##TITLE=Analysis number 329890
Compound Code cc 14001
Project Code adrs
Chemist Name stores
##JCAMPDX= 6.0         $$ Bruker NMR JCAMP-DX V2.0
##DATA TYPE= NMR SPECTRUM
##DATA CLASS= NTUPLES
##ORIGIN= Bruker BioSpin GmbH
##OWNER= nmr
$$ XWIN-NMR		Version 3.5
$$ Tue Oct  9 16:08:18 2007 GMT Daylight Time (UT+1h)  MAYBRIDGE\nmr@NMR_250MHZ
##.OBSERVE FREQUENCY= 250.131544655141
##.OBSERVE NUCLEUS= ^1H
##.ACQUISITION MODE= SIMULTANEOUS (DQD)
##.ACQUISITION SCHEME= undefined
##.AVERAGES= 16
##.DIGITISER RES= 18
##SPECTROMETER/DATA SYSTEM= dpx250
##.PULSE SEQUENCE= zg30
##.SOLVENT NAME= DMSO
##.SHIFT REFERENCE= (INTERNAL, DMSO, 0, 16.5088)
##AUDIT TRAIL= $$ (NUMBER, WHEN, WHO, WHERE, WHAT)
$$ ##TITLE= Audit trail, XWIN-NMR		Version 3.5
$$ ##JCAMPDX= 5.01
$$ ##ORIGIN= Bruker BioSpin GmbH
$$ ##OWNER= nmr
$$ C:\u/data/dgb/nmr/ADRS/440/pdata/1/auditp.txt
$$ ##AUDIT TRAIL=  $$ (NUMBER, WHEN, WHO, WHERE, WHAT)
(   1,<2007-10-09 16:07:56.92 +100>,<MAYBRIDGE\nmr>,<NMR_250MHZ>,
      <created by zg, POWCHK disabled, PULCHK disabled
       configuration hash MD5:
       76 6E 9A 78 1E 09 19 81 EC 84 63 8F B0 6A 59 2D
       data hash MD5: 64K
       29 7E E0 F5 94 8E 5D BA E6 B5 02 A5 AF D2 16 E8>)
(   2,<2007-10-09 16:08:09.20 +100>,<MAYBRIDGE\nmr>,<NMR_250MHZ>,
      <Start of raw data processing
       ef LB = 0.3 FT_mod = 6 PKNL = 1 SI = 32K 
       data hash MD5: 32K
       1E 8E D4 D9 75 65 9C 92 84 C8 1B B2 46 52 A7 85>)
(   3,<2007-10-09 16:08:10.86 +100>,<MAYBRIDGE\nmr>,<NMR_250MHZ>,
      <apk 
       data hash MD5: 32K
       16 CE 08 2F F3 62 03 36 C4 A0 DB 39 47 23 69 77>)
(   4,<2007-10-09 16:08:11.56 +100>,<MAYBRIDGE\nmr>,<NMR_250MHZ>,
      <abs ABSG = 5 
       data hash MD5: 32K
       EC 5D 31 B5 94 69 11 0A D3 FC 12 DA A7 53 A3 A8>)
$$ ##END=
$$ 
$$ hash MD5
$$ 20 BE A1 12 87 82 34 0A D1 A8 4E 95 DE 66 C4 92
##$RELAX= 
##$RELAX= 
##$RELAX= 
##$RELAX= 
##$RELAX= 
##$RELAX= 
##$RELAX= 
$$ Bruker specific parameters
$$ --------------------------
##$DU= <C:\u>
##$EXPNO= 440
##$NAME= <ADRS>
##$PROCNO= 1
##$TYPE= <nmr>
##$USER= <dgb>
##$AMP= (0..31)
100 100 100 100 100 100 100 100 100 100 100 100 100 100 100 100 100 100 
100 100 100 100 100 100 100 100 100 100 100 100 100 100 
##$AQSEQ= 0
##$AQ_mod= 3
##$AUNM= <au_zg>
##$AUTOPOS= <54 >
##$BF1= 250.13
##$BF2= 250.13
##$BF3= 250.13
##$BF4= 250.13
##$BF5= 500.13
##$BF6= 500.13
##$BF7= 500.13
##$BF8= 500.13
##$BYTORDA= 1
##$CFDGTYP= 0
##$CFRGTYP= 5
##$CHEMSTR= <none>
##$CNST= (0..31)
1 1 145 1 1 1 1 1 1 1 1 1 1 1 1 1 1 1 1 1 1 1 1 1 1 1 1 1 1 1 1 1 
##$CPDPRG= <>
##$CPDPRG1= <>
##$CPDPRG2= <>
##$CPDPRG3= <>
##$CPDPRG4= <mlev>
##$CPDPRG5= <mlev>
##$CPDPRG6= <mlev>
##$CPDPRG7= <mlev>
##$CPDPRG8= <mlev>
##$CPDPRGB= <>
##$CPDPRGT= <>
##$D= (0..31)
0 1 0 0 0 0 0 0 0 0.06 0 0 0 0 0 0 0.0002 0 0 0 0 0 0 0 0 0 0 0 0 0 0 
0 
##$DATE= 1191942475
##$DBL= (0..7)
120 120 120 120 120 120 120 120 
##$DBP= (0..7)
150 150 150 150 150 150 150 150 
##$DBP07= 0
##$DBPNAM0= <>
##$DBPNAM1= <>
##$DBPNAM2= <>
##$DBPNAM3= <>
$$ [...]
##$SUBNAM7= <"">
##$SUBNAM8= <"">
##$SUBNAM9= <"">
##$SW= 20.6930455092707
##$SWIBOX= (0..15)
0 0 3 0 0 0 0 0 0 0 0 0 0 0 0 0 
##$SW_h= 5175.983436853
##$TD= 65536
##$TD0= 1
##$TE= 296.16
##$TE2= 300
##$TE3= 300
##$TEG= 300
##$TL= (0..7)
0 120 120 120 120 120 120 120 
##$TP= (0..7)
150 150 150 150 150 150 150 150 
##$TP07= 0
##$TPNAME0= <>
##$TPNAME1= <>
##$TPNAME2= <>
##$TPNAME3= <>
##$TPNAME4= <>
##$TPNAME5= <>
##$TPNAME6= <>
##$TPNAME7= <>
##$TPOAL= (0..7)
0.5 0.5 0.5 0.5 0.5 0.5 0.5 0.5 
##$TPOFFS= (0..7)
0 0 0 0 0 0 0 0 
##$TUNHIN= 0
##$TUNHOUT= 0
##$TUNXOUT= 0
##$USERA1= <user>
##$USERA2= <user>
##$USERA3= <user>
##$USERA4= <user>
##$USERA5= <user>
##$V9= 5
##$VALIST= <valist>
##$VCLIST= <CCCCCCCCCCCCCCC>
##$VD= 0
##$VDLIST= <DDDDDDDDDDDDDDD>
##$VPLIST= <PPPPPPPPPPPPPPP>
##$VTLIST= <TTTTTTTTTTTTTTT>
##$WBST= 1024
##$WBSW= 4
##$XGAIN= (0..3)
0 0 0 0 
##$XL= 0
##$YL= 0
##$YMAX_a= 316941
##$YMIN_a= -345629
##$ZGOPTNS= <>
##$ZL1= 120
##$ZL2= 120
##$ZL3= 120
##$ZL4= 120
##$ABSF1= 16.50882
##$ABSF2= -4.184353
##$ABSG= 5
##$ABSL= 3
##$ALPHA= 0
##$AQORDER= 0
##$ASSFAC= 0
##$ASSFACI= 0
##$ASSFACX= 0
##$ASSWID= 0
##$AUNMP= <proc_1d>
##$AZFE= 0.1
##$AZFW= 0.1
##$BCFW= 0
##$BC_mod= 0
##$BYTORDP= 0
##$COROFFS= 0
##$CY= 12.5
##$DATMOD= 1
##$DC= 0
##$DFILT= <>
##$DTYPP= 0
##$F1P= 14.0000005364418
##$F2P= -0.99999901652339
##$FCOR= 0.5
##$FTSIZE= 32768
##$FT_mod= 6
##$GAMMA= 0
##$GB= 0
##$INTBC= 1
##$INTSCL= 1
##$ISEN= 128
##$LB= 0.3
##$LEV0= 0
##$LPBIN= 0
##$MAXI= 10000
##$MC2= 0
##$MEAN= 0
##$ME_mod= 0
##$MI= 0
##$NCOEF= 0
##$NC_proc= -4
##$NLEV= 6
##$NOISF1= 0
##$NOISF2= 0
##$NSP= 0
##$NTH_PI= 0
##$NZP= 0
##$OFFSET= 16.50882
##$PC= 1
##$PHC0= 147.9383
##$PHC1= 9.189163
##$PH_mod= 1
##$PKNL= yes
##$PPARMOD= 0
##$PSCAL= 4
##$PSIGN= 0
##$REVERSE= no
##$SF= 250.130003295573
##$SI= 32768
##$SIGF1= 0
##$SIGF2= 0
##$SINO= 400
##$SIOLD= 32768
##$SREGLST= <1H.DMSO>
##$SSB= 0
##$STSI= 32768
##$STSR= 0
##$SW_p= 5175.98343685301
##$SYMM= 0
##$S_DEV= 0
##$TDeff= 65536
##$TDoff= 0
##$TI= <Analysis number 999999
Compound Code 99
Book Reference 9
Project Code 9>
##$TILT= no
##$TM1= 0
##$TM2= 0
##$TOPLEV= 0
##$USERP1= <user>
##$USERP2= <user>
##$USERP3= <user>
##$USERP4= <user>
##$USERP5= <user>
##$WDW= 1
##$XDIM= 32768
##$YMAX_p= 431418090
##$YMIN_p= -403051
$$ End of Bruker specific parameters
$$ ---------------------------------
##NTUPLES= NMR SPECTRUM
##VAR_NAME=  FREQUENCY,     SPECTRUM/REAL,   SPECTRUM/IMAG
##SYMBOL=    X,             R,               I
##VAR_TYPE=  INDEPENDENT,   DEPENDENT,       DEPENDENT
##VAR_FORM=  AFFN,          ASDF,            ASDF
##VAR_DIM=   32768,         32768,           32768
##UNITS=     HZ,            ARBITRARY UNITS, ARBITRARY UNITS
##FACTOR=    0.157963299565203, 1,           1
##FIRST=     4129.35109597096, 0,            0
##LAST=      -1046.63234088205, 0,           0
##MIN=       -1046.63234088205, -403051,     0
##MAX=       4129.35109597096, 431418090,    0
$$ Real data points
##PAGE= N=1
##DATA TABLE= (X++(R..R)), XYDATA
$$ [...]
$$ plain form
16339 -56916 53172 33060 37356 -12791 -124589 -149392 -63166 29717 36418 16051 -89784
16328 -89784 -59867 15113 44578 -37301 -85512 -118076 -108018 -207412 -201612 -168776 -178141 -208504
16316 -208504 -242168 -169794 -103607 -96615 -131574 -99957 -38297 41385 47189 -19819 -130489 -182873
16304 -182873 -137290 -74729 -128776 -184761 -264051 -292186 -200863 -114739 -75631 -84522 -93806 -50636
16292 -50636 -81675 -75387 4201 9075 4033 -62666 -77828 -127344 -214551 -173700 -69018 -3639
16280 -3639 67603 78970 -17667 -97594 -62718 -85071 -27720 -22829 -97115 -55913 15937 -59279
16268 -59279 -96031 -81289 -22556 35765 -9309 -28099 -98050 -96835 -88919 -73580 -51356 9899
16256 9899 -15348 27840 39909 52534 140005 207934 104436 -44914 -15107 -78697 -210794
$$ packed form
16339e6916J10088k0112M296n0147j11798k4803Q6226R2883O701k0367j05835
16328h9784K9917P4980K9465q1879m8211l2564J0058r9394N800L2836r365l0363
16316b08504l3664P2374O6187O992l4959L1617O1660P9682N804o7008j10670n2384
16304a82873M5583O2561n4047n5985p9290k8135R1323Q6124L9108q891r284M3170
16292e0636l1039O288P9588M874n042o6699j5162m9516q7207M0851J04682O5379
16280c639P1242J1367r6637p9927L4876k2353N7351M891p4286M1202P1850p5216
16268e9279l6752J4742N8733N8321m5074j8790o9951J215P916J5339K2224O1255
16256I899k5247M3188J2069J2625Q7471O7929j03498j49350K9807o3590j32097
$$ plain form
16245 -210794 -214110 -145495 -31589 12935 54312 16406 -120019 -202635 -229796 -232071 -122026
16234 -122026 -47663 -128908 -204769 -211393 -191485 -178896 -236518 -128090 -36217 -115854 -256610
16223 -256610 -244270 -185241 -114284 -56852 -82640 -162632 -200497 -142928 -143848 -91885 14734 -24553
16211 -24553 -58801 -93985 -14963 -6860 -79953 -129965 -165221 -118749 25111 65567 52317 -20971
16199 -20971 -121949 -156850 -194603 -241680 -168374 -94691 -25763 19778 -13012 -40526 -81845
16188 -81845 -196723 -247605 -329601 -322348 -302267 -260287 -217428 -245512 -226922 -168764 -66973
16177 -66973 40804 -37492 -148267 -161192 -89034 -62682 25588 -11861 -19608 26020 -33685
16166 -33685 -73149 -87501 -101294 -59420 -34468 62283 130898 113773 -11739 -39989 -56829
$$ packed form
16245b10794l316O8615J13906M4524M1377l7906j36425q2616k7161k275J10045
16234a22026P4363q1245p5861o624J9908J2589n7622J08428R1873p9637j40756
16223b56610J2340N9029P0957N7432k5788p9992l7865N7569r20N1963J06619l9287
16211b4553l4248l5184P9022Q103p3093n0012l5256M6472J43860M0456j3250p3288
16199b0971j00978l4901l7753m7077P3306P3683O8928M5541l2790k7514m1319
16188h1845j14878n0882q1996P253K0081M1980M2859k8084J8590N8158J01791
16177f6973J07777p8296j10775j2925P2158K6352Q8270l7449p747M5628n9705
16166c3685l9464j4352j3793M1874K4952R6751O8615j7125j25512k8250j6840
$$ plain form
16155 -56829 -72179 -19643 -7897 -46402 -71931 -9470 -12124 39105 21391 -563 60638 76302
16143 76302 -9745 -56474 -93177 -136137 -171847 -134673 -135651 -101751 -102720 -116913 26656 45841
16131 45841 -90579 -116538 -124837 -115526 -148082 -102454 6188 -73851 -193273 -168703 -78931
16120 -78931 -104828 -153022 -52263 -5582 10634 -21173 23005 109691 53009 49546 5509 11672
16108 11672 -2004 -9819 -19412 -39738 -73023 -47569 -36218 -46119 -23210 -13073 -41449 -13844
16096 -13844 -24083 21591 49975 25678 6247 13563 -22957 -26768 -10454 36393 -13734 -23607
16084 -23607 -89586 -120912 -77659 -47133 -17943 50623 75218 90668 101708 27873 -78819
16073 -78819 -58684 -105111 -52963 -8530 -74185 -154692 -41550 -58575 -126147 -101987 -90278
$$ packed form
16155e6829j5350N2536J1746l8505k5529O2461k654N1229j7714k1954O1201J5664
16143G6302q6047m6729l6703m2960l5710L7174r78L3900r69j4193J43569J9185
16131D5841j36420k5959q299R311l2556M5628J08642q0039j19422K4570Q9772
16120g8931k5897m8194J00759M6681J6216l1807M4178Q6686n6682l463m4037O163
16108A1672j3676p815r593k0326l3285K5454J1351r901K2909J0137k8376K7605
16096a3844j0239M5674K8384k4297j9431P316l6520l811J6314M6847n0127r873
16084b3607o5979l1326M3253L0526K9190O8566K4595J5450J1040p3835j06692
16073g8819K0135m6427N2148M4433o5655q0507J13142j7025o7572K4160J1709
$$ plain form
16062 -90278 -121178 -61954 -40604 -63553 -24922 22548 25367 -49159 -123446 -71314 1311 30195
16050 30195 -79618 -95014 -35854 34614 69356 110909 66305 494 44101 58845 48927 -38261
16038 -38261 -132242 -142895 -63591 -99890 -142642 -96497 36572 56565 -3993 27855 96125
16027 96125 1556 -63332 -109064 -209582 -150586 25918 23115 21525 46998 28462 -47783 -83586
16015 -83586 -39818 -44336 -60606 -93027 -93444 -52606 2124 -42660 -25141 -45827 -56601 -94552
16003 -94552 -125861 -116976 -98527 -162599 -157374 -126207 -112440 -46545 -10204 26001 55657 29447
15991 29447 -76429 -121947 -198411 -269404 -168683 -64925 -53115 -65532 -126448 -210348 -147304
15980 -147304 -66241 -129043 -36410 -67891 -127692 -164197 -155011 -115350 -148937 -167793 -189151 -138308
$$ packed form
16062i0278l0900N9224K1350k2949L8631M7470K819p4526p4287N2132P2625K8884
16050C0195j09813j5396N9160P0468L4742M1553m4604o5811M3607J4744r918q7188
16038c8261r3981j0653P9304l6299m2752M6145J33069J9993o0558L1848O8270
16027I6125r4569o4888m5732j00518N8996J76504k803j590K5473j8536p6245l5803
16015h3586M3768m518j6270l2421m17M0838N4730m4784J7519k0686j0774l7951
16003i4552l1309Q885J8449o4072N225L1167J3767O5895L6341L6205K9656k6210
15991B9447j05876m5518p6464p0993J00721J03758J1810j2417o0916q3900O3044
15980a47304Q1063o2802R2633l1481n9801l6505R186L9661l3587j8856k1358N0843
$$ plain form
15968 -138308 -49108 1109 15646 -37039 167 -14827 -68633 -107823 -147684 -156973 -76988 63145
15956 63145 159029 103589 9417 48198 98891 57948 62062 3143 -70540 -70140 -72401 23182
15944 23182 46320 66935 33332 -13946 10828 14975 -14988 10108 35119 43700 -50078 -136495
15932 -136495 -83911 14104 51115 30603 -109589 -110153 -58088 33838 72366 26090 -55376 -64330
15920 -64330 -39409 -137653 -223352 -201326 -202429 -150656 -39293 31881 64166 41709 105811 68936
15908 68936 -14226 -1524 -56303 -136484 -86531 -105097 -87667 -72566 -118133 -108234 -129064 -91533
15896 -91533 -41526 -25910 3398 34512 26552 -11814 -60072 -71244 -70530 7652 111436 58652
15884 58652 -48213 10223 125017 213291 130955 42853 -85983 -154663 -117830 -40271 -7928
$$ packed form
15968a38308Q9200N0217J4537n2685L7206j4994n3806l9190l9861r289P9985J40133
15956F3145R5884n5440r4172L8781N0693m0943M114n8919p3683M00k261R5583
15944B3182K3138K0615l3603m7278K4774M147k9963K5096K5011Q581r3778q6417
15932a36495N2584R8015L7011k0512j40192n64N2065R1926L8528m6276q1466q954
15920f4330K4921r8244q5699K2026j103N1773J11363P1174L2285k2457O4102l6875
15908F8936q3162J2702n4779q0181M9953j8566J7430J5101m5567R899k0830L7531
15896i1533N0007J5616K9308L1114p960l8366m8258j1172P14P8182J03784n2784
15884E8652j06865N8436J14794Q8274q2336q8102j28836o8680L6833P7559L2343
$$ plain form
15873 -7928 -29347 -35309 -2936 -54045 -58234 -127473 -222068 -180533 -123699 -28083 -49376 -210509
15861 -210509 -175270 -144001 -38481 -111824 -144864 -207872 -217331 -94812 -70439 -100683 -92539
15850 -92539 -84424 -116554 -54137 -1700 -44455 -48797 12909 41601 120532 176556 80701 -61791
15838 -61791 -58863 -54840 -7241 19169 -36082 -75166 -157569 -185256 -135298 -15691 36487 29334
15826 29334 18229 13370 -83790 -150803 -120281 -32431 -27815 -3741 20943 22379 71622 106439
15814 106439 67213 24160 -75335 -100285 -163412 -172189 -127952 -53619 -40835 -103473 -121582 -101190
15802 -101190 -113211 -11037 -2308 84925 198908 156804 33008 -7061 69040 67361 98125
15791 98125 92705 79493 57842 123811 116141 87421 58216 -65413 -86679 -9301 -5795 -84606
$$ packed form
15873g928k1419n962L2373n1109m189o9239r4595M1535N6834R5616k1293j61133
15861b10509L5239L1269J05520p3343l3040o3008r459J22519K4373l0244Q144
15850i2539Q115l2130O2417N2437m2755m342O1706K8692P8931N6024r5855j42492
15838f1791K928M023M7599K6410n5251l9084q2403k7687M9958J19607N2178p153
15826B9334j1105m859r7160o7013L0522Q7850M616K4074K4684J436M9243L4817
15814A06439l9226m3053r9495k4950o3127q777M4237P4333J2784o2638j8109K0392
15802a01190j2021J02174Q729Q7233J13983m2104j23796m0069P6101j679L0764
15791I8125n420j3212k1651O5969p670k8720k9205j23629k1266P7378L506p8811
$$ plain form
15779 -84606 -132786 -164927 -77261 -55869 -4641 -8045 -65233 -193783 -218355 -217078 -243337 -113101
15767 -113101 35250 137876 220934 199994 194638 259586 218526 165816 109596 73358 38261
15756 38261 -47391 -165502 -199961 -252152 -212827 -84910 -70552 -86175 -20540 61847 68391
15745 68391 41432 116042 44475 -58419 -54890 -6691 -14738 -43511 -76295 -95082 -122641 -192782
15733 -192782 -101226 -26873 15663 20054 -126575 -237797 -242429 -163945 -134402 -97445 -44270
15722 -44270 -123845 -131199 -44978 -85091 -161604 -180883 -164281 -113956 -140110 -132453 -101322 -73097
15710 -73097 -773 -59085 -116008 -87588 -121934 -102140 -82569 -22331 15431 -81612 -170248 -78360
15698 -78360 30346 -33592 -102472 -69705 -27246 2805 29114 -28071 -59169 -52335 -24448 38252
$$ packed form
15779h4606m8180l2141Q7666K1392N1228l404n7188j28550k4572J277k6259J30236
15767a13101J48351J02626Q3058k0940n356O4948m1060n2710n6220l6238l5097
15756C8261q5652j18111l4459n2191L9325J27917J4358j5623O5635Q2387O544
15745F8391k6959P4610p1567j02894L529M8199q047k8773l2784j8787k7559p0141
15733a92782R1556P4353M2536M391j46629j11222m632P8484K9543L6957N3175
15722d4270p9575p354Q6221m0113p6513j9279J6602N0325k6154P657L1131K8225
15710g3097P2324n8312n6923K8420l4346J9794J9571O0238L7762r7043q8636R1888
15698g8360J08706o3938o8880L2767M2459L0051K6309n7185l1098O834K7887O2700
$$ plain form
15686 38252 16051 -21518 107635 168989 133463 59785 7730 -31330 -136499 -128839 -133686 -130670
15674 -130670 -28913 -34067 -82696 -71602 -76972 -45080 -72159 -78832 -115722 -45196 46601 56750
15662 56750 -52486 -147384 -132303 -62910 31501 74941 36777 79900 136570 124453 68109
15651 68109 1013 -101205 -101451 24228 23650 -57269 -53680 -114147 -102443 -94657 -125317 -104245
15639 -104245 -73801 -130572 -65135 -8621 35009 24993 -52840 -49229 -72438 -8954 71737 69077
15627 69077 56240 20853 9009 15316 -4155 -22827 25866 -40467 -37943 -102970 -99454 -31312
15615 -31312 1574 10245 79649 34331 66510 31936 -28848 5123 -31368 -165524 -159686 32895
15603 32895 22577 -107005 -91495 -63386 1487 10170 -43634 -18381 -4983 27388 38887 48039
$$ packed form
15686C8252k2201l7569J29153O1354l5526p3678n2055l9060j05169P660m847L016
15674a30670J01757n154m8629J1094n370L1892k7079o673l6890P0526R1797J0149
15662E6750j09236r4898J5081O9393R4411M3440l8164M3123N6670j2117n6344
15651F8109o7096j02218k46J25679n78q0919L589o0467J1704P786l0660K1072
15639a04245L0444n6771O5437N6514M3630j0016p7833L611k3209O3484Q0691k660
15627F9077j2837l5387j1844O307j9471j8672M8693o6333K524o5027L516O8142
15615c1312L2886Q671O9404m5318L2179l4574o0784L3971l6491j34156N838J92581
15603C2895j0318j29582J5510K8109O4873Q683n3804K5253J3398L2371J1499R152
$$ plain form
15591 48039 129677 84054 -25090 -110669 -151934 -116598 -108915 -29451 99824 41684 -32710
15580 -32710 -26069 -92095 -138052 -75474 1376 32609 13359 -12983 22689 74775 -18371 -38622
15568 -38622 -73829 -81596 19530 72040 98132 90545 35545 2666 -38356 -74815 2883 85045
15556 85045 47560 14524 -16533 -44766 23326 -26643 31570 41917 -23084 29560 19745 -37951
15544 -37951 -62629 -91470 -123057 -116480 -3972 -29060 -108146 -78194 -128961 -51239 -64983 -97561
15532 -97561 -114699 -126841 -161634 -128089 -168414 -217516 -226845 -163346 -80924 49297 -10168 -92082
15520 -92082 -183947 -144427 -141196 -71710 -108813 -174938 -168021 -215278 -253633 -189660 -119392 -155916
15508 -155916 -147531 -204990 -216665 -166018 -51113 -83058 -47258 -84962 -155293 -95055 -137327
$$ packed form
15591D8039Q1638m5623j09144q5579m1265L5336P683P9464J29275n8140p4394
15580c2710O641o6026m5957O2578P6850L1233j9250k6342L5672N2086r3146k0251
15568c8622l5207p767J01126N2510K6092p587n5000l2879m1022l6459P7698Q2162
15556H5045l7485l3036l1057k8233O8092m9969N8213J0347o5001N2644r815n7696
15544c7951k4678k8841l1587O577J12508k5088p9086K9952n0767P7722j3744l2578
15532i7561j7138j2142l4793L3545m0325m9102r329O3499Q2422J30221n9465q1914
15520i2082r1865L9520L231O9486l7103o6125O917m7257l8355O3973P0268l6524
15508a55916Q385n7459j1675N0647J14905l1945L5800l7704p0331O0238m2272
$$ plain form
15497 -137327 -94367 -84107 -45223 25219 52168 -400 -84407 -135580 -136343 -106878 -104783 -191813
15485 -191813 -220662 -158302 -54023 -21379 -150889 -193698 -175500 -242063 -182307 -48248 75449
15474 75449 165573 85750 -54920 -108010 27341 147164 106749 6023 -100750 -173170 -179495
15463 -179495 -149578 -142289 -48083 939 -32351 -43830 -157227 -192239 -146121 -129315 -68362
15452 -68362 -97332 -40812 -62483 -19711 -21608 -98802 -29042 22280 44969 41323 19099 -29324
15440 -29324 -67984 -96556 -147792 -83786 17898 60836 9890 -118466 -187798 -113921 -171446
15429 -171446 -179295 -49890 102981 92250 1410 -66983 -153575 -153567 -185668 -134362 -125896 -120893
15417 -120893 -145163 -213849 -332860 -403051 -241020 -147850 -89433 -70877 -67500 -61124 -20177
$$ packed form
15497a37327M2960J0260L8884P0442K6949n2568q4007n1173p63K9465K095q7030
15485a91813k8849O2360J04279L2644j29510m2809J8198o6563N9756J34059J23697
15474G5449R0124p9823j40670n3090J35351J19823m0415j00726j06773p2420o325
15463a79495K9917P289R4206M9022l3290j1479j13397l5012M6118J6806O0953
15452f8362k8970N6520k1671M2772j897p7194O9760N1322K2689l646k2224m8423
15440b9324l8660k8572n1236O4006J01684M2938n0946j28356o9332P3877n7525
15429a71446p849J29405J52871j0731r0840o8393q6592Ql2101N1306Q466N003
15417a20893k4270o8686j19011p0191J62031R3170N8417J8556L377O376M0947
$$ plain form
15406 -20177 -12494 -44699 8217 -49091 -81825 10732 54450 -9909 -63174 -34138 -72851 -83823
15394 -83823 -83488 -48460 -68066 -101208 -88853 -11422 76122 81220 -7749 -19391 -23968 -34459
15382 -34459 -99104 -42627 -86152 -72598 25287 77938 18257 -25201 -59795 -74621 -23417 -71830
15370 -71830 -42621 -84934 -120588 -94817 -172575 -186385 -118315 -92791 -125690 -99678 -180204 -171161
15358 -171161 -103490 -59493 -102176 -42861 -19904 -48286 25192 25426 9591 -24780 -39855 9501
15346 9501 -82520 -123107 -187377 -200541 -197682 -131536 -51893 30323 61591 -19669 -111667 -4645
15334 -4645 74897 -56729 -161845 -165766 -140846 -27349 29892 -20807 67846 148758 151137 110341
15322 110341 -48443 -78570 15535 98113 117590 186976 94797 73705 154449 82983 46203
$$ packed form
15406b0177P683l2205N2916n7308l2734R2557M3718o4359n3265K9036l8713j0972
15394h3823L35L5028j9606l3142J2355P7431Q7544N098q8969j1642m577j0491
15382c4459o4645N6477m3525J3554R7885N2651n9681m3458l4594j4826N1204m8413
15370g1830K9209m2313l5654K5771p7758j3810O8070K5524l2899K6012q0526R043
15358a71161O7671M3997m2683N9315K2957k8382P3478K34j5835l4371j5075M9356
15346I501r2021m0587o4270j3164K859O6146P9643Q2216L1268q1260r1998J07022
15334d645P9542j31626j05116l921K4920J13497N7241n0699Q8653Q0912K379m0796
15322A10341j58784l0127R4105Q2578J9477O9386r2179k1092Q0744p1466l6780
$$ plain form
15311 46203 139738 129685 69030 7645 28299 4453 -17274 40995 12135 -20181 -67849 -59023
15299 -59023 -102812 -45842 93945 52896 31925 53624 154788 171605 126533 88196 66663
15288 66663 70158 -55361 -107486 -113427 -52076 40227 84650 6274 -111013 -165679 -226317 -149198
15276 -149198 -62588 3858 18946 -81758 -89525 -14358 -3786 -53955 -127136 -192295 -252160
15265 -252160 -239924 -204512 -168759 -119291 -27061 -38362 32508 71708 102195 34628 -25452
15254 -25452 -4094 -9365 -126879 -163955 -88072 -29821 38049 -6559 81056 78448 -14702 43141
15242 43141 86214 -36957 -172180 -97725 -103125 -58826 2819 -276 27203 47986 40667 20226
15230 20226 -122063 -248973 -200482 -66269 -66016 -226941 -264901 -185118 -96893 -44567 -54388
$$ packed form
15311D6203R3535j0053o0655o1385K0654k3846k1727N8269k8860l2316m7668Q826
15299e9023m3789N6970J39787m1049k0971K1699J01164J6817m5072l8337k1533
15288F6663L495j25519n2125n941O1351R2303M4423p8376j17287n4666o0638P7119
15276a49198Q6610O6446J5088j00704p767P5167J0572n0169p3181o5159n9865
15265b52160J2236L5412L5753M9468R2230j1301P0870L9200L0487o7567o0080
15254b5452K1358n271j17514l7076P5883N8251O7870m4608Q7615k608r3150N7843
15242D3141M3073j23171j35223P4455n400M4299O1645l095K7479K0783p319k0441
15230B0226j42289j26910M8491J34213K53j60925l7960P9783Q8225N2326r821
$$ plain form
15219 -54388 -48354 -40923 23399 17231 24038 16086 -50212 -89269 -55434 -104303 -186460 -258638 -246851
15206 -246851 -171679 -110946 -91204 -43870 13265 -27285 -47777 -129209 -151582 -68980 44058
15195 44058 49977 8808 -4870 -96633 -205886 -296143 -251246 -226106 -196239 -106001 -99500 -65207
15183 -65207 -63748 -1817 63820 -30299 -120020 -189318 -133052 -54812 -28829 -15161 -44671 -82749
15171 -82749 -5896 -55537 -110075 -128239 -105449 -98549 -134511 -195020 -192216 -52995 -4800 11821
15159 11821 -5208 8249 5087 -99999 -95270 -57665 27267 -43693 -112011 -97156 -79870 -79285
15147 -79285 -100586 -157219 -234353 -191772 -112747 -92773 -173826 -292416 -272086 -276106 -304826 -229899
15135 -229899 -144807 -48074 -7774 39762 9501 50094 75347 -18730 -19166 51688 113068 63088
$$ packed form
15219e4388O034P431O4322o168O807p952o6298l9057L3835m8869q2157p2178J1787
15206b46851P5172O0733J9742M7334N7135m0550k0492q1432k2373Q2602J13038
15195D4058N919m1169j3678r1763j09253r0257M4897K5140K9867R0238O501L4293
15183f5207J459O1931O5637r4119q9721o9298N6266P8240K5983J3668k9510l8078
15171h2749P6853m9641n4538j8164K2790O900l5962o0509K804J39221M8195J6621
15159A1821j7029J3457l162j05086M729L7605Q4932p0960o8318J4855J7286N85
15147g9285k1301n6633p7134M2581P9025J9974q1053j18590K0330m020k8720P4927
15135b29899Q5092R6733M0300M7536l0261M0593K5253r4077m36P0854O1380m9980
$$ plain form
15123 63088 -99358 -115948 -38722 29329 11367 800 -16847 -35259 38858 73903 55035
15112 55035 57509 68582 17793 -23117 -48571 -144173 -175007 -156505 -91320 16499 11466 -39506
15100 -39506 -38659 -88962 -139210 -182319 -177334 -117951 -92816 -118171 -31599 -53667 -65067 -16246
15088 -16246 16864 -67788 -66742 -92474 -116579 -91959 -104070 -218482 -256719 -175302 -132092 -220606
15076 -220606 -149940 -105961 -27315 -20455 -63771 -93563 -82202 -7611 114211 127364 -1286
15065 -1286 -27106 13611 76558 57714 159103 188329 55296 -142888 -103941 -98516 -104730 -117096
15053 -117096 -27875 -58636 -114899 -118124 -197096 -194768 -77025 -133692 -164756 -167978 -182993 -238776
15041 -238776 -207449 -155609 -87679 -75432 -30991 4331 -9352 -98535 -25878 37084 5048
$$ packed form
15123F3088j62446j6590P7226O8051j7962j0567j7647j8412P4117L5045j8868
15112E5035K474J1073n0789m0910k5454r5602l0834J8502O5185J07819n033n0972
15100c9506Q47n0303n0248m3109M985N9383K5135k5355Q6572k2068j1400M8821
15088a6246L3110q4652J046k5732k4105K4620j2111j14412l8237Q1417M3210q8514
15076b20606P0666M3979P8646O860m3316k9792J1361P4591J21822J3153j28650
15065a286k5820M0717O2947j8844J01389K9226j33033j98184L8947N425o214j2366
15053a17096Q9221l0761n6263l225p8972K328J17743n6667l1064l222j5015n5783
15041b38776L1327N1840O7930J2247M4441L5322j3683q9183P2657O2962l2036
$$ plain form
15030 5048 -12691 -42157 -7142 -48153 -142202 -82452 5577 58700 92886 130094 168838 121874
15018 121874 167600 93475 119372 61777 90854 79919 29383 -4922 21831 -40971 -106643
15007 -106643 -103007 -18413 96862 43037 -41725 -98840 -164649 -204221 -256361 -155859 -56263
14996 -56263 -73753 -94598 336 -34085 -125354 -93863 -25624 -122519 -102166 -119109 -72614 -78743
14984 -78743 -62692 35924 23059 -55650 -37498 -190460 -200945 -132108 -75045 3132 8370 5267
14972 5267 105312 123597 63480 52937 58345 16771 108499 77406 42820 -46053 -75847 -20023
14960 -20023 -16961 -73889 -5757 -9727 -48489 -102090 -41685 -133654 -235235 -295967 -238662 -155701
14948 -155701 -153445 -142600 -137971 -107851 -149040 -34267 43138 25801 -9900 -28640 -85291 -39481
$$ packed form
15030E048j7739k9466L5015m1011r4049N9750Q8029N3123L4186L7208L8744m6964
15018A21874M5726p4125K5897n7595K9077j0935n0536l4305K6753o2802o5672
15007a06643L636Q4594J15275n3825q4762n7115o5809l9572n2140J00502R9596
14996e6263j7490k0845R4934l4421r1269L1491O8239r6895K0353j6943M6495o129
14984g8743J6051R8616j2865p8709J8152j52962j0485O8837N7063P8177N238l103
14972E267J00045J8285o0117j0543N408m1574R1728l1093l4586q8873k9794N5824
14960b0023L062n6928O8132l970l8762n3601O0405r1969j01581o0732N7305Q2961
14948a55701K256J0845M629L0120m1189J14773P7405j7337l5701j8740n6651M5810
$$ plain form
14936 -39481 32696 112762 142478 94169 64216 -30507 -125197 -36282 20880 49163 98012 112834
14924 112834 -15956 -56598 5284 -77852 -110543 -134139 -169059 -57805 -21162 59591 72016
14913 72016 46919 40467 11953 29446 2847 -121087 -116169 -141333 -114763 -112407 -93862 -118028
14901 -118028 -129932 -163400 -163843 -132996 -211256 -149934 -18644 31141 80604 66496 45075 65737
14889 65737 -15748 -63998 -90451 -34209 -53190 -79264 -95354 -78821 -43482 -5499 -71170 -208536
14877 -208536 -223805 -188320 -151102 -8679 96248 105967 77369 -55821 -173108 -142196 -2612
14866 -2612 102719 35517 -35482 -38740 -67351 -2828 62253 95920 22701 -49985 -57404 -81580
14854 -81580 -16676 -46886 -77464 -81105 -23020 -4627 -32202 -23850 -98463 -69000 -80732 -4660
$$ packed form
14936c9481P2177Q0066K9716m8309k9953r4723r4690Q8915N7162K8283M8849J4822
14924A12834j28790m0642O1882q3136l2691k3596l4920J11254L6643Q0753J2425
14913G2016k5097o452k8514J7493k6599j23934M918k5164K6570K356J8545k4166
14901a18028j1904l3468m43L0847p8260O1322J31290M9785M9463j4108k1421K0662
14889F5737q1485m8250k6453N6242j8981k6074j6090J6533L5339L7983o5671j37366
14877b08536j5269L5485L7218J42423J04927R719k8598j33190j17287L0912J39584
14866b612J05331o7202p0999l258k8611O4523O5081L3667p3219p2686p419k4176
14854h1580O4904l0210l0578l641N8085J8393k7575Q352p4613K9463j1732P6072
$$ plain form
14842 -4660 -48076 -97883 5230 -11010 -72888 -161411 -112976 38279 124413 66265 -81646
14831 -81646 -41653 -3657 11553 -113657 -254734 -175413 -124199 -139654 -111089 -83670 -69814
14820 -69814 -71182 -161162 -118609 35872 22627 -24226 27813 22112 34785 -26628 65676 127795
14808 127795 85128 94930 1894 -59202 -91711 -24619 -19903 895 -68702 4819 2157 -131683
14796 -131683 -50796 26859 69485 73614 -14477 49458 50933 -7047 -5240 -114739 -172273 -157174
14784 -157174 -159413 -200328 -184094 -152908 -139751 -142791 -102458 -168608 -159047 -65941 40882 127215
14772 127215 206600 155949 45215 19294 36311 -2995 -83008 -49027 -49404 -33556 22737 -3699
14760 -3699 -123298 -97518 -12651 16541 -23110 54456 -15716 -101650 -31321 55263 89963 117698
$$ packed form
14842d660m3416m9807J03113j6240o1878q8523M8435J51255Q6134n8148j47911
14831h1646L9993L7996J5210j25210j41077P9321N1214j5455K8565K7419J3856
14820f9814j368q9980M2553J54481j3245m6853N2039n701J2673o1413R2304O2119
14808A27795m2667R802r3036o1096l2509O7092M716K0798o9597P3521k662j33840
14796a31683Q0887P7655M2626M129q8091O3935J475n7980J807j09499n7534J5099
14784a57174k239m0915J6234L1186J3157l040M0333o6150R561R3106J06823Q6333
14772A27215P9385n0651j10734k5921J7017l9306q0013L3981l77J5848N6293k6436
14760c699j19599K5780Q4867K9192l9651P7566p0172q5934P0329Q6584L4700K7735
$$ plain form
14748 117698 97164 68592 73821 40239 -59077 -22189 -30703 -17790 -20613 -68673 -150247 -167057
14736 -167057 -163747 -118749 -98371 -124481 -148274 -143944 -206372 -155472 -47768 -99042 -139615 -87604
14724 -87604 -51946 -48892 -96925 -61661 8029 107057 81631 74867 81760 109225 54591 8560
14712 8560 -11317 -67737 -24919 -85406 -91734 -133969 -97849 -16984 82939 161035 152626 166178
14700 166178 102937 -52319 -170231 -185820 -183235 -215013 -161941 -136469 -176452 -196190 -49293
14689 -49293 -10341 5137 -62677 -6423 58057 -15457 -17710 19971 67407 4381 15035 33372
14677 33372 5510 -39182 -68766 -153093 -93540 743 15214 -35589 -40535 -38651 -46147 -12116
14665 -12116 -33524 -76182 8116 48632 -48702 -204650 -93554 -53498 -65724 -158274 -223992
$$ packed form
14748A17698k0534k8572N229l3582r9316L6888q514J2913k823m8060q1574j6810
14736a67057L310M4998K0378k6110k3793M330o2428N0900J07704n1274m0573N2011
14724h7604L5658L054m8033L5264O9690R9028k5426o764O893K7465n4634m6031
14712H560j9877n6420M2818o0487o328m2235L6120Q0865R9923P8096q409J3552
14700A66178o3241j55256j17912j5589K585l1778N3072K5472l9983j9738J46897
14689d9293L8952J5478o7814N6254O4480p3514k253L7681M7436o3026J0654J8337
14677C3372k7862m4692k9584q4327N9553R4283J4471n0803m946J884p496L4031
14665a2116k1408m2658Q4298M0516r7334j55948J11096M0056j2226r2550o5718
$$ plain form
14654 -223992 -123402 -28244 -108661 -79762 -11573 79642 34460 61954 66836 44072 87333
14643 87333 37379 -56153 27667 105821 170458 135304 58678 124786 177166 135739 40257 79055
14631 79055 139631 167397 187256 141680 71662 7275 29092 45780 -6261 -74888 -76677 5220
14619 5220 117513 91337 16242 -15496 2955 37323 -3833 -13232 -61966 61972 69297 -35093
14607 -35093 -102321 -109042 -121624 -164006 -169051 -95727 -9418 56555 -20593 -62740 29986 160196
14595 160196 129273 14569 23199 54047 35770 87714 52752 45412 17439 -19925 2713 61663
14583 61663 19548 -56210 993 28586 53123 120967 146170 199878 167896 90596 -1340 -110343
14571 -110343 -109854 -133581 -116496 -7940 -14989 -19123 92728 16230 -53671 32540 73126 43470
$$ packed form
14654b23992J00590R5158q0417K8899O8189R1215m5182K7494M882k2764M3261
14643H7333m9954r3532Q3820P8154O4637l5154p6626O6108N2380m1427r5482L8798
14631G9055O0576K7766J9859m5576p0018o4387K1817J6688n2041o8627j789Q1897
14619E220J12293k6176p5095l1738J8451L4368m1156r399m8734J23938P325j04390
14607c5093o7228o721j2582m2382n045P3324Q6309O5973p7148m2147R2726J30210
14595A60196l0923j14704Q630L0848j8277N1944l4962p340k7973l7364K2638N8950
14583F1663m2115p5758N7203K7593K4537O7844K5203N3708l1982p7300r1936j09003
14571a10343M89k3727J7085J08556p049m134J11851p6498o9901Q6211M0586k9656
$$ plain form
14559 43470 -81981 -41688 -16441 163 -1750 28266 31439 44229 10203 75050 8214 -17952
14547 -17952 -1412 35198 77515 1440 -25272 36535 -16413 -93295 85563 207197 103987
14536 103987 -64944 -53464 26410 1752 -36870 -85382 -155149 -154307 -62124 -1307 -17196 -528
14524 -528 -1056 2700 -30487 -24001 14457 121424 35389 -45220 -202613 -160858 -124774 -80525
14512 -80525 -152013 -225594 -88434 -5799 22372 12567 -34117 -78004 -4623 77203 122781 87448
14500 87448 106288 75551 58405 130071 181646 81569 71856 62634 96789 166488 180885 54672
14488 54672 -43678 2787 31969 -2755 -27527 -46902 2924 27690 20518 -49626 1699 164835
14476 164835 257316 215547 120286 74456 -44763 -61491 -87442 -29941 18178 76141 112294
$$ packed form
14559D3470j25451M0293K5247J6604j913L0016L173J2790l4026O4847o6836k6166
14547a7952J6540L6610M2317p6075k6712O1807n2948p6882J78858J21634j03210
14536A03987j68931J1480P9874k4658l8622m8512o9767Q42R2183O0817j5889J6668
14524e28n28L756l3187O486L8458J06967q6035q0609j57393M1755L6084M4249
14512h0525p1488p3581J37160Q2635K8171r805m6684m3887P3381Q1826M5578l5333
14500H7448J8840l0737j7146P1666N1575j00077r713r222L4155O9699J4397j26213
14488E4672r8350M6465K9182l4724k4772j9375M9826K4766p172p0144N1325J63136
14476A64835R2481m1769r5261m5830j19219j6728k5951N7501M8119N7963L6153
$$ plain form
14465 112294 23858 -52053 -75267 7511 102937 147049 85904 54950 88833 -39405 -97707
14454 -97707 -80627 62210 -11297 -2957 23312 13525 -12854 -58940 -43704 -81687 -44592 55991
14442 55991 4556 -5721 -83306 -41773 64964 97162 105627 78830 25927 -7649 119143
14431 119143 154083 96594 88805 21630 -96529 -131641 -170271 -54759 81581 30465 -109321
14420 -109321 -138438 -4620 52661 -12785 57621 147069 78066 28927 -31914 -56972 -81730
14409 -81730 -75374 26312 40426 -32419 -159659 -107368 -32653 -43542 -102670 -15502 -36911
14398 -36911 -72021 -25066 65339 48559 -10871 -21668 21860 -72286 -151573 -159848 -135195 -94291
14386 -94291 -61148 28887 58453 20989 25478 44555 97944 101055 75631 40237 30331 -697
$$ packed form
14465A12294q8436p5911k3214Q2778R5426M4112o1145l0954L3883j28238n8302
14454i7707J7080J42837p3507Q340K6269r787k6379m6086J5236l7983L7095J00583
14442E5991n1435j0277p7585M1533J06737L2198Q465k6797n2903l3576J26792
14431A19143L4940n7489p789o7175j18159l5112l8630J15512J36340n1116j39786
14420a09321k9117J33818N7281o5446P0406Q9448o9003m9139o0841k5058k4758
14409h1730O356J01686J4114p2845j27240N2291P4715j0889n9128Q7168k1409
14398c6911l5110M6955R0405j6780n9430j0797M3528r4146p9287q275K4653M0904
14386i4291L3143R0035K9566l7464M489J9077N3389L111k5424l5394r906l1028
$$ plain form
14374 -697 -64537 -20274 -70377 -185348 -245303 -219873 -118351 -98078 -107025 -39908 -1573 -8802
14362 -8802 -37363 -17959 -10089 48215 -6369 -80657 -70481 -46348 -73385 -135058 -148827 -154664
14350 -154664 -150151 -107534 -68455 75951 65768 74018 -35871 -150930 -175744 -228982 -224829
14339 -224829 -129095 -91464 -138620 -44238 -101206 -112518 -53345 40733 108909 92279 -6184
14328 -6184 -62759 -125719 237 27082 20928 16508 65473 136996 156856 59508 15031 -55047
14316 -55047 10013 -28856 -131098 -235541 -187673 -63050 -64060 -193742 -179017 -45157 8957
14305 8957 1401 26576 81149 103831 113813 128374 175736 186582 85755 -35672 -28004 -10168
14293 -10168 29580 -66259 -16092 72841 22138 82722 97586 105697 172479 118323 57148 10445
$$ packed form
14374f97o3840M4263n0103j14971n9955K5430J01522K0273q947O7117L8335p229
14362h802k8561J9404P870N8304n4584p4288J0176K4133k7037o1673j3769n837
14350a54664M513M2617L9079J44406j0183Q250j09889j15059k4814n3238M153
14339b24829R5734L7631m7156R4382n6968j1312N9173R4078O8176j6630r8463
14328f184n6575o2960J25956K6845o154m420M8965P1523J9860r7348m4477p0078
14316e5047O5060l8869j02242j04443M7868J24623j010j29682J4725J33860N4114
14305H957p556K5175N4573K2682R982J4561M7362J0846j00827j21427P668J7836
14293a0168L9748r5839N0167Q8933n0703O0584J4864Q111O6782n4156o1175m6703
$$ plain form
14281 10445 18182 57069 114131 99725 51742 29435 47686 103486 107975 185391 248409 218883
14269 218883 195955 173723 156376 96859 98549 113932 133020 95860 53485 199529 302560
14258 302560 246615 280987 321818 268025 257369 260430 182290 202794 251605 216921 103667
14247 103667 88264 67280 65421 116419 75147 98901 97727 -6236 -12527 70014 60899 -25633
14235 -25633 -106023 -120423 -43787 -36066 -57134 12071 -42527 -29750 1840 38506 -18190 -147511
14223 -147511 -6257 37128 2702 -10700 -10571 19339 11902 15987 62428 -45745 -59856 -60304
14211 -60304 -52064 -55994 -112327 -168635 -185877 -192873 -165245 -91606 -90350 -127611 -40907 78820
14199 78820 60068 -24857 -23281 -79363 -59157 -10087 37130 5768 52737 76737 106422 100036
$$ packed form
14281A0445P737L8887N7062j4406m7983k2307J8251N5800M489P7416O3018k9526
14269B18883k2928k2232j7347n9517J690J5383J9088l7160m2375J46044J03031
14258C02560n5945L4372M0831n3793j0656L061p8140K0504M8811l4684j13254
14247A03667j5403k0984j859N0998m1272K3754j174j03963o291Q2541r115q6532
14235b5633q0390j4400P6636P721k1068O9205n4598J2777L1590L6666n6696j29321
14223a47511J41254M3385l4426j3402J29K9910p437M085M6441j08173j4111m48
14211f0304Q240l930n6333n6308j7242o996K7628P3639J256l7261Q6704J19727
14199G8820j8752q4925J576n6082K0206M9070M7217l1362M6969K4000K9685o386
$$ plain form
14187 100036 93985 43318 126963 137274 -3139 -40646 -41678 -16486 72343 122725 75015 -7316
14175 -7316 23435 33575 95238 34806 38249 43637 25400 -111244 -158105 -116587 -70139 -6598
14163 -6598 -25740 65787 48311 -51825 -39204 58898 71362 94325 76335 137368 121105 111927
14151 111927 147885 115720 93741 19535 -40878 65146 118852 94528 14053 21324 19991 43086
14139 43086 26768 -48763 -56212 -17242 34547 170323 190749 163647 209478 193345 148519 153103
14127 153103 177837 131226 66101 38001 -6035 34297 57655 35718 -51961 -35480 38171
14116 38171 108076 154773 105675 80967 74752 75819 48501 -17670 -25111 2781 -14221 15333
14104 15333 62520 185623 215210 111200 156391 111708 28483 40152 89576 87425 35676
$$ packed form
14187A00036o051n0667Q3645J0311j40413l7507j032K5192Q8829N0382m7710q2331
14175g316L0751J0140O1663o0432L443N388j8237j36644m6861M1518M6448O3541
14163f598j9142R1527j7476j00136J2621R8102J2464K2963j7990O1033j6263r178
14151A11927L5958l2165k1979p4206o0413J06024N3706k4324q0475P271j333K3095
14139D3086j6318p5531p449L8970N1789J35776K0426k7102M5831j6133m4826M584
14127A53103K4734m6611o5125k8100m4036M0332K3358k1937q7679J6481P3651
14116C8171O9905M6697m9098k4708o215J067k7318o6171p441K7892j7002K9554
14104A5333M7187J23103K9587j04010M5191m4683q3225J1669M9424k151n1749
$$ plain form
14093 35676 -24489 37225 42415 -2925 8700 54281 13393 129376 159989 82493 93502 3514
14081 3514 -106925 -113734 -37392 12096 74315 63760 115781 180903 163059 44217 7387 -35755
14069 -35755 -90798 -99894 -58293 -74984 36408 157152 83871 21167 105528 186150 187108 113336
14057 113336 65255 56511 -25707 49485 19402 23681 72139 99215 58312 84163 67443 77429
14045 77429 20496 -111020 -138623 -33396 30641 1997 -126769 -106275 -13835 27838 25803
14034 25803 19522 106596 122214 138246 56570 3947 -11164 -85494 3279 53815 -23055 -63890
14022 -63890 -102310 -103884 -55613 9290 151331 109751 83613 71509 112427 106345 72585 51984
14010 51984 62235 167499 305310 268539 290985 287447 90021 -46970 -14086 18872 16168
$$ packed form
14093C5676o0165O1714N190m5340J1625M5581m0888J15983L0613p7496J1009q9988
14081C514j10439o809P6342M9488O2219j0555N2021O5122j7844j18842l6830m3142
14069c5755n5043r096M1601j6691J11392J20744p3281o2704Q4361Q0622R58p3772
14057A13336m8081q744q2218P5192l0083M279M8458K7076m0903K5851j6720R986
14045G7429n6933j31516k7603J05227O4037k8644j28766K0494R2440M1673k035
14034B5803o281Q7074J5618J6032q1676n2623j5111p4330Q8773N0536p6870m0835
14022f3890l8420j574M8271O4903J42041m1580k6138j2104M0918o082l3760k0601
14010E1984J0251J05264J37811l6771K2446l538j97426j36991L2884L2958k704
$$ plain form
13999 16168 -59114 -132850 -110003 -142862 -149837 -87056 -82317 -81881 -38233 -54418 -4268 67087
13987 67087 98796 41824 59240 7760 -23697 11322 8732 83992 84351 -129199 -127066 -136789
13975 -136789 -171451 -19012 56686 92539 47453 -14209 -63244 -50797 -48193 -113288 -32979
13964 -32979 53870 90389 133316 102660 142149 180152 280708 109089 -44336 -82414 -48758
13953 -48758 -7639 37223 39716 -56530 -57379 4345 121961 151434 107579 40217 -20865 -57574
13941 -57574 -47928 23307 72371 118066 95530 109975 137663 105415 47209 131814 156669 295261
13929 295261 342619 467287 651396 944366 1142838 1111431 960325 791673 620505 379290
13919 379290 300476 189445 263819 348220 341428 218230 121261 162941 207217 167304 102116
$$ packed form
13999A6168p5282p3736K2847l2859o975O2781M739M36M3648j6185N0150P1355
13987F7087L1709n6972J7416n1480l1457L5019k590P5260L59k13550K133r723
13975a36789l4662J52439P5698L5853m5086o1662m9035J2447K604o5095Q0309
13964c2979Q6849L6519M2927l0656L9489L8003J00556j71619j53425l8078L3656
13953d8758M1119M4862K493r6246q49O1724J17616K9473m3855o7362o1082l6709
13941e7574R646P1235M9064M5695k2536J4445K7688l2248n8206Q4605K4855J38592
13929B95261M7358J24668J84109K92970J98472l1407j51106j68652j71168k41215
13919C79290p8814j11031P4374Q4401o792j23198r6969M1680M4276l9913o5188
$$ plain form
13908 102116 47900 17937 30444 3731 -10362 43885 18709 -66967 -106057 -25030 -33724 -13759
13896 -13759 -66804 10534 133691 150999 122102 89848 91197 5191 -117252 -43288 7628
13885 7628 -27597 -10886 65394 163338 191158 116355 33008 1261 -2510 -53971 -21389 6044
13873 6044 -31975 76683 178246 96445 -113807 -99036 -40916 65658 121587 112690 -5124
13862 -5124 -51996 -6210 -58879 -149965 -152005 -166002 -54521 49431 113116 41024 56726 73899
13850 73899 13563 -51172 -39988 27610 9903 -15015 26192 64011 52997 109448 145447 108535
13838 108535 -5524 -39495 48738 73634 26518 132 -8246 -33289 -37923 6704 88327 168563
13826 168563 138708 41689 -52084 39002 116106 66633 34956 -40169 28997 10859 -38206
$$ packed form
13908A02116n4216k9963J2507k6713j4093N4247k5176q5676l9090Q1027q694J9965
13896a3759n3045P7338J23157J7308k8897l2254J349q6006j22443P3964N0916
13885G628l5225J6711P6280R7944K7820p4803q3347l1747l771n1461L2582K7433
13873F044l8019J08658J01563q1801k10252J4771N8120J06574N5929q897j17814
13862e124m6872M5786n2669r1086k040j3997J11481J03952O3685p2092J5702J7173
13850G3899o0336o4735J1184O7598j7707k4918M1207L7819j1014N6451L5999l6912
13838A08535j14059l3971Q8233K4896m7116k6386q378k5043m634M4627Q1623Q0236
13826A68563k9855r7019r3773R1086P7104m9473l1677p5125O9166j8138m9065
$$ plain form
13815 -38206 -70156 -80063 -120627 -115416 -126519 -102312 -39919 66977 47893 23723 1416 60412
13803 60412 51624 47512 38975 -47782 -96386 -145992 -130156 -109325 41535 132205 91940 100960
13791 100960 165822 104148 37989 -10467 -72802 -26759 41361 25548 23321 -16720 -13335 15551
13779 15551 20868 84405 12996 849 48813 34819 -7313 -53031 -17234 116973 134740 6464
13767 6464 1061 104000 242539 196187 57909 -40428 -65452 64487 105713 82948 54113
13756 54113 -25219 -83583 -58984 -5055 61041 48157 -8827 -36139 -28363 -3513 -27389 93291
13744 93291 90571 -8973 8649 125834 129756 159083 198925 112778 39099 72034 -15840 -91970
13732 -91970 -133735 -30877 -20968 63743 46117 32783 40219 94972 159014 179865 107886 92863
$$ packed form
13815c8206l1950r907m0564N211j1103K4207O2393J06896j9084k4170k2307N8996
13803F0412q788m112q537q6757m8604m9606J5836K0831J50860R0670m0265R020
13791A00960O4862o1674o6159m8456o2335M6043O8120j5813k227m0041L385K8886
13779A5551N317O3537p1409j2147M7964j3994m2132m5718L5797J34207J7767j28276
13767F464n403J02939J38539m6352j38278r8337k5024J29939M1226k2765k8835
13756E4113p9332n8364K4599N3929O6096j2884n6984k7312P776K4850k3876J20680
13744I3291k720r9544J7622J17185L922K9327L9842q6147p3679L2935q7874p6130
13732i1970m1765J02858R909Q4711j7626j3334P436N4753O4042K0851p1979j5023
$$ plain form
13720 92863 29138 -91126 -221464 -228066 -154708 -124027 -79991 -4910 12096 166711 191412
13709 191412 121288 158460 142671 51107 56636 106259 104502 159454 174474 135154 138744 77834
13697 77834 -21251 1235 80308 76985 61320 2740 73960 93309 144240 125246 98313 103579
13685 103579 57245 33989 126212 155304 188929 126077 100497 130309 122385 128442 106802 139425
13673 139425 162790 108675 128116 125892 92077 76253 16761 -23521 -47430 16954 71072 181039
13661 181039 150717 96416 52965 43891 28929 -70533 -53590 -2254 -9771 -82671 -9384 38282
13649 38282 97632 170507 29643 54925 102346 93717 108946 103352 102431 31939 -3131 -20283
13637 -20283 -127834 -115597 588 71328 49580 90398 116367 183517 164410 47538 30165
$$ packed form
13720I2863o3725j20264j30338o602P3358L0681M4036P5081J7006J54615K4701
13709A91412p0124L7172j5789r1564N529M9623j757N4952J5020l9320L590o0910
13697G7834r9085K2486P9073l323j5665n8580P1220J9349N0931j8994k6933N266
13685A03579m6334k3256R2223K9092L3625o2852k5580K9812p924O057k1640L2623
13673A39425K3365n4115J9441k224l3815j5824n9492m0282k3909O4384N4118J09967
13661A81039l0322n4301m3451r074j4962r9462J6943N1336p517p2900P3287M7666
13649C8282N9350P2875j40864K5282M7421q629J5229n594r21p0492l5070j7152
13637b0283j07551J2237J16185P0740k1748M0818K5969O7150j9107j16872j7373
$$ plain form
13626 30165 75202 119011 164886 152559 65152 58113 172937 115319 117633 190145 168642 150215
13614 150215 245108 270516 212351 123237 83359 -173 18585 95196 114516 29386 51918
13603 51918 55914 95039 112779 187188 194921 213017 236033 221727 153438 136455 190242 292080
13591 292080 249166 223397 245297 196831 116415 76368 127927 118115 64325 108299 49854 47290
13579 47290 168131 150130 94766 168369 209805 179649 137821 10676 -17497 5318 78651
13568 78651 118306 59609 58675 49149 30379 72526 120754 64467 60103 37303 -93590 -80643
13556 -80643 -52932 32355 78523 60100 37431 67737 83245 103888 32699 -31177 38547 96931
13544 96931 173071 239946 208697 160260 115037 153295 134590 13675 27413 -20018 -40776
$$ packed form
13626C0165M5037M3809M5875j2327q7407p039J14824n7618K314P2512k1503j8427
13614A50215R4893K5408n8165q9114l9878q3532J8758P6611J9320q5130K2532
13603E1918L996L9125J7740P4409P733J8096K3016j4306o8289j6983N3787J01838
13591B92080m2914k5769K1900m8466q0416m0047N1559r812n3790M3974n8445k564
13579D7290J20841j8001n5364P3603M1436l0156m1828j27145k8173K2815P3333
13568G8651L9655n8697r34r526j8770M2147M8228n6287m364k2800j30893J2947
13556h0643K7711Q5287M6168j8423k2669L0306J5508K0643p1189o3876O9724N8384
13544I6931P6140O6875l1249m8437m5223L8258j8705j20915J3738m7431k0758
$$ plain form
13533 -40776 37698 92267 158257 241357 223227 136324 61280 32887 83508 169388 207221 317675
13521 317675 341671 365722 279226 157096 103263 169296 233510 169550 192366 218986 154988
13510 154988 112549 184185 217380 202585 205134 106164 8734 -22401 98496 180187 222893
13499 222893 142395 94503 136000 62847 27064 18993 11534 -29497 -49361 10919 33077 58581
13487 58581 105024 56202 -6754 1401 44686 -1700 -53457 -86013 -43324 -130887 -152589 -100365
13475 -100365 -36007 -16118 -4589 8280 -76659 -63271 -15156 54959 66562 78309 105595
13464 105595 27046 -36565 -9660 -5382 80479 192277 182536 226416 124706 64425 158010
13453 158010 249674 236043 104902 -157 -20722 122452 154469 205182 174294 139508 202876
$$ packed form
13533d0776P8474N4569O5990Q3100j8130q6903p5044k8393N0621Q5880L7833J10454
13521C17675K3996K4051q6496j22130n3833O6033O4214o3960K2816K6620o3998
13510A54988m2439P1636L3195j4795K549r8970r7430l1135J20897Q1691M2706
13499B22893q0498m7892M1497p3153l5783q071p459m1031j9864O0280K2158K5504
13487E8581M6443m8822o2956Q155M3285m6386n1757l2556M2689q7563k1702N2224
13475a00365O4358J9889J1529J2869q4939J3388M8115P0115J1603J1747K7286
13464A05595p8549o3611K6905M278Q5861J11798r741M3880j01710o0281R3585
13453A58010R1664j3631j31141j05059k0565J43174L2017N0713l0888l4786O3368
$$ plain form
13442 202876 124045 60884 74666 169914 138634 111853 120263 109336 211222 315796 309803
13431 309803 329769 246207 194952 237148 166572 109133 150672 156006 155658 134340 132138 81453
13419 81453 -11907 49481 84279 135706 152242 131571 57562 191063 251879 207504 190206
13408 190206 151247 112327 211859 209613 162136 156331 102272 113236 159935 163610 95095 -38839
13396 -38839 -75432 -60299 -1128 -70399 -83655 -28075 33113 -29949 89751 177195 132781
13385 132781 27920 -37445 35919 14769 55511 187634 89608 255049 326580 272934 305919
13374 305919 354587 261207 176750 200951 193408 194629 133810 118041 138436 152280 213747 246298
13362 246298 192479 226583 237080 231538 247708 273285 266643 257939 213830 199705 156957 132993
$$ packed form
13442B02876p8831o3161J3782R5248l1280k6781Q410j0927J01886J04574n993
13431C09803J9966q3562n1255M2196p0576n7439M1539N334l48k1318k202n0685
13419H1453r3360O1388L4798N1427J6536k0671p4009J33501O0816m4375j7298
13408A90206l8959l8920R9532k246m7477n805n4059J0964M6699L675o8515j33934
13396c8839l6593J5133N9171o9271j3256N5580O1188o3062J19700Q7444m4414
13385A32781j04861o5365P3364k1150M0742J32123r8026J65441P1531n3646L2985
13374C05919M8668r3380q4457K4201p543J221o0819j5769K0395J3844O1467L2551
13362B46298n3819L4104J0497n542J6170K5577o642q704m4109j4125m2748k3964
$$ plain form
13350 132993 115729 113496 131246 125779 -19720 49182 191468 206553 244868 198352 127899
13339 127899 56695 127009 185612 228254 269151 304575 274210 238490 248149 163328 132931 90615
13327 90615 48602 48548 20634 77282 213995 270378 313603 264673 195132 156842 161550 274873
13315 274873 297331 318217 284529 277149 292724 224901 163793 235644 220383 254576 228457 222299
13303 222299 224905 187872 189250 177387 87702 149024 202522 206320 132349 -28618 -35831 -34609
13291 -34609 -56775 -30709 14242 131225 215896 198183 157375 159995 127266 85680 -2634 90348
13279 90348 209527 155017 88272 78964 108119 78916 105096 167672 102608 80633 111392 206055
13267 206055 268618 212738 169446 146457 89284 -7842 74824 102051 7117 -31628 64064
$$ packed form
13350A32993j7264k233J7750n467j45499O8902J42286J5085L8315m6516p0453
13339A27899p1204P0314N8603M2642M0897L5424l0365l5720R659q4821l0397m2316
13327I0615m2013n4k7914N6648J36713N6383M3225m8930o9541l8290M708J13323
13315B74873K2458K0886l3688p380J5575o7823o1108P1851j5261L4193k6119o158
13303B22299K606l7033J378j1863q9685O1322N3498L798p3971j60967p213J222
13291c4609k2166K6066M4951J16983Q4671j7713m0808K620l2729m1586q8314R2982
13279I0348J19179n4510o6745r308K9155k9203K6180O2576o5064k1975L0759R4663
13267B06055O2563n5880m3292k2989n7173r7126Q2666K7227r4934l8745R5692
$$ plain form
13256 64064 96172 161979 145224 59207 72371 102957 103426 110705 199482 239559 172518 151221
13244 151221 211881 270119 250578 230071 299903 319454 314261 381273 470615 345277 261473
13233 261473 252404 262044 192809 139373 67685 107234 139032 180377 160989 165442 81754 106385
13221 106385 152298 269937 253379 178764 168137 176018 153792 229172 187975 185558 157429 165142
13209 165142 119452 216244 337080 353446 271440 152469 180381 235734 279152 338969 291564
13198 291564 233000 278703 358487 388302 326589 234900 239865 248619 230347 206797 208289 209651
13186 209651 264915 258806 200110 261052 311550 241211 180107 81332 101627 243314 204271
13175 204271 180891 226343 229776 164915 135316 171906 311195 459273 437684 308121 304870
$$ packed form
13256F4064L2108O5807j6755q6017J3164L0586M69P279Q8777M0077o7041k1297
13244A51221O0660N8238j9541k0507O9832J9551n193O7012Q9342j25338q3804
13233B61473r069R640o9235n3436p1688L9549L1798M1345j9388M453q3688K4631
13221A06385M5913J17639j6558p4615j0627P881k2226P5380m1197k417k8129P713
13209A65142m5690R6792J20836J6366q2006j18971K7912N5353M3418N9817m7405
13198B91564n8564M5703P9784K9815o1713r1689M965Q754j8272k3550J492J362
13186B09651N5264o109n8696O0942N0498p0339o1104r8775K0295J41687l9043
13175B04271k3380M5452L433o4861k9599L6590J39289J48078k1589j29563l251
$$ plain form
13164 304870 276290 303705 324187 398947 364493 220955 166642 219955 233685 194108 146299
13153 146299 228812 373545 351556 322967 296596 315408 308623 258550 235366 264971 257627 200165
13141 200165 211790 210821 258856 279514 204549 172594 160734 158666 151331 245023 217299 150273
13129 150273 127083 155619 128795 95409 80652 35688 -11121 142146 208043 349353 338141
13118 338141 253483 220517 214844 167501 201982 203829 234843 350925 336486 220029 97425
13107 97425 33116 83590 200032 231519 336540 366405 259905 220059 172457 196396 147528
13096 147528 154919 265118 364602 344423 289409 299674 292661 161958 174181 320765 358587
13085 358587 376243 322717 311384 286800 309450 336714 350232 349553 319193 298955 256997 220066
$$ packed form
13164C04870k8580K7415K0482P4760l4454j43538n4313N3313J3730l9577m7809
13153A46299Q2513J44733k1989k8589k6371J8812o785n0073k3184K9605p344n7462
13141B00165J1625r69M8035K0658p4965l1955j1860k068p335R3692k7724o7026
13129A50273k3190K8536k6824l3386j4757m4964m6809J53267O5897J41310j1212
13118C38141q4658l2966n673m7343L4481J847L1014J16082j4439j16457j22604
13107I7425o4309N0474J16442L1487J05021K9865j06500l9846m7602K3939m8868
13096A47528P391J10199R9484k0179n5014J0265p013j30703J2223J46584L7822
13085C58587J7656n3526j1333k4584K2650K7264J3518o79l0360k0238m1958l6931
$$ plain form
13073 220066 261524 260457 248988 200130 270657 351637 369383 359247 329251 328088 329257 260160
13061 260160 255300 290178 313361 289900 216535 200686 293387 258304 189879 138655 270390
13050 270390 348583 393741 474815 420630 493867 466473 408330 494985 455916 420169 477491
13039 477491 407077 221452 227125 261925 309071 316387 247168 202797 168970 265619 367888
13028 367888 387017 355009 357244 263843 262979 176975 221565 361120 335726 244938 313538 199897
13016 199897 165068 213208 323831 305809 234384 184245 174752 212765 137078 15532 90401
13005 90401 169333 137548 179321 280024 374790 408953 354203 335758 321169 310767 335521
12994 335521 382702 490777 490481 458232 360253 321584 296705 288076 321791 228693 145035 174524
$$ packed form
13073B20066M1458j067j1469m8858P0527Q0980J7746j0136k9996j163J169o9097
13061B60160m860L4878K3183k3461p3365j5849R2701l5083o8425n1224J31735
13050B70390P8193M5158Q1074n4185P3237k7394n8143Q6655l9069l5747N7322
13039D77491p0414j85625N673L4800M7146P316o9219m4371l3827R6649J02269
13028C67888J9129l2008K235r3401q64q6004M4590J39555k5394r0788O8600j13641
13016A99897l4829M8140J10623j8022p1425n0139r493L8013p5687j21546P4869
13005I0401P8932l1785M1773J00703R4766L4163n4750j8445j4589j0402K4754
12994C35521M7181J08075k96l2249r7979l8669k4879q629L3715r3098q3658K9489
$$ plain form
12982 174524 263265 424201 439451 394660 275781 212685 102240 106917 152550 234226 341050
12971 341050 450002 566367 464054 381067 352660 379421 438843 489242 578894 582117 627847
12960 627847 616761 528118 584900 532203 444907 445718 455332 434002 414167 374074 292358 276274
12948 276274 313002 231088 306245 306908 319299 410231 433838 397344 411259 272271 285239 345966
12936 345966 354277 424056 429581 374437 353247 258108 220380 236884 264904 328174 321168 323608
12924 323608 342425 465023 551039 510355 457743 441366 365596 416357 333719 253373 307163
12913 307163 247039 256393 401772 456560 402302 326413 381535 441587 478327 514693 428803
12902 428803 295485 342796 308061 263054 303939 257931 244534 332638 461627 431989 361148
$$ packed form
12982A74524Q8741J60936J5250m4791j18879o3096j10445M677M5633Q1676J06824
12971C41050J08952J16365j02313q2987k8407K6761N9422N0399Q9652L223M5730
12960F27847j1086q8643N6782n2697q7296Q11R614k1330j9835m0093q1716j6084
12948B76274L6728q1914P5157O63J2391R0932K3607l6494J3915j38988J2968O0727
12936C45966Q311O9779N525n5144k1190r5139l7728J6504K8020O3270p006K440
12924C23608J8817J22598Q6016m0684n2612j6377p5770N0761q2638q0346N3790
12913C07163o0124R354J45379N4788n4258p5889N5122O0052L6740L6366q5890
12902D28803j33318M7311l4735m5007M0885m6008j3397Q8104J28989k9638p0841
$$ plain form
12891 361148 325390 414118 494203 593906 594216 514103 557380 502254 498824 394729 347352 426911
12879 426911 428588 379781 407383 506802 530781 465916 363186 219814 235317 245942 370566
12868 370566 477360 477898 498970 374405 240263 271201 397547 442107 475361 610245 473556
12857 473556 391877 407124 453906 358002 310607 338353 410597 407970 527358 620723 653833
12846 653833 729300 671523 737284 745058 714852 615895 560715 506084 380563 371547 487477
12835 487477 572429 557102 538296 474521 488214 498631 531381 578620 556355 397782 347884
12824 347884 444206 408187 366143 401400 395912 464882 522029 470459 502187 485431 496212 454261
12812 454261 441295 407109 390502 358399 401876 489440 575721 592879 691625 607943 473619
$$ packed form
12891C61148l5758Q8728Q0085R9703L10q0113M3277n5126l430j04095m7377P9559
12879D26911J677m8807K7602R9419K3979o4865j02730j43372J5503J0625J24624
12868C70566J06794N38K1072j24565j34142L0938J26346M4560L3254J34884j36689
12857D73556q1679J5247M6782r5904m7395K7746P2244k627J19388R3365L3110
12846F53833P5467n7777O5761P774l0206r8957n5180n4631j25521r016J15930
12835D87477Q4952j5327j8806o3775J3693J0417L2750M7239k2265j58573m9898
12824C47884R6322l6019m2044L5257n488O8970N7147n1570L1728j6756J0781m1951
12812D54261j2966l4186j6607l2103M3477Q7564Q6281J7158R8746q3682j34324
$$ plain form
12801 473619 521821 596283 496808 488990 489551 497960 525028 587424 520246 480723 517476 573673
12789 573673 522347 529208 504848 525493 582804 531263 563921 574880 542357 573275 544169 468454
12777 468454 464471 477317 521976 533246 526255 460569 468523 451586 537028 567944 546604 542238
12765 542238 574036 520111 548849 608525 559331 518915 504896 655287 688743 725344 704407
12754 704407 650722 584138 659283 660477 704013 670456 650755 611448 557724 563313 521189 427408
12742 427408 414874 503941 524469 666306 652771 604521 575404 573992 610227 659817 624417
12731 624417 573156 574572 660616 730270 752761 646071 513779 534410 511369 543362 523013
12720 523013 539217 513618 489159 519085 456758 426685 504989 457757 400750 405952 373758 494868
$$ packed form
12801D73619M8202P4462r9475p818N61Q409K7068O2396o7178l9523L6753N6197
12789E73673n1326O861k4360K0645N7311n1541L2658J0959l2523L0918k9106p5715
12777D68454l983J2846M4659J1270o991o5686P954j6937Q5442L0916k1340m366
12765E42238L1798n3925K8738N9676m9194m0416j4019J50391L3456L6601k0937
12754G04407n3685o6584P5145J194M3536l3557j9701l9307n3724N589m2124r3781
12742D27408j2534Q9067K0528J41837j3535m8250k9117j412L6235M9590l5400
12731F24417n1261J416Q6044O9654K2491j06690j32292K0631k3041L1993k0349
12720E23013J6204k5599k4459K9926o2327l0073P8304m7232n7007N202l2194J21110
$$ plain form
12708 494868 564189 671610 633250 609633 562068 520099 435942 478765 569621 562756 580061
12697 580061 623966 673955 785330 759969 667317 607304 476833 467039 549275 491811 516269
12686 516269 608908 563812 596019 636431 601942 569962 551609 563044 588065 513536 513036 506763
12674 506763 494524 522636 573427 664150 664144 682499 668761 710232 753311 796641 757897 711830
12662 711830 674792 747713 748183 588757 535612 575313 651401 716894 763430 715891 570346
12651 570346 559812 556266 519791 524268 579190 581232 615105 608679 523391 641442 751273 738729
12639 738729 677015 746847 714987 782105 853992 803588 753487 756171 783235 748900 720584 753229
12627 753229 766781 792815 750349 716737 736552 781478 777352 736583 743074 756641 682715 668218
$$ packed form
12708D94868O9321J07421l8360k3617m7565m1969q4157M2823R0856o865J7305
12697E80061M3905M9989J11375k5361r2652o0013j30471r794Q2236n7464K4458
12686E16269R2639m5096L2207M0412l4489l1980j8353J1435K5021p4529n00o273
12674E06763j2239K8112N0791R0723oJ8355j3738M1471M3079M3330l8744m6067
12662G11830l7038P2921M70j59426n3145L9701P6088O5493M6536m7539j45545
12651E70346j0534l546l6475M477N4922K042L3873o426q5288J18051J09831j2544
12639G38729o1714O9832l1860O7118P1887n0404n0101K684K7064l4335k8316L2645
12627G53229J3552K6034m2466l3612J9815M4926m126m0769O491J3567p3926j4497
$$ plain form
12615 668218 679533 729199 680663 670261 715940 776425 811410 864292 901184 935756 814201
12604 814201 815373 745864 779282 820216 822998 732031 753147 804209 778473 814736 860413 868056
12592 868056 821122 741886 754925 855801 960226 983935 921773 899850 851044 725947 692700
12581 692700 719561 687099 720974 745205 775585 722174 627197 683936 744918 799334 830853
12570 830853 935370 952293 835847 808761 922390 1009939 939604 934805 1023809 1063188 975259
12559 975259 1017441 1025784 982559 882848 835968 849125 746177 826802 914693 936852 957768
12548 957768 912078 923832 948643 1027273 941510 839333 861397 893603 928369 958433 963153
12537 963153 857532 885670 1048818 1185998 1249660 1199034 1086063 1002493 1028801 1037961 979578
$$ packed form
12615F68218J1315M9666m8536j0402M5679O0485L4985N2882L6892L4572j21555
12604H14201J172o9509L3418M0934K782r0967K1116N1062k5736L6263M5677P643
12592H68056m6934p9236J3039J00876J04425K3709o2162k1923m8806j25097l3247
12581F92700K6861l2462L3875K4231L0380n3411r4977N6739O0982N4416L1519
12570H30853J04517J6923j16446k7086J13629Q7549p0335m799Q9004L9379q7929
12559I75259M2182Q343m3225r9711m6880J3157j02948Q0625Q7891K2159K0916
12548I57768m5690J1754K4811P8630q5763j02177K2064L2206L4766L0064M720
12537I63153j05621K8138J63148J37180O3662n0626j12971q3570K6308R160n8383
$$ plain form
12526 979578 974688 997063 1152330 1182747 1067733 1001435 951043 970946 978980 1076866 1063042
12515 1063042 1057798 1151982 1214636 1152650 1132742 1176543 1117934 1104353 1154874 1155500 1194650 1101131
12503 1101131 1098135 1093255 1128778 1205586 1196285 1177776 1144816 1177603 1173340 1122796 1050448 1085552
12491 1085552 1154624 1093068 995775 1032244 1082481 1027911 998593 1000781 1047366 1202743 1312875
12480 1312875 1312967 1316270 1294685 1220543 1196665 1306139 1401302 1338990 1290584 1354179 1346690 1315134
12468 1315134 1253157 1210478 1199866 1161278 1119755 1048028 1045659 1082993 1173195 1245227 1280558
12457 1280558 1211801 1210184 1176865 1185642 1284145 1330419 1310710 1260359 1241996 1322778 1250157 1175798
12445 1175798 1262110 1295761 1324548 1345028 1350832 1360226 1319619 1330923 1429338 1458265 1391414 1353457
$$ packed form
12526I79578m890K2375J55267L0417j15014o6298n0392J9903Q034R7886j3824
12515A063042n244R4184O2654o1986j9908M3801n8609j3581N0521O26L9150r3519
12503A101131k996m880L5523P6808r301j8509l2960L2787m263n0544p2348L5104
12491A085552O9072o1556r7293L6469N0237n4570k9318K188M6585J55377J10132
12480A312875R2L303k1585p4142k3878J09474R5163o2312m8406O3595p489l1556
12468A315134o1977m2679j0612l8588m1523p1727k369L7334R0202P2032L5331
12457A280558o8757j617l3319Q777R8503M6274j9709n0351j8363Q0782p2621p4359
12445A175798Q6312L3651K8787K0480N804R394m0607J1304R8415K8927o6851l7957
$$ plain form
12433 1353457 1392047 1391496 1352002 1328880 1332744 1421452 1499923 1397931 1376595 1373993 1393411 1404086
12421 1404086 1430513 1544502 1583186 1545069 1453347 1439308 1409047 1414823 1446076 1468768 1520989
12410 1520989 1541612 1528764 1513261 1567364 1606830 1566019 1493788 1554111 1691301 1729285 1719366
12399 1719366 1689096 1576584 1611659 1639310 1632621 1663720 1761171 1735888 1684194 1753845 1759751
12388 1759751 1713494 1649762 1667546 1681244 1604568 1559517 1555482 1576918 1586945 1642871 1679126
12377 1679126 1700624 1734687 1734727 1758883 1702624 1725925 1753126 1781854 1798381 1914018 1905909 1750977
12365 1750977 1780741 1745678 1803626 1778497 1893821 2052526 2014523 1958618 1948047 1892683 1807411
12354 1807411 1938022 2084924 2060502 1983279 1935414 1961705 1943084 1973603 2081662 2124102 2069715
$$ packed form
12433A353457L8590n51l9494k3122L864Q8708P8471j01992k1336k602J9418J0675
12421A404086K6427J13989L8684l8117r1722j4039l0261N776L1253K2692N2221
12410A520989K0623j2848j5503N4103L9466m0811p2231O0323J37190L7984r919
12399A719366l0270j12512L5075K7651o689L1099R7451k5283n1694O9651N906
12388A759751m6257o3732J7784J3698p6676m5051m035K1436J0027N5926L6255
12377A679126K1498L4063M0K4156n6259K3301K7201K8728J6527J15637q109j54932
12365A750977K9764l5063N7948k5129J15324J58705l8003n5905j0571n5364q5272
12354A807411J30611J46902k4422p7223m7865K6291j8621L0519J08059M2440n4387
$$ plain form
12343 2069715 2040766 1996419 1974933 2007487 2055488 2024699 2098201 2223586 2221589 2268556 2326212
12332 2326212 2238250 2208647 2136504 2080505 2055795 2108235 2130130 2205420 2181400 2089602 2079717
12321 2079717 2168567 2219978 2274477 2254792 2292236 2331810 2357855 2457818 2545809 2581065 2515803
12310 2515803 2470397 2461381 2455661 2435033 2404428 2230043 2238071 2409478 2596416 2668941 2576482
12299 2576482 2534389 2579036 2664432 2714665 2667410 2632994 2599269 2574333 2515598 2539364 2596254
12288 2596254 2679077 2750541 2712761 2732862 2852992 2873486 2943210 2811144 2783319 2813229 2757264
12277 2757264 2768382 2771356 2766442 2777601 2906479 2970988 2970199 3006966 2922821 2899543 3110804 3154848
12265 3154848 3082012 3017242 3110460 3183278 3257181 3219876 3158429 3178082 3325350 3309414 3238718
$$ packed form
12343B069715k8949m4347k1486L2554M8001l0789P3502J25385j997M6967N7656
12332B326212q7962k9603p2143n5999k4710N2440K1895P5290k4020r1798r885
12321B079717Q8850N1411N4499j9685L7444L9574K6045R9963Q7991L5256o5262
12310B515803m5406r016n720k0628l0605j74385Q028J71407J86938P2525r2459
12299B576482m2093M4647Q5396N0233m7255l4416l3725k4936n8735K3766N6890
12288B596254Q2823P1464l7780K0101J20130K0494O9724j32066k7825K9910n5965
12277B757264J1118K974m914J1159J28878O4509p89L6767q4145k3278K11261M4044
12265C154848p2836o4770R3218P2818P3903l7305o1447J9653J47268j5936p0696
$$ plain form
12254 3238718 3208837 3201869 3209697 3259172 3304679 3461502 3409727 3454545 3432792 3345820 3332542
12243 3332542 3394329 3453862 3468525 3407641 3418304 3514090 3479641 3532934 3680157 3773329 3820255
12232 3820255 3699735 3740286 3835015 3840409 3830306 3811431 3875429 3883985 3800101 3921865 3971496
12221 3971496 4025434 4025470 3973340 3942058 3951800 3993771 4070162 4111943 4110209 4185463 4259278 4292300
12209 4292300 4310025 4326820 4408559 4426814 4451367 4516923 4550136 4487861 4421877 4472006 4612632
12198 4612632 4553330 4507690 4484477 4528455 4608336 4719966 4816363 4836648 4832976 4965708 4987231
12187 4987231 4976187 5042160 5012157 4979358 5014629 5057272 5123998 5219845 5285070 5334424 5355438
12176 5355438 5407125 5516825 5562246 5564775 5577836 5606320 5687295 5638083 5669957 5700482 5732999
$$ packed form
12254C238718k9881o968P828M9475M5507J56823n1775M4818k1753q6972j3278
12243C332542O1787N9533J4663o0884J0663R5786l4449N3293J47223R3172M6926
12232C820255j20520M0551R4729N394j0103j8875O3998Q556q3884J21764M9631
12221C971496N3938L6n2130l1282R742M1971P6391M1781j734P5254P3815L3022
12209D292300J7725J6795Q1739J8255K4553O5556L3213o2275o5984N0129J40626
12198D612632n9302m5640k3213M3978P9881J11630R6397K0285l672J32732K1523
12187D987231j1044O5973l0003l2799L5271M2643O6726R5847O5225M9354K1014
12176E355438N1687J09700M5421K529J3061K8484Q0975m9212L1874L0525L2517
$$ plain form
12165 5732999 5762291 5860911 5889612 5890712 5970198 6063556 6161422 6191411 6202429 6241727 6254701
12154 6254701 6289737 6377614 6359914 6350576 6476540 6541946 6521360 6453046 6479855 6565379 6567980
12143 6567980 6590166 6675047 6794531 6878752 7024260 7083884 7151722 7191455 7230214 7297250 7402705
12132 7402705 7387360 7425889 7417366 7454587 7507663 7540834 7594569 7668564 7722307 7835510 7901070
12121 7901070 7958992 8032828 8007267 8036763 8147159 8293650 8360733 8424773 8477851 8568777 8789549
12110 8789549 8952440 8951701 9000807 8941974 8980528 9181287 9251461 9297118 9456174 9492577 9610975
12099 9610975 9736530 9782665 9847378 10015048 10108025 10134192 10183591 10172804 10131601 10304683 10509049
12088 10509049 10622086 10664725 10765155 10898312 11042283 11181229 11271138 11292084 11308417 11321533
$$ packed form
12165E732999K9292R8620K8701J100P9486R3358R7866K9989J1018L9298J2974
12154F254701L5036Q7877j7700r338J25964O5406k0586o8314K6809Q5524K601
12143F567980K2186Q4881J19484Q4221J45508N9624O7838L9733L8759O7036J05455
12132G402705j5345L8529q523L7221N3076L3171N3735P3995N3743J13203O5560
12121G901070N7922P3836k5561K9496J10396J46491O7083O4040N3078R0926K20772
12110H789549J62891p39M9106n8833L8554K00759P0174M5657J59056L6403J18398
12099I610975J25555M6135O4713J67670R2977K6167M9399j0787m1203J73082K04366
12088A0509049J13037M2639J00430J33157J43971J38946Q9909K0946J6333J3116
$$ plain form
12078 11321533 11551314 11822151 11989568 12130141 12313339 12371090 12474469 12611344 12647428 12704557
12068 12704557 12781338 12896809 12967958 13137263 13410270 13491404 13513779 13614331 13856154 14023010
12058 14023010 14050164 14158152 14370016 14580378 14728873 14789629 14867362 14908352 15152795 15399349
12048 15399349 15492484 15592256 15726777 15895678 16134768 16333315 16519400 16712118 16839519 16855068
12038 16855068 17010967 17229851 17360105 17516578 17635672 17775946 18034868 18355333 18629379
12029 18629379 18777978 18919387 19033895 19208238 19413151 19548410 19794070 20052019 20282837
12020 20282837 20476531 20670019 20683312 20930425 21236888 21393727 21494574 21688458 21934400
12011 21934400 22094618 22304265 22566318 22756957 22950258 23258993 23505593 23713268 23931087
$$ packed form
12078A1321533K29781K70837J67417J40573J83198N7751J03379J36875L6084N7129
12068A2704557P6781J15471P1149J69305K73007Q1134K2375J00552K41823J66856
12058A4023010K7154J07988K11864K10362J48495O0756P7733M0990K44443K46554
12048A5399349R3135R9772J34521J68901K39090J98547J86085J92718J27401J5549
12038A6855068J55899K18884J30254J56473J19094J40274K58922L20465K74046
12029A8629379J48599J41409J14508J74343K04913J35259K45660K57949K30818
12020B0282837J93694J93488J3293K47113L06463J56839J00847J93884K45942
12011B1934400J60218K09647K62053J90639J93301L08735K46600K07675K17819
$$ plain form
12002 23931087 24075108 24249775 24446341 24741806 25089696 25441765 25703651 25874540 26067036
11993 26067036 26219550 26374132 26599906 26845782 27060197 27316888 27478732 27703540 27980323
11984 27980323 28094025 28334405 28591673 28833031 29055306 29380094 29740105 29889916 30070718
11975 30070718 30317213 30525931 30798410 30999639 31287370 31448908 31616146 31835858 32021855
11966 32021855 32209001 32400777 32588262 32766769 32883096 33156979 33359586 33513249 33737900
11957 33737900 33857810 34022109 34215806 34348795 34499182 34590023 34713502 34800913 34921227 35112989
11947 35112989 35291512 35485232 35613155 35586694 35651081 35753762 35849303 35918250 36017239 36034673
11937 36034673 36057284 36033550 36093606 36179850 36143955 36068743 36196343 36268523 36190080 36162050 36137722
$$ packed form
12002B3931087J44021J74667J96566K95465L47890L52069K61886J70889J92496
11993B6067036J52514J54582K25774K45876K14415K56691J61844K24808K76783
11984B7980323J13702K40380K57268K41358K22275L24788L60011J49811J80802
11975C0070718K46495K08718K72479K01229K87731J61538J67238K19712J85997
11966C2021855J87146J91776J87485J78507J16327K73883K02607J53663K24651
11957C3737900J19910J64299J93697J32989J50387R0841J23479Q7411J20314J91762
11947C5112989J78523J93720J27923k6461O4387J02681R5541O8947R8989J7434
11937C6034673K2611k3734O0056Q6244l5895p5212J27600P2180p8443k8030k4328
$$ plain form
11926 36137722 36088616 36012550 36099950 36089141 36024262 35954961 35910717 35793499 35683872 35552482
11916 35552482 35506830 35476098 35367005 35233464 35186855 35087994 34983527 34787309 34610240 34497839
11906 34497839 34312016 34035660 33870867 33781589 33580111 33467705 33360722 33169189 33021477
11897 33021477 32798169 32588717 32497636 32314821 32120261 31905693 31732586 31471615 31202452
11888 31202452 30958872 30680270 30449566 30177650 29950579 29861769 29730403 29467355 29207225
11879 29207225 29012455 28759386 28544277 28312478 28123954 27985624 27791483 27515948 27128667
11870 27128667 26820559 26595323 26372604 26185151 25964074 25765268 25551629 25286845 24960785
11861 24960785 24780367 24630600 24395042 24247284 24033365 23756546 23545934 23390456 23329741
$$ packed form
11926C6137722m9106p6066Q7400j0809o4879o9301m4244j17218j09627j31390
11916C5552482m5652l0732j09093j33541m6609r8861j04467j96218j77069j12401
11906C4497839j85823k76356j64793q9278k01478j12406j06983j91533j47712
11897C3021477k23308k09452r1081j82815j94560k14568j73107k60971k69163
11888C1202452k43580k78602k30704k71916k27071q8810j31366k63048k60130
11879B9207225j94770k53069k15109k31799j88524j38330j94141k75535l87281
11870B7128667l08108k25236k22719j87453k21077j98806k13639k64784l26060
11861B4960785j80418j49767k35558j47758k13919k76819k10612j55478o0715
$$ plain form
11852 23329741 23118973 22869677 22655345 22324747 22089394 21897019 21657104 21506585 21442843
11843 21442843 21121735 20858903 20645945 20399194 20203855 20059919 19932217 19763274 19613340
11834 19613340 19359322 19085736 18973298 18799290 18578735 18336057 18116369 17990112 17804110
11825 17804110 17588187 17494895 17267566 17007727 16859460 16688378 16470673 16293038 16148621
11816 16148621 16107589 15945990 15761714 15676089 15538009 15370805 15230532 15227441 15141427 15023699
11806 15023699 14840753 14618140 14485590 14300521 14056048 13916653 13824460 13754019 13685342 13589823
11796 13589823 13378365 13255920 13215353 13122713 12934373 12740438 12656526 12576072 12391849 12197476
11786 12197476 12101958 11986622 11975299 11879660 11701474 11546479 11312815 11085547 10992806 10980262
$$ packed form
11852B3329741k10768k49296k14332l30598k35353j92375k39915j50519o3742
11843B1442843l21108k62832k12958k46751j95339j43936j27702j68943j49934
11834A9613340k54018k73586j12438j74008k20555k42678k19688j26257j86002
11825A7804110k15923r3292k27329k59839j48267j71082k17705j77635j44417
11816A6148621m1032j61599j84276q5625j38080j67204j40273l091q6014j17728
11806A5023699j82946k22613j32550j85069k44473j39395r2193p0441o8677r5519
11796A3589823k11458j22445m0567r2640j88340j93935q3912q0454j84223j94373
11786A2197476r5518j15336j1323r5639j78186j54995k33664k27268r2741j2544
$$ plain form
11776 10980262 10953112 10862423 10885067 10850165 10724624 10621216 10590738 10520843 10449141 10345766
11766 10345766 10191180 10031506 9924111 9874423 9798826 9640745 9542762 9437002 9353069 9258297
11756 9258297 9148398 9197592 9137956 9056065 8875362 8758988 8719267 8664331 8550267 8427246
11746 8427246 8379089 8391521 8394982 8355116 8191550 8049514 8007138 8030006 7971931 7930860 7922142
11735 7922142 7778340 7614325 7521108 7554030 7491764 7355972 7363018 7294178 7212208 7053986 7014230
11724 7014230 7111984 7067974 6980687 6970875 6989652 7012460 6844276 6759962 6689163 6588649 6499462
11713 6499462 6537094 6508968 6486173 6452264 6324759 6227312 6191013 6251030 6200773 6058376 5912547
11702 5912547 5923633 6056708 6013810 5910959 5869301 5796592 5694706 5600239 5607461 5640486 5573137
$$ packed form
11776A0980262k7150r0689K2644l4902j25541j03408l0478o9895p1702j03375
11766A0345766j54586j59674j07395m9688p5597j58081r7983j05760q3933r4772
11756I258297j09899M9194n9636q1891j80703j16374l9721n4936j14064j23021
11746H427246m8157J2432L461l9866j63566j42036m2376K2868n8075m1071q718
11735G922142j43802j64015r3217L2922o2266j35792P046o8840q1970j58222l9756
11724G014230R7754m4010q7287r812J8777K2808j68184q4314p0799j00514q9187
11713F499462L7632k8126k2795l3909j27505r7447l6299O0017n0257j42397j45829
11702E912547J1086J33075m2898j02851m1658p2709j01886r4467P222L3025o7349
$$ plain form
11691 5573137 5486372 5521017 5470597 5424065 5446884 5428204 5332732 5286496 5251022 5197397 5168111
11680 5168111 5191503 5244562 5209139 5103255 5006876 4944596 4965314 5044705 5098348 5078326 5033085
11669 5033085 4943703 4757632 4702228 4691752 4733036 4761045 4812213 4827350 4850096 4852477 4923633
11658 4923633 4986710 4958160 4975796 5072147 5092578 5201162 5499234 5827705 6100348 6687629
11648 6687629 7609786 8572944 9239428 9304962 8680313 7775165 6943443 6289371 5688520 5247779
11638 5247779 5051183 4832578 4546120 4399813 4352078 4208505 4060746 3938175 3907863 3797916
11628 3797916 3789229 3789326 3815692 3768322 3757460 3714243 3650319 3567958 3469452 3438458 3544961 3584108
11616 3584108 3440412 3344571 3308593 3284179 3346163 3310534 3376719 3432389 3279463 3212759 3232913
$$ packed form
11691E573137q6765L4645n0420m6532K2819j8680r5472m6236l5474n3625k9286
11680E168111K3392N3059l5423j05884r6379o2280K0718P9391N3643k0022m5241
11669E033085q9382j86071n5404j0476M1284K8009N1168J5137K2746K381P1156
11658D923633O3077k8550J7636R6351K0431J08584K98072L28471K72643N87281
11648F687629R22157R63158O66484O5534o24649r05148q31722o54072o00851m40741
11638E247779j96596k18605k86458j46307m7735j43573j47759j22571l0312j09947
11628C797916q687R7K6366m7370j0862m3217o3924q2361r8506l0994J06503L9147
11616C584108j43696r5841l5978k4414O1984l5629O6185N5670j52926o6704K0154
$$ plain form
11605 3232913 3296862 3221620 3173052 3220728 3178213 3095483 3083941 2981554 2877254 2761115 2863675
11594 2863675 2929138 3029472 3038332 2977829 2907447 2951255 2993028 3086150 3071817 2994851 2940071
11583 2940071 2894420 2875808 2841878 2749410 2723927 2773429 2777753 2738859 2719392 2756069 2776188
11572 2776188 2693579 2651819 2626803 2652174 2533578 2515302 2572939 2606058 2552726 2516927 2519424
11561 2519424 2532352 2545786 2597692 2615164 2593051 2446422 2365401 2456367 2495389 2422172 2394143
11550 2394143 2377926 2322294 2281737 2352125 2413556 2461983 2449865 2412218 2287101 2187023 2171675
11539 2171675 2144575 2157049 2285492 2322898 2187203 2147511 2163676 2166415 2191743 2119517 2009964
11528 2009964 2035823 2182236 2249307 2160985 2115290 2110310 2122714 2130178 2102856 2130941 2112356
$$ packed form
11605C232913O3949p5242m8568M7676m2515q2730j1542j02387j04300j16139J02560
11594B863675O5463J00334Q860o0503p0382M3808M1773R3122j4333p6966n4780
11583B940071m5651j8612l3930r2468k5483M9502M324l8894j9467L6677K0119
11572B776188q2609m1760k5016K5371j18596j8276N7637L3119n3332l5799K497
11561B519424J2928J3434N1906J7472k2113j46629q1021R0966L9022p3217k8029
11550B394143j6217n5632m0557P0388O1431M8427j2118l7647j25117j00078j5348
11539B171675k7100J2474J28443L7406j35695l9692J6165K739K5328p2226j09553
11528B009964K5859J46413O7071q8322m5695m980J2404P464k7322K8085j8585
$$ plain form
11517 2112356 2117271 2142266 2129144 2080722 2144975 2123208 2040387 1969153 1811218 1732617 1803766
11506 1803766 1819967 1755060 1773771 1786934 1829722 1782691 1859226 1946527 1849350 1786145 1775546
11495 1775546 1855487 1805497 1700799 1743722 1713507 1662001 1634856 1612899 1640217 1617317 1655308
11484 1655308 1663560 1615335 1621268 1666436 1703109 1652630 1674238 1698412 1806686 1749060 1710760
11473 1710760 1713289 1794812 1834720 1739428 1664211 1674742 1712496 1690975 1566197 1524916 1536066
11462 1536066 1579628 1643120 1628345 1536945 1458203 1413605 1414786 1472085 1478883 1448602 1537636 1556942
11450 1556942 1519911 1484756 1470009 1472934 1381478 1292283 1236090 1254178 1278088 1369831 1445483
11439 1445483 1431830 1352728 1341478 1372168 1336760 1312414 1344175 1281863 1276400 1325297 1376327
$$ packed form
11517B112356M915K4995j3122m8422O4253k1767q2821p1234j57935p8601P1149
11506A803766J6201o4907J8711J3163M2788m7031P6535Q7301r7177o3205j0599
11495A775546P9941m9990j04698M2923l0215n1506k7145k1957K7318k2900L7991
11484A655308Q252m8225N933M5168L6673n0479K1608K4174J08274n7626l8300
11473A710760K529Q1523L9908r5292p5217J0531L7754k1521j24778m1281J1150
11462A536066M3562O3492j4775r1400p8742m4598J181N7299O798l0281Q9034J9306
11450A556942l7031l5155j4747K925r1456q9195n6193J8088K3910R1743P5652
11439A445483j3653p9102j1250L0690l5408k4346L1761o2312n463M8897N1030
$$ plain form
11428 1376327 1287821 1259384 1187325 1244772 1287582 1256084 1229291 1218537 1287301 1347080 1348945
11417 1348945 1335304 1312966 1316820 1281250 1219193 1196984 1299981 1368289 1314478 1227214 1280533
11406 1280533 1288059 1230701 1156226 1045278 1023828 1092004 1161271 1243487 1262615 1256477 1250238 1210779
11394 1210779 1175895 1187805 1174834 1185741 1206766 1246250 1374224 1462046 1538371 1738020 2017327
11383 2017327 2388103 2935625 3323666 3451964 3187929 2741559 2299259 1917013 1625560
11374 1625560 1516153 1424474 1395670 1386265 1269445 1151152 1050155 1068931 1084309 1091252 1058145
11363 1058145 1112920 1122914 1029112 979538 947183 997246 1018968 997525 868698 814329 842505
11352 842505 1011816 1059915 1042246 1021028 952533 970640 973877 891247 941478 990152 1046706
$$ packed form
11428A376327q8506k8437p2059N7447M2810l1498k6793j0754O8764N9779J865
11417A348945j3641k2338L854l5570o2057k2209J02997O8308n3811q7264N3319
11406A280533P526n7358p4475j10948k1450O8176O9267Q2216J9128o138o239l9459
11394A210779l4884J1910j2971J0907K1025L9484J27974Q7822P6325J99649K79307
11383B017327L70776N47522L88041J28298k64035m46370m42300l82246k91453
11374A625560j09407r1679k8804r405j16820j18293j00997J8776J5378O943l3107
11363A058145N4775R994r3802m9574l2355N0063K1722k1443j28827n4369K8176
11352H42505J69311M8099j7669k1218o8495J8107L237q2630N0231M8674N6554
$$ plain form
11341 1046706 1039640 1070693 1060885 1053370 1053148 924221 872075 837889 815110 848297 845621 845322 868639
11328 868639 937341 931886 921331 904863 849453 772242 732077 697333 727613 841542 914838
11317 914838 958735 917798 902751 832647 786060 827356 872831 820636 830701 820961 899437 816201
11305 816201 714602 678819 716339 735794 766990 813511 771228 705143 758835 725505 642224
11294 642224 758345 807077 799125 825940 794518 730358 667647 732365 740426 744283 752137 768446
11282 768446 752028 750188 695629 746507 765329 758490 726768 829531 848934 761180 855476 913244
11270 913244 906680 762090 751930 788694 758425 703110 696965 678518 777537 805849 813752 825006
11258 825006 817558 890213 793617 724367 668631 681634 702332 766279 800550 868254 915724 828207
$$ packed form
11341A046706p066L1053r808p515k22j28927n2146l4186k2779L3187k676k99K3317
11328H68639O8702n455j0555j6468n5410p7211m0165l4744L0280J13929P3296
11317I14838M3897m0937j5047p0104m6587M1296M5475n2195J0065r740P8476q3236
11305H16201j01599l5783L7520J9455L1196M6521m2283o6085N3692l3330q3281
11294F42224J16121M8732p952K6815l1422o4160o2711O4718Q061L857P854J6309
11282G68446j6418j840n4559N0878J8822o839l1722J02763J9403q7754R4296N7768
11270I13244o564j44590j0160L6764l0269n5315o145j8447R9019K8312P903J1254
11258H25006p448P2655r6596o9250n5736J3003K0698O3947L4271O7704M7470q7517
$$ plain form
11246 828207 768549 805745 828720 720515 715324 687259 648490 702692 663351 670013 671020 709953
11234 709953 647505 754348 798935 722613 719675 680482 722237 842709 905374 866129 794435
11223 794435 786550 755243 703627 671045 773369 806742 829245 838620 783221 725080 705527 589974
11211 589974 536583 551111 641418 698473 650631 609036 555482 487574 488447 515327 509069 469513
11199 469513 521348 605437 600894 579948 545405 560485 529729 447635 488803 545280 567597 507572
11187 507572 575966 538942 439707 368804 372914 416850 384268 351699 394185 496982 616190
11176 616190 624748 699300 674019 656443 576720 576702 548506 522953 473273 467457 461230 465231 505637
11163 505637 591555 616454 614746 599432 444161 413657 483751 484061 499356 528208 546402 487880
$$ packed form
11246H28207n9658L7196K2975j08205n191k8065l8769N4202l9341O662J007L8933
11234G09953o2448J06843M4587p6322k938l9193M1755J20472O2665l9245p1694
11223G94435p885l1307n1616l2582J02324L3373K2503R375n5399n8141j9553j15553
11211E89974n3391J4528R0307N7055m7842m1595n3554o7908Q73K6880o258l9556
11199D69513N1835Q4089m543k0946l4543J5080l0756q2094M1168N6477K2317o0025
11187E07572O8394l7024r9235p0903M110M3936l2582l2569M2486J02797J19208
11176F16190Q558P4552k5281j7576p9723j8k8196k5553m9680n816o227M001M0406
11163E05637Q5918K4899j708j5314j55271l0504P0094L10J5295K8852J8194n8522
$$ plain form
11151 487880 434873 431278 416469 485969 568373 577065 594402 582138 529970 485893 555642 489837
11139 489837 504985 475267 327631 381103 404281 464648 434286 423735 377919 363102 347583
11128 347583 413628 505037 583883 543455 463053 394032 407334 485146 504102 407252 471310
11117 471310 542076 512124 488173 495266 577331 594575 715377 673049 566692 541066 559138
11106 559138 529605 494119 494506 424878 422832 424434 275193 142363 170496 154686 169082 191679
11094 191679 228173 301730 386376 388980 400269 527752 629709 630467 551916 508610 482888 417795
11082 417795 362194 389230 371527 339805 272666 287618 327694 397610 497144 591214 709217
11071 709217 733877 738742 719603 757747 629817 590830 674994 771597 830509 882868 925646
$$ packed form
11151D87880n3007l595j4809O9500Q2404Q692J7337j2264n2168m4077O9749o5805
11139D89837J5148k9718j47636N3472K3178O0367l0362j0551m5816j4817j5519
11128C47583O6045R1409P8846m0428q0402o9021J3302P7812J8956r6850O4058
11117D71310P0766k9952k3951P093Q2065J7244J20802m2328j06357k5626J8072
11106E59138k9533l5486L87o9628k046J602j49241j32830K8133j5810J4396K2597
11094A91679L6494P3557Q4646K604J1289J27483J01957P58p8551m3306k5722o5093
11082D17795n5601K7036j7703l1722o7139J4952M0076O9916R9534R4070J18003
11071G09217K4660M865j9139L8144j27930l8987Q4164R6603N8912N2359M2778
$$ plain form
11060 925646 812802 742567 710329 581330 610514 588748 720321 788515 830369 852933 896964
11049 896964 908072 881999 951184 1053326 1087477 1153004 1187171 1206951 1244171 1225399 1237010
11038 1237010 1281724 1360574 1513415 1651214 1717599 1667269 1585155 1523819 1614679 1737655 1753208
11027 1753208 1831511 1937223 2173550 2301266 2470804 2537706 2450760 2256074 2026035 1923843
11017 1923843 1953150 2037017 2272899 2498776 2699073 2847810 2859354 2806821 2716904 2652520
11007 2652520 2640916 2660131 2767767 2898570 3065660 3311953 3562214 3939772 4325744 4782400
10997 4782400 5279606 5797453 6451581 7274889 7943742 8136176 8233837 8417196 8925527 9720820
10987 9720820 10789507 12071657 13829031 16000399 18717926 22140127 26705434 32624783
$$ packed form
11060I25646j12844p0235l2238j28999K9184k1766J31573O8194M1854K2564M4031
11049H96964J1108k6073O9185J02142L4151O5527L4167J9780L7220j8772J1611
11038A237010M4714P8850J52841J37799O6385n0330q2114o1336R0860J22976J5553
11027A753208P8303J05712K36327J27716J69538O6902q6946j94686k30039j02192
11017A923843K9307Q3867K35882K25877K00297J48737J1544n2533q9917o4384
11007B652520j1604J9215J07636J30803J67090K46293K50261L77558L85972M56656
10997D782400M97206N17847O54128Q23308O68853J92434R7661J83359N08331P95293
10987I720820J068687J282150J757374K171368K717527L422201M565307N919349
$$ plain form
10979 32624783 40472780 51396811 67222190 90777930 126623685 180661150 257372027
10972 257372027 351326800 431418090 429326712 337141618 236918451 165525869 118785427
10965 118785427 88156619 67466756 53092095 42839273 35249028 29344375 24658360
10958 24658360 20977496 18162886 16037930 14265835 12836040 11663282 10735559 9997632
10950 9997632 9420338 9037232 8819730 8786541 8531646 7805521 6908921 6114311 5492781 5062740
10940 5062740 4763246 4481123 4264448 4088958 4021428 4039256 4190856 4449336 4551736 4258365
10930 4258365 3826888 3542010 3248433 2807286 2474058 2417109 2342677 2328085 2192110 2092234
10920 2092234 2093742 2010891 1850206 1709476 1759111 1794161 1811895 1790387 1720062 1509399 1313186
$$ packed form
10979C2624783P847997J0924031J5825379K3555740L5845755N4037465P6710877
10972B57372027R3954773Q0091290k091378r2185094j00223167p1392582m6740442
10965A18785427l0628808k0689863j4374661j0252822p590245n904653m686015
10958B4658360l680864k814610k124956j772095j429795j172758r27723p37927
10950I997632n77294l83106k17502l3189k54895p26125q96600p94610o21530m30041
10940E062740k99494k82123k16675j75490o7530J7828J51600K58480J02400k93371
10930D258365m31477k84878k93577m41147l33228n6949p4432j4592j35975r9876
10920B092234J508q2851j60685j40730M9635L5050J7734k1508p0325k10663j96213
$$ plain form
10909 1313186 1233220 1242835 1236803 1189292 1329242 1333722 1164166 1105948 1094001 1075631 1056893
10898 1056893 1020539 946912 1008851 1037484 1154775 1158752 1123921 1112537 1051671 1143463 1097594
10887 1097594 942825 843342 787501 793861 849329 928170 916431 901223 817355 800619 917101
10876 917101 991628 886352 820205 810403 839660 880451 770594 726742 835331 892620 812855
10865 812855 735159 741572 709517 664725 657413 715434 732305 779494 804490 787028 695918 652653
10853 652653 726798 775146 840840 784051 729330 810036 879440 894444 1064762 1239462 1353967
10842 1353967 1306882 1073514 852369 761362 723318 796523 807084 752639 643238 654876 693005
10831 693005 692914 648250 595678 498880 435375 524635 576958 547616 543266 552275 541385 696621
$$ packed form
10909A313186p9966R615o032m7511J39950M480j69556n8218j1947j8370j8738
10898A056893l6354p3627O1939K8633J17291L977l4831j1384o0866R1792m5869
10887A097594j54769r9483n5841O360N5468P8841j1739j5208q3868j6736J16482
10876I17101P4527j05276o6147r802K9257M0791j09857m3852J08589N7289p9765
10865H12855p7696O413l2055m4792p312N8021J6871M7189K4996j7462r1110m3265
10853F52653P4145M8348O5694n6789n4721Q0706O9404J5004J70318J74700J14505
10842A353967m7085k33368k21145r1007l8044P3205J0561n4445j09401J1638L8129
10831F93005r1m4664n2572r6798o3505Q9260N2323k9342m350R009j0890J55236
$$ plain form
10819 696621 692377 635024 587083 601298 597686 658425 637645 548803 545654 511716 466935 473561
10807 473561 524008 540669 459366 456602 463907 396539 311355 443948 511084 552197 514290 534822
10795 534822 508602 523650 420955 441510 475424 455672 456667 422840 452272 648406 583495
10784 583495 464440 383028 442852 417622 372082 297547 287951 320097 356717 368093 346146
10773 346146 290131 250743 259513 258495 248791 116596 96784 134853 108691 100050 117585 168786
10761 168786 189124 192927 213566 155726 303512 386977 304306 223836 256490 197915 136254
10750 136254 132090 114481 191871 209274 210933 223730 287247 355046 493578 640362 615272
10739 615272 594363 418638 287345 291262 214547 204580 185002 69430 73656 192958 316930
$$ packed form
10819F96621m244n7353m7941J4215l612O0739k0780q8842l149l3938m4781O626
10807D73561N0447J6661q1303k764P305o7368q5184J32593O7136M1113l7907K0532
10795E34822k6220J5048j02695K0555L3914j9752R95l3827K9432J96134o4911
10784E83495j19055q1412N9824k5230m5540p4535r596L2146L6620J1376k1947
10773C46146n6015l9388Q770j018r704j32195j9812L8069k6162q641J7535N1201
10761A68786K0338L803K0639n7840J47786Q3465q2671q0470L2654n8575o1661
10750A36254m164j7609P7390J7403J659J2797O3517O7799J38532J46784k5090
10739F15272k0909j75725j31293L917p6715r967j9578j15572M226J19302J23972
$$ plain form
10728 316930 295953 167740 154605 140018 153849 206248 268312 257216 181605 81104 137864
10717 137864 197654 266488 261438 241286 226787 294139 349996 336326 287543 252429 167985 97111
10705 97111 151043 180731 195741 115952 111317 272436 340041 361970 343084 337108 272858 259996
10693 259996 348495 311135 283459 349287 438811 467701 408266 332388 224091 219540 312448
10682 312448 340960 342784 424700 426843 517397 602371 582753 488036 457443 485157 527219 512823
10670 512823 489438 437658 461346 542466 521377 486101 459777 523335 707361 800174 809800
10659 809800 800302 935600 1087061 1209608 1330738 1310565 1230381 1236108 1326052 1367296 1364843
10648 1364843 1410541 1506117 1593562 1634689 1723569 1717164 1747296 1871071 1977756 2143306 2386017
$$ packed form
10728C16930k0977j28213j3135j4587J3831N2399O2064j1096p5611j00501N6760
10717A37864N9790O8834n050k0152j4499O7352N5857j3670m8783l5114q4444p0874
10705I7111N3932K9688J5010p9789m635J61119O7605K1929j8886n976o4250j2862
10693B59996Q8499l7360k7676O5828Q9524K8890n9435p5878j08297m551R2908
10682C12448K8512J824Q1916K143R0554Q4974j9618r4717l0593K7714M2062j4396
10670E12823k3385n1780K3688Q1120k1089l5276k6324O3558J84026R2813R626
10659H09800r498J35298J51461J22547J21130k0173q0184N727Q9944M1244k453
10648A364843M5698R5576Q7445M1127Q8880o405L0132J23775J06685J65550K42711
$$ plain form
10637 2386017 2626279 2976549 3473752 4082751 4684308 4956028 5209938 5639444 6222676
10628 6222676 7018947 7975212 9344988 11328676 13952881 17570738 22529609 29082835
10620 29082835 37499368 47754501 58777028 67660062 71560194 70299777 66347156 62755526
10612 62755526 61436210 63384657 69405442 80061810 95883330 116428193 138445812
10605 138445812 154745916 157626100 147239733 131621765 118286032 110622992 109550411
10598 109550411 115555049 128913653 149808171 176610304 203436155 219743897 215391756
10591 215391756 192457536 163764657 139179421 122167775 113001653 110973918 115478940
10584 115478940 125878093 140250514 153825327 159101953 150282641 130057062 107475875
$$ packed form
10637B386017K40262L50270M97203O08999O01557K71720K53910M29506N83232
10628F222676P96271R56265J369776J983688K624205L617857M958871O553226
10620B9082835Q416533J0255133J1022527Q883034L900132j260417l952621l591630
10612F2755526j319316J948447O020785J0656368J5821520K0544863K2017619
10605A38445812J6300104K880184j0386367j5617968j3335733p663040j072581
10598A09550411O004638J3358604K0894518K6802133K6825851J6307742m352141
10591B15391756k2934220k8692879k4585236j7011646r166122k027735M505022
10584A15478940J0399153J4372421J3574813N276626q819312k0225579k2581187
$$ plain form
10577 107475875 88825792 75659240 67678404 64093857 64021530 66442650 70169737 72949591
10569 72949591 72022047 65817577 55444688 44387398 34903575 27553216 22069872 18044226
10561 18044226 15101031 13030672 11545561 10531379 9889984 9464975 8837130 7781302
10553 7781302 6719177 5929119 5277744 4689118 4321243 4007336 3650149 3472827 3181671
10544 3181671 2988172 2726539 2556207 2490131 2415833 2407483 2315893 2135728 1918233 1861863
10534 1861863 1912625 1905606 1829377 1747214 1658270 1619790 1577827 1534216 1459120 1430426 1361000
10523 1361000 1293415 1259180 1192231 1185258 1095666 1133055 1109634 1191710 1254569 1203087 1257192
10512 1257192 1203661 1122013 1083399 945944 938137 928419 915092 929424 1026623 956503 854104
$$ packed form
10577A07475875j8650083j3166552p980836l584547p2327K421120L727087K779854
10569G2949591r27544o204470j0372889j1057290r483823p350359n483344m025646
10561A8044226k943195k070359j485111j014182o41395m25009o27845j055828
10553G781302j062125p90058o51375n88626l67875l13907l57187j77322k91156
10544C181671j93499k61633j70332o6076p4298q350r1590j80165k17495n6370
10534A861863N0762p019p6229q2163q8944l8480m1963m3611p5096k8694o9426
10523A361000o7585l4235o6949o973q9592L7389k3421Q2076O2859n1482N4105
10512A257192n3531q1648l8614j37455p807r718j3327J4332R7199p0120j02399
$$ plain form
10501 854104 762349 853563 791272 692448 682776 658250 616946 663328 732454 731575 690124 761991
10489 761991 775737 720317 631704 613808 582482 605471 631739 774206 787983 705676 689851
10478 689851 636152 638668 638499 662166 684931 751092 767092 675176 666804 711013 718871 776230
10466 776230 865925 827274 832291 772788 705173 568255 514507 618821 686940 671205 710731
10455 710731 796962 750018 702836 704038 609992 565882 609284 626344 589781 519404 525969 568984
10443 568984 622295 608952 534618 480492 466034 458588 462136 575040 528769 444983 398469 339603
10431 339603 369093 409868 425887 363137 321714 313061 445121 471651 464308 463236 474379 429100
10419 429100 413504 314946 269365 411347 506142 412499 307263 360361 370913 344474 348610
$$ packed form
10501H54104r1755R1214o2291r8824r672k4526m1304M6382O9126q79m1451P1867
10489G61991J3746n5420q8613j7896l1326K2989K6268J42467J3777q2307j5825
10478F89851n3699K516j69K3667K2765O6161J6000r1916q372M4209P858N7359
10466G76230Q9695l8651N017n9503o7615j36918n3748J04314O8119j5735L9526
10455G10731Q6231m6944m7182J202r4046m4110M3402J7060l6563p0377O565M3015
10443E68984N3311j3343p4334n4126j4458p446L548J12904m6271q3786m6514n8866
10431C39603K9490M0775J6019o2750m1423q653J32060K6530p343j072J1143m5279
10419D29100j5596r8558m5581J41982R4795r3643j05236N3098J0552k6439M136
$$ plain form
10408 348610 256740 296843 259415 244205 238555 236394 217673 165012 86666 77580 138018 146825
10396 146825 112427 244452 289425 304411 262032 283045 228670 160031 182158 154869 35612
10385 35612 22059 84784 163699 251598 166113 169522 156854 178118 107573 88084 14500 106094
10373 106094 200788 307287 356002 336213 322216 297895 213854 135622 98821 184227 221041
10362 221041 197562 275513 410040 487264 482062 401680 301326 291028 267465 242564 289620
10351 289620 321616 344191 371660 340749 427782 396090 343699 347910 285476 195986 159845 245508
10339 245508 291128 212894 209675 229607 283638 255420 253821 259024 225444 172153 137661 114054
10327 114054 69037 46842 50752 78640 65575 95626 156911 184411 176788 212808 224390 219142
$$ packed form
10408C48610r1870M0103l7428j5210n650k161j8721n2661p8346r086O0438Q807
10396A46825l4398J32025M4973J4986m2379K1013n4375o8639K2127k7289j19257
10385C5612j3553O2725P8915Q7899q5485L409j2668K1264p0545j9489p3584R1594
10373A06094R4694J06499M8715j9789j3997k4321q4041p8232l6801Q5406L6814
10362B21041k3479P7951J34527P7224n202q0382j00354j0298k3563k4901M7056
10351B89620L1996K2575K7469l0911Q7033l1692n2391M211o2434q9490l6141Q5663
10339B45508M5620p8234l219J9932N4031k8218j599N203l3580n3291l4492k3607
10327A14054m5017k2195L910K7888j3065L0051O1285K7500p623L6020J1582n248
$$ plain form
10315 219142 165006 138203 167517 144799 107712 26260 17288 165840 155370 152404 264702
10304 264702 263585 219157 146724 158509 138755 165428 119821 60618 42642 65908 139645 170430
10292 170430 157919 111197 147744 221584 254858 192315 179243 142509 106401 56647 144383
10281 144383 203878 175549 140000 176725 133412 64357 -14317 -11555 3771 97193 152598 142549
10269 142549 165171 203929 113526 166023 205109 220254 287990 275160 256194 201603 129715
10258 129715 120735 137935 160811 234143 150827 151521 246526 285098 202612 185810 173188 201303
10246 201303 133885 106163 140165 137526 234775 263722 217491 163419 181039 197490 42789
10235 42789 14677 21238 107772 78671 85960 112736 130176 149392 191228 180287 118638 76186
$$ packed form
10315B19142n4136k6803K9314k2718l7087q1452q972J48552j0470k966J12298
10304B64702j117m4428p2433J1785j9754K6673m5607n9203j7976K3266P3737L0785
10292A70430j2511m6722L6547P3840L3274o2543j3072l6734l6108m9754Q7736
10281A44383N9495k8329l5549L6725m3313o9055p8674K762J5326R3422N5405j0049
10269A42549K2622L8758r0403N2497L9086J5145O7736j2830j8966n4591p1888
10258A29715q980J7200K2876P3332q3316O94R5005L8572q2486j6802j2622K8115
10246B01303o7418k7722L4002k639R7249K8947m6231n4072J7620J6451j54701
10235D2789k8112O561Q6534k9101P289K6776J7440J9216M1836j0941o1649m2452
$$ plain form
10223 76186 37496 47854 355 113183 218651 172951 140306 27030 39737 68902 14972
10212 14972 -109338 -64998 32157 150085 296133 221101 110093 160503 256787 317513 244491
10201 244491 129036 132269 132812 107323 86549 112449 136831 144150 158431 172358 197199 212878
10189 212878 186850 133245 131306 171320 184930 245154 257469 242635 293429 346552 382135 492641
10177 492641 495420 530236 568609 503022 474292 529696 674289 775888 790137 809603 810768
10166 810768 764680 715934 749019 781742 723998 709152 775464 985641 1178846 1294622 1328350
10155 1328350 1166874 953833 791184 733995 723060 660367 630728 685957 853430 913531
10145 913531 931555 805284 718247 671775 521204 328128 378034 424486 460556 466318 460515
$$ packed form
10223G6186l8690J0358m7499J12828J05468m5700l2645j13276J2707K9165n3930
10212A4972j24310M4340R7155J17928J46048p5032j11008N0410R6284O0726p3022
10201B44491j15455L233N43k5489k0774K5900K4382P319J4281J3927K4841J5679
10189B12878k6028n3605j939M0014J3610O0224J2315j4834N0794N3123L5583J10506
10177D92641K779L4816L8373o5587k8730N5404J44593J01599J4249J9466J165
10166H10768m6088m8746L3085L2723n7744j4846O6312K10177J93205J15776L3728
10155A328350j61476k13041j62649n7189j0935o2693k9639N5229J67473O0101
10145I13531J8024j26271q7037m6472j50571j93076M9906M6452L6070N762n803
$$ plain form
10134 460515 491659 463301 424250 430503 250009 143454 124678 81389 120022 123255 77887
10123 77887 81160 117355 114249 135957 60594 66009 27643 -31228 -78912 -60305 -52812 -84469
10111 -84469 -84947 -37500 62930 82419 23707 -9056 -53274 -112916 -16111 73330 163228 78264
10099 78264 -6128 -37554 -20728 60180 69816 -7719 14904 177563 202144 72090 95918
10088 95918 185962 87297 74318 59489 100274 137423 125621 176431 188136 137931 172725 150435
10076 150435 71598 61850 117465 123362 172381 174779 79299 -29377 96428 98992 -47405 -101154
10064 -101154 5002 35324 124857 200689 170380 172960 104379 142720 127759 91251 208215
10053 208215 256314 184590 59279 1355 78439 59566 25128 24412 15062 -16801 -7071 -15873
$$ packed form
10134D60515L1144k8358l9051O253j80494j06555j8776m3289L8633L233m5368
10123G7887L273L6195l106K1708p5363N415l8366n8871m7684J8607P493l1657
10111h4469m78M7447J00430J9489n8712l2763m4218n9642R6805Q9441Q9898q4964
10099G8264q4392l1426J6826Q0908R636p7535K2623J62659K4581j30054K3828
10088I5918R0044r8665j2979j4829M0785L7149j1802N0810J1705n0205L4794k2290
10076A50435p8837r748N5615N897M9019K398r5480j08676J25805K564j46397n3749
10064a01154J06156L0322Q9533P5832l0309K580o8581L8341j4961l6508J16964
10053B08215M8099p1724j25311n7924P7084j8873l4438p16r350l1863R730q802
$$ plain form
10041 -15873 33443 69643 3704 33968 33298 10661 69493 101030 159865 95792 42564 46367
10029 46367 102866 60237 57221 857 51203 58257 110789 218901 155185 115203 34226 130180
10017 130180 202062 159763 -20595 18897 162039 196589 31038 38814 12344 27378 -16290
10006 -16290 18497 -28248 -149493 -180625 -182961 -173430 -134737 -78202 -97243 39450 80660 77472
9994 77472 176181 136751 -31656 99605 186053 275349 296965 188379 184423 183303 136612 87266
9982 87266 54833 39031 20105 -1798 -85749 -32257 61157 -29811 -100271 -166933 -134395 -17111
9970 -17111 59400 60083 89395 105389 113393 159796 149924 86009 51823 1769 -84910 -76712 -35201
9957 -35201 36271 -15006 -22598 -63546 -58190 -18288 11275 -33379 -95145 19036 61492 43462
$$ packed form
10041a5873M9316L6200o5939L0264o70k2637N8832L1537N8835o4073n3228L803
10029D6367N6499m2629l016n6364N0346P054N2532J08112o3716l9982q0977R5954
10017A30180P1882m2299j80358L9492J43142L4550j65551P776k6470J5034m3668
10006a6290L4787m6745j21245l1132k336R531L8693N6535j9041J36693M1210l188
9994G7472R8709l9430j68407J31261Q6448Q9296K1616j08586l956j120m6691m9346
9982H7266l2433j5802j8926k1903q3951N3492R3414r0968p0460o6662L2538J17284
9970a7111P6511O83K9312J5994Q004M6403r872o3915l4186n0054q6679Q198M1511
9957c5201P1472n1277p592m0948N356L9902K9563m4654o1766J14181M2456j8030
$$ plain form
9945 43462 2189 -54973 -45416 -27200 -37656 -115448 -129165 -73651 -15635 19795 57954 99215
9933 99215 24243 -46772 -16737 6280 -47598 28641 159569 122574 101098 144313 86062 43777
9921 43777 6088 -12448 -25502 -59963 -70943 -77300 -15977 64952 23591 53009 -25115 -71110
9909 -71110 -113965 -42941 -7295 -99423 -43594 60989 99595 108325 72420 107352 16709 -28026
9897 -28026 -34772 -166336 -257298 -167343 -59923 -34673 -27981 48911 119088 78655 -20602 -28861
9885 -28861 -23866 -31891 -46591 -106814 -177522 -168312 -92125 -19993 -27186 38402 140518 108398
9873 108398 18413 -118307 -148701 -40471 23912 119709 110928 117142 84934 111974 134404 33266
9861 33266 -26701 -147292 -115668 28958 80459 134091 171821 139683 23682 31789 72021
$$ packed form
9945D3462m1273n7162R557J8216j0456p7792j3717N5514N8016L5430L8159M1261
9933I9215p4972p1015L0035K3017n3878P6239J30928l6995k1476M3215n8251m2285
9921D3777l7689j8536j3054l4461j0980o357O1323Q0929m1361K9418p8124m5995
9909g1110m2855P1024L5646r2128N5829J04583L8606Q730l5905L4932r0643m4735
9897b8026o746j31564r0962Q9955J07420K5250O692P6892P0177m0433r9257q259
9885b8861M995q025j4700o0223p0708R210P6187P2132p193O5588J02116l2120
9873A08398q9985j36720l0394J08230O4383R5797q781O214l2208K7040K2430j01138
9861C3266n9967j20591L1624J44626N1501N3632L7730l2138j16001Q107M0232
$$ plain form
9850 72021 78340 53430 40689 94137 172594 182858 184580 285912 322001 313252 252034 224078
9838 224078 185791 159534 126599 144930 51675 -53670 -14278 79796 80846 109181 73453 67986
9826 67986 141370 89391 49214 90097 161644 103121 84459 161833 182309 171298 132713 76969
9814 76969 66461 67719 60449 53209 97775 87054 180861 203003 169119 144144 73138 75883 106920
9801 106920 59622 21571 48621 -57126 -36487 -7866 -48300 -40415 35159 22525 96257 187641
9789 187641 87466 -17739 -8959 104399 118625 51620 48853 19128 -28195 5930 -28032
9778 -28032 9756 1817 -4524 -27385 -112141 -22347 44615 -3990 67994 174795 172731 111658
9766 111658 50027 53528 99211 69351 153004 220559 203986 256475 202308 181131 100371 53077
$$ packed form
9850G2021O319k4910j2741N3448P8457J0264J722J01332L6089q749o1218k7956
9838B24078l8287k6257l2935J8331r3255j05345L9392R4074J050K8335l5728n467
9826F7986P3384n1979m0177M0883P1547n8523j8662P7374K0476j1011l8585n5744
9814G6969j0508J258p270p240M4566j0721R3807K2142l3884k4975p1006K745L1037
9801A06920m7298l8051K7050j05747K0639K8621m0434P885P5574j2634P3732R1384
9789A87641j00175j05205Q780J13358J4226o7005k767k9725m7323L4125l3962
9778b8032L7788p939o341k2861q4756Q9794O6962m8605P1984J06801k064o1073
9766A11658o1631L501M5683k9860Q3653O7555j6573N2489n4167k1177q0760m7294
$$ plain form
9754 53077 167556 182011 103277 108516 107330 -29825 -123271 -30000 16014 98704 150246 192678
9742 192678 153688 122679 50341 66936 39740 98717 44599 -70180 -41043 4615 -7609
9731 -7609 14867 -10561 17844 23805 67674 73013 69436 53603 -510 -28499 -7218 44496 145150
9718 145150 192152 171541 122554 78440 45836 -15946 -91265 48585 113358 83817 422
9707 422 -48284 -92106 -149397 -89570 43018 49621 68913 130235 171903 205556 115388 53200
9695 53200 -13807 -75220 -63922 7683 80654 152496 90609 65564 108231 124396 195390 183441
9683 183441 163867 105793 76113 78448 45724 128285 211328 139046 107474 114997 176579 187847
9671 187847 135573 9745 -60951 -45294 47644 11417 -40554 -13365 18833 30798 -17240
$$ packed form
9754E3077J14479J4455p8734N239j186j37155r3446R3271M6014Q2690N1542M2432
9742A92678l8990l1009p2338J6595k7196N8977n4118j14779K9137M5658j2224
9731g609K2476k5428K8405N961M3869N339l577j5833n4113k7989K1281N1714J00654
9718A45150M7002k0611m8987m4114l2604o1782p5319J39850O4773k9541q3395
9707D22m8706m3822n7291N9827J32588O603J9292O1322M1668L3653r0168o2188
9695E3200o7007o1413J1298P1605P2971P1842o1887k5045M2667J6165P0994j1949
9683A83441j9574n8074k9680K335l2724Q2561Q3043p2282l1572P523O1582J1268
9671A87847n2274j25828p0696J5657R2938l6227n1971K7189L2198J1965m8038
$$ plain form
9660 -17240 -113029 -86221 23351 289375 482864 596153 804836 1095134 1168676 878933
9650 878933 611922 470890 352019 316382 313578 246530 231451 208532 162358 143471 114497
9639 114497 58453 2341 -98080 -21784 137030 166762 191588 257023 148265 19252 70429
9628 70429 158777 165574 96692 -20743 21851 -9339 -41161 -53430 -117336 -57263 -82119 2103
9616 2103 8536 4830 78201 3869 -61601 -67555 -73050 -28524 -6008 23406 41467 -27053 -69292
9603 -69292 -77637 -22772 -23447 23881 77264 106073 69282 23468 38642 63083 72761 121952 128872
9590 128872 96081 6317 109039 156865 52796 70080 114430 94377 133112 181999 227540
9579 227540 226392 121908 82739 133104 68825 8961 29201 67275 11804 83461 218089
$$ packed form
9660a7240r5789K6808J09572K66024J93489J13289K08683K90298P3542k89743
9650H78933k67011j41032j18871l5637k804o7048j5079k2919m6174j8887k8974
9639A14497n6044n6112j00421P6296J58814K9732K4826O5435j08758j29013N1177
9628G0429Q8348O797o8882j17435M2594l1190l1822j2269o3906O0073k4856Q4222
9616B103O433l706P3371p4332o5470n954n495M4526K2516K9414J8061o8520m2239
9603f9292q345N4865o75M7328N3383K8809l6791m5814J5174K4441R678M9191O920
9590A28872l2791q9764J02722M7826j04069J7284M4350k0053L8735M8887M5541
9579B27540j148j04484l9169N0365o4279n9864K0240L8074n5471P1657J34628
$$ plain form
9568 218089 203488 44765 -59701 -29258 82912 104319 9721 -13725 -119141 -103911 -30726
9557 -30726 20039 11190 109443 103762 21430 19623 20812 -49698 -113597 -12017 99665 101304
9545 101304 135325 145464 133319 43570 -41376 -61179 -92463 -104504 -70649 -1545 47634 -15944
9533 -15944 -16122 16164 -55436 -35171 791 35396 11824 -38494 -68341 -59438 -19666 -56411
9521 -56411 -15743 -37966 -59427 -94751 -34449 -10 618 43214 21314 12001 -6165 37860
9509 37860 169819 110157 16159 -18311 16677 -68170 -73977 -38628 12366 -59150 30851 54814
9497 54814 15229 -23717 -41675 -63693 38487 -17686 -113869 -57686 -55528 -21475 89153 45161
9485 45161 49321 109563 127785 113201 151118 134473 146192 51848 62761 100317 60164 -30373
$$ packed form
9568B18089j4601j58723j04466L0443J12170K1407r4598k3446j05416J5230P3185
9557c0726N0765q849R8253n681q2332j807J189p0510o3899J01580J11682J639
9545A01304L4021J0139j2145q9749q4946j9803l1284j2041L3855O9104M9179o3578
9533a5944j78L2286p1600K0265L5962L4605k3572n0318k9847Q903L9772l6745
9521e6411M0668k2223k1461l5324O0302L4439O28M2596k1900r313j8166M4025
9509C7860J31959n9662r3998l4470L4988q4847n807L5349N0994p1516R0001K3963
9497E4814l9585l8946j7958k2018J02180n6173r6183N6183K158L4053J10628m3992
9485D5161M160O0242J8222j4584L7917j6645J1719r4344J0913L7556m0153r0537
$$ plain form
9473 -30373 -71294 -82664 -126738 -109375 -158472 -141629 -108033 -59977 -542 -32633 -87672 -58620
9461 -58620 11177 120770 129445 114821 171141 163982 193284 114065 -2396 40517 120242 226029
9449 226029 346267 321868 226090 170094 118146 61120 110121 114351 116051 80831 28343 13459
9437 13459 64897 13091 -60347 -108300 -53710 16904 -69803 -45844 14406 -8602 -41412 5317
9425 5317 -12096 -38983 -65729 -9406 43636 76182 104095 20560 70241 146032 49575 6502
9413 6502 82510 121706 55952 -34058 -83401 -33937 10984 15368 75893 77247 1625 34480
9401 34480 50108 67792 107811 136090 112376 46895 85097 29449 61323 126780 194186 66429
9389 66429 69970 90677 31309 7443 36756 12908 4351 -41451 51483 16089 -19263 -59473
$$ packed form
9473c0373m0921j1370m4074J7363m9097J6843L3596M8056N9435l2091n5039K9052
9461e8620O9797J09593Q675j4624N6320p159K9302p9219j16461M2913P9725J05787
9449B26029J20238k4399r5778n5996n1948n7026M9001M230J700l5220n2488j4884
9437A3459N1438n1806p3438m7953N4590P0614q6707K3959O0250k3008l2810M6729
9425E317j7413k6887k6746N6323N3042L2546K7913q3535M9681P5791r6457m3073
9413F502P6008L9196o5754r0010m9343M9464M4921M384O0525J354p5622L2855
9401C4480J5628J7684M0019K8279k3714o5481L8202n5648L1874O5457O7406j27757
9389F6429L541K0707n9368k3866K9313k3848q557m5802R2934l5394l5352m0210
$$ plain form
9377 -59473 -92986 -116862 -137742 -115731 -48238 -54981 -86956 3449 105532 72370 -9505 36505
9365 36505 137448 -7164 -109908 -107674 -92761 -107073 -42561 49569 50697 43516 109073 33364
9353 33364 40320 132704 58308 56944 52460 40834 -3849 18950 81656 33728 -40116 640
9341 640 60736 61536 44168 27041 75021 35524 -18727 61682 62803 61739 -8846 -39776 -49531
9328 -49531 -80532 -112739 -40391 21956 39720 -38888 -2499 25189 -28717 -56732 -47370 65655
9316 65655 105764 74353 1865 11516 -28720 -48066 -26353 -33087 -60105 -60196 -26999 21455 150319
9303 150319 156994 151707 125305 109795 93302 113547 137129 113699 134896 89684 71298 7744
9291 7744 -21765 -14611 94477 9285 -46644 -68338 -66029 -40509 57413 87525 27807 -5069
$$ packed form
9377e9473l3513k3876k0880K2011O7493o743l1975R0405J02083l3162q1875M6010
9365C6505J00943j44612j02744K234J4913j4312O4512R2130J128p181O5557p5709
9353C3364O956R2384p4396j364m484j1626m4683K2799O2706m7928p3844M0756
9341F40O0096Q00j7368j7127M7980l9497n4251Q0409J121j064p0585l0930r755
9328d9531l1001l2207P2348O2347J7764p8608L6389K7688n3906k8015R362J13025
9316F5655M0109l1411p2488R651m0236j9346K1713o734k7018r1L3197M8454J28864
9303A50319O675n287k6402j5510j6493K0245K3582k3430K1197m5212j8386o3554
9291G744k9509P154J09088q5192n5929k1694K309K5520R7922L0112n9718l2876
$$ plain form
9279 -5069 34525 48747 127781 66504 -52108 -82284 -10066 101414 76073 25186 29856 72949
9267 72949 42992 -34164 -170243 -147078 -6835 14798 48055 7742 -70295 -136672 -267268
9256 -267268 -303442 -296182 -119886 -55133 -42856 -150197 -176863 -168025 -71091 -40738 -104633 -48086
9244 -48086 44556 80691 18195 -18918 62267 -15114 -63826 -14803 -6048 -41429 -52865 -142077
9232 -142077 -115796 -87495 -155655 -132662 -67649 -22716 45624 82291 102755 129154 187694 209844
9220 209844 147829 49932 4511 -24682 -10281 33705 74549 111195 122242 132048 167841 60908
9208 60908 -57194 -67415 -77928 -72483 -113987 -134587 -82252 -8217 22427 7888 -45184 59406
9196 59406 27731 -21163 82911 111651 108257 34716 -6179 -48012 -1292 6356 -105870 -94309
$$ packed form
9279e069L9594J4222P9034o1277j18612l0176P2218J11480k5341n0887M670M3093
9267G2949k9957p7156j36079K3165J40243K1633L3257m0313p8037o6377j30596
9256b67268l6174P260J76296O4753J2277j07341k6666Q838R6934L0353o3895N6547
9244d8086R2642L6135o2496l7113Q1185p7381m8712M9023Q755l5381j1436q9212
9232a42077K6281K8301o8160K2993O5013M4933O8340L6667K0464K6399N8540K2150
9220B09844o2015r7897m5421k9193J4401M3986M0844L6646J1047R806L5793j06933
9208F0908j18102j0221j0513N445m1504k0600N2335P4035L0644j4539n3072J04590
9196E9406l1675m8894J04074K8740l394p3541m0895m1833M6720P648j12226J1561
$$ plain form
9184 -94309 -54057 -109588 -77681 -127858 -138820 -87764 44748 77485 -52646 -69529 -22108
9173 -22108 10795 80814 166710 105825 84317 7555 28106 -47490 -154305 -124983 -103178 -100737
9161 -100737 -55208 -89396 -105733 -97913 -78979 -119002 -76911 -22528 42962 17412 -33988 -8574
9149 -8574 -3559 -2096 32239 50138 186916 225047 211330 268022 288835 155833 109962 105797
9137 105797 53726 35156 89355 100966 104339 74104 39337 -58936 -100433 -90118 -9573 -39603
9125 -39603 -53955 -34363 -40214 51474 10668 -1561 -31630 -84421 -15689 69557 51734 49551
9113 49551 -7666 -24504 85885 247867 237360 89748 79413 101518 7293 -487 128327
9102 128327 186318 40773 -77202 -126094 -86223 -44835 27610 -1801 -51687 -96786 -29264
$$ packed form
9184i4309M0252n5531L1907n0177j0962N1056J32512L2737j30131j6883M7421
9173b2108L2903P0019Q5896o0885k1508p6762K0551p5596j06815K9322K1805K441
9161a00737M5529l4188j6337P820J8934m0023M2091N4383O5490k5550n1400K5414
9149h574N015J463L4335J7899J36778L8131j3717N6692K0813j33002m5871m165
9137A05797n2071j8570N4199J1611L373l0235l4767r8273m1497J0315Q0545l0030
9125c9603j4352J9592n851R1688m0806j2229l0069n2791O8732Q5246j7823k183
9113D9551n7217j6838J10389J61982j0507j47612j0335K2105r4225p780J28814
9102A28327N7991j45545j17975m8892L9871M1388P2445k9411m9886m5099O7522
$$ plain form
9091 -29264 -28771 -43909 -46369 -24822 -54546 -121016 -20900 51127 77892 54715 90709 212158
9079 212158 173560 70129 59407 108110 -8773 -71314 -65844 -24695 22993 -28851 -55977
9068 -55977 -5072 -19712 13295 64711 -31748 -81967 -45672 -108658 -198124 -170630 -26030 -24924
9056 -24924 72257 211924 255799 157392 66281 70239 45622 -9111 -38102 -50007 -4355 30237
9044 30237 27132 -67 -66177 -23822 -42992 -131239 -125875 -1864 101212 79823 69421 73162
9032 73162 116299 131824 70361 -7258 -30167 -20976 -7970 -49609 -153620 -54242 64109 53984
9020 53984 56968 177652 195195 73152 -14665 36426 107530 74189 -5129 -101394 -100051 -129955
9008 -129955 -138888 34861 -12216 -52032 -43816 -26935 38317 113268 93408 -80 -75210 -74734
$$ packed form
9091b9264M93j5138k460K1547k9724o6470J00116P2027K6765k3177L5994J21449
9079B12158l8598j03431j0722M8703j16883o2541N470M1149M7688n1844k7126
9068e5977N0905j4640L3007N1416r6459n0219L6295o2986q9466K7494J44600J106
9056b4924R7181J39667M3875r8407r1111L958k4617n4733k8991j1905M5652L4592
9044C0237l105k7199o6110M2355j9170q8247N364J24011J03076k1389j0402L741
9032G3162M3137J5525o1463p7619k2909R191J3006m1639j04011R9378J18351j0125
9020E3984K984J20684J7543j22043q7817N1091P1104l3341p9318r6265J343k9904
9008a29955q933J73749m7077l9816Q216J6881O5252P4951j9860r3488p5130M76
$$ plain form
8996 -74734 39279 97945 13709 11727 22103 -29202 -61337 -68822 3311 49493 -29932 -47443
8984 -47443 -66097 -193895 -145609 -915 22417 71362 32161 -40760 17352 32695 37620 57332
8972 57332 63988 12448 54792 110177 144802 150619 145820 4989 84907 118392 84487 43032
8960 43032 67952 95638 48689 -59282 -32511 -67647 -46487 50291 82400 63442 159141 136661
8948 136661 95540 -958 54210 127398 58458 -20856 -54134 71382 35315 73633 153358
8937 153358 116038 100817 105391 118921 186600 139463 48344 117579 217223 215873 123016 111640
8925 111640 128627 65253 31106 -66667 -96116 -20316 -85521 9520 124674 136082 125528
8914 125528 142684 98299 137922 162876 139978 114326 33155 45861 80311 -19424 -34470 -70972
$$ packed form
8996g4734J14013N8666q4236j982J0376n1305l2135p485P2133M6182p9425j7511
8984d7443j8654j27798M8286J44694K3332M8945l9201p2921N8112J5343M925J9712
8972E7332O656n1540M2344N5385L4625N817m799j40831P9918L3485l3905m1455
8960D3032K4920K7686m6949j07971K6771l5136K1160R6778L2109j8958R5699k2480
8948A36661m1121r6498N5168P3188o8940p9314l3278J25516l6067L8318P9725
8937A53358l7320j5221M574J3530O7679m7137r1119O9235R9644j350r2857j1376
8925A11640J6987o3374l4147r7773k9449P5800o5205R5041J15154J1408j0554
8914A25528J7156m4385L9623K4954k2898k5652q1171J2706L4450r9735j5046l6502
$$ plain form
8902 -70972 -5056 29793 108200 121198 100032 61729 8206 47112 -5 -90476 -27127 -15690
8890 -15690 -29007 -54340 59985 76342 72551 29379 33942 29643 46959 78504 61687 -1885
8878 -1885 -22777 -4266 -30875 -122609 -37527 51208 -10557 25796 43803 2891 -35772 -87220
8866 -87220 -133431 -48377 7424 -25940 -20014 -2851 43580 53142 4240 -96695 -212195 -173751
8854 -173751 -98300 -37657 46861 126919 83555 51448 89729 36040 37908 24447 61609 -25314
8842 -25314 16516 3138 114150 195737 64082 -42099 -24926 33456 102596 77071 -12878
8831 -12878 -50104 -73577 -71940 -59935 -97573 -72842 4397 -16599 -68995 -130409 -16000 54320
8819 54320 35113 60685 65086 125260 147069 63373 53432 27011 -50772 8722 39996 -23754
$$ packed form
8902g0972O5916L4849P8407J2998k1166l8303n3523L8906m7117r0471O3349J1437
8890a5690j3317k5333J14325J6357l791m3172M563m299J7316L1545j6817o3572
8878a885k0892J8511k6609r1734Q5082Q8735o1765L6353J8007m0912l8663n1448
8866h7220m6211Q5054N5801l3364N926J7163M6431R562m8902j00935j15500L8444
8854a73751P5451O0643Q4518Q0058m3364l2107L8281n3689J868j3461L7162q6923
8842b5314M1830j3378J11012Q1587j31655j06181J7173N8382O9140k5525q9949
8831a2878l7226k3473J637J2005l7638K4731P7239k0996n2396o1414J14409P0320
8819E4320j9207K5572M401O0174K1809q3696r941k6421p7783N9494L1274o3750
$$ plain form
8807 -23754 -72682 44518 100303 59414 -18408 -83795 -73597 -9499 88438 138826 122788 88227
8795 88227 -3832 -41432 -75774 -90335 12508 176827 193898 63669 87501 158336 153935
8784 153935 116904 133739 85324 145461 213253 173615 192743 178030 168271 164858 84600 -1068
8772 -1068 -6615 -111801 -110125 -117347 -197614 -176973 -136714 -152038 -135201 -53434 -14336 20363
8760 20363 124363 98584 -10725 -25944 111528 131846 82849 28596 20067 26594 119248 166422
8748 166422 92197 126131 112972 5126 5322 611 -8151 -13572 -15208 59877 142551 110286 -11047
8735 -11047 -131208 -130199 16593 37836 61944 56490 2942 -48604 47481 119459 159894 153458
8723 153458 137578 -13777 2958 105118 126116 7073 61672 43059 16097 30367 -18073
$$ packed form
8807b3754m8928J17200N5785m0889p7822o5387J0198O4098R7937N0388j6038l4561
8795H8227r2059l7600l4342j4561J02843J64319J7071j30229K3832P0835m401
8784A53935l7031J6835m8415O0137O7792l9638J9128j4713r759l413q0258q5668
8772a068n547j05186J676p222q0267K0641M0259j5324J6837Q1767L9098L4699
8760B0363J04000k5779j09309j5219J37472K0318m8997n4253q529O527R2654M7174
8748A66422p4225L3934j3159j07846J96m711q762n421j636P5085Q2674l2265j21333
8735a1047j20161J009J46792K1243K4108n454n3548n1546R6085P1978M0435o436
8723A53458j5880j51355J6735J02160K0998j19043N4599j8613k6962J4270m8440
$$ plain form
8712 -18073 -50153 -5340 52590 168860 257565 194243 73287 -11135 -34620 8225 -30908
8701 -30908 -104792 -25083 -3185 63280 145348 126985 37178 38875 94632 28073 -10700 -18672
8689 -18672 -62916 -104774 -78599 -41579 -10353 -45225 -132941 -73755 15136 51875 179119 218560
8677 218560 183055 112739 76893 76857 147036 129855 55480 38419 25501 8752 46422 126866
8665 126866 155608 162439 120469 88438 136252 114496 127918 108940 51256 17769 47957 59009
8653 59009 98960 191986 239735 151855 135462 182551 190667 228826 128558 57536 152306 150480
8641 150480 67185 93271 184359 185361 146099 102926 110373 162051 261729 121685 -30026 -125390
8629 -125390 -90899 -28887 29656 -51348 -72988 -38014 5365 28702 82011 60613 17631 -10282
$$ packed form
8712a8073l2080M4813N7930J16270Q8705o3322j20956q4422k3485M2845l9133
8701c0908p3884P9709K1898O6465Q2068j8363q9807J697N5757o6559l8773p972
8689a8672m4244m1858K6175L7020L1226l4872q7716N9186Q8891L6739J27244L9441
8677B18560l5505p0316l5846l6P0179j7181p4375j7061j2918j6749L7670Q0444
8665A26866K8742O831m1970l2031M7814k1756J3422j8978n7684l3487L0188J1052
8653E9009L9951R3026M7749q7880j6393M7089Q116L8159j00268p1022R4770j826
8641A50480q3295K6086R1088J002l9262m3173P447N1678R9678j40044j51711r5364
8629a25390L4491O2012N8543q1004k1640L4974M3379K3337N3309k1398m2982k7913
$$ plain form
8617 -10282 21901 34188 -32709 -9717 57509 111208 146868 54197 -25403 -72641 -82587 -109241
8605 -109241 -60787 5568 68309 96889 35416 -8652 -27268 -7115 135585 118124 37540
8594 37540 10719 104977 192769 214727 78663 -9220 -17533 65386 203480 253741 135982
8583 135982 2341 -23258 40039 45515 118090 162648 257372 248807 128562 99309 139012 49113
8571 49113 3426 -43200 -75924 -72614 22788 30132 130161 152529 135511 157848 124104 60406
8559 60406 133930 164010 166450 111483 94655 84218 63802 91882 145201 148305 125195 -41006
8547 -41006 -89560 -72275 6372 76920 12960 39494 127661 158822 149166 100309 6914 -57841
8535 -57841 -47126 -25900 5030 112083 94298 110282 114260 137326 113900 174082 235054 220632
$$ packed form
8617a0282L2183J2287o6897K2992O7226N3699L5660r2671p9600m7238r946k6654
8605a09241M8454O6355O2741K8580o1473m4068j8616K0153J42700j7461q0584
8594C7540k6821R4258Q7792K1958j36064q7883q313Q2919J38094N0261j17759
8583A35982j33641k5599O3297N476P2575M4558R4724q565j20245k9253L9703q9899
8571D9113m5687m6626l2724L310R5402P344J00029K2368j7018K2337l3744o3698
8559F0406P3524L0080K440n4967j6828j0437k0416K8080N3319L104k3110j66201
8547d1006m8554J7285P8647P0548o3960K6534Q8167L1161r656m8857r3395o4755
8535e7841J0715K1226L0930J07053j7785J5984L978K3066k3426O0182O0972j4422
$$ plain form
8523 220632 170960 183571 177818 50038 119605 237149 202796 119333 143470 116369 42127
8512 42127 28411 -14463 -66685 36935 104331 125996 197745 241908 279052 304762 198140
8501 198140 105899 107638 147656 82580 -999 41224 -28247 -57543 -81789 -40400 -45390 34493
8489 34493 160337 124671 103062 68542 30626 24769 52404 68899 122350 103516 16497 -47780
8477 -47780 -68995 -1512 46702 -8460 -53009 30112 83543 35470 64757 175481 231568 206718
8465 206718 163179 140181 208532 231331 267105 195105 117296 175018 325206 312847 194815
8454 194815 115638 158843 111506 146174 261068 255190 166297 223254 288047 301203 325831 262757
8442 262757 274564 363765 360658 282452 194925 164264 167011 180811 182463 229656 196779 114572
$$ packed form
8523B20632m9672J2611n753j27780O9567J17544l4353q3463K4137k7101p4242
8512D2127j3716m2874n2222J03620O7396K1665P1749M4163L7144K5710j06622
8501A98140r2241J739M0018o5076q3579M2223o9471k9296k4246M1389m990P9883
8489C4493J25844l5666k1609l4520l7916n857K7635J6495N3451j8834q7019o4277
8477d7780k1215O7483M8214n5162m4549Q3121N3431m8073K9287J10724N6087k4850
8465B06718m3539k2998O8351K2799L5774p2000p7809N7722J50188j2359j18032
8454A94815p9177M3205m7337L4668J14894n878q8893N6957O4793J3156K4628o3074
8442B62757J1807Q9201l107p8206q7527l0661K747J3800J652M7193l2877q2207
$$ plain form
8430 114572 59919 -20825 -143202 -177936 -48876 91785 159274 232403 103401 173727 257564
8419 257564 166085 190047 261144 207217 197822 254605 250026 271065 237813 263011 197603 153552
8407 153552 287126 330792 321429 311122 342972 295314 289239 247041 221743 141966 68386 -22222
8395 -22222 -126247 -76572 -53884 -63933 32770 134210 153253 93408 88863 94801 42845 -3422
8383 -3422 -23270 -133940 -53384 49735 159461 217419 233654 196180 81449 22921 129706
8372 129706 255822 238952 159122 -12467 -26621 99503 143596 143185 110833 95753 101520 91544
8360 91544 66512 91407 154632 195795 206340 237318 243678 247601 257585 309356 279787 212345
8348 212345 288748 303576 304235 205779 148910 96370 164119 163460 163935 192602 166432 143285 94631
$$ packed form
8430A14572n4653q0744j22377l4734J29060J40661O7489P3129j29002P0326Q3837
8419B57564r1479K3962P1097n3927r395N6783m579K1039l3252K5198o5408m4051
8407A53552J33574M3666r363j0307L1850m7658o075m2198k5298p9777p3580r0608
8395b2222j04025M9675K2688j0049R6703J01440J9043n9845m545N938n1956m6267
8383c422j9848j10670Q0556J03119J09726N7958J6235l7474j14731n8528J06785
8372A29706J26116j6870p9830j71589j4154J26124M4093m11l2352j5080N767r976
8360I1544k5032K4895O3225M1163J0545L0978O360L923R984N1771k9569o7442
8348B12345P6403J4828O59r8456n6869n2540O7749o59M75K8667k6170k3147m8654
$$ plain form
8335 94631 87015 107726 66580 98212 139727 163616 168519 64459 56063 96712 102672 198933
8323 198933 285202 355310 317740 255058 176478 104629 55603 72386 97527 76657 75083 32467
8311 32467 80824 141552 70172 81290 101352 114769 27741 19921 170200 208711 170952 210907
8299 210907 152235 170716 206041 186433 221277 218592 252900 235262 266181 268194 323650 332881
8287 332881 292295 255679 257634 203709 137746 75931 58789 86321 120603 180897 216044 220314
8275 220314 121136 216492 177685 186675 154061 100944 35602 71176 218400 236324 135569
8264 135569 62801 132324 188755 215903 216708 167420 180017 226753 188157 269691 287252 256827
8252 256827 324956 366121 418476 332674 173374 212310 204849 248749 263971 187628 193328 258917
$$ packed form
8335I4631p616K0711m1146L1632M1515K3889M903j04060q396M0649N960R6261
8323A98933Q6269P0108l7570o2682p8580p1849m9026J6783K5141k0870j574m2616
8311C2467M8357O0728p1380J1118K0062J3417q7028p820J50279L8511l7759L9955
8299B10907n8672J8481L5325j9608L4844k685L4308j7638L0919K013N5456R231
8287C32881m0586l6616J955n3925o5963o1815j7142K7532L4282O0294L5147M270
8275B20314r9178R5356l8807Q990l2614n3117o5342L5574J47224J7924j00755
8264A35569p2768O9523N6431K7148Q05m9288J2597M6736l8596Q1534J7561l0425
8252B56827O8129M1165N2355q5802j59300L8936p461M3900J5222p6343N700O5589
$$ plain form
8240 258917 248093 247908 359948 291915 288911 374916 302177 303827 252151 197733 125760 208061
8228 208061 348306 301279 278376 206696 227204 276122 302131 275800 194965 221167 202353
8217 202353 161321 262314 261653 269225 305862 214812 206278 230376 171535 141056 178253 220937
8205 220937 282320 322029 317674 262095 284826 368344 419994 404753 383835 329318 290796 291772
8193 291772 235686 212019 150162 222797 330348 311094 225942 264320 229093 223525 285299 216138
8181 216138 188588 204844 161257 100463 102414 115873 97737 38863 -5499 54763 136859 233472
8169 233472 246647 172406 142808 251124 302440 257588 248685 91994 13237 87120 174130
8158 174130 112621 69382 19905 193911 311637 201262 145634 182459 151537 84743 75286
$$ packed form
8240B58917j0824j85J12040o8033l004Q6005p2739J650n1676n4418p1973Q2301
8228B08061J40245m7027k2903p1680K0508M8918K6009k6331q0835K6202j8814
8217B02353m1032J00993o61P572L6637r1050q534K4098n8841l0479L7197M2684
8205B20937O1383L9709m355n5579K2731Q3518N1650j5241k0918n4517l8522R76
8193B91772n6086k3667o1857P2635J07551j9254q5152L8378l5227n568O1774o9161
8181B16138k7550J6256m3587o0794J951J3459j8136n8874m4362O0262Q2096R6613
8169B33472J3175p4241k9598J08316N1316m4852q903j56691p8757P3883Q7010
8158A74130o1509m3239m9477J74006J17726j10375n5628L6825l0922o6794r457
$$ plain form
8147 75286 20983 30069 88998 168454 179849 199899 160645 103584 122611 79180 48222 121134
8135 121134 307208 293881 74108 -9055 2548 88750 211544 259735 242445 309793 351292
8124 351292 332496 348359 274933 194346 176096 91155 91104 148951 138908 69489 -2553 77375
8112 77375 72766 58155 83861 82346 31315 107263 222321 222238 215539 232898 227380 159578 160410
8099 160410 207582 188489 134187 200657 168702 161304 169468 191505 233691 229241 214950 284655
8087 284655 190701 82401 115115 164183 199194 171525 137839 74466 9695 55964 15255
8076 15255 -9367 -22600 36039 -21495 -11002 21333 69922 148853 138632 159444 137559 97275
8064 97275 28604 -28283 36102 158530 181332 151024 139695 176753 88196 28149 -37249 -45906
$$ packed form
8147G5286n4303R086N8929P9456J1395K0050l9254n7061J9027m3431l0958P2912
8135A21134J86074j3327k19773q3163J1603Q6202J22794M8191j7290O7348M1499
8124C51292j8796J5863p3426q0587j8250q4941n1N7847j0043o9419p2042P9928
8112G7375m609j4611K5706j515n1031P5948J15058q3o699J7359n518o7802Q32
8099A60410M7172j9093n4302O6470l1955p398Q164K2037M2186m450j4291O9705
8087B84655r3954j08300L2714M9068L5011k7669l3686o3373o4771M6269m0709
8076A5255k4622j3233N8639n7534J0493L2335M8589P8931j0221K0812k1885m0284
8064I7275o8671n6887O4385J22428K2802l0308j1329L7058q8557o0047o5398q657
$$ plain form
8052 -45906 -93897 -33462 -7690 13426 47479 43557 -64166 -37974 49856 97701 102297 80659
8040 80659 86269 24430 46910 93643 91726 83069 127623 152720 99109 51060 124711 174810
8028 174810 120359 173042 105234 44547 81893 102052 -10678 -96245 -8862 82291 31268
8017 31268 34976 123587 80506 -56134 -121932 -124979 -74426 6938 14060 114170 74126 -65656
8005 -65656 -59441 -32774 52240 -8837 26593 55007 91120 113321 76741 46881 63849 118960
7993 118960 170447 236450 154575 80494 36804 -83484 -58111 -16273 37091 91573 56349
7982 56349 60067 47431 33409 -14038 -22897 88805 70018 -160109 -216293 -166791 -89344 -4913
7970 -4913 20155 128182 139952 86912 10519 -37697 -79071 -91524 -82799 -14673 20550 69202
$$ packed form
8052d5906m7991O0435K5772K1116L4053l922j07723K6192Q7830M7845M596k1638
8040H0659N610o1839K2480M6733j917q657M4554K5097n3611m8049P3651N0099
8028A74810n4451N2683o7808o0687L7346K0159j12730q5567Q7383R1153n1023
8017C1268L708Q8611m3081j36640o5798l047N0553Q1364P122J00110m0044j39782
8005f5656O215K6667Q5014o1077L5430K8414L6113K2201l6580k9860J6968N5111
7993A18960N1487O6003q1875p4081m3690j20288K5373M1838N3364N4482l5224
7982E6349L718j2636j4022m7447q859J11702j8787k30127n6184M9502P7447Q4431
7970d913K5068J08027J1770n3040p6393m8216m1374j2453Q725O8126L5223M8652
$$ plain form
7958 69202 68440 -8175 -24739 -80804 -37287 77596 77422 94144 74448 30289 22725 58515 -26685
7945 -26685 -146403 -129589 -92234 38235 80106 126219 111661 29999 1796 35056 34914 -29099
7933 -29099 14800 60172 13264 -51005 -35976 -94882 -129083 -163249 -255704 -251173 -270201 -242505
7921 -242505 -205049 -259260 -275448 -305211 -239650 -196503 -131966 -77626 -90016 -16747 11380 27994
7909 27994 50224 59423 53424 74658 71860 11095 5304 -52883 -76673 -100598 -14327 83496 154868
7896 154868 165553 215559 123443 163058 238357 150006 27992 -6646 -63560 10337 27266
7885 27266 -844 26882 42177 123159 161296 148508 87990 101765 62922 -25174 -80193 -151926
7873 -151926 -166811 -116545 -96137 46728 118219 112584 61998 85737 128121 233095 167195
$$ packed form
7958F9202p62p6615j6564n6065M3517J14883j74J6722j9696m4159p564L5790q5200
7945b6685j19718J6814L7355J30469M1871M6113j4558q1662k8203L3260j42o4013
7933b9099M3899M5372m6908o4269J5029n8906l4201l4166r2455M531j9028K7696
7921b42505L7456n4211j6188k9763O5561M3147O4537N4340j2390P3269K8127J6614
7909B7994K2230R199n999K1234k798o0765n791n8187k3790k3925Q6271R7823P1372
7896A54868J0685N0006r2116L9615P5299q8351j22014l4638n6914P3897J6929
7885B7266k8110K7726J5295Q0982L8137j2788o0518J3775l8843q8096n5019p1733
7873a51926j4885N0266K0408J42865P1491n635n0586K3739M2384J04974o5900
$$ plain form
7862 167195 37724 -22314 -32872 -67820 -125333 -151044 -85473 -24370 32641 135219 199520
7851 199520 133460 5464 -11548 -17934 -95319 -159226 -161339 -179716 -220449 -106110 -88522 -96201
7839 -96201 -99017 -40500 80062 157884 98588 -49434 -870 75271 87535 29290 -44355 -23041
7827 -23041 -100465 -175416 -80634 -44979 -66697 -81374 -93379 -110991 16176 34873 7014 64368
7815 64368 129056 -7180 -74507 9914 -40472 -76802 -57369 -139069 -182390 -176659 -179645 -88182
7803 -88182 -16130 -29738 -2036 67453 38014 -1021 14655 -90140 -159714 -60408 1829 -106102
7791 -106102 -178008 -108987 -84791 -99543 -104204 -85372 -43201 -51197 -16939 53527 141339 156384
7779 156384 124221 139906 15483 -38028 -119359 -160064 -100487 -26928 1510 61410 83826
$$ packed form
7862A67195j29471o0038j0558l4948n7513k5711O5571O1103N7011J02578O4301
7851A99520o6060j27996j7012o386p7385o3907k113j8377m0733J14339J7588p679
7839i6201k816N8517J20562P7822n9296j48022M8564P6141J2264n8245p3645K1314
7827b3041p7424p4951R4782L5655k1718j4677j2005j7612J27167J8697k7859N7354
7815F4368O4688j36236o7327Q4421n0386l6330J9433q1700m3321N731k986R1463
7803h8182P2052j3608K7702O9489k9439l9035J5676j04795o9574R9306O2237j07931
7791a06102p1906O9021K4196j4752m661J8832M2171p996L4258P0466Q7812J5045
7779A56384l2163J5685j24423n3511q1331m0705N9577P3559K8438N9900K2416
$$ plain form
7768 83826 52702 -3606 63978 24776 -19539 31360 79838 104597 -9073 -73621 -136818 -113312
7756 -113312 73073 67506 -77366 -144778 -224777 -241798 -163779 -192835 -198890 -109162 -108120 -82668
7744 -82668 -132568 -134011 -144916 -87764 62018 135215 88968 75995 120488 186358 258076 117118
7732 117118 52596 -22810 -67559 -2235 -38481 -92076 -79168 15395 45585 43536 57083 135263
7720 135263 76991 26458 1147 -11876 30818 78703 65809 12047 -15373 204 -74435 -43060
7708 -43060 35811 52388 -57199 -146064 -63847 -48379 -38333 28395 16422 30084 73439 85792
7696 85792 114000 -8874 -22198 -21482 -100562 -79777 24675 115810 110389 171869 174734 171006
7684 171006 170548 199701 159747 55597 21401 55393 7296 8796 26935 76664 102487 111160
$$ packed form
7768H3826l1124n6308O7584l9202m4315N0899M8478K4759j13670o4548o3197K3506
7756a13312J86385n567j44872o7412p9999j7021P8019k9056o055Q9728J042K5452
7744h2668m9900j443j0905N7152J49782P3197m6247j2973M4493O5870P1718j40958
7732A17118o4522p5406m4749O5324l6246n3595J2908R4563L0190k049J3547P8180
7720A35263n8272n0533k5311j3023M2694M7885j2894n3762k7420J5577p4639L1375
7708d3060P8871J6577j09587q8865Q2217J5468J0046O6728j1973J3662M3355J2353
7696H5792K8208j22874j3324P16p9080K0785J04452R1135n421O1480K865l728
7684A71006m58K9153l9954j04150l4196L3992m8097J500J8139M9729K5823Q673
$$ plain form
7672 111160 88204 41340 -18775 -43782 -57864 -257218 -211589 -128346 -137943 -60393 -36928 15449
7660 15449 -70071 -121538 -331 54146 64481 -26932 -32868 -8510 -14087 -24782 6636 98913
7648 98913 107356 90233 59106 26289 -10448 -81216 -64278 -24370 -53991 -153207 -80105 -62757
7636 -62757 -69133 28698 27620 -8456 86066 187922 168262 124054 70576 37240 22946 48082
7624 48082 113114 170924 196620 130802 -21927 -71277 -70087 -61473 -95508 -124355 -126152 -64321
7612 -64321 -20529 70691 84400 39144 60722 147670 134496 36252 25072 -25073 -38998 -18150
7600 -18150 13531 96249 64828 22383 43964 8277 -32958 -72015 20506 170746 190780 183677
7588 183677 153313 117226 105327 133044 124446 225938 302297 301036 212416 79267 -47746
$$ packed form
7672A11160k2956m6864o0115k5007j4082j99354M5629Q3243r597P7550K3465N2377
7660A5449q5520n1467J21207N4477J0335r1413n936K4358n577j0695L1418R2277
7648I8913Q443j7123l1127l2817l6737p0768J6938L9908k9621r9216P3102J7348
7636f2757o376R7831j078l6076R4522J01856j9660m4208n3478l3336j4294K5136
7624D8082O5032N7810K5696o5818j52729m9350J190Q614l4035k8847j797O1831
7612f4321M3792R1220J3709m5256K1578Q6948j3174r8244j1180n0145j3925K0848
7600a8150L1681Q2718l1421m2445K1581l5687m1235l9057R2521J50240K0034p103
7588A83677l0364l6087j1899K7717q598J01492P6359j261q8620j33149j27013
$$ plain form
7577 -47746 -164812 -152526 -83348 -39421 30715 72521 5404 -123537 -157090 -125896 -167494
7566 -167494 -167582 -203539 -71091 -44755 -136856 -172127 -163527 -97493 -67689 -41689 -20693 -18360
7554 -18360 35486 69902 83442 74695 68440 24964 -77364 -104849 -124985 -77364 -30051 -33606
7542 -33606 -40129 -3059 100329 174743 188290 152679 134300 126075 54188 -90387 -166543 -57270
7530 -57270 -8283 -70929 -42187 -63001 -72550 818 28466 -43257 -122134 -100058 -184067 -225221
7518 -225221 -143075 -46737 83660 182339 157745 138075 107296 96534 105850 212752 199366
7507 199366 126742 92418 75180 202482 188127 152712 227563 324130 378214 274358 214764
7496 214764 187059 94996 19587 46790 -37549 -72279 -43634 -122917 -78629 -72073 -57936 -8109
$$ packed form
7577d7746j17066J2286O9178M3927P0136M1806o7117j28941l3553L1194m1598
7566a67494q8l5957J32448K6336r2101l5271Q600O6034K9804K6000K0996K333
7554a8360N3846L4416J3540q747o255m3476j02328k7485k0136M7621M7313l555
7542c3606o523L7070J03388P4414J3547l5611j8379q225p1887j44575p6156J09273
7530e7270M8987o2646K8742k0814r549P3368K7648p1723p8877K2076q4009m1154
7518b25221Q2146R6338J30397R8679k4594j9670l0779j0762R316J06902j3386
7507A99366p2624l4324j7238J27302j4355l5415P4851R6567N4084j03856n9594
7496B14764k7705r2063p5409K7203q4339l4730K8645p9283M4288O556J4137M9827
$$ plain form
7484 -8109 18661 -52413 -121428 -97366 -48351 13104 -4257 -17021 -36286 -95904 -138057 -48099
7472 -48099 -26477 131524 152295 146465 119683 48184 37784 93789 7977 -105538 -164957 -116329
7460 -116329 -19661 44371 87073 87934 34038 32197 33655 32810 -15631 -1726 -101317 -95633 -102209
7447 -102209 -45315 62338 76685 15298 -48856 -95782 -49239 -14655 -40517 -57508 -76965
7436 -76965 -40419 5420 19996 49530 80045 70877 51249 77797 71658 2517 -115936 -95550
7424 -95550 -125043 -92588 -146674 -127046 -59706 7686 -121184 -184103 -93328 -47916 -42172 -128911
7412 -128911 -108292 -66505 -120451 -112878 -28711 15487 -43447 -82557 101154 43330 4375 62255
7400 62255 203245 162005 -12145 -44850 -96537 -118762 -117708 -67003 -29521 8523 17910 -59090
$$ packed form
7484h109K6770p1074o9015K4062M9015O1455j7361j2764j9265n9618m2153Q9958
7472d8099K1622J58001K0771n830k6782p1499j0400N6005q5812j13515n9419M8628
7460a16329R6668O4032M2702Q61n3896j841J458q45m8441J3905r9591N684o576
7447a02209N6894J07653J4347o1387o4154m6926M6543L4584k5862j6991j9457
7436g6965L6546M5839J4576K9534L0515r168j9628K6548o139o9141j18453K0386
7424i5550k9493L2455n4086J9628O7340O7392j28870o2919R0775M5412N744q6739
7412a28911K0619M1787n3946P573Q4167M4198n8934l9110J83711n7824l8955N7880
7400F2255J40990m1240j74150l2705n1687k2225J054N0705L7482L8044R387p7000
$$ plain form
7388 -59090 4686 25249 86959 95691 166301 54037 -32158 -107047 -103861 -71267 -47655 -40060
7376 -40060 -11366 -13919 -47011 -48171 -16640 17083 35105 -9164 -68265 -114575 -48569 -19998
7364 -19998 -107749 -121235 -176020 -79758 -83290 -115632 -226906 -281529 -265042 -255749 -255526 -191075
7352 -191075 -55951 3023 -50414 -46474 -75268 -148155 -148607 -44731 -49919 -93343 -36511 98062
7340 98062 195114 18847 -154543 -145137 -139706 -94247 -9219 -65661 -68729 -162903 -166680 -105567
7328 -105567 -25606 20768 15790 -57297 -129556 -105166 -22297 -73992 -110867 -137362 -118833 -216091
7316 -216091 -230048 -275671 -209053 -152677 -212704 -236937 -203501 -125132 -40810 14458 826 48322
7304 48322 104623 166319 122246 43914 57125 68548 54782 139089 160821 96637 -39177 -96510
$$ packed form
7388e9090O3776K0563O1710Q732P0610j12264q6195p4889L186L2594K3612P595
7376d0060K8694k553l3092j160L1531L3723J8022m4269n9101m6310O6006K8571
7364a9998q7751j3486n4785R6262l532l2342j11274n4623J6487R293K23O4451
7352a91075J35124N8974n3437L940k8794p2887m52J03876n188m3424N6832J34573
7340I8062R7052j76267j73390R406N431M5459Q5028n6442l068r4174l777O1113
7328a05567P9961M6374m978p3087p2259K4390Q2869n1695l6875k6495J8529r7258
7316b16091j3957m5623O6618N6376o0027k4233L3436P8369Q4322N5268j3632M7496
7304D8322N6301O1696m4073p8332J3211J1423j3766Q4307K1732o4184j35814n7333
$$ plain form
7292 -96510 -23352 38180 -9198 -141612 -238355 -132842 -98261 -133986 -98889 -115169 -126812
7281 -126812 -135395 -148379 -115636 2542 -6131 -14597 25828 -26888 -187816 -191652 -39323 41797
7269 41797 40298 31197 8990 -56838 -31230 -25347 976 -23910 -61226 -31449 -41327 -36474 -47326
7256 -47326 -169370 -185527 -40733 -145549 -254681 -243336 -220269 -183206 -122509 -176004 -193223
7245 -193223 -179014 -78240 -136314 -217244 -193292 -175022 -93003 -37651 -156108 -198742 -121302
7234 -121302 -67767 -23074 -78047 -153440 -259429 -272376 -246223 -208953 -156299 -8218 67193
7223 67193 31067 -82812 -58865 -80093 -60277 -47820 -60278 -110847 -108415 -63989 -26570 -56316
7211 -56316 -81877 -62368 -53928 13435 13738 -103325 -121411 -53534 -124585 -103991 -28759 -41234
$$ packed form
7292i6510P3158O1532m7378j32414r6743J05513L4581l5725L5097j6280j1643
7281a26812q583j2984L2743J18178q673q466M0425n2716j60928l836J52329Q1120
7269D1797j499r101k2207o5828K5608N883K6323k4886l7316K9777r878M853j0852
7256d7326j22044j6157J44794j04816j09132J1345K3067L7063O0697n3495j7219
7245a93223J4209J00774n8074q0930K3952J8270Q2019N5352j18457m2634P7440
7234a21302N3535M4693n4973p5393j05989j2947K6153L7270N2654J48081P5411
7223F7193l6126j13879K3947k1228J9816J2457j2458n0569K432M4426L7419k9746
7211e6316k5561J9509Q440O7363L03j17063j8086O7877p1051K0594P5232j2475
$$ plain form
7199 -41234 -122768 -111738 -51005 -23311 -76769 -99487 -89813 -79103 -46462 -98893 -109450 -66780
7187 -66780 -38827 54466 53867 2199 -15607 61061 220205 162639 86396 42574 18556 -61245
7175 -61245 -16646 -43864 -41932 -74250 -63741 -11384 -58239 -81144 -51167 -26278 26173 51764
7163 51764 -51803 -128561 -151976 -83377 2680 9910 44372 -23369 -54376 -169346 -84769 -53995
7151 -53995 -78422 -36223 -58961 -135512 -93431 -59235 -47395 38308 123305 105650 36993 11280
7139 11280 -75548 -18974 -95467 -162790 -164237 -122095 -129946 -107298 -107345 -21047 69784 87928 103431
7126 103431 94118 45268 56349 65919 45787 -54381 -147767 -144322 -113370 -121890 -74666 -112175
7114 -112175 -154594 -100090 -172638 -306669 -335884 -127140 58159 101570 -1540 32773 21815
$$ packed form
7199d1234q1534J1030O0733K7694n3458k2718R674J0710L2641n2431j0557M2670
7187f6780K7953R3293n99n1668j7806P6668J59144n7566p6243m3822k4018p9801
7175f1245M4599k7218J932l2318J0509N2357m6855k2905K9977K4889N2451K5591
7163E1764j03567p6758k3415O8599Q6057P230L4462o7741l1007j14970Q4577L0774
7151e3995k4427M2199k2738p6551M2081L4196J1840Q5703Q4997j7655o8657k5713
7139A1280q6828N6574p6493o7323j447M2142p851K2648m7Q6298R0831J8144J5503
7126A03431r313m8850J1081R570k0132j00168r3386L445L0952q520M7224l7509
7114a12175m2419N4504p2548j34031k9215K08744J85299M3411j03110L4313j0958
$$ plain form
7103 21815 -98376 -161125 -169687 -124551 -22634 -15672 -65991 -53600 -128311 -70316 37555 46404
7091 46404 -15828 -170473 -187526 -105907 -21295 44086 27652 -12780 -134453 -194920 -272840
7080 -272840 -280491 -284476 -240999 -182189 -173584 -154794 -49751 -37250 -168009 -160680 -87899 -59491
7068 -59491 -70753 -98965 -232725 -235593 -208184 -247021 -138561 -103268 -161285 -197407 -191196 -170511
7056 -170511 -190561 -157845 -118353 -188124 -213090 -190697 -181205 -95064 -31434 -78278 -230865 -334147
7044 -334147 -251787 -122939 -104961 -104772 -46296 -42692 -199226 -289209 -301263 -176018 -84182 -159065
7032 -159065 -126093 -134920 -135159 -160791 -95088 -76799 -65433 40004 14642 33155 -2661 -50861
7020 -50861 -52317 -32270 -95141 -116140 -130925 -60510 -43892 -79120 -56931 -33862 -53643 -21072
$$ packed form
7103B1815j20191o2749q562M5136J01917O962n0319J2391p4711N7995J07871Q849
7091D6404o2232j54645j7053Q1619Q4612O5381j6434m0432j21673o0467p7920
7080b72840p651l985M3477N8810Q605J8790J05043J2501j30759P329P2781K8408
7068e9491j1262k8212j33760k868K7409l8837J08460L5293n8017l6122O211K0685
7056a70511k0050L2716L9492o9771k4966K2393R492Q6141O3630m6844j52587j03282
7044c34147Q2360J28848J7978J89N8476L604j56534q9983j2054J25245R1836p4883
7032a59065L2972q827k39k5632O5703J8289J1366J05437k5362J8513l5816m8200
7020e0861j456K0047o2871k0999j4785P0415J6618l5228K2189K3069j9781L2571
$$ plain form
7008 -21072 20799 -47825 -44730 58122 63717 17700 -16391 11149 77898 87677 63896 110802
6996 110802 180870 233367 105091 -67669 -93496 -17294 32496 29298 -108318 -114572 -123072 -156153
6984 -156153 -74281 -96675 -78554 -34755 -57259 -39171 -16061 78641 87036 10751 -72128 -129613
6972 -129613 -64113 -45641 -120141 -72169 -90125 -72105 19807 -94848 -184695 -140261 -101794
6961 -101794 -130200 -105491 -181072 -162417 -172731 -231175 -283145 -374606 -363863 -359599 -385432 -318947
6949 -318947 -244611 -219890 -187337 -162528 -153044 -152365 -99055 -140821 -163479 -107841 -59399 -10246
6937 -10246 3124 24893 113903 115187 18935 -41388 -86830 -50870 -91811 -90459 1354 -25996
6925 -25996 -22655 -26188 -28254 -25226 -75596 -87902 -107579 -199731 -231169 -231618 -183642 -131578 -105145
$$ packed form
7008b1072M1871o8624L095J02852N595m6017l4091K7540O6749R779k3781M6906
6996A10802P0068N2497j28276j72760k5827P6202M9790l198j37616o254q500l3081
6984a56153Q1872k2394J8121M3799k2504J8088K3110R4702Q395p6285q2879n7485
6972a29613O5500J8472p4500M7972j7956J8020R1912j14655q9847M4434L8467
6961a01794k8406K4709p5581J8655j0314n8444n1970r1461J0743M264k5833O6485
6949c18947P4336K4721L2553K4809R484O79N3310m1766k2658N5638M8442M9153
6937a0246J3370K1769Q9010J284r6252o0323m5442L5960m0941J352R1813k7350
6925b5996L341l533k066L028n0370j2306j9677r2152l1438m49M7976N2064K6433
$$ plain form
6912 -105145 -90377 -62710 -73072 -171362 -183944 -56366 -27560 -20642 -17900 -66557 -70768 -50381
6900 -50381 -68226 -137398 -194516 -195941 -94773 19457 -28485 -104144 -135899 -212301 -158291 -89233
6888 -89233 -84245 -131848 -99467 -56767 -76972 22153 73912 51770 71974 51605 3864 -17548
6876 -17548 -31542 -180803 -165112 -7694 -47468 -37206 -3023 -28237 -119903 -198328 -181598
6865 -181598 -113758 -74985 -25787 -97043 -75282 -27422 -38544 -4771 99036 67212 13289
6854 13289 -59070 -142331 -140874 -48085 -74843 -117526 -80899 -99012 -177403 -241525 -194228 -152944
6842 -152944 -158210 -88842 -67107 -84154 247 57531 18970 -37945 -138472 -171016 -96885 -130718
6830 -130718 -176187 -127034 -89174 -141776 -40470 -130024 -203498 -239863 -244292 -225915 -190597 -55990
$$ packed form
6912a05145J4768K7667j0362r8290j2582J27578K8806O918K742m8657m211K0387
6900e0381j7845o9172n7118j425J01168J14230m7942p5659l1755p6402N4010O9058
6888h9233M988m7603L2381M2700k0205R9125N1759k2142K0204k0369m7741k1412
6876a7548j3994j49261J5691J57418l9774J0262L4183k5214r1666p8425J6730
6865a81598O7840L8773M9198p1256K1761M7860j1122L3773J03807l1824n3923
6854A3289p2359q3261J457R2789k6758m2683L6627j8113p8391o4122M7297M1284
6842a52944n266O9368K1735j7047Q4401N7284l8561n6915j00527l2544P4131l3833
6830a30718m5469M9153L7860n2602J01306q9554p3474l6365m429J8377L5318J34607
$$ plain form
6818 -55990 -27664 -146508 -198212 -81321 -85796 -45630 -27705 29691 109823 136491 47054 -6109
6806 -6109 -86889 -166507 -159406 -123509 -93096 5823 58780 -36406 -54014 46877 92677 56420
6794 56420 52028 34454 -2869 -66945 -113114 -140076 -65752 -92252 -89584 -134062 -292308 -258487
6782 -258487 -164790 -14343 -44975 -24046 -72424 -154457 -18410 -72689 -93267 -53726 -30235
6771 -30235 -77421 -161996 -101481 -51069 -29586 -28652 -33052 -117682 -200282 -178044 -111949 -42270
6759 -42270 35667 112952 37195 -54321 -40341 -24942 -83121 -89135 -81298 -65301 -89337 -72268
6747 -72268 -110542 -242975 -238772 -246006 -210950 -91844 -33908 -39738 -29470 -34485 109188 42777
6735 42777 -111131 -212972 -283780 -265973 -218457 -218456 -201227 -150969 -63238 -64438 -111284 -110023 -80443
$$ packed form
6818e5990K8326j18844n1704J16891m475M0166J7925N7396Q0132K6668q9437n3163
6806f109q0780p9618P101L5897L0413R8919N2957r5186j7608J00891M5800l6257
6794E6420m392j7574l7323o4076m6169k6962P4324k6500K668m4478j58246L3821
6782b58487R3697J50447l0632K0929m8378q2033J36047n4279k0578L9541K3491
6771c0235m7186q4575O0515N0412K1483R34m400q4630q2600K2238O6095O9679
6759d2270P7937P7285p5757r1516J3980J5399n8179o014P837J5997k4036J7069
6747g2268l8274j32433M203p234L5056J19106N7936n830J0268n015J43673o6411
6735D2777j53908j01841p0808J7807M7516JJ7229N0258Q7731j200m6846J261K9580
$$ plain form
6722 -80443 -111544 -142721 -109725 -50370 133221 129913 75755 44820 3251 -90047 -136883 -194866
6710 -194866 -245812 -325999 -324832 -201901 -189614 -175725 -188157 -190288 -195105 -174586 -94550 29277
6698 29277 96344 182709 132178 45557 -3249 -106028 -187820 -187979 -219954 -209702 -166314 -120189
6686 -120189 -19195 10267 -19646 -181427 -166186 -97324 -108241 -157681 -152077 -98400 51679
6675 51679 178895 226938 116292 79840 93444 109086 40942 -66036 -68331 25327 16820 59497
6663 59497 67519 47311 -82999 -93716 -10531 24466 78511 77481 23492 101469 246168 338534
6651 338534 498601 681880 963561 1421269 1792768 1605933 1182463 939081 772059 813534
6641 813534 865424 987842 1058911 1180329 1357184 1821397 2463070 3260865 4318779 5732482
$$ packed form
6722h0443l1101l1177L2996N9355J83591l308n4158l0935m1569r3298m6836n7983
6710a94866n0946q0187J167J22931J2287J3889j2432k131m817K0519Q0036J23827
6698B9277O7067Q6365n0531q6621m8806j02779q1792j59l1975J0252M3388M6125
6686a20189J00994K9462k9913j61781J5241O8862j0917m9440N604N3677J50079
6675E1679J27216M8043j10646l6452J3604J5642o8144j06978k295R3658q507M2677
6663E9497Q022k0208j30310j0717Q3185L4997N4045j030n3989P7977J44699R2366
6651C38534J60067J83279K81681M57708L71499j86835m23470k43382j67022M1475
6641H13534N1890J22418P1069J21418J76855M64213O41673P97795J057914J413703
$$ plain form
6631 5732482 7965785 11903964 19017486 30980522 47597506 59689524 47787140 28544891
6623 28544891 17224909 11375048 8205223 6324962 4981709 4023747 3235538 2585412
6615 2585412 2077125 1662773 1497765 1391606 1265405 1214889 1271651 1289242 1395198 1679358
6605 1679358 1947099 1682969 1159922 830639 692786 644959 553603 437291 443975 405528
6595 405528 294512 165086 102675 146612 225198 278393 226730 209080 50377 38910 36603
6584 36603 37969 21428 16345 18289 78209 129776 117362 92018 72733 70446 46377 7855 -55910
6571 -55910 -127566 -95512 -81227 -145431 -151196 -152146 -186203 -216150 -94139 -11260 14831 -49998
6559 -49998 -26832 -84873 -90004 10584 -5144 -62195 -77022 14684 3812 10285 99877 177652
$$ packed form
6631E732482K233303L938179P113522J1963036J6616984J2092018j1902384j9242249
6623B8544891j1319982n849861l169825j880261j343253r57962p88209o50126
6615B585412n08287m14352j65008j06159j26201n0516N6762J7591J05956K84160
6605A679358K67741k64130n23047l29283j37853m7827r1356j16312O684l8447
6595D05528j11016j29426o2411M3937P8586N3195n1663j7650j58703j1467k307
6584C6603J366j6541n083J944N9920N1567j2414k5344j9285k287k4069l8522o3765
6571e5910p1656L2054J4285o4204n765r50l4057k9947J22011Q2879K6091o4829
6559d9998K3166n8041n131J00588j5728n7051j4827R1706j0872O473Q9592P7775
$$ plain form
6547 177652 86974 118147 -3288 -132743 -160663 -160439 -183289 -128108 -60465 11632 147989
6536 147989 161074 110102 135357 116367 88030 71951 93791 39796 11801 -29590 -7786 -113358
6524 -113358 -179360 -152564 -125800 -38771 -53747 -94599 -129083 -132285 -67578 -35616 -13866 -64650
6512 -64650 -116542 -92336 -102477 -166904 -150009 -163257 -138066 -174211 -144687 -119432 -156765 -246787
6500 -246787 -218720 -148062 -88810 -97620 -90663 -3696 77069 150529 41603 -139293 -179638 -52237
6488 -52237 -19796 25036 -16000 -86276 -144422 -184082 -219973 -151339 -88955 -113122 -11084 -29339
6476 -29339 -5206 86343 -58115 -140306 -120448 -193958 -222935 -168682 -132952 -103124 -46762 11062
6464 11062 -58338 -93033 -167113 -214955 -203218 -142070 -128808 -245527 -278642 -223516 -155625 -42760
$$ packed form
6547A77652r0678L1173j21435j29455k7920K24k2850N5181O7643P2097J36357
6536A47989J3085n0972K5255j8990k8337j6079K1840n3995k7995m1391K1804j05572
6524a13358o6002K6796K6764Q7029j4976m0852l4484l202O4707L1962K1750n0784
6512f4650n1892K4206j0141o4427J6895j3248K5191l6145K9524K5255l7333r0022
6500b46787K8067P0658N9252q810O957Q6967Q0765P3460j08926j80896m0345J27401
6488e2237L2441M4832m1036p0276n8146l9660l5891O8634O2384k4167J02038j8255
6476b9339K4133R1549j44458q2191J9858p3510k8977N4253L5730K9828N6362N7824
6464A1062o9400l4695p4080m7842J1737O1148J3262j16719l3115N5126O7891J12865
$$ plain form
6452 -42760 12475 -36526 11987 40519 99574 50952 20974 -60710 -77745 -1498 -5846 -24995
6440 -24995 -76976 -119532 -98286 -20331 43185 83129 -2295 -70114 -65163 -87873 -37640 -29323
6428 -29323 -50180 -133806 -71632 -80517 -132407 -79039 10421 -13467 1838 30735 5987 -32029
6416 -32029 -142094 -158231 -169622 -168809 -153487 -96452 -52258 9089 -815 83740 91782 107192
6404 107192 50908 69904 433 -29783 -33894 -12081 -19499 -30005 34556 -4558 -16208 -76137
6392 -76137 -141298 -105918 -157707 -188746 -182006 -225237 -240779 -182303 -181095 -63087 10467 -15402
6380 -15402 -64568 -98011 -91245 -56767 27757 53692 82951 63699 233 24988 -7766 -59081
6368 -59081 1378 44519 35864 15956 -87904 -178798 -115024 -26957 58524 50265 -9476 10048
$$ packed form
6452d2760N5235m9001M8513K8532N9055m8622k9978q1684j7035P6247m348j9149
6440b4995n1981m2556K1246P7955O3516L9944q5424o7819M951k2710N0233Q317
6428b9323k0857q3626O2174q885n1890N3368Q9460k3888J5305K8897k4748l8016
6416c2029j10065j6137j1391Q13J5322N7035M4194O1347r904Q4555Q042J5410
6404A07192n6284J8996o9471l0216m111K1813p418j0506O4561l9114j1650n9929
6392g6137o5161L5380n1789l1039O740m3231j5542N8476J208J18008P3554k5869
6380a5402m9166l3443O766L4478Q4524K5935K9259j9252o3466K4755l2754n1315
6368e9081O0459M3141q655j9908j03860r0894O3774Q8067Q5481q259n9741J9524
$$ plain form
6356 10048 -4985 -28545 53184 -3238 -115923 -113617 -74287 -124167 -126145 -69077 -6854 38409
6344 38409 3102 33135 13439 7426 -66599 65282 226262 240069 217939 141713 -15965
6333 -15965 -162850 -189121 -203884 -240713 -286898 -243607 -141363 -78147 20647 32451 -36929
6322 -36929 -9794 13639 -126900 -89142 -43072 -170250 -200599 -129983 -107212 -711 -41547
6311 -41547 -52889 -49855 -92910 -153045 -173703 -198595 -137337 -147479 -191870 -158742 -63304 -12799
6299 -12799 -8111 -110839 -200318 -142716 -136479 -77628 -34625 -82087 39104 108490 153960 43257
6287 43257 38265 34356 3797 76767 63269 58774 47192 -13650 36121 63410 76714 64563
6275 64563 51017 -24450 -138849 -159178 -161602 -127986 -148704 -138253 -88332 -77555 -136479 -39301
$$ packed form
6356A0048j5033k3560Q1729n6422j12685K306L9330m9880j978N7068O2223M5263
6344C8409l5307L0033j9696o013p4025J31881J60980J3807k2130p6226j57678
6333a5965j46885k6271j4763l6829m6185M3291J02244O3216R8794J1804o9380
6322c6929K7135K3433j40539L7758M6070j27178l0349P0616K2771J06501m0836
6311d1547j1342L034m3055o0135k0658k4892O1258j0142m4391L3128R5438N0505
6299a2799M688j02728q9479N7602O237N8851M3003m7462J21191O9386M5470j10703
6287D3257m992l909l0559P2970j3498m495j1582o0842M9771K7289J3304j2151
6275F4563j3546p5467j14399k0329k424L3616k0718J0451M9921J0777n8924R7178
$$ plain form
6263 -39301 23764 -626 62569 88671 97741 190449 89191 7911 4437 13689 20881 166338
6251 166338 184338 139108 112365 37453 -21900 -95498 -165273 -200853 -133515 -124568 -120789 -147618
6239 -147618 -119771 -4580 -23283 -60874 -47041 -7899 -137894 -121239 -133373 -158277 -174768
6228 -174768 -161181 -94169 -85857 -57252 -95802 -138036 -128462 -150931 -33865 50140 74186 36732
6216 36732 9452 -69114 -116743 29260 115666 85956 12528 16063 5919 -108550 -120626 -47881
6204 -47881 18089 20039 -14776 -34240 27391 -369 -146093 -70779 -59650 -68956 -62974 -11536
6192 -11536 -30689 -93126 -73366 9247 -11367 -3310 -12478 -59734 -63699 -18573 108145 162482
6180 162482 174090 106930 130984 51634 -30591 -55 2081 50257 23184 -55447 -55181 -92873
$$ packed form
6263c9301O3065k4390O3195K6102R070R2708j01258q1280l474R252P192J45457
6251A66338J8000m5230k6743p4912n9353p3598o9775l5580O7338Q947L779k6829
6239a47618K7847J15191j8703l7591J3833L9142j29995J6655j2134k4904j6491
6228a74768J3587O7012Q312K8605l8550m2234R574k2469J17066Q4005K4046l7454
6216C6732k7280p8566m7629J46003Q6406k9710p3428L535j0144j14469j2076P2745
6204d7881O5970J950l4815j9464O1631k7760j45724P5314J1129r306N982N1438
6192a1536j9153o2437J9760Q2613k0614Q057r168m7256l965M5126J26718N4337
6180A62482J1608o7160K4054p9350q2225L0536K136M8176k7073p8631K66l7692
$$ plain form
6168 -92873 -97730 -183934 -199628 -77174 36167 -35616 -34283 -34635 -71436 -43443 -14948 -89801
6156 -89801 -184371 -177599 -88208 61929 94880 -25900 -80007 -21648 39701 67115 64366 51883
6144 51883 -17513 -49262 -23507 36531 77052 98363 39471 -9803 7721 18768 -28247 9132
6132 9132 -103341 -103060 -1454 54220 42718 7764 -20502 -60595 -84010 -149908 -170977 -176425
6120 -176425 -50452 12063 -88160 -43535 21288 -55334 -44375 -45907 1591 -88129 -129405
6109 -129405 -57816 -27182 -23954 -34183 -38555 -12616 -112050 -168131 -116129 -150125 -132960 -24605
6097 -24605 -4902 -89995 -173302 -159657 -115192 46770 82471 -64905 -131088 -155188 -198215
6086 -198215 -187047 -134967 4230 -18287 -142733 -179942 -108380 -143216 -233136 -296637 -267156
$$ packed form
6168i2873m857q6204j5694J22454J13341p1783J333l52l6801K7993K8495p4853
6156h9801r4570O772Q9391J50137L2951j20780n4107N8359O1349K7414k749j2483
6144E1883o9396l1749K5755O0038M0521K1311n8892m9274J7524J1047m7015L7379
6132I132j12473K81J01606N5674j1502l4954k8266m0093k3415o5898k1069n448
6120a76425J25973O2515j00223M4625O4823p6622J0959j532M7498q9720m1276
6109a29405P1589L0634L228j0229m372K5939r9434n6081N2002l3996J7165J08355
6097b4605J9703q5093q3307J3645M4465J61962L5701j47376o6183k4100m3027
6086a98215J1168N2080J39197k2517j24446l7209P1562l4836q9920o3501K9481
$$ plain form
6075 -267156 -148264 -139943 -133877 -63469 -26670 8934 58684 33686 -14818 -22142 -73295 -133327
6063 -133327 -39845 54564 102317 86875 25024 77252 163842 190279 106165 -27883 -152676
6052 -152676 -94297 -79424 -61443 -50485 73613 45010 -28513 -169257 -247221 -129235 -64063
6041 -64063 -142658 -182109 -150741 -146267 -180270 -153320 -67130 25168 63057 -14834 -82854 -106618
6029 -106618 -79645 -76800 -108721 -6072 48599 -13001 -39831 -4772 -96825 -173199 -148409 -149338
6017 -149338 -181148 -36024 14761 77574 101510 3865 24135 8102 -46546 -36523 -5362
6006 -5362 -60107 -146212 -45547 -48974 -97629 -140593 -150982 -122270 -211607 -131123 -22858 -29557
5994 -29557 -40111 -14193 12185 27854 -28656 -20087 -2854 47821 16458 6845 8557 44850
$$ packed form
6075b67156J18892Q321O066P0408L6799L5604M9750k4998m8504p324n1153o0032
6063a33327R3482R4409M7753j5442o1851N2228Q6590K6437q4114j34048j24793
6052a52676N8379J4873J7981J0958J24098k8603p3523j40744p7964J17986O5172
6041f4063p8595l9451L1368M474l4003K6950Q6190R2298L7889p7891o8020k3764
6029a06618K6973K845l1921J02649N4671o1600k6830L5059r2053p6374K4790r29
6017a49338l1810J45124N0785O2813K3936r7645K0270j6033n4648J0023L1161
6006e362n4745q6105J00665l427m8655m2964j0389K8712q9337Q0484J08265o699
5994b9557j0554K5918K6378J5669n6510Q569J7233N0675l1363r613J712L6293
$$ plain form
5982 44850 43878 -80556 -150896 -166899 -185781 -121274 -79752 -138314 -175984 -173824 -124145 -90349
5970 -90349 -107991 -114279 -64384 -45398 -74671 -134812 -29574 86839 82270 102650 4916 -90800
5958 -90800 -9217 -18713 -138661 -181810 -161541 -143068 -193583 -211264 -182768 -165549 -2424 61649
5946 61649 98661 149391 107026 43661 -52067 -75894 -47618 40672 84886 104726 101065 32745
5934 32745 -59739 -64892 -35138 -162462 -191096 -35888 42620 -12985 -35075 -112605 -181085 -199432
5922 -199432 -117398 13817 88675 34685 543 -22456 -78962 -27614 -27976 -64567 -125157 -47668
5910 -47668 19745 -7378 -5624 807 88597 138778 71189 -5231 40398 59263 39995 57357
5898 57357 7631 -111438 42026 102264 -46225 -213303 -306424 -159076 -183397 -130638 -63423
$$ packed form
5982D4850r72j24434p0340j6003j8882O4507M1522n8562l7670K160M9679L3796
5970i0349j7642o288M9895J8986k9273o0141J05238J16413m569K0380r7734r5716
5958i0800Q1583r496j19948m3149K0269J8473n0515j7681K8496J7219J63125O4073
5946F1649L7012N0730m2365o3365r5728k3827K8276Q8290M4214J9840l661o8320
5934C2745r2484n153K9754j27324k8634J55208P8508n5605k2090p7530o8480j8347
5922a99432Q2034J31215P4858n3990l4142k2999n6506N1348l62l6591o0590P7489
5910d7668O7413k7123J754O431Q7790N0181o7589p6420M5629J8865j9268J7362
5898E7357m9726j19069J53464O0238j48489j67078r3121J47348k4321N2759O7215
$$ plain form
5887 -63423 -26657 -8270 79923 62121 -14548 -71529 -91680 -64606 -55437 -153927 -205647 -134439
5875 -134439 -89394 16852 75292 18477 101613 147224 81502 -6579 -150912 -225929 -74091
5864 -74091 -48041 -84342 -31035 -37949 -20174 -142 42607 96711 185501 127327 -50972 -65175
5852 -65175 -24128 -4677 103490 99038 66075 409 -44870 -6423 4550 12926 -5599 91770
5840 91770 92198 117942 59584 74800 33517 -119486 -102359 -20189 -33388 -44033 -34368 -38646
5828 -38646 -25806 5413 -52229 -104110 -104381 -159663 -66172 -14792 21111 50339 39007 3378
5816 3378 -55725 -76655 -90476 -196354 -223162 -208474 -92172 13346 -10093 -113585 -164034
5805 -164034 -126817 -11699 22228 51811 -2848 -28867 19858 41114 10712 17579 118570
$$ packed form
5887f3423L6766J8387Q8193j7802p6669n6981k0151K7074R169r8490n1720P1208
5875a34439M5045J06246N8440n6815Q3136M5611o5722q8081j44333p5017J51838
5864g4091K6050l6301N3307o914J7775K0032M2749N4104Q8790n8174j78299j4203
5852f5175M1047J9451J08167m452l2963o5666m5279L8447J0973Q376j8525R7369
5840I1770M28K5744n8358J5216m1283j53003J7127Q2170j3199j0645R665m278
5828c8646J2840L1219n7642n1881k71n5282R3491N1380L5903K9228j1332l5629
5816C378n9103k0930j3821j05878k6808J4688J16302J05518k3439j03492n0449
5805a64034L7217J15118L3927K9583n4659k6019M8725K1256l0402O867J00991
$$ plain form
5794 118570 49732 57372 -37249 -52352 -75865 -178874 -155827 -3180 36032 -33577 -56806
5783 -56806 -156094 -227484 -122080 -133764 -266474 -317830 -299384 -249545 -233055 -173053 -224321
5772 -224321 -250039 -100639 29379 72185 -1377 -25002 49807 138522 71147 -56959 -15927
5761 -15927 -39023 -100079 -82354 -63532 -129887 -99051 -163915 -154844 -118718 -151660 -175026 -160872
5749 -160872 -219646 -234248 -146929 -58170 -48068 -63308 -51501 50070 133029 32925 -47356
5738 -47356 -80708 -108506 -81962 -44576 -116193 -92796 -93267 -18730 -79951 -94940 -35512 -80118
5726 -80118 -151723 -209314 -181480 -248015 -249524 -183966 -58872 65461 18571 63633 80812 -25511
5714 -25511 -43536 -30884 -85574 -174666 -169973 -88965 -40627 -31053 -84618 -46439 -33367 -29483
$$ packed form
5794A18570o8838P640r4621j5103k3513j03009K3047J52647L9212o9609k3229
5783e6806r9288p1390J05404j1684j32710n1356J8446M9839J6490O0002n1268
5772b24321k5718J49400J30018M2806p3562k3625P4809Q8715o7375j28106M1032
5761a5927k3096o1056J7725J8822o6355L0836o4864R071L6126l2942k3366J4154
5749a60872n8774j4602Q7319Q8759J0102j5240J1807J01571Q2959j00104q0281
5738d7356l3352k7798K6544L7386p1617K3397m71P4537o1221j4989N9428m4606
5726h0118p1605n7591K7834o6535j509O5558J25094J24333m6890M5062J7179j06323
5714b5511j8025J2652n4690q9092M693Q1008M8338R574n3565L8179J3072L884
$$ plain form
5702 -29483 20324 1154 5580 75603 37307 25076 -119342 -126267 -38772 69534 13167 -73561
5690 -73561 -71294 -23460 -23409 -39984 664 -16197 -82888 -45274 -33813 -19137 22838 25944 -33991
5677 -33991 -83495 -33826 62455 141214 187581 48726 30174 -484 -64375 -13924 125533
5666 125533 160366 108488 64653 18 -14207 -13547 21425 36714 67357 -39082 29911 104650
5654 104650 102079 -36202 -160004 -266071 -226342 -102862 -115618 -99159 -46947 -125340 -114102
5643 -114102 -146000 -115344 -12680 -17381 -45289 -63832 -219985 -189026 -152105 -195760 -146024
5632 -146024 -88778 -45768 -186850 -183547 -52530 -82335 -66293 -67801 -35804 -26132 -111810 -112780
5620 -112780 -39228 -36618 -69690 -84619 -108926 -43192 105708 68328 -33029 -20968 10003
$$ packed form
5702b9483M9807j9170M426P0023l8296j2231j44418o925Q7495J08306n6367q6728
5690g3561K267M7834N1j6575M0648j6861o6691L7614J1461J4676M1975L106n9935
5677c3991m9504M9669R6281P8759M6367j38855j8552l0658o3891N0451J39457
5666A25533L4833n1878m3835o4635j4225O60L4972J5289L0643j06439O8993P4739
5654A04650k571j38281j23802j06067L9729J23480j2756J6459N2212p8393J1238
5643a14102l1898L0656J02664m701k7908j8543j56153L0959L6921m3655M9736
5632a46024N7246M3010j41082L303J31017k9805J6042j508L1997R672q5678r70
5620a12780P3552K610l3072j4929k4307O5734J48900l7380j01357J2061L0971
$$ plain form
5609 10003 64007 60047 71868 44600 65460 14240 -19406 -36314 -2091 73463 47716 -35719
5597 -35719 31463 -49331 -134943 -137678 -91731 29373 65135 91037 154059 155656 117999 13535
5585 13535 -39004 -5624 4045 -74257 -158961 -136722 -149707 -174720 -183859 -183947 -14716 78111 65980
5572 65980 118954 61914 -47181 -56060 -19811 -28332 -33526 26630 27900 56998 47879 90309 45318
5559 45318 -46255 -46830 16177 10738 49715 61297 71854 31929 -26995 -79220 -46912 -140598
5547 -140598 -166430 -119718 -64607 -63816 -83469 -41541 20870 125702 84746 79478 71348 -2151
5535 -2151 -138213 -81765 -44607 -102334 -92750 28479 16158 -97496 -123697 -99633 -36847 -83409
5523 -83409 -76342 39062 42462 -63402 7874 -49985 -95628 -21157 43649 89049 65803 58530
$$ packed form
5609A0003N4004l960J1821k7268K0860n1220l3646j6908L4223P5554k5747q3435
5597c5719O7182q0794q5612k735M5947J21104L5762K5902O3022J597l7657j04464
5585A3535n2539L3380R669p8302q4704K2239j2985k5013r139q8J69231R2827j2131
5572F5980N2974n7040j09095q879L6249q521n194O0156J270K9098r119M2430m4991
5559D5318r1573n75O3007n439L8977J1582J0557l9925n8924n2225L2308r3686
5547a40598k5832M6712N5111P91j9653M1928O2411J04832m0956n268q130p3499
5535b151j36062N6448L7158n7727R584J21229j2321j13654k6201K4064O2786m6562
5523h3409P067J15404L400j05864P1276n7859m5643P4471O4806M5400k3246p273
$$ plain form
5511 58530 45033 35281 -12009 -72951 -29553 46101 68938 316 -30812 7483 -55323 -90906
5499 -90906 -60089 22522 85871 -1447 68645 60659 -43474 -104168 -172175 -109316 -15531 -39932
5487 -39932 -195374 -220065 -162433 -151794 -253439 -226798 -205183 -193952 -73629 9363 30319
5476 30319 69431 13443 37543 47987 113239 184692 80869 -52089 -155386 -159937 -80471
$$ packed form
5511E8530j3497r752m7290o0942M3398P5654K2837o8622l1128L8295o2806l5583
5499i0906L0817Q2611O3349q7318P0092p986j04133o0694o8007O2859R3785k4401
5487c9932j55442k4691N7632J0639j01645K6641K1615J1231J20323Q2992K0956
5476C0319L9112n5988K4100J0444O5252P1453j03823j32958j03297m551P9466
$$ [...]
##END NTUPLES=NMR SPECTRUM
##END=
