##TITLE=Analysis number 329892
Compound Code cc 15501
Project Code adrs
Chemist Name stores
##JCAMPDX= 6.0         $$ Bruker NMR JCAMP-DX V2.0
##DATA TYPE= NMR SPECTRUM
##DATA CLASS= NTUPLES
##ORIGIN= Bruker BioSpin GmbH
##OWNER= nmr
$$ XWIN-NMR		Version 3.5
$$ Tue Oct  9 16:23:11 2007 GMT Daylight Time (UT+1h)  MAYBRIDGE\nmr@NMR_250MHZ
##.OBSERVE FREQUENCY= 250.131544655141
##.OBSERVE NUCLEUS= ^1H
##.ACQUISITION MODE= SIMULTANEOUS (DQD)
##.ACQUISITION SCHEME= undefined
##.AVERAGES= 16
##.DIGITISER RES= 18
##SPECTROMETER/DATA SYSTEM= dpx250
##.PULSE SEQUENCE= zg30
##.SOLVENT NAME= DMSO
##.SHIFT REFERENCE= (INTERNAL, DMSO, 0, 16.5116)
##AUDIT TRAIL= $$ (NUMBER, WHEN, WHO, WHERE, WHAT)
$$ ##TITLE= Audit trail, XWIN-NMR		Version 3.5
$$ ##JCAMPDX= 5.01
$$ ##ORIGIN= Bruker BioSpin GmbH
$$ ##OWNER= nmr
$$ C:\u/data/dgb/nmr/ADRS/460/pdata/1/auditp.txt
$$ ##AUDIT TRAIL=  $$ (NUMBER, WHEN, WHO, WHERE, WHAT)
(   1,<2007-10-09 16:22:49.22 +100>,<MAYBRIDGE\nmr>,<NMR_250MHZ>,
      <created by zg, POWCHK disabled, PULCHK disabled
       configuration hash MD5:
       76 6E 9A 78 1E 09 19 81 EC 84 63 8F B0 6A 59 2D
       data hash MD5: 64K
       E6 40 5B 1F 95 94 3C 62 10 2D F4 C5 E8 1B 91 0B>)
(   2,<2007-10-09 16:23:02.65 +100>,<MAYBRIDGE\nmr>,<NMR_250MHZ>,
      <Start of raw data processing
       ef LB = 0.3 FT_mod = 6 PKNL = 1 SI = 32K 
       data hash MD5: 32K
       4B 7C 46 C2 95 5E E5 D7 F1 6A FD 82 49 E4 5E 8F>)
(   3,<2007-10-09 16:23:04.31 +100>,<MAYBRIDGE\nmr>,<NMR_250MHZ>,
      <apk 
       data hash MD5: 32K
       2B 41 E3 38 99 FD CE 29 8A A3 86 60 B1 BA 85 05>)
(   4,<2007-10-09 16:23:05.01 +100>,<MAYBRIDGE\nmr>,<NMR_250MHZ>,
      <abs ABSG = 5 
       data hash MD5: 32K
       8B 65 01 7D 4B 75 AB BF 84 E6 79 60 E1 7F C2 46>)
$$ ##END=
$$ 
$$ hash MD5
$$ 03 25 87 8B 82 71 00 0B 94 A8 4F 8E 84 07 DB 1B
##$RELAX= 
##$RELAX= 
##$RELAX= 
##$RELAX= 
##$RELAX= 
##$RELAX= 
##$RELAX= 
$$ Bruker specific parameters
$$ --------------------------
##$DU= <C:\u>
##$EXPNO= 460
##$NAME= <ADRS>
##$PROCNO= 1
##$TYPE= <nmr>
##$USER= <dgb>
##$AMP= (0..31)
100 100 100 100 100 100 100 100 100 100 100 100 100 100 100 100 100 100 
100 100 100 100 100 100 100 100 100 100 100 100 100 100 
##$AQSEQ= 0
##$AQ_mod= 3
##$AUNM= <au_zg>
##$AUTOPOS= <56 >
##$BF1= 250.13
##$BF2= 250.13
##$BF3= 250.13
##$BF4= 250.13
##$BF5= 500.13
##$BF6= 500.13
##$BF7= 500.13
##$BF8= 500.13
##$BYTORDA= 1
##$CFDGTYP= 0
##$CFRGTYP= 5
##$CHEMSTR= <none>
##$CNST= (0..31)
1 1 145 1 1 1 1 1 1 1 1 1 1 1 1 1 1 1 1 1 1 1 1 1 1 1 1 1 1 1 1 1 
##$CPDPRG= <>
##$CPDPRG1= <>
##$CPDPRG2= <>
##$CPDPRG3= <>
##$CPDPRG4= <mlev>
##$CPDPRG5= <mlev>
##$CPDPRG6= <mlev>
##$CPDPRG7= <mlev>
##$CPDPRG8= <mlev>
##$CPDPRGB= <>
##$CPDPRGT= <>
##$D= (0..31)
0 1 0 0 0 0 0 0 0 0.06 0 0 0 0 0 0 0.0002 0 0 0 0 0 0 0 0 0 0 0 0 0 0 
0 
##$DATE= 1191943367
##$DBL= (0..7)
120 120 120 120 120 120 120 120 
##$DBP= (0..7)
150 150 150 150 150 150 150 150 
##$DBP07= 0
##$DBPNAM0= <>
##$DBPNAM1= <>
##$DBPNAM2= <>
##$DBPNAM3= <>
$$ [...]
##$SUBNAM7= <"">
##$SUBNAM8= <"">
##$SUBNAM9= <"">
##$SW= 20.6930455092707
##$SWIBOX= (0..15)
0 0 3 0 0 0 0 0 0 0 0 0 0 0 0 0 
##$SW_h= 5175.983436853
##$TD= 65536
##$TD0= 1
##$TE= 296.16
##$TE2= 300
##$TE3= 300
##$TEG= 300
##$TL= (0..7)
0 120 120 120 120 120 120 120 
##$TP= (0..7)
150 150 150 150 150 150 150 150 
##$TP07= 0
##$TPNAME0= <>
##$TPNAME1= <>
##$TPNAME2= <>
##$TPNAME3= <>
##$TPNAME4= <>
##$TPNAME5= <>
##$TPNAME6= <>
##$TPNAME7= <>
##$TPOAL= (0..7)
0.5 0.5 0.5 0.5 0.5 0.5 0.5 0.5 
##$TPOFFS= (0..7)
0 0 0 0 0 0 0 0 
##$TUNHIN= 0
##$TUNHOUT= 0
##$TUNXOUT= 0
##$USERA1= <user>
##$USERA2= <user>
##$USERA3= <user>
##$USERA4= <user>
##$USERA5= <user>
##$V9= 5
##$VALIST= <valist>
##$VCLIST= <CCCCCCCCCCCCCCC>
##$VD= 0
##$VDLIST= <DDDDDDDDDDDDDDD>
##$VPLIST= <PPPPPPPPPPPPPPP>
##$VTLIST= <TTTTTTTTTTTTTTT>
##$WBST= 1024
##$WBSW= 4
##$XGAIN= (0..3)
0 0 0 0 
##$XL= 0
##$YL= 0
##$YMAX_a= 353883
##$YMIN_a= -444418
##$ZGOPTNS= <>
##$ZL1= 120
##$ZL2= 120
##$ZL3= 120
##$ZL4= 120
##$ABSF1= 16.51157
##$ABSF2= -4.181602
##$ABSG= 5
##$ABSL= 3
##$ALPHA= 0
##$AQORDER= 0
##$ASSFAC= 0
##$ASSFACI= 0
##$ASSFACX= 0
##$ASSWID= 0
##$AUNMP= <proc_1d>
##$AZFE= 0.1
##$AZFW= 0.1
##$BCFW= 0
##$BC_mod= 0
##$BYTORDP= 0
##$COROFFS= 0
##$CY= 12.5
##$DATMOD= 1
##$DC= 0
##$DFILT= <>
##$DTYPP= 0
##$F1P= 14.0000005364418
##$F2P= -0.99999901652339
##$FCOR= 0.5
##$FTSIZE= 32768
##$FT_mod= 6
##$GAMMA= 0
##$GB= 0
##$INTBC= 1
##$INTSCL= 1
##$ISEN= 128
##$LB= 0.3
##$LEV0= 0
##$LPBIN= 0
##$MAXI= 10000
##$MC2= 0
##$MEAN= 0
##$ME_mod= 0
##$MI= 0
##$NCOEF= 0
##$NC_proc= -3
##$NLEV= 6
##$NOISF1= 0
##$NOISF2= 0
##$NSP= 0
##$NTH_PI= 0
##$NZP= 0
##$OFFSET= 16.51157
##$PC= 1
##$PHC0= 145.6408
##$PHC1= 4.548708
##$PH_mod= 1
##$PKNL= yes
##$PPARMOD= 0
##$PSCAL= 4
##$PSIGN= 0
##$REVERSE= no
##$SF= 250.13000260759
##$SI= 32768
##$SIGF1= 0
##$SIGF2= 0
##$SINO= 400
##$SIOLD= 32768
##$SREGLST= <1H.DMSO>
##$SSB= 0
##$STSI= 32768
##$STSR= 0
##$SW_p= 5175.98343685301
##$SYMM= 0
##$S_DEV= 0
##$TDeff= 65536
##$TDoff= 0
##$TI= <Analysis number 999999
Compound Code 99
Book Reference 9
Project Code 9>
##$TILT= no
##$TM1= 0
##$TM2= 0
##$TOPLEV= 0
##$USERP1= <user>
##$USERP2= <user>
##$USERP3= <user>
##$USERP4= <user>
##$USERP5= <user>
##$WDW= 1
##$XDIM= 32768
##$YMAX_p= 399574810
##$YMIN_p= -124342
$$ End of Bruker specific parameters
$$ ---------------------------------
##NTUPLES= NMR SPECTRUM
##VAR_NAME=  FREQUENCY,     SPECTRUM/REAL,   SPECTRUM/IMAG
##SYMBOL=    X,             R,               I
##VAR_TYPE=  INDEPENDENT,   DEPENDENT,       DEPENDENT
##VAR_FORM=  AFFN,          ASDF,            ASDF
##VAR_DIM=   32768,         32768,           32768
##UNITS=     HZ,            ARBITRARY UNITS, ARBITRARY UNITS
##FACTOR=    0.157963299565203, 1,           1
##FIRST=     4130.03904135405, 0,            0
##LAST=      -1045.94439549896, 0,           0
##MIN=       -1045.94439549896, -124342,     0
##MAX=       4130.03904135405, 399574810,    0
$$ Real data points
##PAGE= N=1
##DATA TABLE= (X++(R..R)), XYDATA
$$ [...]
20731 -55826 -56677 -65378 -70985 -44723 -22008 -14284 -1014 23565 54421 21338 -16887 -21007 -8051
20718 -8051 -30168 -43270 -65554 -67051 -55035 -46290 -35990 -9024 8898 2310 -582 -15008 -41972
20705 -41972 -40150 -11651 21384 4230 -21370 -17347 -21856 -33767 -35249 -38809 -25152 -42140 -66467
20692 -66467 -58973 -40970 -23421 -49404 -46596 -44726 -46630 -29431 -23656 -4770 -6783 -18578 -19637
20679 -19637 -27994 -17794 -3989 1 -19797 -48571 -44176 -16474 -19105 -32883 -56614 -62874 -4964
20666 -4964 11359 -23824 -58771 -48270 -12877 -5459 -10260 -8524 -15039 -23205 -42998 -44069 -14168
20653 -14168 -17974 -38499 -50721 -38243 -36057 -30354 -28212 -28974 2333 3567 -7948 -7628 -22754
20640 -22754 -41779 -41587 -46143 -49096 -50534 -38759 -38181 -59947 -53851 -23765 -34173 -61822 -61926 -31283
20626 -31283 -1643 -8689 -7294 -12592 -41999 -38372 828 21208 19738 998 -14565 -46224 -53449
20613 -53449 -40894 -36363 -47330 -37761 -50035 -45520 -46029 -58169 -31007 -28492 -32744 -46275 -64381
20600 -64381 -45016 -40040 -48886 -49193 -27053 1339 5434 10707 16114 -1797 9949 6198 -16979
20587 -16979 -13673 -23663 -42193 -77546 -72279 -63916 -60684 -53152 -66891 -41926 -16309 21051 -3303
20574 -3303 -34905 -44242 -24298 -37358 -59796 -48286 -28245 -19353 -1782 -16381 -6730 17858
20562 17858 615 -50353 -56781 -39434 -14889 -18696 6390 -368 -25964 -20740 5861 11049 7757
20549 7757 -4675 -26487 -52500 -37482 -33906 -38861 -27645 -18806 -17599 -17706 -22221 -42903 -48110
20536 -48110 -51514 -32354 -29480 -25830 -15289 -6767 -13875 -30044 -4105 12005 -1921 -18627 -28319
20523 -28319 -18301 -30292 -25309 -25003 -52552 -27594 -6121 10618 19021 14875 -12313 -52244 -56021
20510 -56021 -40826 -38939 -44791 -40226 -36001 -60568 -59636 -22539 -11127 -29285 -41612 -32622 -20054
20497 -20054 -7687 8020 1028 -4054 -14472 -20403 -8534 6482 -15808 -42034 -46373 -59766
20485 -59766 -69633 -61899 -28152 -15431 -9517 -28272 -43599 -50033 -52740 -45077 -41231 -55063 -55835
20472 -55835 -30667 -26761 -20752 -51082 -46772 -50969 -69913 -76230 -63041 -46168 -43895 -33166 -60505
20459 -60505 -62785 -63413 -83668 -96865 -99440 -68689 -72080 -31663 -9737 -38534 -51198 -54344 -57021
20446 -57021 -72566 -71103 -31016 -20555 -61959 -70824 -53522 -47822 -52237 -20823 -8295 14300
20434 14300 -16691 -32834 -30801 -28100 -20253 -32908 -28906 -17691 -35715 -47621 -44628 -30273 -31571
20421 -31571 -62714 -83933 -56520 -47071 -37614 -5571 1863 -5253 -12509 -41291 -59316 -26411 21061
20408 21061 45785 21326 -15195 -42756 -49631 -38139 -15056 -24487 -34193 -26610 -44299 -60225
20396 -60225 -41651 -27611 -59513 -69544 -57686 -51524 -48927 -53292 -59704 -28610 -27168 -42887 -48970
20383 -48970 -49998 -60942 -55275 -42105 -47763 -41678 -46731 -43744 -52469 -66123 -46142 -37766 -39413
20370 -39413 -35399 -33525 -29916 -32212 -37456 -58911 -64588 -46121 -65709 -100739 -100538 -96712 -109647
20357 -109647 -95312 -49681 -38794 -21161 -17435 -44516 -19728 -35603 -54459 -73087 -67237 -62888
20345 -62888 -54442 -31980 -36829 -34133 -35479 -31242 -27136 -36768 -19948 -22500 -17057 -7445 -25500 -34320
20331 -34320 -40685 -26022 -19674 -7287 -2518 2308 -4702 -623 11459 36095 52667 50756 27217
20318 27217 -26998 -32712 -34034 -11331 -7596 17274 3853 16777 20885 11888 8429 714 -19736
20305 -19736 -34822 5077 -2113 -26302 -34451 -63458 -68250 -53147 -12876 23406 -14700 -35303
20293 -35303 -44384 -67663 -78468 -77768 -60101 -83156 -89344 -64954 -63761 -60327 -38363 -24881 -22726
20280 -22726 -18170 -35481 -62418 -77832 -53447 -20925 -19032 -42399 -22329 -11741 -3418 7438
20268 7438 22305 35081 12629 12603 32500 55743 97593 114689 135504 167802 148162 118804
20256 118804 100118 61089 69446 86299 86853 60735 34309 37032 44491 50998 50100 46431 116072
20243 116072 172457 195801 140836 59869 17765 -7440 -5943 8604 9793 -12461 -29821 -33526
20231 -33526 -27576 -19337 19979 13118 10734 8503 11247 1014 -387 3128 -13292 -46127 -67010
20218 -67010 -59647 -40697 -33469 -23162 -25767 -16158 -31157 -40681 -35618 -32943 -31538 -16957 -10322
20205 -10322 -20537 -44875 -55704 -37165 -36044 -39238 -15291 14353 34379 43001 60354 91371
20193 91371 87059 57875 25001 8785 -3970 -14273 -31195 -48701 -20462 -65 -14540 -27588
20181 -27588 -20286 -13079 -21904 -20322 14544 33927 38863 40204 20982 -20738 -34930 -41139 -33251
20168 -33251 -52974 -62701 -37559 -25030 -20234 -30655 -25516 -19336 -28204 -53992 -50556 -30689 -21266
20155 -21266 -29514 -45378 -36768 -25688 -30961 -18453 -7510 -14100 759 147 -12568 30954 26602
20142 26602 14426 13333 23979 22599 839 -23778 -25160 -515 6356 -3588 -35420 -23433 -19450
20129 -19450 -21099 2209 19811 -19247 -39898 -56851 -44692 -37589 -14298 -20506 -25794 -38332
20117 -38332 -49801 -71625 -55013 -38937 -18846 -12807 -17408 -16461 -34221 -64406 -44278 -22602
20105 -22602 -26942 -59315 -49717 -60507 -54832 -34039 -10445 -3598 -10411 -15464 -37390 -28221 -33360
20092 -33360 -32437 -26871 -37953 -38153 -26228 -39257 -44418 -8533 11734 5229 -1775 2990 9628 -509
20078 -509 -7332 -18356 -2982 -11220 -35992 -46621 -34072 -30291 -5728 812 -10386 34476 59760
20065 59760 66688 95338 134330 142769 128490 86169 35815 16363 -719 -10333 -8039 -5075 1959
20052 1959 40908 95896 136948 130272 99567 82488 93353 74382 44560 31637 12706 -2014
20040 -2014 -8448 4110 16229 36590 12577 -42142 -46205 -36233 -25044 -37647 -23470 -18776 -44758
20027 -44758 -65618 -68798 -68757 -50861 -29068 -40879 -50929 -51826 -30574 -22892 -25961 -32401 -29548 -13811
20013 -13811 6793 -14202 -31769 -40923 -44597 -29108 -15028 -1711 8373 -2724 -24911 -27717
20001 -27717 -23032 -19302 -49855 -60273 -44604 -20055 -22882 -35183 -27812 -12274 -5191 -35743 -53918
19988 -53918 -28884 -22821 -15974 -5246 -18180 -27852 -27976 -37302 -61454 -59799 -33361 -12291 -13887
19975 -13887 -32432 -30959 -26659 -27225 -2853 -28883 -54657 -69197 -69378 -50354 -50097 -52064 -50030 -24939
19961 -24939 -36004 -39161 -51012 -62525 -73868 -88323 -102526 -93736 -93368 -97135 -81767 -62002 -59290
19948 -59290 -29886 -9808 -3080 17015 41470 37894 17174 -14806 -32451 -56544 -43021 -31194
19936 -31194 -25361 -24692 -1888 -16805 -21299 -4908 10234 -11762 -11454 -18178 -28037 -19484 4373
19923 4373 15236 -15534 -35095 2666 58243 75947 68412 40870 21875 -8314 -32933 -13004
19911 -13004 6818 9289 14440 20362 10936 226 -2432 11147 5606 11259 10036 13615 18440 10550
19897 10550 -9766 -1428 -2293 6689 -7549 -17579 -30906 -24521 -12568 -14948 -3416 -15059 -16756
19884 -16756 7264 26056 34670 14945 2490 -24482 -48004 -32539 -15468 -2087 8929 -8147
19872 -8147 -21392 -23597 -34030 -19184 -3840 2226 6450 -8446 -29294 -1827 24762 36223
19860 36223 24342 5165 -776 387 -2991 40698 83086 93294 113394 161971 203760 264155
19848 264155 335485 407611 438920 452019 423207 372996 281244 221807 148072 98787 81050
19837 81050 75398 59754 37523 40937 33806 27144 19345 7451 12934 6753 23298 26736 11765
19824 11765 -11084 -3054 23644 32221 19363 32707 46056 52963 8956 -32679 -21952 -27224
19812 -27224 -28238 -13667 -35318 -36479 11060 33002 5230 15171 31662 70154 102500 115535
19800 115535 148223 182645 186246 174568 165261 161359 130461 94545 69190 70800 80026 83578 104031
19787 104031 126542 121281 126581 159979 204538 221660 213135 170396 116048 88517 79051 63366
19775 63366 21100 -6718 -21338 -20534 -21130 -51440 -57907 -48303 -46553 -24987 -7457 -7849 -20932
19762 -20932 -21602 -28201 -35509 -19775 675 16545 33393 30824 15696 12727 3073 -30220 -42273
19749 -42273 -29925 -38303 -22462 -10452 -22630 -47267 -34304 17085 36158 39558 9609 19716
19737 19716 6332 -25439 297 10907 1904 -21940 -49804 -55272 -38489 -40486 -28184 -21665
19725 -21665 -33953 -49989 -67198 -55433 -53638 -68912 -71283 -46587 -65684 -105278 -113719 -93448
19713 -93448 -83049 -92748 -109541 -100612 -79707 -77217 -57001 -36044 -61330 -56606 -33248 -28719 -24258
19700 -24258 -9556 -27692 -56882 -72877 -72564 -63892 -47298 -57007 -45234 -42262 -45097 -63489 -65579
19687 -65579 -45958 -25960 -54293 -56672 -59649 -66649 -61126 -64794 -59448 -49812 -50190 -60235 -68090 -83326
19673 -83326 -79667 -67294 -33151 -28552 -69007 -94625 -61568 -47513 -71394 -66628 -27687 7795
19661 7795 7189 3468 -8486 -30573 -34759 -39162 -68431 -95967 -110827 -90076 -66997 -36107 -17422
19648 -17422 -30116 -23819 -10258 30283 43728 21479 -27881 -53037 -51070 -74011 -79854 -91689
19636 -91689 -61808 -26014 -32669 -24740 -25841 -53029 -65167 -49655 -34465 -9539 -13812 -39374
19624 -39374 -30440 -26266 -36088 -42043 -52870 -65914 -55624 -15986 12665 8419 110 -3998 -12534
19611 -12534 -19159 -3632 -9070 -16341 -20498 -11175 -29986 -45086 -44946 -52612 -42857 -49566 -52281 -33521
19597 -33521 3186 30812 -398 -33043 -12962 25667 16672 -430 -3321 61 1017 35654 25514
19584 25514 38209 30685 4842 -33257 -45171 -54399 -40321 -43102 -41447 -44592 -24179 21531 41802
19571 41802 68948 77447 66014 46702 -4736 -33778 -17675 3992 -161 -6615 -38695 -44148
19559 -44148 -16140 -18084 -42427 -25246 -57313 -87443 -98478 -73004 -49650 -23577 -1527 20362
19547 20362 1725 -34695 -33544 -22443 -37968 -24917 -18971 -8994 -10643 -4376 9995 23418 32063
19534 32063 29040 37232 52729 81126 78961 73317 63702 49529 24206 8604 7889 15440 -4435
19521 -4435 -22982 -19797 -2477 47982 66415 79745 82623 66724 44024 76422 96099 76620
19509 76620 92967 65609 50179 75330 68313 44855 25993 8584 9497 -10446 -35652 -38667
19497 -38667 5906 49984 64555 48085 38382 18876 8545 -5911 -12713 -22629 -26629 -59633
19485 -59633 -75131 -70468 -65187 -59963 -46393 -43222 -40598 -58794 -71190 -65096 -59139 -37349 -42319
19472 -42319 -53750 -59916 -50178 -30081 -15868 -13404 -34235 -73281 -78866 -75450 -88331 -124342 -123101
19459 -123101 -78016 -49150 -54347 -78582 -93573 -88537 -94407 -110559 -89658 -58937 -51048 -72600
19447 -72600 -89137 -95895 -92717 -88376 -40556 -28307 -33592 -35827 -29179 -19146 -33199 -30519 -919
19434 -919 -8615 -44567 -57505 -30927 -26252 -49620 -62240 -62084 -85162 -80395 -62043 -49320 -27453
19421 -27453 -33575 -28398 -26480 -57255 -93654 -82515 -78869 -89774 -86063 -54026 -36041 -44014 -59415
19408 -59415 -38063 -36940 -37943 -48836 -66565 -67902 -54249 -81897 -85413 -67292 -71508 -45925 -9229
19395 -9229 10680 23074 30466 33258 42932 40177 53922 60480 53555 52081 21917 8446 -301
19382 -301 -21807 -2024 20322 42091 52075 43310 63270 112954 109975 73442 53471 39409 20252
19369 20252 -3616 -5027 -6654 -21768 -6431 -6072 -31961 -26855 -31479 -32035 -21683 -15680 -32831
19356 -32831 -36636 -43880 -56776 -42689 -177 5169 8396 8330 11065 8030 -16146 -28556 -25683 -25314
19342 -25314 -31678 -13634 -16890 3373 52297 58444 70004 106531 102578 114113 129855 92098
19330 92098 87526 78212 49855 39282 53512 59029 61815 91430 134788 159607 163773 166315 152940
19317 152940 120778 85171 57361 57582 57496 51655 63759 54626 61816 94111 98689 86664 91275
19304 91275 114676 99812 88768 120979 126281 149268 156450 165189 198760 238662 266783 306335
19292 306335 357603 380524 414524 403697 380862 392595 416249 451452 521705 659949 868487
19281 868487 1098550 1251441 1324559 1357989 1314504 1228070 1168820 1133335 1130120 1217699 1327022
19270 1327022 1468065 1683159 1960276 2307935 2750173 3299248 3976514 4789537 5835469
19261 5835469 7281227 9406408 12722960 17991799 26334459 39010685 56684382 78177013
19253 78177013 100034367 113656511 114883560 110784033 96118408 73520846 53012788
19246 53012788 37280702 26316337 19181186 14598310 11577097 9484582 7930262 6728106
19238 6728106 5763885 4917670 4202366 3654343 3196349 2846315 2563598 2326458 2108526
19229 2108526 1942332 1837564 1816181 1837993 1897146 1971259 2006744 1982591 1928306 1769588 1562785
19218 1562785 1395321 1243326 1114078 1006195 927582 911595 902351 899648 909660 920084 916468
19207 916468 864664 825918 766991 703828 624352 574418 542958 519935 489123 450691 441105 444628
19195 444628 437133 411118 392307 383674 372411 373204 362084 329494 313953 330244 348858 375636
19183 375636 399653 395548 332704 307789 330339 380815 402656 411393 413296 387236 355949 347059
19171 347059 347633 372062 414875 431532 429040 446306 481656 495444 487809 482103 478834 464667 453856
19158 453856 432172 426929 396477 391634 370084 312098 276347 260019 258415 254696 211322 178207
19146 178207 192482 215308 222714 248451 247673 243313 233774 234216 238359 245501 264537 263002 283912
19133 283912 301416 286998 296041 286366 283646 295737 298201 312645 360523 383799 417715 447382
19121 447382 481107 515876 542558 538066 520780 488494 457054 458581 502517 514774 522778 528261
19109 528261 515808 480967 448443 430195 395531 381056 385372 358654 355525 326378 294477 282570
19097 282570 266715 258845 246308 221396 210984 240358 284076 297035 272700 235052 237648 240991
19085 240991 246678 224215 194302 230982 257512 274243 303484 343094 368690 398396 430269 419300
19073 419300 409447 424897 436765 444140 425369 398841 369356 325710 306341 310561 291480 291843
19061 291843 291058 273588 285907 316899 345285 372422 383998 379918 376472 336410 306273 281478
19049 281478 261948 242031 257194 273836 246458 222144 177770 147802 125595 143122 148599 154018
19037 154018 150282 120781 126556 127805 116309 103603 105086 126043 112500 116658 141489 147003 143039
19024 143039 128132 106667 116897 140222 147493 165761 153533 146461 161957 156282 141327 136032
19012 136032 149592 164565 161487 152378 120215 104751 90575 95358 116715 126626 118469 123917 123657
18999 123657 145530 145575 104484 87639 92594 106331 109047 96221 90587 94717 116445 117257 129752
18986 129752 111303 79852 71705 78060 98658 124462 122898 122313 109139 87531 55083 42805
18974 42805 62781 77105 74688 91335 112221 94084 64643 57840 41397 20100 37715 40917
18962 40917 9753 15395 59479 76948 66688 43169 16688 9094 19336 44601 64861 99445
18950 99445 114783 108759 128782 137170 139450 164510 199405 231517 230579 200356 156968 138413 96952
18937 96952 97671 109594 83331 60727 42462 33612 37903 48461 72107 75279 70628 115935 149092
18924 149092 156448 111835 86235 81948 90534 76119 84618 77860 39238 -3104 -22856 270
18912 270 28195 66447 97881 100822 91676 86906 94605 112738 144793 140459 118763 98260 117457
18899 117457 133976 131983 143986 158630 167703 189360 213941 235350 291267 319455 319975 291926
18887 291926 273276 243276 219463 202052 190995 193448 198377 186429 164953 143383 136388 141090
18875 141090 135722 137510 154454 169748 179837 190419 199608 169183 166545 181932 184682 154892
18863 154892 129729 128672 132593 148402 147307 128749 144274 143027 123733 122738 153180 176652 205166
18850 205166 234318 253966 262588 276593 306769 336195 353314 376840 412637 448061 509992 505934
18838 505934 484258 478606 465153 465361 453573 448535 433001 414430 416314 428503 412172 389787
18826 389787 371201 369347 360047 327593 260635 209476 168538 160209 181141 233377 225562 215791
18814 215791 203552 164495 140633 127962 115287 127424 119442 140964 147612 154112 164788 163137
18802 163137 176450 206919 208552 191054 171603 171293 212530 248983 263724 292784 306388 298731
18790 298731 296960 317053 338680 356135 375735 362271 330599 307794 258031 232781 220681 192071
18778 192071 194723 200472 192725 209533 209429 185935 151502 133297 126838 134377 150999 168512 166198
18765 166198 157123 129772 138083 146764 135077 134257 142712 133376 126072 126947 135030 111404 95191 90702
18751 90702 117766 91870 63545 51597 60568 76017 65771 61482 47960 59037 50486 35197
18739 35197 19920 9080 6945 -4815 -49166 -41426 -12366 3737 17345 7250 -11263 -21204
18727 -21204 -23889 -807 33051 41369 43368 40473 26919 41401 77701 93788 78632 106457
18715 106457 112087 104497 95189 91135 83694 72977 79372 51249 55752 88175 114483 105880 122019
18702 122019 160826 181963 187709 207456 234354 283349 351841 390187 426832 465171 469062 470693
18690 470693 469665 488087 507620 539048 624426 727791 835543 964466 1107624 1337777 1736186
18679 1736186 2316331 3170528 4206324 4999482 5060783 4651395 4340502 4254097 4427693 4959070
18669 4959070 5819237 6618581 7201577 7635610 7172921 5681420 4202721 3229208 2706765
18660 2706765 2464185 2433255 2578515 2945887 3509496 4135295 4543698 4402346 3890857 3419370
18650 3419370 3124783 2978006 2927844 2984465 3142114 3474854 3899030 4370286 4743722 4882895
18640 4882895 4970286 5118087 5149912 5099530 5213678 5645814 6511000 7771637 9270335 10842913
18630 10842913 12180639 13110107 13870727 14654062 15304415 15365171 14640762 14165498 14780906
18621 14780906 16437048 18624662 21422290 25234913 28877754 29705865 28141546 26743030
18613 26743030 26908189 28209305 29719435 31797805 34318232 34692246 30697810 24542511
18605 24542511 19474449 16271077 14488802 13639901 13566746 14270495 15912429 18732898 23016635
18596 23016635 28570539 34046912 37780788 39502479 40338227 41546402 42983662 44280822
18588 44280822 47185548 54164294 66509513 84559599 107487322 133995586 161626333
18581 161626333 184890933 200578406 209495712 208282736 198214678 189089599 185703320
18574 185703320 182463702 172358833 155166279 133115940 108115260 83973547 64677475
18567 64677475 50987246 41448590 34633463 29646713 25960945 23213133 21206956 19870530
18559 19870530 19177851 19169742 20018967 21815978 24260396 26762946 29617263 34367182 41875654
18550 41875654 50981757 57991421 58679642 52641075 43349233 35261793 30181598 27790202
18542 27790202 27774931 29996856 33638386 36449751 36855876 35820147 33235740 29147524
18534 29147524 25891687 23350757 20466059 18093368 16815385 16138639 15868283 15836613 15382961
18525 15382961 14189250 12847515 12151160 12502188 13974138 16218398 17990162 17581972
18517 17581972 15459140 13382651 11887726 10939273 10540850 10396639 10043315 9392778 8952846
18508 8952846 8970079 9337484 9928146 10772866 11949458 13229299 14046719 14163421 14354209
18499 14354209 15540201 17677852 19771795 20629042 20058536 18932181 17100962 13995664
18491 13995664 10647194 8127630 6498021 5470196 4825377 4374355 4099163 4033499 4166219
18482 4166219 4531939 5246075 6222348 6963166 6520620 5380031 4576660 4275692 4331469
18473 4331469 4647104 5215055 5920341 6354532 6125380 5379644 4718915 4324221 4213073
18464 4213073 4421091 5067054 6093461 7315271 8129484 8078685 7488275 6396794 5055853
18455 5055853 4024362 3418665 3081273 2857712 2746750 2727179 2769465 2927343 3278868 3849385
18445 3849385 4538449 4912063 4513145 3606022 2777863 2222689 1870083 1653938 1485133
18436 1485133 1377759 1353725 1318600 1314007 1314694 1318516 1319640 1313459 1316414 1264691 1215735 1179821
18424 1179821 1140884 1138524 1183854 1224221 1226239 1256713 1286598 1289581 1201400 1138459 1110130 1076050
18412 1076050 1036872 1041633 1050347 1060411 1078612 1084389 1045919 985335 939645 886114 855914 867126
18400 867126 843732 834556 840411 848698 825857 814729 824319 771877 733714 687638 678593 687129 695672
18387 695672 680996 668715 665611 655517 644465 636687 668792 667744 655086 652347 642199 654259
18375 654259 664831 682528 686236 679016 680477 703272 684884 674033 659365 665079 638316 623739
18363 623739 586484 572462 582326 592505 560568 534254 542065 554668 540802 535887 528261 525360
18351 525360 550105 581273 573764 544271 536405 516340 509858 504498 512302 505012 476482 448746 443715
18338 443715 453646 451604 471157 457657 437006 447001 456637 471050 475881 468623 438707 434420 423999
18325 423999 417834 419551 398054 380283 387728 408228 425275 430367 403751 389920 388574 373608
18313 373608 368137 375878 386870 375446 369257 343073 319905 336483 361574 369558 387970 413661
18301 413661 423712 422426 408291 401127 414190 439358 430435 431793 458907 484059 560459 628013
18289 628013 614776 549887 488836 470689 432807 396335 400477 412692 430297 405175 375099 361080
18277 361080 364837 357744 337039 339388 302835 269328 258686 258274 280912 301368 292912 267367 259908
18264 259908 265343 284220 318748 327575 326677 317520 321247 341614 333653 341629 333641 293017 310630
18251 310630 353058 379241 411340 421908 426070 420545 406523 380017 373982 369012 380101 384531
18239 384531 367433 376374 398993 407879 417179 425038 447942 460757 471937 520751 568656 571810
18227 571810 580336 577580 535647 473139 450491 437520 430332 402289 362118 347366 345737 331342
18215 331342 337715 354123 363686 377100 382709 387472 379881 372169 381696 372742 360518 343423 361574
18202 361574 378684 378169 385505 373881 381066 384543 378419 405779 447313 451130 442975 420029 405816
18189 405816 411408 416220 416573 403210 370593 359050 335368 331503 317738 321375 341218 363980 380853
18176 380853 368480 332147 334481 335598 354677 386467 392395 409791 396027 407070 443845 464397
18164 464397 519381 538073 502014 488368 502176 529101 559348 589711 623991 632192 611810 600958
18152 600958 553985 518394 483745 475394 495402 520518 549986 578666 600615 583212 549898 538659
18140 538659 520077 509488 485401 476292 489972 513196 538368 540578 485237 469825 476526 492678
18128 492678 518613 547551 551696 526342 518805 520448 541668 614122 691193 745971 812980 866942
18116 866942 880494 855243 843871 888219 980182 1092862 1165850 1186779 1176706 1190869 1258251
18105 1258251 1401361 1586738 1696953 1702835 1606767 1452048 1258363 1056497 925792 876828
18095 876828 847641 815624 781589 749610 749714 746879 784277 813822 878312 905044 889904 891438
18083 891438 924757 1017417 1110497 1227327 1363668 1463666 1543863 1596260 1549960 1437285 1303261
18072 1303261 1170462 1114308 1130324 1212766 1332591 1457571 1517627 1523201 1441249 1349593 1283708
18061 1283708 1238461 1190293 1097416 971260 860580 826148 806653 714256 650546 614068 599285
18050 599285 573711 530613 530703 531728 537218 558273 572302 572177 548748 546145 544530 567121 580591
18037 580591 604594 633110 632514 635690 649481 656428 629554 615116 597232 588386 571402 536200
18025 536200 537179 540801 572100 615803 649276 671078 712370 787387 803540 831348 854430 892985
18013 892985 939138 940222 959816 1024727 1089916 1163837 1246766 1335324 1377793 1412715 1428491 1361801
18001 1361801 1268754 1206436 1152331 1045151 925692 831756 786404 756698 687231 650528 635586
17990 635586 644989 647128 686991 709799 721092 731864 754107 776259 739855 691559 651553 627412
17978 627412 617209 628291 619120 603340 576142 554349 555680 557664 536673 551623 600503 634520
17966 634520 636499 622355 638371 672114 704511 715483 701263 676684 676810 697617 688115 669898
17954 669898 654621 630699 636173 624273 585220 567965 568508 573351 566842 499352 438933 438303 429147
17941 429147 412133 421925 432477 463470 491271 534091 581023 587511 578320 568802 538617 512075
17929 512075 490855 437099 377026 315947 303540 305954 312547 312837 323512 325383 316953 348181 379946
17916 379946 417580 422699 423998 418746 389052 355157 339188 347315 380856 403313 422897 469936
17904 469936 493751 500415 510039 516598 515610 513773 471873 395116 329684 271462 228141 237704 248044
17891 248044 265213 269765 260717 246835 256356 260975 243531 233175 234320 217023 168857 141875
17879 141875 149440 161316 152708 153886 176638 176495 162743 141167 129674 118676 120790 104427 103510
17866 103510 126661 140923 119132 118751 131715 128402 126257 112480 113259 136272 138150 108873 102559
17853 102559 94655 62416 59566 69529 116505 142373 135016 122964 107357 103251 116901 113276 109190
17840 109190 113005 130320 159993 169821 160517 154843 178975 158404 131246 117590 129498 147498
17828 147498 130479 136415 151873 159718 140912 128123 114738 101210 107190 115468 114403 123858 113742
17815 113742 142238 174595 186588 173288 166906 180023 157446 157058 159281 193066 219350 235140
17803 235140 227730 192157 153115 134521 141359 136901 123191 105734 77770 49671 61317 81217
17791 81217 107912 112091 99069 103187 93180 100831 117364 113201 111333 95845 107724 126027 134110
17778 134110 135025 126871 134134 110644 89144 78969 80268 88113 92007 90209 129303 147201 138003
17765 138003 143934 149553 126960 128501 144596 160617 161967 134014 119507 116158 113025 132288 151790
17752 151790 165251 160028 151340 164795 190038 198501 190956 176537 165071 155485 114735 74749
17740 74749 64578 75930 97658 119024 123902 108905 92497 92469 106253 99545 70802 82701 92169
17727 92169 127063 131869 142637 145350 108892 76242 79263 106070 142716 142446 124533 97170 100859
17714 100859 102138 86256 65165 76342 94838 71814 79656 88132 113774 132734 118456 114408
17702 114408 72772 47403 38802 42214 58954 89546 114373 97915 78934 78001 84156 98406
17690 98406 102685 111864 117774 110866 103686 91210 70637 81424 95812 116875 80670 49565 30691
17677 30691 18791 25734 52350 76842 60885 41592 31521 68964 89890 92886 66401 62349
17665 62349 77627 92177 84417 94143 96368 75246 93981 91482 87609 115576 105763 75988 76833
17652 76833 92441 88132 68426 68809 72156 72801 74776 81812 67214 49069 35383 23671 61675
17639 61675 91469 101158 107697 83705 61448 59737 93804 90434 94639 89062 97041 127190 114956
17626 114956 91296 75083 96916 82325 67544 63181 55417 44614 48013 65279 81756 68032
17614 68032 59917 94016 111241 100379 103778 85935 68196 67845 63386 68124 57544 66627 78506
17601 78506 115351 131920 120462 69381 53188 79787 91610 94404 89934 115316 121531 127734
17589 127734 136603 148722 142655 141981 176313 204589 239538 298208 312681 304752 296482 250419 223093
17576 223093 223644 186664 143499 120585 119690 112537 95593 66189 63521 102664 115998 82450 66129
17563 66129 60579 81888 107640 99469 90447 96074 80753 101017 99384 90362 93571 115851 105131
17550 105131 102034 90692 82663 64224 50784 44272 65803 73376 60224 55091 50589 51993 70908
17537 70908 38288 35654 48608 72157 75713 52519 79551 75140 55306 48037 65181 72618 63310
17524 63310 78313 78953 69216 92939 103914 96382 83043 97793 95712 87771 65082 66014 92407
17511 92407 92796 81169 93253 86509 58032 68016 53181 40357 57664 53025 48461 68331 76186
17498 76186 62675 57317 68701 37630 3487 -2552 27684 26758 40279 39028 44662 40590 41777
17485 41777 47089 61861 67116 67535 53151 61558 72579 85631 82927 53075 63254 72170 74785
17472 74785 66297 67274 65229 73484 109978 149704 160896 127627 100848 83604 67375 21804 43360
17459 43360 61582 66221 69845 84420 66393 50824 37453 40186 46610 68961 86342 60773
17447 60773 58695 51883 30926 33193 29993 26967 82486 116464 105595 108982 105980 115497 96350
17434 96350 90768 98954 88057 97806 73226 54219 55652 78925 70572 58823 60827 84850 100627
17421 100627 127989 146482 131910 106974 81714 75078 75167 79898 89127 79715 70443 67549 57665
17408 57665 48758 75896 74869 62022 92801 107804 112545 90909 75940 85050 91653 94706 86415
17395 86415 67693 56412 56721 83513 101574 105736 117182 130684 136323 140224 161780 176852 177426
17382 177426 190579 179323 135913 128534 120320 133015 121515 110229 128121 153423 151593 114743
17370 114743 104826 105513 101642 87255 97731 125988 119808 90559 104836 119184 126592 142066 171951
17357 171951 194067 215373 226113 201676 169826 142396 133389 109799 92421 81632 95816 112518
17345 112518 118310 121282 107815 88914 67073 75120 96098 92998 108232 116063 98964 113645
17333 113645 119290 109655 125182 146030 180283 182055 159694 161032 198042 186777 139584 128820
17321 128820 118814 122885 134553 126374 101051 95411 78413 83434 93523 115887 134642 106353
17309 106353 103122 88952 94047 104220 94929 111310 119922 125934 84556 49695 63279 86764
17297 86764 89960 91598 108623 134836 142420 126657 107948 99170 93080 93419 95264 95633 76418 73075
17283 73075 70314 64275 58176 69355 74018 113871 109606 75317 73907 85787 65849 56625 78056
17270 78056 96700 97010 94395 84395 85252 78049 76694 57838 66967 81492 77248 74456 81108 92616
17256 92616 122050 155868 140815 90046 64113 63034 72574 88003 95889 104338 115152 122683 132812
17243 132812 129013 125990 139410 142718 122949 117739 127681 114814 77264 64746 73771 97526 95069
17230 95069 99000 112119 100443 89280 83045 73532 38880 49268 49607 74942 98236 111236 114409
17217 114409 126916 107793 86109 89141 108771 86125 78648 86998 85785 65682 76574 72808
17205 72808 79846 106489 100006 68066 43956 57763 62613 65864 44610 40822 49434 39727 23477
17192 23477 52466 65646 64481 62717 40453 23576 58173 67775 61157 49348 49456 64189 76866
17179 76866 65469 65024 35386 54937 65661 63688 45411 38635 48164 33701 16848 -1918 -13993
17166 -13993 -9149 9749 17768 -6227 661 30785 10226 -11618 9935 22201 37794 58596
17154 58596 55154 40008 12075 -18095 -11910 11069 26538 26527 19279 11947 6663 22085 5472
17141 5472 10449 -903 15674 36407 39739 36579 48409 68783 57742 50227 51129 65210 62764
17128 62764 50833 17350 27089 50985 52895 53151 38567 42932 18736 -698 -2382 9360 23661
17115 23661 14768 39780 94549 86045 71284 37636 4120 7646 20097 33434 39423 52540
17103 52540 63749 81186 85601 62850 45061 59008 31988 27219 25003 29126 46526 64905
17091 64905 66078 78987 66420 51259 26613 16125 11404 25943 50460 48218 76578 78678
17079 78678 59360 42698 55045 58887 53454 46042 38441 37209 40379 52381 52850 27979 23516
17066 23516 12554 -4499 31225 40892 54752 57969 37971 45977 43373 35566 33283 49028 47336
17053 47336 61171 66429 70324 76664 66912 51919 48919 58232 55952 51995 60586 60587 70788 63697
17039 63697 65809 71803 65153 51377 11939 15526 32651 13863 -13828 -11208 14119 36510 40749
17026 40749 2757 -45803 -54556 -31578 28996 27500 18757 25634 31688 41392 23011 -2859 -8163
17013 -8163 12634 32794 57296 89812 77092 83125 130087 110376 84646 55357 20287 10317
17001 10317 -24915 -45840 -26654 423 23360 44330 56159 54786 56826 42440 49224 32252
16989 32252 -7105 -6427 23482 44541 39543 32922 32849 35719 25644 24934 13157 -3773 8832 20152
16975 20152 21240 710 -8118 9634 -15676 -14899 16596 24850 33631 50492 29460 11707 15154
16962 15154 24386 30057 44773 30753 11546 9984 -712 2086 10404 26724 30879 8532 -2265
16949 -2265 15382 19494 12811 23973 16340 -17824 -9040 829 7862 3658 29469 16374 9455
16936 9455 7095 -8438 3752 14771 8018 12158 41248 44274 30090 23148 30334 7067 12898
16923 12898 17020 18827 15576 16577 -5996 -3658 -12443 -24291 -12388 -20872 -28042 -16326 -7818
16910 -7818 565 -16575 -21875 7129 10379 8070 15973 29608 16272 21339 12864 -902 4029
16897 4029 3972 3146 -12374 -4891 -879 6600 7644 3557 -14653 -20089 -28994 -15086 5421 2570
16883 2570 -19227 -32584 -17257 3032 -20114 -21957 15078 4196 -4167 25037 40306 26839
16871 26839 19889 -8772 -31814 -2491 2221 8435 16313 -2679 33 -38533 -52204 -17963 10215
16858 10215 16721 6091 26782 35254 32899 34285 6901 -26219 -22882 -18657 -10642 -2004 -2866 6514
16844 6514 13972 37683 45633 40978 33430 16864 8556 6203 -10463 -6699 -3543 -3805 27294 22978
16830 22978 13498 21193 34915 43998 34401 -1793 -26972 -27285 -30074 -25467 6398 10609 -15173
16817 -15173 -3763 2251 -4280 12457 38373 55637 61514 48428 45535 39195 63805 88206 83702
16804 83702 42709 19830 22379 29812 13534 37549 33227 4051 -5785 21594 26630 7275 7845
16791 7845 5585 -458 -11772 1213 12721 -3427 5155 27734 32568 18567 21231 13373 -1832
16778 -1832 -4261 -32960 -20935 -367 1410 2431 3428 16213 23900 8138 15323 15072 5331 -5971
16764 -5971 -16372 -20625 -10042 -25284 -7728 24308 16478 8256 18573 31976 61809 30802
16752 30802 39043 35743 31439 31932 8414 8827 16801 7470 8934 3383 -10561 -8799 -28468 -28520 -4783
16737 -4783 -15479 -52767 -48881 -31556 -36689 -38264 -50607 -52623 -1352 39139 41211 35770 18037
16724 18037 -8079 -8933 -32470 -59732 -54419 -45477 -48363 -38346 -17956 -16981 7179 23373 5752
16711 5752 -15820 -32803 -54643 -43507 -9892 18907 3554 -33974 -24626 -6224 22652 17028
16699 17028 -14947 -23881 -42142 -30987 -4694 16587 12960 -8506 -13044 -18041 6082 21446
16687 21446 5085 2664 11983 -46151 -88570 -104294 -75602 -45344 -35391 -22124 -12174 11654
16675 11654 20612 15526 -4629 9798 23051 5718 33237 35584 14510 9995 -6428 14511
16663 14511 26708 30159 29851 45631 59179 38683 42906 66464 42147 16142 -3360 -9207 -4009
16650 -4009 3373 4637 -7603 -13073 -3613 -24160 -21319 -24821 -33956 -38520 -15379 -12794 -5614 -3823
16636 -3823 -1296 -1249 15006 27763 642 3203 19288 21925 14602 6029 16182 17159 4502 -3387
16622 -3387 10076 26448 24793 48248 57627 24400 17661 20179 25820 37404 41716 32821 25273
16609 25273 -15750 -15185 9768 1206 -13319 886 10554 5105 -2355 8130 13186 12187 3487 13640
16595 13640 27178 27708 42571 16158 -26999 -30498 -19341 -17194 999 33213 31640 -14252 -22173
16582 -22173 -53486 -54348 -60739 -19113 -17880 -36170 -40069 -21894 -13662 -19588 -33947 -32696 -4066
16569 -4066 -115 -8290 -7740 -5582 -28823 -37713 -32882 -34237 -30315 -10330 30944 20766 3069 -5762
16555 -5762 9172 22783 19989 23318 29841 6471 11137 34087 38468 34576 18053 13774 23324
16542 23324 29181 24899 9998 -4390 8056 17803 12493 3149 -13746 -13591 385 603 -7083 -24513
16528 -24513 -17478 -11120 -1904 30435 35120 27128 32246 31331 21328 -17307 -23782 -7644 -8533 -4721
16514 -4721 -7998 -7434 -18120 -31871 -24262 -6921 10158 13197 -20515 -46678 -30000 -6103 -9195
16501 -9195 -9680 12654 2582 20649 16226 27893 24979 8861 21074 12007 -6468 -25952 -18853
16488 -18853 -32795 -37000 -49413 -27405 -13242 -27508 -39846 -45114 -55809 -66183 -45958 -29990
16476 -29990 1216 12692 17908 723 -24164 -574 21836 13944 6744 -7905 364 19588
16464 19588 25114 15188 15594 27582 30230 18603 13939 16920 15075 6388 -2656 -10271 -17536 -22051
16450 -22051 -17685 -24796 13819 53798 52224 46099 17651 3601 -26745 -40193 -46050 -28139 -17577
16437 -17577 -22971 -30509 -31090 -23811 -31203 -38801 -32728 -32553 -10314 -18425 -24692 -133 38258 18221
16423 18221 -18392 -31953 -27477 -8095 10030 7439 -8364 -1682 1532 824 3736 -23061 -36452
16410 -36452 -27084 -13502 -16972 -6891 -13959 -599 -13931 -36557 -36319 -14946 -33396 -10334 2831
16397 2831 -9223 -591 1261 -15428 -6828 -9527 -6227 -25549 -43538 -36833 -13902 -27204 -25823
16384 -25823 -1580 -17602 -36881 -36915 -42229 -35144 -12846 -931 33428 23993 13473 14765 -19417
16371 -19417 -17729 -28074 -30746 -49330 -38655 -21533 -18201 -4963 -10414 -39522 -52421 -39714
16359 -39714 -37078 -56590 -54708 -11034 19232 -3752 -29863 -30328 -35538 -27100 -36723 -42711 -22834
16346 -22834 -22681 -34152 -43365 -21701 -13006 -15001 -15785 -21793 -26549 -21171 -41710 -55448 -67497 -29344
16332 -29344 -21165 4225 5648 -15059 -41344 -42145 -59255 -54364 -40450 -30990 -15037 3119 -5864
16319 -5864 -5947 1151 -22626 -23250 -11928 -18189 -31072 -31317 -25524 -16257 -14585 -27007 -33566 -29559 -30550
16304 -30550 -21334 -36328 -49707 -39276 -48931 -78579 -73853 -61772 -70113 -43309 -18661 -32240
16292 -32240 -19238 -27696 -30555 -17205 18830 9563 10871 31535 -12167 -11495 -10641 -17596 -45596
16279 -45596 -60154 -50909 -22481 11795 3863 -7718 -1579 -17912 -5091 27475 39076 28062
16267 28062 565 -1269 7873 15038 -354 36 3031 6285 16280 20242 23565 2049 4224 -7575
16253 -7575 -10318 3183 -5962 -4716 -7555 6953 19961 4376 6683 -11531 -2724 -8714 -41189
16240 -41189 -34979 -7374 -1540 -15192 -34795 -46586 -33420 -21610 23428 18189 15576 790
16228 790 -16204 -27690 -6606 3093 -1414 -11214 -24500 -54223 -46133 -34840 -29650 -17494 -7855
16215 -7855 -32957 -13889 1111 -14713 -35829 -23808 3154 18931 18154 225 -22763 -35580
16203 -35580 -51886 -55908 -43781 -34803 -19911 -44558 -46627 -23655 12818 22884 -1045 -1459 -19428
16190 -19428 -44656 -41446 -41331 -26886 -23753 -24852 -26010 -46767 -26152 -21512 -45416 -50816 -18918
16177 -18918 3584 -6719 -44674 -39178 -28773 -14073 -10496 -14193 -29115 -33891 -35522 -20362 -20899
16164 -20899 -9518 2453 1316 1171 -19806 -27560 -11142 3380 -12710 -15309 -11578 14644 26612
16151 26612 -8604 -49826 -37711 -32768 -44555 -26165 -5567 -26486 -44371 -27136 -18121 -17131
16139 -17131 -5332 13416 25211 22873 -5211 2644 15768 13042 -17937 -59400 -44778 -36258
16127 -36258 -14444 -13422 -13311 -2172 -7037 -17105 -18736 -31175 3293 32880 23948 -1110 -37348
16114 -37348 -35292 -19467 -40063 -74776 -68257 -40672 -18449 -24489 -24836 -9083 18308 10445 3238
16101 3238 17885 35380 21370 3401 3983 5167 -6633 -22004 -26527 -29641 -49025 -43984 -48688
16088 -48688 -31629 -21857 -1653 9070 8460 5596 15638 22800 15890 -10196 -34155 -47092 8991
16075 8991 47877 20296 -85 8449 -16532 -35722 -36060 -42290 -51749 -31672 -15344 -5433 -16691
16062 -16691 9738 9331 -28961 -33659 -13032 -8723 -3505 2781 -20609 -20461 -22064 -12286 10926 34653
16048 34653 33589 15854 -6838 1381 23596 49110 39479 11720 -28240 -19639 3475 47041
16036 47041 24691 12496 29422 23566 22799 3778 3132 -9699 -9403 -25171 -35252 -15655 -9498
16023 -9498 -26990 -22553 -37728 -41232 -48706 -57803 -63378 -56418 -47450 -51491 -42136 5061 19468 20081
16009 20081 10902 -1721 5624 -12537 -28987 -8043 -22825 -50430 -48887 -16964 -24625 -25333 -55248
15996 -55248 -58825 -60541 -39142 -15132 -31142 -40187 -34533 -22864 -16497 -6271 -4121 3992 -8907
15983 -8907 -31121 -34609 -23905 -34765 -49462 -62842 -45369 1567 30468 21961 5188 -4555
15971 -4555 -11210 -14403 -39164 -51163 -35148 -22108 901 -4643 -7375 -446 -34209 -16479 -11767
15958 -11767 -16538 -5048 -18688 -24904 -18507 -36507 -57574 -64232 -61847 -54463 -55051 -50127 -41439 -25860
15944 -25860 -17501 -12269 -16947 -13108 -19435 -38 3696 -5330 -34197 -44351 -11010 -6788 -23935
15931 -23935 -19725 -14973 -20053 -28066 -26291 -1502 4310 -1090 -17794 -30876 -15981 -6371 -3096
15918 -3096 -26998 -47094 -33045 -10643 -8493 -10344 -26172 -53140 -64350 -70849 -66659 -75866 -58086
15905 -58086 -33296 -45278 -45344 -46639 -36089 -25316 -36683 -22341 -27362 -27817 -8970 7603 -21107
15892 -21107 -23304 -24329 -32050 -39003 -52006 -62136 -30876 -3965 4814 -4004 -8492 -5057 -23910
15879 -23910 -24366 -23607 -52667 -43267 -18422 -10457 -36478 -52995 -48555 -27943 -8059 -11185 7919
15866 7919 47312 54268 40136 10275 -389 -19785 -23068 -33764 -39347 -38922 -36847 -34141 -14312
15853 -14312 7050 23138 2818 -426 -18026 -32381 3349 9178 3457 -12843 -13757 1235 -2075
15840 -2075 -20301 -31220 -27855 -26695 -22524 -7195 -46176 -65688 -74138 -55804 -58823 -54090 -25550
15827 -25550 -8424 -2747 -8185 -13483 -37255 -39055 -12322 -35079 -41113 -24452 -15384 -5251 315
15814 315 -11950 -6123 -3103 9648 27727 50214 25059 -13522 -16870 -5042 -12385 -42905 -63475
15801 -63475 -49398 -47176 -37135 -26573 -11774 -4867 -9873 -25854 -22427 -35523 7556 14150 5836
15788 5836 2519 -9800 -22290 -34114 -1134 23849 2317 -16501 -29628 -19824 -22228 -35142
15776 -35142 -55121 -64452 -84133 -87852 -83954 -66055 -69223 -68407 -45947 -24957 -37680 -30223 -13525
15763 -13525 -13457 -14258 -7348 -21699 -11435 14314 5865 -5881 -2200 -4031 -13833 -17288 -23883 -13073
15749 -13073 -29056 -19180 -13258 -34736 -38022 -29036 -21997 -10581 -21502 -3624 -4451 -33965 -21757
15736 -21757 -6387 4649 -774 -20947 -15558 -2135 -1743 -5741 -8262 -1076 -6207 -15433 -7334 -23683
15722 -23683 -46678 -30442 1259 7111 -6278 -9305 4977 13014 4394 17311 17728 -6603 -23715
15709 -23715 -12631 21001 -7854 -19378 -26324 -8872 -12011 4356 18131 15705 -12550 -21069
15697 -21069 -37506 -43324 -20174 14703 10303 1475 12860 7572 8204 160 -10900 -9399 -16841
15684 -16841 -13156 -28129 -41350 -50753 -64091 -31392 7447 -90 30017 52677 35392 10742
15672 10742 -17794 -32128 -37220 -17908 -5470 25836 -2984 -35986 -35981 -29832 -15678 -10643 -26200
15659 -26200 -11707 -8883 -12334 13047 20251 13161 -12061 -19899 -4066 3047 -9459 -14919 -46560
15646 -46560 -30363 -16472 -51256 -70188 -34945 -646 -22191 -44069 -35271 -40699 -24777 -8780
15634 -8780 -25917 -70205 -65048 -68442 -39649 -29508 -29936 -49428 -72186 -53536 79 6059 -8931
15621 -8931 -29171 -16377 14383 3082 -566 -9593 -18496 -2589 4850 -21168 -25160 -14549 -29410
15608 -29410 -27516 -6315 -11532 -12512 -14372 -1059 -17800 -25147 -34058 -32425 4300 6618 -7144
15595 -7144 -6529 -7663 5458 6257 2803 -9003 -15170 -12158 -24753 -33063 -47973 -31582 -34574 -34827
15581 -34827 -30974 -43895 -30003 -8255 -10380 -25328 -37129 -21543 -17514 -53624 -64379 -73412
15569 -73412 -59989 -30202 -39697 -41998 -30912 -21558 -40925 -45591 -26276 -1661 36584 2291
15557 2291 -23237 -13703 -26918 -13608 -2271 18941 29790 32870 12824 -8979 -32637 -3388
15545 -3388 13008 8684 -6232 4113 15527 -14688 -29049 -26901 -35102 -34309 -23149 -10440 -3007
15532 -3007 -1316 -5215 4828 9711 -2185 14413 -8268 -34773 -47917 -47307 -40947 -25495 -20789
15519 -20789 -15188 -33629 -38620 -17209 1945 -6029 -9218 -24378 -13798 -14279 -16011 -22459 -37158
15506 -37158 -70298 -84611 -57559 -5727 6773 3750 20787 13322 -12781 -30924 -9392 -1564
15494 -1564 -11293 -24287 -12146 -7939 -53170 -48645 -21580 -41149 -57305 -36149 -17993 -1419
15482 -1419 -2459 -17288 -13577 -436 -21666 -43822 -36405 -24850 -43699 -52001 -26454 -18223 -31443
15469 -31443 -18510 -32751 -42074 -61539 -71744 -69305 -58856 -41789 -21838 -14965 -24367 -18360 -6871
15456 -6871 -22302 -22664 -9691 11318 -11643 -47735 -39952 -20955 -2963 4895 4058 -2520 -32122
15443 -32122 -11236 -1352 -29310 -21515 -11144 -8205 -21757 -21514 -26440 -27759 -14441 -24375 -19808
15430 -19808 1038 4531 -1993 -14425 5381 -1903 -9317 -7771 -10578 2522 -10051 -23027 -25731
15417 -25731 -16655 -21709 -28413 -29901 -19723 -19693 -28462 -24801 -13142 -3430 12726 -22341 -27017 -6486
15403 -6486 -13062 11321 9121 -19553 -32001 -40708 -73302 -87832 -54327 -22680 -23091 -23574 -15349
15390 -15349 -56477 -74646 -54177 -43809 -64053 -55421 -14270 11585 5149 2988 -9825 -31581
15378 -31581 -46249 -27519 -13731 -12169 -20380 -18249 -5642 -1682 -11815 -11806 -4869 -18834 -32480
15365 -32480 -18042 -24956 -39314 -2897 25420 25052 18007 32896 23632 7848 12627 24715 29780
15352 29780 7788 -14143 -2828 6214 31967 35238 25523 -2728 -24446 -60446 -77735 -47691
15340 -47691 -32590 -44498 -48453 -27605 -7033 -4478 -4675 298 -10130 -3885 -16004 -31778 -14005
15327 -14005 -12803 -11458 -13863 -27123 -27671 5868 6355 -24515 -37907 -15434 -2141 -9408 5805
15314 5805 2855 11637 26571 15542 7601 29657 15898 21150 16293 -24409 -51815 -61907 -85788
15301 -85788 -55415 -31846 -25260 -29779 -15207 10568 24324 41158 46909 42455 36418 34192 28852
15288 28852 33892 375 -17340 -25602 -49620 -67911 -54125 -44167 -59560 -67715 -64689 -77774 -91662
15275 -91662 -105942 -99163 -69683 -30094 -13564 -15869 -23306 -46095 -77445 -62821 -33597 -27884
15263 -27884 -42839 -46372 -33246 -34122 -18205 -20717 -18576 -20371 -22765 -22459 -28826 -33817 -37480 -46203
15249 -46203 -42808 -47135 -47636 -27666 -30777 -57606 -57759 -61497 -75276 -80123 -75891 -26886 -9020 10965
15235 10965 14696 -2223 -5568 -21652 -29482 -34046 -13086 -6259 122 10038 10780 1582 -7204 -8613
15221 -8613 -2486 1136 -3076 8464 3029 9692 15936 22001 18554 -11329 -19964 -12272 -14882 -21502
15207 -21502 -44469 -76156 -49086 -7604 -11737 -49509 -55633 -26101 8963 2428 -16283 -13721
15195 -13721 -4028 4445 -22313 -18427 686 14479 35186 29382 15652 8747 18574 19527 -9433
15182 -9433 -21552 -25228 -19541 -12057 8623 -6423 -24162 -11109 4071 -12495 -39266 -32201 -7506
15169 -7506 18078 25235 32588 47753 32487 34653 38309 19116 4158 -23342 -52773 -30531 -4913
15156 -4913 -20521 -44022 -46510 -24047 -16668 -6756 -4886 -4115 -34083 -54078 -41954 -24552 -11911
15143 -11911 -30544 -35565 -48915 -28630 -24882 -36643 -31439 -34613 -38046 -33801 -20236 965 3558
15130 3558 -3493 762 -7782 -38134 -56486 -33232 -27951 -27231 -27045 -22115 -19705 -31657 -19658 -3384
15116 -3384 -11332 -15354 -4901 -16194 -11873 2679 -7302 -36045 -51107 -50193 -50987 -32957 1263
15103 1263 2258 -3993 -11559 -4343 -2498 -4775 -27004 -24064 -43804 -70537 -60388 -40619 -5268
15090 -5268 -6441 -24970 -49359 -67030 -88956 -70845 -58008 -69653 -49803 -28367 -9765 -2530
15078 -2530 10946 9799 -1074 14792 1943 -13034 -34014 -58840 -66091 -75469 -86865 -59105
15066 -59105 -44327 -40436 -18954 8518 -1377 -13399 -41580 -42174 -26271 -11075 9470 13124 3533
15053 3533 19203 -8111 -8056 -8053 11170 3701 -4934 -18394 1884 6084 5591 -1613 -2584 1279 12836
15038 12836 10445 965 15423 -7594 -46140 -62102 -41068 -15791 12669 -3892 47 7786
15026 7786 3397 -7736 7504 10336 2565 827 -9983 -35106 -21322 -38970 -48573 -34033 -6867
15013 -6867 -8969 -22038 -45460 -56169 -44927 -26001 -28769 -12583 4576 -1648 -6983 -18162 -29753
15000 -29753 -10418 371 -7389 -2287 2209 -4907 -28590 -20973 -21285 -4440 -20894 -9353 15644
14987 15644 28476 17129 -15098 -62788 -69560 -53844 -26072 -15933 -23716 -51671 -67134 -62368
14975 -62368 -62340 -62713 -83327 -93027 -62923 -38417 -42045 -66073 -56171 -35047 -50289 -49709 -35640 -21133
14961 -21133 -2976 94 -8554 -40188 -31174 -27991 -4110 21122 14112 -9239 -27184 -38962 -39932
14948 -39932 -5859 -10837 -18756 -669 2932 -4285 -18376 -24887 -33149 -31839 -29968 -28398 -27232 -9667
14934 -9667 837 6755 6832 -1343 -22766 -37047 -45329 -34064 -50112 -29540 -7855 4720 29925
14921 29925 27778 -4644 -17247 1390 21367 18056 37917 25334 9340 -20365 -35682 -25026
14909 -25026 -21339 -14082 -19202 -18804 -13263 -5325 -13184 -24720 4861 28271 18874 -3387 -5414 -33353
14895 -33353 -49033 -50457 -22062 -23871 -30771 -13320 -21969 -13858 10821 25369 31251 36823 30650
14882 30650 26708 6035 47554 58425 27790 8282 -4140 -21564 -9853 -3993 20125 36366
14870 36366 57721 53521 62082 48369 29537 6885 -8454 -34212 -57152 -35894 -3681 -1281
14858 -1281 4652 4759 -2679 -13171 -2940 13864 18925 28546 20310 1411 12617 -22131 -28880
14845 -28880 -34091 -54540 -27133 -21542 -10806 -9883 -19741 -32950 -37732 -27553 -22562 -26386 -35871
14832 -35871 -35054 -19172 -15279 -4468 -5443 -31576 -51487 -43926 -50380 -42370 -42291 -60184 -50826 -37603
14818 -37603 -29272 -2343 9966 22158 16092 -5336 10176 10834 -11336 -4998 8079 -2423 -20579
14805 -20579 -26353 -28314 -24126 -26590 -29284 -17434 8 31908 32647 15521 25170 31929 -2086
14792 -2086 -6608 19137 52269 71175 49121 38019 19009 -9503 -19144 -24169 -64067 -62335 -84327
14779 -84327 -75324 -62967 -54605 -40550 -21296 -26665 -41904 -21399 13261 -11973 -19830 -32607
14767 -32607 -18210 -19944 -23390 -14294 -11016 -15258 -16930 1909 752 -31316 -35437 -39846 -38563 -41598
14753 -41598 -50319 -40161 -27079 -35209 -36612 -28661 -32012 -14560 -2295 -24793 -22564 3695 -9939
14740 -9939 -5801 15762 28679 17336 8040 2748 -8622 15175 28257 14974 14966 15585 11622 11164
14726 11164 -5055 -50667 -55442 -36583 -9887 9946 16168 11136 11525 8982 20121 12681 30761
14713 30761 33554 7534 11755 4661 -16442 54 -12154 -9602 -15857 1937 7037 9357 25322
14700 25322 25202 -10196 -17665 -36989 -64911 -63592 -50686 -17414 30 3823 6062 -3025 16066
14687 16066 9503 6665 26009 9579 19659 27270 9235 -1436 -24290 -34977 -48045 -16901
14675 -16901 1963 6828 -6835 -931 1156 11089 14677 16278 9847 5701 6591 4279 9611 17365
14661 17365 20434 37085 30869 44813 46096 27645 41945 25770 26113 20278 5549 -14588 -8544
14648 -8544 -10839 -2626 1897 -4117 -8420 -19825 -11947 -7398 -9283 -18932 -14772 -12453 8046 26922
14634 26922 18396 -18534 -44826 -45228 -35002 -51705 -25158 -6735 -17533 -19784 1763 9333 22781
14621 22781 16750 7508 -9440 -27090 -31187 -29348 -7262 6178 15122 20302 7103 -19366 -36931
14608 -36931 -56350 -44448 -38881 -25728 -43909 -38928 -27598 7067 13158 23236 28087 16193
14596 16193 10869 20795 3278 -38185 -33289 -14513 19820 52835 40653 9542 10157 31498 9837
14583 9837 -10424 -28622 -27368 -30283 -8639 3117 -19176 -23413 1081 -2926 11929 27548 38424
14570 38424 30462 28719 11570 5917 18244 47388 54486 33922 32584 30193 32485 35054 -1328
14557 -1328 -11312 -11834 -15274 -16100 -9709 -12408 -26514 -16868 -17383 -40281 -60571 -62563 -38018 -12175
14543 -12175 9830 5157 24298 34543 35009 34312 20204 1256 -10160 -30200 -53609 -33531 21074
14530 21074 37555 15172 27191 12221 -9448 3958 10917 -13662 -32133 -26648 -9726 -955
14518 -955 6913 -10524 -22687 -7727 3682 -10554 -21391 19498 22112 20847 11463 13802 -2112
14505 -2112 -7700 10241 36174 36597 25766 19781 34073 20264 2341 -8533 -23659 -41569 -39797
14492 -39797 -7611 4804 -4764 1014 8910 -11560 -30559 -36581 -27054 -6801 5237 37458 45485
14479 45485 52350 45671 59037 56108 48117 54555 41173 16879 193 -3266 -9624 -2353 -2751 -555
14465 -555 -13575 -28785 -37336 -13097 -17420 -12487 9055 380 -23539 -6373 23614 29699 12071
14452 12071 21754 32437 32029 34941 55423 53813 54694 32324 199 72 8220 21120 4586 -17716
14438 -17716 -11089 -19597 -10738 20716 26631 -4719 -16214 -10028 959 -1295 -1608 -8251 4628
14425 4628 5377 3452 192 -23231 -48304 -60761 -67840 -49952 -7912 8969 13307 1995 8753
14412 8753 6098 31505 52508 57763 48193 21154 -15132 4530 24202 14293 -4459 295 -18355
14399 -18355 -17210 -39591 -18423 13305 89 4569 2209 -28769 -49063 -43998 -19467 23451
14387 23451 41250 8213 -14898 -7234 -15270 -29691 -30756 -44251 -54671 -8914 5225 20147
14375 20147 5910 -23611 -13678 -11295 -15582 8568 16071 22431 18932 9781 -25095 -22429 -8775
14362 -8775 1950 9919 -23065 -5283 -7756 6317 27164 3687 -16188 -29813 4848 -2963
14350 -2963 -15227 -4270 3539 23954 -4816 -26444 -25578 -8019 998 1078 -21091 -19946 -15643 -4376
14336 -4376 16898 25158 24120 11843 40641 49821 24710 11825 11987 31373 55013 63357 71232
14323 71232 59781 31671 27930 30490 30095 38242 39758 32163 40409 18058 1817 -970 -18464
14310 -18464 -1140 12321 30732 30926 26841 37702 33469 33547 29022 6013 3010 4419 -25227 -24419
14296 -24419 -15031 6122 24188 14785 11297 -9662 -5006 27392 45669 48016 33573 35968 21299
14283 21299 -7561 -16889 -12407 -14474 -11774 17913 14586 13261 45538 46548 40585 43991 58151
14270 58151 65854 43300 9610 -1919 8054 10228 4472 -16601 -362 -2823 3045 6234 -20572
14257 -20572 -6303 -1748 9954 14862 -480 7260 21291 36702 33289 36653 38842 50349 58628
14244 58628 5359 -34061 -2862 14820 13089 5368 14616 -5277 -28388 -58831 -32971 -11743
14232 -11743 1543 8951 3429 -15131 -1305 1722 -10724 -9633 11009 18958 -8794 3382 6351
14219 6351 6079 14534 -2629 -33552 -49611 -14323 5791 -21042 -26800 -7240 6519 9586 24704
14206 24704 45177 39879 33225 50090 65054 54336 31615 14181 16127 16315 27076 40326 47140
14193 47140 24407 5025 25983 31428 19961 29265 45930 55588 34053 23056 29001 11199
14181 11199 -19148 -2506 16649 34182 28960 7994 12969 22894 21601 22800 39973 41660 22680
14168 22680 24190 12063 5000 -1008 9452 22583 4117 -4125 -14381 -9769 -33241 -27877 1057
14155 1057 11826 3604 -4920 -13520 -31220 -36275 -64291 -64120 -34581 -14814 -25794 -30602 -11129
14142 -11129 -7155 -1483 5179 -285 8033 15826 6545 14564 18218 1053 -24018 -37512 -38352 -27283
14128 -27283 -13660 -4330 -26961 -27501 -5021 -8961 1587 15963 27118 22172 28542 35578 39039
14115 39039 26958 34497 34858 48924 40245 25950 -71 -6254 5595 2171 30072 34136 38570
14102 38570 38197 29903 20007 19992 39705 49831 1866 -22939 -9848 -1998 22355 39777 56626
14089 56626 73482 58464 48880 18846 13565 29617 31744 -1394 7478 19188 30882 49355
14077 49355 46795 30731 33850 58341 71258 47692 29561 41180 43560 40853 20568 15573 25229
14064 25229 26293 1482 -26331 -26984 -22259 -17754 19563 36456 22564 30132 15159 29436 24494
14051 24494 22732 52768 55041 40639 57867 65813 48569 42549 22151 42596 38836 26711 32492
14038 32492 12856 10302 26900 21070 44892 25041 31107 22908 -15201 -18914 2251 19025 20100
14025 20100 18957 33221 19158 -9245 -11251 -14806 -15097 -8999 -1138 -2423 -7398 -6445 -3137 4402
14011 4402 15082 17968 3096 2825 411 26126 29866 31447 41861 37068 43989 53467 41549 30360
13997 30360 24392 37519 7073 -13769 7586 16634 14747 11373 17479 16052 12738 18313 332
13984 332 -5033 -230 5382 -657 2875 -25938 -40695 -35790 -38970 1949 40041 38245 9228 -7222
13970 -7222 1122 13255 54127 62908 68696 55689 33010 21087 38452 28040 25865 12873 14739
13957 14739 46628 47680 45084 45646 47995 28454 51777 47778 42489 27352 20277 8595 18706
13944 18706 37083 16700 -1743 4819 5169 24069 33881 42007 29002 4874 -4492 -21368 -10859
13931 -10859 -1183 12612 20264 14765 40787 53077 49359 29789 35748 69725 67911 64785 42833
13918 42833 3037 -6048 -337 13904 39555 16427 -3263 4487 -7068 -1253 12130 27851
13906 27851 43925 22645 -13786 929 11191 -795 8234 16243 29882 42585 58196 52180
13894 52180 50276 56780 28361 10971 28558 10088 2712 -17308 -28376 -29359 -20504 -18741 -15785
13881 -15785 -11583 3044 18039 40229 57166 64552 72537 62683 58725 35820 18180 18776 25167
13868 25167 34628 11093 19281 15123 10649 -9148 -8235 18651 12957 17086 19068 22958 35437 24839
13854 24839 235 -19014 18831 26239 19279 42988 21391 -15347 1055 28314 61396 90928
13842 90928 59990 13087 9447 -8359 -13271 11893 8693 15061 32859 19542 23072 26581 17480
13829 17480 -3640 -38411 -34669 6962 22288 43476 48035 30584 19445 33078 40248 26445
13817 26445 49066 46528 44443 48406 44182 54633 57390 34230 11896 37324 30447 47274 75087
13804 75087 76723 83412 50724 33074 33616 10405 8221 24595 35403 48299 36472 48660 59063
13791 59063 37905 13820 41665 54717 16777 7083 16784 31671 31158 31372 23422 39730 44197
13778 44197 45507 50505 35327 15147 38216 53718 43505 20563 7311 7778 2502 7646 35700
13765 35700 35750 28754 16688 32289 43085 37875 27611 18823 19305 35654 65299 66901 18068
13752 18068 6269 42468 48532 13466 35543 63395 88194 84769 77306 55238 87106 112841
13740 112841 108943 63800 22293 20963 10625 8984 14906 18937 15999 10260 -4282 -25626 -12563
13727 -12563 6380 22186 18353 3836 -12429 -20859 -33200 -35516 -21746 -7672 26878 54072
13715 54072 4143 3520 25792 38164 538 -26487 -17838 27498 45813 29016 37386 63777
13703 63777 49328 26243 6093 -1415 -781 -4698 15557 9715 -245 21348 32917 17691 6969
13690 6969 31072 34938 30782 33187 9180 7564 26036 40913 29589 44218 32848 15623 2097
13677 2097 13684 36705 74800 88131 61976 44548 9340 9708 39198 63818 53711 63981
13665 63981 64304 33654 20024 37042 47965 51879 38051 43920 51152 53840 62482 69645 64663
13652 64663 63881 82521 78984 56288 48044 33044 7557 23176 22319 25402 39529 42199 46265
13639 46265 53920 71713 88706 85087 85353 49582 43331 43668 56030 71237 86921 78208 49503
13626 49503 26964 50208 53464 53279 77932 70850 67985 73144 82184 80463 63543 58613 42668
13613 42668 40700 25116 8337 -1334 7370 7177 31926 49844 58706 65289 57094 25737 21519
13600 21519 30353 47074 57376 39120 35441 49416 31096 10597 13344 238 9136 29593
13588 29593 24965 20655 40406 65539 59141 55759 59038 86751 98538 68276 38427 51931 85806
13575 85806 85860 88926 75786 50382 30509 25421 33994 50014 38995 33045 17092 48393 80966
13562 80966 92672 78119 58757 48349 47558 59837 72144 51367 37001 32391 46846 59813
13550 59813 50172 30767 35321 17336 30305 75220 98534 96804 100570 67545 50181 51541 83151
13537 83151 93596 83973 63148 44500 34938 57109 79582 69446 87433 71397 60419 78848
13525 78848 75536 57721 41735 34488 25738 12122 14449 32435 47904 78314 88619 74304
13513 74304 63724 55432 57567 81464 82760 78420 63483 61841 56159 34209 56754 82446 71501
13500 71501 59318 91964 91624 72663 80749 82511 66805 69455 78582 76164 47088 38818 56355
13487 56355 65936 76738 82527 61037 81666 59626 52653 37337 40007 57553 47537 64438
13475 64438 96569 105419 101918 124484 114652 71620 46437 49594 73795 75226 83517 116485 133421
13462 133421 106586 90917 81382 66212 44090 68679 71667 63929 54801 34502 26177 39486
13450 39486 30284 12364 16616 21839 37597 66130 78399 85707 78513 82201 79038 81793 75260
13437 75260 62946 53431 51615 55922 71512 83579 61269 37783 63483 85710 74810 76977
13425 76977 72466 51957 37428 54358 63428 54034 61194 62443 51725 57516 57137 55230 44161
13412 44161 41199 54304 31198 25301 36296 16517 16069 60916 72579 54056 34878 65609
13400 65609 77859 71489 81135 73579 65865 37756 41760 74484 64884 54173 73029 74573 65916
13387 65916 57900 83224 90161 82044 61807 54036 67716 70182 71926 88227 87987 86430 84106 82806
13373 82806 82153 72781 72557 60964 63645 68191 52822 49620 67299 68910 77261 66157 47288 60336
13359 60336 65839 86048 74836 72777 80960 80828 92539 94743 111775 88014 73127 86630 99037
13346 99037 81868 57452 69516 100926 117109 92307 67092 47266 56735 62247 77412 70094
13334 70094 61968 61547 65200 59663 85436 70075 57967 71616 86051 101035 97432 103482 108657
13321 108657 88844 94184 88361 68672 87354 105159 101128 103548 105183 93476 96030 95847 84103
13308 84103 47124 39095 53031 76299 78453 65509 47350 47263 40918 62573 86792 91334 92395
13295 92395 89054 86344 76173 52704 71830 87987 84569 78040 84927 82940 77876 94222 82884
13282 82884 99438 134182 127256 111892 95906 104221 103569 109194 88490 83766 87041 78882 76128
13269 76128 92207 102106 115723 107769 94607 86761 94439 97146 98424 120158 127609 120640 92795
13256 92795 101345 106887 92345 77496 92523 91414 90682 89217 96858 84983 74488 77323 79761
13243 79761 81434 91329 90523 69031 52120 50861 79599 104306 114411 133860 149164 131525 133816
13230 133816 106715 116527 116162 116689 106859 88058 85096 111175 125795 151169 160454 157535 144180
13217 144180 147563 145715 137173 125560 105325 98175 103962 113091 125996 119316 94296 92986 92396
13204 92396 101580 99481 104717 113440 116319 119788 126922 146140 118494 93816 78809 88912 114812
13191 114812 112188 94178 98490 104264 117474 125776 120264 123520 118215 115207 103625 104964 101021
13178 101021 102333 105392 106432 121508 142493 142319 128045 102971 83628 80211 83906 80695 116550
13165 116550 102491 79315 82944 109060 130061 130249 133983 127713 145466 156770 144090 133546
13153 133546 119961 138960 158681 169004 146195 139190 121437 118890 126224 136829 135397 94838
13141 94838 93599 106391 104118 93198 97940 120668 136873 121084 111393 127096 130413 130349 144006
13128 144006 145384 121029 127043 150320 150947 128276 132491 136945 158380 154489 139968 113492 77137
13115 77137 75049 93266 108724 111496 109785 112666 102602 111777 142073 145605 125294 111207 116222
13102 116222 125903 120091 128248 118773 126842 117333 115931 139387 130614 107227 123580 135938 135409
13089 135409 130804 130217 124926 106376 108742 145106 170221 170657 130089 107750 94301 86460 100074
13076 100074 122059 138790 146333 141778 135810 140525 157518 144833 117115 130960 161328 191278
13064 191278 189227 172321 173023 186073 201898 191408 178329 175683 165445 190685 196956 182748
13052 182748 152055 131497 134325 164111 179305 170465 175009 172370 173751 179481 156908 143428 128192
13039 128192 130123 159192 159654 143941 160397 156863 152660 144741 145982 147864 148375 164839 151523
13026 151523 147753 154024 153363 157465 142119 157966 183169 178150 189019 210788 216076 207035 211453
13013 211453 189565 179497 157335 123397 139230 177953 229659 240990 185583 133011 131950 161138
13001 161138 170712 171396 165723 188258 195197 183722 168757 177637 183103 168129 167912 157384 172818
12988 172818 178050 182471 180364 158782 136281 139874 182804 170880 168724 169752 166180 154961 159672
12975 159672 149522 159745 184503 190199 182531 172386 185664 168575 152994 171207 174163 164017
12963 164017 158735 155305 159518 165631 175235 190879 192206 171438 189094 216798 222867 205772 194954
12950 194954 186413 173438 182545 186747 190385 205271 195231 171715 169264 165130 207063 208178 220289
12937 220289 225211 212150 209156 243450 229664 210881 212415 189671 178144 154539 163699 184583
12925 184583 174061 170914 196107 186692 190433 186630 195929 208237 221236 234842 217882 214548 225464
12912 225464 245725 238242 207567 191529 197925 202701 187253 167519 177989 181239 203606 220716
12900 220716 222815 234064 237431 223839 203714 206133 194612 188764 212812 216241 216205 189644 188830
12887 188830 190772 187265 203199 235534 247687 203576 195875 181943 186341 224317 226097 217000 212349
12874 212349 236966 232553 213220 230194 252888 251725 240622 234677 218578 235841 258604 254178
12862 254178 232154 207978 208094 218618 220319 220686 207859 190348 216216 237508 260791 275769
12850 275769 267956 260048 254924 244599 246983 258034 262747 239602 238108 257390 257700 245549 226123
12837 226123 199403 197335 212014 239553 253065 258024 257833 277121 305560 282002 267518 273171
12825 273171 299095 301145 301394 294335 298547 274536 255692 247965 244685 249351 261267 270754 282248
12812 282248 273309 250827 246727 242653 249686 253794 261626 265642 255687 257651 288500 282792 284811 304409
12798 304409 309426 293466 285859 308617 330561 365794 353789 343470 336469 325854 299280 295019
12786 295019 285613 306070 311007 295601 303962 306051 284846 280457 275905 267400 301657 335400 340863
12773 340863 337944 325911 313241 303962 314980 332576 328233 339523 330558 284735 281854 321974
12761 321974 304109 295654 302270 285735 291263 301891 302064 303885 306579 310390 322684 324035 290111
12748 290111 292160 296027 306512 313788 333713 324387 321138 353899 370925 347630 345627 320552 327595
12735 327595 329320 345524 371667 334063 312275 362290 363778 369474 363160 342921 344153 361847
12723 361847 360898 349561 358878 365515 381782 386855 401312 409099 377854 387274 369154 335280 348162
12710 348162 379861 385310 368376 350397 367966 356575 335445 359953 381426 387286 389731 385149
12698 385149 387894 389483 380958 366511 387783 398437 400336 385543 396317 397441 390884 386729 351161
12685 351161 350597 402929 428725 416494 410234 393065 418846 447540 423635 382841 364879 378094
12673 378094 382813 387329 383966 383994 397126 368393 366155 392817 379248 362729 383572 385597 409625
12660 409625 425273 410672 420246 416992 412025 395174 394832 418779 431980 431417 422227 413746 401485
12647 401485 406561 429304 409842 406113 390976 371133 377151 399876 430058 449652 439172 421950
12635 421950 409437 403879 410566 421089 426465 424040 429659 453268 465132 452511 455615 447340 438265
12622 438265 450496 458582 468893 486359 466918 472667 454719 455529 467076 471116 478582 479211 484505
12609 484505 511032 529638 506918 470145 476311 468689 461149 472821 488423 466854 476474 500862
12597 500862 490906 479542 481161 491757 506344 525545 525949 554037 552846 526672 494031 471609
12585 471609 494342 493310 490826 482232 495822 511565 505041 521396 510013 502918 503086 513456 510800
12572 510800 510178 516925 535230 533526 531204 530528 522326 540233 550816 544182 522229 506680 530692
12559 530692 548221 562791 568518 542055 522566 552461 577225 564390 549076 537061 536073 511947
12547 511947 517579 528416 544219 579998 589237 577165 580459 565717 545589 566843 584268 597528
12535 597528 603907 621699 630306 611672 591259 591796 594833 585692 571729 605444 613885 599421 602060
12522 602060 611831 623094 623981 630774 634383 624198 626598 647364 657130 645105 615846 618356 633828
12509 633828 643601 649879 653190 639254 627982 613888 603504 600698 604659 620131 638263 655007
12497 655007 694372 698009 700010 700947 707975 707865 716356 719088 702069 718283 726024 735745 736872 722525
12483 722525 705818 674883 663421 678189 664573 674383 679927 696601 716291 708978 719345 732450
12471 732450 733168 738510 755258 792889 779946 744996 749902 749851 745220 728618 723015 720537 737815
12458 737815 773077 765010 752988 745916 746817 732181 745038 787599 806836 805186 789929 766810
12446 766810 776208 791607 783905 779735 817558 845251 836263 795172 773364 769121 791809 807999
12434 807999 832221 836163 857612 855552 861834 867620 881530 884384 892584 878286 855317 863153 841502
12421 841502 843726 843063 844020 862767 901865 917418 901236 882705 861544 860458 875993 892421 911538
12408 911538 922265 928111 921579 916857 935919 959222 945998 941224 946049 949609 951072 954507 945986
12395 945986 948274 925321 955922 962447 941527 931949 970620 980084 962066 958189 985533 1003918
12383 1003918 1017759 1027528 1031540 1048054 1049117 1041303 1028261 1048554 1070872 1051249 1065734 1101953
12371 1101953 1079054 1053736 1057857 1080179 1103176 1093595 1098791 1083833 1081199 1098032 1108640 1125950
12359 1125950 1129453 1138105 1127771 1104519 1087355 1089644 1126087 1156016 1155462 1127278 1128530 1122386 1116572
12346 1116572 1152609 1161355 1147779 1150511 1141956 1151440 1179290 1192215 1182999 1170863 1173320 1196731
12334 1196731 1208381 1216424 1206802 1199755 1213734 1237758 1259905 1255563 1257427 1254868 1262728 1291626 1271622
12321 1271622 1267338 1255789 1241469 1262569 1275213 1289643 1287763 1297148 1316175 1336001 1366767 1374277
12309 1374277 1350052 1336545 1354089 1359350 1343434 1363253 1375589 1404765 1428653 1413974 1419099 1398537
12297 1398537 1405449 1430848 1440000 1441120 1455772 1444062 1417757 1403078 1408714 1442248 1476056 1476489
12285 1476489 1473633 1483409 1499861 1507475 1501412 1493046 1486423 1504440 1531775 1514593 1520813 1530508 1548021
12272 1548021 1548582 1560443 1574486 1550970 1550780 1552594 1563686 1589846 1576704 1600187 1605692 1629203
12260 1629203 1638915 1620084 1638487 1635718 1637753 1673591 1685262 1680879 1685051 1708466 1696450 1684677
12248 1684677 1705832 1705971 1687629 1708964 1728998 1754522 1767940 1791690 1797458 1803435 1801078 1791629
12236 1791629 1777987 1800647 1800676 1804889 1797159 1806487 1802553 1803702 1840251 1828412 1810025 1808611 1834102
12223 1834102 1859840 1866942 1862866 1871335 1871591 1868887 1877882 1891972 1890750 1889210 1899866 1925015 1946371
12210 1946371 1975222 1980238 1975360 1967899 1971861 1999734 2018693 2035598 2029125 2018260 2019493 2015805 2058339
12197 2058339 2098300 2112438 2126719 2112120 2117436 2112524 2107296 2133941 2154933 2155379 2168370 2179254
12185 2179254 2213914 2218096 2220005 2230324 2216892 2182303 2190452 2192882 2187129 2173740 2175373 2201710
12173 2201710 2234358 2213876 2203151 2241084 2247056 2251634 2254047 2255037 2270925 2282612 2279603 2247972
12161 2247972 2244746 2269396 2284682 2323718 2341106 2329919 2320372 2319560 2330218 2346261 2380226 2405618
12149 2405618 2402862 2387902 2359293 2346582 2334670 2346054 2379939 2396004 2407250 2423496 2461443
12138 2461443 2464628 2456767 2465980 2451330 2449907 2457359 2461762 2473529 2486423 2484941 2505512 2516184 2544075
12125 2544075 2533069 2521923 2521691 2523174 2535534 2538047 2533425 2555865 2596280 2608492 2601453 2599297 2609803
12112 2609803 2610976 2618930 2623138 2603287 2579190 2577778 2587304 2596474 2632217 2657657 2634182 2634411 2635207
12099 2635207 2650559 2687818 2704199 2703507 2689507 2670185 2650787 2663863 2676315 2660307 2651299 2674632
12087 2674632 2691222 2728596 2714427 2705125 2712149 2722889 2746072 2748431 2708468 2703623 2704826 2681873
12075 2681873 2668958 2686253 2701042 2676802 2677814 2668854 2672602 2674283 2687031 2704925 2702010 2714865
12063 2714865 2722813 2748826 2762620 2766267 2781581 2798602 2778729 2738709 2700780 2703707 2715610 2725667
12051 2725667 2733509 2753286 2768336 2762502 2737635 2720952 2741799 2765045 2759083 2765449 2755525 2747713
12039 2747713 2753633 2751326 2724753 2722329 2783839 2779919 2750928 2750842 2741548 2737278 2731963 2739610 2753568
12026 2753568 2757877 2745969 2754629 2735965 2728002 2732414 2729708 2702315 2706081 2706110 2709021 2718652 2728370 2692219
12012 2692219 2666428 2660605 2653174 2664227 2688650 2673783 2646053 2654168 2661097 2652765 2653255 2666298 2671178
11999 2671178 2692355 2663493 2657841 2662396 2651120 2649111 2615078 2609931 2633293 2612004 2581583 2569647
11987 2569647 2565424 2557463 2549221 2531697 2521984 2537242 2551776 2586438 2579194 2543836 2522439 2512505
11975 2512505 2514934 2530970 2541186 2549444 2546193 2531464 2520828 2496684 2488453 2496780 2484720 2475633
11963 2475633 2493270 2490337 2492451 2465388 2417995 2397984 2394520 2375469 2385348 2369710 2369295 2364097 2362563
11950 2362563 2360809 2363629 2365553 2346398 2330012 2313926 2334185 2331829 2320659 2320534 2328076 2344107 2351604
11937 2351604 2333539 2291025 2268579 2273675 2287019 2290864 2301909 2267506 2246741 2252264 2248079 2260238
11925 2260238 2248153 2229201 2216361 2214601 2205462 2187481 2160674 2152787 2154498 2146893 2129096 2118482
11913 2118482 2127562 2127318 2119123 2117578 2087169 2074943 2059898 2066137 2070497 2089614 2045304 2021627 2030160
11900 2030160 2026162 2005505 1975286 1967277 1984525 1978557 1933000 1899968 1907893 1930109 1988559 2005252
11888 2005252 1974578 1955389 1958863 1926294 1899192 1896862 1922200 1919753 1924239 1893363 1851540 1825377
11876 1825377 1846825 1849154 1850621 1862146 1860893 1850565 1857459 1855811 1829249 1827137 1831627 1815431 1796490
11863 1796490 1767009 1759213 1788345 1772080 1744785 1749269 1754662 1746923 1741351 1735723 1701709 1675874
11851 1675874 1679756 1674097 1682417 1675636 1661110 1644823 1612669 1594797 1618978 1605866 1582230 1563079
11839 1563079 1562953 1578711 1580735 1555258 1548037 1556530 1545232 1546493 1562517 1567791 1551973 1536445 1510485
11826 1510485 1484670 1473436 1476504 1507657 1502857 1487710 1481650 1490275 1484502 1471698 1483043 1463748
11814 1463748 1454046 1435119 1423758 1425556 1426225 1431819 1440069 1424592 1428711 1413225 1381382 1376730 1389878
11801 1389878 1378333 1344780 1347126 1354656 1334234 1327439 1326963 1334637 1349457 1368144 1355277 1340047
11789 1340047 1319158 1318192 1337738 1315493 1289843 1279409 1274980 1250403 1240047 1251546 1246342 1273932
11777 1273932 1276727 1278951 1289838 1306547 1268544 1250356 1246481 1241300 1255974 1267105 1272462 1249387
11765 1249387 1246246 1232863 1220325 1190669 1193489 1184050 1179412 1167667 1150244 1143464 1120831 1091338
11753 1091338 1093813 1115729 1102606 1095492 1102856 1116972 1113588 1119165 1116380 1101501 1087157 1088162 1077533
11740 1077533 1058206 1046169 1033734 1022049 1044309 1044426 1062111 1079383 1076280 1077427 1056125 1047608
11728 1047608 1048416 1055662 1041705 1009426 1013670 1014647 987162 942477 929522 946425 953255 987495 961985
11715 961985 948450 946174 951979 939376 931152 930474 937716 922324 912222 894978 893681 911312 888747
11702 888747 880000 878410 869072 836091 852074 879077 896699 900024 896164 896257 909344 926150 901086
11689 901086 890234 860370 863391 853441 844429 845242 844193 812428 795926 821917 820408 820313 834793
11676 834793 827814 832077 810289 787994 790029 779736 801241 811743 821812 821252 801413 777602
11664 777602 755889 741215 735543 748464 749413 717687 726766 749241 750279 749552 759452 748750 741075
11651 741075 760232 733039 715015 711886 710366 721582 719231 695138 669311 673006 675925 685103 692538
11638 692538 693724 692510 702836 722810 707903 704021 693988 705624 698752 665730 640240 651611
11626 651611 691566 705467 688981 699887 668427 631695 623688 627541 645450 643043 669297 664091
11614 664091 654770 670587 662934 651237 646773 647964 631307 630814 644121 658226 668483 642879 633396
11601 633396 642309 601301 569051 588478 602589 595135 605604 591619 570268 584765 603673 604233
11589 604233 593440 587920 587117 597885 593776 591276 591598 572853 574487 601852 593171 571090 555269
11576 555269 575998 583225 571741 583262 587624 570921 528573 526080 534362 558095 557536 559156 561514
11563 561514 545533 527102 502374 518531 551581 560776 563921 545892 538366 538152 536736 545990 549820
11550 549820 559817 559113 546972 541946 532581 539285 540146 545258 536506 524895 526672 528788 559209 596078
11536 596078 599940 598687 582707 590463 565424 543988 561292 566024 573873 564640 544964 525463 487439
11523 487439 471583 499042 515513 510153 489990 471719 487879 488961 472288 457664 471423 485084
11511 485084 484071 481718 481403 476844 484729 465853 468144 462533 450901 449478 476130 480319 478078 469837
11497 469837 481612 461341 460995 458884 446226 447000 456509 451080 469552 472394 446664 429169 413290
11484 413290 422764 435175 457931 462909 429507 402829 411262 422387 397402 411207 445054 470036
11472 470036 468265 442684 415431 396187 403865 422037 416456 429837 427792 430804 436511 441807 438547
11459 438547 418568 411106 398669 399140 435725 436328 429708 434965 435678 426908 418253 402284 391900 412704
11445 412704 415505 415313 438553 453027 443554 453269 461538 451344 441189 423708 407649 403446 394457
11432 394457 398672 398452 403695 436284 462537 439878 397145 374648 386852 403135 404225 421992
11420 421992 401540 403811 413922 423846 469576 455797 413673 385908 369806 384405 426324 428780
11408 428780 414999 390200 417258 405399 378669 385211 383201 379802 356761 363402 372468 387998
11396 387998 395277 366246 346306 373261 400118 385874 378437 381230 367484 365619 353591 351339
11384 351339 395354 402931 389874 370675 359118 338659 331647 354459 351342 352552 347166 331771
11372 331771 321285 341401 374473 373107 338271 304089 347019 337184 342022 354540 352134 354852
11360 354852 356355 393606 409220 421297 421558 403470 375525 419617 431147 414005 419066 437578
11348 437578 421145 403634 403764 398107 385602 363739 350821 366679 360258 365529 372323 388972 377636
11335 377636 381757 393295 406738 405790 407337 385629 357556 362114 375190 388146 364278 381657
11323 381657 389995 357747 366812 368965 379363 427267 446363 435593 429478 451833 464607 439066
11311 439066 448616 450149 423499 447668 480452 506514 490007 483974 472530 444814 432114 430271
11299 430271 428621 432931 422330 421463 415922 404487 436260 451045 446110 450709 442953 424100 428420
11286 428420 422772 414151 407056 403092 394289 393213 401333 438860 478840 517588 551910 554262 547299
11273 547299 570608 641313 696831 709644 784317 905561 1047950 1254261 1517458 1758907
11263 1758907 1921862 1867805 1706654 1562724 1502451 1534449 1657758 1811074 1936945 2030994
11253 2030994 1999683 1810303 1586548 1374695 1218489 1109594 1000350 909974 839956 804526
11243 804526 792056 772072 794296 836905 866531 914996 967555 1014382 1108253 1221081 1398293
11232 1398293 1593290 1832893 2107161 2318487 2414145 2365457 2162611 1866834 1567705 1352875
11222 1352875 1154045 1023405 904958 826744 804787 767830 709408 643884 584770 560110 539638
11211 539638 498174 483192 490936 494346 489871 483113 472470 468430 460603 458813 476184 471700 448939
11198 448939 426735 391718 359585 355134 356467 387460 414785 415511 410243 402985 387792 360631 360188
11185 360188 363075 343454 314883 310847 281120 271596 279571 273791 283654 319598 352155 329387 327804
11172 327804 335209 336117 316921 274037 281911 317826 324514 326179 304304 299352 299159 302714 302883 271248
11158 271248 235397 251416 262814 245987 268294 282490 261335 238971 232230 235391 231111 204536
11146 204536 236045 242147 235968 228758 227371 244456 251803 273408 291383 301133 275164 259748 299719
11133 299719 276721 249531 264808 267558 259619 258952 277030 288254 295688 291168 260001 271412 255378
11120 255378 251797 270007 281902 296195 345264 347796 351349 347192 347558 377290 426811 455724 443840
11107 443840 426984 402561 356467 319871 288221 295069 302382 322443 345949 336474 312542 286551
11095 286551 250930 243285 239381 223115 204666 206212 209928 214864 230587 250262 243766 224297 210163
11082 210163 215827 213777 242158 258154 242319 230539 238496 262137 289830 289568 279081 315896
11070 315896 308025 267134 240316 240132 235024 234101 227554 189289 154485 143890 131471 110314 100943
11057 100943 94412 91387 119063 155527 168478 180080 194738 218319 258405 262685 300589 303299
11045 303299 285375 278395 270194 267830 290247 296837 296252 326066 378578 407505 421988 409238 387409
11032 387409 357071 315837 312124 323996 343944 382244 418357 484457 552036 569709 560714 513921
11020 513921 506243 507832 482501 465086 456826 487347 568843 634308 755830 910105 1047897
11009 1047897 1223113 1427684 1731344 2009811 2108407 2060946 1844036 1495311 1163508 900576
10999 900576 750948 634793 540431 463572 401147 340392 298249 283260 269040 266147 233852
10988 233852 194586 175393 190035 209061 214111 236055 237919 238687 210199 208111 218072 222689 209107
10975 209107 193349 193952 160590 172503 166220 149993 160061 195666 211895 197590 180402 154669
10963 154669 156091 158817 174437 176069 148434 143560 145833 161624 197425 212503 224439 222239 219114
10950 219114 202369 187020 168365 160858 160239 152127 159984 145819 141095 153674 166594 155347 169449
10937 169449 174201 182057 188537 174679 152292 166685 162170 157386 153508 142852 153018 160127 138007
10924 138007 102956 93364 106625 107766 94869 99895 126166 122830 108644 112724 125575 132990 130964
10911 130964 175776 180372 162921 174675 183796 180641 181116 160800 98405 91686 100196 103592 96051
10898 96051 74809 91368 98659 86125 81704 97030 100756 127490 118518 103626 102394 104919 108039
10885 108039 105694 83699 84089 99034 81471 75986 87617 97878 82293 87601 87913 97182 119463
10872 119463 109549 126188 155828 148475 108832 95270 80416 118241 145698 150656 163282 160988
10860 160988 175352 205587 198465 203990 202851 195371 222136 272534 305347 341230 357650 384066
10848 384066 421246 386699 333473 285213 247579 229353 232222 197408 188693 181843 182811 173191 154041
10835 154041 121646 105041 98417 78007 70119 68526 89629 72029 78791 86938 93282 101261 88147
10822 88147 67202 68334 60164 49997 41254 54220 59172 71585 82383 99912 107424 92965 69572
10809 69572 60825 58013 67856 81015 66979 51535 29749 23248 15823 15491 1220 -4960 44236
10796 44236 50341 61302 57864 64451 80916 78258 95802 109959 121368 106263 122855 115318 120656
10783 120656 117287 136054 160591 154082 121693 96036 88228 81750 64781 54873 65432 84153
10771 84153 68939 60391 61986 81527 112041 110263 101821 137431 153196 152143 130539 118983 131848
10758 131848 124571 92496 83786 120411 117298 97337 85780 65391 6786 -11003 -8073 30065
10746 30065 45429 35276 48841 64247 75452 83439 72335 75085 86928 104000 93949 82672
10734 82672 86671 66163 58076 68094 76285 89437 93133 89118 82187 85810 71902 72460 96768
10721 96768 119284 140962 184960 174336 167998 175014 186800 170324 159187 194097 214790 196492
10709 196492 155986 155954 187587 180348 183578 213876 221124 226538 242517 264725 287086 320404 331506
10696 331506 345107 379362 436294 485798 547365 617803 615328 538967 453220 401952 362555 335774
10684 335774 325579 318604 305810 283967 290547 318848 336410 343906 346447 361486 388810 367251
10672 367251 358565 351651 354812 345787 380798 441790 499310 557460 567981 568201 607849 633700 687456
10659 687456 798212 941731 1136411 1383818 1603155 1615391 1424782 1230340 1138764 1111169
10649 1111169 1068806 1041755 1045982 1076271 1144784 1205325 1259543 1338195 1415188 1492380 1613058
10638 1613058 1735921 1899639 2049987 2241406 2442053 2660047 2862489 3072479 3276136
10629 3276136 3517475 3818176 4218801 4738714 5441055 6398840 7730121 9465674 11768877
10620 11768877 14716928 18260006 21985209 25076607 26722194 26835066 26114878 25483555
10612 25483555 25760280 27299820 30327310 35173772 42111785 51185861 61646547 71673022
10604 71673022 79697622 86818740 96856035 114717239 145432754 193522081 259760571
10597 259760571 333400659 385673167 399574810 386215195 336914639 263790168 197974514
10590 197974514 149702897 116629338 94468839 79727210 70198437 64609131 62052114
10583 62052114 61648013 61960795 60724760 56135940 48816579 41133580 34892260 30532305
10575 30532305 27841345 26480478 26015811 26157742 26628695 26735298 25760056 23412203 20095905
10566 20095905 16690079 13767602 11478636 9753248 8448275 7449541 6732555 6190910
10558 6190910 5808678 5472694 5148566 4741079 4349568 4012170 3711091 3467448 3240713
10549 3240713 3029091 2865363 2723653 2571378 2446883 2374061 2309315 2214562 2135467 2040833
10539 2040833 1935006 1849240 1775084 1721153 1669442 1649817 1646304 1633917 1606124 1551820 1517552
10528 1517552 1479287 1456412 1424222 1362324 1307118 1292306 1276244 1271288 1263986 1221844 1174622 1152066
10516 1152066 1125398 1098075 1070058 1065531 1023177 1002163 996356 970865 970845 962995 944153 926178
10504 926178 922644 916431 896926 871382 818142 792810 761747 720270 714316 719121 729439 719857
10492 719857 729045 726835 733289 732139 720444 722264 688366 685576 733836 754180 743987 725471 734246
10479 734246 734100 691802 677159 659587 624247 624640 618989 645567 652083 661945 702837 726541 748240
10466 748240 720639 678836 662104 622000 596863 597209 572385 548823 539890 518407 529139 552264
10454 552264 540120 525077 471422 448531 455674 462963 469314 451703 456215 485991 489525 488609 467561
10441 467561 469428 486410 477182 478035 449193 441485 442648 437575 414090 418269 412083 411929 431054 456301
10427 456301 441192 423248 379239 367642 368467 361125 314954 311426 344483 355929 355055 340467 355919
10414 355919 340681 343659 337003 304315 301987 305822 295961 314171 324566 304843 296746 290516 284204
10401 284204 281138 299014 324079 333925 311591 288936 287505 283203 279947 295905 289532 297536 302826
10388 302826 305733 294661 260557 244973 275570 280303 308261 302887 270532 244710 240996 228472
10376 228472 251464 267551 250857 245217 260533 273815 281214 288133 287847 266056 265106 238391 224048
10363 224048 231289 242043 256022 254526 270945 287472 330576 339187 345429 331187 305091 284135
10351 284135 287346 316300 352758 366281 390867 387372 388193 372674 336919 312967 270474 258023
10339 258023 253851 269351 275731 258044 238619 206070 187786 183186 164572 174042 182306 197079
10327 197079 207348 205686 227852 208570 182058 192301 191670 190028 182531 176642 187650 205129 208677
10314 208677 198679 205697 225441 226888 225560 239231 243980 219971 211542 226154 233279 224586 230692
10301 230692 247265 247143 238458 250466 246206 230597 238898 248025 247335 230210 251320 249866 237672
10288 237672 245353 223852 209969 183084 167941 153179 179147 202403 226978 265398 321763 401488
10276 401488 476320 586185 780210 1058468 1409283 1793397 2177791 2602955 3014905 3309988
10266 3309988 3411864 3402218 3338385 3181865 2898286 2515353 2074286 1690454 1372465 1095012
10256 1095012 845407 647511 564900 511126 478070 425841 417264 434980 426642 421911 449968
10245 449968 460374 459222 464652 479619 495724 519476 515741 518634 530237 511033 551492 617921
10233 617921 710698 829316 967666 1138143 1291826 1357184 1257628 1070979 915014 771394
10223 771394 631600 533267 453958 423130 398933 382990 360733 370927 342513 297284 287590
10212 287590 275534 243943 234687 276307 296053 316801 345748 352975 361658 355201 364985 366537 391494
10199 391494 408506 409223 419548 442946 463184 456702 440278 461324 494505 515743 533735 571124
10187 571124 659163 796071 980345 1198833 1493512 1831266 2108721 2212549 2164981 1948356
10177 1948356 1621019 1315018 1098105 977437 909935 840683 763824 737147 730489 694150 662853
10166 662853 629178 591063 568369 546727 539696 539018 517066 536319 566109 571333 589152 572744
10154 572744 511310 428180 374946 377915 369303 363399 374808 409620 437507 448714 439666 431294
10142 431294 397040 370617 360381 335045 321386 291115 314570 330058 329274 335263 327012 294236
10130 294236 264141 261740 237910 200868 177245 166967 166862 153432 149515 141902 170057 193728
10118 193728 177223 173804 171088 144260 110510 115659 106950 101699 116201 126599 108153 83696
10106 83696 68742 69163 85027 115382 127194 114621 141486 131690 91048 76583 98526 106653
10094 106653 128949 116700 93791 84480 85871 119300 148474 149845 128046 97563 91166 74323
10082 74323 103815 112083 108522 102030 99509 98674 106204 98178 123663 137067 129718 143486 158956
10069 158956 155551 141064 140921 127304 119531 112496 76487 55480 63138 94743 94889 75176 57559
10056 57559 73868 74659 94568 88476 90753 90129 87168 99534 108428 116727 92278 101093 115535 103087
10042 103087 132189 149824 136760 137857 128916 133548 142610 162381 155638 136810 87916 67338
10030 67338 87143 86111 68764 59851 62428 52412 53337 66181 82722 77439 71139 67404 78351
10017 78351 72514 61331 74001 83388 84827 112241 122544 104497 90400 102747 124806 147009
10005 147009 132583 91898 90182 99619 100033 99347 87055 67212 70831 84000 74443 74855 108390
9992 108390 87196 69621 60041 56961 52681 66785 90055 94616 82999 75619 68029 53623 67248
9979 67248 89115 75580 81579 102248 137192 147789 123734 129671 123709 131439 120894 112925 117084
9966 117084 98854 78685 67447 67957 74716 88564 60969 45566 56793 70363 75120 85260
9954 85260 91261 81310 74944 76301 77582 75295 75656 82029 79142 65083 55052 100172 117692 111143
9940 111143 100412 85465 52593 37870 29269 31800 39031 55359 57812 82801 96822 95979 113647
9927 113647 135043 143706 131043 104455 73531 86435 77299 52278 65523 80440 63199 59208
9915 59208 102693 114643 103782 62747 32137 41556 58530 83379 88807 53338 54626 58243 57252
9902 57252 39434 26467 12335 16247 44028 56123 54937 61548 63836 86915 80793 60985 54396
9889 54396 70737 95058 87206 63610 77619 72013 79596 76340 77563 79075 86004 66724 75550
9876 75550 75992 73575 61174 74039 82596 81168 72034 63882 69642 71579 90737 75204 62174 57275
9862 57275 83748 66943 56585 53460 46648 71832 93963 120976 120959 117976 132679 109986 81394
9849 81394 54918 60505 57368 77069 87666 88280 81031 67690 59254 55874 64297 58637 49443 49728
9835 49728 59034 82344 103573 133876 139671 103717 69474 67736 79752 99553 89017 76873
9823 76873 99700 111079 104803 80153 88403 79465 68715 57795 74648 75268 111838 114974 109198
9810 109198 98091 72347 42695 39306 64314 67628 56455 79201 95525 106044 92354 74291
9798 74291 71875 65506 31153 18267 44217 40403 47875 73056 81414 72597 79130 95128 87972
9785 87972 74681 79041 108457 74354 67392 83402 59248 39870 43453 47798 62215 82359 92047
9772 92047 85262 117541 113540 84572 49394 56324 72720 75880 81665 52001 20329 18409 3552
9759 3552 23400 39243 60182 61795 44633 50479 34170 42855 81013 87765 73600 68773 83365
9746 83365 89225 73157 46837 76791 93280 92308 95740 88151 50924 41882 57483 86857 79170
9733 79170 57140 80531 94842 69954 53018 46894 49418 56598 67345 42909 24329 24318 35983
9720 35983 44156 64979 52167 24630 27043 47323 62204 62043 63080 72167 85164 53848 17948
9707 17948 14648 33374 50273 59939 65337 54300 56096 63379 53320 17986 18753 43415 59182
9694 59182 39720 36490 39910 15724 -7933 -9786 10149 26151 36944 33846 33461 45177 53329
9681 53329 66088 56461 60853 22772 25670 32164 49343 73418 102253 81794 66837 80039 72665
9668 72665 49118 32736 21848 46275 37950 33649 41818 66154 108025 93722 80063 85084 111234
9655 111234 169839 233927 242278 185529 140820 86860 70484 84880 82481 71684 63378 58470
9643 58470 56260 63851 81902 79624 43629 15646 35994 53254 23863 -4226 -11410 521 10922
9630 10922 24938 29300 30090 42210 41434 31180 58715 69870 74674 83784 71613 59641 42088
9617 42088 50515 46657 34462 24611 42904 55708 28010 13091 -11808 -13197 -5681 -16608 -15716
9604 -15716 2222 -7539 -10103 21072 22103 41464 69904 61560 68132 72160 66084 40665 31728
9591 31728 12120 1303 18357 24616 35255 36424 34636 31644 24443 29708 16862 6587 10349
9578 10349 14571 18959 24005 18290 4091 6284 -12746 699 13258 44199 73632 77300 58085
9565 58085 44930 38251 19129 21974 12080 3896 17001 28287 38802 80335 72873 65228 46306
9552 46306 19154 -2009 34620 60577 51612 34174 31535 41928 40144 3033 -4587 19858 13788
9539 13788 17664 5859 -6530 11257 29798 42775 40074 60513 60831 36744 34863 33322 -8647
9526 -8647 -19840 -22611 -6030 22533 44353 41413 51655 58159 50921 55116 28865 8074 17307
9513 17307 24992 32894 22130 2247 25687 15505 6186 6056 21774 26009 31500 24451 12062
9500 12062 9326 2717 -5490 -18351 -27268 -31905 17890 51923 66841 38610 25011 42509 56858
9487 56858 34650 37775 40924 50050 76423 63601 58881 65435 78592 63581 35075 49742 53721
9474 53721 45680 21328 31085 34813 24985 37376 47777 57985 44475 38301 45245 42419 48374
9461 48374 29562 17226 42878 37359 40473 2926 3842 27526 34939 14757 -2973 796 8886
9448 8886 21969 17364 21959 43331 32927 2836 -2758 -40217 -40483 -25313 -6670 8739 10451
9435 10451 22183 29905 -3810 -6932 5327 -11727 -21600 1487 2160 -3925 -13148 -47525 -51780
9422 -51780 -21106 15278 33197 23592 -14784 -22081 25536 40571 48945 14801 -7547 -11871 6382
9409 6382 8318 7304 16119 11311 -18569 -35889 -2496 17631 200 -3815 30338 30084 31861 20907
9395 20907 31414 30696 -10611 -20056 -806 23868 53477 40808 34246 36083 5575 17464 18690
9382 18690 26241 -523 -5555 -13224 -14798 -12635 -1810 16237 14589 2159 4011 1215 2539 3125
9368 3125 8790 16155 5679 23565 61966 72684 47584 7584 18707 38386 53743 39328
9356 39328 28420 22796 29613 28539 24343 6086 8983 1441 19323 18620 12693 -6412 -12895 -481
9342 -481 28760 19165 25884 28850 15034 1297 -16269 -7774 -11302 15496 20241 -5304 9539
9329 9539 13269 -10415 -34991 -50077 -45996 -5942 27156 34957 6159 -24011 -42637 -34758 -29790
9316 -29790 -37337 -43143 -16331 8775 12042 25405 42264 46480 56695 62799 51273 37139 38849
9303 38849 37992 32175 30099 8149 9292 29395 13318 -10791 -13632 -32926 -8153 20235 18283
9290 18283 10864 -11680 -31694 -32915 -19450 -9478 -29657 -39101 -26429 4065 25428 13264 2759
9277 2759 5914 21110 -103 -1888 -3319 -9765 -8808 5304 2947 7292 33675 42456 51948 33290
9263 33290 17554 8887 2564 19146 8217 -2500 -5193 -23390 -7403 -17343 -21027 -5604 21001
9250 21001 31474 15079 11873 26382 77650 89667 55873 28604 16300 19207 38544 39590
9238 39590 -7456 -30236 13052 34451 26863 22400 -2969 -10520 -21088 -17129 -29016 -30278 -13830
9225 -13830 -23317 -3140 12493 41857 50132 10092 -3674 -9368 -20586 -12413 13597 50952 56735
9212 56735 51792 37673 25919 39182 35422 12143 6132 30349 29783 18467 18222 30487 15030
9199 15030 -8788 -12905 -7911 261 32929 29401 2958 -3994 15483 14267 -881 -11113 -5468
9186 -5468 -37582 -49183 -27446 -4803 32053 34213 49132 53603 42319 27497 13945 -2068
9174 -2068 -21604 -17550 -14461 -15856 -16077 -1274 13343 32124 43986 38393 21912 -6312 -8572
9161 -8572 4809 -9893 11236 25183 14822 3246 5815 -14562 2185 16343 34749 51607
9149 51607 34347 25460 38759 32161 18944 20205 7243 45928 56866 62716 68621 71543 77747
9136 77747 84735 57308 41034 49945 47221 54866 43742 39309 56717 51292 32001 17724 22661
9123 22661 41711 44347 36547 36265 37470 46722 -1911 -15828 -6530 -9160 -4033 -23 -13447 -11038
9109 -11038 13675 28510 -4228 -18906 -3622 34572 66119 61867 63769 54816 44915 28280 22753
9096 22753 31876 36841 27734 26228 47793 77839 88614 69105 50964 41416 23727 24054 47562
9083 47562 48382 46867 28648 31659 45591 48222 50170 65659 64315 43550 10486 2656 28308
9070 28308 45725 64075 67266 89592 87773 79658 53515 63680 71651 85786 55203 35750 63955
9057 63955 87020 92564 67483 87993 94152 62529 44813 57633 64363 64318 52954 45142 54015
9044 54015 46202 39203 39786 43452 30324 35079 36470 33280 61388 73079 70911 63705 36638 28749
9030 28749 24236 -7128 -17305 -16433 4264 10488 4214 20599 18826 27649 28339 23535 48132 47700
9016 47700 54716 80987 67793 56370 55664 65626 63860 59523 62004 69990 62755 96623 128787 119352
9002 119352 80923 76083 90207 89568 74327 70933 60413 42441 65248 49629 -15941 1680
8990 1680 38013 46106 56066 57809 44199 33500 33764 15147 -2668 3333 22622 29203 49683
8977 49683 37168 14940 14415 3173 -25163 -51872 -56119 -31522 -683 -1102 -21751 -4599 6683
8964 6683 20286 14680 -1177 30341 49076 43993 51714 45849 58130 87226 84708 50985 -1625
8951 -1625 -6030 -10045 -11985 -8384 -8409 16456 32493 58118 30022 -11080 -12837 13692 18100 17374
8937 17374 19856 42030 41362 38717 12860 22863 39220 27570 7362 26234 20463 12302 20800
8924 20800 35082 29067 23615 12659 21527 43413 56834 55846 45353 68563 64633 36181 17166
8911 17166 -12793 -7280 -23416 -35405 -30599 -20324 -4037 -11774 370 -10831 -28008 -19822 21001
8898 21001 29808 1416 -14135 -10229 -9163 -23571 -55725 -47987 -19017 -6626 -6801 -7121 2128 35198
8884 35198 46017 40544 29603 25494 37136 51797 51757 61633 44753 54185 38543 22431 34808
8871 34808 43305 36450 30922 28168 9866 -8903 17728 42352 40286 26165 32383 29294 33299
8858 33299 40632 53969 46933 34073 33050 43761 39318 26238 6314 16110 41607 25836 -4438
8845 -4438 4171 7963 4746 930 36271 32386 26217 27102 10893 -20804 -14574 31685 29167 12002
8831 12002 36947 27345 28927 5477 -22928 -28782 -1020 21165 46220 50784 63586 72984 58592
8818 58592 34586 33071 20098 4266 41699 38675 33619 35607 32678 45009 13869 7060 19042
8805 19042 40140 44089 49292 47024 45010 63781 60065 30485 -8867 2446 31966 54923 62341
8792 62341 33119 26781 21868 38052 51547 48273 41227 49754 56307 60130 33162 34854 56068
8779 56068 36936 28325 31589 27445 23462 37336 37307 46716 79119 99787 93972 64992 58998 67813
8765 67813 74692 67489 64940 66735 80610 110459 103940 76534 44734 24384 11066 174 33694
8752 33694 45306 45480 62447 57382 55749 58288 51031 48513 37216 28242 13450 421 8851 29259
8738 29259 43482 48517 25856 18980 40125 49236 69791 69480 44520 46870 34559 33675 57144
8725 57144 67721 66308 60706 40416 21224 29416 23786 27102 42351 57796 57467 57767 81395 88277
8711 88277 53030 33548 51849 40975 29622 35001 24626 33933 23803 42966 51425 57770 50136
8698 50136 29216 10401 19705 29935 59832 52329 52882 50980 53008 58032 71016 90834 65974
8685 65974 49124 48001 39681 44611 54932 27506 -3962 -14877 3791 24519 40057 49756 77878
8672 77878 93076 49775 35988 35908 65048 56932 42872 40795 41580 52394 54218 46397 59292 50865
8658 50865 39142 54686 36327 56063 84157 85591 34776 4715 5730 -2921 -17315 1173
8646 1173 12490 35069 50896 47276 12519 16974 41156 50122 60509 43697 3585 4404 16685
8633 16685 31472 42719 15183 24203 62767 85815 66432 56844 39861 41243 46035 35347 19343
8620 19343 29853 28844 40642 37775 40832 36554 35993 15651 44468 81314 87029 79010 77242 66254
8606 66254 45708 28180 14429 -4037 -8300 5575 10595 16705 31896 39322 53008 67104 65852
8593 65852 69746 52130 40141 35754 25005 58488 73790 59324 61955 66083 39354 37040 21713
8580 21713 40219 59377 50588 52913 40203 38075 65291 57866 72791 63096 24502 13289 47782
8567 47782 47853 7120 -42458 -55612 -30911 -5839 -6602 -28291 4379 27882 17360 5581 12205
8554 12205 42602 56588 28606 10892 2182 11454 30116 26198 9528 -1908 4674 997 19839
8541 19839 19750 13860 13859 12321 45768 57040 58561 53096 46222 34825 38649 69734 98858 61355
8527 61355 47704 47609 48557 29934 15203 14672 17220 24694 25962 16475 38037 51523 62604 51604
8513 51604 65084 75077 81763 54920 20261 8068 19264 48480 56934 60686 65775 76151 63246
8500 63246 67152 72663 74281 29913 28879 31078 23627 34329 31346 51981 55199 45286 40992 25124
8486 25124 21548 17461 11221 -4725 6476 30882 41093 39181 25489 17213 3726 9513 49875
8473 49875 52558 35056 38139 64814 88469 86891 71081 76082 79519 87898 66917 42658 20550
8460 20550 40612 31814 33864 47179 67704 69324 68466 57942 45088 37322 60027 64613 53911
8447 53911 48335 56790 62181 37593 40608 50372 56813 81107 99127 77947 75167 83803 61830
8434 61830 63237 79362 92938 95322 65457 69606 77003 68593 74929 85190 72503 40866 31966
8421 31966 20502 27653 33703 26503 45842 64258 63237 54605 39760 43466 64569 54723 55486 48401
8407 48401 54435 74198 79570 76453 74828 93113 79320 55520 31993 54148 58826 45029 38620
8394 38620 52399 72594 73458 58865 69405 89321 86986 53153 36523 34362 15612 9209 38944
8381 38944 32413 31933 51024 43010 54118 28808 17961 51394 49898 47821 39457 52332 24808
8368 24808 1962 24987 44103 59657 78663 66960 51226 70643 79527 44372 10249 15531
8356 15531 5614 21803 43393 45034 50647 37340 48168 83815 96119 81311 88160 90152 75247
8343 75247 78072 68394 71303 68698 48761 38010 73434 111867 100708 106284 93930 81798 84817
8330 84817 73812 46899 51089 84702 112061 88878 81923 78079 74176 72867 69926 50253 19976
8317 19976 44160 76841 90148 93492 86444 31236 14785 29413 50377 56766 37144 21769
8305 21769 22495 31288 29251 20305 32167 59189 89635 90039 95061 79258 63153 39436 32135 59762
8291 59762 98146 105607 85775 69897 86591 101477 87783 84793 73190 78466 79476 90060 62681
8278 62681 41738 48942 71516 94549 82058 64907 83676 84122 84582 71419 70586 86435 83297
8265 83297 64616 69075 91986 93717 102246 91164 57117 49036 52600 57177 79567 64940 40753
8252 40753 42216 38860 54961 58548 73905 69848 66612 62312 55874 43396 29916 22639 58003
8239 58003 64038 17663 34892 49215 55308 67755 48926 30785 33243 46054 59214 65060 75569
8226 75569 59293 44007 55083 71806 93880 100820 93810 71584 61393 37278 44569 66520
8214 66520 80305 81149 92726 82804 72438 74989 70856 51471 59158 68959 61227 88311 104386
8201 104386 107737 98110 64391 44557 41082 24248 25766 27987 34261 30682 31517 53828 48206 51558
8187 51558 46095 55268 49244 26080 19328 21330 35203 59754 61046 38624 35657 73743 81283
8174 81283 50933 48284 65930 79970 68245 59094 54424 50570 41558 32372 46666 63393 68436
8161 68436 69557 57844 63463 64280 49859 52890 63100 87899 109568 102039 86421 66857 49733
8148 49733 16334 21592 19976 30935 66446 71632 58810 18258 25016 41241 27737 14201 18791
8135 18791 14756 7730 -9465 3312 8951 20508 26502 18382 -1931 13324 24020 23213 35794
8122 35794 27229 48118 89762 97094 61439 75243 64410 46183 48097 30801 16517 14015 35789
8109 35789 24162 21200 23390 23535 5857 -11385 12651 32344 10324 -11021 -4109 -4901 27272
8096 27272 30876 -4541 -4332 -8414 2933 10443 -3823 -16635 -38824 -19022 -9092 -8377 -20050
8083 -20050 -23115 -10685 -4110 -24529 -20984 -18552 6663 34605 33569 26829 -1261 -19880 -11551
8070 -11551 611 -3009 7393 28170 35237 37990 40572 42822 29434 32775 32500 40693 21901 5413
8056 5413 9004 16153 22672 13224 3784 14999 26818 35653 44497 47479 27067 29328 48673 45158
8042 45158 33438 43208 51534 51491 35562 35715 58884 43989 36989 47887 46561 40280 29884 41682
8028 41682 41024 29786 42356 17672 -14056 -12407 -4164 -4614 -11394 -21601 -29706 -25589 -20894 -5894
8014 -5894 36364 40581 35437 24298 14542 5264 5987 -17 16337 9180 24845 33284 43882 34893
8000 34893 1045 -3435 26768 19153 8726 16154 15469 3558 6677 17819 31420 37880 39183
7987 39183 18322 6293 -5781 -4619 6378 13295 23878 23544 8028 17798 38676 36354 13173
7974 13173 -4302 -19232 -11396 -3554 -12582 -11950 -8094 4494 8402 -21719 -21313 -13323 -9516 -3228
7960 -3228 -5049 -18198 -20291 -548 8820 28489 33070 7612 11887 12202 13759 9130 -935 -7011
7946 -7011 3719 22561 17087 5944 -14316 -23572 -29843 -40907 -28052 -31076 -19066 -8304 14101
7933 14101 11433 2024 -8522 7466 16553 18013 4880 2785 -7657 -13010 15804 29555 26910
7920 26910 -8946 -32778 -32418 -18663 -21896 -36953 -35081 34750 50418 22503 12208 3377 -11207
7907 -11207 -29845 -791 19010 35329 27704 400 -23798 -17774 -1032 13021 5579 -963 16647
7894 16647 37856 41489 31676 -9491 -16387 -1527 -6730 963 -5096 -12732 -15584 -7151 16215 24005
7880 24005 30681 66489 44777 25724 10092 198 12239 27732 34111 38688 32284 7588 -31443
7867 -31443 -47170 -44432 -36380 -30721 1420 -11623 -30535 -638 2152 3996 -4789 32608 40367
7854 40367 15852 21235 21637 19349 1508 -207 2914 -22558 -19918 100 16105 2062 -6572
7841 -6572 -4219 8241 18257 37688 50803 50789 24984 10572 24855 60776 60520 44127 8786
7828 8786 -14600 -25244 -28522 -12840 18460 6573 -3457 -1363 -20758 -27404 -28491 -23591 -25495
7815 -25495 -47651 -28646 4426 10058 -9233 -9922 11740 28333 34584 33286 42914 24208 -4443
7802 -4443 -8022 -5571 -22591 -45625 -32166 8873 6486 4328 1267 -4560 -29298 -31991 -20142
7789 -20142 -880 7102 1906 3323 528 -4897 6236 -22787 -21125 -12257 8547 11893 8288 -17373
7775 -17373 -34738 -15848 8871 -1500 -11895 -11437 12871 35440 13696 11808 10113 -6921 9544
7762 9544 -4755 -7222 -2794 -8604 -6183 9424 17957 23194 -6952 -15507 20668 33598 51088
7749 51088 28861 21424 15955 16868 -15181 -45570 -40346 -22321 -20823 -55452 -65504 -57131 -29822
7736 -29822 -23276 -24568 -23954 -43743 -74723 -63334 -37637 -32261 -53327 -74194 -53019 -50142 -45054
7723 -45054 -47018 -42317 -30038 -17902 20978 37573 60159 21735 -2864 2913 -20516 -18248 -14301
7710 -14301 -33893 -49117 -26093 -5567 4430 -12569 -1771 9550 8653 -19163 2443 34916
7698 34916 14511 204 -21630 -19836 2604 -6916 -19816 -12583 5626 10860 16633 -1970 -26782
7685 -26782 464 34799 48556 51291 22107 -6216 -16238 -23451 -35643 -14007 -3251 2511
7673 2511 459 4277 31315 31504 9440 27018 18918 18090 14488 3532 18142 22067 25894 -11104
7659 -11104 -34490 -18371 -16744 -14161 -13159 -17989 -29365 -20701 -14083 -6733 -9084 9383 25722
7646 25722 -6875 -24033 -4424 -5355 -33601 -20374 -19873 1770 15496 20775 25727 30833 15420
7633 15420 4165 17634 2533 2323 25792 19992 24931 20586 2408 -7825 -3233 -5399 6224
7620 6224 14849 43275 37154 21688 5700 34151 23654 -9685 -26941 -24394 -2595 -353 -16925
7607 -16925 -22446 -23201 -29673 -22828 -54754 -50525 -23194 -7506 6372 4788 -18515 -19739 -18621 -463
7593 -463 -6737 -23957 -22518 -8800 -7163 -8557 -1259 -10487 -8648 9955 11584 31256 24199 18207
7579 18207 7246 13478 28433 18110 318 -22196 -27300 -15771 -5031 19739 9217 1109
7567 1109 2536 -12568 -37153 -41862 -5792 13605 38918 24436 16423 16331 10995 25851 22920 27620
7553 27620 33384 783 -2080 19721 13261 25282 21477 -21100 -30511 -23258 -15935 -83 -36949
7540 -36949 -40230 -36543 -45476 -41862 -20129 -15926 -7254 -22620 -14111 -9289 7673 -1639 -11486 -3644
7526 -3644 1007 -19762 -24784 -29891 -27266 -46900 -31455 -34726 -40018 -30051 -37722 -32725 -44061 -26625
7512 -26625 -4768 -3749 -12365 15059 27800 22855 10643 -17152 -11903 -844 3894 -4342 -21653
7499 -21653 -25831 -23768 -18483 -43564 -60027 -47648 -30713 -48139 -24505 -13143 -24544 -43810
7487 -43810 -57356 -40709 -27448 -24346 -1025 -9067 -39672 -40543 -66184 -71227 -58423 -53630 -49995
7474 -49995 -6527 19078 23503 16851 21490 22649 6687 2576 3261 -131 -25574 -42395 -35578 -44979
7460 -44979 -25995 -24548 -30800 -28001 -16217 -31415 -38453 -40662 -39213 -44926 -59419 -36201 -57420
7447 -57420 -59876 -50350 -33745 -60037 -73087 -23315 -5689 -732 20838 16980 24757 5731 -1076
7434 -1076 -7658 15669 22849 22862 7012 -6035 -29127 -32608 -32771 -39952 -54095 -40075 -19974 14241
7420 14241 -316 -22279 -5132 11165 23502 2032 -26371 -32714 -22954 -28624 -11418 18633
7408 18633 15265 -10667 -33350 -28740 -5039 13445 32642 37450 27243 19271 7525 13014 14802
7395 14802 2441 -16731 709 14074 -2863 6364 24904 17305 11924 -4661 -11296 -4884 -5919
7382 -5919 -31714 -39027 -17387 13299 14166 32978 32577 45379 27478 5383 18030 14157 -10425
7369 -10425 -1249 10040 -11701 -24620 8846 23134 31447 2705 -18935 -60176 -65041 -39566
7357 -39566 -18691 -12233 -15423 -6519 3284 4497 -31995 -45520 -45763 -52221 -45649 -20729 -52492 -75932
7343 -75932 -67817 -61056 -37574 -35341 -51388 -69199 -59273 -51963 -52582 -42197 -45182 -28893 -29075 -36610
7329 -36610 -33281 -26877 -34173 -47593 -47956 -23129 -21447 -12456 -29501 -17917 -27550 -19425 -15776 -33777
7315 -33777 -31218 -33214 -41071 -40100 -47870 -60077 -58790 -22456 -4747 13153 29603 -12936 -22362
7302 -22362 -15352 -21555 -27169 -59884 -56006 -51765 -67744 -45136 -19672 -10960 -17843 -10581 -26964
7289 -26964 -33655 -29357 -41596 -30692 -30753 -37081 -44283 -39708 -34596 -25712 -34033 -33711 -44227 -49730 -38835
7274 -38835 -5476 -11290 -11671 -8594 -15102 -43695 -71680 -66620 -65900 -82735 -80068 -84334 -71713 -62256
7260 -62256 -55500 -53689 -27462 -22732 -23082 -17262 -7186 -8228 -33888 -49180 -70316 -46851 -29540
7247 -29540 -62555 -75948 -51100 -42054 -65654 -69566 -45924 -8598 -2526 -30800 -25929 -9847 -2572
7234 -2572 -6853 -10208 -8362 -5402 24828 20853 19307 11642 4660 -1132 -15479 -26174 -20835 -27664
7220 -27664 -44161 -64485 -73832 -69792 -57490 -57090 -70745 -64201 -56946 -54524 -29292 -14392 -7466
7207 -7466 -3612 -7550 -8487 -12807 -19996 -32395 -11134 -34905 -59497 -53782 -55655 -32100 -25444 -26569
7193 -26569 1231 5721 -12424 -16984 -40539 -49740 -37057 -28442 -38780 -42373 -56130 -54814 -19289
7180 -19289 11980 4663 13925 -2697 -20312 -25876 -24647 -26659 -31610 -22408 -20180 -29741 -33567 -21854
7166 -21854 -6846 -16680 -11507 -10772 -2087 13558 2769 -17034 -16304 -49503 -78920 -75303 -73235 -59018
7152 -59018 -58420 -20188 -10189 -2725 5991 370 20737 -940 -30577 -28036 -9391 10091 -8628
7139 -8628 -931 5782 -14504 -29084 -35870 -25587 -27116 -22974 -51121 -75701 -64062 -64058 -36551 -6874
7125 -6874 20611 -4248 -18493 -3206 -11093 -12771 -17724 -34558 -57043 -76756 -62269 -56169 -18756
7112 -18756 8132 8630 -5579 983 -17793 -47010 -32161 -34431 -45706 -43959 -40382 -29656 -15927
7099 -15927 -8381 -1943 -36079 -45437 -43220 -24821 -11160 -26676 -32627 -18796 -14419 -42900 -75140
7086 -75140 -67490 -48306 -39897 -53465 -52885 -45671 -28876 -39605 -43957 -26076 -23143 -37476 -35864
7073 -35864 -24850 -4299 1185 12162 6568 -26911 -26621 -16086 -10309 -26360 -43726 -35592 807
7060 807 12127 10253 13168 -337 25875 34360 31204 22309 -13474 -18531 -17075 -9569 -28523 -60901
7046 -60901 -65705 -31366 -16332 -3695 -6334 -24985 -54755 -68277 -67247 -58410 -56773 -60582 -64576
7033 -64576 -67539 -56209 -27705 -5441 3877 -6108 4169 20296 2598 14671 7990 1702 6677
7020 6677 7751 -27742 -63132 -87649 -72982 -47264 -16412 -16207 -35500 -52877 -62327 -72477 -78063
7007 -78063 -78828 -49135 -22941 -2501 364 -18303 -25307 -5053 4652 -14186 -25385 -30837 -19268
6994 -19268 18833 39930 37890 34700 -2999 -10216 -42722 -52601 -60051 -50770 -15537 -21591 -16885
6981 -16885 -4754 -2638 -322 -12755 -19953 -49790 -54093 -79812 -83287 -78719 -68462 -35826 -37288
6968 -37288 -32099 -41951 -20874 -16166 -8272 -13857 -41937 -44673 -47472 -27726 -15120 -16903 -20322 -13110
6954 -13110 -22402 -22954 -30731 -41999 -53136 -36942 -39668 -39290 -17218 -13756 15154 2805 -16893
6941 -16893 -27339 -30946 -17799 2970 -17690 -28387 -18358 -19662 -12086 -31935 -10013 11400
6929 11400 888 3199 -10957 253 -13712 -13565 -19772 -26500 -39581 -40448 -28589 -7708 -12101
6916 -12101 -39443 -47186 -14609 -15925 -39989 -25835 -18504 -12160 -10907 554 -13356 -44492 -68907
6903 -68907 -59106 -50531 -29573 144 -14588 -9341 -3132 -39722 -62645 -50257 -41544 -37525 -40399
6890 -40399 -14869 -25532 -26089 -26057 -38543 -39534 -47907 -20966 -34232 -46913 -45591 -34705 -17593 -5189
6876 -5189 22914 13134 -14026 -28409 -27176 -42595 -36591 -24722 -38745 -4191 -9074 -40864 -47170
6863 -47170 -46996 -36630 -27782 -44245 -34844 -27461 -34870 -30802 -60464 -81165 -58105 -33442 -16109
6850 -16109 3538 1562 -18458 -31519 -50708 -69017 -78494 -60266 -16424 13194 33504 34370 29339
6837 29339 16565 19970 5372 -16650 -24286 -22840 -16550 4653 -11560 -32120 -17188 -15789 -31072
6824 -31072 -13845 -1120 -6167 -8131 -522 -19559 -38796 -72634 -69237 -68628 -70703 -69181 -57849
6811 -57849 -40541 -41448 -35542 -26350 -24465 -39516 -32669 -19797 -2501 -13110 -26315 -47982 -80839
6798 -80839 -68202 -63848 -35767 -15115 6352 7798 19466 6470 -23538 -31418 -43361 -31430
6786 -31430 -21649 -19219 -17903 20429 18181 -15162 -51142 -64746 -83967 -74092 -81125 -74831 -53697
6773 -53697 -40245 -28126 -33901 -24463 -30484 -31404 -19710 -18872 -41165 -42502 -5912 5507 -5778
6760 -5778 916 4075 16731 37446 28749 16124 -389 -12363 -5688 -5074 24762 17593 -20425
6747 -20425 -31382 -28865 -4963 -13755 -47309 -51063 -40346 -44908 -34675 -22807 -25369 5947 11656
6734 11656 7063 20698 22427 24848 1629 -33823 -38939 -17292 -2378 -32220 -34709 -27651 -14019
6721 -14019 10340 9374 -17950 -8937 5502 -40983 -70172 -61270 -35907 -30455 -34396 -18761 -20415
6708 -20415 -3555 -5196 -18480 4379 -6029 -31842 -23757 -10657 -15264 -29140 -37796 -44988 -74821
6695 -74821 -57853 -30018 -17893 -6464 -33159 -46322 -26205 -5981 -8385 6178 16945 12156
6683 12156 -2600 -12526 -15490 -9470 796 955 -24824 -32044 -12663 -10624 -14739 -761 8735 15290
6669 15290 27609 27992 17800 14260 -201 3344 19497 9270 -8611 -4059 -4115 859 14857 5796
6655 5796 -4821 -13673 -25672 -33998 -13664 25227 47565 68842 66066 98703 163986 258442 364821
6642 364821 369937 260163 176237 138455 151263 132763 127806 164902 187747 255558 329857 457825
6630 457825 610608 817112 1097892 1481352 2189348 3516772 5926714 9569742 13377834
6621 13377834 12757067 8109445 4492386 2729068 1889932 1414537 1112417 878807 686072
6612 686072 535978 432689 349293 296635 271271 252042 259331 255207 248344 256718 312259 410924
6600 410924 406048 261849 156533 135553 111598 101819 112225 79214 69282 57483 70383 50404
6588 50404 15789 19484 18094 2587 39 4552 8863 18529 44183 51783 17656 30773 32121
6575 32121 4710 -2756 2596 -10557 -10690 -15192 -25513 -26995 -39973 -41233 -18464 -31331 -12520
6562 -12520 -19961 -22694 -10127 30803 35370 17332 -47430 -71104 -56291 -15694 10737 13404 -13984
6549 -13984 -32936 -11114 452 -1103 -14284 -5667 11440 2228 -5206 14115 19589 41489 39898
6536 39898 30378 17497 8895 -7909 -26426 -18093 -10186 10924 31356 41698 47083 27803 8747
6523 8747 -1415 -8763 -3027 -11774 -11599 -19318 -31007 -29765 -26035 -19016 -25242 -31061 -8129 -8788 -9163
6508 -9163 -15899 -29815 -33209 -25666 -28127 -50235 -56947 -33271 -8651 -10632 -13741 -20522 510 -15167
6494 -15167 -55356 -51461 -36393 -38234 -55006 -61672 -70885 -75161 -57718 -40546 -29430 -27758 -27581
6481 -27581 -40833 -44380 -31707 -30969 -28665 -24146 -25652 -2347 -13183 -20990 -30171 -24332 -13497 569
6467 569 1479 1647 -2162 10495 -3527 -13307 -12371 2274 -16242 -36260 -32435 -42400 -49257 -60433
6453 -60433 -35676 -36890 -49977 -43913 -49176 -61729 -58620 -65168 -66734 -73611 -71745 -91249 -77317
6440 -77317 -62429 -63232 -63352 -47830 -28155 -26983 -49691 -56049 -23655 -12474 -15770 -25566 -18456 -19082
6426 -19082 -40679 -69686 -66149 -32880 -24646 -51133 -42651 -41792 -30544 -31420 -32834 -382 -8848 -24162
6412 -24162 -34135 -48944 -54117 -50375 -31454 -43429 -41875 -20786 -20767 -25992 -39632 -54667 -52794 -36758
6398 -36758 -23052 -45785 -46468 -31857 -18840 -29095 -39391 -45996 -38726 -47624 -54135 -43387 -42411
6385 -42411 -34730 -39599 -49273 -53465 -39480 -35604 -28825 -10595 854 12778 23992 17514 27272
6372 27272 21078 5007 4530 -15266 11916 34491 15728 -12731 -32902 -60453 -49159 -26372
6360 -26372 -23713 -25227 -31409 -57920 -45515 -33233 -26149 -28704 -13795 -12141 -18227 -37368 -44396
6347 -44396 -40308 -31552 -31023 -14830 8972 20956 -4604 -32665 -26542 -18196 10178 -862 -10210
6334 -10210 573 44514 35015 971 -7513 -10968 5598 21375 30818 -11599 -12952 -8783 1001
6321 1001 900 -3391 -14786 -24395 -35525 -24876 -26572 -22038 -20120 -38030 -58052 -37895 -56287
6308 -56287 -53918 -52431 -50328 -30282 -28885 -4136 -10208 -1204 -27471 -48793 -30983 -5519 466
6295 466 -19891 -24316 -9298 5697 -8844 -37317 -46412 -17572 -4207 -11242 -26186 -38031 -35818
6282 -35818 -30464 -32980 -3942 15532 21165 12587 -6598 1594 10492 15935 27734 2355 -12371
6269 -12371 -35274 -17627 8347 9325 6426 -8021 -29551 -23565 -24884 -26566 -20865 -28496 -26810 -30042
6255 -30042 -58998 -63980 -50043 -38090 -3211 1532 -14255 411 -1471 3516 -10905 -7893 -11547
6242 -11547 -1193 18484 19601 272 8023 43488 44075 20329 -18526 -59939 -74651 -78278 -42002
6229 -42002 -20915 -21353 -40084 -26092 -26156 -21901 -30645 -19733 -5260 6470 -28399 -80976 -108629
6216 -108629 -117627 -93134 -82847 -75993 -64579 -51613 -4989 29607 11849 -13772 -40935 -40462
6204 -40462 -33436 -43479 -36875 -16605 -4909 653 7282 18966 1218 2360 6832 16946 -662
6191 -662 -5557 -16870 -53927 -70939 -64675 -16962 -1637 -28995 -46517 -46736 -32823 -22499 -6363
6178 -6363 -621 -16173 -43642 -45135 -53741 -27656 -42793 -72659 -39809 -19510 -22705 -55123 -50838
6165 -50838 -27782 -37789 -15049 -5224 -20771 -24503 -27522 -24451 -20512 -23829 -37195 -28061 16122
6152 16122 26945 33943 18924 -19921 -34272 -43210 -40802 -16078 -25597 -13936 -9882 -23917 -26539
6139 -26539 -48100 -51757 -44483 -43563 -41910 -35644 -52842 -56998 -17776 16793 7457 2966 -839 -31559
6125 -31559 -26492 -37649 -16140 -1559 -13665 -58005 -74524 -80622 -85081 -73765 -48589 -26177
6113 -26177 -20741 -43609 -60360 -84523 -57729 -27503 -44832 -49448 -39441 -42523 -36766 -71710 -77875
6100 -77875 -62652 -26090 -5186 1289 3207 -10821 8796 -2318 -23977 -28971 -43535 -51345 -40948
6087 -40948 -49466 -45399 -51164 -62068 -54297 -56725 -51091 -37345 -32095 -26681 -18795 -39974 -49656 -39670
6073 -39670 -53602 -40818 -22994 -40933 -43140 -54682 -47822 -29990 -22709 -31825 -27134 -29749 -25108
6060 -25108 -30875 -51368 -26813 -10715 -17632 -36962 -45565 -11876 -7280 5845 -6349 -18667 -16630
6047 -16630 -34252 -33638 -25510 -22225 -25744 -49176 -68923 -81112 -91302 -92734 -56926 -27840 -8096
6034 -8096 -8295 4952 -24729 -37353 -15379 -15485 -19718 7180 14511 6338 14980 24202 12746 23563
6020 23563 11430 8835 3129 7252 2585 -5022 17296 19893 21270 11307 17774 41716 65872 46473
6006 46473 42846 34270 40233 20173 -6814 -19885 -13964 -22268 -16675 -22573 -22144 -29148 -22144 -6557
5992 -6557 14775 3416 10557 13651 -16949 -44613 -29201 -40902 -27964 -12582 -18612 -24056 -20309
5979 -20309 -22484 -22943 -22002 -2271 -25867 -45532 -21551 -3228 -12905 -15794 4961 883 -12277
5966 -12277 -812 2890 6910 -12384 -53236 -54475 -49918 -40904 -30651 -34385 -31678 -36320 -21318
5953 -21318 -26863 -23683 -2433 10981 -11971 -49926 -76189 -66291 -54090 -44822 -12295 -17188 -29266
5940 -29266 -35151 -39186 -28760 -37066 -18670 -6611 -9191 -24194 -33671 -48562 -40728 -33848 -36842
5927 -36842 -29302 -19449 -44579 -62493 -87775 -83267 -70973 -98408 -97955 -82857 -34727 16757 15462
5914 15462 -6345 -24215 -33688 -70219 -84078 -70649 -33751 -7275 -14965 -11149 -18470 -11329 12672
5901 12672 4287 -34374 -47178 -43111 -32291 -8243 -10083 -6 -19728 -23136 -46229 -42729 -43145
5888 -43145 -39967 -26057 -27850 -42695 -35948 -26249 -24379 -15542 -49921 -74295 -82275 -85640 -90947 -66025
5874 -66025 -47480 -46078 -64666 -79294 -76564 -36503 -213 -16987 -24703 -15312 -28401 -24462 -8982
5861 -8982 -4836 -22426 -26857 -15017 -27916 -23740 -25791 -46023 -58452 -48273 -38861 -46358 -45273
5848 -45273 -25382 5816 22 -12880 -11826 25600 3816 -32831 -32935 -32971 -26418 -26187 -4163 19804
5834 19804 19139 -19251 -52310 -59799 -56700 -55585 -41426 -25078 1740 416 -7034 -17123 -11852
5821 -11852 -11439 -9772 -46937 -70685 -85525 -66962 -34098 -30836 -61633 -46222 -46252 -56050 -52272 -47875
5807 -47875 -50475 -24479 -23703 -33094 -25799 -10397 -19704 -27334 -47230 -40180 -18588 -7118 -30045
5794 -30045 -33872 -46065 -59315 -48926 -47074 -26713 -22469 -29529 -58493 -40926 -35417 -56817 -40748
5781 -40748 -41478 -45989 -43279 -18819 157 -20944 -13672 -11655 -28903 -19802 -20143 -25296 -10279 14996
5767 14996 20264 -15043 -20237 -1386 28624 45757 25963 -8187 -2500 16257 2392 1618 -30599
5754 -30599 -22820 -38365 -51939 -29470 -29899 -26789 -31369 -44853 -48422 -31773 4178 1032 961 15984
5740 15984 5794 -35228 -46678 -34293 -25391 -21472 -16505 -1685 16631 15398 4182 -2438 -621
5727 -621 3990 -5806 -7556 5627 21252 9235 -11525 11517 898 -2995 -10438 8684 -2421
5714 -2421 -16657 -4524 10819 8146 14864 10331 -9207 -43473 -14953 2016 -24284 -35434 -42788
5701 -42788 -35129 -28119 -22848 8708 49895 36609 3376 -9190 -19672 -47136 -42001 19824 25561
5688 25561 -8719 -8881 10345 9430 -9171 -15749 -20893 -26780 -33931 -58192 -43086 -35434 -25594 -36943
5674 -36943 -6976 11381 5404 -861 -19693 -1187 15806 12423 15285 12819 -3712 -9704 -21308
5661 -21308 -33704 -34038 -20973 -58110 -50620 -48936 -54642 -51992 -26193 -14908 1167 -525 -18701
5648 -18701 -57351 -54563 -51837 -60227 -64198 -44803 -39753 -43793 -37623 -16796 -32718 -18425 -8304
5635 -8304 -13022 -27524 -17266 10476 31598 38598 39111 7371 -23065 -21636 -26837 -62184 -63606
5622 -63606 -43850 -30039 -36881 -20630 -4674 10726 -10182 -28819 -45924 -58581 -59749 -22290
5610 -22290 21202 42148 24929 11606 34405 40368 13765 11027 -1883 -37819 -82648 -81870 -41093
5597 -41093 -19376 -23707 -4679 7930 -4904 -35 6850 5279 3284 8262 13881 19184 35227
5584 35227 37982 5242 -60477 -82224 -74113 -52672 -52826 -54617 -66620 -81712 -35694 -162 17113
5571 17113 21557 37076 40129 22043 -25069 -55078 -52821 -44991 -62257 -26155 -30533 -9582 -54
5558 -54 -21866 -31488 -61828 -61001 -57889 -71808 -83174 -50057 -36283 -54242 -40731 -15565 -4318
5545 -4318 -8125 -25310 -37598 -2673 12234 13236 12082 22074 8789 1996 -169 8150 19338
5532 19338 20337 10788 22637 29672 17926 -12378 -20696 -34607 -22240 -23677 -40541 -46886 -52330
5519 -52330 -60211 -45785 -33149 -55340 -46814 -19660 -4098 -8241 -2791 -1403 8999 589 -17069
5506 -17069 -30305 -21325 -26684 -36335 -44455 -66683 -66172 -43478 -16891 863 4550 -17845 -23131
5493 -23131 -3981 20752 29993 1715 -21301 -48708 -55419 -50741 -38447 -26830 -15360 -13784 -54100
5480 -54100 -39966 -32304 -23590 1681 -12138 -59709 -53363 -19581 -23625 -28415 -13448 -7624 -31870
5467 -31870 -44397 -53530 -45297 -9836 25530 25357 -13095 -33988 -43238 -33347 -23057 -41868 -60283
5454 -60283 -58916 -46841 -55242 -52383 -42469 -24174 -5435 -14667 -25845 -22222 -14816 -1389 -9186
5441 -9186 -26671 -33229 -28223 -254 -11502 -48757 -63432 -25787 -16415 -16283 -30325 -26510 -11331
5428 -11331 -28036 -51523 -69718 -74853 -31713 -15114 -16760 -2557 9156 -1365 -13767 -26756
5416 -26756 -12714 346 6249 9087 -3211 10603 88 -32394 -55377 -55996 -51060 -55506 -43870
5403 -43870 -11793 14693 295 -22714 -12775 9934 -880 -34254 -17408 1577 31801 30570
5391 30570 9655 18159 7278 13469 6120 -7185 -5825 3130 -3866 -17633 -17828 2 5500 19368
5377 19368 22812 -3898 -4855 -4422 12972 -1105 -35105 -58255 -59331 -47537 -37788 -22507 -27496
5364 -27496 -49090 -26523 -9294 10712 -5547 -453 -5046 -20690 -31796 -48946 -53830 -81214
5352 -81214 -63525 -40665 -24035 -40632 -39968 -25250 -9366 -5730 -25360 -32008 -43422 -44266 -23376
5339 -23376 -1969 4080 -4578 15283 4016 -7372 -36996 -18462 -15188 -28846 -42012 -14766
5327 -14766 3584 32187 29481 13327 -5482 -9761 -464 3030 37435 37299 33552 -7485 -24221
5314 -24221 -21090 -32643 -35998 -33965 -35886 -62536 -59430 -61569 -42639 -28155 -14635 -23597 -28177
5301 -28177 -24080 -8353 15438 28009 14949 -2186 -35070 -51165 -25092 -29136 -12851 -14276
5289 -14276 -11671 5299 -2359 2002 509 -43791 -54058 -19265 -3913 -7322 5426 1938 -1772
5276 -1772 -12943 -43707 -47579 -38099 -34974 -57320 -68053 -67588 -42743 -38626 -55434 -58722 -52953 -50693
5262 -50693 -53262 -54131 -10217 24685 2372 9182 17489 6549 -22485 -26972 -12560 -5239 -6161 212
5248 212 -1235 6713 29898 31227 22884 17522 14669 17149 -5967 -36585 -42307 -16136 -12417 -9616
5234 -9616 -37881 -21394 3745 5618 23952 780 -14549 -9348 -24283 -16439 -10836 -39421 -52829
5221 -52829 -37178 -10161 -13813 -34325 -40787 -33624 -23404 -4795 -17188 -35464 -39546 -45785 -58586
5208 -58586 -57941 -13842 580 4267 12400 31731 32573 509 1017 5494 -18792 -29669 -9574 -2634
5194 -2634 -19103 -5951 11918 7412 10707 -18730 -50299 -24735 -16349 -12346 -16821 -10359 -4300
5181 -4300 -4433 -13553 -51658 -44314 -26538 -7503 3797 -25207 -44570 -26962 -48205 -58714 -15505
5168 -15505 5547 22186 5855 -26964 -5969 34857 29271 -2795 -13257 -10982 -9685 -5134 -16793
5155 -16793 -6427 22984 22473 -290 -29502 -42970 -33386 -25543 -23856 -6782 -17808 -32311 -11952
5142 -11952 2348 -4120 1103 -33848 -48467 -32267 -3454 17746 19646 24228 4486 -58601 -90486
5129 -90486 -75582 -53326 -48302 -42036 -24559 -18775 -19625 -22966 -26341 -13449 -7277 2418 6270 9275
5115 9275 -4341 -4285 20707 12404 -916 -31843 -19317 -24827 -9763 9277 9958 15282 2989 -31450
5101 -31450 -37866 -54386 -82707 -69360 -47330 -32974 -36915 -48002 -45719 -28097 -40044 -58557
5089 -58557 -47600 -36771 -39229 -54425 -51373 -63640 -67297 -62303 -41821 -27096 -37144 -45652 -17789
5076 -17789 -15850 -30341 -39569 -75202 -30169 -10984 3271 -1201 -3438 -17920 -21181 -25108 -35950
5063 -35950 -27921 -21278 -37761 -36995 -51498 -46618 -24947 14759 28413 12518 -720 4523 15758
5050 15758 6393 1587 -21171 -28475 14619 34029 27869 48145 81010 75827 29190 17165 30210
5037 30210 12608 -7482 -29097 -45779 -67417 -65121 -61984 -88024 -95917 -76710 -58114 -52646 -51452
5024 -51452 -55885 -28302 9498 4752 -4979 437 7720 -938 -38003 -34442 -1545 -15112 -11009
5011 -11009 -8002 -17836 -30753 -34433 -41435 -68453 -57771 -14297 7218 8855 -12572 -7696 7946
4998 7946 7069 16035 -7822 -7586 -10673 -14878 -30117 -18282 -10282 5183 -4628 -12677 -10836 22847
4984 22847 27303 9381 8051 352 -26817 -22356 -46293 -25734 -1192 -17086 -19341 -25437 -8799
4971 -8799 28384 15044 -16386 -23419 -11066 -28950 -42369 -34916 -1966 15461 12493 24469 14044
4958 14044 -610 -10759 -20083 -15476 -7526 -20237 2871 30531 9139 2749 5167 15081 -15658
4945 -15658 -6700 1510 6124 24267 32615 14418 -4547 -26900 -26940 -27466 3333 18379 13006 19408
4931 19408 14575 -37655 -59547 -68450 -64844 -66681 -76119 -82954 -58387 -51247 -47543 -37587 -32890 -35313
4917 -35313 -15226 -22509 -25102 -30133 -30987 -9582 2396 3704 5429 1653 -12849 -24271 -42527
4904 -42527 -25103 -16035 -27813 -20060 -21535 -24954 -12154 -1429 -2511 5239 5720 3977 -10550 -19799
4890 -19799 -15749 -1952 -15255 -21491 -20816 -6554 -30055 -55330 -15266 -2875 -28643 -47036 -43550
4877 -43550 -43765 -40438 -39314 -32573 -8896 5092 -102 -9048 -15995 -20733 -41653 -51897 -48099 -44117
4863 -44117 -12066 -23713 -35636 -37902 -38759 -29664 -11389 -24545 -46807 -60212 -59481 -47297 -37900
4850 -37900 -41673 -40396 -32234 -15083 -19746 -34217 -56403 -58718 -47244 -40335 -40895 -43418 -35476 -37055
4836 -37055 -56437 -56236 -53223 -25791 17576 27646 19918 728 -15866 -32052 -23890 -1024 -15274
4823 -15274 -8988 15427 12416 -817 -30134 -36430 -33925 -39045 -48248 -61305 -52369 -32301 -29311
4810 -29311 -4726 -7271 -5244 -20757 -51794 -75864 -50763 -51896 -42657 -44836 -39180 -34267 -15296
4797 -15296 -10814 2023 9861 12307 36979 54906 41526 -8545 -20876 -37965 -66865 -59389 -47824
4784 -47824 -52440 -36772 -35971 -21330 -11755 -21283 -13264 724 -5281 -9383 -6122 -10024 3036 15908
4770 15908 18307 15102 24563 21391 3779 -16052 -22030 1506 14282 -16115 -41531 -59047 -39025
4757 -39025 -31272 -34702 -12938 -8861 -18217 -24975 -20210 -27009 -19821 -22997 -42126 -43246 -44829 -39709
4743 -39709 -8290 412 -11218 7119 25240 29651 33858 6146 -29090 -36781 -28427 -388 15090
4730 15090 25089 12424 1825 -1979 6699 24849 42832 33472 19281 16330 30321 23965 19408
4717 19408 -7161 -34746 -45217 -42679 -6436 20310 19406 13308 15912 19785 25404 7390 -29425
4704 -29425 -49658 -30777 -15429 -1807 31027 27497 13690 30406 22178 5302 29611 41898
4692 41898 22609 19873 12573 9665 2280 -24313 -53080 -60407 -44918 -16736 -19340 -31170 -45932
4679 -45932 -43671 -33847 -38431 -42897 -44077 -46624 -45741 -58343 -25762 -12957 -21195 -28081 -29713 -31067
4665 -31067 -25434 -28205 -25967 -36097 -59470 -45297 -18906 -3165 2831 5872 -13146 -27477 -15949
4652 -15949 -25045 -26781 -20863 -23200 -38976 -11217 -19704 -12485 -14858 -6729 1011 -5288 -17556 -12850
4638 -12850 -5310 -9654 -12196 -21455 -35551 -30778 -21049 -52340 -81264 -97511 -76913 -68803 -90938
4625 -90938 -67565 -23657 -25295 -38456 -36747 -42825 -13992 -1845 -19299 -32574 -26698 -18156 -38289
4612 -38289 -45229 -30785 -11835 -20593 -27253 -29376 -30816 -24980 -28194 -21856 -11826 -23598 -30185 -19609
4598 -19609 -20850 -33723 -16411 -16461 -18848 -13920 -12098 -12205 6832 32603 42354 31161 5964 -17131
4584 -17131 -14822 -14155 147 4040 7844 -11096 -18671 942 1230 -415 13623 36909 45599 36223
4570 36223 21216 -2869 -22908 -15757 -15152 -20389 -22748 -44726 -52781 -24214 -12156 -43 -2516
4557 -2516 17708 15418 -1338 -19109 -12036 -6504 -30732 -44180 -24274 -10503 -31601 -49797 -58508
4544 -58508 -55468 -20168 -19452 -4782 -8935 1942 15337 3404 -2663 -6273 -517 5251 26184
4531 26184 45958 42334 37932 44498 43022 10301 -25190 -8394 -5022 -147 -9814 -3729 3049 -5368
4517 -5368 7903 19121 27769 60978 46508 16710 2040 397 -20069 -31237 -40653 -43230 -47592
4504 -47592 -38585 -27372 -15371 4678 8121 -2422 7046 -3336 -15673 -3114 9220 12485 16921
4491 16921 -3519 -9162 -10080 -18823 -10495 596 2271 -12086 -15672 -26038 -36284 -49371 -37479
4478 -37479 -15622 -36520 -52282 -40779 -29271 -34276 -41273 -37483 -46252 -46732 -60459 -48624 -40491
4465 -40491 -36614 -34768 -14347 -852 -30519 -35021 -41724 -45212 -46051 -36540 -11110 -7582 -1557 -7073
4451 -7073 6277 -4727 -17267 -24588 -36898 -32070 -33101 -2604 -5128 2275 35942 18734 11002
4438 11002 -14864 -49099 -20729 -17214 -25481 -19521 -33203 -31573 -37072 -25596 -6052 -6289 -9730
4425 -9730 -25436 -24332 -19231 -24453 -16309 -4618 -270 -22340 -33680 -13153 11003 1098 -907
4412 -907 -7119 -21652 -8485 -12714 -13203 -11592 -21640 -36015 -8614 8716 11962 12381 5321 -10164
4398 -10164 -16916 -24164 -34085 -28984 1385 22373 8436 -754 16175 -22141 -25705 -16178 -33890
4385 -33890 -43475 -27097 -5032 16040 40822 34922 13471 -15853 -39869 -26757 -34165 -24647 -3980
4372 -3980 -35754 -39924 -33968 -26670 -41654 -34278 4940 -480 -4293 2884 -28209 -34829 -25097 -33581
4358 -33581 -53458 -29074 2481 6385 -4847 -15870 -2135 -6040 14921 30461 31739 51229
4346 51229 59542 34237 15683 5770 14336 13640 18064 3717 -18354 -7595 14054 3474 6907
4333 6907 4049 6611 25161 19988 10931 35633 39091 18696 16089 4753 3561 17886 15615 -6409
4319 -6409 -11239 1619 4695 -9682 4445 12 -34571 -27034 -13255 -3243 6772 14107 -39551
4306 -39551 -40157 -23784 -39393 -23759 -13648 -20863 -28713 -24145 -35306 -45430 -56710 -46662 -14078
4293 -14078 -8507 -21310 -24361 -20753 -27837 -36420 -42728 -20310 -7419 6006 -1229 -33872 -58313
4280 -58313 -78043 -55893 -45602 -61876 -68548 -26970 -6904 -9958 -11516 -36411 -32192 -6476 22466
4267 22466 4251 6010 19152 27912 31354 13214 1452 4750 -16225 -27765 -13748 -6651 3535
4254 3535 3902 -14637 -16670 18273 41099 31234 7122 -8355 4556 39260 26236 17674 23893
4241 23893 -12886 -23523 11995 24679 -2562 -7913 12994 22189 2309 16834 14000 29481
4229 29481 33951 15175 15661 11097 43896 63388 40746 -441 16266 12612 16343 44800 50449
4216 50449 1887 -49548 -66049 -76201 -55963 -18458 -12077 -7447 -1502 409 -11213 -9162 8150
4203 8150 31393 1318 -8547 -30804 -34901 -25826 -5377 -1867 4482 -6885 2708 1261 3407 5367
4189 5367 4017 28072 29802 23652 651 -1414 15282 -1737 14265 18290 15296 21798 34037
4176 34037 53858 68862 61169 38009 -2225 12614 2380 -34997 -39273 -7273 31814 14787
4164 14787 -737 -1179 -6160 -1936 -1832 -23503 -18733 6686 7 -3500 -8603 -1315 866 2814
4150 2814 -15511 -16564 -3266 -8216 -12414 -4122 4682 11312 5231 3829 790 6958 20684 19971
4136 19971 26762 19691 2270 11339 13153 8064 -3761 -22996 -43833 -64818 -47071 -25448 -36873
4123 -36873 -30679 -65673 -76754 -42493 -11383 -7662 -10771 -5124 -10292 -11722 -27741 -34323 -17311
4110 -17311 1057 9798 28863 51224 53498 50095 59662 66347 77619 68754 55077 46476 30060
4097 30060 24139 -3348 1816 6841 -30535 -20336 4213 -4722 15216 -3875 -43631 -16233 -3892
4084 -3892 -23954 -13482 -10090 -34442 -12866 875 -6930 -41738 -37905 -18230 -1327 -8006 -29809
4071 -29809 -27440 -47875 -47949 -32294 -24047 -17162 -7063 1704 -9529 -3176 13676 -2802 -14345
4058 -14345 -23643 -31105 -35002 -23413 -10120 -18953 -21628 -24336 -41409 -27900 -13260 -38582 -29453
4045 -29453 -4693 23948 29184 28671 21666 -1050 20195 9964 2412 -2064 -30220 -25992 -5742
4032 -5742 -31108 -21607 6584 23232 3361 -7429 3181 40019 53600 26764 -19059 -13483
4020 -13483 -4611 -28446 -26257 -10481 33459 40004 -2305 -6334 23809 26318 23976 35204 25727
4007 25727 8518 -10672 -3751 17550 37836 44201 35179 30880 -17297 -15235 5227 11024 14944
3994 14944 13052 -5379 -16702 -4991 11252 4199 -13025 -13594 -5368 9845 59013 43057 49316
3981 49316 43135 32740 37300 54790 68804 43853 21194 -9863 -25289 -10733 -5164 -3948 8187
3968 8187 22670 11335 18640 63612 54152 22973 -6925 -13464 14631 3614 -24792 -27528 476
3955 476 14948 4218 -16577 -14089 1431 -1724 -8127 -2500 -34641 -64183 -61235 -37741 -35279
3942 -35279 -16993 -22298 -5052 6356 2791 9016 7420 21152 30788 34512 32410 8902 -24584
3929 -24584 -43426 -46407 -54148 -45807 -51987 -50857 -29573 -21242 -30447 267 31070 27627 22515 19611
3915 19611 -141 -14910 -7980 6098 16008 5161 18059 7887 12229 6730 7034 -1525 -11157
3902 -11157 -15495 -12219 -22057 -25333 -14894 2645 9999 13871 26744 19797 13054 -12400 -48186
3889 -48186 -58586 -29689 -25274 -30620 -7523 -5690 -701 9832 26078 46102 49934 50156 46855
3876 46855 32319 1839 -16176 -37253 -28050 -14434 -17350 -14725 -17932 -6262 4633 20211 -698
3863 -698 3824 29572 21329 22191 36931 44223 31550 8068 -26116 -28054 2214 -11794 -49931
3850 -49931 -51964 -10520 3817 -14122 -30041 -43403 -33043 -19004 -23402 -26921 -15452 2384
3838 2384 -15318 -15944 -3406 9462 -6665 -6381 -22489 -39397 -19787 -37137 -11605 7681 2108
3825 2108 -32018 -41740 -31117 -22669 -16282 2619 -45816 -49746 -32887 -14144 -14387 -7714 -18699
3812 -18699 -3444 -6857 -15195 -4071 22479 22416 6218 -24709 -32215 -42464 -33912 -29187 -36710 -25700
3798 -25700 -19071 3304 10835 3003 14070 9225 3424 5558 18073 20662 9531 15701 8660 24682
3784 24682 25413 34418 27337 1816 -9412 -4076 -11234 -29157 -26416 -42591 -37021 -37386 -56112 -55540
3770 -55540 -22631 -4853 -8095 -8289 4519 5354 -14271 -17741 4163 17838 -4297 -16448 -5846
3757 -5846 17564 30719 43824 28792 27664 12744 536 -416 -38599 -34803 -17960 -8812 -11251
3744 -11251 -7562 563 2525 -10996 -17210 -16223 -1817 -3470 -6040 8289 2996 -19724 -7528 -8568
3730 -8568 -39815 -16622 -23762 -12558 -14037 -40970 -24410 -8579 -3878 9196 7502 15960 -9993
3717 -9993 -22712 9556 26334 6292 -19262 -4167 236 14990 29688 48588 31097 -10064
3705 -10064 -22836 -23435 -17572 -30782 -21155 -17399 -6092 -49 -5952 -27197 -16527 34378 58624
3692 58624 49229 13460 -16858 -24121 -5635 -18748 -48559 -27761 1016 11124 11731 -346 -10031
3679 -10031 16399 21149 7566 -10164 -19709 -7847 2609 -13103 -2550 -16975 -23857 -3464
3667 -3464 24430 41359 43985 59311 32133 23617 25814 40090 32607 16769 31161 18165 8288
3654 8288 -12553 -40372 -16142 9776 16176 -1895 -12236 -11961 8712 14925 8033 1358 -701
3641 -701 -13272 -26753 -21685 -13811 -5660 -10191 -5915 3763 9594 15923 14460 13145 21057 -4388
3627 -4388 3416 19966 -7394 -20007 -10154 -13649 -7821 5016 25191 10393 -3872 -15882 -16672
3614 -16672 -17537 -1620 28904 59063 51363 42848 21615 27134 15194 -15974 11617 36637 26628
3601 26628 -635 -6441 -9741 26708 27009 10143 11490 -3448 -11029 -19322 -11657 -390 9434 1491
3587 1491 8008 36843 31652 25316 29665 18391 -7853 2236 290 18833 4699 -7097 8293
3574 8293 -67 -2789 -23057 -9637 16853 15279 13615 2579 7909 372 -27215 -31851 -23049 -26200
3560 -26200 -44471 -39467 -7856 2595 10404 -5083 -22079 -16082 -31538 -22221 -501 21967 15393
3547 15393 7078 3500 9153 10854 1930 -19446 -11226 -4208 -21718 -12927 11412 36575 45045 1473
3533 1473 -9910 18150 8376 6874 -2392 -16443 -38642 -34411 -43576 -38422 -25013 3461 1530
3520 1530 -4355 -9429 -15568 10936 26110 32195 15516 17483 31655 40737 52424 20524 2915
3507 2915 -16060 -7420 -4862 -15439 -9182 -14028 4704 14008 17869 25822 21612 10188 23009 13974
3493 13974 8577 3885 -13991 -7815 -4068 -21930 -19347 -26450 -11087 -6036 -12682 -1348 -11134 -10397
3479 -10397 -9869 -1536 -1731 -24503 -49141 -48098 -23523 7568 39301 34680 38573 26412 12799
3466 12799 5415 5680 -112 14798 25651 27171 17518 -18757 -27236 -7753 -12514 -16972 7489 20573
3452 20573 13630 26939 21036 16565 12341 -15993 -23409 -6728 9003 -6083 -22679 -16712 -5453
3439 -5453 9187 12326 -12723 -48810 -45086 -25754 -23025 -19669 -24351 -12143 -5422 -13294 -21850 -22888
3425 -22888 -39444 -64298 -51235 -31037 -29740 -14763 95 20939 33161 16063 -6262 -9130
3413 -9130 -3441 -19103 -28941 -36293 -46707 -26151 -19982 -55300 -67881 -42197 -31316 -18125 -17087
3400 -17087 -23183 -14813 4373 3826 -8119 -15391 -13486 -25119 -28788 -15814 -6188 3730 10160 1712
3386 1712 -379 7285 9689 23123 34619 18697 205 -9069 17323 34267 27719 32545 30047
3373 30047 18082 4992 18367 35759 39071 15214 25217 43695 26967 1240 -5230 -17435
3361 -17435 1521 13674 17774 -8144 -3824 -13944 -8729 12550 27562 -6477 -18141 -13050 999
3348 999 5407 -7421 8066 23391 25878 24320 27524 18282 9821 -938 -16846 -7580 -10619 -5366
3334 -5366 -26226 -34703 -20455 -21061 -1188 28493 18322 -6169 -15711 2092 -2748 -15897 -10813
3321 -10813 -7662 -12827 -12528 987 7037 4582 -1376 -15356 -11039 -4833 -5318 -27456 -57359 -52771
3307 -52771 -42640 -30495 -28916 -10428 -8926 -3979 -2934 15423 50898 28571 26528 25469 5550
3294 5550 9730 10065 -2792 337 -6414 -14883 -35656 -57701 -44189 -19801 7115 3697 -28478
3281 -28478 -47198 -26192 -19045 -22340 -7790 8472 14013 30408 3505 -8221 -27107 -37077 -24887
3268 -24887 -30236 -9099 -6158 -9424 9335 20148 13115 -2571 -28911 -38119 -35805 -3017 8435
3255 8435 -9269 -23307 -8484 8501 8639 2134 7447 14115 18837 8719 1183 23891 31493 29923
3241 29923 2732 -29494 -19520 8951 10944 14540 -418 5702 4704 19741 50211 57648 47570
3228 47570 47929 37141 21214 -8130 -35562 -32050 -22502 -6177 -2794 -10182 -23043 -30876 -17839
3215 -17839 606 4377 4345 -11395 -35456 -40854 -23295 -20496 -38475 -36536 -11033 -15329 -1794
3202 -1794 17698 8644 -20661 -24548 -13896 -6921 -32255 -25208 -191 4203 -2111 -32645 -51152
3189 -51152 -38634 -22616 -11065 -27838 -35773 -25835 -1078 -1212 -3817 2584 22447 35508 9398
3176 9398 -8658 -29726 -7896 19884 28476 30571 13798 -6597 -1746 32488 46565 65481 29107
3163 29107 -11104 -11938 -4193 19240 27151 26021 29675 27435 6871 -955 7186 24038 36796 34711
3149 34711 28129 5792 -17068 -16231 -30806 -21465 13506 38547 27656 2394 -9452 9507 -1110
3136 -1110 -16838 -18384 -21842 -11465 10613 7565 -28612 -34487 -41972 -29284 10180 21593 14576
3123 14576 19783 10571 -3855 1756 23291 10099 29866 60184 45272 37801 23167 7803 -3873
3110 -3873 -17960 -2074 35118 34135 486 -25877 -27565 -8889 -31044 -48356 -38102 -34270 -22424
3097 -22424 -24756 -25938 -14192 -13322 -21562 -8249 -13460 6318 34509 21919 -7165 -8633 -28
3084 -28 2972 -20846 -22467 -20711 5306 27542 24276 11290 964 -2735 -5865 7711 15873 30022
3070 30022 9481 116 7699 9830 -8593 -23524 -15780 1787 -17745 -1021 25856 43085 47935
3057 47935 32159 -344 -34091 -20735 -18873 15659 32364 4500 -27309 -4297 9870 4614
3045 4614 5188 -17437 -31954 -10364 19993 2201 -11907 -5975 -5420 14893 4266 -26304 -16866
3032 -16866 -29990 -28275 7790 18613 12913 -10670 -31190 -10792 1028 3772 -5079 -41725 -21674
3019 -21674 -8441 -12612 -14788 -13904 11 379 -17899 -23775 -5716 4050 -12124 -3646 -542 -29481
3005 -29481 -23342 -57417 -93833 -61448 -45488 -24541 5648 43053 40402 16750 -584 5301
2993 5301 25094 20431 21087 5301 -5881 11094 3617 -2708 -3945 -21208 -23936 -34335 -26826 -18412
2979 -18412 -23112 -13300 10159 -6246 -8115 -9799 11878 23189 8744 9203 23064 27696 9376
2966 9376 32645 16127 -3267 -3997 10864 11392 7913 6304 7474 16388 27189 36773 16771 282
2952 282 -4123 -17942 -32272 -34335 -35214 -20278 -28381 -43001 -29927 -17417 -26883 -19731 -5549 -21518
2938 -21518 -12927 3016 21211 20451 9927 3232 -14190 -16314 -1357 13114 22497 32926 50111
2925 50111 53964 30423 -11562 269 6440 14445 8825 -5212 -3639 -20548 -28126 -8468 3080
2912 3080 10236 -6404 -15144 1422 -13699 -38937 21861 32567 24929 18695 7147 590 12711
2899 12711 27988 18189 10377 -3031 -18216 -16096 -13793 -35297 -47447 -37172 -46841 -21887 1109
2886 1109 -1009 2649 -5720 -25944 -26323 -9883 -4468 -8169 -11564 -26962 -15482 -17703 605 16591
2872 16591 15253 5256 17317 31583 10722 3576 12967 18330 1127 -1768 -10747 -20161 -9756
2859 -9756 -11943 -15378 -8349 -5601 -5897 -11742 -4943 -11607 -4720 3961 -12562 -26500 -11793 -7774
2845 -7774 19340 46119 59427 62018 19122 -3252 -13084 1717 -9956 -6220 -19509 -23406 -29193
2832 -29193 -13014 7531 -20558 -35592 -19000 362 10740 8108 -19166 -15390 -24718 -65419
2820 -65419 -71198 -47955 -9766 -13847 -19340 -16223 -23773 -65877 -76139 -61784 -70597 -45574 -49218
2807 -49218 -14173 1093 -8794 22158 26273 18815 34509 26410 12393 13515 8566 -7678 -19328
2794 -19328 -14094 19120 43163 47992 36595 15353 -12594 -25635 -42423 -29606 -31331 -41685
2782 -41685 -26545 -33685 -40854 -29656 -35276 -48984 -44918 -39955 -14018 -40493 -40527 -35293 -28167 -10822
2768 -10822 -14025 -6782 -12279 -28878 -37812 -5335 21483 31907 22606 -8419 15267 22223 17086
2755 17086 10662 -8834 5272 18403 6561 5933 12071 30522 5217 -23451 -47171 -25224 11805
2742 11805 13907 12911 20352 30405 11420 7710 28129 15442 4863 17701 19392 2260 -14617
2729 -14617 -10080 -3413 -3007 -31986 -45490 -29647 -9853 -19591 -26522 -31943 -19750 -17469 -5196
2716 -5196 1823 11502 23678 8073 -32784 -22198 -3656 -5552 -1474 8484 7088 -13666 -20837
2703 -20837 6540 -16149 -40808 -45287 -44150 -43976 -9552 -3435 3540 5355 -14060 -4200 10135
2690 10135 14934 5235 9906 33174 52207 45364 32834 19795 21433 10028 -13796 -26836 -41425
2677 -41425 -11686 12589 10650 19288 22782 25725 25788 15151 9430 -1767 -8637 -146 1644 -802
2663 -802 -2414 4794 -1256 -7191 4531 10555 -14282 -15952 -44519 -40875 -5587 2087 11585 29892
2649 29892 40521 27356 3554 -21970 -9954 -17983 -19490 15604 46644 29218 -25425 -21867
2637 -21867 10369 20654 9584 6402 -42782 -59409 -50372 -34568 -51476 -53621 -42924 -40183 -24304
2624 -24304 -23632 -21615 -13981 -7619 -1467 13365 44464 35357 8954 -11660 -14098 5921 65942
2611 65942 79359 91603 90305 72026 55887 56621 45586 36093 46004 34714 18955 21025 -18489
2598 -18489 -30934 -6748 18753 23810 25776 46284 63881 74060 25307 10496 954 -22425
2586 -22425 -25922 -17018 17015 60218 59280 32238 22142 12824 -15763 -27336 -14349 200 4380
2573 4380 9304 -8576 -29354 -40444 -48844 869 48918 47733 16850 290 -2441 -7024 7848
2560 7848 -4724 -22008 -8370 -21953 -10998 -13424 -5593 18 -15336 -20383 -20563 -28028 -46226
2547 -46226 -65336 -45741 -19721 -34107 -26144 -24569 -16472 -3564 -12867 -7168 -5954 -14414 -29219
2534 -29219 -17993 -11738 -18608 -7431 -24608 -11417 -22569 -17102 614 8496 18484 21626 20823
2521 20823 19221 26397 24423 32246 9543 194 14403 27473 7489 1428 22783 56027 57465
2508 57465 44560 821 -36213 -32519 7352 4956 11220 8335 9060 -4165 5043 14622 13754 19424
2494 19424 -2150 -10919 -18676 -24903 -20299 -44054 -44879 -28598 -14094 -15688 -14440 -18401 13554 -1268
2480 -1268 6887 37419 42566 37320 10115 3013 13589 4293 -2819 -25940 -53519 -40571 -7625
2467 -7625 3402 -3220 -14245 -10380 5916 6087 2970 11091 22399 27555 56256 36697 -14650
2454 -14650 -22508 -4202 -23191 -40586 -32302 -2918 40060 59821 42844 18496 15344 24734 5660
2441 5660 -6262 -24443 -30546 -34269 -23613 -5614 -5708 -6522 6799 12578 -1500 -14329 -21326 -33990
2427 -33990 -35614 -10180 21748 8803 -3222 -30738 -21204 -19202 -13953 5740 27715 33223 41731
2414 41731 18665 -10505 14191 41351 20217 -18036 -18238 -16696 3588 2209 -11251 -2515 -5260
2401 -5260 -2342 -15001 -14154 -1416 -15824 6394 13764 -8594 -4510 29828 55888 55610 46304 36637
2387 36637 27387 2614 -2454 -229 -4785 -2800 -29084 -16190 2958 37300 48658 45982 23388
2374 23388 -46 -24544 -23031 13210 19061 16188 15347 6546 16078 11382 34821 37680 34369 13890
2360 13890 3454 8911 14610 8999 22648 41980 38315 35166 23635 13652 12752 28723 55986
2347 55986 63649 44685 42069 28587 -8598 3978 28882 11450 2861 14899 -2026 -7726 -14269
2334 -14269 -15953 22368 34666 31998 51931 48167 26951 39335 23991 -321 -1032 28477 11949
2321 11949 5097 -5529 9305 15214 31412 33678 34985 26845 20875 35385 17880 1352 -14326
2308 -14326 -7543 3695 -27695 -21013 15563 29608 40715 25500 11934 -27372 -42802 -9123
2296 -9123 5607 7381 27792 42599 38680 -1972 -1431 31003 42407 28780 6543 -10016 -15342
2283 -15342 -2645 18659 16173 19785 35478 40005 26332 18050 -8802 -2048 7609 2027 -12785
2270 -12785 26234 32797 31553 19608 6922 11789 10934 7488 22649 40314 35618 17898 5932
2257 5932 -13771 -17455 -2103 14622 18356 10942 22519 9965 -11040 -38854 -37436 -34427 -11840
2244 -11840 11883 8605 12237 7300 -19102 8433 -2671 -22251 -690 10983 13381 -3823 13910
2231 13910 3168 -6447 698 21039 49159 59448 41639 9956 1245 34959 55350 64489 60152
2218 60152 35583 34734 15408 7490 -4070 -3577 6400 14073 7335 16950 -1869 -37384 -6680 15613
2204 15613 38591 12124 10925 29780 29464 32098 20300 6445 -101 -5459 -22939 -9729 -10839
2191 -10839 -10053 6359 2835 16142 9471 690 -2859 6804 14437 -9777 -2228 10710 22262 18349
2177 18349 13201 7386 9943 34281 44304 17827 -18504 -21127 -17165 -5144 10168 -11109 -25461
2164 -25461 13585 20611 14113 8192 17402 14188 13771 -1488 -13797 -16448 -1658 21937 21760 17140
2150 17140 21194 22086 -1577 -2307 -530 -17969 -40059 -27318 7153 12253 2085 -12086 -12978 -6958
2136 -6958 -4058 10663 27543 17877 -21787 -46170 -25628 -23794 -44058 -43018 -32841 -12311 -18950
2123 -18950 -14964 -7964 22246 24443 43464 15479 -37294 -42016 -38069 -35626 -36772 -46032 -24914
2110 -24914 -10596 9109 -3435 -19537 -19884 -8313 30118 39315 20775 -4823 -16612 8621
2098 8621 24182 6251 9643 5600 21850 18144 -3301 -3525 -3811 13981 27327 21010 409 7477
2084 7477 -3493 -14624 -20 -14882 -8328 11188 10050 -11985 -13447 -11501 -12396 3140 27207
2071 27207 25971 -2764 6001 21601 18092 -21430 -13727 1351 13486 26032 51772 57962 42812
2058 42812 28045 5046 10181 16173 5393 -6164 3222 13376 11946 15408 37562 21288 12668
2045 12668 11584 6605 29865 27991 48202 55176 18975 -6422 -10597 -25842 -52925 -39876 -1925
2032 -1925 6203 -9393 11936 38253 12721 -10536 -24585 -1709 12380 43625 55080 39664
2020 39664 25286 16981 13856 -2519 -2937 10339 27901 23683 -1009 -15314 -20478 -33928 -45842
2007 -45842 -22974 3569 -5920 -12192 8273 19367 25403 17579 33336 33800 7968 -3974 14240
1994 14240 6669 13475 19786 37627 50326 67214 67728 41299 19265 13619 30809 24502 246
1981 246 -9289 -18570 -39772 -24185 -8584 18281 24193 27151 34701 15424 -23142 -18462 -22828 -58332
1967 -58332 -61985 -25131 -11974 15336 39841 20821 14914 2717 -450 1386 -7922 7382 -4126
1954 -4126 1226 3936 -2699 9513 24450 33674 16074 5837 4495 -23783 -33030 -26120 7056
1941 7056 23008 27445 50920 29788 -12627 -1281 -5444 -19690 -32424 -34932 -24468 -11544 8413
1928 8413 -22039 -29707 -16987 -15259 -21403 1593 31680 24023 11247 -2549 -15289 -25706 -5191
1915 -5191 13839 -5843 -5829 3589 10199 2260 9907 4858 3158 -13091 7868 44666 35413 26805
1901 26805 15322 20223 34861 28573 31878 32049 20247 21151 27253 39297 19193 -3192 10981
1888 10981 18337 17463 20352 10294 -10892 -26977 -27454 -8603 -4356 -12048 -27716 94 17630
1875 17630 18838 14047 14686 19432 -9247 -42054 -39876 -12646 10897 20383 24636 14351 -9329
1862 -9329 5702 15945 11924 23887 28774 33661 55887 78380 52821 25959 14537 29213 36043
1849 36043 15634 3363 23843 7173 -12026 -15702 -21736 18885 59846 46439 24351 12572
1837 12572 13364 12805 10216 568 6677 10122 -2596 -12950 17844 31995 31047 24817 33651 57257
1823 57257 100961 85346 28273 -1901 -838 13630 23392 16932 16126 17605 -5956 -6232 -1991 14357
1809 14357 17750 -9351 -6253 4441 8577 14669 9898 -845 -4531 1496 21288 289 -8356
1796 -8356 -9265 -98 32798 48567 35470 27611 26839 26011 6584 8372 3630 -5707 8373 6793
1782 6793 -359 5864 31578 39299 37512 19644 5138 15526 34398 39895 31190 21071 -4440
1769 -4440 -13517 -7395 -10237 16057 21075 17812 29805 35495 9828 -10615 -12773 -20763 12203 42791
1755 42791 45063 38671 37034 6 -23912 668 -14640 -40833 -43267 -24312 -5970 -4553 -24175
1742 -24175 -28617 -27097 -14048 -5847 30074 33377 -6751 -9610 -1854 -15857 -31710 -31077 -29453 -25969
1728 -25969 -5118 15362 6279 7 17156 17446 -8574 -39324 -30627 -6523 -3986 -33370 -21867
1715 -21867 -16153 -22362 -24183 -37599 -34506 -27133 -22630 -18295 -16176 6657 13287 -1298 -19031 807
1701 807 21465 34178 33128 25612 22657 27690 19819 14592 9948 24290 47760 56935 54445 48175
1687 48175 14024 5144 31570 47473 44837 30933 19679 26817 23529 22506 -10758 -11431 20910
1674 20910 24937 -1580 3656 14448 13366 21917 18870 -15368 -41000 -25422 -10947 -14385 -18036
1661 -18036 10288 37720 15458 -4717 -3642 11433 7989 -21497 -5350 12018 5067 3385 15991
1648 15991 4524 -7790 6569 18168 25363 41900 37738 40094 35967 13988 -2462 21572 43094
1635 43094 58542 69180 72778 71930 61746 40698 6717 8545 63 -1532 7929 3605 -9320
1622 -9320 -36042 -58105 -46127 7259 39306 49233 49175 48036 57620 69156 58368 41631 35713
1609 35713 18073 11864 11309 31285 23996 23935 10648 1356 -923 1713 -10064 14048 52800 59894
1595 59894 60447 71416 83297 53326 24284 -12677 -27089 -22700 -1852 6192 -25461 -25442 18507
1582 18507 24568 17524 11924 -2221 -14681 9683 28078 18255 32237 39807 53551 72104 67968
1569 67968 65863 37540 -2519 15298 41472 36268 9133 -14398 1260 21541 15574 -5352
1557 -5352 -7267 -2528 -18032 -21153 -15595 -19737 8380 9366 12993 8017 12516 -1679 -25355 -41368
1543 -41368 -48687 -39999 229 39763 27593 10296 15834 35097 30637 19099 6288 -10734 -39064
1530 -39064 -18173 4239 17492 41166 33253 21497 32561 39810 31783 36710 26883 37416 72085
1517 72085 57498 44173 16387 -2271 -10319 4219 -5355 -347 33295 21692 -7519 5374
1505 5374 18204 5949 3410 597 17094 12233 23224 44434 50897 21613 6571 32759 60200
1492 60200 76337 49062 17338 4670 -1510 -8116 17900 64112 71670 52251 47863 27255 6254
1479 6254 -14908 -33117 -4413 3086 -4882 -3265 -9433 -7886 -7706 -58 14070 15271 565 24541
1465 24541 19359 5586 -3659 -9230 -10489 -27492 -10093 3357 6566 9281 16232 24459 30318 -6853
1451 -6853 -37969 -22655 21812 28839 4664 -26539 -31463 -17955 -2069 -12827 -4409 8434 -2707
1438 -2707 -7932 10003 35261 60056 43667 40102 58492 59192 31551 12903 -15138 -13677 29258
1425 29258 36936 19915 -2500 -17007 -31356 -46525 -23805 -27002 -26286 -11951 55 12438 -1395
1412 -1395 -2096 -14007 -16489 -6716 12390 7669 1415 18261 27386 12707 17920 20550 3270 96
1398 96 29791 16766 12652 22601 26684 32047 46210 34772 -1257 -17136 -11287 22944 33178
1385 33178 39157 52215 39042 21122 21312 25204 9985 4757 5261 -12518 -24322 -12482 -2752
1372 -2752 -3304 14114 37252 43781 34872 26890 30699 19780 7413 6112 16537 46961 66848
1359 66848 35273 14793 -2392 19583 31341 5858 -6807 -5477 2270 4754 17939 20868 38468
1346 38468 29422 23152 2232 -18190 -9573 3658 -9943 -19444 -11312 5859 8795 28607 42855
1333 42855 35263 639 -6124 -2426 5549 33293 41154 7849 -8956 -9542 3991 12772 24687
1320 24687 23343 27978 13868 -24329 -33045 -1852 14858 18936 7612 19091 35045 46897 41055
1307 41055 30366 10532 6814 17463 23393 52892 42990 20536 3674 -20864 -30180 -25073 -24615
1294 -24615 -30039 -29985 -18533 -8893 14097 10098 -5663 12035 7989 4975 20791 49080 59744
1281 59744 20229 -10524 -5207 1906 3089 9523 1998 19084 11144 -903 -12463 -14500 -24757
1268 -24757 -31371 -26085 -8795 17093 36239 41125 45830 26518 -1723 -17090 -19698 -3406 -6843
1255 -6843 15149 30149 -464 -5619 -9321 -4932 6210 2075 -13448 -5520 14158 11802 -5189
1242 -5189 690 10382 2035 8587 11446 20404 -1817 -158 8213 7988 12095 -474 -14148 4386
1228 4386 15730 19176 43220 43822 22725 -2764 -19863 -18073 -26907 -49413 -53648 -22373 -17086
1215 -17086 6605 16619 576 -2758 -6943 -24342 -14711 23203 44872 31352 39470 43572 38569
1202 38569 8547 -11147 -9932 -530 -4048 4860 18708 12943 2749 11769 -7106 -939 6595
1189 6595 20564 3796 -2875 1722 32442 30660 33113 19187 10092 5858 27170 31204 16834
1176 16834 28590 44435 47565 44703 52280 62124 64279 44213 26007 1976 10070 24283 24536
1163 24536 24247 21169 17659 24106 20037 -311 -43 8682 10663 8969 8265 25965 17992 25459 66708
1148 66708 74083 70857 82339 34771 17535 28065 30810 30971 27742 4892 4915 9951 24965 3413
1134 3413 16143 30912 29630 29295 9210 -16998 21672 54029 35747 20123 2963 18078 66425
1121 66425 59189 46408 38551 13951 20738 57309 63352 36642 14707 18804 46055 47457 28866
1108 28866 17863 39713 58855 45425 31409 14932 37467 39667 23265 -1117 -27097 -29885
1096 -29885 -17674 -10124 -20209 -41988 -22893 -19594 -9933 3472 -27948 -43296 -36291 -42438 -13378
1083 -13378 30724 36254 19850 8325 -1867 22263 42464 39647 55430 59524 33660 24115 31070
1070 31070 15313 -2328 -12106 -14273 -8913 -14365 2791 15152 26642 29316 9420 -17016 -26620
1057 -26620 8564 20784 36923 37093 24445 20353 41134 52298 36987 14581 1582 -28105
1045 -28105 -22958 104 3355 21910 21310 6470 6732 17711 36970 30751 23947 25928 22609 31744
1031 31744 60845 55784 39380 31296 14481 -5957 -1132 -16504 -13744 18351 24919 12055 7451
1018 7451 -13764 -31605 -21708 -16181 12092 42425 32436 27827 49942 53695 18140 -914 10874
1005 10874 -18190 -39555 -39117 1604 16874 29535 53172 50801 38254 66120 66989 58701 59232
992 59232 52622 31072 8735 16960 30996 39729 36091 20416 21883 11972 -129 -18051 -1809
979 -1809 -7138 -15282 2030 -16293 -3377 24614 32811 53369 61396 30783 31392 21148 29980 15237
965 15237 -4822 33120 34615 8184 -18949 -11408 4465 30215 33828 23157 -148 -7874 12858
952 12858 10780 4646 685 -12537 -3680 -10308 -24669 -7563 17189 41109 39212 34165 57619
939 57619 61578 40626 10531 -222 -3317 -5569 -24763 -16031 -26530 -9086 26500 46558 3123
926 3123 -27059 -10928 18655 22933 29093 59954 60904 58988 48327 62802 60198 40223 22967
913 22967 16522 13363 15964 14672 -9720 -29266 -5322 9634 2679 -1230 -8940 4141 3959 10181
899 10181 8786 5222 -14484 -17631 -8480 -20820 -4885 18991 -3763 -25337 -24633 -47671 -62286
886 -62286 -48414 -37343 -39268 -69994 -72665 -34570 -15477 -20632 -3843 8267 14822 1187 -12520
873 -12520 -23332 20316 47463 34716 24903 6678 -10796 -5282 -4463 7523 36748 28869 18378
860 18378 13567 48931 66832 38243 -9412 -29607 -19948 -12719 -14174 6407 29909 42547 13797
847 13797 -21445 -53511 -42187 -28247 -32735 -29658 -18801 -37514 -32964 2024 11119 -16158 488
834 488 13443 -193 -1458 11496 25331 12838 7323 -2514 -7450 21597 31984 22423 24492 16694
820 16694 21166 6567 -8187 8995 16215 9254 -16633 -3223 19850 5352 15291 18372 2624
807 2624 22497 21749 1838 7763 15454 22153 22024 30674 25942 37039 35422 13624 15679 30027
793 30027 27877 26550 25250 21040 -2903 -7755 -4066 -4978 -12137 -25756 -38056 -32456 -31783 1307
779 1307 13975 36983 46519 37804 47571 51208 39618 34243 10344 2149 3591 17535 5062 6419
765 6419 3334 13908 8982 9235 14130 12217 -20857 -38907 -49402 -37703 -13031 352 -9456 6790
751 6790 34888 47458 59412 60916 63891 32722 10040 33052 39851 50650 41171 5625 13378
738 13378 35091 39510 32602 34016 9009 5356 18460 17577 1583 14774 34704 17716 14333
725 14333 29967 -5578 -11149 13910 13548 1023 -475 10317 15847 43664 30891 -17627 -34905
712 -34905 -23663 -3939 20682 31094 22790 26107 31423 43159 56612 37581 21126 -7428 -7149
699 -7149 4533 -5374 -24074 -30483 -10839 19688 -368 -2104 -3156 -1510 9713 -24978 -31090
686 -31090 -10437 17032 31781 8970 -12329 -10219 20871 35116 60721 60378 59779 62230 66011
673 66011 52310 27313 26736 13089 17263 5096 -9443 14675 22447 34174 26842 6469 15672
660 15672 2926 15960 9975 -24188 -31218 -1171 4666 23168 39431 32083 63944 58343 36148
647 36148 43997 51023 14979 -23127 -30610 -22693 5282 29029 9812 16821 39038 41433 37287
634 37287 16790 19106 49870 31779 -9521 -21857 -15198 7216 4127 10359 28386 -4414 -33872
621 -33872 -29925 -401 -2895 4879 20168 13799 7580 2683 12647 27145 29334 46634 60951 31821
607 31821 2929 8481 20255 2313 -9745 -17588 -16908 -22800 -29913 -35720 -19144 6545 22708
594 22708 6220 -4802 22454 15231 19039 24985 31893 20340 31242 8754 -4553 -16100 -19938
581 -19938 -11224 14681 14789 10765 -677 -18454 -25355 -26030 4105 19940 23181 56267 62553 46987
567 46987 28562 11987 11825 10325 -7185 -21857 -9957 1873 262 12343 26606 42458 41053
554 41053 44520 29089 14272 6801 26579 14468 1651 6954 -1269 -15692 -17796 -19041 -15375
541 -15375 -2139 15031 -2809 -22174 -8798 11797 -17927 -21250 -30382 -27249 -5155 25032 9795
528 9795 -16911 -14508 1560 24141 33845 38353 46503 37029 22950 8505 18117 26171 37182 38594
514 38594 33926 21333 50379 64127 43441 36940 50406 76889 62094 36741 8524 32183
502 32183 53977 53786 24567 36836 45207 20284 -10384 -7483 13469 29564 22976 24284 22791
489 22791 4330 -14185 -23167 -5946 35032 34992 38929 30095 6346 33725 39343 34791 15049 12358
475 12358 12481 7410 21845 -6132 -37987 -34075 -36441 -6768 10509 12043 14154 21388 7134 -8538
461 -8538 -11952 -7187 -14282 -15888 -12191 -24963 -4847 5073 7166 18972 26088 8701 -9045 12873
447 12873 5086 -25199 -9899 22493 18192 9212 4083 20555 20836 3716 -1022 8162 23783 37352
433 37352 24934 8650 -3053 -3461 -6718 -4402 -15766 9869 31525 27729 3213 3772 18115
420 18115 14076 16625 24961 33318 34235 32999 31428 30785 21171 7381 3696 -1426 6811 -2655 3508
405 3508 22266 27045 9165 -7283 -1814 15708 16224 -11752 -15544 3402 9333 4463 -3380 5618
391 5618 12706 -23133 -46629 -24113 520 16287 19228 23757 33033 20026 34312 35159 36748 26299
377 26299 37634 41614 32214 34243 53383 27028 -1271 23642 18199 -4439 -1070 8790 1389
364 1389 4002 12698 6756 12605 26552 6509 14249 28635 47485 22385 45076 32781 15495
351 15495 16570 40481 28048 43334 53972 54785 26465 15396 1276 -6234 -24143 -40983 -31806
338 -31806 -16259 -34769 -48968 -48863 -43179 -48637 -39055 -41814 -47652 -51354 -17791 -26312 -22133 -17025
324 -17025 -7105 -17014 -11541 22042 10226 -11816 -5507 -9869 -6695 6077 19291 30574 39823
311 39823 31348 34583 31907 19247 12739 24007 8287 25727 37698 46793 52776 33841 9353
298 9353 -1072 2639 12996 17205 24873 38443 24812 14356 185 7400 21696 29105 39376
285 39376 46463 64234 76565 55646 38211 34249 21252 7484 6939 10022 4146 22660 33759
272 33759 27728 21911 23229 14905 3251 1657 10514 14116 19296 26507 3863 -7414 26957 30733
258 30733 26372 24683 -8400 -18734 -6658 -23011 -2343 20296 30835 15756 -2069 -8438 -16316
245 -16316 -15869 8243 24780 12478 21495 26620 23124 37631 45025 35717 11211 -20782 -16153 12887
231 12887 3493 -6760 -17253 -14342 -23224 -31175 -22127 -13343 -22221 -26863 -36257 -19627 14536 11173
217 11173 -7176 -1274 1089 -7705 3568 20408 30364 42675 37825 31334 23061 11939 33387
204 33387 27043 26999 32083 19776 19716 25583 8657 2771 1374 13810 13461 -7140 -8399 -10041 -27825
189 -27825 -26002 -1723 17976 50248 55009 40287 57421 42969 37187 17620 2450 -7510 15192
176 15192 24743 34947 39373 48611 27175 11087 18245 19792 30376 47088 51874 17929 15930
163 15930 29747 36607 23500 29834 22249 17636 41172 49335 36520 30611 45879 56393 30923
150 30923 26759 41816 35601 25286 26175 28564 16106 2226 -10838 -11582 -11332 -8127 2226 8070
136 8070 23846 8453 10798 23348 21454 16733 11594 -7673 -6206 -6988 -19708 -12287 -1103 -552
122 -552 -4833 -12746 -6405 -4147 -14397 -32209 -29853 -25868 -43765 -47013 -40447 -37508 -35524 -19911
108 -19911 -8478 5429 427 -3652 -7107 -534 20885 24908 12324 23185 22964 4937 6061 13733
94 13733 15283 11111 10178 11607 -6283 5332 11772 10036 13964 16332 808 -583 4316 392 9635
79 9635 22719 25283 28260 23846 20336 4858 -7148 -7642 270 22395 20896 8733 10597 -6340
65 -6340 -21524 -16224 -354 -1278 -4386 7335 15775 1424 -11074 -9103 -13932 -29725 -47303 -34664
51 -34664 11609 34429 35554 24977 20787 16282 16964 24152 18320 12802 9474 7768 14249 8223 18935
36 18935 30207 14445 -1408 940 14438 25831 27432 19407 12408 20904 45497 46478 43683 31359
22 31359 31671 20830 19704 9070 10621 -1202 -10968 -5560 8199 8398 4546 -2878 16390 19347
8 19347 19669 33907 22458 6254 11165 12382 5099 10802
0 10802
$$ Imaginary data points
##PAGE= N=2
$$ [...]
##END NTUPLES=NMR SPECTRUM
##END=
