##TITLE=Analysis number 330382
Compound Code cc 23010
Project Code adrs
Chemist Name fudan
##JCAMPDX= 6.0         $$ Bruker NMR JCAMP-DX V2.0
##DATA TYPE= NMR SPECTRUM
##DATA CLASS= NTUPLES
##ORIGIN= Bruker BioSpin GmbH
##OWNER= nmr
$$ XWIN-NMR		Version 3.5
$$ Wed Nov 21 10:10:32 2007 GMT Standard Time (UT+0h)  MAYBRIDGE\nmr@NMR_250MHZ
##.OBSERVE FREQUENCY= 250.131544655141
##.OBSERVE NUCLEUS= ^1H
##.ACQUISITION MODE= SIMULTANEOUS (DQD)
##.ACQUISITION SCHEME= undefined
##.AVERAGES= 16
##.DIGITISER RES= 18
##SPECTROMETER/DATA SYSTEM= dpx250
##.PULSE SEQUENCE= zg30
##.SOLVENT NAME= DMSO
##.SHIFT REFERENCE= (INTERNAL, DMSO, 0, 16.522)
##AUDIT TRAIL= $$ (NUMBER, WHEN, WHO, WHERE, WHAT)
$$ ##TITLE= Audit trail, XWIN-NMR		Version 3.5
$$ ##JCAMPDX= 5.01
$$ ##ORIGIN= Bruker BioSpin GmbH
$$ ##OWNER= nmr
$$ C:\u/data/dgb/nmr/ADRS/1920/pdata/1/auditp.txt
$$ ##AUDIT TRAIL=  $$ (NUMBER, WHEN, WHO, WHERE, WHAT)
(   1,<2007-11-21 10:09:50.97 +000>,<MAYBRIDGE\nmr>,<NMR_250MHZ>,
      <created by zg, POWCHK disabled, PULCHK disabled
       configuration hash MD5:
       76 6E 9A 78 1E 09 19 81 EC 84 63 8F B0 6A 59 2D
       data hash MD5: 64K
       95 4B 2E 4C 4F 21 11 19 31 C4 EA 0D 08 90 1F 70>)
(   2,<2007-11-21 10:10:11.80 +000>,<MAYBRIDGE\nmr>,<NMR_250MHZ>,
      <Start of raw data processing
       ef LB = 0.3 FT_mod = 6 PKNL = 1 SI = 32K 
       data hash MD5: 32K
       8D E0 89 E7 2E 16 A3 64 35 0C EC 4B D5 22 C1 79>)
(   3,<2007-11-21 10:10:13.82 +000>,<MAYBRIDGE\nmr>,<NMR_250MHZ>,
      <apk 
       data hash MD5: 32K
       D8 04 B6 6D 07 E3 DA 4C 38 4F 52 EB 9B E7 74 EE>)
(   4,<2007-11-21 10:10:15.01 +000>,<MAYBRIDGE\nmr>,<NMR_250MHZ>,
      <abs ABSG = 5 
       data hash MD5: 32K
       18 06 E9 F6 C6 11 24 D6 4F 31 0D 95 BE 8D BF 3F>)
$$ ##END=
$$ 
$$ hash MD5
$$ 12 EF 4E 91 37 E8 DF 98 9E 10 23 E3 02 50 C4 3B
##$RELAX= 
##$RELAX= 
##$RELAX= 
##$RELAX= 
##$RELAX= 
##$RELAX= 
##$RELAX= 
$$ Bruker specific parameters
$$ --------------------------
##$DU= <C:\u>
##$EXPNO= 1920
##$NAME= <ADRS>
##$PROCNO= 1
##$TYPE= <nmr>
##$USER= <dgb>
##$AMP= (0..31)
100 100 100 100 100 100 100 100 100 100 100 100 100 100 100 100 100 100 
100 100 100 100 100 100 100 100 100 100 100 100 100 100 
##$AQSEQ= 0
##$AQ_mod= 3
##$AUNM= <au_zg>
##$AUTOPOS= <5 >
##$BF1= 250.13
##$BF2= 250.13
##$BF3= 250.13
##$BF4= 250.13
##$BF5= 500.13
##$BF6= 500.13
##$BF7= 500.13
##$BF8= 500.13
##$BYTORDA= 1
##$CFDGTYP= 0
##$CFRGTYP= 5
##$CHEMSTR= <none>
##$CNST= (0..31)
1 1 145 1 1 1 1 1 1 1 1 1 1 1 1 1 1 1 1 1 1 1 1 1 1 1 1 1 1 1 1 1 
##$CPDPRG= <>
##$CPDPRG1= <>
##$CPDPRG2= <>
##$CPDPRG3= <>
##$CPDPRG4= <mlev>
##$CPDPRG5= <mlev>
##$CPDPRG6= <mlev>
##$CPDPRG7= <mlev>
##$CPDPRG8= <mlev>
##$CPDPRGB= <>
##$CPDPRGT= <>
##$D= (0..31)
0 1 0 0 0 0 0 0 0 0.06 0 0 0 0 0 0 0.0002 0 0 0 0 0 0 0 0 0 0 0 0 0 0 
0 
##$DATE= 1195639787
##$DBL= (0..7)
120 120 120 120 120 120 120 120 
##$DBP= (0..7)
150 150 150 150 150 150 150 150 
##$DBP07= 0
##$DBPNAM0= <>
##$DBPNAM1= <>
##$DBPNAM2= <>
##$DBPNAM3= <>
$$ [...]
##$SUBNAM6= <"">
##$SUBNAM7= <"">
##$SUBNAM8= <"">
##$SUBNAM9= <"">
##$SW= 20.6930455092707
##$SWIBOX= (0..15)
0 0 3 0 0 0 0 0 0 0 0 0 0 0 0 0 
##$SW_h= 5175.983436853
##$TD= 65536
##$TD0= 1
##$TE= 295.16
##$TE2= 300
##$TE3= 300
##$TEG= 300
##$TL= (0..7)
0 120 120 120 120 120 120 120 
##$TP= (0..7)
150 150 150 150 150 150 150 150 
##$TP07= 0
##$TPNAME0= <>
##$TPNAME1= <>
##$TPNAME2= <>
##$TPNAME3= <>
##$TPNAME4= <>
##$TPNAME5= <>
##$TPNAME6= <>
##$TPNAME7= <>
##$TPOAL= (0..7)
0.5 0.5 0.5 0.5 0.5 0.5 0.5 0.5 
##$TPOFFS= (0..7)
0 0 0 0 0 0 0 0 
##$TUNHIN= 0
##$TUNHOUT= 0
##$TUNXOUT= 0
##$USERA1= <user>
##$USERA2= <user>
##$USERA3= <user>
##$USERA4= <user>
##$USERA5= <user>
##$V9= 5
##$VALIST= <valist>
##$VCLIST= <CCCCCCCCCCCCCCC>
##$VD= 0
##$VDLIST= <DDDDDDDDDDDDDDD>
##$VPLIST= <PPPPPPPPPPPPPPP>
##$VTLIST= <TTTTTTTTTTTTTTT>
##$WBST= 1024
##$WBSW= 4
##$XGAIN= (0..3)
0 0 0 0 
##$XL= 0
##$YL= 0
##$YMAX_a= 494941
##$YMIN_a= -480457
##$ZGOPTNS= <>
##$ZL1= 120
##$ZL2= 120
##$ZL3= 120
##$ZL4= 120
##$ABSF1= 16.522
##$ABSF2= -4.171173
##$ABSG= 5
##$ABSL= 3
##$ALPHA= 0
##$AQORDER= 0
##$ASSFAC= 0
##$ASSFACI= 0
##$ASSFACX= 0
##$ASSWID= 0
##$AUNMP= <proc_1d>
##$AZFE= 0.1
##$AZFW= 0.1
##$BCFW= 0
##$BC_mod= 0
##$BYTORDP= 0
##$COROFFS= 0
##$CY= 12.5
##$DATMOD= 1
##$DC= 0
##$DFILT= <>
##$DTYPP= 0
##$F1P= 14.0000005364418
##$F2P= -0.99999901652339
##$FCOR= 0.5
##$FTSIZE= 32768
##$FT_mod= 6
##$GAMMA= 0
##$GB= 0
##$INTBC= 1
##$INTSCL= 1
##$ISEN= 128
##$LB= 0.3
##$LEV0= 0
##$LPBIN= 0
##$MAXI= 10000
##$MC2= 0
##$MEAN= 0
##$ME_mod= 0
##$MI= 0
##$NCOEF= 0
##$NC_proc= -3
##$NLEV= 6
##$NOISF1= 0
##$NOISF2= 0
##$NSP= 0
##$NTH_PI= 0
##$NZP= 0
##$OFFSET= 16.522
##$PC= 1
##$PHC0= 164.9615
##$PHC1= 4.05973
##$PH_mod= 1
##$PKNL= yes
##$PPARMOD= 0
##$PSCAL= 4
##$PSIGN= 0
##$REVERSE= no
##$SF= 250.13
##$SI= 32768
##$SIGF1= 0
##$SIGF2= 0
##$SINO= 400
##$SIOLD= 32768
##$SREGLST= <1H.DMSO>
##$SSB= 0
##$STSI= 32768
##$STSR= 0
##$SW_p= 5175.98343685301
##$SYMM= 0
##$S_DEV= 0
##$TDeff= 65536
##$TDoff= 0
##$TI= <Analysis number 999999
Compound Code 99
Book Reference 9
Project Code 9>
##$TILT= no
##$TM1= 0
##$TM2= 0
##$TOPLEV= 0
##$USERP1= <user>
##$USERP2= <user>
##$USERP3= <user>
##$USERP4= <user>
##$USERP5= <user>
##$WDW= 1
##$XDIM= 32768
##$YMAX_p= 275512913
##$YMIN_p= -188861
$$ End of Bruker specific parameters
$$ ---------------------------------
##NTUPLES= NMR SPECTRUM
##VAR_NAME=  FREQUENCY,     SPECTRUM/REAL,   SPECTRUM/IMAG
##SYMBOL=    X,             R,               I
##VAR_TYPE=  INDEPENDENT,   DEPENDENT,       DEPENDENT
##VAR_FORM=  AFFN,          ASDF,            ASDF
##VAR_DIM=   32768,         32768,           32768
##UNITS=     HZ,            ARBITRARY UNITS, ARBITRARY UNITS
##FACTOR=    0.157963299565203, 1,           1
##FIRST=     4132.6476996994, 0,             0
##LAST=      -1043.33573715361, 0,           0
##MIN=       -1043.33573715361, -188861,     0
##MAX=       4132.6476996994, 275512913,     0
$$ Real data points
##PAGE= N=1
##DATA TABLE= (X++(R..R)), XYDATA
$$ [...]
15758A4416N781m1695k8336J9454L0398J7344J0462J6036m841L7462l044l178
$$ 14416 20197 -21498 -49834 -30380 18 17362 27824 43860 39019 76481 73437 70259
15746G0259j5869n4256l5626p063j2610j0483K449k1199o434M7932J5974M1009
$$ 70259 54390 134 -35492 -42555 -55165 -65648 -63199 -84398 -90832 -42900 -26926 14083
15734A4083k7457k4293J3847l2019M041j3685J1995J5682P7216O4256J5289j2945
$$ 14083 -13374 -37667 -23820 -55839 -51798 -65483 -53488 -37806 39410 103666 118955 106010
15722A06010l3605m7601K9308K6651l0975l1864K905j751m2819j0215L5287K0465
$$ 106010 72405 24804 54112 80763 49788 17924 20829 19078 -23741 -33956 1331 21796
15710B1796K9193R229k4001n4574m9813J1371K6653L0786l9349K0735O7243j6439
$$ 21796 50989 60218 36217 -18357 -68170 -56799 -30146 640 -38709 -17974 49269 32830
15698C2830o2445L1421p064L3295K3888k1901j7979k2081J6710P933L323l391
$$ 32830 -29615 1806 -5258 28037 51925 30024 12045 -10036 6674 14607 17930 14539
15686A4539l3971L918L1161K6964P69l2350p216p12m0940P570M3215M005k2144
$$ 14539 -19432 -15514 15647 42611 43380 11030 3814 3102 -37838 -30268 12947 16952 -5192
15673e192L6538Q124P480k2221k608K0239j1493n820j1543k0120m7495O064L3946
$$ -5192 31346 39470 46950 24729 22121 42360 30867 25047 13504 -6616 -54111 -48047 -14101
15660a4101P66J9257l4280k3859j1669J5769L223J7962L5833K9156j9632p0679
$$ -14101 -13335 5922 -28358 -52217 -63886 -48117 -44894 -26932 8901 38057 18425 -52254
15648e2254J0851N2782n015j0344k0436M001k2928J0320L1549K2368k0421j8350
$$ -52254 -41403 11379 6364 -3980 -24416 -20415 -43343 -33023 -1474 20894 473 -17877
15636a7877L0644J9427j3267j9202k5328k6272q761K1970j3284p677K5579M6490
$$ -17877 12767 32194 18927 -275 -25603 -51875 -60636 -38666 -51950 -59627 -34048 12442
15624A2442K9134j8369m6028K1113k7588m8876k1925K5808L5640Q768N250N0952
$$ 12442 41576 23207 -22821 -1708 -29296 -78172 -100097 -74289 -38649 -29881 -24631 26321
15612B6321p587j7897J0641J654k5094L737J9799M3966K5066J4228l2387j5210
$$ 26321 18734 837 11478 13132 -11962 -8225 11574 55540 80606 94834 62447 47237
15600D7237n7088p4163q731k2960N0741O4905K4608L4996N22j298m7511j1659
$$ 47237 -9851 -84014 -92745 -115705 -64964 -59 24549 59545 60067 58769 11258 -401
15588d01k905K3314J5971j5769o313O524N5k668r61M005j4755m5490j4936O045
$$ -401 -3306 20008 35979 20210 13897 20421 20476 17808 16847 20852 6097 -39393 -54329 -48284
15574d8284K9193l1224k303K9669k7747j3712L6653J0115K3490r535J0903j5721
$$ -48284 -19091 -50315 -52618 -22949 -50696 -64408 -27755 -17640 5850 -3685 7218 -8503
15562h503j2506M545l0698J9039K5435j6885l5219m0339j5704k9105P4371L9972
$$ -8503 -21009 -16464 -47162 -28123 -2688 -19573 -54792 -95131 -110835 -139940 -65569 -25597
15550b5597k4657q443N5207R309p428q232k0864R611M0588%o227p274K4805N217
$$ -25597 -50254 -58697 -3490 5819 -1609 -9841 -30705 -21094 19494 19494 13267 5993 30798 36015
15536C6015J1987l984j402j7850l060L7021j0767q978J0055n2175k0890j818P2866
$$ 36015 48002 44018 42616 24766 21706 58727 47960 38982 49037 -3138 -24028 -25846 47020
15523D7020l472k7147J3373n211k6476j7923j6411O816M456m921L3832J9501l3797
$$ 47020 43548 16401 29774 24563 -1913 -19836 -36247 -29431 -24975 -29896 3936 23437 -10360
15510a0360n7774o996K2599Q534j107J9468J4942n912J1193M191n507q34J6505
$$ -10360 -68134 -75130 -52531 -43997 -45104 -25636 -10694 -16606 -5413 -1222 -6729 -7563 8942
15497H942K2248k2175l4304k6267k084j6733L4207j0377L0129L3314j2594j8778
$$ 8942 31190 9015 -25289 -51556 -53640 -70373 -36166 -46543 -16414 16900 4306 -14472
15485a4472j7047j9735j3466K2176o506k3040O0954J8905k1881Q07J3918n845
$$ -14472 -31519 -51254 -64720 -42544 -49050 -72090 -11136 7769 -14112 -13305 613 -5232
15473e232l620o944j8658n980J7394j7941K9273M1461j2437m3809J319k7176Q50
$$ -5232 -8852 -15796 -34454 -40434 -23040 -40981 -11708 29753 17316 -26493 -25174 -52350 -51500
15460e1500q926l0576j417J3716o29K2633K6905K5946j2500J2592J5640K6395
$$ -51500 -60426 -91002 -92419 -78703 -79332 -56699 -29794 -3848 -16348 -3756 11884 38279
15448C8279q6138L185L8022L895K1149J4283j6434J5773K1328k3510k0126p271
$$ 38279 -47859 -44674 -6652 -2757 18392 32675 16241 32014 53342 29832 9706 2435
15436B435o8601M379M1214K1279J6168Q131K5884l8643q0795l3337o166K4003
$$ 2435 -66166 -61787 -20573 706 16874 25005 50889 12246 -68549 -101886 -108052 -84049
15424h4049J8723M3912M1720L6432J9622j1378k9278j7439J0176L474K51Q524
$$ -84049 -65326 -21414 20306 56738 76360 64982 35704 18265 28441 31915 32166 40690
15412D0690n287L0631j4942q5710l0734N0735K391J2938J3195O07j9353m7600
$$ 40690 35403 66034 51092 -34618 -65352 -14617 -12226 712 13907 14514 -4839 -52439
15400e2439K1612L9664K1200k7508q007K1496M3571j7073o2686n030K487J4024
$$ -52439 -30827 8837 30037 2529 -5478 16018 59589 42516 -20170 -25200 -22713 -8689
15388h689J8519k2041m5925l3384M9134N1707L7603J4904k6720k6968O447J2797
$$ -8689 9830 -12211 -58136 -91520 -42386 9321 46924 61828 35108 8140 14587 27384
15376B7384m4511j8859n235j2744k9348J5301M5239r912j5471L540j3924M9105
$$ 27384 -17127 -35986 -41221 -53965 -83313 -68012 -22773 -32685 -48156 -44616 -58540 -9435
15364i435M4862j9624r761k5572P80j559j277L5280L7747m4066L256l4981J8960
$$ -9435 35427 15803 6042 -19530 -18750 -20309 -21586 13694 51441 7375 10631 -24350 -5390
15351e390j5082k0118j934K4827K7850P032k1312j1788L798R280j3536J7897J1520
$$ -5390 -20472 -40590 -42524 -17697 10153 17185 -4127 -15915 -12117 -2837 -16373 1524 13044
15338A3044J690M3726k6141k5554K857J9496M3277k0858j5827l8870l5836K1025
$$ 13044 14734 58460 32319 6765 9622 29118 72395 51537 35710 -3160 -38996 -17971
15326a7971L2897J4556K4793l1764k7613Q244j6463J166k5145j6333o373R440
$$ -17971 14926 29482 54275 22511 -5102 3142 -13321 -12155 -37300 -53633 -60006 -50566
15314e0566L5317K0912l0773j8084r225P792K1883L0125J7732K186K5847M010
$$ -50566 -15249 5663 -25110 -43194 -52419 -44627 -22744 7381 25113 27299 53146 57156
15302E7156j1241J9469K7789p8945r4991p68K2545K2660L6989L107l3194k476
$$ 57156 45915 65384 93173 14228 -80763 -81531 -58986 -36326 663 3770 -29424 -31900
15290c1900N4100L8798K3565k1034o462j3023K6343l0151j3341k5624l4096k1677
$$ -31900 22200 60998 84563 63529 57067 44044 70387 40236 26895 1271 -32825 -54502
15278e4502J0975N9773L5821j0121K4643J5023j3990N577k6554j0081p720j3247
$$ -54502 -43527 16246 52067 41946 66589 81612 67622 73199 46645 36564 28844 15597
15266A5597l7213L793M036k6915J1637j352m4989n273J8275N2783Q759q450L1316
$$ 15597 -21616 -17823 -13787 -40702 -29065 -30417 -75406 -80679 -62404 -9621 -862 -9312 22004
15253B2004L2010K9797j4720m8976q6349j2934J4723K0444K3349L990J1937k637
$$ 22004 54014 83811 69091 20115 -66234 -79168 -64445 -44001 -20652 -16662 -4725 -7362
15241g362J3869l4550j2351j1606K4143J0649j1044j4168k4686M5434N6842J2101
$$ -7362 6507 -28043 -40394 -52000 -27857 -17208 -28252 -42420 -67106 -21672 35170 47271
15229D7271k568J4766R852N124p136l1829k7249j2015l1255j9358J1616J3941
$$ 47271 44703 59469 69321 74445 67309 35480 8231 -3784 -35039 -54397 -42781 -28840
15217b8840L8351l9581j1454K2777k3245J5654L651L362m8811m0690L2480K4970
$$ -28840 9511 -30070 -41524 -18747 -41992 -26338 -22687 -19325 -68136 -108826 -76346 -51376
15205e1376M177O4239k015o417m6602l2792M6000K943l3925m5990K923L0850P6811
$$ -51376 -47199 17040 15025 8608 -37994 -70786 -24786 -21843 -55768 -101758 -98835 -67985 8826
15192H826L415l5835k4366R740K5667j5657k0368l3109Q164K6612J3184J0350
$$ 8826 12241 -23594 -47960 -38220 -12553 -28210 -48578 -81687 -73523 -46911 -33727 -23377
15180b3377j90m629j7506K003j967J1423J8133N0821M811n814L707j541l6644
$$ -23377 -23567 -28196 -45702 -43699 -45666 -34243 -16110 34711 39522 33708 37415 35874 -770
15167g70j886k6086j3186j3632J5427J2149J8351k6156j8835J2072P031J6822
$$ -770 -2656 -28742 -41928 -55560 -40133 -27984 -9633 -35789 -54624 -42552 -35521 -18699
15155a8699K8303j0993n2388n495j0605L072J255L181M8719j293J9442P409l1445
$$ -18699 9604 -1389 -53777 -59272 -69877 -66805 -65550 -62369 -13650 -14943 4499 11908 -19537
15142a9537n940J2292L003O826o03J3519O999k0620j4051j1496q390K0083K4475
$$ -19537 -25477 -13185 -10182 -3356 -3959 9560 16559 -4061 -18112 -29608 -37998 -17915 6560
15129F560L5021k665k5016L8706k1565n8141k2755M9N801k1380r275m1381L7627
$$ 6560 41581 38916 13900 52606 31041 -27100 -49855 -49806 -44005 -65385 -74660 -116041 -78414
15116g8414O7127J6073p349p515k9921j3283N2361J4730L2195o201l0154k8958
$$ -78414 -11287 4786 -2563 -10078 -39999 -53282 -921 13809 46004 39803 9649 -19309
15104a9309k1772K7121J6980K5656J2570l0014J5293J0584n6304k8952L4242K4698
$$ -19309 -41081 -13960 3020 28676 41246 11232 26525 37109 -19195 -48147 -13905 10793
15092A0793Q832n9649M78K165J2199Q123l4903L0904K3384k6406p902k3672j1457
$$ 10793 19625 -40024 -39546 -37381 -25182 -17059 -51962 -21058 2326 -24080 -31982 -55654 -67111
15079f7111R061k4809P632j240o731J4394K9525N6976K7281L703k3182j9321k8394
$$ -67111 -58050 -82859 -75227 -76467 -83198 -68804 -39279 17697 44978 48681 25499 6178 -22216
15066b2216q030j5088j2710L2239J1469J4903K6J9663K5703j5935k6990J3227
$$ -22216 -30246 -45334 -58044 -25805 -14336 567 593 20256 45959 30024 3034 16261
15054A6261k1689j371q771p529J4090j0447L0060m210m5038k1043K9628J0505
$$ 16261 -5428 -6799 -15570 -23099 -9009 -19456 10604 6394 -38644 -59687 -30059 -19554
15042a9554J7688k831K3851R859p1198m3894J6754M4409K1442p18m4788j6434
$$ -19554 -1866 -4697 19154 29013 -42185 -86079 -69325 -24916 -3474 -4192 -48980 -65414
15030f5414j4826m3065P4137M7456j5286k4212K9774K0014q800K2183J0034j3793
$$ -65414 -80240 -123305 -49168 -1712 -16998 -41210 -11436 8578 -222 21961 31995 18202
15018A8202J6580P065j6364l9584K1464K8519j1274l6910m334m2479J1064K7025
$$ 18202 34782 41847 25483 -14101 7363 35882 24608 -12302 -16636 -59115 -48051 -21026
15006b1026j949M616K1223K655l2713o112M180J4056R92r132N0455q868l4371
$$ -21026 -22975 -18359 2864 5519 -27194 -33306 -29126 -15070 -14078 -23210 27245 18377 -15994
14993a5994j4181k0993O045J2422j5567o570L504P726j0255L975k5394K1569K2189
$$ -15994 -30175 -51168 -45123 -32701 -48268 -54838 -51334 -43608 -53863 -49888 -75282 -53713 -31524
14980c1524J8450L6277J1496P737j5927j1994J4784k4134l837j394n4051m3938
$$ -31524 -13074 23203 34699 42436 26509 14515 29299 5165 1328 -66 -54117 -98055
14968i8055m802N711N2552L0364m3145m1557J1261K9872k437j7755J5577J6696
$$ -98055 -102857 -97146 -44594 -14230 -57375 -98932 -87671 -57799 -60236 -77991 -62414 -45718
14956d5718J8597k1583J3127J7237J737j9732k199J0190K0791r935p873K8871
$$ -45718 -27121 -48704 -35577 -18340 -16603 -36335 -38534 -28344 -7553 -17488 -25361 3510
14944C510q885L191K8888q59j6927O86K3283J6412j3209m0660l4450L3617N505
$$ 3510 -5375 -2184 26704 25845 8918 9604 32887 49299 36090 -4570 -39020 -5403 102
14931A02j7345N9575M3503N404k7972l2177k2142l89J1959j2694q571j5346K1764
$$ 102 -17243 42332 85835 91239 63267 31090 8948 8559 20518 7824 -747 -16093 5671
14918E671r060J9994L018J9415n134R614l2958j6383n369j0811k1111k3123l0289
$$ 5671 -3389 16605 19623 39038 33904 43518 10560 -5823 -11192 -22003 -43114 -66237 -96526
14905i6526m6063L5335M3243L1434R988L3373L352k6546l9791L7457M4839J9455
$$ -96526 -142589 -107254 -64011 -32577 -22589 10784 14136 -12410 -52201 -14744 30095 49550
14893D9550m680j4516P034k0997k7152K926j7238k4083j3122J6565J2736O252
$$ 49550 44870 30354 37388 16391 -10761 -7835 -25073 -49156 -62278 -45713 -32977 -26725
14881b6725J745p211k1683L8073Q815j2013L2970J3323j4328k0184q25j2695j5778
$$ -26725 -24980 -32191 -53874 -15801 -6986 -18999 13971 27294 12966 -7218 -8043 -20738 -36516
14868c6516N655l0689L2993M5898M7494K7135o3585k6656J6941l120l4786n8456
$$ -36516 -30861 -61550 -28557 17341 64835 91970 28385 1729 18670 15550 -19236 -77692
14856g7692k3282j0139P4046J8864J8673O727k2100k7769l4322q359J1884K1301
$$ -77692 -100974 -111113 -37067 -18203 470 7197 -14903 -42672 -76994 -85353 -73469 -52168
14844e2168P9908j2237n5394K5207K2554j174J5696K741k3381l0858j8943o528
$$ -52168 27740 15503 -39891 -14684 7870 6696 22392 25133 1752 -29106 -48049 -54577
14832e4577K4361j3970k2283N518j0264K3316R943j5935J5804M1395j3304l0716
$$ -54577 -30216 -44186 -66469 -60951 -71215 -47899 -37956 -53891 -38087 3308 -9996 -40712
14820d0712k4532K2768J8891k5325l417M6206M1516M244j4498K6247l0954k1111
$$ -40712 -65244 -42476 -23585 -48910 -52327 -6121 35395 39639 25141 51388 20434 -677
14808f77K549l152P410k9871m1468p987Q181L6910K8029j0038j8495j7574J707
$$ -677 1872 -1280 6130 -23741 -65209 -73196 -65015 -28105 -76 -10114 -28609 -46183 -44476
14795d4476R560N1352j7669j4450L5022J2226l5427J3530L0226l4361j5346n045
$$ -44476 -34916 16436 -1233 -15683 19339 31565 -3862 9668 39894 5533 -9813 -14858
14783a4858J5662m5939P317N4827N531j0577K1123l0544M359J7474J4k5425p052
$$ -14858 804 -45135 -37818 17009 22540 11963 33086 2542 6901 24375 24389 -1036 -8088
14770h088k8159m2960o839N8494J3621k2819L8204L0092J2629l361k3242K614
$$ -8088 -36247 -79207 -86046 -27552 -13931 -36750 1454 31546 44175 40814 17572 20186
14758B0186J7849l3139m9158Q265P5562K9512J8484j8425k3844o541K8201J977
$$ 20186 38035 4896 -44262 -35997 39565 69077 87561 69136 45292 38751 66952 68929
14746F8929k9438k7084l1380J8515j4979l9688n0180J6338L9903j6262K7011L4308
$$ 68929 39491 12407 -18973 -458 -15437 -55125 -105305 -88967 -49064 -65326 -38315 -4007
14734d007j5281k4374L0964m556k8511J5359l140j4316J7585K1725M3475J7709
$$ -4007 -19288 -43662 -12698 -17254 -45765 -30406 -33546 -47862 -30277 -8552 34923 52632
14722E2632J9524j0858k5636J5167J5364k1718o5477P034N3397k6286J6895k1302
$$ 52632 72156 61298 35662 50829 66193 44475 -21002 -13968 39429 13143 30038 8736
14710H736k9129k8100R727R070K8979O265l9534q443Q429K2753m237k6108k8637
$$ 8736 -20393 -48493 -38766 -29696 -717 5548 -33986 -42429 -34000 -11247 -15484 -41592 -70229
14697g0229K9575M274K0780J4508m1874n0093J5730K2900l631j8104J8561O7160
$$ -70229 -40654 -36380 -15600 -1092 -42966 -93059 -77329 -54429 -58060 -76164 -57603 9557
14685I557n868K3153l0301l5050l1245J1736K476M2632J4114j1420k2939L1895
$$ 9557 3689 26842 -3459 -38509 -69754 -58018 -55542 -12910 1204 -10216 -33155 -1260
14673a260N4076j767l3647k3282N251k4715L9598L853k3722K0379p297l5790n430
$$ -1260 52816 51049 17402 -5880 -629 -25344 14254 18107 -5615 14764 7467 -28323 -33753
14660c3753l0533M0M3181O2363L8774l9807l2443J7384r921j9194j9477l085O22
$$ -33753 -64286 -64246 -21065 41298 80072 40265 7822 25206 15285 -3909 -23386 -26471 -25849
14647b5849J9031l366M7966K7677j7434m1707K4399l5796m1627J5610K4490k9052
$$ -25849 -6818 -10184 37782 65459 48025 6318 30717 -5079 -46706 -31096 -6606 -35658
14635c5658k5014k140N833O382L2377N8719k629J1927K9765R570l1776r3689k4314
$$ -35658 -60672 -62812 -56979 -50597 -18220 40499 37870 49797 79562 89132 57356 -36333 -60647
14622f0647M8956J8527j7906l964R566j645k0741j8887p192J2666J1456M1156
$$ -60647 -11691 6836 -11070 -15034 -5468 -7113 -27854 -46741 -53933 -41267 -29811 11345
14610A1345K0412j9402K005R972k902l3601j5531j8114J3889J4727m13k4546M6079
$$ 11345 31757 12355 14360 24332 21430 -12171 -27702 -45816 -31927 -17200 -17613 -42159 3920
14597C920K4497j600J7945j2136k0692j9980R807L2469j0345Q505O885j4223l7771
$$ 3920 28417 26817 44762 32626 11934 -8046 1761 34230 23885 32390 39275 25052 -12719
14584a2719j9668O888K7231L4747j8750N60K6565j0810k048O365K777o921J9988
$$ -12719 -32387 -25499 1732 36479 17729 18289 44854 34044 31996 38361 41138 34217 54205
14571E4205m0190o467j0713K8045M1122r343R54j0549k5327K4762J4800M2936
$$ 54205 14015 7548 -3165 24880 66002 56659 57613 47064 21737 46499 61299 104235
14559A04235R15q176j6449o621K1934l0963m585J4590j106q838j5739n9002n0755
$$ 104235 105150 96974 80525 73904 95838 64875 60290 74880 73774 64936 49197 -9805 -60560
14546f0560J6246K8051Q335o566M202r254n061L6603J4871J1310K7866P168l5959
$$ -60560 -44314 -16263 -7928 -14494 -10292 -19546 -24607 11996 26867 38177 66043 73211 37252
14533C7252m8926N6276K1699O982Q311M069J6161Q448K4043r375k9591o3684j9817
$$ 37252 -11674 44602 66301 73283 81594 85663 101824 110272 134315 124940 95349 31665 11848
14520A1848j4235J8803L6120l775j6368m718m9354l6059L099k0518L7626L9067
$$ 11848 -2387 16416 52536 48761 32393 27675 -21679 -57738 -54639 -75157 -37531 1536
14508A536P138l5032j6160m5406j903L6729O504l2134q674M5415L0712M0006k0135
$$ 1536 8674 -26358 -42518 -87924 -89827 -53098 -46594 -78728 -87402 -41987 -11275 28731 8596
14495H596L2708J428k70L9537J1436n0203j3342k3812P380l8709K4718L9113L1835
$$ 8596 41304 42732 42462 81999 93435 43232 29890 6078 13458 -25251 -533 38580 70415
14482G0415R194j8297l2187l1927J0917l3684P541J8304K8379p823K0456K059
$$ 70415 79609 61312 29125 -2802 8115 -25569 -18028 276 28655 20832 41288 43347
14470D3347j7643O32r927k5832j924o884l5052j4373m763j3282L0857K0035L3800
$$ 43347 25704 26336 16409 -9423 -11347 -18231 -53283 -67656 -72419 -85701 -54844 -34809 -1009
14457a009K4413M704J0009l5503q906p420Q644R146k3634m8320l3695M6399K391
$$ -1009 23404 28108 38117 2614 -6292 -13712 -5068 4078 -19556 -67876 -101571 -55172 -52781
14444e2781K7923j6977l925L4772J3502M717l3657o380L5946P712J6968J7743
$$ -52781 -24858 -41835 -45760 -10988 2514 7231 -26426 -32806 3140 10852 27820 45563
14432D5563J3808p2372m2470L1895k3486j5453N3304N5149J6320O109o810O581
$$ 45563 59371 -13001 -55471 -23576 -47062 -62515 -9211 45938 62258 68367 61557 68138
14420F8138l5234l0573o757r854m2560j7280J5344O1926N7232N821k2130o5420
$$ 68138 32904 2331 -4426 -14280 -56840 -74120 -58776 3150 60382 66203 44073 -21347
14408b1347k7752N8923J3452r405M662j0662j0630p998J3590k5390j1571M6558
$$ -21347 -49099 9824 23276 13871 18533 7871 -2759 -10757 2833 -22557 -34128 12430
14396A2430l307n2329k0821L799J7086m414J2080L6567R699j4260K25r830l5540
$$ 12430 9123 -43206 -64027 -60228 -43142 -47556 -35476 1091 10790 -3470 -3245 -13075 -48615
14383d8615L5659R555j6257k1193N894O1797l4967r898L3878l8322k1275J2509
$$ -48615 -12956 -3401 -19658 -40851 -34957 26840 -8127 -18025 15853 -22469 -43744 -31235
14371c1235L0959J2982m0758j1645q50k724j4709J5299N5413L9213m3261j549
$$ -31235 -276 12706 -28052 -39697 -40547 -43271 -57980 -42681 12732 51945 8684 7135
14359G135K4283J7055k4945k1396R87O4427n023m105l7697m4680j1577r814K5945
$$ 7135 31418 48473 23528 2132 3119 67546 62523 58418 20721 -23959 -35536 -45350 -19405
14346a9405O0133M3300l9328m1655j7630K866j5464j4256J013M393M573q423j2593
$$ -19405 40728 84028 44700 3045 -14585 -11719 -27183 -41439 -40426 -36033 -31460 -39883 -52476
14333e2476K0065l376k1362K3948K8890j1548l806N5012L7628k6520k5920n4506
$$ -52476 -32411 -35787 -57149 -33201 -4311 -15859 -19665 35347 72975 46455 20535 -33971
14321c3971j6703K5460K1027J0679n5961q1890J1729L3703l235L866M8996Q21
$$ -33971 -50674 -25214 -4187 6492 -49469 -131359 -119630 -85927 -89162 -85296 -36300 -35479
14309c5479k8544Q0881J4036m4585p079J3696Q040L6222n8638j7221j5171k4825
$$ -35479 -64023 16858 30894 -13691 -20770 -7074 966 37188 -21450 -38671 -53842 -78667
14297g8667K3626j3571j874L7798k4332j2733L1178p935j2178L2823p91N088K1440
$$ -78667 -55041 -68612 -70486 -32688 -57020 -69753 -38575 -46510 -58688 -25865 -26656 -21568 -128
14284a28J0576M404m9449j5859J3499K8742K4363j158j8643k282k9123K0541J5208
$$ -128 10448 14852 -34597 -50456 -36957 -8215 16148 14990 -3653 -5935 -35058 -14517 691
14271F91k5879j6464J1218L962K8367M4842J4303o2472k9728K2831K399l197L4383
$$ 691 -25188 -41652 -30434 -26472 1895 46737 61040 -1432 -31160 -8329 -5930 -9127 25256
14258B5256l542K8499K6649l1043j7757k291k9233k7667j2977k9045n007j5008
$$ 25256 21714 50213 76862 45819 28062 25771 -3462 -31129 -44106 -73151 -78158 -93166
14246i3166L2316K5331m635K8616M6057K5681P179j9607k9258J7285m2344m3647
$$ -93166 -60850 -35519 -40154 -11538 34519 60200 67379 47772 18514 35799 -6545 -50192
14234e0192M661R895K7706n218J976L4776j2365J9466Q422m069K928j0224J1334
$$ -50192 -45531 -35636 -7930 -13148 -11172 23604 11239 30705 39127 35058 37986 27762 39096
14221C9096l6688j3571K3637j4874j3148J5756J9812N952l127J2853J4990j0013
$$ 39096 2408 -11163 12474 -2400 -15548 208 20020 25972 22845 35698 50688 40675
14209D0675J2337K0j7760L1572L8269j5633o495j9219j4422l0256m3210r367K7998
$$ 40675 53012 53032 35272 66844 105113 89480 82985 63766 49344 19088 -24122 -33489 -5491
14196e491M0952J3533r606n1493l3180L6068k5838p190J3542L9694n207K0239
$$ -5491 35461 48994 39388 -12105 -45285 -9217 -35055 -42245 -28703 10991 5784 26023
14184B6023l5294j3320J0867K4820r559k4690j171L7668L8840R822M00k0309J5590
$$ 26023 -9271 -22591 -11724 13096 3537 -21153 -22324 15344 54184 64006 64406 44097 59687
14171E9687k9137J0288N8733o3510n1798L822j0010k989J3062M1279K6562k9098
$$ 59687 30550 40838 99571 36061 -15737 -11915 -21925 -24914 -11852 29427 55989 26891
14159B6891k9698j9152J4441N534m453J2242P219j8014J4220K714O146J9526M1799
$$ 26891 -2807 -21959 -7518 -1984 -6437 5805 13024 -4990 9230 11944 18090 37616 79415
14146G9415K2926k0143k1955m7119l3688L475R632j2651Q213J8646q06k0095J9398
$$ 79415 102341 82198 60243 13124 -20564 -17089 -7457 -20108 -11895 6751 5945 -14150 5248
14133E248L724o01l168J5822m452l8519j3035K2329M0990M9474p238m2508l667
$$ 5248 8972 8371 5203 21025 16573 -21946 -34981 -12652 28338 77812 70574 28066 24399
14120B4399N244k3260K0242q264l4128R598P988l6851k2675p786M3524K2118J1100
$$ 24399 29643 6383 26625 18361 -15767 -6169 1819 -35032 -57707 -65493 -21969 149 11249
14107A1249M3054J8522K0482l0821j0798Q710O498j4668p328J7651J6323P688
$$ 11249 54303 72825 93307 62486 51688 60398 66896 52228 44900 62551 78874 86562
14095H6562l2627k440J5524n6503p0806J9754J2962K8563K1966o854K4866L0505
$$ 86562 53935 51495 67019 10516 -60290 -40536 -27574 989 22955 16101 40967 71472
14083G1472j1304l8779M640K8901K9786J2115R55m1553p116n848k1093n885r148
$$ 71472 60168 21389 26029 54930 84716 96831 97786 56233 49117 43269 22176 16291 7143
14070G143j3876L396K0099K9512k5522Q394j747j4087N230k8293p931m036K7184
$$ 7143 -6733 -3337 16762 46274 20752 29146 27399 13312 18542 -9751 -17682 -21718 5466
14057E466j4080M818j2861j3038K7132K8392p171J0062r265p9895j3293J0686
$$ 5466 -8614 -3796 -16657 -29695 -2563 25829 18658 28720 19455 -60440 -73733 -63047
14045f3047L9613l0050l1591p119M0452J1292L6606J6738k522n50q5J2338P886
$$ -63047 -23434 -53484 -85075 -92194 -51742 -40450 -3844 12894 10372 9822 9737 22075 29961
14032B9961l3578j831Q225k0203O86n828M5670k5478k3347N3168M1346L8970j7644
$$ 29961 -3617 -5448 2777 -17426 -16740 -22568 23102 -2376 -25723 27445 68791 107761 90117
14019I0117m4053l7720K5608L2550p1117l1851J4070K4j3868J1168N8671l6880
$$ 90117 46064 8344 33952 66502 -4615 -36466 -22396 -22372 -36240 -25072 33599 -3281
14007c281o4959K3313K2319p93O994j8755K1340J5547K2790m141j0510k2226L5780
$$ -3281 -68240 -44927 -22608 -23401 -16407 -35162 -13822 1725 24515 20374 9864 -12362 23418
13994B3418J9734k4522l9227l6087K8532M2669J5864j1774j2412J0751J9138K5076
$$ 23418 43152 18630 -20597 -56684 -28152 14517 30381 18607 6195 16946 36084 61160
13982F1160j0307J5810k3680j2850r675k680L8080r434J3199J9972p946j7924
$$ 61160 50853 66663 42983 30133 20458 17778 55858 46424 59623 79595 71649 53725
13970E3725n9925l9940j0867K4098M0795K4802j6423j602k6664k6811J2365J2021
$$ 53725 -6200 -46140 -57007 -32909 7886 32688 16265 14663 -12001 -38812 -26447 -14426
13958a4426n912J7645N7620N964m5371o91M9452l1272k7746J8641J67k0811l3060
$$ -14426 -20338 -2693 54927 60891 15520 14829 64281 33009 5263 23904 24071 3260 -29800
13945b9800M147J168L1222N5197kj9572k0416P490O237j5432J3744J5922l3710
$$ -29800 -25653 -24485 6737 61934 61932 42360 21944 29434 35671 20239 33983 49905 16195
13932A6195j5730J7496L4144N6111O650j5336m1752q3329k7890j0589J5207J2547
$$ 16195 465 17961 52105 108216 114866 99530 57778 -25551 -53441 -64030 -48823 -36276
13920c6276L0514L1702J7819K6751J4677k4491n9921l0603q322r323L827l148
$$ -36276 -5762 25940 43759 70510 85187 60696 775 -29828 -38150 -47473 -43646 -46794
13908d6794j0967J6374J4478L1445j6493j6733L35M2821J2465M78q800k3806K4243
$$ -46794 -57761 -41387 -26909 4536 -11957 -28690 -28355 14466 26931 27409 18609 -5197 19046
13895A9046J5553j0067J5635L4253m7914j3568l811J2975l6491Q786N8498R334
$$ 19046 34599 24532 40167 74420 26506 12938 9127 22102 -14389 -5603 52895 62229
13883F2229k5588k6620l4525j4569O7933R922J6873k259m1993q243j1703M8724
$$ 62229 36641 10021 -24504 -39073 28860 38782 55655 53396 11403 3160 -8543 40181
13871D0181j66P22k6016l1136O6849K179j9280q497j8858l3963M211K3601j3496
$$ 40181 40015 40737 14721 -16415 50434 52613 33333 24836 5978 -27985 -23774 -173 -13669
13858a3669J9329L3447M8361j1220k1679J2880K6039o2573l8574K5787M0021J3227
$$ -13669 5660 39107 87468 76248 54569 67449 93488 30915 -7659 18128 58149 71376
13846G1376M6226J7850n361o040M1741R326J3079k7972n3246j3944o814m3630
$$ 71376 117602 135452 130091 124051 165792 175118 188197 160225 106979 93035 86221 42591
13834D2591j1098o345J0699P879P699O4263K696j4180l3180l6139K1875k4420
$$ 42591 31493 25148 35847 43726 51425 115688 118384 104204 71024 34885 56760 32340
13822C2340l0976n819J7633l141p368q358L513K796K3476J7595K0782K6673R30
$$ 32340 1364 -4455 13178 10037 2669 -5689 -2176 620 24096 41691 62473 89146 90076
13809I0076k1948O637Q897K0379k155M4606j1093K2309M6553O935N177N1996P0769
$$ 90076 68128 74765 83662 104041 101886 146492 135399 157708 204261 211196 216373 268369 339138
13796C39138n8577n6880p482o756n9113m0306k4541M595J284k2615J3115K2286
$$ 339138 280561 223681 216199 209443 150330 110024 85483 90078 91362 68747 81862 104148
13784A04148o719O5625K6100n8055n9747m32q717m5255p435O9020k2941K357m841
$$ 104148 97429 163054 189154 131099 71352 70920 62203 16948 9513 78533 55592 57949 53108
13771E3108j2930J6214q900l2519k6909P305M0834K037k044K1771K1525L6378
$$ 53108 40178 56392 47492 14973 -11936 -4631 36203 38240 36196 57967 79492 115870
13759A15870j668J6320R71l29Q7166Q0470O5651M1473j4338p162o7646p7948l6690
$$ 115870 114202 130522 131493 131164 218330 298800 364451 405924 391586 384424 316778 238830 202140
13746B02140n1580p6720j4655O3086j8485n4885k895J630K9795j9505N023m2753
$$ 202140 150560 73840 59185 122271 103786 48901 46006 47636 77431 57926 62949 20196
13734B0196j2393Q91N0245L389p693o8015l8600Q922J4713P6909K7283l1021m9144
$$ 20196 7803 8694 58939 62328 54635 -13380 -51980 -43058 -28345 48564 75847 44826 -4318
13721d318L3022K9554P827q759j3080L8896o083n2155J2126M593K6853r598O767
$$ -4318 28704 58258 66085 57326 44246 83142 77059 24904 37030 41623 68476 58878 65645
13708F5645M8769k244k7127K7051j2702m3921k6833J1856L3885j5762l8228l2169
$$ 65645 114414 112170 85043 112094 99392 55471 28638 40494 74379 58617 20389 -11780
13696a1780L63L3401j0504j1445l553l2351n002q989j5039N606L3936M9551L8544
$$ -11780 -11417 21984 11480 35 -3518 -35869 -40871 -49860 -64899 -59293 -25357 24194 62738
13683F2738J9398M9025l4711p5999r629L6205l3590m0344j114L0898k542l270
$$ 62738 82136 131161 96450 20451 10822 47027 13437 -26907 -28021 2877 335 -2935
13671b935R455j1070k9677K7982J0051r080J7440J40N0471J5189j3847J285O290
$$ -2935 6520 -4550 -34227 -6245 3806 -5274 12166 12306 62777 77966 64119 65404 71694
13658G1694l6288k8303r958K3393K1560j4651J8878r768l3626n4134M3597J2629
$$ 71694 35406 7103 -2855 20538 42098 27447 46325 36557 2931 -51203 -7606 5023
13646E023j462K7447j2768q415M2326p450M4788j3553n8570k2458K2467L6853
$$ 5023 3561 31008 18240 9825 52151 44701 89489 75936 17366 -5092 17375 54228
13634E4228k4810j2861N897L81L1218M7718j4576m5493L739j3567j4832M130o237
$$ 54228 29418 16557 22454 22835 54053 101771 87195 41702 45441 31874 17042 21172 14935
13621A4935l5454n335N4226j5088j9949K3868M3443L4860n885j2648N93k4419
$$ 14935 -20519 -25854 28372 13284 -6665 17203 60646 95506 89621 76973 77566 53147
13609E3147K1719J0772M246K7837J7504j4434n6728j7436L2859k1631p284k3694
$$ 53147 74866 85638 89884 117721 135225 120791 64063 46627 79486 57855 50571 26877
13597B6877J8119K0885J1183j2804l0088k456O338K4575n642N4373K3126P630
$$ 26877 44996 65881 77064 64260 34172 31716 38054 62629 56987 111360 134486 142116
13585A42116N078J8132J8112K4012J3272l4481j5132p0310m0474l70K8761L7561
$$ 142116 147194 165326 183438 207450 220722 186241 171109 100799 60325 59955 88716 126277
13573A26277L4995l3045n5526M1733L9333M5045J6096L37Q901j1263k9684k8617
$$ 126277 161272 128227 72701 114434 153767 198812 214908 215245 224146 212883 183199 154582
13561A54582J0982q258O925n185q375p833j0120m1894L778j1153M7947J3502Q478
$$ 154582 165564 157306 164231 159046 150671 142838 132718 90824 94602 83449 131396 144898 153376
13548A53376O514j0075M1400J3759K2325n950l2000m826L3439N808k6219p337
$$ 153376 159890 149815 191215 204974 227299 221349 189349 184523 217962 223770 197551 190214
13536A90214L6661J7083J2493L8831J7152m7495j7737j1829m8878j9646l6532
$$ 190214 226875 243958 256451 295282 312434 264939 247202 235373 186495 166849 130317
13525A30317J6245J1482L306m7294l0945l4948J6010L229K004n486n0250k5254
$$ 130317 146562 158044 161350 114056 83111 48163 64173 67402 69406 63920 13670 -11584
13513a1584K1611j2645J4530J3166J6181j4j1972k548j8933J5414K2288J8420
$$ -11584 10027 -2618 11912 25078 41259 41245 29273 26725 7792 23206 45494 63914
13501F3914k12K934J6166M1613L3325j6293m7687L641J8185R496J0997K4403m3909
$$ 63914 63702 66636 82802 124415 157740 141447 93760 97401 115586 125082 136079 160482 116573
13488A16573m3095k2617o81k1448K9077j8828J965k8707K2740O137M591j1252
$$ 116573 73478 50861 50180 28732 57809 38981 40946 12239 34979 41116 45707 34455
13476C4455k5932L2704M9453L9009j7750m9871k5394J37l519K4411P025k730L0541
$$ 34455 8523 41227 90680 129689 111939 62068 36674 36811 33292 57703 64728 61998 92539
13463I2539J1071Q308m2986m2180k617R368J1917K5165P079L7536J0133n5551
$$ 92539 103610 111918 68932 26752 24135 33503 45420 70585 77664 115200 125333 69782
13451F9782l4167N1055M1434k2324K8538k6229L405j546J549m2429j4192K419
$$ 69782 35615 86670 128104 105780 134318 108089 111494 109948 111497 69068 54876 57295
13439E7295L7745p48O96K2689L1100o820p273m2373J795K4098M4944L1466L3520
$$ 57295 95040 94292 94988 117677 148777 141957 134684 92311 94106 118204 163148 194614 228134
13426B28134k6508k6548L504J8004k3644J7251M8350L2240j9205n1425k6831j8996
$$ 228134 201626 175078 178582 196586 172942 190193 238543 270783 251578 200153 173322 154326
13414A54326q03N4597K1550M3121K017J3747M5274K9668K882N3964J2630o848
$$ 154326 153523 208120 229670 272791 274808 288555 333829 363497 366379 420343 432973 426125
13402D26125J6796N7457N5886O7832P6516O3715Q1145J26634J23872J29853J82345
$$ 426125 442921 500378 556264 624096 700612 764327 845472 972106 1095978 1225831 1408176
13391A408176K91847L35954L28229L88610N80376P55721J015838J501672K220250
$$ 1408176 1700023 2035977 2364206 2752816 3333192 4088913 5104751 6606423 8826673
13382H826673L185815M223353M331299K414344o09776k705477l722732l803057
$$ 8826673 12012488 16235841 20567140 22981484 22371708 19666231 15943499 12140442
13374A2140442l016224k150999j476042r98820o76404n60022l97946k86722k27572
$$ 12140442 9124218 6973219 5497177 4498357 3821953 3261931 2863985 2577263 2349691
13365B349691k06137j48625m3826k7533l9715j8909Q528O0095N5948K7085L8859
$$ 2349691 2143554 1994929 1951103 1923570 1883855 1864946 1873474 1933569 1989517 2016602 2055461
13354B055461R8017J13928J54220J66930K92412L30706M93798O11510P10276R11776
$$ 2055461 2153478 2267406 2421626 2588556 2880968 3211674 3705472 4316982 5027258 5939034
13344E939034J060814J305735J653943K110055L017201M598767O928060J0494578
$$ 5939034 6999848 8305583 9959526 12069581 15086782 19685549 26613609 37108187
13336C7108187J4680870J5737088P953496l797967j0324556j3402059j3304490
$$ 37108187 51789057 67526145 75479641 71681674 61357118 47955059 34650569
13329C4650569r873501o430753m151503k752051j875808j375348j137402q95259
$$ 34650569 24777068 18346315 14194812 11442761 9566953 8191605 7054203 6158944
13321F158944p38592o10337n23761m02842l00079k11574j66024j14853o9506o9686
$$ 6158944 5420352 4810015 4286254 3883412 3583333 3371759 3205735 3090882 3021376 2951690
13311B951690n0986J0534N422N3279J23523J68179K68281L28624M57589N70617
$$ 2951690 2900704 2911238 2916660 2969939 3093462 3261641 3529922 3858546 4316135 4886752
13301D886752P31377R83851J164062J369821J680421K296640L279486M817108
$$ 4886752 5618129 6601980 7766042 9135863 10816284 13112924 16392410 21209518
13293B1209518P265709J0979350J5138202J5649346P018573m875155j0982772
$$ 21209518 28475227 39454577 54592779 70242125 77260698 72385543 61402771
13286F1402771j3919622j3420855r783501o381810m079669k683448j845816j403376
$$ 61402771 47483149 34062294 24278793 17896983 13817314 11133866 9288050 7884674
13278G884674j171486r53505p22276o51731n64247l82190l07248k73089j99092
$$ 7884674 6713188 5759683 5037407 4385676 3821429 3439239 3131991 2858902 2659810
13269B659810j59003j38075j23626j05492p0324k6693L1018r357k0012R5138J27859
$$ 2659810 2500807 2362732 2239106 2133614 2063290 2036597 2067615 2058258 2038246 2133384 2261243
13258B261243J37969J99955K49897L35819M96788N46405O76615R43569J225708
$$ 2261243 2399212 2599167 2849064 3184883 3681671 4228076 4904691 5848260 7073968
13249G073968J683275K440142L526776M496699M089971J476770j633551l512914
$$ 7073968 8757243 11197385 14724161 19220860 23310831 24787601 23154050 19641136
13241A9641136m256232l955100k969284k067647j401270r36753o70006n14289
$$ 19641136 15384904 11429804 8460520 6392873 4991603 4054850 3384844 2870555
13233B870555l83484k89596k84997k44161j75221j58670j49305j52450p7936n3008
$$ 2870555 2487071 2197475 1912478 1668317 1493096 1334426 1185121 1032671 954735 901727
13223I01727q7812o2957j5118l4310k5483m0539m4087M853J5546k1808K2972M1259
$$ 901727 813915 750958 735840 701530 676047 635508 591421 596274 611820 590012 612984 654243
13211F54243M3373M8690M4181R5582Q7673O9406M327j8315j01013j24232j45153
$$ 654243 697616 746306 790487 886069 973742 1043148 1047475 1029160 928147 803915 658762
13200F58762r3417k6751n8191n2781p0871n5252r02m2734j7593l3400j9579O696
$$ 658762 565345 538594 480403 427622 356751 301499 300597 257863 240270 206870 187291 193987
13188A93987L1011j138M2658L1987j2014j5814k525L135j9793m7333k6290j1787
$$ 193987 224998 223860 266518 298505 286491 270677 268152 271287 251494 204161 177871 166084
13176A66084k970L9644R971M7714j2169o2445q380K810J160O8000L2097J8191
$$ 166084 163114 202758 212729 260443 248274 185829 177449 180259 181419 249419 281516 299707
13164B99707O2586L0222M0370M915l5596m8738o4616j5376n2768n2839k3914j2832
$$ 299707 362293 392515 432885 437800 402204 353466 288850 273474 220706 167867 143953 131121
13152A31121k4245j081j426L143l3657J1988J7762n410k3810N913M1525O651j6174
$$ 131121 106876 105795 104369 107512 73855 85843 103605 98195 74385 80298 121823 128474 112300
13139A12300K0448J589l6337k4383J3409J4759k7386J5998K6265J5731J817j6855
$$ 112300 132748 134337 98000 73617 87026 101785 74399 90397 116662 132393 134210 117355
13127A17355j7569l6488j7625j5480J1144J026O0351M5442M8l4444j1820M0468
$$ 117355 99786 63298 45673 30193 41337 42363 102714 148156 148204 113760 101940 142408
13115A42408R843j4674k1455p0428k0573K8572K812p179R048j401K219n087j2041
$$ 142408 152251 137577 116122 45694 25121 53693 56505 49326 58374 56973 59192 54105 42064
13102D2064O975q895q314j1565K0797M7945M4634l6647m9372J5813L1149j888
$$ 42064 49039 40144 31830 20265 41062 89007 133641 96994 47622 63435 94584 92696
13090I2696k9781q797l9681j9988L9528N0690J4581r834O856l3223J5958j6003
$$ 92696 62915 54118 14437 -5551 33977 84667 99248 89414 96270 63047 79005 63002
13078F3002n73k7668l1119J4770J9367K7862M994r920j5660K6448R448j2170j467
$$ 63002 62429 34761 3642 18412 37779 65641 70635 60715 45055 71503 80951 68781 67314
13065F7314l0972M922j7694k1302p591N0575J9374L651N509J9136j4307k0151
$$ 67314 36342 41264 23570 2268 -5323 45252 64626 68277 73786 92922 78615 58464
13053E8464j8386n218J6047L4301k0272n0414l6455K2403P3657J9665J4671l180
$$ 58464 40078 34860 50907 85208 64936 14522 -21933 470 74127 93792 108463 105283
13041A05283K3179K518k8874P626k3723j3693J373P985j0493m7214J5490k6578
$$ 105283 128462 130980 102106 109732 86009 72316 73689 81674 71181 23967 39457 12879
13029A2879L0814L2932K2601J6778n555n518k4766j0669j7662l5652O825N5558
$$ 12879 43693 76625 99226 116004 110449 104931 80165 69496 51834 16182 23007 78565
13017G8565j0180K3321j7831l4944K728l0706m7783K7983P466o310J7303J795
$$ 78565 68385 91706 73875 38931 41659 10953 -36830 -8847 -1381 -7691 9612 11407
13005A1407L1100j744l0798Q204L5254K4379n622k7217k2817l660J27R048k0419
$$ 11407 42507 40763 9965 18169 53423 77802 72180 44963 22146 18486 18613 27661 7242
12992G242o735K3405l4178J667K7440M2323K241j6372r050r990L4288J025o7117
$$ 7242 507 23912 -10266 -8599 18841 61164 63405 47033 37983 27993 62281 63306 -3811
12979c811m1128J2574q090M716J3007K3492l580N201K185K8983M071k8314m5835
$$ -3811 -44939 -32365 -40455 -35739 -22732 760 -2820 2381 4566 33549 37620 9306 -36529
12966c6529J1798N3904k0880J4737K6862j1382k8706k7811q320L8859o797J7981
$$ -36529 -24731 29173 8293 23030 49892 38510 9804 -18007 -26327 12532 5735 23716
12954B3716N702j4807k7452k5533j177J5709J7088L321L7185j7799J5016J7082
$$ 23716 29418 14611 -12841 -38374 -39551 -23842 -6754 -3433 33752 15953 30969 48051
12942D8051j9010P888r538n6358N195M2093k6078m3956M4004L2049j64k1879l051
$$ 48051 29041 36929 27391 -28967 -23772 18321 -7757 -51713 -7709 24340 24176 2297 -754
12929g54l400L0296M3262J2975r087J0602K9206l0816l9658K2254j3673m2458
$$ -754 -4154 26142 69404 82379 73292 83894 113100 82284 42626 64880 51207 8749
12917H749P233L9132P824M3809J7323j2853o23K9542M6252L4279J2576o915j8736
$$ 8749 15982 55114 62938 106747 124070 111217 110594 140136 186388 220667 233243 226328 207592
12904B07592l8810m7604q8298l6396L691J0911N3426K5717k0856j9333o4551P927
$$ 207592 168782 121178 32880 -3516 175 11086 64512 90229 69373 50040 -14511 -6584
12892f584m149K4948l468k5651p051L5244K4009K9320L0850o66k1298M352l9575
$$ -6584 -10733 14215 10747 -14904 -21955 13289 37298 66618 97468 96802 75504 79856 40281
12879D0281l8423L475L2031K7340K9253m919m8320j3272K669M1720L7875L6845
$$ 40281 1858 5333 37364 64704 93957 89038 40718 27446 30115 71835 109710 146555
12867A46555J721N9713O8575O2912L4234l3012l2190l8189l7742l4151j9496J398
$$ 146555 148276 207989 276564 339476 373710 340698 308508 270319 232577 198426 178930 180328
12855A80328o931J0513m8046k9118K611l4459l6564k1722j0931m310j389J1989
$$ 180328 173397 183910 135864 106746 109357 74898 38334 16612 5681 1371 -18 11971
12843A1971Q873o868O678o613p836O72k5545K5267N4938r63m1796j4418L0542
$$ 11971 20844 13976 20654 14041 6205 6877 -18668 6599 61537 60574 18778 4360 34902
12830C4902N609J2102k6850j1806L5127K1896J3799O7915P3850K9394J0207J7777
$$ 34902 40511 52613 25763 13957 49084 70980 84779 152694 226544 255938 266145 283922
12818B83922K661l5239j9641r082m5843m7890j6277n9819N356o663J4225M5537
$$ 283922 286583 251344 231703 222621 176778 128888 112611 52792 58148 51485 65710 111247
12806A11247k5176P403k828l4911k2618l188N867j1801k5240J4000Q7174M0177
$$ 111247 86071 93474 90646 55735 33117 29929 35796 23995 -1245 12755 99929 140106
12794A40106m9233j1801O7409r768n9763l4931o454j2112j7929M7150N4576J13
$$ 140106 90873 79072 146481 136713 76950 42019 35565 23453 5524 52674 107250 107363
12782A07363q48l1089M351Q27J413q437R410k7972K1729L3330J5393K3133k4935
$$ 107363 106515 75426 79777 80604 82017 73580 82990 55018 76747 110077 125470 148603 123668
12769A23668l8972o32J4773n823o090J3799m2009j445k5722n954K0700q788m7188
$$ 123668 84696 84064 98837 93014 86924 100723 58714 57269 31547 25593 46293 37505 -9683
12756i683k2360L8161K2445J955L7313J5548K847j0294K3902L371m3537m9447
$$ -9683 -32043 6118 28563 30518 67831 83379 86226 75932 99834 103205 59668 10221
12744A0221m1746j1980K5327L1932K5954L0402j6662j1741L3398P028k3077K3425
$$ 10221 -31525 -43505 -18178 13754 39708 70110 53448 41707 75105 82133 59056 82481
12732H2481m0833J6357L1211k0395K3585K261m4212m0728K7351K5946m9473K4557
$$ 82481 41648 58005 89216 68821 92406 94667 50455 9727 37078 63024 13551 38108
12720C8108J4416m5368j0170m078J9610O681K9058j180l1204L0220L720o4631
$$ 38108 52524 7156 -3014 -7092 12518 19199 48257 47077 15873 46093 49813 -14818
12708a4818j0582j9178M061j0594j92J6132J8163J3721K908P95J6768M153o498
$$ -14818 -25400 -44578 -40517 -51111 -51303 -35171 -17008 -3287 -379 416 17184 21337 14839
12695A4839k0488J3740J9407r745L3478K5382q024j620l501j5053l050K1776j0907
$$ 14839 -5649 8091 27498 17753 51231 76613 68589 66969 63468 48415 45365 67141 56234
12682E6234m6486n0218l9611K9280K9942L6703J3920j2581r660l540J8548K8145
$$ 56234 9748 -40470 -80081 -50801 -20859 15844 29764 17183 7523 3983 22531 50676
12670E0676j1659J1888J0401r333k8628l1212K559M2580K5786n6061q875j6019
$$ 50676 39017 50905 61306 51973 23345 -7867 -5308 37272 63058 6997 -1878 -17897
12658a7897k6466j1223n9173j8836N0501M3265K533O700k2385O836J2577K0495
$$ -17897 -44363 -55586 -114759 -133595 -83094 -39829 -37296 -30596 -52981 -46145 -33568 -13073
12646a3073M3136j0670M959k575j3029k1139j284j3421K3742k177J5613J7295
$$ -13073 30063 19393 24352 21777 8748 -12391 -13675 -27096 -3354 -5531 10082 27377
12634B7377l5k7952j9724J3956J4047j3127j3185k0930j1365n648K8657L1865
$$ 27377 27342 -610 -20334 -6378 7669 -5458 -18643 -39573 -50938 -56586 -27929 3936
12622C936J8650j301l651K3088K4586o957k9567l2204K1945Q783J3174l2202m1566
$$ 3936 22586 21285 17634 40722 65308 58351 28784 -3420 18525 27308 40482 8280 -33286
12609c3286k6218k1724j1551M731J5016J2386p40L6547L1988K2342K6437n584
$$ -33286 -59504 -81228 -92779 -88048 -73032 -60646 -61386 -24839 7149 29491 55928 50344
12597E0344k0835l2745J730j9510l2981k4535j351M7994L1552M2126J578N028
$$ 50344 29509 -3236 -1506 -21016 -53997 -78532 -79883 -31889 -337 41789 43367 48395
12585D8395j3501l5276j9075J4579o637K008l3004k3093M061K3184L8307K6403
$$ 48395 34894 -382 -19457 -4878 -11515 -9507 -42511 -65604 -61543 -38359 -52 26351
12573B6351L997K5767L3164k505l0006n0895k7923J2641K2685j898l727P957K9727
$$ 26351 30348 56115 89279 86774 56768 5873 -22050 -9409 13276 11378 7651 15608 45335
12560D5335n0456k6087K1618J4286j2831K0692J7656j1458j3797K7540K5701J5421
$$ 45335 -5121 -31208 -9590 4696 -8135 12557 30213 18755 4958 32498 58199 73620
12548G3620K855L4677o0472n6293J4221p912l4692m2334M091L1896J5192K462
$$ 73620 76475 111152 50680 -5613 8608 696 -33996 -76330 -72239 -40343 -25151 -22689
12536b2689J4324J1237K145J7373l863r322j4008J5209j9739J9915l9768j0076
$$ -22689 -8365 2872 5017 22390 18527 9205 -4803 10406 -9333 10582 -29186 -39262
12524c9262K6240N267M2981N5332J7721l1019J960l4543m269m7005K1815K9931
$$ -39262 -13022 -7755 35226 90558 108279 77260 79220 44677 40408 -6597 15218 45149
12512D5149j7591j4706K148l0858k2463L4760J4939k0367m6021L03J6869L2075
$$ 45149 27558 12852 15000 -15858 -38321 -3561 11378 -8989 -55010 -54707 -37838 -5763
12500e763n216J4473R592K5077J0976Q723L5092Q666j7873j0360j8613m5794K3278
$$ -5763 -10979 3494 13086 38163 49139 57862 92954 101620 83747 73387 54774 8980 32258
12487C2258K2250r45j007J1839L6998J0524q73p580k0205p0611k6553J1276l345
$$ 32258 54508 53563 52556 64395 101393 111917 111044 103464 83259 12648 -13905 -2629 -5974
12474e974k0386N0276N84m0996K5079J6946l808J2136m679K597j3537j5146L1025
$$ -5974 -26360 23916 24500 -16496 8583 25529 21721 33857 29178 31775 18238 3092 34117
12461C4117j9481m4116J0285K3172K4496L2144l569J6589J025j9861m5849j2508
$$ 34117 14636 -29480 -19195 3977 28473 60617 57048 73637 74662 54801 8952 -3556
12449c556J6029K4297Q344J9740j5964m1083L1023J3547j4164P220p525J5658
$$ -3556 12473 36770 45114 64854 48890 7807 38830 52377 38213 45433 37908 53566
12437E3566k4923p420k1338j0507J288L7342N4014K4931k3114n1544K2021J2129
$$ 53566 28643 21223 -115 -10622 -9334 28008 82022 106953 83839 32295 54316 66445
12425F6445l4464j0647K6432p685J7278L9186K5414o1511o133q098k3678M101
$$ 66445 31981 21334 47766 40081 57359 96545 121959 60448 54315 46217 22539 26640
12413B6640k2144r211K9770r544J6767L1502M1846J8211m0140o546N607J8041
$$ 26640 4496 -4715 25055 15511 32278 63780 105626 123837 83697 77151 82758 100799
12401A00799L8935k0308j6894m409l2874L2992P525J2229L1387J9583J3074l863
$$ 100799 139734 119426 102532 98123 65249 98241 105766 117995 149382 168965 182039 178176
12389A78176L3875O1055P2334P8831M4553K1932L9898O5121N7899P1193Q1862
$$ 178176 212051 273106 345440 424271 468824 490756 530654 595775 653674 724867 806729
12378H06729Q2361N1315K520q757l4640m9343m5654r3186r7791n3307m2128p7928
$$ 806729 889090 940405 942925 934168 899528 850185 804531 711345 613554 560247 518119 440191
12366D40191q9946n1626k8013l7312j4217l9974m4139L457Q292k1651j9628k9750
$$ 440191 350245 298619 270606 233294 219077 179103 134964 138421 146713 125062 105434 75684
12354G5684j9O8665J0473l8057J415j4987k4291l1573j400L5008J5201J2954o919
$$ 75684 75665 144330 154803 116746 118161 103174 78883 47310 45910 80918 96119 109073 102154
12341A02154P159p604k3261k7084K7280k6545n4435p013J0908N3257J6047L676
$$ 102154 109313 101709 78448 51364 78644 52099 -2336 -9349 1559 54816 70863 74539
12329G4539j8223n9311k6378k0045J7161K1317K0410J5446R000k6351J8503l717
$$ 74539 56316 -2995 -29373 -49418 -32257 -10940 9470 24916 33916 7565 26068 22351
12317B2351n2K8782j1255k1408m908K9932J0383O97J2245J4705m8j4586n5746
$$ 22351 22299 51081 39826 18418 13510 43442 53825 54522 66767 81472 81424 66838 11092
12304A1092l2546K6732N1569l7460J4305J1240p58o217l246L3064k6317q896p3967
$$ 11092 -21454 5278 56847 19387 33692 44932 44174 37957 34711 67775 41458 32562 -41405
12291d1405k8529M1970J4305K1893J5507K12J3155K9868K468j5561N343j2489
$$ -41405 -69934 -27964 -13659 8234 23741 23953 37108 66976 69444 53883 59226 46737
12279D6737k7225l8227j6770n016J6099k0612l6880K1731K0442m389M668J2498
$$ 46737 19512 -18715 -35485 -40501 -24402 -45014 -81894 -60163 -39721 -44110 -39442 -26944
12267b6944J330n63J2726j0222K6811L9853L9731J0913j2022L668P978K2309K9004
$$ -26944 -25614 -26177 -13451 -23673 3138 42991 82722 93635 81613 85281 93259 115568 144572
12254A44572l0649m8011k4968j171o371m982J0510J3271o3512m7379L5009M627
$$ 144572 113923 65912 40944 39773 33402 28420 38930 52201 -11311 -58690 -23681 -19054
12242a9054K6614J2951k3446k6821M2316J19530K0338m1551j5218m7658j8405
$$ -19054 7560 20511 -2935 -29756 12560 132090 152428 110877 95659 48001 29596
12231B9596L6227Q193k1105J6184n744J4540M554J1747o450l4497J6100J2583
$$ 29596 65823 74016 52911 69095 63351 77891 82445 94192 87742 53245 69345 81928
12219H1928m0413j2446N876j9862Q408J7807N7793K5095j2952k3881m5282n8580
$$ 81928 41515 29069 34945 15083 23491 41298 99091 124186 111234 87353 42071 -16509
12207a6509K3102L8558N1394l976J2938K1081n4474o113K983o4516L5545M3374
$$ -16509 6593 45151 96545 92569 105507 126588 72114 66001 68984 4468 40013 83387
12195H3387J3820q594Q237R217m5648p922r982l108j3489N5399L5517l3748l0130
$$ 83387 97207 88613 96850 106067 60419 52497 42515 39407 25918 81317 116834 83086 52956
12182E2956K3059J3291n222l1402J6672K1182j6133j3754K7051Q86l3833M9677
$$ 52956 76015 89306 84084 52682 69354 90536 74403 60649 87700 88586 54753 104430
12170A04430O8177K9312P270m6810m4116l3551P39l3065j6210N643l1994J7229
$$ 104430 172607 201919 209189 162379 118263 84712 85451 52386 36176 41819 9825 27054
12158B7054J6618j9302k672K0541P659O894R498J5704k7399j3531M0832j2067
$$ 27054 43672 24370 21698 42239 49898 56792 66290 81994 54595 41064 81896 69829
12146F9829j5090j8827m040l8371j4405L0823m872l7095k1039K7761K6159j5062
$$ 69829 54739 35912 31872 -6499 -20904 9919 5047 -32048 -53087 -25326 833 -14229
12134a4229M0166M3422J1855O970k5122l0093j7271J0861M1026J8897k2332J3348
$$ -14229 25937 69359 81214 88184 63062 32969 15698 26559 67585 86482 64150 77498
12122G7498N9743L3331p24k0243k2444l8051k8015J3172j7547l5781n017j0873
$$ 77498 137241 170572 169848 149605 127161 89110 61095 74267 56720 20939 15922 5049
12110E049J4733L7559J6831j880J2099m0699L092M834K9334n559J6312J3290k571
$$ 5049 19782 57341 74172 72292 84391 43692 46784 51618 80952 75393 91705 104995 102424
12097A02424J1876J4515m5799J0734L3514j8426r284J4062J8095k1221J4297O421
$$ 102424 114300 128815 83016 93750 127264 108838 99554 113616 131711 110490 124787 131208
12085A31208o707q31j1186o590L166l3561o2517j3095K1494K268j9139l6668K9453
$$ 131208 124501 123670 112484 105894 109060 75499 12982 -113 21381 23649 4510 -32158 -2705
12072b705N4535K067q267L2359M118L8302k2991J1182M0228k8004l4643l451J938
$$ -2705 51830 53897 45630 77989 82107 120409 97418 108600 148828 120824 86181 82730 84668
12059H4668k4005n443M1642J4520K0762o790j9617J2947l1642l9033k6445k209
$$ 84668 60663 55220 96862 111382 132144 125354 105737 118684 87042 48009 21564 19355
12047A9355M2829L0879J509L3200O983k8785o9330p6684r4837m0113K4475N5293
$$ 19355 62184 93063 94572 127772 134755 105970 36640 -40044 -134881 -174994 -150519 -95226
12035i5226O4459M4481k9358q74N0908j6325J7148M5603K6427K3492j4556J4536
$$ -95226 -30767 13714 -15644 -16518 34390 18065 35213 80816 107243 130735 116179 130715
12023A30715k9673j3889j5349N0854K781o316j9547N166M8652R219k0208J5636
$$ 130715 101042 87153 71804 122658 125439 119123 99576 104742 153394 162613 142405 158041
12011A58041k8021o8748j3716K0984K5184J4338k544n207J2385K8218l519L0530
$$ 158041 130020 61272 47556 68540 93724 108062 105518 100311 112696 140914 137395 167925
11999A67925J2973K6348Q039r061k920L694K3950j5495l0884j7375M3532N4833
$$ 167925 180898 207246 215285 206224 203304 206998 230948 215453 184569 167194 210726 265559
11987B65559P6982J6586q435J6658j5099l066n727m2999m0005l3261J4117m023
$$ 265559 342541 359127 350692 367350 352251 349185 343458 300459 260454 227193 241310 237287
11975B37287J4095L7730K2487K4299Q1329L3932r627l1179K5009J4986M759L1636
$$ 237287 251382 289112 311599 335898 417227 451159 441532 410353 435362 450348 455107 486743
11963D86743K2930K9668M0854L0677K3378J9469M0932Q781N5145L4192L9577O4450
$$ 486743 509673 539341 580195 610872 634250 653719 694651 703432 758577 792769 832346 896796
11951H96796P9361J8999K6534J0629L1640N8898Q7939J09836J06502J10442O6626
$$ 896796 976157 995156 1021690 1032319 1063959 1122857 1210796 1320632 1427134 1537576 1604202
11940A604202R1258J09336J56291J84071J92485K49909K82870L27485L92080M24144
$$ 1604202 1695460 1804796 1961087 2145158 2337643 2587552 2870422 3197907 3589987 4014131
11930D014131M75352N71898P08893Q95692J143662J468012J892989K453356L352119
$$ 4014131 4489483 5061381 5770274 6665966 7809628 9277640 11170629 13623985 16976104
11921A6976104M676198O590254R527747J4261950K2168203L4775068M7765358
$$ 16976104 21652302 28242556 37770303 52032253 74200456 108975524 156740882
11914A56740882M0547393L984126k2739101l4106464l9829880l2653222k1338350
$$ 156740882 197288275 201272401 178533300 144426836 104596956 71943734 50605384
11907E0605384j3478010q866068o045755m225942l129955k375431j845227j485156
$$ 50605384 37127374 28261306 22215551 17989609 14859654 12484223 10638996 9153840
11899I153840j204572j014565q47853p45815n97438m69922m16263l99908l19560
$$ 9153840 7949268 6934703 6086850 5341035 4743597 4273675 3857412 3457504 3137944
11890C137944k37969k23400j79771j81337j85015j27981j27900o3127m1780o0465
$$ 3137944 2899975 2676575 2496804 2315467 2130452 2002471 1874571 1811444 1769664 1709199
11880A709199m9034n9824n2985p5819n8861k3751l9574o8535q1416m6928n2533
$$ 1709199 1660165 1600341 1547356 1471537 1412676 1388925 1349351 1280816 1199400 1152472 1099939
11869A099939q6891k7384k1634r4684o7277r1231n3349p2654l8128K980j8134
$$ 1099939 1013048 985664 964030 869346 802069 710838 657489 584835 546707 549687 531553
11858E31553l437K5042k7087o8216k8326K1128J0553N941k1320k8481k6572m4144
$$ 531553 528116 553158 526071 457855 429529 450657 461210 467151 445831 417350 390778 346634
11846C46634r793M366l947o925n1548l5087l1425j6249J5904m2897j9968J3353
$$ 346634 336841 341207 337260 330335 278787 243700 212275 196026 211930 169033 149065 162418
11834A62418M6138O035j9073l8984Q425J783j1730j2393j4146J9514L0798O2243
$$ 162418 208556 214591 195518 156534 164959 166742 155012 142619 128473 147987 178785 241028
11822B41028m176r637R214K013j1048k3498o0934P003l155R826j793j5060j8876
$$ 241028 236852 227215 236429 238442 227394 203896 142962 149965 146810 156636 154843 139783 120907
11809A20907k982j0056o0491K239J8636L6197N5950P120M1232j720m4174J1359
$$ 120907 117925 107869 47378 49617 68253 104450 160400 167520 208752 207032 162858 174217
11797A74217L2073k7152l9772j0164L0356M7402q83K1754P6850O3103L9796n9599
$$ 174217 206290 179138 139366 129202 159558 206960 206077 227831 304681 367784 407580 347981
11785C47981p1630n4840m6414p6025o0744K488q134M5923L6617j0896K4559l154
$$ 347981 276351 221511 175097 99072 38328 40816 32682 78605 115222 104326 128885 125731
11773A25731m5010m7532k0915n864K9465J6968q465o085O8180k5240N795k5805
$$ 125731 80721 33189 12274 6410 35875 52843 44378 38293 106473 81233 87028 61223
11761F1223j2314J8551m6822o3763K13P1296L1562m5528j1079Q682p963J8364
$$ 61223 48909 67460 20638 -43125 -42912 28384 59946 14418 3339 12021 4058 22422
11749B2422L3987L4543O773m1847l7243l1811l3786L2844L5826o730K6339K74
$$ 22422 56409 90952 97725 55878 18635 -13176 -46962 -14118 21708 14978 41317 41591
11737D1591m313j604J1323J5315Q248j2295k361J920K472k712k253j6956M6096
$$ 41591 37278 35674 46997 62312 70560 58265 55904 57824 60296 57584 55331 38375 84471
11724H4471K7363l541L526O28N457N691L1048P600J8435l0628m8054k1380K0168
$$ 84471 111834 108293 111819 112447 117904 123595 154643 162243 180678 150050 101996 80616 100784
11711A00784j568M2568l7824o0763o0289M457J8353j2653K7140N4541J3265j2408
$$ 100784 99216 141784 103960 43197 -17092 -12635 5718 -6935 20205 74746 88011 75603
11699G5603k1415P20j1084O4365l945n4342m8519l5146l4056R270K5473Q437K9845
$$ 75603 54188 54908 43824 108189 104244 49902 1383 -33763 -67819 -58549 -33076 -24639 5206
11686E206O687j4965k7301J2957M996l944J185q870r68K4260L1009K8945k0750
$$ 5206 11893 -3072 -30373 -17416 -12420 -16364 -15179 -24049 -25017 -757 30252 59197 38447
11673C8447l4933M014L1205L8133l068j3779j9852K7876J2258l9803j8089M3812
$$ 38447 3514 7528 38733 76866 73798 60019 40167 68043 80301 40498 22409 66221
11661F6221q181j6437M053l5081j0146l301J4670K9742J2053J4271P286l3860
$$ 66221 58040 41603 45656 10575 429 -2872 11798 41540 53593 67864 75150 41290
11649D1290l1892O056L8800K3110l2060n002r985P454K8258K0606k67K0877l206
$$ 41290 9398 15454 54254 77364 45304 40302 30317 37771 66029 86635 86368 107245 104039
11636A04039l7583l8333m0048j9694N4285M6698m8101j0637o386Q962N867m303
$$ 104039 66456 28123 -11925 -31619 22666 69364 21263 10626 4240 13202 19069 14766
11624A4766j4293j6658K4035J6768K8269J3896j1247l0366j1193j274J3761N3647
$$ 14766 473 -16185 7850 24618 52887 66783 55536 25170 13977 12703 26464 80111
11612H0111k05l5918k707L9310Q374k6790m9790k6098k1583J9978N7972L1873
$$ 80111 79906 43988 41281 80591 88965 62175 12385 -13713 -35296 -15318 42654 74527
11600G4527m6961l2975q662N8483L642n6818n2341K3751L9120N672J7577K4109
$$ 74527 27566 -5409 -14071 44412 48054 -8764 -61105 -37354 1766 7438 25015 49124
11588D9124j340J8826M3307K3639n5435p1129n1357l9953J0684M0450o950K8613
$$ 49124 47784 66610 109917 133556 78121 6992 -44365 -84318 -73634 -33184 -40134 -11521
11576a1521J0019j9295L4510K6434j8626k0497K6460M387K7124n315l1649j045
$$ -11521 -1502 -20797 13713 40147 21521 1024 27484 31871 58995 53680 22031 20986
11564B0986k0736k5251l927P236k7062M7929P883m56k2739J974O8200L3197m9500
$$ 20986 250 -25001 -28928 -21692 -48754 -825 7058 6602 -16137 -14163 54037 87234 37734
11551C7734m6048K7346M8272K2618j5713k8054p736j2134j6471K4691r13m412
$$ 37734 -8314 19032 67304 89922 74209 46155 38419 26285 9814 34505 33592 29180
11539B9180M2302m0210J9801j7776j1649L0167J4222p939K0852k1743k3150l5719
$$ 29180 71482 31272 51073 33297 21648 51815 66037 58098 78950 57207 34057 -1662
11527a662M126J1499J727P560K5653L589j1891k0847J1403N223m126L2941K4591
$$ -1662 2464 13963 15690 23250 48903 52492 40601 19754 31157 36380 32254 65195 89786
11514H9786Q993l958l971m3413J2837L5218Q838m4219l8165j8963k0817O145L4292
$$ 89786 98779 94821 90850 47437 60274 95492 104330 60111 21946 2983 -17834 -11689 22603
11501B2603j749j044k6498n0111K3231Q094m0208l538L4977J7739O813M0692r834
$$ 22603 20854 19810 -6688 -56799 -33568 -25474 -65682 -69220 -34243 -16504 -9691 31001 21167
11488B1167l0680j8885L948L0288j9559K9280m44l1298L1031l4859j5064j0673
$$ 21167 -9513 -28398 -24450 5838 -13721 15559 15115 -16183 14848 -20011 -35075 -45748
11476d5748j7230J5984J6894O332K5233K9518k0898k7488J6379j1487j4002n813
$$ -45748 -62978 -46994 -30100 -23768 1465 30983 10085 -17403 -1024 -12511 -26513 -32326
11464c2326L516J2001k2045j5198O2933O021J8397j6223j4836r531n81L7157Q3
$$ -32326 -28810 -16809 -38854 -54052 8881 14902 33299 17076 2240 -7291 -7872 29285 29368
11451B9368k9568j2476r945l09K3701K4648M1417J5462K4495k6616k8194j439
$$ 29368 -200 -12676 -22621 -22930 771 25419 66836 82298 106793 80177 51983 50544
11439E0544l1771k7759n11q165N279M563K6721J6662m636N358J554k628r341n7395
$$ 50544 18773 -8986 -9497 -17662 -12383 -7820 18901 35563 30927 36285 37839 35211 25870 -31525
11425c1525l5631L1772m072q641N2926J1590k0637J1583J8667j5211m1069m561
$$ -31525 -67156 -35384 -39456 -48097 4829 16419 -4218 7365 26032 10821 -30248 -34809
11413c4809k2890k668K7944K3734L7436m455m1941J6713M7413J0437j0663n875
$$ -34809 -57699 -60367 -32423 -8689 28747 24292 -17649 -936 46477 56914 46251 40376
11401D0376p039M733p741q665K6658o319J3874m717J7943q541l6207j3018J5285
$$ 40376 33337 38070 30329 21664 48322 42003 55877 51160 69103 60562 24355 11337 26622
11388B6622o937k6521j5908J1251O286k2457J3459j5180J1084J4074N9254L7206
$$ 26622 19685 -6836 -22744 -11493 -5207 -27664 -14205 -29385 -18301 -4227 55027 92233
11376I2233n9917R32k5266r004k130J402K8082K699o176Q237k8818l0430K498
$$ 92233 32316 33248 7982 -1022 -3152 -1750 26332 29031 22855 31092 2274 -28156 -25658
11363b5658J044L8934P800P843J6458n7808k7973k4780m080M7932L3353j8743
$$ -25658 -24614 14320 22120 29963 46421 -11387 -39360 -64140 -68220 -20288 13065 -5678
11351e678M5418j6345L33L7882L210q018r504N901m0453O505l1439M164P0528
$$ -5678 39740 23395 23728 61610 64820 56802 47298 53199 12746 19251 -12188 -8024 62504
11338F2504J203n408J2228l124m9753M44j0018O36n5116R619L0487q906Q533l0151
$$ 62504 63707 58299 70527 67403 17650 18094 8076 8712 -46404 -36785 -6298 -15204 -6671 -36822
11324c6822j3553L2000K0568J3313K2692Q946k308J8653J6024J4248k9205n6994
$$ -36822 -50375 -18375 2193 15506 38198 47144 44836 63489 79513 93761 64556 7562
11312G562l8281K4229M4356j4975J4150K6703k2516l4100k4332J2467L5831M365
$$ 7562 -30719 -6490 37866 22891 37041 63744 41228 7128 -17204 -4737 31094 35459
11300C5459j2206l022K5240L438J2292J8806K310N015o5141n835K3749l0216J114
$$ 35459 23253 20231 45471 48909 61201 80007 82317 87332 22191 16356 40105 9889 11003
11287A1003P819k1121Q336O621j8070L6519J4760M4622J7696J7159k8430j7303
$$ 11003 18822 -2299 6037 12658 -5412 31107 45867 90489 108185 125344 96914 79611
11275G9611k0119m1188m0592k0283nM5263N1364j486k1860k5388j938N533J5990
$$ 79611 59492 18304 -22288 -42571 -42576 2687 54051 52565 30705 5317 3379 8912 24902
11262B4902k7416k1785L6417L3431J6175k9343j6695m709K1769K26J371J6761
$$ 24902 -2514 -24299 12118 45549 61724 32381 15686 10977 32746 32972 34343 51104
11250E1104j8112K7092N708L086M531k9047k1525m126O604o256j3618j2640K6020
$$ 51104 32992 60084 65792 68878 73409 44362 22837 18711 25315 19059 5441 -7199 18821
11237A8821j5856m019L5670J8990N565p228j7835m5483J3802J8757M7643M3994
$$ 18821 2965 -1054 34616 53606 59171 51943 34108 -11375 2427 21184 68827 112821
11225A12821l1097m7004k9559L102M3027m287K9767j693m8217n2173K0789K9738
$$ 112821 81724 34720 5161 8263 51290 47003 76770 75077 26860 -25313 -4524 25214
11213B5214o414n769m631J6031q149l741K2093J0117j2096q82l2334k3255j6022
$$ 25214 18800 13031 8400 24431 16282 12541 34634 44751 32655 31773 -561 -23816 -39838
11200c9838R912K5592N156j811N20M8037Q7373J8146m7925j2039j3666K61L59
$$ -39838 -29926 -4334 822 -989 -469 47568 134941 153087 105162 93123 79457 79718 80077
11187H0077M0107J1507J2690N9829O3422M7740Q7465P1046Q5947P5712L1807k8305
$$ 80077 120184 131691 144381 204210 267632 315372 402837 473883 559830 635542 667349 639044
11175F39044m0034j03434o8611n6259m4080j00207k9143j8334L994m9514m6406
$$ 639044 599010 495576 426965 370706 326626 226419 197276 178942 182936 133422 87016
11164H7016Q194j4736J2005l0259k7789K6589n451L7866K0113j4029k3223j4408
$$ 87016 95210 80474 92479 62220 34431 61020 55569 93435 113548 99519 76296 61888
11152F1888k4156n6737J5251M8455l6922m4257r263K3638K6813L6383J0730P202
$$ 61888 37732 -19005 -3754 44701 7779 -36478 -45741 -22103 4710 41093 51823 59025
11140E9025n541r576j1567J0530k3514p6219L5692O8448p107r229N3241O292l5640
$$ 59025 53484 43908 32341 42871 19357 -56862 -21170 47278 40171 30942 84183 90475 54835
11127E4835K6683k906j9594j1148L2630p773j6216K08l3551q091j459j2748J8799
$$ 54835 81518 78612 59018 47870 80500 72727 56511 56719 23168 15077 13618 870 19669
11114A9669l4314m784L9923M8708n505l4155l2972j2250j212L6488N4094j8897
$$ 19669 -14645 -19429 20494 69202 63697 29542 -3430 -15680 -16892 19596 73690 54793
11102E4793k2829j883o655J6725k7897o550J4413n501K7433Q936l014L6598K5044
$$ 54793 31964 30081 23426 40151 12254 5704 20117 14616 42049 50985 47971 84569 109613
11089A09613l4297l9862n789o136J6079l0193n990M7394M3253r256j9258M1084
$$ 109613 75316 35454 29665 23529 39608 9415 3425 50819 94072 84816 65558 106642
11077A06642K5371j7479k4658l341j7289J355J242j3568J3769M1699r245j0550
$$ 106642 132013 114534 89876 86535 69246 70601 71843 58275 72044 113743 104498 93948
11065I3948n751k6211J0244j2197M87J1123j8262l9106q131K0204M2318J7875
$$ 93948 88197 61986 72230 60033 60520 71643 53381 14275 6144 26348 68666 86541
11053H6541L5688M3523N7505K1174J2854Q556L7948P139N012J8942J9608j3172
$$ 86541 122229 165752 223257 244431 257285 265841 303789 310928 315940 334882 354490 341318
11041C41318l1414J3634L7534N0481L7784L3623O9614m170j9807J0718l1292o5710
$$ 341318 309904 323538 361072 411553 449337 482960 552574 548404 528597 539315 508023 442313
11029D42313r430J7082M4267M0767R2717Q5954O8671l2654p5847p5750m7971l1220
$$ 442313 432883 449965 494232 534999 627716 713670 782341 749687 673840 598090 550119 518899
11017E18899l0431P679n460N2052L0683M174j7003k5545n2901l1795o7222j08034
$$ 518899 488468 496147 490687 542739 573422 577596 560593 535048 482147 450352 383130 275096
11005B75096l4130M50K599k3907M3457r4k3942k6542m9898m3158m1905l1484j8205
$$ 275096 240966 241416 244015 220108 263565 263471 239529 212987 163089 119931 78026 46542 28337
10992B8337q150Q698L4494L3640J0423j3489j5863l6540k283R771Q292j8790j802
$$ 28337 20187 28885 63379 97019 107442 93953 78090 41550 39267 49038 57330 38540 36738
10979C6738j1205J1372M4223L0033J8826R935K5703j8231k8397m1985K685j0609
$$ 36738 25533 36905 81128 111161 129987 139922 165625 147394 118997 77012 79697 69088
10967F9088m4798l6279L486K9510K2763K5923K9009k7148k7627j2480j6254J6094
$$ 69088 24290 -11989 -8503 21007 43770 69693 98702 71554 43927 31447 15193 31287
10955C1287p116j8914n201L9519M0021j8946m5946j9836K5617K696L06l83k4613
$$ 31287 24171 5257 56 39575 79596 60650 14704 -5132 20485 23181 23487 23104 -1509
10942a509J9775J6481K2953L569N204J2884m4784j8661l4814j5716K2080L2017
$$ -1509 18266 34747 57700 61269 66473 79357 34573 15912 -18902 -34618 -12538 19479
10930A9479O0663K6813k3687m9998k910J3852j382K8100n9598j5028N4422O1478
$$ 19479 80142 106955 83268 33270 30360 44212 42830 70930 11332 -3696 50726 112204
10918A12204k7547k2888j9021k8644k8919K0440L1018J3644Q194j1767L4584M2651
$$ 112204 84657 61769 42748 14104 -14815 5625 36643 50287 58481 46714 81298 123949
10906A23949R789K7386m991m3787m1835n1540J6481q93j4501J8355J8612l635
$$ 123949 133738 161124 156133 112346 70511 18971 35452 34559 20058 38413 57025 53390
10894E3390l0232j4241j247L3748J9690J018k2007O331M164j1534J5680J2989
$$ 53390 23158 8917 7670 41418 61108 62126 40119 46450 50614 39080 54760 67749
10882F7749L8281j287k8344R948J0254k6979j9358k168j7043j6240L4528K1807
$$ 67749 106030 104743 76399 86347 96601 69622 50264 48096 31053 14813 49341 71148
10870G1148l505k5552k2539Q799M1340M0532P483l0274J2769J3824L1315L613
$$ 71148 67643 42091 19552 28351 69691 110223 117706 87432 100201 114025 145340 148953
10858A48953Q786j75k4508m0861L2776k5733n2942O826N3753K6549K5038K5264
$$ 148953 157739 157564 133056 92195 124971 99238 46296 53122 106875 133424 158462 183726
10846A83726k1070l8545K2251l4k7113J4290J3309L2409k1810J1365K313j4047
$$ 183726 162656 124111 146362 146328 119215 133505 146814 179223 157413 168778 171091 157044
10834A57044k8550m371k7689j8908L5276M0555L0306j1727p669l5839k6126l165
$$ 157044 128494 124123 96434 77526 112802 153357 183663 171936 164267 128428 102302 99137
10822I9137J8215J988O237j0013m861p557n477j5597L350r211m298j9739k0851
$$ 99137 117352 119340 125577 115564 110703 103146 97669 82072 85422 76211 71913 52174 31323
10809C1323j4403l3866r136K4921M8433J5402L6975j6614l1617K7897R745J8990
$$ 31323 16920 -16946 -26082 -1161 47272 62674 99649 83035 51418 79315 89060 108050
10797A08050K4837l8811j9834l1642L2021L2202j4679O7951J662n0136m5753k6260
$$ 108050 132887 94076 74242 42600 74621 106823 92144 160095 161757 111621 65868 39608
10785C9608j1790j1826k0616J1540L586K1873M0850M0316k5365k8419j0489K803
$$ 39608 27818 15992 -4624 6916 10502 32375 73225 113541 88176 59757 49268 52071
10773E2071O6203j2946j3990M364K6060R249J404l838J399k9167R256M713l674
$$ 52071 118274 105328 91338 95702 121762 131011 132415 128577 129976 100809 110065 114778 111104
10760A11104K5968M429J6539L504J5926q250J750L3537J4602J9182l3839j5420
$$ 111104 137072 141501 158040 161544 177470 169220 170970 204507 219109 238291 204452 189032
10748A89032q522K3763K5841k1084k1778j8853k1854k5175j8822O3313J5467j3897
$$ 189032 180510 204273 230114 209030 187252 168399 146545 121370 102548 165861 181328 167431
10736A67431K0963j153n0589K0399k381m1298j3044k7046L3114L6407L423L0233
$$ 167431 188394 187241 136652 157051 154670 113372 100328 73282 106396 142803 146226 176459
10724A76459j3474L940M4182l602n6442p2567m1585k0979L6623J5131K2994K9321
$$ 176459 162985 166925 211107 207505 151063 78496 36911 15932 52555 67686 90680 120001
10712A20001L4307n5572m0497j1541m627J8341J5976q421J0750L5486n610k9481
$$ 120001 154308 98736 58239 46698 42071 60412 76388 67967 78717 114203 108593 79112
10700G9112L4818N2492K8061n5300l2632K4875J2924L7588M7810L1624j1097q092
$$ 79112 113930 166422 194483 139183 106551 131426 144350 181938 229748 261372 250275 242183
10688B42183J2700K880K217r442p837r907Q747L3915L6646o6584k3698Q259K8371
$$ 242183 254883 257763 259980 250538 242701 232794 241541 275456 312102 245518 221820 230079 258450
10675B58450K4960J1967k8498L6395r330J5993M1688r993K9791O1800J6116L5800
$$ 258450 283410 295377 266879 303274 293944 309937 351625 341632 371423 433223 449339 485139
10663D85139J0233j7780K0988j2325L36j0386L8533L6304O4817J7090o788K3534
$$ 485139 495372 477592 498580 486255 486591 476205 514738 551042 615859 632949 626161 649695
10651F49695M9069M7156K8946K6913M9753O0470P0150M9493P1433P8357P9729
$$ 649695 698764 745920 774866 801779 851532 912002 982152 1031645 1103078 1181435 1261164
10640A261164P5645J16944J70185K34439K79480L22588L56253K94535K10281K18938
$$ 1261164 1336809 1453753 1623938 1858377 2137857 2460445 2816698 3111233 3321514 3540452
10630C540452K76927L40780M88386O29838Q58075J204863J605959K197465K959608
$$ 3540452 3817379 4158159 4646545 5276383 6134458 7339321 8945280 11142745 14102353
10621A4102353L858918N037682O216466O702556N560413L055675N16678j305128
$$ 14102353 17961271 22998953 29215419 35917975 41478388 44534063 45050741 43745613
10613D3745613j839424j060459O40863K977106N802787R087658J2290564J3381416
$$ 43745613 41906189 40845730 41486593 44463699 50266486 59354144 71644708 85026124
10605H5026124R989253L260167l118386o927334p845816n918261k166301K155522
$$ 85026124 95015377 98275544 95157158 88229824 80384008 74465747 72299446 74454968
10597G4454968O864280J1853401J5956530J6386575J0143567m52009r303555j4360097
$$ 74454968 81319248 93172649 109129179 125515754 135659321 135207312 125903757 111543660
10589A11543660j5306417j2519745p931614l112579J350667N402153Q285873Q065081
$$ 111543660 96237243 83717498 75785884 72673305 74023972 79426125 87711998 95777079
10581I5777079L371725l703068r347798j2177804j2110033r707770o505312l529218
$$ 95777079 99148804 95445736 86097938 73920134 61810101 52102331 45597019 42067801
10573D2067801j004735R80467K015472J678005l97721l178187n363531o350438
$$ 42067801 41063066 42043533 44059005 45737010 45339289 42161102 36797571 30447133
10565C0447133o242750n257466m095497l024165k219277j649570j208947r23696
$$ 30447133 24204383 18946917 14851420 11827255 9607978 7958408 6749461 5825765
10557E825765p03192n75974n08960m28812l91407l16560l03962k40074j97631
$$ 5825765 5122573 4546599 4037639 3608827 3217420 2900860 2596898 2356824 2159193
10548B159193j60761j60528j37735p2769j18051q9022r0792r9344p0253l9714
$$ 2159193 1998432 1837904 1700169 1627400 1509349 1420327 1329535 1230191 1159938 1120224
10538A120224p7385m3395j6967r0182p2955j0739k8293l6888j8618J9161k7203
$$ 1120224 1042839 999444 982477 892295 819340 808601 780308 743420 724802 743963 716760
10527G16760o0482j1563J1686j8739j4326j1942o8178l9554p231r251K1434k0856
$$ 716760 656278 644715 656401 637662 623336 611394 543216 503662 496431 487180 508614 487758
10515D87758j3463J9415O215k7965L4011N7192k4772q610K4009N6451L3372L7456
$$ 487758 474295 493710 499925 471960 505971 563163 538391 529781 553790 610241 643613 681069
10503F81069L1739J30937J64809K30778K58397J96207O875p6321j45554j84528
$$ 681069 712808 843745 1008554 1239332 1497729 1693936 1700811 1624490 1478936 1294408
10493A294408k03762j42995j41683r9649q1136k7228n4271o5802j6815k2808L2935
$$ 1294408 1090646 947651 805968 706319 625183 597955 543684 477882 461067 438259 471194
10482D71194K9282Q070k630l561L4014m024j3971l1223J8806l3437j3445j483
$$ 471194 500476 508546 505916 502355 536369 532345 518374 487151 505957 472520 459075 457592
10470D57592M870L2689l172M7297k0028J5097M1166J4521O2955R6031R5608J45313
$$ 457592 462462 495151 491979 539276 519248 534345 575511 590032 652987 749018 844626 989939
10458I89939K10481J94376J43122P0385k5219j58621j94743j83687k36876j93375
$$ 989939 1200420 1394796 1537918 1608303 1583084 1424463 1229720 1046033 809157 615782
10448F15782j10831n9548l6179l1203o9422j5981P342l4680p2665m9743l695M067
$$ 615782 504951 445403 409224 378021 308599 292618 299960 265280 192615 142872 139177 143244
10436A43244J7147J6514K2566M292n8379m6951k5914L046M9675Q614K4830L6116
$$ 143244 160391 176905 199471 203763 145384 98433 72519 75565 125240 133854 158684 194800
10424A94800J4430l6003k9630J2022j950k0451l0726j3901N667K4998j4522j8889
$$ 194800 209230 173227 143597 155619 153669 133218 102492 88591 94258 119256 104734 85845
10412H5845m03L0518K1284K4767Q776j7822j5095J1503o118k0054k0095L3668
$$ 85845 85442 115960 137244 162011 170787 152965 137870 149373 143255 123201 103106 136774
10400A36774L3948L1833K085j0560l7716n3770J8264k5908K2602L6937K4423l955
$$ 136774 170722 202555 204640 194080 156364 102594 120858 94950 117552 154489 178912 174957
10388A74957k0284l1420K84L0301J4661o682l2656k7718L2173L5553j6835n2444
$$ 174957 154673 123253 123537 153838 168499 161817 129161 101443 133616 169169 152334 99890
10376I9890K5512j0587L769l6938K0925j4616l1613K7476O9522L4679j6289J7739
$$ 99890 125402 114815 118584 81646 102571 87955 56342 83818 153340 188019 171730 189469
10364A89469J9197k216j0230J2586m6755k0346k4379K0084J7304J2146N9256J5382
$$ 189469 208666 206450 196220 208806 162051 141705 117326 137410 154714 166860 226116 241498
10352B41498R544J3377Q15l0394m6898j5589K4843L9153N913K547j7761k3056
$$ 241498 251042 264419 265234 234840 187942 172353 197196 236349 242262 244809 227048 203992
10340B03992K6740j4433o1887m8863Q751J647q568J3911j6011m841q752m04L8551
$$ 203992 230732 216299 154412 105549 114300 115947 107379 121290 105279 100438 91686 91282 129833
10327A29833K1171q552r245j5727M544K1765P607N4420J7638l8340P656Q0877
$$ 129833 151004 142452 133207 117480 122024 143789 151396 205816 223454 185114 192770 273647
10315B73647K2366j9226n899m430j8049l5994K3585J7195J1684n558j8661J2398
$$ 273647 296013 276787 270888 266458 248409 212415 236000 253195 264879 259321 240660 253058
10303B53058p722k3806k1583K8166O725n7445l2790k5474O899L3929M7192K1245
$$ 253058 245336 221530 199947 228113 234838 177393 144603 119129 126028 159957 207149 228394
10291B28394m6516j6349R81m1424j6185K518K0807L7271J5996N1800M1397K9543
$$ 228394 181878 165529 166510 125086 108901 111419 132226 169497 185493 237293 278690 308233
10279C08233L5181J00800J30661R1837J17762J12089Q2380L281L6743k0840j8401
$$ 308233 343414 444214 574875 666712 784474 896563 978943 982224 1018967 998127 979726
10268I79726m7840n8326r4263j18901j13098m4673m4310o8013o0770n7536l4754
$$ 979726 931886 873560 779297 660396 547298 502625 458315 390302 329532 271996 237242
10257B37242j8517R466N136j4534j1224J0336K2325l373L1697k2488j0967r671
$$ 237242 218725 228191 233327 218793 207569 217905 240230 236857 268554 246066 235099 225428
10245B25428O0513k0953J593M5351M571l2349J5129J4693J7662m426j5157r941
$$ 225428 285941 264988 266581 311932 316503 284154 299283 313976 331638 327212 312055 302114
10233C02114K8615K1339k929j714M8318K5712K921j5367m0648o0498o3937q0317
$$ 302114 330729 352068 349139 347425 395743 421455 424376 409009 368361 307863 243926 163609
10221A63609r2504m7071q547L4478K8621K8780P0268M3506K499j0159J6325J3915
$$ 163609 71105 24034 15487 49965 78586 107366 177634 221140 223639 213480 229805 243720
10209B43720K5608R799J2949N7223O0248J0669J0766k3394o2251l8893l3408J9475
$$ 243720 269328 279127 292076 349299 409547 420216 430982 407588 345337 306444 273036 292511
10197B92511Q4888M0746R329j7122m5719l1881M2907R328n466L1166L1422N0083
$$ 292511 377399 418145 427474 410352 364633 332752 375659 384987 379521 410687 442109 492192
10185D92192J8986J8482N1477M7320N5857K2241k9726o5254q7635q172J0804M077
$$ 492192 511178 529660 581137 628457 684314 706555 676829 611575 523940 515768 526572 530649
10173E30649R201J04700J21509J53077J27208O7449M2751K0912j6982n1910k7488
$$ 530649 539850 644550 766059 919136 1046344 1113793 1156544 1177456 1160474 1108564 1081076
10162A081076m334M6790P6084J09124O1907N7207M4998L1470n1206q9353O620
$$ 1081076 1076742 1123532 1199616 1308740 1370647 1427854 1472852 1504322 1453116 1363763 1370383
10151A370383J5569j579L4046P3273P5319O2036O1173L8959j4431j0013j621j8013
$$ 1370383 1385952 1384373 1418419 1491692 1567011 1629047 1690220 1729179 1714748 1704735 1703114 1685101
10139A685101J5867Q6612Q2601J70123J70739J21173J15865Q3090O5128M7484
$$ 1685101 1700968 1787580 1870181 2040304 2211043 2332216 2448081 2531171 2596299 2643783
10129B643783J05548J72096J51585J42452K20921K65574K90378L42996M37635
$$ 2643783 2749331 2921427 3073012 3215464 3436385 3701959 3992337 4335333 4772968
10120D772968M80927N35808N98038O74186P11294O74120O66957P26620P53740
$$ 4772968 5253895 5789703 6387741 7061927 7773221 8447341 9114298 9840918 10594658
10111A0594658Q63391J013538J228959J561838J963275K436498L208989M403936
$$ 10594658 11458049 12471587 13700546 15262384 17225659 19662157 22871146 27275082
10103B7275082O201718Q782203J2693893J8507523K7103579L8925715N0849019
$$ 27275082 33476800 42259003 54952896 73460419 100563998 139489713 190338732
10096A90338732N2480435L2693746m07077k9350665m4823609m8143110m1188366
$$ 190338732 242819167 275512913 275105836 245755171 200931562 152788452 111600086
10089A11600086k9932971k0402186j3777608r361848o442177m574575l276687
$$ 111600086 81667115 61264929 47487321 38125473 31683296 27108721 23832034
10082B3832034k473784j969748j554387j159597q51588o99827m89003k16304j9001
$$ 23832034 21358250 19388502 17834115 16674518 15822930 15123103 14634100 14417796 14398795
10073A4398795Q4988Q2334J47256K40026L92411N50073M97605N83028Q09370J135190
$$ 14398795 14483783 14566117 14713373 14953399 15345810 15895883 16393488 16976516 17785886 18921076
10063A8921076J730666K536996L590263N039270P168466J0218794J4754081K1188717
$$ 18921076 20651742 23188738 26779001 31818271 38986737 49205531 63959612 85148329
10055H5148329K9292220L6704707L8688493L2497063J9734688K349071j6498048
$$ 85148329 114440549 151145256 189833749 222330812 242065500 244414571 227916523
10048B27916523l1026703l7216923l6120766l0627630k3241839j6522214j1498816
$$ 227916523 196889820 159672897 123552131 92924501 69682662 53160448 41661632
10041D1661632q070103n759253m241015l233560k564179k131544j802228j550818
$$ 41661632 33591529 27832276 23591261 20357701 17793522 15661978 13859750 12308932
10033A2308932j331425j076837q04215o30055n64294n01154m85331n14164n75259
$$ 12308932 10977507 9900670 9096455 8466400 7902106 7400952 6915621 6401457 5826198
10024E826198n72372m61591l78828l60890l32827k85381k29487j64874j88195
$$ 5826198 5253826 4792235 4413407 4052517 3719690 3434309 3204822 3039948 2851753
10015B851753j89643j79042j79513r4900q2344r6389p5278j10252p3336o6045
$$ 2851753 2662110 2483068 2303555 2208655 2126311 2029922 1954644 1844392 1771056 1705011
10005A705011q1770q1741q5629p8827l3817m4471j4386o4963l8444l3823l3228
$$ 1705011 1623241 1541500 1455871 1377044 1343227 1298756 1284370 1219407 1180963 1147140 1113912
9994A113912k272m3272R77k3481j7903j0565n5017r9156l9136M324l3361j3018
$$ 1113912 1111640 1068368 1069345 1045864 1027961 1017396 962379 863223 824087 828411 795050 782032
9982G82032k5853j2311K6026M3714l5050r4954J2431M1510P460L0272K4770K1754
$$ 782032 756179 743868 769894 813608 778558 683604 696035 737545 745005 775277 800047 821801
9970H21801O5237L8014l0715m0212o8781j02315o2336m7102l7429K6979M1562
$$ 821801 887038 925052 894337 854125 785344 683029 620693 573591 536162 563141 604703
9959F04703k1047l9009k0938m157J4302N35o8882j5165L7426K1821L3938K6670
$$ 604703 583656 544647 523709 519552 533854 534389 465507 450342 487768 509589 543527 570197
9947E70197j7350J5597J3777L5567K4847O7473L4238R1361K12053K33478K37397
$$ 570197 552847 568444 582221 617788 642635 710108 744346 835707 1047760 1281238 1518635
9936A518635L25365L38714K86357K15742P0865j57589k76447l04307k83535k25055
$$ 1518635 1844000 2182714 2469071 2684813 2755678 2598089 2321642 2017335 1733800 1508745
9926A508745j69627r4068j43952j20744j31538j36954p7353p1529q8710q2083
$$ 1508745 1339118 1245050 1101098 980354 848816 711862 634509 562980 474270 392187
9916C92187j2922q275l9052p603k8210j4582N819N849L051n166O701M884j0577
$$ 392187 379265 370990 331938 324335 296125 281543 287362 293211 296262 291096 297797 302681 292104
9903B92104K0460O5514l1696n4941m3933j5657L327j8635K5889L2203k8135l6697
$$ 292104 312564 378078 346382 291441 247508 231851 235178 216543 242432 274635 246500 209803
9891B09803L1888M1147K7633k1100m3973j1524j8491J7773r876K3444o527k3270
$$ 209803 241691 282838 310471 289371 245398 233874 215383 233156 223280 246724 240197 216927
9879B16927k8150N065M5137J5026j1015j8167L6664M1785p117J4262J3247M4581
$$ 216927 188777 193842 238979 254005 242990 224823 261487 303272 296155 310417 323664 368245
9867C68245R2641J29036J46934J83058J77693J90283K35867K49703K40195J99650
$$ 368245 460886 589922 736856 919914 1097607 1287890 1523757 1773460 2013655 2213305
9857B213305O5875k6110r4590k08037k61407k24350j99083k10939j99570j52498
$$ 2213305 2279180 2253070 2158480 1950443 1689036 1464686 1265603 1054664 855094 702596
9847G02596q6963m5200O612n7737r1349n0980l0693n487m0779l4453p622M9365
$$ 702596 615633 570433 577045 519308 427959 376979 346286 340799 300020 265567 257945 307310
9835C07310L8728k720l8257p0316k6853N285p587j9576k7946k3216J2197M2143
$$ 307310 346038 343318 305061 234745 207892 213177 205590 186014 158068 134852 147049 189192
9823A89192q819l0837m2742N706M55R126L0129K9892k1190m4243J9193M2991j4237
$$ 189192 180373 149536 106794 112500 112955 122081 152210 182102 160912 116669 135862 178853 164616
9810A64616K713J3990k1950j5460o3277m9462K0041P6746P150M055O6265J6480
$$ 164616 167329 181319 159369 143909 80632 31170 51211 127957 135107 139162 205427 221907
9798B21907J4014K022l3468j4176j8283k1149l3450j0785k0279k2462K9319J4621
$$ 221907 235921 237943 204475 190299 172016 150867 117417 106632 86353 63891 93210 107831
9786A07831k6386p934n114j0205J7431J4674N837J4978L1186k0432m2811K323
$$ 107831 81445 73511 68397 58192 75623 90297 96134 111112 142298 121866 79055 81378
9774H1378N042o724k3007K8347J5127n0079o996m169J3214P805k4426j5115Q501
$$ 81378 86420 79696 56689 85036 100163 50084 43088 38919 52133 59938 35512 20397 28898
9761B8898o646K1055N6062o742l1217j3265L1279n014j5807J0869k4150q150J3502
$$ 28898 22252 43307 99369 92627 61410 48145 79424 74410 58603 69472 45322 37172 50674
9748E0674L1719r461l7570J6351L4935R890n538L3053j0037k8454m1292k9333
$$ 50674 82393 72932 35362 51713 86648 96538 91000 124053 114016 85562 44270 14937
9736A4937L1333M057K575J2151R755L753L1154L8542l8653m3722k5112r63j4721
$$ 14937 46270 50327 52902 65053 74808 78561 109715 148257 109604 65882 40770 39807 25086
9723B5086j7294l44M6687M5597l8013j3563M5938j1766j7850K8091R026L847l2386
$$ 25086 7792 7448 54135 99732 61719 48156 94094 82328 64478 92569 101595 105442 73056
9710G3056r401K6992P44M733r000J7986L5777L731K8698K7928j573J9943L875
$$ 73056 63655 90647 91391 96124 87124 105110 140887 144618 173316 201244 199671 219614 223489
9697B23489n778J5982J8933L7213L3746J14253J40275J50723K15141K60419K07324
$$ 223489 217711 233693 252626 289839 323585 437838 578113 728836 943977 1204396 1411720
9686A411720K3477p4439j83323k11901k10436j89650j25964q0966l7206m7999
$$ 1411720 1435197 1360758 1177435 965534 755098 565448 439484 358518 321312 273313
9676B73313n1021k2807K5008Q367k8470n4981l1751K0245M753k6047J6033M5036
$$ 273313 222292 199485 224493 232860 204390 149409 117658 137903 142656 116609 132642 177678
9664A77678K8550L966k7627p889j9166p227j8838r74N85j0256K9516R2348J09327
$$ 177678 206228 210194 182567 174678 155512 148285 129447 128473 129058 118802 148318 240666 349993
9651C49993P7940R5740J20219J74967K19559J59154R5246Q1207N5220L740L892
$$ 349993 427933 523673 643892 818859 1038418 1197572 1292818 1374025 1429245 1432985 1436877
9640A436877l998j19097j90009j92508j86081j57220j12371p8487n4635p5947
$$ 1436877 1432879 1313782 1123773 931265 745184 587964 475593 397106 342471 266524
9630B66524k6498n9423j6186J4164k6056j5129k2675m9846k5718J0018J400K2764
$$ 266524 240026 180603 164417 178581 152525 137396 114721 64875 39157 49175 50575 73339
9618G3339j1617J0845K5291J1275k7401m2816k1600k2196K1538p255l1596Q709
$$ 73339 61722 72567 97858 109133 81732 38916 17316 -4880 16658 9403 -22193 -13484
9606a3484J1002L1956J7272l7946q037J7549n321j3273K477K0994K4564M605k7992
$$ -13484 -2482 29474 46746 8800 763 18312 12991 -282 2195 23189 47753 52358 24366
9593B4366l9575k9940M8343J216K2720J6374l3766N195j8535M1766j373j6722
$$ 24366 -15209 -45149 3194 4410 27130 43504 9738 14933 -3602 38164 36791 20069
9581B0069n2978J8287N0803n305l6129J2269m244k8130m746m772J4287L4152J939
$$ 20069 -32909 -14622 36181 30876 -5253 7016 2772 -25358 -30104 -34876 -20589 13563 15502
9568A5502L852l5882l6154K0731N0228L3934N769k6849l6945R909L1765q451J6657
$$ 15502 19354 -16528 -52682 -31951 18277 52211 57980 31131 -5814 4095 35860 27409 44066
9555D4066N7414n7704l4015L776n08r556K3608o934J1142j9943m1026J9307K163
$$ 44066 101480 43776 9761 13537 13029 3473 27081 20147 31289 11346 -29680 -10373 -8210
9542h210J65J0793R509K0421l7633k1426J2189m070K7044K5498j9504n3285O757
$$ -8210 -8045 2748 12257 32678 -4955 -26381 -14192 -18262 8782 34280 14776 -38509 -31752
9529c1752P6760L7887m7472k6749N514L1800j6940j5667L01k4859j874l0434o314
$$ -31752 45008 82895 35423 8674 14188 45988 29048 13381 13682 -11177 -13051 -43485 -49799
9516d9799J5451K0342q035J8399L8171N734L1359Q129p897P028k2396j9168O734
$$ -49799 -34348 -14006 -22041 -3642 34529 40263 71622 79751 71854 78882 56486 37318 44052
9503D4052K6853j4824m95m331l0557p8431l6313K0375O397j0203L3058M2297R072
$$ 44052 70905 56081 55586 51255 20698 -57733 -94046 -73671 -67274 -77477 -44419 -2122 6950
9490F950j99M268J8395k9089k7623p587n2749q436L0226K9977J2128k9687k8919
$$ 6950 6751 11019 29414 325 -27298 -34885 -87634 -96070 -65844 -35867 -23739 -53426 -82345
9477h2345j0511K8645N4820O9556L70j0999j8855KJ914n564k2677K8876J1386
$$ -82345 -92856 -64211 -9391 60165 60535 49536 30681 30683 32597 27033 4356 33232 44618
9464D4618l8751L4314K4098p1500k7503M2425L3454K437k3517j2480J4208m1972
$$ 44618 5867 40181 64279 -7221 -34724 7701 41155 43592 20075 7595 21803 -20169
9452b0169k8253Q322r83K5673m487J5278k0251R659L4725j3947K40K819j812j9823
$$ -20169 -48422 -40100 -41083 -15410 -19897 -4619 -24870 -15211 19514 5567 5807 8626 6814 -13009
9438a3009k1689j7863r324M2536K7798K7723K7269m0129Q505j2342l438J1674
$$ -13009 -34698 -52561 -61885 -19349 8449 36172 63441 23312 31817 19475 16037 27711
9426B7711j5492R255j4291j1273p644k1345J6915O8606o628o6944l664J1673k2147
$$ 27711 12219 21474 7183 -4090 -11734 -33079 -16164 52442 45814 -21130 -24794 -13121 -35268
9413c5268o843M7918K3030J6071k8737J2824l142l8767j503K8331Q449j3043j1649
$$ -35268 -42111 5807 28837 44908 16171 28995 25853 -12914 -14417 13914 22363 9320 -2329
9400b329k36R370k472p52k8283j1493P290p301o939O8118k1286j4669M1599N703
$$ -2329 -2565 6805 4333 3581 -24702 -36195 -28905 -36206 -43145 24973 3687 -10982 30617 36320
9386C6320n7Q329p96J9458j5601k7164j583M507J2379P670j5250j1551N045K8024
$$ 36320 36263 44592 43796 63254 47653 20489 18906 23413 35792 43462 28212 16661 21706 49730
9372D9730L0467k0322m3047K3980j3685n493K054l799mK7516k8142K9750K3787
$$ 49730 80197 59875 16828 40808 27123 21630 23684 19885 19881 47397 19255 49005 72792
9359G2792j1909j4500l1110K2248o506j8190j8617k0474k8966l877L8687K7478
$$ 72792 60883 46383 15273 37521 31015 12825 -5792 -26266 -55232 -59109 -20422 7056
9347G056j9072R083M1092l8021k6737p456K5082m434k5053O6280p135k873M3060
$$ 7056 -12016 -2933 38159 138 -26599 -34055 -8973 -13407 -38460 27820 20685 17812 60872
9334F0872p3685o733L2707K9314j8851k8753L3513j3716k5596J8732N6368l2241
$$ 60872 -12813 -19546 13161 42475 23624 -5129 28384 14668 -10928 7804 64172 31931
9322C1931k6280j1143j1996J2897k1416J1511L0828r228l4342J4253J6277m8392
$$ 31931 5651 -5492 -17488 -4591 -26007 -14496 16332 7104 -27238 -12985 3292 -45100
9310d5100R587L7164M8710k6759j2406j7925n735O0840R307L3264K9328j8197
$$ -45100 -35513 1651 50361 23602 11196 -6729 -12464 48376 57683 90947 120275 102078
9298A02078k5082o5772k5698M1593K6973J1194n51j2714K0396K0410k364j4471
$$ 102078 76996 11224 -14474 27119 54092 65286 64735 52021 72417 92827 90463 75992
9286G5992l3446J4925K8146K765m6846k0827O650j963M672M9318j7263l2806J8454
$$ 75992 42546 57471 85617 88382 41536 20709 27359 25396 30068 79386 62123 29317 47771
9273D7771j2038k1835o366n891o4584K527Q4975k348K6163j3006o3451j5277k480
$$ 47771 35733 13898 7532 1641 -62943 -60416 24559 22211 48374 35368 -28083 -43360 -45840
9260d5840N2659K6191J0846J4744m044p3445j5895j0994k3304J0817L1768M5926
$$ -45840 6819 33010 43856 58600 54556 -18889 -34784 -45778 -69082 -58265 -26497 19429
9248A9429l0091N31Q551k4802K4027O755r797p1072j6182R77K0554O5019K8034
$$ 19429 -10662 -10131 -1580 -26382 -2355 4400 -5397 -76469 -92651 -91674 -71120 -6101 21933
9235B1933j6287l4446K4901j7854n877k1665Q055J4872m904L2933K7645k5427
$$ 21933 5646 -28800 -3899 -21753 -27630 -49295 -41240 -26368 -31272 1661 29306 3879
9223C879M7k3394K5109K7871N865J6230j3249l6892o9635j568O8132J5153l9927
$$ 3879 3926 -19468 5641 33512 39377 55607 42358 5466 -64169 -65737 2395 17548 -22379
9210b2379m1406L1116J5469j5043J1748J1235K3840K2544k2069l5720R403L975
$$ -22379 -63785 -32669 -17200 -32243 -20495 -9260 14580 37124 15055 -20665 -11262 -7287
9198g287Q309K9947M4246j5810o5366k4842N77L1607J0250K471K7500J8664j1884
$$ -7287 1022 30969 75215 59405 -5961 -30803 -30226 1381 11631 14102 41602 60266 48382
9185D8382k2922J576K4752j3317o342M5803j805l0603K8961L6057j1169m7026
$$ 48382 25460 27036 51788 38471 32129 77932 76127 45524 74485 110542 99373 52347
9173E2347l0411l1217j6600K5889l8413j5462J6857L4457K7819r58o0151R722
$$ 52347 21936 -9281 -25881 8 -38405 -53867 -37010 -2553 25266 24308 -35843 -26121
9161b6121L0826K5937Q807M2275l148k3739k3459K4178N0961m035m4281Q534P882
$$ -26121 4705 30642 39449 81724 78576 54837 31378 55556 106517 102482 58201 66735 74617
9148G4617n171l6608k344R634J7748O607j736k9163k7342R09j9334j6103M622
$$ 74617 69446 32838 30494 40128 57876 64483 62747 33584 6242 7151 -12183 -28286 -23664
9135b3664n090L0818L3446J0148j2598r801J3065m2722k1729K7850K6363J2922
$$ -23664 -28754 2064 35510 45658 33060 23259 36324 -6398 -28127 -277 26086 39008
9123C9008l909O493J8150l1186l5864Q169O9834J6291j4623k600p940k3292N680
$$ 39008 35099 41592 59742 28556 -7308 861 70695 86986 72363 69763 61823 38531 44211
9110D4211J3452J8992K2557J6061P096m626M880M6261K8066k953N8856J06295
$$ 44211 57663 76655 99212 115273 122369 117743 122623 168884 196950 193997 252853 359148
9098C59148P6072J9705l820l9199r4500q9102j0072k2261k4628l8487o97m4541
$$ 359148 435220 454925 451105 411906 317406 228304 218232 195971 171343 132856 132159 87618
9086H7618m0248k4216J2922O5293K4793l5740n4985j1809Q865J6617m460k5818
$$ 87618 47370 23154 36076 101369 126162 90422 35437 23628 32493 49110 44650 18832
9074A8832l3708J779L1498N3318L947k0560m816J2735J451L527k396j764J2952
$$ 18832 -14876 -13097 18401 71719 75666 55106 50290 63025 64476 68003 65607 63843 76795
9061G6795M5148N7688M337J9019Q0614J41198J87730J84846Q5028l9711j20387
$$ 76795 121943 179631 183968 202987 283601 424799 612529 797375 882403 842692 722305
9050G22305j78239j45203j16240n5251l9951m2812k4571Q093k4148l511j2390
$$ 722305 544066 398863 282623 227372 187421 144609 120038 128131 103983 100472 88082
9039H8082k2729K4472P786j0823N58J783k3488j3973J8201M834o8843l1205K4785
$$ 88082 65353 89825 97611 86788 87346 89129 65641 51668 69869 74703 5860 -25345 -560
9026e60K7903p176J933L9601K2960J9229k8817j136k6473R067J4495L1661L1516
$$ -560 27343 20167 22100 61701 84661 103890 75073 73937 47464 56531 71026 102687 134203
9013A34203J9883M6530P3247N4793P1900M5333k060m4073q5718r5167l5149n8338
$$ 134203 154086 200616 273863 328656 400556 445889 443829 399756 314038 218871 183722 125384
9001A25384n627j3668l9623k3441K6444n346J23K5711L626p50l1533k2238L6688
$$ 125384 119757 106089 66466 43025 69469 64123 64246 89957 93583 92833 61300 39062 75750
8988G5750L129k3684j5888j3221o99m75K8038m0993p4350K2870K4286J3665J0357
$$ 75750 78879 55195 39307 26086 25387 24912 52950 11957 -62393 -39523 -15237 -1572 8785
8975H785j1328N2933J8467k3969L062K343L3282L9569J9230j7593J6202J0396
$$ 8785 -2543 50390 68857 44888 47950 50293 83575 123144 142374 124781 140983 151379
8963A51379o4448j4284j3489l7292n4795J4330L0513K5325N0851K4269j0676j4806
$$ 151379 86931 72647 59158 21866 -32929 -18599 11914 37239 88090 112359 101683 86877
8951H6877K8705q300l9070l1036l65L1430l2867j617K2936m435P771L6276R936
$$ 86877 115582 107282 68212 37176 36811 68241 35374 33757 56693 52258 60029 96305 106241
8938A06241q890J06j8378K3035J3635k1308J613k2486q863k6589j923K7892J8141
$$ 106241 97351 97457 79079 102114 115749 94441 96054 73568 64705 38116 36193 64085 82226
8925H2226L0967n4209j8689M0311K2096R148L879j0979j2568k6784J550K1518
$$ 82226 113193 58984 40295 80606 102702 111850 115729 104750 92182 65398 66948 88466
8913H8466k6466p293N6000J7225L875l171n8487k6081l10Q748j4995M2392L2281
$$ 88466 62000 54707 110707 127932 131807 128636 70149 44068 43758 52506 37511 79903 112184
8900A12184r395l2834L6611k1734o6411j8578O7096M3225K3278j9133l7184p490
$$ 112184 102789 69955 106566 84832 18421 -157 66939 110164 133442 114309 77125 69635
8888F9635o393L4422M2275M339k7975k662O949l0384r964J7169m0524j4760K6807
$$ 69635 63242 97664 139939 144278 116303 113641 120590 90206 80242 97411 56887 42127 68934
8875F8934J9339P334j0745L4980j2304m088Q609K0533R928M9224j1369k0525J0124
$$ 68934 88273 95607 84862 119842 107538 103450 112059 132592 142520 191744 180375 159850 169974
8862A69974O8787M3145p195k1193k866J483j3056m3530n7375R375k7400j490k0287
$$ 169974 238761 281906 274711 253518 250652 252135 239079 195549 138174 147549 120149 118659 98372
8849I8372k0433j1954K9596P455n492j7178k1465M7425M3222j2647j5509j3364
$$ 98372 77939 65985 95581 103036 97544 80366 58901 106326 149548 136901 121392 108028
8837A08028m356R728K9532j562j4471K0239j2386m7293P428J6839m0763j6753
$$ 108028 103672 113400 142932 141370 126899 147138 134752 87459 94887 111726 70963 54210
8825E4210k9425N86L2395L6265J7321J6730M3869P6683K3305P1483R1132K0059
$$ 54210 24785 25371 57766 94031 111352 128082 171951 248634 271939 343422 434554 454613
8813D54613J8861n7609p8526n7328m15k9342j8441p192N063k0343m105l7937m1055
$$ 454613 473474 415865 337339 280011 279596 250254 231813 224621 229684 209341 205236 167299 126244
8800A26244l7754K8176M1203J2808p360m1145l4380J853j442J9446M1780J0733
$$ 126244 88490 116666 157869 170677 163317 122172 87792 89645 88203 107649 149429 160162
8788A60162K4434L8396K9034P150l6415k110l1128o6731n7761j4432M3814N5450
$$ 160162 184596 222992 252026 259176 222761 220651 189523 122792 65031 50599 94413 149863
8776A49863N8079K8353J019K2625M7131J9032L2127K1535k1207o604m645j2088
$$ 149863 207942 236295 237314 259939 307070 326102 358229 379764 358557 351953 347308 335220
8764C35220J124q781K36q383L5829k7576k8285j9774J4451K3391K8347J3939O2685
$$ 335220 336344 327563 327799 319416 355245 327669 299384 279610 294061 317452 345799 359738 422423
8751D22423K9186k9941J2058L087k1096j900J1093r725r423K9447M7666N8910
$$ 422423 451609 421668 433726 436813 415717 413817 424910 415185 405762 435209 482875 541785
8739E41785Q049k0197K2847L2680L3067O347j2657L8188Q2893O9508Q6619P7424
$$ 541785 549834 529637 552484 585164 618231 624578 611921 650109 733002 802510 889129 966553
8727I66553N3544O4009Q2830P0546P7180P5723J28422J28776J42312K41396K75530
$$ 966553 1020097 1084106 1166936 1237482 1314662 1390385 1518807 1647583 1789895 2031291 2306821
8716B306821L36152L39548L88023M41888N07069N95964P53098J030980J451829
$$ 2306821 2642973 2982521 3370544 3812432 4319501 4915465 5668563 6699543 8151372
8707H151372K093277K976477M273701O180677R293811J3909494J7583857J3328575
$$ 8151372 10244649 13221126 17494827 23675504 32969315 46878809 64462666 77791241
8699G7791241P54828q576922j3096140j4653141j2080854q184206n365694l563615
$$ 77791241 78546069 69969147 56873007 42219866 30139012 21954806 16589112 13025497
8691A3025497k414235j719057j232290r11119o54855m96405l50587k63778j99773
$$ 13025497 10611262 8892205 7659915 6748796 6093941 5597536 5246949 4983171 4783398
8682D783398j49307j60056j46913j10042l6877L8868Q8764R4919J41700K57125
$$ 4783398 4634091 4474035 4327122 4217080 4180203 4219071 4307835 4402754 4544454 4801579
8672D801579L64055N36689O38919P40795P91005Q21370J057289J341408J874122
$$ 4801579 5165634 5702323 6341242 7082037 7873042 8694412 9751701 11093109 12967231
8663A2967231K767739M029155N786335Q356284J2398494J9514276L1332818M2004469
$$ 12967231 15734970 19764125 25550460 33906744 46305238 65819514 97152332 139156801
8655A39156801K8512056m878648k1221303l0285155l2853042k4519007j5585348
$$ 139156801 167668857 162790209 141568906 111283751 78430709 53911702 38326354
8648C8326354r878565o487812m377118l064583k262822j626286j171707r18518
$$ 38326354 28447789 21959977 17582859 14518276 12255454 10629168 9457461 8538943
8640H538943p01508o53959o12854n79866n35427m25599k76485k14011j22638j23123
$$ 8538943 7837435 7183476 6570622 5990756 5455329 5029730 4753245 4539234 4416596 4293473
8630D293473p2702l8209J032R7528J96719K71850K69266L80963M73040N67683
$$ 4293473 4220771 4182562 4183594 4281122 4477841 4749691 5018957 5399920 5872960 6440643
8620F440643P71290J055569J468296K168853L084684M394483O469944R776290
$$ 6440643 7211933 8267502 9735798 11904651 14989335 19383818 25853762 35630052
8612C5630052J4273811J6879595J0902595j589277r597260j3582455j4441798
$$ 35630052 49903863 66783458 77686053 76096776 66499516 52917061 38475263
8605C8475263j1332002p520701m940614l308372k299467j587640j175514q92675
$$ 38475263 27143261 19622560 14681946 11373574 9074107 7486467 6310953 5418278
8597E418278o37322n06065l69272l40248l78258l86226l04000k66871k06805j52916
$$ 5418278 4780956 4274891 3905619 3565371 3187113 2800887 2496887 2230016 2023211 1870295
8587A870295j63400j50929j09820q8466j31751p7253o7332l5427K3165j6043n4071
$$ 1870295 1706895 1555966 1446146 1357680 1225929 1148676 1081344 1045917 1069082 1053039 998968
8576I98968n1869j5193R826o8182n8910j7506j9744L7950Q2912J10670J09526
$$ 998968 947099 931906 941732 873550 814640 797134 777390 815340 898252 1008922 1118448
8565A118448Q1442O6557l4046j10898j58013j38155j21635q1093p7998n3686j2849
$$ 1118448 1199890 1266447 1232401 1121503 963490 825335 703700 622607 544609 490923 478074
8554D78074l3999m2233r181o347J9174j9085j2763k0353j6890j3679J1549P636
$$ 478074 444075 401842 392661 386314 405488 386403 373640 353287 336397 322718 334267 341903
8542C41903l5388n2423j6014J5917N923L6003j943j8359K2842r433l7795O6505
$$ 341903 306515 254092 238078 253995 259918 295921 293978 275619 298461 289028 251233 317738
8530C17738P3013L5533o2124l2555o8335l2177k3873k5160J5829K5391N268m9146
$$ 317738 390751 426284 364160 331605 263270 231093 207220 182060 197889 223280 228548 179402
8518A79402j3552R10l0737O864L0955k9599M626j5721J3201K7762L143k870J7695
$$ 179402 165850 166760 136023 142887 173842 144243 148869 133148 146349 174111 177254 174384 192079
8505A92079J527L1402j5942k9972K4670K8121m0334k7138j2187N6787K0522n3194
$$ 192079 193606 225008 209066 179094 203764 231885 191551 164413 152226 209013 229535 176341
8493A76341m508j7893k6404K5835j4421k1892o781J5003L5033j1459p333k602
$$ 176341 171833 153940 127536 153371 138950 117058 110277 125280 160313 148854 141521 138919
8481A38919P257j8266J9031n6k5088j190K8037j0564r775K6020n6278l4346K0537
$$ 138919 146176 127910 146941 146885 121797 120607 148644 138080 128305 154325 98047 63701 84238
8468H4238K0746r075M993Q44j2418L71L0127L332R893m1041k3745j6995l677L1410
$$ 84238 104984 95909 100902 101746 89328 89699 119826 123158 133051 92010 68265 51270 47593 79003
8454G9003O4006K9250n3708o4490j8321O2239M0336K7205j1385j3278J8124J0880
$$ 79003 143009 172259 118551 54061 35740 97979 138315 165520 154135 140857 158981 169861
8442A69861l1321j7265j1159k8043j1570n441J9007j685k7020K1036J3000j9007
$$ 169861 138540 121275 110116 82073 70503 65062 84069 82384 55364 76400 89400 70393
8430G0393l2119K2p944J3797j7256L9833J3327n7764J7065K8586L2518O851l5068
$$ 70393 38274 38296 30352 44149 26893 66726 80053 22289 39354 67940 100458 107309 72241
8417G2241m5979N1543Q7622k9634o2103l1162J8870K3239J7422r370l0857q19
$$ 72241 26262 77805 165427 135793 73690 42528 61398 84637 102059 92689 61832 61013
8405F1013M1651j1747j9346J9852P468k0469j1710Q340L2551J3971K3899J5688
$$ 61013 102664 90917 71571 91423 98891 78422 66712 75052 107603 121574 145473 161161
8393A61161m4738j0837j4159j3982Q937j237k97J2475K4633n53j1159J2080J566
$$ 161161 116423 105586 91427 77445 86382 85145 84848 97323 121956 121403 110244 122324 123890
8380A23890j8311n6350l475K4934M139J440M2584K6489k8255j4695o765R52M720
$$ 123890 105579 49229 45754 70688 74827 76267 118851 145340 117085 102390 95625 96577 101297
8367A01297J8446p418n329k0636q170J720K4863J2261K0102l6993j3554l5361
$$ 101297 119743 112325 106996 86360 78190 79910 104773 117034 137136 100143 86589 51228
8355E1228K347M7936K9676j6685K8448K986j0885R19m707m004l4849J5183m3312
$$ 51228 53575 101511 131187 114502 142950 145936 135051 135970 131263 127259 92410 107593 64281
8342F4281n2714p489L7331M0531K4963k7000J6709l523k467o21N3876q707k6790
$$ 64281 11567 4078 41409 81940 106903 79903 96612 93089 90622 90001 143877 135170 108380
8329A08380M8709J3381n989J2996n9450k5350L310O335k686J497l7441j2362M2730
$$ 108380 157089 170470 164481 177477 118027 92677 95987 102322 99636 101133 63692 51330 94060
8316I4060M6835R524O051j4124l5637l5900l0013r511N5428L6082j1214k0361
$$ 94060 140895 150419 156470 142346 106709 70809 40796 31285 86713 122795 111581 91220
8304I1220J0379L6508M9969j8743j1219O2309O1239J00083L6716L1335J8613o6378
$$ 91220 101599 138107 188076 169333 158114 220423 281662 381745 418461 449796 468409 402031
8292D02031o9745o2520p5813r022k9159n8419P473J4649M047k3458J0890L2532
$$ 402031 332286 269766 193953 184931 155772 97353 104826 119475 123522 100064 110954 143486
8280A43486L7218j0131k1041j2402k7113k2985K430L1624J6399l136l6260l7257
$$ 143486 180704 170573 149532 137130 110017 87032 89462 121086 137485 134349 98089 60832
8268F0832K7886k5075j4283J523M7757n980K5474N1106J6838N7019l33K4577P3626
$$ 60832 88718 63643 49360 50883 98640 92660 118134 169240 186078 243097 242764 267341 340967
8255C40967K8638L6580J34907K24836J44975n092q9935j84335k00093r1064q0829
$$ 340967 369605 406185 541092 765928 910903 905811 815876 631541 431448 340384 259555
8244B59555m1045q541o590J2057l8950m3962J4104K9307M819J0825j4648k927
$$ 259555 218510 209969 203379 215436 176486 132524 146628 175935 180754 191579 176931 174004
8232A74004p192J4819Q539k2557M622m616N356K9997r760l6537n2580j2635J7573
$$ 174004 166812 181631 190170 167613 172235 167619 172975 202972 193212 156675 104095 91460 109033
8219A09033L8616J6243J2697m3649r009L8416k4048K5782P2937O3692J5231K7693
$$ 109033 147649 163892 176589 132940 123931 162347 138299 164081 237018 300710 315941 343634
8207C43634J07145L9825l9580p1772m5740l5012l7207p9536j1008K791m272J0298
$$ 343634 450779 490604 451024 379252 333512 298500 261293 181757 170749 173540 169268 179566
8195A79566o251l4146k8626o563n173J3097K3349l8620R102J136k0402M652j7786
$$ 179566 173315 139169 110543 103980 98807 111904 135253 96633 105735 106871 86469 91121 73335
8182G3335j4203j4573J7792L8110k9139J4203K7043l6873k7133k853N3166J1913
$$ 73335 59132 44559 62351 100461 71322 85525 112568 75695 48562 45709 98875 110788
8170A10788k4215l2047n2286o681M5559N7146K7829k6323P056j8041m3790K1439
$$ 110788 86573 54526 2240 -4441 41118 98264 126093 99770 106826 88785 44995 66434
8158F6434j7208P560J108k7434m2913J5849J5098K8332L8132J3852J976J1230
$$ 66434 49226 56786 57894 30460 -12453 3396 18494 46826 84958 98810 100786 112016
8146A12016Q988k9037m2065o129J8065N8976J3819j7935n5819o868L5793K3408
$$ 112016 121004 91967 49902 43773 61838 120814 134633 116698 60879 54011 89804 113212
8134A13212p941K3123q079j6398j8263j3423m087m7964K360l2333l2052J9749
$$ 113212 105271 128394 120315 103917 85654 72231 68144 20180 22540 -9793 -41845 -22096
8122b2096J2971M6117J2879k1739j5625p230M7033L7499J5174n665l8171k2182
$$ -22096 -9125 36992 49871 28132 12507 5277 52310 89809 104983 99318 61147 38965
8110C8965q72k1916j4802M6285N3538M265q424k7312M1660M822l5943j6644k2944
$$ 38965 38093 16177 1375 47660 101198 105463 97039 69727 111387 116209 80266 63622 40678
8097D0678k8980p046j1101L4562L8674j4517K6366J0145k6076l3850k7171k8057
$$ 40678 11698 4652 -6449 28113 66787 52270 78636 88781 62705 28855 1684 -26373
8085b6373K3512q43M080J3684j1224j316K1449j2294o761L6878N0508m0576j2953
$$ -26373 -2861 -3704 376 14060 2836 1520 22969 10675 3914 40792 91300 50724 37771
8072C7771K9509n665L443Q741J0584m0941l8535j2298L2503J672l8772k169N6769
$$ 37771 67280 61615 65058 73799 84383 43442 4907 -7391 25112 26784 -11988 -14157 42612
8059D2612M6265o1301m1504l9176j7533J9543K4695m211J8130K5141k3693q86
$$ 42612 88877 27576 -13928 -53104 -70637 -51094 -26399 -30610 -12480 12661 -11032 -11918
8047a1918M5858O477k877J3032L1674J7880m462j8334k7489k86r540K044R718
$$ -11918 33940 40417 37540 50572 82246 100126 95664 77330 49841 49555 40015 42059 51777
8034E1777R706k630n2744k7011M1858O945j0453L9776r982o508J79K7492j6656
$$ 51777 61483 58853 6109 -20902 20956 27901 17448 57224 47242 40734 40913 68405 51749
8021E1749m6193L260j3070L0097K0595j1367l1131P007R367K0431M2653L03p0427
$$ 51749 5556 8816 -4254 25843 46438 35071 3940 10947 20314 40745 83398 83701 13274
8008A3274l8717K6394L2182L0766L2091O344n3586p321m648j5707K0227N8202
$$ 13274 -25443 951 33133 63899 95990 102334 48748 41427 36779 21072 41299 99501
7996I9501Q81J1483Q942J836j247K6093O7207N0277l1472m1031k0197j5516n2794
$$ 99501 100382 111865 120807 122643 121396 147489 214696 264973 233501 192470 172273 156757 103963
7983A03963k2985m0165o283K7903K0016K1211L4261Q304r570k4581n214L0159
$$ 103963 80978 40813 34530 62433 82449 103660 137921 146225 136655 112074 106860 137019
7971A37019k1559o1910q959M973q451K4227R409k6947k0127J8261j7036K2076
$$ 137019 115460 53550 44591 49564 41113 65340 74749 47802 27675 45936 28900 50976
7959E0976M8020K454m4856K6527L3370K8240L9861K369j481K0508N1690L8167
$$ 50976 98996 101450 56594 83121 116491 144731 184592 186961 185480 205988 257678 295845
7947B95845o618J3937j0510k1355j2161k4349l6676n4716l0257k9335l8425j4392
$$ 295845 289227 303164 292654 271299 259138 234789 198113 143397 113140 83805 45380 30988
7935C0988Q0641O016k3501k5901K6573L9930n4038m6969l4588k9729n736J2694
$$ 30988 111629 117645 94144 68243 94816 134746 80708 33739 -849 -30578 -36314 -23620
7923b3620N7888K7536r285l3118k3007M6353J3830J1302J4899o174n3746M9916
$$ -23620 34268 61804 52519 19401 -3606 42747 56577 67879 82778 76604 22858 72774
7911G2774L3704l5370m8677m608J540N9638Q930j5153m733p132k701L6362J6928
$$ 72774 106478 71108 22431 17823 19363 79001 87931 72778 68045 60913 58212 94574 111502
7898A11502j3746K109k1488j1875J0180k250k7268m2148K2503L7892r252j8746
$$ 111502 97756 99865 78377 66502 76682 74432 47164 5016 27519 65411 56159 37413
7886C7413p8263J5364L4504K887k5486k1669J490J9699j4899J8345p613o453n175
$$ 37413 -40850 -25486 9018 11905 -13581 -35250 -33760 -14061 -28960 -10615 -18228 -24681 -29856
7873b9856p746J2956M5287K7315j8174J6638O102l4617j1070K924J0795J6564
$$ -29856 -37602 -24646 20641 47956 29782 46420 52522 17905 6835 9759 20554 37118
7861C7118L4801m697n1468J4067j4208j2613J0797q338J7121j4032m0179j8085
$$ 37118 71919 67222 15754 29821 15613 3000 13797 5459 22580 8548 -31631 -49716
7849d9716R771L6203l2091J0990K3300j841k5866M7674K5928q977j7198J3080
$$ -49716 -39945 -3742 -35833 -24843 -1543 -3384 -29250 18424 44352 35375 18177 31257
7837C1257j9033j000N3679k2144n5734Q285K9228L0643L35j6029j4481j302l3758
$$ 31257 12224 11224 64903 42759 -12975 -4690 24538 55181 55516 39487 25006 23704 -10054
7824a0054J2253K2067L734n037p8079j8414l127K1017L1414j0009k341j9786k0520
$$ -10054 2199 24266 28000 22963 -55116 -73530 -76657 -55640 -24226 -34235 -36576 -56362 -76882
7811g6882P1511K5364k9725r510j8361k9608N7286K0767p06j9429M118L6258L7179
$$ -76882 -5371 19993 -9732 -19242 -37603 -67211 -9925 10842 10136 -9293 -5175 31083 68262
7798F8262k0713l3480l424N19L702n3108k0023j7174L6961J5269M4778K4191n642
$$ 68262 47549 14069 10645 11164 14866 -38242 -58265 -75439 -38478 -23209 21569 45760 40118
7785D0118j3956o337P341r246l2193r507J051m1920k0217J7001k637M682M172
$$ 40118 26162 19825 27166 17920 -14273 -23780 -22729 -64649 -84866 -67865 -70502 -65820 -61648
7772f1648n6924K2414N0173K0821L5367J6416K3581R396l396J081J860q212j0909
$$ -61648 -118572 -96158 -45985 -25164 10203 26619 50200 59596 56200 57281 59141 50929 40020
7759D0020k5651m8917J2395J2485M406K2634j8011J0321k985m0334k283K6968
$$ 40020 14369 -34548 -22153 -9668 -5262 17372 -639 9682 6697 -33637 -35920 -8952
7747h952J0105N501j9112J8316L8255l0623l9004N789j3493K9263N5227J129l1617
$$ -8952 1153 6654 -12458 5858 44113 13490 -25514 -19725 -33218 -3955 51272 52401 20784
7734B0784J056O530K4557R964J7985K6723k9223m2774R872j6695l3010K1168q3
$$ 20784 21840 28370 52927 62891 80876 107599 78376 35602 45474 28779 -4231 16937 16854
7721A6854m2582k7208J3126J5158K3721P706J5350J0339J259O476k0709l9897
$$ 16854 -25728 -52936 -39810 -24652 -931 6775 22125 32464 33723 40199 19490 -20407
7709b0407j1345L9685l258j0457m733p159m0927K0820R29l5601j6775N8584J5274
$$ -20407 -31752 7933 4675 -5782 -10515 -17674 -58601 -37781 -36852 -72453 -89228 -30644 -15370
7696a5370l7222M468j6527j8677M6773m716J6707N7183J4257j5064k4864m1392
$$ -15370 -52592 -48124 -64651 -83328 -36555 -41271 -24564 32619 46876 31812 6948 -34444
7684c4444m682P801r237J7085M441J1666j2599L7756k1380k7934N099L6523k897
$$ -34444 -39126 -31325 -40562 -23477 -19036 -7370 -19969 17787 -3593 -31527 -26428 10095 7198
7671G198O533O73J0286J9611l6225J7206Q311Q794l1784j2976j3614o759j8973
$$ 7198 13731 14404 24690 44301 8076 25282 33593 42387 10603 -2373 -15987 -22746 -41719
7658d1719Q468j3318m977j1786R152p012L6379K0183p585k972P040K5739l0483
$$ -41719 -33251 -46569 -51546 -63332 -54180 -61192 -24813 -4630 -12215 -15187 -8147 17592 -12891
7645a2891K7294J4432k035p664N292J7749m4797K4587K4950k4306n3492j0075
$$ -12891 14403 28835 26800 19136 24428 42177 -2620 21967 46917 22611 -30881 -40956
7633d0956q259J2872K6151M0060Q100q097k4167r441J967n126J7991k6862p248
$$ -40956 -49215 -36343 -10192 29868 37968 29871 5704 -3737 -1770 -6896 11095 -15767 -23015
7620b3015M7771l9334l4164L4997l281n343K4994j564j0769Q604R84J1862K597
$$ -23015 24756 -14578 -48742 -13745 -17026 -22369 2625 1061 -9708 -1104 -120 11742 14339
7607A4339m2523j0406k1200l2006J1453K5601J9407P180r02J3175l6600J227K103
$$ 14339 -28184 -38590 -59790 -91796 -80343 -54742 -35335 -28155 -29057 -15882 -52482 -51255 -49152
7594d9152l663j38L6309K3197L7030k4114m7088J1583J9226l85M225J9959M953
$$ -49152 -52815 -52953 -16644 6553 43583 19469 -27619 -16036 3190 2805 7030 26989 31942
7581C1942j8217l7536k1274l548K4913M1240J9814n0233m7529K629L3732J3962
$$ 31942 13725 -23811 -45085 -48633 -23720 17520 37334 -12899 -60428 -57799 -24067 -10105
7569a0105j3195L4206J4910j6680n2656Q097K2418J3966k501K6531K5934o428
$$ -10105 -23300 10906 25816 9136 -43520 -35423 -13005 961 -1540 24991 50925 44497
7557D4497m5427l7720j2559M6354N0174l1716m9141k6971M846J1103R636l9012
$$ 44497 -930 -38650 -51209 -4855 45319 13603 -35538 -62509 -57663 -46560 -36924 -75936
7545g5936K2571J9187l5987q12J8424L8259r996l0166J8854j676L2477L2096o5685
$$ -75936 -53365 -34178 -70165 -70977 -52553 -14294 -24290 -54456 -35602 -37278 -4801 27295 -38390
7532c8390j8546n11L9626j4391n0926J0511j1919J9649L1882R899j7439k3986
$$ -38390 -56936 -57447 -17821 -32212 -83138 -72627 -84546 -64897 -33015 -23116 -40555 -64541
7520f4541J7556M0269N2374L8307l066j3319n6359r060l2624Q285K7577K3824
$$ -64541 -46985 -6716 45658 83965 80899 67580 11221 2161 -30463 -22178 5399 29223
7508B9223n338l0374M5382l064l8934k0711J8581l1751p546M713j1582K5409k2277
$$ 29223 23885 -6489 38893 35829 -3105 -23816 -5235 -36986 -44532 -39819 -51401 -25992 -48269
7495d8269l3359p815M4371L6415L4334J843l895J4716J6791l4999m9673l9384
$$ -48269 -81628 -89443 -45072 -8657 25677 27520 23625 38341 55132 20133 -29540 -68924
7483f8924K0743J3920j7148J0832K1669m543l2393P325K6992L3892L3388J6746
$$ -68924 -48181 -34261 -51409 -40577 -18908 -23451 -55844 -48519 -21527 12365 45753 62499
7471F2499J3408m4483l9691L6552K4179k641j6499k4541j1829N631J2378N4624
$$ 62499 75907 31424 -8267 28285 52464 49823 33324 8783 -3046 2585 14963 69587
7459F9587n2047m1321j8982K7000k182j9051K5034J6479k4679k2676L0433J6474
$$ 69587 17540 -23781 -42763 -15763 -17945 -36996 -11962 4517 -20162 -42838 -12405 4069
7447D069r949L3958m967k6692j634j9242P651K1375l693L704R485j2930l1934
$$ 4069 -5880 28078 23111 -3581 -5215 -24457 -16806 4569 876 4580 14065 1135 -30799
7434c0799k7275N4642j7548l6579L227k2330p153N7406M9341M567m9423k5153
$$ -30799 -58074 -3432 -20980 -57559 -54332 -76662 -83815 -26409 22932 27499 -21924 -47077
7422d7077K8924K6168K1475j819j2526p245M3581J3889l1757K3590l5447m3715
$$ -47077 -18153 8015 29490 27671 15145 7900 51481 65370 33613 57203 21756 -21959
7410b1959j802L0439j5020J9296K1224j0887J636J685k7754k3000j4169J7863
$$ -21959 -23761 6678 -8342 10954 32178 21291 22927 24612 -3142 -26142 -40311 -22448
7398b2448J2570l029l365J7155K0370k2913k3031J6640M623R134J900q499P248
$$ -22448 -9878 -12907 -16272 883 21253 -1660 -24691 -8051 -3428 5706 7606 -893 6355
7385F355J2532L834M310l063k0976j4657J21j9868l0358p513M2250M7354k3571
$$ 6355 18887 22721 27031 23968 2992 -11665 -11544 -31412 -61770 -69283 -27033 20321 -3250
7372c250j3453l1054K5516K0796k0316r557j2104Q236J0107J2881j498k7983J7581
$$ -3250 -16703 -47757 -22241 -1445 -21761 -31318 -43422 -35186 -25079 -12198 -13696 -41679 -24098
7359b4098K2646J5220J878k1479k342q982K7099j0919l8470m0995k9895N1164
$$ -24098 -1452 13768 15646 -5833 -8175 -17157 9942 -977 -39447 -80442 -110337 -59173
7347e9173N2604M1640M2934j6648j0078L199n6892Q987J5288j5268k4947l8342
$$ -59173 -6569 35071 78005 61357 51279 54478 -2414 6573 21861 6593 -18354 -56696
7335e6696k7823k0234L23n688J1398P023M2083M2647l1800k8159L8334J3667O725
$$ -56696 -84519 -104753 -104430 -110118 -98720 -91697 -49614 -6967 -38767 -66926 -28592 -14925 -8200
7322h200J0824K5179N3266j7886l9994j0751l2303j4075J6467l0408m928K0768
$$ -8200 2624 27803 81069 63183 23189 12438 -19865 -33940 -17473 -47881 -52809 -32041
7310c2041M4675j6485m9699O093j19N608j1804K7059k7229k8531L14K0853L6664
$$ -32041 12634 -3851 -53550 -47457 -47576 -41968 -53772 -26713 -53942 -82473 -82159 -61306 -24642
7297b4642l8135k4383K1481L1421J549o780m3828J0091J433K3375J0874m4972
$$ -24642 -62777 -87160 -65679 -34258 -32709 -39489 -83317 -73226 -71793 -48418 -37544 -82516
7285h2516K2956L0610L7587q228j998J3007j1641l8768K1516J1476m092L6296
$$ -82516 -59560 -28950 8637 409 -1589 11418 -223 -38991 -17475 -5999 -10091 26205
7273B6205J5994l3192J1593k252N769j202l7042k1662j1009O011j8810o557M6145
$$ 26205 42199 9007 20600 18348 24117 22915 -14127 -35789 -46798 -40787 -59597 -66154 -20009
7260b0009M6929K6763p5148K659O435j8625J61q984j1882Q467K2927J3106L140
$$ -20009 26920 53683 -21465 -18806 -12371 -30996 -30835 -39819 -51701 -43234 -20307 -7201 -4061
7247d061K8029J2187r105K5031J5921j5977k709l1079K2797p111m6844J0033L4970
$$ -4061 23968 36155 27050 52081 68002 52025 49316 18237 41034 33923 -12921 -2888 32082
7234C2082L6053o841m5189r282k4652J0806O010L1113K5275m795o2426j1914J393
$$ 32082 68135 61294 16105 6823 -17829 -7023 -1013 30100 55375 50580 -11846 -23760 -22367
7221b2367L3154O547K0608o382P084k1349p878K0229K431L7730m049j0780k3985
$$ -22367 10787 17334 37942 31560 38644 17295 9417 29646 32077 69807 65758 54978 30993
7208C0993l5565P315o64m8774j7295J1036j3821j5461N6626K600J5499M147P486
$$ 30993 -4572 2743 2079 -46695 -63990 -52954 -66775 -82236 -25610 -23010 -7511 -3364 4122
7195D122o832j5990N285o603k0503l0062J9445J1645O1973P2685J9993k5761l9141
$$ 4122 -2710 -18700 -13415 -20018 -40521 -70583 -51138 -39493 22480 95165 115158 89397 50256
7182E0256r179J554l317J0834J9266n468j4925o6657p6862J2730L7653L5878j0220
$$ 50256 41077 42631 39314 50148 69414 63946 49021 -17636 -94498 -81768 -44115 -8237 -18457
7169a8457J4312L3927J2352j3619l0544k5936l037M528j9466j0106J1315J7651
$$ -18457 -4145 29782 42134 28515 -2029 -27965 -31002 -26474 -45940 -56046 -44731 -27080
7157b7080M6154K8253q597p79j768k4283k6001k5143J1715M448q123k3034J5643
$$ -27080 19074 47327 38730 37951 36183 11900 -14101 -39244 -27529 -23081 -31204 -54238 -38595
7144c8595l2536m309N7218M2753j8229j7636M111K6817K9710J3400k7833k5366
$$ -38595 -71131 -75440 -18222 24531 6302 -11334 -7223 19594 49304 62704 34871 9505
7132I505L591P869J148k382L7668k2448k9047L2146m0260o2333J8144R3029M5994
$$ 9505 13096 20965 22113 19731 57399 34951 5904 38050 -2210 -64543 -46399 46630 92624
7119I2624l8438j3579k325l3771k1677J4397j6835o23m6579J5901L3679j4112
$$ 92624 54186 40607 38282 4511 -17166 -2769 -19604 -20227 -66806 -50905 -17226 -31338
7107c1338R702K7779j5522m4455J250M0741J3993M212P444L9622K3496m9049o6724
$$ -31338 -21636 6143 -9379 -53834 -52584 -11843 2150 6362 13806 53428 76924 27875 -38849
7094c8849N487K0970K1574N38J17l8371k9696k8666M5142M8264J5084m409j1536
$$ -38849 -33362 -12392 9182 9720 9837 -28534 -58230 -86896 -41754 6510 21594 17185 5649
7081E649l457m6680k1069P1732M1561n2015n7874l432O5204M0334J6068L225m9410
$$ 5649 2192 -44488 -65557 6175 47736 -4279 -62153 -65585 -381 39953 56021 59246 9836
7068I836J4364m1910m3577N197K7036L0044k283k7540j4709K7984J3773n132l5075
$$ 9836 24200 -17710 -61287 -56090 -29054 990 -1293 -28833 -43542 -15558 -1785 -6917 -41992
7055d1992j4778J0940L4788R417N980K8728j26l6857j1494l0978r466K4705l1205
$$ -41992 -56770 -45830 -11042 -1625 4355 33083 32957 -3900 -15394 -46372 -55838 -31133 -62338
7042f2338L838m14K1973J7988j8589R390J8172l8288l434L1173k953K7577J2873
$$ -62338 -58500 -58914 -36941 -18953 -37542 -28152 -9980 -48268 -51702 -20529 -23482 4095 16968
7029A6968K062j1880n9526p497L9032K3965j5610j086K2645M1907K0271j0891
$$ 16968 19030 7150 -52376 -59873 -20841 3124 -12486 -13572 9073 50980 71251 60360
7017F0360o0511k4745L5755K2833o591k4238J4761k2741k7534j9968L5400N7180
$$ 60360 -151 -24896 10859 33692 27101 2863 17624 -5117 -32651 -52619 -17219 39961
7005C9961M4464j4138k9824m8062k3041J3414n932n81K3639M1684L3767m2183
$$ 39961 84425 70287 40463 -7599 -30640 -17226 -23158 -23739 -100 41584 75351 33168
6993C3168k2468J1731K7286k4870k2842m4766L6742L3211o713k1279R872k1379
$$ 33168 10700 22431 49717 24847 2005 -42761 -6019 27192 20479 -800 9072 -12307
6981a2307L1282J7786m0445k7108K578L7942R942j4704k1442m0910J5650N385
$$ -12307 18975 36761 -3684 -30792 -28214 9728 19670 4966 -16476 -57386 -41736 -36351
6969c6351j292k8907m3840L2631N1876l053m013J6349k3252j9545P842O027k8681
$$ -36351 -37643 -66550 -110390 -77759 -25883 -28936 -32949 -16600 -39852 -59397 -51555 -45528 -74209
6956g4209J4794N7171K4845J9734l3485P122J2713j6995k1048l2624j6069n727
$$ -74209 -59415 -2244 22601 42335 8850 15972 28685 11690 -9358 -41982 -58051 -63778
6944f3778l4342J7339r155j7396J843J4038K2561o959K7263l311r420l6943K5672
$$ -63778 -98120 -80781 -89936 -107332 -105489 -91451 -68890 -75849 -48586 -51897 -61317 -98260 -72588
6931g2588N3128L3437K1919J240n567l3049m1499O917j965K9482K952o263j5410
$$ -72588 -19460 13977 35896 37136 31569 -1480 -42979 -36062 -38027 -8545 -5593 -11856 -27266
6918b7266p002L6104k2072m8845R271p598j7251L6791K5760L3051J3043K0151
$$ -27266 -34268 1836 -20236 -69081 -59810 -67408 -84659 -47868 -22108 10943 23986 44137
6906D4137j5053N815J1561l7822n1385j8439L9994J3855j6370J3202M8554P919
$$ 44137 29084 34899 46460 8638 -42747 -61186 -21192 -7337 -23707 -10505 38049 45968
6894D5968m1995k1160K1700J8355l7758k2799k6559j9655K7148J8347n581J8828
$$ 45968 3973 -17187 4513 22868 -14890 -37689 -64248 -83903 -56755 -38408 -43989 -25161
6882b5161K0500m117L1445J2570J739k7251m408m602r150k3326o89K9967J5904
$$ -25161 -4661 -8778 22667 35237 36976 9725 5317 715 -8435 -31761 -32450 -2483 13421
6869A3421j1707K439K1247L2854J1918j3064K2041j1545k2451k4046k5453m662
$$ 13421 1714 4153 25400 58254 70172 57108 79149 67604 45153 21107 -4346 -9008
6857i008j4557K840k0632J1701N9725J2472l0167l4229L686P371j6307j6835J2841
$$ -9008 -23565 -20725 -41357 -29656 30069 42541 12374 -21855 -18169 -10798 -27105 -43940 -31099
6844c1099m523l8293Q343O312J3191J3861L6210m200k0936j4304j4634K0602j0912
$$ -31099 -35622 -73915 -65572 -59260 -46069 -32208 4002 -198 -21134 -35438 -50072 -29470 -40382
6831d0382k3267O880K9255O420J994Q456k6482k3209P594R428N2497N672m4303
$$ -40382 -63649 -56769 -27514 -21094 -19100 -10644 -37126 -60335 -52741 -43313 9184 14856 -29447
6818b9447l916k5496J1749J0383K1620Q766k9846L594M1030j3121k8283O319P564
$$ -29447 -33363 -58859 -47110 -36727 -15107 -6341 -36187 -32593 8437 -4684 -32967 -26648 -19084
6805a9084L2569l2106L5992K9506o0622m8504K947O5638j1334O731k3378k8681
$$ -19084 13485 -18621 17371 46877 -13745 -62249 -59302 6336 -4998 1733 -21645 -50326
6793e0326j728N18o183j4431P364K4756q651r176J3754K1861M21j3852m3452j3586
$$ -50326 -52054 -51536 -57719 -72150 -64786 -40030 -48681 -57857 -44103 -22242 -21821 -35673 -79125 -92711
6779i2711q600J2946L1304M7941R125m1791p6064J2373q376M7787P3034N7496
$$ -92711 -101311 -88365 -57061 -9120 5 -41786 -117850 -105477 -113853 -66066 6968 64464
6767F4464n927k304k0922j5923l9434M1933M4824k8459q385m0678k9188K7557
$$ 64464 58537 56233 35311 19388 -20046 21887 66711 38252 29867 -10811 -39999 -12442
6755a2442J1248K7000J2099o2179j0571M0268l224k1872m8550J1288j778j5006
$$ -12442 -1194 25806 37905 -24274 -34845 5423 2199 -19673 -68223 -56935 -58713 -73719
6743g3719L142J2902J6553P952J3118N61k0591J6254k5453Q005L0372J7768P289
$$ -73719 -70577 -57675 -41122 -33170 -20052 -19491 -40082 -23828 -49281 -41276 -10904 6864 14153
6730A4153K3388J5509J3895J7776m0877l5411j8096l041L007M937n12K4185L4233
$$ 14153 37541 53050 66945 84721 43844 8433 -9663 -12704 -9697 -4760 -5272 18913 53146
6717E3146K524n6713o0743k4362L1212j8098K3803J2080k9534M843k2763k0833
$$ 53146 55670 -1043 -61786 -86148 -54936 -73034 -49231 -37151 -66685 -61842 -84605 -105438
6705a05438J2534K9668O0648l733k1986j1927m1206j0109O0240L5858n917n039
$$ -105438 -92904 -63236 -2588 -6321 -28307 -40234 -81440 -91549 -31309 4549 -1368 -6407
6693f407m9619L68k157J6996M5818J4538j0235j2996k6713n721J4709L5748m0561
$$ -6407 -56026 -55658 -57815 -40819 4999 19537 9302 -3694 -30407 -36128 -21419 14329 -26232
6680b6232l3723l9113R012J0836K5655l317k9866m450J2779K2945p947J0258R377
$$ -26232 -59955 -99068 -90056 -79220 -53565 -56882 -86748 -91198 -78419 -55474 -63421 -53163 -43786
6667d3786L370j8785k5111k776j315L3255K3269P606P310R533l1929m1598L588
$$ -43786 -40416 -59201 -84312 -87088 -88403 -55148 -31879 -24273 -16963 -7430 -39359 -80957 -77369
6654g7369L3769M0243M2877k9881k1975J8637K5190m2645n0301m71L7374J1538
$$ -77369 -43600 -3357 39520 9639 -12336 6301 31491 -11154 -61455 -61926 -24552 -13014
6642a3014L433K0353k3698j6637L0121O287k2724m1089K3087L1412J1367j5031
$$ -13014 -9581 10772 -12926 -29563 558 6845 -15879 -56968 -33881 -2469 8898 -6133
6630f133l6998J2200J7851k2591m753k9285j1072M8537K9909J1400L2937k1091
$$ -6133 -43131 -30931 -13080 -35671 -40424 -69709 -80781 -32244 -2335 9065 42002 20911
6618B0911k2537J9665J9471j2678j3705j3300k2656L3565J1659n3185j1888K7760
$$ 20911 -1626 18039 37510 24832 11127 -2173 -24829 8736 20395 -32790 -44678 -16918
6606a6918j45p37k8536l4875L8108k192l8052j0544K798Q155Q068Q088K1452J2447
$$ -16918 -17063 -17800 -46336 -81211 -43103 -45295 -83347 -93891 -91093 -82938 -74870 -66782 -45330 -32883
6592c2883K5338J9710K0118o4584J522O0731K8553m2024l0293j4260M1177K1052
$$ -32883 -7545 12165 32283 -32301 -30779 29952 58505 16481 -13812 -28072 13105 34157
6580C4157r177J4015j5492m3184k4181J937k055L1370m8004l530K9605L9737J4479
$$ 34157 24980 38995 23503 -19681 -43862 -41925 -43980 -12610 -60614 -64144 -34539 5198 19677
6567A9677J2989l2187k1762k3275O217K9389J774j1224N169k260q171J5697l9039
$$ 19677 32666 479 -21283 -44558 -38341 -8952 -7178 -18402 -13233 -15493 -23664 -7967 -47006
6554d7006k0638Q056K3987K1286J3272n7103J6572J8565R355n1473j6315L9729
$$ -47006 -67644 -59588 -35601 -14315 -1043 -58146 -41574 -23009 -13654 -65127 -81442 -41713
6542d1713l795L0437K6066m2488m7927L7523O6616P567k2953j6437m1240J9143
$$ -41713 -45508 -15071 10995 -31493 -79420 -41897 24719 32286 9333 -7104 -48344 -29201
6530b9201K3703k5740k4010N3576L4418o6733m5990L0923n334M669J9829k501
$$ -29201 -5498 -31238 -55248 -1672 32746 -33987 -79977 -49054 -54388 -49719 -29890 -32391
6518c2391m9157k0966O3979P0846J2625k0570p74r594j7282J080J2646j0848N104
$$ -32391 -81548 -102514 -38535 32311 44936 24366 23592 13998 -3284 -2204 10442 -406 4698
6505D698J933j8735O813L11j8066L879J9221m468L358m856j4906M0878J5972m0473
$$ 4698 6631 -12104 -5291 -4980 -23046 -19167 54 -4414 -1056 -5912 -20818 20060 36032 -4441
6491d441M493n6655k5196k7556N993J9766K4554K3103J9587r896j3157K40J6799
$$ -4441 52 -56603 -81799 -109355 -103362 -83596 -59042 -35939 -16352 -26248 -39405 -39165 -22366
6478b2366L5941l7727l9612j1392L2641J5449j0424M8845P5598J7568l8923n8671
$$ -22366 13575 -24152 -63764 -75156 -42515 -27066 -37490 11355 86953 104521 65598 6927
6466F927k7017J3713J1225J4942K9352l3164k8862K8220J7262J6690J9406j1577
$$ 6927 -20090 -6377 4848 19790 49142 15978 -12884 15336 32598 49288 68694 57117
6454E7117l7192m6604n5333P334M8737K4535k3943J8827M5524L981l4161p633
$$ 57117 19925 -26679 -82012 -74678 -25941 -1406 -25349 -6522 39002 42983 8822 1189
6442A189K387J6992k4650L942j1901K2231K6083n990k1768O928N953j5818K1154
$$ 1189 3576 20568 -4082 -140 -12041 10190 36273 30283 8515 15443 21396 5578 26732
6429B6732J6147n802p534k411K845j7290r756n689L8068R433m2354O462J8976
$$ 26732 42879 37077 29543 27132 29977 12687 2931 -2758 35310 44743 2389 8851 27827
6416B7827L711J9950k4644j7769o518l6419j0725K3920K6129m831k4875k6901
$$ 27827 31538 51488 26844 9075 2557 -33862 -44587 -20667 5462 631 -24244 -51145
6404e1145j1941K4357l9512k0567L8586L9439J7530k7528J3650J7912J2179O786
$$ -51145 -63086 -38729 -78241 -98808 -60222 -20783 -3253 -30781 -17131 781 12960 19746
6392A9746l3203r42K4541J0396j7208j4494l307k1874j5744p109k4737J2989N282
$$ 19746 -13457 -14399 10142 20538 3330 -11164 -14471 -36345 -52089 -59198 -83935 -70946 -65664
6379f5664K2109n041K3030L9784k497J5615J927j9633j4553L560J4696k7502N315
$$ -65664 -43555 -48596 -25566 14218 11721 27336 29263 9630 -4923 -1363 13333 -14169 -8854
6366h854K7988m5221j9780N175q251R264k606K4435k1225l1665j4123j7973l362
$$ -8854 19134 -26087 -45867 -40692 -48943 -39679 -42285 -17850 -39075 -70740 -84863 -102836 -106198
6353a06198K5450O8400j7542p233J2934j1174k1465M6669j9095j4973J1388J2918
$$ -106198 -80748 -12348 -29890 -37123 -24189 -35363 -56828 -10159 -29254 -44227 -32839 -19921
6341a9921K3413L216m1793o1193L4090Q6977L229l9570K4584k5871l1403J0682
$$ -19921 3492 6708 -35085 -96278 -62188 24789 28018 -11552 13032 -12839 -44242 -33560
6329c3560L8176q893J2616R907j4193k6841K2674j0245j2658l6679j1345J8532
$$ -33560 4616 -4277 8339 18246 4053 -22788 -114 -10359 -23017 -59696 -71041 -52509
6317e2509M345j5082l006M3927O625j7175j9375J1980O309J8943J9295l0019m6599
$$ -52509 -48164 -63246 -66252 -22325 -15700 -32875 -52250 -40270 -33961 -15018 4277 -25742 -72341
6304g2341n283J2818N2810N7621j0600m475k9066l4580j8671K0451M5736Q992
$$ -72341 -77624 -64806 -11996 45625 35025 30550 1484 -33096 -51767 -31316 14420 23412
6292B3412r634q957L4399l583q637l5118j8879j6701N569L0252p081k2097n7764
$$ 23412 13778 4821 39220 35637 27000 -8118 -26997 -43698 -38129 -7877 -14958 -37055 -94819
6279i4819K2979N8843L2204j3155k748k936l2029M471J2894J5933R627L212m0277
$$ -94819 -71840 -12997 19207 6052 3304 368 -31661 -27190 -14296 1637 11264 14476 -25801
6266b5801n0059Q757M7415K4417Q461l7530J4339K0307m2817l599M3610P403m8995
$$ -25801 -75860 -67103 -19688 4729 13190 -24340 -10001 10306 -32511 -36110 7500 14903 -34092
6253c4092j8267L4376q473J1683P5586J9656o0081l8315R406r294k0545L613p416
$$ -34092 -52359 -17983 -26456 -14773 60813 80469 20388 -17927 -8521 -17815 -38360 -34747 -42163
6240d2163k1626j0199L6226J192j811n270K9122K8372l3595m463j5981j1365M1317
$$ -42163 -63789 -73988 -37762 -36570 -38381 -43651 -14529 13843 -19752 -24215 -40196 -51561 -10244
6227a0244M0781M8900k5153k7410j1763l3611q870O528K6094J4604k9017l7340
$$ -10244 30537 79437 54284 26874 15111 -18500 -27370 -20842 5252 19856 -9161 -46501
6215d6501O24O036j5785m579J9787L6212j0652m8564P909J9160K3036j08j552
$$ -46501 -45877 -39841 -55626 -60205 -40418 -4206 -14858 -63422 -55513 -36353 -13317 -13425 -14977
6202a4977j1649l1543j7491k2597j1597M5857O353o26J7644K6662J6162k3536
$$ -14977 -26626 -58169 -75660 -98257 -109854 -63997 -57644 -58270 -40626 -13964 2198 -21338
6190b1338Q118l1212p955M2089L9984J8810l4348j6606j5866J7445J9006l2682
$$ -21338 -13220 -44432 -52387 -10298 29686 48496 14148 -2458 -18324 -879 18127 -14555
6178a4555m6391J7047K1560j9030j8255J1858J7632K3385J4692k4486K8407J2158
$$ -14555 -60946 -43899 -22339 -41369 -59624 -47766 -30134 -6749 7943 -16543 11864 24022
6166B4022m122K6870j7707j5691K871l0528l5475k6680m236L9849L735O181J8819
$$ 24022 19900 46770 29063 13372 16243 -14285 -49760 -76440 -80676 -40827 -37092 -30911 -12092
6153a2092l4772L717N831j0770J3794M0064J4751m3146J0726J499o855K5247J0319
$$ -12092 -46864 -43147 -37316 -48086 -34292 5772 20523 -22623 -11897 -10398 -17253 7994 18313
6140A8313L22k0655O30L4885J4475l0265j5879L3859M485p072m8952k9190l9357
$$ 18313 18635 -2020 -1390 33495 47970 17705 1826 35685 40170 33098 -15854 -45044 -84401
6127h4401l9803K5941L1189k3391J828J4124Q356L0048L3787j8508k4086L7914
$$ -84401 -124204 -98263 -67074 -90465 -88637 -74513 -66157 -36109 -2322 -20830 -44916 -7002
6115g002q164m3220j1460k1219J6746K5500K2007K150J9370m220l9621m179l4934
$$ -7002 -15166 -58386 -69846 -91065 -74319 -48819 -26812 -24662 -5292 -9512 -49133 -53312 -88246
6102h8246q968L4463M1412J8283J4553K8681J8797p4570n0409J8093L2062M305
$$ -88246 -97214 -62751 -21339 -3056 11497 40178 58975 -15595 -66004 -47911 -15849 -11544
6090a1544k5309J8670J4996J2120k0677n498j3290j2653J4906J0296L372J8810
$$ -11544 -36853 -18183 -3187 8933 -11744 -17242 -30532 -43185 -28279 -17983 -14611 4199
6078D199J2166j0374n9874K1017J1849l241j5958R512Q925n94N211l3484k1466
$$ 4199 16365 5991 -53883 -32866 -21017 -24258 -40216 -30704 -21779 -22373 -17162 -50646 -72112
6065g2112J8175J3310j8739L376n033j084K9660J8669j3139l1259j1771L6255
$$ -72112 -53937 -40627 -59366 -55990 -61023 -62107 -32447 -13778 -26917 -58176 -69947 -33692
6053c3692J1914R065k2537L5247K4095j0518j8069n1432j4143J5724J3959l1133
$$ -33692 -21778 -12713 -35250 -3 24092 13574 -4495 -55927 -70070 -54346 -40387 -71520
6041g1520N96L2647K1222l0683J0401N126QJ140N837P7029M0948n253m7351l2459
$$ -71520 -70924 -38277 -17055 -47738 -37337 -32211 -32203 -31063 -25226 51803 92751 87498 40147 7688
6027G688n5841j4197L8398j4442l2538n226L1902O509q277P038J4592N3899O597
$$ 7688 -48153 -62350 -23952 -38394 -70932 -76158 -44256 -37747 -46024 -38986 -24394 29505 36102
6014C6102l1585k3278L0068K5656j5327l0712l4593N0721L8111J1380R168m698
$$ 36102 4517 -18761 11307 36963 21636 -9076 -43669 7052 45163 56543 65711 61013
6002F1013m0073l8396k3196j1463L7205L002k4682j600K7444M435K2160m8109
$$ 61013 20940 -17456 -40652 -52115 -14910 -11908 -36590 -38190 -10746 -6311 15849 -32260
5990c2260o5617j7231M4545N6684J0841K0748K4743j2022Q233p147j6809k1396
$$ -32260 -97877 -115108 -70563 -13879 -3038 17710 42453 30431 38664 31517 14708 -6688
5978f688m0741N982L7105L8506l5597k2010M1022N883j7775o1578L6132O0290
$$ -6688 -47429 -41447 -4342 34164 -1433 -23443 17579 23462 5687 -55891 -19759 40531
5966D0531n344k951k400j3598L0598J8384L536j1053l5674l2555l1545k061L663
$$ 40531 35187 32236 29836 16238 46836 65220 68756 57703 22029 -10526 -42071 -44132 -40469
5953d0469l7057j0820K1522K6105J9620q155n0742n266J2986n676K4643J6536
$$ -40469 -77526 -88346 -66824 -40719 -21099 -29254 -79996 -85262 -72276 -77952 -53309 -36773
5941c6773J3888j4519m543J7123K5399J7366j8472l992k3781k8277k3884L4561
$$ -36773 -22885 -37404 -41947 -24824 575 17941 -531 -4523 -28304 -56581 -80465 -45904
5929d5904L4326q4m468k601M7690Q831k0202k4996j6394Q552M4754M061j6140
$$ -45904 -11578 -11662 -16130 -18731 28959 37790 17588 -7408 -23802 -15250 29504 33565 17425
5916A7425q571j7315P522R593m643J9581l2250N004J9653n7378K361p759J9828
$$ 17425 8854 -8461 -939 8654 4011 23592 -8658 -3654 15999 -41379 -39018 -46777 -26949
5903b6949j9941O116P5919L7988J0452l2945n3162l4446j92M207Q48J9158J7645
$$ -26949 -46890 -40774 35145 73133 83585 50640 -2522 -36968 -37160 -32953 -32105 -12947 4698
5890D698j2792j6237j4187J3980K007j7074k5609L0756K7546k393n3098K951j5631
$$ 4698 -8094 -24331 -38518 -24538 -22531 -39605 -65214 -34458 -6912 -9305 -62403 -59452 -75083
5877g5083m9040M0743O1087N4908l5207K204n734m135l740k0509l8149P264K509
$$ -75083 -124123 -83380 -22293 32615 -2592 -388 -6122 -10257 -13997 -34506 -72655 -65391 -62882
5864f2882P1565K9648m2076k5541j0762J1716J5657j391K062k6416l7524j7135
$$ -62882 8683 38331 -3745 -29286 -40048 -28332 -12675 -14066 -12004 -38420 -75944 -93079
5852i3079j0906P5039M1671J0281k3579r092lL096j1648j3519K1521J3681n4921
$$ -93079 -103985 -28946 12725 23006 -573 -9665 -9668 -6572 -18220 -31739 -10218 3463 -51458
5839e1458j1995M6531L1288j5369J5101o819j989k1190J0221K8779l523J3178
$$ -51458 -63453 -16922 14366 -1003 14098 7279 5290 -15900 -5679 23100 19577 32755
5827C2755K6271m724l54j6612n3368m8477M1758L8914l5578m4608L6302J8972
$$ 32755 59026 54302 53948 37336 -16032 -64509 -22751 16163 -19415 -64023 -27721 -8749
5815h749L843j6015kj4701L4891R175j1058j5240k3594o086m644M4908J7148Q922
$$ -8749 -4906 -20921 -20923 -35624 -733 8442 -2616 -17856 -41450 -47536 -52180 -7272 9876 18798
5801A8798j9293P99k0468k750J4085J1530j4986j6494j568j265J5647j152j5572
$$ 18798 -495 304 -20164 -22914 -8829 2701 -12285 -28779 -30347 -31612 -15965 -17117 -32689
5788c2689n047j5146p043M1052J1124l8715j3770J1494j8783K1890K0074o848
$$ -32689 -37736 -52882 -59925 -18873 -7749 -46464 -60234 -48740 -67523 -45633 -25559 -32407
5776c2407J9319J7978m4205l4066j0349l7808k9322L8033L1670K8621J3167j4501
$$ -32407 -13088 4890 -39315 -73381 -83730 -121538 -150860 -112827 -81157 -52536 -39369 -53870
5764e3870l045J9469L4777J717m0792j8080O749J4488J0323k6411J381J3472j3372
$$ -53870 -56915 -37446 -2669 -952 -41744 -59824 -53075 -38587 -28264 -54675 -53294 -39822 -53194
5751e3194q315P316L7787k2297M77J2897K8578j8243K4755j396k5556m9859l9703
$$ -53194 -61509 -54193 -16406 -38703 -38226 -25329 3249 -14994 9761 8365 -17191 -67050 -106753
5738a06753q925J5303K4298K171M3255K7437l157n80P438M5433k9482o5789j6335
$$ -106753 -115678 -100375 -76077 -73906 -30651 -3214 -6371 -6951 487 45920 16438 -49351 -65686
5725f5686k3269l854K3277L5316K6413N0628L2526n3029n0417O5533J9061n0046
$$ -65686 -88955 -92809 -69532 -34216 -7803 42825 75351 22322 -28095 37438 56499 6453
5713F453L471J2067m1921p428K7294M3874j7717n939k5782k9769j3546J7212K3673
$$ 6453 9924 21991 -19930 -27358 -64 43810 26093 20154 -5628 -35397 -48943 -31731 -8058
5700h058M266n024K309m4409o076k0792k663J4353L236o475L0731M6049R306K8032
$$ -8058 -3792 -8816 -6507 -50916 -56992 -77784 -80447 -66094 -62858 -69333 -38602 7447 16753 44785
5686D4785K845n7557k1379J2095J4049l2416k4481k8878K0169Q556j5767k1496
$$ 44785 47630 -9927 -31306 -19211 -5162 -37578 -62059 -90937 -70768 -62212 -77979 -99475
5674i9475J7104L2257l273k133k568K5711O8800J3981K0725j8332l8007J1331
$$ -99475 -82371 -50114 -53387 -55520 -58088 -32377 36423 50404 71129 52797 14790 26121
5662B6121j7622l7450n6541m1526k7549L2590P5076Q4067k056m434j1819m8983
$$ 26121 8499 -28951 -85492 -127018 -154567 -121977 -46901 37166 35110 30676 18857 -30126
5650c0126m0706j5015J3659J5298L070J0779p519J175o46j9561k407j6335M2834
$$ -30126 -70832 -85847 -72188 -56890 -53820 -43041 -50560 -49385 -50031 -69592 -71999 -88334 -45500
5637d5500M1132L9310L961J3459j4601j9196k8503p073M554J9917K0685K1659
$$ -45500 -4368 34942 38903 52362 37761 18565 -9938 -17011 -12457 7460 28145 49804
5625D9804K2889m6463n8774K5076j0759J3L6850l6060o277j1020q770M4536O966
$$ 49804 72693 26230 -32544 -7468 -18227 -18214 18636 -17424 -23701 -34721 -43491 1045 8011
5612H011j2832j1391M768m184M393J7496j7104J379n392N318n1j0849m9144K3908
$$ 8011 -4821 -16212 -11444 -15628 -11235 6261 -10843 -9464 -14856 -9538 -9589 -20438 -69582 -45674
5598d5674M0043j9599J4635N015k5486M0746m0662j2594l2752k4363J5740L0323
$$ -45674 -5631 -25230 -10595 -5580 -31066 9680 -30982 -43576 -76328 -100691 -84951 -54628
5586e4628O167J414K3605K0236J5321k0944m5378j8504o562L472P234L3859k2522
$$ -54628 -48461 -47047 -23442 -3206 12115 -8829 -54207 -72711 -79273 -75801 -68567 -34708 -57230
5573e7230j6366J3385K4748K6300o186n7947K0728J1742j1382L0827K6369P500
$$ -57230 -73596 -60211 -35463 -9163 -15349 -73296 -52568 -40826 -52208 -21381 4988 12488
5561A2488m2477j995q291l577o200J1568J2327p519q496L0132M2890l56m334k4729
$$ 12488 -29989 -31984 -40275 -43852 -50052 -38484 -26157 -33676 -42172 -12040 30850 30494 26160 1431
5547A431j9210o172l869O383j795j233k4147K762J3190l7244L0636K3509J6238
$$ 1431 -17779 -23951 -27820 -21437 -23232 -24465 -48612 -45850 -32660 -69904 -39268 -15759 479
5534D79O847J756m3182k5219J4939L9979K6725n4847k5423j1787k0384J2298m561
$$ 479 7326 9082 -34100 -59319 -44380 -4401 22324 -32523 -57946 -69733 -90117 -77819 -82380
5521h2380K9043M7087J1520o63j6716m4084k7436J1955J0226J3530m1554k0267
$$ -82380 -53337 -6250 5270 4607 -12109 -56193 -83629 -71674 -61448 -47918 -89472 -109739
5509a09739L1965J5562j5146R25K0818M342N121j2162o424N261J1534K0370l488
$$ -109739 -77774 -62212 -77358 -76433 -55615 -51273 -46152 -58314 -64738 -59477 -47943 -27573 -31061
5496c1061j8075K2900L1672K6777m1237k3670J4921m3522J0691O098K364n077
$$ -31061 -49136 -26236 5436 32213 -9024 -32694 -17773 -61295 -50604 -44506 -42142 -47219
5484d7219Q518m0219j0N375l000l38J5158K2610k1083K3820N3843L8659k3667
$$ -47219 -38701 -78920 -78930 -73555 -76555 -76893 -61735 -39125 -60208 -36388 17455 56114 32447
5471C2447k9538k8106M1212K4607l752n526O296k6783L909K0362r936K1674J4100
$$ 32447 2909 -25197 16015 40622 36870 31344 37640 10857 14766 35128 25192 46866 60966
5458F0966j6639L65k8978l5118J7622M346K699R659O221m3238L511L8628j6594
$$ 60966 44327 44692 15714 -19404 -1782 2564 5263 14922 21143 -22095 -18584 20044 3450
5445C450m4967k863R810q314O278K9964J9341j6741o49k7987l341J5756k3756
$$ 3450 -41517 -44380 -34570 -42884 -36606 -6642 12699 -4042 -4691 -32678 -36019 -20263 -44019
5432d4019l749k5233L1804J7086K3175m0896J5496N1502M237l2833J0125o964
$$ -44019 -47768 -73001 -41197 -24111 -936 -41832 -26336 25166 29403 -3430 6695 -269
5420b69L2071J1294l0031n3323J3954j5323l1928k6275K2708K5983l325L8876
$$ -269 31802 43096 13065 -40258 -26304 -41627 -73555 -99830 -77122 -51139 -54464 -15588
5408a5588J9406m2014J6029l271J7163J1143J9454J9790j6264m3423K250L2849
$$ -15588 3818 -38196 -22167 -25438 -8275 2868 22322 42112 25848 -17575 -15325 17524
5396A7524k3802j2888k1433K0808K356J265J3299k490k4238q300r170m765J656
$$ 17524 -6278 -19166 -40599 -19791 -17435 -16170 -2871 -5361 -29599 -37899 -47069 -51834 -50178
5383e0178k9200J2057N490K5357L0125K9423K0497k208n6405l1030m724K4610
$$ -50178 -79378 -67321 -61831 -36474 -6349 23074 43571 41363 -15042 -46072 -50796 -26186
5371b6186J3117j9240j7845J7257O505j8565l0856M8227K3651N500l7056j6394
$$ -26186 -13069 -32309 -50154 -32897 -26392 -44957 -75813 -27586 -3935 1565 -35491 -51885
5359e1885M2500m962J8104J4459J3524p381K6008j971n1975j7325K1156k984J1689
$$ -51885 -9385 -14347 3757 18216 31740 24359 50367 48396 -3579 -20904 252 -2732 8957
5346H957K0382j3970j0900J9726N957j6801n4676j7467P61J7685K7793J5718j6474
$$ 8957 29339 15369 4469 24195 30152 13351 -41325 -58792 -58031 -40346 -12553 3165 -13309
5333a3309k0903N680J3737N0395n085l9942l3655j031L5919M589M843J5535k1689
$$ -13309 -34212 -28532 -14795 35600 30515 -9427 -43082 -44113 -8194 -3605 1238 16773 -4916
5320d916k6605k8301p278L2416L5094K3672k8683m393J4823k663L9952L8131R842
$$ -4916 -31521 -59822 -67100 -34684 410 24082 -4601 -8994 5829 3166 43118 81249 91091
5307I1091o4765o1959m9656O219M6301n448j2325K3186J0822j4771o323l4491
$$ 91091 26326 -35633 -85289 -79070 -32769 -38217 -50542 -27356 -16534 -31305 -37628 -72119
5295g2119K9625p623J6258J3827j6891K639J4917J3891l6980J6145J3605K6687
$$ -72119 -42494 -50117 -33859 -20032 -36923 -34284 -19367 -5476 -42456 -26311 -12706 13981
5283A3981J3964j534k1139J4147k8973k3220L4638J5181J3853j8369L3298j8238
$$ 13981 27945 26411 5272 19419 -9554 -32774 1864 17045 30898 12529 45827 27589
5271B7589m3892m2174m4519J3023L8388N8511M3700j0424k404k6306j1632j9538
$$ 27589 -16303 -58477 -102996 -89973 -51585 6926 50626 40202 37798 11492 -140 -19678
5259a9678n0079j695k8792l3565K2322J3039j6835k2832J1444K1634J6072L3837
$$ -19678 -69757 -71452 -100244 -133809 -111487 -98448 -115283 -138115 -126671 -105037 -88965 -55128
5247e5128J1475R673L2218k8264L6826N568k3968n474L7358J4324q429Q904k0678
$$ -55128 -43653 -33980 -1762 -30026 6800 12368 -11600 -17074 20284 34608 26179 35083 14405
5234A4405q591o676k540L660L0277R374j9342k610L0081j1355q648j7424m2762
$$ 14405 5814 -862 -3402 258 30535 39909 20567 17957 48038 36683 28035 10611 -32151
5221c2151k1442K7833j420l2192o401K549K5892j2031p644J5117J6377K8948o371
$$ -32151 -53593 -25760 -27180 -59372 -65773 -63224 -37332 -49363 -57007 -41890 -25513 3435 -2936
5208b936j0306K5429K9759l0797k1280N129L1734P711m5659R54O913j9228l62
$$ -2936 -13242 12187 41946 11149 -10131 -5002 26732 34443 -11216 -10262 -3349 -22577 -22939
5195b2939K0315j5031k5761j2688M6600K5183N258l2686m7715j9326J6397N6332
$$ -22939 -2624 -17655 -43416 -56104 -9504 15679 20937 -11749 -59464 -78790 -62393 -6061
5183f061N5782k84o523O311l3155l540Q560J0850k160j9632l2257l7893L83L3394
$$ -6061 49721 49437 42914 49225 16070 12530 21090 31940 29780 10148 -22109 -60002 -59619 -26225
5169b6225j6893k1397j7642L2990N3478J8850l8563P492L3397j7701k5889j8279
$$ -26225 -43118 -64515 -82157 -49167 4311 23161 -15402 -7910 25487 7786 -18103 -36382
5157c6382k5787l2279O1503J8450k0260L043J9754m844l9153l7404K9948L5332
$$ -36382 -62169 -94448 -32945 -14495 -34755 -31712 -11958 -16802 -55955 -93359 -63411 -28079
5145b8079J028M637K4191L5075K1921j5620m6083l0289R408L962J1792L8081l675
$$ -28079 -27051 -22414 1777 36852 58773 43153 -2930 -33219 -23811 -19849 -8057 30024 26349
5132B6349m3403m6762j1371m194M0136K6236k5691r07P023L0648K1344N201j5168
$$ 26349 -17054 -63816 -75187 -79381 -39245 -13009 -38700 -39607 -32584 -1936 19408 24609 9441
5119I441j7491J3170L747j4125j8164J3431M3946L1974o0990k1017J5250n096
$$ 9441 -8050 5120 8867 -5258 -23422 -9991 33955 65929 4939 -16078 -828 -5924
5107e924m6318q128L8633L4230l895k1812r678O727K1802L7083J5817m811R875
$$ -5924 -52242 -60370 -21737 12493 8598 -13214 -22892 -16165 5637 42720 58537 53726 63601
5094F3601j0372l5272l8084o956n904j457K2824k5865j7223J9773L6401j0358
$$ 63601 53229 17957 -20127 -27083 -32987 -34444 -11620 -37485 -54708 -34935 1466 -8892
5082h892j3265j3992K3359K3657n3369K9566M8444K3544l1503m2179l1743m0665
$$ -8892 -22157 -36149 -12790 10867 -42502 -12936 35508 59052 27549 -14630 -46373 -87038
5070h7038j7233L8992N8915M5539J1439j3413L522p583l3320j9432K3004Jj3940
$$ -87038 -104271 -65279 -6364 39175 50614 37201 40723 33140 -180 -19612 3392 3393 -10547
5057a0547L1429j2335J6581j0950o67q222J3250J3708m921J2337K0649J7374r912
$$ -10547 20882 8547 25128 14178 13511 5289 18539 32247 27326 39663 60312 77686 67774
5044F7774k7871n2449l7430j2425N607J6527J8717J9986p197J1812k8056k9079
$$ 67774 39903 -12546 -49976 -62401 -56794 -40267 -21550 -1564 -8761 3051 -25005 -54084
5032e4084K7641J9397L936m5763j1156k7881p252L5264j5664l328N6024M3020
$$ -54084 -26443 -7046 -3110 -48873 -60029 -87910 -95162 -59898 -75562 -78890 -22866 20154
5020B0154k5353n5729l5252N555K0939J9166K343k0401J1080K6394l5047q321
$$ 20154 -5199 -60928 -96180 -90625 -69686 -50520 -48177 -68578 -57498 -31104 -66151 -74472
5008g4472P2644M3439k0476l2794j5707J2212j2866l7575J7367N6316K5831O788
$$ -74472 -1828 41611 21135 -11659 -27366 -15154 -28020 -65595 -48228 8088 33919 40707
4996D0707k8813l8504j8170j1357K911K6958J5378K4327l3009k9328K1293o800
$$ 40707 11894 -26610 -44780 -56137 -53226 -26268 -10890 13437 -19572 -48900 -27607 -34407
4984c4407o8718o926M3213M4082M8711p516k8704j0010K183K161k5582k0067N249
$$ -34407 -103125 -110051 -66838 -22756 25955 18439 -10265 -20275 -18092 -15931 -41513 -61580 -56331
4971e6331M3002O8298K5533q951l0367j0850K659k5199k1947J5159J6817l9834
$$ -56331 -13329 54969 80502 71551 41184 30334 32993 7794 -14153 1006 17823 -22011
4959b2011l6535J7794L4219J3376M0997L0274k8034l1636K649m44J3551o884J3736
$$ -22011 -58546 -40752 -6533 6843 47840 78114 50080 18444 21093 20649 34200 27316 41052
4946D1052J5734P151O045j5511o0292o8021j0829M1991M04J7554m455L5032o287
$$ 41052 56786 63937 69982 54471 -5821 -73842 -84671 -42680 -42276 -24722 -29177 5855 -432
4933d32j4942p009L6831j6224k8122k6442L3161m433m2315K6299L9203J5444j1638
$$ -432 -15374 -22383 14448 -1776 -29898 -56340 -23179 -27612 -69927 -43628 -4425 11019 -619
4920f19j1731o727k6105l2710M354J6778J8162n7386k2751k884O2110O4494M241
$$ -619 -12350 -19077 -45182 -77892 -73538 -56760 -38598 -95984 -118735 -121619 -59509 4985 9226
4907I226L635K2040q519l8768j3200q567L6383L8853m6775r322K8927J883q544
$$ 9226 12861 34901 26382 -12386 -25586 -34153 2230 41083 -5692 -15014 13913 15796 7252
4894G252k8762l1482J6531M5552M2400L118l0271J5897k154j1647q607p069j6824
$$ 7252 -21510 -52992 -36461 9091 51491 54609 24338 40235 38081 26434 17827 10758 -6066
4881f066J7401J2866j665J6993k3123l7951p171k4811k0061L2335J7323M8310
$$ -6066 11335 24201 22536 39529 16406 -21545 -28716 -53527 -73588 -41253 -23930 24380
4869B4380P562p678r918k515k6781k3543L2268q081j0518J97K5136k1565o9677
$$ 24380 31942 24264 14346 11831 -14950 -38493 -6225 -14306 -24824 -24627 509 -21056 -90733
4856i0733J7132M889J9614l6944J649J8279j813N9255l120m919O2925L6076M329
$$ -90733 -73601 -68712 -49098 -86042 -84393 -66114 -67927 -8672 -11792 -16711 46214 82290 86619
4843H6619k0623n2710o9881k946j522L83j0475K0631m339J174K4159J1729J0669
$$ 86619 65996 13286 -56595 -59541 -61063 -60680 -71155 -50524 -54863 -53689 -29530 -17801 -7132
4830g132J3669j9405P132K1522o439L1117L5620k1299j6188n227j4803n1299l1010
$$ -7132 6537 -12868 -5736 15786 9347 40464 76084 54785 38597 33370 18567 -32732 -63742
4817f3742O967L1169P457J0240J9017J7846l3958m5557M494K0810p133L3058M5207
$$ -63742 -56775 -25606 -18149 -7909 11108 28954 -5004 -50561 -46067 -25257 -32390 668 45875
4804D5875J015m8617m5853j5894o971K1833K5181l7935L1430K9849K4941K5117
$$ 45875 46890 -1727 -47580 -63474 -70445 -48612 -23431 -61366 -29936 -87 24854 49971
4792D9971K519m5553K0818l2225n2886k0394j7421N7378K2971o335M592R632N2575
$$ 49971 52490 6937 27755 -4470 -57356 -77750 -95171 -37793 -14822 -21157 -16565 -6933 45642
4779D5642P568l9017k6296j872M207R707K044M325q291L0498j1336m1317J1959
$$ 45642 53210 14193 -12103 -13975 -9768 -61 1983 6308 -1983 28515 17179 -24138 -12179
4766a2179k41l1317o84j5065J0208K0004J7495m8891k3798O3217L5379L136l4666
$$ -12179 -12420 -43737 -44421 -59486 -49278 -29274 -11779 -60670 -84468 -21251 14128 17264 -17402
4753a7402j5326M2767N608k4689J954j2968k6308K500J9273j516J8398O0693J3260
$$ -17402 -32728 10039 15647 -9042 -7088 -20056 -46364 -43864 -24591 -26107 -7709 52984 66244
4740F6244r630l751n0909j6487J2005L6008k4323p632Q357M765k3771J3056L2926
$$ 66244 56614 52863 1954 -14533 -2528 33480 9157 1525 9882 14647 -9124 3932 36858
4727C6858P680j2672l0076R802J8031N650l0819k778n367k2634j9317L3778o918
$$ 36858 44538 31866 1790 11592 29623 35273 4454 1676 -3691 -26325 -45642 -11864 -18782
4714a8782J4281P408k047k0245n5520j1850L4770L2096J7479j54k1933J2815P761
$$ -18782 -4501 2907 860 -19385 -74905 -86755 -51985 -19889 -2410 -2564 -24497 -11682 -3921
4701c921j5341l6485r135J0595Q864N1366K9434k7024j478k1210n2878M7611R8131
$$ -3921 -19262 -55747 -64882 -54287 -45423 5943 35377 8353 6875 -14335 -67213 -19602 78529
4688G8529j7632k5335l8363k9149j0168O480M0451j5174l1347Q975J433k6642
$$ 78529 60897 35562 -2801 -31950 -42118 -35638 4813 -10361 -41708 -32733 -31300 -57942
4676e7942N464N6541K1710J4832k4865n3121K386N5559J5507J8728K694k1767
$$ -57942 -52478 4063 25773 40605 15740 -37381 -34995 20564 36071 54799 57493 35726
4664C5726r486O843k7512J5695M0779r974l0306n3045K7957K7242o051k2079k9767
$$ 35726 26240 33083 5571 21266 62045 52071 21765 -31280 -3323 23919 17868 -4211 -33978
4651c3978J5272L9656L969l409O187l514j5637J3528Q138k4686J9540M3588l8266
$$ -33978 -18706 20950 24919 21510 27697 24183 8546 22074 30212 5526 25066 68654 30388
4638C0388m1849J5364N095k6190P153J9710O473j2221L0531J2782j8981j9234
$$ 30388 -11461 3903 8998 -17192 -10039 9671 16144 3923 34454 47236 28255 9021
4626I021k7101J9046L7892L1085j2701m9228p0639K0104O9714K6109n4828k8971
$$ 9021 -18080 966 38858 69943 57242 8014 -62625 -42521 27193 53302 -1526 -30497
4614c0497K7338M998K045m897K8242k6287j9841J1976j2847p71Q893l9497n3083
$$ -30497 -3159 1839 3884 -1013 27229 942 -18899 -6923 -19770 -20541 -11648 -51145 -104228
4601a04228J8827M77o691K1393N099K9271l778L1431K2135K0421j1463k6625j9718
$$ -104228 -85401 -84924 -91615 -70222 -65123 -35852 -39630 -8199 13936 34357 22894 -3731 -23449
4588b3449j2889j7413j5757J3781L8570J6363j7521L9831r561j9991L1997K6597
$$ -23449 -36338 -53751 -69508 -55727 -17157 -794 -18315 21516 11955 -8036 23961 50558
4576E0558J2101j0976k70j826l8998m4301r015J222K8084P2264K9216l1803J2351
$$ 50558 62659 51683 51413 49587 10589 -33712 -42727 -41505 -13421 58843 88059 56256 68607
4563F8607L3229J9410k2299m5093k2074m0527k997k6435Q252M0447K844l0802
$$ 68607 101836 121246 98947 53854 31780 -8747 -11744 -38179 -29927 10520 13364 -17438
4551a7438k873j6899Q606J1078m209j2444R390K2303L6689K9077n976j0663k4762
$$ -17438 -20311 -37210 -28604 -17526 -21735 -34179 -24789 -2486 34203 63280 57304 46641 21879
4538B1879k6510j0945J798K7068j3359q659l3290J404L8781K3565j0787l43K3312
$$ 21879 -4631 -15576 -13778 13290 -69 -8728 -42018 -40614 -1833 21732 10945 10602 33914
4525C3914m3008J7346N9786l2847m4174J2070p959K6090K6625J2100j5618k3641
$$ 33914 -9094 8252 68038 35191 -8983 3087 -4872 21218 47843 59943 44325 20684
4513B0684M3694q763k1586k1430K1594N528J4378p735j082m168K875l5411k5793
$$ 20684 64378 55615 34029 12599 34193 39721 54099 46364 45282 41114 43989 8578 -17215
4500a7215N7600P671n994l0211k7151j6003o739L1899K6355j9655r274j1772n499
$$ -17215 40385 48056 42062 11851 -15300 -31303 -38042 -6143 20212 557 -8717 -20489 -25988
4487b5988K8470R285O67J3937j7546k1263j0159m6553J4939M8301k3688j9655
$$ -25988 2482 11767 12434 26371 8825 -12438 -22597 -69150 -54211 -5910 -29598 -49253
4475d9253k156p554p859L2686l656K1347L5766k7553j4554J5188j6815J3720j0641
$$ -49253 -51409 -58963 -66822 -34136 -37792 -16445 19321 -8232 -22786 -7598 -24413 -10693 -21334
4462b1334k6745j5245n240R648l48R88J2668k4528K0093q965k8483K755K8156
$$ -21334 -48079 -63324 -68564 -58916 -59264 -58276 -45608 -70136 -50043 -59008 -87491 -84736 -56580
4449e6580K8224J3929L072L7370J7626J908k6541m7604K2616P793k2715j3158
$$ -56580 -28356 -14427 -11355 26015 43641 45549 19008 -28596 -5980 1813 -20902 -34060
4437c4060m016k2985k83j50K6906k4237q022L4068l777J0047j5853J2972o571
$$ -34060 -38076 -61061 -61344 -61494 -34588 -58825 -66847 -32779 -36556 -26509 -42362 -29390 -35961
4424c5961k129j3368k7827j1932l930K8492M0230j3026J4K291M1549j4916K9378
$$ -35961 -38090 -51458 -79285 -91217 -95147 -66655 -26425 -39451 -39437 -37146 4403 -10513 18865
4411A8865l2478l6671R508O2679J8079l5976L2956K6069k7125j9786J4869k8795
$$ 18865 -13613 -50284 -40776 21903 39982 4006 36962 63031 35906 16120 30989 2194
4399B194n6194j8315K1480J8032J7090J4226o2395k132L1547Q042j0691L3523
$$ 2194 -54000 -72315 -50835 -32803 -15713 -1487 -63882 -66014 -34467 -26425 -37116 -3593
4387c593N941j6609L328J4443j8422n2968J5915J7003R124M472j536M382L095
$$ -3593 2348 -14261 -10933 3510 -14912 -67880 -51965 -34962 -25838 -21366 -22902 -18520 -15425
4374a5425K2652L0618J8374k1199l9045J5727M603j6034j8943K1372M487N055
$$ -15425 7227 37845 56219 35020 -4025 11702 16305 271 -18672 2700 7187 12242
4362A2242L1345o524j7960l4016j1305M9903Nl0398k165j8687p667r572R929k0882
$$ 12242 43587 37063 19103 -14913 -26218 23685 23690 -6708 -8873 -27560 -35227 -44799 -34870 -55752
4348e5752M9096L8929M6813l2797l7627j7073n77n775L0438L5389k4510m7452
$$ -55752 -6656 32273 79086 46289 8662 -8411 -8988 -14763 15675 51064 26554 -20898
4336b0898k2356P91L0909L983j6889L3085n640m2970o801J8334L2685L8319l9241
$$ -20898 -43254 -42463 -11554 -7571 -24460 8625 2985 -39985 -46786 -28452 4233 42552 3311
4323C311m0149L8276j0651j0959k3580P338q460l0596K3862J0050K7637j6130
$$ 3311 -36838 1438 -9213 -20172 -43752 -36414 -44874 -75470 -51608 -41558 -13921 -30051
4311c0051J4602L9716L9967k6436n1712k0723j606J255l7902j2513L7384J3427
$$ -30051 -15449 24267 64234 37798 -13914 -34637 -36243 -34988 -72890 -85403 -48019 -34592
4299c4592K1336L6851o233m0112q897K2336K6871l0994j4390K1729J5246o842
$$ -34592 -13256 23595 17362 -22750 -31647 -9311 17560 -13434 -27824 -6095 9151 2309
4287B309Q551L221N4952l2476k2251j0998l7272o182J6486J8674M0960j0327J2492
$$ 2309 10860 14081 69033 36557 14306 3308 -33964 -40146 -23660 -4986 35974 25647 38139
4274C8139O7377J812j1401m4737k0124R516k9187m4623o1279P402L4156N838M1230
$$ 38139 105516 107328 95927 51190 31066 40582 11395 -33228 -94507 -87105 -52949 -47111 -5881
4261e881M4760K7304k5109o439K2417n8189l7304j3268K1761J7655J1510J3145
$$ -5881 38879 66183 41074 34635 57052 -1137 -38441 -51709 -29948 -12293 -783 12362
4249A2362J4475m722p2076o9800r99K1135R632L8020K2652J9600j8357M9181L0520
$$ 12362 26837 22115 -49961 -119761 -120760 -99625 -89993 -51973 -29321 -9721 -28078 21103 51623
4236E1623k8396l9159Q965j3982P341j535r774k0275m3707J804m962L1705J3192
$$ 51623 23227 -15932 -6967 -20949 -13608 -15143 -24917 -45192 -88899 -87095 -92057 -60352 -47160
4223d7160J847r217N4635j8325j5940j4741q20N93l170J7877l7140K1563K1560
$$ -47160 -45313 -54530 105 -18220 -34160 -48901 -49721 -49128 -52298 -34421 -71561 -49998 -28438
4210b8438L6697o688j4343j1092R366l0615J0555N1918O0062J1422l3496j3472
$$ -28438 8259 1571 -12772 -23864 -14498 -45113 -34558 17360 77422 88844 55348 41876
4198D1876j2824j6034J239j1020n1415k9207N7435M3416J3091L252P395l0501
$$ 41876 29052 13018 14257 3237 -48178 -77385 -19950 23466 36557 39809 47204 16703
4186A6703k2232k3997J8928j6699k4002j2695J0898k4605m560N7265J8778l670
$$ 16703 -5529 -29526 -10598 -27297 -51299 -63994 -53096 -77701 -82261 -24996 -6218 -9888
4174i888L4573J1398l1281J5191q242l1193R07j479m704K3952N4595j956k0628
$$ -9888 24685 36083 4802 19993 11751 -19442 -18535 -20014 -24718 -766 53829 51873 31245
4161C1245j5894n2242J0912L8631j4517M725J8918K7946J9786o0907m6217l570
$$ 31245 15351 -36891 -25979 12652 -1865 2860 21778 49724 69510 8603 -37614 -41184
4149d1184L5856J8704J2696N282m770j3076j0401n5152l969M8739p789j5488L5938
$$ -41184 -5328 13376 26072 31354 26584 13508 3107 -52045 -56014 -7275 -15064 -30552 5386
4136E386J7468Q053k1862m405J6247j8712r670Q431j105p164O428k3228L4623
$$ 5386 22854 30907 9045 4640 20887 2175 -7495 936 -169 -7333 -905 -24133 10490
$$ [...]
##END NTUPLES=NMR SPECTRUM
##END=
