##TITLE=Analysis number 330112
Compound Code cc 24101
Book Reference lab3
Project Code adrs
Chemist Name stores
##JCAMPDX= 6.0         $$ Bruker NMR JCAMP-DX V2.0
##DATA TYPE= NMR SPECTRUM
##DATA CLASS= NTUPLES
##ORIGIN= Bruker BioSpin GmbH
##OWNER= nmr
$$ XWIN-NMR		Version 3.5
$$ Mon Oct 29 11:15:13 2007 GMT Standard Time (UT+0h)  MAYBRIDGE\nmr@NMR_250MHZ
##.OBSERVE FREQUENCY= 250.131544655141
##.OBSERVE NUCLEUS= ^1H
##.ACQUISITION MODE= SIMULTANEOUS (DQD)
##.ACQUISITION SCHEME= undefined
##.AVERAGES= 16
##.DIGITISER RES= 18
##SPECTROMETER/DATA SYSTEM= dpx250
##.PULSE SEQUENCE= zg30
##.SOLVENT NAME= DMSO
##.SHIFT REFERENCE= (INTERNAL, DMSO, 0, 16.522)
##AUDIT TRAIL= $$ (NUMBER, WHEN, WHO, WHERE, WHAT)
$$ ##TITLE= Audit trail, XWIN-NMR		Version 3.5
$$ ##JCAMPDX= 5.01
$$ ##ORIGIN= Bruker BioSpin GmbH
$$ ##OWNER= nmr
$$ C:\u/data/dgb/nmr/ADRS/1480/pdata/1/auditp.txt
$$ ##AUDIT TRAIL=  $$ (NUMBER, WHEN, WHO, WHERE, WHAT)
(   1,<2007-10-29 11:14:47.04 +000>,<MAYBRIDGE\nmr>,<NMR_250MHZ>,
      <created by zg, POWCHK disabled, PULCHK disabled
       configuration hash MD5:
       76 6E 9A 78 1E 09 19 81 EC 84 63 8F B0 6A 59 2D
       data hash MD5: 64K
       81 7B E0 B9 45 00 58 AC A5 A5 77 CA BF 0B 04 FE>)
(   2,<2007-10-29 11:15:02.23 +000>,<MAYBRIDGE\nmr>,<NMR_250MHZ>,
      <Start of raw data processing
       ef LB = 0.3 FT_mod = 6 PKNL = 1 SI = 32K 
       data hash MD5: 32K
       C2 3E CF 3E 24 15 46 CF 6F 52 69 F4 3D 51 FC F3>)
(   3,<2007-10-29 11:15:04.42 +000>,<MAYBRIDGE\nmr>,<NMR_250MHZ>,
      <apk 
       data hash MD5: 32K
       E7 6C C2 40 6D 49 58 16 78 BC 3E F5 51 08 AF F2>)
(   4,<2007-10-29 11:15:05.32 +000>,<MAYBRIDGE\nmr>,<NMR_250MHZ>,
      <abs ABSG = 5 
       data hash MD5: 32K
       F4 2C 5D FC 97 2B 81 81 19 32 32 17 9F 9D FB 40>)
$$ ##END=
$$ 
$$ hash MD5
$$ 8B 4C 5D 7C 87 BD 8F 37 8F 5D B3 A1 6A 0C 56 30
##$RELAX= 
##$RELAX= 
##$RELAX= 
##$RELAX= 
##$RELAX= 
##$RELAX= 
##$RELAX= 
$$ Bruker specific parameters
$$ --------------------------
##$DU= <C:\u>
##$EXPNO= 1480
##$NAME= <ADRS>
##$PROCNO= 1
##$TYPE= <nmr>
##$USER= <dgb>
##$AMP= (0..31)
100 100 100 100 100 100 100 100 100 100 100 100 100 100 100 100 100 100 
100 100 100 100 100 100 100 100 100 100 100 100 100 100 
##$AQSEQ= 0
##$AQ_mod= 3
##$AUNM= <au_zg>
##$AUTOPOS= <17 >
##$BF1= 250.13
##$BF2= 250.13
##$BF3= 250.13
##$BF4= 250.13
##$BF5= 500.13
##$BF6= 500.13
##$BF7= 500.13
##$BF8= 500.13
##$BYTORDA= 1
##$CFDGTYP= 0
##$CFRGTYP= 5
##$CHEMSTR= <none>
##$CNST= (0..31)
1 1 145 1 1 1 1 1 1 1 1 1 1 1 1 1 1 1 1 1 1 1 1 1 1 1 1 1 1 1 1 1 
##$CPDPRG= <>
##$CPDPRG1= <>
##$CPDPRG2= <>
##$CPDPRG3= <>
##$CPDPRG4= <mlev>
##$CPDPRG5= <mlev>
##$CPDPRG6= <mlev>
##$CPDPRG7= <mlev>
##$CPDPRG8= <mlev>
##$CPDPRGB= <>
##$CPDPRGT= <>
##$D= (0..31)
0 1 0 0 0 0 0 0 0 0.06 0 0 0 0 0 0 0.0002 0 0 0 0 0 0 0 0 0 0 0 0 0 0 
0 
##$DATE= 1193656485
##$DBL= (0..7)
120 120 120 120 120 120 120 120 
##$DBP= (0..7)
150 150 150 150 150 150 150 150 
##$DBP07= 0
##$DBPNAM0= <>
##$DBPNAM1= <>
$$ [...]
##$SUBNAM7= <"">
##$SUBNAM8= <"">
##$SUBNAM9= <"">
##$SW= 20.6930455092707
##$SWIBOX= (0..15)
0 0 3 0 0 0 0 0 0 0 0 0 0 0 0 0 
##$SW_h= 5175.983436853
##$TD= 65536
##$TD0= 1
##$TE= 295.16
##$TE2= 300
##$TE3= 300
##$TEG= 300
##$TL= (0..7)
0 120 120 120 120 120 120 120 
##$TP= (0..7)
150 150 150 150 150 150 150 150 
##$TP07= 0
##$TPNAME0= <>
##$TPNAME1= <>
##$TPNAME2= <>
##$TPNAME3= <>
##$TPNAME4= <>
##$TPNAME5= <>
##$TPNAME6= <>
##$TPNAME7= <>
##$TPOAL= (0..7)
0.5 0.5 0.5 0.5 0.5 0.5 0.5 0.5 
##$TPOFFS= (0..7)
0 0 0 0 0 0 0 0 
##$TUNHIN= 0
##$TUNHOUT= 0
##$TUNXOUT= 0
##$USERA1= <user>
##$USERA2= <user>
##$USERA3= <user>
##$USERA4= <user>
##$USERA5= <user>
##$V9= 5
##$VALIST= <valist>
##$VCLIST= <CCCCCCCCCCCCCCC>
##$VD= 0
##$VDLIST= <DDDDDDDDDDDDDDD>
##$VPLIST= <PPPPPPPPPPPPPPP>
##$VTLIST= <TTTTTTTTTTTTTTT>
##$WBST= 1024
##$WBSW= 4
##$XGAIN= (0..3)
0 0 0 0 
##$XL= 0
##$YL= 0
##$YMAX_a= 356566
##$YMIN_a= -554289
##$ZGOPTNS= <>
##$ZL1= 120
##$ZL2= 120
##$ZL3= 120
##$ZL4= 120
##$ABSF1= 16.522
##$ABSF2= -4.171173
##$ABSG= 5
##$ABSL= 3
##$ALPHA= 0
##$AQORDER= 0
##$ASSFAC= 0
##$ASSFACI= 0
##$ASSFACX= 0
##$ASSWID= 0
##$AUNMP= <proc_1d>
##$AZFE= 0.1
##$AZFW= 0.1
##$BCFW= 0
##$BC_mod= 0
##$BYTORDP= 0
##$COROFFS= 0
##$CY= 12.5
##$DATMOD= 1
##$DC= 0
##$DFILT= <>
##$DTYPP= 0
##$F1P= 14.0000005364418
##$F2P= -0.99999901652339
##$FCOR= 0.5
##$FTSIZE= 32768
##$FT_mod= 6
##$GAMMA= 0
##$GB= 0
##$INTBC= 1
##$INTSCL= 1
##$ISEN= 128
##$LB= 0.3
##$LEV0= 0
##$LPBIN= 0
##$MAXI= 10000
##$MC2= 0
##$MEAN= 0
##$ME_mod= 0
##$MI= 0
##$NCOEF= 0
##$NC_proc= -4
##$NLEV= 6
##$NOISF1= 0
##$NOISF2= 0
##$NSP= 0
##$NTH_PI= 0
##$NZP= 0
##$OFFSET= 16.522
##$PC= 1
##$PHC0= 134.6116
##$PHC1= 27.52063
##$PH_mod= 1
##$PKNL= yes
##$PPARMOD= 0
##$PSCAL= 4
##$PSIGN= 0
##$REVERSE= no
##$SF= 250.13
##$SI= 32768
##$SIGF1= 0
##$SIGF2= 0
##$SINO= 400
##$SIOLD= 32768
##$SREGLST= <1H.DMSO>
##$SSB= 0
##$STSI= 32768
##$STSR= 0
##$SW_p= 5175.98343685301
##$SYMM= 0
##$S_DEV= 0
##$TDeff= 65536
##$TDoff= 0
##$TI= <Analysis number 999999
Compound Code 99
Book Reference 9
Project Code 9>
##$TILT= no
##$TM1= 0
##$TM2= 0
##$TOPLEV= 0
##$USERP1= <user>
##$USERP2= <user>
##$USERP3= <user>
##$USERP4= <user>
##$USERP5= <user>
##$WDW= 1
##$XDIM= 32768
##$YMAX_p= 362106623
##$YMIN_p= -382920
$$ End of Bruker specific parameters
$$ ---------------------------------
##NTUPLES= NMR SPECTRUM
##VAR_NAME=  FREQUENCY,     SPECTRUM/REAL,   SPECTRUM/IMAG
##SYMBOL=    X,             R,               I
##VAR_TYPE=  INDEPENDENT,   DEPENDENT,       DEPENDENT
##VAR_FORM=  AFFN,          ASDF,            ASDF
##VAR_DIM=   32768,         32768,           32768
##UNITS=     HZ,            ARBITRARY UNITS, ARBITRARY UNITS
##FACTOR=    0.157963299565203, 1,           1
##FIRST=     4132.6476996994, 0,             0
##LAST=      -1043.33573715361, 0,           0
##MIN=       -1043.33573715361, -382920,     0
##MAX=       4132.6476996994, 362106623,     0
$$ Real data points
##PAGE= N=1
##DATA TABLE= (X++(R..R)), XYDATA
$$ [...]
19635B34467r272m607K9472Q818K0481j2757J4416n035R4184Q6609J11649P7820
19623F46245R5717M9603k7084q0469j63388p3431o4690p4883J2002l4635m3061
19612B41926n6051J793m515j042J3067r081K2018Q492J323l7323m1196Q062Q16
19599A48289L3218j9437m128L0990J2084k2084L1120q490O189J7182L6116k3050
19587B37999k3019p466J4634j1196q780k6215l0462j8135L1507l9768r3221Q1701
19575A07579J14090p864l4181J9926l1222J4973O7764J96K0065L8356p309j3128
19563B89245o6945J1388O5530K8375K680j2212o8374q1780n684J5833l1252M7070
19551A93874j8592J3666Q6699j7949m3874J8825J6161J730J5506J5967J1611n6280
$$ y = [234467, 225195, 220588, 250060, 258878, 279359, 266602, 281018, 275983, 370167, 456776, 568425, 646245, 741962, 791565, 764481, 684012, 520624, 447193, 382503, 307620, 319622, 284987, 241926, 185875, 187668, 183153, 182111, 195178, 186097, 208115, 216607, 217930, 180607, 139411, 147473, 148289, 181507, 162070, 157942, 188932, 201016, 178932, 210052, 201562, 207751, 224933, 261049, 237999, 214980, 207514, 222148, 210952, 202172, 175957, 145495, 127360, 158867, 119099, 25878, 107579, 221669, 213805, 179624, 199550, 168328, 183301, 251065, 251261, 271326, 309682, 302373, 289245, 222300, 233688, 299218, 327593, 330273, 318061, 249687, 167907, 162223, 178056, 146804, 193874, 175282, 188948, 275647, 257698, 213824, 232649, 248810, 250540, 266046, 282013, 293624, 237344]
19539B37344p676p930L3623N0291M1635j292k6075p3732p090O7712M0263k4540
19527C22533o3763n6620M7621Q2857N998m7908J2281M8450j0234m4392o3411k9110
19515B04302J6880k7049m7238O1065J3944k8217L2632K0856K8571O130K1224m7222
19503B55878q632N6951J4155j326m5630K767J518K5012L7575k096p6256k1476
19491B38440N3252M0951N82j403k4058l3109J6953Q6535J8621l9315p800l2313
19479C17336K088J1071L6705k1512j9476k0389q903K768j482k2004p3603j9502
19467A83097K3257p78L4823P1746J5453K304J4443q105K824N7757K0405n6955
19455C60271l0115J1638m929q598m6008l7574K1865K4663J2541J8653K9107j6824
$$ y = [237344, 229668, 221738, 255361, 305652, 347287, 345995, 319920, 246188, 239098, 306810, 347073, 322533, 258770, 202150, 249771, 332628, 338626, 290718, 302999, 351449, 341215, 296823, 233412, 204302, 221182, 194133, 146895, 207960, 221904, 193687, 226319, 247175, 275746, 281876, 303100, 255878, 247246, 304197, 318352, 317026, 271396, 274163, 275681, 300693, 338268, 336172, 259916, 238440, 291692, 332643, 333225, 331822, 307764, 274655, 291608, 378143, 396764, 357449, 349649, 317336, 319424, 330495, 367200, 345688, 326212, 305823, 296920, 299688, 298206, 276202, 202599, 183097, 206354, 205576, 240399, 312145, 327598, 329902, 344345, 336240, 339064, 396821, 417226, 360271, 330156, 341794, 336865, 328267, 282259, 244685, 266550, 291213, 303754, 322407, 351514, 334690]
19443C34690j0010j6165j828K907K4902K6951P3947J4182o3621p9786l876M8545
19431C50838j5125m9076Q707M4106J3699O0948K1323p8888k3807N9199M4067l2046
19419D03945m7870l6658L097k7393l5443o099M2453K7019J4259j317M8431N0153
19407D34577l8696r8709l3466M0348J8754l7279K4960Q3073l98r926l3113r659
19395C40466J3855J2934J529n3172m7948N576J2830o090j9520M7793K8935M8081
19383C85269l267r5335K9945j6408l4240m4645l1712N2168M0392l9227K0879j0217
19371B53602M1712j134K3184M1004L0075J6579o2754m8345P437L7181l6581N0303
19359C52263J1225J0995J8427M656m6874L2842o036l1376k0549L3330J2329m497
$$ y = [334690, 324680, 308515, 306687, 309594, 334496, 361447, 435394, 449576, 385955, 306169, 302293, 350838, 335713, 286637, 295344, 339450, 353149, 414097, 435420, 356532, 332725, 391924, 435991, 403945, 356075, 319417, 322514, 295121, 259678, 253579, 296032, 323051, 337310, 335993, 384424, 434577, 395881, 297172, 263706, 304054, 322808, 285529, 310489, 393562, 393164, 383238, 350125, 340466, 354321, 367255, 368784, 315612, 267664, 273240, 286070, 279980, 260460, 308253, 337188, 385269, 382002, 286667, 316612, 300204, 265964, 221319, 189607, 241775, 282167, 242940, 263819, 253602, 295314, 294180, 317364, 358368, 388443, 405022, 342268, 293923, 301360, 338541, 301960, 352263, 363488, 374483, 392910, 397566, 350692, 383534, 377498, 346122, 325573, 358903, 371232, 366735]
19347C66735k3784J7052J4743O7784k5430l2933R931K5385J1948K3222O285m4877
19335D16061n0113p428O360j9406n8479m0638M6937K0338K6385J3570l0512j7061
19323C06014N5329N5406k0594m068P86k9408j8964n0165l125J2052j7928J9337
19311C04672O828K0330M0773m5808O036M9660M7697J3801k72Q202l3055K3419
19299D42283m1717l2097M6036M5916Q078k5184j9618K9659j0216q201K850K661
19287D40450r767L2803N202L014M3140N1051j775J8856K2712K7421K2728L8271
19275F94106L3682N1708O0539M7796N5142k4854M0591M7360K3079M9612P5713
19264A154474L2148K9653O7579Q977J21707J30177N3529K4383q069m6760j16434
$$ y = [366735, 342951, 360003, 374746, 442530, 417100, 384167, 394098, 419483, 431431, 454653, 460938, 416061, 365948, 358520, 364880, 345474, 286995, 246357, 293294, 313632, 340017, 353587, 323075, 306014, 361343, 416749, 396155, 392087, 392873, 363465, 344501, 294336, 291211, 303263, 285335, 304672, 311500, 331830, 372603, 326795, 332831, 382491, 430188, 443989, 443717, 451919, 418864, 442283, 400566, 368469, 414505, 460421, 468499, 443315, 423697, 453356, 443140, 434939, 437789, 440450, 430683, 463486, 468688, 471702, 514842, 565893, 564118, 582974, 605686, 633107, 655835, 694106, 727788, 779496, 840035, 887831, 942973, 918119, 958710, 1006070, 1029149, 1078761, 1154474, 1186622, 1216275, 1283854, 1292831, 1414538, 1544715, 1598244, 1622627, 1614558, 1567798, 1451364]
19253A451364j36257j50859m3745m2596j3436K8680N139q35j4122p1177j12473
19242H99683o7987m770R16m0903j17715m2991m5600o2781K4953j2279l674M007
19230E30859m3030k9721k5214N0782m0669m263K6441M423k2546R010o903l256
19218D45913L7672j3231J2551N849J8155R098K5668j3093j924p082L2896J8615
19206E71087L217m5083o3877l3891M8807K7846k1131m2854j0168O9784k9938l5110
19194D38689j2189k4015J0136M4890O1816L0136l5362n9460k7929J740K0580P289
19182D56321K5036q357j2892l9814K5956M175k3678M1882K1750m751k7633J3951
19170D71946K6563k880K6563P7775M2075J5170n7654k4469J6437O5386k3747K6170
$$ y = [1451364, 1315107, 1164248, 1120503, 1077907, 1064471, 1093151, 1098290, 1097455, 1083333, 1012156, 899683, 831696, 826926, 827842, 786939, 669224, 626233, 580633, 517852, 542805, 530526, 526852, 530859, 487829, 458108, 432894, 483676, 443007, 438744, 465185, 469608, 447062, 456072, 449169, 445913, 483585, 470354, 482905, 488754, 506909, 516007, 541675, 528582, 526658, 519576, 552472, 571087, 574304, 529221, 465344, 431453, 480260, 508106, 486975, 444121, 433953, 503737, 473799, 438689, 426500, 402485, 412621, 457511, 519327, 549463, 514101, 454641, 426712, 428452, 449032, 456321, 481357, 473000, 460108, 420294, 446250, 450425, 426747, 468629, 490379, 485628, 457995, 471946, 498509, 495629, 522192, 599967, 642042, 657212, 599558, 575089, 591526, 656912, 633165, 659335]
19158F59335k3002Q836M4K0639k994l0982j06693q6133K3563l6072k0979M2285
19146D47847M8675J8670J4981K5503n6647n4761L2129O772N832R664J5757K3648
19134E38070P444j8630m7590J1490J04353N0128p6597n5644K1508J9344L4557
19123E88433j7945L3141l325j2441K9717J6034o4919q0502O6167J4706K2033L6625
19111F27724L7474K3712K0670J3630k4100N763l9235k8586q123J6620M9625L1224
19099G26398M1342j8311j5069r838k1213q007M5377J9222p442o6003n2879k903
19087F30674J5788J5372q272k9701p155l1160m9433J8975m3528m1272p933j592
19075D60763N6998P4310N9259l0496m4903J315M257Q0061J0719K0109k881q971
$$ y = [659335, 636333, 645169, 645213, 665852, 662858, 631876, 525183, 439050, 462613, 426541, 405562, 447847, 496522, 515192, 530173, 555676, 499029, 444268, 476397, 483169, 489001, 498665, 514422, 538070, 545514, 526884, 479294, 490784, 595137, 645265, 568668, 513024, 534532, 553876, 588433, 570488, 603629, 600304, 587863, 617580, 633614, 568695, 488193, 554360, 569066, 591099, 627724, 665198, 688910, 709580, 723210, 699110, 704873, 665638, 637052, 628929, 645549, 695174, 726398, 767740, 749429, 734360, 724522, 703309, 695302, 740679, 759901, 752459, 686456, 633577, 630674, 646462, 661834, 653562, 623861, 616706, 585546, 536113, 555088, 511560, 470288, 462355, 460763, 517761, 592071, 651330, 620834, 575931, 577246, 581503, 661564, 672283, 692392, 689511, 680540]
19063F80540K7587J444L438R1102r004n113J3074j0802m7008N421P9845O0239
19051H90763O7327P5633J8855L8430j5362m3456p1425q0699l7557j25908l9143
19040F77458p314n982l4840k235L0463K0504j5818m1625N0207L9894k7104p769
19028F75839K852J4333R204J1498J2011m6890k3915l042l3745k6332m4594K1688
19016E68907M8975P5929K2473l3583j5641r78L3685m1051p4603j8668J2724P6710
19004F54879N4951j1190L2594M5079J3216P626R7947J01092P3975O3676K1059
18993A154904K7243L006M375K999M4615L2687M6974j14385j08102m9964l3365
18982A010987M2979J2909r6139j13847l8483j7538K6986L713M8295N6697N6791
$$ y = [680540, 708127, 709571, 713009, 804111, 795107, 789994, 803068, 792266, 745258, 750679, 830524, 890763, 958090, 1033723, 1052578, 1091008, 1075646, 1032190, 960765, 880066, 842509, 716601, 677458, 670144, 664162, 629322, 627087, 657550, 678054, 662236, 620611, 670818, 710712, 683608, 675839, 678691, 693024, 702228, 713726, 725737, 678847, 654932, 651890, 618145, 591813, 547219, 568907, 617882, 693811, 716284, 682701, 667060, 666082, 699767, 658716, 584113, 565445, 578169, 654879, 709830, 698640, 731234, 776313, 789529, 797155, 895102, 996194, 1070169, 1133845, 1154904, 1182147, 1185153, 1189528, 1192527, 1237142, 1269829, 1316803, 1202418, 1094316, 1044352, 1010987, 1053966, 1066875, 970736, 856889, 818406, 800868, 827854, 831567, 879862, 936559, 993350]
18971I93350R896M3752R5161M5315K427o587M5356m9805j5758l125m0745l528
18959A115709J04876J10014N9390l5922o8632j01209q3721o4929l8827J5650N1620
18948A064019J7743M9281P1665J574k150m9717p7833k9795k4881Q255M359l9597
18936I92923m1335L0682K266K644k2142j8065M8492K9481O4572K2939N5037L4474
18924A201968N9876J27650R6210L1030P1894J01430J8278L813N4001n577j6193
18913A744380R373J23743J09128R9084j2157r5663l3361o3818r0465j15586r3387
18902A581271j39670m9844o8415o7090m4462l4781m160r552O724n6142q4423k1828
18890A007628J431l4519P876j8749M594k6619p226l6957K58k3362J3721R021M6870
$$ y = [993350, 1003246, 1046998, 1142159, 1187474, 1189901, 1183314, 1228670, 1178865, 1163107, 1159982, 1119237, 1115709, 1220585, 1330599, 1389989, 1354067, 1285435, 1184226, 1100505, 1035576, 996749, 1012399, 1064019, 1081762, 1131043, 1202708, 1204282, 1202132, 1152415, 1074582, 1044787, 1019906, 1028161, 1032520, 992923, 951588, 982270, 984536, 987180, 965038, 946973, 995465, 1024946, 1089518, 1112457, 1167494, 1201968, 1261844, 1389494, 1485704, 1516734, 1588628, 1690058, 1708336, 1712149, 1766150, 1760573, 1744380, 1753753, 1877496, 1986624, 2085708, 2073551, 1977888, 1944527, 1880709, 1790244, 1674658, 1581271, 1441601, 1391757, 1323342, 1256252, 1211790, 1177009, 1172849, 1163297, 1170021, 1113879, 1029456, 1007628, 1009059, 974540, 982416, 963667, 968261, 941642, 934416, 897459, 897717, 874355, 888076, 897097, 943967]
18877I43967j9062o9410j2952K5468k5832L609M0565p071j8863J8503K0172p983
18865H91111r257N2732m221j9666j0641L0814M2721m4210M6344Q3301p7878l7845
18853I43305O5528j3491r1779J2704J4674L4994J4519L1970l55K5528o352k5908
18841A005337O1658K726M8068N611j16145p0134r456L3328R5458J7428n6103J0089
18829A027865j3814n5645L1137K1211m1904J9208l8090K745J3547M6888J3560
18818A026708O451l2286j0200m7176L4602N3276K1613P3872M5240Q9000J0432
18807A271532O4023N4113Q046J8447R9918J3115J7828Q6838J2244p3096P094J11328
18795A691430Q2892O8049M1529m518o377J9853L9229N088p1775K5249l4740q2344
$$ y = [943967, 924905, 855495, 842543, 868011, 842179, 845788, 886353, 879282, 860419, 878922, 899094, 891111, 881854, 934586, 930365, 910699, 900058, 930872, 973593, 929383, 975727, 1059028, 981150, 943305, 1008833, 995342, 903563, 916267, 930941, 965935, 980454, 1012424, 1012069, 1037597, 1031245, 1005337, 1066995, 1069721, 1117789, 1123400, 1007255, 937121, 927665, 960993, 1056451, 1073879, 1017776, 1027865, 1014051, 958406, 989543, 1010754, 968850, 988058, 949968, 952713, 966260, 1013148, 1026708, 1033159, 1000873, 990673, 943497, 978099, 1031375, 1052988, 1126860, 1172100, 1261100, 1271532, 1335555, 1389668, 1397714, 1416161, 1516079, 1529194, 1547022, 1633860, 1646104, 1573008, 1580102, 1691430, 1774322, 1842371, 1883900, 1879382, 1873005, 1892858, 1932087, 1937175, 1865400, 1890649, 1855909, 1773565]
18783A773565n5447k3190o4045q6690m6377k5067r2353P031Q0851J20490J58752
18772A747520J97667L82176L15681J85698J12308p2843j82259k37980j83653j00991
18762B163324k7193J55457K96834L46829K82561K53181J18819j45630k81849k68565
18752B893768k60433j98064j27436j06991j1252k907J829l1050k8638k4056j4578
18741B090192k7244o1371r6690m7962l3522k8138j07480p1686L6643L3794O4668
18730A751204O7266j6050n6925l6435J9406M5791J43305J83358K65095L25419
18720B691434K97922J92042O927j94335k54377k29406j84746o7393J36459K49358
18710B643885L77447L61833J77788O4129r5713j77278k48673j69524j80916m5659
$$ y = [1773565, 1718118, 1694928, 1630883, 1544193, 1497816, 1472749, 1380396, 1387427, 1468278, 1588768, 1747520, 1945187, 2327363, 2643044, 2828742, 2941050, 2868207, 2685948, 2447968, 2264315, 2163324, 2136131, 2291588, 2588422, 2935251, 3217812, 3470993, 3589812, 3444182, 3162333, 2893768, 2633335, 2435271, 2307835, 2200844, 2189592, 2186685, 2188514, 2157464, 2128826, 2104770, 2090192, 2062948, 2001577, 1904887, 1856925, 1823403, 1795265, 1687785, 1616099, 1652742, 1686536, 1751204, 1818470, 1802420, 1745495, 1709060, 1728466, 1774257, 1917562, 2100920, 2366015, 2691434, 2989356, 3181398, 3188325, 2993990, 2739613, 2510207, 2325461, 2258068, 2394527, 2643885, 3021332, 3383165, 3560953, 3625082, 3529369, 3352091, 3103418, 2933894, 2752978, 2707319]
18700B707319n3808o0463p3775o5064o5159o7484j38303q9151j01279o7587l8005
18689A887241q9492n8905J980L1854K0359O8079L5005J4463k4585j9846L5363
18678A901516n9774q2558q286n4924q271K2052L9766L0791j3949l2344M2003j8307
18666A757715n1562J164K2542J08157K8581j4299l9557n1593r887L2098k6521
18655A756838p2972M6354M0650q45o6606m8162K6334Q089j3642l6491m6438M1523
18643A634632O6836k0197j1020Q468K589N3843J00710M6527R7475K4763Q0888
18632B085514Q0679l5509k5626J7367O5017J03100M5903O5730m71k6682n3992
18621B321030R178P6890l8232k5446P5141M8439k0951j186l8375p4659q0275l145
$$ y = [2707319, 2653511, 2593048, 2519273, 2454209, 2389050, 2321566, 2183263, 2094112, 1992833, 1925246, 1887241, 1797749, 1738844, 1740824, 1772678, 1793037, 1861116, 1896121, 1910584, 1885999, 1866153, 1901516, 1841742, 1759184, 1750898, 1695974, 1687703, 1709755, 1749521, 1780312, 1766363, 1734019, 1776022, 1757715, 1706153, 1707317, 1729859, 1838016, 1866597, 1852298, 1812741, 1761148, 1751261, 1783359, 1756838, 1683866, 1730220, 1770870, 1770025, 1703419, 1655257, 1681591, 1689680, 1676038, 1639547, 1593109, 1634632, 1701468, 1681271, 1670251, 1678719, 1681308, 1735151, 1835861, 1882388, 1979863, 2004626, 2085514, 2166193, 2130684, 2105058, 2122425, 2187442, 2290542, 2336445, 2402175, 2401704, 2375022, 2321030, 2330208, 2407098, 2368866, 2343420, 2418561, 2467000, 2446049, 2444863, 2406488, 2331829, 2251554, 2248409]
18609B248409m9274j2557j2071n4384M389K4081k7746j8858n749m3697m6716j9565
18597A986262M1513M8852m4059j30672n3922p0535R658l9491n4650M095Q1610
18586A778661P0045O2346K3415P8166N9037R7412J25006Q6146M6380O07p530J20879
18574B540570K66770J40996O5080m8610j54447j07995q7997j34838q8968J8790
18564B409351J11891J51787J96991J22814o6783j93845k47213k43558j55857p6660
18554B008918O1294J6211m0220l5152K1081K9049j3324j04495l4369K1776L0499
18543A961268M8439K2391J5683M5808n8501m5211K6502N5695M044K839O1104R8614
18531B238675J32528J42209K47069K91675J47515m6428j30370j48630m5288J05801
$$ y = [2248409, 2199135, 2186578, 2174507, 2120123, 2124512, 2148593, 2120847, 2101989, 2096240, 2052543, 2005827, 1986262, 2027775, 2076627, 2032568, 1901896, 1847974, 1777439, 1787097, 1747606, 1692956, 1697051, 1778661, 1848706, 1911052, 1934467, 2012633, 2071670, 2169082, 2294088, 2380234, 2426614, 2427221, 2419691, 2540570, 2807340, 2948336, 3013416, 2964806, 2810359, 2702364, 2614367, 2479529, 2390561, 2409351, 2521242, 2673029, 2870020, 2992834, 2926051, 2732206, 2484993, 2241435, 2085578, 2008918, 2070212, 2086423, 2046203, 2011051, 2032132, 2061181, 2047857, 1943362, 1908993, 1930769, 1961268, 2009707, 2032098, 2047781, 2093589, 2035088, 1989877, 2016379, 2072074, 2076118, 2078957, 2140061, 2238675, 2371203, 2513412, 2760481, 3052156, 3199671, 3153243, 3022873, 2874243, 2828955, 2934756]
18521B934756K05331K15228R2281j0591o6003J3567q4907k19087k81218j72885
18511B626472m3130J00945J88937J20299j09901k96587l01558k26230j10486q6754
18501A862007l9357K8250j6023K2382O2224J4143l2596K3907Q7099J4468J9802
18490B046306M4085J1183M0773K7229J9691O4191N4496r793K6397N2627Q3471
18479B460656J30576R1073J40872K05847L39858J72952p4877k51209k43028j38890
18469B833830q6053M806O2585O5708J46197K50104K11934l2077j53395k37557
18459C066082k85550j76188j22718n8176J7823O4197K8395M1985K0353K9187Q2289
18448B707679P1595N4866Q6993O0465J9980M987N1617Q5448R7521J24386M980
$$ y = [2934756, 3140087, 3355315, 3447596, 3437005, 3371002, 3384569, 3299662, 3080575, 2799357, 2626472, 2583342, 2684287, 2873224, 2993523, 2883622, 2587035, 2285477, 2059247, 1948761, 1862007, 1822650, 1850900, 1834877, 1857259, 1919483, 1933626, 1901030, 1924937, 2012036, 2026504, 2046306, 2090391, 2101574, 2142347, 2169576, 2189267, 2253458, 2307954, 2298161, 2324558, 2377185, 2460656, 2591232, 2682305, 2823177, 3029024, 3368882, 3541834, 3466957, 3215748, 2972720, 2833830, 2747777, 2752583, 2815168, 2880876, 3027073, 3277177, 3489111, 3457034, 3303639, 3066082, 2780532, 2604344, 2481626, 2423450, 2441273, 2505470, 2533865, 2575850, 2596203, 2625390, 2707679, 2779274, 2834140, 2921133, 2981598, 3001578, 3006565, 3058182, 3143630, 3241151, 3365537, 3370517]
18437C370517N6773R5889L2247N9144P3541j5128p794R2879P7191J11609N1113
18426C997981L8647Q6205J24959J89452J50662K03824J80915K21186K32972J90698
18416E617501K48425L47697L72707L87803M32944M68380N41065N27700O52229
18407I596451P48873R21685J069332J290027J591402K121837K999257M110073
18399B4448937N696870P475640Q870010R160752Q118475O506144N445369N523863
18391H1246060O450868P656245R197762J0584408J0210220P811411M300636J035402
18383A38493012l81184j41167m77072k548628n915630r422651j1091868j0501543
18375I8013269q995142p424442o002473n384247n845261p148883q740335r421817
$$ y = [3370517, 3427290, 3523179, 3555426, 3614570, 3688111, 3672983, 3665189, 3758068, 3835259, 3946868, 3997981, 4036628, 4122833, 4247792, 4437244, 4587906, 4791730, 4972645, 5193831, 5426803, 5617501, 5865926, 6213623, 6586330, 6974133, 7407077, 7875457, 8416522, 8944222, 9596451, 10345324, 11267009, 12336341, 13626368, 15217770, 17339607, 20338864, 24448937, 30145807, 37621447, 46491457, 55652209, 63770684, 70276828, 75722197, 81246060, 87696928, 95353173, 104550935, 115135343, 125345563, 133156974, 137457610, 138493012, 138111828, 137970661, 137493589, 134944961, 129029331, 119606680, 108514812, 98013269, 89018127, 81593685, 75591212, 70206965, 64361704, 57212821, 48472486, 39050669]
18367C9050669q608768o886608m973850l382182k340389j736151j383920j131261
18359H607540q34833o96116n99792n05505m57569l88282l50895l50283l53825
18350D070440l71130k21633k17584k13680j23240j03803m7198q3086l3471m3070
18340B612545M6813L0515J821J45120O7254L0134Q4643J03439J40526R0654P4622
18329C428086m691l9634K57K9285k0114o0321q5535j10438m7689o331K4584O0199
18317C167658P1012P359j03313j28262p2308r3121k2678M8238N007k912m9739
18306B826941j09773r7118n6515k9365O537J1963m7141N533R9158M5650J4542
18295B670412P414k658K7078l9040l1659N5692M2213P1703N9864M6578R3817J20271
$$ y = [39050669, 30441901, 23555293, 18581443, 15199261, 12858872, 11122721, 9738801, 8607540, 7772707, 7076591, 6476799, 5971294, 5513725, 5125443, 4774548, 4424265, 4070440, 3699310, 3477677, 3260093, 3046413, 2923173, 2819370, 2772172, 2689086, 2655615, 2612545, 2659358, 2689873, 2691694, 2836814, 2904068, 2934202, 3018845, 3122284, 3262810, 3353464, 3428086, 3423395, 3383761, 3384018, 3413303, 3393189, 3332868, 3247333, 3136895, 3089206, 3082875, 3107459, 3167658, 3238670, 3246029, 3142716, 3014454, 2942146, 2849025, 2826347, 2874585, 2879592, 2876680, 2826941, 2717168, 2620050, 2563535, 2534170, 2540707, 2552670, 2505529, 2511062, 2610220, 2655870, 2670412, 2677826, 2675168, 2702246, 2663206, 2631547, 2687239, 2729452, 2801155, 2861019, 2907597, 3001414, 3121685]
18283C121685J20802J19457J22702R4331O2154R7201J09427O6058N0515J08167
18273D072499J47920J96217J66166J61397P5329P1248N5388L5223R8022J53418
18263E232827N7605O6962Q4068P5977J8949M4105O3931J33965K74469K56281K34241
18252F543380K73934L51214L85271M13637M71215O99020R58842J303207J852354
18243A3252074K682948L964251N685849P569792R033018R316533Q056558N436843
18235F4997866J512546k237575m565503n028434l333982R7729M276586P528193
18227F3247426Q144460O504814K861246k597601p348026j0400668j1569523j0718075
18219C8124053q668379o535737m543831l012497k057025j446495j024792p39129
$$ y = [3121685, 3242487, 3361944, 3484646, 3578977, 3641131, 3738332, 3847759, 3913817, 3964332, 4072499, 4220419, 4416636, 4582802, 4744199, 4819528, 4890776, 4946164, 4981387, 5079409, 5232827, 5290432, 5357394, 5441462, 5517439, 5536388, 5580493, 5644424, 5778389, 6052858, 6309139, 6543380, 6817314, 7168528, 7553799, 7967436, 8438651, 9137671, 10096513, 11399720, 13252074, 15935022, 19899273, 25585122, 33154914, 42187932, 51504465, 59561023, 64997866, 66510412, 64272837, 59707334, 54678900, 51344918, 51442647, 55719233, 63247426, 71391886, 77896700, 80757946, 78160345, 70812319, 60411651, 48842128, 38124053, 29455674, 22919937, 18376106, 15363609, 13306584, 11860089, 10835297, 10096168]
18211A0096168n38168k47822j09035o7989M6634M7951R8485J94208L33284M39621
18201A0293337N72162P26506R83253J375066J944873K854693M181090N906633
18193B8837613P926779R592870J0355807R770701P433935L347225p11557l854706
18185G2698667n401486m383272j004618L444344P220218Q909249Q238834M895939
18177I4617875n99893n780116r476390j1166423j0041968o605353j945711K092757
18169E1094778L071247n4322m565230p474186p782490o014393l356875p47738
18161B4170791J610174L807076N123626M206513N53398l911980o518699o676862
18153B2364037n332384l538188k266855j538500j180409r34535p05785n75095
$$ y = [10096168, 9558000, 9310178, 9201143, 9133154, 9179788, 9227739, 9326224, 9520432, 9853716, 10293337, 10865499, 11592005, 12575258, 13950324, 15895197, 18749890, 22930980, 28837613, 36764392, 46357262, 56713069, 66483770, 73917705, 77264930, 76553373, 72698667, 67297181, 62913909, 61909291, 65353635, 72573853, 81483102, 89721936, 94617875, 94017982, 88237866, 78761476, 67595053, 57553085, 50947732, 49002021, 51094778, 54166025, 54111703, 49546473, 42072287, 34289797, 28275404, 24918529, 24170791, 25780965, 29588041, 34711667, 38918180, 39471578, 35559598, 29040899, 22364037, 17031653, 13493465, 11226610, 9688110, 8507701, 7573166, 6867381, 6292286]
18145F292286m23017k55546j05836P8129J03007J22014J91079J88860Q1829J28119
18135F400924K06082K73468M35892O00529Q08989J157589J606485K159023L059791
18126A6708772M588049O737835R578063J2507989J3533879J0739766N479672J166846
18118H1040871j474359m106242o558218p547605o094084k568183J478975M095161
18110E8266316M096982K332078O74284j109057m358048q214888j0464565j0270379
18102C0952723q259864n723425l760551k490531j659873j218730q93834o91031
18094F254884m52760l02227j64700j29689r7210m5480j02692j08365l833M8174
18084D896102J58943K63569L56451M28669O38243Q89990J302812J815247K569051
$$ y = [6292286, 5869269, 5613723, 5507887, 5586016, 5689023, 5811037, 6002116, 6190976, 6272805, 6400924, 6607006, 6880474, 7316366, 7916895, 8725884, 9883473, 11489958, 13648981, 16708772, 21296821, 28034656, 37612719, 50120708, 63654587, 74394353, 79874025, 81040871, 79566512, 75460270, 68902052, 61354447, 55260363, 52692180, 54171155, 58266316, 62363298, 64695376, 65369660, 64260603, 59902555, 51687667, 41223102, 30952723, 22692859, 16969434, 13208883, 10718352, 9058479, 7839749, 6945915, 6254884, 5802124, 5499897, 5335197, 5205508, 5108298, 5062818, 4960126, 4851761, 4847928, 4896102, 5055045, 5318614, 5675065, 6103734, 6741977, 7631967, 8934779, 10750026, 13319077]
18075A3319077L851210N834853Q507527J1225511J1546154P088120q00124p527658
18067E3044670j0198501q874095n558135j881945J423175M364087O615562O781044
18059D5715862L327894k690676p763877r496139q445656o155292l988948k506531
18051G996637j654867j188624q35629o06186n11524m23467l11151k83776k17534
18042A963879j16717j24882o9799k2683o6854j03795o3616n4083n7705m4813j5595
18031A223337J1354l0573l7690o0847p9338k8219q1866j05083m7789l7623l9352
18020F86311k959J2692j2699l8420k0604J3794J6288k5427l6944Q4527R4063j8703
18008G51919J7338L9907k5424m589J8512N6430N1837J22310Q7093L6003R7328
$$ y = [13319077, 17170287, 23005140, 31512667, 42738178, 54284332, 61372452, 60572328, 53044670, 42846169, 33972074, 28413939, 26531994, 27955169, 32319256, 38934818, 45715862, 49043756, 46353080, 38589203, 29093064, 20647408, 14492116, 10503168, 7996637, 6341770, 5153146, 4317517, 3711331, 3199807, 2776340, 2465189, 2181413, 1963879, 1847162, 1722280, 1652481, 1629798, 1562944, 1459149, 1395533, 1341450, 1283745, 1238932, 1223337, 1234691, 1204118, 1166428, 1105581, 1026243, 998024, 916158, 811075, 763286, 725663, 686311, 683352, 696044, 683345, 644925, 624321, 638115, 654403, 628976, 592032, 676559, 770622, 751919, 769257, 809164, 783740, 779151, 797663, 854093, 905930, 1028240, 1115333, 1151336, 1248664]
17997A248664J29666Q2422K1772m1798m9142o0466J3635n4986l5481M4226j8950
17986A279562k674J6269k5762r0475j08413j04793p9527r3391l0932o2955p4128
17975F22781m9874r3945p7027O5558R4883O3090J4736k907m30p286o0565m0484
17963E28530L720m691K4807J3828l7579j6924K1729J3584P8357L5603O3618M2079
17951G66661L1206j8169l6309K2812K1960L9060P8955O0215K2952n2481j2524
17940I24338K7747j3823o5664k3875m2143m6485N9199O642k5331l5213o6221q8754
17928F10417j4577N5961j0980k0448n86k8536K7386J8385L96l3738l4180l0650
17916E38850l5387J5242O8281j1551J8822O5207J12404N0088k3983J3740l9454
$$ y = [1248664, 1378330, 1460752, 1482524, 1440726, 1391584, 1331118, 1344753, 1289767, 1254286, 1298512, 1279562, 1276888, 1293157, 1267395, 1176920, 1068507, 963714, 884187, 790796, 759864, 696909, 622781, 572907, 478962, 401935, 467493, 562376, 625466, 640202, 637295, 636865, 629579, 569014, 528530, 532250, 527559, 552366, 566194, 528615, 511691, 533420, 547004, 625361, 660964, 724582, 766661, 797867, 779698, 743389, 766201, 788161, 827221, 906176, 966391, 989343, 936862, 924338, 952085, 938262, 872598, 848723, 806580, 760095, 819294, 825936, 800605, 765392, 699171, 610417, 595840, 651801, 640821, 620373, 619787, 591251, 618637, 637022, 637418, 603680, 569500, 538850, 503463, 518705, 586986, 575435, 594257, 659464, 771868, 821956, 797973, 811713, 772259]
17905G72259m1319N8497J05850k5722q8295J1361Q0703M5428l9992n8758J0823
17894H30835L4227k5064l9255J665L9790N5656J9793n1043p1793J6031L2333J8653
17882H61828J6263K1025K3813L0661O038o0750k1438m1961j8809K5545N0155K3717
17870I16087j6130l639P9003J06915Q7140J07521J25480R7832K0034L4797O8334
17859A623374m5296K2910R9012N7903L8027l183j6660P025O219k0558p9318n2711
17847A636744n5620j7936n191m0683q519J6518l9303p2614o5889k3293m5834j1784
17835A266596l3177j4133p8926n469K9862O4874L8881O5981L2980J13150J33205
17824A613824J90067L10060K93293L54770L04166J58188J07418N8634O1974J30739
$$ y = [772259, 730940, 789437, 895287, 869565, 781270, 792631, 873334, 918762, 878770, 820012, 830835, 865062, 839998, 800743, 802408, 842198, 897854, 917647, 866604, 794811, 810842, 843175, 861828, 878091, 899116, 922929, 953590, 959628, 898878, 877440, 835479, 816670, 842215, 892370, 916087, 899957, 896318, 975321, 1082236, 1169376, 1276897, 1402377, 1500209, 1520243, 1555040, 1623374, 1578078, 1600988, 1700000, 1757903, 1795930, 1792747, 1776087, 1783112, 1789331, 1768773, 1689455, 1636744, 1581124, 1563188, 1557997, 1517314, 1508795, 1525313, 1486010, 1413396, 1347507, 1324214, 1278380, 1266596, 1233419, 1219286, 1140360, 1134891, 1164753, 1229627, 1268508, 1334489, 1367469, 1480619, 1613824, 1803891, 2113951, 2407244, 2762014, 3066180, 3224368, 3331786, 3390420, 3452394, 3583133]
17814C583133P3529L0321r0943j72436l08875l89609l99452l01065j72525j14726
17804A737352q7568j07700l5706J164m0714m1025l3280n9478l0691l0730l2772
17793A238852J86O639m6735k5033L7415L1558l2231p4299m0805O2488N6125K3133
17781A237293M1364j5927k6551l1464K1139K0606N7304J19230J42683J88151K37639
17770A991467K76055K39011L22383K53006J54058J01280m106l4654R8919j0472
17760C386947q6940j02753j55417k33626k79276k35053j88743j11275j5800q981
17750A969083K5266l2902k0493n5254l6042j7675j6556o1184o8017l4059n168
17739A646999o0013k8542P785J3174N8754L108L9172J9226k6582n5243M5978N361
$$ y = [3583133, 3656662, 3686983, 3596040, 3423604, 3114729, 2725120, 2325668, 2024603, 1852078, 1737352, 1649784, 1542084, 1506378, 1507542, 1466828, 1425803, 1392523, 1333045, 1302354, 1271624, 1238852, 1239038, 1245677, 1198942, 1173909, 1211324, 1242882, 1210651, 1136352, 1095547, 1158035, 1214160, 1237293, 1278657, 1262730, 1236179, 1204715, 1225854, 1246460, 1303764, 1422994, 1565677, 1753828, 1991467, 2267522, 2506533, 2828916, 3081922, 3235980, 3337260, 3333154, 3298500, 3397419, 3386947, 3300007, 3197254, 3041837, 2808211, 2528935, 2293882, 2105139, 1993864, 1978064, 1969083, 1994349, 1961447, 1940954, 1885700, 1849658, 1831983, 1815427, 1754243, 1686226, 1652167, 1646999, 1586986, 1558444, 1566229, 1579403, 1638157, 1641265, 1680437, 1699663, 1673081, 1617838, 1663816, 1669177]
17727A669177j3958L6029O1861J443J8548Q524Q3456P4720Q7276K4608N435N8251
17715B115370L2857K2929L9226j32N8557Q1238J62846J41182P2001J82123J11977
17704C020174J20266J44691J65107J03649Q6087P2810J54595J84712K12895J93674
17694D458660K45463J69226K07040K65887M12664O67891Q44650J001411J301978
17685I574870J758453K540221L752587N550017Q135201J0937347J1964935O870494
17677F1084125j376561n714139n395396r52750N086352Q838896N704287l795881
17669F3478933j0912133j2968380j1138384p547873m639455k898689j959409j347832
17661A0066778r95011p19542m77841l13208k34376k22048j28400o1172n8653L6605
$$ y = [1669177, 1655219, 1691248, 1753109, 1754552, 1773100, 1781624, 1865080, 1939800, 2027076, 2051684, 2057119, 2115370, 2148227, 2171156, 2210382, 2210250, 2268807, 2350045, 2512891, 2654073, 2726074, 2908197, 3020174, 3140440, 3285131, 3450238, 3553887, 3639974, 3712784, 3867379, 4052091, 4264986, 4458660, 4704123, 4873349, 5080389, 5346276, 5758940, 6426831, 7271481, 8272892, 9574870, 11333323, 13873544, 17626131, 23176148, 31311349, 42248696, 54213631, 61084125, 59707564, 53993425, 48598029, 47645279, 52731631, 61570527, 67274814, 63478933, 52566800, 39598420, 28460036, 20912163, 16272708, 13374019, 11414610, 10066778, 9071767, 8352225, 7874384, 7561176, 7326800, 7104752, 6976352, 6915180, 6856527, 6893132]
17651F893132J26911R3299J44738J80771K26380K74036L51791M58222O04410P74835
17641A0128525R74119J343876J926881K798058M077050N905805Q749989J2693427
17633D8597730J7394509J9547268J2971442k12090q607457r304631l249787O119914
17625H3256898J2925729R756383m231281j6080311k0496359j8535705j2963634
17618C3631720q214477n306700l527720k480396j907839j514183j186193r09979
17610H584233p44149o79658n16188l61102k74935j57030o3746j12924j30850o1487
17600E482164N7121O3310j9387j4366j927O9698K27891L55412N79980J029076
17590G828972J579642K354551L502452N242563P599447R384754P125752M66855
$$ y = [6893132, 7020043, 7113342, 7258080, 7438851, 7665231, 7939267, 8291058, 8749280, 9353690, 10128525, 11102644, 12446520, 14373401, 17171459, 21248509, 27154314, 35904303, 48597730, 65992239, 85539507, 98510949, 98298859, 89691402, 80386771, 77136984, 83256898, 96182627, 105939010, 101707729, 85627418, 65131059, 46595354, 33631720, 25417243, 20110543, 16582823, 14102427, 12194588, 10680405, 9494212, 8584233, 7840084, 7160426, 6644238, 6283136, 6008201, 5851171, 5787425, 5674501, 5543651, 5482164, 5539285, 5602595, 5583208, 5568842, 5566915, 5636613, 5864504, 6219916, 6799896, 7828972, 9408614, 11763165, 15265617, 20508180, 28107627, 37492381, 44618133, 45084988]
17582D5084988m239047n187551k741551J754946N539831N454967n39677o612187
17574C8514719r123394q638025o048834l679149k343553j585403j218081q64155
17566E014125o11718m48010l02066l09408l50537k48010r1131o7469q8413q6868
17556B410495n5461L1213l4878k7296N0654J281p9447j08532j40988j28132p6250
17545A842659j04506m2288J2556n4867l7496m9644k3220J5303K9742O4162P3376
17534A725777L3482N530P0581M3615M4469Q4446L584N9918K9086K1896P1903R7470
17522B291757R3163N7848O2714J39004J95330J09951J01922J46100J47775J67169
17512C512733J82347K06806K08783K96658L15175L45927M86865N59194N57972
$$ y = [45084988, 40845941, 35658390, 32916839, 34671785, 40211616, 45666583, 45126906, 38514719, 29391325, 20753300, 14704466, 11025317, 8681764, 7096361, 5878280, 5014125, 4402407, 3954397, 3652331, 3342923, 2992386, 2744376, 2653245, 2585776, 2497363, 2410495, 2355034, 2386247, 2351369, 2324073, 2374727, 2376008, 2296561, 2188029, 2047041, 1918909, 1842659, 1738153, 1695865, 1708421, 1653554, 1616058, 1566414, 1543194, 1558497, 1588239, 1652401, 1725777, 1759259, 1764789, 1835370, 1878985, 1923454, 2007900, 2011484, 2071402, 2100488, 2122384, 2194287, 2291757, 2384920, 2442768, 2505482, 2644486, 2839816, 2949767, 3051689, 3197789, 3345564, 3512733, 3695080, 3901886, 4110669, 4407327, 4722502, 5068429, 5555294, 6114488, 6672460]
17503F672460P28988R51540J194126J617862K187075L101937M587133O689470
17495B7730591R103566J0901562J0768658R927327Q619270O555551N954191N519824
17487I5080540N131642K841840j941343m855323o479413o870077o877984q052082
17479F7977800q449189r361910j0201549r428808p744052n660518l761634k427526
17471A0942614j607299j181020q80692o61328m75065l79420k91382k58725j95433
17462E012250j09533j5575k029j1107R9633J44817J50604K27041L16421L86279
17452F198801M82552N74248P67175J082406J605336K407331L551298N238229P386442
17443B9293818R192010R410215Q817345Q007344N997283N130574M834788M187164
$$ y = [6672460, 7401448, 8352988, 9547114, 11164976, 13352051, 16453988, 21041121, 27730591, 36834157, 47735719, 58504377, 68431704, 77050974, 83606525, 89560716, 95080540, 100212182, 103054022, 101112679, 96257356, 89777943, 82907866, 76029882, 67977800, 59528611, 50166701, 39965152, 30536344, 22792292, 17131774, 13370140, 10942614, 9335315, 8154295, 7273603, 6612275, 6137210, 5757790, 5466408, 5207683, 5012250, 4902717, 4887142, 4885113, 4874006, 4973639, 5118456, 5269060, 5496101, 5812522, 6198801, 6681353, 7255601, 8022776, 9105182, 10710518, 13117849, 16669147, 21907376, 29293818, 38485828, 47896043, 56713388, 64720732, 70718015, 75848589, 80683377, 84870541]
17435H4870541K956026r91356m170058n797523o324441o065670o723714p003021
17427E0750784p866533q776650q307952o995754n102936l377854k241416j484837
17419F596852r75687q14462p02791n30242l60656m21518l68628l01423k29404
17410A892041j24723j98732k19720j49958r4163r9863j34026j18102j12068q6059
17400E54627q5008l9945o1722p1557n6477M2865k5921l7186m1226k7632j1009
17389A39809K3701O0089M6003M431J8217J6979M4183j7712l1067K4362L7140L9615
17377D05750R437m9213p8632k1062Q830l0941l3921k1683L0974n151K9810m77
17365B43721J674l1107n9079K3687K0982R1020K1199o7302q6360J5006j3714m7922
$$ y = [84870541, 87826567, 86835211, 82665153, 76867630, 70543189, 64477519, 57753805, 50750784, 42884251, 34107601, 25799649, 18803895, 13700959, 10323105, 8081689, 6596852, 5621165, 4806703, 4103912, 3573670, 3213014, 2791496, 2422868, 2121445, 1892041, 1767318, 1568586, 1348866, 1198908, 1104745, 1004882, 870856, 752754, 640686, 554627, 469619, 429674, 367952, 296395, 239918, 282783, 256862, 219676, 178450, 150818, 139809, 163510, 223599, 269602, 274033, 292250, 309229, 353412, 335700, 304633, 328995, 366135, 405750, 415187, 365974, 287342, 266280, 275110, 244169, 210248, 188565, 219539, 214388, 244198, 243721, 245395, 214288, 155209, 178896, 199878, 290898, 312097, 244795, 158435, 173441, 159727, 111805]
17353A11805k1567q2614k9238M6219K4909k3611M957M7965k3632p6005j2917K5903
17341g826K4027l6812q616l3515M938J5028M925o043J0152J4479J5374M7773o748
17328C7136l4871q8454J1833P5758K4952K8227m913K2027m336P1654L6677M3235
17316B18925P322l9596m3206l3249K6060Q379k683P307j6184k3174M501K4692
17304A39094q358p9385l9607J9945n937K187L248o3758p999p874j8020j3302k6882
17291a06648L3943K3657Q386J2212L243k9787j2722N0216L5163o7841m7398N8511
17279c9065L3007K5390j1144r7070m5687J1315N4070n0656l5144j242L4693J6667
17267a04866J3935k169l409L0258m4057l7171n7334K3131R327k1842J9041L6726
$$ y = [111805, 90238, 7624, -21614, 24605, 49514, 25903, 30860, 78825, 55193, -20812, -33729, -7826, 16201, -20611, -29227, -62742, -57804, -42776, -37851, -43894, -33742, -19263, -3889, 43884, 37136, 2265, -86189, -74356, 1402, 26354, 54581, 49668, 71695, 67359, 139013, 175690, 218925, 226247, 186651, 143445, 110196, 136256, 144635, 141952, 149259, 133075, 109901, 114402, 139094, 130736, 51351, 11744, 31689, 25752, 27939, 31187, -32571, -40570, -48444, -66464, -79766, -106648, -72705, -49048, -40662, -28450, -25207, -54994, -67716, -17500, 17663, -50178, -97576, -39065, -6058, 19332, 8188, -88882, -134569, -123254, -69184, -119840, -154984, -156226, -121533, -104866, -90931, -93100, -96509, -66251, -110308, -147479, -204813, -181682, -172355, -194197, -175156, -138430]
17255a38430K3866k6322N729M4145K9409k3150m474j3831k9883k1335p258k0k7049
17242a88603m9713L3849O0353j402l6795L6389L2644j2511K6848L3321p1839J1151
17230a26308K9699K758j2999N8072p698m0775p1345n0758N181l4959M4893O8963
17218a35276J7969j5413K2966j2941p0183j8797K2291L3026J2853j158j9506l6280
17206b00449K8779O893j2573k4977j5553L570j6039r897M8894O3406j5855l5136
17194a78937m2894Q355R381n8352O648O2379j6184r342J4265k4921K321O417k8388
17181b49252l4136Q732o928k9516k2736N094Q7349N4422J8713M2094L9539j8857
17169a05482K9893O2628K9962n1026N457N6660K4567P110J2151R443l2525l1259
$$ y = [-138430, -114564, -140886, -135157, -91012, -61603, -84753, -89227, -103058, -132941, -154276, -161534, -161554, -188603, -238316, -204467, -144114, -145516, -182311, -145922, -113278, -125789, -98941, -65620, -137459, -126308, -96609, -93851, -106850, -48778, -56476, -97251, -168596, -219354, -214173, -249132, -204239, -135276, -117307, -132720, -109754, -122695, -192878, -211675, -189384, -156358, -143505, -144663, -164169, -200449, -171670, -164777, -177350, -202327, -217880, -214310, -230349, -240246, -191352, -127946, -143801, -178937, -221831, -213476, -204095, -262447, -255799, -193420, -209604, -218946, -204681, -229602, -227281, -220864, -249252, -283388, -274656, -281584, -311100, -333836, -328742, -241393, -186971, -168258, -126164, -86625, -105482, -75589, -12961, 17001, -34025, -28568, 28092, 52659, 59769, 71920, 81363, 48838, 17579]
17157A7579O7541R3235J4029j04904m4531l6862J1707l219n4154m6197O309n719
17145h5186p3610j8087K148O526o424N2118K3423q10M711J1819J3954K728p256
17132g3946l980J9205J6567l5364K1058L1858M4907n381k1110j8237l2367J5139
17120d1651O4486J02354L1987Q958Q521j7238J5891K8982l0231k992R2855P8430
17108C40352n5249q9056n4326k2028L9139k0130q0334j02961m634l7064l7635
17097a23926O1618O6435L5412K341l5633l1820J0958L2811m589k5434p134N796
17085a3165N784N108k7035Q250m1772k0560O655k604K5955n9328k8723k7520M0494
17072a28461L8587J9893K6004r130l3635j4417q178L4349J570K9622R0263L807
$$ y = [17579, 85120, 178355, 192384, 87480, 42949, 6087, 17794, 14575, -39579, -85776, -79467, -85186, -158796, -176883, -174735, -168209, -174633, -122515, -99092, -99902, -95191, -83372, -69418, -66690, -73946, -77926, -58721, -42154, -77518, -56460, -24602, 20305, 14924, -6186, -24423, -56790, -41651, 22835, 125189, 157176, 166134, 174655, 157417, 173308, 202290, 172059, 169067, 261922, 340352, 285103, 196047, 141721, 119693, 158832, 138702, 58368, -44593, -49227, -86291, -123926, -62308, 4127, 39539, 41880, 6247, -25573, -14615, 18196, 13607, -11827, -18961, -13165, -7381, -2273, -29308, -21058, -62830, -83390, -76735, -79339, -53384, -112712, -141435, -168955, -128461, -89874, -69981, -43977, -53107, -86742, -101159, -109337, -74988, -73418, -43796, 46467, 50274]
17060E0274o2714K114l398m9003n3940m8472k8112M920O354M0474N8320m7633
17048a30816q6190k6979M8223J6288J461N4490L5028M410n3807m0311l8806m0579
17036b57588o0095J8234K07K2048P6642M4607o097k6555p2639p053j1403J9669
17024b60023J782j7214M054k3515M2459L9756J8507m9897k6838L2882l5583K5551
17012b48079K4623J4024j0808m1285k3110M0943m231m5975K260k9821L1299J4084
17000b76076j3702J5942J9783o998m404p4L3664P8777N6889q159m9692j8049J0424
16987a61675l1040M8254K0625O2261k0297n0436J9464M3406P5719J37132N9513
16976B02926n7812L9713R1324R366j1497K9286l7447o0080n5607r6705p0160m3782
$$ y = [50274, -12440, -10326, -13724, -62727, -116667, -165139, -193251, -188331, -181977, -141503, -83183, -130816, -217006, -243985, -195762, -179474, -178013, -123523, -88495, -84085, -137892, -178203, -217009, -257588, -317683, -299449, -299242, -277194, -200552, -155945, -162042, -188597, -261236, -268289, -279692, -260023, -258241, -275455, -271401, -294916, -252457, -212701, -194194, -244091, -270929, -238047, -273630, -248079, -223456, -209432, -220240, -261525, -284635, -243692, -247923, -293898, -291638, -321459, -290160, -276076, -289778, -273836, -254053, -261051, -265455, -265529, -231865, -153088, -96199, -104358, -154050, -172099, -161675, -192715, -144461, -123836, -61575, -81872, -132308, -112844, -69438, 6281, 143413, 202926, 145114, 184827, 276151, 285517, 274020, 303306, 265859, 205779, 150172, 53467, -16693, -60475]
16964f0475r8304j4239N087J9957m1835j0652J0564K5771l3778p0289j6720N7938
16952b26975Q1410K9741Q053j1593q307m5478j3123j1056l7910j9235l43R181
16940b45635K2368q464k5301r623N2712J9865k5252K7943O469K9091R8700M0487
16928a6640J813M5724k4947M5608L4082M3224K8883k6627q3608J6089l5497n0542
16916b2438J4429k047q7122m3414m7021J5857P328J9395M0501m0409j0106m692
16904a59739j26j2818j3324L232k4602j2068j1362n6156o260O0900n5505j4358
16892c02186O5343J19951M7193J8896L2857n436n9505k9100k1344k8914l4805
16881a97050k816m7617l2870o193K9782L9163j0822p2014l744M4798Q3376r59
$$ y = [-60475, -158779, -173018, -167931, -147974, -189809, -200461, -189897, -164126, -197904, -268193, -284913, -226975, -145565, -115824, -107771, -119364, -127671, -173149, -186272, -197328, -235238, -254473, -254816, -245635, -223267, -231731, -257032, -266655, -213943, -194078, -219330, -191387, -184918, -155827, -57127, -16640, -14827, 30897, 5950, 51558, 85640, 128864, 157747, 131120, 47512, 63601, 28104, -22438, -8009, -10056, -97178, -140592, -187613, -171756, -164428, -145033, -104532, -144941, -155047, -159739, -159865, -172683, -186007, -182775, -207377, -219445, -230807, -286963, -293223, -232323, -287828, -302186, -236843, -116892, -69699, -50803, -17946, -23382, -82887, -111987, -133331, -162245, -197050, -199866, -247483, -280353, -286546, -256764, -217601, -228423, -300437, -304181, -259383, -176007, -176966]
16869a76966j0882j2370l4655j7274M9366j7925p5451m5669M4373M5979j7517
16858b68991l0734J7915K3327K6938n0651m6588j2572J2932M8373j127K954J6644
16846b61580M374Q773l20k2673l2294Q750l6552j4792J3720O380J9814O3566J1499
16833b31335l9199k2061L5594q058k2428j4394J7309N118P509L8789K1935j4927
16821b26148k9664l7151o1954J5384J6874K4467j2899K966R207k7180O482r155
16809c28771p08P0354l5618m3399Q169R7297R0874n2932j06308j5339P7501K3188
16797b15692n4030J5811O3739o094j6432J3141o4495j2303O2735l7721p269l011
16785b61621J3952j6297K2378J2728o3754j6510k4609m9187M1317j0158J1065
$$ y = [-176966, -187848, -200218, -234873, -252147, -202781, -220706, -296157, -341826, -297453, -251474, -268991, -299725, -281810, -258483, -231545, -282196, -328784, -341356, -328424, -280051, -281178, -278224, -261580, -257206, -248433, -248753, -271426, -303720, -294970, -331522, -346314, -332594, -326214, -306400, -242834, -231335, -270534, -292595, -257001, -265059, -287487, -301881, -284572, -279454, -271945, -233156, -211221, -226148, -255812, -292963, -354917, -339533, -322659, -298192, -311091, -308125, -298918, -326098, -319616, -328771, -329479, -259125, -294743, -338142, -329973, -232676, -141802, -194734, -301042, -316381, -238880, -215692, -269722, -253911, -190172, -196266, -212698, -199557, -264052, -276355, -213620, -251341, -258610, -261621, -247669, -263966, -241588, -228860, -292614, -309124, -333733, -382920, -341603, -351761, -340696]
16774c40696M5758L1254n9041L2149J1162j5004k9865O1488K5755j1237m2146
16763b90423l9589J1635O8201M9216o9016m6921J3720Q3524k6577N0773L058j4530
16751b06929n1620m6252Q0973k613p1856k0342N5362N5111L6314k1569k7432l155
16739b24008m1054o003O2833j6603P48j6181l9438j4217J2698M2371M1983K0497
16727a76374o2639r7481j5556L0990N4186K8174j5980l9129K8019J7245j5456
16716b64001j1985M2256J5856o2681n315N4987K1023Q498k1132k2921m509K7502
16704b22422L1344o7646o5927j0102Q2277P4874L466p5688r6870N3834N3179l2749
16692b72430l25k1590J4173M263m5875m2676j6920K4962K7230Q19L5472K1367
$$ y = [-340696, -294938, -263684, -322725, -290576, -279414, -294418, -324283, -262795, -237040, -248277, -290423, -330012, -318377, -250176, -200960, -269976, -316897, -303177, -219653, -246230, -195457, -192399, -206929, -258549, -304801, -223828, -226441, -298297, -318639, -263277, -208166, -171852, -193421, -220853, -224008, -265062, -271065, -208232, -224835, -224087, -240268, -279706, -293923, -281225, -238854, -196871, -176374, -239013, -336494, -352050, -321060, -266874, -238700, -254680, -293809, -265790, -248545, -264001, -275986, -233730, -217874, -280555, -285870, -230883, -209860, -201362, -222494, -245415, -249924, -222422, -191078, -258724, -324651, -334753, -252476, -177602, -174136, -249824, -346694, -292860, -239681, -272430, -272755, -294345, -280172, -275909, -321784, -364460, -381380, -356418, -329188, -328369, -292897, -271530]
16680b71530N072o4644R669O3817J0616j1950J8234o44L0141J0798n5504l7390
16668b93315k238M0000J7260k7619L1171j4683m8830j1135j9056j8128O7196L0423
16656b48954N738n921p3059l7991j544N4339N3639o326Q44J5525K5267K0560L6440
16643a61443r533m3117l1758Q144J7854R446n2958k6907K600M6897K7058J0926
16631b02791P2305L7785j2255k5860l1138m9534k7656J2350K0701n3790k4367
16620b84250o737J7908m7924m1332L3316O6787k4832k7355k0176L2411J2778M4242
16608b45164O723J0412J2774l1007j4959J341L5927l502l0929M0168N9119n6670
16596b15767m5673L2794O4691K988J7890k9730k7097l5148o2476L6916K7854J206
$$ y = [-271530, -266458, -331102, -321433, -257616, -247000, -258950, -240716, -241360, -211219, -200421, -255925, -293315, -295553, -255553, -238293, -265912, -234741, -249424, -298254, -309389, -328445, -346573, -279377, -248954, -243216, -249137, -322196, -360187, -361731, -307392, -253753, -260079, -259235, -243710, -218443, -197883, -161443, -170976, -214093, -245851, -237707, -219853, -210407, -263365, -290272, -287672, -240775, -213717, -202791, -130486, -92701, -104956, -130816, -161954, -211488, -239144, -226794, -206093, -259883, -284250, -290987, -273079, -321003, -362335, -329019, -262232, -287064, -314419, -334595, -302184, -289406, -245164, -238441, -228029, -215255, -246262, -261221, -259880, -223953, -227455, -258384, -218216, -159097, -215767, -261440, -228646, -163955, -160967, -143077, -172807, -199904, -235052, -297528, -260612, -232758, -231552]
16584b31552N091L0658J498J8824K838p849l6411p2577j4946l3484J5509N0476
16572b71925K0606M1805L4174k4300o3865q3987o124L7817M0937J3797j1339j4616
16560b87020K3371J1146M653M0680M5331n1835k2584k3894M4508M5106l8656O299
16548b02895l4154p6460o888L5798J1441n5337j3248M6086Q515J9738O0866N7160
16536a49378m945p6175N1238O5732n3272j00157j9081J1703K9801L1963k4806
16525b37377J9002J980q213j7478L6437l7179P802k5011o979K843j1065K982j6043
16512b88299J9811K6323l388Q668m1345j5357N1158O5113j3573j8328J4052K3139
16500a72026l7611J6853O8822k5557j00847j314P2667K9958L827L044m0627q2378
$$ y = [-231552, -226461, -195803, -194305, -175481, -172643, -180492, -216903, -289480, -304426, -337910, -322401, -271925, -251319, -209514, -175340, -199640, -263505, -347492, -353616, -315799, -274862, -261065, -272404, -287020, -263649, -252503, -247850, -207170, -161839, -213674, -236258, -260152, -215644, -170538, -209194, -202895, -237049, -313509, -320397, -284599, -273158, -328495, -341743, -295657, -287142, -267404, -206538, -149378, -154323, -230498, -179260, -113528, -166800, -266957, -286038, -274335, -244534, -212571, -237377, -218375, -216395, -224608, -242086, -205649, -242828, -235026, -260037, -267016, -264173, -275238, -272256, -288299, -268488, -242165, -245553, -236885, -278230, -293587, -242429, -177316, -190889, -209217, -195165, -172026, -209637, -192784, -123962, -149519, -250366, -251680, -179013, -149055, -145228, -142184, -182811, -265189]
16488b65189M0026L202J1138j1937J3236O997O742K2563n2463l7581n0854k0684
16476c34804j6557j412L4117P6294K5184o0862p3080K0852N5701J5451O691Q893
16464b43532O2449L1039l6907m1762L1054m2802o4969r645j4825M6995L7819k3947
16452b69033r900M6499M7629J4079m4307J5346J9729l7316l2435O5220K8673K872
16440a52944k9484M2861Q885K7905M2040n566o2803m1543K1157j7650L7456L7835
16428i1851r029j2828M5933L9364Q1039m127K5743k987l7489n2263n1589j4061
16416h4145m6982n8434l9383k2702N7882M5267l9149R678j0953j1012O0163J6599
16404a23171k528K0940L902m8098n3155n4756l0829k90M7910M7434j6454o3241
$$ y = [-265189, -225163, -221961, -210823, -222760, -209524, -202527, -195785, -173222, -225685, -263266, -314120, -334804, -351361, -352773, -318656, -242362, -217178, -278040, -351120, -330268, -274567, -259116, -252425, -243532, -181083, -150044, -186951, -228713, -197659, -240461, -305430, -315075, -329900, -282905, -245086, -269033, -278933, -232434, -184805, -170726, -215033, -199687, -179958, -217274, -249709, -184489, -155816, -152944, -182428, -139567, -130682, -102777, -60737, -66303, -129106, -170649, -149492, -167142, -129686, -91851, -100880, -113708, -67775, -28411, 52628, 48501, 74244, 71257, 33768, -18495, -70084, -84145, -131127, -189561, -228944, -251646, -193764, -148497, -187646, -177968, -188921, -199933, -139770, -123171, -125699, -104759, -100857, -148955, -202110, -256866, -287695, -287985, -240075, -192641, -209095, -272336]
16392b72336M6976N5497j7181k468L2993P4073J909k6339m1689k4530o2414j5480
16380b50989L746K9948j6608l5547M0095O5929L0654O7781Q0291l0704o8310m1962
16368a25676L3036k0915j280q847K5383n2000q456Q7223J7828j0242p360K0978
16356e0328K8525K1334R9278J08456J59760J69574J34371J57448n357m5975j88146
16345E88940k19533j53339r0236l956m8369l4309m0138j4339k4144R24k1305J2382
16333d7422M523o4200o7935K2582R6208K1271n6585p9m9111l5278J8011k4656
16321a82671L2137m0718q9077M5978M5628n6322M7234L865k874P605O515L4692
16309a48008J354j1525k7412J9828Q9066M0225q7685j03823m5678N2648K0547
$$ y = [-272336, -225360, -169863, -187044, -189512, -156519, -82446, -80537, -106876, -148565, -173095, -235509, -250989, -247243, -217295, -233903, -269450, -229355, -163426, -132772, -64991, 15300, -15404, -83714, -125676, -92640, -113555, -114835, -123682, -98299, -150299, -158755, -71532, -53704, -63946, -71306, -50328, -21803, -469, 98809, 207265, 367025, 536599, 670970, 828418, 823061, 777086, 588940, 369407, 216068, 125832, 121876, 73507, 39198, -940, -15279, -39423, -38499, -59804, -47422, -42899, -107099, -175034, -152452, -56244, -34973, -91558, -91637, -140748, -176026, -158015, -182671, -150534, -191252, -280329, -234351, -188723, -245045, -197811, -193946, -196820, -189215, -182700, -148008, -146654, -158179, -185591, -165763, -76697, -36472, -124157, -227980, -273658, -221010, -200463]
16298b00463P8934j8501m3393k6230o4226j0321K4799J7615J8739M7292o595j0148
16286a92498Q3116k834n471m4029m3344l5158J8668J3190M4856L0648P66m3449
16274a75539l8219l4177K740L3999O7198L3902M0925K231l9729k2217p2105J3529
16262a87462l1965Q5039M53k7992k36J4177k0386P172j7381l3834l8522j1552
16250b62489L9461L5873r1929n381P389j6086K5572R948O004Q0229N6224M6827
16238f8358m0462m7529J0540m3460k9466q42J5202m6730o1587m342j9892J030
16226c35896J4481M8459L873N7313M8387L2099K7190L6340O547l8807j0035j949
16214a11998o2055o7625M0271L4731J8214o6297K645L6965J0186j1371N2447K3034
$$ y = [-200463, -121529, -140030, -183423, -209653, -273879, -284200, -259401, -241786, -223047, -175755, -182350, -192498, -109382, -112216, -117687, -161716, -205060, -240218, -221550, -208360, -163504, -132856, -132090, -175539, -213758, -247935, -245195, -211196, -143998, -110096, -69171, -66940, -106669, -128886, -200991, -187462, -219427, -134388, -133935, -161927, -162163, -147986, -168372, -161200, -178581, -212415, -250937, -262489, -223028, -187155, -279084, -284465, -277076, -293162, -267590, -257642, -251638, -171409, -115185, -68358, -108820, -156349, -145809, -189269, -218735, -219577, -204375, -251105, -312692, -317034, -336926, -335896, -321415, -272956, -269083, -211770, -163383, -131284, -104094, -67754, -61207, -100014, -110049, -111998, -174053, -241678, -201407, -166676, -148462, -214759, -212114, -175149, -164963, -176334, -123887, -100853]
16202a00853j2977j4231k7748K7056L3146o331l8406O1576N1455o1127k5103m1819
16190a55362l46L907M919l5537n7330l6317j5413K9363l0203j6578M1635P2896
16178a94366K3673J6609J090k9457M4349M911m668J5453J993k4764o7531k8338
16166b41046O3908R971q2403m3663L6094M648P5077L4830J1783O6612k6958q8723
16154a79870j8465L6981J0752k3287M2395n7592k3462J7032O0891k9592J3715
16143a50502L5301j6850l343j6692J3824O2897K7009K6297M1859J20587J82183
16132C22570J65371J14178J6671j32746j40744j69433r7253l2207o1723l3819
16122d9135n4368o4871k3754L3656J2050L064o3774M4376J15746L6281j095p8180
$$ y = [-100853, -113830, -128061, -155809, -128753, -95607, -101938, -140344, -78768, -27313, -88440, -113543, -155362, -155708, -151801, -146882, -182419, -239749, -276066, -291479, -262116, -292319, -308897, -267262, -194366, -170693, -154084, -152994, -182451, -138102, -133191, -137859, -122406, -120413, -145177, -212708, -241046, -177138, -167167, -249570, -293233, -257139, -252491, -177414, -142584, -130801, -64189, -91147, -179870, -198335, -161354, -150602, -173889, -131494, -189086, -212548, -195516, -134625, -164217, -150502, -115201, -132051, -135394, -152086, -138262, -75365, -48356, -22059, 19800, 140387, 322570, 487941, 602119, 618790, 486044, 345300, 175867, 78614, 46407, -15316, -49135, -103503, -168374, -192128, -158472, -146422, -143358, -207132, -162756, -47010, -10729, -11824, -90004]
16110i0004p3887L592P0154M4550j0714j7510J478L9507k3248j30608o0862K4317
16098b23235J16755O1328r356l384K290n7356n3197p17K7522k9549N016O5952
16086i7931r636j6857P172l6162k3290N695N4038N322r029j6791m665k5425L1986
16073a35573k1105j8606K2311J2533m6092K5070j588l6869N0660j048l7778m0807
16061b28892o073L1715M0261O634N3283m757j7631N069j1358J4027m1984k6212
16049a85918J4011L0742J7685o029m9366m2443j5568N6521Q8213Q335l8070k6344
16037a48231L5797j6943K105j615j062m2378p2229o5909N4392J9567L3323K4360
16025a78823m8387o4894N0797P6408j8081j2064M6683K7551J5857l6884j6395
$$ y = [-90004, -163891, -160299, -90145, -45595, -56309, -73819, -72341, -32834, -56082, -186690, -247552, -223235, -106480, -45152, -54508, -57892, -55602, -112958, -166155, -166872, -139350, -168899, -163883, -97931, -107567, -124424, -117252, -153414, -176704, -171009, -116971, -111649, -120678, -137469, -142134, -167559, -135573, -156678, -175284, -152973, -140440, -186532, -161462, -163050, -199919, -149259, -150307, -188085, -228892, -234965, -203250, -162989, -156355, -103072, -107829, -125460, -120391, -131749, -117722, -159706, -185918, -171907, -141165, -123480, -129509, -178875, -221318, -236886, -180365, -92152, -83817, -121887, -148231, -112434, -129377, -127272, -128887, -129949, -172327, -244556, -310465, -256073, -236506, -203183, -178823, -227210, -292104, -241307, -164899, -182980, -195044, -148361, -120810, -104953, -141837, -158232]
16014a58232k519k0120l644L7561R847J7316j154o3222q8423M0071M0617N768
16002a86134l5034J2648L1203J147k1769M5325L4890J5455K298R327L7320n2555
15990a05879q9589n7845J0558o112K9315N1962K4475k6857O97j5850M3286M166
15978a37673M5962N416j8455o0426o3289l8072m618L3629P1844q22j8942n7198
15966b42644J1293j2238j2181j9794K9968M7941K0094K274k0183l1227r402L3411
15954b02688P5275L1229k5037m8926k6604j1844N7897N0924k186j6115j9060m4849
15942a81984k0091j4970j1291k1276k1335M8454N399P021J6714N875k807J8741
15930a71550J0130K473J6097l9507m718J9056J8558K0187k0233n3246l6437k7453
$$ y = [-158232, -160751, -180871, -184515, -146954, -137107, -119791, -120945, -184167, -272590, -232519, -191902, -186134, -221168, -208520, -177317, -176170, -197939, -152614, -117724, -102269, -99971, -90644, -53324, -105879, -195468, -253313, -242755, -248867, -219552, -167590, -143115, -169972, -169275, -185125, -141839, -137673, -91711, -86295, -104750, -165176, -228465, -266537, -271155, -237526, -165682, -166504, -185446, -242644, -231351, -243589, -255770, -275564, -245596, -197655, -177561, -175287, -195470, -226697, -236099, -202688, -127413, -96184, -121221, -170147, -196751, -208595, -150698, -99774, -101960, -118075, -137135, -181984, -202075, -217045, -228336, -249612, -270947, -222493, -217094, -210073, -193359, -187484, -190291, -171550, -161420, -158947, -142850, -182357, -187075, -168019, -149461, -129274, -149507, -202753, -239190, -266643]
15918b66643p272P4806N6447m6138j980K5530R395k8037J7637j5660K1086j598
15906a62427p089k3850k1499k7558k594j1951J2368L7204K0965kK9273q989J4615
15893a51534K3213L0308k6416m8282k398N4268P4820m2881n0792j3057k2801M2519
15881a33033p5967k9417j9281J9592P8384j0314k1194p878L3988J8828j3745k7074
15869a87111K1430M6552l4159m9985l9907j7375K2082J01351R6612j7682j11423
15858a69615L262n425l4860q713J1951M4360K9224N459m913k8206k7734j7660
15846b02870N1968l0440J3944P175l8938j8882L9802L9978r657K1660o928l109
15834a36297l189N3277L5867n6960o5722k5311Q8258L1236L8190l0523q3829K2858
$$ y = [-266643, -273915, -199109, -142662, -188800, -190780, -165250, -155855, -183892, -166255, -181915, -160829, -162427, -169516, -193366, -214865, -242423, -245017, -256968, -244600, -207396, -186431, -186433, -157160, -166149, -151534, -128321, -98013, -124429, -172711, -175109, -120841, -46021, -88902, -139694, -152751, -175552, -133033, -209000, -238417, -257698, -238106, -159722, -170036, -191230, -199108, -165120, -146292, -160037, -187111, -165681, -119129, -153288, -203273, -243180, -260555, -238473, -137122, -40510, -58192, -169615, -166353, -171778, -206638, -215351, -203400, -159040, -129816, -124357, -129270, -157476, -185210, -202870, -150902, -181342, -167398, -160223, -199161, -218043, -178241, -138263, -147920, -126260, -133188, -136297, -139486, -86209, -50342, -107302, -173024, -198335, -110077, -78841, -40651, -71174, -155003, -132145]
15822a32145M3800k0102K4822J1499J7481n6737K0659L4698l0156n1400p516J6721
15810a28376K8511n1266l9297j4272L0084k9038J9028m8367o0880N7276j360L5221
15798b02736N4218M4713n21M4747K8991p3224n211M1739R028l4731p4513n3395
15786b20895M098P0654M3464M0988L1722j2349l3740l4009m421J7344J2378J657
15774h3109q354k445P822L6838n5061l4170n400n6737j0250Q4872M9877l0188
15762a06305K6311K7943P636O482m7275l0558m2363n170M7973L8034N3702P2745
15750D9155N8677j1134n2365l2504j5985j8849n6994l5195k5846p177o996L7397
15738a17816k3315q344J2856k574j0017J391n9J8619l6235P526K5514L1366M5674
$$ y = [-132145, -88345, -108447, -83625, -72126, -54645, -111382, -90723, -56025, -86181, -137581, -145097, -128376, -99865, -151131, -190428, -204700, -174616, -203654, -184626, -232993, -293873, -236597, -237957, -202736, -148518, -103805, -104326, -59579, -30588, -103812, -109023, -67284, -58256, -92987, -167500, -220895, -216797, -146143, -102679, -61691, -29969, -42318, -76058, -110067, -114488, -97144, -84766, -83109, -91463, -93908, -86086, -49248, -104309, -138479, -143879, -200616, -210866, -125994, -76117, -106305, -79994, -52051, -44415, -37933, -85208, -115766, -158129, -163299, -115326, -77292, -23590, 49155, 107832, 96698, 44333, 11829, -4156, -23005, -79999, -115194, -141040, -148217, -155213, -117816, -141131, -149475, -136619, -139193, -149210, -147819, -147878, -129259, -165494, -157968, -132454, -101088, -55414]
15725e5414j1773n4252L5313L2621k0228M6020K7312n9467k1090N1406Q6722j7403
15713C9767j07214p2336q753N9923K0319j6995l5670k3072r430o236j7177j2313
15701a89187K9676P6089k9403m4693k0758k783L0853L6877k8523m8358j1340M9204
15689a52346R877O328l2212l3035M1213Q7320P6334k8592p2176j6490K5710l4387
15677a22456K2183q464q726k2891j5574k1390L0660K0376o916j2812L5170l7493
15665a48333r698m1448J486P9886N180n4260l7209j0644K1898K0375J1904N0659
15653a10204M8636m615r831k293k5877j8481P8370m8198j02188J4112K4277L4089
15641a22203P7587M3616n1920m9772p2165R735K385j3688R322m7140J1584K6792
$$ y = [-55414, -67187, -121439, -86126, -53505, -73733, -27713, -401, -59868, -80958, -29552, 57170, 39767, -67447, -139783, -148536, -88613, -68294, -85289, -120959, -144031, -153461, -159697, -176874, -189187, -159511, -83422, -112825, -157518, -178276, -181059, -150206, -113329, -141852, -190210, -201550, -152346, -142469, -136141, -168353, -201388, -160175, -72855, 3479, -25113, -97289, -113779, -88069, -122456, -100273, -108737, -117463, -140354, -155928, -177318, -146658, -126282, -133198, -146010, -110840, -148333, -158031, -199479, -197993, -118107, -112927, -167187, -204396, -215040, -193142, -172767, -160863, -110204, -61568, -66183, -76014, -78307, -104184, -122665, -44295, -92493, -194681, -180569, -156292, -122203, -44616, -1000, -52920, -102692, -174857, -165122, -162737, -176425, -167103, -214243, -202659, -175867]
15629a75867k0656R587K784l5609K650K870m5850J1122J9927N1355K9797R992
15617a37898M911J5629K7238j8449l9104K1741M7593k407L9595M5249j185q3132
15605h0219p9693J8627M3866r8o0551q4019P5591n5K2282L0686K355l5205N7510
15592h8923Q0722l242l4061k9904j7852k3614Q0044M8504m8163n8475n8004o1878
15580b14846J3871M2963R470J141m273J0012J19854J2044r905k0429l4301J5931
15568e8468n0951l1620L0478k8731j3105K2525L5581n8026k013M0006k1719N6720
15556g9323M8782J5405o6254n6172L2702J3731p8037k0143M5677K9202k8282j4821
15544a57533N0270Q1307N0045j1005O7137L9009k078j08703n1747k7419P718J9895
$$ y = [-175867, -196523, -186936, -184152, -219761, -217111, -214241, -260091, -248969, -229042, -177687, -147890, -137898, -132987, -117358, -90120, -108569, -147673, -125932, -78339, -80746, -41151, 4098, 2913, -80219, -159912, -141285, -97419, -97517, -158068, -242087, -166496, -166551, -144269, -113583, -111228, -146433, -88923, -8201, -11443, -45504, -75408, -93260, -116874, -36830, 11674, -36489, -94964, -152968, -214846, -200975, -158012, -148542, -147401, -151674, -141662, -21808, -9764, -19669, -40098, -74399, -58468, -109419, -141039, -110561, -139292, -152397, -129872, -94291, -152317, -154330, -114324, -136043, -79323, -30541, -15136, -81390, -137562, -104860, -91129, -169166, -189309, -143632, -114430, -142712, -157533, -107263, -25956, 24089, 13084, 80221, 119230, 117152, 8449, -43298, -70717, -62999, -43104]
15532d3104K6231K8658m5182l7112M682j1355K8361J2634O40l8753l4189M7242
15520f1247J2630K8189N5596J982l3179m2742k4345K2705L9372l7723K4499L3635
15508A9372m5351m4816J1056k4656m6313L4525M4009m1355n0296l5909P8405O4383
15496c6946J6617J7481k6964o295q91L595j3121O743j740j1176l1118J4370J2214
15483e7231k8748n106P269J4728N1774R393n0099k8858k436j5881O911l7452K7098
15470a08638K3825K3236J2068N962r198j7644O9871Q8696m7517j9824l715o6947
15458d9825k9887K1471M2884l4584j3372M7953O266K850n8279M715M3193j7325
15446c3940K7372N556j3151m1203k286p748K1126J3554q856j0392K4168j5444
$$ y = [-43104, -16873, 11785, -33397, -70509, -65827, -77182, -48821, -36187, -35547, -74300, -108489, -61247, -48617, -20428, 35168, 37150, 3971, -38771, -63116, -40411, -1039, -38762, -14263, 19372, -25979, -70795, -59739, -84395, -130708, -96183, -52174, -93529, -143825, -179734, -101329, -36946, -20329, -2848, -29812, -36107, -36998, -33403, -46524, -39781, -41521, -52697, -83815, -69445, -57231, -85979, -91085, -83816, -69088, -17314, -7921, -58020, -86878, -89314, -105195, -98284, -135736, -108638, -84813, -61577, -49509, -43547, -52745, -70389, -518, 88178, 40661, 20837, 17122, -49825, -79712, -58241, -15357, -49941, -63313, -15360, -9094, -6244, -64523, -59808, -16615, -33940, -6568, -1012, -14163, -55366, -57652, -65400, -44274, -30720, -39576, -49968, -25800, -41244]
15434d1244j5260k2130J3590j8470k0375j0296k4892Q093K999M3532J0929o3325
15422a36849q248L2354K324M2932K3264J029l0863Q836N5716o8721m645N3263
15410b9608m080J3961l7735l0533p718K4301K2319j0062l8636L0631n690j27l281
15397g6258j9166o5825n3410J3991O8932N4605L0527k2090j4824J8591l641O0929
15385g639o8564j05218L7301N3211n0828N5805L9357k2092K253n7978J5068L3572
15373g5752L8391O1737j4919n7828k3905J4737K7567k8159p0506K1410K0539L7299
15361d9389O8995Q281l1762q0081J9437L4987j5652k0136l9087n1055o838J1845
15349a50455J01499K8918k7913M0049m290j4333n4657q9633K6544L6096N1031
$$ y = [-41244, -56504, -78634, -65044, -83514, -103889, -114185, -139077, -130984, -127985, -84453, -73524, -136849, -145097, -112743, -110419, -67487, -44223, -43194, -74057, -65221, -9505, -78226, -82871, -29608, -33688, -19727, -57462, -87995, -95713, -71412, -49093, -59155, -97791, -67160, -72850, -72977, -76258, -95424, -161249, -214659, -200668, -131736, -77131, -46604, -68694, -83518, -64927, -68568, -7639, -76203, -181421, -144120, -90909, -141737, -85932, -46575, -68667, -66414, -124392, -109324, -75752, -37361, 24376, 9457, -48371, -72276, -57539, -29972, -58131, -128637, -107227, -86688, -49389, 19606, 27887, -3875, -83956, -64519, -29532, -45184, -65320, -104407, -155462, -162300, -150455, -48956, -20038, -47951, -7902, -12192, -26525, -81182, -170815, -144271, -108175, -57144]
15338e7144N6870p88q2008L1381Q9619J7469k8924l0298k3135j1255k5892k0767
15326h4872N873K794L6779N491l0375L2504M1274r953k4051m5757q067j7081K479
15313i2962J0903m4534j8833q442J1947P7513O7894l6503j742L6499k1240q1309
15301a00809L0631P6403Q974k2419L5853n3067l248M7894K0543o2808J3789o086
15289a4350j3785l104j7733q0706q1954M9239J05479K375j2926J5706k164l7334
15277i1257m3315M0090J03522j9383j6920p2623r223J5662n1829k5376P922M7053
15265a15677P890O928L8481j6896k8827M3915K0531l1222l6611J3905K3506r542
15253h3619J6471j479J4933k170j4454P899o590n1386L6137M6553n2971j7573
$$ y = [-57144, -274, -1062, -83070, -51689, 37930, 55399, 26475, -3823, -26958, -38213, -64105, -84872, -78999, -76205, -39426, -33935, -64310, -31806, 9468, -485, -24536, -70293, -78360, -95441, -92962, -82059, -126593, -145426, -153868, -141921, -64408, 3486, -33017, -34759, 1740, -19500, -100809, -70178, 6225, 15199, -7220, 28633, -24434, -27682, 20212, 40755, -22053, -8264, -14350, -28135, -31239, -48972, -129678, -211632, -162393, -56914, -54539, -67465, -51759, -53923, -91257, -134572, -94482, 9040, -10343, -27263, -99886, -109109, -93447, -145276, -170652, -162730, -115677, -107787, -100859, -62378, -79274, -108101, -64186, -43655, -74877, -111488, -97583, -74077, -83619, -67148, -68627, -53694, -55864, -70318, -62419, -69009, -120395, -84258, -37705, -90676, -108249]
15241a08249O813O4882P4872K4388o506K0806l707m6369m7376Q034o745n2027
15229g1184l799q288O227o0736M257K1548k240l5003N3551L9223J2343L65m8465
15216i2201n267O0057J8107l0230k9533j593j2161l3598M883O7711M5737J8564
15204A0476M9083j293o7295M175j186N4941N390o6485K0763k4737j8846k459N3997
15191A6524K7563r602l4645M1829j5883o1835p145J4872l4146o006Q776O0633
15179I35m473r385J9796R966J6923K3032j6960m3315m2655L6905J4522R066j3168
15166A189r3102N602k676N0757K7898M54M165j767K5918N2541k5969m7059l1483
15153c3532J754l6333l0035j4077L8957K10M4357K6775J6762J4433J1383J1k7565
$$ y = [-108249, -101436, -36554, 38318, 62706, 56200, 77006, 73299, 26930, -20446, -12412, -19157, -71184, -74983, -83271, -77044, -137780, -133523, -111975, -114215, -149218, -95667, -56444, -44101, -43736, -92201, -97468, -37411, -19304, -49534, -79067, -80660, -92821, -126419, -121536, -53825, -8088, 10476, 59559, 58266, -9029, -4854, -6040, 48901, 54291, -12194, 8569, -16168, -35014, -37473, 16524, 44087, 34485, -160, 41669, 25786, -36049, -43194, -28322, -62468, -68474, -59698, 935, -3538, -12923, 6873, 16839, 33762, 56794, 39834, -3481, -46136, -9231, 5291, 14357, 1189, -91913, -86311, -88987, -38230, -10332, -9878, -5713, -7480, 18438, 70979, 45010, -2049, -33532, -31778, -68111, -98146, -112223, -73266, -73056, -28699, -1924, 14838, 29271, 40654, 40665, 13100]
15140A3100R135l400k8275k8575M0946J5167j3962K0742R702j0909r5109j0376
15128h1814k2298J6640Q4046k6371k5862J3357K6627P274j4635j5821n315K369
15116d1803j0245n3309l5505K1299l213J6501L9166K7970J1217o884J3043P855
15104a3908l9963l8244l8449K9241N1984Q6254k2190r150m7211P365J8972l409
15092a8708l6972m6674J7330n86j8348O6J5822O3286O1651M0937j5226k7001k8153
15079G424K498j1243k6853n7960J3189l5775J8559Q0118j4919J7235M1698n2181
15067a8210m6201l7928L2763P6289l1892j3786O6477j5382k1686R246k2711l8466
15055f1487j9139J0202J917l1781J7480O5172M9457K308m7940L1884M514o1639
$$ y = [13100, 22235, 18835, -9440, -38015, 2931, 18098, 4136, 24878, 34580, 23671, -71438, -81814, -104112, -87472, -3426, -29797, -55659, -42302, -15675, -8401, -23036, -38857, -44172, -41803, -52048, -105357, -140862, -119563, -122776, -106275, -67109, -39139, -27922, -34806, -21763, -13908, -53871, -92115, -130564, -101323, -49339, 36915, 14725, 5575, -41636, -34271, -15299, -18708, -55680, -102354, -85024, -85610, -103958, -103892, -88070, -24784, 36867, 77804, 62578, 35577, 7424, 9922, -1321, -28174, -86134, -72945, -108720, -90161, -10043, -24962, -7727, 33971, -18210, -64411, -102339, -69576, 6713, -25179, -38965, 27512, 12130, -9556, -310, -23021, -61487, -80626, -70424, -68507, -100288, -82808, -17636, 31821, 34129, -13811, 18073, 22587, -39052]
15043c9052L957R597P2631L4972J6830n8318M290l2413k1705m8759q370O677M1921
15030a7742N6141J2399M9976l3725n625j8118k524K3477j3356k4334J3630K6901
15018F7100K1220q7072m8522j2172r80K9295J5155N7803P958K7293K3331M9393
15006A49802n0271l4934m1241j6875K7165L7532j6976n6878j8758j8862L5904
14995d392R862L9511j1008k3465l6N8279j4034l8643p4083J2065O5623n966Q339
14982B2052m2427p935M7300K9897k8849j344J8213J5565L4567R123n8374k398
14970C5390l972j7058n3164o179K8008o248R6330M3723R787R341K1498q928j360
14957A47168l1388j4569k9900k1834j1318l8423r80K7517k8154m224P5296M0460
$$ y = [-39052, -35095, -25498, 47133, 82105, 98935, 40617, 44907, 12494, -9211, -57970, -66340, -59663, -17742, 38399, 50798, 100774, 67049, 61424, 43306, 40782, 64259, 50903, 26569, 40199, 67100, 88320, 1248, -47274, -59446, -60426, -31131, -15976, 41827, 49785, 77078, 100409, 149802, 99531, 64597, 23356, 6481, 33646, 71178, 54202, -2676, -21434, -40296, -4392, 5470, 44981, 33973, 10508, 10472, 68751, 54717, 16074, -58009, -45944, 19679, 13713, 22052, -20375, -28310, 18990, 48887, 20038, 18694, 36907, 52472, 87039, 96162, 37788, 35390, 31418, 14360, -38804, -44983, -16975, -23223, 73107, 116830, 126617, 135958, 157456, 148528, 147168, 115780, 101211, 71311, 49477, 38159, -264, -1244, 26273, -1881, -6105, 69191, 109651]
14945A09651k5346k1646o668N970L0416M0899L2642k8192l6316P633l4615k3802
14933E0626m1394N402J5683k42m5383j3148j8406K8470O8290L0874J9230o3411
14921C6591j2313P626K4207J6183m3558j8936l9844J5973N1440N0890R599q795
14909H9063o2572l4014o146L8353J9294O2540J1476J3056m0603J5075J4488k9636
14897I0374k935m9298j4199o56k260N0990J2967j5172Q130J9220k7339k06L4769
14884A04385L2253O5600J00763J3643K4344M9728J5871J8033M9000J00826K11674
14873G86120K05352J71405K61860K13577P1293K2004o2859j43073j40791k3984
14863A360904N4332J12324J01610M4244j06310j84703k53251j89774j94796j19330
$$ y = [109651, 84305, 62659, 55991, 61961, 92377, 133276, 165918, 137726, 101410, 109043, 74428, 50626, 9232, 14634, 30317, 30075, -15308, -28456, -46862, -18392, 49898, 80772, 100002, 36591, 24278, 31904, 56111, 72294, 28736, 9800, -30044, -14071, 37369, 88259, 97858, 89063, 26491, -7523, -13669, 24684, 43978, 106518, 117994, 131050, 90447, 105522, 120010, 90374, 87439, 38141, 23942, 23286, 21026, 72016, 84983, 69811, 77941, 97161, 69822, 69616, 104385, 136638, 202238, 303001, 316644, 340988, 390716, 406587, 424620, 473620, 574446, 786120, 991472, 1162877, 1424737, 1638314, 1709607, 1731611, 1668752, 1525679, 1384888, 1360904, 1415236, 1527560, 1629170, 1673414, 1567104, 1382401, 1129150, 939376, 744580, 625250]
14853F25250q1876j21423j17006n4760r512l4627k0091K4246p422p1735o3473
14842F7571k3952l3378k3361J9520N3915L9457L653l0024J7673K7538O957L7436
14830A63005N4186L5032q545j1311o1577o9807M616K8794o7901J8217J5512l2200
14818F8021j2246K2249N7179P7274q284m3832L2586k1593l3831j5793j3601p0942
14806C7187M693P1645J2579L5578l2774k5936J6093J3816l357OM106q142K5090
14793A50584K5978K0893p271p843l7209j5196J2194l1880J5468k5560M617k2543
14781H2232m4264N2182J7476l5763k9185k810l3609L1499O5998K9123L6178q509
14769A60548J9707K7746j9882l8773p3014o7224k5105L9380K9371j0927k4663
$$ y = [625250, 543374, 421951, 304945, 250185, 240673, 206046, 185955, 210201, 202779, 131044, 67571, 43619, 10241, -13120, 6400, 60315, 99772, 103425, 73401, 91074, 118612, 125569, 163005, 217191, 252223, 243678, 232367, 170790, 100983, 105599, 134393, 66492, 84709, 100221, 68021, 55775, 78024, 135203, 212477, 204193, 160361, 192947, 171354, 137523, 121730, 108129, 37187, 41880, 113525, 126104, 161682, 128908, 102972, 119065, 132881, 129524, 129530, 133636, 125494, 150584, 176562, 197455, 190184, 182341, 145132, 129936, 142130, 110250, 125718, 100158, 104775, 82232, 37968, 90150, 107626, 71863, 42678, 39868, 6259, 37758, 103756, 132879, 169057, 160548, 180255, 208001, 188119, 149346, 76332, 9108, -15997, 23383, 52754, 41827, 17164]
14758A7164M860K161M0903o922l6598r742o5065k9937M4505J00391L0156j3525
14746G8351j7968K0M4240j0087M1514Q0695N6014m8220r9130n52R088k1906M858
14733A16917P5118n4791K0779m2009j9619L1913r247j778k525n347k0840K5669
14721A14240K4746K0076L8932r369N7736l7831m6968K0392K8499k1826n434l547
14709A79646L76k7706l5394l6486K974j6853K6128l158l4363o4828j9244J02963
14697G4055M3128M8247K6113J6469N803p3016n6008K5045p11J7179p737L932M4517
14684A67016L2412K575L0666M0978j5682p97j2322J7342O2042n1821k3562k4333
14672B24514m5377Q316q002m615K9291O6917P2930P527l5187j206p0995J3207
$$ y = [17164, 22024, 24185, 65088, 58166, 21568, 11826, -53239, -83176, -38671, 61720, 91876, 78351, 60383, 60403, 104643, 94556, 136070, 216765, 272779, 224559, 125429, 124877, 133965, 112059, 116917, 192035, 137244, 158023, 116014, 96395, 128308, 119061, 117283, 114758, 109411, 88571, 114240, 138986, 159062, 197994, 188625, 246361, 208530, 161562, 181954, 210453, 188627, 183193, 179646, 180022, 152316, 116922, 80436, 83410, 66557, 92685, 89527, 55164, -9664, -28908, 74055, 117183, 165430, 191543, 208012, 213815, 140799, 84791, 109836, 109125, 126304, 118567, 122499, 167016, 199428, 202003, 232669, 273647, 257965, 257168, 244846, 262188, 324230, 272409, 248847, 224514, 179137, 187453, 179451, 174836, 204127, 271044, 343974, 351501, 316314, 315108, 244113, 257320]
14660B57320l3764k4222L9259L6558j8171K0830J00121K2268M6881P3304m790
14649E15594o8508k4855k7633R707p172P0751K3502N7882M230o4577o9968K849
14637D21802n658j5798J2911l8840p1130j07535K6580P5664j4342p2061o5798
14626A45795K4570O9394K7004J3006M918l5635j0108j5481m6206m299M6479J3728
14614B33165K3454L6222L0194J3050O4346P6641K0307l9276m7550j3144R90j3048
14602C85351l8226k9586n1177k7374N8617J0373j00886j563O0385J5046k2287
14591B58673m4086Q170K1831N7306L2278J5733j3119k5962l1081l4959l4648M4498
14579B54634J1813j6705J609J6551m0854k8056n1644K5001K5379N1264m934K4705
$$ y = [257320, 223556, 199334, 238593, 275151, 256980, 277810, 377931, 400199, 447080, 520384, 515594, 447086, 422231, 394598, 404305, 397133, 467884, 491386, 549268, 553498, 488921, 418953, 421802, 416144, 400346, 413257, 374417, 303287, 195752, 222332, 297996, 283654, 211593, 145795, 170365, 239759, 266763, 279769, 284687, 249052, 238944, 223463, 177257, 172958, 219437, 233165, 256619, 292841, 323035, 336085, 400431, 477072, 497379, 458103, 410553, 397409, 398399, 385351, 347125, 317539, 266362, 238988, 297605, 307978, 207092, 205529, 265914, 280960, 258673, 214587, 222757, 244588, 301894, 334172, 349905, 336786, 310824, 279743, 244784, 210136, 254634, 266447, 249742, 251351, 267902, 227048, 198992, 147348, 172349, 197728, 248992, 244058, 268763]
14567B68763O9239L650j2138k4086k6157N2019L2459K4320K8989j4103K5280Q5229
14555E13464j9109k9278O194M0324j9886j5923J1679j3313J963J787p948J5117
14543D85071M5744M4203l5949o5083J8965k567j727o622J5147K7358J5212j0128
14531E29624N7999O3659K0391m0789o7198r0780r9682l7738k8468l3673L8035
14520C11380N7825P3554K3559o7070j15395p6075n6387j9742P5310N2313Q327
14509B67599R6552P8471M7150O2201L3378l977j6080M6117L8934L1462j4376n7816
14497F09615q2479j350K0747P4777J13052L3461J5488J3683J6746k5399l6140
14486G52201p381M3701M2081j7562k173r611k8667n925l0306O2158Q0557K0933
$$ y = [268763, 338002, 341652, 329514, 305428, 279271, 331290, 363749, 388069, 417058, 402955, 428235, 513464, 494355, 465077, 471271, 511595, 491709, 475786, 487465, 474152, 476115, 477902, 469954, 485071, 530815, 575018, 539069, 473986, 492951, 490384, 488657, 482035, 497182, 524540, 539752, 529624, 587623, 651282, 671673, 630884, 563686, 472906, 373224, 335486, 307018, 273345, 311380, 369205, 442759, 466318, 399248, 283853, 207778, 151391, 131649, 206959, 259272, 267599, 364151, 442622, 489772, 551973, 585351, 581374, 565294, 611411, 650345, 681807, 667431, 609615, 527136, 525786, 546533, 621310, 734362, 767823, 783311, 796994, 813740, 788341, 752201, 744820, 788521, 830602, 813040, 810867, 801256, 772589, 766664, 736358, 798516, 879073, 900006]
14474I00006l9356J946O5562Q2719M1845L6734j0085k1570n81N5748q505J7329
14462A121792N7013L7428P0453R2233P1600K1217N4645K2570J4433J45434O3504
14451A772322R288M9995K9997M4578Q5863O2441N6180R8489P9873J01609L1864
14440B422499P1827Q5409Q4160O6640J18231J41944J43602J87762J37314J34521
14430C593909J66887J88362L01173K43472K09004K35597L52591M54936M87358
14421F233289N74564O74006P99745R00020J053570J270137J585256J954208K217266
14412A7262061K295750K235038K300255K679807L446613M737434O721923R794353
14404E1473234J4112182K0386251K9412316M1858552N6516010O6079045N7080687
$$ y = [900006, 860650, 862596, 928158, 1010877, 1052722, 1089456, 1079371, 1057801, 1057220, 1112968, 1104463, 1121792, 1178805, 1216233, 1286686, 1378919, 1450519, 1471736, 1526381, 1548951, 1563384, 1708818, 1772322, 1781610, 1831605, 1861602, 1906180, 1992043, 2054484, 2110664, 2209153, 2289026, 2390635, 2422499, 2494326, 2579735, 2663895, 2730535, 2848766, 2990710, 3134312, 3322074, 3459388, 3593909, 3760796, 3949158, 4250331, 4493803, 4702807, 4938404, 5290995, 5745931, 6233289, 6807853, 7481859, 8281604, 9181624, 10235194, 11505331, 13090587, 15044795, 17262061, 19557811, 21792849, 24093104, 26772911, 30219524, 34956958, 41678881, 51473234, 65585416, 85971667, 115383983, 157242535, 213758545, 279837590, 336918277]
14397C36918277K4040634j6771916m2316344m4167364k7384805j898026K4183956
14390B52604412M3786332M5464923K0250956k0474696n3215283o5061842n8616903
14383A64737899m3812991k9840324k0227496j4290665j0501728p706556n632934
14376C2725205m081540l027983k434224k155520k136734k167791k004633j735229
14368A2981551j492748j161278q12263o57611o78484o32654n61092m95408m37534
14359F052479l85962k89215k12089k07491k24495k59360l07794m04386l26723
14350C434964k77988j87662j61818k01159k20020j17492j21673j59100j63118
14341A824934o7347n8918l2275j9116r8429n7737o3504p4514o1633m9423o8653
$$ y = [336918277, 360958911, 344186995, 301870651, 257703287, 230318482, 228420456, 252604412, 296390744, 341855667, 362106623, 341631927, 288416644, 223354802, 164737899, 120924908, 91084584, 70857088, 56566423, 46064695, 38358139, 32725205, 28643665, 25615682, 23181458, 21025938, 18889204, 16721413, 14716780, 12981551, 11488803, 10327525, 9515262, 8857651, 8179167, 7546513, 6985421, 6490013, 6052479, 5666517, 5377302, 5165213, 4957722, 4733227, 4473867, 4166073, 3761687, 3434964, 3156976, 2969314, 2807496, 2606337, 2386317, 2268825, 2147152, 1988052, 1824934, 1757587, 1698669, 1666394, 1647278, 1548849, 1491112, 1427608, 1353094, 1291461, 1242038, 1173385]
14330A173385l2618L1135o6296k6889K872k885p4775m4250J7211J215m4153m5401
14318H88551n0363j5318j9747m3551k4421R7302n5638o5740j9124L9813N511l9093
14306F98182K1063L2598l991L2753o1614l1299M7265N9628j3181l4421L0162Q6075
14294H63220J9392p5799l3919j5242n5676k2220K6146l1402j1987J7001K4741
14283G04255j4551m6116r143J9888J5071o560o7286J2170J00247M4915K5559P3395
14271H51844M0379J4889p2741j05363j00452r127K9032R7528N4879L2248q990
14260H24126r4762r6948m9142j07j2571q0995k7497p2271n0366K7031k112l6655
14248C27731l8745R070O258j7652o0361j8272j1581m8036j1613m4920j5260j0549
$$ y = [1173385, 1140767, 1171902, 1105606, 1078717, 1081589, 1078704, 1003929, 959679, 976890, 978105, 933952, 888551, 838188, 822870, 803123, 759572, 735151, 832453, 776815, 711075, 691951, 731764, 737275, 698182, 719245, 751843, 747852, 780605, 718991, 687692, 734957, 794585, 781404, 746983, 777145, 863220, 882612, 806813, 772894, 757652, 701976, 679756, 705902, 674500, 662513, 679514, 704255, 689704, 643588, 634445, 654333, 669404, 662844, 595558, 607728, 707975, 752890, 778449, 851844, 892223, 907112, 834371, 729008, 628556, 619429, 648461, 745989, 800868, 833116, 824126, 729364, 632416, 583274, 583167, 570596, 489601, 462104, 389833, 339467, 366498, 364386, 327731, 288986, 298056, 304314, 286662, 226301, 208029, 196448, 148412, 136799, 91879, 76619, 66070]
14236F6070J6733R883L1953P2043K6016n2780m9254n457l5535l8292N4063P8473
14224A73916J245l4844m4593J4350P5213K8382L7814k1303K5456R902J7417j0749
14212B72206j8577L495j7138p245m4086K2246k308K9430P145j1796J2993k4464
14200B21901L0162l388l3261n4005o9491l4602M3342O8166L7907p910l0547m0272
14188A28002k9481k0250j7285n1614j573J575N1950K7916q5394N274L673r21J2327
14175B4199L9265N4544r069p0400j5079M3287J6221K1141j6029j8083L8934P712
14163A16643K2490m0494o428J9817J0115j5013l4503k0857J6348J7748q96K9615
14151A14585m0097J012l1517L754k610m9955L099K6594O6147k4417J8965L1068
$$ y = [66070, 82803, 92686, 124639, 196682, 222698, 169918, 120664, 115207, 79672, 41380, 95443, 173916, 175161, 140317, 95724, 110074, 185287, 213669, 251483, 230180, 255636, 265538, 282955, 272206, 253629, 257124, 239986, 232741, 188655, 210901, 208593, 238023, 245168, 233372, 246365, 221901, 252063, 248675, 215414, 161409, 91918, 57316, 100658, 168824, 206731, 198821, 168274, 128002, 98521, 78271, 60986, 9372, 7799, 9374, 61324, 89240, 3846, 9120, 12793, 11872, 24199, 63464, 118008, 108939, 38539, 23460, 66747, 82968, 104109, 88080, 69997, 108931, 116643, 139133, 98639, 92211, 112028, 122143, 107130, 72627, 51770, 68118, 85866, 84970, 114585, 74488, 75500, 43983, 47737, 45127, -4828, -1729, 24865, 91012, 66595, 85560, 116628]
14139A16628p223K690L583k8530j2768N5741K9994j3170j9656p4714p2358P34
14127a9049M8580j8344M4543L5387O0426j1545l1472Q401j7803j3700j2961M6416
14115A18879K7255K4451L4398N5103j2593j08677l3304k0356j7070P145J9881
14104I5112k7926j5266p202k645J7994j8514K5317J2000J4811J8479J2454q2983
14092D1631l9649j5647J6773M1815N9140O5566J9638l5347n1011m671o130k7016
14080F5092K6247R6586L7650k4101p0833q552n0176j5877J608O2568Q2210n8462
14068A43960m5362m0280k3451O6157M6267K6324O250J3790m1506l0855k8470N2258
14056A45082R4367R776k5544j3300k8416N546k4380M6288L5654J5345k8158o0594
$$ y = [116628, 109405, 112095, 115678, 87148, 74380, 130121, 160115, 146945, 127289, 52575, -19783, -19049, 29531, 11187, 55730, 91117, 151543, 139998, 108526, 116927, 99124, 85424, 72463, 118879, 146134, 170585, 204983, 260086, 247493, 138816, 105512, 85156, 68086, 75231, 95112, 67186, 51920, 44718, 42073, 60067, 41553, 66870, 78870, 93681, 112160, 124614, 41631, 1982, -13665, 3108, 44923, 104063, 169629, 189267, 153920, 102909, 98238, 92108, 65092, 91339, 187925, 225575, 201474, 130641, 122089, 71913, 56036, 57644, 120212, 202422, 143960, 98598, 58318, 34867, 101024, 147291, 173615, 179865, 193655, 152149, 121294, 92824, 145082, 239449, 249225, 223681, 210381, 181965, 187511, 163131, 209419, 245073, 260418, 232260, 171666]
14044A71666k3700j0540L4408M8446L9096M2945o2983j5583O3864P920j2039k285
14032B81215L7579l6738J4135O9909M1846n547o8247q7814m7952K9202O3967M0858
14020C32413m2941l8882J035J7087J901l3321m7420k0553k4528K9412K7999K7742
14008B29944L0504M1004P3517L002j03617n5823R750L0423n103o2162L1633M6635
13996B69707q3190k196K8366l4216n3024j1174K9447j7530L0943J7548m2187L7126
13984A69620Q2044j01391L596k8400J4644N2301l6184K8600j755l2423L1829P6472
13972B58953l8954n6446J2042l3188L5128o237l7607J9787m7807r682J3417P6129
13960A85535K1976p612j399k3798K2666m62o9856m1525j3284K8367o982J938L7952
$$ y = [171666, 147966, 137426, 171834, 220280, 259376, 302321, 239338, 223755, 287619, 295539, 283500, 281215, 318794, 282056, 296191, 366100, 407946, 402399, 334152, 246338, 198386, 227588, 291555, 332413, 289472, 250590, 251625, 268712, 270613, 237292, 189872, 169319, 144791, 174203, 202202, 229944, 260448, 301452, 374969, 377971, 274354, 218531, 228281, 258704, 253601, 191439, 223072, 269707, 186517, 184321, 212687, 178471, 125447, 114273, 143720, 126190, 157133, 174681, 132494, 169620, 251664, 150273, 153869, 125469, 140113, 192414, 156230, 184830, 183075, 150652, 182481, 258953, 219999, 163553, 175595, 142407, 177535, 171298, 133691, 153478, 105671, 95989, 109406, 185535, 207511, 199899, 198500, 174702, 197368, 196906, 127050, 85525, 72241, 100608, 93626, 95564, 133516]
13947A33516l4192p0808M8453J05436N6339L6004l8136j7905L5392r824n0627
13936A93648R821R0049L5342p5972k0468M5711M6043j791L9946O9034L0053O5961
13924E27377Q2433J28105J59262K32293K86079K34632K16420J03058j43544k22347
13914A603768j47022n9052O9531P5031P1218J00009P5254p5824k21763l09384
13904A181766k38897j15048j11666j30808q7818O695k435j22772o497k1579l2280
13893C18661m0068p349L7357L3234o7424j00103j8212O0685P1700j5000p1437
13882B02044j9030j0360K3560k7774J2025L6485M587m4197n9071n7523K5396R3386
13870A79528J2896n3054k736J9496k674m5991j1314J455O8987P846l2170O957
$$ y = [133516, 99324, 28516, 76969, 182405, 238744, 274748, 236612, 218707, 254099, 244275, 193648, 203469, 293518, 328860, 252888, 232420, 278131, 324174, 322383, 362329, 431363, 461416, 527377, 609810, 737915, 897177, 1129470, 1415549, 1650181, 1866601, 1969659, 1826115, 1603768, 1456746, 1397694, 1467225, 1542256, 1613474, 1713483, 1788737, 1712913, 1491150, 1181766, 942869, 827821, 716155, 585347, 497529, 504224, 501789, 379017, 372520, 350941, 318661, 278593, 271244, 308601, 341835, 274411, 174308, 156096, 216781, 288481, 273481, 202044, 183014, 172654, 196214, 168440, 180465, 216950, 221537, 177340, 118269, 60746, 86142, 179528, 192424, 139370, 136634, 156130, 153456, 107465, 96151, 97606, 166593, 174439, 142269, 149226]
13858A49226j2766r813Q943L2460q774j1099K7237l8094k8153l9206J3342O5509
13846A48812L4242j6450q560J787K3693N6098m2345q7707M6963P6885l1504l404
13834A98510L2445l7488N654k0160r865n324j1134k3022l305K1255r483L5139
13822A73222Q498N2115J2662j8203j5013J8678N087J3947m1258K7217p931l6574
13810A92447J7115j2185l4895n2641M2979J7868L0774Q282o243j3899l7043m2613
13798A09946n3576O5059M4727Q776r861j5583K3949K86n2268n808J7769O9353
13786B02769J6982k8537p1137j0329p881M9544k1296k0755O0570L137L8065L9878
13774B51010k4525j3634L0471J5829l3136n2445k3033m776J04022L1642n8519
$$ y = [149226, 136460, 126647, 135590, 168050, 159276, 148177, 175414, 137320, 109167, 69961, 83303, 148812, 183054, 166604, 158044, 159831, 183524, 239622, 197277, 109570, 156533, 233418, 201914, 198510, 230955, 193467, 199121, 178961, 169096, 163772, 152638, 129616, 126311, 147566, 138083, 173222, 181720, 233835, 246497, 228294, 213281, 231959, 237046, 250993, 209735, 236952, 229021, 192447, 209562, 197377, 162482, 109841, 152820, 170688, 201462, 209744, 203501, 189602, 152559, 109946, 56370, 121429, 166156, 174932, 165071, 149488, 173437, 173723, 121455, 115647, 133416, 202769, 219751, 191214, 120077, 109748, 101867, 151411, 130115, 109360, 169930, 173067, 211132, 251010, 226485, 212851, 243322, 259151, 226015, 173570, 150537, 145761, 249783, 281425, 222906]
13763B22906j4853M8336K6482o3472j05263l7015K6027K7365M5734R350q92j5347
13751A69358K2551R161M179l1257l3174M636O596k0901Q687M1833k1524o5532
13739I4613l2558O6465K7502K7522o3558p466R316m6874N0688P0895j2061k4876
13727A59608k4166j5357K6330J8672O1316n191J5978L1467p773r4662r4258k509
13715F9455K5271N4569M1900L3101k786N839L7173K466k9150p269L1058M5142
13703C06769k3430k7262k0584k9323k4011j6730N0290N2508k467j4782j0045k1740
13691B19193r827K1499j4150n066L2877N9360M3368o2606j7950r208j2918j6457
13679B28115J3848k6655m4648p9865M2550N6326l34k2056j4716J00426L8247n1093
$$ y = [222906, 208053, 256389, 282871, 219399, 114136, 77121, 103148, 130513, 176247, 185597, 184705, 169358, 191909, 201070, 205249, 173992, 140818, 145454, 152050, 131149, 139836, 181669, 160145, 94613, 62055, 128520, 156022, 183544, 119986, 112520, 121836, 74962, 125650, 196545, 184484, 159608, 135442, 120085, 146415, 165087, 226403, 221212, 237190, 268657, 260884, 166222, 71964, 69455, 94726, 149295, 191195, 224296, 221510, 227349, 264522, 266988, 237838, 230569, 261627, 306769, 283339, 256077, 235493, 206170, 182159, 165429, 215719, 268227, 265760, 250978, 240933, 219193, 209366, 230865, 216715, 211649, 244526, 303886, 347254, 284648, 266698, 257490, 244572, 228115, 241963, 215308, 170660, 90795, 133345, 189671, 189337, 167281, 152565, 252991, 291238, 240145]
13667B40145m0604l1055m895j6138j8821q410m351P5821L2309l121J4297k3692
13655B11485j3043K8145n248M9167K1237p269q115R324j6284Q068o541m461j6176
13642B50289K643K7730L2914J3434n206K622j8730K7920l141m1314l4009Q2614
13630C37766o64o3797n4659L9706P0213o22j2065J7821o726o3088k6159N3983
13618B91709P6933j1767r716o5464J6786n315K9312L729j9465m3519n640J9279
13606B76862J2043K7738k0493M6939Q1980n2635k6702J2988l3458N0832k8035
13595C48059L52p012J1251K6772L095m8908K9145J9597l869J1274j8510q654K0931
13582C83523n6640o1266J6386k5000O860j002J2555J4072m770p117N7050O9750
$$ y = [240145, 199541, 168486, 163591, 147453, 128632, 120222, 115871, 191692, 224001, 220880, 235177, 211485, 198442, 226587, 221339, 270506, 291743, 284474, 276359, 285683, 269399, 277467, 270926, 266465, 250289, 252932, 280662, 313576, 327010, 321804, 324426, 305696, 333616, 330475, 289161, 255152, 337766, 337102, 273305, 218646, 258352, 328565, 327943, 315878, 333699, 326973, 263885, 237726, 291709, 368642, 356875, 347159, 281695, 298481, 293166, 322478, 326207, 306742, 263223, 257583, 276862, 288905, 316643, 296150, 343089, 425069, 372434, 345732, 358720, 325262, 376094, 348059, 348411, 341399, 352650, 379422, 382517, 333609, 362754, 382351, 378482, 389756, 371246, 362592, 383523, 326883, 265617, 282003, 257003, 263863, 262861, 275416, 289488, 284718, 277601, 334651, 404401]
13570D04401L8306j5698q475O4061M0394j419L3836N6531M4936O6402K4363J36954
13558H84592K64442L01605L14420L17207K09817J37391L5613q2614j88991k36376
13548A957106r8695M0990O7205R6818J49082K49517Q5912j11027j59889k56949
13538B020070l12177k32598j75437j58794j45768j41842j39580o0710l6136l795
13528F13233l0534l0753l5023o4991m1287N2390k389p1467J6728n4955K7701M1219
13516D19872k37l6094J1484o403j2381l3608m8817l8899M2153o4489J409Q4698
13504C18688N3809r9657p0547L8394j4965N5006L7925r75Q916l6171m553N9854
13492C45724L1644m8163N397j0659p532n3609k7219M1146L7635K8548q5099j1753
$$ y = [404401, 442707, 427009, 418534, 482595, 522989, 521570, 555406, 611937, 656873, 723275, 747638, 884592, 1149034, 1450639, 1765059, 2082266, 2292083, 2429474, 2465087, 2382473, 2193482, 1957106, 1858411, 1899401, 1966606, 2063424, 2212506, 2462023, 2547935, 2436908, 2277019, 2020070, 1707893, 1475295, 1299858, 1141064, 995296, 853454, 713874, 653164, 617028, 613233, 582699, 551946, 516923, 451932, 410645, 463035, 460646, 389179, 405907, 350952, 378653, 419872, 419635, 383541, 395025, 388622, 376241, 342633, 293816, 254917, 297070, 232581, 233990, 318688, 372497, 272840, 202293, 240687, 225722, 280728, 318653, 317678, 326594, 290423, 285870, 345724, 377368, 329205, 334602, 323943, 316411, 262802, 235583, 276729, 314364, 342912, 257813, 246060]
13480B46060K6974r504m7249m900j1165K1814Q6325K0709M195R677k421k2251
13468C18264n7481L0930J5407j3298r303M0286P3933r317P069j7890p0601k5224
13456B82775K8762K6557j2941o814J2788N2883N3306j6667o3878l9055l0615L1217
13444C18318J5976l6057j4251n06o863O9490l4027O700P341M0912o692p7944p8146
13431B04251j3999L092J5066l5409K2262k9602N9302M7001k8877K90q119K6548
13419B61806P5449m2448p5445M4413M1475J3719J777m9734L566j4253J6483N9529
13407C36337m2496L5430L6787K349l761q9707q039j9899N155J7148n930L2274
13395B95648J8641L7377n2162K257l3889J7369R34N0145L7414J5328j6713l292
$$ y = [246060, 273034, 263530, 216281, 211381, 200216, 222030, 308355, 329064, 333259, 342936, 340515, 318264, 260783, 291713, 307120, 293822, 284519, 324805, 398738, 389421, 396490, 378600, 307999, 282775, 311537, 338094, 325153, 318339, 331127, 384010, 437316, 420649, 356771, 317716, 287101, 318318, 334294, 298237, 283986, 283480, 276617, 346107, 312080, 318780, 326121, 367033, 360341, 282397, 204251, 190252, 193344, 208410, 173001, 195263, 165661, 224963, 271964, 243087, 243377, 235258, 261806, 337255, 294807, 219362, 263775, 305250, 318969, 320746, 271012, 274578, 260325, 276808, 336337, 293841, 329271, 366058, 368407, 364646, 274939, 266900, 247001, 252156, 269304, 263374, 295648, 314289, 351666, 299504, 301761, 267872, 285241, 286175, 336320, 373734, 389062, 372349, 369057]
13383C69057q6115l9667O2654L9811q1706R098M5304J9961M3616k0966l2015J6722
13371C45754L2676L4066l7501L3399k6086o3226J549K2244K9105K7520r979j5756
13359C73765k3318k3587L9270j961L1454k3548k7626M6549k4699l4942M0731L9942
13347D12030l9428J3996Q5564K7340p717j4219L4324n79k6044k724p9641j7903
13335C84999N484K2440O400j5537K466k1008L584j7805K2979j6881p4806L4645
13323C36960j8856O2643L8210M659q2869R003M4866J7149N7940K7441K4899P058
13311E29103J0476j7138k5444j7614M3841N5564N5446j9462q931k7189L2874R9774
13299G11300K9755N580l1207k5002m248N4778j0082m7267q7492K6659r4658m9006
$$ y = [369057, 282942, 243275, 305929, 345740, 264034, 273132, 318436, 338397, 382013, 361047, 329032, 345754, 378430, 412496, 374995, 408394, 382308, 319082, 320631, 342875, 371980, 399500, 389521, 373765, 350447, 326860, 366130, 364169, 395623, 372075, 344449, 390998, 366299, 331357, 372088, 412030, 372602, 386598, 472162, 499502, 491785, 477566, 511890, 511311, 485267, 482543, 402902, 384999, 390483, 412923, 419323, 403786, 406252, 385244, 388828, 371023, 394002, 377121, 302315, 336960, 318104, 380747, 418957, 423616, 340747, 349750, 394616, 411765, 469705, 497146, 522045, 529103, 539579, 522441, 496997, 479383, 523224, 578788, 634234, 614772, 605841, 578652, 611526, 711300, 741055, 746635, 715428, 690426, 686178, 740956, 730874, 683607, 596115, 622774, 528116, 479110]
13287D79110M2044j6574J2633M1102P85L3776j769J0057k791m2621K8173Q1573
13275F65498R5638J6203P065K819n5352j3218r564k4495k4830p6870m4386j834
13263E36674J5973M2130N7397J06977J62380R4265N7302J4494l7786q7639o3600
13252H98567p6225n4131j00111j07231m4058m9298j0810q959n0927R330M9354
13241D55501N244J1874l2097p010j7075L8948j0161L8107n6683J9725k8546N42
13229D18369k2040Q267M0024L693k5726M5543J4327l823j1535J1223Q6204J34880
13217F99406P5098k6040j7325o5883j12441n4225j4218M6005K712k4588n4451
13206D54050r2034k5161L9778K960K1852j2895p7524j885j9140K3041k7820R24
$$ y = [479110, 521154, 504580, 517213, 558315, 559100, 592876, 591107, 601164, 598373, 555752, 583925, 665498, 761136, 777339, 784404, 787223, 731871, 718653, 709089, 684594, 659764, 582894, 538508, 536674, 552647, 594777, 652174, 759151, 921531, 1015796, 1073098, 1087592, 1049806, 962167, 898567, 822342, 768211, 668100, 560869, 516811, 467513, 456703, 447744, 396817, 406147, 455501, 460745, 472619, 440522, 433512, 416437, 455385, 445224, 483331, 426648, 446373, 417827, 418369, 396329, 404596, 444620, 448313, 422587, 468130, 482457, 478634, 467099, 478322, 564526, 699406, 774504, 748464, 731139, 665256, 552815, 498590, 484372, 530377, 533089, 508501, 454050, 362016, 336855, 376633, 379593, 401445, 388550, 311026, 309141, 290001, 313042, 285222, 286146]
13194B86146O5178J3479m1676l8995L9568J63P2755Q5352Q0598m794n7911p2026
13182D27837p4310l8111O0930K1473j97L3645o042K1531K2545j2514M484n5244
13170D06027n6318L4925O078L9931N3228j4726n2837P857L471j0075o6906l5824
13158C14831J996M0954K7559M7335m6858l3796k1386q257N725j4576L4985k4289
13146C24223M498p648M5956M7737j1413l2888K2373K206k5310j8259K0915l6374
13134C36016o0658O422j0071P708L6803L5452M9657l7917R173L6988l6310L4837
13122D08100K3321j6545l0455N5207N7593L2154n8927p1897l1715k990j4704n6335
13110B92807k7146j718K0550N604L1388j0620m5835o637r744N2984J9330P801
$$ y = [286146, 351324, 364803, 323127, 284132, 323700, 323863, 396618, 481970, 562568, 557774, 499863, 427837, 353527, 315416, 376346, 397819, 397622, 431267, 425225, 446756, 469301, 456787, 461271, 406027, 349709, 384634, 390712, 430643, 483871, 469145, 416308, 424165, 427636, 417561, 350655, 314831, 316827, 357781, 385340, 432675, 385817, 352021, 330635, 322378, 328103, 313527, 348512, 324223, 328721, 321073, 367029, 414766, 403353, 370465, 392838, 395044, 369734, 351475, 372390, 336016, 275358, 281780, 271709, 279417, 316220, 351672, 401329, 363412, 372585, 409573, 373263, 408100, 431421, 414876, 384421, 439628, 497221, 529375, 470448, 398551, 366836, 363846, 349142, 292807, 265661, 263943, 284493, 290097, 321485, 310865, 265030, 258393, 248649, 301633, 320963, 328764]
13098C28764N7239J5818m1733o9600J4696m54j0179J3631J7979M5073O5649N834
13086D42717k3196j3808p8091N58K7947q383k6442o7806n01P614j5452L5918r318
13073B71757q677O842Q1200J2567p993J6966p6435k8606R140j0034Q552N0090
13061C25369k6450o6304k1725O8998K7690j7213J2435K1345k0154J8080J2991
13050C35062M5748N2717J0370l3901j1548j704K2956k1623k9734l866R170k6299
13038C47348N385k7149J7658Q0260K925r7474j0684j2451K4201J6115j4972k6827
13026C04335O128K9415L1512m5852J694k2098K6872O437M7853K5073o6716r384
13014C35269K0123o844k2101q180O715K0077M3956J4266l9434m9113n757Q16L5480
$$ y = [328764, 386003, 401821, 360088, 290488, 305184, 304730, 294551, 308182, 326161, 371234, 436883, 442717, 419521, 405713, 327622, 328180, 356127, 347744, 321302, 253496, 252995, 260609, 245157, 281075, 271757, 263080, 269922, 351122, 363689, 355696, 372662, 296227, 267621, 276761, 266727, 275279, 325369, 298919, 232615, 210890, 279888, 307578, 290365, 302800, 324145, 303991, 322071, 335062, 380810, 433527, 443897, 409996, 398448, 396744, 419700, 398077, 368343, 364477, 373647, 347348, 352733, 325584, 343242, 423502, 426427, 328953, 318269, 305818, 330019, 346134, 331162, 304335, 310463, 339878, 371390, 325538, 327232, 305134, 332006, 338443, 386296, 411369, 344653, 335269, 355392, 348548, 326447, 318267, 324982, 345059, 389015, 403281, 363847, 314734, 308977, 309793, 345273]
13001C45273l2763q810L0423N4477J0669J1709L841M2131J9110n5853k6784K5155
12989D18578N4570n3824j5273J6553k7777m509R29L2805K3597j6988n3926k4931
12977C49804k2680K5864M6583k9550l6624j121k698j582k9569Q705K4690M0655
12965C72477p470J0665N7276J5252o1498j3266j5696o8177k0681N3631K5149K6231
12953C73893M8634m928o1621k5214K1994M8585O0213N8437K6753j4392k5015k3575
12941D83764N725n2535k4184j7630l1293J4077J381M1750k4276j4798p0011j5903
12929B96067J32834N2311p4517j9856J8178L1387N8543K0302J5569k228n1365
12918D77225k9686q460l9368k4020R556k0246K1293Q906N1375p679l6571l0090
$$ y = [345273, 312510, 303700, 334123, 388600, 399269, 410978, 414819, 456950, 476060, 420207, 393423, 418578, 473148, 419324, 404051, 420604, 392827, 388318, 389247, 422052, 445649, 428661, 374735, 349804, 327124, 352988, 399571, 370021, 333397, 332276, 329578, 327996, 298427, 307132, 331822, 372477, 365007, 375672, 432948, 448200, 386702, 373436, 357740, 289563, 268882, 322513, 347662, 373893, 422527, 417599, 355978, 330764, 352758, 401343, 461556, 519993, 546746, 532354, 507339, 483764, 489489, 436954, 412770, 395140, 363847, 377924, 379305, 421055, 396779, 381981, 311970, 296067, 428901, 481212, 406695, 386839, 405017, 436404, 494947, 515249, 530818, 528590, 477225, 447539, 439079, 399711, 375691, 385247, 365001, 386294, 395200, 446575, 438896, 402325, 372235]
12906C72235M46J1460k5438M6291N0398M9033N0146m2926r4946K1206p568k5375
12894D04962k4236j1525l0071k8158L8996J6373O8004q153l0331K9897K6774Q6518
12882E39050L4188K6233p946P808K9226k6529l9988k4332m5184j1015k7881P03
12870D54333m2029J8307J4945K1234J737k0771l813j5212L020k9940m1872O1410
12858D21349Q5521j2290m8850q0947l9770N166K4825J2809L5452k1817M8M7938
12846D29434o732M5595J6602m9577L3206o97K2248L3775K9359O9165M0621p3311
12834E89688l8905o1932n7471j7734P2314o3372l3659N1806M2652o562N2448o369
12822E22904o2415l9759R951J2435J13k3149j0761Q3508N6772o684J3615j8875
$$ y = [372235, 372681, 384141, 358703, 404994, 455392, 504425, 554571, 511645, 416699, 437905, 430337, 404962, 380726, 369201, 339130, 310972, 349968, 366341, 434345, 426192, 395861, 425758, 452532, 539050, 573238, 599471, 591525, 599333, 628559, 602030, 562042, 537710, 492526, 481511, 453630, 454333, 412304, 430611, 445556, 466790, 468527, 447756, 443943, 428731, 431751, 401811, 359939, 421349, 506870, 494580, 445730, 364783, 325013, 330179, 355004, 367813, 403265, 381448, 381496, 429434, 422702, 468297, 484899, 435322, 468528, 467831, 490079, 523854, 553213, 622378, 662999, 589688, 550783, 488851, 431380, 413646, 485960, 422588, 388929, 440735, 483387, 476825, 529273, 522904, 460489, 420730, 430681, 443116, 443229, 420080, 409319, 492827, 549599, 542915, 556530, 537655]
12810E37655m8213l9084P6688N6492J25394l4377n4719N414r477o290k5144o9660
12798E14679J6794l5353k2623M667K7430k7238j7310k2903K1085O5610K7217n1285
12786E00770m7679m0158J6704L2314j2686M0109L9425J6744l051K6428n9492K0512
12774E29940K2239k8227J7604N0391L6337m1366l6745L5740L8242J1059j843r0653
12762E42718r1704j958J283M995n0688r227L4704L3201k3116j1257R946O3204
12750E02101K6885j5897R087J8285m1613m2286L2045j6544J7086J9839K2680R21
12738E32589M8206l1038r8357l499N5720O7655L0609j0018j6692L2677K3268j1273
12726F19847o0395J5298k6332k3839r595m4048J2914K6916P816l3491N139l561
$$ y = [537655, 489442, 450358, 527046, 583538, 708932, 674555, 619836, 625250, 615773, 609483, 584339, 514679, 531473, 496120, 473497, 478164, 505594, 478356, 461046, 438143, 459228, 524838, 552055, 500770, 453091, 412933, 429637, 461951, 449265, 489374, 528799, 545543, 542492, 568920, 509428, 529940, 552179, 523952, 541556, 591947, 628284, 586918, 550173, 585913, 624155, 635214, 633371, 542718, 451014, 449056, 450339, 455334, 404646, 395419, 430123, 463324, 440208, 428951, 438897, 502101, 528986, 513089, 522176, 540461, 498848, 456562, 488607, 472063, 489149, 508988, 531668, 532589, 580795, 549757, 451400, 447901, 503621, 571276, 601885, 591867, 575175, 607852, 631120, 619847, 559452, 574750, 548418, 524579, 514984, 470936, 483850, 510766, 518582, 485091, 490230, 486669]
12714D86669m1104j8908l7800K6822P8834N052N4916M1890Q468K3140j9311m8547
12702E60121k2450k8078l271k2644k4803K3795J0908N107l584L209l3454K52J8982
12689D84090O1632j6501k8368k9592L9904m141q057j3450j6073l2386L3141P5579
12677E45778J7321n2145k9881K6669j3121j5625j6418N65n0027J8623M4068j2043
12665D63764J7402N2660J1724l9153j3897L3609K0218j328m0081L6785j2626J0697
12653E39774K8781M1838j8453l1730L4090r465m3456P737r598N1832L5391J7139
12641F43880m5475m5112j9626K6352K9882l1128k3762L2783J6139J9789r90m8721
12629E54011j4097l1429K2994J8877K1446O6905O450k2078j0893m3047j0028M6214
$$ y = [486669, 445565, 426657, 388857, 415679, 494513, 499565, 554481, 596371, 604839, 627979, 608668, 560121, 537671, 509593, 506322, 483678, 458875, 482670, 493578, 498685, 495101, 498310, 464856, 465108, 484090, 545722, 529221, 500853, 471261, 511165, 507024, 498967, 485517, 469444, 437058, 470199, 545778, 563099, 510954, 481073, 507742, 494621, 478996, 462578, 463143, 413116, 431739, 475807, 463764, 481166, 533826, 545550, 506397, 492500, 526109, 546327, 544999, 504918, 541703, 529077, 539774, 568555, 610393, 591940, 560210, 594300, 584835, 541379, 549116, 539518, 591350, 626741, 643880, 598405, 553293, 533667, 560019, 589901, 558773, 535011, 567794, 583933, 603722, 602732, 554011, 539914, 508485, 531479, 550356, 571802, 638707, 645157, 623079, 612186, 569139, 559111, 605325]
12617F05325N4977P3747M934M4389m0093n4956j4841J1865L0443oJ7614m7619
12605F85779N416k4110o4091m1509n8086M2114O8350l5462j580j2715k4632j5027
12593E24447M6255M9929L1824n260K685j6624m8125N3491P8187j6995n6284q2332
12581E61198J3316N2493L6721P7634K9276k6077l3658o320K8015K5424R9774P8436
12569I36232k112j1994n6058l4892o8688L6581j0910O285j5318J10299K2888J1931
12557I24244N9211J36836R8577L9787k6041K9870M3019Q188M2168K8708K5477
12546A410044N177P015K2075j4270o210J739j09635j8995j5159n3057m7812o1083
12534A119829l9794p7392n3970o1742k0363p534k1924q739K122k7504j5971m6787
$$ y = [605325, 660302, 734049, 738983, 783372, 743279, 688323, 673482, 685347, 715790, 715784, 733398, 685779, 691195, 667085, 602994, 561485, 503399, 545513, 613863, 578401, 576821, 564106, 539474, 524447, 570702, 620631, 652455, 647195, 649880, 633256, 585131, 638622, 716809, 699814, 643530, 561198, 574514, 627007, 663728, 741362, 770638, 744561, 710903, 704583, 732598, 758022, 857796, 936232, 934120, 922126, 866068, 831176, 762488, 799069, 788159, 794444, 779126, 889425, 912313, 924244, 983455, 1120291, 1218868, 1258655, 1232614, 1262484, 1305503, 1313691, 1355859, 1384567, 1410044, 1415221, 1422236, 1444311, 1430041, 1423831, 1425570, 1315935, 1296940, 1281781, 1228724, 1180912, 1119829, 1080035, 1002643, 948673, 886931, 866568, 859034, 837110, 828371, 830493, 802989, 787018, 740231]
12522G40231o7165q8642P083K3530K7251K118j3516k605l6903P969k1177m7563
12510E30611L6624N3212j2032m0734J2486o3214r3826m6324L3813K8730K7939
12499D67285Q9362O3149p321k9806N2412k2466p0256j7631m9391M3514m765p241
12487E06845K674m582l035k981Q6193k3342o6689n9064r280M3923J8595K5953
12475E15210O948k2835M9255P278m4890j5424K2839J3967L5543L5204o3864q2117
12463D57114o159J8434j1362m8104P358N1905m06j4472p0311M03N5285O276K2156
12450D68117q216K1508j5197k1791K8071J5307o914N897M1120o5003n6914Q1737
12438D87722M3238k9990K0809M1918O3587k0115j6415M0418l746k638J2998p2204
$$ y = [740231, 673066, 584424, 591507, 615037, 642288, 644406, 630890, 628285, 591382, 599351, 578174, 530611, 567235, 620447, 608415, 567681, 580167, 516953, 423127, 376803, 410616, 439346, 467285, 556647, 619796, 612475, 582669, 635081, 612615, 542359, 524728, 475337, 518851, 514086, 506845, 509519, 504937, 501902, 498921, 585114, 561772, 495083, 436019, 426739, 470662, 489257, 515210, 522158, 499323, 548578, 555856, 510966, 495542, 518381, 532348, 567891, 603095, 539231, 457114, 450955, 469389, 458027, 409923, 417281, 469186, 468780, 454308, 383997, 384400, 439685, 445961, 468117, 459901, 481409, 466212, 444421, 472492, 487799, 480885, 486782, 527902, 462899, 405985, 487722, 530960, 500970, 521779, 563697, 627284, 607169, 590754, 631172, 627426, 624788, 637786, 565582]
12426E65582r6466p6764L2393L9931J3078l9296Q8O0587L350J783M651l4831j6681
12413D57405L2333M1588j6752n177J3838L0592p773J4037K7230N6351j6889m6950
12401E79833K0207J0519m267K2281K4524N1865L9529K7992J09176M3742L520k8470
12389I00451J3035j8270L6344J04716Q6595J43494K54889L89834N00950O94484
12379C106522O63086K53695k43147n81650o96353n18916l82659k81183k13065
12370A106330j16441p0125n0247n830m6130q521K6876K1260L2325j0118m99l94
12358H78486O6195O8804R4677J06503R6364R1778O2412j8641m1906j4993K259
12347A391938L35R8875J47244K74104M11910O16723R55854J339643J631947J350178
$$ y = [565582, 469116, 392352, 424745, 464676, 477754, 438458, 438546, 499133, 502483, 504266, 508917, 474086, 457405, 489738, 531326, 514574, 509397, 523235, 553827, 546054, 560091, 587321, 643672, 626783, 579833, 600040, 610559, 606292, 628573, 653097, 704962, 744491, 772483, 881659, 925401, 928921, 900451, 913486, 895216, 931560, 1036276, 1122871, 1266365, 1521254, 1911088, 2412038, 3106522, 3769608, 4023303, 3780156, 3198506, 2502153, 1983237, 1600578, 1319395, 1106330, 989889, 919764, 869517, 863687, 817557, 809036, 835912, 857172, 889497, 879379, 878880, 878486, 944681, 1013485, 1108162, 1214665, 1311029, 1402807, 1465219, 1446578, 1404672, 1389679, 1391938, 1392273, 1491148, 1638392, 1912496, 2324406, 2941129, 3896983, 5236626, 6868573, 8218751]
12337H218751P8532j078544j613643j487764j025776o87651m02972k72367j93887
12328A534679o7723K5570J5124l04o9037q5444r4543r2186q6992l3946m9323K3395
12316A019270Q0240M9684l9471n3204J2292K2378l7713J9472N1550o241O7635
12305A185892R8807R6639J42866K76115M35182O19418O70562N92445K49892k78891
12295D088927o30667p02816o05478m07247k33840k8133l1791M596N6924J45826
12285A656301R0367q013j07825k23438k17406j57075j27458m5792o657l378p4361
12274G75265o385j5853m7116J1197M947k943k4674J6950M2592p7321m0449Q109
12262F44319j6570K9429M339m5726m2391r393O423R3537O6320J7951n9080n6488
$$ y = [8218751, 8297283, 7218739, 5605096, 4117332, 3091556, 2403905, 2000933, 1728566, 1534679, 1466956, 1492526, 1507650, 1507346, 1438309, 1352865, 1258322, 1166136, 1079144, 1045198, 995875, 1019270, 1099510, 1149194, 1109723, 1056519, 1068811, 1091189, 1053476, 1072948, 1124498, 1118257, 1185892, 1284699, 1381338, 1524204, 1800319, 2235501, 2854919, 3525481, 4117926, 4367818, 4088927, 3458260, 2755444, 2149966, 1742719, 1508879, 1480746, 1448955, 1453551, 1510475, 1656301, 1746668, 1738655, 1630830, 1407392, 1189986, 1032911, 905453, 859661, 853004, 849626, 775265, 768880, 753027, 705911, 717108, 722055, 719112, 694438, 711388, 753980, 676659, 636210, 644319, 627749, 657178, 661517, 615791, 573400, 564007, 570430, 663967, 730287, 748238, 689158, 632670]
12250F32670M7734M7813L7139N7110J0721J8376J2816p5930j2253j8508Q358o2081
12238G03965l1342J7484o127j1185K7166n945O589k8554q4922p9722K6958J683
12226E36048P634L5244P8619m0018m2453k986m550p3848l9538q440n2092j3523
12214C80097j9657K3284J6316M0238J0815l0516Q094J7795Q782K9150k5205k4502
12202D34691J7413l1218P635o635L3289O551J524J6750l629M1198K0630j7179
12190E21020q847k4287j5608L8505J6521k2947K3829K4178L5996m1413n6636J4110
12178E04421P4775K7090n9562o1564O290J1166o494L3128M6235p437m9687j103
12166E17258l3834k9185K3043o056r141m734N2855N7931p683j9153j1846o5346
$$ y = [632670, 680404, 728217, 765356, 822466, 833187, 851563, 864379, 788449, 776196, 757688, 766046, 703965, 672623, 690107, 683980, 672795, 699961, 694016, 700605, 672051, 587129, 507407, 534365, 536048, 543682, 578926, 657545, 617527, 575074, 572088, 567538, 493690, 454152, 445712, 393620, 380097, 360440, 383724, 400040, 440278, 451093, 420577, 428671, 446466, 455248, 484398, 459193, 434691, 452104, 420886, 428521, 421886, 455175, 461726, 463250, 480000, 476371, 517569, 538199, 521020, 512173, 487886, 472278, 510783, 527304, 504357, 528186, 552364, 588360, 546947, 490311, 504421, 579196, 606286, 546724, 485160, 491450, 502616, 496122, 529250, 575485, 568048, 518361, 517258, 483424, 454239, 477282, 471226, 462085, 457351, 510206, 568137, 560454, 541301, 529455, 464109]
12154D64109J5000J2172J3211m9872L1613q322K4064M652r246m6386L5096L4847
12142E20938Q783J0947k0516o5595j3571P6648L4091L040m816J1037l6765m4750
12130D79471L427K9253K6359N7308K1175n8811j4262M7335l6386r8943k4085O4613
12118D96454P1250j4146k4442M636k2903l6932J6683j5203L561o0083k1326R264
12106D06813L7705L1158P044k6971l8705K7815K193k950j7513j7925J0654O3059
12094D82377L7537j6753N100n0190n1531M6787j8156p967P4486N0450J168l1132
12082E22176q3591n7199o644K2515J5309k0359J1371q513l650j7701J8766K0491
12070D12971J9086K4543L8136L037l5198r0148k3168N5876k6697O587P717J6339
$$ y = [464109, 479109, 491281, 504492, 454620, 486233, 477911, 501975, 506627, 497381, 450995, 486091, 520938, 529721, 540668, 520152, 454557, 440986, 517634, 551725, 554765, 549949, 560986, 524221, 479471, 482898, 512151, 538510, 595818, 616993, 558182, 543920, 591255, 554869, 455926, 431841, 496454, 567704, 553558, 529116, 533752, 510849, 473917, 490600, 475397, 478958, 418875, 397549, 406813, 444518, 475676, 482720, 455749, 417044, 444859, 447052, 444102, 426589, 408664, 419318, 482377, 519914, 503161, 508261, 458071, 406540, 453327, 435171, 427204, 501690, 552140, 553308, 522176, 438585, 381386, 374742, 397257, 412566, 392207, 403578, 395065, 391415, 373714, 392480, 412971, 432057, 456600, 494736, 497773, 462575, 372427, 349259, 405135, 378438, 385025, 392742, 409081]
12058D09081L3364J2249p999m4692N784O1459K056M418k4414j8937k0438M1218
12046D53149K872K1887L1901l5593l5847L143o399p737j7490J5855k7698J0996
12034D09039l7544R324O4258N3179m119j8875n9039j1206L8891L9948j5840l8977
12022D29039k4483l7498J1159j1231N931K7963n4648n6237K4979O0425J5368J9605
12010D10372J9598m0452l3597R294O0226k4585k6707j735L3659P5295R4126Q2604
11998F58098n4281p4804o3577o612m4036o1591L488K4341J2968M7861o990m1143
11986C93722l9362k503P4608N066o915K6126j0219l8240j1274M4077K6128L179
11974D64393l8068n6604K44k9019N0967K8905Q2976j6751l4068p5977q6162m180
$$ y = [409081, 442445, 454694, 446695, 402003, 407787, 469246, 471302, 475720, 451306, 432369, 411931, 453149, 456021, 477908, 509809, 474216, 438369, 441512, 435113, 427376, 409886, 425741, 398043, 409039, 371495, 380819, 445077, 498256, 494137, 475262, 416223, 405017, 443908, 483856, 468016, 429039, 404556, 367058, 378217, 366986, 372917, 400880, 346232, 289995, 314974, 375399, 390767, 410372, 429970, 389518, 355921, 365215, 425441, 400856, 374149, 372414, 406073, 481368, 575494, 658098, 603817, 529013, 465436, 458824, 414788, 353197, 356685, 381026, 393994, 441855, 434865, 393722, 354360, 351857, 426465, 431531, 424616, 450742, 440523, 402283, 391009, 435086, 461214, 464393, 426325, 369721, 369965, 340946, 391913, 420818, 503794, 487043, 452975, 376998, 290836, 286656]
11962B86656M2513J2944J1706l4652J922R3253J05765J8985J2496p735o7280p3073
11950D03500l3693J7356J2197j0530L265K0302R978M5929J0602l2318m239j7705
11938D24644K349Q550R807J0546o626j073l2453l6678l7745J2754m8073M2979
11926C48981R9872J9113o2778o6893l1530j967J5028j9620k0904L8643J2733l732
11914C26946K3157K7744L0184k9517r550O586n3573l397K1860M3515O857N411
11902C96223j224l8505J8351P4382p1266p3283L31N3009O9890j3377n8577l6920
11890C19034k3181l0088J3093J1147L2385R392O780L7528J6215K0951l8600k7160
11878C47496l0379K4038K4255l0716j8384q925m0099K7450R053Q458M2805K3239
$$ y = [286656, 329169, 342113, 353819, 319167, 321089, 414342, 520107, 539092, 551588, 543853, 476573, 403500, 369807, 387163, 399360, 388830, 392095, 412397, 422375, 468304, 478906, 446588, 442349, 424644, 426993, 435543, 445350, 455896, 449270, 448197, 415744, 379066, 341321, 354075, 306002, 348981, 448853, 467966, 405188, 338295, 306765, 304798, 319826, 300206, 279302, 317945, 330678, 326946, 350103, 377847, 408031, 378514, 368964, 375550, 321977, 318580, 340440, 383955, 390812, 396223, 394999, 356494, 374845, 449227, 377961, 304678, 305009, 358018, 427908, 414531, 355954, 319034, 295853, 265765, 278858, 290005, 322390, 331782, 338562, 376090, 392305, 413256, 374656, 347496, 317117, 341155, 365410, 334694, 316310, 307385, 267286, 294736, 303789, 312247, 355052, 378291]
11866C78291J6431O327j7863O6920K625j6097m4020l3695k4466n81Q930N768l2927
11853C15643l806K2929j0445p174N405P9222J0574j27215j24052Q472Q8202K5067
11841B82822k5027K9724N3341p320l1949j4387k2182K2296M5432J4757j1902n651
11829C29954j092K6487J7578k2658j9414j554J7438K2322J264k8091j9817J8320
11817C40737P1552N4761j6505k4690n0946K9722r190M5988K8650j8411o6509l5543
11805C49616j8921Q621L6673m8531o6838J2348p953p5994N4224J24381Q0204o5952
11793C81878o0756M7181M8024K2129n398k7075n8443j4815r410j6727N9180K9268
11781C95036j5621m770j2375L1460k7456p0873m6436L520N2489O6595M4277K2353
$$ y = [378291, 394722, 401049, 383186, 450106, 452731, 436634, 392614, 358919, 334453, 333872, 342802, 348570, 315643, 311837, 334766, 324321, 317147, 322552, 401774, 412348, 285133, 161081, 169553, 257755, 282822, 257795, 287519, 340860, 333540, 301591, 287204, 265022, 287318, 332750, 347507, 335605, 329954, 328862, 355349, 372927, 350269, 330855, 329301, 346739, 369061, 370325, 342234, 322417, 340737, 412289, 467050, 450545, 425855, 374909, 404631, 395441, 441429, 470079, 451668, 385159, 349616, 330695, 339316, 375989, 327458, 260620, 272968, 265015, 189021, 243245, 367626, 447830, 381878, 321122, 368303, 416327, 438456, 433058, 405983, 347540, 332725, 323315, 306588, 365768, 395036, 379415, 374645, 362270, 393730, 366274, 295401, 248965, 252485, 304974, 371569, 415846, 438199]
11769D38199j9859p1956n7196n10O455K4540J767M578J2988l2783Q272K2121Q071
11756C44687K0880p7104k7675R3847J7769j8542l0869J9867l7118p0331j8011
11745B17400N7226K4720l555l5900K3237o160J1860J9117J3508j1219n3700o421
11733B50113j575O5966J18184J1993q5466p5098J1118L988L6820K9806j2630q7617
11721B65602j5658K3677L264n1634O1647O9660k5349j6220m389n8530j9571L2051
11709B64550n053l4997M6607K4910k5419P887j4778j0189p6275m896L2404L7720
11697B42471P2230K5413k189q367O882l9647K4700P308l0177l848l0648j0533
11685B53595J7962J1244N1008M0655n8234o4669l1644l5121K4261K1859j6181
$$ y = [438199, 418340, 346384, 289188, 288678, 295133, 319673, 321440, 326018, 339006, 306223, 314495, 336616, 344687, 365567, 288463, 260788, 354635, 372404, 353862, 322993, 342860, 305742, 235411, 217400, 274626, 299346, 295791, 259891, 283128, 276968, 288828, 307945, 321453, 310234, 256534, 250113, 248538, 314504, 432688, 444681, 359215, 284117, 295235, 299223, 336043, 365849, 353219, 265602, 249944, 273621, 276885, 225251, 286898, 356558, 331209, 314989, 310600, 252070, 232499, 264550, 259497, 224500, 271107, 296017, 270598, 278485, 263707, 253518, 177243, 172347, 204751, 242471, 314701, 340114, 337925, 329558, 336440, 296793, 321493, 328801, 298624, 294776, 264128, 253595, 271557, 282801, 333809, 374464, 316230, 251561, 219917, 184796, 209057, 230916, 214735]
11674B14735j6298O1935O8859m5932m8096M6022L4788n505O339n9197Q666M0867
11662C07183K3070l0230k1566K9300m1399j975m0177K6590J3824j2816m7816K8486
11650B32474N8722J4557J0138l3465O560q387K9P5717M3527m8208p6533m2270
11638B32861j9318J8084M189K6586K7982O3301p6224m5471n9221J408N505m8615
11626A31067l7309Q9393J22352J1732r435j7401m1575O025j3635l9963k5320K4844
11614B00775J3149N005J3326J7715J5139Q923J3216R549N692j3781l5862j8538
11602B34308L9752J5402r87M00o081J5701j9913M4090N523p5175P17P6652L725
11589C34114l6249j9585j706N6014K2326m5854l6350q4K0670M3339N2807K9675
$$ y = [214735, 198437, 260372, 329231, 283299, 235203, 281225, 316013, 310508, 316847, 257650, 266316, 307183, 330253, 300023, 278457, 307757, 266358, 264383, 224206, 250796, 264620, 251804, 203988, 232474, 291196, 305753, 315891, 282426, 288986, 280599, 280628, 356345, 399872, 351664, 275131, 232861, 213543, 231627, 235816, 262402, 290384, 353685, 277461, 231990, 172769, 174177, 179682, 131067, 93758, 183151, 305503, 317235, 307800, 290399, 248824, 254849, 241214, 201251, 175931, 200775, 213924, 218929, 232255, 249970, 265109, 274032, 287248, 296797, 302489, 288708, 252846, 234308, 274060, 289462, 288475, 288875, 282794, 298495, 278582, 322672, 328195, 253020, 253737, 330389, 334114, 297865, 278280, 276574, 332588, 354914, 309060, 272710, 272626, 293296, 336635, 389442, 419117]
11577D19117M0987J9528L5733n1926n0507r615R386o5339p3575K1781K5701l8808
11565B82463l1477k4907O0547J3013M4739m0413n8575O4646l4217q2356J800M98
11553A95761M0501l7973L7567Q1527p482l0333K5378j0263k7282M3131l9718o0092
11541B10722j9616j6335k176M9775P2941j1543M5288M7667L0880O8587K8801j4010
11529D90981k2348n4499p4609j0330n1954l4263M26o979M6719K9025N0632p207
11517C55594n0200l3913r45J2678n5957j4975O0840K8328J1523l0912m6929K1228
11505B56360M8920j2362k6593k506J7207L8867r415j5728k289L2866J3233j9325
11493C19235m5206J2764m1898J2178M6740L9454r289K3480O0685l0419n4855k4539
$$ y = [419117, 460104, 479632, 515365, 463439, 412932, 403317, 412703, 347364, 273789, 295570, 321271, 282463, 250986, 226079, 286626, 299639, 344378, 303965, 245390, 310036, 275819, 193463, 195263, 195761, 236262, 198289, 235856, 317383, 309901, 279568, 304946, 294683, 267401, 310532, 270814, 210722, 191106, 174771, 172595, 222370, 295311, 283768, 329056, 376723, 407603, 476190, 504991, 490981, 468633, 414134, 339525, 329195, 277241, 242978, 243404, 236425, 283144, 312169, 362801, 355594, 305394, 271481, 270536, 283214, 227257, 212282, 273122, 301450, 312973, 282061, 235132, 256360, 305280, 292918, 266325, 263819, 281026, 319893, 310478, 294750, 292461, 325327, 338560, 319235, 274029, 286793, 244895, 257073, 303813, 343267, 333978, 357458, 418143, 387724, 332869, 308330]
11481C08330J2628o942o507J1020K8286k2086K5138L2823o1822l986J118L5955
11469C53955J1911K2825l4976L5385k8449K207N9729k8013j1310J611J6594m8763
11457C52706n1603n6208q674q672N1857Q7681l7070k4068n0415k7492k4055l7
11445B03950J7806j51N1972L9806M6156M4987J0505k650P582j2783n6955R872
11433C60097J8757n7176K032O777p1791n1297r591O3308j305j9819N8383L5176
11421C33551j2016m0736O813K2296m7272M8349j9472k7104K3241K1554m6829l3720
11409B28655M6614O3651J0772N976p7711l0678J2252M1034k4699l2881N1608l8331
11397B56262n6506M5251j4885m6967l786K4409m292M3754k648m6524K0432K7975
$$ y = [308330, 320958, 314016, 307509, 318529, 346815, 324729, 349867, 382690, 320868, 316882, 318000, 353955, 365866, 388691, 353715, 389100, 360651, 362858, 422587, 394574, 383264, 384875, 401469, 352706, 301103, 244895, 236221, 227549, 279406, 367087, 330017, 305949, 255534, 228042, 203987, 203950, 221756, 221605, 273577, 313383, 359539, 404526, 415031, 412381, 419963, 407180, 350225, 360097, 378854, 321678, 323710, 330487, 258696, 207399, 197808, 261116, 259811, 239992, 298375, 333551, 321535, 280799, 287612, 309908, 262636, 310985, 291513, 264409, 287650, 309204, 262375, 228655, 275269, 338920, 349692, 355668, 277957, 247279, 259531, 300565, 275866, 242985, 294593, 256262, 199756, 245007, 230122, 183155, 179369, 203778, 199486, 243240, 240592, 194068, 214500, 242475]
11385B42475m3032j4127j7495R7029N0005j4185m4867n7997J3905j6798j0577
11374A84336M4274P0869K3438J2753q16m3689k4062l1089o295O490j6007Q0421
11362C00623M2443l0108J52l533M1146q874k3531k2066o1595l652M7415K9892
11350C08312n1082L5571r228k9914k095O6815m354m3092J314k9082k0011M3528
11338B66682O0676q841q9472l3366O0459J8906J2701j5075j7404m4211o030K0803
11326B25828j8694M7973K8407R72R924k6302j6963M4642K8953Q185m7780J395
11314B86540k1412m9626Q316j3264l1130k0203Q11k6144M681j1260J8752M9762
11302A95823O157R716M4494M2327N2704J6418J1368p4391n2161K7386n235Q97
$$ y = [242475, 199443, 185316, 167821, 264850, 314855, 300670, 255803, 197806, 211711, 194913, 184336, 228610, 299479, 322917, 335670, 334854, 291165, 267103, 236014, 229719, 236209, 220202, 300623, 343066, 312958, 313110, 309577, 350723, 341849, 318318, 296252, 234657, 231005, 278420, 308312, 257230, 292801, 283573, 253659, 251564, 318379, 314025, 270933, 272247, 243165, 223154, 266682, 327358, 318517, 229045, 195679, 256138, 275044, 287745, 272670, 255266, 211055, 205025, 225828, 207134, 255107, 283514, 284486, 294410, 268108, 251145, 295787, 324740, 332925, 285145, 286540, 265128, 215502, 223818, 210554, 179424, 159221, 160032, 133888, 138569, 127309, 146061, 195823, 201980, 211696, 256190, 298517, 351221, 367639, 379007, 304616, 252455, 279841, 274606, 275503]
11290B75503K3104l4584o4590j6140k4844K294J8458l836m8314J7783N2819L320
11278B00973M934K4712n2652J7214M8313M2759R009q5231k3088l1538k0302k2638
11266A12465Q18K0414k211N3705R9342Q5019p7161m7340k7734p5398k851R4735
11254B33803k2466m6866M1521p964n4916m7433L5808L9156j8553J9216O27l3123
11242A38810M8194n0042m7706J4081J3076L282M5943J7915k8047l0648n1088L9552
11230A13322M9071P7695j5788j250J7531P230o9783j3626N9198l5537k0072J8313
11218A86304L8351M534m0173J4067j3239k0175K4626m0845K2819l427k816M6551
11206B16577k854k5969j8453J4187m3419p49K8565K2797K0514J3000j7486l0888
$$ y = [275503, 298607, 264023, 199433, 183293, 158449, 160743, 179201, 175365, 127051, 144834, 197653, 200973, 205907, 230619, 177967, 195181, 243494, 286253, 295262, 210031, 186943, 155405, 135103, 112465, 113283, 133697, 131486, 185191, 284533, 369552, 292391, 245051, 217317, 141919, 139068, 233803, 211337, 164471, 205992, 198028, 143112, 95679, 131487, 170643, 152090, 171306, 171933, 138810, 187004, 136962, 89256, 103337, 116413, 119695, 165638, 183553, 155506, 124858, 73770, 113322, 162393, 240088, 224300, 223050, 240581, 247811, 178028, 164402, 223600, 188063, 167991, 186304, 224655, 229189, 189016, 203083, 189844, 169669, 194295, 153450, 176269, 172842, 170026, 216577, 213723, 187754, 169301, 183488, 140069, 139320, 167885, 190682, 211196, 224196, 206710, 175822]
11194A75822l9778m8340p87J25031Q8169p0824j07645R851J4236J9305r24L1166
11182A95282J2560l9564J6349j7272n2009r416j5749K1948K9374O2916L689k5911
11170A82197j2989N6870L1838J2740j1064p704j9763K2511l6418L0666j7118M475
11158B36241L9884l9513m6731l323k6596l2956m2618j7892P843O8247N4201j1646
11146A85141o4035l1369j2898q758K8149K7789N5952J7734j0193m9679n7909l6538
11134D3386M3346N3135P6230j5298k0190M507J2348J2866R759j6964K1886K2905
11122B47916j9758j1373k8941l7651N3071P5659o985j5438m6587k2471L7332m5087
11110A79687q1717o84L8151K2065m864l8188k5554m528K3808M8459j1260n986
$$ y = [175822, 136044, 87704, 86917, 211948, 300117, 229293, 121648, 131499, 145735, 165040, 164116, 195282, 207842, 168278, 184627, 167355, 115346, 105930, 90181, 112129, 141503, 204419, 208108, 182197, 169208, 226078, 257916, 270656, 259592, 251888, 232125, 254636, 218218, 248884, 231766, 236241, 276125, 236612, 189881, 186558, 159962, 127006, 84388, 66496, 74339, 142586, 196787, 185141, 121106, 89737, 76839, 68081, 96230, 124019, 179971, 197705, 187512, 137833, 79924, 43386, 86732, 139867, 216097, 200799, 180609, 185116, 197464, 210330, 220089, 203125, 225011, 247916, 228158, 216785, 187844, 150193, 203264, 278923, 271938, 256500, 209913, 187442, 224774, 179687, 97970, 97286, 135437, 157502, 152638, 114450, 88896, 84368, 108176, 156635, 145375, 139389]
11098A39389m7447m3800j9698j8124L1779M088L5269M3685M6628l506K4280k2119
11086A70424l7501n6900j08952M4067Q9318L7977K480k6496M894L4821L0328K2707
11074B07167l1040k8392J7804L4399l3102j8718q321m7930k2168K2858J040l004
11062I0593J8033k5231k6894O1637J3717J6614k3986m3373k28J4003N3045N2561
11050B00491j1493P8877P5679J7517j2913K9053k6369j6869l0803O8870P5364
11039D47404J555K4325Q5588J01382P3991L9586n5151j37245m4045k219O8015
11028F03186L0301J07716J1334P0087N2561O536p6789p7489o4878n2629n3788
11017E56148J2670j1749Q136J7434j9924L4918N4430L0385o0868r6827j0298k5698
$$ y = [139389, 91942, 48142, 28444, 10320, 42099, 46187, 81456, 125141, 171769, 168263, 192543, 170424, 132923, 76023, -32929, 11138, 100456, 138433, 140913, 114417, 119311, 154132, 184460, 207167, 176127, 147735, 165539, 199938, 166836, 148118, 139797, 91867, 69699, 92557, 93597, 90593, 108626, 83395, 56501, 118138, 131855, 148469, 124483, 81110, 80882, 94885, 147930, 200491, 188998, 267875, 343554, 361071, 348158, 377211, 350842, 333973, 303170, 372040, 447404, 448959, 473284, 558872, 660254, 734245, 773831, 718680, 581435, 537390, 535171, 603186, 633487, 741203, 752537, 822624, 875185, 881721, 804932, 727443, 662565, 609936, 556148, 568818, 557069, 565205, 582639, 562715, 597633, 652063, 682448, 621580, 524753, 514455, 488757]
11005D88757k8475k1044K9498N8939P064m1565k5008j5740l0559k2566r5282q38
10993C03181j0200l3747n8535m7263o015j5094J4467O7945l8395l2381J8953L0487
10981A93403r460j675K2849k4282p42N5159m507k8633l0631n2853m1654l4616
10969D2358Q6720J52870O6959p0196r9797l280m5385L9845r143p1970k3881J4666
10957G9766M3884J3689j5347N320R9723J04197l0508k3479J0214o1305m1024L1766
10945B16896J7625j7591k205J2517o5575k6742L5766k9034j1964K1729K0976l1059
10933A41339m0042k9134J2983M8929p310l264P040N278M7515J3044m9425p7770
10921F9183N285M1318K7914L0194k2319N5512L0191p176j9761K4069K3101K5540
$$ y = [488757, 460282, 439238, 468736, 527675, 534739, 493174, 468166, 452426, 421867, 399301, 304019, 303181, 292981, 259234, 200699, 153436, 147421, 132327, 146794, 214739, 176344, 143963, 162916, 193403, 183943, 182268, 205117, 180835, 180093, 235252, 230745, 202112, 171481, 118628, 76974, 42358, 129078, 281948, 348907, 278711, 178914, 175634, 130249, 170094, 160951, 88981, 65100, 79766, 123650, 137339, 121992, 127312, 227035, 331232, 300724, 277245, 287459, 226154, 185130, 216896, 234521, 216930, 214725, 227242, 161667, 134925, 170691, 141657, 129693, 151422, 172398, 141339, 101297, 72163, 85146, 134075, 126765, 123501, 130541, 135819, 183334, 196378, 146953, 69183, 74468, 115786, 143700, 173894, 151575, 207087, 237278, 230102, 210341, 234410, 257511, 283051]
10909B83051K9926R104k0074k3277M4471M5130l1082j6773k2984J0725j3304n0146
10897B44767p647J1010K5946n5324l3932J3070k5738j8748J5062K9084J5421m4059
10885A68912o9329l4508K9844M736k0161O0781O5073q0287j4268K4312m528k3867
10873A06710K4760N9540R638q822N7542R3213O804n6403L605j1955p7635p362
10861A99635m7427L5436P6145M3180j3255o2343l1187J4104M2584P483j9816L3364
10849B77903J87M3115N3382j1152m6195p8840l4824L3568M412k6126j5551k608
10837A97271M7203K5705o6523j7744K8561n6268m4350J8881L5168O5400Q4943
10826C18247m8571K8014J2943p475M1790R9304K7942o6697R233k1742k6981j131
$$ y = [283051, 312977, 322081, 302007, 278730, 323201, 368331, 337249, 320476, 297492, 308217, 294913, 244767, 237120, 248130, 274076, 218752, 184820, 197890, 172152, 153404, 168466, 197550, 212971, 168912, 99583, 65075, 94919, 99655, 79494, 140275, 205348, 125061, 110793, 135105, 130577, 106710, 131470, 191010, 200648, 191826, 249368, 342581, 349385, 292982, 296587, 284632, 206997, 199635, 152208, 187644, 263789, 306969, 293714, 231371, 200184, 214288, 256872, 264355, 244539, 277903, 278090, 321205, 374587, 363435, 317240, 238400, 203576, 237144, 241556, 215430, 199879, 197271, 244474, 270179, 203656, 185912, 214473, 158205, 113855, 132736, 167904, 233304, 318247, 269676, 297690, 310633, 303158, 344948, 444252, 472194, 405497, 414730, 392988, 366007, 364876]
10814C64876j8781o5123l7384J7349J0534k5535m2040L897k095J551j2752k2388
10802A72109j1195k9437J9711l9826p68N5590K0311R487M5094k5935l1872j487
10790A81782j8775R494K7681k8617j821K2017M6316L9767M5161K7511O9605M8189
10778D68310L1842R394q3292j26317l5467k1617n8078j2448P251j3049k7678L4793
10766A73644j3006p7961k4899L0265J4364K680Q882J4961K3909j1489m2078M1039
10754A40311J7671J0459K1807O461k865R321N3023m3337L5906R3171J1215p7004
10742B76139j0736M061M3244J7292J6117k7623k9673J9224N2364M4598m3196K0055
10730C81866J7017K5970P786r340M96k2498n0669q9249q1675p4309q7030m8636
$$ y = [364876, 346095, 280972, 243588, 260937, 271471, 245936, 203896, 207793, 205698, 207249, 194497, 172109, 160914, 131477, 151188, 111362, 110594, 166184, 186495, 195982, 241076, 215141, 183269, 181782, 163007, 172501, 200182, 171565, 169744, 191761, 238077, 277844, 323005, 350516, 420121, 468310, 500152, 509546, 426254, 299937, 264470, 242853, 184775, 172327, 179578, 166529, 138851, 173644, 160638, 82677, 57778, 88043, 102407, 105087, 113969, 128930, 152839, 141350, 99272, 140311, 157982, 168441, 190248, 196709, 193844, 203165, 256188, 212851, 248757, 341928, 353143, 276139, 265403, 269464, 312708, 330000, 346117, 318494, 288821, 308045, 360409, 405007, 361811, 381866, 398883, 424853, 432639, 423299, 423795, 401297, 350628, 261379, 179704, 105395, 18365, -30271]
10718c0271k4329K1264l934M1043M9277M7152j1o2720K3410L7983p102n1394L3797
10705G4165L5843J6520O3109N0755l6886m1585k2555o701M0490j6100m2986L9007
10693A53076J15380J43917K17462J72387K2576k4328p1927j23711j17079p8466
10683D09287l3706q0243m2300k7337J957K8680l685n4147R211L645l4597p1161
10671A05604M235K6885n1523k4278P6547n759M4555M4500k1740o524l220M1081
10659B30363J7898J3654j3738n2413j4027K9292J38941N4763L8032J03771O474
10648E53010J3307l3255n2191J5596k4240O2167K0408m5286P6807N4115N5912
10637F96350K23952K26458K19856K28693J89949K34076K30186J84810L56212M15239
$$ y = [-30271, -54600, -33336, -37270, 3773, 53050, 100202, 100191, 37471, 60881, 98864, 91762, 40368, 74165, 110008, 126528, 189637, 240392, 203506, 161921, 139366, 132665, 173155, 157055, 114069, 153076, 268456, 412373, 629835, 802222, 824798, 800470, 728543, 604832, 487753, 409287, 375581, 295338, 253038, 225701, 227658, 256338, 252653, 198506, 207717, 211362, 176765, 105604, 109839, 136724, 85201, 60923, 137470, 131711, 176266, 220766, 199026, 192502, 189282, 230363, 248261, 261915, 248177, 195764, 181737, 211029, 349970, 404733, 442765, 546536, 553010, 566317, 533062, 480871, 496467, 472227, 534394, 554802, 509516, 586323, 640438, 696350, 920302, 1146760, 1366616, 1595309, 1785258, 2019334, 2249520, 2434330, 2790542, 3205781]
10627C205781M86831P54214J165435J538715K197757L019082L990633N132021
10619B1490469O121749O219908M898170K415000j39853j680188j730493o62579
10611C6932183J256254L780455O643999R698300J2129829J2337136Q592598J763882
10603I3134636m541535p664828p289287m514749n87758L771331Q287136J2512142
10595I3107088J5572133J4681987P957200k380644j1166897j5017618j4101870
10588H8651379j0281546n714646j395685K622374O098562Q034924O949784J866818
10580I6831964n137618j0451585j2355606j1026935q172462n121168k367921k94994
10572D1903675J205741J761131J023402j057310l667946n650714o304799n742597
$$ y = [3205781, 3692612, 4446826, 5612261, 7150976, 9348733, 12367815, 16358448, 21490469, 27612218, 33832126, 38730296, 41145296, 41005443, 39325255, 37594762, 36932183, 38188437, 41968892, 48612891, 58311191, 70441020, 82778156, 91370754, 93134636, 88593101, 80928273, 73638986, 69124237, 68536479, 72307810, 80594946, 93107088, 108679221, 123361208, 131318408, 128937764, 117770867, 102753249, 88651379, 78369833, 72655187, 71259502, 73881876, 79980438, 88015362, 94965146, 96831964, 91694346, 81242761, 68887155, 57860220, 49687758, 44566590, 42198669, 41903675, 43109416, 44870547, 45893949, 44836639, 41168693, 35517979, 29213180, 23470583]
10564B3470583m688956l498675k584352k016969j531075j180906r38322p58970
10556F272358n78762m45726m16585l96875l22670k36593j78147j88914j89565
10547C318521j73299j22552r6703r9502j6927r7979o8955j6419n3568r0558j21639
10536B360420r7325j13497p2517n8222k9099j10981q8044o2467l5753j6726l5747
10525A640042l7813J9686J465q973j7818o9606o0783N050L4210L6960k5971o3843
10513A452606N032M0521M8304R3847K5671P838N1842M2765o537j2733k4415k1316
10501A703425O5653O6316K6685q3392n8699k8022n9591k8909o8028p1296L3660
10490A497802M0404J3958J9660j5911l1667m6399j2855m4097q6255l7870k6800
$$ y = [23470583, 18781627, 15282952, 12698600, 10681631, 9150556, 7969650, 7031328, 6272358, 5693596, 5247870, 4831285, 4434410, 4111740, 3875147, 3697000, 3508086, 3318521, 3145222, 3022670, 2925967, 2826465, 2809538, 2711559, 2642604, 2626185, 2572617, 2482059, 2360420, 2263095, 2149598, 2077081, 2018859, 1989760, 1878779, 1790735, 1728268, 1692515, 1675789, 1640042, 1602229, 1621915, 1623380, 1614407, 1596589, 1526983, 1466200, 1471250, 1505460, 1542420, 1516449, 1452606, 1457638, 1498159, 1546463, 1640310, 1665981, 1673819, 1725661, 1768426, 1761889, 1749156, 1724741, 1703425, 1769078, 1835394, 1862079, 1778687, 1719988, 1691966, 1632375, 1603466, 1535438, 1464142, 1497802, 1538206, 1552164, 1571824, 1555913, 1524246, 1477847, 1464992, 1420895, 1334640, 1296770, 1269970]
10479A269970m811l8373J780O3334J2265n8381P3438J70004K05903J65847J56276
10468B017252J40861O0348j06317k01080j44888r3333p2790j2980p6797q5286
10458A424990l0865r952l5297j1105n4261l6618j6834l4940K1346P7299N5767
10447A349530J04849J09166j2812p0356j52214j84276j08100r375l2092l0520
10437I63800n8285l8062L870j0741J59O7175L6381N8826N2046P4814L6337n353
10425A180967j27900o1165m9958n4421l4671k960P9542k0028q4628j2792M028
10414H16014k9512k5527k1792l053k539Q5438J13587Q8281P3256m307k0290n3043
10402A016513k8181o317k2914m0146o6301m3410j4490M8860R6493J46962J23040
$$ y = [1269970, 1265159, 1226786, 1228566, 1291900, 1304165, 1245784, 1319222, 1489226, 1695129, 1860976, 2017252, 2158113, 2218461, 2112144, 1911064, 1766176, 1672843, 1600053, 1587073, 1510276, 1424990, 1394125, 1384173, 1348876, 1337771, 1283510, 1246892, 1230058, 1195118, 1216464, 1293763, 1349530, 1454379, 1563545, 1550733, 1480377, 1328163, 1143887, 1035787, 1026412, 994320, 963800, 905515, 867453, 871323, 860582, 860741, 927916, 964297, 1023123, 1075169, 1149983, 1186320, 1180967, 1053067, 991902, 941944, 887523, 852852, 849892, 929434, 909406, 824778, 811986, 816014, 786502, 760975, 739183, 736130, 733591, 819029, 932616, 1020897, 1094153, 1089846, 1069556, 1016513, 988332, 982015, 959101, 918955, 852654, 809244, 794754, 843614, 940107, 1087069, 1210109]
10391A210109K54075K80253M54173O58772O64541N41484K5157m55683p04697o97554
10381B230630m43455l29787k11732r9595j45929j08493o2917k5241n7636n2149
10371F93696R740O0453k4731R951J3403k338O281J6542J1442J682M6435K8293
10359H70849m2845L582N1926O666M0070P7334J86364K65982M01417N39571Q77460
10348C278376J269665J569691J399730L82103p79581j367940j470005j131402
10340C150637o75853m36852m00783k75264j62963j30976o6380n4328j06049M8044
10330H89233N0617j18391n4243m7974m9540j5422k5604k632k4926m5434K6N9974
10318F15684K8527P0771P624j1513P5278Q0318R3824J02370K62453K94094M21862
$$ y = [1210109, 1464184, 1744437, 2198610, 2857382, 3521923, 4063407, 4088564, 3632881, 2928184, 2230630, 1787175, 1457388, 1245656, 1146061, 1000132, 891639, 828722, 803481, 745845, 693696, 703436, 763889, 739158, 749109, 762512, 760174, 766455, 782997, 794439, 796121, 842556, 870849, 828004, 831586, 883512, 890178, 930248, 1007582, 1193946, 1459928, 1861345, 2400916, 3278376, 4548041, 6117732, 7517462, 7899565, 7119984, 5752044, 4282039, 3150637, 2474784, 2037932, 1637149, 1361885, 1198922, 1067946, 1001566, 947238, 841189, 889233, 939850, 821459, 767216, 719242, 669702, 654280, 628676, 626044, 601118, 555684, 555710, 615684, 644211, 714982, 722606, 711093, 786371, 866689, 960513, 1062883, 1325336, 1619430, 2041292]
10307B041292O42629O78618M46307o0701n33317o81704n93787m50188l02672j99480
10297I86997j33519q9618m6112o2965p6892n0685p1239K3817j3627o897P894l6815
10285D30339M2704J4945l3961m0883j8555l1800L9072j250J77L0734l5513p5540
10273C20469m0590r3719o3314P6716J17758N1360l4021k331M6391J1465o2334
10262C27850l8096j419j5822N8253n146l8283K8814r292n9707J9276J6880K6914
10250C10222L5256l9005n9828L120L9516k4962M1992N7225n8731j0854K3092K181
10238C19224J1838L7121K178o445l0372o288K7234m9350j1725o5789j3962Q9361
10226C03025N3942j0398n4527k7540J3929L8947L6226l0531J944j2332m6492j3151
$$ y = [2041292, 2683921, 3362539, 3808846, 3748145, 3214828, 2533124, 1939337, 1489149, 1186477, 986997, 853478, 763860, 717748, 654783, 577891, 527206, 455967, 479784, 466157, 459260, 467154, 430339, 473043, 487988, 454027, 413144, 394589, 362789, 401861, 400611, 400788, 431522, 396009, 320469, 279879, 186160, 122846, 199562, 317320, 368680, 334659, 332328, 378719, 390184, 327850, 289754, 288335, 272513, 330766, 325620, 287337, 316151, 306859, 247152, 266428, 283308, 310222, 345478, 306473, 246645, 249765, 289281, 264319, 306311, 363536, 304805, 293951, 317043, 319224, 331062, 368183, 370361, 363916, 333544, 327256, 354490, 305140, 293415, 227626, 213664, 303025, 356967, 346569, 292042, 264502, 278431, 317378, 353604, 323073, 325017, 312685, 266193, 253042]
10214B53042M6245J8355J6114m8686m8415L5233K5449k3644L973l2240k7715j7801
10202A99910m6177M6644M3508L5419L3169l5044k8410o607J2488p808j5712k2559
10190B08821k3675L6448J00536M9457M8569l2900l0949J3670n622O1346j6697
10179D09004j6416N2024K0411K7796m7486j4858m478P1407J16032L4037J1760
10168F59233N262K0302N0513K3734p1895m005N070j00327J9738N7196J06343J31666
10156I02830O1007m3972q0241j05001p8224j9464n9488j8138M2588N2211N6476
10145G10584Q0688k2354o1476p6189o2982n059K4983m5028n9645m0714k4391M6353
10133D64770J02140M9848q4537r8286R562J2656m8801n7350o857j5812L517m0046
$$ y = [253042, 299287, 317642, 333756, 285070, 236655, 271888, 297337, 273693, 277666, 245426, 217711, 199910, 153733, 200377, 243885, 279304, 312473, 277429, 249019, 242412, 254900, 247092, 231380, 208821, 185146, 221594, 322130, 371587, 420156, 387256, 356307, 369977, 364355, 425701, 409004, 392588, 444612, 465023, 492819, 445333, 430475, 425997, 497404, 613436, 647473, 659233, 664495, 684797, 735310, 759044, 687149, 683144, 688214, 587887, 607625, 664821, 771164, 902830, 963837, 919865, 839624, 734623, 656399, 636935, 577447, 559309, 601897, 654108, 710584, 791272, 768918, 707442, 631253, 568271, 563212, 588195, 543167, 483522, 442808, 418417, 464770, 566910, 616758, 532221, 433935, 443497, 456153, 407352, 350002, 343145, 327333, 330850, 290804]
10121B90804k3254K7876M0900m659q5094n9124L8979M5277L8221r760n266P118
10109C02018M8272Q4178L1426p6952m8721p7848j4306J5120m066k7513J8477K0130
10097B70215L3953m3530n2938N282J7278K1833j6320J428M005L7000J5598k8602
10085B65202k1121M4722k9084m3949j076J8304L9719l0115k8626j4136j7407m916
10073A77517j4348L4479p836o4837K3295L2498n978M1241o396K897K0642J1323
10061B44497l7248k2110j9297J5110N0108J3779l8655l4700o305K6830N4839l4070
10049B12778j5295l2109L5235N6376n2238n2880k0331J295N2714L1315k6136k8510
10037A62214L2029J9161m9898o2323N118k2726l2213R558N568K5596j3846J2788
$$ y = [290804, 267550, 295426, 336326, 331667, 246573, 187449, 226428, 271705, 309926, 300166, 294900, 302018, 350290, 434468, 465894, 388942, 340221, 262373, 248067, 263187, 259121, 231608, 250085, 270215, 304168, 260638, 207700, 212982, 230260, 252093, 235773, 237201, 241206, 278206, 293804, 265202, 244081, 288803, 259719, 215770, 214694, 232998, 272717, 242602, 213976, 199840, 182433, 177517, 163169, 197648, 189812, 124975, 148270, 180768, 174790, 216031, 209635, 212532, 233174, 244497, 207249, 185139, 165842, 180952, 231060, 244839, 206184, 171484, 165179, 192009, 246848, 212778, 197483, 165374, 200609, 256985, 204747, 151867, 131536, 132831, 185545, 216860, 190724, 162214, 194243, 213404, 163506, 101183, 106301, 83575, 51362, 60920, 66488, 92084, 78238, 91026]
10025I1026J6252L8198L4294o1093o8942K7402K7792J126R2763L3779O101m9823
10013A88875n7795L3341N9819m0571k491J8884o6224J8636j6953m1411n5375K0058
10001E8793L5463k8726R997K8878N4245N6472O4065J3225N197M7962J642k0657
9989C26556r043j9208n345K2796M4930K4570q1938q2214m1189k8149J4758L5882
9977B02406L2523j8429o4409R675M9578m8462j9606L7731k3844k4707n3820K7232
9965A05868O2079j0415l7468J2511q998j9758j5664J9558O5036K7071l6922k2992
9953A39906l9074K0565K0303L6050K4877r287M210l838k5135Q5908O5605j7186
9941C02904n4223n6919L3148R378n759o7942n2580K3889K6718k2724o751K1125
$$ y = [91026, 107278, 145476, 179770, 118677, 49735, 77137, 104929, 106055, 198818, 232597, 238698, 188875, 131080, 164421, 224240, 183669, 181178, 200062, 133838, 152474, 135521, 94110, 38735, 58793, 94256, 65530, 75527, 104405, 158650, 215122, 279187, 292412, 297609, 345571, 347213, 326556, 317513, 298305, 292960, 315756, 360686, 385256, 303318, 221104, 179915, 151766, 166524, 202406, 234929, 216500, 152091, 161766, 211344, 162882, 143276, 181007, 157163, 132456, 78636, 105868, 167947, 157532, 120064, 132575, 123577, 103819, 88155, 107713, 172749, 199820, 162898, 139906, 100832, 121397, 141700, 177750, 202627, 193340, 197550, 193712, 168577, 254485, 320090, 302904, 248681, 191762, 224910, 234288, 228529, 160587, 108007, 131896, 158614, 135890, 129139, 150264]
9929A50264l898L9752R403n9062l157O5680K9851k8496l5072r827J1417J455j8757
9916A49553N380k4923J0111m629L8532J7893k9691M628j2455J1827K4805J0500
9904B01531k1845l4507k8097n745K3024M3913o240l6352P5534m1844o9451n3182
9892D6739j0303P706L2625J4068J2113N774L6689p148k4402k9512P836J819k883
9879I1121j2177M0860j5873o5783p993j224O903J4948K6306J9467J5780K6526
9867A38861j2037k8633l4011L6052L34k3554j482J9178K5317j3424m6273K5728
9855H6056M2945J0339l2948j1149N0177l149p638l501j7295L218k3715m6995J7107
9842F3452K410k210M7241j7187n7648N7606M1773M1466l2292P006L5286k4723
$$ y = [150264, 146366, 186118, 195521, 136459, 133302, 198982, 228833, 200337, 165265, 155438, 166855, 168310, 149553, 154933, 130010, 140121, 135492, 174024, 191917, 162226, 166854, 154399, 166226, 191031, 201531, 179686, 145179, 117082, 111337, 134361, 178274, 172034, 135682, 211216, 169372, 99921, 46739, 36436, 44142, 76767, 90835, 102948, 108722, 145411, 138263, 113861, 84349, 92185, 94004, 91121, 78944, 119804, 103931, 38148, 30155, 28931, 35834, 50782, 77088, 96555, 112335, 138861, 126824, 98191, 64180, 100232, 100566, 77012, 75530, 94708, 120025, 106601, 60328, 86056, 129001, 139340, 106392, 95243, 145420, 142271, 134633, 131132, 113837, 117055, 93340, 46345, 63452, 65862, 63652, 110893, 93706, 36058, 93664, 135437, 176903, 144611, 151617, 186903, 162180]
9830A62180m7214K3460J5282k7020J6868K5487p10p6621m1323K5974O1842k3045
9818A15160m5259k4537K2004M3628J1657p0154M804L8815n776o2610o99J791O763
9805C5587K2515m1609K1948L7552L3436j1307n0279l6193J192M5795L4546m3485
9793D9698q99K6543J715N3732K5917k8229n8538r309k224L433L2902L6030k70
9780A30501r779J6577L198n8720k3196P3340L3923n4517o925l8165J2796M652
9768H3685j4039N6812M13l0634J0583L69k2194O244m2135M5729P0847L6592j9192
9755A83080p0033K2138K2347l3168m0309k1665K521L8738O8700o0453m765N025
9743A12156L8544N607p3321m8844R18K5519Q3433Q528k0108m212l4901O572N2218
$$ y = [162180, 114966, 138426, 153708, 126688, 143556, 169043, 168333, 91712, 50389, 76363, 138205, 115160, 69901, 45364, 67368, 110996, 122653, 52499, 57303, 96118, 90342, 27732, 27033, 28824, 35587, 58102, 16493, 38441, 75993, 109429, 98122, 47843, 11650, 12842, 58637, 93183, 49698, 48799, 75342, 77057, 130789, 156706, 128477, 69939, 60630, 58406, 61839, 94741, 130771, 130501, 120722, 137299, 140497, 81777, 58581, 131921, 165844, 111327, 104402, 66237, 79033, 83685, 69646, 126458, 126871, 96237, 106820, 107189, 84995, 91239, 49104, 94833, 165680, 202272, 183080, 113047, 135185, 157532, 124364, 84055, 62390, 64911, 103649, 172349, 111896, 107131, 112156, 150700, 156307, 82986, 34142, 35060, 60579, 144012, 152540, 132432, 128220, 93319, 99891, 152109]
9730A52109O1197q264r0825o4763l5282l345N3817l4335k1066k2221m3876J4446
9718d2408O1374K34l3463M7882J15237k3711r5802q266J3271n4058p901L9671
9706A2060J0333o066K4775r259P583k3949K81O8881K3283j7133l6465k6575p930
9693A9819Q469K6937K2776m5932J1801l0468k9513M397j2826j9175M0184O2416
9681E8885k1719k4442p937N9843L0215m4048j2864M842L1986K8561K3528l0383
9669I6467n0998P223l005l884J9429j680O0030K3319l8909p155K1755O0965J22183
9656C05740K01037K91765K49309J9290j67997k54830k43687j32660n1814j8415
9646A97738j01433k5307M7196M8035q220k0268K949J6812j9870l3125k3268m1022
$$ y = [152109, 213306, 205042, 114217, 49454, 14172, 10827, 64644, 30309, 9243, -12978, -56854, -42408, 18966, 19200, -14263, 33619, 148856, 125145, 29343, 21077, 34348, -19710, -27611, 12060, 22393, 16327, 41102, 31843, 39426, 15477, 15758, 84639, 107922, 90789, 54324, 27749, 19819, 28288, 55225, 78001, 32069, 43870, 13402, -16111, -11714, -24540, -43715, -3531, 58885, 37166, 12724, 4787, 64630, 94845, 50797, 37933, 42775, 74761, 103322, 126850, 96467, 45469, 52692, 49687, 45803, 65232, 63552, 123582, 146901, 107992, 100837, 122592, 183557, 305740, 506777, 798542, 1047851, 1067141, 899144, 644314, 400627, 267967, 216153, 197738, 96305, 70998, 118194, 166229, 158009, 137741, 140690, 157502, 137632, 104507, 81239, 40217]
9634D0217r996K3963j1256m710k5889L9232M6565j306n9907J9625N8870J2934
9622A28342L4315k1827m2861l587j3674L2132j2976j3304m372P995L9265R13J0392
9609A40753J0497k5901l0823j9780m3997j1558m1631N5581O5292l9043m3364j8593
9597b567O863J6596J6817M4621o8718n8327k6969J602O7134M6146L0644L4162
9585A08004p0553j8814J8865K2168m6157o5606K0444O4900K3594L6529j489Q943
9573A00828J4936k1291l0954m2229J4483K1503j852l2717J3233L0797P517K4951
9561I9205J6770j1328n9487K332L33O4848K708n0006j9810j0906K9781j8270K33
9548D6403M8411L2466J9319L0098O4029l5706m1476m3560m8486J4526M2329Q961
$$ y = [40217, 30221, 54184, 42928, 38218, 12329, 51561, 98126, 96820, 36913, 56538, 115408, 128342, 162657, 140830, 97969, 94382, 80708, 112840, 99864, 86560, 82188, 90183, 129448, 130361, 140753, 151250, 125349, 94526, 74746, 30749, 19191, -22440, 33141, 98433, 59390, 16026, -2567, 4296, 20892, 37709, 82330, 13612, -44715, -71684, -70082, -2948, 43198, 73842, 108004, 37451, 18637, 37502, 59670, 13513, -52093, -31649, 33251, 56845, 93374, 91885, 100828, 115764, 94473, 63519, 21290, 35773, 57276, 55424, 22707, 35940, 66737, 74254, 99205, 115975, 104647, 45160, 47492, 47825, 112673, 115381, 65375, 45565, 34659, 64440, 46170, 46403, 94814, 127280, 146599, 176697, 240726, 205020, 163544, 119984, 71498, 86024, 128353, 137314]
9536A37314m7353j1487l2993j4234m9162P017N9495M6051l1384L3179K1092l2123
9524H5412n8123K5039J1599K8224k8160L3646M3595l1249J6053J7482n9147j7205
9512F7166M986q079q980n1974J9996j0840l5615L0485N0288K9457J9563L4438
9500A40891K878M7304J6204K9491l3361j3585l1197l1987l0979L9849M414r4108
9488D5814k1552K6144o533j5261M979J4078J5448k838j8973j6837o6627m2069
9476h4227p071R871N6855J008q641k9572J3432N7053N1579L3915m2186l249K0178
9463F8945N7336J6305o3259m7428N906J6261o672Q18J6636l4819l6229J5701J3209
9450B2710M3065J8158l4523R95J2979l938K9755K1275j5520J5563o576p2531r0477
$$ y = [137314, 89961, 78474, 45481, 31247, -17915, -10898, 48597, 94648, 63264, 96443, 117535, 85412, 27289, 52328, 63927, 92151, 63991, 97637, 141232, 109983, 126036, 143518, 84371, 67166, 72152, 64073, 55093, 3119, 23115, 12275, -23340, 7145, 57433, 86890, 106453, 140891, 143769, 191073, 207277, 236768, 203407, 189822, 158625, 126638, 95659, 135508, 139922, 45814, 24262, 50406, 43873, 28612, 33591, 47669, 63117, 60279, 41306, 24469, -42158, -84227, -91298, -81427, -24572, -23564, -32205, -61777, -48345, 8708, 60287, 94202, 52016, 48767, 68945, 126281, 142586, 79327, 31899, 37805, 54066, 47394, 48212, 64848, 30029, -6200, 9501, 22710, 65775, 83933, 49410, 50405, 63384, 59446, 89201, 110476, 94956, 110519, 103943, 31412, -59065]
9437e9065m2733K9893M0624j8076K1858P8118j2776j2364l0778O3022M4533r383
9425I2873j320m2002l2350L4893r543k1441j3465j7134k768J3891P8816M480j6974
9412F7956P95N1291N7955o3603m7356p205l9520m7393R546M4311N7802N1841K0203
9399A56623p3074m4077j8182L8635n828l1856j3082j8939O466O1043M0131K1716
9387A19576K4303j6185q31j1233O785m0767J5790j6895k4021n894m6061M9247
9375E3814L1192k5418K9474J053O393j6395q1231n2296K2186O3749M8553p786
9363G3288j5317Q502j3823m059N1204k0523O054m751M543k2523m1301o5076l8019
9350h1801O1737j6895j6702J9203N281J9216L8008r470k1054K4180L8789J7497
$$ y = [-59065, -101798, -71905, -31281, -49357, -27499, 50619, 37843, 25479, -5299, 57723, 102256, 92873, 91553, 49551, 17201, 52094, 42551, 21110, 7645, -9489, -12257, 1634, 80450, 84930, 67956, 68751, 120042, 177997, 114394, 67038, 59833, 20313, -27080, -17534, 26777, 84579, 136420, 156623, 83549, 39472, 21290, 59925, 54097, 22241, 9159, -9780, -3314, 57729, 97860, 119576, 143879, 127694, 126863, 115630, 122415, 81648, 97438, 80543, 56522, 50628, 4567, 53814, 85006, 59588, 89062, 90115, 96508, 80113, -1118, -53414, -31228, 32521, 81074, 73288, 57971, 66473, 52650, 48591, 99795, 79272, 85326, 80575, 85118, 62595, 21294, -43782, -81801, -20064, -36959, -53661, -34458, -29177, -9961, 28047, 18577, -2477, 21703, 60492, 77989]
9338G7989p0495m9983M1926K9050j2097J4114j0779k0815k9949j1957O3070N4190
9326G4264K533o3750k974P184l1543j809L1865N5075r0333o5023R1936P7099j8738
9313F5786n5571K0972L1667J1033o0574q1376L8429O0950k080R417J4811j9351
9301C4113l7594J8702J6520N1379O02o0016o8255l6313q075J06122J3024J611
9289C1820N0933o395p7543k9678k0772J1111K3852j1818n7007l498Q0207K4253
9277A5465q552j5988j3872q825K5416N6740J6157k6083R192J207l3935K8898Q153
9264E3973j4786M664J4024j099m9922J0623K4840N2459Q491m7091r681n649k1717
9251A9129q795k9983l2773O7901J3223j3664j4328l5102k0672o1958l9161J3541
$$ y = [77989, 7494, -42489, -563, 28487, 16390, 30504, 19725, -1090, -31039, -42996, 20074, 74264, 76797, 13047, 10073, 17257, -14286, -16095, 15770, 70845, -19488, -84511, 7425, 84524, 65786, 10215, 31187, 62854, 73887, 13313, -68063, -29634, 31316, 29236, 38653, 53464, 34113, -3481, 15221, 31741, 83120, 83722, 23706, -44549, -80862, -88937, 17185, 30209, 31820, 82753, 76358, -1185, -30863, -51635, -40524, -16672, -28490, -85497, -88995, -8788, 15465, 6913, -9075, -22947, -31772, -6356, 50384, 66541, 40458, 49650, 50857, 16922, 45820, 53973, 39187, 43851, 57875, 56776, 6854, 17477, 42317, 94776, 103267, 56176, 46495, 40846, 19129, 10334, -19649, -52422, 15479, 28702, 15038, 710, -34392, -55064, -117022, -156183, -142642]
9239a42642O6288R6694n453n8941r471K3682L2201N5834M5374m0230p5919L6920
9227B4337Q754l0315l5454M0509K5157m4686j6329M9487Q494p707K8272k8864
9215B1655n4934l5907K229K3863j9148K2903K2168M0475O5926K7736k4178M9517
9203A42305l0601j17660k7292J6613p451k7253L2304R697R837j0014K1408M3237
9191E5130k0142r4172p2695M3101J11220M8637l9725L637K8119l1041N07L2037
9179F4613m2233l4882K2461J5579K0924n1284n2102K5077N0899l8274o1064m6840
9167a27126K3069J14164Q1197k9427J0337L9571r2167o122M8403j6725j0708j6783
9155A7683k8680K1047l6851P419P7667P1266P339j9007n3678L432P637j5708j8442
$$ y = [-142642, -76354, 20340, 14887, -44054, -53525, -29843, 2358, 58192, 103566, 63336, -12583, 24337, 33091, 2776, -32678, 7831, 32988, -11698, -28027, 21460, 29954, 22247, 50519, 21655, -33279, -69186, -66957, -43094, -62242, -39339, -17171, 23304, 89230, 116966, 92788, 142305, 111704, -5956, -33248, -16635, -24086, -51339, -19035, -9338, 499, -9515, 11893, 55130, 34988, -59184, -131879, -88778, 22442, 71079, 31354, 34991, 63110, 32069, 32576, 64613, 22380, -12502, 9959, 25538, 46462, -4822, -56924, -31847, 19052, -19222, -80286, -127126, -104057, 10107, 91304, 61877, 72214, 111785, 19618, 13496, 61899, 45174, 34466, 17683, -10997, 10050, -26801, -19382, 58285, 129551, 136890, 117883, 64205, 67637, 75274, 59566, 41124]
9142D1124k3658J4004K4926O819l0316k6724m4705m2362j3033M0383K8529L7841
9130A2828K3346n088J6399m2294n1638n999L9820l9150Q075M0359r114m2907k420
9117e7783L715l8857L0000L42k3260N2653P2236L0568K6403o319J5542l1232l5373
9104C8635j5655k990L0315L4904J8062n657p3198p7410k4005J7628K0706M6613
9092G948m55K7383j1755l0162J083K2892J2492N564j1403j0242m2551K0347j0572
9079a9431k8925N3950J7348N3964l7999P300n305k4575L1967L7700l1175j6661
9067C8158J3208p78l4487l4221n175L6908j878l2924l9101L2343M2002K2544J5031
9054E1630l0246o0712l7052k1865q6067Q929Q7745L6400J8587L1344K4980M8422
$$ y = [41124, 17466, 31470, 56396, 63215, 32899, 6175, -38530, -80892, -93925, -53542, -25013, 12828, 36174, 31086, 47485, 5191, -46447, -52446, -12626, -51776, -43701, -3342, -12456, -55363, -57783, -54068, -92925, -62925, -62583, -85843, -33190, 39046, 69614, 96017, 89698, 105240, 74008, 38635, 22980, 19990, 50305, 85209, 103271, 97614, 24416, -52994, -76999, -59371, -38665, 7948, 7493, 34876, 23121, -7041, -5958, 16934, 29426, 34990, 23587, 13345, -29206, -8859, -19431, -48356, 5594, 22942, 76906, 38907, 46207, 40902, 16327, 48294, 85994, 54819, 38158, 51366, 50588, 16101, -18120, -23295, 13613, 11735, -21189, -60290, -27947, 14055, 36599, 51630, 21384, -39328, -76380, -98245, -184312, -175383, -87638, -51238, -32651, -1307, 23673, 72095]
9042G2095m1398o0667R121j6232K129m070K5126n383m364K5703j8444M2134k0814
9029D936m1029K4793L3408p387J8759o6383O899K8058l5907m7941o485Q909N4541
9016b4829j2067k0298k2161l7829Q5428K4241K269P819N3586J8565k6656l9113
9004H955k6434L0077Q0409k8621l742l8557k1794k4534J0063n107j598m591m5944
8991g1418j8823n5585n335O5025o567j1876M0245N2787k2865j6348K9694L5995
8979A4929k9179J6192R155M633N2278J0656l6645j0887l8215k9503L8232N824
8967G470K3891L6755j4447l2433j9673J0885k2142M248L7771K1298q0589l4859
8955f1825M3002J6095n2907j6017o596K3783q50R52m06k1677L195N0819j6511
$$ y = [72095, 30697, -29970, -20849, -37081, -34952, -39022, -13896, -19279, -23643, 2060, -16384, 25750, 4936, -36093, -11300, 22108, 14721, 33480, -32903, -26004, 2054, -33853, -81794, -88279, -79370, -24829, -36896, -57194, -79355, -117184, -31756, -7515, -5246, 2573, 56159, 74724, 48068, 8955, -17479, 12598, 93007, 64386, 60644, 22087, 293, -24241, -14178, -19285, -20883, -25474, -71418, -90241, -145826, -151161, -86136, -92703, -104579, -64334, -11547, -34412, -50760, -21066, 14929, -14250, 1942, 11097, 15730, 68008, 78664, 42019, 31132, -7083, -36586, 1646, 7470, 31361, 68116, 53669, 21236, 1563, 12448, -9694, -5446, 32325, 53623, -26966, -61825, -18823, -2728, -55635, -71652, -78248, -54465, -55315, -54363, -54769, -76446, -73251, -22432, -38943]
8942c8943j596J2657o9437j4459K1273k9671J121m1407K522K832L1212L6702n502
$$ y = [-38943, -40539, -27882, -97319, -111778, -90505, -120176, -119055, -160462, -157940, -155108, -123896, -87194, -92696]
$$ [...]
##END NTUPLES=NMR SPECTRUM
##END=
