##TITLE=Analysis number 330156
Compound Code cc 27004
Book Reference 552/26
Project Code adrs
Chemist Name stevem
##JCAMPDX= 6.0         $$ Bruker NMR JCAMP-DX V2.0
##DATA TYPE= NMR SPECTRUM
##DATA CLASS= NTUPLES
##ORIGIN= Bruker BioSpin GmbH
##OWNER= nmr
$$ XWIN-NMR		Version 3.5
$$ Thu Nov  1 11:14:23 2007 GMT Standard Time (UT+0h)  MAYBRIDGE\nmr@NMR_250MHZ
##.OBSERVE FREQUENCY= 250.131544655141
##.OBSERVE NUCLEUS= ^1H
##.ACQUISITION MODE= SIMULTANEOUS (DQD)
##.ACQUISITION SCHEME= undefined
##.AVERAGES= 16
##.DIGITISER RES= 18
##SPECTROMETER/DATA SYSTEM= dpx250
##.PULSE SEQUENCE= zg30
##.SOLVENT NAME= CDCl3
##.SHIFT REFERENCE= (INTERNAL, CDCl3, 0, 16.522)
##AUDIT TRAIL= $$ (NUMBER, WHEN, WHO, WHERE, WHAT)
$$ ##TITLE= Audit trail, XWIN-NMR		Version 3.5
$$ ##JCAMPDX= 5.01
$$ ##ORIGIN= Bruker BioSpin GmbH
$$ ##OWNER= nmr
$$ C:\u/data/dgb/nmr/ADRS/30/pdata/1/auditp.txt
$$ ##AUDIT TRAIL=  $$ (NUMBER, WHEN, WHO, WHERE, WHAT)
(   1,<2007-11-01 11:13:57.57 +000>,<MAYBRIDGE\nmr>,<NMR_250MHZ>,
      <created by zg, POWCHK disabled, PULCHK disabled
       configuration hash MD5:
       76 6E 9A 78 1E 09 19 81 EC 84 63 8F B0 6A 59 2D
       data hash MD5: 64K
       43 AB 12 F3 F8 A8 02 7C AF 67 CA 99 23 FD 38 C7>)
(   2,<2007-11-01 11:14:13.54 +000>,<MAYBRIDGE\nmr>,<NMR_250MHZ>,
      <Start of raw data processing
       ef LB = 0.3 FT_mod = 6 PKNL = 1 SI = 32K 
       data hash MD5: 32K
       90 9B 6E 8A 34 26 E6 7B 02 28 DB 41 32 75 DD DD>)
(   3,<2007-11-01 11:14:15.10 +000>,<MAYBRIDGE\nmr>,<NMR_250MHZ>,
      <apk 
       data hash MD5: 32K
       C8 F4 4F 44 CE E2 F0 E7 2A FA 48 79 96 91 07 5F>)
(   4,<2007-11-01 11:14:15.83 +000>,<MAYBRIDGE\nmr>,<NMR_250MHZ>,
      <abs ABSG = 5 
       data hash MD5: 32K
       04 77 B2 27 C6 D6 43 DA 34 52 F8 36 CF 05 21 4C>)
$$ ##END=
$$ 
$$ hash MD5
$$ C7 CE 8C DB ED 8F EE 75 A7 9E 79 77 70 D6 84 F0
##$RELAX= 
##$RELAX= 
##$RELAX= 
##$RELAX= 
##$RELAX= 
##$RELAX= 
##$RELAX= 
$$ Bruker specific parameters
$$ --------------------------
##$DU= <C:\u>
##$EXPNO= 30
##$NAME= <ADRS>
##$PROCNO= 1
##$TYPE= <nmr>
##$USER= <dgb>
##$AMP= (0..31)
100 100 100 100 100 100 100 100 100 100 100 100 100 100 100 100 100 100 
100 100 100 100 100 100 100 100 100 100 100 100 100 100 
##$AQSEQ= 0
##$AQ_mod= 3
##$AUNM= <au_zg>
##$AUTOPOS= <6 >
##$BF1= 250.13
##$BF2= 250.13
##$BF3= 250.13
##$BF4= 250.13
##$BF5= 500.13
##$BF6= 500.13
##$BF7= 500.13
##$BF8= 500.13
##$BYTORDA= 1
##$CFDGTYP= 0
##$CFRGTYP= 5
##$CHEMSTR= <none>
##$CNST= (0..31)
1 1 145 1 1 1 1 1 1 1 1 1 1 1 1 1 1 1 1 1 1 1 1 1 1 1 1 1 1 1 1 1 
##$CPDPRG= <>
##$CPDPRG1= <>
##$CPDPRG2= <>
##$CPDPRG3= <>
##$CPDPRG4= <mlev>
##$CPDPRG5= <mlev>
##$CPDPRG6= <mlev>
##$CPDPRG7= <mlev>
##$CPDPRG8= <mlev>
##$CPDPRGB= <>
##$CPDPRGT= <>
##$D= (0..31)
0 1 0 0 0 0 0 0 0 0.06 0 0 0 0 0 0 0.0002 0 0 0 0 0 0 0 0 0 0 0 0 0 0 
0 
##$DATE= 1193915635
##$DBL= (0..7)
120 120 120 120 120 120 120 120 
##$DBP= (0..7)
150 150 150 150 150 150 150 150 
##$DBP07= 0
##$DBPNAM0= <>
##$DBPNAM1= <>
$$ [...]
##$SUBNAM7= <"">
##$SUBNAM8= <"">
##$SUBNAM9= <"">
##$SW= 20.6930455092707
##$SWIBOX= (0..15)
0 0 3 0 0 0 0 0 0 0 0 0 0 0 0 0 
##$SW_h= 5175.983436853
##$TD= 65536
##$TD0= 1
##$TE= 295.16
##$TE2= 300
##$TE3= 300
##$TEG= 300
##$TL= (0..7)
0 120 120 120 120 120 120 120 
##$TP= (0..7)
150 150 150 150 150 150 150 150 
##$TP07= 0
##$TPNAME0= <>
##$TPNAME1= <>
##$TPNAME2= <>
##$TPNAME3= <>
##$TPNAME4= <>
##$TPNAME5= <>
##$TPNAME6= <>
##$TPNAME7= <>
##$TPOAL= (0..7)
0.5 0.5 0.5 0.5 0.5 0.5 0.5 0.5 
##$TPOFFS= (0..7)
0 0 0 0 0 0 0 0 
##$TUNHIN= 0
##$TUNHOUT= 0
##$TUNXOUT= 0
##$USERA1= <user>
##$USERA2= <user>
##$USERA3= <user>
##$USERA4= <user>
##$USERA5= <user>
##$V9= 5
##$VALIST= <valist>
##$VCLIST= <CCCCCCCCCCCCCCC>
##$VD= 0
##$VDLIST= <DDDDDDDDDDDDDDD>
##$VPLIST= <PPPPPPPPPPPPPPP>
##$VTLIST= <TTTTTTTTTTTTTTT>
##$WBST= 1024
##$WBSW= 4
##$XGAIN= (0..3)
0 0 0 0 
##$XL= 0
##$YL= 0
##$YMAX_a= 407043
##$YMIN_a= -418258
##$ZGOPTNS= <>
##$ZL1= 120
##$ZL2= 120
##$ZL3= 120
##$ZL4= 120
##$ABSF1= 16.522
##$ABSF2= -4.171173
##$ABSG= 5
##$ABSL= 3
##$ALPHA= 0
##$AQORDER= 0
##$ASSFAC= 0
##$ASSFACI= 0
##$ASSFACX= 0
##$ASSWID= 0
##$AUNMP= <proc_1d>
##$AZFE= 0.1
##$AZFW= 0.1
##$BCFW= 0
##$BC_mod= 0
##$BYTORDP= 0
##$COROFFS= 0
##$CY= 12.5
##$DATMOD= 1
##$DC= 0
##$DFILT= <>
##$DTYPP= 0
##$F1P= 14.0000005364418
##$F2P= -0.99999901652339
##$FCOR= 0.5
##$FTSIZE= 32768
##$FT_mod= 6
##$GAMMA= 0
##$GB= 0
##$INTBC= 1
##$INTSCL= 1
##$ISEN= 128
##$LB= 0.3
##$LEV0= 0
##$LPBIN= 0
##$MAXI= 10000
##$MC2= 0
##$MEAN= 0
##$ME_mod= 0
##$MI= 0
##$NCOEF= 0
##$NC_proc= -2
##$NLEV= 6
##$NOISF1= 0
##$NOISF2= 0
##$NSP= 0
##$NTH_PI= 0
##$NZP= 0
##$OFFSET= 16.522
##$PC= 1
##$PHC0= 161.7643
##$PHC1= 5.720212
##$PH_mod= 1
##$PKNL= yes
##$PPARMOD= 0
##$PSCAL= 4
##$PSIGN= 0
##$REVERSE= no
##$SF= 250.13
##$SI= 32768
##$SIGF1= 0
##$SIGF2= 0
##$SINO= 400
##$SIOLD= 32768
##$SREGLST= <1H.CDCl3>
##$SSB= 0
##$STSI= 32768
##$STSR= 0
##$SW_p= 5175.98343685301
##$SYMM= 0
##$S_DEV= 0
##$TDeff= 65536
##$TDoff= 0
##$TI= <Analysis number 999999
Compound Code 99
Book Reference 9
Project Code 9>
##$TILT= no
##$TM1= 0
##$TM2= 0
##$TOPLEV= 0
##$USERP1= <user>
##$USERP2= <user>
##$USERP3= <user>
##$USERP4= <user>
##$USERP5= <user>
##$WDW= 1
##$XDIM= 32768
##$YMAX_p= 453278306
##$YMIN_p= -90486
$$ End of Bruker specific parameters
$$ ---------------------------------
##NTUPLES= NMR SPECTRUM
##VAR_NAME=  FREQUENCY,     SPECTRUM/REAL,   SPECTRUM/IMAG
##SYMBOL=    X,             R,               I
##VAR_TYPE=  INDEPENDENT,   DEPENDENT,       DEPENDENT
##VAR_FORM=  AFFN,          ASDF,            ASDF
##VAR_DIM=   32768,         32768,           32768
##UNITS=     HZ,            ARBITRARY UNITS, ARBITRARY UNITS
##FACTOR=    0.157963299565203, 1,           1
##FIRST=     4132.6476996994, 0,             0
##LAST=      -1043.33573715361, 0,           0
##MIN=       -1043.33573715361, -90486,      0
##MAX=       4132.6476996994, 453278306,     0
$$ Real data points
##PAGE= N=1
##DATA TABLE= (X++(R..R)), XYDATA
$$ [...]
$$ plain form
16627 -29568 -17751 -15715 -37197 -54767 -55297 -52096 -57231 -51355 -42952 -34082 -30283 -13538 -18308 -34166
16613 -34166 -26645 -15640 -38106 -36536 -11590 -10311 -23095 -19571 -27213 -17470 -11726 270 23328
16600 23328 31371 27514 -4751 -20980 -22057 -37091 -44185 -12391 -27481 -26490 -6865 -7562 -10139
16587 -10139 -23052 -8458 5001 -3224 -13050 -9745 -8705 11017 -3191 -11221 -2484 10794 12696
16574 12696 -1408 4608 18198 25690 17158 -6512 -17743 -14923 -4484 -13617 -4665 -8029 -32883
16561 -32883 -43490 -35837 72 19628 14372 -16521 -4002 17177 25993 12459 6538 1205 -3857
16548 -3857 -2444 -2620 13029 13004 -4128 -5580 -5445 2343 24837 26463 -10118 -21685 -25473 -30156
16534 -30156 -38482 -29797 -30881 -16443 -15992 -20286 -3507 -15564 -32825 -29235 -28858 -10112 12530
$$ packed form
16627b9568J1817K036k1482j7570n30L201n135N876Q403Q870L799J6745m770j5858
16613c4166P521J1005k2466J570K4946J279j2784L524p642R743N744J1996K3058
16600B3328Q043l857l2265j6229j077j5034p094L1794j5090R91J9625o97k577
16587a0139j2913J4594J3459q225r826L305J040J9722j4208q030Q737J3278J902
16574A2696j4104O016J3590P492q532k3670j1231K820J0439r133Q952l364k4854
16561c2883j0607P653L5909J9556n256l0893J2519K1179Q816j3534n921n333n062
16548c857J413j76J5649k5j7132j452J35P788K2494J626l6581j1567l788m683
16534c0156q326Q685j084J4438M51m294J6779j2057j7261L590L77J8746K2642
$$ plain form
16521 12530 15926 -7244 -28916 -24143 -22595 -16288 2257 -13156 -48649 -49745 -38201 -23450 -15680
16508 -15680 -6106 -6082 2381 226 4848 32158 29720 22348 29683 24525 -69 -16511 -39177 -42127
16494 -42127 -23248 -38756 -30996 -14288 2302 5870 -14831 -35993 -41283 -22091 -2270 -15398
16482 -15398 -44281 -55913 -35861 -6653 4882 4495 -13355 -9439 12386 -5464 -15688 -6110
16470 -6110 -8210 -14028 -26701 -41791 -31612 -17441 -17496 -21212 -22243 -34044 -28693 -16890 -46975
16457 -46975 -54737 -41175 -4713 20037 15874 9884 -19106 -21048 73 24981 25521 19458 45805
16444 45805 39116 7882 10423 -727 -13878 -34309 -47718 -55194 -28474 -16916 -2695 -6070
16432 -6070 -11405 4066 12301 -14687 -20886 -12634 -12531 16249 33182 41723 47479 33995 7458
$$ packed form
16521A2530L396k3170k1672M773J548O307J8545j5413l5493j096J1544J4751P770
16508a5680R574K4Q463k155M622K7310k438p372P335n158k4594j6442k2666k950
16494d2127J8879j5508P760J6708J6590L568k0701k1162n290J9192J9821j3128
16482a5398k8883j1632K0052K9208J1535l87j7850L916K1825j7850j0224R578
16470f110k100n818j2673j5090J0179J4171n5l716j031j1801N351J1803l0085
16457d6975p762J3562L6462K4750m163n990k8990j942K1121K4908N40o063K6347
16444D5805o689l1234K541j1150j3151k0431j3409p476K6720J1558J4221l375
16432f070n335J5471Q235k6988o199Q252J03K8780J6933Q541N756j3484k6537
$$ plain form
16419 7458 -4528 -4729 -5738 -8706 -8288 -10146 -22916 -16761 -21164 -17991 5996 28029 6162 11519
16405 11519 21994 13692 11236 5747 20272 -6842 -36425 -18103 -12950 8064 6600 4194 -1119
16392 -1119 4943 18063 18457 41954 44924 45689 56186 63090 91892 104276 135763 165151 184885
16379 184885 196391 163617 134336 101577 75770 61368 33354 14207 13718 9193 -14546 -15366
16367 -15366 -10661 1651 6295 27271 27111 3975 6734 7692 -2560 20328 26536 31549 14490
16354 14490 -20314 -26305 -29679 -27679 -26121 -28382 -26481 -28697 -9464 -11969 -16037 12144 21388 19772
16340 19772 9534 22310 17181 916 9562 24753 24773 20761 28846 41717 60115 55538 49157
16327 49157 34666 35096 48963 34180 29581 14222 4182 7370 6554 -1809 -27280 -48035 -44803
$$ packed form
16419G458j1986k01j009k968M18j858j2770O155m403L173K3987K2033k1867N357
16405A1519J0475q302k456n489J4525k7114k9583J8322N153K1014j464k406n313
16392a119O062J3120L94K3497K970P65J0497O904K8802J2384L1487K9388J9734
16379A84885J1506l2774k9281l2759k5807j4402k8014j9147m89m525k3739q20
16367a5366M705J2312M644K0976j60k3136K759R58j0252K2888O208N013j7059
16354A4490l4804n991l374K000J558k261J901k216J9233k505m068K8181R244j616
16340A9772j0238J2776n129j6265Q646J5191K0m012Q085J2871J8398m577o381
16327D9157j4491M30J3867j4783m599j5359j0040L188q16q363k5471k0755L232
$$ plain form
16314 -44803 -42518 -54147 -28202 61 643 -4268 -19822 -20943 -30011 -31138 -27910 -54380 -46659
16301 -46659 -33522 -24663 -31298 -20759 -17669 -14982 -230 9445 1881 -3378 -14190 -19254 -17787
16288 -17787 -6082 4169 -27 11600 14241 13391 -5647 -25732 -15768 -1480 3700 5318 -9456
16275 -9456 -10775 -29039 -25171 9186 23618 26741 23456 5121 7991 5397 -11198 -24014 -24904
16262 -24904 -31347 -26632 -4681 -829 -8495 -14162 -14239 -1867 -8455 -13058 143 14237 25056 17971
16248 17971 27289 36347 45601 52608 51455 37137 24780 11807 2546 18161 15512 -4560 -22170
16235 -22170 -5613 -7334 -2090 4309 7486 30616 37402 35284 11429 22757 38830 41383 29591
16222 29591 29742 14860 5455 11264 13951 20569 15646 -4946 -8186 -14403 -26651 -21601 2102 -12062
$$ packed form
16314d4803K285j1629K5945K8263N82m911j5554j121r068j127L228k6470P721
16301d6659J3137Q859o635J0539L090K687J4752R675p564n259j0812n064J467
16288a7787J1705J0251m196J1627K641q50j9038k0085R964J4288N180J618j4774
16275i456j319j8264L868L4357J4432L123l285j8335K870k594j6595j2816q90
16262b4904o443M715K1951L852p666n667p7J2372o588m603J3201J4094J0819p085
16248A7971R318R058R254P007j153j4318j2357j2973r261J5615k649k0072j7610
16235b2170J6557j721N244O399L177K3130O786k118k3855J1328J6073K553j1792
16222B9591J51j4882r405N809K687O618m923k0592l240o217j2248N050K3703j4164
$$ plain form
16208 -12062 -14195 -2515 7507 6614 15155 7165 -283 -13544 -25730 -28501 -16651 -33807 -10311
16195 -10311 22882 9697 7979 5091 -4336 7545 29042 28677 25429 2543 -14992 -8097 -11937
16182 -11937 -10840 -10750 -3080 7867 6892 -10581 -24063 -26718 -4560 -2208 142 -8436 -5056 5782
16168 5782 7171 6332 18650 15460 9246 7248 -701 -30093 -24383 -5510 -8340 521 4430 -6472
16154 -6472 -6461 14168 27044 8634 5480 -1094 -15687 -12977 -21872 -28668 -22152 -9234 -10726 -7083
16140 -7083 -11334 -13539 2283 -8786 -5027 -16645 -54064 -50099 -49982 -43467 -47202 -33171 8483
16127 8483 24971 12265 -5350 -7851 -14865 -24392 -25541 -28751 -18309 -915 8302 2135 -41243
16114 -41243 -33665 8273 19772 12723 18164 24166 15604 -6258 -32128 -26661 -15295 3586 30467
$$ packed form
16208a2062k133J1680J0022q93Q541p990p448j3261j2186k771J1850j7156K3496
16195a0311L3193j3185j718k888r427J1881K1497l65l248k2886j7535O895l840
16182a1937J097R0P670J0947r75j7473j3482k655K2158K352K350q578L380J0838
16168E782J389q39J2318l190o214j998p949k9392N710J8873k830Q861L909j0902
16154f472J1K0629J2876j8410l154o574j4593K710q895o796O516J2918j492L643
16140g083m251k205J5822j1069L759j1618l7419L965J17O515l735J4031M1654
16127H483J6488j2706j7615k501p014r527j149l210J0442J7394R217o167m3378
16114d1243P578M1938J1499p049N441O002q562k1862k5870N467J1366J8881K6881
$$ plain form
16101 30467 28553 -1429 3517 21462 7384 20136 951 -25384 -16398 -11040 -8542 -5259 -15258
16088 -15258 -40193 -28085 -14719 -8769 9496 13247 -3300 -9375 -26661 -14649 -8270 3016
16076 3016 3004 -15213 -41341 -53603 -53155 -32241 -17020 3556 16817 14873 2020 -13588 -11404
16063 -11404 -10414 3823 -2006 -31569 -32201 -29194 -26754 -6901 -12653 -17649 -27014 -42233 -37170 -23321
16049 -23321 -11563 -453 2991 -1373 -5633 -13999 -17882 -18213 -5432 -7490 5826 -11578 -16179
16036 -16179 -25238 -13787 -14112 -16801 -28108 -30459 -20651 -11169 -16162 -13471 -1694 -3808 -11816 -14748
16022 -14748 -16650 -19553 -22567 -17724 -22513 -20715 -4463 2168 14537 19145 7652 -1382 4821 1124
16008 1124 8644 12473 12169 20778 28560 -9450 -32579 -10418 4773 12971 9404 5066 -2230 8169
$$ packed form
16101C0467j914k9982M946J7945j4078J2752j9185k6335Q986N358K498L283r999
16088a5258k4935J2108J3366N950J8265L751j6547o075j7286J2012O379J1286
16076C016j2j8217k6128j2262M48K0914J5221K0576J3261j944j2853j5608K184
16063a1404R90J4237n829k9563o32L007K440J9853n752m996r365j5219N063J3849
16049b3321J1758J1110L444m364m260q366l883l31J2781k058J3316j7404m601
16036a6179r059J1451l25k689j1307k351R808R482m993K691J1777k114q008k932
16022a4748j902k903l014M843m789J798J6252O631J2369M608j1493r034O203l697
16008A124P520L829l04Q609P782l8010k3129K2161J5191Q198l567m338p296J0399
$$ plain form
15994 8169 7630 804 -12877 -26599 -13167 3652 3566 7313 4117 -18775 -29971 -23851 -7426 -7712
15980 -7712 -21407 -24654 -15487 -21569 -29541 -10887 2617 -2006 8668 5210 11706 21013 -4135
15967 -4135 -19647 -15867 -29403 -21796 -17247 -19557 -17093 -26041 -2733 -11907 -17037 -17081 -19884 -18931 -7775
15952 -7775 -25654 -15317 -24679 -16867 -4597 3399 -9234 -12579 -16894 -52197 -59538 -52746 -41216
15939 -41216 -31340 -40133 -42809 -33112 -42895 -52856 -26975 -19153 -21910 14396 16420 13242 5447 17404
15925 17404 2379 1645 4452 -10637 -20264 -8668 -4889 -1554 290 -10348 -28218 -32688 -45768
15912 -45768 -43755 -34630 -34577 -30796 -13384 -18903 -22941 -29165 -15971 -16708 -15837 -28632 -19084 -11665 11334
15897 11334 27432 23406 12004 6870 15379 -4422 -10389 -353 -6491 -7132 -3306 9633 445
$$ packed form
15994H169n39o826j3681j3722J3432J6819q6L747l196k2892j1196O120J6425k86
15980g712j3695l247R167o082p972J8654J3504m623J0674l458O496R307k5148
15967d135j5512L780j3536P607M549k310K464q948K3308r174n130m4k803R53J1156
15952g775j7879J0337r362P812J2270P996j2633l345m315l5303p341O792J1530
15939d1216R876q793k676R697r783r961K5881P822k757L6306K024l178p795J1957
15925A7404j5025p34K807j5089r627J1596L779L335J844j0638j7870m470j3080
15912d5768K013R125N3L781J7412n519m038o224J3194p37Q71j2795R548P419K2999
15897A1334J6098m026j1402n134Q509j9801n967J0036o138o41L826J2939r188
$$ plain form
15884 445 -16122 -19601 -15729 -15562 -14077 -26500 -10972 -19213 -8508 7546 27135 22433 20677 4108
15870 4108 2430 6432 9201 -23525 -41508 -43215 -26264 -27363 -6982 -1310 3720 8151 7264 56
15856 56 -12677 -10208 -16906 -10004 3354 4746 824 -22091 -39961 -38688 -26131 -6955 -9060 -15402
15842 -15402 -9730 -3587 494 11433 4780 11352 20540 4725 -9151 21138 12858 8598 8232 -1302
15828 -1302 7441 25427 15157 -9752 -9041 -6644 -8876 -5626 18062 16216 1432 -1183 7880 27127
15814 27127 30934 21145 -14653 -33574 -32102 -20491 -14855 -46230 -44765 -49698 -46874 -39748 -31688
15801 -31688 -1688 10718 -2205 -12920 -14471 -31093 -22123 -25223 -32001 -10577 -11244 -14896 -5948
15788 -5948 -21507 -27850 -41123 -43051 -29287 -14207 -14913 -35641 -41850 -14566 4310 -11062 -23939
$$ packed form
15884D45j6567l479L872J67J485j2423J5528q241J0705J6054J9589m702j756j6569
15870D108j678M002K769l2726j7983j707J6951j099K0381N672N030M431q87p208
15856E6j2733K469o698O902J3358J392l922k2915j7870J273J2557J9176k105o342
15842a5402N672O143M081J0939o653O572R188j5815j3876L0289q280m260l66r534
15828a302Q743J7986j0270k4909P11K397k232L250K3688j846j4784k615R063J9247
15814B7127L807r789l5798j8921J472J1611N636l1375J465m933K824P126Q060
15801c1688L0000J2406j2923j0715j551j6622Q970l100o778K1424o67l652Q948
15788e948j5559o343j3273j928J3764J5080p06k0728o209K7284J8876j5372j2877
$$ plain form
15775 -23939 -15588 -23477 -39798 -17810 -4807 -6349 -15150 -34184 -40873 -51103 -50764 -51512 -33619
15762 -33619 -6916 4127 3746 -10413 -6752 -14534 -30200 -20121 -3710 4873 20515 31267 14321
15749 14321 5357 -12176 -4616 10186 30471 5280 -32238 -35018 -27594 -34558 -32955 -21590 -26554
15736 -26554 -43342 -40299 -24771 -26776 -10637 8958 7869 -9312 -24886 -24384 -505 18750 23314
15723 23314 13946 2392 -108 -3848 -1779 13904 1092 -4527 4248 16601 10204 12079 10194
15710 10194 21548 5301 -2698 4815 5638 9457 20952 35166 25014 20066 20560 10616 9959 27248
15696 27248 33366 18840 45348 61143 82637 85434 82232 103682 96612 79651 59529 35963
15684 35963 14348 1834 -12742 -5931 5504 21189 27883 30354 34191 25342 29628 25385 30956
$$ packed form
15775b3939Q351p889j6321K1988J3003j542q801j9034o689j0230L39p48J7893
15762c3619K6703J1043l81j4159L661p782j5666J0079J6411Q583J5642J0752j6946
15749A4321q964j7533P560J4802K0285k5191l7518k780P424o964J603J1365m964
15736b6554j6788L043J5528k005J6139J9595j089j7181j5574N02K3879J9255M564
15723B3314r368j1554k500l740K069J5683j2812n619Q775J2353o397J875j885
15710A0194J1354j6247p999P513Q23L819J1495J4214j0152m948M94r944o57J7289
15696B7248O118j4526K6508J5795K1494K797l202K1450p070j6961k0122k3566
15684C5963k1615j2514j4576O811J1435J5685O694K471L837q849M286m243N571
$$ plain form
15671 30956 35239 37258 14006 1915 6412 -7091 -16231 -21895 -32470 -40003 -16892 -4341 2234
15658 2234 11577 8240 13708 -3537 -12279 -31871 -16476 10891 24987 26306 21246 1655 -13328
15645 -13328 -1981 8369 21112 25841 12580 11530 2245 -17349 -19859 2673 3204 -8274 -1983
15632 -1983 14270 35180 55720 65782 73244 80931 57983 40639 62762 57988 32797 8542
15620 8542 13186 24652 -12030 -8664 4030 9324 23857 25694 14613 -5009 -14298 -41889 -55330
15607 -55330 -35129 661 8975 -11130 -27713 -18410 -18214 8860 29025 45429 43555 23800 7614
15594 7614 -2994 10380 8069 8691 18135 27633 23828 2750 -1005 -4452 -24850 -38174 -15472
15581 -15472 443 241 -19095 -11036 -16867 -6047 2838 14426 24018 27370 20070 9739 13442
$$ packed form
15671C0956M283K019k3252j2091M497j3503r140n664j0575p533K3111J2551O575
15658B234R343l337N468j7245q742j9592J5395K7367J4096J319n060j9591j4983
15645a3328J1347J0350J2743M729j3261j050r285j9594k510K2532N31j1478O291
15632a983J6253K0910K0540J0062P462P687k2948j7344K2123m774k5191k4255
15620H542M644J1466l6682L366J2694N294J4533J837j1081j9622r289k7591j3441
15607e5330K0201L5790Q314k0105j6583R303J96K7074K0165J6404j874j9755j6186
15594G614j0608J3374k311O22R444R498l805k1078l755l447k0398j3324K2702
15581a5472J5915k02j9336Q059n831J0820Q885J1588R592L352p300j0331L703
$$ plain form
15568 13442 17137 7975 -4719 -22444 -40631 -44796 -32895 3016 39560 56341 33006 13664
15556 13664 6833 9901 4292 1021 -11431 -8753 -409 9069 8314 18829 16631 6734 -31267 -48537
15542 -48537 -6135 12843 5538 -6791 -13102 -12388 -14258 -1730 -6000 -8108 -31039 -17291 -14169
15529 -14169 -16652 -5877 2523 3543 -177 -14651 -1499 17146 1260 -4309 416 -13186 -1159
15516 -1159 14105 19754 7517 -4210 -8453 -14697 -19878 -31848 -33994 -25975 -556 5787 -558
15503 -558 7386 14194 12910 2319 -7029 -11914 -18958 -9174 -16121 -24725 -12418 -21652 -12531 20114
15489 20114 21240 5104 21017 37843 17209 -18626 -10457 13542 24544 22368 16029 7437 8723
15476 8723 5999 13891 17761 18166 29386 19087 7144 -3684 -15286 20241 43710 27163 21168
$$ packed form
15568A3442L695r162j2694j7725j8187m165J1901L5911L6544J6781k3335j9342
15556A3664o831L068n609l271j2452K678Q344R478p55J0515k198r897l8001j7270
15542d8537M2402J8978p305j2329o311P14j870J2528m270k108k2931J3748L122
15529a4169k483J0775Q400J020l720j4474J3152J8645j5886n569M725j3602J2027
15516a159J5264N649j2237j1727m243o244n181j1970k146Q019K5419O343o345
15503e58P944O808j284j0591r348m885p044R784o947q604J2307r234R121L2645
15489B0114J126j6136J5913J6826k0634l5835Q169K3999J1002k176o339q592J286
15476H723k724P892L870M05J1220j0299j1943j0828j1602L5527K3469j6547n995
$$ plain form
15463 21168 25547 25707 1885 -15429 4177 9699 -9126 -7177 4292 7370 -5495 -7198 -7821
15450 -7821 -5248 10848 4853 26672 20806 13784 20155 6766 -3736 -9450 -8884 -6686 -7930 6193
15436 6193 2672 311 5086 15648 16708 3371 -18734 -24843 -15214 3880 682 -5816 973 18777
15422 18777 20545 15643 -371 21282 12283 10574 12474 -10599 -26913 -26388 -26511 -19745 -28711 -43881
15408 -43881 -36783 -11391 -18685 -14192 -4590 14190 -2646 -170 6776 15319 14556 -4942 -6913 -4185
15394 -4185 1661 17398 11280 -6334 -38009 -49131 -37716 -39327 -28936 -17596 -1264 -4464 5652
15381 5652 13291 14385 5848 -14986 -3714 6998 2065 -4528 -4513 -3348 -6848 -11902 -12659 -13395 -705
15366 -705 14521 17043 -3092 11201 28519 1272 -21458 -7896 -3323 143 -12548 -9763 -9641
$$ packed form
15463B1168M379J60k3822j7314J9606N522j8825J949J1469L078j2865j703o23
15450g821K573J6096n995K1819n866p022O371j3389j0502n714N66K198j244J4123
15436F193l521k361M775J0562J060j3337k2105o109R629J9094l198o498O789J7804
15422A8777J768m902j6014K1653q999j709J900k3073j6314N25j23O766q966j5170
15408d3881P098K5392p294M493R602J8780j6836K476O946Q543p63j9498j971K728
15394d185N846J5737o118j7614l1675j1122J1415j611J0391J1340J6332l200J0116
15381E652P639J094q537k0834J1272J0712m933o593J5J165l500n054p57p36J2690
15366g05J5226K522k0135J4293J7318k7247k2730J3562M573L466j2691K785J22
$$ plain form
15353 -9641 -25299 -29098 -25127 -7943 8037 8867 -10511 -29395 -15814 -1713 3013 -4902 3374
15340 3374 -11087 -17189 -21932 4291 -9906 -10663 -8979 -10370 -8204 -16030 -8523 1206 3791 17221
15326 17221 7261 -8514 -5325 7544 11339 3437 -3962 -15728 -19283 -9647 -19573 -28790 -25976 -31459
15312 -31459 -24612 -36745 -37594 -32471 -20015 -18493 -35560 -39327 -38622 -19873 -7119 -4610 -8226 73
15298 73 6619 11284 32639 27890 9894 22349 32540 27920 25932 17304 -9928 -4183 704 -2964
15284 -2964 -11963 -12697 -12025 -9172 -22915 -15048 -10894 -19168 -5552 -17121 -27372 -43850 -49525 -46641
15270 -46641 -42046 -36360 -11745 8677 32356 18073 -6877 2104 11126 17880 4515 -6517 -27159
15257 -27159 -18497 -13972 -27343 -51236 -65142 -61664 -33330 -21154 -26554 -33622 -23695 -15596 4553
$$ packed form
15353i641j5658l799L971J7184J5980Q30j9378j8884J3581J4101M726p915Q276
15340C374j4461o102m743K6223j4197p57J684j391K166p826P507R729K585J3430
15326A7221r960j5775L189J2869L795p902p399j1766l555R636r926r217K814n483
15312c1459O847j2133q49N123J2456J522j7067l767P05J8749J2754K509l616Q299
15298G3O546M665K1355m749j7996J2455J0191m620j988q628k7232N745M887l668
15284b964q999p34O72K853j3743P867M154q274J3616j1569j0251j6478n675K884
15270d6641M595N686K4615K0422K3679j4283k4950Q981R022O754j3365j1032k0642
15257b7159Q662M525j3371k3893j3906L478K8334J2176n400p068R927Q099K0149
$$ plain form
15244 4553 13221 4981 -3189 7320 10124 -12742 -20567 -548 6150 26948 27519 25310 8527 -1979
15230 -1979 1368 43713 41165 699 -9759 -10735 -37582 -48862 -36747 -19890 -814 4623 910
15217 910 11180 -4347 441 11037 6570 11200 8375 14228 29963 20227 203 4794 -8812
15204 -8812 -22130 -17910 -14001 -10660 -10842 -25015 -28218 -30907 -18061 -15920 -5120 -14392 -35465 -45419
15190 -45419 -28864 -16304 -21818 -17978 -16473 1939 14608 28895 33127 48861 46968 24717 -2357
15177 -2357 -21245 -29250 -41190 -45217 -11337 4821 -2995 -26378 -35833 -14805 -6126 -12415 1093
15164 1093 6384 -6719 -10635 -19427 -10005 -12952 -19780 -16538 -13078 -13863 -13839 -18261 -11449 14710 13716
15149 13716 12413 18330 20871 20425 12886 -5516 -20381 6144 8284 -39 -1776 -7395 -16743 -35974
$$ packed form
15244D553Q668q240q170J0509K804k2866p825K0019O698K0798N71k209j6783j0506
15230a979L347M2345k548m0466j0458r76k6847j1280J2115J6857J9076N437l713
15217I10J0270j5527M788J0596m467M630k825N853J5735r736k0024M591j3606
15204h812j3318M220L909L341j82j4173l203k689J2846K141J0800r272k1073r954
15190d5419J6555J2560n514L840J505J8412J2669J4287M232J5734j893k2251k7074
15177b357j8888q005j1940m027L3880J6158p816k3383r455K1028Q679o289J3508
15164A093N291j3103l916q792R422k947o828L242L460p85K4m422O812K6159r94
15149A3716j303N917K541m46p539j8402j4865K6525K140q323j737n619r348j9231
$$ plain form
15135 -35974 -11641 -10090 -9302 -37905 -40430 -27126 -23091 -10715 -18011 -21255 -20338 -11011 5832 15786
15121 15786 9903 -18317 -31705 -25943 -18526 -36112 -36009 -13461 -2602 220 -218 -25791 -38428
15108 -38428 -16068 -19929 -13527 -1608 -12702 -7764 10450 20806 11205 15778 17079 -349 1745
15095 1745 15620 3339 -13228 4766 11648 10627 4584 3305 24656 26518 31558 15312 -23913
15082 -23913 -44432 -64257 -67881 -48319 -33893 -15974 -5014 3642 -4302 -2169 -10088 -10199 10084
15069 10084 9373 -3610 -3819 8660 6820 -20279 -31233 -20654 -6760 7154 19430 1041 21622
15056 21622 23701 2751 -9729 -5049 -8333 -8563 -2833 -19746 -9639 -3829 -10757 -22741 -27456
15043 -27456 -9743 -4004 14407 15231 1266 4516 4011 -3617 3448 995 -14612 -9637 -30931 -32462
$$ packed form
15135c5974K4333J551P88k8603k525J3304M035J2376p296l244R17R327J6843R954
15121A5786n883k8220j3388N762P417j7586J03K2548J0859K822m38k5573j2637
15108c8428K2360l861O402J1919j1094M938J8214J0356r601M573J301j7428K094
15095A745J3875j2281j6567J7994O882j021o043j279K1351J862N040j6246l9225
15082b3913k0519j9825l624J9562J4426J7919J0960Q656p944K133p919j11K0283
15069A0084p11j2983k09J2479j840k7099j0954J0579J3894J3914J2276j8389K0581
15056B1622K079k0950j2480M680l284k30N730j6913J0107N810o928j1984m715
15043b7456J7713N739J8411Q24j3965L250n05p628P065k453j5607M975k1294j531
$$ plain form
15029 -32462 -16731 -12182 -9815 935 2319 1507 -7042 -23252 -19981 -2344 2729 9278 1595 -16286
15015 -16286 -20330 -35152 -31818 -18679 -18479 -6420 -3607 -2689 15318 13354 -3752 -24253 -46446
15002 -46446 -64919 -41623 -15285 -16466 -21438 -28935 -30920 -36066 -30792 -31226 -36222 -47383 -35270
14989 -35270 -33825 -34550 -14037 4090 22199 15932 4336 -3153 401 -11604 -28959 -10359 -2365
14976 -2365 -35270 -52802 -31476 -20306 -5088 8675 5854 -677 -5348 -12968 -24578 -22801 -19608
14963 -19608 -21464 -25029 -20370 -21457 12495 17597 7125 9478 20078 26672 -2202 -13710 -4358
14950 -4358 3153 -13504 -36891 -40636 -1221 26025 26886 19249 6574 -1795 18638 28351 28169 31545
14936 31545 39642 48778 28193 -8404 -24621 -15349 -14284 13007 27146 19394 -4859 -664 16377
$$ packed form
15029c2462J5731M549K367J0750J384q12q549j6210L271J7637N073O549p683j7881
15015a6286m044j4822L334J3139K00J2059K813R18J8007j964j7106k0501k2193
15002d6446j8473K3296K6338j181m972p497j985n146N274m34m996j1161J2113
14989c5270J445p25K0513J8127J8109o267j1596p489L554j2005j7355J8600P994
14976b365l2905j7532K1326J1170J5218J3763k821o531m671p620j1610J777L193
14963a9608j856l565M659j087L3952N102j0472K353J0600O594k8874j1508R352
14950d358P511j6657k3387l745L9415K7246Q61p637j2675q369K0433R713j82L376
14936C1545Q097R136k0585l6597j6217R272J065K7291J4139p752k4253M195J7041
$$ plain form
14923 16377 34517 39701 19925 19762 -7680 -13720 -18861 -17684 -15065 -9577 -8669 -19967 -12436 -20445
14909 -20445 -25540 -17986 -10696 23557 44319 37672 33994 31423 16202 3779 1931 -3266 -6069
14896 -6069 19753 34103 19663 10015 16423 5452 -15952 -35596 -20379 -17083 -30743 -30362 -19743
14883 -19743 -25297 -26644 -14268 -7619 3821 10781 19397 21633 8904 10382 3365 3370 4021 7004 32933
14868 32933 23304 22311 30137 32829 20574 3487 -13168 -23222 -10526 -226 -18887 -23717 -10163
14855 -10163 -6641 -13158 -18070 -14448 8623 3303 12918 19003 -2466 738 5113 -7532 -35847
14842 -35847 -32424 -25870 -24235 -24140 -30918 -33832 -26111 -45957 -58114 -55064 -21576 -13691 -26477 -23148
14828 -23148 -19462 -6098 -4106 -13492 5129 29894 45468 37099 237 -18375 -45149 -42077 -37400
$$ packed form
14923A6377J8140N184j9776j63k7442o040n141J177K619N488R08j1298P531q009
14909b0445n095P554P290L4253K0762o647l678k571j5221j2423j848n197k803
14896f069K5822J4350j4440r648O408j0971k1404j9644J5217L296j3660L81J0619
14883a9743n554j347J2376O649J1440O960Q616K236j2729J478p017NO51K983K5929
14868C2933r629r93P826K692j2255j7087j6655j0054J2696J0300j8661m830J3554
14855a0163L522o517m912L622K3071n320R615O085k1469L204M375j2645k8315
14842c5847L423O554J635R5o778k914P721j9846j2157L050L3488P885j2786L329
14828b3148L686J3364J992r386J8621K4765J5574q369l6862j8612k6774L072M677
$$ plain form
14815 -37400 -43511 -35137 -19718 -15875 -11137 -10724 -3014 7314 -412 -7692 -5681 -3938 1087 3706
14801 3706 14049 -4354 -21454 -17170 -6113 4651 -2713 -36063 -42807 -30800 -13284 -29841
14789 -29841 -35161 -22088 -8472 -12184 -27221 -17543 6875 -8190 -25720 -23337 -7526 -691 32645
14776 32645 35967 18898 -18636 -5477 -2205 -20437 -21853 -9903 10191 12812 892 -14918
14764 -14918 3302 22276 -1087 -22602 -14205 -17946 -4533 2825 -9834 -6036 -15678 -21473 -24053
14751 -24053 -22117 -22720 -10070 -3006 -11369 -18792 -18463 7030 22085 20335 8568 1209 -12502 -12951
14737 -12951 -7281 -15399 -13778 -10187 6301 31159 62471 96059 106719 110542 113684 96066 64943
14724 64943 50621 31318 13227 8127 3495 -8585 -15409 8251 6998 -7990 -4984 -7310 7422
$$ packed form
14815c7400o111Q374J5419L843M738M13P710J0328p726p280K011J743N025K619
14801C706J0343j8403j7100M284J1057J0764p364l3350o744J2007J7516j6557
14789b9841n320J3073J3616l712j5037R678K4418j5065j7530K383J5811O835L3336
14776C2645L322j7069l7534J3159L272j8232j416J1950K0094K621j1920j5810
14764a4918J8220J8974k3363k1515Q397l741J3413P358j2659L798r642n795k580
14751b4053J936o03J2650P064q363p423L29K5493J5055j750j1767p359j3711m49
14737a2951N670q118J621L591J6488K4858L1312L3588J0660L823L142j7618l1123
14724F4943j4322j9303j8091n100m632j2080o824K3660j253j4988L006k326J4732
$$ plain form
14711 7422 5746 -7829 -12709 -15089 -13787 -5627 605 7322 6783 18192 21701 11372 5423 -12503
14697 -12503 -14378 -14610 -41701 -57267 -41099 -30555 -26276 -31073 -43321 -38023 -46727 -36729 -25818
14684 -25818 -26726 -33096 -42465 -53279 -51512 -39113 -29815 -47101 -25528 -8471 -21367 -24095 -33212
14671 -33212 -28889 -16673 -24002 -28591 -18723 -24507 -23358 -11427 -6902 -5456 -6963 -13233 -21852 -15194
14657 -15194 -14362 -28329 -48543 -51810 -46146 -34326 -25809 -37308 -30895 -20722 208 3928 -669
14644 -669 14369 29390 25334 9641 4832 12862 23932 34822 29554 14359 -13834 -24985 -36220
14631 -36220 -31530 -18950 -11992 -21931 1943 10220 -10727 -20986 -33078 -26608 -19125 -19896 -22691
14618 -22691 -20777 5314 -2374 -15959 -14676 -7814 -9169 3284 7605 19448 21774 17606 406
$$ packed form
14711G422j676j3575m880k380J302Q160O232O717n39J1409L509j0329n949j7926
14697a2503j875k32k7091j5566J6168J0544M279m797j2248N298q704R998J0911
14684b5818r08o370r369j0814J767J2399R298j7286K1573J7057j2896k728r117
14671c3212M323J2216p329m589R868n784J149J1931M525J446j507o270q619O658
14657a5194Q32j3967k0214l267N664J1820Q517j1499O413J0173K0930L720m597
14644f69J5038J5021m056j5693m809Q030J1070J0890n268j5195k8193j1151j1235
14631c6220M690J2580O958r939K3874Q277k0947j0259j2092O470P483p71k795
14618b2691J914K6091p688j3585J283O862j355J2453M321J1843K326m168j7200
$$ plain form
14605 406 -671 -8918 -12733 -2602 3374 -2723 -24752 -30801 -19033 4560 22590 26532 19425 21396
14591 21396 13212 6628 -3031 -7362 -13129 -16864 -16380 -2812 8957 17007 35301 44105 32259 1308
14577 1308 -10717 5023 15205 1878 -18647 -6008 -6605 -10602 615 8432 5650 -3770 -2164
14564 -2164 -5689 -5662 -18470 -23506 -21248 -29564 -33706 -14091 -4214 -1569 -11008 -16009 -37182 -35514
14550 -35514 -31432 -27081 499 12549 662 -14919 -21643 -12347 9782 22698 9231 19074 11664
14537 11664 -3670 2391 4949 8147 13281 -13002 -19324 -8474 -3142 6877 26627 34041 20432
14524 20432 18255 -913 -19374 -22307 -16290 -23800 -9417 -3171 -17279 -39361 -24372 1485 25009
14511 25009 38987 30165 7036 -3370 651 -1323 -12240 -9140 -12783 -17949 -16026 -7006 -16127
$$ packed form
14605D06j077q247l815J0131N976o097k2029o049J1768K3593J8030L942p107J971
14591B1396q184o584r659m331n767l735M84J3568J1769Q050J8294Q804j1846l0951
14577A308j2025J5740J0182j3327k0525J2639n97l997J1217P817k782r420J606
14564b164l525K7j2808n036K258q316m142J9615R877K645r439n001k1173J668
14550c5514M082M351K7580J2050j1887j5581o724R296K2129J2916j3467R843p410
14537A1664j5334O061K558L198N134k6283o322J0850N332J0019J9750P414j3609
14524B0432k177j9168j8461k933O017p510J4383O246j4108k2082J4989K5857K3524
14511B5009J3978q822k3129j0406M021j974j0917L100l643n166J923R020r121
$$ plain form
14498 -16127 -26792 -42359 -53345 -27193 1517 380 -15866 -16352 -35045 -45379 -32283 -25787
14486 -25787 -20615 -17575 -17329 -22403 -21284 -20864 -9037 -2421 1252 7412 483 690 -2499 -8619 4802
14471 4802 6799 536 -971 8655 -12533 -25048 -27343 -3737 10538 -5275 -14620 -9333 -13186
14458 -13186 305 5421 4093 -11702 19470 15147 -12387 -21961 1038 3866 -6760 -21040 -9868
14445 -9868 19367 22134 15998 22697 30522 19079 -11755 -17912 -11366 6254 -11426 -18022 -5343
14432 -5343 -13809 -6912 -24108 -53673 -32950 7117 23130 15163 -1492 -13929 -7888 -9741 -18159
14419 -18159 -15360 8070 29460 13600 2993 8498 8219 -8578 -24152 -18732 -6031 -11163 9800
14406 9800 12292 14256 175 -28177 -33118 -5453 13541 22223 13082 -14842 -28916 -17390 -20661
$$ packed form
14498a6127j0665j5567j0986K6152K8710j137j6246m86j8693j0334J3096O496
14486b5787N172L040K46n074J119M20J1827O616L673O160o929K07l189o120J3421
14471D802J997o263j507R626k1188j2515k295K3606J4275j5813r345N287l853
14458a3186J3491N116j328j5795L1172m323k7534r574K2999K828j0626j4280J1172
14445i868K9235K767o136O699P825j1443l0834o157O546J7620j7680o596J2679
14432e343q466O897j7196k9565K0723M0067J6013p967j6655j2437O041j853q418
14419a8159K799K3430K1390j5860j0607N505k79j6797j5574N420J2701n132K0963
14406I800K492J964j4081k8352m941K7665J8994Q682r141k7924j4074J1526l271
$$ plain form
14393 -20661 -28018 -29279 -16364 2126 15295 2459 -5424 2128 -12058 -28580 -16516 -23593 -4424
14380 -4424 7071 20369 27866 25227 2113 -10807 -5129 -3622 1879 15829 18170 20720 11544
14367 11544 -8556 3471 139 4157 24147 35076 19193 -11493 -33113 -24679 -27336 -31891 -14712
14354 -14712 -9398 -17819 -8924 -2597 18668 19979 18567 20586 11042 -4319 -15954 -31880 -7124
14341 -7124 27548 17726 -9986 472 15403 21404 11952 -21307 -26692 -6868 1975 1461 -16370
14328 -16370 -8114 17162 16857 8305 -4571 -8050 -17021 -26594 7049 24346 20100 10870 12580 17440
14314 17440 4858 -18110 -29258 -27248 -8590 893 4810 -10126 -30151 -22653 -5541 -6625 7688
14301 7688 -3843 5578 12534 9924 6176 9339 22650 22192 11711 12130 8127 20151 38566 21420
$$ packed form
14393b0661p357j261J2915J8490J3169j2836p883P552j4186j6522J2064p077J9169
14380d424J1495J3298P497k639k3114j2920N678J507N501J3950K341K550r176
14367A1544k0100J2027l332M018J9990J0929j5883l0686k1620Q434k657m555J7179
14354a4712N314q421Q895O327K1265J311j412K019r544j5361j1635j5926K4756
14341g124L4672r822k7712J0458J4931O001r452l3259n385J9824Q843n14j7831
14328a6370Q256K5276l05q552j2876l479q971r573L3643J7297m246r230J710M860
14314A7440j2582k2968j1148K010J8658R483L917j4936k0025P498J7112j084J4313
14301G688j1531R421O956k610l748L163J3311m58j0481M19m003J2024J8415j7146
$$ plain form
14287 21420 7790 11565 -11066 -5808 5793 3116 -4534 2473 -3026 -9923 -19767 -13257 -316
14274 -316 -6574 2386 5375 -6381 -12329 3765 722 2103 22738 25520 20973 12128 21853 37870
14260 37870 57357 64446 64298 61437 44020 38023 60985 62729 33384 4749 5614 15664 5218
14247 5218 -7248 958 -4636 -1919 2576 6729 1663 2502 19861 13813 -2692 -8602 -20516 -26966
14233 -26966 -8854 -26293 -46385 -38813 -29727 -21142 344 -12476 -21394 -1162 10555 11901 22161
14220 22161 5248 -1445 -18305 -20065 6371 6476 -9625 -20126 -26738 -9874 4858 -1098 -20415
14207 -20415 -39641 -28052 -5721 -11498 -11688 13842 26448 20569 29400 24599 6356 10698 8485
14194 8485 -881 -12865 -7466 1376 12846 480 5965 27791 23468 16602 15073 19190 30036
$$ packed form
14287B1420j3630L775k2631N258J1601k677p650P007n499o897r844O510J2941
14274c16o258Q960K989j1756n948J6094l043J381K0635K782m547q845R725J6017
14260C7870J9487P089j48k861j7417n997K2962J744k9345k8635Q65J0050j0446
14247E218j2466Q206n594K717M495M153n066Q39J7359o048j6505n910j1914o450
14233b6966J8112j7439k0092P572R086Q585K1486j2820q918K0232J1717J346J0260
14220B2161j6913o693j6860j760K6436J05j6101j0501o612J6864J4732n956j9317
14207b0415j9226J1589K2331n777j90K5530J2606n879Q831m801j8243M342k213
14194H485r366j1984N399Q842J1470j2366N485K1826m323o866j529M117J0846
$$ plain form
14181 30036 27299 26833 22836 9139 -842 -6288 16531 8408 -21151 -15528 -5281 -6587 -10336 -2002
14167 -2002 13131 8149 -4520 -20691 -26697 -24720 -34298 -41206 -17584 7381 10888 14711 13993 11435
14153 11435 13320 1835 10430 15206 13543 -6078 -25387 -23707 -21618 -11706 -13686 -15591 326
14140 326 3653 -19353 -8120 18880 15293 5617 12947 21568 26028 45019 63464 59901 55377 40023
14126 40023 45106 53742 37956 38388 26660 6769 -1967 -12414 -7556 -8468 12624 12765 6934 15324
14112 15324 23354 25028 24364 15005 19608 10875 2881 -11317 -21142 -17242 12295 26243 19594 -219
14098 -219 17637 47856 39096 22335 42366 70472 74577 62724 57637 51590 65641 65080 45314
14085 45314 25241 11359 4189 -7892 -6469 -15876 -24696 -26245 -16436 959 7304 10688 11654 5535
$$ packed form
14181C0036k737m66l997j3697r981n446K2819q123k9559N623J0247j306l749Q334
14167b002J5133m982j2669j6171o006J977r578o908K3622K4965L507L823p18k558
14153A1435J885j1485Q595M776j663j9621j9309J680K089R912j980j905J5917
14140C26L327k3006J1233K7000l587r676P330Q621M460J8991J8445l563m524j5354
14126D0023N083Q636j5786M32j1728j9891q736j0447M858r12K1092J41n831Q390
14112A5324Q030J674o64r359M603q733p994j4198r825L900K9537J3948o649j9813
14098b19J7856L0219q760j6761K0031K8106M105j1853n087o047J4051n61j9766
14085D5314k0073j3882p170j2081J423r407q820j549R809J7395O345L384R66o119
$$ plain form
14071 5535 30191 24954 -6269 9779 6225 1037 -8692 6342 19142 -7313 -6899 21405 43153
14058 43153 46817 45316 24447 -4991 -15389 -1975 -7193 -15335 -28982 -41784 -28138 -1136
14046 -1136 -3880 -7756 -21838 -33228 -34668 -28945 -23799 -32168 -35531 -19589 786 -7552 -18155
14033 -18155 -25299 -14739 -9342 -14519 -11084 -18537 -29253 -23338 -3046 39550 27135 13155 30615
14020 30615 57584 56141 39143 34225 37135 15480 17355 27882 44389 54420 67237 60753 47256
14007 47256 43038 40034 25079 27493 22966 34125 38918 27930 25517 11478 8413 -21851 -43244
13994 -43244 -32321 -20423 -6078 -5069 -20 755 -8359 -1671 -437 10982 9400 -2205 -12074
13981 -12074 -8973 -4660 15542 24432 19936 31580 40507 22876 2764 -18864 -31881 -28277 -14601
$$ packed form
14071E535K4656n237l1223J6048l554n188r729J5034J2800k6455M14K8304K1748
14058D3153L664j501k0869k9438j0398J3414n218q142j3647j2802J3646K7002
14046a136k744l876j4082j1390j440N723N146q369l363J5942K0375q338j0603
14033a8155p144J0560N397n177L435p453j0716N915K0292M2596j2415j3980J7460
14020C0615K6969j443j6998m918K910k1655J875J0527J6507J0031J2817o484j3497
14007D7256m218l004j4955K414m527J1159M793j0988k413j4039l065l0264k1393
13994d3244J0923J1898J4345J009N049P75r114O688J234J1419j582j1605r869
13981a2074L101M313K0202Q890m496J1644Q927j7631k0112k1628j3017L604J3676
$$ plain form
13968 -14601 -4420 7876 3209 576 10355 33666 39467 51416 26312 11169 11946 7556 33636
13955 33636 19561 21075 21879 26516 5446 -13293 10479 17118 -3184 -3272 -21155 -47984 -48875 -57524
13941 -57524 -55294 -53177 -43097 -19779 -5658 -9986 2481 285 -5407 -8568 -15995 -36007 -49138
13928 -49138 -42175 -31852 -13050 9537 -4016 290 6122 3493 -3096 6819 21081 8046 -132
13915 -132 9767 14975 19611 36606 33847 18363 24823 19056 12750 9295 636 7585 3273 17897
13901 17897 6833 -19354 -14726 -8873 10400 9257 -76 4029 20266 12291 2384 4857 19774
13888 19774 23068 20287 -26235 -23001 -11595 -31184 -46385 -19260 6753 4902 8219 10882 4783
13875 4783 9089 11204 3966 18442 13664 987 4183 -4374 -11713 -4998 -9386 -15963 -40254 -25874
$$ packed form
13968a4601J0181J2296m667k633R779K3311N801J1949k5104j5143P77m390K6080
13955C3636j4075J514Q04M637k1070j8739K3772O639k0302q8j7883k6829q91q649
13941e7524K230K117J0080K3318J4121m328J2467k196n692l161p427k0012j3131
13928d9138O963J0323J8802K2587j3553M306N832k629o589R915J4262j3035q178
13915a32R899N208M636J6995k759j5484O460n767o306l455q659O949m312J4624
13901A7897j1064k6187M628N853J9273j143r333M105J6237p975r907K473J4917
13888A9774L294k781m6522L234J1406j9589j5201K7125K6013j851L317K663o099
13875D783M306K115p238J4476m778j2677L196q557p339O715m388o577k4291J4380
$$ plain form
13861 -25874 -3581 -7758 15208 35316 54153 57549 47441 16975 -12685 -16415 -17689 -26301 -19910
13848 -19910 -3190 -12631 -27731 -29751 -20798 -23078 -24022 -8705 2278 4023 6751 13005 7111 -7141
13834 -7141 -10052 1341 1295 11870 22965 32667 29077 19666 18749 21482 42545 47610 43793 26985
13820 26985 14194 8410 -16867 -22186 -1346 2356 5235 10520 10655 4542 11771 11705 1579 -4114
13806 -4114 -4497 -2999 4251 2929 -15859 -30071 -28862 -27146 -23892 -25653 -16457 -12564 6474 18446
13792 18446 15064 3253 -6351 -2265 -6282 -4862 -12236 -9358 3011 4067 -20570 -11974 -4256 -6262
13778 -6262 -17011 -18013 -10689 -2115 3834 8502 439 -5435 -3813 -3648 -4092 20663 44242 49236
13764 49236 23461 11937 13411 -89 -3855 -13035 -7929 -14624 -18335 -14181 15872 34447 38129
$$ packed form
13861b5874K2293m177K2966K0108J8837L396j0108l0466k9660l730j274q612O391
13848a9910J6720r441j5100k020Q953k280r44J5317J0983J745K728O254n894j4252
13834g141k911J1393m6J0575J1095R702l590r411r17K733K1063N065l817j6808
13820B6985j2791n784k5277n319K0840L702K879N285J35o113P229o6j0126n693
13806d114l83J498P250j322j8788j4212J209J716L254j761R196L893J9038J1972
13792A8446l382j1811r604M086m017J420p374K878J2369J056k4637Q596P718k006
13778f262j0749j002P324Q574N949M668q063n874J622J65m44K4755K3579M994
13764D9236k5775j1524J474j3500l766r180N106o695l711M154L0053J8575L682
$$ plain form
13751 38129 21496 9044 11745 29001 26610 25078 28786 23937 14263 21467 20581 19710 25473 44265
13737 44265 36742 30153 28749 23216 29880 34513 34891 26924 9543 -12672 -648 12437 -6440
13724 -6440 -23954 -15758 -85 -11697 -24113 -16601 -7183 -10430 -4061 14566 12479 19007 16903
13711 16903 25298 8852 -8526 -11904 -4902 -5217 7104 21578 35763 20678 -11015 9466 35932
13698 35932 59485 42210 30025 25351 24187 32385 25232 2339 -1708 18494 17715 26921 -749
13685 -749 -11946 4433 17423 25181 41670 33889 27333 16962 13843 12632 12048 -9138 -11873 -7096
13671 -7096 -1721 -3262 -9553 -13903 -1131 3269 2922 12137 -2192 -221 11343 26449 23740 -7564
13657 -7564 390 16150 21442 30725 27685 22498 -1583 -10634 -3848 -7398 5170 33957 32578 -772
$$ packed form
13751C8129j6633j2452K701J7256k391j532L708m849r674P204q86q71N763J8792
13737D4265p523o589j404n533O664M633L78p967j7381k2215J2024J3085j8877
13724f440j7514Q196J5673j1612j2416P512R418l247O369J8627k087O528k104
13711A6903Q395j6446j7378l378P002l15J2321J4474J4185j5085l1693K0481K6466
13698C5932K3553j7275j2185m674j164Q198p153k2893m047K0202p79R206k7670
13685g49j1197J6379J2990P758J6489p781o556j0371l119j211n84k1186k735M777
13671g096N375j541o291m350J2772M400l47R215j4329J971J1564J5106k709l1304
13657g564P954J5760N292R283l040n187k4081r051O786l550J2568K8787j379l3350
$$ plain form
13643 -772 -5174 5783 13538 18405 17908 19237 2187 10796 18579 7238 -972 -9951 5345 21473
13629 21473 34213 20885 29462 16526 21280 18161 36877 28902 32805 57747 50908 53776 51730
13616 51730 29014 38165 48983 38450 18861 16144 -10274 -18437 13617 31586 13449 3658
13604 3658 3827 7859 462 -15986 -14859 9272 11567 -4760 10351 16743 25294 15935 2779 4212
13590 4212 4314 1069 17709 18890 22439 20757 22917 40930 48210 27794 27822 34268 59898 75509
13576 75509 105363 111345 101571 92433 71393 46876 31362 53197 59461 50901 42983 47363 43316
13563 43316 40608 45646 53855 92593 96177 85877 67422 80204 106016 141327 167868 193099
13551 193099 217009 289635 372045 461197 612607 941970 1429515 1990243 2376636 2431755
$$ packed form
13643g72m402J0957P755M867m97J329j7050Q609P783j1341q210q979J5296J6128
13629B1473J2740j3328Q577j2936M754l119J8716p975L903K4942o839K868k046
13616E1730k2716R151J0818j0533j9589k717k6418q163L2054J7969j8137r791
13604C658J69M032p397j6448J127K4131K295j6327J5111O392Q551r359j3156J433
13590D212J02l245J6640J181L549j682K160J8013P280k0416K8O446K5630J5611
13576G5509K9854N982r774r138k1040k4517j5514K1835O264q560p918M380m047
13563D3316k708N038Q209L8738L584j0300j8455J2782K5812L5311K6541K5231
13551A93099K3910P2626Q2410Q9152J51410L29363M87545N60728L86393N5119
$$ plain form
13541 2431755 2073932 1482384 952313 623903 433675 306099 237516 216792 186617 135902
13531 135902 136748 173267 171541 156134 147102 140766 134826 113587 126549 138403 141839 147600 144780
13518 144780 153535 161653 160204 164909 153002 143790 171663 199931 255469 284055 328947 397156
13506 397156 503906 623493 812475 1120730 1634532 2414231 3411864 4300210 4693664 4362632
13496 4362632 3446549 2394506 1568894 1022633 714169 518445 396869 340874 277603 238906
13486 238906 204060 172859 153115 127819 116948 135069 134191 125571 86404 85944 87073 86372 77616
13473 77616 89603 109149 101770 97862 90493 110055 136772 149639 163403 179265 211514 249324
13461 249324 305446 398399 544731 772032 1145193 1689883 2262625 2575883 2528397 2035388
$$ packed form
13541B431755l57823n91548n30071l28410j90228j27576o8583k0724l0175n0715
13531A35902Q46L6519j726j5407r032o336n940k1239J2962J1854L436N761k820
13518A44780Q755Q118j449M705j1907r212K7873K8268N5538K8586M4892O8209
13506C97156J06750J19587J88982L08255N13802P79699R97633Q88346L93454l31032
13496D362632r16083j052043q25612n46261l08464j95724j21576n5995o3271l8697
13486B38906l4846l1201j9744k5296j0871J8121q78q620l9167m60J129p01q756
13473G7616J1987J9546p379l908p369J9562K6717J2867J3764J5862L2249L7810
13461B49324N6122R2953J46332K27301L73161N44690N72742L13258m7486m93009
$$ plain form
13451 2035388 1368703 833251 527426 357314 263599 213983 178025 146966 137821 124763 89830
13440 89830 76609 60374 50062 51918 51979 73804 65105 49794 5269 -15863 -18493 -7285 7581
13427 7581 19961 26507 40820 21202 20350 21075 21356 21023 30983 34831 25830 25505 20038 13069 20694
13412 20694 18693 34527 21263 -4882 -6987 50 -9078 -3669 -1165 7360 10295 -8107 -2274
13399 -2274 25347 34843 19164 4587 9770 21644 10104 -5777 2944 3084 -10131 -13417 -10708
13386 -10708 2664 16325 22995 21437 31149 24681 16562 1070 -8901 -17802 -29857 -19342 10894
13373 10894 51221 69976 56732 47971 31854 20032 27257 39433 23677 15493 24311 22739 9316
13360 9316 8414 -2321 -464 4594 21498 20941 3354 -15768 -21333 -18699 -8409 -2229 -19886 8290
$$ packed form
13451B035388o66685n35452l05825j70112r3715m9616l5958l1059r145j3058l4933
13440H9830j3221j6235j0312J856O1K1825q699j5311m4525k1132k630J1208J4866
13427G581J2380O546J4313j9618q52P25K81l33R960L848r001l25n467o969P625
13412B0694k001J5834j3264k6145k105P037r128N409K504Q525K935j8402N833
13399b274K7621R496j5679j4577N183J1874j1540j5881Q721J40j3215l286K709
13386a0708J3372J3661O670j558R712o468q119j5492r971q901j2055J0515L0236
13373A0894M0327J8755j3244q761j6117j1822P225J2176j5756q184Q818j572j3423
13360I316r02j0735J857N058J6904n57j7587j9122n565K634J0290O180j7657K8176
$$ plain form
13346 8290 15455 20524 27901 28794 16227 9986 17117 -11241 -3113 8950 -11393 -29927 -47936
13333 -47936 -67162 -40275 -2336 15939 10734 15193 4672 -18282 -33285 -43615 -22845 -8599
13321 -8599 734 -6585 -1825 6053 -3747 -11703 8927 5239 -7976 -5109 5171 3922 25425 28953
13307 28953 4431 9227 38499 23023 4309 9089 -16889 -15641 -27904 -28741 -419 4433 10674
13294 10674 17966 -8396 -8730 4341 20435 21759 24202 4964 7008 12908 3513 15209 21136
13281 21136 31686 30736 10771 23187 35116 42699 50267 73448 105545 131538 182261 186414 160384
13268 160384 119865 72986 29869 14159 9737 20465 10046 -1491 13985 17872 21455 18932
13256 18932 26098 7559 5383 1213 -5214 -9485 -27460 -50750 -53849 -36203 -34135 -14820 -1094
$$ packed form
13346H290P165N069P377Q93j2567o241P131k8358Q128J2063k0343j8534j8009
13333d7936j9226K6887L7939J8275n205M459j0521k2954j5003j0330K0770J4246
13321h599R333p319M760P878r800p956K0630l688j3215K867J0280j249K1503L528
13307B8953k4522M796K9272j5476j8714M780k5978J248j2263q37K8322M852O241
13294A0674P292k6362l34J3071J6094J324K443j9238K044N900r395J1696N927
13281B1136J0550r50j9965J2416J1929P583P568K3181L2097K5993N0723M153k6030
13268A60384m0519m6879m3117j5710m422J0728j0419j1537J5476L887L583k523
13256A8932P166j8539k176m170o427m271j7975k3290l099J7646K068J9315J3726
$$ plain form
13243 -1094 -5297 -2643 12045 57013 81928 102663 109563 103403 123085 160187 211170 211530 183372
13230 183372 142803 104225 93091 80163 28691 -3165 -12052 4599 -8666 -23960 -23945 6331
13218 6331 16144 17889 18581 24143 52770 47677 17662 14655 21205 15637 10579 1219 14284 35537
13204 35537 52357 48081 33306 36679 55182 74322 90806 110857 105600 119736 124510 108830
13192 108830 65616 36780 24810 26882 10420 13935 22208 37596 27464 14556 29196 31499
13180 31499 25042 10294 -14665 -22573 -16439 12667 8806 -2050 2339 -9624 -17545 -9479 -7350
13167 -7350 -12907 3497 24883 33799 37112 29305 17483 14191 11049 -8365 -18326 -37277 -11646
13154 -11646 23962 17428 13208 17851 35592 22411 -1235 -10688 -21119 -14196 -3882 -13454 -21966
$$ packed form
13243a094m203K654J4688M4968K4915K0735O900o160J9682L7102N0983L60k8158
13230A83372m0569l8578j1134j2928n1472l1856q887J6651j3265j5294J5L0276
13218F331R813J745O92N562K8627n093l0015l007O550n568n058r360J3065K1253
13204C5537J6820m276j4775L373J8503J9140J6484K0051n257J4136M774j5680
13192A08830m3214k8836j1970K072j6462L515Q273J5388j0132j2908J4640K303
13180C1499o457j4748k4959p908O134K9106l861j0856M389j1963p921Q066K129
13167g350n557J6404K1386Q916L313p807j1822l292l142j9414r961j8951K5631
13154a1646L5608o534m220M643J7741j3181k3646r453j0431O923J0314r572q512
$$ plain form
13141 -21966 -13869 -12111 -16855 -30312 -31947 -41738 -6784 16138 479 -7682 -4775 1525 2030 2653
13127 2653 16339 23841 34673 39812 15303 -14201 -24273 -16952 6676 8427 -2762 -14491 -35081
13114 -35081 -47860 -45563 -35698 -20560 -4172 10560 14474 4744 8200 26689 59421 46941 50436
13101 50436 34955 36900 41528 18240 -5165 -17412 -32932 -5825 20347 36784 21347 9583
13089 9583 13328 10839 16841 18358 23816 34989 38158 29965 29031 31490 30463 -2829 -37364 -49226
13075 -49226 -41708 -22148 -6923 -1444 -2684 -7797 -22763 -23998 -16805 -15016 -15044 -8126 -17817 -7121
13061 -7121 -8050 -17395 -16494 -16527 -24948 -25601 -33412 -33575 -46708 -54967 -36749 -22579 -24704 -21412 -22104 -25858
13045 -25858 -27789 -36124 -36301 -10356 -12852 -27097 -24647 -9492 17389 8390 4879 -6808 -11016
$$ packed form
13141b1966Q097J758m744j3457j635r791L4954K2922j5659q161K907O300N05O23
13127B653J3686P502J0832N139k4509k9504j0072P321K3628J751j1189j1729k0590
13114c5081j2779K297R865J5138J6388J4732L914r730L456J8489L2732j2480L495
13101E0436j5481J945M628k3288k3405j2247j5520K7107K6172J6437j5437j1764
13089I583L745k489O002J517N458J1173L169q193r34K459j027l3292l4535j1862
13075d9226P518J9560J5225N479j240n113j4966j235P193J789k8O918r691J0696
13061g121r29r345R01l3q421o53p811j63j3133q259J8218J4170k125L292o92l754
13045b5858j931q335j77K5945k496j4245K450J5155K6881q999l511j1687m208
$$ plain form
13032 -11016 -4177 -1440 -10430 7556 28371 26764 15168 24938 36694 32043 32917 19051 3001
13019 3001 33492 51587 55520 70014 60885 52548 47267 48005 24400 663 -17904 -8777 -2354
13006 -2354 13315 18453 20318 1649 -20582 -31480 -22704 -890 21989 10960 15367 22786 25458
12993 25458 24008 21568 14735 9735 9832 28141 45274 38511 26421 5907 -6434 9217 36130
12980 36130 32042 27324 20096 22532 26172 20168 10927 -2250 17260 27078 19865 22649 11569 -4587
12966 -4587 1039 7652 10646 20111 26121 19271 6832 -15683 -9999 9206 16924 10649 -2448 3604
12952 3604 3185 14191 -1593 -22866 -26922 -29263 -37644 -41682 -16219 2507 6878 16275 -529
12939 -529 -4748 -77 15978 18272 7341 760 2747 3118 3000 -11229 -13807 4974 13411 -121
$$ packed form
13032a1016O839K737q990J7986K0815j607j1596R770J1756m651Q74j3866j6050
13019C001L0491J8095L933J4494r129q337n281P38k3605k3737j8567R127O423
13006b354J5669N138J865j8669k2231j0898Q776K1814K2879j1029M407P419K672
12993B5458j450k440o833n000R7J8309J7133o763j2090k0514j2341J5651K6913
12980C6130m088m718p228K436L640o004r241j3177J9510R818p213K784j1080j6156
12966d587N626O613K994R465O010o850j2439k2515N684J9205P718o275j3097O052
12952C604m19J1006j5784k1273m056k341q381m038K5463J8726M371R397j6804
12939e29m219M671J6055K294j0931o581J987L71j18j4229k578J8781Q437j3532
$$ plain form
12925 -121 115 -8235 -7817 -5595 -2129 -2552 -15366 -26025 -31199 -28066 -34097 -27798 -47684 -49258 -36379
12910 -36379 -23593 -16080 1871 3319 5115 3396 10569 10446 6236 11224 5661 8245 30760 38540
12896 38540 49654 48006 23998 427 -2973 -8765 -11293 -15362 2268 22165 19867 5736 3452
12883 3452 3979 -5034 -14005 -9394 8211 14081 5523 -2382 -5609 -8992 11347 15457 19233 43713
12869 43713 34853 28104 28870 19761 7796 7777 9982 1001 -20459 -5053 2295 17135 31580 15535
12855 15535 15297 27560 36720 37535 57368 52780 28390 7408 -6128 9942 14202 5733 -1715
12842 -1715 -7841 7275 20453 20296 1897 -10686 -17081 -11675 18024 44611 23049 7804 4222
12829 4222 8653 -17018 -26481 -16729 -14396 -15205 9774 19005 5704 1165 16236 30063 21394 5093
$$ packed form
12925a21K36q350M18K222L466m23j2814j0659n174L133o031O299j9886j574J2879
12910c6379J2786P513J7951J448J796j719P173j23m210M988n563K584K2515P780
12896C8540J1114j648k4008k3571l400n792k528m069J7630J9897k298j4131k284
12883C452N27r013q971M611J7605N870q558p905l227l383K0339M110L776K4480
12869D3713q860o749P66r109j1965j9K205q981k1460J5406P348J4840J4445j6045
12855A5535k38J2263R160Q15J9833m588k4390k0982j3536J6070M260q469p448
12842a715o126J5116J3178j57j8399j2583o395N406K9699K6587k1562j5245l582
12829D222M431k5671r463R752K333q09K4979R231j3301m539J5071J3827q669j6301
$$ plain form
12815 5093 9053 19849 41535 33385 27383 14502 10444 13849 23757 44195 54450 68754 50333
12802 50333 44738 25736 17639 33489 38534 22068 26306 33397 6686 -13826 12903 33748 32347
12789 32347 48718 51347 31003 21115 19760 18290 10616 3833 -6848 -8883 -3096 1385 33663
12776 33663 48535 36952 31496 15325 16209 2096 12649 18700 -2140 -18926 -19716 2327 13275
12763 13275 25996 13388 -4506 -11077 -3214 18143 6946 -4756 -20653 -20981 -30434 -21645 -14501
12750 -14501 -12963 7209 19062 27848 43307 51322 71595 72376 68954 51767 35944 26773 14807
12737 14807 1771 -6229 -2116 13312 32524 25658 13160 1047 864 -2878 2882 24175 30466
12724 30466 31432 26445 12884 -3286 -2086 14804 14698 5394 2261 -1988 22156 42421 54140
$$ packed form
12815E093L960J0796K1686q150o002j2881m058L405R908K0438J0255J4304j8421
12802E0333n595j9002q097J5850N045j6466M238P091k6711k0512K6729K0845j401
12789C2347J6371K629k0344r888j355j470p674o783j0681k035N787M481L2278
12776C3663J4872j1583n456j6171Q84j4113J0553O051k0840j6786p90K2043J0948
12763A3275J2721j2608j7894o571P863K1357j1197j1702j5897l28r453Q789P144
12750a4501J538K0172J1853Q786J5459Q015K0273P81l422j7187j5823r171j1966
12737A4807j3036q000M113J5428J9212o866j2498j2113j83l742N760K1293O291
12724C0466R66m987j3561j6170J200J6890j06r304l133m249K4144K0265J1719
$$ plain form
12711 54140 53329 34591 29954 43253 32425 16733 23931 18761 30481 28152 47403 48349 24959
12698 24959 9498 21819 42642 20934 1460 -1078 -10047 -12132 -3306 -6257 -4767 -2910 10021
12685 10021 -3393 14394 34167 28159 14722 4618 -14844 -14713 -1784 25583 26392 10039 13320
12672 13320 8211 12761 2942 -11279 -24292 -25088 -28320 -37289 -13738 -4502 -20696 -17401 -8527 12845
12658 12845 24431 50588 42268 37249 20424 4758 -14527 -27589 -18290 1251 -630 -12278
12646 -12278 -13727 -20893 -17348 -13870 18486 8843 21707 17234 17335 28934 15038 16785 24861 17065
12632 17065 7786 1174 -6256 -1597 12117 17500 13369 14565 -1910 -4634 -9824 -7259 -7065 -2006
12618 -2006 3089 11148 3891 1478 11101 1448 6503 23699 11366 13688 1788 -2617 -5094 10152
$$ packed form
12711E4140q11j8738m637J3299j0828j5692P198n170J1720k329J9251R46k3390
12698B4959j5461J2321K0823k1708j9474k538q969k085Q826k951J490J857J2931
12685A0021j3414J7787J9773o008j3437j0104j9462J31J2929K7367Q09j6353L281
12672A3320n109M550r819j4221j3013p96l232q969K3551R236j6194L295Q874K1372
12658A2845J1586K6157q320n019j6825j5666j9285j3062R299J9541j881j1648
12646a2278j449p166L545L478L2356r643J2864m473J01J1599j3896J747Q076p796
12632A7065r279o612p430M659J3714N383m131J196j6475k724n190K565J94N059
12618b006N095Q059p257k413R623r653N055J7196j2333K322j1900m405k477J5246
$$ plain form
12604 10152 9497 5636 -12574 -14426 -7208 1077 1247 -19785 -12875 230 17285 18225 -2503 -18014
12590 -18014 -21735 -19453 -8073 -6519 -17644 -6048 24508 34655 28389 26184 28985 26834 30147
12577 30147 45425 31729 26480 5712 6001 16167 30481 48551 34803 47084 43450 30945
12565 30945 42585 39700 26542 8258 -4 -34066 -47183 -38249 -41679 -20634 7711 15658 13904
12552 13904 21293 8493 8330 17313 36157 54014 54307 42744 36132 35066 42355 29531 9588
12539 9588 902 12377 22122 14603 25343 20009 16551 4113 -8070 8995 12859 16597 41344
12526 41344 55587 26364 26163 27033 22996 9625 26280 43590 35706 27250 24452 42063 59678
12513 59678 77429 85678 68701 74489 83645 69322 71520 89300 81684 69151 63846 48733 57252
$$ packed form
12604A0152o55l861j8210j852P218Q285J70k1032O910J3105J7055R40k0728j5511
12590a8014l721K282J1380J554j1125J1596L0556J0147o266k205K801k151L313
12577C0147J5278j3696n249k0768K89J0166J4314J8070j3748J2281l634j2505
12565C0945J1640k885j3158j8284q262l4062j3117Q934l430K1045K8345P947j754
12552A3904P389j2800j63Q983J8844J7857K93j1563o612j066P289j2824j9943
12539I588q686J1475R745p519J0740n334l458j2438j2183J7065L864L738K4747
12526D1344J4243k9223k01Q70m037j3371J6655J7310p884q456k798J7611J7615
12513E9678J7751Q249j6977N788R156j4323K198J7780p616j2533n305j5113Q519
$$ plain form
12500 57252 42776 62166 74153 77691 73241 68340 65193 62599 64789 45187 58130 61184 48813
12487 48813 33288 31768 35516 44488 45222 24980 15498 28937 46020 61226 71426 68879 59441
12474 59441 60329 62203 48680 46226 52471 67178 97996 124032 111652 107647 120222 110653 103665
12461 103665 88573 81879 66230 56744 57581 52991 49408 53520 64357 86978 107032 94527 86726
12448 86726 65099 59057 72867 42754 32518 34688 23322 24841 30470 28918 1003 2618 31013
12435 31013 41309 33988 9954 -19614 -25416 -17449 106 22581 12819 -4123 17317 9709 4693
12422 4693 17259 27823 41438 33046 16621 12014 18027 24400 10977 16357 29451 40099 29501
12409 29501 23665 29759 38606 36483 51400 51024 38169 30680 25002 19184 17472 -3689 -6956 -1322
$$ packed form
12500E7252j4476J9390J1987L538m450m901l147k594K190j9602J2943L054j2371
12487D8813j5525j520L748Q972P34k0242r482J3439J7083J5206J0200k547r438
12474E9441Q88J874j3523k454O245J4707L0818K6036j2380m005J2575r569o988
12461A03665j5092o694j5649r486Q37m590l583M112J0837K2621K0054j2505p801
12448H6726k1627o042J3810l0113j0236K170j1366J519N629j552k7915J615K8395
12435C1013J0296p321k4034k9568n802P967J7555K2475r762j6942K1440p608n016
12422D693J2566J0564J3615q392j6425m607O013O373j3423N380J3094J0648j0598
12409B9501n836O094Q847k123J4917l76j2855p489n678n818j712k1161l267N634
$$ plain form
12395 -1322 23734 12030 -48 -2630 -10604 -9199 -8914 -2 4932 -2291 546 -11410 -3264 14348
12381 14348 11195 -2755 3927 18361 24948 26738 38650 37913 16226 -5183 11541 34300 38481
12368 38481 -6639 -19667 -20788 -25383 -24157 -10711 -3128 -16907 -13289 -5253 -12903 -15152 -8506
12355 -8506 -4106 -38210 -31867 9487 15395 15190 -2327 -12558 -18613 -17037 -39248 -21129 -182
12342 -182 7870 5338 -5143 -16840 -6934 6562 11841 14487 18377 18028 27556 25013 9228 -10977
12328 -10977 -19944 -19931 -10032 -6723 -1691 10515 -7894 -11944 -5315 -10612 -16960 -899 -7700 -3928
12314 -3928 8908 -1272 2017 23858 7267 5485 11197 18588 -1272 -5767 -1908 8616 13241
12301 13241 26724 31768 28015 20798 -3681 1430 17743 21742 20556 37857 39329 43565 67478
$$ packed form
12395a322K5056j1704j2078k582p974J405K85Q912M934p223K837j1956Q146J7612
12381A4348l153j3950O682J4434O587J790J1912p37k1687k1409J6724K2759M181
12368C8481m5120j3028j121m595J226J3446P583j3779L618Q036p650k249O646
12355h506M400l4104O343M1354N908k05j7517j0231o055J576k2211J8119K0947
12342a82Q052k532j0481j1697R906J3496N279K646L890l49R528k543j5785k0205
12328a0977q967J3R899L309N032J2206j8409m050O629n297o348J6061o801L772
12314c928J2836j0180L289K1841j6591j782N712P391j9860m495L859J0524M625
12301A3241J3483N044l753p217k4479N111J6313L999j186J7301J472M236K3913
$$ plain form
12288 67478 43626 21333 31873 32606 10604 6892 6069 11012 13394 25909 28422 32976 25093 19209
12274 19209 2225 13715 21888 21672 12371 4891 -1739 -21634 -23669 -30956 -3948 -5069 -5529 -4245
12260 -4245 -18427 -8596 1515 -5062 -10596 -7066 -15657 -19453 -18018 -18250 -560 -492 -14024 -16139
12246 -16139 642 4744 -5825 -29267 -38777 -26783 -20017 -9685 -4443 -13944 -28796 -33373 -27718
12233 -27718 -20996 -14113 -16025 -13127 -5019 -2020 897 -11286 -8407 7459 -11773 -16083 3485
12220 3485 19684 6058 -3285 -9508 -9852 -3930 -11589 -3450 18724 35529 52450 59870 53663 17367
12206 17367 -15282 -9901 -7202 -10192 -10465 -5186 -1684 -28959 -37381 -50626 -33938 -20253 -7640
12193 -7640 9943 940 10519 18409 17660 19383 1532 -2446 4528 1834 -2798 -5447 -18174 -20462
$$ packed form
12288F7478k3852k2293J0540P33k2002l712q23M943K382J2515K513M554p883n884
12274A9209j6984J1490Q173k16r301p480o630j9895k035p287K7008j121m60J284
12260d245j4182R831J0111o577n534L530q591l796J435k32J7690O8j3532k115
12246a6139J6781M102j0569k3442r510J1994O766J0332N242r501j4852m577N655
12233b7718O722O883j912K898Q108K999K917j2183K879J5866j9232m310J9568
12220C485J6199j3626r343o223l44N922p659Q139K2174J6805J6921P420o207l6296
12206A7367l2649N381K699k990k73N279L502k7275q422j3245J6688J3685J2613
12193g640J7583r003R579P890p49J723j7851l978O974k694m632k649j2727k288
$$ plain form
12179 -20462 -23739 -28501 -14507 -5682 -10425 -10648 -582 7545 18779 45285 20120 -13283 -15815
12166 -15815 -386 -10633 -15486 8525 25538 31908 27969 36320 8812 -5306 -14011 -16101 -24643
12153 -24643 -21040 -5234 16845 9409 1647 1099 -8045 -8135 -2246 -5235 14866 8192 -11141 -19585
12139 -19585 -2850 6919 11789 19541 39043 21660 7241 14510 9147 2411 24934 27878 -1568
12126 -1568 -26099 -24954 -21111 -3936 5077 2568 13899 11289 12051 7284 2261 9013 -6923 -14536
12112 -14536 -40057 -49452 -24682 -6047 -4940 -3910 -10166 -21419 -23420 9785 23053 22581 17706
12099 17706 3158 884 -3500 4126 28907 45478 16568 10552 33294 39718 18538 13001 12019
12086 12019 13314 14830 25976 14035 -8774 -6700 5943 7816 7798 5750 -195 -1367 -25502 -15469
$$ packed form
12179b0462l277m762J3994Q825m743k23J0066Q127J1234K6506k5165l3403k532
12166a5815J5429j0247m853K4011J7013O370l939Q351k7508j4118q705k090q542
12153b4643L603J5806K2079p436p762n48r144r0N889k989K0101o674j9333q444
12139a9585J6735R769M870P752J9502j7383j4419P269n363o736K2523K944k9446
12126a568k4531J145L843J7175R013k509J1331k610P62m767n023O752j5936p613
12112a4536k5521r395K4770J8635J107J030o256j1253k001L3205J3268m72m875
12099A7706j4548k274m384P626K4781J6571k8910o016K2742O424k1180n537r82
12086A2019J295J516J1146j1941k2809K074J2643J873j8k048n945j172k4135J0033
$$ plain form
12072 -15469 -1285 -10518 -29030 -26778 -15614 2794 7161 -9798 -39854 -11152 11404 33270
12060 33270 37853 34925 42475 36710 24161 30779 36563 13247 17619 15952 19770 9097 -7189
12047 -7189 -15539 -24544 -20353 -15246 -6439 2926 19679 17257 6235 26415 36015 42322 49583 47636
12033 47636 44671 25272 21622 24089 18583 25276 45424 28003 4258 12603 20664 24612 33207
12020 33207 24140 26940 30969 25914 -281 -16598 -19722 4253 12368 -930 -10233 -16994 -18725
12007 -18725 -8520 -3665 -3739 -6980 15776 29616 28568 19250 413 -5168 3134 4009 14497 4243
11993 4243 -2123 6540 22572 38427 44302 26559 25032 36784 33125 17382 -3275 1513 28849
11980 28849 20354 -2812 -11834 -9008 -9240 -9562 7852 19158 11285 11659 13491 -15994 -41405 -43252
$$ packed form
12072a5469J4184r233j8512K252J1164J8408M367j6959l0056K8702K2556K1866
12060C3270M583k928P550n765j2549O618N784k3316M372j667L818j0673j6286
12047g189q350r005M191N107Q807R365J6753k422j1022K0180R600O307P261j947
12033D7636k965j9399l650K467n506O693K0148j7421k3745Q345Q061L948Q595
12020C3207r067K800M029n055k6195j6317l124K3975Q115j3298r303o761j731
12007a8725J0205M855p4l241K2756J3840j048r318j8837n581Q302Q75J0488j0254
11993D243o366Q663J6032J5855N875j7743j527J1752l659j5743k0657M788K7336
11980B8849q495k3166r022K826k32l22J7414J1306p873L74J832k9485k5411j847
$$ plain form
11966 -43252 -28784 -18539 2791 872 -6446 -13245 -10463 -11731 9516 21722 14151 2708 -11708
11953 -11708 -36559 -36175 -17845 20090 6505 -10138 -4649 9708 18468 23942 25173 27083 6329
11940 6329 -18219 -9664 -10617 -10664 10958 15632 15228 13923 23352 32566 29934 12589 -9000 -10144 -3334
11925 -3334 13993 15003 1644 10400 23518 31982 22282 3663 12078 38566 41649 24171 14472
11912 14472 24895 23469 -11182 -23050 -26662 -49260 -58288 -27734 -17910 7953 33053 21542
11900 21542 -5605 -16605 -15986 -1482 12411 25432 17787 10656 31153 49495 40261 28099 16978
11887 16978 1934 -21479 -19543 -11506 -23299 -20430 -22608 -33704 -16040 -21903 -12984 -27409 -40067
11874 -40067 -27631 -9934 -5965 -9252 -11489 -79 22348 30691 43568 25241 16634 19661 27396
$$ packed form
11966d3252J4468J0245K1330j919p318o799K782j268K1247J2206p571j1443j4416
11953a1708k4851L84J8330L7935j3585j6643N489J4357Q760N474J231J910k0754
11940F329k4548Q555r53m7K1622M674m04j305R429R214k632j7345k1589j144O810
11925c334J7327J010j3359Q756J3118Q464r700j8619Q415K6488L083j7478r699
11912A4472J0423j426l4651j1868l612k2598r028L0554R824K5863K5100j1511
11900B1542k7147j1000O19J4504J3893J3021p645p131K0497J8342r234j2162j1121
11887A6978j5044k3413J936Q037j1793K869k178j1096J7664n863Q919j4425j2658
11874d0067J2436J7697L969l287k237J1410K2427Q343J2877j8327q607L027P735
$$ plain form
11861 27396 40206 49304 53304 42487 31897 27012 11767 18415 14662 5282 10817 8152 14021
11848 14021 26332 36300 43707 29854 10095 8046 10045 7857 28521 19136 -5134 -13777 -9245
11835 -9245 -13347 261 7333 21087 18720 9359 465 -14222 -17687 -7951 -19175 -17362 1865
11822 1865 14580 11234 26326 34481 17390 7534 11097 12851 16179 28064 -5918 -9029 8850
11809 8850 12432 18733 33490 29705 19918 17447 11796 1509 -5631 -6088 4569 19829 27304 9795
11795 9795 7786 15990 22197 3572 -13124 2699 31711 26584 13654 -7445 -17238 -4874 6144
11782 6144 31283 31758 9933 -1355 14273 16196 1957 14806 27105 13039 42546 59604
11770 59604 65189 61977 55536 35120 6292 6079 1824 1999 22499 27110 26181 32003 15706 22705
$$ packed form
11861B7396J2810R098M000j0817j0590m885j5245O648l753r380N535k665N869
11848A4021J2311R968P407j3853j9759k049J999k188K0664r385k4270q643M532
11835i245m102J3608P072J3754k367r361q894j4687l465R736j1224J813J9227
11822A865J2715l346J5092Q155j7091r856L563J754L328J1885l3982l111J7879
11809H850L582O301J4757l785r787k471n651j0287p140m57J0657J5260P475j7509
11795I795k009Q204O207j8625j6696J5823K9012n127j2930k1099r793J2364J1018
11782F144K5139M75k1825j1288J5628J923j4239J2849J2299j4066K9507J7058
11770E9604N585l212o441k0416k8828k13m255J75K0500M611r29N822j6297O999
$$ plain form
11756 22705 21016 10671 3062 4797 1396 8242 -16466 -42545 -46359 -41352 -26510 -6091 20390
11743 20390 40535 39220 36937 27932 20122 29916 30986 41102 41647 47000 26914 -7507 -2000 -341
11729 -341 -11985 -17279 -8969 10590 21927 26958 15053 28750 37538 17985 5869 9367 6348
11716 6348 11150 45977 45323 12881 12607 -1255 -15841 -10159 6722 -3582 -14142 -10656 -3154
11703 -3154 659 -6530 -12507 -8073 15225 11397 2736 -18494 -26367 -22374 -25469 -19112 -325 -9157
11689 -9157 -34585 -31594 -17418 -865 -10628 5833 19149 3249 -8166 -10403 -3320 -1213 -13369
11676 -13369 -27315 -22802 -22451 -20813 -19161 -20324 8476 11181 -9007 -20425 -23751 -31425 -35431 -30738
11662 -30738 -15468 5770 11277 32827 33312 28910 28242 33381 15814 17673 16911 21607 31365 36996
$$ packed form
11756B2705j689j0345p609J735l401O846k4708k6079l814N007J4842K0419K6481
11743B0390K0145j315k283r005p810R794J070J0116N45N353k0086l4421N507J659
11729c41j1644n294Q310J9559J1337N031j1905J3697Q788j9553j2116L498l019
11716F348M802L4827o54l2442k74j3862j4586N682J6881j0304j0560L486P502
11703c154L813p189n977M434K3298l828q661k1230p873L993l095O357J8787q832
11689i157k5428K991J4176J6553r763J6461J3316j5900j1415k237P083K107j2156
11676a3369j3946M513L51J638J652j163K8800K705k0188j1418l326p674m006M693
11662c0738J5270K1238N507K1550M85m402o68N139j7567J859p62M696R758N631
$$ plain form
11648 36996 36519 46598 40547 29493 7215 -12804 -14412 -10200 -6973 2897 12744 18273 32595
11635 32595 42179 47192 38334 36483 29113 44968 46601 31052 3216 -16153 -7332 1422 -14685
11622 -14685 -20459 -17909 -17064 4156 18094 3350 8248 24927 35298 31380 15399 -3500 6582
11609 6582 28926 31816 21295 18558 24708 35756 8365 -16411 -20750 -523 -11057 -6528 -12426
11596 -12426 -2102 10255 25808 33080 26323 12481 -2200 -23969 632 30564 23146 2360
11584 2360 3696 16168 25139 31876 25820 21166 7691 994 3431 11613 7725 -14100 768 8712
11570 8712 17915 15860 6398 4190 15283 29765 14593 2912 -4152 -10396 -15649 -39727 -36498
11557 -36498 -14008 -1465 12034 29552 24039 27452 24905 4128 -4532 -13915 -4629 11310 17152
$$ packed form
11648C6996m77J0079o051j1054k2278k0019j608M212L227R870R847N529J4322
11635C2595R584N013q858j851p370J5855J633j5549k7836j9369Q821Q754j6107
11622a4685n774K550Q45K1220J3938j4744M898J6679J0371l918j5981j8899J0082
11609F582K2344K890j0521k737O150J1048k7391k4776m339K0227j0534M529n898
11596a2426J0324J2357J5553P272o757j3842j4681k1769K4601K9932p418k0786
11584B360J336J2472Q971O737o056m654j3475o697K437Q182l888k1825J4868P944
11570H712R203k055r462k208J1093J4482j5172j1681p064o244n253k4078L229
11557c6498K2490J2543J3499J7518n513L413k547k0777q660r383R286J5939N842
$$ plain form
11544 17152 26589 19374 2706 1970 6254 -5698 6099 19759 35122 32219 25495 14235 802
11531 802 -14780 -30436 -26239 -1821 13296 24377 34342 21097 14184 31194 16555 -4145 8124
11518 8124 25083 29562 16466 -2769 -208 199 6888 15627 11162 21183 22415 14175 -12447 -22192
11504 -22192 -15577 -2135 -9185 4623 -16516 -21275 -24925 -33180 -40170 -27661 -9288 -11221 -8831
11491 -8831 -20053 -12056 10263 11276 26130 30898 19346 9089 15667 29623 16994 18251 16008
11478 16008 27912 38393 38572 37821 52492 47970 29560 21824 19954 -1358 -9131 1361 -8795
11465 -8795 -10274 8298 20775 18726 -12941 -25483 -15737 0 13687 8001 25215 25444 6599
11452 6599 16389 35369 33252 13345 1069 8939 676 -5247 19246 15140 25640 30077 27389
$$ packed form
11544A7152R437p215j6668p36M284j1952J1797J3660J5363k903o724j1260j3433
11531H02j5582j5656M197K4418J5117J1081R965j3245o913J7010j4639k0700J2269
11518H124J6959M479j3096j9235K561M07O689Q739m465J0021J232q240k6622r745
11504b2192O615J3442p050J3808k1139m759l650q255o990J2509J8373j933K390
11491h831j1222P997K2319J013J4854M768j1552j0257O578J3956j2629J257k243
11478A6008J1904J0481J79p51J4671m522j8410p736j870k1312p773J0492j0156
11465h795j479J8572J2477k049l1667j2542R746J5737J3687n686J7214K29j8845
11452F599R790J8980k117j9907j2276P870q263n923K4493m106J0500M437k688
$$ plain form
11439 27389 30204 29769 13243 11515 -7821 -15109 2950 19026 10179 11745 14838 13403 14018 17437
11425 17437 29441 27739 27433 35152 26571 13175 -2909 3251 1701 -5828 1345 21458 18768 22602
11411 22602 30303 44384 35486 27106 46626 48974 30701 23883 16125 22503 40531 49440 44564
11398 44564 38458 52504 39073 1474 -606 -6074 13699 12667 -4421 12071 53636 63129 38858
11385 38858 21061 15717 428 3858 25384 39369 52863 40297 34920 21206 -4612 -30020
11373 -30020 -15431 -5025 7975 8237 7033 21077 20667 14878 23898 39312 38368 39372 17899 12762
11359 12762 6377 -14691 -4782 -6193 4806 7736 20690 32167 22616 7396 -5835 -20681 -32729
11346 -32729 -26849 -7188 -2030 -5917 -12507 -18862 -14330 8879 29244 13447 11082 20898 32826
$$ packed form
11439B7389K815m35j6526j728j9336p288J8059J6076q847J566L093j435O15L419
11425A7437J2004j702l06P719q581j3396j6084O160j550p529P173K0113k690L834
11411B2602P701J4081q898q380J9520K348j8273o818p758O378J8028Q909m876
11398D4564o106J4046j3431l7599k080n468J9773j032j7088J6492M1565R493k4271
11385C8858j7797n344j5289L430K1526J3985J3494j2566n377j3714k5818k5408
11373c0020J4589J0406J3000K62j204J4044m10n789R020J5414r44J004k1473n137
11359A2762o385k1068R909j411J0999K930J2954J1477r551j5220j3231j4846j2048
11346c2729N880J9661N158l887o590o355M532K3209K0365j5797k365R816J1928
$$ plain form
11333 32826 19359 30706 29034 18255 23436 25554 6608 -8399 -573 6438 18250 22723 32720
11320 32720 23800 18807 32107 41688 38728 45081 51486 48543 52933 75193 77940 69629 91272 119129
11306 119129 116197 106369 85229 65125 46400 37397 19575 15922 23422 20769 29613 42933 23826
11293 23826 22381 44929 45596 36823 43994 62266 56784 36969 39340 28560 18438 35673 41975
11280 41975 31062 52267 59130 55820 33165 35872 18651 17591 27853 23840 31145 41384 32203
11267 32203 8487 18889 33739 33043 6481 -11527 -5777 -2025 3555 -1765 13288 15697 16444
11254 16444 19517 19786 28952 54177 82462 70364 57792 59196 49593 63153 106854 127902 114038
11241 114038 98201 95955 61782 28368 11056 8143 4488 -7124 -1634 2825 27074 50732
$$ packed form
11333C2826j3467J1347j672j0779N181K118j8946j5007P826P011J1812M473R997
11320C2720q920m993J3300R581k960O353O405k943M390K2260K747q311K1643K7857
11306A19129k932r828k1140k0104j8725r003j7822l653P500k653Q844J3320j9107
11293B3826j445K2548O67q773P171J8272n482j9815K371j0780j0122J7235O302
11280D1975j0913K1205O863l310k2655K707j7221j060J0262m013P305J0239r181
11267C2203k3716J0402J4850o96k6562j8008N750L752N580n320J5053K409P47
11254A6444L073K69R166K5225K8285j2098j2572J404r603J3560M3701K1048j3864
11241A14038j5837k246l4173l3414j7312k913l655j1612N490M459K4249K3658
$$ plain form
11229 50732 49129 26946 7027 15675 6429 10786 28018 31867 22002 23173 10889 -7048 -13709
11216 -13709 -4341 18390 -4088 -14999 -9299 -2755 -8496 963 -323 -6326 449 4844 -1520 14474
11202 14474 50328 86439 81159 42960 35806 35811 29235 22071 22009 32552 39975 38195 37178 22313
11188 22313 40517 41036 52234 56181 54440 47330 17534 14910 14174 16470 39913 43627 41209 31721
11174 31721 58842 65468 62731 71433 76213 66690 52395 28484 15755 -4700 -8378 -4506 -6811
11161 -6811 480 28147 21260 10879 27473 28440 41682 45413 63526 68503 41348 13694 6455
11148 6455 17463 35678 45357 43054 37010 38606 45896 53330 42605 31587 39329 51557 41627
11135 41627 32199 20887 23732 27681 26372 24560 10650 15502 15488 24951 16743 7511 21711 30723
$$ packed form
11229E0732j603k2183j9919Q648r246M357J7232L849r865J171j2284j7937o661
11216a3709R368K2731k2478j0911N700O544n741R459j286o003O775M395o364J5994
11202A4474L5854L6111n280l8199p154No576p164o2J0543P423j780j017j4865
11188B2313J8204N19J1198L947j741p110k9796k624p36K296K3443L714k418r488
11174C1721K7121O626k737Q702M780r523j4295k3911j2729k0455l678L872k305
11161f811P291K7667o887j0381J6594R67J3242L731J8113M977k7155k7654p239
11148F455J1008J8215R679k303o044J596P290P434j0725j1018P742J2228r930
11135D1627r428j1312K845L949j309j812j3910M852j4R463q208r232J4200R012
$$ plain form
11121 30723 42014 42349 52877 55199 51339 56886 51365 48267 85786 97719 78357 63460 45276
11108 45276 33196 38153 44723 50737 39636 27694 31945 64211 63166 48565 46209 41378 36651
11095 36651 25769 16769 22546 37726 24753 7755 1093 2818 8035 5220 1588 -3748 19151
11082 19151 49960 40324 43444 48121 42507 13627 12444 10400 16691 9449 7629 34091 55222
11069 55222 51473 34171 13409 10462 31139 40614 38787 31179 16240 -6333 -421 15514 37376
11056 37376 70372 66344 58175 39892 26165 42441 64279 42212 17896 25010 46677 51215
11044 51215 70316 66043 46203 37092 40161 50175 55320 50554 61309 74378 75443 76363 88389
11031 88389 81639 66186 67319 68272 56218 36235 43048 41830 39236 50273 39092 32684 42104
$$ packed form
11121C0723J1291L35J0528K322l860N547n521l098L7519J1933j9362j4897j8184
11108D5276j2080M957O570O014j1101j1942M251L2266j045j4601k356m831m727
11095C6651j0882r000N777J5180j2973j6998o662J725N217k815l632n336K2899
11082A9151L0809r636L120M677n614k8880j183k044O291p242j820K6462K1131
11069E5222l749j7302k0762k947K0677R475j827p608j4939k2573N912J5935K1862
11056C7376L2996m028q169j8283j3727J6276K1838k2067k4316P114K1667M538
11044E1215J9101m273j9840r111L069J0014N145m766J0755J3069J065R20J2026
11031H8389o750j5453J133R53j2054j9983O813j218k594J1037j1181o408R420
$$ plain form
11018 42104 50756 53312 54398 40491 47326 59225 57760 44918 43552 27281 34585 33042 21818
11005 21818 32074 30790 34837 30868 34925 51081 46482 47913 56603 65924 70761 67202 59403 39391
10991 39391 -6388 -4267 23141 43853 44542 46869 57915 72321 67674 67907 58541 64201 55082 42563
10977 42563 31292 37738 33207 31210 41993 42201 41475 49073 48827 52975 58468 38056 35389 66023
10963 66023 83153 66517 64572 66475 43428 18517 13589 17855 31715 43289 45808 36318 49661
10950 49661 43413 48854 56210 66423 72786 82079 69821 67310 86822 96815 93653 78711 60693
10937 60693 56328 58791 73452 85511 82377 81374 67029 50803 53065 65164 49133 46674 49448
10924 49448 39695 35172 27048 45434 49825 37868 54277 63740 52296 82644 101594 79902 58567
$$ packed form
11018D2104Q652K556J086j3907O835J1899j465j2842j366j6271P304j543j1224
11005B1818J0256j284M047l969M057J6156m599J431Q690R321M837l559p799k0012
10991C9391m5779K121K7408K0712O89K327J1046J4406m647K33r366N660r119j2519
10977D2563j1271O446m531j997J0783K08p26P598k46M148N493k0412k667L0634
10963F6023J7130j6636j945J903k3047k4911m928M266J3860J1574K519r490J3343
10950D9661o248N441P356J0213O363R293j2258k511J9512R993l162j4942j8018
10937F0693m365K463J4661J2059l134j003j4345j6226K262J2099j6031k459K774
10924D9448r753m523q124J8386M391j1957J6409R463j1444L0348J8950k1692k1335
$$ plain form
10911 58567 45826 42270 58180 73980 65802 56516 65197 68106 85133 80156 81488 81931 75955 92098
10897 92098 112468 113639 105404 88455 68093 48947 41431 50143 58302 55720 65546 56876 57273 63102
10883 63102 42323 39750 62625 50031 51125 61157 54639 41364 59932 98585 125977 118768
10871 118768 115851 144659 156036 140717 129590 130589 145030 145932 131898 113353 105785 120576 122220
10858 122220 115088 130808 144774 173220 199457 225349 258432 331500 450759 609235 853836
10847 853836 1239498 1722579 2191877 2529198 2519044 2211477 1754752 1228791 815507 571266
10837 571266 427060 326113 251650 223665 189185 161999 140104 144873 123151 97277 103937
10826 103937 118210 119036 109519 84636 76821 77835 65959 92198 125392 125240 134679 115428 93973
$$ packed form
10911E8567j2741l556J5910J5800q178r286Q681K909J7027m977J332M43n976J6143
10897I2098K0370J171q235j6949k0362j9146p516Q712Q159k582R826q670L97N829
10883F3102k0779k573K2875j2594J094J0032o518j3275J8568L8653K7392p209
10871A18768k917K8808J1377j5319j1127R99J4441R02j4034j8545p568J4791J644
10858A22220p132J5720J3966K8446K6237K5892L3083P3068J19259J58476K44601
10847H53836L85662M83081M69298L37321j0154l07567m56725n25961m13284k44241
10837E71266j44206j00947p4463k7985l4480k7186k1895M769k1722k5874O660
10826A03937J4273Q26r517k4883p815J014j1876K6239L3194j52R439j9251k1455
$$ plain form
10813 93973 86935 87603 100528 109490 101325 93710 103966 92917 86009 63868 27609 31755 78597
10800 78597 87827 89463 97577 100876 98913 83215 65823 50398 36098 36581 53924 83748 97375
10787 97375 97035 79955 61938 53225 41625 28581 47194 55484 56884 61189 55245 61058 80024
10774 80024 87681 83687 73006 67682 52327 57533 79421 98618 91651 71819 59192 39744 41146
10761 41146 79410 88452 102154 118444 120583 115052 112917 96799 92968 92539 99697 120372 161073
10748 161073 187213 177090 170506 134396 102552 25805 -32083 -29168 -14229 -23017 9310 20311
10736 20311 22150 31081 32357 25920 46120 52968 48157 68316 79320 54385 60907 64332 86012
10723 86012 75721 64075 73100 74161 75301 80271 84072 103961 104382 125094 157639 181595 195424
$$ packed form
10813I3973p038O68J2925Q962q165p615J0256j1049o908k2141l6259M146M6842
10800G8597R230J636Q114L299j963j5698j7392j5425j4300M83J7343K9824J3627
10787I7375l40j7080j8017q713j1600j3044J8613Q290J400M305n944N813J8966
10774H0024P657l994j0681n324j5355N206K1888J9197o967j9832j2627j9448J402
10761D1146L8264R042J3702J6290K139n531k135j6118l831m29P158K0675M0701
10748A61073K6140j0123o584l6110l1844p6747n7888K915J4939q788L2327J1001
10736B0311J839Q931J276o437K0200O848m811K0159J1004k4935O522L425K1680
10723H6012j0291j1646R025J061J140M970L801J9889M21K0712L2545K3956J3829
$$ plain form
10710 195424 194955 183628 170027 169445 172681 152179 129537 126250 128369 134643 141839 143089 152251 154377
10696 154377 152847 176465 217395 233650 269368 318007 383999 415758 421042 381055 360354 307832
10684 307832 251260 204536 174043 188735 199754 203344 192879 182333 170238 162020 162869 178606
10672 178606 162124 164363 155061 158775 174898 167540 149040 149704 171488 180088 169172 166908 167584
10659 167584 163800 142585 132092 121311 116633 125646 134929 136503 132250 151941 169304 194395 226947
10646 226947 218569 197829 183255 167582 162034 166504 179910 203188 204628 196907 204601 205531 217440
10633 217440 262175 297897 318049 389072 456389 538946 629359 705267 852926 1084000 1435654
10622 1435654 2029427 2932459 4043676 5020637 5654765 5825570 5557369 5062679 4468704
$$ packed form
10710A95424m69j1327j3601n82L236k0502k2642l287K119O274P196J250R162K126
10696A54377j530K3618M0930J6255L5718M8639O5992L1759N284l9987k0701n2522
10684C07832n6572m6724l0493J4692J1019L590j0465j0546j2095q218Q49J5737
10672A78606j6482K239r302L714J6123p358j8500O64K1784Q600j0916k264O76
10659A67584l784k1215j0493j0781m678R013R283J574m253J9691J7363K5091L2552
10646B26947q378k0740j4574j5673n548M470J3406K3278J440p721P694R30J1909
10633B17440M4735L5722K0152P1023O7317Q2557R0413P5908J47659K31074L51654
10622A435654N93773R03032J111217R76961O34128J70805k68201m94690n93975
$$ plain form
10613 4468704 3667817 2887763 2397548 2096823 1804377 1449745 1114501 864162 706804
10604 706804 606692 558132 522396 494173 490656 488278 477996 478056 491646 513129 521784 529506 556077
10591 556077 530176 494991 478575 452114 418941 412269 401886 405189 397096 411908 423599 444540
10579 444540 490856 535183 579171 622116 660421 735999 829466 971801 1180794 1448179 1713451
10568 1713451 1905316 2014191 2094179 2204570 2354946 2529430 2572854 2430206 2259048 2102347
10558 2102347 2010930 1952443 1857241 1568372 1146393 830039 672559 566130 507148 489753
10548 489753 483530 478203 475242 477790 473663 472774 488711 497390 501845 490136 492281 491777 476619 480435
10534 480435 495349 491442 486594 494469 526062 558761 608257 638220 629923 660922 663993 650082
$$ packed form
10613D468704q00887p80054m90215l00725k92446l54632l35244k50339j57358
10604G06804j00112m8560l5736k8223l517k378j0282O0J3590K1483Q655P722K6571
10591E56077k5901l5185j6416k6461l3173o672j0383L303q093J4812J1691K0941
10579D44540M6316M4327M3988M2945L8305P5578R3467J42335K08993K67385K65272
10568A713451J91865J08875P9988J10391J50376J74484M3424j42648j71158j56701
10558B102347r1417n8487r5202k88869m21979l16354j57480j06429n8982j7395
10548D89753o223n327k961K548m127q89J5937Q679M455j1709K145n04j5158L816
10534D80435J4914l907m848P875L1593L2699M9496K9963q297L0999L071j3911
$$ plain form
10522 650082 703380 790512 869467 1000556 1185041 1446554 1840742 2263090 2570307 2714780
10512 2714780 2661069 2577062 2626095 2701707 2658162 2396834 1967347 1561365 1308889 1175432
10502 1175432 1105770 1066355 1023818 1014793 1015169 1017508 1031963 1067435 1088538 1109371 1160181 1199337
10490 1199337 1231241 1258409 1260481 1254820 1257610 1281236 1328390 1400730 1463844 1512651 1586393 1657361
10478 1657361 1725989 1784672 1884426 1994520 2080909 2142772 2223064 2324721 2455075 2654960
10468 2654960 2854526 3056282 3312976 3592404 3882612 4211963 4609179 5133187 5834573
10459 5834573 6734629 7729275 8673643 9437919 9927005 10271148 10622929 11182286 12153780
10450 12153780 13706277 15901105 18776941 22329741 26597684 31735902 38192097 47134979
$$ packed form
10522F50082N3298Q7132P8955J31089J84485K61513L94188M22348L07217J44473
10512B714780n3711q4007M9033P5612m3545k61328m29487m05982k52476j33457
10502A175432o9662l9415m2537r025L76K339J4455L5472K1103K0833N0810L9156
10490A199337L1904K7168K072n661K790K3626M7154P2340O3114M8807P3742P0968
10478A657361O8628N8683R9754J10094Q6389O1863Q0292J01657J30354J99885
10468B654960J99566K01756K56694K79428K90208L29351L97216N24008P01386
10459E834573R00056R94646R44368P64276M89086L44143L51781N59357R71494
10450A2153780J552497K194828K875836L552800M267943N138218O456195Q942882
$$ plain form
10442 47134979 60567499 82047131 118066076 177012597 259752194 346284461 419813568
10435 419813568 453278306 424871765 358275903 268173200 177300984 112397836 74590175
10428 74590175 53365510 40709855 32627015 27048628 22722596 19190047 16231618 13698597
10420 13698597 11704888 10197218 9050123 8208720 7648543 7338096 7143596 6940475 6578696
10411 6578696 6004039 5308412 4584147 3919248 3449370 3129405 2884065 2700098 2538887
10402 2538887 2389303 2271769 2146143 2021776 1883214 1751535 1621471 1509629 1427642 1351880
10392 1351880 1285986 1246323 1192587 1149981 1082171 1016620 984189 959828 903065 832802 765721
10381 765721 713641 674614 649558 642952 672342 685514 684327 657417 630300 617005 601947 593421
$$ packed form
10442D7134979J3432520K1479632L6018945N8946521Q2739597Q6532267P3529107
10435D19813568L3464738k8406541o6595862r0102703r0872216o4903148l7807661
10428G4590175k1224665j2655655q082840n578387m326032l532549k958429k533021
10420A3698597j993709j507670j147095q41403n60177l10447j94500k03121l61779
10411F578696n74657o95627p24265o64899m69878l19965k45340j83967j61211
10402B538887j49584j17534j25626j24367j38562j31679j30064j11842q1987p5762
10392A351880o5894l9663n3736m2606o7810o5551l2431k4361n6763p0263o7081
10381G65721n2080l9027k5056o606K9390J3172j187k6910k7117j3295j5058q526
$$ plain form
10369 593421 593832 609886 614964 626736 659606 689399 705611 681924 641286 581276 520628 464492
10357 464492 438025 413920 383116 365962 354415 343816 327438 327250 319471 310460 300758 314673
10345 314673 327393 336373 335951 324734 307036 299584 273433 287324 317523 296597 254011 232546
10333 232546 222421 207731 182907 180823 196632 193807 185318 187100 199562 205162 219408 252982
10321 252982 287408 325525 336149 342824 334956 344705 350796 330655 362591 459610 526455 551775
10309 551775 584675 532623 472507 376147 279491 249296 235773 230569 224228 225874 233315 241978
10297 241978 253847 305477 343662 403332 494843 581178 611065 558653 487889 484570 538016 573372
10285 573372 579893 513206 385801 291671 229075 162370 110251 68154 59215 49458 55368 69907
$$ packed form
10369E93421M11J6054N078J1772L2870K9793J6212k3687m0638o0010o0648n6136
10357D64492k6467k4105l0804j7154j1547j0599j6378j88p779r011r702J3915
10345C14673J2720Q980m22j1217j7698p452k6151J3891L0199k0926m2586k1465
10333B32546j0125j4690k4824k084J5809k825q489J782J2462N600J4246L3574
10321B52982L4426L8117J0624O675p868R749O091k0141L1936R7019O6845K5320
10309E51775L2900n2052o0116r6360r6656l0195j3523n204o341J646P441Q663
10297B41978J1869N1630L8185N9670R1511Q6335K9887n2412p0764l319N3446L5356
10285E73372O521o6687j27405r4130o2596o6705n2119m2097q939r757N910J4539
$$ plain form
10273 69907 90033 103517 144533 178530 230720 279150 299593 331199 353583 358482 380741 376037
10261 376037 377938 389065 408196 433609 500278 584221 646164 679678 717410 840816 1082091
10250 1082091 1406927 1772384 2151238 2445045 2588572 2546525 2357392 2117338 1867117 1606764
10240 1606764 1400086 1247316 1131869 1011280 930690 844339 715546 639244 627680 612662
10230 612662 567399 515972 460456 394144 347023 303242 260025 247233 233638 210588 181828
10219 181828 176111 178432 180106 170544 181317 190425 198182 211417 218217 233776 268293 305113 350874
10206 350874 396205 472010 595967 724350 828011 971917 1157889 1357174 1526935 1619805
10196 1619805 1606019 1508703 1397357 1317696 1233992 1137929 1044498 980862 962190 929008 890835
$$ packed form
10273F9907K0126J3484M1016L3997N2190M8430K0443L1606K2384M899K2259m704
10261C76037J901J1127J9131K5413O6669Q3943O1943L3514L7732J23406K41275
10250A082091L24836L65457L78854K93807J43527m2047j89133k40054k50221k60353
10240A606764k06678j52770j15447j20589q0590q6351j28793p6302j1564j5018
10230F12662m5263n1427n5516o6312m7121m3781m3217j2792j3595k3050k8760
10219A81828n717K321J674r562J0773R108P757J3235O800J5559L4517L6820M5761
10206C50874M5331P5805J23957J28383J03661J43906J85972J99285J69761R2870
10196A619805j3786r7316j11346p9661q3704r6063r3431o3636j8672l3182l8173
$$ plain form
10185 890835 804799 704360 629395 551255 495010 423999 320885 253127 215994 184336 164093
10174 164093 134620 127761 103552 123676 142121 133657 114732 141999 158377 144247 136836 145171
10162 145171 149602 160158 150087 162764 196732 248526 337874 430932 529218 609513 660664 721969
10150 721969 825400 914883 977947 1027528 1001056 931220 843089 732703 628333 524043 464554
10139 464554 486700 546134 561911 529424 445102 342696 278936 265642 269472 263950 249042 200326
10127 200326 159904 122693 80146 75706 56429 53799 45650 37620 48949 61763 52814 31228
10115 31228 27936 21581 25474 27768 26637 31050 47534 55737 74058 80922 106457 133041 166959
10102 166959 218607 283246 290220 236157 197581 175200 177122 218200 250457 238610 181852 128191
$$ packed form
10185H90835q6036j00439p4965p8140n6245p1011j03114o7758l7133l1658k0243
10174A64093k9473o859k4209K0124J8445q464j8925K7267J6378j4130p411Q335
10162A45171M431J0556j0071J2677L3968N1794Q9348R3058R8286Q0295N1151O1305
10150G21969J03431Q9483O3064M9581k6472o9836q8131j10386j04370j04290n9489
10139D64554K2146N9434J5777l2487q4322j02406o3760j3294L830n522j4908m8716
10127B00326m0422l7211m2547m440j9277k630q149q030J1329J2814q949k1586
10115C1228l292o355L893K294j131M413J6484Q203J8321O864K5535K6584L3918
10102A66959N1648O4639O974n4063l8576k2381J922M1078L2257j1847n6758n3661
$$ plain form
10090 128191 97360 71163 58380 48142 34443 35387 4095 3979 18883 25330 56688 61793 40262
10077 40262 25455 29757 25238 9447 -3591 15149 29076 27755 50824 47827 37347 19367
10065 19367 18486 30862 31577 15160 20399 7519 5444 20813 18165 18251 22575 37043 62632 51669
10051 51669 39343 30147 28340 50597 44480 31864 32246 42141 41394 62287 51777 17390 2510
10038 2510 14192 34570 67475 65145 92826 138003 142733 155952 198456 268250 348046 468949
10026 468949 640444 920739 1355409 1821839 2243756 2463972 2352394 2011625 1521294 1002057
10016 1002057 636360 434165 312035 236496 193960 150453 129127 117700 88154 73146 61911
10005 61911 35230 15636 13520 8074 21945 47272 35505 45377 44454 33786 46591 30631 2342
$$ packed form
10090A28191l0831k6197j2783j0238j3699R44l1292j16J4904O447L1358N105k1531
10077D0262j4807M302m519j5791j3038J8740J3927j321K3069k997j0480j7980
10065A9367q81J2376P15j6417N239j2880k075J5369k648Q6M324J4468K5589j0963
10051E1669j2326r196j807K2257o117j2616L82R895p47K0893j0510l4387j4880
10038B510J1682K0378L2905k330K7681M5177M730J3219M2504O9794P9796J20903
10026D68949J71495K80295M34670M66430M21917K20216j11578l40769m90331n19237
10016A002057l65697k02195j22130p5539m2536m3507k1326j1427k9546j5008j1235
10005F1911k6681j9594k116n446J3871K5327j1767R872r23j0668J2805j5960k8289
$$ plain form
9992 2342 -5466 -14251 -8009 -24496 -22102 -7475 -5233 3458 11981 38126 36682 3343 -5470 -3801
9978 -3801 2117 -1828 -16917 -58124 -54340 -46715 -46960 -33795 -20225 -10392 5548 24903 12662
9965 12662 3203 -1404 -11535 4585 32397 39926 59380 91374 127425 186682 205392 192881
9953 192881 157979 116206 64535 45199 26369 29857 15519 17211 41215 45469 26830 16568
9941 16568 -838 8896 7259 4161 -7061 4347 29678 24405 3938 3818 24955 47869 66663
9928 66663 86343 90083 83300 70112 51304 28684 31014 51020 41083 26604 24115 22000 17084
9915 17084 20603 32360 41660 57505 79723 76220 83322 88273 95641 120361 152484 207004 275851
9902 275851 389982 542065 742662 897842 939103 851644 664175 451945 300026 198710
$$ packed form
9992B342p808q785O242j6487K394J4627K242Q691Q523K6145j444l3339q813J669
9978c801N918l945j5089m1207L784P625k45J3165J3570R833J5940J9355j2241
9965A2662r459m607j0131J6120K7812P529J9454L1994L6051N9257J8710j2511
9953A92881l4902m1773n1671j9336j8830L488j4338J692K4004M254j8639j0262
9941A6568j7406R734j637l098j1222J1408K5331n273k0467j20K1137K2914J8794
9928F6663J9680L740o783j3188j8808k2620K330K0006r937j4479k489k115m916
9915A7084L519J1757R300J5845K2218l503P102M951P368K4720L2123N4520O8847
9902B75851J14131J52083K00597J55180M1261q7459j87469k12230j51919j01316
$$ plain form
9892 198710 146667 116919 87947 66873 54616 48845 61810 49211 29623 35885 43527 35924
9880 35924 37473 32015 36309 31706 41101 34511 56586 85834 88033 87447 84491 64354 33277 21669
9866 21669 9157 16335 8551 11955 -3157 -22071 -11448 -1850 1844 -2029 11159 15654 10749
9853 10749 18404 15086 14855 27691 40472 52074 64531 33690 19588 6566 45288 49325 34248
9840 34248 11503 23224 48487 77453 103738 125905 127552 106052 75512 65795 64766 67713 52848
9827 52848 46738 29528 19769 19841 13105 30758 22911 -1681 -19660 -10105 15676 8312 28089 33078
9813 33078 15762 13695 23015 4416 -12432 -17049 -12413 -28866 -28153 -11678 -1917 -6476 -3286 20444
9799 20444 29203 59240 70011 66936 64727 82546 100084 106144 102919 121995 130329 118542 91713
$$ packed form
9892A98710n2043k9748k8972k1074j2257n771J2965j2599j9588O262P642p603
9880C5924J549n458M294m603R395o590K2075K9248K199n86k956k0137l1077j1608
9866B1669j2512P178p784L404j5112j8914J0623R598L694l873J3188M495m905
9853A0749P655l318k31J2836J2781J1602J2457l0841j4102j3022L8722M037j5077
9840C4248k2745J1721K5263K8966K6285K2167J647k1500l0540r717j029K947j4865
9827E2848o110j7210r759P2o736J7653p847k4592j7979R555K5781p364J9777M989
9813C3078j7316k067R320j8599j6848m617M636j6453P13J6475R761m559L190K3730
9799B0444Q759L0037J0771l075k209J7819J7538O060l225J9076Q334j1787k6829
$$ plain form
9786 91713 78849 79367 68252 48886 36928 25385 11391 10585 30964 35893 40611 36944 35401
9773 35401 43612 47408 50283 36709 33456 37612 31089 28371 35111 8777 7585 3978 -6909 -14710
9759 -14710 -3783 3441 19959 35958 56107 54567 49094 59993 58333 53964 38356 41883 25601
9746 25601 12343 12708 20854 25685 39018 27317 14121 6621 4343 4718 -4872 -16207 -2712 2528
9732 2528 5928 29320 43577 32041 4962 21056 25134 39734 39707 20071 8693 28760 45779
9719 45779 64550 59946 30745 24353 23197 1359 782 -11497 -16206 12676 5130 -5495 9822
9706 9822 27139 36250 36762 22869 7533 6120 8967 706 -8342 -9009 2624 -5436 -11139 -25232
9692 -25232 -25270 -10346 -16536 -16112 -21195 -2130 23971 37667 22191 10993 19820 15297 15636 12606
$$ packed form
9786I1713j2864N18j1115j9366j1958j1543j3994q06K0379M929M718l667j543
9773C5401Q211L796K875j3574l253M156o523k718O740k6334j192l607j0887p801
9759a4710J0927P224J6518J5999K0149j540n473J0899j660m369j5608L527j6282
9746B5601j3258L65Q146M831J3333j1701j3196p500k278L75r590j1335J3495N240
9732B528L400K3392J4257j1536k7079J6094M078J4600k7j9636j1378K0067J7019
9719D5779J8771m604k9201o392j156k1838n77j2279m709K8882p546j0625J5317
9706I822J7317R111N12j3893j5336j413K847q261r048o67J1633q060n703j4093
9692b5232l8J4924o190M24n083J9065K6101J3696j5476j1198Q827m523L39l030
$$ plain form
9678 12606 -3059 -8838 -27152 -23101 -1671 -29107 -44071 -41843 -30315 15145 40989 26938
9666 26938 19641 22068 6404 -13685 -4519 10558 6686 17065 30274 15291 -3346 -12291 -16185
9653 -16185 -7473 -3891 -3111 1814 -7350 -8696 -7905 -10003 -7136 -7856 -8628 -7655 -12571 -13201 5616 -10389
9637 -10389 -11141 -618 -1435 5743 -458 -5989 -7563 -5197 -11358 7366 18056 28733 44057 14002
9623 14002 11748 29282 32328 25767 23807 31693 31631 41592 55628 46235 33839 15318 5982 -1389
9609 -1389 -7584 1554 16054 6488 9872 -15986 -16416 -9104 -2948 14209 36843 34213 19894 29705
9595 29705 21439 918 -5147 -5384 -18227 -14333 -25000 -15744 -14816 -1954 6301 -3672 -16913 -15130
9581 -15130 -22317 -16823 -10408 8130 7160 21404 26421 10535 30084 53160 50482 32728 35463
$$ packed form
9678A2606j5665n779j8314M051K1430k7436j4964K228J1528M5460K5844j4051
9666B6938p297K427j5664k0089R166J5077l872J0379J3209j4983j8637q945l894
9653a6185Q712L582P80M925r164j346P91k098K867p20p72R73m916o30J8817j6005
9637a0389p52J0523q17P178o201n531j574K366o161J8724J0690J0677J5324l0055
9623A4002k254J7534L046o561j960P886o2R961J4036r393j2396j8521r336p371
9609a389o195R138J4500r566L384k5858m30P312O156J7157K2634k630j4319R811
9595B9705q266k0521o065k37j2843L894j0667R256R28J2862Q255r973j3241J783
9581a5130p187N494O415J8538r70J4244N017j5886J9549K3076k678j7754K735
$$ plain form
9568 35463 23993 21528 27862 18912 -1710 -13112 -12176 13576 27700 31107 28757 33556 22783
9555 22783 -3159 3691 2110 -4103 -12711 -10797 4400 -2356 11629 25134 17122 14324 16469 16862
9541 16862 29436 26199 25502 7574 9155 19924 22150 17234 14194 26590 48298 59508 67926
9528 67926 59044 34409 23407 18252 9562 -3120 -3980 -786 -16 14042 18760 26487 34606 24577
9514 24577 39687 32357 18081 734 2626 9355 19058 17194 13960 15201 8354 -10439 -6035 985
9500 985 13967 14461 10841 21278 28428 29999 35466 26864 22184 19445 16828 26380 22876 -9983 -25800
9485 -25800 -40243 -54613 -40092 -29340 -15144 -5103 -871 34722 24350 23664 16504 22768 38772
9472 38772 26620 34109 13474 -4091 122 17552 19282 -1647 -2636 -170 21651 28698 23718
$$ packed form
9568C5463j1470k465O334q950k0622j1402R36K5752J4124L407k350M799j0773
9555B2783k5942O850j581o213q608J914J5197o756J3985J3505q012k798K145L93
9541A6862J2574l237o97j7928J581J0769K226m916l040J2396K1708J1210Q418
9528F7926q882k4635j1002n155q690j2682q60L194P70J4058M718P727Q119j0029
9514B4577J5110p330j4276j7347J892O729R703j864l234J241o847j8793M404P020
9500I85J2982M94l620J0437P150J571N467q602m680k739k617R552l504l2859j5817
9485b5800j4443j4370J4521J0752J4196J0041M232L5593j0372o86p160O264J6004
9472C8772j2152P489k0635j7565M213J7430J730k0929r89K466K1821P047m980
$$ plain form
9459 23718 32577 29811 17217 9775 -11249 -8634 1525 -6723 -9990 6097 5950 -12854 -14165 -11884
9445 -11884 12528 25557 21880 15057 -7404 -18222 -26353 -8657 7797 -3542 -372 11163 -5980
9432 -5980 -11799 -1801 747 14777 -45 -6503 -8070 -10596 -16045 -17287 -11542 5034 9993 14635
9418 14635 23737 33888 36545 56203 50479 47913 42831 31907 38166 25644 2553 6780 36226
9405 36226 28436 16158 1678 -24602 -15257 -9092 -10457 -24679 -13425 7146 20559 13018 -7947
9392 -7947 -6030 -20748 -32074 -6872 16098 2148 17279 19552 24063 21892 20180 15277 3435
9379 3435 -6079 -11191 -20037 -15259 -3599 20316 29847 20173 24407 30210 33102 9937 18290 31771
9365 31771 28377 13180 -3372 2246 22540 18161 2878 2116 12678 38196 51603 37170 11248
$$ packed form
9459B3718Q859k766j2594p442k1024K615J0159q248l267J6087j47j8804j311K281
9445a1884K4412J3029l677o823k2461j0818q131J7696J6454j1339L170J1535j7143
9432e980n819R998K548J4030j4822o458j567k526n449j242N745J6576M959M642
9418A4635R102J0151K657J9658n724k566n082j0924O259j2522k3091M227K9446
9405C6226p790j2278j4480k6280R345O165j365j4222J1254K0571J3413p541k0965
9392g947J917j4718j1326K5202K2970j3950J5131K273M511k171j712m903j1842
9379C435r514n112q846M778J1660K3915R531r674M234N803K892k3165Q353J3481
9365C1771l394j5197j6552N618K0294m379j5283p62J0562K5518J3407j4433k5922
$$ plain form
9352 11248 -362 -7261 2245 -1268 1332 -4458 9509 10698 -4747 -8022 -3041 8883 19742
9339 19742 21853 37550 47095 35513 37620 38329 41072 44045 43686 42207 32633 22588 14149 26119
9325 26119 33543 31786 13258 11978 26391 22904 19281 14072 -1624 -5536 15452 29318 34535
9312 34535 29398 25141 31912 38398 19077 8700 12514 -6511 -19839 4924 31009 21249 7299
9299 7299 17949 19761 24086 16086 -1526 5847 19475 47601 59025 57909 60711 71974 69039
9286 69039 59984 61139 52684 33035 16507 8913 24855 26512 33339 32113 20214 30954 34410
9273 34410 16825 8265 2748 -4242 -3635 9541 13252 18951 34281 46013 40107 39838 50506 53309
9259 53309 35989 22877 48598 47746 33480 42037 53344 53956 60372 54935 51422 49866 58091 64939
$$ packed form
9352A1248j1610o899R506l513K600n790J3967J189j5445l275M981J1924J0859
9339A9742K111J5697R545j1582K107P09K743K973l59j479r574j0045q439J1970
9325B6119P424j757j8528j280J4413l487l623n209j5696l912K0988J3866N217
9312C4535n137m257O771O486j9321j0377L814j9025j3328K4763K6085r760j3950
9299G299J0650J812M325q000j7612P373J3628K8126J1424j116K802J1263k935
9286F9039r055J155q455j9649j6528p594J5942J657O827j226j1899J0740L456
9273C4410j7585q560n517o990O07J3176L711N699J5330J1732n906k69J0668K803
9259E3309j7320j3112K5721q52j4266Q557J1307O12O416n437l513j556Q225O848
$$ plain form
9245 64939 58997 49835 33162 32240 39328 43714 43650 61578 72181 63708 46622 59845 66962 67102
9231 67102 67667 45387 26858 38998 57647 74168 89729 95817 96484 78895 72510 71196 66290
9218 66290 65003 71949 64745 71023 73887 70095 62962 52000 55374 48713 43667 55716 65757 68090
9204 68090 82801 97257 122438 155297 149306 128007 136460 116163 128214 151672 160190 148729
9192 148729 134862 144179 166500 174489 177293 191721 198861 216349 232213 263713 292257 301429 313742
9179 313742 339032 394300 410722 442810 458568 466205 493649 555119 609601 671528 758295 858591
9167 858591 968325 1109741 1282268 1509273 1795012 2195540 2719363 3434342 4494902 6048036
9157 6048036 8397893 11863721 16342732 20620216 23003697 22479628 18895453 13884590
$$ packed form
9245F4939n942r162j6673r22P088M386o4J7928J0603q473j7086J3223P117J40
9231F7102N65k2280j8529J2140J8649J6521J5561O088O67j7589o385j314m906
9218F6290j287O946p204O278K864l792p133j0962L374o661n046J2049J0041K333
9204F8090J4711J4456K5181L2859n991k1299Q453k0297J2051K3458Q518j1461
9192A48729j3867R317K2321P989K804J4428P140J7488J5864L1500K8544R172J2313
9179C13742K5290N5268J6422L2088J5758P637K7444O1470N4482O1927Q6767J00296
9167H58591J09734J41416J72527K27005K85739M00528N23823P14979J060560J553134
9157F048036K349857L465828M479011M277484K383481n24069l584175n010863
$$ plain form
9149 13884590 9538679 6576492 4702496 3515165 2738390 2179472 1779245 1487390 1266314
9140 1266314 1095201 952262 827897 717608 638477 567995 510483 460398 427996 394690 351479
9129 351479 341060 321614 298124 267752 246536 226987 222236 199853 182053 174157 177194 164091
9117 164091 164199 177814 168701 155961 146755 159153 149852 120363 120932 133160 125881 145337 148894
9104 148894 146958 141587 122860 101004 90939 125063 129058 133315 115974 80951 75127 72695 73554
9091 73554 92053 95440 76600 62122 63976 82788 99582 77054 66653 89055 94463 104468
9079 104468 90390 57037 60114 69977 54491 64930 91319 102083 91840 72252 57860 53265
9067 53265 44193 42628 43859 50607 61660 47994 57156 61691 62290 62746 62500 79896 79279 69363 73910
$$ packed form
9149A3884590m345911k962187j873996j187331p76775n58918m00227k91855k21076
9140A266314j71113j42939j24365j10289p9131p0482n7512n0085l2402l3306m3211
9129C51479j0419j9446k3490l0372k1216j9549m751k2383j7800p896L037j3103
9117A64091J08J3615r113j2740r206J2398r301k9489N69J2228p279J9456L557
9104A48894j936n371j8727k1856j0065L4124L995M257j7341l5023n824k432Q59
9091G3554J8499L387j8840j4478J854J8812J6794k2528j0401K2402N408J0005
9079A04468j4078l3353L077R863j5486J0439K6389J0764j0243j9588j4392m595
9067E3265r072j565J231O748J1053j3666R162M535N99M56k46J7396o17r916M547
$$ plain form
9052 73910 77771 78239 62718 74390 88196 82756 79583 74340 70109 79389 98975 113934 114107 104166
9038 104166 100306 78002 90383 92800 88577 111144 93535 75830 82134 92180 93808 100772 101724
9025 101724 73096 68088 57926 53967 83765 94948 104771 117370 119458 126782 125480 126106 113097
9012 113097 99591 78419 42400 15545 20542 35517 51975 63573 71963 74070 79418 84019 94632
8999 94632 75889 62091 72260 55091 54190 61134 61511 60202 35731 21067 8807 10472 10511 -1260
8985 -1260 11814 45321 38883 31849 18250 17449 50510 82490 75289 50240 48017 63167 67248
8972 67248 56003 24036 4490 13576 13755 7444 19583 35843 46194 40054 45822 32413 31354
8959 31354 7683 15162 20419 45832 62442 66543 81829 93570 85218 73711 63280 69272 71513
$$ packed form
9052G3910L861M68j5521J1672J3806n440l173n243m231R280J9586J4959J73r941
9038A04166l860k2304J2381K417m223K2567j7609j7705O304J0046J628O964R52
9025A01724k8628n008j0162l959K9798J1183R823J2599K088P324j302O26j3009
9012A13097j3506k1172l6019k6855M997J4975J6458J1598Q390K107N348M601J0613
8999I4632j8743j3798J0169j7169r01O944L77j309k4471j4664j2260J665L9j1771
8985a260J3074L3507o438p034j3599q01L3061L1980p201k5049k223J5150M081
8972F7248j1245l1967j9546R086J79o311J2139J6260J0351o140N768j3409j059
8959C1354k3671P479N257K5413J6610M101J5286J1741q352j1507j0431N992K241
$$ plain form
8946 71513 43406 21344 16075 24895 18716 18361 49167 71274 65480 41546 38433 34238 17507
8933 17507 35028 42485 28872 24039 18377 12942 10875 14476 33181 34268 32974 28643 22837 9807
8919 9807 -7341 -5710 -18022 13382 38742 49197 58070 36880 22511 5038 17919 45901
8907 45901 65667 38408 5150 20003 25811 22744 15720 24753 39739 37105 20058 15718 6547
8894 6547 -5582 3735 17042 8271 844 3248 -3073 -12818 -14868 -4462 -5162 2717 12818 27939
8880 27939 47891 33338 29839 21480 26465 20796 38185 62243 93072 121027 92407 60989 45649
8867 45649 37529 4277 -5609 -114 9362 17497 23078 23561 40102 55771 60662 40204 15038 7329
8853 7329 8736 -8779 -17441 -17420 11264 40809 35573 22851 12867 7767 24840 23964 19701 26892
$$ packed form
8946G1513k8107k2062n269Q820o179l55L0806K2107n794k3934l113m195j6731
8933A7507J7521P457j3613m833n662n435k067L601J8705J087j294m331n806j3030
8919I807j7148J631j2312L1404K5360J0455Q873k1190j4369j7473J2881K7982
8907D5901J9766k7259l3258J4853N808l067p024R033J4986k634j7047m340r171
8894F547j2129R317J3307q771p427K404o321r745k050J0406p00P879J0101J5121
8880B7939J9952j4553l499q359M985n669J7389K4058L0829K7955k8620l1418j5340
8867D5649q120l3252r886N495R476Q135N581M83J6541J5669M891k0458k5166p709
8853G329J407j7515q662K1K8684K9545n236j2722r984n100J7073q76m263P191
$$ plain form
8839 26892 45953 34379 23146 16072 12569 7062 -1821 23114 18655 22359 44177 82930 123151
8826 123151 153499 177695 173970 149918 117430 56617 26635 13384 11367 8103 -5736 -5746 14674
8813 14674 35798 40898 52199 43781 33232 43856 21693 6082 23897 31097 25061 11045 -6945
8800 -6945 -16382 2350 31289 34944 15271 15404 31578 23377 18489 30275 29070 28576 20643 32965
8786 32965 32462 24112 30962 34408 72615 90778 108310 111809 110066 73888 36502 12719 14572
8773 14572 20808 20569 17960 4986 -5412 7286 16754 24972 29472 21955 10057 -5223 -6012 -5365
8759 -5365 -18699 -12257 12416 7991 8599 9186 10618 14789 5755 4867 35298 21628 2416 -17776
8745 -17776 -11517 8948 16304 14110 8375 -6961 -20816 -42716 -12360 5160 -2090 22137 60353
$$ packed form
8839B6892J9061j1574j1233p074l503n507q883K4935m459L704K1818L8753M0221
8826A23151L0348K4196l725k4052l2488o0813k9982j3251k017l264j3839j0K0420
8813A4674K1124N100J1301q418j0549J0624k2163j5611J7815P200o036j4016j7990
8800f945r437J8732K8939L655j9673J33J6174q201m888J1786j205m94p933J2322
8786C2965n03q350O850L446L8207J8163J7532L499j743l6178l7386k3783J853
8773A4572O236k39k609j2974j0398J2698R468Q218M500p517j1898j5280p89O47
8759e365j3334O442K4673m425O08N87J432M171r034q88L0431j3670j9212k0192
8745a7776O259K0465P356k194n735j5336j3855k1900L0356J7520p250K4227L8216
$$ plain form
8732 60353 66469 51596 19383 7578 15617 22244 -1608 -8679 -27119 -41814 -17463 5450 -882
8719 -882 -6915 16360 45797 40424 36139 29421 38845 40632 26011 17599 12418 19479 47361 39700
8705 39700 33334 42571 63013 62866 56579 52069 34699 26740 54514 58769 55048 47125 48939 46117
8691 46117 34202 27449 22596 16775 1241 6631 18695 6798 18641 20733 37074 75319 104889
8678 104889 145504 168405 171224 160478 99671 70657 60794 60751 37508 13469 11567 16571 17435
8665 17435 37999 35354 42534 50949 54394 45958 44402 28832 6159 -8310 -8219 -7240 27459 25551
8651 25551 20473 45948 43933 46490 64984 66077 58665 65676 79931 82299 76593 80617 92145 97626
8637 97626 114182 144813 203281 255886 316308 379055 393204 355879 285344 191141 118147 99034
$$ packed form
8732F0353O116j4873l2213j1805Q039O627k3852p071j8440j4695K4351K2913o332
8719h82o033K3275K9437n373m285o718R424J787j4621q412n181P061K7882p661
8705C9700o366R237K0442j47o287m510j7370p959K7774M255l721p923J814k822
8691D6117j1915o753m853n821j5534N390J2064j1897J1843K092J6341L8245K9570
8678A04889M0615K2901K819j0746o0807k9014r863m3k3243k4039j902N004Q64
8665A7435K0564k645P180Q415L445q436j556j5570k2673j4469R1R79L4699j908
8651B5551n078K5475k015K557J8494J093p412P011J4255K368n706M024J1528N481
8637I7626J6556L0631N8468N2605O0422O2747J4149l7325p0535r4203p2994j9113
$$ plain form
8625 99034 95937 108029 111878 101310 94106 65816 87410 124944 130036 188036 262312 295806 306269
8612 306269 290437 221786 133444 91468 83047 85589 97313 101807 81761 72800 79638 96207 91517
8599 91517 68619 77189 106097 110605 101524 86761 96365 123969 160886 171086 181740 226786 274930
8586 274930 284001 253531 236082 189203 173647 167131 149186 136419 152089 154900 154777 162835 195535
8573 195535 238944 322239 437675 514836 541465 478229 357451 240160 171423 138514 98936
8562 98936 77327 72636 55510 39397 37247 55439 65670 53280 52610 53462 50016 53393 31297
8549 31297 27365 32398 50743 51510 37862 46790 39742 26384 32185 37020 39233 72307 89378 84580
8535 84580 55635 28685 34529 41326 27008 37595 66760 80236 99006 146170 222453 250691
$$ packed form
8625I9034l097J2092L849j0568p204k8290K1594L7534N092N8000P4276L3494J0463
8612C06269j5832o8651q8342m1976q421K542J1724M494k0046q961O838J6569m690
8599I1517k2898Q570K8908M508r081j4763R604K7604L6917J0200J0654M5046M8144
8586B74930R071l0470j7449m6879j5556o516j7945j2767J5670K811j23Q058L2700
8573A95535M3409Q3295J15436P7161K6629o3236j20778j17291o8737l2909l9578
8562I8936k1609m691j7126j6113k150J8192J0231j2390o70Q52l446L377k2096
8549C1297l932N033J8345P67j3648Q928p048j3358N801M835K213L3074J7071m798
8535H4580k8945k6950N844O797j4318J0587K9165J3476J8770M7164P6283K8238
$$ plain form
8523 250691 226796 163404 109198 49689 17624 14500 19924 44912 38188 25795 28709 26450 37270
8510 37270 36424 31388 26839 38017 45462 32420 19563 -430 -6375 15290 21483 18142 22750 21954
8496 21954 15574 16671 31585 57869 55822 51166 35863 10421 4190 -463 14087 14431 -1012
8483 -1012 -5303 4763 -4942 -13869 22309 20192 18411 31383 44746 48210 6755 -3468 775
8470 775 -4366 -9751 -327 25608 62414 54173 32688 31315 32330 39455 33157 11251 10880 -15674
8456 -15674 -16006 -10083 -16958 -34356 -32977 -13379 -10076 -4144 8732 29148 29611 39481 56713 63658
8442 63658 48971 42570 38177 23089 10458 14516 -4815 -7761 -10938 -3666 477 -3274 8921
8429 8921 25700 21513 24278 22546 31425 29230 36603 42398 36099 40521 26856 20002 -3060 -2667
$$ packed form
8523B50691k3895o3392n4206n9509l2065l124N424K4988o724j2393K914k259J0820
8510C7270q46n036m549J1178P445j3042j2857j9993n945K1665O193l341M608p96
8496B1954o380J097J4914K6284k047m656j5303k5442o231m653J4550L44j5443
8483a012m291J0066r705q927L6178k117j781J2972J3363L464m1455j0223M243
8470G75n141n385R424K5935L6806q241k1485j373J015P125o298k1906l71k6554
8456a5674l32N923o875j7398J379J9598L303N932J2876K0416M63R870J7232O945
8442F3658j4687o401m393j5088j2631M058j9331k946l177P272M143l751J2195
8429H921J6779m187K765j732Q879k195P373N795o299M422j3665o854k3062L93
$$ plain form
8415 -2667 215 1557 2386 671 1913 7153 21692 17453 31782 48278 40486 -14719 -14659 6327
8401 6327 15899 29292 22809 34273 48924 45589 41467 25819 10421 17920 20294 21444 17194 1256
8387 1256 -13309 -8784 7149 18864 249 -13499 4255 5018 895 7603 -744 -2263 4707 -8580
8373 -8580 -25650 -24462 -4355 24412 29848 23088 15012 16375 28314 17627 16347 9647 -5824
8360 -5824 -14427 5426 15304 -15202 -30165 -56553 -44298 -33890 -40847 -17935 -519 12988 26585
8347 26585 8986 2413 -20942 -25582 -40432 -23415 -13662 3482 -4283 1029 16275 8644 15814
8334 15814 9227 8404 31195 35836 16321 12234 26221 -7691 -31179 5046 39579 12505 39451
8321 39451 43943 28979 15829 10799 7709 12569 24821 19442 4156 1570 2484 2876 17385 11408
$$ packed form
8415b667K882J342Q29j715J242N240J4539m239J4329J6496p792n5205O0K0986
8401F327R572J3393o483J1464J4651l335m122j5648j5398P499K374J150m250j5938
8387A256j4565M525J5933J1715j8615j3748J7754P63m123O708q347j519O970j3287
8373h580j7070J188K0107K8767N436o760q076J363J1939j0687j280o700j5471
8360e824q603J9853R878l0506j4963k6388J2255J0408o957K2912J7416J3507J3597
8347B6585j7599o573k3355m640j4850J7017R753J7144p765N312J5246p631P170
8334A5814o587q23K2791M641j9515m087J3987l3912k3488L6225L4533k7074K6946
8321C9451M492j4964j3150n030l090M860J2252n379j5286k586R14L92J4509n977
$$ plain form
8307 11408 21063 14840 17821 12819 3834 -9905 -7635 1157 5423 -12438 -4882 1722 2466 -14374
8293 -14374 -33776 -40367 -28863 -3423 15322 -8095 -25027 -11253 -6425 1931 -3739 -11522 4414
8280 4414 17581 15775 13544 -7225 -9312 -20781 -22003 -15528 -22335 -28783 -12316 4952 917 1740
8266 1740 20137 39081 25127 9384 -769 -10546 -22537 -17999 -1340 127 -2052 -25516 -33438
8253 -33438 -23393 2521 41455 18635 -5571 4732 31113 38814 21288 15034 4985 -8667
8241 -8667 2231 5230 4991 -13083 6652 19744 -11129 -10362 -18760 -25640 -17749 -6448 -7315 -4524
8227 -4524 1741 -22153 -32464 6884 27007 20501 10651 9096 11029 26000 33803 19889 9879
8214 9879 15917 11334 -5130 -20819 -39143 -31807 -31935 -46341 -37588 -10952 -17833 -13455 -19023 -23781
$$ packed form
8307A1408R655o223K981n002q985j3739K270Q792M266j7861P556O604P44j6840
8293a4374j9402o591J1504K5440J8745k3417j6932J3774M828Q356n670p783J5936
8280D414J3167j806k231k0769k087j1469j222O475o807o448J6467J7268m035Q23
8266A740J8397J8944j3954j5743j0153r777j1991M538J6659J467k179k3464p922
8253c3438J0045K5914L8934k2820k4206J0303K6381P701j7526o254j0049j3652
8241h667J0898K999k39j8074J9735J3092l0873P67q398o880P891J1301q67K791
8227d524O265k3894j0311L9348K0123o506r850j555J933J4971P803j3914j0010
8214I879O038m583j6464j5689j8324P336j28j4406Q753K6636o881M378n568m758
$$ plain form
8200 -23781 -8469 -11951 -10990 -20045 -37334 -28152 -16763 -7265 1995 1931 -6080 -4755 1350 15653
8186 15653 26456 17644 3673 -739 3568 13692 17218 -2409 3190 6398 5524 -1999 -5601 -17547
8172 -17547 -13756 -23494 -40602 -51775 -53801 -24691 -30977 -47718 -38804 -23915 -8322 15814 13614
8159 13614 -11431 -11545 8297 8221 3845 18628 30715 30578 54840 42502 12521 7043 -24732 -40896
8145 -40896 -46703 -21347 -16468 -18835 -10589 2882 9706 23696 33756 43734 30696 27540 32963
8132 32963 44710 28736 21900 24563 20895 37848 31064 28266 11006 18852 -1298 -7384 -2461
8119 -2461 45 -23488 -18645 -4989 13399 20260 -2935 -23262 -19513 -457 -6563 12567 8447
8106 8447 12413 3037 -8788 10829 -3096 7998 855 20200 26605 32909 18019 7382 10605
$$ packed form
8200b3781J5312l482R61r055j7289R182J1389R498R260o4q011J325O105J4303
8186A5653J0803q812j3971m412M307J0124L526j9627N599L208q74p523l602j1946
8172a7547L791r738j7108j1173k026K9110o286j6741Q914J4889J5593K4136k200
8159A3614k5045j14J9842p6m376J4783J2087j37K4262j2338k9981n478l1775j6164
8145d0896n807K5356M879k367Q246J3471O824J3990J0060R978j3038l156N423
8132C2963J1747j5974o836K663l668J6953o784k798j7260P846k0150o086M923
8119b461K506k3533M843J3656J8388O861k3195k0327L749J9056o106J9130m120
8106H447L966r376j1825J9617j3925J1094p143J9345O405O304j4890j0637L223
$$ plain form
8093 10605 5652 4477 -15043 -22331 -7796 10083 -3081 6458 -1329 -3736 6415 16178 28749
8080 28749 49667 29242 -7124 -14311 -15295 -33375 -16611 21836 31682 20164 5096 -10932 -6416
8067 -6416 -14070 8315 9212 5601 13981 30141 15489 7856 -3657 -13760 -7033 -5946 14508 9184
8053 9184 7147 -2435 -23211 -16065 7390 6519 -5447 -4302 -8281 15661 18678 11686 21683 18439
8039 18439 22468 35125 40596 28939 19281 17316 23892 41483 33372 28717 23171 9614 -8001
8026 -8001 -5565 9268 21160 32416 4660 -13109 -21759 -3212 -660 -5058 -23951 -12943 8552
8013 8552 6409 8567 30152 34432 15724 5580 6171 -3706 -7010 1560 20226 18782 9432 21755
7999 21755 2021 -11862 -11250 7800 16612 19203 19053 2724 18026 10117 7275 22617 12318
$$ packed form
8093A0605m953j175j9520p288J4535J7879j3164R539p787k407J0151R763J2571
8080B8749K0918k0425l6366p187r84j8080J6764L8447R846j1518j5068j6028M516
8067f416p654K2385Q97l611Q380J6160j4652p633j1513j0103O727J087K0454n324
8053I184k037r582k0776P146K3455q71j1966J145l979K3942L017o992R997l244
8039A8439M029J2657N471j1657r658j965O576J7591q111m655n546j3557j7615
8026h001K436J4833J1892J1256k7756j7769q650J8547K552m398j8893J1008K1495
8013H552k143K158K1585M280j8708j0144N91r877l304Q570J8666j444r350J2323
7999B1755j9734j3883O12J9050Q812K591j50j6329J5302p909k842J5342j0299
$$ plain form
7986 12318 28866 52922 18132 -1089 6257 18133 16554 6504 16309 8611 -327 10372 7328
7973 7328 12763 15959 27 -19498 -29124 -1298 22184 28995 21652 15270 38347 46874 44093 39152
7959 39152 16270 7683 24464 46348 38247 38198 32981 31682 36177 22477 24595 9669 17819 39819
7945 39819 40192 13840 13527 18139 26724 31405 37127 34762 31061 27949 19470 20433 37008 59650 59220
7930 59220 47540 52438 46747 40409 43386 42501 50586 53853 19360 10448 4810 -5405 1805 3090
7916 3090 16384 49129 44095 36865 38440 38581 37989 42815 35493 45246 36583 26323 7729 3307
7902 3307 31036 25433 23928 46070 54652 25707 7832 13180 11610 26188 34221 35080 42396 56577
7888 56577 57220 49905 47087 43420 36634 13915 4330 -7759 -9178 -16195 -1989 8575 10353 10846
$$ packed form
7986A2318J6548K4056l4790j9221P346J1876j579j0050R805p698q938J0699l044
7973G328N435L196j5932j9525r626K7826K3482O811p343o382K3077Q527k781m941
7959C9152k2882q587J6781K1884q101m9n217j299M495j3700K118j4926Q150K2000
7945C9819L73k6352l13M612Q585M681N722k365l701l112q479R63J6575K2642m30
7930E9220j1680M898n691o338K977q85Q085L267l4493q912n638j0215P210J285
7916C090J3294L2745n034p230J575J41n92M826p322R753q663j0260j8594m422
7902C307K7729n603j505K2142Q582k8945j7875N348j570J4578Q033Q59P316J4181
7888E6577O43p315k818l667o786k2719r585j2089j419p017J4206J0564J778M93
$$ plain form
7874 10846 9539 18313 6677 2029 6801 -1516 -10237 -2878 3041 10020 5902 10782 14762 40339
7860 40339 43600 34468 31560 27846 11027 15154 18853 24674 29823 16982 12731 11664 -4915 -2806
7846 -2806 13637 8223 -23829 -40252 -31330 -15426 8645 -333 -11999 -576 -7666 -11827 -6934
7833 -6934 -7896 21718 30924 12083 6703 18509 8814 1502 -1516 -12450 -6611 24486 28439 9202
7819 9202 -10438 282 4180 -4478 -856 -12274 -3931 -2187 -17200 -17038 -10192 14975 -98 -2644
7805 -2644 -2333 -2103 -8766 -6035 -6402 12414 29077 30004 31027 28840 36901 23170 2449 -7833 -33794
7790 -33794 -54671 -44343 -27473 -23175 -39544 -29996 -3464 13259 27788 12419 238 -1287
7778 -1287 -6958 -13900 -9514 -16303 -12928 -6812 -32195 -37344 -11408 -10217 -25352 -10685 8605 11039
$$ packed form
7874A0846j307Q774j1636m648M772q317q721P359N919O979m118M880L980K5577
7860D0339L261r132k908l714j6819M127L699N821N149j2841m251j067j6579K109
7846b806J6443n414l2052j6423Q922J5904K4071q978j1666J1423p090m161M893
7833f934r62K9614R206j8841n380J1806r695p312l018j0934N839L1097L953j9237
7819I202j9640J0720L898q658L622j1418Q343J744j5013J62O846K5167j5073k546
7805b644L11K30o663K731l67J8816J6663R27J023k187Q061j3731k0721j0282k5961
7790c3794k0877J0328J6870M298j6369R548K6532J6723J4529j5369j2181j525
7778a287n671o942M386o789L375O116k5383n149K5936J191j5135J4667J9290K434
$$ plain form
7764 11039 196 -2206 20152 15368 6205 4191 -10061 -18138 -15060 -17522 -28191 -18521 -13503 -18317
7750 -18317 -12643 -31090 -48141 -41477 -18537 -30436 -24759 -18647 -17521 -31977 -20375 -10026 -18325
7737 -18325 -40068 -50522 -68729 -70320 -59936 -38994 -8409 9322 10411 8661 -9270 -9885 1072
7724 1072 33459 32490 16101 -3422 -5060 -12990 -26786 -30466 -24896 -33530 -25317 -12370 -15746 -26712
7710 -26712 -24915 -12141 -14261 -7715 14347 -2293 -38305 -54818 -53878 -42214 -28625 6124 3354
7697 3354 -8991 -16830 -11504 -32088 -50790 -64442 -70813 -41293 -14733 795 13298 -1819 -3251
7684 -3251 11477 -4450 -37198 -56659 -50371 -31238 -18054 -9242 -15664 -19817 -10577 -4298 -6124
7671 -6124 18448 14185 -1072 -12512 -25395 -25024 -15026 -16585 -12662 -7564 -5654 -3987 573 10110
$$ packed form
7764A1039j0843k402K2358m784r163k014j4252q077L078k462j0669R670N018m814
7750a8317N674j8447j7051O664K2940j1899N677O112J126j4456J1602J0349q299
7737a8325k1743j0454j8207j591J0384K0942L0585J7731J089j750j7931o15J0957
7724A072L2387r69j6389j9523j638p930j3796l680N570q634Q213J2947l376j0966
7710b6712J797J2774k120O546K2062j6640l6012j6513R40J1664J3589L4749k770
7697C354j2345p839N326k0584j8702j3652o371K9520K6560J5528J2503j5117j432
7684c251J4728j5927l2748j9461O288J9133J3184Q812o422m153R240O279j826
7671f124K4572m263j5257j1440j2883L71R998j559L923N098J910J667M560R537
$$ plain form
7657 10110 -11124 -20651 -28110 -53001 -50477 -13877 15325 9072 12653 -768 -7904 -30787 -50310
7644 -50310 -71708 -45058 -23946 -26943 -24440 -29645 -35621 -38293 -23447 -7920 -6714 -7314 -7591 2172
7630 2172 7080 5427 2800 -7516 -19574 -30201 -11649 22862 33316 13266 15073 5524 -13019
7617 -13019 515 4307 -5159 -22883 -35139 -25818 -27039 -36948 -21807 -28000 -25195 -12316 -17212
7604 -17212 -6157 14419 22721 -9389 -34073 -50782 -40759 -23945 -8687 -2266 -16468 -47587
7592 -47587 -49536 -32352 -31295 -11922 6025 10465 5287 -21585 -37787 -47974 -50106 -50347 -41736
7579 -41736 -47690 -43194 -49015 -38711 -31114 -39080 -23095 -26398 -21184 -13014 -19791 -32971 -41016 -46816
7565 -46816 -47524 -35200 -8658 -10054 -40123 -19403 -15395 -32212 -26147 -11072 -14526 -25342 -30110
$$ packed form
7657A0110k1234r527p459k4891K524L6600K9202o253L581j3421p136k2883j9523
7644e0310k1398K6650K1112k997K503n205n976k672J4846J5527J206o00k77R763
7630B172M908j653k627j0316j2058j0627J8552L4511J0454k0050J807r549j8543
7617a3019J3534L792r466j7724j2256R321j221r909J5141o193K805J2879m896
7604a7212J1055K0576Q302l2110k4684j6709J0023J6814J5258O421j4202l1119
7592d7587j949J7184J057J9373J7947M440n178k6872j6202j0187k132k41Q611
7579d1736n954M496n821J0304P597p966J5985l303N214Q170o777j3180q045n800
7565d6816p08J2324K6542j396l0069K0720M008j6817O065J5075l454j0816m768
$$ plain form
7552 -30110 -18270 -16767 -17545 6795 13607 -4838 -20426 -3179 8124 11694 4023 5580 -15956
7539 -15956 -25678 -29910 -13508 -2625 15376 11862 861 -9201 -17902 -12263 -4944 13218 15849
7526 15849 -8978 -1517 5888 -5188 -2287 -4454 -4904 -9194 -2881 1007 -8121 -2162 2558 14456
7512 14456 4891 -11169 -7943 9297 7722 4069 -14485 -15769 -31628 -34650 -10558 -5550 10046
7499 10046 15858 -3125 -6705 -8094 -5412 -22235 -37086 -30204 -21181 -25785 -20304 -22053 -28169 -31908
7485 -31908 -26175 -11644 -21426 -36952 -47658 -59996 -33886 -17357 -31008 -20755 -24449 -33607 -17989
7472 -17989 -7532 4880 5330 2770 9157 2564 -11097 -18511 -14080 -18135 -10996 -31844 -55373 -51669
7458 -51669 -51069 -32979 -30963 -8696 -7482 -27584 -22993 -8161 -11409 -9442 -13266 -38217 -48875
$$ packed form
7552c0110J1840J503p78K4340O812j8445j5588J7247J1303L570p671J557k1536
7539a5956r722m232J6402J0883J8001l514j1001j0062q701N639P319J8162K631
7526A5849k4827P461P405j1076K901k167m50m290O313L888r128N959M720J1898
7512A4456r565j6060L226J7240j575l653j8554j284j5859l022K4092N008J5596
7499A0046N812j8983l580j389K682j6823j4851O882R023m604N481j749o116l739
7485c1908N733J4531r782j5526j0706j2338K6110J6529j3651J0253l694r158J5618
7472a7989J0457J2412M50k560O387o593j3661p414M431m055P139k0848k3529L704
7458e1669O00J8090K016K2267J214k0102M591J4832l248J967l824k4951j0658
$$ plain form
7445 -48875 -34803 -16680 -19226 -10294 -17347 -25151 -20708 -19883 -18152 -3414 -23740 -25427 -18924 -31281
7431 -31281 -27885 -22779 -9321 6 14271 6760 -2386 -14893 -22492 -12571 -14961 -29049 -44812
7418 -44812 -35463 -14488 -12370 -8755 -21429 -48207 -53259 -32694 -14268 4531 14008 6417 -16420
7405 -16420 -28858 -26935 -40256 -46072 -48098 -28706 -43166 -38576 -26289 -13017 -5889 -7168 -4276
7392 -4276 -8909 -14794 2333 -3559 -15664 295 18747 38701 20866 16020 21446 19172 -8189
7379 -8189 -21477 -19663 -18883 -21931 -17566 -17388 4481 7766 -5275 -21083 -44508 -29025 18379 24659
7365 24659 29337 18892 7990 12975 14173 -244 -20216 -27863 -29258 -37073 -24365 -19458 -22406
7352 -22406 -15979 -7071 -6716 -9290 -22389 -6539 -5572 -8039 -12810 -17370 -6517 -12629 -15872 11725
$$ packed form
7445d8875J4072J8123k546Q932p053p804M443Q25J731J4738k0326j687O503j2357
7431c1281L396N106J3458R327J4265p511r146j2507p599R921k390j4088j5763
7418d4812R349K0975K118L615j2674k6778n052K0565J8426J8799R477p591k2837
7405a6420j2438J923j3321n816k026J9392j4460M590J2287J3272P128j279K892
7392d276m633n885J7127n892j2105J5959J8452J9954j7835m846N426k274k7361
7379h189j3288J814P80l048M365J78K1869L285j3041j5808k3425J5483M7404O280
7365B4659M678j0445j0902M985J198j4417j9972p647j395p815J2708M907k948
7352b2406O427Q908L55k574j3099J5850R67k467m771m560J0853o112l243K7597
$$ plain form
7338 11725 27328 3680 -5434 3344 6688 8879 5260 9430 8752 -6549 -12967 -15790 -19459 -21413
7324 -21413 -13173 1764 8180 -2412 -21104 -27000 -17965 -2080 2358 -2024 -23 4219 -13343
7311 -13343 -36355 -13463 3713 1954 -18268 -31359 -35931 -20861 -14739 -1274 -12311 -13232 -14108
7298 -14108 -19043 -28353 -14960 -14321 -24705 -29569 -14995 32 349 -3711 10361 29907 43064
7285 43064 28799 25754 18841 11239 5292 2475 -25633 -36800 -26209 -18942 -16894 -19410 -25497 -18047
7271 -18047 -11934 -8589 -13315 -16773 -5883 -5063 -13921 -4787 22822 37158 38004 48924 53191 23885
7257 23885 -8627 758 -16320 -16950 -7201 -4511 -11396 -14178 -11093 -11063 -23976 -16042 3234 -13556
7243 -13556 -22412 -29442 -15404 -3916 429 -6448 -26133 -35100 -38849 -46945 -44660 -12974 -19166 -9600
$$ packed form
7338A1725J5603k3648r114Q778L344K191l619M170o78j5301o418k823l669j954
7324b1413Q240J4937O416j0592j8692n896R035J5885M438m382K001M242j7562
7311a3343k3012K2892J7176j759k0222j3091m572J5070O122J3465j1037r21q76
7298a4108m935r310J3393O39j0384m864J4574J5027L17m060J4072J9546J3157
7285D3064j4265l045o913p602n947k817k8108j1167J0591P267K048k516o087P450
7271a8047O113L345m726l458J0890Q20q858R134K7609J4336Q46J0920M267k9306
7257B3885l2512R385j7078o30R749K690o885k782L085L0j2913P934J9276j6790
7243a3556q856p030J4038J1488M345o877j9685q967l749q096K285L1686o192R566
$$ plain form
7229 -9600 -5304 -13122 -17071 -26832 -33745 -24786 -20231 -14045 226 9881 11552 5806 -3062 -23698
7215 -23698 -26127 -32050 -46818 -47112 -37757 -38761 -36850 -33284 -20749 -9341 -178 -1540 6434 -3483
7201 -3483 -23777 -23629 -17277 -21506 -31568 -45866 -33684 -26636 645 3223 -7380 -19527 -17453
7188 -17453 -580 11911 19814 31559 28805 14404 17108 31741 46585 44542 41525 34881 20557
7175 20557 10760 12062 17373 -5540 -27477 -34576 -29746 -24073 -29398 -17024 4359 5169 -18185 -28878
7161 -28878 -37914 -32804 -30235 -17129 -24493 -30532 -14377 -14231 179 -397 -2603 -20572 -16414 -8290
7147 -8290 -10630 -3670 19031 5009 -28737 -26998 -11253 -17764 -17495 -7598 -4962 10465 -5792 -31104
7133 -31104 -15193 5360 710 -14072 -16523 16411 14931 -3482 -18058 -6729 -12681 -20893 -2170
$$ packed form
7229i600M296p818l949r761o913Q959M555O186J4271R655J671n746q868k0636
7215b3698k429n923j4768k94R355j004J911L566J2535J1408R163j362P974r917
7201c483k0294J48O352m229j0062j4298J2182P048K7281K578j0603j2147K074
7188a7453J6873J2491P903J1745k754j4401K704J4633J4844k043l017o644j4324
7175B0557r797J302N311k2913k1937p099M830N673n325J2374K1383Q10k3354j0693
7161b8878r036N110K569J3106p364o039J6155J46J4410n76k206j7969M158Q124
7147h290k340O960K2701j4022l3746J739J5745o511K69R897K636J5427j6257k5312
7133c1104J5911K0553m650j4782k451L2934j480j8413j4576J1329n952q212J8723
$$ plain form
7120 -2170 7329 -2466 2453 2036 -19604 -37527 -20234 -31312 -21846 -2485 -5252 -4210 11486 4293
7106 4293 -19805 -49407 -58623 -32076 -24730 -20456 -8726 -7689 -8629 -6840 -9496 -14390 -10997 16440
7092 16440 34160 4321 -3276 -366 -4011 1720 1238 -3891 -9799 -23774 -28594 -20702 -9354 -15610
7078 -15610 -18792 -39065 -56717 -45856 -18073 11357 14668 -10467 -16605 -3620 -11029 -22230 -23005
7065 -23005 -5354 825 1100 5519 -7953 -3434 -16689 -21146 -24964 -17579 -13312 -18068 -13176 -20537
7051 -20537 -38589 -26453 -20161 -14142 -3158 -274 602 12026 19921 13121 12228 -2156 -9085 10917
7037 10917 8927 2903 1025 2662 -2187 -2448 -30 -14852 -28830 -15968 -22544 -21579 -14668 -13722 -12113
7022 -12113 -24734 -48373 -29061 -30957 -20301 -2922 2080 -16345 -7555 3910 15378 6341 -10219
$$ packed form
7120b170R499r795M919m17k1640j7923J7293j1078R466J9361k767J042J5696p193
7106D293k4098k9602r216K6547P346M274J1730J037r40J789k656m894L393K7437
7092A6440J7720k9839p597K910l645N731m82n129n908j3975m820P892J1348o256
7078a5610l182k0273j7652J0861K7783K9430L311k5135o138J2985p409j1201p75
7065b3005J7651O179K75M419j3472M519j3255m457l818P385M267m756M892p361
7051b0537j8052J2136O292O019J0984K884Q76J1424P895o800q93j4384o929K0002
7037A0917j990o024j878J637m849k61K418j4822j3978J2862o576R65O911R46J609
7022a2113j2621k3639J9312j896J0656J7379N002j8425Q790J1465J1468r037j6560
$$ plain form
7009 -10219 -18322 -12141 -2870 13041 -910 -1778 -791 -4525 -1019 6792 13612 15479 17498 27217 22417
6994 22417 8568 16582 -1045 -2024 7966 20086 10756 -3931 -20035 -13902 2089 3839 -5602
6981 -5602 -36508 -44423 -32623 -17338 -9561 -30950 -41336 -15693 -8970 -22834 -12712 1570 18927
6968 18927 24485 38621 30218 12608 6981 -3515 -7240 -17202 -16980 -28925 -26479 -24536 -14348 3403
6954 3403 21438 43288 21353 12245 8262 -1919 -842 11923 9253 2307 -14275 -17806 -29282
6941 -29282 -24372 -35928 -49060 -34592 -26120 -27794 -13075 2019 -3123 -16550 16 -2242 -33251
6928 -33251 -39411 -19998 -14214 -6575 -6203 23866 24003 5330 -27548 -39158 -23988 -6978 3366
6915 3366 3886 -2159 -4539 -12656 -1148 11621 318 -13533 -13889 -25122 -34888 -11475 -6026 -12291
$$ packed form
7009a0219q103O181R271J5911j3951q68R87l734L506P811O820J867K019R719m800
6994B2417j3849Q014j7627r79R990J2120r330j4687j6104O133J5991J750r441
6981e602l0906p915J1800J5285P777k1389j0386K5643O723j3864J0122J4282J7357
6968A8927N558J4136q403j7610n627j0496l725r962K22j1945K446J943J0188J7751
6954C403J8035K1850k1935r108l983j0181J077J2765k670o946j6582l531j1476
6941b9282M910j1556j3132J4468Q472j674J4719J5094n142j3427J6566k258l1009
6928c3251o160J9413N784P639L72L0069J37j8673l2878j1610J5170J7010J0344
6915C366N20o045k380q117J1508J2769j1303j3851l56j1233r766K3413N449o265
$$ plain form
6901 -12291 -19730 -28857 -7496 -7349 -22658 -19611 -3051 -22529 -35484 -24787 -24981 -32829 -14960
6888 -14960 -4019 -14061 -17850 -14879 5542 5337 14758 -6873 -31155 -24580 -24178 -26182 -13222 -5279
6874 -5279 -10242 -12005 1410 4930 -488 -4930 1202 16039 13597 10946 -2138 -22623 -27219 -16540
6860 -16540 -16452 -15920 -21114 -25096 -30933 -31995 -40153 -37065 -7480 12017 -5621 -16076 -377 -11061
6846 -11061 10291 16390 5001 5393 -6447 -22894 -35040 -19798 -7608 -3705 -39058 -39802 -23048
6833 -23048 -22759 -16091 -16917 -5845 3070 8986 -3289 -13395 -16224 -22087 -22392 -20502 -5949 4098
6819 4098 -681 -13459 -27222 -39055 -31064 -24067 -33956 -23524 -7807 -7848 5488 961 -3362 -9726
6805 -9726 -27841 -36026 -46740 -57906 -52678 -50300 -35563 -47185 -60182 -47175 -27050 -8728 -22287
$$ packed form
6901a2291p439r127K1361J47j5309L047J6560j9478j2955J0697j94p848J7869
6888a4960J0941j0042l789K971K0421k05R421k1631k4282O575M02k004J2960P943
6874e279m963j763J3415L520n418m442O132J4837k442k651j3084k0485m596J0679
6860a6540Q8N32n194l982n837j062q158L088K9585J9497j7638j0455J5699j0684
6846a1061K1352O099j1389L92j1840j6447j2146J5242J2190L903l5353p44J6754
6833b3048K89O668q26J1072Q915N916j2275j0106k829n863l05J890J4553J0047
6819D098m779j2778j3763j1833P991O997r889J0432J5717m1J3336m527m323o364
6805i726j8115q185j0714j1166N228K378J4737j1622j2997J3007K0125J8322j3559
$$ plain form
6792 -22287 -41723 -50737 -33795 -16028 -17053 -32159 -24149 -26244 -9966 -20006 -31498 -25586 -12426
6779 -12426 6460 259 -17024 -9220 -4185 -5657 -29260 -24531 -33625 -31454 -23326 -14003 -12229 -22244
6765 -22244 -25763 -349 -2671 716 -12693 -11707 16587 6063 -12531 -3012 -7192 -19423 -5782
6752 -5782 4386 -5459 -21298 -26568 -41162 -33388 -22747 9348 22834 28699 15434 19861 21218
6739 21218 9230 10212 7358 -15865 -29817 -17431 4604 -2172 -17754 7989 5686 -3859 627
6726 627 8559 -4073 -3433 -2741 -9263 -16539 -10605 -17474 -25462 -24602 -30147 -11912 -8362 -24613 -14154
6711 -14154 6725 6579 7909 2921 8316 16406 1647 -4052 -10196 -455 -4803 6626 249 -13947
6697 -13947 -25889 -30776 -51225 -37353 -8977 -11628 -22020 -31719 -12270 3341 -3985 -18517 -20986
$$ packed form
6792b2287j9436r014J6942J7767j025j5106Q010k095J6278j0040j1492N912J3160
6779a2426J8886o201j7283P804N035j472k3603M729r094K171Q128R323J774j0015
6765b2244l519K5414k322L387j3409R86K8294j0524j8594R519m180j2231J3641
6752e782J0168r845j5839n270j4594P774J0641L2095J3486N865j3265M427J357
6739B1218j1988R82k854k3223j3952J2386K2035o776j5582K5743k303r545M486
6726F27P932j2632O40O92o522p276N934o869p988Q60n545J8235L550j6251J0459
6711a4154K0879j46J330m988N395Q090j4759n699o144R741m348J1429o377j4196
6697a3947j1942m887k0449J3872K8376k651j0392r699J9449J5611p326j4532k469
$$ plain form
6684 -20986 -13644 -22786 -54570 -49490 -46072 -32164 -22034 -11867 1454 3615 12879 17089 7909
6671 7909 -3741 -237 634 12094 28082 33674 29898 5203 -957 1730 -20335 -21298 -48995 -59066
6657 -59066 -43123 -18327 -5675 1647 2236 -112 -2260 -5218 1144 -14161 -25414 -39749 -40080 -25401
6643 -25401 20715 17971 16530 28389 18658 -4814 -19003 -8030 9475 12484 -2989 -11340 -10952
6630 -10952 -10217 -4678 -772 -1517 5190 4914 2596 24273 13666 -3186 -14595 -1175 3341 2616
6616 2616 -4550 2536 7260 3516 5230 12152 21582 8767 9337 25174 15931 -11084 -22015 -21579
6602 -21579 -27444 -24508 -16089 -6602 1331 27849 39460 40410 40277 15566 -8658 -34448 -27614 -33510
6588 -33510 -20804 -5660 -11494 -14167 -23163 386 23371 24760 25054 16018 545 -13608 5806
$$ packed form
6684b0986P342r142l1784N080L418J3908J0130J0167J3321K161R264M210r180
6671G909j1650L504Q71J1460J5988N592l776k4695o160K687k2065r63k7697j0071
6657e9066J5943K4796J2652P322N89k348k148k958O362j5305j1253j4335l31J4679
6643b5401M6116k744j441J1859r731k3472j4189J0973J7505L009j5473q351L88
6630a0952P35N539L906p45O707k76k318K1677j0607j6852j1409J3420M516p25
6616B616p166P086M724l744J714O922R430j2815N70J5837r243k7015j0931M36
6602b1579n865K936Q419R487P933K6518J1611R50j33k4711k4224k5790O834n896
6588c3510J2706J5144n834k673q996K3549K2985J389K94r036j5473j4153J9414
$$ plain form
6575 5806 8932 -5624 -6634 -10777 -7666 -17131 -24737 -26931 -7626 19669 17378 -14241 -18418 -22187
6561 -22187 -25827 -36644 -34890 -30567 -8658 6327 -18124 -55372 -50554 -35983 -29268 -29739 -9357
6548 -9357 -2065 -6827 -13725 -15122 -236 3982 -8873 -14327 -11555 -23035 -32124 -26277 -26175 -37058
6534 -37058 -48032 -49586 -60676 -75092 -68978 -46671 -27576 -9733 14561 6669 3635 -6810 -29802
6521 -29802 -23756 -1197 -11285 -39538 -41598 -35207 -22598 -8626 8304 5374 4564 12992 18430
6508 18430 -1188 -3704 -1053 12109 22197 7520 -645 3133 -4688 -5559 7566 28275 15772
6495 15772 18697 12744 5670 4422 7219 -10621 -32681 -44598 -31658 -37403 -41875 -48770 -44084 -34586
6481 -34586 -29693 -22632 -9312 -9482 -20029 -18824 5337 5079 -13266 -13452 2448 -12961 -28945 -15822
$$ packed form
6575E806L126j4556j010m143L111r465p606k194J9305K7295k291l1619m177l769
6561b2187l640j0817J754M323K1909J4985k4451l7248M818J4571O715m71K0382
6548i357P292m762o898j397J4886M218j2855n454K772j1480r089N847J02j0883
6534c7058j0974j554j1090j4416O114K2307J9095J7843K4294p892l034j0445k2992
6521b9802O046K2559j0088k8253k060O391J2609J3972J6930k930q10Q428N438
6508A8430j9618k516K651J3162J0088j4677q165L778p821q71J3125K0709j2503
6495A5772K925n953p074j248K797j7840k2060j1917J2940n745m472o895M686R498
6481c4586M893P061J3320j70j0547J205K4161k58j8345j86J5900j5409j5984J3123
$$ plain form
6467 -15822 -635 4741 -4094 3725 -24681 -40189 -35403 -26629 -28805 -16801 -13152 -33710 -38577
6454 -38577 -19484 -4098 -11375 -15554 -5563 1654 5161 446 -12796 -18023 -14325 -15057 -22536 -15317
6440 -15317 -15610 -15794 -7523 3208 20662 12148 11330 28823 32341 20872 28780 16247 -1870 3788
6426 3788 3993 7892 4918 16920 16747 9251 11334 5147 -14447 -10965 -18538 -21758 -14156 -1566 -3587
6411 -3587 -19149 -7523 255 -9819 -15291 -18785 -19666 -35441 -31019 -20126 -3702 -16263 -27524
6398 -27524 -25869 -28538 -29851 -12833 10519 28624 31755 31879 27606 27279 11647 -12384 -17768 -19769
6384 -19769 -18552 -14710 -8826 2939 9169 -5500 -16424 3034 10138 -2858 -18235 -27768 -21002
6371 -21002 -16460 -18661 -25898 -24112 -27180 -30514 -6525 19331 -516 -17602 -5941 10450 2072
$$ packed form
6467a5822J5187N376q835P819k8406j5508M786Q774k176J2004L649k0558m867
6454c8577J9093J5386p277m179R991P217L507m715j3242n227L698p32p479P219
6440a5317k93j84Q271J0731J7454q514q18J7493L518j1469P908j2533j8117N658
6426C788K05L899k974J2002j73p496K083o187j9594L482p573l220P602J2590k021
6411c587j5562J1626P778j0074n472l494q81j5775M422J0893J6424j2561j1261
6398b7524J655k669j313J7018K3352J8105L131J24m273l27j5632k4031n384k001
6384a9769J217L842N884J1765O230j4669j0924J9458P104j2996j5377r533O766
6371b1002M542k201p237J786l068l334K3989K5856j9847j7086J1661J6391q378
$$ plain form
6358 2072 12068 5987 544 -149 -5686 -23328 -32768 -22477 3251 30294 27674 4355 2171 -13015
6344 -13015 -8111 11403 12364 8306 10209 16279 14636 26330 43725 38324 34214 17346 9460 22180
6330 22180 21325 10561 6087 7509 -525 -22895 -30807 -17278 -6599 -18873 -32256 -32971 -6899
6317 -6899 12837 22110 26678 20843 9817 15225 -9783 -35813 -33373 -25145 -9132 8004 -4274
6304 -4274 -11888 -15503 -12613 -28547 -28286 18250 31903 6710 -16580 -10779 -3286 16999 37086
6291 37086 15208 -4598 -25297 -29907 -35204 -15564 -4711 -2920 -11628 -18765 -20596 -15277 2422
6278 2422 8561 -122 5609 4949 556 -12866 -16788 -11506 -13647 -7236 10022 6637 26272 16458
6264 16458 -1763 -22995 -17004 -28025 -32496 -30550 -32361 -34907 -27795 -34534 -28861 -6919 11422
$$ packed form
6358B072R996o081n443o93n537j7642r440J0291K5728K7043k620k3319k184j5186
6344a3015M904J9514R61m058J903O070j643J1694J7395n401m110j6868p886J2720
6330B2180q55j0764m474J422q034k2370p912J3529J0679j2274j3383p15K6072
6317f899J9736R273M568n835j1026N408k5008k6030K440Q228J6013J7136j2278
6304d274p614l615K890j5934K61M6536J3653k5193k3290N801P493K0285K0087
6291C7086k1878j9806k0699m610n297J9640J0853J791q708p137j831N319J7699
6278B422O139q683N731o60m393j3422l922N282k141O411J7258l385J9635r814
6264A6458j8221k1232N991j1021m471J946j811k546P112o739N673K1942J8341
$$ plain form
6251 11422 -620 -15541 -26395 -27575 -9855 -7809 -12957 -6477 19386 38178 29965 3049 13528
6238 13528 8745 -1770 -4738 -8874 -12747 -16364 -31860 -34390 -41946 -42052 -42624 -34202 -34726 -29019 -22013
6223 -22013 -14526 -10638 -15398 -11470 -14733 -32999 -30783 -35983 -53784 -71468 -90486 -75721 -52196
6210 -52196 -48264 -52121 -53752 -26533 -8003 5543 -4387 -27855 -51031 -42631 -27610 -18162 -9029
6197 -9029 -3638 5529 -2700 -9776 -28998 -14610 -7418 -12776 -9396 -10414 -3354 14582 -4094 -35111
6183 -35111 -29309 -11581 -25637 -22578 -6021 -15147 -11803 -11786 -8555 -18 2993 5690 13359 15951
6169 15951 7237 4474 6983 17576 22157 12510 16744 21195 27713 17022 8111 17316 8196 -6279
6155 -6279 -14208 -24645 -49911 -47904 -20305 -32246 -19883 -17014 -19007 -8117 6878 21511 39253
$$ packed form
6251A1422j2042j4921j0854j180J7720K046n148O480K5863J8792q213k6916J0479
6238A3528m783j0515k968m136l873l617j5496k530p556j06n72Q422n24N707P006
6223b2013P487L888m760L928l263j8266K216n200j7801j7684j9018J4765K3525
6210e2196L932l857j631K7219J8530J3546r930k3468k3176Q400J5021R448R133
6197i029N391R167q229p076j9222J4388P192n358L380j018P060J7936j8676l1017
6183c5111N802J7728j4056L059J6557r126L344J7L231Q537L011K697P669K592
6169A5951q714k763K509J0593M581r647M234M451O518j0691q911R205r120j4475
6155f279p929j0437k5266K007K7599j1941J2363K869j993J0890J4995J4633J7742
$$ plain form
6142 39253 47173 22425 -58 -9204 -7520 -23488 -25259 -1198 -14255 -22497 -39218 -57998 -56622
6129 -56622 -38986 -23340 -21035 -3273 5856 6937 -6072 4816 15544 14507 -8535 -14651 -7500
6116 -7500 -42524 -60954 -43063 -35856 -6745 -20750 -31492 -22105 7703 10877 -10153 -6376 13084
6103 13084 -11544 -24229 -14870 -22183 -29998 -32885 -28206 -26872 -16774 -20206 -19960 8744 11105 -5493
6089 -5493 -30658 -43277 -45240 -43897 -30900 -20569 -21217 -44026 -58788 -36794 -7416 14083 6835
6076 6835 -4827 -9617 -17266 -40749 -49509 -46137 -16726 -7509 -4488 -15745 -11350 -3791 14069 25496
6062 25496 8053 2192 -13383 -17459 -9930 -5823 -10117 -18769 -28048 -13696 3058 7938 7650 2126
6048 2126 1471 -7325 -13162 -10682 7285 -1974 -16581 -16523 2348 6962 15478 22530 15585 19651 -5561
$$ packed form
6142C9253P920k4748k2483r146J684j5968j771K4061j3057q242j6721j8780J376
6129e6622J7636J5646K305J7762R129J081j3009J0888J0728j037k3042o116P151
6116g500l5024j8430J7891P207K9111j4005j0742R387K9808L174k1030L777J9460
6103A3084k4628j2685R359p313p815k887M679J334J0098l432K46K8704K361j6598
6089e493k5165j2619j963J343J2997J0331o48k2809j4762K1994K9378K1499p248
6076F835j1662m790p649k3483q760L372K9411R217L021j1257M395P559J7860J1427
6062B5496j7443n861j5575m076P529M107m294q652r279J4352J6754M880k88n524
6048B126o55q796n837K480J7967r259j4607N8J8871M614Q516P052o945M066k5212
$$ plain form
6033 -5561 3951 168 -3904 -22234 -26105 -9982 -4336 -11303 -2889 2135 -10685 -23449 -23480 -47058
6019 -47058 -40771 -33713 -16142 -6568 -16756 -42710 -38792 -9864 -20593 -22854 -24564 -26321 -19322
6006 -19322 -15469 -12351 -26869 -30974 -33541 -35490 -45454 -35304 -31404 -20943 -20300 -20113 -27939 -1671
5992 -1671 23119 6729 6513 8673 -18902 -23088 -26895 -16880 -9128 -4687 1272 11089 4493 7842
5978 7842 -2423 -9242 11820 23954 15687 -899 -6519 -18429 -16841 -12171 -4827 8406 11501
5965 11501 2870 -13697 -34293 -27605 -12513 -7287 -4905 -15122 -9498 -5 -9494 -29012 -35512
5952 -35512 -10476 9954 -4206 -24503 -32956 -17761 -18150 -17728 -6831 -3899 -167 -736 9855 -2024
5938 -2024 2611 8472 10379 -6391 -10167 -4616 -1581 22982 29895 10263 -525 -525 -8046 -6666 39
$$ packed form
6033e561R512l783m072j8330l871J6123N646o967Q414N024j2820j2764l1k3578
6019d7058O287P058J7571R574j0188k5954L918K8928j0729k261j710j757O999
6006a9322L853L118j4518m105k567j949r964J0150L900J0461O43J87p826K6268
5992a671K4790j6390k16K160k7575m186l807J0015P752M441N959R817o596L349
5978G842j0265o819K1062J2134q267j6586n620j1910J588M670P344J3233L095
5965A1501q631j6567k0596O688J5092N226K382j0217N624R493r489j9518o500
5952c5512K5036K0430j4160k0297q453J5195l89M22J0897K932L732n69J0591j1879
5938b024M635N861J907j6770l776N551L035K4563O913j9632j0788%p521J380O705
$$ plain form
5923 39 8939 5976 499 9061 10724 -6538 -38214 -53771 -29828 -1446 20196 21176 22586 39130
5909 39130 23289 9865 4020 1171 -3986 -4095 3320 1458 4146 8572 10602 4000 -991 11087
5895 11087 6091 13205 20279 29453 5845 1917 11547 6874 5505 -15848 -20509 -5420 -9311 -18723
5881 -18723 -6416 -9650 1335 13643 26675 23083 1268 4273 -1408 -9383 -17909 -521 979
5868 979 6137 20149 11548 -9132 -22828 -20241 -20659 -10774 1885 3281 15598 15108 -208 -6956
5854 -6956 -2184 4505 -5469 -17383 -33523 -30134 -11394 3882 10814 6262 -5364 3271 16137
5841 16137 37954 48667 48288 30655 -9412 -46498 -48693 -23081 1556 9332 19557 -4064 -20149
5828 -20149 -14490 15997 29874 22341 31426 54965 33111 9954 4006 10189 14654 16617 7421
$$ packed form
5923C9Q900k963n477Q562J663j7262l1676j5557K3943K8382K1642R80J410J6544
5909C9130j5841j3424n845k849n157j09P415j862K688M426K030o602m991J2078
5895A1087m996P114P074R174k3608l928R630m673j369k1353m661J5089l891r412
5881a8723J2307l234J0985J2308J3032l592k1815L005n681p975q526J7388J500
5868I79N158J4012q601k0680j3696K587m18R885J2659J396J2317m90j5316o748
5854f956M772O689r974j1914j6140L389J8740J5276O932m552j1626Q635J2866
5841A6137K1817J0713l79j7633m0067l7086k195K5612K4637P776J0225k3621j6085
5828b0149N659L0487J3877p533R085K3539k1854k3157n948O183M465J963r196
$$ plain form
5815 7421 -8464 -14024 -8358 1407 16681 3493 -19312 -18170 -9343 -14915 -8587 4524 15352
5802 15352 -14929 -21312 -27283 -24798 -30472 -9315 -1117 -4689 -9361 -20489 -26232 -4987 -22964
5789 -22964 -10413 9074 -13693 -29933 -8726 -14412 -14231 -14866 -7916 -11483 -24438 -19792 -2123
5776 -2123 -7848 -23820 -7177 -6622 -12531 -9016 -2053 -21404 -14546 -10275 -2214 -7204 -25975 -40051
5762 -40051 -33204 -25233 -34258 -35052 -21891 -41209 -38567 -21537 -26745 -34190 -21705 -31088 -38358 -33269
5748 -33269 -42824 -48536 -33465 -14650 -34275 -55934 -63841 -31890 -9851 -11228 -21741 -34610 -37429
5735 -37429 -36679 -31095 -20404 -18436 -13125 168 4445 -1076 12672 16457 -1027 14316 8690 -1625
5721 -1625 2789 -6587 -13909 -3445 4756 -9378 -20004 -16036 -20969 -18217 -22208 -11041 -1108 -10698
$$ packed form
5815G421j5885n560N666R765J5274j3188k2805J142Q827n572O328J3111J0828
5802A5352l0281o383n971K485n674K1157Q198l572m672j1128n743K1245j7977
5789b2964J2551J9487k2767j6240K1207n686J81o35O950l567j2955M646J7669
5776b123n725j5972J6643N55n909L515O963j9351O858M271Q061m990j8771j4076
5762d0051O847P971r025p94J3161j9318K642J7030n208p445J2485r383p270N089
5748c3269r555n712J5071J8815j9625k1659p907L1951K2039j377j0513j2869k819
5735c7429P50N584J0691J968N311J3293M277n521J3748L785j7484J5343n626j0315
5721a625M414r376p322J0464Q201j4134j0626L968m933K752l991J1167R933r590
$$ plain form
5707 -10698 -8431 -19442 -3393 5528 -17556 -36740 -36669 -30457 -27011 -26063 -31911 -26816 -35996 -41949
5693 -41949 -32673 -46492 -38697 -26528 -44168 -43289 -22794 -23493 -37048 -40387 -49910 -50023 -27173 -26570
5679 -26570 -9015 -9243 5598 -4295 -20269 -22349 -4353 -6186 -10473 -15094 -31310 -35325 -27461 -32548
5665 -32548 -31701 -32456 -19878 -3492 21989 38552 42634 23819 23987 10032 -6251 -8832 2011
5652 2011 -3961 -21206 -5985 -9134 -7438 -3291 14375 20984 14656 -4561 7044 44059 43425 25208
5638 25208 18689 -7609 -18630 -2238 20118 29335 33654 40101 42675 23550 9369 -649 -27665
5625 -27665 -28545 -12116 -20022 -21377 -21101 -2461 -8749 -15546 -8844 13719 9483 3475 -4080 -19914
5611 -19914 -16268 -10838 13680 10368 436 -1948 -12108 -6061 269 6759 13169 8641 -12729 -13898
$$ packed form
5707a0698K267j1011J6049Q921k3084j9184P1O212L446R48n848N095r180n953
5693d1949R276j3819P795J2169j7640Q79K0495o99j3555l339r523j13K2850O03
5679b6570J7555k28J4841r893j5974k080J7996j833m287m621j6216m015P864n087
5665c2548Q47p55J2578J6386K5481J6563M082j8815J68j3955j6283k581J0843
5652B011n972j7245J5221l149J696M147J7666O609o328j9217J1605L7015o34j8217
5638B5208o519k6298j1021J6392K2356R217M319O447K574j9125j4181j0018k7016
5625b7665q80J6429p906j355K76J8640o288o797O702K2563m236o008p555j5834
5611a9914L646N430K4518l312r932k384j0160O047O330O490O410m528k1370j169
$$ plain form
5597 -13898 -16719 -23823 -19703 -3727 -3929 -15057 -28060 -22934 -14414 -11388 3212 -7031 3495
5584 3495 8202 15515 21068 5017 -4761 -6807 -27173 -40627 -52140 -31859 7798 23400 7262
5571 7262 -2120 -49906 -53406 -17258 -7394 -4166 -891 -1872 -18102 -12483 -8851 15082 29507 22639
5557 22639 8682 -3875 -7517 -11311 -18495 -11286 -485 9271 7901 13319 2775 -17657 -36375
5544 -36375 -39027 -46253 -30958 -83 -6657 -3611 -16743 -12072 -10237 -12643 -9097 3633 -165 -9332
5530 -9332 12098 534 -20830 -8212 4109 3485 -18436 -38345 -27191 -10355 -22314 -24343 -24941
5517 -24941 -19580 -16605 -19639 -16453 -5140 -8616 -3669 -1335 -13218 -12188 8107 6304 9215 20700
5503 20700 5409 13082 5536 1979 -5958 2408 2995 -11861 -27689 -31501 -15215 -21167 -24713 -33054
$$ packed form
5597a3898k821p104M120J5976k02j1128j3003N126Q520L026J4600j0243J0526
5584C495M707P313N553j6051r778k046k0366j3454j1513K0281L9657J5602j6138
5571G262r382m7786l500L6148R864L228L275r81j6230N619L632K3933J4425o868
5557B2639j3957j2557l642l794p184P209J0801R756j370N418j0544k0432j8718
5544c6375k652p226J5295L0875o574L046j3132M671J835k406L546J2730l798r167
5530i332K1430j1564k1364J2618J2321o24k1921j9909J1154J6836j1959k029n98
5517b4941N361K975l034L186J1313l476M947K334j1883J030K0295j803K911J1485
5503B0700j5291P673p546l557p937Q366N87j4856j5828l812J6286n952l546q341
$$ plain form
5489 -33054 -5592 5209 -4286 -15487 -9083 18123 23653 11187 5706 8116 9334 14046 12859
5476 12859 -19722 -13084 -7637 -12924 -20265 -17254 -5800 -6097 -10323 -15256 5570 18777 10125 -11884
5462 -11884 -10106 -21563 -29589 -21305 -14433 -844 5527 -5661 -4244 -5879 9223 2837 9474 -3021
5448 -3021 -21813 -26257 -19347 1884 23616 -4968 3488 9415 1706 -2093 16726 18762 23106 10810
5434 10810 -10481 -3917 -2790 9592 15271 18025 9794 8265 4422 4258 2318 7135 -10926 -17562
5420 -17562 -15449 -9590 -5601 2998 -389 -17239 -20290 -21923 -22067 -18836 -10825 -39743 -33986 -21981
5406 -21981 -15275 -20301 -30981 -26738 -5511 -267 -7270 12109 788 -9427 -5453 -15864 -16349
5393 -16349 -30929 -35799 -23301 -8043 19434 23750 9526 14701 6805 107 -32271 -37585 -36413
$$ packed form
5489c3054K7462J0801r495j1201O404K7206N530j2466n481K410J218M712j187
5476A2859l2581O638N447n287p341L011J1454k97m226m933K0826J3207q652k2009
5462a1884J778j1457q026Q284O872J3589O371j1188J417j635J5102o386O637j2495
5448c021j8792m444O910K1231K1732k8584Q456N927p709l799J8819K036M344j2296
5434A0810k1291O564J127J2382N679K754q231j529l843j64j940M817j8061o636
5420a7562K113N859L989Q599l387j6850l051j633j44L231Q011k8918N757J2005
5406b1981O706n026j0680M243K1227N244p003J9379j1321j0215L974j0411m85
5393a6349j4580m870J2498J5258K7477M316j4224N175p896o698l2378n314J172
$$ plain form
5380 -36413 -40101 -39459 -15812 -22733 -28092 -35437 -27990 -17629 -3046 2621 31945 51076 39973
5367 39973 24417 15433 8667 15368 1401 -10746 -12252 -8621 -13558 -9144 -8385 -17085 -41030 -33670
5353 -33670 -16967 3949 15412 -2027 11867 4261 -1373 -769 1819 230 -12755 -37121 -47982
5340 -47982 -50574 -50179 -40002 -8349 -1404 8170 -7350 -22464 -23251 -10417 -14739 -19044 -21194 -27038
5326 -27038 -28018 -9603 3957 4791 -2973 -31835 -48646 -42752 -33953 -16213 2192 4794 -16160
5313 -16160 -18408 -5670 13072 11863 -3736 -17511 -15922 -3071 -989 -1576 -6260 104 3691 -13253
5299 -13253 -19265 -18571 -6581 5886 -17418 -12979 3760 -5053 -9401 -10371 -3195 -3048 11630 18602
5285 18602 19349 5904 -1260 -35214 -51389 -37951 -31463 -31911 -33943 -35530 -26922 -17907 -23800 -21351
$$ packed form
5380c6413l688O42K3647o921n359p345P447J0361J4583N667K9324J9131j1103
5367C9973j5556q984o766O701j3967j2147j506L631m937M414P59q700k3945P360
5353c3670J6703K0916J1463j7439J3894p606n634O04K588j589j2985k4366j0861
5340d7982k592L95J0177L1653O945R574j5520j5114p87J2834m322m305k150n844
5326b7038r80J8415J3560Q34p764k8862j6811N894Q799J7740J8405K602k0954
5313a6160k248J2738J8742j209j5599j3775J589J2851K082n87m684O364L587j6944
5299a3253o012O94J1990J2467k3304M439J6739q813m348r70P176J47J4678O972
5285A8602P47j3445p164l3954j6175J3438O488m48k032j587Q608R015n893K449
$$ plain form
5271 -21351 -26137 -34448 -31907 -18829 -5867 -6487 -17462 -16103 -12510 -13644 -19388 -28222 -44156 -33701
5257 -33701 -15482 -10284 1874 6857 10809 13989 10879 1810 -18909 -25802 -29156 -5046 -2547 -10562
5243 -10562 -36116 -30502 -11668 -6219 -13736 -5310 5100 -3715 -26093 -12814 -2271 6291 30150
5230 30150 38555 36342 18883 3728 -11837 -30680 -48341 -42005 -18486 -5186 -17398 -33054
5218 -33054 -54434 -63290 -56659 -47766 -44409 -32477 -6479 15312 15998 -5139 -10568 -23189 -32333
5205 -32333 -24110 -2961 -3569 -1825 6205 20938 14640 -2505 -9122 -5076 -24472 -41816 -55565
5192 -55565 -55204 -55473 -33047 -22131 -35601 -52594 -38753 -38857 -13940 -7719 -26598 -30957 -27008 -18454
5178 -18454 -2805 1247 -9688 -946 5819 -19301 -48224 -43740 -28321 -15514 -19446 -6938 -11366
$$ packed form
5271b1351m786q311K541J3078J2962o20j0975J359L593j134n744q834j5934J0455
5257c3701J8219N198J2158M983L952L180l110r069k0719o893l354K4110K499q015
5243a0562k5554N614J8834N449p517Q426J0410q815k2378J3279J0543Q562K3859
5230C0150Q405k213j7459j5155j5565j8843j7661O336K3519J3300j2212j5656
5218c3054k1380q856O631Q893L357J1932K5998K1791O86k1137n429j2621r144
5205c2333Q223K1149o08J744Q030J4733o298j7145o617M046j9396j7344j3749
5192e5565L61k69K2426J0916j3470j6993J3841j04K4917O221j8879m359L949Q554
5178a8454J5649M052j0935Q742O765k5120k8923M484J5419J2807l932J2508m428
$$ plain form
5165 -11366 -18027 -28664 -28405 -20243 -42486 -36179 -398 20017 17251 17625 21109 9970 19131 38441
5151 38441 34025 -470 -5128 7965 1713 -4583 -5360 -9027 -21031 -29693 -9422 19288 17944 20616
5137 20616 22295 9461 681 -4888 -5360 -9420 -2789 -2607 -9734 -16287 -9854 -20599 -29491 -11468
5123 -11468 2262 910 -9644 -3098 10280 3103 -2915 -14009 -26632 -37017 -31213 -29875 1526
5110 1526 552 -25812 -34266 -40799 -31737 -24794 -10649 -15483 -28205 -34907 -48582 -48870 -27975 -41984
5096 -41984 -52107 -29393 -25737 -32005 -30879 -9829 -22531 -25605 -21252 -9736 -10468 -3815 -1997 -9853
5082 -9853 -12155 -10636 -5615 -12080 -15640 1296 -14168 -21635 -5583 -9239 -24105 -16736 -22538 -15041
5068 -15041 -19834 -2468 -10462 -11611 2919 -12535 -28760 -14080 -12984 -29386 -30561 -40404 -27078
$$ packed form
5165a1366o661j0637K59Q162k2243O307L5781K0415k766L74L484j1139R161J9310
5151C8441m416l4495m658J3093o252o296p77l667j2004q662K0271K8710j344K672
5137B0616J679j2834q780n569m72m060O631J82p127o553O433j0745q892J8023
5123a1468J3730j352j0554O546J3378p177o018j1094j2623j0385N804J338L1401
5110A526r74k6364q454o533R062O943J4145m834j2722o702j3675k88K0895j4009
5096d1984j0123K2714L656o268J126K1050j2702l074M353J1516p32O653J818p856
5082i853k302J519N021o465l560J6936j5464p467J6052l656j4866P369n802P497
5068a5041m793J7366p994j149J4530j5454j6225J4680J096j6402j175r843J3326
$$ plain form
5055 -27078 -13568 -8473 7960 -5357 -20315 -19464 -4694 1660 1601 7396 20745 -1993 6166 1404
5041 1404 -14960 -11280 11469 -2582 -16887 -6408 22369 21868 8300 -16548 -31645 -28428 -9915
5028 -9915 6897 17086 24394 22233 3442 -4511 -15046 -25287 -27022 -8171 -2353 -42895 -49162
5015 -49162 -13731 -8019 -7074 -6331 1261 -18978 -35319 -28511 -8656 -14937 -26547 -15036 -18012 -10815
5001 -10815 19742 25063 14375 25874 34397 25866 -4124 -23242 -27597 -11906 -19817 -27202 -25777
4988 -25777 -7438 26062 -4143 -21793 -26414 -24951 -5807 18863 24147 26031 22103 21743 -419
4975 -419 -4131 10571 414 -7067 -19447 -29766 -13052 13032 -5152 -23885 -7211 -2699 -5892
4962 -5892 -21965 -14043 6698 -4927 -17291 -32833 -35227 -21993 -6084 6299 -4383 -24966
$$ packed form
5055b7078J3510N095J6433j3317j4958Q51J4770O354n9N795J3349k2738Q159m762
5041A404j6364L680K2749j4051j4305J0479K8777n01j3568k4848j5097L217J8513
5028i915J6812J0189P308k161j8791p953j0535j0241j735J8851N818m0542o267
5015d9162L5431N712R45P43P592k0239j6341O808J9855o281j1610J1511k976P197
5001a0815L0557N321j0688J1499Q523q531k9990j9118m355J5691p911p385J425
4988b5777J8339L3500l0205j7650m621J463J9144K4670N284J884l928l60k2162
4975d19l712J4702j0157p481j2380j0319J6714K6084j8184j8733J6674M512l193
4962e892j6073P922K0741j1625j2364j5542k394J3234J5909J2383j0682k0583
$$ plain form
4950 -24966 -34463 -23893 -21164 -19882 -2802 15170 -4730 -6741 -11498 1624 1797 -8118 2287
4937 2287 15716 24034 31769 27149 13135 14016 14695 4788 -4818 -6436 -8109 -16127 -19298 -37553 -40119
4922 -40119 -33182 -15552 -21294 -39511 -45313 -46281 -42531 -23759 -15923 -19592 -510 14799 14786 -1183
4908 -1183 -9202 4982 -14941 -37406 -13075 -9853 -7802 -12082 -14778 -18638 -5834 8823 6563
4895 6563 -14824 -23509 -10256 -21931 -24434 1912 6086 2573 -13835 -21076 -32951 -34615 -31945
4882 -31945 -16715 -7165 -633 7980 19158 14559 -133 1275 -8064 -21148 -23799 -10697 10446
4869 10446 15531 30501 22872 2334 -12448 -33138 -25923 -1995 8487 -1021 4281 15455 3983
4856 3983 -10426 -9575 -4531 -11585 -11836 -10332 -15610 -21201 -3959 -3846 -18713 -24589 -14300 -19747 -28000
$$ packed form
4950b4966r497J0570K729J282J7080J7972j9900k011m757J3122J73r915J0405
4937B287J3429Q318P735m620j4014Q81O79r907r606j618j673q018l171j8255k566
4922d0119O937J7630n742j8217n802r68L750J8772P836l669J9082J5309j3j5969
4908a183q019J4184j9923k2465K4331L222K051m280k696l860J2804J4657k260
4895F563k1387q685J3253j1675k503K6346M174l513j6408p241j1875j664K670
4882c1945J5230R550O532Q613J1178m599j4692J408r339j3084k651J3102K1143
4869A0446N085J4970p629k0538j4782k0690P215K3928J0482r508N302J1174j1472
4856C983j4409Q51N044p054k51J504n278n591J7242J13j4867n876J0289n447q253
$$ plain form
4841 -28000 -21860 -2078 -8640 -10149 2848 -1585 -34592 -39424 -15754 -11828 -27884 -26121 -28523
4828 -28523 -7479 4156 12618 19927 14837 16020 10514 14066 1576 2227 17714 18772 15920 -9913
4814 -9913 -9965 -3884 -12692 959 3826 -12064 -5924 -12995 -28029 -17778 -12703 16 -1421 -4133
4800 -4133 14090 34176 11065 -7732 211 -4959 -10305 -18958 -23584 -3152 -2033 14877 582
4787 582 -2679 -3577 -5197 -6980 -19134 -25108 -35411 -33915 -16250 9703 -1140 -11811 -11404 -3602
4773 -3602 -29371 -35035 -25272 -12227 -4802 2597 13565 26978 16525 18064 11010 15688 37079
4760 37079 37276 13627 841 12979 15676 380 -20574 -14087 -15014 -19287 10 14635 10993
4747 10993 -585 -7246 -22386 -28194 -2480 -6591 -21785 -13751 -21251 -38187 -45793 -22949 5240
$$ packed form
4841b8000O140J9782o562j509J2997m433l3007m832K3670L926j6056J763k402
4828b8523K1044J1635Q462P309n090J183n506L552j2490O51J5487J058k852k5833
4814i913n2O081q808J3651K867j5890O140p071j5034J0251N075J2719j437k712
4800d133J8223K0086k3111j8797P943n170n346q653m626K0432J119J6910j4295
4787E82l261q98j620j783j2154n974j0303J496J7665K5953j0843j0671M07P802
4773c602k5769n664R763J3045P425P399J0968J3413j0453J539p054M678K1391
4760C7079J97k3649j2786J2138K697j5296k0954O487r27m273J9297J4625l642
4747A0993j1578o661j5140n808K5714m111j5194Q034p500j6936p606K2844K8189
$$ plain form
4734 5240 7777 2991 815 1049 14338 -9351 -16831 891 3389 -12743 -17237 -27745 -18129 5665
4720 5665 27699 20417 19056 36330 34286 30698 29539 12779 -3057 1357 -3921 -9571 -15514 -3916
4706 -3916 -5845 5195 2878 -2805 1177 5338 1493 -11599 -17961 -17354 12834 8577 16706 1276
4692 1276 -4938 -5736 -7759 -21838 -4715 11939 22105 13801 15581 4687 19751 20457 7237 1755
4678 1755 -5208 -854 5915 4378 2385 5350 15108 17382 -1491 -22791 -3941 5235 -5219 -31105
4664 -31105 -27661 -31157 -35650 -26705 -23851 -23207 4592 5119 9287 7250 25049 34804 15191 -18628
4650 -18628 -29925 -10231 622 4199 12318 10340 -2614 4349 -17760 -13052 17285 9681 276
4637 276 -6526 -17566 -3065 4776 30981 32771 41072 36342 22899 8453 19372 26650 2798
$$ packed form
4734E240K537m786k176K34J3289k3689p480J7722K498j6132m494j0508R616K3794
4720E665K2034p282j361J7274k044l588j159j6760j5836M414n278n650n943J1598
4706c916j929J1040k317n683L982M161l845j3092o362O07L0188m257Q129j5430
4692A276o214p98k023j4079J7123J6654J0166q304J780j0894J5064P06j3220n482
4678A755o963M354O769j537j993K965R758K274j8873k1300J8850R176j0454k5886
4664c1105L444l496m493Q945K854O44K7799N27M168k037J7799R755j9613l3819
4650a8628j1297J9694J0853L577Q119j978j2954O963k2109M708L0337p604r405
4637B76o802j1040J4501P841K6205J790Q301m730j3443j4446J0919P278k3852
$$ plain form
4624 2798 3067 12444 9842 9987 15930 28575 29608 26655 21336 10417 18491 32002 26732 -570
4610 -570 -37635 -19446 -1484 7839 -6170 -6832 -11002 -11913 -7364 9870 17660 24657 9254 -20369
4596 -20369 -31359 -21830 -2958 -8863 -13966 -13713 -4289 1524 -8396 -9245 -1999 -3454 -2483 -9887 -11632
4581 -11632 -15593 -16617 -28683 -10124 11795 7665 -2513 14469 1486 -2091 -5778 4606 14728
4568 14728 16051 -6691 -24975 -21233 -15381 -11908 -16127 -20488 -15994 1735 -12190 -11002 -13672 -8317
4554 -8317 -3678 -8111 558 -766 14294 21074 14577 25547 31709 24044 1173 1895 12083 -156
4540 -156 -4182 -11685 -2783 9582 963 -28281 -8595 10504 24038 11528 -14998 -35829 -26215
4527 -26215 11183 31798 11550 5047 3612 -11477 -9392 -3162 -1112 -10623 -27577 -22590 -11964
$$ packed form
4624B798K69R377k602J45N943J2645J033k953n319j0919Q074J3511n270k7302
4610e70l7065J8189J7962R323j4009o62m170r11M549J7234P790O997j5403k9623
4596b0369j0990R529J8872n905n103K53R424N813r920q49P246j455R71p404j745
4581a1632l961j024j2066J8559K1919m130j0178J6982j2983l577l687J0384J0122
4568A4728J323k2742j8284L742N852L473m219m361M494J7729j3925J188k670N355
4554h317M639m433Q669j324J5060O780o497J0970O162p665k2871P22J0188j2239
4540a56m026p503Q902J2365q619k9244J9686J9099J3534j2510k6526k0831R614
4527b6215L7398K0615k0248o503j435j5089K085O230K050r511j6954M987J0626
$$ plain form
4514 -11964 19070 43968 47505 36239 34943 14509 8861 7746 -4373 -2702 4751 15863 3670
4501 3670 -8298 -2270 14600 9664 -8413 -11130 6403 31102 29540 14594 8548 -13681 -21595
4488 -21595 -22585 -26544 -40112 -33627 -24754 -13446 17121 20064 -1278 -12905 2561 -10747 1578
4475 1578 21105 23070 47431 41382 20073 645 6145 1203 -13462 -23368 -23194 712 -2039 -5122
4461 -5122 -18907 -27242 -12589 -9001 -9714 -3545 111 7271 15135 21034 4487 -10043 228 10407
4447 10407 -2100 -6846 -24140 -21947 -5358 8660 22328 35845 25827 28532 16007 15056 6655
4434 6655 -10920 3631 15829 11895 6852 -3973 11278 18076 19236 10976 5970 -475 -12238
4421 -12238 -10199 -8539 -3605 -2422 -18388 -32098 -42373 -40434 -18540 4109 -6112 -16796 6847
$$ packed form
4514a1964L1034K4898L537j1266j296k0434n648j115j2119J671P453J1112j2193
4501C670j1968O028J6870m936j8077k717J7533K4699j562j4946o046k2229p914
4488b1595r90l959j3568O485Q873J1308L0567K943k1342j1627J5466j3308J2325
4475A578J9527J965K4361o049k1309j9428N500m942j4665r906J74K3906k751l083
4461e122j3785q335J4653L588p13O169L656P160P864N899j6547j4530J0271J0179
4447A0407j2507m746j7294K193J6589J4018J3668J3517j0018K705j2525r51q401
4434F655j7575J4551J2198l934n043j0825J5251O798J160q260n006o445j1763
4421a2238K039J660M934J183j5966j3710j0275J939K1894K2649j0221j0684K3643
$$ plain form
4408 6847 26837 6775 -17225 -34331 -30104 -10787 1910 -4823 -19640 -21608 -31000 -25506 -3036
4395 -3036 -814 11170 20906 15015 -3369 -26688 -12442 5552 8421 5937 -108 12146 24187
4382 24187 36991 59506 62736 62679 49160 25691 3608 6083 11188 9498 6426 -1350 -5811 -19087
4368 -19087 -21995 -19415 -9862 -22759 -26244 -13055 2524 -5760 -13578 5229 24311 5351 -6817
4355 -6817 -9993 -15794 -20805 -30977 -49458 -38405 -30270 -31542 -26879 -9900 14353 46856 52068
4342 52068 42763 32566 15915 20670 28389 38905 43522 16069 6265 -11035 -4096 -2334 1463
4329 1463 31408 31246 29963 33079 25042 18675 10194 1867 -16712 -37665 -17932 4307 2519 -4607
4315 -4607 -11058 -11202 2157 -11098 -19681 -21756 -27375 -19770 -16835 -13732 -18129 -9805 6318 5687 14164
$$ packed form
4408F847J9990k0062k4000j7106M227J9317J2697o733j4817j968r392N494K2470
4395c036K222J1984R736n891j8384k3319J4246J7994K869k484o045J2254J2041
4382B4187J2804K2515L230n7j3519k3469k2083K475N105j690l072p776m461j3276
4368a9087k908K580R553j2897l485J3189J5579q284p818J8807J9082j8960j2168
4355f817l176n801n011j0172j8481J1053Q135j272M663J6979K4253L2503N212
4342E2068r305j0197j6651M755P719J0516M617k7453r804j7300O939J762L797
4329A463K9945j62j283L116q037o367q481q327j8579k0953J9733K2239j788p126
4315d607o451j44J3359j3255q583k075n619P605K935L103m397Q324J6123o31Q477
$$ plain form
4300 14164 19713 20558 9955 -1823 6845 -7594 -31285 -37277 -10400 -5350 2097 1098 -2877 8273
4286 8273 16575 5724 4581 8402 14310 15810 -13026 -15143 560 8295 -6293 -17249 -12291 -5510
4272 -5510 12599 10798 16766 13679 10196 2926 8681 9653 27052 14422 -11030 -12310 -13292 -18490
4258 -18490 -18635 6754 16854 22046 11905 12129 20603 31019 23813 3681 9152 -532 1756 881
4244 881 -13781 -16114 3610 19876 18518 26540 35915 22161 -14352 2668 39830 24302 21326
4231 21326 18941 24074 38537 26593 16397 28550 25376 9117 4241 -3016 -23694 -17291 -23390
4218 -23390 -25367 -18966 -25206 -40615 -14834 2653 -791 4727 -13021 -23123 -2921 846 -4809
4205 -4809 -28009 -20672 413 754 -6702 -4117 -6520 -5527 4870 -9618 -3527 3657 -5266 -4734 18531
$$ packed form
4300A4164N549Q45j0603j1778Q668j4439k3691n992K6877N050P447r99l975J1150
4286H273Q302j0851j143L821N908J500k8836k117J5703P735j4588j0956M958O781
4272e510J8109j801N968l087l483p270N755R72J7399j2630k5452j280r82n198
4258a8490j45K5389J0100N192j0141K24Q474J0416p206k0132N471r684K288q75
4244H81j4662k333J9724J6266j358Q022R375j3754l6513J7020L7162j5528k976
4231B1326k385N133J4463j1944j0196J2153l174j6259m876p257k0678O403o099
4218b3390j977O401o240j5409K5781J7487l444N518j7748j0102K0202L767n655
4205d809k3200P337K1085L41p456K585k403R93J0397j4488O091P184q923N32K3265
$$ plain form
4190 18531 -3263 -11932 6371 21883 22699 -5155 -14346 -9861 8611 12605 9459 2729 1863 11016
4176 11016 22439 19061 -261 -28022 -21537 -3032 14792 18128 -10290 -14109 4518 -20420 -5071
4163 -5071 10669 -12369 -13260 -6612 -12804 -12969 -3718 -6896 19328 25196 16722 7041 -7220 -10143
4149 -10143 12858 7345 13574 16537 -1885 15444 31089 28279 7324 718 -12048 -26050 -21722
$$ packed form
4190A8531k1794q669J8303J5512Q16k7854r191M485J8472L994l146o730q66R153
4176A1016J1423l378j9322k7761O485J8505J7824L336k8418l819J8627k4938J5349
4163e071J5740k3038q91O648o192j65R251l178K6224N868q474r681j4261k923
4149a0143K3001n513O229K963j8422J7329J5645k810k0955o606j2766j4002M328
$$ [...]
##END NTUPLES=NMR SPECTRUM
##END=
