##TITLE=Analysis number 330255
Compound Code cc 27013
Book Reference 552/38
Project Code adrs
Chemist Name stevem
##JCAMPDX= 6.0         $$ Bruker NMR JCAMP-DX V2.0
##DATA TYPE= NMR SPECTRUM
##DATA CLASS= NTUPLES
##ORIGIN= Bruker BioSpin GmbH
##OWNER= nmr
$$ XWIN-NMR		Version 3.5
$$ Fri Nov  9 11:39:02 2007 GMT Standard Time (UT+0h)  MAYBRIDGE\nmr@NMR_250MHZ
##.OBSERVE FREQUENCY= 250.131544655141
##.OBSERVE NUCLEUS= ^1H
##.ACQUISITION MODE= SIMULTANEOUS (DQD)
##.ACQUISITION SCHEME= undefined
##.AVERAGES= 16
##.DIGITISER RES= 18
##SPECTROMETER/DATA SYSTEM= dpx250
##.PULSE SEQUENCE= zg30
##.SOLVENT NAME= CDCl3
##.SHIFT REFERENCE= (INTERNAL, CDCl3, 0, 16.522)
##AUDIT TRAIL= $$ (NUMBER, WHEN, WHO, WHERE, WHAT)
$$ ##TITLE= Audit trail, XWIN-NMR		Version 3.5
$$ ##JCAMPDX= 5.01
$$ ##ORIGIN= Bruker BioSpin GmbH
$$ ##OWNER= nmr
$$ C:\u/data/dgb/nmr/ADRS/450/pdata/1/auditp.txt
$$ ##AUDIT TRAIL=  $$ (NUMBER, WHEN, WHO, WHERE, WHAT)
(   1,<2007-11-09 11:38:16.99 +000>,<MAYBRIDGE\nmr>,<NMR_250MHZ>,
      <created by zg, POWCHK disabled, PULCHK disabled
       configuration hash MD5:
       76 6E 9A 78 1E 09 19 81 EC 84 63 8F B0 6A 59 2D
       data hash MD5: 64K
       6F A1 6E C2 17 CD 53 8C 24 A1 DB 27 7C 81 F7 EC>)
(   2,<2007-11-09 11:38:38.97 +000>,<MAYBRIDGE\nmr>,<NMR_250MHZ>,
      <Start of raw data processing
       ef LB = 0.3 FT_mod = 6 PKNL = 1 SI = 32K 
       data hash MD5: 32K
       00 18 E8 E4 7A 1F 98 D0 EF 64 8F 0E 52 75 E4 7A>)
(   3,<2007-11-09 11:38:43.40 +000>,<MAYBRIDGE\nmr>,<NMR_250MHZ>,
      <apk 
       data hash MD5: 32K
       94 04 FB C2 E4 BF 75 58 C3 36 AB BE A9 61 99 E0>)
(   4,<2007-11-09 11:38:45.00 +000>,<MAYBRIDGE\nmr>,<NMR_250MHZ>,
      <abs ABSG = 5 
       data hash MD5: 32K
       D1 27 F9 51 FF 96 45 AB 1E 8F 3A 4C 37 C7 2C C5>)
$$ ##END=
$$ 
$$ hash MD5
$$ F7 84 5D 37 94 DB 96 28 B6 01 F7 0A 16 5A 85 CC
##$RELAX= 
##$RELAX= 
##$RELAX= 
##$RELAX= 
##$RELAX= 
##$RELAX= 
##$RELAX= 
$$ Bruker specific parameters
$$ --------------------------
##$DU= <C:\u>
##$EXPNO= 450
##$NAME= <ADRS>
##$PROCNO= 1
##$TYPE= <nmr>
##$USER= <dgb>
##$AMP= (0..31)
100 100 100 100 100 100 100 100 100 100 100 100 100 100 100 100 100 100 
100 100 100 100 100 100 100 100 100 100 100 100 100 100 
##$AQSEQ= 0
##$AQ_mod= 3
##$AUNM= <au_zg>
##$AUTOPOS= <19 >
##$BF1= 250.13
##$BF2= 250.13
##$BF3= 250.13
##$BF4= 250.13
##$BF5= 500.13
##$BF6= 500.13
##$BF7= 500.13
##$BF8= 500.13
##$BYTORDA= 1
##$CFDGTYP= 0
##$CFRGTYP= 5
##$CHEMSTR= <none>
##$CNST= (0..31)
1 1 145 1 1 1 1 1 1 1 1 1 1 1 1 1 1 1 1 1 1 1 1 1 1 1 1 1 1 1 1 1 
##$CPDPRG= <>
##$CPDPRG1= <>
##$CPDPRG2= <>
##$CPDPRG3= <>
##$CPDPRG4= <mlev>
##$CPDPRG5= <mlev>
##$CPDPRG6= <mlev>
##$CPDPRG7= <mlev>
##$CPDPRG8= <mlev>
##$CPDPRGB= <>
##$CPDPRGT= <>
##$D= (0..31)
0 1 0 0 0 0 0 0 0 0.06 0 0 0 0 0 0 0.0002 0 0 0 0 0 0 0 0 0 0 0 0 0 0 
0 
##$DATE= 1194608295
##$DBL= (0..7)
120 120 120 120 120 120 120 120 
##$DBP= (0..7)
150 150 150 150 150 150 150 150 
##$DBP07= 0
##$DBPNAM0= <>
##$DBPNAM1= <>
$$ [...]
##$SUBNAM7= <"">
##$SUBNAM8= <"">
##$SUBNAM9= <"">
##$SW= 20.6930455092707
##$SWIBOX= (0..15)
0 0 3 0 0 0 0 0 0 0 0 0 0 0 0 0 
##$SW_h= 5175.983436853
##$TD= 65536
##$TD0= 1
##$TE= 295.16
##$TE2= 300
##$TE3= 300
##$TEG= 300
##$TL= (0..7)
0 120 120 120 120 120 120 120 
##$TP= (0..7)
150 150 150 150 150 150 150 150 
##$TP07= 0
##$TPNAME0= <>
##$TPNAME1= <>
##$TPNAME2= <>
##$TPNAME3= <>
##$TPNAME4= <>
##$TPNAME5= <>
##$TPNAME6= <>
##$TPNAME7= <>
##$TPOAL= (0..7)
0.5 0.5 0.5 0.5 0.5 0.5 0.5 0.5 
##$TPOFFS= (0..7)
0 0 0 0 0 0 0 0 
##$TUNHIN= 0
##$TUNHOUT= 0
##$TUNXOUT= 0
##$USERA1= <user>
##$USERA2= <user>
##$USERA3= <user>
##$USERA4= <user>
##$USERA5= <user>
##$V9= 5
##$VALIST= <valist>
##$VCLIST= <CCCCCCCCCCCCCCC>
##$VD= 0
##$VDLIST= <DDDDDDDDDDDDDDD>
##$VPLIST= <PPPPPPPPPPPPPPP>
##$VTLIST= <TTTTTTTTTTTTTTT>
##$WBST= 1024
##$WBSW= 4
##$XGAIN= (0..3)
0 0 0 0 
##$XL= 0
##$YL= 0
##$YMAX_a= 486454
##$YMIN_a= -528598
##$ZGOPTNS= <>
##$ZL1= 120
##$ZL2= 120
##$ZL3= 120
##$ZL4= 120
##$ABSF1= 16.522
##$ABSF2= -4.171173
##$ABSG= 5
##$ABSL= 3
##$ALPHA= 0
##$AQORDER= 0
##$ASSFAC= 0
##$ASSFACI= 0
##$ASSFACX= 0
##$ASSWID= 0
##$AUNMP= <proc_1d>
##$AZFE= 0.1
##$AZFW= 0.1
##$BCFW= 0
##$BC_mod= 0
##$BYTORDP= 0
##$COROFFS= 0
##$CY= 12.5
##$DATMOD= 1
##$DC= 0
##$DFILT= <>
##$DTYPP= 0
##$F1P= 14.0000005364418
##$F2P= -0.99999901652339
##$FCOR= 0.5
##$FTSIZE= 32768
##$FT_mod= 6
##$GAMMA= 0
##$GB= 0
##$INTBC= 1
##$INTSCL= 1
##$ISEN= 128
##$LB= 0.3
##$LEV0= 0
##$LPBIN= 0
##$MAXI= 10000
##$MC2= 0
##$MEAN= 0
##$ME_mod= 0
##$MI= 0
##$NCOEF= 0
##$NC_proc= -2
##$NLEV= 6
##$NOISF1= 0
##$NOISF2= 0
##$NSP= 0
##$NTH_PI= 0
##$NZP= 0
##$OFFSET= 16.522
##$PC= 1
##$PHC0= 170.0311
##$PHC1= 5.105638
##$PH_mod= 1
##$PKNL= yes
##$PPARMOD= 0
##$PSCAL= 4
##$PSIGN= 0
##$REVERSE= no
##$SF= 250.13
##$SI= 32768
##$SIGF1= 0
##$SIGF2= 0
##$SINO= 400
##$SIOLD= 32768
##$SREGLST= <1H.CDCl3>
##$SSB= 0
##$STSI= 32768
##$STSR= 0
##$SW_p= 5175.98343685301
##$SYMM= 0
##$S_DEV= 0
##$TDeff= 65536
##$TDoff= 0
##$TI= <Analysis number 999999
Compound Code 99
Book Reference 9
Project Code 9>
##$TILT= no
##$TM1= 0
##$TM2= 0
##$TOPLEV= 0
##$USERP1= <user>
##$USERP2= <user>
##$USERP3= <user>
##$USERP4= <user>
##$USERP5= <user>
##$WDW= 1
##$XDIM= 32768
##$YMAX_p= 329758952
##$YMIN_p= -126638
$$ End of Bruker specific parameters
$$ ---------------------------------
##NTUPLES= NMR SPECTRUM
##VAR_NAME=  FREQUENCY,     SPECTRUM/REAL,   SPECTRUM/IMAG
##SYMBOL=    X,             R,               I
##VAR_TYPE=  INDEPENDENT,   DEPENDENT,       DEPENDENT
##VAR_FORM=  AFFN,          ASDF,            ASDF
##VAR_DIM=   32768,         32768,           32768
##UNITS=     HZ,            ARBITRARY UNITS, ARBITRARY UNITS
##FACTOR=    0.157963299565203, 1,           1
##FIRST=     4132.6476996994, 0,             0
##LAST=      -1043.33573715361, 0,           0
##MIN=       -1043.33573715361, -126638,     0
##MAX=       4132.6476996994, 329758952,     0
$$ Real data points
##PAGE= N=1
##DATA TABLE= (X++(R..R)), XYDATA
$$ [...]
16599A43467M0119L4817K8525K7736K5182J9154J2783M021j4577r602k9932k5393
$$ 143467 183586 218403 246928 274664 299846 319000 331783 335804 321227 311625 281693 256300
16587B56300k3903k3885l7664l6492k0769l6824k6972j2228k514j2693n499M456
$$ 256300 232397 208512 170848 134356 113587 76763 49791 37563 35049 22356 16857 21313
16575B1313p613r653l953j912O215J6088K263m694n080M35P774o1j0967n943O572
$$ 21313 13700 4047 94 -1818 4397 20485 22748 18054 12974 13409 21183 21122 10155 4212 10784
16560A0784p647p020J050L446q138j70J6262m391m468K698k549k586j3376l675
$$ 10784 3137 -3883 -2833 613 -7525 -7695 8567 4176 -292 2406 -143 -2729 -16105 -19780
16546a9780K566J0708R305Q887j380p969l347j6702k454Q63J3017R341J602K775
$$ -19780 -17214 -6506 2799 11686 10306 2337 -1010 -17712 -20166 -19303 -6286 3055 4657 7432
16532G432m053k063L489n405K867J4997L156n466k521J332j700p082l448q028
$$ 7432 3379 1316 4805 -600 2267 17264 20420 14954 12433 13765 12065 4983 1535 -6493
16518f493o219M280r87p31n862O534P144p522J233J2193P435n679m078j384j313
$$ -6493 -12712 -8432 -9419 -10150 -16012 -9478 -2334 -9856 -8623 3570 11005 5326 1248 -136 -1449
16503a449l191M631M411r514j1161n916O428j991J1642K018L301O947j664m518
$$ -1449 -4640 -9 4402 -5112 -16273 -22189 -15761 -17752 -6110 -4092 -791 6156 4492 -26
16489b6j722n496J571Q610M825j106L725N34j3311o356Q423M625o036m075l647
$$ -26 -1748 -7244 -5673 2937 7762 6656 10381 10915 -2396 -8752 -329 4296 -1740 -5815 -9462
16474i462o832J1651J7075J0059r307q648l225J284N41M598M523L832k033j5510
$$ -9462 -16294 -4643 12432 22491 13184 4536 1311 2595 3136 7734 12257 16089 14056 -1454
16460a454j1357L140J0348l909l854J758L790o471k181n907L070J3657l01n888
$$ -1454 -12811 -9671 677 -3232 -7086 -5328 -1538 -8009 -10190 -16097 -13027 630 329 -5559
16446e559P239M836M057P851L123j991m896j191o976j659j381M643O750L786J56
$$ -5559 1680 6516 10573 18424 21547 19556 14660 13469 6493 4834 3453 8096 14846 18632 18788
16431A8788j1063n916j3674n596Q377R077M778j720n717O019N129l913J224M648
$$ 18788 7725 1809 -11865 -17461 -9084 -7 4771 3051 -2666 3353 8482 4569 5793 10441
16417A0441p160o895k569K192J523L652k64j406j490L092R368j614n410r59J396
$$ 10441 3281 -3614 -6183 -3991 -2468 1184 920 -486 -1976 1116 10484 8870 3460 2501 3897
16402C897K191O19m054j462J6891K361r021M890N244n097j4904l837O99j2106
$$ 3897 6088 6707 2653 1191 18082 20443 11422 16312 21556 16459 1555 -2282 -1583 -13689
16388a3689q7J1138M237N167m706j595O946o061K125J0098n529R24J1686Q931
$$ -13689 -13776 -2638 1599 6766 2060 465 7411 1350 3475 13573 8044 8968 20654 29585
16374B9585n85q887o043p15p607j0474k680L454Q375n899l205J5856K736k977
$$ 29585 29000 20113 14070 13355 5748 -4726 -7406 -3952 4423 -1476 -4681 11175 13911 10934
16360A0934q42j0149j1645K554P697J3787n996j7262l173R248J1665r368L179
$$ 10934 10092 -57 -11702 -9148 -1451 12336 6340 -10922 -14095 -4847 6818 -2550 629
16347F29O565p491M035P954m318k774m774k262L569m445m927P86J4664J3807P111
$$ 629 7194 -297 3738 11692 7374 4600 -174 -2436 1133 -3312 -8239 -7453 7211 21018 28129
16332B8129r683K031j96L898j0425j0050r664k422j1252O588J4593K0410J2050
$$ 28129 18446 20477 20281 24179 13754 3704 -5960 -8382 -19634 -13046 1547 21957 34007
16319C4007j4597q356K277k628o748o270m009O578J2284L699R092p658l381J0413
$$ 34007 19410 11054 13331 10703 3955 -2315 -6324 254 12538 16237 25329 17671 14290 24703
16305B4703P340l121q434N04j7456L118K692L382l941N60O258m649j7645J5468
$$ 24703 32043 28922 20488 20992 3536 6654 9346 12728 8787 9347 15605 10956 -6689 8779
16291H779L118j1197L106J0688J4621J2871K951n767R34J6135Q515q567p798j255
$$ 8779 11897 700 3806 14494 29115 41986 44937 39170 40104 56239 64754 56187 48389 47134
16277D7134j2132j5010L217M738L269p220O0n607M533R883q104j4912m569m290
$$ 47134 35002 19992 23209 27947 31216 23996 24056 18449 22982 32865 24761 9849 5280 990
16263I90Q843J220k604M371o001k628L247k382j1282Q456Q383M47J1328p40j5800
$$ 990 9833 11053 8449 12820 6819 4191 7438 5056 -6226 2230 10613 11060 22388 21648 5848
16248E848R27R207N760N045l926j3654N064N088j0523j966J4J1512M342r850m324
$$ 5848 6775 15982 21742 26787 22861 9207 14271 19359 8836 6870 6884 18396 22738 12888 8564
16233H564K826P681k545R52k522j6715p050q990o392k561L549P405m507j2104
$$ 8564 11390 19071 16526 17478 14956 -1759 -8809 -17799 -24191 -26752 -23203 -15798 -20305 -32409
16219c2409m832N874J4461K628q037Q530K934o661K475J3946o746p061R23J3242
$$ -32409 -37241 -31367 -16906 -14278 -22315 -13785 -10851 -17512 -15037 -1091 -7837 -14898 -13975 -733
16205g33K960L003O407O31m226m820L959J4294L680n15k721J947Q37r532j4306
$$ -733 2227 5230 11637 12268 8042 3222 7181 21475 25155 24640 21919 23866 24703 15171 865
16190H65p154j234L66m50m976o830n191n790J0099O776j3384Q05L155J221j36
$$ 865 -6289 -7523 -7157 -7607 -12583 -19413 -24604 -30394 -20295 -13519 -26903 -26098 -22943 -21722 -21858
16175b1858J5170N485n60Q851N921r112k915J2532J2094m089J417P217K249P239
$$ -21858 -6688 -1203 -1763 7088 13009 3897 982 13514 25608 21519 22936 30153 32402 39641
16161C9641J4246O392J7484J9999J2030q404r737O509R292J492m999q352n032
$$ 39641 53887 60279 77763 97762 109792 101388 91651 98160 107452 108944 103945 95593 90561
16148I0561M756j294l1j6047j2882n332N071J3416R833j4574q342j0795o573K681
$$ 90561 95317 94023 93992 77945 65063 59731 64802 78218 88051 73477 65135 54340 47767 50448
16134E0448J270l154o560k312k962N076R60J92j475q6r27K642L414n52L040J1446
$$ 50448 51718 48564 42004 39692 36730 41806 42766 42958 41483 41397 40470 43112 46526 45974 49014 60460
16118F0460N197K141j804o393l676N873J303m683M881J1084P299J576p49J870
$$ 60460 65657 67798 65994 59601 55925 61798 63101 58418 63299 74383 81682 83258 82509 84379
16104H4379K949l94m80P169J3300J0968K527k226j970J14K388O393j1100Q149
$$ 84379 87328 86934 86454 93623 106923 117891 120418 118192 116222 116336 118724 125117 114017 122166
16090A22166Q233k312J2129J175n68j155J3114J6367j296J2952K8855K8454J5085
$$ 122166 130399 128087 140216 141391 140823 139668 152782 169149 167853 180805 209660 238114 253199
16077B53199O787J324J5007L2984L2441M9250L0608K4314M0321N3068N4239N7925
$$ 253199 259986 261310 276317 309301 341742 390992 421600 445914 486235 539303 593542 651467
16065F51467O5775O3316Q4099Q9395R5748J07463R5692J00556J22424J22126J41944
$$ 651467 717242 780558 864657 954052 1049800 1157263 1252955 1353511 1475935 1598061 1740005
16054A740005J67545J96922K06612K35527K65209L13924L39212L71362M18541
$$ 1740005 1907550 2104472 2311084 2546611 2811820 3125744 3464956 3836318 4254859
16045D254859M95143N74082P23003R02599J185547J656592K367236L430433M706191
$$ 4254859 4750002 5324084 6047087 6949686 8135233 9791825 12159061 15589494 20295685
16036B0295685N807999O654120O256038O020505O042393N451776N689917L887890
$$ 20295685 26103684 32757804 39013842 45034347 51076740 56528516 62218433 66106323
16028F6106323P15519j010924m696766n204262n576047o288046o135080o883952
$$ 66106323 66821842 65810918 61114152 55909890 50333843 44045797 37910717 31026765
16020C1026765o719955n791140m674026l419235k443378j719282j197611q64879
$$ 31026765 24306810 18515670 13841644 10422409 7979031 6259749 5062138 4197259
16012D197259o32595m74609l74475l06297k58165k18656j81531j56833j34830
$$ 4197259 3564664 3090055 2715580 2409283 2151118 1932462 1750931 1594098 1459268
16003A459268j19749r0099q0290o1842m4426l3859l2605l6902n1109n5106o5137
$$ 1459268 1339519 1249420 1169130 1107288 1062862 1029003 996398 959496 908387 853281 788144
15992G88144o6289o0550n9614o3784n9271n4327l0901k8172l1842k2572j4463
$$ 788144 721855 661305 601691 537907 478636 424309 393408 365236 333394 310822 296359
15981B96359k1588l076j0923j2876j1989n247m905o751j1831p151l475j0122j0362
$$ 296359 274771 271695 260772 247896 235907 230660 225755 219004 207173 200022 196547 186425 176063
15968A76063j2955p939j0152L558P349P21r130r641l804R24L84p479o479K17o049
$$ 176063 163108 155169 145017 148575 155924 156645 147515 137874 134070 134994 135378 127899 121420 121637 115588
15953A15588j0366q350j1278m882J61m131n521p235J2099J5625R236M433m251
$$ 115588 105222 96872 85594 80712 80873 76742 71221 63986 76085 91710 100946 105379 101128
15940A01128j050J49j2721j430N084M562p734j1492j3686j10j399k616N278J3922
$$ 101128 100078 100227 87506 86076 91160 95722 87988 76496 62810 62700 61301 58685 63963 77885
15926G7885l834o481k725j268j276n135N984o44M342o052k0820m844l77m051l90
$$ 77885 74051 67570 64845 63577 62301 57166 63150 62506 66848 60796 39976 35132 34755 30704 30314
15911C0314j7091o716J703l771j563j6856p775M967j675j000J531N166N653J8194
$$ 30314 13223 6507 8210 4439 2876 -13980 -21755 -16788 -18463 -19463 -17932 -12766 -7113 11081
15897A1081l798p602R266J8436O020L938K520K841k016Q60o69R811L696J795n042
$$ 11081 7283 -319 8947 27383 33403 37341 39861 42702 40686 41546 40877 50688 54384 56179 51137
15882E1137p396K366J0427J134p043K626k017j5153L222j211p549K112n881J1345
$$ 51137 43741 46107 56534 57668 50625 53251 51234 36081 39303 38092 30543 32655 26774 38119
15868C8119J5005R70p808k898n605j2846M988l342r434k699L522J402K2460p422
$$ 38119 53124 54094 46286 43388 37783 24937 29925 26583 17149 14450 17972 19374 41834 34412
15854C4412k1365q727J628O621k48L328O675J0901j203R103Q176J568Q071K52
$$ 34412 13047 4320 5948 12569 12321 15649 22324 33225 32022 41125 49301 50869 58940 59192
15840E9192p248k008m34l255M292n149j7512p439o481n283J4462J0767n192j6227
$$ 59192 51944 49936 49502 46247 50539 45390 27878 20439 13958 8675 23137 33904 28712 12485
15826A2485j1404P370J125J4788n483j9112j4639N704J8768k412p820j5981o373
$$ 12485 1081 8451 9576 24364 18881 -231 -14870 -9166 9602 7190 -630 -16611 -22984
15813b2984N941J4907J2688K688j489K465J0058q004j1020o840o751L258J5294
$$ -22984 -17043 -2136 10552 13240 11751 14216 24274 16270 5250 -1590 -8341 -5083 10211
15800A0211p167j3475J2739J3745m07p818J819J154o66P595q078r407J1655l11
$$ 10211 3044 -10431 2308 16053 15646 7828 9647 10801 10135 17730 9652 245 11900 11589
15786A1589q200n64k162Q413R082l681K202j093J267P821o592k867P630L415J0348
$$ 11589 3389 2825 663 9076 18158 14477 16679 15586 16853 24674 18082 15215 22845 26260 36608
15771C6608p622n827n003q511p611N95L980N640j3642n030O995R745k514q233
$$ 36608 28986 23159 18156 9645 2034 2629 6609 12249 -1393 -6423 572 10317 7803 -430
15757d30O971Q62M511L266K560K190p034j1176n201M341j995j1135k911L922R699
$$ -430 6541 7403 11914 15180 17740 19930 12896 1720 -3481 860 -1135 -12270 -15181 -11259 -1560
15742a560J3673L853p262M201J523M373N492N220r625k004J3206P328j1110j9191
$$ -1560 12113 15966 8704 12905 14428 18801 24293 29513 19888 17884 31090 38418 27308 8117
15728H117K067K716j914j0019j0900P491k270n126o843L510J3943L425M78J410
$$ 8117 10184 12900 10986 967 -9933 -2442 -4712 -9838 -16681 -13171 772 4197 4675 6085
15714F085k862m268k505O173P494N884K383j3375l18J39O746m048K063L959o378
$$ 6085 3223 -1045 -3550 2623 10117 16001 18384 5009 4691 4830 11576 7528 9591 13550 7172
15699G172N69N755q954L94J3070k423n731o534k974o218J65q027R378J2000K154
$$ 7172 7741 13496 4542 4936 18006 15583 9852 3318 344 -5874 -5709 -13736 -4358 7642 9796
15684I796K987j304j0250L900q320n228k424J4637Q37L135Q092l96J243l509q878
$$ 9796 12783 11479 1229 5129 -3191 -8419 -10843 3794 4631 7766 15858 15462 16705 13196 4318
15669D318m773R241q685l856P009j0326j30L807M61p919J380Q607L492R775k973
$$ 4318 -455 8786 101 -3755 3254 -7072 -7202 -3395 -2934 -10853 -9473 -866 2626 12401 9428
15654I428o548R636o730m461Q527l888L154M03J577K339N20j112j3873m017l419
$$ 9428 2880 12516 5786 1325 9852 5964 9118 9521 11098 13437 13957 12845 -1028 -5045 -8464
15639h464r47k666R085J074Q097J867n553j965O34m040Q798O716R581p366m814
$$ -8464 -9411 -12077 -2992 -1918 6179 8046 2493 528 1162 -2878 5920 12636 22217 14851 10037
15624A0037j2897M053J0494l213q553N965n825o386j183J6366O027j1902j1331
$$ 10037 -2860 1193 11687 8474 -79 5886 61 -6325 -7508 8858 14885 2983 -8348
15611h348n590j730R969O473j1498j888P029R946M148j55O008q246k141n31o604
$$ -8348 -13938 -15668 -5699 774 -10724 -12612 -5583 4363 8511 8356 14364 6118 3977 3446 -3158
15596c158j20O097O393j751p501k172L607J3721j0567j3781j3486j0248o38n765
$$ -3158 -3278 2819 9212 7461 -40 -2212 1395 15116 4549 -9232 -22718 -32966 -33604 -39369
15582c9369N58J2319N914R358Q568k492M335r115K699O282P451l553m337R954
$$ -39369 -38811 -26492 -20578 -11220 -2652 -5144 -809 -9924 -7225 -943 6508 2955 -1382 8572
15568H572J629N160M329M32j7085j577P017l212J993k67m359M076O731n308k915
$$ 8572 10201 15361 19690 20122 3037 1460 8477 5265 7258 6991 2632 6708 13439 8131 5216
15553E216K674p87q454j900Q924J2715Q44l514P442k101j2149K643o720j357j221
$$ 5216 7890 7103 -1351 -3251 5673 18388 19232 15718 23160 21059 8910 11553 4833 3476 2255
15538B255m87O195q625l111J777r15L223j49q405r894J5191j543p073r789m806
$$ 2255 1768 7963 -662 -3773 -1996 -2911 312 163 -8242 -18136 -2945 -4488 -11561 -21350 -26156
15523b6156O686K2435R481o095N90N404p746j0152k729L609q336K25O169k142
$$ -26156 -19470 2965 12446 6351 6941 12345 4599 -5553 -8282 -4673 -13009 -12784 -6615 -8757
15509h757q967J7109J2803L013r962j9367J951J6098j525J76l33L592R471O465
$$ -8757 -17724 -615 12188 15201 5239 -14128 -12177 3921 2396 2572 2239 5831 15302 21767
15495B1767Q007j1109J5j6275q470R800J2623Q561o379r755J620K904k34j430
$$ 21767 29774 18665 18680 2405 -6065 3735 16358 24919 18540 8785 10405 13309 13075 11645
15481A1645k016R137j785o850J199J4090R438N432L855q29M865P439J0070J480
$$ 11645 9629 18766 16981 10131 11330 25420 34858 40290 44145 43316 48181 55620 65690 67170
15467F7170O712M2342M2358L9572L3896L5994L0349K6728K4202K874Q564O485
$$ 67170 73882 116224 158582 198154 232050 268044 298393 325121 349323 352197 360761 367246
15455C67246k0052k6022l7673m2639m0181m5888l8421k0368k2536o070j5198j5401
$$ 367246 347194 321172 283499 240860 200679 154791 116370 96002 73466 67396 52198 36797
15443C6797r061m781n733k286o870J794p680k495L246M028O753L350r149n933
$$ 36797 27736 22955 17222 14936 8066 9860 2180 -315 2931 6959 13712 17062 7913 1980
15429A980k189m596K601R451M316O458n042j0013L739j119j0501N398J5341O07
$$ 1980 -209 -4805 -2204 7247 11563 18021 12979 2966 6705 5586 -4915 483 15824 16431
15415A6431m237l388l048o286m389q864K814O536j860N854K450J2265J1401K610
$$ 16431 12194 8806 5758 -528 -4917 -13781 -10967 -4431 -6291 -437 2013 14278 25679 28289
15401B8289j6640m504m965N28Qp257k855K126P234O015J79m492j424r156L470
$$ 28289 11649 7145 2180 2708 2716 -4541 -7396 -5270 1964 7979 8158 3666 2242 -6914 -3444
15386c444J0069L100l330p076r104J961k397O412R854J0307j2870q340l120K817
$$ -3444 6625 9725 6395 -681 -9785 -7824 -10221 -3809 6045 16352 3482 -4858 -7978 -5161
15372e161J7163Q260j1606k009p87N448L673L106j418q277J0393j070o687l958
$$ -5161 12002 20262 8656 6647 5860 11308 14981 18087 16669 8392 18785 17715 11028 7070
15358G070N943K248m273P979j308p486l447j2907q278m087J3552J3715Q700r159
$$ 7070 13013 15261 10988 18967 17659 10173 6726 -6181 -14459 -18546 -4994 8721 17421 8262
15344H262Q851P049j3078j7971j470j871j510P153Q586K220N111k670j302p861
$$ 8262 17113 24162 11084 -6887 -8357 -10228 -11738 -4585 4001 6221 11332 8662 7360 -501
15330e01Q963q937J823P905j1680l732P56P922M971k900j814L424L955q524J024
$$ -501 8462 -475 1348 9253 -2427 -6159 -5403 2519 7490 4590 2776 6200 10155 1631 2655
15315B655J0214J437R99j0145k757o064j974K86M574o504l645L949Q092k632k118
$$ 2655 12869 14306 15305 5160 2403 -3661 -5635 -5349 -775 -7279 -10924 -6975 1117 -1515 -3633
15300c633o934k262R639k4N654K1647q631j0236r314J436j0857j503J0457p078
$$ -3633 -10567 -12829 -3190 -3214 2440 24087 15456 5220 -4094 -2658 -13515 -15018 -4561 -11639
15286a1639K605P326k921j0560P236J0036Q305J163n434j101l573r899k726j057
$$ -11639 -9034 -1708 -4629 -15189 -7953 2083 10388 11551 6117 5016 1443 -8456 -11182 -12239
15272a2239o291K984P758J2007k476J837K083n260K012r099j38Q827k990O944
$$ -12239 -18530 -15546 -7788 4219 1743 3580 5663 403 2415 -6684 -6822 2005 -985 5959
15258E959Q216P93L520k218j2879k718q33J460j7192K80J7186J817j1467K68J3448
$$ 5959 14175 14968 18488 16270 3391 673 -160 1300 -15892 -15612 1574 3391 -8076 -7808 5640
15243E640R584L593o947l44o942l926P256K237j7738M91M995l481m332q780P125
$$ 5640 15224 18817 11870 11526 4584 658 7914 10151 -7587 -7096 -2101 -5582 -9914 -18694 -11569
15228a1569m910P563J3628O080p856L492o671J077j087n275L367L079R369J355
$$ -11569 -16479 -8916 4712 10792 2936 6428 -243 834 -253 -5528 -2161 918 10287 11642
15214A1642j101j6968n280Q224N126L886p750RO830m055p989p65K548J5257O514
$$ 11642 10541 -6427 -11707 -3483 1643 5529 -2221 -2212 4618 563 -7426 -8191 -5643 9614 16128
15199A6128j0985P023J6782m684j1141j3642r300l106Q310K676j68M256j376N54
$$ 16128 5143 12166 28948 24264 13123 -519 -9819 -12925 -4615 -1939 -2107 2149 773 1327
15185A327O669j1467j234Q540K460k790k500K930j2443n853N481M433L677q524
$$ 1327 7996 -3471 -4705 3835 6295 3505 1005 3935 -8508 -14361 -8880 -4447 -770 -9294
15171i294J863J0220o371M801J583R549m797o138q857j1775K375J5208J1417j0946
$$ -9294 -7431 2789 -3582 1219 2802 12351 7554 1416 -7441 -19216 -16841 -1633 9784 -1162
15157a162l080P663M962O947j899m508r975j2984j594m295N843P482R788K835
$$ -1162 -4242 3421 8383 15330 13431 8923 -1052 -14036 -15630 -19925 -14082 -6600 3188 6023
15143F023J695p663m255M898O269O39L392L314q811K018n202l743R049o2P444
$$ 6023 7718 55 -4200 698 6967 7606 10998 14312 5501 7519 2317 -1426 7623 7561 15005
15128A5005o546o929k60N713K339j0895O23J5217m853L165K856R354l33r185J0734
$$ 15005 8459 1530 1270 6983 9322 -1573 -950 14267 9414 12579 15435 24789 24456 15271 26005
15113B6005p403q367r29M420J0551j0155k0793m800J2321R364k719k007r76L251
$$ 26005 18602 10235 9306 13726 24277 14122 -6671 -11471 850 10214 7495 5488 4512 7763
15099G763J206j5008j3950J811N19p82J5264M439l106m10m034L145Q626k536j1003
$$ 7763 8969 -6039 -19989 -18178 -17659 -18441 -3177 1262 -1844 -2254 -6288 -3143 5483 2947 -8056
15084h056o25j3629L988J484q604j994J0917J0579N017N090J549k977M949l260
$$ -8056 -8681 -22310 -18322 -16838 -25442 -27436 -16519 -5940 -923 4167 5716 2739 7688 4428
15070D428m086J1694M056q898j0247j463m322J2486M027n612q220q327j0109P266
$$ 4428 342 12036 16092 7194 -3053 -4516 -8838 3648 7675 2063 -6157 -14484 -24593 -17327
15056a7327N764L108J1332r54p601o674K317M051N684Q946J228P951M247l622
$$ -17327 -11563 -8455 2877 1923 -5678 -12352 -10035 -5984 -300 8646 9874 17825 22072 18450
15042A8450m971o078j9351r433J0773J1857r997O910R479J99M90j3063o040j458
$$ 18450 13479 7401 -11950 -21383 -10610 1247 -8750 -1840 7639 7838 8328 -4735 -10775 -12233
15028a2233L015j2864P242J8367J0673l868j3454M109N17L185P46L729J0746m572
$$ -12233 -9218 -22082 -14840 3527 14200 10332 -3122 987 1504 4689 5435 9164 19910 15338
15014A5338L116r185o229l060l825j2090P139p62j1516k309P587J629j536K166
$$ 15338 18454 9269 3040 -20 -3845 -15935 -8796 -9558 -21074 -23383 -15796 -14167 -15703 -13537
15000a3537K246M322O057j544j4088j582Q143J3688L702L599l130JJ0498K355
$$ -13537 -11291 -6969 -912 -2456 -16544 -18126 -9983 3705 7407 11006 7876 7877 18375 20730
14986B0730r880k920j0358j3333K965J0318J0607k377j9005p580J6737J2709m496
$$ 20730 10850 7930 -2428 -15761 -12796 -2478 8129 5752 -13253 -20833 -4096 8613 4117
14973D117q920r357J542J2806J0479J860r143r495p895J2675R474L397m034L448
$$ 4117 -4803 -14160 -12618 188 10667 12527 3384 -6111 -14006 -1331 8143 11540 7506 10954
14959A0954P8k997p280m633J5406J5595K582q038n697J695L455K443J741j4819
$$ 10954 11032 8035 755 -3878 11528 27123 29705 21667 15970 17665 21120 23563 25304 10485
14945A0485l197k134R730P368q426j3359n297j997K433l468n505l492J0335J441
$$ 10485 7288 5154 14884 22252 13826 467 -4830 -6827 -4394 -7862 -13367 -16859 -6524 -5083
14931e083Q055m736j0075Q102O810Q554j060j2275M778J1711o196j1460n970J3700
$$ -5083 2972 -1764 -11839 -3737 3073 11627 10567 -1708 3070 14781 8585 -2875 -8845 4855
14917D855l670r827p152L731k910N280l091J1178J19j0988o075j546M594N483
$$ 4855 1185 -8642 -15794 -12063 -14973 -9693 -12784 -1606 -1487 -12475 -18550 -20096 -15502 -10019
14903a0019J4730J3161j97m742j1250o433Q693P827P685m906j2342n873l529j758
$$ -10019 4711 17872 17675 12933 1683 -4750 3943 11770 19455 14549 2207 -3666 -7195 -8953
14889h953o890O53O155O791l604K022m398K937k022n617N807n121J578M201n198
$$ -8953 -15843 -15190 -9035 -2244 -5848 -3826 -8224 -5287 -7309 -12926 -7119 -12240 -10662 -6461 -11659
14874a1659m248J957P874k970N546n359O929M617p958o378M776P661j4915m454
$$ -11659 -15907 -13950 -6076 -9046 -3500 -8859 -1930 2687 -5271 -11649 -6873 788 -14127 -18581
14860a8581K060J2787P521J794k224o010l791J272o06J405J4872K00j1758q00
$$ -18581 -16521 -3734 3787 5581 3357 -2653 -6444 -5172 -5778 -4373 10499 10699 -1059 -1859
14846a859l609M053M618j281j7362p608K951m43m326j186L468N9N186N117k846
$$ -1859 -5468 -1415 3203 1922 -15440 -23048 -20097 -20540 -24866 -26052 -22584 -22525 -17339 -12222 -15068
14831a5068n175J3208N040R22J004o949j48L288L758J1081Q21j284r63j719L290
$$ -15068 -20243 -7035 -1995 -1073 -69 -7018 -7166 -3878 -120 10961 11782 10498 9535 7816 11106
14816A1106j290J775o77L099n806o460N811N003M526q743m314q512j099P830M492
$$ 11106 9816 11591 10914 14013 8207 1747 7558 12561 17087 8344 4030 -4482 -5581 2249 6741
14801F741O153O17j3106J386P503n451n691j753p40N538O115p077j2017k879j412
$$ 6741 12894 13511 405 1791 9294 3843 -1848 -3601 -4341 1197 7312 235 -11782 -14661 -16073
14786a6073l351J345N764J1716R187M132o339l623J7511K614K155r775k4507p498
$$ -16073 -19424 -18079 -12315 -599 8588 12720 6381 2758 20269 22883 25038 15263 -9244 -16742
14772a6742O222n253J2716L442n552n32L637N050k185q675O089P763J1314J2473
$$ -16742 -10520 -15773 -3057 385 -5167 -5699 -2062 2988 803 -7872 -1783 5980 17294 29767
14758B9767j5279j171k133l451p539M819J2637m274l999k890m266j4522k016M219
$$ 29767 14488 13317 11184 7733 194 5013 17650 13376 9377 6487 2221 -12301 -14317 -10098
14744a0098Q173M032j039k119N751K568m980r23p944q102J0614n935j266J0158
$$ -10098 -1925 2107 1068 -1051 4700 7268 2288 1365 -6579 -14681 -4067 -10002 -11268 -1110
14730a110q06n984o148l450p50q94J0754M820J1256K672Q7m581J947o506j2517
$$ -1110 -1916 -7900 -14048 -17498 -18248 -19142 -8388 -3568 7688 10360 10447 5866 7813 1307 -11210
14715a1210n404n165J4112O599j0981j482P093n34k058j1551P480r19j3897m280
$$ -11210 -16614 -21779 -7667 -1068 -12049 -13531 -6438 -6972 -9030 -20581 -13101 -14020 -27917 -32197
14701c2197J5090O435j273r221j305Q914N849J4686J994o565m361j007K596j485
$$ -32197 -17107 -10672 -11945 -21166 -22471 -13557 -7708 6978 8972 2407 -1954 -2961 -365 -1850
14687a850j227Q034p912N65J1211P323n674q129p34k396L15j3555j1962K536R767
$$ -1850 -3077 4957 -2955 -2390 8821 16144 10470 2341 1607 -789 -474 -14029 -25991 -23455 -13688
14672a3688J3852R771m816j263L816J378Q27n505Q602K929q482q287J5583Q650
$$ -13688 164 9935 5119 3856 7672 9050 9877 4372 12974 15903 7421 -866 14717 23367
14658B3367p340q991m138J2665n508o95p621n218j310P267R448N346q989j3665
$$ 23367 16027 7036 2898 15563 10055 9360 1739 -3479 -4789 2478 11926 17272 8283 -5382
14644e382r604p829J2494Q767L718N379o540K367o587n994J3795J4610J434j3950
$$ -5382 -14986 -22815 -10321 -1554 2164 7543 1003 3370 -3217 -9211 4584 19194 20628 6678
14630F678m79l960n188J1142p159j4238m083P433M646j0284p180Q473J283n232
$$ 6678 6199 2239 -2949 8193 1034 -13204 -17287 -9854 -5208 -15492 -22672 -14199 -12916 -18148
14616a8148o427K775J4278P791n017L283J529P83J5341l767j8059l44j333O484
$$ -18148 -24575 -21800 -7522 269 -4748 -1465 64 847 16188 12421 -5638 -5982 -7315 -831
14602h31O348o52M569J1275J3910Q407j362j7439j5829j651p400o148j168k846
$$ -831 5517 4865 9434 20709 34619 43026 41664 24225 8396 6745 -655 -6803 -7971 -10817
14588a0817M117r634m481J5650M721L651N453L142p214j283n913j525L655R179
$$ -10817 -6700 -16334 -20815 -5165 -444 3207 8660 11802 4588 3305 -2608 -4133 -478 8701
14574H701r753q237O832J842l296k897Q110q987k081K568l014m168J1878J867
$$ 8701 -1052 -9289 -2457 -615 -3911 -6808 1302 -7685 -9766 -7198 -10212 -14380 -2502 -635
14560f35k0461l453M638m624Q142J1596l494l116j392N037k057r95K660k55q72
$$ -635 -21096 -24549 -19911 -24535 -16393 -4797 -8291 -11407 -12799 -7762 -9819 -10814 -8154 -8409 -9281
14545i281j266Q483m428R260O854Q908O084j579r169l292j230j2962j0745M478
$$ -9281 -10547 -2064 -6492 2768 9622 18530 24614 23035 13866 10574 9344 -3618 -14363 -9885
14531i885J6888J8499r963r536p677l384M214M960k81j843n26j0361j3136J0407
$$ -9885 7003 25502 15539 6003 -1674 -5058 -844 4116 3835 1992 1466 -8895 -22031 -11624
14517a1624O599J093M52m010M306J3589N505m336p379m705N740j1372j4321k057
$$ -11624 -5025 -3932 -3480 -7490 -3184 10405 15910 11574 4195 -510 5230 -6142 -20463 -22520
14503b2520J9487O981P81r499k538P257R930p511Q557L329o520k370n271j606
$$ -22520 -3033 3948 4729 -4770 -7308 -51 9879 2368 10925 14254 7734 5364 93 -1513
14489a513M939R23n112N241n40j6191k602n94L834L953o728n827M170p64j493
$$ -1513 3426 4349 -763 4478 3938 -12253 -14855 -15449 -11615 -7662 -14390 -20217 -16047 -16811 -18304
14474a8304Q189J3255q983l003N462O147l963m619j0751q08Q947J3868P489n441
$$ -18304 -10115 3140 -5843 -8846 -3384 2763 -1200 -5819 -16570 -17378 -8431 5437 12926 7485
14460G485N965q004j4042J130J5291p485l846P539P411m550R69n917q25K296m516
$$ 7485 13450 5446 -8596 -7466 7825 340 -3506 4033 11444 6894 7863 1946 1121 3417 -1099
14445a099q350N066L771l818M727M65j304k146J2501O435j0087p877j772j029
$$ -1099 -9449 -4383 -612 -4430 297 762 -542 -2688 9813 16248 6161 -1716 -3488 -4517
14431d517O055Nk414j930J5550J1276J833m036j269j4199q517r008l582K990J0161
$$ -4517 1538 1543 -871 -2801 12749 24025 25858 21822 20553 6354 -2163 -11171 -14753 -11763 -1602
14416a602p31r007j867J7807o956q967L731l42k672j859P35L580N347R45r559
$$ -1602 -2333 -11340 -13207 4600 -2356 -11323 -7592 -7934 -10606 -12465 -11730 -8150 -2803 -1858 -11417
14401a1417l391j393O719R534p965r731M629J0563J0180n779L560Q001j081l40
$$ -11417 -14808 -16201 -9482 52 -7913 -17644 -13015 -2452 7728 1949 5509 13510 12429 12089
14387A2089l524m476n613P639K988L827P309q636q673K831m149P78J1652M82j3832
$$ 12089 8565 4089 -1524 6115 9103 12930 20239 11603 2930 5761 1612 2390 14042 14524 692
14372F92j1327Q264L776M322r70k042r085n761K143J1063j38n667p029o093R920
$$ 692 -10635 -2371 1405 5727 4757 2715 -6370 -12131 -9988 1075 937 -4730 -11759 -17852 -7932
14357g932O877K071j2012k717p378J192O464J537l961R588l877J883R934Q69M297
$$ -7932 -1055 1016 -10996 -13713 -21091 -19899 -13435 -11898 -15859 -6271 -10148 -8265 1669 2538 6835
14342F835n052p152J971m805K50l70p215j274M365O225l918p234l874L909J0318
$$ 6835 1783 -5369 -3398 -8203 -7953 -8323 -15538 -16812 -12447 -6222 -10140 -17374 -21248 -17339 -7021
14327g021Q501n866N866N086n521M553L113P574k356j811q327j1273N657N883
$$ -7021 1480 -4386 1480 6566 1045 5598 8711 16285 13929 12118 3791 -7482 -1825 4058
14313D058M344j0586j2298m828n921o180J0239J3971Q284k445J8063J0983m155
$$ 4058 8402 -2184 -14482 -19310 -25231 -31411 -21172 -7201 1083 -1362 16701 27684 23529
14300B3529P522j431q785m569J839J2206k663j3567O065R717l502p869j1685n100
$$ 23529 31051 29620 20835 16266 18105 30311 27648 14081 20146 29863 26361 18492 6807 1707
14286A707J177P815k247n327J745K082j7587m338O612J5985R711j049p850l113
$$ 1707 2884 10699 8452 3125 4870 6952 -10635 -14973 -8361 7624 17335 16286 8436 5323
14272E323q885n18R561l73k849m266J814k941j72Q407L994p192r709j817P399
$$ 5323 -3562 -4080 5481 5108 2259 -2007 -193 -3134 -3306 5101 9095 1903 -7806 -9623 -2224
14257b224j714o412N818R310R7k86J658q26r788J136M296j745q382r1J0047O28
$$ -2224 -3938 -10350 -4532 4778 4875 4589 6247 5421 -4367 -3231 1065 -680 -9062 -9153 894 1522
14241A522n903j4974n373m371J1003J4419K59L625J3733p317k685j1459J1747
$$ 1522 -4381 -19355 -24728 -29099 -18096 -3677 -3418 207 13940 6623 3938 -7521 4226
14228D226J1240r778j16j254J587j978L024l564m717J0789J0364K848l077p699
$$ 4226 15466 5688 5572 4318 5905 3927 6951 3387 -1330 9459 19823 22671 19594 11895
14214A1895q960r534J733p304p032K264J0848M209m508k249M980R18L253J1924
$$ 11895 2935 -6599 -4866 -12170 -19202 -16938 -6090 -1881 -6389 -8638 -3658 -2740 513 12437
14200A2437j836q413p686j3327N887J6050j04m251L252n524J2288N246m307M48
$$ 12437 10601 2188 -5498 -18825 -12938 3112 3008 -1243 2009 -3515 8773 14019 9712 10160
14186A0160N85R25K411M429o190p398N447K714J672j950k939j351l14O498j136
$$ 10160 10745 11670 14081 18510 12320 4922 10369 13083 14755 12805 9866 8515 8201 14699 13563
14171A3563j276m58l305r177j3844M398L016Q963J4711q779j2146j9209j3548
$$ 13563 12287 11829 8524 -653 -14497 -10099 -7083 1880 16591 7812 -4334 -23543 -37091
14158c7091k578O391R044O638J8682P029Q953j0289k048O641j2504p834R758J2515
$$ -37091 -39669 -33278 -24234 -17596 1086 8115 17068 6779 4731 11372 -1132 -8966 792 13307
14144A3307K113m662o662j802k434m982N198j171J2884R629N213N274j5308r936
$$ 13307 15420 10758 4096 2294 -140 -5122 76 -1095 11789 21418 26631 31905 16597 6661
14130F661m941p431p566p07Q933N741o33k747m953k654J3743J2343j4138k0160
$$ 6661 1720 -5711 -13277 -13984 -5051 690 57 -2690 -7643 -10297 3446 15789 1651 -18509
14116a8509J0271P681K709O219M761N406J689M63j0080j1507j4103k247M320O321
$$ -18509 -8238 -557 2152 8371 13132 18538 20227 20690 10610 -897 -15000 -17247 -12927 -6606
14102f606R517R330L161m547q846O439J191p851p900L852J3089m45j418M916q89
$$ -6606 2911 12241 15402 10855 2009 8448 9639 1788 -6112 -2260 10829 10384 8966 13882 12993
14087A2993j8272l365N182N660m915M889n145m570M789k709P233R631o302j0679
$$ 12993 -5279 -8644 -3462 2198 -2717 2172 -2973 -7543 -2754 -5463 1770 11401 5099 -5580
14073e580o00j3433n50J3276Q160k171l66N761p442R84J0260Q108n947o571q512
$$ -5580 -6180 -19613 -20163 -6887 1273 -898 -1264 4497 -2945 -1961 8299 16407 10460 3889 -4623
14058d623L961j3980n620J3951J2227K349M650O470q38R84K319j5357r174m715
$$ -4623 -662 -14642 -20262 -6311 5916 8265 12915 19385 18547 19531 21850 6493 -2681 -7396
14044g396l468j178J2223K356K392M343j0344p935o046R274o71k341P255L803
$$ -7396 -10864 -12042 181 2537 4929 9272 -1072 -9007 -15053 -5779 -6450 -8791 -1536 2267
14030B267K451q047o20P694j3357K806J0295K345R322k64p084N073m59m824o706
$$ 2267 4718 -3329 -3949 3745 -9612 -6806 3489 5834 15156 14892 7808 12881 12422 7598 892
14015H92R894N830J681P78M12o648k0450L358O706r9o107J079M393N419n853K531
$$ 892 10786 16616 18297 19075 19487 12839 -7611 -4253 2453 2354 -3753 -2674 1719 7138 1285 3816
13999C816j0559p03O096n32m282K875j1020n736L562O471L577r264J1234J9049
$$ 3816 -6743 -7446 -1350 -1882 -6164 -3289 -14309 -20045 -16483 -10012 -6435 -15699 -4465 14584
13985A4584K597o566m921k012j3814n541R034J2058K254n564m321R30k613n03
$$ 14584 17181 10615 5694 3682 -10132 -15673 -6639 5419 7673 2109 -2212 -1282 -3895 -4398
13971d398n993k164j2446K279J1975J3659K074r18o62k13L182k852j4045K675
$$ -4398 -10391 -12555 -25001 -22722 -10747 2912 4986 4068 3406 3193 6375 3523 -10522 -7847
13957g847J643N811R96O610J743l973m262L134r295N037j170r178j3739R987J2396
$$ -7847 -6204 -393 603 7213 8956 4983 721 3855 -5440 -403 -1573 -10751 -24490 -14503 -2107
13942b107L798l298Q026o286o595k554l220k354N290J0210o7j3594O072J4409
$$ -2107 1691 -1607 6419 133 -6462 -9016 -12236 -14590 -9300 910 843 -12751 -6679 7730
13928G730k617J863K825p80m50L093Q32m760q442j2646J235M669R373k89Q894
$$ 7730 5113 6976 9801 9021 8571 11664 12496 7736 -706 -13352 -12117 -7448 1925 1636 10530
13913A0530n578j1560n040P976j172m689P716O26n006L546K823O147q543J102
$$ 10530 4952 -6608 -11648 -3672 -4844 -9533 -1817 -1191 -6197 -2651 172 6319 -2224 -1122
13899a122m52R926j0731j3682M618Q695J77L890K170K637m877Q03o79n597P659
$$ -1122 -1574 8352 -2379 -16061 -11443 -2748 -2571 1319 3489 6126 1249 2052 1373 -4224 3435
13884C435m67o111N353o268J3148k040j3618m308M226q468j4934m365K0069J5965
$$ 3435 2968 -3143 2210 -4058 9090 7050 -6568 -10876 -6650 -15118 -30052 -34417 -14348 1617
13870A617J037J051o265o491o103P8J6061J7777o911k146j7657P035j663p278
$$ 1617 2654 3705 -2560 -9051 -15154 -15076 985 18762 11851 9705 -7952 -917 -2580 -9858
13856i858j456P390J0556k034n969l301l34N094n648L148M48N147M850l72p604
$$ -9858 -11314 -3924 6632 4598 -1371 -4672 -5006 88 -5560 -2412 -1964 3183 8033 7661 57
13841E7j884m613p405K344J2179J163l564k372p713m398P314P262k320l043J1091
$$ 57 -1827 -6440 -13845 -11501 678 1841 -1723 -4095 -11808 -16206 -8892 -1630 -3950 -6993 4098
13826D098N390p497l005L115Q204r85m046k910K896J7267M177j2803j6917j3762
$$ 4098 9488 1991 -1014 2101 10305 9320 5274 2364 5260 22527 26704 13901 -3016 -16778
13812a6778K472q345P59k167J1414J0218J408J3260k525j4404J61j270O677L630
$$ -16778 -14306 -22651 -21892 -24059 -12645 -2427 -1019 12241 9716 -4688 -4527 -5797 880 4510
13798D510o561k342M613n109N397k268P13L202j184k4P407O024M984r419k420
$$ 4510 -2051 -4393 220 -4889 508 -1760 -1047 2155 971 947 8354 14378 19362 9943 7523
13783G523M253o292l877M755K322k20J316j910n766m769K687P968L080J0133O452
$$ 7523 11776 5484 1607 6362 8684 8464 9780 7870 2104 -2665 22 7990 11070 21203 27655
13768B7655O929O0k21j2954j5875l088L915N828J0572j1121o880P97O700P528
$$ 27655 34584 34644 34423 21469 5594 2506 6421 12249 22821 11700 4820 5617 12317 19845
13754A9845l750j3235k159N929K092N474j2945O999J0415m22M425L629j1463p274
$$ 19845 16095 2860 701 6630 8722 14196 1251 8250 18665 18243 22668 26297 14834 7560
13740G560j706J96j575K752Q436p683j1457L011J7925R833r739m442n156O179
$$ 7560 5854 6050 4475 7227 15663 7980 -3477 -466 17459 27292 17553 13111 7955 14134
13726A4134J2179j0467k3275n407J980O430o308l351J4100J7072J1760j4341j0524
$$ 14134 26313 15846 -7429 -12836 -10856 -4426 -10734 -14085 15 17087 28847 14506 3982
13713C982n28Q107m138j0684M202r34m264l49l873Q247P590Q021j4054n788o273
$$ 3982 3454 11561 7423 -3261 941 7 -4257 -4606 -8479 -232 7358 15379 1325 -4463 -10736
13698a0736j6092K354J303O154J2317M095n576r367k26o460L345O700J6478K885
$$ -10736 -26828 -24474 -23171 -17017 -4700 -605 -6181 -15548 -15774 -22234 -18889 -12189 4289 7174
13684G174M518m830j1553L885q122P65k648p402N217L661n705K509J2632J940
$$ 7174 11692 6862 -4691 -806 -8928 -8163 -10811 -18213 -12996 -9335 -15040 -12531 101 2041
13670B041r506j0120J5694q397n192r322m533J3102o031j32R878P921N559m959
$$ 2041 -7465 -17585 -1891 -10288 -15480 -24802 -29335 -16233 -22264 -22396 -12518 -4597 962 -3997
13656c997M582J169j10K651m554j3081l715N681N89Q780J1572k855j1301P01J7860
$$ -3997 585 1754 1644 4295 -259 -13340 -17055 -11374 -10785 -2005 9567 6712 -4589 -3888 13972
13641A3972J6193n577j5205o128n240M438K767R359n19m798m200j1560K088n66
$$ 13972 30165 24588 9383 3255 -1985 2453 5220 14579 14060 9262 5062 -6498 -4410 -4976
13627d976r064r078M714J866L364n367J5338Q146R76J171o048L667J080j342r486
$$ -4976 -14040 -23118 -18404 -16538 -13174 -18541 -3203 4943 5919 7090 1042 4709 5789 4447 -5039
13612e039J829J1685J652J3779l754j7951m921N700K999P101r716k227O663j719
$$ -5039 -3210 8475 10127 23906 20152 2201 -2720 2980 5979 13080 3364 1137 7800 6081
13598F081K995P086O194r801m504M718k118P71P188n916j3385O45Q564L963k0251
$$ 6081 9076 16162 22356 12555 8051 12769 10651 11422 18610 12694 -691 -46 8518 12481 -7770
13583g770m645J614R594M881J1218L736L509m54j2337p668J94J156J723n403m141
$$ -7770 -12415 -10801 -1207 3674 14892 18628 22137 21683 9346 1678 1872 3028 4751 -652 -4793
13568d793m327M281M454p61R137K75m082k451k564K954o8l1L934J685k218J297
$$ -4793 -9120 -4839 -385 -1146 7991 8266 4184 1733 -831 2123 2055 2024 5958 7643 5425 6722
13552F722K726j918K561p184o092J462m990l674J0076Q055N077n533j421q283
$$ 6722 9448 7530 10091 2907 -3185 -1723 -6713 -10387 -311 7744 12821 7288 5867 -2416
13538b416M691O702q053j3950j1086O862Q085J4541L68j558p217o043L412Q932
$$ -2416 2275 8977 924 -13026 -24112 -17250 -9165 5376 5744 4186 -3031 -9074 -5662 3270
13524C270O680N467l655L95k977l414m501j0696k907m488L175P482R37j0375N222
$$ 3270 9950 15417 11762 12157 9180 5766 1265 -9431 -12338 -16826 -13651 -6169 -5232 -15607 -10385
13509a0385P975N26P282M967L613N541O09j3963N643J1179J9286m152o45j2718
$$ -10385 -2410 -1884 5398 10365 13978 19519 20128 6165 11808 22987 42273 38121 37476 24758
13495B4758q264R695n663J120q774p783r283J2789Q347j0333j2079l537R398p079
$$ 24758 16494 26189 20526 21646 12872 5089 -4194 8595 16942 6609 -5470 -9007 391 -6688
13481f688k177M313J0837N25o440K525L377m385L451N762k427k68P05K568L255
$$ -6688 -8865 -4552 6285 6810 370 2895 6272 1887 5338 11100 8673 8405 9110 11678 14933
13466A4933n358O171p232j4743M142l478l723M031k358K178L890j480J8757N603
$$ 14933 9575 15746 8514 -6229 -2087 -5565 -9288 -5257 -7615 -5437 -1547 -3027 15730 21333
13452B1333l813n755M257M720j0630n528k220m379l281R917k169l729j0788J016
$$ 21333 17520 11765 16022 20742 10112 4584 2364 -2015 -5296 4621 2452 -1277 -12065 -11049
13438a1049L207j823J52k85P060k541M493P197J5531m867o390J874M298r613l263
$$ -11049 -7842 -9665 -9513 -9798 -2738 -5279 -786 6411 21942 17075 10685 12559 16857 7244 3981
13423C981O92J0435M842j237J041m846N295Q059J074K806L242M445m962j3230
$$ 3981 4673 15108 19950 18713 19754 14908 20203 28262 29336 32142 35384 39829 34867 21637
13409B1637p60m064Q2l120j3242k32O584J0406k47O231m908p786o494j00j746
$$ 21637 20877 16813 16895 13775 533 301 6885 17291 17044 23275 18367 10581 4087 3987 2241
13394B241j663N923R136K699o20K818q435P515K983k03O016k891k576j1594r392
$$ 2241 578 6501 15637 18336 17716 20534 12099 19614 22597 22394 28410 25519 22943 11349 1957
13379A957m198l918n836j856J4102J4220N360r973r771L33j732J537Q723l569
$$ 1957 -2241 -6159 -11995 -13851 251 14471 19831 9858 87 420 -1312 225 8948 5379
13365E379m707j0066l59k519O04Q34K321k367q294O22J2241J1552n720L465Q510
$$ 5379 672 -9394 -9753 -12272 -11668 -10834 -8513 -10880 -19174 -18552 -6311 5241 -479 2986 11496
13350A1496n198j0477M627O619q096O214R728p662K629N063M481K650j0388o63
$$ 11496 6298 -4179 448 7067 -1029 5185 14913 7251 9880 14943 19424 22074 11686 11023
13336A1023j475j298N927N073L830n450J102J4008K61q904r324L315l416K52K686
$$ 11023 9548 8250 14177 19250 23080 17630 18732 32740 33001 24097 14773 18088 14672 14924 17610
13321A7610M312K505L327j3M639k112M990n414r997L528J2227j0888j7246M65
$$ 17610 21922 24427 27754 27741 32380 30268 35258 29844 19847 23375 35602 24714 7468 7933
13307G933J0350p635O557J2852J2350p277j3890n552M335O538n234q54O75K280
$$ 7933 18283 10648 17205 30057 42407 35130 21240 15688 20023 26561 21327 20473 21148 23428
13293B3428n985q323o77l290M678J636N315k618p096q783K031l589L837M217K729
$$ 23428 17443 9120 8443 5153 9831 11467 16782 14164 7068 -1715 316 -3273 564 4781 7510
13278G510m954L450m224j042J4511j359J1287L724J918j3446m104J767L080RJ313
$$ 7510 2556 6006 1782 740 15251 13892 25179 28903 30821 17375 13271 15038 18118 18127 19440
13263A9440J0953J717P513N996o650J2594J3058J586K728J4072J2233J1140N822
$$ 19440 30393 32110 39623 45619 38969 51563 64621 66207 68935 83007 95240 106380 112202
13250A12202K3680J6654K2532L2792M5221M7511P9301R4597R8733P8588M8639
$$ 112202 135882 152536 175068 207860 253081 300592 379893 474490 573223 651811 700450
13239G00450J4998J985L09k069l6720o4969r0831j04296q6633o6198o0064l5337
$$ 700450 715448 717433 717742 715673 678953 613984 523153 418857 332224 266026 205962 170625
13227A70625k3506j0171j8036k6878k1746q215J407k898r133j040M676j1450j2037
$$ 170625 147119 136948 118912 92034 70288 62073 63480 60582 51449 50409 55085 43635 31598
13214C1598N708J1727J5102k707j2491K130L077j7638k1754J68j269L807m325
$$ 31598 37306 49033 64135 61428 48937 51067 54144 36506 14752 14920 13651 17458 13133
13201A3133p267J2222J851P235p762r905N649M32Q282Q229O950J229n03p594m896
$$ 13133 5866 18088 19939 27174 19412 9507 15156 15588 23870 32099 39049 40278 39775 32181 27285
13186B7285K709p282K677j0910q132J1223J7095L281q011n805j4774k065O77p40
$$ 27285 29994 22712 25389 14479 6347 17570 34665 37946 29935 24130 9356 7291 7968 7228
13172G228J0865J3686J1872j0718j2277l943m726m685N988M407J6166j859J920
$$ 7228 18093 31779 43651 32933 20656 16713 11987 7302 13290 17697 33863 32004 33924
13159C3924K599L609K962O512j4327j8500P609r748j1645m033N893O783p71N156
$$ 33924 36523 40132 43094 49606 35279 16779 24388 14640 2995 -1038 4855 11638 10867 16023
13145A6023O282l733j2515m156m32l917Q218P686m285l265N642J6633O271j2564
$$ 16023 22305 18572 6057 1901 1469 -2448 5770 13456 9171 5906 11548 28181 34452 21888
13131B1888K333M334j4746K51N782J4230j3728k050K644k5j4071k354P318J358
$$ 21888 24221 28555 13809 14060 19842 34072 20344 18294 20938 20913 6842 4488 11806 13164
13117A3164k665K665J4829R281J9905O841k643j4997j1162m530N257m38L694j2525
$$ 13164 10499 13164 27993 37274 57179 64020 61377 46380 35218 30688 35945 35507 39201 26676
13103B6676n693K58P661l86K463J649M730J2138j2393j2504m419q338K1P844J1988
$$ 26676 20983 21241 28902 28516 30979 32628 37358 49496 37103 24599 20180 11842 11863 19707 31695
13088C1695R383r627q043k691Q307j401j2392J4943P707J8420N877j4861r00K197
$$ 31695 41078 31451 23408 20717 29024 27623 15231 30174 37881 56301 62178 47317 46417 48614
13074D8614J466M067k56m931m691j611J6388M307L509L780M170o21K2108J8964
$$ 48614 50080 54147 53891 48960 44269 42658 59046 63353 66862 70642 74812 74191 96299 115263
13060A15263J6546L26r871k4913L223k059k1803r271k1229K261J7729n639r268
$$ 115263 131809 132135 122264 97351 100574 98515 76712 67441 46212 48473 66202 60563 51295
13047E1295K575r47l696j301m809K566M367j149j7027j0029j069l183m331M972
$$ 51295 53870 52923 49227 47926 43117 45683 50050 48901 31874 21845 20776 17593 13262 18234
13033A8234J4075J6363k50p762p830j641O445Q346M78P55M959j386J842N896k770
$$ 18234 32309 48672 48422 40660 32830 31189 37634 45980 46458 47213 52172 50786 52628 58524 55754
13018E5754m957L025J637o924l909L750j1770k655L105L845j1112k529O957j2254
$$ 55754 50797 53822 55459 48535 44626 48376 36606 33951 37056 40901 29789 27260 34217 21963
13004B1963j0613N427j2421j2534j9147o075l294q636K077Q889K889J0360M962
$$ 21963 11350 16777 4356 -8178 -27325 -33400 -36694 -45330 -43253 -34364 -31475 -21115 -16153
12991a6153J2824J3505J7143l830M470M387O61L556n185Q031J0471p087j2375
$$ -16153 -3329 10176 27319 23489 27959 32346 33007 36563 31378 39409 49880 42793 30418
12978C0418N645j5865K667J9060R181L585j524K984M466o66L90j5183j3995j7446
$$ 30418 36063 20198 22865 41925 51106 54691 53167 56151 60617 59951 60341 45158 31163 13717
12964A3717q997Q966J4522n772j6547p390J0878P201Q585J298P779R558R150M169
$$ 13717 4720 13686 28208 22436 5889 -1501 9377 16578 25163 26461 34240 43798 52948 57117
12950E7117P028P56P897K229p019J045J259N897Q438R255J8734P797J0951K4265
$$ 57117 64145 64901 72798 75027 68008 69053 70312 76209 84647 93902 112636 120433 131384 155649
12936A55649K5599K3226K7386R182K9874Q797J979J0358o648j789j2135j4530
$$ 155649 181248 204474 231860 241042 270916 279713 281692 292050 285402 283613 271478 256948
12924B56948j9435k194j565p316p452r634q054K955o972q260J0320l669q557l921
$$ 256948 237513 235319 233754 226438 218986 209352 201298 204253 197281 189021 199341 195672 187115 183194
12910A83194P067K19J515Q314R408n024p976o031N084J2912M640K781P137J3746
$$ 183194 190261 190480 191995 200309 209717 204693 196717 190686 195770 208682 213322 216103 223240 236986
12896B36986P737o159o976k777J1975J8573J2631K3769K1458l261k551K2515J5940
$$ 236986 244723 238564 231588 228811 240786 259359 271990 295759 317217 313956 311405 333920 349860
12883C49860J2291K952J748K673P000J4779J0019M110J6116J4823L036N002Q336
$$ 349860 362151 365103 366851 369524 376524 391303 401322 405432 421548 436371 439407 444409 452745
12870D52745J6217J0087J0120K6938J7094J0594O751J4338K2615K9630K7950J6023
$$ 452745 468962 479049 489169 516107 533201 543795 550546 564884 587499 617129 645079 661102
12858F61102L0618M2550M3856K5351M4921P5739O7221N4192N5860O8149Q1786
$$ 661102 691720 734270 778126 803477 848398 924137 991358 1045550 1101410 1169559 1251345
12847A251345R3982Q0807Q3087J02536J11946J09719J10810J18808J41958J58537
$$ 1251345 1345327 1426134 1509221 1611757 1723703 1833422 1944232 2063040 2204998 2363535
12837B363535J88675K13037K64810L14686L45055L91023M43428N19893O10628
$$ 2363535 2552210 2765247 3030057 3344743 3689798 4080821 4524249 5044142 5654770
12828E654770O73721P41198Q39105R10017R84836J048479J147480J329309J569465
$$ 5654770 6328491 7069689 7908794 8818811 9803647 10852126 11999606 13328915 14898380
12819A4898380J892255K329701K944875L766250M939949O621602Q953930J2120300
$$ 14898380 16790635 19120336 22065211 25831461 30771410 37393012 46346942 58467242
12811E8467242J5803076J8568121J7709058J1940336M490443L37204M97633Q08680
$$ 58467242 74270318 92838439 110547497 122487833 126978276 127315480 127813113 128621793
12803A28621793l035396j0379396j6540708j8397549j6758843j3784071j0732099
$$ 128621793 125586397 115207001 98666293 80268744 63509901 49725830 38993731
12796C8993731q102211o034050m487935l397328k601658k014213j610847j334716
$$ 38993731 30891520 24857470 20369535 16972207 14370549 12356336 10745489 9410773
12788I410773j114756r14441p44803o64686o21900n53908m73534m17205l65790
$$ 9410773 8296017 7381576 6636773 5972087 5350187 4796279 4322745 3905540 3539750
12779C539750l17848k70053k25064j96143j97245j76893j42316j33479j34301
$$ 3539750 3221902 2951849 2726785 2530642 2333397 2156504 2014188 1880709 1746408
12770A746408j27343r6802q8901r2921o1130p6217o6419m1881m0310l0798l1540
$$ 1746408 1619065 1522263 1433362 1340441 1279311 1203094 1136675 1094794 1054484 1023686 992146
12759I92146n2766n2449k7988p437j5307k1357k9634k5409k7284j9867k2282k4816
$$ 992146 939380 886931 858943 851506 836199 814842 785208 759799 732515 712648 690366 665550
12747F65550j6988l0701l6901k5498j4320J4669j344j4204l9263k9420k1207j4318
$$ 665550 648562 617861 580960 555462 541142 555811 554467 540263 501000 471580 450373 436055
12735D36055j9485j3398k1401j9484k7223j1791j4966p110L325Q012r534j4774
$$ 436055 416570 403172 381771 362287 335064 323273 308307 301197 304522 312534 303000 288226
12723B88226j030J5405l869r948j9349k1273k718J2771P13k16j5477j630R17K020
$$ 288226 287196 302601 298732 288784 269435 248162 245444 258215 258928 258712 243235 241605 242522 244542
12709B44542Q454K652m030j1877j3104k420k297m696M794j550n017j5614j8267
$$ 244542 252996 255648 251618 239741 226637 224217 221920 217224 222018 220468 215451 199837 181570
12696A81570j7243N221J793m582k3669k4209j6821o228j7434j5648j2988J304
$$ 181570 164327 169548 171341 166759 143090 118881 102060 95832 78398 62750 49762 51066
12684E1066q813n867p228q147K53N345Q486J1287J7765Q152J7532J7988J3915
$$ 51066 42253 36386 29158 21011 21264 26609 35095 46382 64147 72299 89831 107819 121734
12671A21734j38P553J6023R085o790J778J0356J626j6789M083O828P458k959n549
$$ 121734 121596 129149 145172 154257 147467 149245 159601 161227 144438 148521 155349 162807 159848 154299
12657A54299O62k188k036R613l989q092M608r783N596R097n020j5747r931j5708
$$ 154299 154961 152773 150737 160350 156361 148269 152877 143094 148690 157787 152767 137020 127089 111381
12643A11381l567k817n847J282N353l888j404m248j1784M615J741p925J218Q128
$$ 111381 107814 104997 99150 100432 105785 101897 100493 96245 84461 89076 90817 82892 84110 92238
12629I2238j4107r668J1169J4309K325K803R560N209R729m064M26M856J0615P873
$$ 92238 78131 68463 79632 93941 96266 99069 108629 113838 123567 119503 119929 124785 135400 143273
12615A43273l637n396p296m55m357m646K491K688j7659j3328r964j2284p49l752
$$ 143273 139636 134240 126944 126489 122132 117486 119977 122665 105006 91678 81714 69430 68681 64929
12601F4929j8795r917j576p123n120J2097O345m310j105k700J2158l690o542j5630
$$ 64929 46134 36217 34641 27518 22398 34495 40840 36530 35425 32725 44883 41193 34651 19021
12587A9021l80R500K402n733n976J0321J1372Q088r890J6373N413L190m23m9J993
$$ 19021 18641 28141 30543 24810 18834 29155 40527 48615 38725 55098 60511 63701 63278 63229 65222
12572F5222P324j0224j8041j685o868j157L806q68q787j3129J0748J3369K003
$$ 65222 72546 62322 44281 42596 35728 34571 38377 37509 28722 15593 26341 39710 41713
12559D1713l253M31j5783L538J4857P369l736M202l684j0067P885Q71N120R102
$$ 41713 38460 38891 23108 26646 41503 48872 45136 49338 45654 35587 43472 44343 49463 58565
12545E8565O70j5617q705O879r38m542l124J262J1477p376m733k901Q636j691
$$ 58565 59235 43618 34913 41792 40854 36312 33188 34450 45927 38551 33818 30917 39553 37862
12531C7862m086J882m499m199J949j296j1252j2894L554L129L251J718Q462p01
$$ 37862 33776 35658 31159 26960 28909 27613 16361 3467 7021 10150 13401 15119 23581 22880
12517B2880J4582K093o124M407J9851M291n306r010j074P138r045j4328j264L710
$$ 22880 37462 39555 33431 37838 57689 61980 56674 47664 46590 53728 44683 30355 29091 32801
12503C2801L010L937P332Q913M714J112J0003R042N038J5554J1280N189J7557
$$ 32801 35811 39748 47080 55993 60707 61819 71822 80864 85902 101456 112736 117925 135482
12490A35482J3321J6928L2694M5903N8202O7547J13205J64661J17632j0496o3207
$$ 135482 148803 165731 198425 244328 302530 370077 483282 647943 765575 755079 691872
12479F91872l9913K7063O8224O5837n5139j43242j43175j05195r4512o8498m8206
$$ 691872 651959 679022 747246 813083 757944 614702 471527 366332 271820 203322 155116
12468A55116l5837k6142k4249J371P560q542M145M337l660m126k834j1266j8943
$$ 155116 119279 93137 68888 70259 77819 69277 73422 77759 74099 69973 67139 55873 36930
12455C6930j3513j818M957o39p706R355N116l713n056P424J3724K823q959j8067
$$ 36930 23417 21599 26556 25917 18211 27566 32682 28969 23913 31337 45061 47884 38925 20858
12441B0858M299n225o973j377j959k384J1170J2600m893l33j0034l186n341m239
$$ 20858 25157 19932 12959 11582 9623 7239 18409 31009 26116 25783 15749 12563 7222 2983
12427B983L11J0577J2298q371l02m951k62Q177K67k882L288J3450m094q220j0779
$$ 2983 3294 13871 26169 17798 17496 12545 12283 20460 20727 17845 21133 34583 30489 22269 11490
12412A1490n492J791R388r69n608j996J3574Q199M501N518j141k375l563q29k471
$$ 11490 5998 7789 17177 16208 10600 8604 22178 30377 34878 40396 39255 36880 33317 32488 30017
12397C0017o094L673Q788j922m830K697J2168J850j737R182J0510O254L236J7088
$$ 30017 23923 27596 36384 34462 29632 32329 44497 46347 44610 53792 64302 70556 73792 90880
12383I0880M273M753J2677P506K384M880L0439K7650L0735N4465P4865R8948J07140
$$ 90880 95153 99906 112583 120089 122473 127353 157792 185442 216177 270642 345507 444455 551595
12370E51595Q6528M1237J5648P559p459P25j4400n2771r9800r5904r2252p8491
$$ 551595 638123 679360 695008 702567 695108 695833 681433 628662 528862 432958 340706 262215
12358B62215n7940l6410k9933j6722k2073p138J1224j2822k2065r456r990J48
$$ 262215 204275 167865 137932 121210 99137 91999 103223 90401 68336 58880 48890 49038
12346D9038K47j0520N423n61o421L493q553J786K303m630O124O587J667o085q124
$$ 49038 49285 38765 44188 43627 37206 40699 32146 33932 36235 31605 37729 44316 45983 39898 31774
12331C1774M78p512N961l526l589O365L756q047j0057R29J3246P66j3170j3414
$$ 31774 32252 24740 30701 27175 23586 29951 33707 25660 15603 16532 29778 30544 17374 3960
12317C960j12R157J449q500k054J6135P398j3447j0669Q51n814m271O994N310
$$ 3960 3848 13005 14454 5954 3900 20035 27433 13986 3317 4168 -1646 -5917 1077 6387
12303F387N407J74l822O189L03l065P385Q623J309k854l984q161j5485j029N189
$$ 6387 11794 11968 8146 14335 14638 11573 18958 27581 28890 26036 22052 13891 -1594 -2623 2566
12288B566J3003j0715m905p425j280P503O243K892K701P7j1991j750J3476R754
$$ 2566 15569 4854 -51 -7476 -8756 -1253 4990 7882 10583 10660 -1331 -3081 10395 20149
12274B0149M242N82j1923R568J526j0824k315N527l7j02q983P723J147r803j1985
$$ 20149 24391 24973 13050 22618 24144 13320 11005 16532 16495 16393 7410 15133 16280 6477 -5508
12259e508n066J0063m826J932N875L452K618L100m500p130j5037L796J2422j666
$$ -5508 -10574 -511 -5337 -3405 2470 5922 8540 11640 7140 10 -15027 -11231 1191 -475
12245d75o065m133k338J2009R642J991n342P424M262n924K060N163q410p67K076
$$ -475 -6540 -10673 -13011 -1002 8640 10631 5289 12713 16975 11051 13111 18274 9864 9097 11173
12230A1173n567k944j200O718J245l247K584L64r296O159R801n190J024K2229
$$ 11173 5606 2662 1462 8180 9425 6178 8762 9126 -170 5989 15790 10600 11624 33853
12216C3853N485n799j3774j1261j4202k564Q884N294Q948m693N070J2438n13j0798
$$ 33853 39338 33539 19765 8504 -5698 -8262 622 5916 14864 10171 15241 27679 27166 16368
12202A6368j1729J0141K614o656q315n05J545N20o62L754M41J0458p271l470K762
$$ 16368 4639 14780 17394 10738 2423 1918 3463 3983 3321 7075 7516 17974 10703 7233 9995
12187I995r725l647K117L689p298j448k923j171R118J0786J657O71m039m227R33
$$ 9995 270 -3377 -1260 2429 -4869 -6317 -9240 -10411 -1293 9493 11150 11821 7782 3555 4488
12172D488n856J546J2962K752j0796R167J0946r089r351m033P854J3451l802j6839
$$ 4488 -1368 178 13140 15892 5096 14263 25209 16120 6769 2736 10590 24041 20239 3400
12158C400J732J0545j0664j496k326l151Q021Q086J8726o651j2853r55n866l132
$$ 3400 5132 15677 5013 3517 1191 -1960 6061 14147 32873 26222 13369 12414 6548 3416
12144C416k227k212p401o685Q858J0487N000q006j078J020l327m219P335J0976
$$ 3416 1189 -1023 -8424 -15109 -6251 4236 9236 1230 152 1172 -2155 -6374 961 11937
12130A1937L162m58J0159r16l586J47O852q96o055k575j910m22m339M343J32m216
$$ 11937 15099 14641 24800 23884 20298 20445 27297 26401 20346 17771 15861 15439 11100 15443 15575 11359
12114A1359r768m459J1200l85j147j1580j017Q647n258L805P346r457O20m51n913
$$ 11359 1591 -2868 8332 7947 6800 -4780 -5797 2850 -2408 1397 8743 -714 -94 -545 -6458
12099f458M308n55p767o863K565K18Q54J467P962l285L561J996J3751J1574N661
$$ -6458 -2150 -2705 -10472 -17335 -14770 -14552 -13698 -12231 -4269 -7554 -3993 -1997 11754 23328 28989
12084B8989n612m807j108O079j5057j3352J4701J3370k1063m967J7325o825n347
$$ 28989 23377 18570 17462 23541 8484 -4868 9833 23203 2140 -2827 14498 7673 2326
12071B326k837m808o533L908O180Q86J1533N411j0307N926K393L669N351L03j439
$$ 2326 -511 -5319 -11852 -7944 -1764 -878 10655 16066 5759 11685 14078 17747 23098 23401 21962
12056B1962j0482q808l683R279M34j699M047n23o1j0438j0144J1942j0541j234
$$ 21962 11480 2672 -1011 8268 8702 7003 11050 10527 10466 28 -10116 1826 -8715 -9949
12042i949J6243m37p407M524l91m387L479K333k504p733l510J1033j173r5J048
$$ -9949 6294 5857 -1550 2974 2583 -1804 1675 4008 1504 -6229 -9739 1294 121 26 1074
12027A074m07l537K460l832K548J012k164k764J1036l093l669Q040P352P377j0868
$$ 1074 667 -2870 -410 -4242 -1694 -682 -2846 -5610 5426 2333 -1336 6704 14056 21433 10565
12012A0565p586m887j482J1003O065l78P068L429j4627q717k527N018J3851J2646
$$ 10565 2979 -1908 -3390 7613 13678 13300 20368 23797 9170 453 -2074 2944 16795 29441
11998B9441L103l866j2387n168L094o184K582P121N661m169j0205j5213p795k743
$$ 29441 32544 28678 16291 11123 14217 8033 10615 17736 23397 19228 9023 -6190 -13985 -16728
11984a6728R333K686o097P22J3496J0913K299r307l557K162k750K310J1601R369
$$ -16728 -7395 -4709 -10806 -10084 3412 14325 16624 7317 3760 5922 3172 5482 17083 26452
11970B6452p657j4625j2101K775R330N004L593q123l847O195P157q245k614O704
$$ 26452 18795 4170 -7931 -5156 4174 9178 12771 4648 801 6996 14153 5908 3294 9998
11956I998P144m219r16p56n205q808q142j0572L802J6610J2245m55n689j3225
$$ 9998 17142 12923 12007 11251 6046 -2762 -10904 -21476 -17674 -1064 11181 10726 5037 -8188
11942h188k695O791K694j1057q923P622P958j500M661j0410J914L186K14N702
$$ -8188 -10883 -4092 -1398 -12455 -21378 -13756 -5798 -7298 -2637 -13047 -11133 -7947 -7733 -2031
11928b031k982j169K6j447m42Q181N868n845n427M819n150j238l230N100N766
$$ -2031 -5013 -6182 -6156 -7603 -8045 136 6004 159 -5268 -449 -5599 -6837 -10067 -4967 799
11913G99L260J118n880P28k54r029l516M964P105K331O01p747K965J3441P943
$$ 799 4059 5177 -703 25 -229 -9258 -12774 -7810 -705 1626 2227 -5520 -2555 10886 18829
11898A8829j548J647j1194j1211k579J131J523N210r93j1298p000Q183P989L050
$$ 18829 17281 18928 7734 -3477 -6056 -4925 -3402 1808 815 -10483 -17483 -9300 -1311 1739
11884A739q83J1348J8120m929j0600K288o574j1119L343j269j3951n69l630N710
$$ 1739 856 12204 30324 25395 14795 17083 10509 -610 2733 1464 -12487 -13056 -16686 -10976
11870a0976l91l993J429J5458J061M208P079J0544J582J398p772j3541q759q388
$$ -10976 -11367 -15360 -13931 1527 2588 6796 13875 24419 26001 27399 19627 6086 -2673 -11061
11856a1061Q82M00o158p795J3196J3845O69P39m517N245L774M762n399j0598j468
$$ -11061 -10179 -9779 -15937 -23732 -10536 3309 3978 4717 200 5445 9219 13981 8582 -2016 -3484
11841c484R053k498P33J884q208j102r212Q96R540n487P42M634K322N366j08J395
$$ -3484 5569 3071 3804 5688 -2520 -3622 -12834 -11938 -2398 -7885 -7143 -2509 -187 5179 5071 6466
11825F466n812N974O650k2262l630Q969j3563L351J3365l221p354L427J422K372
$$ 6466 654 6628 13278 -8984 -12614 -3645 -17208 -13857 -492 -3713 -11067 -7640 -6218 -3846
11811c846J817Q618K568l247q486Q273r9r018P02n37j1154m051p55N736K0853
$$ -3846 -2029 6589 9157 5910 -2576 5697 5598 -3420 -2718 -3255 -14409 -18460 -19215 -13479 7374
11796G374R09K428Q68r405q692k619Q751Q174P039O26l04j6309r605L438J306
$$ 7374 8283 10711 11579 2174 -6518 -9137 -386 7788 14827 15453 15149 -1160 -10765 -7327 -6021
11781f021K773n974L326P949J990j5825J232J2046O427j751m160j5428M317N673
$$ -6021 -3248 -9222 -5896 2053 4043 -11782 -10550 1496 7923 6172 2012 -13416 -9099 -3426
11767c426l894L05J2524Q221n071j2138N075K358M48O150o594J183l331k095q389
$$ -3426 -7320 -7015 5509 13730 8659 -3479 1596 3954 4402 10552 3958 5141 1810 -285 -8674
11752h674Q867J3149O510l793M6n093p7l786j5225K925Q374q247l960j1060n81
$$ -8674 193 13342 19852 16059 16105 11012 10935 7149 -8076 -5151 3223 -5024 -8984 -20044 -20625
11737b0625Q605o575N277J4384j726o310O840p301j43r36l349n453k175L251R238
$$ -20625 -12020 -18595 -13318 1066 -660 -6970 -130 -7431 -7574 -8510 -11859 -17312 -19487 -16236 -6998
11722f998J6449Q929l510o22J0852o284k859l813m599k513M304O223J37p554n499
$$ -6998 9451 18380 14870 14248 25100 18816 15957 12144 7545 5032 9336 15559 15696 8142 2643
11707B643K00l175k590M005J484k922n609O392O354o607k007j876J767K7J1516
$$ 2643 2843 -332 -2922 1083 2567 -355 -5964 428 6782 175 -1832 -3708 -1941 -1914 9602
11692I602J1884j0237o822O929O639O498O182o062n841m194q525k0969j876J0572
$$ 9602 21486 11249 4427 11356 17995 24493 30675 24613 18772 14578 6053 -14916 -16792 -6220
11678f220R736K086o495l120k739l212q758r19K035L084n240k681L253J3417m201
$$ -6220 3516 5602 -893 -4013 -6752 -9964 -18722 -19641 -17606 -14522 -19762 -22443 -19190 -5773 -9974
11663i974k409J094L623J3910Q695n660m001J949p435Q481q96l268K309q016o114
$$ -9974 -12383 -11289 -7666 6244 14939 9279 5278 7227 -208 8273 7377 4109 6418 -1598 -7712
11648g712m248O92N639p69l174q94O85p090Q670j349j892P380J4380N980l329
$$ -7712 -11960 -11268 -5629 -6398 -9572 -10466 -9781 -16871 -8201 -9550 -11442 -4062 10318 16298 12969
11633A2969j692L513j099P824p144j0739k111L545m477l285m03N263L269m050
$$ 12969 11277 14790 13691 21515 14371 3632 1521 5066 589 -2696 -3099 2164 5433 1383
11619A383l585l614J176o988q869M675J0626L314K686J0605K380j1790r542m614
$$ 1383 -2202 -5816 -4640 -11628 -20497 -15822 -5196 -1882 804 11409 13789 1999 -7543 -12157
11605a2157k282K620M990j4228K249J6303O573n291q184P362P388j3790m511O378
$$ -12157 -14439 -11819 -6829 -21057 -18808 -2505 4068 -1223 -9407 -2045 5343 -8447 -12958 -6580
11591f580O012J6465M734j0693l104R143l18o677r075l986m199J5289m6q606K636
$$ -6580 -568 15897 20631 9938 6834 15977 15659 8982 -93 -4079 -8278 7011 6965 -1641 995
11576I95J0980J0721j1387j8285l125J083m594P427k115Q397Q510p698l236J00
$$ 995 11975 22696 11309 -6976 -10101 -9018 -13612 -6185 -8300 97 8607 909 -2327 -2227
11562b227Q175M283O04r428j165l709l829n09M99L706j652Q245o902q032l218
$$ -2227 5948 10231 10835 1407 242 -3467 -7296 -7805 -7306 -3600 -5252 2993 -3909 -11941 -15159
11547a5159K791J632J3642R126q201k51M812l196j6151j192J7048O140M50m251
$$ -15159 -12368 -10736 2906 12032 3831 3580 8392 5196 -10955 -12147 4901 11041 11491 7240
11533G240J899Q792K846j4590j127k503K105J1813m070j675O240j627j770o039
$$ 7240 9139 17931 20777 6187 5060 2557 4662 16475 12405 10730 16970 15343 13573 7534
11519G534p634P866m752M599J3897m702j5859o460R102J2556R163l04p656k252
$$ 7534 -100 7766 3014 7613 21510 16808 949 -5511 3591 16147 25310 25006 17350 15098
11505A5098j166J423j1989J965Q593Q325P94m601r190o288k234o542P438J3603
$$ 15098 13932 15355 3366 5331 13924 22249 23043 18442 9252 2964 730 -5812 1626 15229
11491A5229n917l196q238p817J1680Q577q232p944n335j393O003J9020M605m697
$$ 15229 9312 6116 -2122 -9939 1741 10318 2086 -5858 -11193 -12586 -6583 12437 17042 12345
11477A2345L552j1435n018L918M36o090m78R46J2735l667n716J331N661Q837J151
$$ 12345 15897 4462 -556 3362 3798 -2292 -2770 -1824 10911 7244 1528 2859 8520 17357 18508
11462A8508R278J999q370j3263J077j1010j166K007p036q36P478K439O470J486
$$ 18508 27786 29785 21415 8152 9229 -1781 -2947 -940 -7976 -8812 -1334 1105 7575 9061
11448I061Q81j6846P246L877p63P16J3293J2709j6564o302N310J207q700j2014
$$ 9061 9942 -6904 342 4219 3456 4172 17465 30174 13610 7308 12618 13825 5125 -6889
11434f889R139L12Q757p6K85j0890q409J528O593J7517p156k0808n685Q843o610
$$ -6889 2250 2562 11319 11243 11528 638 -7771 -6243 350 17867 10711 -10097 -15782 -6939 -13549
11419a3549m228P071k306o951k136J0925O707M093q280q26J1290K819L440m172
$$ -13549 -17777 -10706 -13012 -19963 -22099 -11174 -4467 -374 -8654 -9480 1810 4629 8069 3897
11405C897j2244O726M4K184l766N353Q223o159N111J8508m315j3014j2107k150
$$ 3897 -8347 -1621 -1577 607 -3159 2194 10417 4258 9369 27877 23562 10548 -1559 -3709
11391c709m855K279J0129J8237P299j1290l753j258J126Q584j224n952J841m572
$$ -3709 -8564 -6285 3844 22081 29380 18090 14337 13079 14205 22789 21565 15613 17454 12882
11377A2882q609K2K189k617L412R318M138O595n512j7154r859P347o402k326Q224
$$ 12882 4273 4295 6484 3867 7279 16597 20735 27330 21818 4664 -5195 2152 -4250 -6576 1648
11362A648j932n964q161P577J0890k504p890M180J2452K640o048k422K604J689
$$ 1648 -284 -6248 -14409 -6832 4058 1554 -6336 -2156 10296 12936 6888 4466 7070 8759
11348H759P379n204j2524n677K187M817O87k664q902O787O977q027L532m786l529
$$ 8759 16138 10934 -1590 -7267 -5080 -263 424 -2240 -11142 -4355 2622 -5405 -1873 -6659 -10188
11333a0188l899J0630K259j76j048P28Q074P595L34j6953L009N924k523j1272
$$ -10188 -14087 -3457 -1198 -1374 -2422 -1694 6380 13975 14309 -2644 365 6289 3766 -7506
11319g506j254o184j974o311J4775J3556j068l789j2243q173K724K3705J2479
$$ -7506 -8760 -14944 -16918 -23229 -8454 5102 4034 245 -11998 -20171 -17447 6258 18737
11306A8737O931j0602r225o534J059J0033R962q731l045K938P023O743l922M838
$$ 18737 25668 15066 5841 -693 366 10399 20361 11630 8585 11523 18546 25289 21367 26205
11292B6205L920L011P16l064L534l662q541m777m058O830p935K331J4994m98J1366
$$ 26205 30125 33136 33852 30788 34322 30660 22119 17342 13284 20114 12179 14510 29504 29006 40372
11277D0372O976O438M987K1253K8013M3788O0847L5271P563m377l2592n7458l9353
$$ 40372 47348 53786 58773 80026 108039 151827 212674 247945 255508 251131 218539 161081 121728
11264A21728l3548k2819j2804J206k0979j0813p302j1074k075j534J0223O430
$$ 121728 88180 65361 52557 53763 32784 21971 14669 3595 1520 -14 10209 16639
11252A6639l304j1955L110o60J962R183m174m215j262j821N188Q128m448p118
$$ 16639 13335 1380 4490 3830 5792 14975 10801 6586 5324 3503 8691 16819 12371 5253
11238E253k433p197j0455L108l469p75J5857l610J078k952n86J0410r97m952K661
$$ 5253 2820 -4377 -14832 -11724 -15193 -15968 -111 -3721 -2643 -5595 -6181 4229 3232 -1720 941
11223I41J0927L06O798J2499R123q265j6188j2093j0391L192J0112m863q870l575
$$ 941 11868 12174 18972 31471 40594 32329 16141 4048 -6343 -3151 6961 2098 -6772 -10347
11209a0347P473P73N220o55k597N530j3812o780L965m229Q758M634j695J1081
$$ -10347 -2874 -2101 3119 2464 -133 5397 -8415 -15195 -11230 -15459 -6701 -2067 -3762 7319
11195G319J0970n410j4071M611J1261k565J065L031j052m681j056M153J0439o353
$$ 7319 18289 12879 -1192 3419 14680 12115 13180 16211 15159 10478 9422 13575 24014 17661
11181A7661j0572n71r97L227K640K817k336J162M627O108k575j5377J819O515
$$ 17661 7089 6518 5521 8748 11388 14205 11869 13031 17658 23766 21191 5814 7633 14148
11167A4148L166K751O880Q628j2234m986J3561J7290q19L603J1736O828L2643
$$ 14148 17314 20065 26945 35573 23339 18353 31914 49204 48385 51988 63724 70552 103195
11154A03195L4311N0850M9894K6030j2514o28r36j0193m4593m0676m5394l8106
$$ 103195 137506 188356 238250 264280 251766 251138 250202 240009 195416 154740 109346 71240
11142G1240m881r668j2745r720k825m657J873Q67N043Q020m269r956j0919N012
$$ 71240 66359 56691 43946 34226 31401 26744 28617 29484 34527 42547 38278 28322 17403 22415
11128B2415N066o516K995O984n706L234l258k0025k179k848Q207J5336J434k090
$$ 22415 27481 20965 23960 30944 25238 28472 25214 5189 3010 162 8369 23705 25139 23049
11114B3049K0431O367K84J1205M559j2400o146n678J169j0089j1635q327j236
$$ 23049 43480 49847 50131 61336 65895 53495 47349 41671 42840 32751 21116 12789 11553
11101A1553M686J0718Q529j1643j9423o509J019O964M309p518J996m010K979N352
$$ 11553 16239 26957 35486 23843 4420 -2089 -1070 5894 10203 2685 4681 671 3650 9002
11087I002J232p699q119J935q590j397P825J472J1025n691P034K820q451k087
$$ 9002 10234 2535 -5584 -3649 -12239 -13636 -5811 -4339 6686 995 8029 10849 2398 311
11073C11N963J6047L136q172N154J77J474O981n051N1k552q171K141J858P85j6319
$$ 311 6274 22321 25457 17285 22439 22616 24090 31071 26020 26071 23519 15348 17489 19347 20132 3813
11057C813p256K433P614M361m778O794R950J147m75p141n171o026l624Q799O617
$$ 3813 -3443 -1010 6604 10965 6187 12981 22931 24078 23603 16462 11291 5265 1641 10440 17057
11042A7057K96L861r317l923j80j078N953q576p706J047J123Q586j2019l224N402
$$ 17057 17353 21214 11897 7974 7794 6716 12669 4093 -3613 -2566 -1443 7143 -4876 -8100 -2698
11027b698Q312O587r869O493m12M616q107n340K217K995J479l800k433N727O073
$$ -2698 5614 12201 2332 8825 8413 13029 4922 -418 1799 4794 6273 2473 40 5767 11840
11012A1840m278J882j2483j0010J8293K238L080L809j781l836o670N45N844m764
$$ 11840 7562 9444 -3039 -13049 5244 7482 10562 14371 12590 8754 2084 2629 8473 3709
10998C709Q293M265N501Q456j3552k6821o367J0878J4388l760p174J0103R977
$$ 3709 12002 16267 21768 30224 16672 -10149 -16516 -5638 8750 4990 -2184 7919 17896
10985A7896P443j0131P76N522k663N406J993k969O065p299l125P083j6523O715
$$ 17896 25339 15208 15984 21506 18843 24249 26242 23273 29338 22039 18914 25997 9474 16189
10971A6189P718l469m772p513P532J6695j466P74r25l023J83k555j1516p042J763
$$ 16189 23907 20438 15666 8153 15685 32380 30914 31688 30763 27740 27923 25368 13852 6810 8573
10956H573Q111l911j7017n754J4993P221k934j5648m705J5253k390R872J1674
$$ 8573 16684 12773 -4244 -9998 4995 12216 9282 -6366 -11071 4182 1792 11664 23338
10943B3338k410j0039L625o137o434J1308O561m439M606J0071J0289j2501r834
$$ 23338 20928 10889 14514 8377 1943 13251 19812 15373 19979 30050 40339 27838 18004
10930A8004m66P766j2384j5457j1235K135O338k387J069J0143n03r00j035Q12
$$ 18004 17538 25304 12920 -2537 -13772 -11637 -5299 -7686 -6617 3526 3023 2123 1088 1900
10916A900m812M054J4342M138P278K335J12r514L873r91Q219k219j2199M170J879
$$ 1900 -2912 1142 15484 19622 26900 29235 29347 19833 23706 22715 30934 28715 16516 20686 22565
10901B2565p009J000n585j524j3723p324J825L676J1539J419R04L838P779j1366
$$ 22565 15556 16556 10971 9447 -4276 -11600 -9775 -6099 5440 6859 7763 11601 19380 8014
10887H014p16Q404m316j5838j925p24p808O907J2296J3600J353r578J061j609
$$ 8014 7298 15702 11386 -4452 -6377 -7101 -14909 -8002 4294 17894 19247 9669 10730 9121
10873I121P46P95P269J6505m80j4957M122k276q152j0608o068P059K280j0974
$$ 9121 9867 10662 17931 34436 33956 18999 23121 20845 12693 2085 -3983 3076 5356 -5618
10859e618j7043o13L737M641k043J0288K181P131J0947Q781J6959p177q611j0117
$$ -5618 -22661 -23274 -19537 -14896 -16939 -6651 -4470 2661 13608 22389 39348 32171 23560 13443
10845A3443r837L410R44M836J630q089P410R833n328L973m350k271j602j0375
$$ 13443 3606 7016 7960 12796 14426 6337 13747 23580 18252 22225 17875 15604 14002 3627
10831C627j2583l139L251R251k057k096P087R14M287J0504j6J4480J944j0736
$$ 3627 -8956 -12095 -8844 407 -1650 -3746 3341 4255 8542 19046 19030 33510 35454 24718
10817B4718j0309J593K728K278m816m686P906M048K757l481L118l448j0102o171
$$ 24718 14409 16002 18730 21008 16192 11506 19412 23460 26217 22736 25854 22406 12304 6133
10803F133M916J0536k9J375m841n529n213p953o70M981N23r22l750m277J5280
$$ 6133 11049 21585 21556 22931 18090 12561 7348 -605 -1275 3706 4229 3307 -443 -4720 10560
10788A0560k882l243j005J670J2655n609p306L741M190J0342k550n516k609m190
$$ 10560 7678 4435 3430 5100 17755 12146 4840 8581 12771 23113 20563 15047 12438 8248
10774H248l488J705o56L628O388N192P036m434j1379o017Q436O738r003J740j586
$$ 8248 4760 6465 5809 9437 15825 21017 28053 23619 12240 6223 14659 21397 12394 14134 12548
10759A2548r085j1889l593M218P444J063Q452M141r768o943J1382o782j1447j913
$$ 12548 3463 -8426 -12019 -7801 -357 706 9158 13299 3531 -3412 7970 1188 -10259 -12172
10745a2172J974J8069k696L290Q586o958K717J7049L434n890M697K422j4586l866
$$ -12172 -10198 7871 5175 8465 17051 10093 12810 29859 33293 27403 32100 34522 19936 16070
10731A6070n372q62L178J706K538N327K988j49o294R610K537l600q651J251K168
$$ 16070 10698 9836 13014 14720 17258 22585 25573 25424 19130 28740 31277 27677 19026 20277 22445
10716B2445J4322j3421j5641J732J1642P002M059J0471Q23j249N452N45j977j3432
$$ 22445 36767 23346 7705 9437 21079 28081 32140 42611 43434 42185 47637 48182 46205 32773
10702C2773m096L614m69k163q513r22J4647J854j1734j6475J851K546J4444J1924
$$ 32773 28677 32291 31822 29659 21146 20224 34871 36725 24991 8516 10367 12913 27357 39281
10688C9281n693j1567L59j974l619j0174k128k190j1948l991k852J359Q045J8006
$$ 39281 33588 22021 22380 20406 16787 6613 4485 2295 -9653 -13644 -16496 -15137 -7092 10914
10674A0914Q31p211O937K498o253M350Q783l147l183r160j0036p73m597L207r003
$$ 10914 11745 4534 11471 13969 7716 12066 20849 17702 14519 5359 -4677 -5450 -10047 -6840 -15843
10659a5843O261J4293Q209J4327j02j1479Q600R87k14k126j514p496m269J2428
$$ -15843 -9582 4711 12920 27247 27145 15666 24266 25253 25039 22913 21399 13903 9634 22062
10645B2062J8551P261P153P361l752l158r129p986L007L93Q728k194r165L440
$$ 22062 40613 47874 55027 62388 58636 55478 46349 38363 41370 41763 50491 48297 39132 42572
10631D2572J893Q128J3921N680K280J7787K490K594q926L815J0315J3810J2505
$$ 42572 44465 52593 66514 72194 74474 92261 94751 97345 88419 92234 102549 116359 128864
10618A28864J0025J4003J9816K7990L5548N3707R0134J33020J96873K81550L52318
$$ 128864 138889 152892 172708 200698 236246 289953 380087 513107 709980 991530 1343848
10607A343848L22783J56857m6297k54632l49618l17621k31736j79172j26870o3163
$$ 1343848 1666631 1823488 1777191 1522559 1172941 855320 623584 444412 317542 254379
10597B54379m1837l5496k9462k7896j9859j3413k215m965k578n14P437L404q247
$$ 254379 212542 177046 147584 119688 99829 86416 84201 79236 76658 76144 83581 86985 78738
10584G8738J306j0723l948p341j0306q987o521j387J2482J0701L42o706P25m577
$$ 78738 80044 69321 65373 58032 47726 38739 32218 30831 43313 54014 54356 47650 48375 43798
10570D3798j0788K648M018q90l938m438k718k038M517n961J8o725J4462o0j4051
$$ 43798 33010 35658 39676 38786 34848 30410 27692 25654 30171 24210 24228 17503 31965 31905 17854
10555A7854J075L299R232Q842m068O582N01r943j5219N810J7175K257K21J082
$$ 17854 18929 22228 31460 40302 36234 42816 43317 33374 18155 23965 41140 43397 43618 44700
10541D4700o673j0787o473m535J5280N776K95J0616q4P11O300j913k821N699l387
$$ 44700 38027 27240 20767 16232 31512 37288 37583 48199 48115 48826 55126 53213 50392 56091 52704
10526E2704m191k628l564n887O282L80l265M1l82n435p830M65j156K11O099k75
$$ 52704 48513 45885 42321 36434 42716 43096 39831 39872 39490 34055 26225 26690 25534 25745 31844 31569
10510C1569M112O911O602J2376J6919J5961J0969O205k0858k5723k3581j1002
$$ 31569 35681 42592 49194 61570 78489 94450 105419 111624 90766 65043 41462 30460
10498C0460O833k753j1117M029l559J047L464K3971K4923o23P927J8688J86N567
$$ 30460 37293 34540 23423 27452 23893 24940 28404 52375 77298 76675 84602 103290 103476 109043
10484A09043K4883Q533j0904j2120M899N878m258m159p168j045q300j5532k536
$$ 109043 133926 142459 131555 119435 124334 130212 125954 121795 114627 113582 105282 89750 87214
10471H7214l977p796J5110N851j7528m094n130m202J3088J3374K0284J4943J5022
$$ 87214 83237 75441 90551 96402 78874 74780 69650 65448 78536 91910 112194 127137 142159
10458A42159L1337K6094M4551L1561K0411j1798l2401n3639m1352k5187j4313
$$ 142159 173496 199590 244141 275702 296113 284315 251914 198275 156923 131736 117423
10447A17423p149j3599o227q220N667N360o891j1387j635J441j0092j0753L592
$$ 117423 110274 96675 90448 82228 87895 93255 86364 74977 73342 74783 64691 53938 57530
10434E7530J9233n625r144O740M423l209r936q392Q156O059j762R926N621K28
$$ 57530 76763 71138 61994 68734 73157 69948 60012 51620 59776 65835 64073 73999 79620 79848
10420G9848m874J4801R061p706m241J5035J4407j1209l404O961O720k6862j4486
$$ 79848 74974 89775 98836 91130 86889 101924 116331 105122 101718 108679 115399 88537 74051
10407G4051J8485J639J2625J6871r345j9386m878J94m159r145k7973k7807j6254
$$ 74051 92536 94175 106800 123671 114326 94940 90062 90256 86097 76952 48979 21172 4918
10394D918j4344j2954p161j6943j9794p976j3542p42K0430L3353L4158K7252K0421
$$ 4918 -9426 -22380 -29541 -46484 -66278 -74254 -87796 -88538 -68108 -34755 -597 26655 47076
10381D7076J3230O32m551j557p202o825j64k029J096K7856J1594Q55p818j1320
$$ 47076 60306 60938 56387 54830 47628 40803 40639 38610 39706 67562 79156 80011 72193 60873
10367F0873L478R222n98K676o591l445p398j2042j5051j985j3420j1213k2447
$$ 60873 64351 73573 72975 75651 69060 65615 58217 46175 31124 29139 15719 4506 -17941
10354a7941n885K483J705L479J0029J2640K0491M608R927J6906J6696J2004j566
$$ -17941 -23826 -21343 -19638 -16159 -6130 6510 27001 31609 41536 58442 75138 87142 85576
10341H5576L248J5850K8827O298o981n768J0580Q728J0904K3106L2738M7764O4237
$$ 85576 88824 104674 133501 139799 132818 127050 137630 146358 157262 180368 213106 260870 325107
10328C25107P2411O5647L5990L491l1269m2184l2292j6280j7637k9633l0027m825
$$ 325107 397518 463165 499155 502646 471377 429193 396901 380621 362984 333351 303324 298499
10316B98499q338j4253j8172j5613j2470j7766l371N228L601K3892J2190n116
$$ 298499 290161 275908 257736 242123 229653 211887 208516 213744 217345 241237 253427 248311
10304B48311k2046k771M943j7436o566j032J4005R436m051P615K0745J8270J6065
$$ 248311 226265 223494 228437 211001 204435 203403 217408 226844 222793 230408 251153 269423 285488
10291B85488K1254n002j2723j0622j5464M653J3872L0930K0277J3445J1118K0444
$$ 285488 306742 301740 289017 278395 262931 267584 281456 312386 332663 346108 357226 377670
10279C77670J7462Q429R289J8080O411k459L971L521M757L129L257O036J292O39
$$ 377670 395132 403561 412850 430930 437341 434882 438853 442374 447131 450260 453517 459553 460845 461484
10265D61484K5955K1289J6184K0188L1685K5203K7844K7911J1248o157L238j629
$$ 461484 487439 508728 524912 545100 576785 601988 629832 657743 668991 662834 666072 664443
10253F64443K8392M4934N9212O3837O7864Q3087R4314Q5791R3057J05727J17625
$$ 664443 692835 737769 796981 860818 928682 1011769 1106083 1191874 1284931 1390658 1508283
10242A508283J52780J88506K37194L32881M35746M84315K05001J1608J59175K11036
$$ 1508283 1661063 1849569 2086763 2419644 2855390 3339705 3544706 3556314 3715489 3926525
10232C926525m5928j42024J7797J57075K75661M14354N47068O82571Q41284J033474
$$ 3926525 3880597 3738573 3756370 3913445 4189106 4603460 5150528 5833099 6674383 7707857
10222G707857J205851J207351J107843R68451Q86168R61267J144812J385319J697013
$$ 7707857 8913708 10121059 11228902 12197353 13083521 14044788 15189600 16574919 18271932
10213A8271932K108494K671378L386711M235853N493845P495552J0583733J5365169
$$ 18271932 20380426 23051804 26438515 30674368 36168213 43663765 54247498 69612667
10205F9612667K2907335L5261071N3196009O7006932N7380267K4394671j3613002
$$ 69612667 92520002 127781073 180977082 247984014 305364281 329758952 316145950
10198C16145950m9700584o4063538n5372798m1344574k9603605k0287048j3491318
$$ 316145950 266445366 202381828 147009030 105664456 76060851 55773803 42282485
10191D2282485r015537o293269m676359l743692l075187k450969j907906j524512
$$ 42282485 33266948 26973679 22297320 18553628 15478441 13027472 11119566 9595054
10183I595054j181561q86905n98307l29956k25253k70297m24308n99541o59511
$$ 9595054 8413493 7526588 6928281 6598325 6373072 6102775 5678467 5078926 4419415
10174D419415n58822m36277l36714k65100k22000j94425j98764k07357j94361
$$ 4419415 3860593 3424316 3087602 2822502 2600502 2406077 2207313 1999956 1805595
10165A805595j75777j54784j26159r9035o9753l7120k9305l2328l6963n1409m6674
$$ 1805595 1629818 1475034 1348875 1249840 1180087 1142967 1113662 1081334 1044371 992962 946288
10154I46288l0727j5745j5821j7824j4224l63l68k0993k3483m9622o5090o0233
$$ 946288 915561 899816 883995 866171 851947 851584 851216 830223 806740 757118 692028 631795
10142F31795m7819l0484k0325k596k305j1165k7441k0507R207P952k2780k8436
$$ 631795 583976 553492 533167 530571 528266 517101 489660 469153 478360 486312 463532 435096
10130D35096l9184k1046q938k4922n308r215j1451j4612j0995J489J6049M967
$$ 435096 395912 374866 365928 341006 335698 326483 315032 300420 289425 290914 306963 311930
10118C11930j3107L216M554O048Q366j0598j1429l035o742k324k578Q459M686
$$ 311930 298823 302039 306593 312641 321007 310409 298980 295945 289203 286879 284301 292760 297446
10105B97446O07l769j0651l535q331j0703M47k1165k6021k0185L943J9578P55
$$ 297446 298053 294284 283633 280098 271767 261064 261511 240346 214325 194140 198083 217661 218416
10092B18416r609j833m730j6193k2988j9375j2236l5870l3340j2820K030j1708
$$ 218416 208807 206974 202244 186051 163063 143688 131452 95582 62242 49422 51452 39744
10080C9744r488r433k3879m4375m4841k9098n268J5256O3269P3268O1803M1670
$$ 39744 30256 20823 -3056 -47431 -92272 -121370 -126638 -111382 -48113 25155 86958 128628
10068A28628L9182K4552J7765l311j2267p822m151j2643j0440j606R502R24k998
$$ 128628 167810 192362 210127 206816 194549 186727 182576 169933 159493 157887 167389 168313 165315
10055A65315J4882J3761J2612J749N060M657P749J5122J9673K288o491j5653j1986
$$ 165315 180197 193958 206570 208319 213379 218036 225785 240907 260580 262868 256377 240724 228738
10042B28738k7801r871q007k7266q916j412o026l578m81j2147k343M633j2452
$$ 228738 200937 191066 183059 155793 146877 145465 139439 135861 135380 123233 120890 125523 113071
10029A13071J0469J5650Q652m802j110k926j7220n59J0322J0924J0676j2189P743
$$ 113071 123540 139190 147842 143040 141930 139004 121784 121225 131547 142471 153147 140958 148701
10016A48701K2846L7809L7066K5921M382p286m959j0159j5242p264p116k7131
$$ 148701 171547 209356 246422 272343 276725 269439 264480 254321 239079 231815 224699 197568
10004A97568k5346j2792j5175r489j5770j3156j0253k444r116j3199j0552J8482
$$ 197568 172222 159430 144255 134766 118996 105840 95587 93143 84027 70828 60276 78758
9992G8758l05j0350j0041j0392j3861j7905P673O237J6585J2338J1102J1329Q969
$$ 78758 78453 68103 58062 47670 33809 15904 23577 29814 46399 58737 69839 81168 90137
9979I0137o62o975O15j615J5205J2850R689j466n523j529j2228p26j995r237l5
$$ 90137 89475 82500 83115 81500 96705 109555 119244 117778 112255 110726 98498 97772 95777 86540 86505
9964H6505o25q149j293j572J817N580K2m737n828n987J6038J1060K094R751m034
$$ 86505 85880 77731 76438 74866 76683 82263 82285 77548 71720 65733 81771 92831 94925 104676 100642
9949A00642j961Q377O956j0106r031o533j2105m113J1912M508K995J548M148l068
$$ 100642 98681 107058 114014 103908 94877 88344 76239 72126 84038 88546 91541 93089 97237 94169
9935I4169J168k228o334r222l325k419P00l692j568K0829J0383q55j0468K217
$$ 94169 95337 93109 86775 77553 74228 71809 72509 68817 67249 88078 98461 97606 87138 89355
9921H9355m69l509r962j4088m03R146R797J1607l318M333J1217m33j0138p506
$$ 89355 88886 85377 75415 61327 60924 70070 79867 91474 88156 92489 103706 103273 93135 85629
9907H5629Q305J0757J2506P35m513r057J39j250o089j4071j4324j7976j0476j115
$$ 85629 93934 104691 117197 117932 113419 104362 104501 103251 97162 83091 68767 50791 40315 39200
9893C9200J4168J6139J1586K0866K5584Q277J933o452n904p59l671j8819m980
$$ 39200 53368 69507 81093 101959 127543 135820 137753 131301 125397 124638 120967 102148 97168
9880I7168K6005J6324j1041j6177l134n789j2046K233K118p674Jj825q529O403
$$ 97168 123173 139497 128456 112279 109145 103356 91310 93543 95661 87987 87988 86163 77634 84037
9866H4037o05m11J0518R342J568r249q332r428j831r245P900J1039Q326J0498
$$ 84037 83432 83021 93539 102881 104449 95200 86868 77440 75609 66364 74264 85303 93629 104127
9852A04127J0215j803r915L9O231l398N07K409O931m412j1149L123O573q3K31
$$ 104127 114342 112539 102624 102663 108894 105496 106003 108412 115343 110931 99782 102905 109478 109395 109626
9837A09626l650R678J3699K0972o146k926m9j0925N050l983m100O039M718j203
$$ 109626 105976 115654 129353 150325 144179 141253 141204 130279 135329 131346 127246 133285 138003 136800
9823A36800N302k651j1726m85L063k458O682J7970n175m490K746M153J6088n001
$$ 136800 142102 139451 127725 127240 130303 127845 134527 152497 147322 142832 145578 149731 165819 160818
9809A60818O846P651O546l510P587K1556J1345J998J5018J4192J1217K4809L5834
$$ 160818 167664 175315 181861 178351 185938 207494 218839 220837 235855 250047 261264 286073 321907
9796C21907N2008O5744J18348J78144K44873L38135L69223K33574L6396j87959
$$ 321907 373915 439659 558007 736151 981024 1319159 1688382 1921956 1958352 1770393
9786A770393l43792l47895k70698j85132j24025r2550p1934n2168k4505j9153
$$ 1770393 1426601 1078706 808008 622876 498851 406301 334367 282199 257694 238541
9776B38541o417j1058o794l719o363q559j0090l238J1142l197j4494j2321j4149
$$ 238541 232124 221066 214272 210553 204190 195631 185541 182303 193445 190248 175754 163433 149284
9763A49284r110K0362l116k2202j2334L929J2482J195k494M18j203r231L598J5123
$$ 149284 140174 160536 157420 135218 122884 126813 139295 140490 137996 138414 137211 127980 131578 146701
9749A46701j4N92m681n820j883P633J3552l510O661K2689j318K21J1676r236m601
$$ 146701 146687 147279 142598 136778 134895 142528 156080 152570 159231 181920 180602 180823 192499 183263 178662
9734A78662K425j0493n722J248p502p24j820J4287j548r193M483J3337k521L969
$$ 178662 181087 170594 164872 166120 158618 157894 156074 170361 168813 159620 164103 177440 174919 178888
9720A78888N545l591o302p107j058L425Q511r428q45m98m184O68N797k611p575
$$ 178888 184433 180842 174540 167433 166375 169800 178311 168883 168038 167540 163356 164024 169821 167210 159635
9705A59635K53P342J2055j089p324K669K0094j857o198N102Q526R49j266j5934
$$ 159635 159888 167230 179285 178196 170872 173541 193635 191778 185580 190682 199208 200157 198891 182957
9691A82957K64n340j0116o87k497M605o75n248J7325O4Q817M401M361j1379L347
$$ 182957 183221 177881 167765 167078 164581 169186 168511 163263 180588 180652 189469 193870 198231 186852 190199
9676A90199J6101Q146l99j0934j6138j4848J904O741K745Q311Q911j542j0473
$$ 190199 206300 214446 214047 203113 186975 172127 174031 180772 183517 191828 200739 199197 188724
9663A88724N417k186j0679k920Q297n727K133M004M518j31K721J0010p08l45m477
$$ 188724 194141 191955 181276 178356 186653 180926 183059 187063 191581 191450 194171 204181 203473 203128 198651
9648A98651n016K966M261n345k0K1432N454j5855q654m003J813k495M587J0605
$$ 198651 193635 196601 200862 195517 195497 216929 222383 206528 197874 193871 195684 193189 197776 208381
9634B08381r09j365L379N967r930j0018j3300O406L109j673N364q816r295L931
$$ 208381 207472 206107 209486 215453 205523 195505 182205 188611 191720 190047 195411 186595 177300 181231
9620A81231O94M359P674M562N243L148m164k680m050l766o810m651P308L284Q47
$$ 181231 181925 186284 193958 198520 203763 206911 202747 200067 196017 192251 185441 180790 188098 191382 192229
9605A92229R510N811J867K329m490q672m58J567K433N012R464j2203j0853Q10
$$ 192229 201739 207550 209417 211746 207256 198584 198126 199693 202126 207138 216602 204399 193546 194356
9591A94356K782k266J1861j2058J132Q08J852o959Q760r49m485j1683j0806j651
$$ 194356 197138 194872 206733 194675 195807 196615 198467 191508 200268 199319 194834 183151 172345 170694
9577A70694J3349K314K836L740L249k485M9j496P655q817j3299N516K270O186
$$ 170694 184043 186357 189193 192933 196182 193697 193746 192250 199905 191088 177789 183305 185575 191761
9563A91761M195j2132j6168n056O169J0451K687N709L98j518j244m193M419N497
$$ 191761 195956 183824 167656 162600 168769 179220 181907 187616 188014 186496 185252 181059 185478 190975
9549A90975L383J811n446Q336k20n510K341R656Q142j811M261Q322J0018r012
$$ 190975 194358 196169 190723 199059 198839 193329 195670 205326 213468 211657 215918 224240 234258 225246
9535B25246k1148j3258J944P54m726j0479P900J2558L338j1299l451J48O322j058
$$ 225246 204098 190840 192784 193538 188812 178333 186233 198791 202129 190830 187379 187527 193849 192791
9521A92791p588j0068P420J4700M032j8247m079J185j2641q109M272J4409J4629
$$ 192791 185203 175135 182555 197255 201287 183040 178961 180146 167505 159396 163668 178077 192706
9508A92706J3318m61o092q778O98k956J0956P889M565J0365j5045j5918p52K829
$$ 192706 206024 205563 199471 190693 191391 188435 199391 207280 211845 222210 207165 191247 190495 193324
9494A93324o38L12j673K09K556j41J3250j717l991p198J335O159q501k917N715
$$ 193324 192686 192998 191325 191534 194090 193949 207199 205482 201491 194293 195628 201787 193286 190369 196084
9479A96084N599j4432j800J2123p376j7749N660Q208J0748J5909p63j1023j6342
$$ 196084 201683 187251 185451 197574 190198 172449 178109 186317 197065 212974 212211 201188 184846
9466A84846l382p924m832N513Q170K381L937M599M093L962K833M841J5113N101
$$ 184846 181464 173540 168708 174221 182391 184772 188709 193308 197401 201363 204196 209037 224150 229251
9452B29251l335J338l433J704q427o848J087n024j667k260O545j528k236l212
$$ 229251 225916 227254 223821 225525 217098 210250 211337 206313 204646 202386 208931 207403 205167 201955
9438B01955R21N920R018K491L691p719o564J098M284J871l829p666m862L675j539
$$ 201955 202876 208796 217814 220305 223996 216277 209713 210811 215095 216966 213137 205471 200609 204284 202745
9423B02745j88r86N462l579k278R525J843L990J1749n52o370L093J920J4375J0183
$$ 202745 202557 201571 207033 203454 201176 210701 212544 216534 228283 227731 221361 224454 226374 240749 250932
9408B50932L594k6108j4566J3868Q172j1554J67O358n769m780l722j605M242p549
$$ 250932 254526 228418 213852 227720 235892 224338 224505 230863 225094 220314 216592 214987 219229 211680
9394B11680j984k194M94J6819M116m403n389J98J592q829n007P493M505P647M235
$$ 211680 209696 207502 207996 224815 228931 224528 219139 219337 220929 212100 207093 214586 219091 226738 230973
9379B30973o079q947n544M286J0895j596Q378L581o310j2400J5694P564k27M537
$$ 230973 224894 215947 210403 214689 225584 223988 232366 235947 229637 217237 232931 240495 240268 244805
9365B44805j643q216P007J0709J844J1628n163K993N108j298k0104o773K350J0692
$$ 244805 243162 234946 241953 252662 254506 266134 260971 263964 269072 267774 247670 240897 243247 253939
9351B53939m791q175K49J1835O854j1814k1143n365o91J150J9794K7668O412k4245
$$ 253939 249148 240973 241222 253057 259911 248097 226954 221589 220898 222048 241842 269510 275922 251677
9337B51677j7706j217J8774J0436k328j469k028l236l421O902j985m864n371J739
$$ 251677 233971 232754 251528 261964 259636 258167 256139 252903 249482 256384 254399 249535 244164 245903
9323B45903q89P173o682L513n61o048M429J5664K70N705N165j488J16n577j9751
$$ 245903 245014 252187 245505 249018 248457 242409 246838 262502 262772 268477 273642 272154 272270 266693 246942
9308B46942k1079J5556J7580P696K042j2980P22L602l192R657k354N006k222N227
$$ 246942 225863 241419 258999 266695 268737 255757 256479 260081 256889 266546 264192 269198 266976 272203
9294B72203J2025l608j7346r40O658K105O469j390M433R07j055J301Q87j907k451
$$ 272203 284228 280620 263274 262334 268992 271097 277566 276176 280609 281516 280461 281762 282649 280742 278291
9279B78291J896Q282O056O659n311k610L86P30Q067K828J829k752O890R772L313
$$ 278291 280187 288469 294525 301184 295873 293263 293649 294379 302446 305274 307103 304351 311241 321013 324326
9264C24326J091j7180j2055k286J852J1968P995M739p712o535j328j7249J313
$$ 324326 325417 308237 296182 293896 295748 307716 315711 320450 312738 306203 304875 287626 288939
9251B88939L687o832K317J9703J8131N105m10Q545R16j458p909L952N137J048
$$ 288939 292626 285794 288111 307814 325945 331050 330640 339185 340101 338643 330734 334686 339823 340871
9237C40871l967N03j558Q57M19n581N338l812O584J4021n84q39q203j0154k624
$$ 340871 336904 337407 335849 336706 337125 331544 336882 333070 339654 353675 353091 352252 344049 333895 331271
9222C31271K768L600J1315J3296O632q889j326J0871l192M307M154j0241l6j152
$$ 331271 334039 337639 348954 362250 368882 359993 358667 369538 366346 370653 374807 364566 364530 363378
9208C63378q876P84K808M668L987J221L267O488N748J7899O016p78n421m51j64
$$ 363378 354502 355286 358094 362762 366749 367970 371237 377725 383473 401372 407388 406610 401189 400738 400574
9193D00574n878J8720L856o034k06k027k058K493p94k638O874O319R110j362m0
$$ 400574 394696 413416 417272 411238 411032 409005 406947 409440 408646 406008 412882 419201 428311 426949 426909
9178D26909m792P791J9579J0998P822J0873M523J469j2208j2829r463N133J4535
$$ 426909 422117 429908 449487 460485 468307 479180 483703 485172 472964 460135 450672 455805 470340
9165D70340M772L820J2621R45m24K592j044J771N853J2810J7719N866r046O816
$$ 470340 475112 478932 491553 492498 492074 494666 493622 495393 501246 514056 531775 537641 528595 535411
9151E35411K02P325l648q742M724l086P214P960J0864K053J250j1423N674M517
$$ 535411 535613 542938 539290 530548 535272 532186 539400 547360 558224 560277 561527 550104 555778 560295
9137E60295R916N400n01K007K1295J3303p462j2594k298J4680j512Q593M860j752
$$ 560295 570211 575611 575110 577117 598412 611715 604253 591659 589361 604041 602529 611122 615982 614230
9123F14230j390O713J3718J3194R132m59j2981l948J2881K1740J5338K608l586
$$ 614230 612840 619553 633271 646465 655597 655138 642157 638209 651090 672830 688168 690776 687190
9110F87190Q228n874m989M895J3903O880J2512m593p539J0861J3568k594L868
$$ 687190 695418 689544 684555 689450 703353 710233 722745 718152 710613 721474 735042 732448 736316
9097G36316O478R128N024j65N150J0758R915P22P948R796J0370L981Q300j403
$$ 736316 742794 751922 756946 756781 761931 772689 782604 783326 791274 801070 811440 815421 823721 822318
9083H22318N507J5517N266R618N36O587P460N423J0441K5260K3190Q200J1034
$$ 822318 827825 843342 848608 858226 858762 865349 872809 878232 888673 913933 937123 945323 956357
9070I56357J2479J5892L437n382J7142J3721J0751j566R745J7402J6022J0376
$$ 956357 968836 984728 988165 982783 999925 1013646 1024397 1022831 1032576 1049978 1066000 1076376
9058A076376P839J1531M108P095O537O314J3382K4471J2355N058K5857K1631N999
$$ 1076376 1084215 1095746 1099854 1106949 1113486 1119800 1133182 1157653 1170008 1175066 1200923 1222554 1228553
9045A228553K437J1137K9152K5574J7950J8228R319J8087L1983K4948K7599J6857
$$ 1228553 1230990 1242127 1271279 1296853 1314803 1333031 1342350 1360437 1392420 1417368 1444967 1461824
9033A461824J2108K3532J2386J1033L766K4293J3891J4233L1161K3732L1761P881
$$ 1461824 1473932 1497464 1509850 1520883 1524649 1548942 1562833 1577066 1608227 1631959 1663720 1671601
9021A671601J1353J0578K9241K5369M5020L1567K8051K3885K9646K5679L1835
$$ 1671601 1682954 1693532 1722773 1748142 1793162 1824729 1852780 1876665 1906311 1931990 1963825
9010A963825K3007L6509M4772L7496K8941L2528M2141K3712L3282L4801L0593
$$ 1963825 1986832 2023341 2068113 2105609 2134550 2167078 2209219 2232931 2266213 2301014 2331607
8999B331607K8379L1514M8498M4525M0316L5935M0541L5753M7829N3868M6208
$$ 2331607 2359986 2391500 2439998 2484523 2524839 2560774 2601315 2637068 2684897 2738765 2784973
8988B784973M2274N3453N8321M6437M8826O5374O4635N8097N7184O6607P3408
$$ 2784973 2827247 2880700 2939021 2985458 3034284 3099658 3164293 3222390 3279574 3346181 3419589
8977C419589O1568O5311P6592P8599P1146R0672Q1853P9993O9011Q6937R1984
$$ 3419589 3481157 3546468 3623060 3701659 3772805 3863477 3945330 4025323 4094334 4181271 4273255
8966D273255Q1529Q7589J03989J01768J18268J07574R8155J13308J11646J12051
$$ 4273255 4354784 4442373 4546362 4648130 4766398 4873972 4972127 5085435 5197081 5309132
8956E309132J19879J30327J39394J51111J52970J66284J57003J56751J59577J75278
$$ 5309132 5429011 5559338 5698732 5849843 6002813 6169097 6326100 6482851 6642428 6817706
8946F817706J74796J73952J83538J94754J96043J92433K02130K19162K28980K31835
$$ 6817706 6992502 7166454 7349992 7544746 7740789 7933222 8135352 8354514 8583494 8815329
8936H815329K40720K47722K46743K52918K73058K78130K81377K93105K94811L14096
$$ 8815329 9056049 9303771 9550514 9803432 10076490 10354620 10635997 10929102 11223913 11538009
8926A1538009L10714L09161L29311L28719L20036L32078L43716L45243L42344
$$ 11538009 11848723 12157884 12487195 12815914 13135950 13468028 13811744 14156987 14499331
8917A4499331L46922L48688L48277L60778L38367L39701L46055L31110L15758
$$ 14499331 14846253 15194941 15543218 15903996 16242363 16582064 16928119 17259229 17574987
8908A7574987L08018K99378K73619K57173K53235K21213J91614J72229J65624
$$ 17574987 17883005 18182383 18456002 18713175 18966410 19187623 19379237 19551466 19717090
8899A9717090J30475R0687P2818L3224P699j7023o5691q6912j00845j33829j71100
$$ 19717090 19847565 19938252 20011070 20044294 20051993 20034970 19969279 19882367 19781522 19647693 19476593
8888A9476593j81168k10722k41524k63703k85222k96465l10877l19274l27622
$$ 19476593 19295425 19084703 18843179 18579476 18294254 17997789 17686912 17367638 17040016
8879A7040016l28816l49851l45970l66786l63426l66680l64333l56238l60647
$$ 17040016 16711200 16361349 16015379 15648593 15285167 14918487 14554154 14197916 13837269
8870A3837269l61332l49795l29926l42975l40442l42030l34864l10156l05270
$$ 13837269 13475937 13126142 12796216 12453241 12112799 11770769 11435905 11125749 10820479
8861A0820479k99116k99921k99152k61951k47100k62476k58150k25490k11749
$$ 10820479 10521363 10221442 9922290 9660339 9413239 9150763 8892613 8667123 8455374
8852H455374k21272k05626j86012k04450k25168k30483k25315k15946j83002j62898
$$ 8455374 8234102 8028476 7842464 7638014 7412846 7182363 6957048 6741102 6558100 6395202
8842F395202j73155j77496j68738j53139j33371j35002j39945j36652j26796j14167
$$ 6395202 6222047 6044551 5875813 5722674 5589303 5454301 5314356 5177704 5050908 4936741
8832D936741j24582j24508j15746j10070j04058r3846r0743q8941q6816r4658
$$ 4936741 4812159 4687651 4571905 4461835 4357777 4263931 4173188 4084247 3997431 3902773
8822C902773j13206r1441p9161o3829p0228p6519o9186p2994p2134n7068p5901
$$ 3902773 3789567 3698126 3618965 3555136 3484908 3408389 3339203 3266209 3194075 3137007 3061106
8811C061106r1990n5659n3536n1830o1697n3728m4962n0643n2438m1937n2110
$$ 3061106 2969116 2913457 2859921 2808091 2746394 2692666 2647704 2597061 2544623 2502686 2450576
8800B450576n0176m7557m5978m3981l9595m1340m6588j7871l0115m0184n1131
$$ 2450576 2400400 2352843 2306865 2262884 2223289 2181949 2135361 2117490 2087375 2047191 1996060
8789A996060l2736l4197l0362k0387k8682l9828l3345k2107k8313l1465l1780
$$ 1996060 1963324 1929127 1898765 1878378 1849696 1809868 1776523 1754416 1726103 1694638 1662858
8778A662858k9347j7001j7532k2558l3095k8407k4959j6616k0511l4016j5723
$$ 1662858 1633511 1616510 1598978 1576420 1543325 1514918 1489959 1473343 1452832 1418816 1403093
8767A403093k0059j9597k0467j7387j8192j5599j9350k4390j2464k6243k0354
$$ 1403093 1383034 1363437 1342970 1325583 1307391 1291792 1272442 1248052 1235588 1209345 1188991
8756A188991j2355j1816q092p481k4705j3659j7975k0008L284q899k1311j7421
$$ 1188991 1176636 1164820 1156728 1149247 1124542 1110883 1092908 1072900 1076184 1067285 1045974 1028553
8744A028553j0741p09j2719j7587j6026q855j1947p811q198k1014j7577n380K34
$$ 1028553 1017812 1017103 1004384 986797 970771 961916 949969 942158 933960 912946 895369 889989 890223
8731H90223j0767j2394j2025j9838j3741j400n155o201j4222j8374p99j000j0409
$$ 890223 879456 867062 855037 835199 821458 820058 814903 808702 794480 776106 775307 774307 763898
8718G63898M007r946j9821j6042k5249p544J2097O617n845L56j737k6470j2749
$$ 763898 767905 757959 738138 722096 696847 689303 701400 708017 702172 702528 700791 674321 661572
8705F61572L329o388q861k292j0230j0350j2938j0320j4013K019r178j779j4313
$$ 661572 664901 658513 649652 647360 637130 626780 613842 603522 589509 591528 582350 580571 566258
8692E66258j34L82j836m794l603j2536j365r55r810l409l554j0367n969l951m158
$$ 566258 566124 566506 564670 559876 556273 543737 542372 541417 531607 528198 524644 514277 508308 504357 500199
8677E00199o127n553m481k081R20j2177r623l044j1591o716Q000M027j762j0481
$$ 500199 494072 488519 484038 481957 482877 470700 461077 458033 446442 439726 447726 451753 449991 439510
8663D39510j2660o535N821L894o697j5043l051J3388P502j980j0316p088j897
$$ 439510 426850 420315 426136 430030 423333 408290 405239 418627 426129 424149 413833 406745 404848
8650D04848j8562k0908p989j1052K535R203O527j2243L860l205p819N87M617q43
$$ 404848 386286 365378 357389 346337 348872 358075 364602 352359 356219 353014 345195 345782 350399 349556
8636C49556j3784j0651l158M161M805m609j4518o147m292l836o90P109J2812R93
$$ 349556 335772 325121 321963 326124 330929 326320 311802 305655 301363 297527 296837 303946 316758 317751
8622C17751p844oK627j757j9586M758K0156m791j9584j3784k586Q075K323M844
$$ 317751 309907 309901 312528 310771 291185 295943 316099 311308 291724 277940 275354 283429 285752 290596
8608B90596q574q418J443M50Q582R868k582r309j004p951j305l862r565L772O153
$$ 290596 282022 273604 275047 275497 284079 293947 291365 282056 281052 273101 271796 267934 258369 262141 268294
8593B68294Q921J4727k951j8219k345j371m668o774L335q862L983J887O107J0189
$$ 268294 277215 291942 288991 270772 268427 267056 262388 255614 258949 250087 254070 255957 262064 272253
8579B72253p42l171j95j7709J165J3350j698o265k344J4408j3043q668P053K751
$$ 272253 271511 268340 268145 250436 251601 264951 263253 256988 254644 269052 256009 247341 254394 257145
8565B57145n653k1534m891n022m147K66J0999j5041j0627j383n185l767J174p51
$$ 257145 251492 229958 225067 220045 215898 216164 227163 212122 201495 200112 194927 191160 192334 191583
8551A91583L825J770l319J3151J7040L776p290j0466L523j0481j1292o327m056
$$ 191583 195408 197178 193859 207010 224050 227826 220536 210070 213593 203112 191820 185493 181437
8538A81437o964K042L079r029p822L749O915J0051n91Q546N445j4641q393J153
$$ 181437 174473 176515 179594 170565 162743 166492 173407 183458 182867 191413 196858 182217 173824 174977
8524A74977j350m839p168l983N236J1218J2360n137K560m567K74m197n793Q247
$$ 174977 173627 168788 161620 157637 162873 174091 186451 181314 183874 179307 179581 175384 169591 177838
8510A77838L548j229M13L35j7839j299K444l15o923j1230q88n696Q96P427R543
$$ 177838 181386 180157 180570 180905 163066 161767 164211 163896 156973 145743 144855 139159 140055 147482 157025
8495A57025m809p073J404R16J0411o46k887j252n297k666K77n53j695j888p35
$$ 157025 152216 145143 146547 147463 157874 157228 154341 153089 147792 145126 145403 144850 143155 141267 140532
8480A40532j607l909J1998J4841Q48J2027M931m234q177j3947j3082L331N744
$$ 140532 138925 135016 147014 161855 162703 174730 179661 175427 167250 153303 140221 143552 149296
8467A49296J0739j863m958L731n769N04O368l610O928p071j6629k2909j7830M517
$$ 149296 160035 158172 153214 156945 151176 151680 158048 154438 161366 154295 137666 114757 96927 101444
8453A01444N224n341N419J3114j0783k187P931N831m335n283L456J2658k779O658
$$ 101444 106668 101327 106746 119860 109077 106890 114821 120652 116317 111034 114490 127148 124369 131027
8439A31027J4270M116o878J527K54j4486j2110j1509J104R991O451J442J2618
$$ 131027 145297 149413 142535 144062 144316 129830 117720 106211 107315 117306 123757 125199 137817
8426A37817J1576q972j784j747k018o782P387L703l022K812j0299m007l076j632
$$ 137817 149393 140421 138637 136890 134872 128090 135477 139180 136158 138970 128671 124664 121588 119956
8412A19956K522M522n069J892L32n508K747j0030j3054o421R891k107j6468M930
$$ 119956 122478 127000 121931 123823 124155 118647 121394 111364 98310 91889 101780 99673 83205 88135
8398H8135J6868l699K86K67o427j7145j15O166k06J5578M148j495o720j906j4387
$$ 88135 105003 101304 101590 101857 95430 78285 78170 84336 84130 99708 103856 102361 95641 93735 79348
8383G9348p340J2263K370k190J538k409M206p249m476Q06l04J2677O418J298p17
$$ 79348 72008 84271 86641 84451 85989 83580 87786 80537 76061 76867 76563 89240 95658 96956 96239
8368I6239k706k203m004O573n418J705n541j006r601k255R276m180j0529O532
$$ 96239 93533 91330 87326 93899 88481 90186 84645 83639 74038 71783 81059 76879 66350 72882
8354G2882J9357l070k859p454j5910p364L361J7668N569l456n38N398l251j2846
$$ 72882 92239 89169 86310 78856 62946 55582 58943 76611 82180 78724 78186 83584 80333 67487
8340F7487M899o513N911J1026o037n110Q098n036j6465o375M810M879r050Q1J3207
$$ 67487 72386 65873 71784 82810 76773 71663 79761 74725 58260 51885 56695 61574 52524 52605 65812
8325F5812K583q009J825k051K941J2560O163n114k951k017m322M006n974r352
$$ 65812 68395 60386 62211 60160 63101 75661 81824 76710 73759 71742 67420 71426 65452 56100
8311E6100J70n56r712J458R021J2919m159J933K528j0440L314J784m082K30M864
$$ 56100 56270 55714 46002 47460 56481 69400 65241 67174 69702 59262 62576 64360 60278 60508 65372
8296F5372j744Q299K292r663j0535j926O688J1259J0336J017n821j8454p601L632
$$ 65372 63628 71927 74219 64556 54021 52095 58783 70042 80378 81395 75574 57120 49519 53151
8282E3151J0971M981m051J661j773n57j1799r7P326O201J109o522N148J0829J420
$$ 53151 64122 69103 65052 66713 64940 64383 52584 52487 59813 66014 67123 60601 65749 76578 77998
8267G7998r506j1177J3750L927j5275r412R45N920k289j2472o506j8l912L155
$$ 77998 68492 57315 71065 74992 59717 50305 51250 57170 54881 42409 35903 35885 31973 35128
8253C5128J5399P84p772K623P217q131j2720j483q76K869L171p110J3699K0011
$$ 35128 50527 51311 43539 46162 53379 45248 32528 31045 30169 33038 36209 29099 42798 62809
8239F2809K767q589q192K010Q5J337j034l311j5788q069j286J9388P727m944J0738
$$ 62809 65576 56987 48795 50805 50890 52227 51193 47882 32094 24025 22739 42127 49854 44910 55648
8224E5648J2491p756j48l760j3046p511m438M333n205P17L271J073J0630J2221
$$ 55648 68139 60383 60235 56475 43429 35918 31480 35813 30608 31325 34596 35669 46299 58520
8210E8520o60r492p375P17k955O001L449k362L899M124j1968j4343m10J3419l381
$$ 58520 57860 48368 40993 41710 38755 44756 48205 45843 49742 53866 41898 27555 27145 40564 37183
8195C7183n936J032Q582k656r89OK235Q184L328l556J575j0776R183N107l823
$$ 37183 31247 32279 40861 38205 37216 37222 39457 47641 50969 47413 48988 38212 47395 52502 48679
8180D8679j7147q461O02R486R509K285j885j3840k706R121m674N454N138q998
$$ 48679 31532 23071 23673 33159 42668 44953 43068 29228 26522 35643 30969 36423 41561 32563
8166C2563L283J5443K831n324o785n093P176M10j1225n449k388o412N667J4984
$$ 32563 35846 51289 54120 48796 42011 36918 44094 44504 33279 27830 25442 19030 24697 39681
8152C9681R912j6640k404k098L742K278J748J026p90m356j3027J834M295l835
$$ 39681 49593 32953 30549 28451 32193 34471 36219 37245 36455 32099 19072 20906 25201 21366
8138B1366R531J2008M73j0150q950J0248L895K319o77r35K518r61j0262p59K690
$$ 21366 30897 42905 43378 33228 24278 34526 38421 40740 40063 39128 41646 40685 30423 29664 32354
8123C2354n281m597k840J1933R88J710p539J811J386j133j235j829k251r86j856
$$ 32354 27073 22476 19636 31569 32557 34267 26728 28539 29925 28792 27557 25728 23477 22491 20635
8108B0635R319k766q73l771j255O392J2559Q700M646j656k5891j5254L636o898
$$ 20635 29954 27188 26315 22544 21289 27681 40240 48940 53586 51930 26039 10785 14421 7523
8094G523k217J5805N763N36o716m434R791N394L317n32M86J212j642O378O21l024
$$ 7523 5306 21111 26874 27410 20694 16260 26051 31445 34762 34230 34716 35928 34286 40664 41285 38261
8078C8261K072M456j0125n855r818L288N722J652M463o231N127L659O520j0073
$$ 38261 40333 44789 34664 28809 18991 22279 28001 29653 34116 27885 33012 36671 43191 33118
8064C3118j5011O850K633M533l455j516R61n004k1312q723k725J2514J5541K984
$$ 33118 18107 24957 27590 32123 28668 27152 28113 23109 1797 -6926 -9651 2863 18404 21388
8050B1388n920j4822n253K078J3520J4778K166o918J654j83l04l140Q929L890
$$ 21388 15468 646 -4607 -2529 10991 25769 27935 21017 22671 22488 22184 19044 27973 31863
8036C1863L768K549j1074N656L393m048o472q111L726l601n492J1761J0548J0917
$$ 31863 35631 38180 27106 32762 36155 32107 25635 17524 21250 17649 12157 23918 34466 45383
8022D5383m097j2079J182N553M794k037P54N688m8n601J471q661p127J825o610
$$ 45383 41286 29207 30389 35942 40736 38699 39453 45141 45093 39492 40963 32302 25175 27000 20390
8007B0390p754N186j070o948m305N319J6048J5548J513p591j167N835l952j4824
$$ 20390 12636 17822 16752 9804 5499 10818 26866 42414 43927 36336 35169 41004 37052 22228
7993B2228m956M105l815j97R748L250r636j901j576q98k502N720j730q403L808
$$ 22228 17272 21377 17562 17365 27113 30363 20727 18826 17250 16352 13850 19570 17840 9437 13245
7978A3245M363J1927K553j345m215Q997Q09k916k539o90N27Q682O546j2167j3715
$$ 13245 17608 29535 32088 30743 26528 35525 36334 33418 30879 30189 30716 39398 45944 33777 20062
7963B0062L886P368J301J305J470N544j1870j1154O046O26M210l681O8K326N565
$$ 20062 23948 31316 32617 33922 35392 40936 29066 17912 23958 24584 28794 25113 25181 27507 33072
7948C3072O994L518r456L861Q088J1665m401n140m271Q28m73m753M99J0212J3187
$$ 33072 40066 43584 34128 37989 46077 57742 53341 48201 43930 44758 44285 39532 40031 50243 63430
7933F3430r91j7418q526Q496O70j1519J905N740J803j794p115P638P418m547n879
$$ 63430 62439 45021 36495 44991 45661 34142 36047 41787 43590 41796 34681 42319 49737 45190 39311
7918C9311k168o579r163M37k195r88J982J294N241R081P280J756n208l525l458
$$ 39311 37143 30564 21401 21838 19643 18655 20637 21931 27172 36253 43533 45289 40081 36556 33098
7903C3098l635j952J168Q148N685L405o227N775K740o819q754P869Q455r957J0410
$$ 33098 29463 27511 28679 36827 42512 45917 39690 45465 48205 41386 32632 40501 48956 38999 49409
7888D9409M846r117O202j904r672j3763m836K1390k867m221l862J003M326J412
$$ 49409 54255 45138 51340 49436 39764 26001 21165 42555 39688 35467 31605 32608 36934 38346
7874C8346l437p497j2050M350P683k387k1150k454J5978L815n671L203m90q719
$$ 38346 34909 27412 15362 19712 27395 25008 3858 1404 17382 21197 15526 18729 18239 9520
7860I520j255K1109J4415o03p563r260j5985K483k258L385J5843O655p383o264
$$ 9520 8265 29374 43789 43186 35623 26363 10378 12861 10603 13988 29831 36486 29103 22839
7846B2839k580m449n265N396k180j347P087k374q82r247J449P785Q22k897O896
$$ 22839 20259 15810 10545 15941 13761 12414 19501 17127 16245 6998 8447 16232 17054 14157 21053
7831B1053O361j4633j19N052k532P98Q103O704q89n730j7610l814L353N350N352
$$ 21053 27414 12781 12662 17714 15182 15980 24083 30787 29898 24168 6558 2744 6097 11447 16799
7816A6799L023q364L514q344n260J580J781k580L156k963K814J4322J6944R336
$$ 16799 19822 11458 14972 6628 1368 2948 4729 2149 5305 2342 5156 19478 36422 45758
7802D5758j5524r539j453o66m812P678J364K522j6574j3300R77J7437J931q59
$$ 45758 30234 20695 19242 18576 13764 21442 22806 25328 8754 -4546 -3569 13868 15799 14940
7788A4940n86L436l899p035K644P227J147j1555k1100Q316M350J7121P44m806
$$ 14940 14354 17790 13891 6856 9500 16727 17874 6319 -14781 -6465 -2115 15006 15750 10944
7774A0944L467J0435j1846j462M150l090j5389L799J642P614O017n889R292R237
$$ 10944 14411 24846 13000 11538 15688 12598 -2791 1008 2650 10264 16281 10392 19684 28921
7760B8921q703j3520M175R472n160k278q662J3352n051k001j159R8k766j690l833
$$ 28921 20218 6698 10873 20345 15185 12907 4245 17597 12546 10545 9386 9484 6718 5028 1195
7745A195j3863m998L39K29J3921J7250O052q139M862M951l404O678j277j3510
$$ 1195 -12668 -17666 -17327 -17098 -3177 14073 20125 11986 16848 21799 18395 25073 23796 10286
7731A0286J1122J954r439j0425r476J086K578j161Q337l55j3469m317n61M749
$$ 10286 21408 23362 13923 3498 -5978 -4892 -2314 -3475 4862 4507 -8962 -13279 -13840 -9091
7717i091O241N377J40P18l015p504M9P772O261j422J304l260L023R775l695M913
$$ -9091 -2850 2527 2667 3385 370 -7134 -7085 687 6948 5526 6830 3570 6593 16368 12673 17586
7701A7586M725K151j561r198r250o784j108M840m240Q734O503M145O311j698k629
$$ 17586 22311 24462 22901 13703 4453 -2331 -3439 1401 -2839 5895 12398 16543 22854 21156 18527
7686A8527j4563M468N210j690o094k602n342J0390J059k268j1444K607Q633M390
$$ 18527 3964 8432 13642 11952 5858 3256 -2086 8304 9363 7095 -4349 -1742 6891 11281
7672A1281n095l821l671l719K570l607k447P07P68J2871M064j1211r822n69q048
$$ 11281 6186 2365 -1306 -5025 -2455 -6062 -8509 -7802 -7034 5837 9901 -1310 -11132 -11701 -19749
7657a9749n17l14r34J3098K059L33P834R779l987r200m11J5048J1362n512M254
$$ -19749 -20266 -20580 -21514 -8416 -6357 -6024 1810 11589 7602 -1598 -2009 13039 24401 18889 23143
7642B3143J666p848j0556j07Q813J609l780m844k078p309j0023m596m314K395
$$ 23143 24809 16961 6405 6298 15111 16720 12940 8096 6018 -1291 -11314 -15910 -20224 -17829
7628a7829o63K488J6126K748j1166K00N34K0065J1571n054L802j321j4477P601
$$ -17829 -18492 -16004 122 2870 -8296 -8096 -7562 12503 24074 19020 22822 21501 7024 14625
7614A4625j64o296j1715j915O360O347K629L441R16O725m497j176n347l816J0063
$$ 14625 14461 8165 -3550 -5465 895 7242 9871 13312 14228 20953 16456 15280 9933 6117 16180
7599A6180M197k957k462J256Q085q984r259M595J9201l334j0052K017n696q024
$$ 16180 20377 17420 14958 16214 24299 15315 6056 10651 29852 26518 16466 18483 12787 4763
7585D763N54J852m875n028Q913l443j210l86j683N732m2L4N622l047o978l235
$$ 4763 5317 7169 2294 -2734 6179 2736 1526 1140 -543 5189 5147 5181 10803 7756 778 -2457
7569b457k507P677J0257p358J3046J0987k081j2890k770J6052k452j8471L778
$$ -2457 -4964 2713 12970 5612 18658 29645 27564 14674 11904 27956 25504 7033 10811
7556A0811N807r35p609p505k177k327n299k700L428j2059J748Q449R976J2302
$$ 10811 16618 15683 8074 569 -1608 -3935 -9234 -11934 -8506 -20565 -18817 -10368 -392 11910
7542A1910O122l114p472l72L366J520j0685o932n471J8986K0662n718j7079j1106
$$ 11910 18032 14918 7446 7074 10440 11960 1275 -5657 -11128 7858 28520 22802 5723 -5383
7528e383j278Q493M77N569r532L909J4747M099J1562l072J4168l371j6571j0090
$$ -5383 -6661 1832 2309 7878 -1654 2255 17002 21101 32663 29591 43759 40388 23817 13727
7514A3727k5714M258R354M638M908k307k199L550N801K666N04J979O549r023o869
$$ 13727 -11987 -7729 1625 6263 11171 8864 6665 10215 16016 18682 19186 21165 27714 18691 11822
7499A1822L494l230j323l282p232O907P926J428r58p018q067l53K969p363m134
$$ 11822 15316 12086 10763 7481 249 7156 15082 16510 15552 8534 467 114 3083 -4280 -8414
7484h414Nl348N561k302l20J4821N815l587r423l093M360K565L568k011K13Q588
$$ -8414 -8409 -11757 -6196 -8498 -8818 6003 11818 8231 -1192 -4285 75 2640 6208 4197 4410 12998
7468A2998j360m264R517J1055j0253k189o468j3194J572j803m218M998q742K52
$$ 12998 11638 7374 16891 27946 17693 15504 9036 -4158 -2586 -4389 -8607 -3609 -12351 -12099
7454a2099j331K840N979O124N599O718K635M982p575l531n037N559J876k907n135
$$ -12099 -13430 -10590 -4611 1513 7112 13830 16465 21447 13872 10341 5304 10863 12739 9832 4697
7439D697o02r5J023l673r074O90J3284L592Q492N955j3780j3642o26M918P63n799
$$ 4697 4095 4000 5023 1350 -7724 -7034 6250 9842 18334 24289 10509 -3133 -3759 1159 1922 -3877
7423c877l555l388K698L858M53O173R739l463K250J734j1201M062M677O31j8308
$$ -3877 -7432 -10820 -8122 -4264 -3811 2362 12101 8638 10888 12622 1421 5483 10160 10791 -7517
7408g517K930P991J204j810M783L581n212r645o762M853k279j1306k817p1P974
$$ -7517 -4587 3404 4608 2798 7581 11162 5950 -3695 -10457 -5604 -7883 -19189 -22006 -22077 -14103
7393a4103L737j084J1802M567j955r50J7259J2498p827q352p349j745j960K112
$$ -14103 -10366 -11450 352 4919 2964 2014 19273 31771 23944 15592 8243 6498 4538 6650
7379F650m645M53L572M370r70p966l362k809j5175l992O202J1720P153l947K21
$$ 6650 2005 2458 6030 10400 9430 1464 -1898 -4707 -19882 -23874 -17672 -5952 1201 -2746 -2525
7364b525q943L006O527q523Q598N549L686l746l577J1186k607O150L024k199k621
$$ -2525 -11468 -8462 -1935 -10458 -1860 3689 7375 3629 52 11238 8631 14781 17805 15606 12985
7349A2985o391l533O906l245j147j614N103J1056J342k869j4646j4597K8J782
$$ 12985 6594 3061 9967 6722 5575 3961 9064 20120 21462 18593 3947 -10650 -10622 -8840
7335h840N917N118o361o888L2M403J1021O238l661n222o964K560j980o743J720
$$ -8840 -2923 2195 -4166 -11054 -11022 -6619 4402 10640 6979 1757 -5207 -2647 -4627 -11370 -9650
7320i650J2425o780J61J3426O87m077p554K079o032n936M417L434j1637L457K488
$$ -9650 2775 -4005 -3844 9582 10269 6192 -1362 717 -5315 -11251 -6834 -3400 -15037 -11580 -9092
7305i092r232L537Q421L781j390J632N332m14J265K491l977m834l678J960J0385
$$ -9092 -18324 -14787 -6366 -2585 -3975 -2343 2989 2575 3840 6331 2354 -2480 -6158 -4198 6187
7290F187O916L767J1829p281o037n164k024j227r050q54J12N075n414j0887m879
$$ 6187 13103 16870 28699 21418 15381 10217 8193 6966 -2084 -2938 -2826 2249 -3165 -14052 -18931
7275a8931N243J3100J605N344N674k676p647K726r013r658O768k13J2683L018
$$ -18931 -13688 -588 1017 6361 12035 9359 1712 4438 -4575 -14233 -7465 -7678 5005 8023
7261H023M666P120n251J228J3443j1248r484k272K306L016k687p482j2521J232
$$ 8023 12689 19809 14558 15786 29229 17981 8497 6225 8531 11547 8860 1378 -11143 -9911
7247i911Q640J991Q57j0347N57J1808j2093k886J3674R956O172q716p226O247
$$ -9911 -1271 720 1577 -8770 -8213 3595 -8498 -11384 2290 12246 18418 9702 2476 8723
7233H723m821n030K329K625j0597j4911r970J2712J1346l742k501p008J2302M664
$$ 8723 3902 -1128 1201 3826 -6771 -21682 -31652 -18940 -7594 -11336 -13837 -20845 -8543 -3879
7219c879K915J3319j1507p301O448O085j387p803L749Q999Q248Q58j881l446m743
$$ -3879 -964 12355 848 -6453 -5 6080 4693 -3110 639 9638 17886 18744 16863 13417 8674
7204H674n948l366m64O744M910j064q823P372m690n114p434k798R061j319m156
$$ 8674 2726 -640 -1104 5640 10550 9486 663 8035 3345 -1769 -9203 -12001 -2940 -4259 -8415
7189h415j1968o185Q314P113Q02j950P209Q33n609Q477M509K46N764j480k479
$$ -8415 -20383 -26568 -18254 -11141 -10339 -12289 -5080 -4247 -9856 -1379 3130 3376 9140 7660 5181
7174E181j1229J5815J0005k503k919p537l454J4972J302j4365j378K075m591o286
$$ 5181 -6048 9767 19772 17269 14350 6813 3359 18331 19633 5268 3890 5965 1374 -4912
7160d912m615j79K1072J2252l540j1686j3754o411k421N999n119M57Q788j475
$$ -4912 -9527 -9706 11366 23618 20078 8392 -5362 -11773 -14194 -8195 -13314 -12857 -4069 -5544
7146e544N523J0528O6j0837j448Q813k559k265l835q38J3620R488M829j998r437
$$ -5544 -21 10507 10573 -264 -1712 7101 4542 2277 -1558 -2396 11224 20712 25541 23543 14106
7131A4106m827l866m057l521m642L940k461j541K077o094N770r584M173O189M660
$$ 14106 9279 5413 1356 -2165 -6807 -2867 -5328 -6869 -4792 -10886 -5116 -14700 -10527 -4338 322
7116C22O162K027j699P39L12j320O900j737j1580M120m393N650n254j2702N740
$$ 322 6484 8511 6812 7551 7863 6543 13443 11706 126 4246 -147 5503 249 -12453 -6713
7101f713M26M670M141o496J173j1353J5651J393j0802p23L769Q01J257j535q77
$$ -6713 -6287 -1617 2524 -3972 -2799 -14152 1499 2892 -7910 -8633 -4864 -4063 -2806 -4341 -5218
7086e218m829K095l941L177O401J4292j158m033L982l086j2816k330R982q195
$$ -5218 -10047 -7952 -11893 -8716 -2315 11977 10819 6786 10768 7682 -5134 -7464 2518 -5677
7072e677J424n680k137J4416K190r03Q921n257p514l7K132M604k687o224j3704
$$ -5677 -4253 -9933 -12070 2346 4536 3633 12554 7297 -217 -254 1878 6482 3795 -2429 -16133
7057a6133p400L899J8199J0833q019o510j400L909Q716J588j1874j0786p326L438
$$ -16133 -23533 -19634 -1435 9398 1379 -5131 -6531 -2622 6094 7682 -4192 -14978 -22304 -18866
7043a8866J106m0K268J383J4207J0772K727o482r995o238k272J0649J501m792
$$ -18866 -17760 -17800 -15532 -14149 58 10830 13557 7075 -2920 -9158 -11430 -781 720 -4072
7029d072P551R601M693j1041r971l312Q986K054j2914m369K174J1133R455o087
$$ -4072 3479 13080 17773 6732 -3239 -6551 2435 4489 -8425 -12794 -10620 513 9968 3881
7015C881J035M551m487m629R355o766p124q8q471mL993l651O066J3616M990k830
$$ 3881 4916 9467 4980 351 9706 2940 -4184 -4272 -12743 -12747 -8754 -12405 -6339 7277 12267 9437
6999I437l033o944J357R364J5325j595r787k099J0986q663j4710R146J224j5400
$$ 9437 6404 -540 817 10181 25506 23911 14124 12025 23011 14348 -362 8784 10008 -5392
6985e392o591n537N398J500M799N769J64o200L254l947j2168P090J2912m092l927
$$ -5392 -11983 -17520 -12122 -10622 -5823 -54 110 -6090 -2836 -6783 -18951 -11861 1051 -3041 -6968
6970f968k867m307j0966L040P193n626P344L211p147Q262o81L599N015q953n395
$$ -6968 -9835 -14142 -25108 -22068 -14875 -20501 -13157 -9946 -17093 -8831 -9512 -5913 -898 -9851 -15246
6955a5246J8020L60j0751K079j0758j0018l15J2659P692Q712J5115p065k914l133
$$ -15246 2774 3134 -7617 -5538 -16296 -26314 -26629 -13970 -6278 2434 17549 10484 7570 4437
6941D437j0688n342J407k65M41M94m207j3222r473J1891K270n191j509J1432L507
$$ 4437 -6251 -11593 -10186 -10451 -10010 -9516 -13723 -26945 -36418 -24527 -22257 -27448 -28957 -17525 -14018
6926a4018N020k607K671N831n151L163m477n265M004R14J0997L061K918o087j088
$$ -14018 -8998 -11605 -8934 -3103 -8254 -5091 -9568 -14833 -10829 -9915 1082 4143 7061 974 -114
6911a14n064j441j1705O026m191l689Q771p131q437J1197j364o504O072P73M872
$$ -114 -5178 -6619 -18324 -12298 -16489 -20178 -11407 -18538 -26975 -15778 -17142 -23646 -17574 -16801 -11929
6896a1929L694p917L817N126q969p438K921N965r64j407j2121M076R493K618K122
$$ -11929 -8235 -16152 -12335 -7209 -16178 -23616 -20695 -14730 -15694 -17101 -29222 -25146 -15653 -13035 -10913
6881a0913r092j288O551K680m67J5041J0116l795k719K510M028m760l32P488r874
$$ -10913 -20005 -21293 -14742 -12062 -12529 2512 12628 8833 6114 8624 12652 7892 7560 15048 5174
6866E174l154K0428J1209p187k315M394m455j2236k328L386J0k860m739q328M352
$$ 5174 2020 22448 33657 26470 24155 28549 24094 11858 9530 12916 12926 10066 5327 -3001 1351
6851A351O890r089J6170L216m044m483j1653j0834J3986J0040L403l370r983n760
$$ 1351 8241 -848 15322 18538 14494 10011 -1642 -12476 1510 11550 14953 11583 1600 -4160
6837d160j0462P408O071l694l498l174p162j299p36N610N524k112n65K924K977
$$ -4160 -14622 -7214 -1143 -4837 -8335 -11509 -18671 -19970 -20706 -15096 -9572 -11684 -12249 -9325 -6348
6822f348J4742J0059r615M000N054l479R738l614r117q171L401L665j0703L692
$$ -6348 8394 18453 8838 12838 17892 14413 24151 20537 11420 3249 6650 10315 -388 3304
6808C304N113m300p049q651N742M425J855k617m354L378R333J962q089q807n092
$$ 3304 8417 4117 -2932 -11583 -5841 -1416 439 -2178 -6532 -3154 6179 8141 52 -8755 -13847
6793a3847J276Q614M411n431L938J1744K42J237j0305q785n092o372J420Q352
$$ -13847 -12571 -3957 454 -4977 -1039 10705 10947 12184 1879 -6906 -11998 -18370 -16950 -8598
6779h598J2822Q456O40k856q721j891N32O033j758m119l124j0510j5941Q568J1353
$$ -8598 4224 12680 13320 10464 1743 -148 384 6417 4659 540 -2584 -13094 -29035 -20467 -9114
6764i114J1419p143r959p878J834Q60K685P777J1205Q590r836k866j409q062j967
$$ -9114 2305 -4838 -14797 -22675 -20841 -19981 -17296 -9519 1686 10276 440 -2426 -3835 -11897 -13864
6749a3864P28n74O402r13j309J0440O895J7759Q165j3102j2577q873L379j0982
$$ -13864 -13136 -13710 -7308 -8221 -9530 910 7805 25564 33729 20627 8050 -823 2556 -8426
6735h426q066O109J2318o630r431L694J5080J1217r550j0080M796l944m46J087
$$ -8426 -16492 -10383 1935 -4695 -14126 -10432 4648 15865 6315 -3765 1031 -2913 -3359 -2272
6721b272J814J5222J5107n953p220l316N857K950l168l192p943j3470K694p850
$$ -2272 -458 14764 29871 23918 16698 13382 19239 22189 19021 15829 7886 -5584 -2890 -10740
6707a0740j0177L030J5718R985J49m170M578M091j0176k335n328R45Q227J538
$$ -10740 -20917 -17887 -2169 7816 7965 3795 8373 12464 2288 -47 -5375 -4430 3797 5335
6693E335l845R672L944j3965k3072J3472J7686J0697n00M440j674o702l799K057
$$ 5335 1490 11162 15106 1141 -21931 -8459 9227 19924 19424 23864 22190 15488 11689 13746
6679A3746o953O429J0226r659j4454L809n720j1736K685N162J3856K52j638K958
$$ 13746 6793 13222 23448 13789 -665 3144 -2576 -14312 -11627 -6465 7391 7643 6005 8963
6665H963n67l290q086m587O580N958L582l421o768j1405P665J2553O59j357N422
$$ 8963 8396 5106 -2980 -7567 -987 4971 8553 5132 -1636 -13041 -5376 7177 7836 6479 11901
6650A1901J6163L667l263j4293l744r469q560o510q002P328J2238O132j606q964
$$ 11901 28064 31731 28468 14175 10431 962 -7598 -14108 -22110 -14782 -2544 3588 1982 -6982
6636f982J96M102R71J160K174Q671l68J895m530n707J2174Q034j051j0480q668
$$ -6982 -6786 -2684 -1713 -553 1621 10292 9924 11819 7289 1582 13756 21790 20739 10259 1591
6621A591O759r881p833p362P973O939J2123J0506j6829j137l180o402P68N708
$$ 1591 8350 -1531 -9364 -16726 -8753 -1814 10309 20815 3986 2849 -331 -6733 -5965 -257
6607b57n34q88L861N337j1051m812j805Q035N244j1186n24k164k379O827Q035
$$ -257 -791 -1679 2182 7519 -3532 -8344 -10149 -2114 3130 -8056 -8580 -10744 -13123 -6296 1739
6592A739o241M489J1198k028p033M309p374k648R953J1205Q414j391p492n254
$$ 1739 -4502 -13 11185 9157 2124 6433 -941 -3589 6364 17569 25983 24592 17100 11846
6578A1846r216l500j0289j0201K489l137L271K299P598L450K149k320n206P746
$$ 11846 2630 -870 -11159 -21360 -18871 -22008 -18737 -16438 -8840 -5390 -3241 -5561 -10767 -3021
6564c021J1015o597j0319L606m309p81O100J411n298m071K011O508K18n405M60
$$ -3021 7994 1397 -8922 -5316 -9625 -10406 -4306 -2895 -8193 -12264 -10253 -3745 -3527 -8932 -8472
6549h472M437L582K216k028n809J398j1009m043N093J0399q07R730j2960q055
$$ -8472 -4035 -453 1763 -265 -6074 -4676 -15685 -19728 -14635 -4236 -5043 4687 -8273 -16328
6535a6328J64Q767J908k023J0159Q057N581p225j2285K855K506M652p864p981
$$ -16328 -16164 -7397 -5489 -7512 2647 10704 16285 9060 -3225 -370 2136 6788 -1076 -9057
6521i057k922q18R812j329p786P51M541J438K603n662j333o014N585R849m806
$$ -9057 -11979 -12797 -2985 -4314 -12100 -11349 -6808 -5370 -2767 -8429 -9762 -15776 -10191 -342 -5148
6506e148r212P953J802J832l331j0510j9333L713J0039j639k437N131J1039J2103
$$ -5148 -14360 -6407 -4605 -2773 -6104 -16614 -35947 -32234 -22195 -23834 -26271 -21140 -10101 2002
6492B002J3800k741j2K043J328l508q666n771J0686R82k512p322j387Q869q135
$$ 2002 15802 13061 13049 15092 16420 12912 4246 -1525 9161 10143 7631 309 -1078 7791 -344
6477c44j0808n126n189Q106P559M615Q334l432j1691n19N190R289l862O660M090
$$ -344 -11152 -16278 -21467 -13361 -5802 -1187 7147 3715 -7976 -8495 -3305 5984 2122 8782 12872
6462A2872o397q035j386J537M10j5164k704m54O624K642Q185L099M90K784l874
$$ 12872 6475 -1560 -2946 -1409 -999 -16163 -18867 -19321 -12697 -10055 -1870 1229 1719 4503 629
6447F29J789L37k382j5208r970O296J8876J2028K116q146J309J412q531j6326
$$ 629 2418 2755 373 -14835 -24805 -18509 367 12395 14511 6365 7674 9086 555 -15771
6433a5771l152J922J7634J6497m341j0605m591q025p685O696Q490l088M652J0350
$$ -15771 -18923 -17001 633 17130 12789 2184 -2407 -10432 -18117 -11421 -2931 -6019 -1367 8983
6419H983J862j6121j1584L630j495p138J902M833N116K463Q885K36L857p687j0091
$$ 8983 10845 -5276 -16860 -13230 -14725 -21863 -19961 -15128 -10012 -7549 1336 1572 5429 -2258 -12349
6404a2349K366M36R900R699J0005J0025m148j1488n096J249l978Q068j962k135
$$ -12349 -9983 -9547 353 10052 20057 30082 25934 14446 9350 10599 6621 14689 12727 10592
6390A0592M52o520J524K735o442j5100j1851R312O432J738O125N565n218j8020
$$ 10592 11044 4524 6048 8783 2341 -12759 -24610 -15298 -8866 -7128 -1003 4562 -656 -18676
6376a8676r899J1553o958M534J0565N261q000k431M957R245O788p291O626k756
$$ -18676 -28575 -17022 -23980 -19446 -8881 -3620 -11620 -14051 -9094 151 6939 -352 6274 3518
6362C518o249K778j052J9850K357j3967P034J923o116l117m562K191j443J2364
$$ 3518 -2731 47 -1005 18845 21202 7235 14269 16192 10076 6959 2397 4588 3145 15509
6348A5509m47k2165j9259R172J8055n690l799Q575K395m722M651J6939Q376j0074
$$ 15509 15062 -7103 -26362 -17190 865 -4825 -8624 -49 2346 -2376 2275 19214 27590 17516
6334A7516j3501J442o916r604n63Q620K726l132O168j3888j3069l147M218O064
$$ 17516 4015 5457 -1459 -11063 -11626 -3006 -280 -3412 2756 -11132 -24201 -27348 -23130 -17066
6320a7066J2624j022j352R233n097m905j050N061lK711R010Q742P756o319j6444
$$ -17066 -4442 -5464 -6816 2417 -2680 -7585 -8635 -3574 -3577 -866 8144 16886 24642 18323 1879
6305A879l983J853L107L373m652p435J9J7459O997J117j84j1675k0156q851O374
$$ 1879 -2104 -251 2856 6229 1577 -5858 -5839 11620 18617 19734 19550 7875 -12281 -21132 -14758
6290a4758j444m581P967Q566J1627j1454j506N06j827J111P860r759M447J326
$$ -14758 -16202 -20783 -12816 -4250 7377 -4077 -5583 -5077 -6904 -5793 2067 -7692 -3245 -1919
6276a919M52K902L91J524k997p590l824M302O011M541L107n820R59k027R778J1793
$$ -1919 -1467 1435 1826 3350 353 -7237 -11061 -6759 -748 3793 6900 1080 2039 12 9790 21583
6260B1583j0904j6880k074Q230j4j7708J133R143r062N514P394L341p881Q12n514
$$ 21583 10679 -6201 -8275 -45 -59 -17767 -16634 -7491 -16553 -11039 -3645 -304 -8185 -7373 -12887
6245a2887Q55J5121Q182j1998j1770n36P690J527O074J4475n379j0247j6614j0175
$$ -12887 -12032 3089 11271 -727 -12497 -13033 -5343 -3816 2258 16733 11354 1107 -15507 -25682
6231b5682J3391j806P432K193O035Q394Q70j1466j4888N435N231J44M465K60O140
$$ -25682 -12291 -14097 -6665 -4472 1563 9957 10827 -639 -15527 -10092 -4861 -4717 -252 8 6148
6216F148Q41j1384n487O739M912q614j4735J677J2579J4051L677j3402p858M579
$$ 6148 6989 -4395 -9882 -3143 1769 -6845 -21580 -19903 -7324 6727 10404 -2998 -10856 -6277
6202f277Q974K363o596O03J417k302o715J839J0867l731j417l819j874J1169L168
$$ -6277 2697 5060 -1536 -933 484 -1818 -8533 -6694 4173 442 -975 -4794 -6668 4501 7669
6187G669l596N814J00k224O630j517q437q173j1397m86j899J650Q886K518k738
$$ 7669 4073 9887 9987 7763 14393 12876 4439 -3734 -15131 -15617 -17516 -15866 -6980 -4462 -7200
6172g200n65L421L792L196O30N16J517k709m946r004l938N230Q207k687O005J785
$$ -7200 -7765 -4344 -552 2644 3274 3790 5307 2598 -2348 -11352 -15290 -10060 -1853 -4540 1465 3250
6156C250k698l952J170J292O848J590L311o66j349O591p120j3304j2137l117j280
$$ 3250 552 -3400 -2230 -938 5910 7500 10811 10145 8796 15387 8267 -5037 -17174 -20291 -21571
6141b1571J0252n398N12J2115O177J1890N424p617O14j5194m068R09p797k610
$$ -21571 -11319 -16717 -16205 -4090 2087 13977 19401 11784 12398 -2796 -6864 -5955 -13752 -16362
6127a6362p777J978O135Q355J482j0531o967L368k282M114P613N900O754o257
$$ -16362 -24139 -22161 -16026 -7671 -6189 -16720 -23687 -20319 -22601 -18487 -10874 -4974 1780 -4477
6113d477M90J1236k475j3416l726m083L856P936N806N399k814l942o390l381j708
$$ -4477 -3987 7249 4774 -8642 -12368 -16451 -12595 -4659 1147 6546 3732 -210 -6600 -9981 -11689
6098a1689j245L93N608J119J1460L640l93J565K610J652l934p490R75N514j0189
$$ -11689 -12934 -12541 -6933 -5814 5646 9286 8893 10458 13068 14720 10786 3296 4271 9785 -404
6083d04q94J6479j0327k768Q435M830k018l753j0027l426l207j424l260p800j95
$$ -404 -1298 15181 4854 2086 10521 15351 13333 9580 -447 -3873 -7080 -8504 -11764 -19564 -19759
6068a9759m721m967J0794L389R587O714q671J0105J1196J408J4219j0320k247
$$ -19759 -24480 -29447 -18653 -15264 -5677 1037 -7634 2471 13667 15075 29294 18974 16727
6055A6727L290L402L06m125k346m014l555j7063j9802r958P671J3056n23J0515
$$ 16727 20017 23419 23725 19600 17254 13240 9685 -7378 -27180 -37138 -29467 -16411 -16934 -6419
6041f419j410j8675k762J7510J5236J74O517N639j0730j8704N376J2591K1080
$$ -6419 -7829 -26504 -29266 -11756 3480 3654 10171 15810 5080 -13624 -8248 4343 25423
6028B5423l436k2062j9891N18j162n508M830N715N666O123L46L831O068K262J155
$$ 25423 21987 -75 -19966 -19448 -20610 -26118 -21288 -15573 -9907 -3784 -3438 393 6461 8723 9878
6013I878m997n005M151P726N957q299N439p143j1177o146j769R678Q673k655m018
$$ 9878 4881 -124 4027 11753 17710 9411 14850 7707 -3470 -9616 -11385 -1707 6966 4311 293
5998B93L348j0651P922J8832j0634j3953Q367J663O574l385j4066o19P311N726
$$ 293 3641 -7010 912 19744 9110 -4843 3524 5187 11761 8376 -5690 -6309 1002 6728
5984F728o372j2582j849p687L964J92L705L797j110m633M73J4285K526L502l556
$$ 6728 356 -12226 -14075 -21762 -17798 -17606 -13901 -10104 -11214 -15847 -15374 -1089 1437 4939 1383
5969A383k777R347K662M520j8045j7013J506j597J0941M615J0046J1783M282l589
$$ 1383 -1394 7953 10615 15135 -2910 -19923 -18417 -20014 -9073 -4458 5588 17371 21653 18064
5955A8064j8208j7559j27J9692J4012j6j467Q38r196j3157j1252p883Q000R651
$$ 18064 -144 -17703 -17830 1862 15874 15858 14391 15229 6033 -7124 -18376 -26259 -18259 -8608
5941h608R333j968m490O798j627J011k164q265J4944P637n894r344L574R667k181
$$ -8608 725 -1243 -5733 1065 -562 449 -1715 -9980 4964 12601 6707 -2637 937 10604 8423
5926H423k577k517q414m102o833Q61P843N459O330m345R06o297j2606o070L283
$$ 8423 5846 3329 -5085 -9187 -16020 -15159 -7316 -1857 4473 128 1034 -5263 -17869 -23939 -20656
5911b0656J2321J0114N00M765K338N000J0391k84k1190N30J589j2638j049P588
$$ -20656 -8335 1779 2279 7044 9382 14382 24773 24489 3299 3829 5418 -7220 -8269 -681
5897f81m288j2654j422J4008J609J292M99Q79J793Q740R714j0801j0732P891J837
$$ -681 -4969 -17623 -19045 -5037 -3428 -2136 -1637 -758 1035 9775 19489 8688 -2044 5847 7684
5882G684p36Q75L146j341r537n226P430J93p022m413N095M098P963k189j0821
$$ 7684 6948 7823 10969 9628 91 -5135 2295 2488 -4534 -8947 -3852 246 8209 6020 -4801
5867d801q312o328M271K685O491K844K645J0151l099N599N26n550n198q890J8481
$$ -4801 -13113 -19441 -15170 -12485 -5994 -3150 -505 9646 6547 12146 12672 7122 1924 -6966 11515
5852A1515J2500q686r025j2264K7P530P708o636l808K112M660m062L762k661Q64
$$ 11515 24015 15329 6304 -5960 -5933 1597 9305 2669 -1139 973 5633 1571 5333 2672 3536
5837C536K14q906J0164Q166j3102r692o572m369J6158O530k714k077M14l393q86
$$ 3536 3750 -5156 5008 13174 72 -9620 -16192 -20561 -4403 2127 -587 -2664 -2250 -5643 -6529
5822f529m44k380N170j97p841o568j947m115J869K503Q607n734P301L906N459
$$ -6529 -6973 -9353 -4183 -4380 -12221 -18789 -20736 -24851 -22982 -20479 -11872 -17606 -10305 -6399 -940
5807i40k381j5K476o053K402N492j3868m50k375j455m004r049r830k544M079J4891
$$ -940 -3321 -3336 -860 -6913 -4511 981 -12887 -13337 -15712 -17167 -21171 -30220 -40050 -42594 -38515 -23624
5791b3624Q615n687O017R375J1898P628k037j1152j1976j0068M462q459j80J5570
$$ -23624 -15009 -20696 -14679 -5304 6594 14222 12185 1033 -10943 -21011 -16549 -25008 -25188 -9618
5777i618O023J38m226j181J060J130J0427Q45l641j0315J660m737L772M50L193
$$ -9618 -3595 -3457 -7683 -8864 -7804 -6674 3753 4598 957 -9358 -7698 -12435 -8663 -8213 -5020
5762e020O002o554J77K168K321M588p612n220k545L599j743m260J720K568Q908
$$ -5020 982 -5572 -5395 -3227 -906 3682 -3930 -9150 -11695 -8096 -9839 -14099 -12379 -9811 -903
5747i03n570n895J2691O998j8366m195J0117j943q714K897J3753J0647n902n161
$$ -903 -6473 -12368 323 7321 -11045 -15240 -5123 -7066 -15780 -12883 870 11517 5615 454
5733D54j089k873q96J3786J220k975l922l218K68K707j2666k501N908P489N65
$$ 454 -635 -3508 -4404 9382 10602 7627 3705 487 755 3462 -9204 -11705 -5797 1692 2257
5718B257o729n616j267O569N514j609o005n302L703M10o064l906P140q308J0060
$$ 2257 -4472 -10088 -11355 -4786 728 -881 -6886 -12188 -8485 -8075 -14139 -18045 -10905 -19213 -9153
5703i153Q919Q163q58L794k0208j2202p30M771R120R694l362j808q134j2987K800
$$ -9153 -234 7929 7071 10865 -9343 -21545 -22275 -17504 -8384 1310 -2052 -3860 -11994 -24981 -22181
5688b2181J1276j0102j0069N964Q926M040K1804J5362p947m860r942j909Q877
$$ -22181 -10905 -21007 -31076 -25112 -16186 -12146 9658 25020 17073 12213 2271 362 9239
5675I239R051J125p175n80m708j0520o46j257N683j494J5513N52o664j500L375
$$ 9239 18290 19415 12240 11660 6952 -3568 -4214 -5471 212 -1282 14231 14783 8119 6619 9994
5660I994m424j1400j794J840j3637j3255K898L669J1393O808R192O281m008j166
$$ 9994 5570 -5830 -7624 -5784 -19421 -32676 -29778 -26109 -14716 -7908 1284 7565 3557 2391
5646B391k484L586O513m079j210l030j3911K781P478n352P276J1908j1538j0699
$$ 2391 -93 3493 10006 5927 4717 1687 -12224 -9443 -1965 -7317 -41 11867 329 -10370
5632a0370P818K169k752Q801j037n61r20k390P133o821r760r846r260O27J5582
$$ -10370 -2552 -383 -3135 5666 4629 4068 3148 758 7891 1070 -8690 -18536 -27796 -27169 -11587
5617a1587K770k891k006o945N182J3747q451O77K532K019l35J315N164j589J199
$$ -11587 -8817 -11708 -13714 -20659 -15477 -1730 -10181 -9504 -6972 -4953 -5288 -3973 1191 -398 801
5602H01P453j052o054p891n589J897M188p46k27K060r624L540Q385q85l85j61
$$ 801 8254 7202 1148 -6743 -12332 -10435 -6247 -6993 -7220 -5160 -14784 -11244 -2859 -3744 -4129 -4290
5586d290q888o266J5096P966N631j0348j904q531o297P367J7544J0570l709J153
$$ -4290 -13178 -19444 -4348 3618 9249 -1099 -3003 -11534 -17831 -10464 7080 17650 13941 15094
5572A5094J5221o173j7900r363Nl050R1N574m228j2002L755J0175P043j251m262
$$ 15094 30315 24142 6242 -3121 -3116 -6166 -6075 -501 -4729 -16731 -12976 -2801 4242 2991 -1271
5557a271q68m516L13k943M264P450k312r349p850j2132n783J5635J1359l87p279
$$ -1271 -2139 -6655 -6342 -9285 -5021 2429 117 -9232 -17082 -29214 -34997 -19362 -8003 -8390 -15669
5542a5669q883Q847r71P575J4688O697p03m518j0510J0038J555n218k730O300
$$ -15669 -24552 -15705 -16676 -9101 5587 12284 11581 7063 -3447 6591 8146 2928 198 6498
5528F498O133p137k393m290K806N947R276m674j0545M606P944j0394j2948p014
$$ 6498 12631 5494 3101 -1189 1617 7564 16840 12166 1621 6227 14171 3777 -9171 -16185
5514a6185K628J0919P914L804Q823l72n051J630k628j0316j752K650P735l184
$$ -16185 -13557 -2638 5276 9080 17903 17531 12480 14110 11482 1166 -586 2064 9799 6615
5500F615j0530J91J0965j2088p63o81L14o27L963J2412Q849p133j4423L578O94
$$ 6615 -3915 -3724 7241 -4847 -5610 -6291 -5977 -6604 -2641 9771 18620 11487 -2936 642 1336
5485A336J1177O766j88p102j4703j5420m430M752L518J1710L619r504l650O304
$$ 1336 12513 19279 19091 11989 -2714 -18134 -22564 -17812 -14294 -2584 1035 -8469 -12119 -5815
5471e815N517k954K145L268l821m350L278J4424r15m712p025J064J017M534o724
$$ -5815 -298 -3252 -1107 2161 -1660 -6010 -2732 11692 10777 6065 -960 104 1121 5655 -1069
5456a069j2278l169R499M698j235J5404M630o628k3256r28J1833Q343O117k524
$$ -1069 -13347 -16516 -7017 -2319 -3554 11850 16480 9852 -13404 -14332 -2499 5844 11961 9437
5442I437l667k445n708m956q620O430J2866N162R26j2989K314O175K376K703Q185
$$ 9437 5770 3325 -2383 -7339 -15959 -9529 3337 8499 9425 -3564 -1250 4925 7301 10004 18189
5427A8189K978l128j1340q814p73J515p79J445M299L737o621O561P56P547q081
$$ 18189 21167 18039 6699 -2115 -2888 -1373 -2152 -707 3592 7329 708 7269 8025 15572 7491
5412G491J1963j666j0296o863m10j098k904J924j5979Q573J2396j578n578q26
$$ 7491 19454 17788 7492 629 219 -879 -3783 -1859 -17838 -9265 3131 1553 -4025 -4851
5398d851o557o353Q728M851N05n011k660j6315l654K675J6169J9546P464J010
$$ -4851 -11408 -17761 -9033 -4182 -3677 -8688 -11348 -27663 -31317 -28642 -12473 7073 14537 15547
5384A5547r898j4384p186j909P015O362J191L588K672M138J052q283K86k996M035
$$ 15547 5649 -8735 -15921 -17830 -10815 -4453 -3262 326 2998 7136 8188 -95 191 -2805 1230
5369A230N658N901r090N499L368J671J473j0363o536M518K696J229J642j3976
$$ 1230 6888 12789 3699 9198 12566 14237 15710 5347 -1189 3329 6025 7254 8896 -5080
5355e080j0731N567N797k998N740J4252J2495j1653j0237N153j111Q894n558n518
$$ -5080 -15811 -10244 -4447 -7445 -1705 12547 25042 13389 3152 8305 7194 16088 10530 5012
5341E012K863J1678j494j3125j7073pJ0932Q319N171m945p168K965K0359k819
$$ 5012 7875 19553 18059 4934 -12139 -12146 -1214 7105 12276 7331 163 3128 23487 20668
5327B0668j2123j5563j509J302Q22p559J453J0161O951o644q185p788L948J5555
$$ 20668 8545 -7018 -8527 -7225 -6403 -13962 -12509 -2348 4603 -2041 -10226 -18014 -14066 1489
5313A489K486q758j4982O66R067q11R537q067j0771j802M878O323P718n499k616
$$ 1489 3975 -4783 -19765 -19099 -10032 -10843 -1306 -9373 -20144 -21946 -17068 -10745 -3027 -8526 -11142
5298a1142K704k020K644J943N038m560o89J1945j059L682n912r628J4534J6998
$$ -11142 -8438 -10458 -7814 -5871 -833 -5393 -6082 5863 4804 8486 2574 -7054 7480 24478
5284B4478m195L55K52k023l912q111m857N823K209l465p077o86k175p82l128M080
$$ 24478 20283 20638 20890 18867 14955 6844 1987 7810 10019 6554 -523 -1209 -3384 -4166 -7294 -3214
5268c214R217m4K156m118K563l844p65Q154P713n039o844K235Q00J465n925q243
$$ -3214 6003 5959 8115 3997 6560 2716 1951 10105 17818 12779 5935 8170 8970 10435 4510 -3733
5252c733Q709n040m106L155J3546j9048q366N909L202j1353K919J0400J1040m113
$$ -3733 4976 -64 -4170 -1015 12531 -6517 -14883 -8974 -5772 -17125 -14206 -3806 7234 3121
5238C121L60Q67K815K201j061K006M477n620n542q150m477K048K941j3522O466
$$ 3121 3481 4348 7163 9364 8303 10309 14786 9166 3624 -4526 -9003 -6955 -4014 -17536 -11070
5223a1070M079k275Q684N920J0625p741j5843j3903l502O614P596J999m809l88
$$ -11070 -6991 -9266 -582 5338 15963 8222 -7621 -21524 -25026 -18412 -10816 -8817 -13626 -14014
5209a4014l33K698n149K907J4717M540n215j003O701M454O690M641j236n545q412
$$ -14014 -14347 -11649 -16798 -13891 826 5366 151 -852 5849 10303 16993 21634 20398 14853 6441
5194F441K825p234n552p534k37J0543J951l485j315j862j141N143N063k195q737
$$ 6441 9266 2032 -3520 -11054 -11291 -748 1203 -2282 -3597 -5459 -6600 -1457 3606 1411 -7326
5179g326n125l037J2755l841O494l259p629J0556J2128k230k498L040O967n773
$$ -7326 -12451 -15488 -2733 -6574 -80 -3339 -10968 -412 11716 9486 6988 10028 16995 11222
5165A1222r967r323N437J0989j1768q898k884p605M845O661J1066R202n309m331
$$ 11222 1255 -8068 -2631 8358 -3410 -12308 -15192 -22797 -17952 -11291 -225 8977 3668 -663
5151f63Q87K38J0888Q176k2673j5427l653K334J3058n49K046n398j2215p694J2574
$$ -663 224 462 11350 19526 -3147 -18574 -22227 -19893 -6835 -7384 -5338 -10736 -22951 -30645 -18071
5136a8071J7016j680m561r13n548L105J801O783m288n411k800j581N941O402j760
$$ -18071 -1055 -2735 -7296 -8209 -13757 -10652 -8851 -2068 -6356 -11767 -14567 -16148 -10207 -3805 -5565
5121e565J135r759n128J0550R647r501k2395m74J0366J320j096R621J992n138
$$ -5565 -4430 -14189 -19317 -8767 880 -8621 -31016 -31490 -21124 -19804 -20900 -11279 -9287 -14425
5107a4425J3678Q07M970N227j6230k005k550R12J1171R655k623L154R108j0838
$$ -14425 -747 60 5030 10257 -5973 -7978 -10528 -9616 1555 11210 8587 11741 20849 10011
5093A0011j249k091p58L754k394j029J259r500j572k91r729J991N342J3349J8770
$$ 10011 8762 6671 5913 9667 7273 6244 7503 -1997 -3569 -3860 -13589 -11598 -6256 7093 25863
5078B5863m85o170J909M035l325j982p669m065j8154p675O020j1117Q039P989
$$ 25863 25378 19208 21117 25152 21827 19845 12176 8111 -10043 -17718 -11698 -22815 -14776 -6787
5064f787N465O437p59q344J0079m164q192L896p175j591K1318M202l618k26q49
$$ -6787 -1322 5115 4356 -3988 6091 1927 -6265 -2369 -9544 -11135 10183 14385 10767 10541 9692
5049I692j1971p646J069J995j7700j526L864N01k157J29K050m011J1624J9899
$$ 9692 -2279 -9925 -8856 -6861 -24561 -26087 -22223 -21722 -23879 -23750 -21700 -25711 -14087 5812
5035E812k380J486J6961q399n981n874q168k57J289L729J1296J833j906l805k109
$$ 5812 3432 4918 21879 13480 7499 1625 -6543 -6800 -5511 -1782 9514 11347 9441 5636 3527
5020C527Q01L340L180j0502l391j4450q601R981J0932K974k981l080P427Q83k349
$$ 3527 4328 7668 10848 346 -3045 -17495 -26096 -16115 -5183 -2209 -5190 -8270 -843 40 -2309
5005b309k071m449k090K887R35J2071m449r002K96k306p458r173J3189K542o231
$$ -2309 -4380 -8829 -10919 -8032 -7097 4974 525 -8477 -8181 -10487 -17945 -27118 -13929 -11387 -17618
4990a7618j1103J0083Q277o261J63M647N814L436j421k169n403m318N659J562
$$ -17618 -28721 -18638 -10361 -16622 -16459 -11812 -5998 -2562 -3983 -6152 -11555 -15873 -10214 -8652
4976h652j1418j380Q212L04n253j563L240Q789Q447K074n660k439r624m668J365
$$ -8652 -20070 -21450 -13238 -12934 -18187 -19750 -16510 -7721 726 2800 -2860 -5299 -14923 -19591 -18226
4961a8226J0087J1070M105K042p6m370N454J3374j689o997n167O023m778r835
$$ -18226 -8139 2931 7036 9078 9002 4632 10086 23460 21771 14774 9607 15630 10852 1017
4947A017K030P221l785o213o518k096o280J2460J163j048m5k944p796J747j4L397
$$ 1017 3047 10268 6483 270 -6248 -8344 -14624 -2164 -1001 -2049 -2094 -5038 -12834 -11087 -11101 -7704
4931g704o376j4531n697J3881l525m53L066J1202M476p855r010J3367J0939n59
$$ -7704 -14080 -28611 -34308 -20427 -23952 -24405 -21339 -10137 -5661 -13516 -22526 -9159 1780 1221
4917A221K768L058J818Q471N677j0281j4889k860l357J1477J3411J549r260M226
$$ 1221 3989 7047 8865 17336 23013 12732 -2157 -5017 -8374 3103 16514 18063 8803 13029
4903A3029P897o747j8325j332j027j148m02P43K564M009p038J637j3227n860J3901
$$ 13029 20926 14179 -4146 -5478 -6505 -7653 -8055 -7312 -4748 -739 -7777 -6140 -19367 -25227 -11326
4888a1326n123Q05K250n36M622Q173l9j2130k724j333k64k018K841r763R274j567
$$ -11326 -16449 -15644 -13394 -13930 -9308 -1135 -1174 -13304 -16028 -17361 -17625 -19643 -16802 -26565 -17291 -18858
4872a8858r355Q863J4631O751M871o784N68J2208J0407J763k127j1927q664q065
$$ -18858 -28213 -19350 -4719 2032 6903 119 687 12895 23302 25065 22938 11011 2347 -5718
4858e718n859Q475P094L737m513K714R236O628K586j0874j0118L719p801j3873
$$ -5718 -11577 -3102 3992 7729 3216 5930 15166 21794 24380 13506 3388 7107 -694 -14567
4844a4567j744j98P311p209j0257M031o843q185l679K253Q001J2942J2743N371
$$ -14567 -16311 -16509 -9198 -16407 -26664 -22633 -29476 -37661 -41340 -39087 -31086 -18144 -5401 -30
4830c0O313n209K319J1498J0665j1647l335N448J817o291p395p69O334P225l607
$$ -30 6283 1074 3393 14891 25556 13909 10574 16022 17839 11548 4153 3384 9718 16943 13336
4815A3336k520q812L012p399o118M623J2934p003j674L422P936L276o729j4710
$$ 13336 10816 2004 5016 -2383 -8501 -3878 9056 2053 379 3801 11737 15013 8284 -6426
4801f426l287k057m012o096Q848K3258J3536P9j0131n76j1980L240K143J438O181
$$ -6426 -9713 -11770 -15782 -21878 -13030 10228 23764 23843 13712 13136 1156 4396 6539 7977 14158
4786A4158l761q779n397j1535o962Q086Q079q228L018K500r447N089K133P77o444
$$ 14158 10397 1618 -3779 -15314 -22276 -14190 -6111 -14339 -11321 -8821 -18268 -13179 -11046 -10269 -16713
4771a6713o372J7059K179j7638k274N120J615L241J623Q419J0768r080j8794L090
$$ -16713 -23085 -6026 -3847 -21485 -23759 -18639 -17024 -13783 -12160 -3741 7027 -2053 -20847 -17757
4757a7757J3775M533M618p292k995R145l298j132J841J488n403l250R90j596p745
$$ -17757 -3982 551 5169 -2123 -5118 4027 729 -403 1438 2926 -2477 -5727 -4737 -6333 -14078
4742a4078k287J4851l467n572O09M461k862J440l658j766r721l604J2346J0685
$$ -14078 -16365 -1514 -4981 -10553 -9944 -5483 -8345 -6905 -10563 -12329 -22050 -25654 -13308 -2623
4728b623q742p26O779Q735K3374m022j5809m99l793k495L602P39l534j026J159
$$ -2623 -11365 -12091 -5312 3423 26797 22775 6966 6467 2674 179 3781 4520 986 -40 1119
4713A119J368m719j86J7932K860Q16r329j917J539L659q698R03L342J927p32J7417
$$ 1119 2487 -2232 -2418 15514 18374 19190 9861 7944 9483 13142 4444 5347 8689 10616 9884 27301
4697B7301l823j7811j6486l143J237K846j173J712q213O119J3212N871n797K433
$$ 27301 23478 5667 -10819 -13962 -12725 -9879 -11052 -9340 -17553 -11434 1778 7649 1852 4285
4683D285Q870k624j171o317q250j2919j513k60N291R570R405L905K785o249o735
$$ 4285 13155 10531 9360 3043 -5207 -18126 -19639 -19899 -14608 -5038 4367 8272 11057 4808 -1927
4668a927R929k246j3443j3504O551J5245P073q024m363M397L558j640L237K37
$$ -1927 8002 5756 -7687 -21191 -14640 605 7678 -346 -4709 -312 3246 1606 4843 5080
4654E080k122j5131N058J6219o002j2412L080K810N504j2294L267L850K702m249
$$ 5080 2958 -12173 -7115 9104 3102 -9310 -6230 -3420 2084 -10210 -6943 -3093 -391 -4640
4640d640q749Q174N470n698j362K614r860K526P929J408Q914N596M820j3276k251
$$ -4640 -13389 -5215 255 -5443 -6805 -4191 -14051 -11525 -3596 -2188 6726 12322 17142 3866 1615
4625A615N05j3375m845J414L653N897K838P347O557r353l697M122l914o27m504
$$ 1615 2120 -11255 -16100 -14686 -11033 -5136 -2298 5049 11606 2253 -1444 2678 -1236 -1863 -6367
4610f367J2467J5143n022o819r313Q93M308r645j337P80n847J368O714N698J327
$$ -6367 6100 21243 16221 9402 89 982 5290 -4355 -5692 -4912 -10759 -9391 -2677 3021 4348
4595D348o171j4460r155k621J6446K326k824j594O514J1339l904N936N811j306
$$ 4348 -1823 -16283 -25438 -28059 -11613 -9287 -12111 -13705 -7191 4148 244 6180 11991 10685
4581A0685j4305q223M224M579O965Q524j0112q541J2597P748K33l830r027p922
$$ 10685 -3620 -11843 -7619 -3040 3925 12449 2337 -6204 6393 14141 14374 10544 1517 -6405
4567f405L650O611m694j720Q419J0422J0917N01k249o60o595L407r775m798j157
$$ -6405 -2755 3856 -838 -2558 5861 16283 27200 27701 25452 24792 18197 21604 11829 7031 5874
4552E874L754j653m050J331M319j920m100k465j2128q212k590J0047R115Q892
$$ 5874 9628 7975 3925 5256 9575 7655 3555 1090 -11038 -19250 -21840 -11793 -2678 6214
4538F214m321j0422k476K46j429J325k251J169J360j259r77j3906j3521J1445
$$ 6214 1893 -8529 -11005 -10759 -12188 -10863 -13114 -11945 -10585 -11844 -12821 -26727 -40248 -28803
4524b8803J1646k296K1071J6083m210j3495k1361m113J4368Q830K496l031o602
$$ -28803 -17157 -19453 1618 17701 13491 -4 -21365 -25478 -11110 -2280 216 -2815 -9417
4511i417J288k527k194j278N097M897q014l722jO182n32j2771K585Q971O870N538
$$ -9417 -8129 -10656 -12850 -14128 -9031 -4134 -12148 -15870 -15871 -9689 -10221 -22992 -20407 -11436 -4566 972
4495I72j191J827P977P434j253r747M754j3196j5621M402L572j035j15M904L695
$$ 972 -219 1608 9585 17019 15766 6019 10773 -2423 -18044 -13642 -10070 -11105 -11220 -6316 -2621
4480b621R324P88r632r51n7P070R54P15j4689p479P50J713N705n177p265N983
$$ -2621 6703 7491 -2141 -3092 -3149 3921 4875 5590 -9099 -16578 -15828 -14115 -8410 -13587 -20852 -14869
4464a4869P787L246J1501N654K792l436j8659p320J0201J8803L406r837j2282
$$ -14869 -7082 -3836 7665 13319 16111 12675 -5984 -13304 -3103 15700 19106 9269 -3013
4451c013k621M690k293L986p232j785J3149J0980m01o578j2902J628l9q380j0508
$$ -3013 -5634 -944 -3237 749 -6483 -8268 4881 15861 15460 8882 -4020 -2392 -2431 -10811 -21319
4436b1319n224N618L122Q858M497n044R422M886o811L123p11r258p127N079R273
$$ -21319 -26543 -20925 -17803 -8945 -4448 -9492 -70 4816 -1995 1128 417 -8841 -15968 -10889 -1616
4421a616K207r88O13j733M437n572j7525p475L869P573J1879Q231N488n867p904
$$ -1616 591 -397 216 -1517 2920 -2652 -20177 -27652 -23783 -16210 -4331 3900 9388 3521 -4383
4406d383K703j0937L417R367q722r933L138J6166O647k675p248m511N596J9249
$$ -4383 -1680 -12617 -9200 167 -8555 -18488 -15350 816 7463 4788 -2460 -6971 -1375 17874
4392A7874J2799j1974j6836l543O511l922m246j909O13J655k750r914L036J0301
$$ 17874 30673 18699 1863 -1680 4831 909 -3337 -5246 -4633 -2978 -5728 -15642 -12606 -2305
4378b305r355q289O276J0593j231m260L591J0854J3836k888p540l421o462r067
$$ -2305 -11660 -19949 -13673 -3080 -4311 -8571 -4980 5874 19710 16822 9282 5861 -601 -9668
4364i668k926k940J4628j693p052L559P038J832l03K900l434j3939j2423k484
$$ -9668 -12594 -15534 -906 -2599 -9651 -6092 946 2778 2475 5375 1941 -11998 -24421 -26905
4350b6905O803l343o30O595R351N756O410L924k151k954n153j824L556N009J719
$$ -26905 -20102 -23445 -24075 -17480 -8129 -2373 4037 7961 5810 2856 -2297 -4121 -565 4444 6163
4335F163n623l552o560M136p25j4614n967J1646P155P316R36l541k513J067l287
$$ 6163 540 -3012 -9572 -5436 -6161 -20775 -26742 -15096 -7941 -625 311 -3230 -5743 -4676 -7963
4320g963j876M081L179q376Q1N654j846J034k181p717l909J510j448K126k111
$$ -7963 -9839 -5758 -2579 -10955 -10874 -5220 -7066 -6032 -8213 -15930 -19839 -18329 -19777 -17651 -19762
4305a9762n011K578P91O786J6443L562k360m478l727j2842p865r11Q139P449m652
$$ -19762 -24773 -22195 -21404 -14618 1825 5387 3027 -1451 -5178 -18020 -25885 -26796 -18657 -11208 -15860
4290a5860L88O136j692J1142k19j7753j4260N175J232m373J6888J3435o339r377
$$ -15860 -15472 -9336 -11028 114 -105 -17858 -32118 -26943 -25711 -30084 -13196 239 -6100 -15477
4276a5477q144R002J4038j492M807P34q952J8730J5498j243j6240j1069P060l61
$$ -15477 -23621 -14619 -581 -2073 2734 3468 -5484 13246 28744 27501 11261 192 7252 6891
4262F891p769K599L33J034Q104R586j542m064j0911r697M117N914Q32q759l870
$$ 6891 -878 1721 2054 3088 11192 20778 19236 15172 4261 -5436 -1319 4595 5427 -3332 -7202
4247g202R467j2l374L470P444M562J160j2211k2624l676J4326j52p3k709r383
$$ -7202 2265 2253 -1121 2349 9793 14355 15515 3304 -19320 -22996 -8670 -8822 -8895 -11604 -20987
4232b0987L629R741l433m762j946J7412K386m138P516n456j340M414J846m998
$$ -20987 -17358 -7617 -11050 -15812 -17758 -346 2040 -2098 5418 -38 -1378 3036 4882 -116
4218a16n260N47L936Q541k703p091p794K937L496L331m342n084j0381p009J490
$$ -116 -5376 -4829 -893 7648 4945 -2146 -9940 -7003 -3507 -176 -4518 -9602 -19983 -26992 -25502
4203b5502P317R79k105q66J5506n144r444J8524N674p637k545O156R503p017j6415
$$ -25502 -18185 -17206 -19311 -20177 -4671 -9815 -19259 -735 4939 -2698 -5243 913 10416 3399 -13016
4188a3016p181K699M542J0228j967M761L681l497J1947m062j2851j0009K533l915
$$ -13016 -20197 -17498 -12956 -2728 -4695 66 3747 250 12197 8135 -4716 -14725 -12192 -16107
4174a6107o810J3365M838l747n850J469j799P939J1408L853j4470p950R81N344
$$ -16107 -22917 -9552 -4714 -8461 -14311 -12842 -14641 -6702 4706 8559 -5911 -13861 -12880 -7536
4160g536J0482L32K748m610l778K82l016M426P628m597q341J25K702m66l791K82
$$ -7536 2946 3278 6026 1416 -2362 -2080 -5096 -670 6958 2361 -5980 -5855 -3153 -3619 -7410 -7128
4144g128J2702J383k82j914p869Q240M376k141o355j1499m776L741p073l46J5660
$$ -7128 5574 6957 6675 4761 -3108 5132 9508 7367 1012 -10487 -15263 -11522 -18595 -18941 -3281
4129c281J2754L367J158j6672r783q660k660J0221J4098M520J087n509L953n77
$$ -3281 9473 12840 13998 -2674 -12457 -21117 -23777 -13556 542 5062 6149 640 4593 4016
4115D016Q698n572o715L815J0690j114o223O196L945J271M009j3992m407j5701
$$ 4016 12714 7142 427 4242 14932 13818 7595 13791 17736 19007 23016 9024 4617 -11084
4101a1084O6J129o392j0862O688P149M608K749m425R631O486L226m748p423j1185
$$ -11084 -11018 -9889 -16281 -27143 -20455 -13306 -8698 -5949 -10374 -743 5743 8969 4221 -3202 -14387
4086a4387P972J7986j211r547L841l818K901J076N89M541n059p203r530m841Q808
$$ -14387 -6415 11571 10360 813 4654 836 3737 4813 5402 9943 4884 -2319 -11849 -16690 -7882
4071g882L671k815m741P844j948K628N103J1680K479n072P708M943p232j1902
$$ -7882 -4211 -7026 -11767 -3923 -5871 -3243 1860 13540 16019 10947 18655 23598 16366 4464
4057D464p068l406k813n029R07k081N58L278J2565K818o294j1459m084L272K117
$$ 4464 -2604 -6010 -8823 -13852 -12945 -15026 -14468 -11190 1375 4193 -2101 -13560 -17644 -14372 -12255
4042a2255O168R456K442O222q48L176J808L911q026r841k204k049N435P086P52
$$ -12255 -6087 3369 5811 12033 11185 14361 16169 20080 12054 2213 9 -2040 3395 10481 11233
4027A1233j1608j1328K068j444P562O152M60m192P378q64p41k508M172M261j2060
$$ 11233 -375 -11703 -9635 -11079 -3517 2635 3095 -1097 6281 5417 4676 2168 6340 10601 -1459
4012a459l664k752m38J3771l386r430q523q957P300J0112M653J506n39r243q83
$$ -1459 -5123 -7875 -8313 5458 2072 -7358 -15881 -24838 -17538 -7426 -2773 -1267 -1806 -11049 -11932
3997a1932K393o26K202J003J0101k209p142o78O125k158J204J0008j23K378m191
$$ -11932 -9539 -10165 -7963 -6960 3141 932 -6210 -6888 -763 -2921 -1717 8291 8168 10546 6355
3982F355K580p590p523J0940l32p840k800r321j914J1530L622M948m878J4088
$$ 6355 8935 1345 -6178 4762 4430 -3410 -6210 -15531 -17445 -5915 -2293 2655 -2223 11865
3968A1865O951o922L219l475M175k831j1553q682O84J055m80L92k067j0315j723
$$ 11865 18816 11894 15113 11638 15813 12982 1429 -7253 -6569 -5514 -5994 -5602 -7669 -17984 -19707
3953a9707Q776k782j1812k098L483K2220J0483r670j100J0326q36n263j4419q873
$$ -19707 -10931 -13713 -25525 -27623 -24140 -1920 8563 -1107 -2207 8119 7283 2020 -12399 -21272
3939b1272M014J712K309N466M915O289P412p27K29J1426j0124j4752J33P697N814
$$ -21272 -17258 -15546 -13237 -7771 -2856 3433 10845 10118 10347 21773 11649 -3103 -2970 4727 10541
3924A0541L52l642q167j683P822O203l222j1572P915N082p376r115j074o84l764
$$ 10541 10893 7251 -916 -2599 5223 11426 8204 -3368 4547 9629 2253 -6862 -7936 -8620 -12384
3909a2384R391Q32L110J0402P548j7191j629J8812j1270p812M83K565m830o588
$$ -12384 -2993 -2161 949 11351 18899 1708 79 18891 7621 -191 292 2857 -1973 -8561
3895h561L011N355n112j518j0794J350P46J097J6794n680j4498n082J972p047
$$ -8561 -5550 -195 -5307 -6825 -17619 -16269 -15523 -14426 2368 -3312 -17810 -22892 -20920 -27967
3881b7967p512Q714J1997N554M375P941O999n950k64J623J281j5001j063K848
$$ -27967 -35479 -26765 -14768 -9214 -4839 3102 10101 4151 3887 5510 6791 -8210 -9273 -6425
3867f425R910J706o653k173j0492l758N989N202p466J928J477N82O604N210P928
$$ -6425 3485 5191 -1462 -3635 -14127 -17885 -11896 -6694 -14160 -12232 -10755 -10173 -3569 1641 9569
3852I569Q49N852q675j4986k3426m858J9455J1858L534n906J3474N602p650o30
$$ 9569 10418 16270 7595 -7391 -30817 -35675 -16220 -4362 -828 -6734 6740 12342 4692 4062
3838D062P33j6560k655j543N899J510m730o352L705P283J0541M935O42J170m588
$$ 4062 4795 -11765 -14420 -15963 -10064 -8554 -13284 -19636 -15931 -8648 1893 6828 7470 8640 4052
3823D052j0248p513N324k838L237J8303q45L637n143q321j658M236r029J0229
$$ 4052 -6196 -13709 -8385 -11223 -7986 10317 9472 13109 7966 -355 -2013 2223 -6806 3423
3809C423J720K652L759J387j0121l477n453p247j71j382R372K711J803J243J0176
$$ 3423 5143 7795 11554 12941 2820 -657 -6110 -13357 -13528 -14910 -5538 -2827 -1024 219 10395
3794A0395r756m711o40R464J0176m984j1337n804J2641m944j4974O389K810K543
$$ 10395 639 -4072 -4712 4752 14928 9944 -1393 -7197 5444 500 -14474 -8085 -5275 -2732
3780b732P118n10J2878j462j0704p023L425l126K387M783j7052k43m836M826O191
$$ -2732 4386 3876 16754 15292 4588 -2435 990 -2136 251 5034 -12018 -12261 -17097 -12271 -6080
3765f080P228J57L744P00o1J568j3283j2864L292J3352Q012K670P489j230p047
$$ -6080 1148 1305 5049 5749 5688 7256 -6027 -18891 -15599 -2247 5765 8435 15924 14694 7647
3750G647K009o204m331l213o468O414m438j5743m15P308M029P158M956o220p691
$$ 7647 9656 3452 -879 -4092 -10560 -4146 -8584 -24327 -24742 -17434 -13405 -6247 -1291 -7511 -15202
3735a5202J468J6238Q940k0357r712M527J9629N766l855k788j905p2k0j3003l976
$$ -15202 -13734 2504 11444 -8913 -18625 -14098 5531 11297 7442 4654 2749 2677 2657 -10346 -14322
3720a4322k904n61K342J45R297N993L451n391j4600N033J1308n157J397j144N530
$$ -14322 -17226 -17787 -15445 -15300 -6003 -10 3441 -1950 -16550 -11517 -209 -5366 -3969 -5113 417
3705D17o565J487k498j0315Q694Q269k974K57Q684J077n85q5p009r277n900o38
$$ 417 -6148 -4661 -7159 -17474 -8780 -511 -3485 -3228 5456 6533 5948 5863 -1146 -10423 -16323 -16961
3689a6961J0892k145o366j1252K320J7199R216l427j1742p220P77k743M432L699
$$ -16961 -6069 -8214 -14580 -25832 -23512 -6313 2903 -524 -12266 -19486 -18709 -21452 -17020 -13321
3675a3321j541J2053O468j488j2282r106N991J5455O897J4996k310m158j3886
$$ -13321 -14862 -2809 3659 2171 -10111 -19217 -13226 2229 9126 24122 21812 17654 3768
3662C768r91o246Q605K814k508K977Q474j1925j0902l493n668J1743J4321o718
$$ 3768 2777 -3469 5136 7950 5442 8419 16893 4968 -5934 -9427 -15095 -3352 10969 4251
$$ [...]
##END NTUPLES=NMR SPECTRUM
##END=
