##TITLE=Analysis number 330256
Compound Code cc 27046
Book Reference 552/28
Project Code adrs
Chemist Name stevem
##JCAMPDX= 6.0         $$ Bruker NMR JCAMP-DX V2.0
##DATA TYPE= NMR SPECTRUM
##DATA CLASS= NTUPLES
##ORIGIN= Bruker BioSpin GmbH
##OWNER= nmr
$$ XWIN-NMR		Version 3.5
$$ Fri Nov  9 11:47:08 2007 GMT Standard Time (UT+0h)  MAYBRIDGE\nmr@NMR_250MHZ
##.OBSERVE FREQUENCY= 250.131544655141
##.OBSERVE NUCLEUS= ^1H
##.ACQUISITION MODE= SIMULTANEOUS (DQD)
##.ACQUISITION SCHEME= undefined
##.AVERAGES= 16
##.DIGITISER RES= 18
##SPECTROMETER/DATA SYSTEM= dpx250
##.PULSE SEQUENCE= zg30
##.SOLVENT NAME= CDCl3
##.SHIFT REFERENCE= (INTERNAL, CDCl3, 0, 16.522)
##AUDIT TRAIL= $$ (NUMBER, WHEN, WHO, WHERE, WHAT)
$$ ##TITLE= Audit trail, XWIN-NMR		Version 3.5
$$ ##JCAMPDX= 5.01
$$ ##ORIGIN= Bruker BioSpin GmbH
$$ ##OWNER= nmr
$$ C:\u/data/dgb/nmr/ADRS/460/pdata/1/auditp.txt
$$ ##AUDIT TRAIL=  $$ (NUMBER, WHEN, WHO, WHERE, WHAT)
(   1,<2007-11-09 11:46:32.69 +000>,<MAYBRIDGE\nmr>,<NMR_250MHZ>,
      <created by zg, POWCHK disabled, PULCHK disabled
       configuration hash MD5:
       76 6E 9A 78 1E 09 19 81 EC 84 63 8F B0 6A 59 2D
       data hash MD5: 64K
       1E 4E BB 2C 7C CA E4 D9 33 B1 5A C6 76 3E 13 A8>)
(   2,<2007-11-09 11:46:47.02 +000>,<MAYBRIDGE\nmr>,<NMR_250MHZ>,
      <Start of raw data processing
       ef LB = 0.3 FT_mod = 6 PKNL = 1 SI = 32K 
       data hash MD5: 32K
       AC F0 49 01 33 96 78 0E 07 77 D7 93 1C 50 5E 73>)
(   3,<2007-11-09 11:46:48.91 +000>,<MAYBRIDGE\nmr>,<NMR_250MHZ>,
      <apk 
       data hash MD5: 32K
       64 20 08 B6 75 E8 47 C4 A7 21 E4 07 E8 D6 E7 71>)
(   4,<2007-11-09 11:46:49.66 +000>,<MAYBRIDGE\nmr>,<NMR_250MHZ>,
      <abs ABSG = 5 
       data hash MD5: 32K
       60 CA 95 3A 44 FA 04 C9 23 56 0B C7 DD 1B DD 63>)
$$ ##END=
$$ 
$$ hash MD5
$$ 38 FC AC 5E 65 37 92 D9 38 64 24 3C 5D A8 13 5B
##$RELAX= 
##$RELAX= 
##$RELAX= 
##$RELAX= 
##$RELAX= 
##$RELAX= 
##$RELAX= 
$$ Bruker specific parameters
$$ --------------------------
##$DU= <C:\u>
##$EXPNO= 460
##$NAME= <ADRS>
##$PROCNO= 1
##$TYPE= <nmr>
##$USER= <dgb>
##$AMP= (0..31)
100 100 100 100 100 100 100 100 100 100 100 100 100 100 100 100 100 100 
100 100 100 100 100 100 100 100 100 100 100 100 100 100 
##$AQSEQ= 0
##$AQ_mod= 3
##$AUNM= <au_zg>
##$AUTOPOS= <20 >
##$BF1= 250.13
##$BF2= 250.13
##$BF3= 250.13
##$BF4= 250.13
##$BF5= 500.13
##$BF6= 500.13
##$BF7= 500.13
##$BF8= 500.13
##$BYTORDA= 1
##$CFDGTYP= 0
##$CFRGTYP= 5
##$CHEMSTR= <none>
##$CNST= (0..31)
1 1 145 1 1 1 1 1 1 1 1 1 1 1 1 1 1 1 1 1 1 1 1 1 1 1 1 1 1 1 1 1 
##$CPDPRG= <>
##$CPDPRG1= <>
##$CPDPRG2= <>
##$CPDPRG3= <>
##$CPDPRG4= <mlev>
##$CPDPRG5= <mlev>
##$CPDPRG6= <mlev>
##$CPDPRG7= <mlev>
##$CPDPRG8= <mlev>
##$CPDPRGB= <>
##$CPDPRGT= <>
##$D= (0..31)
0 1 0 0 0 0 0 0 0 0.06 0 0 0 0 0 0 0.0002 0 0 0 0 0 0 0 0 0 0 0 0 0 0 
0 
##$DATE= 1194608789
##$DBL= (0..7)
120 120 120 120 120 120 120 120 
##$DBP= (0..7)
150 150 150 150 150 150 150 150 
##$DBP07= 0
##$DBPNAM0= <>
##$DBPNAM1= <>
$$ [...]
##$SUBNAM7= <"">
##$SUBNAM8= <"">
##$SUBNAM9= <"">
##$SW= 20.6930455092707
##$SWIBOX= (0..15)
0 0 3 0 0 0 0 0 0 0 0 0 0 0 0 0 
##$SW_h= 5175.983436853
##$TD= 65536
##$TD0= 1
##$TE= 295.16
##$TE2= 300
##$TE3= 300
##$TEG= 300
##$TL= (0..7)
0 120 120 120 120 120 120 120 
##$TP= (0..7)
150 150 150 150 150 150 150 150 
##$TP07= 0
##$TPNAME0= <>
##$TPNAME1= <>
##$TPNAME2= <>
##$TPNAME3= <>
##$TPNAME4= <>
##$TPNAME5= <>
##$TPNAME6= <>
##$TPNAME7= <>
##$TPOAL= (0..7)
0.5 0.5 0.5 0.5 0.5 0.5 0.5 0.5 
##$TPOFFS= (0..7)
0 0 0 0 0 0 0 0 
##$TUNHIN= 0
##$TUNHOUT= 0
##$TUNXOUT= 0
##$USERA1= <user>
##$USERA2= <user>
##$USERA3= <user>
##$USERA4= <user>
##$USERA5= <user>
##$V9= 5
##$VALIST= <valist>
##$VCLIST= <CCCCCCCCCCCCCCC>
##$VD= 0
##$VDLIST= <DDDDDDDDDDDDDDD>
##$VPLIST= <PPPPPPPPPPPPPPP>
##$VTLIST= <TTTTTTTTTTTTTTT>
##$WBST= 1024
##$WBSW= 4
##$XGAIN= (0..3)
0 0 0 0 
##$XL= 0
##$YL= 0
##$YMAX_a= 439532
##$YMIN_a= -511007
##$ZGOPTNS= <>
##$ZL1= 120
##$ZL2= 120
##$ZL3= 120
##$ZL4= 120
##$ABSF1= 16.522
##$ABSF2= -4.171173
##$ABSG= 5
##$ABSL= 3
##$ALPHA= 0
##$AQORDER= 0
##$ASSFAC= 0
##$ASSFACI= 0
##$ASSFACX= 0
##$ASSWID= 0
##$AUNMP= <proc_1d>
##$AZFE= 0.1
##$AZFW= 0.1
##$BCFW= 0
##$BC_mod= 0
##$BYTORDP= 0
##$COROFFS= 0
##$CY= 12.5
##$DATMOD= 1
##$DC= 0
##$DFILT= <>
##$DTYPP= 0
##$F1P= 14.0000005364418
##$F2P= -0.99999901652339
##$FCOR= 0.5
##$FTSIZE= 32768
##$FT_mod= 6
##$GAMMA= 0
##$GB= 0
##$INTBC= 1
##$INTSCL= 1
##$ISEN= 128
##$LB= 0.3
##$LEV0= 0
##$LPBIN= 0
##$MAXI= 10000
##$MC2= 0
##$MEAN= 0
##$ME_mod= 0
##$MI= 0
##$NCOEF= 0
##$NC_proc= -2
##$NLEV= 6
##$NOISF1= 0
##$NOISF2= 0
##$NSP= 0
##$NTH_PI= 0
##$NZP= 0
##$OFFSET= 16.522
##$PC= 1
##$PHC0= 166.3385
##$PHC1= 9.563443
##$PH_mod= 1
##$PKNL= yes
##$PPARMOD= 0
##$PSCAL= 4
##$PSIGN= 0
##$REVERSE= no
##$SF= 250.13
##$SI= 32768
##$SIGF1= 0
##$SIGF2= 0
##$SINO= 400
##$SIOLD= 32768
##$SREGLST= <1H.CDCl3>
##$SSB= 0
##$STSI= 32768
##$STSR= 0
##$SW_p= 5175.98343685301
##$SYMM= 0
##$S_DEV= 0
##$TDeff= 65536
##$TDoff= 0
##$TI= <Analysis number 999999
Compound Code 99
Book Reference 9
Project Code 9>
##$TILT= no
##$TM1= 0
##$TM2= 0
##$TOPLEV= 0
##$USERP1= <user>
##$USERP2= <user>
##$USERP3= <user>
##$USERP4= <user>
##$USERP5= <user>
##$WDW= 1
##$XDIM= 32768
##$YMAX_p= 278133633
##$YMIN_p= -41410
$$ End of Bruker specific parameters
$$ ---------------------------------
##NTUPLES= NMR SPECTRUM
##VAR_NAME=  FREQUENCY,     SPECTRUM/REAL,   SPECTRUM/IMAG
##SYMBOL=    X,             R,               I
##VAR_TYPE=  INDEPENDENT,   DEPENDENT,       DEPENDENT
##VAR_FORM=  AFFN,          ASDF,            ASDF
##VAR_DIM=   32768,         32768,           32768
##UNITS=     HZ,            ARBITRARY UNITS, ARBITRARY UNITS
##FACTOR=    0.157963299565203, 1,           1
##FIRST=     4132.6476996994, 0,             0
##LAST=      -1043.33573715361, 0,           0
##MIN=       -1043.33573715361, -41410,      0
##MAX=       4132.6476996994, 278133633,     0
$$ Real data points
##PAGE= N=1
##DATA TABLE= (X++(R..R)), XYDATA
$$ [...]
17037f307O478L632K454J242J279J818p723m856o885K526N400O52p004o613K578
17022a1329L753M953k050l71R625K850j945q192j1079O424O499m551L790J5888
17008A4265m080M709M571r330q518l891n122K190J0028J65o31R869l442n926k592
16993B265K212L63j2451n929O144J1306M080l672n485J807O857o35r427K025J0857
16978A0317P738R80n653r755j029q309J628M822O857L46m974J755J10n113O2R914
16962I696n20o418n12p439k646P386O000k882k663M614j300p945O226O791m579
16947C809j5499p576J0477M698N515N977q005n442n009k567M724P004Q912K166
16933I184k734m922J069j649j855n385K654J0247N810L005M393K879K586m512
$$ y = [-6307, 171, 3803, 6257, 7499, 8778, 10596, 2873, -1983, -8868, -6342, -942, -290, -7294, -13907, -11329, -7576, -2623, -4673, -5044, 4581, 7431, 5486, -2706, -13785, -7361, -862, -5413, -1623, 14265, 10185, 14894, 19465, 10135, 1617, -2274, -7396, -5206, 4822, 4987, 4356, 14225, 10783, 4857, 2265, 4477, 4840, -7611, -13540, -7396, 3910, 7990, 4318, -1167, 640, 7497, 6862, -2565, -540, 10317, 18055, 19035, 13382, 3627, 2598, -5711, -4083, 739, 7596, 7942, 2968, 4723, 4833, -280, -218, 9696, 9176, 2758, 2246, -5193, -7839, -453, 5547, 2665, 2, 4616, 3316, -4629, 1597, 8388, 3809, -11690, -19266, -8789, -4091, 1424, 7401, -604, -6046, -11055, -13622, -8898, -1894, 7018, 9184, 6450, 1528, 2597, 948, -907, -6292, -3638, 6609, 12419, 15424, 19817, 22696, 25282, 20770]
16919B0770n710r626o105L310J224j531k17o595n359M068K843K268J1115M124
16905A4579j2993j732J739j2447K732K735r739o50m114L491K679M475j035n69
16891a0849M818M869J556k520J518o846O09L460L7R342P945o158n852P279L500
16876A2708l963m641k232P080n747j0240L211m73n910o935J0040L427Q544M064
16862H933j0894m172N307J1704n288n429R202Q781J0437o080r318n926L142r93
16848I406J652l050m935l212n335L05R602L97j0518M619J2003j079j3825n512
16834i482K847m759P101N636n39j1001N298P117O792K66l686q429o718n876K937
16819a2496P748r537J440M712P990l443o152O760O223L529n57o410K956m674l213
$$ y = [20770, 15060, 5434, -671, 2639, 3863, 2332, 2115, -4480, -9839, -5771, -2928, -660, 10455, 14579, 1586, -146, 1593, -10854, -8122, -5387, -15126, -15776, -19890, -16399, -13720, -9245, -10280, -10849, -6031, -1162, 394, -2126, -608, -7454, -6845, -3385, -3348, 5994, 13939, 7781, 1929, 9208, 12708, 8745, 4104, 1872, 8952, 3205, -7035, -3824, -4297, -10207, -17142, -7102, -3675, 4869, 8933, -1961, -6133, -826, 10878, 5590, 161, 9363, 18144, 28581, 22501, 13183, 7257, 10399, 9406, 11058, 8008, 3073, -139, -5474, -5169, 4433, 4830, -5688, -1069, 10934, 9855, -3970, -9482, -6635, -11394, -4293, 1343, 804, -10197, -4899, 2218, 9010, 9276, 5590, -2839, -9557, -15433, -12496, -4748, -14285, -12845, -8133, -143, -3586, -9738, -2978, 3245, 6774, 6217, -193, 2763, -1911, -5124]
16804e124J996M890N544o117L203M458M177o21N017j984N171l779k915L194Q079
16789B5189j707l77M180q824j3617l850O85Q89k39j0195l832o085J6722N438q393
16774d016K571J4457j861k909m69m899m012p569m839L858R165p53L750k321P928
16759H081k553j277J310L597L826l508j114l735J450O887Q18p071L894N219J2669
16744B8493j479j104n414j7025j3208J642k100P526R664K356o844J19Q163N639
16730A6428L538o987K975p364j693K060O307J0121J33j0763q373o512m148k122
16716f400o095q38l773J4610N592q243J420L271n686k381O652k817P23P955J495
16701E485j0957M711M701N592j922m576l513k383j681J661R241M297J737n129
$$ y = [-5124, -3128, 1762, 7306, 1189, 4392, 8850, 13027, 12406, 17423, 15439, 20610, 16831, 13916, 17110, 25189, 23482, 23105, 27285, 18461, 4844, 994, 1679, 2568, 2329, -7866, -11698, -17783, -1061, 4377, -4016, -1445, 13012, 11151, 8242, 7773, 2874, -1138, -8707, -13546, -9688, -523, -1276, 2474, 153, 8081, 5528, 4251, 5561, 9158, 12984, 9476, 8362, 4627, 6077, 12964, 13782, 6711, 10605, 15824, 28493, 27014, 25910, 20496, 3471, -9737, -8095, -10195, -2669, 6995, 9351, 2507, 2626, 10789, 16428, 19966, 12979, 15954, 8590, 6897, 8957, 15264, 25385, 25518, 14755, 6382, -130, -4278, -6400, -12495, -13333, -17106, -2496, 3096, -5147, -3727, -456, -6142, -8523, -1871, -4688, -3965, 3990, 5485, -5472, -761, 3940, 9532, 7610, 3034, -479, -2862, -4543, -2882, 6359, 10656, 12393, 7264]
16687G264k352Q922Q742R28r84r861n821K463o34K576O03j0114n073J298J605
16672d38P719J375Q685L156k459N163k204j310q966r868N673K501n420Q237N710
16657A7554J519j847p252l92N551m0j0760R924J3062J4903J9983P879k07N21L427
16642G3825K0119K2519L2550K7743M0657K6077K3985K5278J4334q165k7174k0910
16630B50838k8000k8103k7680l0508l0716k7144j7445j1138k1465m768Q02l904
16618B0769R226n25m275m044m587L095l2k989j592q484q446M872J320q824k857
16603g373j080O294L875k553N181j364K623K526j019L711j522m870L022L722n038
16588F135j328O45L183M192p524m277Q348R914l866p574n678L15Q235J96q759
$$ y = [7264, 4912, 13834, 22576, 23504, 22520, 12659, 6838, 9301, 8667, 11243, 11846, 1732, -3341, -2043, -438, 7281, 8656, 17341, 20497, 18038, 23201, 20997, 19687, 10721, 853, 6526, 9027, 3607, 11844, 17554, 19073, 17226, 9974, 9582, 15133, 15093, 4333, 14257, 27319, 42222, 62205, 70084, 69877, 70398, 73825, 93944, 116463, 149013, 176756, 217413, 243490, 267475, 292753, 307087, 298922, 271748, 250838, 222838, 194735, 167055, 136547, 105831, 78687, 61242, 50104, 28639, 23871, 24673, 20769, 29995, 29470, 25195, 21151, 16564, 19659, 19627, 16638, 15046, 6562, -1884, 2988, 4308, -4516, -7373, -8453, -2159, 1716, -837, 4344, 2980, 5603, 8129, 7110, 10821, 9299, 4429, 7451, 11173, 6135, 4807, 5452, 8635, 12827, 5303, 1026, 9374, 19288, 15422, 7848, 2170, 2485, 10720, 10916, 2157]
16573B157J942N448j324R55p164k771J681R452Q804o071k498R525k799o329L751
16558A4759l842K842j035l434m26J74n818l724n822j090P715J185l642j453J1744
16543H133p87o779k194k127m66J1357K712m311L388M942J671N040J58k827k452
16528A5458l134M76N289l419q13O228m474p531j568R928n18J309L517k819l427
16513A4502M893L591k043r940K883M879J842k797J544P100l788o325l687p07k062
16498I885j115P054M327N742m732r461m627l270J299M62Q657R225K374m660K181
16483B3341j3299n061J3097j066O2J877J295P18p69j402J0690J348j0941J702
16469B1592K807m087o006n389P199O847Q346o003m574O078j674p998j20q237L61
$$ y = [2157, 4099, 9547, 8223, 9178, 2014, -757, 924, 10376, 19180, 13109, 10611, 20136, 17337, 11008, 14759, 10917, 13759, 12724, 9290, 8864, 9038, 3220, -504, -6326, -7416, 299, 1484, -2158, -3611, 8133, 7346, 567, -1627, -3754, -4220, 7137, 9849, 5538, 8926, 13868, 15539, 20579, 20737, 17910, 15458, 12324, 12800, 18089, 14670, 13857, 20085, 15611, 8080, 6512, 16440, 15922, 17231, 20748, 17929, 14502, 19395, 22986, 20943, 11003, 13886, 18765, 20607, 17810, 19354, 26454, 22666, 16341, 12654, 11947, 9885, 8770, 15824, 20151, 25893, 21161, 11700, 7073, 3803, 5102, 5564, 14221, 23446, 25820, 21160, 23341, 10042, 4981, 18078, 17012, 17074, 18951, 20246, 20964, 20195, 18793, 29483, 30831, 19890, 21592, 24399, 20312, 14306, 8917, 16116, 22963, 31309, 25306, 20732, 26810, 25136, 17138, 17018, 8781, 9142]
16454I142K747P036p337k421K187K546j111P981P341r635j464m487l14N274L082
16439B0567R135K047l485j00N779L724n251j0504j0321L681J184n552m834k895
16425C175J173L542Q570P729m876L374Q557N802O750o80l853P960q44j5666p677
16410B3036l742m288O355R337l132R47P872J920L433J395q251m786K209J600n440
16395B8465K194k942L246J3552K869n759r94q531J2m263p945p859J2840Q512j075
16380C2322k031j031P907N860K532j693N421J2979k668k6n139r512o352n894o290
16365B6385o86l642n613Q591j99P33N229J95m135J0150J866m540j772o996r11
16350B4655l973l854O523R855j843p859m06K197n639m635k961q182N423N515P395
$$ y = [9142, 11889, 18925, 11588, 9167, 11354, 13900, 12789, 20770, 28111, 18476, 17012, 12525, 12211, 17485, 20567, 29702, 31749, 28264, 28164, 33943, 37667, 32416, 21912, 11591, 15272, 16456, 10904, 6070, 3175, 4348, 7890, 16460, 24189, 19313, 22687, 31244, 37046, 43796, 43116, 39263, 47223, 46379, 30713, 23036, 19294, 15006, 21361, 30698, 27566, 28513, 36385, 38305, 41738, 43133, 34882, 30096, 32305, 33905, 28465, 30659, 27717, 30963, 44515, 47384, 41625, 40631, 32100, 32112, 27849, 19904, 12045, 24885, 33397, 32322, 30291, 29260, 37167, 43027, 45559, 43866, 49287, 62266, 59598, 59572, 54433, 44921, 38569, 32675, 26385, 25699, 22057, 16444, 25035, 24836, 25569, 30798, 30993, 26858, 37008, 38874, 34334, 32562, 25566, 24655, 20682, 16828, 23351, 33206, 31363, 23504, 23098, 25295, 19656, 15021, 12060, 3878, 9301, 14816, 22211]
16335B2211K75k643J099K79L441Q129Q757l584L050J0814K94J750k669j7495M677
16320C8385J307m876K091l680l773K427J191R384r08q594m835N403J594K552j548
16305C6120n44j176n79N09P11k007j0704L259l70R030K100M397l895L600M890
16290D5341m631m601L533q358K749J039j0315O017Q667L712k232p702N617P245
16276D6081K871l567j588K285J899m128k593O816N431n738q900o336N791m256
16262C4068k042O467j619l069m011j3825j4486m192J927R65N622O307N835P103
16248B5050L488K879L6L098O336j2110K854P299K32l89N249j0251p965L273N683
16233C4762k183r117P081O760L716l165j146J2810M543K929k199o370p941r75
$$ y = [22211, 22486, 19843, 20942, 21221, 24662, 32791, 41548, 37964, 41014, 51828, 52122, 53872, 51203, 33708, 38385, 39692, 34816, 36907, 33227, 29454, 31881, 33072, 42456, 41548, 32954, 28119, 33522, 35116, 37668, 36120, 35576, 34400, 33821, 34330, 35041, 33034, 22330, 25589, 25219, 34249, 36349, 40746, 36851, 40451, 45341, 40710, 36109, 39642, 31284, 34033, 35072, 24757, 30774, 39441, 43153, 40921, 33219, 38836, 46081, 48952, 45385, 43797, 46082, 47981, 43853, 41260, 48076, 53507, 47769, 38869, 32533, 38324, 34068, 32026, 38493, 36874, 33805, 29794, 15969, 1483, -2709, -782, 183, 5805, 12112, 17947, 25050, 28538, 31417, 31453, 34551, 40887, 28777, 31631, 38930, 39162, 38773, 44022, 33771, 25806, 29079, 34762, 32579, 23462, 30543, 37303, 41019, 37854, 36708, 49518, 54061, 56990, 54791, 48421, 40480, 39505]
16219C9505M379p914Q850P694p311k670R769Q37q91P68m143J2105J7567M195L47
16204H3087l901L85J637j089L60M885j787k334j651J1340K972O39l086j912k07
16189H9338L305K10r783p814j668J7423J0899Q07j4031j791P224J8280L716j6315
16175I9800j3548J855j2o961o467j143k280J435O525P797M202P810O301M853l852
16160A06315l357R512M001j152n228l247r108l96J439J3088O062o657L517P470
16146A22259M626o43Q697L197P709Q252P364L173N151m114n268R569J3099R606
16132A92677Q839l901k728R961n387J644J3559J2805N060J0175J2348L446M339
16119B62837J2022J4489J1148J8478J9155J7285K5612L4123K3287L0218L1158
$$ y = [39505, 43884, 35970, 44820, 52514, 45203, 42533, 52302, 53139, 52248, 53016, 48873, 60978, 78545, 82740, 83087, 79186, 79571, 81208, 80119, 80479, 85364, 83577, 81243, 79592, 90932, 93904, 94543, 91457, 89545, 89338, 92643, 92853, 83070, 75256, 73588, 91011, 101910, 102717, 88686, 86895, 94119, 112399, 116115, 99800, 86252, 88107, 88095, 81134, 74667, 73524, 71244, 72679, 79204, 87001, 91203, 99013, 105314, 110167, 106315, 102958, 112470, 116471, 115319, 110091, 106844, 97736, 97340, 98779, 111867, 117929, 111272, 114789, 122259, 126885, 126242, 134939, 138136, 145845, 154097, 161461, 164634, 169785, 165671, 160403, 169972, 183071, 192677, 201516, 197615, 194887, 204848, 199461, 201105, 214664, 227469, 232529, 242704, 255052, 258498, 262837, 274859, 289348, 300496, 318974, 338129, 355414, 381026, 415149, 438436, 468654, 499812]
16108D99812L8371N3560O2425O7559P7209Q9999Q4688R5253R0587Q6156R0339
16097A335958Q2918R3729Q8688R9977J18182J36867J57077J95995K55959K92848
16087B858198L33762L91869M60071N39070O69449Q78320J206818J759084K607360
16078A1704001L638672M632809N420447N449577N639755N628289N112212M488685
16070E1714447J906043L21097k276433m094638m728134n542109n584774n960075
16062B5755424n656747m847360l867939k851366k048801j462346j039935p38832
16054C242098n36488m05974l07405k26367j92963j75893j46974j37764j17194
16045I95076q9172p7090p6402n8027k7372j8120j8106j3328r271j6750l2921n0398
$$ y = [499812, 538183, 591743, 654168, 721727, 798936, 888935, 973623, 1068876, 1159463, 1245619, 1335958, 1418876, 1512605, 1601293, 1701270, 1819452, 1956319, 2113396, 2309391, 2565350, 2858198, 3191960, 3583829, 4043900, 4582970, 5252419, 6130739, 7337557, 9096641, 11704001, 15342673, 19975482, 25395929, 30845506, 36485261, 42113550, 47225762, 51714447, 53620490, 53941587, 51665154, 47570516, 42842382, 37300273, 31715499, 25755424, 20098677, 15251317, 11383378, 8532012, 6483211, 5020865, 3980930, 3242098, 2705610, 2299636, 1992231, 1765864, 1572901, 1397008, 1250034, 1112270, 995076, 905904, 828814, 752412, 694385, 667013, 648893, 630787, 617459, 608188, 591438, 558517, 508119]
16033E08119m1938l7067m3114m7922m1617l4763l4774k3461j6115j0072j4178
16022A63098j7617k0014j3413r364n41p872j3109l320l372j684j1251j2697M310
16009E3154j3676j4953l018j932O119k313N426j514q721N974q34j972j019r952
15995A0769o856J363N248R211R658m07l870k956o273q243j80j415N217Q815l735
15980A6346J567J0365N51j7063m463M299O611N313j180j803k055l381q717j00
15966F290k199o46r241o581N324n466j073K759p574l326N085P391n700m470J365
15951a8062k175m445l67k886M419P1m715K292J0254J0162L161j61l732o548L022
15936i710J113M303m187q399p5M531O6K462J027M344R489O354N75m440L105o316
$$ y = [508119, 466181, 429114, 386000, 338078, 296461, 261698, 226924, 203463, 187348, 177276, 163098, 145481, 125467, 112054, 102690, 102149, 94277, 81168, 77848, 74476, 72792, 61541, 48844, 53154, 39478, 24525, 21507, 19575, 25694, 23381, 28807, 27293, 18572, 24546, 23712, 21740, 20721, 10769, 3913, 5276, 10524, 19735, 29393, 28986, 25116, 22160, 15887, 7644, 7464, 6049, 11266, 20081, 16346, 17913, 28278, 28829, 11766, 7303, 11602, 18213, 23526, 22346, 20543, 18488, 15107, 6390, 6290, 4091, 3445, -5796, -12377, -7053, -12519, -13592, -10833, -18407, -21733, -16648, -9257, -14957, -19427, -18062, -20237, -24682, -25049, -27935, -23516, -23445, -28160, -25868, -15614, -5452, -2291, -2452, -6184, -12732, -9710, -8597, -4294, -8481, -16880, -16955, -12424, -12358, -9896, -8869, -4525, 4964, 11318, 11893, 7453, 10558, 4242]
15920D242j554l573M261M469n422Q354M875k134l574m484m964r223k352l491J696
15905a2874O215r36m825n858m069L524O071L230o716k362J0804Q104l438J103
15891b027R66O80j025K6J315P76N159o3k629J263j720j2207m110j423K81K293
15875a2445K605p636o904m335j506J228P502M187k299N494N749J776l365n008
15861a4957o212M659M519O884l28l534n335J2474l57o812n213P513j0099p376
15847b4174j214j295j611R421J1861j465m915n016O326P423N671J426J796j5266
15833a1032j2002L42j553J636J1568J64L539N74j03m066q374J041N878N502J68
15818f718j83o35J045O186m060q660O994l676p94o31K857r66p088J536L933J839
$$ y = [4242, 2688, -885, 3376, 7845, 2423, 10777, 15652, 13518, 9944, 5460, 496, -8727, -11079, -14570, -12874, -6659, -7595, -12420, -18278, -22347, -18823, -12752, -9522, -16238, -18600, -7796, 308, -3130, -2027, -1061, -381, -1406, -1380, -65, 711, 5870, 5807, 3178, 4441, 2721, -9486, -13596, -15019, -14738, -12445, -9840, -17476, -24380, -28715, -30221, -28993, -21491, -17304, -19603, -14109, -8360, -6584, -9949, -14957, -21169, -16510, -11991, -5107, -5435, -8969, -14304, -1830, -2187, -8999, -14212, -6699, -16798, -24174, -25388, -26683, -28294, -18873, -7012, -8477, -13392, -18408, -12082, -4659, 1012, 2438, 4234, -11032, -23034, -22692, -24245, -22609, -11041, -10877, -7338, -6764, -6867, -10933, -19307, -18266, -12388, -6886, -6718, -6901, -7536, -6491, -305, -4365, -13025, -6031, -9707, -10501, -11132, -8275, -9241, -16329, -14793, -10860, -9021]
15802i021P65L509J10N766J1450p581j0764j416P520O447j536l07q766J424M313
15787A913m084M187k396J1496N732j0113j0957l624j166o168J68m95M968M784
15773e755N117p821p754n740l925P040J270M193l282l940n266M493K740k83q406
15758b7319n923N993Q657n523n09O850M328M409q980k0300j369P595J5239Q146
15744h706L507P148k324l522l54o34l98j0822o292K353Q855j562P04r815K323
15729a9539m27O616l28m704l307Q32k484k066o271j739J2297P322M114K224o202
15714a3662k402P972N345J928n585o980r611J427O389P97Q858J547m381R21R339
15699A902%p973k179m854j0570L717n408N556R656M360l350r758m127P283O114
$$ y = [-9021, -8256, -4747, -4637, 1129, 12579, 4998, -5766, -7182, 338, 6785, 5249, 4942, -3824, -2400, 1913, -2171, 2016, -380, 11116, 16848, 6735, -4222, -7846, -9012, -15180, -15012, -15507, -10539, -5755, -638, -8459, -16213, -21953, -25878, -18838, -17568, -13375, -16657, -20597, -25863, -21370, -18630, -18913, -27319, -33242, -27249, -18592, -24115, -24624, -17774, -13446, -9037, -18017, -38317, -39686, -32091, -16852, -8706, -5199, 1949, -375, -3897, -4251, -4885, -5283, -16105, -22397, -20044, -11189, -12751, -12047, -21862, -19539, -19966, -13350, -13678, -18382, -21689, -20857, -23341, -25407, -31678, -33417, -21120, -13798, -9684, -7460, -13662, -16064, -8092, -2747, -819, -6404, -13384, -22995, -21568, -15179, -14382, -5524, -3977, -8358, -7437, 1902, 1902, -6071, -8250, -13104, -23674, -19957, -25365, -19809, -10153, -5793, -9143, -18901, -23028, -15745, -9631]
15684i631n125P711J0565q479m912L013o44M814m796j0052O209R982N282O33n94
15669C976n993p587M12n333Q299K942J449L155l102L23N357p564p609N074J931
15654d270m769O76M635L722j392j1029O29R11l532j28N902R449j589j1175J216
15639a0744L445N334j1267n4l416n13Mr68o51L390J438m764l571K236Q536K945
15623h620j200k378r12K394n10m78P960m831K796N96n726k607O76j475O414J098
15607f803O4r28k686j39K695N48q61Q517k617K401Q287l042j1958q72N576n896
15591g714k861k261l895j3626j398J2867O840J395N937m908J232M566j758K362
15577c222q27O49Q676l152n850O20k783j710k781k370N717l359K072J272p507
$$ y = [-9631, -14756, -7045, 3520, -4959, -9871, -6858, -7502, -2688, -7484, -17536, -11327, -1345, 3937, 4570, 3976, -2017, -9604, -9192, -14525, -6226, -3284, -1835, 1320, -1782, -1459, 3898, -3666, -11275, -6201, -4270, -9039, -8363, -3728, -6, -1398, -12427, -11798, -10887, -14419, -14547, -8645, 804, -785, -11960, -10744, -7299, -1965, -13232, -13286, -16702, -17215, -17211, -18179, -18830, -15440, -14002, -18766, -22337, -20101, -11565, -8620, -9820, -12198, -13110, -10716, -11226, -11704, -3744, -8575, -5779, -5183, -10909, -13516, -12840, -14315, -7901, -6803, -6739, -7667, -10353, -10492, -7797, -7249, -8110, 407, -2210, 191, 8478, 5436, -6522, -7394, -1818, -7714, -10575, -12836, -16731, -30357, -31755, -18888, -12048, -10653, -4716, -9624, -8392, -3826, -5584, -3222, -4049, -3400, 5276, 2124, -3726, -3106, -5889, -7599, -10380, -12750, -7033, -10392, -8320, -7048, -14555]
15562a4555O875o76l078L250L612p52r800J416P270m375k278j832J37N15l897
15547a8168M12J046j158o73o337j09J7186k749m301O262k310N658L519K554J73
15532A005j0831k379l225Q524J5262J051l550k165Q159O304Q009j1989q660P320
15518A2835L343k326j324N423O997J367m731j963M785Q280J0910K4370K4774L6661
15504A29401L1896L1272M1202K3428J5724R617O227j2434k4996k0281l4419l2368
15492A64269k7843l0583k5556k2901r555j1919j3698j3479m086j1402l928N81
15480a0100L837J380K549J681N448L483k655K289k597j0359K445k468p740O914
15466e893O006N899N600R13m732k467K285M413k146J793P972L894Q53l531J36
$$ y = [-14555, -7680, -8356, -11434, -8184, -4572, -5324, -15124, -13708, -6438, -10813, -13091, -14923, -14786, -14271, -18168, -17756, -16710, -17868, -18541, -24878, -24987, -7801, -10550, -14851, -8589, -10899, -5241, -1722, 832, 1005, -9826, -12205, -15430, -6906, 8356, 9407, 5857, 3692, 11851, 18155, 26164, 14175, 5515, 12835, 16178, 13852, 12528, 17951, 24948, 26315, 21584, 19621, 24406, 32686, 43596, 67966, 92740, 129401, 161297, 192569, 233771, 257199, 272923, 282540, 288767, 276333, 251337, 231056, 196637, 164269, 136426, 105843, 80287, 57386, 47831, 35912, 22214, 8735, 4649, -6753, -10681, -10100, -6263, -4883, -2334, -653, 4795, 8278, 5623, 7912, 5315, -5044, -2599, -5067, -12807, -5893, 113, 6012, 11612, 12525, 7793, 5326, 7611, 12024, 9878, 11671, 19643, 23537, 24390, 20859, 20995]
15451B0995l266K489M309j5974j4147J0096J6618k004l253m221j1425q083o16
15438h482r35O71M188J17o995o243K699R221O0M415P67j223q715m491R001K073
15422c872K762j258k758N164K306k720L693K232l235p937N918O444p066K092N149
15407F914o588j812P76l570M310K717m636R13K856M750Q664l918j1865j0521k388
15392a3398R119R858M3r079j637j138j042l882J436J050M60R484M367L26k362
15377C605p600j0657j2466M288N125l143P589N290Q00n796N480j037R08M630k306
15362e290J219k909j515L38q64L189K933J855M746M377j726k250o309p070R975
15347F99K226r751L39r57R00O94K423J308j273j093r956j738N516j806j636Q292
$$ y = [20995, 17729, 20218, 24527, 8553, -5594, 4502, 21120, 19116, 15863, 11642, 217, -7866, -8482, -9417, -8746, -4558, -4441, -11436, -17679, -14980, -5759, -5699, -1284, -517, -1740, -10455, -14946, -5945, -3872, -1110, -2368, -5126, 38, 2344, -376, 3317, 5549, 2314, -5623, 295, 6739, -327, 1765, 6914, 326, -1486, -710, -4280, 30, 2747, -1889, -976, 1880, 6630, 15294, 11376, -489, -11010, -13398, -4279, 5579, 5622, -3457, -5094, -6232, -7274, -11156, -9720, -8670, -8210, 1274, 5641, 5967, 3605, -3995, -14652, -27118, -22830, -17705, -20848, -13259, -7969, -7169, -12965, -7485, -8522, -7614, -2984, -5290, -4071, -6980, -8495, -8157, -9021, -5832, -2899, -1044, 3702, 8079, 6353, 4103, -2206, -9276, 699, 2925, -6826, -6487, -7444, -6544, -5850, -3427, -2119, -3392, -4485, -14441, -16179, -10663, -12469, -14105, -5813]
15331e813N39p971j828J55R970K765N07m77L257l806k44J180o12j029Q218M702
15315I513k740j454K303o473o535m358J1413P219l001J53N914L835m480k084j4543
15300e318l256R363q886k228N625P445k42j3005n7l636j2874J546K151Q389J0986
15285c997O581P94n375J042o779o149N977Q116O758L527j364j151o768q405l099
15270a0292P176q04j5102L331Q312J197j800N174O145J228m552o806J521P318
15256B046N723M403k64o783n352J861q774j692L307N204P315n208j0182m091K099
15241a0388R491Q895j676n249o189Q01R330n9m501p485O926j883O64p645j6935
15226b5903o663Q879P027P521J928o105o85L193J6705np244j3361p010N135J1994
$$ y = [-5813, -5274, -13245, -15073, -14918, -4948, -2183, -1676, -2153, 1104, -2702, -2946, -1766, -2378, -3407, 4811, 9513, 6773, 5319, 7622, 1149, -5386, -9744, 1669, 8888, 5887, 6040, 11954, 15789, 11309, 9225, -5318, -8574, 789, -8097, -10325, -4700, 2745, 2503, -10502, -10559, -14195, -27069, -25523, -23372, -14983, -3997, 2584, 3378, -1997, -955, -7734, -13883, -7906, 210, 6968, 10495, 9131, 7980, 1212, -7193, -10292, -3116, -3920, -19022, -15691, -7379, -6182, -7982, -2808, 3337, 4565, 13, -6793, -5272, 2046, 7769, 12172, 11908, 5125, -227, 1634, -7140, -8832, -5525, -321, 6994, 1786, -8396, -12487, -10388, -897, 7998, 6322, 1073, -5116, -4315, 5015, 4956, 455, -7030, -104, -1987, -1323, -8968, -25903, -32566, -23687, -16660, -9139, -7211, -13316, -14001, -10808, 5897, 5892, -1352, -14713, -21723, -16588, -4594]
15211d594J0233l438k122o994J260P532K538j1607m289P267J448M590P493q56
15197H461j302l3m125R61q590m930l988J486k944m292k048K409M454j130j977
15182a7588p15O386l12j748l487m21l124Q682J1757M505n409J465L089j844R58
15167B194p075j2998J15P144N205k131n911Q377O90m86M406K02M114k112n530
15152c796j106j477L94K615O15J288J420J528o6l625k952n714J524N492K064Q557
15136F761Q496O903o570n680P235j31J169q264r953L654L322Q779r471o645j705
15121b100P580j45K640J467j717p609k053N014p19l125l648M832n838k146R75
15106f592m953r67M056l288o58J146k867M732K490n18L918M744K54m142o205q495
$$ y = [-4594, 5639, 2201, 79, -6915, -5655, 1877, 4415, -7192, -11481, -4214, -2766, 1824, 9317, 8461, 7159, 7126, 3001, 3962, -4628, -9558, -13546, -12060, -15004, -19296, -21344, -18935, -14481, -15611, -17588, -18303, -11917, -12229, -13977, -17464, -17885, -21009, -12327, -570, 3935, -1474, -9, 3080, 1236, 2194, -4881, -17879, -17764, -10620, -5415, -7546, -13457, -5080, -4390, -4876, -470, -268, 3846, 1734, -3796, -4902, -6379, -5985, -3370, -2755, -1467, -47, 1481, 1415, -2210, -5162, -10876, -9352, -3860, -1796, 6761, 15257, 22160, 15590, 9910, 17145, 17014, 18183, 9919, -34, 3620, 6942, 15721, 6250, -395, -2100, 5480, 5335, 7975, 9442, 7725, 116, -1937, 3077, 2358, -767, -4415, 417, -5421, -7567, -6592, -11545, -12512, -8456, -11744, -12402, -11256, -14123, -9391, -6901, -7419, -3501, 1243, 1497, -2645, -8850, -17345]
15090a7345O254O800K52m190p309j905J4848R364o992J774N143n84J141l277O38
15075D612q400J862P865p224j0182k951k833n259J2515J4663K854J758p70m144
15061D366j4007k067Q391n895L719l178L374l040q714L470N897n824J474J6135
15047D101K490o141o365j4465k512L31J0684N172R44P12M928l897n185L3J555
15032g615r26n180n125M982N742j122o996j1841N252N944o805k244j369M016O247
15017a7040J388J18M734N622M607r381J46Q7N232N808L882n265L128L061p925
15002a798l93n04r23L15P655M420N59o800j639j218p136o818O791K860R822P048
14986A2241r11j4585K118J1518q137p716o686J274O759P566N522n753J82P13j0588
$$ y = [-17345, -11091, -4291, -4039, -8229, -15538, -17443, -2595, 6769, -223, 1551, 6694, 6110, 7251, 3974, 4612, -3788, -1926, 5939, -1285, -11467, -14418, -17251, -22510, -9995, 4668, 7522, 9280, 8510, 4366, -9641, -11708, -3317, -9212, -5493, -8671, -5297, -8337, -17051, -13581, -7684, -13508, -12034, 4101, 6591, 450, -5915, -20380, -22892, -22561, -11877, -6705, -5761, -5049, -121, -4018, -9203, -9170, -7615, -8541, -13721, -18846, -13864, -8122, -9244, -16240, -28081, -22829, -16885, -23690, -25934, -27303, -23287, -17040, -15652, -15534, -10800, -5178, -571, -9952, -9806, -9719, -4487, 1321, 5203, -62, 3066, 6127, -1798, -2191, -2695, -3618, -3303, 4352, 8772, 9331, 2531, 892, -326, -7462, -14280, -7489, -4629, 5193, 12241, 11330, -3255, -1137, 10381, 2244, -5472, -12158, -10884, -4125, 3441, 8963, 3210, 3392, 4105, -6483]
14971f483k242P289n635K543J0024R82n447l287J189K724K906J891n0l606n666
14956b868j941j483j370M064L862N502m100m386M014P078j283k882j0407K273
14942c927R815n3m602L067j060n747r700K37M854p172l082O672m300P16l98L378
14926a1302N424l27n372q199R70J955R768J274N852M06m198Q03p017k155M460
14911g658p14N295J787p709k686R802k71m732J643k957o917k30N891K526r31j142
14895i003j762J569P19M428K790J097j343J5K883j435l365N407J499l202q662
14880h365j2721J41l64j458J671m8N718N368j0044m00J1406M550K970R344J0731
14865A8499o472n810q119L800j686l06N087n712p363n22R531j0606m312L244P354
$$ y = [-6483, -8725, -1436, -7071, -4528, 5496, 6478, 1031, -2256, -1067, 1657, 4563, 6454, 6404, 2798, -2868, -4809, -6292, -7662, -3598, 264, 5766, 1666, -2720, 1294, 8372, 7089, 4207, -6200, -3927, 5888, 5835, 1233, 4300, 3240, -2507, -12207, -11970, -7116, -14288, -17370, -10698, -14998, -14282, -14680, -11302, -5878, -6205, -11577, -19776, -18806, -16851, -7083, -5809, 43, 449, -3749, -2946, -9963, -12118, -7658, -8372, -3077, -1290, -8999, -11685, -1883, -2154, -6886, -5243, -8200, -15117, -15347, -9456, -6930, -7861, -9003, -10765, -9196, -8477, -4049, -1259, -162, -1505, -1490, 1393, -42, -3407, 2000, 3499, 297, -8365, -21086, -20945, -21309, -22767, -21096, -21144, -15426, -10058, -20102, -20502, -9096, -4546, -1576, 7768, 18499, 12027, 6217, -1902, 1898, 212, -94, 4993, -719, -8082, -8604, 927, -9679, -13991, -10747, -3393]
14850c393K136j20n261M568J2270P940o243j4272m433K231N230J364L033r13m425
14835b88l433L460l734n489M757n63K335j920P659r71K564l444L376L329m497
14820C141r980O710P176O741K260o655j145k002o557k883K906L613J842J186j997
14805D356M043j296j1201l110J055j1626m085Q074O174P241M741k853N19L034
14791E066P890L035j2060r790L862r98J627n075j4289M523P932K559L539J306
14777h73P510O694j4789p948M151O064l77Q13N215j154M550J703q476j9057O344
14762i630R917r02R03J525L779n520j4760K827R0N285J4087m232M2K540k766m43
14746B742J177L618O470l991j2031R11N89m415k900Q99O913L369j399K573l995
$$ y = [-3393, -1257, -1377, -6638, -2070, 10200, 18140, 11897, -2375, -6808, -4577, 653, 2017, 5050, 4137, -288, -3721, -261, -3995, -9484, -4727, -5290, -2955, -4875, 2784, 1813, 4377, 933, 4309, 7638, 3141, -6839, -129, 7047, 13788, 16048, 9393, 8248, 6246, -311, -3194, -288, 3325, 5167, 6353, 4356, 8399, 7103, -4098, -7208, -6153, -17779, -21864, -13790, -7616, -375, 4366, 1513, 2032, 5066, 12956, 15991, 3931, -5859, -1997, -2995, -1368, -6443, -20732, -16209, -8277, -5718, -2179, -873, 6637, 13331, -1458, -9406, -5255, 809, 432, 1245, 6460, 5306, 9856, 11559, 3083, -15974, -9630, 287, -615, 288, 1813, 5592, 72, -14688, -11861, -11771, -6486, 7601, 3369, 3411, 5951, 3185, 2742, 3919, 7537, 14007, 10016, -2015, -1104, -515, -4930, -7830, -6931, -18, 3351, 1952, 4525, 530]
14731E30k295q71O302M434j463k406k87p9l068J037k863j0205J111J3990K750
14716F617j3304p128K739j045r45J1760K082j380R38k653R60k543j89n812p21
14701a0624J001J0090N587R89r61j553Q60J597p106l331m10J946P577m235k306
14686h79J0561m1J205J216K844J752j933j967j873k634o147m54Q421K625j7650
14671d954n31J071n465J855Q99l681j156J5039l12j400j671J019k253m820L261
14656c099L073o228J935J2915O770k384m138n359q014q47O580L526J754r928k734
14641f178l204J2894P102m900j2637m123N742J236J262N512P148j0246j314l367
14627e073n827j81L169p309J170J3398L446L78L651p175N230R385o28k312O077
$$ y = [530, -1765, -2636, 3666, 8100, 6637, 4231, 3944, 3865, 797, 1834, -1029, -11234, -10123, 3867, 6617, -6687, -13815, -11076, -12121, -13066, -1306, 776, -604, 334, -2319, -1359, -3902, -4091, -9903, -10624, -9623, 467, 6054, 7043, 6082, 4529, 5389, 6986, -120, -3451, -3861, -1915, 5662, 1427, -879, 9682, 9641, 10846, 12062, 14906, 16658, 14725, 12758, 10885, 8251, 2104, 1650, 10071, 12696, -4954, -5485, -4414, -9879, -8024, -7125, -10806, -11962, 3077, 2765, 1365, -306, 713, -1540, -6360, -3099, -26, -6254, -4319, 8596, 15366, 12982, 8844, 3485, -4529, -5376, 1204, 4730, 6484, -3444, -6178, -9382, 3512, 10614, 5714, -6923, -11046, -5304, -4068, -2806, 2706, 9854, -392, -1706, -5073, -10900, -11081, -7912, -15221, -14051, -653, 2793, 3171, 6822, -353, 4877, 14262, 13634, 11322, 17399]
14612A7399o119o969r827J446J810L79m662O715N462N6o149o630k674k316k661
14597a4740J741J972L610j075J0361O699p178k844L504J001L652P243p998l409
14583B539L740K927r714P570K329j2282l307J1116J1935n84n541j1527j2417m263
14569a7479M458R597M734N997n636k233K081r112o290P916K875r634m219J536
14555a5409P809P538J286j0102j894N238J521M87k74p144M214Q233J4150M978
14541B0631m724j0742r017M405P42Q684L737L08K934q543J699l423l206O774L540
14526A3799K121l353o720j5140p76Q373l292m44l480N013J2212j098p356Q73n33
14511A99q59N149K171n787Q3j761K772Q60r68K316o499n916M502J3263K369j0841
$$ y = [17399, 11280, 4311, -5516, -4070, -2260, -1881, -6543, 172, 5634, 5690, -459, -7089, -9763, -12079, -14740, -12999, -11027, -7417, -8492, 1869, 8568, 1390, -1454, 2050, 3051, 6703, 13946, 5948, 2539, 6279, 9206, -508, 7062, 9391, -2891, -6198, 4918, 16853, 16269, 10728, -799, -13216, -17479, -13021, -3424, 1310, 7307, 1671, -562, 1519, -7593, -13883, -5967, -3092, -12726, -16945, -15409, -7600, -62, 1224, -8878, -10772, -5534, -4013, -3526, -3800, -10944, -6730, 1503, 15653, 20631, 15907, 5165, -3852, 553, 1295, 9979, 13716, 14024, 16958, 8415, 10114, 6691, 3485, 10259, 13799, 15920, 12567, 5847, -9293, -10069, -1696, -4988, -5432, -8912, -3899, 8313, 7215, -141, 732, 199, -660, 4489, 6660, 873, 956, -805, 1967, 2827, 1859, 4175, -2324, -8240, -3738, 9525, 11894, 1053]
14495A053j732m7l945J934n806L229l22M586Q479L366O0k667l570k392m005m313
14479f092p055o038J0410P500j012m816J507J089n878k307k710O731K583j1681
14465a7769m168P781O467n17J987Q222l463m005L818k695m438m996J771m201M739
14450a1467N054M937J2580N812P24o25n140q865o936M742M717o970J0217l841
14436D939m330l521Q991K587k662j0235O88M82k901n4M316J163m103n769M066
14421f343L541m18J0222j9M127J922o993k027Q702k155K044M629j54J069o07o278
14405A1262j142M601j34n730o631p218l405L822J0040J5181k905q45M626m200
14391A7322j3316j1780j593L437M338P882K451r530l445M729J876m539N888J981
$$ y = [1053, -679, -726, -4671, -2737, -8543, -5314, -5636, -1050, 7429, 10795, 10855, 8188, 4618, 2226, -1779, -6092, -13147, -19185, -8775, -1275, -2287, -7103, -5596, -4507, -10385, -12692, -15402, -8671, -6088, -17769, -21937, -14156, -7689, -8206, -6219, 2003, -1460, -5465, -1647, -4342, -8780, -13776, -12005, -16206, -11467, -6413, -1476, 11104, 16916, 17640, 17015, 11875, 3010, -3926, 816, 5533, -1437, 8780, 4939, 609, -2912, 6079, 8666, 6004, -4231, -3543, -3061, -5962, -6016, -1700, -537, -4640, -10409, -6343, -2802, -3220, 7002, 6983, 11110, 13032, 6039, 4012, 12714, 10559, 12603, 17232, 17078, 18147, 17540, 11262, 10120, 14721, 14587, 8857, 2226, -4992, -8397, -4575, 5465, 20646, 17741, 16896, 21522, 17322, 4006, -7774, -9367, -5930, -1592, 6290, 8741, -789, -4234, 495, 2371, -2168, 3720, 5701]
14377E701o482j4755j3417M628N22N706Q121Q893P318P670r79r283n722K350L13
14362E84p162j0051J372J064M514L185L419M498j731R4R13N281P784N111n14o511
14346A1850o380o499o783l563j446j610J3253P385p950o442R218K392M207M191
14332A1823j899o103n289R723K117m054Q09M152K739l874q097j615L280N408m053
14317E067l490j3437K623O569L634j860L559J0346J75j820j1321q194k724Q8N473
14302e312O012N19k991M119J0120o23q329L213p042n634K702n339m133P405L237
14287b076n736M448P95j301M170j809J172P566k577J06n233m990R930N989L125
14272A3579k073p247r690m581J928n14m865K10O475Q725l960N79m197k634P636
$$ y = [5701, -781, -15536, -28953, -24325, -23803, -18097, -9976, -1083, 6235, 13905, 12926, 3643, -2079, 271, 584, -6578, -16629, -15257, -14193, -9679, -6494, -3075, 1423, -308, -214, 699, 5980, 13764, 18875, 18361, 11850, 5470, -1029, -7812, -11375, -12821, -14431, -1178, 6207, -1743, -8185, 1033, 3425, 7632, 11823, 9924, 3821, -1468, 8255, 10372, 6318, 7127, 11279, 14018, 10144, 2047, 432, 3712, 9120, 5067, 1577, -11860, -9237, -2668, 966, -894, 2665, 13011, 13186, 11366, 45, -8149, -10873, -10785, -5312, 700, 1219, -1772, 2347, 12467, 11844, 3515, 6728, -314, -5948, -3246, -8585, -12718, -5313, -2076, -7812, -3364, -2569, -3870, 300, -1509, -337, 7229, 4652, 4758, -475, -5465, 4465, 10454, 13579, 11506, 4259, -5431, -10012, -8084, -8598, -13463, -13253, -6778, 1947, -2013, -1434, -5631, -8265, -629]
14257f29k131k771n433K472k68k530N840r96P160L241K755j220P96n70k952n694
14241b930J2823m079r25j691o788L02N303r57m207j65J7497P21l116m535k662
14226D591j185m95m142p029R496O203j392j636l939K090k306M307L855k098J68
14211F488l016j1294J503M937M085J258o823p522L340J163J091P446M212O457
14197A3325N896o031R07J1387k829m904j135P243L648m784l302j0480l729J434
14183F646n195R49p783m767M943q233N04Q343L109n899J435K989J697L487O023
14168H248n057K274J124l263Q652O564q541m14m210n760q039J435Q26M766J8319
14153A6924N552r873k313Q800P350o501o330o381O09m607J817M185n187q523N128
$$ y = [-629, -2760, -5531, -10964, -8492, -8760, -11290, -5450, -6446, 714, 3955, 6710, 5490, 6286, 5716, 2764, -2930, 9893, 5814, 4889, 3198, -3590, -3288, 2015, 1058, -3149, -3314, 14183, 14904, 11788, 7253, 4591, 3406, 2911, -1231, -8260, 1236, 7439, 6047, 4411, 472, 2562, 256, 4563, 8418, 6320, 6488, 3472, -7822, -6319, -1382, 2703, 3961, -2862, -10384, -7044, -5881, -4790, 2656, 6868, 13325, 19221, 13190, 14097, 25484, 22655, 17751, 16616, 23859, 27507, 22723, 19421, 8941, 5212, 6646, 1451, 2400, -5383, -10150, -5207, -13440, -12936, -4593, -1484, -7383, -5948, -2959, -1262, 2225, 8248, 3191, 5465, 6589, 3326, 11978, 18542, 10001, 9587, 5377, -383, -8422, -6987, -6161, -1395, 16924, 22476, 12603, 10290, 19090, 26440, 19939, 13609, 7228, 7837, 3230, 5047, 9232, 4045, -4478, 650]
14138F50n81R08l287P535N014j418L640q232j2419j4987Q104O985N157R00p384
14123i415Q43P911k266n598j1378K868R819K184J1375Q95l17N174Q437q82K744
14108B2394N71O811Q68n307o844q819n137n139L729P45J068k353l961l477J0286
14093E435K756r322k651J709j00J306N007m118N53k445k903l81n1M766J583O943
14077H087j114o834q178p79K600K977o223O722M494l206j03m509p054N900J304
14062e916L776M53k011N430k908j083R24K683j583N946k496M70p3L35q49K56J586
14045D940L137n916k893J300Q580n915p783Q001K328Q13M692M478o206J114m806
14030E864K113L836J64o487n416K007o227l71J719O233Q97J915L603J740O896
$$ y = [650, 69, 977, -2310, 5225, 10239, 8821, 12461, 4229, -8190, -23177, -15073, -8088, -2931, -2031, -9415, -8572, -661, -2927, -8525, -19903, -17035, -7216, -5032, 6343, 7238, 6921, 12095, 20532, 19650, 22394, 22965, 29776, 30644, 25337, 18493, 9674, 4537, -602, 3127, 3872, 4940, 2587, -1374, -4851, 5435, 8191, -1131, -3782, -2073, -2173, -867, 4140, 22, 575, -1870, -4773, -5154, -5205, -439, 1144, 8087, 6973, 139, -8039, -8818, -6218, -3241, -9464, -2742, 1752, -1454, -1557, -6066, -13120, -7220, -5916, -2140, -1687, -3698, 1732, -1176, -2259, -1335, 1348, -235, 5711, 3215, 3685, 3612, 3947, 3098, 3354, 4940, 8077, 2161, -732, 568, 9148, 3233, -4550, 3451, 5779, 6592, 11284, 15762, 9556, 10670, 5864, 7977, 11813, 11977, 5490, 74, 2081, -4146, -4517, -2798, 3435, 4332, 6247, 9850, 11590, 18486]
14015A8486j0633L244P146J546j644k472k097q805o258l923K551N77l568k729
14001h579J857O755k510K725j974m477J1129O299k670J188m051j582j850O979
13987I239J2965Q8r635j3340L592K263k576l334n58l882J796J353J855N673k415
13972C084p361K350J503L851J2733j613j2467j340R66M397P837J606l172k729
13958I645j45k289k733k098k459p762r752N289J0596P708K511N970L016r298j111
13943G088K355K091m60j166j2274K365N625Q71m204K625K146j952j322J784p179
13928a607N32k101L002J14J27J916l118M6m966O633J1623M738q139K369L690j765
13912A3094m81J130M281J39l092O428m671q334J0593l590M549K992o59p541j8073
$$ y = [18486, 7853, 11097, 18243, 19789, 18145, 15673, 13576, 4771, -1487, -5410, -2859, -2282, -5850, -8579, -6722, 33, -2477, 248, -1726, -6203, 4926, 11225, 8555, 9743, 5692, 4110, 2260, 9239, 22204, 22292, 12657, -683, 2909, 5172, 2596, -738, -1296, -5178, -3382, -2029, -174, 5499, 3084, -4277, -1927, -424, 3427, 16160, 14547, 2080, 740, 1706, 6103, 13940, 15546, 12374, 9645, 9500, 7211, 4478, 2380, -79, -7841, -17593, -12304, -1708, 6000, 8511, 14481, 17497, 8199, 7088, 9443, 11534, 11074, 9908, -2366, -1, 5624, 6495, 2291, 4916, 7062, 5110, 3788, 5572, -1607, -1075, -3176, -174, -60, 67, 1983, -1135, -1089, -6055, 578, 12201, 16939, 8800, 11169, 14859, 13094, 12613, 13743, 18024, 18163, 15071, 21499, 16828, 8494, 19087, 15497, 20046, 23038, 22379, 14838, -3235]
13897c235O932J0561r375j3827p362R16L641k028J5124r35k968P821J8n134N646
13882E795J1359P032k730p574m222r084j0860N012J1974P08J988J3221O911k5494
13868D036o718l386N155O147L230P70j319j532j943k983J668J654J789k681l314
13853E73l480o252l149n908M222Q862P022K122n446o70L226L347J170k299n73
13838B767K649q020m967P799r40k937L148M874j1188L195L886J14M439k43J50
13823D726N939l263l117r026l769Q934J1371j733o613O45n665K364J781K521j458
13808C637q512R543j578j0738n632N516O152l49J162m017O992J2385q925o893
13794a257l562L285P777M266q134o319Q990N774N262q379j0475R546R408j30n475
$$ y = [-3235, 3697, 14258, 4883, -8944, -16306, -15390, -11749, -13777, 1347, 412, -2556, 5265, 5283, 149, 5795, 17154, 24186, 21456, 13882, 9660, 576, -10284, -5272, 6702, 7410, 9398, 22619, 29530, 4036, -2682, -6068, -913, 5234, 8464, 9234, 7915, 6383, 4440, 1457, 3125, 4779, 6568, 3887, 573, -2907, -9159, -12308, -18216, -13994, -5132, 1890, 4012, -1434, -2104, 1122, 4469, 5639, 3340, 2767, 5416, -2604, -7571, 228, -712, -3649, -501, 4373, -6815, -3620, 266, 380, 4819, 4576, 4726, 10665, 7402, 4285, -4741, -8510, 424, 11795, 10062, 3449, 4094, -1571, 793, 2574, 5095, 3637, -4875, 4668, 3090, -7648, -13280, -7764, -1612, -1961, -799, -4816, 2176, 14561, 5636, -1257, -4819, -1534, 6243, 10509, 2375, -3944, 5046, 10820, 16082, 7703, -2772, 6774, 16182, 16052, 10577]
13779A0577l298M647p76k174o66r46K351q888J85m168M773o607K586P716p790
13764b478n990j330N649P479q781K694J6599M923J149j5999m113N452k619j695
13750I40l463o353K433J173M730R408N230K937R908J3650j3642j0022m223n817
13736F889l322k495Q0J590J461k139K675J183l988N817l59o821N037J3430m201
13721A4837k406R447l586n713p474n735k196J2224O302r943K977l972k785J369
13707C346P684o69n614n623j18K163M98L917J1082r960j3439K391R387J4566l800
13692A5811j323j640j0554r231J193O348p984J450P879j958M988k993k481J7196
13678A6701m919L811L81Q6Q862J043m703p120m300K715M609J072R25K46j13p759
$$ y = [10577, 7279, 11926, 11150, 8976, 8310, 7364, 9715, 827, 1012, -3156, 1617, -4990, -2404, 5312, -2478, -8468, -9798, -4149, 3330, -5451, -2757, 13842, 18765, 19914, 3915, -198, 5254, 2635, 940, -2523, -8876, -6443, -5270, -540, 8868, 14098, 17035, 26943, 40593, 26951, 16929, 12706, 6889, 3567, 1072, 1152, 2742, 4203, 2064, 4739, 5922, 1934, 7751, 7392, 571, 5608, 19038, 14837, 12431, 21878, 18292, 12579, 5105, -630, -2826, 9398, 15700, 5757, 8734, 4762, 1977, 3346, 11030, 10361, 4747, -876, -994, 1169, 1667, 5584, 16666, 6706, -6733, -4342, 5045, 19611, 15811, 14488, 12848, 2294, -6937, -5744, 604, -7380, -5930, 1949, -9, 4979, 1986, -495, 16701, 11782, 15593, 15974, 16060, 24922, 25965, 21262, 14142, 9842, 12557, 17166, 18238, 19163, 19409, 19296, 11537]
13662A1537o238j3177Q44N077R024J1882K922o934j616m464M514K743j249l943
13648A0922J846J3483j420o272o92o81p9J354k736r559j1064M207Q035K750l999
13633F095J822k73L100m423m371Q314k408l958J392R652L964L550l841Q15p937
13618A1493q133O786K210l305L25M46M362p826l528O644J1309k869q023L55r045
13603A201N27P279Q193j1043l877L49J18O149N863N613n645m157N153k514l384
13588I825j863R35m352L192l142m582M957Q817M974p997J346O618K897O00j0608
13573A1617l13M27l737p881P846J1607q670l506r028j1190l066L045J2790L068
13559C009m71J3149P371j6822k254P002M504o811m651L997m750o412L201m241
$$ y = [11537, 5299, -7878, -7034, -1957, 7067, 18949, 21871, 14937, 13321, 8857, 13371, 16114, 14865, 10922, 12768, 26251, 24831, 18559, 17867, 17186, 17107, 18461, 15725, 6166, -4898, -691, 7344, 10094, 6095, 7917, 7644, 10744, 6321, 1950, 10264, 7856, 3898, 5290, 14942, 18906, 22456, 18615, 19430, 11493, 3360, 10146, 12356, 9051, 9376, 9822, 14184, 6358, 2830, 9474, 20783, 17914, 9891, 10246, 1201, 1728, 9007, 17200, 6157, 2280, 2629, 2747, 8896, 14759, 20372, 14727, 10570, 15723, 13209, 9825, 7962, 8897, 4545, 7737, 4595, 13, 4970, 13787, 18761, 10764, 12110, 18728, 21625, 22225, 11617, 11304, 11731, 7994, 113, 7959, 19566, 10896, 7390, -1638, -12828, -15894, -12849, -59, 3009, 2538, 15687, 23058, 6236, 3982, 10984, 15488, 8677, 4026, 8023, 3273, -3139, 62, -4179]
13545d179n204p67k689o00J5673Q919J984q683P873O261n406j7201n692P453n15
13530b773J820M911m171p817J0179N273n295O125n126j0739m24O371M718k491
13516E61N518L24k345J248l213O061Q46l265k908M259l679K637J714j595M735
13501A0898q28J0225N836p957o767n10O803J0051J344n611n742L58o648j78L49
13486A1623Q60l101k951j309N428N105j778L093L695l753m462k734j181O689O68
13471A5892P998Q766J1723o370r509k1310j5191M430J764Q855j061j399m916k537
13457b865k864j3867R798Q521M594O531P070p335l806L426o234k531p705l607
13443a0874L275K343N116L028o324P410Q758N362q60L901M57l968q984n886O288
$$ y = [-4179, -9383, -10150, -12839, -13439, 2234, 11153, 13137, 4454, 12327, 18588, 13182, -4019, -9711, -2258, -2773, -953, 3958, -213, -8030, 2149, 7422, 2127, 8252, 3126, -7613, -8037, -1666, 3052, 561, 6079, 6403, 4058, 5306, 2093, 8154, 9000, 5735, 2827, 7086, 3407, 6044, 7758, 6163, 10898, 10070, 20295, 26131, 18174, 11407, 10897, 17700, 27751, 29095, 23484, 17742, 18100, 11452, 11274, 11623, 12483, 9382, 6431, 5122, 10550, 15655, 13877, 16970, 20665, 16912, 12450, 9716, 8535, 15224, 15892, 23890, 32656, 44379, 38009, 28500, 7190, -8001, -3571, -1807, 7048, 5987, 4588, -328, -2865, -5729, -19596, -9798, -1277, 3317, 9848, 16918, 9583, 5777, 9203, 2969, 438, -7267, -10874, -7599, -5256, -140, 2888, -3436, 3974, 12732, 18094, 17234, 21135, 21592, 17624, 8640, 2754, 9042]
13428I042j405m682R28L838Q551l346L694j576m67m295m751R51J765N41K476l804
13412G460n25j395J1025Q089j1326l052l78L40m717l402r272R226J5017l760l274
13397A0056K502j320M30k483m912k953O732K445J471L546J992K262m543K716J94
13382A8135k30n155j579M532p669m380l995m012L454P64P359O375p594J009M301
13367A1315O725m431R769J1400l365j6521m371J781R032Q773j6p309n123j664
13353A5995P280L022K512j987r001j94m03J401M374m523l880R26r015j900n17
13338D090n116r849M715L421J620J3573K230l579R26j785K393J592l710O343N147
13323B2011n98k664q509K864J3495j796j2210O182L117n386m541l30N740M945
$$ y = [9042, 7637, 2955, 3883, 7721, 16272, 12926, 16620, 15044, 14577, 10282, 5531, 6482, 8247, 8788, 11264, 7460, 6935, 5540, 16565, 24654, 13328, 10276, 9898, 10238, 5521, 2119, -7153, 2073, 17090, 13330, 10056, 12558, 11238, 11668, 9185, 4273, 1320, 8052, 10497, 11968, 15514, 17506, 19768, 15225, 17941, 18135, 17905, 12750, 11171, 15703, 8034, 3654, -341, -4353, -899, -135, 7224, 13599, 6005, 7014, 11315, 18040, 13609, 23378, 34778, 31413, 14892, 10521, 12302, 21334, 30107, 30091, 22782, 17659, 15995, 23275, 26297, 28809, 26822, 17821, 17627, 17224, 18625, 22999, 18476, 14596, 15522, 6507, 4607, 4090, -1026, -10875, -6160, -2739, -1119, 12454, 14684, 11105, 12031, 10246, 12639, 14231, 10521, 16864, 22011, 21413, 18749, 10240, 13104, 26599, 24803, 12593, 18775, 21892, 16506, 11965, 11635, 17375, 22320]
13309B2320K001r121l356M584Q72j1143L267P819j0939m762Q30P506N556j2905
13295B529j8417R68K1671J3895j403K7j69r83K300L679q857k903J8589Q366k066
13280C7226j0686m882l82n795j1247O2Q461P841k451k29K010j0m683K306M479
13265B2020P635Q51m490p274j186k019L48q478p324Q44P299R331J708J064o009
13250A4320k133O355L918j4447L79M926j961j189P309n122k506M486K7j0591R227
13235A2998Q468k029j1177J1598J816k241m956k729j17K732L38Q528K650j2237
13221A3642o838m929m371k688J507M545J1514R899P492O296K248q045j3616j1317
13207E339J91Q274K580K31R145O312o596p458r725n850N943K797L948q122m694
$$ y = [22320, 24321, 15200, 11844, 16428, 17300, 6157, 9424, 17243, 6304, 1542, 2372, 9878, 15434, 2529, -15888, -14920, 6751, 20646, 19243, 19270, 19101, 18118, 20418, 24097, 15240, 12337, 30926, 39292, 37226, 26540, 21658, 21276, 15481, 4234, 4296, 12757, 20598, 18147, 17918, 19928, 19918, 15235, 17541, 22020, 29655, 30506, 26016, 18742, 17556, 15537, 15885, 7407, 83, 927, 8226, 17557, 19265, 20329, 14320, 12187, 18542, 22460, 8013, 8392, 13318, 11357, 10168, 17477, 12355, 9849, 14335, 14362, 3771, 12998, 21466, 19437, 8260, 19858, 21674, 19433, 14477, 11748, 11631, 14363, 14701, 23229, 25879, 13642, 6804, 1875, -2496, -5184, -3677, 868, 12382, 22281, 29773, 36069, 38317, 30272, 16656, 5339, 5530, 13804, 16384, 16615, 25760, 32072, 25476, 18018, 8293, 2443, 8386, 11183, 15131, 7009, 2315]
13192B315P065P394j434n212P652L838P850Nr821n577L045o108K644P138J0537
13177C1331P456p003K306l162l459P469N924L242N41n318L714L390j4862p822
13163B3747j6J2467l661r338Q245J0695p617m802K274k301J386k983L291R059
13149D0446p026j1258j330j809j590M423N107J425K475k421J64m205o513l53K666
13134B0201q830q126J2990P491l097m010K815J0438R378k670j0028k046O442n369
13120B5579N072K837o404J746O204J1754K0110Q254K042J0564M683N315l13j887
13106I5556R351L659K1372L0901K7838M3990O7773R8004R8600Q0827N3815L2747
13094F64433J1683L706k2579o4510r8284j10974q9124o5737m4253l6030k8322
$$ y = [2315, 9380, 16774, 15340, 10128, 17780, 21618, 29468, 29473, 19652, 14075, 17120, 11012, 13656, 20794, 31331, 38787, 31784, 34090, 30928, 27469, 34938, 40862, 44104, 44645, 39327, 43041, 46431, 31569, 23747, 23731, 36198, 32537, 23199, 31444, 42139, 34522, 29720, 31994, 29693, 31079, 28096, 31387, 40446, 33420, 22162, 20832, 19023, 17433, 21856, 26963, 28388, 30863, 28442, 28606, 24401, 17888, 17535, 20201, 11371, 3245, 16235, 23726, 20629, 16619, 19434, 29872, 39250, 36580, 26552, 24506, 30948, 25579, 30651, 33488, 27084, 28830, 35034, 46788, 66898, 75152, 77194, 87758, 92441, 97756, 97443, 95556, 104907, 108566, 129938, 160839, 188677, 232667, 300440, 398444, 497044, 577871, 631686, 664433, 676116, 679822, 657243, 592733, 494449, 383475, 294351, 228614, 184361, 148331, 120009]
13083A20009k7351j1661j1471j0404k931N034J167K775n000j0486o075k054m65
13070D1087K313N133l708J135M820m341n912k926L735K580p405o221L326m716
13056B8900O154j081o54K482P74k988K300m445o84n339K12K481J153J860o369
13041B4756n173j216Q403O803o081n424N287j876R172o11k925n722R96J849j314
13026B6924Q154l010q486m373o39J973L752O829K897J363J524p071M544M315o737
13011C1959q562m458P214N06l69J5040J3714j282j020n694j1625K882k13L235
12997D1327k128m45R042l92n355K730J828N554k472R29J2741m358j0138n895M051
12982D7019P269L641m522P028l184J4196N371j0132p884N619m463q697q403L74
$$ y = [120009, 92658, 80997, 69526, 59122, 56191, 61225, 62392, 65167, 60167, 49681, 43606, 41552, 41087, 43400, 48533, 44825, 45960, 50780, 46439, 40527, 37601, 41336, 43916, 36511, 30290, 33616, 28900, 35054, 33973, 33319, 35801, 36575, 33587, 35887, 31442, 30758, 25419, 25631, 28112, 29265, 31125, 24756, 19583, 18367, 26770, 33573, 27492, 22068, 27355, 25479, 34651, 34040, 31115, 25393, 26389, 28238, 26924, 35078, 32068, 23582, 19209, 18570, 20543, 24295, 31124, 34021, 35384, 36908, 29837, 34381, 38696, 31959, 23397, 18939, 26153, 26659, 26290, 41330, 55044, 53762, 52742, 47048, 35423, 38305, 38092, 41327, 39199, 38754, 47796, 47404, 42049, 44779, 46607, 52161, 49689, 50618, 63359, 59001, 48863, 42968, 47019, 54288, 57929, 53407, 60435, 57251, 71447, 76818, 66686, 58802, 64421, 59958, 51261, 42858, 43232]
12968D3232M162m95O524J2436m009j3135j3209O718K194p597l060j280q682n93
12954B3206P60J6090Q288j2279j2522l546J081Q444J4380J3077O306n268l696
12941E4321M019L476k855l310k476j8536j1048M496K908K932J1124J1487K943
12928E9481m004l658Q202J2346J4936J0175O913N166m769J508J6758J0722m249
12915A29527j7577k0839j7892j798K081o746j4282k55L635m89k320j0564q384
12902C4097N444J6256K836n909m564p790n483J1398p20q940L042Q212K1842M046
12888G3767n558m704l242L741R926m66n857O354K237j242q304r856q273l865l942
12873D0716J256K1473P936L166M293Q813R766j740j1737j222N78l465M464j4048
$$ y = [43232, 47394, 46899, 53423, 65859, 61850, 48715, 35506, 42224, 44418, 36821, 33761, 32481, 23799, 23206, 23966, 40056, 48344, 36065, 23543, 19997, 21078, 29522, 43902, 56979, 63285, 58017, 54321, 58340, 61816, 58961, 55651, 53175, 34639, 23591, 28087, 30995, 33927, 45051, 56538, 59481, 55477, 51819, 60021, 72367, 87303, 97478, 104391, 109557, 104788, 106296, 123054, 133776, 129527, 111950, 91111, 73219, 71421, 73502, 66756, 52474, 52219, 55854, 55365, 53045, 42481, 34097, 39541, 55797, 58633, 52724, 48160, 40370, 34887, 46285, 45565, 36625, 39667, 47879, 69721, 73767, 68209, 63505, 60263, 64004, 73930, 73464, 67607, 73961, 76198, 74956, 66652, 56796, 48523, 44658, 40716, 41972, 63445, 71381, 74547, 78840, 87653, 97419, 95679, 83942, 82720, 83298, 79833, 84297, 70249]
12859G0249j1765o467L209Q65K960k906q348j2321m057L880m018P793N884j062
12845D3896Q006J334R982J0962j357R232M074j0201o345m947O4R920M402j1076
12831F7946J178N070N298o479k462j694l177l607L413J1453O973k978J0485K582
12817I4001K462P383M507K336J0139J1419M520N608P27l970N347R625l54j493
12803A52257q039l774R33J687K873K982J0103O675o344k363J1059K964L200k911
12789A71302o51J0123K795k119k397l124n252q757k754p435k453M371L601K172
12775A59422J0965J0686j143m046m808j3299L273J2084n962j01j243o843O496
12762A65481J739k222N599O232l22K930J185L279J0177P732m000l522J196k573
$$ y = [70249, 58484, 52017, 55226, 56091, 59051, 56145, 47797, 35476, 31419, 35299, 31281, 39074, 44958, 43896, 51902, 53236, 63218, 74180, 72823, 82055, 86129, 75928, 69583, 64636, 64700, 74620, 79022, 67946, 69124, 74194, 79492, 73013, 70551, 68857, 65680, 62073, 65486, 76939, 83912, 80934, 91419, 94001, 96463, 103846, 108353, 110689, 120828, 132247, 136767, 142375, 143102, 139132, 144479, 154104, 153750, 152257, 144218, 140444, 141377, 143064, 145937, 148919, 159022, 165697, 159353, 156990, 168049, 171013, 174213, 171302, 170651, 180774, 183569, 181450, 179053, 175929, 170677, 161920, 159166, 151731, 149278, 153649, 157250, 159422, 170387, 181073, 179930, 175884, 171076, 157777, 161050, 173134, 167172, 167071, 165828, 158985, 165481, 167220, 164998, 170597, 176829, 176507, 179437, 180622, 183901, 194078, 201810, 197810, 194288, 195484, 192911]
12748A92911J693n255N980Q935L338R303L948J5686J7998J8094K5588L141N622
12735C06982J1167K0983J44O205J1401O045O715J8188M267P715J2747J2135J5395
12722D40089J3681K765J6517J1310J227L459J5545J3276K3063K1472K4980K6512
12710F13896K6263M1652L6694L7506N3564N5025N1073N9682N7713N9363N9271
12699A151702O4841P4477R2233J01514J13706J23291J35538J60585J80825K36180
12689B434892K87628L61327M50626N61163O72835P69998Q32807Q69640R50129
12680H191045J063449J180452J295805J470694J796947K408351L442932N214295
12672B6063970Q063903J2210332J6957172J9699282J7140657R769882L233527
$$ y = [192911, 194604, 189349, 195329, 204264, 207602, 216905, 220853, 236539, 254537, 272631, 298219, 301360, 306982, 318149, 339132, 339276, 345481, 356882, 362927, 369642, 387830, 392097, 399812, 412559, 424694, 440089, 453770, 456535, 473052, 484362, 485589, 489048, 504593, 517869, 540932, 562404, 587384, 613896, 640159, 681811, 718505, 756011, 809575, 864600, 915673, 975355, 1033068, 1092431, 1151702, 1216543, 1291020, 1383253, 1484767, 1598473, 1721764, 1857302, 2017887, 2198712, 2434892, 2722520, 3083847, 3534473, 4095636, 4768471, 5538469, 6371276, 7240916, 8191045, 9254494, 10434946, 11730751, 13201445, 14998392, 17406743, 20849675, 26063970, 34127873, 46338205, 63295377, 82994659, 100135316, 109905198, 113138725]
12665A13138725J678479K036613j653290r788456j6903794j8872993j6677449
12658E2957835j3125683r778045p079652n077653l661933k658740j940694j438339
12650H197096j091576q43947o77397n59732m90523m81597m93582m60934m04768
12641B693040l39124k82513k40543k04397j77821j44915j11949j07957j03709
12632I80112p7997p3965n7405n1004m7208l6774l6759m3512m0980k0743q915j1807
12620D73043k6746k7464j5850k1912j5955j3043j5436j6343j1626j7445k0199
12609B71024j8050j8032k1985m051j0605q749l019q597j6596j5172n616m17j0895
12596A29240n866m029j127K569n636m512J2152K26J854L065j23j505l78m869k597
$$ y = [113138725, 114817204, 116853817, 115200527, 105412071, 88508277, 69635284, 52957835, 39832152, 30054107, 22974455, 17896802, 14234869, 11576129, 9635435, 8197096, 7105520, 6261573, 5584176, 5024444, 4533921, 4052324, 3558742, 3097808, 2693040, 2353916, 2071403, 1830860, 1626463, 1448642, 1303727, 1191778, 1083821, 980112, 902115, 828150, 770745, 719741, 672533, 635759, 599000, 555488, 514508, 493765, 484850, 473043, 446297, 418833, 402983, 381071, 365116, 352073, 336637, 320294, 308668, 291223, 271024, 252974, 234942, 212957, 208906, 198301, 189552, 186533, 177936, 161340, 146168, 140552, 140135, 129240, 123374, 119345, 118218, 120787, 115151, 110639, 122791, 123017, 124871, 127936, 127813, 126308, 125930, 121061, 118464]
12581A18464K006j1020j9792j0015N923j995k447J2617J2043N692o84l358l730
12568A03704m252O329n151j3257o485J041k374j7365j6012j6758r59K555l493
12555B7523K625J21l955p01p48O318K971k120m343q47n805p223N892P970M427
12540C2105m268m738K044m361J145P210R144l551o545k30n351O580L33p242K058
12525B4333R76O224K264l726k027o89j1712o936M426K625Q794n24M487L385J2887
12510D4787Q993k350p03m995k594o641o158n088J867j0040m422L335l371M199
12496A6819K393l511o45J305J87j184KK024J905M176J2680N643N334L984O534
12481E7646P93j2944j9289L858M575K263o394j3190O394m478p186r323p855n342
$$ y = [118464, 120470, 109450, 89658, 79643, 85566, 83571, 81124, 93741, 105784, 111476, 110792, 107434, 103704, 99452, 105781, 100630, 87373, 80888, 81929, 79555, 62190, 46178, 29420, 28461, 31016, 27523, 30148, 30269, 26314, 25613, 24865, 31183, 34154, 32034, 27691, 26844, 21039, 13816, 19708, 27678, 32105, 27837, 23099, 25143, 20782, 21927, 29137, 38281, 34730, 28185, 27955, 22604, 29184, 29517, 22275, 24333, 25309, 31533, 33797, 30071, 28044, 27355, 15643, 8707, 13133, 15758, 24552, 24028, 28515, 31900, 44787, 53780, 51430, 50727, 45732, 43138, 36497, 30339, 25251, 27118, 17078, 12656, 15991, 12620, 16819, 19212, 15701, 15056, 16361, 16548, 15364, 15366, 17390, 19295, 23471, 36151, 41794, 47128, 51112, 57646, 58439, 45495, 26206, 30064, 34639, 36902, 30508, 17318, 23712, 19234, 12048, 2725, -5130, -10472]
12467a0472l276q392L852J4923J0664m54m05Q850J3394M621q338o040k06j0003
12453H718j087R16k129j568o050M283k882K505j3032m053O496O28O296M619K397
12438F057r382R258L830n344n635M59O271M740L304o708k348N095J627J857q67
12423A2214K122N777O751J085q749M476P019J0707l354p473j0704n52o265j32
12409A2922N601j420N109m224P216j850r018m129q161j425O474n470m836m209
12395g420J3934J2425R092R197k207q025O135N296P836j786j3644j4400k203q424
12381E806j235R686N966O74N352k529P140M697l623K476m567m615r717m779n708
12366E024p354j316K075n003j1978r725p115J1847J5537J6961O925R810O214r142
$$ y = [-10472, -13748, -22140, -18288, -3365, 7299, 6845, 6440, 15290, 28684, 33305, 24967, 18927, 18721, 8718, 7631, 8547, 6418, 4850, -1200, 3083, 201, 2706, -10326, -14379, -7883, -7255, -959, 3660, 6057, -3325, 5933, 9763, 4419, -1216, -757, 5514, 10254, 13558, 6850, 4502, 9597, 11224, 13081, 12214, 14336, 20113, 26864, 27949, 19200, 23676, 30695, 41402, 38048, 30575, 19871, 19319, 13054, 12922, 18523, 17103, 22212, 17988, 25204, 23354, 14336, 10207, 2046, 621, 7095, 1625, -3211, -7420, 6514, 18939, 28031, 37228, 35021, 26996, 33131, 38427, 46263, 44477, 30833, 16433, 14230, 5806, 4571, 14257, 20223, 20897, 26249, 23720, 30860, 35557, 31934, 34410, 29843, 25228, 15511, 10732, 5024, -2330, -3646, -1571, -6574, -18552, -28277, -35392, -23545, -8008, 8953, 15878, 25688, 31902, 22760]
12352B2760j7688r226k009K907L735r6q239q983Q688J6024L281m022j868m703
12338E61l380R01J2107m934j838K333J4368O474J4399J0037J722n555j4899p343
12324B4953k621M381q76j4300l030k948M240O691K285n552k046R096J509l687
12310A8095J122p354J068K852K303j801m354j887j393j0758J275m100J672J45
12296c115P552P220O501l756m962r17J2898P114j1181k806L228L815J2130R676
12282D3397K371l63q222n852J291R009Q595l178K547J7039J3379J8451J6048J8302
12268A32814K7038L3700L1466N3498P3373P9541R3698Q2995O5625M1958K8685
12257G44391J41k1499m6113m9259l0923p875N3025J22466K04975K31286J00878
$$ y = [22760, 5072, -4154, -6163, -3256, 479, 383, -7856, -16839, -8151, 7873, 11154, 7132, 5264, 561, -2819, -1918, 10189, 5255, 3417, 5750, 20118, 26592, 40991, 51028, 52750, 47195, 32296, 24953, 22332, 26713, 25837, 11537, 8507, 5559, 9799, 16490, 18775, 13223, 11177, 20273, 21782, 18095, 19217, 11863, 12931, 15783, 18086, 16285, 11931, 10044, 8651, -2107, -832, -4932, -3260, -3115, 4437, 11657, 18158, 14402, 9440, 8523, 21421, 28535, 17354, 14548, 17776, 21591, 33721, 43397, 45768, 45405, 37183, 31331, 32622, 41631, 50226, 47048, 49595, 66634, 80013, 98464, 114512, 132814, 159852, 193552, 225018, 278516, 351889, 431430, 525128, 608123, 673748, 715706, 744391, 744532, 723033, 676920, 627661, 596738, 588863, 641888, 764354, 969329, 1200615, 1301493]
12246A301493o5938r2827N302R2005J09056m1965k00095k19368j67476j06734
12236F13453m1521J529M1403O0788M3370J4139N197j0043j4501m5724p8739j08278
12224D81073j08090r7477o7323m2206l5566l2037k7201j2646K553R897j5991j4642
12212D0344P379K615l123j4726j0366r475L449Q759j0329l449J536O403j637m067
12198A3313O413O699o972l610p043p835J567M412K424j534j799M06l383l956J062
12183A64P903l331R88M823L909l297q493r970O153J0908L686k042J41q873q873
12168f204o714J0052P419p2l8J778m106r612r261k331R83O858Q47n071l85l396
12152a9253P723N135P713M006K80J951k127k802k010m182P418J0659N672q895
$$ y = [1301493, 1235555, 1142728, 1148030, 1240035, 1349091, 1307126, 1107031, 887663, 720187, 613453, 571932, 573461, 614864, 675652, 719022, 733161, 738358, 728315, 713814, 668090, 589351, 481073, 372983, 275506, 208183, 165977, 130411, 98374, 71173, 58527, 61080, 70977, 54986, 40344, 47723, 50338, 47215, 32489, 22123, 12648, 16097, 24856, 14527, 11078, 12614, 19017, 17380, 13313, 19726, 26425, 19453, 15843, 8800, 965, 2532, 6944, 9368, 7834, 6035, 6441, 3058, -898, 164, 8067, 4736, 5724, 10547, 14456, 11159, 2666, -7304, -1151, 9757, 13443, 11401, 11542, 2669, -6204, -12918, -2866, 4553, 4481, 4443, 6221, 2115, -7497, -16758, -19089, -18106, -11248, -10401, -15472, -15857, -19253, -11530, -6395, 1318, 5324, 5604, 7555, 5428, 2626, 616, -3566, 3852, 14511, 20183, 11288]
12138A1288n506o233J66k191J853k300n675q471M629R578Q756o534j164M880J586
12123D662l304p394N498k267L032L043k759j082p151j1367m701j385n105q729
12109c9009J502J1063J534J0148J1276o315J006R490K609j1401o775j060K110
12096a3822K434L752Q572m853O690k087M085Q04l096M673j468Q245M826j4546
12082D209n790J318P386L382R13j898R69l849p76j961m619o376n582m44Q103L361
12066a654l538j172p493M642J1389l930j884J226n9M274N19j184P26J170J351
12051D383m464l024r766L70M729M106L182j616L224P566M33l311k749M797K71
12036H131k425K371k747j0806m094m11O044N646L509j102n956k671M039N530R192
$$ y = [11288, 5782, -451, -285, -2476, -623, -2923, -8598, -17069, -12440, -2862, 5894, -640, -1804, 3076, 4662, 1358, -6036, -538, -2805, 227, 3270, 511, -571, -7722, -19089, -23790, -25175, -30280, -39009, -37507, -26444, -24910, -14762, -3486, -9801, -8795, 695, 3304, -8097, -14872, -15932, -13822, -11388, -7636, 936, -3917, 2773, 686, 4771, 5575, 2479, 7152, 5684, 13929, 18755, 4209, -1581, -263, 7123, 10505, 11418, 9520, 10489, 6640, 5864, 3903, -716, -7092, -12674, -13118, -5015, -1654, -5192, -6364, -13857, -9215, 2174, -1756, -3640, -2414, -2473, 1801, 2320, 1136, 1862, 3032, 4383, -81, -3105, -12871, -12501, -7772, -3666, -484, -2100, 1124, 8690, 9123, 5812, 3063, 7860, 8131, 5706, 8077, 5330, -5476, -9570, -9981, -3937, 1709, 5218, 4116, -1840, -4511, -472, 5058, 14250]
12021A4250L937M914j139l447q449j0503K678M052j285J602Q041N703j239L080
12007B2195M942j5407j2413j988P761L529K872K619n113k845J2346M14k023K06
11993A7095q873o654P52K722N23n815n441q420j636R532J0323Q549q259M334n426
11978C306l142K003p62K019P830p972j1172o659L396Q043J939J229j414n584j27
11963g067j569O753R234n351j710m300r371J449n62K384J971K207l967O567K880
11948d52J833o540n669J1268L503K61M166o920k554N460M923L980j860o393j072
11933C934l575K475p45m504K753N333K253l673n864n791J34J2322Q833k324q87
11918A0674j129q389l079N78p774l329k109o052L798P028K491J829P135o540o136
$$ y = [14250, 18187, 23101, 21962, 18515, 10066, -437, 2241, 6293, 5008, 6610, 14651, 20354, 19115, 22195, 27137, 11730, -683, -2671, 5090, 8619, 11491, 14110, 8997, 6152, 18498, 18912, 16889, 17095, 8222, 1568, 2320, 5042, 5565, -250, -5691, -14111, -15747, -6215, 4108, 12657, 4398, 8732, 3306, 164, 2167, 1405, 3424, 11254, 3282, -7890, -14549, -11153, -3110, -1171, 58, -1356, -6940, -7067, -8636, -1883, 7351, 2000, 290, -4010, -13381, -11932, -12494, -10110, -8139, -5932, -9899, -3332, -452, 1381, -5159, -10828, 440, 3943, 4204, 8370, 1450, -1104, 4356, 9279, 13259, 11399, 5006, 3934, 359, 2834, 2089, -2415, 338, 5671, 7924, 4251, -1613, -7404, -7270, 5052, 13885, 11561, 10674, 9545, 1156, -1923, -1345, -9119, -12448, -14557, -20609, -16811, -9783, -7292, -5463, 1672, -4868, -11004]
11903a1004j011N45P020M60n931n035L228K141l215q980L443P670k520k1J168
11888a2042N37k652R176O702l013J365K730J0232R860p462m081l725j4631n16
11874g520J0391L759P024O55O700N81m059r221q310l516q49O55J0794J942n162
11859C864J056J055m303m707O613M344o873l571p17m633Q257K245O3J843j0509
11844e973r424K50J6271P233o822j403j531J987Q38N986q03p683r026k553k761
11829a5414q743P224K210K902J0884K0613Q228p411L706O925N122o41k331j0666
11815B2608L922J9165R517j704Q751J9424L7793N5141L3098k5794m2653l0495
11803A08773m1140j9870p403j2261j3867r826M377K725k602j642o89J0603J347
$$ y = [-11004, -12015, -11470, -4450, -3990, -9921, -14956, -11728, -9587, -12802, -21782, -18339, -10669, -13189, -13210, -12042, -11505, -14157, -4981, 1721, -1292, 73, 2803, 13035, 22895, 15433, 11352, 7627, -7004, -7520, 2871, 6630, 13654, 14309, 21009, 21590, 17531, 8310, 0, -3516, -4365, -3710, 7084, 9026, 3864, 4920, 5975, 1672, -3035, 3578, 7922, 1049, -2522, -3239, -7872, 385, 2630, 2693, 4536, -5973, -15397, -15147, 1124, 8357, 1535, 132, -1399, 588, 1426, 7412, 6609, -1074, -10100, -12653, -15414, -24157, -16933, -14723, -11821, -937, 19676, 27904, 20493, 24199, 31124, 36246, 35605, 33274, 22608, 26530, 45695, 55212, 53508, 62259, 81683, 119476, 174617, 207715, 181921, 139268, 108773, 67633, 47763, 40360, 28099, 14232, 4406, 8783, 11508, 8906, 7264, 6575, 17178, 18525]
11790A8525p187j0998O349L426K070q671n805K422n794O983N562K531j904k19
11776G290J810K820l151j610j0846j165j598P137Q594L658K343K711j174p52R86
11761A7053p181p693l147N457Q464L775k333L751N011K165m13l233p528l887k045
11746H216j521q230O74Q746M03P11Q071P906Q70m913n029J838j134j630o109r205
11730c36j502N287N416q497k079J634O930N668R841R793J0407K956j981R010K999
11715E5546K145l492m578o786r596j6956k520O579O75m7L117K910K43l459p845
11700A5936o026m521K740K284p266p28J829q640O714P820O519l044q015M155J0974
11685B0731K891K504k768j0959j3586K866l705P364L513o855r242j554M574j131
$$ y = [18525, 11338, 340, 6689, 10115, 12185, 3514, -2291, 131, -5663, 1320, 6882, 9413, 7509, 7290, 9100, 11920, 8769, 7159, -3687, -4852, -6450, 687, 9281, 12939, 15282, 17993, 16819, 16067, 17053, 9872, 2179, -968, 4489, 12953, 16728, 14395, 18146, 23157, 25322, 24909, 21676, 14148, 10261, 8216, 6695, -1535, -861, 7885, 8288, 8999, 17070, 24976, 25846, 20933, 15904, 17742, 16608, 14978, 8869, -336, -1838, 3449, 8865, 368, -1711, -77, 6853, 12521, 22362, 32155, 42562, 45518, 43537, 52547, 55546, 57691, 54199, 49621, 42835, 33239, 16283, 13763, 20342, 21017, 20970, 24087, 26997, 27240, 23781, 15936, 9910, 5389, 8129, 10413, 3147, 2419, 4248, -4392, 2322, 10142, 16661, 13617, 5602, 9757, 20731, 23622, 26126, 23358, 12399, -1187, 1679, -2026, 5338, 8851, 1996, -7246, -8800, -4226, -5357]
11671e357J064J517K714K452K424o632l571P912O090j1017j2581M346P343J7509
11657A4213k315o966O729J557M945o221r004K532J189O131P857k842l777k38j0693
11642C097O98N899n047m877l039R031L166K812k661k159n285n272j002P381P925
11627A0667j0104r833L931P400N800o671q76o898M448L578n113Q992J0552p772
11613H101k068K547q273r02N652n801j0756k515M051K498O914P905Q229l445J097
11598A3234l043r501p707J760m444J751J847k593J2242Q57k636j017K664L737
11584G151M180P37L646J096q086L733O138J790m565o969o730m052J668K90k40
11569b13J874K901r20J767o113o341P423K329n19m364K649O463r28N409l474k749
$$ y = [-5357, -4293, -2776, -62, 2390, 4814, -1818, -5389, 2523, 8613, -2404, -14985, -10639, -3296, 14213, 11898, 4932, 11661, 13218, 18163, 11942, 2938, 5470, 6659, 12790, 20647, 17805, 14028, 13790, 3097, 3795, 9694, 4647, -230, -3269, 5762, 8928, 11740, 9079, 6920, 1635, -3637, -4639, 2742, 10667, 563, -9270, -5339, 2061, 7861, 1190, 314, -6584, -2136, 1442, -3671, 5321, 15873, 8101, 6033, 8580, 307, -595, 5057, -744, -11500, -14015, -9964, -7466, -552, 7353, 15582, 12137, 13234, 10191, 690, -7017, -5257, -9701, -7950, -6103, -8696, 3546, 4403, 1767, 750, 3414, 7151, 11331, 12068, 15714, 16810, 8724, 12457, 18595, 20385, 15820, 8851, 2121, -1931, -263, 27, -213, 1661, 4562, 3642, 5409, -704, -7045, 378, 2707, 2188, -2176, 473, 6936, 6008, 11417, 7943, 5194]
11553E194m83j194L122K068K674l858o027N206m323M433M557l621M345j102j312
11538I679j639p002m568k202O659Q744J680p23p843M128P211o769P565J2303l014
11523B4209j5969j1881Q917R165O083k813r899k459L015K118M295N13l539L897
11509A5652K48J201o375n986l010M306J6168j549p85r935k288R361Q809k594o127
11494A7096m095r118L139j662M58K856O850N589j499r393J818k139M918J2531
11480B7349J308n824q370m038K729J039k587J832N31K436M583m109p858o133k967
11465g9r460P031k948J834K174k303m108j0168j217R488N721R64P827l353n411
11450d008J348P779M409l13l820j0593J260M060l636L573M372m973q95L600M922
$$ y = [5194, 4711, 3517, 6639, 8707, 11381, 7523, 1496, 6702, 2379, 6812, 11369, 7748, 12093, 10991, 9679, 8040, 1038, -3530, -5732, 927, 9671, 11351, 10628, 2785, 6913, 14124, 7355, 14920, 27223, 24209, 8240, -3641, 5276, 14441, 20524, 17711, 7812, 5353, 8368, 10486, 14781, 15294, 11755, 15652, 15900, 17101, 10726, 4740, 1730, 6036, 22204, 20655, 19870, 9935, 7647, 17008, 25817, 23223, 17096, 13001, 3883, 7022, 5360, 5818, 8674, 15524, 21113, 19614, 10221, 12039, 9900, 14818, 27349, 28657, 22833, 14463, 10425, 13154, 14193, 11606, 13438, 13969, 16405, 20988, 16879, 9021, 2888, -79, -9539, -2508, -5456, -3622, -1448, -3751, -7859, -18027, -19244, -9756, -4035, -3071, 4756, 1403, -4008, -2660, 5119, 9528, 9215, 5395, -5198, -3938, 122, -3514, 59, 4431, -542, -1437, 2163, 7085]
11435G085L641J207j2424j5547J6369J1365j185q210o829O063J687J019l840j683
11421a282O512R724O567N788k325k658o052l487k848n217j3j794J945Q633l203
11406A0290O915n625j652q21K107k91P32k52L536K57l821k545Q18p789o809Q965
11390D015K969k326j63o991K443J812L447k57M037J726M24n88K781Q954O104j440
11374B6947n137o208O768N26j0557j1962O873J048J0463Q06L30K920k997m8O591
11359B6363L57P06J540k298n416L610j92k943n392M600l71p435M090J857o09n878
11343A2589m976O73O816%q004p475L45L398J687Q125J4843Q288r22p314o687Q50
11327B2236n128o219J490l050o841r265P515R325P415j108N570J3474n788r618
$$ y = [7085, 10726, 11933, -491, -16038, 331, 11696, 10511, 2301, -4528, 1535, 3222, 4241, 401, -1282, 5230, 14954, 21521, 27309, 24984, 22326, 16274, 12787, 9939, 4722, 4709, 2915, 4860, 13493, 10290, 17205, 11580, 9928, 9107, 11214, 10923, 11655, 11403, 14939, 15196, 11375, 8830, 9648, 1859, -4950, 4015, 6984, 4658, 4495, -2496, -53, 1759, 5206, 4949, 8986, 10712, 11136, 10548, 13329, 22283, 28387, 26947, 21810, 15602, 22370, 22896, 12339, 377, 7250, 8298, 18761, 19567, 19897, 22817, 19820, 19772, 26363, 26720, 27426, 28966, 26668, 21252, 24862, 24670, 21727, 16335, 20935, 20564, 13129, 17219, 19076, 18467, 12589, 7613, 8286, 15102, 15102, 7098, -377, -32, 3366, 5053, 13178, 28021, 36309, 35387, 28073, 21386, 22236, 17108, 10889, 12379, 9329, 2488, -6777, 738, 10063, 17478, 16370, 21940, 35414, 29626, 20008]
11313B0008q31J370k069J88Q070l447J07O184m053m059m190J0632M671N679r245
11298B9015k229k831L913L154j1254q008M029N850N586L108K563q736L777k089
11284B5848M163J425l013J2720P800o249j619k377r451J4087O438p92L813K613
11270E5406j36j1759m007L478P130k656p465o216K897k741L479p353j502j5778
11256A2777j3599N203K054M501l23n515Q639R212l931r289N077j725K090J906
11242A7077J786M037O068P75l733j2262p037P808L722r215m710J0574P891K390
11228B5171k383q361m119Q113N818M064Q007J665p159p056j144J555K38N335k323
11213B7421m265O37l447O676J637r02Q537K285p046K510J006m528r211r600m917
$$ y = [20008, 19177, 20547, 18478, 18666, 26736, 23289, 23396, 29580, 25527, 21468, 17278, 27910, 32581, 38260, 29015, 26786, 23955, 27868, 31022, 19768, 11760, 15789, 21639, 27225, 30333, 32896, 24160, 27937, 25848, 30011, 31436, 28423, 41143, 48943, 42694, 41075, 38698, 29247, 43334, 49772, 48980, 52793, 55406, 55270, 43511, 39504, 42982, 50112, 47456, 39991, 33775, 36672, 33931, 37410, 30057, 28555, 12777, -822, 4381, 6435, 10936, 10613, 5098, 13737, 22949, 19018, 9729, 14806, 13081, 15171, 17077, 18863, 22900, 28968, 29743, 26010, 13748, 6711, 14519, 18241, 9026, 4316, 14890, 22781, 25171, 22788, 14427, 10308, 18421, 24239, 28303, 36310, 37975, 30816, 23760, 22616, 24171, 24409, 29744, 27421, 23156, 23793, 20346, 27022, 28659, 27757, 36294, 38579, 31533, 34043, 35049, 30521, 21310, 11710, 6793]
11198F793J0535l672J438R154K642N024k890j0185k454N909L828j898k955o333
11184A4936p532L827O767L76m053M68N923L990J314k370l097q902P724K2060K358
11169D3789j7074j821M596k823M758j75k561M62j0014J944p14k69O591K58J4509
11154D1456J6048k870m417m324q197M487j757l567r328k474N86j802l132K801
11140B3510J6567l671j305m03L381J105n653p562r114j0226l609Q236O798L513
11126B1567P806R943N279N547o839j983J550q223M287M52j251n821r316o016K662
11111A9644L206n53k69J564l609M745L593J279m04m843L25M729J2093L530p698
11096C7332q272p089R0L404J2809J1504j917k819R091M834r701j6831j1674M234
$$ y = [6793, 17328, 13656, 15094, 24248, 26890, 31914, 29024, 18839, 16385, 22294, 26122, 24224, 21269, 14936, 7404, 11231, 17998, 18374, 14321, 14789, 20712, 24702, 26016, 23646, 20549, 11647, 19371, 41431, 43789, 26715, 24894, 29490, 26667, 31425, 31250, 28689, 29151, 19137, 21081, 20367, 20098, 26689, 26947, 41456, 57504, 54634, 50217, 45893, 37696, 42183, 40426, 36859, 27531, 25057, 25643, 23841, 20709, 23510, 40077, 36406, 35101, 34698, 38079, 39184, 33531, 25969, 16855, 6629, 3020, 11256, 18054, 21567, 29373, 39316, 44595, 50142, 43303, 41320, 42870, 34647, 38934, 39386, 38135, 32314, 22998, 16982, 19644, 22850, 22297, 22028, 23592, 19983, 24728, 28321, 29600, 29196, 24353, 24678, 29407, 41500, 45030, 37332, 29060, 21971, 22061, 25465, 38274, 49778, 47861, 45042, 54133, 58967, 49266, 32435, 20761, 24995]
11082B4995M069J19L984L495j1660j0019l709P687K13K66k755L811P191j731l401
11067B2555M94n467j1812R419N474O244K388k680P42m954L045N180J0037l265
11053C7400n965j101K386m533J153J1424J4294R596M580J925j931O526L319J0473
11039H9546J7606L0482K0633J9210m164j3059k3825j2894j1818k1428j2418j9395
11027E8476j2271M016K186o681L805M417P119m824o114q840M479J0009o123N761
11013E5415O561R244Q620J9126R076K4422K2766J8085L481p601k1773j9797j8083
11000A09542j7814q184m639j1619q770p129l17q123n856l359q267j1363J0567
10987B4669J2789J2745N444j0899j330p93o959m070M052L214Q936M972k888L108
$$ y = [24995, 29064, 29183, 33167, 36662, 25002, 14983, 11274, 18961, 19174, 19440, 16685, 20496, 27687, 25956, 22555, 23049, 17582, 5770, 15189, 20663, 26907, 29295, 26615, 27357, 22403, 25448, 30628, 40665, 37400, 31435, 30334, 32720, 28187, 29340, 40764, 55058, 64654, 69234, 71159, 69228, 75754, 79073, 89546, 107152, 137634, 158267, 177477, 173313, 160254, 136429, 123535, 111717, 90289, 77871, 58476, 46205, 50221, 52407, 45726, 49531, 53948, 61067, 56243, 50129, 41289, 45768, 55777, 49654, 55415, 61976, 71220, 79840, 98966, 108042, 132464, 155230, 173315, 176796, 169195, 147422, 127625, 109542, 91728, 83544, 78905, 67286, 58516, 51387, 51070, 42947, 37091, 33732, 25465, 14102, 24669, 37458, 50203, 55647, 44748, 43418, 42625, 35666, 31596, 35648, 38862, 47798, 52770, 49882, 52990]
10973E2990n148p758N264N686J014L603K789n608l490o090o834o260R101j979
10959C7280O4N881M599r559M087L566L703j0477k685p074J877J4810L167l198
10945D6041J118M868j613o363p40K616K711N025L19L588N007R081o162j2810J168
10930E3854J0577J1688J688O757J2916R622Q733o47L189o66k040P298J1327J3245
10916A47541J2994J6166L1882M6921M9396R4976J69948K53841L35987K92140M1130
10905A492922k22428k81470k41249j84593j32575j12714p0655m7145l6929k8962
10895A34202k1827q265j1473k648N137J1998n763k444L139l94j4610j2029m474
10882G0549m067o129p59k039n407N243L177P938l51j4590K363N243o326M208m350
$$ y = [52990, 47842, 40084, 45348, 51034, 52048, 55651, 58440, 52832, 49342, 43252, 36418, 30158, 39259, 37280, 37344, 43225, 47824, 38265, 42352, 45918, 49621, 39144, 36459, 29385, 31262, 46072, 49239, 46041, 47159, 52027, 50414, 44051, 43311, 45927, 48638, 53663, 53982, 57570, 62577, 71658, 65496, 52686, 53854, 64431, 76119, 77807, 84564, 97480, 107102, 115835, 115188, 118377, 117711, 115671, 122969, 134296, 147541, 160535, 176701, 208583, 255504, 304900, 399876, 569824, 823665, 1159652, 1451792, 1492922, 1270494, 989024, 747775, 563182, 430607, 317893, 247238, 200093, 163164, 134202, 112375, 104110, 92637, 89989, 95126, 107124, 101361, 98917, 102056, 101662, 87052, 75023, 70549, 66482, 60353, 59594, 57555, 52148, 57391, 60568, 68506, 68155, 53565, 55928, 61171, 54845, 59053, 54703]
10867E4703k984N764J24q197M823P7p238k055Q776M424j407R471N341j0055j1092
10852E0475K39m89K650L591J321L658n032k273p80n800L519O136K70J5191K13
10837G2889l195n377K606L349l245m200k555J391j889k617Q192L038k500K770
10823F8657K208L449j469L11l895j035L163k937j0903J375J056Q521L035j397
10809G0139J0715o281k880N953j2357r985j037J026P533J6744L523J861m926m363
10795G5665N712K288N486J1478Q992P547O44j5901j9145j7213J699R131n000l670
10781F7713J807l353j1347k46Q560J1300p3p105j3799j3133J0331M026l655j1225
10767C9801K607J9180K6010K0172k957j3615j7524j8185j0918P433J0991N060
$$ y = [54703, 51719, 57483, 57607, 49410, 54233, 54310, 47072, 45017, 53793, 58217, 56810, 66281, 71622, 61567, 50475, 50714, 50225, 52875, 56466, 57787, 61445, 56413, 54140, 53360, 47560, 51079, 57215, 57485, 72676, 72889, 69694, 64317, 66923, 70272, 67027, 62827, 60272, 61663, 59774, 57157, 65349, 68387, 65887, 68657, 70865, 74314, 72845, 73156, 69261, 68226, 71389, 68452, 57549, 58924, 59980, 68501, 71536, 70139, 80854, 74573, 71693, 77646, 65289, 55304, 54267, 55293, 62826, 79570, 83093, 84954, 80028, 75665, 81377, 83665, 89151, 100629, 109621, 117168, 117812, 101911, 82766, 65553, 67252, 76383, 71383, 67713, 69520, 66167, 54820, 54574, 63134, 74434, 74361, 67256, 53457, 40324, 50655, 54681, 51026, 39801, 42408, 61588, 87598, 107770, 104813, 91198, 73674, 55489, 44571, 52004, 62995, 68055]
10755F8055N44n397O296L965N390J770K299R115K865m372J6485L1726K6695L0287
10741A95723L5762K1189l213k4722k8420l4655k9482j1738N030N404N434q285
10729A28027j0150k2636J2762j0027o459K031q069P883J5131j1151j0399P282
10717I4225k843q489q213L151n36o99K544L091J1181K69m406J8260J5362m426
10703A18471k306J430o845j4383j2356p421P994J1987J0485n303k69k946N574
10690A04112P756o454j3148P073K0023J4166N463m070J537J234o88j5617r819
10677A11568j8261k2418q396j2395j5258M706K878J4125J4018O112J491R476J0230
10664I7876K70Q73O990J3131M902O247K943m100K004M821M195N640p642M393J3557
$$ y = [68055, 68599, 63202, 69498, 73463, 78853, 80623, 82922, 92037, 94902, 90530, 107015, 138741, 165436, 195723, 231485, 252674, 249461, 224739, 196319, 161664, 132182, 120444, 125474, 130878, 136312, 128027, 117877, 95241, 108003, 97976, 91517, 93548, 85479, 93362, 108493, 97342, 86943, 94225, 91382, 82893, 74680, 77831, 77295, 76596, 79140, 82231, 93412, 93681, 89275, 107535, 122897, 118471, 116165, 117595, 110750, 96367, 84011, 76590, 84584, 96571, 107056, 101753, 101484, 98538, 104112, 111868, 105414, 92266, 99339, 119362, 133528, 138991, 134921, 136458, 137692, 137004, 121387, 111568, 93307, 70889, 62493, 50098, 34840, 39546, 42424, 56549, 70567, 76679, 78170, 87646, 97876, 98146, 99019, 106009, 119140, 124042, 130289, 133232, 129132, 131136, 135957, 140152, 145792, 138150, 142543, 156100]
10649A56100K012k082m884j0720q111l726J0077J3252O27j1119l793O680J6720
10636A61033J5594K1069J5466M029N813M083O898Q179l77J7523K0071J5239J7772
10623C12392K7321M2698O5927R9737J81792K58364L08289K59437J01180p8749
10613A578388k30275k62308j97155j48711j16174r2248p2286n9815m6947k7492
10603C24977j1978j2217l464p150m007P466O460N74j465N196k127j2008j8051
10590B72206k5283r468j21J709p108k434K509Q11L307J9034J9345K5188J3173
10577C12868J1846J5988N50p581l864O41J459r549m585o049L456J9566R567J7229
10563C61542K4241K3051J4550J2923J3290J8969J7723J0578K137j222M427J9300
$$ y = [156100, 158112, 156030, 151146, 140426, 132315, 128589, 138666, 151918, 152545, 141426, 137633, 144313, 161033, 176627, 197696, 213162, 217191, 223004, 227087, 233985, 242164, 241787, 259310, 279381, 294620, 312392, 339713, 382411, 448338, 548075, 729867, 988231, 1296520, 1555957, 1657137, 1578388, 1348113, 1085805, 888650, 739939, 623765, 531517, 459231, 399416, 352469, 324977, 312999, 300782, 297318, 290168, 286161, 293627, 300087, 300661, 299196, 304392, 302265, 290257, 272206, 246923, 237455, 237334, 239043, 231935, 229501, 232010, 232821, 236128, 255162, 274507, 299695, 312868, 324714, 340702, 341252, 333671, 329807, 330448, 331907, 322358, 317773, 311724, 315180, 334746, 344313, 361542, 385783, 408834, 423384, 436307, 449597, 468566, 486289, 496867, 499004, 497782, 502209, 521509]
10551E21509K4909K5805J7637J4429J0516R203P768K0746K7230K1230P441J488
10539G09911M246K2777J7454J5636K5959L3359L4202M1197M7300N8831N7339O2454
10527A130665O3171O4260R0210R8699R4372R0844P9762Q1757J03475J27305J46554
10516B171074J44682J64407J96764K41872K63401K77453L09773M16656O09509
10507D795591Q05780J015469J127092J044748R09102R89463J237565J549326J797113
10498A5271249J950838K108599K443090L094044M251798O240349R647991J5433469
10490F0441427K4964398L9855666N8389277O3876160L0606705k5066090n2643312
10483B00424231m9314612l8778130k9265572k1215821j5244356j1109678q120586
$$ y = [521509, 546418, 572223, 589860, 604289, 614805, 624008, 631776, 652522, 679752, 700982, 708423, 709911, 714157, 736934, 754388, 770024, 795983, 829342, 863544, 904741, 952041, 1010872, 1068211, 1130665, 1193836, 1258096, 1348306, 1447005, 1541377, 1632221, 1711983, 1793740, 1897215, 2024520, 2171074, 2315756, 2480163, 2676927, 2918799, 3182200, 3459653, 3769426, 4186082, 4795591, 5601371, 6616840, 7743932, 8788680, 9697782, 10687245, 11924810, 13474136, 15271249, 17222087, 19330686, 21773776, 24867820, 29119618, 35359967, 45007958, 60441427, 85405825, 125261491, 183650768, 247526928, 278133633, 253067543, 200424231, 151109619, 112331489, 83065917, 61850096, 46605740, 35496062, 27375476]
10476B7375476n885907m190413k928504j931298j125778m41906n11j58397p53702
10467I959060j123590j227494j118356r10415p43094o55463n65972m34271l34599
10458B845806k86603k58232k30735j87434j42776j14725j09251j13737j08748
10449A293565q5742o6280o0826m0574m2103m9214m1503k8534k9138k8916k2986
10438G97749l4138l6412l2234k8130j8085k4493m0942m6276m4692k8111j6934
10427D47302L292N60o338k3625k6074j9759k2643p848j911j0354P7j2498j3254
10414C06927j327o722N923J1063R452J2606J9238p38r135J0144L022r747k0755
10401C29951k3118j7306k7285j8138j7026j4028l942o527l601Q70N753J8913P718
$$ y = [27375476, 21489569, 17299156, 14370652, 12439354, 11313576, 10871670, 10871159, 10712762, 9959060, 8835470, 7607976, 6489620, 5579205, 4836111, 4180648, 3614676, 3180405, 2845806, 2559203, 2300971, 2070236, 1882802, 1740026, 1625301, 1516050, 1402313, 1293565, 1207823, 1141543, 1080717, 1040143, 998040, 948826, 907323, 878789, 849651, 820735, 797749, 763611, 727199, 694965, 666835, 648750, 624257, 583315, 537039, 492347, 464236, 447302, 450594, 451154, 444816, 421191, 395117, 375358, 352715, 344867, 342956, 332602, 332679, 320181, 306927, 305600, 298878, 304801, 315864, 325316, 337922, 357160, 356422, 347287, 357431, 360453, 350706, 329951, 306833, 289527, 262242, 244104, 227078, 213050, 209108, 202581, 198980, 199850, 205603, 224516, 232234]
10388B32234P068n300j582N89p654j5138l701l869j5480k0080j2944r530o858
10375A37755q430J470N482K54j230o73Q104k204j5984j6990n215m073n072J1834
10361A05028K4406M5377N0175K2192m894r257j0936q866Lj0575q644l726P757
10348A98040j97Q733J1937J022p6K958m544P473P457M431J250O289J6806K2416
10334B83995L3350J0609p18k543j0223j8854m647O161o739j6127j5549K968J6559
10321B78242J2494J8991l962j8276n769q276j0833k561j0101k1341q061k142Q492
10308B26897J0798J2261J1002K4316K1036J0509J914J4800J9512Q148j0148j6920
10296C34125n778r404k3167j6700j3739j916k517j0299M736J9373K8308L5597
$$ y = [232234, 239302, 234002, 232420, 233009, 225355, 210217, 206516, 202647, 187167, 167087, 154143, 144613, 137755, 129325, 130795, 136277, 136531, 135301, 134628, 142732, 140528, 124544, 107554, 102339, 98266, 93194, 105028, 129434, 174811, 224986, 247178, 242284, 233027, 222091, 213225, 213228, 202653, 194009, 190283, 198040, 197843, 206576, 218513, 219535, 219459, 222417, 217873, 225346, 232803, 237234, 238484, 244773, 261579, 283995, 317345, 327954, 327236, 324693, 314470, 295616, 290969, 297130, 290391, 274264, 258715, 261683, 278242, 290736, 309727, 305765, 287489, 281720, 273444, 262611, 260050, 249949, 228608, 220547, 218405, 226897, 237695, 249956, 260958, 285274, 306310, 316819, 318733, 333533, 353045, 361193, 351045, 334125, 328347, 318943, 295776, 279076, 265337, 263421, 260904, 250605, 255341, 274714, 303022, 338619]
10284C38619K1371J2524R103J7095K1640J1056K1628J1666J0936J9728K6552J2293
10272E34211k706n954J150J8198K2252K7240K8390J4409r65k257N921K1270L8618
10259F99777L4453L1999K4804K9127M8943P1407O1711O4356O5044P8885Q7684
10248A298190J15536J22512J16431J16136J29622J36411J52972J67126K06408
10239B561344K74456L50143M80182O83264R40809R49176O73027R11081J337366
10230I160848J233644P26793N42616M15603L94440O12091R73499J449312J941640
10221A7450486K376761K605461K753086L224906M358848O831980J1495975J9411183
10213G0508686L2056109M7946290N4739556L8883632J0449557j9823529m4097939
$$ y = [338619, 359990, 372514, 381617, 398712, 420352, 431408, 453036, 464702, 475638, 495366, 521918, 534211, 531505, 525551, 526701, 544899, 567151, 594391, 622781, 637190, 636225, 633968, 639889, 661159, 699777, 734230, 766229, 791033, 820160, 869103, 940510, 1002221, 1066577, 1131621, 1210506, 1298190, 1413726, 1536238, 1652669, 1768805, 1898427, 2034838, 2187810, 2354936, 2561344, 2835800, 3185943, 3666125, 4349389, 5290198, 6239374, 6912401, 7823482, 9160848, 10394492, 11121285, 11663901, 12079504, 12473944, 13086035, 14059534, 15508846, 17450486, 19827247, 22432708, 25185794, 28410700, 32769548, 39601528, 51097503, 70508686, 102564795, 150511085, 205250641, 244134273, 254583830, 234760301, 190662362]
10206A90662362m7203904l7635559k7865285k0089529j4166770j0022352p255302
10199B6423661n382910m075753l151295k398967j778985j336847j045874q20622
10191F432408o00355l80288j96144j60421k47544l86919n42551n52148m58401
10182B907637l64524k96327k35892j95824j62571j44479j32818j21549r9192q4790
10172A069671o1379n2129m1483l4973l6652m0031m7080l0872j6866j8459k2892
10161F66855l1306l6184k3335j4602k5225l0000m5839l7134l4761j5511j6604
10150C56354m448o631r783j9884j8207q426m099o829p823j7425j4257k1193j3931
10137B03418L153J5665p24N767J0332r38P298L298r654j1531r738o933j0447j3881
$$ y = [190662362, 143458458, 105822899, 77957614, 57868085, 43701315, 33678963, 26423661, 21040751, 16964998, 13813703, 11414736, 9635751, 8298904, 7253030, 6432408, 5832053, 5451765, 5255621, 5095200, 4847656, 4460737, 3918186, 3366038, 2907637, 2543113, 2246786, 2010894, 1815070, 1652499, 1508020, 1375202, 1253653, 1154461, 1069671, 1008292, 956163, 914680, 879707, 843055, 803024, 755944, 725072, 708206, 689747, 666855, 635549, 599365, 576030, 561428, 536203, 506203, 460364, 423230, 388469, 372958, 356354, 351906, 345275, 335492, 315608, 297401, 288975, 284876, 278047, 270224, 252799, 238542, 217349, 203418, 206571, 222236, 221512, 227279, 237611, 236673, 243971, 247269, 237615, 226084, 216346, 209413, 198966, 185085]
10123A85085o2l703j1853j5314k374p33o819J0541J7365J1794R072M379r838p661
10109A79879O25N690l499J033l583k0400j5878j6846k400O970K3068M1115M1397
10096B37171K5379m803j7806l4694m3090k8208k6083k5889k8782l303R357R834
10084F9083Q408K3755J6361L264j070m337Q583R758J376J2741J1988J2205L057
10071A75172k021J606J4443J7376K5213L7924N3386Q4721J38429K13656L13200
10060A073105L30717J24746j60230k81785k47129k00986j41875j01792q5150n5299
10050B54322m6638l1652k7711j2186o777j1486q894o666j3019j3526p892r800
10038E8075m859j230L06O683M249Q911L274K472N489P089M076P179P869P049k4
$$ y = [185085, 185023, 181320, 169467, 154153, 151779, 151046, 144227, 154768, 172133, 183927, 192999, 197378, 187540, 179879, 180504, 186194, 182695, 183728, 180145, 159745, 143867, 127021, 124621, 131591, 154659, 195774, 237171, 262550, 257747, 239941, 205247, 162157, 133949, 107866, 81977, 53195, 49892, 59249, 69083, 77491, 101246, 117607, 120871, 119801, 115464, 124047, 133805, 135181, 147922, 159910, 172115, 175172, 173151, 174757, 189200, 206576, 231789, 269713, 323099, 407820, 546249, 759905, 1073105, 1403822, 1528568, 1368338, 1086553, 839424, 638438, 496563, 394771, 309621, 254322, 207684, 176032, 148321, 136135, 129358, 117872, 108978, 102312, 89293, 75767, 67875, 58075, 53216, 51986, 52292, 58975, 63224, 72135, 75409, 77881, 83370, 90459, 94535, 101714, 109583, 116632, 116608]
10023A16608R29k425j5096j9648j6378r850j2178j0364j4657j551Q857r208o931
10010H108L412J4321K841k383k153n799m088J0854L396L323J0822M53M34p759
9996C5782l582m755n252l696j2394n76Q654J222n006O65O938M512R324O463J671
9981C9970r175L768j191j2574j0457j741p83Q750L855p967n469Q973R40P503j784
9966B2618K98M158K588k861j297J183L065Q772J2823q179j5389l248p19J0661
9952C4473N457j918m271N47J454o854M631k003j917m127r866p652o711P935j561
9937G617L004J2843J6381Q383N097l196q25j8680k7135j0135J3202M930J0220
9924B1706J1295m612r045j1468K974m38K888k049M74l20n330J148J608K515n062
$$ y = [116608, 117537, 115112, 100016, 80368, 63990, 54140, 41962, 31598, 16941, 15390, 24247, 15039, 8108, 11520, 25841, 28682, 26299, 24146, 18347, 14259, 25113, 28509, 31832, 42654, 43107, 43541, 35782, 32200, 27445, 22193, 18497, 6103, 5527, 14181, 15403, 10397, 11062, 18000, 22512, 31836, 38299, 39970, 30795, 34563, 33372, 20798, 10341, 8600, 7817, 16567, 20422, 12455, 6986, 15959, 16899, 24402, 22618, 22916, 27074, 29662, 26801, 25504, 26687, 29752, 38524, 51347, 43168, 27779, 24531, 23812, 34473, 39930, 38012, 33741, 34288, 35742, 28888, 33519, 31516, 29599, 25472, 15606, 7954, 1243, 9178, 7617, 10621, 23464, 39845, 48228, 53325, 50129, 49304, 30624, 3489, -6646, 6556, 11486, 21706, 33001, 28389, 19344, 7876, 10850, 10412, 13300, 11251, 11725, 11405, 6075, 7223, 8831, 11346, 6284]
9909F284j4491n243m923q659m671o708k999P457P020J3078O581J0361k404j3477
9895a2794n364M610J222J894J447O276M806j001q245K267J2514O793J2211O404
9881C3040p877j8583p157l505l677j199L882Q606J937P426J684p07k098J224k156
9866A0840n594M943l437n03Q974p43q191l684r237n113L780O805J2620p624j4
9851C822R816l343m721N542j1937j1759M766R610K364l233N743J0836l550l404
9837A0552J378n7O597J3101q97n909L013O543j2433n492k490P698J1039L03J722
9822C4668N217J0J2359J2773M799P596J825n946p921r93k023J4660K0512J9141
9808A16677J4876L48K4002M3106N6889R1274J44831K27912K91142K69171J34561
$$ y = [6284, -8207, -13450, -18373, -27032, -31703, -38411, -41410, -33953, -26933, -13855, -7274, 3087, 683, -12794, -18158, -13548, -12326, -10432, -8985, -2709, 2097, 1096, -7149, -4882, 7632, 14425, 26636, 33040, 25163, 6580, -577, -4082, -7759, -8958, -5076, 3530, 5467, 12893, 14577, 13870, 11772, 12996, 10840, 5246, 10189, 6752, 6249, 15223, 14480, 6289, 2605, -6632, -11745, -7965, -1160, 11460, 3836, 3822, 13638, 10295, 5574, 11116, -821, -12580, -7814, 1796, 4160, 927, 6670, 17506, 13956, 10552, 11930, 11873, 18470, 31571, 30674, 24765, 27778, 34321, 21888, 16396, 13906, 21604, 32643, 32946, 34668, 39885, 39895, 52254, 65027, 69826, 77422, 79247, 73301, 65380, 64387, 62364, 77024, 97536, 116677, 131553, 131901, 155903, 199009, 255898, 347172, 492003, 719915, 1011057, 1280228, 1414789]
9797A414789m0504j99462k78281k39584j69047j16636r5096o4302m1064k9636
9787A41177k9471k3949j1683k501n014q517p241O284J0315nq079o549j5702q874
9773C0191j7224n810o794N024l860J958M403m046K147K294k238n974r070j691
9759a0690Q242J7834O089p195o772j220O343L025N508K837n568p42R9m376P401
9744B0815M277k99k513k497K126J527P427l05m242m528m611O195J0386k102q920
9729B2736P172K647j96Q378l28K077J1069O536K5562M3999M4086N5832L2617J9485
9715B81672p39j8810l2145m4234l6737l4433k6403j9037j4186n606j0302q247
9703C0793j1227l264L456q437j027M7n858m859L016q28M624K268M843l849o638
$$ y = [1414789, 1374285, 1174823, 896542, 656958, 487911, 371275, 276179, 211877, 170813, 141177, 111706, 87757, 76074, 73573, 68559, 60042, 52801, 59085, 69400, 69395, 61316, 54767, 39065, 30191, 12967, 7157, 363, 5387, 1527, 3485, 7888, 3842, 5989, 8283, 6045, 71, -8999, -10690, -2448, 15386, 21475, 14280, 7508, 6288, 12631, 15656, 21164, 24001, 18433, 17691, 17790, 13414, 20815, 25092, 24793, 22280, 19783, 21909, 23436, 30863, 30558, 26316, 21788, 17177, 23372, 33758, 31656, 22736, 29908, 32555, 32359, 40737, 40409, 42486, 53555, 60091, 85653, 129652, 173738, 229570, 262187, 281672, 280933, 262123, 229978, 185744, 149007, 114574, 88171, 69134, 54948, 49342, 39040, 30793, 19566, 16302, 19758, 11321, 10294, 10341, 4483, -376, 2640, 1812, 6436, 8704, 13547, 9698, 3060]
9688C060l653R333J2243r088n366J0205J0401K132j5692o234o498P94k081l528
9674c972K983Q45Q58o63M807M609J585L855j950n624N388K468K720O332J114q831
9658A6524N37q71j2814L95O143R926M53k194j512p663j3179K556Q213m147K575
9643D942K635J71k452j382R484P750P863j0345k312o54r535r039J683K934M386
9628F129M182P238M967L188l212j970q490l01j999m787k778K684Q174l670P318
9613A6673O95r51R066M604m425j2468k576m610o590k461l190k304O677K773O86
9598A599O607l94k535K719q34J501k472k02P443P754P09j484J188m718k946P116
9582B1051K847L572P339m949p131k210j680M484L037p74J127P597p355j2291K664
$$ y = [3060, -593, 8740, 20983, 11895, 6529, 16734, 27135, 29267, 13575, 7341, 843, 1637, -444, -3972, -989, -144, 714, 51, 4858, 9467, 11052, 14907, 12957, 7333, 12721, 15189, 17909, 24241, 25355, 16524, 17061, 16190, 3376, 3771, 9914, 19840, 20293, 18099, 16587, 8924, -4255, -1699, 6514, 2367, 4942, 7577, 7748, 5296, 3914, 13398, 21148, 29011, 18666, 16354, 15700, 6165, -2874, -1191, 1743, 6129, 10311, 17549, 22516, 25704, 22492, 20522, 12032, 11731, 9732, 4945, 2167, 4851, 13025, 9355, 16673, 17368, 16417, 25483, 30087, 25662, 13194, 10618, 6008, -582, -3043, -6233, -8537, -1860, 913, 1599, 8206, 7812, 5277, 7996, 7162, 8663, 6191, 5989, 13432, 21186, 21895, 20411, 21599, 16881, 13935, 21051, 23898, 27470, 34809, 29860, 22729, 20519, 18839, 23323, 26360, 25586, 26713, 34310, 26955, 14664, 17328]
9567A7328j960R85O1r807L931M375J569q534M130J106m349J280K613o297k507
9552C924N679Q073M336P744M436o946j5420p669K719M124O664K40l003J1436R709
9537C6046j289J115j5137o192k90j0654k55P956O862O82k599L329p711p632J107
9522E338M223J488j175P89M333l460j0953Q88n294P709J0505J3656M897j0910
9508B2034l533P233M543L09p174l533Q611J498k363j8r44o323M71q21p37J4694
9492C3947N224m488L533Q946r009j0234o844O294J545p287k380O997N261J26N047
9477C6678L779q143j0024j472Q32R976K313j58J604O506o061q432o9N382r27L272
9461C5056k26m825j2335n178k967m303J686Q785L061K663l33M774O265M535n279
$$ y = [17328, 15368, 16353, 16414, 6607, 10538, 14913, 16482, 7948, 12078, 13184, 8835, 10115, 12728, 6431, 3924, 9603, 17676, 22012, 29756, 34192, 27246, 11826, 4157, 6876, 11000, 17664, 17904, 14901, 26337, 36046, 34757, 35872, 20735, 14543, 14253, 3599, 3344, 11300, 18162, 18844, 16245, 19574, 11863, 4231, 5338, 9561, 11049, 9874, 10663, 14996, 11536, 583, 1471, -3823, 3886, 14391, 28047, 32944, 22034, 18501, 25734, 30277, 30586, 23412, 19879, 28490, 29988, 27625, 27607, 26663, 20340, 20811, 19990, 19253, 33947, 39171, 34683, 38216, 47162, 38153, 27919, 21075, 27369, 28914, 21627, 19247, 26244, 31505, 31631, 36678, 40457, 32314, 22290, 20818, 21650, 31626, 33939, 33781, 35385, 41891, 35830, 27398, 27329, 32711, 31784, 35056, 34830, 30005, 17670, 12492, 9525, 5222, 6908, 15693, 18754, 21417, 21084, 25858, 32123, 36658, 31379]
9446C1379m174l998O301N855j771l398j1636J629P317L893M436k165m284m792
9432B4592K82p81J462o191m83K106R575l580n497r95O489J0701o848p300k101
9417B1431m036M607J5558N578m207q428J706n829M54O880K80n240M106n79p061
9402B5220J0076N110n678o789L619k01M269J245O13M967N839n735p356j1629n478
9387A8092J885L476m2K059N867k803O28J1136K094Q65R0m169M978J030r240j2430
9371B3516K742M086k142J98M798P001n749J424M354l518p19N403n017J198L678
9356D1253J549Q43L42N630N371l932k215L95K080O473r305k866M304Q504j0812
9341D7614o873Q293L177n76P477Q521m362j3747m420L041p097j735J558M687K746
$$ y = [31379, 27205, 23207, 29508, 35363, 33592, 30194, 18558, 20187, 27504, 31397, 35833, 33668, 29384, 24592, 24874, 24093, 25555, 19364, 18881, 20987, 30562, 26982, 21485, 20490, 26979, 37680, 30832, 23532, 21431, 17395, 22002, 37560, 43138, 38931, 30503, 32209, 26380, 26834, 33714, 33994, 28754, 32860, 32281, 25220, 35296, 40406, 34728, 27939, 31558, 31357, 35626, 36871, 37484, 42451, 48290, 42555, 35199, 23570, 18092, 19977, 23453, 23411, 25470, 31337, 28534, 29162, 40298, 42392, 43257, 43347, 39178, 44156, 45186, 35946, 23516, 26258, 30344, 28202, 28400, 33198, 40199, 34450, 35874, 40228, 36710, 35991, 41394, 36377, 37575, 41253, 42802, 43645, 43987, 49617, 54988, 51056, 48841, 49236, 51316, 57789, 48484, 45618, 49922, 58426, 47614, 40741, 49034, 52211, 51635, 59112, 67633, 63271, 49524, 45104, 48145, 41048, 39313, 40871, 45558, 48304]
9326D8304o49L887l591o808k125R800L600N91j372m713K547N403mo305J0141J26
9310E8832o731K851N802N189K548p525k035M514N657l706k3826j785N117l306
9296D1596k649R693J1678N805N088n065O95o889l554K80K583J564l389K642n210
9281E4868k064k572k856M248P442P516o756p05J835n116l582N281J083K112K444
9266F3178o243Q560L185k246P07J3167j324l797q895j0243L665K966L493J0816
9252G6989N141m261r323l95p50m271Q291Q795O194o211n240r559j253M999R7j57
9236F9086J256m488R09O992K246n405M053K28K076j762J1443j6m162o916J217
9221G6757j785p78O312R380J90k361q563r217j126J811L407N385P801m179k070
$$ y = [48304, 47655, 51542, 47951, 41143, 39018, 48818, 52418, 53009, 51637, 46924, 49471, 54874, 54870, 48565, 58706, 58832, 52101, 54952, 60754, 65943, 68491, 60966, 58931, 63445, 69102, 65396, 41570, 39785, 44902, 41596, 38947, 48640, 60318, 66123, 71211, 66146, 66841, 59952, 56398, 56678, 59261, 60825, 57436, 60078, 54868, 52804, 50232, 47376, 51624, 59066, 66582, 59826, 59121, 60956, 55840, 52258, 57539, 58622, 60734, 63178, 56935, 65495, 68680, 66434, 67141, 80308, 78984, 75187, 66292, 56049, 59714, 62680, 66173, 76989, 82130, 77869, 68546, 68151, 67401, 63130, 71421, 80216, 86410, 80199, 74959, 65400, 64147, 69146, 69243, 69086, 70342, 65854, 66763, 73755, 76001, 70596, 74649, 74877, 76953, 75191, 86634, 86618, 82456, 75540, 76757, 74972, 74194, 80506, 89886, 90076, 87715, 79152, 69935, 68809, 70620, 74027, 79412, 87213, 83034, 80964]
9206H0964O476k916N239J972k245J693K659R687k7j0399N489p951O306K489n060
9191I4376J67P660k173l707o115M740Q021K069r192L594k500j522m865k199j978
9176H6376K156L029R392J704n4l279m089p870M606J1397P347R02n338K505R371
9161A18155j784J160N90K441j1351m972Q47J0323M366m841N278K657P74k37q9
9146A23317N459j460M686j878p569n015m21p696n604O251Q756N978J719m861k098
9131A19564j113M099O88J0596m79j964J1052M188p461q137M313q04M187L488l27
9116A41890r607m545k444J196Q544P5N36j0407j661R584P432L190J873J927K943
9101A50526p00n753N305N58K274J476q57n294Q021l614n576K916J4760K362o045
$$ y = [80964, 87440, 84524, 89763, 91735, 89490, 91183, 93842, 103529, 103502, 93103, 98592, 90641, 96947, 99436, 94376, 94543, 102203, 100030, 96323, 90208, 94948, 102969, 105038, 95846, 99440, 96940, 95418, 90553, 88354, 86376, 88532, 91561, 100953, 102657, 102603, 99324, 95235, 87365, 91971, 103368, 110715, 111617, 106279, 108784, 118155, 116371, 117531, 118121, 120562, 109211, 104239, 105086, 115409, 119775, 114934, 120212, 122869, 123643, 123406, 123317, 128776, 127316, 132002, 130124, 122555, 117540, 117119, 109423, 103819, 110070, 118826, 124804, 126523, 121662, 119564, 118451, 122550, 123238, 133834, 133355, 131391, 142443, 146631, 139170, 131033, 135346, 134542, 138729, 142217, 141890, 132283, 127738, 125294, 126490, 135034, 135109, 135645, 125238, 123577, 133161, 140593, 143783, 145656, 147583, 150526, 149826, 144073, 149378, 149936, 152210, 153686, 152829, 147535, 155556, 151942, 146366, 149282, 164042, 166404, 160359]
9086A60359q664L158M981J449K075j986q88m280R964n31n801L958Q258J8861r22
9071A89991k808K415l823j0917P101P373l423M87Q952o19o90J3279L758l65n457
9056B05254n030k075o658J672J4614N254r570k229Q57M994N739N611J187J862
9042B21482k935n434l001K782J464k319N859J2266K275K499k210P045M389j431
9028B42731K137N233j273n894l27O827P43j479k78R023K522j821M167N343o87
9013B66967l846J024P630R531P857O667K222q698K756n903j0504J1710J5629P879
8999C10921j0494o284M624J0727o044j1876J0101Q81R297M061m963K883N174M871
8985C23879P531K312m7l053j152P829J1619J983M7M306L092j683J101J1027Q176
$$ y = [160359, 151695, 154853, 159834, 161283, 163358, 161372, 160484, 156204, 166168, 165637, 159836, 163794, 172052, 190913, 189991, 187183, 189598, 185775, 174858, 181959, 189332, 185909, 186396, 195348, 194729, 194039, 207318, 211076, 210711, 205254, 200224, 198149, 191491, 193163, 207777, 213031, 203461, 201232, 202089, 207083, 212822, 218433, 219620, 221482, 218547, 213113, 210112, 212894, 214358, 212039, 217898, 230164, 232439, 234938, 232728, 239773, 244162, 242731, 244868, 250101, 248828, 242934, 242607, 249434, 250177, 248698, 248420, 257443, 259965, 258144, 262311, 267654, 266967, 263121, 264145, 271775, 281306, 289163, 295830, 298052, 289354, 292110, 286207, 275703, 287413, 303042, 310921, 300427, 294143, 298767, 309494, 303450, 291574, 301675, 302556, 311853, 315914, 310951, 313834, 319008, 323879, 331410, 333722, 333675, 330622, 329470, 337299, 348918, 350901, 350948, 355254, 358346, 356663, 357764, 368791, 376967]
8970C76967J0680O111L356J841l847Q862J2812O184p525j331J0961O840o612k412
8956D22887J50L697J5050R960j561M028N494J0085K752L820N730J2645k294M974
8942D97417N391p112J0121J3346J1724J0869O944j72M814P119J2088J2307P348
8929E92204Q989L459J6433J6257J79J0471Q717O203L311M053P444J0780J7574
8916G06074P586J3757J6884N880J1374K0965R364O995K522K159K4296P698M03
8903H35957J0119J6485J9374K0412J1285J8805K5331J2807J0752K1025Q568J0025
8891A020945K3110K4886J9917J4085J3096K6715J4499K0065K5425L1735K8962
8880A263440J9083K4162K5911K0089K7662K6582P787J9341K7394K9092L5290M2217
$$ y = [376967, 387647, 393758, 397114, 398955, 395108, 403970, 416782, 422966, 415441, 414110, 425071, 431911, 425299, 422887, 423037, 426734, 441784, 451744, 450183, 454211, 459705, 469790, 472542, 476362, 482092, 494737, 492443, 497417, 502808, 495696, 505817, 519163, 530887, 541756, 548700, 548528, 553342, 560461, 572549, 584856, 592204, 601193, 604652, 621085, 637342, 637521, 647992, 656709, 662912, 666223, 670276, 677720, 688500, 706074, 713660, 727417, 744301, 750181, 761555, 782520, 791884, 798879, 801401, 803560, 827856, 835554, 835957, 846076, 862561, 881935, 902347, 913632, 932437, 957768, 970575, 981327, 1002352, 1010920, 1020945, 1044055, 1068941, 1088858, 1102943, 1116039, 1142754, 1157253, 1177318, 1202743, 1234478, 1263440, 1282523, 1306685, 1332596, 1352685, 1380347, 1406929, 1414716, 1434057, 1461451, 1490543, 1525833, 1568050]
8868A568050L8055L9499K7186L4341L0943L6343M1402K8077L3157L3240L9330
8857A949623M2151M4830M8326N4427N1848M6499M1442N4904O3205N1398N3190
8846B501843N6698N8895N9851O2657O2701P0846P1884P2120P6561P1540P9996
8835C245592Q5038Q3790Q9646Q7672Q2667R6866J00773R5043J08847J16188J04306
8824D296428J12302J08311R4567J10748J13686J08270J15253J14017J22740J20317
8814E416639J20582J35065J30338J29630J19216J09526J13373J21605J07507J13217
8804F616698J22050J08842R0933Q3463P5617Q9755Q8286O7866N7767N3346L3992
8793G488615L5788L0041J1900J1605L083n188j5598k8429l5418l9776n0836n5915
$$ y = [1568050, 1606105, 1645604, 1672790, 1707131, 1738074, 1774417, 1815819, 1843896, 1877053, 1910293, 1949623, 1991774, 2036604, 2084930, 2139357, 2191205, 2237704, 2279146, 2334050, 2397255, 2448653, 2501843, 2558541, 2617436, 2677287, 2739944, 2802645, 2873491, 2945375, 3017495, 3094056, 3165596, 3245592, 3330630, 3414420, 3504066, 3591738, 3674405, 3771271, 3872044, 3967087, 4075934, 4192122, 4296428, 4408730, 4517041, 4611608, 4722356, 4836042, 4944312, 5059565, 5173582, 5296322, 5416639, 5537221, 5672286, 5802624, 5932254, 6051470, 6160996, 6274369, 6395974, 6503481, 6616698, 6738748, 6847590, 6938523, 7021986, 7097603, 7187358, 7275644, 7343510, 7401277, 7454623, 7488615, 7524403, 7554444, 7566344, 7577949, 7581032, 7575844, 7560246, 7531817, 7496399, 7456623, 7405787, 7349872]
8781G349872q6303p9951p6328r4876r9868j04670j07188j17478j08689j08956
8771F365565j22317j23517j23588j24639j23661j14798j21591j26867j26948j23622
8761E134017j15603j17395j18839j11742j17666j16973j05539j02113j07044j01407
8751D019696r6158r3702r6622r7616r6763q3482p6397p8101q6004p8377p7614
8740C058860q2398p2779o6114p3979o7239p2701p2840n6891o0224n6730n4198
8729B322767n2287m8068n3351l7149m5564m4014m9173m6905m6148l7922m2268
8718A819918m1357m1183m4753k1819k3674l2899l4182k2370m0958l7682j8988
8707A460053j8095k5991l0257k0892k9682l3470k1565k8863l2433k5328k1130
$$ y = [7349872, 7263569, 7183618, 7107290, 7012414, 6912546, 6807876, 6700688, 6583210, 6474521, 6365565, 6243248, 6119731, 5996143, 5871504, 5747843, 5633045, 5511454, 5384587, 5257639, 5134017, 5018414, 4901019, 4782180, 4670438, 4552772, 4435799, 4330260, 4228147, 4121103, 4019696, 3923538, 3829836, 3733214, 3635598, 3538835, 3455353, 3378956, 3300855, 3214851, 3136474, 3058860, 2976462, 2903683, 2837569, 2763590, 2696351, 2623650, 2550810, 2493919, 2433695, 2376965, 2322767, 2270480, 2222412, 2169061, 2131912, 2086348, 2042334, 1993161, 1946256, 1900108, 1862186, 1819918, 1778561, 1737378, 1692625, 1670806, 1647132, 1614233, 1580051, 1557681, 1516723, 1479041, 1460053, 1441958, 1415967, 1385710, 1364818, 1335136, 1301666, 1280101, 1251238, 1218805, 1193477, 1172347]
8696A172347j9540j5622j6721k4316k3147k0192k5412j5119p288k2016j6005j7111
8684I49858j8704k3106j2944j0928j1098j1652j3407j9038j8641j3624r427r928
8672G77361j7211j9329j3877j104m467o788q722j4903p091N006k668k1967j5162
8659F49078p49j42k392j3039j4890r102L639j3982j5416p548j0780q701n358m582
8645E46036j9317o812j424p571k462j2125p989j329j2079o778m681k998l075n808
8631D51588q624k183r662j0091k219m73K97J662k116k341k157m349m102q295j3157
8616C83778K434j001k327j0306r244O500O882J473L478K13j1749p927M751J3280
8602C80235K3188J120j1433j7333k1473j1939o754j6122j0204k369L112k486m205
$$ y = [1172347, 1152807, 1137185, 1120464, 1096148, 1073001, 1052809, 1027397, 1012278, 1004990, 982974, 966969, 949858, 931154, 908048, 895104, 884176, 873078, 861426, 848019, 828981, 810340, 796716, 787289, 777361, 760150, 740821, 726944, 725840, 721373, 714585, 705863, 690960, 683869, 688875, 686207, 664240, 649078, 648329, 648187, 645795, 632756, 617866, 608764, 612403, 598421, 583005, 575457, 564677, 555976, 550618, 546036, 526719, 519907, 518483, 510912, 508450, 496325, 488336, 487007, 474928, 468150, 463469, 460471, 457396, 451588, 442964, 440781, 431119, 421028, 418809, 418336, 418633, 420295, 418179, 415838, 413681, 409332, 405230, 396935, 383778, 386212, 385211, 382884, 372578, 363334, 369834, 376716, 378189, 381667, 381880, 370131, 362204, 366955, 380235, 403423, 404543, 393110, 375777, 354304, 342365, 335611, 319489, 309285, 306916, 310028, 307542, 303337]
8589C03337L58j1025p336o656O128O803n244J285l716j808K886N852O577k934
8575B94507J700o301m505O490L878j878j633L162q771n884K720K434q086r58M972
8560B81847k21J9796L4520L9668J0144l4527l9108l5122j7065j5582j0630j8706
8548B15014l027L421q92k642J693k509q591j2121J103Q19m278L02l276p803j0210
8533A67003q49P060k90k146j139P67J760m299m858M885k220O307Q23m964k771
8518A65069K177J3641J812n534l542J7699J4716O253j3261n318n584j3015j8696
8505A56417m913M336r71J874K544m540k255P1r390n455l496K173J0652q944r174
8490A28929N929O966j3130q291K858n014m390M548J522j1967k235P191Q618R943
$$ y = [303337, 303695, 292670, 285334, 278678, 284806, 291609, 286365, 287650, 283934, 282126, 285012, 290864, 297441, 294507, 296207, 289906, 285401, 291891, 295769, 293891, 292258, 295420, 286649, 280765, 283485, 285919, 277833, 276875, 281847, 281626, 301422, 335942, 375610, 385754, 351227, 312119, 276997, 259932, 244350, 233720, 215014, 211987, 215408, 214516, 211874, 213567, 211058, 202467, 190346, 191449, 192268, 187990, 188292, 185016, 177213, 167003, 166154, 173214, 172924, 170778, 169639, 170406, 172166, 167867, 163009, 167894, 165674, 171981, 172804, 167840, 165069, 167246, 180887, 182699, 177165, 173623, 191322, 206038, 212291, 199030, 193712, 188128, 175113, 156417, 151504, 155840, 154869, 156743, 159287, 154747, 152492, 152563, 143173, 137718, 134222, 136395, 147047, 138103, 128929, 134858, 141824, 128694, 120403, 123261, 118247, 113857, 118405, 119927, 107960, 105725, 112916, 121534, 131477]
8476A31477L220j09K00j2595j3663m160M411N74k391J269j820m757n855L459J0439
8461A09699N757k990j0440m172M693N135Q619J37j521m676q85K963l355m653P924
8446A12235p389p847l503O552L210l52k108q014N288J832L16l239J46m840p535
8431H4752j902l64l278J407L392M64o35J831K311p696K164K797p32j049m579O183
8415H5066P372k625j314j180M550p142j3878m964L437l758n786M098P222o413
8401F4685N541J0148Q721M042p32M039k168j3622k194o283j456R88p348L724L322
8386G1407m06M582N537r76n493j0733j51M299N923k81j3418j979J1426R301k278
8371G6760j0476n302J7566q219k160J823j973j0996j5540M246J7355O153L65K217
$$ y = [131477, 134697, 134588, 134788, 122193, 108530, 104370, 108781, 109355, 106964, 108233, 106413, 101656, 95801, 99260, 109699, 115456, 112466, 102026, 97854, 102547, 107682, 116301, 116438, 114917, 110241, 109356, 112319, 108964, 104311, 112235, 104846, 96999, 93496, 100048, 103258, 102906, 100798, 92784, 98072, 99904, 100220, 96981, 97127, 92287, 84752, 82850, 82486, 79208, 80615, 84007, 84471, 83836, 85667, 87978, 80282, 82446, 85243, 84511, 83462, 78883, 85066, 92438, 89813, 88499, 87319, 91869, 84727, 70849, 65885, 69322, 65564, 59778, 63876, 71098, 64685, 70226, 80374, 89095, 93137, 92405, 96444, 94276, 80654, 78460, 72177, 70721, 71709, 64361, 68085, 71407, 71001, 75583, 81120, 80144, 74651, 63918, 63767, 68066, 73989, 73708, 60290, 58311, 69737, 79038, 76760, 66284, 60982, 78548, 70329, 68169, 69992, 68019, 57023, 41483, 45729, 63084, 69237, 69602, 71819]
8357G1819k597K942j959p458m349k820q113k589R321j514j482J175m037R147n16
8342E6970L321O510j3433o166O292n989O414J0130m217q938j884q494P992N605
8328E4113K225P584r11p156o287r621k022L343R04P485m282N239M143n264J733
8313E1226M925l22q251J640o259k919r9o261Q038M199k229j54K098m751j102J0584
8297E0363K652K054k302N62k23p014K478P60n541q167j57m446m808j788P415J0361
8281D2199P351o384o471k128p020O066M231Q677N27q120p90K460m393k126R455
8266D3534J0985o423j6096J818l408k656K088l434J481R264M341k750o978p726
8252B4040p367J0766J3471J166k672l996o120o813M672l347J995o092L65J095
$$ y = [71819, 69222, 72164, 70205, 62747, 58398, 55578, 47465, 44876, 54197, 52683, 51201, 52376, 48339, 57486, 56970, 60291, 66801, 53368, 47202, 53494, 47505, 53919, 64049, 59832, 50894, 49010, 40516, 48508, 54113, 56338, 63922, 63011, 55855, 49568, 39947, 37925, 41268, 42172, 49657, 45375, 50614, 54757, 49493, 51226, 56151, 55829, 47578, 49218, 42959, 40040, 39941, 33680, 41718, 45917, 43688, 43534, 45632, 40881, 39779, 50363, 53015, 55069, 52767, 53329, 53106, 46092, 48570, 49330, 43789, 35622, 35465, 31019, 26211, 24423, 31838, 42199, 49550, 43166, 36695, 34567, 27547, 33613, 37844, 46521, 47048, 38928, 38138, 40598, 36205, 34079, 43534, 54519, 48096, 32000, 33818, 30410, 27754, 29842, 26408, 27889, 37153, 41494, 38744, 31766, 24040, 16673, 27439, 40910, 42076, 39404, 35408, 29288, 22475, 27147, 23800, 25795, 19703, 20068, 21163]
8238B1163N840P768M238j1894q128L446J469M115m746L514K643k7M919p134j627
8223B5559N984o074M115O089j888Q530k692j4777K921Q833j542q965j4388M683
8209A6388O788L178J507j1735l74J0253r9p376P393M553L914R691N193j9667j3636
8194A5971N953N597o493l110L155l545o24J1430L230m162R882L62p492n369J804
8179B6589N647N017n282k486O371k718m905l147P55q82M474o285j46K37r25Q597
8163C0911p384l684M650l618l528N396L766k911n300k535j548P376N231j026m398
8148B1398r652q703N96k939M883J2772P590o10K73K997L29j0369J71R65l309J897
8132A8289J993N9n370q074J4398Q130m140L933n637j0092K419J619l002k146o333
$$ y = [21163, 27003, 34771, 39009, 27115, 18987, 22433, 23902, 28017, 23271, 26785, 29428, 29401, 34320, 27186, 25559, 31543, 25469, 29584, 35673, 33785, 42315, 39623, 24846, 27767, 36600, 35058, 26093, 11705, 16388, 23176, 26354, 27861, 16126, 15752, 26005, 25906, 18530, 25923, 30476, 34390, 44081, 49274, 29607, 15971, 21924, 27521, 21028, 17918, 21073, 17528, 16904, 28334, 31564, 27402, 37284, 37646, 30154, 24785, 26589, 32236, 37253, 31971, 29485, 35856, 33138, 28233, 25086, 25841, 24959, 29433, 23148, 23002, 23239, 22314, 30911, 23527, 19843, 24493, 20875, 17347, 22743, 26509, 23598, 18298, 15763, 14215, 21591, 26822, 25796, 21398, 11746, 3043, 3639, 700, 5583, 18355, 25945, 25335, 25608, 28605, 28934, 18565, 18736, 19701, 16392, 18289, 20282, 20341, 14971, 6897, 21295, 29425, 25285, 29218, 23581, 13489, 15908, 17527, 14525, 12379, 6046]
8117F046L940J0927j528p841M069J2517L655n554m027m074J316q126j0633M311
8103D998J5795Q021M9k837p679M62p07L608q81N001L966n565J901k24j2447k925
8087A0536J586L690R4l034K965M899p90j690j577P87m526o583M449M004M67Q454
8071B3731J583j1346Q1J2392m344N86k403K342M796k946j609J86m39M5k83p581
8055A4791j809P180m199l109l532LN108M056K220J858q895K501L026M722M780
8040B8701k417m312l285J0681o44Q454n85q206p493M760J0260M786O463L544m375
8025D6332r449j6320r918Q792j446p56L684k728o512j861R406k131m883q46J0509
8010B1873K904k537p965k072R129k36p75o170j853l844k365J1089J8392m173q121
$$ y = [6046, 9986, 20913, 19385, 11544, 15613, 28130, 31785, 26231, 22204, 18130, 19446, 11320, 687, 4998, 20793, 28814, 28863, 26026, 18347, 18809, 18102, 21710, 20829, 25830, 29796, 24231, 26132, 25908, 13461, 10536, 12122, 15812, 15906, 12872, 15837, 20736, 19946, 18256, 16679, 17466, 12940, 6357, 10806, 14810, 15277, 23731, 25314, 13968, 14049, 26441, 22097, 22683, 20280, 22622, 27418, 24472, 22863, 23049, 22610, 22655, 22372, 14791, 12982, 20162, 15963, 12854, 9322, 9325, 14433, 18489, 20709, 22567, 13672, 16173, 19199, 23921, 28701, 26284, 21972, 18687, 29368, 28724, 37178, 36593, 28387, 20894, 25654, 35914, 40700, 47163, 50707, 46332, 36883, 20563, 10645, 19437, 17991, 17235, 20919, 18191, 11679, 9818, 19224, 17093, 12210, 11364, 21873, 24777, 22240, 14275, 12203, 21332, 21096, 20321, 14151, 12298, 8454, 6089, 17178, 35570, 31397, 23276]
7995B3276O369n427j784P541O086l762m124l400l185p367n4N721Q169N044j158
7980C1945J139P513k579K730K460n274p626m094m312o093P900J2414P121P99r058
7965C4985l12J227m092J442j27k209L381n65L544l576q264j007j2l502j573J7540
7949C6880K773m550k356O544N453J156j2971J849J7102L435k513O113j5988q157
7935C4770l273O425J3134O796o79r125L673K230o771q692J362L218n766k332M951
7920C9921r283J522m741p152O03P165l91P526J047K485M600J715p877n113K90
7905C2317l20j792N680R60N273R174J3610l100n549n468k223k621P99j770m810
7890D0160p635O8K777o096n931M371P361L646o145n072Q923l634n238K003M876
$$ y = [23276, 29645, 24218, 22434, 29975, 36061, 32299, 28175, 24775, 21590, 14223, 14169, 19890, 28059, 33103, 31945, 33084, 40597, 38018, 40748, 43208, 37934, 30308, 26214, 21902, 15809, 23709, 36123, 43244, 44043, 34985, 34673, 35900, 31808, 33250, 33123, 30914, 34295, 33730, 37274, 33698, 25434, 24427, 24415, 20913, 19340, 36880, 39653, 35103, 32747, 39291, 44744, 45900, 32929, 34778, 51880, 55315, 52802, 58915, 42927, 34770, 31497, 37922, 51056, 57852, 57173, 48048, 51721, 53951, 47180, 38488, 39850, 43068, 37302, 34970, 39921, 30638, 32160, 27419, 20267, 20870, 28035, 27644, 35170, 36217, 38702, 43302, 45017, 37140, 32027, 32317, 31997, 30205, 35885, 36845, 42118, 51292, 64902, 61802, 56253, 50785, 48562, 45941, 46740, 44970, 40160, 32525, 32593, 35370, 29274, 23343, 27714, 35075, 38721, 32576, 27504, 36427, 32793, 27555, 29558, 34434]
7875C4434N996m513m162k645l3N7n761o856O719J2315n842p914O64j819m19p957
7859A2264L267j193J272N675K978m771K793r366j874j0968m237J0650P187m853
7845H824m684L321p70n232m06l901m076R084Q197O59l476J243P80K124M463O865
7829B3015n36j4809q985N396N952J912p79L63l836j452q346j884M1Q105L388l353
7813D192m621l340l119R042R246o456j0566K362K524J648Q679o185L86r32k939
7798g9j565k73j70l912J982J2171N948l258J995K796R348N773n760j6091m09Q807
7782A7303l791p010m918N249O17p920j453J0658J3556N600r096l001j466k500
7768A1828N714m454j0708O738R45o398J91n551l697r03m81J4543M846J115r691
$$ y = [34434, 40430, 35917, 31755, 29110, 29077, 29134, 23373, 16517, 23236, 35551, 29709, 21795, 22459, 20640, 20221, 12264, 15531, 14338, 15610, 21285, 24263, 19492, 22285, 12919, 11045, 77, -4160, 6490, 13677, 8824, 4140, 7461, 6691, 1459, 1053, -2848, -6924, 2160, 10357, 11016, 7540, 8783, 9563, 11687, 16150, 23015, 22479, 7670, -1315, 4081, 10033, 11945, 11166, 11529, 7693, 6241, -2105, -3989, -3948, 4157, 7545, 4192, -429, -3769, -6888, 2154, 11400, 4944, -5622, -3260, -736, 912, 9591, 3406, 3792, 2860, -79, -1644, -1917, -2087, -5999, -4017, 8154, 14102, 10844, 12839, 15635, 24983, 30756, 24996, 8905, 8496, 17303, 13512, 6502, 1584, 6833, 7450, -470, -1923, 8735, 22291, 27891, 18795, 15794, 14328, 11828, 17542, 13088, 2380, 9118, 10063, 3665, 3856, -1695, -5392, -6295, -6776, 7767, 12613, 13728, 4037]
7753D037p18k597p35L707K525q490j836Q746P237q713o802j1773l530M324L44
7738a4274j151P639R035l580k236o951l266l232N724J59K939O290K324J2317j036
7723A0701k093o10L867q798l199Q351m857q943m12L070R161J304k859J0534J291
7708A6508j576j3205j2533o389L528N008K921N556P123j809J304J08j0430M796
7694I10P159j474l739j72l97P843L70j1994j5889n959K649R639k828J698L954
7679h230L523j345k911n692j966N575K086M02L727K695K761n803j2775J836j821
7664a7938n133Q499L648n317J1786P745k328j0219K948R46K931J603l460Q461
7650D172P465p154l180L171j1050L277L782k881R34M031R968O304l607r343L752
$$ y = [4037, 3319, 722, -13, 3694, 6219, -2271, -4107, 4639, 11876, 3163, -3639, -15412, -18942, -14618, -14274, -15425, -7786, 1249, -2331, -4567, -11518, -14784, -18016, -12292, -12133, -9194, -2904, -580, 11737, 10701, 8608, 7998, 11865, 3067, -132, 8219, 3362, -5581, -5993, -2923, 6238, 7542, 4683, 15217, 16508, 14932, 1727, -10806, -17195, -13667, -8659, -5738, -182, 6941, 5132, 6436, 6544, -3886, 910, 8069, 6595, 2856, 2684, 2287, 10130, 10500, -1494, -17383, -23342, -20693, -11054, -13882, -12184, -8230, -4707, -6052, -8963, -14655, -16621, -11046, -8960, -8558, -4831, -2136, 625, -5178, -17953, -16117, -17938, -23071, -14572, -10924, -16241, -4455, 3290, 962, -9257, -6309, -5363, -2432, -829, -4289, 4172, 11637, 4483, 1303, 4474, -6576, -3299, 483, -2398, -1464, 2567, 12535, 18839, 15232, 5889, 9641]
7635I641K905N525J454m253J275o294P222J1373l410o611J120n249n653m552r929
7620e436N233M957j713m646L928N513P147K255p008J339p51r009r665Q857R078
7605A0079J588l876n477j7046K854J4160L223P78l036p691L918K693k613L12J16
7590a8l329m180R325R808l487p477k13L533k444R41l481R89Q325k325o925K691
7574A733p74j7045j559J300j184N495P730n404r42K617r732n738M416N602l151
7559a6636N089J1114l572k549K892l151j847J47l334m973N059n160L112Q417p047
7544a2439j117J0423M104o773M88K904k151j890Q914Q754k718n379p207p379K158
7529i308j75R78J232J838L553r43m42O393J4804m419N088k782k903k656P025j483
$$ y = [9641, 12546, 18071, 19525, 15272, 16547, 10253, 17475, 28848, 25438, 18827, 19947, 14698, 9045, 4493, -5436, -203, 4754, 3041, -1605, 2323, 7836, 14983, 17238, 10230, 11569, 10818, 1809, -7856, 1001, 10079, 11667, 7791, 2314, -14732, -11878, 2282, 5505, 6283, 3247, -4444, -526, 2167, -446, -134, -18, -3347, -7527, 1798, 11606, 8119, 642, 429, 3962, 1518, 2459, -1022, -33, 8292, 5967, -958, 1733, 959, -16086, -17645, -16345, -17529, -12034, -4304, -9708, -10650, -8033, -17765, -23503, -19087, -13485, -16636, -11547, -433, -4005, -6554, -3662, -6813, -8660, -8513, -11847, -16820, -11761, -16921, -13809, -5392, -12439, -13556, -3133, 971, -5802, -5314, -2410, -4561, -6451, 2463, 11217, 8499, 3120, -4087, -11466, -9308, -9483, -8505, -7273, -5435, -1882, -2825, -3267, 3126, 17930, 13511, 18599, 15817, 12914, 10258, 17283, 15800]
7513A5800n217l511K669N278M528k482n703j116j1170j353j516L313J784l306
7499b002l124M63k064l926p76J016k724J173M164L367R458K095q291p467K425
7484f213K46K639L030j257k938N66L473K42j136K272P983M788r549j095j164j278
7468F09J80o656N94M961M100q29j2433n113l432o43P51N166J51p49J3870N51K248
7451C326o682l18K038n273R551q53n23o807q115p58m145O049J1680q499L72N730
7435c227J720M779j116j976k261m91K652J314j226J465L767L902P594q779j2574
7420d457j0415Q19Q729K948k868o575O597N871m919j0180P884L591q66j29q962
7405a2932J4036k233q279k22M176Q14O659Q895q646J07K148k7j008j033j261n285
$$ y = [15800, 10583, 7072, 9741, 15019, 19547, 17065, 11362, 10246, -924, -2277, -3793, -480, 1304, -2002, -5126, -4663, -6727, -10653, -11429, -10413, -13137, -11964, -7800, -4433, 5025, 7120, -1171, -8638, -6213, -5967, -3328, -298, -1555, -4493, -3927, -454, -212, -1348, 924, 8907, 13695, 4146, 3051, 1887, 609, 789, -5867, -5273, -312, 3788, 2959, -9474, -14587, -18019, -18662, -17911, -12745, -12594, -13343, 527, 1078, 3326, -3356, -3674, -1636, -6909, 2642, 1789, 1266, -5541, -13656, -14414, -18559, -12510, -830, -9329, -8957, -3227, -1507, 3272, 2156, 180, -2081, -2572, 80, 1394, 168, 1633, 5400, 9302, 16896, 8117, -4457, -14872, -14053, -5324, -2376, -5244, -11819, -5222, 649, -4270, -14450, -6566, -2975, -3841, -3970, -12932, 1104, -1129, -9408, -9630, -5454, -4640, 2019, 10914, 2268, 2375, 4523, 4496, 3488, 2455, 1194, -4091]
7389d091n556p951J859K917O803M842r28j0519M215J0046N057M467m08k424j1564
7374c235q880m095O599K974m852J007L701L717P436l091Q881L446n03k375l456
7359G274j001j0232p122N285P957J653l21m624M673K211K251o835j0976r050K167
7344a6690N685O054J8286N934j0160n018m304o93N286m428j0053J535L923l625
7330h268M046P757M783k223k731M363J010m284o911J734M517m075K059L227n547
7315e43k1Q094J700k814m371K906J4869l987j4275l091m311L472J1910Q575q223
7300I890j3627K159J088Q19n285J004P856J686K024n241l970l359K280L63n628
7285g941J43q431j182Q266Q81n7k555J819m385N302Q708L6k184m337R229J1173
$$ y = [-4091, -9647, -17598, -15739, -12822, -6019, -1177, -2105, -12624, -8409, 1637, 6694, 11161, 10753, 8329, -3235, -12115, -16210, -9611, -6637, -11489, -10482, -6781, -3064, 4372, 1281, 10162, 13608, 13105, 10730, 7274, 6273, -3959, -11081, -5796, 2161, 3814, 3493, -1131, 3542, 5753, 8004, 1169, -9807, -18857, -16690, -11005, -4951, 13335, 19269, 9109, 4091, -213, -906, 4380, -48, -10101, -8566, -4643, -8268, -4222, 3535, 8318, 6095, 3364, 7727, 8737, 4453, -2458, -724, 3793, -282, 1777, 5004, -543, -564, 7530, 9230, 6416, 2045, 4951, 19820, 15833, 1558, -1533, -5844, -2372, 9538, 18113, 9890, -3737, -1578, -490, 329, -4956, -3952, 3904, 5590, 7614, 2373, -1597, -4956, -2676, -2313, -7941, -7798, -16229, -17411, -9145, -8264, -8321, -10876, -9057, -13442, -8140, 568, 604, -1580, -5917, 3312, 14485]
7269A4485O312n672m505l435K694M436q3r38j3985k611N171L9j7052j949N599
7254a1494n92K669O485L361l540j1243k20N749J1864P083l7j0025L203P877l693
7239G447m206j2140j1751l7M738M558R104L8m314J486j685J03N026N511o795N961
7223C044M338m787l939m319j0436J935K739L036L050l778L224L201k306j224m723
7208a0945r550L408L654k725J1950J7088L4p462p815m912L104m756j271j0071
7194b0269K321J3308P386n496j510P71M968l107K526J0148R980l727r626r299
7180a626l982n306j4990L297R025L805n826K637J0155Q842N48l248m718J683l310
7165c014q742R31O552k333O506N688M911o939j065q9j265m727j189J936J265K370
$$ y = [14485, 20797, 15125, 10620, 7185, 9879, 14315, 14232, 13294, -691, -3302, 1869, 1908, -15144, -17093, -11494, -12086, -9417, -2932, 429, -3111, -14354, -14574, -8825, 3039, 10122, 10085, 60, 3263, 11140, 7447, 3241, -8899, -20650, -20687, -15949, -11391, -2287, -2249, -6563, -5077, -6762, -6659, -1633, 3878, -2917, 3044, 7382, 2595, -1344, -5663, -16099, -14164, -11425, -8389, -5339, -9117, -5893, -2692, -4998, -6222, -10945, -20495, -17087, -13433, -16158, -4208, 12880, 12914, 5452, -2363, -7275, -4171, -8927, -10198, -20269, -17948, -4640, 2746, -2750, -4260, -3489, 1479, -1628, 898, 11046, 21026, 17299, 7673, -1626, -5608, -10914, -25904, -22607, -13582, -9777, -15603, -12966, -2811, 6031, 6579, 3331, -1387, 296, -3014, -11756, -10825, -4273, -6606, -100, 5588, 10499, 3560, 2495, 2406, 1141, -3586, -4775, -2839, -1574, 796]
7149G96p943M22O452q48N248j0764m858P171o073j116M851j72L774N228P785K054
7133A2007j2778r637m262K44R617k380o67O218K604j428n826r445p36j22j503
7118a8094L453L251L503M883l002L416l626l64R501N149m423j1066q633N93M350
7103a1109J468O475M208O779l675J416q86n364j337K635n585J259L263o748m940
7088a2141q51J628L208O677n723j0719n729P456M480K708J868J2669O100p329
7074D302o011j973K358P295o117q249l706M030n914P034N887L712k74L699L888
7059I961k235m191q597O405L717J576M05K68r469q18L834P345n68m915r45k721
7043i48L736J107r183n067l436R418K247l22L900L100K727l705N277n202N901
$$ y = [796, -7147, -6725, -273, -1121, 4127, -6637, -11495, -4324, -10397, -11513, -6662, -6834, -3060, 2168, 9953, 12007, -771, -10408, -14670, -14426, -4809, -7189, -7856, -1638, 966, -462, -6288, -15733, -16469, -16591, -18094, -14641, -11390, -7887, -3004, -6006, -2590, -6216, -6580, 2921, 8070, 3647, -7419, -16052, -15459, -11109, -9641, -3166, 1042, 7821, 4146, 5562, 4676, -688, -2025, 610, -4975, -3716, -453, -7201, -12141, -12992, -11364, -8156, -1479, -7202, -17921, -23650, -16194, -11714, -9006, -7138, 5531, 11631, 4302, -1709, -3682, -1324, 5971, -146, -8395, -12101, -8071, -13985, -6951, -1064, 2648, 2374, 6073, 9961, 7726, 3535, -5062, 1343, 5060, 6636, 7041, 7309, -2160, -2978, 856, 8201, 7633, 2718, 1773, -948, 2788, 3895, -5288, -10355, -13791, -4373, -2126, -2448, 1452, 4552, 7279, 3574, 8851, 3649, 9550]
7028I550q418r070k32k035M431M319L914l499o973J609J1363k855J386O34M149
7013H273k273n820m587P588l799k610l165n001N726P752O140O201L456o613l722
6998G546n134k520N683l793J422O832j3857o441k276m595J0071K498Q338n511
6984a737r570q969Q251M913J60m559l624j659P196L04L828R66M856m044N82P456
6968D350m321j1639j223J3852P090j170r448L141N92O705q442p867K584k866k464
6953a1126J0429Q702J890K267l125o219m437o757M59J0733J69O210j793l016j0865
6938f479k924P72k377R162p93n14M28n000L520J229l90l741J33O15m450k481J6157
6921B867N736j156k722n664n069P041J681N999m167j4484Q092L721N57j8k948
$$ y = [9550, 1132, -7938, -8170, -10205, -5774, -1455, 2459, -1040, -8013, -6404, 4959, 2104, 3490, 4124, 8273, 6000, 180, -4407, 3181, -618, -3228, -6393, -11394, -5668, 2084, 8224, 14425, 17881, 11268, 7546, 2412, -108, 5575, 1782, 3204, 10036, -3821, -10262, -12538, -17133, -7062, -4564, 3774, -1737, -11307, -20276, -12025, -7112, -6952, -11511, -15135, -16794, -9598, -9294, -5466, -4500, 356, -3688, -3106, 4350, 29, -11610, -12833, 1019, 8109, 6939, -2509, 632, 1224, 7929, -513, -8380, -5796, -8662, -11126, -697, 8005, 9895, 12162, 9037, 2818, -1619, -8376, -7917, 2816, 2985, 9195, 7402, 4386, -6479, -9403, -8631, -11008, -1846, -2639, -3153, -2725, -7725, -4205, -2976, -3366, -7107, -6974, -6359, -10809, -13290, 2867, 8603, 7447, 4725, -939, -6008, 1033, 2714, 8713, 4546, -9938, -1846, 1875, 2432, 2414, -534]
6906e34p506j963K547K554j831N821q929n783J326O020K818J838N498P389k360
6891F905J80j278J691o379o519L434j448k499q99P535N406p232j433Q967J143
6876G574j791J102l078p213k133o311L741k728m476j114O78r33R039J1713P80
6861D850k952n623p705L221N304Q019K082K077o742n462K409M515l449q89M725
6846D380k778j584p234q307L741R086j919n797N71K66l958J698J4754J650N79
6831E148m327l057m099m175M961J2612j48l71m363k444j472l802m006Q334n582
6816f791O00J864O571R677M62o243j2594n415J0196K339q515k907J2711N879n965
6801A869p205N166P448n222j728O243p412j0712l180J0885Q348L331l766o129
$$ y = [-534, -8040, -10003, -7456, -4902, -6733, -912, -9841, -15624, -14298, -8278, -5460, -3622, 1876, 9265, 6905, 7085, 5807, 7498, 1119, -5400, -1966, -3414, -5913, -6812, 723, 6129, -1103, -2536, 6431, 7574, 5783, 6885, 3807, -3406, -5539, -11850, -8109, -10837, -15313, -16427, -15749, -16682, -7643, 4070, 4850, 1898, -3725, -11430, -8209, -2905, 5114, 7196, 9273, 2531, -2931, -522, 3993, 544, -345, 4380, 1602, 18, -7216, -15523, -11782, -2696, -4615, -10412, -9841, -9575, -13533, -11835, 2919, 4569, 5148, 821, -2236, -6335, -10510, -5549, 7063, 6915, 6544, 2181, -263, -1735, -5537, -9543, -1209, -6791, -6191, -4327, 2244, 11921, 12383, 6140, -6454, -11869, -1673, 666, -7849, -10756, 1955, 7834, 1869, -5336, -170, 7278, 2056, 328, 6571, -841, -11553, -14733, -3848, 4500, 7831, 4065, -2064]
6787b064m831m789L165J345K417L523J995j0225p252p21J755P643k000J676P070
6772a293J393J2591m642q481p369j978k524M156n14J540n012O212J0137J1898
6758A6114J285n746n085l987j2978j963J4648R210K961r73j3541j1631m819K127
6744a4378M790Q636n417j1049P366J2470N631j0518r078j445K030Q374O69m57
6730b376K307N507o575q330j3524L315P965L629J2333j939n185J551p414M668
6716d068M544J233K92n233o352j297Q510P269o07k37q741n626L419R6l807r375
6700a9980J1995J2327J782j663j1699j0580P287k47m647J861K750l897j0223M148
6686b0786P532L95P773Q922o923n412N167J0959M411p536q624q49Q356k333q281
$$ y = [-2064, -6895, -11684, -8519, -7174, -4757, -1234, 761, -9464, -16716, -17437, -15682, -8039, -10039, -8363, -1293, 100, 12691, 8049, -432, -7801, -9779, -12303, -8147, -8661, -7121, -12133, -5921, 4216, 16114, 17399, 11653, 6568, 2581, -10397, -12360, 2288, 11498, 14459, 13486, -55, -11686, -16505, -14378, -9588, -952, -6369, -17418, -10052, 2418, 8049, -2469, -11547, -12992, -10962, -2588, -1919, -2376, -69, 5438, -1137, -9467, -22991, -19676, -11711, -8082, 4251, 2312, -2873, -1322, -8736, -4068, 476, 1709, 2001, -3232, -9584, -10881, -2371, 4898, 4291, 4054, -4687, -10313, -6894, -6798, -10605, -19980, -7985, 4342, 6124, 4461, -7238, -17818, -10531, -10778, -15425, -13564, -10814, -14711, -24934, -20786, -13254, -12859, -5086, 3836, -3087, -8499, -3332, 7627, 12038, 4502, -4122, -4971, 3385, 1052, -7229]
6671g229r617Q853Q129o733p254J1438J2438j230j1019n713m6K009J95l39J232
6656d886Q15j0474o021J301l093Q039J2187J679n652K982M192j717k947j17m080
6641g792k719Q002k65o953P311K82o526m456R170k962K030K623k507M787J271
6626A296K993O87k087l599o083n48N216M877M949j551k784j813l334n964N807
6611a938r212l553J919o436n622N291R463J1481k846N786j0480n751P497J3750
6597I349j217j0966O93J278N148K050p865k126N744M098l433r903R49N925k524
6582b800K340o71Q497J0776J866L761o834j2992j263o605j1571p02O208J351m070
6567a2709J136k033l063k25J080J2942O384o732l99O514L561p721q740j078M560
$$ y = [-7229, -16846, -7993, 136, -6597, -13851, -2413, 10025, 8795, -2224, -7937, -7983, -5974, -5779, -6118, -4886, -4071, -14545, -20566, -19265, -22358, -14319, -2132, -453, -6105, -3123, 1069, -648, -3595, -3712, -7792, -10511, -2509, -2774, -9727, -2416, -2134, -8660, -13116, -3946, -6908, -4878, -2255, -4762, 25, 1296, 4289, 4976, 2889, -710, -6793, -7341, -2125, 2752, 7701, 6150, 3366, 1553, -1781, -7745, -1938, -11150, -14703, -12784, -19220, -24842, -19551, -10088, 1393, -1453, 4333, -6147, -11898, -4401, 9349, 8132, -2834, -2141, -863, 4285, 6335, -1530, -3656, 2088, 6186, 2753, -7150, -6201, -276, -2800, -460, -1131, 7366, 18142, 20008, 23769, 16935, 3943, 2680, -3925, -15496, -16198, -9990, -8639, -12709, -11573, -13606, -16669, -16894, -15814, -2872, 3512, -3220, -3619, 2895, 6456, -1265, -10005, -11083, -6523]
6552f523o443k739J193J1746J003j1074J424L744j135j674M415J0770K73p64k595
6537A621K190p14q157j685q085M04R665R859J345q779k925m902l671P925L210
6522b699j1115Q161J2855Q699O965j583p410o624m110R43j726n798J897r23l595
6507f063p095n26r476m271P459J7161J949k979J804r32n045Q415K916J324m351
6492B90n183p533M608J1787p038k817K469n426j113L607P653M23o478L613J001
6477a37M696K909L684k233j1285n802J584j774l024N266j11r85j763l262L297
6462h940O709m438n05M507l300n141N275O306l310L411O51n267R258J0907K185
6447A8308m530j6260j3213k95M373O170Q807q15J4596j059j5861j4694L779j295
$$ y = [-6523, -12966, -15705, -14512, -2766, -1763, -12837, -11413, -7669, -8804, -10478, -6063, 4707, 4980, 4216, 1621, 3811, 3097, -5060, -6745, -14830, -14426, -4761, 5098, 6443, -2336, -5261, -10163, -13834, -5909, -2699, -13814, -5653, 7202, 15901, 22866, 21283, 13873, 7249, 3139, 4082, 2356, -3442, -1545, -2468, -6063, -13158, -13684, -23160, -27431, -19972, -2811, -862, -3841, -2037, -2969, -8014, 401, 3317, 4641, 290, -4893, -12426, -7818, 3969, -3069, -5886, -3417, -8843, -9956, -6349, 1304, 1727, -4751, -1138, -137, 4559, 7468, 11152, 8919, -2366, -8168, -6584, -8358, -11382, -6116, -6227, -7212, -8975, -12237, -8940, -2231, -6669, -7174, -2667, -5967, -11108, -5833, 473, -2837, 574, 1225, -4042, 5216, 16123, 18308, 13778, -2482, -15695, -15990, -11617, -5447, 3360, 2545, 17141, 16082, 221, -14473, -10694, -11989]
6433a1989O122J7013K023m713p059p072j545L941N979p379p941O005L418j830
6419e027o298O92L926k466M111l259K560J7226k534K324m625r054o037j3585l972
6404b6018P555M866N361K690R22K276p79J057L645J2664m328j2520j584n01K905
6389a789N663m122K735r881l407j810n802J241J3174j616J897M097K776j000k267
6374a11k077M27m21M172K822n164k980n025J409k431k409N015M473m801O631j92
6358f62n655l316L335M729n16L451M443M077P39r140p123j0334O044L239J1862
6343E173M553P520j1009n704p823m253k060J664L483J017k348R19L046J430m992
6328i384k483J1295p536k059K496N528m831j1971K274J4151j888N87p009j584
$$ y = [-11989, -5867, 11146, 13169, 8456, 1397, -5675, -7220, -3279, 2700, -4679, -12620, -6615, -3197, -5027, -11325, -10633, -6707, -9173, -5062, -8321, -5761, 11465, 8931, 11255, 6630, -2424, -8461, -22046, -26018, -18463, -13597, -8236, -5546, -4624, -2348, -3127, -2070, 1575, 14239, 9911, -2609, -4193, -4694, -1789, 3874, -248, 2487, -7394, -10801, -12611, -18413, -17172, -3998, -5614, -3717, 380, 3156, 2156, -111, -2188, -1761, -2182, 1990, 4812, -352, -3332, -8357, -6948, -9379, -11788, -6773, -2300, -7101, -470, -662, -6317, -9633, -6298, -1569, -2085, 1366, 5809, 9886, 10625, 1485, -5638, -15972, -9928, -6689, 5173, 9726, 17246, 6237, 533, -7290, -11543, -13603, -11939, -8456, -7439, -9787, -8868, -5822, -4392, -9384, -11867, -572, -8108, -10167, -7671, -2143, -6974, -18945, -16671, -2520, -4408, -3821, -10830, -12414]
6314a2414O667p161m062O844l003L632O25L61j546m826N728J4309P79j965m653
6299f85l470j1501Q04N398l068N928R824L594K316J561m276m989Q88K44j476j322
6283b30N996J335j515J912k930r204k491R28k513j227M911J5454k966r485o619
6268h644k587n086l282K62L556N24j559J0374N366K175M2o721k157k908L179K045
6252e421N973R41k900N032k173n17n786j987r366P18O784m494r854j319K899J6597
6236d873J5482r635j1169q800l527K206o54q970P810J8579L503n447l767K206
6222g056P82J0019P71n949j986n132n869J895P414l835m385m435M351j432M936
6207i911M030k86m60o22n758r97P538O360K732l138P987Q158o369q118p678r107
$$ y = [-12414, -5747, -12908, -16970, -10126, -13129, -9497, -8872, -8511, -10057, -14883, -9155, 5154, 5933, 3968, -685, -4155, -15656, -14852, -9454, -12522, -6594, 3230, 6824, 9140, 10701, 6425, 1436, 2324, 2568, 1092, -230, 5766, 7101, 5586, 7498, 4568, -4636, -7127, -6199, -8712, -9939, -5028, 10426, 7460, -2025, -8644, -11231, -16317, -19599, -19337, -15781, -15257, -16816, -6442, -1076, 1099, 1141, -5580, -7737, -10645, -7466, -5421, 552, 1493, -1407, 3625, 1452, 935, -4851, -6838, -16204, -15486, -8702, -13196, -23050, -24369, -21470, -4873, 10609, 974, -10195, -18995, -22522, -20316, -20970, -29940, -22130, -3551, -48, -5495, -9262, -7056, -6274, 3745, 4516, -1433, -3419, -8551, -14420, -12525, -5111, -8946, -13331, -17766, -13415, -14847, -9911, -5881, -6167, -6627, -7249, -13007, -14004, -6466, -106, 2626, -512, 7475, 15633, 9264, 1146, -6532, -15639]
6191a5639M288K273J386m771O962Q464L951l959j0430p755N413Q457J812P70k539
6176a317J595q75n07P268j727m715m197O608J1219l770K539K749j0412p12n852
6161b106j4542j531J047M844J0245K023J796K417P03J878M64j2448m524P840N458
6146C564o56n64m309N715k220j145l28r246k650R335K671j042L63N483k222O586
6130I335k882l141p292M621O857L865j868O38N765k682p812j2320K468M257j37
6115c28P640P524J354r981j0373j0396O766j524n32k127Q75J934M433m302k861
6100a1898K67l67L205O649N546L732j574k455j639j793P667j874n509J364p102
6085e781r784J3525J2774l364j5141r14Q62m961N430R179J213P264j2298m088
$$ y = [-15639, -11351, -9078, -7692, -12463, -5501, 2963, 6914, 2955, -7475, -15230, -9817, -1360, 452, 1222, -1317, 278, -597, -1104, 6164, 4437, -278, -4475, 2133, 13352, 9582, 12121, 14870, 4458, 3746, -2106, -16648, -18179, -17132, -12288, -2043, -20, 1776, 4193, 4896, 6774, 7238, -5210, -9734, -1894, 3564, 2908, 2344, -1965, 3750, 1530, 385, 57, -9189, -11839, -2504, 167, -875, -512, 4971, 2749, 9335, 6453, 3312, -3980, 641, 7498, 11363, 9495, 10133, 15898, 13216, 5404, -6916, -4448, -191, -328, 7312, 14836, 16190, 6209, -4164, -14560, -7794, -9318, -9850, -11977, -11102, -9168, -4735, -9037, -11898, -11631, -11998, -8793, -2144, 3402, 7134, 5560, 3105, 1466, -327, 7340, 5466, -43, 1321, -5781, -15565, -2040, 10734, 7370, -7771, -8685, -7823, -12784, -7354, 1825, 3038, 10302, -1996, -6084]
6071f084J841R713J3229p809n872N466l296o728q624l450M787O218l219l667l755
6056a1250L823L357o365n519N361M453O265J400N429N233n318j199K844M209K329
6041A5052r733p971J551j874K602j613K20Q724O3m737K017n31j2194q829O44Q568
6025h041M617N197N86j202L82L229j2821j663k282K837O885N68K31M667j1297
6010h107L336K657m155j681l722R022O315J618m276j2339L443q167M788P890K695
5995f83P313M700j517j926n13M785N361r723k508k802K682l823j2550j0513M694
5980a7023K242K530l350l59P193M110R29J404J2116O507l685j6159j4427K358
5966a5614q171k559O550J3654N065j868J213O660J4K131k475n714r971m140N310
$$ y = [-6084, -4243, 5470, 18699, 10890, 5018, 10484, 7188, 460, -8164, -11614, -6827, -609, -3828, -7495, -11250, -7427, -4070, -10435, -15954, -10593, -6140, 125, 1525, 6954, 12187, 6869, 5670, 8514, 12723, 15052, 5319, -2652, -1101, -2975, -373, -1986, -1766, 6958, 7021, 2284, 4301, 3770, -8424, -17253, -16609, -8041, -3424, 1773, 2359, 1157, 1539, 4768, -8053, -9716, -11998, -9161, -2276, -1708, -1477, 3190, -8107, -4771, -2114, -6269, -7950, -11672, -2650, 3665, 5283, 1007, -11332, -7889, -16056, -11268, -3378, -683, 6630, 11330, 9813, 7887, 7374, 12159, 17520, 7797, 5289, 2487, 5169, 1346, -11204, -21717, -17023, -14781, -12251, -15601, -15960, -8767, -4657, -3728, -2324, 9792, 16299, 12614, -3545, -17972, -15614, -23785, -26344, -19794, -6140, -1075, -2943, -1730, 4930, 4944, 7075, 4600, -1114, -11085, -15225, -9915]
5951i915K214p089m085l220j747K228Q980L453N1O54p52R363J576K447L161N58
5935G877q987j804j280n048K352J1373m614m311k477L47r178j335R753J2712l61
5920E019l410J133J374K99K300j176L401n817k6M640q119O231p025o739M906k586
5904e595J362J1448M582j748n54n417k951m632L387o184r575J3630k33m474N275
5889a679M229n589n647M872m398L291l146M066L866R30Q0N830K546n077k013j362
5873G99P516O47j102K203L552o530n28N465k341j0384j2628J478P585k509K774
5858d003l55n314k588J189L0L184n618J57Q998M907J954k183J703K180k918M761
5842F084n052o073m15R850O611K110l842j081j753m986l93K536k092l785k848
$$ y = [-9915, -7701, -14790, -18875, -22095, -23842, -21614, -12634, -9181, -9130, -8476, -9228, 135, 1711, 4158, 7319, 7877, -1110, -2914, -4194, -9242, -6890, 4483, -131, -4442, -6919, -6572, -15750, -17085, -7332, 5380, 5019, 1609, 2742, 4116, 4415, 6715, 5539, 8940, 3123, 3097, 7737, -382, 5849, -1176, -7915, -3009, -5595, -4233, 7215, 11797, 10049, 9495, 4078, 1127, -3505, -118, -6302, -15877, -2247, -2480, -6954, -1679, 2550, -3039, -8686, -3814, -8212, -4921, -8067, -4001, -135, 795, 875, 6705, 9251, 4174, 2161, 799, 8315, 8962, 7860, 10063, 13615, 7085, 6557, 12022, 9681, -703, -13331, -11853, -4268, -6777, -4003, -4358, -9672, -12260, -11071, -11041, -7857, -13475, -13318, -4320, 587, 2541, 358, 2061, 4241, 1323, 6084, 1032, -5041, -5456, 4394, 11005, 13115, 9273, 8192, 6439, 1453, 1060, 3596, 1504, -2281, -5129]
5827e129O304O295O526j178l034j5603j4899L349J148j505k084o959J0901R806
5813f062R890J0964j0970n742N601Q081k05J244m231m836K658k721p130l916n856
5798a3231N19m42O398J0575M46M299l957p97J1236J947j1019o098o768J165k288
5783h015l913J232M690J2209L979m079L49r573n652J1830L724k884O351k18n698
5768D332K588P0q164O04K294n494J426N170M407l716O3m323m651l879P700N60
5752a013o63k308K078R725l883n116j0479m112J2303R098j5836l379M63K67N32
5737a2323N907j65q081j140K650L874K49J37P591L885J328j0730q366N389J8391
5722H596M951l022q061n205L142R47k03j250j915P667k021o990N420Q93n178N384
$$ y = [-5129, 1175, 7470, 13996, 12818, 9784, -5819, -20718, -17369, -16221, -17726, -19810, -26769, -15868, -6062, 3828, 14792, 3822, -1920, 3681, 11762, 11557, 12801, 8570, 3734, 6392, 3671, -3459, -7375, -13231, -12712, -13154, -6756, 3819, 4265, 8564, 4607, 3810, 15046, 16993, 5974, -124, -6892, -5727, -8015, -11928, -10696, -6006, 6203, 10182, 6103, 6452, -3121, -8773, 3057, 6781, 3897, 10248, 10030, 4332, 6920, 6990, -1174, -570, 1724, -3770, -2344, 2826, 7233, 3517, 3580, -743, -5394, -9273, -1573, -1013, -1676, -3984, -1906, 7819, 3936, -1180, -11659, -15771, -3468, 5630, -10206, -13585, -13122, -12855, -12323, -6416, -6581, -14662, -15802, -13152, -9278, -9029, -8892, -1301, 2584, 3912, -6818, -15184, -9795, 8596, 13547, 10525, 2464, -2741, 401, 1348, 1145, -105, -2020, 5647, 3626, -3364, 2056, 2949, -2229, 3155]
5706C155l53N50L608m052j608K749n395p88k195K951o597j541L737O265r45q46
5690a305P328l87j5045l048Q621Q41O319m632m250J042p796k082N547J0471J2655
5675A4279N589m941j0724Q672J233L289J9j2100j5654j425K109k529n112j903
5661a9198N975J641L161m873P857K010M155o74j324L228J507o52j4840j009l401
5646a6437J070R888J74m987M767l329k075l88L927L434r326L754J3213M184J0261
5631A8130N747p450m344j2630k254r14o410L540R635N010R430k412j0065j896
5617C117J756j0124L212K195j564k893M678R89n66o773m77j646o321j265L386
5602a2296l59n038N398L282J2304K13J0066l248l180L897J002j448j0279o605
$$ y = [3155, 2802, 3352, 6960, 2908, 1300, 4049, -1346, -2134, -4329, -1378, -7975, -9516, -5779, 486, -459, -1305, 6023, 5636, -9409, -12457, -3836, -2995, 3324, -1308, -5558, -4516, -12312, -14394, -8847, 1624, 14279, 19868, 14927, 4203, 12875, 14108, 17397, 17416, 5316, -10338, -11763, -9654, -12183, -17295, -19198, -13223, -11582, -8421, -13294, -5437, -3427, 728, 54, -1270, 1958, 3465, 2813, -12027, -13036, -16437, -15367, -5479, -5305, -10292, -5525, -8854, -10929, -11317, -7390, -3956, -13282, -9528, 3685, 7869, 18130, 23877, 16427, 12083, -547, -2801, -3715, -10125, -6585, 3050, 8060, 17490, 15078, 5013, 3117, 4873, -5251, -2039, 156, -1408, -4301, 377, 1366, 800, -5973, -6450, -8096, -14417, -15682, -12296, -12655, -17693, -12295, -9013, 3291, 3504, 13570, 10322, 7142, 11039, 12041, 10593, 314, -6291]
5588f291n220J72J757P547j0618l231K063L223J531J080L842O181m115J152L651
5573B724j608l45L647M037n228m091n278J423J2337Q515l789n186P559o274j1560
5558c117k310l820k619l15m166J435O227J495o044M565K579J393O398K725J105
5543E531N478m373p95Q214M943l271j083M316l987q058o915n988R338M928l796
5528D482L310O27r369j0181j87L524O771M13k768K014P552L313j0854o077j191
5513h621m658l56M297L334J634O442o438p965k682R031M987n913M228J0591M866
5498A2777Nj2955N188N343O079J762r398r086l797k591J1503l846n563J969k556
5483e166n918N052J031K642L603m494r710P340O391K41M574k697J0334Q305n534
$$ y = [-6291, -11511, -11339, -9582, -2035, -12653, -15884, -13821, -10598, -9067, -7987, -4145, 2036, -2079, -927, 2724, 1116, 771, 4418, 8455, 3227, -864, -6142, -4719, 7618, 16133, 12344, 7158, 14717, 8443, -3117, -5427, -9247, -11866, -12181, -16347, -14912, -8685, -7190, -13234, -8669, -6090, -4697, 1701, 4426, 5531, 11009, 6636, 5841, 14055, 18998, 15727, 14644, 18960, 14973, 6915, 0, -5988, 3350, 8278, 4482, 7792, 8419, -950, -11131, -11318, -7794, -1023, -610, -3378, -1364, 6188, 9501, -1353, -7430, -8621, -13279, -13635, -9338, -6004, -4370, 2072, -4366, -12331, -15013, -5982, -995, -6908, -2680, 7911, 12777, 12782, -173, 5015, 10358, 16437, 18199, 8801, -285, -4082, -6673, 4830, 984, -4579, -2610, -5166, -11084, -6032, -5001, -2359, 1244, -3250, -12960, -5620, 771, 1012, 5586, 2889, 13223, 21528, 15994]
5468A5994n845k095K396O354j315k688l882j2094L356K493K03j454L299N479M874
5453A5075l1p85n512J795m167o812K122j684L712M317m949r230j241L944R389
5438E943o961q333k016j17J1586l145n699M926K435Q948K112q521p993j741m524
5423a3100n76L254j505J74M764M922j576R24L003M286j0130p591q849k844K5272
5408D28R235K817n192o432p576L027P999l92L447R661n450j4349j2369p202N879
5393a6469O892P839k89M638k861j0330k106k111M518J5776J4604n847r100k653
5379B501l313L75k993J555J1346m770r117l042k139O922j838n341K646j631N75
5364h264k255Q271R941j284j1949n554L196N102M586N160Q129l487q688j514r303
$$ y = [15994, 10149, 8054, 10450, 16804, 15489, 12801, 8919, -3175, 181, 2674, 2877, 1423, 4722, 10201, 15075, 15044, 14259, 8747, 10542, 6375, -437, 1685, 1, 3713, 8030, 3081, -6149, -7390, -3446, 5943, -1018, -9351, -11367, -11484, 102, -3043, -8742, -3816, -1381, 7567, 9679, 1158, -6835, -8576, -13100, -13676, -10422, -11927, -11753, -6989, -2067, -3643, -2719, 284, 4570, -5560, -13151, -22000, -24844, 428, 9663, 12480, 7288, 856, -6720, -3693, 4306, 3914, 7361, 17022, 11572, -2777, -15146, -22348, -16469, -9577, -1738, -2027, 2611, -250, -10580, -12686, -14797, -10279, 5497, 20101, 14254, 5154, 2501, -812, -437, -3430, -1875, 9471, 4701, -4416, -7458, -9597, -2675, -4513, -9854, -7208, -8839, -8264, -10519, -2248, 7693, 6409, -5540, -11094, -7898, -2796, 1790, 6950, 15079, 11592, 2904, 1390, -7913]
5349g913J917L951n59J782P31N242M584o230j1706j030k199J303O143O693J247
5334C956K835O66K100n844p434k867j123J695K330k134m328M825K50N237J697
5319A861j329q597L71Q392j939K565R05O554O17n563n735q18p30K711L094k71
5303B088m263j265n495m848k293K790l034P880J252j0174L165Q458P761Q867m978
5288E911j0770N214J259p106O018J502P36j813n859M686m717N212J0260k907j969
5273E657q884L263P008k182j5821n693K446K10N764L987k570k484N678j140M120
5258f41L769R495k843p793m290K195n896n859p093L692P91K71j0904l492J1809
5243a6789J3806M47p357L779J0037l905o807q849J193l973P596N085K586K843
$$ y = [-7913, -5996, -2045, -2604, -822, -91, 5151, 9735, 3505, -8201, -9231, -11430, -10127, -3984, 2709, 3956, 6791, 7457, 9557, 3713, -3721, -6588, -7711, -6016, -3686, -5820, -10148, -5323, -5073, 164, 1861, 532, -8065, -7694, 698, -1241, 1324, 2229, 8783, 9400, 3837, -1898, -2716, -3446, -735, 2359, 2088, -2175, -3440, -8935, -13783, -16076, -13286, -16320, -8440, -7188, -17362, -14197, -5739, 2022, 10889, 5911, -4859, 355, 1614, -5492, 526, 2028, 2764, 951, -4908, -222, -4939, 273, 10533, 7626, 5657, -3227, 36, 7044, 4862, -10959, -16652, -14206, -13996, -8232, -4245, -6815, -9299, -3621, -4761, -641, 3128, 12623, 9780, 1987, -2303, -108, -6004, -11863, -18956, -15264, -14473, -14202, -25106, -28598, -16789, -2983, -2536, -9893, -6114, 3923, 18, -6789, -15638, -14445, -18418, -10822, -5737, -3151, -308]
5229c08n162J446j456k097m865l946O853J1550O48j945j279Q64o560r086j783
5214a7126K745J5560J2747o563l253j2540O144L877m781L867L545M011k294j3267
5200g328o428N232Q744j083O174M226J016p398k300K150L228r206L275Q654k0
5185H936n262O06k444l166k489J543J541N923l75o355L16p505O444N469p463n582
5169i863j668J321M379j21J653J049J2590O363p000l196o757k99j897j634M721
5154c59L281j917R66o98O866K744k83k163l507K228k521K798L680J75m863j636
5138D791j794l569O560M272k768k510l640p454j345M757L907Q532k133o386r552
5123h332k935K271M075M306r60n413P58j334O727M331r740J12N355n346O202j964
$$ y = [-308, -5470, -4024, -5480, -7577, -12442, -16388, -9535, 2015, 2663, 718, -561, 303, -6257, -15343, -17126, -14381, 1179, 13926, 7363, 4110, -8430, -2286, 1591, -3190, 677, 4222, 8233, 5939, -7328, -13756, -8524, 220, -863, 5311, 9537, 10553, 3155, 855, 3005, 6233, -2973, 302, 8956, 8936, 3674, 4280, 1836, -1330, -3819, -2276, -735, 5188, 4813, -1542, -1226, -8731, -2287, 3182, -4281, -9863, -11531, -10210, -5831, -5952, -4299, -3250, 9340, 15703, 8703, 5507, -1250, -1549, -3446, -5080, -359, 2922, 1005, 1971, 1273, 8139, 10883, 10600, 8437, 4930, 7158, 4637, 7435, 11115, 11290, 6427, 4791, 2997, -572, 5988, 10260, 7492, 4982, 1342, -6112, -7457, -2700, 1207, 9739, 7606, 1220, -8332, -11267, -8996, -4921, -615, -1575, -6988, -6230, -7564, -837, 3494, -6246, -6134, -779, -6125, 77, -1887]
5107a887j0240R910Q651p096k517J650l587L336M458K764k144l917K629O202l861
5092D351j708K646q709k339j154o686j385J689K0946L645p373j3165l823k264
5078a5329n898O515M791J496q719J137O286J638O21p264j552K956O547n3n83O212
5062a199J067N61m980q099J294m562n357M661Q562L713N799k102M046N184j2686
5047d098k381n052M674P723J446j925P51M231o558j275J278j006K507k59n19J295
5031H32l411q330M906M797m69o392m606m745m362j800O762Q876P038m99j145n1
5015b599o54Q64p68n412o963j577N010O30J2414N759J300n691Q195R986p580n372
4999G542l97k019r275n199j1300K40N389Q029L236l196L21j860p036N574m261
$$ y = [-1887, -12127, -2217, 6434, -662, -3179, -1529, -5116, -1780, 2678, 5442, 3298, -619, 2010, 8212, 4351, 2643, 5289, -3420, -5759, -6913, -13599, -14984, -13295, 7651, 11296, 3923, -9242, -13065, -15329, -21227, -14712, -9921, -8425, -17144, -16007, -9721, -8083, -7462, -14726, -16278, -13322, -6775, -6828, -7411, -1199, -132, 429, -4551, -12650, -11356, -15918, -21275, -16614, -8052, -4339, 1460, -642, 3404, 8588, -4098, -6479, -11531, -6857, 866, 2312, 387, 1138, 5369, -1189, -2464, -1186, -2192, 315, 56, -463, 832, -2579, -10909, -6003, -1206, -1675, -8067, -12673, -17418, -21780, -23580, -16818, -7942, -904, -1403, -2548, -2599, -3253, -2389, -3157, -8569, -15532, -17109, -12099, -11469, 945, 6704, 8004, 2313, 10508, 20494, 12914, 7542, 7145, 5126, -4149, -9348, -20648, -20408, -15019, -6990, -3754, -6950, -6629, -8489, -15525, -9951, -14212]
4984a4212n188jJ2275J417l115m172k670L725R133l894p097Q280Q007R33K111
4969E532l3r364q85n357J1021N895j1011o824K384N468L638P22j139l347l316
4954f616q703O701N806O159M624p772l891J975K878o168j0761p647K269J1283
4940i863R180O761M395K141j1265m831J749N787n007o617Q115O834M984m443o903
4925A017M450j663j3414q742Q995J3439n815K669k7P37k066q43O387Q968p294
4910F798q612N789J0787j753M3l481l293l540m692Q94Q685L046r762j3155O182
4895f064M73o743o72Q185L771M519m303K063M866K365K970q346m01k335q286J737
4879f201O503n809l905O3j777N539Q826j615o982j283M542m934m564O257j91Q47
$$ y = [-14212, -19400, -19401, -7126, -5709, -8824, -12996, -15666, -11941, -2808, -6702, -13799, -5519, 2488, 3421, 5532, 5499, -3865, -4750, -10107, 914, 6809, -4202, -11026, -8642, -3174, 464, 1186, 47, -3300, -6616, -15319, -8618, -2812, 3347, 7971, 199, -3692, -1717, 1161, -5007, -15768, -23415, -21146, -9863, -683, 6078, 10473, 12614, 1349, -3482, -1733, 4054, -953, -7570, 545, 7379, 12363, 7920, 1017, 5467, 3804, -9610, -18352, -9357, 4082, -1733, 936, 909, 1646, -420, -1263, 5124, 14092, 6798, -1814, 3975, 14762, 13009, 13052, 9571, 6278, 2738, -1954, -1060, 7625, 10671, 909, -12246, -6064, -5591, -12334, -13006, -4821, -1050, 3469, -834, 1229, 6095, 8460, 11430, 3084, 2683, 348, -7938, -6201, 302, -5507, -9412, -9349, -11126, -5587, 3239, 1624, -5358, -6641, -2099, -7033, -11597, -5340, -5531, -4684]
4863d684K992M373R3m735n648L835r743r559k83J0730k173LR631N141o240m866
4847a1133j562l928J4364j166k601j724J233L912o863k03R532m114n648N946K96
4832c659p031l9p50o690L278P104O650O667m811q88n60M537J633q113q186P757
4816c101j178l080L36k552K766K765o409J754J1177J7750J32j2485j4595o868
4802a3588n491n901J4932P648N514K765n583J818N548K650k87o026l641p22m107
4787d471n583J276J7170P671p62o209J585m766m244L93j822m883j762M121n41
4772b827K89O124K375p677j2147n294Q72K652Q82o813k276J5553j961j131Q140
4757c239j091r328Q385j175j0801K081L485N156Q270P434N69m426r069q945m969
$$ y = [-4684, -1692, 2681, 2774, -1961, -7609, -3774, -13517, -23076, -23359, -12629, -14802, -14799, -5168, -27, -6267, -11133, -12695, -16623, -2259, -3425, -6026, -7750, -6517, -2605, -9468, -9671, -139, -4253, -9901, -3955, -3659, -10690, -10729, -11479, -18169, -14891, -7787, -1137, 5530, 719, -169, -729, 3808, 5441, -2672, -10858, -3101, -4279, -7359, -7023, -9575, -6809, -4044, -10453, -8699, 2478, 20228, 20360, 7875, -6720, -13588, -19079, -24980, -10048, -2400, 3114, 5879, 296, 2114, 7662, 10312, 10025, 3999, 358, -364, -4471, -10054, -8778, 8392, 16063, 15301, 9092, 10677, 5911, 1667, 2060, 238, -4645, -6407, -2286, -2827, -2538, 3586, 5961, -1716, -13863, -19157, -18285, -15633, -14751, -21564, -23840, -8287, -10248, -11379, -3239, -4330, -13658, -5273, -6448, -17249, -15168, -11683, -6527, 1743, 9177, 9746, 5320, -3749, -12694, -17663]
4742a7663P50M847R196K613m902J363L115K277q415R46O961j935J860L35M096
4727E444l671p835n933P412P989m480l514j943l322j675l824J203q584K638O901
4712a3194O710K177K510Q578J274m282K475m984r776K154P390J3072k395j2236
4698e27q570q691k713M637m501R759L029L976L843p430j886O197K229O388P63
4683F503l715q146M947P502L997N651p422o549q449P360j717m802M951P54N413
4668F278L802k021k485o522J764N038L172J620l552o688JP184k648r524K324Q172
4652E915j71m613l604p462L736N364o631M322M836R576O718m31j5256j3160j771
4637a2632O37N46j221k210j401J626J0297P354J0679k661j154P498L35l005k851
$$ y = [-17663, -16913, -12066, -2870, -257, -5159, -3796, -681, 1596, -6819, -5873, 1088, -847, 1013, 1348, 5444, 1773, -6062, -11995, -4583, 3406, -1074, -4588, -6531, -9853, -11528, -15352, -14149, -22733, -20095, -13194, -6484, -4307, -1797, 6781, 8055, 3773, 6248, 1264, -8512, -6358, 1032, 14104, 11709, -527, -9097, -17788, -20501, -15864, -20365, -10606, -7577, -3601, 242, -7188, -9074, -2877, -648, 5740, 6503, 2788, -5358, -411, 7091, 11088, 16739, 9317, 2768, -5681, 1679, -38, -4840, 111, 865, 6278, 10080, 8059, 5574, -948, 816, 5854, 9026, 10646, 7094, 406, 407, 7591, 4943, -4581, -2257, 5915, 5744, 1131, -2473, -9935, -6199, -835, -7466, -3144, 1692, 11268, 17986, 17555, 2299, -10861, -12632, -11995, -11449, -12670, -14880, -16281, -14655, -4358, 2996, 13675, 11014, 9860, 17358, 17693, 14688, 11837]
4622A1837M825l015p30n42M310n534o765j060n581m039J322Q596o41K82M95n58
4606C202q343m573L90Q198N769j959j0537m509k655P687p104L342N481j0068M950
4591a0729l334P061J2890j446j4331o93O188L61K917O911k846j962J25J966J888
4576D966J205o353l606j2577N888J211R08k241J0224R15j883N675l013M03L268
4561D990M462m521q146m191l00J613j759N03L047O619j725J117k327r844k24K254
4545h432k266L795O475L957L825j860p051P145L278m38q69L39P88q95o396k817
4529a422J0792o480j0486N310M573j6672o826O909n60j3070Q029J3662Q425n39
4515A645L802J0331R88q174k831m187O75l497n010o594p57Q60L138K202o632P194
$$ y = [11837, 16662, 13647, 12917, 12375, 16685, 11151, 4386, 3326, -2255, -6294, -4972, 3624, 2983, 3265, 3760, 3202, -5141, -9714, -9324, -1126, 4643, 2684, -7853, -12362, -15017, -7330, -14434, -11092, -5611, -15679, -10729, -14063, -7002, 5888, 4442, -9889, -10582, -4394, -4033, -1116, 5795, 2949, 987, 1112, 3078, 4966, 6171, -182, -3788, -16365, -10477, -9266, -8358, -10599, -375, 540, -1343, 4332, 1319, 1722, 4990, 9452, 4931, -3215, -7406, -7706, -6093, -7852, -7349, -4302, 2317, 592, 1709, -618, -10462, -10686, -8432, -10698, -6903, -428, 3529, 7354, 5494, -1557, 5588, 8866, 8428, 7559, 7898, 8686, 7791, 1395, -1422, 9370, 2890, -7596, -2286, 2287, -14385, -21211, -14302, -14862, -27932, -19903, -6241, 2184, 1645, 5447, 15778, 16766, 8592, 5761, 1574, 2249, -1248, -6258, -12852, -13609, -12749, -9611, -7409, -14041, -6847]
4499f847n149m70O267N536o469j480l97L239l070q074O11P735P288Q442J832o564
4483B430K173K940k762n317L579N566l968l274L374o730N482j638p606m415Q884
4468a282J3518M455l304p052o401j433N938N548N301n186o223p44j254j701r207
4453i027m152M068N778J588j4735j285O655l165j3503O125O954P525N383n31o265
4438h587p140N095P843M55m491L065L983R31r45J966j3413n877m901N411Q452
4423h153J4427J16l859q722p690O419L015L129k104m449K483j828j979n23k504
4408a2222O563P252o514k194L24M648R641l19L211j986k605m142n70l21j52K384
4392B998M413l035k887J661k431m708l385n05l335o014K60J115l788L347J2173
$$ y = [-6847, -11996, -12466, -6199, -663, -7132, -8612, -9009, -5770, -8840, -16914, -16303, -8568, -1280, 7162, 8994, 2430, 4603, 7543, 4781, -536, 3043, 8609, 4641, 1367, 4741, -1989, 3493, 1855, -5751, -10166, -1282, 12236, 16691, 13387, 6335, -66, -1499, 4439, 9987, 15288, 10102, 3879, 3135, 1881, 180, -9027, -13179, -9111, -3333, -1745, -16480, -17765, -11110, -14275, -27778, -21653, -14699, -7174, -1791, -2322, -8587, -15727, -10632, -2789, -2334, -6825, -3760, 223, 1154, 209, 2175, -11238, -17115, -22016, -16605, -8153, 6274, 6390, 2531, -6191, -13881, -7462, -4447, -1318, -3422, -7871, -5388, -7216, -9195, -9718, -12222, -5659, 1593, -4921, -7115, -6791, -2143, 7498, 7179, 10390, 8404, 5799, 1657, 1087, 766, 614, 2998, 7411, 4376, 1489, 3150, 719, -3989, -7374, -7879, -11214, -17228, -16968, -15853, -19641, -16294, -4121]
4377d121K340j471J514L258Q109J262n680m224P704j469m703j1691j0904k311
4363b2387Q922O537N000n36k132o989q90N817K029L007k344l318L427J271R418
4348F832Q969P029Q79n350n484q030J204r68k962l983k216n85M86Q46M265J499
4332B431m732J645n588j244J4348Q993J625m218L663j2417p760J184Q193J4450
4318B0573N344O074o225r114n598o508q806p2j187J865n765n594K363M417L429
4303d804J2331J1628n406j405j274k307p872j907O100j685P810J816K530j1572
4289C983j1392m109k175L088P152Q234M594l620J1189l604j839J649n76Q787k606
4274A8755r576q567P87Q174R47j433o133r52j516l874N769K179k154k180P462
$$ y = [-4121, -1781, -3252, -1738, 1520, 9629, 10891, 5211, 987, 8691, 7222, 2519, -9172, -20076, -22387, -13465, -6928, -1928, -2464, -4596, -11585, -12475, -6658, -4629, -1622, -3966, -7284, -3857, -2586, 6832, 15801, 22830, 23709, 18359, 12875, 4845, 6049, 5081, 2119, -1864, -4080, -4665, -4179, -3333, 932, 2431, -2301, -656, -6244, -7488, 6860, 15853, 17478, 13260, 16923, 4506, -3254, -2070, 6123, 20573, 25917, 31991, 25766, 16652, 11054, 4546, -4260, -4332, -5519, -3654, -9419, -15013, -12650, -8233, -4804, 7527, 19155, 13749, 12344, 11070, 8763, 891, -1016, 5084, 3399, 11209, 13025, 15555, 3983, -7409, -11518, -13693, -10605, -3453, 4781, 9375, 5755, 16944, 13340, 11501, 13150, 12574, 21361, 18755, 9179, 612, 1399, 9573, 10520, 9087, 2954, 2002, 486, -3388, 2381, 4560, 2406, 226, 7688]
4259G688k064k157M857q663k474L925N221k85l113k354M648k35N221m996m710
4244E09l77m07p29L499M161J449n502j142n849K201j0299m034P620N264K41K061
4228a334M948m954K971K908J154K039j409n903r769m098M328L804n199L064L462
4213c988J086Q00J1028m412n347O228Q340M2l527k013j565r785k1630n796Q902
4198b1637J1007Q144l094N335N720n67k832m5J628l548K03P11J1182n121l958
4183C128Q286o198k170N217k548r2K333l569L464j159j2712M017M691k931k339
4168b582M507l632k760M80J6916M912q607q728k097n063l325N669R864k395j2526
4153i367o296m074J1700J0305j1147o509l678R972O618j377m84J246J2334M080
$$ y = [7688, 5624, 3467, 8324, -339, -2813, 1112, 6333, 6048, 2935, 581, 5229, 4994, 10215, 5219, 509, 132, -275, -1004, 2495, 6656, 8105, 2603, 1461, -4388, -2187, -12486, -16520, -8900, -3636, -3395, -1334, 3614, -1340, 1631, 4539, 5693, 7732, 6323, 420, -9349, -13447, -9119, -5315, -10514, -7450, -3988, -2902, -2102, 8926, 4514, -833, 5395, 13735, 13777, 10250, 8237, 6672, -3113, -24743, -30539, -21637, -10630, -2486, -5580, -245, 5475, 4908, 2076, 2031, 3659, 111, 314, 1025, 12207, 7086, 3128, 11414, 5216, 3046, 8263, 5715, 5623, 7956, 4387, 7851, 6692, -6020, -2003, 2688, -243, -2582, 1925, -1707, -4467, -3987, 12929, 17841, 9234, 506, -1591, -6654, -9979, -4310, 5554, 3159, -9367, -15663, -19737, -8037, 2268, -8879, -15388, -19066, -9094, -2476, -3853, -4337, -3091, 9243, 13323]
4139A3323n717q192p729l099J645J2935L834n915L045P544j0506n882r457l780
4125a7951J0407J4267m699j994L63j211n949O846P739Q10n752K267K424J0385
4111A7952p605o468q304k173n59L152N018o06R010l152r660l430j256K023J6770
4096A0712J038K101l953M17K297J979n858q640r126M316k007n378M646M095m6
4081c407N41M886L301O005J150k289n820p724n622J379l098j554K22O457R311
4066C738J7363q126j2076p706m984L460j276P55Q032N707l595M53n117p516K62
4051a0626R52J2863m285l16p244k768l050j633O233Q570p33p593J043K834M813
4036i40l858N195R764J841m420j4433M229M469m291m608n478l956J168L530l841
$$ y = [13323, 7606, -586, -8315, -11414, -9769, 3166, 7000, 1085, 4130, 11674, 1168, -4714, -14171, -17951, -7544, 6723, 2024, 30, 393, -818, -6767, 79, 7818, 8628, 2876, 5143, 7567, 17952, 10347, 3879, -4425, -6598, -7157, -4005, 1013, 407, 9417, 6265, -3395, -6825, -8081, -6058, 10712, 11750, 13851, 9898, 10315, 12612, 14591, 8733, 93, -9033, -4717, -6724, -12102, -7456, -3361, -3407, -2866, 2020, 5321, 11326, 12476, 10187, 4367, -3357, -8979, -7600, -10698, -12252, -12030, -5573, 3738, 21101, 12975, 899, -6807, -11791, -8331, -9607, -8852, -820, 4887, 1292, 1745, -3372, -10888, -10626, -9674, 3189, -1096, -1412, -8656, -11424, -14474, -16107, -9874, -1304, -2037, -9630, -8587, -5753, -940, -4798, 397, 10161, 12002, 7582, -6851, -2622, 1847, -2444, -7052, -12530, -16486, -15318, -11788, -15629]
4021a5629k964M133M301L902M991L105M122J973r317N755Q264R76l807K454J265
4006A3524J7j927l408l321j360l5K047o835r908J290P98J0927M246m779p772L785
3990b711j01o931l679O96k503J2840K899k643K860l683k97o822k625O195R995
3975C490M12l733j65K328L593J1472j782m027o874q703p640n707N878j0k087P092
3959f463L071L287n852p127J0109K366l27j342k138j916P000j983q494n109M621
3944a0297J485R588P933o106N146J833l107m58j6423j0255P987O514l947N454
3930d653Q517k278q877K78K211L98m379j0201q186P694J0968l449O265Q43N995
3915A146J660M80n231J460O83m245K758J581l802J995O893n052P079J1622j045
$$ y = [-15629, -18593, -14460, -10159, -6257, -1266, 1839, 5961, 7934, -1383, 4372, 12636, 13612, 9805, 12259, 13524, 13541, 11614, 8206, 4885, 3525, 3490, 5537, -1298, -11206, -9916, -9118, 1809, 6055, 1276, -6496, -2711, -2812, -9743, -13422, -12726, -15229, -2389, 510, -2133, 727, -2956, -3253, -10075, -12700, -6505, 3490, 3902, 169, 4, 2332, 5925, 17397, 15615, 11588, 4714, -3989, -11629, -17336, -11458, -11468, -13555, -6463, -3392, -105, -5957, -13084, -2975, -609, -936, -2278, -4416, -6332, 668, -1315, -9809, -14918, -10297, -8812, 776, 8709, 2603, 7749, 9582, 6475, 6017, -10406, -20661, -12674, -6160, -10107, -4653, 3864, 1586, -7291, -7013, -4802, -4404, -8783, -18984, -27170, -19476, -8508, -11957, -5692, -4849, 1146, 2806, 3286, -1945, -485, 198, -4047, -1289, 292, -3510, -1515, 5378, 326, 7405, 19027, 17982]
3900A7982j2626m261J415K350n875j0137k774k914l081K776K894L500P163j141
3886d729K756p310m334L9Q338J04k203j228Q957k78P389o432q289p965K850k183
3870a4518J3011N687P06n506m939M638O735j511l696J478m553M663J1797M220
3856A8212j12J509l722q512Q40j865n423L488k94r438M863K338J023j095R037
3841A0849j375j0358j2502J0776m197l004j0832J900J3463M40j007o05K031r730
3827a4151P16J2374K521N712J638j46j792r904R97Q9M189P242j337L098m511n281
3811A454j0006m008N904J1109J2088K629o06j0430n566N463J222n826r509j258
$$ y = [17982, 5356, 1095, 2510, 4860, -1015, -11152, -13926, -16840, -19921, -17145, -14251, -10751, -3588, -4729, -1973, -9283, -13617, -13578, -5240, -5136, -7339, -8567, 390, 112, 7501, 1069, -7220, -15185, -12335, -14518, -1507, 4180, 4886, -620, -5559, -921, 5814, 4303, 607, 2085, -2468, 2195, 13992, 18212, 18100, 19609, 15887, 7375, 8215, 6350, 927, 4415, 4121, -5317, -454, 1884, 2907, 1812, 10849, 9474, -884, -13386, -2610, -6807, -9811, -20643, -18743, -5280, -4840, -5847, -6452, -4421, -14151, -13435, -1061, 1460, 7172, 8810, 8664, 6872, -3032, -2035, -1946, 2243, 9485, 8148, 11246, 6735, 1454, -8552, -12560, -6656, 4453, 16541, 19170, 18564, 8134, 2568, 8031, 9253, 3427, -6082, -7340]
$$ [...]
##END NTUPLES=NMR SPECTRUM
##END=
