##TITLE=Analysis number 330082
Compound Code cc 27101
Project Code adrs lab3
Chemist Name stores
##JCAMPDX= 6.0         $$ Bruker NMR JCAMP-DX V2.0
##DATA TYPE= NMR SPECTRUM
##DATA CLASS= NTUPLES
##ORIGIN= Bruker BioSpin GmbH
##OWNER= nmr
$$ XWIN-NMR		Version 3.5
$$ Thu Oct 25 09:13:37 2007 GMT Daylight Time (UT+1h)  MAYBRIDGE\nmr@NMR_250MHZ
##.OBSERVE FREQUENCY= 250.131544655141
##.OBSERVE NUCLEUS= ^1H
##.ACQUISITION MODE= SIMULTANEOUS (DQD)
##.ACQUISITION SCHEME= undefined
##.AVERAGES= 16
##.DIGITISER RES= 18
##SPECTROMETER/DATA SYSTEM= dpx250
##.PULSE SEQUENCE= zg30
##.SOLVENT NAME= DMSO
##.SHIFT REFERENCE= (INTERNAL, DMSO, 0, 16.522)
##AUDIT TRAIL= $$ (NUMBER, WHEN, WHO, WHERE, WHAT)
$$ ##TITLE= Audit trail, XWIN-NMR		Version 3.5
$$ ##JCAMPDX= 5.01
$$ ##ORIGIN= Bruker BioSpin GmbH
$$ ##OWNER= nmr
$$ C:\u/data/dgb/nmr/ADRS/1340/pdata/1/auditp.txt
$$ ##AUDIT TRAIL=  $$ (NUMBER, WHEN, WHO, WHERE, WHAT)
(   1,<2007-10-25 09:13:13.74 +100>,<MAYBRIDGE\nmr>,<NMR_250MHZ>,
      <created by zg, POWCHK disabled, PULCHK disabled
       configuration hash MD5:
       76 6E 9A 78 1E 09 19 81 EC 84 63 8F B0 6A 59 2D
       data hash MD5: 64K
       82 00 4B C6 62 5E E4 9B C4 93 26 EB 20 66 C1 8B>)
(   2,<2007-10-25 09:13:27.74 +100>,<MAYBRIDGE\nmr>,<NMR_250MHZ>,
      <Start of raw data processing
       ef LB = 0.3 FT_mod = 6 PKNL = 1 SI = 32K 
       data hash MD5: 32K
       38 1D 62 BB 36 67 29 E9 CA 78 62 EE 7A 11 36 AA>)
(   3,<2007-10-25 09:13:29.27 +100>,<MAYBRIDGE\nmr>,<NMR_250MHZ>,
      <apk 
       data hash MD5: 32K
       06 7F 96 F9 4A B7 32 B3 CE B8 3C 8F 9B 7F EB FB>)
(   4,<2007-10-25 09:13:29.99 +100>,<MAYBRIDGE\nmr>,<NMR_250MHZ>,
      <abs ABSG = 5 
       data hash MD5: 32K
       B1 45 3E 76 DA CC 70 CF 9E 0C 01 59 68 C0 E3 8E>)
$$ ##END=
$$ 
$$ hash MD5
$$ 15 D2 3B 5C AA FB 76 1A 90 CB 70 CC C7 D6 98 5E
##$RELAX= 
##$RELAX= 
##$RELAX= 
##$RELAX= 
##$RELAX= 
##$RELAX= 
##$RELAX= 
$$ Bruker specific parameters
$$ --------------------------
##$DU= <C:\u>
##$EXPNO= 1340
##$NAME= <ADRS>
##$PROCNO= 1
##$TYPE= <nmr>
##$USER= <dgb>
##$AMP= (0..31)
100 100 100 100 100 100 100 100 100 100 100 100 100 100 100 100 100 100 
100 100 100 100 100 100 100 100 100 100 100 100 100 100 
##$AQSEQ= 0
##$AQ_mod= 3
##$AUNM= <au_zg>
##$AUTOPOS= <4 >
##$BF1= 250.13
##$BF2= 250.13
##$BF3= 250.13
##$BF4= 250.13
##$BF5= 500.13
##$BF6= 500.13
##$BF7= 500.13
##$BF8= 500.13
##$BYTORDA= 1
##$CFDGTYP= 0
##$CFRGTYP= 5
##$CHEMSTR= <none>
##$CNST= (0..31)
1 1 145 1 1 1 1 1 1 1 1 1 1 1 1 1 1 1 1 1 1 1 1 1 1 1 1 1 1 1 1 1 
##$CPDPRG= <>
##$CPDPRG1= <>
##$CPDPRG2= <>
##$CPDPRG3= <>
##$CPDPRG4= <mlev>
##$CPDPRG5= <mlev>
##$CPDPRG6= <mlev>
##$CPDPRG7= <mlev>
##$CPDPRG8= <mlev>
##$CPDPRGB= <>
##$CPDPRGT= <>
##$D= (0..31)
0 1 0 0 0 0 0 0 0 0.06 0 0 0 0 0 0 0.0002 0 0 0 0 0 0 0 0 0 0 0 0 0 0 
0 
##$DATE= 1193299992
##$DBL= (0..7)
120 120 120 120 120 120 120 120 
##$DBP= (0..7)
150 150 150 150 150 150 150 150 
##$DBP07= 0
##$DBPNAM0= <>
##$DBPNAM1= <>
##$DBPNAM2= <>
$$ [...]
##$SUBNAM6= <"">
##$SUBNAM7= <"">
##$SUBNAM8= <"">
##$SUBNAM9= <"">
##$SW= 20.6930455092707
##$SWIBOX= (0..15)
0 0 3 0 0 0 0 0 0 0 0 0 0 0 0 0 
##$SW_h= 5175.983436853
##$TD= 65536
##$TD0= 1
##$TE= 295.16
##$TE2= 300
##$TE3= 300
##$TEG= 300
##$TL= (0..7)
0 120 120 120 120 120 120 120 
##$TP= (0..7)
150 150 150 150 150 150 150 150 
##$TP07= 0
##$TPNAME0= <>
##$TPNAME1= <>
##$TPNAME2= <>
##$TPNAME3= <>
##$TPNAME4= <>
##$TPNAME5= <>
##$TPNAME6= <>
##$TPNAME7= <>
##$TPOAL= (0..7)
0.5 0.5 0.5 0.5 0.5 0.5 0.5 0.5 
##$TPOFFS= (0..7)
0 0 0 0 0 0 0 0 
##$TUNHIN= 0
##$TUNHOUT= 0
##$TUNXOUT= 0
##$USERA1= <user>
##$USERA2= <user>
##$USERA3= <user>
##$USERA4= <user>
##$USERA5= <user>
##$V9= 5
##$VALIST= <valist>
##$VCLIST= <CCCCCCCCCCCCCCC>
##$VD= 0
##$VDLIST= <DDDDDDDDDDDDDDD>
##$VPLIST= <PPPPPPPPPPPPPPP>
##$VTLIST= <TTTTTTTTTTTTTTT>
##$WBST= 1024
##$WBSW= 4
##$XGAIN= (0..3)
0 0 0 0 
##$XL= 0
##$YL= 0
##$YMAX_a= 373418
##$YMIN_a= -408070
##$ZGOPTNS= <>
##$ZL1= 120
##$ZL2= 120
##$ZL3= 120
##$ZL4= 120
##$ABSF1= 16.522
##$ABSF2= -4.171173
##$ABSG= 5
##$ABSL= 3
##$ALPHA= 0
##$AQORDER= 0
##$ASSFAC= 0
##$ASSFACI= 0
##$ASSFACX= 0
##$ASSWID= 0
##$AUNMP= <proc_1d>
##$AZFE= 0.1
##$AZFW= 0.1
##$BCFW= 0
##$BC_mod= 0
##$BYTORDP= 0
##$COROFFS= 0
##$CY= 12.5
##$DATMOD= 1
##$DC= 0
##$DFILT= <>
##$DTYPP= 0
##$F1P= 14.0000005364418
##$F2P= -0.99999901652339
##$FCOR= 0.5
##$FTSIZE= 32768
##$FT_mod= 6
##$GAMMA= 0
##$GB= 0
##$INTBC= 1
##$INTSCL= 1
##$ISEN= 128
##$LB= 0.3
##$LEV0= 0
##$LPBIN= 0
##$MAXI= 10000
##$MC2= 0
##$MEAN= 0
##$ME_mod= 0
##$MI= 0
##$NCOEF= 0
##$NC_proc= -3
##$NLEV= 6
##$NOISF1= 0
##$NOISF2= 0
##$NSP= 0
##$NTH_PI= 0
##$NZP= 0
##$OFFSET= 16.522
##$PC= 1
##$PHC0= 149.1624
##$PHC1= 4.842215
##$PH_mod= 1
##$PKNL= yes
##$PPARMOD= 0
##$PSCAL= 4
##$PSIGN= 0
##$REVERSE= no
##$SF= 250.13
##$SI= 32768
##$SIGF1= 0
##$SIGF2= 0
##$SINO= 400
##$SIOLD= 32768
##$SREGLST= <1H.DMSO>
##$SSB= 0
##$STSI= 32768
##$STSR= 0
##$SW_p= 5175.98343685301
##$SYMM= 0
##$S_DEV= 0
##$TDeff= 65536
##$TDoff= 0
##$TI= <Analysis number 999999
Compound Code 99
Book Reference 9
Project Code 9>
##$TILT= no
##$TM1= 0
##$TM2= 0
##$TOPLEV= 0
##$USERP1= <user>
##$USERP2= <user>
##$USERP3= <user>
##$USERP4= <user>
##$USERP5= <user>
##$WDW= 1
##$XDIM= 32768
##$YMAX_p= 451471380
##$YMIN_p= -81478
$$ End of Bruker specific parameters
$$ ---------------------------------
##NTUPLES= NMR SPECTRUM
##VAR_NAME=  FREQUENCY,     SPECTRUM/REAL,   SPECTRUM/IMAG
##SYMBOL=    X,             R,               I
##VAR_TYPE=  INDEPENDENT,   DEPENDENT,       DEPENDENT
##VAR_FORM=  AFFN,          ASDF,            ASDF
##VAR_DIM=   32768,         32768,           32768
##UNITS=     HZ,            ARBITRARY UNITS, ARBITRARY UNITS
##FACTOR=    0.157963299565203, 1,           1
##FIRST=     4132.6476996994, 0,             0
##LAST=      -1043.33573715361, 0,           0
##MIN=       -1043.33573715361, -81478,      0
##MAX=       4132.6476996994, 451471380,     0
$$ Real data points
##PAGE= N=1
##DATA TABLE= (X++(R..R)), XYDATA
$$ [...]
14627d937q441Q943j1869o705J399k149m11K989Q583j305k7194M934K2119J5777
14613A733j237j2291j0507Q108Q455J0361J1202L856j1518p526M600M494q913
14600H17j5678m766P561p545q997J5504J2031Q86j0887l955O322J876J8923j7448
14586e356m387K0262P201l367j7730K372P334Q680j0461j2761J2946K128k088
14573D773j745j2337j517J296O116J8643J2256J2045J999j6092o442k1891j0954
14560a3850O271n204J44j4324J0068P19J1890N887m264J2198j1056k1958J541
14547b1938L836J5166Q800j0821j158K0357l932j8615p619m374m168p904K926
14534b9444L647J6332N284m279M119J3581R083M274q868N70M329j6044j7452K192
$$ y = [-4937, -13378, -4435, -16304, -23009, -21610, -23759, -24170, -21181, -12598, -13903, -41097, -36163, -14044, 1733, 496, -11795, -22302, -14194, -5739, 4622, 15824, 19680, 8162, 636, 5236, 9730, 817, -14861, -19627, -12066, -19611, -28608, -13104, -1073, -187, -11074, -15029, -8707, -6831, 12092, -5356, -9743, 10519, 17720, 14353, -3377, -1005, 6329, 15009, 4548, -8213, 4733, 6861, 4773, 3028, -9309, -10826, -9530, -3414, 15229, 27485, 39530, 41529, 25437, 18995, -2896, -13850, -7579, -12783, -12639, -26963, -16895, -16176, -4286, 1601, -2663, 9535, -1521, -23479, -21938, -18102, -2936, 5864, -4957, -6115, 14242, 10310, -8305, -15924, -20298, -24466, -32370, -29444, -25797, -9465, -4181, -8460, -4341, 9240, 18323, 22597, 13729, 14299, 18628, 2584, -14868, -12676]
14520a2676M765J8199k070j2803J6020M369r247j8588j6169l435K4169J8272k057
14507H749l802j2391M78J5730O267j0613j7093k0626P665J7035j6302r948R156
14494b5695K629J7012l473P349l64j0617J3928j730J8159N406l2968m174L4236
14481A9698j0006k6054j248L153K634J2101j534k461Q517l837J693J9573Q721
14468C0950M831P46j0277j8743M322l362j2404j3586J6382J5611j338j2617O871
14455G386p993K765N861q973L288r832o554J3028P470J4051m514k226O027O92
14441B0476p590q712o973J0691j003j0905k9676j6234J2142N412L5742R302k0405
14428g733R03n106j7747R043R187j2125p787P456L5911J4745o882L960k805m364
$$ y = [-12676, -7911, 10288, 8218, -4585, 11435, 15804, 6557, -12031, -28200, -31635, -7466, 10806, 8749, 4947, -7444, -6966, 8764, 15031, 4418, -12675, -33301, -25636, -8601, -24903, -34851, -25695, -23066, -6054, -9527, -2178, -2542, -13159, 769, -961, 17198, 22604, -10364, -14538, 19698, 9692, -16362, -17610, -14457, -11823, 278, -1256, -3717, 4800, 963, 2656, 22229, 30950, 35781, 36527, 26250, 7507, 11829, 8467, -3937, -17523, -1141, 14470, 13132, 515, 7386, -607, 2158, 8019, -954, 2334, -7498, -14052, -1024, 6446, 20497, 15983, 13757, 19784, 20476, 12886, 4174, -2799, 7892, 6889, -4016, -33692, -49926, -37784, -32372, 3370, 12672, -7733, -6830, -11936, -29683, -20640, -11453, -23578, -31365, -23909, 12002, 26747, 19865, 23825, 21020, 16656]
14414A6656p746j2563l045k90j0896O129j4344J0942J7033k2001j2642K2846K92
14401i629p03J4957O132j553j4566k25J104j0984J717J480J3850L079r451l460
14387h252Q543N94J550M88o869L625J6580J0550O839k3071j5915j1941J1314N703
14373b62m792l365P523n407l739j3908m043J3509R144r031J124Q875J2705m584
14359C749k2583N883K4196J140M404M98l95R99M102j9573j4522Q8o970n728J2162
14344a2550J4316r948J765O276J0648N673J419p438k5504J2781J1786j4098l114
14331g988J6261j1084J5274L549j0637j0140J0592j597o594l216p598K314l942
14318a4806L033K538j5772j7818J1002J7627n100n516r210K4119K4855m766j2276
$$ y = [16656, 8910, -3653, -6698, -6988, -17884, -11755, -26099, -15157, 1876, -20125, -32767, -9921, -9629, -10332, 4625, 10757, 9204, -5362, -5587, -4483, -15467, -13750, -12270, 1580, 4659, -4792, -8252, 291, 885, 2435, 2923, -3946, -321, 16259, 26809, 33648, 10577, -5338, -17279, -5965, -262, -5054, -8419, -896, -6303, -10042, -23950, -27993, -14484, -5340, -14371, -13247, -4372, 8333, 3749, -18834, -12951, 11245, 12385, 16789, 17287, 16892, 17891, 21993, 2420, -12102, -12014, -18984, -24712, -12550, 1766, -8182, -6417, -141, 10507, 16180, 17599, 10161, -15343, -2562, 9224, -4874, -7988, 8273, -2811, 12463, 16012, 5375, -4765, 5827, 4230, -2364, -5580, -13178, -10864, -14806, -11773, -9235, -25007, -42825, -31823, -14196, -19296, -24812, -34022, -9903, 14952, 10186, -2090]
14305b090o037K647J0037l449j5259j4095L922K2644Q486m515J378q563q557r110
14291b2561K256m977L469N421q39j5566N612N306N395R279R086P750M969J9030
14277C3630l965j8006J427n031O978J2092j230Q47m582j7089q874o654K1717K8017
14263C9277N482o746N376r337j2562j6446j3022j9726q328K0266K4729q884J783
14250A862k991n658P325Q935N032j331j511k532J05p720o166j3066k2081K610
14236c7187K5301J2786j175o444L226J0896j50K4134K01k0271j9015P1J357R504
14222C234J1190k346L151j1615p200l875N964L2146L465r884n62Q014j1553k6646
14208f517j0275J6600l6317o001J996j272M043O060R332J6875R475k940j6130
$$ y = [-2090, -8127, -5480, 4557, 1108, -14151, -28246, -24324, -1680, 6806, 2291, 3669, -4894, -13451, -22561, -20305, -25282, -21813, -16392, -17231, -32797, -27185, -21879, -16484, -7205, 1881, 9631, 14600, 33630, 29665, 11659, 13086, 8055, 15033, 27125, 25895, 26742, 22160, 5071, -3803, -10457, 11260, 39277, 44759, 38013, 43389, 34052, 21490, 5044, -7978, -27704, -36032, -15766, 8963, 79, 1862, -1129, -6787, 538, 9473, 14505, 13174, 11663, 9131, 9236, 1516, -4650, -17716, -39797, -37187, -11886, 900, -275, -6719, -3493, 7403, 7253, 31387, 31588, 11317, -7698, -7627, -6270, 3234, 14424, 12078, 15229, 3614, -3586, -7461, -1497, 30649, 34114, 24230, 23668, 31682, 20129, -6517, -16792, -192, -36509, -42510, -40514, -41786, -37743, -31683, -22351, -5476, 3999, 1059, -15071]
14195a5071L943L2303o580j0148q353m338R742J2873R216l482o75n337L925r726
14181H292L196O79n92M32n938m42N349q332l666K337j0849K270K0452o21j3788
14166a221k3400R020J9826n175L838J0926l44j5361j4673M635J1589j241j1143
14153a2724P700j3392Q079q253J114M056O816L408N288n818r65o188k439L982
14139i336j0960M10J3057J7097j3756q625l795j2478J0971J4188J6261J0149j6885
14126F298j791K115q166K064k637n015r884Q692K088m973N37k155P802J0876J319
14111G170j4975N666N190j946p667j2701m840N875J8340K4566R67k4612m494r774
14097a3235o327K0082n896o154P694j703Q539J0110Q37n979L294j2586j019J1707
$$ y = [-15071, -11128, 21175, 14595, 4447, -3906, -8244, 1498, 14371, 23587, 20105, 19430, 14093, 18018, 8292, 11488, 12167, 11575, 12007, 6069, 5627, 10976, 2644, -1022, 1315, -9534, -7264, 13188, 12567, -1221, -24621, -15601, 4225, -950, 2888, 13814, 13470, -1891, -16564, -11929, -340, -1581, -12724, -5024, -18416, -10337, -18590, -17476, -13420, -6604, -3196, 2092, -3726, -4691, -10879, -13318, -9336, -20296, -19886, -6829, 10268, -3488, -12113, -15908, -28386, -17415, -3227, 13034, 23183, 6298, 4507, 6622, -1544, 520, -2117, -7132, -17016, -8324, -6236, -11209, -10672, -12827, -5025, 5851, 7170, -7805, -2139, 3051, 1105, -6562, -19263, -24103, -18228, 112, 24678, 25645, 1033, -3461, -13235, -19562, 520, -5376, -11530, -3836, -5539, 3000, 13110, 13947, 7968, 11262, -1324, -2343, 9364]
14083I364J3009j4124k2512j5133N201k687K1253O191J349J3382J8060k543k0079
14070A0731j04O978J971l879k5869J792J1901j8566j8839o869J0476J2424q054
14057b5907O053l537r672K197n475J0399R225L545k259J109r417k333l539j5031
14043d4642k667J4223L5783J3589o385j0748N65L170l9M872N003n322j7688P694
14029b592j174k2093k3095J8283J4627K0837J7655K762j2618k2955o629k168n908
14016b5068N3J4197q490o695N310O22P44J7433Q913k5746j2312J8965J1947O128
14002F001N505M56l1229l214J671j3814j6584J2260M0980N356j4152L753r843
13989a2854j3719p22K9169J73J14j534j9312L497P095M448R479L0R406o516J0334
$$ y = [9364, 22373, 8249, -14263, -29396, -24195, -26882, -5629, 562, 1911, 15293, 33353, 30810, 10731, 10627, 17605, 19576, 15697, -10172, -8380, 3521, -15045, -33884, -40753, -30277, -17853, -25907, -19854, -23391, -33063, -30866, -36341, -25942, -16717, -13172, -15431, -14322, -23739, -26072, -29611, -44642, -47309, -33086, 2697, 16286, 9901, -847, -282, 2888, 2849, 7721, 12724, 7402, -10286, -2592, -3766, -25859, -48954, -30671, -16044, 4793, 22448, 25210, 12592, -10363, -16992, -19160, -25068, -25015, -10818, -19308, -26003, -20693, -20071, -19327, -1894, 7019, -18727, -31039, -12074, -127, 6001, 11506, 11962, -19267, -22481, -20810, -34624, -51208, -38948, 2032, 7388, -6764, -3011, -12854, -26573, -27295, 1874, 2047, 2161, 627, -18685, -15188, -8093, -3645, 5834, 5864, 15270, 8754, 19088]
13974A9088o219k1140m176p53n847Q734R523j7686l960K4522J2587j6959L56J2345
13960A0415K755j5895k1529j312k21R82l893L117K2364J0776j4526o036q040j3212
13946c4255n56k525Q176J2535P178P257K667j5353n674O856K5785m231k2949j6057
13932c1146J6688K2938m897j2750L558Q261J9882L722L738r116n815j5191j4380
13919a4508j4528j9441J1558K2617N186p695O339P182N997j4364K581Q379l139
13906c836j4125j689o86j1073K6103J5243j650r872q387J7863J0326l0980o950
13893a9713j3812m262J380l826m351l938J5615M108O216P723P848J75n464L481
13879h820P303J8301q330j2572k949K8516J3098k1828k3328O206J042J2442k0874
$$ y = [19088, 12869, -8271, -12447, -13200, -19047, -10313, -790, -18476, -22436, 2086, 14673, -2286, -1930, 10415, 13170, -2725, -24254, -25566, -25787, -24805, -28698, -25581, -3217, 7559, -6967, -13003, -21043, -34255, -34811, -37336, -29160, -16625, -9447, -2190, 477, -14876, -20550, -13694, 12091, 7860, -15089, -31146, -14458, 8480, 3583, -9167, -5609, 2652, 22534, 26256, 29994, 20878, 15063, -128, -14508, -29036, -48477, -36919, -14302, -9116, -16811, -10472, -3290, 2707, -11657, -9076, -697, -3836, -17961, -19650, -20336, -31409, -5306, 9937, 8287, -1585, -9972, 7891, 18217, -12763, -19713, -33525, -37787, -36407, -40233, -44584, -48522, -32907, -28799, -22583, -14860, -7012, -6837, -12301, -8820, -1517, 16784, 8454, -4118, -7067, 21449, 34547, 12719, -10609, -4403, -3361, 9081, -11793]
13866a1793j7215K808j0495J4582J9551R070j4296k4126l158J0679N240J3041
13854f112j863j3244J626j0156m389R60J1982J3547L869N612Q779o968M167o448
13840A362l961J4752R761N057N231n720K447l960k2403k2300J066j554q864K4099
13826d987Q926J4720n356k3932j0620J6114K9252m131o755j3949j6026N565L260
13813g919J7252r497k849O8K068k106J342J180O919l574j2203j3685J3832P792
13799a380J1978q008j5473O134J6865J6719j6497P250Q193j4995l552R641l535
13786A3340j5318J6689R99k099O251O228q198j6023o780j287m786m594q306O684
13772a7200P564o139m364Q324m28O776J1439j5607k193j9188j576N708L50l814
$$ y = [-11793, -29008, -26200, -36695, -22113, -2562, 6508, -7788, -31914, -35072, -24393, -19153, -6112, -7975, -21219, -19593, -29749, -34138, -33178, -21196, -7649, -3780, 1832, 10611, 3643, 7810, 1362, -2599, 12153, 21914, 26971, 32202, 26482, 28929, 24969, 2566, -19734, -18668, -20222, -29086, -4987, 3939, 18659, 13303, -10629, -21249, -5135, 24117, 19986, 13231, -718, -16744, -11179, -7919, 9333, -164, -3013, -2945, -877, -2983, -1641, -461, 6458, 2884, -9319, -23004, -9172, -1380, 10598, 2590, -12883, -6749, 10116, 26835, 10338, 17588, 25781, 10786, 7234, 16875, 13340, -1978, 14711, 15710, 13611, 19862, 26090, 17892, 1869, -4911, -6198, -10984, -15578, -23884, -17200, -9636, -15775, -20139, -11815, -12243, -5467, 5972, -9635, -11828, -31016, -32592, -26884, -26534, -30348]
13758c0348M913J3466R717j440m840Q915J5493q364j3686J6867k116N248M349
13745A8174q809p468o347j1811m13J0549r525M049J3328n52j670J534l940q507
13731a1408k214M75P611M164J9363K122j5566j6605Q548M699n763L456q012k702
13717a1832j2334o915K4713j013k044O882m036O615Q281K76k905K179R622j0366
13703G123q386j1975j66N625m496o325P77k433r588j2075J9971J4162K396j0704
13689a6094l950K98n701Q262j3452n832J2351o393p959K262j41L946J7689M138
13675a0576n210J718O412J0408P91Q882p061j198j3474j8110M600K4049j2871
13662a1640R724P167Q557J1517m763r341k5635l367K110O125J3127O628L166j7438
$$ y = [-30348, -25435, -11969, -2252, -3692, -8532, 383, 15876, 7512, -6174, 10693, 8577, 13825, 18174, 9365, 1897, -4450, -16261, -16674, -6125, -15650, -11601, 1727, 1175, -495, 1039, -2901, -11408, -13622, -13147, -5536, -1372, 17991, 20113, 4547, -12058, -3510, 1189, -4574, -1118, -9130, -11832, -24166, -31081, -6368, -7381, -9425, -2543, -6579, 36, 8317, 8593, 5688, 7867, 17489, 7123, -1263, -13238, -13404, -7779, -12275, -18600, -17823, -20256, -29844, -41919, -21948, -7786, -5390, -16094, -20044, -19746, -25447, -17185, -30637, -36469, -24118, -30511, -38470, -36208, -36349, -32403, -14714, -10576, -15786, -14068, -7656, 2752, 3543, 12425, 5364, 4166, -9308, -27418, -22818, 1231, -11640, -1916, 5251, 13808, 25325, 20562, 11221, -14414, -17781, -15671, -9546, 3581, 10209, 13375, -4063]
13648d063j4088J4795j0558m728Q280J9418J9938J1453M202k3418j6862J171j134
13635D406K0509O533Q347nj4820p910j0341j8084j4437j357K769J8499J3541q423
13621g73l086o584r134L319j73n296J1938P785l364n218n312P636M545M473O210
13606F966r753r090j9720J1849J4400J1543J3569O020j4678n602j433L810o184
13593A697k0745N418o193l391j99j4307K1747N749j8575L846J408L221J5836J373
13579c115J4741j5015O591J1558P340K960l396p099J0463R214n084j2214j6526
13566D18j4513j4971M410L1003N200J991K523n544m961J568M883q292q555K0051
13552A5211j930j6835l816k097M336K3402J1566k579j6145n18P594k1349j0814
$$ y = [-4063, -18151, -3356, -13914, -18642, -10362, 9056, 28994, 40447, 44649, 21231, 4369, 5540, 4406, 24915, 31448, 39795, 39790, 24970, 17060, 6719, -11365, -25802, -27159, -24390, -5891, 7650, -773, -3859, -10443, -19577, -16258, -16431, -21727, -9789, -2004, -5368, -10586, -15898, -8262, -3717, 756, 6966, -2787, -11877, -31597, -19748, -5348, 6195, 19764, 25784, 11106, 5504, 4071, 7881, 1697, -19048, -13630, -19823, -23214, -23413, -37720, -15973, -10224, -28799, -24953, -23545, -20324, -4488, -3115, 11626, -3389, 3202, 14760, 22100, 25060, 21664, 14565, 25028, 34242, 29158, 16944, 418, -14095, -29066, -24656, 6347, 11547, 13538, 16061, 10517, 5556, 7124, 12007, 3715, -4840, 15211, 13281, -3554, -7370, -9467, -5131, 18271, 29837, 27258, 11113, 10595, 18189, -3160, -13974]
13539a3974N733M66k241j9703q243J4625p07j322P556K5980o1l107R334r575p162
13524b401P957J9719q55o661j0459k0324k1010N585J7970J1852j0353J982O956
13511d2R527j5665l752k691L484Q070j579k5922k796R477J5956O03j6632K201
13497a9761J8868J8060j128K642j3659k0416o579q578j1505J581J7827J3729O045
13484b874J2288l287J682J660k572p267j2917J4430N714J1749q304Q019K960k490
13470A8791K213O947m381l3176j1807R227J3059O022P72J8053l54k0299k4440
13457a9373m451O423n6j1731L50P214P16J7018l023N992j5530Q422J2342l376
13443I37l830j3405P59J2913K964j9991r005J898L693K0429Q420j6636K6790J1978
$$ y = [-13974, -8241, -7775, -10016, -29719, -37962, -23337, -24044, -25366, -17810, 8170, 8109, 5002, 14336, 4761, -2401, 5556, 25275, 24420, 17759, 7300, -13024, -34034, -28449, -10479, 1373, -8980, -6998, -42, 9485, -6180, -9932, -12623, -9139, -1069, -2648, -28570, -31366, -21889, -5933, -5330, -21962, -19761, -893, 17167, 16039, 18681, 5022, -15394, -21973, -30551, -42056, -40475, -22648, -8919, -2874, 9414, 6127, 7809, 9469, 6897, -370, -13287, 1143, 6857, 18606, 10302, 18321, 21281, 18791, 21004, 27951, 23570, -9606, -21413, -12186, 873, 6895, 7667, 25720, 25366, 5067, -19373, -23824, -17401, -17457, -29188, -28838, -21624, -20908, -3890, -6913, -921, -16451, -8029, 4313, 937, -2893, -16298, -15539, -2626, 338, -19653, -28658, -26760, -23067, -2638, 5782, -10854, 15936, 27914]
13429B7914j0977n419q883k6640o340Q10M590J6979o074j6781P287r018j2206
13416d4758J6861L1821R674Q523m490r646J438k0842k474J8117J1191q34k1984
13403g403j1539J5655J5708N616L090O169J0336k835j3287L37o30K103N522m610
13389B4232r260O51q277J9327R227j1334R218Q837k8224k0600o76j213o712K05
13375a4599J466N778O06j4602r555M450Q398M69J1340R995O954l063j966q792
13361c121j8563J1283J2112J7103O015k7324O573J6796j3102k5491m797K7878
13349E362K7939k11j4539j1470j0033j6701J357n390J1993p546q117J7526L17
13336i513K603J608R553P558O656Q188r158J587O122J598o715j0994J436J615
$$ y = [27914, 16937, 11518, 2635, -24005, -30345, -29535, -24945, -7966, -14040, -30821, -23534, -32552, -44758, -27897, 3924, 13598, 22121, 17631, 7985, 9423, -11419, -13893, 4224, 15415, 14581, -7403, -18942, -3287, 12421, 18037, 21127, 27296, 37632, 34797, 21510, 21847, 21217, 23320, 28842, 24232, 14972, 15623, 7346, 26673, 35900, 24566, 33784, 42621, 14397, -6203, -6879, -8092, -14804, -14599, -13133, -7355, -6749, -21351, -30906, -26456, -18058, -17589, -6249, 3746, 10700, 7637, 5671, -3121, -21684, -10401, 1711, 18814, 24829, -2495, 4078, 20874, 7772, -17719, -22516, 5362, 33301, 33090, 18551, 7081, -2952, -19653, -18296, -23686, -11693, -19239, -27356, -9830, -9513, -6910, -5302, 4251, 11809, 18465, 26653, 17495, 19082, 25204, 26802, 20087, 9093, 10529, 12144]
13322A2144J541P958l634m015r39j4186o13q516J3363k078l511j293J8447L875
13308A8543n052j8823jR63R941n640n87p288q762L059K8085J3995j8401j249l694
13293E089j7224J692Q579K9689k7451j1715l066l034J7061R425K108k9301j9633
13280c7781L198M021O715p19N775p070J5295q977J7361j779M619M037J0541p594
13266G642k1664J053J0616K99N640n47j2344K618K0584J9078j794P210j571K723
13252C9543P995j3448p38j7579j4510J0940M541l874j0353j6379J439L837M92
13239h094O349O015K4791P876j1560M319O257N010j2846k8060k0592J13P755j652
13225a4319K626O77J2364l803q140r503m189Q875M932o602k435K3446O246J7357
$$ y = [12144, 13685, 21643, 18009, 13994, 13055, -1131, -1744, -10260, 3103, 1025, -2486, -3779, 14668, 18543, 13491, -5332, -5333, -4370, 5571, -69, -656, -7944, -16706, -13647, 14438, 28433, 10032, 8783, 5089, -12135, -10443, -1864, 27825, 374, -11341, -14407, -17441, -380, 9045, 11153, -18148, -37781, -34583, -30562, -23847, -24566, -18791, -25861, -10566, -19543, -2182, -3961, 658, 4695, 15236, 7642, -14022, -12969, -2353, -2054, 3586, 3039, -9305, -6687, 13897, 32975, 31181, 38391, 36820, 39543, 47538, 34090, 33352, 15773, 1263, 12203, 16744, 12870, 2517, -13862, -12423, -8586, -8094, -1745, 4270, 29061, 36937, 25377, 29696, 35953, 40963, 28117, 57, -20535, -20422, -12667, -14319, -11693, -11016, 1348, -2455, -10595, -20098, -24287, -15412, -10480, -17082, -19517, 3929, 10175, 27532]
13211B7532j8478j0405O164N585K75r691K768k1808k2603l916J9942J9197k506
13198g944o23J0957Q10j4462j4797J0648L063l645R273P788J3018o015q035J7635
13184A7671J9591J226j6506M221J2748j8673k0548n729l885J5426J34j551J7820
13171B1945O622l908L418l703r40j3968O80j1763N33P72P764j663l3346j3558
13157d1115l526J2387L266J3833J7216j760m110N976j790k4859K405J3688R652
13144A263N661j3223q218J2423J4460O651J3633p722m960m96M594p587J120p130
13130A0469p116o164J6519J0068j3107j1336p980J0098J2628r324r547k965O196
13117a561N1P252m794j1857l377M780N444j0119K3015Q339j1461j720Q132K447
$$ y = [27532, 9054, -1351, 4813, 10398, 10673, 982, 3750, -18058, -40661, -44577, -24635, -5438, -7944, -8567, 2390, 3200, -11262, -26059, -15411, -12348, -15993, -6720, 1068, 14086, 8071, 36, 17671, 37262, 38488, 21982, 26203, 38951, 20278, -270, -5999, -9884, 5542, 5676, 4125, 21945, 28567, 24659, 28077, 24374, 23434, 9466, 10146, -1617, -1084, -312, 7452, 5789, -27557, -41115, -44641, -32254, -28988, -15155, 2061, 301, -3809, 2167, 377, -24482, -22077, -8389, 1263, 6924, -6299, -14517, -2094, 12366, 19017, 32650, 24928, 19968, 19472, 24066, 16479, 17599, 10469, 3353, -2811, 13708, 23776, 10669, -667, -8647, 1451, 14079, 4755, -4792, -7757, -1561, -1510, 5742, 948, -10909, -14286, -9506, -4062, -14181, 8834, 17173, 5712, 3992, 12124, 14571]
13103A4571L802r179o798O50n030L136j0647k0157O247l335N772m911J0146J9794
13089D061K2013j1245j3163j3694j5628J0379J6540J4351J2983J961j6132j6648
13077d222j5953J6005J3858P514J0276j0170L958j0944O85j1591j9405l922J6981
13064f930K0856J5146J2999j0553q546J917Q18O278J9019R57k4112m173M494J2722
13050D0892n447J1069r649k7939j9946n933J6027p837J0377K6135N961j5492l811
13037A4407J7595j0629N831L374O81O48l559q629j1482R07K0262M837j5835M821
13023B3229K5513r520j1507j646j2619r959J5233m555p17j2446r760J5992P309
13010A4547N14q715r825P539K306o836L692J1088q352j5269J7358p948n238o969
$$ y = [14571, 18373, 9194, 2396, 3046, -1984, 1152, -9495, -29652, -23405, -26740, -20968, -25879, -15733, 4061, 26074, 14829, 1666, -12028, -27656, -17277, -737, 13614, 26597, 28558, 12426, -4222, -20175, -4170, 9688, 17202, 27478, 17308, 21266, 10322, 11007, -584, -19989, -23911, -6930, 13926, 29072, 42071, 31518, 22972, 24889, 25707, 31985, 51004, 51961, 27849, 23676, 28170, 40892, 35445, 46514, 36865, 8926, -11020, -16953, -926, -8763, 1614, 27749, 33710, 18218, 14407, 32002, 21373, 27204, 30578, 31259, 31907, 28348, 19719, 8237, 9144, 29406, 34243, 18408, 23229, 48742, 39222, 27715, 26069, 13450, 3491, 18724, 14169, 13452, 1006, -8754, 7238, 14547, 15061, 6346, -3479, 4060, 6366, -470, 3222, 14310, 5958, -9311, 8047, 99, -5139, -12108]
12996a2108l03M753n672O777O598K985J8236o484P759O646j7142k3503R352J1366
12982I260N480j9135q013N086M487J8702P949K082j2991J1476J8500j7309j9339
12969F235l479N602K3624J9646j3715j0209m767l687J5579L059j8706j3354O980
12956A2808N797j788k2327o871O526J2137Q796J458k0783j8721J0509J296R53
12943a0210j7297N664J9409j995P363J1895J0101j2855j6627J4881J1910J6585
12931C8824K3588J3271k015k0169j9826k638R634L758j2845K099j2460m781j3358
12918C082k756K9523K0368q493L855K1963K515j0822k8653k2931J8451J0374J0324
12905D6800p250k0447L650J0330J6258j7562p989K2711N586k4564Q036o843o176
$$ y = [-12108, -12411, -7658, -13330, -6553, 45, 3030, 21266, 14782, 22541, 29187, 12045, -11458, -2106, 9260, 14740, -4395, -12408, -7322, -2835, 15867, 23816, 25898, 12907, 24383, 42883, 25574, 6235, 2756, 8358, 31982, 51628, 37913, 27704, 22937, 19250, 34829, 37888, 19182, 5828, 12808, 18605, 16817, -5510, -12381, -5855, 6282, 15078, 16536, -4247, -22968, -12459, -11163, -10210, -27507, -21843, -2434, -4429, 2934, 14829, 24930, 12075, -4552, 10329, 22239, 38824, 62412, 75683, 73668, 53499, 33673, 31035, 40669, 44427, 31582, 33681, 21221, 16440, 3082, 326, 29849, 50217, 41724, 45579, 67542, 70057, 59235, 30582, 7651, 26102, 36476, 46800, 39550, 19103, 22753, 33083, 49341, 31779, 23790, 46501, 52087, 27523, 35559, 28716, 22540]
12892B2540O426K57n972N55N00J930j5310J6884K220J1477n243j1612k0006k3527
12878a8881J6655J7830M046K053K1887q583J3252r347k1504p44R189J6098M070
12865D6021k3203M153R44j2979q839O545R918J5421j59n884M463K989P277j915
12851D4752j3193j1544m909M849J7796P999j3816J8049R133M94k2368k621J1684
12838D6305k6336j2549O277J3369o122L981O287J090j2220J0077o947j4274j0391
12825a453N325M258K156J3754q932p14L675r301N968J139m587k2356K883J4577
12811F392L363p188J657N307m963P693m014N498Q001J0387J3243m866k2144q665
12797I701J1145o635j23J4104M120p90m344K871j0190P712j711K399L918r12K694
$$ y = [22540, 28966, 29223, 23251, 23806, 24306, 26236, 10926, 27810, 30030, 41507, 36264, 24652, 4646, -18881, -2226, 15604, 19650, 21703, 43590, 35007, 48259, 38912, 17408, 16664, 25853, 41951, 46021, 22818, 26971, 27915, 14936, 6097, 12642, 22560, 37981, 37822, 31938, 36401, 39390, 46667, 44752, 31559, 20015, 15106, 19955, 37751, 45750, 31934, 49983, 59116, 59610, 37242, 34621, 46305, 19969, 7420, 13697, 27066, 20944, 24925, 31212, 32302, 20082, 30159, 23212, 8938, -1453, 3872, 8130, 10286, 24040, 15108, 14394, 18069, 8768, 14736, 15875, 11288, -11068, -8185, 6392, 9755, 2567, 4224, 9531, 4568, 12261, 8247, 13745, 21746, 32133, 45376, 40510, 18366, 9701, 20846, 14211, 14088, 28192, 32312, 31522, 27178, 30049, 19859, 27571, 25860, 28259, 32177, 31265, 33959]
12782C3959L100L809p408j0763j4298K1547J3861M83o26N971Q44j1104l3722L112
12768H765k948l643k331O7K089O312n785r105P427K3307J7430p027J235J3805
12754D9598M886n234p178l745o858J3682l826r955k1989O573R665n700n764N645
12740A9800k65L262j1123R459n583O024m050j2225k354L429N000J4746J4853M705
12726D5678k2297j0120L638J556p293N540k770P005J8778M314N483K0205j1248
12713E8469j4001j6230m363Q559n085R69J1098N811K932k913L708L099j1566l711
12699C6776p459J0957J1149K747r891J8475j4115p565R963n39n905J1256j5253
12686D0596K617m869m893q794N717Q214J0126p674j1304J26P699P354j625K476
$$ y = [33959, 37059, 40868, 33460, 22697, 8399, 29946, 43807, 44290, 43664, 49635, 50479, 39375, 5653, 8765, 5817, 2174, -157, -90, 1999, 8311, 2526, -6579, 848, 24155, 41585, 34558, 35793, 49598, 54484, 49250, 42072, 38327, 31469, 45151, 41325, 31370, 9381, 15954, 25619, 19919, 14155, 19800, 19535, 22797, 11674, 21133, 15550, 21574, 17524, 5299, 2945, 6374, 11374, 26120, 40973, 45678, 23381, 13261, 16899, 18455, 11162, 16702, 13932, 20937, 39715, 44029, 49512, 69717, 58469, 44468, 28238, 23875, 32434, 27349, 28318, 39416, 45227, 48159, 45246, 48954, 52053, 40487, 36776, 29317, 40274, 51423, 54170, 44279, 62754, 48639, 41074, 51037, 50498, 44593, 55849, 40596, 43213, 38344, 33451, 24657, 30374, 38588, 48714, 41040, 29736, 29862, 37561, 44915, 43290, 45766]
12672D5766j8566m013J98o565j5740J0249J8824J1492J320K692n744n695j2286
12659B1932j5808J0359J6113j610l533p444r404N910J5800M29o007o6J8338O337
12645E1346o540j1641O153J7091k2983j4984J0653l248m028j265N372J1941J6820
12632E4687l005q075P230M890M837N985q092j581j3018q49l837N614N227j3310
12618C6703j6621J7159J6422P448j3317k0675j3247O975N207J7736K957j9297
12606B7450J3924L9611o035j5901o135p921n253j4540R041P633M74Q730J6724
12593F7802r720k0939Q342N825L301p915l349K060r750J2324k465K819M828j1353
12579D1810O044J9785j646k0805l400J4434j2858k4791K572O319P157r635m037
$$ y = [45766, 27200, 23187, 23385, 16820, 1080, 11329, 30153, 41645, 42965, 45657, 39913, 34218, 21932, 6124, 16483, 32596, 30986, 27453, 20009, 10605, 16515, 32315, 32744, 26737, 26671, 45009, 51346, 44806, 33165, 39318, 56409, 33426, 18442, 29095, 25847, 21819, 20554, 25926, 37867, 54687, 51682, 43607, 50837, 55727, 60564, 66549, 58457, 56876, 43858, 43009, 39172, 44786, 50013, 36703, 20082, 37241, 53663, 61111, 47794, 27119, 13872, 20847, 26054, 43790, 46747, 27450, 41374, 80985, 74950, 59049, 52914, 44993, 39740, 25200, 34241, 41874, 42348, 51078, 67802, 58082, 37143, 45485, 51310, 54611, 46696, 43347, 45407, 35657, 47981, 45516, 48335, 53163, 41810, 47854, 67639, 65993, 45188, 41788, 56222, 43364, 18573, 21145, 27464, 34621, 24986, 20949]
12566B0949J5246J4849L885J2399p400j0913K369N15o889K006O050M429j329l2568
12552B3598M202J2894J3398K084J1642p96r538O00P134J9609k1058k3126j073
12539C9570o134J0706l609q179J6671L998P338k716p078j1612J3706J3171j2938
12526E2894j0724R180j5114P125O595j445O42N992O621r808J2451P445O456j0065
12512F8245r187K2758J643j6945j4177k872r437J7712J7692J6757m77j8084j4221
12499E9407j997K3898K735N427p795m360Q856Q949n522N110K1698P292o435M991
12485A22254q551j2754p993N991R4j864O373j2906K053J547j4211N887J0947j6822
12471H0045m703R972p968p469R655K3446j0953J395q18j1797j2614j608M337L478
$$ y = [20949, 36195, 51044, 54929, 67328, 59928, 49015, 51384, 51899, 45010, 47016, 53066, 57495, 56166, 23598, 27800, 40694, 54092, 56176, 67818, 67022, 57484, 58084, 65218, 84827, 63769, 40643, 39570, 33436, 44142, 40533, 32354, 49025, 53023, 60361, 57645, 50567, 38955, 52661, 65832, 52894, 42170, 51350, 36236, 43361, 49956, 48511, 49153, 55145, 61766, 51958, 64409, 71854, 78310, 68245, 59058, 81816, 83459, 66514, 52337, 49465, 40028, 57740, 75432, 92189, 91712, 73628, 59407, 57410, 81308, 84043, 89470, 81675, 77315, 86171, 95120, 89598, 94708, 116406, 123698, 117263, 122254, 113703, 100949, 92956, 98947, 99041, 97177, 103550, 90644, 92697, 94244, 80033, 85920, 96867, 80045, 75342, 85314, 77346, 69877, 79532, 102978, 92025, 93420, 92602, 80805, 68191, 66583, 70920, 74398]
12457G4398P947J7999Q064n222j5834j810Q411q740p479J036J4879J1939l180
12444A02408j026J872Q859K213J2273k4389j4740N717J1J7295q927O615j353k89
12430A06539r707j4541J542P502P351K345K904J0848p832j452j6768o915J6360
12417I8176J1588r972j9022p775J9963m83P7M507J4686m321O913J2556o487K469
12403A22875j22N238Q79k6078j1258m29k157M855J1843l720p802N37J0183P176
12389A12020p317q115J262p976j946K469J3064J925J7556p1L957j1466p869j1691
12375I5802K2297J3628k954J6681J2377j9607j4704p582O209J9292N798q326n729
12362A33182l969j094l168J1468K0572j877Q760N329o821p899O180K268m427j5762
$$ y = [74398, 82345, 100344, 108408, 103186, 87352, 85542, 93953, 85213, 77734, 78770, 93649, 105588, 102408, 101382, 103254, 112113, 114326, 126599, 102210, 87470, 93187, 93198, 110493, 101566, 108181, 106828, 106539, 96832, 82291, 83833, 91335, 98686, 101031, 103935, 114783, 106951, 105499, 88731, 81816, 98176, 109764, 99792, 80770, 72995, 92958, 92475, 92552, 97059, 111745, 107424, 114337, 126893, 120406, 122875, 122753, 127991, 128870, 102792, 91534, 91105, 88948, 93803, 105646, 101926, 94124, 94661, 104844, 112020, 104703, 96588, 97850, 89874, 87928, 90397, 103461, 105386, 122942, 122871, 126828, 115362, 107493, 95802, 118099, 131727, 128773, 145454, 157831, 138224, 123520, 115938, 122147, 141439, 147237, 138911, 133182, 129213, 128119, 124951, 136419, 156991, 155114, 163874, 169203, 162382, 154483, 160663, 162931, 158504, 142742]
12348A42742n034J0538J981l722j6654O180k212M590j6798k890J5579L196m320
12335A33176j2949J8612J2343O823P817j516J2114j605j3141M724R930k364k632
12322A71332O813Q52L408j4282p780M790r216N641k783k597R608J4507q020n145
12308A67128J2439M97k017O222j1125K079J3393J5394R617j5853q604K767O661
12295A98598Q546J4734j2456j8029K57J1927J1008j0813n169J0763J1316J3065
12283B33747j459K311q061R152R195k0462j1920k242p674K4037J5357m017j1368
12270B26596j2142k654J1831j7255L463J0228J1111L817M821j5810q190J6999
12258B32815J5594j1268k7498O797K4597l53R83k1292r664m257J1150K8588J2521
$$ y = [142742, 137708, 148246, 150227, 146505, 129851, 136031, 133819, 138409, 121611, 118721, 134300, 137496, 133176, 120227, 138839, 151182, 158005, 165822, 164306, 176420, 174815, 161674, 166398, 176328, 173964, 171332, 178145, 178997, 182405, 168123, 160343, 165133, 155917, 161558, 158775, 156178, 165786, 180293, 172273, 167128, 179567, 180064, 178047, 184269, 173144, 175223, 188616, 204010, 213627, 197774, 189170, 191937, 198598, 207144, 221878, 209422, 191393, 191650, 203577, 214585, 203772, 198603, 209366, 220682, 233747, 232288, 234599, 226538, 235690, 244885, 224423, 212503, 210261, 202587, 226624, 241981, 237964, 226596, 214454, 211800, 223631, 206376, 209839, 220067, 231178, 234995, 239816, 224006, 215816, 232815, 248409, 237141, 209643, 216440, 241037, 240684, 241667, 220375, 210711, 206454, 217604, 246192, 258713]
12245B58713q535n398p185M240J8978n097k579L943n140P025P283j3895L551K3806
12231B79710p146O965J7888Q562q580o483j0953Q589R586q585J1690J9477M603
12218C25323P04n532Q43j3933j4535J2225J4507j0072K36R085K156J029k759n66
12204C18711J4861K5036m706r861J1145o005m42k553J3381J3805O248M730j29
12191C84221p948r913j1939J6755J1296Q577o201J2236K0248K451j3823l220J1025
12178D13765n076k7779j2309K0674N156K193N745k29q14R159O011J139L472m570
12164D16537L2478K9046j975J332j141R893j0249N697J7848J2421j3314j3396
12152D85177q435k882J7328m677J485J4267J004j46J1462J4328p441P919K4024
$$ y = [258713, 250178, 244780, 237595, 241835, 260813, 255716, 253137, 257080, 251940, 258965, 266248, 252353, 255904, 279710, 272564, 279529, 297417, 305979, 297399, 290916, 279963, 288552, 298138, 289553, 301243, 320720, 325323, 326027, 320495, 321338, 307405, 292870, 305095, 319602, 309530, 309766, 318851, 321007, 322036, 319277, 318711, 333572, 358608, 353902, 344041, 355186, 349181, 348739, 346186, 359567, 373372, 379620, 384350, 384221, 376273, 366360, 354421, 371176, 382472, 391049, 384848, 397084, 417332, 419783, 405960, 402740, 413765, 408689, 380910, 368601, 389275, 394431, 396624, 402369, 402140, 401326, 410485, 416496, 417635, 421107, 416537, 449015, 478061, 476086, 477418, 476277, 486170, 475921, 481618, 499466, 511887, 498573, 485177, 476742, 473860, 491188, 486511, 487996, 502263, 503267, 503121, 514583, 528911, 521470, 529389, 553413]
12139E53413j136l000p700O781m515J5165J5666J5928J2921J5286l0762l5544
12127E52503j6514J8076L0979P881j0917Q907j630N877K5480K8273J8427J1267
12115F78609R958M118P702k5345k9186K5144M4687K446L668j6214j7072J6916
12103G05431K0092K5112M592J3014J8033j391P216N855J9798P368p243J7329k0841
12090H14365p344L055M931m35R599L4752J6938J1020n823N894K088J2958K2531
12077I24529M576O302N594L136o562J3049J9970R230R666K3615N890L378J4353
12064A036726J3353J4006J2048L506O539l903J3322J2921K7868N127P754K4005
12052A173272K3969J3677N649K3071K7685L1507L3137K3158K0885Q60k2185q854
$$ y = [553413, 552277, 549277, 541577, 548358, 543843, 559008, 574674, 590602, 603523, 618809, 588047, 552503, 535989, 554065, 585044, 592925, 582008, 590915, 589285, 595162, 620642, 648915, 667342, 678609, 688567, 692685, 700387, 675042, 645856, 671000, 715687, 718133, 721801, 705587, 688515, 705431, 725523, 750635, 755227, 768241, 786274, 784883, 792099, 797954, 817752, 825120, 817877, 835206, 814365, 807021, 810076, 815007, 814572, 824171, 858923, 875861, 886881, 881058, 886952, 889040, 901998, 924529, 929105, 935407, 941001, 944137, 937575, 950624, 970594, 979824, 989490, 1013105, 1018995, 1022373, 1036726, 1050079, 1064085, 1076133, 1079639, 1086178, 1082275, 1095597, 1108518, 1136386, 1141513, 1149267, 1173272, 1197241, 1210918, 1216567, 1239638, 1267323, 1298830, 1331967, 1355125, 1376010, 1376870, 1354685, 1345831]
12040A345831K6827J0691r338K507J0411J9122K0492J7928K0083J5720J6083K016
12028A498373K458L184Q724K3594K7117K5566O481k526J5281K7553K0604k521
12016A653888K0238J000J5164M1911J9234K5829K2226J2808R240K1061L5097N2363
12004A930059N3139O9031M8572L2308J2478m637k8221k3092n583P35j257J6637
11992B100169L1714J5754Q923o637n08K6800L5757L1887J6914J9511J5579R734
11980B305597K6564L7423K253j0976Q024L9497M3992K1859J9409P8J6582J3937
11968B524239J5834M487K0162L4258L3986L8462O749L3604N6594P6176P9103N5799
11956B979453j7282l0345l5146l2640k1509j3527j0588K425K2826J8403L472J4537
$$ y = [1345831, 1372658, 1383349, 1374011, 1376518, 1386929, 1406051, 1426543, 1444471, 1464554, 1480274, 1496357, 1498373, 1500831, 1504015, 1512739, 1536333, 1563450, 1589016, 1595497, 1592971, 1608252, 1635805, 1656409, 1653888, 1674126, 1675126, 1690290, 1732201, 1751435, 1777264, 1799490, 1812298, 1821538, 1842599, 1877696, 1930059, 1983198, 2052229, 2100801, 2133109, 2145587, 2140950, 2112729, 2089637, 2084054, 2084789, 2083532, 2100169, 2131883, 2147637, 2156560, 2149923, 2149415, 2176215, 2211972, 2243859, 2260773, 2280284, 2295863, 2305597, 2332161, 2369584, 2371837, 2360861, 2368885, 2408382, 2452374, 2474233, 2493642, 2493720, 2510302, 2524239, 2540073, 2544560, 2564722, 2598980, 2632966, 2671428, 2678177, 2711781, 2768375, 2844551, 2923654, 2979453, 2962171, 2931826, 2896680, 2864040, 2842531, 2829004, 2818416, 2820841, 2843667, 2862070, 2865542, 2880079]
11944B880079J443j00j2009p341P219L0288M637Q183n59K54J7086q429M289n241
11930B919799q192O295J347N962J6400Q921o817j0797j3500m357p493j1234J7609
11917B913943L5164J6152K3201J4570m834j2745l5707j6707j8782j6323l3370
11906B864562k5544o27j3816k4011j3665l244k0255k4914j5974j4490o420k5111
11894B676491j4231j4669k7326l0544k8751j6063o443L690k3512k1766j2600J256
11882B485532k5552l7027j905n302l1980k6774k7077M769m482k3408k8650j8317
11870B259827j4365j4204l0886l6666k8676r078j5514j0150j0724l1466l3657
11859B024441j7935j1629k6089j6688n283k254n568k4302l2038k987j7878j9521
$$ y = [2880079, 2881522, 2881422, 2869413, 2862072, 2869291, 2899579, 2904216, 2912399, 2911840, 2912094, 2929180, 2920751, 2925040, 2919799, 2911607, 2917902, 2919249, 2925211, 2941611, 2950532, 2943715, 2932918, 2919418, 2915061, 2907568, 2896334, 2913943, 2949107, 2965259, 2988460, 3003030, 2998196, 2985451, 2949744, 2933037, 2914255, 2897932, 2864562, 2839018, 2838391, 2824575, 2800564, 2786899, 2783655, 2763400, 2738486, 2722512, 2708022, 2701602, 2676491, 2662260, 2647591, 2620265, 2589721, 2560970, 2544907, 2538464, 2542154, 2518642, 2496876, 2484276, 2485532, 2459980, 2422953, 2421048, 2415746, 2383766, 2356992, 2329915, 2334684, 2330202, 2306794, 2278144, 2259827, 2245462, 2231258, 2200372, 2163706, 2135030, 2125952, 2110438, 2100288, 2089564, 2058098, 2024441, 2006506, 1994877, 1968788, 1952100, 1946817, 1944563, 1938995, 1914693, 1882655, 1879668, 1861790, 1842269]
11847A842269j9453l0237j6443k0229j8366l101j3059j2458o425j0274j5907j9636
11835A656681k2134j288k6164k3873l1465j6453j8083l939l1843l0191j6777j2616
11823A421855q210j830k5335l6273n809L969n611j7308k2601j3698k2257k2046
11811A244846j5108J8269J2034m791q703j7381k5033j4971n178j9561n664j6004
11799A142755j8581p696j1689P556j9005k1242j7943j940j7996o242j0824j4715
11787A002438Q039j5449j5957j2592j763K2632K273j8411k469j1172j8233o286
11775I33050k214o443l848j6536k7558l4642j4729n781R60J833n23j0664n36j0695
11761H01674j7021l1900J1922L947k7632o163R666K618p861N532M640N45l293
$$ y = [1842269, 1822816, 1792579, 1776136, 1755907, 1737541, 1734440, 1721381, 1708923, 1702498, 1692224, 1676317, 1656681, 1634547, 1633259, 1607095, 1583222, 1551757, 1535304, 1517221, 1513282, 1481439, 1451248, 1434471, 1421855, 1413645, 1411815, 1386480, 1350207, 1344398, 1348367, 1342756, 1325448, 1302847, 1289149, 1266892, 1244846, 1229738, 1248007, 1260041, 1255250, 1246547, 1229166, 1204133, 1189162, 1183984, 1164423, 1158759, 1142755, 1124174, 1116478, 1104789, 1112345, 1093340, 1072098, 1054155, 1052215, 1034219, 1027977, 1017153, 1002438, 1010477, 995028, 979071, 966479, 964716, 987348, 989621, 971210, 968741, 957569, 939336, 933050, 930836, 924393, 920545, 904009, 876451, 841809, 827080, 821299, 822259, 824092, 823569, 812905, 812369, 801674, 784653, 752753, 764675, 768622, 740990, 734827, 744493, 747111, 739250, 744782, 749422, 749967, 746674]
11748G46674j2082j8947p616o057j1674R506M72j5541j5841j0740m11M653L425
11735F65821r049m160k3488k5757j3333j3788o025J1448J1315j3823j6276j4429
11723E48456r463j0396l987j061M179J962J6439r018j2639N60j5562p880q545
11710D93045m061J249j000M316P271m82K856j6451k5672R132J6813j1791j9728
11697D55497J7172K0090j1072j2031j6175k264J550q474k109l741p977j095j0196
11684D19175j8925M303R129k038l175J3364P589r927o724J836j6076L733P774
11671D10038k0150r085o444O730k8345l2150r423K2018L4711P944k860m960o557
11658C61467j3364l17k09Q853J1968O631j5888l6248P918J2523J0010L149j5372
$$ y = [746674, 734592, 715645, 708029, 701972, 690298, 699804, 700276, 684735, 668894, 658154, 657743, 662396, 665821, 656772, 652612, 629124, 603367, 590034, 576246, 570221, 581669, 592984, 579161, 562885, 548456, 538993, 528597, 524610, 523549, 527728, 529690, 546129, 537111, 524472, 525032, 509470, 501590, 493045, 488984, 490233, 489233, 493549, 500820, 500338, 503194, 486743, 461071, 470203, 487016, 475225, 455497, 472669, 492759, 481687, 469656, 453481, 451217, 452767, 444293, 442184, 438443, 430466, 429371, 419175, 400250, 404553, 413682, 411644, 408469, 421833, 429422, 419495, 412771, 414607, 398531, 402264, 410038, 389888, 380803, 374359, 381089, 352744, 320594, 311171, 333189, 367900, 375844, 372984, 368024, 361467, 348103, 347786, 347577, 356430, 368398, 375029, 359141, 322893, 330811, 343334, 353344, 356493, 341121]
11645C41121j8477r693j5659n146j1522k0572P876L7525J2239J2117o594n988
11633C17227l887j5601j4900K983r173O407M032j0014k0792r909m192m703L011
11620B40489q754l068J5271L623O073J9470q161J453r925O988m034k7494k569
11607B29362J0000k462p804l744j232J980K6156j804j6631l02J6837J1698j2866
11594B49188o002k637P596K307O013P181K062J5700j5913l9547k2598j1136k087
11581A90127J2019J2877p34o346j3430j0177J644K2025j2509o479n777j3167p217
11568A62856m578M487R114q830j4102J7554j818N637J1271P884j6313J0883Q056
11555A92101n517k06r305j0351p189j392K4963j1456k0194j3260m563J8660P895
$$ y = [341121, 322644, 312951, 297292, 292146, 280624, 260052, 267928, 305453, 317692, 329809, 323215, 317227, 313340, 297739, 282839, 285822, 276649, 283056, 287088, 277074, 256282, 246373, 242181, 237478, 240489, 231735, 228667, 243938, 247561, 253634, 273104, 264943, 266396, 256471, 263459, 259425, 231931, 229362, 239362, 236900, 229096, 225352, 224120, 226100, 252256, 250452, 233821, 233519, 250356, 262054, 249188, 243186, 240549, 248145, 250452, 256465, 263646, 265708, 281408, 265495, 225948, 203350, 192214, 190127, 202146, 215023, 214289, 207943, 194513, 184336, 185980, 208005, 195496, 189017, 183240, 170073, 162856, 158278, 162765, 171879, 163049, 148947, 166501, 164683, 170320, 181591, 189475, 173162, 184045, 192101, 186584, 186378, 177073, 166722, 159533, 158141, 183104, 171648, 151454, 138194, 133631, 152291, 160186]
11542A60186p462k006R549R227Q107j5258j0038J3398Q354j2286j436o125L507
11529A57717J5250M472j6368n280n208N440J0123K1499l380j2637k2799P589J2313
11516A68731P747j2135k054o409l7340m737l484j5174P905M321J553N159k3785
11503I0298p912J8395J6936J5462O62p164j9939J0504J5293k926m936K80m882
11490A20071K873P53N909M231j2486M149J3948j489M408o227q430R48j8639n438
11476A04581o054O048M556L313P227n945m50P791o838l688j5846m525J5178J2415
11462A17763J025k7471l395j0443K329J4058J6179N896j6502k4209n778j2058
11450E7394N229Q411J3191P339J7040L073k2510N142M523j1919j0496l309J976
$$ y = [160186, 152724, 150718, 160267, 169494, 177601, 162343, 152305, 165703, 174057, 161771, 160335, 154210, 157717, 172967, 177439, 161071, 155791, 150583, 156023, 166146, 187645, 184265, 171628, 148829, 156418, 168731, 176478, 164343, 162289, 155880, 118540, 113803, 110319, 95145, 103050, 107371, 108924, 114083, 90298, 82386, 100781, 117717, 133179, 133841, 126677, 106738, 117242, 132535, 129609, 124673, 124953, 120071, 122944, 123697, 129606, 133837, 121351, 125500, 139448, 137959, 142367, 136140, 127710, 128658, 110019, 104581, 98527, 104575, 109131, 112444, 119671, 113726, 113276, 121067, 114229, 110541, 94695, 90170, 105348, 117763, 118788, 91317, 87922, 77479, 79808, 93866, 110045, 115941, 99439, 75230, 69452, 57394, 62623, 71034, 84225, 91564, 108604, 111677, 89167, 94309, 98832, 86913, 76417, 73108, 75084]
11437G5084J4069J4727j0351j1172J1793n755R350R33q325o469Q906l291q728
11424H0771k386K94K254L404n932m829j5211K3408J1177p017Q26L728L566J4176
11410A08229j2075n598M717q281q387K063j113m665O373m191j6557j1804N773
11397E4484r911k795m217K8348M5636M081j3099j0178Q732K1384k881l0073j2027
11384G7484j3006p741j5458K2319J1049j6400j7165j4734K4651K8076K072j6172
11372F4975R732J1942O295j0464k4204K044q84j2181p538M664K1160r551R901
11359F5891p065k6833r054L3415J0878J4686R155j7844j5742R053J751o271o651
11346E5369l930p963j6221q299K2011K2670O299n252l136k329r070j0547j063
$$ y = [75084, 89153, 103880, 93529, 82357, 94150, 88395, 97745, 98678, 90353, 83884, 92790, 89499, 80771, 78385, 78679, 80933, 84337, 78405, 73576, 58365, 81773, 92950, 85933, 86759, 90487, 94053, 108229, 96154, 90556, 95273, 86992, 78605, 80668, 79555, 74890, 81263, 77072, 60515, 48711, 54484, 44573, 41778, 37561, 65909, 111545, 115626, 102527, 92349, 101081, 122465, 119584, 89511, 77484, 64478, 56737, 41279, 63598, 74647, 58247, 41082, 26348, 50999, 79075, 81147, 64975, 74707, 86649, 92944, 82480, 58276, 60320, 59436, 47255, 39717, 44381, 65541, 55990, 65891, 58826, 31993, 22939, 56354, 67232, 81918, 91073, 73229, 57487, 66540, 68291, 62020, 55369, 51439, 43476, 27255, 18956, 40967, 63637, 69936, 64684, 61548, 59219, 50149, 39602, 38539]
11333C8539o825j1541j0254R967p19n444N079K4391J306M080r773J0582J1276
11320F0664K0114q917j5250q179J2331o698l892n477j8193J3940J5341n482j0856
11307C9446J014O43l794N840J0998R834j410K014J2266J0292k8948k1592j2018
11294B4585r074N081p539J6377L4149J3631o969j1691r886k34J3647n919j5744
11281D0414L081J0622j5450j569P292l388N475J754Q588R730j1888j5878J2324
11268E1107L6275l08k0830j3405p861r911O069J01K493k0360k135L484q323N028
11254B1424R348l289j7833J371N755O463m736O026o991J8312J7755j0472j9569
11241B3564K397J3289j157o037r913Q04P104p002Q08j3142J0893K5822n236p444
$$ y = [38539, 31714, 20173, 9919, 19886, 19167, 13723, 18802, 43193, 44499, 48579, 38806, 49388, 60664, 80778, 71861, 56611, 48432, 60763, 54065, 50173, 44696, 26503, 40443, 55784, 50302, 39446, 40460, 41103, 37309, 43149, 54147, 63981, 62571, 64585, 76851, 87143, 58195, 36603, 24585, 15511, 20592, 13053, 29430, 63579, 77210, 70241, 58550, 48664, 48430, 62077, 56158, 40414, 43495, 54117, 38667, 37098, 44390, 41002, 46477, 48231, 56819, 66549, 54661, 38783, 51107, 87382, 87074, 66244, 52839, 44978, 35067, 41136, 41237, 43730, 23370, 21235, 24719, 16396, 21424, 30772, 27483, 9650, 11021, 16776, 23239, 18503, 24529, 17538, 35850, 53605, 43133, 23564, 25961, 39250, 38093, 32056, 22143, 22947, 30051, 23049, 23857, 10715, 21608, 47430, 42194, 34750]
11227C4750r00j308M652J573M168R93j8335k6260M919P953J4912j419j0906j5279
11213d87J8857J0304l444p585m09Q662r846n450p451j4049P356p691j2696J768
11199b2161J0492Q006R996L318r883q511J5005J8852J1289R295O474j1551j6224
11186B4397Q562P332K748P495j7404j0126M995m499o531J6773M989p95p536k937
11172B7463j0860J906K535K4992q77j9454p242l51j6890m289Q68J3091L657j3501
11158A048p500O306N929P262M654k865O08n748L099J5230r434J004O833q879K084
11143A9631J7287Q739k78p364k8783j0433j1663M736Q465J0588O664Q689J891
11130B8169k3456j0524L5803J7364r038l157N533k6688o916N375R112J49J09o044
$$ y = [34750, 33850, 32542, 37194, 38767, 42935, 43928, 25593, -667, 4252, 12205, 27117, 25698, 14792, -487, 18370, 28674, 25230, 17645, 17236, 25898, 16052, 10602, 3151, -10898, -3542, -11233, -23929, -22161, -11669, -3663, 6333, 9651, -232, -8743, 6262, 25114, 36403, 45698, 52172, 40621, 24397, 32959, 40291, 43039, 50534, 33130, 23004, 27999, 23500, 16969, 33742, 38731, 37936, 30400, 27463, 16603, 18509, 21044, 46036, 45159, 25705, 18463, 18112, 1222, -3067, -2199, 10892, 14549, 1048, -6452, -146, 5783, 13045, 17699, 14834, 15442, 9694, 12793, 28023, 18589, 19593, 26426, 17547, 19631, 36918, 45657, 45379, 38015, 9232, -1201, -12864, -8128, 337, 10925, 17589, 26278, 28169, 4713, -5811, 29992, 47356, 38318, 35161, 40694, 14006, 7090, 12465, 21577, 21726, 21835, 15791]
11116A5791o768O982j5707j9637m801J6666O502L55J977M032p59Q33J0607J0142
11102B6215R56l978k666K037P89N599j757j4229P685k030m485j1768m28l719N661
11087C882L37P669q625k0530l875K1851J2559L731O7o719j3347j5400J9842J9695
11073B1137q181j4664j2875q65L647J8356Q466L801J1348p192q628K239l149p353
11059F087L792j1775k424K5210J3816l880j115j7833J0087J0270K000j408p79
11046C2048k878J9791O887r540M088J5875O859R227n559L0417J3073P813J1948
11033A40049O544q417j4551j8892n199K0394K0031J5308J9436L9538J3756K617
11021B30614l5168m0947k4511k7837j342J9648j0034q42K0117J4777J557L459
$$ y = [15791, 9023, 16005, 298, -19339, -24140, -7474, -972, -617, 1360, 5392, 4633, 5466, 16073, 26215, 27171, 23193, 20527, 22564, 23353, 28952, 27195, 12966, 20651, 18621, 14136, 2368, 1940, -1779, 3882, 4219, 11888, 3263, -17267, -21142, 709, 13268, 16999, 17066, 10347, -3000, -18400, 1442, 21137, 12956, -1708, -14583, -15448, -11801, 6555, 15021, 18822, 30170, 22978, 14350, 16589, 13440, 6087, 9879, -1896, -4320, 20890, 34706, 30826, 29711, 11878, 21965, 32235, 34235, 32827, 32048, 29170, 48961, 55848, 46308, 50396, 66271, 73130, 82357, 76798, 107215, 120288, 128101, 140049, 146593, 138176, 123625, 104733, 99534, 119928, 139959, 155267, 174703, 214241, 227997, 230614, 195446, 154499, 129988, 102151, 100809, 120457, 110423, 109581, 129698, 144475, 146032, 149491]
11009A49491j0827p654p612l2419k4066o042k013j755j3874J1745K6554m660k8521
10996D8347o481J2821J714k0651m636j5697o463J6239J840o211J32j3305k1371
10983a3722K0145Q339j7979n463K0409J8952j7868k3203q434k125O181l481k613
10970b0862K6974J9721j0859l0567M125J5529P442K532R691q032L270K754j2255
10957I463o516K055L144j1829j680N383p842n949o035j1807k5468J5876K3926
10944a7279J3977P292L885k5742M711J2N278j1874m187J764p641J7241K2884p180
10930C141N819J862j1920j3950M425M869J302J85M475P395l380p51J4706P072
10916B5250o324p048K320J8793Q023j8927j7319J071J110P674L605l774p500l836
$$ y = [149491, 138664, 131010, 123398, 90979, 66913, 60871, 58858, 57103, 43229, 54974, 81528, 76868, 48347, 41866, 54687, 56401, 35750, 31114, 15417, 8954, 25193, 27033, 20822, 20954, 7649, -13722, 6423, 14762, -3217, -8680, 11729, 30681, 12813, -10390, -18824, -20949, -14768, -18249, -20862, 6112, 25833, 14974, -15593, -11468, 4061, 11503, 14035, 23726, 15694, 18964, 21718, 9463, 2947, 5002, 8146, -3683, -5363, 20, -7822, -13771, -19806, -31613, -57081, -41205, -17279, -3302, 3990, 7875, -17867, -13156, -13144, -7866, -19740, -23927, -22163, -29804, -12563, 10321, 3141, 8960, 10822, -1098, -15048, -10623, -5754, -4452, -4267, 208, 7603, 4223, 3472, 18178, 25250, 18926, 11878, 14198, 32991, 41014, 22087, 4768, 5839, 6949, 14623, 18228, 14454, 6954, 3118]
10902C118j8298j602J7300j2038n497j4494j576Q055K1607L0134J3782r710k6464
10889D317j0183j6048K452J3618J8987N169k1761k191R18n885J720K633j0702
10876a6956q929J3947L712J0113J472J228j1734J895m480r524P841o360j042K1112
10862B295M039o22p327k326J5684R781j0136k4536m598J3701k42n95J8268J1159
10848B4545O757m723R700K1013l116k5886l927q0j2584j6327n968J3362K8658
10835C1424l33k5620k8640Q660L0766J2595l913p695j0296j1865m721M764J5049
10822A0175J0020q527r221k3952p262J1164j1601l451n144n839l279r174N195
10809e0896K1073J831P725l479M579k159j3913j9200N873p40J2905Q562R086R833
$$ y = [3118, -15180, -16782, 518, -11520, -17017, -31511, -33087, -25032, -3425, 26709, 40491, 30781, 4317, -5866, -21914, -19462, -5844, 13143, 18312, -3449, -5640, -4722, -10607, -8887, -6254, -16956, -25885, -11938, -8226, 1887, 3359, 4587, -7147, -5252, -9732, -19256, -11415, -17775, -18817, 2295, 6334, 5712, -1615, -3941, 11743, 21524, 11388, -13148, -17746, -4045, -4287, -4882, 13386, 24545, 31302, 26579, 36279, 57292, 54176, 28290, 24363, 24283, 11699, -4628, -10596, 2766, 31424, 31091, 5471, -23169, -14509, 16257, 28852, 24939, 17244, 6948, -4917, -9638, -4874, 10175, 20195, 11668, 2447, -21505, -28767, -17603, -29204, -32655, -37799, -43638, -46917, -56091, -50896, -29823, -27992, -20267, -23746, -19167, -21326, -35239, -54439, -48566, -49306, -36401, -27839, -18753, -8920]
10795h920k4124j0846L103j0971q400O669J219j4034o76J7765J44J3086J2570
10782b3415R562r04N851l070M677J1173o963j2640q118j0389j5932P327J7621
10769b5220K107L118L017o466q390m390n104J0054J6367m535J369j4736L159L660
10755b5990J0961K76j6888N490L810k1951j0299L390L673n755M92L464j5485l91
10741f5203L797P874K050J7067K4279j4184p504N858j9802p639q191j9880J6014
10728f5464K6828r98p484j199r87J3969L170j7528n568J992j137r268K245K965
10714e8464L5848J6698q976k5945r342N968p361P49n285J805K258L640J5516J7649
10700a5242p396n08m445j5030K06M720k269k62L7536P372J4797L058j2083k3952
$$ y = [-8920, -33044, -43890, -40787, -51758, -60158, -53489, -52270, -66304, -66980, -49215, -49071, -35985, -23415, -13853, -14757, -8906, -11976, -7299, 3874, -3089, -15729, -23847, -34236, -50168, -42841, -25220, -23113, -19995, -16978, -23444, -31834, -36224, -41328, -31274, -14907, -19442, -18073, -32809, -29650, -25990, -15029, -14753, -31641, -26151, -22341, -44292, -54591, -51201, -47528, -53283, -52791, -49327, -64812, -65203, -61406, -53532, -51482, -34415, -10136, -24320, -31824, -25966, -45768, -53407, -61598, -81478, -65464, -38636, -39634, -47118, -48317, -49304, -35335, -32165, -49693, -55261, -53269, -54406, -63674, -61429, -58464, -22616, -5918, -14894, -40839, -50181, -44213, -51574, -50825, -56110, -54305, -52047, -48407, -32891, -15242, -22638, -23146, -27591, -42621, -42415, -37695, -39964, -40226, -2690, 4682, 19479, 22537, 10454, -13498]
10686a3498N197j155k141n315J2024N235j5152o898J0551j783K245J8042K4878
10673C2230j4699j388N435Q204q350n651j398K9813J0272l56q527j5214O705Q438
10659D5514J010J0221J6085l828L901K574P055Q140j515K058K066J8122L3131
10646A44534Q662Q493J4805J0472K0427J3816L6164N1025M3494O8634O6874O9435
10634E56835Q6003J00450R4733J09249J17743J46211J93935K52939L22979L94233
10624B375310N17531O51148Q68594J134665J427529J750756J911546J680448J064080
10615A3381607L57210j31329k89657j83980K45486Q48690J619261K504556L352570
10606B1704414L720144K977768J211625n47283j560191j898343j560176o70604
$$ y = [-13498, -8301, -9456, -11597, -16912, -4888, 347, -14805, -21703, -11152, -12935, -10690, 7352, 32230, 17531, 16143, 21578, 29782, 21432, 15781, 14383, 44196, 54468, 54112, 45585, 30371, 37076, 45514, 46524, 56745, 72830, 69002, 72903, 75477, 82532, 90672, 89157, 91215, 93281, 111403, 144534, 153196, 161689, 176494, 186966, 207393, 221209, 257373, 308398, 351892, 420526, 487400, 556835, 642838, 743288, 838021, 947270, 1065013, 1211224, 1405159, 1658098, 1981077, 2375310, 2892841, 3543989, 4412583, 5547248, 6974777, 8725533, 10637079, 12317527, 13381607, 13738817, 13607488, 13317831, 13133851, 13379337, 14228027, 15847288, 18351844, 21704414, 25424558, 28402326, 29613951, 29066668, 27506477, 25608134, 24047958, 23377354]
10598B3377354M66054J760487L090783M183884M430562L000398J77622k359254
10590C8127890l740372m096868l580824k450278j165122J06792J251355K048816
10582B6501389K090549R89147r13048k527210l293367l367188k889156k037991
10574A4553125j180307m65878Q2433L92389L48457j35968q86306j506559j793567
10565I407819j773202j575921j268786r41558p05005n17592l91245k78258k05091
10556A751161k03614j67551j23603j07600r4614j05519p0128p3887p0406l4187
10546G00052l4395k0649n5053n8145j6982j4914j4069j8904k9261k5199k7567
10535C84914j9787o193k6490k3241j711q742j4516j3073j4387P182P136k8112
$$ y = [23377354, 23843408, 25603895, 28694678, 32878562, 37309124, 40309522, 40487144, 38127890, 34387518, 30290650, 26709826, 24259548, 23094426, 23201218, 24452573, 26501389, 28591938, 29581085, 28668037, 26140827, 22847460, 19480272, 16591116, 14553125, 13372818, 12906940, 12989373, 13381762, 13730219, 13594251, 12707945, 11201386, 9407819, 7634617, 6058696, 4789910, 3848352, 3143347, 2625755, 2234510, 1956252, 1751161, 1547547, 1379996, 1256393, 1148793, 1054179, 948660, 878532, 804645, 734239, 700052, 665657, 645008, 589955, 531810, 514828, 499914, 485845, 466941, 437680, 412481, 384914, 365127, 358934, 332444, 309203, 307492, 298750, 284234, 271161, 256774, 263956, 271092, 242980]
10523B42980r870j757J8461j2525k221o138j7612l747r507q266j7269J538K899
10510A76966j7798j725R014P794j7994k1210j527j2061p581j1243O42N570Q935
10497A17782M260p994j2202O011J1287l661K372P656J2979K151j7730j2413J5938
10484A26436J1919n003p816P453J7896m639j9420k120K598p794N163J6784J3653
10471A55110j2405k5858L364K605J5412J8211j0762k1089q94O744k265L357J5612
10458A47142k6677k1654K1111J078M603L878K0990j450k6309k387k9549l177j2141
10445G5458j3174P541K659M851J3064L784j7792k230q3l870l3Q715m871j3969
10431F0050J195r905l270j6091J5327J496J6113M425r643K972o283l979J83j1181
$$ y = [242980, 233110, 231353, 249814, 237289, 235068, 228930, 211318, 207571, 198064, 189798, 172529, 174067, 176966, 159168, 157443, 166457, 174251, 156257, 135047, 133520, 121459, 113878, 102635, 103277, 108847, 117782, 122042, 114048, 101846, 107857, 119144, 115483, 117855, 125511, 138490, 140641, 122911, 110498, 126436, 138355, 133352, 125536, 132989, 150885, 146246, 126826, 124706, 127304, 119510, 124673, 141457, 155110, 142705, 116847, 120211, 122816, 138228, 156439, 145677, 124588, 123694, 130438, 128173, 131530, 147142, 120465, 98811, 119922, 121000, 125603, 129481, 150471, 149021, 122712, 120325, 90776, 87599, 75458, 62284, 69825, 72484, 77335, 90399, 94183, 76391, 74161, 74078, 70208, 70175, 78890, 74019, 60050, 61245, 51340, 48070, 31979, 47306, 48802, 64915, 69340, 59697, 62669, 56386, 52407, 52590, 41409]
10417D1409K865N055J040K37l110J8086j1433j0475k2658o50o573J2871K6899
10404E3563J219o588Q152p547q716j1219R099J3165l22j79Q915j0109j8669P670
10390C8434k814J2513J09j1127O432l975j6943Q79P983O950K791j0748m397L161
10376B9248J0383L999j673M390l349j507r658j791k3924r667j786K193M666J3140
10362A4664Q433J0017M013j0251Q574R129p005j3547j1225q068j4944J2180J3680
10349A5650o1r760J765J29K955j346k928k405J6322l736M203p179j8316j664K4173
10334A7802K0561j6018k8259J488M318j707p552J221K035N064J6745K0551L428
10321C9677O237k8120r330J424L746j7359j3770J3658k928k447J2323J293k269
$$ y = [41409, 44274, 49329, 50369, 50606, 47496, 65582, 54149, 43674, 21016, 20366, 13793, 26664, 53563, 54782, 48194, 56346, 48799, 40083, 28864, 37963, 51128, 50806, 50627, 59542, 49433, 30764, 38434, 35620, 48133, 48242, 37115, 43547, 39572, 22629, 23508, 31491, 38441, 41232, 30484, 26087, 29248, 39631, 43630, 41957, 46347, 42998, 41491, 31833, 30042, 6118, -3549, -5335, -3142, 1524, 14664, 23097, 33114, 37127, 26876, 35450, 44579, 37574, 24027, 12802, 4734, -10210, 1970, 15650, 15589, 5829, 7594, 7723, 10678, 9332, 6404, 3999, 20321, 16585, 20788, 13609, -4707, -6371, 17802, 38363, 22345, -5914, -4426, -108, -1815, -9367, -8146, -6111, -1047, 15698, 36249, 39677, 45914, 17794, 8464, 9888, 13634, -3725, -17495, -3837, -6765, -9212, 3111, 4404, 2135]
10308B135J704L667O666m121p396j0489J210N892R184J0228j1089K3386j2849
10295A8128j6439N261J0285j3312j008O444J1717r29l5323n709K7331R126K415
10282A7987k1453m501K1265J7025k490j4982k5413m593J4837K789j4398J5264
10270A337J7046Q196j7975k4413K616J9298J0574K0267o09j7632r69m526j1177
10257B033L831N34J237K053q423r555r445L735N889l173R033N211j9019j7375
10243c3434J0334J0523J8567j442j6170j7912K490N850j776J5679J3326j8231
10231a2196k782J6234j62q708M66J4855J04K536r587o108K2510o564j2989K169
10217b22k8559P331K9036Q630N721N934k789j6948q893J3287J1631J5897q688
$$ y = [2135, 3839, 7506, 14172, 10051, 2655, -7834, -6624, -732, 8452, 18680, 7591, 30977, 18128, 1689, 6950, 17235, 3923, 2915, 9359, 21076, 20147, -15176, -20885, 6446, 15572, 17987, -3466, -7967, 13298, 30323, 27833, 12851, -12562, -17155, -2318, 471, -13927, 1337, 18383, 26579, 8604, -15809, -13193, 6105, 16679, 36946, 36337, 18705, 17736, 13210, 2033, 5864, 6398, 7635, 9688, 1265, -8290, -17735, -14000, -8111, -11284, -2251, 2960, -16059, -33434, -23100, -12577, 5990, 4548, -11622, -29534, -27044, -21194, -22970, -7291, 6035, -12196, -14978, 1256, 1094, -7614, -7148, 7707, 7811, 10347, 760, -5348, 17162, 10598, -2391, -222, -28781, -21450, 7586, 16216, 21937, 27871, 25082, 8134, -759, 12528, 24159, 40056, 31368]
10204C1368j4958K648p603r184J932j6168j4859j1348P875J8798j1314n470Q53
10191b7430P110R855J2004J9948J4984O745P257l914j334J7884K2490K0172k938
10178A02833J4195n352j0043j284L563j5408j0163L0182M1373K5168J5169J4716
10166B04949J1827P28j4240m919K0645J7222K2867L9302M5333N6493M8804L3076
10154D82087M0156N8879Q3955J06118J77663K16387K34892K29646K14519J90508
10144B034810J40032K7455m5059j47853k08539k26087k43881k58317k31259j77388
10134F63914j56712j24465p3125l2340m7050l0816k0215j515k7836j7926j4583
10123A17331l5769j1756j0877K179J6685j0850r304k4141k2876k3785n412J642
$$ y = [31368, 16410, 19058, 11455, 2271, 4203, -11965, -26824, -38172, -30297, -11499, -22813, -28283, -27430, -20320, -10465, 1539, 21487, 36471, 43216, 50473, 46559, 45225, 63109, 85599, 105771, 102833, 117028, 111676, 101633, 100349, 103912, 88504, 78341, 108523, 149896, 175064, 190233, 204949, 216776, 217504, 203264, 198345, 218990, 236212, 259079, 298381, 343714, 400207, 449011, 482087, 522243, 581122, 665077, 771195, 948858, 1165245, 1400137, 1629783, 1844302, 2034810, 2174842, 2202297, 2157238, 2009385, 1800846, 1574759, 1330878, 1072561, 841302, 663914, 507202, 382737, 309612, 277272, 230222, 199406, 179191, 177676, 149840, 131914, 117331, 81562, 69806, 58929, 61108, 77793, 66943, 57639, 33498, 10622, -13163, -18575, -16933]
10111a6933K218K059j359O039J7040r531j0761O789J0537J2210r646j0978J4902
10098A2586J833n065q474J1247m784n609J4791K1117j2000k1461M845J591J6359
10085B6976J56n857o316k2280j2448M336j190p562j33m343p076J020J6666R53
10071a7098J5212J1939q528p330M470j618P938j0331o176q560j6076m384J2029
10058b8513N483j787j1587J4203J0140O005O203K2735r798k8445q113R747J29
10045a3598j6882R402J8807L332K1846k747j1746p895k453M208K894j9114k859
10032a6805m561n734J4363J6784N756J020L777q22l227k2470O444j1035r806K2193
10018d123l234n386l365M429l181M77q433J0944K5809j0896j8146j5157K5233
$$ y = [-16933, -14715, -12656, -14015, -7976, 9064, -467, -11228, -4439, 6098, 18308, 8662, -2316, 12586, 14419, 9354, 880, 12127, 7343, 1734, 16525, 37642, 25642, 4181, 9026, 10617, 26976, 27132, 21275, 14959, -7321, -19769, -15433, -16623, -24185, -24318, -28661, -35737, -34717, -18051, -17098, -1886, 10053, 1525, -5805, -1335, -2953, 4985, -5346, -11522, -20082, -36158, -40542, -28513, -23030, -24817, -36404, -22201, -12061, -6056, 147, 22882, 13084, -15361, -23474, -13727, -13598, -30480, -21078, -2271, 1061, 22907, 20160, 8414, 519, -1934, 2274, 5168, -13946, -16805, -21366, -27100, -12737, 4047, 9803, 10823, 14600, 13778, 10551, -11919, -5475, -16510, -26316, -4123, -7357, -12743, -16108, -11679, -14860, -14383, -22816, -11872, 13937, 3041, -15105, -30262, -5029]
10005e029J0686r457j2541m848Q271Q686R049J1698j5756k5364k257R192R967
9992g703J9022N513r674P876J374k1152k0032P809M186j0260r129J9554R6J0197
9978b323P740q223q420q570n879L651r739p36J0456m896o35J1642J012p286j1004
9963c3210K5167O313n504J623M017o086M243k4766o290P461J3234M983o837k187
9949a7839m094m580L282j9158p165K0888K4892j2158k704R110j5153r552m767
9936c8998q936P165L3548Q639j2826N634j2943L753J8532L274j3014j1215p11
9923a8098J214M765j061K1165N92k4930q160L065N651P733q448q578K476m989
9909b7603J7940K293j1040j5100M434J215J4413K7365j494k1605j3559L588K6758
$$ y = [-5029, 5657, -3800, -16341, -21189, -12918, -4232, 4817, 16515, 759, -24605, -26862, -17670, -7703, 11319, 16832, 7158, 15034, 16408, -4744, -24776, -16967, -12781, -23041, -32170, -12616, -12520, -2323, 5417, -2806, -11226, -19796, -25675, -22024, -31763, -32499, -22043, -26939, -27574, -15932, -14920, -22206, -33210, -8043, -1730, -7234, -5611, -1594, -7680, -3437, -28203, -34493, -27032, -13798, -8815, -15652, -17839, -21933, -26513, -23231, -42389, -49554, -28666, -3774, -15932, -18636, -9526, -24679, -34231, -38998, -47934, -40769, -7221, 1418, -11408, -5774, -18717, -14964, 3568, 6842, -6172, -17387, -18098, -16884, -12119, -13180, 7985, 8577, -16353, -24513, -21448, -15797, -8064, -16512, -25090, -22614, -27603, -9663, -7370, -18410, -33510, -29076, -27861, -13448, 13917, 12423, -9182, -22741, -19153, 7605]
9896G605q919L39k0895j1462J4158R628k2819N076K0063J4241L270q842j7045
9883a5602q581j0458J7487J6583J2181k547k6508j0459J3869K0985J0506j2880
9871D576j7000J8263l359p094r929oN301K00PK357m029j0654K521Q537Q837j6741
9855a8213n975o64r552l365K1282R575o428j8042Q337P065J7425k53j3008j1393
9841b3209j1601j0716O106K2650J3319Q939j3282L80J487p512R98l663j6129n795
9827c8028P182M587o457K5687K2490M380k3353r60L505q655j0187j9538r085M155
9813d4277J0435Q99R632R251r194j1428j6870m602K4840J2395q033m941K3221
9800h672r465k25n47j2192K834J8946K0716k1179l581p601n287J5014J3317J4696
$$ y = [7605, -1314, -975, -21870, -33332, -19174, -9546, -32365, -27289, -7226, 7015, 10285, 1443, -15602, -24183, -34641, -17154, -571, 11610, 9063, -17445, -27904, -14035, 6950, 17456, 4576, -12424, 5839, 2480, -4614, -14543, -14549, -9248, -9048, -9041, -6684, -10713, -21367, -18846, -10309, -1472, -18213, -24188, -24852, -34404, -37769, -16487, -6912, -13340, -31382, -23045, -15980, 1445, 1192, -11816, -23209, -34810, -45526, -39420, -16770, -3451, 5488, -7794, -7414, -5927, -13439, -12441, -16104, -32233, -38028, -30846, -26259, -32716, -7029, 15461, 19841, -3512, -4472, -967, -9622, -19809, -39347, -48432, -44277, -33842, -32943, -23311, -14060, -23254, -34682, -51552, -56154, -31314, -18919, -26952, -31893, -8672, -18137, -18362, -18909, -31101, -28267, -9321, 11395, -9784, -13365, -20966, -26253, -11239, 2078, 16774]
9786A6774p945j1214J1388L355q106r970k2803K318K5013M128J610L147J99Q778
9772A6672m067J053L669k462r699K771k032j6365J622R781N659P657O444j004
9758A9699j514P503k2246j4031r339J1760J1133p037J1617J3972R924p677j5532
9745H232K242q613k0481j101M855r5m186j2361n221J4891L392K1006J0765j4923
9731a598k0410k485R497k0535l857J5602J4485m312J4343J5444j1710q814l990
9718h340j659j7145k787O499J6374J317j29P197l002j3657p937n099M227J3020
9704a1121j2020n353J5899K3391l702P976K1063J1633J0060P453M735m859J7194
9691H2349K2639J0521O995J0908k1437k7423P554J2396J0476P000J3038q584k6407
$$ y = [16774, 8829, -2385, 9003, 12358, 4252, -5718, -28521, -26203, -1190, 2938, 4548, 7695, 7894, 16672, 12605, 13658, 17327, 14865, 5166, 7937, 5905, -10460, -8838, 943, 6602, 14259, 20703, 19699, 18185, 25688, 3442, -10589, -19928, -8168, 2965, -4072, 7545, 21517, 31441, 23764, 8232, 10474, 1861, -18620, -19721, -14866, -14961, -19147, -31508, -36729, -21838, -18446, 2560, 13325, -1598, -22008, -24493, -14996, -35531, -39388, -23786, -9301, -13613, 730, 16174, 4464, -4350, -8340, -9999, -27144, -29931, -23432, -7058, -5741, -5870, 1327, -1675, -15332, -23269, -28368, -24141, -11121, -23141, -28494, -12595, 10796, 7094, 15070, 36133, 47766, 57826, 65279, 70014, 65155, 82349, 104988, 115509, 122504, 133412, 111975, 84552, 92106, 104502, 114978, 121978, 135016, 126432, 100025]
9678A00025j4933L984j1409O904K4135P798j5936J4214L0052J7155k1043j5635
9666A25311Q794J6177P481j7p084Q959K0368J3937K6334K5989N5270J25663J64745
9653E91927J86496L1482j00848j19920j43865j11124o9087l0151j5840r050k3797
9642A86223n768j2428R22k1278q690J5895k1165j4691nJ5478j167r482J0741Q477
9628A43062k962Q200J759J3537j007j8238J502q706J1154J2854J1696L745P377
9615A83973J7228Q380q379J2310M891o866j5920j0266j0840r779k1082j6976j8445
9602A08229r660q863J4580j4146o987r032J027k177j3699k9447m965P204k794
9589B9270K6293J0516r831L731j9237j9865l406p288k5961L849K5921m120j2533
$$ y = [100025, 85092, 89076, 77667, 84571, 108706, 116504, 100568, 114782, 144834, 161989, 140946, 125311, 134105, 150282, 157763, 157746, 150662, 159621, 179989, 193926, 220260, 246249, 301519, 427182, 591927, 778423, 809905, 709057, 589137, 445272, 334148, 265061, 234910, 219070, 210020, 186223, 180455, 168027, 168949, 147671, 138981, 154876, 133711, 119020, 119015, 134493, 133326, 123844, 134585, 143062, 140100, 148300, 150059, 163596, 162589, 144351, 145853, 137147, 148301, 161155, 172851, 176596, 183973, 201201, 209581, 201202, 213512, 218403, 211537, 195617, 185351, 174511, 164732, 143650, 126674, 108229, 98569, 89706, 104286, 90140, 83153, 74121, 75148, 72971, 59272, 29825, 24860, 32064, 29270, 55563, 66079, 56248, 59979, 40742, 20877, 17471, 10183, -15778, -11929, 13992, 9872, -2661]
9576b661N899M799q236k6794p991J8462Q042j2269q984J0701J4178j0235N988
9563i101M254R019n179N202J2094Q227K3364J3534m798j6496j7068Q450O196n161
9549C2537p017j2827m475J1989j246k837m266j2747n12K370j9387k88J3599M444
9535f63j2811o132K9834K6353o114j432j703q556K526k64n186o445K075j941L469
9520A3010J4405p591J7637K651J7875P017k4628K859J7437p233q82N185N28K4812
9506H3082L1219K3932J0666L2462j5823j9957o518r052j3324j8602j0847m141
9494H3097j4210o249k534m719L083m121j7403o619p739J6102j627p767n956K590
9480B5928q729L175N350L754K1558n084L581j6406j7012L755j3983P728K4657
$$ y = [-2661, 3238, 8037, -199, -26993, -34984, -16522, -8480, -20749, -29733, -19032, -4854, -15089, -9101, -4847, 4172, -1007, 4195, 16289, 24516, 47880, 61414, 56616, 40120, 23052, 31502, 37698, 32537, 25520, 12693, 8218, 20207, 18961, 16124, 11858, -889, -1401, 969, -18418, -18706, -5107, -663, -13474, -19606, 10228, 36581, 30467, 29035, 27332, 18776, 21302, 21038, 15852, 9407, 11482, 9541, 13010, 27415, 19824, 37461, 40112, 57987, 65004, 40376, 43235, 60672, 53439, 52557, 57742, 58270, 83082, 114301, 138233, 148899, 181361, 165538, 145581, 139063, 130011, 116687, 98085, 87238, 83097, 68887, 62638, 60104, 55385, 58468, 54347, 36944, 30325, 22586, 38688, 37061, 29294, 23338, 25928, 17199, 20374, 25724, 29478, 51036, 45952, 49533, 33127, 16115, 19870, 5887, 13615, 38272]
9467C8272K0991J1304j3893j6945n292l491k1180r96j2285J8188J0071O98k169
9454B3273j1715M445J2169p99J1018j3547j7596J1957J650K31O610J3783K7377
9441F8856j1343r921j0062j0612L639j2369Q322P295p069J314K3405n65m870r40
9427D5080J0939O421m300O7P011J312j524L173k2665m193P176Q054J366P780m517
9412F1180l16j519p511J0294l525k4227J4532K7817j4731O415j5214k2887k912
9399B7396J526J813L4898J6515P72j0933J511J440M964j100O800L4598J8284j3225
9385A25259r224j2311q84n127j3579K480k607j0235l6708k4748j634J980R421
9372B2083J2872K5124K8624K3400J9729K0356K0041K5713J4246Q981P343l231
$$ y = [38272, 59263, 70567, 56674, 39729, 34437, 30946, 9766, 8770, -3515, 14673, 24744, 25442, 23273, 11558, 16003, 28172, 27373, 38391, 24844, 7248, 19205, 20855, 21086, 27696, 41479, 68856, 57513, 47592, 37530, 26918, 30557, 18188, 26510, 33805, 26736, 28050, 51455, 50890, 46020, 45080, 56019, 62440, 58140, 58207, 65218, 66530, 65006, 68179, 45514, 41321, 48497, 56551, 57917, 65697, 61180, 60864, 59345, 51834, 62128, 58603, 34376, 48908, 76725, 61994, 68409, 53195, 30308, 27396, 28922, 30735, 65633, 82148, 82920, 71987, 73498, 74938, 79902, 78802, 85602, 120200, 138484, 125259, 116035, 103724, 102840, 97713, 84134, 86614, 84007, 73772, 37064, 12316, 10682, 12662, 22083, 34955, 60079, 88703, 112103, 131832, 152188, 172229, 197942, 212188, 221169, 228512, 225281]
9360B25281j1214M93K3211J8566L175J5090K246P865J3655m571N53K4815L7555
9347C56720J1498j1185j1738M039N392K9427K7529O298J708J0522J8735J2747
9335D61692J1957Q666J4806K4516J4121L0607J8710j1109K4900K3880J6809J9403
9323F58958L4167K4141J5649K7505J9222J7115K1560N8317L8612M0013K1651J6782
9311I93692M1022L2159M1847L7574N2287M8983M0895M7993O1227O5054Q2064P8614
9299A623411O7647N2346O5637O2954O8755O2188R1246Q3427R3234J17153J38690
9288B526688J21641J31630J65737J71537J82665K09167K34734K40145K49282K78336
9278D511562L32773L44372L67409M39582M79267N49232O31816P13471Q31931R25739
$$ y = [225281, 214067, 214560, 237771, 256337, 259512, 274602, 276848, 284713, 298368, 293797, 294350, 319165, 356720, 368218, 357033, 345295, 349334, 354726, 384153, 411682, 417980, 419688, 430210, 448945, 461692, 473649, 482315, 497121, 521637, 535758, 566365, 585075, 573966, 598866, 622746, 639555, 658958, 693125, 717266, 732915, 760420, 779642, 796757, 818317, 876634, 915246, 955259, 976910, 993692, 1034714, 1066873, 1108720, 1146294, 1198581, 1247564, 1288459, 1336452, 1397679, 1462733, 1544797, 1623411, 1691058, 1743404, 1809041, 1871995, 1940750, 2002938, 2094184, 2177611, 2270845, 2387998, 2526688, 2648329, 2779959, 2945696, 3117233, 3299898, 3509065, 3743799, 3983944, 4233226, 4511562, 4844335, 5188707, 5556116, 5995698, 6474965, 7024197, 7656013, 8369484, 9201415, 10127154]
9268A0127154J079298J250859J455457J704208K018200K399152K897274L501776
9260B6433378M245373N145708O218475P455289Q929383J0672976J2769282J5128933
9252I6998797J7421465J8753201J7704765J2903364M572327m807333j2512102
9245A51034484j7180633j8775182j7971277j5814262j3252271j0852379q852812
9238D8335668p205030n858634m789265l938123l244766k706273k286083j926316
9230A6381178j629497j388570j195168j048164q91635p71937o95066o41779n90207
9221G529155n11536m47888m06316l66517l36007l09713k96244k55620k31957j89280
9211D178077j76927j92051j79744j41675j30055j41556j40176j32265q6881r7169
$$ y = [10127154, 11206452, 12457311, 13912768, 15616976, 17635176, 20034328, 22931602, 26433378, 30678751, 35824459, 42042934, 49498223, 58427606, 69100582, 81869864, 96998797, 114420262, 133173463, 150878228, 163781592, 168353919, 163546586, 151034484, 133853851, 115078669, 97107392, 81293130, 68040859, 57188480, 48335668, 41130638, 35272004, 30482739, 26544616, 23299850, 20593577, 18307494, 16381178, 14751681, 13363111, 12167943, 11119779, 10228144, 9456207, 8761141, 8119362, 7529155, 7017619, 6569731, 6163415, 5796898, 5460891, 5151178, 4854934, 4599314, 4367357, 4178077, 4001150, 3809099, 3629355, 3487680, 3357625, 3216069, 3075893, 2943628, 2856747, 2759578]
9201B759578j10042q6402q2266j02003r1868o7658p6786p9163o1934n5259n9099
9190A887098o5262l4150k6559n0505n7165j9688j8433l2378l6600k815M613M8459
9178A596615O6693Q2278J08430J46606J72333K51432L45061M28171M77277L83006
9168D057902J16142k12139m12538m92674m76857m03414l40853k49547j80924j19180
9158A285918j09973q9120p8574p3651m7016m0946m7878j6658k1051k3675j5627
9147G21749j8204j1664j6250k3217l1089k1287j9724N885l822j4324m244k7959
9135E35850r011K6642J35n271N44j8527K186J2593K1279J5194J0048L0550J6704
9122F38916J3957K3272j1012j7387j9087m3534l8766j4747j3438j6438o927k3663
$$ y = [2759578, 2649536, 2563134, 2480868, 2378865, 2286997, 2219339, 2142553, 2063390, 2001456, 1946197, 1887098, 1821836, 1787686, 1761127, 1710622, 1653457, 1633769, 1615336, 1582958, 1546358, 1543543, 1548156, 1596615, 1663308, 1745586, 1854016, 2000622, 2172955, 2424387, 2769448, 3197619, 3674896, 4057902, 4174044, 3961905, 3549367, 3056693, 2579836, 2176422, 1835569, 1586022, 1405098, 1285918, 1175945, 1086825, 1008251, 934600, 887584, 846638, 798760, 782102, 761051, 737376, 721749, 703545, 691881, 675631, 652414, 621325, 600038, 580314, 586199, 582377, 568053, 563809, 535850, 526839, 553481, 553616, 548345, 548889, 530362, 532548, 545141, 566420, 581614, 591662, 622212, 638916, 652873, 676145, 665133, 647746, 628659, 585125, 546359, 531612, 518174, 501736, 494809, 471146]
9110D71146j8553J1442j870j8396o576K29l1826J676K7188J3489P259P362M875
9097D67445j9215k6299j7596j7915j0875j5816n935O800m392m874J6075j7299
9085C50104j4939n476j3300k4237j8023K099J881p779k511q675l107m758P239
9072B58518k287J6027J8582L444O363r358j2410j4923l220o558j4082n817j163
9059B33116j5539R991K2785j1816L747J0041k140M836J1331n334n408M626j2302
9046B47934P185K0733R479R11j2413j6353m038o564M122N784L500J4511J6603
9033B91394K0929k217L275J2715J3590O773J5334K4891M0366K1500K0085K5937
9021D94572M7842N1244Q0589N9628R3857Q9992J06119J26413J52212J75105J67612
$$ y = [471146, 452593, 464035, 462165, 443769, 437193, 437422, 405596, 407272, 434460, 447949, 455208, 462570, 467445, 448230, 421931, 404335, 386420, 375545, 359729, 353794, 360594, 356202, 351328, 367403, 350104, 335165, 329689, 316389, 292152, 274129, 276228, 278109, 270330, 267819, 259144, 256037, 251279, 258518, 256231, 272258, 290840, 294284, 300647, 291289, 278879, 263956, 260736, 254178, 240096, 234279, 233116, 217577, 227568, 250353, 238537, 242284, 252325, 250185, 255021, 266352, 261018, 255610, 260236, 247934, 255119, 275852, 285331, 286242, 273829, 257476, 253438, 246874, 250996, 256780, 260280, 274791, 291394, 312323, 310106, 313381, 326096, 339686, 346459, 361793, 386684, 427050, 448550, 468635, 494572, 542414, 593658, 674247, 733875, 827732, 917724, 1023843, 1150256, 1302468, 1477573, 1645185]
9010A645185J55504J60980J26235P7373N1382k923p9071j47742j75612j70022
9000A641289j59792j56525j31386j39397j10044r5561r3355p3465m9629n8714
8990E73421n8987n1040m0041l0022j6288j1260j0670j392o533j8354o952j8004
8978C03878k1500k5608N086J2200l012j2752k268j4966p560J0804J5196p610k1459
8965B30429j4196j554j1751P440N434p509j3702m37K639l425k950O26N552l420
8951A93176k9435n89q47M043J1990M209j1573p564j0447l472Q295K1421J7469
8938A96676L987R53J1216M080J7143J9170J1969J8715J0072L5490K4927j1380
8926C43018j851j2647O419r9j4461m410l570Q00k7948j2814j614k1036m5696k3649
$$ y = [1645185, 1800689, 1961669, 2087904, 2165277, 2216659, 2213736, 2134665, 1986923, 1811311, 1641289, 1481497, 1324972, 1193586, 1054189, 944145, 848584, 755229, 681764, 632135, 573421, 514434, 463394, 423353, 393331, 377043, 365783, 355113, 353721, 347188, 328834, 321882, 303878, 282378, 256770, 261856, 274056, 271044, 258292, 256024, 241058, 233498, 244302, 259498, 251888, 230429, 216233, 214679, 202928, 210368, 215802, 208293, 194591, 194154, 196793, 193368, 190418, 191044, 196596, 193176, 163741, 163152, 162305, 166348, 178338, 182547, 170974, 163410, 152963, 149491, 157786, 179207, 196676, 200663, 201616, 212832, 216912, 234055, 253225, 265194, 283909, 293981, 329471, 354398, 343018, 341167, 328520, 334939, 334840, 320379, 315969, 312399, 313199, 285251, 272437, 270823, 249787, 204091, 180442]
8912A80442P35L143K843j5807p546K0414P093j7891k8029j5092M447J4266r790
8899A39228m816l376r603r60K9934J6484J4255p516J5169L7481J7555q961q788
8886B26086L856J1832K3345L4520K3328J7635k30P760R400p651O036K5788K5094
8873D06799L6778K1520K0860K3551J7798M6102N1893L2632J7598P314j2842N59
8861F70562k2641o0467l6441l1869l9203l6687l4975l7469j8709J338j182k99
8849C51958k305j1354j385O220m136J713K442l510l1037r589q075q331J1107K3790
8835C17508j1859k0315J37J3136N373O055K6986n748K131J1853k4744k0819J0618
8822C10312j5862l4612j5245K1093J1892n768o645P508K2332J0972q389j9399
$$ y = [180442, 181177, 184320, 187163, 171356, 163810, 184224, 191317, 173426, 145397, 130305, 134752, 149018, 139228, 134412, 131036, 121433, 120473, 150407, 166891, 181146, 173630, 188799, 226280, 243835, 234874, 226086, 229942, 241774, 265119, 299639, 322967, 340602, 340372, 348132, 357532, 349881, 355917, 381705, 406799, 443577, 465097, 485957, 509508, 527306, 573408, 625301, 657933, 675531, 682845, 670003, 670562, 647921, 587454, 551013, 519144, 479941, 443254, 408279, 370810, 352101, 353439, 352257, 351958, 349653, 338299, 336914, 343134, 338998, 340711, 343153, 339643, 308606, 299017, 290942, 282611, 293718, 317508, 305649, 285334, 285471, 298607, 303980, 310035, 337021, 331273, 333404, 345257, 320513, 299694, 310312, 294450, 259838, 244593, 265686, 277578, 271810, 265165, 272673, 295005, 305977, 297588, 278189]
8810B78189j0223K0606J1897L445L415j0010j2655J6717P162j3044j3646k065
8798B79788k7058J919K121q968n311p909J0048J5824J1188N508n201J2042K3448
8785C07439j0464j8344M311q309q783m957O55K1396J665j1293k8838k1457l3J7585
8771B40573k0037m902J050k5414k7896q393j4064j3135J0145K8572J9330K1556
8759B07385K359LN3466N8295K3852J97j4199K3296M121r164P959Q148J553j9472
8745C47799j9525j5545m4644n5266m5981l4934m5484j8452J9473J0574K7750N5416
8733A81181P0910O1747O7178N6052N3391M8202M4599M6401K9174J3917L3839K8926
8721G35517L1356K3038J5999K4945K4003K0500K1008J9194M5664M9024L4007M3985
$$ y = [278189, 267966, 288572, 300469, 303914, 307329, 297319, 284664, 301381, 308543, 295499, 281853, 279788, 252730, 254649, 256770, 247802, 242491, 234582, 244630, 260454, 271642, 277150, 271949, 283991, 307439, 296975, 278631, 282942, 274633, 265850, 260893, 261548, 282944, 284609, 273316, 244478, 223021, 222988, 240573, 220536, 215634, 216684, 191270, 163374, 154981, 140917, 127782, 137927, 166499, 185829, 207385, 209744, 209747, 263213, 321508, 345360, 345557, 331358, 354654, 358775, 349611, 357570, 365718, 367271, 347799, 328274, 312729, 268085, 212819, 166838, 131904, 86420, 67968, 87441, 98015, 125765, 181181, 252091, 313838, 381016, 437068, 490459, 538661, 583260, 629661, 658835, 672752, 706591, 735517, 766873, 789911, 805910, 830855, 854858, 875358, 896366, 915560, 961224, 1010248, 1044255, 1088240]
8709A088240L4341L8876K2885K6273M2055N1040P2085O5127N6947O9788O7471
8698A635128N9153Q7661Q6041J17855J40184J80611K39173K37284K48493J96420
8688C228003R7522m76o0316r7711p4466l1357Q828O5143J09597J56365K26191
8677C627323K57645K10995R4199K4185m9827j09221j00216o8738m6555L213N0338
8666C893341R1528R8409J13610J37641J42544J62981J82853J75355J90318K09806
8656E398386K63252K62535K66867L07735L48431L95540M42476M52270N10678N46041
8646I194211N81921O37294O84848P84456Q57065R68295J055996J198378J356386
8637A7318850J531069J734252J985918K283257K607828L015196L511726M061325
$$ y = [1088240, 1122581, 1161457, 1184342, 1210615, 1252670, 1303710, 1375795, 1440922, 1497869, 1567657, 1635128, 1694281, 1781942, 1867983, 1985838, 2126022, 2306633, 2545806, 2783090, 3031583, 3228003, 3325525, 3325049, 3264733, 3167022, 3092556, 3061199, 3070027, 3135170, 3244767, 3401132, 3627323, 3884968, 4095963, 4190162, 4214347, 4164520, 4055299, 3955083, 3886345, 3839790, 3843003, 3893341, 3984869, 4083278, 4196888, 4334529, 4477073, 4640054, 4822907, 4998262, 5188580, 5398386, 5661638, 5924173, 6191040, 6498775, 6847206, 7242746, 7685222, 8137492, 8648170, 9194211, 9776132, 10413426, 11098274, 11882730, 12739795, 13708090, 14764086, 15962464, 17318850, 18849919, 20584171, 22570089, 24853346, 27461174, 30476370, 33988096, 38049421]
8629C8049421M687487N460302O361699P381283Q635951J0115777J1917871J4155350
8621A06765141J6960433K0488217K4966096L0427470L6624378M2564069M6296538
8614C25092342M5215143L8008300K6672488J4470580K012527j2031926k6730438
8607D12709016l8595083m5356802m6912934m4093032l8384293l1693566k5448170
8600A42225136k0275198j6256234j3207611j0880798r151328p874408o846080
8593E7733479n987175n239984m617471m049636l504292l042340k639689k319724
8585B6333168k063737j813909j591782j426647j271277j162793j048069r28071
8577A5026883q27580p52380o96844o46941n72547n44915n07353m49807m29147
$$ y = [38049421, 42736908, 48197210, 54558909, 61940192, 70576143, 80691920, 92609791, 106765141, 123725574, 144213791, 169179887, 199607357, 236231735, 278795804, 325092342, 370307485, 408315785, 434988273, 449458853, 451471380, 439439454, 412709016, 374113933, 328757131, 281844197, 237751165, 199366872, 167673306, 142225136, 121949938, 105693704, 92486093, 81605295, 72453967, 64579559, 57733479, 51746304, 46506320, 41888849, 37839213, 34334921, 31292581, 28652892, 26333168, 24269431, 22455522, 20863740, 19437093, 18165816, 17003023, 15954954, 15026883, 14199303, 13446923, 12750079, 12103138, 11530591, 10985676, 10478323, 10028516, 9599369]
8568I599369m01120l51724l40732l09295k78270k67755k72363k38891k14122j83881
8558F741216j57973j29262r6667m9878q913N5173J55554K90379M37289N93872
8548G830790O95115N31574N8394m33409p06680q07625p68836o69889n14078l63304
8538D852052k58461j86958j33328r2013m6841q411J3830O9223J37983K11756L57287
8527D916119N11093O60172P38788N28964K7351m34769o97207p87989p46040o09940
8517D106542m69207l68469k74054j90967j20271j01974j15054q8391n9710n9011
8507B259434o7932q1345p2484n7472l4918l3524l2908n3996m0591k4499l3264
8496A726501j7456r238j0886P345R46p927K2919K8633O9567O0046L9293L7701
$$ y = [9599369, 9198249, 8846525, 8505793, 8196498, 7918228, 7650473, 7378110, 7139219, 6925097, 6741216, 6583243, 6453981, 6357314, 6307436, 6298523, 6353696, 6509250, 6799629, 7236918, 7830790, 8525905, 9057479, 9115873, 8682464, 7975784, 7168159, 6399323, 5729434, 5215356, 4852052, 4593591, 4406633, 4273305, 4181292, 4134451, 4126040, 4139870, 4209093, 4347076, 4558832, 4916119, 5427212, 6087384, 6826172, 7355136, 7382487, 6947718, 6250511, 5462522, 4716482, 4106542, 3637335, 3268866, 2994812, 2803845, 2683574, 2581600, 2466546, 2378155, 2318445, 2259434, 2191502, 2110157, 2037673, 1980201, 1945283, 1911759, 1878851, 1824855, 1784264, 1759765, 1726501, 1709045, 1699807, 1688921, 1696266, 1697212, 1689285, 1712204, 1740837, 1810404, 1870450, 1909743, 1947444]
8484A947444K7116P597k6040m2565n6999n7160p4016p8495r0714o9165m6056l3865
8472A407082k8177j9602j7032l9355j8046R17k1053M603J134o145j5690j2720
8460A235916l744J4832J0325j3361l6462k3953k4993j3672j5196l6396k6022l4978
8448A032296k1248l3140l8300j8868K071p274m936q863p654k3981l3098j6266
8436H20739n673o529j2972Q450N028k698L003k1287j4455j395J5197j239o604
8423G79565j9928j8381R643j014k2040m69l287r196k913J0831K376J8661j169
8410G42679j8312J76J2990p079j0231k2890k7240J8427L524J1647L0563K7213
8398G61467M3492L3885p878m0510l7691n9712k9893n042r333m607j2036r213l0390
$$ y = [1947444, 1974560, 1982157, 1956117, 1913552, 1856553, 1799393, 1725377, 1646882, 1556168, 1487003, 1440947, 1407082, 1378905, 1359303, 1342271, 1302916, 1284870, 1285787, 1264734, 1269337, 1270471, 1264326, 1248636, 1235916, 1232172, 1247004, 1257329, 1243968, 1207506, 1183553, 1158560, 1144888, 1129692, 1093296, 1067274, 1032296, 1011048, 977908, 939608, 920740, 922811, 915537, 910601, 901738, 894084, 870103, 837005, 820739, 815066, 808537, 795565, 804015, 809043, 806345, 809348, 788061, 773606, 772211, 787408, 786169, 779565, 759637, 741256, 750899, 749885, 727845, 727376, 724089, 714893, 711980, 722811, 725187, 743848, 742679, 724367, 724543, 737533, 730454, 720223, 697333, 670093, 688520, 692044, 703691, 734254, 761467, 804959, 838844, 830966, 790456, 752765, 693053, 663160, 658118, 648785, 644178, 632142, 622929, 592539]
8385E92539k7628k5254j1088K3873K7344P080R123R763q282j3522j453m193k0787
8372E57515k4442k0157Q032k711j5808n466J0548M321n771J3034o336j799l980
8359E06980R917K6197K2088L0449P7687J32203J30868M853r4101q2031r1374r2810
8347E80926n2290j9831k649j3656j7384j4561M463j585q597K664k539R548j725
8334D62784J0542j6238l626O824R052K1937r28p819j8782j6077r413o761j1118
8321D20377N004K3283j1113j8301L416P998O367l972m465J3362L9776N1219L4131
8308E67082J4045l3959m8452m3123m5774k5330k3111k0231k8425J5477J4241J9244
8296C61684R169r593j8420k139J8673L254q804j3369J4882r479J4744J1676k1081
$$ y = [592539, 564911, 539657, 528569, 552442, 579786, 586866, 595989, 605752, 597470, 583948, 582495, 578302, 557515, 533073, 512916, 520948, 518237, 502429, 496963, 507511, 511832, 506061, 519095, 512759, 510960, 506980, 516897, 543094, 565182, 595631, 673318, 805521, 936389, 941242, 847141, 765110, 673736, 580926, 528636, 508805, 506156, 492500, 475116, 460555, 465018, 463433, 454836, 457500, 454961, 464509, 462784, 473326, 457088, 453462, 460286, 469338, 491275, 490347, 482528, 463746, 447669, 438256, 431495, 420377, 425381, 448664, 437551, 419250, 422666, 430664, 437031, 433059, 428594, 441956, 481732, 532951, 567082, 581127, 547168, 498716, 455593, 409819, 384489, 361378, 341147, 312722, 328199, 342440, 361684, 370853, 361260, 342840, 340701, 359374, 362628, 353824, 340455, 355337, 345858, 360602, 372278, 351197]
8283C51197k5156q38J7351j5352q625J497J5314K2623j1624o155J318j0274r021
8270C22255m204k5686p398Q263o816j0769J1302o254K630J392K2470J5821Q355
8257C31361l535k0930n751K1107j0649r568m884Q023O422J406r925m474O391P731
8243C12725K692r724J81J1308K6504M877J120N549J5786L4723P808J5410J7501
8230D46460J5411L2990K2877K9216M7677M2012L9037P3116O1501O9982P4551R4694
8218A049524J22172J36601J49554J66937J60423J47234J41706J17295M6997J5637
8208B254080r421o9440j16366j59839j64451j62461j84919j56469j35535j28206
8198I66973q1362p4438m6847m1647n0781n3246l2852l1957m4615k8153k6570k0864
$$ y = [351197, 326041, 325203, 342554, 327202, 318577, 320074, 335388, 358011, 346387, 340232, 341550, 331276, 322255, 318051, 292365, 284967, 293230, 286414, 275645, 286947, 280693, 283323, 284715, 307185, 323006, 331361, 327826, 306896, 301145, 322252, 311603, 302035, 297151, 305174, 311596, 313002, 303077, 298603, 304994, 312725, 315417, 305693, 305874, 317182, 343686, 348563, 349683, 355232, 371018, 405741, 413549, 428959, 446460, 461871, 494861, 517738, 546954, 594631, 636643, 675680, 748796, 810297, 880279, 954830, 1049524, 1171696, 1308297, 1457851, 1624788, 1785211, 1932445, 2074151, 2191446, 2238443, 2254080, 2244659, 2175219, 2058853, 1899014, 1734563, 1572102, 1387183, 1230714, 1095179, 966973, 885611, 811173, 764326, 722679, 671898, 618652, 585800, 553843, 509228, 481075, 454505, 433641]
8186D33641k1278j6303q041j3089K814l89j0214l2953k9826k2528m847J1917j682
8173B87222j116N656j2418n377q269k822m092J7659R191j6193q592j4039j3727
8160B33083M510K0733j1779j5477N26J78l979J0177j02p308r916Q276n147n547
8146B18228r962r994L2463P551j0193k780K578j8228j0924J8191Q100j5021r644
8133B00365l558K3012J2586j3819l434j4337L22k245J3727O992l539o605k803
8120B06664j9524j909P324j1071j4808j1372P485q313J3860K3350M75j2981j032
8107A78148R765m026k0416j124j857K3983K815k1166p682J477n045o506J0174
8094A58540L129J17J8796o647j876j3614k0898J3502J5508l201m777O761n030
$$ y = [433641, 412363, 396060, 388019, 374930, 377744, 377355, 367141, 334188, 304362, 281834, 276987, 288904, 287222, 286106, 291762, 279344, 273967, 265698, 262876, 258784, 276443, 285634, 269441, 260849, 246810, 233083, 237593, 258326, 246547, 231070, 231596, 231774, 227795, 237972, 237870, 230562, 220646, 228922, 223775, 218228, 208266, 198272, 230735, 238286, 228093, 225313, 227891, 209663, 198739, 216930, 225030, 210009, 200365, 196807, 219819, 232405, 218586, 215152, 200815, 201137, 198892, 212619, 219611, 216072, 209467, 206664, 187140, 185231, 192555, 181484, 166676, 155304, 162789, 154476, 168336, 191686, 192161, 179180, 178148, 187913, 183887, 163471, 162347, 160490, 184473, 187288, 166122, 158440, 159917, 154872, 148366, 158540, 161669, 161786, 180582, 173935, 172059, 158445, 137547, 151049, 166557, 163356, 158579, 165340, 160310]
8081A60310J195r024J256O386J0093K2283j1401p677p587l259L287j3292Q303
8068A60873J2548m972j3494j924n728J526j1082j1892P93J4240R984p919J9581
8055A62534L03l346K204j4654n061q074K963N468R210o734j1528Q722N283j1376
8041A35914R651L052k0k8346k455K9204J3395N646K797q251n579o25r965j2952
8027A31466M230J5420j185j0418k94j921j8869K65j836k0640P27K5469J7358j201
8013A38571j2290l575p228j3240n022J988R442K9148J2343j0974M693j0177p457
8000A26222j501k1320k2163K904K3608j514n441R392k681r385Q644O329j671j1876
7986I9547j2440m463q272J936J4933j848n605J2762J9373K4905J6865N46m312
$$ y = [160310, 161505, 152481, 153737, 160123, 170216, 192499, 181098, 173421, 165834, 162575, 165862, 152570, 160873, 173421, 168449, 154955, 153031, 147303, 148829, 137747, 125855, 126648, 140888, 150872, 142953, 162534, 162837, 159491, 161695, 147041, 141980, 133906, 136869, 142337, 151547, 144813, 133285, 142007, 147290, 135914, 145565, 148617, 148597, 120251, 117796, 147000, 160395, 166041, 168838, 160587, 155008, 154383, 144418, 131466, 135696, 151116, 149931, 139513, 139219, 137298, 118429, 118694, 116858, 96218, 96945, 122414, 139772, 138571, 126281, 122706, 115478, 102238, 97216, 99204, 108646, 137794, 150137, 139163, 143856, 133679, 126222, 124721, 103401, 81238, 84142, 107750, 106236, 100795, 110187, 107506, 98121, 106765, 113094, 111423, 99547, 87107, 82644, 74372, 76308, 91241, 89393, 83788, 96550, 115923, 140828, 157693, 158239, 153927]
7973A53927M638k4867q969K5416N610k2357j8413j922q038r156n509J018J9431
7960A10809J3685N861R780j0594o355o055o107p142O260M339J0065j4350j7038
7947I3158K073k3859j1568o70K5868P387j1813p763q588j6576n814l853J9371
7934E7353J6656J1428l275N36Q738J2247j4382M649M64Q977J6346K343j7167J808
7920A06721K087k2270k2629R231J2037j4557j1197P635J6288J2581J0377M188
7908A10492j9257l736O546J8552M174j3462q389n864r441j999j2488O58M305L316
7894G3407J2990J6932q70N03k613J0594K798j5151n552m509j282j3506m762K4315
7880I3294K0996j2492j5338L343l871N169J0521m29p720j6717l562j4447j7030
$$ y = [153927, 158565, 133698, 124729, 150145, 155755, 133398, 114985, 113063, 105025, 95869, 90360, 91378, 110809, 124494, 130355, 140135, 129541, 123186, 117131, 111024, 103882, 110142, 114481, 124546, 110196, 93158, 95231, 71372, 59804, 59134, 85002, 92389, 80576, 72813, 64225, 47649, 41835, 37982, 57353, 74009, 85437, 82162, 82698, 91436, 103683, 89301, 93950, 94414, 103391, 119737, 122080, 104913, 106721, 108808, 86538, 63909, 73140, 85177, 70620, 59423, 67058, 83346, 95927, 106304, 110492, 91235, 87499, 94045, 112597, 116771, 103309, 94920, 89056, 79615, 77616, 65128, 65786, 70091, 73407, 86397, 103329, 102459, 102962, 100349, 110943, 113741, 98590, 93038, 88529, 87247, 73741, 68979, 93294, 114290, 101798, 86460, 89803, 85932, 91101, 101622, 101193, 93473, 76756, 73194, 58747, 41717]
7867D1717o680M801J1672K9442J0866q041L270n637L172O843K431n400j9804R385
7853G8037m348j118n233q337J3279J8869n445K380m50n595l014j830Q37j0582
7839F7450K860j283M885J748J1004R752n405J3667j8405k0446o939L909J1926
7826G4723O995L07O686J1523J008r712J82p801k221j8989n752N816q732q600J0524
7811E5957J4254J899j9932r031K4998j295j1619m719q320K4898J480Q394O864
7798H3828j4949O901J6709j792k0918l311J4135j0622j1580R275O576M355J1814
7785I0421J1720M297l877j6973R91J7238p94M339j3375M343m791j2697k1043j9928
7771C9871K1886K0562n995J397P66O236p550j6606r240k0668J6071J5277O811
$$ y = [41717, 35037, 39838, 51510, 80952, 91818, 83777, 87047, 81410, 84582, 91425, 93856, 88456, 68652, 78037, 73689, 72571, 67338, 59001, 72280, 91149, 85704, 88084, 87634, 82039, 79025, 77195, 78032, 67450, 70310, 69027, 73912, 75660, 86664, 96416, 91011, 104678, 86273, 65827, 58888, 62797, 74723, 81718, 82025, 88711, 100234, 101242, 91530, 91712, 83911, 81690, 62701, 56949, 62765, 54033, 45433, 55957, 70211, 72110, 52178, 43147, 68145, 66850, 55231, 50512, 42192, 67090, 68570, 76964, 83828, 68879, 75780, 92489, 90697, 69779, 66468, 80603, 69981, 58401, 67676, 74252, 78607, 90421, 102141, 106438, 102561, 85588, 86579, 103817, 103023, 107362, 93987, 98330, 93539, 80842, 59799, 39871, 61757, 82319, 76324, 77721, 78487, 84723, 77173, 60567, 51327, 30659, 46730, 62007, 68818]
7758F8818j3763K3532n12q878R71K884j569q45l353J6396r603p563J4131m599
7744G6047j0256j6784R296O132k257j361O025L497l853O852l639J493j2095Q453
7730F7550J5451m871J2385L097q219j00M897k5089j1195N237J861M432p15J1270
7716G5991L740o331K457l09l415J82j3650j2022k519N492m019j5713m435J5347
7702D0796J3599J1284j5585L050J6160N304J532j4650m720J2224N321o228l171
7689F4916m656J6361l91n756K680Q304J5973l076p169j3902j2299J0259K0569
7676I1813J4259n352L6j72p586k3187p436q77r692k924k716J0594J3004r450J4427
7661G4741P495R505p805j4728j0761j666j636R174O538k842q850q49K726Q829
$$ y = [68818, 55055, 78587, 78075, 69197, 70168, 73052, 71483, 70638, 67285, 83681, 74078, 66515, 80646, 76047, 65791, 49007, 58303, 64435, 62178, 60817, 66842, 70339, 66486, 73338, 69699, 71192, 59097, 67550, 83001, 78130, 90515, 93612, 85393, 85293, 90190, 65101, 53906, 59143, 61004, 65436, 64721, 75991, 79731, 73400, 75857, 75548, 72133, 72315, 58665, 46643, 44124, 49616, 45597, 29884, 25449, 40796, 54395, 65679, 50094, 53144, 69304, 74608, 76140, 61490, 56770, 68994, 74315, 68087, 64916, 60260, 76621, 76230, 70474, 73154, 81458, 97431, 94355, 87186, 73284, 60985, 71244, 91813, 106072, 100720, 100756, 100584, 92998, 69811, 62375, 61498, 51806, 48882, 46166, 56760, 69764, 60314, 74741, 82236, 91741, 83936, 69208, 58447, 56781, 55145, 64319, 70857, 68015, 59165, 58316, 61042, 69871]
7647F9871m340p124K3763l160j5480j0444j1415J1320K346j0883L451l35p164
7634D0406J5124N475j008K279j616m521j5602r170K582o333q231N63J1143K782
7620C3873R0N099j0962J5377J4577L836j3351j1134p674M553P028j853r593L092
7606C2958P011j3203L665J0926L026k2430J361J4440J3998o338j54j262P089p234
7592D3853M934K2497j3153k5915p40J4836k083o12N145l916P313l248l28J6913
7578F5496l371o784o332Q48J024j3098J006J5668P582k17j2975j2182Q737P296
7564E2698j4671j8232J7851J7575J3358O019J8017j3782k6436l557J1113j8209
7552D1744j2276L715M052O557J6886J346n875j3461j1366R695K2196Q80k2600
$$ y = [69871, 65531, 58407, 82170, 79010, 63530, 53086, 41671, 52991, 55337, 44454, 47905, 47570, 40406, 55530, 61005, 59997, 62276, 60660, 56139, 40537, 31367, 33949, 27616, 19385, 19948, 31091, 33873, 33963, 39062, 28100, 43477, 58054, 61890, 48539, 37405, 29731, 34284, 41312, 39459, 29866, 32958, 39969, 26766, 30431, 41357, 44383, 21953, 23314, 37754, 51752, 45414, 45260, 43998, 51087, 43853, 48787, 71284, 58131, 32216, 31476, 46312, 44229, 43617, 48762, 44846, 52159, 48911, 48583, 65496, 62125, 55341, 49009, 49857, 50881, 37783, 38789, 54457, 62039, 61822, 48847, 36665, 45402, 52698, 38027, 19795, 37646, 55221, 68579, 74598, 92615, 78833, 52397, 48840, 59953, 41744, 29468, 33183, 37235, 43792, 60678, 62024, 56149, 42688, 31322, 41017, 63213, 64093, 41493]
7539D1493M27J2637o444k057J8708q983m847k100r509j7534P904K7562R434j0028
7525E6663j407k4251j6268m594K727Q472P284J4950J8106j5735r258p889r509
7512A9291j0332J4386J3732M837P821J3540Q836r227j1970Q521O67q792q848J0292
7498E2754q288p000J3903k5172n457k1544m145J8449P559J0293N022J3163J2710
7485F2247R465j692k033k2317j0566r302Q925J8928J4896j8330j6078K845J0305
7472D7293O283N108O568N616j33J3729p988l1402j6015n343L791J1425K1101J6040
7458G6073k000k2139M40n748R09k986k97P775r87j2311J2015J2849m420j7645
7444D1528m01j3771N794K3557l332k0656j3061R827m266M411J2747j0044j8577
$$ y = [41493, 41920, 54557, 48113, 46056, 64764, 55781, 50934, 48834, 39325, 21791, 29695, 57257, 66691, 56663, 55256, 31005, 14737, 10143, 12870, 21342, 28626, 43576, 61682, 45947, 36689, 28800, 19291, 8959, 23345, 37077, 41914, 49735, 63275, 72111, 62884, 50914, 59435, 60102, 51310, 42462, 52754, 44466, 37466, 51369, 26197, 20740, -804, -4949, 13500, 21059, 31352, 36374, 49537, 62247, 71712, 70020, 67987, 45670, 35104, 25802, 34727, 53655, 68551, 50221, 34143, 36988, 47293, 53576, 58684, 65252, 70868, 70735, 84464, 76476, 45074, 29059, 23716, 27507, 38932, 60033, 76073, 74073, 51934, 52374, 46626, 47535, 44549, 44252, 52027, 51040, 38729, 50744, 63593, 59173, 41528, 41127, 27356, 33150, 56707, 53375, 32719, 19658, 29485, 25219, 29630, 42377, 32333, 13756]
7431A3756K2069R727q51p971j2171N838M310j0415N686L433O520J186l936J3156
7417E0337k393j8283J0024o39O326K51n818k0577m776J1642l897O658j034r953
7403A7868j6368M824J6632k64O761L0150K406j1697j2304j9389M893M187M415
7390C2114P39J9574K961k4872p985O785O458Q57o494N56j009j7944O483K5866
7376D4089Q939r037k325m111m003r922J568J0994N53k0490L597J4943J4344J4350
7362F3489J8451r529j6148K593M854p448j0428L470J0159k771j3514J5047j2752
7349D5473j8j2140p459N569R192J0362o975r154L931J9118k0150j1261P1j3360
7335A3199p812n666K1292Q999K671K818K960o88j52J9376R211n556M556P100o948
$$ y = [13756, 35825, 45552, 44701, 36730, 24559, 30397, 34707, 24292, 29978, 33411, 39931, 41117, 37181, 50337, 47944, 29661, 39685, 39046, 45372, 45623, 39805, 19228, 14452, 26094, 22197, 28855, 27821, 17868, 1500, 6324, 22956, 22692, 29453, 59603, 62009, 50312, 38008, 18619, 23512, 27699, 32114, 32853, 52427, 55388, 30516, 22531, 29316, 35774, 36631, 30137, 30693, 29684, 11740, 18223, 44089, 53028, 43991, 41666, 37555, 33552, 23630, 25198, 36192, 36745, 16255, 19852, 34795, 49139, 63489, 81940, 72411, 56263, 58856, 63710, 56262, 45834, 49304, 59463, 56692, 43178, 58225, 45473, 45455, 33315, 25856, 31425, 40617, 50979, 44004, 34850, 38781, 57899, 37749, 26488, 26559, 13199, 5387, -279, 21013, 30012, 32683, 35501, 38461, 37773, 37621, 56997, 66208, 60652, 65208, 72308, 65360]
7320F5360j0190j9428m820O899j062L682j4457j4164J7817R027m089j7388l048
7307A4139O610P02j3148R678K963k3478m386K5186K2980L700j7530j5651o658
7294E107p082R162q128J6338J8108M366p183l086J685J6172N581j3125k8151j5155
7280e391J6292L132O703K450l207m983P155j215q5r917J3309N726L682J1478N39
7265D5668R22j3754j5426k3604O838l2J4285J8535M874J5595J2523l6006l1419
7252a001M184K6102J8083p280j9747j0683q445J1734J6950M879N068m078J295
7239C7061l680k0024j2228o764K611J7493Q386J040L143n047O876j125k958N125
7225B9909N754Q66N02K178k358k1484J8242K6329N048p928r637p747K082Q312
$$ y = [65360, 55170, 35742, 30922, 37821, 36759, 40441, 25984, 11820, 29637, 38664, 34575, 17187, 14139, 20749, 21451, 8303, 17981, 20944, -2534, -6920, 18266, 41246, 44946, 27416, 11765, 5107, -1975, 7187, -941, 15397, 33505, 37871, 30688, 27602, 29287, 45459, 51040, 37915, 9764, -5391, 10901, 14033, 20736, 23186, 19979, 14996, 22151, 20936, 20851, 10934, 24243, 29969, 33651, 45129, 45668, 46590, 32836, 17410, -6194, 644, 612, 14897, 33432, 38306, 53901, 66424, 30418, -1001, 3183, 29285, 47368, 40088, 20341, 9658, 1213, 12947, 29897, 34776, 39844, 35766, 37061, 33381, 13357, 1129, -5635, -3024, 14469, 22855, 23895, 27038, 21991, 28867, 27742, 24784, 29909, 35663, 36529, 37031, 39209, 36851, 15367, 33609, 59938, 64986, 57058, 47421, 39674, 41756, 50068]
7211E0068j0511j8265k1363J457L9089j0249j7993J634l521M999Q995q180m472
7198A1688n99R497N323Q104R240j4484j5907K0317L913K641j26J6557m898j4239
7184C7027m806n373O941J988q826m518n999k0802L941R259J5152J8617r248Q12
7170C4165q203p279j7981N277J8667j1158l73J872J7206o813j9612J9307l923
7157B1152p417j1173o980p064L186J75J2266Q762j0168M201K2989P089j1769o477
7143A8772m473k1519r665J5448L8393j2631o332J7471q280q734n20l076k524J1689
7129B4019J7367j1812j0225r599p348R022J2176j1393L908R803p508m989P605
7116B1026Q201j367p995j785o960k578q264o37n013k355K4886J628r268J707J9587
$$ y = [50068, 39557, 21292, -71, 1386, 40475, 30226, 12233, 13867, 10346, 15345, 24340, 16160, 11688, 11089, 20586, 25909, 34013, 43253, 28769, 12862, 33179, 37092, 39733, 39607, 56164, 51266, 37027, 32221, 26848, 33789, 35777, 26951, 22433, 16434, -4368, -427, 8832, 23984, 42601, 33353, 34165, 25962, 18683, 702, 5979, 24646, 13488, 13115, 14987, 32193, 25380, 5768, 25075, 21152, 13735, 2562, -4418, -11482, -8296, -8121, 4145, 12907, 2739, 6940, 29929, 37018, 25249, 18772, 14299, -7220, -16885, -1437, 36956, 24325, 17993, 35464, 27184, 18450, 17930, 14854, 12330, 24019, 41386, 29574, 19349, 9750, 2402, 11424, 23600, 12207, 16115, 25918, 18410, 13421, 21026, 29227, 27860, 19865, 18080, 11120, 8542, 278, -359, -5372, -7727, 17159, 18787, 9519, 11226, 30813]
7101C0813P436k3306j5267J1007J0864K1216j562j6039n618o105o473j0258J84
7088c108O322J6954j054q932K6418M045k5789j1551J569m928N84k109L268J5815
7074A7504r860J0206J5950K1142k089j8117j3352M6j886j947j259K716M68q235
7060A1287r521J0407K234L87M199o15k951M891j4961J998Q720J7574p244L171
7046B9576j7741K820R91J597l868K3889O084R10j1374k1486O371J0354J2243j3095
7032B7271j0878q14R450J151j2070k0689j4327j892K3757p270R16J2562K063o883
7018B347k0373j582K8025r881M040j5605j1431J7409J4966l286o897j5290K2008
7005D450K149L98Q399m396L100r24J2760K3895J5438j0629j9290p220q686j9643
$$ y = [30813, 38249, 14943, -324, 10683, 21547, 42763, 41201, 25162, 19544, 13439, 6966, -3292, -3108, 3214, 20168, 19114, 10182, 36600, 40645, 14856, 3305, 4874, -54, 530, -1579, 1689, 17504, 7644, 17850, 33800, 54942, 52853, 34736, 21384, 21430, 19544, 17597, 16338, 19054, 19522, 11287, 1766, 12173, 14407, 14794, 18993, 18378, 15427, 20318, 5357, 7355, 16075, 33649, 26405, 29576, 11835, 14655, 15646, 17243, 13375, 37264, 43348, 44258, 32884, 11398, 17769, 28123, 40366, 27271, 16393, 15579, 25029, 26180, 14110, -6579, -20906, -22798, 959, -6311, -5395, 7167, 9230, 2347, -18026, -19608, 8417, -1464, 2576, -13029, -24460, -7051, 7915, 4629, -2268, -17558, 4450, 6599, 6997, 15396, 11000, 14100, 13176, 25936, 49831, 65269, 54640, 35350, 28130, 19444, -199]
6991a99M401J330l865j90m194m547J9603K5347j2142j0615L849N614J5893l246
6977C7039j4836l280r012L535M835p535p129R521L010J5159J910q193k212n476
6963A7336p01m436J2050k566O059R270j2952j7536J2862R589M057j9951j2413
6950F68N217p489l147J2331Q425K984p991k550J480M189R413p822j416J5996M252
6935C4540k399J641l96j5366L465j0305J3797O717j3784M807J4841j0144m267
6922B3147J2504j72n715j1257J6218O960k3578L03N946r6k4964j2717k060K674
6908a2807K0883J8966M748j3520j7398j1329R934L5369J7076k723k2053j1780
6896A5366J16J6517L915j5891q02K315q695N831l492j2608l376J546Q10m816j2213
$$ y = [-199, 4202, 5532, 1667, 1477, -2717, -7264, 12339, 37686, 25544, 14929, 18778, 24392, 40285, 37039, 22203, 18923, 9911, 13446, 18281, 10746, 3617, 13138, 16148, 31307, 33217, 25024, 22812, 17336, 16635, 12199, 24249, 21683, 27742, 37012, 24060, 6524, 19386, 28975, 33032, 13081, 668, 5885, -1604, -4751, 7580, 16005, 18989, 10998, 8448, 9928, 14117, 23530, 15708, 14292, 30288, 34540, 32141, 33782, 33386, 18020, 21485, 11180, 24977, 31694, 17910, 22717, 37558, 27414, 23147, 35651, 35479, 29764, 18507, 34725, 41685, 18107, 18410, 24356, 24260, -704, -13421, -15481, -12807, 8076, 27042, 31790, 18270, 872, -10457, -523, 34846, 51922, 49199, 27146, 15366, 15482, 31999, 35914, 20023, 19221, 21536, 12841, 18672, 15180, 2572, -804, 742, 1552, -3264, -15477]
6881a5477Q902O898J8663o291j5748n315J8656K693K036m550L365P147K849j5298
6867H530o060J0642m099J5031j773r622L836j2091j1099O801n043J5063Q891o121
6853A2886m997N77M444r746K220J5280n921j0660Q47L989K871j252q869k710p817
6838h858O535K6644j572j3229M974R243M653k5807q828K8992P769j0855n636k912
6824A1113P370R962J590j3349m924o409j493O367k754J2289J0811J2906q71k3677
6810A8931m669p632N241j467J927j7257k003K0142J5861J997o347j679r380J7980
6796C1645R726j7439j0827q110j8173O609J8807P468k2321k8640N307J4543O919
6783d486m794Q970J8245K170N263P921r200j4112J1450J0185J0386J1907j4161
$$ y = [-15477, -6575, 323, 18986, 12695, -3053, -8368, 10288, 12981, 15017, 10467, 13832, 20979, 23828, 8530, 2470, 13112, 9013, 24044, 22271, 12649, 16485, 4394, -6705, 96, -4947, 10116, 19007, 12886, 7889, 8466, 12910, 3164, 5384, 20664, 14743, 4083, 4930, 8919, 11790, 10538, 1669, -1041, -8858, -2323, 24321, 22749, 9520, 14494, 23737, 28390, 2583, -6245, 22747, 30516, 19661, 14025, 11113, 18483, 28445, 30035, 16686, 11762, 5353, 3860, 10227, 7473, 19762, 30573, 43479, 42608, 18931, 14262, 6630, 11871, 10404, 12331, -4926, -6929, 13213, 29074, 31071, 24724, 23045, 13665, 31645, 41371, 23932, 13105, 4995, -13178, -6569, 12238, 19706, -2615, -31255, -25948, -11405, -4486, -9280, -310, 17935, 20105, 25368, 33289, 24089, 9977, 21427, 31612, 41998, 53905, 39744]
6770C9744k5383m167j028j629J2585J0623j0407p709k2058o752K4438R019l4636
6757a7360j2566J8907N978N23j603L488J6k56L381Q680k24M375N851O29L134J1765
6741C4718l799j8955K476l912J3212K543p213m778k2757j5302m284N092K0762
6728b197K673P950L351J819n686J1090J347M641q839L732K829p158j2829n652
6714b929j47J269Q982N463J0505p317M11M540j2264j923J4860J98J1443J2541
6700D5632M13j6791j5650p298j3801K110R710K1418j5999j6122l470J2857K870
6687E879N737j1136l887Q239J4373L777p058L194j3193L857L675j8839K335J4561
6673A1514j1220o235n25j0878R916K6454J845p937M483J6056R161j0505j7039
$$ y = [39744, 14361, 10194, 9166, 7537, 20122, 30745, 20338, 12629, -9429, -16181, 8257, 17276, -17360, -29926, -11019, -5041, -4518, -6121, -2633, -2617, -2873, 508, 9188, 8964, 13339, 19190, 19819, 22953, 34718, 30919, 11964, 14440, 10528, 23740, 26283, 19070, 14292, -8465, -23767, -28051, -22959, -2197, 476, 8426, 11777, 13596, 7910, 19000, 20347, 24988, 16149, 19881, 22710, 15552, 2723, -2929, -3076, -1807, 7175, 12638, 23143, 15826, 16237, 20777, 8513, 6590, 21450, 21648, 33091, 45632, 46045, 29254, 13604, 6306, -7495, -5385, 4325, 25743, 9744, -6378, -9848, 3009, 5879, 11616, 480, -3407, 4832, 19205, 22982, 15924, 19118, 5925, 9782, 13457, -5382, -3047, 11514, 294, -5941, -6466, -17344, -7428, 19026, 20871, 12934, 17417, 33473, 42634, 32129, 15090]
6660A5090l391N484O319l363k753P882K954N488L861n931p618j0636l379J75J1339
6645B1521J1277j0000n73K801j1964M806o780j0163l428J670K2366O999Q624n160
6631C1996M721J1413j270R50o110o551j0797n809o286K1806o103l754L091q425
6617A8872j2437N064j0842l465r096j5221K1198M486n272J3920K3712j1416j1332
6604H171J2663L88j060o399k6338m804r937J3545K4713k386r546J1125P579P406
6590B5120K633J1058m37M603j6877k3687Q871j84K652o237M450O978R983J51K040
6575C1117j4623k711k397j0455N515J0214J3861j321m797q506o37j469L071K6921
6561D3783p803j2334r529j8561M820j1118j5610J8001O868J115P408l979j3267
$$ y = [15090, 11699, 17183, 23502, 20139, 17386, 25268, 28222, 33710, 37571, 31640, 24022, 13386, 10007, 10182, 21521, 32798, 22798, 22225, 25026, 13062, 17868, 11088, 925, -2503, -833, 21533, 28532, 37156, 31996, 36717, 48130, 46860, 47810, 41700, 35149, 24352, 18543, 12257, 34063, 27960, 24206, 27297, 18872, 6435, 11499, 657, -2808, -11904, -27125, -5927, -1441, -6713, 7207, 30919, 19503, 8171, 20834, 21222, 20162, 13763, -12575, -17379, -27316, -13771, 10942, 8556, -990, 10135, 17714, 25120, 27753, 38811, 38374, 42977, 26100, 2413, 11284, 11100, 13752, 7515, 11965, 18943, 28926, 29077, 31117, 16494, 13783, 11386, 931, 6446, 16660, 30521, 29200, 24403, 15897, 15260, 13791, 16862, 43783, 35980, 23646, 14117, -4444, 376, -10742, -26352, -8351, -1483, -368, 7040, 3061, -10206]
6548a0206K777K3528J7109P245k1645P357K7851P950L784j4262j8910m107k3727
6535D744j1687O63J0227J5477K665k822q375j0888n810k165M063J7121J6105r183
6521B0135k709j6021K28L865p263L436M475J7137o544l755L370J411j0689L769
6507A0845K337k316j039p783K781M16J6936p46j830J0431j3858p079n302k1521
6493a7728j7945m363J7869L907J2686K9221k432k362j8553J0608j5578O680P702
6480I712j9869R972N97j8122q06n736O101J5803j172l543j0079j4395M153O636
6466b0748N40J0193J4623M330Q548P583j2268j7249l587Q949M281j101P160q290
6452B964m690k575Q081n852Q777J4746k7700m340J9796p443l968K1876Q958r629
$$ y = [-10206, -7429, 16099, 33208, 40453, 18808, 26165, 54016, 61966, 65750, 51488, 32578, 28471, 4744, -6943, -6280, 3947, 19424, 22089, 19267, 10892, 4, -5806, -7971, -3908, 13213, 29318, 20135, 17426, 1405, 1633, 5498, -1765, 1671, 6146, 23283, 16739, 12984, 16354, 17765, 7076, 10845, 13182, 10866, 9827, 2044, 4825, 5241, 22177, 21431, 19601, 30032, 16174, 9095, 3793, -17728, -35673, -40036, -22167, -18260, -5574, 23647, 21215, 18853, 300, 10908, -4670, 2010, 9712, -10157, -185, 412, -17710, -18516, -24252, -18151, -2348, -3520, -7063, -17142, -31537, -27384, -20748, -20208, -10015, 4608, 8938, 17486, 25069, 12801, -4448, -8035, 914, 5195, 4094, 11254, 2964, -1726, -4301, 3780, -2072, 6705, 21451, -6249, -10589, 9207, 1764, -2204, 19672, 28630, 19001]
6438A9001j0696r91O287P551K817N774J8533M674j2583K252L1053m704k0307r851
6424C8810K18q872k2903j2302K6872J1235k35j8055j1853k988j4323k24J8993
6411D373K1900M892o909p980m004l129k775q453J2668q55j4256l02j047J1806
6397E929m097L88p521n492J7946j4739J1527J0721j4730j5099L516J368J0492
6384B09o218r665J096J8815J3601k861q809J2027q907r72q556O053K682O346J8023
6369C2864J391k658k3621k1837p086l187J5541L3071K2454L884r127k4737q843
6356H109M811p347j145J9738O681P370O652j1836j2230k6639j7842J5840M800
6343c038M738p075k753p78J848J0102j807K085m305M580n730o923M52J4637K9954
$$ y = [19001, 8305, 7314, 13601, 21152, 23969, 29743, 48276, 52950, 40367, 42619, 73672, 68968, 48661, 38810, 39028, 30156, 7253, -5049, 21823, 33058, 32823, 14768, 2915, -73, -14396, -14620, 4373, 26273, 31165, 24256, 16276, 12272, 9143, 6368, -2085, 10583, 9728, -4528, -4830, -5877, 5929, 1832, 2220, -5301, -10793, 7153, -7586, 3941, 14662, -68, -15167, -11651, -10283, 209, -6009, -15674, -14578, 4237, 17838, 14977, 6168, 18195, 9288, 8316, -240, 5813, 8495, 14841, 32864, 34255, 31597, 7976, -13861, -20947, -24134, -8593, 24478, 46932, 50816, 41689, 16952, 8109, 12920, 5573, 4428, 24166, 30847, 38217, 44869, 33033, 20803, -5836, -23678, -7838, -3038, 1700, -5375, -8128, -8906, -7058, 3044, 1237, 3322, -983, 3597, -2133, -9056, -8604, 6033, 35987]
6328C5987k1423j4400o702J3081M558m812J564K325j6135p144j3795k0519J6764
6315c0651K9290O827l274l16N446k2939k4968P773k044J1727n26P114o562K8897
6301E794K0485L678k78p274q789n578J3843J965j7864k709J7124l04j033j673
6287A7387j971L212P844k4881l382o226j4125N179L1791K6116j2465k2946K693
6274H226Q362L649j2500J7195J7200q206j7965m622O502J5974R200j6226j8504
6261H285j2781K7352Q938j392k014P42m132k2377r75J706N792J3538k1347j2171
6247a0836k284j0041J3963K064k614r192o126J5074J0795J0539O723k838J1885
6234B7112m231k0659q157P113K2875m590o333n705m521J3020j976j8299J5380
$$ y = [35987, 14564, 164, -6538, 6543, 11101, 6289, 7853, 10178, -5957, -13101, -26896, -47415, -30651, -1361, 5466, 2192, 1876, 7322, -15617, -40585, -32812, -34856, -23129, -23655, -16541, -23103, 5794, 26279, 29957, 29679, 22405, 13616, 8038, 21881, 23846, 5982, 3273, 20397, 20093, 19060, 17387, 15416, 18628, 26472, 1591, -1791, -8017, -22142, -16963, 14828, 40944, 28479, 5533, 8226, 16588, 20237, 7737, 24932, 42132, 33926, 15961, 11339, 17841, 33815, 43015, 26789, 8285, -4496, 22856, 31794, 30402, 28388, 29130, 24998, 2621, 1646, 3352, 9144, 22682, 1335, -10836, -13120, -23161, -9198, -7134, -9748, -18940, -25066, -9992, 803, 11342, 18065, 15227, 27112, 22881, 2222, -5935, 1178, 24053, 19463, 13130, 7425, 2904, 15924, 13948, -4351, 11029]
6221A1029k616j035K277M144L224k235P636N402N709q199j3332k2350L63M039
6207e944P941q285l744m366M915J713K3071P196J518o741j9384m745m641P080
6193d416k257l591O650J6440J1018J2592J0812j1930j7403r175n95o829J4327
6180A5643J0343Q458P310q825k3464p00k2377j6205J2144J7591P49J069q786N645
6166a405j9804k3047K3359J1605p11R848M560j5461n470p020k42K4784J2617J2102
6152B5715q368j5621K458J8005p734k5608r680M752J9949J546k6809j5786J0061
6139b7120J0980r089j198J6720j407K061m751j814J8878J0190j0490k002j0774
6126i816j6390L245O922J5474K4837M214k6930k958R976K908N954K61p533m149
$$ y = [11029, 8413, 7378, 9655, 13799, 17023, 14788, 22424, 27826, 33535, 25336, 12004, -10346, -9983, -5944, 1997, -6288, -10032, -14398, -9483, -7770, 15301, 22497, 24015, 17274, -2110, -6855, -11496, -4416, -6673, -10264, -3614, 12826, 23844, 36436, 47248, 35318, 17915, 8740, 8145, 1316, 15643, 25986, 34444, 41754, 32929, 9465, 8765, -13612, -29817, -17673, -82, 667, 1736, -7050, -1405, -21209, -44256, -20897, -9292, -10003, -155, 4405, -11056, -16526, -23546, -23788, 996, 13613, 25715, 17347, 1726, 4184, 22189, 14455, -11153, -20833, -16081, 3868, 5414, -21395, -37181, -27120, -16140, -25229, -26427, -9707, -11114, -9053, -13804, -15618, 3260, 13450, 2960, 958, -9816, -26206, -22961, -16039, -565, 24272, 28486, 1556, -1402, 8574, 11482, 17436, 17697, 10164, 6015]
6112F015k0252N69K768j2178l336K7342O173k5081R407O46q398M466R490J9282
6098A6913p386Q163l420k609n616Q326j457j8526j4479N040J6786M085j9672K874
6084a0978n177n901R525K423Q110J5357k26J8087j1313j6053Q048J2781L112j6904
6070A0891k8034K894R325j7002p144l311O619P603J8001P784p02m93J3196l500
6056A6127q873j0740J940n584Q221n492l0490l780J1903N103R003J3063j4504
6043a4103j299n900L823j2263O878K2689j6332q730P361J7583J4667j4166j7277
6030a7069l025K2557J3291j0453j749N825N752J8628O171p899j5754q504j1576
6017c805p191p272J0417J1061k0174j009K0617l487O387j4615q919J5874k094
$$ y = [6015, -14237, -13668, -10900, -23078, -26414, 928, 7101, -17980, -8573, -7927, -16325, -11859, -2369, 16913, 9527, 17690, 14270, 11661, 6045, 14371, 12914, -5612, -20091, -15051, 1735, 5820, -13852, -10978, -16155, -22056, -12531, -10108, -1998, 13359, 13133, 31220, 19907, 3854, 11902, 24683, 27795, 10891, -17143, -14249, -4924, -21926, -29070, -32381, -25762, -18159, -158, 7626, 6924, 6431, 19627, 16127, 7254, -3486, -1546, -7130, 1091, -4401, -34891, -38671, -26768, -21665, -12662, 401, -14103, -15402, -21302, -17479, -29742, -22864, -175, -16507, -25237, -17876, -293, 14374, 208, -17069, -20094, 2463, 15754, 5301, 3552, 9377, 15129, 33757, 39928, 32029, 16275, 7771, -3805, -10996, -18268, -7851, 3210, -16964, -17973, 2644, -843, 5544, -9071, -17990, -2116, -4210]
6004d210M32n399Q25K0160k690j199j492q372j2859K7582m978k9932J986Q518
5990a1628J059J055K865k963j4270J991K6053P667r907m02M251J1519j5931p757
5976f398J5391o21L512O024q484M16k06R116l907j6721k180N623L321j103q14
5961B969n682K0838L791j122j4251J5703J6856q64j387j3426k3640q296K9374
5948B0863J7369q885k2518j902k097j3321j450K0547K223k5599k5834q00J1969
5935b9435J3766o777n042K855L953J584l752J3835Q980j3732k30J9222J547j7610
5921a0836L934R621p065K805m584J5034Q412q193j9971l284p244J1098J8139k664
5907E202k2580J0588J1174j052j5925K171J6353j4581j5625q263l936K034J5599
$$ y = [-4210, -3778, -9177, -8352, 11808, 9118, 7919, 6427, -1945, -14804, 12778, 7800, -22132, -20146, -11628, -10569, -9514, -6649, -9612, -23882, -21891, 4162, 11829, 1922, 1520, 5771, 17290, 1359, -6398, 8993, 8372, 11884, 17908, 9424, 9840, 9634, 18750, 14843, -1878, -4058, 1565, 4886, 3783, 2969, -2713, 18125, 21916, 20794, 6543, 22246, 39102, 38238, 36851, 23425, -215, -8511, 20863, 38232, 29347, 6829, 4927, 2830, -10491, -11941, 8606, 10829, -14770, -40604, -41404, -29435, -15669, -22446, -27488, -24633, -20680, -19096, -22848, -9013, -33, -13765, -13995, 5227, 6774, -10836, -6902, 2719, -4346, -1541, -6125, 8909, 17321, 9128, -10843, -14127, -21371, -10273, 7866, 5202, -17378, -6790, 4384, 3332, -12593, -10422, 5931, -8650, -24275, -32538, -36474, -34440, -18841]
5894a8841P723L75Q728M745j9635K419J4993L320j293J2638J1872K24r721k4663
5880g116J761M429L32m937m754J7692q461N216j390K649m827M890l544P718J178
5865A0836k3404j0673P975N890Q203q674j1080q75N263P07N818L227p709R583
5851d913q30R836M257m85k7043J1723p217p939Q408R937k908l527j4176p900J0814
5836b1963N693N292K363O731l2J1708q986J1629L679J466j6856k1728r692K4862
5822e834J8861K1053m23k3993j4376m456M58K104K4640M970k1914k3717J155R816
5808a1656M960j642K096r269P054q98j082r458J759R511K581J0323K632J0607
5794A7518J0468m014m789q847p480O85O912n199j4104j2258N535J6760n200O972
$$ y = [-18841, -11118, -10743, -2015, 2730, -16905, -14486, 507, 3827, 2534, 15172, 27044, 27268, 17547, -7116, -5355, -926, -594, -5531, -10285, 7407, -1054, 4162, 2772, 5421, 594, 5484, 1940, 9658, 10836, -12568, -23241, -15266, -9376, -1173, -9847, -20927, -21802, -16539, -15832, -10014, -6787, -14496, -4913, -5743, 4093, 8350, 7865, -19178, -7455, -14672, -22611, -14203, -4266, -7174, -10701, -24877, -32777, -21963, -16270, -10978, -8615, -1884, -1916, 9792, 806, 12435, 16114, 17580, 724, -21004, -30696, -5834, 13027, 34080, 33657, 9664, -4712, -9168, -8710, -6606, 18034, 23004, 1090, -22627, -21472, -11656, -6696, -8338, -6242, -15511, -8457, -9355, -10437, -19895, -18136, -8625, -6044, 4279, 6911, 17518, 27986, 23972, 19183, 10336, 2856, 3541, 10453, 5254, -8850, -21108, -15573, 1187, -4013, 2959]
5780B959J4753J1016J508j1827j4276l831j3063J5606K9361j4863j9581m135j6342
5767b2715m316J1744M001O288O278l691k719p101j266J2353N788j565L047j9026
5753a2900j6207J2010L429m189M547O349p466L004K2460M536p283q669J3301N805
5739A8727j4707j3921N117m336o939P304k046J0180j91K871J4456K815k5366L079
5725b957J8341m079j6222j461J9792J3820k8920j4636J9083J9638J0981J7000
5713E0380j1834o921n753j8949r267j6064m941L791o196q156J7816k636J0357
5700h373j715k38j765M050O649o989J36j5772Q0m917J3812n378l006P273J6353
5685B00J2810k489N058J9903j2800j561J4425o911l881j0512j4572q388r404N208
$$ y = [2959, 17712, 28728, 30236, 18409, 4133, 302, -12761, 2845, 32206, 17343, -2238, -6373, -22715, -27031, -15287, -11286, -4998, 1280, -2411, -5130, -12231, -13497, -1144, 4644, 3079, 6126, -12900, -29107, -17097, -13668, -17857, -13310, -6961, -14427, -11423, 11037, 15573, 8290, -379, 12922, 18727, 4020, -9901, -4784, -9120, -16059, -8755, -10801, -621, -812, 2059, 16515, 19330, -6036, -2957, 15384, 11305, -4917, -6378, 13414, 27234, -1686, -16322, 2761, 22399, 33380, 50380, 38546, 31625, 25872, 6923, -2344, -18408, -23349, -19558, -25754, -33910, -16094, -18730, -8373, -10088, -10326, -12091, -8041, -1392, -8381, -8245, -24017, -23937, -28854, -15042, -20420, -23426, -16153, 200, 13010, 10521, 15579, 35482, 22682, 21121, 35546, 28635, 24754, 14242, -330, -8718, -18122, -12914]
5671a2914J4247l884M494N44P423M033m826k9701M358R942n892Q36J6732Q001
5657A3393M019J4238l978j8721j7212m526J5798M032R591J241k8528Q580J2908
5644A0835Q638j1879k096J3644j8469k4566k567K3631P439j963j0421r467J0100
5631g141R597j2891j3908N039N404L290O141J2042K75m801j1569N966P12L90o751
5616h205o871q715r629N767L4517R8r073o344k149j0822P112l381q676m564J2846
5601a8089L864J6863j3355l2812J6419K9528K902q360j994J5419m666j8547n616
5588a8444q16l660Q470o4N928p096p679J9588K1152r246k1627j0422L696Q511
5574a1709M928K848P04p225J1344M183m278j644l020J0688J1656j0281j0848j0231
$$ y = [-12914, 1333, -2551, 1943, 2487, 9910, 13943, 9117, -20584, -16226, -6284, -12176, -11340, 5392, 13393, 17412, 31650, 27672, 8951, -8261, -12787, 3011, 7043, 16634, 17875, -10653, -2073, 10835, 19473, 7594, 5498, 19142, 673, -23893, -26460, -2829, 4610, 2647, -7774, -17241, -7141, 2456, -10435, -24343, -19304, -13900, -10610, -4469, 7573, 7848, 3047, -8522, -2556, -1844, -1454, -8205, -15076, -23791, -33420, -27653, 6864, 6962, -2111, -8455, -10604, -21426, -14314, -17695, -26371, -30935, -18089, -14225, 2638, -10717, -43529, -27110, 2418, 5320, -3040, -5034, 10385, 5719, -12828, -18444, -19260, -22920, -14450, -14514, -8586, -15682, -23361, -3773, 17379, 8133, -13494, -23916, -20220, -11709, -6781, -3933, -3229, -10454, 890, 5073, 795, -849, -3869, 6819, 18475, 8194, -2654, -12885]
5560a2885O722j9853n497J1921R488M092o53q599j6233K9815J5162J1720O859
5547C2059j0057j2173q883N665O219J0630j625j2287k3942j4575r909K8346N643
5534d889Q106N224Q364r72j019j3418J3534L956j2007J747M502l122R240n588
5520A3658k2560J300J8979J9856o458o914j1033k933j246q212K611l683j4704
5507b1339kJ8629J9746k335j3311J4514N509j1769O61n823j1648j1446K788R356
5493f470J1549p036j4790m284J942j8373k453J1562P389Q828J6398j628M585J0867
5479A8086J7878k649j4708j7820j0842Q384j7806k2300P131J3804J7810J902Q456
5466G326j3420j1718J4270R908r876l674l248M54J2443O62K655j1370K360R405
$$ y = [-12885, -6163, -26016, -31513, -19592, -10104, -6012, -6665, -15264, -31497, -1682, 13480, 25200, 32059, 22002, 9829, 946, 6611, 12830, 23460, 21835, 9548, -14394, -28969, -38878, -10532, -4889, 3217, 8441, 16805, 15833, 14814, 1396, 14930, 18886, 6879, 8626, 13128, 10006, 19246, 13658, -8902, -7602, 11377, 31233, 24775, 17861, 6828, 3895, 2649, -5563, -2952, -6635, -21339, -21341, -2712, 17034, 14699, 1388, 15902, 21411, 9642, 10303, 4480, -7168, -18614, -15826, -6470, 5079, -1957, -16747, -21031, -19089, -37462, -39915, -28353, -20964, -12136, 4262, 2634, 7219, 18086, 35964, 33315, 18607, 787, -10055, -1671, -19477, -41777, -34646, -20842, -3032, -1130, 7326, -6094, -17812, -3542, 6366, -3510, -7184, -10432, -9978, 2465, 3127, 5782, -5588, -3228, 6177]
5452F177n674k3583K758J6958O875k449j6147j267n880n2J2383J1463K96O185
5438H043r97O20k488k666L985J3290k5766j0461l170K0881J5718k1643k5976l177
5424c3807l213J6795J0394Q040P277R874q111j0990J0043J623m330r911r217j0807
5410b6340j0173J5679N816n763J802K0758r45j9207r37J2672l788J3417K111k027
5396C075M934M53J3219k166k6363j9217K0179O626m149r819J108k037R458M40
5382d259q398k0875K440K596n398l129L34J770m302J0430l16p199n349P308M987
5367b9360K021K8526K8195k727k1444l868j3097k8983j1169J4085K0949K7143
5355A0271j2964k2281Q832O855j884j578J3839j5461k7395J9908J0750J6839J680
$$ y = [6177, 503, -23080, -20322, -3364, 3511, 1062, -15085, -16352, -22232, -22284, -9901, 1562, 1858, 8043, 7046, 7666, 5178, 2512, 6497, 19787, -5979, -16440, -19610, 1271, 16989, -4654, -30630, -33807, -37020, -20225, -9831, -1791, 5486, 15360, 7249, -3741, 6302, 7925, 3595, -6316, -15533, -26340, -36513, -20834, -15018, -20781, -18979, 1779, 834, -18373, -19310, -6638, -10426, 2991, 5102, 3075, 8009, 8462, 21681, 19515, -6848, -26065, -5886, 740, -3409, -13228, -12120, -14157, -4699, -4259, -12657, -33532, -31092, -28496, -33894, -37023, -36689, -34919, -39221, -28791, -29107, -36306, -41655, -34347, -29360, -27339, 1187, 29382, 26655, 5211, 1343, -11754, -40737, -51906, -37821, -16872, 10271, -2693, -24974, -16142, -9287, -11171, -12749, 1090, -14371, -41766, -21858, -11108, 5731, 7411]
5342G411j0537j126n931l117Q98R931lj4345P630R479P486O173M853M975L797
5327B7574J516J015p689j2865k7340n283j0078K0945J6514k734j7786J7949L949
5314E687k888Q874R565p601j0912J5469j4154p988J2298K031j192L16o797o179
5300c471R052k334j8518n611J0611N559J6341K171r251k0388K0842N375n056j3902
5286h580j1620r387o643j7n27J9973J4213q72m760l249K448R619N687n997j926
5271a638J068j0744J091Q86l638J766l634l585P892J2881K70j9057j9874N701
5257c0615J547J4400n665j705J0617P010q072m884m020j1319P486J6507o531R256
5243e988N208j5017p242K752j0546j378M560j768j823j731q35o860J8695K6354
$$ y = [7411, -3126, -4252, -10183, -13300, -12402, -2471, -2474, -16819, -9189, 290, 7776, 13949, 18802, 23777, 27574, 29090, 30105, 22416, 9551, -17789, -23072, -33150, -12205, 4309, 1575, -16211, 1738, 5687, 2799, 11673, 21238, 13637, 2725, 18194, 4040, -3948, 8350, 10381, 9189, 9505, 2708, -3471, 5581, 3247, -15271, -20882, -10271, -4712, 11629, 13800, 4549, -15839, 5003, 10378, 5322, -8580, -20200, -29587, -36230, -36247, -36774, -16801, -2588, -3460, -8220, -11469, -9021, 598, 6285, 288, -1638, -570, -11314, -10223, -9337, -12975, -11209, -14843, -18428, -10536, 2345, 2615, -16442, -36316, -30615, -29068, -14668, -20333, -22038, -11421, -4411, -12483, -17367, -21387, -32706, -25220, -8713, -15244, -5988, -780, -15797, -23039, -20287, -30833, -32211, -27651, -29419, -31242, -32973, -33808, -40668, -21973, 4381]
5229D381k614p232R536q261j2760m249o764Q797m489j2875J718J1114J4869J6193
5215G364O317K0118r928j2967k634q504j5058J4867q876N38j044K605J9376J80
5201A2354j4294J07R476n200L9j881M667p07k6864k8270J7310J0678L1827J1090
5187B0332r125m677O003j834n828Q559J8787m094k3748k2055J694J6774J5258
5174A6046l137L700k6j4967o073J4187K0564m659J204r459k4049j4340N914L034
5160a2061j076P521l255N103J3386p096j2150k421n720P935K987j201o096K940
5146a1204n853L423J1615l680j0848q912J0634J8476j1371j7530j7894m885Q202
5133c9827K1793K2296q436k5882K83K849j5199l452K23K005N938J6447J4610M701
$$ y = [4381, 1767, -5465, 4071, -4190, -16950, -21199, -27963, -19166, -23655, -36530, -34812, -23698, -8829, 7364, 13681, 33799, 23871, 10904, 8270, -234, -15292, -425, -9301, -8763, -9807, -7202, 12174, 12354, -1940, -1833, 7643, 2443, 2482, 601, 5268, 4561, -22303, -50573, -33263, -22585, 9242, 20332, 11207, 6530, 12533, 10699, 4871, 13430, 32217, 28123, 4375, -17680, -15986, 788, 16046, 12909, 16609, 16583, 1616, -4457, 9730, 30294, 25635, 26839, 17380, -6669, -21009, -15095, -12061, -13137, -5616, -8871, -3768, 9618, 2522, -9628, -12049, -17769, -9834, -6847, -8048, -14144, -11204, -17057, -13634, -2019, -5699, -16547, -25459, -14825, 3651, -7720, -25250, -43144, -48029, -39827, -18034, 4262, -4174, -30056, -29773, -26924, -42123, -45575, -45352, -43347, -37409, -20962, -6352, -1651]
5119a651n931Q981J4634q892j2714q733q324K0627J2397o867j8729r023K2560
5106a665k936q687r325M989K1514J2469j583o052n428m398j0243L876R440N814
5092G785J2381N30p562o38O017r972j1270p575J1552p600j3264P526J2330J4381
5078A4621p120r030p942l760N438O511j790q681R875J7504r499r160j0198j0331
5064b3562J3995K0376J2760j3962j6940j0300J2426o379L31P230Q152j2059o115
5051a4047p528j1086J1583J5327j9953j209K0887K084M88Q928M116j3365o38j04
5037d517k3327l804O311r762j3210N087M77j55K3375J5011j1598J8357M288l0
5023F503p142j3573J2368O622J6199M195k2248j5574l98J0069j3649j0022n332
$$ y = [-1651, -7582, 1399, 16033, 7141, -5573, -14306, -22630, -2003, 10394, 3527, -15202, -24225, -1665, -4601, -13288, -22613, -17624, 3890, 16359, 14776, 8724, 3296, -1102, -11345, -7469, 1971, 7785, 20166, 20696, 13134, 12496, 18513, 8541, -2729, -10304, 1248, -6352, -19616, -12090, 240, 14621, 7501, -1529, -9471, -13231, -7793, -1282, -3072, -11753, -1878, 15626, 6127, -3033, -13231, -23562, -9567, 10809, 23569, 9607, -7333, -17633, -5207, -11586, -11255, -4025, 4127, -7932, -14047, -21575, -32661, -21078, -5751, -25704, -26913, -6026, -3942, -3454, 5474, 9590, -3775, -4413, -4517, -27844, -31648, -25337, -35099, -48309, -43222, -42745, -42900, -19525, -4514, -16112, 2245, 6533, 6503, -639, -14212, -1844, 4778, 20977, 25172, 2924, -12650, -13048, -2979, -16628, -26650, -31982]
5010c1982J5091J5005J301m209J5893L883m936k0469M802Q37r266J754L737J2550
4996C991M273j3095r156J1900R369l3354j3545K7290K0414Q177r88k0335j0861
4983a5920k955l009j2974R942n731J6489P743J3298K794j0208j8432J1703Q875
4970A615m714j4189l975J2769J3698l434j0888m006J085j0249j7013L97R527K0724
4956h653J7188k394o541n072O458p504k8431p248Q344J1849J2329J4077q092j6669
4942b0359O278L940k961k831j3821J2205J1088R695m119q364k1504j0462J127
4929d0088O097J3975K067K1471J6850n386j8248k9502j928o975J2479J1074J5089
4916c025L429P55J1767J0743l899k5075p583j0820j0578J1646J2931J798p737
$$ y = [-31982, -16891, -1886, -585, -4794, 11099, 14982, 10046, -10423, -5621, -4784, -14050, -12296, -8559, 3991, 8264, -4831, -13987, -2087, 7282, -26072, -39617, -12327, 8087, 16264, 15276, -5059, -15920, -18875, -21884, -34858, -24916, -30647, -14158, -6415, 6883, 9677, -531, -18963, -7260, 1615, -3099, -17288, -21263, -8494, 5204, 1770, -9118, -13124, -12039, -22288, -39301, -38904, -29377, -8653, 8535, 6141, -400, -5472, 986, -6518, -34949, -42197, -33853, -22004, -9675, 4402, -3690, -20359, -14081, -10141, -13102, -15933, -29754, -17549, -6461, 3234, -885, -9249, -30753, -41215, -40088, -33991, -20016, -17949, 3522, 20372, 14986, -3262, -32764, -34692, -41667, -29188, -18114, -3025, 404, 1159, 12926, 23669, 19770, -5305, -12888, -23708, -34286, -22640, -9709, -7911, -15648]
4903a5648j0157K1029J2967K06J89j0207k4715m398K8916P724j951O831p118k1510
4889a7842j6791J2697L3292J8696j5196j6715p028P900J4094K047N804m520j0740
4876E698J6876J9896L456k4516k6074k425J3158Q981L311p000j6571J7602M999
4863A7391n848j3799j461p103P096k573k1132p162N564l434J0394J6444q471j9449
4849c3543J1988K5730J826j1470n078o359J5566k903j9037j1717J044j485N695
4836b9743N94K832K3442M546j2220k903q73j2020P472K0035J4588o025R478k8902
4822i699j1742J8336K2913j5188N999o603k4519j4064J3136Q463J0374K660k0439
4809b0373M059O754o491j664J5154j3576m971J4642k703k715P112L839j6641l4519
$$ y = [-15648, -25805, -4776, 8191, 8397, 8586, -1621, -26336, -30734, -1818, 5906, 3955, 10786, 3668, -17842, -34633, -21936, 11356, 30052, 14856, -1859, -8887, -987, 13107, 15154, 20958, 16438, 5698, 22574, 42470, 45926, 21410, -4664, -7089, 6069, 15050, 18361, 11361, -5210, 12392, 17391, 11543, -2256, -3717, -10820, -3724, -6297, -27429, -34591, -29027, -32461, -22067, -5623, -14094, -33543, -21555, 4175, 6001, -5469, -10547, -16906, -1340, -4243, -23280, -34997, -33953, -35438, -29743, -29149, -26317, -2875, 1671, -10549, -13452, -14325, -26345, -18873, 1162, 15750, 9725, 19203, -9699, -21441, -3105, 19808, 4620, 10619, 4016, -20503, -34567, -21431, -12968, -2594, 66, -20373, -16314, -9560, -16051, -17715, -2561, -16137, -21108, -6466, -9169, -11884, -4772, -933, -17574, -52093]
4795e2093m11K7939k164m38K1941Q103P413l375j633q964n246J0331L444n796
4781i49j2494j8657K339J0354J4139l25Q977J5348M789q523j4755l241J5028K188
4767A4218k2000p145J8451k582J3056J3398k080j9440J910J2815k191k5296j3507
4754b0393J9607m197J371J976K131r829r647l015J2555l342j041K7153J742n040
4740A0031K347j5297j4993r539J6734J8974p952J544Q824J770p666p921r26J2593
4726H523Q845j5338j8708k117J5138N306l1065o439J7857J2795o255k4892p430
4713d3780m301J0301N471J3675p901j5605J4840J4316m064o639O575n029J2861
4700i280J2391P448J3219k7098l1184P821J6857K0105l947j7499j2452l618K1137
$$ y = [-52093, -52504, -24565, -26729, -27167, -5226, 2877, 10290, 6915, 5282, -3682, -8928, 1403, 4847, -949, -13443, -32100, -29761, -19407, -5268, -5593, 3384, 18732, 23521, 14998, 243, -2998, 12030, 14218, -7782, -14927, 3524, 942, 13998, 27396, 25316, 5876, 7786, 20601, 18410, -6886, -20393, -786, -4983, -3612, -1636, 495, -9334, -18981, -21996, -9441, -12783, -13824, 13329, 15071, 10031, 12378, -2919, -17912, -27451, -10717, 8257, 305, 1849, 10673, 12443, 4777, -3144, -4070, 8523, 17368, 2030, -16678, -18795, -3657, 1649, -29416, -35855, -17998, -5203, -11458, -36350, -43780, -48081, -37780, -32309, -18634, -26535, -42140, -27300, -12984, -17048, -23687, -17112, -22141, -9280, 3111, 10559, 23778, -3320, -34504, -26683, -9826, 10279, 6332, -11167, -23619, -27237, -6100]
4687f100K733J5421k156k7648r781N451K1685O070j1981o28p08l889R800L258
4673A527L123o885o63k4163n979O33J9766K958j3084K0933N122j1621l126P037
4659d422Q641L911j3584m999J206j1127p562J0383O0L433N374j9859O155N38R505
4644a2347J3355J9031n788l4878l94P271Oo463j0169K650P768J4097j533j4424
4630b1818K728K7049K633Q91J1428K0778o060k4480n461j602j1413l102j2612
4617b1041J652M855k669J5560J2266m389l193l026n785m088r977j3551n914P466
4603c1834J4176kL623P772p863N020J2k8616l021K7849K7891m029j4516o592j5195
4588b5325J0435K16m139J6878K418j8458l120P77m626O656P66J1248J462j4477
$$ y = [-6100, -3367, 12054, 9898, -17750, -27531, -22080, -395, 5675, -6306, -6934, -7642, -11531, -1731, 1527, 4650, -2235, -2898, -27061, -33040, -32407, -12641, -9683, -22767, -1834, 3288, -8333, -11459, -4422, 4219, 8130, -5454, -10453, -9247, -20374, -27936, -17553, -17493, -14060, -8686, -28545, -22390, -21852, -12347, 1008, 20039, 14251, -20627, -21021, -13750, -13744, -20207, -30376, -27726, -19958, -5861, -7394, -21818, -19090, 7959, 10592, 11483, 22911, 43689, 37629, 13149, 7688, 6086, -5327, -8429, -21041, -19389, -14534, -17203, -1643, 10623, 6234, 3041, 15, -5770, -9858, -19835, -33386, -39300, -31834, -17658, -17660, -14037, -6265, -14128, -9108, -9096, -37712, -40733, -12884, 15007, 10978, -3538, -10130, -25325, -14890, -14674, -18813, -1935, 483, -17975, -21095, -20318, -24944, -18288, -17522, -6274, -4812, -19289]
4574a9289m238J3202J5800J3580p413j0984M774J2836J0623K735k8055j9904N242
4561a1091J2499m640k0603o00J1214J3960n393r151q664J3731j2488r474J5019
4548a5681J065L771M035j635k1628M675K3237J7664R130j9335j817J5383r549
4535I315l709j0533l987L830K4679Q15Q253j6309q982L572q551q905k356j3308
4521b6176l721Q079J193l508J4886j8388j5501J4957J3769n045k622M933J4633
4508b511R225k897r131q911q053N753J8029J4347M334j207l4189L973M667l897
4494a0468J8011N466l892j0935p408P528r320j1458j2032r830K3206J2162R373
4481D03p459j6862Q073J0621j3660M227J3035j754j8499j8801r95J0293K8011
$$ y = [-19289, -23527, -10325, 5475, 19055, 11642, 658, 5432, 18268, 28891, 31626, 3571, -16333, -11091, 1408, -3232, -23835, -24435, -13221, 739, -4654, -13805, -22469, -8738, -21226, -30700, -15681, -14616, -10845, -6810, -8445, -30073, -25398, -2161, 15503, 24633, 5298, 3481, 18864, 9315, 5606, -4927, -8914, -5084, 19595, 20410, 28663, 12354, 3372, 6944, -1607, -10512, -12868, -26176, -29897, -21818, -20625, -24133, -9247, -27635, -43136, -28179, -14410, -19455, -22077, -17144, -2511, 6714, 3817, -5314, -14225, -22278, -16525, 1504, 15851, 20185, 18978, -15211, -11238, -6571, -10468, 7543, 13009, 9117, -1818, -9226, -1698, -11018, -22476, -34508, -44338, -21132, -8970, 403, -7056, -23918, -15845, -5224, -18884, -14657, -1622, -3376, -21875, -40676, -41671, -31378, -3367]
4468c367K6802K3452j1236j6646k2274K442J0061J858l850j470k3179q688q683
4455c4778J543J5614J248L583K0210l499p463j2337M219k096m851R467j547J4984
4441D297K6018j0304m455R2j0714k0828j5173j1258N111Q893p255n403n915J780
4427d5114r94P523P430J0961j033j978K7564Q913p188k0257n785l453j81Q548
4413a5044J3476j5906j3336l499j0181n021J9295j3810j1624J9898J8455p062
4401b4359j3549j3488K1787J2777P357J5054L452j0563k314l343M084J013J32
4388a960j0241m019M795j2129j2153q999Q097K4395j524K656P963J8778k52j39
4374A5268J504o958j0366j1107P015o796j3118n959L2271J3700j5545p432r450
$$ y = [-3367, 23435, 46887, 35651, 19005, -3269, -827, 9234, 11092, 7242, 5772, -17407, -26095, -34778, -33235, -17621, -16373, -12790, 7420, 3921, -3542, -15879, -11660, -13756, -18607, -9140, -10687, 4297, 30315, 20011, 15556, 15648, 4934, -15894, -31067, -42325, -37214, -28321, -35576, -40979, -46894, -45114, -46108, -38585, -31155, -20194, -21227, -23205, 4359, 13272, 6084, -14173, -19958, -23411, -23592, -15044, -1568, -17474, -30810, -34309, -44490, -49511, -30216, -44026, -55650, -35752, -17297, -24359, -37908, -51396, -29609, -16832, -9475, 5579, 9031, -1532, -3846, -7189, -3105, -2092, -1960, -12201, -16220, -11425, -23554, -35707, -44706, -36609, -12214, -13738, -11082, -3119, 15659, 15407, 15268, 16772, 9814, -552, -11659, -4644, -11440, -24558, -30517, 1754, 15454, -91, -7523, -16973]
4361a6973J2244J3942J88k693j6697k503K1266j378j391L485J3669j578j6290
4348E291j5349J3715J485q482q243O841J2802k581q315n717M119Q1l428k176J4341
4333D384n736o151J936k363M578K1867J1236R874M692k9033k5231p949r988j3372
4319d1256p253O708K6669P034l563j1177p331Q254R784J2772p617p097K797j2409
4305b3685p308O298J0101n538L708j3153o773K1968J4776q035j1317l548L05J1003
4291a1198q097k0667O459l764J0846J7514J2292R673p164j9018J210Q261J5305
4278A1652K061l410Q204O800j3811m2455n141j9821J5467K1279r659K2920L0404
4265B4490o207k3748j6834r30l934Q62j9109N887K6860J1390q837l1723K0114
$$ y = [-16973, -4729, 9213, 9401, 6708, -9989, -12492, 8774, 7396, 6005, 9490, 23159, 21581, 5291, -10058, 3657, 5142, -3340, -11583, -4742, 8060, 5479, -2836, -8553, -4434, -4353, -7781, -9957, 4384, -1352, -7503, -5567, -7930, -3352, 18515, 29751, 39625, 44317, 15284, -9947, -17896, -27884, -41256, -48509, -41801, -15132, -8098, -11661, -22838, -30169, -21915, -12131, 641, -6976, -14073, -11276, -23685, -30993, -24695, -14594, -20132, -16424, -29577, -36350, -14382, 394, -7641, -18958, -22506, -22201, -11198, -19295, -39962, -33503, -37267, -26421, -8907, 3385, 13058, 5894, -13124, -11914, -3653, 11652, 13713, 10303, 18507, 25307, 11496, -30959, -36100, -55921, -40454, -19175, -28834, -5914, 24490, 18283, -5465, -22299, -23229, -27163, -26301, -45410, -39523, -12663, -1273, -10110, -41833, -21719]
4252b1719K5555j2800l064l521j4735Q6j1232j3699R299Q120k344j2645p884J2196
4238d8387J1250J4298Q864M757j802k7614R47J00K296R756j0882m57r080J7577
4224b8377J2077J5127j7260j1355n04J7789J2780l288J071J5371K0598j7732k6633
4211a0336j4298J5633J567l085L341J762J6826J5053O415j6324j3530l087k2300
4198b2363j9455K293K2216J8501j0637j719P423J2123M922j0198j1156J3754J551
4185G255J2513K97j7154j6413R91j3575l598J1179J351P329r336N273R006O059
4171A177n663j789L255m512j1180j7517l996R382J1388J344j0336P588J9935J7553
4157A6629K2344r403p42j0159j0348j4267L800P56p24j5419j011P497p265J552
$$ y = [-21719, 3836, -8964, -12028, -15549, -30284, -30198, -41430, -55129, -45830, -37710, -40054, -52699, -60583, -48387, -37137, -22839, -13975, -9218, -11020, -38634, -37687, -37587, -35291, -25535, -36417, -36874, -45954, -28377, -16300, -1173, -18433, -29788, -30292, -12503, 277, -3011, -1940, 13431, 34029, 16297, -10336, -24634, -9001, -7434, -10519, -7178, -5416, 11410, 26463, 32878, 16554, 3024, -63, -22363, -41818, -39525, -17309, 1192, -9445, -11164, -3741, 8382, 13304, 3106, -8050, 5704, 7255, 19768, 20065, 2911, -13502, -12511, -26086, -29684, -18505, -17154, -9825, -19161, -13888, -4882, 1177, -4486, -6275, -3020, -7532, -18712, -36229, -40225, -30843, -19455, -18111, -28447, -20859, -924, 16629, 38973, 29570, 28828, 18669, 8321, -5946, -2146, -1390, -2114, -17533, -18544, -11047, -18312, -16760]
4143a6760l525j127R775o75Q193j2399O680J1191p549j9393r018J4963n41j0179
4129c0364R493m092N806J6391M519l523o940O296k327j2244k031j9348j6226J112
4115e3478O10L126O953L9105J1904L080P595Q739p094k895r365Q10J746j0980
4101a44m820J6084j8869j9414r00j3953j898J1175R733J7458M118j338k135j8892
4087b3795M869J055M430Q279j6962j0664K872n680Q309J4823o678L726l567q859
4073b7842j2677j2642k005J3644Q970J6783J091j5274J3746R434j3364J3871N350
4060i15l139q847j1242p032j5473O399j947J7693k121J5365R920P14r506j5056
4046b5187j2904j1865N247P892k46l787j2467J7413J5494r584M122J0239m886
$$ y = [-16760, -20285, -21412, -11637, -12312, -4119, -16518, -9838, 1353, -6196, -25589, -34607, -19644, -20185, -30364, -20871, -24963, -19157, -2766, 1753, -1770, -8710, -2414, -4741, -16985, -19016, -38364, -54590, -53478, -52868, -49742, -42789, -3684, 8220, 11300, 18895, 27634, 20540, 17645, 8280, 9090, 10836, -144, -4964, 11120, -7749, -27163, -28063, -42016, -43914, -32739, -23006, -5548, -1430, -2768, -4903, -23795, -18926, -17871, -13441, -5162, -22124, -32788, -29916, -35596, -27287, -12464, -19142, -15416, -18983, -27842, -40519, -53161, -55166, -41522, -32552, -15769, -14678, -29952, -16206, -6772, -20136, -6265, -915, -4054, -12901, -24143, -31175, -46648, -40249, -42196, -24503, -26624, -11259, -1339, -625, -10131, -25187, -38091, -49956, -44709, -36817, -37063, -40850, -53317, -35904, -20410, -29994, -25872, -15633, -20519]
4033b0519r28p765L976J3546J7394J4272M871j3548k6002k2382j6910p230K0616
4020d0609K4322J6531l82m537r437o990j1218N016J83j1264j062P7p838n862Q488
4005d4582J9739J2384J3324j968j3356k3494j60L512J1215R193J148K1925N220
3992A4100j7835N582J9432M272l317k998p82k5813J690J8100J462k5294M06j884
3978a2879o944P05J3337Q212J7115J1609K592j7120n870n695j0009o189p572j6209
3964c4917k79N115J0883m79k0715O731J4320J2611J3396k202l951m044K559n900
3950f872j3938l7k051K2904j849l70O961o884j5462M329K7473M790Q122n020k1629
3935D67k5363j00J0635J0614J1795j006m098j259j891q561R185Q192J737L027
$$ y = [-20519, -21447, -29212, -25236, -11690, 5704, 19976, 24847, 11299, -14703, -37085, -53995, -61225, -40609, -16287, 244, -138, -4675, -14112, -21102, -32320, -27304, -27121, -38385, -39447, -39370, -47208, -53070, -44582, -24843, -12459, 865, -1103, -14459, -37953, -38113, -34601, -23386, -14193, -13045, 8880, 14100, -3735, 1847, 21279, 25551, 22234, 19236, 18454, -7359, -5669, 12431, 13893, -11401, -10995, -12879, -19823, -19118, -5781, 2431, 19546, 31155, 33747, 16627, 10757, 5062, -4947, -11136, -18708, -34917, -35196, -30081, -19198, -19677, -40392, -33661, -19341, -6730, 6666, 4464, 513, -3531, -972, -6872, -20810, -20847, -22898, 6, -1843, -2213, 4748, -2136, -17598, -13269, 14204, 18994, 27116, 22096, 467, -24896, -24996, -14361, -3747, 8048, 7042, 2944, 1685, -206, -8767, 418, 8610, 10347, 13374]
3921A3374o086j4493j0546Q054J1657K877q222k9637o580k475O741p659J8960
3908b4035j377k816L57n194k587L075J0542J664K547o769j0854J6962M920J9318
3894E753K851O342j1266m695r302j3740o111P218j2354Q401K2788L044j4025N853
3880i243J1155Q693M346R688o120j0279j7444p110J7431r5p269K71Q830J3309
3866A6163q973j4000j2846R822Q264j2880j6754l385M150J2116J5352J4693j3875
3853b153J910J9250k242j5991k1354p140M17J23R50O540K5984K2519K86m470j3312
3838A1317N639j0963o246k273l008j6908K935l996k013K5636K3913j7445k4964
3825a8376J1613N811J2293K1335k59k0051j8719j3478N79j1795k31J9396J1169
$$ y = [13374, 7288, -7205, -17751, -9697, 1960, 4837, -3385, -33022, -39602, -42077, -35336, -42995, -24035, -25412, -28228, -27871, -33065, -35652, -32577, -22035, -20371, -17824, -24593, -35447, -18485, -13565, 5753, 8604, 14946, 3680, -1015, -10317, -24057, -30168, -22950, -35304, -26903, -4115, -1071, -15096, -9243, 1912, 10605, 14951, 24639, 18519, 8240, -9204, -16314, 1117, 1022, -6247, -5976, 2854, 16163, 7190, -6810, -19656, -9834, -1570, -14450, -31204, -34589, -30439, -18323, -2971, 11722, -2153, -243, 19007, 16765, 774, -20580, -27720, -27303, -27180, -26230, -19690, 6294, 28813, 29099, 24629, 11317, 16956, 5993, -253, -2526, -5534, -22442, -19507, -23503, -25516, 120, 24033, 6588, -18376, -6763, -952, 11341, 32676, 32417, 12366, -6353, -19831, -19252, -31047, -31278, -11882, -713]
3812g13N19r55j6098r525K255O831m949Q77m882J4768O125j3623M270N026o217
3797a6291j1507L613J4613R481o579k3079J6592K0070J647N421M785j3175J996
3784G587j403j2619n415j1141o287j1053j0522p273K4863K0340q813J2882R626
3771G72j2529J0272j3765O015J162Q103M13m286m365o612o560K0574Q288q265
3757g83j7599O49P218R405M247r917p902J6899k871j5761j0295R833K6420N722
3743A5265j4240j3860L047K2086j4018q71Q964k850k0703M190L474k737j875N295
3729h833J397j4013L446j7807j4757J0589l808K1780R948j1674J2111R990L131
3716A500k195r580k7764p483O582J37J6438K0465k782j9784J99J9999K0858r923
$$ y = [-713, -194, -1149, -17247, -26772, -24517, -17686, -22635, -21758, -26640, -11872, -5747, -19370, -15100, -10074, -16291, -27798, -24185, -9572, -91, -6670, -29749, -13157, 6913, 8560, 13981, 18766, 5591, 7587, 6184, -6435, -11850, -22991, -29278, -40331, -50853, -58126, -33263, -12923, -21736, -8854, 772, -11757, -1485, -15250, -9235, -8073, 30, 443, -3843, -8208, -14820, -21380, -806, 7482, -783, -18382, -17733, -10515, -1110, 3137, -6780, -14682, 2217, -654, -16415, -26710, -16877, 9543, 15265, 1025, -12835, -9788, 12298, -1720, -2591, 6373, 3523, -17180, -12990, -9516, -12253, -14128, -8833, -7436, -21449, -18003, -35810, -50567, -39978, -43786, -22006, -12058, -23732, -11621, -1631, 1500, -695, -10275, -38039, -45522, -38940, -38803, -22365, -1900, -4682, -24466, -24267, -4268, 16590, 6667]
3702F667J1244m584K732q33m155j228j0577j7785j8469l326o548l377J0069q6
3688d0256M989o083P766M937L34Q915K41J1527J0148n423l93K7839j0291j1394
3674B856n408j702Q00j6628O545J5833J399J0568j3759l377R757J5715K971j1071
3660A4499k747n213j509l725j4461m34J5731j3554j7274K5612J5871j287j053
3647A0456J946q546o050j5986o484K0870K1216O323K25q188j3530o310J3704J1969
3633B1615k4512l6682j4512L251Q946J8872J8754Q574P179p178j7299n620J0101
3620h511n99J1910K2094N960K1679O365J534j8702l4118o612o976J0941N024j461
3606H528j2002m030m000o709M150j3383j299J1317m497q741K0909m233r704P420
$$ y = [6667, 17911, 13327, 16059, 15226, 11071, 9843, -734, -18519, -36988, -40314, -46862, -50239, -40170, -40256, -35267, -41350, -33584, -28647, -28313, -19398, -19157, -7630, 2518, -2905, -3298, 24541, 14250, 2856, -2552, -4254, -3454, -20082, -13537, 2296, 3695, 14263, 504, -2873, 6884, 22599, 25570, 14499, 11752, 6539, 5030, 1305, -13156, -13590, 2141, -11413, -28687, -3075, 12796, 11509, 10456, 12402, 3856, -2194, -18180, -24664, -3794, 17422, 23745, 23970, 15782, 2252, -4058, 9646, 21615, -2897, -39579, -54091, -50840, -41894, -23022, -4268, 4306, 11485, 4307, -12992, -18612, -8511, -9110, 2800, 24894, 30854, 52533, 58898, 60432, 41730, 7612, 1000, -5976, 4965, 9989, 8528, -3474, -7504, -11504, -18213, -14063, -27446, -28745, -17428, -21925, -30666, -9757, -13990, -23694, -16274]
3592a6274J6804P654K643j5912r571n746J418K2097n387J0334r963p68J0914j0922
3578b679o370L705n144J4727J1159M293j2998J951J193j4087p995l023O972K1854
3564A3558j254j2532j5703j1662J3049J2188j1581m422P561L455Q034M556Q831
3551A4078q687k0347k172o045r173J4870J0983J2913L641J4095J1711n594L73
3538C0646P480r236k1068r733M623j4223J1785J4771l779j3730r795j2497K0220
3525d536L892N876j3428O358M335j2193j1644K2922m992k2860j0480q503L668
3512d1585j1398N627J5508k557R687Q48j0874j4927J6451K7461J2263J8618P788
3499C2910j2581j2848P573j4675j8032j441n092K295q854j1525J5745K7234N532
$$ y = [-16274, 530, 8184, 10827, -5085, -14656, -20402, -18984, 3113, -2274, 8060, -1903, -2671, 8243, -2679, -9049, -5344, -10488, 4239, 15398, 19691, 6693, 8644, 9837, -4250, -12245, -15268, -8296, 13558, 12304, -228, -15931, -27593, -14544, -2356, -13937, -18359, -10798, -7343, 691, 5247, 14078, 5391, -14956, -17128, -23173, -32346, -17476, -6493, 6420, 10061, 24156, 35867, 30273, 30646, 38126, 28890, 7822, -1911, 2712, -11511, 274, 15045, 11266, -2464, -12259, -24756, -4536, -644, 5232, -8196, -1838, 2497, -9696, -21340, 1582, -3410, -26270, -36750, -45253, -41585, -52983, -47356, -31848, -34405, -24718, -23870, -34744, -49671, -33220, -5759, 6504, 25122, 32910, 20329, 7481, 15054, 379, -17653, -19094, -24186, -21891, -30745, -42270, -26525, 709, 6241]
3486F241j9600j8784k847M35K0422P870o292Q415q822j8253q254J5444O657m814
3472b2182P614k01J0752M742n202k416k246R292J7208K085J1366k2169j8779K0864
3458A0728J5110k0428o996J6123K1243O241j4464k4661j3022m989K5272J1028
3446B1185J724r755l940n36J989j7689j3411J1111J1222J127J2191J579j3634
3433C163j0297O541J214M458R419K190k296p985j7150j6771J5830J0381J4743
3420A3440J573j9581l0530R681K3664k567m209J0195j5271l3339J0241Q488r531
3407c7746R803M112o978Q739Q758P800m875m919J0562p587L85q460L511R518K353
3392e024J142J5128r982j7850J7400k442n106R210j1454O339N699O488L148j3931
$$ y = [6241, -13359, -32143, -34990, -34555, -14133, -6263, -12555, -4140, -12962, -31215, -39469, -24025, -17368, -22182, -14568, -14769, -4017, 725, -4477, -6893, -9139, 153, 17361, 19446, 30812, 8643, -10136, 10728, 25838, 5410, -1586, 14537, 35780, 42021, 27557, 2896, -10126, -15115, 10157, 21185, 22909, 13154, 9214, 8678, 10667, -7022, -20433, -9322, 1900, 3027, 15218, 16797, 3163, -7134, -593, 621, 5079, 14498, 16688, 14392, 6407, -10743, -27514, -11684, -1303, 13440, 15013, -4568, -35098, -25417, -1753, -4320, -8529, 1666, -13605, -46944, -36703, -28215, -37746, -27943, -23831, -30809, -22070, -13312, -5512, -10387, -15306, -4744, -12331, -11946, -20406, -16895, -7377, -5024, -3882, 11246, 1264, -16586, 814, -1628, -6734, 2476, -8978, -2639, 3060, 9548, 12696, -1235]
3378a235j6896j0948J138K2129N666J4731l07r590m180j513n230K053L550m013
3364d645o813L375J2506K561J0825j8231j8407N621L008m742J00J2582m5j526
3350c831j2138K1686P528J0829m140j8895j7006o931p847R657R204p801M767p253
3336b2171o968J0646n076n521R017P029J3250P407L369j0156J1177o747j6655
3323a1399l388j2022l404K392r43Q299N41K2167J4923l0940j8704j6845l471P249
3309d5545J8931K7973l361l731J4117J764j2156o786n321l953r202p74J1585K6623
3295A0164J9179m049j0738K6j4433q844j5858K2962r31j1494J2684j2858R260
3282d930J7148K1127j5437j9312k44j6842K291L552J5151N463k5312K569L4593
$$ y = [-1235, -18131, -29079, -27941, -5812, -146, 14585, 14278, 4688, 508, -1005, -6235, -4182, -632, -4645, -11458, -8083, 4423, 6984, 17809, -422, -18829, -13208, -10200, -14942, -14842, -2260, -2305, -3831, -15969, 5717, 13245, 24074, 19934, 1039, -15967, -22898, -30745, -21088, -11884, -19685, -14918, -22171, -29139, -18493, -23569, -29090, -20073, -13044, 206, 7613, 10982, 826, 12003, 5256, -11399, -14787, -26809, -30213, -27821, -28764, -20465, -19924, 2243, 17166, -13774, -32478, -49323, -52794, -45545, -26614, 1359, -2002, -5733, 8384, 10148, -2008, -8794, -14115, -18068, -27270, -28044, -16459, 10164, 29343, 25294, 14556, 14582, 149, -8695, -24553, -1591, -2522, -14016, -1332, -14190, -4930, 12218, 33345, 17908, -1404, -1648, -18490, -16199, -12647, 2504, 7967, -17345, -14776, 19817]
3269A9817j64j0679o015q47r027n232o951O696j4151q305L707J2142k337K030
3255a9316J2351L398J945p989n272P997O631J1286L174o840J731L289R537m582
3241A7340j5127l546R092j815J6060p172k3108o980k846k989L73j5072J906J3796
3227b0088K6075K9049K206j2961J0684k858k9441r23P221J876j2264j4543M803
3214a1164J4840R780k34o027l421O877K23l078J0771k5541l0705k245o913M349
3200d2488J5369Q103L108J4188l827j5703N53J121J4976P895O677k0672l377N193
3186h884p482j385K754R777P495j980j9949k6870q887J8828K5912M934m121J1280
3172A422O475j336j69J95m121r395o355M198J7259N121M56j8472j7891k738J2438
$$ y = [19817, 19653, 8974, 2959, 2112, -6915, -12147, -19098, -12402, -26553, -34858, -31151, -19009, -21346, -19316, -6965, -3567, -1622, -9611, -14883, -6886, -255, 11031, 14205, 7365, 9096, 12385, 21922, 17340, 2213, -1333, 7759, 5944, 22004, 14832, -8276, -15256, -18102, -21091, -20718, -35790, -33884, -20088, 5987, 35036, 37242, 24281, 34965, 32107, 2666, 1743, 8964, 10840, -1424, -15967, -11164, 3676, 13456, 13222, 7195, 3774, 10651, 10874, 7796, 18567, -6974, -37679, -39924, -46837, -42488, -27119, -19016, -15908, -1720, -5547, -21250, -20697, -19576, -4600, 3295, 9972, -10700, -14077, -8884, -16366, -17751, -14997, -5220, 2275, 295, -19654, -46524, -55411, -36583, -10671, -5737, -9858, 1422, 7897, 6561, 6392, 6587, 2466, -6929, -13284, -9086, 8173, 13294, 13750, -4722, -22613, -25351, -12913]
3157a2913N851j613m295J425p298m299J2189K5466p607J645o595o892K827J871
3143b38k833j4875j456Q002N998q787M031J1260N42o966N310K0649j6628p564
3129c555l148j5058p153n673O486J4168N524j26Q333K0413J3293k8553R642K1737
3115C6330p855j7846j1608M004l507k975P130K46m993l741j2680k218j6783K0794
3101a5702K4636K150J594j2932k3417Q198K4458l38L067j7503Q85n81R334J9053
3087B2902o502k098p255k2814m255J1227O519P047J852n97L303M807O567r735
3073A0968j7366n110P105J539j4280P690O980k2050k7536l721J0569K0462J7286
3060g464P055p150j644k1108j6428J2792O950p210J259Q792Q952R934r085k100
$$ y = [-12913, -7062, -8675, -12970, -11545, -18843, -23142, -10953, 14513, 6906, 8551, 1956, -4936, -2109, -238, -3071, -17946, -19402, -11400, -5402, -14189, -10158, 1102, 1644, -5322, -12, 20637, 4009, -3555, -6703, -21761, -28914, -34587, -28101, -13933, -8409, -8535, -202, 20211, 33504, 4951, 14593, 36330, 28475, 10629, -979, 3025, -482, -3457, 3673, 3919, -1074, -4815, -17495, -19713, -36496, -15702, 8934, 11084, 12678, -254, -23671, -15473, 8985, 8647, 11714, -5789, -4904, -5485, 3849, 22902, 16400, 14302, 7047, -15767, -20022, -8795, -2276, 4771, 6623, 6026, 9329, 14136, 20703, 10968, -6398, -11508, -4403, -2864, -17144, -9454, -2474, -24524, -52060, -55781, -45212, -24750, -7464, -409, -7559, -9203, -30311, -46739, -33947, -26997, -34207, -32948, -24156, -15204, -5270, -14355, -16455]
3046a6455K518M837K569l442o92M688J9316j1992q627j956J5540J2821L153L202
3032B5480l420m623n751k0855k0952O509N699K448k853n679n085L182M320O213
3018a5367j2475r214L866P989Q714K220n971Q00n460K439N176J4033l131k0640
3004b7021l052J132J4435Q424r438m266j0392N466J7058J1553J0656j1770r123
2991f338J392n323K198K310j997Q618j3524J4189l454L047L840l914k984m239
2977f179q51l72J7522o231j3965L524J2425j573r195K328p810j924P475l807M490
2962d143l408m869J5183J057P382P797k1202j9390n07r975K8438J5314o388o203
2948i14j6241P353j037j0780j4839n70J0516J2791J9358r505L576J6614j20j7178
$$ y = [-16455, -13937, -9100, -6531, -9973, -10665, -5977, 13339, 1347, -7280, -9236, 6304, 19125, 22278, 25480, 22060, 17437, 11686, -9169, -30121, -23612, -17913, -15465, -18318, -23997, -29082, -25900, -21580, -15367, -27842, -37056, -33190, -25201, -16487, -14267, -20238, -19438, -24898, -22459, -17283, -3250, -6381, -27021, -30073, -28941, -14506, -6082, -15520, -19786, -30178, -24712, -7654, 3899, 14555, 2785, -6338, -4946, -10269, -8071, -5761, -7758, 860, -12664, 1525, -1929, 1118, 4958, 1044, -1940, -6179, -7030, -7402, 10120, 3889, -10076, -6552, 5873, 4300, -4895, -2567, -10377, -12301, -4826, -8633, -4143, -7551, -12420, 2763, 3820, 11202, 18999, -2203, -21593, -22100, -32075, -3637, 11677, 5289, -914, -17155, -9802, -10839, -21619, -36458, -37028, -26512, -13721, 5637, -3868, -292, 16322, 16202, -976]
2934i76L36j0050O659K1145o5r877O272q509k5362l40j72r233Q117K1370J582
2919H97r120p101n487J1675J0687K133M662j3569j341M114k0140J175J7984R76
2905b455j301p097q703r187J0192J6861M000k155p48P568m496o024N972j857k862
2890b292J0426L955J2667l518J735p493j4272j5794P83J2867q20N204j5616j8984
2876c1152o690J6549L314K1826J5327P13R898L436l283p929j6968N54q233j0065
2862a2703j3919j673J8607M669j309J0620J1984o039J250J771j3972q264J932
2849g046J4158p925M238j0017k635j7399N450K7509q973j5545J867k704j671p354
2835b8047n74M766J3296K787N308J6723n570j8369J1780J6895p455m365J5934
$$ y = [-976, -640, -10690, -4031, 17114, 17049, 7172, 13444, 4935, -20427, -20767, -20939, -30172, -22055, -685, 897, -8223, -15324, -20811, -9136, 1551, 3684, 8346, -5223, -6564, -2450, -22590, -21415, -3431, -2455, -3756, -10853, -19556, -28743, -18551, -1690, 2310, 155, -593, 6975, 2479, -3545, 2427, 570, -2292, 8134, 12089, 24756, 21238, 22973, 15480, 1208, -14586, -13803, -936, -1756, 3448, -12168, -31152, -37842, -21293, -17979, 3847, 19174, 19887, 29785, 33221, 29938, 22009, 5041, 5595, -2638, -12703, -26622, -28295, -9688, -5019, -6328, 4292, 16276, 10237, 11487, 13258, -714, -8978, -7046, 7112, -813, 3425, -6592, -9227, -26626, -21176, 6333, -2640, -18185, -16318, -19022, -20693, -28047, -28621, -23855, -10559, -7772, -2464, 14259, 8689, -9680, 2100, 18995, 11540, 7175, 23109]
2822B3109j722p133j9854m316J6343K5432j0302k3447r468J2948J0854j6162j0255
2809a3973o460Q248K00P730R147k9239j8930R639R484J8354J7350J0266m325k2845
2795e354J0137k431n867j0806p805J1368J3375l314l076J1384K673j2178k705
2782d599r453o472O739J7110O963O36R7m142j0858j4284J4416o728k2236K4087
2768h724j908j4832q319k380j3241r45N597j07K8753Q705r728L43J2397P882K113
2753E606K5J839j9196P425J01r483j070J8463q48j5242J1164j06k279q878J2295
2738a84J9710j470N796P975K646l0191j8735j0089M654J776J30J344J0186j4759
2724b1211J8999J3406k4702j8778K1620J8531q933k7868l064K1144r260k1376
$$ y = [23109, 21387, 14254, -5600, -9916, 6427, 31859, 21557, -1890, -11358, 1590, 12444, -3718, -13973, -20433, -12185, -11985, -4255, 4892, -24347, -43277, -33638, -24154, -5800, 11550, 21816, 17491, -5354, 4783, 2352, -3515, -14321, -22126, -10758, 2617, -697, -3773, 7611, 10284, -1894, -4599, -14052, -20524, -13785, 3325, 10288, 10924, 11021, 6879, -3979, -18263, -3847, -10575, -32811, -8724, -10632, -25464, -33783, -36163, -49404, -50349, -44752, -44859, -16106, -7401, -17129, -16786, -4389, 3493, 5606, 5631, 7470, -11726, -4301, -4200, -13683, -14753, 3710, 2862, -12380, -1216, -1322, -3601, -12479, -184, 19526, 18056, 23852, 31827, 34473, 4282, -14453, -24542, -19888, -18112, -17982, -16638, -6452, -21211, -2212, 11194, -13508, -32286, -10666, 7865, -1068, -28936, -32000, -10856, -20116, -41492]
2712d1492Q805L5069J2088n166j5612j2321k088j497K5394j827J942K68p117r868
2698a3422q04M607J3304r64j5214r838j0098j607j2369J1586K4841J0204j2354
2685a2128k3804J829K359J1004Q471J735P714J4015Q206k5520k68J4000l455j5699
2671a1541k6887k372P754J8840R988j0011l387J8168L978K2116P745k2398j4186
2658b193N424j284p341J165L710P611j435j0619r49n708r899n851J3412J1706
2644b251M768l545l33J2380j0517p360K6525J5207j7494j1718R057Q179j1111
2631A1787r500j2158M407L144k2977q03J6781J861o777O123o441n014J0492l461
2617a2536j6068P669K1792q770n68Q891P130N160j2922k8225j756J4104O436J1584
$$ y = [-41492, -32687, 2382, 14470, 9304, -6308, -18629, -20717, -22214, 3180, 1353, 3295, 3563, -3554, -13422, -14226, -9619, 3685, 2721, -12493, -22331, -32429, -34036, -46405, -34819, -9978, 226, -12128, -35932, -34103, -31744, -20740, -12269, -10534, -2820, 11195, 19401, -6119, -6387, 7613, 4158, -11541, -38428, -40800, -33046, -14206, -4218, -14229, -17616, 552, 4530, 26646, 34391, 11993, -2193, 3231, 1947, -5394, -4229, -519, 7092, 5657, -4962, -5911, -11619, -21518, -27369, -13957, -2251, 2517, -1028, -1361, 11019, 502, -6858, 19667, 34874, 17380, 5662, 14719, 22898, 11787, 2287, -9871, -5464, -2320, -25297, -26100, -9319, -7458, -14235, -8112, -14553, -19567, -9075, -12536, -28604, -20935, 857, -7913, -8481, 410, 7540, 12700, -222, -28447, -30203, -16099, -9663, 1921]
2603A921J1109j2333K862o786O477K1964r305j9049L33M896N919l375M444K091
2589A1168J611L429q351m603L867j4208J8655J2493l361k4558J3698K6027p007
2576B8860p095m231j2884l941M340J1657J284j6393O583J1195j251k402j1757
2563C965k570J687k0291j5442M407J0243l320P714J1844J2823k085j462j625r009
2549c121q598o862J2677K6562k2952n055J4398p997O740k0462m736J8313P008
2536E915k261n697p566m030j2038l956j639J923j772Q836l64L14Q032L051J6039
2521D787j2846k4169R815J9544O876j445L748K533K658j166l871o497q18L15p602
2506h138q467J1400o414k134q318j293M536P973q551R206J555K857J0056q310
$$ y = [1921, 13030, 697, 3559, -3227, 3250, 25214, 15909, -3140, -2807, 2089, 8008, 4633, 9077, 11168, 12779, 16208, 7857, 3254, 7121, -7087, 11568, 24061, 20700, -3858, 9840, 35867, 28860, 21765, 17534, 4650, 709, 5049, 16706, 17990, 1597, 8180, 19375, 18124, 15722, 3965, 1395, 3082, -17209, -32651, -28244, -18001, -21321, -13607, -1763, 11060, 8975, 7513, 5888, -3121, -11719, -18581, -5904, 20658, -2294, -7349, 7049, -948, 5792, -14670, -19406, -1093, 5915, 3654, -2043, -9609, -13639, -25677, -29633, -31272, -29349, -31121, -22285, -22649, -22335, -14303, -11252, 4787, -8059, -32228, -22413, -2869, 4007, 2562, 6310, 8843, 11501, 10335, 6464, -33, -851, -536, -8138, -16605, -5205, -11619, -13753, -22071, -23364, -18828, -10855, -19406, -10200, -8645, -5788, 4268, -4042]
2492d042P15J3052j1225N12Q671J5096r485j6418j0158O935o111j0068R243K8562
2478A5279J4243j105j5360L702N967j0989O009M917j8666K674P052l455M739j1516
2464C491J3000L656j0419j3079o824O152N533J2528l259R398l019K100o4k0752
2450a558J822o45n187p815l748l638J6382P602k972L705m5P121Q028O880J0269
2435C6201r275O921j4299j1395j9278j6396o891K574J963J3574K971j0660N547
2422a8443K3194j3493j2453o433J9804K0618K198k2474q461K591o041N915Q839
2409d639J5259O502L346k9015j1005J6344J2980j1659j2494j1317k976L0237J2739
2396A4302N289n228L608j3079n029o448j3379l777J2555J7273L5096j851l9337
$$ y = [-4042, -3327, 9725, -1500, -988, 7683, 22779, 13294, -3124, -13282, -6347, -12458, -22526, -13283, 15279, 29522, 28417, 13057, 16759, 22726, 11737, 17746, 22663, 3997, 6671, 13723, 10268, 15007, 3491, 16491, 20147, 9728, -3351, -10175, -4023, 1510, 14038, 10779, 20177, 17158, 19258, 19194, -1558, 264, -381, -5568, -13383, -17131, -20769, -4387, 3215, 243, 3948, 3903, 11024, 19052, 25932, 36201, 26926, 33847, 19548, 8153, -11125, -27521, -34412, -31838, -29875, -16301, -13330, -23990, -18443, 4751, -8742, -21195, -27628, -7824, 12794, 14992, -7482, -15943, -13352, -19393, -13478, -4639, 10620, 17122, 20468, -8547, -19552, -3208, 9772, -1887, -14381, -25698, -28674, 1563, 14302, 19591, 14363, 17971, 4892, -137, -6585, -19964, -23741, -11186, 6087, 41183, 39332, -5]
2383eK165J0278j1386M528J1559o421l903m938J6553m191l434k3275k4020O350
2369c0140J7727J2121J5925k022r340J0287j3785m579K299o817J2832n982M195
2356B721J3567k3760k4998O573K2081K2918n366o249j0316k981j3122K374m067
2343b0625K997K0972P935j0796L98N949j2497o495J0392J597k3066l365Q716J6237
2329a651j497p146J9393J4824j0672j4869q967R631r076p097J9777m245j5640
2316a7235R650N227Q238j1118q650j118J3686m376j2066K919J2238j767O422K727
2302D777N515l084j5772P805J4659j4616k8346P490J6329J74j7338J4802R863
$$ y = [-5, 2160, 12438, 1052, 5580, 17139, 10718, 6815, 1877, 18430, 14239, 10805, -12470, -36490, -30140, -12413, -292, 15633, 13611, 4271, 14558, 773, -3806, -1507, -8324, 4508, -1474, 2721, 16288, -7472, -32470, -25897, -3816, 19102, 13736, 7487, -2829, -5810, -18932, -16558, -20625, -17628, 3344, 11279, 483, 881, 6830, -5667, -12162, -1770, -173, -23239, -26604, -17888, -1651, -3148, -10294, 9099, 23923, 13251, -1618, -10585, -954, -10030, -17127, 2650, -1595, -17235, -7585, -2358, 5880, -5238, -13888, -15006, -1320, -5696, -17762, -14843, -2605, -4372, 2050, 4777, 10292, 7208, -8564, -759, 13900, -716, -29062, -21572, -5243, -5069, -22407, -7605, 2258]
$$ [...]
##END NTUPLES=NMR SPECTRUM
##END=
