##TITLE=Analysis number 330113
Compound Code cc 27202
Book Reference lab3
Project Code adrs
Chemist Name stores
##JCAMPDX= 6.0         $$ Bruker NMR JCAMP-DX V2.0
##DATA TYPE= NMR SPECTRUM
##DATA CLASS= NTUPLES
##ORIGIN= Bruker BioSpin GmbH
##OWNER= nmr
$$ XWIN-NMR		Version 3.5
$$ Mon Oct 29 11:23:06 2007 GMT Standard Time (UT+0h)  MAYBRIDGE\nmr@NMR_250MHZ
##.OBSERVE FREQUENCY= 250.131544655141
##.OBSERVE NUCLEUS= ^1H
##.ACQUISITION MODE= SIMULTANEOUS (DQD)
##.ACQUISITION SCHEME= undefined
##.AVERAGES= 16
##.DIGITISER RES= 18
##SPECTROMETER/DATA SYSTEM= dpx250
##.PULSE SEQUENCE= zg30
##.SOLVENT NAME= CDCl3
##.SHIFT REFERENCE= (INTERNAL, CDCl3, 0, 16.4257)
##AUDIT TRAIL= $$ (NUMBER, WHEN, WHO, WHERE, WHAT)
$$ ##TITLE= Audit trail, XWIN-NMR		Version 3.5
$$ ##JCAMPDX= 5.01
$$ ##ORIGIN= Bruker BioSpin GmbH
$$ ##OWNER= nmr
$$ C:\u/data/dgb/nmr/ADRS/1490/pdata/1/auditp.txt
$$ ##AUDIT TRAIL=  $$ (NUMBER, WHEN, WHO, WHERE, WHAT)
(   1,<2007-10-29 11:22:26.97 +000>,<MAYBRIDGE\nmr>,<NMR_250MHZ>,
      <created by zg, POWCHK disabled, PULCHK disabled
       configuration hash MD5:
       76 6E 9A 78 1E 09 19 81 EC 84 63 8F B0 6A 59 2D
       data hash MD5: 64K
       E5 EC EB 7A 36 33 0E B8 DE AD 9D 4E A4 1F CF 5A>)
(   2,<2007-10-29 11:22:53.17 +000>,<MAYBRIDGE\nmr>,<NMR_250MHZ>,
      <Start of raw data processing
       ef LB = 0.3 FT_mod = 6 PKNL = 1 SI = 32K 
       data hash MD5: 32K
       8F 0A 86 47 80 5A 1F 1E FF 86 B2 A4 20 11 32 18>)
(   3,<2007-10-29 11:22:55.37 +000>,<MAYBRIDGE\nmr>,<NMR_250MHZ>,
      <apk 
       data hash MD5: 32K
       0A 1D F2 B7 91 B8 ED 03 C9 85 4E 8A D2 F0 EE 5C>)
(   4,<2007-10-29 11:22:56.25 +000>,<MAYBRIDGE\nmr>,<NMR_250MHZ>,
      <abs ABSG = 5 
       data hash MD5: 32K
       7E AE F3 66 46 87 70 7E 3E D5 80 35 C3 66 7E 43>)
$$ ##END=
$$ 
$$ hash MD5
$$ 63 7B 6D 46 F3 B6 67 87 17 37 9D 6B 95 01 38 93
##$RELAX= 
##$RELAX= 
##$RELAX= 
##$RELAX= 
##$RELAX= 
##$RELAX= 
##$RELAX= 
$$ Bruker specific parameters
$$ --------------------------
##$DU= <C:\u>
##$EXPNO= 1490
##$NAME= <ADRS>
##$PROCNO= 1
##$TYPE= <nmr>
##$USER= <dgb>
##$AMP= (0..31)
100 100 100 100 100 100 100 100 100 100 100 100 100 100 100 100 100 100 
100 100 100 100 100 100 100 100 100 100 100 100 100 100 
##$AQSEQ= 0
##$AQ_mod= 3
##$AUNM= <au_zg>
##$AUTOPOS= <18 >
##$BF1= 250.13
##$BF2= 250.13
##$BF3= 250.13
##$BF4= 250.13
##$BF5= 500.13
##$BF6= 500.13
##$BF7= 500.13
##$BF8= 500.13
##$BYTORDA= 1
##$CFDGTYP= 0
##$CFRGTYP= 5
##$CHEMSTR= <none>
##$CNST= (0..31)
1 1 145 1 1 1 1 1 1 1 1 1 1 1 1 1 1 1 1 1 1 1 1 1 1 1 1 1 1 1 1 1 
##$CPDPRG= <>
##$CPDPRG1= <>
##$CPDPRG2= <>
##$CPDPRG3= <>
##$CPDPRG4= <mlev>
##$CPDPRG5= <mlev>
##$CPDPRG6= <mlev>
##$CPDPRG7= <mlev>
##$CPDPRG8= <mlev>
##$CPDPRGB= <>
##$CPDPRGT= <>
##$D= (0..31)
0 1 0 0 0 0 0 0 0 0.06 0 0 0 0 0 0 0.0002 0 0 0 0 0 0 0 0 0 0 0 0 0 0 
0 
##$DATE= 1193656942
##$DBL= (0..7)
120 120 120 120 120 120 120 120 
##$DBP= (0..7)
150 150 150 150 150 150 150 150 
##$DBP07= 0
##$DBPNAM0= <>
##$DBPNAM1= <>
$$ [...]
##$SUBNAM7= <"">
##$SUBNAM8= <"">
##$SUBNAM9= <"">
##$SW= 20.6930455092707
##$SWIBOX= (0..15)
0 0 3 0 0 0 0 0 0 0 0 0 0 0 0 0 
##$SW_h= 5175.983436853
##$TD= 65536
##$TD0= 1
##$TE= 295.16
##$TE2= 300
##$TE3= 300
##$TEG= 300
##$TL= (0..7)
0 120 120 120 120 120 120 120 
##$TP= (0..7)
150 150 150 150 150 150 150 150 
##$TP07= 0
##$TPNAME0= <>
##$TPNAME1= <>
##$TPNAME2= <>
##$TPNAME3= <>
##$TPNAME4= <>
##$TPNAME5= <>
##$TPNAME6= <>
##$TPNAME7= <>
##$TPOAL= (0..7)
0.5 0.5 0.5 0.5 0.5 0.5 0.5 0.5 
##$TPOFFS= (0..7)
0 0 0 0 0 0 0 0 
##$TUNHIN= 0
##$TUNHOUT= 0
##$TUNXOUT= 0
##$USERA1= <user>
##$USERA2= <user>
##$USERA3= <user>
##$USERA4= <user>
##$USERA5= <user>
##$V9= 5
##$VALIST= <valist>
##$VCLIST= <CCCCCCCCCCCCCCC>
##$VD= 0
##$VDLIST= <DDDDDDDDDDDDDDD>
##$VPLIST= <PPPPPPPPPPPPPPP>
##$VTLIST= <TTTTTTTTTTTTTTT>
##$WBST= 1024
##$WBSW= 4
##$XGAIN= (0..3)
0 0 0 0 
##$XL= 0
##$YL= 0
##$YMAX_a= 707132
##$YMIN_a= -640855
##$ZGOPTNS= <>
##$ZL1= 120
##$ZL2= 120
##$ZL3= 120
##$ZL4= 120
##$ABSF1= 16.42567
##$ABSF2= -4.2675
##$ABSG= 5
##$ABSL= 3
##$ALPHA= 0
##$AQORDER= 0
##$ASSFAC= 0
##$ASSFACI= 0
##$ASSFACX= 0
##$ASSWID= 0
##$AUNMP= <proc_1d>
##$AZFE= 0.1
##$AZFW= 0.1
##$BCFW= 0
##$BC_mod= 0
##$BYTORDP= 0
##$COROFFS= 0
##$CY= 12.5
##$DATMOD= 1
##$DC= 0
##$DFILT= <>
##$DTYPP= 0
##$F1P= 14.0000005364418
##$F2P= -0.99999901652339
##$FCOR= 0.5
##$FTSIZE= 32768
##$FT_mod= 6
##$GAMMA= 0
##$GB= 0
##$INTBC= 1
##$INTSCL= 1
##$ISEN= 128
##$LB= 0.3
##$LEV0= 0
##$LPBIN= 0
##$MAXI= 10000
##$MC2= 0
##$MEAN= 0
##$ME_mod= 0
##$MI= 0
##$NCOEF= 0
##$NC_proc= -1
##$NLEV= 6
##$NOISF1= 0
##$NOISF2= 0
##$NSP= 0
##$NTH_PI= 0
##$NZP= 0
##$OFFSET= 16.42567
##$PC= 1
##$PHC0= 156.9817
##$PHC1= 5.515935
##$PH_mod= 1
##$PKNL= yes
##$PPARMOD= 0
##$PSCAL= 4
##$PSIGN= 0
##$REVERSE= no
##$SF= 250.130024093336
##$SI= 32768
##$SIGF1= 0
##$SIGF2= 0
##$SINO= 400
##$SIOLD= 32768
##$SREGLST= <1H.CDCl3>
##$SSB= 0
##$STSI= 32768
##$STSR= 0
##$SW_p= 5175.98343685301
##$SYMM= 0
##$S_DEV= 0
##$TDeff= 65536
##$TDoff= 0
##$TI= <Analysis number 999999
Compound Code 99
Book Reference 9
Project Code 9>
##$TILT= no
##$TM1= 0
##$TM2= 0
##$TOPLEV= 0
##$USERP1= <user>
##$USERP2= <user>
##$USERP3= <user>
##$USERP4= <user>
##$USERP5= <user>
##$WDW= 1
##$XDIM= 32768
##$YMAX_p= 350459145
##$YMIN_p= -14532
$$ End of Bruker specific parameters
$$ ---------------------------------
##NTUPLES= NMR SPECTRUM
##VAR_NAME=  FREQUENCY,     SPECTRUM/REAL,   SPECTRUM/IMAG
##SYMBOL=    X,             R,               I
##VAR_TYPE=  INDEPENDENT,   DEPENDENT,       DEPENDENT
##VAR_FORM=  AFFN,          ASDF,            ASDF
##VAR_DIM=   32768,         32768,           32768
##UNITS=     HZ,            ARBITRARY UNITS, ARBITRARY UNITS
##FACTOR=    0.157963299565203, 1,           1
##FIRST=     4108.55338887512, 0,            0
##LAST=      -1067.43004797789, 0,           0
##MIN=       -1067.43004797789, -14532,      0
##MAX=       4108.55338887512, 350459145,    0
$$ Real data points
##PAGE= N=1
##DATA TABLE= (X++(R..R)), XYDATA
$$ [...]
20561 -5984 -5088 -4955 -8059 -8572 -10211 -11447 -11827 -9546 -8226 -8015 -7787 -7102 -4635 -1280 -25 2357
20545 2357 247 -2870 -6345 -4395 -3649 -555 1141 2347 -1160 -4422 -4543 -5931 -7283 -6508 -5607 -7533
20529 -7533 -6000 -3753 -1425 -1384 -2588 -4513 -2840 -3849 -2549 -3769 -4604 -1303 -2677 -1931 -1113 -2311
20513 -2311 -2304 -4562 -4058 -5454 -5722 -5218 -2692 -483 410 1731 2116 -275 -4511 -4388 -3570 -1898 -3051
20496 -3051 -1106 -1074 -1185 -6923 -4283 -698 530 1354 2354 1724 -2179 -2548 -3260 -1742 920 2058
20480 2058 297 160 -1336 -710 618 2643 2683 171 -3007 693 5835 3567 3433 1225 -1209 -297
20464 -297 -2168 -2136 1012 -1364 -1199 -1670 -3687 -1682 -717 -1246 -2731 -2330 437 699 -636 717 3034
20447 3034 920 -2033 -2000 -3993 -3350 -1440 -702 -1625 -387 -935 1494 5312 5301 6852 6202 2053 -823
20430 -823 138 -652 450 2246 3084 3417 811 -2193 -1562 -2000 -1377 -1584 -3152 -1359 1161 932 71
20413 71 -2121 -1951 -2278 -2264 -2293 -2026 -2111 -2217 957 2955 231 -2621 -4193 -4871 -1076 2272 235 -2986
20395 -2986 -2658 -1497 -1214 -4341 -2985 -2279 -1171 1204 1348 -284 -2072 -1221 -1170 -15 4168 3275 -6671
20378 -6671 -12087 -12086 -7695 -6720 -6806 -5113 -2206 -2203 -2115 -4872 -3545 -1107 -737 -5870 -9041 -10703 -11775 -10321
20360 -10321 -6340 -3218 -5058 -4028 -1095 -1328 -2838 -3943 -4099 -3831 -1675 -2946 -5151 -8693 -8174
20345 -8174 -3915 -2239 -3176 -6107 -9135 -10540 -7561 -5265 -4889 -5690 -2887 -2152 -4654 -6639 -8773 -6039
20329 -6039 -4682 -6774 -6653 -4081 -1241 -2953 -6335 -9674 -11603 -7132 -6470 -4645 -4796 825 1374 -764
20313 -764 -207 -1492 -2477 -3911 -2185 -3731 -4825 -2222 -1782 -2234 -3069 -3804 -3900 -2729 -4144 -5726 -7418
20296 -7418 -8088 -7682 -4241 -2983 -4469 -4499 -5582 -5258 -4263 -2915 -298 -621 -466 -1930 -5323 -3854 -4190
20279 -4190 -1667 652 2346 1131 -3977 -5865 -5720 -6482 -5520 -2098 -1611 -5196 -9135 -6382 -6266 -8543
20263 -8543 -9099 -4891 -2138 127 -2156 -1327 -1338 -2806 -2478 -4953 -3462 -882 443 -2277 -2347 -3876
20247 -3876 -4068 -5240 -4004 -2361 1427 -1230 -4448 -6795 -4325 -1298 -1925 -2393 -3751 -1467 -964 -491
20231 -491 -2901 -6837 -6796 -1576 1018 1477 1686 -923 -3148 -3019 -994 626 2364 2502 3006 2123 -282
20214 -282 405 3193 1193 -4619 -7483 -8753 -5642 -2255 -1799 -1885 -2490 -2600 1066 1013 -990 -45 -1311
20197 -1311 -5160 -2185 -158 -491 -3346 -4803 -4887 -4056 -5393 -5402 -3546 763 -1598 -664 -1288 -5002 -7798
20180 -7798 -7396 -9267 -9227 -8296 -6722 -4119 -1436 -898 -2036 -1651 459 -1820 -2245 -2607 -589 -4035 -5823
20163 -5823 -4728 -2559 -1516 230 1238 1240 540 413 -755 -981 182 353 -845 -5027 -2997 -1955
20147 -1955 -3421 -5360 -7534 -6802 -3766 1508 -628 -5658 -7075 -7238 -2486 -373 3679 -770 -1065
20132 -1065 -164 -4428 -5763 -5520 -3471 -2803 -3449 -4466 -2846 -2365 -1683 -3335 -3453 -2850 -3284 -4732 -4434
20115 -4434 499 -426 -504 -3974 -4281 -4482 -5011 -725 3371 -420 -2059 -2529 -1987 -1301 -2817 -6158 -5582
20098 -5582 -6706 -3568 -3622 -4823 -5525 -7499 -8381 -8438 -10724 -10926 -6242 -2894 1141 4718 4924 4023 3232
20081 3232 -308 -418 -2588 -1262 -893 -3975 -2916 1363 4186 1855 2824 -280 -4679 -2513 -1002
20066 -1002 -2339 -1566 444 -384 -3003 -207 -1310 -1162 2093 3313 1038 1116 3486 5319 3770 1113
20050 1113 899 1238 3664 1773 -2198 -4914 -6419 -5273 -3474 414 2906 2272 -65 -1599 -926 2238
20034 2238 2763 -1275 -2588 -1648 1599 -56 -2451 1043 2060 136 -2762 -4694 -5468 -6008 -4502 -2124
20018 -2124 924 -468 -2463 -5505 -6061 -6457 -2786 -2833 -2961 -2653 -263 -1217 -3368 -119 32 -1077 -559
20001 -559 964 850 1510 1771 882 320 929 -1931 -4276 -980 -1102 251 1513 3514 1583 -1904 1327
19984 1327 1409 -242 -2428 -4289 -2306 -564 628 184 1763 -1311 -3186 -3377 -159 3211 1631 -232
19968 -232 -3306 -3512 -4700 -2987 -1072 -3207 -8936 -8955 -979 1472 3681 2068 -1025 -3939 -6423 -6894
19952 -6894 -1244 2258 5852 6966 8286 6984 9671 9630 5211 4511 5485 4856 1451 1200 2030 2808 265
19935 265 1828 -1043 -3064 -3310 -2080 -1548 -5537 -7604 -10567 -7815 -3660 -69 159 890 2459 3173
19919 3173 4980 3961 -1256 -4078 -807 142 -1914 -2899 -4745 -3676 2136 201 -1676 -2221 -1747 -16
19903 -16 808 -96 3170 -41 -3247 -4069 -4346 -4933 -5372 -2379 -1749 -5908 -8104 -7315 -2105 2730 1715
19886 1715 402 1088 1682 461 -1210 -2961 -1931 -3234 -4705 -5828 -5542 -4514 -5046 -2831 -2007 -1223
19870 -1223 207 -472 -125 2335 5414 4327 3613 2366 -32 297 658 2001 4803 2747 1596 564
19854 564 624 279 -1295 1657 2953 1650 -98 -725 -1633 -4016 -1978 -1183 23 66 -4231 -2540 -1483
19837 -1483 -2285 -3178 -4198 -1061 2731 3054 3461 5048 3365 1470 1243 -2986 -5023 -3612 -5664 -7451
19821 -7451 -8626 -8055 -9410 -6875 -5982 -5202 -5132 -2046 -478 1896 -1507 -4179 -3290 -5004 -3394 -2519
19805 -2519 399 1052 3578 3321 -863 -1290 1044 -583 -2975 1298 1683 2308 1500 -1649 884 4587
19789 4587 3043 771 1460 1088 -283 -274 -2784 -1209 1726 3270 4610 1580 1082 4454 7360 9466
19773 9466 6453 9059 7332 762 1699 -427 -1061 1165 2518 3432 1747 -2197 -3985 -3409 -4626 -1798
19757 -1798 1177 463 1634 3857 2679 1574 -524 -1923 -1158 846 2686 3146 3202 4745 5896 3084
19741 3084 -1078 1143 6398 10396 11453 9281 6842 4636 4934 4366 -119 -1166 2800 3795 7690
19726 7690 5696 3854 6185 3559 651 1236 1699 -1352 -1450 1300 1797 1281 4192 6274 6775 5008
19710 5008 4023 1476 468 3610 5865 3368 -2324 -6693 -7255 -6882 -6336 -7999 -8321 -3975 -217 599
19694 599 1213 1013 -680 2095 3819 3239 2841 2084 4231 2355 2655 6128 9103 9328 9007 6549 4596
19677 4596 4631 3189 6346 5001 17 1640 3280 6419 6980 5107 5579 3173 1759 -2931 -2345 1164
19661 1164 -853 -1766 1187 5091 1201 3240 8180 8141 7692 9473 5417 1932 -2378 113 4550 6646
19645 6646 8154 7779 8761 10386 10194 10422 8117 6524 8863 10199 15008 27352 32000 30663 33397
19630 33397 39940 49819 60163 67527 67495 64711 63662 62049 62529 66546 70505 68301 62140 53237 48419
19615 48419 44307 42697 40324 32895 23678 16098 10870 7897 7519 7829 11279 14051 16243 17203 16726
19600 16726 15137 15231 10723 10102 8712 12044 13479 12796 11339 6311 6554 8034 6837 7244 9206 11697
19584 11697 15874 23177 32639 43557 47984 48186 51901 59819 67555 73166 72892 71313 71686 68370 67650
19569 67650 66562 65973 66903 65018 55265 46571 39545 35901 32926 24855 18767 11953 5816 5934 5299
19554 5299 5062 6033 6624 4155 5169 4747 4990 9056 12731 11256 8372 5567 5348 5703 4194 3015
19538 3015 5523 6794 5149 4251 4193 7244 3361 4248 7210 5178 5240 5730 799 -1760 -956 1547 6310
19521 6310 7424 8852 7194 205 -3826 -1204 216 1340 4923 5359 4399 3473 2460 4259 5372
19506 5372 2346 -1203 -1066 613 1644 2068 1240 1815 2361 1065 2096 5127 7321 7489 3851 1494
19490 1494 1637 3024 0 -1568 -2249 -857 54 -1565 -667 165 766 -701 -613 1642 4814 2602 -2714
19473 -2714 -2853 -771 1853 1605 3395 1230 1049 833 -2900 -3400 -2535 -2209 222 2111 4203 3828 1310
19456 1310 1470 1666 1512 1947 2315 643 1280 1807 -516 766 1427 3114 6472 5333 5938 4633 3247
19439 3247 911 893 3516 2920 303 384 1907 1687 -2074 -1502 2371 5117 6219 6051 6572 5955 7139
19422 7139 5019 1359 2 1039 4767 6395 941 -4766 -3832 -707 -2511 -1575 -436 -1684 -1223
19407 -1223 -551 2232 4941 5203 5676 5618 6111 6729 10110 14208 12954 9176 9971 14532 13890 8740 6868
19390 6868 4680 3650 3784 7514 11819 10348 11399 13808 11074 9199 9302 8348 9719 11136 12055 10625
19374 10625 8379 8963 11195 13882 14372 16613 20286 23297 26936 28480 26188 27019 26948 24865 22815 23329
19358 23329 26483 27627 29828 31209 31792 31850 31885 34324 38796 41106 41153 38690 35626 38643 43103 46509
19342 46509 53491 62380 70677 77749 80718 82219 83569 86411 87390 88068 85505 77752 71195 66954 62762
19327 62762 57509 53657 49911 46517 41826 42565 39341 39388 37981 40999 44506 44905 44305 43598 40469 37232
19311 37232 34464 30786 30547 32944 34050 32654 34683 36760 36087 32587 27031 24576 24493 24522 23740 22481
19295 22481 17921 14356 13402 9805 10505 11478 12812 12899 13348 16350 18282 14937 12322 12038 14062 17452
19279 17452 16990 11600 10348 10768 11272 11870 11102 11348 9967 9741 10017 10234 10450 11482 14337 15145 12817
19262 12817 14353 16847 16285 15687 10787 7936 6059 6132 8983 13774 15452 16609 14669 12312 11322 9835
19246 9835 9844 9095 9243 11400 14306 15869 14029 12815 16083 16170 14756 15556 16926 17119 16692 18559 17607
19229 17607 14701 14213 11737 9076 13593 14892 12747 10429 10875 5943 4038 8070 15247 16636 18380
19214 18380 19995 21049 20515 19959 20464 21322 23739 26119 26397 27910 29653 29268 24019 22157 26110 29842
19198 29842 28531 26518 22867 21767 21978 25050 27867 27356 27885 30921 34025 32468 28574 30080 33734
19183 33734 33289 29665 27463 28239 29107 30008 28026 27758 27727 31385 34259 34455 34136 35605 38204 41618 43793
19166 43793 42411 40454 39146 38356 45433 53186 57197 58536 62779 70899 76013 78622 80010 87546 95459
19151 95459 101579 107791 119760 134192 140798 150403 165447 183199 203567 221604 238495 260186
19139 260186 278647 287564 295670 307356 327575 357647 379352 396486 417847 440132 467082 503253
19127 503253 559206 648284 770990 947899 1217289 1628394 2279298 3300548 4623786 5681561
19117 5681561 6126764 6419016 7219740 9021870 11266688 12377069 12371400 12146987 11899522
19108 11899522 11865291 11986349 12199194 12889366 13212215 11956719 9886716 8081512 7181619
19099 7181619 6982345 6551109 5494036 4223541 3129116 2380031 1920895 1635905 1438729
19090 1438729 1294569 1192449 1122354 1070825 1021629 981250 958136 946825 935526 915010 895247
19079 895247 889879 891480 889465 895395 927189 998930 1113776 1276670 1526944 1934248 2599372
19068 2599372 3663287 5074203 6230059 6705559 6983564 7787052 9674682 12134194 13403311
19059 13403311 13374353 13073061 12780900 12746093 12888388 13072228 13706170 14044086 12800674
19050 12800674 10652151 8720458 7699970 7437291 6988919 5892647 4543630 3357370
19042 3357370 2531434 2019482 1690776 1452937 1271908 1136036 1042354 972955 896693 823432
19032 823432 768433 719406 669959 617325 568042 529395 495595 455784 410751 376935 350671
19021 350671 324028 295843 265122 240916 226130 211414 193613 174256 160334 154031 145517 140148
19009 140148 135016 127524 121981 117359 113406 111631 109830 113935 122486 132849 142074 145055 144813 145394
18995 145394 154162 172125 186408 187602 183487 177851 176850 175141 171028 170323 179004 176630 159075 143016
18981 143016 128065 123050 117601 108348 93958 77315 64515 57973 55179 52346 53144 54959 59089
18968 59089 62822 66774 66251 64859 64459 59840 55952 56883 54730 53565 54019 55903 61555 64792 63149
18953 63149 62202 56842 50159 43476 40319 40977 39339 38921 34284 32568 30431 31611 34320 33231 30286
18938 30286 28789 29196 33585 31422 29707 30640 31754 30422 31545 31408 29818 28278 29587 30612 28730
18923 28730 28398 28411 30996 32939 37054 37892 44928 50429 51888 51553 47278 39800 33050 33208 38001 39959
18907 39959 42810 44453 47843 50318 49864 48275 45408 40093 33819 30609 32601 32473 28462 25985 24888
18892 24888 25456 26672 23703 20854 21820 21403 19675 19200 19348 19274 23054 22529 20450 19152 16981 16046 17684
18875 17684 19775 20659 19205 16301 16235 17611 17677 17020 12444 8666 12210 14636 14232 15371 15617 19003
18859 19003 16218 18407 20062 20031 17483 18492 19895 20174 21601 22371 22349 22807 25301 26293 31052 36584
18843 36584 38898 44468 54409 65437 70834 77370 88158 105484 120117 137411 162387 193039 210351
18830 210351 202200 190232 187599 190719 204309 216341 216050 213005 205676 188400 164401 141338 121661
18817 121661 116481 113453 104938 89016 70759 57208 50537 44864 44931 42833 38463 34254 35157 33476
18803 33476 33195 33493 38670 41584 44963 50632 56850 61681 65480 66537 67177 71054 72063 75733 89793
18788 89793 110262 135408 155157 157819 152792 150403 159191 189706 217220 226374 226184 220040 207900
18775 207900 194598 184849 180976 186432 194424 190067 178829 165576 151480 138045 122795 100392
18763 100392 80865 61478 49390 42997 36700 35641 34531 33989 32645 30190 28981 25934 25044 26739
18749 26739 28443 28192 27044 25917 24834 25860 24083 19718 19573 22841 23822 20731 18844 18673 18399 24248
18733 24248 28243 26858 24361 23103 22494 22140 22340 19332 18953 21592 19966 19238 20425 18060 15137 15323
18717 15323 10800 9192 7740 8864 12969 13570 14472 14852 12505 13912 14014 13465 12858 12251 10752 7138
18701 7138 5672 6589 7726 8096 9108 9853 7409 6877 8935 14131 16024 14394 17560 12844 10761 12968
18685 12968 10279 9997 6010 6094 6808 9521 8984 8866 8614 6141 4050 4658 9143 12821 15715 11412
18669 11412 9104 9946 10060 10410 9852 11547 12067 14235 13088 13758 12174 14272 17645 18017 15706 13290
18653 13290 13251 16452 17900 17363 15067 17071 17994 18670 20329 17641 13821 12819 10874 12421 11641 14524
18637 14524 11880 8461 8858 11134 7579 7525 8834 10602 12055 14723 17015 15890 16665 13499 11057
18622 11057 12342 12304 12033 8550 9430 8971 6289 9293 13272 14902 14346 14147 16740 17941 19849 23101
18606 23101 24067 23582 23440 23042 20695 22118 26827 32389 41729 47637 49273 49986 55286 67958 75498
18591 75498 78419 77559 74669 74349 77649 76927 78033 82901 85805 80896 72851 63784 56475 51770 49436
18576 49436 45864 44567 40390 33558 28552 27968 28405 24624 21032 21679 19693 17951 20117 19861 17576
18561 17576 18891 21800 27421 30147 30057 30445 31369 32976 35489 35123 35049 35403 40056 46382 55500 66363
18545 66363 74057 75083 75009 79790 86297 94268 97427 100198 100830 98233 93274 91107 90619 95461 97918
18530 97918 90134 78496 68724 63433 63625 57942 45240 36799 32007 32219 30823 25934 21213 20221 18798
18515 18798 17697 18335 21182 24818 26848 25901 29258 33781 35319 35222 32815 28826 28203 27068 27046 27119 27049
18498 27049 26579 24793 27928 32691 30885 28579 27221 27550 21273 17819 16543 16411 15289 13512 9464
18483 9464 5969 8196 8055 8741 11687 8467 8699 8626 7627 9148 11596 18334 19941 18461 19570 16723
18467 16723 14449 13914 15070 13781 13462 15292 19264 18338 16579 17552 18545 21002 22870 24634 22260 20468
18451 20468 16662 14194 15938 17613 19575 19164 13987 11857 14047 20405 20657 18252 14570 18467 18526
18436 18526 15890 15537 15648 13524 14211 19955 22935 20083 17802 19844 19522 21197 23539 19564 20517 20598
18420 20598 24612 26289 29915 31374 32522 31439 25776 22918 24280 28000 32386 32804 33686 35707 36186
18405 36186 36690 41104 40422 41795 43049 42036 39434 40312 40344 43354 42420 41855 42400 42584 38734 36567 37990
18388 37990 41171 42562 45177 49080 52675 54497 53619 55049 54049 51084 49558 50078 53710 57752 61158
18373 61158 62752 65332 72224 77041 83550 90397 94277 99019 111522 122739 133197 144928 152831
18360 152831 159335 171488 190679 215491 234717 251874 265943 276482 286361 301512 331583 372364
18348 372364 416775 466545 524158 594569 692219 843301 1078944 1454149 2031735 2908229
18338 2908229 4047194 4907637 5020982 4717491 4525162 4842492 5910439 7961448 10929552
18329 10929552 13232327 13098746 11238743 9159603 7927638 7890719 9067190 11330971
18321 11330971 13498518 13460288 11273649 8579212 6476673 5343102 5017870 5279813 5711613
18312 5711613 5568970 4730082 3672469 2774449 2171760 1796924 1573799 1456094 1402309
18303 1402309 1366509 1327912 1293521 1277859 1297837 1388040 1573650 1882234 2353191 3061799
18293 3061799 4114498 5348751 6044386 5927793 5535188 5427541 5990482 7470187 10111430
18284 10111430 13484776 15332282 14388820 12036870 9869716 8857222 9206070 10896466
18276 10896466 13561868 15389544 14471712 11703414 8793512 6745395 5752495 5575780
18268 5575780 5957530 6285541 5849149 4795406 3635679 2707539 2091550 1702301 1464084
18259 1464084 1321874 1231481 1150716 1065578 965340 861897 773250 719770 701284 694446 681142
18248 681142 646092 586131 520382 458624 409096 380772 366474 351722 332809 307604 277295
18237 277295 251095 228311 209617 199896 193281 191823 187104 180233 175240 176393 178907 176226 170223
18224 170223 165039 168488 172616 184914 201984 217097 221271 210749 195479 178575 165335 166898
18212 166898 175804 188039 193655 186345 167350 147139 130622 126295 127368 127723 123799 118020 109996
18199 109996 99244 89910 86306 80806 77219 75980 73161 71037 70241 66426 65283 65432 67263 67742 64684
18184 64684 67369 70526 72907 71395 68151 63752 59962 58603 58918 63517 69441 74906 87378 99337
18170 99337 102573 97432 96733 100317 105426 120665 146262 167469 174598 166799 149921 132537 124299
18157 124299 133636 149765 168927 179834 170439 147674 128176 113097 103854 101071 103596 102927 96421
18144 96421 83384 69721 64342 57286 53325 50745 53292 54832 57814 57669 55641 58611 61077 64694
18130 64694 70263 77703 90701 102974 116926 130555 143025 153983 167999 192428 227954 281887
18118 281887 354573 434656 518056 631662 827929 1178761 1813014 2975140 4945938 6534159
18108 6534159 6007248 4382029 2726657 1636818 1083028 794030 625807 519581 440620
18099 440620 375086 320308 277471 246334 227664 225032 226609 229949 232284 229642 217825 195727
18087 195727 169536 148099 131850 119931 108077 97886 88243 82258 72513 63701 60204 53239 49000
18074 49000 46679 45874 45898 45621 46759 41889 39436 42885 44787 46357 42346 38371 35643 34388 35375 35056
18058 35056 34125 31720 28510 27629 30344 32327 36413 38742 41033 47644 58215 71497 87407 103939
18044 103939 121124 125120 125188 129257 132689 138593 141126 131389 116686 98092 82475 73152 64552 57474
18030 57474 51020 47663 43336 38742 35794 32305 30517 32413 33118 30997 28483 28308 30317 31811 32645
18015 32645 31067 30128 28929 25803 25801 26945 25768 24031 21553 22497 21685 22662 20739 20590 20977 20227 24737
17998 24737 30478 34556 41494 52129 65649 76298 81118 72744 60371 47079 39698 33187 30296
17985 30296 26939 23498 20868 19377 22318 25444 23989 22740 26369 30195 34255 36578 32809 28909
17971 28909 27253 30735 30571 29421 29552 29255 27203 27236 28563 27467 26675 26037 24514 21601 21748 22960
17955 22960 21709 19917 20625 17417 15975 16291 15666 16048 12692 12282 15115 16190 15601 16811 18495 17743
17939 17743 15423 12396 11680 15109 14107 14111 15547 13217 9385 7869 8740 12199 13270 12192 12993 16670
17923 16670 20302 21546 20067 21111 19460 21745 19818 18166 17125 14866 12070 13598 14792 13897 15093
17908 15093 15823 14348 14041 13018 11234 7928 10160 12124 12196 15016 13614 8938 5501 5051 6045 8852
17892 8852 12681 13053 11901 10936 9891 10181 8921 9790 11057 11410 9087 9037 13571 16365 15810 14647 13584
17875 13584 14968 15998 16598 14682 11687 15052 12593 11623 9824 8362 8844 12756 11658 10093 6521
17860 6521 8202 11866 10928 10200 10945 10544 9205 11300 10005 7442 9543 9913 10664 11365 11595 10410 11811
17843 11811 16546 15998 11658 11754 12192 12462 12933 13052 11561 12908 14722 19660 24353 28599 34836 40111
17827 40111 39226 36355 37844 40182 43713 52981 60544 67323 65553 58349 47344 38488 39701 48205
17813 48205 57214 66295 68824 61633 49038 37137 32896 32082 34126 31925 26286 24047 22722 22660 22161
17798 22161 22390 20012 18668 18310 14518 15548 15092 16506 17652 21749 22422 23856 28601 36921 44594
17783 44594 53071 56524 58422 55958 54725 57971 70869 84636 101539 107627 103612 91180 82637
17770 82637 74893 72688 80478 92622 100512 96987 82186 62678 49620 44849 43021 44840 45562 43963
17756 43963 37651 30013 24825 18878 13089 12441 12415 14105 15577 20367 24961 21041 17632 16777 12921
17741 12921 13466 17626 19491 17516 21148 22325 24997 27349 31012 34408 35521 34800 33667 32933 30614
17726 30614 31058 26582 21736 19400 17375 17677 17144 20843 23465 19681 18526 18754 14930 18190 21457
17711 21457 25040 30380 37047 46378 59792 83290 119787 157399 184400 182625 160033 123170 89026
17698 89026 65742 51290 41234 34178 31168 30382 32219 34032 29254 26812 27061 28602 34080 37097
17684 37097 36327 32529 32009 30156 29398 29418 30208 30593 28288 25685 24190 21817 20436 20919 22730 24425
17668 24425 26362 29321 30605 32013 35235 39763 50614 66060 90900 125972 164801 202751 222099
17655 222099 226969 228382 230487 220676 195233 161607 123459 93913 73777 63138 58538 54118 47834
17642 47834 42573 37775 38799 40277 39583 38819 40617 41667 42965 42369 41339 39216 36945 37654 40205
17627 40205 42673 41032 38780 39599 41266 41942 44072 44516 49672 53114 58572 65059 71751 78745 86634
17612 86634 94728 105246 122695 153621 195458 238552 272147 295295 307586 314539 314105 299202
17600 299202 266300 237495 214185 198255 196030 201481 212858 230944 253472 282085 322020 372654
17588 372654 442828 535302 650781 810632 1037646 1363241 1847237 2580146 3720884 5528970
17578 5528970 8303006 11868594 15385199 17303314 16472966 13608028 9966148 6852137
17570 6852137 4691742 3367386 2579748 2082768 1734228 1457786 1238505 1064694 936149
17561 936149 843289 779147 740886 721990 707019 690673 669839 652308 649767 666120 702479 740259
17549 740259 762031 757774 732735 698223 678824 676446 702515 758496 849525 978927 1160606
17538 1160606 1425500 1802640 2363011 3209339 4496729 6488578 9405674 12939751 16210861
17529 16210861 17800980 17380690 16098013 15416024 16186644 17833424 18748343 17504167 14512521
17520 14512521 10819454 7633472 5384777 3966976 3090888 2514488 2100155 1782335 1529836
17511 1529836 1329705 1176618 1068187 998200 958301 936101 922258 905311 878234 839574 790114
17500 790114 740528 699741 677081 666589 656613 641684 619132 601928 602324 630387 694988 784909
17488 784909 898779 1045708 1242461 1531047 1971604 2649607 3697981 5352630 7830210
17479 7830210 10862788 13605575 14625335 13369468 10672450 7628705 5197391 3564443
17471 3564443 2579569 1989807 1604291 1322411 1107253 941988 812291 717841 654592 618244
17461 618244 608074 606788 599982 570697 518938 463389 417731 388327 374450 371385 366535 354651
17449 354651 334442 298794 262039 229718 204116 188629 190494 193555 190020 191043 200835 219652
17437 219652 232465 226116 202044 175602 148149 127308 115660 109229 105099 100498 94153 92505 94094
17424 94094 91858 86776 85140 86738 89398 92389 99302 116202 145837 185377 223348 254536 267301
17411 267301 269893 278264 287396 280240 247814 205905 159806 125251 102309 89383 78110 66627
17399 66627 59918 54179 53071 51817 51148 49186 49001 50793 51374 49448 51916 48815 47765 46678 44243
17384 44243 45220 43450 42248 41979 39068 37221 38514 37986 34345 33741 36766 37307 39572 41030 43721 46803
17368 46803 52172 60456 81594 113004 147213 173665 179809 159778 127016 95517 68831 52001
17356 52001 43225 42234 38458 30600 27172 30992 30287 26348 23038 21725 23461 26369 25365 24241 19761
17341 19761 16122 21068 22474 21512 20704 21951 22086 20931 20532 18613 15549 13937 14356 15409 17053 17447
17325 17447 16204 16375 16138 16043 16229 16824 18138 16249 14446 12841 9264 9287 6524 6334 4751 4866 7957
17308 7957 8955 9352 7700 9646 7565 7886 9664 10284 7042 10119 11137 10599 11804 9446 7869 9951
17292 9951 9910 8633 5960 7813 6177 3633 4244 4236 2976 4793 7552 8127 9950 12960 13243 14166 14279
17275 14279 13463 13307 13191 11350 11487 12366 12334 9654 5755 5507 7389 7892 8055 8133 9219 7732 9545
17258 9545 9795 11945 13459 13625 8959 5688 9485 11690 11700 13807 15653 16155 19068 17394 13445 11874
17242 11874 10651 10630 11619 12269 9011 5051 2672 -1518 22 5402 8934 13024 14199 12787 11960 12017
17226 12017 10487 10905 13364 14551 14015 14033 15840 14681 14685 11389 8607 10339 11892 12252 12862 11972 7189
17209 7189 2782 840 361 2498 3551 4844 6398 9880 11280 10070 8507 9775 11266 10865 10535
17194 10535 9511 8839 6395 6700 1191 1465 3861 6539 8662 11963 8882 6549 5428 6774 6001
17179 6001 6296 6814 3647 3312 4710 6184 7326 6072 4255 2205 2074 5804 8004 4469 3338 4265
17163 4265 3764 3714 5827 6868 7391 5181 3561 6106 7854 8073 6692 7296 8797 12546 10016 5902
17147 5902 3585 3650 5477 4705 8073 3921 3512 6816 8222 8363 4882 2045 639 3876 7067 8858
17131 8858 9035 9504 9054 8753 10044 7331 3544 5850 8823 5258 1053 -1018 423 -82 417 -915
17115 -915 1266 5278 5222 3736 1892 2162 771 326 3191 7036 8104 9622 8532 10014 8129 6360
17099 6360 5968 7619 7400 7196 6523 4697 3232 2077 3102 1772 586 -1927 -1047 494 1251 2512
17083 2512 273 457 686 -1345 -1313 664 4306 7349 7799 7943 4333 -719 -197 2902 4021 3508 2586
17066 2586 1466 1795 3698 3103 5784 9380 13335 16792 24053 34908 45287 61518 78552 85498
17052 85498 83003 72844 56258 40893 30306 22271 18537 16255 14141 11571 9384 10241 10823 12153
17038 12153 9350 4410 2694 5546 8532 7897 6000 3802 4272 3185 4266 3857 4731 5902 4068
17023 4068 3662 4676 3757 3736 5769 9630 11364 12427 14844 17351 17761 23488 32160 47732 66671
17008 66671 79903 90965 92751 87216 84276 86852 90026 95551 89484 75462 54881 39245 33331
16995 33331 29669 20711 14404 12939 8666 6889 7737 8135 7181 7015 9478 11020 9193 5793 4410
16980 4410 3345 4013 4212 2147 2104 5871 8012 5377 1750 4275 6959 5659 4872 5516 5047 2795
16964 2795 3300 6030 12045 17242 22303 26037 37271 55366 71011 77678 77113 67618 52506 38152
16950 38152 27888 22246 17255 17263 13471 9540 8550 9845 8508 6364 6024 5500 3148 3456 922 1836
16934 1836 6358 8943 8860 5037 4798 4641 3808 4256 7231 10137 11327 9339 8641 6808 7121 8650 5795
16917 5795 2465 485 3731 743 512 1233 1390 4906 5357 3864 3647 3486 3993 2540 3742 2973 150
16900 150 464 -570 2215 3868 7751 6818 3152 3061 1638 -870 1002 -223 -3660 -1145 2155 3886
16884 3886 3114 4021 1621 207 -1242 -838 260 1052 1012 -518 -1038 -973 -3107 -7200 -5445 -2361 -1990
16867 -1990 188 -918 -3527 -3922 -4175 -4316 -1292 -907 3468 1115 -1576 -2015 -2684 270 1929 2967
16851 2967 4969 6171 5828 3345 5877 4648 1353 1005 920 2304 1832 431 -1237 -3550 -1606 -196
16835 -196 2511 3987 2656 2773 1560 -278 1463 2430 4986 6488 6409 4376 2918 2476 -298 -3344
16819 -3344 -6995 -7403 -1388 3730 4073 6742 6887 4592 3282 1605 3169 3430 1848 -948 -1456 -2513
16803 -2513 -506 181 3975 3697 376 33 1285 -403 -623 -3751 -5664 -1368 450 -1228 1007 3511
16787 3511 5799 4432 526 -634 -714 -3386 -2539 -2194 -1793 -4554 -4093 -3503 476 5687 3588 2731 854
16770 854 1651 1498 556 1386 2061 2283 -1797 -3140 -1916 596 1166 1260 169 -99 2287 3632 5908
16753 5908 3904 262 -911 -6032 -7483 -2293 4212 5854 4636 5512 6736 5174 3593 5199 6676
16738 6676 5337 5431 3350 45 -2123 -2811 -1852 -1262 -281 2089 1551 3954 5034 5046 3441 1862 1962
16721 1962 1567 2042 494 -995 -2240 -5094 -2881 -156 1835 -2444 -6430 -4891 -4390 -1855 1085
16706 1085 1073 762 -1410 -4129 -5621 -5999 -5078 -2223 -315 -173 -598 1561 4278 5208 5414 5161 1813
16689 1813 226 1080 1916 -460 -866 2067 842 -210 171 -1742 611 5351 3213 2899 6048 4479
16673 4479 3192 2569 5394 2879 -2740 -521 366 -2537 -2012 -2393 -4631 -4434 -1880 -1661 465 2487
16657 2487 0 -2167 -3054 -4189 -2406 -2128 -1655 -290 -1198 -1609 -824 1136 -13 2113 2677 4925
16641 4925 2902 1793 498 56 -966 -2292 -1564 2666 3499 -651 -2622 -6046 -8151 -7996 -5907 -2431
16625 -2431 -3594 -2058 -1932 -1896 -2211 -1392 -1242 340 2293 1790 1042 -283 -450 -2625 -1990 2384 5237
16608 5237 4232 1974 3143 3445 4152 8110 4396 1134 -1357 -3791 -1612 368 -574 -667 -2047 -3185
16592 -3185 -4562 -2810 -3597 -5120 -3753 -881 -2516 -1774 -3433 -4695 -3212 -2735 -2651 -2076 -1169 -1066 -1966
16575 -1966 -2252 -649 2899 1344 5299 5019 1500 991 2657 4348 4636 3632 2857 3333 1419 -80
16559 -80 -972 -1487 -1893 -981 -2788 -5932 -6440 -4663 -3939 -1328 -3352 -6086 -3439 -5103 -3699 -5039 -7184
16542 -7184 -6048 -4269 -4071 -1973 42 -541 -33 -2739 -6617 -5496 -3692 -2244 -246 -739 -1790 -1622
16526 -1622 -1817 853 -2509 -4367 -6852 -6853 -3429 1054 1223 -1261 2315 5572 3994 2988 563 -5420
16510 -5420 -5629 -5796 -8566 -7621 -4085 -2389 -1444 -3535 -3413 -1415 -4332 -9648 -7257 -7652 -10022 -7927
16494 -7927 -4664 -4923 -3369 -2467 -1284 177 -376 -3939 -6403 -6428 -5070 -2808 -556 445 1501 2386
16478 2386 -669 -814 -50 -962 -4608 -4342 -4634 -2737 -1099 -4477 -6066 -4942 -4561 -2120 -2830 -3886
16462 -3886 -4445 -5184 -5671 -2576 -697 -2311 -3986 -3787 3001 6625 5364 3028 1024 1307 1236 832 1453
16445 1453 18 915 3701 1284 -1198 -1920 2556 4696 94 635 -121 -4501 -5809 -9090 -8574 -7428
16429 -7428 -5004 -3217 -1764 770 826 -111 321 1942 3924 5433 4077 2035 1423 3402 4834 3194
16413 3194 1049 332 451 -1467 -4220 -4805 -1803 561 3213 3644 2960 1983 -1792 -3434 -1339 1170
16397 1170 2325 1370 503 1749 444 -1330 -2978 -2222 -3944 -4146 -3356 -2368 -971 313 2768 2063
16381 2063 -1104 -2731 -3587 -1456 -933 -10 2159 1511 468 3785 5362 2534 -990 3628 3583 -331
16365 -331 -3620 -4309 -2931 -1430 -2105 -2281 -733 -1652 -1724 -2755 -2880 -397 167 -1298 -28 1542 2123
16348 2123 3498 1926 -90 -2010 953 1786 608 135 -2429 -3845 2017 -298 -412 1056 1807 -2101
16332 -2101 -5643 -7176 -4055 -4408 -2576 324 1671 707 -935 247 -923 -107 534 -996 -1998 378
16316 378 4406 0 -2 3754 2212 -408 -890 -2156 -1608 -2625 -3405 -3489 -2475 -951 -2996 -4096 -5083
16299 -5083 -6363 -4672 -1536 757 -1301 -1983 -928 518 2002 6703 5938 -1583 -6569 -6449 -3223
16284 -3223 -647 -2038 -5536 -5600 71 3517 3156 4091 4661 2137 -1397 -5498 -4340 -2164 -3165 -3899
16268 -3899 -196 952 236 -244 -1556 -2943 -2217 -934 -2691 -594 -2269 -1063 899 1660 2148 1631
16252 1631 86 -455 205 2263 2885 -818 -3567 -157 -1721 -5296 -4293 -1511 852 756 2387 1358
16236 1358 -1955 -3717 -3798 -1988 -4025 -5444 -5356 -1503 702 -866 -616 -983 -4086 -4883 -1616 -1734 -3632
16219 -3632 -3999 -2841 -3850 -3504 -3939 -151 2389 1948 4193 7495 4304 -322 526 3309 3599 -2156
16203 -2156 -4323 -6840 -6068 -5553 -2431 -2661 -3324 -2989 -2566 -2096 -1468 -2497 -4116 -2600 -887 -1198 -1731
16186 -1731 1524 2531 -1679 -6817 -7768 -5426 -6643 -6286 -2718 -2903 -4150 -3825 -2798 -613 540 1513
16170 1513 4463 5134 2454 2299 2627 3569 2976 -21 -1684 -2441 -3423 -1292 -146 -3568 -1951 -298
16154 -298 -4744 -4376 -3219 -1557 -2566 -2679 -1779 691 260 -451 267 -478 92 292 756 1487 1311 2528
16136 2528 3155 440 224 -2523 -2706 -3251 -2426 -1571 -3268 -5395 -7797 -1429 -1830 -2670 -30 329 2691
16119 2691 2223 -430 370 1350 784 -1820 -6612 -4958 -778 -263 1252 2379 1840 3017 130 -592
16103 -592 27 -1059 -1973 -2217 -3509 -5391 -7708 -5009 -745 -2364 -2423 -439 527 1446 3329 1257 1199
16086 1199 3734 2753 -3198 -3265 -1634 -1382 -421 -982 -1818 -450 -982 -1482 -5736 -5020 -4304 -5114 -4351 -2312
16068 -2312 -3214 -5175 -7388 -6306 -9594 -8116 -3682 1022 812 590 881 -78 -2984 -628 4820 5283
16052 5283 1068 -2336 -2273 -3064 1371 2493 4091 3371 1500 -148 -270 -2003 -3030 -2879 -1725 -1627 -1828
16035 -1828 -1665 -5599 -5858 -398 2516 3197 3851 4346 3663 1463 -2756 -5155 -6097 -747 3525 859
16019 859 -367 1245 -170 1270 1913 1937 614 -207 -703 -1600 -552 843 -3787 -5878 -7166 -8274
16003 -8274 -6420 -3486 -2051 -604 -2258 -1838 -909 -1909 -511 -102 -2154 -3641 -4534 -2407 -618 -3326
15987 -3326 -5481 -5016 -5184 -5613 -5023 -1188 -939 -2070 -5199 -6398 -5228 -3891 -5047 -3939 -813 83
15971 83 381 -3443 -3800 -2527 -4675 -4276 -2019 -1755 -1894 986 1768 -210 1289 1312 404 -4532 -7474
15954 -7474 -4808 -1654 -1655 -5301 -8848 -7161 -6768 -5589 -2782 -2526 -1002 -1797 1533 565 3110 3730 803
15937 803 -3446 -2294 -5177 -4421 -2324 271 1941 3078 1169 3216 8776 7861 3721 -280 1460
15922 1460 2430 3853 4282 4685 5341 2457 -1951 -5153 -3089 1024 651 -2510 -916 1729 672 -497
15906 -497 -2016 -4527 -5914 -5500 -4032 -2255 -2750 -955 -367 220 -330 -3160 -734 2216 823 -1897
15890 -1897 -515 -1306 -3506 -6999 -4370 -3165 -4387 -4661 -3647 -6035 -5699 -1789 507 -169 -1988 -3679
15874 -3679 -5922 -8831 -8850 -10647 -7706 -2447 -2052 -939 -2038 -3077 -1286 -3830 -8707 -10486 -10104 -6092
15858 -6092 -2902 -3486 -5245 -7598 -6920 -3012 64 1874 1041 -2009 -3427 -2207 -1960 -6038 -6954 -4311
15842 -4311 -3393 -5489 -7201 -4999 -2234 -2323 -4279 -6528 -4864 -2947 -2330 -5744 -6616 -6214 -3219 -427
15826 -427 -1339 -312 676 88 -1612 -3761 -3620 425 4566 5040 6259 5802 3756 -582 -1670 1580
15810 1580 2105 596 -681 -759 -2014 -3344 -2814 -686 1548 -2430 -4237 -3289 -3016 -3393 -2955 744 458
15793 458 295 1340 3235 3708 3753 1276 -1173 -1172 -4426 -667 316 -1214 -2688 -3620 -4337 -7606 -5926
15776 -5926 -4421 -4749 -6465 -3340 -1511 -1598 2862 2175 -867 -267 -79 -2648 -3844 -4739 -2567 -2455 -929
15759 -929 -2993 -4121 -3513 -3384 -5347 -5467 -6607 -6343 -3518 -3481 -3593 -1134 -2572 -2239 -2387 -1015 -811
15742 -811 -3507 -5430 -3810 165 -818 -2229 -2835 -4502 -4882 -5592 -2355 -2063 1072 3402 3687 1049
15726 1049 -5048 -5314 -1236 -231 -2918 -4180 43 1853 471 -1305 987 2460 359 3423 8046
15711 8046 9074 7730 6113 4188 4826 7627 9996 3554 423 -1014 -462 646 4068 5853 5703
15696 5703 2605 3662 3388 1331 -331 886 1912 1460 1785 -866 -3427 -3207 223 1636 377 -1948
15680 -1948 -3399 -3040 470 -297 -1569 -1157 -1486 3945 7001 4244 3496 1912 1625 812 -554 -4152
15664 -4152 -8131 -5681 -830 720 1771 -346 -3417 -4254 -1709 949 2632 1968 -1527 -379 2340
15649 2340 3654 1844 -144 -4033 -5495 -6167 -5744 -4359 -1746 -4850 -4228 -1327 -2360 -3910 -3769 -3321
15633 -3321 -2476 -718 969 2747 612 71 -3060 -4758 -2538 -3512 -7198 -6382 -3813 -4503 -3952 -5511
15617 -5511 -6190 -3875 766 445 284 -1701 -3139 -4164 -5099 -7664 -6435 -5096 -2024 1175 223 9
15601 9 3254 5624 4005 2470 4745 3349 2028 3352 3325 841 -2815 -4513 -3468 -2804 -762 64
15585 64 3302 744 -1286 -3104 -2953 -1834 -142 928 -1718 655 2416 -100 -1330 -1904 -1433 1724
15569 1724 2062 1064 2290 3324 2902 -391 -833 4088 5596 4160 5217 6948 10880 14705 17066 9791
15553 9791 2669 1919 -2146 -4591 -4495 -5113 -4229 -4681 366 -1614 -4262 -1166 2740 -406 -4024 -4302
15537 -4302 -5369 -956 2877 -2675 -5488 -5008 -4162 869 2718 192 -1921 -3647 -4906 -2764 -2249
15522 -2249 -4364 -6585 -3543 -1134 2975 1122 -1910 -3781 -2409 -2744 -3542 -3844 -4849 -6215 -5966 -2924
15506 -2924 112 1257 139 1367 -134 -229 -83 -1133 -995 -2263 -1371 2120 669 -3600 -3623 -2027
15490 -2027 -4538 -8331 -6703 -3585 -2889 252 -348 -5447 -3918 -626 559 2275 3335 6243 9164
15475 9164 6675 6195 4331 2311 137 -4111 -7291 -10654 -9179 -6789 -9066 -9856 -11118 -9830 -9518
15460 -9518 -8230 -7480 -5525 -5111 -4967 -1736 -1106 -1051 -3902 -3262 -4360 -4600 -3987 -1847 -2300 -2830 251
15443 251 4633 8284 4014 -1908 -2421 -3284 -3528 -5958 -4725 -3811 -2064 -807 1962 3347 5004 8123
15427 8123 6777 4059 216 -3565 -3459 -1038 4 -2191 -4297 -2722 -2791 -4179 -7406 -10260 -7689
15412 -7689 -574 1891 -1231 -1721 -1963 -3967 -6289 -5042 -6096 -6098 -3867 -3283 -733 -1271 -2615 -3120 -3594
15395 -3594 -2101 -1562 -2307 -4376 -5830 -2968 907 1418 1218 358 597 109 2629 1805 2688 3465 2669
15378 2669 2133 2767 5112 3385 2746 1390 376 -3355 -3837 -1365 -2005 161 1663 -149 -1260 -1138
15362 -1138 -3698 -4478 -2863 -4586 -3360 -967 -2225 -5806 -5546 -7471 -6168 -5367 -3144 -4814 -5582 -2549
15346 -2549 -2475 -2813 -4064 -1705 2462 -637 -4354 -5319 -2268 974 651 -3935 -5915 -6161 -6078 -3434 1144
15329 1144 2056 1481 2915 7632 5924 1084 3059 4408 1840 455 -1454 -1943 -4067 -4280 -2972 -1162
15313 -1162 394 -2448 -2828 -1814 -1072 -1501 -3017 -2230 -3224 -3949 -4849 -6198 -4391 -4205 -7032 -7262 -7577
15296 -7577 -7444 -6589 -1923 -840 -2323 -3249 -6147 -6168 -4588 -4302 -3968 -4864 -6831 -5929 -7198 -6321 -3122
15279 -3122 -1864 -1596 -3873 -2183 -927 -4466 -9311 -8791 -7074 -7707 -6118 -5046 -2963 -4936 -6232
15264 -6232 -6594 -4789 -7814 -8970 -6593 -7206 -6419 -4327 -4227 -5046 -6690 -5178 -3141 -4780 -5626 -3917
15248 -3917 -2792 357 -2266 -6482 -4450 -1423 -2240 -5771 -4291 2500 5318 3159 2266 -1431 -3028
15233 -3028 -1878 -2737 -3597 -3262 -2649 -3065 -1022 -1810 -3317 -2777 -1389 -3314 -3009 -2728 -1914 -3084 -3085 -2166
15215 -2166 -3395 -465 -718 -3049 -3395 -5094 -6757 -8001 -7598 -5295 -1996 -605 572 39 558 2434
15199 2434 116 -4159 -7682 -6856 -5376 -5529 -3272 -1451 -573 335 1499 1663 1177 -1604 -2065 -1701 -1982
15182 -1982 1173 3428 3790 -2059 -6608 -6529 -4683 -616 2111 1096 1109 -1396 -6510 -5206 -4358 -2374
15166 -2374 -1406 -84 3084 6069 7388 8730 5495 2691 451 -568 -3003 -1422 1882 2368 465
15151 465 -642 -1379 -3427 -2306 -1820 -4194 -6579 -6807 -6807 -5829 -3495 -4065 -7979 -7114 -8091 -9586 -8905 -8821
15133 -8821 -7362 -3503 -2680 -6074 -8602 -10659 -8191 -4690 -1645 341 -656 1906 5311 4403 4361 2258
15117 2258 -1014 -409 610 1234 888 -1817 -1217 2387 369 -2678 -3317 -3879 -2805 -1000 -3758 -3747 -2975
15100 -2975 -908 -2283 -4698 -4360 -1828 -1787 -530 -1291 -1047 2102 3726 3212 1651 -1271 -535 -1983
15084 -1983 -976 -322 -4313 -2475 473 1358 2673 -1209 -2296 1650 3750 3459 379 1012 -73 69
15068 69 -2277 -1796 957 926 -1533 -1496 -3124 -4208 -1760 -2710 -2954 -1867 -2747 -832 -109 952 1269 -1093
15050 -1093 908 2226 688 -2970 -4429 -1717 -625 -4 889 823 3061 5240 6790 4748 292 87
15034 87 1050 4164 7577 7045 5186 3941 4115 7001 9483 8078 9172 8714 9782 9952 8558 12321
15018 12321 18256 18864 21303 23947 28090 35545 39060 45507 56691 75818 95957 115594 146341
15005 146341 195363 278598 422718 668073 1093533 1878897 3044914 3579337 2978525 2029012
14995 2029012 1192312 714600 477023 349221 273320 216548 173266 142103 120039 103274
14985 103274 88789 78556 74842 69050 61621 50633 43769 43888 42046 34006 27618 24780 24844 22977
14971 22977 17647 17952 20438 18584 14117 13002 12187 10585 12801 10597 10032 7350 5080 9066 11857
14956 11857 6262 5505 4412 4279 7434 8258 4281 6072 6888 4572 2832 3905 1807 -1025 316
14941 316 3361 4833 -860 -2537 -805 -3740 -5454 -1846 -3309 -2800 -3910 -4223 -4216 -1014 1124 3464
14925 3464 3237 818 -1950 -3967 -1520 -4767 -2449 2560 2054 -28 1208 284 1318 631 -1479 -376
14909 -376 408 -1004 829 -901 -1935 -3244 -3544 -4077 -5323 -3307 -1030 -150 1527 -646 -2573 -1414
14893 -1414 -2208 -1407 -2325 -1996 396 159 -79 -1053 -3776 -1806 -3396 -8147 -10896 -5206 -1656 -2233 -4088
14876 -4088 -5750 -1607 534 -199 -435 -534 -1562 -3366 -2967 435 6787 7290 7111 6975 3338 2711 -3649
14859 -3649 -4576 -3506 784 2417 1446 -3815 -6566 -3208 -3100 -3769 -5040 -2649 -2183 -3173 -917 1009
14843 1009 -1496 -5097 -8111 -4620 -2006 -2849 -4446 -4183 -4826 -3535 -3370 -1329 -1874 -2405 -875 3492
14827 3492 969 1463 4893 3251 783 1905 -1115 -2339 -1090 727 3047 1700 1675 1659 1756 -563
14811 -563 -457 1300 2495 784 -3499 -8125 -7032 -5006 -2442 -2678 -3729 -700 2179 1989 -1420 -4356
14795 -4356 -4230 -420 -2479 -5066 -2060 -1158 -612 -322 2478 2473 -844 -2625 -717 2433 1897 -508 1429
14778 1429 -78 -3805 -4748 -5018 -5001 -4681 -2846 -3205 -1067 717 -2554 -2756 -2760 -2117 -249 2699 3469 7281
14760 7281 7966 6033 4314 5265 6076 10566 11519 14806 12053 9320 10273 7000 4705 1764 20 3128
14744 3128 2414 534 -590 946 -271 -325 -1764 -5605 -4954 -3397 -843 495 -403 -1021 1712 4437
14728 4437 2653 332 1874 846 -2839 611 -379 -2455 -4303 -2475 -1587 -5760 -6712 -2392 -458
14713 -458 -2797 -5399 -5330 -3099 -2672 -1962 -3051 -2729 -2085 -5660 -8065 -8459 -4944 -3112 -3769 -1791 130
14696 130 -3432 -4642 -7067 -3618 -1044 -1065 -3406 -3574 -3218 -5457 -4540 -5010 -3098 -2639 -2950 -3434 -2095
14679 -2095 -7 2098 2317 -3150 -2812 716 586 -2586 -4783 -1925 -55 -1288 -3463 499 877 5
14663 5 469 -1465 -6735 -7331 -3271 1322 5268 6145 3756 268 -1478 -926 -777 -580 2016 1711 -2951
14646 -2951 -5226 -6657 -8150 -9612 -10853 -8051 -5088 -194 -1135 -3511 -4118 -3919 -4151 -4337 -6593 -7252
14630 -7252 -6270 -4161 -2725 -32 -3511 -3774 -4059 -3488 -5010 -3751 -3692 -3496 -2262 -556 -4291 -6508
14614 -6508 -6958 -6756 -4643 -2998 -460 -106 1428 2431 2520 1285 2263 3281 2999 1833 -4119 -7429
14598 -7429 -9714 -5782 577 1502 1917 -194 -3315 -4401 -6488 -5855 -1354 579 956 1999 1985 3280
14582 3280 2656 -1026 -2348 -4274 -3801 -384 3268 1596 -1826 -1762 -1467 -3781 -5903 -6426 -7805 -6415
14566 -6415 -4579 -2555 -3184 -3006 -2452 -4428 -4622 -6106 -6950 -8759 -8607 -7850 -5885 -1134 -4085 -9368
14550 -9368 -12505 -12259 -7497 -3164 -5164 -7256 -5961 -5828 -7908 -8665 -5604 -1341 -478 111 -1903 -4747
14534 -4747 -6562 -7481 -7257 -6652 -5462 -4837 -2293 1148 163 -37 -4766 -4611 -2153 -1061 -1254 -1718 910
14517 910 -1978 -139 1478 -4 356 2454 4720 3748 1457 -1640 -3403 -6573 -5266 -5125 -2052 -4203
14501 -4203 -5237 -4310 -2991 -2013 -2901 -1423 -1787 -6166 -6515 -7801 -8690 -5345 -2293 -1416 1603 -698
14485 -698 -1039 575 -2099 -5120 -2720 -278 1515 228 232 1705 767 2416 4527 1854 2344 3290 583
14468 583 -4860 -6629 -3648 -3983 -5893 -3381 -3901 -4777 -4360 -2569 -2156 -2579 828 680 -1792 -4641 -4620
14451 -4620 -2814 -572 -1496 -2095 -1549 -15 1569 -565 -2806 -2495 -1913 1073 701 -592 907 4874
14435 4874 7815 8992 9015 15907 15430 8942 4807 5589 4314 904 -4948 -4223 -3460 -3016 -3717 -2510 -3110
14418 -3110 -3508 -6051 -5094 -3521 -3068 -1130 -2302 -3735 253 1242 -1154 -1475 294 568 -2585 -2936
14402 -2936 -869 1539 1945 -1703 -4363 -3422 -5586 -3757 -3643 -5318 -5502 -5206 -5716 -5363 -2604 -2131 -3823
14385 -3823 -4124 -1755 -2507 -3035 -3611 -3131 -4254 -6348 -6021 -5230 -4443 -5266 -5557 -5620 -6836 -7502 -6689 -3349
14367 -3349 -999 -614 -1559 -3338 -5088 -7042 -7416 -3988 -2761 -5930 -6217 -4649 -4078 -7661 -7535 -6733
14351 -6733 -6363 -2786 -2596 -5793 -4087 -1418 -782 -1386 -1820 -2359 -3937 -5635 -5414 -3654 -2691 -1896 1303
14334 1303 -1196 -3499 -2723 -4088 -6422 -9575 -10257 -10920 -12503 -8987 -7898 -8768 -8809 -6817 -2863 -2067
14318 -2067 -3278 -3451 -3229 -3490 -6798 -5127 -1440 -745 -1548 -221 181 1420 1727 -914 -3273 -938
14302 -938 2511 1804 1514 -514 -2392 -6684 -4865 -2333 -217 -206 -75 -1672 -1037 297 -662 -2639 -2174
14285 -2174 -1526 -2107 -3622 -2365 1343 -759 -3304 -3261 -3364 -2138 -834 1377 2712 -648 -1653 -215
14269 -215 728 -1759 3024 4246 1135 -2043 -3712 -4074 -4850 -7424 -3983 2316 1172 -3667 -5357 -1237
14253 -1237 1655 1854 4519 5163 4671 1132 -1367 -1445 -2339 -1959 -4198 -6404 -7003 -4026 -677 -3054 -3270
14236 -3270 -3355 -2009 -4917 -8996 -9974 -8111 -3503 -688 -3280 -2564 -1309 -3069 -3440 -4998 -5301 -2456
14220 -2456 2450 3638 3002 2017 -232 486 1719 1940 1139 -106 -2734 -1191 30 -2189 -2085 4202
14204 4202 4100 677 -32 -1343 -1175 -1745 -3645 -3081 -4655 -1422 3223 5698 9326 7945 3131 -1713
14188 -1713 1510 1382 595 -1277 -3676 -7792 -6627 -5368 -5928 -5447 -3823 -4261 -6499 -8369 -6473 -4558
14172 -4558 -3695 -1519 -1284 -2416 -6487 -7211 -2108 -291 -488 -1014 -2700 -3965 -3563 -2985 461 3900
14156 3900 5324 2096 -3139 -1058 5254 5305 1051 -1163 379 -6170 -8067 -7907 -8951 -3440 991
14141 991 2632 -770 -3316 -4994 -7043 -6184 -3513 -1457 1027 -178 -2233 -521 -567 -8665 -9395 -6298
14125 -6298 -6492 -2838 -1294 -1476 -1265 -2996 -6497 -7456 -5974 -7270 -6158 -5572 -6103 -3618 461 -1688
14109 -1688 -3032 -1529 -1227 -1315 -1014 -623 651 899 -2701 -6062 -5729 -1662 -410 -2979 -517 -1383 -4387
14092 -4387 -4106 -629 -905 -358 -3189 -4077 -3742 -4223 -8260 -11088 -10327 -5115 -1833 -2426 -1655 1644 1205
14075 1205 -2264 -5716 -5279 -2803 -3778 -5480 -4345 -2353 2314 2178 4123 2119 -1253 -3332 -1351
14060 -1351 7 -2420 -7253 -10087 -8229 -7262 -5443 -1881 -1079 -3417 442 252 -1948 -3540 -6657
14045 -6657 -8927 -7113 -5666 -2911 339 -1909 -3825 -4760 -5490 -6614 -7049 -5646 -2265 -13 -233 717
14029 717 764 -1336 500 -3616 -5664 -7074 -6145 -4316 -2033 -3734 -5895 -6424 -9303 -5582 -5072 -4674
14013 -4674 -2333 84 797 12 -977 -1378 -1174 -4493 -2708 -939 -4642 -3022 -565 1126 552 -5580
13997 -5580 -7504 -6479 -1878 -845 -3373 -3763 -3600 -3700 -2865 -1504 -519 1711 -2434 -6587 -9408 -7694
13981 -7694 -7496 -8865 -5593 -3719 -2406 -1585 459 797 -4525 -5505 -2364 1363 -2908 -4266 -1733 -2735
13965 -2735 -4824 -6234 -9064 -8926 -4385 -1552 -2174 -2243 676 1766 960 -3735 -6929 -4588 559 2106
13949 2106 500 1561 944 -1214 -3374 -2943 -1654 -3359 -3664 -3775 -3399 -4065 -4692 -5244 -1739 640 -1719
13932 -1719 184 -412 -354 1498 3105 3719 1519 -79 150 1421 -697 -5112 -6187 -5899 -3344 -1527
13916 -1527 -3142 -4330 -7729 -7575 -7493 -8902 -8431 -6550 -6268 -7345 -5281 -4796 -6311 -5950 -6126 -7322 -5399
13899 -5399 -4064 -1732 815 55 -4201 -5438 -4579 -3750 -4545 -3458 -4941 -5240 -1729 -1715 -2146 -3869 -4363
13882 -4363 -607 -1945 -4452 -3715 -830 -4000 -3201 -2058 -545 419 -3677 -4927 -5452 -6650 -4993 -4523
13866 -4523 -9258 -12037 -14532 -14183 -12098 -10449 -6626 -3930 -3733 -3331 -2072 26 -1779 -4887 -4531 -5239
13850 -5239 -5248 -1483 3616 4608 1864 -370 -1776 -429 520 -3265 -3303 -6974 -7835 -4498 -3516 -3499 -2062
13833 -2062 -3811 -3805 -5072 -10199 -12170 -9926 -8253 -3425 24 1245 336 128 1864 12 -491 1354
13817 1354 1589 -224 -1085 -2571 -2796 -2321 -3169 -3661 -4880 -4923 -3699 413 -223 -3330 -5872 -3265 -1408
13800 -1408 -1772 -120 -2765 -5208 -3720 -3741 -3101 -2725 -3596 -4247 -4942 -7773 -9816 -7698 -5301 -2379 1172
13783 1172 -1783 576 3692 5682 5488 2833 85 -1091 -2173 -3589 -940 1002 4012 3118 1692
13768 1692 1298 -300 -2388 -4514 -5631 -3645 -1706 -3331 -6080 -7183 -7206 -7090 -5448 -3463 -1421 -731
13752 -731 -395 -356 -1629 -578 -859 -2793 -4443 -1803 924 -1563 -4042 -2660 1540 2295 4426 3556
13736 3556 701 -2110 -1644 105 -2466 -3540 -4508 -4611 -5517 -6260 -6855 -5055 -2343 -2426 -3048 -2296 -766
13719 -766 -168 -1613 412 -1430 -3063 -824 3802 3418 -2303 -4025 -7736 -8411 -5480 -5823 -5269 -1721
13703 -1721 -565 -3305 -3955 -1929 -3347 -4609 -4326 -5216 -3871 -6555 -5479 -3786 -2750 -3272 -4712 -3718
13687 -3718 -3378 -553 -2334 -4853 -1896 2014 4344 -70 3075 8702 9421 16469 20421 19262 16908
13672 16908 12854 8913 6657 5035 -12 4045 4219 2294 1158 -2134 -4166 -2512 -2334 -5220 -6320
13657 -6320 -5581 -4149 -6869 -4897 -3330 -2865 -2683 -1967 -528 -3564 -1468 -1694 -2319 -1799 270 1446
13641 1446 -437 -3600 -5686 -3905 -907 -4235 -5283 193 4112 7099 10221 14308 13632 11313 8416
13626 8416 4639 4660 4232 3296 3431 2156 -1620 -1211 7 3239 1007 2224 2907 223 382 1704 459
13609 459 2915 6517 4964 2206 -384 -2151 74 385 -510 -22 -1534 -2328 -4492 -2542 257 1002
13593 1002 -473 -1300 -3180 -4227 -3811 130 -1386 -4099 -3556 71 3736 2461 -1271 -3418 -4104 -3079
13577 -3079 -2784 -6656 -6567 -567 277 -1942 -3143 -1421 -1347 -1273 1869 445 -1206 -3191 -3079 -2057 -1906
13560 -1906 -2545 -4738 -4064 -3558 -2956 -1184 -2185 -2763 -1653 -1565 -2107 -2128 -1958 -1915 -1738 -2937 -3095 351
13542 351 -355 -2884 -1171 -2018 -4878 -4069 -2062 -2464 -3803 -4628 -3675 -567 -536 -387 -447 -1236 -3584 -1324
13524 -1324 3280 2541 3721 1259 -738 -1676 637 -1270 -1738 -4774 -5717 -5814 -4496 -5254 -5023 -6558 -5973
13507 -5973 -2094 -4356 -4533 -4908 -6294 -6529 -6923 -4654 -868 -2190 -3647 -6711 -5724 -4007 -4377 -3611
13491 -3611 -5918 -10558 -12383 -12119 -8685 -5380 -7212 -4407 -1015 736 -1762 -5823 -3869 -5018 -3405
13476 -3405 -1810 -5979 -7666 -7007 -1838 2548 6934 5045 1972 -1315 -1950 -937 -1537 -2542 -4452
13461 -4452 -3363 -1015 -543 -3284 -4439 -1470 154 1396 -567 191 1043 2790 871 -3544 -4699
13446 -4699 -3893 -2188 2460 6190 7931 5200 3798 1838 -253 2034 1933 -2442 -4053 -5526 -6504
13431 -6504 -5096 -1450 -1491 -1440 -2617 -2074 -2164 -4646 -9130 -9064 -5750 -5090 -3302 -2395 -1644 -1370 -2209 -2441
13413 -2441 -5528 -6100 -4223 -4295 -4092 -7 484 -1894 -1673 -1778 1009 1721 -3286 -3506 -4780 -5256 -3136
13396 -3136 -2633 -1271 -487 -2077 -5430 -6135 -5916 -912 882 -1925 -5501 -5180 -6264 -2570 -15 -275
13380 -275 1335 2289 1044 -3216 -3553 -2752 -2769 1474 4011 3121 546 -572 -1407 -793 -1360 -1800 -994 -920
13362 -920 49 -141 -1206 -3901 -7224 -4095 95 2808 2857 2996 520 481 -155 2810 -307 -1299 307
13345 307 -444 -2051 -1080 902 2371 3036 -819 -5590 -8142 -6893 -6228 -4068 -2075 -683 -1627 -2725
13329 -2725 -1308 -1041 1535 1190 1117 -2026 -3752 -3335 -4035 -3992 -521 -738 -2370 -1206 -2749 -2285 -2073
13312 -2073 -1108 3921 2523 2928 476 -1338 1178 1256 1658 712 868 -1113 -2238 -785 521 1315 -1158
13295 -1158 -3031 -1783 3240 2571 2253 -69 -1875 -3098 -2457 -443 540 -537 -2273 -1505 345 3524
13279 3524 3580 -2257 -2091 860 1558 2502 1673 308 -4166 -3655 -1628 -4462 -3359 -2609 2173 2412 1741
13262 1741 1624 2182 4842 2774 160 -1959 -1803 -5352 -3727 517 120 -3537 -8780 -7131 -2621 219
13246 219 1465 730 -140 -2965 -2963 -2873 -1665 -3150 295 -1155 -2345 -1146 800 1536 -838 -1079 51
13229 51 -246 -748 -3832 -4719 -3317 -1527 3 2003 2618 1817 2037 -948 407 3609 2433 1920 -2008
13212 -2008 -3901 -1669 -113 2494 7320 11040 9785 5443 -1109 -2962 -2746 -1772 -649 1244 3204
13197 3204 3419 4866 6421 8639 6419 3536 1179 1147 -701 -1490 -1653 -3528 -5356 -1877 -2297 -3613
13181 -3613 -3856 -4984 -3772 -3995 -4670 -5431 -6568 -4289 -2148 -5773 -4494 -1186 -1364 298 2234 1442
13165 1442 559 4815 5027 4563 289 -4030 -2471 -875 256 -1049 -1523 669 216 831 -2720 -4411
13149 -4411 -3606 -696 -3359 -3114 -2819 -4881 -5469 -1588 -1225 -5538 -6582 -4495 590 -259 821 1993
13133 1993 -759 -3476 133 893 3365 5288 3233 2617 1558 512 850 -840 -1888 1227 1408 1609
13117 1609 1862 619 -176 -1721 -2198 623 2719 1460 77 -2844 -221 742 -298 -1112 -3245 -3067
13101 -3067 -4428 -5980 -6712 -3675 -2071 -4462 -4350 -2096 116 1641 1627 -1073 -2574 -818 1525 460
13085 460 2145 2963 4265 6195 3668 -1898 -3476 -2454 -2197 -2219 -1504 -2675 -4761 -4215 298 1271 484
13068 484 2423 1097 243 -4833 -7611 -6862 -2166 188 1168 -1727 -921 2176 7106 6935 2669 -2540
13052 -2540 -6988 -7805 -4158 -4591 -7897 -4929 -2453 -1879 -507 -312 -1418 -3161 -4566 -5148 -3775 -1371
13036 -1371 -1796 -3224 -2818 -1353 -1621 -5593 -6950 -5363 -5816 -6049 -5968 -4942 -3747 -2937 -5618 -4737 -18
13019 -18 53 -1127 -1656 -5153 -5849 -3573 -4878 -3452 -748 -110 1083 -92 -2520 -2002 353 423 628
13002 628 1614 1520 2397 4697 5115 4579 5253 5563 4005 2312 4193 4100 5480 5969 7095 3220 -1048 -5
12984 -5 -1343 601 5559 4511 -1201 -3613 -1167 -431 4514 1876 4134 4680 5488 4866 6651 7882
12968 7882 6550 4447 2743 -757 -1897 71 5018 4865 3241 2041 2662 2125 4773 5902 1352
12953 1352 2521 5666 6246 5314 4951 5365 3178 2151 800 -2028 -3528 -961 -2235 -2080 -1625 -946
12937 -946 743 5533 8333 5806 1673 -4175 -3602 -1631 1035 1808 1605 4511 8728 9269 8149 7473
12921 7473 7710 6704 3407 5393 4057 -232 1001 90 2142 4752 2435 2134 2369 166 -2528 639
12905 639 3072 3264 -308 367 1562 2326 -16 1030 3098 2239 -582 -852 -130 4393 7780 2698
12889 2698 -400 -606 -2751 -3982 -3285 -2770 -443 1731 4458 2592 2775 5075 6425 8497 9754 12276
12873 12276 12665 11796 12354 10955 13506 18025 19244 21207 31666 37814 49555 69356 99739 146519
12859 146519 222302 294980 295261 233828 154760 97911 67507 52382 41898 34610 27090 23473
12847 23473 22157 20984 20612 19038 17230 12769 11511 12305 17547 20692 28106 41381 51582 51461 53818
12832 53818 53472 45549 35716 27151 26092 26084 23598 19622 17924 14699 12996 12023 10673 10264 8687 9291
12816 9291 10610 13583 11169 10125 11058 13626 16133 13731 16200 18703 21380 26281 29586 28486 22236
12801 22236 14994 10178 8471 8465 11389 7713 4629 4469 7476 8758 13714 15328 13332 13685 14170 15219
12785 15219 12480 11606 11777 12083 12114 13011 15267 18251 20828 21213 21673 21787 22405 19784 20180 22719 24175
12768 24175 26039 29101 29691 31260 30775 34914 45125 56975 68545 84570 109251 135787 148829
12755 148829 160858 186449 232383 313391 450883 675460 1058295 1694717 2395104 2495778
12745 2495778 1994930 1353535 839227 540845 380087 288671 229003 186466 157477 135737
12735 135737 122925 112317 101344 91027 79257 66848 59257 55231 49096 44751 40974 35920 33553
12722 33553 31543 30228 27974 27263 26120 22768 22023 18903 18576 20979 20435 17770 13481 13138 14247 16519
12706 16519 17109 13730 12811 13321 16833 15247 15032 14832 16996 17571 14534 12200 11833 13118 9792 5295
12690 5295 5414 7545 6208 5463 6520 7077 6692 3935 4300 6025 8987 10651 11582 7749 7496 7709 4218
12673 4218 2734 4387 5563 8492 10622 10349 10854 8545 7835 9041 10913 7441 5253 4707 7897 6219
12657 6219 8892 12213 15312 15911 15124 15214 14129 10687 10452 7609 6052 6948 9498 12423 13374 11247
12641 11247 8725 6790 7171 7806 6558 5478 5036 4297 3501 1605 2815 3837 2991 3437 4207 2721
12625 2721 3499 1847 1872 749 -3806 -2571 -1362 1320 2432 3440 3562 6639 8633 9786 11292 9439
12609 9439 7929 7359 9097 9771 9395 11368 11780 9878 5886 2244 159 3278 7557 8335 8783 11019
12593 11019 16119 14457 10968 9840 8482 5021 1465 2029 2990 5148 6514 8171 8458 6680 10031
12578 10031 8776 10084 10472 10198 9639 8633 7226 9763 9193 11562 11228 11486 10197 8608 9642 11716
12562 11716 13723 16919 22371 28316 26703 26394 32328 44863 68142 101655 150408 201445 208784
12549 208784 174925 127995 92050 71437 55782 40756 34280 29356 26003 23982 23000 23056 26547
12536 26547 28676 30413 38191 47636 57618 65120 60550 52347 40188 31930 25682 21282 19173 20125
12522 20125 22660 21552 19750 17447 17661 15777 13870 15276 17068 13706 12460 9291 8872 10663 8895
12507 8895 9579 11721 14892 15309 11815 6725 7319 9987 13840 14875 14526 13859 14920 13908 15472 22301
12491 22301 28230 37453 48049 47510 41243 29655 18595 14474 15714 13220 11853 11418 12981 17543
12477 17543 16704 14040 11297 12787 14060 10823 9268 9885 13182 11136 8622 9231 9579 9897 10200 8745
12461 8745 7550 9726 11004 12302 11041 8544 8689 12003 11884 8627 6139 5343 6250 7006 6170 4943
12445 4943 6072 3607 4846 3490 619 601 -141 -543 5587 9234 5986 3331 3885 5127 5412 3051
12429 3051 5220 6903 10075 12785 13223 11610 10071 8839 8641 10502 8625 6879 3748 3994 4199 6110
12413 6110 5106 2094 4589 6783 5664 9225 13181 12931 10689 9611 7578 5335 7305 9191 11348
12398 11348 7046 4624 7039 7996 7449 7018 6706 8389 10406 9234 5904 6446 4045 188 1988 7164
12382 7164 8342 9818 8109 6683 6429 7837 9183 9390 8658 9635 10970 11552 10946 11646 7618 7349 8445
12365 8445 7601 10617 14644 16568 17530 11944 9007 8831 10384 9901 11502 12070 10856 9598 10878 9157
12349 9157 8552 10219 7605 5818 4956 7273 7645 5811 6778 7877 8245 9338 10446 9989 9275 9767 12893
12332 12893 11994 9110 5242 8420 11111 10148 8325 10953 9577 11556 11475 11590 13156 10834 10203 11302
12316 11302 11201 9973 7335 3700 5891 8384 8963 9874 8644 7596 7026 8241 11110 10677 5885 4420
12300 4420 6652 5731 3772 1843 6514 10078 10928 10782 8565 7508 3427 9101 12148 9184 12147
12285 12147 13738 14856 13191 9675 10585 14318 20688 23339 21100 16520 11557 10456 12267 11142 6614
12270 6614 6049 10577 13661 14349 13070 9656 10280 11849 12788 10882 10411 11362 10417 7479 8653 9439 8248
12253 8248 11296 14749 13940 12999 13089 13035 9966 7933 10010 8368 7073 6303 6077 7146 7760 11995 13106
12236 13106 9727 10726 15157 16108 11557 10297 11138 12191 12879 13796 15119 16243 17484 14583 13593 11610
12220 11610 14936 16999 10767 8503 10172 13464 12124 9857 9554 13255 16837 16443 16245 13306 10259
12205 10259 11603 14168 12601 12825 14659 15561 16505 16903 16681 16798 15270 14661 18046 15899 11018 12826
12189 12826 15110 14941 17623 17504 18157 17823 16791 15131 15442 15107 14198 13517 10912 13435 11819 11448 14841
12172 14841 17117 18227 17316 14970 13379 12798 13340 15034 15863 18856 18818 15667 15766 15095 15812 15536 16390
12155 16390 16238 19111 18858 20931 20786 20024 20242 20391 23812 24880 25699 23286 22131 21786 18666 20012
12139 20012 22050 21909 20551 22430 22057 21066 21340 22132 22329 18664 18469 17710 19874 19528 20224 20049 18642
12122 18642 15908 16769 17552 13892 15721 19868 20833 22566 18025 14555 14500 16418 18287 20745 21918 20675
12106 20675 19421 19351 20124 20983 25150 28882 28935 27272 24398 21441 20789 22636 24440 23407 19076 21314
12090 21314 23687 26451 24196 18391 20791 21840 23413 26598 30216 28370 27938 29385 27978 26252 27643
12075 27643 25391 25678 27794 27437 24712 22681 23809 23422 23302 25313 23015 19580 22538 25832 28291
12060 28291 29756 25052 21631 22648 26046 24709 23395 23793 20619 21024 18831 19229 18867 18651 18324 18423
12044 18423 21902 25529 27404 23822 24960 26135 23830 18966 17554 22639 24607 22449 17250 18768
12030 18768 19592 21618 23615 25503 24422 24817 20636 18630 17027 18711 19569 20587 20937 21913 23862 26408
12014 26408 25254 23619 22214 22727 25213 21053 16451 15120 17790 19031 18498 18268 18697 18511 20885 19568
11998 19568 17622 18847 18388 14276 14573 15788 14045 12081 14294 16838 20293 21499 17826 18532 20387
11983 20387 20380 18494 20629 21529 23935 25622 26014 25869 20035 17123 18661 20020 19636 17608 17473 18574
11967 18574 22569 26748 27905 25182 23580 24757 27178 26910 23588 26812 26660 26696 23733 24074 25440 27846
11951 27846 28291 28029 26497 27934 24433 25250 26059 25603 23559 24376 25259 26125 26483 26568 25195 23986 26622
11934 26622 27124 30384 30189 29949 31410 31449 27165 22291 18580 14621 17200 22796 23862 26278 26678 27443
11918 27443 27142 22133 17570 22188 25473 23685 22505 23864 23813 24024 26094 22898 21679 22285 21312 19342
11902 19342 22004 24860 24174 21237 22037 25046 27739 28836 24152 23157 26137 29186 29992 26872 27504 31525
11886 31525 31084 29418 30422 30256 27900 28102 31646 34181 34869 34724 34326 32232 29632 32034 32192 31824
11870 31824 32727 31277 28011 25660 31764 37494 37650 36944 38415 40326 43592 47345 50624 57718 71659
11855 71659 87471 101181 122508 151018 181432 208083 229190 247757 261272 278725 300491 321844
11843 321844 335867 336730 325330 303067 280411 270072 259696 245606 218979 186412 154273 126795
11831 126795 103596 88402 78418 70002 62932 57210 55886 53284 50018 49059 48272 46236 42564 39924
11817 39924 37901 36638 34601 34837 35326 31044 27660 24860 25699 27139 26139 25584 24043 24544 25603 27265
11801 27265 25735 24893 28051 28721 27236 26557 25990 24503 24007 26458 29046 29404 27360 27281 31438 29475
11785 29475 27915 27938 26206 24063 24912 26635 24643 21340 22126 20881 18216 15072 15027 19048 24011 22442
11769 22442 19907 20834 22414 26083 25573 20444 18732 23142 26445 26759 29827 29832 27552 23074 22389 23584
11753 23584 21979 20338 16799 14580 13562 14977 16996 18692 17905 16801 15105 17494 23519 29722 30793
11738 30793 28580 28104 23641 19901 17544 15246 13311 12590 14224 14711 16394 13491 11269 13806 12313
11723 12313 13836 15980 14809 20080 20731 15919 15739 14579 19728 24852 28675 29530 28419 28374 27769 25101
11707 25101 24168 23744 23112 19546 19731 21471 18387 20341 22555 24787 25788 26314 24847 22546 17993 18006
11691 18006 22341 23748 24008 26778 33596 38620 40185 42731 48714 53220 55575 58904 60172 64568 69593
11676 69593 73089 72698 70574 68223 62429 57926 53916 55284 57754 56444 51282 46679 43011 37603 35129
11661 35129 34371 33769 35210 32602 32745 33248 29756 30330 28620 29084 30987 34142 33890 33114 33508 36681 39923
11644 39923 40659 42915 44917 48146 53136 50594 51013 52541 56942 60253 64560 72637 84514 99925
11630 99925 122266 143087 163162 180294 188278 187026 173157 152234 128194 110911 96082 84664
11618 84664 75693 73062 73581 71209 70620 71855 70274 70118 66160 63484 62382 55826 51125 48634 49262
11603 49262 48428 46054 43801 45556 42562 40221 40118 38867 35803 34555 30046 29367 28304 27555 25053
11588 25053 23113 26440 33672 33959 29795 26755 30691 32075 30264 30302 33143 33796 35725 35203 34570 34429
11572 34429 38165 41252 41888 41389 42816 44997 46511 47689 49390 52476 59453 66186 73808 80839 94060
11557 94060 103774 116810 133453 153507 179265 219860 272144 335826 392461 434376 458946 474766
11545 474766 497350 535921 581958 615012 620818 594609 548278 502346 471583 456995 436617 400659
11533 400659 347296 286535 234492 194240 168904 149630 138621 129456 122375 115852 108279 103875
11521 103875 102370 104809 111045 110776 109950 111244 111783 113107 115095 115216 113856 114931 119212 121256 119442
11506 119442 120415 120392 119174 119520 118457 118368 119837 117670 116989 117853 123192 129890 131424 131423 136059 139088 140387
11489 140387 142536 148089 152888 156653 164605 171348 178465 182392 184960 190414 200779 209845 217981 227095
11475 227095 236867 244633 257724 269484 285406 302261 315564 328836 341362 354500 367244 384379
11463 384379 400187 413270 430607 450590 477855 501784 534681 570817 611897 661427 726268
11452 726268 807021 907252 1026862 1165757 1312089 1480322 1681204 1922377 2200925 2521780
11442 2521780 2889917 3333912 3876045 4560420 5455056 6661453 8351357 10794927 14372835
11433 14372835 19433988 25810379 32392880 37634758 40755980 42442576 44487661 48219869
11425 48219869 53292882 58015135 60383530 59335268 55425343 50402273 46296043 43989798
11417 43989798 42548226 40191331 35774646 29638779 23194441 17699189 13632655 10843460
11409 10843460 8944283 7588490 6557489 5730911 5044636 4470278 3991090 3580784 3217976
11400 3217976 2887891 2588598 2320936 2088004 1887695 1704825 1540364 1393817 1271224
11391 1271224 1168758 1083297 1012023 955636 906343 863977 830061 805921 794262 798356 823544
11380 823544 877540 951486 1033640 1115605 1183157 1225903 1252261 1280105 1331502 1403865 1476786
11369 1476786 1511418 1484601 1407321 1308665 1216479 1154485 1106653 1039206 940813 823754 709042
11358 709042 607044 527001 468888 426394 394699 369544 353948 345369 337532 328622 321497 315249
11346 315249 314538 325763 347218 381570 434117 502920 576857 637580 669829 665326 627170 562382
11334 562382 481379 403600 337705 292226 260577 234627 214755 202826 196483 192163 183984 178912
11322 178912 172782 167797 164352 163006 167412 174733 184345 194411 198394 188576 170272 157185 150430
11309 150430 138927 133222 128736 120372 111112 106402 100653 98330 98142 92312 92541 93079 88159 84546 83203
11294 83203 82058 82638 83827 78403 77417 76556 78814 81041 83336 82787 81654 82852 80032 78542 79805
11279 79805 79709 78569 77615 76666 73099 69236 66825 68666 69770 68322 67497 67239 63426 61200 61709 59971
11263 59971 59177 59617 60172 60703 60044 64263 66107 64245 61277 60379 57345 57037 56310 52598 53870 54863 53760
11246 53760 47958 45595 44842 40493 38500 32075 28303 30924 35142 32634 28092 27431 33263 34930 37393
11231 37393 39128 41894 44491 45542 44986 48554 53476 60078 64103 69071 74485 83950 97343 114478
11217 114478 143717 183860 234148 308249 384931 437417 462937 467770 464638 442964 394372 324693
11205 324693 251732 194268 153052 123505 101967 86633 77925 68402 62256 57764 55832 52240 48411
11192 48411 45989 44156 40613 32675 28778 29638 29596 32641 33753 30417 27629 23755 20536 20988 25425
11177 25425 25723 24594 27115 27397 25976 26645 27067 29257 28426 27367 28460 27826 27220 24301 23241 25700
11161 25700 26169 25568 26516 26553 26087 25458 25829 23123 21550 19401 19257 18365 16883 14494 13246 15793 17325
11144 17325 17017 19491 17509 15492 18711 16384 13027 17081 18444 13766 9832 10167 10028 9166 12332
11129 12332 12586 16081 21948 23818 22760 24551 26780 28000 27043 25379 22619 23044 22265 21760 20176 20288
11113 20288 23447 23912 24005 24194 23007 22453 21068 21108 16409 15691 15636 12386 13936 15174 13285 14622 16072
11096 16072 18311 18990 15031 14605 13606 11984 11367 10880 8951 11513 11733 12735 16339 19063 19782 18458
11080 18458 17279 16850 12491 11371 11993 8092 8394 13499 17486 13787 10975 9073 6884 5988 5104 4522
11064 4522 3168 8653 9629 12870 12932 10766 11795 12829 13216 9549 8142 9178 12346 12132 17269 17904
11048 17904 17592 15094 14751 16998 18958 17804 17176 14578 9408 8195 6116 2797 4165 7451 6936
11033 6936 4608 5415 9134 11932 10694 12858 17400 21214 21418 22684 17598 17642 16205 16020 17796 20580
11017 20580 21971 24435 27145 31050 35177 41428 55006 66937 80039 101273 129293 162761 193618
11004 193618 217468 232777 244576 260871 278759 302483 323112 330138 314781 289743 267668 252571
10992 252571 241986 227771 209957 182124 152088 122379 97174 80701 67158 57021 48120 42656
10980 42656 37625 32610 28755 27687 25999 23893 21620 22091 22595 20228 18717 16341 13482 12064 9554
10965 9554 9605 9138 7320 7293 9004 10242 11108 9562 11245 11908 11006 7919 10314 8780 6700 7847 8689
10948 8689 13739 15121 16983 16406 13883 15025 11777 12383 12374 14922 18721 18133 14220 12704 9072 7348
10932 7348 10063 9650 9876 12761 12895 9291 5016 4130 7128 7490 7987 5198 6615 8180 6125 5539
10916 5539 5239 3703 3807 3795 4346 7923 10885 8464 6108 1999 -114 -31 3338 880 1492 8822 7467
10899 7467 4762 4901 1756 2567 2624 4265 3974 3312 2451 3010 5500 3815 -237 468 4429 3459 4218
10882 4218 4769 4871 6004 6172 5280 4152 3934 3114 -309 -3498 -1497 1843 1449 -831 -3990 528
10866 528 5146 5409 3112 3140 5297 5011 4292 4591 6225 10481 8287 8666 9531 4710 1713 3790 6719
10849 6719 5368 6218 4945 6345 6151 5040 1728 -673 -1202 1191 2232 4388 5629 9076 6327
10834 6327 4737 3709 3980 4375 5198 6260 4954 4380 1636 997 4491 8944 9927 7509 12953 20422
10818 20422 30345 34694 26232 12740 7092 6374 5461 344 1778 2650 3871 5075 3364 4841 8209
10803 8209 8526 4005 3765 4667 5444 7400 7757 4252 -596 672 1205 2744 3312 2586 4414 5517 8940
10786 8940 8729 6766 5249 2987 2005 2659 2669 2649 -966 -1898 -635 2270 5733 6582 4243 3471 3988
10769 3988 5619 6406 7015 8058 6394 7525 7543 4990 4836 1013 274 467 3986 5705 2864 -841
10753 -841 -127 775 3473 2664 1204 87 -98 2127 2383 1160 -249 -3996 -2948 -947 783 -155
10737 -155 -2539 -459 3554 4022 3037 4671 5461 4879 2280 2497 2232 461 -626 -1523 -3280 -615 1007
10720 1007 527 2398 2355 4159 5277 4345 2754 1014 3892 4300 1199 2235 4490 3639 2831 3141 67
10703 67 399 -594 -813 -461 -492 -900 1681 2764 2015 5191 6933 2883 -2071 -6425 -7799 -3924 -507
10686 -507 -2213 -226 5143 7434 3695 2284 4389 5687 4240 3976 2281 -2333 -1096 -510 -355 970
10670 970 2536 2964 1021 -2167 -3593 -2677 -4106 -1578 1369 2809 2153 2787 3403 1032 -2580 -1061
10654 -1061 178 2608 4079 2782 3116 4905 3341 2648 4801 4834 1411 606 758 1327 3308 4442
10638 4442 4317 3568 1291 563 -2208 -3148 1591 7204 7727 3339 2176 8088 11200 9896 6308 8399
10622 8399 7837 6064 4777 8904 11733 10235 5973 6166 7553 6715 4378 5774 7611 4595 7849
10607 7849 5765 3592 3792 3949 2248 -3209 -5333 -4990 545 6899 8665 11004 10531 7889 7652 10859
10591 10859 10763 10404 7019 6258 8819 11135 9498 4959 2350 3176 5612 5929 4619 1045 21 -553
10575 -553 358 5694 2092 -627 -3524 -3259 1860 3294 3880 170 -4428 -4028 -1850 -101 1527 4546
10559 4546 9660 8931 5862 5634 6753 6162 4784 2065 -1613 -2489 -1952 1595 8501 7485 4025 6008
10543 6008 7413 7985 5685 5294 4694 6465 9337 9457 7283 1712 2628 3881 5255 4906 3325 -99
10527 -99 -1425 -1043 518 1414 1867 2410 3655 3312 4146 3854 4135 3715 5706 6223 2035 -1276 1849 2983
10509 2983 -280 -879 -1970 -112 -1641 -4634 -2626 1379 3387 3989 1564 -3896 -4516 -664 2669
10494 2669 3519 4362 5126 3066 4201 5669 1028 1343 5101 6956 8704 6113 3939 5496 5184 2006
10478 2006 2123 2193 1332 1923 3774 7128 8953 6570 4533 2726 688 1040 3366 4565 1447 -1559
10462 -1559 -888 813 -2514 -950 -1308 11 856 3968 4235 1181 2150 1577 3815 3032 4325 4004 3241
10445 3241 885 -52 -437 1158 3485 4292 6299 5166 5144 7522 5048 5758 4550 3452 3587 2268
10429 2268 -1232 -2252 963 3676 3181 4205 2771 1851 1603 -1727 -95 1343 639 -1236 100 1586
10413 1586 70 -2442 -2335 2436 3639 5882 3043 773 -305 -3340 -4553 -1443 -822 -141 1569
10398 1569 2184 700 1464 4080 3249 1393 1203 -272 594 985 1694 1208 3099 5020 4951 3272 1537
10381 1537 2285 3794 -589 -1932 -838 2313 1097 279 4167 3994 3239 2648 3359 986 -3715 -5707
10365 -5707 -7521 -4331 -5411 -4700 -164 -10 -78 -841 774 3025 2995 3569 2279 781 2544 1844 -939
10348 -939 1212 -245 1613 2334 3416 4034 3254 4028 4456 5670 5180 4453 4998 6980 7092 8674 6157
10331 6157 5592 5145 5371 5239 1496 1274 4472 5839 8792 9069 7760 2846 5005 2855 3279 4466
10315 4466 1744 -1328 -78 2549 2210 1149 2792 4532 8300 7196 5395 3427 932 -2383 -5017
10300 -5017 -6133 -3513 -1768 -2700 1929 2172 142 -1850 -3368 912 5930 7892 8502 9761 8246
10285 8246 5233 3242 1798 2694 3958 4287 3174 5311 5664 5395 3080 4407 3536 3743 7274 12226
10269 12226 12376 17145 14931 7179 7657 6639 4199 4557 5079 3452 3512 3128 4366 5811 6848 5480
10253 5480 1562 994 782 1679 3517 3304 -132 -1154 -2023 -2734 -342 3223 1423 -4193 -1064 -3508
10237 -3508 -3577 -3589 -6508 -6973 -2013 1277 4737 5145 7098 8365 5086 2247 -342 -480 3058 5450
10221 5450 7446 6147 4986 4137 3841 5795 2961 755 967 858 2463 4817 6797 5846 4745 3509
10205 3509 2033 1372 -1644 -243 531 1076 2342 3866 4462 5528 3406 1117 2003 936 -82 -920
10189 -920 -2433 -3551 -2303 -2648 -1450 1095 514 6 3089 2932 -1632 -1710 898 1172 2905 4524 2457
10172 2457 -2035 -2847 2307 3423 4397 4118 6281 7067 5148 5135 6992 9692 11976 10693 7417 4686
10156 4686 2394 -1767 -146 2341 3390 3834 3263 3466 5311 5267 4038 1465 -1408 -3177 -3225 287
10140 287 297 470 258 1643 1275 210 1556 4839 3540 -1653 -2315 843 3346 3991 5112 2123 -1022
10123 -1022 264 -1673 -2634 -1243 336 2017 2238 1208 2828 3164 2328 341 -446 1447 2899 3437
10107 3437 1988 127 368 -6096 -4800 -2104 1079 4361 4292 2986 3508 1965 1539 1191 777 588 -832
10090 -832 313 2301 2715 4705 4256 3620 4336 2176 3554 4072 3873 1508 2949 3164 2053 -712 -895
10073 -895 -469 1402 -749 -1727 -1370 1662 2984 2186 2925 2724 2625 3350 1731 2109 -86 713 4531 5587
10055 5587 5743 8656 8260 7093 7973 16786 26902 40327 68022 119399 167738 159049 117252 76365
10041 76365 44369 30065 23466 16630 10952 7032 7106 7999 5704 7849 7776 4894 4069 6067 5994 5219
10025 5219 5856 4680 6382 3592 2642 2794 3731 2834 -788 760 1615 2223 757 970 3607 5162 9784
10008 9784 9734 8927 5238 1640 -640 -1271 235 -1132 -2632 -5255 -4685 439 4393 6875 7673 8190
9992 8190 3664 5028 4830 3123 3459 7690 6696 4953 6007 6670 8691 4946 4244 4044 2497 2458 -491
9975 -491 -1923 995 2748 2312 -4388 -4536 803 5667 3588 3469 4131 1796 2700 1593 1013 3311 4976
9958 4976 5504 5674 7440 6496 5279 9805 13353 11492 7381 6911 10045 8477 5572 5122 6219 4996
9942 4996 5482 5135 4774 5546 5073 4973 5600 4468 4711 9523 12417 15042 17006 13289 11118 10507 8490
9925 8490 6949 2576 -902 -1619 -3170 -345 3071 6310 7401 7718 5991 2381 2974 4047 3298 4144
9909 4144 4691 4538 2393 2131 4505 3555 2171 1152 1119 3259 5783 5772 4327 1789 3655 5221 7045
9892 7045 3977 1460 4005 5636 7775 10041 11118 9966 5621 2054 478 -2186 -3408 -83 1586
9877 1586 2081 1116 -1041 -2203 -6011 -11494 -10006 -4187 -1081 -1914 -3868 -3684 -4792 -5667 -2260 -653
9861 -653 711 4219 7566 6494 5479 4965 5884 9723 10768 11224 10339 8505 3706 4410 6263 11900
9845 11900 14943 10520 8016 7707 10105 9918 8457 5035 4739 4209 5759 5496 8992 11530 11027 6521
9829 6521 6326 7833 7625 6974 6049 8839 10264 8748 8069 6699 3774 5475 9268 11769 11728 10993 10044
9812 10044 10866 12896 13759 12199 7426 8844 8255 9461 9624 4800 2920 6833 9979 8189 7220 7872
9796 7872 5406 3241 276 -836 -352 -795 1787 716 3824 5866 7771 9039 8773 7796 7292 6232
9780 6232 1169 894 3754 1588 3319 8706 10003 9061 6970 6249 4716 3131 2420 6230 11305 10755
9764 10755 7277 6890 6822 8939 10664 7416 4454 5101 7164 7213 8380 10277 10189 9617 8298 5480 3125
9747 3125 5640 3208 4135 4378 5739 8394 7322 4771 -156 756 3939 4921 865 1284 5207 5782
9731 5782 8328 12314 12725 12944 12067 8909 9711 11028 10255 10784 10499 10849 10912 8797 8291 7159 7902 9532
9713 9532 8032 5707 4021 5956 6917 9604 8313 6981 8001 5248 4630 7160 9353 11793 11655 11641
9697 11641 13392 16710 18999 19431 18700 19056 20718 20102 16671 16098 15606 18710 15770 14886 15789 14548 14725
9680 14725 14900 12436 6284 8698 11330 10977 11360 10562 10932 11021 11842 11778 11970 12708 10710 11610 13921 10303
9662 10303 6274 7597 12006 10798 11872 12474 11870 11264 8468 6272 10007 10734 9777 6892 3409 3895
9646 3895 8630 12265 14234 14930 17813 19833 17045 15327 11849 9640 13100 13709 13852 15182 16985 16801
9630 16801 13036 13248 14168 13943 12729 11178 11516 10948 8328 12328 11503 12484 9901 11075 10731 8479 8621
9613 8621 6428 5945 9760 13510 11144 8751 14044 17251 17487 19922 17710 17786 18669 19021 20610 25403
9597 25403 26513 19323 16916 17796 14883 12709 15018 13426 14834 14680 13684 16801 19068 19625 19120 17366
9581 17366 13627 12507 12777 11291 11066 14139 17739 23237 25977 27916 26874 25993 26143 24151 19442 18410
9565 18410 18939 22050 24729 24407 25596 32117 35021 34197 33856 32124 30317 27776 24118 23630 21799 19545
9549 19545 17464 12878 12982 15975 19170 22072 19796 17650 16989 17059 18462 19019 19501 23046 25815 28353
9533 28353 30617 31230 37550 40864 39719 35233 32095 32238 32269 27489 23892 20828 21170 21375 20411 22559
9517 22559 28037 30315 31588 30141 30351 29357 28981 29318 27883 26705 26343 30460 31240 31090 29829 31210
9501 31210 30529 30304 30957 30076 29572 29725 30593 29901 25676 25535 32140 35040 35849 35439 37440 33722 30947
9484 30947 29419 30294 31315 31869 32066 29054 25410 26209 29445 35711 38978 37938 41400 42789 42467 45942
9468 45942 51941 57629 61094 64882 71464 84875 98217 114241 132158 154651 180261 207242 248226
9455 248226 311304 408577 538092 691999 868852 1056401 1222793 1332784 1374039 1338033
9445 1338033 1224634 1057160 874179 699410 546449 426317 338202 276855 234758 203893
9435 203893 182718 165335 151291 139784 129043 120657 113751 106649 99682 85492 73999 67735 60345
9422 60345 52459 47718 46351 43411 39010 38013 39777 38104 33643 34634 38145 39157 42999 46705 45621
9407 45621 42467 39399 35244 33487 33109 33350 34615 36308 36847 35878 34365 32820 34996 33403 32831 33077
9391 33077 31615 33048 34449 34608 32320 34979 38673 42088 44620 42282 38215 33415 32167 30584 31730
9376 31730 32161 30156 26277 28289 30808 31473 31606 36871 43148 41760 39138 38167 35053 34162 34710 28229
9360 28229 15814 6491 -1430 -363 -16 3171 5318 3512 643 4974 18355 26319 25262 27337
9346 27337 29197 30220 36275 40568 42935 42738 41975 42812 42461 40123 40101 42306 43067 42869 41266 37734 37938
9329 37938 39925 41132 40302 43776 47910 48659 47972 49535 51266 52725 56988 58785 60044 61503 60429
9314 60429 58594 58249 61387 62823 68896 78943 88536 106481 124160 149397 189414 239521 284006
9301 284006 304652 291608 257915 214616 172113 142461 126240 116660 112542 103159 91931 85814
9289 85814 80361 79028 81901 85336 84229 86250 81197 68433 56340 49919 48409 51739 60279 72174
9275 72174 85727 93785 95746 99263 98998 99394 97670 98353 98361 99708 99179 95265 90075 91495 100393 107860
9259 107860 115734 119058 119553 112317 103826 95070 86435 81677 72661 70041 73194 76166 77375 79700 84058
9244 84058 86852 89650 94817 101328 111114 120787 131193 144631 155205 150889 136228 116021 101036
9231 101036 91726 88315 91980 92753 92718 89995 84105 77705 70602 65137 63620 68519 72678 75901 75831 74900
9215 74900 76144 78804 84720 82002 78052 73045 66794 63006 64842 77222 84667 89106 91036 93716
9201 93716 98309 102661 102832 99860 97761 96654 98389 98333 98724 97039 89772 86587 87434 92635 102604 110177
9185 110177 122767 142430 165271 183661 199006 219281 241584 268878 305379 352555 381740 378865
9173 378865 351569 311728 272758 243997 225636 211534 203915 199467 201593 210787 227754 249246
9161 249246 271501 291286 310807 330164 349410 374253 411318 468983 554722 658139 752141
9150 752141 791244 770023 719221 681008 663142 643511 624003 610941 614894 647359 713627 819703
9138 819703 987079 1245744 1641672 2240129 3038628 3758627 3934553 3471545 2708526 1996898
9128 1996898 1501419 1196067 1010234 892184 820376 782412 770818 775808 781139 771167 749219
9117 749219 721180 691814 670307 657462 655371 664074 680975 698014 707507 708322 700431 698658 705359
9104 705359 717388 734122 749129 763357 776043 792481 815530 853731 905574 963700 1017577 1074696
9092 1074696 1129968 1179026 1225192 1281385 1344343 1406892 1473465 1541648 1617208 1704969 1801649
9081 1801649 1900104 1998930 2108089 2235283 2393890 2585010 2806299 3050316 3329696 3661188
9071 3661188 4048372 4503229 5053626 5724665 6542205 7556815 8873345 10644034 12963414
9062 12963414 15705281 18439368 20873540 23353290 26633698 31563446 39083232 50527068
9054 50527068 68083433 95060602 135946654 195203523 269465165 333055470 350459145
9047 350459145 315351834 249989041 181147852 127237658 91502533 68838334 54103711
9040 54103711 44074852 36997971 31938296 28360263 25848289 23930553 22099368 20069573
9032 20069573 17956509 16128534 14889483 14150016 13346663 12068942 10483641 8955480
9024 8955480 7716418 6777892 6054759 5477305 5002518 4602470 4242152 3916580 3624309
9015 3624309 3374745 3155098 2954931 2768024 2596703 2448693 2315374 2205280 2111295 2022263
9005 2022263 1938881 1858578 1785795 1719391 1657106 1597587 1540026 1478562 1412345 1349401 1291212
8994 1291212 1238271 1189980 1146076 1104398 1062040 1019075 978587 947098 925067 908786 895117
8983 895117 879285 858498 838289 821731 806511 793399 778965 761511 743095 721727 691813 657910
8971 657910 627796 599362 579607 568285 555797 536381 510548 484975 463502 450702 443653 438653
8959 438653 436821 442225 443704 445750 443614 444069 455035 476130 508582 543406 562238 554279 521953
8946 521953 477361 437924 412093 397095 387918 380398 378700 391145 421061 454484 473441 461683
8934 461683 432482 403824 384627 372343 364350 350295 335285 321720 304739 277804 251249 231193
8922 231193 214373 209625 209082 209231 214051 218176 223542 228732 238401 252361 270945 285273 289671 286598
8908 286598 284132 281978 278425 270791 262535 257371 252789 250700 249965 247606 248545 251037 255669 261915 270899
8893 270899 286754 311877 337182 364304 395418 422321 445369 472413 517750 587890 699389
8882 699389 872008 1133008 1505832 1998725 2535082 2900361 2878635 2505027 1984240 1501704
8872 1501704 1137449 886295 717343 606312 533004 485401 448615 412364 364817 310596 261191
8861 261191 224617 199474 191943 190656 182542 176412 171781 166039 162881 157513 152197 148242 150085 148516
8847 148516 148400 146447 139491 130340 124565 117299 109878 96909 87157 84759 85313 88202 91431 93418 90246
8832 90246 87301 81796 78711 74093 71002 70607 68427 69814 71826 77363 88922 101085 111557 119571
8818 119571 120249 117545 110357 97592 81345 74402 73025 73327 75531 77114 76008 76300 74711 74453 68618
8803 68618 68277 72401 77805 83025 90622 101233 105625 106799 105847 98414 93178 85933 79162 76922 76626
8788 76626 76894 81388 85410 86547 87878 87737 85918 81762 75185 69472 68098 69274 70332 71192 75601
8773 75601 74494 70941 71088 74889 76801 77276 77402 77977 73194 68318 73175 80001 82613 80975 78939 74878
8757 74878 69580 66251 67256 67047 64941 64159 64179 69602 74956 76379 79372 87807 103146 113547 115405
8742 115405 107683 102590 108762 114592 117742 110614 101449 93694 87468 81991 76002 71908 68095 64432
8728 64432 66997 71932 75616 74875 75546 74345 73063 69199 62138 57821 51973 46274 40796 44899 46152
8713 46152 47816 50409 49078 50378 51438 53174 53273 52755 49633 48203 47049 50257 51819 50579 53138
8698 53138 50472 47614 45900 46661 45159 45903 41873 39283 39427 41518 45027 46292 45586 44547 44468 46632
8682 46632 51784 55186 58426 57065 55100 55798 60719 62646 59159 58459 58419 54532 54978 54258 52108 52598
8666 52598 54072 57579 62556 68797 74293 81707 95150 106853 117638 133627 153712 176512 203681
8653 203681 238008 294440 377084 488624 630308 800313 985209 1167559 1307826 1380127
8643 1380127 1381976 1307000 1160707 981724 803912 638648 500687 391956 317114 267648
8633 267648 236191 210276 190226 175103 159065 144919 132446 120214 113116 107279 103253 99228
8621 99228 88534 83421 81021 78118 71407 65635 64067 60752 56101 53431 48097 44295 39247 35851
8607 35851 39042 44603 47753 46055 43961 43598 43038 38712 39680 39947 41646 43580 44289 41798 43034 46887
8591 46887 46173 44545 42589 40183 37021 33590 30575 26626 26556 29018 30340 34618 33899 32580 34208 32718
8575 32718 30387 27535 26429 25646 25564 27194 27299 27951 28340 25353 25389 29066 32042 33390 36508 35356 32796
8558 32796 31421 30779 30519 30021 30987 32345 33052 31670 30514 31644 31844 27629 26517 27426 27419 22242 17277
8541 17277 14688 11937 9992 11864 15287 16258 16626 20017 20267 15795 16378 17884 15042 10892 7668 7359
8525 7359 10238 14929 18935 17547 14529 15302 20421 21910 21932 21047 20055 23393 20591 20689 22764 22703 23402
8508 23402 23493 23513 24259 22168 23410 21446 20766 15929 12717 10304 9998 10496 11234 13961 16880 17006 15836
8491 15836 20028 21915 19594 21475 23293 21946 24729 24897 23117 18124 17477 18241 19950 20771 20704 24642
8475 24642 27855 29118 30957 31986 29804 30178 27345 25126 24633 21433 20744 20400 19733 18988 17447 21434
8459 21434 22433 22179 21375 17379 16577 16976 18632 19181 15523 15539 21405 25858 23360 21771 18179 17328 20350
8442 20350 22797 24373 21010 19711 19659 16274 14705 14486 14512 14653 16137 13934 10759 11773 11967 11333 13849
8425 13849 13655 14281 15258 13033 14689 19245 17870 17659 15257 12089 11531 11978 12157 15754 17844 18273 17859
8408 17859 12356 13066 14030 13184 12798 12671 10135 10603 6829 4943 6873 8820 12119 12883 13007 13948 14599
8391 14599 13911 11804 16802 21943 21451 20197 21092 21067 20695 22081 20779 17228 15603 14549 16848 17646
8375 17646 14584 14896 13868 12883 10962 10761 8930 6006 7258 9704 15058 16054 15771 19495 18054 14881
8359 14881 13030 16959 17968 18863 19356 18578 18095 12892 7549 6682 8116 6323 6715 8744 7958 9407
8343 9407 11749 17035 15853 11996 12750 12822 12423 10174 9418 12987 14709 15938 14264 10995 12829 14215
8327 14215 10455 7994 7899 7400 7659 8767 12334 13024 10928 9236 10064 10203 11503 10902 11835 11088 11241
8310 11241 8825 8820 12032 15979 15081 15007 13456 11529 11934 15090 13407 13367 14284 16498 14603 13549 13768
8293 13768 14108 12029 9321 12240 12188 9223 11980 13138 14298 12890 13477 13679 16111 17477 18705 12461
8277 12461 13008 12327 9753 7459 4544 3445 5200 4838 5780 9682 14098 14262 12592 10110 10105 9873 11239
8260 11239 13022 15626 16643 14720 13949 14765 13619 11983 11024 12553 11644 7835 6609 9199 11581 12108
8244 12108 12908 11483 15733 16048 12321 10298 11675 17836 22046 17317 13167 12556 16602 16171 14870 18459
8228 18459 21241 18629 16154 16682 16336 17977 16306 17014 22433 20797 17184 15043 14584 14573 15121 14607 13724
8211 13724 15247 15846 13862 12340 12902 14286 14017 11360 6685 4589 5285 8312 11863 13172 12979 12631
8195 12631 13172 10303 10190 11911 11707 12119 13767 15715 17952 16270 12592 8162 3147 3868 8459 7858
8179 7858 9284 10686 9668 9500 13951 15911 15802 16464 17848 16007 15386 13795 10054 7517 9367 8376
8163 8376 6869 4560 6918 7880 11007 11378 11997 16555 16565 15484 13019 10326 12370 15722 13570 10697
8147 10697 10357 8349 10734 14417 18716 18604 18050 19681 20078 22225 19052 12089 10666 10922 12183 15518
8131 15518 17268 17438 18312 18758 17218 18657 23331 22469 20655 20852 20537 20510 19553 17887 14602 15742 19581
8114 19581 18607 21043 24787 24236 22828 20290 17252 19143 23179 24328 24116 22375 20805 21667 23797 23122
8098 23122 23851 28060 27188 24992 26732 28703 32566 29909 32266 30839 32314 32681 33174 36215 41176 49529
8082 49529 46056 43516 45305 45228 44584 44612 42238 39285 34647 36488 38797 38096 42180 44644 45262 45219 46007
8065 46007 48557 53054 56124 56839 58744 63172 68839 72884 71518 68722 63226 57178 54939 51498 47767
8050 47767 44367 42371 41928 43072 43847 46829 47913 48355 50803 52893 52497 55239 55567 52176 49175 47583
8034 47583 47944 48468 46081 42522 42303 44186 40498 42301 50304 50376 52420 55797 61126 60872 62678 62756 67243
8017 67243 70786 74118 72528 67790 61326 57269 53919 46776 37305 34193 34720 35744 40351 40800 32976
8002 32976 34552 34055 30524 31425 32656 31850 28575 29185 29880 28800 26739 25094 26099 27223 27980 25925
7986 25925 25604 25765 27174 28882 31548 32263 31825 31457 31833 31075 30907 32347 30985 27586 25759 26526 25709
7969 25709 20706 18429 21022 20929 22741 25322 23426 20851 24575 26550 24125 23358 20607 19097 21209
7954 21209 24291 26005 25017 21541 18008 18219 16773 15636 16890 15388 13350 16693 18974 19188 19012 15876
7938 15876 13603 15147 13251 11019 12799 14380 11418 12817 13125 12033 12687 12432 8009 7901 9443 12584
7922 12584 11164 9616 10885 12923 15948 16222 12973 12810 14717 16171 14684 14516 14235 14995 14571 11672
7906 11672 11331 9771 8646 6569 4691 3521 8074 12149 12270 13208 14807 9844 8007 7885 8244 7370
7890 7370 5882 5566 6440 9832 8267 11237 14981 14043 11136 10466 8175 7502 7410 8437 7982 8867 5914
7873 5914 4318 5007 5913 4310 4076 7055 9762 10714 10755 8047 9625 6692 5238 6796 4807 7801
7857 7801 7004 6612 6557 5078 5371 5756 6706 3654 3895 4380 1446 1703 3658 3614 2346 4133 6080 5337
7839 5337 3468 1910 1576 1097 2225 2436 4046 1480 -661 1642 5413 7604 7673 6582 6121 8141
7823 8141 5638 5470 5542 5256 9786 10667 8088 8893 6990 4924 3237 6371 7000 2830 1560 502 3209
7806 3209 4801 6750 7542 2399 -2182 430 935 -144 -2671 330 7271 8778 10175 11870 10180
7791 10180 8071 8451 7622 3701 662 645 6533 8878 6533 4744 5455 6874 9133 4406 3931 6576
7775 6576 8521 7743 4291 2937 5516 3033 1787 4432 4075 4330 6107 4255 4369 2136 1302 847
7759 847 -91 1138 3220 5054 2639 5145 6823 7203 5987 868 801 1724 2173 3563 3889 3829 5985
7742 5985 2843 786 3492 4888 5238 6901 8978 11143 8259 6053 3900 3471 2467 2528 4345 702
7726 702 1008 3133 6239 9126 7602 4912 2601 687 3401 4156 1811 -1257 -939 2126 -817 104
7710 104 1664 533 1838 1017 1172 3286 4710 5056 6334 6522 5324 3750 -936 944 654 -1178
7694 -1178 -692 129 -1355 -2889 -3132 -4891 -3723 1059 1629 2243 6122 7617 8350 4280 1933 3643
7678 3643 7241 7315 7004 9104 4951 2341 2597 1505 3752 3759 5880 6962 8765 7801 4686 4918 2144
7661 2144 -686 -896 -2225 218 1843 3101 5488 5308 3514 3517 1591 -688 1610 1276 -4404 -5516
7645 -5516 -1904 -2282 -3999 -4174 -3623 -662 2193 2960 1473 1260 1812 2514 2127 1310 970 -1338 -1922 -3702
7627 -3702 -4559 -4462 -20 1277 1314 -1449 -4778 -3743 1080 2029 3112 3634 1702 2589 3900 4152 4685
7610 4685 5945 773 861 1917 1765 3510 2600 1227 618 -88 3119 919 -1950 -1564 2065 3303 962
7593 962 2941 4243 2494 -284 -499 -2042 -6370 -8830 -9354 -11062 -5410 -3719 -2907 -2092 -270 1275
7577 1275 -252 -1262 255 2358 4226 2268 2944 1863 -822 -1971 -1521 1666 1142 676 997 4128
7561 4128 3765 2579 3860 3978 3156 487 -632 -1989 320 1934 2237 4760 3856 2873 2169 978 1220
7544 1220 2107 5198 4840 2535 1345 630 -369 591 2937 1917 745 1753 -1590 -3270 -2390 -1541 -2553
7527 -2553 673 3273 4812 4599 4509 4760 5699 7579 5027 3589 4132 3195 2991 -554 3030 2404 -96
7510 -96 33 2919 5748 5865 4743 2099 3765 5368 5524 2325 -514 3122 7047 8980 7114 4141
7494 4141 392 -1580 -2679 -2988 -3658 -4524 -3419 -1310 -1746 969 2144 44 -546 -1263 -125 1993
7478 1993 3476 1480 -845 -1856 -1476 -2005 -1017 -2016 -251 -341 -3337 -801 1458 547 3945 2732 -3026
7461 -3026 -2460 1018 3545 3442 3847 3491 2028 2497 2036 -49 1336 11 -687 -122 689 3301 6040
7444 6040 4052 3335 4482 4924 3745 2770 2947 2966 -410 -1000 -574 -1764 -1176 -3729 -1655 1070 2165
7427 2165 3265 5082 3097 -340 856 3140 5386 2833 1583 -1178 -2434 -2388 -314 4699 3513
7412 3513 4923 8554 5430 4238 1680 -1237 -3662 -5937 -4702 -2219 812 1341 3268 4242 2976
7397 2976 149 1585 1524 2652 2915 595 1161 315 -290 -829 426 667 776 1136 1701 -541 -2493 -1885
7379 -1885 -2512 -2560 -1130 -332 -1646 -2799 -3089 -1758 -2392 -4379 -2108 -580 -1918 -7979 -7369 -5192 -1743
7362 -1743 -1120 452 2982 5498 6264 4990 3518 4015 415 -2587 -1863 2368 1875 -802 -3778 -2220
7346 -2220 -2193 -873 1252 4638 4464 5404 6603 4866 2361 2491 2661 4265 3900 4537 1417 1021 768
7329 768 -358 3464 4611 1320 -391 91 1351 2599 2405 3907 3917 4243 223 -2394 -3410 -5527
7313 -5527 -3560 -2833 129 296 -2824 -1700 -220 -274 -1481 439 3099 2197 2589 4957 1157 -3223
7297 -3223 -2996 -3744 -3450 -3383 -3347 -3153 -6078 -5833 -2306 1025 3839 6461 6099 2699 1856 830 -1060 -3023
7279 -3023 -2039 -3831 -3071 1139 -37 -3322 -5173 -7070 -6520 -2196 1163 -1360 -1289 -2264 -3493 -1502
7263 -1502 2797 5592 4728 1274 -79 283 3275 3298 2117 487 1403 -142 -1875 -2155 -4131 -2638
7247 -2638 -333 1427 1784 228 -237 611 21 120 1253 2879 4030 3562 -698 -3652 -2405 -3235 -2179
7230 -2179 -1807 -2430 -553 -906 -4847 -7686 -4866 -3784 -5531 -8123 -9161 -5183 -1383 -258 -3971 -7987
7214 -7987 -4143 -1537 -539 1215 -396 1416 667 183 -830 -2664 -412 -1033 -3646 -3900 -1620 1747
7198 1747 763 1790 1185 -1779 -1824 2431 3090 2054 583 -1258 -324 -272 907 1490 -142 -2917 -2018
7181 -2018 -1007 -1824 -4373 -6291 -5888 -1926 400 -2346 -3379 -2878 -5989 -6240 -5163 -6129 -8169 -6940
7165 -6940 -4711 -4580 -3276 -3628 -5760 -6446 -2383 -1907 -294 1928 1932 -259 -3540 -2250 -2736 -2170 518
7148 518 1163 1681 6766 1587 -1305 -300 2494 2692 -1182 -3393 -1662 -281 2728 2042 651 1767
7132 1767 1521 5759 6572 4026 2720 1121 58 -2491 -1208 -138 829 -412 414 1332 585 245 -208
7115 -208 489 1248 1418 -502 -2230 -2337 -2684 -2140 -581 -161 -2358 -3327 -457 1428 3190 3486 1682
7098 1682 66 -2797 -2197 -2063 -4683 -4400 -4604 -1792 1120 2022 3105 2020 3538 4255 1259 853 4621
7081 4621 6339 2380 -731 -1778 -1060 -1318 -3426 -1374 -1458 -4715 -4305 -3982 -8142 -10198 -9544 -8365 -11146
7064 -11146 -9959 -6012 -1527 -2735 -1400 -3131 -3766 -5041 -3325 -5272 -8765 -9939 -9124 -7855 -2893
7049 -2893 1106 3887 3257 4442 3923 5114 4570 1477 -1418 -1595 -2128 -321 1798 1096 1212 1515 938
7032 938 1164 4451 1369 -1430 1829 1488 -2197 -619 1014 2892 3092 3239 2338 468 148 909 196
7015 196 -1192 -4850 -5995 -4490 -3737 -4602 -8004 -7664 -7484 -8763 -7535 -5337 -2668 -3573 -4014 -2180 -2530
6998 -2530 -5259 -8555 -6991 -4091 -3398 -4185 -4296 -2714 -392 1431 3581 4120 1816 -962 -2453 -3446
6982 -3446 -4476 -925 439 606 2879 1221 1474 4789 2793 -1014 -1205 -404 -2094 -4828 -5576 -3025
6966 -3025 2031 260 -2185 -2917 -1250 -1867 -1399 -226 1930 1281 -1512 -2413 -4966 -5066 -6819 -2856
6950 -2856 -2193 -5517 -4823 -2536 -1466 -721 -2207 -2162 1002 1675 3323 6731 6664 -2233 -4153 -3745 -604
6933 -604 -1433 -2253 -2413 -1201 -103 2075 3760 6626 5003 3055 4823 10126 12257 11081 9397 8059
6917 8059 6705 5478 3754 1980 -513 -3787 -3748 -2307 -412 -255 -553 -1154 2529 458 -611 180
6901 180 948 -1487 -2536 -782 815 1249 764 -2742 -667 1748 328 1954 3200 2707 1428 3097
6885 3097 3666 4073 8016 16717 29849 46058 64729 62507 43668 25244 16731 10553 7061 6430
6871 6430 9751 15188 16300 16018 12060 11808 12363 8904 5265 3202 4040 3202 3804 6055 6139 5607 4445
6854 4445 228 -3331 -3778 -4247 -1278 2149 3973 7014 11384 11999 8266 5047 3971 4448 1288 1140
6838 1140 175 -1300 -857 -1636 -3887 -4330 -3587 -3585 -2670 -2033 -3540 -4168 -3080 933 3586 541 -1542 -1489
6820 -1489 -983 -115 -895 127 3135 1957 620 1078 2438 1785 2362 195 -3903 -4655 -4526 -5207 -5302 -2309
6802 -2309 1527 4095 5647 4309 3820 3860 2578 2790 1775 -294 -267 2897 6347 6372 3685 2287 2321
6785 2321 1909 1167 1332 4941 5396 1126 1478 1949 672 2279 2530 370 509 1913 3279 7595 7922
6768 7922 6474 6362 8064 10479 16714 22746 34394 54026 82955 131586 174743 166441 127534 82632
6754 82632 51009 34915 26071 19389 15825 14052 13414 9003 6896 8428 6932 2381 1338 7450
6740 7450 11608 16240 21449 30862 45407 61357 63085 56165 45075 33116 20986 12496 10577 12464
6726 12464 10343 8216 7590 7003 8748 7394 7087 6616 9816 9388 7202 6501 9226 8768 7347 6211
6710 6211 3704 747 855 -926 1307 3915 4709 3737 4479 3144 -464 7 246 676 2026 5213 6450
6693 6450 6046 3001 770 1505 2463 2596 6031 4646 1881 -60 -3143 694 6681 9104 2900 -1586
6677 -1586 -1384 2121 728 169 -1602 -3551 -7835 -6608 -3793 -1682 759 3081 4838 2606 1669 -641
6661 -641 -3762 -5422 -4440 -2423 -526 1135 1619 3025 967 -3442 -2577 -2806 -4976 -6410 -8221 -7658
6645 -7658 -7677 -7345 -5229 -1832 1152 2189 1500 -1472 -203 353 1293 -800 -664 -879 -2281 -1245 -1243 -5072
6627 -5072 -5761 -4532 -1846 -726 -381 985 369 -3082 -3135 -1392 -4172 -5385 -4010 -3773 -2052 -2181 -3879
6610 -3879 -7050 -8144 -3552 -6275 -10116 -7721 -6961 -7015 -4222 -3145 -3715 -4875 -7981 -7257 -3203 -2433
6594 -2433 -1724 -2507 621 1282 93 829 -24 -769 -552 376 -2580 -2779 -1423 1277 2382 1188 114
6577 114 -2588 -1535 1177 -559 -944 151 -2184 -4100 -1624 -313 -4523 -4886 -876 -1110 -4461 -5059
6561 -5059 -4520 -3424 -1219 -1775 -2706 -2629 -483 -286 -605 259 -5551 -6230 -2761 -3032 -4615 -4276 -3382 -4045
6543 -4045 -4534 -6568 -7935 -7009 -5851 -5240 -4392 -52 2684 2769 3935 2714 -55 -1605 -401 -160 847
6526 847 4010 4334 3988 4694 2890 2354 5919 7020 5840 1879 -1427 -1999 -1145 -569 1186 3246 3257
6509 3257 1514 -1162 -114 1383 4239 4837 294 -262 802 -1896 -937 524 2738 2369 4684 5323
6493 5323 3199 1173 579 3425 5115 3055 -1089 -479 -707 -1045 -361 -1934 -1324 -1714 -3376 -3524 -2729
6476 -2729 953 1449 -68 -4456 -2691 -1612 -759 739 1568 57 -4859 -5503 -7408 -3283 -1824 -2868
6460 -2868 -4117 -6003 -3646 -3319 -5063 -5483 -4241 -4551 -3823 -1723 -3363 -2817 -680 -246 -2216 -3348
6444 -3348 -757 -2742 -6115 -5674 -3034 -2300 -989 -1074 -2969 -3110 -2463 -3141 -1781 -1707 -4460 -1856 -1018
6427 -1018 -2085 -309 3222 1479 -1188 -2697 1218 4471 -1337 -4597 -5431 -4880 -2540 -1187 1175
6412 1175 2077 -372 -2978 -4591 -4575 -4792 -2960 -4757 -3312 -212 -3431 -3902 -5474 -3296 -448 1265
6396 1265 3008 464 -496 -2146 -2221 -1760 301 2556 616 -869 -411 -3166 -2919 -662 2786 4147
6380 4147 3448 2415 4323 3740 -15 -2843 -1833 -2909 -2837 -1223 251 2603 2871 -259 -2425 -2569
6364 -2569 -2372 -1669 2553 3073 -762 -4856 -5661 -5588 -5621 -6026 -6017 -4104 -5280 -4278 -3195 -5344 -5624 -3765
6346 -3765 -3816 -2747 -3441 -1888 -2873 -2630 -6572 -8458 -7228 -6329 -3709 -1967 -4038 -5873 -6253 -3667 -1702
6329 -1702 -2724 -176 2664 3012 3398 1979 402 -3261 -6983 -3132 1160 2374 1331 1086 190 2496
6313 2496 659 -2203 -478 1100 1586 3449 1516 -1330 -783 -1545 -1528 2256 1538 1443 1811 -3786 -4520
6296 -4520 -2626 1199 1159 28 -4282 -5694 -4496 -3214 -4515 -4933 -2430 877 450 -364 1546 552
6280 552 54 -341 -286 -1663 -871 -350 -987 -1767 -2790 -2653 338 -100 1061 2069 1359 3760 5232 1354
6262 1354 443 604 -260 -2682 -341 1428 -643 -1567 -3672 -2591 -2864 323 5275 7317 6235 545
6246 545 -1854 -4232 -3375 -1116 785 1769 -973 -3465 -4272 -2231 564 2569 -656 -1527 -2794 -2351
6230 -2351 -3152 -3282 -4413 -3479 -1351 -520 -2611 -2565 -945 326 -820 -3499 -5731 -6623 -3570 -349 3928
6213 3928 3836 3183 1786 2065 268 -3375 -2339 -2047 -2470 -2293 -2554 -2272 -3604 -5028 -6582 -5768 -4294
6196 -4294 -1320 926 534 -1150 2571 340 -1971 -4154 -2055 640 2738 3465 701 90 -1164 -558
6180 -558 -2217 -820 -975 1013 -883 -1202 -213 872 1820 2029 557 3439 1229 -1078 -217 -1368 -2462
6163 -2462 638 -2543 -3305 -2947 -3631 1991 -69 -2313 -3890 -6091 -4220 -2048 660 1287 -749 -2512
6147 -2512 -1998 -1568 295 20 -2285 -1845 -2647 -3391 299 2309 5541 3871 2375 2252 -261 2430 2811
6130 2811 -59 -804 3443 2479 2285 413 -1187 -3079 -5352 -5290 -7573 -7074 -5287 -3317 -3620 -4061 -3940
6113 -3940 -2695 -1374 -161 -706 -603 -364 1251 2322 2648 2804 3138 4985 6161 6445 835 -4589 -3437
6096 -3437 -3354 -5190 -7834 -10285 -8670 -6796 -6586 -4687 -1609 -1662 -6096 -5470 -4515 -4781 -6779 -6277 -8942
6079 -8942 -7664 -2380 -1903 -2634 -2470 -3866 -4592 -7317 -9455 -10350 -6498 -2397 -4229 -6024 -8522 -7000
6063 -7000 -5855 -4848 -1134 451 4401 6717 3198 1999 153 2513 1202 -331 1902 3196 2074
6048 2074 -1545 -4130 -6133 -6302 -4298 -7296 -5261 -3917 -5751 -5377 -499 831 3068 3633 84 -1309
6032 -1309 318 1978 1879 -1431 -4760 -4746 -3769 -5900 -5189 -4234 -2225 -189 -446 415 2353 308 -809
6015 -809 363 2756 -82 -1252 -3188 -6425 -6077 -5854 -5480 -3530 -3465 -993 -431 -2596 -3643 -3642 -5168
5998 -5168 -6943 -6410 -5000 -4987 -4356 -3254 -2811 -946 -4021 -5220 -5270 -5432 -7144 -6402 -2971 1447 3606
5981 3606 1540 1960 3221 457 -193 1478 1071 -1167 -2920 -1976 -833 1668 2810 1719 1613 -1524
5965 -1524 -3993 -2242 -2438 -3524 -5985 -3061 -1982 -6422 -8879 -5396 -4945 -3998 786 2347 2730 410
5949 410 -1439 -3199 -2432 820 4444 4636 1890 -1287 -5473 -4625 -4485 -3833 -3973 -3266 -3228 -1522 -3476
5932 -3476 -2203 -2779 -6143 -2754 -3938 -1983 -2823 -2240 -2430 -2252 765 173 2752 2006 2706 4976 -257
5915 -257 907 3307 630 -1415 366 -1050 -1818 -8274 -8265 -7131 -5372 -1492 223 -2741 -2996 -3171 -6185
5898 -6185 -5857 -3049 -1450 -2806 -4308 -1695 353 -2473 -5126 -2423 -2909 -4115 -4800 -3915 -4670 -2737
5882 -2737 1297 2506 3532 2281 -2856 -3153 -358 4971 4049 227 783 384 -1696 -5609 -4671 -1519
5866 -1519 -43 229 1834 1930 745 -2915 -6641 -6235 -4944 -4815 -8808 -9112 -7607 -4754 632 3716
5850 3716 3919 -2135 -1334 -3574 -5178 -2866 222 -1 342 -1409 -2031 -324 1597 -1752 -942 -3206
5834 -3206 -4888 -6241 -5161 -2694 -2576 -1418 838 135 0 1402 -405 -1788 -2859 -1687 -2569 -5316
5818 -5316 -5009 -6081 -3567 -4149 -3048 -1800 -3979 -1296 -547 713 -211 -1433 -1702 2104 2319 1694 -1873
5801 -1873 -1929 1933 4905 3309 -2822 -2465 -1049 -5397 -7812 -9038 -8284 -5430 -3433 -2000 -4895 -1888
5785 -1888 -774 -2720 -373 4537 2650 -1385 1274 -345 -1293 589 -960 2037 1148 -1203 -1963 -3194
5769 -3194 -2666 -6559 -6685 -7443 -6709 -5396 -2518 135 962 357 -1955 586 1161 16 1128 4206 1949
5752 1949 -1611 2020 3616 879 -1015 -2996 -2463 -4194 -8356 -8263 -6023 -2360 -715 949 441 -64
5736 -64 -3022 -3433 -2544 -2522 -1399 1745 3437 3225 2843 3197 5149 3956 2599 120 -4157 -4169 -5154 -3544
5718 -3544 -1357 436 1425 52 -2358 -876 -3073 -2673 -3740 -6192 -2882 -1629 -1157 98 -994 -2123
5702 -2123 -1318 -2674 -4904 -2563 -2221 -212 -35 1071 2784 1026 -3258 -4079 -4979 -3230 -1842 -2246
5686 -2246 -1512 2907 4548 2689 2199 -1833 -6155 -7569 -5482 -6210 -6305 -5504 -3353 -1005 -1768 -2038 -4706
5669 -4706 -5237 -2095 -1562 -4396 -8080 -5618 -3644 -1976 -1618 -655 -2775 -2818 -978 -1594 -4752 -7954 -7780
5652 -7780 -4445 409 50 -1652 4297 4787 259 -4649 -8008 -4929 -809 -2015 -3879 -293 1703
5637 1703 -1414 -403 -397 -1459 -1423 -1386 -3906 -3734 1211 3225 3164 2846 -1816 -5295 -5482 -6798 -2858 210
5619 210 400 -2878 -2689 -1054 -2320 -2050 2555 3238 2450 2131 827 -2359 -4120 -1654 -3957 -3932 -4856
5602 -4856 -5728 -4609 -2045 -2788 -6329 -3838 -3126 -3702 -4873 -3748 1205 -981 -27 1210 2248 -1236
5586 -1236 -4307 -5067 -2577 -1664 -4229 -2044 649 800 523 322 -237 2012 3532 1182 1705 -885 -1525
5569 -1525 -133 510 -3185 -4277 -4382 -4568 -5227 -7435 -8264 -7276 -6525 -3326 -4000 -5337 -4482 -4516 -2137 337
5551 337 1886 -800 -514 -3164 -3753 -2367 1635 2104 -41 170 -871 1624 4680 7415 7495 5870 2958
5534 2958 748 -521 -785 -2302 -1 5032 2516 -999 -2016 -2656 -3663 -4025 -3681 -1139 1072 1438
5518 1438 1600 -10 -2230 -3532 -4544 -3954 -925 791 427 -1270 -2813 -1348 348 1033 -875 966
5502 966 -462 2189 1962 2558 747 -2529 -2552 -107 -1512 -2665 -5247 -1427 2797 3605 346 -4798
5486 -4798 -5549 -6277 -5774 -1555 263 1454 3027 814 -1654 -1677 -2083 500 -515 496 1137 232 3058
5469 3058 6778 4480 -230 -1457 -3650 -9889 -11976 -9701 -4450 -850 317 195 -2957 -4958 -3799
5454 -3799 -68 -741 1840 -521 -3066 -1863 -3776 -4468 -5516 -4387 -157 -874 -3081 -1693 -210 -9
5438 -9 2958 3804 1388 -408 130 3877 3870 -115 -785 351 -2421 -4417 -4585 -5091 -5065 -2104 -2323 -1759 172
5419 172 303 -69 -1458 -2217 -1266 1346 5237 5332 2082 3699 4862 3879 3317 3494 330 -1152 467
5402 467 1207 1452 2732 4026 6669 4247 4229 3812 1116 181 -369 1262 1779 -1289 -3125 -1807 -1568
5385 -1568 133 -798 1676 5866 2905 -1010 245 3870 4932 5330 5024 5150 2607 1266 -1222 -2454
5369 -2454 -5487 -5758 -5492 -1123 2459 -646 -922 -1872 -3597 -6108 -7073 -7259 -4482 -2842 -2777 -3850 -2754
5352 -2754 -573 -1098 -254 -2082 -3447 -1613 673 -80 860 1140 -1591 -4227 -6902 -5570 -4185 -1980
5336 -1980 -1334 -3767 -7326 -8746 -5129 -5845 -4013 -4801 -7541 -7273 -2257 1263 2447 1635 834 -1144
5320 -1144 -2821 -1787 913 1022 854 1727 4767 2216 -1795 -915 -554 2436 1236 108 -943 -1225
5304 -1225 -3704 -4151 -889 578 -794 -315 181 -700 -78 -630 1422 718 -1425 -3423 -3421 -148 436 -1486
5286 -1486 -633 -720 -197 -3164 -5947 -4719 30 2141 -2294 -3351 -1431 -1073 -3011 -3504 -6194 -4630
5270 -4630 -2236 776 1225 1651 1513 -1713 -3948 -2021 -1304 466 -1175 -5158 -6054 -3119 -2063 -3422
5254 -3422 -2534 -4172 -3727 -2321 -27 2258 161 -335 30 1401 3594 3530 1781 -2172 -7476 -6325
5238 -6325 -2059 -2997 -5630 -3170 -175 -1844 -1179 -2785 -2621 -4667 -3537 1019 5708 3748 1439 -5199
5222 -5199 -3597 -3874 -1272 -2638 -5260 -5772 -3460 -4553 -3882 -2338 -2874 -5113 -8772 -7817 -5253 -2105
5206 -2105 -1210 -968 -2376 -4552 -5525 -2553 -2082 -1357 -1245 -1198 -2089 -2346 -3995 -1921 643 4416 4323 2532
5188 2532 994 1528 1674 3059 5457 3749 1294 -2823 -298 -1583 -6876 -7257 -5067 -2988 -2020 -4290
5172 -4290 -5199 -3895 -228 4926 10279 7164 5123 1041 -584 -3804 -3263 -4151 -991 3822 78 -1430
5156 -1430 -2081 -1831 -1699 -1854 -1232 -3986 -5564 -4434 -3985 -2338 -5273 -5784 -2431 -6494 -5395 -2639 -314
5139 -314 841 -677 -8491 -9031 -9684 -9307 -7557 -2458 760 -1070 -2823 -3734 -3229 -1158 -682 -3887 -4307
5122 -4307 -4021 -4163 -2485 -1402 -4515 -3822 -4306 -7525 -4391 -734 -201 -804 -3818 -6937 -7944 -6229
5106 -6229 -6014 -3241 -2128 -3761 -538 -234 -2355 -1925 -81 1103 -164 -1456 78 -3049 -3263 -2350
5090 -2350 306 -131 928 2274 646 -767 2879 3542 446 -835 -5898 -6537 -8933 -6833 -1875 -20
5074 -20 -1642 -357 -2308 -3011 -3173 -3051 -4035 -2818 -3036 -1238 2471 2755 -2547 -6746 -7619 -4470 -1108
5057 -1108 -368 -2384 -1866 -2547 -2840 -1704 -2609 -1296 -3871 -4904 -3877 -2965 -2311 -2256 -2249 -4040 -3071 -1031
5039 -1031 3798 4856 756 -4271 -4666 -4645 -5082 -6710 -4347 -2106 -1789 149 932 -539 40 -133 223
5022 223 1499 -2596 -4131 -3021 -4357 -5097 -5154 -5198 -4188 -2615 -1389 -3271 -3647 -4780 -5659 -3344 -1176
5005 -1176 -3809 -4200 -1691 -1644 -1528 26 -1340 -4079 -6883 -6501 -1795 1054 630 -849 -2037 -3949
4989 -3949 -6288 -5272 378 937 -1679 -4008 -4467 -6490 -5952 -4507 -3467 -519 -249 -1666 -3490 -3439
4973 -3439 -947 -2225 -6132 -9567 -9217 -5364 -585 549 77 -3752 -7510 -3835 -2464 445 711 -956
4957 -956 -1898 -3894 -2086 -3784 -3136 -1437 547 -520 -3778 -3948 -1740 -3611 -1976 -2717 -2221 -928
4941 -928 -4031 -5803 -2066 -811 -216 -2320 -1697 -3016 -4850 -2604 -4483 -4160 -235 2854 427 -1619
4925 -1619 -3732 -3785 -5114 -4285 -3383 -160 984 -2127 -854 -354 -2107 -760 739 -1328 -4041 -2203
4909 -2203 431 1452 2215 1389 971 1042 2065 137 -2323 -3576 -2428 -3271 -1255 284 243 -1655 -4490
4892 -4490 -2600 -898 -2734 -2818 -3888 -3021 -4392 -6502 -6472 -6473 -4664 -4552 -4068 -3081 -3370 1273 3768 185
4874 185 1358 272 -2675 -5019 -2608 -2037 -1571 -909 -1803 -3125 -2083 -823 1158 -2222 -7135 -6687
4858 -6687 -3942 -6673 -6109 -5251 -5982 -4439 -4618 -4937 -6620 -7125 -4336 -1571 -164 -937 -4241 -5276 -3324
4841 -3324 -906 -1319 -2807 -4197 -991 1125 3092 -271 -2280 269 2134 2030 -92 -505 1978 1634
4825 1634 1463 -772 730 1989 882 1250 1992 1397 -645 -4799 -4974 -3754 -2925 -3042 -2763 -1257 1263
4808 1263 3179 4807 1710 -347 249 -538 1368 2307 416 1226 -47 -1486 -3597 -6378 -6067 -3955
4792 -3955 -4874 -4258 -2870 -5057 -6161 -5305 -4843 -7294 -6481 -6373 -5969 -3724 -3100 -1604 -2618 788 -897
4775 -897 -4016 -3146 -975 -551 -1944 -3087 -3198 -1536 -1922 -801 1139 910 2021 2211 1028 -1424 -4772
4758 -4772 -5868 -3100 -683 -424 -2313 -5811 -6950 -8383 -9369 -6401 -1710 -2790 -3284 -353 4010 3606
4742 3606 2254 1043 -629 474 -928 -2274 -1331 -386 -974 3773 2167 1827 3044 2748 3092 2006
4726 2006 1274 1475 1952 227 -1572 1212 114 -5714 -9873 -6547 -3912 -3512 -1982 -3647 -6929 -8542
4710 -8542 -7861 -4436 -2003 -3451 -2013 -65 4178 3256 2280 367 145 2022 1845 1228 -1908 -2461 -2080
4693 -2080 1255 -10 -1501 -2022 256 2234 -1206 -2711 -2684 1944 3885 -10 1128 383 -877 442
4677 442 625 -1305 -2075 -2524 -2056 -2605 -2804 -4355 -6298 -4007 -1718 -1191 -3643 -4461 -5210 -7427 -4955
4660 -4955 -4879 -6203 -4080 -2864 -3145 -5537 -5345 -2712 -511 -1238 -5215 -4227 -5849 -5534 -5513 -3929 -2127
4643 -2127 -2665 -3866 -4173 -5244 -2862 -941 332 -1780 -2671 -2641 -3828 -1394 -1035 -4398 -5671 -2532
4627 -2532 932 4186 2225 -308 -889 634 778 551 2248 2597 2848 5491 7693 3848 777 -1356
4611 -1356 -432 1378 107 -772 -947 -765 447 3799 4416 2112 927 -345 75 412 -1224 -4852 -2856
4594 -2856 -930 -312 877 1823 2381 -1346 -3627 -6748 -8292 -6550 -6007 -4609 -1045 3535 3905 425
4578 425 -448 -5201 -7067 -5116 -5285 -2817 -3350 -4426 -4284 -5673 -7217 -7574 -5018 -3735 -3492 -3245 56
4561 56 -610 -3336 -735 -753 -3108 -981 2928 -432 -1829 -1248 -649 -1139 -245 59 -1780 -2445 -485 -909
4543 -909 -1544 -3289 -4754 807 3575 5250 1541 403 417 1870 1419 150 795 439 1891 1482 -702
4526 -702 -2341 -211 1470 4027 3095 2379 2208 745 -1614 -2730 -2844 170 -1210 -2718 -148 4254
4510 4254 1943 998 -1860 -3153 -1691 -1294 -2177 -1697 -605 -897 -1010 -3615 -1710 1253 4134 3176 -45
4493 -45 244 477 3494 4035 2522 -2319 -4607 293 3273 100 1590 -1000 -913 3600 3192 -392 -1396
4476 -1396 -406 14 192 -1567 -673 -598 -239 294 978 -2818 -4752 -4470 -3894 1580 3052 1990 361 2425
4458 2425 2493 1599 590 -1671 -16 493 3160 1910 -409 -502 -970 -3592 -2772 -969 2417 3430 567
4441 567 2421 1839 1773 1729 4454 6990 6978 3967 -623 117 1559 -1188 -7176 -8048 -5510 -689 -438 -778
4423 -778 -235 1130 -631 -905 -434 -161 -141 -1737 -3064 -4389 -4791 -1415 2589 1169 -386 -105 -2440
4406 -2440 -2421 1524 2438 699 -3159 -3943 -4360 -2252 -3336 -2089 -49 940 -30 -191 -2438 -1652 689
4389 689 23 -1822 -1340 -1756 -4041 -4175 -2958 -5268 -6438 -2983 -2560 -2622 -958 -1297 -429 -1212 -2666 -3556
4371 -3556 -5710 -5149 -7052 -7755 -2682 -1625 -3339 -5118 -5202 -3509 -3739 318 3066 1744 -3019 -5229
4355 -5229 -5007 -2625 -1584 -1194 -1730 -3758 -5523 -7335 -8475 -8284 -5590 -1106 620 322 2670 4776
4339 4776 1935 -826 -1751 -4720 -6499 -5995 -2039 3336 5296 2824 1927 2281 485 -349 -1171 -1377 -3418
4322 -3418 -2264 744 2233 1364 2867 1004 -1078 1904 3788 1848 427 3594 2115 406 -2828
4307 -2828 -4419 -1518 -2165 -2245 2125 4553 3776 1130 -2535 -83 3261 1417 -2320 -3812 -4498 -6361
4291 -6361 -4367 85 781 2701 2946 238 2925 3798 738 -1968 -1497 -1189 -3529 -90 -727 -2581
4275 -2581 -2440 -737 -3577 -4068 -3766 -3727 -4129 -2638 -1927 -3603 -5295 -4575 -2071 779 1091 -423 1692
4258 1692 3360 -717 -3890 -2237 -2322 -3256 -2487 340 258 723 1781 1846 1032 2043 1776 -1432 -571 860
4240 860 163 147 996 -351 -3173 -3029 -3290 -3531 -2273 -2529 459 3575 4563 5255 703 -3161 -1530 -3279
4222 -3279 -2495 -3930 -7383 -7742 -2875 -1967 -1969 -297 -3729 -2886 2289 852 -1026 -448 492 1072 -1589
4205 -1589 -1867 983 883 -4617 -6098 -4562 -4258 -3528 -2541 -4124 -3056 -2064 462 -1362 -2112 -3224 -1890
4188 -1890 55 -1756 -3723 -6508 -8225 -5420 -4337 -1907 1043 251 2717 3447 1682 -776 -5171
4173 -5171 -4516 -2437 -2094 -2569 -4489 -3042 -3824 -2915 -986 -101 827 1478 887 -1102 -2131 -1017 821
4156 821 815 -1855 -4848 -5939 -1849 -3622 -4377 -2968 -4596 -2759 -1586 -1355 -892 -1759 -2232 -2058 -2721 -544
4138 -544 -1813 -498 136 -1526 -1735 -1754 -2533 -3129 -3206 -3689 -5581 -5603 -4412 -613 -34 2832 3562 3164 854
4119 854 -275 -554 811 -2120 -4495 -4551 -2425 -4814 -4926 -2894 -454 -488 -334 -1953 -2264 -3163 -2544 -3802
4101 -3802 -3562 -1925 285 3911 3455 3050 -1082 -4681 -3997 -6327 -7007 -3720 -3564 -3505 -3794 -4282 -4139 -1479
4083 -1479 498 2565 5202 3812 3311 531 -2177 -1868 -3110 -4347 -3980 -2202 -2608 -996 1389 4366
4067 4366 451 -1332 -1508 -1509 -7617 -9060 -7629 -5008 -2247 -813 -1680 -2147 -4898 -5730 -4953 -6841 -5006
4050 -5006 -6093 -7857 -3518 2840 6210 4837 3170 5688 7966 3961 -2385 -5903 -6122 -3094 -724
4035 -724 -2078 -3742 -6856 -5150 -3316 -2035 -688 253 -1383 -1910 1727 2179 1397 2381 5261 5006 2757
4018 2757 -2609 -7849 -7620 -6997 -8283 -5580 -3626 -5002 -4052 -2631 -3292 -4853 -3400 -1215 2210 2680
4002 2680 -406 -2741 -4179 -2616 469 1573 -738 -2127 -3578 -4601 -6663 -6346 -5099 -1485 2206
3987 2206 1125 -3634 -1874 -3338 -8058 -6022 187 1818 815 1488 -1418 -3675 -4564 -1927 -3628
3972 -3628 -2142 534 121 -2145 -2173 -434 -542 3353 4610 809 1023 2597 4483 3147 985 -3759
3956 -3759 -7294 -5292 -1903 -388 891 -806 -3059 -4284 -5375 -4171 -1805 1345 1993 2967 1785
3941 1785 -1937 -1427 -638 -2232 -1215 -1294 -1274 -647 -591 -551 -1354 -1428 527 776 1752 1295 1565 -2593 -5003
3922 -5003 -2663 1309 1405 -931 -3966 -5891 -8903 -5007 -1221 391 -906 -1229 -1827 -2458 -4462 -2462
3906 -2462 880 -675 -2574 -4823 -4698 -2440 -3943 -4278 -3498 -3510 -2244 -377 1547 3518 1884 173
3890 173 986 2624 -16 -2684 -5320 -4000 -5538 -1901 2840 2022 658 217 3621 3375 2293 263
3874 263 2106 4157 6432 4667 -1395 -4306 -4202 -5260 -4498 -1685 625 -2010 -3656 -1646 1063 -1797
3858 -1797 -618 -340 -1101 -3425 -722 295 640 1158 2393 2536 454 2945 6221 3686 1590 1351
3842 1351 416 -864 -462 -4363 -5983 -4362 922 3217 2208 1876 -437 -2269 -1272 2867 4100 3392
3826 3392 2902 3188 3674 850 -3067 -4467 -4517 41 557 -1223 -1751 -555 2973 3661 4798 4508 6718
3809 6718 4140 -759 -1575 -2977 -3936 -423 294 801 953 -1288 -2311 -449 2783 3195 -120 -3888
3793 -3888 -2194 -3446 -2446 -773 -1196 -3258 -463 316 391 -1476 -2526 -1712 -270 172 2673 -868
3777 -868 -3485 -2511 -3263 -2395 158 -1551 -2250 570 1734 1255 -751 -3998 -4216 -5028 -6041 -3322 774
3760 774 1566 -302 -3491 -4861 -2833 -909 221 825 1986 3227 3108 1215 263 -1615 -5541 -5547 -2873
3743 -2873 -3186 -2359 -1279 -1158 689 2083 -151 -708 2147 1530 -764 -2768 -4504 -2668 705 -530
3727 -530 1472 1230 467 3628 3715 3972 3615 3039 -1252 -3686 -5573 -5322 -5231 -4789 -2712 -2488 -4248 -4837
3709 -4837 -4476 -1138 -2937 -4103 -5205 -4841 -5700 -5212 -3338 -1741 -4175 -3886 -131 947 4309 3776
3693 3776 2288 -895 -1509 251 3180 1429 92 -1175 -2356 -1043 -936 -1422 -253 1593 1729 -1039
3677 -1039 -1434 -1203 -3338 -5094 -3199 1146 3170 2215 1068 982 1531 3189 6239 2628 1238 2049 558
3660 558 394 397 2813 1847 343 -2754 -3662 -413 4089 4833 4115 1191 656 -1258 -1578 -858 -3253 -2890
3642 -2890 -1021 -75 562 112 -256 -2516 -3357 -2804 -1636 -903 -2917 -400 1679 -1700 -4290 -9353 -10807
3625 -10807 -9061 -6254 -2550 -1339 -2818 -2013 -1559 -5036 -6900 -4039 -278 3002 2847 2124 2588 -1376
3609 -1376 -4639 -5548 -4061 -4005 -5066 -1357 -991 1030 7613 7024 297 -3922 -2948 -2748 -1899 -1791 -1399
3592 -1399 404 1350 6 360 2761 980 863 2295 1912 -36 2160 3860 2221 533 1403 1073
3576 1073 -511 -2080 -4900 -7584 -7947 -5338 -43 -1048 -1865 -246 1466 744 -2917 -2655 -1990 -876
3560 -876 356 2261 2808 3354 1039 -2262 -5705 -2551 -1238 -1221 -2263 1663 3375 2103 3328 5382
3544 5382 5043 1940 3412 4303 2281 1201 1660 988 -1402 -3052 -3974 -4569 -6178 -6924 -1937 -1219 -3478
3527 -3478 -1505 -2011 -3948 -841 1104 1803 -1539 -6413 -5931 -5290 -4793 -2720 -567 1192 2541 -1021
3511 -1021 -3501 -3243 -2965 -360 102 -2690 -3695 -2772 -3067 -5062 -3547 -4096 -2563 -805 687 478 -1957
3494 -1957 -4738 -2911 -2386 -1728 2151 4095 3724 1280 -4782 -5660 -5576 -5303 -3757 -997 2098 463 860
3477 860 -1931 -5877 -3536 -1242 -765 1137 2298 -1253 -1514 -2349 -2736 -3699 -3951 -3123 -884 220 2178
3460 2178 2987 -1003 -1258 -182 3198 614 -856 3 750 -1403 -1737 -528 -3219 -1503 -2102 -4136
3444 -4136 -5819 -4210 -1741 1869 962 -607 -2258 -904 1923 4997 3759 1761 3601 2313 4216
3429 4216 4484 330 102 -1260 -5332 -5751 -6705 -7650 -5582 -3374 -239 -1057 -2617 -2911 -2303 -1862 -1652
3412 -1652 -3113 490 1457 1762 284 -643 539 1088 2219 -521 -2998 -2869 -5070 -5878 -7760 -5044
3396 -5044 -3138 -3008 -3302 -2945 -2705 -1702 -2092 -1273 -2325 -2113 618 -622 2437 2660 -545 -1086 945
3379 945 1536 -1266 -6561 -7382 -5640 -3662 -867 -1685 -3411 -5099 -4500 -4863 -7737 -8644 -5026 -1934 -558
3362 -558 2366 1460 3097 4654 3701 4166 3526 2358 2546 6172 4314 -1545 -776 4899 4024 2233 396
3345 396 -3650 -6588 -3233 322 -526 -2583 -2970 -4938 -3012 -1467 -551 -431 -629 -1033 -2312 -1315 1348
3328 1348 -2091 -4272 -2899 -1554 -1743 -1555 1831 1955 4252 2864 2225 1763 2371 1065 -2516 -1811 784
3311 784 1311 -511 576 -874 -716 112 1195 1542 1431 342 826 2487 2195 867 128 -3771 -4130
3294 -4130 -870 1105 1052 2561 1197 -80 1112 2190 1798 -58 920 -1567 -1164 -1536 -1095 656 953
3277 953 -952 53 1769 -1247 -4593 -5490 -1721 724 -102 1882 2012 -2391 -3748 -3118 -2951 -2495 -5466
3260 -5466 -3649 -3112 -1472 484 -542 -1520 -13 429 -23 -3501 -5327 -6059 -5739 -5665 -6416 -128 1089
3243 1089 -333 -2760 -5190 -1517 3528 1757 1597 507 660 1119 4643 3807 319 -2102 -2075 -983
3227 -983 -701 825 2032 -102 -2848 -3815 -4829 -3428 219 2176 902 185 1855 93 -2034 -3775
3211 -3775 -2920 -11 1131 2314 145 -44 679 -3415 -5579 -5643 -1014 2476 2363 2848 5704 6977 8424
3194 8424 8345 8148 3833 -335 -4137 -2903 -86 936 2754 4988 4644 4065 1352 -1785 -250 1203
3178 1203 -2268 -3265 -3723 -4239 -3826 -1942 273 1290 1945 -1152 -1493 -1115 -2742 -1513 -932 -2009 -959
3161 -959 11 2207 1641 -194 -5095 -6300 -5842 -2488 -2969 -6494 -5162 -3298 -3781 -7611 -6060 -2405
3145 -2405 -2003 -2529 -3310 -4762 -5783 -2551 -1405 -1024 -3176 -5003 357 4457 8111 4370 2045 411
3129 411 -363 -288 1166 247 -3541 -4844 -5519 -1160 77 -4757 -3437 -2125 -2587 -2490 -4185 -3868 -1285
3112 -1285 -2393 -2127 -1270 -372 -1785 -3042 513 1529 2916 250 485 3147 7584 9988 4601 2107
3096 2107 4181 4155 803 659 1852 1856 3540 -423 -6528 -6298 -823 4048 4679 2231 -1416 -1526 897
3079 897 978 408 1987 583 1137 1414 893 948 1256 1495 1712 4212 3786 1590 1016 2831 2792 -1349 -4208
3060 -4208 -5781 -2744 -2421 315 70 827 4041 6660 5937 4701 6375 7412 5915 5472 3578 490
3044 490 -1228 -84 1315 738 -1626 -2264 -1667 -39 -669 1582 4486 864 -349 -2075 -3608 -5270
3028 -5270 -2944 -3696 -2109 3151 8515 7141 1673 -1269 -1991 -3984 -1273 760 2794 2478 2116 2729
3012 2729 2376 -381 -5080 -4711 -9640 -8134 -4308 -2691 -5850 -5963 -4383 -6226 -7583 -5474 -454 -1215
2996 -1215 291 49 -3999 -4675 -2499 -1311 -2309 -1870 1723 1326 -1672 -2083 -1605 -1288 -2039 -2980 -5663
2979 -5663 -2711 1512 876 -19 1027 586 657 -1404 -965 1517 -643 -523 1941 2791 2726 1876 -716 771
2961 771 2396 1297 595 687 33 1452 2142 3583 5173 5177 5702 6705 5703 5983 6941 7123 4643 1835
2943 1835 4481 5143 5386 4316 4822 2854 1683 3112 7506 6560 3775 -1420 -1518 365 -1098 -4036
2927 -4036 -2433 -658 -2542 -454 2072 196 600 2940 4565 5658 2896 -1542 134 2746 2763 2111
2911 2111 2845 3356 3929 -670 -1506 -193 -1338 961 -894 -4367 -7798 -6743 -5887 -6150 -4411 -2681
2895 -2681 -1119 -1380 -1036 -853 -3 1123 -151 -1153 -2908 -1319 -848 900 -3551 -3242 1089 1155 -1649
2878 -1649 -2546 -2237 612 1202 2365 1738 -354 -2032 -1029 1273 -477 -589 3598 1869 42 209
2862 209 528 4089 4471 2718 4669 4605 2219 1947 3736 2696 -956 -487 -133 -3674 -3818 -6384 -6979
2845 -6979 -5603 -5527 -2964 754 4910 2526 2177 1352 2884 1553 -46 -1948 -270 1395 1432 1608 1050
2828 1050 179 -3056 -5056 -7969 -7587 -4340 1184 3120 4112 3513 67 460 141 580 -715 2239 3117
2811 3117 972 -3743 -2711 -2546 -292 -2982 -2426 -5882 -7792 -5988 -2811 -2496 -986 1058 1511 4066
2795 4066 3015 737 -2278 -1507 2317 23 -2715 -2862 -1556 -914 -1460 -1553 -152 -76 -944 -1974 3065
2778 3065 3045 5042 6626 6671 4678 2996 2113 1133 -4207 -4696 -1747 -717 1978 3691 2071 1698 2961
2761 2961 4550 5658 494 -3715 -7818 -5602 -2588 1746 1917 2716 2565 2979 1941 2466 699 2114
2745 2114 3695 3048 435 1309 4129 3737 1276 -2580 -6180 -1707 3700 2578 350 -2598 -2391 -4136
2729 -4136 -4337 -6421 -4893 -1945 -622 -5361 -6888 -3226 289 1817 1255 719 -1216 632 5187 4646
2713 4646 1251 2758 1885 3692 3502 1986 5875 7431 2865 1239 390 -2654 -2450 394 -614 -73
2697 -73 3375 809 -3336 -4036 -2184 942 -1395 -2535 -3924 -4466 -3106 -2455 -2678 -887 1256 3783
2681 3783 2881 2773 2919 -1675 -913 235 -1263 -2416 -671 -1332 -1599 -2596 -237 3033 1841 -154 2087
2664 2087 1794 3739 2296 882 1395 1317 -73 -1847 -3746 -5491 -3514 -1210 -538 -2216 -2785 760
2648 760 3153 -323 -2278 -75 1451 1638 1095 2268 2257 3257 1561 2405 2154 3387 2108 5323 6499
2631 6499 7239 7109 4618 -7 -1567 1007 5015 6114 3284 -912 -2575 -3323 -972 1994 2341 2013
2615 2013 3470 94 -759 -2988 -1671 -3503 -2885 -3458 -5863 -3407 -3759 -3453 -4593 -4667 -1814 3772 3322
2598 3322 480 1258 567 1284 4310 916 -1882 -4310 -3730 -986 -1831 -3164 -5283 -3522 -2602 -2303 -2581
2581 -2581 -2546 -945 -5183 -6026 -531 3606 2609 1394 -28 -690 1511 2379 -2504 -1830 1699 875 1648
2564 1648 2342 1670 2443 2811 4741 5404 4411 2861 1350 3410 4286 3370 745 1669 -1186 -1211 470 -442
2546 -442 4139 7176 4360 2039 2352 447 -794 -2476 -2471 -2909 -2980 -2172 -2877 -3682 -3539 -2066 -1378 -1260
2528 -1260 -4005 -3045 -1955 -588 -3015 -2950 821 1732 1811 -1802 -1808 2604 2837 2739 -1461 -5644 -4364 -353
2510 -353 883 3219 3796 -324 -4306 -3189 -281 151 -626 -4311 -4813 -2333 -1391 -4470 -634 2968
2494 2968 1301 -3733 -5097 -2422 1303 2597 87 -1428 504 1846 -275 814 2498 3422 3119
2479 3119 2366 1723 -1611 -5222 -3533 -427 2067 670 687 1725 3670 4502 3421 2536 253 -1215
2463 -1215 -565 1305 1218 -2915 -4745 -6768 -7108 -6895 -4411 -3657 887 1793 -4480 -4267 -1441 927 714
2446 714 999 -1546 1012 1615 -1156 -2493 -2104 438 1785 3185 2366 -1726 -1704 -1685 -5002 -132 2953
2429 2953 2253 2289 3324 211 38 -251 3874 5271 1788 330 -1960 -1821 -3093 -5741 -5639 -9611 -11261
2412 -11261 -9443 -5692 -3718 -467 3696 3325 2689 1243 -1624 -509 590 1475 2080 -895 -2816 -4636
2396 -4636 -3795 -2851 -1209 2832 6754 6667 3775 3056 2140 2978 4561 4906 5019 1296 5055 8334 9777
2379 9777 10030 9667 9407 8308 7878 2736 974 -221 84 -354 -4098 -3908 -3448 -4624 -4002 899 5765
2362 5765 4404 4502 6726 7574 3700 2122 2438 5182 6198 4904 544 -1851 -3641 -3808 -2170 -1585
2346 -1585 -1995 -3209 -129 3890 4139 1254 515 -633 -500 2747 3025 1556 -1957 -1563 1350 1815 1869
2329 1869 1706 4057 3116 3862 4710 2829 1190 2091 3836 4064 1713 -245 2971 3677 708 -3268 -876
2312 -876 1221 2012 2623 4877 2501 653 -1762 -4114 -4038 -4824 -3861 -1815 -3974 -2691 1148 2878 865
2295 865 -1965 -798 228 1645 5570 4067 -259 2482 2366 4914 2766 1459 4387 4191 2564 -1661
2279 -1661 -2474 -829 2643 3439 2411 193 -2806 1531 4387 3099 1522 178 -478 1165 108 475
2263 475 2509 2475 3364 3099 1615 2157 5910 5757 5026 5242 3351 500 767 872 1267 3720 4086 2999
2245 2999 1138 1674 227 -1682 -253 69 806 996 760 1164 3027 3721 -965 -3133 -4051 -1660 -2049
2228 -2049 -2982 -1138 1856 2584 1454 3367 2548 -34 1987 2589 203 -2754 -646 621 -2 -2045
2212 -2045 95 2997 2361 2438 2808 1432 -258 2336 4520 2995 -466 -1985 -2479 -2445 2095 4753 1565
2195 1565 3104 3868 3632 2545 1791 -229 -1893 -1581 -881 444 248 -1251 -3362 -3817 -4510 -5668 -5212
2178 -5212 -3977 -4932 -2356 151 1496 -45 -601 5 -1731 -6355 -4692 -886 2162 1151 -3879 -4610
2162 -4610 -1260 535 3053 3688 686 -213 47 -858 -773 -1202 -2606 -1906 -1234 -445 -986 212 -2596 -4453
2144 -4453 -1601 2418 1988 4051 2503 2967 2845 2763 3976 2714 -1669 -5074 -6223 -3105 1101 5084
2128 5084 6283 6246 5834 5545 2813 4311 2818 5187 7157 5481 4712 5772 7774 6194 4069 2990
2112 2990 3222 3205 2714 -1159 -2478 -2676 -929 576 -10 -441 -245 2678 3342 330 -281 3323 2295
2095 2295 4107 5131 5479 6531 7233 10137 5718 2415 2049 1902 2859 1306 194 418 -399 -2055 2421
2078 2421 6202 4766 2923 4705 3727 5628 5452 6246 4454 4720 3904 2595 967 -569 -1201 795
2062 795 2655 3600 3381 2241 926 911 -1861 579 538 -2281 -2867 46 3 2108 -1588 -3659 -3556 -2278
2044 -2278 -483 -3496 -2069 527 4451 2403 -1649 -4759 -4414 -367 2242 -2016 -4750 -2903 -817
2029 -817 -118 -228 756 2691 668 -2750 -2343 -180 -883 -1605 -1518 -1099 257 160 -2745 -328 2307 977
2011 977 -2091 -5670 -6822 -7099 -6614 -2710 -3293 -1355 -2177 -2973 -594 160 1404 -1900 -3177 -2812 -5702
1994 -5702 -4595 -5022 -7353 -5986 -2889 -408 3936 7377 4167 1161 2282 1771 2349 -132 -2485 -1566
1978 -1566 -172 598 -3565 -3632 -798 -1485 -1237 -1234 539 175 758 -220 -482 -838 -2498 -255 830 -73
1960 -73 472 983 603 868 2274 2590 1614 1018 1944 2065 3086 4695 3661 66 -715 -2965 -2694 452
1942 452 1092 1961 2654 3238 610 -2070 -2119 -146 1587 3848 5280 3058 657 2310 2258 -1652 -2607
1925 -2607 -2789 -1423 -823 -1356 -2243 -1477 -1810 -1751 1073 -221 147 162 -924 532 442 794 -590 -654 -525
1906 -525 2035 2952 3239 5296 3284 3287 2400 2716 1258 226 520 -656 -3164 25 4496 4498 -2603 -4706
1888 -4706 -3255 358 2999 2547 3547 2209 6114 4764 1355 2096 5490 4905 133 -2228 -883 983
1872 983 2347 876 -2481 -90 1841 -100 -116 -282 792 146 -277 1019 4655 6407 5108 -832
1856 -832 -555 -201 774 1271 -1197 1129 1449 1068 483 708 1702 520 3717 4912 3101 364 332 967
1838 967 693 -2347 -1504 -1271 -1450 -353 -1367 -903 1490 2726 1005 1427 3342 4799 4544 3197 1637
1821 1637 -320 -1934 -1264 261 -1773 988 2015 956 1642 1328 -1601 -2499 -3447 -3348 -5576 -617 -601
1804 -601 -506 -2502 -4684 -6496 -5951 -2730 -1537 -1728 410 5937 8683 7642 2376 -669 1768 4041
1788 4041 3422 1786 2062 -33 -74 544 680 240 -212 -2431 -2123 -2559 -2150 -2073 -3283 452 1417 2175 2895
1769 2895 4734 3025 3114 3941 3627 1446 -1642 -3380 -2211 -3387 -4539 -7030 -5825 -4498 -2209 -899
1753 -899 904 1430 -1309 -2178 414 -2336 -1476 2585 6791 8210 4059 2010 -395 -1989 -2943 -3725
1737 -3725 -4417 -4808 -4540 -2168 -4340 -6425 -7052 -5305 -3300 -1343 1069 2841 1240 -485 122 -436
1721 -436 -1449 -1027 -930 -618 -4168 -6695 -7770 -7151 -7875 -3729 33 -723 13 1065 2388 1125 -1564
1704 -1564 -2020 -764 -2857 -2180 727 4536 2447 1790 438 1136 -1428 -647 3828 2983 601 1055 1200
1687 1200 1418 3060 7575 7821 4350 2635 1063 -948 -3203 -7065 -3299 1558 6503 7254 5408 2050
1671 2050 -608 252 1199 -1124 -1232 -886 1014 -1298 -3250 -3624 378 606 2278 6316 8868 6205
1655 6205 982 1082 285 -629 -2712 -4301 -3115 -890 -606 -108 -468 -4072 -4852 -737 710 112 2501
1638 2501 4812 3237 1392 -752 -2059 -1592 -2784 -2037 845 1230 3061 2805 1008 34 -1582 -212
1622 -212 2952 4586 2410 1883 2245 458 236 815 1739 772 2824 1375 -2368 935 -103 1242 4849
1605 4849 2691 1113 1609 4261 4472 2854 677 -227 -319 169 1104 -1069 1106 669 79 1306 2813
1588 2813 1592 248 1671 1350 741 -1124 -1827 1014 -120 -379 3451 4981 3580 692 4171 5917
1572 5917 4672 5238 1401 3157 4100 5434 4116 3192 1417 -1315 -3096 -4473 -1469 -692 -1010 -4145
1556 -4145 -2830 21 1771 -46 -3352 -3231 -4071 -1500 476 215 -3990 -3158 -1396 -494 -1261 1819
1540 1819 3232 695 897 838 1729 499 1407 5165 4998 5377 5812 1237 384 -1669 1926 789 763 4698
1522 4698 7838 6833 4248 5031 3207 1953 2733 2392 3817 5377 3338 3037 402 -1073 -2855 -3105
1506 -3105 -2351 3277 7246 5458 3679 7892 10893 8345 6232 7127 8690 7368 3270 2993 1263 -2765
1490 -2765 -2559 -1565 -2076 -823 2848 5157 3718 3242 1208 -245 767 2651 4639 4269 982 623
1474 623 1646 5246 5942 555 -2145 -202 488 -720 -1548 -1223 2009 4158 3361 4921 3186 -115
1458 -115 -2257 -1436 -756 -149 -427 -606 1160 3759 2353 969 856 -685 -311 -1193 922 -1717 -4054
1441 -4054 -2468 -405 -1753 -1742 -632 -1550 509 -1773 -2872 -1794 -1887 291 -1060 -633 2497 885
1425 885 783 -1483 -55 115 -2987 -361 1369 2307 1083 1898 5481 8409 12182 7407 2541 1533
1409 1533 3014 2368 1178 3170 5520 7307 1914 -1378 -754 -723 32 -1298 617 4362 6633 8565
1393 8565 4054 -458 -1569 1355 2108 -2133 -2238 1277 790 -2262 -2631 -3048 -2076 -783 -1074 -1625 -3494
1376 -3494 -2562 -1019 292 2797 4969 4227 2142 228 1913 4734 8868 12400 9658 6967 3680
1361 3680 4210 4931 3774 4049 2851 2838 3121 3258 6446 8026 7717 6079 4953 1759 260 -107 802
1344 802 -1378 -930 358 2904 2670 1946 2029 313 2341 7521 8628 6994 5025 7292 9563 5683
1328 5683 2252 1032 1575 4903 5779 3202 7352 9571 6637 1618 1300 1144 -2464 -5961 -2778 3183
1312 3183 1105 -1972 -368 1778 -101 -4351 -1931 -2389 -2911 -2281 3500 4722 3513 3802 6080 7997
1296 7997 8497 3812 3315 2876 6724 3057 454 49 143 1461 1604 3320 3701 4147 2252 584 676 1103
1278 1103 1503 400 -3476 -2813 136 884 -214 406 -4244 -1697 1162 2978 3039 3336 2539 1143 1052
1261 1052 3363 1616 1343 2159 1914 2078 3617 4367 4978 4369 1632 2211 -2177 -4414 -6410 -5539 -6607
1244 -6607 -6076 -4912 -2482 -3013 -5640 422 2347 502 -1041 -1795 -2039 -639 1171 -107 -1303 399
1228 399 2652 3916 4566 7757 9753 10034 5992 655 -3435 -3580 720 3913 6456 3659 2615 4750
1212 4750 3919 1965 -1649 -3893 -3591 -261 1720 -764 333 882 2599 5588 5017 4282 1013 -581
1196 -581 -657 -977 -2144 -1236 -1270 1654 3184 4331 6164 2668 3310 4929 4805 3962 613 639 3794 5758
1178 5758 7211 4181 -34 -553 2644 -364 -1862 -2728 -2366 1139 3753 5117 643 452 1971 627
1162 627 3351 5748 3704 4103 4109 1730 2087 4978 8694 13784 11520 7834 6181 7166 2627 1383 2284
1145 2284 238 -902 -1299 2081 1914 -610 23 -499 -164 3397 6468 4122 -73 -1440 879 -950
1129 -950 340 2269 2346 2977 5451 5610 3230 1084 3432 3051 275 1322 3358 5633 3542 4053 4167
1112 4167 1347 -53 1287 4716 3170 -2886 -6319 -5718 -7312 -8497 -3885 973 2093 514 1252
1097 1252 1742 763 1218 175 -356 -42 327 3852 3413 1278 2216 4175 5148 5212 4958 4517 3842 2595
1079 2595 2580 4085 4643 6577 4736 4148 5683 4216 3898 2937 1963 1335 -84 1817 258 62 2296
1062 2296 2917 2739 2365 -373 -3061 -3340 -139 969 -1609 -2456 668 2957 3897 3851 2595 1149 2256
1045 2256 1908 4211 4226 3449 4425 5183 3926 3019 6407 5462 1747 1789 1065 -1308 -3541 -3456 -736 -120
1027 -120 -941 -2271 3099 3051 4629 4473 979 1680 -1369 -1504 -542 -570 -3586 -4626 -5267 -3998 -1337 1289
1009 1289 633 1492 3198 3652 3508 1463 -575 -510 1770 -235 -4329 -4542 -2663 -1517 270 1014 7
992 7 1401 628 -155 426 535 -2196 -4741 -1633 805 160 -1649 -2123 1150 1998 877 -1454 -3797 -5151
974 -5151 -830 5331 7039 9145 7629 3553 1067 -1052 -726 -556 -294 -1128 135 -672 -2837 -2907 2256
957 2256 2472 1373 1602 -490 -1404 -308 -909 1494 -1361 -2935 -3759 -3578 -3208 -106 472 1638 3382
940 3382 4681 4738 3061 3048 5658 8235 8021 5505 2764 1560 1555 2774 5498 2674 110 -97 636 179
922 179 1012 1334 1190 -869 -2220 629 106 2181 1765 931 1428 4052 3645 1508 -341 -1923 -1178 2215
904 2215 3603 3363 2162 -1933 -2858 -59 -3818 -7422 -5236 -3494 -2625 739 1537 3970 4222 4894 4228
887 4228 2924 2770 5504 3732 2926 5194 9263 9982 7320 2953 1125 -2184 -4879 -4552 -667 1913
871 1913 3037 2836 788 -3053 -3334 -4587 -4922 -2905 -329 -583 918 193 -2844 -967 -257 2165 5542
854 5542 2462 -647 1468 1478 1476 3628 4319 2942 850 1520 2247 4732 7159 6890 7414 5272 4207 4281
836 4281 2628 2004 4071 5116 4829 5993 3868 3417 3044 4327 2676 4283 4593 4646 2493 -715 4
819 4 1406 3495 7016 8083 3839 852 -1639 -1229 673 -1484 -983 456 603 1392 2698 5952 5419
802 5419 6097 7341 6405 6320 7754 4518 4658 5292 6660 4650 1592 1100 -394 1032 3460 -140 756
785 756 6459 6834 7453 7549 3815 3133 4652 3368 2184 1667 3601 2526 2884 7463 8550 7631 3973
768 3973 3619 3902 2702 3690 4409 4636 2299 -104 773 4262 4251 4624 3276 110 1425 1721 1476 3422
750 3422 5620 2777 304 853 2255 1695 -447 580 -1928 -1888 -56 1579 2247 3377 2069 3429
734 3429 1287 -2098 -2112 -1459 -1859 -3351 -4155 -3514 -1909 -2222 982 1736 1741 3754 1584 2047 146 -1160
716 -1160 1301 3304 2692 4682 6109 5631 5126 1404 5648 10036 9323 8352 6390 4391 125 1846
700 1846 2230 1107 3224 8966 10792 7965 7236 5872 3309 3783 6744 8483 4941 259 -1533 275
684 275 -1609 -4754 -3468 -187 -420 -747 3144 6125 4170 2507 1824 2396 2194 5359 5169 2552 3332
667 3332 4173 916 913 3215 3524 -1894 -4601 -1146 -585 -2387 744 5493 5691 2936 5667 6537 11074
650 11074 12484 11467 4924 1593 1908 4803 4939 4424 1939 1298 3924 2819 275 106 -2804 -3779
634 -3779 -2883 1474 2095 744 -1498 -1448 -1791 -231 -354 3599 4728 3644 2019 1234 2951 8702 10534
617 10534 9160 5245 418 -2417 -1418 158 4812 8497 8602 3852 2248 3519 6312 6078 7977 6536
601 6536 3817 5150 7430 6076 7164 9191 8591 8081 7534 7029 10679 8494 7792 4730 1907 -795
585 -795 -545 -512 -659 -570 1426 4098 1252 987 4519 5085 7597 9081 8349 6338 2190 1171 1009 2646
567 2646 3457 4057 1115 -162 1027 50 2127 4596 4661 1655 -928 -682 -5553 -6574 -4437 -1060 2052
550 2052 3510 3223 757 1995 5117 4299 3067 2193 666 1058 2378 4650 9475 10637 6994 1115
534 1115 1955 6512 4336 3747 3558 5980 6617 5688 3617 4567 6819 7594 4965 2882 1623 1618 2322 4304
516 4304 1536 -944 -569 2000 4783 4652 4940 4864 2421 4547 3700 2080 631 2101 4611 4491 3759
499 3759 4126 1138 1131 1484 731 1470 5198 8732 6965 3907 3367 1974 2520 4304 6785 9530 7751
482 7751 9399 8809 8754 5312 2852 4027 6710 8447 6064 6856 5818 3886 5782 5191 -1070 -5108
466 -5108 -4370 -1816 2441 1514 -741 762 3170 3811 4008 4344 4603 1990 68 1578 4594 4665 -898
449 -898 -1782 3032 4773 4021 2972 3222 1776 365 -1690 -4646 -1743 -2730 -3747 -3651 -1587 1429 3685
432 3685 2556 2247 2091 1522 975 5296 6507 3745 1529 2372 3336 2923 2321 1249 8 -3792 -4719
415 -4719 -1792 -750 2074 -1366 -2718 -4760 -1650 -1016 105 -1358 -2754 -2595 -1582 -281 3884 4115
399 4115 2550 3657 4917 4092 -690 -1989 803 1506 -769 -898 1631 6445 9906 10350 8135 5818
383 5818 5350 3998 6803 5838 3644 4372 7338 5309 5667 4362 5515 2461 1872 4021 6760 10037
367 10037 8591 3843 3593 2891 3340 5249 5249 1545 334 885 -393 1212 1856 961 1349 4076 1910
350 1910 1556 929 899 5765 7082 4745 3856 3901 93 -274 2174 1131 2324 3302 3083 4421 4076 4267
332 4267 5829 6825 7231 6287 5325 4785 8628 7570 3383 3855 3475 167 -1912 -3052 -3928 -3187 -520
315 -520 -100 2319 3513 2198 126 151 1024 2589 5601 5749 6798 7664 7697 8030 6714 4385 2730 3399
297 3399 3835 8709 6540 3797 882 -1373 1046 2134 3211 5306 2044 -1523 404 -27 1510 988
281 988 1079 430 910 4879 5246 3766 1064 230 2186 5245 5139 4269 2516 507 2365 4779 3509
264 3509 283 -2258 -917 61 214 1910 2765 4420 2810 248 1564 4687 5430 7820 9828 7015
248 7015 3215 2693 6464 10292 8846 3956 2296 4642 5394 4571 4552 4175 4367 4745 -262 444 1521
231 1521 6232 8578 7765 5228 3807 4435 4584 4166 3690 2435 931 -182 -96 1014 1654 2569 3507 1292
213 1292 -696 1625 -190 937 -841 -2044 -949 -188 1951 4213 4701 3744 4425 5988 4868 2793
197 2793 1696 2725 2960 4161 2670 1339 -399 1988 4667 5434 3938 3051 3264 1030 2988 4543
181 4543 5713 5167 3622 5114 2239 1003 2782 3618 1379 3010 4947 3524 1402 1216 1457 2116
165 2116 1305 636 1315 2413 259 1087 1553 3333 3215 3650 6415 6191 5916 5718 3528 2434 1171 1145
147 1145 1814 3628 6791 6018 5680 6818 7115 7679 6287 5307 5538 5257 4407 3556 5193 6389 5906 6548
129 6548 4482 221 92 3795 4234 2595 2060 928 3280 3808 5082 6984 7429 4431 318 737 2314
112 2314 3402 4287 3982 3817 1464 -885 -1674 1631 3252 4033 5394 4478 4316 5542 3455 1025 -913
95 -913 -711 -405 1848 2620 3096 4362 2596 465 -311 -701 490 3013 4227 5172 5231 4274 2675 2709 900
76 900 -1812 -3008 -1485 -1905 807 2930 3678 3250 1612 2866 2856 2409 3427 4540 3246 761 1962
59 1962 6199 8173 5272 4542 5477 4740 2032 -1729 -2476 -171 1112 3120 3051 1553 416 1316 4540
42 4540 2513 526 2082 4269 2451 -534 2310 2122 2048 1177 1459 2767 3695 4592 7292 8781 8960
25 8960 6083 3826 2879 3491 2493 1503 2405 4346 2907 -133 398 100 3919 4607 3225 3747 4834 6864
7 6864 5326 5092 6153 5634 4312 857 -1366
0 -1366
$$ Imaginary data points
##PAGE= N=2
##DATA TABLE= (X++(I..I)), XYDATA
32767 20905 21006 17552 17352 18890 18578 19070 20330 22144 22086 22634 25375 23489 21239 22358 24072 23845
32751 23845 24370 24754 24810 27131 29574 30720 28949 27050 26122 24330 24407 25501 26421 26864 27145 27265 26401
32734 26401 25323 23516 25015 24593 25183 29206 31131 30317 32152 31689 31852 32784 32442 32392 31661 32544 30873
32717 30873 29272 31794 32038 32454 31839 32328 31599 30564 32649 35358 35469 37065 38528 40561 41740 39358
32701 39358 39386 40777 40178 39334 37526 35447 34559 36227 38288 41180 42678 44051 43723 44866 46244 47114
32685 47114 49069 48807 47144 44978 44214 48097 50612 47634 45637 43990 45099 47437 47225 46291 47457
32670 47457 48008 48107 50058 50713 49417 47881 46354 48149 48444 48647 47833 47111 50572 51686 52948 53164 52586
32653 52586 50967 48132 50308 53095 53832 54210 54488 54553 52599 52367 52641 53060 54856 54878 57374 57726 54117
32636 54117 51503 55011 57141 57728 58961 60471 59309 56252 57125 58507 58540 58653 58038 55301 53691 53260
32620 53260 55849 56803 59468 59599 55730 55397 55335 57362 58754 62675 65122 65581 65754 65937 67183 64574
32604 64574 61332 61459 65063 64962 63586 62325 64444 64108 64907 66911 67004 66422 65185 66109 68154 68978 69204
32587 69204 71001 70642 71131 71362 69673 69668 69865 69478 72945 74000 73977 73700 73334 74558 73768 73239 73724 72377
32569 72377 70776 71755 74817 74530 76336 77803 76045 74172 74330 77073 79720 77926 77047 76837 79880 78463
32553 78463 75103 72495 72869 72762 73140 73963 74712 74973 78753 78741 79187 76636 76802 77599 78034 78196 81890 82604
32535 82604 81833 80967 78869 79376 80891 83229 85306 84272 82243 81156 83889 84229 82920 84281 85303
32520 85303 83971 84000 86300 87590 87794 87069 85318 83687 80429 79127 82263 84820 87418 90115 92760
32505 92760 92118 89679 87145 88623 89438 89662 91899 91593 88954 86303 87742 88812 91347 93603 92341
32490 92341 91301 91955 89710 85440 88213 89987 89325 87529 89497 92972 90716 87084 86837 88466 89151
32475 89151 90255 91732 91340 89953 88629 89848 87336 85991 89229 92323 94577 94235 93506 93607 93103 94553
32459 94553 94106 95764 96669 94058 91172 90176 90921 94470 98084 97162 96489 97874 95432 94156 94139 93012
32443 93012 92108 97090 98607 95620 97831 98020 95164 94946 95685 94162 93523 94961 100343 101174 102085 102590
32427 102590 100224 102487 103782 100715 100390 101930 99989 97858 98347 97726 98716 99342 99121 99282 98672 96955
32411 96955 97052 98901 101306 102589 101410 98284 96154 97691 98933 99865 100782 100439 100814 100503 99453 101446
32395 101446 103101 100998 101814 101174 97445 97190 99526 103393 104825 102675 101087 101756 102517 101441 102190 99035
32379 99035 96287 98069 96876 98381 105035 107588 106954 105856 104440 105032 103346 101410 100274 102856 103842
32364 103842 105788 104451 104502 104831 105220 107122 104705 104204 102814 99959 101552 102854 106531 106569 104803 105412
32348 105412 105229 104972 107133 104817 104537 102923 104188 105071 105797 106851 109973 109815 110464 109688 109575 109067 109125
32331 109125 106041 102794 105582 109257 106935 103104 103261 106711 107838 108908 111803 112307 110771 107511 110862
32316 110862 115620 112897 110393 112294 111646 111109 111549 111604 109499 108450 110853 113078 111475 109407 110066 112108
32300 112108 114870 113923 111739 110613 109596 108576 111645 110712 113167 114588 115932 116673 117666 116889 115802
32285 115802 113524 111315 111560 114286 113142 114748 116824 115383 116508 115392 114014 114402 114042 114288 112424
32270 112424 113256 114712 112471 112088 113126 115948 116819 117199 115236 118419 116076 110202 111943 115580 115736
32255 115736 118154 117435 115592 113245 111766 109916 110084 109942 108397 110397 111988 115261 116211 115574 113015
32240 113015 115332 116496 115439 114233 110425 111447 114729 115692 116403 111620 113002 113770 111910 112620 115502
32225 115502 115445 115045 114964 115346 115286 114604 115465 112336 107034 108272 109335 113850 115747 113090 110636 111240 110417
32208 110417 113339 115947 117514 115155 112966 113045 114361 114374 112353 116323 118867 118400 115667 115431 112063 116681
32192 116681 119862 120472 120409 119440 116447 113245 112586 112231 114208 115891 119048 121799 122189 121775 119389 117328
32176 117328 117386 116192 116066 118734 120564 120014 119637 117552 117505 115744 115858 117499 117976 118728 117551 117008 114438
32159 114438 116810 119882 118581 114921 111879 111989 114644 116629 116238 111770 111559 113879 114435 115146 113751
32144 113751 115013 115435 118803 119001 114894 116802 118765 115764 113267 115125 116007 114822 116214 116260 118984
32129 118984 121541 118585 116932 116547 116714 121234 123136 119373 118480 118551 117673 114735 114707 114577 116068 117116
32113 117116 117739 114763 112564 111313 113165 111634 111266 111872 114579 116531 116131 119645 120162 120181 119165 120336
32097 120336 120140 118461 118620 118840 120111 116729 115566 118590 120666 119482 120219 117469 112438 113980 113983 114522
32081 114522 113157 109433 111370 114578 115717 114100 114070 118193 120115 117271 112962 114407 116110 120311 120107
32066 120107 116867 116065 117071 120749 123974 121587 119222 116680 116761 116242 116312 117214 116917 116429 117542 116373
32050 116373 114976 113708 116649 119791 116927 114787 111952 112908 115818 117190 117331 115968 114387 114326 113624
32035 113624 115436 113782 113853 116683 119981 114773 112072 115357 117247 119183 117432 111859 112743 114346 116585
32020 116585 117327 115390 111076 111296 112893 114039 115933 119554 121614 121697 120139 119998 117938 114672 116015
32005 116015 119767 120210 118516 116102 111855 109707 112205 114149 114997 116723 117603 118364 120745 120798 121215 119790
31989 119790 120960 121269 119812 120331 120500 117558 120066 122924 123259 120879 119967 119622 119038 118995 118220 119954 120690
31972 120690 116990 116527 116443 116718 117542 117763 117462 117786 117273 118793 122189 120930 119233 116613 117701 116049
31956 116049 116235 118288 120757 122029 122979 121301 119882 118735 116184 113785 114382 115533 114454 116665 117874
31941 117874 118635 120282 119417 118153 117102 118632 120931 121402 119850 119099 121874 123868 122744 120749 118820
31926 118820 120262 120397 120028 119787 120625 120656 119948 119299 119882 120967 120752 118675 118213 120098 119568 118409 120530
31909 120530 122881 124549 121827 121155 117921 113559 114298 116427 114726 116481 114801 113341 111140 110876 111234
31894 111234 113913 116315 117423 116256 119488 117797 116837 116338 115734 116714 120514 118861 116828 118860 116354
31879 116354 114558 114422 115071 115394 117517 115873 113921 113197 112446 116913 121566 124501 121918 120196 119543 118444
31863 118444 118323 121686 123467 125181 124634 123888 122201 121542 119344 118304 119178 116816 118056 119891 122582
31848 122582 120927 117057 118088 119926 121018 120046 117805 120409 122386 123055 121336 121943 120711 116959 116576
31833 116576 116961 118900 119612 120697 118142 119543 119743 123906 126888 124504 125458 122116 118631 118431 123145
31818 123145 127804 125205 120747 120383 121160 121057 120047 119572 117760 114315 114817 117060 116888 119160 121152 121479
31802 121479 121317 121510 120999 119300 120212 123771 122505 121805 119987 118570 119973 123505 123131 121215 117261 117463
31786 117463 119331 116026 115098 117789 116271 115789 118746 119530 118053 117650 120808 122124 123321 125893 127132
31771 127132 121771 117950 117167 116330 115949 116912 119862 119404 121469 119081 116592 119637 119272 120629 120119 116897
31755 116897 119987 122472 123701 120224 118573 119406 117876 117514 117623 120389 120470 119288 116800 119508 121389
31740 121389 117520 110821 109844 112753 115468 117906 118784 120385 122073 119586 118985 118190 117717 116262 115170
31725 115170 115863 117408 119630 120052 120230 121093 122659 123152 120423 120115 119785 122215 124895 125350 124710 126011
31709 126011 124716 120555 116154 115443 115038 114966 117797 121366 118641 118594 120842 122382 122010 119491 119361 117959
31693 117959 119618 119633 116985 116015 117800 118156 120826 122368 121546 121755 116993 113034 112540 118099 122623 123310
31677 123310 122703 125042 125055 123224 120858 119311 119107 124484 125668 124993 126872 122872 118741 119578 119475 118558
31661 118558 117187 117400 119962 122419 121068 118531 116713 116956 117485 119194 116760 113813 114954 117263 117938
31646 117938 119952 120258 117747 117361 118377 119009 124136 124501 122820 120747 123882 126060 122142 118215 116085
31631 116085 114262 112775 114638 116058 115684 113327 111759 113042 116836 120052 119468 120808 123564 120647 117947
31616 117947 117672 120569 119210 119615 118430 118385 117928 118614 118211 116199 116626 118978 117828 113848 116163 119467
31600 119467 121960 121687 123736 124909 122899 119927 117256 119514 122171 126829 126342 124171 122330 121265 119678
31585 119678 123283 125213 125773 123103 121473 124585 127274 125706 120984 119912 120290 120059 121997 122501 120677
31570 120677 120699 117129 117196 121556 123599 123558 124721 122241 121008 119071 116906 121555 122328 117685 120563 125605
31554 125605 129173 128573 125753 123107 125640 127688 126948 125005 121066 122574 127123 125918 122462 120507 121993
31539 121993 121793 121285 121197 120276 119309 119874 122332 123042 122341 123881 123554 122322 124716 123547 120891 120875 118469
31522 118469 118725 120470 120008 119854 117347 115996 116806 118564 121644 121476 118647 119899 118643 113949 115109
31507 115109 121467 119965 118274 118625 118016 121106 122452 121685 119438 120746 119271 118172 120061 123106 123115 123970
31491 123970 124098 121668 121060 121561 122094 119772 119706 120172 121580 119883 117179 116747 114478 115283 116892 117131 117062
31474 117062 117216 118558 121665 124299 123306 120379 118864 117768 118369 117910 117305 120732 123956 123416 119791 119431
31458 119431 118441 117550 119617 123706 123904 121882 118556 120726 122939 125144 125218 123540 121444 118543 117873 120229
31442 120229 122139 124203 122552 122620 124739 123990 119937 116943 120349 121288 118661 118299 119966 118536 119096 118769
31426 118769 118872 120517 122615 125131 124640 122861 119721 116838 116626 120211 122580 122314 122058 119189 120497
31411 120497 121186 126819 126318 125132 122625 122150 125403 126866 127026 125762 125248 122777 120145 121160 123652
31396 123652 123936 123726 122399 125163 125936 121464 118853 117681 118031 119099 121075 121599 121072 119462 121606 126921
31380 126921 127682 123889 122208 120281 117996 117052 117771 120324 124295 124551 124877 123750 123276 122647 121481 121730
31364 121730 119091 117400 120462 120787 120587 121283 123030 123896 124512 124183 123880 123212 120690 118881 119983 122424
31348 122424 121944 120568 121437 121541 118257 117758 119561 118772 121734 123378 122528 122238 125109 124463 122504 122533 126064
31331 126064 127068 124623 122975 122711 123244 122498 120443 117142 117139 117255 116756 115312 117571 122755 125081 125649
31315 125649 125541 122002 122756 121154 121984 122762 123153 126224 125549 127809 127901 123870 123584 123494 121441 121138 123316
31298 123316 124300 122828 122398 123951 125067 125989 123132 121904 122478 121166 122182 121094 119067 118945 122601
31283 122601 123273 122970 123436 123618 122548 123398 123762 124648 127613 125922 122693 121505 122697 123426 122637 121350
31267 121350 122820 122735 122396 123235 121968 119081 119081 123088 124114 126534 126258 123259 121326 122779 120571 121014
31251 121014 120159 117371 114209 114784 119296 120391 123446 125456 123883 120051 118714 119107 121466 122730 123673
31236 123673 126225 127996 124918 121244 119293 121998 122932 123436 123251 123735 122245 122076 122281 122519 121770 123341
31220 123341 121663 118543 120747 123105 122933 124002 124705 124747 123133 123719 121304 119888 120131 118832 118326 122531
31204 122531 124904 127620 127728 127247 127237 123704 124251 126564 128234 127461 127182 121068 119506 117496 117867 119952
31188 119952 121007 121386 122395 123024 122164 122127 119755 118369 120488 120487 119813 120819 119491 118175 120372 120663 122243
31171 122243 122046 121039 118827 119273 120143 119570 119630 122917 126082 127417 126856 126069 121872 120392 119667 114486
31155 114486 114289 116687 117358 118049 121415 122992 122175 121871 121106 122190 122341 120351 117754 121725 125003 122461
31139 122461 120861 121284 121137 123230 124755 126221 121845 124678 124730 122427 121962 122683 123488 121672 120165 120613
31123 120613 123061 122889 122448 121836 125643 127548 128093 123939 121353 122024 123115 125716 123641 122929 127297 127482
31107 127482 126393 126735 125551 124411 124106 125118 126249 124337 123737 123998 122971 126679 127595 127081 127870 129707
31091 129707 128903 126323 128583 128283 128073 128423 126424 120609 121423 122952 122974 123941 125082 126387 124497 120943
31075 120943 119422 122148 125009 125771 123403 121833 123252 124518 126133 129109 131310 131088 127570 124279 125306
31060 125306 122969 122982 123033 125268 126256 123639 121782 124477 124413 125144 123644 120245 119741 120948 121467 124180 128943
31043 128943 129725 127570 123217 119536 116461 115729 118127 119445 118054 120629 120259 119926 120211 124344 123411 122358
31027 122358 122517 124587 123773 123774 122643 120985 122139 121250 123534 126024 125617 127769 123848 121441 124036 123942
31011 123942 123925 122412 119889 123819 126154 125664 125143 122854 124516 127496 125743 122778 119806 117745 121271
30996 121271 124726 127681 123732 116611 118418 120414 121042 123223 125235 125669 126207 124098 125677 127900 127388
30981 127388 128824 125765 122742 119857 116950 117550 119386 120245 121551 120177 119370 119508 120657 124152 125415
30966 125415 126057 125816 122547 122063 124902 123448 123411 122522 121966 122089 121710 124752 123495 124148 124975 123883 123939
30949 123939 124720 122463 121697 122421 122558 123609 125571 124894 122562 122545 119859 119104 119557 124766 126709 124676
30933 124676 123559 124320 125905 125582 122591 121217 120195 123297 125584 129707 133418 128384 121117 120435 122497
30918 122497 122923 126323 127857 130338 130000 128557 126238 126732 128733 127949 127781 128921 126317 124500 123949 121882
30902 121882 120957 121559 121678 124475 126471 127841 127928 126336 123194 123538 125207 127576 130820 132479 129983 128919
30886 128919 127079 125783 127048 122491 120258 120137 121296 122148 122223 121666 122258 124519 124968 125445 125157 127576
30870 127576 126192 126887 126629 126605 127084 126791 128152 127429 125737 126691 125380 125498 126055 126045 127840 130772 129800
30853 129800 126796 122732 121946 125627 127494 127466 127929 127859 126460 126157 127157 128298 128524 128061 127058 127652 128422
30836 128422 127233 128991 129511 129276 131421 132875 130653 126114 124514 122229 121178 121566 124126 124625 126861
30821 126861 128134 128518 128037 129796 128970 124790 123469 123285 125333 124389 121027 120669 122689 122967 123858 125437
30805 125437 125756 124239 124796 128353 129854 130154 125779 124779 125749 127904 128472 129626 129429 126259 124944 125106
30789 125106 128245 131307 130676 129526 127489 127646 126332 123886 124615 126003 125784 126277 126297 126212 126444 123053 127371
30772 127371 130293 132955 129705 124325 122362 121980 123459 126840 126462 125044 129838 132289 131893 130302 130205
30757 130205 127500 124961 125892 127356 128151 129437 128188 131281 132992 130238 127142 126885 130108 129627 132041
30742 132041 131286 127328 124692 122973 122675 124158 126774 126544 122506 122074 125319 127699 131690 131054 127130
30727 127130 125180 121154 121300 122901 123768 126810 126916 124145 123560 124017 127752 129706 130855 128124 126738
30712 126738 128320 128532 127602 129150 128604 126458 127583 129478 129582 129049 124716 122410 123627 123910 124787 123955
30696 123955 120146 120052 121028 120151 120804 123119 124823 124470 126238 128642 129179 128304 128883 124911 123484 125747
30680 125747 126659 125592 123560 123005 124314 126073 127161 128174 127539 130989 132346 133536 131331 129095 126427
30665 126427 124473 123465 123584 123221 122109 121874 125605 126268 124998 124653 124356 121829 122879 127631 130346 130138
30649 130138 126166 127030 128996 129669 127727 124896 124604 125518 127391 125829 126471 126529 126184 125297 123334 121551
30633 121551 124209 125561 128096 128198 127647 130265 130541 130892 130786 125370 124866 125491 127063 125828 125563 129197
30617 129197 128657 126217 127849 123623 121773 123777 124524 126419 127383 127521 130760 130591 128374 128816 128797 124330
30601 124330 124615 125626 126858 128818 127376 127692 127346 127028 128496 130129 132165 129912 126340 125478 126909
30586 126909 128214 126476 123208 123069 126306 124457 125211 128011 130155 132684 134854 133374 129959 125425 127340
30571 127340 129365 131779 130387 129856 127013 126245 126506 125573 123686 121101 118186 121854 121348 121575 127402 127691
30555 127691 124602 125502 124750 118345 118927 119397 122420 122046 118443 120099 123741 124405 125436 126836 128822 129494
30539 129494 125045 126547 127114 127416 126511 127839 129565 131036 130981 130879 129357 132326 133514 133277 130917 129111
30523 129111 127240 128633 128595 128750 129782 129377 131371 132761 130836 127755 126647 128944 130410 131524 132189
30508 132189 130246 126386 127570 128732 130462 128657 128907 127529 129892 131242 130179 127803 125816 124422
30494 124422 123935 122799 124761 126658 128005 126722 126361 127445 127772 124877 126085 128781 127110 126328 129691
30479 129691 129756 129057 131063 131596 129365 129856 130230 130385 132108 133781 129961 127623 123153 120709 120445 120483 123812
30462 123812 126684 128743 129718 126514 124949 126183 126519 126674 128788 128265 128949 132584 131890 126830 123876 126409
30446 126409 127726 128951 129101 128406 132837 133159 131057 128483 129631 129061 131485 132007 130567 127101 130809
30431 130809 133488 130676 129379 127635 125463 125085 124998 127219 129601 130535 128560 129229 131053 131383 133511 132710
30415 132710 133209 132048 128369 124889 126926 128094 129129 130907 130216 129315 125517 120408 121294 119877 120099
30400 120099 123588 124348 125875 123786 121278 120583 124162 126747 126588 125309 123580 123044 125964 128654 131020
30385 131020 131623 128846 126789 124828 123947 123606 126154 130521 126810 125149 127507 130640 129123 127494 131097
30370 131097 132749 132103 128496 128926 132294 133329 130222 129082 127113 125741 128716 130230 129646 132224 131932
30355 131932 133663 137182 137407 134217 130082 128907 131960 132231 128481 125948 125533 127798 128131 130157 125901
30340 125901 125470 126906 124811 124682 121201 121089 121814 126495 127109 122989 122517 125280 127761 127831 128748 129294 129356
30323 129356 129944 129470 131112 134156 134180 129311 123929 124322 127093 130431 133085 132873 129730 128057 127801 129521
30307 129521 126948 129654 130072 127747 128170 125934 125976 125503 127791 130015 131968 131415 130627 125916 124320 127321
30291 127321 126691 127196 126658 126647 126322 126699 125981 127128 131503 133422 133877 131685 127605 121390 120209 123174
30275 123174 123796 125059 127161 128118 129500 129174 129950 133168 134450 131279 132348 132504 133380 134457 133729 134756
30259 134756 129915 126756 125899 128185 127790 127020 126705 128192 130664 131291 127176 126603 126810 125423 125967 130448
30243 130448 133342 133714 130824 129773 132568 132592 128229 130509 129909 125594 120850 122864 129303 132409 130758
30228 130758 128860 129047 129230 132699 132397 131652 133261 132222 129365 129741 132762 133399 133408 133062 128482 127918 130129
30211 130129 124481 125942 128573 131849 135517 135252 132581 132080 127866 127172 129779 127198 125552 122676 123370
30196 123370 125167 127755 130337 131995 130152 130287 130382 132600 131822 131722 131276 130131 129504 128391 127400 127970
30180 127970 126672 127987 127930 128328 129630 133121 132190 130008 131718 131634 131787 132421 132838 131254 130342 131311 127472
30163 127472 125637 124904 127474 127811 126042 125480 129317 130399 130008 135109 136236 130638 127710 128013 125851
30148 125851 127750 127483 124720 121271 123085 126279 128079 129432 128436 128665 131372 130322 129448 128741 128937 134098
30132 134098 133216 132486 128495 126313 127469 131111 128603 130286 133857 134870 135172 133859 133285 130128 127825
30117 127825 128840 126087 126945 129103 127405 126118 125489 128127 132639 133824 133401 129540 125451 125404 129191
30102 129191 135295 133391 133820 137944 134599 135096 134948 132701 130441 128898 128021 128445 132764 133689 133049 133115
30086 133115 133397 130425 130704 135324 137173 134534 132409 134588 133405 128983 127779 131694 133826 136920 136560
30071 136560 132340 134638 134374 131865 128265 127912 130227 133203 131068 131659 134082 131375 130387 130018 133729
30056 133729 135685 135495 135501 136568 134491 134847 134783 133928 132413 131533 130180 126819 125847 129510 132848 132359 131657
30039 131657 130971 131251 130090 131493 132147 134454 135938 136928 135494 135046 136572 137927 139105 138553 137126 132538
30023 132538 128245 129015 133889 135489 134690 135619 134904 130515 132077 131352 129105 128573 129899 129431 130618 130986
30007 130986 130413 132926 134490 132858 132556 129725 132219 134246 133642 132383 126155 127699 132841 134867 134626
29992 134626 134282 131224 130542 132180 131635 132033 134883 136393 137609 135232 133308 134317 136852 135584 132426
29977 132426 131514 132647 132152 131108 132297 132523 131113 131001 130928 129133 129628 133664 136834 137358 135234 132660
29961 132660 130457 127609 125298 126161 125913 126303 124642 128177 130488 132914 130810 129410 131494 128935 129567
29946 129567 130517 129878 130960 132037 133186 135153 133548 129559 127692 128719 131912 136090 137261 133325 133090
29931 133090 133949 132881 131727 130426 133769 134246 130447 130599 131830 133381 131913 132332 130562 129210 129013
29916 129013 131741 129552 129716 129018 128493 130286 129475 129286 129262 128297 127490 129422 131444 134408 135919 135639 132395
29899 132395 127422 128741 129701 131648 130990 129495 131330 136208 134633 128630 126643 127567 129378 130990 133903
29884 133903 135253 137539 132866 130637 138352 139470 137036 135134 135287 135059 133784 133666 134351 132824 130573
29869 130573 132481 133575 131340 127023 127443 129623 130493 129513 129123 130094 131930 131727 131951 131880 131290 134045 137987
29852 137987 135422 132977 132106 131673 131448 131868 131560 130728 131537 133861 132184 132287 132953 134991 136886 137046 136369
29835 136369 134036 136325 137991 136666 135365 133961 134331 135945 134605 133588 134746 138400 138082 135308 136892
29820 136892 138607 136639 136948 139184 137562 134167 133783 131110 129853 133234 136214 137790 138900 140152 141669
29805 141669 139384 140238 140743 136976 136440 137656 141497 141478 136254 133067 133263 132978 130781 130686 130701 128647 128463
29788 128463 129014 130724 131996 133360 134742 136382 138690 137194 134341 133751 132394 135345 134950 133564 132785
29773 132785 132206 130227 130249 132272 134535 131453 130092 131296 130303 132898 138161 140276 138166 139974 138252
29758 138252 136694 134829 136194 138408 134976 135918 134839 135110 136444 131680 130425 128456 129685 131925 135533
29743 135533 137918 135422 131382 129702 133085 135842 138238 137225 137241 136063 133153 135756 138239 139296 138675
29728 138675 137775 136240 132396 131926 132668 136032 139920 137758 132918 131981 132312 133744 135162 133597 134192 131300
29712 131300 132760 133991 133388 132504 132019 131886 131726 134082 134234 135635 138059 139051 137869 134341 131694 132211
29696 132211 134520 138188 139190 139090 137269 134634 130227 126719 127905 132248 135739 140176 144358 142733
29682 142733 140248 140366 139238 134850 133427 136445 135084 134950 134047 134107 135087 135974 135187 133171 132792 135214
29666 135214 135361 135862 134709 134438 132006 131692 131839 130833 130231 130711 133770 136075 137591 137362 135811 134546
29650 134546 134911 137172 139425 139646 142450 139707 140237 137070 135650 135247 133633 130717 127918 129676 129625 129457
29634 129457 131531 137214 140707 142147 139001 141029 140577 139994 139297 137397 136157 136139 136986 135543 136062 138513
29618 138513 135340 131430 130324 133317 134744 134555 135068 136496 137180 139111 139865 136795 132990 133310 134052 134628
$$ [...]
##END NTUPLES=NMR SPECTRUM
##END=
