##TITLE=Analysis number 330081
Compound Code cc 27701
Project Code adrs lab3
Chemist Name stores
##JCAMPDX= 6.0         $$ Bruker NMR JCAMP-DX V2.0
##DATA TYPE= NMR SPECTRUM
##DATA CLASS= NTUPLES
##ORIGIN= Bruker BioSpin GmbH
##OWNER= nmr
$$ XWIN-NMR		Version 3.5
$$ Thu Oct 25 09:05:36 2007 GMT Daylight Time (UT+1h)  MAYBRIDGE\nmr@NMR_250MHZ
##.OBSERVE FREQUENCY= 250.131544655141
##.OBSERVE NUCLEUS= ^1H
##.ACQUISITION MODE= SIMULTANEOUS (DQD)
##.ACQUISITION SCHEME= undefined
##.AVERAGES= 16
##.DIGITISER RES= 18
##SPECTROMETER/DATA SYSTEM= dpx250
##.PULSE SEQUENCE= zg30
##.SOLVENT NAME= DMSO
##.SHIFT REFERENCE= (INTERNAL, DMSO, 0, 16.522)
##AUDIT TRAIL= $$ (NUMBER, WHEN, WHO, WHERE, WHAT)
$$ ##TITLE= Audit trail, XWIN-NMR		Version 3.5
$$ ##JCAMPDX= 5.01
$$ ##ORIGIN= Bruker BioSpin GmbH
$$ ##OWNER= nmr
$$ C:\u/data/dgb/nmr/ADRS/1330/pdata/1/auditp.txt
$$ ##AUDIT TRAIL=  $$ (NUMBER, WHEN, WHO, WHERE, WHAT)
(   1,<2007-10-25 09:05:13.52 +100>,<MAYBRIDGE\nmr>,<NMR_250MHZ>,
      <created by zg, POWCHK disabled, PULCHK disabled
       configuration hash MD5:
       76 6E 9A 78 1E 09 19 81 EC 84 63 8F B0 6A 59 2D
       data hash MD5: 64K
       26 22 D1 50 54 0A 02 5D BE 87 98 CE 34 1A 70 AE>)
(   2,<2007-10-25 09:05:26.16 +100>,<MAYBRIDGE\nmr>,<NMR_250MHZ>,
      <Start of raw data processing
       ef LB = 0.3 FT_mod = 6 PKNL = 1 SI = 32K 
       data hash MD5: 32K
       00 86 EB 08 89 B2 A1 61 19 00 4A D0 6E 54 FF 0F>)
(   3,<2007-10-25 09:05:27.74 +100>,<MAYBRIDGE\nmr>,<NMR_250MHZ>,
      <apk 
       data hash MD5: 32K
       92 A2 05 37 17 33 D8 01 6F E4 33 B6 67 00 FC 7F>)
(   4,<2007-10-25 09:05:28.50 +100>,<MAYBRIDGE\nmr>,<NMR_250MHZ>,
      <abs ABSG = 5 
       data hash MD5: 32K
       2E 2F EE C0 DC DD 9D 1F A6 59 66 22 E6 55 62 DD>)
$$ ##END=
$$ 
$$ hash MD5
$$ 12 B6 E7 CC 7C 80 1B 7F 8F 51 62 BE DA 7E 25 91
##$RELAX= 
##$RELAX= 
##$RELAX= 
##$RELAX= 
##$RELAX= 
##$RELAX= 
##$RELAX= 
$$ Bruker specific parameters
$$ --------------------------
##$DU= <C:\u>
##$EXPNO= 1330
##$NAME= <ADRS>
##$PROCNO= 1
##$TYPE= <nmr>
##$USER= <dgb>
##$AMP= (0..31)
100 100 100 100 100 100 100 100 100 100 100 100 100 100 100 100 100 100 
100 100 100 100 100 100 100 100 100 100 100 100 100 100 
##$AQSEQ= 0
##$AQ_mod= 3
##$AUNM= <au_zg>
##$AUTOPOS= <3 >
##$BF1= 250.13
##$BF2= 250.13
##$BF3= 250.13
##$BF4= 250.13
##$BF5= 500.13
##$BF6= 500.13
##$BF7= 500.13
##$BF8= 500.13
##$BYTORDA= 1
##$CFDGTYP= 0
##$CFRGTYP= 5
##$CHEMSTR= <none>
##$CNST= (0..31)
1 1 145 1 1 1 1 1 1 1 1 1 1 1 1 1 1 1 1 1 1 1 1 1 1 1 1 1 1 1 1 1 
##$CPDPRG= <>
##$CPDPRG1= <>
##$CPDPRG2= <>
##$CPDPRG3= <>
##$CPDPRG4= <mlev>
##$CPDPRG5= <mlev>
##$CPDPRG6= <mlev>
##$CPDPRG7= <mlev>
##$CPDPRG8= <mlev>
##$CPDPRGB= <>
##$CPDPRGT= <>
##$D= (0..31)
0 1 0 0 0 0 0 0 0 0.06 0 0 0 0 0 0 0.0002 0 0 0 0 0 0 0 0 0 0 0 0 0 0 
0 
##$DATE= 1193299512
##$DBL= (0..7)
120 120 120 120 120 120 120 120 
##$DBP= (0..7)
150 150 150 150 150 150 150 150 
##$DBP07= 0
##$DBPNAM0= <>
##$DBPNAM1= <>
##$DBPNAM2= <>
$$ [...]
##$SUBNAM7= <"">
##$SUBNAM8= <"">
##$SUBNAM9= <"">
##$SW= 20.6930455092707
##$SWIBOX= (0..15)
0 0 3 0 0 0 0 0 0 0 0 0 0 0 0 0 
##$SW_h= 5175.983436853
##$TD= 65536
##$TD0= 1
##$TE= 295.16
##$TE2= 300
##$TE3= 300
##$TEG= 300
##$TL= (0..7)
0 120 120 120 120 120 120 120 
##$TP= (0..7)
150 150 150 150 150 150 150 150 
##$TP07= 0
##$TPNAME0= <>
##$TPNAME1= <>
##$TPNAME2= <>
##$TPNAME3= <>
##$TPNAME4= <>
##$TPNAME5= <>
##$TPNAME6= <>
##$TPNAME7= <>
##$TPOAL= (0..7)
0.5 0.5 0.5 0.5 0.5 0.5 0.5 0.5 
##$TPOFFS= (0..7)
0 0 0 0 0 0 0 0 
##$TUNHIN= 0
##$TUNHOUT= 0
##$TUNXOUT= 0
##$USERA1= <user>
##$USERA2= <user>
##$USERA3= <user>
##$USERA4= <user>
##$USERA5= <user>
##$V9= 5
##$VALIST= <valist>
##$VCLIST= <CCCCCCCCCCCCCCC>
##$VD= 0
##$VDLIST= <DDDDDDDDDDDDDDD>
##$VPLIST= <PPPPPPPPPPPPPPP>
##$VTLIST= <TTTTTTTTTTTTTTT>
##$WBST= 1024
##$WBSW= 4
##$XGAIN= (0..3)
0 0 0 0 
##$XL= 0
##$YL= 0
##$YMAX_a= 344305
##$YMIN_a= -406862
##$ZGOPTNS= <>
##$ZL1= 120
##$ZL2= 120
##$ZL3= 120
##$ZL4= 120
##$ABSF1= 16.522
##$ABSF2= -4.171173
##$ABSG= 5
##$ABSL= 3
##$ALPHA= 0
##$AQORDER= 0
##$ASSFAC= 0
##$ASSFACI= 0
##$ASSFACX= 0
##$ASSWID= 0
##$AUNMP= <proc_1d>
##$AZFE= 0.1
##$AZFW= 0.1
##$BCFW= 0
##$BC_mod= 0
##$BYTORDP= 0
##$COROFFS= 0
##$CY= 12.5
##$DATMOD= 1
##$DC= 0
##$DFILT= <>
##$DTYPP= 0
##$F1P= 14.0000005364418
##$F2P= -0.99999901652339
##$FCOR= 0.5
##$FTSIZE= 32768
##$FT_mod= 6
##$GAMMA= 0
##$GB= 0
##$INTBC= 1
##$INTSCL= 1
##$ISEN= 128
##$LB= 0.3
##$LEV0= 0
##$LPBIN= 0
##$MAXI= 10000
##$MC2= 0
##$MEAN= 0
##$ME_mod= 0
##$MI= 0
##$NCOEF= 0
##$NC_proc= -3
##$NLEV= 6
##$NOISF1= 0
##$NOISF2= 0
##$NSP= 0
##$NTH_PI= 0
##$NZP= 0
##$OFFSET= 16.522
##$PC= 1
##$PHC0= 154.3677
##$PHC1= 4.910641
##$PH_mod= 1
##$PKNL= yes
##$PPARMOD= 0
##$PSCAL= 4
##$PSIGN= 0
##$REVERSE= no
##$SF= 250.13
##$SI= 32768
##$SIGF1= 0
##$SIGF2= 0
##$SINO= 400
##$SIOLD= 32768
##$SREGLST= <1H.DMSO>
##$SSB= 0
##$STSI= 32768
##$STSR= 0
##$SW_p= 5175.98343685301
##$SYMM= 0
##$S_DEV= 0
##$TDeff= 65536
##$TDoff= 0
##$TI= <Analysis number 999999
Compound Code 99
Book Reference 9
Project Code 9>
##$TILT= no
##$TM1= 0
##$TM2= 0
##$TOPLEV= 0
##$USERP1= <user>
##$USERP2= <user>
##$USERP3= <user>
##$USERP4= <user>
##$USERP5= <user>
##$WDW= 1
##$XDIM= 32768
##$YMAX_p= 389021195
##$YMIN_p= -165085
$$ End of Bruker specific parameters
$$ ---------------------------------
##NTUPLES= NMR SPECTRUM
##VAR_NAME=  FREQUENCY,     SPECTRUM/REAL,   SPECTRUM/IMAG
##SYMBOL=    X,             R,               I
##VAR_TYPE=  INDEPENDENT,   DEPENDENT,       DEPENDENT
##VAR_FORM=  AFFN,          ASDF,            ASDF
##VAR_DIM=   32768,         32768,           32768
##UNITS=     HZ,            ARBITRARY UNITS, ARBITRARY UNITS
##FACTOR=    0.157963299565203, 1,           1
##FIRST=     4132.6476996994, 0,             0
##LAST=      -1043.33573715361, 0,           0
##MIN=       -1043.33573715361, -165085,     0
##MAX=       4132.6476996994, 389021195,     0
$$ Real data points
##PAGE= N=1
##DATA TABLE= (X++(R..R)), XYDATA
$$ [...]
16680F393j6149J5668L6346L9766j5065j6840k4265n891l5758r002j6749K8787
16668a2759M3143j7522m2700q845j8457r340j187L6492J1669J3328J9649M1999
16656E5470J0210j6095k5759k2573j3272M3913J2447L782J2647j9215l9403L2746
16644C4898K6945j9323l2663Q225N756J0949m1879q373P732n785k0013m015J8031
16631a9515L7372o884j7428j8581k91o493K8260J9524N636l7850j0336p618M0018
16618E814K4909k2807k7837J5719o293L546j1141j2652m6271j4044M0818M1228
16606i011l5313J0256K2788Q025k6812O266L7814o5j3065l5136K6298o635m0642
16593e5232k4169J5507J0807J6083K4726K873m898k2093j4528K606R97p759m132
$$ plain form
16680 6393 -9756 5912 42258 82024 66959 50119 25854 19963 -15795 -24797 -41546 -12759
16668 -12759 30384 12862 -29838 -38683 -57140 -66480 -67667 -31175 -19506 -6178 13471 55470
16656 55470 65680 49585 23826 1253 -12019 31894 44341 48123 60770 41555 2152 34898
16644 34898 61843 42520 9857 18082 23838 34787 -7092 -15465 -7733 -13518 -33531 -37546 -19515
16631 -19515 17857 10973 -6455 -25036 -25327 -31820 -3560 15964 21600 -16250 -26586 -34204 5814
16618 5814 30723 7916 -19921 -4202 -10495 -6949 -18090 -30742 -77013 -91057 -50239 -9011
16606 -9011 -44324 -34068 -11280 -3255 -30067 -23801 14013 13948 883 -34253 -7955 -14590 -55232
16593 -55232 -79401 -63894 -53087 -37004 -12278 -9405 -14303 -36396 -50924 -48318 -47321 -55080 -59212
16580e9212k8443L3528N0512M1622n200k5680P585O295l2950r278K6087m481j5968
16567a5583j5667j4365J633K1873K9527m5211j0330N208m4632l0950O4613M2206
16555a1678K6657l8739r38M7609j2960J380J7298j3125o3044R237N7643J0847
16543C0187M566K9679q260j5733P691j063n1418l1141J6529l081L5143J7615n2130
16530b1416k5820M713M9840O6574P477p7445j8831j3642j051L0060j7836j6729
16518c4106L2943j9631l7385q503j07n194L211M6631P236p037J4574k0886K4034
16505d220K7130R10j4118l4399l9737L12M6806K6883K0465q982q229k5209m9059
16492f1447Q857O9776Q558K0417j1709m5810l0730J6900K7274Q308J9604M28l4198
$$ plain form
16580 -59212 -87655 -54127 -3615 38007 32807 7127 14712 21007 -11943 -21221 4866 385 -15583
16567 -15583 -31250 -45615 -43982 -22109 7418 -37793 -48123 -42915 -87547 -118497 -53884 -11678
16555 -11678 14979 -23760 -24698 22911 9951 11331 28629 15504 -47540 -38303 19340 30187
16543 30187 34753 64432 56172 40439 48130 47067 -4351 -35492 -18963 -22044 13099 30714 -21416
16530 -21416 -47236 -42523 7317 73891 81368 3923 -14908 -28550 -29601 459 -17377 -34106
16518 -34106 -1163 -20794 -58179 -66682 -66789 -71983 -68772 -22141 -14905 -21942 -7368 -28254 -4220
16505 -4220 22910 23820 9702 -24697 -64434 -64122 -17316 9567 30032 21050 12821 -12388 -61447
16492 -61447 -52590 17186 25744 46161 34452 -11358 -42088 -25188 2086 10394 29998 30426 -3772
16479c772J4318R625l903j3160j0332k2814Q424J816o494n871l2544K7685j1327
16466d8349P457J571j3114L4182L3150L9386P695k7128k3849j0578K5355J5264
16454D1042k8435l6005J0904M0370O611j7620M1714J3237k8533p918K2523j9940
16442C7950P460l928l6737o49R74K3409j3881M576j6610K0841N19J7327K8232
16429F9483N227N203j5818j5749q018O603k7747l3551N234J6721j011j839J6290
16416B1028l046l3519J2942K2333M817k4181K3266l258l3877o515Q578L7961J3873
16403D0402k6002m1101J7485k8905k7919M148K6312k1723k7390l4822K6383K3750
16391f9382Q194j1687L1240K9773l8K0526n644k0984j3566l0863r423k4051N187
$$ plain form
16479 -3772 10546 20171 16268 3108 -7224 -30038 -21614 -19798 -26292 -32163 -64707 -37022 -48349
16466 -48349 -40892 -39321 -52435 -18253 14897 54283 61978 34850 11001 423 25778 41042
16454 41042 12607 -23398 -12494 27876 34487 16867 58581 71818 43285 35367 57890 37950
16442 37950 45410 41482 4745 4096 5070 28479 14598 19174 2564 23405 23924 41251 69483
16429 69483 74710 79913 64095 48346 40328 46931 19184 -14367 -9133 7588 6577 4738 21028
16416 21028 17982 -15537 -2595 19738 24555 374 23640 20382 -13495 -20010 -11432 26529 40402
16403 40402 14400 -26701 -9216 -38121 -66040 -61892 -35580 -57303 -84693 -119515 -93132 -69382
16391 -69382 -61188 -72875 -41635 -11862 -11900 8626 2982 -18002 -31568 -62431 -71854 -95905 -90718
16378i0718K7271j2768J1882M1723k2077k714M2806j907l147J7089K3983k64j9144
16365A2015k3085Q459J5889l0999j4563L6515L6361k4978j5384j6277k4926K2343
16353a8630J1561J7412n123k3062K2750J4372l6578m5495M599q381k0521Q674
16341g8422L3017K4327p0036n232k8078L1260N6259J3961M1232J7657k3083J9
16329A2881n181o093j537n600j1499J7091K4740p848k949n1108j7848M1061L3859
16316A9969J48j4207n9115j0496K1636L2905j0242J1198J582m1247J1416J5329
16304b1124J5075N635J5318k9430j0190L2714n924o068K4190k013j6439l1885
16292c0141k1121J1017K4552Q512J4951j644P612L0030r359m5763J3116M1174
$$ plain form
16378 -90718 -63447 -76215 -64333 -22610 -44687 -47401 -4595 -6502 -9649 7440 31423 31159 12015
16365 12015 -11070 -2611 13278 -17721 -32284 4231 40592 15614 230 -16047 -40973 -18630
16353 -18630 -7069 10343 5220 -17842 4908 19280 -17298 -62793 -58194 -66575 -87096 -78422
16341 -78422 -45405 -21078 -91114 -96346 -124424 -93164 -36905 -22944 18288 35945 12862 12881
16329 12881 7700 1607 70 -5530 -17029 62 24802 16954 14005 -37103 -54951 -13890 19969
16316 19969 20117 5910 -53205 -63701 -42065 -9160 -19402 -8204 -6622 -47869 -36453 -21124
16304 -21124 -6049 -414 14904 -14526 -24716 7998 2074 -3994 20196 18183 1744 -30141
16292 -30141 -51262 -40245 -15693 -7181 7770 6126 13738 43768 34409 -11354 1762 42936
16280D2936j3587L495n981m0619M2231l3873n3381k8266k1374O359O5273j0046
16268d6833j809M0762J6747k2989l3017L8440K8156l3313m619k7770K1889K5213
16256H57K4854m5398m3558r95K7467j8621l5061K3068L6603k840j136K977o547
16243c8330Q175K8525M2671J5227l7267k5022k1043J8578K5952Q489m705m5924
16231b4674n621M9082O3528m1567l2399m0375m1834J0393J7775K0086r294m716
16219c9616l3612K7852J7421k833k9182P282K5328M347k4275j9967J6249J4288
16207c6718N1640K3874k7526l2417o864k5768P399N2336K6963J6247k728p597
16195C8841l3810L816L5096k8707K0037P312q931j8253k2792M3956K592K3511
$$ plain form
16280 42936 29349 32844 26863 -13756 28475 -5398 -58779 -87045 -108419 -102060 -36787 -46833
16268 -46833 -48642 -7880 8867 -14122 -47139 -8699 19457 -13856 -18475 -46245 -24356 857
16256 857 25711 -19687 -63245 -64240 -36773 -55394 -90455 -67387 -30784 -33624 -34760 -31783 -38330
16243 -38330 -30155 -1630 41041 56268 19001 -6021 -27064 -8486 17466 25955 21250 -24674
16231 -24674 -30295 18787 82315 40748 8349 -32026 -73860 -63467 -45692 -25606 -34900 -39616
16219 -39616 -73228 -45376 -27955 -30788 -59970 -52688 -27360 -23013 -47288 -67255 -51006 -36718
16207 -36718 14922 38796 11270 -21147 -28011 -53779 -46380 5956 32919 49166 46438 38841
16195 38841 5031 8847 43943 15236 35273 42585 33654 15401 -7391 36565 39157 62668
16183F2668k0717J3228J6472q3333n5012p430Q954P880O594j3983K2953L5378
16171f348O243k3480k1193J6407O2346J7007R8m5730j1567Q300k9797k3978J217
16158e0475j4522q388K7873L5911j3578J7900l1449j4817M8818j3450J7997N00
16146B320J0471J3654l1847J0128n152k49k5477k5936j3430Q982L3491L6236Q029
16133B1220n913j0674J1507O674k9054r072L7126j9349j7283j9085J8939K2561
16121G597l4034m7963J2404M9720K9493R97N0826J8603n5364k0852j3347L100
16109A180J1152J2529k306m6153P759j58r924j328J6465m619J3144K0300J2671
16096C0712J3177L4356l3715M935j9871k164K604k7709k3736o075j73j24K4529
$$ plain form
16183 62668 41951 55179 71651 -11682 -66694 -74124 -65170 -57290 -50696 -64679 -41726 -6348
16171 -6348 -105 -23585 -44778 -28371 33975 50982 51080 5350 -6217 2083 -27714 -51692 -50475
16158 -50475 -64997 -73385 -45512 -9601 -23179 -5279 -36728 -51545 -2727 -16177 1820 2320
16146 2320 12791 26445 -5402 4726 -426 -675 -26152 -52088 -65518 -56536 -23045 13191 21220
16133 21220 15307 4633 16140 22814 -6240 -15312 21814 2465 -14818 -33903 -14964 7597
16121 7597 -26437 -74400 -61996 -12276 17217 18214 69040 87643 32279 11427 -1920 1180
16109 1180 12332 24861 22555 -23598 -15839 -15997 -25921 -27249 -10784 -15403 -2259 18041 30712
16096 30712 43889 78245 44530 49465 29594 27430 30034 2325 -21411 -27486 -27659 -27783 -3254
16083c254P980N772o945l2850l8388m904L9221n194L473L12K0734K8053o884k1507
16069a4381M3308Q637J9274N667l5143m5133o160L2716L1405k9974m9170k8840
16057f7794P660M1351O5741L5162J7851j4639o6139n2381M536j8283J5325j2560
16045d4170m686l7883j4048k6696M2429L9384K4800L476j2739J5562k379l7502
16033e4452k709K1407P275L2734L3341K0567J3823j1142M266K4507r553j6421
16021F3643O53l3217J0409m0410j356J1542J0159J8806j5372J4116N4k4399L831
16008A8459Q030l1798o5464J8678L28K639m490J1023L2135J1972J9594p660o2094
15995d8648N571j1405j4852J7443P431k6440J0509N7885J3910R707K5627j1592
$$ plain form
16083 -3254 4726 10498 3553 -29297 -67685 -72589 -33368 -38562 -35089 -34777 -14043 14010 7126 -14381
16069 -14381 28927 37564 56838 62505 27362 -17771 -23931 8785 40190 10216 -38954 -67794
16057 -67794 -60134 -18783 46958 82120 99971 85332 19193 -33188 -28652 -46935 -31610 -44170
16045 -44170 -48856 -86739 -100787 -127483 -85054 -45670 -20870 -17394 -30133 -14571 -16950 -54452
16033 -54452 -57161 -35754 -28479 4255 37596 58163 71986 60844 65110 89617 80064 63643
16021 63643 64296 31079 41488 1078 -278 11264 21423 40229 24857 38973 39027 14628 18459
16008 18459 26489 -5309 -70773 -52095 -51767 -49128 -53618 -42595 -10460 1512 21106 13446 -48648
15995 -48648 -43077 -54482 -69334 -51891 -44460 -70900 -60391 -2506 11404 21111 46738 35146
15983C5146o4718l6138l378O7189N616l7664J0901J3879k6033j842L1060J489
15971d493J5670K0033P552k9520M504J6894q399K4618m707p553j0445q9534j5122
15958h0502J6263J4186J8256M3808N7494k2445j0322J1143m4310k6195l681L5026
15946H721N8107K6595n12k3601k5404l5064l3687J0935m4896n6665J336L8442
15934g5693K3248k3291J7560l786M781O2071L1547J3860M1472L2222l1198n3805
15922C8988j3700N428l4594j8760J7656m3377K454J797J1465J4777R843O816L0149
15909B8942K7077k1566J2141m4948m1773K9577J5577K4202K2337m0076m6201l3904
15897f8615l598K3699K3001L2732J7372N175M292L366O938k9905j0695P225j3975
$$ plain form
15983 35146 -29572 -65710 -69088 -1899 3717 -33947 -23046 -9167 -35200 -37042 -5982 -4493
15971 -4493 11177 31210 38762 9242 13746 30640 22241 46859 42152 34599 24154 -65380 -80502
15958 -80502 -64239 -50053 -31797 12011 69505 47060 36738 47881 3571 -22624 -26305 8721
15946 8721 66828 93423 92911 69310 43906 8842 -24845 -13910 -58806 -115471 -114135 -75693
15934 -75693 -52445 -75736 -58176 -61962 -57181 4890 36437 50297 91769 123991 92793 38988
15922 38988 25288 30716 -3878 -22638 -4982 -48359 -45905 -44108 -32643 -17866 -8023 -1207 28942
15909 28942 56019 34453 46594 1646 -40127 -10550 5027 29229 51566 11490 -34711 -68615
15897 -68615 -72213 -48514 -25513 7219 24591 29766 34058 37424 44362 14457 3762 10987 -2988
15884b988K9742J3409j6456j9798j7932J2972j2190Q441K6230k2594M7310J075
15872D7221J593l3120l5503k9887L2312K7373j8356J9576q61O006M724j4924J2079
15859A8233m2549Q045N0420K3970j7764l241J6676M7593m6421l3009K702k418
15847B2237Q909J6059m271j7924m83k1332j0113K7568R722j0547J2748J6989j9873
15834B9689m0712l8356K1767l177J4452J2507k444M597J2428K8299O321k7657
15822A7714r968k0215N834K0052j7935J7657L7123k0523l0047k6078R411J4378
15810b597j207L5124j7052k9022j7671J3250N7777j7822p1592j268Q634n236L8829
15797i853K3381J48j3416k1608J6123l2432L61J5536M948M2671q716j1334k4881
$$ plain form
15884 -2988 26754 40163 23707 3909 -14023 -1051 -13241 -4800 21430 -1164 46146 47221
15872 47221 48814 15694 -19809 -49696 -17384 9989 -8367 11209 10348 16354 21078 6154 18233
15859 18233 -24316 -16271 34149 58119 40355 37114 53790 101383 54962 21953 24655 22237
15847 22237 31146 47205 42934 25010 24527 3195 -6918 20650 30372 19825 32573 49562 29689
15834 29689 -11023 -49379 -27612 -30789 -16337 -3830 -6274 -1677 10751 39050 45371 17714
15822 17714 7746 -12469 -6635 13417 -4518 13139 50262 29739 -308 -26386 -16975 -2597
15810 -2597 -3804 31320 14268 -14754 -32425 -19175 38602 20780 -50812 -52080 -43446 -48682 -9853
15797 -9853 13528 13676 260 -21348 -5225 -37657 -37296 -21760 -16812 25859 17143 5809 -19072
15784a9072n959K4480K1540j3139L6251J2386k0940j7630j4792l1600O506J3518
15772h451k0378J2529J4165q49J1680o37o441j3106K2569l486l0241K2901K3658
15759B3913r87l335J2088l4389m3614J1920J0912J6905K8404o0N859k017L0025
15746E5624J2337o3773k7867k2611K4074p179k948J0564L5084O3000O788j024
15734H2069O737R959K1202r620q2878k6492j3986n186J3378j0305l5836L6779
15722a4179J2076J1652L6389k5757o5990O5K9359O484R868J9724K3837K5J3408
15709E6961M4715l9425l6910J7003l5247J0996l2391k9471L0730L1340Q722j6286
15697A0737l2776k134K2747j9859K8374O7814l683o419N211k4288l2036J3831
$$ plain form
15784 -19072 -25031 -551 20989 7850 44101 56487 35547 17917 3125 -28475 -21969 -8451
15772 -8451 -28829 -16300 -2135 -2984 8696 8059 1618 -11488 11081 7595 -22646 255 23913
15759 23913 22926 19591 31679 -2710 -46324 -34404 -23492 -6587 21817 21757 27616 25599 55624
15746 55624 67961 4188 -23679 -46290 -22216 -29395 -32343 -21779 13305 76305 83093 82069
15734 82069 88806 98765 119967 110347 27469 977 -13009 -18195 -4817 -15122 -50958 -14179
15722 -14179 -2103 9549 45938 20181 -45809 -45744 -16385 -9901 -33 19691 43528 43553 56961
15709 56961 101676 62251 25341 42344 7097 18093 -14298 -43769 -13039 18301 27023 10737
15697 10737 -22039 -24173 -1426 -21285 7089 74903 71220 64801 70012 45724 13688 27519
15685B7519N70J896l70J5500K2693j1634k2344k5077N071K4396K3505k3963q020
15672B9742p791J5853K1307j5370M483K2241J7005j2825k6554m1470N078K016
15660A3715K1930l1661l5916N4694M5506l4217n7661J1047O5162L9290J8437n1194
15648E9132k8475j7661L5708R679o7841l5550M523M8249L1564o18k9973m4237
15636c5500k3930J7585K9947k434j9937M769L1524L297n949j2464j9722R890K2710
15623b14M724p859K9384l8857m7158n084M4289M2255k5099k6752k8831P748M5828
15610e626N5396P241k8330m0715k3286J0101J1266J4161M4640J5981l0728K6133
15598E6234K437j2643J1778Rn449M0177L51p2907l3346o054L5760L2879k2085
$$ plain form
15685 27519 28089 29985 29615 45115 67808 56174 33830 8753 13824 38220 61725 37762 29742
15672 29742 21951 37804 59111 43741 48224 70465 87470 74645 48091 6621 11699 13715
15660 13715 35645 3984 -31932 22762 68268 34051 -23610 -12563 52599 91889 110326 59132
15648 59132 30657 12996 48704 58383 -9458 -45008 -40485 7764 39328 38710 8737 -35500
15636 -35500 -59430 -41845 -11898 -14332 -34269 -29500 2024 5321 -628 -13092 -32814 -22924 -214
15623 -214 4510 -3349 26035 -12822 -59980 -65064 -20775 21480 -3619 -30371 -59202 -51454 -5626
15610 -5626 49770 57011 28681 -12034 -35320 -25219 -13953 208 44848 60829 30101 56234
15598 56234 58671 46028 57806 57815 52366 92543 92894 19987 -13359 -19413 16347 49226 27141
15585B7141m655N950j5848j0592K8532K6007k2867O526O90q788k2537j7655k5665
15572c3761J247K4367K4258k5138J8272M2772j0995l3829K0915K2362j2871m7437
15560i838j8284L9640J444k8816j0089j205K2980J6864k905J7410l4463M384L3789
15547C0911J0423p536j2152L6469K708l5922J1128P6181J1151k7618k0199l9295
15535C6249k3044L583j3457j1869K9695j6446k2014l232J7211m8192l6647M6237
15523d1926L6347r558j0610l3427O773J9198M2237j9009r628K265M197K0546N236
15510A2641m2926k1405J2917L7135k9241o113J5869K098Q147K4321K307M994L9708
15497F0452j3759l6135J3677L5152J5328N280j079j1392m929l0733j000M180k8067
$$ plain form
15585 27141 22486 28436 12588 1996 30528 56535 33668 40194 40884 32096 9559 -8096 -33761
15572 -33761 -32514 -8147 16111 -9027 9245 52017 41022 7193 28108 50470 37599 -9838
15560 -9838 -28122 11518 12962 -15854 -25943 -27148 -4168 12696 9791 27201 -7262 -2878 30911
15547 30911 41334 33798 21646 58115 60823 24901 36029 112210 123361 95743 75544 36249
15535 36249 13205 16788 3331 -8538 21157 4711 -17303 -20535 -3324 -51516 -88163 -41926
15523 -41926 -5579 -15137 -25747 -59174 -52401 -33203 9034 -9975 -19603 -17338 -13141 7405 12641
15510 12641 -30285 -51690 -38773 -1638 -30879 -36992 -21123 -19025 -10878 13443 15750 20744 60452
15497 60452 46693 10558 24235 59387 74715 79995 78916 67524 62595 31862 30862 35042 6975
15484F975n2376q369j347L5094J9206M109p812k1740j8646j6217K7863j3800K986
15471d4074J5083J5648M7855j714J4980J1504n639n1329Q559K1398N019K744P972
15458D8006K8251O579k0586j4875L3186k3586j4857l6688k2272j3064k1109J8124
15446c2891K2118J3771M833M3129M8649k2605k2586l583J474K1435L0922j4854
15434H9812j0050R318k9738m843O87K7031L8411R815o7160l2405K5339K1385m1722
15421C5880q5661p534M1436j351K1035N102J3158o705Q350J0239J4893r134l8844
15408H64m641L9373K4563k8883j1814J4751J7197k7522o2377r237L6272N3944
15396D2490P2879J3791J9843k1789l9709k9369Jj508k0650l2010L634K2999m215
$$ plain form
15484 6975 -45401 -53770 -55117 -20023 -817 3292 -4520 -26260 -44906 -61123 -33260 -47060 -44074
15471 -44074 -28991 -13343 34512 32798 47778 59282 53643 2314 10873 32271 37290 40034 48006
15458 48006 76257 82836 62250 47375 80561 56975 42118 5430 -16842 -29906 -51015 -32891
15446 -32891 -10773 2998 7831 50960 99609 77004 54418 50835 52309 73744 104666 89812
15434 89812 79762 89080 59342 54499 55186 82217 120628 130443 63283 30878 56217 77602 35880
15421 35880 -49781 -57315 -15879 -17230 3805 8907 22065 15360 23710 33949 48842 39708 864
15408 864 -3777 35596 60159 31276 19462 34213 51410 23888 -38489 -47726 -11454 42490
15396 42490 115369 129160 149003 127214 87505 58136 58137 56629 35979 3969 7603 30602 26387
15383B6387j4219J8399k3418m5736l4458M9655M1095J3337L54q040o627J7753
15371C4482K2306Q545k6772j1956m5240L484K4008j8426k0624R371q328m2524
15359g1674q680M2381L9055o754j1295l0094j2181J1031N1339P3904n7566k1883
15347b417J4035P852k5520k1879K6511O5717O965L037p530j7221j1667J8008k5906
15334B9985j2293n028l869K2314L4381o83q596J073l2138P632N565k141m806n158
15320B6238m4930k5776J9056L60L2895K1363J1561M968m1923j7611L6394j1865
15308A0730k3365J6570m948L897K6372J6251J1108k2993k8922j4440l4410p451
15296e1601J3411L6480M3271L126n1465J0433K676K6696j1669l2546K8263K0014
$$ plain form
15383 26387 12168 30567 7149 -38587 -73045 -23390 17705 31042 31396 23356 16729 34482
15371 34482 56788 65333 38561 26605 -18635 -15151 8857 -9569 -30193 -20822 -29150 -71674
15359 -71674 -80354 -37973 1082 -5672 -16967 -47061 -59242 -48211 3128 77032 19466 -2417
15347 -2417 11618 19470 -6050 -27929 -1418 64299 71264 74301 66771 49550 37883 55891 29985
15334 29985 17692 12664 8795 31109 65490 64807 56211 57284 25146 32778 38343 36202 31396 26238
15320 26238 -18692 -44468 -25412 -25052 7843 29206 40767 45735 3812 -13799 22595 10730
15308 10730 -12635 3935 -1013 2884 29256 45507 56615 33622 4700 -9740 -44150 -51601
15296 -51601 -38190 -1710 41561 44687 -6778 3655 6331 33027 21358 -11188 17075 37089
15284C7089j5889k1634j2743J2945L6876j6662K7182J0795q018k7574q819j3057
15272D91K213J6716J8293L8043M922K022j5381k9709n4127K093K1592j335j2551
15259f718j269l164M9211o573K7069q436m408k8467j6797q468q467K4180K6145
15246C3838j8147l4567m549r586J0235R784J4643q197l9244k885M99L6273M1089
15233B9186M1162K6770K8741l9048m6992q457n157l0033j0830M8738L4370k6514
15221D1936j8638K3486M3304j5063J3060J7982j0492P423J0904n680l5841o658
15209F5723J4828r13K1036J0411J1357k0321J0743m3211n2819K1005L359k5078
15197A6120K2785J7762q644K3300J981O416j2654k9335j3533j5875J967J9625
$$ plain form
15284 37089 21200 -434 -13177 -232 36644 19982 47164 57959 49941 22367 13548 491
15272 491 2704 19420 37713 75756 80678 82700 67319 37610 -16517 -14424 7168 5833 -6718
15259 -6718 -7987 -11151 38060 31487 58556 50120 45712 17245 448 -8020 -16487 7693 33838
15246 33838 15691 -18876 -23425 -33011 -22776 -12992 1651 -6546 -45790 -48675 -48176 -11903 29186
15233 29186 70348 97118 125859 86811 39819 31362 26205 -3828 -14658 34080 68450 41936
15221 41936 23298 46784 90088 75025 88085 106067 95575 102998 113902 108222 72381 65723
15209 65723 80551 79638 100674 111085 122442 102121 112864 69653 16834 37839 41198 16120
15197 16120 38905 56667 48023 71323 73304 79720 67066 37731 24198 8323 10290 29915
15185B9915k4415K095j5270j4485k5142j383o165M4686K4261m304j0387k3423
15173b4017K2770L1993K4660l737j1339k6680m190J2914Q975l5529k0740K3351
15161a569L7269o28q701M094k5222K743L4102J0292k2818k8244j5036K6166q942
15148C506k1380P140K0287L5700o92J2084J7917l2968k0953l3157J1491r76O867
15135D866J5015n034L7608j0399l3683J2324l749k1107R59J9782O731l9524j3554
15122b9765J9085L2893J0640l2030J8732J9967j9722M5316N0777k9303l7425k9500
15110A9665k9630q31L6435J4454J0238k7615k9192j013L314m862L827J6382N3030
15097F4202L3868j5077K7392j5588n2887k4320k1553N077J5135J1475j2770k5779
$$ plain form
15185 29915 5500 7595 -7675 -22160 -47302 -48685 -54850 -10164 14097 9793 -594 -24017
15173 -24017 -1247 30746 55406 51669 40330 13650 9460 22374 31349 -4180 -24920 -1569
15161 -1569 35700 35072 26371 30465 5243 7986 42088 52380 29562 1318 -13718 12448 3506
15148 3506 -17874 -10734 9553 45253 44561 56645 74562 41594 20641 -12516 -1025 -2001 4866
15135 4866 19881 14847 52455 42056 8373 20697 16948 -4159 -3200 16582 23313 -16211 -29765
15122 -29765 -10680 22213 32853 823 19555 39522 19800 65116 115893 86590 49165 19665
15110 19665 -9965 -10796 25639 40093 50331 22716 -6476 -7489 -4175 -9037 -5210 11172 64202
15097 64202 98070 82993 110385 94797 41910 17590 -3963 1114 16249 27724 14954 -10825
15085a0825k1878M928J1862p401L2386N0982L789l3867j8972L698L0283j6444
15073B8541n6892L9417P693k2528R1P807K9245q67n0039m8025M4656K2589J913
15060C601q809K8749L0364m47k0181m1746k3823k232N372K9183J1810j6780n341
15047a0280K5160M9172l067l618O117l1992p368K3083Q398J4415k8780k140r797
15034B9303m4334O076Q775j1993n124j8089J5927l952R955Q755K8427j3249m930
15021E547L0480J7793j3126m9390q362m170J3353L9252K4011P932j3793J321L2453
15008H3301J7325n1835j7467J9920j0641N890K2155j0108j3656N64j2828k299
14996C0321J6299L0546M461m1450R748Q445j9560K7037K8853j5238j6012j900
$$ plain form
15085 -10825 -32703 -27775 -15913 -23314 9072 60054 63843 29976 11004 14702 44985 28541
15073 28541 -28351 11066 18759 -3769 -3678 4129 33374 32507 -17532 -65557 -20901 1688 3601
15060 3601 -5208 23541 53905 53458 33277 -8469 -32292 -34524 -29152 31 11841 -4939 -10280
15047 -10280 14880 64052 60985 57367 63484 31492 24124 47207 55605 70020 41240 39100 29303
15034 29303 -15031 -8955 -180 -12173 -17297 -35386 -19459 -23411 -13456 -4701 23726 10477 5547
15021 5547 36027 53820 40694 -8696 -17058 -21228 -7875 31377 55388 63320 49527 50848 83301
15008 83301 100626 48791 31324 51244 40603 46493 68648 58540 44884 45448 32620 30321
14996 30321 46620 77166 81627 40177 49925 58370 38810 65847 94700 79462 63450 61550
14984F1550J5428m0597k2977J7214k5280j1209j7046O3591M7540L9422m5838n8838
14972B2960j4048Q926L788L2298J5189k4568k9194P712K5479m5536k8135K2403
14960b726L4574K2414J2670j674N301L1845j3667j2197R175k8493K3522k4925
14948E5819j4326L1190j1818n8377k7912K5977M6270M0910J7212k1494o6420n734
14936A1297L2535j0168k0271j5905J0540K5607jm3768j6733L4524K6340K0992
14924E4989M579r394m709O349j1402Nn0161M630L7605j0565o698L2734j630r532
14910C6800K2115p314m978k0457n8747J1274L9419L0302L2977J6095o709J8452
14898A09229J6349k9276n2195l557K3859K4241J1719j0656j5253m7442k7442j8679
$$ plain form
14984 61550 76978 36381 13404 30618 5338 -5871 -22917 40674 88214 127636 81798 22960
14972 22960 8912 17838 21626 53924 69113 44545 15351 23063 48542 3006 -25129 -2726
14960 -2726 31848 54262 66932 65258 70559 102404 88737 76540 85715 57222 80744 55819
14948 55819 41493 72683 60865 2488 -25424 553 46823 87733 104945 83451 17031 11297
14936 11297 43832 33664 13393 -2512 8028 33635 33634 -10134 -26867 7657 33997 54989
14924 54989 59568 50174 45465 51814 40412 40417 -9744 -5114 32491 21926 15228 47962 46332 36800
14910 36800 58915 51601 46623 26166 -32581 -21307 18112 48414 81391 97486 90777 109229
14898 109229 125578 96302 44107 40550 64409 88650 100369 89713 74460 27018 -424 -19103
14886a9103M4535L8704K0220j2609o362K4154l0179l2113L9345p028j9622m6143
14874f201k539j6240Q550r529L6940K4549J5278J8571k8498P717R832J6706Q242
14861H3378j1409J2325l146m104J4410l6007n6001k628J0845M410o403J2714k2006
14848c622J2436M0578L5510j3946k4128j3456p660j2572j4411k411J6347L6666
14836D9331K9204k2979J1172m301o898p4244K356L742k3259j2811K4253J7662
14824f772K9845O8446j9670m5299K5871N4249j1791m8855m0802K1601Q154K302
14812C7279N792L966J9833j2356k8200p6531J870M9364j2891O0093J9684m662
14800F3241n505J2081k9827k3683J9509O7965j2382j3403j4636j5632L568J943
$$ plain form
14886 -19103 25432 64136 84356 71747 65385 89539 59360 27247 66592 59564 39942 -6201
14874 -6201 -8740 -24980 -16430 -25959 10981 35530 50808 69379 40881 48598 58430 75136 83378
14861 83378 71969 84294 81148 77044 91454 55447 -554 -3182 7663 12073 5670 18384 -3622
14848 -3622 8814 49392 84902 70956 46828 33372 25712 13140 -1271 -3682 12665 49331
14836 49331 78535 55556 66728 62427 55529 -18715 -16359 -12617 -35876 -48687 -24434 -6772
14824 -6772 23073 91519 71849 26550 52421 106670 94879 46024 5222 26823 34977 37279
14812 37279 43071 47037 66870 54514 26314 -50217 -48347 1017 -11874 48219 67903 63241
14800 63241 57736 69817 39990 16307 35816 103781 91399 77996 63360 47728 51296 53239
14788E3239j8331j591K2318j055J8672K8534o491m5068J6753j74Q495j3677L0771
14775I2395k6657q187L605J740K3989K4514P01l9365n468P958j1861j0664k0531
14762C2169j6527J9772J7944j0804M3820m2289m9617J6619J3728L18J8066L357
14750D6556M860k8670o893n663M6230K8989N547m767l0850j3219K518k7551J7730
14737C4817j5393J7123K9438k419l7468j7782o614M7937o56m4347k7536l175L2760
14724F685P026m7556K9094O1806J408q2715J1675L6724M402P236K1470O812k6178
14711C7889p966J0359K6044K9661n4m6633m3336R929L9354M2450O876K2454j4265
14698A12762M53o0782j6752K2929K9648L0411m6753m5222o267K7167n373K914
$$ plain form
14788 53239 34908 33317 55635 54580 73252 101786 95295 50227 66980 66806 75301 61624 92395
14775 92395 65738 57551 61156 62896 86885 111399 112100 72735 67267 75225 63364 52700 32169
14762 32169 15642 35414 53358 42554 86374 44085 -5532 11087 24815 25133 43199 46556
14750 46556 51416 22746 15853 10190 56420 85409 90956 86189 55339 42120 44638 17087 34817
14737 34817 19424 36547 65985 63566 26098 8316 1702 49639 48983 4636 -22900 -26075 6685
14724 6685 13711 -33845 -4751 57055 58463 -24252 -12577 24147 28549 35785 57255 64067 37889
14711 37889 29923 40282 66326 95987 95933 49300 5964 15893 55247 97697 104573 127027 112762
14698 112762 113215 52433 35681 58610 88258 118669 71916 26694 20427 47594 42221 45135
14686D5135n161Q608o897K6229j167l5376O999L9316J4691K8894O397l4001l0797
14673F2870k8834K977M1505K4366L2192K8845k7861l5424j4801M213j7732j4091
14661E8225K1775j8232j3946m4377k5463O3049r327L3054K6215L2803j4116m2221
14649F7439k0517j1013o872K2278J8747J1105j5999k2857l4855M1196L6991j4761
14637G0882R585l5680K5232L3934J8993l82l5233l1016j9427k4515k6731N170
14625i188P309L0126K9440l6715k0221L5938N9069q023R407p004L5786l175n2622
14612G0127J5286J098o474m53n805L20M239p945k9118k5538K7722L6344L2750
14599A12553m834J3198j5494m4682n070K8141M8499J1404J433k3512n2827k9994
$$ plain form
14686 45135 39974 48582 41685 67914 66747 31371 38370 77686 92377 121271 127668 93667 62870
14673 62870 34036 37013 78518 102884 135076 163921 136060 100636 85835 90048 72316 58225
14661 58225 80000 61768 47822 3445 -22018 41031 31704 64758 90973 123776 109660 67439
14649 67439 46922 35909 29037 51315 70062 81167 65168 42311 7456 48652 85643 70882
14637 70882 80467 44787 70019 103953 122946 122564 87331 56315 36888 12373 -14358 -9188
14625 -9188 -1879 28247 57687 20972 751 36689 95758 87735 97142 90138 125924 122749 70127
14612 70127 85413 86511 80037 79584 73779 74099 78338 70393 41275 15737 43459 79803 112553
14599 112553 107719 120917 105423 60741 55671 83812 132311 143715 145148 121636 68809 38815
14587C8815j4227O675q600p704K7068L3137j8950o115n3546k9502O806K1237L8881
14574C3975J8720l3473m8365J918J929L6525L8472l0991j4801K441J9488l038
14562B2800j4169k0826N4322K5166k4236j4378K9352k9477p070J6112j1467J3923
14550D0052m0026j8706j1987R827P0184J1367l8759R675K7795K2494m108k1066
14538E6742M0019K7766j1930n713J7474K762Q174J6044r858o7603p649q639p334
14525E0255p931k2252o580m6389J7669R648M239J1797L3592J1582J4724k7627
14513D2727p375r668K3760N7039J4706J6591L2337k1161k1576k5583O949j9858
14501H8888n8384l2866K3029K4895k984J9739j3947j3688r204J4702k3575j1652
$$ plain form
14587 38815 24588 31263 22663 14959 42027 75164 56214 50099 -3447 -32949 -26143 -4906 33975
14574 33975 52695 19222 -29143 -27225 -25296 11229 49701 18710 3909 6350 25838 22800
14562 22800 8631 -12195 42127 67293 43057 28679 58031 28554 21484 37596 26129 40052
14550 40052 26 -18680 -30667 -20840 49344 60711 21952 31627 59422 81916 77808 56742
14538 56742 96761 124527 112597 106884 124358 127120 135294 151338 141480 73877 66228 57589 50255
14525 50255 42324 20072 13492 -32897 -15228 -5580 -1341 10456 44048 55630 70354 42727
14513 42727 35352 25684 49444 106483 121189 137780 170117 148956 127380 101797 108746 88888
14501 88888 30504 -2362 20667 45562 42578 62317 48370 34682 25478 40180 16605 4953
14489D953J3396K3617j2568j0995J6473N460k0022l0295J4737l302q854M818J5583
14476A3001K8176j3202J2661L128k3440l1542L7635L0145M2851n1162l7775N8818
14464F9294L3276L1604j817j5678m9848r430J27l5562j1038M5589K0118o035j2369
14451E8231j3893J949K901J6700j049k4217k4608K8672K507P666J6769r456l14
14438F1858M5339p149L378K7444L722k7030o6989k2601P428L4344l605k2755o434
14425B6950L8749L4774J5136L6991l2672l4263l952l2681l6168k1221J0664M7157
14413D9464J6781J8596J5478q8044k8888M8146J1405Q29M573o346l4777M934J144
14400A3295K3717M4591j2282k4360j6761Q615J7480J2626l9775O137M9097M1170
$$ plain form
14489 4953 18349 41966 29398 18403 34876 40336 20314 -9981 4756 1454 -7400 -2582 13001
14476 13001 41177 27975 40636 43764 20324 -11218 26417 56562 99413 48251 10476 69294
14464 69294 102570 134174 132357 116679 66831 57401 57528 21966 10928 56517 76635 70600 58231
14451 58231 44338 46287 49188 65888 64839 40622 16014 44686 47193 54859 71628 62172 61858
14438 61858 107197 100048 103426 130870 134592 107562 40573 17972 25400 59744 56139 33384 26950
14425 26950 65699 100473 115609 152600 119928 85665 81713 49032 12864 -8357 2307 49464
14413 49464 66245 84841 100319 12275 -16613 31533 42938 43767 48340 41994 7217 12151 13295
14400 13295 37012 81603 69321 44961 28200 36815 54295 66921 27146 33283 82380 123550
14388A23550O4509J827m9822k252j9479k7460k422K51l69M95O0528L9517O06k3210
14374A66269k1675j7718m4197R383k3496k6726K216r584J0594M0229P005p077
14362H5223M5493j89l1240J7445l543K014J2028K848o941k9086k2074K9621J973
14349A03572l6095K1365l737k3519l2287k4159K0140O7010M8683L564M996k2682
14337A26851K148k7270o438j2088k0907K2442l251L595K0122J9316J1027j4405
14325A21142J5935K0867k585l2712j7387N587j1082K787K3995k7407m1055j5643
14313D2442M165J5512M0797M2721j7484m811M6912J1436m9111n1262j4386L823
14301G0754j2150M0205M3387k6613l0074k449O512m3092k883M527L8695K8803
$$ plain form
14388 123550 188059 189886 140064 137812 118333 90873 88451 88702 88333 88828 149356 188873 189479 166269
14374 166269 144594 126876 82679 92062 68566 41840 44056 34472 45066 85295 92300 85223
14362 85223 130716 130527 99287 116732 113189 115203 127231 130079 123138 94052 71978 101599 103572
14349 103572 67477 88842 85105 61586 29299 5140 25280 92290 140973 144537 149533 126851
14337 126851 128999 101729 95291 83203 62296 84738 81487 85082 105204 124520 135547 121142
14325 121142 137077 157944 155359 122647 105260 110847 99765 102552 126547 99140 58085 42442
14313 42442 46607 62119 102916 145637 128153 123342 170254 181690 132579 81317 66931 70754
14301 70754 58604 98809 142196 115583 85509 83060 89572 46480 43597 48124 86819 115622
14289A15622r098j3588n2299l185j5448K6989j0283L714L8795K4852l4483r322
14277F2266K3907J9290l8563k0058l797J0864J5519K1590j943l7680r947K4275
14265F5723L2076n945k6365q141J6410J9664r10j4388K7329J5542k0357P765n660
14252A02743J572k4330K4506j8477k0039r0R961K2054K1588J6169k1264K3575
14240A37968J9186j2581j3740j0606J5640K2498K7214j1813l5434J5852L2455
14229A86639L372k1217m7143j5799p625j871p317K5884l1914m7129l6072q810
14217i002o2693N4611Q0451K5868k0766K842J7918K624l0840P92O456K9956M074
14204A02291J411k3977j8913Q2313L6306o132n3166j693j6254k5351K497L6541
$$ plain form
14289 115622 106524 92936 40637 37452 22004 48993 38710 42424 81219 106071 71588 62266
14277 62266 86173 105463 66900 46842 43045 53909 69428 91018 89075 51395 41448 65723
14265 65723 97799 91854 65489 57348 73758 93422 92512 78124 105453 120995 100638 108403 102743
14252 102743 104315 79985 104491 86014 65975 65885 75846 97900 119488 135657 114393 137968
14240 137968 157154 144573 130833 120227 135867 158365 185579 173766 138332 154184 186639
14229 186639 190011 168794 121651 105852 98227 96356 89039 114923 83009 35880 -192 -9002
14217 -9002 -71695 -17084 63367 89235 68469 71311 89229 91853 61013 61805 68261 98217 102291
14204 102291 103702 79725 60812 143125 179431 173299 120133 118440 102186 76835 79332 115873
14192A15873J5786R437n5570L396k2819J4586M9702K0506m1169K746L0136j7909
14180A24701n240m9426P501O8929J5270l7526q6800k4238N1294J6121k500M336
14168H2422j1233l732M2363K9852K33k2869m4416Q773L8953M7351Q14j1051l3344
14155A24116j813n679k101k8368j7734R013J7595L537J2642P651m7081k5519J6837
14142F3096O247j3689J0275N051j6969J6050L7351N883j5422k7134j4754k3825
14130C2160j576N7755k571K9947L760L8620M692m9320R995k8891k3322K7745K5890
14117A24884k5506j5371k5384j3436j2773j1388L4939N6680L5093m0525J2114
14106A19327k6705n909j7176K557L3447P841m0518j4762P245k609l3044R506J8271
$$ plain form
14192 115873 131659 141096 85526 88922 66103 80689 130391 150897 109728 112474 142610 124701
14180 124701 119461 70035 77536 146465 161735 124209 37409 13171 64465 80586 78086 82422
14168 82422 71189 67457 109820 139672 139905 117036 72620 81393 120346 167697 168511 157460 124116
14155 124116 122303 116624 114523 86155 68421 77434 95029 98566 111208 118859 71778 46259 63096
14142 63096 69343 55654 65929 70980 54011 70061 107412 113295 97873 70739 55985 32160
14130 32160 30584 88339 85768 115715 119475 158095 162787 113467 123462 94571 71249 98994 124884
14117 124884 99378 84007 58623 45187 32414 21026 55965 112645 147738 107213 119327
14106 119327 92622 86713 69537 72094 105541 113382 72864 58102 65347 62738 29694 39200 57471
14093E7471k7729M50J2513J0860j1722p369K663k9968K0195L0842J2251j1954
14081E8503j5949K0715O087K678Q36N39j1820j994j6370q4355o261O1710N8519
14068G2838L6030p469k1306j1674N8289l6591k4632J2379M3720J148o2021m874
14056E5837K4815m719n941j0397K084K0736J702k2027K175P954n044J9863K7810
14043A14848k0527m6128j8693M974r761J4697O086l6397O665K3035J2485J0871
14031F2155j2620M1671J6161j3364l0039r080j006L5452N6784j6398n4585J7079
14019I2210K5754L2261J8127j8405L775m993l4764m3958O457j1105j0229J030
14007E6160J1571L4952R713k8183q376N29j4134p675J66J6171M0675K9155J6696
$$ plain form
14093 57471 29742 30192 42705 53565 41843 34474 37137 7169 27364 58206 70457 58503
14081 58503 42554 63269 69356 72034 72870 73409 61589 59595 43225 -41130 -47391 14319 72838
14068 72838 108868 101399 80093 68419 126708 90117 65485 77864 121584 122732 60711 55837
14056 55837 80652 75933 69992 59595 61679 82415 84117 62090 64265 72219 67175 87038 114848
14043 114848 94321 48193 29500 34474 24713 39410 45496 9099 15764 38799 51284 62155
14031 62155 49535 91206 107367 94003 63964 54884 53878 89330 146114 129716 75131 92210
14019 92210 117964 150225 168352 149947 153722 148729 113965 70007 76464 65359 55130 56160
14007 56160 67731 102683 112396 84213 75837 76366 62232 54557 54723 70894 111569 140724 157420
13994A57420J6623j4274o978N987k7408J8267k1074J8373O6613r765n8700j2595
13982A32489M618j8579k7068j7354Q881J9669K3804J0433J2349p160l7538l0654
13970G3890O065J3320j681J8901J7307K291Q598j8912k0529J2798n5129k6728
13958C0191Q599j6213R756L1455K3386k0620J8574K763L3942P75Q376l107K7586
13945A55463J0393l1986m3395J9648L6937K2652l1683k1488j6362j4908K4993
13934A10264j5561j4084o347Q601J8760m737j0003k4323j6933L7797K991J4437
13922A00862L0363J9112O814j7608P985j4908J8179J2703k6050j4121O993m200
13910A26124K9440J7983K131k042P990l3672J2182q229n644l2122l8015J2712
$$ plain form
13994 157420 174043 159769 152791 158778 131370 149637 128563 146936 213549 203784 145084 132489
13982 132489 137107 118528 91460 74106 82987 102656 126460 136893 149242 142082 104544 73890
13970 73890 79955 93275 91594 110495 127802 130093 138691 119779 99250 112048 56919 30191
13958 30191 38790 22577 32333 63788 87174 66554 85128 87891 121833 122608 130984 127877 155463
13945 155463 165856 133870 90475 110123 147060 169712 138029 116541 100179 85271 110264
13934 110264 94703 80619 74272 82873 101633 96896 86893 62570 45637 83434 86425 100862
13922 100862 131225 150337 157151 139543 147528 132620 150799 163502 137452 123331 130324 126124
13910 126124 155564 173547 175678 173636 181626 147954 160136 151907 146263 114141 76126 88838
13898H8838N1277K0369P30J8271j6348m4826M387L4854k2015j5155l1735J6713
13886A05360J5333J8274l3292m468J0608l021N276k89K024m660O52j242J5280
13873A25835O3395J4374n2433l0980R938L9623J3594j067k1274J993k0773q855
13861A33370Q965K8269j2788J0151j6027J8656n1231j9697K1577K224j1446Q862
13849A20885m5803j5211J6700o255J6712L7986R897j1462l0072j1382J8798k4135
13837G6658k408L0269K8964k7147J9059R075K6518n158k0786n7895m1441R59L0787
13824F7454N4583K7341l0640k2828j7657L466j9628L848Q27K4898K3074o406k3967
13811H4365K3848k319k3971j6023n365K2985j2573N081j1467K1884L8061N94r308
$$ plain form
13898 88838 140115 160484 161214 179485 163137 118311 122698 157552 135537 120382 88647 105360
13886 105360 120693 138967 105675 101207 111815 108794 114070 113781 115805 111145 111797 110555 125835
13873 125835 189230 203604 151171 120191 130129 169752 183346 182279 161005 162998 142225 133370
13861 133370 142335 170604 157816 167967 151940 170596 119365 99668 121245 123469 112023 120885
13849 120885 75082 59871 76571 70316 87028 125014 134911 123449 93377 81995 100793 76658
13837 76658 74250 104519 133483 106336 125395 134470 160988 155830 135044 77149 35708 36667 67454
13824 67454 122037 149378 118738 95910 78253 81719 62091 65939 66766 91664 114738 108332 84365
13811 84365 108213 105894 81923 65900 60535 83520 70947 76028 64561 86445 124506 125100 115792
13798A15792J273j1672J1712J6351M387j9652J5593K5426j66n4390q214K129J2580
13785A11149K0493q742R522K4486L597j2089l523L361k5276K4072K8702K750l6675
13772A41827N738q495k7112J3413k5877l1225K281l2584L2523L5093M2572k823
13760A45331j6222J4429j6587l0608P730J2356L844M0180k895m7j6984O440R451
13747A56418p171L54J1299j7792j2635K3103k6189Q759K0332L7069N6690J2137
13735B62374o7296n2526M186O4412K6903l8443m6252k6892K6535j13k5455Q148
13723A35581l333k3668M9095J8156m3236j7594K6451q339R059L1850M2680L759
13711B20461m0564l4070o907K7164k0435P81L3101l2308J063J88k2539L044q171
$$ plain form
13798 115792 117065 105393 117105 133456 137843 118191 133784 159210 159044 104654 96440 98569 111149
13785 111149 131642 122900 132422 156908 160505 148416 144893 148254 122978 147050 175752 178502 141827
13772 141827 147565 139070 111958 125371 99494 68269 70550 37966 70489 105582 148154 145331
13760 145331 129109 143538 126951 96343 104073 116429 120273 160453 157558 157511 140527 146967 156418
13747 156418 149247 149601 160900 143108 130473 153576 127387 136146 156478 193547 250237 262374
13735 262374 195078 142552 146738 211150 238053 199610 153358 126466 153001 152888 127433 135581
13723 135581 132248 108580 157675 175831 132595 115001 141452 133113 142172 174022 216702 220461
13711 220461 179897 145827 138920 166084 145649 146430 179531 147223 148286 148474 125935 128979 120808
13698A20808q43Q626L344L0933J0j0028L552L2655j9573j4308j6229L157j4339
13685A27765l5620L608L7537L1120j8228J0610N5944j9500n2149q615M3608J4291
13673A90371m7367r748o629K3503j77L0840L0277k8814n190m0564k743r949J6021
13660A39831m6035k2897J4433P0176M6380q964J7721j1511n0076r183O814J7220
13648A63909j2592l8620j6062L0390m406K7807n084j882N343Q655K2099k4791
13636A54766J5457L5428K4104l1554l3876Q80L1687K2784n9960o4358J230N2130
13624A48718N8624j9594n3848l0343J2132Q547L1708K6205Q804K955l1496l9559
13612A22853L941O517j6109J0728J8446L2664J5118k5223n930J0936K4144K8391
$$ plain form
13698 120808 119965 128591 131935 162868 162878 152850 156402 189057 169484 155176 138947 142104 127765
13685 127765 92145 95753 133290 164410 146182 156792 212736 193236 141087 132472 176080 190371
13673 190371 143004 133256 126627 150130 149953 180793 211070 182256 177066 136502 133759 123810 139831
13660 139831 93796 70899 85332 155508 201888 192924 210645 199134 149058 139875 146689 163909
13648 163909 151317 112697 96635 127025 122619 150426 145342 143460 148803 157458 179557 154766
13636 154766 170223 205651 229755 198201 164325 165205 196892 219676 159716 95358 96588 148718
13624 148718 207342 187748 133900 103557 115689 124236 155944 182149 190953 193908 162412 122853
13612 122853 126794 133311 117202 127930 146376 179040 194158 168935 163005 173941 198085 226476
13600B26476p479l4403J8481N228l2383n2281j2423Q921M6867M0145o773R619
13588B09995M5329K21k6809K4240j3702n0417K3628N4327k0673m3356J8525N88
13576B21896J1696N176l4088r004l364n6044K0875L5077N66m4371k3636J3959
13564A38738Q341N0676l8971j9054K2291o379J4012K7341J6291O257n1983k517
13552A65043L7387K8792r485j2065l9833K4512l2683k5073L8095J6304k1334l0364
13540A39296o09k7655k0104P6246Q932n9009k8036L848L9921k2791J805L2369
13528A44213K2844m381p911L9059l936J3292p32k6151l7122M8711K9962m1830
13516A76018n4718M590L4930R945q709k744N888j2840L4446l294l6069j8808L3293
$$ plain form
13600 226476 218997 184594 203075 208303 175920 123639 111216 120137 167004 207149 200376 209995
13588 209995 255324 255545 228736 252976 239274 188857 212485 266812 246139 202783 221308 221896
13576 221896 233592 238768 204680 195676 192312 136268 157143 192220 192786 148415 124779 138738
13564 138738 147079 197755 158784 139730 162021 155642 169654 196995 213286 219543 167560 165043
13552 165043 202430 231222 221737 209672 169839 194351 161668 136595 174690 190994 169660 139296
13540 139296 138687 111032 90928 167174 176106 117097 89061 92909 132830 110039 111844 144213
13528 144213 167057 162676 154765 193824 189888 203180 202448 176297 139175 187886 217848 176018
13516 176018 121300 125890 160820 170765 162056 159312 165200 152360 186806 183512 147443 128635 161928
13503A61928J4294N969M5012K2276j3983q832n9549n2256K051J7279K6128m244
13491A56073l0246l1234K0143J0511N0223o556j2996L7913o325L6943K9937j7005
13479B37381l7391m4024J029K1659j561J3999k145p442n590K143J2168l667p807
13466A78752M7804L5676j192m6308N289N397k6145O000l556K2312k2325K5825
13454B27529L977L1837L2772k7997l5517l3332j8032J3934J7766o550j1215k563
13442A92609J6423J3876k682R078J3077L0772r737j8981j7214J1846q008K364
13430B33423o637n0557k2588O881R430K7149K6722K5706j4901j1701O285Q27j0548
13417B19491j0538J5515J5273l219l0187k5347j9209k790K1736j0900J806r43
$$ plain form
13503 161928 176222 182191 227203 249479 235496 226664 167115 114859 116910 134189 160317 156073
13491 156073 125827 94593 114736 125247 175470 168914 155918 193831 187506 224449 254386 237381
13479 237381 199990 155966 156995 178654 177093 191092 188947 181505 175915 178058 190226 186559 178752
13466 178752 226556 262232 261040 214732 220021 225418 199273 205273 201717 224029 201704 227529
13454 227529 231506 263343 296115 268118 232601 199269 181237 195171 212937 206387 195172 192609
13442 192609 209032 222908 220226 229304 242381 273153 263416 244435 227221 239067 231059 233423
13430 233423 226786 176229 153641 160522 169952 197101 223823 249529 234628 222927 229212 230039 219491
13417 219491 208953 224468 239741 236522 206335 180988 161779 158989 180725 169825 171631 170688
13405A70688j5316K9749P137L2042K9646R718J9043j4083j8685J2533o271o152
13393B50049L182k2068j2169k0295n317l4770k4885j770J5081J7557O5704N320
13381B35619k6418k1262k0295J5245L92L3128k4108k5599R125O4072K7409k2940
13369B44368k5835Q786j2654o955K8382J3702M43j2453l1788K3269M0592R570
13357B79427j5630n2485J4589M1004J742k1635K3112M29j456j8029o601j5700
13345B28767j6735j9225j4280L7297L2745K0041R827k8267l7142J8711K995J5965
13333B50699O861j0707l0209K729q755L5675N3746J5057k9396p7696l2771L9776
13321B15009j888R141J1822J6353k125j4222j6021q842K7067J7568j6354k1992
$$ plain form
13405 170688 155372 185121 192258 224300 253946 263664 282707 268624 249939 262472 256201 250049
13393 250049 253231 231163 218994 198699 193382 158612 133727 131957 147038 164595 230299 235619
13381 235619 209201 187939 167644 182889 183281 216409 192301 166702 175827 239899 267308 244368
13369 244368 218533 227319 214665 207710 236092 249794 250237 237784 205996 229265 269857 279427
13357 279427 263797 211312 225901 266905 268647 247012 270124 270553 269097 251068 244467 228767
13345 228767 212032 192807 178527 215824 248569 268610 278437 250170 213028 231739 234734 250699
13333 250699 257560 246853 216644 219373 210618 246293 300039 315096 285700 208004 175233 215009
13321 215009 213121 222262 234084 250437 248312 234090 218069 209227 236294 253862 237508 215516
13309B15516K2515L1029j5989l0039K0081K7237k1961J162N631j4314J9692J1018
13297B71578m6053m2009J5365J3571k2775j6862j2053K9288J602L2113L0567m7356
13285B06976k5381k4167M740L6279K9280p805P409o028j197M0585j9985J2605
13273B53311k1210m101j224O030n1054j3206N7966O4118M4034Q690m7722n2573
13261B43059j8466j3484k158M6540K2361l1376k2774N302N1937j2026J9077j0762
13249B77230o230K7299L5153p251n0321o1151j960j8844L8511K0005J7529K0370
13237B90340j0977m3984J2335J3274J4812l7407q320K759j9184L810K7482M435
13225B49375j9918J5738K7263K587J7435R152J5656m2123q013J9470P830m2818
$$ plain form
13309 215516 238031 269060 253071 223032 243113 270350 248389 249551 255182 240868 260560 271578
13297 271578 225525 183516 198881 212452 189677 172815 160762 190050 191652 223765 254332 206976
13285 206976 181595 157428 162168 198447 227727 219922 227331 221303 220106 260691 240706 253311
13273 253311 232101 228000 226776 232806 181752 168546 226512 290630 334664 343354 295632 243059
13261 243059 224593 211109 208951 255491 277852 246476 223702 229004 280941 268915 287992 277230
13249 277230 271000 298299 333452 326201 275880 214729 212769 193925 232436 252441 269970 290340
13237 290340 279363 235379 247714 260988 275800 238393 230073 232832 213648 217458 244940 249375
13225 249375 229457 245195 272458 275045 292480 301632 317288 275165 267152 286622 294452 251634
13213B51634n494j0093M494O929J0095J2080L0041k0182K5606J2584K2589J3213
13201C53496k0413j9224q69m3415l1143L6176p185l4308k7961R424M0259K3493
13189B78330N1019J5654k9162j6560K568M375j5967k1820k4189K2161j9886j0633
13177B35890K5205L2212j84j467M7695O213k7819j9370K0258J4488K7664k6478
13165C34307r589j2667k743q694J9249l1j3014k3682r058J9656J6637l2026k6473
13152B51872O1384J4244n6984K8599j6929L259j4036L2196l1530L53J7073j1223
13140B78278k9671k1876k083l670J7475r68K0503K1005L2470J8847j2345J4738
13128C32703N356n100j8093j3655k2835j3342L284l5167N322L4063j4736l4664
$$ plain form
13213 251634 246140 236047 240541 247470 257565 269645 299686 279504 305110 317694 340283 353496
13201 353496 333083 313859 312990 269575 238432 274608 267423 233115 205154 214578 254837 278330
13189 278330 329349 345003 315841 299281 301849 306224 290257 268437 244248 266409 246523 235890
13177 235890 261095 293307 293123 291656 339351 345564 317745 298375 318633 333121 360785 334307
13165 334307 324718 312051 309308 300614 319863 319832 306818 283136 274078 293734 310371 278345 251872
13152 251872 313256 327500 270516 299115 282186 285445 271409 303605 272075 272428 289501 278278
13140 278278 248607 226731 224648 220978 238453 237485 257988 278993 311463 330310 317965 332703
13128 332703 338059 332959 314866 301211 278376 265034 268318 233151 238473 272536 257800 223136
13116B23136J49O0473M0637J1581Q581j7716j8453k5672l5542M49k7065N3687
13104B74245M9349L1717J3751k9743j2211Q648m759m077J1793k2497j1350j1111
13092B93755L0468k49J0413L8965Q99k2754k7607J3227j3581p752k874j1768k8935
13079B72207o929L005j9737K4880M6662k2307l8074j2628N2789J2871l930K3940
13067C32749K1091Q678l2786k5019j2364R564J31Q703j479l1577J8706M3245r009
13054C30633p685n4j2503m2804K2211K9995J4738Q634l2043J3144L2558K6431
13042C83255l8890l2681M329N3877K1750K580J72m5658J4691J0269j5045O475
13030C65124j8241J6841J8785k1747m4622q174k0631j6944M4745L8660k1139k8729
$$ plain form
13116 223136 223285 283758 324395 335976 344557 326841 308388 282716 247174 247623 220558 274245
13104 274245 323594 355311 369062 339319 327108 335756 330997 326920 338713 316216 304866 293755
13092 293755 324223 323974 334387 373352 374251 351497 323890 337117 323536 315784 312910 301142 272207
13079 272207 265278 268283 248546 273426 320088 297781 259707 247079 299868 312739 308809 332749
13067 332749 353840 362518 329732 304713 292349 301913 302044 310747 309268 277691 296397 339642 330633
13054 330633 322948 322894 310391 267587 289798 319793 334531 343165 311122 324266 356824 383255
13042 383255 344365 311684 316013 369890 391640 394220 394392 348734 363425 373694 358649 365124
13030 365124 346883 363724 382509 360762 316140 307966 287335 270391 315136 353796 332657 303928
13018C03928K9208M6965K0080j5513l6488p351J8291M746o971K1678k3906l1745
13006C22922K6441L6493k1089j4269j0478j3079o98O669L4107P908k3376k3838
12994C27713r931O497M0102J1865m003J1045N120K2025k7310m0042j1459L5979
12982C67601R384j0621Q451K2039J603K6592K4857j6550j8548m7752K442l090
12970C66408j1985J4644j4976K600L3394M0639K1271k3313k3784L502K0369r958
12958D18811j6563j5727K5240P91k4386k368j250J4651q535M864K0735J7915j0804
12945D23374M0036J9125J7420n4206o1025n46K1643K2101K76l4089J23j7969k3861
12932C52402P539K2742J7671O522m5439k9265O8489J6545P505P98m792j3618k2499
$$ plain form
13018 303928 333136 380101 400181 384668 348180 340829 359120 363866 356895 378573 354667 322922
13006 322922 349363 385856 364767 350498 340020 326941 326243 332912 367019 374927 351551 327713
12994 327713 317782 324279 364381 376246 372243 383288 388408 410433 383123 343081 331622 367601
12982 367601 376985 366364 374815 396854 398457 425049 449906 433356 414808 367056 369498 366408
12970 366408 354423 369067 354091 356691 390085 430724 451995 428682 404898 408400 428769 418811
12958 418811 402248 386521 411761 412552 388166 385798 384548 399199 390664 395528 416263 434178 423374
12945 423374 463410 482535 499955 445749 384724 384178 405821 427922 428198 394109 394232 376263 352402
12932 352402 359941 382683 400354 406876 361437 332172 400661 417206 424711 425509 420717 407099 384600
12919C84600J1978J250K2843P638j0132l9685R055k6433J2867N668O563P534L2637
12906D26383j0121r597o602J4k26J5051M7037J0613k9370K0549n608j9391j0570
12893D28162L4776J1251M019m9583j274K6158M594K4090J8789K5706L354k6589
12881E03453k3783l0590Q165K703k9964j1484K8342K7911q51k6048l045P627R706
12868D62142k681r308J3947j6222j2324Q554N3536K0261k1205k9993J6624k783
12856D80548j3443m092k7618m6760l3973L0405J0682j4964J8233Q0651K4107l2525
12844D71251j7952K929J1219J0423J2809R490K0992l9573k4930Q38K4524l997
12832D78023j285k01n634K6318r382j3780M4068M3230J0012k7623j6561K5109
$$ plain form
12919 384600 396578 397828 420671 428309 418177 378492 387547 361114 373981 379649 386212 393746 426383
12906 426383 416262 406665 400063 400077 399851 414902 461939 472552 443182 463731 458123 438732 428162
12893 428162 462938 474189 478208 428625 427351 453509 458103 482193 500982 526688 530042 503453
12881 503453 479670 449080 457245 459948 429984 418500 446842 474753 473902 447854 444809 452436 462142
12868 462142 459461 450153 464100 447878 435554 444108 497644 517905 496700 466707 483331 480548
12856 480548 467105 463013 435395 388635 354662 385067 395749 380785 399018 479669 503776 471251
12844 471251 453299 456228 467447 477870 490679 500169 521161 481588 456658 457496 482020 478023
12832 478023 476738 476537 470903 497221 487839 474059 518127 561357 571369 543746 527185 552294
12820E52294n49k8658K5684O547j887L4406k1948l1169J3874l7704l7821L4442
12808E07511L2329j8808m0708l2385K029J1689J3911O747l0390r93j8084M9385
12796D82233L7020K7921J4641Q400L3976K0595k6483l7355j9567l1413l1723n214
12784D73031L4171L4333l2465m1977J790K0321L9109j3353m9121j8886K8086O2371
12772E37410J1575J6432j1685Q333j8665q872K374J6855K2325L5386J7043m0365
12760E88146l7720o9340L2015N897j6746K5595K4590j2186l2060J5019L0555M5225
12748E98990O882m9493k8364J584Q408M1817k0385J2151O6121J2404m4345o7630
12736E38140J9847L3294q805l2915j792J0925n634j2219K4488P644L8384N455
$$ plain form
12820 552294 551745 523087 548771 555318 553431 587837 565889 534720 548594 510890 473069 507511
12808 507511 539840 521032 480324 447939 449968 461657 475568 482315 451925 450932 432848 482233
12796 482233 519253 547174 561815 570215 604191 624786 598303 560948 541381 509968 478245 473031
12784 473031 507202 541535 509070 467093 468883 489204 528313 514960 465839 446953 475039 537410
12772 537410 548985 565417 553732 562065 543400 534528 536902 553757 576082 611468 628511 588146
12760 588146 550426 481086 513101 518998 502252 527847 552437 540251 508191 523210 553765 598990
12748 598990 605872 556379 528015 529599 538007 579824 559439 571590 637711 650115 605770 538140
12736 538140 557987 591281 582476 549561 547769 558694 553060 540841 565329 572973 611357 616812
12724F16812n985o829k2066n731J2578j794q311J6157J9540O0034J5440n6004
12712F33841m7516O249K5755k0223j1829l8039J0561N709J5178J318l715k982
12700E74307M987K0375q72j5812l8267k1526l213J449L4001N0223N4513J2461
12688F72626k1578l3323k5326J4912K5776m7210l0460q144j8215L5415o06K9414
12676E93281M4775J0553r109M527N209K1671J5602l0965J576L956J5041k9855
12664F46262j3116M3912L3354J0011m9705k1710J8171R461k9662m8666r522K1548
12652F10338N0834L3190j2402k3490O332L4126l9246j4034r115P961m306m973
12640F35215L4745K5633k374n4715j38K629L8232J2217j5296q97K4079K9351o550
$$ plain form
12724 616812 610827 603998 581932 576201 588779 586985 578674 594831 614371 674405 689845 633841
12712 633841 586325 592574 618329 598106 586277 548238 558799 564508 579686 581004 577289 574307
12700 574307 579294 599669 598797 582985 544718 523192 519979 521428 555429 605652 660165 672626
12688 672626 651048 617725 592399 607311 633087 585877 555417 547273 529058 564473 563867 593281
12676 593281 638056 648609 639500 644027 649236 670907 686509 655544 657120 661076 676117 646262
12664 646262 633146 677058 710412 720423 670718 649008 667179 676640 646978 598312 588790 610338
12652 610338 661172 694362 681960 658470 664802 698928 659682 645648 636533 644494 640188 635215
12640 635215 669960 695593 693219 638504 638366 640995 679227 691444 676148 675251 699330 728681 722131
12627G22131l464l3104j6556M2960J3948j2165k7519j935J2412q761Q422o177
12615F90192m3474l3933N8022N4688j7644j8723j1444L2336J0257k417m64j04
12603G17292J3349L603j0529J2461j4073k8696J2363J0361l3654R955K1376N858
12591G19666k7134J3178J8575P257K3318k734L3292k591q723l25n109K6075K7062
12578H21807q744o3702j1273K434m0169j2127K4068k6305n759J8716L7033K59
12566G36238M3716J3933j0189k6342l9375K260K7066L9664j0537K967J6275m6611
12554G49065k5190K5905M0561j3467J4541N150k5409p5785J8800R077k3507k7992
12542F71749J0079N6119R5513O978m0899j5910L9063J6128J4968N261n3676R873
$$ plain form
12627 722131 718667 685563 669007 711967 725915 713750 686231 684296 696708 687947 696369 690192
12615 690192 646718 612785 670807 725495 707851 689128 677684 710020 720277 717860 717396 717292
12603 717292 730641 734244 723715 736176 722103 693407 705770 716131 682477 692432 713808 719666
12591 719666 692532 705710 724285 731542 754860 752126 785418 782827 774104 773779 768670 794745 821807
12578 821807 813063 749361 738088 740522 700353 688226 712294 685989 680230 698946 735979 736238
12566 736238 779954 793887 783698 757356 717981 720241 747307 786971 776434 779401 795676 749065
12554 749065 723875 749780 790341 776874 791415 796565 771156 695371 714171 723248 699741 671749
12542 671749 681828 737947 833460 840438 799539 783629 822692 838820 853788 859049 805373 815246
12530H15246J2682n086j0809M488P019j5618K8041J2676r385p54m922k0822K2073
12517H34829j7999L995o267o141K6338K1202O89L0102o85n203j1040M361L7891
12504I12072J7021J0601j0980K4055j5795k0086p56m725n9833M867L3977L4573
12492I24991k460k6140m8212q703m140J6946o1o216M4806N6938j1129L436k007
12479I38049J2739j8328o288K639n745K6821O154Q57L2448j5116m143k36j4673
12466I55178p597k471j6394l7274K4831j1254J7708K853J3811M1244k9942K0767
12454I71460O481k8672j0364l3050k1909l665K6105L0919o666m130J1347K2126
12442I59982r805Q554J1376k5652j1867O882M4470J3425j6770L682J1594j9780
$$ plain form
12530 815246 827928 822842 812033 816521 823540 807922 835963 848639 839254 838500 833578 812756 834829
12517 834829 816830 820825 814558 808417 834755 855957 856646 886748 886063 880860 869820 874181 912072
12504 912072 929093 939694 928714 952769 936974 916888 916132 911407 851574 856441 890418 924991
12492 924991 922531 896391 848179 839476 835336 852282 852221 846005 890811 947749 936620 940056 938049
12479 938049 950788 932460 926172 928811 923066 949887 956041 956898 989346 974230 970087 969851 955178
12466 955178 947581 945110 928716 891442 916273 905019 922727 925580 939391 980635 950693 971460
12454 971460 977941 949269 938905 905855 883946 880281 906386 937305 930639 926509 937856 959982
12442 959982 950177 958731 970107 944455 932588 939470 983940 997365 980595 984277 995871 976091
12430I76091K6956K4886m6039J0982J7185P187L6600q511l3682l3397J0508J3198
12418A001964P2669J669k4954L2990j7372j1711j2697k5463q877K4419N656j3365
12406A024928k1458m1947J7132O648N7925M2442j9589l1698j8394J8994R633J0250
12394A054866K4691K3738o319J0706L8903l5698n5085p839K6162p671J1005N7081
12382A134540m482l5847j7117k6127J6937L9975J1128l359l9972J0993O3909J8544
12370A169122j6719k3028l8705k3907K1275O738N8321r06R501J1038O932J6453
12358A196115k862j5080l602k4980J899J2853J5014k3448j6517j9250K3208L9331
12346A182681J8849j7331l619k4919r737l5519K5436N1824J4795j0141k973J3108
$$ plain form
12430 976091 1003047 1027933 981894 992876 1010061 1017248 1053848 1045337 1011655 978258 988766 1001964
12418 1001964 1074633 1076302 1051348 1084338 1066966 1055255 1042558 1017095 1008218 1032637 1038293 1024928
12406 1024928 1003470 961523 978655 985303 1043228 1085670 1066081 1034383 1015989 1034983 1044616 1054866
12394 1054866 1079557 1103295 1096976 1107682 1146585 1110887 1055802 1047963 1074125 1066454 1077459 1134540
12382 1134540 1130058 1094211 1077094 1050967 1067904 1107879 1119007 1115648 1075676 1086669 1150578 1169122
12370 1169122 1152403 1129375 1090670 1066763 1088038 1094776 1153097 1152191 1161692 1172730 1179662 1196115
12358 1196115 1193253 1178173 1174571 1149591 1151490 1164343 1179357 1155909 1139392 1120142 1143350 1182681
12346 1182681 1201530 1184199 1180580 1155661 1145924 1110405 1135841 1187665 1202460 1192319 1189346 1202454
12334A202454k233K6980K9858j4086k8543J3403J4235O843Q430m042K0905j0986
12322A263218o246K7452N1150K591j6315k8551K717j0342r686l3874o832J109
12310A236391J2901J3797J7477j7947O353M618m3122J4796J4891n6892R59L1151
12298A235373K441L846K4032K0780N842N725J6856J5733K054k4332j2701R487
12286A305136j1221k6331o034M0916K2143J3616j1881J4268K693j4289k0469j9413
12274A289134K2280m011l5569r839J375R973N0184M3367K4293K3517m3325l1510
12262A339869p126J623J5483K3944J9213N520k1188P303o670J514m583j0516o676
12249A357710P316J729J8109j4416j4638M2090K1097n1828j2813R462k34l461
$$ plain form
12334 1202454 1200221 1227201 1257059 1242973 1214430 1227833 1242068 1248911 1257341 1253299 1274204 1263218
12322 1263218 1256972 1284424 1335574 1338165 1321850 1293299 1296016 1285674 1275988 1242114 1235282 1236391
12310 1236391 1249292 1263089 1280566 1262619 1268972 1273590 1230468 1245264 1260155 1203263 1204222 1235373
12298 1235373 1237814 1241660 1265692 1286472 1292314 1298039 1314895 1330628 1332682 1308350 1295649 1305136
12286 1305136 1293915 1267584 1261550 1302466 1324609 1338225 1326344 1340612 1343305 1329016 1308547 1289134
12274 1289134 1311414 1307403 1271834 1261995 1263370 1273343 1323527 1366894 1391187 1414704 1371379 1339869
12262 1339869 1332743 1334366 1349849 1373793 1393006 1398526 1377338 1384641 1377971 1379485 1374902 1364386 1357710
12249 1357710 1365026 1366755 1384864 1370448 1355810 1397900 1418997 1367169 1354356 1363818 1363584 1360123
12237A360123K8760l357K9758J9706l5740j7845j5845K0754J4932L640N542J4886
12225A425314J5147L778m5389j7060K5495L2928n229j2256j9188j1952l242N7953
12213A446299K0291n1485l8955k475j0929L3716M0578P481J9733K1991k7482K7108
12201A485871J9283r5j336L019r704l41j3560k0252K915j9011K9527j2554j6367
12188A447395J0472P3724K5760n1747k7995Q904k9870L946O4224L2527J4402J8817
12176A590559k5283k5592l4789O215K1247j4950K4581L288k5233K146K2355Q684
12164A553228L5959j9676j7882K5210p633j9743M419L753o630M6046k252J5362
12152A610161K4506J427l5252o386N0200L7472l0282j5330p495n1221J9948J8395
$$ plain form
12237 1360123 1388883 1385526 1415284 1434990 1399250 1381405 1365560 1386314 1401246 1404886 1410428 1425314
12225 1425314 1440461 1444239 1398850 1381790 1407285 1440213 1434984 1422728 1403540 1391588 1388346 1446299
12213 1446299 1466590 1415105 1376150 1373675 1362746 1396462 1437040 1444521 1464254 1486245 1458763 1485871
12201 1485871 1505154 1505059 1503723 1506742 1497038 1496697 1483137 1462885 1465800 1446789 1476316 1463762 1447395
12188 1447395 1457867 1531591 1557351 1505604 1477609 1486513 1456643 1460589 1524813 1557340 1571742 1590559
12176 1590559 1565276 1539684 1504895 1511110 1532357 1517407 1541988 1545276 1520043 1522189 1544544 1553228
12164 1553228 1589187 1569511 1551629 1576839 1569206 1549463 1553882 1557635 1551005 1597051 1594799 1610161
12152 1610161 1634667 1636094 1600842 1594456 1644656 1682128 1651846 1636516 1629021 1577800 1597748 1616143
12140A616143J5966j4851m7380r1456J5849N2691L0884K2206K1831J6134n441
12129A632576m547k2763k8253m8639J9346M4074N2212N143o483q604n2069J1178
12117A593171K2573M2191N793N145j1191K5166K957J1987k6904k7206j7560l378
12105A622744k919j246M2038k6650l7620K2743L8377N7493O36j1523J2078o992
12093A709159r426k1631j4981k8099J4753L3405j4384j8073r751k4040m09j3030
12081A603493P731N5701j290k2870O129M8281p23o3654R379L8389K6960j5749
12069A691777M9273r530n6617N340J3838j1071l344n94O742K0778L3838k052n3477
12056A684901j8128N2466K3722L3557j0632L271k4178j5862M617k6813l5100M5700
$$ plain form
12140 1616143 1632109 1617258 1569878 1478422 1494271 1546962 1577846 1600052 1621883 1638017 1632576
12129 1632576 1628029 1605266 1577013 1528374 1547720 1591794 1644006 1649149 1642666 1634062 1581993 1593171
12117 1593171 1615744 1657935 1663728 1668873 1657682 1682848 1685805 1697792 1670888 1643682 1626122 1622744
12105 1622744 1619825 1618579 1660617 1633967 1596347 1619090 1657467 1714960 1715596 1704073 1716151 1709159
12093 1709159 1699733 1678102 1663121 1635022 1649775 1683180 1668796 1650723 1640972 1616932 1616523 1603493
12081 1603493 1611224 1666925 1665635 1642765 1648894 1697175 1696452 1632798 1642177 1680566 1707526 1691777
12069 1691777 1741050 1731520 1674903 1680243 1694081 1683010 1679666 1679072 1685814 1706592 1740430 1738378 1684901
12056 1684901 1666773 1719239 1742961 1776518 1765886 1769157 1744979 1729117 1733734 1706921 1671821 1717521
12044A717521J6149j6341k0465p0458q322M0410N0869K8537p456l2130J2598l9262
12032A671650p397P645M9903l4430m1070O346K3774J1121M2617k804k0116J4167
12020A721406L6238j8604l9937m4559n639L2025K6556l927K8046J3121k1145k3869
12008A699712j8472n231J8638R863R622L119k0181K9249L6342L2978J5554j1160
11996A800033J920q132j8207j8491m420J5453r613l0334l8237l4573j1920K9898
11984A673377j1289K3963J257M255J242K2356l609K649j5525K3414j3173J8577
11972A727494j5413k7634J4307J4085K2733R131k0680J8010k1354k0500J3547
11961A713726L233m009J5768m739L2763j6955l4804L135k1686j0147J2533n136
$$ plain form
12044 1717521 1733670 1717329 1696864 1626406 1618084 1658494 1709363 1737900 1730444 1698314 1710912 1671650
12032 1671650 1664253 1671898 1721801 1687371 1646301 1652647 1676421 1687542 1730159 1727355 1707239 1721406
12020 1721406 1757644 1739040 1699103 1654544 1648905 1680930 1707486 1703559 1731605 1744726 1723581 1699712
12008 1699712 1681240 1676009 1694647 1704510 1714132 1717251 1697070 1726319 1762661 1795639 1811193 1800033
11996 1800033 1801953 1793821 1775614 1757123 1752703 1768156 1758543 1728209 1689972 1655399 1643479 1673377
11984 1673377 1662088 1686051 1687308 1691563 1692805 1715161 1711552 1714201 1698676 1722090 1708917 1727494
11972 1727494 1712081 1684447 1698754 1712839 1735572 1744703 1724023 1742033 1720679 1700179 1713726
11961 1713726 1716959 1712950 1728718 1723979 1756742 1739787 1704983 1708118 1686432 1676285 1688818 1683682
11949A683682M4669K7173R402m8377j1337M3814R434k5154K620q979k6468j4543
11937A685936N2369N9254l2244l7786m0762J6465j4801r917J4892K9493K8820
11926A751719j3933k4068l6913K0526K294L1707J6759l5348l3694l3745j1157
11915A634147p34L7178k142k9780m2487j3429N4486K5384l8576k7644J8119N343
11903A619865J5524J8880J4658L1379J1113m377k3242k0315o071j7066j3484k7128
11891A599736l036q80L808L1464K8665J1606r662q177k2085J0550k1067K9998
11879A650920l8277j4456K1651J7940m3369j5243N244K7445J4695p606q785k13
11867A609946K2414n037M361K8198N575R203n8549m0288K0606N0654K0908p046
$$ plain form
11949 1683682 1728351 1755524 1764926 1716549 1705212 1749026 1758460 1733306 1735926 1726947 1700479 1685936
11937 1685936 1738305 1797559 1765315 1727529 1686767 1703232 1688431 1678514 1693406 1722899 1751719
11926 1751719 1737786 1713718 1676805 1697331 1699625 1731332 1748091 1712743 1679049 1645304 1634147
11915 1634147 1633413 1670591 1668449 1638669 1596182 1582753 1637239 1662623 1624047 1596403 1614522 1619865
11903 1619865 1635389 1654269 1668927 1700306 1711419 1707042 1683800 1663485 1657414 1640348 1626864 1599736
11891 1599736 1596700 1595820 1599628 1631092 1659757 1671363 1661701 1653524 1631439 1641989 1620922 1650920
11879 1650920 1612643 1598187 1619838 1637778 1594409 1579166 1584410 1611855 1626550 1618944 1610159 1609946
11867 1609946 1632360 1627323 1631684 1659882 1665457 1674660 1616111 1575823 1596429 1647083 1667991 1660945
11855A660945j8815q207j8793J0402l542m287J1926J0314m4165L548k7094m2927
11843A529305R187J7523N4517N6308j4846n2094R499r303k3045J2895j0206J0920
11831A590660J9388l9492Q605k8023J768J3845k145l3115k7819K1655K1799j2705
11819A534421M91M6727k1602k0956J701k8386l864K9986J2583O718n504l1389
11807A520926n5865k3838j3358k1012p011J6294M4218R287J0292J3676K1018J8165
11795A532792q034j9221j0707j7928P492M103j0046L2427k5821m2265J0049K5825
11783A478666J1464o153P66N192l2976j6562p021l6834L0099K0333J5726j8103
11771A444597J6106j8199K6279k7859k1895O756j2974l8807l1558J8488R192P537
$$ plain form
11855 1660945 1642130 1633923 1615130 1625532 1621990 1617703 1629629 1639943 1595778 1599326 1572232 1529305
11843 1529305 1538492 1556015 1610532 1666840 1651994 1599900 1609399 1600096 1577051 1589946 1579740 1590660
11831 1590660 1610048 1570556 1579161 1551138 1552906 1566751 1564606 1531491 1503672 1525327 1547126 1534421
11819 1534421 1534912 1581639 1560037 1539081 1540782 1512396 1508532 1538518 1551101 1557819 1552315 1520926
11807 1520926 1465061 1441223 1427865 1406853 1399842 1416136 1460354 1469641 1479933 1493609 1514627 1532792
11795 1532792 1524758 1505537 1494830 1476902 1484394 1488497 1478451 1510878 1485057 1442792 1452841 1478666
11783 1478666 1490130 1483977 1484743 1489935 1456959 1440397 1433376 1396542 1426641 1446974 1462700 1444597
11771 1444597 1460703 1442504 1468783 1440924 1419029 1425785 1412811 1374004 1342446 1360934 1370126 1377663
11759A377663Q088O557K6849K1887r278k0720L655j5324k2188L1065K6736r676
11747A425314J9554k0219n4099k7054k2369q935N833J5687J742M7561K6560r081
11735A400494J807L2449L060k7909k6715k5547N082J8752J8934R657k0503m7171
11723A342390o204O327J4923k3743n2537k3747l5755L4361J2870j0899j2068L4872
11711A280790M2922p989k0685J8525j4819r24K3452J7879n595p29l8735l3566
11699A260526q172n36J812k4506J0247q490m357o635J1282M0914J9673k2815j4642
11686A254301j716k2052k9324K9860K2848K2041K1191j6276l2685l418m4180L306
11674A203896J4272K1441k771j7492j2336j1414N998o670K1034L8604l2000m0442
$$ plain form
11759 1377663 1385751 1392308 1419157 1441044 1431766 1411046 1414701 1399377 1377189 1408254 1434990 1425314
11747 1425314 1444868 1424649 1370550 1343496 1321127 1312192 1318025 1333712 1335454 1383015 1409575 1400494
11735 1400494 1402301 1434750 1437810 1409901 1383186 1357639 1362721 1381473 1400407 1410064 1389561 1342390
11723 1342390 1336186 1342513 1357436 1333693 1281156 1257409 1221654 1256015 1268885 1257986 1245918 1280790
11711 1280790 1323712 1315723 1295038 1313563 1298744 1297820 1321272 1339151 1333556 1332827 1294092 1260526
11699 1260526 1252354 1251818 1253630 1229124 1239371 1230881 1226524 1219889 1231171 1272085 1291758 1268943 1254301
11686 1254301 1252585 1230533 1201209 1231069 1253917 1275958 1297149 1280873 1248188 1244770 1200590 1203896
11674 1203896 1218168 1239609 1236838 1219346 1207010 1195596 1201594 1194924 1215958 1254562 1222562 1182120
11662A182120K0751L7181r916n1555l5592K347Q817n139k934J1857K2932j8104
11650A162765j9386j9060K385j2465K6608K299K6817m2285k2667J1611l0139l503
11638A082980O4813N8037m6528j7519Q659n4167j3519N74P369K3050J5419L3686
11626A162854p269k0767k6549r915j1736n745K4306K0371r704k4530L842J3841
11614A108999L026k0367k6079K7050K8022M4922n872k7963k3641K4078l37l3082
11602A098756j015m507m8421l4885O8975P836J1482J4978J0570m2864m6341J0816
11590A045380K358K3838p282J4600N8218J6589j7038l2383k2555l8060j1888j0354
11578A021423M1478K2593Q792p559l6991K8397J0399j0293P027j2751m2575j0328
$$ plain form
11662 1182120 1202871 1240052 1230136 1178581 1142989 1145336 1154153 1149014 1146080 1157937 1180869 1162765
11650 1162765 1143379 1124319 1126704 1114239 1140847 1143146 1169963 1127678 1105011 1116622 1086483 1082980
11638 1082980 1147793 1205830 1159302 1141783 1150442 1096275 1082756 1083330 1090699 1113749 1129168 1162854
11626 1162854 1155585 1134818 1108269 1098354 1086618 1080873 1105179 1125550 1115846 1091316 1095158 1108999
11614 1108999 1112025 1091658 1065579 1092629 1120651 1165573 1159701 1131738 1108097 1132175 1131838 1098756
11602 1098756 1097741 1093234 1044813 1009928 1078903 1086739 1098221 1113199 1123769 1080905 1034564 1045380
11590 1045380 1047738 1071576 1064294 1078894 1137112 1153701 1136663 1104280 1081725 1043665 1031777 1021423
11578 1021423 1062901 1085494 1094286 1086727 1049736 1078133 1088532 1078239 1085266 1072515 1029940 1019612
11566A019612L0229l745J0550k1909m190Q275J8716j825O645m7860o3486J9203
11554I70215J143l6147Q629N6371K9101k9695l4473J7420J9389R667P959J4218
11542A033797p61m0315K0392J1464J3365j7475j7155q695k470m5698l1994M644
11530I19099M3130K7846l660j5395k3924J546m674k7166k4239j812n48p198j0596
11517H72409J8626k9169k6018M7643K2878k6638j9222j1170J5793J274K70l928
11505H62748l881k6177K9275k1023n877J9926K3551R810K2823J6782l2042l3348
11493H62567k1678L1086K0914m9820k300R797R844r963r831o1468l1583N6565
11481H04130N2311o189K6797K0429j6350j9954N13Q849J764J2818j6515R88J431
$$ plain form
11566 1019612 1049841 1046096 1056646 1034737 1030547 1038822 1057538 1055713 1062358 1014498 951012 970215
11554 970215 971358 935211 943840 1000211 1029312 999617 965144 982564 1001953 1011620 1019579 1033797
11542 1033797 1033036 992721 1013113 1024577 1037942 1020467 1003312 994617 992147 946449 914455 919099
11530 919099 962229 990075 986415 971020 947096 948642 943968 916802 892563 890751 890203 883005 872409
11517 872409 891035 861866 835848 883491 906369 879731 860509 849339 865132 866406 866676 862748
11505 862748 858867 832690 861965 840942 835065 854991 878542 888352 911175 927957 895915 862567
11493 862567 840889 871975 892889 843069 840769 850566 860410 850447 840616 779148 747565 804130
11481 804130 856441 850252 877049 897478 881128 861174 861687 870536 872300 885118 868603 869591 871022
11468H71022J1559N2758M3962M1917J6203m0495j6778k8405m8758k5032k1524
11457H56429j7692k4078j4129p31J0845o4j2789l1018l4403J1848N4272o413k4897
11444G67180K8700K1959L0848p08p153l3508n8394j7139O4438l909m479K0270
11432H08105K7347n40m9058m3525L3910J0205j7487p743K5666J8948m0355k1021
11420G44452M5890m2938n4188Q920L8953j5000K1319p122J1270J4298K0925L0257
11408H17036n1518N931L340j3149N342M0890l276l3262J2729R031m777o1576n8251
11395F68490J4617L5365J8514M3246j8238o670M556J2479q863j978o517j9636
11383G35365K2041o616l105j4639J572J1738j8316K0195k4874j6551M7331K3926
$$ plain form
11468 871022 882581 935339 979301 1021218 1037421 996926 980148 951743 902985 877953 856429
11457 856429 838737 814659 800530 799799 810644 810580 797791 766773 732370 744218 798490 792077 767180
11444 767180 795880 817839 848687 847979 840826 807318 748924 731785 796223 792314 787835 808105
11432 808105 835452 834912 785854 742329 776239 786444 768957 761214 786880 805828 765473 744452
11420 744452 790342 747404 693216 702136 741089 726089 747408 740286 751556 765854 786779 817036
11408 817036 765518 771449 774789 761640 766982 807872 804596 771334 784063 793094 788317 726741 668490
11395 668490 683107 718472 736986 780232 761994 755324 759880 772359 763496 761518 755001 735365
11383 735365 757406 750790 747685 733046 734618 746356 728040 748235 723361 706810 754141 778067
11371G78067l3272L5815J7217p622l529q379k5212J2847j2562n3151j6646L006
11359F86579R046N558m445j5630o630K8619K0427j6382O504K6085l897O668K4798
11346G67300J8963n1252m4837R131P1467K4169m1182l3742j5083O339L9750O5919
11334H16942J6061l518J9282J4472m336L4797J5934K4224K9584N9745Q5795J27108
11322A236090J57598J38576J22033J72780J63295J28922J45830J10568O9050K4922
11312B469664K8897j3135r7513j89445k87175k57338k56847j97616o2491o5473
11302A071528j21953n5377m4816q526J015j8173k2084k8053K029M451k725n2296
11290G25020k1557K4019K4949m0378K9798J678l9492m2543k506n447L0283K5048
$$ plain form
11371 778067 744795 780610 797827 790205 786676 778297 753085 765932 753370 700219 683573 686579
11359 686579 695625 701183 696738 681108 674478 703097 723524 707142 713646 739731 735834 742502 767300
11346 767300 786263 735011 690174 699305 770772 794941 753759 720017 704934 711273 751023 816942
11334 816942 833003 829485 848767 863239 858903 893700 909634 933858 963442 1023187 1108982 1236090
11322 1236090 1393688 1532264 1654297 1827077 1990372 2119294 2265124 2375692 2444742 2469664
11312 2469664 2498561 2485426 2387913 2198468 1911293 1653955 1397108 1199492 1137001 1071528
11302 1071528 949575 894198 849382 840856 841871 823698 801614 773561 775590 780041 777316 725020
11290 725020 703463 727482 752431 712053 741851 743529 704037 661494 658988 653541 683824 708872
11278G08872l98j7273n7476k708O9395J0570k3978k3169k0583L176j7284k1638
11266F07506l972m3132J504J3682O88L2667k5062R976P9837J519l9486m051m8497
11253E83179K2139n865l0105M2572M2911l7131K1362L447k5887R54L566P384J454
11240F29980K0073N475n557j2562n0239L6305M7487k855l5438j6054j46L8747
11228F55216J3656j3899l7179k7686m501q028K2881J5505k1734Q790K7285n321
11216F24985J0280j1003l1779M33M557M6M041j8405j2449P679J519j4564N137
11203E70477P309M4207j2732r774R010k4679q320O496l9920p787M0764l870j1368
11190E59813P517r55J6646L9537l1453M8039L963m1412K1486O561L9305l928k5010
$$ plain form
11278 708872 708474 691201 633725 631017 700412 710982 687004 663835 643252 646428 629144 607506
11266 607506 603534 560402 561906 575588 576276 608943 583881 593857 673694 675213 635727 631676 583179
11253 583179 605318 599453 569348 611920 654831 617700 639062 642509 616622 617576 621142 628526 629980
11240 629980 650053 655528 649971 637409 587170 623475 670962 668107 632669 616615 616469 655216
11228 655216 668872 654973 617794 590108 585607 577579 600460 615965 594231 603021 630306 624985
11216 624985 635265 624262 592483 592916 597473 597519 601560 583155 570706 578385 579904 565340 570477
11203 570477 577786 621993 609261 599487 608497 583818 575498 581994 542074 534287 575051 571181 559813
11190 559813 567330 566375 583021 622558 591105 639144 643107 601695 623181 629742 669047 665119 640109
11177F40109l0576J1547k4859j0555n851M8717M7421K2715M2491N0334k2686P519
11165G76326M3414M807L386k5147m8555l2848m6099q412j8797l676K6891K0688
11153F91978o5556m2542j710M372J5854j2329j5196q779K5588M0718k8723Q874
11141F12549J9010m422k5143j1184J5507J066m8894o167k270N0617K5582m5421
11129E80830j0622K6224q681L1329J3657L3939M7754l2965j06738p6935L608K7551
11117E28951N3881K772l5182l1990j7472p412J8657K9157M6157L8402L2n1916
11105E74037M950L0538o341P97Q618L2043M324M261l0118k3731q116O858K5826
11092F23946N0664Q960k3421L68K326J808O4989o759l5339J166L3995K6440J6902
$$ plain form
11177 640109 609533 621080 596221 585666 579815 628532 675953 698668 741159 791493 768807 776326
11165 776326 819740 824547 827933 802786 754231 721383 675284 666872 648075 644399 671290 691978
11153 691978 626422 583880 582170 586542 602396 590067 574871 566092 591680 632398 603675 612549
11141 612549 631559 627137 601994 590810 606317 607383 558489 552322 550052 600669 626251 580830
11129 580830 570208 596432 587751 619080 632737 666676 714430 681465 574727 497792 501400 528951
11117 528951 582832 585604 550422 518432 500960 493548 512205 541362 587519 625921 625953 574037
11105 574037 578987 609525 603184 603981 612599 644642 648966 653227 623109 599378 591262 598120 623946
11092 623946 674610 683570 660149 660517 662843 664651 729640 722881 687542 688708 722703 749143 766045
11079G66045j6579m8240K7412R622l0380J1881K2052r153L015L9625L1343O900
11067H13543l0735K106J4162o131l6836j1409k4712J1269m647j8330k0145J6815
11055G04950M9723M7969J547P243L2545R0129L2368L4117m144J0267M2669O533
11043A055916m9164j7935J3149K2335j7822J9104n5713l6069n8983n5632m9202
11032G69984o7064j8786o3800R598O7125L2172N5543J50435J38796Q1771K9903
11021A185677K0895k5252n5967o7949j368M1750M8551K601N0664N6292O0061q260
11009A307695p136k0592p8765O924j936o191J7291M2085L7715L7454J851k3291
10997A313104j8801p495J6744j8729l2219J0523j1999M3117Q1944L0001L1948
$$ plain form
11079 766045 749466 701226 728638 738260 707880 719761 741813 732660 735675 775300 806643 813543
11067 813543 782808 784914 799076 792945 756109 744700 719988 731257 726610 708280 688135 704950
11055 704950 754673 802642 804189 811432 843977 934106 966474 1000591 996447 1006714 1049383 1055916
11043 1055916 1006752 988817 1001966 1024301 1006479 1025583 969870 933801 874818 819186 769984
11032 769984 702920 684134 620334 629932 697057 729229 784772 935207 1074003 1155774 1185677
11021 1185677 1206572 1181320 1125353 1057404 1056036 1097786 1146337 1148938 1199602 1255894 1315955 1307695
11009 1307695 1300559 1279967 1201202 1208126 1206190 1199999 1217290 1259375 1297090 1334544 1336395 1313104
10997 1313104 1294303 1286808 1303552 1284823 1252604 1263127 1251128 1294245 1376189 1406190 1438138
10986A438138K8876k467L9941M8592N4307M2342O5397M7540M2264R0508P7117
10975A972555M7598L9937M1267R7413P5463N5473O4105R6244Q5372P5522Q7166
10964B738115O9001O6252M6938N9074J06990J15706J08924J24894J35699J78985
10954C750578J90029K01452J98837J79566J98032K47198K54484K89561K96179
10945E805916K83204L55994M53937M96703N69951P05859Q29417R39856J050960
10936A1491797J161415J216300J303293J482504J688847J963209K303228K682983
10928B5293576L170370L833285M758546N937837P599829R805237J2773125J6748482
10920H9920287K1906823K7961154L4490199M0138227M3021198M1644707L6320436
$$ plain form
10986 1438138 1467014 1464547 1504488 1553080 1607387 1649729 1715126 1762666 1804930 1895438 1972555
10975 1972555 2020153 2060090 2101357 2198770 2274233 2329706 2393811 2490055 2575427 2650949 2738115
10964 2738115 2807116 2873368 2920306 2979380 3086370 3202076 3311000 3435894 3571593 3750578
10954 3750578 3940607 4142059 4340896 4520462 4718494 4965692 5220176 5509737 5805916
10945 5805916 6089120 6445114 6899051 7395754 7965705 8671564 9500981 10440837 11491797
10936 11491797 12653212 13869512 15172805 16655309 18344156 20307365 22610593 25293576
10928 25293576 28463946 32297231 37055777 42993614 50593443 60398680 73171805 89920287
10920 89920287 111827110 139788264 174278463 214416690 257437888 299082595 335403031
10913C35403031K8217299J8483235O917630p264137k3139437l8289933m9116007
10906B71211681n2580008m8586555l9790110k9962082k1544616j5384656j1182655
10899E2180999q325987o400117n062521m029986l281235k605965k170297j814111
10891A8490780j556959j315727j114652r97630r23316r25360r42843r47905q37703
10882H928685p07761o14718n72105m97960l94791l48864l74763l01003k71929
10873D844791k58250k34056k20453k05531k27231j58344j43665j27096j15201
10864C154964j36684j66067j25135j14190j30085q9817p5875r8322o8253j0060
10854B140476k3233r3149q7876o4956l5445m0558l8425n0510k2196l4696l3606
$$ plain form
10913 335403031 363620330 382103565 389021195 381757058 358617621 320327688 271211681
10906 271211681 218631673 170045118 130255008 100292926 78748310 63363654 52180999
10899 52180999 43855012 37454895 32392374 28362388 25081153 22475188 20304891 18490780
10891 18490780 16933821 15618094 14503442 13505812 12582496 11657136 10714293 9766388 8928685
10882 8928685 8220924 7606206 7034101 6536141 6141350 5792486 5417723 5116720 4844791
10873 4844791 4586541 4352485 4132032 3926501 3699270 3540926 3397261 3270165 3154964
10864 3154964 3018280 2852213 2727078 2612888 2482803 2392986 2317111 2218789 2150536 2140476
10854 2140476 2117243 2024094 1936218 1871262 1835817 1795259 1756834 1706324 1684128 1649432 1615826
10843A615826l2354j5049j008j1454k4213k2861k6545j4550k4530K777l1352p8853
10831A335834o3278k8415l2419m3160r615k7259l2107l3245k6165j3569o420j2906
10819A007276k9673m3127j4568j5665P755m5895j224K1372K639j1114n5108o1641
10807G61027o951M8498L1559K4465k3037k3203L8504L4168L8158N4538j2314J6496
10795I81908O573R553O0138O1190K0316J9503q948j5292o9995n5958l2675l1005
10783I45308q3578p3590m2491n0833p5432n5653Q197k636k3791L093O3738M9871
10771F62203j9231l8664m2244j9248M8530J6980j3623j4733k7510m3083Q610Q395
10759E26382O361J3977J4563l3513m9650k1976k3041n6753k1139M6976J4065P680
$$ plain form
10843 1615826 1583472 1568423 1567415 1555961 1531748 1508887 1482342 1467792 1443262 1446039 1414687 1335834
10831 1335834 1272556 1244141 1211722 1168562 1158947 1131688 1099581 1066336 1040171 1026602 1020182 1007276
10819 1007276 977603 934476 919908 904243 911998 866103 864879 886251 888890 877776 822668 761027
10807 761027 754076 802574 834133 858598 835561 812358 850862 885030 923188 977726 965412 981908
10795 981908 988481 998034 1058172 1119362 1139678 1159181 1150233 1134941 1064946 1008988 976313 945308
10783 945308 861730 788140 745649 694816 619384 563731 571928 569292 545501 548594 612332 662203
10771 662203 642972 604308 562064 542816 591346 608326 594703 579970 552460 509377 517987 526382
10759 526382 532743 546720 561283 527770 478120 456144 433103 376350 355211 402187 416252 423932
10747D23932K4586K8237j9253J4210o1209r038J6847N4423m3154l6894K6735l4565
10735C84857j725J7630O667J0873q427j1333p248j0989K4631J6340j0522k0964
10723C89790j0883n512N8793k481l9137n8330q282L1642J7001L3389j7872k3874
10711C64244J2103O81j8462p4193r832L7404K7213K4534J8328m5957L392k4726
10699C14729l5350j0152l4100k440P506L3261n898l7582K2781J6135M0533K3750
10687C33173O432l666q668J6367K332J0184J3612L2480J0267L961k6622J411L8300
10674D29563M6532r399R114O3203K1742m87J5871n8222k2036L0724K7915K6089
10662E80609J8911L6512M8519J4932J4805J6152K7603j3376K397L5432j7402L1360
$$ plain form
10747 423932 448518 476755 457502 471712 410503 401465 418312 472735 429581 392687 419422 384857
10735 384857 383132 400762 407429 418302 409875 398542 391294 380305 404936 421276 410754 389790
10723 389790 378907 373395 432188 429707 390570 332240 323958 355600 372601 405990 388118 364244
10711 364244 376347 377028 358566 284373 274541 311945 339158 363692 382020 336063 339455 314729
10699 314729 279379 269227 235127 232687 240193 273454 267556 229974 252755 268890 309423 333173
10687 333173 339605 335939 327271 343638 345970 356154 369766 402246 412513 416474 389852 391263 429563
10674 429563 476095 466696 475810 539013 560755 560268 576139 517917 495881 526605 554520 580609
10662 580609 599520 636032 684551 699483 714288 730440 758043 744667 747064 782496 765094 796454
10650G96454J8875o325O604J2496J2510L0940O0114K0030J7241R0816P9270R0727
10638A229752P1023J12217J68638K08773J90575J59423J66027J31964K08495K26986
10628B873873L08682M54199N96295P92660J101982J460426K076314K814650L547444
10619A6026525M350186M746762M199843K406179J22814j480911j786960r62507
10611B7621931M53552K170887M224893O577067Q647919R572283P871073K951125
10603G0090730k887750o354841o484613m353876j328576J901870N230957Q539057
10595F4352958J1229960J1870304Q458096N83411p901768j2338386j1987767q886455
10587E5380353n200020j718131J399153M124317O011394O120485L294947k125706
$$ plain form
10650 796454 815329 809004 815608 828104 840614 871554 931668 951698 968939 1059755 1139025 1229752
10638 1229752 1300775 1412992 1581630 1790403 1980978 2140401 2306428 2438392 2646887 2873873
10628 2873873 3182555 3636754 4233049 5025709 6127691 7588117 9664431 12479081 16026525
10619 16026525 20376711 25123473 29323316 31729495 31852309 30371398 28584438 27621931
10611 27621931 28075483 30246370 34471263 41048330 49696249 59268532 67139605 70090730
10603 70090730 67202980 60848139 54363526 50009650 48681074 50582944 55813901 64352958
10595 64352958 75582918 87453222 95911318 96494729 88592961 76254575 64266808 55380353
10587 55380353 50180333 48462202 49861355 53985672 59997066 66117551 69412498 67286792
10579F7286792p552184r975947r168980o790561m179400k000663k93461Q97607
10571B8223203J608131J399278O8977k146608m133202m888323m526960l659948
10563A1944548k719186j956403j396938j010559p85309n57552m24542l43548k76610
10554B473901k49783k18482j95100j66773j25861j18263j11460j21410p7495j03127
10544I86147o2827k4455l9096n0060J350l5848l8247o3184l6936J7974j1119K8888
10532F72587L6304m3828j5671L5492k737k0134q4113p041M8729j306l289m0321
10520E74672k5841M1251K0088J037M7228Q0474Q5211J39663J25892J46099J55535
10509A391309J64256J62062J37692J08743R8442P9789K3633J305j12817j84506
$$ plain form
10579 67286792 59734608 49758661 40589681 33799120 29619720 27619057 27325596 28223203
10571 28223203 29831334 31230612 31299589 29152981 25019779 20131456 15604496 11944548
10563 11944548 9225362 7268959 5872021 4861462 4076153 3518601 3094059 2750511 2473901
10554 2473901 2224118 2005636 1810536 1643763 1517902 1399639 1288179 1166769 1089274 986147
10544 986147 923320 898865 859769 809709 811059 775211 736964 673780 636844 654818 643699 672587
10532 672587 708891 665063 649392 684884 682147 662013 577900 570859 619588 618282 614993 574672
10520 574672 548831 590082 610170 611207 658435 738909 824120 963783 1089675 1235774 1391309
10509 1391309 1555565 1717627 1855319 1964062 2062504 2142293 2165926 2167231 2054414 1869908
10499A869908k15208k38044k31770j55020j56973j45983p3957l1040j1821k6051
10489E84041n8999p4155m9111p788M309j7503l75j0341m6842l1057l820K9300
10477C17659L0377M1831j0774l3867J3169J84N04L7474j3160n811j5169K654l5915
10464C29156l8510m9223m9206J755J8323k9712J4200J2566k159J1004j8337j46
10452A99711j5657M9139j4069n9242r097l5317m2347J869O0882O5491J3924k9305
10440A85982k7147P93j5239j4532j3267l5292n098J7827L315k2973Q963J6350
10428I9682l639p483J8858l0700m269N1790K1884J5665j3823n9114o730J3905
10416I6026j2318J0553j301L0501p969J5088L747k5349R688M2780J2273K1259
$$ plain form
10499 1869908 1654700 1416656 1184886 1029866 872893 726910 652953 621913 610092 584041
10489 584041 525042 450887 401776 393988 398297 380794 380419 370078 323236 292179 288359 317659
10477 317659 348036 389867 379093 345226 358395 358579 359083 396557 383397 377586 362417 365071 329156
10464 329156 290646 241423 192217 193972 212295 182583 196783 209349 207190 218194 199857 199711
10452 199711 184054 233193 219124 159882 150785 115468 73121 74990 135872 201363 215287 185982
10440 185982 158835 159628 144389 129857 116590 81298 76200 94027 97342 74369 83332 99682
10428 99682 96043 88560 107418 76718 72449 124239 146123 161788 147965 88851 82121 96026
10416 96026 83708 94261 92960 123461 115492 130580 134327 108978 118666 161446 173719 194978
10404A94978m5801j2737j1305j1967j0173J1084K5794Q633J1394m533k4244J7431
10392A48554j2486m0954j0267R356q166K4314N1928k624j3696m303k8628N082
10380A18110J4295M3903K3234j1783j5405j1919K7927K4731m2502o1697q053m9608
10368E1233k8243K2342K0345L3674M0851K7254j0605j8894p043N527k1719K4940
10356A39662l025p0495J9374P276K5428l5820j1420J9715R490Q455j1755k2155
10344G4730q23J3053N014L7289L221O588L6901j3362l1270k945j7144l0162l1632
10331D9458j629J9398L1405O82L6219O701k7325j8832j1790j8213j088K5853J6129
10318A06968l1262m6208l9559K3610l465j4810j8904O375K2882N007j7330M6103
$$ plain form
10404 194978 149177 136440 125135 113168 102995 114079 139873 148506 159900 155367 131123 148554
10392 148554 136068 95114 84847 94203 86037 110351 162279 159655 145959 141656 113028 118110
10380 118110 132405 176308 199542 187759 172354 160435 188362 213093 170591 108894 100841 51233
10368 51233 22990 45332 65677 99351 140202 167456 156851 137957 130914 136441 114722 139662
10356 139662 136637 66142 85516 92792 118220 82400 70980 90695 100185 108640 96885 74730
10344 74730 73907 86960 91974 129263 132484 139072 175973 162611 131341 128396 111252 81090 49458
10331 49458 47829 67227 98632 99314 135533 142234 114909 96077 84287 66074 64986 90839 106968
10318 106968 75706 29498 -10061 13549 10084 -4726 -23630 -17255 5627 10634 -6696 39407
10306C9407L2085k5502K1464m3857m6720R151K1615Q572N122j712l9296j7213
10294c6884J6874N7809J2089J5908J00K444O655J8969L2464j9903O662J0798l1340
10281I2645o5020j6209N5298J1859M58K2886l665j7380K756N331J2526k0181j6195
10268F5109l0445L1898j3105L082J3869k629K927l1724J481L1652j7095p255j112
10255D6653l7210J9744M4878k5686r971o838q726l1301k1568L6056K3011j1655
10243A7387M0752J3203l2483K3815J6725J4229L6805j5911j6067k3954m887L2755
10231A02369K9259n112m5233k0249K8033j63K70o238k0834r840j005K3247L2435
10218A06939j1064k1302j3144N5048M6923K043j7749j1927K5682k6754m8860k1084
$$ plain form
10306 39407 71492 45990 67454 23597 -23123 -13972 7643 16215 21337 19625 -19671 -36884
10294 -36884 -20010 37799 49888 65796 65896 68340 74995 93964 126428 106525 113187 123985 92645
10281 92645 27625 11416 66714 78573 79031 101917 98252 80872 83628 88959 101485 81304 65109
10268 65109 34664 66562 53457 56539 70408 67779 70706 38982 40463 72115 55020 47765 46653
10255 46653 9443 29187 74065 48379 38408 31570 22844 -8457 -30025 6031 29042 17387
10243 17387 58139 71342 38859 62674 79399 93628 130433 114522 98455 74501 69614 102369
10231 102369 131628 126516 81283 61034 89067 88904 89174 82936 62102 52262 51257 74504 106939
10218 106939 95875 74573 61429 116477 163400 165443 147694 135767 161449 134695 85835 64751
10206F4751k8223K1820L1722m071j8588K4273j3332N733j2843l2282j5642J4355
10194C7673k0471m261j5428j034J4412L3623K3413L0130M6974K4525L1706K0429
10182B21691J9715K0499L3683n6500k9738k495R889J238j5996P779M6322N0062
10170C06149L6086O6886K9389j3986k4058L0303k2905l7956l4141q134O5478M3655
10158D36766P9740O7002k3695M563k5243r1092n2914m3161k0028j4317J3305J7462
10146C48388j2475L0234R632J6872J503l4794n1511o2705o5517l2212M0185N2885
10134B40485J1775n0405Q917R493k3440m6393k9109P911j4800K809P099k0338
10122A04004j5502L283K882o496J7726k2691o3062m2330N525o043K394K6715K4660
$$ plain form
10206 64751 36528 58348 90070 85999 67411 91684 78352 84085 71242 38960 23318 37673
10194 37673 17202 12941 -2487 -3521 10891 44514 67927 98057 145031 169556 201262 221691
10182 221691 241406 261905 295588 239088 209350 206855 216744 217982 201986 209765 256087 306149
10170 306149 342235 409121 438510 424524 400466 430769 407864 369908 335767 327633 393111 436766
10158 436766 516506 583508 559813 564376 539133 448041 395127 351966 331938 317621 330926 348388
10146 348388 335913 366147 375779 392651 394154 359360 307849 245144 179627 147415 187600 240485
10134 240485 252260 201855 210772 220265 196825 150432 121323 129234 114434 117243 124342 104004
10122 104004 88502 91785 94667 88171 105897 83206 20144 -22186 -16661 -22704 -20310 6405 31065
10109C1065J3622L7015j3819j3536m5463j4242j5211J8546J2467l9094P572l931
10097b5009L1481N4875M4143M544r301m1711Q045Q010k0293j1143K9150J8030
10085I0821n718n890k1146l3007k7256k9026K3579L102J4093j0406L1386M251
10073C4783J2607K3082j2150j0387J6513j528L3099j5464M528r7k0455k432O495
10060F8594P563j6459k9607K0082K2614k9164l8504K0585J5662P336p418L2842
10048G4126o649R452m693R231m0561n7846k0111Q699M1833J6745J1077k7728j4105
10035e30L5449R240k2685l8864K4562J2982k7449L000J557k465K4127K6022K0548
10022F5494m554l2794k9025O07J042J9822j5895j0406J3815L6877k915j3230l5926
$$ plain form
10109 31065 44687 81702 67883 54347 8884 -5358 -20569 -2023 10444 -28650 -21078 -25009
10097 -25009 6472 61347 105490 110034 100733 59022 67067 75077 54784 43641 72791 90821
10085 90821 85103 79213 58067 25060 -2196 -31222 -7643 -4541 9552 -854 30532 34783
10073 34783 47390 70472 58322 47935 64448 62920 96019 80555 85083 84986 64531 62099 68594
10060 68594 76157 59698 30091 50173 72787 43623 5119 25704 41366 48702 41284 74126
10048 74126 67477 76929 72236 81467 40906 -16940 -37051 -28352 13481 30226 41303 13575 -530
10035 -530 34919 44159 21474 -17390 7172 20154 -7295 -4295 -2738 -5203 18924 44946 65494
10022 65494 60940 28146 -879 -272 770 20592 4697 -5709 8106 44983 42068 28838 -7088
10009g088J4550J0947P069L8107m992O41K6567L780k165p328m1711l3083Q700
9996A3994K7779P743J4708J6520l050k3907m1395K8504J258j9372L0859K2849
9984G6490K500M705N628k0985j2322l5861j8864M9699m499m008j1548p163Q610
9971C2382o552l4979K321r384L372L8147M1124J696m3049k1976K407K2476K4541
9958E2526M3921M8317r562M132m1820l8168K28N513L5626L82k6090j4309j7720
9945D2976j7409m0917k656O30j8552K0306K1897k5439n035L4175P9059K3451j5967
9932I6519k2789k4269j9970j1717k6187l6134K5072N5168K3805P26k855j1862
9920D5507j9548l0140q243P048K8796M474j8490K5584l8088l890L7060k1962J0326
$$ plain form
10009 -7088 7462 18409 25478 63585 58593 59234 85801 89581 87416 80088 38377 5294 13994
9996 13994 41773 49516 64224 80744 77694 53787 12392 40896 42154 22782 53641 76490
9984 76490 78990 83695 89323 68338 56016 20155 1291 50990 46491 42483 30935 23772 32382
9971 32382 25830 -9149 -6828 -16212 -12840 25307 66431 68127 25078 3102 5509 27985 52526
9958 52526 96447 144764 135202 139334 97514 59346 59574 65087 100713 101095 75005 60696 42976
9945 42976 25567 -15350 -18006 -17376 -35928 -15622 6275 -19164 -24199 9976 89035 112486 96519
9932 96519 73730 49461 29491 17774 -8413 -44547 -19475 35693 59498 60224 57369 45507
9920 45507 25959 -4181 -12424 -5376 23420 27894 9404 34988 -3100 -6990 30070 8108 18434
9907A8434j8692k5206K6979n469j7983K1391Q474K518O506K5830N0741J0881k9480
9894G4924o915o048j4105j2223k4136J2304M670R866L2514l4547r289K3235J2054
9881F2304m448O704m0078j0453L5576K0820n73J4316j9342J943K7837P79k8746
9868F6639k3253k0198j62k1167J0831k9653Q866J9512J1438n688k7286O51j547
9855a1017k2776j0944K9259j1523L6495K2083j1061k4158L305K0521r784m2924
9843c2524J5838K3516J8857K3135j034l25k3081k7014K0622J7379p210l2868l304
9830h013M3779l862O567l1415k0362J9389K3440L9885k1614j3879M2355j2540
9818F3730K2114n0715n0682l0209N971M5399k556j683P150l498L1643M2704R239
$$ plain form
9907 18434 -258 -25464 1515 -3954 -21937 -546 7928 10446 16952 42782 93523 104404 74924
9894 74924 68009 61961 47856 35633 11497 23801 28471 38337 70851 36304 27015 50250 62304
9881 62304 57856 64560 24482 14029 49605 70425 69852 84168 64826 66769 94606 95385 66639
9868 66639 43386 23188 23026 1859 12690 -16963 -8097 11415 22853 17165 -10121 -9470 -11017
9855 -11017 -33793 -44737 -15478 -27001 9494 31577 20516 -3642 -337 20184 10400 -32524
9843 -32524 -16686 6830 25687 48822 47788 47463 24382 -2632 17990 35369 28159 -4709 -8013
9830 -8013 35766 31904 38471 7056 -13306 6083 29523 69408 47794 33915 76270 63730
9818 63730 85844 35129 -15553 -45762 -39791 5608 3052 1369 8519 5021 36664 79368 88607
9805H8607m7378l0706J0269J6295l8998l8473L4456L2622n199K0357L1288l9482
9793C3658J0987M9822k1756J5005k3598m689J782L1930O975k2126k64K919k9024
9780E1621j1328k5113n252j5139K3413O530M890j0103Q839K1985J5905k2014r572
9767C4662j5509j0143k3696K3536K1218P7Q57j2926k7839l3343P322Q473M4484
9754A7173j9576k1708J080K5841k3901J0966M4058K550k2229J8112l7495j6900
9742b2029J1288O0187L1794m4039j4594K027j2561l753K89J2519O407j8715n9880
9729e1060J9116O8640K7412P368m2926j5187J929k4379j7308m316L2372K26L704
9716E591J03M8153P967q451j2776k2173k1529j0679K6341J0359j9559m099J772
$$ plain form
9805 88607 41229 10523 20792 37087 -1911 -40384 -5928 26694 21495 41852 73140 33658
9793 33658 44645 94467 72711 87716 64118 59429 61211 93141 100116 77990 77726 80645 51621
9780 51621 40293 15180 9928 -5211 18202 24732 29622 19519 28358 50343 66248 44234 34662
9767 34662 19153 9010 -14686 8850 30068 30145 31002 18076 -9763 -43106 -35784 -27311 17173
9754 17173 -2403 -24111 -23031 2810 -21091 -10125 33933 36483 14254 32366 -5129 -22029
9742 -22029 -10741 49446 81240 37201 22607 24634 12073 8320 8609 21128 27535 8820 -51060
9729 -51060 -31944 36696 64108 71476 28550 13363 15292 -9087 -26395 -30711 1661 1887 5591
9716 5591 5694 53847 61814 53363 40587 18414 -3115 -13794 12547 22906 3347 -752 1020
9703A020L0257K3814j6476q360K3711J9099j7738j5623q013P471j6334l5927n7026
9690g0125J118K5389Q698L8039P717k6131N7605L9758K2186j9765O985o970m7515
9677C6989k3680K0814L7722n788r804P942p65n766j6084j4426Q913N859K0047
9664F1973l1809l2113K1770L2652M1967K234J4942R7062J53458J90454K11822
9653G64412J27206r4349k54917k05539j04217n3496P382n1395n1765J6416M937
9642A04675j3560k8016n122p552j0966l4409j335j91K1805J4160J9462l6233K392
9629B5110N5282l464m8839J9537N8237K3878j4225j1666j7435J0849k2052r502
9617F5710K103Q944n2578l1011L2951J0165j7546l5309L3525L1621n3542J5545
$$ plain form
9703 1020 31277 55091 38615 30255 53966 73065 55327 39704 31691 39162 22828 -13099 -70125
9690 -70125 -69007 -43618 -34920 3119 10836 -15295 42310 82068 104254 84489 91474 84504 36989
9677 36989 13309 34123 71845 66057 56253 64195 63430 57664 41580 27154 36067 41926 61973
9664 61973 30164 -1949 19821 52473 94440 96674 111616 208678 362136 552590 764412
9653 764412 891618 797269 542352 336813 232596 179100 186482 135087 83322 99738 104675
9642 104675 91115 63099 57977 50425 39459 5050 3715 3524 25329 39489 58951 22718 25110
9629 25110 80392 76928 28089 47626 105863 129741 115516 103850 86415 97264 75212 65710
9617 65710 67813 76757 24179 -6832 26119 36284 18738 -16571 16954 48575 -4967 10578
9605A0578K0631J190k2054L2440k6798K7704K875q219m9475j8036J1100J6010
9593b054J3137K8972j8032k8009P205M6848j3076M678J5586l5553k4668J932K1907
9580A8873K5900m649k251p773k4211p671j7998k2528j628k3795K871L0050j4864
9567d9674j5929J2218m830J637J450M5866N3691K8052n123j8944l204J3192k0149
9554C8253l933o092j5415K5035j8468j0076J4216L2780L2035j750Q629k7040L335
9541G1509J9395l5848j1781l2137k4412K8577M9821P829j2686j8566l0988j2200
9529a487l3532q39L4459j8482K4631M2067j052L4K2547k1319J6567n3519k9893
9516a9818K6539m5541N828J637L7626R118j059j01q416K6909O387j055K5740n388
$$ plain form
9605 10578 31209 32399 10345 42785 15987 43691 46566 38347 -11128 -29164 -18064 -2054
9593 -2054 11083 40055 22023 -5986 1219 48067 34991 39669 55255 19702 -4966 -3034 18873
9580 18873 44773 40124 37873 30100 5889 -1782 -19780 -42308 -43936 -67731 -64860 -34810 -49674
9567 -49674 -65603 -53385 -58215 -56578 -55128 -9262 44429 72481 67358 48414 45210 58402 38253
9554 38253 34320 28228 12813 37848 19380 9304 23520 56300 88335 86585 95214 68174 71509
9541 71509 90904 55056 43275 11138 -13274 15303 65124 72953 60267 41701 10713 -1487
9529 -1487 -35019 -35858 -1399 -19881 4750 46817 45765 45799 68346 47027 63594 10075 -19818
9516 -19818 6721 -38820 -32992 -31355 6271 15389 14330 14229 5813 32722 39109 38054 63794 58406
9502E8406j4163j4834Q248o482r311J3626K5819j4806n906j8352m4856j3877k33
9489c6721n813k7541M539J8705K1667J9349K3067K1265J3684j0041m8382L673
9477b549J8566r436R23J3082j8676k5162P627M627P477J1956j6822m303K9861
9464A7171M0523J0402l4366m9744k1742J0666J6717J940L9537L6694k0957k9429
9452A7412J2384K9395Q505j8102j6742L6636Q657n0969m3211k1458m372J5020
9440b6845J048K0985k708K0332J7674K5100L5590k1979j680J4805J9394N111m2944
9427F3883q068J8656n982o726J2754r002k4428L431L088k7832n3425j1855K5263
9414b0243N748k0316J019k417L045L2542K3213n570Q096L564m610j6997n8410
$$ plain form
9502 58406 44243 29409 37657 31175 21864 35490 61309 46503 40597 22245 -22611 -36488 -36721
9489 -36721 -42534 -70075 -65536 -46831 -25164 -5815 17252 38517 52201 42160 -6222 -2549
9477 -2549 16017 6581 7504 20586 1910 -23252 -15625 -10998 -3521 8435 -8387 -12690 17171
9464 17171 57694 68096 33730 -16014 -37756 -27090 -10373 -8433 31104 67798 46841 17412
9452 17412 29796 59191 67696 49594 32852 69488 78145 27176 -16035 -37493 -41865 -26845
9440 -26845 -25797 -4812 -7520 12812 30486 55586 91176 69197 67517 82322 101716 106827 63883
9427 63883 55815 74471 68489 61763 74517 65515 41087 44518 47606 19774 -33651 -45506 -20243
9414 -20243 -14495 -34811 -33792 -36209 -33164 -622 22591 17021 25117 28681 24071 7074 -51336
9401e1336O095O172J7628j5146N1602K0702m4014J83m108j6616L7787l645j0502
9388e198J7423k7233n6397l4653M1399O3094l922l9418L6194M7127j6224l447
9376A8745J1707K3409K9236K0485L6284n6396n3405j7154Q027k4519L6374M5596
9364G8389l9304j1078r174m2492k8327L4389l923n007J5972M4193j5282j7695
9352F61L1892l2279k9467L1347M781k2552O158j4230L896j6556N9386R186k9928
9339B295m8153M5310Q507k8242K2973K9118K1717k4878l1073q126Q69j3623O854
9326a6452J1219P452k1393J1650P239K2438k4436M790K6734k4174j6885R853q208
9313a0173m609J0229j1511j7400j6286j6763K2938K5913K0215q141J6750L6546
$$ plain form
9401 -51336 -45241 -39069 -21441 -36587 15015 35717 -8297 -8114 -12222 -28838 8949 5304 -5198
9388 -5198 12225 -15008 -71405 -106058 -64659 -1565 -5487 -44905 -8711 38416 22192 18745
9376 18745 30452 53861 83097 103582 139866 83470 30065 12911 20938 -3581 32793 78389
9364 78389 39085 28007 18833 -23659 -51986 -17597 -21520 -26527 -10555 33638 18356 661
9352 661 32553 274 -29193 2154 6935 -15617 -9459 -23689 -19793 -36349 23037 32223 2295
9339 2295 -45858 -548 7959 -20283 2690 31808 53525 28647 -2426 -10552 -9683 -23306 -16452
9326 -16452 -5233 2219 -19174 -7524 -285 22153 -2283 2507 29241 5067 -11818 -1965 -10173
9313 -10173 -14782 -4553 -16064 -33464 -49750 -66513 -43575 -17662 2553 -5588 11162 47708
9301D7708r288n0556k6730l375m369Q214K6789j942Q032k4963k456L0261K7239
9288B4564l1447l4816K5253L013j1279M2959O723k1696J5109K3179J8983J7551
9276G8096k2350m1224K804K5074l9711n4426O751L6307k0305j2661K1708O084
9264a3853J3523N290l0490j5398k0757j056N6676O4462p371p2337j3704J0556
9252b4459J9701M0377p097j9707l0510k959K9640J8007l5758p087j0166m3932
9240g3950M275O263L0583K9213L5387J9714l4792l3225j6089J7535K5937j471
9228I380K4725k9110l9360j2632P413K6357J540J75k5987p544K8026L2580o219
9215I344j4789j675m1430o43J6482L5964P9028J7001l4770n1003l6930J6101j5625
$$ plain form
9301 47708 38420 -12136 -38866 -42241 -46610 -38396 -11607 -13549 -5517 -30480 -32936 -2675 24564
9288 24564 -6883 -41699 -16446 -13433 -24712 18247 24970 3274 18383 41562 60545 78096
9276 78096 55746 14522 17326 42400 2689 -51737 -44986 -8679 -28984 -41645 -19937 -13853
9264 -13853 -330 4960 -25530 -40928 -61685 -62741 -6065 58397 51026 -21311 -35015 -24459
9252 -24459 -4758 35619 28522 8815 -21695 -24654 4986 22993 -12765 -19852 -30018 -73950
9240 -73950 -69675 -63412 -32829 -3616 31771 51485 16693 -16532 -32621 -15086 10851 9380
9228 9380 34105 4995 -34365 -46997 -39584 -13227 -11687 -11512 -37499 -45043 -17017 15563 9344
9215 9344 -5445 -7120 -48550 -49193 -32711 3253 82281 99282 64512 13509 -23421 -7320 -22945
9202b2945n470l4644p026L2921J7196k5134J9732K2139N0564o148j7574P638q305
9189B2944n014L419k7922J5441M458j5433q721r168k4107J9172O0063J3261k1310
9176B7083J598J791k0200k2201o1534j208m558M352J2344J1289n342J2897j2294
9163e5983M24J8155J3104J4118j3574k6974J3872L3440m346k8457R038m1193j8355
9150h6731N3406M6356R832M783L154J6031n0146l0591R567L0462J3280k5187m5817
9137e1601l093J1878M769N316m064m437r348j3988O474M6417K6081j3316k0708
9124a9620p485l4969l571L5813J793L7100K6667M8415J0026L7952o6036o9592
9112c507r094M7957J1217m4886n3413J0141N2596J5751R469N3533P861k4253n2979
$$ plain form
9202 -22945 -28415 -63059 -70085 -37164 -19968 -45102 -25370 -3231 47333 41185 23611 31249 22944
9189 22944 17930 21349 -6573 8868 13326 -2107 -10828 -19996 -44103 -24931 35132 48393 27083
9176 27083 28681 30472 10272 -11929 -73463 -74671 -79229 -74877 -62533 -51244 -56586 -43689 -55983
9163 -55983 -55559 -37404 -24300 -10182 -23756 -50730 -36858 -3418 -7764 -36221 -27183 -68376 -86731
9150 -86731 -33325 13031 22863 27646 30800 46831 -3315 -33906 -24339 6123 19403 -5784 -51601
9137 -51601 -54694 -42816 -38047 -32731 -36795 -41232 -50580 -64568 -58094 -11677 14404 1088 -19620
9124 -19620 -27105 -62074 -65645 -29832 -28039 9061 35728 84143 94169 132121 66085 -3507
9112 -3507 -12601 35356 46573 1687 -51726 -41585 11011 26762 36231 89764 97625 73372 20393
9099B0393K9773n436m5896n7918j2584N2934k4244K158K0400K5695j3390K144
9087e971J6024L0883j4376J3767M1587o624k0800p408J525k5575M994k3145n8698
9074e3817l603M1346k8568k1506J0061O3884J2844j3987J2097j17j5248l1966
9062b8580J594J5496K6653K164M352J6250K982l0665o9908o818M3958M4294N027
9049B6799o141J675j7179m3914m6201M5266L5498L2649j5594l0755k9828k3029
9037g0754L7517J6650L341K3043j214l9817m9414J7606M5843O416o987k8375l1442
9024g7587O897N266J3862J235K1662j876n007J2314j214J0846j3875j5482k9710
9011g2669j4426J8474K4202N9860j0872l0991M3037P000n8649j4017J2502M486
$$ plain form
9099 20393 50166 44730 -1166 -59084 -71668 -18734 -42978 -40820 -20420 5275 -8115 -5971
9087 -5971 10053 40936 26560 40327 81914 75290 54490 47082 48607 23032 28026 4881 -53817
9074 -53817 -57420 -16074 -44642 -66148 -56087 7797 20641 6654 18751 18634 3386 -28580
9062 -28580 -26986 -11490 15163 17327 21679 37929 40911 10246 -59662 -66480 -22522 21772 26799
9049 26799 20658 22333 5154 -38760 -84961 -39695 -4197 28452 12858 -17897 -47725 -70754
9037 -70754 -33237 -16587 -13246 9797 8583 -31234 -80648 -63042 -17199 -10783 -17770 -46145 -77587
9024 -77587 -70690 -65424 -51562 -50327 -28665 -30541 -35548 -23234 -24448 -13602 -27477 -42959 -72669
9011 -72669 -87095 -68621 -44419 15441 4569 -26422 16615 23615 -35034 -49051 -36549 -32063
8999c2063J6609r181k417L1670n4p233N41P731J0570n640J198K6272O2659j1139
8985H9523m2988m6487J0959L308K8356k1797J4265j9477K639l2697j2142O2334
8973C5796P030l7557l6130l5367k4515L5833J9559K2784L7264M915j9354M754
8961A5012J7602m0155m8396R67M2586K8208K4018L3073j1404m7406j3148M9801
8949E0758M1731K1907k1347o9481J6582J4923K3219O928J9291p2791m0132j4322
8937b2734k914J5679L79k8731J7480J1791p358q247L6711J6636J2058J1672J7398
8924F9820j9984l9297j740j1890k4071J3389J6497J2213L2984R28j6647n7491
8912b5289k8852N1689Q463K6724j1006P240K6144P078j4225k6354l0663J3819
$$ plain form
8999 -32063 -15454 -24635 -27052 4618 4564 -2669 -2128 5603 16173 10533 11731 38003 100662 89523
8985 89523 46535 48 11007 14315 42671 20874 35139 15662 18301 -14396 -26538 35796
8973 35796 42826 5269 -30861 -66228 -90743 -54910 -35351 -12567 24697 29612 10258 15012
8961 15012 32614 -7541 -55937 -54970 -12384 15824 39842 72915 61511 14105 957 50758
8949 50758 92489 114396 93049 23568 40150 55073 78292 85220 104511 31720 -8412 -22734
8937 -22734 -25648 -9969 -9590 -38321 -20841 -9050 -16408 -24655 12056 28692 40750 52422 69820
8924 69820 49836 10539 8799 -3091 -27162 -13773 2724 14937 47921 48849 32202 -25289
8912 -25289 -54141 -2452 6011 32735 21729 28969 55113 62191 47966 21612 -9051 4768
8900D768M242j9478L7669M515L2244J4085k6191J9754j1085m8909l6387J6747
8888h026O3756j6613J069j5825j7373K8027n974k4766P744q430l3234k8762L9242
8875a9165q903J6007N081K729m279N1973M7138l7107j5576j036K7089l192l1000
8862B9759k5603j5527j5568J38l857L3745K3631K6070k6209r557K2066q95k1729
8849A6464q46K4750k9409j3726r605M707L5403R951j1605n6703j864M5594J2817
8836B5928p001j27j0336j927n445J1908J9203L167N038j4204l2385l4028k5828
8823f6037J9875N4993L0096K4381l3482m0390L0488J2028J6400p111k8271j3625
8811f55K8717K3850j6398J8135l250N626K2404J1684p74l7620K2853j8349l9748
$$ plain form
8900 4768 9010 -10468 27201 31716 63960 78045 51854 71608 60523 11614 -24773 -8026
8888 -8026 55730 39117 40186 24361 6988 35015 29041 4275 12019 3589 -29645 -58407 -19165
8875 -19165 -28068 -12061 -6980 -4251 -8530 43443 90581 53474 37898 36862 63951 60759 29759
8862 29759 4156 -11371 -26939 -26801 -30658 3087 26718 52788 26579 17022 39088 38193 16464
8849 16464 15618 40368 10959 -2767 -12372 -7665 27738 37689 26084 -30619 -32483 13111 25928
8836 25928 18927 18800 8464 6537 1092 13000 32203 35370 40408 26204 -6181 -40209 -66037
8823 -66037 -46162 8831 38927 63308 29826 -10564 19924 31952 48352 41241 12970 -655
8811 -655 28062 51912 35514 53649 50399 56025 78429 90113 89339 51719 74572 56223 16475
8798A6475k8975K2902J3858j5230L7391Q421m2442L71j9734J492J9399L3796l0861
8785A6863l2306J2496L8164l3686k0410K4978N1380K1847j4392j453o639j1684
8773D5158k7052K1474L4515Q952n4055R829M2469J134k0273l2988j8542N084R936
8760B5641J7584j0646j5471L3014m8034j7351J3572j7416k0131K1965L9718j3502
8748H943k8558j8848o206K7324K9131R873k6572L305L0082k462j3168M2845m369
8735E1320l8006k2594K31J7428j4054J7147J8823N562j5479M140q948l533R036
8722B1073J3612k0126l2194J9423K7917k2251n145m5929J7342L6487J0624L1565
8710E2398m788j4004j585K0389L1147k1498j28l0470l7453o156L5150P4004J3453
$$ plain form
8798 16475 -12500 10402 24260 9030 46421 54842 12400 12771 -6963 -5471 13928 47724 16863
8785 16863 -15443 -2947 35217 1531 -18879 6099 57479 79326 64934 63481 56842 45158
8773 45158 18106 39580 74095 83047 28992 38821 81290 82424 62151 29163 10621 15705 25641
8760 25641 43225 32579 17108 50122 2088 -15263 -1691 -19107 -39238 -17273 22445 8943
8748 8943 -19615 -38463 -44669 -17345 11786 21659 -4913 -1608 28474 26012 12844 55689 51320
8735 51320 13314 -9280 -9049 8379 -5675 11472 30295 35857 20378 24518 15570 12037 21073
8722 21073 34685 14559 -17635 1788 29705 7454 2309 -43620 -26278 10209 20833 52398
8710 52398 47610 33606 32021 52410 83557 62059 61931 31461 -5992 -12148 23002 97006 110459
8697A10459j3393l6641J6425l9477k5111k2711L2683j0579J2199M4267K0395m1868
8685D6648k4468p834J9926k2312J3542J4513n3657M562K2677j8554l2282L328
8673c3911M3530M9463O314k6899k3339J5487K6139J0551j213J2774n517j8044
8661E5335k3493l3437o348N450k228K5644l3316l6576j0218M3827J7032j5365
8649a3693j0991M8560M7231k8255j366k1390r925J4086M7709M731l0016J5499
8637F2180P439n3126m8738k2193K1342M6929J6397n8581L7133L9718k4205N929
8625C0224k5020J6098L1711O677j6149j2892j9464k5784j6555l6045M0691J3037
8613a3471l0107q288o903N2767L4448J8601k6117J1854R839K3441j9640n39L3906
$$ plain form
8697 110459 97066 60425 76850 37373 12262 -10449 22234 11655 23854 68121 88516 46648
8685 46648 22180 14346 34272 11960 25502 40015 -13642 -9080 13597 -4957 -37239 -33911
8673 -33911 9619 59082 65396 38497 15158 30645 56784 67335 66122 78896 73379 55335
8661 55335 31842 -1595 -7943 -2493 -4721 20923 -12393 -48969 -59187 -15360 1672 -13693
8649 -13693 -24684 23876 71107 42852 41486 20096 10171 24257 71966 76697 46681 62180
8637 62180 69619 16493 -32245 -54438 -33096 13833 30230 -28351 8782 48500 24295 30224
8625 30224 5204 21302 53013 59690 43541 30649 11185 -14599 -31154 -67199 -26508 -13471
8613 -13471 -43578 -51866 -58769 -6002 28446 47047 20930 32784 42623 66064 46424 45885 79791
8600G9791m684K9083o204m3168j0217K6952o618M508o3038N458j832k0327M749
8587e547l54P263K8005j6441l7563q453k767k02J5775J5630k105O4263K0137j3469
8573F4172K0890m096j5793l5305k7628M834L8011j5721n2374L387L651j9318m4916
8560h0206k413M6377M0867j7285j0853J3918M7325K0870r547j3124N142o282M080
8547C8869k4408O365j763n4544l6206m767J4942P8732L1910l1240j8626J1492
8535A0756p958L1088J344J5906J5102K074P231k6243n3734n674J3991K474j2717
8522f360m615J1505n288J2130k6667L8057J7572R225m3076m9696P612K5135K6976
8509A2510J715J9636l8419j783J3592J4351J0898k4691m2607k8672J7797K7558
$$ plain form
8600 79791 75107 104190 97986 54818 44601 71553 64935 69443 6405 11863 10031 -10296 -5547
8587 -5547 -5901 1362 29367 12926 -24637 -33090 -35857 -36059 -20284 -4654 -6759 57504 77641 64172
8573 64172 85062 80966 65173 29868 2240 7074 45085 29364 -23010 -19623 -15972 -35290 -80206
8560 -80206 -82619 -36242 4625 -12660 -23513 -9595 37730 58600 49053 35929 41071 34789 38869
8547 38869 14461 20826 19063 -35481 -71687 -76454 -61512 17220 49130 17890 -736 10756
8535 10756 2798 33886 35230 51136 66238 68312 75543 49300 -4434 -10108 3883 6357 -6360
8522 -6360 -10975 530 -4758 7372 -19295 18762 36334 45559 2483 -47213 -39601 -14466 12510
8509 12510 14225 33861 -4558 -6341 7251 21602 32500 7809 -34798 -63470 -45673 -18115
8497a8115j3699M785J8492j1839J6971K7751j2606j6611K7878K2229k941K4055
8485F6350M137J2375n899k073R921l7981l6329m5274J8831L4861K132k777l8581
8472b0307J6392L5372j4580J3506j4624n7857q05M7055L0151L9487J5209k7638
8460F1361l753k2017l8079n2742j5233L7751K5065J0769L7592K0193J4898j3856
8448F1949J8856K5921R181o4405k0556j3048J9405J8509j0586k5897k5470K4059
8436A7918J6535j6658m7034j5664L2555K7274J1487K2892M393Q062J0840J824
8424G4424J7762k8667j8960l1047M282l728J2473M201L0773j1639k1766j5687
8412A2421k6926k336N4249k354k9848j1345L5028J1218J541K9650j1324j1830
$$ plain form
8497 -18115 -31814 -27029 -8537 -20376 -3405 24346 11740 -4871 23007 45236 42295 66350
8485 66350 70487 82862 76963 74890 84811 46830 10501 -34773 -15942 18919 21051 18274 -20307
8472 -20307 -3915 31457 16877 30383 15759 -42098 -42903 4152 34303 73790 88999 61361
8460 61361 57608 35591 -2488 -55230 -70463 -32712 -7647 3122 40714 60907 75805 61949
8448 61949 80805 106726 115907 51502 30946 17898 37303 55812 45226 19329 -6141 17918
8436 17918 34453 17795 -29239 -44903 -12348 14926 26413 49305 53698 61760 72600 74424
8424 74424 92186 63519 44559 13512 17794 14066 26539 30740 61513 49874 28108 12421
8412 12421 -14505 -16841 37408 35054 5206 -6139 28889 40107 41648 71298 59974 48144
8400D8144J8154K06p229m4401l4254j8392l207R81J9140j3688K0166M6043P6563
8387A08226J2822O274j4496n2812J6447M47N800K6179L2977J6976l8185k1637
8375I9018O274p056k1693L892Q568m2222l8274K813M2403J4263j4127m3956N830
8362A5733K8263K9120L8678K7000l7884m3992j0631j1785J7512M6365l7544k4837
8350C5998J0538R493P685J5369l697m7979j4781R473K483j928J5511O1326M576
8337A04067K487j6788j1572l4940J2587K5696r442Q491j3951l273Q648R452m958
8324G6504K8994L1494p61l6866q439j144j2326J2261n2174l6396M0859P8043m018
8311A16031l0584o482n973M858K7146N30l3714l2796M395N598J5208K3874o655
$$ plain form
8400 48144 66298 66504 59275 14874 -19380 -37772 -40979 -39998 -20858 -34546 -14380 31663 108226
8387 108226 121048 127322 112826 60014 76461 76908 82708 108887 141864 158840 120655 99018
8375 99018 105292 98236 76543 80435 89003 46781 8507 11320 53723 67986 53859 9903 15733
8362 15733 43996 73116 111794 138794 100910 56918 46287 34502 52014 98379 60835 35998
8350 35998 46536 56029 63714 79083 75386 27407 12626 22099 24582 22654 38165 99491 104067
8337 104067 106554 89766 78194 43254 55841 81537 72095 80586 66635 63362 72010 81462 76504
8324 76504 105498 136992 136231 99365 90926 89782 77456 89717 37543 1147 42006 120049 116031
8311 116031 85447 78965 72992 77850 104996 105526 71812 39016 43411 49009 64217 88091 81436
8298H1436l4510O217L1936k2499O336m931j1220N04J7795K1483K6919k7526l1061
8285F0879Q431L5167M0227k3346k7198l0553o3598o980P1521J7809l0410K3963
8273G5912J0687R226k8687L6427O7364Q442Q005k4830k8973m879m052L665j5434
8260A12873R88j7911K1840Q834m325j6910l388k5079j9501Q105N986k260Q475
8247G7727O7878J3157n533o987o2486j6217p072K1366L2341M8217q484j3332k0563
8234A20012k5596j2486O955K1974J0446k7849R024K023n1174n4587k200k6273
8222b9731k1734N6460P6984K8531k0500m84p050M9018N436o902j3626l5168k5773
8209E5461j979k0529K5819K9137k7765k8601Q017K5252j1149l2902N0884N0531
$$ plain form
8298 81436 46926 53143 85079 62580 68916 63985 52765 53269 71064 92547 119466 91940 60879
8285 60879 69310 104477 144704 121358 94160 63607 9 -6971 64550 82359 51949 75912
8273 75912 86599 95825 67138 103565 170929 179371 187376 162546 133573 128694 124642 128307 112873
8260 112873 113861 95950 117790 126624 122299 105389 102001 76922 57421 65526 71512 69252 77727
8247 77727 145605 158762 153229 146242 83756 67539 60467 81833 114174 162391 153907 140575 120012
8234 120012 94416 81930 88885 110859 121305 93456 102480 104503 53329 -1258 -3458 -29731
8222 -29731 -51465 4995 81979 110510 90010 89526 82476 131494 136930 130028 116402 81234 55461
8209 55461 53482 32953 58772 87909 60144 31543 39560 64812 53663 20761 71645 122176
8197A22176m6259n8057Q084J7250n737L1506L2522J9002L1208j6648j4147K1549
8185A42449j5901q619k4043k0006J522J1064M75l026k7459j856K6636k9448l4274
8172A7514m977N034p534J2434K7994K8418M7928l8154p0683l5287J5987M0634
8160C9308M5614j9043k9805k5847J7141k9411k0840k1635K0595J6170N7742N344
8148E5333K393J4115k2926L9184J8840k7535k5793N126J7584m659K8850r551j8270
8135G2691k7391M629J0847J8188P042j8254k0536l5094P635n156q782N896k746
8122H969M0482K8223J4051q030l8980n1973l299M754m230K0034R6K2099L6282
8109F8478q325k5075J94L652P72J1456k1013P088j0227j0408K2255M6571p991
$$ plain form
8197 122176 75917 17860 25944 43194 37457 68963 101485 120487 151695 135047 120900 142449
8185 142449 126548 117929 93886 73880 75402 86466 86941 83915 56456 54600 81236 51788 17514
8172 17514 12537 17571 10037 22471 50465 78883 126811 88657 17974 -17313 -1326 39308
8160 39308 84922 65879 36074 10227 27368 -2043 -22883 -44518 -23923 -7753 49989 55333
8148 55333 57726 71841 48915 88099 106939 79404 53611 58737 76321 71662 100512 90961 72691
8135 72691 45300 49929 60776 78964 86006 67752 47216 12122 19757 14601 5819 11715 8969
8122 8969 49451 77674 91725 83695 44715 -7258 -10557 -5803 -10033 10001 10097 32196 68478
8109 68478 60153 35078 35272 38924 39696 51152 30139 37227 27000 16592 38847 85418 77427
8096G7427p463j9886J510R961J6134l3759k8978L6141L0222k6511n5885k0477
8084b1564l1781L0582L8586J4208l474m0016K4003L9167L6558j2072m1350K0629
8072E3476L8230N333m1413m9883J5166r445j5563j2972L4235m768P632K529q463
8059A4094m2922J3641L0011J9651j656j2012R584j2167j4623K1674K468k5987
8047A756k5641L9459M4730J213k0829k7245J6123p34k691K9966K3440J534m0491
8034D0590k7357J6792K0040k9671j2934J5065p07j2738L3453l5504K447l167k2066
8021a5757j7657L4463O710k7964J6160J3280R857j5512j1582j2156M100J9524
8009C466o284r489Q593q176r398j4340j0986J4017p169J1723K5547N4763J6413
$$ plain form
8096 77427 69964 50078 51588 61549 77683 43924 14946 51087 81309 54798 -1087 -21564
8084 -21564 -53345 -22763 15823 30031 26557 -13459 10544 49711 86269 74197 32847 53476
8072 53476 91706 97039 55626 5743 20909 11464 -4099 -17071 17164 12396 20028 22557 14094
8059 14094 -28828 -15187 14824 34475 32819 20807 30391 18224 3601 25275 27743 1756
8047 1756 -23885 15574 60304 61517 40688 13443 29566 28832 26141 56107 79547 81081 40590
8034 40590 13233 30025 50065 20394 7460 22525 21818 9080 42533 7029 9476 6309 -15757
8021 -15757 -33414 1049 7759 -20205 -4045 9235 19092 3580 -8002 -20158 -16058 3466
8009 3466 -2818 -12307 -3714 -11890 -21288 -35628 -46614 -32597 -39766 -28043 -2496 52267 68680
7996F8680l0592k0306j4061j4878J7745k0320O847l671L413L5084K0659j7265
7984C1335m5236L337o796L2544J8935m8418m320J4788j3092l9896j6644Q843L4492
7971c0128K8499j3225k9010K6727J9486j4129L3974L2196l6573L598k7233O911
7959A093P093j6147o840r593J6567M6771m2551O014m226j6342K5406M2498J6549
7946F6292r172j2349k6485n052M389K4244j3149k9478L1120J4275O456k9697O945
7933B8339j3675P011n0038j3720N767J7609P101J148k4587N409L9169O915R095
7920B5543k5491l6769m491k7373p148j3100P996O0935K7944o9635m6119M2719
7908f4989N2477j2581p067j4518l9424L4925L4045K8100J1442k3474l3211j7391
$$ plain form
7996 68680 38088 17782 3721 -11157 6588 -13732 -6885 -10556 -7143 27941 48600 31335
7984 31335 -13901 -10564 -17360 15184 34119 -14299 -18619 -3831 -16923 -56819 -73463 -64620 -30128
7971 -30128 -1629 -14854 -43864 -17137 2349 -11780 22194 54390 17817 21415 -5818 1093
7959 1093 8186 -7961 -14801 -24394 -7827 38944 -3607 2407 -1819 -18161 7245 49743 66292
7946 66292 57120 44771 18286 13234 17623 41867 28718 -760 30360 44635 51091 21394 28339
7933 28339 14664 21675 -28363 -42083 -36316 -18707 -11606 -10458 -35045 -29636 9533 16448 25543
7920 25543 52 -36717 -41208 -68581 -75729 -88829 -80833 -19898 8046 -61589 -107708 -64989
7908 -64989 -12512 -25093 -32160 -46678 -86102 -51177 -17132 10968 22410 -1064 -34275 -51666
7896e1666J0617l7225L16M0878K9349m1818J7739M290M478K0272j626K4944L0482
7883E1030J6109j5332k8286K990L3185J1717p2711l0040M1720K6355J6792m3858
7871I671l937l746J2815j4953J2620J2433J8201k3067J9104K8870o622L051j3206
7858E1234m4436o0222k3226J8708L2081M6472K4167n5290k4692n911j2004K6848
7846b6271r042K3131J9925k4834K1090J8790l9852j9438K3772N373L5129J9726
7834D7499Q703j4380k9844K2197k086j5587k2393j2529p71l04j1965o6179O329
7821i1310J6942L2092j0821p3408n824K480L9030P3070K9793L888j013j4328J0471
7808A1062k4355o244j0615k4611j6342j0291L7135L7373M1140l99m5256n1414
$$ plain form
7896 -51666 -41049 -78274 -77958 -37080 -7731 -49549 -31810 -27520 -23042 -2770 -4396 20548 51030
7883 51030 67139 51807 23521 26511 59696 71413 -1298 -31338 10382 36737 53529 9671
7871 9671 5734 1988 14803 -150 12470 24903 43104 20037 39141 68011 61389 64440 51234
7858 51234 6798 -53424 -76650 -57942 -25861 20611 44778 -10512 -35204 -41115 -53119 -26271
7846 -26271 -35313 -12182 7743 -17091 3999 22789 -17063 -36501 -12729 -7356 27773 47499
7834 47499 56202 41822 11978 34175 32089 16502 -5891 -18420 -19191 -19495 -31460 -97639 -91310
7821 -91310 -74368 -42276 -53097 -126505 -132329 -129849 -90819 -17749 12044 15932 14919 591 11062
7808 11062 -13293 -19537 -30152 -54763 -71105 -81396 -44261 -6888 34252 33853 -11403 -62817
7796f2817m4881L8666P7956L7824j3930k3499J014Q087j9603l9177P2278J6035
7784D7953j708k5130k7354K4753L9269m5225o0812m027N8038M0046m2981l4750
7772c1928P184J7251l1408j0891j500P634J5063j1674M4533o552j5766k8675O746
7759c9983L8679L0170l7878k2419J9749L8844N742j9957l0236k2763J0405K8322
7747a325L1151j2769o5099k9225J6593O970J2561k2879n005L7391k671j634K1983
7734a3958j0958j7425k3226l557L8786j5400j0084M7752M1617m330q918k77O816
7721B6838l5354q842J655o032k8407j0544K5383K3477K3999j9431j4175K4584
7709C151M5688M793k0845j8472j7686P903r052J3107k594k1987j2721j3358O824
$$ plain form
7796 -62817 -107698 -69032 8924 46748 32818 9319 10333 18420 -1183 -40360 31918 47953
7784 47953 46245 21115 -6239 18514 57783 12558 -48254 -52281 5757 45803 2822 -31928
7772 -31928 -24744 -7493 -38901 -49792 -51292 -43658 -28595 -40269 4264 -2288 -18054 -46729 -39983
7759 -39983 -1304 28866 -9012 -31431 -11682 27162 32904 12947 -17289 -40052 -29647 -1325
7747 -1325 29826 17057 -48042 -77267 -60674 -53704 -41143 -64022 -69027 -31636 -34307 -35941 -13958
7734 -13958 -24916 -42341 -65567 -69124 -30338 -45738 -55822 -8070 33547 29217 20299 20022 26838
7721 26838 -8516 -17358 -15703 -21735 -50142 -60686 -35303 -11826 12173 -7258 -21433 3151
7709 3151 48839 53632 32787 14315 -3371 4532 -4520 8587 5993 -15994 -28715 -42073 -35249
7696c5249l064M099J5459M2440J7672K5101j4196l9963k1233L7133N0087P105
7684H5391l1974j8458o4277l7192P8894J0066Q064j5643L1922J7066k2642j7646
7672B3571r44l3782O630R894j8265o325n558j884j6079J7589L9634q769l9820
7659c4108j0813K5154J0873K6882j5091l7725j3139k3516L1778J4280J5169L3792
7647B3536L2934j2675N027k1114m1475L7277L3813L2392J4625p1606o4213K8629
7635b850K9284J765j3750R607K3876j1646n0192j9496R089m0235k2132L5600M9292
7622a788L5131k5363m7428J1892J0534J5953J047l0571k2154K0874N1998k4908
7610d783q802J2184M860k4850J8955K6917M6123J7026j9190n0868n8275Q388L0780
$$ plain form
7696 -35249 -38313 -34214 -18755 23685 41357 66458 52262 12299 -8934 28199 78286 85391
7684 85391 53417 34959 -29318 -66510 12384 22450 30514 14871 46793 63859 41217 23571
7672 23571 22627 -11155 -4525 5369 -12896 -19221 -24779 -26663 -42742 -25153 14481 5712 -34108
7659 -34108 -44921 -19767 -8894 17988 2897 -34828 -47967 -71483 -39705 -25425 -10256 23536
7647 23536 56470 43795 48822 27708 -13767 23510 57323 89715 104340 32734 -31479 -2850
7635 -2850 26434 28199 14449 24056 47932 36286 -13906 -33402 -24313 -64548 -86680 -51080 -1788
7622 -1788 33343 7980 -39448 -27556 -17022 -1069 -22 -30593 -52747 -31873 20125 -4783
7610 -4783 -13585 -1401 3459 -21391 -2436 24481 70604 87630 68440 17572 -40703 -32315 -1535
7597a535k0647k9733K4470k241j193J2457l9789k2627q899J9670M2934L424k1853
7584d5562k1825K0920L1421J1599M7725K2496K2271m5026l8712K3039M3647O849
7572G8842l6230q817r349j8569J0594j1290K5846j6541n0891L7153J6727j1186
7560F289P1173r125l4484l183J5442j3152k8376j2382J3411n6107j7863K4005
7548d4352L6102j4500L6535q838o1464j5030n273O695K2490J2843j942K6829Q723
7535a182k4007Q627k763k2251K0151k1908j5437N7447K3593j9533j4511O972k4594
7522b9396j3386k824P160j8062K32K4952J9994J6165K0096j3471j4525l7977K5786
7509a5256M9094J754Q535q709l6842l5712q786l2277M453J0261k2327J591J8609
$$ plain form
7597 -1535 -22182 -51915 -27445 -29686 -30879 -18422 -58211 -80838 -89737 -70067 -27133 -23709 -45562
7584 -45562 -67387 -46467 -15046 -3447 44278 66774 89045 44019 5307 28346 71993 78842
7572 78842 42612 33795 24446 5877 16471 5181 31027 14486 -36405 748 17475 6289
7560 6289 77462 68337 33853 30670 46112 32960 4584 -7798 5613 -50494 -68357 -44352
7548 -44352 -8250 -22750 13785 4947 -56517 -71547 -76820 -70125 -47635 -34792 -36734 -9905 -1182
7535 -1182 -25189 -16562 -19325 -41576 -21425 -43333 -58770 -1323 22270 2737 -11774 -4802 -29396
7522 -29396 -42782 -45606 -38446 -56508 -56276 -31324 -11330 4835 24931 11460 -3065 -41042 -15256
7509 -15256 33838 35592 44127 35418 -1424 -37136 -45922 -78199 -73746 -63485 -85812 -84221 -65612
7496f5612R626K3745L1149q414j8117n4295j793L3725K3569l9747K9982J4234
7484b1948j5645j5757M0996J0935j1760J6366K1646K5761r012l0570l3547j633
7472b4168J0308M5120q291K1799k0088m7180j4653K9394L0276Q984k5810l116
7460B575r501r223j4301J3430K7142J3660K370l8381j26o792l552l1793k6534
7447h1026P335M2942Q027J0069k0911j5504M1099j3130n364K0848L603j3173J6690
7434A505O624J0371K1598L8721j4739j9088Q30R809L1512j4659r0309k0630N5027
7421A6572J9456j0117N698J5688l0245q5574o424K5415M9547l3661o9342P132
7409i5855O5110j3158j9343K089R689K5476L9652N5809K540j1424m2107k8786
$$ plain form
7496 -65612 -55986 -32241 -1092 -9506 -27623 -81918 -83711 -49986 -26417 -66164 -36182 -21948
7484 -21948 -37593 -53350 -12354 -1419 -13179 3187 24833 50594 41582 11012 -22535 -24168
7472 -24168 -13860 31260 22969 44768 24680 -22500 -37153 -7759 22517 31501 5691 2575
7460 2575 -6926 -16149 -30450 -17020 10122 23782 26152 -12229 -12355 -19147 -22699 -54492 -81026
7447 -81026 -73691 -30749 -22722 -12653 -33564 -49068 -7969 -21099 -26463 -5615 -2012 -15185 1505
7434 1505 8129 18500 40098 78819 64080 44992 45822 55631 87143 72484 -17825 -38455 16572
7421 16572 36028 25911 31609 47297 17052 -68522 -74946 -49531 16 -33645 -102987 -95855
7409 -95855 -30745 -43903 -63246 -61157 -51468 -25992 13660 69469 72009 60585 18478 -10308
7397a0308K1954L382j3906j6118m0203l9601R814J973k707K9512O2670R407j2927
7384B942l927j3480J6089r50j3190J3599J6280j0622J9332J1751k2930O515L555
7371B4964l4832o1010n690M2697j255M152k7575R559P694K6674J4773j4659l5281
7358d9789l0994K188Q11l110J2062Q910K8956R169j8771k4369L7099O888J5590
7345e360j5818M5325L3049k622n4176l1103m0107l2K5321J1270j9136J9195K9642
7332d552j452j9171K9346m887L80l5971l189r522J5343L8471L1177K9622R160
7319G4755M303j1118m7806n4381L5894M4463j7476m3154m3476L9631J1838J1943
7307E416K2897J8343O964m8775j1714J5633M0453J9025j282n3641j4774L069m8934
$$ plain form
7397 -10308 11646 15028 1122 -14996 -55199 -94800 -84986 -83013 -85720 -56208 6462 15869 2942
7384 2942 -985 -14465 1624 674 -12516 1083 17363 6741 26073 37824 14894 21409 24964
7371 24964 -9868 -70878 -76568 -33871 -35126 -30974 -58549 -48990 -41296 -14622 151 -14508 -49789
7358 -49789 -80783 -78595 -77784 -80894 -68832 -59922 -30966 -21797 -40568 -64937 -27838 -20950 -5360
7345 -5360 -21178 24147 57196 54574 398 -30705 -70812 -70844 -45523 -34253 -53389 -34194 -4552
7332 -4552 -6004 -25175 4171 -716 -336 -36307 -39496 -49018 -33675 4796 35973 65595 74755
7319 74755 79058 67940 20134 -34247 1647 46110 28634 -14520 -57996 -18365 -6527 5416
7307 5416 28313 46656 53620 4845 -6869 8764 49217 68242 66960 13319 -1455 1614 -47320
7294d7320l0910K5926N5352O75R864j473k3793k9592L4254L1529l387j7361j2181
7281h417l8100j0049J3702k7348o592L3316l5687M366L5904K9693L16P057j8814
7268b0653j6522j5472j3872k4368J7859L0914o956l5863J0253L456j8100K065
7256h7259k9687R055N4752L7667M8521R819m4939J36j2109l1722j4536m919k332
7243f7553K7349J9418j0689p229J7372J5466n045R847r955J2854j3762K2747j366
7230I454j1124l9605J316O049L9097l669j4303l035n5647N982L1948K841M5463
7217A4767m7q720R022j5718k3394L404j9249j2234L879K8652M5591L174k8189
7204I38j6677Q053J3077N074r445l3939j6964K8900J8821l2686l7855k0935J9245
$$ plain form
7294 -47320 -78230 -52304 3048 3723 13587 12114 -11679 -41271 -7017 24512 21125 3764 -8417
7281 -8417 -46517 -56566 -42864 -70212 -76804 -43488 -79175 -74809 -38905 -9212 -8896 -1839 -20653
7268 -20653 -37175 -52647 -66519 -90887 -73028 -42114 -49070 -84933 -74680 -71224 -89324 -87259
7256 -87259 -116946 -107891 -53139 -15472 33049 42868 -2071 -1935 -14044 -45766 -60302 -65221 -67553
7243 -67553 -40204 -20786 -31475 -38704 -21332 -5866 -10911 -1064 -11019 1835 -11927 10820 9454
7230 9454 -1670 -41275 -39959 -33910 5187 1518 -12785 -15820 -71467 -65485 -33537 -30696 14767
7217 14767 14720 6000 15022 -696 -24090 -20686 -39935 -52169 -48290 -19638 25953 29127 938
7204 938 -15739 -7686 5391 10465 1020 -32919 -49883 -20983 -2162 -34848 -72703 -93638 -74393
7191g4393J1656j620l6814O299L0040M9325N6772p413k6926k0077l3739k1340
7179f8230k2570K1753J1316l493q241J9843K295P905K162R896j1569K9828O591
7166b514l149l9632j7832j4320k1997J9605O0830k776m2122m7634j4461L6902
7154h9100N2970k7922L8392L8818k6746l3401%J5152K6609J5711m3178k8248L7105
7141b3838J4454l244l687k1600j2881o091L6421L1097l3210j2831m7180L560J4108
7128f4922N7948M779j0821P378K1943L1502p227l3218j5068Q162r063J6768j9391
7115a1230k5879p569K8458j4229J1446M3791o795J1061m7118m2054m328R422k0189
7102g5213P521M2298M093n2963J5705K3033J1689l202J4221J7501k9002o4510
$$ plain form
7191 -74393 -62737 -64357 -101171 -94872 -64832 -15507 41265 33852 6926 -13151 -46890 -68230
7179 -68230 -90800 -69047 -57731 -61224 -69465 -49622 -47327 -39422 -37260 -27364 -38933 -9105 -2514
7166 -2514 -5663 -45295 -63127 -77447 -99444 -79839 -19009 -21785 -63907 -111541 -126002 -89100
7154 -89100 -36130 -64052 -25660 13158 -13588 -46989 -46989 -31837 -5228 10483 -32695 -60943 -23838
7141 -23838 -9384 -12628 -16315 -37915 -50796 -56887 -20466 10631 -22579 -35410 -82590 -79030 -64922
7128 -64922 -6974 -2195 -13016 -5638 16305 47807 40580 7362 -7706 456 -8607 8161 -11230
7115 -11230 -37109 -44678 -16220 -30449 -19003 24788 17993 29054 -18064 -60118 -64446 -55024 -75213
7102 -75213 -67692 -25394 -21301 -74264 -58559 -35526 -23837 -27039 -12818 4683 -24319 -88829
7090h8829q681K8185N3865L0443j4251Q270L1851j8133p360L8135k5764m6437
7078a8706K0434j992K8110J6344J1485m7580l2773j8880L040J2089J998L4067
7066G636M991l8424l8500K3k2726J1743k436l011L033J0443j1460n161q983J670
7052i1162n256m780P4478N6604K4314l1179n8942j5945J2242j7794K6727k7J6270
7039a4450L099m605O265Q890J94l6810o446k100l341N5791M8332r634L1348j2352
7025F4181k8254N818J3368j0890j7766m137k3439M0974m725L876k3411j463r183
7012D949m654j0225j0891j4053J2353K1853j3663J1881n1225K7293K8485n6506
7000e4403j2665j088M5626J969j9600k6828J8892O0489p523Q056l1528m3667J471
$$ plain form
7090 -88829 -97510 -69325 -15460 14983 732 9002 40853 22720 15360 53495 27731 -18706
7078 -18706 1728 -264 27846 44190 55675 8095 -24678 -43558 -40518 -28429 -26431 7636
7066 7636 12627 -25797 -64297 -64274 -87000 -75257 -77693 -80704 -77671 -67228 -78688 -83849 -92832 -91162
7052 -91162 -96418 -101198 -26720 29884 54198 23019 -35923 -51868 -39626 -57420 -30693 -30720 -14450
7039 -14450 -11351 -15956 -9691 -801 -607 -37417 -43863 -45963 -49304 6487 54819 45185 76533 64181
7025 64181 35927 41745 55113 44223 26457 22320 -1119 39855 35130 39006 15595 14132 4949
7012 4949 295 -9930 -20821 -34874 -22521 -668 -14331 -2450 -53675 -26382 2103 -54403
7000 -54403 -67068 -68156 -22530 -20561 -40161 -66989 -48097 12392 4869 12925 -18603 -62270 -60799
6987f0799n1568k6405K4472K1732M842K0899M4856L8662J4094L301k4932k3235
6975a4081J392j3338J8809q857j4228j3297L333n2911J8332L1450j0748j033O865
6962d8312J499J1916J4203q172N1998L4038m2654m0751k5693P861l0530K0469
6950e4128r853m8031k0740P652q65J7625M1056P679P442K0929j5258J9614K3566
6937c312P622R002k4593L550k3825m2458P607J2752K824k1420O344K6091j5527
6924e5343K7962M6174L6010o1277l2178K4291L6646K5004k5497m4248k7465M04
6912d9517J3031j503L8811L8254j5761J146K1691o646j914n902n6024k9435l453
6899e7222j7895J1012j6227N856J3975k994M2841M68J9801L3809J1821k3102m254
$$ plain form
6987 -60799 -112367 -138772 -114300 -92568 -87726 -66827 -21971 16691 30785 34086 9154 -14081
6975 -14081 -12689 -26027 -7218 -16075 -30303 -43600 -40267 -93178 -74846 -43396 -54144 -55177 -48312
6962 -48312 -46813 -34897 -20694 -28866 23132 57170 14516 -26235 -51928 -44067 -74597 -54128
6950 -54128 -63981 -112012 -132752 -125100 -125965 -108340 -67284 -59605 -52163 -31234 -46492 -26878 -3312
6937 -3312 4310 13312 -11281 -7731 -31556 -74014 -66407 -53655 -50831 -72251 -65907 -39816 -55343
6924 -55343 -27381 18793 54803 -6474 -38652 -14361 22285 47289 21792 -22456 -49921 -49517
6912 -49517 -36486 -37989 822 39076 23315 24461 46152 39506 37592 31690 -24334 -53769 -57222
6899 -57222 -75117 -64105 -80332 -74476 -60501 -63495 -20654 -20186 -385 33424 45245 22143 17889
6886A7889j2108k9447K9316M080J5000q492j4278p16N807Q443J8599m1042j2103
6873a9052k0383Q020N1965k9987P305L197R384K2367K3964o6130n5394k6488K5114
6860f6118M4442J1668L4386P0001k8003n7377k5284n136L9064l5955n8520L009
6848g3823K5748J3210J1150l0052J2415J5975J3651O952k0756k3506J0861K9673
6836h502N0219q108k0979l1481n595k1468N707K2131M7769K0030l0656l86j0464
6823H217l1664j4623N864j2938K5068k604k7216m1645L5810J2386J9200L804l7564
6810e7905p071J9294k2148j4903k8539K1348N1791j41l9404J7679K1716N187L166
6797b9930j2562k2197r903J2623J6823M065j168j8829r197J1576K3135M856K2532
$$ plain form
6886 17889 5781 -23666 5650 9730 24730 16238 1960 1244 7051 15494 34093 -6949 -19052
6873 -19052 -39435 -31415 20550 -9437 -2132 1065 10449 32816 56780 -9350 -64744 -91232 -66118
6860 -66118 -21676 -10008 24378 94379 66376 8999 -16285 -21421 17643 -18312 -76832 -73823
6848 -73823 -48075 -34865 -23715 -53767 -41352 -25377 -11726 -4774 -25530 -49036 -38175 -8502
6836 -8502 41717 33609 12630 -18851 -24446 -45914 -40207 -18076 29693 49723 19067 18681 8217
6823 8217 -23447 -38070 -32206 -45144 -20076 -22680 -49896 -91541 -55731 -43345 -24145 -20341 -57905
6810 -57905 -64976 -45682 -67830 -82733 -111272 -89924 -38133 -38274 -77678 -59999 -38283 -33096 -29930
6797 -29930 -42492 -64689 -74592 -61969 -45146 -41081 -42249 -61078 -70275 -58699 -35564 -30708 -8176
6784h176M301k3455j4121k10k2763J5235J4366k5293j671K3949L7167L9812j5996
6771B3145l4393J5366J724l0685J0748k5059J3296K099L4212n8750l0550K6867
6759e1980M5572M4081J912M230k7279j4300n755j194j2076j6804J4326L2867m7214
6746c3614m0741J3643N5112j0026m3120P02k456K8211j3634j0763N332k3185N5
6733g4484J9039J3731J5617J6403L6062M9373j8031k3872j9769o945K8751L1867
6721F7742l0034r0596N784P060O857j5590L7023j55j0255O432J0307j2269l1831
6708d9525k1733L311m982k3149L068K2504L1157O2727m6702j9390R211J4824L401
6695a5278k6497L542M949m312M6329L6309l0554o584K3276J160n152l8266l6216
$$ plain form
6784 -8176 -3875 -27330 -41451 -41661 -64424 -49189 -34823 -60116 -61787 -37838 -671 39141 23145
6771 23145 -11248 4118 5842 -24843 -14095 -39154 -25858 -23759 10453 -48297 -78847 -51980
6759 -51980 -6408 37673 39585 43815 16536 2236 -3519 -4713 -16789 -33593 -19267 13600 -33614
6746 -33614 -74355 -60712 -5600 -15626 -58746 -58044 -60500 -32289 -45923 -56686 -51354 -74539 -74484
6733 -74484 -55445 -41714 -26097 -9694 26368 75741 57710 33838 14069 7124 35875 67742
6721 67742 37708 -52888 -47104 -40044 -33187 -48777 -11754 -11909 -22164 -15732 -5425 -17694 -49525
6708 -49525 -71258 -67947 -72929 -96078 -93010 -70506 -39349 23378 -23324 -42714 -33503 -18679 -15278
6695 -15278 -41775 -38233 -33284 -37596 8733 45042 14488 7904 31180 32340 27188 -11078 -47294
6682d7294Q55J1010j7550l5893j5661J4199K7079K8515o249K6766J3228m2143
6670d3138K88l0258N618L0216J9154J3461l4933n082L7034J0959j616r208o5337
6657g2842k1738K6792L1888J5079Q443M415M1826R351j6938l538q875j6550l8672
6644d1359l7123L1822q895l2566l816R722L1994K2008Q1737R814l8327k0448j5513
6631a0950k4763j3245M5659L6973K9452j2784q1062k6089R100J5278N0227K2978
6619D0774R095K818M02r284J8219m492k6181J4587J7351q911k8413j4204M837
6606A6598o219j2019P230m208l4321j365j5687p054K5378j6712Q550N6096m6091
6593b9824l6799M6470j6994l9029K3981j3697l2528K9918L5650R825L5025o543
$$ plain form
6682 -47294 -46439 -35429 -52979 -88872 -104533 -90334 -63255 -34740 -40989 -14223 -995 -43138
6670 -43138 -42850 -73108 -67490 -37274 -18120 -4659 -39592 -44674 -7640 3319 1703 -7505 -72842
6657 -72842 -94580 -67788 -35900 -20821 -12378 -7963 33863 43214 26276 22738 13863 -2687 -41359
6644 -41359 -78482 -46660 -55555 -88121 -91937 -82215 -50221 -28213 53524 63338 25011 4563 -10950
6631 -10950 -35713 -48958 -3299 33674 63126 50342 -30720 -56809 -47709 -32431 17796 40774
6619 40774 49869 52687 53089 43805 62024 57532 31351 45938 63289 54378 25965 11761 16598
6606 16598 10379 -1640 5590 1382 -32939 -34304 -49991 -57045 -31667 -48379 -39829 16267 -29824
6593 -29824 -66623 -20153 -37147 -76176 -52195 -65892 -98420 -68502 -32852 -23027 11998 5455
6581E455l816j2521r561m646q528K7248K7730J3850K2906k4036j0563m7906k4744
6568d9132J4647M37j1360J1320K3315N4798P914l6531n9866k3003l970R744J6311
6555d5376j1333K538m658R640L7528M1551P842j1121l0259p4696L6457J1261J7882
6542a2744m2720p6338Q947N7868P402l2819j1537K2125k447J125K9581J220J8050
6529c2287K6643J7129k9313k33k0830j5184M4332p85n4585o880K5740Q2337J9656
6516E5740l7993n0748r621L1430K0943J1302k3720k9125l905j6650P989K1093
6504b3265k6663k685j6860J9165L769k7725N6055l9175r358j7543j4547K6513
6492g2319Q948N5507J9490m0037k6667J0913L4924l0652m8588j3308L6980L0036
$$ plain form
6581 5455 1639 -10882 -20443 -25089 -33617 -6369 21361 35211 58117 34081 23518 -24388 -49132
6568 -49132 -34485 -34048 -45408 -34088 -10773 44025 51939 15408 -44458 -67461 -71431 -61687 -45376
6555 -45376 -56709 -54171 -58829 -49189 -11661 29890 37732 26611 -3648 -78344 -41887 -30626 -12744
6542 -12744 -55464 -131802 -122855 -64987 -57585 -90404 -101941 -79816 -82263 -81138 -51557 -50337 -32287
6529 -32287 -5644 11485 -17828 -18061 -38891 -54075 -9743 -10528 -65113 -71993 -46253 36084 55740
6516 55740 17747 -33001 -42622 -11192 9751 21053 -2667 -31792 -35697 -52347 -44358 -23265
6504 -23265 -49928 -52613 -69473 -50308 -46539 -74264 -18209 -57384 -66742 -84285 -98832 -72319
6492 -72319 -63371 -7864 11626 -28411 -55078 -44165 -9241 -39893 -88481 -101789 -64809 -34773
6480c4773J4663J1279k3601J6790j4603J4421Q028Q714J3512J5881N747k5659
6468A0399m1970J4275J456j1772L6267k663k0670j2215J5886l2310J9879L6072
6456A2634j8565k3243r501N3714J7788r192j8461j8291l5693L134N025J4961K7301
6443A611m0462l0140M9713J4505k1942j6948m71J5172N000L7145k9555k1000L9446
6430B074M822k1198K802K9848N659k7795l6186m2862k334J1496P698j0990O4936
6417a2030L9610k331l276K7820m6045j9122l1456l3979j0832N457N5202N1480
6405B0498k8308j8855N6993K2485j8162k0477o851j5437k0441l5769l9104j4247
6393a17675J1090M1052J8974k6488M2226M9788j4231J1890j9755l3917p208l1321
$$ plain form
6480 -34773 -20110 -8831 -32432 -15642 -30245 -15824 -7796 918 14430 30311 36058 10399
6468 10399 -31571 -17296 -15840 -27612 8655 5992 -14678 -26893 -11007 -43317 -23438 12634
6456 12634 -5931 -29174 -38675 15039 32827 23635 5174 -13117 -48810 -45676 -40651 -25690 1611
6443 1611 -38851 -68991 -19278 -4773 -26715 -43663 -44134 -28962 -23962 13183 -16372 -37372 2074
6430 2074 6896 -14302 -11500 18348 24007 -3788 -39974 -82836 -85170 -73674 -65976 -76966 -12030
6417 -12030 27580 25249 21973 49793 3748 -15374 -46830 -80809 -91641 -86184 -30982 20498
6405 20498 -7810 -26665 30328 52813 34651 14174 7323 -8114 -28555 -64324 -103428 -117675
6393 -117675 -106585 -65533 -46559 -73047 -30821 18967 4736 16626 -3129 -37046 -44254 -75575
6381g5575O079j0115J6785j1932l6008L3280K8670k7348m826N2245K149l4927
6369f1523R732N3038M7938m314m0326n6495J2911j3153p665l8417k2203N833L3459
6356h1185K2402p863J5161L3479j5634N358J3128J3141j871k587J1906l5863q284
6343c8712K6713j5420l0311k4101J3150J6321j063L4114j0199k7298l0736j466
6331h9008P967J8074M843k7924J8547J3752L903R885j8750K1001J8997l5543m041
6318e8297R817k7505k1844L1732L3211k0241k3726k0828J7397J5858L2342M468
6306b7616k6179j0870M4743j0491M470J2950j6272j2207m238m1628j0326M876
6294i2788K9831K9742j1152K960l774o582j2124J4367j3550J8797O915n541r870
$$ plain form
6381 -75575 -69496 -79611 -62826 -74758 -110766 -77486 -48816 -76164 -80990 -28745 -26596 -61523
6369 -61523 -51791 1247 49185 44871 4545 -51950 -39039 -52192 -59857 -98274 -120477 -114644 -81185
6356 -81185 -58783 -66646 -51485 -18006 -33640 -28282 -15154 -2013 -3884 -6471 5435 -30428 -38712
6343 -38712 -11999 -27419 -57730 -81831 -68681 -52360 -53423 -19309 -29508 -56806 -87542 -89008
6331 -89008 -81041 -62967 -58124 -86048 -67501 -53749 -49846 -39961 -58711 -37710 -18713 -54256 -58297
6318 -58297 -48480 -75985 -97829 -66097 -32886 -53127 -76853 -97681 -80284 -64426 -32084 -27616
6306 -27616 -53795 -64665 -19922 -30413 -25943 -12993 -29265 -41472 -45710 -87338 -97664 -92788
6294 -92788 -62957 -33215 -44367 -41407 -45181 -51763 -63887 -49520 -63070 -44273 -37358 -42899 -52769
6281e2769j27l2541M8694O6675j494k7268M115J0421m0338o788j8240k3437r343
6268h2440L9000O1079O588p906M1647k413n6490l6707r375p804m062M0145J8682
6255e6l2798p1101J1134N6033M2659Q828n939K6040p71J8962m077m8625l3729
6242c3440J8235Q171J8155j3506K7801J7699k2911l3572l7988m285J5934k3322
6230f3029P456P643J2027j531o132N158l730L0248J7143L7708J7581m9704n7477
6217d6639l7384L7464L1064j5188m1764O791J0958L7808K0030m95l0738j5843
6205d3936j5097Q360K065r728j531J0778K7555K7071K182m464P866j5472j1250
6192a5601l8835j1926J810J1252j2951L5900J4009K0906Q882L753k3802J4317
$$ plain form
6281 -52769 -52896 -85437 -36743 29932 28438 1170 5285 15706 -24632 -31420 -49660 -73097 -82440
6268 -82440 -43440 17639 24227 16321 57968 55555 -935 -37642 -47017 -54821 -58883 -18738 -56
6255 -56 -32854 -103955 -92821 -36788 5871 14699 8760 34800 34029 52991 48914 289 -33440
6242 -33440 -15205 -7034 11121 -2385 25416 43115 20204 -13368 -51356 -55641 -39707 -63029
6230 -63029 -55573 -47930 -35903 -37434 -43566 -38408 -42138 -11890 5253 42961 60542 10838 -46639
6217 -46639 -84023 -46559 -15495 -30683 -72447 -65656 -54698 -16890 3140 2645 -28093 -43936
6205 -43936 -59033 -50673 -48608 -58336 -59867 -49089 -21534 5537 7719 3255 11121 -4351 -15601
6192 -15601 -54436 -66362 -64552 -53300 -66251 -30351 -16342 4564 13446 17199 -6603 7714
6180G714j4180K0802n630j7618r823J1164k7126k1915j4476N0723K2171o735m1101
6167d6030J4149j6547j9021P2950q700k0696K1810P612k6659j9483j1553P85j6386
6154f7769J1078N1357N9534q065n5772k6116k7025j6930j9168L0328K0167O419
6142d1962l3301m198K8040K3976J2061J7839L3173l1770r33m5527k4495K2747
6130d4350K2437n712L3j8116N479o346O2202l98R671k4569o816M479L364m8378
6116d7020m355K2678O522j9400j8473L4650L2342J0658j7523R808j0359k1538
6104b2010j670J52L9347K0306n259K4474m7967n8257j4175M0206N4040M9513J4724
6091I3424m2062n8702n29K1916L9650K7941j4053K0399M36q4332l7240k39j0094
$$ plain form
6180 7714 -6466 14336 8706 -8912 -18735 -7571 -34697 -56612 -71088 -20365 1806 -4929 -46030
6167 -46030 -31881 -48428 -67449 5501 -3199 -23895 -2085 5527 -21132 -40615 -52168 -51383 -67769
6154 -67769 -56691 -5334 54200 46135 -9637 -35753 -62778 -79708 -98876 -68548 -48381 -41962
6142 -41962 -75263 -79461 -51421 -27445 -15384 2455 35628 3858 2925 -42602 -67097 -44350
6130 -44350 -21913 -27625 -27592 -45708 -40229 -46575 15627 15229 24900 331 -6485 -2006 1358 -47020
6116 -47020 -51375 -28697 -22175 -41575 -60048 -25398 6944 17602 79 9887 -472 -22010
6104 -22010 -23680 -23528 15819 36125 30866 55340 7373 -50884 -65059 -24853 29187 78700 93424
6091 93424 51362 -7340 -7869 14047 53697 81638 67585 87984 88420 4088 -33152 -33391 -43485
6078d3485J0273N998K3815k8835l1577M9203J0065o8047K3039K4552r119j4319
6066d8437J38J5638O925J7183K6001k0606l0750L7901N066k5591l2155l792j854
6053e4333L1121L0878K6740j2879l7847n5914K3917L3589k5771k357P718O4888
6041B9750L7842l1074n7952m7276p712K8162k5475J6143K3227l3243P814Q351
6029e1443J3744K2822j7644M106J8736r945j1799l1505k5532P977L8453J1004
6017c1026J4206K0875k4906L3125L4476l1296l4772o109n546J5152j3745K3478
6005f088q496O843j865j3798k326j6779k3086J8119l9229Q812K5188M7301L0473
5992B5069J2305l6766o594O4960r082l2789Q104p0p845n4848o3343J8335K8147
$$ plain form
6078 -43485 -33212 -27214 -3399 -32234 -63811 -14608 -4543 -72590 -49551 -24999 -34118 -48437
6066 -48437 -48299 -32661 -25736 -8553 17448 -3158 -33908 3993 9059 -16532 -48687 -52479 -54333
6053 -54333 -23212 7666 34406 21527 -16320 -72234 -48317 -14728 -40499 -42856 -35138 29750
6041 29750 67592 36518 -21434 -68710 -76422 -48260 -73735 -57592 -34365 -67608 -59794 -51443
6029 -51443 -37699 -14877 -32521 -28415 -9679 -19624 -31423 -62928 -88460 -80483 -42030 -31026
6017 -31026 -16820 4055 -20851 12274 46750 15454 -19318 -25427 -30973 -15821 -29566 -6088
6005 -6088 -14584 -7741 -9606 -23404 -25730 -42509 -65595 -47476 -86705 -77893 -52705 -5404 25069
5992 25069 37374 608 -5986 58974 49892 17103 25207 25137 17292 -37556 -100899 -82564 -54417
5979e4417K7322L8591m254k7019J8592j2289m129j5948P845n719l2271J990O8277
5966F571L4350l4791l377j4961L65L4862M01J2458j023J9001O529l1850k4929
5953C606J8834p584k8200k428J8467m776k1237K5511k2040o52L871n1291k198
5940g0117r292L365J7273n786J5005K3711k6468k862l381m262k485J94l946P781
5926f1270J0099K2528K0289N43k1874k554K7800J0297o4148l1945K1876K6757
5914d1602K1265j4698m862O516n852K368K5468O085K681l7705L3753K8366J3120
5901C4903k5982m9738j0459R223j9437l0945m256M3831L5394M1942j6106m6473
5889c8103k6582J0596o050K8998N751l1732l0574K8392L7241J3233l99k1340o373
$$ plain form
5979 -54417 -27095 11496 7242 -19777 -1185 -13474 -17603 -33551 -25706 -31425 -63696 -61706 6571
5966 6571 40921 6130 2753 -12208 -11843 23019 23420 35878 34855 53856 60385 28535 3606
5953 3606 22440 14856 -13344 -15772 2695 -2081 -23318 2193 -19847 -20499 -16628 -67919 -70117
5940 -70117 -79409 -76044 -58771 -64557 -49552 -25841 -52309 -55171 -58552 -62814 -65299 -65105 -69051 -61270
5926 -61270 -51171 -28643 -8354 -7811 -29685 -32239 -4439 5858 -58290 -90235 -68359 -41602
5914 -41602 -20337 -35035 -39897 -33381 -39233 -36865 -11397 -5312 -2631 -40336 -6583 21783 34903
5901 34903 8921 -40817 -51276 -42053 -61490 -92435 -96691 -52860 -17466 24476 8370 -38103
5889 -38103 -64685 -54089 -60139 -31141 -25390 -57122 -87696 -59304 -22063 -8830 -9229 -30569 -36942
5876c6942j6547m5287M408M6491M7732K9593l1969n0125n290K6356J997M1018
5864A1435L7367k0745m5149M801J9373k3547J4597p067l4701j6652R831j919k5448
5851g7824j370L0889K1627L84j5183K9479J1264m4694l7750K1274N0171j4375
5839b6108j1699K2482Q303j2120o228l9544l4919o105J9121K461L7652J131J6225
5826b9348r906k9778J1751K9765O613j6749p478L1380P820m450M7384p709r195
5813B0100p893k7846j3458j6410R701K1072j2077l2830J6473J2569R909K03J3028
5800g459K7288j4463J8643j8814n7920j0414M3138J6911k6208l3570K2470l694
5788d4092m241M5405L5374j4000n3826r931J5946o293L6766r700j5304O001k0894
$$ plain form
5876 -36942 -53489 -98776 -94368 -47877 -145 29448 -2521 -52646 -57936 -31580 -29583 11435
5864 11435 48802 28057 -17092 -12291 7082 -16465 -1868 -8935 -43636 -60288 -50457 -52376 -77824
5851 -77824 -79194 -48305 -26678 -26294 -41477 -11998 -734 -45428 -83178 -61904 -11733 -26108
5839 -26108 -37807 -15325 -7022 -19142 -25370 -64914 -99833 -105938 -86817 -84356 -46704 -45573 -29348
5826 -29348 -39254 -69032 -57281 -27516 -20903 -37652 -45130 -13750 -5930 -10380 37004 29295 20100
5813 20100 12207 -15639 -29097 -45507 -35806 -14734 -26811 -59641 -43168 -30599 -20690 -20487 -7459
5800 -7459 19829 5366 24009 5195 -52725 -63139 -20001 -3090 -29298 -62868 -40398 -44092
5788 -44092 -48333 -2928 32446 18446 -35380 -45311 -29365 -35658 1108 -8592 -23896 -17895 -38789
5775c8789K041J062l2806m3332L708N8797L3462j0359n5083J2668L7298M6400
5763A5067N9205l3375m2892j4142K2902l7131R467J8779J5954N548M946m588j8888
5750H52l5437m4049J7099J0880L0587M0233L4104l1959l5574K097P54J1500l7041
5737c5954l4812L0478O3429K8110k3268j0976m3996r583k8602K306l6529J3823
5725h5574N2228n293j2593L308J4045l0705O721M8395J1413l1762k190l3113O333
5712e8787M2274Q127j0399l7770J6075K1081J9334K8707j169l5791m9427P948
5700d9797J8849K7434J0985p1321Q389K2303M185l5853O080o866k5857r228M5048
5687e5649M5787N0312j9853m7181M030J6932j6524J3741K0793p870o954L088J0945
$$ plain form
5775 -38789 -36748 -35686 -68492 -111824 -108116 -49319 -15857 -26216 -81299 -68631 -31333 15067
5763 15067 74272 40897 -1995 -16137 6765 -30366 -20899 -2120 13834 19382 24328 19740 852
5750 852 -34585 -78634 -61535 -50655 -20068 20165 54269 22310 -13264 -11167 -10413 1087 -35954
5737 -35954 -70766 -40288 23141 51251 27983 17007 -26989 -36572 -65174 -62868 -99397 -85574
5725 -85574 -33346 -38639 -51232 -47924 -33879 -64584 -57863 -9468 1945 -29817 -32007 -65120 -58787
5712 -58787 -16513 -8386 -18785 -56555 -40480 -19399 -65 28642 27473 -8318 -57745 -49797
5700 -49797 -30948 -3514 7471 -63850 -55461 -33158 -28973 -64826 -58746 -65612 -91469 -100697 -55649
5687 -55649 -9862 40450 20597 -26584 -22554 -5622 -22146 -8405 12388 4518 -2436 652 11597
5674A1597j4437L6369l583j1478j8691J44k927K46p853mj244r274o781j0704J0992
5659b7628J9013N881q588K2340l4832j3690M95J1101J3426k6522l0867M1150R2350
5646F3629k6081l1019L0263L1090k6049j4094J6456n343k0797Q006q066l9540
5634b1545k16O0016K7153j3974n4786r449M4248j785k1181q259j3088j4252k2442
5621d9560P927L1339J2454j7601n7476j3653N9693N7539R950m0061j6653j4185
5609c0287k6668N6008M696o0078k7640j68L8523R604J4388J4438k8938j5398Q080
5596d3440L2950J729P839o0377l6204M9555K7562N322j9579R49k7472j1587M0842
5583c1911J1400n266P111R426K2745O3222j1522n4178p2k8404Q307K7501l8110
$$ plain form
5674 11597 -2840 33529 29946 18468 -223 -79 -3006 -2760 -10613 -10617 -11861 -21135 -27916 -38620 -27628
5659 -27628 -8615 -2734 -11322 11018 -23814 -37504 -37009 -25908 -12482 -39004 -69871 -28721 63629
5646 63629 37548 6529 36792 67882 41833 27739 44195 38852 18055 26061 17995 -21545
5634 -21545 -21761 38255 65408 51434 -3352 -12801 31447 29662 8481 222 -12866 -27118 -49560
5621 -49560 -41633 -10294 2160 -15441 -72917 -86570 -26877 30662 40612 551 -16102 -30287
5609 -30287 -56955 -947 3749 -56329 -83969 -84137 -45614 -36010 -21622 -7184 -36122 -51520 -43440
5596 -43440 -10490 -8761 -922 -61299 -97503 -47948 -20386 -15064 -34643 -33694 -61166 -72753 -31911
5583 -31911 -20511 -25777 -18666 -9240 13505 76727 65205 11027 10955 -17449 -9142 18359 -19751
5570a9751m1258j9851l9851k4098N7693K4194k1424K3766k1688L9097n15n501
5558d9187k3591J7364k8013L5208J4984o534O94M7088K0807m8686k2298J6346
5546b5818M6896j1889j0056o422J9303r520m716j5915n468O209k8876j3555k3114
5533h2941J7429j5352j8845L0547L3519J4288n8703k5275r71N095K0757L9545
5521d0907J1173k8328j6724L232L252J846J6471J4208K280m124Q830K3019j980
5508g752j654l2552Q054m005O32m486K1175R640p754J9984m701j0244r733j6154
5494c9550R386j6139K5112n811j1802j2589L9964J9498k51k7358K6089M9037k6600
5481B8986l1732k2030n089o536J6777J0843j7081K1871M494k8169j1767J8228
$$ plain form
5570 -19751 -61009 -80860 -120711 -144809 -87116 -62922 -84346 -60580 -82268 -43171 -43686 -49187
5558 -49187 -72778 -55414 -83427 -48219 -33235 -39769 -39075 8013 28820 -19866 -42164 -25818
5546 -25818 21078 9189 -867 -7289 12014 2494 -2222 -18137 -23605 -17396 -46272 -59827 -82941
5533 -82941 -65512 -80864 -99709 -69162 -35643 -21355 -80058 -105333 -106304 -101209 -80452 -40907
5521 -40907 -29734 -58062 -74786 -71554 -68302 -66456 -49985 -35777 -33497 -37621 -28791 -5772 -7752
5508 -7752 -9406 -41958 -33904 -37909 -37277 -41763 -20588 -10948 -18702 1282 -3419 -13663 -23396 -39550
5494 -39550 -30164 -46303 -21191 -27002 -38804 -51393 -11429 8069 7818 -19540 6549 55586 28986
5481 28986 -2746 -24776 -29865 -36401 -19624 -8781 -25862 -3991 503 -27666 -39433 -21205
5469b1205K0258K948j3893p832K8113N318k9246O141K5373n081m0601J3228P987
5456h492J576L4394M127k6378n052L2362n058J3680P395n7406j9112n308K5959
5443g313k4747l2364j1192N5186M6470l2609j8236k6198k0253j7840J5531l357
5431g6922K7273M1738K0348K6176J5514k3586J1014m6837l4795j4281K8202L0713
5419D557L6680L0240p576q412k3291l1209Q249M948r958p74p97k9887j7236J6249
5405b8217J7434m169O346k8158l9322M852J1474k2147L0671M269j5101r417M2220
5392b9265L0332k6020j269K1803l9080j8617K999p602j7348O3665M1484J2317
5380C3399k2995m2278j7158K8868J6493j1255m6648j7109P216m501L4802Q763
$$ plain form
5469 -21205 -947 2001 -11892 -19724 8389 13707 -15539 -9398 15975 10894 -29707 -16479 -8492
5456 -8492 -6916 27478 31605 5227 175 32537 27479 41159 48554 -8852 -27964 -33272 -7313
5443 -7313 -32060 -64424 -75616 -20430 26040 -6569 -24805 -51003 -71256 -89096 -73565 -76922
5431 -76922 -49649 -7911 12437 38613 54127 30541 41555 -5282 -40077 -54358 -26156 4557
5419 4557 41237 71477 63901 55489 32198 989 9238 14186 4228 3454 2657 -27230 -44466 -28217
5405 -28217 -10783 -14952 -8606 -36764 -76086 -71234 -59760 -81907 -51236 -46967 -62068 -71485 -29265
5392 -29265 1067 -24953 -26222 -4419 -43499 -62116 -59117 -66719 -84067 -20402 21082 33399
5380 33399 10404 -31874 -49032 -20164 -3671 -14926 -61574 -78683 -71467 -75968 -41166 -32403
5368c2403R126O614k556r428k8420k1919K0449L8966K9064K8457l3733j8969N981
5355h771l5814k4075Q939K1384M0330M2135J816n498l5136k9887n691J0527j041
5342b0782O073L3152j3484k5210K0545r913r619j1086j081M2411J1969L0181j9946
5329C3210m5853j8555j3759j9252m94m4139K0854K7916J2548J8969k01L2037k3166
5316a9885k0120J2729J8696J67J6627J8057J3922j2220l2433n2660M798K9420
5304b2902J9824J335r242P206Q235K5249r239l0307o642o571L9612k238k1263
5291f943K1010j8992k8693J3692j5167K5341O1161L896n6475k0420L1553J5759
5279B5722p922m0826j8652M747k1015K3422j4908l6776K4726J8294k0032k335
$$ plain form
5368 -32403 -23277 -16663 -19219 -28647 -57067 -78986 -58537 -19571 9493 37950 4217 -14752 -8771
5355 -8771 -44585 -68660 -59721 -38337 1993 44128 45944 40446 5310 -24577 -30268 -19741 -20782
5342 -20782 -14709 18443 4959 -20251 294 -9619 -19238 -30324 -31405 11006 22975 53156 33210
5329 33210 -12643 -31198 -44957 -64209 -64703 -108842 -87988 -60072 -47524 -28555 -28756 3281 -19885
5316 -19885 -40005 -27276 -8580 -8413 8214 26271 40193 27973 -4460 -57120 -52322 -22902
5304 -22902 -3078 -1743 -10985 -3779 4456 29705 20466 -9841 -16483 -23054 16558 14320 -6943
5291 -6943 14067 -4925 -33618 -19926 -35093 -9752 51409 55305 -1170 -21590 9963 25722
5279 25722 17800 -23026 -41678 -36931 -57946 -34524 -49432 -86208 -61482 -43188 -63220 -65555
5267f5555M5901N1283l889q934k469j3773m6956k3479K0631J9370J5670J8339
5255F139J3352k0373k2619K1810q982k6188K3863L7257l2062j0338L5923K958
5243B0740k1821p618k9672K0919L7571k2810n2658R961L421J7226R934j9132k4240
5230e8179J8272Q791K6718k224k857J0602K758l7133j7411o412M012n848k2517
5217h1428K3408L1564K3339k1922j3182k5876l2194p469L648K011J7596J5526
5205f4979L337K390k578J4702M8868M395J627j8396M025j2327J4560J9877l3020
5192a7519K81J4912k5774j073n4494k9834M0533P5128j5926l3577Q350p833O35
5179d6191J4028l8866Q903P367J2713O0059J3546m7032l6348n7M5732j829l5987
$$ plain form
5267 -65555 -19654 31629 27740 18806 16337 2564 -44392 -67871 -47240 -27870 -12200 6139
5255 6139 19491 -882 -23501 -1691 -10673 -36861 -12998 24259 -7803 -18141 17782 20740
5243 20740 -1081 -8699 -38371 -17452 20119 -2691 -55349 -45388 -41967 -24741 -14807 -33939 -58179
5230 -58179 -39907 -31116 -4398 -6622 -9479 1123 3881 -33252 -50663 -57075 -53063 -58911 -81428
5217 -81428 -58020 -26456 -3117 -25039 -38221 -64097 -96291 -103760 -100112 -98101 -80505 -64979
5205 -64979 -61642 -59252 -61830 -47128 1740 6135 7762 -10634 -6609 -18936 -4376 15501 -17519
5192 -17519 -17238 -2326 -28100 -29173 -83667 -113501 -72968 2160 -13766 -47343 -38993 -46826 -46191
5179 -46191 -32163 -71029 -62126 -54759 -42046 18013 31559 -15473 -51821 -51878 -6146 -7975 -43962
5166d3962L751K2339K5790L1583P128J5277j5317k2771m6806l3916O854J6159
5154c3891l9624J0857K5739p526J9342N2305j610p5841j3990k4726K1082K2174
5142d5709P241n298J3103K0692M4333l499j7590l0844Q263N3k9079l3571j0295
5129h2200K8467K1444k2590m2450K4544J8341L889J9466J5225J3052K156o2900
5117f3556m5237L7327L5299Q311K0394Q1218j824l3364k1826k5384K1170j8638
5105f110l5934r03M8545J9084j8900q668k1235j4658j5758j0812n744j5194j2551
5092i8838K6848M1062J9581Q390M1338M264J377m5954o664M1129j2009j6483M4102
5079D8143L1257j5473J6379j4132o1443n6153j3329N7625K4813K2457r797m064
$$ plain form
5166 -43962 -40211 -17872 7918 39501 46629 61906 46589 23818 -22988 -56904 -50050 -33891
5154 -33891 -73515 -62658 -36919 -44445 -25103 27202 25592 -50249 -64239 -88965 -67883 -45709
5142 -45709 -38468 -43766 -30663 -9971 34362 30863 13273 -17571 -9308 -9255 -38334 -71905 -82200
5129 -82200 -53733 -32289 -54879 -97329 -72785 -54444 -50555 -31089 -15864 -2812 -656 -63556
5117 -63556 -108793 -71466 -36167 -27856 -7462 73756 71932 38568 16742 -8642 12528 -6110
5105 -6110 -42044 -42947 5598 24682 5782 -2886 -24121 -38779 -54537 -65349 -71093 -86287 -98838
5092 -98838 -71990 -30928 -11347 -2957 38381 42645 44022 -1932 -8596 32533 20524 4041 48143
5079 48143 79400 63927 80306 66174 4731 -51422 -64751 -7126 17687 40144 30347 26283
5067B6283L7450N005l9946k5262r873K8626p047j9970j6343p502l6655J6692R989
$$ plain form
5067 26283 63733 68738 28792 3530 -6343 22283 15236 -4734 -21077 -28579 -65234 -48542 -38553
$$ [...]
##END NTUPLES=NMR SPECTRUM
##END=
