##TITLE=Analysis number 330057
Compound Code cc 29213
Project Code adrs
Chemist Name aci
##JCAMPDX= 6.0         $$ Bruker NMR JCAMP-DX V2.0
##DATA TYPE= NMR SPECTRUM
##DATA CLASS= NTUPLES
##ORIGIN= Bruker BioSpin GmbH
##OWNER= nmr
$$ XWIN-NMR		Version 3.5
$$ Tue Oct 23 10:09:21 2007 GMT Daylight Time (UT+1h)  MAYBRIDGE\nmr@NMR_250MHZ
##.OBSERVE FREQUENCY= 250.131544655141
##.OBSERVE NUCLEUS= ^1H
##.ACQUISITION MODE= SIMULTANEOUS (DQD)
##.ACQUISITION SCHEME= undefined
##.AVERAGES= 16
##.DIGITISER RES= 18
##SPECTROMETER/DATA SYSTEM= dpx250
##.PULSE SEQUENCE= zg30
##.SOLVENT NAME= CDCl3
##.SHIFT REFERENCE= (INTERNAL, CDCl3, 0, 16.4506)
##AUDIT TRAIL= $$ (NUMBER, WHEN, WHO, WHERE, WHAT)
$$ ##TITLE= Audit trail, XWIN-NMR		Version 3.5
$$ ##JCAMPDX= 5.01
$$ ##ORIGIN= Bruker BioSpin GmbH
$$ ##OWNER= nmr
$$ C:\u/data/dgb/nmr/ADRS/1160/pdata/1/auditp.txt
$$ ##AUDIT TRAIL=  $$ (NUMBER, WHEN, WHO, WHERE, WHAT)
(   1,<2007-10-23 10:08:59.12 +100>,<MAYBRIDGE\nmr>,<NMR_250MHZ>,
      <created by zg, POWCHK disabled, PULCHK disabled
       configuration hash MD5:
       76 6E 9A 78 1E 09 19 81 EC 84 63 8F B0 6A 59 2D
       data hash MD5: 64K
       52 AD 80 8E FF E0 92 F2 7F 9B EF 79 ED 99 31 6B>)
(   2,<2007-10-23 10:09:12.26 +100>,<MAYBRIDGE\nmr>,<NMR_250MHZ>,
      <Start of raw data processing
       ef LB = 0.3 FT_mod = 6 PKNL = 1 SI = 32K 
       data hash MD5: 32K
       B2 D2 51 1C CA 52 E1 1B 54 EA BC B4 19 E9 4B E5>)
(   3,<2007-10-23 10:09:13.95 +100>,<MAYBRIDGE\nmr>,<NMR_250MHZ>,
      <apk 
       data hash MD5: 32K
       32 E8 0C 30 5F 04 F8 39 35 4C 86 27 9A 1E A3 3D>)
(   4,<2007-10-23 10:09:14.73 +100>,<MAYBRIDGE\nmr>,<NMR_250MHZ>,
      <abs ABSG = 5 
       data hash MD5: 32K
       37 38 B8 5B 23 BC 07 1A D1 FB 0B C8 82 5A E1 FD>)
$$ ##END=
$$ 
$$ hash MD5
$$ AB CB 99 69 40 B2 30 3B CC 4C BE 52 A2 BC 5E DC
##$RELAX= 
##$RELAX= 
##$RELAX= 
##$RELAX= 
##$RELAX= 
##$RELAX= 
##$RELAX= 
$$ Bruker specific parameters
$$ --------------------------
##$DU= <C:\u>
##$EXPNO= 1160
##$NAME= <ADRS>
##$PROCNO= 1
##$TYPE= <nmr>
##$USER= <dgb>
##$AMP= (0..31)
100 100 100 100 100 100 100 100 100 100 100 100 100 100 100 100 100 100 
100 100 100 100 100 100 100 100 100 100 100 100 100 100 
##$AQSEQ= 0
##$AQ_mod= 3
##$AUNM= <au_zg>
##$AUTOPOS= <8 >
##$BF1= 250.13
##$BF2= 250.13
##$BF3= 250.13
##$BF4= 250.13
##$BF5= 500.13
##$BF6= 500.13
##$BF7= 500.13
##$BF8= 500.13
##$BYTORDA= 1
##$CFDGTYP= 0
##$CFRGTYP= 5
##$CHEMSTR= <none>
##$CNST= (0..31)
1 1 145 1 1 1 1 1 1 1 1 1 1 1 1 1 1 1 1 1 1 1 1 1 1 1 1 1 1 1 1 1 
##$CPDPRG= <>
##$CPDPRG1= <>
##$CPDPRG2= <>
##$CPDPRG3= <>
##$CPDPRG4= <mlev>
##$CPDPRG5= <mlev>
##$CPDPRG6= <mlev>
##$CPDPRG7= <mlev>
##$CPDPRG8= <mlev>
##$CPDPRGB= <>
##$CPDPRGT= <>
##$D= (0..31)
0 1 0 0 0 0 0 0 0 0.06 0 0 0 0 0 0 0.0002 0 0 0 0 0 0 0 0 0 0 0 0 0 0 
0 
##$DATE= 1193130537
##$DBL= (0..7)
120 120 120 120 120 120 120 120 
##$DBP= (0..7)
150 150 150 150 150 150 150 150 
##$DBP07= 0
##$DBPNAM0= <>
##$DBPNAM1= <>
##$DBPNAM2= <>
##$DBPNAM3= <>
$$ [...]
##$SUBNAM7= <"">
##$SUBNAM8= <"">
##$SUBNAM9= <"">
##$SW= 20.6930455092707
##$SWIBOX= (0..15)
0 0 3 0 0 0 0 0 0 0 0 0 0 0 0 0 
##$SW_h= 5175.983436853
##$TD= 65536
##$TD0= 1
##$TE= 295.16
##$TE2= 300
##$TE3= 300
##$TEG= 300
##$TL= (0..7)
0 120 120 120 120 120 120 120 
##$TP= (0..7)
150 150 150 150 150 150 150 150 
##$TP07= 0
##$TPNAME0= <>
##$TPNAME1= <>
##$TPNAME2= <>
##$TPNAME3= <>
##$TPNAME4= <>
##$TPNAME5= <>
##$TPNAME6= <>
##$TPNAME7= <>
##$TPOAL= (0..7)
0.5 0.5 0.5 0.5 0.5 0.5 0.5 0.5 
##$TPOFFS= (0..7)
0 0 0 0 0 0 0 0 
##$TUNHIN= 0
##$TUNHOUT= 0
##$TUNXOUT= 0
##$USERA1= <user>
##$USERA2= <user>
##$USERA3= <user>
##$USERA4= <user>
##$USERA5= <user>
##$V9= 5
##$VALIST= <valist>
##$VCLIST= <CCCCCCCCCCCCCCC>
##$VD= 0
##$VDLIST= <DDDDDDDDDDDDDDD>
##$VPLIST= <PPPPPPPPPPPPPPP>
##$VTLIST= <TTTTTTTTTTTTTTT>
##$WBST= 1024
##$WBSW= 4
##$XGAIN= (0..3)
0 0 0 0 
##$XL= 0
##$YL= 0
##$YMAX_a= 489415
##$YMIN_a= -347293
##$ZGOPTNS= <>
##$ZL1= 120
##$ZL2= 120
##$ZL3= 120
##$ZL4= 120
##$ABSF1= 16.45061
##$ABSF2= -4.242563
##$ABSG= 5
##$ABSL= 3
##$ALPHA= 0
##$AQORDER= 0
##$ASSFAC= 0
##$ASSFACI= 0
##$ASSFACX= 0
##$ASSWID= 0
##$AUNMP= <proc_1d>
##$AZFE= 0.1
##$AZFW= 0.1
##$BCFW= 0
##$BC_mod= 0
##$BYTORDP= 0
##$COROFFS= 0
##$CY= 12.5
##$DATMOD= 1
##$DC= 0
##$DFILT= <>
##$DTYPP= 0
##$F1P= 14.0000005364418
##$F2P= -0.99999901652339
##$FCOR= 0.5
##$FTSIZE= 32768
##$FT_mod= 6
##$GAMMA= 0
##$GB= 0
##$INTBC= 1
##$INTSCL= 1
##$ISEN= 128
##$LB= 0.3
##$LEV0= 0
##$LPBIN= 0
##$MAXI= 10000
##$MC2= 0
##$MEAN= 0
##$ME_mod= 0
##$MI= 0
##$NCOEF= 0
##$NC_proc= -3
##$NLEV= 6
##$NOISF1= 0
##$NOISF2= 0
##$NSP= 0
##$NTH_PI= 0
##$NZP= 0
##$OFFSET= 16.45061
##$PC= 1
##$PHC0= 5.968421
##$PHC1= 8.072285
##$PH_mod= 1
##$PKNL= yes
##$PPARMOD= 0
##$PSCAL= 4
##$PSIGN= 0
##$REVERSE= no
##$SF= 250.130017855211
##$SI= 32768
##$SIGF1= 0
##$SIGF2= 0
##$SINO= 400
##$SIOLD= 32768
##$SREGLST= <1H.CDCl3>
##$SSB= 0
##$STSI= 32768
##$STSR= 0
##$SW_p= 5175.98343685301
##$SYMM= 0
##$S_DEV= 0
##$TDeff= 65536
##$TDoff= 0
##$TI= <Analysis number 999999
Compound Code 99
Book Reference 9
Project Code 9>
##$TILT= no
##$TM1= 0
##$TM2= 0
##$TOPLEV= 0
##$USERP1= <user>
##$USERP2= <user>
##$USERP3= <user>
##$USERP4= <user>
##$USERP5= <user>
##$WDW= 1
##$XDIM= 32768
##$YMAX_p= 317241214
##$YMIN_p= -161848
$$ End of Bruker specific parameters
$$ ---------------------------------
##NTUPLES= NMR SPECTRUM
##VAR_NAME=  FREQUENCY,     SPECTRUM/REAL,   SPECTRUM/IMAG
##SYMBOL=    X,             R,               I
##VAR_TYPE=  INDEPENDENT,   DEPENDENT,       DEPENDENT
##VAR_FORM=  AFFN,          ASDF,            ASDF
##VAR_DIM=   32768,         32768,           32768
##UNITS=     HZ,            ARBITRARY UNITS, ARBITRARY UNITS
##FACTOR=    0.157963299565203, 1,           1
##FIRST=     4114.79117471436, 0,            0
##LAST=      -1061.19226213865, 0,           0
##MIN=       -1061.19226213865, -161848,     0
##MAX=       4114.79117471436, 317241214,    0
$$ Real data points
##PAGE= N=1
##DATA TABLE= (X++(R..R)), XYDATA
$$ [...]
20952 -11424 -8903 -7331 -3969 -1238 -2552 2699 4681 516 -2125 -2372 -6702 2061 11831 3764 798
20937 798 5744 2861 -3576 -12723 -10956 -4708 -6242 -5805 -1801 -5848 -2296 -1669 1959 -1414 -9064
20922 -9064 -7947 -7815 -5498 1705 10518 4043 -3432 -10066 -4130 -1825 -6558 -3898 -10034 -11481 -12393
20907 -12393 -5563 -3237 -1055 -3500 -5241 1598 4343 360 -1674 -7428 -10839 -11456 -12131 -14296 -12188
20892 -12188 -7376 -7709 -15756 -15591 -15077 -5649 -715 -1509 842 -688 -3654 -5172 -7037 -6205 -4506 -6593
20876 -6593 -6180 -9810 -7110 -5627 -7701 -10750 -5983 -791 -1515 -4875 -5057 -1585 -4410 -5402 -6857 -10546
20860 -10546 -5953 620 2881 -3677 -4337 -4803 -7835 -8183 -9364 -10156 -1800 -157 -3247 -1177 1730
20845 1730 5133 5600 7618 3382 -6532 -6269 -4460 2180 4155 -545 -7456 -7475 -10288 -10947 -18419 -20318
20829 -20318 -10969 -6231 -10392 -12516 -7887 -3719 587 4199 3076 4589 444 3814 7919 7323 4076
20814 4076 2339 6325 6970 11671 14658 8623 4447 4520 3735 2005 -3502 -12309 -11628 -6381 -7625 -10968
20798 -10968 -12980 -9427 -6209 -9207 -10486 -7679 -5101 -7954 -6352 -7192 -12087 -11691 -4752 2261 -1039
20783 -1039 -5880 2138 3899 2926 -1825 -3066 -1801 -8824 -16947 -16039 -6466 470 2043 1485 4321
20768 4321 14511 19487 10744 3580 1017 -1380 -2059 -6253 -15082 -12286 -4083 1471 2477 -2260 -5741
20753 -5741 -8121 -8919 -5587 -2179 -4861 -4289 -354 859 7608 3310 5417 6436 7186 6232 -2372 -8475
20737 -8475 -12885 -11042 -6992 -3012 -9518 -12743 -11073 -9329 -7428 -11043 -12958 -12533 -19735 -19397 -15454
20722 -15454 -12826 -14526 -11737 -8385 -9956 -14877 -11350 -1399 5927 5214 -4540 -8735 -6539 -7940 -8110
20707 -8110 -12982 -8535 -4547 -2301 -7284 -12772 -7305 -6026 -8291 -7570 -4997 -6797 -5070 -3402 -5684
20692 -5684 -9134 -13052 -13772 -13605 -10234 -9209 -10849 -11953 -13692 -13258 -7405 -6471 -5768 -1003 -8749 -9380
20676 -9380 -2492 -6962 -15461 -16990 -14660 -12627 -16327 -16299 -10699 -1636 2929 3518 -7606 -7148 -1177
20661 -1177 -2840 -3350 -4480 50 474 1822 -680 -659 -1745 -2048 1156 132 -2468 -3458 -368 5978
20645 5978 8156 6984 6128 2664 -496 1274 5207 -2143 -4737 -6221 -17010 -13255 -10188 -4626 -4817
20630 -4817 -8023 -3030 3108 3414 -1311 -2177 -3049 -3609 1084 3270 -2137 -7095 -8348 -4417 2178 6010
20614 6010 -1645 -1351 -2439 3636 -238 -1881 -1719 -228 161 -1816 553 1800 3294 1203 -1204
20599 -1204 -5106 -8135 -16781 -19732 -13461 -7554 321 -2971 -5393 -4345 -5197 -8255 -10202 -4678 207
20584 207 -2925 -1475 -837 -8581 -18287 -14845 -8444 -8103 -6557 -7161 -4966 6017 4532 5771 3295
20569 3295 -3168 -4391 -3094 -2331 -1971 3233 1725 -5251 -3560 -2689 -4822 -7377 -4884 697 -159 10097
20553 10097 11639 6823 6868 -2826 -3671 -2272 3288 6232 4222 1532 605 -6074 -10860 -9673 -8568
20538 -8568 -3553 417 1975 1880 13386 18236 9671 6053 6523 4770 8604 10727 1706 3335 12565
20523 12565 11862 2439 -4110 1446 4275 -694 -2144 -3205 -1381 3225 2452 -1482 -1878 -1356 2044
20508 2044 44 -650 -1238 -1096 -5831 -10045 -14843 -13971 -7544 -4997 -7012 -4278 7421 5938 1651
20493 1651 3508 -2720 -9937 -11338 -7277 -9322 -8219 -5564 -3025 3783 5622 1098 -789 3453 4540
20478 4540 3255 -218 2745 4158 43 -4713 -4324 -3868 -7221 -9223 -11110 -5860 -3643 -7640 -6147
20463 -6147 -5141 -5715 -8975 -3479 -3698 -4886 -1724 -2277 -296 3334 529 -4397 -7148 -5634 -5847 799
20447 799 1595 -1184 -3069 -7124 -7589 -8519 -7382 -5698 -1543 2129 1420 595 1992 -1798 -6070 -4960
20431 -4960 -1556 -1283 -8635 -6257 -4573 -3348 -2711 -2599 -2636 -9281 -6258 384 -888 -4184 -6634 -5725
20415 -5725 -12387 -13757 -7875 -5495 -9484 -9105 -126 -5328 -4332 3344 3655 7272 8272 1715 1524 981
20399 981 247 1599 1031 1138 2309 -2937 -4340 -6156 -6939 -5597 -9451 -9678 -10794 -5737 -933 -648
20383 -648 -1061 1400 -463 1604 2313 1731 -1412 -179 -6508 -4976 -6089 -5759 -3678 -6596 -4967 -7154
20367 -7154 -4473 4064 10389 11022 10852 8739 5448 297 1113 -1997 416 1557 -5608 -11507 -10835 -7575
20351 -7575 -7874 -11162 -15942 -16557 -14805 -10822 -8971 -8522 -8597 -11013 -12163 -7381 284 -3373 -6195 -4088
20335 -4088 713 4190 4658 -2302 -5998 -8571 -13857 -7307 -4671 -6363 -1017 8760 3600 -3814 -6400
20320 -6400 -4660 -4461 -8262 -2462 5797 1337 1408 5554 1598 1892 1765 3010 -2711 -7345 -4925 -2571
20304 -2571 -4173 -6023 -851 3030 5801 7624 6338 5591 2669 2384 -1268 -368 -8643 -16071 -12146
20289 -12146 -1644 1137 7358 3730 -5396 -8787 -10448 -11940 -9607 -854 2204 -1354 -786 2359
20275 2359 2687 2440 2573 6596 4994 -709 -2270 -984 -1445 -1676 2269 170 6227 8157 5751 6247
20259 6247 10360 22825 37427 47316 61865 68664 68180 62783 49323 35534 24805 18922 19814 16764
20245 16764 13598 8174 4241 3502 1677 5564 13019 11285 7128 7992 7832 14005 18328 17093 18360
20230 18360 16335 19990 22293 22602 19233 27130 42804 59741 76173 77990 76362 68966 49135 28048
20216 28048 14329 11302 10254 8299 8766 4301 1550 4468 4840 10208 12492 11328 15261 14677 8655
20201 8655 8012 4365 -38 -2719 -4461 -5400 -1707 4905 -466 -7092 -8782 -5714 -195 960 -1851
20186 -1851 -4802 3484 6301 2428 1191 1621 -1920 -3370 -12 2698 3336 2564 -2132 -1851 -1628 -2489
20170 -2489 -730 -1034 -7224 -4842 -3486 -2786 1171 184 249 -6149 -6428 -3236 -4933 -3533 6592 7431
20154 7431 1941 6375 12585 10681 5291 340 1781 2316 2503 -104 -4731 -2094 3406 867 -3055
20139 -3055 -2002 -174 -6919 -5922 -8739 -10091 -3500 2096 -398 4142 5609 7247 5255 -5194 -10743
20124 -10743 -8330 4038 6599 3752 -129 3960 5121 2967 1117 5986 8493 8653 5209 6410
20110 6410 3660 -532 2295 2768 -2282 -2734 -537 6119 3518 -1016 -3800 -9048 -229 6359 8929
20095 8929 6217 3086 5235 5281 7085 10041 15259 24575 20948 11824 17246 20700 14990 16432 13888
20080 13888 15483 19219 23855 22788 18874 18702 16024 15734 14851 10530 15943 25411 23983 18067 14587
20065 14587 14766 19974 25953 29466 27280 25790 26224 32543 34729 28362 27055 30684 33970 29809 30988
20050 30988 45916 61673 74999 86600 99435 120494 144719 177306 226793 306395 413912
20039 413912 543295 670352 744582 738091 687945 640873 645315 727413 900730 1156314 1449908
20028 1449908 1596076 1459289 1193156 926040 737742 651440 643154 680440 730501 744733
20018 744733 689532 577177 450867 338890 259533 199267 157689 124774 104171 93064 81732
20007 81732 80678 75759 63611 57673 50112 42390 42178 41386 40193 33487 27537 20721 20551 22864 24973
19992 24973 26849 26793 32232 28257 26364 29421 34660 36408 31701 28422 38536 45782 48066 48877 44666
19977 44666 50514 54553 65051 74048 70768 57344 48187 42696 44326 47813 42781 36283 33357 30953
19963 30953 34127 38855 40374 36780 36042 34661 29616 25509 31470 43716 61386 65593 63528 60763
19949 60763 58397 63201 66361 65241 55512 41262 32083 30311 24873 19908 16017 17985 18793 18258 22460
19934 22460 15931 7886 10077 18772 32246 47801 58697 60745 53373 48846 48884 46729 31378 17237
19920 17237 13780 16910 20644 16897 21677 28956 28512 40656 52721 53155 48405 42367 31031 17764
19906 17764 14958 12238 11987 13657 17577 14396 6922 124 -6015 -3388 -2981 236 7972 3248 2937
19891 2937 5483 8851 7720 3628 -1275 1723 4899 4511 4210 -2496 -10689 -5728 -3239 3169 4822
19876 4822 2759 -2116 1052 -989 -144 3719 4400 3688 10120 8649 10470 5770 2651 5185 8428
19861 8428 9275 8015 8397 6730 6461 8894 15069 14081 6328 -2171 -6206 316 12484 18132 6104
19846 6104 -4240 -3544 3642 10052 11673 10520 4298 10368 15755 18533 15414 18255 25716 21258 13489
19831 13489 15604 19378 25362 26625 30875 35118 37029 31386 29863 33683 30705 22507 14905 15342 19657
19816 19657 28248 32102 21514 4904 -24 5680 7875 4273 -3244 -7979 -1576 5207 2364 10
19802 10 6421 8356 11064 16435 14206 8417 391 -980 7139 6697 1462 2253 1807 5415 11390 10049
19786 10049 11634 7793 1988 6638 10391 13030 13839 7033 1663 1057 2288 2994 -2009 -1153 3935
19771 3935 7392 9411 8322 11525 15057 3838 382 2791 156 -344 1543 4637 5007 2926 5426
19756 5426 5279 4769 776 5135 3927 2177 2847 -1698 1380 9110 8754 8673 4920 -431 -711 -1438 -3822
19739 -3822 -3870 -2384 779 -1087 -2675 -2217 3528 5181 2293 5135 9454 14522 15045 17087 16870 11090
19723 11090 13177 16751 18941 14800 13991 15698 10712 10811 12168 9397 7706 6508 7401 9823 9226 9368
19707 9368 11812 23097 29784 28256 26947 20422 17301 18217 15374 15606 15743 12525 10724 9437 4415
19692 4415 9757 16579 23825 24507 23361 24527 26967 24638 27078 23145 26123 36395 39034 37746 38154
19677 38154 41414 43939 42504 44781 46401 34183 25743 18866 13947 23931 22259 14367 12644 6973
19663 6973 3212 8496 17037 17960 14161 16108 11893 16959 21757 25374 22813 24072 26361 25783 16512
19648 16512 14378 17011 17476 11661 8058 6899 7446 11415 15801 19005 15792 11278 13955 20595 25288
19633 25288 31625 36968 38219 33052 27062 27567 29062 30549 27455 31232 35156 36227 40950 43315 40366
19618 40366 48410 60192 63081 71888 78727 86507 97198 119995 139518 162185 163254 151148 138971
19605 138971 129913 123114 115103 114291 116858 122735 133733 159301 197960 229819 224233 188995 161699
19592 161699 146858 140961 152336 169575 198269 224735 232472 226134 212556 198487 198195 203189 202502
19579 202502 184903 161992 144388 134551 132751 155123 192814 246752 294436 300490 264286 209863
19567 209863 170034 152599 153573 171617 196472 210325 219914 219782 185266 143260 121217 112445 108183
19554 108183 116252 124449 139740 160137 177063 192068 216740 238777 237280 233195 215543 181831
19542 181831 148909 129722 126650 133752 147918 162200 181637 194493 189952 163588 138797 113598
19530 113598 93880 78941 70652 61420 56566 45951 45446 50390 58524 59933 66952 72311 73079 65247
19516 65247 59904 48993 44492 44311 42601 33669 29887 22952 24023 24132 21349 19638 20397 14290 6818
19501 6818 13916 23868 25503 21013 18349 21768 25489 22073 14595 11340 14372 13103 17490 22674 21321
19486 21321 17256 20564 21786 12915 12996 22103 21254 20259 19672 15944 20098 22301 24440 23208 19279 21284
19470 21284 23843 22188 18014 16956 14916 19979 27699 28211 26007 19756 16092 21035 23810 18688 13952
19455 13952 19835 31885 31820 22900 23015 27635 26567 24778 26434 27575 27766 31465 29524 23826 27539
19440 27539 28223 26338 21522 23592 26477 21696 21167 20984 20852 23074 25193 25589 26247 28592 31469 34957
19424 34957 34358 27091 26236 21086 23019 26439 30051 31383 32970 36701 31363 31244 34818 30608 27821
19409 27821 33310 35219 34715 33194 30869 32270 34366 26870 18260 11724 11372 11801 18215 25822 28249
19394 28249 21625 18981 23853 29332 24591 22464 25278 25320 24026 21912 25176 29409 28201 29355 25737
19379 25737 22428 29382 34561 33773 31170 29402 24138 22814 21652 21671 21970 20816 21455 16170 18316 18982
19363 18982 17663 18338 20731 30917 37003 36979 40527 44064 48210 60315 73538 74204 66923 56979 47238
19348 47238 43738 38935 38753 34516 35373 38902 39378 43331 49355 42707 33702 26774 29808 39009 42930
19333 42930 43964 43987 45692 44174 48545 49040 48527 56001 57111 46538 44052 40807 44758 48668 44356
19318 44356 41034 44566 44694 43136 46568 45305 42615 42072 38916 38945 50102 59355 62194 69270 72436
19303 72436 75828 76477 73411 65395 56002 44795 38077 40748 50107 57018 59751 71014 77820 77906 70272
19288 70272 60272 48543 39663 33930 35081 39738 38636 40151 41096 45874 46032 39193 35644 35195 32794
19273 32794 38326 43877 46954 45036 49918 52820 54786 49894 51955 53406 56514 63890 70490 74044
19259 74044 72988 76548 75512 73225 76588 81786 80034 86050 89869 92786 95030 100126 104348 112431
19245 112431 128374 139513 147941 147982 146990 146833 146364 138928 131824 124056 119742 124064 141420 164649
19231 164649 190747 207673 219757 225378 219559 213020 215275 216584 225680 248649 293763 341222 405285
19218 405285 485018 580512 704266 856575 974736 951756 825169 686648 572692 508233
19208 508233 495507 521357 580860 658025 690639 684533 687392 716320 764133 821188 877858 938180
19196 938180 974842 914691 803102 696999 629974 607486 622315 685062 783728 879097 898949
19185 898949 835240 749611 693564 685384 738149 830182 968554 1093723 1131823 1114977 1109158
19174 1109158 1167830 1226114 1207989 1124228 1041923 1007908 1038155 1087194 1111049 1149233 1265110
19163 1265110 1474427 1771423 2015596 2006911 1848118 1719470 1694204 1729212 1812364 1976873
19153 1976873 2151462 2161622 2016360 1867342 1788211 1757085 1726137 1693552 1701965 1780070 1880589
19142 1880589 1967306 2017097 2110042 2327538 2662163 2930197 2886396 2653122 2458914 2404347
19132 2404347 2399036 2410172 2440658 2520263 2699638 2993713 3296667 3438815 3437320 3434381 3530144
19121 3530144 3715433 4008535 4478888 5044959 5350126 5446309 5670892 6213673 7082732 8285657
19111 8285657 9654434 10477573 10630842 10738794 11327095 12231038 13224058 15021691 18700174
19102 18700174 25138322 34874580 47415525 56241110 54022647 45710607 37695248 31660376
19094 31660376 27017667 24175046 23221756 22711399 22238395 22853698 25565895 30214147 34150537
19085 34150537 35694368 36868792 38424105 38553973 37505939 35287268 32796164 31663569
19077 31663569 30956568 28629752 25942765 24600883 25453437 27520989 28097684 26859603
19069 26859603 25915921 26503365 26947719 25601230 23937616 23631122 24513387 24522631 23555324
19060 23555324 22780799 21800613 20037454 18504780 18354213 20260174 24410901 30754997
19052 30754997 37782457 44084237 51387025 59237950 62159036 56248714 44482420 33306694
19044 33306694 26037074 22862073 23103304 26672708 33797347 44560048 55918673 58301286
19036 58301286 49940451 38189291 28732821 22054424 17120037 13499727 11104732 9685683
19028 9685683 8950509 8536123 7984508 7245435 6590224 6193953 6066285 6168798 6462769
19019 6462769 6982101 7585202 7534065 6594081 5376346 4370749 3698402 3227706 2875231
19010 2875231 2621124 2456231 2384423 2390588 2434052 2410676 2286214 2139277 2051917 2056781 2138430
18999 2138430 2304517 2551167 2766021 2755319 2445999 2007625 1641237 1397622 1236654 1135352
18989 1135352 1062615 1013153 976619 945704 924090 910561 924301 950235 995170 1042107 1056847
18978 1056847 1011906 931905 850875 789416 746709 714497 687127 659695 644777 634010 630835
18967 630835 639368 646503 639208 610971 574992 533077 501497 480990 464992 447097 434727 425691
18955 425691 419301 422083 422089 418991 410728 401201 390387 374721 366977 362865 355626 352581 361608 364121
18941 364121 362331 358490 355322 346415 338982 333842 324811 314407 306853 303562 299269 300029 302596 309117
18927 309117 313563 315560 312898 304202 294389 295621 298643 292690 279629 264586 255157 250408 250192 258774
18913 258774 265585 271588 272734 270281 262672 257561 253358 249302 250545 250825 249130 251209 252721 253923
18899 253923 248700 249663 252738 246353 240890 233099 222682 208748 203324 204312 198607 202302 213683 213125
18885 213125 211235 213502 217056 217211 208831 205546 200278 197114 195949 192930 192620 192180 191930 190522 188052
18870 188052 190308 191430 197074 204484 210925 214101 236662 256609 266252 280966 304000 333905 376831
18857 376831 411225 407860 384709 358449 336501 331537 333083 344228 373897 414953 465194 522374
18845 522374 565183 564142 536606 503405 478233 464880 457525 450852 457707 466239 480718 495358
18833 495358 507381 505120 484005 466519 446030 427482 413248 402671 398304 388271 376919 373730
18821 373730 378467 391787 412651 439760 475290 507154 527390 532395 533220 526211 512527 498446
18809 498446 489496 480016 473620 470853 492447 545136 605784 668008 708859 712306 683721 641594
18797 641594 607770 588883 577775 586352 585868 567873 552185 542371 549006 559209 555571 542540 529950
18784 529950 515927 499443 478009 462449 439850 423685 405657 397059 386777 370842 357500 351737
18772 351737 345692 335026 333971 345400 359936 360678 356085 362935 393709 445363 479941 478747 454054
18759 454054 413393 376461 350057 336093 332082 317711 296164 276803 258088 246585 236675 238676
18747 238676 243829 232042 206675 175823 158688 152332 153154 145148 132235 119270 111616 107053 104267
18734 104267 97767 95254 90848 85945 87764 91191 95184 105008 111383 119002 138015 151821 149012 143043
18720 143043 134631 130588 141275 161496 179946 192757 190088 171972 160963 150584 143897 145486
18708 145486 143785 151215 143056 120813 101285 85491 85035 83569 76016 77489 76990 74336 74392 67559
18694 67559 60366 54901 59677 72139 76866 75301 73465 67632 65221 63904 68203 76896 76033 69146
18680 69146 66112 70481 73191 68311 68884 71296 66171 63734 64435 65972 69218 69909 62019 60425 63221
18665 63221 62051 58768 55326 53713 58464 60837 64879 63902 65614 67675 70791 70911 67536 59711 63522
18650 63522 72067 78173 77267 77664 82163 77380 74217 68166 57137 60990 65267 65587 69628 69376 64490
18635 64490 67555 64316 62263 66447 66815 70788 78014 80286 81487 76656 68188 62903 66600 65706 61121
18620 61121 69651 72472 71002 74905 83677 76815 68329 68305 68823 65093 64219 66988 66628 67329 72402 75532
18604 75532 83292 97922 105455 115011 129713 145834 170859 185872 188906 192745 193501 203539 198446
18591 198446 178627 167350 172586 191808 226545 268168 301629 317308 315682 306757 296759 285487
18579 285487 261216 227432 197251 178132 173798 182659 192098 185105 172026 156495 145872 144441
18567 144441 148963 151159 146343 143983 145132 146769 147035 146535 159284 185130 220061 256054 278245
18554 278245 281386 267538 246548 228729 219607 229172 259589 298068 338958 367993 387952 384880
18542 384880 362460 335262 315069 314409 333585 374022 412014 429386 422911 398789 360828 320105
18530 320105 283612 262790 258768 262587 272196 281216 294305 302162 285610 266611 256780 257322 254785
18517 254785 244240 225053 192816 161151 135798 122161 112159 101624 90340 85953 92319 96942
18505 96942 92482 92901 90211 89449 89510 88726 92008 84374 75079 78542 86443 89616 92716 90488 96178 103367
18489 103367 102982 101581 93719 90887 90166 91212 94427 93048 91630 88383 87726 86017 83705 82012 79342
18474 79342 81759 89897 90869 94759 95253 98755 99339 91321 83529 86078 89875 95552 94300 92837 90921
18459 90921 93220 98875 109908 118898 125986 130107 131903 129028 126303 126571 124313 132490 138885 146913
18445 146913 152830 156885 169309 180130 188822 203650 229860 251815 259506 266519 262661 257558 252669
18432 252669 251938 255131 261598 264368 264128 259055 257975 267927 281520 298166 317856 341171 365561
18419 365561 399162 426446 421437 395501 375073 373714 392343 418234 445605 479976 496962 509584
18407 509584 519664 522611 522013 519930 528210 539526 546180 555112 563178 573243 600398 640321 693246
18394 693246 771344 852308 911186 955583 1017998 1132716 1300705 1493435 1643786 1693008 1641484
18383 1641484 1535557 1422658 1344645 1331389 1374316 1474634 1629674 1822497 2049744 2351618
18373 2351618 2780485 3398248 4285461 5532007 7240960 9061872 9741406 9453665 9098837
18364 9098837 8912900 8390654 7642355 6848858 6303499 6189877 6570418 7338721 7773168
18355 7773168 7258321 6449482 5856558 5624673 5610116 5793245 6208111 6879416 7807289 9128872
18345 9128872 10675284 11987170 13585602 15953833 18931053 19820356 17574670 14414504
18337 14414504 11996692 10897720 10908116 11929169 13868926 15975496 17402846 17674081
18329 17674081 16288887 14279025 12245037 10747020 9936323 9781870 10110187 10817847 11980014
18320 11980014 13758632 16297295 19996265 25096753 30286033 35415713 42396535 50663166
18312 50663166 54860414 55776871 57597631 60539241 58728963 53430895 48813441 45159521
18304 45159521 40708727 37160644 35727568 35410686 36207521 38632884 40311554 38151213
18296 38151213 34278430 31461625 31086415 32347331 35188805 39333961 40785970 36867218
18288 36867218 30760243 25560905 22759327 22005565 22939274 25495143 29995323 37044551
18280 37044551 47411039 60790360 71718820 76276626 79340445 85013677 94193070 99590032
18272 99590032 92565338 76238463 59942124 49786001 47282512 51836457 63368670
18265 63368670 81611263 100807094 110419185 107365598 93187990 72506943 53132363
18258 53132363 38655290 29386689 23590071 19829976 17330103 15736604 14917228 14873189
18250 14873189 15711288 17506447 20218936 22766096 23486192 23288881 23053807 22635172 21481248
18241 21481248 18504460 14918281 11868504 9936882 9012810 8913050 9561953 10916236 12649084
18232 12649084 13307392 12209641 10059926 7985609 6516971 5570608 4947945 4522852 4181952
18223 4181952 3828539 3486413 3203273 2994744 2830868 2699409 2586325 2484929 2408712 2362278
18213 2362278 2345809 2356292 2384382 2400635 2407669 2466486 2644072 2985649 3520375 4070191 4087872
18202 4087872 3607466 3009039 2585747 2396043 2381104 2510810 2690873 2953644 3354107 3836688
18192 3836688 3943776 3528129 2924088 2423346 2116056 1934985 1852006 1850956 1917319 1996921
18182 1996921 1946938 1758858 1528461 1345449 1221212 1129502 1058963 1003303 966365 936314
18172 936314 916172 901755 882110 870061 868304 867492 879586 900120 922252 941875 956319 955073
18160 955073 948794 939509 944048 970665 1020654 1098788 1192961 1271789 1330273 1391630 1429531 1424948
18148 1424948 1398237 1362173 1326171 1281275 1211300 1132287 1038652 937234 850622 770299 697694
18137 697694 653684 620153 598441 576397 559049 546390 540915 538733 539178 539314 543105 550882 563182
18124 563182 583716 617796 655284 693874 735265 788391 860270 966417 1142261 1416541 1883945
18113 1883945 2665497 3860338 5638343 8161769 9729510 8378356 5753750 3662566
18105 3662566 2482001 1821294 1412838 1147965 977929 854399 764592 695876 637969 601980
18095 601980 579034 557222 540717 527529 519370 511935 503532 497735 487628 465975 439860 414632
18083 414632 394032 389529 389955 390689 395649 405922 412986 411205 414002 397522 373600 353127 336393
18070 336393 328851 323596 321900 308278 309913 305941 293408 281631 269298 271004 267410 262303 254406
18057 254406 256179 257138 263446 263235 265926 271624 276371 274006 269597 256999 251406 250230 252894 249839
18043 249839 247380 251185 255305 260043 265510 267135 265442 267558 269276 271455 267233 261909 256345 251107
18029 251107 242187 239181 235660 232944 228382 217289 212846 206500 196020 186577 173919 169251 173055
18016 173055 178974 179055 177076 181293 194029 201401 204207 206063 201921 193638 183671 175345 159131 150028
18002 150028 145477 148094 150940 152635 152659 150889 153464 154110 156410 157736 158908 154125 144279 140553 133257
17987 133257 128344 123540 124355 121645 121513 126327 128900 129524 137728 142773 141542 133805 126095 120865 116413
17972 116413 116069 114578 106831 101040 104388 108006 108536 108846 110735 116536 111029 107978 105413 107117 103008
17957 103008 90545 83328 85729 85036 83725 89139 93061 90096 84689 82679 87651 86323 82480 81740
17943 81740 79622 77546 75204 67336 63934 69138 77098 82110 81772 78111 72655 70239 75947 78642 78298
17928 78298 77979 77823 71573 67560 71202 69161 61549 62781 60001 61688 63189 63320 58706 60806 62125
17913 62125 62548 66538 68684 61708 61067 60378 53510 50011 51531 47169 48268 57065 58123 60077 64632
17898 64632 65575 58191 55652 53038 51006 49119 56726 64976 63228 61746 56251 57154 62033 65044 67650
17883 67650 65090 59840 60393 58769 62711 67347 64528 61053 58681 58187 60570 52051 48009 57732 60966
17868 60966 61803 67067 72972 74281 78084 78994 61051 53097 57631 60025 54573 52557 58986 68846 73951
17853 73951 67982 76698 90719 97827 103366 109857 114139 116882 123593 132141 152417 182790 206273
17840 206273 208319 193901 174990 161790 162858 177602 187309 180895 159563 139025 129539 137592 143233
17827 143233 156027 178799 187458 172531 149178 124847 114083 109251 105099 110044 124437 135974
17815 135974 142794 170597 201071 224579 228362 212551 184231 161030 146549 134325 140988 148205
17803 148205 159710 176601 201252 221236 225442 226507 238494 262328 290874 319538 337020 341938
17791 341938 336042 345557 374077 397255 402278 393039 378588 341899 294673 256312 227935 209580
17779 209580 190630 171028 158692 152969 155910 164832 184091 198680 191111 172540 150596 139439
17767 139439 131380 130083 139483 152136 166498 184144 198950 204618 208701 210134 206225 187276 168503
17754 168503 156154 162976 178437 195080 210732 226556 251254 264544 270386 266924 266961 276886 290129
17741 290129 291760 276924 244652 223237 208079 199494 199477 205292 213966 238056 259566 249544 208264
17728 208264 163332 135835 116051 100221 98698 104918 104879 104019 101722 106678 111425 107792 100271 92575
17714 92575 83603 80030 75867 69219 74159 80489 84629 81177 76572 73300 74982 74869 73260 73919 75042
17699 75042 78141 84916 90688 108232 127232 139338 131187 122690 117842 114045 118938 134074 137821
17686 137821 129371 120268 109829 93882 80975 77566 70628 54798 42496 38763 32910 30154 34205
17673 34205 43285 39630 40100 41867 38214 30495 30976 38237 43600 47165 55751 52013 46500 40362 34398
17658 34398 29758 30461 38676 49607 59361 62093 63133 63170 70079 79612 90850 101423 133960 182157
17644 182157 234346 289538 349892 419618 500771 584826 638735 638176 626119 631052 621672 562053
17632 562053 475838 391652 326363 273013 221064 179818 140267 114883 97865 87594 83035 76392
17620 76392 68865 65276 52526 47230 52042 48076 41893 41794 40873 33123 31663 31027 35178 32694 26624
17605 26624 27870 32032 31899 26663 25866 23309 12717 11139 17489 12467 15976 22644 17003 9604 10757
17590 10757 11968 13676 17507 13784 16296 20704 20424 15874 9707 9901 13895 9291 6551 7634 8390
17575 8390 17616 17198 8890 12807 14908 15221 12356 11747 13589 13034 11791 11108 8298 12016 14780 16985
17559 16985 14273 10843 7371 10832 12632 14599 14041 19111 22229 13725 9237 9992 7518 10000 11787
17544 11787 11566 14688 12354 12470 9986 10822 15453 15892 15662 9690 5714 10271 10680 8248 17564 26908
17528 26908 23872 16683 15264 11699 12778 6018 2028 784 -3628 -6881 -2042 7998 2710 -150
17514 -150 -2665 -2703 -5502 -2998 -1948 -8304 -6089 3413 9298 5313 4457 5905 10529 16694 14694 10559
17498 10559 -2999 -968 12343 17116 11060 4370 2112 3379 7636 6765 5125 7230 11359 12213
17484 12213 12215 10777 8368 13829 15547 17699 15249 15776 19645 14649 10500 14318 14761 17483 24746 33388
17468 33388 30987 23867 18835 17924 23059 31644 38280 40897 42256 37607 40881 53149 66881 77003
17454 77003 86467 93933 103279 125556 158177 212238 298733 404010 496753 544777 572335 636778
17442 636778 776010 994803 1222370 1275883 1141724 983231 916467 995414 1175395 1272985
17432 1272985 1155458 920880 707158 591361 564308 563870 510711 413718 302275 214965 161389
17421 161389 125158 109157 103253 97009 93517 83841 78833 67067 54952 48881 50942 52583 50612
17408 50612 43059 35108 30579 28984 26409 25387 25016 23754 21377 22146 24788 23030 19536 18609 20832
17393 20832 21317 25778 23706 18549 17541 17991 20968 23571 17416 9420 8021 7290 6997 8086 14812
17378 14812 16123 16550 10786 9658 8988 5358 7077 5376 4925 6800 8447 15756 18407 10575 11191
17363 11191 12079 2978 3739 6357 10436 15705 15407 13937 12381 15483 19360 16842 11141 6175 5444
17348 5444 5206 3319 107 -956 2225 5401 3490 -375 79 -89 4268 14428 10450 7955 5299
17333 5299 3158 4723 7860 7942 8743 8096 7310 -934 -3355 -4658 -1083 7232 9091 1505 -218 835
17317 835 -723 -2660 -2819 -407 5085 6546 3322 1792 -3603 -101 5796 12053 14882 14605 13623 10194
17301 10194 6573 -810 5080 6564 3904 1965 2920 7841 9397 4519 -468 -1099 -465 -2392 4278
17286 4278 10596 6979 5412 7066 9959 13297 10813 8345 -26 -3442 240 2287 1485 2499 6872
17271 6872 4719 6795 8222 6203 7127 9715 9572 11290 7529 5203 6200 6939 3403 -363 1826 5548
17255 5548 2336 -4473 -3330 2688 4594 2625 2049 -1058 -6185 -221 2840 4209 7199 5314 -1772
17240 -1772 -3421 -6845 -2742 3663 4767 5711 4361 4836 4403 3119 939 2822 2606 5793 3522 119
17224 119 3591 7266 10764 9451 292 -6416 -1043 -2590 -2655 -3125 404 2355 3137 1295 -3601 -84
17208 -84 -1014 -492 -146 -560 2482 3620 4682 6563 2028 -2966 -2792 -2400 4188 7083 2202 -3584 -3919
17191 -3919 -1937 3116 5274 7891 8627 4418 -4799 -8737 -1208 6310 8697 8293 4173 -3811 -1680
17176 -1680 -3111 -6121 -7868 -8925 -8037 -8368 -9697 -7326 -9445 -7219 -8726 -5771 -7657 -5613 952
17161 952 2468 7272 15461 13999 8214 7250 683 -1848 -3854 -3630 -1843 3923 3437 654 -5543 2115
17145 2115 1587 -1856 649 681 1733 -921 -4076 -1110 4717 3208 -2587 -6135 -4757 -1098 -1752 -519
17129 -519 3932 -1472 -2923 -2517 -1908 5762 3453 -3380 -680 4570 5170 5919 12951 10055 6900 5977
17113 5977 -827 -1540 -10705 -15530 -7206 4744 4050 -110 886 3248 2422 963 -2164 -4690 -7840
17098 -7840 -13328 -8553 -1859 6045 9361 9559 10317 6701 1181 1766 2214 -4482 -3023 -4154 -1783 -3984
17082 -3984 -6131 -1282 -2817 -7747 -9177 -11211 -9185 -7112 -3693 -22 -312 -4094 -884 302 -4061
17067 -4061 -4217 -2367 2154 4396 2985 -4796 -9777 -6747 -1922 -304 -379 -16 -4161 393 7431 9372
17051 9372 3577 -636 -3361 -9937 -7835 -1474 5756 8654 5684 -3426 -3764 2173 8127 11508 8005
17036 8005 1283 -2308 -7195 -8061 -9594 -9108 -7265 -6824 -8770 -5473 1951 745 2683 6490 10023
17021 10023 8391 -375 -2209 -3231 -5146 -7316 -1648 -8135 -13227 -7884 -4731 -7424 -13588 -9871
17007 -9871 -3696 -8274 -5085 -2325 -4307 -4758 -3147 -1290 6891 3827 -8686 -8599 -5469 -10520 -10102
16992 -10102 -10270 -6607 -12865 -15712 -15485 -22438 -14105 -9200 -6590 -4998 -360 -2804 -2419 -2307 2094
16977 2094 -963 -1029 -17 -3105 -2452 1565 95 -3041 -6399 -1449 2295 5129 5003 4737 1169 2190
16961 2190 5414 9320 7083 3822 3066 -6896 -7584 -5904 -7343 -8712 -15602 -14644 -12999 -7533 -1509
16946 -1509 -288 1362 3072 8493 6520 980 2719 1730 -1009 -1466 -2946 -395 861 483 -8535
16931 -8535 -12047 -9724 -8300 -9858 -9537 -4653 -5402 -7516 -3655 -1723 2085 4350 -977 -1023 4464 6106
16915 6106 1053 -4174 -1620 -1613 -6230 -4493 -6665 -9203 192 7672 2857 -507 4261 -2559 -6719
16900 -6719 -2809 -1325 -3759 91 1435 -659 -4338 -1373 -177 779 -4870 -11354 -13742 -15607 -17372
16885 -17372 -15608 -9349 -3397 -3172 -4745 -6419 -10239 -7567 -1565 -1224 1557 974 -1915 2576 4180
16870 4180 1562 4595 11485 7458 3778 -87 2047 2736 -3470 -2163 -2836 -765 -3121 -5727 -3168
16855 -3168 -1525 -1511 -8646 -5990 -5406 -6185 -8903 -11066 -9442 -2075 -129 -2724 -5028 -1296 -633 -2201
16839 -2201 4136 141 -2454 -2819 -1691 -2135 -2080 843 326 -4207 -3260 3176 52 -8486 -7805 2927
16823 2927 5337 6404 -2850 -3678 147 -746 -505 -2198 -7539 -7503 -6153 -8910 -12321 -13307 -13351 -13977 -14085
16806 -14085 -4634 3868 3837 1971 3987 -536 -922 -8232 -14642 -18325 -9549 -7214 -6817 -4536 -2029
16791 -2029 -4439 -6709 -5202 -3572 1242 1337 3815 4415 1658 732 3328 3535 5605 8421 5706 -2418
16775 -2418 -3669 -1312 -9007 -3986 2893 3376 4265 -65 -1413 4510 7573 4751 4280 5309 -85
16760 -85 -3290 -10924 -10193 -6485 -2296 -3231 -3325 -2679 -3034 239 1077 1122 1552 -4464 -4821 1645 -458 -2638
16742 -2638 3985 7971 3940 -3930 -4962 -4850 -5870 -7977 -462 -5684 -8416 -4095 -2301 -2693 -4678
16727 -4678 -11209 -16029 -10958 -2486 -2945 -1518 -609 -6022 -9905 -10025 -33 4097 -3220 -10352 -8120
16712 -8120 -7884 -6500 -830 1760 1574 -4424 -11416 -9068 -11427 -11413 -9228 -14260 -15319 -17975 -17539 -13127
16696 -13127 -9481 -6247 -2195 264 1471 -642 -1264 -2983 677 -2256 -5629 -8106 -13053 -15973 -15400
16681 -15400 -9678 -6245 -5553 -5124 -5646 -5455 -6474 -6755 -10350 -8791 -7084 -5472 -6399 -4688 646 -1721
16665 -1721 -7016 -12026 -11600 -917 7020 6377 -4506 -7111 -5545 -5318 -3566 -2283 -2648 -192 652
16650 652 -4596 -9409 -14824 -14621 -9264 -5801 -4805 -8196 -6816 -8449 -5347 -2879 -925 948 -816
16635 -816 3347 3475 745 -3232 -6535 -6370 -7111 -10151 -8592 -6048 -4536 -8288 -10493 -7400 -805 1851
16619 1851 3798 4409 2469 -1262 -5007 -12015 -16552 -14233 -12178 -7395 -638 -1224 -3216 -4794 -4765 -6491
16603 -6491 -9137 -9529 -7194 -7341 -1917 -413 -2406 -3593 -5193 -6145 -1611 -1251 -6646 -9969 -9660 -9173
16587 -9173 -11622 -14943 -12937 -12411 -7551 -3731 -6430 -8065 -8618 -7096 -5075 -2955 -5980 -7202 -1324
16572 -1324 571 395 730 3428 2365 -520 -1661 5745 12041 15246 14097 13340 4420 1040 2493
16557 2493 -5724 -9029 -11093 -4477 -5770 -5417 -7693 -7980 -3708 3826 11548 7195 -1543 1075 437
16542 437 -719 -2220 -1610 1966 1602 1710 -3918 -10631 -11942 -6392 -1794 -2515 -831 -5588 -10781 -10293
16526 -10293 -4785 -2878 -7057 -5261 -4946 -8424 -5026 -7547 -10198 -13230 -15499 -11640 -6662 -5976 -5748
16511 -5748 -5335 -6737 -10278 -10523 -14509 -11075 -14579 -18795 -18294 -13702 -12517 -7877 1008 3344 -1424
16496 -1424 1694 1883 -2493 -1682 2180 4932 2506 -3282 -5614 -4110 -2510 -1212 -4170 -6038 -7407
16481 -7407 -7169 -9038 -10136 -9751 -12302 -8372 -1956 3447 -874 -2861 -5996 -7562 -13151 -11812 -8092
16466 -8092 -3353 -4629 -2119 -1757 -7592 -13717 -14213 -11107 -7990 -386 7334 4094 -4737 -256 1443
16451 1443 3572 3004 930 5683 286 82 2804 -505 1720 -1231 -4767 -6229 -2449 245 2820
16436 2820 -27 -8812 -3817 536 -1146 -1399 -1862 -3146 -5439 -8080 -1769 -4314 -7685 -2854 152
16421 152 5112 7256 1075 -5424 -6180 -1066 -548 -5752 -8597 -8378 -11224 -7913 -3045 -348 -1688 294
16405 294 1157 48 -257 768 -3688 -13478 -13458 -10693 -4541 890 -1607 -6015 -4674 -6110 -11110 -11961
16389 -11961 -7282 -7192 -12050 -4880 228 -1218 287 -1964 -3480 -4790 -13108 -14506 -15385 -11531 -5700
16374 -5700 -1373 6144 4882 -5221 -4072 -1406 3861 5372 6090 2467 -9187 -12635 -10053 -9964 -5111
16359 -5111 -4471 -4549 -22 2141 -1305 -3533 -2788 -2387 -4726 -8241 -7173 -10670 -12507 -17802 -10533 -7151
16343 -7151 -10553 -7757 -6661 -12528 -6249 2722 6307 5504 1939 -7266 -13491 -8469 -2127 -6598 -8765
16328 -8765 -9066 -11348 -10729 -8503 -10424 -7478 -5784 -6521 -9085 -12192 -5445 -834 -5704 -12231 -16033
16313 -16033 -25030 -20107 -13663 -7370 -5022 -5028 -6386 -9000 -12485 -15845 -20404 -15355 -7841 -8382 -13666
16298 -13666 -11410 -8746 -3616 -992 -2818 44 -134 2532 1435 5569 5876 -3627 -4996 -6487 -5572
16283 -5572 -4309 -6639 -5940 -6824 -12549 -15471 -15673 -13940 -15530 -13189 -10769 -6933 -3660 -2613 -2970 5985
16267 5985 7061 -1722 -1262 1508 2198 749 -7598 -12854 -8762 -1791 -6816 -8457 -5118 -7992 -11669
16252 -11669 -9155 -10422 -13738 -9477 -2430 2882 3847 -821 -4234 -6815 -4752 -11782 -9485 -4865 -5849
16237 -5849 -5276 -3906 -3274 -3041 -4795 -4933 -2306 -8744 -5413 -5422 -10773 -16604 -17389 -15870 -8987 -5815 -3022
16220 -3022 -2197 -5925 -11543 -9142 -4489 -7953 -11996 -14032 -13183 -14343 -12918 -5697 -2711 -2513 -10262
16205 -10262 -13627 -12752 -12993 -5394 -3683 -4075 -4114 -1099 -526 685 6544 4039 -3903 -6892 -2749 -651
16189 -651 -7597 -14740 -14893 -17516 -14703 -11136 -10322 -8138 -7103 -6768 -9026 -449 -2129 -11702 -14271 -6847
16173 -6847 -8592 -7797 -2711 -9780 -5054 -10578 -18189 -14493 -6229 -7309 -4259 -4910 -1188 -2454 -5280
16158 -5280 -6361 -13672 -22259 -16730 -12449 -15085 -12822 -14357 -10920 -6711 -6997 -3466 -6222 -7523 -12402
16143 -12402 -14782 -19992 -15597 -12797 -7246 -8129 -4011 -1388 -2364 -2810 -239 2226 4136 6448 3661
16128 3661 4432 5193 -1565 -3950 2159 -2567 -12531 -12316 -7839 -5338 -5838 -8403 -6769 -5909 -7249 -15044
16112 -15044 -8291 -642 148 -685 444 -2446 -9099 -6979 -1638 -512 -5676 -3154 -6042 -5344 -736
16097 -736 967 3287 113 565 3086 1179 -3937 -9071 -13198 -8435 -2806 3146 1734 -725 -4001
16082 -4001 -4712 229 296 1411 78 -7245 -5200 845 9382 2503 -8366 -12082 -13068 -11246 -10591 -8496
16066 -8496 -4731 -552 3463 7166 4884 1861 -1527 -7436 -11247 -13045 -15741 -12061 -6040 -5672 -2324
16051 -2324 524 -841 -2167 -2613 -5957 -9285 -3101 2062 -503 2048 7310 7566 6002 2609 3365
16036 3365 233 -4882 -1929 -2365 -933 65 -3344 -5650 -7046 -5773 -222 2379 1842 3751 4883
16021 4883 8169 11598 4399 1724 -1704 2407 4227 3033 495 -3324 -9471 -13064 -11364 -10751 -10759 -11780
16005 -11780 -7822 -3001 -1681 -6518 -6561 -5382 -1101 -3175 -3075 3025 1522 -4312 -5979 -6070 -9349 -3593
15989 -3593 -3277 83 396 -7474 -8746 -6021 -8408 -9829 -3806 -5746 -6319 -10039 -4951 -1361 -2521
15974 -2521 -3976 -6189 -4582 -1050 924 4234 -113 -10569 -11098 -4575 4112 8652 4259 4160 5077
15959 5077 -2614 -7674 -8765 -10133 -15859 -18064 -18380 -14751 -9087 -12289 -17026 -17047 -12739 -7915 -1512
15944 -1512 -1045 986 552 -4211 -13996 -16619 -10785 -8515 -5250 1310 -1089 -4629 -2355 -631 -7323
15929 -7323 -12558 -9117 -6069 -6350 -10257 -7091 -5426 -4941 -30 1499 4105 4519 5044 2110 -5394 -10622
15913 -10622 -14654 -7460 -2096 -7044 -6352 -2150 -4899 -7335 -9550 -4270 -6385 -3566 -7110 -13789 -18902
15898 -18902 -14891 -13347 -11421 -8356 -5978 -10843 -19355 -22018 -16952 -16604 -18747 -14938 -17696 -20818 -23928
15883 -23928 -24299 -19842 -14772 -11266 -13776 -12075 -17182 -17986 -10374 -6930 -5434 -4455 -11479 -6286 -2506
15868 -2506 -9902 -13108 -12207 -11643 -7943 -695 6780 2555 -4899 -9787 -7244 -8754 -9526 -13495 -10916
15853 -10916 -11070 -9484 -4256 -5382 -14298 -11278 -8824 -8446 -9099 -7910 -15103 -21701 -17726 -12350 -2908
15838 -2908 1155 -5599 -5079 4236 1189 -6215 -7490 -8684 -5685 -8404 -4928 6534 6715 722 -5061
15823 -5061 -13234 -14519 -12299 -13503 -12437 -17092 -14101 -10171 -10156 -11171 -8051 -7853 -9660 -5537 414
15808 414 533 484 4490 6436 1729 -1615 3232 8612 8722 3059 -3655 -8672 -6273 -3375 -6212 -7774
15792 -7774 -2939 795 3507 3915 4166 3762 6476 3541 -7192 -11491 -10078 -6370 -10713 -17143 -14567
15777 -14567 -11754 -5643 -4541 -9346 -4207 3274 3566 -2379 -6643 2719 4459 3453 -3279 -10757 -7986
15762 -7986 -9235 -15168 -12353 -5342 337 608 -383 2451 2037 -4572 -6743 -9610 -16982 -17719 -12550 -12785
15746 -12785 -10577 -10073 -5498 -3311 -8424 -19728 -19786 -14443 -7873 -6518 -11734 -10889 -7807 -12446 -10497
15731 -10497 -4059 -5614 -6182 -8181 -12697 -13862 -15803 -15744 -11813 -10985 -11774 -7094 -10046 -8078 -9879 -10283
15715 -10283 -8235 -8752 -15566 -16875 -14058 -17258 -20150 -16313 -14482 -13135 -11195 -5880 -7531 -6721 -6661
15700 -6661 -9971 -8068 -6661 -4574 513 700 -1027 -4722 6169 7159 256 -801 -5803 -2013 -861
15685 -861 1199 1155 2158 9434 8165 7526 908 -10385 -7882 -5712 -9002 -8707 -9466 -9133 -4331 -9120
15669 -9120 -14732 -14608 -17249 -11414 -1720 2490 5895 6429 -3982 -8867 -11638 -12795 -13814 -14894 -17461
15654 -17461 -14668 -15198 -17095 -19882 -23889 -23236 -20075 -17034 -15808 -20609 -17553 -15116 -14613 -12654 -9788
15639 -9788 -8229 -6604 -8893 -11998 -19349 -19812 -15601 -15447 -17777 -16298 -9997 -5614 -8111 -15074 -15408
15624 -15408 -13074 -11534 -13298 -13682 -15011 -12673 -15197 -13903 -16368 -18277 -15405 -15287 -15595 -16025 -11913
15609 -11913 -5450 -4237 -4271 -2956 -7397 -6622 -5103 -4765 -10380 -15248 -13298 -11083 -4927 -4044 -5608 -7207
15593 -7207 -6845 -4845 -5782 -8099 -6188 -4324 -8937 -8155 -6562 -8555 -10621 -6605 -5427 -8410 -4263
15578 -4263 -4897 -1951 3418 -894 -1044 5871 8408 8388 6685 12885 13538 15046 12319 6920 -7 -8490
15562 -8490 -7925 3401 8350 4669 3793 5641 6775 5846 8402 8654 9670 11853 11927 12424 10029 5229
15546 5229 2847 -964 -926 6297 8657 4471 6064 2082 3873 340 -4098 -650 263 6631 9159
15531 9159 9683 13138 16148 19310 23693 23258 23508 25862 25471 24323 19893 21302 23344 26742 21686 19541
15515 19541 19307 19264 17826 16513 12561 12629 13813 15843 17545 9598 3271 2036 440 5897 8365 7524
15499 7524 -1003 -5174 -1282 2955 280 -2367 1441 7193 12429 8370 6268 8280 6410 1201 957
15484 957 -2505 -1144 -2733 -882 -2435 4065 2441 2892 2570 4288 7082 6802 4518 -3589 -8425 -13248
15468 -13248 -13462 -9901 -12438 -7792 -5780 -6627 -13299 -21107 -20704 -18842 -18308 -20438 -17662 -14674 -9456
15453 -9456 -6868 -9085 -8117 -2950 -1013 -3788 -2226 -5286 -5966 -3252 4228 3883 -5168 -12195 -12191 -9666
15437 -9666 -9671 -10579 -9053 -7188 -4765 3006 2134 0 -3801 -8458 -8567 -6668 -8409 -6566 -3270 -1729
15421 -1729 -2345 1782 2811 7055 3996 -256 -7175 -12012 -13480 -9422 -8625 -9970 -13164 -6606 -5431
15406 -5431 -8008 -5906 -5231 -3656 -3238 -5606 -13406 -14922 -13812 -2203 -3950 -5388 -3541 -7798 -14349
15391 -14349 -11664 -9759 -5633 -3995 -9206 -10667 -11390 -9071 -8263 -17494 -18810 -14586 -9464 -8059 -7786
15376 -7786 -10895 -15378 -15784 -10951 -9262 -12231 -6831 -5773 -6627 -5379 -7715 -7481 -13145 -12709 -15403 -16788
15360 -16788 -15508 -13446 -15785 -17046 -16294 -11875 -10723 -11637 -19328 -22505 -14296 -8596 -11771 -10190 -6363
15345 -6363 -8345 -6001 -10344 -18456 -16894 -13248 -8216 -9412 -10909 -8325 -10546 -8398 -5483 -1076 -1343
15330 -1343 -2249 -6305 -5755 -7606 -8861 -11356 -14315 -15911 -13293 -9643 -11007 -13780 -8415 -6171 -421
15315 -421 -3958 -10549 -18791 -13629 -12216 -16104 -16512 -10396 -13122 -10265 -5462 -4253 -6789 -18336 -21627
15300 -21627 -9410 -1547 -7153 -12515 -11601 -14500 -14485 -11980 -11818 -7624 -8567 -4974 -2534 923 1030 -8694
15284 -8694 -13561 -14321 -9555 -8613 -8255 -6195 -8360 -16850 -13949 -2794 523 3112 1917 -5874 -3962
15269 -3962 -2186 1785 1751 4472 4119 -409 -6666 -13479 -13727 -11134 -7033 -6893 -11064 -12483 -7601 -8542
15253 -8542 -14766 -16964 -15027 -11282 -9379 -10095 -8661 -8688 -9542 -6849 -8046 -4739 -4439 -5561 -8213 -7318
15237 -7318 -5400 -3347 -161 -91 -2349 -5921 -4924 -2422 -4187 -6791 -8724 -9877 -6187 -8456 -8453 -7523
15221 -7523 -712 -9086 -15104 -20178 -22754 -24257 -21498 -22853 -15688 -16581 -19331 -16778 -14410 -17843 -19212
15206 -19212 -13729 -11954 -13813 -8715 -8396 -11166 -11616 -10053 -5141 -8287 -8646 -13542 -10744 -10849 -12650
15191 -12650 -11552 -7470 -6990 -10358 -6897 -9674 -11710 -7453 -10018 -13996 -15519 -14193 -12208 -3513 -601
15176 -601 -8810 -13346 -9996 -10263 -8224 -9423 -12712 -15532 -12112 -7806 -6660 -8078 -8372 -5166 -1250
15161 -1250 -2745 -9069 -5828 99 -2400 -10881 -15121 -8066 -2474 -1631 -3511 -7148 -7216 -2367 2836
15146 2836 -1724 -8442 -7461 -10625 -11741 -7811 -3585 -8998 -15287 -8916 -10237 -5824 -5887 -12541 -17106
15131 -17106 -22604 -19884 -12818 -10500 -13722 -7542 -1804 937 5684 5746 -2083 -11871 -13603 -15057 -14534
15116 -14534 -15645 -11883 -7294 -12460 -12075 -4986 -2626 -5864 -8181 -11700 -11456 -14232 -17969 -18603 -17392
15101 -17392 -17085 -12407 -8908 -6970 366 -4285 -4365 -1127 -1026 -1885 1928 300 -5092 -2180 -5159 -8732
15085 -8732 -6058 -8119 -3837 104 -2153 -161 -6403 -9767 -14997 -12202 -12683 -11573 -9420 -11441 -9901
15070 -9901 -7296 -9729 -13157 -11160 -7798 -4312 -8572 -14709 -14195 -9739 -7182 -6578 -2102 6844 14664
15055 14664 3383 -6171 -10733 -4641 -8879 -9078 -13288 -16377 -20679 -15132 -12526 -9484 -9581 -9578 -12295 -18375
15039 -18375 -16904 -10104 -2435 -4764 -9452 -9992 -11276 -12848 -11627 -13152 -15256 -17326 -12500 -9231 -4323
15024 -4323 -606 -2461 -3613 -130 -163 5107 -1084 -6746 -9252 -12541 -12447 -10592 -10756 -13439 -14547 -17437
15008 -17437 -17480 -10736 -4193 -566 -5749 -6688 -10110 -9479 -5420 -5095 -4985 -7751 -8016 -6964 -9813 -9931
14992 -9931 -12097 -14876 -8979 -2066 -1847 -2665 1362 2326 -7083 -6918 -6837 -10576 -7783 -6761 -6958 -12233
14976 -12233 -14411 -11596 -12122 -16188 -19795 -23961 -28570 -21232 -15060 -16516 -19473 -18091 -12578 -13251 -9606
14961 -9606 -8402 -152 5742 6666 -853 -5240 -11360 -17576 -17124 -15417 -11449 -12337 -11105 -14395 -15408
14946 -15408 -14487 -11003 -9726 -7393 -3527 -7418 -11305 -13727 -11495 -6865 -3300 -3307 -1119 3907 5453
14931 5453 12322 17770 16951 10726 6277 2939 -99 4043 6987 1167 -1532 -1937 -654 -1374 -2299 -6196
14915 -6196 -4870 -1149 3181 -1092 -7575 -7233 -5826 -6523 -11516 -15002 -14611 -9510 -4651 -6704 -6000 -5476
14899 -5476 1947 -3715 -5422 -3360 -8918 -11047 -5869 -548 1680 3295 -1459 -7070 -7614 -8698 -9238
14884 -9238 -12602 -10193 -11229 -9211 -4085 -3148 -6282 -5659 -4610 -7522 -7495 -9914 -12101 -13494 -17176 -19861
14868 -19861 -13691 -8508 -2444 1184 -3299 -1804 -3314 -5598 -4513 -4985 -10781 -11071 -6924 -7855 -7927 -7418
14852 -7418 -4475 -3389 -10050 -11065 -7458 -7853 -14699 -9940 -7090 -8855 -6211 -6593 -7243 -3706 175
14837 175 -3032 605 7510 9741 9068 2974 -5746 -4863 2032 -663 -8628 -3687 -6248 -7101 2702 106
14821 106 -6603 -5509 -5605 -8681 -14620 -8180 -8454 -9580 -4101 -5062 -6552 -9090 -5745 -519 33 -4612
14805 -4612 -2558 -733 -2696 197 3186 -5200 -8736 -17459 -14358 -10352 -5905 -7502 -1597 4222 4390
14790 4390 2368 2915 172 -92 5273 7488 7783 8235 4983 1379 -49 1964 2854 6437 9440 13298
14774 13298 7780 -1943 -220 4593 -2876 -2953 -4462 -5066 -2929 -10918 -5988 -2796 -1744 -6159 -10090
14759 -10090 -10033 -11192 -4388 -2008 862 -3124 -6415 -9374 -10304 -14515 -13228 -4198 147 3625 -206
14744 -206 -4086 2795 8021 2094 -4267 -11193 -8819 -4804 -2130 -2047 -6399 -7585 -7008 -9814 -13629 -11878
14728 -11878 -8531 -1844 934 -2374 -4139 -163 10766 10542 12361 16302 11129 4873 -3716 -5167
14714 -5167 -6431 -10116 -11118 -5709 -159 4739 8205 9183 5626 3974 1974 3485 -555 2583 2332
14699 2332 3294 3141 1609 1946 5227 5952 3263 1150 -2574 -72 6092 5171 2392 598 2346 3097
14683 3097 5983 7601 1723 -4004 -10117 -6521 -8324 -7759 2884 4280 -2241 -3765 -2440 -1503 -7235
14668 -7235 -9329 -7377 -6000 -9454 -6606 -1419 454 -2017 -3117 237 5259 6817 -826 -9121 -5031
14653 -5031 -5975 -9369 -11763 -12150 -10367 -4926 -4846 690 2674 6985 10746 9679 4916 2525 1521 -3632
14637 -3632 -4805 -6391 -3447 4087 1772 -3199 -1492 -1018 46 4916 5849 2715 2474 1193 -2195
14622 -2195 937 3778 3516 525 1151 -3801 -9333 -14771 -17827 -12147 -8748 -7899 -5719 -2732 2352
14607 2352 6468 5121 -2356 4118 6147 5903 7818 7171 731 2704 6695 7352 1617 2294 1717 4471
14591 4471 9104 4870 -606 -2785 -1930 949 -3048 -7961 -12786 -13324 -7084 1488 5676 7849 10834
14576 10834 3737 -6297 -2316 2763 746 1036 3722 4266 10006 3726 -6464 -6233 -4602 2451 2067
14561 2067 4319 1895 -3389 -5459 -9061 -4384 1921 3779 4082 5785 4066 1942 2313 210 107
14546 107 662 937 -615 -5011 -5109 -354 298 -5504 -4104 -202 2306 1729 3680 4312 5850 2636 5577
14529 5577 2282 -2099 -3516 2127 6769 4784 2842 5431 8656 6979 1854 -4920 -6180 2009 4433
14514 4433 4595 4542 5628 7086 6014 4345 -760 -3706 -3114 -2704 1495 10350 4273 1824 5455 3191
14498 3191 10630 12667 6204 85 44 1021 209 -2802 1043 1821 4400 6236 9006 8298 8965 949
14482 949 -815 1376 4608 6923 -2316 -5342 -9569 -3634 -6593 -8914 -7006 -2725 3772 6049 1916
14467 1916 5169 6518 10280 5653 6258 2391 236 6135 7219 1272 -6506 -5113 1582 2871 1989
14452 1989 -2854 -1220 71 5048 5618 -1172 2591 8359 4752 4342 768 3453 7740 3751 8640
14437 8640 11145 1016 -35 -547 -556 -1859 4009 7265 3141 2823 4691 5838 5692 770 1497 8140
14421 8140 14992 14982 18271 13805 1626 6123 3971 2378 9927 6825 -1258 3707 13301 21125 21167
14406 21167 16539 17490 17401 18954 13351 16119 20729 16468 16001 19991 27506 29577 26816 28516 34618
14391 34618 33530 27643 28431 28153 27213 25235 29056 36618 46313 51100 54046 61904 65241 75230 86625
14376 86625 95055 96062 102340 105080 116292 130070 145418 168733 189356 219495 253206 292331
14364 292331 343208 413515 501121 608048 735706 884276 1050223 1225925 1401414 1566261
14354 1566261 1715885 1837214 1930496 1999416 2042766 2063615 2073318 2068040 2047430 2014959 1957403
14343 1957403 1870907 1758469 1621073 1469871 1298202 1125604 958498 807559 674107 567241
14333 567241 476289 399948 339132 293880 256499 228237 204599 183591 165258 153969 145393 138654
14321 138654 131451 123811 111723 103811 97990 91941 81933 74831 73067 69105 65342 54847 54366 54538
14307 54538 54499 55425 51265 35554 34206 28554 26572 21800 23183 30414 27820 24509 27821 25853 24857
14292 24857 27613 27477 27975 24365 20956 22301 17320 11898 9644 16388 16907 16272 15177 15079 16235 15166
14276 15166 11388 14321 9234 4706 7584 9648 6915 10043 12320 7291 792 -889 4393 -1967
14262 -1967 2624 4814 5796 8079 6229 -1453 2359 5857 4079 5449 8488 11588 11756 5517 -697
14247 -697 3775 13893 20443 22048 18190 11629 9575 8454 8385 15368 19041 17708 14027 19406 25246
14232 25246 18217 10172 8750 9162 6927 1389 -5357 -6339 -1731 5499 9095 11488 8795 3670 3424
14217 3424 2779 668 -924 -866 6768 8589 15706 19221 14804 10824 10222 15860 24132 31406 35755 32250
14201 32250 34892 36135 31433 31828 30472 32821 30883 25540 19298 21225 20493 13109 9342 2094 4682
14186 4682 9844 12040 8700 5503 5662 3931 826 2999 6050 4020 10716 14352 13434 17836 13269
14171 13269 14142 14280 10759 8054 3395 5128 8418 10561 17890 27740 29243 32185 26882 16358 15158
14156 15158 15255 15394 12135 9962 11533 14530 14270 11943 10695 6805 3787 7604 15435 8356 8388 9744
14140 9744 8942 14535 10125 327 -7049 -2353 4586 7783 17897 14096 12350 10271 11357 6319 1915
14125 1915 4804 5305 -2830 -4539 -391 1555 -647 -1532 1951 6126 12671 17917 15925 11738 4558
14110 4558 2676 2332 3006 2357 7982 16202 15278 9633 8400 4807 6177 10316 19855 19908 16581 16609 20961
14093 20961 15530 14519 9031 5527 3948 2969 2829 1028 -147 -6333 -7050 -7040 -5100 -4984 -3279 -5551
14077 -5551 -9293 -4340 -4375 -6688 510 5063 3025 1694 6090 707 -2154 -9224 -5158 -602 2839
14062 2839 4018 1927 5052 10471 12074 10907 10524 4756 11637 15105 10254 10750 8968 13899 23664
14047 23664 23364 21732 21028 19160 20283 23411 19945 15415 6703 3832 8658 9793 10395 11894 12755
14032 12755 8389 1888 4942 6553 9426 14149 12317 11860 12056 11655 11582 9614 10063 5834 5909 12247
14016 12247 14996 13635 15635 16366 9327 5353 5928 -791 -2661 6738 14006 11657 4461 10719 17725
14001 17725 21223 22941 19074 13732 13105 15031 13215 9165 7018 2875 1146 4353 12088 15198 12443
13986 12443 10280 7475 7933 12967 8389 6225 711 -4411 -5622 -5862 -3767 -3441 6508 11852 17678
13971 17678 20504 16427 15067 23070 23305 23145 29340 27036 29765 34897 32910 32278 30967 29972 27200
13956 27200 25486 29601 29004 29612 28981 29575 28273 23656 17095 17204 15110 19763 28963 29879 32686 30000
13940 30000 20570 15820 19816 22849 27218 28356 29330 27866 25837 29111 24894 24873 23896 22126 23942
13925 23942 27895 23631 15504 20932 24931 30906 34065 33330 37392 40748 44518 49121 53410 50857 43718
13910 43718 46224 47434 47519 44262 38773 34873 30351 25222 25077 28481 35246 43238 41191 36392 26736
13895 26736 29184 34479 29445 33763 37236 38445 34833 36072 46580 42096 44634 40574 36683 30453
13881 30453 32376 43152 41902 36835 34305 35804 36554 39629 46430 50896 44671 48032 51891 55881
13867 55881 54235 54588 57198 53865 52733 49996 59093 66986 65940 69597 71910 77182 76396 79436 83127
13852 83127 79884 86237 95520 107859 109270 112828 114518 115005 113755 110424 120297 133668 136915 134240
13838 134240 129354 128914 130272 138129 145110 147970 148495 147085 142099 140018 137346 139958 142138 135572 135394
13823 135394 125837 124542 131605 136995 133550 131466 142437 142732 141730 139572 134159 137754 150059 147711
13809 147711 152809 157114 157890 162035 163684 164363 165447 178867 194417 215342 235102 257878 274186
13796 274186 285103 295223 310941 322149 320457 308103 293165 270635 253359 238942 220665 204214
13784 204214 185726 168756 151597 140855 128147 118031 114407 108872 98506 91670 89399 90477
13772 90477 85777 75115 75195 74818 78351 69691 55200 51209 53317 51378 48373 48157 45409 46747 46755 39449
13756 39449 37979 38519 42756 51857 55010 55369 55079 55328 59075 64012 63789 71171 79152 77073 76511 74371
13740 74371 70532 71876 75661 77191 80144 80974 84614 91570 94888 93594 96340 100692 103670 106071 110776
13725 110776 118118 128792 142031 155294 167124 175111 185120 198021 205091 224402 236863 245819
13713 245819 251025 254356 271154 289141 303746 309638 311045 317595 328073 318972 304294 296627 292087
13700 292087 278070 258147 238159 217227 201936 185810 165345 147925 135721 122372 108105
13689 108105 94919 82965 77139 72756 73808 71447 68822 60670 59273 56855 52021 52557 61833 71115
13675 71115 72175 71732 73305 76902 88067 97920 109396 118819 121063 122581 119627 113501 104454 92103
13661 92103 81250 72994 66655 57258 52710 50435 42869 36597 37850 34229 29290 29873 23452 22981 21204
13646 21204 23585 23925 22729 28303 31288 29330 32288 30548 25655 26303 32148 25877 25725 29599 30724
13631 30724 27693 27472 24300 21434 27056 30011 25825 25330 17825 14373 12666 12335 14403 17445 19782
13616 19782 22408 19412 18399 16162 9744 10984 10400 13807 13621 19020 14337 6672 11586 17380 17449
13601 17449 14346 14079 12141 9426 9032 8257 9499 5794 9034 10377 7910 7712 13530 18172 21797
13586 21797 23486 21311 24921 37459 46731 56243 61601 67568 72675 73157 66582 49862 34054 21399
13572 21399 21209 19888 16602 15408 6572 3250 7250 6423 2868 -2371 -1774 -625 11669 12160 11460
13557 11460 16102 9075 11299 9618 5189 31 3324 6881 6968 13147 18718 28801 32755 27109 24069
13542 24069 22236 14260 17517 18879 11985 6490 2977 5260 6079 8768 6806 8269 9657 16042 13473
13527 13473 24356 32897 24388 15982 16559 12264 18126 18536 14770 12680 11301 12453 16888 17621 15294
13512 15294 16546 17068 19512 15247 14853 14301 17323 9721 6225 7514 6404 8472 16414 20698 17633
13497 17633 9590 4640 6217 6709 7735 12842 11824 5314 6906 6897 2187 3875 1838 1689 856 -4683
13481 -4683 -8428 -9778 153 9473 9746 7046 -243 -8660 -8522 -1717 6300 4737 -537 3067 5268
13466 5268 6394 8892 8840 6942 1345 6078 12954 10403 4811 -4487 -4377 1659 -1850 -3340 2291
13451 2291 7481 7639 7737 9816 5464 1143 2226 4520 2299 2851 5323 7929 1351 -1052 4139 5246
13435 5246 6893 13239 12611 9625 12610 11059 11034 13878 19909 21335 22220 15072 13128 16317 17645 22297
13419 22297 25997 21577 26104 27862 28012 25277 30717 47753 59124 65245 74167 80787 90081 94899
13405 94899 98296 98312 99142 91173 78880 67729 53896 44721 42096 43139 37058 30340 29833 32496 26415
13390 26415 18674 19140 22173 20245 21902 27557 24098 14602 15001 15487 17040 18898 21989 26933 25976
13375 25976 22678 26061 20939 19707 21644 18014 12429 13941 16435 15717 18570 18163 22265 25037 22047
13360 22047 13386 7670 9844 10537 10103 7810 5986 8693 16208 24886 26591 29851 37513 37833 34009
13345 34009 46882 57581 64797 73853 81444 92120 107011 125897 154322 190263 222899 262140
13333 262140 311843 373430 443198 522732 599706 672494 736253 777602 786720 772069 735369 684873
13321 684873 611862 525498 440991 367544 311556 265303 219405 183545 157271 139469 126386
13310 126386 111813 98675 93261 82495 73803 73646 77622 74015 64350 52944 45319 45378 45235 38722
13296 38722 35317 38719 37663 27974 27374 30792 23721 20269 19226 22076 23332 15940 14477 15677 16243
13281 16243 20497 26140 26872 20588 19938 21983 24791 28751 25428 22141 21252 22124 28290 26401 20294
13266 20294 19883 19946 19426 21254 19478 23034 18774 13416 6116 3949 5032 12060 11672 13155 15311 16525
13250 16525 20900 24818 19582 15524 12802 10933 9325 11079 14646 17527 23076 22935 18764 16596 17165
13235 17165 21191 21210 27379 21844 14264 11443 16820 19562 14676 17362 16898 12755 9079 10694 10061
13220 10061 5375 7786 11761 16367 16962 18989 19694 17783 18223 18114 17019 9647 8244 15614 23232
13205 23232 23385 20327 18455 18376 15816 12414 15014 5079 241 -21 -6465 -9055 -10281 -12586 -11713 -13527
13189 -13527 -7263 1622 4004 2310 3109 -5216 -12113 -7873 4763 6880 9731 14916 18078 19339
13175 19339 16542 17440 18844 22764 23803 15759 12167 11491 14614 23786 32640 40552 42020 40054 39312
13160 39312 40704 43356 49386 53015 65731 77187 82871 88996 107627 120592 132283 133865 134472
13147 134472 130550 126168 119504 103813 87981 81012 68822 50861 47046 46623 38748 30928 20833
13134 20833 17658 15760 12335 17570 23551 34193 40582 36244 38234 42731 45227 43313 41653 48469
13120 48469 57337 59158 57255 60141 59801 63920 70104 78723 80241 77026 74053 66474 58277 54089 54541
13105 54541 56223 58567 51892 46707 48329 45316 35467 28117 25487 26060 24646 23425 21677 24052 24075
13090 24075 22993 24013 21371 19861 17117 11946 11903 15451 16016 14069 14547 15271 23438 27426 35423 39777
13074 39777 42435 44486 50601 60846 73018 81940 92386 96426 100336 96031 93553 94237 93723 91877
13060 91877 89696 89741 83843 82265 79664 71316 67505 69738 72551 71872 69513 66504 66883 64860 68045
13045 68045 76335 86713 95984 104670 105251 109997 117910 123862 130115 136107 145703 153326 155926 164968
13031 164968 171765 179266 189851 194864 201456 209321 218807 228951 230869 235672 241443 250796 259760 263234
13017 263234 268467 269657 270382 268437 271793 280298 292985 299894 307678 323154 333197 346000 358598
13004 358598 378485 402209 430782 464659 507911 547698 595853 657902 718557 789776 866362
12993 866362 947376 1036468 1111618 1172215 1212471 1232328 1234928 1216652 1175715 1125337 1071012 1008393
12981 1008393 946085 891611 840663 797756 753189 723658 700790 679388 664367 660767 655348 653325
12969 653325 650014 648642 652076 648897 650164 654827 664680 682316 702665 721374 743282 765107 790247
12956 790247 824915 861155 901134 950379 995059 1045360 1089184 1135826 1177741 1223851 1268523
12945 1268523 1312658 1362756 1415026 1475436 1536369 1601435 1677202 1761074 1845769 1932885 2021774
12934 2021774 2119209 2219276 2325427 2452991 2593764 2744033 2910449 3094103 3295732 3520931
12924 3520931 3772566 4062762 4386245 4752426 5174217 5652814 6199809 6828110 7553347
12915 7553347 8406484 9403913 10575338 11967930 13619050 15587581 17947052 20807770
12907 20807770 24331518 28752625 34363719 41505780 50489517 61497275 74393089 88680118
12899 88680118 103593963 118097579 130654880 139605022 144152448 144328547 140098917 131487590
12891 131487590 119349738 105225672 90616402 76637244 64033481 53255150 44441426
12884 44441426 37434354 31914893 27545221 24030798 21156704 18754572 16711691 14957975
12876 14957975 13445479 12130478 10985834 9989917 9131598 8391204 7748964 7194759 6699123
12867 6699123 6255729 5859704 5502389 5168402 4852204 4559666 4289894 4032306 3796456
12858 3796456 3583332 3383961 3194460 3017763 2857088 2714896 2582384 2456673 2354535
12849 2354535 2258722 2157260 2062535 1981850 1906867 1835142 1768964 1711050 1654005 1599412 1549011
12838 1549011 1508082 1468016 1433090 1399002 1364486 1323574 1287190 1262605 1235125 1203713 1181960
12827 1181960 1150399 1122966 1097214 1067841 1037310 1009084 984346 962680 938171 907883 881038
12816 881038 857556 833764 817267 790338 769387 757487 741293 721105 706163 693941 675512
12805 675512 657678 647317 633014 612736 596489 583451 576913 563905 556049 547775 536492 523944
12793 523944 511827 501219 496241 493486 488397 483478 473641 465785 456731 455049 448607 437905 429581
12780 429581 421908 416479 415612 406826 392038 382580 391671 402721 398433 395888 391573 382028 375805 375438
12766 375438 368089 351987 343020 343207 342336 335321 323941 319722 310564 302302 296485 295363 297446 300470
12752 300470 296584 292293 295287 295158 296954 299911 304109 305037 307723 319040 324454 322426 318426 309064
12738 309064 300917 288029 274281 268458 266678 263922 261513 260043 254289 243627 238863 243646 251207
12725 251207 253985 255519 253358 257230 263603 268266 275026 281025 288475 299584 312117 326430 337337
12712 337337 338472 342149 340753 336496 331791 319871 309951 319059 318345 313647 305840 304416 312240 319441
12698 319441 323519 319017 326098 336556 344271 350053 358394 374099 386131 400290 421045 439494 448451
12685 448451 465264 479121 487342 498380 503779 502350 491895 477035 465231 448708 429091 400275
12673 400275 370667 347273 325696 302911 290615 284486 272580 260326 250585 239262 239636 235786
12661 235786 228613 222528 228865 234598 234273 225262 217864 213140 210518 205381 196439 182435 174304 168421
12647 168421 164719 169376 173408 173564 173656 171042 171383 172802 170017 169737 167894 161965 166952 172756 173828
12632 173828 173149 165302 157759 144920 138508 137306 139675 134627 131774 133208 131400 131399 132975 132486 140915
12617 140915 154591 167433 175538 175002 171371 175742 180171 181980 179271 174569 172083 176300 184609 189702
12603 189702 189287 187396 189095 191327 205202 215910 223139 232267 239134 232574 216167 192830 170178
12590 170178 161210 151664 139642 128752 128735 125274 123580 120339 122314 124100 130739 133402 136545 142032
12576 142032 150109 165657 184000 201744 218947 217596 212175 205232 198882 199927 207418 223663 250286
12563 250286 285478 321589 364404 390145 378976 354653 340543 358291 389252 390283 371381 355367
12551 355367 348728 357028 377134 431262 526414 632462 733008 798887 798186 766136 757845 815555
12539 815555 978118 1269459 1678876 2219780 2842672 3057637 2756229 2334146 2125772 2173175
12529 2173175 2242413 2144087 1901169 1647975 1467116 1367924 1341361 1408157 1580439 1840548
12519 1840548 2082741 2131991 1990867 1826566 1769609 1835225 1910227 1953425 2065139 2330343
12509 2330343 2670317 2808387 2712734 2513339 2318963 2234614 2309295 2514183 2793424 3059748
12499 3059748 3308779 3537283 3826670 4211125 4811695 5790701 7042332 7717162 7139899
12490 7139899 5953253 4894538 4326611 4087440 3900550 3626236 3284206 2971525 2719203
12481 2719203 2541525 2513445 2648904 2876459 3069471 3038035 2745278 2400820 2186716 2110491
12471 2110491 2067921 2019406 2009797 2109822 2288743 2416440 2362460 2179186 1994904 1912115
12461 1912115 1955634 2092682 2303063 2551091 2790932 2973557 3043093 2983630 2922888 3038436
12451 3038436 3420425 3726199 3412475 2744221 2052113 1553518 1247145 1084407 1028541 1031501
12441 1031501 1047697 1015959 935567 825649 708133 615065 557987 535962 525612 521483 521907
12430 521907 519068 501458 472586 452756 452612 463189 452056 422370 379902 332143 290594 259099
12418 259099 241018 239668 242649 250021 256373 257496 243420 214513 187455 174181 167394 160253 153171
12405 153171 141895 133696 127925 126906 130048 131954 128462 128265 132363 126175 125972 132542 140427 145983
12391 145983 147196 150498 156781 148772 136079 124132 117183 119630 123496 125907 132266 123448 114839 109943
12377 109943 120524 131197 138176 140956 142217 144692 153894 153961 148504 141117 132269 124860 126145 146008
12363 146008 166465 180170 183375 172804 167724 155574 136653 125396 122358 122305 119991 120815 121248 124453
12349 124453 128846 135566 140893 135922 138305 142628 141598 147182 150736 157506 158834 156076 150655 148788
12335 148788 149322 150340 151247 150622 160467 169518 181583 200005 223602 247949 277254 291310 292868
12322 292868 278644 251369 217957 198699 181165 164406 152202 142482 142593 144891 148881 152522 144768
12309 144768 139088 141249 138966 142914 143341 139577 135068 130073 126272 122327 127895 125839 127719 126239
12295 126239 122510 119434 113132 116082 123932 139775 155121 164553 165981 161165 149586 133151 114555
12282 114555 102624 97724 103753 102245 89551 80633 81276 85167 94585 94787 97013 96030 96469 90921 84668
12267 84668 74410 77193 78156 78993 76997 87470 98615 101471 101237 107223 118541 125688 132134 134307
12253 134307 138531 137271 139330 155454 168317 176722 178006 186041 194509 210635 218961 222284 225378
12240 225378 229213 235132 234910 230866 221186 210404 203285 191993 185163 184739 177269 167620 156151 153614
12226 153614 157293 160657 162296 163934 166362 170560 175206 179202 185124 193093 205575 220396 234078
12213 234078 246562 262849 281324 301374 316476 330978 347861 367650 369947 371256 373219 369120
12201 369120 364410 361797 353135 341444 331695 320817 299623 286958 272796 266547 257843 243153 228350
12188 228350 212655 202992 195996 184839 179037 173055 174939 170927 167351 161966 162922 165182 169224 171606
12174 171606 174331 179253 182224 185842 198772 208292 220340 229491 229121 234177 242147 242036 245307 240099
12160 240099 229774 223555 213600 198793 186097 175737 161968 147487 138417 132499 121960 115129
12148 115129 112426 110901 103919 88104 82914 73413 74442 71515 66441 67740 67657 61394 63586 64673
12134 64673 68143 72678 74101 66939 58601 55102 56315 57062 56323 56375 52251 47149 47302 48393 45242 42944
12118 42944 43398 46149 49742 45674 49634 50078 49031 48697 45733 47451 47468 40822 41500 43679 38557 37728
12102 37728 41612 46174 42738 41169 41555 41707 39794 40516 37719 34574 34832 36813 35091 37644 41037
12087 41037 38239 32450 35239 34602 38705 40472 39080 34802 34774 35812 37212 40495 36194 36197 42066 44984
12071 44984 51086 52994 51004 49699 51448 47672 43926 38615 35185 30680 28696 26832 23701 27419
12057 27419 34714 31939 28549 25746 24307 25765 29094 32718 38963 39622 38275 34821 40093 39129 38725
12042 38725 43631 43612 40200 41358 41118 42317 42189 36058 37530 42300 43310 48019 55578 64438 67241
12027 67241 63960 56255 54203 47015 41199 39871 42332 45014 42274 34964 34907 35860 36538 38159 36091
12012 36091 36209 31073 35539 32803 36110 38422 35214 24462 23209 31366 31092 27255 26679 25753 29935
11997 29935 28049 24296 26589 24337 30633 35776 31327 28915 29269 32128 37285 41078 47290 52729 42902
11982 42902 28332 24259 26921 24931 25918 27300 28701 20710 16592 17470 17154 18588 20699 19916 17543
11967 17543 15141 14586 18449 17897 17266 23868 24361 23417 18019 19302 27180 30953 19663 17455 18490
11952 18490 21161 24716 19012 21201 24899 24804 32219 32484 25139 19957 17668 22915 24612 29153 28004
11937 28004 29537 32643 35731 36313 32800 27188 24654 28810 31162 27177 26006 30059 31646 33240 31374
11922 31374 25335 17454 19559 24336 25550 21208 15371 13865 16971 16798 18695 23736 24622 26184 29052
11907 29052 33976 39812 41688 36954 26125 21181 21128 23338 27668 29068 33297 29680 31789 29352 21269
11892 21269 18299 24289 29715 29759 29841 30989 33163 32921 29484 29674 35893 42343 38881 41194 43254 40149
11876 40149 30303 26118 25320 33379 33657 31017 28074 29536 35540 41781 38500 33270 33634 33886 35341
11861 35341 32969 31204 33854 37479 38212 36252 30694 35307 38888 39010 36299 32517 33853 39470 42509
11846 42509 52241 51757 41447 38240 41974 45207 47519 48856 52490 47530 43069 40853 39409 39378 38108
11831 38108 33079 26688 25272 28014 33127 38597 33892 31743 30426 27781 31376 33400 32150 23726
11817 23726 23788 29747 33321 31457 30936 28063 26670 31800 32327 30088 28648 28007 33735 40013 37259 36638
11801 36638 32062 32812 35162 37421 40166 41645 44048 41330 39420 34013 29912 24136 20520 28802 32265
11786 32265 29705 26485 27499 29988 34493 37660 36646 38385 36907 31849 34908 37998 40567 35617
11772 35617 30105 32231 33037 29035 24186 27918 28096 28411 25411 20967 18626 19579 26610 23438 21503
11757 21503 17406 13813 16914 20810 25219 27390 25367 19063 18141 19467 20973 15152 13789 21442 22985
11742 22985 26202 23476 18969 18152 26263 26845 27134 24129 19235 17330 21642 26508 29444 20625 15977
11727 15977 15871 13040 10578 6904 5312 8149 12390 19199 21598 23751 18764 14570 12698 17004 25823
11712 25823 24282 19350 20653 25040 25245 21526 19705 20969 21927 24373 17799 13883 22441 26259 25055
11697 25055 17595 10215 12220 18583 18499 19228 14679 14915 20248 22249 16933 11905 13213 17333 12006
11682 12006 8379 6471 16645 14628 9249 10617 14839 15478 19862 21015 23298 21539 16971 10450
11668 10450 11574 7712 5666 6433 2636 4308 10869 12067 14391 12564 14596 12548 12354 9046 9118
11653 9118 14829 17119 21534 28079 26514 24871 25390 31785 27668 21122 19464 21989 20515 19029 19588
11638 19588 14090 16241 16304 21731 27228 22753 22559 20762 24537 29394 32090 32751 30287 26925 19876
11623 19876 18477 21482 20024 23106 33537 39105 43342 43512 43919 42658 37772 36699 40802 47474 57809
11608 57809 55955 48641 45195 48331 51565 56449 58350 56018 52473 50310 49064 48149 45635 42498 39770
11593 39770 28126 24398 25817 27575 24161 23759 27233 29937 26892 15256 17835 26015 25539 28104
11579 28104 27205 25454 17660 18187 22599 28521 23484 26862 23995 18844 18217 20753 15064 13179 17666
11564 17666 20816 14452 16106 28247 31661 26885 18439 17932 20334 21917 19284 11595 11926 7400 2947
11549 2947 9161 14560 10832 10990 11689 20987 24755 18259 18938 24754 17359 12874 18164 19269 17721
11534 17721 19035 18263 19545 21996 24566 24931 29114 23348 16091 12393 18601 21204 22133 26923 23609
11519 23609 19756 20511 19511 14635 14587 12414 13191 15783 15318 13751 11912 8872 -909 -2988 2876 8625
11503 8625 11885 13196 13063 13231 12708 14413 21374 22029 23977 23090 18824 16485 18312 22092 23561 26966
11487 26966 26005 21901 19753 14766 13111 15426 19879 18302 20404 22378 25610 22501 16459 11448 14689
11472 14689 20563 27449 26016 19295 15333 18702 18825 18576 19899 20573 23546 19874 15234 15098 16919
11457 16919 14768 16204 18036 9351 11818 10986 8968 11411 11562 15071 17449 17652 20940 25469 24336
11442 24336 15288 9478 14080 22206 24589 25092 23635 28653 33280 28365 23392 23394 22072 21163 18374 24689
11426 24689 29819 26094 25586 24767 19561 20413 20086 21063 16449 12674 17757 20853 21155 20222 14470 17558
11410 17558 22467 21720 20331 17790 19404 23990 25938 29816 32298 25276 19064 21284 20216 21936 22741
11395 22741 19454 21300 24217 22363 20980 22209 23931 24488 23720 20377 13733 12932 16734 18878 16249
11380 16249 19549 17193 7561 7728 14703 20869 25045 26201 26703 30086 23273 13123 12165 17368 22043
11365 22043 16511 11185 19305 22739 23389 25933 21178 19813 9311 7565 13246 14673 19464 21305
11351 21305 22543 21144 18010 23929 26205 23454 21632 23284 24792 25211 16621 12949 12941 12642 18557 21237
11335 21237 22423 19695 16068 25071 24075 17349 21321 21250 20547 23341 22082 25100 29501 21710 25724
11320 25724 26929 24161 21714 25531 22689 18540 21280 30691 35099 30939 28900 23583 21793 21988 17849
11305 17849 11513 12979 14016 16747 16344 19948 22179 24538 31465 33642 27681 22316 16592 16082 20509
11290 20509 21042 20215 18862 21010 19924 20635 19169 17238 15524 9894 3132 12611 22742 28871 29266
11275 29266 31339 36905 39664 37099 31790 34560 35604 32492 31549 32670 31816 24935 20001 23853 25583
11260 25583 28706 24610 25411 25906 30411 33824 34971 29046 30316 30002 30485 31533 36098 39584 34134
11245 34134 29275 27678 26261 24169 20583 19240 23134 19968 18225 14518 12818 12922 11338 18181 25092
11230 25092 24559 25152 30604 29132 28023 29867 27054 22015 12413 7647 5366 10672 22070 26598 21071
11215 21071 25702 30101 27152 19132 24637 31216 39077 35987 26653 19625 12776 17586 23919 28822
11201 28822 28204 27204 27385 24976 25252 27302 23278 24823 25518 26572 32335 36876 31231 29227 31064
11186 31064 29045 27001 28617 36948 32686 24222 21636 27521 38833 44410 38081 34369 32629 21386
11172 21386 8038 277 1966 8482 15853 28983 42023 44752 44277 40649 29864 18167 11472
11159 11472 9197 20886 40368 49271 47474 46186 49241 49021 42043 25595 19113 24481 36409 47119
11145 47119 46111 36334 31018 25792 18535 18212 21777 21632 23808 28323 26200 23052 24257 24944 24556
11130 24556 25320 27727 32769 37742 44861 43915 38470 39886 37486 34847 34502 27565 22097 22321 22515 20948
11114 20948 26361 25368 25251 22824 25417 34834 39886 34980 27285 26407 31698 25480 21037 26508 41924
11099 41924 47839 50983 47892 39980 33862 38796 44189 54095 66050 66800 65230 59399 52343 47483
11085 47483 37241 30228 28099 29075 31499 38154 40583 43556 39695 37377 37975 39222 41449 42507 39244
11070 39244 33964 27118 27378 39178 41647 38340 33058 34044 33043 35310 30666 28441 31810 28962 26004
11055 26004 26157 30006 29619 29362 30531 31982 32585 37226 37680 41593 40295 38081 38258 41902 40264 34468
11039 34468 36191 38464 39032 38304 35803 32993 29082 34186 32956 22673 21049 34543 42302 48933
11025 48933 56560 59826 63726 65024 58677 53939 53782 52182 52323 52311 47913 48806 50271 45993 40107 40203
11009 40203 34023 31865 38155 37026 37390 39222 40876 39496 37741 40588 41709 41036 34942 35591 36542
10994 36542 32985 31664 33235 32059 34076 29948 21373 22818 34682 33865 33553 31129 28457 32624 35852
10979 35852 38047 39433 41936 43818 44135 37994 31698 34814 39490 43362 39642 39710 38872 40867 41963
10964 41963 41400 37642 35013 36842 36249 33384 34195 37668 43960 43716 46308 53395 56347 57172 51835 58623
10948 58623 67056 72197 72068 73935 83646 86767 79905 77173 75963 83809 94636 98229 96235 85083
10934 85083 70078 61806 59809 53446 51696 57106 59042 63065 69919 83588 107874 138201 174812
10921 174812 218199 244854 231811 191113 146031 107820 86909 74951 63572 66757 67859 64250
10909 64250 62732 67589 72350 76195 80451 85553 85125 92006 93861 93880 82592 76493 75967 76333 75926 76103
10893 76103 74275 70802 61406 61762 61819 57034 53490 54516 57296 54318 60601 67461 66947 67037 67841 62309
10877 62309 64846 67499 62653 63565 62022 61530 60748 70388 69661 68498 66721 57364 47112 42389 37218
10862 37218 30914 34858 37240 33034 31286 35101 41487 45224 39495 42525 39809 36447 39867 41757
10848 41757 39541 35855 38491 42092 40061 38448 35665 29380 35526 45910 44527 49799 56697 55109
10834 55109 56179 57380 62719 66969 76486 85470 88605 92256 99022 103253 105697 101274 89270 85032
10820 85032 88991 91417 96707 99635 103234 104090 106429 110833 119166 129373 137533 142985 149359 149981 156838
10805 156838 164327 170778 182575 194914 225314 272081 336401 434636 575222 767238 1016504
10794 1016504 1272041 1495483 1712877 1862800 1844111 1687430 1473599 1229816 975847 747846
10784 747846 570985 446590 360326 305172 282460 266437 247472 225955 204811 186447 175305
10773 175305 166966 158936 154144 156386 155953 157875 157987 160569 165331 159259 155757 154216 163593 175807
10759 175807 183015 187235 197319 202643 200886 207875 214894 213630 220850 230643 240483 250651 258562 269380
10745 269380 279224 299363 314892 321854 327152 327919 332587 343765 355751 363864 367904 374817 392917
10732 392917 424607 462251 521436 571742 565350 509687 431565 364745 318810 285811 264378 245487
10720 245487 230795 227904 229824 222902 222849 231239 240487 240177 238436 247624 267187 278464 287510 304628
10706 304628 313849 315810 331227 346726 360356 391439 442687 505781 569986 660907 773686 932771
10694 932771 1170083 1517176 2027812 2793611 3858319 5154034 6454669 7323993 7277247
10685 7277247 6384245 5075582 3798822 2777476 2059297 1570306 1238742 1023715 873520
10676 873520 760922 678563 609019 549068 496240 456043 429280 406634 393883 382233 363952
10665 363952 339558 326421 311172 298254 283290 267891 261763 264909 279134 305927 348191 410830
10653 410830 504114 587078 642855 663847 662424 648032 606145 549728 509805 502669 490134 450951
10641 450951 412172 387183 357144 318183 283436 254416 225829 201045 174961 158238 143748
10630 143748 127583 119225 107516 101384 107665 116783 133988 152074 170951 176601 179423 185348 184175
10617 184175 170988 166955 165271 159236 149279 143364 143289 144855 152445 155985 155442 155709 162185 170417 173724
10602 173724 182691 182213 177649 174333 171791 161376 149231 139871 127470 112569 107970 101491 94806
10589 94806 96278 97350 107029 130777 153901 165937 167672 162177 154451 144314 131881 130731 126775
10576 126775 122451 129280 155268 179664 204468 215954 222070 212960 211139 213289 215300 228216 237244
10563 237244 247698 254677 257096 264545 276705 299506 322481 347349 367845 389442 411455 446863
10551 446863 496089 557926 645740 772938 968405 1281217 1791271 2592376 3740543 5099063
10541 5099063 5704800 5199997 4404697 4017243 4325738 5196816 5879142 5353102 4131139
10532 4131139 2905884 2071045 1581436 1296503 1121798 1011207 923717 849907 797553 762454
10522 762454 744714 744261 755192 763897 757364 758895 770422 803782 844345 890132 959790 1052104
10510 1052104 1168356 1328368 1546877 1863356 2314463 2917109 3646980 4430251 5203436
10501 5203436 5971066 6575668 6593517 6049870 5278776 4489580 3705163 2974797 2361139 1905546
10491 1905546 1576329 1343038 1174208 1054323 979880 926648 872855 830696 807337 791735
10481 791735 781203 778057 784779 803542 826620 860778 901913 955324 1026800 1109691 1203586 1280170
10469 1280170 1325210 1323367 1274380 1203362 1112888 1028385 945410 870363 819366 785363 763631
10458 763631 752238 759032 771455 792571 822544 855167 892549 939651 985000 1013821 1042404 1075178
10446 1075178 1111209 1158240 1207883 1252696 1306977 1373667 1439980 1524321 1626404 1756867 1930017
10435 1930017 2115783 2288864 2482992 2721388 2997192 3225891 3344051 3422332 3523421 3648387
10425 3648387 3778739 3904760 3995094 4044146 4096700 4191033 4365204 4647715 5045654 5582638
10415 5582638 6270001 7107281 8034277 8977684 9925539 10819488 11535583 12149192 12873414
10406 12873414 13821317 15039710 16683839 18946643 21910559 25780664 31126549 38833086
10398 38833086 50205227 67214285 92247593 127313604 171659092 216872957 255484537
10391 255484537 290726719 317241214 315701514 290278853 255306149 215869718 172396115
10384 172396115 130433304 96063144 71817258 55703132 44854322 37275083 31796027
10377 31796027 27694033 24416778 21687248 19438847 17595457 16042318 14695809 13557726
10369 13557726 12596237 11667972 10713697 9805661 8973524 8198853 7494599 6879792 6359265
10360 6359265 5915534 5539449 5216445 4922704 4652546 4392686 4148878 3917768 3701904
10351 3701904 3509910 3339778 3189676 3058043 2940594 2839473 2747385 2676873 2603961 2527364
10341 2527364 2452688 2377866 2317167 2276790 2253340 2243620 2257074 2283952 2304907 2298842 2242958 2150486
10329 2150486 2048553 1942448 1849435 1776461 1714409 1656368 1618792 1591553 1562670 1532916 1499709
10318 1499709 1471540 1433490 1383452 1328494 1281145 1237757 1201623 1162300 1131862 1109871 1090223
10307 1090223 1073054 1060843 1049210 1039282 1030449 1009965 987250 969856 958154 952000 938768 925480
10295 925480 911331 894041 869011 848335 828889 814873 795476 779570 770669 774374 787819 798282
10283 798282 805363 815425 823581 832915 845320 868165 899877 941539 1002946 1111147 1290686 1567126
10271 1567126 1949065 2385174 2634800 2477747 2075997 1657060 1357368 1169319 1042111
10262 1042111 946072 869553 806510 754708 713814 675395 641893 618651 615495 610579 597524 577995
10250 577995 569176 556384 547817 546068 548689 556096 555457 555016 562662 580100 597709 612319 619360 624611
10236 624611 621951 604504 591708 583488 570769 551789 531870 520607 507524 498222 494196 499648
10224 499648 511596 525499 535917 543379 543950 536445 527381 510866 502836 492153 474122 464654 462434
10211 462434 461421 464985 480641 497430 513141 518622 516240 518954 519312 517123 505878 498777 488852
10198 488852 480293 478765 478232 483722 499156 510113 522788 526481 528864 541793 561163 594768 645770
10185 645770 724873 851694 999375 1120484 1202994 1298194 1426763 1476661 1393746 1262529
10175 1262529 1158074 1070546 947257 804057 685808 609824 561243 529418 505757 484311
10165 484311 464633 449717 425481 402861 391310 381825 369883 370065 373202 382820 391456 397061 404374
10152 404374 404489 395770 380514 369629 363003 362340 357083 352944 350452 351470 354322 360694 370082 378353
10138 378353 381131 386563 393693 399661 399059 399923 395049 383502 376624 375221 373447 375237 374276 365855 357313
10123 357313 354723 358949 362933 362330 357245 347205 343524 337809 324045 314670 309568 312293 311020 304377
10109 304377 303654 308022 308563 313405 324736 333029 338933 342408 339772 342478 348676 354361 364818 377472
10095 377472 388900 394743 392409 385413 377909 363873 352840 343621 331562 321545 313580 303904 294538
10082 294538 285126 288069 288769 298564 310435 317591 323630 326698 326985 329119 332173 334300 334012 337168 340511
10067 340511 347799 359231 375222 385512 381169 378869 371618 372728 381056 388213 403001 415486 424542
10054 424542 430956 429402 423252 404738 386893 373651 363198 352546 343129 334461 331384 327726 321166
10041 321166 316582 311332 304538 304431 309720 312246 306928 308801 312649 309771 307782 311107 319106 318540 321835
10026 321835 321290 314182 314205 308036 309589 314557 315634 313037 317111 325734 325322 331778 340116 353267 357043
10011 357043 359568 371911 386360 405447 434504 477596 527006 603585 683067 760030 808633 800290
9999 800290 739037 652640 592703 556322 540522 536152 555214 592924 659046 758636 908248 1114731
9987 1114731 1377257 1640207 1889505 2108126 2203054 2110054 1909114 1678245 1428848 1173044
9977 1173044 943710 775355 665653 593591 542438 505448 478777 462306 452014 442168 430490
9966 430490 426887 427383 430566 432258 434767 433502 422834 406104 390675 381645 372670 362991 363465 369510
9952 369510 362346 355627 355960 354205 357459 364038 361407 354578 352019 356707 354666 354525 354760 356297 362898
9937 362898 365411 366654 372931 373893 368496 370620 374087 368034 360466 361838 357786 356301 358954 361019 361177
9922 361177 366785 373148 371256 370137 375866 384405 387668 393357 395489 393623 393397 391621 392555 389594 389774
9907 389774 394226 400547 407282 412914 412660 419763 430188 449695 482789 539288 604721 658288 673966
9894 673966 646478 609258 584788 601039 657630 740834 856202 962366 967288 874089 758196
9883 758196 674846 631094 623507 642533 681296 700766 675169 611472 545782 491745 457811 429605
9871 429605 416664 412457 402609 397891 397419 396875 396900 400576 403260 408101 407142 409393 408483 407243 405165 414554
9855 414554 419006 412100 411816 414504 414064 403054 397113 396149 392831 393728 395701 393731 397835 398424 400475
9840 400475 406769 409114 416521 425494 434839 450837 468346 476986 483381 499056 512019 515700 509461
9827 509461 504620 497564 479769 464744 455044 448491 438598 431363 430727 420839 415133 420477 428684 430353
9813 430353 437164 446740 453377 453300 452164 452939 460752 471595 493490 528086 556566 569199 563759 537256
9799 537256 505423 486850 470240 459217 450760 446316 449748 453236 449511 448336 452052 452242 445819 445515
9785 445515 442779 438776 444145 448114 449864 452670 455479 457057 452791 449156 452987 451657 454622 458831
9771 458831 459432 472445 477300 477973 474857 471121 461544 459585 461099 456019 455361 454528 458844 461853 464148
9756 464148 468679 471406 476389 478426 480950 484604 489861 492430 495144 495792 495676 497898 499149 500410 507585
9741 507585 510285 513005 521488 524174 528495 529850 527103 530471 532684 536818 542840 550223 555960 562205
9727 562205 567147 573830 577559 566581 555744 549701 545543 543316 549277 553481 554574 554756 554707 554896 556596
9712 556596 560396 566017 567836 567787 571090 580059 584758 584839 581955 582754 586561 593039 604171 614018 621061
9697 621061 623318 626283 632847 635515 637774 633799 626014 627519 621058 616342 616207 616223 612029 616175 619697
9682 619697 623746 625189 624490 623965 634721 643295 661024 675361 685783 701742 732731 770952 820620
9669 820620 896803 997928 1082968 1139364 1191165 1285260 1400435 1434555 1372521 1281224 1214426
9658 1214426 1178672 1131411 1064903 994467 934368 895651 872905 861255 859295 864833 867004 858761
9646 858761 842973 831565 818736 802803 793592 785796 774239 765152 762117 760481 759247 759816 762057
9633 762057 764723 767823 767361 777413 789549 795123 799096 789819 786387 788525 792627 794912 795076 805619
9619 805619 828492 857080 871024 879914 883968 884201 883374 880877 882294 886440 886712 896818 911327 915634
9605 915634 919239 914821 913763 909315 898466 895713 903413 918540 926280 928921 918139 910045 905238 892577
9591 892577 883926 884271 886078 890913 892143 891225 894004 900055 905341 913537 919554 923717 932379 946746 965095
9576 965095 990271 1030314 1091747 1154256 1186656 1197618 1195994 1203916 1206141 1191963 1160443 1120849
9564 1120849 1090672 1075306 1063784 1052994 1039455 1030796 1027811 1029284 1035665 1036345 1039134 1044154 1048187
9551 1048187 1062444 1078015 1093766 1110831 1124323 1142648 1169534 1195147 1226672 1277658 1353352
9540 1353352 1458690 1579955 1669411 1703573 1709590 1706151 1732862 1806206 1931057 2105884 2393149
9529 2393149 2857555 3520339 4121528 4174319 3869305 3481866 3201763 2979297 2736618 2470266
9519 2470266 2246942 2084728 1999989 1997034 2091384 2284982 2586482 2942154 3240814 3475865
9509 3475865 3777585 4136970 4309676 4295166 4151448 4052527 3964177 3824559 3701444 3562910
9499 3562910 3472715 3441229 3447921 3465771 3376395 3247051 3179237 3274123 3580239 4073382 4763683
9488 4763683 5754901 7114693 8755456 10233570 10377335 9160273 7442845 5946029 4914359
9479 4914359 4230618 3767670 3478517 3367578 3399801 3554079 3714508 3750488 3690767 3631137
9469 3631137 3711459 3896491 4087537 4269025 4418405 4547650 4632659 4695002 4588362 4324083
9459 4324083 4056480 3760151 3403262 3048466 2765305 2594533 2528808 2545596 2635329 2794493
9449 2794493 3029438 3291440 3535056 3760837 4031899 4380926 4751825 4761445 4272576 3653307
9439 3653307 3180987 2910986 2734836 2618195 2554094 2538383 2541792 2549613 2532084 2462949 2365055
9428 2365055 2281156 2222220 2189740 2172348 2171288 2169186 2172031 2175087 2189093 2201709 2205825 2206453 2215666
9415 2215666 2235080 2252167 2265450 2277466 2283471 2296462 2306194 2313664 2320185 2334483 2352244 2374709
9403 2374709 2413903 2464040 2495624 2506624 2519207 2521947 2523852 2501139 2457616 2434236 2413983 2406107
9391 2406107 2410615 2421985 2440890 2459117 2478572 2491298 2508527 2533259 2552816 2566501 2584545 2612273
9379 2612273 2632221 2650940 2686243 2713459 2734561 2753381 2769456 2791015 2807334 2809236 2812016 2817140
9367 2817140 2831844 2850976 2875528 2888267 2907418 2924857 2935817 2946681 2957057 2969167 2983074
9356 2983074 3001567 3014447 3028058 3048179 3067210 3080539 3097714 3121755 3144744 3165095 3192737
9345 3192737 3217602 3243968 3262537 3283340 3308644 3329912 3349718 3379229 3410502 3441398 3469429
9334 3469429 3503522 3543003 3578779 3607442 3633885 3662673 3688588 3711236 3728572 3757623 3787525
9323 3787525 3812715 3833986 3855157 3879024 3902752 3921179 3941860 3969347 3993607 4015410 4045189
9312 4045189 4073426 4100742 4135055 4168387 4194539 4229154 4259673 4287511 4319970 4362375 4402894
9301 4402894 4439590 4468181 4499144 4532561 4571598 4605111 4639350 4679336 4718704 4755651 4789343
9290 4789343 4821320 4853074 4893082 4925828 4959376 4991211 5019022 5054199 5095137 5130936 5167850
9279 5167850 5207309 5243025 5274940 5310121 5347346 5385597 5421446 5456436 5490704 5535521 5574445
9268 5574445 5611242 5657117 5702472 5743964 5794079 5835684 5872164 5907556 5949031 5991021 6031367
9257 6031367 6068049 6112610 6155695 6192305 6227181 6257923 6297068 6336590 6378448 6426460 6471205
9246 6471205 6514368 6562463 6606977 6644642 6683340 6727559 6766766 6813409 6852135 6884031 6922114
9235 6922114 6961244 6991041 7024572 7057544 7088398 7124888 7164738 7202484 7245253 7280429 7308495
9224 7308495 7343155 7386254 7426333 7466562 7512767 7564464 7615625 7665575 7705519 7738658 7753839
9213 7753839 7763008 7780472 7794424 7815846 7839719 7865361 7887572 7918261 7945143 7971870 8003388 8033828
9201 8033828 8060863 8089183 8114117 8129399 8140188 8152641 8163269 8174574 8189517 8199334 8210756 8221484
9189 8221484 8231174 8236278 8244744 8257275 8271285 8291965 8319136 8348675 8380889 8412867 8432608 8427639
9177 8427639 8398798 8362502 8327378 8298688 8271309 8246859 8229009 8218666 8208683 8198704 8185765 8171851
9165 8171851 8167325 8158380 8149623 8136956 8117520 8098114 8080832 8063784 8044803 8017205 7979863 7938597
9153 7938597 7901149 7877820 7853553 7828542 7800696 7769929 7739375 7720455 7702463 7685834 7665678
9142 7665678 7640279 7615807 7578044 7535161 7487085 7432783 7392026 7355487 7313431 7273619 7233788
9131 7233788 7200194 7164849 7133314 7098550 7058852 7018436 6979851 6937798 6895868 6856347 6822353
9120 6822353 6792777 6755768 6713546 6670386 6625416 6584118 6543303 6506645 6472706 6436777 6393276
9109 6393276 6353773 6317081 6277993 6237413 6194336 6150244 6112704 6074547 6034407 5988142 5946160
9098 5946160 5904080 5858650 5810584 5761296 5716880 5684456 5646013 5600772 5559192 5518362 5479906
9087 5479906 5440623 5406622 5370099 5329180 5286799 5247931 5210389 5168941 5127354 5091393 5062555
9076 5062555 5027053 4989386 4960204 4919325 4879741 4851901 4816478 4772938 4727963 4693952 4668861
9065 4668861 4644268 4608226 4569886 4529984 4504708 4481262 4452869 4419364 4381908 4347814 4317223
9054 4317223 4277152 4238822 4206013 4171095 4137240 4108918 4072862 4042176 4007863 3973294 3944540
9043 3944540 3916322 3888760 3862974 3833725 3799183 3767909 3739932 3714117 3686798 3656768 3625345
9032 3625345 3596494 3570378 3547969 3529245 3512594 3486835 3457888 3434458 3411100 3395754 3374902
9021 3374902 3361806 3350440 3333711 3314408 3284818 3254891 3230302 3207132 3180096 3145848 3113987
9010 3113987 3084232 3054849 3025905 3009821 2992559 2970571 2945642 2921827 2897444 2867997 2846456
8999 2846456 2829543 2815794 2804299 2784648 2765622 2748150 2731368 2717846 2701845 2683573 2664563
8988 2664563 2653060 2640819 2625514 2608540 2597374 2581069 2565645 2550228 2537113 2528877 2523145 2513664
8976 2513664 2509644 2511671 2510916 2508711 2508776 2520663 2533722 2548854 2575075 2608634 2650496 2705005 2775093
8963 2775093 2860567 2963230 3079465 3191544 3294909 3381225 3443718 3470458 3458979 3411319 3343432
8952 3343432 3255737 3146310 3024852 2912349 2800352 2697783 2595440 2506132 2428590 2355613
8942 2355613 2286307 2229383 2182197 2138804 2101244 2065448 2037704 2013622 1982701 1952006 1924467
8931 1924467 1904107 1887352 1874237 1858949 1840216 1824369 1810673 1794567 1779174 1760262 1738799
8920 1738799 1717535 1707948 1697353 1683743 1671458 1658583 1644551 1631976 1622564 1607550 1602380 1597808
8908 1597808 1594213 1579624 1562770 1552197 1537806 1536603 1531467 1525180 1514339 1498238 1487758 1481521
8896 1481521 1469625 1467393 1464808 1462072 1461843 1457280 1449089 1438812 1426046 1421800 1417715 1417285 1417751 1405380
8882 1405380 1395580 1392505 1380853 1379094 1371056 1364557 1356770 1349308 1344050 1349548 1358793 1359210 1355125 1354464
8868 1354464 1355757 1360135 1364232 1376315 1394272 1421695 1447157 1476059 1514268 1552939 1590877 1637854
8856 1637854 1703773 1769737 1833050 1917800 2052700 2261900 2571957 3046767 3805691 4963702
8846 4963702 6585388 8633062 10474094 10751745 9270346 7146183 5327685 4086728
8838 4086728 3283643 2754004 2398016 2158378 1998055 1879501 1795788 1726039 1654009 1582112
8828 1582112 1518843 1456339 1408049 1365929 1315274 1268365 1237685 1214289 1185432 1167091 1149141
8817 1149141 1133123 1118157 1102140 1086730 1073788 1065203 1049093 1035289 1020745 1017946 1008055 997475
8805 997475 991560 976686 968040 958730 957048 949168 939377 933495 930194 924580 923096 917882 910620 901435
8791 901435 896406 891988 890714 885032 875427 868077 870729 873401 872195 863820 849888 852967 852471 844769
8777 844769 837968 831552 826912 829928 831748 830491 826267 818583 808315 805198 805240 801567 804049 812846 808192
8762 808192 797473 791082 787578 781224 776773 774771 771223 767724 762749 753293 747512 743703 744373 741969
8748 741969 738853 738927 740481 732225 733763 736827 735043 728927 728723 724993 716465 718605 721317 720440 721236 726312
8732 726312 725911 719878 717773 713925 710476 706546 706039 709747 708505 703085 705414 710062 709312 712425 722607
8717 722607 735463 740523 747651 748309 749796 752940 760629 761382 758224 755003 746149 735224 723015 714727
8703 714727 709707 702882 705279 705963 701952 695350 690693 687385 686360 688075 684169 680036 681073 677295 673053
8688 673053 670815 671823 672032 671530 672321 675232 674565 669023 665677 669741 675095 682320 686503 685538 684797 694135
8672 694135 700725 711485 720381 718194 719900 719344 715442 700982 687746 675414 665372 663583 656132
8659 656132 644298 639182 639419 629490 627234 633523 637123 633024 631907 631775 626372 621096 618586 614088 606632
8644 606632 603471 601861 598120 599843 603409 601122 599094 593623 593478 589394 584084 589696 594096 593889 595440
8629 595440 601212 595327 598565 603327 608087 610518 611609 612944 612012 615668 624437 630371 635332 642321 654865
8614 654865 670318 681590 680216 680019 680416 681272 682635 685854 695301 715862 732719 742968 756067 770657
8600 770657 773881 771825 773067 777699 785950 795126 805477 810828 815549 815532 820832 823477 832623 840110 846549
8585 846549 852091 856725 861536 863995 868661 872490 870347 870163 869118 875469 889193 902575 922716 943437
8571 943437 961050 981289 1011074 1033863 1040694 1034247 1003752 960625 912416 866399 821857 780534
8559 780534 754417 736501 731404 721815 688420 649567 616734 600974 589692 573976 558078 552454
8547 552454 550339 537971 528888 526234 529783 532772 531718 528688 523099 506297 491462 485282 474098
8534 474098 458437 453663 445967 436967 429860 429795 431289 429660 424443 420138 420207 420768 414753 412827 406086
8519 406086 402961 398805 397784 402981 404733 405801 408188 416801 422052 418470 404084 391663 385833 378359
8505 378359 369951 367836 366198 361426 362140 362838 365679 367664 368177 363334 357693 351191 347440 346554 350364
8490 350364 350867 343141 336297 346261 341864 345358 347310 346062 343460 339576 335183 337682 336674 330486 333438
8475 333438 329184 325971 324506 318312 313735 315468 314408 317250 317077 316162 312109 305960 306090 315783 320403
8460 320403 319531 315658 315840 314003 313358 312207 312087 311672 306694 301837 301554 301462 307622 314271 318623 321719
8444 321719 326838 327526 327940 328338 327562 323401 322089 320798 313766 315059 312860 301792 294173 295455 294606
8429 294606 294356 294182 291578 283842 283690 289452 293078 293281 289638 284309 285801 282205 277859 273993 271086
8414 271086 278820 279631 277185 289997 306247 319824 327696 338406 348073 351344 340964 328389 326399
8401 326399 332059 330483 320975 318764 312400 298619 284718 276715 276980 273496 271456 270179 272721 275956
8387 275956 272326 261491 257586 261605 268419 271573 274822 271108 270119 265941 259994 265258 267539 267832 269006
8372 269006 265961 261472 258441 260748 250375 248316 250796 251637 250553 253825 257887 256988 259203 262339 262394
8357 262394 252693 244892 248204 252719 245943 245868 241987 238039 233222 230803 230093 230488 229461 231095 231496 234023
8341 234023 236695 243529 255661 265033 264534 260048 262415 269207 270251 268154 258008 250788 255254 257148
8327 257148 245206 236051 231969 226838 224455 221384 217210 216166 222947 231046 233670 228210 229009 223866
8313 223866 215289 206289 211476 216917 216215 214141 214533 214000 217228 217125 216835 220569 218669 221791 224173 229291
8297 229291 237146 249410 257085 268483 278599 277634 271104 255628 239956 233492 224159 211575 209942
8284 209942 213107 210961 210931 211181 209099 208874 203859 199169 197368 192816 189750 193549 201246 199273 190743
8269 190743 188475 194848 201766 198023 192248 193807 195822 189524 186184 186061 186250 186085 188855 196389 207462
8254 207462 215184 222871 226178 218700 205007 200427 195339 192568 195144 195227 188413 186524 187506 189402 196314
8239 196314 194320 192276 186676 183889 179092 178396 181107 181955 180102 176623 171988 172209 172463 173492 174774
8224 174774 174561 175674 172420 170664 169389 176095 174273 172873 172703 172360 176212 176869 174042 171352 170539 166238
8208 166238 159110 159878 170290 172412 170473 170813 167027 168845 175224 177534 176324 174951 169973 164526 160840
8193 160840 157082 156354 161409 163950 165799 160532 156070 153936 151553 146537 147135 150025 149606 148538 149406
8178 149406 151768 150698 151254 145116 136236 134949 140378 143423 142556 140548 145353 148841 144467 141538 141696
8163 141696 141298 146436 152054 149826 144323 142079 146423 140490 135546 140759 136657 132625 135150 137446 137108
8148 137108 140704 143922 140954 144826 149292 145370 140834 135575 140056 146350 148716 146471 149410 146941
8134 146941 143183 142233 144935 142638 137014 138679 136077 138497 142132 140613 134203 131385 133205 133429 139490
8119 139490 142990 143955 145826 144586 141602 135769 134065 135530 141973 145885 147531 146982 144916 143016 138306
8104 138306 134334 137781 132723 126654 123949 121114 117575 124853 130030 131997 134212 128325 126604 123968
8090 123968 123704 120138 118101 123061 123302 117223 118576 127471 135836 126786 125586 136203 136500 135668 136816
8075 136816 138276 137369 132601 129933 131599 135018 139846 136850 136692 131979 132132 127591 128481 132674 135789
8060 135789 137257 133590 127153 127227 128262 126014 122790 125906 126374 125266 126114 128892 128511 130772 138211 143392
8044 143392 150897 148209 135826 134046 131187 125832 135342 146427 149271 155004 169899 184955 194660
8031 194660 199241 199634 196432 197586 202002 200737 196084 198772 199565 201973 201641 200692 206102 210802 214119
8016 214119 220829 222163 218256 211918 209026 208800 202372 203718 200067 194737 200019 197402 196794 196041 194650
8001 194650 194185 188990 190252 193743 196194 192571 198211 205322 218047 229503 231586 243942 253949 254149
7987 254149 252641 257070 276700 295161 306348 321646 336959 349105 349038 341333 345976 349321 349017 338075
7973 338075 320481 308760 289106 267187 259672 250891 246700 235013 221195 217184 209274 196983 187951
7960 187951 188142 193058 200979 202654 202315 199827 197362 196942 195981 188257 185839 191545 200493 210989 218482
7945 218482 223837 230888 233561 230005 235243 241362 249878 250562 250656 252156 250055 252907 251569 248904 251685
7930 251685 250818 246519 235469 224565 224571 215096 206015 196233 186612 180248 173695 168732 164814 154875 147692
7915 147692 147053 147538 145123 150600 157593 159869 153487 155297 156886 159889 159264 155646 153514 161200 166940
7900 166940 165681 163611 156167 153101 153530 154781 156832 159093 166402 170442 173808 181959 185470 192953 193575
7885 193575 184024 172814 165492 161918 157654 153614 151048 139445 126895 120171 110441 102270 101590 102948
7871 102948 101487 101509 96622 98858 103624 100363 93110 94668 97814 102912 98680 96122 96291 96428 93621
7856 93621 89414 82893 82254 82302 85181 80270 78294 78915 89460 93958 94027 96190 97474 95065 95879 95530
7840 95530 93294 88519 86504 90693 94954 93283 96024 95363 89953 84774 82326 85598 86622 79549 78012
7825 78012 80491 77487 73619 74894 79784 75845 72387 74547 75067 72489 71311 70275 73766 79978 77684
7810 77684 75791 71692 69349 70565 67994 68862 75128 76553 70041 67790 65736 65009 64323 67319 68323
7795 68323 73406 69422 60573 59224 60700 65134 62597 60194 61067 61736 60528 60901 64819 75405 73864
7780 73864 71504 70848 71193 67572 69649 66511 64483 65235 71746 73228 71049 71732 68955 71914 69305 73855
7764 73855 74359 70672 70283 66398 63870 60771 56637 57187 57732 59540 53599 45983 47073 49805 51146 57602
7748 57602 64154 64405 67220 71875 74727 73805 70822 65580 59325 54795 53214 51136 52077 50120 49559 50154
7732 50154 49239 47944 49772 54427 56190 63980 69427 69773 69641 69166 63640 56429 65789 64435 61136 62249
7716 62249 56530 53394 55499 59934 60603 60528 63323 58645 54269 51410 51129 50504 53961 56780 56996 58458
7700 58458 59523 61766 64137 65875 65100 58703 55680 56523 53622 51445 48760 54723 60273 61800 60931
7685 60931 63037 58353 56206 54423 50889 52737 55087 53500 54498 50097 42653 47992 53918 59183 61309
7670 61309 59415 54698 53165 50729 51240 57641 54247 53929 49383 48558 48632 50560 46784 47882 48451 48361 54903
7653 54903 51990 54450 46424 47716 51430 44018 46711 52885 56166 54952 52397 46489 45902 42309 42410
7638 42410 47814 50622 49425 48778 53001 53942 48621 45562 46296 55475 57443 56171 49033 44302 42508
7623 42508 47096 51446 49528 47480 41861 40023 42637 37760 45267 49159 42204 42375 47354 46504 52207
7608 52207 48508 39357 38584 40774 37741 37723 43809 41974 37083 38071 45871 51814 52797 50949 47521 38484
7592 38484 36034 40226 44505 47360 51205 49785 43641 45030 45316 42776 47921 47114 43823 46754 45186
7577 45186 43332 43374 42939 46318 40797 41674 38838 39345 41104 36694 33693 36967 40341 39386 44973 44284
7561 44284 38687 36239 40442 41793 46660 41102 45716 55001 56342 58214 50626 45216 44275 43422 37905
7546 37905 35419 37155 35834 39387 41741 43137 43063 48187 49494 46001 49196 49687 45277 40011 37556
7531 37556 39699 36842 28758 32874 39710 43318 41035 38613 39170 43775 43505 48853 43468 37963 37728
7516 37728 36501 32269 29012 29008 30214 37991 34608 30427 39176 45122 47859 45074 48221 47856 44942 45978
7500 45978 42929 39100 33390 30021 28905 32416 30533 30776 33692 37739 36598 32230 34817 38893 37657
7485 37657 36236 40795 39859 37761 36766 36903 40083 41813 44289 38222 34258 32466 31878 36029 34969 37279
7469 37279 42077 39355 34435 27785 28724 25526 20364 23878 31566 28545 31379 31821 34484 37869 41506
7454 41506 36464 31445 27836 22712 20556 25236 30386 38657 34528 30849 28887 27656 29154 29637 30210
7439 30210 33726 36194 31021 27620 31959 27644 29269 25956 30152 27339 26345 29906 38992 40895 39495
7424 39495 32598 28791 33010 37646 36626 35357 30595 33023 37009 38623 38241 31317 33109 33308 32119
7409 32119 36006 31218 25705 24268 25023 23835 19884 17882 23181 29305 30850 28398 22177 17765 20917
7394 20917 20942 26918 28810 38051 34630 23414 27834 26800 29858 34573 31068 27688 31215 33713 33225
7379 33225 29000 26713 30638 33323 36513 29457 27943 28356 32778 39459 41344 33278 32234 34748 29989
7364 29989 28089 30675 32007 27572 28283 27497 30313 31149 30907 29766 31786 31781 35650 35066 30266 22365 18595
7347 18595 18685 19668 30944 32863 23326 22797 22859 20130 23499 28013 34250 37143 39104 30025 23261 22612
7331 22612 20633 23285 21461 21185 28274 30856 23027 24498 28203 24035 21993 23564 23948 20372 18837
7316 18837 23159 22329 25024 30871 26863 21357 22352 16704 18071 23639 22648 17222 17170 15993 15394 19245
7300 19245 24866 24967 22668 23026 27417 25631 24904 26181 26014 29945 28410 26558 30369 26224 20093 16219
7284 16219 21889 25304 30904 26792 27437 25238 20218 20335 21042 20400 18563 18104 16654 19232 20308 14139
7268 14139 17882 24780 29502 29527 28440 20555 17463 17878 16512 20458 23572 22763 22781 26148 26784 24515
7252 24515 25014 21047 20022 19669 20628 21005 23506 18655 13666 12794 16854 25423 26486 28708 31239 27907
7236 27907 22288 20526 22678 27037 24381 22486 22171 22940 22104 20561 21749 25375 23178 24108 20555 17786
7220 17786 16684 21105 21875 19323 17069 15912 15394 16596 13208 18239 23359 23611 28781 20671 15295
7205 15295 12193 14422 19469 20150 20099 19688 13490 10526 7986 10895 19819 23896 23406 23977 30810 28059
7189 28059 25574 25420 27164 29760 29050 27007 25248 24996 22356 21012 17541 14332 12622 12247 24416
7174 24416 33781 27525 24757 25710 18757 14969 15162 18835 18987 17241 9996 6084 6064 10335 15384 24806
7158 24806 27578 23208 17255 15768 12485 10869 11375 20614 29615 32411 28874 28139 29173 23937 23117
7143 23117 25358 21193 13160 9687 15041 15804 14035 14418 18863 25731 22205 17792 22032 25614 29036
7128 29036 25064 16510 13139 18889 16557 9135 8589 13135 16601 18368 19075 25705 24359 23323 27337
7113 27337 26794 21998 22601 16877 13045 9367 14257 17070 17369 21260 21428 15851 5158 7525 10433
7098 10433 10583 18147 15509 11630 5659 10730 14366 13026 19264 23478 17302 15214 15671 19429 21665
7083 21665 20515 18954 21893 18638 16645 20569 21253 23941 21110 17581 24986 30125 31525 26157 21260
7068 21260 18506 16672 18141 16298 10329 5631 9543 12528 13060 15020 17569 16196 12874 10488 12727
7053 12727 22441 23101 19001 17621 14102 14678 16874 22259 24377 24184 22825 22110 17372 12965 15776 18295
7037 18295 21122 28376 28328 22794 21407 16737 12782 9644 11000 19403 18456 19557 21375 19659 14981
7022 14981 22524 31464 30646 28707 28008 23223 24649 27394 25104 17531 16808 18607 17982 17480 15057 23612
7006 23612 26248 18609 15943 19258 15208 8955 11686 8522 10248 10668 13715 15731 18156 22499 18699
6991 18699 11915 6792 2200 11656 19504 17884 20270 23034 17533 10440 11332 16590 15476 15812 14108
6976 14108 11794 9808 14997 17159 16738 17408 19676 19143 23873 21189 18974 19728 25183 29340 29280 27301
6960 27301 18023 13300 11007 12916 18237 17452 14584 19281 23027 20298 16679 13880 14149 14788 18183
6945 18183 14728 10199 13174 16626 12376 15907 17142 17578 21211 22068 22390 22293 22151 23693 19874 11937
6929 11937 5116 6080 13211 18845 18273 16493 17875 16496 10381 12340 18078 23092 21299 14636 6615
6914 6615 5924 13276 11122 17567 21426 14690 14203 12164 8458 8041 13847 14141 11510 7164 9295 13269
6898 13269 17333 15697 14577 12922 17005 21493 16557 15876 18874 19973 20585 13653 7513 10717 7828
6883 7828 8948 10935 16337 13921 13891 11992 9032 15805 25070 24132 19658 9453 9604 7522 2815 5445
6867 5445 16310 17864 23873 29649 25177 19402 16160 14699 11051 11666 15044 21431 20130 13274 8228
6852 8228 5118 6597 5702 3424 8525 9547 6963 4871 6992 7115 12345 11728 9398 12060 11898 9346
6836 9346 12216 15113 5533 1977 8133 11693 14317 15252 9613 1224 480 9414 18047 15843 9179
6821 9179 9294 14831 10439 9010 6818 6439 8047 5852 13485 14031 15071 9086 7569 5262 6629 8684
6805 8684 9583 9870 6875 6970 9825 10509 10949 18692 24918 31100 39693 58648 72380 74121 62768 43576
6789 43576 33130 32744 31029 26604 16964 8341 4725 5775 12070 13000 12658 10597 8496 7778 9452
6774 9452 12543 10929 11125 13646 14206 14550 12670 13096 16610 18892 18701 17374 16633 15242 10855 10406 16937
6757 16937 18267 13095 8967 12126 17119 21987 22588 22992 20300 17534 15616 9275 6533 13620 10805
6742 10805 3554 5359 12814 11989 12416 17234 18480 22498 27582 30285 29013 30223 29454 28069 29234
6727 29234 36065 41294 47186 56867 71492 94933 130255 172004 224402 239705 208756 153362 104586
6714 104586 77097 58236 41042 29157 25833 20949 20883 18025 18605 16248 18272 20010 20296 20744 17958
6699 17958 13810 21451 25826 22925 23308 25891 26948 18355 10765 9614 14048 15969 15095 11510 11529 7297
6683 7297 5335 6125 5219 7302 10006 11025 17029 19887 19165 15836 16354 14930 14231 6612 4312 358
6667 358 -6657 -2485 3170 2240 4200 5468 3977 6647 13266 13385 15053 16207 17879 15774 12704 9594
6651 9594 6447 6628 781 1119 9084 8544 9999 8412 8986 7240 7041 8768 10713 17005 15790 8717
6635 8717 2343 1302 4372 7922 4442 3253 2109 5797 10627 12083 11028 9252 10615 17470 17307
6620 17307 16040 15411 9878 6029 1603 381 -834 491 3674 2797 10381 17093 16490 16152 19373 15434
6604 15434 7085 2683 -199 779 6798 8162 4273 3257 1434 4833 10529 12518 9181 5123 6323
6589 6323 9244 7285 8634 8523 12639 13251 7963 2998 2551 6303 4384 7815 9942 8361 9603 7088
6573 7088 -3832 -9271 -4520 4272 8322 3717 769 -1593 637 -2627 -2320 -24 1589 5669 8746
6558 8746 8044 9740 15817 15170 11355 8804 4005 8417 12115 5413 9634 10175 7419 3346 4455 4797
6542 4797 2792 7285 11330 10771 16281 19386 14748 13875 15641 11991 9653 8887 9008 10685 8892 3815
6526 3815 8321 11827 7734 4353 2950 -2002 -1789 -5589 -5857 2545 9235 10476 6884 4514 5809
6511 5809 8739 -99 -790 -920 848 2554 160 1900 -225 3780 7300 6281 8038 8025 7651 5334
6495 5334 1701 -9968 -11388 -4035 2534 8796 8538 2573 -494 3903 4880 3053 6457 5945 1721
6480 1721 2614 6764 17149 19551 12029 8348 14125 13967 8955 5735 9969 7922 3539 986 1274
6465 1274 9950 14187 14263 9169 6835 7982 8875 2496 599 654 373 539 5624 2956 -6 1712 11012
6448 11012 23147 12749 5018 2357 5334 6081 9068 2209 -5091 -6532 411 10783 16035 15794
6434 15794 8945 11739 13289 7493 8256 11845 11072 7315 2767 4705 2989 2889 -2293 -3920 -4028 -1534
6418 -1534 -2176 2156 4477 1507 444 2304 -1952 804 5633 4949 -679 -5152 -5825 -1257 1942 10095
6402 10095 12082 9160 6389 6703 3529 9337 9297 2685 -589 -3151 -6890 -4775 -2499 -1534 4594 6971
6386 6971 3238 1392 2104 3116 2453 6896 6087 5401 10729 13252 8575 4599 3340 540 744 -2720
6370 -2720 445 6504 3452 1973 6581 6363 1898 2286 2748 -403 3526 10171 13396 2608 -1854
6355 -1854 3024 4779 5478 12675 13239 10134 6899 18826 24810 23444 15015 6553 7259 9502 10099 12262
6339 12262 8866 10805 5909 4758 3528 9972 14268 10791 5199 1726 3544 11065 12474 7971 6702
6324 6702 7179 9767 7413 7466 4417 1435 2658 7246 8220 3809 -3637 -7026 -7600 -8398 -3258 -3614 251
6307 251 2569 3602 4991 7639 6187 924 774 -3705 -8043 -6875 -3762 -8215 -10152 -7816 -3191
6292 -3191 -1301 68 -246 -2396 -951 961 3141 2711 128 -268 -6621 -9404 -10037 -7680 -10576 -16838
6276 -16838 -11325 -7000 -7394 -3971 4228 9172 1075 -1916 -878 4842 7678 6527 -2927 -5185 4745
6261 4745 7916 3500 5203 7709 2563 2265 730 -2629 -7056 -3447 -294 -479 -539 2751 5011 4087
6245 4087 -3286 -1993 3457 6938 8720 -1173 -5176 2600 5995 5825 2228 2020 1155 -1751 -210 2857
6229 2857 4630 2687 575 6298 10347 8225 7237 6125 5190 3468 -483 3452 2523 1933 -3833 -8904
6213 -8904 2337 5321 6234 7231 2426 1013 2583 1783 129 2247 -367 -5950 439 4319 1324
6198 1324 -4586 -6471 -10399 -6082 -3774 -3353 2123 4303 1087 2541 4579 10916 11503 6708 2205
6183 2205 -352 -1353 1552 5533 4943 5250 3791 751 3378 4290 5635 4923 4547 2244 -3485 -3389 -718
6166 -718 5185 9296 3497 -1715 -6967 -9286 -7168 -2774 458 -2126 -4448 -7890 -5586 -2862 -5604
6151 -5604 -3803 -4264 -4570 25 182 167 -2073 -2046 -4901 -9542 -6650 -4964 -5919 -4168 2715 -747 -5684
6134 -5684 -5201 -5522 -5814 -4689 -3566 -7027 -11242 -15411 -13046 -6610 1468 3809 -2377 -450 1592 -1486
6118 -1486 -262 5153 6850 4057 9010 6012 3243 -4730 -10631 -5563 -2201 -3449 42 -5819 -7778
6103 -7778 -1209 -2979 -4712 -4226 2605 3516 3038 -270 2796 9507 7769 3023 1545 2971 7376 8930
6087 8930 1049 -410 -1831 -4408 -11170 -12892 -14772 -15818 -11684 -3194 2159 4179 -1981 535 2826
6072 2826 2333 2368 -2386 -5720 -1947 -3472 -4163 -3281 -4717 -7385 -10501 -8377 -4812 -6953 -6846 -4948
6056 -4948 1787 3139 1047 -1846 -550 -961 -569 -2032 -3247 -5017 3075 -1578 -2172 2745 1663 4812
6040 4812 5564 1564 4524 6096 14876 16970 12356 11335 8115 7587 8974 7417 4056 2024 -2216
6025 -2216 -3665 -4242 2681 7586 -3070 -12599 -16341 -8446 -992 5241 9927 8892 9243 9294 4885 -5437
6009 -5437 -7479 -6936 -4989 -1850 2601 2491 -565 6377 10395 11106 17185 13013 7839 4241 -5161 -3997
5993 -3997 -4422 -4579 -5429 244 -485 -399 5887 9933 7117 3587 10117 16115 11840 8117 4039 1926
5977 1926 5760 6235 4277 2393 3817 4367 -6145 -9021 -6110 -8782 -6893 -1747 1417 1980 5006
5962 5006 5240 276 597 -2230 -4757 828 -349 -3987 -5139 -8140 1914 6693 3687 -2838 -1855
5947 -1855 3708 3654 3181 1698 -78 -798 -829 1403 -3278 -11010 -20750 -16117 -11957 -10992 -3443 -809 -7823
5930 -7823 -8472 -4777 -2516 -9078 -11490 -10421 -3994 68 706 -6506 -1595 507 2153 373 -4172
5915 -4172 -3433 1583 107 -816 -11 1383 197 5341 9233 4661 -752 -3651 68 3445 3130 1084
5899 1084 4774 5845 5632 369 4190 9193 11124 8117 3795 993 -2136 -672 2039 -87 2940
5884 2940 471 -4439 -3627 2543 -2652 -8958 -8810 -6228 -8431 4552 9811 14133 7199 -2353 -7608
5869 -7608 -1393 4652 7058 1452 -6101 -9306 -11018 -4508 1724 4698 2291 3318 1354 -227 -5579
5854 -5579 -10648 -2722 -2453 -1491 -3397 -4175 2730 8095 6421 1848 -385 -4542 -8314 -5271 -7839 -9359
5838 -9359 -10468 -9367 -11525 -10267 -7638 -508 2025 -4936 -4387 -7347 -2217 -1938 -3789 -7224 -10267
5823 -10267 -10783 -9582 -11341 -8496 -723 2826 2038 5111 9205 11252 8639 2059 2194 -99 -1010 -1875
5807 -1875 -6946 -10003 -2529 -775 -2624 -9364 -4439 -331 -1968 540 6996 3195 1185 683 -748
5792 -748 7543 9598 2024 -6434 -4341 1785 3990 -1099 -4101 -6622 -12481 -9302 -8166 -8162 -1065 1525
5776 1525 -1822 -3423 -1530 2273 4233 3569 -4886 -5228 -114 609 -4213 -5867 -352 407 -1272 1615
5760 1615 4013 3632 4312 2407 -181 2675 -826 741 371 -3531 -2310 2548 -1857 3474 -1327 -435
5744 -435 -1177 -2525 -4826 -2865 -3955 964 986 -511 -2968 -463 2002 -1486 -8491 -9944 -1313 4860
5728 4860 9339 5897 -336 -2017 -2444 3591 1225 -4905 -815 -938 -5752 -6142 -7346 -9378 -6056 -5025
5712 -5025 -675 6698 10018 4853 -697 -2389 -2493 -3496 228 1961 -4228 -6709 -8143 -1276 2584
5697 2584 4758 2067 -306 -609 956 -828 -3235 -2455 -5951 -2553 -1879 -9273 -11993 -10845 -11820 -6055
5681 -6055 -2376 -1276 -2252 3145 -731 -2463 -4647 -1209 2503 625 -3562 -3415 553 -717 -6244
5666 -6244 -7715 -7009 -7316 -3735 283 4423 10256 12018 6193 4765 3756 1581 53 339 -2513 -327
5650 -327 -872 4011 5213 5260 5253 4849 7060 5490 4336 -1943 3065 2715 2438 3487 1425 2492 1629 2990
5632 2990 2945 -33 1194 2377 -372 -4401 -5480 -1733 -423 -2262 -3976 -3558 -5014 -4303 -5618 -3748
5616 -3748 -2620 3917 6975 1497 -5556 -4756 -8756 -11992 -11041 -1723 -3825 -1611 -786 -2022 2968 4132
5600 4132 602 -3888 -1819 -2207 -3182 -6179 -8763 -8542 -3690 -2140 -3578 -5554 -1948 730 -5967 -8079
5584 -8079 -7075 -3829 -6448 -6726 -2190 1109 178 -7899 -8713 -5439 -7275 -5558 1296 3252 6164 6991
5568 6991 4456 854 571 1007 -2587 -7648 -13266 -13828 -10226 -1154 -472 -1917 -437 -855 422 -1191
5552 -1191 -3632 760 6051 -283 -1894 -4913 -520 -3867 -5425 -5454 -8332 -1868 2900 1129 -3928
5537 -3928 -7169 -6168 -1807 -1211 885 -6950 -10083 -10523 -4882 -3979 -7011 -9069 -9426 -10272 -1861 832
5521 832 -3708 -2831 -1233 -8825 -9342 -2686 595 6777 9800 6375 -314 -2458 2161 388 1478 6644
5505 6644 5362 -4455 -5875 644 1629 -3642 -2957 -6215 -6902 -4499 2881 2118 -1343 -5266 -5945 -4962
5489 -4962 -5209 -5663 -5120 -4979 -5548 -4220 -9436 -8063 -4308 -6175 -8085 -8788 -7676 -12201 -11876 -8282 -6481
5472 -6481 -5544 -4886 -6725 -5053 -3463 -7601 -11505 -11525 -5788 -2648 2108 2899 3807 582 -6243 -12289
5456 -12289 -12069 -11508 -11731 -10260 -9175 -8842 -10058 -13561 -11740 -8718 -7701 -2733 -2070 -7382 -8888 -7619
5440 -7619 -9408 -10744 -8337 -9541 -5652 -6286 -13413 -16136 -11276 -6264 -8160 -3589 -2442 -6654 -14052
5425 -14052 -16044 -8561 -3763 -11604 -5955 318 3081 4274 165 -2076 979 3858 2519 4650 -1776
5410 -1776 -1771 951 971 3992 4024 -721 -5313 -2825 -1587 -4996 -772 941 3441 1165 -5744 -7246 -10553
5393 -10553 -9199 -11668 -6455 -6377 -8151 -3973 -1797 -1176 -6713 -11673 -17776 -19124 -14472 -10222 -14147
5378 -14147 -17729 -18968 -17519 -13635 -12142 -10000 -7043 -1192 474 -1790 -488 1092 -174 -2951 -3048
5363 -3048 -185 7047 10590 7054 4750 833 -3509 -5140 -6061 -7480 -6417 -137 235 -3973 -4023 403
5347 403 1938 5734 1803 3369 4017 5546 63 -3210 1928 4948 8597 7158 5871 6965 9166
5332 9166 10248 5404 510 -2488 -620 4287 6266 -1384 -4959 -3926 -892 4966 -2537 -10393 -5678
5317 -5678 -721 -766 -2638 -228 -8521 -9221 -8826 -8689 -5342 -5561 -8012 -8336 -10391 -11148 -10878 -14057 -14484
5300 -14484 -15466 -16925 -13542 -12636 -13561 -10373 -6851 -6197 -10053 -15328 -18684 -9349 -6184 -5657 -4580 -7033
5284 -7033 -11761 -11722 -10981 -7211 -9998 -10285 -5250 9404 8132 3007 1344 -6811 -4616 81 -2024 1575
5268 1575 129 -1134 1035 2367 -866 -1432 412 -1075 220 6198 5948 3444 -2970 -2910 -5348 -7773
5252 -7773 -11000 -9866 -5862 -6985 -12784 -8932 -865 6440 11214 11483 4246 2727 3591 3294 -2649 -845
5236 -845 421 -795 -3053 -5813 -6519 -2604 -4801 -7698 -3379 -6364 -15893 -14939 -11331 -10804 -9209 -927
5220 -927 -1297 -4180 -9328 -12923 -8760 -3657 -1713 -2811 -5598 -11085 -11996 -8443 -3704 5279 4583 2011
5204 2011 -697 -3043 -1557 -241 -4379 -8073 -9276 -11570 -20305 -18577 -9073 -5612 -10093 -8827 -12512
5189 -12512 -12615 -11744 -5522 -1371 5814 5980 4586 4845 879 -3352 -6215 -11836 -10855 -10966 -10477 -4396
5173 -4396 -2172 -1687 -4630 -16254 -16753 -13015 -14510 -14951 -10410 -9413 -12549 -5890 6144 8465 3646
5158 3646 2898 -272 -2816 -4173 -11102 -15309 -12324 -8314 -8310 -337 4461 811 -4720 -3916 -1797 -2766
5142 -2766 -7401 -7964 -6252 5811 6792 4897 -2485 -5258 -2196 2965 5667 6499 -2539 -7135 -7080 -9426
5126 -9426 -11775 -13563 -16337 -11744 -10796 -13724 -14688 -15888 -14314 -10039 -12555 -15323 -14215 -9612 494
5111 494 4817 3345 5298 -1130 -6852 -1222 4811 4602 -1661 -3085 -2263 -2083 1473 259 -5569 -10707
5095 -10707 -10305 -10110 -13976 -10855 -4281 1540 8058 7307 -639 -3999 231 501 5435 11058 9862 1781
5079 1781 -3089 -1501 -826 1517 6499 4518 231 -3481 -3213 -4885 -4692 -4694 -341 -2763 -6635 -8394
5063 -8394 -7183 -7228 -2014 -3252 -1340 4619 6994 1783 -2713 671 3969 -3398 -13763 -18868 -15591
5048 -15591 -15849 -7571 -5452 -8547 -10788 -10685 -13474 -13125 -15377 -20773 -10357 -912 -4054 -6093 -1378
5033 -1378 -4836 -7843 -8083 -2159 2081 778 511 1389 3063 2085 4520 4134 6950 3889 5997 -2259
5017 -2259 -2600 -877 -3428 2810 4359 6032 5221 5245 4678 1697 -3504 -1251 1463 2749 6138 6767
5001 6767 3865 -3886 -6870 -2514 7248 7662 2456 5434 8000 5711 286 -4482 -4933 -5114 -2048 -2783
4985 -2783 -2726 1791 4491 5361 6995 6607 2276 -1421 -3328 -1923 -28 -4462 -2183 -1664 813 -8546
4969 -8546 -11157 -5196 1973 3664 -1080 -285 -1083 -6683 -5005 -10685 -12099 -11500 -10534 -5218 -1871 -9617
4953 -9617 -15803 -16316 -14255 -16185 -14425 -7441 2415 4984 -4312 -8076 -2564 -2349 -9480 -10964 -10137 -7488
4937 -7488 -1950 -995 -4401 -4712 -5926 -3666 -2101 -6147 -8513 -12837 -10903 -6022 -5923 -1376 6042 9409
4921 9409 6854 -8068 -15832 -14445 -10847 -7726 -7183 -6611 -8474 -15271 -18687 -12335 -6907 -5765 -7258
4906 -7258 -15072 -17306 -13881 -13386 -10545 -11159 -14188 -5500 -1740 -8792 -10131 -9254 -6297 -1392 -3503 -2805
4890 -2805 -1438 3172 6770 4512 -1243 -6859 -13185 -16071 -17843 -20637 -15728 -14681 -12921 -5699 -1493
4875 -1493 -523 -3829 -3893 -577 -3069 -231 -3139 -10519 -9288 -7136 -6235 -2740 -2214 -4326 5170 7392
4859 7392 -390 -575 -2318 -3030 -3857 -6413 -4483 -3583 -5048 -1654 -2867 -3920 -6991 -1528 -482 -2226
4843 -2226 -2298 -1514 -1994 -5726 -9415 -13724 -20647 -25753 -18697 -8870 -7905 -6214 -4030 -4263 -7163 -4906
4827 -4906 -4038 -3991 -8457 -7621 -5144 -6162 -10139 -7495 -3670 -9434 -11681 -7362 -11038 -11299 -7083 -1495
4811 -1495 1786 5277 5742 234 -7320 -4728 -6008 -8080 -6800 -1201 -542 -3988 -1510 1912 1745 2806
4795 2806 1899 3094 6351 3563 -9089 -10233 280 5461 80 -3308 -79 3645 -1951 -618 732
4780 732 -8282 -9884 -5771 430 1492 -1565 -3818 -1356 4905 697 -2843 -4149 -5708 -6034 -7114
4765 -7114 -8507 -9346 -3908 -6794 -3941 -4064 -8227 -11779 -12905 -10308 -12311 -12939 -13150 -12599 -13546 -16324
4749 -16324 -12773 -7025 -3509 -4921 -3585 -1727 -3732 -8338 -7582 -6358 605 6122 4716 458 -2712
4734 -2712 -4329 -2653 -4523 -7825 -3125 2291 1569 7018 7516 8977 9009 3420 -3323 -2944 398 2051
4718 2051 4344 258 1859 -1426 -4624 -13293 -16112 -19323 -18421 -14121 -5449 -838 6783 4893 3760
4703 3760 3636 1867 -7284 -12235 -10659 -7147 -9375 -9266 -1992 -3033 -4690 -4814 -7916 -6473 -3948 -5614
4687 -5614 -4508 -2697 -5956 -763 -181 105 1347 -3247 -4460 -2800 -6318 -8004 -16573 -21243 -17317
4672 -17317 -14649 -8132 -7332 -2830 -597 -2620 -2262 3531 -3843 -8321 -9850 -8804 -8061 -5105 2928
4657 2928 3551 2747 2243 -59 -403 3286 2378 -2741 539 -2694 -8675 -13070 -8183 696 -648 -1090
4641 -1090 -3441 -4250 -3148 -2605 -382 1043 5113 2902 -2466 201 8413 7662 7585 12584 10686 8179
4625 8179 1851 -2736 -1756 -1013 -2365 615 6781 2229 -4271 -3983 -4524 -7563 -11794 -10309 -5428 -484
4609 -484 1023 3802 689 1866 2431 -1048 -1703 -2205 -5854 -10013 -4757 -3776 -5561 -5632 -13579 -11817 -10084
4592 -10084 -11703 -11931 -11469 -5667 -581 -977 -3204 -2375 2521 -2499 -7291 -6221 -5060 -3579 4331 2174
4576 2174 -5991 -10039 -9438 -6197 -4439 -1706 -1325 -4548 -8751 -3071 -864 2669 3120 -728 -3349 -10097
4560 -10097 -10186 -15215 -19452 -13505 -11670 -9188 -4359 -8232 -12123 -11413 -7609 -7595 -5803 2949 3755 -713
4544 -713 -7149 -5806 -4261 -958 -2494 119 -6427 -10510 -8762 -5142 -5253 -10521 -12541 -3088 4313
4529 4313 6116 1526 -299 -750 -4897 -6400 -7786 -7764 -9343 -8320 -3146 -586 -880 -2178 889 5947
4513 5947 5040 -468 -5727 -9195 -8140 -7529 -5723 1776 -2859 -7428 -11821 -13044 -13090 -9114 -5118 -6920
4497 -6920 -10040 -15082 -10486 -6995 -4362 -6627 -8909 -16888 -19710 -11456 -5454 -4359 -2033 6409 6218
4482 6218 -1475 -2570 -5003 -4969 -5539 -9856 -10918 -12249 -10218 -10691 -8901 -7879 -4599 -3143 -5420 -5159
4466 -5159 -3206 5912 6694 3754 6019 1319 414 3946 4898 4903 2768 -2896 -3036 -2375 -5199 -5456 -6601
4449 -6601 -3233 3096 7363 4398 -3549 -6361 -3810 1123 920 -186 2055 -3161 -5045 -639 -1842
4434 -1842 -9730 -11396 -3443 -4295 -5491 -6685 -7594 -9256 -14497 -11058 -12515 -15519 -12097 -10204 -6742
4419 -6742 -4130 -7888 -7702 -5116 -765 -4711 -6597 -9697 -7492 -8896 -6040 -3800 3222 4164 -4944
4404 -4944 -9631 -10044 -4710 -7678 -6891 -1757 -2119 5075 5430 -1368 -6276 -2850 -2801 -2230 -7878 -6836 -1751
4387 -1751 887 -234 2249 4620 6173 9586 -254 -8878 -7705 -9592 -6886 -3831 -3058 -7386 -2277
4372 -2277 6153 5734 5238 4664 1049 2701 3540 -1259 -8275 -6124 -8228 -11983 -12564 -12744 -11076 -10490 -11909
4355 -11909 -9110 -8219 -6267 2192 1556 -4560 -13576 -16062 -10352 -5096 -9474 -4778 -1334 1916 4135
4340 4135 354 -5056 -9854 -11309 -13994 -8241 -3627 -817 -1361 49 5220 -3184 -6301 -7043 -4752
4325 -4752 -3378 1238 -3460 -8352 -10504 -11313 -8690 -2928 -2714 -7130 -8567 -14748 -13544 -8519 -5605
4310 -5605 -4412 -1852 -4971 -8803 -9967 -8600 -11075 -14244 -18595 -16088 -12224 -13641 -12961 -15985 -15423
4295 -15423 -11689 -10839 -6199 -4913 -14374 -19310 -18286 -10043 59 1433 -2915 -5605 -6558 -5011 -10760
4280 -10760 -8405 -7339 -8936 -5045 -9947 -10016 -9678 -9892 -9423 -11641 -17073 -12788 -9917 -11653 -14110 -14519
4264 -14519 -23452 -20098 -14011 -9630 -7954 -5641 -8171 -11143 -9025 -6103 -5099 -4838 -3312 -6563 -7798
4249 -7798 -6163 -3349 926 2029 -1602 -1315 -1108 -3613 -2475 39 4240 7398 9840 5957 73
4234 73 -3475 -6003 -9871 -10634 -8820 -5275 -7760 -14847 -14236 -16505 -14329 -7296 -4377 -2268 1703 465
4218 465 3228 1245 -2035 -5593 -2644 2444 313 -10216 -6355 -169 7869 5064 -1064 -2256 -2255 -6473
4202 -6473 -11856 -13020 -9275 -7471 -4387 -505 -1935 -3557 -8702 -10243 -3420 -1959 -4272 -6002 -10289
4187 -10289 -14340 -8819 -3642 -2799 -8956 -10285 -10050 -9454 -12616 -14219 -11445 -10518 -8898 -7244 -2612 -3988
4171 -3988 -6067 -10589 -11049 -7669 -2000 -3772 -4136 -4167 -6686 -2016 636 -4417 -7575 -6668 -3441 -6870
4155 -6870 -8208 -7403 -5681 -8461 -8307 -4283 2646 7945 6239 4185 203 -4984 -1433 4913 4556 8469
4139 8469 7307 5974 3602 2180 -2528 -7306 -11021 -14709 -14432 -17617 -17436 -16860 -13510 -8923 -4573 -2009
4123 -2009 -4196 -3090 -1513 -5097 -6134 -12296 -15376 -5341 2854 1897 1218 5147 3273 -116 -12544
4108 -12544 -17569 -17351 -16430 -10295 -6530 -4526 -6154 -6193 -5288 -802 6700 11975 10574 12257 57 -5231
4092 -5231 -3579 -1311 1420 2766 -2373 -3913 -4546 -4648 -5172 -2228 -1053 111 2955 1478 -2769 -2974
4076 -2974 -3776 -4433 -4264 3229 7511 4062 5407 3817 -1954 -1358 -1958 -2113 -2576 -6345 -4209 -2529 -4788
4059 -4788 -5544 -4322 -7528 -9133 -9706 -7986 -6447 -7631 -9881 -12795 -11807 -9593 -8300 -5633 -6156 -3722
4043 -3722 -3816 -1244 343 -4350 -13557 -12980 -6453 -5420 -2181 -71 5589 8533 10145 4392 -5493 -7388
4027 -7388 -2969 -1986 3589 6175 6396 2288 5354 845 -8117 -9708 -10701 -11741 -6762 -4878 -2689 -6984
4011 -6984 -8461 -8636 -8061 -8550 -13430 -9148 -4087 -4631 -4338 -5929 -4745 -7487 -10589 -7919 -6807 -13887
3995 -13887 -14912 -15060 -10740 -7847 -4035 -5707 -12098 -10702 -8426 -8355 -8381 -8111 -6049 -10181 -7535 -4409
3979 -4409 -3695 -267 5752 3056 -2563 -5459 -3078 -5801 -6382 -9979 -8925 -10614 -10778 -10128 -11154 -13924
3963 -13924 -11879 -11875 -8231 -515 8 -5475 -5323 -5891 -2292 2666 127 -6852 -7405 -3609 -3070 -8440 -7923
3946 -7923 -3652 -4445 -3803 -3253 -2657 86 -2081 -6716 -8340 -5178 -7508 -8406 -12469 -19746 -17343 -9380
3930 -9380 -5265 -429 -3430 -2707 -4903 -13596 -12445 -10316 -8499 -7074 -5210 -4326 -4625 -4543 -2865 5547
3914 5547 7632 6597 5309 8140 5810 -6088 -19231 -15648 -6808 3999 421 -6871 -7365 -1364
3900 -1364 4375 3452 7125 7332 5055 -262 -7918 -4475 61 -4115 -1111 2160 1968 2362 -4570 -5361
3884 -5361 -850 457 255 -6032 -9955 -16916 -15669 -13655 -8863 -313 1664 -1943 -7436 -10279 -2290
3869 -2290 1388 -3051 -8078 -7338 -3219 -3887 -9385 -3093 -2205 -5561 -7931 -4690 -8785 -8289 -7704 -9669
3853 -9669 -11577 -18721 -17277 -10964 -7349 -1599 -4550 -12069 -11612 -9341 -14561 -13586 -5901 -4316 -3840 -6215
3837 -6215 -4713 -1334 -191 -3697 -2465 2189 829 -1950 -5360 -4261 -3755 -6126 -9774 -11243 -14838
3822 -14838 -14169 -13319 -11251 -10869 -6226 -3957 -1770 -141 5522 2216 -1182 -4904 -2620 745 -1721
3807 -1721 481 1688 5811 7568 7079 -749 -4654 -6674 -9309 -6994 -2314 -151 -4247 -5397 -5270
3792 -5270 -5192 -5017 -9719 -10960 -10308 -8003 -8907 -8676 -10047 -5185 1564 -1347 -1658 -5686 -10747 -14335 -15349
3775 -15349 -7946 -5678 -4286 -2603 -5764 -2678 -5018 -4099 -4203 -2902 4083 -1207 -1517 3244 3684 2516
3759 2516 -2008 -5272 -5836 -10748 -8061 -3174 -6780 -10234 -12518 -16839 -10995 -6547 -3276 3654 -169
3744 -169 212 923 4353 2572 -6084 -4876 1581 3195 4998 7785 3866 -3391 -4946 -117 1757 -1666
3728 -1666 -7135 -6261 -3789 -2529 -2067 -2344 505 -2148 -2009 -626 -3225 -2520 -250 -883 -2587 -4514
3712 -4514 -6021 -13164 -15066 -10602 -4859 466 -4330 -2284 -3225 -8338 -12373 -14075 -11256 -6709 -8051
3697 -8051 -5880 -1817 -6251 -4614 2604 3481 723 -2460 -9042 -13821 -12311 -8868 -6861 -4766 -4059
3682 -4059 -3084 -6727 -3575 -2701 -6608 -5397 -4348 -6484 -9989 -8614 -9981 -13832 -10839 -3724 -1468
3667 -1468 -5957 1752 6940 -2226 -5076 -5601 -8349 -10175 -7493 -6614 -5561 -2261 -4505 -7178 -6706 -6736
3651 -6736 -14584 -19371 -12289 -8029 -8860 -2915 -442 -4818 -8444 -1639 2779 -1124 -2211 -2025 3080
3636 3080 4035 6536 8515 4988 284 -3041 -2082 -7383 -8527 -10832 -12877 -10233 -5558 -6097 -7687 -3948
3620 -3948 -2389 -2585 -3555 -1731 -4403 -8222 1 7450 -67 -7554 -7243 344 2482 1035 -5429 -3767
3604 -3767 -5120 -9460 -11068 -4578 505 -2568 -4681 -8122 -1337 -1327 2324 3583 3434 7319 3264 -2944
3588 -2944 -2512 -3257 -63 -4409 -10186 -4630 -4463 -7808 -241 7414 9441 -1797 -3596 -6532 -10195
3573 -10195 -8422 -12369 -12305 -13018 -12480 -8072 -824 -228 -8812 -8552 -4267 -3234 -2131 -231 -6201 -11082
3557 -11082 -5541 -932 -3831 -6527 -3104 4377 2266 -2342 -1994 -2474 -4222 327 1978 -2761 -6262
3542 -6262 -5016 -8251 -10198 -11289 -9094 -3786 -3585 1682 3596 537 -185 -1915 1421 5178 6337
3527 6337 -1504 -3548 4291 456 -1208 1065 -3589 -8494 -9623 -14494 -14974 -12451 -8384 -7784 -10723
3512 -10723 -11644 -15130 -20166 -16089 -10329 -5266 -2607 -2253 -4104 -1816 -6344 -6486 -9074 -9044 -4754 -9269
3496 -9269 -16219 -18656 -13278 -12960 -12983 -11202 -9133 -5662 -9164 -9009 -5205 -3729 -9846 -13611 -11617 -8200
3480 -8200 -2921 -1382 -6449 -5740 -4424 -6294 -4826 -5548 -3109 -6412 -9244 -4192 -7966 -10120 -16909
3465 -16909 -21156 -15120 -11853 -10546 -7371 -7357 -4800 1832 2475 577 -3149 -4935 -6738 -6999 -9028 -5772
3449 -5772 164 -2703 -11087 -19254 -16068 -9640 -9287 -6702 -2789 -9881 -15161 -18134 -9194 -3704 -6898
3434 -6898 -13105 -10507 -12929 -10619 -9779 -11478 -14013 -12087 -11890 -16530 -14000 -12472 -7638 2057 3598
3419 3598 2478 318 572 4655 4657 -567 1682 -2417 -4136 -7337 -8999 -3253 -6273 -9005 -4312 1968
3403 1968 6549 9853 8826 2552 -5912 -8164 -8773 -5516 -2811 -3384 -3628 -3491 917 -4031 -5014 -3053
3387 -3053 -228 2289 3815 5284 867 -3163 -5389 -6591 -7589 -7060 -7627 -11076 -10534 -7976 -10400 -8918
3371 -8918 -9755 -7804 -8529 -7938 -1155 5022 10972 10882 5747 3834 1523 4966 5840 5223 1057 -2248 -12147
3354 -12147 -9895 -7792 -3304 -1271 1259 2130 -1631 6130 10191 5763 -2248 -890 -3343 -8979 -12522
3339 -12522 -7680 -6664 -8990 -8141 -4715 -1522 803 -3921 -3561 -4965 -7624 -6355 -7428 -5054 1002
3324 1002 3166 2224 658 686 1450 -288 461 4122 4707 10570 14771 10980 5361 639 -3553 -5634
3308 -5634 -7430 -3970 -9414 -15815 -13445 -15305 -11872 -7884 -6473 -1613 3710 2599 -4342 -11687 -10302
3293 -10302 -3097 -3002 -7550 -12799 -16038 -15988 -10243 -4253 -2513 -1089 -3359 -3333 -4843 -7738 -6357 -4875
3277 -4875 -2326 -2784 -7106 -10698 -6907 -2668 1291 6057 8205 -1878 -5208 -2195 -2369 -2132 -1631 3805
3261 3805 2387 1309 -1739 -1138 -4083 -5430 -7152 -7839 -4066 2034 -1250 -1723 -4034 -9615 -12297 -12216
3245 -12216 -13303 -9410 -2124 -5626 -3015 3054 -355 -4312 1570 3497 1330 -428 3690 7814 7861
3230 7861 2692 -1429 -2872 -1398 2164 4244 4019 5653 13089 12921 11700 -6 -6857 -8679 -6157
3215 -6157 -5769 -4415 -2871 3176 7658 6822 1308 -799 -5501 -6887 3667 4522 5835 8289 2023
3200 2023 1081 2875 -3969 -1361 4041 2934 -1196 777 2113 -7966 -14819 -3003 828 4994 7288
3185 7288 6232 7889 9060 8846 579 -413 107 -3525 -2925 -5788 -2985 386 1943 -1519 -4426 -61
3169 -61 -6489 -11236 -8956 -2720 -2917 -7613 -4979 3521 848 -11206 -17921 -14514 -10791 -7583 -6357
3154 -6357 -8120 -8706 -4994 -6973 -6366 -2268 1836 -95 -7644 -6997 -1193 1915 -1454 -5930 -10113 -6111
3138 -6111 -6925 -6685 265 2029 377 -329 -2838 -2028 -4264 -4091 -1325 -3846 -3181 -2781 -5622 -4077 4524
3121 4524 3386 -10836 -15807 -16355 -11454 -9928 -6482 -5853 -3207 -3174 -7223 -9236 -9781 -11432 -10081 -10714
3105 -10714 -10407 -11731 -12023 -6929 -3238 -5881 -11772 -13778 -14570 -10269 -10538 -7524 -1968 -5448 -199 5523
3089 5523 3310 912 -2808 2503 8796 6452 6403 1392 -3729 -1013 -1301 -3659 -663 -955 1288 6302
3073 6302 7667 8079 6395 5905 5659 346 -3555 -10516 -6694 1626 4699 2403 1039 -892 -4906 -7282
3057 -7282 -8848 -10923 -7875 -8854 -11376 -8034 -2429 541 5512 7440 1992 -937 2332 3117 -2204
3042 -2204 -8870 -7494 -3512 -3761 -8369 -10286 -9946 -7251 -3564 -2606 -4002 -833 -522 -5663 392 286
3026 286 800 -1814 -3702 -7788 -9853 -8751 -7492 -14708 -19918 -17552 -13662 -11895 -9196 -8143 -7493 -7691
3010 -7691 -7843 -2889 663 -286 -2481 1185 -5031 -9372 -2073 547 2918 3860 6438 8956 4988 6874
2994 6874 11301 12855 4156 -616 299 -2750 -9556 -13485 -7860 221 -2534 -9392 -9043 -8963 -3352 -3778
2978 -3778 -8559 -8423 -11729 -9367 -2962 -4773 -2032 4374 -2064 -1637 -4230 -3425 -5625 -9503 -5101 -1765
2962 -1765 233 5665 1010 -1636 -8107 -12859 -16161 -18569 -12429 -7238 -3910 -6332 -11839 -12175 -11915
2947 -11915 -10741 -8264 882 6793 2039 5 1001 747 6473 4123 -1734 -4845 -6961 -12367 -12740
2932 -12740 -7451 -1013 -3163 1305 -1688 3768 7554 5135 -2478 -1211 5482 3356 -1590 60 1834
2917 1834 1714 -6549 -5313 -3524 -3257 -1226 -2218 1344 2047 4066 6758 4843 12012 14463 6489 -576
2901 -576 -1522 3112 -215 -7991 -8411 -3290 -5619 -16364 -20836 -21935 -20834 -20004 -15963 -9789 -5227 -2025
2885 -2025 -303 4394 1494 93 1826 4644 6135 12324 14591 13839 15225 7710 1656 2723 1236
2870 1236 -1479 -5367 -5868 -10265 -10455 -7192 -4618 -6502 -10441 -8848 -6334 -1779 2579 1191 -6439
2855 -6439 -9490 -6322 -2938 -1430 3260 3298 160 -298 -86 2597 3489 3677 642 -3698 -3600 -3307 3991
2838 3991 8446 1498 604 893 -470 2584 3578 -1870 -11824 -14907 -10337 -8419 -4962 -6720 -5320 -1082
2822 -1082 -427 -2156 -1147 -3602 -1856 829 10915 11433 9350 5624 5079 -3306 -5005 -2875 -413
2807 -413 -1647 3406 6642 10853 4200 3305 5965 3270 2610 1612 4745 5888 4791 6719 4998 -551
2791 -551 -3501 841 3377 10505 12895 11431 9787 7925 1831 614 3272 4195 -601 1557 1901 -3283
2775 -3283 -4223 -5847 -5190 -8438 -5607 4605 3556 402 -4425 -1772 -1751 -3556 -4761 -3232 2401 -347
2759 -347 -5734 -6769 107 2899 3494 -1926 998 5926 1320 -5450 1766 8218 6168 6916 9184 11377
2743 11377 15852 10119 2584 -2301 -3028 -2611 -3711 412 1467 5625 4567 3436 751 -5316 -592
2728 -592 998 694 2820 2452 919 4494 7266 5229 -4043 -5907 -8197 -6554 -7178 -6289 -5859 -3275
2712 -3275 -5026 -7030 -5437 -4010 3786 2605 -2192 -5508 -2070 5531 3399 1842 1781 -5872 -9397
2697 -9397 -4703 1330 7726 5266 -2488 -5481 504 2553 1235 -1165 -1831 -3837 -4105 4251 -501
2682 -501 -1479 -137 1849 -161 -86 2413 811 2594 3694 6066 5177 -4220 -9474 -11100 -4206 -1607
2666 -1607 -604 -1750 -5371 -4975 601 3204 2716 1950 -352 747 2131 7669 3718 -7821 -10536
2651 -10536 -15847 -12237 -7381 -11488 -13107 -11960 -9845 -7273 -5419 -8110 -6194 -2919 -5085 -541 2940
2636 2940 -2292 -4300 -10109 -8701 -2625 665 2738 2115 8152 10817 6241 12508 9195 -699 -6686
2621 -6686 -7077 -6418 -1467 1886 998 2463 3431 3732 -4482 -4864 -2274 2283 -4782 -9936 -13317 -10195
2605 -10195 -4512 -5050 -8817 -7289 -4565 -9336 -8727 -14657 -18293 -6244 -125 3168 2674 -2894 -5228
2590 -5228 -4839 -4063 -7130 -3469 1356 4077 3630 7336 8239 5755 4953 5066 3362 6676 5390 2855
2574 2855 -993 -1283 -1933 -1697 -2967 302 -1935 -8110 -11969 -8754 -9397 405 5788 5786 7950 8881 6128
2557 6128 5994 5843 1804 -3639 -9925 -4773 7177 5099 3403 5844 13511 16949 15394 5716 -2283
2542 -2283 1541 2888 -8644 -17654 -9416 -1229 2318 -2044 -2621 1236 -1843 -3634 -2023 -6580 -8884
2527 -8884 -6668 -15200 -23048 -23036 -21523 -19144 -8765 1751 15266 22802 25716 21969 12373 -90
2513 -90 -9995 -13932 -16997 -12077 -5244 10589 22956 28619 32839 30290 21478 13857 10307 -4264 -12595
2498 -12595 -12845 -14900 -12975 -14148 -19675 -24144 -12206 49 -313 -6435 -2845 -1359 -5895 -3277 -1744
2483 -1744 327 -170 -4370 -2680 2424 3510 -645 -2209 -4035 -5568 808 9708 8333 8190 17696
2468 17696 10781 878 -2536 -705 968 -764 -162 1672 -2506 -5863 -9731 -16087 -13949 -12559 -10544
2453 -10544 -12708 -9917 -7828 -2492 -1487 -1659 -1134 -2444 -2500 -5408 -5502 -7438 -3483 -2516 -1777 -4749 -6378
2436 -6378 -6375 -4177 -3956 1216 3443 -3585 -12970 -15595 -13395 -14361 -13221 -4968 -4442 -5578 2314 1792 -1815
2419 -1815 -4807 -4415 -6244 -8576 -7464 -906 3700 2627 4873 -1591 -4286 -796 2141 4938 6931
2404 6931 -422 -9008 -11985 -12359 -8787 -6904 1532 796 -4561 -9212 -5685 -430 -8945 -9989 -13687
2389 -13687 -9169 -7647 -4606 -3174 1444 3691 187 -2745 -4629 -6620 -4038 2863 -740 -293 -4551
2374 -4551 -2608 3814 5294 2926 -1338 -4484 -14349 -16446 -11627 -5227 -1333 -803 -2460 -1086 -4440
2359 -4440 1223 9270 11413 8337 2373 7479 11923 10727 6753 -72 798 -1208 -2458 -4994 -2684
2344 -2684 -6448 -6996 2099 6503 6711 1579 2519 2765 3646 10720 10685 3177 -2368 -4871 -12530 -12009 -7072
2327 -7072 -2617 -3635 501 3541 3622 -198 998 3895 5123 -47 4222 1789 1974 3243 121 -4435
2311 -4435 6231 7809 1800 -4365 -4061 -421 -178 -770 -2649 -786 -1154 1097 350 -5092 -1215 -565
2295 -565 789 2165 -613 -496 -4023 -5509 -5114 -2901 155 -813 -4492 -1375 6532 2939 -1914 1127
2279 1127 -2554 -2611 -3040 253 -3573 -8172 -469 -892 -98 5 4036 7330 9949 5951 5265 2601 843
2262 843 164 4180 2103 2282 1308 729 1713 2003 586 -332 -7308 -3654 -4374 -6602 -7707 -7475 -5804
2245 -5804 524 373 5625 13278 15173 13894 10889 2983 -5813 -5165 -9599 -4986 1681 4502 9619
2230 9619 9023 11862 12941 8970 5103 4313 3459 2822 550 4429 3174 2753 -1257 -4979 -4936 -3268 -887
2213 -887 -3841 2278 4366 1372 1103 -1379 365 1079 -1120 -2678 904 1754 916 2451 -1272 -500
2197 -500 713 -4414 -3018 -2344 -1421 -7076 -11179 -11245 -13134 -6752 -8665 -9530 -9795 -10407 -11460 -11854 -927
2180 -927 6469 6636 2750 -1536 -1481 -1740 668 -192 -46 -4944 -4990 -1674 -3769 652 3249 5372 -623
2163 -623 -191 3767 -2791 -10202 -16755 -11165 -5933 -6404 -5068 -552 -669 -2552 -2083 -8878 -6858 -2937
2147 -2937 550 1870 1584 -1164 -3144 265 -961 -3997 -246 2200 4037 3826 898 -3018 -3298 1695
2131 1695 335 -585 3868 1191 3172 1016 2001 62 -8416 -11048 -10857 -7435 -6716 392 490 192 -2596
2114 -2596 1106 1841 -5965 -6875 -8145 -9524 -10514 -7393 -626 5102 2972 2634 286 -3473 475 739
2098 739 -2448 -3534 1944 1577 4963 9017 6410 -2217 -5044 -5960 -3037 -5593 -7683 -6952 -3947 -2355
2082 -2355 1277 -31 -5472 -7984 -11037 -9823 2933 6600 6492 8115 440 -4091 -8248 -8267 -4455
2067 -4455 -692 -493 2322 3948 5861 4115 6746 1685 -2292 -1234 886 1599 -1651 -2387 -3255 -3579
2051 -3579 546 2060 3872 8532 1595 -5139 -5324 -2545 3029 5502 9743 15260 15615 13441 7266
2036 7266 594 2397 5448 -1342 -6144 -5798 -8267 -9523 -6812 2641 5947 687 3111 933 2221
2021 2221 5959 6339 3126 -4811 -7795 -2156 -7137 -1773 6665 9427 1952 -517 -2016 -1485 -3564
2006 -3564 5543 11331 12311 11716 8472 3915 -6904 -14949 -9441 -6351 -3688 4537 10989 8043 4257
1991 4257 5162 6194 2690 1295 1215 -551 -3203 -870 1808 4083 5445 9716 7160 3878 -874 -2067
1975 -2067 2600 6958 3997 3696 2451 3315 4656 2483 2661 3923 3400 54 -2209 3864 8395 3622
1959 3622 -548 -6775 -4481 462 3699 1748 2058 -3602 -1943 4448 2578 1667 3395 2174 3217
1944 3217 -1090 359 -626 -1328 -5595 -8991 -7574 -3877 -202 6458 13480 18527 14263 7041 3694
1929 3694 9629 10622 7895 6267 7975 8765 4287 -4274 -1572 -2203 -1265 -897 -123 -2601 5033 10309
1913 10309 10221 1723 -2475 -1407 -5288 -11121 -8006 -6342 -5361 -6591 -3330 -2104 -6114 -4590 1352
1898 1352 4753 705 -3805 -2324 881 6894 5470 4074 1659 -2097 1386 -2913 -3130 2220 -266
1883 -266 902 6510 9361 6800 6614 12446 14530 13617 12946 10766 10491 6359 4905 6824 3259 3343 979
1866 979 -1265 -1873 -866 -2076 -1971 -2282 -725 -1015 2512 3623 4014 1371 -8188 -8931 -7 3419 4512
1849 4512 4752 -1862 -8308 -14603 -10847 3581 9203 5641 -706 1581 4416 4790 7352 -314 -394 -8512
1833 -8512 -14251 -9401 -4902 -7620 -9264 -6019 -1685 -2657 -6499 -3566 -1193 64 1452 2361 -3588
1818 -3588 -8940 -755 5313 5961 2801 6148 6653 2710 2666 2605 4902 3015 -2542 -3663 -2419 966
1802 966 2455 -7008 -12473 -8476 -7845 -4754 -2701 -468 1161 -1799 -7974 -5838 -1755 -2279 -8732 -15716
1786 -15716 -10754 3694 7879 -940 -452 -4138 -11342 -3373 2713 559 1140 3298 2417 -2932 -6603
1771 -6603 -9301 -5826 -2645 -519 2683 2083 -2241 -7104 -10536 -1435 1223 1799 2371 885 252 3186
1755 3186 -2932 -988 -1138 -521 -307 -4494 -6067 -3480 -8888 -109 12216 16319 18508 15792 13664
1740 13664 13518 12559 1508 -5158 -8907 -6791 4637 10943 11873 6201 9229 12150 6601 -2140 -3056
1725 -3056 -74 -3141 -14135 -10066 -2230 -545 5977 7615 6071 773 -2990 -2728 -6410 -3136 -757
1710 -757 -4299 -6427 -3181 -3323 -6718 -8896 -3722 -175 7265 9989 9471 3788 3258 9075 8436 6882
1694 6882 1728 -3806 -5556 -1388 -4103 -6769 -9612 -3448 -1910 4963 9017 15609 22260 14360 7488
1679 7488 6906 9986 145 -2698 14 -622 2036 1494 3270 4996 1260 -152 1633 7262 12606 12282
1663 12282 5434 -2326 -2518 -1219 7315 13577 16771 15151 6776 3474 3933 -2578 -7586 -4142 -2102
1648 -2102 -3311 -3208 -4530 1645 11310 10524 2771 1247 3025 1026 -1878 -1169 707 1101 182 2294
1632 2294 8623 13175 6932 8525 5115 3853 -4855 -3824 -3574 388 1270 2194 2111 -2203 -2492 -1562 -2034
1615 -2034 -3955 15 -3998 -6047 -7332 -8279 -3059 -3833 817 -959 -977 -2314 -20 1443 3386 1410
1599 1410 1820 -142 1070 8194 8450 4900 -1372 -2165 -3430 -7184 -7616 3288 12547 12588 10695 16102
1583 16102 11389 13233 14522 12650 11614 12882 4855 632 9307 11337 5030 4648 4877 573 2511
1568 2511 6832 7873 7506 5566 4692 3894 454 -1364 -5998 -2176 613 1102 3617 7268 3165 55
1552 55 3562 2294 1078 1118 449 -1967 -4657 -6830 -4405 1496 -1426 -5566 -7864 -5933 -1868 2244
1536 2244 8580 5138 4206 1255 1981 7017 12929 13919 16562 13760 7892 6752 7653 6532 7755 4881
1520 4881 3255 7987 7677 6552 11154 9808 8606 11244 13798 13095 16262 18250 10128 5623 3017
1505 3017 4046 7415 7917 2829 1606 1508 3827 2385 -585 -1825 -1921 -6322 3503 7273 9300 8029
1489 8029 4938 3066 3601 4357 4779 6863 6051 5120 9257 13191 12333 11265 11072 6774 5079 8026 10144
1472 10144 10451 1403 -2491 -4077 645 5631 5215 10245 13733 13959 11219 7688 8883 8045 3697 682
1456 682 1292 4096 4714 4622 1662 3880 3559 -2630 -225 -5062 -5849 -2863 -2317 8712 13550 13924 12344
1439 12344 11805 5458 807 -2552 -2460 -265 6132 9804 5525 741 -3112 -3574 -896 860 -2710 -3297
1423 -3297 1023 4409 1657 -1187 2785 1714 1237 4345 4946 131 1296 5700 9694 10381 9079 8581
1407 8581 4650 1035 4373 676 -5262 -3571 2358 5061 4929 -631 -1370 -970 2367 6683 7475 2357
1391 2357 5673 6049 4800 4775 9446 12120 9755 9520 8733 3785 6439 4513 3211 3088 4240 1
1375 1 -7846 -11624 -15777 -9806 -6555 -3845 -1465 3583 355 -422 1899 1297 5364 -1939 -7723 -7156
1359 -7156 -5720 -2069 -2760 -3253 3183 4261 2509 -5254 -7615 -9354 -3060 -1763 576 4016 7862
1344 7862 3682 2712 2147 1969 5803 5485 2662 4279 2233 932 6004 6478 72 -2679 -3994 -4866
1328 -4866 -6414 -5783 1914 3516 -2586 -4567 -2875 4503 5582 -2885 -5107 -10022 -11322 -9987 -3818
1313 -3818 -3010 743 -8047 -10557 -7345 4480 5092 3547 2678 1986 2921 9402 14777 12201 7973 10543
1297 10543 8819 7049 364 -5533 -3556 -2770 -1521 2817 5819 6376 -3254 -1735 5776 6051 2208
1282 2208 3703 10905 14499 14212 14492 12332 10016 1788 -1731 3843 5191 1778 6282 4343 1408
1267 1408 2568 5159 7173 2070 -499 -3225 7618 11801 13511 12138 10309 10402 9788 9987 10370 9898
1251 9898 10975 10531 6402 4149 2192 -5712 -1261 9064 9074 662 -3312 -3898 -1015 2655 4515 4505
1235 4505 2085 -2008 5948 10945 9257 9126 6996 3520 4499 4319 -608 1763 6621 3112 -3033 -1869
1219 -1869 7957 3986 -7326 -5386 5535 6180 1163 -879 3094 7122 12131 11754 15840 15319 3949
1204 3949 -1067 6348 11675 12311 10120 11615 12820 8826 12418 11418 9062 4178 -525 720 4614
1189 4614 2542 4382 15633 15617 5081 2088 -3455 -648 2828 3585 3440 2306 2320 9515 15598 19525
1173 19525 17323 8253 7855 11628 12356 11157 8192 5018 4135 4979 12919 9619 3392 453 -1192 891
1157 891 24 8951 6741 2793 5119 6120 1219 -718 -749 2222 5001 59 -1664 5113 9432 5959
1141 5959 7579 12940 17587 19188 22079 20726 7391 3837 1761 4126 5404 4795 1079 -225 -1191
1126 -1191 -1456 235 -1537 -2079 -1401 -1789 1543 7500 10405 9838 8300 3903 6829 12575 18134 21665
1110 21665 17553 13674 6176 -1365 1287 9634 10298 4094 4317 719 -1371 1833 6440 10834 6753
1095 6753 5359 11434 17573 14563 8805 4860 5657 7302 8485 7588 11445 11518 10269 11269 5021 -1602
1079 -1602 -2811 -4244 232 2085 861 -3118 -1485 -6528 -11364 -8321 -1732 6733 10526 12944 9450
1064 9450 8933 10489 12754 11571 5992 -6184 -4862 1279 4287 4439 -294 -3978 -6052 -2014 3510
1049 3510 2506 5384 7126 8649 8241 8991 9663 7617 6972 10123 4370 6607 8830 11289 12847 11126
1033 11126 11297 9763 13322 18138 15499 12202 10894 13171 14659 12062 8505 8161 20864 21511 16432
1018 16432 4570 1181 6687 7654 1218 2092 4627 1316 921 3155 5716 8023 3732 -358 -2521
1003 -2521 -420 -2640 -1147 5864 9232 8896 9687 12194 13747 7896 5050 68 2811 7024 7991 7435
987 7435 1612 2317 5695 6176 9656 11431 8332 4566 6370 8199 11358 10327 6555 3684 8665 10029
971 10029 7402 11382 6360 -164 -1178 -1953 4800 3813 3587 6968 6680 5085 -210 -5904 -7701 -4845
955 -4845 -1413 10974 14295 14925 9905 6176 8367 8973 618 -341 8383 2744 226 6138 6787 3991
939 3991 5898 7227 7630 13282 10661 12751 8377 1583 80 3331 5581 6370 5177 3162 -4561 -8498
923 -8498 -9454 -10716 -6242 -5451 2228 8387 5903 7619 8301 9662 9746 9214 7748 6742 2986 1000 -2336
906 -2336 -7799 -4853 5718 16185 17335 18683 15734 9218 5322 8495 11741 6330 5855 4228 -1953
891 -1953 -1606 -1794 405 -3275 -7600 -7311 -2929 -2474 -4464 -2393 2397 7369 6755 -675 -1675 1330
875 1330 5116 1203 -1577 -4107 -1049 -457 395 2720 3716 5001 4996 1598 630 473 1039 -4148 -3889 -1671
857 -1671 -3067 686 1597 3029 2784 4760 3579 5471 6263 4183 1787 -1235 -2824 -2097 -67 -2680
841 -2680 -2813 4889 17098 18595 15034 12508 11352 7910 8398 5551 1610 12660 16563 14073 7876
826 7876 5432 5459 7487 10218 9057 14176 13659 9746 1729 -220 6302 5275 1553 -4001 -89 5224
810 5224 5520 4625 3296 2425 5335 10420 6317 2897 4105 1236 -3070 -519 5361 8353 6140 5433
794 5433 2987 4218 6910 3948 2192 3267 5268 3556 1701 4381 2754 835 1289 4877 6772
779 6772 8010 10020 8001 12384 14188 11376 11547 6941 3790 5388 2093 -3121 -8621 -8684 -5845 5869
763 5869 13533 8932 12037 14539 11436 17883 17442 13562 15426 15951 10977 3075 5130 8581 14749 17008
747 17008 11662 14819 18545 16062 10557 6656 5836 15416 9739 7254 8576 6461 8240 5530 3632
732 3632 4203 8198 5224 6643 1923 -1217 1514 2987 5078 5718 8826 12449 16566 18440 12683 11866
716 11866 8072 4810 7791 9412 9248 3974 -943 -2650 3999 7177 11270 13908 12555 10581 15097
701 15097 18388 17222 16762 16462 8936 6586 9967 11180 5613 6683 3909 2837 8202 9103 13177 11471
685 11471 8200 8049 10830 10367 687 963 3994 6802 5477 4927 10307 8204 7600 11993 14842 12161
669 12161 16304 14528 11812 7800 8811 8409 512 -1463 3865 3814 5790 2352 -454 873 4089 8081
653 8081 9542 9375 13387 12311 8503 11001 10621 9698 5950 4236 9359 10000 4333 2971 7907 12039
637 12039 8621 4712 9870 14365 15779 15099 13456 17091 15373 6829 3686 2757 3218 -508 -2129 953
621 953 7344 8700 6576 9079 5221 5536 2054 -4870 -5670 1041 9744 9053 1433 1245 8428 8863 5815
604 5815 5751 9995 11016 16981 20698 16548 15981 12199 11243 7022 8166 6149 3797 4951 218 -5161
588 -5161 -7114 -7958 -1571 -2516 2748 10940 14607 11075 4945 4008 3063 -4034 -2558 973 4641 6771
572 6771 4574 3434 2354 2856 8567 13882 6156 3449 12436 13912 5450 5347 6913 7100 -1191 -5103
556 -5103 -8615 -7175 -5397 -2206 993 2829 4011 5313 4374 3287 5447 -182 -3693 -3320 -4317 2234
540 2234 7004 11369 12773 11400 5009 3662 10961 12784 8872 3006 -3114 -3320 3206 9707 11679
525 11679 9862 1445 4008 8494 5544 6239 9929 6721 5665 3546 291 737 -1246 -4491 -3947 -5335
509 -5335 -5553 -4399 -2309 -9326 -8699 -5428 -1844 -7523 1310 8856 10985 13225 15957 7429 3946 4109
493 4109 3575 80 -1503 -2087 -8429 -13709 -11577 -3416 -2624 -4469 -3443 -5580 -2911 -2985 -6147 -7322
477 -7322 -3155 -1230 130 2946 4577 5363 4096 -1797 817 22 930 7418 15129 6027 1237 523
461 523 -3539 1898 5646 4425 7628 1507 2352 907 -8069 -10010 -1144 11348 14141 17199 9063
446 9063 1809 -3119 -6583 -11246 -9936 -9493 -5951 -822 2129 1850 78 153 297 -4685 -7595 -10392
430 -10392 -5032 607 1036 -373 -1600 -1686 1169 6661 2642 -6007 -11781 -13511 -14858 -13165 -15884 -15431
414 -15431 -13838 -15672 -8992 -948 4939 8277 7186 2741 -5523 -8797 -5388 -1059 -6 1954 -2625
399 -2625 -6998 -9206 -13298 -14708 -7433 -3084 -5389 -6925 6 3383 -764 -2170 -2659 -3370 -196 -7473
383 -7473 -15696 -13901 -13278 -13434 -17544 -17182 -13822 -11545 -15889 -16316 -17794 -22116 -20495 -18309 -22133 -21838
367 -21838 -18183 -18729 -18099 -17528 -19358 -20155 -14756 -15392 -16512 -19996 -17001 -13090 -15802 -14002 -14152 -10193
351 -10193 -10369 -13632 -14992 -10200 -5985 -10791 -10466 -13033 -15961 -16006 -15845 -12749 -12734 -14684 -16573 -13282 -17496
334 -17496 -16968 -22657 -24052 -20699 -19868 -19481 -18354 -17186 -17512 -19816 -26907 -33468 -34157 -28129 -23742 -23519
318 -23519 -28251 -29293 -27629 -23013 -29476 -29008 -26324 -29061 -28611 -24904 -27525 -29658 -27713 -25523 -23081
303 -23081 -21511 -16989 -18745 -19065 -21894 -31389 -34414 -34049 -33937 -28804 -22774 -21448 -27149 -30769 -29668 -31085
287 -31085 -31085 -31400 -25802 -29079 -30163 -28231 -24344 -22092 -23589 -27283 -30488 -34148 -37244 -39519 -37286 -37899
271 -37899 -34530 -30137 -27612 -29017 -34748 -39564 -40295 -37328 -37470 -34724 -29246 -37515 -44102 -46245 -42072
256 -42072 -37375 -38022 -34716 -36510 -42561 -45081 -45691 -49899 -45201 -42850 -47481 -58685 -58520 -53026 -48529
241 -48529 -42281 -41915 -47948 -47788 -47025 -47784 -51213 -50135 -46770 -46700 -48427 -48074 -49532 -48365 -47359 -48339 -48269
224 -48269 -48264 -47256 -49224 -54326 -53682 -51893 -56906 -55115 -47590 -48098 -50970 -55967 -58799 -60387 -58856 -57678
208 -57678 -65637 -65207 -59226 -61875 -61872 -63188 -65539 -62520 -58814 -56106 -58386 -58694 -61014 -60988 -57332 -57114 -64245
191 -64245 -71827 -74177 -80487 -80172 -77773 -77539 -73153 -66785 -69834 -69637 -64510 -65872 -68356 -69546 -70984 -68693
175 -68693 -72389 -70601 -66897 -66872 -66669 -71553 -77958 -77375 -78221 -80181 -80933 -81446 -76186 -72103 -72431 -76456 -77032
158 -77032 -77528 -72753 -71628 -73854 -81094 -83345 -86607 -85886 -89359 -89025 -85281 -87099 -87224 -88005 -92730 -96868
142 -96868 -95800 -90672 -92313 -90418 -88200 -86738 -84583 -82351 -87463 -92007 -94086 -92007 -94275 -96096 -99699
127 -99699 -99837 -100115 -100944 -93862 -88138 -89504 -91972 -93930 -96994 -98366 -94256 -95232 -97813 -97096 -94766 -99066
111 -99066 -100694 -99263 -102983 -105134 -109465 -108803 -108621 -109069 -104751 -102147 -105287 -109307 -108298 -104977 -106146 -107011
95 -107011 -110701 -112360 -110611 -112737 -115244 -114044 -117210 -111896 -107302 -109044 -113250 -113067 -112628 -110834 -108704
80 -108704 -108689 -107113 -108891 -108744 -107725 -110253 -111497 -115914 -115506 -117288 -119472 -119403 -120337 -122283 -119472 -113089 -115277
63 -115277 -117013 -117160 -120727 -125464 -126037 -125527 -123488 -125515 -129305 -130462 -125800 -124387 -124402 -127278 -125400 -126358
47 -126358 -120440 -121367 -123895 -125733 -131329 -136169 -132808 -131761 -131364 -132150 -132263 -130362 -132578 -138917 -141642 -143005
31 -143005 -140991 -144433 -142767 -145137 -143755 -143515 -143719 -140660 -137195 -137866 -140371 -144191 -150498 -151794 -149599 -146456
15 -146456 -149621 -155121 -160275 -157246 -157155 -161848 -161427 -157636 -155899 -155602 -154382 -153442 -153479 -156616 -160062
0 -160062
$$ Imaginary data points
##PAGE= N=2
##DATA TABLE= (X++(I..I)), XYDATA
32767 93903 96197 98109 102548 101054 100288 97364 92314 91966 96117 101183 101749 98957 103966 102776 96789
32752 96789 94533 95273 103926 108325 107756 108308 110738 112284 111268 105517 104039 103885 109259 116513 116708 117220
32736 117220 117795 120304 122368 125976 125958 122694 126576 128063 127091 127497 127383 124310 124633 129877 136808 137751
32720 137751 135292 129083 128392 134251 135706 136404 137384 139778 141533 143531 143278 138809 140234 141892 141307
32705 141307 140734 144958 146606 147918 145779 147732 148766 150845 155174 155244 154242 153063 151132 152343 154822
32690 154822 154736 155049 155708 157524 161815 164800 169098 169267 164944 163752 159557 157994 165036 166749 164001
32675 164001 166937 171623 171076 170030 168941 170557 172068 170959 172525 175547 177569 174839 175474 179257 180806
32660 180806 180972 183033 185165 187877 189338 188404 187295 187491 190983 189464 189559 195291 196386 193971 197177
32645 197177 200385 202622 201109 201154 198090 198413 195478 196598 202935 197372 198084 203956 204395 202983 202585 204997
32629 204997 208388 208761 202163 202117 202100 201872 203460 202958 202402 208126 213662 211087 208463 206467 205870 208718
32613 208718 210268 214194 214365 214437 215602 215255 214938 213661 216332 216345 216487 219695 222499 226639 224453 226654
32597 226654 228452 228130 231982 234763 234288 230478 231454 236702 234233 230963 230737 233411 234113 229926 235371
32582 235371 240697 244015 245846 246846 249633 250169 246720 248450 244867 242864 245423 244398 238954 236914
32568 236914 239628 244278 251110 253367 257713 257014 255262 254090 254391 253116 253064 247672 247001 253433 254993
32553 254993 254857 258681 260422 263242 266487 263895 266929 270278 270416 266675 261568 260854 259485 260225 262652
32538 262652 269393 276592 271407 269957 265288 263675 265618 266327 263939 267331 270309 270801 265815 264773 271487
32523 271487 273145 269409 266249 270219 275641 274249 270811 271850 277888 276108 275191 281942 284158 286228
32509 286228 286782 288507 286260 283659 281801 276270 278176 278795 278623 281907 286274 284969 283677 282071 283920
32494 283920 282794 284292 286722 285987 283579 284944 282294 284669 284638 284400 286361 292959 295534 289608 287675
32479 287675 289281 294338 295458 294592 295779 299106 297093 298078 305194 307968 310137 304705 298154 300091 301992
32464 301992 303276 301964 300354 301151 300283 302060 305839 311150 311291 309556 311032 313906 313655 313583 312564 308483
32448 308483 313379 315713 310212 311199 317554 311629 309249 314671 317837 320934 322942 324410 320909 313224
32434 313224 309028 306057 305769 307794 316290 312950 307919 309583 310558 307330 308574 312058 308197 309169 315675
32419 315675 319456 320668 318165 322517 319634 315426 320218 319077 321708 327477 322524 321166 328596 322982
32405 322982 325077 327750 326381 329667 333585 330131 324678 327283 329062 327101 324204 322440 324650 336710
32391 336710 338639 340007 334479 329973 327755 332530 331101 330572 335394 333320 331779 329544 332385 333687
32377 333687 333362 331271 330126 335404 339648 337860 330548 332600 336102 335891 333933 332460 331085 333083 330483
32362 330483 333975 339703 343494 345655 338846 336214 335503 334631 335754 342603 342066 340444 341623 343806 346519
32347 346519 349033 349528 347168 342325 342104 342644 338535 338372 348474 359480 355597 347257 344534 349065 354384
32332 354384 355058 351252 350175 349222 348771 342905 338867 340461 349622 354064 349275 344382 347928 348947 343375
32317 343375 346028 351243 348566 347350 341818 341507 345593 351652 352036 349972 350670 350136 355533 363665 359552
32302 359552 354663 345875 346028 349466 350390 348133 344918 347849 350671 352868 355814 356054 359386 358980 358726
32287 358726 357973 355562 353414 352593 356239 358836 363862 358461 356988 357561 355706 352459 352455 358011 360936 360172
32271 360172 356424 354039 355368 359365 360491 355539 358873 361909 359989 354004 349483 352301 356530 362798
32257 362798 365978 369035 377455 372980 366099 355657 356372 365564 366128 360815 363658 366072 363730 362920 362019
32242 362019 366598 369472 365498 353831 359252 361999 359811 356174 353574 355603 359217 355637 353224 356243
32228 356243 355735 358443 362088 363168 360296 358768 361099 364080 359943 359161 358801 357996 365505 368186 360692
32213 360692 359419 359772 354896 357130 357440 355736 359572 361288 359558 360756 364675 365845 363725 361910 361046
32198 361046 364057 362859 358294 360337 361342 364568 366459 363204 361250 364653 364678 363862 364038 366953 368309
32183 368309 368099 369681 364875 364203 370672 373736 369019 370717 372755 369357 367771 367410 368599 376989 377125
32168 377125 369574 358935 357560 364173 369599 369888 364700 364644 369877 372491 369752 369436 364655 363762 365136
32153 365136 362043 366077 364604 364804 367173 367501 368308 375316 371158 366427 367163 374420 375876 374314 378859
32138 378859 381638 383518 375397 367848 369576 374445 375295 370338 368054 366243 368797 372058 369827 368836 366877
32123 366877 364837 363702 359506 357408 368027 372272 371227 367573 369133 368588 371487 376598 376754 372941
32109 372941 375069 375064 375971 374885 376502 376230 374357 374625 376240 375127 371464 378163 379074 379202 378667 381935
32093 381935 383886 379408 377313 374502 372106 372960 377118 380819 379740 375648 377717 380729 380966 384924 379961
32078 379961 377590 373288 367648 365548 372291 373113 371933 373183 373366 372122 374112 377837 378546 374775 370036
32063 370036 374552 378387 377035 373652 372410 373899 370698 368962 373504 372148 362889 362353 366557 367093 365741
32048 365741 369576 374529 378394 376863 374603 368079 370107 376118 376191 370344 364310 364009 370237 371044 368866
32033 368866 368469 368735 368301 370664 377231 374494 371326 374226 376540 375714 368782 370305 365362 363989 368118
32018 368118 370712 368022 370240 375686 374719 371945 374738 375895 376829 380578 377073 370964 366030 364225 363507
32003 363507 366076 371813 375401 374984 371043 361269 369567 372411 377828 380867 380331 376249 371410 363926 363793
31988 363793 365321 370919 373781 376430 379952 380430 375616 372579 369007 372167 370918 364277 361687 367627
31974 367627 366686 365777 371741 370764 374913 373386 370216 371125 373839 372147 370935 371894 371574 375618 376864 378277
31958 378277 380927 374678 371507 378230 382071 377990 381583 382429 381894 382045 387474 377303 370367 374082 376911
31943 376911 379549 373642 379197 382298 379730 378018 383222 380075 373231 373612 375870 383539 384834 388779
31929 388779 389826 391785 382629 381174 378966 373570 368027 365654 370882 366448 361708 363164 372645 377223
31915 377223 372158 370358 374124 377202 377164 375875 378926 381188 377627 376759 382249 384905 382716 379672 375601
$$ [...]
##END NTUPLES=NMR SPECTRUM
##END=
