##TITLE=Analysis number 330177
Compound Code cc 29408
Project Code adrs
Chemist Name endeavour
##JCAMPDX= 6.0         $$ Bruker NMR JCAMP-DX V2.0
##DATA TYPE= NMR SPECTRUM
##DATA CLASS= NTUPLES
##ORIGIN= Bruker BioSpin GmbH
##OWNER= nmr
$$ XWIN-NMR		Version 3.5
$$ Fri Nov  2 11:11:03 2007 GMT Standard Time (UT+0h)  MAYBRIDGE\nmr@NMR_250MHZ
##.OBSERVE FREQUENCY= 250.131544655141
##.OBSERVE NUCLEUS= ^1H
##.ACQUISITION MODE= SIMULTANEOUS (DQD)
##.ACQUISITION SCHEME= undefined
##.AVERAGES= 16
##.DIGITISER RES= 18
##SPECTROMETER/DATA SYSTEM= dpx250
##.PULSE SEQUENCE= zg30
##.SOLVENT NAME= CDCl3
##.SHIFT REFERENCE= (INTERNAL, CDCl3, 0, 16.522)
##AUDIT TRAIL= $$ (NUMBER, WHEN, WHO, WHERE, WHAT)
$$ ##TITLE= Audit trail, XWIN-NMR		Version 3.5
$$ ##JCAMPDX= 5.01
$$ ##ORIGIN= Bruker BioSpin GmbH
$$ ##OWNER= nmr
$$ C:\u/data/dgb/nmr/ADRS/170/pdata/1/auditp.txt
$$ ##AUDIT TRAIL=  $$ (NUMBER, WHEN, WHO, WHERE, WHAT)
(   1,<2007-11-02 11:10:36.06 +000>,<MAYBRIDGE\nmr>,<NMR_250MHZ>,
      <created by zg, POWCHK disabled, PULCHK disabled
       configuration hash MD5:
       76 6E 9A 78 1E 09 19 81 EC 84 63 8F B0 6A 59 2D
       data hash MD5: 64K
       DD 0F A5 41 8A 98 73 4E 33 6A 38 2B 2C 27 3F 54>)
(   2,<2007-11-02 11:10:53.67 +000>,<MAYBRIDGE\nmr>,<NMR_250MHZ>,
      <Start of raw data processing
       ef LB = 0.3 FT_mod = 6 PKNL = 1 SI = 32K 
       data hash MD5: 32K
       EB 49 8B 4B 9E E4 4C 5F 88 32 4E E7 3C E7 2A 28>)
(   3,<2007-11-02 11:10:55.26 +000>,<MAYBRIDGE\nmr>,<NMR_250MHZ>,
      <apk 
       data hash MD5: 32K
       E0 26 E0 A0 E1 7B 65 B8 C2 99 A0 27 88 FA 37 8B>)
(   4,<2007-11-02 11:10:56.14 +000>,<MAYBRIDGE\nmr>,<NMR_250MHZ>,
      <abs ABSG = 5 
       data hash MD5: 32K
       26 09 6C 85 79 81 83 48 67 C4 81 DC 32 E7 B0 89>)
$$ ##END=
$$ 
$$ hash MD5
$$ E5 0D 5E 37 7F 5F 49 D7 8B 5E C6 D6 78 89 FC 48
##$RELAX= 
##$RELAX= 
##$RELAX= 
##$RELAX= 
##$RELAX= 
##$RELAX= 
##$RELAX= 
$$ Bruker specific parameters
$$ --------------------------
##$DU= <C:\u>
##$EXPNO= 170
##$NAME= <ADRS>
##$PROCNO= 1
##$TYPE= <nmr>
##$USER= <dgb>
##$AMP= (0..31)
100 100 100 100 100 100 100 100 100 100 100 100 100 100 100 100 100 100 
100 100 100 100 100 100 100 100 100 100 100 100 100 100 
##$AQSEQ= 0
##$AQ_mod= 3
##$AUNM= <au_zg>
##$AUTOPOS= <6 >
##$BF1= 250.13
##$BF2= 250.13
##$BF3= 250.13
##$BF4= 250.13
##$BF5= 500.13
##$BF6= 500.13
##$BF7= 500.13
##$BF8= 500.13
##$BYTORDA= 1
##$CFDGTYP= 0
##$CFRGTYP= 5
##$CHEMSTR= <none>
##$CNST= (0..31)
1 1 145 1 1 1 1 1 1 1 1 1 1 1 1 1 1 1 1 1 1 1 1 1 1 1 1 1 1 1 1 1 
##$CPDPRG= <>
##$CPDPRG1= <>
##$CPDPRG2= <>
##$CPDPRG3= <>
##$CPDPRG4= <mlev>
##$CPDPRG5= <mlev>
##$CPDPRG6= <mlev>
##$CPDPRG7= <mlev>
##$CPDPRG8= <mlev>
##$CPDPRGB= <>
##$CPDPRGT= <>
##$D= (0..31)
0 1 0 0 0 0 0 0 0 0.06 0 0 0 0 0 0 0.0002 0 0 0 0 0 0 0 0 0 0 0 0 0 0 
0 
##$DATE= 1194001834
##$DBL= (0..7)
120 120 120 120 120 120 120 120 
##$DBP= (0..7)
150 150 150 150 150 150 150 150 
##$DBP07= 0
##$DBPNAM0= <>
##$DBPNAM1= <>
##$DBPNAM2= <>
$$ [...]
##$SUBNAM7= <"">
##$SUBNAM8= <"">
##$SUBNAM9= <"">
##$SW= 20.6930455092707
##$SWIBOX= (0..15)
0 0 3 0 0 0 0 0 0 0 0 0 0 0 0 0 
##$SW_h= 5175.983436853
##$TD= 65536
##$TD0= 1
##$TE= 296.16
##$TE2= 300
##$TE3= 300
##$TEG= 300
##$TL= (0..7)
0 120 120 120 120 120 120 120 
##$TP= (0..7)
150 150 150 150 150 150 150 150 
##$TP07= 0
##$TPNAME0= <>
##$TPNAME1= <>
##$TPNAME2= <>
##$TPNAME3= <>
##$TPNAME4= <>
##$TPNAME5= <>
##$TPNAME6= <>
##$TPNAME7= <>
##$TPOAL= (0..7)
0.5 0.5 0.5 0.5 0.5 0.5 0.5 0.5 
##$TPOFFS= (0..7)
0 0 0 0 0 0 0 0 
##$TUNHIN= 0
##$TUNHOUT= 0
##$TUNXOUT= 0
##$USERA1= <user>
##$USERA2= <user>
##$USERA3= <user>
##$USERA4= <user>
##$USERA5= <user>
##$V9= 5
##$VALIST= <valist>
##$VCLIST= <CCCCCCCCCCCCCCC>
##$VD= 0
##$VDLIST= <DDDDDDDDDDDDDDD>
##$VPLIST= <PPPPPPPPPPPPPPP>
##$VTLIST= <TTTTTTTTTTTTTTT>
##$WBST= 1024
##$WBSW= 4
##$XGAIN= (0..3)
0 0 0 0 
##$XL= 0
##$YL= 0
##$YMAX_a= 521535
##$YMIN_a= -565306
##$ZGOPTNS= <>
##$ZL1= 120
##$ZL2= 120
##$ZL3= 120
##$ZL4= 120
##$ABSF1= 16.522
##$ABSF2= -4.171173
##$ABSG= 5
##$ABSL= 3
##$ALPHA= 0
##$AQORDER= 0
##$ASSFAC= 0
##$ASSFACI= 0
##$ASSFACX= 0
##$ASSWID= 0
##$AUNMP= <proc_1d>
##$AZFE= 0.1
##$AZFW= 0.1
##$BCFW= 0
##$BC_mod= 0
##$BYTORDP= 0
##$COROFFS= 0
##$CY= 12.5
##$DATMOD= 1
##$DC= 0
##$DFILT= <>
##$DTYPP= 0
##$F1P= 14.0000005364418
##$F2P= -0.99999901652339
##$FCOR= 0.5
##$FTSIZE= 32768
##$FT_mod= 6
##$GAMMA= 0
##$GB= 0
##$INTBC= 1
##$INTSCL= 1
##$ISEN= 128
##$LB= 0.3
##$LEV0= 0
##$LPBIN= 0
##$MAXI= 10000
##$MC2= 0
##$MEAN= 0
##$ME_mod= 0
##$MI= 0
##$NCOEF= 0
##$NC_proc= -3
##$NLEV= 6
##$NOISF1= 0
##$NOISF2= 0
##$NSP= 0
##$NTH_PI= 0
##$NZP= 0
##$OFFSET= 16.522
##$PC= 1
##$PHC0= 160.6328
##$PHC1= 8.559661
##$PH_mod= 1
##$PKNL= yes
##$PPARMOD= 0
##$PSCAL= 4
##$PSIGN= 0
##$REVERSE= no
##$SF= 250.13
##$SI= 32768
##$SIGF1= 0
##$SIGF2= 0
##$SINO= 400
##$SIOLD= 32768
##$SREGLST= <1H.CDCl3>
##$SSB= 0
##$STSI= 32768
##$STSR= 0
##$SW_p= 5175.98343685301
##$SYMM= 0
##$S_DEV= 0
##$TDeff= 65536
##$TDoff= 0
##$TI= <Analysis number 999999
Compound Code 99
Book Reference 9
Project Code 9>
##$TILT= no
##$TM1= 0
##$TM2= 0
##$TOPLEV= 0
##$USERP1= <user>
##$USERP2= <user>
##$USERP3= <user>
##$USERP4= <user>
##$USERP5= <user>
##$WDW= 1
##$XDIM= 32768
##$YMAX_p= 536958952
##$YMIN_p= -189223
$$ End of Bruker specific parameters
$$ ---------------------------------
##NTUPLES= NMR SPECTRUM
##VAR_NAME=  FREQUENCY,     SPECTRUM/REAL,   SPECTRUM/IMAG
##SYMBOL=    X,             R,               I
##VAR_TYPE=  INDEPENDENT,   DEPENDENT,       DEPENDENT
##VAR_FORM=  AFFN,          ASDF,            ASDF
##VAR_DIM=   32768,         32768,           32768
##UNITS=     HZ,            ARBITRARY UNITS, ARBITRARY UNITS
##FACTOR=    0.157963299565203, 1,           1
##FIRST=     4132.6476996994, 0,             0
##LAST=      -1043.33573715361, 0,           0
##MIN=       -1043.33573715361, -189223,     0
##MAX=       4132.6476996994, 536958952,     0
$$ Real data points
##PAGE= N=1
##DATA TABLE= (X++(R..R)), XYDATA
$$ [...]
24336 -87107 -75133 -45382 -7109 23232 11550 7523 1980 5955 -27678 -42072 -52940 -44098
24324 -44098 -38767 -55586 -53804 -29008 9094 4323 -51443 -66408 -36413 12442 23231 12158
24312 12158 40152 42422 30608 -3972 17226 63684 36695 12464 29515 -14995 -28196 -46895
24300 -46895 -44210 -28041 -16076 -3108 -33668 -74328 -58630 -64288 -19418 -1339 26033 74331
24288 74331 102205 94620 114516 133786 87029 86555 52590 25747 -3344 -27790 -19490 -33607
24276 -33607 -24653 -17806 -34577 -70073 -75082 -50292 -23134 88 -7484 -37264 -27533 -10040 -4637
24263 -4637 -6999 -46600 -78212 -75818 -47891 -4130 35906 41915 22728 10347 39546 82833
24251 82833 78378 60441 3811 -60147 -54103 -38107 13747 14113 -24195 55479 56562 46813 15070
24238 15070 -12143 -33707 -4381 24028 19554 23057 56520 45351 18764 -6093 -1621 -2905
24226 -2905 23069 34319 33340 27369 28327 14516 -8782 -6755 17073 42069 42149 25671 21391 31593
24212 31593 -13375 -53883 -32973 -39781 -12208 -37017 -56682 -53240 -39852 -44179 -57351 -22929
24200 -22929 -13078 -42174 -43347 6474 28056 -28048 -12423 -14265 7637 10321 -1314 -4741 11734
24187 11734 -8150 -11702 -14533 -31281 -41768 -31240 -14350 -21847 -35182 -70962 -48192 22254
24175 22254 25519 -42502 -62979 -38794 -813 -4162 -69299 -73470 -81541 -66525 -25286 22493
24163 22493 59742 49848 52983 43694 874 -44919 -16173 20829 -836 -32760 -4133 14110
24151 14110 -8934 -51486 -84866 -88181 -79527 -64462 -23839 -15415 -56182 -129715 -113593 -88154
24139 -88154 -49827 -55436 -20585 11249 -3083 -3512 5895 34774 -152 -53482 -710 19448
24127 19448 32452 13696 -7963 -26327 -27562 -60321 -60457 -34146 -22227 22781 14901 36087
24115 36087 43890 18432 3392 -15684 9798 -25715 -50296 -25133 25662 64286 35000 3881
24103 3881 -16899 16243 -25279 -28383 -28877 -40374 -5370 6683 -2933 -16894 -24707 -611 5569
24090 5569 4385 -18554 -53068 -28206 -5508 -11289 -23172 -41024 -25718 2330 47097 40883
24078 40883 9936 437 13074 -15199 -52252 -37533 4086 8675 33751 25244 46280 93749
24066 93749 97596 106133 72073 11452 3401 5991 14332 1092 20940 28395 40753 25233 -915
24053 -915 16024 47668 15079 3559 11798 22500 26765 10284 36184 63308 84725 92042 65875
24040 65875 430 -16709 16101 -10870 -44672 2771 70389 85346 85182 66319 65754 104823
24028 104823 91492 45329 26890 50426 39738 8520 -9494 -21418 2313 14589 41455
24017 41455 54936 1524 -32901 6754 18005 18189 132 16290 6682 21277 46839 49966
24005 49966 52291 41015 -24829 -58371 -59134 -75528 -29972 -6578 -23950 -18032 -6731 -25858
23993 -25858 37491 58340 49563 48122 36996 41795 43042 32471 5061 -15215 -14411 1824 -7705
23980 -7705 -12212 -54086 -51541 -72175 -58685 -43428 -72041 -24421 5195 -26896 -4508 -27024
23968 -27024 -43817 -69909 -51542 -372 13510 14666 51539 16157 -10796 -20198 10188 -41690
23956 -41690 -89807 -50653 -8993 -22220 -51983 -59524 -41666 -20450 -19989 -53509 -72047 -54365
23944 -54365 -8316 31386 32884 -8164 -1803 -6748 -12731 17728 43600 79069 53563 32554
23932 32554 20387 -1352 -904 -8199 -29077 -55820 -66154 -55014 -80888 -21191 61441 51858
23920 51858 37082 38655 2186 -18062 -25612 -20126 14153 -20624 -13834 -9550 16420 18334 23677
23907 23677 2672 -16416 -10191 7886 11796 -3490 -6425 9074 -31266 -6518 13795 26296
23895 26296 8750 15431 -28777 -35674 -19538 -37303 -68941 -38877 -14039 -4993 -6339 -54584
23883 -54584 -48712 -76897 -73946 -53018 -54450 -59747 -42943 -29944 -36701 -29685 -5634 -4264 -22817
23870 -22817 -59036 -44607 -12661 1385 5245 -15561 -38423 -17912 2895 21810 21788 12407 34933
23857 34933 51907 -4035 -21285 7089 35457 29184 41958 31897 2301 -16189 -441 2959
23845 2959 11854 3052 5863 12728 14505 8405 3828 -1365 8928 -2189 -28254 3300 10558 53584
23831 53584 55514 -5371 -12845 -11935 16470 64555 68909 68372 20830 -45811 -21213 39418 49789
23818 49789 62675 71737 80433 74301 66932 36377 14206 -18778 -119 16539 21210 22811 59853
23805 59853 66355 31078 24026 44584 -1318 -13964 -32379 -27501 -27192 9254 46107 83242 82080
23792 82080 69136 9666 -22629 -26098 -18925 15560 3650 -17329 8142 37510 -24113 -63078
23780 -63078 -38793 -40856 -16684 -27147 -33386 -13782 1299 -12532 -45551 -52312 -35898 -2186
23768 -2186 31423 30408 51568 49689 11010 -17230 24728 18044 -45232 -92726 -39286 486
23756 486 -5116 6436 10661 -30285 -23868 -7445 26799 49325 -295 -6091 -35856 -53886 -36725
23743 -36725 11868 28474 511 1416 17619 20627 16696 -9425 -15681 17275 -2956 15760 54754
23730 54754 10130 -17656 19315 3538 -23676 -47987 -37482 -21678 21215 24458 19806 20411
23718 20411 11228 -15984 -24903 -7414 -15549 -14738 8634 11336 11030 33304 11414 -37149 -45950
23705 -45950 -49082 -49138 -49818 -24842 -21745 -17032 16625 30835 -9455 -892 25810 7402 -31433
23692 -31433 -7616 16062 38496 51058 47359 40188 38863 48946 27333 -13431 -14998 -5290 27773
23679 27773 7416 4784 5052 -25245 -24540 15202 46653 25235 7765 -573 -35101 -56186 -27832
23666 -27832 -10643 -38640 -10413 25851 30764 81877 85672 35213 21922 1231 -26388 -54209
23654 -54209 -51430 -43280 -9576 5316 -12776 -17309 -10313 -15742 -47183 -59130 -39422 -8016 -16345
23641 -16345 -8764 -63617 -59763 -81994 -36168 14907 2751 -39413 -48272 -43683 -1169 15049
23629 15049 -7886 -8151 7209 3289 9771 14981 -5499 940 21752 42582 8999 18437 45048
23616 45048 33569 38206 10521 -6171 -5960 -10124 -35836 -56964 -31152 -59266 -79421 -51242
23604 -51242 -34981 17848 28996 1235 -51804 -20746 29775 41777 59034 30784 -7836 -18068
23592 -18068 -33243 -46060 -38419 -16205 13982 22253 7016 -18700 2626 9286 16464 13425 -15266
23579 -15266 -15581 8285 31155 10896 -31246 -24938 -40899 -34014 -23020 99 31994 70689
23567 70689 83681 37350 1153 5875 -29307 -58318 -44414 -59391 -77517 -91392 -65292 -41677
23555 -41677 -63596 -60998 -53554 -62672 -50406 -42439 -125 11092 24753 30654 32874 19001 23391
23542 23391 13718 10763 31776 47252 20903 -28758 -6390 32759 58746 60678 56654 26430
23530 26430 -43123 -72764 -19082 6496 3953 -2864 -7743 -6819 34754 43345 22893 44270 63071
23517 63071 45389 67002 88101 101265 96024 64429 34597 24915 48842 32321 46559 62075
23505 62075 83996 56723 -19434 -5400 -2944 -43286 -32339 -24899 -35857 -24418 -63597 -73074
23493 -73074 -49321 -13897 -25677 -26854 12976 24834 -1239 33929 98977 122540 124159 65143
23481 65143 50188 51400 25685 1929 17530 8412 21726 24572 -24278 -29202 -31517 -895 31200
23468 31200 17158 -5088 2666 9053 39257 14160 12219 9202 -22271 -35555 -42901 -30742 -15365
23455 -15365 696 -16428 -36725 -47197 -42354 -31704 -20669 7074 48137 27789 -6999 -10664
23443 -10664 33458 45354 62294 33415 14819 61496 79682 59024 34975 33913 43219 22336
23431 22336 -14352 -42088 -3931 15952 5680 44618 60563 10205 -3085 9119 36516 30199
23419 30199 9142 7873 -7552 -3666 -6371 -29973 -31823 -28522 -29339 -25984 -16403 -47663 -91178
23406 -91178 -63213 -24960 -32651 -58499 -84468 -60091 -17083 13793 12586 6448 -15051 -19335
23394 -19335 -30161 -36260 -21449 -4054 16104 11693 -19501 -31837 -7962 30852 -1237 5478
23382 5478 43764 29566 16154 -3552 6527 -10039 -23417 -6548 8314 -8532 -15237 -32665
23370 -32665 -28362 -9759 4213 -8608 -56863 -59089 -38231 -28855 1414 105 13605 52280
23358 52280 68777 52765 38126 55589 43440 -4523 -41761 -42237 -36275 -14328 13803 1003
23346 1003 8540 20807 23562 -4718 -26137 -53667 -62638 -60075 -19357 30405 33705 35643 5641
23333 5641 -5919 16145 24148 39559 40309 38355 -10548 -35521 19287 59023 78463 100776 68986
23320 68986 33231 20654 14108 22318 29183 24087 8576 -11051 -5830 -1439 10899 61437 40396
23307 40396 -2665 -44392 -35211 -16970 -6516 -48030 -58163 -26399 12785 27409 4311 -45675
23295 -45675 -38873 -31471 4511 37196 -15379 -63157 -73206 -45641 -15038 8220 -22681 16260
23283 16260 49309 44985 32589 40573 43780 46146 47071 67896 29780 -38671 -47199 -24302 -28585
23270 -28585 -79041 -97689 -66812 -38582 -44266 -21355 31609 35296 16857 35176 39384 40010 32807
23257 32807 49386 60952 62408 48398 34328 58626 79870 69917 26403 -3840 -20608 -13490
23245 -13490 13319 26947 24260 7156 -3907 -8867 -31785 -43856 -25483 5022 13807 18278
23233 18278 897 27619 84930 59342 46434 14912 35055 34463 38987 -9566 -56524 -39332
23221 -39332 -30593 -30587 -41986 -24220 -31573 -21423 -1559 1975 18501 -1610 -21724 -26226 -45820
23208 -45820 -48616 -24144 -42080 -28756 22122 35372 8901 -14396 -16077 -41463 -45891 -18404
23196 -18404 54723 70067 62217 68392 43182 54944 76769 35609 36206 36195 58603 77207 31724
23183 31724 -13470 -29925 -42116 1699 34460 40658 17245 -40279 -31809 -16663 11133 32219
23171 32219 48063 48768 7047 -20778 -931 25400 69948 57317 48282 40870 33422 23795 -10009
23158 -10009 -52899 -20834 -3381 -10184 11782 44407 46129 57690 76961 48933 30450 12600
23146 12600 2809 14234 25229 3503 -6767 47350 64776 29452 5604 -18968 -30169 -30864
23134 -30864 -15116 -11983 -15787 3389 24008 21044 16051 -12033 -19754 -47724 -49057 -42734 -37022
23121 -37022 -28905 24538 5684 -14637 -21686 -14853 35366 41107 38620 13045 -48693 -54155 -57438
23108 -57438 -48009 -34053 -20485 5463 14610 809 -21527 -37152 -45508 -21221 -54024 -83604
23096 -83604 -105434 -51510 -20078 -4566 -10814 -23893 -13079 -11499 39548 58477 20591 -43517
23084 -43517 -51466 -46596 -31691 -24047 -7250 54151 62795 38120 16888 -9200 -39384 -74341
23072 -74341 -58960 -16348 -8149 -10951 43728 82865 116258 115629 95064 127444 82130 56660
23060 56660 25119 -3300 36557 58512 56533 22161 45758 58439 34240 452 -15116 -25574
23048 -25574 -5774 33241 40786 40588 61286 67087 47678 44356 52873 56601 36722 45873 25988
23035 25988 42344 72950 89932 40297 -17028 -32587 -15582 -34163 -76131 -91538 -85128 -36489
23023 -36489 -42007 -29128 -15689 23702 23282 -22758 -9116 8729 37794 28095 13639 33967
23011 33967 46190 35261 23098 -17359 -50602 -61516 -32650 -38620 -57588 -73878 -60326 -40460
22999 -40460 -42210 -30873 -51164 -43394 -33827 -36939 -4502 -3866 -7855 12676 14150 -30912 -12870
22986 -12870 7841 10926 4297 -22727 1806 5526 -14535 -3184 -18280 -9511 23861 9816
22974 9816 -19778 -27140 -4501 46036 17226 -4220 -16277 -26469 -26184 6186 35800 57675
22962 57675 52571 58087 35737 33531 65978 47150 41561 33505 32464 37452 -24905 -64077 -70984
22949 -70984 -39907 -48308 -51890 -43497 -55420 -68493 -40688 -40151 -59781 -42276 -55746 -53182 -27419
22936 -27419 7532 13083 44377 19661 -27833 -8476 -5136 -46982 -68522 -33079 -1159 -6714
22924 -6714 5670 -21469 5622 1767 -52578 -84917 -78865 -48910 -85390 -72649 -51216 -57626
22912 -57626 -80031 -28870 1993 31719 1742 -19183 21261 65256 31666 -14233 -24819 -22482
22900 -22482 22730 243 -3916 -672 -14768 -32493 -55766 -54659 -32315 -4991 -5543 -53981 -90945
22887 -90945 -38837 11270 -3503 -34036 -33293 -87844 -56949 19593 37367 36713 -9426 -38357
22875 -38357 -29692 -11977 11518 -23 -16027 -20771 -9418 12157 17073 20405 -35267 -66985
22863 -66985 -25938 -5496 9921 -26729 -26701 -10737 9513 -1532 -43041 -7875 9631 -22513
22851 -22513 -55051 -47137 -49001 -21525 16058 34693 59843 49039 35911 61413 59717 34916
22839 34916 75530 118874 100338 62184 71830 34783 5018 11718 26638 -5948 -29174 -24116
22827 -24116 -14594 -10903 -26440 12893 42500 33016 25863 11497 28988 11450 10668 26341 9375
22814 9375 -28513 -50670 -10079 21953 38007 52618 59680 25072 -26499 -88703 -92105 -69469
22802 -69469 -42433 -27995 -20477 10794 38003 33149 22280 20520 12772 22000 3740 835 4619
22789 4619 25786 18897 6402 -2484 -31560 -42313 -24378 -21673 -67000 -52195 -306 28090
22777 28090 38476 59506 33218 -14179 -43837 -27024 805 20633 9919 -5587 -16618 -3275
22765 -3275 -41968 -50430 6309 10399 14556 16938 36330 17412 18233 17556 -3337 -7030 -20048 -56437
22751 -56437 -42547 10096 25491 26155 -5579 2009 40364 55355 20596 -4750 18939 38491
22739 38491 26349 -14917 -28363 -27768 -5337 6442 18202 18271 48727 38310 21772 18150 29500
22726 29500 21574 -18681 -5407 -21597 -40376 3059 -414 2488 -6356 -24215 -10679 -12880 -19182
22713 -19182 -7937 -55793 -70012 -49046 -62443 -81470 -52321 3215 33454 54376 61503 35644
22701 35644 -4936 -19093 -8951 -20815 -37189 -27684 -6254 7372 35117 36096 51850 59955
22689 59955 40654 58362 67388 -12201 -32900 -63018 -72459 -51173 -11543 26242 62253 64477
22677 64477 32397 23026 46744 50130 67129 67288 29111 19727 3434 3610 -45212 -75070 -56600
22664 -56600 -38732 -13602 -19175 11264 4868 29893 4594 -1247 692 16946 4827 3545 -12218
22651 -12218 4765 2374 -16453 -25642 -12007 -47549 -61100 -33287 -18549 17004 29064 27716
22639 27716 58617 53882 1945 -12725 3365 14995 40801 24707 60078 83988 98002 61181
22627 61181 24968 25855 50196 49592 43566 40516 6362 202 -24992 -16545 17720 46045 49974
22614 49974 27723 -15237 -46162 -36472 -21769 -1502 -18999 -35944 -32414 -5779 31897 22033
22602 22033 32317 36481 30779 19258 -31171 -66166 -97397 -52509 -35389 -33257 -3834 -15171
22590 -15171 -28858 -19180 -3853 -25476 4802 9580 70496 99528 59194 -15067 -31829 -25782
22578 -25782 -4236 -5508 -13979 7009 42333 5431 -18461 -38103 -39871 -241 23275 19347
22566 19347 35459 27515 41216 30136 2479 -11891 -960 5545 4771 39106 77170 74231 54832
22553 54832 31516 18610 506 -32650 -6145 -217 -19806 -43569 -18720 -14980 -10888 -25683
22541 -25683 -12823 -31528 -53128 -48967 -65026 -85382 -72899 -55008 -56504 -46176 -5664 -18959
22529 -18959 -26613 -46890 -22189 -16950 19842 35982 15048 -19397 4616 46303 13050 10796
22517 10796 7459 -37168 -60901 -46339 3394 14124 -3548 35411 74547 85005 79855 32082
22505 32082 42417 57871 34568 3915 19355 41890 32083 29310 15474 2154 -6856 -32654
22493 -32654 -53493 -32509 -27651 -57668 -37238 13980 19732 -8161 -28928 -35253 -23842 -25767
22481 -25767 -39087 -26514 17634 19976 -10797 -32709 9161 51834 25017 2039 -24233 -30787
22469 -30787 -33850 -929 60512 116114 105382 83051 95440 89319 101900 107805 90702 68907
22457 68907 68066 73630 61264 40123 -11038 -15347 -6340 7900 6826 -17746 -26442 -10294 -13834
22444 -13834 -11981 2878 -5201 -11146 -10804 11878 57100 56030 19296 2165 -15615 -45223 -36062
22431 -36062 -22162 -16969 -2031 3379 15203 28780 -27422 -65806 -27071 4397 6410 31900
22419 31900 35452 -12703 -71733 -54288 -9451 -47814 -85998 -68852 -44996 -36360 -24128 -40773
22407 -40773 -27542 11075 41595 26046 23123 22510 19668 24364 1618 -15522 -51785 -66134 -40217
22394 -40217 -28863 111 22396 31707 -17084 -16228 24009 51303 42524 64841 40154 33367 19357
22381 19357 7051 5583 -38397 -46843 -28794 -2645 -3543 12481 -35089 -21130 -6609 -47691
22369 -47691 -67685 -41254 -27444 -37759 -34050 -35895 11611 56783 38823 9726 1313 9331
22357 9331 -18416 -17308 -12164 1874 17199 -6676 -42016 -17627 -10276 -32236 -56287 -36034
22345 -36034 -5506 -3273 -14036 6176 61781 94200 91154 95162 79346 54888 44353 26979
22333 26979 32951 35333 33211 4000 -12448 -31633 -43520 21394 71817 49827 57978 48278 38719
22320 38719 28305 -18265 364 18999 -17423 -28542 -35532 -29819 35753 35014 7085 -1522 -903
22307 -903 8274 3471 -12466 21799 22369 10273 3346 -7040 -3466 -43115 -66880 -88986 -83175
22294 -83175 -13478 20397 2348 -41839 -22426 -109 -4934 -31331 -12337 -14375 -7616 15313
22282 15313 17663 17672 35672 57473 34532 10732 -20002 4410 1506 197 -27648 -63477 -48075
22269 -48075 -28131 -8743 -39123 -70370 -44785 -8335 -56299 -96366 -77260 -83187 -60695 -37956
22257 -37956 -50108 -63751 -55970 -90351 -128236 -88039 -33902 1036 -7251 -36927 -16147 -12232
22245 -12232 14633 16627 62059 42090 26388 47892 45935 41157 45880 70469 72190 34566 -9676
22232 -9676 14691 19304 22697 -15283 -26606 -22402 -28429 -13495 29746 65724 51340 30757 5198
22219 5198 -26417 -18264 22735 37406 30590 72862 77680 49006 5098 -52166 -70284 -87563
22207 -87563 -76563 -43092 -15902 -59347 -59152 -41963 -29756 -46526 -34244 -5181 -32830 -37269
22195 -37269 -62705 -44980 -2432 -9949 -49543 -17130 7450 22259 33964 62390 37758 4565
22183 4565 13752 10470 6897 5378 41360 14309 -7943 -26588 -40195 -21266 -27907 18729 23982
22170 23982 685 -21225 4318 4049 -27035 -42355 -858 29359 -1748 -31302 2815 53653
22158 53653 72418 61158 43420 44192 51520 20378 -6243 -21549 -23786 -48163 -64280 -51907
22146 -51907 -29961 -43808 -59769 -26343 -8872 -9350 -27998 26903 63936 58041 33340 24434
22134 24434 323 -9985 8520 -10707 -40208 -48956 -34504 -10887 -22118 -32058 -42719 -31399
22122 -31399 -7642 -12118 -45160 -59161 -64108 -77720 -60974 6668 16550 -8958 -15966 -43431
22110 -43431 -62266 -58897 -4979 11339 6585 23624 44223 60746 12994 -28238 -52778 -49119
22098 -49119 -16546 16602 -17669 -22246 -25594 9313 28290 47637 66514 87911 57191 4879
22086 4879 -16083 24822 -6662 -26506 -23269 -6611 893 26605 51375 46243 38736 -12866 528
22073 528 46754 72234 80894 44251 13972 22949 -2849 12022 42652 33221 10358 -6320 3125
22060 3125 61095 89989 56163 41036 19878 13401 -16200 -50029 -45339 -19668 1983 375
22048 375 -43205 -28232 -29129 -41664 7406 87425 110323 64426 43332 44859 39903 -10340 -73860
22035 -73860 -81687 -82064 -59444 -48518 -83420 -73453 -38626 -31817 -1963 -13075 -13083 14124 23699 14605
22021 14605 -4243 -13525 -20258 12953 45888 89422 89277 50421 14259 23314 15084 -14320 1488
22008 1488 -33405 -67419 -38703 11504 25660 21249 37566 -12705 -23139 -38894 -46838 -7226
21996 -7226 42041 74709 35587 28211 45887 7065 -8782 -20002 -43246 -78629 -97711 -69751
21984 -69751 -65093 -39563 -35654 -23182 22118 45438 38614 35592 34395 32952 14715 -5777 18653
21971 18653 19509 -3725 -11092 -12798 21018 -14956 -22671 -7458 12680 -7394 -4053 25511 -22876
21958 -22876 -40772 -24150 7664 28713 42123 35117 31322 42551 36283 47825 46855 18623 -7729
21945 -7729 -19869 -41658 -72378 -70663 -66311 -63385 -36520 -65606 -67723 -91723 -75414 -103533 -54873
21932 -54873 -2339 25537 25989 9882 -7992 31054 72608 49677 36103 26325 40836 -38381
21920 -38381 -75395 -74725 -33227 -5939 9013 -10431 -12023 -23544 -57684 -45874 27110 49412
21908 49412 -8794 -57060 -83892 -73772 -28475 3267 -3097 7436 -6492 -4954 -44169 -48016
21896 -48016 -42591 -33602 -60534 -86246 -65025 -22556 19313 16643 -7208 -4448 9675 15741 -5909
21883 -5909 12836 -8039 -31098 -69471 -84406 -80490 -64385 -59311 -41334 -73570 -109648 -109814 -119781
21870 -119781 -80692 -67502 -72120 -58057 -34261 -57055 -77474 -80749 -73790 -69437 -27841 24734
21858 24734 37935 22145 52589 55211 28084 41213 17754 32157 27148 42033 15924 14366
21846 14366 -31129 -58325 -75070 -85106 -68614 -57348 -51283 -25001 -23238 -40454 4007 15301
21834 15301 48837 72577 96058 63941 36413 33971 67840 72008 102476 78664 18289 -45152
21822 -45152 -61182 -58767 -59325 -10284 -6855 22806 19810 29835 8543 -3582 -8587 -17282 7258
21809 7258 34234 28408 5372 -30238 -3047 9492 -22083 -54127 -75133 -89223 -84745 -78344
21797 -78344 -100306 -68876 -55172 -56000 -59148 -32225 -21921 -26029 -14738 -18568 -29136 -36387 -57992
21784 -57992 -49693 -10966 13626 47253 56519 40581 28169 42762 31256 -5288 -1027 22860
21772 22860 1186 -14477 -13581 -31307 -53208 -26997 -1336 17703 -1370 -23010 -29400 -11070
21760 -11070 8727 19854 13611 50253 71909 122288 132472 105128 97749 67480 32921 22218
21748 22218 17972 10835 -34204 -13419 802 8221 -4134 13342 -25135 -73599 -96239 -81467
21736 -81467 -69786 -13737 45084 38245 7701 -30354 -32187 15957 -1200 -40577 -34805 -32194
21724 -32194 -34246 -54300 -80001 -73978 -74545 -59543 -64207 -39717 -24362 -21263 -17484 -18776 -38784
21711 -38784 -48397 -6268 3745 4843 12792 14114 28029 43427 60113 76606 81480 48340 982
21698 982 -26905 8024 53863 63082 72048 55430 37708 16597 25254 52039 41318 26597 -8733
21685 -8733 -46466 -35409 -56165 -61026 9864 37124 -17676 -70623 -58775 -41073 -31344 -43882
21673 -43882 -14905 -29757 -10972 27864 37144 50095 18056 2533 26565 71230 52118 -14865
21661 -14865 -6012 -6680 11373 65085 89281 100480 55722 -3904 -9876 1527 7721 -32308 -60234
21648 -60234 -56135 -74334 -44696 -35980 6092 7069 25783 13148 49525 -6226 -44333 -57213
21636 -57213 -52328 -56483 -77077 -62111 -23032 728 4827 24298 12014 10141 9119 -14184 474
21623 474 -1669 26469 6555 -18812 -11436 -29894 -36502 -51739 -70850 -53773 -35279 11390 33578
21610 33578 1698 -66441 -73803 -40587 -18688 6800 -7282 -34022 4592 24198 7836 -6541
21598 -6541 15054 34030 54469 70049 29029 -18821 -17740 -13026 33933 33054 17457 10926 17336
21585 17336 47089 19857 -34529 -47821 -40115 14865 7712 -8721 7531 -16983 -45735 -37758
21573 -37758 -43966 -93644 -69703 -27141 -8554 -27906 -60209 -19505 -7396 -4484 913 -19179
21561 -19179 -30418 -19536 -36407 -59424 -59363 -65938 -87698 -104416 -86166 -64099 -114744 -129455
21549 -129455 -94185 -62476 -48689 19889 44165 18709 -15414 -60735 -6802 -16574 -23505 -7668
21537 -7668 5212 17343 -36284 -90423 -104711 -111380 -86845 -28369 -1136 12714 -27141 -1485
21525 -1485 13941 34111 21752 32130 37566 28450 -1798 21063 -8128 15064 40134 55299
21513 55299 64138 46169 61179 44012 13770 34696 24036 11113 -9074 14981 16051 41052
21501 41052 51372 5868 -6726 -2469 3408 23770 54460 46642 57772 43593 5039 -45363
21489 -45363 -73687 -65819 -39708 -30345 -3436 19350 -24413 -7019 -16695 -8474 31134 38202 17054
21476 17054 59419 59449 9423 23907 51310 21064 -27673 -32460 -34369 -58870 -50123 4315 33550
21463 33550 23184 26127 31534 -1208 -36549 -22323 -21489 -49081 -81037 -38906 2781 11392 -23921
21450 -23921 -11515 -37870 -68359 -62805 -16352 -1309 -47036 -62240 -22328 -26299 6931 -24617
21438 -24617 -32744 -6498 18379 18027 -29593 -30886 -10276 -5348 -13716 -13249 -13262 -15054 -26843 -11648
21424 -11648 -6265 -2886 -11648 -13943 -24285 -57618 -17012 -22457 17589 17253 -23114 -17104 17471
21411 17471 37509 16397 11291 -4009 25118 36197 44206 43476 -7644 -7341 19166 62782 83426
21398 83426 46117 49508 105537 85022 31991 23896 59012 52179 3448 -10076 5688 39592
21386 39592 23710 11464 -18325 -17205 13725 32196 6654 -25318 -66516 -30455 20279 20110
21374 20110 26922 58301 52828 52657 23647 6399 -28548 -18167 -43513 -67166 -77776 -86701 -36786
21361 -36786 -45365 -40969 -8209 21763 53530 88048 44155 361 -13702 -28630 -31574 -63955
21349 -63955 -55934 -4399 4986 19073 10137 -41314 -74575 -40672 -2416 51570 25790 54816
21337 54816 70809 69725 54923 5203 -9941 -34956 -16287 -4530 -47299 -36496 -2346 17697
21325 17697 12622 -21382 -13896 -18450 -11863 -30221 5865 7163 -13664 -23711 12767 51000 50108
21312 50108 5766 23361 29463 2836 16817 26312 -7894 -26142 -9109 -12674 -32261 -36078
21300 -36078 1654 20357 -2408 -17094 14382 36315 38080 30424 -10022 -60355 -44760 -35009
21288 -35009 -9844 31311 26473 14900 26809 40360 33 -43507 -29470 -25322 -41521 -2149
21276 -2149 -17684 -14528 -11984 -21410 -23872 -15126 -37537 -19484 -16890 -25983 -24734 -7167 11727
21263 11727 -24693 553 21621 2876 23848 61058 65739 10480 -21266 -19360 -1790 38109
21251 38109 20480 -16187 -12332 -3891 29436 24292 -27265 -87454 -72116 -60952 -24343 16089
21239 16089 43679 43350 18643 -6404 -122 -18603 -45884 -46086 -46171 -23630 -11711 -23605 -15205
21226 -15205 -8075 26349 72550 59744 36932 51008 50995 2417 -24927 13525 53730 34280
21214 34280 -13061 11718 21438 21376 25273 47446 61301 45473 19272 -29407 -31492 -912 44064
21201 44064 49314 61049 -260 -10369 40043 84022 45356 32878 63306 44455 3039 -19728
21189 -19728 -3439 23023 25009 49747 28812 49471 34973 -24738 -19987 -8738 22035 18920
21177 18920 11043 46886 60730 17977 -26835 -57828 -26657 -22551 -30675 -10071 -12678 -7966 -7459
21164 -7459 15246 30546 31763 31365 -671 -21539 -24739 -31465 16849 40473 3627 -13121 -30427
21151 -30427 -51620 -66494 -27045 23921 -6477 -39739 -57618 -11412 29358 3743 -22052 -58442
21139 -58442 -48125 -41503 -15229 -1598 -27238 -5684 44025 24888 19890 52293 105192 94837
21127 94837 -9948 -43406 -71395 -85916 -55977 -13838 -59808 -21452 -30483 -28753 -30081 -64560
21115 -64560 -75890 -61076 -8554 18045 51172 45692 5556 -1362 -4600 17971 19519 14737 37898
21102 37898 33472 27644 -9814 -33806 -45949 -38387 12147 52141 81068 57268 16620 -9709
21090 -9709 -59069 -76845 -53529 -25065 -1720 17327 10272 14480 4948 3456 -3591 6043 -19940
21077 -19940 -30039 -37851 -19790 -11970 -19462 -27386 -65983 -67071 -59244 -16833 21449 19100 50360
21064 50360 55653 70605 64138 64233 47336 54459 47125 11649 20407 33035 46816 -12270 13994
21051 13994 54883 60138 16761 -44837 -66541 -77512 -59145 -70425 -86740 -59580 -53903 -18329
21039 -18329 3745 10071 14578 18344 34654 35021 29233 1621 68983 94038 53645 15691 -14799
21026 -14799 -29070 -43706 -16571 13565 51531 19818 -1739 -13553 -32062 -15385 -46980 -58873
21014 -58873 -66312 -39878 4944 -31995 -54018 -42611 -19650 -55032 -40609 -4858 -14507 -15028
21002 -15028 -10102 -22043 -59372 -24016 -1007 9868 -7237 -27981 9831 57998 41329 16548
20990 16548 -11951 -67467 -102853 -70282 -8159 234 -23135 -69262 -111559 -37527 -29915 -47135
20978 -47135 -18988 -19217 3226 18386 14523 -2764 -5475 7484 39914 4277 -25464 -43061
20966 -43061 -22327 -29574 -41070 -52077 -42052 -26928 33058 -12616 -70813 -80782 -21370 24837
20954 24837 42901 11725 -1007 -4745 -48104 -38723 -53930 -24191 -8844 8637 12448 -7331
20942 -7331 -27652 -2668 21243 30814 -9485 -15308 -40439 -60033 -34571 -32999 7890 1468 -21566
20929 -21566 464 35632 8572 -6624 -11984 7293 26687 39708 -21204 -30996 -41013 -41057 -19848
20916 -19848 -23434 -9502 34227 46205 18298 -20960 -21810 26090 61427 60106 30339 1803
20904 1803 -37996 -27543 20393 16962 1779 2779 1560 10092 -15483 -3835 11554 -10430 -26035
20891 -26035 -2922 7549 8233 -21373 -33532 -15524 -15222 24683 38218 20790 18270 10921 29722
20878 29722 22781 29064 29333 19984 -4875 -21532 39017 63633 39488 10443 -15583 -40339 -22658
20865 -22658 46035 58748 20759 31332 39170 52166 74520 27541 15175 5986 -7751 -28335
20853 -28335 -39737 -19271 6637 -35019 -88541 -84675 -85921 -56920 -1601 -5792 23556 37058
20841 37058 -7561 1427 33249 17633 2927 22084 22937 6058 7037 3964 2120 18434 17149
20828 17149 6445 22344 28145 17803 40863 17166 3829 -7434 -37751 -17475 2807 14098
20816 14098 -23741 -59257 -44139 -61678 -52356 -26006 -26215 8336 7955 -8505 -20903 -60067 -24040
20803 -24040 -205 21041 24877 36907 58953 72782 11342 -71632 -94950 -86202 -49906 -3155
20791 -3155 25476 40030 36285 31738 -9664 -29073 -11028 -9304 -15407 -64773 -90342 -67028 -58016
20778 -58016 -32363 -24537 7611 40050 17266 -22083 15564 4748 -15734 -44109 -82199 -87205
20766 -87205 -48432 -34587 -24857 -36119 -16290 -11879 -31216 -76393 -69905 -39576 6033 1001
20754 1001 -35660 -41441 -19107 -13473 -21486 22864 5514 -9678 -12837 13401 1511 -10855 -51780
20741 -51780 -63158 -39603 3660 -7377 -35557 -14580 39449 34835 10444 14537 33927 88996
20729 88996 78632 16623 -17546 -28414 13004 45724 10884 -5835 -5865 -26317 -23248 -2389
20717 -2389 -37836 -49702 -55969 -48249 -21610 4943 -17091 -60227 -101504 -86998 -70096 -44178
20705 -44178 -5894 24551 50925 50578 -6575 -38043 -24208 -44287 -43700 -55647 -75514 -47257
20693 -47257 4790 -1492 -36454 -16823 -19605 -6999 -22712 -50056 -67292 -50504 -49885 -21713
20681 -21713 11926 -19969 -48401 -29410 15874 29313 28280 41233 20061 -6526 15178 -6521
20669 -6521 15426 24265 23194 35933 14356 -23911 -3646 9231 16200 -22051 -62284 -60401 -36950
20656 -36950 -12205 4532 2700 -45681 -58742 -54564 -736 5190 -28337 -4189 51303 51658 28434
20643 28434 36045 35075 28166 12541 19719 38200 70655 26571 26788 32886 1282 5364 -11623
20630 -11623 -21981 -20775 -17266 -16277 7644 -1366 -20024 -23996 -33906 -24421 11829 18657 -17645
20617 -17645 -40897 -65417 -56908 -73923 -54723 1358 36769 20588 -5283 -54781 -66842 -65187
20605 -65187 -59038 20817 22090 -8932 -15903 -19607 -16790 892 8074 -25170 -71727 -83987 -73919
20592 -73919 -59229 -25814 -12712 20472 35443 30961 50578 36466 8236 2999 19852 52896
20580 52896 44142 38078 -454 -50458 -50233 -42669 -12884 -3761 -7838 -14167 15376 39231 9969
20567 9969 -7353 -15075 9130 56424 62783 59727 9992 -30995 -7384 -5872 45711 72839 16021
20554 16021 -30751 -43957 -30876 5426 13192 -17662 -30797 -7864 28949 -557 -33033 -51092
20542 -51092 -31865 15214 33010 41033 24558 14549 28825 22518 42125 74351 67220 52791
20530 52791 19755 18842 28550 -7632 20187 14283 -7231 -10471 -32409 -67946 -87131 -87425 -60845
20517 -60845 -52116 -40470 -42246 -33489 2027 48290 72797 44640 -12669 -50636 -40650 8877
20505 8877 15608 -17789 -3932 -20566 -18498 -21046 -9661 13614 65333 84279 51376 55502 61328
20492 61328 48436 5918 34003 75975 86939 77064 39916 38751 27669 2568 7725 6605
20480 6605 57224 50406 9677 14812 29504 5317 -5802 -43909 -68607 -50977 -23390 -30341
20468 -30341 -28552 693 2391 10316 42441 83326 115988 86219 53893 49776 5236 -38840
20456 -38840 -49291 252 -4204 -39752 -73745 -57638 -21261 9001 -12210 -56834 -46815 -44020
20444 -44020 -58722 -43447 -47066 -59876 -100 25073 31024 4652 -45118 -79558 -87309 -62650
20432 -62650 -61566 -32656 -4429 -44700 -59240 -77968 -21333 27890 40836 28214 14840 6777
20420 6777 24087 53056 47234 23274 -4858 37384 23576 -2584 -7237 23796 33226 21073
20408 21073 36483 36440 16127 26276 35279 17090 24786 747 -7515 -12272 -7500 -5975 -52830
20395 -52830 -41606 -3916 -3901 -24874 -4973 13810 -28448 -30704 -4397 -20971 -39683 -37225 10154
20382 10154 -244 34950 58997 47417 -10729 11787 47216 39383 43146 63853 19522 54783
20370 54783 78388 45671 18457 -4089 -4152 -31515 16821 7634 -25081 -12476 -14679 -14113 -337
20357 -337 -2785 29101 19830 1664 7880 2641 20356 35829 72596 40107 41276 76532 57613
20344 57613 36210 41178 59882 42293 6475 -7002 15461 -5730 -34426 -43231 -26993 -5613
20332 -5613 -5280 13322 29577 36324 20348 -19840 -51828 -57130 -31035 6233 38195 12702 -20315
20319 -20315 30299 32255 -4996 -24729 -4246 10297 31082 20304 5531 -9906 -4309 19492
20307 19492 20034 7662 5931 3114 -5380 9548 32950 75682 91874 26484 -11547 -20373 -1311
20294 -1311 -23818 -9918 -7263 -27081 -46724 -23690 -43348 -88504 -117837 -113606 -92463 -71659
20282 -71659 -17293 -10846 -40968 -70246 -59832 -920 28152 49828 27220 13768 -1312 -21305
20270 -21305 -29090 -10370 -13942 -55959 -75708 -63354 -63510 -40104 -21968 -36732 -51658 -10212
20258 -10212 -22167 -10303 -9165 -60677 -58228 -36906 -18706 -55875 -80743 -54557 -62302 -72468
20246 -72468 -35263 -73599 -55396 -21989 -15416 -35391 -95382 -117426 -61097 -9115 -22788 -46413
20234 -46413 -20615 -19428 -43791 -48619 -70240 -71391 -59680 -70706 -58983 -22848 1939 39969
20222 39969 57901 61341 41752 -2545 -42213 -61040 -77642 -42279 13067 43640 18992 -3547
20210 -3547 1723 -23809 -34067 -1843 18469 19137 26692 -7150 25016 66188 75047 68832 -5592
20197 -5592 2210 54756 100192 79575 43101 9167 -8825 -22728 5449 74953 72889 41076
20185 41076 94013 156563 131425 71559 32766 62487 36594 -616 -1751 -9873 22830 55743
20173 55743 61896 75341 67414 62124 79591 30022 28881 59155 11125 -21953 5082 44129
20161 44129 42983 50525 54343 26536 -16019 13750 38078 11987 42059 41059 26884 -9661
20149 -9661 -29106 -50717 -75342 -53344 -31385 14094 49510 59599 39488 50469 57070 79429
20137 79429 59756 12618 -13040 12324 -19717 -35003 -24978 7016 39269 75789 81325 110983
20125 110983 59210 1595 -29436 -20666 -34129 -41515 -53545 -31468 -27171 -16344 11885 23980
20113 23980 15392 -21 46839 15111 -62426 -23992 -9291 -44481 -43777 -31823 -28305 26431
20101 26431 34099 -17688 -22405 20698 14853 8308 -44805 -47963 -13043 3777 17930 54750 61264
20088 61264 30738 -19666 -63603 -86471 -34030 30756 50235 70535 24366 9371 38337 52145
20076 52145 73165 49836 43111 44184 43465 43547 24481 1267 -10241 1619 -37118 -68017 -38851
20063 -38851 -12900 -12331 -33919 -23471 4432 1094 -2616 25124 11635 -23070 -25376 -2885 -32912
20050 -32912 2670 15235 50856 69607 105292 106631 101258 114370 112429 71006 39033 7036
20038 7036 -28618 -33334 -27988 -5540 25343 28585 41301 44797 33847 44897 33669 16289 9693
20025 9693 -19977 -14489 -18296 -18878 29180 84715 78418 114333 109999 89806 82334 42054 14015
20012 14015 14847 -48224 -63505 -41088 -45431 -27096 17108 -22171 -26526 -7419 976 1076 24116
19999 24116 60905 97568 118563 44289 11388 44150 44739 949 -16590 -24088 -17772 13437
19987 13437 -3895 -1858 37628 33453 10660 -7641 15887 13298 -12621 16997 53008 49371
19975 49371 6573 -22192 5087 23365 61003 64394 72848 70468 64264 31982 -8182 -11100 -24669
19962 -24669 -19546 -21978 3898 54976 90511 82005 61404 45565 24388 31465 49389 17947
19950 17947 7186 28473 54822 66487 56500 28972 28538 49824 45478 31185 -11438 -1722 39513
19937 39513 62494 31846 28672 38672 15294 4103 36703 73265 53083 63721 22282 -30426
19925 -30426 -23263 -7817 -11414 -35887 -13082 -17252 -16310 -22008 -23296 -12052 -5882 -18219 -4044
19912 -4044 30117 26378 -11326 -3112 4578 -1488 -4120 13958 16972 6900 -19140 -64344 -80122
19899 -80122 -44189 -14071 -39541 -20118 -8061 30280 30983 66100 69507 72557 74882 62830 37958
19886 37958 28426 8733 -46217 -70051 -60883 -60753 -12084 -32389 12837 30029 31236 64678 87301
19873 87301 68424 28057 989 2778 27999 18510 -34280 -15063 19450 18815 33395 16331
19861 16331 -33703 -42076 -29939 20678 4934 23214 54612 54769 45690 33652 6997 -12023
19849 -12023 -24051 23466 844 -15239 23863 32766 28954 21293 6564 13499 -2356 4390 23531
19836 23531 27950 -436 -5284 3320 -17344 -9572 -3047 14209 -2788 -18875 -18272 -14685 -29286
19823 -29286 -56042 -71305 -81776 -90033 -94674 -82847 -75207 -15685 47686 60101 50690 46283 45099
19810 45099 6637 -15411 -42810 -17268 27307 58129 38997 -4868 14366 25448 19279 -2326
19798 -2326 -42644 -15448 7100 53858 59297 64516 65412 75276 101040 90388 56492 59839 45062
19785 45062 23266 28233 8967 -48713 -39307 -5634 18104 33706 24112 3428 7579 30919
19773 30919 41055 -27976 -46062 630 22294 19568 27418 39011 38690 36540 38838 -5656 -55046
19760 -55046 -76495 -27373 48408 62519 50290 74579 95145 99053 47587 19297 5221 14038
19748 14038 52820 73859 58955 101485 93811 11498 -72212 -76797 -69537 -50556 -69987 -45770
19736 -45770 -6490 3005 439 -15762 -1692 32999 52022 37713 2913 15893 9820 -36747
19724 -36747 -20056 9902 -30227 -9055 26621 50526 19576 9231 -2045 -2084 -18342 -31427
19712 -31427 -44162 -25042 -10365 -6923 11153 9864 -6214 -24819 -34823 -31029 -1885 9242
19700 9242 20145 25999 7886 -26167 -15781 -19076 -22856 -34517 9408 20124 -2995 -21825
19688 -21825 -22655 -3685 12486 -25905 -69877 -76241 -33685 -30798 -35136 -31842 12502 39145 31464
19675 31464 38152 73907 60006 43421 -3731 -58802 -55531 -6497 -3318 53862 75816 46230
19663 46230 41606 64027 50003 42071 33970 29563 9765 26325 34270 36494 2141 11489 51286
19650 51286 56901 60344 39654 95111 56557 77726 75185 65086 56119 54123 16504 -21295 -29526
19637 -29526 -13798 -18849 -13174 -8055 -16997 16533 23338 16608 32265 31579 16876 28700 51080
19624 51080 66107 19932 -12778 -9108 -34696 -16062 -6583 15162 -1516 -2843 54082 71883
19612 71883 49231 23471 -22230 -33697 -29292 -37905 -5600 9595 -20589 -32116 -5116 10398
19600 10398 21350 29078 27533 30278 46756 44013 35768 9634 3442 10214 28933 65029 55829
19587 55829 63820 56329 68607 95102 104460 48677 41915 85474 63957 20931 2237 23775
19575 23775 77613 92854 97253 120041 139157 91916 20399 20157 47405 39321 -15590 -31362
19563 -31362 -8858 21892 48201 47399 19665 476 29848 34333 59308 72390 65977 25382
19551 25382 231 -10525 -9323 -19528 -11546 18488 23120 31251 28158 39578 48104 62064 64884
19538 64884 64878 25455 14337 18042 -7135 36055 77366 128245 120742 56615 68324 96616 88130
19525 88130 48753 24151 58343 55791 35409 48204 56649 54988 90746 142268 184560 247338
19513 247338 301506 350308 334116 313542 214184 162214 154788 200819 249401 251379 289223 322077
19501 322077 305330 334953 321212 223969 202409 214614 213070 163295 110574 101296 116096 76219
19489 76219 25722 44957 86373 93084 85617 61633 64891 102983 140365 144499 83332 61120
19477 61120 32968 34600 31792 62273 92166 137931 157539 168138 220545 267780 333051 411825
19465 411825 456691 415130 345918 283172 238896 219852 244963 311723 351079 370271 397868
19454 397868 393425 394852 331444 286278 208568 151588 138406 96768 74268 39186 43124 67915
19442 67915 98225 88090 66600 73032 71705 72808 70924 85227 98575 75504 69791 44289 57033
19429 57033 108617 112392 25540 7347 37312 64093 68997 87800 88069 55738 53885 31630 23031
19416 23031 12890 304 -45444 -32086 -25951 12386 47046 37278 15898 40227 36545 46169
19404 46169 74278 74611 51922 62302 70380 95239 70874 89185 104602 118359 126370 130407 116926
19391 116926 124510 114050 102058 62795 14301 -7936 10540 15451 -2320 -11636 15238 33851
19379 33851 37359 23985 5701 37681 58444 63673 29987 67399 68848 81175 54722 54863 57272
19366 57272 43977 71131 105804 99057 85693 62152 51787 29726 23340 -15276 -35752 4221
19354 4221 33474 19590 -4602 -24567 -21422 4096 380 16627 21283 28954 26390 19752 52324
19341 52324 80113 41861 40018 107514 111960 136684 120270 112046 116173 98818 75359 32215
19329 32215 17313 33823 39634 31957 29773 30335 28199 27887 39421 45495 64865 90163 83324 52835
19315 52835 39015 16320 27427 37227 64996 80664 80043 78325 60304 84051 94936 142548
19303 142548 183152 167432 141991 110752 108096 127934 163789 171626 161873 132830 89402 54421
19291 54421 45795 52669 82979 110319 74701 16337 -7198 -7357 -7362 -7194 23963 62006 69095 63383
19277 63383 100925 84671 36744 8823 18895 33012 70299 94222 103103 94381 82883 100068
19265 100068 80641 99533 116012 115693 132262 159360 189729 193334 150282 149224 135759 105998
19253 105998 131028 142456 119217 121934 125399 116486 115889 113749 95212 100590 101258 126351 71889
19240 71889 63569 70106 81113 77866 83302 69691 31889 35857 7584 -38631 -5822 44927 84003
19227 84003 79635 107406 79212 68028 72632 59754 49513 56237 85265 133456 127208 77786
19215 77786 58794 79970 125629 149954 140241 137726 128564 153771 185573 168044 119624 127337
19203 127337 161348 160374 142607 141936 130998 141287 131203 130668 132124 139129 101872 90186 117286
19190 117286 95056 95546 90543 114143 161824 133913 98443 116619 119644 75951 100161 105999
19178 105999 137693 160582 133770 99017 93011 108703 78080 113639 105249 89682 85012 63577
19166 63577 86630 121270 92673 81987 95715 120034 134865 105387 71885 62359 71642 75554
19154 75554 66542 91090 124926 121127 78439 57854 51796 48188 40799 45590 54897 76678 70231
19141 70231 86638 135344 154137 120601 90624 99310 62549 77268 123550 156164 144700 127752
19129 127752 91223 94391 139689 128421 124480 137916 156514 148468 133158 133485 181887 157936
19117 157936 151927 134684 127626 146354 146685 143551 174470 201890 183740 161376 180959 224664
19105 224664 282802 317188 341081 351461 422307 504851 630130 758144 825249 790343 698505
19094 698505 636355 533141 406722 312531 272796 282436 307015 308528 320110 295490 262761
19083 262761 249389 218563 209891 228869 238852 247887 297457 317787 279228 279678 337356 378368
19071 378368 339771 336636 378604 422251 495138 611459 769531 877768 979072 1040730 996645
19060 996645 890924 718915 579765 531480 518621 483600 521403 559726 614238 717806 834600
19049 834600 939962 1127382 1303759 1534165 1840458 2136833 2388200 2589908 2764599 2883246
19039 2883246 2851494 2697882 2559305 2406527 2228617 2062858 1957117 1931425 1946517 1936892
19029 1936892 1903269 1833940 1812678 1815056 1841502 1940771 2059111 2206602 2315453 2470064 2720576
19018 2720576 3072864 3480602 4040303 4845486 5868801 7236586 9107251 11731330 15667348
19009 15667348 21629790 30268097 40961562 51244469 57728568 57756906 51480089 41636970
19001 41636970 31735486 24255767 19718378 17736204 17745317 19645943 23529412 29283225
18993 29283225 36119013 42941030 47871690 49609756 47753370 42466538 35551259 28026145
18985 28026145 21275442 16118615 12394500 10089602 8696031 7797241 7167491 6696150
18977 6696150 6407392 6230142 6260358 6505301 6932291 7465523 8191422 9220315 10718614
18968 10718614 12971566 16467561 22264896 31691212 45023606 59245084 68078782 66089657
18960 66089657 54483155 39849022 28604748 22318770 19443084 18650262 19406538 21881257
18952 21881257 26650103 34392298 45071202 56953272 66492661 69674389 64775226 53597025
18944 53597025 40079436 28107786 19493112 13916816 10456774 8241028 6707343 5591187
18936 5591187 4672466 3968607 3379004 2941634 2688323 2495254 2362620 2252706 2118385
18927 2118385 1963685 1826175 1805333 1844463 1879013 1922929 1943293 1930035 1949757 1971571 2092652
18916 2092652 2311939 2803093 3708291 4955031 6155253 6647579 6061078 4710501 3418032
18907 3418032 2575066 2082161 1812891 1674822 1588784 1559254 1608616 1696278 1776868 1801265
18897 1801265 1783822 1735080 1735262 1722795 1663713 1610392 1522937 1423571 1381254 1317970 1258374 1254792
18885 1254792 1292564 1296539 1180021 974896 792850 638947 538068 509813 520393 513983 443246
18874 443246 432648 397996 379707 407156 433120 403738 380498 369641 368417 349720 324825 361582
18862 361582 343015 327273 333753 404755 452303 509909 518903 582301 751330 982768 1295160
18851 1295160 1570263 1771652 1877333 1836986 1724100 1680623 1714676 1814524 1909868 1927918
18841 1927918 1865576 1719271 1541459 1377712 1224754 1072976 917495 831038 782530 749562
18831 749562 712033 678785 660298 685492 723427 792461 933022 1018676 1013577 973736 876312
18820 876312 783246 689971 631010 642043 652861 664943 650608 631051 575894 535966 533205 551598
18808 551598 612803 718740 800270 862112 930044 975337 1010757 1081048 1155610 1175321 1200057
18797 1200057 1224810 1216238 1252317 1327777 1320631 1261229 1240428 1109975 1009919 915638 816618
18786 816618 702891 604047 554049 578801 614177 636551 743477 824645 891279 921524 939878
18775 939878 915208 904009 935765 907709 802108 729883 751192 882481 1002976 969727 801404
18764 801404 627536 503435 376270 301168 281304 255513 242941 214163 172260 149299 175575
18753 175575 173154 164656 179626 191318 184405 184826 160530 150518 173613 205143 194150 167258
18741 167258 213082 200077 182921 240116 292695 304745 310883 316434 305528 310480 336191 379295
18729 379295 460385 484573 496212 459702 412162 387251 412261 467950 467898 458819 411591 325558
18717 325558 337189 294601 213694 189639 204763 238856 219701 214051 190395 192729 189863 195424
18705 195424 200290 200968 185942 167640 163273 207965 263526 296478 306258 380406 429962 448442
18693 448442 527064 602728 628257 622143 583911 523208 410649 306327 226672 191604 203463
18682 203463 188892 164661 160544 169676 152770 148311 151562 204514 248312 281039 323267 326282
18670 326282 334836 327869 305554 356468 433643 518879 575515 593263 564577 488353 413347 371564
18658 371564 341453 324818 314437 276444 244622 228021 254861 244010 229847 247250 278689
18647 278689 279055 286060 304331 359228 381520 391001 340884 354312 367389 366032 315799 230051
18635 230051 201855 213844 216973 224941 221091 215259 212403 225806 239302 259128 272007 268233 309538
18622 309538 305456 330924 311175 260776 268221 262608 316639 360976 356118 322485 295521 334396
18610 334396 346185 307475 375572 416526 414502 406270 420902 400352 392002 360810 339817 315134
18598 315134 297062 293367 254083 236838 247990 252272 262067 299783 309913 347016 306989 257397
18586 257397 305733 304297 309084 325502 358633 371622 365712 343096 332633 376197 406229 368548
18574 368548 351550 384861 400490 422931 434781 466319 524379 563834 587959 586671 564894 608870
18562 608870 607409 622686 615547 620906 641434 694764 730346 733017 691128 669583 718370 780940
18550 780940 844325 990102 1176035 1319557 1385618 1419007 1362036 1322191 1290281 1268753 1250931
18539 1250931 1355728 1479460 1655937 1924138 2189331 2376266 2566758 2753518 2971918
18530 2971918 3276711 3754140 4474641 5502987 6898192 8676121 10898178 13841026 17942862
18521 17942862 24227431 34722205 51322259 72452432 91338685 100156051 96886436
18514 96886436 85979732 69532621 49260057 32449012 22245069 16311460 12582469
18507 12582469 10094821 8416823 7350557 6706338 6401029 6352107 6415220 6505752 6605411
18498 6605411 6686282 6736628 6796311 7005610 7587383 8667509 10269113 12503814 15450565
18489 15450565 19373524 24688727 32541099 45247811 65961285 95245346 126363459
18482 126363459 147044793 149624024 137480695 116289192 87162020 57950392 38030500
18475 38030500 26565560 19614908 15060057 11913338 9694653 8150616 7076993 6313675
18467 6313675 5849700 5544604 5316780 5091425 4806168 4496710 4172425 3836347 3592524
18458 3592524 3424337 3211707 2892973 2561016 2361270 2275443 2267613 2271128 2209646 2132493 1997902
18447 1997902 1818415 1668095 1558460 1490673 1491975 1458970 1347354 1252848 1298493 1411636
18437 1411636 1485318 1559049 1579374 1583769 1625568 1652373 1727340 1865903 2007699 2182957 2286079
18426 2286079 2336821 2405775 2431837 2421305 2217062 1899444 1630350 1435245 1341338 1346477 1348121
18415 1348121 1362408 1406236 1482337 1605517 1775309 1863646 1832123 1788167 1622377 1427561
18405 1427561 1310890 1195389 1101184 1050717 1032949 1052787 1058602 1060532 1148884 1235227 1255842
18394 1255842 1253545 1255163 1280946 1266275 1276333 1367267 1514112 1680953 1882804 2103305 2352018
18383 2352018 2536450 2668452 2783328 2908598 3047101 3280953 3665348 4097023 4436342
18374 4436342 4621564 4780915 4865445 4872478 4912578 4995308 5190423 5356911 5566618 5825556
18364 5825556 6169784 6774960 7682674 9099237 11148903 14088515 17964615 22701224 28212787
18355 28212787 34949422 44449263 60332083 86767747 123393496 159849435 177997665
18348 177997665 167179173 134077763 95338903 67591118 53238282 46564362 43318358
18341 43318358 40934090 37965896 34604905 30683615 26114795 22177589 19057295 16649236
18333 16649236 15080981 14180475 13663333 13418531 13442326 13826593 14525213 15687919 17504034
18324 17504034 19985300 23130295 27018128 32018927 38763884 48946498 65418538 90201435
18316 90201435 120240855 146186004 158440451 158030661 154158033 156852789 167143705 177856166
18308 177856166 184863277 191656450 201515023 210056789 202338045 168820213 124117130 91856754
18300 91856754 77559100 75149688 79530987 87219154 94988434 99503740 98076449 92024203
18292 92024203 81798640 67617966 53511094 41174397 31013517 23971074 19654900
18285 19654900 17001378 15123850 13354267 11652036 10260946 9286602 8684228 8347968
18277 8347968 8196094 8257473 8527225 9079791 9901579 10899572 12096314 13749490 16065324
18268 16065324 19290517 23985281 31414995 43838084 63394922 88048771 108428333
18261 108428333 112408766 96639662 71924708 50367925 35295965 25082925 18392587
18254 18392587 14189083 11457019 9550574 8080791 6895724 5964420 5227338 4670307
18246 4670307 4182313 3759956 3403173 3193298 3072165 3070135 3215580 3443264 3640804 3612928
18236 3612928 3324250 2915473 2505643 2246342 2129128 2087342 2162492 2300451 2446692 2595026
18226 2595026 2788957 3060386 3416029 3991718 4791053 5927959 7798730 10952806 15917686
18217 15917686 22414802 28059600 29467263 25376319 18568153 12771638 9259165 7409674
18209 7409674 6266603 5402359 4701194 4114692 3667449 3396590 3196430 3064979 3023011
18200 3023011 2960436 2818132 2645267 2474113 2321300 2226023 2181320 2135346 2089760 2014337
18190 2014337 1866517 1732201 1557150 1335936 1149468 1055666 939803 845751 858566 874015
18180 874015 845746 892298 1014520 1156875 1357486 1516739 1604574 1593495 1543839 1583349 1699922
18169 1699922 1783399 1689242 1606938 1538481 1379883 1164442 1009078 856980 758349 763837 798272
18158 798272 776219 701438 666177 764074 845207 876712 937165 1019573 1078149 1105253 1158495
18147 1158495 1267751 1415595 1564320 1693442 1755204 1717471 1576604 1414980 1329520 1305604
18137 1305604 1423963 1470723 1411277 1212144 1068178 993160 966068 1005401 1096554 1205657
18127 1205657 1299977 1398480 1479479 1675767 1917857 2190292 2573340 3122078 3912359 4996291
18117 4996291 6404598 8244179 10637192 13788231 18697692 27935205 45655499 71802919
18109 71802919 93625880 93247177 64921431 37182207 22625892 15410875 11237101 8479806
18101 8479806 6588301 5288708 4347931 3663646 3174787 2813175 2494729 2198008 1916016
18092 1916016 1648064 1447752 1252450 1072273 967176 871419 764082 705489 684359 608541
18082 608541 560252 549658 581872 562628 560090 597843 602704 537391 489767 455372 434477 420503
18070 420503 372451 341098 324046 302934 311198 308244 288924 285139 298467 276560 275258 291657
18058 291657 281517 240807 221737 212017 216028 254216 209504 145597 117186 142781 150108 124255
18046 124255 113321 164373 245743 325500 359792 339116 312282 257461 187276 125546 127757 124074
18034 124074 116485 115927 135238 153045 168355 156375 152733 141546 137955 117670 105216 128400
18022 128400 148966 163263 188231 195323 221166 256346 279632 326964 370837 397327 357590 350638
18010 350638 334173 326977 287176 216268 200175 223718 284143 295096 214543 155425 137262 120450
17998 120450 61018 9507 5831 34781 29809 617 29420 69411 151445 213409 234035 303556
17986 303556 315304 311134 297838 343570 409302 449574 525845 580871 614192 643818 660525 642396
17974 642396 582304 523720 545028 580347 606640 596497 593579 601573 636312 668195 707298 684723
17962 684723 733391 767812 798680 878515 975024 1032309 1035059 1021966 991059 893136 851065 887937
17950 887937 943232 961033 927845 803965 658303 530934 501134 485930 479069 457605 402685
17939 402685 355221 290806 236259 152361 128369 130881 155706 199333 241476 299762 363433 432783
17927 432783 555701 706917 846295 1043340 1113767 1119499 1109367 1053537 968860 865001 830314
17916 830314 804034 813345 808601 781247 771074 724320 671650 580655 468691 372885 304630 256700
17904 256700 232408 179007 129514 154236 175221 174666 173029 148393 125449 93707 113191 171087
17892 171087 299484 487133 639810 654106 614383 552795 463907 341767 254153 207715 192946
17881 192946 180686 156864 143829 150926 168454 195612 209044 231400 251694 260331 300413 308306
17869 308306 284931 271864 192881 155151 167856 149823 149357 135992 101355 71090 85629 67911
17857 67911 62545 82475 72153 55515 78169 93984 76712 50837 115088 119205 91342 54236
17845 54236 35897 41408 5097 28106 36445 36630 64829 121004 132302 196503 285714 319884
17833 319884 377005 421346 399735 374672 378091 373065 350941 362425 320621 320512 339596 348887
17821 348887 297931 271744 292475 316266 306588 319141 385319 548116 769263 944502 975370
17810 975370 922441 796805 639045 544344 438967 347515 266993 173157 76072 22581 487
17799 487 31127 74671 100043 96779 106211 83776 62983 84936 126316 145292 200699 236631
17787 236631 258662 329136 344227 382532 441990 487463 586514 710243 847731 964793 998105
17776 998105 920038 785749 586497 407901 334141 276788 225341 148305 130042 131405 137397
17765 137397 195332 250759 328881 415675 516430 551754 528360 475014 481191 466861 376784
17754 376784 266135 196098 190100 197377 188984 147539 59951 25003 57856 38128 -14706 -47764
17742 -47764 -48078 -35767 -45647 -51174 -6309 28321 45360 37660 29169 34567 21491 30787 47453
17729 47453 44726 38268 9006 -5832 -4087 14702 4782 940 52981 58620 34895 66641 123590
17716 123590 138444 162830 197267 246756 307208 367756 401280 318557 230215 153667 83881
17705 83881 35448 32103 56060 32724 29155 2225 -6691 34112 43896 -3457 -44075 -30793
17693 -30793 -23330 18484 34516 64059 29984 24361 -740 -7065 9205 24653 35655 22121
17681 22121 12536 -8351 -382 25247 21904 -2707 -13592 -28759 18620 66582 75671 59316
17669 59316 39551 39113 71292 89519 115597 85091 80878 86859 67962 22634 41237 57745
17657 57745 59633 2230 -20973 -12546 -16646 -42634 -4908 20963 23562 5729 25881 35857 49465
17644 49465 40147 27227 2625 91 -36765 -29912 11118 -4383 -1509 -4562 4289 8743 3255
17631 3255 1777 -10830 -2457 10148 -16594 -32091 -33480 -35061 -22025 -31380 -61527 -38040 -33441
17618 -33441 -4140 14743 44794 24085 12403 7625 -18288 -28900 -21935 6073 4013 14169
17606 14169 39521 25354 25455 21190 68089 77277 116270 155002 207589 247457 250934 243618 190979
17593 190979 140531 118919 92746 99506 145202 136418 136510 92807 53487 38300 20015 22225 27959
17580 27959 22761 -6268 -16166 -22474 -44916 -93044 -68790 3040 60260 18818 21430 27417 -13005
17567 -13005 -44572 -27566 35114 14707 32456 45449 39933 25881 809 -35809 -15590 14313
17555 14313 30629 47837 53984 81364 122305 149109 176722 179779 155858 135064 128771 108964
17543 108964 110483 103830 111594 103148 97599 83145 79843 30368 -2383 1767 -22155 -58935 -69035
17530 -69035 -17241 9049 -9751 -19833 -13784 -11474 -21641 -6354 27378 -8148 -10557 -30415
17518 -30415 -31596 -33139 -8669 -2283 -639 24378 -1548 -27213 -1361 -9550 -4100 55820 127324
17505 127324 127833 52405 24310 -2584 -27983 -37623 -62376 -63748 -80941 -71468 -32015 -26049 28277
17492 28277 76400 63283 18733 2791 19757 -889 -29330 3830 29958 28179 23050 -20444
17480 -20444 -60235 -51353 -54434 -55796 -42617 -90166 -120358 -89193 -17081 6397 -10116 -44792
17468 -44792 -8065 -32160 -14660 -1935 -42657 -48648 -3904 3601 -13441 -22575 4069 6710
17456 6710 8828 35981 23909 22959 14373 36189 42655 -1691 -32435 7618 67061 129427 264886
17443 264886 394992 457475 330551 173786 89018 41237 23012 -20076 -48828 -26196 -16540
17432 -16540 -2619 13093 25738 27995 57290 41671 7569 -7909 -16980 -23044 30648 33653
17420 33653 13623 9646 21756 5443 16284 10893 575 -24948 -60723 -47118 -14759 -36195
17408 -36195 -94014 -92161 -56553 11385 41722 -8441 -38768 -72468 -61406 -46116 -16543 2658
17396 2658 10485 -62130 -56058 -16838 -29629 -73118 -57980 -67142 -53355 -35922 -34594 -36912 -44358
17383 -44358 -66906 -115528 -90693 -62938 -67733 -71821 -46535 -45949 -43398 -8866 -10053 26923 -4844
17370 -4844 -36997 -48453 -67019 -44282 -21608 -30368 -54779 -65420 -52690 -3740 -11107 -34675
17358 -34675 -65628 -61282 -39188 -4957 -13008 -29173 -20319 39117 15325 -2076 -4965 29813
17346 29813 5836 -47992 -39881 -49119 -87515 -85224 -50865 -23865 -25489 -82616 -82823 -48650 -34839
17333 -34839 -59869 -7802 3711 11733 20549 18930 54408 34354 -28225 -71869 -52658 -65068
17321 -65068 -80959 -67244 -76053 -69311 -44881 -65411 -68845 -72457 -67864 -80363 -58973 -41368 -49880
17308 -49880 -51586 -65579 -73835 -65457 -59623 -61514 -57424 -37938 -24350 -27095 -55823 -31584 7847
17295 7847 26232 -5410 -12131 5217 29189 43817 28854 21051 -6461 -28849 -11327 -4087
17283 -4087 1031 -15434 -40822 -52826 -48848 -3719 3507 -29386 39988 70511 27789 -31610
17271 -31610 -70434 -81214 -57843 -18054 67257 45398 12750 5393 -15082 963 13918 13217
17259 13217 31750 9024 -52225 -59092 -27650 -26144 -40331 -28433 -2487 3629 -12397 -38486
17247 -38486 -48733 -56644 -77926 -56872 -67377 -71564 -70102 -44748 -36116 -57729 -90167 -55222
17235 -55222 -56087 -75801 -113221 -101021 -47297 -20599 -35534 -50027 -86053 -104477 -47522 -5391
17223 -5391 -12327 -20722 -19872 -34614 -62271 -35466 -21659 -614 6287 -7465 -32582 -51017 -60524
17210 -60524 -45375 -2720 -8651 10667 -6535 -11603 -35312 -28736 -45034 -19398 -10375 22624
17198 22624 59891 77375 51240 10616 9386 -37455 -34374 -18737 -6749 -35567 -27734 37946
17186 37946 21391 2977 -17846 -24851 -14944 -21367 -36250 -53995 -37569 -32651 -16705 -29202
17174 -29202 -20049 9275 3122 -28283 -42798 6971 26432 30065 35748 5716 -46255 -43161 -54019
17161 -54019 -72368 -62671 -58240 -37025 -29084 -31368 -1999 -9917 3095 48420 41668 -22001 -45054
17148 -45054 -23513 3411 -10344 -14823 -33429 -42507 -10665 9382 3600 -44552 -95731 -85996
17136 -85996 -49036 -50931 -60538 -108570 -141487 -120792 -48758 -1651 36814 13319 -6620 2495
17124 2495 -1013 -11618 -18429 -64798 -51562 -6391 48894 68553 41228 22101 3725 -24885
17112 -24885 -36270 1564 535 10127 9455 15879 58117 65314 101862 80341 39024 31107 -40021
17099 -40021 -60093 -31741 -44311 -38097 -28253 -31742 -47784 -47149 -55657 -37233 -9224 -23804 -35053
17086 -35053 -17302 -23079 -47431 15402 10391 -22503 -26628 3079 33208 43800 26359 9439
17074 9439 56163 83448 80569 86630 77629 35286 -25286 -40054 -8629 -48365 -73514 -65964 -86220
17061 -86220 -105227 -87257 -52714 -34439 -48150 -53478 -54808 -49923 -20770 14664 25151 37143
17049 37143 51368 55283 47242 32499 -28247 -58098 -77208 -60021 -82758 -43756 3210 4374
17037 4374 -24067 -27515 5784 -20411 27766 40907 51078 21487 -5049 -37479 -40577 -28865
17025 -28865 -23554 -3542 -42248 -77540 -84383 -58982 -16769 9335 39080 63038 34525 50904
17013 50904 33893 8441 34291 56244 95236 108798 53767 -9894 -54023 -45960 -1775 9984
17001 9984 15466 38045 43351 30563 11008 44156 32876 10537 7071 8680 26827 20421 49256
16988 49256 11687 -11503 -11844 1915 -47840 -70411 -27665 -26043 -48192 -26941 -36210 -31970 14550
16975 14550 17361 -37510 -32591 -21727 -21867 -46035 -41937 -41302 -58326 -28167 -27486 -39906 -41773 -60374
16961 -60374 -85658 -86086 -91633 -104606 -62497 -58407 -91341 -36413 -52718 -94219 -79992 -42962
16949 -42962 -47307 -23321 -17485 -7772 -16456 -44393 -32429 -29864 -32736 -56298 -59449 -73595 -54145
16936 -54145 -42634 -41489 -33315 -22725 -11702 -12698 -18836 8819 2169 -13474 -24543 -23428 -39318
16923 -39318 -24501 22122 62973 30616 -22194 -33705 -49686 -40093 -9235 13929 246 -21352
16911 -21352 -62324 -36641 -12051 -6132 37587 73769 59277 41987 3860 -37417 -50344 -42836
16899 -42836 -42796 -82914 -77493 -49071 -30944 -30059 5353 9739 26177 17352 20157 23347 -5976 -53173
16885 -53173 -55452 -62801 -45824 -49651 -75637 -78582 -70714 -43789 -1642 26359 6717 -25102 -37321
16872 -37321 -36031 -42212 -17748 16070 39281 32263 -6445 -37765 -40085 -10472 -6510 -35641 -55965
16859 -55965 -51663 -56210 -52620 -46924 -46140 -64445 -59602 -41550 -16264 8488 -26124 -28031 -33240
16846 -33240 8696 32400 -12208 -33034 -22908 -15867 -24954 -37630 -83996 -109266 -117008 -106917
16834 -106917 -71042 -61001 -47591 -67041 -63419 -36550 -12409 12107 16346 26679 12293 -4955
16822 -4955 -32250 -59944 -66701 -89709 -61673 -49616 -25123 -6278 -49521 -40916 -27782 -15461
16810 -15461 -32781 -39483 -1137 16900 -5987 10502 63145 46540 -1562 -16236 -57418 -59071
16798 -59071 -32214 -23975 -28152 16187 -4470 -40168 -42749 -63865 -54904 -57376 -92132 -83267 -71957
16785 -71957 -73709 -53828 993 35436 42681 7597 -25053 -55540 -75561 -87799 -61374 -35015
16773 -35015 -9 -10944 -42898 -29931 16252 -29639 -54865 -12467 -6249 -21410 -7667 17743
16761 17743 19813 8660 -31227 -38247 -41760 -37188 8174 2399 -19261 -27391 -36044 -66869 1727
16748 1727 29369 12912 18273 -5880 6882 -10301 -1016 13563 2180 -30221 -37556 35020
16736 35020 52018 40232 58677 69113 6769 -35839 -49665 -32769 -176 6069 21127 17748
16724 17748 -42418 -67988 -65221 -62154 -34869 -38045 -4496 -4888 -9176 -23001 -473 -13960 -38385
16711 -38385 -24661 -27247 -56535 -6326 50069 44052 23741 589 -32288 -59780 -33755 -17494
16699 -17494 -25270 -24951 -41684 -40606 -52211 -28221 -40218 -34667 -19247 -18468 -35912 -88470 -82180
16686 -82180 -34970 21278 -19816 -106388 -179891 -172311 -102408 -78434 -53802 -30102 10038 -52825
16674 -52825 -52473 -16434 12556 -3289 -59372 -75884 -69360 -56013 -50608 -74286 -92883 -74904
16662 -74904 -35128 -26403 -24822 -4976 -4988 -21369 -10218 9082 17238 -23430 -77796 -92764 -57641
16649 -57641 -35455 -46384 -15063 38 -24279 -41496 -18708 -21168 -28640 -4150 -647 8774
16637 8774 10704 27592 26321 -13057 -33869 -23663 -12791 -19083 -27221 13867 18570 22308 11753
16624 11753 2708 -11214 -23654 -43326 -77291 -50212 8613 -5856 -26715 -18351 -26747 -2928
16612 -2928 27032 30896 10415 -44414 -39612 16597 -14107 -42859 -41895 -32161 11719 -20259 -26846
16599 -26846 12772 3480 -47578 -73661 -81006 -39058 -11109 -19719 -26025 22631 46907 32855
16587 32855 -17266 -26827 -67312 -75739 -81092 -117168 -88322 -37355 -2677 -9804 -37514 -13994
16575 -13994 9346 56583 71211 19601 -4342 -25639 -68500 -84529 -76161 -55053 6649 37892
16563 37892 -10607 -10179 12770 10961 -17939 4581 -6995 5943 14441 -2984 -32058 -8846
16551 -8846 -33517 -21627 16885 23658 -30072 -53931 -77690 -50650 -24267 -48067 -82661 -95189
16539 -95189 -59704 -24303 -56059 -48292 -10948 -12667 -28753 -4259 -19674 -45826 -38918 -36955
16527 -36955 -41813 -11691 24772 49449 40468 27710 21139 22936 5584 -24021 -12358 2944
16515 2944 -58977 -67875 -40865 9004 69579 29122 -17742 -39357 -22729 15316 7551 3402
16503 3402 46626 65763 53547 42072 7213 -21182 -66810 -65785 -73067 -83583 -77720 -51971
16491 -51971 -41433 -58720 -58430 -6721 5244 8101 -30152 -6656 -12587 -51805 -33965 -46980
16479 -46980 -26271 -36155 -72009 -62482 -51388 3947 10497 -22511 -50051 -78803 -66501 -77301
16467 -77301 -96085 -87844 -93695 -78761 -62155 -23034 2189 -7063 -56749 -88578 -89943 -77195
16455 -77195 -43637 -15715 -54131 -49751 -3317 -582 -9926 -7898 -19601 -18339 -18073 -19714 -23448
16442 -23448 -13735 15 23746 -9187 -40755 474 6421 -7795 1345 -27212 -24327 -36988
16430 -36988 -26300 -51990 -40098 -15463 -24058 14180 48411 45579 14808 -22515 -23627 -13138
16418 -13138 21451 -4730 -58468 -69806 -80081 -41032 -8632 -28620 -12445 19857 45304 9083
16406 9083 18854 45751 26439 -38960 -50066 -44606 8191 26571 -32915 -70941 -72598 -68459 -45057
16393 -45057 -1380 -7324 -48588 -70394 -44578 -42717 -61844 -40693 -23024 -70701 -74242 -58022
16381 -58022 -58444 -88272 -76236 -52462 -14832 21777 21729 21684 7840 -23750 -72855 -74699 -65892 -50891
16367 -50891 -28281 -17852 -6906 9252 -9803 -25990 -32322 -14008 -63004 -68275 -29351 5048
16355 5048 20300 20104 25119 11585 12085 3004 8871 20389 12033 -24839 -50713 -13822 35870
16342 35870 21536 837 -24219 -12506 6039 -17583 -27185 52061 78568 66410 14024 -33245
16330 -33245 -42838 -28960 -46832 -37798 -8669 4096 -29290 -70338 -67878 -54239 24858 50220
16318 50220 46004 22458 -40876 -83453 -74528 -73646 -11394 -17907 1411 19944 -2520 -3927 -43205
16305 -43205 -14988 5790 -31587 -51122 -47269 -39963 -57897 -40798 -27192 -52462 -66868 -62229
16293 -62229 -43490 -2108 42997 11863 5650 1709 -14634 -42764 -61495 -49111 -27629 -30372
16281 -30372 -83656 -73699 -57735 -39974 -33775 -44046 -26445 -28716 -13728 -49114 -59870 -38103
16269 -38103 -32134 942 303 -7852 -29791 -29158 -5918 31771 735 1197 43781 50696 18353
16256 18353 8659 10062 -5153 27018 57140 28466 -13550 -1998 -12931 -26211 -59810 -29082
16244 -29082 12653 -1105 -35903 -5820 59421 57712 27364 53227 40768 -816 32639 82347
16232 82347 82281 34385 -23673 -37821 -31123 -44427 -43691 -24273 -20423 -417 29611 19645 -17325
16219 -17325 -53360 -35408 2557 -23576 -46736 -13630 -38666 -37139 -16545 -29490 -23670 -41751
16207 -41751 -75573 -75300 -20009 -31738 -60908 -35637 -24823 -12303 -24709 -9821 627 -9339
16195 -9339 -22993 -4884 -33275 -32565 -26881 -6756 -31037 -23671 -22722 -30991 -52689 -43752 -34756 -32958
16181 -32958 -35102 -30439 -21593 -25586 -2350 -32675 -59599 -34222 -29456 -56809 -61331 -42897 -80008
16168 -80008 -86512 -76874 -91779 -92134 -49203 -10620 -44272 -75547 -66772 -9490 21250 -21876 -67483
16155 -67483 -52027 -74047 -83656 -32744 15665 16424 -3989 -21292 -55948 -2600 24229 57795
16143 57795 48461 73424 57126 22927 -3618 9167 14411 39714 57333 78754 69983 43472
16131 43472 8301 -12078 10130 11505 10246 -8565 -19267 -9899 16845 37372 57242 15602
16119 15602 -35769 -30407 16386 56448 38787 -33171 -86490 -50830 -40612 -14637 1805 -58675
16107 -58675 -96816 -94501 -54834 -23261 -24782 -39996 -34002 7348 48811 2294 -8973 1723
16095 1723 -19671 -32891 -23791 -24578 4747 11606 -22001 -17234 6345 4044 43598 4413 -19899
16082 -19899 -29636 -12411 3948 14619 37314 73588 81884 63077 89430 72766 25587 19269
16070 19269 2517 5079 -1129 13311 53937 -5779 -57652 -25515 26064 61578 35670 -50684
16058 -50684 -49669 -12900 2571 14184 6672 -33341 -53897 -44092 -61098 -85749 -71669 -39108
16046 -39108 -42842 -72298 -61387 -41728 24633 2995 1611 -3782 -27109 -31168 -41788 -33946 -20967
16033 -20967 1414 -1572 7312 -20062 -84889 -78192 -51133 -40710 -38349 -23632 -13935 3120 -16161
16020 -16161 -39220 -346 60540 57447 44346 20174 -20724 -2768 -43270 -41197 -49812 -62412
16008 -62412 -29371 -20250 3633 40296 58927 69979 64333 38273 19517 10121 59335 51184
15996 51184 31148 -40207 -59368 -63122 -69763 -77228 -51501 -37409 -42735 -49433 -48764 -22336 -17083
15983 -17083 -41143 -32865 -18923 -43626 -40459 -2600 5487 6934 -6166 -24344 -7470 -22865
15971 -22865 -28262 -19834 -40289 -38495 -6919 -31531 -14131 -17745 -63077 -80327 -79789 -93654 -48828
15958 -48828 -35779 -46322 -80463 -122052 -116108 -64461 -49490 -34888 -49418 -65836 -94766 -76452
15946 -76452 -49115 -43780 -60191 -30363 60003 35477 6254 -18200 -37649 -47938 -36285 -30612
15934 -30612 -6228 47651 65303 55015 22547 -290 19864 12554 -2442 13162 59562 46248
15922 46248 -7178 -22812 -14177 -55367 -81758 -72675 -48200 -7598 18543 18662 14638 1743 -2847
15909 -2847 -2946 -42865 -47063 -53516 -39955 -21648 -20690 -2806 21678 27407 17877 25842 36538 11713
15895 11713 -9367 -12897 12368 11983 -26307 -36816 -38829 -35657 -35689 -17798 -19134 -31847 -9518
15882 -9518 3159 -10773 -25054 -43721 -11175 31620 31210 26301 54390 62569 48198 45784 37189
15869 37189 -1399 -1480 17887 14077 36746 7903 16644 55885 15643 -8039 -3190 -22540 -37310
15856 -37310 -24551 -17309 -15944 -35222 -101750 -100559 -77260 -34429 42353 32128 -16625 -22869
15844 -22869 -28454 -36662 -59283 -42762 -18790 -33818 -59242 -68308 -48005 -27705 -31235 -42152
15832 -42152 -6470 22180 11299 -20615 2791 7103 18104 16658 3246 10080 31996 12106
15820 12106 17642 42767 75178 100384 79240 84507 76984 24736 2600 -16747 -34559 -42076
15808 -42076 -10037 -1941 35397 52487 9402 -20662 -26857 -41248 -77586 -59453 -7354 28986
15796 28986 -5119 -46449 -39562 2973 48942 -5258 20573 48293 50720 72380 40352 -10550
15784 -10550 -61741 -36826 31323 36929 21996 12055 28357 76373 82189 52499 48088 -8446
15772 -8446 4486 37313 14746 -31235 -34461 -9754 -12440 2522 -5996 12082 5628 10379 -8777
15759 -8777 6252 -5264 35651 48770 14533 37172 27286 -889 -19307 -29891 2397 14604
15747 14604 3946 -2003 -4870 -10613 -43717 -57228 -16830 36451 62341 56595 -12169 -32743
15735 -32743 -11468 5753 17918 -9467 -65852 -26370 6402 -1009 -19751 -22146 -1096 1980
15723 1980 18896 18461 24463 22465 -12722 -10161 -14886 -20513 -24481 9515 10778 21688 45526 59572
15709 59572 62655 69613 21016 -19590 -13441 -15736 14581 -6410 -24446 -65921 -59076 -50109 -63949
15696 -63949 -75573 -55845 -33514 -44959 -22588 -23332 -29706 -37543 -33288 -9172 -46247 -108829 -61946
15683 -61946 -18716 -6561 -44078 -22986 -17494 -46779 -73615 -58415 -39541 -35248 -3152 32948
15671 32948 63118 28611 4432 50924 66769 61292 -4475 -22694 -39636 -40947 12834 74135
15659 74135 78777 62747 53950 25451 1726 -28682 -22648 -28958 -12576 -23189 -42496 -37854 -43231
15646 -43231 -76764 -78830 -64176 -72726 -53268 -28871 2575 -14443 6928 13954 -10991 -55914
15634 -55914 -24661 -15203 -39948 -19952 17183 -5135 -42224 -61937 -21296 -11166 -15497 -45466
15622 -45466 -30372 -14006 -2187 -34874 -61222 -70024 -119313 -99098 -93283 -109253 -106295 -67000
15610 -67000 -66234 -56250 -68526 -67119 -51907 -20689 10511 38198 35837 1055 18497 61467 98562
15597 98562 83594 41848 -49369 -83863 -59903 -17322 -14055 -17224 -10533 -18469 -9103 -30916 -67166
15584 -67166 -54843 -47981 -27565 12705 15875 -29384 -52028 -25335 -3417 20510 -1604 3055
15572 3055 20194 24933 -21281 -32072 -20623 -27807 -4855 10794 46441 37014 29344 38803 11957
15559 11957 -17883 17104 62054 77782 42894 -10196 -3250 4510 25974 23964 33087 33032 29532
15546 29532 44762 22461 -7084 20511 44454 27803 37852 44964 34307 60989 77876 60610
15534 60610 31772 54285 18981 20019 945 -44738 -19683 -48489 -67125 -38926 11127 -8775
15522 -8775 -51245 6421 63422 23153 14949 15390 1217 31888 90475 128060 107854 78839
15510 78839 62077 49306 71800 49740 12808 8280 -15413 -16475 -5549 59913 64928 51556
15498 51556 59413 30097 3944 23056 39330 47707 36079 -31646 -46577 -19202 50902 81269
15486 81269 30002 3017 -150 21838 -1141 -38368 -20582 -13889 7708 10286 -15238 -32832
15474 -32832 -18515 -11030 1175 31346 49423 29690 398 -12848 15110 -6227 -10105 -10597
15462 -10597 244 27556 -7623 -9169 30835 35552 22674 5176 -3489 -31159 -20437 -29727
15450 -29727 11516 55521 29372 12403 8807 -18974 -72097 -67728 -52097 -35561 -43161 -31611
15438 -31611 -25631 -42383 -41157 12898 -25755 -68619 -52785 -11324 -6875 -27564 -64128 -68278
15426 -68278 -54008 -35533 -6025 19103 -15954 -17057 -37738 -63129 -49663 -27925 20479 3573
15414 3573 -34689 -26687 -37490 -73184 -64818 -62873 -47960 107 28212 41283 58164 36670
15402 36670 48060 67782 52459 44976 36920 26270 47151 89434 86255 54639 56037 21533
15390 21533 13962 2179 -20877 -48437 -42231 -43301 -38839 -25832 -20926 -6077 14961 25985 32579
15377 32579 32282 36283 33479 9502 2776 48981 55291 5258 -6684 6840 16075 -13141 -55322
15364 -55322 -1516 44069 46202 18224 23126 4061 -23949 -21092 -1836 -12203 11994 -14285
15352 -14285 -12867 -31840 -31680 -23602 -31914 19520 66988 88111 85644 47783 17217 48323 103027
15339 103027 94651 68725 -65 -48842 -30664 18677 37462 -1635 -29702 13373 22157 57514
15327 57514 54784 19708 -7850 -27260 -33713 19129 61732 65050 37263 48723 53280 35993
15315 35993 30069 73224 117616 86674 40152 65777 76949 57129 28326 24159 15052 19154
15303 19154 18831 -29273 -40188 -3420 -9879 -12463 -14653 5010 17659 28041 10775 -15398 8411
15290 8411 -19443 -17859 -49744 -52171 19695 59971 64895 66086 43828 33499 21381 -2595 12890
15277 12890 28731 16291 -7234 -47799 -52264 -34012 -2236 9272 2179 22868 66069 86032
15265 86032 68576 45375 -2692 -1318 7134 36697 51693 47195 55136 41423 21682 5584
15253 5584 -13646 -14814 -51824 -59571 -21441 -19222 -24105 -41873 -18334 -30241 -30861 -23234 14136
15240 14136 31998 21685 25601 32515 38372 7229 -24561 -26048 21457 33674 65589 97837
15228 97837 87072 74285 47823 25178 10721 -18378 11445 15875 38599 72089 47983 3659
15216 3659 -5491 32134 44614 17452 -13393 -45590 -41217 -11891 -11173 9665 32682 24933 -10685
15203 -10685 3432 50851 100612 95278 62663 30128 24050 25197 33746 15174 -419 5663 -20894
15190 -20894 999 33562 -17604 -70162 -41102 -7061 36945 60734 32411 13888 15201 33678
15178 33678 20474 23539 27601 36442 32284 12392 -4 7071 -44687 -49277 -18793 -7193 24254
15165 24254 56270 35173 22545 5886 -16227 -34088 -35294 -45736 -50096 -60409 -40932 16662
15153 16662 45554 10988 6650 24552 30718 19013 -20022 -25831 -19446 -50962 -61361 -21371
15141 -21371 20345 -9957 -39017 -38911 -50255 -3590 35593 42746 68379 47497 22583 37369
15129 37369 23398 -8665 18084 39550 13445 -7812 73 7686 -7607 -12022 8661 16408
15117 16408 5092 4889 15132 12178 -38360 -38603 -56732 -68246 -31403 -5670 -11181 -7154 -10823
15104 -10823 -2235 -43405 -76962 -40339 1495 4988 11141 9995 -2132 35972 64009 56224 20862
15091 20862 10539 56436 43020 8396 -25310 -33041 -56014 -21529 -48481 -40196 -23640 -41793
15079 -41793 -1232 6023 -21042 -38859 5465 43860 57859 68054 31080 30454 2329 -9561
15067 -9561 -17727 -16740 1000 -31274 4224 -3394 -64790 -70012 -42071 -38817 -22970 -50088 -27026
15054 -27026 7017 -4101 42357 46945 64195 19572 -1632 5256 -431 6243 16296 30505
15042 30505 13651 20106 16643 8017 2255 2817 5931 42841 12949 -19389 -34816 -50680 -62822
15029 -62822 -66518 -22339 22148 25926 10351 24287 63492 107797 124516 128814 71660 16877
15017 16877 21406 26832 21153 65533 59817 37211 -401 -14967 -32936 13952 39643 24545
15005 24545 -2126 18449 21376 11957 9332 -19794 -49860 -49302 -34219 -19492 -50059 -20851 17488
14992 17488 -9416 -16413 3438 33799 38054 40909 -1415 -23074 -18252 -31915 -51385 -76222
14980 -76222 -98515 -86006 -22590 23030 13309 -11372 -18446 -22928 -31505 -41712 -28220 -38416
14968 -38416 -3668 25731 -16652 5389 -1026 -8295 7150 2325 -19331 -10725 1772 2054 2523
14955 2523 5143 8742 14377 1728 16555 34846 20884 20186 51318 51681 58657 86515 78315 63738
14941 63738 44591 4456 -30090 21449 80801 65303 19049 18034 9587 -22593 -38336 -42900
14929 -42900 -28590 -65393 -94691 -83656 -62387 -43076 -26507 6977 41407 82321 97427 88184
14917 88184 81832 68608 52845 54192 62333 44688 41272 33247 40268 48773 14007 -5421 16856
14904 16856 21097 -10916 -6598 38998 32126 29933 59371 58660 13640 -29629 -41413 -55594 -50671
14891 -50671 23156 40628 21189 -11124 398 36202 49628 16711 2812 15097 32455 17751
14879 17751 -11824 -5918 38610 31862 16749 40571 9061 -9231 -77902 -59021 -54402 -105147
14867 -105147 -114716 -79371 -26572 3506 23624 18667 -7687 3521 20932 46385 58676 90647
14855 90647 106965 101748 109607 128850 93207 25171 5151 7991 -1085 -11183 -12504 12029 13348
14842 13348 3154 -13629 -1583 -15426 36770 49959 45085 42202 -2034 -30538 -3234 44581
14830 44581 21275 30623 47933 17173 10049 48013 52053 -12841 -30562 -12286 40666 43125
14818 43125 53782 68105 83605 44460 -37412 -8477 15802 27099 37259 38816 25559 28480
14806 28480 11344 -21598 -26802 20515 32631 -8795 20051 57665 22026 21872 -18531 -28497
14794 -28497 -5831 19583 2239 -26919 -19002 11033 -14961 -457 20070 39956 29302 7836
14782 7836 -9810 -41310 -10864 14863 19079 -14242 1478 -684 -10035 -18168 -7722 25333 28235
14769 28235 66719 79302 71164 66930 65774 74288 67226 25427 22395 26478 34765 -7373 360
14756 360 32558 53854 54388 9895 43457 52431 -38647 -33721 34176 25189 10237 6866 12525
14743 12525 84655 97449 67215 34874 31710 41928 34990 4020 15044 45346 36540 18720
14731 18720 -1821 16081 8580 -5020 19912 1227 -28389 -14953 215 -47367 -20844 47327
14719 47327 59245 57148 68861 86942 64800 67139 48809 28980 2262 -4684 7527 -26553
14707 -26553 -36979 22242 80390 58786 8498 -533 17291 30059 49512 67773 65976 62408
14695 62408 68051 92143 116265 127361 123625 128063 162524 169684 137075 80583 82209 131815 205203
14682 205203 248235 314806 355967 460704 620046 824992 1142088 1558647 1983059 2386373
14672 2386373 2657004 2613624 2248392 1737095 1213023 853905 652737 522070 385813 297649
14662 297649 206342 168216 127557 119867 121674 79362 68148 78520 71495 80151 96097 84443
14650 84443 63559 67328 119553 128656 74200 33827 2519 44222 83539 79682 100708 138872
14638 138872 92260 67104 38730 35865 95417 110397 88706 82607 61670 73318 70445 73872
14626 73872 44038 44604 68312 57866 12064 -5606 9567 54139 58158 27905 25701 29218 19057
14613 19057 16777 10144 12400 12313 21325 4892 13416 43177 63416 87998 113224 114548 134722
14600 134722 112678 49233 -26936 1071 145 13702 185 -7309 -2791 -7691 780 43621 36453
14587 36453 26743 6983 24582 46497 29674 4316 -13007 -35729 -53511 -34913 12269 40578
14575 40578 48588 71110 79291 61824 52073 54327 54238 36195 28107 29844 53524 60753 31303 33107
14561 33107 62973 135531 119817 112929 128856 121297 101484 113929 101838 94778 72494 56833
14549 56833 53372 39832 17144 8384 13038 59581 93301 116631 81286 29595 1053 7956
14537 7956 2962 33754 79044 41960 65579 99733 108563 86271 47698 29527 21798 7750
14525 7750 9501 3828 12069 2226 -18285 8548 23400 17379 48824 38569 13968 19149 43326
14512 43326 48735 89864 129358 166958 146620 152757 115596 74430 104902 148847 192676 219286
14500 219286 237298 190655 163694 147209 149231 165625 138036 152988 182476 204387 131904 67908
14488 67908 44464 74960 101215 87654 77966 89164 119814 61392 42408 44524 67274 52212
14476 52212 -10220 -2691 5737 3596 -23970 -71647 -108512 -81588 -68637 -67155 -29215 35007
14464 35007 67342 95162 116522 77358 69955 79069 61120 36355 44076 90534 156151 125880
14452 125880 132425 156781 137488 142476 192640 229494 285203 374403 471395 497971 500892 437620
14440 437620 333942 245044 164359 167519 192915 131650 88905 60178 75977 96126 92183 30763
14428 30763 -963 -4431 -23844 -55795 -7153 36307 72978 56857 49920 92337 130368 129402
14416 129402 84517 60113 35376 44914 26440 28565 61561 34340 24391 4759 5391 11674 4025
14403 4025 -1315 40437 54149 41021 -8373 -18055 52337 91484 51329 -15844 -50769 -32920
14391 -32920 -26257 -7807 38331 117437 134804 151517 203123 219502 243151 264886 291300 283374
14379 283374 294153 294411 288690 290684 323229 359932 394817 449006 534896 688644 911541 1068846
14367 1068846 1189546 1242147 1231791 1135110 963043 788242 606507 468436 430918 366057
14357 366057 356405 346458 328338 341870 419948 532717 637105 748692 826737 767736 658422
14346 658422 483622 375271 295065 270923 212357 204728 172514 176372 151572 167779 188972
14335 188972 135747 130941 141589 141535 119264 139631 161902 176025 218621 227811 208418 236820
14323 236820 291630 328535 381171 398270 414532 455138 447364 443250 394364 314342 250685 186095
14311 186095 186404 212575 191300 139057 156129 168949 150338 123659 131503 145786 138517 131805
14299 131805 132645 130690 118165 103075 108007 127231 121444 167988 164309 168125 175455 197055 166276
14286 166276 161435 161920 220094 260175 276123 282304 257332 280771 275449 250570 261819 253160 329900
14273 329900 380075 336286 316398 308275 310440 325168 326883 334329 337865 353850 388045 373988
14261 373988 335843 338742 371342 410333 429586 441432 503290 524900 543045 598618 594896 588461
14249 588461 548010 532028 519986 576291 664064 749051 851744 928848 963580 956345 944821
14238 944821 937354 969597 1018701 1111858 1184420 1197238 1216129 1241840 1290400 1351567 1439846 1586581
14226 1586581 1751212 1836320 1888638 1969975 2079970 2290343 2546877 2935977 3400086 3847905
14216 3847905 4291293 4781776 5404044 6247170 7352743 8776155 10482244 12222540 13827857
14207 13827857 15206556 16407872 17724186 19525540 22218853 26197663 31740544 39180598
14199 39180598 48998402 62429480 81713301 111277094 157665126 225935662 314557096
14192 314557096 411807525 496408418 536958952 501321944 394938116 268461833 172096058
14185 172096058 115048020 82285273 61965223 48541798 39424375 33120023 28656440
14178 28656440 25269380 22496904 20236338 18539255 17290898 16065852 14551335 12780647
14170 12780647 11102253 9753433 8605999 7618248 6727402 5939620 5233757 4641031 4187311
14161 4187311 3876378 3638332 3415129 3163828 2923981 2712101 2502402 2297420 2197260
14152 2197260 2089645 1995920 1933233 1859347 1750107 1619455 1530602 1438014 1366631 1380291 1383113
14141 1383113 1324006 1328887 1311826 1250354 1226611 1203452 1242632 1275849 1340986 1438812 1561481
14130 1561481 1709914 1894979 2004934 1997803 1900708 1744745 1503922 1285432 1105118 934177
14120 934177 817173 771004 787087 764942 718850 672043 616483 619863 624742 602400 579562 610302
14108 610302 571504 517886 508035 484076 481098 544787 572047 605004 657631 624589 585462 557769
14096 557769 528791 551507 593662 637386 709794 773602 892062 1081690 1332697 1625413 2093346
14085 2093346 2646987 3116189 3485364 3603709 3396193 2954032 2405891 1823342 1373775
14076 1373775 1080483 886535 757983 700700 652573 623052 592306 514419 440198 389945 325791
14065 325791 284935 230148 188851 184244 185068 232108 246501 250702 285517 318320 302315 265375
14053 265375 287995 294382 322978 318505 302645 246766 220561 238194 241903 218035 229443 241219
14041 241219 277852 239557 209203 188320 203485 142316 93917 94615 95802 117052 172161 197350
14029 197350 214160 208380 209226 252160 347426 450975 579949 721169 877568 1131968 1533380
14018 1533380 2003258 2415165 2631504 2514529 2076203 1548903 1134045 832970 618191
14009 618191 461946 403266 344454 331863 283465 269241 240058 174553 69042 46634 33053
13998 33053 52927 41550 32652 53246 51483 80166 136640 212498 240763 226654 205394 188406
13986 188406 161873 172322 146218 107261 100312 88205 83764 57665 87176 103571 92112 136200
13974 136200 153881 153597 147729 134110 119313 101974 79081 96733 91831 106980 152738 176308
13962 176308 156288 138936 157508 182828 180492 119784 97271 60588 32990 97250 129626 73974
13950 73974 37638 20820 16825 34417 40885 61871 86847 67210 43506 61731 62738 37423
13938 37423 36347 27316 17170 65478 105111 62769 8621 13599 -4701 -42575 -82820 -64168
13926 -64168 -51780 -12615 64452 101660 101979 134554 151843 173621 171838 183142 187697 180519 179522
13913 179522 156486 91255 70218 36037 -4176 11464 41367 57529 27995 16849 10681 16815
13901 16815 80259 153144 148776 121493 52834 41683 57591 50737 29876 24760 -24444 -64356
13889 -64356 -48251 -13305 9610 -32712 -84899 -68969 -23761 -4678 6579 3246 -33018 -63760
13877 -63760 -10745 16979 8469 34362 46298 19299 2029 -24030 -20031 -12054 12975 21459
13865 21459 1085 6691 27335 55628 47433 52138 68114 74952 100220 132656 169037 200836
13853 200836 215342 262232 282296 262185 294184 332063 345346 353618 346183 337266 311906 260808
13841 260808 226216 187843 148158 106355 82567 48993 26469 24722 26708 -11876 -4322 13168
13829 13168 25466 13755 32998 52512 32824 35851 37636 43450 81954 57533 36394 33478
13817 33478 11693 14037 55534 80966 72415 76398 99942 98688 63644 56111 61959 57487 53984
13804 53984 67476 59966 84000 123833 160712 183634 216931 278502 367451 481576 646717
13793 646717 791868 932737 1081670 1220341 1319113 1367488 1436628 1465862 1426604 1329456 1246287
13782 1246287 1162813 1078659 971728 884897 751282 610720 478153 361994 299955 265111
13772 265111 248456 250464 219581 228713 257035 228094 186693 142405 156472 170155 148204 132725
13760 132725 132064 144177 188510 240534 221054 219690 213728 220075 240994 312933 379054 420732
13748 420732 453451 516085 598743 667636 712120 775050 806331 821728 849375 817410 778886
13737 778886 712169 640147 593119 542411 443580 344185 291649 234644 212008 161631 149611
13726 149611 189376 206554 147343 106806 116051 115551 111679 139732 152584 160206 166036 168678 207624
13713 207624 248495 290756 334091 393541 476914 624785 806477 1047373 1425504 1914389
13703 1914389 2461406 2883661 3004975 2722301 2068430 1412013 988578 772652 679253 664511
13693 664511 719052 737806 788596 895694 944307 1017086 1042422 1096730 1077986 1041080 1021298
13682 1021298 1003741 962763 914151 848413 730381 607562 562809 509614 406843 305772
13672 305772 274890 277926 242969 193930 196823 196167 141021 70243 83489 133232 179668 177546
13660 177546 175409 168016 132594 133741 130029 160351 153926 100114 96173 87654 36983 46493 68408
13647 68408 86152 115805 110198 91105 53682 13655 42851 66696 33430 -13172 -36738 -5345
13635 -5345 35793 10577 29440 68736 77046 78380 56918 54742 75871 58719 68144 83855 83265
13622 83265 109177 95502 72007 45836 36020 21138 20004 27991 21542 -2376 -20911 23666
13610 23666 33497 40322 71713 47053 7091 -3407 14749 49342 63389 47644 38566 16260
13598 16260 19608 59805 72660 104298 84255 93285 83803 47792 35892 62714 48784 39924
13586 39924 15366 13291 23350 7105 43336 56864 63018 44372 17950 45493 64773 24318
13574 24318 2159 7341 13145 -9073 -52846 -42763 -7963 732 10756 46947 26121 22436
13562 22436 420 -4500 1526 24166 24659 15811 26420 12032 35913 14375 1426 45467 6513
13549 6513 -11993 25960 48440 71882 69716 68822 60151 100336 154299 135690 109331 148160 168145
13536 168145 164096 172293 176735 176850 218429 302803 331546 338644 430490 555682 638589 796857
13524 796857 1027248 1223205 1397436 1557494 1702285 1840983 2000469 2082931 2077581 1969004
13514 1969004 1811786 1627487 1386259 1161086 946879 767449 662607 569300 481910 413685
13504 413685 331366 247603 190471 205388 222330 274970 288775 208000 175160 159199 145796
13493 145796 132833 130398 106794 90777 102848 100151 104920 79031 57669 65571 84720 92478
13481 92478 45957 13337 10200 5399 -10738 -5111 723 8985 -23288 -31672 -21035 32373 53364
13468 53364 42702 53159 35976 55936 46285 49709 62326 27106 10262 25984 32007 72517
13456 72517 35949 23399 34234 26136 9742 -42822 -79790 -25361 525 14180 45508 70221
13444 70221 61268 48583 35810 46891 12629 -6848 23062 6927 -35461 -61339 -67959 -39371
13432 -39371 16903 49779 52301 20495 -3539 9952 8913 16824 44384 39935 15096 49869
13420 49869 83363 54919 33472 42498 17748 51243 52293 39809 10579 37440 90259 83606
13408 83606 57246 37459 5940 -24204 -32073 -5632 -25817 -26300 -11442 -20159 -41086 -41475 -39307
13395 -39307 -45817 -13632 4814 29803 46742 27553 -893 7794 19763 48093 15545 2057
13383 2057 13142 26528 16364 -16143 -25379 -53448 -34711 341 -1287 -34908 -37093 -625
13371 -625 43920 36261 28984 -19209 -25513 1720 5382 44925 41857 58122 54702 35146 44467
13358 44467 64764 21280 24326 -2049 -40062 -40778 -52076 -39140 -7407 48587 29298 1956
13346 1956 -48898 -49229 -39361 -38146 -6232 14831 6451 1010 15859 60874 69867 61263 10688
13333 10688 -12525 10365 12936 28752 33794 45591 59505 65030 43399 -11554 -4688 -5779 -22419
13320 -22419 -33037 -31170 -18031 -30216 -2617 -5505 -39446 -85689 -93858 -99869 -83191 -68197
13308 -68197 -1655 866 13779 16143 -10737 -5829 -12273 2066 15678 36381 33936 4287 25543
13295 25543 20394 18701 8077 40371 14869 -5827 -19483 -14161 -25388 -35072 -2654 30441
13283 30441 28249 47584 40801 2121 -15752 -25369 -4575 11087 -11585 -13713 -7213 1364 7636
13270 7636 17018 18972 9161 -17194 -5602 22259 20902 -5311 -26138 -49049 -8268 20580 11152
13257 11152 2464 -10844 -6680 -3722 6596 34085 19589 -944 35161 54296 53244 50192 45613
13244 45613 38843 -3355 11848 35037 45558 -3303 -14167 -3722 13301 17904 -13242 -27037
13232 -27037 -15242 21542 22814 41055 72235 78511 87496 85414 86615 40932 20497 55570 9471
13219 9471 -15144 -34762 -17677 21907 11915 -46098 -53957 -64056 -64254 -32603 -3981 47479 49854
13206 49854 -2739 15072 23590 -2502 -41697 4464 18699 5256 -15376 -40810 -21134 -54238
13194 -54238 -18966 31481 29565 31779 30976 -8081 910 -9857 13336 47427 51947 41895 33969
13181 33969 532 -17880 774 -6784 -41084 -61658 -55647 -50154 -35864 -30732 -15777 -28808
13169 -28808 -72195 -62195 2071 45456 36117 14758 5354 -20547 -27987 -26451 -23091 -32452 -44110
13156 -44110 -46629 -442 -1149 39722 54000 44266 12112 29274 33973 8138 -4099 -7441 -28560
13143 -28560 -2956 1692 4011 34103 90086 87491 30165 41007 44386 15725 25121 27862 4757
13130 4757 -58110 -45965 16336 21514 -13120 -25655 -53637 -7951 70916 38597 6073 -33907
13118 -33907 -34125 -12397 -26306 -11334 1915 3526 -12148 -40531 -64090 -54818 -23903 6512
13106 6512 -4021 -21091 -50291 -11328 26790 18988 39030 56040 13997 13223 32145 5795
13094 5795 24173 48834 35167 35811 37372 47515 44254 24721 -34736 -50159 -43345 -56947 -52784
13081 -52784 -21614 6938 44405 24371 45726 64559 30615 6091 -17357 -43344 -94157 -85983
13069 -85983 -55403 -12368 14740 27888 30691 -1677 -17714 -21093 -36884 -11954 -17539 -50563
13057 -50563 -48220 -18009 23680 -12631 -12144 -5624 -31306 -59352 -51548 -12674 -18357 -21372 -51685
13044 -51685 -37517 47532 74739 56756 70262 73218 43897 46710 7288 -24430 18854 6435
13032 6435 -38001 -61055 -35691 -36460 -39953 -8526 7020 -18016 6146 -17467 -27013 -22489 -8286
13019 -8286 22994 19664 13738 24191 38680 40758 51936 19159 8540 27397 -6522 -17529
13007 -17529 22157 67325 37129 21680 49020 -15678 -83322 -76516 -12306 42362 30393 60632
12995 60632 46415 -18421 -34169 -53815 -47103 -11068 -24733 -19662 27127 55013 49765 23597
12983 23597 -9718 386 10581 22551 50157 74223 44041 53441 83313 99773 70434 26109
12971 26109 -29066 -59884 -42759 -22517 -35441 -51718 -18230 21746 69167 30756 3887 3332
12959 3332 16341 4898 33208 41004 38930 28664 -7549 15920 30570 67247 43749 4292
12947 4292 -19895 -30341 -68762 -72511 -82266 -60517 -8723 1058 4350 8414 32278 57844 76500
12934 76500 80500 53938 24045 -13192 15188 39622 40554 12307 -24349 -71753 -47858 -47955 -3746
12921 -3746 35582 41653 2515 -6988 7864 -46946 -50100 -11445 521 12600 -25644 -32780 30654
12908 30654 31550 -16222 -10284 15223 16053 -6133 -20227 -48630 -816 26467 19601 12094 44411
12895 44411 41630 -3210 -31258 -9539 -41325 -13073 17481 8099 19711 -3242 -24380 4311
12883 4311 -40650 -93637 -95528 -99704 -49828 -13581 -15070 -5575 -2052 29576 33161 12502 -21323
12870 -21323 -44171 -54028 -34140 -8826 8597 -398 66730 67941 4868 -42156 2782 18678
12858 18678 16461 -14007 -23542 -7711 -26960 -67167 -59962 -49094 -34948 -756 10504 12667
12846 12667 37984 50420 36861 7551 -13780 -27720 -5423 31867 39100 64049 27132 17860
12834 17860 518 -37229 -18682 26764 17148 20664 61785 59909 -4629 -38972 -16840 -9104
12822 -9104 -6432 -16502 17566 25576 21942 37322 30044 555 -9548 30383 52229 47424 82999
12809 82999 117729 99489 37693 -32868 -41921 -51978 -64771 -65379 -26807 -18847 3067 -1631 -7019
12796 -7019 14274 26600 44859 25034 2513 22499 65393 123607 108449 57400 29285 24504
12784 24504 17402 -18475 -5060 -24289 11179 6274 16253 34458 80133 70271 49867 55070 -17245
12771 -17245 -48832 -46891 -25621 -2280 2988 52804 59465 44414 97236 84502 64927 47003
12759 47003 65666 59721 22168 12580 41396 14335 -52503 -76318 -59385 -8132 35466 20643
12747 20643 -1730 -22140 -19596 -32447 -23646 -9888 -2540 26355 -13073 -36616 -35021 -23291
12735 -23291 -57110 -50782 4113 -10751 -12896 46128 93246 101721 56349 25037 -6155 -29909
12723 -29909 -26214 -1405 11967 -35712 -40236 784 14224 38687 48250 54171 41561 47789 32514
12710 32514 27663 36452 59374 42467 -16769 6243 38333 40460 37618 26749 20905 25705 -20916
12697 -20916 -88501 -93875 -79383 -65351 -55313 -51493 -26835 -30477 -5843 32918 48447 37964
12685 37964 32779 36677 56680 63300 -14592 -5568 24220 10147 -13674 -6006 10091 -23121 -7844
12672 -7844 14238 -11972 -8048 44992 76635 83484 89615 39276 25899 76469 71504 54059 60622
12659 60622 84170 78209 72111 37776 29455 20320 915 -12130 -21475 -20162 -3172 41979 38350
12646 38350 -4020 -22367 -42417 -30556 -20761 -23348 -58657 -57298 -848 12166 9623 -1391
12634 -1391 -20616 -12575 -4886 39062 20596 -13611 -33208 -48754 -56325 -50715 -28828 -11942 2256
12621 2256 -14232 -18542 -9632 -14058 -42684 -85890 -102588 -92613 -75613 -29557 20727 -28585 -48963
12608 -48963 -4195 29654 16984 -36816 -60194 -39896 33436 57513 39978 4726 -2280 -11005
12596 -11005 -27913 -41597 -2543 -1192 6975 641 11128 26157 32555 65732 54601 51521 50844
12583 50844 -14484 -38085 11718 12385 -16589 -5983 23483 38428 41981 25159 78542 118363
12571 118363 75527 47609 32871 17207 -3317 19684 19152 -13576 15658 44952 49041 16639
12559 16639 39558 68668 70433 39122 5825 3158 18715 12450 -8117 -28114 7259 55879
12547 55879 40721 57935 41118 7516 37784 24059 23524 64852 73541 64216 36190 36605 45657
12534 45657 67832 75991 38410 18576 24646 34301 8051 -11977 35925 28368 -16134 11514
12522 11514 -9570 -17032 15022 55284 80235 76520 48296 13732 -6539 29273 62260 23035
12510 23035 1085 22108 -8237 -46658 -50180 -10641 5316 -10011 12833 28297 65580 38999
12498 38999 9407 15925 51680 59501 28928 34930 53956 9816 -26133 -35561 -24533 4839
12486 4839 52851 40769 47214 42229 42940 30661 22497 47551 56702 98166 113230 96255 68991
12473 68991 -10195 -67439 -95958 -96387 -90108 -83910 -55117 -6540 27136 -8728 -7682 -23074 -1679
12460 -1679 16306 39438 45852 108085 100749 58228 38493 26268 -12538 -15143 12884 1664
12448 1664 1731 28338 53267 49677 46887 4710 6372 -6155 -1095 12509 -12209 -23259 7316
12435 7316 -21179 -34435 -45329 -45445 -39581 -2173 8451 -42588 -84289 -75795 -52679 -15103 -14389
12422 -14389 -50294 -57084 -56424 -86847 -98626 -56226 15341 73961 56670 27659 29292 27374 2052
12409 2052 9246 55850 51955 44810 35002 2499 -31661 -28085 -36838 -54356 -53750 -16993 -18182 13669
12395 13669 45085 6400 -37358 11284 20365 27417 46384 -7424 -38596 -38517 -43531 -64403 -71831
12382 -71831 -74249 -73543 -35111 -19305 2086 16751 34698 6165 -30654 -15141 -18801 -25533 15816
12369 15816 29798 38213 -15404 -57690 -84966 -45491 -6759 18479 51254 34029 24998 37225
12357 37225 36122 22777 -20823 -73949 -102868 -112068 -64501 -20178 15455 21270 11195 -32069
12345 -32069 -49774 2395 50348 26355 -2470 -18436 -11107 -13260 -41002 -46484 -38370 -55913
12333 -55913 -50046 -14955 24493 68222 118357 104970 84314 44706 29340 19453 -25411 -12053
12321 -12053 29532 2207 -41138 -52163 -28655 -13045 -45070 -45010 -25408 -14847 -10789 5260
12309 5260 -2911 -27122 -3888 48955 24555 -9541 -40249 -31467 -17988 -27919 -33537 -48696 -31086
12296 -31086 12099 -2909 8538 28834 43821 12788 -38138 -42197 -30952 -51174 -64996 -41672
12284 -41672 -71050 -64166 -24704 -30312 -42911 -65049 -10898 12811 -12864 -17895 -10815 -28774
12272 -28774 -24882 -20260 -41936 -32566 -567 44469 82764 87586 25010 12126 28366 24214 -9713
12259 -9713 998 -14621 -15725 17220 -11444 -18269 -11007 -13165 22630 9624 15236 50643 62783
12246 62783 9762 -13474 -22234 -13078 -23192 -55701 -70923 -36561 -7165 5311 9977 12069
12234 12069 32411 36090 20286 -12830 -3089 7470 497 -9445 -13711 6205 6601 6856 417 1289
12220 1289 -15779 -8896 -2416 -13977 -23412 -12964 -7830 7791 14611 20420 10750 -34946 -28247
12207 -28247 -19404 -50912 -64878 -50025 -52902 -10494 21789 25494 42935 14836 13781 10281 -39829
12194 -39829 -25935 -14387 -19554 -28654 -5538 -8235 -32288 -35108 -26297 -32541 -28660 -13457 -13167
12181 -13167 -9272 -15682 -30790 -35333 -42008 -25587 5053 17576 26155 15098 28032 5655 -46174
12168 -46174 -31810 16261 19589 41432 82935 54810 -35963 -73598 -36068 4469 -6434 -20068
12156 -20068 -44523 -29156 -32381 -72630 -97965 -89207 -34356 -7531 -9804 3836 -6014 -55004
12144 -55004 -124338 -189223 -151239 -76362 -39561 -22539 -25916 -12900 -9225 -12930 -44205 -61737
12132 -61737 -55610 -35965 -4191 -21154 20311 -15931 -22622 -2126 -7560 -6186 24067 45198
12120 45198 29671 -19755 -4161 1110 -9159 5224 3379 -10416 -10968 37406 90597 103179
12108 103179 97291 113647 97587 62037 26892 -11612 -48898 -65186 -26444 15912 53008 49563
12096 49563 12867 29498 25521 18279 16723 -8083 -3193 3684 49052 15009 20806 44401 40649
12083 40649 37590 40107 48426 -6276 -19529 -34173 -45389 -4568 46079 29193 31372 14872
12071 14872 -10999 -32193 9450 -6792 -38378 -10827 11171 14072 6887 -13793 12302 17398
12059 17398 4263 -16082 -62864 -64391 -44255 -8442 11770 33073 52269 34999 -6228 -21885
12047 -21885 -46087 -46583 -34582 -16340 -8805 -35746 -44849 148 31646 15344 1605 16065
12035 16065 27699 43862 3933 -21358 -36572 -81985 -59697 -28331 14346 28259 25066 7216
12023 7216 -3801 14874 25635 14656 -10976 -62115 -91777 -85008 -44021 8111 75328 40037
12011 40037 11885 -30472 -39577 -72321 -56613 8446 8798 -24077 -20433 -13813 2994 13557 27292
11998 27292 15993 -4848 7393 -7253 2094 42919 68352 57956 43124 72274 49868 6658
11986 6658 -27651 -70209 -11917 23623 8548 -13141 -18533 -11934 10160 67650 27944 17339
11974 17339 18903 29122 49448 41573 37477 53015 45707 17782 30377 51240 -5086 -68899
11962 -68899 -73122 -69271 -31391 17563 25501 -44355 -95316 -25702 -8518 -24814 -13070 -57117
11950 -57117 -55368 -15702 -19417 -48660 -57730 -65792 -75162 -93178 -74549 -56685 -90194 -101217 -90169
11937 -90169 -30631 -11314 -31479 -17979 -12162 -15569 -11554 4300 -19010 -40910 -32826 -26510 -17888
11924 -17888 -27040 -9047 8961 35870 3522 -20329 -32978 -63320 -42629 -14370 -23965 -43088
11912 -43088 -53407 -64506 -18661 -2840 -46591 -49359 -51021 -28564 -19561 1160 -713 -14902
11900 -14902 -20228 -17371 12919 28653 -38665 -44717 -37841 -51208 -42879 -12858 11367 17545 24672
11887 24672 15465 6484 -676 275 12005 31317 51056 52689 40811 29978 25523 41470 93521
11874 93521 45478 28022 27836 -6014 -33443 -231 2752 19861 26872 3706 -8247 807 -53426
11861 -53426 -48187 -3934 37616 11522 -5465 55108 61585 65675 48542 791 -19914 -26220
11849 -26220 -42357 14206 61113 82037 52381 40553 6811 -27820 -42239 -65769 -53785 -22382
11837 -22382 59 26132 56845 72795 27546 26762 46459 53479 55335 6430 -11347 -8497 -23543
11824 -23543 -7626 -3850 -40988 -66581 -63828 -67218 -48076 -37677 -49827 -19954 7235 37311
11812 37311 41130 43739 1817 -58159 -109965 -101211 -85443 -108340 -94675 -28141 -8036 34670
11800 34670 62049 37617 -42969 -70588 -41719 -51556 -34693 21093 58092 46428 -14098 -42650
11788 -42650 -2478 19033 -13814 -61554 -28918 -3217 4701 -21624 -31055 -36730 -53224 -88634
11776 -88634 -73439 -59598 -56615 -4579 33578 -14945 -27312 -32060 -43421 -49111 -31192 -31499 -49887
11763 -49887 -49374 -19899 -9027 -25350 -28814 -6174 20524 20038 -2929 10641 67101 51438 19018
11750 19018 700 -22043 -81438 -67112 -59653 -34199 -45456 -18627 -16259 -480 12093 5789
11738 5789 -8389 -10491 -1874 26646 52187 38830 32082 7795 -8578 4197 5559 4381 9118
11725 9118 37109 74473 70217 21895 -2564 -50580 -75737 -34311 -26909 -25927 -22748 -17852 -14472
11712 -14472 -21070 -47190 -24413 -36662 -56967 -30421 -19753 -16932 -36342 -68052 -58507 -55251
11700 -55251 -72970 -48128 -64474 -91146 -86665 -69654 -41168 16380 -23872 -8171 14064 4418
11688 4418 11939 46183 39309 11075 -19389 -10902 -10092 -20888 -18440 -15051 -8919 17284 75237
11675 75237 91869 72921 73573 46739 22853 8235 44577 56419 6820 39243 54829 32834
11663 32834 24062 5486 -15401 -17045 5287 -54515 -144718 -116150 -69348 -22399 -11558 20144
11651 20144 43770 -795 -17691 -10830 -13943 -11099 714 -10821 -41866 -34712 -18718 -39239
11639 -39239 -61672 -52231 -4292 36883 44394 21456 21818 26271 33450 5316 12980 13273 -27621
11626 -27621 -35112 -17005 23670 4467 18530 30392 -7233 -62378 -90529 -89310 -54060 -67215
11614 -67215 -41263 22122 15684 -4827 5352 20889 15926 -33453 -69284 -44972 -46688 -105939
11602 -105939 -93483 -43961 -24535 10277 24643 -6948 -30809 -35713 -23649 4030 5088 -22340
11590 -22340 -21523 20777 54283 65867 1731 -45672 -36765 -34214 -36061 -31924 -22878 -11551 44482
11577 44482 45885 39494 42649 44164 13517 -56960 -128940 -115068 -76110 -41066 -44325 -4355 15426
11564 15426 52201 52518 27387 5703 -52178 -41239 -34270 -30843 -40800 -61780 -64974 -32180 -1215
11551 -1215 -17884 -39373 -35365 -9717 -28175 -31734 -48072 -42555 -32777 35184 49020 35366 52244
11538 52244 38218 18714 19244 21766 5438 21178 61243 54222 22567 5510 -3503 -38882 -31699
11525 -31699 -31148 -24576 10255 -5769 -8848 5505 -25794 -89678 -99582 -60228 -28151 13104 313
11512 313 -46906 -46586 -19583 -2035 26734 -2683 -44428 -20684 -10980 22234 78678 70471 1590
11499 1590 16646 -9020 -33243 -20562 9683 -30907 -56264 -19012 -13833 8018 10567 -33128
11487 -33128 -80075 -57042 -64346 -68678 -66238 -84628 -39032 2106 -25225 -25865 -8998 -12427 -30865
11474 -30865 -37827 -44924 -62635 -63098 -31812 -31989 -41844 -71989 -73288 -40315 -39996 -15509 -9977 -35674
11460 -35674 -48434 -6833 -10270 -10024 28667 20608 38552 39784 41885 73696 95655 69387 63544
11447 63544 -6129 -37329 -40350 -12810 -41440 -63492 -35173 27895 31059 -22833 -38911 -28987
11435 -28987 -40563 -77562 -81624 -52247 -30311 -37667 -30546 -446 -590 -5341 5555 -19656 -1310
11422 -1310 -11936 -7483 13560 32680 18391 -19518 -17720 10836 8873 -59476 -114859 -92565
11410 -92565 -45662 -50466 -62080 -37567 -3237 10735 5602 -29397 -23918 -56421 -58271 -33313
11398 -33313 -48739 -106538 -94388 -71329 -28274 6067 51841 32041 31073 26672 14702 -22760
11386 -22760 -29093 -51979 -57499 -28445 3741 -16950 4563 58960 67152 32341 32679 38498 21190
11373 21190 38610 57242 45002 25430 5808 33874 20116 52350 37988 -30164 -109128 -88084
11361 -88084 -59981 -60862 -65165 -44649 -45631 -77625 -93868 -109153 -95950 -74577 -62498 -63819 -45461
11348 -45461 -9454 -19946 -28741 -3486 5775 3264 -3944 -55564 -40586 4307 11417 -2189 23994
11335 23994 18964 -1347 47474 106793 98294 25829 -2733 -1590 20938 10821 -17088 -1574
11323 -1574 -25228 -15133 10085 60395 33311 54786 42584 47298 40627 51202 9735 6993
11311 6993 -28406 -14966 38837 31595 -7059 33251 47034 56887 25904 -21001 -50723 -51804
11299 -51804 -54549 -33700 -105 47013 75210 67005 60882 12317 -2548 27944 45320 61252
11287 61252 37682 4771 23454 -1122 -3824 -11172 -12534 -8763 -13634 -32135 -28314 -18072 5137
11274 5137 59559 64297 -1532 -18577 -53655 -37548 -34270 -38999 -33937 -60116 -61899 -35932 -35350
11261 -35350 -11912 -23380 -57293 -53818 -39750 33732 39733 13518 -2313 -11304 -55923 -79085
11249 -79085 -55784 -65193 -82494 -97482 -54352 -40312 -37281 -41360 -32270 -15107 9082 46604
11237 46604 77766 35701 12208 -11358 -23338 -18179 -21100 -23695 3273 -43297 -79852 -23375
11225 -23375 -13927 30927 16256 576 -22313 -15501 -10062 -9534 -6578 -1831 -45941 -70702 -45071
11212 -45071 -29906 -57618 -60263 -45851 -7334 -32611 -15272 33984 47004 47777 69206 57202
11200 57202 56925 56543 55100 30797 10829 2126 7813 7582 6065 30594 65249 76252 70332 19906
11186 19906 18046 35096 48367 20019 18385 -5197 -51195 -10591 54855 38236 6532 7425
11174 7425 36778 22186 -21879 -101905 -121583 -90447 -57773 -22070 -18855 -3341 -11061 -21671
11162 -21671 -62324 -81853 -65347 -29667 -38267 -29591 -50707 -75678 -49329 -37896 -28869 -53315
11150 -53315 -34564 -27430 -20892 -26775 -11677 6535 28843 61001 62672 18387 -13097 -19538 18325
11137 18325 73573 81673 48963 6572 -8191 -43828 -46301 -47298 -49236 -18769 -11850 -60412 -45798
11124 -45798 -24809 -6637 3389 -7713 9518 31634 22334 25192 41065 3669 -15733 -36952
11112 -36952 -58436 -33394 6645 -19957 -27226 11644 -2915 -11332 -37172 -75745 -67056 -67756 -87700
11099 -87700 -72968 -29427 -37602 -10634 -17131 14064 26170 2304 -18425 -4978 42097 56746
11087 56746 3775 -30675 -10351 -27264 -54036 -28522 -936 7410 -18312 -8391 899 -10174
11075 -10174 -35150 -74691 -77123 -47753 -14697 -62637 -71305 -71856 -24976 22271 54490 63495 76410
11062 76410 64712 16086 29278 35246 30443 18511 227 -35953 -47942 -1845 5723 -2807
11050 -2807 -8284 -5301 -25601 -66191 -57393 -71085 -35877 -2224 -72645 -92437 -94837 -55503 -36363
11037 -36363 -16538 14818 8539 -3788 -17514 -1273 23532 23180 -10470 -15941 -22322 -19874 28865
11024 28865 28943 30548 1709 -4644 -9892 24405 2540 -13293 -14280 -38301 5238 62419 41062
11011 41062 11051 -22428 499 27295 21186 12816 29540 38239 46194 59703 35540 1858
10999 1858 -29810 -59981 -92357 -63207 -2578 -1939 -51235 -28363 -8018 -24069 -78760 -85067
10987 -85067 -51968 -27504 29292 44504 39024 71427 67616 51314 -12527 -58288 -42900 -12542
10975 -12542 18627 28103 44929 68429 58396 56890 28999 15336 62215 61222 90910 56848
10963 56848 3482 -1827 6741 -9226 -32279 -55587 -32365 -36893 -17203 132 -14556 17216
10951 17216 59580 19959 -17964 -35518 376 -11846 -36030 -13776 450 13422 12502 4939
10939 4939 -22440 -21349 -18606 -25627 -18360 -5919 -18778 -26303 1066 -22949 -67569 -33551 -60632
10926 -60632 -99717 -88297 -17030 11285 20491 -8765 -36459 -68908 -85283 -50400 -48384 -11139
10914 -11139 17860 23299 -18120 -56409 -47672 -22556 -28892 -35484 -27688 23936 52357 24497 35157
10901 35157 47524 -2602 -33183 -21170 6313 15880 -7670 29682 52354 28625 -3308 8134
10889 8134 1455 2263 -40682 -50266 -8190 3975 -43079 -47313 -43726 -24617 -1283 -10344 22298
10876 22298 16979 16341 30950 17402 1237 -4594 13192 16259 -5367 -22479 -8075 25149 60115
10863 60115 70204 44898 31766 62604 48702 16029 24695 26933 2788 -28512 -28647 1435
10851 1435 51532 1090 -52654 -20683 -18878 -41383 -29277 -26049 13300 41961 29535 56314
10839 56314 51715 46959 60264 61718 34264 -324 -15289 9336 39320 23075 16377 24918 37569
10826 37569 853 14865 25552 43576 24601 -28796 -40852 -13158 -22320 -34953 -31703 15827
10814 15827 -6382 -62539 -48824 -1229 -3901 -51479 -54749 -48855 -32618 -45938 -65677 -70284
10802 -70284 -57032 -57489 -38332 -47746 -63403 -55152 24645 50815 41530 16875 -12018 -1893 60359
10789 60359 48094 31619 22109 11366 5549 20310 52162 9992 -26760 -34265 -17904 -9962
10777 -9962 -16669 -12754 -1257 -21281 -51758 -30491 -39282 -29471 6718 37153 37328 40393 -5537
10764 -5537 -25713 -29070 -41086 -55241 -56356 -67295 -75019 -72078 -78444 -59638 -55822 -43797 -14132
10751 -14132 32825 64189 44348 38417 38800 49614 54812 55961 27962 22123 6972 12772 15844
10738 15844 -20935 -44065 -64748 -52241 -14584 -32147 -32205 -27399 -56861 -67949 -95163 -67297
10726 -67297 -38771 -26172 13634 23436 14729 4084 -13640 -60638 -73892 -32965 319 18302
10714 18302 29492 -18573 -52831 -87715 -104976 -67719 -55683 -52591 -49203 -29631 -7494 -19476
10702 -19476 -21617 -14701 -60280 -92782 -58937 -40517 -18538 -10766 584 -2353 -37598 -75828
10690 -75828 -81608 -76531 -81619 -56584 -9817 -12283 10955 3184 -10648 -32462 -11618 19088 46379
10677 46379 29419 18990 31509 13170 17228 6640 1622 -26698 -66950 -60919 -38356 2767
10665 2767 38108 23869 8366 54524 67927 66140 13760 21130 14339 4064 7415 732 -24724
10652 -24724 -15112 -7425 14356 25850 -7709 -15485 11612 -8820 -34213 7372 41478 39676
10640 39676 39662 35900 26999 48573 54786 -2294 -11520 7938 7692 -8135 -32483 -34760 -44706 -35527
10626 -35527 10304 29430 11417 5310 1863 -20555 -46472 -36067 -44424 -2255 -13727 -53224
10614 -53224 -26461 5030 31069 44463 43074 51934 64265 57151 9643 -3262 28972 32327
10602 32327 18664 13153 3184 -17472 11901 -17979 -2720 -12179 -40869 -4802 29130 -4536
10590 -4536 -43897 -8528 22496 -9890 486 19689 38790 15373 10542 -4652 -26846 24237
10578 24237 53031 30357 26468 53439 10450 37 37456 -37233 -1400 37891 46357 8118
10566 8118 -1209 7885 22042 30532 46429 39471 35640 13330 2087 -43628 -61766 -72458 -72134
10553 -72134 -58930 -61880 -54082 -37381 -40044 -60593 -49176 13060 37937 4765 -4768 13229
10541 13229 -34864 -57686 -27006 -9464 -29187 -51412 -18365 23643 36686 70300 60298 43196
10529 43196 41213 36746 64279 71026 24551 18325 60067 47682 36459 49103 81104 110457
10517 110457 80689 26600 -18290 -13792 -19565 -20830 -38936 -66579 -37425 -49732 -29746 26501
10505 26501 43675 44221 30974 29061 22141 -24556 -39517 -12201 27755 36975 12682 -26194 -63740
10492 -63740 -47121 -46539 -17711 -5865 -8311 35040 39047 12241 13995 60964 80267 73823 73340
10479 73340 44346 32638 31316 -5276 -40591 -35346 -4120 15530 -14008 1922 -6569 -31597
10467 -31597 -8625 17056 -13451 -51539 -30591 9024 -30659 -56922 -70852 -76185 -31261 45694
10455 45694 62548 3089 -8901 -23190 -6967 33543 58513 4128 -59801 -10604 -15998 -17768
10443 -17768 -11280 -10295 -61006 -55544 -2024 13629 -13305 -36940 -38406 -21365 21026 25641 -13593
10430 -13593 976 22490 -11561 28519 59818 28374 15479 36739 47543 39605 16689 -2484
10418 -2484 17903 9651 -9511 -35242 -30439 -55242 -68514 -49785 -53858 -19195 24200 33381 28053
10405 28053 12871 14662 41866 53681 19182 3303 2248 -8743 -2858 31249 75396 49633
10393 49633 19878 10360 9731 -9530 -15724 -19262 -4168 45369 60330 71892 96106 83017 41466
10380 41466 41122 68441 44745 8708 23324 42953 47825 42003 45727 29936 25175 32812 34757
10367 34757 33243 67666 118220 160265 178386 240092 301922 341469 409280 486150 522748 535658
10355 535658 570645 579817 558895 503823 455120 406023 298072 221878 191380 170691 103682
10344 103682 47230 52522 59852 51900 32333 3287 -2720 61171 92735 25388 2580 26488
10332 26488 71124 42123 20895 39553 64466 53075 36895 16585 -27015 6528 36768 6615
10320 6615 -30117 -62063 -36600 -45201 -74970 -89061 -61644 -35836 -30179 -54687 -76149 -35061
10308 -35061 -996 10581 -14263 -3137 51643 56024 77254 70483 46383 -4774 -43496 -31081
10296 -31081 -12052 -14389 -37822 -11719 25218 30019 -20719 -29784 6877 34391 229 -28553
10284 -28553 -9478 -28517 -29540 -67643 -50925 -24560 1254 15532 -2935 -21389 -22200 -15346
10272 -15346 -29158 20021 -1258 -38125 -36174 -10801 -17941 -24923 -20917 16490 40777 32141 72715
10259 72715 44212 42181 33761 5951 2480 -13518 -47408 -67043 -36670 -1053 -12651 -36810
10247 -36810 -11951 -17044 -34181 -95015 -76129 -34406 -33833 -18356 3794 18013 10327 5733 -904
10234 -904 -36084 -31462 -61710 -42656 18191 61511 72626 71783 37044 12898 42374 78740 85956
10221 85956 82545 60350 27627 -7668 -13465 41702 60956 58811 51196 7307 19546 78640
10209 78640 29619 23819 20842 -21360 -49531 -59943 -77941 -69940 -62196 -12576 24464 9364
10197 9364 -34896 -78013 -98858 -61272 -4673 1288 -46094 -52629 -34497 2575 -8862 29362
10185 29362 17439 -34346 -49867 -18050 15714 9654 -4075 43763 21805 3517 -4085 -16077
10173 -16077 6650 28423 24179 -8174 -25915 -12490 31677 9168 -11497 -47057 -22364 -6845
10161 -6845 3614 -12125 -20298 -14986 4 -1125 5024 59112 34098 18002 48580 37638 55587
10148 55587 16727 5637 32883 36476 34311 24257 11069 8530 -5581 14233 11615 3178 -4254
10135 -4254 8428 30506 45640 21949 16213 -8542 -45408 -65511 -58464 -85636 -79429 -52408
10123 -52408 -30974 -46238 -37813 -32007 -1300 9514 -23818 -51538 -57116 -46791 -19611 -28326
10111 -28326 -28175 -17271 17552 50101 19111 -15866 -32969 -47558 -69764 -89044 -66143 -24635
10099 -24635 11094 13760 -7056 -54279 -72282 -24620 35491 44944 21823 8082 38205 55208
10087 55208 64337 63501 52068 49382 61628 17512 8809 37393 57131 66698 80941 71244 65260
10074 65260 57834 29545 34947 8772 -48741 -73588 -49093 871 16975 29967 52120 43457
10062 43457 28024 42417 29539 23564 23183 -14449 -47291 -56751 -49929 -63591 -41069 -39677 -37316
10049 -37316 -23606 -14959 5242 26575 10626 -25941 -37695 -12204 -33274 -35593 -43415 -87229
10037 -87229 -81312 -65285 -21582 11112 45448 45074 5394 11642 -6009 -13291 -54566 -98795 -80510
10024 -80510 -5495 18260 59759 43703 3155 -35982 -58875 -46129 -17398 8454 40202 67324
10012 67324 52978 37706 43676 49908 56025 46308 16788 36239 58154 52527 44659 57610 56906
9999 56906 51042 -7865 -62392 -51955 -31669 -29869 14433 44961 40223 2245 -38292 5046
9987 5046 21433 12621 2086 6492 11630 24087 14646 -18652 -50644 -53544 -29009 -28502 -969
9974 -969 20031 18196 29681 36037 15212 9645 3028 -23399 -28816 -2177 5779 20214 -47536
9961 -47536 -65743 -33013 -57733 -41158 -9955 3050 15757 8882 13781 5749 7966 32000 66026
9948 66026 63731 43042 8626 -12241 2305 24850 -1527 -18536 -5176 32139 78216 84591
9936 84591 49192 28398 11779 17515 18360 41244 34282 34742 44795 29775 22622 53509 43305
9923 43305 56602 42022 47574 11610 -16167 13721 14548 7645 41250 52631 31611 9070 5134
9910 5134 18229 57621 50344 25129 23260 20393 83367 96942 73362 76974 76896 57366 87452
9897 87452 78383 -2315 -48907 -61926 -60243 -6646 49622 45327 12654 19728 62370 86382 36215
9884 36215 20947 -20662 -41941 -47738 -39359 -47598 -28840 2226 32523 47001 38200 20187 -15142
9871 -15142 -5751 6210 5183 12023 80084 125816 126992 169411 122804 52655 8041 -14891 -35093
9858 -35093 -65905 -52232 -81071 -53384 -37755 11911 88952 111533 73642 28253 23274 10355
9846 10355 -10687 -19717 -16717 31919 63090 39065 24505 17941 -1051 16036 38507 11483
9834 11483 11691 13267 5091 -4 19484 10321 -7319 -23348 -13803 -6648 19818 14245 40820 2326
9820 2326 6400 58912 61843 19638 9633 -7868 -40763 -68102 -69686 -30999 3992 62882 56626
9807 56626 57633 41337 23757 -23024 1208 -13302 -37830 -47772 -35769 -2677 6019 30400
9795 30400 83675 97899 35998 3467 -9018 -48844 -63856 -41946 -68687 -85792 -60290 -21938
9783 -21938 -30492 -5330 6200 -40324 -64960 -72976 -47039 -33261 -22150 10580 -266 4199
9771 4199 18204 32424 44827 17204 23821 26369 13524 35679 55192 14245 9624 16808 40093
9758 40093 31504 -5416 18032 27266 2822 -17422 27815 26642 38967 48401 31607 22012 -5327
9745 -5327 13456 24937 50582 80213 66106 39919 24564 25098 36763 4439 -7302 -38471
9733 -38471 -70131 -38041 24390 70274 88943 97588 103763 91875 31847 28735 20157 27656 28708
9720 28708 -16818 -46085 -14194 15707 41036 69624 22465 7915 35474 55553 9622 -5734
9708 -5734 -12279 -3676 20888 14071 -11025 21306 24384 8288 -37942 -28982 -28315 -15436 25220
9695 25220 40126 32864 4801 -12328 -29219 -565 10365 12232 -42842 -69979 -44507 7431
9683 7431 37322 44171 42260 5350 -20171 -8017 69993 90563 91980 137942 149135 119524 97491
9670 97491 66967 44719 36628 39158 51917 69028 102281 95492 59271 48346 11253 17661 2814
9657 2814 -6450 -19953 -17533 -9453 31105 36996 12842 20476 -20685 -23858 4957 22341 -6883
9644 -6883 29946 40181 44755 71156 84855 60967 35137 58600 30849 52 -16983 -4362
9632 -4362 -615 -16193 5632 -11311 -19381 -6929 5657 10165 -20390 -43064 7938 48520 28386
9619 28386 43257 55380 71321 28553 17826 42462 11936 28649 29587 23830 7729 2207 -6801
9606 -6801 5264 3684 3487 -28712 -44320 -67545 -23474 -18849 11446 11895 3182 16070 -2955
9593 -2955 -4405 6919 7929 48826 77786 83182 66190 63477 83946 94805 62938 15748 31063
9580 31063 38291 43630 12806 8787 57954 54594 11043 -16240 17521 33444 28250 37048 19470
9567 19470 -8782 6831 58191 94601 84872 28162 -14821 -21784 -38462 -23950 2824 -10080
9555 -10080 -14642 15484 15611 7276 -8868 -46194 -20264 14676 34889 33674 -8049 11658 58227
9542 58227 53594 62437 32819 14194 -16155 -44104 -42080 -20710 25976 56284 85114 81262 57413
9529 57413 42990 66188 66782 62514 27220 25033 48994 67849 66012 78280 116238 107353 63699
9516 63699 75048 75572 47266 7862 -4781 16257 41154 54810 68733 65274 56452 85572 32069
9503 32069 3225 50792 55614 32312 32814 61871 95574 77707 51203 41834 8218 21657 7481
9490 7481 -701 -16329 -17077 27754 46101 36141 18280 27030 55877 60107 46278 33166 56818
9477 56818 86667 66332 26899 -45 2661 18165 3528 8524 25143 14412 -2880 -28203
9465 -28203 -9626 39567 58336 40791 26418 28243 42582 60540 15708 -636 -2885 -1016
9453 -1016 29295 48857 27969 12893 32590 38115 20002 28507 27146 73327 106127 127553 143539
9440 143539 127905 94208 46017 37664 83499 95094 72797 80125 57530 14815 -14633 -23537
9428 -23537 -10603 -19419 -7953 -29841 -2722 3962 19376 37401 30655 23470 28647 77422 107506
9415 107506 69337 336 -9251 -4887 10041 8237 30958 49227 59134 28880 73353 65116 65347
9402 65347 68664 42767 9172 30561 54228 35030 28089 58670 100988 97922 43592 13552
9390 13552 -6905 -26789 -11010 -11577 -60314 -27135 196 33442 32057 14776 14108 71537 127586
9377 127586 137240 119071 84332 54376 34722 57109 98197 55321 8778 48608 58011 71485
9365 71485 107570 111552 74274 83234 88575 79275 93386 61161 19331 -35709 -35386 26165 50606
9352 50606 27485 30433 59011 49355 38313 28486 1787 -1407 18073 3495 48464 81421 65365
9339 65365 42849 61737 64284 95200 100922 99056 93644 55826 45043 49206 48244 72539 28794
9326 28794 12544 27077 41920 36017 59904 75940 62506 73638 81399 61719 61879 62801 59946
9313 59946 46582 13422 43233 87525 134958 94705 38947 35392 14706 -6175 7801 65719
9301 65719 69770 64837 51352 32661 -1186 -6314 -19401 -7812 43774 56750 35177 37034 52398
9288 52398 -9443 -23244 29170 64859 91836 89214 59464 37160 33592 88431 131843 114374
9276 114374 76265 41006 22652 29752 38315 51611 105720 98604 34828 12262 948 21174
9264 21174 34365 8322 34174 19381 19526 50784 73578 38612 20039 28318 36332 53822 74739
9251 74739 82214 64473 39722 33841 16582 40043 84268 47699 60139 76283 57066 13552
9239 13552 9721 42316 68685 49114 12913 20941 51133 76984 42269 49982 75552 71026 49573
9226 49573 31030 26164 61802 101317 167339 194472 185331 164509 135441 101683 119007 102333
9214 102333 59066 9796 -24667 -1144 57367 96623 98090 83342 37057 56663 66207 71860
9202 71860 73067 94840 117310 115062 118192 80667 110469 121931 114367 100798 86706 77243 99958
9189 99958 110619 77217 89057 44504 42561 32728 28322 31159 31849 41599 85882 120669 154736
9176 154736 150590 133824 149697 102543 68580 67761 108439 113697 112552 119730 97714 78775 56114
9163 56114 83129 108869 137006 122935 139859 111765 109409 133724 131174 148209 149844 113276
9151 113276 100152 116669 127093 117610 127730 132291 133141 137217 119437 129266 161442 164351 167682
9138 167682 212672 212328 190109 166104 133812 143396 185797 149834 83296 72270 76956 82722 98502
9125 98502 124073 105197 113292 114041 153169 172876 150576 120246 113449 111721 90152 107160 116732
9112 116732 133118 170301 137182 142676 168738 174352 153286 148286 128023 77976 60920 81116
9100 81116 102701 125610 118157 87945 92243 123636 140718 144291 159970 187238 211116 179393
9088 179393 176615 160156 175722 215296 219535 215148 243878 283312 274924 272843 294503 285076 276100
9075 276100 330388 358152 367031 392734 435497 496553 566238 645327 729421 780209 891088 976887
9063 976887 1102919 1334340 1648655 2044858 2550933 3217967 4072873 5271977 7074464
9054 7074464 10004859 14487771 19897074 23748091 23221217 18267534 12622905 8604541
9046 8604541 6123168 4591263 3556598 2849250 2313445 1908130 1598787 1346355 1165711
9037 1165711 1006085 857411 758874 689965 633907 594474 564732 508612 459274 411145 385491
9026 385491 393026 389950 382868 375740 371496 358736 332123 286176 254438 236290 256311 245004 242132
9013 242132 257326 274093 331300 416868 532768 683024 916809 1097415 1031742 681650 438990
9002 438990 330899 243686 204720 170931 198589 190357 166595 149203 151101 151256 134608 145638
8990 145638 95436 90955 134592 134095 133270 130558 149966 144262 127667 132373 122763 109753 69662
8977 69662 60814 122558 150099 133723 132629 120650 125412 113173 93787 60380 95574 91893 106097
8964 106097 105909 61951 35165 39427 54715 68839 89768 121222 101549 59316 58410 56336 57350
8951 57350 73326 67185 47188 53429 82604 87656 41512 74725 71202 36764 52038 64189 84050
8938 84050 67043 63275 80258 81326 83004 110439 98003 77136 112934 110312 147009 127826 82501
8925 82501 40026 48859 82347 65791 88544 130857 114427 110127 100383 81386 76397 51932 68655
8912 68655 81691 92835 112120 120869 111134 61538 31952 50492 57372 48548 21799 8315 44317
8899 44317 44815 34396 15438 -15750 -6353 4703 6144 24328 40386 59324 94163 100902 58722
8886 58722 55239 96642 87762 42070 27462 23598 39991 64660 73589 47923 41036 33586 20811
8873 20811 27955 23298 30944 16896 -14435 7747 25761 27125 11679 -2348 28178 36555 30343
8860 30343 -3690 -18309 -26380 -3555 7035 -49471 -61616 -31585 -46537 -37698 20031 32034
8848 32034 28147 31869 47603 27913 32149 35047 71567 70375 56909 49124 91454 105338 65244
8835 65244 52391 52722 50194 58127 35248 13856 53589 69922 72519 36099 5172 27784 44688
8822 44688 17451 -793 3894 9254 7885 -2127 8605 9418 39802 72881 50709 6481 8922
8809 8922 -13616 -16669 51613 112994 116924 131081 115370 92142 48736 -8783 7346 5044 67131
8796 67131 94158 84852 86895 37708 -22534 -34589 -29563 -11175 -7526 12660 33435 30091 51501
8783 51501 57123 69705 42532 22219 11869 18421 40253 53206 79857 61862 38106 32246
8771 32246 47710 66509 86649 83835 39568 36385 53840 91389 141939 172068 147880 127985
8759 127985 91163 95922 142370 107506 51203 57810 99736 100211 44225 37051 23523 28485 19051
8746 19051 7592 52674 86946 91011 96091 105462 78965 52801 62133 108966 109442 96176 87771
8733 87771 122132 113440 96115 108555 120118 142256 147901 99387 126968 144923 122663 146936
8721 146936 160668 204798 209186 215838 209100 176843 219396 226238 166229 137039 128180 154725 166840
8708 166840 132661 142211 143873 119112 86982 76055 101749 76485 73923 105107 109067 105156 128798
8695 128798 95325 69693 90165 97302 71986 85904 112610 128792 129712 133037 159888 187592
8683 187592 206329 238055 267733 257349 223972 178121 166504 235342 293415 311441 292491 256075
8671 256075 279787 313029 295434 275767 270602 300922 344752 366732 395729 556166 679064
8660 679064 673655 610363 535700 475192 415789 377346 326818 322407 313710 318760 319581 351083 330269
8647 330269 323320 326988 336976 287810 341193 377650 356921 344458 325747 283675 307927 293368
8635 293368 295486 291887 269974 246301 272995 316936 399851 457817 482115 501505 525108 610461
8623 610461 698822 758359 775403 681205 599630 526995 458634 421341 407465 367970 299799 234822
8611 234822 238333 252552 250263 238203 232087 178917 172557 147345 111193 139367 150015 169255
8599 169255 171226 147912 161082 186189 168111 144571 80513 68626 72407 75477 103973 93964
8587 93964 51483 30560 53606 74161 101942 116929 99416 69728 98059 163377 126551 96177
8575 96177 102372 94623 84448 85600 93341 131445 175808 191823 185476 205584 200166 174106 188156
8562 188156 244982 303503 444234 596492 671164 588067 398700 282000 213414 177800 152637
8551 152637 129184 101621 96899 110413 78356 74093 69500 99700 150460 180316 127862 105620
8539 105620 56003 43849 81473 80718 90304 135781 135531 146233 151256 132205 74226 72388 76722
8526 76722 89277 156827 177979 215558 327980 507425 635068 647606 488159 312892 197589
8515 197589 141959 134546 121882 99498 66023 15513 9318 20481 46185 58966 93572 127459
8503 127459 134241 150022 125376 103829 59977 41513 83771 91895 93448 47509 37870 34074 49494
8490 49494 67202 84366 61387 90174 85844 66026 64177 50986 49018 98470 93407 79640 72215
8477 72215 27298 31448 54179 51300 43944 63394 72962 82387 35431 47192 71600 96975 130403
8464 130403 121945 98233 96170 158284 171580 122296 140112 114815 84626 104395 89981 84448
8452 84448 118831 91414 58598 68011 47903 13813 -18847 16202 52831 100579 104157 76357
8440 76357 48750 39878 69506 92011 84156 133663 157537 113475 73483 72261 68151 9577 -741
8427 -741 34075 47432 45865 62747 70366 55881 84549 82654 32388 51548 68185 49773 65575
8414 65575 76886 77708 45320 4876 35779 69750 68404 45203 63497 106758 167714 204690
8402 204690 150048 104323 125591 122391 73502 44860 -5399 -20726 -24588 -16981 24770 30994
8390 30994 33165 -20762 -73012 -73916 -66597 -16287 -8175 -11152 4009 -401 -11372 25832 58446
8377 58446 51526 41755 12113 55547 108739 113690 82681 40782 45241 32767 52259 56360 70732
8364 70732 56422 45782 50961 58680 96458 99909 54613 -5178 7352 77374 85604 50925 56766
8351 56766 55832 39917 26464 23125 33575 46378 58969 71686 64340 49529 50139 65707 59814
8338 59814 43553 36029 6272 1059 -37943 -77475 -7122 35453 35264 18861 -23148 -28523 -900
8325 -900 50955 45587 28996 59059 79563 64849 24629 1562 -2903 4371 7335 32871 34574
8312 34574 13672 31689 5456 -40305 -40368 20281 49707 31111 24500 25879 -29211 -29681 -7102
8299 -7102 5997 31507 52288 43338 62837 34706 12073 926 38541 31791 14413 -322
8287 -322 13299 69566 66445 60305 79505 30338 -41912 -66809 -24661 15182 -2087 -21324 -11223
8274 -11223 14807 -8985 4145 36381 80339 46610 -4500 23624 72771 89021 36996 28426
8262 28426 25150 39968 25376 -3635 9720 21869 34233 58017 20800 -53903 -37864 -57396
8250 -57396 -45069 -33688 -17166 -19516 -60459 -48051 11745 35983 15440 -10387 2422 -12629
8238 -12629 -18832 -4492 26572 35638 528 3715 14915 56387 30397 -21521 -19654 -2006 10794
8225 10794 1236 7067 17792 15688 18846 29177 35877 41902 1126 -73445 -117646 -77146 -30231
8212 -30231 -37949 -21797 -18356 23482 32937 49417 59453 8864 -40259 -45388 -31461 -11512 -29688
8199 -29688 3034 48050 65937 39770 -11479 -8901 4721 -23778 17145 18711 8614 -21719
8187 -21719 -28594 -28861 -6116 3425 -8379 -32194 -28666 13554 72425 91493 70723 73338 67246
8174 67246 87785 72094 10324 21043 77317 82468 32777 38573 9780 8174 28567 29306 23190
8161 23190 25997 30009 36639 41598 51944 47417 24831 -2458 884 35430 37612 26127 18764
8148 18764 949 19371 25646 26223 27986 -2132 42797 43495 -7195 -45976 -58841 -73486 -40946
8135 -40946 -45463 -50806 -49117 -87212 -23949 28777 69526 38341 -26726 -33302 -9430 9231 11872
8122 11872 539 -51278 -59385 -14183 -304 5890 -117 -40981 -50747 -3974 17452 66601 43425
8109 43425 2239 -35989 -26755 428 -6719 14953 -9886 -15168 3712 5046 14854 16434 -2341
8096 -2341 21043 17649 -9422 -45037 -67808 -55007 -8593 11438 31976 48478 71250 102657
8084 102657 78340 48804 45880 61679 78648 84050 89834 108932 82662 57142 124755 140867
8072 140867 131715 153816 207718 242990 274573 326941 364525 348702 331271 335948 321329 334446
8060 334446 330860 347454 358988 302417 250984 264434 269268 210505 190012 203311 215110 224319
8048 224319 212391 180536 144691 140259 170939 183124 201479 229958 217036 160234 170729 203891
8036 203891 209986 234495 241447 268382 284492 291492 383675 549167 694544 809574 940489
8025 940489 1072475 1074059 952925 776227 644921 536734 495813 602561 731582 887855
8015 887855 1038576 1173595 1152189 929533 620690 405131 351507 346253 309809 280631 222278
8004 222278 214398 182243 128059 147950 146183 117444 112872 123349 111169 176078 232839 225353
7992 225353 239587 249767 235943 247876 263854 286685 338338 442127 535760 581435 634893
7981 634893 672497 682493 657854 656404 678552 689259 751545 868865 987397 998381 925927 732777
7969 732777 538512 412284 285351 264419 244678 174336 117719 116697 117608 157327 174932 116479
7957 116479 81519 62989 52555 26992 45189 62228 47594 61131 80788 108298 113138 153267
7945 153267 167677 143424 115955 91399 113231 135370 138343 174173 211886 174501 139375 146507
7933 146507 123462 145735 193262 198671 194464 186512 168542 157567 106072 39396 14597 11124
7921 11124 -19301 -6379 -5613 -32619 -53073 6576 85832 110694 77400 12432 -146 -24666
7909 -24666 -9191 17147 48812 24588 14321 19519 29726 -997 -12290 629 8309 26873
7897 26873 37449 47840 40233 5030 -7612 -28992 -55145 -50967 -42129 -49999 -104972 -72357 -61892
7884 -61892 -2871 25206 -56665 -74450 -31021 -1405 21428 22132 -8160 -24763 -4144 7428
7872 7428 -5678 -2913 -5902 31126 66065 18002 29428 27335 30613 87092 77640 57877 58632
7859 58632 41572 33809 5794 -34654 -28292 -31882 -8202 91 -38194 -62653 -10992 13410 -23907
7846 -23907 -31076 -64654 -111679 -79312 -79947 -56179 -56031 -37922 -16542 -18059 495 -25263 -24664
7833 -24664 7134 31920 39001 41200 53546 31059 -9830 -9423 -10839 13769 45493 70492 35636
7820 35636 -6236 -16351 -3783 20191 -36256 -91052 -64617 -31655 16139 51132 65401 55426
7808 55426 47558 36842 51185 34603 -4386 -57224 -44694 23333 30519 5029 29164 66419
7796 66419 20701 9127 46949 53675 11288 46274 29325 22715 35213 27801 -11417 -31709
7784 -31709 3530 17424 18789 13725 -3290 -20368 -46940 -54839 -14293 -8496 19807 31408 2819
7771 2819 294 23204 -11544 -14545 -289 18655 38802 19212 -25389 -30930 1912 1809 -14897
7758 -14897 -17987 5395 23230 63516 81413 31055 13666 -7340 12887 -19278 -54423 -31989
7746 -31989 8491 6598 19039 23274 7967 13895 14153 28112 -4019 -15260 -11385 -44014 -24485
7733 -24485 -2863 -5167 -27786 -25251 -30052 -36834 -44634 -50301 -14231 935 -10041 4772 -8882
7720 -8882 -7744 -6414 25643 29414 -2534 -31039 -19983 -7002 -23192 -43577 -11325 16236 16375
7707 16375 -24569 5153 49324 28443 18756 9317 2397 20954 9380 -2858 -14430 -21617 -30924
7694 -30924 -72016 -133955 -130526 -85689 -73690 -37747 -14586 -55458 -80656 -49522 -23132 -46625
7682 -46625 -47349 -27954 -31238 1407 27689 26847 45134 47514 42401 25910 7531 -3313 -12053
7669 -12053 -11917 -18041 -26540 -12260 -14721 -18496 -25809 -30311 -49392 -81511 -56062 -51795 -5224 -6731
7655 -6731 -45086 -19847 -29081 -56096 -33979 -27145 -10437 10575 13403 73922 91198 43945 29596
7642 29596 -7784 -597 -25518 -51479 -76651 -129814 -149098 -93336 -23498 -5338 26411 15257
7630 15257 -35056 27976 59261 22030 -24238 -25279 -8606 -42243 -73233 -107414 -77283 -73704
7618 -73704 -105500 -130965 -131116 -109468 -45551 -47581 -33777 -43481 -65437 -44679 -44295 -53293 -85547
7605 -85547 -103636 -102552 -58668 -9845 -9201 -21178 -10360 -19653 -2473 10237 9720 15761 11536
7592 11536 -30496 -15880 -15150 -16273 3298 -45474 -57085 -42881 -38046 -37099 -27029 -19125 3606
7579 3606 -2717 5993 -37461 -6468 -629 -3924 -18626 -26810 -1233 13691 -1182 4046 8355
7566 8355 -2138 -44591 -29119 -26425 -19020 -20495 -2104 9966 -1437 6577 25636 -9238 -81018
7553 -81018 -80730 -47505 -22084 -6474 -26905 -42034 -36250 -3962 22449 23794 -18194 -44740 -62071
7540 -62071 -83451 -78220 -54660 -87939 -109341 -55552 -30014 -33180 -51693 -70905 -80969 -79480
7528 -79480 -38625 -40096 -38633 -3950 2268 -5460 7360 -46641 -73349 -60889 -49087 -56029 -38675
7515 -38675 29800 51012 65657 36909 30788 -4200 21891 53287 30573 -9892 -32787 -25073
7503 -25073 24729 15295 9675 19540 -1967 -38689 -9609 9242 -30468 -30956 -22124 -24837 5922
7490 5922 1168 32936 36485 -2335 -22871 -56815 -70392 -25687 -3949 -15251 -33051 -4195
7478 -4195 8674 12324 -45317 -35063 11743 24426 -2943 -31361 -43042 -33057 7705 31091
7466 31091 34421 48570 22198 -4303 25199 18821 42337 51115 16185 -325 -26307 -11977
7454 -11977 23601 -6345 -66742 -89832 -97273 -61425 -68645 -64417 -42074 -43009 -88120 -119467 -101863
7441 -101863 -107526 -67520 -61549 -92450 -85399 -98774 -102922 -98791 -75547 -32853 19280 34898 -3475
7428 -3475 -13525 3634 -11729 -51820 -57705 -18494 2657 -11886 -27259 -14759 -23203 -75225
7416 -75225 -105051 -128739 -81689 -66788 -64523 -77558 -94619 -121590 -97526 -19561 13417 5430
7404 5430 -23984 -45176 -72456 -37809 -35089 -23247 30707 29258 5909 -17730 3067 6501 -14754
7391 -14754 -35356 -49772 -51758 -46131 -22130 -58676 -70003 -75344 -75905 -24728 22729 -57 -20433
7378 -20433 -18886 -12997 -11100 -12119 -7255 -17913 -32837 -20349 34743 58242 53333 31904 8483
7365 8483 32035 36096 -14405 -42425 -50091 -1586 -23506 -38448 -52089 -79229 -45371 21573
7353 21573 -12975 -55083 -55883 -70307 -45734 -28854 -21161 -22889 -44365 -47764 -42735 -17729 -1026
7340 -1026 -6679 19550 8218 -19870 -4099 5481 4450 13780 -2960 -2300 22596 52954 47549
7327 47549 29365 24307 -113 17128 39686 35660 -1649 38941 45901 30353 11972 23580
7315 23580 26149 2478 -38371 -45261 -47469 -33431 -12756 -5139 -19366 -18023 -20711 -38133 -16005
7302 -16005 -12422 -10427 -5119 -21325 -7576 -9836 -17461 -12832 -55916 -84445 -56193 -13106 -29421
7289 -29421 -40086 8289 11821 -20207 -26378 -36184 -63133 -67489 -41179 8454 -3051 -25022 -53095
7276 -53095 -55439 -47344 -37928 -9105 -5434 -16729 -8225 -7389 -37812 -87624 -83372 -77869 -61329 -29008
7262 -29008 -45693 -71960 -114251 -71156 -66742 -87682 -84461 -67964 -16049 8226 -4889 -7481
7250 -7481 -18663 -19640 -32314 -15476 25683 45596 64704 49925 -15537 -53674 -52496 -32738 -24525
7237 -24525 -15316 -23908 -35254 -13330 -33209 -73363 -65503 -30759 -19 -40488 -75488 -46938
7225 -46938 -26954 2391 17106 2354 -7812 -7309 -1005 2670 -32324 -43872 -32355 -26333 13874
7212 13874 3059 -17666 -41208 -32655 -22393 -19409 3263 15122 -20500 -42453 -53870 -35668
7200 -35668 22864 78348 95533 75930 24728 -23957 -66443 -81351 -54914 -44353 -75730 -94366
7188 -94366 -124476 -122072 -135191 -136889 -95882 -60225 -3339 2387 282 48450 58502 22936 24863
7175 24863 27155 180 -27871 -45886 -59155 -55486 -2653 29082 18222 8065 10597 6554 329
7162 329 -23783 -33000 -10317 -21508 -70275 -71567 -38882 -29593 -35970 4285 12958 23485 45600
7149 45600 51970 46934 41879 58427 12105 5478 -11871 -19071 -9049 -13520 -18331 -16864 -2185
7136 -2185 -23408 -37072 -38718 -35909 11604 337 13623 22348 26099 -6570 -19014 -1738 2804
7123 2804 -18080 5440 8081 -48230 -76674 -31919 -7204 -41750 -27537 -30375 -49757 -23498
7111 -23498 8762 38221 40321 23554 37525 36636 38090 21188 -8007 20443 19190 11140 15814
7098 15814 41501 23182 14188 10569 -12484 -51044 -61853 -51495 -7125 19097 -25024 -21774
7086 -21774 -72387 -75221 -55588 -24333 -1482 25206 45250 34050 31808 47043 38544 43301 20436
7073 20436 16804 2267 17749 35865 -9836 -8653 13951 16657 -26127 -58733 -43011 -12497
7061 -12497 32461 51447 59376 31652 35238 73103 63889 49019 44933 46741 53063 29090 42691
7048 42691 5816 6290 -13011 8559 7596 -2021 17400 30014 9330 2041 -13354 -12394 11522
7035 11522 15086 -27525 -45085 -56213 -74772 -48878 13252 34561 29301 683 -18148 -25955
7023 -25955 -49923 -33598 -40294 -73336 -91421 -80385 -46641 2625 -26114 -51079 -37791 -21905
7011 -21905 -32033 -58192 -85996 -63709 4314 -15461 -12822 2399 -1811 5020 -11681 -47319
6999 -47319 -54518 -52423 -65270 -54339 -53750 -27144 -150 2793 8092 25442 8608 10249 1032
6986 1032 -7089 8128 19818 3586 -9877 -26585 -18998 -16820 -10386 -33676 -48982 -25647 -20241
6973 -20241 -1617 -5521 178 -50540 -85548 -8241 -2315 -23443 2666 -14379 -31597 -37093 -24202
6960 -24202 -17846 -26412 -37600 5696 27464 -13770 -44648 -54268 -59082 -70334 -82276 -66510 -54567
6947 -54567 -7825 34541 33019 -8962 -7177 7828 12489 16071 35666 26172 26204 16886 22480 41774
6933 41774 40825 24650 71885 92523 66877 18091 -8013 -12581 11517 7144 -23232 2150 44356
6920 44356 56859 50937 41741 33634 54143 59615 65775 58473 -12941 -54710 -84211 -87531 -84209
6907 -84209 -61066 -5049 43382 43919 31444 26726 24060 -4578 -55277 -68515 -50972 -48079 -20016
6894 -20016 29421 33376 9244 1293 -12020 -12551 41929 71850 -778 -21077 -17598 -18490 -26864
6881 -26864 -32267 -69089 -63207 -56990 -60944 -95689 -96228 -93500 -71642 -61119 -112156 -85935 -84177
6868 -84177 -80517 -59735 1566 651 -4220 -19728 5843 13103 6252 -23097 -20288 -7384 -18327
6855 -18327 -9107 -47328 -16551 -12880 -38480 -16112 -25086 -27320 -16923 -43903 -53185 -41479 -9262
6842 -9262 -39281 -53849 -71785 -86961 -51883 -39346 -26967 -65957 -63857 -21333 28038 14296
6830 14296 -2572 -6874 -18284 -23544 -17391 3912 49246 42375 22961 -16199 -8741 10360 29700
6817 29700 53413 11274 16582 40968 31315 18298 52638 86180 95605 55480 62608 97311 87787
6804 87787 42628 53522 54456 48092 19323 -29806 -5242 3993 -36965 -10266 37427 -1489 -56412
6791 -56412 -60033 -49775 3932 29821 14495 -21875 -17041 20411 33029 274 -11934 40
6779 40 24676 37407 20108 -1445 12756 6854 -23186 -18222 8236 14080 -8641 12633 27222
6766 27222 4152 11763 17187 -11305 18558 15918 -362 -12468 1950 2049 33166 27118 18693
6753 18693 10061 37893 67377 93277 85582 23483 12289 29152 88431 83445 49841 29730
6741 29730 10964 17177 10202 33849 22293 19159 12723 33338 15807 -5433 -46986 -75669 -77077
6728 -77077 -63449 -14661 15295 52641 58495 64727 78495 69156 69746 58130 58576 20301 -32914
6715 -32914 -20932 28994 35148 -20108 -47636 -30679 -52220 -52009 -48103 -50926 -50387 -32957 7214
6702 7214 8028 -37646 -64600 -71228 -54343 -29618 26421 44437 12169 27444 4109 19 7545
6689 7545 44577 53098 3940 13894 4428 3597 7282 488 -30301 -19355 -4307 -8662 -11549 -40321
6675 -40321 -59956 -47426 -38856 -9905 -7000 -3508 14687 3552 -10164 -14208 -8042 -21805 -52628
6662 -52628 -68482 -75733 -17469 3444 22946 51229 49852 -685 -46667 -57005 -56436 -75540 -74689
6649 -74689 -73751 -57691 -15255 -9489 -8615 -7474 -46648 -49380 8935 43931 67505 21184 5086
6636 5086 -11271 11276 20516 -967 -32646 -53960 -92730 -58506 -15127 20450 -8543 -36089
6624 -36089 222 58264 8161 -48255 -90463 -45361 -3826 -2722 7467 4994 20712 17108
6612 17108 24881 27134 54325 39572 19665 -9639 -50740 -2505 31377 20682 7525 -18064
6600 -18064 -44052 -71986 -80392 -62735 -31655 -8092 9848 -27015 -37602 -2574 61719 59703
6588 59703 19476 4306 9146 23549 32623 -926 -5435 21355 26654 26494 23873 61617 48385
6575 48385 24557 4707 855 -18077 4560 37947 27998 15391 17266 16011 -6419 -36078 -33772
6562 -33772 -43653 -24983 3393 -8007 -80758 -111799 -76354 -53064 -55277 -44929 -57676 -45093
6550 -45093 -30247 -50474 -57360 -61427 -74421 -45931 -37029 -9886 10689 31925 21248 -3884
6538 -3884 -13346 7816 -10914 -31929 -40540 -41803 3900 -2674 -9786 8311 66228 40877 -2931
6525 -2931 11365 36883 13256 2446 -16925 -16365 12975 18513 18801 23476 25041 12143 20127 38277
6511 38277 26242 -12396 -35410 -50787 -16713 44757 13822 -27500 -37229 -49678 -62786 -89565
6499 -89565 -110618 -85452 -34884 12328 -13218 -2914 35002 -11339 -67493 -63646 -48168 -10187
6487 -10187 -35109 -50578 -83831 -76031 -37382 -27499 -44022 -19418 8533 -18475 508 -4645
6475 -4645 15190 26964 18663 26604 -24393 -65856 -9587 27146 22510 -23611 -56375 -85562 -33901
6462 -33901 -60485 -97717 -53724 -53544 -40312 -15159 -23007 -38104 -41196 4289 37493 54362 9409
6449 9409 -21069 -29789 -41822 -41861 -30427 -25591 -45576 -55965 -47269 2837 1143 -32492 -61878
6436 -61878 -77215 -46129 -54937 -31514 737 21467 -17137 -27568 -24614 20509 86793 110188
6424 110188 63562 24451 41191 -10537 -45167 -42192 -52200 -54232 -51133 -53952 -73588 -51334
6412 -51334 7642 22714 19871 -12182 -41354 -66495 -57716 -75971 -20610 -23810 -3800 46128
6400 46128 72229 61277 31347 25857 57125 24118 -41250 -53471 -77437 -110641 -65612 -32670
6388 -32670 -3219 3740 -33620 -37301 -6885 -13048 -23497 19452 -12284 -13110 -36963 -51257 -30297
6375 -30297 -46682 -53506 -66698 -77143 -88565 -102001 -99167 -75250 -42395 -28168 -25238 -24884 -40039
6362 -40039 -93265 -99342 -46107 -2298 12865 10571 -1492 -12447 -31501 -7710 -16920 -8291 -22583
6349 -22583 -55442 -79912 -67185 -33106 -24427 -17797 -63775 -55176 -23135 25730 68927 18366
6337 18366 5106 33611 31150 18420 6363 31664 74198 89522 74244 4726 -41711 -19164
6325 -19164 -25328 -12147 -23279 -34163 -36737 -24008 -17549 -29914 -25967 -31601 -39753 -9319 60534
6312 60534 65944 76601 44350 7115 -19240 -26958 -38914 -13800 7897 3906 -14229 -10846 -5512
6299 -5512 512 10540 -10236 8516 8665 30631 12792 15733 28815 -1751 -21270 -30054 -59061
6286 -59061 -53461 12015 -2964 -43349 -23111 -26951 -26545 -5112 7964 -16107 -69304 -70891 -38399
6273 -38399 -47084 -59475 -52202 -14063 15572 24050 69551 61473 27003 -4658 14254 -14862 -22154
6260 -22154 39203 40144 66067 82985 57916 3403 -22872 -55761 -53658 -45641 -41309 -30550 -1864
6247 -1864 15060 13394 20827 26007 1217 9961 43283 69500 42653 -17499 -31618 -24105 -17254
6234 -17254 -55866 -85182 -89835 -72328 -36140 -16109 -25626 -25869 7881 58297 49113 56764 34448
6221 34448 34371 63561 36622 -17238 -20183 -7043 30349 43320 13869 20605 -6891 -18312 10597
6208 10597 18153 -54808 -84361 -85396 -48359 -70722 -67609 -40187 21046 53328 63932 89184
6196 89184 69967 247 -32031 -58305 -74489 -33277 21073 11257 11545 16202 898 -16937 5917
6183 5917 13871 7521 -19247 -27233 -15363 -9114 -34663 -47760 -66019 -84041 -99705 -77422 -53029
6170 -53029 -11035 -31996 -11556 -11494 -31961 -52720 2931 12531 56543 76853 76379 74173 43562
6157 43562 13480 -7514 -12563 -28516 -64721 -49805 -38606 -64838 -85319 -96359 -101924 -67850
6145 -67850 -36152 11476 23802 19276 -1891 13545 41050 3169 -24599 5345 21743 27878
6133 27878 24156 38741 52618 27115 29547 20996 2124 -3155 -18242 4261 -16519 -20191 -29565
6120 -29565 6429 8899 -44127 -27697 16920 23146 26610 -61438 -115701 -115048 -86956 -42682 -49797
6107 -49797 -55460 -13690 -38998 -75490 -100674 -51111 35107 41097 44991 20370 -22554 -21509 6705
6094 6705 -14067 -20794 -43303 -64221 -38625 -54704 -15754 34252 16178 18432 22044 -8819 -10824
6081 -10824 -39266 -82580 -117401 -75893 -69882 -57562 4340 -12871 -29698 -10063 15005 27357
6069 27357 51514 33314 25290 -13209 -6302 -2145 -45490 -58011 -21877 -3458 -22470 -45014
6057 -45014 -67902 -36807 30299 111581 79725 76095 13552 -51159 -15550 2917 -24444 -26305
6045 -26305 15216 71278 28958 16164 11866 -5831 -45831 -57557 -76701 -73404 -75964 -35426
6033 -35426 51166 52530 14497 17204 8028 17691 48649 79362 67499 38744 20073 -5374 -891
6020 -891 6581 -5115 -27640 -26896 1996 23288 31420 -25032 8888 -14601 -3313 -14263 -69717
6007 -69717 -65394 -52283 -58223 -98395 -53477 -14652 -36830 -48244 -111123 -73204 -38511 -40623
5995 -40623 -34161 -29939 -17318 -6480 6480 -558 -14777 -30641 -73533 -89864 -67190 -70224 -73303
5982 -73303 -73415 -39071 36545 46439 15811 29141 20410 9539 -2437 4265 38509 46766 18247
5969 18247 23294 26345 -5919 -24987 -53421 -70097 -48741 17895 23463 35483 39290 26828 10985
5956 10985 -13137 12930 26062 18412 5971 -8829 -12154 -25815 -33599 -22097 13203 39623
5944 39623 31462 -13003 -30207 -33300 -42711 -21237 -6477 -11993 9056 50629 45391 39051 13859
5931 13859 15369 22700 60406 64299 38146 36538 11305 -4 -15434 -110 1007 16227 21901
5918 21901 17639 40215 35805 13676 18971 -21311 -28178 6978 61941 34699 -25285 -34114 18499
5905 18499 12518 -4423 2874 -415 10905 -22458 -9211 25591 31534 6875 -24386 -20092 21549
5892 21549 64530 51975 16238 32861 87333 63577 34346 45302 68732 61726 58451 69201
5880 69201 91341 56002 -3864 -4311 10422 -26883 -34930 -3548 -12298 -10315 -5164 2897 39088
5867 39088 26494 -13063 -35210 -26079 -8292 -7188 -41087 -23996 -19670 -21309 -42054 -40208 -11493
5854 -11493 2527 -4008 -12250 -41514 -70305 -83148 -56811 -6951 22040 5179 -43758 -51001
5842 -51001 -49785 -355 26030 13456 -13516 -40855 -41571 -50137 -35229 12012 14773 858 -34510
5829 -34510 -46154 -69138 -110483 -99293 -80759 -80686 -87228 -57946 -33485 -26905 -16942 1608 31331
5816 31331 14521 47962 60939 51563 -6918 -48045 -54029 -61392 -51104 -758 -25397 -42116
5804 -42116 -24879 -33788 -13011 -20834 -74736 -28099 19217 40649 3614 -22097 -25934 -7123
5792 -7123 14570 5465 -2188 1387 -22206 -30433 -3040 -18741 8098 -8454 -43193 -70755 -9627
5779 -9627 31906 19628 2147 -2482 28787 44356 45637 33144 35588 14149 28262 -12777 -72703
5766 -72703 -35204 -36321 -25261 12403 8260 -86142 -110219 -114602 -88850 -69945 -72989 -43190 -21745
5753 -21745 9166 -15911 -53127 -66670 -74798 -63940 -60426 -64340 -48521 -47712 -42604 -81257 -56356
5740 -56356 3687 16859 11508 23796 17146 46255 32277 13509 -603 -4359 -12563 -26369 -63773
5727 -63773 -49202 -28355 -24562 -38643 -41540 -1824 28122 37773 5197 -21679 -23404 -70008 -59291
5714 -59291 -50599 -24701 -18523 -28290 -11441 -431 3329 -29195 -18684 -21451 -30349 -9593 -7496
5701 -7496 1570 2372 11610 12577 5296 19379 30597 19610 22789 -3716 -25494 1761 27309 16945
5687 16945 -39350 -68647 -87608 -76387 -30597 15856 33551 -1451 9715 30328 7638 -5984
5675 -5984 -37330 -40634 -67997 -59196 -56857 -20891 -25414 -73862 -49660 -71022 -76588 -72458 -34270
5662 -34270 7233 9697 28018 29340 15288 24872 28527 21231 31861 30729 -7552 3001 -41518
5649 -41518 -68879 -49935 -35872 -21348 -32649 -33471 -33341 -40543 -5659 330 -35323 -38674 -15252
5636 -15252 -2273 -7284 36839 40145 29714 25946 25648 44901 34642 3000 37882 32766 5906
5623 5906 38883 52758 17367 -29466 -39394 -13312 4549 -4949 7185 28161 25903 18495 37027
5610 37027 31966 -4331 330 21445 -17391 -57137 -8216 -1638 -42109 -39915 -3033 -1355 -40159
5597 -40159 -34434 4491 -26898 -30133 -3414 -4200 -7005 245 -1899 -12791 -82302 -70718 -26177
5584 -26177 -17789 -54756 -117289 -118953 -81443 -62686 -98213 -65529 -48576 -41542 -41139 15216 57462
5571 57462 12019 -49853 -104372 -71656 -19199 -14308 -43267 -40229 -19319 -8764 -6214 -806 2567
5558 2567 -13738 -14834 10584 -12273 -23703 -15319 -34373 8085 26663 4552 -43861 -71052
5546 -71052 -61414 -49155 -27375 -40973 -53244 -58674 -42550 2447 1568 -13001 14797 35363 44004
5533 44004 44783 59734 47656 4018 -16511 -12985 -17852 -33920 -72617 -46969 -48193 -36334 -20457
5520 -20457 -53361 -18038 11697 20339 10070 -16562 -12672 14452 22253 1283 -4542 24916 37871
5507 37871 18038 -31321 -40328 -9693 -31119 -23133 -15357 -8527 11017 33538 30935 12482 -21016
5494 -21016 -34533 12859 38502 30906 26427 5794 -14711 -53488 -99270 -56892 -28170 -55804
5482 -55804 -42316 -1012 3631 -47236 -66494 -32624 -4526 -56988 -65916 6496 71543 47698
5470 47698 24930 -19545 -24356 7420 19658 25567 -4614 -17810 -17568 -53063 -86169 -71563 -42764
5457 -42764 -26865 -15673 -45416 -17724 3788 28155 54874 28280 36730 49751 77063 46191
5445 46191 25620 6774 -15372 -11146 -12732 -61353 -41636 -21111 -48427 -60461 -58414 -35731
5433 -35731 11666 42341 44132 45396 54751 68308 40711 -39150 -48595 14333 76178 83425 86035
5420 86035 84673 32031 34011 4713 18278 40694 51178 42870 15717 -10973 -42911 -43458 -45085
5407 -45085 -37756 -20246 -4963 19537 41023 17620 34472 42653 40108 49801 51163 -12794 -15927
5394 -15927 6202 -3406 -9954 -12041 -34338 -55769 -55865 -16927 3287 -10952 -41730 -91744 -79449
5381 -79449 -80438 -78837 -67028 -47264 -78746 -97790 -96021 -73874 -33768 -38971 -45798 -35234 15222
5368 15222 6502 -20779 -21886 -31469 -21547 -31991 -12792 -45808 -87079 -58092 -38777 -6049 1953
5355 1953 -47544 -32914 -3764 5577 7866 -6967 -22955 -4259 3840 31081 39029 32006 -26671
5342 -26671 -55933 -27489 -14350 3592 -9037 -46746 -24201 261 5930 45150 59216 40408
5330 40408 10307 -1151 9654 20749 -29485 -49509 -54586 -8156 19067 -9015 -13905 -11418
5318 -11418 -17243 14640 73857 66847 71410 13913 -39602 -36294 -47292 -51578 -22611 9262 -21529
5305 -21529 -31631 -7511 34893 66840 19562 1887 -2078 10617 13102 12477 6325 -22728 -26601
5292 -26601 -16347 -14662 -14137 -54132 -58873 -67548 -73198 -86186 -76529 -46456 -24837 -39615 -32993
5279 -32993 -45704 -35490 -38794 -64038 -76009 -57437 -34812 -8718 -19546 -46584 -31235 9809
5267 9809 39048 30258 6698 -39041 -32317 -46328 -62597 -83588 -75041 -69671 -21821 -62020 -42991
5254 -42991 -8806 -34984 -21046 -7640 -7714 -5708 15610 6219 6570 -11744 -48348 -71803 -50485
5241 -50485 -32650 -2618 8092 10872 -167 -31953 -63102 -41848 -12731 -33033 -24989 -11014
5229 -11014 3825 -5877 -1748 -52103 -37372 -43510 -23885 50038 39526 45718 78728 63243 6384
5216 6384 -32939 -20796 -25089 -19348 9759 33955 -12254 -49295 -45386 -9863 48288 45199 20708
5203 20708 -38636 -103782 -125305 -138571 -122729 -74554 -51237 -60669 5291 -9707 -5974 18179
5191 18179 23908 12544 43000 49437 29641 9119 23183 214 -47325 -37129 -44628 -41761 -13809
5178 -13809 -934 -8061 -9865 17204 5739 13759 -15952 -69007 -31934 -19042 -47610 -22272
5166 -22272 -12503 -32432 -40358 -4792 55780 82489 99625 75392 86015 100823 88066 66576
5154 66576 31347 12154 -22423 -26537 -14011 -32020 -96349 -111359 -77417 -57910 -65803 -49135
5142 -49135 -50846 -11412 -8550 27770 26493 4010 -23407 -6450 46688 36764 12827 39333 79346
5129 79346 100539 90855 66887 58197 35296 26382 32007 48032 75249 43730 18005 -15479 -8948
5116 -8948 20451 22283 -52218 -91984 -57933 -63689 -18798 7141 2565 -4406 -18136 9051 45881
5103 45881 17406 -50419 -71150 -33223 27005 79937 76400 13988 -7047 -16302 -11553 -12292 -28883
5090 -28883 -40956 -29882 -28882 -26441 5283 24376 38484 27364 -15577 -48532 -67250 -31570
5078 -31570 -20195 -9232 -48582 -62014 -13473 16690 25350 37854 43961 5907 -39291 -20537
5066 -20537 -5973 1257 -1905 -7061 -6430 -45910 -27338 18753 59587 60422 26109 4042 -14538
5053 -14538 -7983 24803 20107 8007 6590 5441 -8909 14495 27885 40575 12783 -26812 -49682
5040 -49682 -35449 -31587 -29887 -18567 -7926 -4728 -31606 -89604 -101574 -79045 -68162 -18817
5028 -18817 -393 37570 38859 4169 -6046 -17051 -9160 1072 43791 40519 14438 -7210
5016 -7210 -74671 -60537 -48865 -25102 -31579 -39059 -23792 -5048 25084 39809 17441 22430 8517
5003 8517 -1845 16898 24928 18992 -1186 -19109 -39641 -11521 -8612 -7328 47395 53006 26129
4990 26129 -2889 -3869 12790 40157 58143 5266 -24341 -13984 -47637 -38873 -28731 -10483
4978 -10483 29286 42239 82133 108018 115211 50934 17693 -17762 -68812 -91900 -86088 -22293
4966 -22293 34230 28890 33618 -4613 -46859 -72175 -62099 -26365 -8490 -41643 -57182 -57878 -19344
4953 -19344 11268 2424 13766 -5447 2205 33416 60417 45588 4883 -28993 -27084 -16234
4941 -16234 9898 -3888 11579 33208 87685 64973 12870 -15577 -48176 -47792 1954 36179
4929 36179 37573 13181 -5171 -10594 -40174 -90239 -107148 -31169 24045 17902 -34927 -7927
4917 -7927 -4576 6602 19812 5075 -38717 -32081 -27517 -20367 16582 -771 -22961 -44574 -115834
4904 -115834 -124703 -70692 -39641 -39479 -23449 -17414 -20113 -13164 -21545 -32294 -3442 18020 14663
4891 14663 18581 5351 -12034 -59251 -50957 -40981 -46624 -89674 -118344 -69168 -45682 -11711 48491
4878 48491 38209 42983 40283 34663 22385 -13723 -16504 -28143 -41492 19900 33648 14768 4330
4865 4330 8853 -18494 -60638 -48976 -37313 12826 52454 65738 45536 2958 5169 28967
4853 28967 17817 23931 -4112 -74495 -42423 17782 23535 -6674 21676 59650 64006 8188
4841 8188 -14388 27204 31564 19917 16494 449 -14507 -7934 23957 23102 1460 -45712 -36455
4828 -36455 12677 40141 22792 29501 31506 -10133 -54566 -51861 -446 18895 21432 27536 14237
4815 14237 -5720 -75398 -65750 -33818 -26596 -669 30448 52423 13059 -20210 -49582 -71899
4803 -71899 -39574 -24049 -35635 4025 16722 48688 54464 50366 50198 32601 39317 21387 3340
4790 3340 -1229 13477 -7703 -29194 -2464 38169 67292 68823 39627 312 13707 63773
4778 63773 47535 11116 -633 -29569 -25817 -40047 -17692 16643 33007 54950 27798 13759
4766 13759 20945 70468 85532 63510 37429 4058 -4599 19153 -1401 -34370 -22405 -17841
4754 -17841 -30552 -10419 7514 -17395 -52124 -13121 33164 56037 60337 70437 52052 11539
4742 11539 -44729 -51743 -3495 10529 3083 -12458 1772 13277 -2892 -34196 15433 48024
4730 48024 50138 28309 -2541 -28731 -28813 7846 16531 3381 16192 69719 46159 42764 -19431
4717 -19431 -53821 -45200 -27116 -1287 -4856 10594 -16546 -42645 -17686 18464 11838 5981 915
4704 915 -55145 -100614 -82797 -50679 5051 32433 -44313 -122583 -120260 -51807 -51547 -32136 -55197
4691 -55197 -53954 -26773 -599 36551 49154 11358 -25328 -62338 -36202 -521 1847 170
4679 170 642 21489 -12129 -45236 -61916 -86486 -54075 -47464 -75320 -11865 41315 48600 21599
4666 21599 19147 68124 67506 12295 -7107 -8956 8642 24253 -6088 -15806 -15519 -22958 -18096 -20181
4652 -20181 -8749 16140 31582 24420 11736 -10548 5857 22889 37127 10705 -26523 -35266
4640 -35266 -7999 46250 80075 55878 5268 37995 58336 45810 38993 2389 -77387 -81117
4628 -81117 -68465 -24005 18268 -15709 -8805 49391 30936 1221 -18288 -40958 -57306 -35318
4616 -35318 14724 6820 18044 41286 58181 49226 43694 40395 38531 29456 50761 50009 4425
4603 4425 12742 11988 28419 25515 -14171 -33650 -62459 -52668 -14587 -11470 -24232 -7952 1342
4590 1342 14211 28719 15193 18860 -15624 -50382 -72784 -44446 -33224 -25061 -4268 -5208 -12888
4577 -12888 -6606 -3802 -10657 -15246 -7911 6009 -270 -20388 -15439 -16843 -34994 -57785 3142
4564 3142 22232 -32373 -25787 -37974 -64050 -69726 -38354 33307 59085 41832 52872 65559
4552 65559 29325 3016 1060 -10499 -20462 -23475 -39030 -8663 49018 66838 82446 57647
4540 57647 43510 44467 2235 -18194 -28865 -24117 28795 37233 29652 47100 79711 65289 19594
4527 19594 7224 12113 -7385 3922 9062 927 32962 33902 5628 18704 -8813 -13893 -46757
4514 -46757 -30999 -12334 -25854 -50857 -29433 -31426 -13849 -2327 1121 13213 -9776 -32553
4502 -32553 -24425 -24678 -26811 -59682 -45810 -56898 -63500 -53185 -50962 3289 7611 -7597 19810
4489 19810 822 -6503 -14903 -29832 -45615 -21491 -5433 10182 -17885 -30123 -34978 -31338 -11325
4476 -11325 -46144 -52434 -20857 351 4168 19406 42628 90363 121982 61924 49275 52847
4464 52847 36706 91045 118586 107968 70092 4883 -26670 -48849 -59562 -19439 -8963 -1442
4452 -1442 -8936 28060 78460 74176 73654 26605 14300 19275 -15191 -34584 -43369 -38231 -52700
4439 -52700 -28980 -15737 -36421 -62927 -59369 -32152 4146 12260 16509 47812 38370 3351 -4771
4426 -4771 -13142 -44074 -45308 -21393 -20048 -71876 -32095 21282 28461 -18778 -36899 -39790 -2644
4413 -2644 11310 -3562 -26490 -8003 109 37050 48255 26757 32059 -26591 -33044 -33278 -49808
4400 -49808 -57215 -75176 -53739 23343 91662 47191 33600 5072 8358 32896 26361 20253 -2646
4387 -2646 17120 1500 -38264 -37378 -4535 12430 -13798 21085 74313 30370 17592 50645
4375 50645 19842 -20627 -23517 -26131 -25550 -7382 7003 34127 40916 6063 -20924 -17656 -14808
4362 -14808 -47803 -39112 -31389 -35181 -30352 -47470 -62338 -58812 -40474 8191 30388 4128 13835
4349 13835 51548 39782 -9593 -15331 -20719 -15349 -43077 -30622 -39625 -33115 -13053 25485 23137
4336 23137 3204 -8160 21875 24793 -7834 -5032 32279 64 -35055 -13996 -25443 -34186
4324 -34186 -18066 -12648 2044 20019 30136 -22743 -27265 -17955 -19690 8274 51878 53056 37987
4311 37987 15767 2047 -28947 -14137 4308 -12636 -19659 -5123 -37116 -17559 1592 30117
4299 30117 58973 6048 -12691 59278 49718 9765 -16639 -11229 3722 -29190 -42957 -34443
4287 -34443 -17561 -33728 -29037 -5755 -26057 -43732 -18517 2685 -1146 -16363 -33991 -37703
4275 -37703 -27304 28262 58993 42551 18032 15228 25182 31587 40440 -24026 -30322 -26095 -11497
4262 -11497 12063 32635 26195 -16492 -48548 -17055 21540 -18116 -16012 41033 86102 33035
4250 33035 -7559 -11216 -20059 -10460 5756 -13950 -51156 -83087 -53244 -21882 45398 72536
4238 72536 44728 5228 -6258 -5110 6675 25952 34779 35731 33063 31010 53127 62262 46928
4225 46928 53581 37435 -6009 4924 16845 18697 37474 17001 -2958 -739 -14166 -11874 -12363
4212 -12363 10205 26529 22633 36118 39275 3740 -36591 -24682 -7289 -24978 -49191 -16223
4200 -16223 -14528 5053 14181 -5671 27389 9340 -24523 -45346 -61217 -62331 -65822 -47249 2068
4187 2068 10077 13998 39036 27583 2532 924 -22839 -28022 -9638 -28022 -8997 -25255 -25522
4174 -25522 -19258 15225 8385 -30039 -19467 24661 42258 24303 38235 36488 15406 -39390
4162 -39390 -49092 -6124 -12005 -37928 -29859 -11025 44434 46638 21324 8227 5061 46847 53841
4149 53841 19340 -794 -9558 10751 -4468 -14250 -18424 -19878 -18723 -44072 -58545 -78436 -42556
4136 -42556 -2376 2509 7593 -12546 -53967 -45922 -65334 -93757 -98336 -75751 -81805 -76293 -34840
4123 -34840 -28842 -32959 -12659 -8113 -13637 -2350 -18056 -70214 -4104 23767 20976 19853 -18917
4110 -18917 16374 60429 61491 85525 55903 8519 -17828 -21302 -17035 -22778 -11472 -20750 -11867
4097 -11867 23750 65025 75682 70245 62050 52970 21289 5713 -8053 -46890 -58547 -8599
4085 -8599 7827 -14428 -16544 -19950 -57507 -61874 1006 8252 -24640 -51788 -34023 -29678 -53949
4072 -53949 -67130 -83920 -37672 -3747 21191 36510 51881 54666 46115 -20725 -65750 -86373
4060 -86373 -74166 -7382 11749 26260 27421 -19116 -32159 -27870 -63666 -54599 -24080 -35215
4048 -35215 -86822 -95112 -11138 30406 33514 10276 4103 5114 18834 13178 -21153 -63937 -55198
4035 -55198 -22544 -20301 -61542 -76398 -76655 -70746 -38535 -59561 -39871 -23994 -25126 -18466 -12164
4022 -12164 4029 29408 -7412 -24795 -12901 -16715 -1118 -6529 -33116 -46214 -13816 22720
4010 22720 8394 21600 29992 32190 25387 11510 24242 14916 21836 30823 30139 34813 35033 39860
3996 39860 24094 -6048 -55657 -25739 -7051 -26225 -37319 -49317 -92934 -102249 -80812 -60519
3984 -60519 -31047 -31040 -51619 -59936 -41118 -27073 -50709 -9745 6109 3139 -19832 -31063 -15607
3971 -15607 -49373 -24130 14047 19378 10543 44258 51287 39667 43139 31988 -11201 7047 18666
3958 18666 33395 41352 20740 15001 -14628 -20006 10433 49539 76368 80935 52403 71762 50298
3945 50298 4510 -46926 -43019 -33343 -65918 -50157 -61967 -76938 -80295 -74109 -76006 -32566 11199
3932 11199 6796 8645 7377 -33188 -18642 -9833 -10553 -4000 -32860 -51283 -42405 -48827 -64559 -38307
3918 -38307 -19064 -12772 -28222 -26565 -57218 -77960 -59098 -48958 -45620 -37645 -19377 -983 -1050
3905 -1050 -18201 -52703 4446 52177 49792 40731 41029 209 2419 -23611 -34599 -70884 -112328
3892 -112328 -76745 -43538 -13807 -30198 -15429 -7709 5257 -27497 -33886 -39177 -26015 -11081
3880 -11081 7382 45479 55280 83907 55107 -11386 -39783 -53330 -24647 18385 73698 65731
3868 65731 57413 2741 -39404 -34490 32874 77314 22757 -17896 -10183 -7456 16529 18444 22207
3855 22207 23220 45462 29267 -18410 -21765 -31397 -4063 23990 8522 -53978 -77401 -40376
3843 -40376 -32648 -15356 9561 32329 31022 17848 -14645 -16479 -34840 -20668 -22984 -32889 -35380
3830 -35380 -23583 -33927 -63222 -48336 -3914 62758 86277 85366 64510 56866 16030 -14199
3818 -14199 -18761 -14231 -7337 11689 25349 17939 -33717 -52304 -73722 -60722 -28243 7396 16407
3805 16407 -15359 35629 85138 115178 119919 112736 85471 51553 1043 -48722 -36768 23436
3793 23436 30466 19579 24708 54526 91864 100125 63274 8944 9717 50700 75700 53038 13024
3780 13024 622 -12288 -13053 19558 -3637 -39128 -10346 44513 47377 17487 24512 34171 37125
3767 37125 35480 50851 58332 65893 68423 42457 46493 52161 36601 18510 55466 26044 -29888
3754 -29888 -50191 -44287 -33074 -36358 -11846 25090 19209 18858 21126 -159 -34402 -33510 -7914
3741 -7914 7688 -20130 -68979 -47744 -9869 -464 34014 42254 30635 53941 61797 2177 -36987
3728 -36987 -63633 -43016 18121 79258 105162 42486 -36933 -5978 36917 78407 9953 -9528
3716 -9528 25347 23854 28237 -11518 -3503 -21412 -11703 -53121 -104581 -104070 -72152 -21780 -6279
3703 -6279 -46543 -67601 -50293 -9954 10095 -5970 -33873 -51008 -54623 -74553 -34228 -26721
3691 -26721 25129 48948 16259 -4616 9409 35290 39960 14977 -4785 31418 12106 -40714
$$ [...]
##END NTUPLES=NMR SPECTRUM
##END=
