##TITLE=Analysis number 330485
Compound Code cc 30414
Project Code adrs
Chemist Name ugmt
##JCAMPDX= 6.0         $$ Bruker NMR JCAMP-DX V2.0
##DATA TYPE= NMR SPECTRUM
##DATA CLASS= NTUPLES
##ORIGIN= Bruker BioSpin GmbH
##OWNER= nmr
$$ XWIN-NMR		Version 3.5
$$ Thu Nov 29 11:49:05 2007 GMT Standard Time (UT+0h)  MAYBRIDGE\nmr@NMR_250MHZ
##.OBSERVE FREQUENCY= 250.131544655141
##.OBSERVE NUCLEUS= ^1H
##.ACQUISITION MODE= SIMULTANEOUS (DQD)
##.ACQUISITION SCHEME= undefined
##.AVERAGES= 16
##.DIGITISER RES= 18
##SPECTROMETER/DATA SYSTEM= dpx250
##.PULSE SEQUENCE= zg30
##.SOLVENT NAME= CDCl3
##.SHIFT REFERENCE= (INTERNAL, CDCl3, 0, 16.522)
##AUDIT TRAIL= $$ (NUMBER, WHEN, WHO, WHERE, WHAT)
$$ ##TITLE= Audit trail, XWIN-NMR		Version 3.5
$$ ##JCAMPDX= 5.01
$$ ##ORIGIN= Bruker BioSpin GmbH
$$ ##OWNER= nmr
$$ C:\u/data/dgb/nmr/ADRS/2480/pdata/1/auditp.txt
$$ ##AUDIT TRAIL=  $$ (NUMBER, WHEN, WHO, WHERE, WHAT)
(   1,<2007-11-29 11:48:42.30 +000>,<MAYBRIDGE\nmr>,<NMR_250MHZ>,
      <created by zg, POWCHK disabled, PULCHK disabled
       configuration hash MD5:
       76 6E 9A 78 1E 09 19 81 EC 84 63 8F B0 6A 59 2D
       data hash MD5: 64K
       BA C5 77 EB 02 FB DB 91 7A 93 E1 16 2D 89 82 1C>)
(   2,<2007-11-29 11:48:56.88 +000>,<MAYBRIDGE\nmr>,<NMR_250MHZ>,
      <Start of raw data processing
       ef LB = 0.3 FT_mod = 6 PKNL = 1 SI = 32K 
       data hash MD5: 32K
       E2 55 24 41 21 F8 58 7C 8E 32 13 06 C5 76 DD 83>)
(   3,<2007-11-29 11:48:58.41 +000>,<MAYBRIDGE\nmr>,<NMR_250MHZ>,
      <apk 
       data hash MD5: 32K
       05 19 12 AD 1E 84 63 D0 83 73 2A D2 16 51 3F 99>)
(   4,<2007-11-29 11:48:59.19 +000>,<MAYBRIDGE\nmr>,<NMR_250MHZ>,
      <abs ABSG = 5 
       data hash MD5: 32K
       F8 49 FE D3 0F DD CA EB BF 37 AC 47 EC 4E F3 60>)
$$ ##END=
$$ 
$$ hash MD5
$$ F8 82 F1 07 DD 47 9F 15 68 93 BB 93 C1 C8 F4 35
##$RELAX= 
##$RELAX= 
##$RELAX= 
##$RELAX= 
##$RELAX= 
##$RELAX= 
##$RELAX= 
$$ Bruker specific parameters
$$ --------------------------
##$DU= <C:\u>
##$EXPNO= 2480
##$NAME= <ADRS>
##$PROCNO= 1
##$TYPE= <nmr>
##$USER= <dgb>
##$AMP= (0..31)
100 100 100 100 100 100 100 100 100 100 100 100 100 100 100 100 100 100 
100 100 100 100 100 100 100 100 100 100 100 100 100 100 
##$AQSEQ= 0
##$AQ_mod= 3
##$AUNM= <au_zg>
##$AUTOPOS= <11 >
##$BF1= 250.13
##$BF2= 250.13
##$BF3= 250.13
##$BF4= 250.13
##$BF5= 500.13
##$BF6= 500.13
##$BF7= 500.13
##$BF8= 500.13
##$BYTORDA= 1
##$CFDGTYP= 0
##$CFRGTYP= 5
##$CHEMSTR= <none>
##$CNST= (0..31)
1 1 145 1 1 1 1 1 1 1 1 1 1 1 1 1 1 1 1 1 1 1 1 1 1 1 1 1 1 1 1 1 
##$CPDPRG= <>
##$CPDPRG1= <>
##$CPDPRG2= <>
##$CPDPRG3= <>
##$CPDPRG4= <mlev>
##$CPDPRG5= <mlev>
##$CPDPRG6= <mlev>
##$CPDPRG7= <mlev>
##$CPDPRG8= <mlev>
##$CPDPRGB= <>
##$CPDPRGT= <>
##$D= (0..31)
0 1 0 0 0 0 0 0 0 0.06 0 0 0 0 0 0 0.0002 0 0 0 0 0 0 0 0 0 0 0 0 0 0 
0 
##$DATE= 1196336920
##$DBL= (0..7)
120 120 120 120 120 120 120 120 
##$DBP= (0..7)
150 150 150 150 150 150 150 150 
##$DBP07= 0
##$DBPNAM0= <>
##$DBPNAM1= <>
##$DBPNAM2= <>
##$DBPNAM3= <>
$$ [...]
##$SUBNAM7= <"">
##$SUBNAM8= <"">
##$SUBNAM9= <"">
##$SW= 20.6930455092707
##$SWIBOX= (0..15)
0 0 3 0 0 0 0 0 0 0 0 0 0 0 0 0 
##$SW_h= 5175.983436853
##$TD= 65536
##$TD0= 1
##$TE= 295.16
##$TE2= 300
##$TE3= 300
##$TEG= 300
##$TL= (0..7)
0 120 120 120 120 120 120 120 
##$TP= (0..7)
150 150 150 150 150 150 150 150 
##$TP07= 0
##$TPNAME0= <>
##$TPNAME1= <>
##$TPNAME2= <>
##$TPNAME3= <>
##$TPNAME4= <>
##$TPNAME5= <>
##$TPNAME6= <>
##$TPNAME7= <>
##$TPOAL= (0..7)
0.5 0.5 0.5 0.5 0.5 0.5 0.5 0.5 
##$TPOFFS= (0..7)
0 0 0 0 0 0 0 0 
##$TUNHIN= 0
##$TUNHOUT= 0
##$TUNXOUT= 0
##$USERA1= <user>
##$USERA2= <user>
##$USERA3= <user>
##$USERA4= <user>
##$USERA5= <user>
##$V9= 5
##$VALIST= <valist>
##$VCLIST= <CCCCCCCCCCCCCCC>
##$VD= 0
##$VDLIST= <DDDDDDDDDDDDDDD>
##$VPLIST= <PPPPPPPPPPPPPPP>
##$VTLIST= <TTTTTTTTTTTTTTT>
##$WBST= 1024
##$WBSW= 4
##$XGAIN= (0..3)
0 0 0 0 
##$XL= 0
##$YL= 0
##$YMAX_a= 417008
##$YMIN_a= -499029
##$ZGOPTNS= <>
##$ZL1= 120
##$ZL2= 120
##$ZL3= 120
##$ZL4= 120
##$ABSF1= 16.522
##$ABSF2= -4.171173
##$ABSG= 5
##$ABSL= 3
##$ALPHA= 0
##$AQORDER= 0
##$ASSFAC= 0
##$ASSFACI= 0
##$ASSFACX= 0
##$ASSWID= 0
##$AUNMP= <proc_1d>
##$AZFE= 0.1
##$AZFW= 0.1
##$BCFW= 0
##$BC_mod= 0
##$BYTORDP= 0
##$COROFFS= 0
##$CY= 12.5
##$DATMOD= 1
##$DC= 0
##$DFILT= <>
##$DTYPP= 0
##$F1P= 14.0000005364418
##$F2P= -0.99999901652339
##$FCOR= 0.5
##$FTSIZE= 32768
##$FT_mod= 6
##$GAMMA= 0
##$GB= 0
##$INTBC= 1
##$INTSCL= 1
##$ISEN= 128
##$LB= 0.3
##$LEV0= 0
##$LPBIN= 0
##$MAXI= 10000
##$MC2= 0
##$MEAN= 0
##$ME_mod= 0
##$MI= 0
##$NCOEF= 0
##$NC_proc= -2
##$NLEV= 6
##$NOISF1= 0
##$NOISF2= 0
##$NSP= 0
##$NTH_PI= 0
##$NZP= 0
##$OFFSET= 16.522
##$PC= 1
##$PHC0= 170.2463
##$PHC1= 5.525095
##$PH_mod= 1
##$PKNL= yes
##$PPARMOD= 0
##$PSCAL= 4
##$PSIGN= 0
##$REVERSE= no
##$SF= 250.13
##$SI= 32768
##$SIGF1= 0
##$SIGF2= 0
##$SINO= 400
##$SIOLD= 32768
##$SREGLST= <1H.CDCl3>
##$SSB= 0
##$STSI= 32768
##$STSR= 0
##$SW_p= 5175.98343685301
##$SYMM= 0
##$S_DEV= 0
##$TDeff= 65536
##$TDoff= 0
##$TI= <Analysis number 999999
Compound Code 99
Book Reference 9
Project Code 9>
##$TILT= no
##$TM1= 0
##$TM2= 0
##$TOPLEV= 0
##$USERP1= <user>
##$USERP2= <user>
##$USERP3= <user>
##$USERP4= <user>
##$USERP5= <user>
##$WDW= 1
##$XDIM= 32768
##$YMAX_p= 313422538
##$YMIN_p= -51891
$$ End of Bruker specific parameters
$$ ---------------------------------
##NTUPLES= NMR SPECTRUM
##VAR_NAME=  FREQUENCY,     SPECTRUM/REAL,   SPECTRUM/IMAG
##SYMBOL=    X,             R,               I
##VAR_TYPE=  INDEPENDENT,   DEPENDENT,       DEPENDENT
##VAR_FORM=  AFFN,          ASDF,            ASDF
##VAR_DIM=   32768,         32768,           32768
##UNITS=     HZ,            ARBITRARY UNITS, ARBITRARY UNITS
##FACTOR=    0.157963299565203, 1,           1
##FIRST=     4132.6476996994, 0,             0
##LAST=      -1043.33573715361, 0,           0
##MIN=       -1043.33573715361, -51891,      0
##MAX=       4132.6476996994, 313422538,     0
$$ Real data points
##PAGE= N=1
##DATA TABLE= (X++(R..R)), XYDATA
$$ [...]
$$ plain form
15181 -18300 -4542 -13115 -30137 -26801 -23562 -11403 -11420 -11815 -4932 1645 148 -10072 -5706 -2692
15167 -2692 -9452 -10973 -14344 -16968 -14873 -11179 -1652 -15922 -21314 -19834 -9039 -3676 -6369 -21021
15153 -21021 -18573 -12099 -10548 7469 5533 -7866 -7455 -10602 -13563 -18995 -8241 -920 10224 524
15139 524 -8135 -7650 -17610 -29878 -26697 -24246 -20740 -21927 -26038 -13786 -8302 2699 3747 -5024
15125 -5024 -10076 -7386 2159 8404 10626 248 -13289 -14139 -21963 -30958 -21754 -742 6670 11432
15111 11432 4626 -11835 -4063 4834 -7351 -12770 -6669 5452 5955 9360 18076 14571 15164 7606
15097 7606 1000 2351 -2152 -7292 -12738 -19093 -5288 -14164 -26407 -21748 -4596 1021 15493 11769
15083 11769 8139 12071 13216 7492 4950 3678 7085 3529 -2845 -13429 -19850 -2554 1959 -1628
$$ packed form
15181a8300J3758q573j7022L336L239J2159j7l95O883O577j497j0220M366L014
15167b692o760j521l371k624K095L694R527j4270n392J480J0795N363k693j4652
15153b1021K448O474J551J8017j936j3399M11l147k961n432J0754P321J1144r700
15139E24q659M85r960j2268L181K451L506j187m111J2252N484J1001J048q771
15125e024n052K690R545O245K222j0378j3537q50p824q995R204K1012P412M762
15111A1432o806j6461P772Q897j2185n419O101J2121N03L405Q716l505N93p558
15097G606o606J351m503n140n446o355J3805q876j2243M659J7152N617J4472l724
15083A1769l630L932J145n724k542j272L407l556o374j0584o421J7296M513l587
$$ plain form
15069 -1628 -6097 -12316 -16428 -16163 -15468 -10767 -4795 -3840 6349 27335 14323 4897 -2155 -7974 -10680
15054 -10680 -16741 -12698 -9193 -8512 6783 16138 14590 -19091 -22596 -3022 10692 8681 10664 14232
15040 14232 17197 19729 21461 16012 15093 11458 10409 7489 2342 12121 11114 5624 2654 6359 9248
15025 9248 7079 -390 -797 16973 28193 31973 24604 13557 7129 27570 38230 38092 49235 52003
15011 52003 50013 56585 72573 101293 127358 197285 310422 502530 848352 1349819 1681084
15000 1681084 1497506 1057444 643241 384123 260643 194523 149484 122022 100193 77087
14990 77087 33790 22629 25447 29815 32761 22773 12967 14951 12246 -425 126 15177 7391 -3236
14976 -3236 -6442 -15161 -8857 1640 2175 9892 24085 29748 35162 32751 29341 20414 -5047 -12915
$$ packed form
15069a628m469o219m112K65O95M701N972R55J0189K0986j3012r426p052n819k706
15054a0680o061M043L505O81J5295R355j548l3681l505J9574J3714k011J983L568
15040A4232K965K532J732n449r19l635j049k920n147R779j007n490k970L705K889
15025I248k169p469m07J7770J1220L780p369j1047o428K0441J0660j38J1143K768
15011E2003j990O572J5988K8720K6065O9927J13137J92108L45822N01467L31265
15000A681084j83578m40062m14203k59118j23480o6120m5039k7462k1829k3106
14990G7087m3297j1161K818M368K946r988r806J984k705j2671N51J5051p786j0627
14976c236l206q719O304J0497N35P717J4193N663N414k411l410q927k5461p868
$$ plain form
14962 -12915 -3846 5417 2463 -11047 -24742 -17372 -4146 -14557 -10732 -1376 2145 6201 10474
14949 10474 17384 6129 -4587 829 -9376 -7351 379 4962 -3482 -12297 -14308 -1438 8026
14936 8026 -6478 -11459 -18306 -21889 -18712 -21542 -32841 -25447 -6306 -12962 -13752 -15338 -13956 -9067
14922 -9067 -12312 -15597 -13297 -15058 -9613 4077 9001 26748 14015 -5583 -15198 -13578 -4124 25
14908 25 -16773 -12335 -8847 -13911 -13526 -17308 -15022 -12009 -6176 -4929 -2200 -14240 -20243 -26367 -23496
14893 -23496 -14079 -14927 -18928 -14677 -12113 2437 9277 15532 10301 4671 -1797 -1129 -11268 -25286
14879 -25286 -31830 -29524 -25806 -24090 -18399 -6141 -5303 -3887 -792 1731 -167 -1036 -4447 3232 1295
14864 1295 -292 -10660 -15457 -5405 2592 3751 2209 -9977 -21030 -16205 -16169 -17867 -14261 -7384
$$ packed form
14962a2915R069R263k954j3510j3695P370J3226j0411L825R356L521M056M273
14949A0474O910j1255j0716N416j0205K025P730M583q444q815k011J2870R464
14936H026j4504m981o847l583L177k830j1299P394J9141o656p90j586J382M889
14922i067l245l285K300j761N445J3690M924J7747j2733j9598r615J620R454M149
14908B5j6798M438L488n064L85l782K286L013N833J247K729j2040o003o124K871
14893b3496R417q48m001M251K564J4550O840O255n231n630o468O68j0139j4018
14879b5286o544K306L718J716N691J2258Q38J416L095K523j898q69l411P679j937
14864A295j587j0368m797J0052P997J159j542j2186j1053M825L6j698L606O877
$$ plain form
14850 -7384 2361 8241 10740 9045 12499 20830 17707 -4850 -15349 -9079 -6449 4281 -489 8678
14836 8678 16514 11709 3473 1488 -4782 -20486 -15428 -3814 -2318 -1181 -1293 -8417 -10008 529
14822 529 703 -18327 -24907 -8490 5813 -303 3108 8928 3003 3292 13528 12042 -5283 -4503
14808 -4503 -4871 -239 986 -7242 -1900 3552 -12195 -1479 8017 3029 3312 8139 18441 19708
14794 19708 11836 11507 3157 918 -2084 -12231 -10272 -6706 42 9497 -14894 -18336 -4510 10136
14780 10136 10033 14806 5837 -7346 -19303 -10815 984 6611 2275 -9006 -7779 -2875 834 -5880
14766 -5880 -10368 -2627 813 2109 1703 -4162 -10484 -14238 -16225 -1271 -1442 1500 8243 14926 19290
14751 19290 13724 10653 5610 10624 10532 -1436 -11174 -9717 -7814 -11969 -15957 -14389 -6148 -4645 -9820
$$ packed form
14850g384R745N880K499j695L454Q331l123k2557j0499O270K630J0730m770R167
14836H678P836m805q236j985o270j5704N058J1614J496J137j12p124j591J0537
14822E29J74j9030o580J6417J4303o116L411N820n925K89J0236j486j7325P80
14808d503l68M632J225q228N342N452j5747J0716R496m988K83M827J0302J267
14794A9708p872l29q350k239l002j0147J959L566O748R455k4391l442J3826J4646
14780A0136j03M773q969j3183j1957Q488J1799N627m336j1281J227M904L709o714
14766e880m488P741L440J296m06n865o322l754j987J4954j71K942O743O683M364
14751A9290n566l071n043N014r2j1968r738J457J903m155l988J568Q241J503n175
$$ plain form
14736 -9820 -6503 -6763 -5603 -10488 -9526 -15767 -20504 934 914 -5091 -7341 1823 -6612 -9084 -6967
14721 -6967 -13018 -8760 1743 1901 -682 5565 -1406 -11424 -23214 -17965 -19964 -14459 -6003 -17264
14707 -17264 -21230 -28106 -21362 -16849 -5261 -8453 -12018 -2743 7802 10713 11203 11926 9854 10207 7981
14692 7981 9839 19102 20129 15972 6010 -2115 -302 -4601 683 -2326 -8265 -7709 -13315 -11711 -11933
14677 -11933 -16912 -9904 891 2458 14126 12633 -1884 14962 25482 17069 4347 1688 3438
14664 3438 12411 21066 15528 7268 4636 14438 17304 -1360 -7545 -6988 -8629 -3506 17409 23562
14650 23562 3646 -14740 -8920 9494 17080 6455 -6371 -14892 -16990 -10152 -16540 -22413 -15185
14637 -15185 -16060 -20835 -23713 -14482 -9020 -7803 5207 3037 4031 5644 9416 6088 -6559 -3581
$$ packed form
14736i820L317k60J160m885R62o241m737K1438k0o005k250R164q435k472K117
14721f967o051M258J0503J58k583O247o971j0018j1790N249j999N505Q456j1261
14707a7264l966o876O744M513J1588l192l565R275J0545K911M90P23k072L53k226
14692G981J858R263J027m157r962q125J813m299N284l009n939N56n606J604k22
14677a1933m979P008J0795J567J1668j493j4517J6846J0520q413j2722k659J750
14664C438Q973Q655n538q260k632R802K866j8664o185N57j641N123K0915O153
14650B3562j9916j8386N820J8414P586j0625j2826q521k098O838o388n873P228
14637a5185q75m775k878R231N462J217J3010k170R94J613L772l328j2647K978
$$ plain form
14623 -3581 -1000 7274 -9381 -11290 -3605 -3414 -6729 -15654 -8982 -5362 -5818 -1514 12688 11690 6211
14608 6211 9770 9598 1547 887 8415 5428 10939 22033 3946 -12694 -284 2202 2892 1822
14594 1822 -7384 -24182 -18508 -468 -6112 -11719 -8710 -824 7730 -2565 -2508 12808 10052 10046 5233
14579 5233 1603 5015 13075 20976 17050 4922 -4503 -11201 -12515 645 9964 9628 6412 4669
14565 4669 9286 21196 9599 8320 4434 -3202 4116 16853 19796 10033 4795 -7040 -9041 -5269
14551 -5269 -6159 850 12669 4951 1234 -192 5188 3067 -7855 -6740 7918 14424 11095 -906
14537 -906 -7536 -895 6966 2235 5321 4556 11447 9125 22669 16215 -2959 -2018 -2071 -7861 -9886
14522 -9886 -3191 14031 8607 1444 8012 4339 16030 2126 -9521 -11480 -7679 -16379 -12148 -7964
$$ packed form
14623c581K581Q274j6655j909P685J91l315q925O672L620m56M304J4202r98n479
14608F211L559j72q051o60P528k987N511J1094j8087j6640J2410K486O90j070
14594A822r206j6798N674J8040n644n607L009P886Q554j0295N7J5316k756om813
14579E233l630L412Q060P901l926j2128r425o698j314J3160R319l36l216j743
14565D669M617J1910j1597j279l886p636P318J2737K943r763n238j1835k001L772
14551e269q90P009J1819p718l717j426N380k121j0922J115J4658O506l329j2001
14537i06o630O641P861m731L086p65O891k322J3544o454j9174R41n3n790k025
14522i886O695J7222n424p163O568l673J1691j3904j1647j959L801q700M231M184
$$ plain form
14508 -7964 -15980 -22604 -24350 -16459 -16975 -15211 -10133 -8603 -9997 -17478 -18400 -18901 9518 17400 3121
14493 3121 -3902 285 -3011 9381 11553 3109 2773 8433 1809 -7272 -13572 -1782 9590 20864
14479 20864 21874 16711 16357 15003 12128 25025 32191 33228 20484 7083 -9117 -8421 -10529 -4145
14465 -4145 6732 11636 11914 5546 19426 22637 19525 22027 13542 1 7490 5688 7964 10745
14451 10745 1948 5460 9842 -452 -2665 5002 5772 14418 9227 -5191 -5642 8361 22261 24871
14437 24871 17322 30934 26623 13426 13185 9757 15512 15712 536 -10777 2524 9919 -1827
14424 -1827 -10881 -6450 -3182 -6090 -4897 -19270 -16620 -7165 -2364 -2164 -6802 -1257 -1222 10490 -1170
14409 -1170 -17099 -14611 -12679 -13650 -14684 -7645 -378 4977 2605 902 -2368 -11274 -3099 -4989 -13590
$$ packed form
14508g964q016o624j746P891n16J764N078J530j394p481r22n01K8419P882j4279
14493C121p023M187l296J2392K172q444l36N660o624r081o300J1790J1372J1274
14479B0864J010n163l54j354k875J2897P166J037j2744j3401j6200O96k108O384
14465d145J0877M904K78o368J3880L211l112K502q485j3541P489j802K276K781
14451A0745q797L512M382j0294k213P667P70Q646n191j4418m51J4003J3900K610
14437B4871p549J3612m311j3197k41l428N755K00j5176j1313J3301P395j1746
14424a827r054M431L268k908J193j4373K650R455M801K00m638N545L5J1712j1660
14409a170j5929K488J932r71j034P039P267N355k372j703l270q906Q175j890q601
$$ plain form
14394 -13590 -20476 -25258 -18279 2128 2122 -9862 -1350 -7185 -11851 4161 8537 14346 10436 31014
14380 31014 23613 167 -7129 -7597 -8160 -2218 4301 3646 -91 2222 13860 15442 14292 -6629
14366 -6629 -13464 3173 8184 12469 8755 432 8236 6125 -3350 -2629 -19347 -17841 -17068 -9456 4264
14351 4264 12651 11564 2443 9004 13985 9915 9431 6007 7747 9221 -624 -4722 7898 20305
14337 20305 16844 13273 10536 18731 36740 24005 14961 7401 -5709 -10553 -17170 -13692 -11610 -6707
14323 -6707 -935 4986 3306 3860 6213 5408 6457 13279 15418 8392 1060 -6521 -21056 -15265 -14185
14308 -14185 2883 3025 3614 -4718 -18599 -19527 -19071 -4826 2499 2587 4041 4895 -5235 -15057 -6691
14293 -6691 -3705 9698 13012 9516 -7102 -7714 -9906 -13894 -15026 -18619 3645 9450 4017 -14259
$$ packed form
14394a3590o886m782O979K0407oj1984Q512n835m666J6012M376N809l910K0578
14380C1014p401k3446p296m68n63N942O519o55l737K313J1638J582j150k0921
14366f629o835J6637N011M285l714q323P804k111r475P21j6718J506P73P612J3720
14351D264Q387j087r121O561M981m070m84l424J740J474r845m098J2620J2407
14337B0305l461l571k737Q195J8009j2735r044p560j3110m844o617L478K082M903
14323f707N772N921j680N54K353q05J049O822K139p026p332p581j4535N791J080
14308a4185J7068J42N89q332j3881r28M56J4245P325Q8J454Q54j0130r822Q366
14293f691K986J3403L314l496j6618o12k192l988j132l593K2264N805n433j8276
$$ plain form
14279 -14259 -8233 9225 6652 5389 2053 16311 15297 21162 13081 9294 -4392 -24828 -31523
14266 -31523 -21916 -1475 14495 24276 24538 21367 11421 -4717 1566 9502 745 1834 10231 13618
14252 13618 8349 -661 -8999 -10889 -11519 -8084 2902 11662 17506 14131 8896 2176 -4136 -7537
14238 -7537 -3161 -9923 -11544 7283 23362 23618 20256 21827 10448 -420 -1619 -58 3803 2240
14224 2240 2662 3498 -10621 -14084 -6880 -580 539 -1444 -16188 -23147 -9505 5305 9611 5965
14210 5965 -6210 -20038 -25774 -14096 1412 10494 10064 2236 -18204 -28128 -21702 -27238 -20949 -11549
14196 -11549 -10834 -16381 -18797 -26292 -20191 -13920 -13719 -749 10904 9499 11749 9083 -1066 -13599
14182 -13599 -20802 -12599 -4079 -2066 8618 15021 12086 1866 -9970 -3328 9224 14734 16872
$$ packed form
14279a4259O026J7458k573j263l336J4258j014N865q081l787j3686k0436o695
14266c1523R607K0441J5970R781K62l171r946j6138O283P936q757J089Q397L387
14252A3618n269r010q338j890o30L435J0986Q760N844l375n235o720o312l401
14238g537M376o762j621J8827J6079K56l362J571j1379j0868j199J561L861j563
14224B240M22Q36j4119l463P204O300J119j983j4744o959J3642J4810M306l646
14210E965j2175j3828n736J1678J5508R082m30p828k0440r924O426n536O289R400
14196a1549P15n547k416p495O101O271K01J2970J1653j405K250k666j0149j2533
14182a3599p203Q203Q520K013J0684O403k935j0220j1836O642J2552N510K138
$$ plain form
14169 16872 7021 6622 5807 343 4418 5825 -3086 -18573 -32687 -28624 -19742 -22824 -32946 -28003
14155 -28003 -12934 4520 6264 -2144 -18194 -33070 -28372 -19465 -9950 4668 4673 -15610 -33512
14142 -33512 -26819 -8153 -5456 -18215 -18951 -14394 -13031 -10693 -5837 -4561 -3393 -955 -4698 -1912
14128 -1912 -8198 -15426 -5478 8627 -3509 2648 2169 626 7604 -4417 -6456 -3298 6096 5517
14114 5517 -3710 -17957 -3511 7747 16686 8909 -7384 -7970 1467 10901 7060 6727 13479 7249
14100 7249 -6577 1728 2118 1525 -10906 -8105 5543 15731 16824 10749 10811 8547 14384 16164 17113
14085 17113 14161 16187 9483 5820 11871 22302 33434 26226 16552 1376 -17722 -27178 -5275
14072 -5275 17008 9225 14634 25187 26112 6866 -1626 -5141 -8457 -9279 -20929 -20045 -3466 3999
$$ packed form
14169A6872r851l99q15n464M075J407q911j5487j4114M063Q882l082j0122M943
14155b8003J5069J7454J744q408j6050j4876M698Q907R515J4618Nk0283j7902
14142c3512O693J8666K697j2759p36M557J363K338M856J276J168K438l743K786
14128a912o286p228R948J4105j2136O157m79j543O978j2021k039L158R394n79
14114E517r227j4247J4446J1258Q939p777j6293n86R437R434l841l33O752o230
14100G249j3826Q305L90n93j2431K801J3648J0188J093o075O2k264N837J780R49
14085A7113k952K026o704l663O051J0431J1132p208r674j5176j9098r456K1903
14072e275K2283p783N409J0553R25j9246q492l515l316q22j1650Q84J6579P465
$$ plain form
14058 3999 -1750 -17084 -17406 -13296 -13137 -4435 -1368 -9949 -15362 -10285 3317 19589 9833 -3006
14044 -3006 -7714 -8687 -1178 -3993 -559 -8799 -1920 9611 27867 35227 24031 12073 9936 15934
14030 15934 3704 -16201 -14773 -12016 477 -6930 -11086 1316 7856 -1808 -2189 7498 9429 1719
14016 1719 -19513 -20471 -9052 -9151 -13801 -8356 -8393 -15743 -16725 -10331 16261 16952 9689 7155 2155 9608
14000 9608 13663 4256 8473 719 -12794 -12667 -16509 -12741 -5489 -1283 -11971 -17643 -9029 -23890
13986 -23890 -33674 -32577 -25861 -22401 -16197 -8092 -6428 -9553 -19311 -17336 -15881 -12957 -14675 -12282
13972 -12282 -9687 1100 13234 14669 -4231 -21841 -19973 -5452 8002 9429 6432 -3966 -20527
13959 -20527 -16519 -19745 -20456 -15981 -1964 -831 590 14824 15253 13583 8489 -8265 -16956 -4944
$$ packed form
14058C999n749j5334l22M110J59Q702L067q581n413N077J3602J6272r756j2839
14044c006m708r73P509k815L434q240O879J1531J8256P360j1196j1958k137N998
14030A5934j2230j9905J428K757J2493p407m156J2402O540r664l81R687J931p710
14016A719k1232r58J1419r9m650N445l7p350r82O394K6592O91p263k534n000P453
14000I608M055r407M217p754j3513J27l842L768P252M206j0688n672Q614j4861
13986b3890r784J097O716L460O204Q105J664l125r758J975J455K924j718K393
13972a2282K595J0787J2134J435j8900j7610J868J4521J3454J427k997j0398j6561
13959b0527M008l226p11M475J4017J133J421J4234M29j670n094j6754q691J2012
$$ plain form
13945 -4944 2294 6419 5788 9809 3843 -4632 -7228 13327 29106 13082 -3179 -8506 -15173 -13281
13931 -13281 -4720 -14974 -25176 -29650 -23111 -23120 -19864 -6650 2720 -3053 -15222 -25543 -26490 -20252
13917 -20252 -19987 -21178 -12574 -17981 -9379 -2523 805 4635 6002 -7438 -20771 -17909 -3750 -4908
13903 -4908 -6730 -153 -2829 17685 21504 10737 13825 10973 7777 3994 -13316 -30946 -35817 -32573
13889 -32573 -33545 -27671 -18099 2523 20868 17448 3165 5911 15496 10458 -1604 2998 1246 2844
13875 2844 6112 -4420 -505 -2269 -12650 -9079 17724 13202 6561 4587 6077 7126 775 -9865
13861 -9865 -8720 4003 10059 7482 -3106 528 403 -12294 -21190 -21181 -11394 -8528 -12059 -22462 -32339
13846 -32339 -21062 -13366 -17746 -13654 -11823 -21472 -33088 -28157 -21682 -12957 -5678 -4846 -2718 -3257
$$ packed form
13945d944P238M125o31M021n966q475k596K0555J5779j6024j6261n327o667J892
13931a3281Q561j0254j0202m474O539rL256J3214R370n773j2169j0321r47O238
13917b0252K65j191Q604n407Q602O856L328L830J367j3440j3333K862J4159j158
13903d908j822O577k676K0514L819j0767L088k852l196l783j7310j7630m871L244
13889c2573r72N874R572K0622J8345l420j4283K746R585n038j2062M602j752J598
13875B844L268j0532L915j764j0381L571K6803m522o641j974J490J049o351j0640
13861i865J145J2723O056k577j0588L634j25j2697q896RR787K866l531j0403r877
13846c2339J1277P696m380M092J831r649j1616M931O475Q725P279Q32K128n39
$$ plain form
13832 -3257 -4413 104 -27 -7823 -17964 -11203 10535 27034 11784 5254 6425 -2961 -11703 -8037
13818 -8037 4287 6440 4036 3487 8061 -5938 -10040 -5035 -2295 1650 3350 11717 11370 6354 370
13803 370 -7973 -6104 -306 7192 11375 10670 2464 -5820 -4773 -5184 -8545 -5496 -6271 -7529 -8886 -9841
13787 -9841 -13799 -8107 -594 2263 -6885 -20293 -6490 -10028 -4482 -4984 -9812 -3846 -9691 -7232
13773 -7232 -11714 -26818 -29595 -24505 -13361 5136 6550 11581 14332 14897 13584 3306 6186 8008
13759 8008 5712 2528 -6140 -23889 -25353 -26537 -26642 -18485 -829 5888 -4948 -10440 -18723 -26084
13745 -26084 -29645 -25402 -24068 -24192 -20275 -18506 -16611 -8693 10964 5895 -1523 -1409 5872 6313 -4874
13730 -4874 -9061 -14863 -24776 -22161 -3038 5492 -3961 -10855 -3592 -5632 394 1794 5444 11231
$$ packed form
13832c257j156M517j31p796j0141O761K1738J6499j5250o530J171r386q742L666
13818h037J2324K153k404n49M574j3999m102N005K740L945J700Q367l47n016n984
13803C70q343J869N798P498M183p05q206q284J047m11l361L049p75j258j357r55
13787i841l958N692P513K857r148j3408J3803l538N546n02m828N966n845K459
13773g232m482j5104k777N090J1144J8497J414N031K751N65j313j0278K880J822
13759H008k296l184q668j7749j464j184j05Q157J7656O717j0836n492q283p361
13745b6084l561M243J334j24L917J769J895P918J9657n069p418J14P281M41j1187
13730d874m187n802r913K615J9123Q530r453o894P263k040O026J400L650N787
$$ plain form
13716 11231 17322 16160 6037 -3266 1132 -2645 -25829 -39456 -34321 -19661 -15479 -6356 4648
13703 4648 25030 32273 15986 -499 7907 1805 -1475 3680 -4343 2759 14015 747 -9000
13690 -9000 -14029 -14424 -16865 -11978 3504 1363 -6142 -2358 -892 9156 12036 -2343 -13756 -28302
13676 -28302 -38598 -26058 -21161 -11910 -1647 14288 17681 4044 -1450 -1005 4498 3821 2406 7746
13662 7746 7863 2827 -2179 -3881 7150 3288 -3172 1133 5763 2339 8639 13807 14044 -5634 -2781
13647 -2781 14711 17423 17045 3426 7203 10200 -3135 -9941 -2416 5012 -1936 -13462 -7595 9894
13633 9894 12845 6252 -5312 -9765 -5872 -6379 -28967 -26881 -11794 -6794 -18383 -14785 6805 23007
13619 23007 13001 10313 9447 -13698 -20798 -420 4901 516 7307 12701 9455 -3322 -7789 -8830
$$ packed form
13716A1231O091j162j0123r303M398l777k3184j3627N135J4660M182R123J1004
13703D648K0382P243j6287j6485Q406o102l280N155q023P102J1256j3268r747
13690i000n029l95k441M887J5482k141p505L784J466J0048K880j4379j1413j4546
13676b8302j0296J2540M897R251J0263J5935L393j3637n494M45N503o77j415N340
13662G746J17n036n006j702J1031l862o460M305M630l424O300N168K37j9678K853
13647b781J7492K712l78j3619L777K997j3335o806P525P428o948j1526N867J7489
13633I894K951o593j1564m453L893n07k2588K086J5087N000j1589L598K1590J6202
13619B3007j0006k688q66k3145p100K0378N321m385O791N394l246j2777m467j041
$$ plain form
13605 -8830 -16040 -16838 -20604 -25388 -19488 -11375 -23919 -40893 -31020 -23554 2728 11090 8008 12294
13591 12294 11008 2576 2677 5776 11956 6393 8047 7119 4563 1077 3472 4591 9145 -10489 -22214
13576 -22214 -20524 -18385 -16836 -8819 -833 -4730 -16862 -9764 8568 11989 6801 2273 11065 13210
13562 13210 9171 10051 18366 10024 1774 -4260 -18732 -33038 -18248 -9855 -4057 3988 1433 -6243
13548 -6243 -15203 -17196 396 10248 23205 11146 -1368 -6196 -19716 -15381 -26861 -32943 -22110
13535 -22110 -27047 -34190 -22379 -17045 -21627 -24063 -13861 3220 6617 5136 2528 -1828 -13115
13522 -13115 -17834 -2441 7301 797 -3091 -2649 9349 -993 -10378 -21630 -9793 -1943 -7329
13509 -7329 -12671 5958 17960 13659 11067 8193 8280 11354 6651 11550 5541 -3 -3753 5005 14134
$$ packed form
13605h830p210p98l766m784N900Q113j2544j6974R873P466K6282Q362l082M286
13591A2294j286q432J01L099O180n563J654r28k556l486K395J119M554j9634j1725
13576b2214J690K139J549Q017P986l897j2132P098J8332L421n188m528Q792K145
13562A3210m039Q80Q315q342q250o034j4472j4306J4790Q393N798Q045k555p676
13548f243q960j993J7592R852J2957j2059j2514m828j3520M335j1480o082J0833
13535b2110m937p143J1811N334m582k436J0202J7081L397j481k608m356j1287
13522a3115m719J5393R742o504l888M42J1998j0342r385j1252J1837P850n386
13509g329n342J8629J2002m301k592k874Q7L074m703M899o009n544l750Q758R129
$$ plain form
13494 14134 5844 16649 20178 13485 13495 11989 17438 21181 7678 -12351 -14445 -5964 3576 3061
13480 3061 9955 23394 21318 23160 13832 7210 -4630 -4305 14630 21446 16986 1595 -18904 -27375
13466 -27375 -14128 -265 -10044 -10542 -886 -428 -6466 -12266 -12536 -4654 -4852 -7224 -5216 2772 17987
13451 17987 19651 16734 19540 13201 -2489 -1368 5175 4440 -5258 -6893 -6322 -6160 -14399 -10034 -7071
13436 -7071 -19146 -19702 -14651 -5550 -8923 -17504 -6061 1874 -7795 -5626 4594 1650 -7314 -9147
13422 -9147 -3405 4658 -2548 -8918 -9356 -18731 -17853 -8722 -13946 -24629 -32517 -38573 -47639 -33407 -12145
13407 -12145 -4968 1164 3635 -421 -121 9558 -634 5809 5247 304 12265 6445 -8205 -17176
13393 -17176 -19854 -16431 -2256 3235 -98 -2220 -1772 -5711 -8441 2501 14467 12690 4156 5093
$$ packed form
13494A4134q290J0805L529o693J0j506N449L743j3503k0029k094Q481R540n15
13480C061O894J3439k076J842r328o622j1840L25J8935O816m460j5391k0499q471
13466b7375J3247J3863r779m98R656M58o038n800k70P882j98k372K008P988J5215
13451A7987J664k917K806o339j5690J121O543p35r698j635N71J62q239M365K963
13436g071j2075n56N051R101l373q581J1443P935r669K169J0220k944q964j833
13422i147N742Q063p206o370m38r375Q78R131n224j0683p888o056r066J4232K1262
13407a2145P177O132K471m056L00R679j0192O443n62m943J1961n820j4650q971
13393a7176k678L423J4175N491l333k122M48l939k730J0942J1966j777q534R37
$$ plain form
13379 5093 10223 8231 1560 -6470 -13673 -15013 19244 38650 25223 15707 15339 17346 11734 -9475
13365 -9475 -21965 -13819 -11359 -9794 -10959 -2767 -5498 6368 -795 807 -1304 -6396 -281 8413
13351 8413 -5349 -396 13289 7705 13386 8090 -1165 2584 -4829 -10879 4034 13746 7299 2943
13337 2943 9633 19603 15631 26898 38703 39971 21576 8598 -9017 -17016 -9020 5238 9095
13324 9095 -1674 -4109 15328 21321 16811 16739 19827 8795 6607 5793 5004 -4383 3075 11982 10336
13309 10336 18202 12042 16004 32935 20301 18269 26297 28236 24041 25580 28422 35364 31995 18303
13295 18303 10567 6844 -8094 -5659 8344 4695 -5338 -5276 -2140 -4026 -10444 -4669 -3105 -15039
13281 -15039 -8058 6711 11109 23908 27428 18800 7368 6254 2313 2617 16050 16285 3215 255
$$ packed form
13379E093N130j992o671q030p203j340L4257J9406j3427r516l68K007n612k1209
13365i475j2490Q146K460J565j165Q192k731J1866p163J602k111n092O115Q694
13351H413j3762M953J3685n584N681n296r255L749p413o050J4913R712o447m356
13337B943O690R970l972J1267J1805J268j8395j2978j7615p999P996J4258L857
13324I095j0769k435J9437N993m510p2L088j1032k188q14p89r387P458Q907j646
13309A0336P866o160L962J6931j2634k032Q028J939m195J539K842O942l369j3692
13295A8303p736l723j4938K435J4003l649j0033O2L136j886o418N775J564j1934
13281a5039O981J4769M398J2799L520q628j1432j114l941L04J3433K35j3070k960
$$ plain form
13267 255 -1766 1747 4203 -2421 -153 3054 -5743 -9351 -13531 -8912 -12145 -10573 -12171 -2405 825
13252 825 8179 14630 15357 8891 2787 1442 746 -2657 6707 -1945 -9972 -7134 -1028 7794 6892 -6565
13236 -6565 -7401 -5472 -2436 3852 -1897 -13790 -9707 -9397 -335 -493 1161 12645 19406 12729 3929
13221 3929 -7099 -18243 -7674 12538 26866 18373 9501 -9429 -13923 -9868 -8372 -15035 -14679
13208 -14679 -29243 -31251 -29745 -30319 -13815 -7513 -2207 103 -5780 -8897 -12179 -6075 -6228 -4465
13194 -4465 -1258 -880 -339 2689 -7171 -11421 -7345 -2723 -5970 -11097 -5031 9514 12950 -5216 -11451
13179 -11451 4780 -514 -12251 -20048 -15407 -10946 -11626 1969 2578 -1655 265 -6189 -458 -902
13165 -902 6115 6348 9433 10952 19054 13845 6404 6911 12473 10402 2773 -10672 -10420 -6095 -5926 -10053
$$ packed form
13267B55k021L513K456o624K268L207q797l608m180M619l233J572j598R766L230
13252H25P354O451P27o466o104j345o96l403R364q652q027K838O106Q822r02j3457
13236f565q36J929L036O288n749j1893M083L10R062j58J654J1484O761o677q800
13221C929j1028j1144J0569K0212J4328q493q872j8930m494M055J496o663L56
13208a4679j4564k008J506n74J6504O302N306K310n883l117l282O104j53J763
13194d465L207L78N41L028r860m250M076M622l247n127O066J4545L436j8166o235
13179a1451J6231n294j1737p797M641M461o80J3595O09m233J920o454N731m44
13165i02P017K33L085J519Q102n209p441N07N562k071p629j3445K52M325J69m127
$$ plain form
13149 -10053 -1936 4348 -1204 6767 7111 7700 -4494 -19807 -14774 -8812 6814 17156 8242 392
13135 392 -4853 -923 -1598 -9649 -13173 -10557 -12627 -17104 -26734 -28338 -10877 -3694 -1784 1980 -10923
13120 -10923 -8300 7154 19128 18539 12492 12562 -2385 -13339 -16133 -5761 5781 -746 -7623 -4367
13106 -4367 7972 -5552 -13641 -16787 -5386 4845 14929 17058 1414 -4095 -7043 -6652 -5302
13093 -5302 -12092 -8138 1353 324 11226 3709 12583 19352 7492 -5863 -5088 -7410 -449 -12519
13079 -12519 -11868 -12741 -2742 1969 4629 8441 7948 3816 8767 15763 8408 10628 13694 10567 -5107
13064 -5107 -12275 -2275 6312 -7467 -13676 -8878 -3227 10167 13356 5886 -5301 -12325 -4236 -5639
13050 -5639 -15088 -16520 -11081 3193 -1364 -5470 -8072 -22242 -24731 -3319 8383 17 -4634 -11104
$$ packed form
13149a0053Q117O284n552P971L44N89j2194j5313N033N962J5626J0342q914p850
13135C92n245L930o75q051l524K616k070m477r630j604J7461P183J910L764j2903
13120a0923K623J5454J1974n89o047P0j4947j0954k794J0372J1542o527o877L256
13106d367J2339j3524q089l146J1401J0231J0084K129j5644n509k948L91J350
13093e302o790L954R491j029J0902p517Q874O769j1860j3355P75k322O961j2070
13079a2519O51q73R999M711K660L812m93m132M951O996p355K220L066l127j5674
13064e107p168J0000Q587j3779o209M798N651J3394L189p470j1187p024Q089j403
13050e639r449j432N439J4274m557m106k602j4170k489K1412J1702q366m651o470
$$ plain form
13036 -11104 -23589 -30549 -39396 -23278 -12838 -16325 -18538 -3825 2870 10805 8534 6168 4580
13023 4580 928 -7250 4825 3714 3661 -9649 -14990 -4939 5436 10140 -865 1432 7868 4901
13009 4901 238 3351 12086 19321 17571 4214 -5031 24159 27321 9682 14233 20267 20627 11951
12995 11951 14004 19455 14343 1242 -8533 -9389 -9477 -2602 -2741 -20630 -8399 -16385 -19213 -14385 -7158
12980 -7158 1193 6895 7954 9995 10742 21225 13817 15219 12756 12504 6256 -1295 2985 9031 13415
12965 13415 13716 10943 2039 -22425 -20148 -16531 -14628 -17394 -19376 -15916 -6666 2074 4549 14237
12951 14237 11174 -5933 -6209 -1357 1811 6659 1176 12105 14982 19446 18411 13934 -1606 -1326
12937 -1326 -149 17800 17221 11823 10592 14034 10748 1690 2628 13645 21770 23427 12103 8344
$$ packed form
13036a1104j2485o960q847J6118J0440l487k213J4713O695P935k271k366j588
13023D580l652q178J2075j111n3j3310n341J0051J0375M704j1005K297O436k967
13009D901m663L113Q735P235j750j3357r245K9190L162j7639M551O034L60q676
12995A1951K053N451n112j3101r775q56q8O875j39j7889J2231p986k828M828P227
12980g158Q351N702J059K041P47J0483p408J402k463k52o248p551M280O046M384
12965A3415L01k773q904k4464K277L617J903k766j982L460R250Q740K475R688
12951A4237l063j7107k76M852L168M848n483J0929K877M464j035m477j5540K80
12937a326J177J7949n79n398j231L442l286r058R38J1017Q125J657j1324l759
$$ plain form
12923 8344 -2262 -9298 5693 22480 15006 -954 -3144 15483 13180 16216 21513 16899 12952
12910 12952 11654 4283 4745 6365 -3978 -13672 -11253 -4949 -125 3757 23609 22937 19121 8274
12896 8274 -7630 -18635 -15839 -11367 7563 17705 -815 -1062 13363 25568 22888 17840 9204
12883 9204 -11464 -14869 -8175 -9781 3551 15765 12536 15648 7507 3940 1086 5096 2258 870
12869 870 19783 21996 16399 7915 68 -9643 -19336 -2054 8545 13579 14397 12467 14901 15875 18632
12854 18632 15617 17698 13335 22960 26013 20990 8904 11251 18522 23633 22709 12297 2558 3246
12840 3246 5611 15260 24075 24363 23021 32386 41405 33496 33840 25050 25542 25388 18163 20231 4399
12825 4399 -5209 1791 1918 -11534 -21946 778 22978 17168 16473 7472 -1221 -5089 -2877 1610
$$ packed form
12923H344j0606p036J4991J6787p474j5960k190J8627k303L036N297m614l947
12910A2952j298p371M62J620j0343r694K419O304M824L882J9852o72l816j0847
12896H274j5904j1005K796M472J8930J0142j8520k47J4425J2205k680n048q636
12883I204k0668l405O694j606J3332J2214l229L112q141l567k854M010k838j388
12869H70J8913K213n597q484p847r711r693J7282J0599N034Q18j930K434R74K757
12854A8632l015K081m363R625L053n023j2086K347P271N111r24j0412r739O88
12840C246K365R649Q815K88j342R365R019p909L44q790M92j54p225K068j5832
12825D399r608P000J27j3452j0412K2724K2200n810o95r001q693l868K212M487
$$ plain form
12811 1610 19012 16307 12714 2425 17265 25095 22742 15067 23908 25505 25339 26514 23115 27716
12797 27716 23615 13413 16609 13983 15549 9418 15625 31494 31734 26013 20731 36886 23678 13183
12783 13183 11376 23070 37670 44148 38113 23334 9446 15346 20397 22989 36620 26717 31256
12770 31256 34092 18744 11967 15871 10298 22437 22798 30904 37714 45098 40116 38939 23060 3040
12756 3040 3046 22241 14444 13169 9445 19012 18325 22521 28638 31096 37639 32360 35973 56012 52609
12741 52609 47291 39666 23168 24889 23998 26524 32191 35392 26751 27317 27205 27322 30343 32793 32093
12726 32093 19373 22998 32263 19986 16837 17835 25464 30602 36016 32826 36181 38662 27170 26227
12712 26227 33940 34010 20359 11357 7777 15117 13813 5254 16985 22014 14978 14299 10773 8996 3728
$$ packed form
12811A610J7402k705l593j0289J4840P830k353p675Q841J597j66J175l399M601
12797B7716m101j0202L196k626J566o131O207J5869K40n721n282J6155j3208j0495
12783A3183j807J1694J4600O478o035j4779j3888N900N051K592J3631r903M539
12770C1256K836j5348o777L904n573J2139L61Q106O810P384m982j177j5879k0020
12756C040OJ9195p797j275l724R567o87M196O117K458O543n279L613K0039l403
12741E2609n318p625j6498J721q91K526N667L201q641N66j12J17L021K450p00
12726C2093j2720L625R265j2277l149R98P629N138N414l190L355K481j1492r43
12712B6227P713P0j3651r002l580P340j304q559J1731N029p036o79l526j777n268
$$ plain form
12697 3728 15807 14990 6615 -5945 -13538 -7968 -1946 1793 -140 -3062 2809 589 4559 14705
12683 14705 21052 32193 31918 14555 4029 24577 26382 46028 53486 42137 30125 19808 33142
12670 33142 37233 38671 54063 47785 44628 52599 65071 64103 50552 48130 48243 47473 35624 32276
12656 32276 40386 39973 42304 41704 39507 36308 23930 32198 47000 50948 62632 69377 72088 65936
12642 65936 68539 70656 60554 76650 99279 99538 100838 121144 144266 135556 132084 135447 140469
12629 140469 162704 173882 181700 174940 163083 135133 111989 108259 124658 121487 112149 98313
12617 98313 75358 81920 101006 112778 109933 89639 81689 84315 90319 97772 100125 87658 93463
12604 93463 97847 94006 89592 87626 87947 89994 91420 95193 104187 107215 94212 94682 93188 88430 86625
$$ packed form
12697C728J2079q17q375j2560p593N570O022L739j933k922N871k220L970J0146
12683A4705O347J1141k75j7363j0526K0548J805J9646P458j1349j2012j0317J3334
12670C3142M091J438J5392o278l157P971J2472r68j3551k422J13p70j1849l348
12656C2276Q110m13K331o00k197l199j2378Q268J4802L948J1684O745K711o152
12642F5936K603K117j0102J6096K2629K59J300K0306K3122q710l472L363N022
12629A40469K2235J1178P818o760j1857k7950k3144l730J6399l171r338j3836
12617I8313k2955O562J9086J1772k845k0294p950K626O004P453K353j2467N805
12604I3463M384l841m414j966L21K047J426L773Q994L028j3003M70j494m758j805
$$ plain form
12589 86625 83071 78723 83127 93685 96932 101154 106903 107109 99550 83647 80060 78572 81022 64542
12575 64542 56992 66380 72411 97520 108686 107778 105652 100611 96305 90098 86160 99922 94478 83055
12561 83055 86854 93743 93317 91330 93770 101417 97692 108849 117879 101552 98868 110805 106253 100259
12547 100259 111796 111162 132353 146087 142522 148707 134606 119537 114697 120362 121053 140238 158842
12534 158842 155208 157702 155311 146724 151718 158938 164690 176934 174179 169544 165791 172993 179061 178226
12520 178226 181048 174199 182049 190868 187758 191793 195051 209314 210566 209778 211022 210705 227958 238415
12506 238415 236646 250532 260723 262526 276762 293216 300286 321130 344296 339560 338323 339770 333921
12493 333921 336099 347155 341018 339205 334764 330979 339291 349831 355450 365480 373812 388961 403002
$$ packed form
12589H6625l554m348M404J0558L247M222N749K06p559j5903l587j488K450j6480
12575F4542p550R388O031K5109J1166r08k126n041m306o207l938J3762n444j1423
12561H3055L799O889m26j987K440P647l725J1157R030j6327k684J1937m552n994
12547A00259J1537o34K1191J3734l565O185j4101j5069m840N665O91J9185J8604
12534A58842l634K494k391q587M994P220N752J2244k755m635l753P202O068q35
12520A78226K822o849P850Q819l110M035L258J4263J252p88J244l17J7253J0457
12506B38415j769J3886J0191J803J4236J6454P070K0844K3166m736j237J447n849
12493C33921K178J1056o137j813m441l785Q312J0540N619J0030Q332J5149J4041
$$ plain form
12480 403002 407889 404543 411718 424441 423737 424380 441200 467536 496702 521230 541548 555779 558160
12467 558160 569267 576026 590243 604096 610183 617791 629024 650129 664748 686843 713079 722015
12455 722015 717265 737205 743291 745124 763526 789088 806097 816435 842932 867589 892685 928016
12443 928016 960523 991076 1037259 1091435 1134783 1191504 1252650 1325195 1402738 1466449 1525888
12432 1525888 1579834 1621206 1660356 1700077 1716804 1720099 1761978 1806524 1860145 1920562 1978288
12421 1978288 2046867 2122337 2217506 2322738 2449179 2566819 2669836 2793438 2920210 3059831
12411 3059831 3217936 3394296 3573205 3785651 4016354 4243913 4494071 4759590 5024562
12402 5024562 5332315 5654917 5976936 6338582 6747340 7164162 7591919 8045155 8516079
$$ packed form
12480D03002M887l346P175J2723p04O43J6820K6336K9166K4528K0318J4231K381
12467E58160J1107O759J4217J3853O087P608J1233K1105J4619K2095K6236Q936
12455G22015m750J9940O086J833J8402K5562J7009J0338K6497K4657K5096L5331
12443I28016L2507L0553M6183N4176M3348N6721O1146P2545P7543O3711N9439
12432A525888N3946M1372L9150L9721J6727L295M1879M4546N3621O0417N7726
12421A978288O8579P5470R5169J05232J26441J17640J03017J23602J26772J39621
12411C059831J58105J76360J78909K12446K30703K27559K50158K65519K64972
12402E024562L07753L22602L22019L61646M08758M16822M27757M53236M70924
$$ plain form
12393 8516079 8982114 9469069 9957006 10428316 10881368 11316105 11701948 12026638 12294199
12384 12294199 12493842 12615688 12650130 12584977 12453083 12251338 11979898 11641715 11255451 10818980
12374 10818980 10371279 9922879 9458558 8983366 8506028 8042186 7614532 7209397 6821276
12365 6821276 6442873 6086166 5739835 5418788 5132185 4857875 4592393 4337521 4115519
12356 4115519 3895948 3683359 3503910 3331555 3176350 3035050 2901802 2772451 2638237
12347 2638237 2506333 2393662 2291083 2194162 2103549 2012529 1922267 1835659 1768685 1725608 1676390
12336 1676390 1621297 1568834 1510439 1459965 1412103 1360087 1327286 1284967 1226002 1181028 1156190
12325 1156190 1111078 1068400 1025629 987559 954395 932828 896824 863879 832765 810515 800220
$$ packed form
12393H516079M66035M86955M87937M71310M53052M34737L85843L24690K67561
12384A2294199J99643J21846L4442o5153j31894k01745k71440l38183l86264m36471
12374A0818980m47701m48400m64321m75192m77338m63842m27654m05135l88121
12365F821276l78403l56707l46331l21047k86603k74310k65482k54872k22002
12356D115519k19571k12589j79449j72355j55205j41300j33248j29351j34214
12347B638237j31904j12671j02579r6921r0613r1020r0262q6608o6974m3077m9218
12336A676390n5093n2463n8395n0474m7862n2016l2801m2319n8965m4974k4838
12325A156190m5112m2678m2771l8070l3164k1567l6004l2945l1114k2250j0295
$$ plain form
12314 800220 793778 782071 773591 742046 721219 698320 667503 655748 646198 641071 624666 608296
12302 608296 582638 587351 592387 578795 571573 544309 522699 516762 507351 513201 505937 497610 488981
12289 488981 481304 474659 465570 442111 439901 439474 437088 437785 420209 409916 394546 383682 372536
12276 372536 377573 391617 393961 389734 384493 382902 377872 367968 371095 358964 353185 340314 326890
12263 326890 331180 336143 323608 315120 307752 309572 310179 291645 279765 286980 275332 281197 282950
12250 282950 283717 285632 274008 264755 270583 277490 282614 273612 257839 248543 259111 268265 274837 262864
12236 262864 235940 232298 237893 232533 221573 221530 199801 204784 212452 218713 221776 218888 233234 241299
12222 241299 243332 247046 252409 248807 241074 255456 257214 252687 243381 242893 240497 218097 207736 206655
$$ packed form
12314H00220o442j1707q480l1545k0827k2899l0817j1755r550n127j6405j6370
12302F08296k5658M713N036j3592p222k7264k1610n937r411N850p264q327q629
12289D88981p677o645r089k3459k210m27k386O97j7576j0293j5370j0864j1146
12276C72536N037J4044K344m227n241j591n030r904L127j2131n779j2871j3424
12263C26890M290M963j2535q488p368J820O07j8534j1880P215j1648N865J753
12250B82950P67J915j1624r253N828O907N124r002j5773r296J0568R154O572j1973
12236B62864k6924l642N595n360j0960m3k1729M983P668O261L063k888J4346Q065
12222B41299K033L714N363l602p733J4382J758m527r306m88k396k2400j0361j081
$$ plain form
12208 206655 207540 204744 200270 199456 206419 201291 196613 197044 193837 193648 189020 184369 178290 174831 171185
12193 171185 167565 174354 178919 186561 193054 201483 208588 200243 205134 216200 216350 215238 215759 220349
12179 220349 224283 215310 213712 221773 226827 215131 193374 171994 171507 185478 169153 163999 172098
12166 172098 189009 195125 189579 173152 178783 173448 182681 189458 177580 158523 154914 174984 188735
12153 188735 199268 205897 190198 175256 179923 208735 230896 243953 242053 228437 230897 240507
12141 240507 253247 271705 282347 304553 325758 348198 362712 360189 360115 347166 341093 347590 371688
12128 371688 374763 354458 339692 351621 362262 342315 340223 339178 344450 368461 370531 388222
12116 388222 409416 413026 423099 439269 454276 472718 491237 508373 532973 547020 562053 578789
$$ packed form
12208B06655Q85k796m474q14O963n128m678M31l207j89m628m651o079l459l646
12193A71185l620O789M565P642O493Q429P105q345M891J1066J50j112N21M590
12179B20349L934q973j598Q061N054j1696k1757k1380m87J3971j6325n154Q099
12166A72098J6911O116n546j6427N631n335R233O777j1878j9057l609K0070J3751
12153A88735J0533O629j5699j4942M667K8812K2161J3057j900j3616K460R610
12141B40507J2740J8458J0642K2206K1205K2440J4514k523p4j2949o073O497K4098
12128C71688L075k0305j4766J1929J0641j9947k092j045N272K4011K070J7691
12116C88222K1194L610J0073J6170J5007J8442J8519J7136K4600J4047J5033J6736
$$ plain form
12104 578789 590334 599592 609000 643113 655155 667592 702639 735594 762710 790379 842382 890463
12092 890463 929259 977540 1023097 1065634 1128454 1209688 1284343 1366546 1449743 1548231 1650967
12081 1650967 1790806 1950609 2126314 2321467 2549989 2806273 3121468 3491827 3940209
12072 3940209 4469608 5084508 5819628 6708651 7747768 8958027 10337695 11854782 13428744
12063 13428744 14921172 16163179 16964807 17229293 16941798 16211608 15210105 14109623 13050555
12054 13050555 12140678 11400304 10834058 10446563 10210339 10081880 10066980 10138700 10299723 10529244
12044 10529244 10851034 11302762 11877765 12625430 13539798 14619102 15835437 17141288 18475759
12035 18475759 19800786 21110903 22400219 23616284 24727507 25708299 26495980 27087118
$$ packed form
12104E78789J1545R258R408L4113J2042J2437L5047L2955K7116K7669N2003M8081
12092H90463L8796M8281M5557M2537O2820Q1234P4655Q2203Q3197R8488J02736
12081A650967J39839J59803J75705J95153K28522K56284L15195L70359M48382
12072C940209N29399O14900P35120Q89023J039117J210259J379668J517087J573962
12063A3428744J492428J242007Q01628K64486k87495p30190j001503j100482j059068
12054A3050555r09877p40374n66246l87495k36224j28459j4900P1720J61023K29521
12044A0529244L21790M51728N75003P47665R14368J079304J216335J305851J334471
12035A8475759J325027J310117J289316J216065J111223R80792P87681N91138
$$ plain form
12027 27087118 27561084 28069424 28844760 30176941 32296925 35298301 39066745 43323556
12019 43323556 47671810 51620272 54543246 55989557 55712862 53696719 50120309 45402226
12011 45402226 40130664 34871866 30004033 25840905 22617162 20332745 18893774 18141903
12003 18141903 17907949 18069345 18578657 19316920 20143888 20897026 21358350 21355332 20809132 19733024
11993 19733024 18230245 16483590 14685452 12971457 11416020 10037370 8841983 7828712
11985 7828712 6965701 6230402 5609558 5063436 4593646 4195992 3833814 3525026 3262237
11976 3262237 3051574 2863190 2689743 2556663 2431849 2316799 2205874 2090817 1967170
11967 1967170 1844800 1724793 1636740 1553233 1468682 1387093 1306277 1240672 1186485 1147669 1104513
$$ packed form
12027B7087118M73966N08340P75336J332181K119984L001376L768444M256811
12019D3323556M348254L948462K922974J446311k76695k016143l576410m718083
12011D5402226n271562n258798m867833m163128l223743k284417j438971p51871
12003A8141903k33954J61396N09312P38263Q26968P53138M61324l018n46200j076108
11993A9733024j502779j746655j798138j713995j555437j378650j195387j013271
11985G828712q63011p35299o20844n46122m69790l97654l62178l08788k62789
11976C262237k10663j88384j73447j33080j24814j15050j10925j15057j23647
11967A967170j22370j20007q8053q3507q4551q1589q0816o5605n4187l8816m3156
$$ plain form
11956 1104513 1054216 1009221 974341 938764 915335 894244 866054 828373 791599 757985 731189
11945 731189 700683 687646 658052 639361 631548 629244 609622 593379 584097 574240 539105 529518
11933 529518 522018 503411 490017 476828 477779 455959 428583 389985 377808 393584 391138 382006
11921 382006 387191 380180 372234 372140 364836 367959 367793 359959 350833 343909 333586 318515 314234 298084
11907 298084 298703 316435 308732 301203 295385 293106 287044 281894 282294 277709 275558 276069 265358 258619
11893 258619 246777 238322 241837 258680 274488 264722 256463 258643 256616 252461 255065 248245 239938
11880 239938 259973 261225 255727 242879 242727 229874 221685 229870 229135 226052 222682 209357 212407 226187
11866 226187 209001 206466 195352 189102 195093 187963 169721 155721 152922 162481 150040 130025 132826
$$ packed form
11956A104513n0297m4995l4880l5577k3429k1091k8190l7681l6774l3614k6796
11945G31189l0506j3037k9594j8691p813k304j9622j6243r282r857l5135r587
11933E29518p500j8607j3394j3189R51k1820k7376l8598j2177J5776k446r132
11921C82006N185p011p946r4p304L123j66p834r126o924j0323j5071m281j6150
11907B98084O19J7732p703p529n818k279o062n150M00m585k151N11j0711o739
11893B58619j1842q455L515J6843J5808r766q259K180k027m155K604o820q307
11880B39938K0035J252n498j2848j52j2853q189Q185p35l083l370j3325L050J3780
11866B26187j7186k535j1114o250N991p130j8242j4000k799R559j2441k0015K801
$$ plain form
11853 132826 131537 129554 125190 131146 135953 130206 133443 126756 126394 123278 134261 142691 134139 125408
11839 125408 117417 110268 113117 121893 104042 94137 97740 89053 84636 88663 98857 97349 101879 106648
11825 106648 115294 125965 126859 119715 103307 101464 95664 78262 67976 68398 72203 79005 80150 83112
11811 83112 83339 77743 81732 88374 97115 100551 89681 91560 94238 89872 90392 91435 87388 79552 63685
11796 63685 58746 67130 68418 73201 72994 67852 67028 71691 71283 73713 76704 75381 73483 68591 61452
11781 61452 64286 74854 83832 87043 81240 86946 77810 67871 57164 45015 28972 13032 9850
11768 9850 35666 61638 72322 75412 77400 78722 64133 66107 70149 77092 91029 93728 83825
11755 83825 73243 66626 61077 46302 18597 8090 28477 41014 38658 39454 53852 67443 74747
$$ packed form
11853A32826j289j983m364N956M807n747L237o687l62l116J0983Q430q552q731
11839A25408p991p149K849Q776j7851r905L603q687m417M027J0194j508M530M769
11825A06648Q646J0671Q94p144j6408j843n800j7402j0286M22L805O802J145K962
11811H3112K27n596L989O642Q741L436j0870J879K678m366N20J043m047p836j5867
11796F3685m939Q384J288M783k07n142q24M663m08K430K991j323j898m892p139
11781F1452K834J0568Q978L211n803N706r136r939j0707j2149j6043j5940l182
11768I850K5816K5972J0684L090J988J322j4589J974M042O943J3937K699r903
11755H3825j0582o617n549j4775k7705j0507K0387J2537k356P96J4398J3591P304
$$ plain form
11742 74747 67217 49982 54159 57005 66395 67137 59231 47952 55803 63435 60753 65656 65425 69414
11728 69414 73363 71525 76840 69257 73823 74334 72270 61426 60947 60392 57620 56392 83155 106867
11714 106867 112730 117440 107938 101862 100246 91187 93668 85499 90494 92076 90068 85769 78005 71765
11700 71765 75323 86356 79104 79382 86113 82594 71590 85177 98255 91253 70066 65140 57763
11687 57763 58326 55857 49403 43084 43807 56308 75759 69044 68487 61950 53973 47066 56827 50315 56279
11672 56279 55434 48204 36579 30690 27114 28322 23535 20367 46691 61118 59552 53881 40936 37348
11658 37348 38051 31292 41419 57154 56447 50684 53510 45034 47917 54469 42229 41113 44198 39168
11644 39168 41962 52257 44597 36920 36316 49425 41314 35859 38883 38767 52837 60756 57334 59777
$$ packed form
11742G4747p530j7235M177K846R390P42p906j1279P851P632k682M903k31L989
11728F9414L949j838N315p583M566N11k064j0844m79n55k772j228K6763K3712
11714A06867N863M710r502o076j616r059K481q169M995J582k008m299p764o240
11700G1765L558J1033p252K78O731l519j1004J3587J3078p002k1187m926p377
11687E7763N63k469o454o319P23J2501J9451o715n57o537p977o907R761o512N964
11672E6279q45p230j1625n889l576J208m787l168K6324J4427j566n671j2945l588
11658C7348P03o759J0127J5735p07n763K826q476K883O552j2240j116L085n030
11644C9168K794J0295p660p677o04J3109q111n455L024j16J4070P919l422K443
$$ plain form
11630 59777 61680 53862 53459 55256 65931 70291 76410 89271 106024 109609 94999 108439 121603
11617 121603 117525 120421 126386 119441 117656 119846 114624 106777 100462 110214 108166 108490 109834 105864
11603 105864 118017 128176 146392 174373 200372 220541 247483 268480 291295 305695 318211
11592 318211 318545 317649 298660 294913 273657 250642 221991 195831 178653 158241 143971 142956 156073
11579 156073 149828 128875 125263 119054 122981 112346 120224 133177 107943 106425 100771 91264 87531
11566 87531 82951 81370 85257 75779 71406 66550 71401 92750 99286 103672 121584 129502 130444 130915
11552 130915 122591 128429 127607 110084 95694 81300 77535 62464 55860 52668 52783 49479 48314 29324
11538 29324 37253 46553 47357 45785 44311 38883 35551 27905 26861 16580 8311 15433 24857 39958
$$ packed form
11630E9777J903p818m03J797J0675M360O119J2861J6753L585j4610J3440J3164
11617A21603m078K896N965o945j785K190n222p847o315R752k048L24J344l970
11603A05864J2153J0159J8216K7981K5999K0169K6942K0997K2815J4400J2516
11592C18211L34q96j8989l747k1256k3015k8651k6160j7178k0412j4270j015J3117
11579A56073o245k0953l612o209L927j0635P878J2953k5234j518n654r507l733
11566H7531m580j581L887r478m373m856M851K1349O536M386J7912P918R42M71
11552A30915q324N838q22j7523j4390j4394l765j5071o604l192J15l304j165j8990
11538B9324P929R300Q04j572j474n428l332p646j044j0281q269P122R424J5101
$$ plain form
11524 39958 44377 45155 42813 30343 21890 21114 18457 17297 14225 6171 11996 21511 30182 30445 37871
11509 37871 30235 34993 36603 36645 22452 6822 8289 6918 8142 17201 30914 32820 36536 36831
11495 36831 37323 31834 20079 16526 10739 15121 9877 -9359 -16081 5360 17234 10341 -4590
11482 -4590 -975 15211 8219 17111 15857 7457 13050 13800 11828 -623 11006 27742 21978 25730
11468 25730 21895 14400 10420 6742 1963 13185 20722 26992 42410 39175 28482 40515 47908
11455 47908 29443 9382 -3774 1373 8264 23580 36939 44870 47140 29772 13289 19634 35824
11442 35824 48229 34403 26547 18098 13057 4551 2362 6764 7086 1034 5889 15528 22744 33655
11428 33655 28448 40549 34698 15142 11228 14942 7310 2489 4198 8755 11529 11364 15392 13797
$$ packed form
11524C9958M419P78k342j2470q453p76k657j160l072q054N825R515Q671K63P426
11509C7871p636M758J610M2j4193j5630J467j371J224R059J3713J906L716K95
11495C6831M92n489j1755l553n787M382n244j9236o722K1441J1874o893j4931
11482d590L615J6186o992Q892j254q400N593P50j972j2451J1629J6736n764L752
11468B5730l835p495l980l678m779J1222P537O270J5418l235j0693J2033P393
11455D7908j8465k0061j3156N147O891J5316J3359P931K270j7368j6483O345J6190
11442C5824J2405j3826p856q449n041q506k189M402L22o052M855R639P216J0911
11428C3655n207J2101n851j9556l914L714p632m821J709M557K774j65M028j595
$$ plain form
11414 13797 28794 25955 19978 9363 1187 5151 30940 29721 20949 14681 -2637 -15854 1176
11401 1176 4704 2977 3498 -3011 -2848 1036 4026 -2260 -14601 -21045 -24501 -17823 7360 13486 10798
11386 10798 8069 5718 -4769 -23607 -17107 -6497 -3502 -8546 -3915 -2650 7691 14425 13883 11933
11372 11933 24695 22718 3145 2580 -624 -1681 -13446 -19086 -5596 1932 13591 10690 10273 8144
11358 8144 8513 5707 -4356 -18884 -23575 -16117 -6895 4454 9278 13586 17961 13590 9629 27984
11344 27984 30169 23464 23747 28338 25549 19487 17170 10698 13507 5889 -6632 -14020 -2021 -865
11330 -865 -8631 -11781 -14639 -16264 -10882 -22760 -10060 5386 3728 5464 9282 7121 8590 3363
11316 3363 -564 -2747 -355 9085 16897 16943 10666 13192 21285 23615 15014 12469 -7147 -5700 -2537
$$ packed form
11414A3797J4997k839n977j0615q176L964K5789j219q772o268j7318j3217J7030
11401A176L528j727N21o509J63L884K990o286j2341o444l456O678K5183O126k688
11386A0798k729k351j0487j8838O500J0610K995n044M631J265J0341O734n42j950
11372A1933J2762j977j9573n65l204j057j1765n640J3490P528J1659k901m17k129
11358H144L69k806j0063j4528m691P458R222J1349M824M308M375m371l961J8355
11344B7984K185o705K83M591k789o062k317o472K809p618j2521p388J1999J156
11330h65p766l150k858j625N382j1878J2700J5446j658J736L818k161J469n227
11316C363l927k183K392R440P812M6o277K526Q093K330q601k545j9616J447L163
$$ plain form
11301 -2537 -1147 -9249 -30937 -23429 -7958 -3371 -7795 -9909 -4485 8297 8746 -3123 -4653 3673
11287 3673 6981 20748 11018 6575 6719 6542 4212 949 1221 -2080 1875 -3420 -2236 13161 6677
11272 6677 -9796 -5717 -5633 -1978 7694 8799 9400 -2996 -3581 -4802 5090 -239 -15014 -2415 3884
11257 3884 6566 5815 -6883 5821 31750 34219 31724 28919 34199 28017 16989 17101 26800 29382
11243 29382 18630 23693 20276 19655 17125 -517 -6542 -4668 4407 5187 8809 13334 13933 13606 28013
11228 28013 26857 14543 15066 9108 8692 6227 773 -1310 867 13491 21729 22429 9253 -5213
11214 -5213 -9146 -14904 -8983 -9818 -14035 -3065 8628 16526 17026 9618 16499 21111 16087 2356
11200 2356 15054 10163 3828 5317 735 -8967 -918 -332 10149 22565 21667 30325 32787 36058
$$ packed form
11301b537J390q102k1688P508J5471M587m424k114N424J2782M49j1869j530Q326
11287C673L308J3767r730m443J44j77k330l263K72l301L955n295J184J5397o484
11272F677j6473M079Q4L655R672J105O01j2396n85j221R892n329j4775J2599O299
11257C884K682p51j2698J2704K5929K469k495k805N280o182j1028J12R699K582
11243B9382j0752N063l417o21k530j7642o025J874R075P80L622M525N99l27J4407
11228B8013j156j2314N23n958m16k465n454k083K177J2624Q238P00j3176j4466
11214e213l933n758N921q35m217J0970J1693P898N00p408O881M612n024j3731
11200B356J2698m891o335J489m582r702Q049N86J0481J2416q98Q658K462L271
$$ plain form
11186 36058 31636 22571 14384 16974 25729 29524 21404 16216 7887 3718 8106 19872 24444 2173
11172 2173 -9419 -4911 -4912 -3501 -4462 -6581 -1396 91 1104 -2671 -1636 5407 2157 5239 1619
11157 1619 3740 3728 8967 8731 19338 17647 12236 20643 19045 18009 14768 5813 5711 10065 4778
11142 4778 2724 20649 15039 15703 10181 7614 1349 9317 13502 15905 15492 16041 13792 8413 7456
11127 7456 4624 13454 11765 9922 5990 6227 2912 -11337 -13992 -9739 -16489 -9321 -9025 12706 14640
11112 14640 9606 2342 -51 -10797 -21348 -20064 848 3932 11102 24887 18099 15178 7971
11099 7971 7836 9333 3305 19691 28083 15497 1469 -9231 2072 493 -11892 -18412 -30645
11086 -30645 -34182 -25421 -16008 -9253 -2555 755 2393 -8575 -11299 -8874 -10420 1565 104 8252
$$ packed form
11186C6058m422r065q187K590Q755L795q120n188q329m169M388J1766M572k2271
11172B173j1592M508jJ411r61k119N185J487J013l775J035P043l250L082l620
11157A619K121j2N239k36J0607j691n411Q407j598j036l241q955j02M354n287
11142D778k054J7925n610O64n522k567o265P968M185K403m13N49k249n379r57
11127G456k832Q830j689j843l932K37l315j4249k655M253o750P168K96K1731J934
11112A4640n034p264k393j0746j0551J284K0912L084P170J3785o788k921p207
11099G971j35J497o028J6386Q392j2586j4028j0700J1303j579j2385o520j2233
11086c0645l537Q761R413O755O698L310J638j0968k724K425j546J1985j461Q148
$$ plain form
11072 8252 11854 14445 10407 2309 7485 10513 16818 12697 8200 2306 -4410 -4453 5515 16319 9681
11057 9681 4657 479 -5577 4412 1699 -318 -6717 -8697 -5870 -21156 -18519 -6426 5359 12905
11043 12905 20563 16885 25687 16007 11190 5531 12000 22419 25829 18648 20467 25058 10849 8726
11029 8726 8025 5234 3836 13946 5211 198 -3477 4249 -727 -242 -6477 9668 13761 12159 2685
11014 2685 -812 1710 10990 -5977 -9711 -1559 -816 -5097 -6342 -17045 -16064 -2976 13680 16907
11000 16907 16455 13941 10637 3930 401 3518 273 -8763 -9713 566 3182 -1721 -8694 -5655 -6379
10985 -6379 -3782 6422 5742 10510 14177 3554 3317 -2885 -18728 -15658 -1482 6200 2420 -7550
10971 -7550 -9534 10513 26200 10263 3632 12640 11686 -376 -5930 397 12835 12824 4728 -246
$$ packed form
11072H252L602K591m038q098N176L028O305m121m497n894o716m3R968J0804o638
11057I681n024m178o056R989k713k017o399j980K827j5286K637J2093J1785P546
11043A2905P658l678Q802r680m817n659O469J0419L410p181J819M591j4209k123
11029H726p01k791j398J0110q735n013l675P726m976M85o235J6145M093j602r474
11014B685l497K522R280j6967l734Q152P43m281j245j0703R81J3088J6656L227
11000A6907m52k514l304o707l529L117l245r036r50J0279K616m903o973L039p24
10985f379K597J0204o80M768L667j0623k37o202j5843L070J4176P682l780r970
10971g550j984K0047J5687j5937o631R008r54j2062n554O327J2438j1q096m974
$$ plain form
10957 -246 -1264 -10187 -1118 3015 1223 10767 11545 8121 1299 -1781 -7523 -7966 -470 7142 15576
10942 15576 18142 9159 9746 3577 4708 5191 6922 11061 8453 12571 759 -2981 -1038 3099 1784
10927 1784 6555 11777 8017 4404 7201 10434 2472 -20698 -13469 -11901 -18283 -6301 -812 -13614
10913 -13614 -15613 -7910 9407 23263 5705 -7901 5610 1058 5191 12253 12754 14468 15000 13790
10899 13790 8042 -7805 -16893 -12488 -1880 3030 -6797 -10069 -1050 464 -3443 -12019 -6735 -6841
10885 -6841 -2159 15687 23506 21400 18357 16637 6232 4600 3773 3695 -1905 -5789 1399 10586 20415
10870 20415 15633 10719 2991 13533 19036 18033 12320 8391 15816 14537 9847 2455 -5373 655
10856 655 7622 16366 29654 28458 16685 6287 12927 8908 5084 6439 2693 706 -4363 22314
$$ packed form
10957b46j018q923R069M133j792R544P78l424o822l080n742m43P496P612Q434
10942A5576K566q983N87o169J131M83J731M139k608M118j1812l740J943M137j315
10927A784M771N222l760l613K797L233p962k3170P229J568o382J1982N489j2802
10913a3614j999P703J7317J3856j7558j3606J3511m552M133P062N01J714N32j210
10899A3790n748j5847r088M405J0608M910r827l272R019J514l907q576N284j06
10885f841M682J7846P819k106l043j720j0405j632q27p8n600l884P188R187R829
10870B0415m782m914p728J0542N503j003n713l929P425j279m690p392p828O028
10856F55O967Q744J3288j196j1773j0398O640m019l824J355l746j987n069K6677
$$ plain form
10842 22314 36829 32815 27118 30832 40109 46878 41555 36980 36133 27359 29418 44353 63696 77040
10828 77040 70195 69035 73752 87464 80897 80380 78502 74983 71780 71733 68620 69025 75215 81655 96144
10813 96144 90569 78984 64280 58435 66867 73309 77930 76155 69505 79302 87020 101296 109642 111547
10799 111547 106005 113057 123500 125404 127649 122043 119373 111943 101003 105084 114344 116565 120792 127087
10785 127087 111793 98185 92517 83122 84067 85670 79425 65632 65240 71952 72821 78726 72169 73207
10771 73207 84033 79491 78089 81678 90012 92255 86807 85908 95086 84601 84901 85347 87934 94745 98080
10756 98080 88556 52906 44616 34819 38464 48222 51427 49078 36931 37474 38355 36349 37906 31630
10742 31630 26126 11610 812 -4819 -10589 -14866 -707 15239 16638 15147 25426 26172 17752
$$ packed form
10842B2314J4515m014n697L714R277O769n323m575q47q774K059J4935J9343J3344
10828G7040o845j160M717J3712o567n17j878l519l203m7l113M05O190O440J4489
10813I6144n575j1585j4704n845Q432O442M621j775o650R797P718J4276Q346J905
10799A11547n542P052J0443J904K245n606k670p430j0940M081R260K221M227O295
10785A27087j5294j3608n668r395R45J603o245j3793l92O712Q69N905o557J038
10771G3207J0826m542j402L589Q334K243n448q99R178j0485L00M46K587O811L335
10756I8080r524l5650q290r797L645R758L205k349j2147N43Q81k006J557o276
10742C1630n504j4516j0798n631n770m277J4159J5946J399j491J0279P46q420
$$ plain form
10729 17752 4151 11958 16696 6650 1721 1270 -2165 -5496 -14308 -18909 -6037 5030 12092 -2030
10715 -2030 -3205 -9970 -1852 8369 12412 20511 -1564 -4772 5761 4911 3041 4805 14385 9725
10701 9725 4545 18984 15624 6603 10104 6391 -9906 -5116 -5404 -5139 -4391 5110 -1447 -15882 -11421
10686 -11421 -4621 1636 2312 -3288 -24869 -38025 -26714 -20173 -21019 -12742 -7281 11981 9691 1648
10672 1648 4948 3083 4882 4327 9695 12700 8149 -5626 -5003 -8529 9423 27437 24430 12243
10658 12243 15438 21377 37039 31851 13345 15194 32046 43057 43544 37087 19841 13211 3541
10645 3541 6726 2495 -8304 -7847 -9639 9989 26900 26384 10815 17178 27687 26837 25760 17236
10631 17236 20177 28434 33883 27711 27726 23552 30138 25644 29206 31699 24937 31089 31763 36443 50992
$$ packed form
10729A7752j3601P807M738j0046m929m51l435l331q812m601J2872J1067P062j4122
10715b030j175o765Q118J0221M043Q099k2075l208J0533q50j870J764R580m660
10701I725n180J4439l360r021L501l713j6297M790k88K65P48R501o557j4435M461
10686a1421O800O257O76n600k1581j3156J1311O541q46Q277N461J9262k290q043
10672A648L300j865J799n55N368L005m551j3775O23l526J7952J8014l007j2187
10658A2243L195N939J5662n188j8506J849J6852J1011M87o457j7246o630r670
10645C541L185m231j0799M57j792J9628J6911n16j5569O363J0509q50j077q524
10631A7236K941Q257N449o172J5m174O586m494L562K493o762O152O74M680J4549
$$ plain form
10616 50992 43787 39391 43055 50551 45006 49214 54391 54465 49667 56213 51198 58488 54109 46006 48823
10601 48823 43384 29071 27675 30486 31410 31969 34810 47232 52188 39369 28154 38367 52371
10588 52371 59388 64292 59361 50708 35607 29410 31795 33681 43741 44350 37503 28864 31323 34717
10574 34717 42503 56951 59815 60352 54743 56850 44502 50006 45897 44660 33404 40711 55184 55741
10560 55741 53558 55994 56303 55905 64439 73699 77202 76086 72042 55921 41092 39683 54119 67267
10546 67267 65971 65435 61204 50436 44320 48355 64133 59991 61711 59505 59933 72285 78534 89862
10532 89862 87329 72849 79359 96297 109512 114729 128982 141963 145483 143321 135633 122586 123793
10519 123793 120828 118875 122250 112007 106326 102533 106717 118738 123722 126895 138530 153157 149357
$$ packed form
10616E0992p205m396L664P496n545M208N177P4m798O546n015P290m379q103K817
10601D8823n439j4313j396K811R24N59K841J2422M956j2819j1215J0213J4004
10588E2371P017M904m931q653j5101o197K385J886J0060O09o847q639K459L394
10574C4717P786J4448K864N37n609K107j2348N504m109j237j1256P307J4473N57
10560E5741k183K436L09l98Q534R260L503j116m044j6121j4829j409J4436J3148
10546F7267j296n36m231j0768o116M035J5778m142J720k206M28J2352O249J1328
10532H9862k533j4480O510J6938J3215N217J4253J2981L520k162p688j3047J207
10519A23793k965j953L375j0243n681l793M184J2021M984L173J1635J4627l800
$$ plain form
10506 149357 149503 146423 138919 158219 165107 169446 160975 162604 166660 169612 174021 180916 169868 182969
10492 182969 194618 199111 205714 202210 193612 189545 205515 220860 212193 203505 202433 216772 234324
10479 234324 234529 245627 264510 291504 290874 288936 294935 294399 304036 313527 307419 317186 321496 326488
10465 326488 352083 369455 379028 387228 395001 409116 414874 431425 439809 442006 449880 477202 497953
10452 497953 520059 544606 557409 561459 575206 603138 627332 651481 671784 693285 731561 764977
10440 764977 801524 837070 874920 915550 966550 1016929 1065890 1113352 1179774 1260369 1352400
10429 1352400 1444379 1543399 1638735 1763583 1916852 2085000 2282306 2501619 2751413 3016973
10419 3016973 3327509 3700259 4129973 4648820 5262108 5970277 6783709 7725900 8791382
$$ packed form
10506A49357J46l080p504J9300O888M339q471J629M056K952M409O895j1048J3101
10492A82969J1649M493O603l504q598m067J5970J5345q667q688j072J4339J7552
10479B34324K05J1098J8883K6994o30j938N999n36R637R491o108R767M310M992
10465C26488K5595J7372R573Q200P773J4115N758J6551Q384K197P874K7322K0751
10452D97953K2106K4547J2803M050J3747K7932K4194K4149K0303K1501L8276L3416
10440G64977L6547L5546L7850M0630N1000N0379M8961M7462O6422Q0595R2031
10429A352400R1979R9020R5336J24848J53269J68148J97306K19313K49794K65560
10419C016973L10536L72750M29714N18847O13288P08169Q13432R42191J065482
$$ plain form
10410 8791382 9984617 11304200 12679873 14002805 15193790 16129590 16678208 16773935 16456924
10401 16456924 15802879 14941910 14002021 13091493 12279360 11596824 11081716 10715052 10468784
10392 10468784 10322848 10265293 10277037 10370303 10538788 10789863 11130183 11574247 12137443 12824901
10382 12824901 13607293 14449667 15341661 16257277 17171899 18087089 18980343 19834212 20600886
10373 20600886 21212306 21614577 21771486 21639220 21273674 20678901 19895292 18996905 18022851
10364 18022851 17005007 15996290 15012806 14091446 13229971 12464375 11820017 11304925 10891299
10355 10891299 10572716 10329698 10153815 10050212 10022866 10078808 10244676 10546036 10980049 11573174
10345 11573174 12302292 13149893 14031437 14876512 15558964 15957436 15986968 15584294 14807093
$$ packed form
10410H791382J193235J319583J375673J322932J190985R35800N48618R5727l17011
10401A6456924o54045q60969r39889r10528q12133o82536n15108l66664k46268
10392A0468784j45936n7555J1744R3266J68485K51075L40320M44064N63196O87458
10382A2824901P82392Q42374Q91994R15616R14622R15190Q93254Q53869P66674
10373B0600886O11420M02271J56909j32266l65546n94773p83609q98387r74054
10364A8022851j017844j008717r83484r21360q61475p65596o44358n15092m13626
10355A0891299l18583k43018j75883j03603k7346N5942J65868L01360M34013N93125
10345A1573174P29118Q47601Q81544Q45075O82452L98472K9532m02674p77201
$$ plain form
10336 14807093 13776879 12583966 11338985 10142388 9031807 8015112 7118216 6336313
10328 6336313 5652216 5062108 4549542 4113140 3737824 3414686 3134493 2883262 2660523
10319 2660523 2462823 2282523 2111262 1968238 1845772 1736415 1634604 1540922 1449724 1375804
10309 1375804 1306905 1241881 1195592 1130811 1080019 1033775 983353 940441 880503 842333 812365
10298 812365 778076 745336 721073 685490 659345 639398 618807 590716 586251 574383 546822 534828
10286 534828 508929 499989 488139 473116 462951 457874 440269 418837 409938 409901 415880 417513 413286
10273 413286 402979 378692 356309 348416 347969 348753 333215 318721 301372 276433 284956 284957 284053 274719
10259 274719 269503 276189 267949 260161 257831 239543 233587 224898 212224 212259 211728 210903 212080 203413 198466
$$ packed form
10336A4807093j030214j192913j244981j196597j110581j016695q96896p81903
10328F336313o84097n90108n12566m36402l75316l23138k80193k51231k22739
10319B660523j97700j80300j71261j43024j22466j09357j01811r3682r1198p3920
10309A375804o8899o5024m6289o4781n0792m6244n0422m2912n9938l8170k9968
10298H12365l4289l2740k4263l5583k6145j9947k0591k8091m465j1868k7561j1994
10286E34828k5899q940j1850j5023j0165n077j7605k1432q899l7N979J633m227
10273D13286j0307k4287k2383p893m47P84j5538j4494j7349k4939Q523Jr04r334
10259B74719n216O686q240p788k330j8288n956q689j2674L5n31q25J177q667m947
$$ plain form
10244 198466 196603 195753 189481 183916 181791 184663 180202 173069 171379 180403 183366 191738 196591 190084
10230 190084 188847 176437 166874 145389 131139 144284 153806 146136 145278 144489 144597 146789 157444 169696
10216 169696 174876 173397 157814 145393 142475 141357 146677 152323 135277 129003 119355 122035 124396
10203 124396 120530 112046 107918 109672 105717 87334 81129 95278 109217 108787 92370 66372 82198
10190 82198 94592 90379 86397 87751 82112 93474 95371 92697 94842 81229 81132 82854 82519 88192
10176 88192 84955 84519 95177 94276 92367 79348 76556 77361 71770 61510 51900 57073 49530 60524
10162 60524 58342 64619 69519 76404 64765 58327 53676 52677 56827 46758 47168 72587 65241 56983
10148 56983 50503 58715 64673 49845 46670 54285 60073 51809 46426 55978 55579 62539 62739 46062
$$ packed form
10244A98466j863q50o272n565k125K872m461p133j690R024K963Q372M853o507
10230A90084j237j2410r563k1485j4250J3145R522p670q58p89J08K192J0655J2252
10216A69696N180j479j5583j2421k918j118N320N646j7046o274r648K680K361
10203A24396l866q484m128J754l955j8383o205J4149J3939m30j6417k5998J5826
10190H2198J2394m213l982J354n639J1362J897k674K145j3613r7J722l35N673
10176H8192l237m36J0658r01j909j3019k792Q05n591j0260r610N173p543J0994
10162F0524k182O277M900O885j1639o438m651r99M150j0069M10K5419p346q258
10148E6983o480Q212N958j4828l175P615N788q264n383R552l99O960K00j6677
$$ plain form
10134 46062 31273 37336 45316 53665 58531 50750 33194 20749 16888 25731 39685 35907 55284
10121 55284 60070 53376 37680 25897 24029 32858 43777 36536 23889 28836 25270 30490 38545
10108 38545 40140 37755 34061 40679 40040 38232 51764 60280 59257 58914 59611 50467 49778 48837 46576
10093 46576 34365 22049 18458 26878 42180 52209 46385 38509 42085 50452 49182 52968 58395
10080 58395 62651 64329 62705 51476 51946 47227 58147 73641 73175 64956 72265 73986 67653 63884
10066 63884 63240 65829 62909 51642 43790 52172 58477 59445 64806 68265 65753 60861 56543 52490 57640
10051 57640 53316 44473 45756 42372 51550 54570 50039 47777 36069 49768 43859 34745 38596 44472
10037 44472 38894 42623 60879 63958 59069 52386 39697 38297 36409 29202 23678 30458 41628 48672
$$ packed form
10134D6062j4789O063P980Q349M866p781j7556j2445l861Q843J3954l778J9377
10121E5284M786o694j5696j1783j868Q829J0919p241j2647M947l566N220Q055
10108C8545J595k385l694O618o39j808J3532Q516j023l43O97r144o89r41k261
10093D6576j2211j2316l591Q420J5302J0029n824p876L576Q367j270L786N427
10080E8395M256J678j624j1229M70m719J0920J5494m66q219P309J721o333l769
10066F3884o44K589k920j1267p852Q382O305R68N361L459k512m892m318m053N150
10051E7640m324q843J283l384R178L020m531k262j1708J3699n909r114L851N876
10037D4472n578L729J8256L079m889o683j2689j400j888p207n524O780J1170P044
$$ plain form
10023 48672 44237 41277 44881 39555 49157 61668 57205 51145 48243 40544 25481 16883 32381 41244
10009 41244 23172 21743 19858 24917 28447 39631 30851 32241 24754 20927 31010 43821 44594 45580
9995 45580 54494 53487 52443 51295 56359 55669 50168 37273 41879 54352 61016 57796 66153 67292
9981 67292 84446 93961 95178 96527 88929 87621 95150 96422 88332 79353 81302 85322 85261 72837 70627
9966 70627 72971 68304 75988 83681 71926 61147 53292 52193 59304 69584 77273 85705 92308 88381
9952 88381 83091 91277 110528 122657 128211 130874 121141 112936 113383 121504 137904 131842 118213 107057
9938 107057 101370 82057 85090 79987 69763 59146 56771 54205 62087 65561 70639 76879 79886 81570
9924 81570 89816 92973 78356 71384 77781 88924 85399 84201 110945 117963 116578 129070 114845
$$ packed form
10023D8672m435k960L604n326R602J2511m463o060k902p699j5063q598J5498Q863
10009D1244j8072j429j885N059L530J1184q780J390p487l827J0083J2811P73R86
9995D5580Q914j007j044j148N064o90n501j2895M606J2473O664l220Q357J139
9981F7292J7154R515J217J349p598j308P529J272q090q979J949M020o1j2424k210
9966G0627K344m667P684P693j1755j0779p855j099P111J0280P689Q432O603l927
9952H8381n290Q186J9251J2129N554K663r733q205M47Q121J6400o062j3629j1156
9938A07057n687j9313L033n103j0224j0617k375k566P882L474N078O240L007J684
9924H1570Q246L157j4617o972O397J1143l525j198K6744P018j385J2492j4225
$$ plain form
9911 114845 108316 107163 95195 94158 93738 88052 76054 60595 63254 51986 48818 46548 48698 54338
9897 54338 56070 61736 74112 85104 79292 61562 54105 56834 47036 30405 24971 20441 23303 24765
9883 24765 26817 23005 28160 25175 17132 15291 16540 15919 14919 15208 12755 22794 39083 49268
9869 49268 52112 42987 38763 28029 18488 22280 19211 29801 30219 22337 31787 38760 45090 44066
9855 44066 38561 31420 30899 20434 25240 34487 32142 29928 33574 27309 10823 5820 10931 13504
9841 13504 11266 13958 20867 23455 12264 15644 26702 32697 33500 23643 30617 31030 27624 32048 33351
9826 33351 27579 25430 12822 4993 1136 -5322 2716 18192 23269 27426 33286 34019 19532 18630
9812 18630 8578 -3895 1602 9365 14023 14651 9112 -8316 -10830 -11781 -12182 -16581 -64 23088
$$ packed form
9911A14845o529j153j1968j037m20n686j1998j5459K659j1268l168k270K150N640
9897E4338J732N666J2376J0992n812j7730p457K729r798j6631n434m530K862J462
9883B4765K052l812N155k985q043j841J249o21j000K89k453J0039J6289J0185
9869D9268K844r125m224j0734r541L792l069J0590M18p882R450O973O330j024
9855D4066n505p141n21j0465M806R247k345k214L646o265j6486n003N111K573
9841A3504k238K692O909K588j1191L380J1058N995Q03r857O974M13l406M424J303
9826C3351n772k149j2608p829l857o458Q038J5476N077M157N860P33j4487r02
9812A8630j0052j2473N497P763M658O28n539j7428k514r51m01m399J6517K3152
$$ plain form
9798 23088 42422 49338 39847 23131 8561 7319 25296 24946 19724 20190 14692 14987 12179 13634
9784 13634 15796 16213 10392 10441 11781 25599 37326 21803 14748 8494 18620 18337 656 -9557
9770 -9557 -4908 -6090 -1750 1832 10370 15410 11524 -7 12622 31061 18867 15308 18231 1927
9756 1927 380 3682 -214 -7453 -6800 -5857 -2958 14917 22079 8943 7473 19300 20173 17820 45575
9741 45575 65124 50956 21129 12189 21322 15200 10693 13633 9414 635 7919 4676 7656 3195
9727 3195 -4186 -6399 -7771 -6143 9012 2456 15223 28897 24096 19616 11602 13777 19241 19174 8972
9712 8972 10022 10533 17967 16273 13940 20615 27262 19463 20454 29402 17763 2079 -2112 3662 11999
9697 11999 5457 2634 1166 -11519 -3214 6342 12572 15887 7555 15972 15254 9469 1029 -6343 -22000
$$ packed form
9798B3088J9334O916r491j6716j4570j242J7977l50n222M66n498K95k808J455
9784A3634K162M17n821M9J340J3818J1727j5523p055o254J0126k83j7681j0213
9770i557M649j182M340L582Q538N040l886j1531J2629J8439j2194l559K923j6304
9756A927j547L302l896p239O53R43K899J7875P162j3136j470J1827Q73k353K7755
9741D5575J9549j4168k9827q940R133o122m507K940m219q779P284l243K980m461
9727C195p381k213j372J628J5155o556J2767J3674m801m480q014K175N464o7j0202
9712H972J050N11P434j694k333O675O647p799R91Q948j1639j5684m191N774Q337
9697A1999o542k823j468j2685Q305R556O230L315q332Q417p18n785q440p372j5657
$$ plain form
9682 -22000 -36134 -34381 -26131 -20878 -18311 -4693 6810 3705 -1171 -5043 -17899 -13737 -13305 -12902
9668 -12902 -15917 -7460 -9506 -10180 -9417 -3342 9855 9171 7933 16690 13412 5825 -782 4871 4569
9653 4569 -2108 -6831 -7681 -9128 -13288 -17200 -14269 1589 3258 -1919 881 -7058 -16143 -14060 -4820
9638 -4820 -5107 289 -3026 -15331 -9987 6957 16987 6516 8090 5513 2775 7536 -6490 -12852
9624 -12852 7101 14392 15717 11182 19644 17955 11388 5966 -7758 -10477 -7991 -3365 -7856 -10188
9610 -10188 -12864 -8861 -4781 -5568 -1319 4825 3292 9794 3811 -3317 -8725 -11152 -18312 -10198 -158
9595 -158 7585 8334 2253 14615 24555 17850 30314 35077 21573 8832 -549 -9127 -4265 -1159
9581 -1159 -4363 1997 13497 12226 13204 2278 1909 2853 279 5307 6785 3923 297 5295 9994
$$ packed form
9682b2000j4134J753Q250N253K567J3618J1503l105m876l872j2856M162M32M03
9668a2902l015Q457k046o74P63O075J3197o84j238Q757l278p587o607N653l02
9653D569o677m723q50j447m160l912K931J5858J669n177K800p939r085K083R240
9638d820k87N396l315j2305N344J6944J0030j0471J574k577k738M761j4026o362
9624a2852J9953P291J325m535Q462j689o567n422j3724k719K486M626m491k332
9610a0188k676M003M080p87M249O144j533O502n983p128n408k427p160Q114J0040
9595a58P743P49o081J2362R940o705J2464M763j3504j2741r381q578M862L106
9581a159l204O360J1500j271R78j0926l69R44k574N028J478k862l626M998M699
$$ plain form
9566 9994 2665 1642 4273 3782 897 -3756 -4815 -5056 -4982 3065 16037 13682 6832 -6040 -1545
9551 -1545 -2059 3268 6934 14953 16632 13746 19919 21084 23290 22240 22229 28760 34601 28860 33512 30856
9535 30856 23866 30671 31357 13493 10440 20470 25102 4944 -11547 -19922 -12999 -43 8717 4835
9521 4835 10700 16473 7942 7065 9470 20580 33367 26292 22615 23447 17677 15943 24016 22472 3141
9506 3141 -6172 -1091 7244 -8226 -11773 -6044 3909 10592 -1836 -6153 -3533 7070 3716 -6372
9492 -6372 -3813 2393 9387 6130 -872 234 17652 21733 17978 14913 8270 1095 -690 2640 -5066
9477 -5066 -2736 -2194 -10913 -3527 4307 8560 6155 -6861 -2506 12453 3612 3740 4354 14378 22540
9462 22540 22790 22454 13002 17630 24754 21118 39459 39873 29596 36810 26009 9518 9533 4657 4321
$$ packed form
9566I994p329j023K631m91k885m653j059k41P4Q047J2972k355o850j2872M495
9551a545n14N327L666Q019J679k886O173J165K206j050j1O531N841n741M652k656
9535C0856o990O805O86j7864l053J0030M632k0158j6491q375O923J2956Q760l882
9521D835N865N773q531q77K405J1110J2787p075l677Q32n770j734Q073j544j9331
9506C141r313N081Q335j5470l547N729R953O683j2428m317K620J0603l354j0088
9492f372K559O206O994l257p002J106J7418M081l755l065o643p175j785L330p706
9477e066K330N42q719P386P834M253k405j3016M355J4959q841J28O14J0024Q162
9462B2540K50l36r452M628P124l636J8341M14j0277P214j0801j6491J5m876l36
$$ plain form
9447 4321 -606 11481 23914 29451 26202 30255 32103 39196 37468 28008 27345 18524 18596 23371 42512
9432 42512 39970 27455 34982 29513 22849 22586 22513 25470 28259 29158 28076 30309 35453 32468 34213
9417 34213 44337 41906 26587 17928 31000 33235 26164 29037 21277 10913 10990 15130 16748 10244
9403 10244 1724 -9574 -5060 -1756 -6715 -1492 -11554 -3833 13189 14212 17135 13866 12249 14819
9389 14819 21448 13444 12032 19749 29597 23778 15314 13783 15069 2096 -2450 2609 2398 -740 -11880
9374 -11880 -5338 18580 21717 12917 25211 40481 34959 22628 10045 21138 40507 39716 28616
9361 28616 20394 25009 26676 25968 19043 4955 23656 36893 28589 28815 46971 66198 56713 37421
9347 37421 21340 29735 55768 67117 61598 43142 27682 28108 32297 42375 57276 46123 54475
$$ packed form
9447D321m927J2087J2433N537l249M053J848P093j728r460o63q821P2M775J9141
9432D2512k542j2515P527n469o664k63p3K957K789Q99j082K233N144k985J745
9417C4213J0124k431j5319q659J3072K235p071K873p760j0364P7M140J618o504
9403A0244q520j1298M514L304m959N223j0062P721J7022J023K923l269j617K570
9389A4819O629q004j412P717R848n819q464j531J286j2973m546N059k11l138j1140
9374a1880O542K3918L137q800J2294J5270n522j2331j2583J1093J9369p91j1100
9361B8616q222M615J667p08o925j4088J8701J3237q304K26J8156J9227r485j9292
9347C7421j6081Q395K6033J1349n519j8456j5460M26M189J0078J4901j1153Q352
$$ plain form
9334 54475 71033 78309 80273 84016 81867 81879 101779 96414 87678 85789 115464 137836 150659 179691
9320 179691 207556 229099 265182 310528 372656 453511 549688 650138 751405 838356 923948
9309 923948 1000590 1041462 1051504 998997 922212 834842 737384 639107 552559 466603 400864 356861
9297 356861 303633 262154 226561 221854 213110 201936 182294 158209 156634 153671 146613 150424 160286
9284 160286 160552 152428 158564 153079 153292 144659 149953 147645 131433 131234 153054 165101 164361 157664 164600
9269 164600 171963 176610 184667 177044 182020 203234 210113 222928 231255 242794 263171 278325 279941
9256 279941 294621 302167 320873 343754 360399 377908 390236 408208 432000 451763 473340 496568
9244 496568 516228 545543 574960 604239 623160 642098 668855 687507 704032 702541 701888 693877
$$ packed form
9334E4475J6558P276J964L743k149J2J9900n365q736j889K9675K2372J2823K9032
9320A79691K7865K1543L6083M5346O2128Q0855R6177J00450J01267Q6951Q5592
9309I23948P6642M0872J0042n2507p6785q7370r7458r8277q6548q5956o5739m4003
9297C56861n3228m1479l5593m707q744j1174j9642k4085j575k963p058L811R862
9284A60286K66q124O136n485K13q633N294k308j6212j99K1820J2047p40o697O936
9269A64600P363M647Q057p623M976K1214O879J2815Q327J1539K0377J5154J616
9256B79941J4680P546J8706K2881J6645J7509J2328J7972K3792J9763K1577K3228
9244D96568J9660K9315K9417K9279J8921J8938K6757J8652J6525j491o53q011
$$ plain form
9232 693877 688181 677212 659843 648404 633108 600938 569153 552201 518571 472092 437584 412826
9220 412826 382288 341596 286255 240028 200963 158613 118204 70803 52620 82755 146989 205777
9208 205777 239559 248549 252089 262511 266528 252267 229852 219185 211328 209901 191322 190127 187034
9195 187034 188729 191556 187956 197196 195702 177298 161934 153980 141172 146540 164848 162940 150418
9182 150418 136723 152194 152424 155726 149662 145232 139858 141874 148326 148050 150613 156443 162568 162968 181589
9167 181589 184438 211385 259286 299086 288864 263292 244522 218771 189477 161484 140552 135654
9155 135654 132799 131103 124251 119431 104963 93074 85886 95888 90884 93807 87679 86785 67556 80192
9141 80192 89647 88573 95699 85378 86519 81076 84480 96347 86884 86175 89193 85531 80423 86952
$$ packed form
9232F93877n696j0969j7369j1439j5296l2170l1785j6952l3630m6479l4508k4758
9220D12826l0538m0692n5341m6227l9065m2350m0409m7401j8183L0135O4234N8788
9208B05777L3782Q990L540J0422M017j4261k2415j0667p857j427j8579j195l093
9195A87034J695K827l600R240j494j8404j5364p954j2808N368J8308j908j2522
9182A50418j3695J5471K30L302o064m430n374K016O452k76K563N830O125M00J8621
9167A81589K849K6947M7901L9800j0222k5572j8770k5751k9294k7993k0932m898
9155A35654k855j696o852m820j4468j1889p188J0002n004K923o128q94j9229J2636
9141H0192R455j074P126j0321J141n443L404J1867r463p09L018l662n108O529
$$ plain form
9127 86952 78990 71083 85501 105023 126011 123328 118422 110009 107001 95926 80898 92710 93834
9114 93834 87850 95709 99782 108210 121313 118631 99726 89227 82280 65749 46193 53558 75334
9101 75334 72462 63115 64681 64964 82023 109885 126754 134744 132872 123919 116843 106078 97456 88631
9087 88631 77159 71462 82152 75020 84343 95752 96175 92361 89088 95778 105540 92752 96184 99288
9073 99288 96365 93769 95267 105868 106942 113220 113979 102192 96748 91138 89401 88058 91532 98732
9059 98732 90912 88305 86564 69278 51849 52828 62791 74544 72046 73336 76111 68627 59286 49504
9045 49504 42226 35029 20258 6737 -14995 -35837 -51891 -38547 27748 123039 186567 228459
9033 228459 235736 211645 191960 185480 192351 204503 207762 202585 202891 192331 190913 194306 196455 190754
$$ packed form
9127H6952p962p907J4418J9522K0988k683m906q413l008j1075j5028J1812J124
9114I3834n984P859M073Q428J3103k682j8905j0499o947j6531j9556P365K1776
9101G5334k872r347J566K83J7059K7862J6869P990j872q953p076j0765q622q825
9087H8631j1472n697J0690p132R323J1409M23l814l273O690R762j2788L432L104
9073I9288k923k596J498J0601J074O278P59j1787n444n610j737j343L474P200
9059I8732p820k607j741j7286j7429R79R963J1753k498J290K775p484r341r782
9045D9504p278p197j4771j3521k1732k0842j6054J3344O6295R5291O3528M1892
9033B28459P277k4091j9685o480O871J2152L259n177L06j0560j418L393K149n701
$$ plain form
9019 190754 185950 179417 184996 194976 197510 208320 219631 213967 207142 208372 229811 238174 246526 269366
9005 269366 278906 300448 319872 332696 323844 326502 315828 322364 312000 300263 295373 298450 311987
8992 311987 317611 330825 350149 377480 387753 391376 392102 407250 423098 427907 434524 455562 475786
8979 475786 474826 469433 466122 467913 479165 493090 493740 502899 524301 549338 578241 606736 632741
8966 632741 645946 672454 702863 724469 750601 789756 806783 824965 850189 890913 930899 967305
8954 967305 1002753 1040801 1103668 1192580 1291223 1391135 1487253 1567694 1648072 1733898 1824722 1947522
8942 1947522 2083805 2229046 2383364 2567487 2783000 3038297 3356436 3752867 4234963 4795734
8932 4795734 5444338 6078719 6649146 7265119 8043218 9054681 10339749 11954333 13941912
$$ packed form
9019A90754m804o533N579R980K534J0810J1311n664o825J230K1439Q363Q352K2840
9005B69366R540K1542J9424J2824q852K658j0674O536j0364j1737m890L077J3537
8992C11987N624J3214J9324K7331J0273L623P26J5148J5848M809O617K1038K0224
8979D75786r60n393l311J791J1252J3925O50R159K1402K5037K8903K8495K6005
8966F32741J3205K6508L0409K1606K6132L9155J7027J8182K5224M0724L9986L6406
8954I67305L5448L8048O2867Q8912R8643R9912R6118Q0441Q0378Q5826R0824J22800
8942A947522J36283J45241J54318J84123K15513K55297L18139L96431M82096N60771
8932D795734O48604O34381N70427O15973P78099J011463J285068J614584J987579
$$ plain form
8923 13941912 16298693 18903754 21676547 24882945 29133003 35174669 43961581 57022592
8915 57022592 76878853 107393496 153218913 215383317 280063217 313422538 293060652
8908 293060652 236959294 175495042 126214877 91940287 69067294 53687314 43068687
8901 43068687 35560500 30161425 26276370 23443085 21239125 19234547 17178159 15144788
8893 15144788 13257684 11613419 10224776 9065705 8102553 7315694 6649948 6094695 5623590
8884 5623590 5214803 4848206 4524593 4241472 3985860 3719705 3474349 3273331 3085824 2923549
8874 2923549 2772488 2628276 2496507 2384271 2294219 2215814 2119552 2021051 1939398 1849678 1766506
8863 1766506 1699039 1621635 1539325 1471762 1402632 1346283 1299298 1241308 1185525 1142167 1114654
$$ packed form
8923A3941912K356781K605061K772793L206398M250058O041666Q786912J3061011
8915E7022592J9856261L0514643M5825417O2164404O4679900L3359321k0361886
8908B93060652n6101358o1464252m9280165l4274590k2872993j5379980j0618627
8901D3068687p508187n399075l885055k833285k203960k004578k056388k033371
8893A5144788j887104j644265j388643j159071r63152p86859o65746n55253m71105
8884E623590m08787l66597l23613k83121k55612k66155k45356k01018j87507j62275
8874B923549j51061j44212j31769j12236r0052p8405r6262r8501q1653q9720q3172
8863A766506o7467p7404q2310o7563o9130n6349m6985n7990n5783m3358k7513
$$ plain form
8852 1114654 1082396 1045598 1000645 959121 926450 887782 849049 809678 784641 757247 727265
8841 727265 694875 686275 672633 663589 652153 644909 626129 604191 579999 558431 534147 534166 534792
8828 534792 530099 531469 514462 504893 489852 452797 431338 410026 395323 384460 380792 387848 388093
8815 388093 385180 383249 396718 386457 356656 352432 373864 381796 363906 356949 353581 345536 322023
8802 322023 316796 323458 327823 323902 313215 284666 266217 265032 261938 251416 243567 243944 245920 239922
8788 239922 231769 220755 229885 272130 331080 385676 411631 422248 409405 378897 362144 349638
8776 349638 345353 333293 322291 308477 274241 252945 256764 253141 251786 251292 253690 247891 242901
8763 242901 226087 208110 216820 228731 233123 237601 229280 214180 200575 182984 159846 147669
$$ packed form
8852A114654l2258l6798m4953m1524l2671l8668l8733l9371k5037k7394k9982
8841G27265l2390q600j3642r044j1436p244j8780k1938k4192k1568k4284J9O26
8828E34792m693J370j7007r569j5041l7055k1459k1312j4703j0863l668P056K45
8815C88093k913j931J3469j0261k9801m224K1432P932j7890o957l368q045k3513
8802C22023n227O662M365l921j0687k8549j8449j185l094j0522p849L77J976n998
8788B39922q153j1014R130M2245N8950N4596K5955J0617j2843l0508j6753j2506
8776C49638m285j2060j1002j3814l4236k1296L819l623j355m94K398n799m990
8763B42901j6814j7977Q710J1911M392M478q321j5100j3605j7591k3138j2177
$$ plain form
8751 147669 145236 157304 159521 155765 149382 159537 167652 164299 167664 173334 176428 183264 182411 163174
8737 163174 144583 143778 160827 168770 154794 146069 143793 131258 113972 105007 105963 103171 99179 115206
8723 115206 139406 163574 171361 167551 158630 160142 161485 157249 154745 146711 128746 90276 87708
8710 87708 87692 91447 86024 92069 105074 115138 119804 122698 119457 102411 103365 104074 99188 95018 94149
8695 94149 101820 114748 117449 104174 95711 98798 105233 111212 103584 105501 99190 91343 89466 85717
8681 85717 83094 78344 79352 80883 84585 80725 96260 102156 101897 94281 88909 86174 81749 82645 78373
8666 78373 61123 51115 38755 40160 49283 69295 85121 99827 95819 100057 95510 74912 68682
8653 68682 69283 60640 52188 48644 51324 60317 78103 81566 74828 66654 55393 54275 64128 70427
$$ packed form
8751A47669k433J2068K217l756o383J0155Q115l353L365N670L094O836q53j9237
8737A63174j8591q05J7049P943j3976q725k276j2535j7286q965R56k792l992J6027
8723A15206K4200K4168P787l810q921J512J343m236k504q034j7965l8470k568
8710H7708j6L755n423O045J3005J0064M666K894l241j7046R54P09m886m170q69
8695I4149P671J2928K701j3275q463L087O435N979p628J917o311p847j877l749
8681H5717k623m750J008J531L702l860J5535N896k59p616n372k735m425Q96m272
8666G8373j7250j0008j2360J405R123K0012J5826J4706m008M238m547k0598o230
8653F8682O01q643q452l544K680Q993J7786L463o738q174j1261j118R853O299
$$ plain form
8639 70427 73763 74059 73949 68882 57622 61192 62101 64297 54161 53206 71626 87240 86089 77364 64069
8624 64069 64580 74240 76937 73768 79438 72983 62717 58786 46810 42242 65435 82846 108718 144512
8610 144512 202622 281144 363153 400271 356173 325166 312573 299611 290966 290989 283378 274078 269269
8597 269269 265480 259909 266034 253790 229394 214081 203374 191637 173315 156760 147979 165223
8585 165223 179960 170216 152167 133101 116740 114544 113987 115505 97943 86336 96188 100882 90132
8572 90132 73823 73578 82605 100396 110533 106365 109300 102610 98399 101681 107930 101328 95524 93035
8558 93035 101052 107433 105948 104424 90903 81908 86905 82536 68503 56562 61483 71024 84007 97976
8544 97976 98492 90554 102874 112219 112846 112581 107377 106557 101251 102005 97114 93977 103701 93340 95100
$$ packed form
8639G0427L336K96j10n067j1260L570R09K196j0136r55J8420J5614j151q725j3295
8624F4069N11R660K697l169N670o455j0266l931j1976m568K3193J7411K5872L5794
8610A44512N8110P8522Q2009L7118m4098l1007j2593j2962q645K3p611r300m809
8597B69269l789n571O125j2244k4396j5313j0707j1737j8322j6555q781J7244
8585A65223J4737r744j8049j9066j6361k196n57J518j7562j1607R852M694j0750
8572I0132j6309k45R027J7791J0137m168K935o690m211L282O249o602n804k489
8558I3035Q017O381j485j524j3521q995M997m369j4033j1941M921R541J2983J3969
8544I7976N16p938J2320R345O27k65n204q20n306P54m891l137R724j0361J760
$$ plain form
8529 95100 90080 85259 81567 92591 94382 99934 112279 121955 139825 169601 205844 231107 255940
8516 255940 290669 359045 442258 523245 600866 694744 803641 896693 954725 1005457 1019435
8505 1019435 1001178 954409 879458 776692 671542 576784 485432 391415 325681 283403 257518
8494 257518 235595 196865 164922 151156 131213 114874 100504 91745 87660 100450 96862 82809
8482 82809 67309 49515 41462 52317 60001 61902 59218 60451 54977 50416 59039 57487 54386 52590
8468 52590 35685 33897 22062 13153 28902 32689 38350 62316 70336 64727 46868 40183 39800 34508
8454 34508 38330 49938 51890 39271 28144 31982 50072 55604 57166 60935 64796 58862 52843 58803
8440 58803 50122 44986 39134 34555 47380 58536 41517 41889 56073 51891 49168 43087 34246 39020
$$ packed form
8529I5100n020m821l692J1024J791N552J2345R676J7870K9776L6243K5263K4833
8516B55940L4729O8376Q3213Q0987P7621R3878J08897R3052N8032N0732J3978
8505A019435j8257m6769p4951j02766j05150r4758r1352r4017o5734m2278k5885
8494B57518k1923l8730l1943j3766j9943j6339j4370q759m085J2790l588j4053
8482H2809j5500j7794q053J0855P684J901k684J233n474m561Q623j552l101j796
8468E2590j6905j788j1835q909J5749L787N661K3966Q020n609j7859o685l83n292
8454C4508L822J1608J952j2619j1127L838J8090N532J562L769L861n934o019N960
8440E8803q681n136n852m579J2825J1156j7019L72J4184m182k723o081q841M774
$$ plain form
8426 39020 61093 77824 65624 57951 57113 48900 49646 56657 51932 39538 43846 54196 54083 43953
8412 43953 35095 45818 48299 44348 46019 51620 52447 42049 41102 46531 62093 60304 58436 52328
8398 52328 59120 63401 60950 57120 51641 30956 32316 45313 48129 49632 44745 44834 44567 45166 37044
8383 37044 29418 45733 54820 62873 55379 39315 32856 33007 36677 34071 38846 46351 44596 34048
8369 34048 42955 47886 33794 10084 20392 23159 26128 17983 35589 40816 32587 21243 30170
8356 30170 43574 46167 51214 47892 43608 56176 69318 63611 49991 44942 53562 40066 17139
8343 17139 7099 21360 43069 62171 55399 39872 37619 39633 39948 41412 37528 37212 42790 32589
8329 32589 24178 31971 34056 19691 10468 16920 27945 35472 19290 12722 13473 16240 15069 20007
$$ packed form
8426C9020K2073J6731j2200p673q38q213P46P011m725j2394M308J0350j13j0130
8412D3953q858J0723K481l951J671N601Q27j0398r47N429J5562j789j868o108
8398E2328O792M281k451l830n479k0685J360J2997K816J503m887Q9k67N99q122
8383C7044p626J6315R087Q053p494j6064o459J51L670k606M775P505j755j0548
8369C4048Q907M931j4092k3710J0308K767K969q145J7606N227q229j1344Q927
8356C0170J3404K593N047l322m284J2568J3142n707j3620n049Q620j3496k2927
8343A7139j0040J4261K1709J9102o772j5527k253K014L15J464l884l16N578j0201
8329C2589q411P793K085j4365r223O452J1025P527j6182o568P51K767j171M938
$$ plain form
8315 20007 34689 27593 14249 27223 31092 32933 27571 30478 27502 12370 -3651 928 13925
8302 13925 28587 33310 15266 15092 28020 32063 30233 12560 18191 17767 14033 12275 14134 24224
8288 24224 31957 32336 20875 21797 36292 47913 31520 26168 20979 28617 33150 33239 36845 29029 22008
8273 22008 16315 28578 24584 4906 -541 20617 24966 20721 15860 20450 22635 25563 32963 30472
8259 30472 26263 26586 23414 17821 7956 19666 31637 35248 36365 34178 23175 8849 16194 10099
8245 10099 14370 26980 25535 15371 32909 29161 20560 15852 17537 24478 34255 36915 33527 32633
8231 32633 25739 24175 33122 26927 24212 21129 29662 26906 35311 31295 19287 14224 6665 10881
8217 10881 21200 17235 6944 7000 13371 16280 17763 17076 10337 21831 35660 29501 27594 23466
$$ packed form
8315B0007J4682p096j3344J2974L869J841n362K907k976j5132j6021M579J2997
8302A3925J4662M723j8044j74J2928M043j830j7673N631m24l734j758J859J0090
8288B4224P733L79j1461R22J4495J1621j6393n352n189P638M533Q9L606p816p021
8273B2008n693J2263l994j9678n447K1158M349m245m861M590K185K928P400k491
8259C0472m209L23l172n593r865J1710J1971L611J117k187j1003j4326P345o095
8245A0099M271J2610j445j0164J7538l748q601m708J685O941R777K660l388q94
8231C2633o894j564Q947o195k715l083Q533k756Q405m016j2008n063p559M216
8217A0881J0319l965j0291N6O371K909J483o87o739J1494J3829o159j907m128
$$ plain form
8203 23466 17557 17347 14260 1060 3690 4444 -4608 6719 23028 21512 20061 25912 28582 19383
8189 19383 3125 640 -2074 -2712 242 -1511 12479 15978 24051 36827 24928 9201 2254 -1971
8175 -1971 6441 14336 20895 24425 20476 22125 26236 28187 8337 -1888 1128 4357 7305 16076
8161 16076 11630 19495 17389 21583 36634 50869 44489 28628 24461 13964 6759 7632 12647 23967
8147 23967 27187 27625 26948 11190 -1412 -5952 -9279 -4602 3137 4231 8393 10290 20454 37514
8133 37514 35520 25409 23323 28097 13660 10145 4796 10784 7650 532 11583 28088 27987 16974
8119 16974 8397 22301 11365 2782 4587 9276 14453 14900 5032 1377 -4772 65 -10933 -10037
8105 -10037 3198 1255 15237 20255 18141 28098 18100 3456 -4279 -1131 13359 25899 26247 16561
$$ packed form
8203B3466n909k10l087j3200K630P54r052J1327J6309j516j451N851K670r199
8189A9383j6258k485k714o38K954j753J3990L499Q073J2776j1899j5727o947m225
8175a971Q412P895O559L530l949J649M111J951j9850j0225L016L229K948Q771
8161A6076m446P865k106M194J5051J4235o380j5861m167j0497p205Q73N015J1320
8147B3967L220M38o77j5758j2602m540l327M677P739J094M162J897J0164J7060
8133C7514j994j0111k086M774j4437l515n349N988l134p118J1051J6505j01j1013
8119A6974q577J3904j0936q583J805M689N177M47r868l655o149M837j0998Q96
8105a0037J3235j943J3982N018k114R957r998j4644p735L148J4490J2540L48r686
$$ plain form
8091 16561 25776 28271 34405 34793 18282 22338 38499 40311 28559 27228 21052 13958 15673 32624
8077 32624 30421 26049 6363 -9419 4375 2779 8108 24623 25641 17649 16647 19756 22321 28293
8063 28293 35225 32756 16624 5083 640 4746 18220 7079 -6141 -14985 -15653 3745 9091
8050 9091 18334 17650 26978 25055 11455 11909 14960 4035 4907 21116 30380 21942 22562 6740 -7612
8035 -7612 -8466 -13601 -11912 -9984 7505 16764 11379 2150 -9574 2639 1690 -10783 -308 18946
8021 18946 15526 12806 3732 1889 11705 16563 13683 1955 5318 8343 9588 22501 27953 33764
8007 33764 29868 21905 23213 20107 29468 23046 17222 13083 5680 9563 23785 14280 2870 19909
7993 19909 13363 -5230 2906 27046 48440 45536 29382 12574 8562 11367 20713 19871 23722 13370
$$ packed form
8091A6561R215K495O134L88j6511M056J6161J812j1752j331o176p094J715J6951
8077C2624k203m372j9686j5782J3794j596N329J6515J018p992j002L109K565N972
8063B8293O932k469j6132j1541m443M106J3474j1141j3220q844o68J9398N346
8050I091R243o84R328j923j3600M54L051j0925Q72J6209R264q438O20j5822j4352
8035g612q54n135J689J928J7489R259n385r229j1724J2213r49j2473J0475J9254
8021A8946l420k720r074j843R816M858k880j1728L363L025J245J2913N452N811
8007C3764l896p963J308l106R361o422n824m139p403L883J4222r505j1410J7039
7993A9909o546j8593Q136K4140K1394k904j6154j6808m012K805R346q42L851j0352
$$ plain form
7979 13370 -11812 -12262 2780 13576 7595 11821 22606 19250 37698 41925 31058 22775 10383
7966 10383 11646 20106 32721 33701 20102 7571 7816 26851 30610 37641 47833 39832 32132 26675
7952 26675 15416 9706 10472 15399 6836 -6136 9871 5276 -6292 -4959 9757 17714 21762 15168
7938 15168 12433 20097 23893 25561 20938 7803 10314 15974 24233 32612 31321 40177 42300 34893
7924 34893 24855 20415 24733 20513 14022 11876 7896 -6600 -7884 5462 13255 12567 23967 33654
7910 33654 32814 29976 27308 20381 17966 22988 33173 24127 21451 24329 14872 11201 11711 8909 5635
7895 5635 6745 7832 24896 20955 15444 11753 3017 -8652 -17988 -21845 -15450 2253 5325 11556
7881 11556 2839 -11503 -5913 -3050 876 13383 14699 2700 9022 21760 10936 11820 12268 18107
$$ packed form
7979A3370k5182m50J5042J0796n981M226J0785l356J8448M227j0867q283j2392
7966A0383J263Q460J2615R80j3599j2531K45J9035L759P031J0192q001p700n457
7952B6675j1259n710P66M927q563j2972J6007m595j1568J333J4716P957M048o594
7938A5168k735P664L796J668m623j3135K511N660Q259Q379j291Q856K123p407
7924C4893j0038m440M318m220o491k146l980j4496j284J3346P793o88J1400R687
7910C3654q40k838k668o927k415N022J0185r046k676K878r457l671N10k802l274
7895E635J110J087J7064l941n511l691q736j1669r336l857O395J7703L072O231
7881A1556q717j4342N590K863L926J2507J316j1999O322J2738j0824Q84M48N839
$$ plain form
7867 18107 12379 11813 25172 30294 16767 9212 1324 -2069 10921 15030 11742 10716 23358 23060
7853 23060 14590 17761 10269 -7011 -20017 -12900 -17046 -23763 -19236 -6319 10105 16331 13887 7733
7839 7733 17900 20644 21372 15640 18322 16312 18065 7688 -3505 -5692 -13078 -14548 -4701 6562
7825 6562 -197 -976 10259 2555 7695 32526 29155 15069 10538 6019 2717 11050 6375 10215
7811 10215 8664 2474 7830 28713 35363 33459 26590 16890 7322 2649 840 2112 -3433 -4372 7536
7796 7536 -4620 1148 -6917 7004 12934 7853 9695 7820 15186 11918 8004 18634 12477 -4368
7782 -4368 -12608 -3528 8038 9559 1158 -2117 -13901 -8056 4789 20008 16637 10908 16575 19381
7768 19381 23749 19870 7830 -4348 -14045 -2517 10098 -7043 -15850 -5501 -6150 -16561 -7497
$$ packed form
7867A8107n728n66J3359N122j3527p555p888l393J2990M109l288j026J2642k98
7853B3060q470L171p492j7280j3006P117m146o717M527J2917J6424O226k444o154
7839G733J0167K744P28n732K682k010J753j0377j1193k187p386j470R847J1263
7825F562o759p79J1235p704N140K4831l371j4086m531m519l302Q333m675L840
7811A0215j551o190N356K0883O650j904o869r700r568m673j809J272n545r39J1908
7796G536j2156N768q065J3921N930n081J842j875P366l268l914J0630o157j6845
7782d368q240R080J1566J521q401l275j1784N845J2845J5219l371n729N667K806
7768A9381M368l879j2040j2178r697J1528J2615j7141q807J0349o49j0411R064
$$ plain form
7755 -7497 -4397 -4273 12368 24088 19593 16493 17374 4800 -9000 -10378 -3655 5298 7916 -2508
7741 -2508 -3318 -249 11343 17015 16942 18680 14593 17339 14635 5026 4875 5061 1275 -11965 -7212 2077
7725 2077 -5907 -1792 -1454 13225 11975 14018 10141 8561 10877 14843 2049 2871 -1371 -419 -352 -842
7709 -842 -916 -9649 6158 19117 17417 3921 -10138 -353 1260 4963 9229 14244 -5695 -7700
7695 -7700 5336 8982 6584 7073 351 1312 10973 8275 -2487 4264 3059 1767 -171 3977 -2098
7680 -2098 223 1362 -2756 -15886 -31793 -40845 -37848 -29648 -13436 -17018 -24824 -22432 -5120 9920
7666 9920 23832 32026 17405 6355 -12659 -4402 12091 13108 1774 7675 9173 9058 11615 22473
7652 22473 25459 22964 19049 19303 17742 -3360 -9293 -5572 -9246 -12855 -7160 3475 16011 13978
$$ packed form
7755g497L100J24J6641J1720m495l100Q81j2574j3800j378O723Q953K618j0424
7741b508q10L069J1592N672p3J738m087K746k704r609j51J86l786j3240M753R289
7725B077p984M115L38J4679j250K043l877j580K316L966j2794Q22m242R52O7m90
7709h42p4q733J5807J2959j700j3496j4059R785J613L703M266N015j9939k005
7695g700J3036L646k398M89o722R61R661k698j0762O751j205j292j938M148o075
7680b098K321J139m118j3130j5907r052K997Q200J6212l582p806K392J7312J5040
7666I920J3912Q194j4621j1050j9014Q257J6493J017j1334N901J498j15K557J0858
7652B2473K986k495l915K54j561k1102n933L721l674l609N695J0635J2536k033
$$ plain form
7638 13978 8322 -3928 -6040 2451 10313 9298 7880 -4327 -11270 -2874 3952 -6770 -13201 7735
7624 7735 9208 3828 -6285 -14237 -21688 -15705 -10037 -8388 -6342 -9169 -5925 12168 6268 8054
7610 8054 11248 18092 15990 5227 5672 12688 7534 -10502 -12878 -10411 -6264 12631 17045 9629
7596 9629 2109 -17043 -8953 4686 1172 -7769 -3185 2588 1889 5716 3689 -1015 -1573 8487 11652
7581 11652 10120 10832 22127 10495 -5429 -8325 -16697 -12355 -1265 479 -7113 -17587 -4518
7568 -4518 5885 7252 -1995 -883 -5246 1743 -8346 -1968 3497 1104 -5345 -15347 -17560 -4865
7554 -4865 -4579 142 11577 12860 12841 6313 -5141 -9818 4332 6531 43 163 -11826 -9688 -6712
7539 -6712 -7962 -9238 -9637 -7008 -9632 -12870 -20319 -10389 14449 14529 1864 16311 23783 21934 9563
$$ packed form
7638A3978n656j2250k112Q491P862j015j418j2207o943Q396O826j0722o431K0936
7624G735J473n380j0113p952p451N983N668J649K046k827L244J8093n900J786
7610H054L194O844k102j0763M45P016n154j8036k376K467M147J8895M414p416
7596I629p520j9152Q090J3639l514q941M584N773o99L827k027m704n58J0060L165
7581A1652j532P12J1295j1632j5924k896q372M342J1090J744p592j0474J3069
7568d518J0403J367r247J112m363O989j0089O378N465k393o449j0002k213J2695
7554d865K86M721J1435J283j9o528j1454m677J4150K199o488J20j1989K138K976
7539f712j250j276l99K629k624l238p449R930K4838Q0j2665J4447P472j849j2371
$$ plain form
7524 9563 4265 -4369 2506 -6638 -6372 10186 28462 26830 17040 5296 -7662 -1448 -8076 -11140
7510 -11140 2105 6402 8935 12048 3399 -13653 -16099 -19227 -17226 -10864 -1371 14613 24778 22620
7496 22620 17350 708 -11966 -10702 -5721 -4768 26800 32629 20698 22651 10181 -2720 -2160 4556
7482 4556 9662 11055 14299 3522 3163 6169 -1896 -5889 -6360 -4836 -6138 -8976 20 4436 -14818
7467 -14818 -16563 -7221 7282 6579 -6697 -23447 -26818 -20861 -5463 11421 6197 1934 -145 -72
7453 -72 8936 6596 -4827 -11033 -6369 -2043 -8186 4015 4710 -13966 -22301 -33658 -44408 -44306 -25913
7438 -25913 -17793 -2312 15472 28510 24730 4916 11321 13761 8451 26130 14397 -3420 -11626
7425 -11626 -1731 2588 5837 15374 2460 -7557 -6378 -11728 -14731 -10427 -10807 -7158 -4346 -8045
$$ packed form
7524I563n298q634O875r144K66J6558J8276j632r790j1744j2958O214o628l064
7510a1140J3245M297K533L113q649j7052k446l128K001O362R493J5984J0165k158
7496B2620n270j6642j2674J264M981R53L1568N829j1931J953j2470j2901N60O716
7482D556N106J393L244j0777l59L006q065l993m71J524j302k838Q996M416j9254
7467a4818j745R342J4503p03j3276j6750l371N957J5398J6884n224m263k079P3
7453g2R008k340j1423o206M664M326o143J2201O95j8676q335j1357j0750J02J8393
7438b5913Q120J5481J7784J3038l780j9814O405K440n310J7679j1733j7817q206
7425a1626R895M319L249R537j2914j0017J179n350l003M304l80L649K812l699
$$ plain form
7411 -8045 -3516 -11216 -14914 -6713 -973 1098 1471 251 7948 12091 16926 13750 4005 7052 17315
7396 17315 22170 10132 -2184 -4574 -3019 -20253 -21902 -4319 -8347 -2116 1336 3077 -5979 -17165
7382 -17165 -21571 -16976 -26444 -29238 -14784 -19921 -14937 -11696 -13893 -15737 -3973 -2935 2507 -2423
7368 -2423 1391 -1556 -11488 -12335 -6813 534 4949 2145 -1590 -9629 -10341 -4760 1494 9352 -873
7353 -873 -5151 -3095 -1660 -496 2031 10086 7081 9262 6540 13447 9644 -11572 -18273 -17457 -12726
7338 -12726 2531 -3162 -9530 -8197 5616 10419 2984 -17104 -15784 -2190 9008 12727 10611
7325 10611 16420 9161 14743 23616 31080 27284 6910 1912 2380 -8557 -10718 -3053 4630 10944
7311 10944 20818 15001 6516 6287 8296 4952 14382 4022 -630 -10883 -8439 40 -4521 -9446
$$ packed form
7411h045M529p700l698Q201N740K071L73j220P697M143M835l176r745L047J0263
7396A7315M855j2038j2316k390J555j7234j649J7583m028O231L452J741r056j1186
7382a7165m406M595r468k794J4454n137M984L241k197j844J1764J038N442m930
7368b423L814k947r932q47N522P347M415k804l735q039p12N581O254P858j0225
7353h73m278K056J435J164K527Q055l005K181k722O907l803k1216o701Q16M731
7338a2726J5257n693o368J333J3813M803p435k0088J320J3594J1198L719k116
7325A0611N809p259N582Q873P464l796k0374m998M68j0937k161P665P683O314
7311A0944R874n817q485k29K009l344R430j0360m652j0253K444Q479m561m925
$$ plain form
7297 -9446 -8002 -4010 -3876 -9976 -13922 -7924 -12733 -5916 3225 7831 9263 8203 1127 -9649 -19734
7282 -19734 -15851 -6297 1804 912 5769 1257 1146 4645 1884 7539 14622 7948 1656 -947 9550
7267 9550 8387 15530 19368 20959 14859 10451 7134 5793 4600 -10468 -3701 -77 -4620 -7340 -1077
7252 -1077 5122 -3425 3780 21663 25022 25156 19499 14457 886 -2336 -3082 -6880 -9966 -8802 -14651
7237 -14651 -10986 316 340 -4803 -10601 -9144 -6393 -11858 -10895 -11304 -11978 -17877 4110 13801 12421
7222 12421 5675 -393 -708 -2768 -10066 -3510 7888 5034 8487 10856 7255 4094 2105 -4926 -14866
7207 -14866 -5660 10524 14939 11004 17203 18653 13727 29390 25478 18944 6834 6450 2048 2774
7193 2774 6567 6307 19626 30315 9883 -6001 -3034 -6537 -4310 -14738 -8543 2388 3655 2938
$$ packed form
7297i446J444L992J34o100l946N998m809O817R141M606J432j060p076j0776j0085
7282a9734L883R554Q101q92M857m512j11L499k761N655P083o674o292k603J0497
7267I550j163P143L838J591o100m408l317j341j193j5068O767L624m543k720O263
7252a077O199q547P205J7883L359J34n657n042j3571l222p46l798l086J164n849
7237a4651L665J1302K4n143n798J457K751n465R63m09o74n899K1987R691j380
7222A2421o746o068l15k060p298O556J1398k854L453K369l601l161j989p031r940
7207a4866R206J6184M415l935O199J450m926J5663l912o534j2110l84m402P26
7193B774L793k60J3319J0689k0432j5884K967l503K227j0428O195J0931J267p17
$$ plain form
7179 2938 11301 7066 13340 20852 22913 9578 -2031 -2325 8715 -959 -7295 1188 14949 20677
7165 20677 4228 1425 11060 20557 24968 11671 13226 18957 -1593 -4647 -5440 -16335 -8541 -207
7151 -207 11964 22990 28349 20843 767 -5341 -3609 -8038 -1766 3393 -6034 1519 12405 19983
7137 19983 14046 21810 27072 11692 -4453 1959 11691 3912 -5941 -6452 -1482 -384 -2507 -4788
7123 -4788 1203 -12127 -23226 -13004 -4477 -18229 -12210 -1802 -8793 -21246 -13476 -8567 -20215
7110 -20215 -27760 -30428 -22260 -14361 -16116 -7351 1073 -13354 -22250 -4853 2005 -6192 -1927 6373
7096 6373 -1534 237 -4187 -4397 -9188 -4666 14475 21328 14991 -840 538 6122 -4658 -21199
7082 -21199 -18580 -10898 -7295 3808 -5752 -9043 -10376 -4770 -13588 -10507 -14363 -14339 -16676 -24532 -14595
$$ packed form
7179B938Q363m235O274P512K061j3335j1609k94J1040r674o336Q483J3761N728
7165B0677j6449k803R635R497M411j3297J555N731k0550l054p93j0895P794Q334
7151b07J2171J1026N359p506k0076o108J732m429O272N159r427P553J0886P578
7137A9983n937P764N262j5380j6145O412R732p779r853n11M970J098k123k281
7123d788N991j3330j1099J0222Q527j3752O019J0408o991j2453P770M909j1648
7110b0215p545k668Q168P899j755Q765Q424j4427q896J7397O858q197M265Q300
7096F373p907J771m424k10m791M522J9141O853o337j5831J378N584j0780j6541
7082b1199K619P682L603J1103r560l291j333N606q818L081l856K4k337p856R937
$$ plain form
7067 -14595 4555 7160 17701 8798 7265 4864 8743 11122 -1010 2474 14651 9686 7277 11074
7053 11074 3270 8818 18101 16227 4029 -3251 461 -1571 -10266 -7885 -7858 -7839 -3420 -5959 -964
7038 -964 3981 -1218 -8996 -6401 -3802 -16087 -18963 -15403 -16354 -12973 -1712 3247 13032 14785 4250
7023 4250 -10315 -174 15729 21302 11432 7239 -1868 4761 3024 -3001 1532 -830 1589 380
7009 380 -9849 -13383 -9353 -12094 -14946 -11356 -5749 -3941 -4134 -2156 1398 8487 -6533 -12339 -7003
6994 -7003 -7112 -6282 -4426 -12729 -6703 -1549 698 6283 9415 3018 -10676 -11706 -3668 7407 15129
6979 15129 8631 13801 8993 -9117 626 5376 7315 6094 9218 19207 17371 3181 8397 11416
6965 11416 -6874 -10977 -12743 -3221 -5702 -12628 -4161 -4506 -18716 -8574 -10433 -16159 -17822 -8701
$$ packed form
7067a4595J9150K605J0541q903j533k401L879K379j2132L484J2177m965k409L797
7053A1074p804N548R283j874j2198p280L712k032q695K381K7J9M419k539M995
7038i64M945n199p778K595K599j2285k876L560r51L381J1261M959R785J753j0535
7023D250j4565J0141J5903N573r870m193r107O629j737o025M533k362K419j209
7009C80j0229l534M030k741k852L590N607J808j93J978L554P089j5020n806N336
6994g003j09Q30J856q303O026N154K247N585L132o397j3694j030Q038J1075P722
6979A5129o498N170m808j8110R743M750J939j221L124R989j836j4190N216L019
6965A1416j8290m103j766R522k481o926Q467l45j4210J0142j859n726j663R121
$$ plain form
6951 -8701 -12175 -5693 4773 -908 -21410 -33618 -33409 -18807 -6348 -10381 -13995 -13742 -31838 -15408
6937 -15408 2739 6019 1851 4253 10933 14154 -1195 -8490 -6519 -7154 1938 4061 6482 -6123
6923 -6123 -6918 1602 22336 29842 20375 4111 -1607 6652 7355 8085 5679 7407 -6683 -11792 -7551
6908 -7551 -9951 -16460 2853 35893 21630 2015 1395 3727 -1423 -5583 -1347 9055 16603 7084
6894 7084 -1599 -14826 -15909 -7844 -11688 -14449 -12000 -21379 -22070 -6230 -4730 -3863 -15027 -16258 -15406
6879 -15406 -8504 -7080 -11127 -5350 -1455 -13707 -11578 -11807 -13435 -3168 -11437 -16073 -20459 -25782
6865 -25782 -28685 -26888 -21123 -7703 3614 -11101 -13104 -1557 6419 5825 -3239 -4837 -8641 2720
6851 2720 9655 -5404 -3751 4123 -2947 -5249 -7023 -607 -6172 -15323 -20452 -20368 -10047 -8481 -4651
$$ packed form
6951h701l474O482J0466n681k0502j2208K09J4602J2459m033l614K53j8096J6430
6937a5408J8147L280m168K402O680L221j5349p295J971o35R092K123K421j2605
6923f123p95Q520K0734P506r467j6264n718Q259P03P30k406J728j4090n109M241
6908g551k400o509J9313L3040j4263j9615o20K332n150m160M236J0402P548r519
6894G084q683j3227j083Q065l844k761K449r379o91J5840J500Q67j1164j231Q52
6879a5406O902J424m047N777L895j2252K129k29j628J0267q269m636m386n323
6865b5782k903J797N765J3420J1317j4715k003J1547P976n94r064j598l804J1361
6851B720O935j5059J653P874p070k302j774O416n565r151n129Q4J0321J566L830
$$ plain form
6836 -4651 -5921 -12505 -3819 3343 -3734 5590 10514 16127 22716 16209 12819 5628 2700 -2375 -12311
6821 -12311 -2161 3306 4240 -5803 -15526 -13912 -14922 -6986 -3402 -6294 -5987 1666 8710 15130 4993
6806 4993 -6787 7371 13000 1682 -9673 -3876 4068 -13935 -21541 -11026 -5568 5690 4625
6793 4625 -12083 -16031 -19890 -26542 -19994 -21112 -10978 -7141 -6472 -11878 -6851 -1759 -5377 -9437 -10863
6778 -10863 4812 16311 2406 -3200 855 7561 6452 7036 1302 7201 15781 14372 11371 3562
6764 3562 12537 7220 -2374 -7397 -16444 -17820 -15175 -15692 -13380 -1037 17576 7303 -7043 -6743
6750 -6743 6650 11006 7919 9440 5387 -5690 -18303 -31334 -33587 -38640 -28512 -28999 -15923 -5382
6736 -5382 -8618 -1566 -1496 -5317 -12164 -9466 -16180 -8295 6378 173 -19569 -14054 1645 8490 -5452
$$ packed form
6836d651j270o584Q686P162p077R324M924N613O589o507l390p191k928n075r936
6821a2311J0150N467R34j0043r723J614j010P936L584k892L07P653P044O420j0137
6806D993j1780J4158N629j1318j1355N797P944j8003p606J0515N458J1258j065
6793D625j6708l948l859o652O548j118J0134L837O69n406N027N092l618m060j426
6778a0863J5675J1499j3905n606M055O706j109N84n734N899Q580j409l001p809
6764C562Q975n317r594n023r047j376K645n17K312J2343J8613j0273j4346L00
6750f743J3393M356l087J521m053j1077j2613j3031k253n053J0128m87J3076J0541
6736e382l236P052P0l821o847K698o714P885J4673o205j9742N515J5699O845j3942
$$ plain form
6721 -5452 -1591 4606 5530 -861 -3526 -16806 -3170 11925 973 -3687 3452 11757 6370 -11858
6707 -11858 -7566 -5279 -13791 -19633 -4736 21391 24390 10960 1686 1079 -8186 -12965 -5413 -8770
6693 -8770 299 7353 14862 10720 8367 12625 4980 -7175 -14408 -17059 -7651 -3040 6919 626 -11387
6678 -11387 10891 28105 25928 18189 15067 18579 10702 -11616 -14027 -7103 2330 6548 -4955 1965
6664 1965 -6401 -17937 -3648 10413 12012 10940 -2167 -13229 -10924 -1108 958 12148 6353
6651 6353 -7562 -16645 -27982 -42440 -26154 -10341 -7409 4746 11140 11836 7021 -111 5397 8830
6637 8830 8817 13225 10355 2363 -4915 13098 23185 18247 6056 -1007 17264 20825 16268 13023
6623 13023 8686 2186 6880 7916 18371 15737 1881 -11787 -10516 4673 14201 25832 30472
$$ packed form
6721e452L861O197R24o391k665j3280J3636J5095j0952m660P139Q305n387j8228
6707a1858M292K287q512n842J4897K6127K999j3430r274o07r265m779P552l357
6693h770R069P054P509m142k353M258p645j2155p233k651R408M611R959o293j2013
6678a1387K2278J7214k177p739l122L512p877k2318k411O924R433M218j1503O920
6664A965q366j1536J4289J4061J599j072j3107j1062K305R816K066J1190n795
6651F353j3915r083j1337j4458J6286J5813K932J2155O394O96m815p132N508L433
6637H830j3M408k870p992p278J8013J0087m938j2191p063J8271L561m557l245
6623A3023m337o500M694J036J0455k634j3856j3668J271J5189R528J1631M640
$$ plain form
6610 30472 20933 4520 -5738 -13647 -6593 -6007 -2858 -387 2875 6383 6990 10903 4252 -4875 -9302
6595 -9302 -11182 -5438 -124 -17113 -20829 -7480 2607 -13888 -30650 -22404 -20229 -6765 -17552
6582 -17552 -24227 -15467 -7454 -596 8445 -10254 -13660 -4580 -6352 -13676 -24694 -23780 -20772 -10739
6568 -10739 -5648 -3555 5575 25478 20647 11489 18382 8067 -6796 -1327 -4056 -3007 2665 -3358
6554 -3358 1798 -2818 -12722 -14742 -10343 -3773 -4022 -16099 -12285 -9303 -11637 -2439 -11490 -4040 5572
6539 5572 5355 20569 23661 13626 9671 15851 14653 11978 5711 -6717 -2839 2989 8806 9423 2197
6524 2197 -4497 -1777 -4452 -1219 5670 11214 5456 -11543 -17572 -14943 -15381 -16974 -4809 -7679 -16660
6509 -16660 -16820 -5406 -3406 6921 14322 5125 -6059 -18494 -28586 -24395 -14648 -22363 -13908 4067
$$ packed form
6610C0472r539j6413j0258p909P054N86L149K471L262L508O07L913o651r127m427
6595i302j880N744N314j6989l716J3349J0087j6495j6762Q246K175J3464j0787
6582a7552o675Q760Q013O858R041j8699l406R080j772p324j1018R14L008J0033
6568a0739N091K093R130J9903m831r158O893j0315j4863N469k729J049N672o023
6554c358N156m616r904k020M399O570k49j2077L814K982k334R198r051P450R612
6539E572k17J5214L092j0035l955O180j198k675o267j2428L878N828N817O17p226
6524B197o694K720k675L233O889N544n758j6999o029K629m38j593J2165k870q981
6509a6660j60J1414K000J0327P401r197j1184j2435j0092M191R747p715Q455J7975
$$ plain form
6495 4067 1245 5437 2027 -3296 8353 8319 11681 -4950 -22857 -28427 -18645 -6770 3631 5577
6481 5577 9847 6347 -950 18308 27862 16440 13161 14838 7798 8873 16190 25193 13083 7247
6467 7247 -8248 -7567 -7663 5480 10729 12672 5147 -140 -3421 -2724 2097 3440 5012 2152 8714
6452 8714 9721 6941 2269 -9321 -21568 -17407 4484 11664 9943 19658 -215 -1467 5618 2022
6438 2022 -420 9393 17036 22709 10462 957 -5627 -2251 -8474 -3438 5927 26097 22368 9592
6424 9592 3711 -2348 8754 2553 12231 22968 21444 13058 3924 -11835 -18774 -28463 -11284 -4523
6410 -4523 -14063 -33846 -25491 -13773 -4352 -6599 -3168 6647 2857 -3374 -7608 -4437 -2834 -5009
6396 -5009 5090 5960 -3924 -4321 -13954 -16950 -11456 -10697 -11770 -8982 -5364 -14099 -24711 -14635 -15534
$$ packed form
6495D067k822M192l410n323J1649l4L362j6631j7907n570R782J1875J0401J946
6481E577M270l500p297J9258R554j1422l279J677p040J075P317R003j2110n836
6467G247j5495O81r6J3143N249J943p525n287l281O97M821J343J572k860O562
6452H714J007k780m672j1590j2247M161K1891P180j721R715j9873j252P085l596
6438B022k442R813P643N673j2247r505o584L376o223N036R365K0170l729j2776
6424I592n881o059J1102o201R678J0737j524q386r134j5759o939r689J7179O761
6410d523r540j9783Q355J1718R421k247L431R815l790o231m234L171J603k175
6396e009J0099Q70r884l97r633k996N494P59j073K788L618q735j0612J0076q99
$$ plain form
6381 -15534 -20606 -21863 -6860 -15589 -15263 -25873 -26090 -26397 -29597 -21810 -26511 -32790 -23469 -12756 -8041
6366 -8041 -13628 -10708 -13257 -16125 -9908 -12159 -9671 -10148 -8945 751 -3370 -3218 1598 3178 -1929
6351 -1929 5868 5791 -173 4011 -8971 -13023 -2825 8365 8259 1761 -5467 3999 7220 3801 9051
6336 9051 6343 13583 14621 4904 8064 13191 20081 13991 11874 5571 -12329 -5590 1984 -4916 -14143
6321 -14143 -3940 4634 -4549 4305 2139 6220 12015 9108 14302 18518 9809 -15358 -20403 -22341
6307 -22341 -29512 -30154 -27820 -12532 5473 10573 5688 1675 13715 4851 1689 -13218 -7792 -5085
6293 -5085 2767 7105 2038 2634 -1528 -4352 -5565 -15964 -9230 -2397 11685 10051 809 -3772 -4365
6278 -4365 -514 -7411 -10592 -5257 -3589 758 1732 4096 -8292 -12520 -11288 -4369 -1258 12600 11830
$$ packed form
6381a5534n072j257J5003q729L26j0610k17l07l200P787m701o279R321J0713M715
6366h041n587K920k549k868O217k251K488m77J203R696m121J52M816J580n107
6351a929P797p7n964M184j2982m052J0198J1190j06o498p228R466L221l419N250
6336I051k708P240J038r717L160N127O890o090k117o303j7900O739P574o900r227
6321a4143J0203Q574r183Q854k166M081N795k907N194M216q709k5167n045j938
6307b2341p171o42K334J5288J8005N100m885m013J2040q864l162j4907N426K707
6293e085P852M338n067N96m162k824j213j0399O734O833J4082j634r242m581n93
6278d365L851o897l181N335J668M347R74K364j2388m228J232O919L111J3858p70
$$ plain form
6263 11830 3749 -4285 8621 5249 6462 7756 7566 7722 -4126 -7288 -15933 -19102 -18151 -23392 -20177
6248 -20177 -6363 3757 5266 3801 3924 -11775 -15469 -16633 -14343 -16595 -18726 -18371 -1542 -108
6234 -108 11764 8465 -13183 -27923 -24840 -15383 -11428 -6948 -803 8950 2797 6803 16292 16235 12983
6219 12983 7619 -1216 -7904 -2333 3614 -2758 -6519 -9497 8985 15493 4912 -3357 -2411 -3357 -12865
6204 -12865 -21642 -16692 -19377 -4049 3565 1031 6140 5305 12380 20326 24246 7392 11435 25177
6190 25177 17561 16837 12404 -7928 -10009 -3889 -939 -3806 -2881 2331 1431 -1038 3752 7118 8185
6175 8185 12436 14279 7253 4451 -6690 -18707 -19833 -6919 5080 1303 584 -1002 -225 11682
6161 11682 11952 9047 3861 191 1690 1381 518 -13368 -12591 -1746 -5762 -3056 -4492 -5857 -6177
$$ packed form
6263A1830q081q034J2906l372J213J294j90J56j1848l162q645l169R51n241L215
6248b0177J3814J0120J509j465J23j5699l694j164K290k252k131L55J6829J434
6234a08J1872l299k1648j4740L083R457L955M480O145R753o153M006R489n7l252
6219A2983n364q835o688N571N947o372l761k978J8482O508j0581q269R46r46r508
6204a2865q777M950k685J5328P614k534N109q35P075P946L920j6854M043J3742
6190B5177p616p24m433k0332k081O120K950k867R25N212r00k469M790L366J067
6175H185M251J843p026k802j1141j2017j126J2914J1999l777p19j586P77J1907
6161A1682K70k905n186l670J499l09q63j3886P77J0845m016K706j436j365l20
$$ plain form
6146 -6177 3963 -24 2462 -648 435 12254 20302 13963 16357 12840 -5909 -13770 540 11922
6132 11922 5145 -11461 -9896 -3828 -11887 -11467 -3087 -1923 -3603 -10269 -7456 -9505 -19447 -14694 -11945
6117 -11945 -7493 -7073 4895 56 -8543 -10381 -14400 -16168 -12117 2705 8338 1433 6771 -1363
6103 -1363 -9353 -4678 -5622 -8100 -25833 -27353 -5178 2524 -2605 2257 20009 23338 20073 12150
6089 12150 7776 9907 14703 18556 13779 19165 18486 8268 12558 -1535 -13553 -11376 -1173 19262
6075 19262 33980 32029 13007 4031 2980 2716 2382 1133 -4237 -23904 -17703 -11448 -4390 -10192
6061 -10192 -18075 -18263 -12587 -6221 7117 13916 2547 1122 -6521 -8484 -535 -1204 -8783 -10701 1406
6046 1406 2972 552 5654 6281 2352 9363 3552 -6001 -10358 -12630 -24498 -24468 -10220 7065 11893
$$ packed form
6146f177J0140l987K486l110J083J1819Q048o339K394l517j8749p861J4310J1382
6132A1922o777j6606J565O068q059M20Q380J164j680o666K813k049r942M753K749
6117a1945M452M20J1968m839q599j838m019j768M051J4822N633o905N338q134
6103a363p990M675r44k478j7733j520K2175P702n129M862J7752L329l265p923
6089A2150m374K131M796L853m777N386o79j0218M290j4093j2018K177J0203K0435
6075A9262J4718j951j9022q976j051k64l34j249n370j9667O201O255P058n802
6061a0192p883j88N676O366J3338O799j1369j425p643j963P949o69p579j918J2107
6046A406J566k420N102O27l929P011n811r553m357k272j1868L0J4248J7285M828
$$ plain form
6031 11893 3519 -10445 -33944 -38919 -30826 -22861 -15932 -10611 -9293 3438 22244 22712 24674 24786
6017 24786 3665 -3483 -6222 -15877 -15308 -2950 11053 -5142 -18573 -16101 -6852 -1486 -18183
6004 -18183 -19729 -6704 -2092 -6354 -18687 -14022 351 3921 190 -1731 -1602 -5118 -6063 6284
5990 6284 8009 -11270 -20830 -24107 -20339 -25779 -24979 -18627 -21087 -23271 -5363 -2356 -11678 -10897 -10730
5975 -10730 -6055 -539 1410 -399 -6657 -23825 -14156 -9153 -6532 -12748 -27739 -21440 -12826 -14912
5961 -14912 -8383 -8853 -7166 -2834 1067 6509 5780 8195 22154 16380 9976 -7259 -28619 -33607
5947 -33607 -13297 10765 10764 6226 -2398 -21140 -28714 -31526 -14214 1669 9260 10765 20186 24616
5933 24616 16484 14217 9324 975 -4390 -13048 -13102 -6434 987 -6482 1088 -5803 -23368 -21463 -17865
$$ packed form
6031A1893q374j3964k3499m975Q093P965O929N321J318J2731J8806M68J962J12
6017B4786k1121p148k739r655N69J2358J4003j6195j3431K472R249N366j6697
6004a8183j546J3025M612m262j2333M665J4373L570l731j921J29l516r45J2347
5990F284J725j9279r560l277L768n440Q00O352k460k184J7908L007r322P81J67
5975a0730M675N516J949j809o258j7168R669N003K621o216j4991O299Q614k086
5961a4912O529m70J687M332L901N442p29K415J3959n774o404j7235k1360m988
5947c3607K0310K4062jm538q624j8742p574k812J7312J5883P591J505R421M430
5933B4616q132k267m893q349n365q658n4O668P421p469P570o891j7565J905L598
$$ plain form
5918 -17865 -10897 -10974 -13527 -11096 -5638 -1273 -2734 -2692 -3164 -6442 -7130 -1383 -2319 -2029 -6381 -22460
5902 -22460 -9494 -9982 -10548 -2557 3582 1202 6304 -950 -22369 -30105 -20313 -9175 -11305 -11626 -13493
5887 -13493 -14046 -5412 -9199 -20393 -35374 -35381 -28495 -16326 -17151 -12001 8531 29070 30893 13165
5873 13165 5858 -6321 -4400 -2384 -694 -8169 -13812 -16158 -8961 307 17164 15843 331 -16189
5859 -16189 -12396 -17242 -16903 -12602 -21774 -14051 -11375 -18382 -20050 -4062 992 1345 -1918 -1923 1615 -2781
5843 -2781 -12265 -13280 -20426 -9060 4011 -5913 -14666 -14377 -14434 -9883 -5407 -7082 -13420 -11355 -13367
5828 -13367 -4298 6806 -3722 -5068 6904 14712 3779 -617 14866 14916 6685 -1817 -6567 -4983
5814 -4983 -8541 -2933 -1 -773 -2098 -1703 -423 5019 2642 6325 9547 21493 19256 15778 10274
$$ packed form
5918a7865O968p7k553K431N458M365j461M2m72l278o88N747r36K90m352j6079
5902b2460J2966m88n66P991O139k380N102p254k1419p736R792J1138k130l21j867
5887a3493n53Q634l787j1194j4981pO886J2169q25N150K0532K0539J823j7728
5873A3165p307j2179J921K016J690p475n643k346P197R268J6857j321j5512j6520
5859a6189L793m846L39M301r172P723K676p007j668J5988N054L53l263nL538m396
5843b781r484j015p146J1366J3071r924q753K89n7M551M476j675o338K065k012
5828a3367R069J1104j0528j346J1972P808j0933m396J5483N0q231q502m750J584
5814d983l558N608K932p72j325L95J280N442k377L683L222J1946k237l478n504
$$ plain form
5799 10274 11934 5219 -8368 -13192 -20026 -12611 -7468 -3865 795 -4017 -5749 -504 13610 19092
5785 19092 7499 -1831 1299 2039 378 -15003 -15370 -7182 -3342 -1631 -13174 -16292 -10062 -4433
5771 -4433 600 290 -15223 -25235 -17022 -5621 -5839 -10642 -22839 -21869 -13083 -21615 -25822 -27020 -16515
5756 -16515 -11123 -27964 -22182 -22486 -18044 -4657 14147 23791 22418 11353 2384 9671 5624 4802
5742 4802 6847 -3041 -2599 4986 21783 22988 9502 -91 985 3684 10499 13452 10329 6262 -426
5727 -426 -5581 -15201 -18170 -18520 -69 2067 5722 -11380 -10531 4353 5230 1242 -1471 -17217 -20870
5712 -20870 -20172 -13669 -9583 -16554 -24971 -24372 -7133 -1631 -4407 -8301 1989 17992 25114 19500
5698 19500 7373 6065 1631 -9202 -8528 -11878 -3229 1989 -5118 -7064 -6951 -8439 -9490 -8194 -18970
$$ packed form
5799A0274J660o715j3587m824o834P415N143L603M660m812j732N245J4114N482
5785A9092j1593r330L130P40j661j5381l67Q188L840J711j1543l118O230N629
5771d433N033l10j5513j0012Q213J1401k18m803j2197R70Q786q532m207j198J0505
5756a6515N392j6841N782l04M442J3387J8804R644j373j1065q969P287m047q22
5742D802K045r888M42P585J6797J205j3486r593J076K699O815K953l123m067o688
5727d26n155r620k969l50J8451K136L655j7102Q49J4884Q77l988k713j5746l653
5712b0870O98O503M086o971q417N99J7239N502k776l894J0290J6003P122n614
5698A9500j2127j308m434j0833O74l350Q649N218p107j946J13j488j051J296j0776
$$ plain form
5683 -18970 -15904 -24667 -13118 -1658 294 969 10776 11421 3969 -11162 -17484 2215 6203 -9000
5669 -9000 -23581 -25844 -20464 -11468 349 -6620 -2526 -2995 3225 638 -272 -958 5484 7297 7700
5654 7700 20638 25399 31881 26148 9306 -1963 -15835 -6484 -11516 -19863 -11130 -950 -9804 -17819
5640 -17819 -21778 -16104 -4907 -2459 -3962 -1224 -2320 -4479 -10053 -14500 -12772 -1562 -10325 -15561
5626 -15561 -14147 -11423 -23164 -17863 145 14860 22049 8866 4401 -1374 -16125 -23024 -13971
5613 -13971 -17908 -17628 -13210 -3131 11523 19696 11959 -16252 -27892 -29028 -26913 -17201 -5587 2276
5599 2276 26017 31645 22836 11162 7062 7262 6857 5945 7531 1837 -1822 -979 -7231 -4322 10984
5584 10984 12947 7290 15966 12638 16277 13399 6936 4275 -9503 -15473 -1828 10476 8364 4214
$$ packed form
5683a8970L066q763J1549J1460J952O75R807O45p452j5131o322J9699L988j5203
5669i000j4581k263N380Q996J1817o969M094m69O220k587r10o86O442J813M03
5654G700J2938M761O482n733j6842j1269j3872R351n032q347Q733J0180q854q015
5640a7819l959N674J1197K448j503K738j096k159n574m447J728J1210q763n236
5626a5561J414K724j1741N301J8008J4715P189j3183m465n775j4751o899R053
5613a3971l937K80M418J0079J4654Q173p737k8211j1640j136K115R712J1614P863
5599B276K3741N628q809j1674m100K00m05r12J586n694l659Q43o252K909J5306
5584A0984J963n657Q676l328L639k878o463k661j3778n970J3645J2304k112m150
$$ plain form
5570 4214 4795 -1103 -3478 9014 12898 22172 15593 11594 11006 10372 6201 483 -15551 -24755 -13972
5555 -13972 3250 2137 3969 11699 8566 7784 15498 14002 -3784 4460 20013 6005 -15963 -18770
5541 -18770 -4581 3216 20072 16264 -4168 -14513 -11220 -12669 -18887 -6264 2192 -1946 -1334 -1908
5527 -1908 -20506 -22352 -15792 -12328 -7093 -15604 -25286 -13577 -558 11092 -4442 -12871 -7398 -3972
5513 -3972 -8715 -13549 -20708 -21005 -11955 -488 13628 23240 21200 9282 -3192 -16025 -16830 -17392
5499 -17392 -11511 -11440 -14389 -892 20556 15369 12449 8223 -49 526 -1530 5799 2517 -1518 7804
5484 7804 10483 8014 4238 12284 9847 7801 -973 -719 14929 16046 3194 -7539 7893 2263
5470 2263 -15193 -24177 -24359 -29247 -31619 -24914 -13567 -7474 -7461 -17974 -10127 -6723 -3066 -8894 -14392
$$ packed form
5570D214N81n898k375J2492L884R274o579l999n88o34m171n718j6034r204J0783
5555a3972J7222j113J832P730l133p82P714j496j7786Q244J5553j4008k1968k807
5541a8770J4189P797J6856l808k0432j0345L293j449o218J2623Q456m138O12n74
5527a908j8598j846O560L464N235q511r682J1709J3019J1650j5534q429N473L426
5513c972m743m834p159k97R050J1467J4116R612k040j1918j2474j2833q05n62
5499a7392N881P1k949J3497K1448n187k920m226q272N75k056P329l282m035R322
5484G804K679k469l776Q046k437k046q774K54J5648J117j2852j0733J5432n630
5470B263j7456q984j82m888k372O705J1347O093J3j0513P847L404L657n828n498
$$ plain form
5455 -14392 -4902 -6233 -17606 -11545 5121 2860 -4836 -8008 -18607 -15137 -9634 -21355 -26800 -15564
5441 -15564 3025 5736 1820 7684 3538 3347 2381 1830 -13842 -25144 -26723 -19264 -20022 -15486 -8156
5426 -8156 -8920 -2350 5063 4489 -10694 1651 -859 -13595 -5347 11101 113 -1216 2826 1068
5412 1068 1250 11677 12989 3039 -7070 -13042 -15213 -18452 -27978 -21195 -10397 -2336 18494 24818
5398 24818 19932 22838 16536 9108 1681 -5399 -11887 -12616 4010 6869 328 7603 -273 -14674
5384 -14674 -10668 2673 -1048 -7620 -9960 -5869 -3450 65 6812 6009 9284 1943 3911 -10476
5370 -10476 -12913 -6438 -536 -14856 -10502 -9752 -8025 849 -8985 -17996 -20245 -16108 -18499 -20079 -15141
5355 -15141 -11370 -11647 -18423 -18988 -8907 -11007 -13065 -7487 -16048 -16699 -14202 -2637 8110 2002 -1969
$$ packed form
5455a4392R490j331j1373O061J6666k261p696l172j0599L470N503j1721n445J1236
5441a5564J8589K711l916N864m146j91r66n51j5672j1302j579P459p58M536P330
5426h156p64O570P413n74j5183J2345k510j2736Q248J6448j0988j329M042j758
5412A068J82J0427J312r950j0109n972k171l239r526O783J0798Q061K0830O324
5398B4818m886K906o302p428p427p080o488p29J6626K859o541P275p876j4401
5384a4674M006J3341l721o572k340M091K419L515O747q03L275p341J968j4387
5370a0476k437O475N902j4320M354P50J727Q874r834r011k249M137k391j580M938
5355a5141L771k77o776n65J0081k100k058N578q561o51K497J1565J0747o108l971
$$ plain form
5340 -1969 -3425 -9459 -15347 -18788 -8012 2975 -2500 -616 -4009 -6581 -4427 9188 14974 6665
5326 6665 -3058 2693 6717 9091 14793 11358 7739 4953 3142 -4989 -7021 -6877 -8851 -9994 -7953
5311 -7953 1214 1034 1191 4708 921 -20263 -23922 -6694 11626 9951 11558 11012 1192 -4971 -18683
5296 -18683 -16283 -18788 -11067 -7770 -7692 -1995 4263 4633 11425 15033 9366 7655 13106 23102 17255
5281 17255 -6910 -11331 -10652 1055 5361 5079 543 1210 -11775 -15830 -19899 -10907 -14408 -4834 1265
5266 1265 -13854 -7701 2422 -7604 -7091 -3327 -7258 -19057 -9028 1524 7392 554 -8908 -13840
5252 -13840 -20887 -13250 3974 17905 18064 723 -11021 -16248 -20851 -33962 -46463 -25192 -7609
5239 -7609 -13598 -13723 -1228 8419 9552 -4523 -2274 3742 6131 9771 8529 -657 5984 3154 -6497
$$ packed form
5340a969j456o034n888l441J0776J0987n475J884l393k572K154J3615N786q309
5326F665r723N751M024K374N702l435l619k786j811q131k032J44j974j143K041
5311g953R167j80J57L517l787k1184l659J7228J8320j675J607n46r820o163j3712
5296a8683K400k505P721L297P8N697O258L70O792L608n667j711N451R996n847
5281A7255k4165m421O79J1707M306k82m536O67j2985m055m069Q992l501R574O099
5266A265j5119O153J0123j0026N13L764l931j1799J0029J0552N868o838r462m932
5252a3840p047P637J7224J3931J59j7341j1744n227m603j3111j2501K1271J7583
5239g609n989j25J2495R647J133j4075K249O016K389L640j242r186O641k830r651
$$ plain form
5224 -6497 -5325 -3901 -14543 -17206 -14450 -9613 -1557 -302 -6658 -16737 -14940 6323 18509 4428
5210 4428 -12638 -9443 -1162 4782 -8595 11730 10440 -2495 -13169 -2938 5699 5518 -5620
5197 -5620 -13393 -17913 -16812 -2374 4849 10463 15061 5884 -2487 -3057 -10216 -17669 -21333 -10576 -10473
5182 -10473 -19092 -12591 -1887 -6239 -8961 -7380 -6405 3411 5135 -5719 -17973 -24379 -19421 4527
5168 4527 8644 4743 1709 -19311 -24828 -9688 -2137 -2470 -14111 -2497 -3272 -16518 -22330 -18705
5154 -18705 -4886 -2901 -2274 -1646 6731 15685 25339 16907 20031 11014 15281 15484 5617 -6165 -10230
5139 -10230 -15972 -5003 -7363 -1407 -3995 -6100 16173 15544 -7943 -12047 -14531 -10206 -12296 -18173
5125 -18173 -26919 -26860 -19879 -1984 10244 9743 8531 1928 -9118 -15202 -32082 -32246 -23408 -38510
$$ packed form
5224f497J172J424j0642k663K756M837Q056J255o356j0079J797K1263J2186j4081
5210D428j7066L195Q281N944j3377K0325j290j2935j0674J0231Q637j81j1138
5197e620p773m520J101J4438P223N614M598r177q371n70p159p453l664J0757J03
5182a0473q619O501J0704m352k722J581R75R816J724j0854j2254o406M958K3948
5168D527M117l901l034k1020n517J5140P551l33j1641J1614p75j3246n812L625
5154a8705J3819J985O27O28Q377Q954R654q432L124r017M267K03r867j1782m065
5139a0230n742J0969k360N956k588k105K2273o29k3487m104k484M325k090n877
5125a8173q746N9O981J7895J2228n01j212o603j1046o084j6880j64Q838j5102
$$ plain form
5111 -38510 -34480 -29167 -17950 -19963 -26692 -22770 -19177 -12632 -2004 -5927 1790 11792 15252 4970
5097 4970 10776 9121 2542 -6830 -8525 -6046 1219 -7838 -14305 6002 14962 10257 12576 12125 15784
5082 15784 5984 -281 2889 -3230 -12833 -19652 -13522 -822 -1472 -18366 -22853 -23223 -31845 -17876
5068 -17876 -10668 -19085 -26685 -25127 -15068 -14289 -7694 7667 22834 20560 18254 20753 35377 31665
5054 31665 21472 28070 23298 20889 5121 -15791 -28719 -29648 -22459 -13682 -640 2934 11265 3116
5040 3116 1876 369 13198 18037 12879 -806 -7096 -4981 -5340 -176 7773 -3324 646 23 -5586
5025 -5586 -9096 -5172 -3635 -5598 -2224 4811 -2911 -16395 -8205 -4228 -5445 -2480 -6626 -16109 -19394
5010 -19394 -21601 -13052 -12887 -13872 -3522 15275 9311 -3832 -7255 -3962 181 10827 -3435 -15956
$$ packed form
5111c8510M030N313J1217k013o729L922L593O545J0628l923P717J0002L460j0282
5097D970N806j655o579r372j695K479P265r057o467K0307Q960m705K319m51L659
5082A5784r800o265L170o119r603o819O130J2700o50j6894m487l70q622J3969
5068a7876P208q417p600J558J0059P79O595J5361J5167k274k306K499J4624l712
5054C1665j0193O598m772k409j5768k0912j2928r29P189Q777J3042L574Q331q149
5040C116j240j507J2829M839n158j3685o290K115l59N164P949j1097L970o23n609
5025e586l510L924J537j963L374P035p722j3484Q190L977j217K965m146r483l285
5010a9394k207Q549J65r85J0350J8797n964j3143l423L293M143J0646j4262j2521
$$ plain form
4996 -15956 -12464 -6138 3864 -5341 -7835 -4859 4066 8668 12116 21305 33518 43518 39770 7877
4982 7877 4918 14603 18462 19583 11617 1875 -6995 -1654 7700 6891 9945 18154 16747 15593 25416
4967 25416 23170 24826 13012 -1518 -8320 -9199 -9379 -17190 -2611 2220 -2587 -9181 -29853 -35631
4953 -35631 -34010 -15837 -2729 -7035 -21728 -24558 -19840 -20561 -22129 -16877 -18629 -16820 -10859 -6859
4939 -6859 -1568 -10377 -3807 12171 2060 -10674 -7943 -7169 -20416 -22169 -11625 7904 20750
4926 20750 4294 -168 7669 10122 11920 9169 24556 21790 14764 8236 1936 -1477 8854 -7380
4912 -7380 -18258 -19420 -6490 -27 1256 7102 9899 7147 -159 9383 19150 16048 15629 14363 9665
4897 9665 6183 10742 10780 10026 12615 4236 -5929 -7295 1947 12511 4885 -13227 -25496 -20905 -17471
$$ packed form
4996a5956L492O326J0002r205k494K976Q925M602L448R189J2213J0000l748l1893
4982G877k959R685L859J121p966r742q870N341R354q09L054Q209j407j154R823
4967B5416k246J656j1814j4530o802q79j80p811J4579M831m807o594k0672n778
4953c5631J621J8173J3108m306j4693k830M718p21j568N252j752J809N961M000
4939f859N291q809O570J5978j0111j2734K731P74j3247j753J0544J9529J2846
4926B0750j6456m462P837K453J798k751J5387k766p026o528o300l413J0331j6234
4912g380j0878j162J2930O463J283N846K797k752p306R542R767l102m19j266m698
4897I665l482M559L8p54K589q379j0165j366R242J0564p626j8112j2269M591L434
$$ plain form
4882 -17471 -28661 -28655 -29415 -19013 -10664 -17435 -16015 -62 7249 14403 5228 -10354 -22833 -11712
4868 -11712 3770 1638 -7789 -5252 -9965 -23864 -11979 -13870 -15726 -22413 -14196 -7627 -3886 -6798
4854 -6798 1872 2848 -5725 -13408 -9007 -17758 -20790 -13380 2484 8402 -5429 -6808 -16653 -36400
4840 -36400 -30404 -11779 -5887 5385 18460 18869 9860 -1273 1739 -3247 -3718 -10726 -1267 12993
4826 12993 19290 3638 -7463 -5590 -17395 -25726 -4698 2752 1019 -13196 -11183 -5432 -4946 7691
4812 7691 22179 22917 7539 -15731 -25943 -28991 -31835 -17400 3217 11618 6000 -3852 -10925 -18305
4798 -18305 -17692 -23169 1343 11027 8083 -6588 -933 5809 -7418 -13616 -9293 -3725 736 -1489
4784 -1489 1875 4165 4010 -4999 -3596 17514 29608 18084 3448 11847 10639 -5979 1566 7280
$$ packed form
4882a7471j1190Op60J0402Q349o771J420J5953P311P154r175j5582j2479J1121
4868a1712J5482k132r427K537m713j3899J1885j891j856o687Q217O569L741k912
4854f798Q670R76q573p683M401q751l032P410J5864N918j3831j379r845j9747
4840c6400N996J8625N892J1272J3075M09r009j1133L012m986m71p008R459J4260
4826A2993O297j5652j1101J873j1805q331K1028P450j733j4215K013N751M86J2637
4812G691J4488P38j5378k3270j0212l048k844J4435K0617Q401n618r852p073p380
4798a8305O13n477K4512R684k944j4671N655O742j3227o198M323N568M461k225
4784a489L364K290j55r009J403K1110J2094j1524j4636Q399j208j6618P545N714
$$ plain form
4770 7280 10677 2503 -8308 -11905 -11039 260 -6154 -1164 8861 5724 -2233 344 4069 -1099
4756 -1099 -4365 -11327 -8585 -4334 -10429 -5121 6037 3571 -5504 -1721 5332 -3960 -20330 -20397 -11690
4741 -11690 3502 6247 5912 -1538 -1169 -38 -13890 -10068 -5259 -1700 9135 7149 -7197 -16764
4727 -16764 -1901 -763 -9580 -8174 3979 8768 1830 -492 -6437 4773 6251 -4133 -11576 5022
4713 5022 8276 11230 -7839 -2052 3565 -3259 -9267 -10227 -4548 -10401 -17271 -6568 15322 24078
4699 24078 15529 17206 18274 1673 -126 2449 -15750 -7795 -10196 -3090 7917 2305 -8624 924
4685 924 18212 23337 10140 9609 5040 -10055 -6641 -506 -4170 -11898 -8320 5130 13593 15562
4671 15562 15347 19888 15333 9783 4532 9180 -735 13343 30679 38220 32542 9000 -3708 -1809
$$ packed form
4770G280L397q174j0811l597Q66J1299o414M990J0025l137p957K577L725n168
4756a099l266o962K742M251o095N308J1158k466r075L783P053r292j6370o7Q707
4741a1690J5192K745l35p450L69J131j3852L822M809L559J0835j986j4346r567
4727a6764J4863J138q817J406J2153M789o938k322n945J1210J478j0384p443J6598
4713E022L254K954j9069N787N617o824o008r60N679n853o870J0703K1890Q756
4699B4078q549J677J068j6601j799K575j8199P955k401P106J1007n612j0929R548
4685I24J7288N125j3197n31m569j5095L414O135l664p728L578J3450Q463J969
4671A5562k15M541m555n550n251M648r915J4078J7336P541n678k3542j2708J899
$$ plain form
4657 -1809 7726 6192 7991 10849 -5184 -22929 -31242 -16383 -8157 103 8265 18121 20302 23934
4643 23934 26948 25432 7896 -10109 -20840 -26428 -32496 -26823 -14276 -5160 -1752 11793 18428
4630 18428 21834 11017 2393 -6045 -15019 -16283 -19844 -25465 -22532 -10330 4314 18415 18171 12239
4616 12239 258 5077 5486 -4109 -9285 -5229 5875 7404 -4304 -11918 -2513 -1877 -13007 -13405
4602 -13405 1911 9324 19354 17107 1961 -1147 -9809 -11240 -8599 6016 4926 -4108 -8593 -17220
4588 -17220 -31040 -26031 -10772 -6419 -13186 -5306 -10319 -12232 -5246 -625 -13338 -15527 -16665 -4722
4574 -4722 1492 10450 20202 11005 5256 -4786 -4451 -2161 483 863 5056 5494 5614 14818 15074 18240
4558 18240 -289 -13931 -8680 -5199 4877 17474 21103 18208 7544 9001 3041 -3420 -10508
$$ packed form
4657a809R535j534J799K858j6033j7745q313J4859Q226Q260Q162R856K181L632
4643B3934L014j516j7536j8005j0731n588o068N673J2547R116L408J3545O635
4630A8428L406j0817q624q438q974j264l561n621K933J2202J4644J4101k44n932
4616A2239j1981M819M09r595n176M056J1104J529j1708p614R405O36j1130l98
4602a3405J5316P413J0030k247j5146l108q662j431K641J4615j090r034m485q627
4588a7220j3820N009J5259M353o767P880n013j913O986M621j2713k189j138J1943
4574d722O214Q958R752r197n749j0042L35K290K644L80M193M38J20R204K56L166
4558A8240j8529j3642N251L481J0076J2597L629k895j0664J457n960o461p088
$$ plain form
4545 -10508 -9742 -18774 -16909 -20043 -9468 -219 -6616 -9331 -19515 -9468 2547 3410 -2028 511
4531 511 -7781 -17826 -29264 -25575 -13719 -9100 -15474 -23961 -13475 -16410 -24524 -30628 -6715 -10199
4517 -10199 -9624 -3160 -3546 2077 5229 499 -2967 5361 17423 23900 11846 1896 -8178 -20387
4503 -20387 -13121 -6275 -2187 3551 -2169 -16965 -17705 -6466 5396 1897 -8169 -17834 -15863 -3716
4489 -3716 4 9026 7338 1812 3710 4229 10725 2662 6102 7099 7731 8346 6678 -5439 -4176 -9004
4473 -9004 -16649 -20298 -19669 -23538 -24866 -12493 2990 5653 3326 -7764 -8227 -2181 -4927 -4885 -9982
4458 -9982 -15104 -11315 -1923 8560 161 -13414 -11095 -2913 -7661 -6726 -8915 -13768 -23214 -21938 -19894
4443 -19894 -13494 -12354 -26619 -19091 -5580 -6646 -21085 -20820 -3694 3783 9366 18925 20596 19939
$$ packed form
4545a0508P66r032J865l134J0575R249o397k715j0184J0047J2015Q63n438K539
4531E11q292j0045j1438L689J1856M619o374q487J0486k935q114o104K3913l484
4517a0199N75O464l86N623L152m730l466Q328J2062O477j2054r950j0074j2209
4503b0387P266O846M088N738n720j4796p40J1239J1862l499j0066r665J971J2147
4489c716L720R022j688n526J898N19O496q063L440R97O32O15j668j2117J263m828
4473i004p645l649O29l869j328J2373J5483K663k327j1090m63O046k746M2n097
4458i982n122L789R392J0483q399j3575K319Q182m748R35k189m853r446J276K044
4443a9894O400J140j4265P528J3511j066j4439K65J7126P477N583R559J671o57
$$ plain form
4429 19939 16508 14104 10723 11442 2972 -6702 -14660 -15251 -3907 17523 23894 21424 13728 194
4415 194 -4195 -11157 -23615 -13272 -9612 -28867 -24249 -15611 -7865 15940 12076 5475 -3418 -9846
4401 -9846 -11465 -4358 1077 -1094 402 -8511 -681 5362 -4960 -10761 -19025 -10236 -2796 -853 16164
4386 16164 19644 -2174 -15209 -26218 -25106 -17870 -15604 -14216 -8358 -5750 -14521 -10381 -13362 -2807
4372 -2807 7316 14242 7881 -10046 -17885 -5124 -8071 -17305 -17684 -12076 -7853 -17656 -13610 -12600
4358 -12600 -10970 -5813 -2499 -1900 -5253 -12665 -58 12836 11012 -2618 -17178 -13176 -2284 474
4344 474 6765 3748 10448 10443 -3608 -9591 5450 15291 6447 -3744 -4991 -3567 -2291 -4365 -4701
4329 -4701 5142 10974 13817 22278 15871 7920 -9651 -10359 -8910 -6154 -3186 -7513 -10528 -10461 -15076
$$ packed form
4429A9939l431k404l381P19q470r674p958n91J1344K1430O371k470p696j3534
4415A94m389o962j2458J0343L660j9255M618Q638P746K3805l864o601q893o428
4401i846j619P107N435k171J496q913P830O043j0322n801q264Q789P440J943J7017
4386A6164L480k1818j3035j1009J112P236K266J388N858K608q771M140k981J0555
4372b807J0123O926o361j7927p839J2761k947r234l79N608M223r803M046J010
4358a2600J630N157L314N99l353p412J2607J2894j824j3630j4560M002J0892K758
4344D74O291l017O700nj4051n983J5041R841q844j0191j247J424J276k074l36
4329d701R843N832K843Q461o407p951j7571p08J449K756K968m327l015O7m615
$$ plain form
4314 -15076 -12239 -20076 -23937 -20461 -11527 -21409 -31295 -37619 -40188 -33595 -14243 -5317 -4202 8363
4300 8363 9691 -1483 -15728 -16698 -12161 -16445 -24333 -22435 -16062 -7485 -8493 -5012 5000 2572
4286 2572 -7385 -23964 -10064 1955 -1132 13521 17588 7100 -1769 -10353 -18259 -16253 -19526 -11066
4272 -11066 -4065 -6838 -6112 -15926 -25196 -10005 -8 -2642 -7690 -2938 11794 5378 72 -8045
4258 -8045 -10380 -5717 -12636 -11601 -10639 -6013 4078 12023 20909 19641 10227 4708 11964 4650 -9383
4243 -9383 -7850 1682 10411 931 -4753 -6580 -9074 -9016 -18584 -41093 -41661 -30245 -35552 -36093 -25816
4228 -25816 -14500 -12419 -7330 -8041 -10395 -6305 -10997 -8980 -7208 -13445 -11218 -15301 -14092 -12889 5117
4213 5117 6125 10 -2638 -5373 -3572 -7065 2713 5579 6569 2584 -3046 -20738 -17382 8916 16383
$$ packed form
4314a5076K837p837l861L476Q934r882r886o324k569O593J9352Q926J115J2565
4300H363J328j1174j4245r70M537m284p888J898O373Q577j008L481J0012k428
4286B572r957j6579J3900J2019l087J4653M067j0488q869q584p906K006l273Q460
4272a1066P001k773P26r814r270J5191R997k634n048M752J4732o416n306q117
4258h045k335M663o919J035R62M626J0091P945Q886j268r414n519P256p314j4033
4243i383J533R532Q729r480n684j827k494N8r568k2509n68J1416n307n41J0277
4228b5816J1316K081N089p11k354M090m692K017J772o237K227m083J209J203J8006
4213E117J008o115k648k735J801l493R778K866R90l985n630j7692L356K6298P467
$$ plain form
4198 16383 20824 16159 4058 7602 -1708 -9136 -8393 -15443 2123 19026 6294 -12394 -8113 -1782
4184 -1782 4192 -6722 -6277 5842 12720 12991 3948 1299 3340 16049 23068 15344 10728 16028 5051
4169 5051 -7329 -9082 -12067 -14487 -22776 -39087 -26705 -15539 -1485 9736 19479 17710 -14793
4156 -14793 -28745 -29297 -15371 -11673 -23071 -23767 -18619 -19831 -29039 -22896 -8806 -3649 -13630 -14249
4142 -14249 -16090 -9289 4692 8128 15456 4735 2690 -5997 -12182 -24471 -34728 -28332 -23537 -15510
4128 -15510 -14985 -12825 4720 9555 -3719 -11531 -12582 -6769 -14139 -16706 -6230 -5210 -7220 -7475
4114 -7475 -1266 9251 14319 13718 6236 7550 15299 3702 1354 7852 -809 -8123 -6144 -11121 -14915
4099 -14915 -11319 -7301 -20696 -22967 -19642 -27036 -19600 -24863 -26910 -23409 -13847 -15225 -20610 -26959
$$ packed form
4198A6383M441m665j2101L544r310p428P43p050J7566J6903j2732j8688M281O331
4184a782N974j0914M45J2119O878K71r043k649K041J2709P019p724m616N300j0977
4169E051j2380j753k985k420q289j6311J2382J1166J4054J1221R743j769l2503
4156a4793j3952n52J3926L698j1398o96N148j212r208O143J4090N157r981o19
4142a4249j841O801J3981L436P328j0721k045q687o185j2289j0257O396M795Q027
4128a5510N25K160J7545M835j3274p812j051N813p370k567J0476J020k010k55
4114g475O209J0517N068o01p482J314P749j1597k348O498q661p314J979m977l794
4099a4915L596M018j3395k271L325p394P436n263k047L501R562j378n385o349
$$ plain form
4085 -26959 -18895 -7721 -5465 -773 3730 14929 16528 21536 19010 7807 2174 -5995 -2186 6691
4071 6691 4675 2109 1024 -1841 10756 21122 15715 -7172 -25669 -13086 -14853 -5791 6450
4058 6450 10522 14937 16566 10038 10372 3887 -4638 -12938 -10586 -19879 -28186 -19032 -6512 -5526 6264
4043 6264 17731 17194 9809 2296 -1905 -11704 -13644 -10045 -5563 -2594 -1079 -918 3354 9878 9604
4028 9604 14874 12989 12266 23559 7574 -5073 -8309 -11594 -11319 -5202 9255 11355 16038 3137
4014 3137 695 3343 -402 2690 378 11768 21707 8426 1648 -5512 -11417 -12916 -3366 -7996
4000 -7996 -17061 -8667 -8317 213 171 -16815 -31648 -20890 -7172 -7473 -2907 -5110 -16276 -25841 -8354
3985 -8354 -1828 -1334 -12183 -11075 -13202 -2519 6922 3610 75 -8669 -6123 -6025 -2800 -3674 -12417
$$ packed form
4085b6959Q064J1174K256M692M503J1199J599N008k526j1203n633q169L809Q877
4071F691k016k566j085k865J2597J0366n407k2887j8497J2583j767R062J2241
4058F450M072M415J629o528L34o485q525q300K352r293q307R154J2520R86J1790
4043F264J1467n37p385p513m201r799j940L599M482K969J515J61M272O524k74
4028I604N270j885p23J1293j5985j2647l236l285K75O117J4457K100M683j2901
4014C137k442K648l745L092k312J1390R939j3281o778p160n905j499R550m630
4000g996r065Q394L50Q530m2j6986j4833J0758J3718l01M566k203j1166r565J7487
3985h354O526M94j0849J108k127J0683R441l312l535q744K546R8L225q74q743
$$ plain form
3970 -12417 -7885 4607 -683 -8976 -8518 -13453 -20213 -16390 -15628 -18053 -11744 -17049 -25190 -21384 -20672
3955 -20672 -23277 -8369 5544 -1301 -10516 -29003 -21152 -11518 -4637 -308 -660 -4002 -11643 -5773
3941 -5773 2817 6717 1758 -2464 -18336 -22788 -20040 -6344 -15370 -10476 -13736 -10872 3645 13902
3927 13902 24024 10660 -6238 -9886 -2301 -12264 -9201 -9519 212 -4414 -8299 -3697 -6609 -22662
3913 -22662 -25618 -23902 -21187 -17232 -10350 -6887 -4140 15467 27761 25083 14627 8094 4014 6410
3899 6410 10445 10914 7772 1209 1072 -6434 -4548 -8334 1069 13952 17432 23316 17646 -46 -16073
3884 -16073 -19405 -10527 -10402 -8926 -4468 -6815 -2 -2646 -143 8075 6815 963 -5412 -3663 -11119
3869 -11119 -11570 195 987 7457 -217 -5436 -7270 -10632 -12083 -9851 -14385 -347 24133 22230
$$ packed form
3970a2417M532J2492n290q293M58m935o760L823P62k425O309n305q141L806P12
3955b0672k605J4908J3913o845r215j8487P851R634O881M329l52l342p641N870
3941e773Q590L900m959m222j5872m452K748J3696r026M894l260K864J4517J0257
3927A3902J0122j3364j6898l648P585r963L063l18R731m626l885M602k912j6053
3913b2662k956J716K715L955O882L463K747J9607J2294k678j0456o533m080K396
3899F410M035M69l142o563j37p506J886l786R403J2883L480N884n670j7692j6027
3884a6073l332Q878J25J476M458k347O813k644K503Q218j260n852o375J749p456
3869a1119m51J1765P92O470p674n219j834l362j451K232m534J4038K4480j903
$$ plain form
3855 22230 6570 -4268 -8673 -8857 -19590 -17443 -7235 -3614 4035 455 -8688 -16299 -19115 -24678
3841 -24678 -23775 -7071 -2264 -6900 776 8401 -7439 -15345 -10902 -1641 4946 -1286 -16094 -19316
3827 -19316 -19542 -30860 -36616 -27255 -10435 -15997 -17786 -12912 -10347 -13888 -3032 -3597 -9720 -19742
3813 -19742 -14785 -10939 -7997 -15388 -473 10208 10356 -6575 -13802 -11965 -191 -3537 -5573 -9727
3799 -9727 -17328 -5238 -9554 -13569 -9084 1127 9924 10525 7493 9671 -4928 -11955 -11439 6129
3785 6129 14760 7957 -3018 -13742 -15223 4149 2251 -5488 2942 1445 6891 5985 5667 -7588
3771 -7588 -15725 -12297 -3555 9802 18609 10869 6807 17203 25487 33485 32156 27456 19731 18875 13739
3756 13739 5121 -4083 -5441 -11433 -2658 -2670 3542 -1233 -4938 4588 21761 22531 16754 17427 20307
$$ packed form
3855B2230j5660j0838m405j84j0733K147J0208L621P649l580r143p611k816n563
3841b4678R03J6704M807m636P676P625j5840p906M443R261O587o232j4808l222
3827a9316k26j1318n756R361J6820n562j789M874K565l541J0856n65o123j0022
3813a9742M957L846K942p391J4915J0681J48j6931p227J837J1774l346k036m154
3799i727p601J2090m316m015M485J0211Q797O01l032K178j4599p027N16J7568
3785F129Q631o803j0975j0724j481J9372j898p739Q430j497N446r06l18j3255
3771g588q137L428Q742J3357Q807p740m062J0396Q284P998j329m700p725q56n136
3756A3739q618r204j358n992Q775j2O212m775l705R526J7173P70n777O73K880
$$ plain form
3741 20307 8269 -2033 -4304 -10095 204 -6116 -15360 -19093 -18116 -21450 -21170 -17508 -20610 -6507
3727 -6507 -938 -6360 -2344 1410 4871 839 1141 -697 76 -2363 1931 -6010 -10872 -3325 2224
3712 2224 -7656 -4 -795 -80 -4408 -7413 -4156 -1392 3579 3221 -1930 6925 15505 15693 18592 18180
3696 18180 30835 13442 -4777 -4602 -14727 -18108 -10456 -12277 -9372 -18668 -14414 -8409 2262 10839
3682 10839 -4809 -1164 442 -16189 -24996 -15776 -230 -730 -24033 -37488 -26372 -14955 -11794
3669 -11794 -7647 5929 18789 22073 14418 8360 3945 -117 -1965 4464 13982 7421 12675 8096
3655 8096 4476 -2129 852 10792 1829 2239 -13896 -8401 -915 -6834 -10010 -14790 -9934 -9387 -6644
3640 -6644 5140 204 -3128 -4640 -19167 -20601 -17489 -8412 -8472 -5576 -16542 -5981 498 5505
$$ packed form
3741B0307j2038j0302k271n791J0299o320r244l733R77l334K80L662l102J4103
3727f507N569n422M016L754L461m032L02j838P73k439M294p941m862P547N549
3712B224r880P652p91P15m328l005L257K764M971l58n151Q855Q580J88K899m12
3696A8180J2655j7393j8219J75j0125l381P652j821K905r296M254O005J0671Q577
3682A0839j5648L645J606j6631q807R220J5546n00k3303j3455J1116J1417L161
3669a1794M147J3576J2860L284p655o058m415m062j848O429R518o561N254m579
3655H096l620o605K981R940q963M10j6135N495P486n919l176m780M856N47K743
3640f644J1784m936l332j512j4527j434L112R077o0K896j0966J0561O479N007
$$ plain form
3626 5505 -6747 -16507 -14374 276 2492 2040 11237 17111 9859 -15131 -6782 17932 14542 -1286
3612 -1286 -2379 6761 -7587 -13825 -5513 -15083 -14547 -6966 -14237 -7811 -9490 -12015 -1197 -468 -4826
3597 -4826 -8947 -1433 10003 18899 -6484 -16324 -6852 -6407 -2901 -5177 3813 20922 9274 -1597
3583 -1597 4353 9938 5307 348 -1870 -4146 3574 10621 12776 6696 8692 16500 24 -19075
3569 -19075 2107 95 -3808 -5857 -6684 -5918 -15375 -6721 -3377 -19189 -13328 -1043 6396 -1657
3555 -1657 -10063 -9570 -13415 -5630 11740 13900 381 -10092 -18765 -25441 -17939 -6826 -4371 -18718
3541 -18718 -12013 -1491 932 1086 -4662 -17316 -16776 -20085 -17591 -14895 -5452 1670 7126 5324 -4824
3526 -4824 -4158 -933 7793 3997 -3119 -12632 -14893 -8880 -15864 -20279 -20049 -17444 -12886 -11627 -8135
$$ packed form
3626E505j2252r760K133J4650K216m52R197N874p252k4990Q349K4714l390j5828
3612a286j093R140j4348o238Q312r570N36P581p271O426j679k525J0818P29m358
3597d826m121P514J1436Q896k5383r840R472M45L506k276Q990J7109j1648j0871
3583a597N950N585m631m959k218k276P720P047K155o080J996P808j6476j9099
3569a9075K1182k012l903k049q27P66r457Q654L344j5812N861J2285P439q053
3555a657q406M93l845P785J7370K160j3519j0473q673o676P502J1113K455j4347
3541a8718O705J0522K423J54n748j2654N40l309K494K696R443P122N456j802j0148
3526d824O66L225Q726l796p116r513k261O013o984m415K30K605M558J259L492
$$ plain form
3511 -8135 -3563 -23676 -14305 -2439 1768 -8179 -24391 -25143 -7559 -1232 8467 13733 15871 16774
3497 16774 6008 -11301 -17819 -17357 -7329 3998 13305 14327 28 -12488 -3886 216 -2213
3484 -2213 436 8266 2291 -7452 492 -1684 -19075 -22244 -11386 -4989 -9758 -18108 -12553 1536
3470 1536 -4767 8553 6518 2830 7230 8035 11498 10468 7576 -8007 -15947 -17995 -15909 2832
3456 2832 17585 7284 4544 7868 3721 -5580 -1436 1607 -642 -27 -1843 -13319 -15661 -27662
3442 -27662 -22734 -6802 898 -372 35 -21697 -10752 1515 -8712 -3390 5647 1907 6945 11619
3428 11619 -3112 -10451 5996 2361 5411 17485 29067 20023 19917 15922 4155 -6727 -7115 -10792
3414 -10792 -385 13516 12259 8081 -3964 1620 6633 7115 23645 20128 1803 5544 9856 15648
$$ packed form
3511h135M572k0113R371J1866M207r947j6212p52J7584O327R699N266K138R03
3497A6774j0766j7309o518M62J0028J1327R307J022j4299j2516Q602M102k429
3484b213K649P830n975r743P944k176j7391l169J0858O397m769q350N555J4089
3470A536o303J3320k035l688M400Q05L463j030k892j5583p940k048K086J8741
3456B832J4753j0301k740L324m147r301M144L043k249O15j816j1476k342j2001
3442b7662M928J5932P700j270M07k1732J0945J2267j0227N322R037l740N038M674
3428A1619j4731p339J6447l635L050J2074J1582r044j06l995j1767j0882l88l677
3414a0792J0407J3901j257m178j2045N584N013M82J6530l517j8325L741M312N792
$$ plain form
3400 15648 17247 8602 1357 7581 8698 4380 1165 -513 -4320 -242 3291 4096 13702 20095 19618
3385 19618 3291 -24622 -30839 -17446 2671 9344 7705 3269 -3037 -1619 1170 -6023 -2045 5593
3371 5593 12406 10534 -1355 5835 26634 27442 9363 -5036 6855 18716 8016 -2061 -2383
3358 -2383 4456 6531 6804 368 -3977 -6995 -7550 -17585 -14808 2053 2413 -6355 -14517 -24072 -25641
3343 -25641 -16341 2080 16095 11806 -11446 -25010 -22399 -15400 -18804 -13143 4070 1564 -3305
3330 -3305 -12958 -14127 -9233 -13615 -27630 -24501 -2771 -595 -1022 85 349 3974 -3351 1476 -2341
3315 -2341 -11831 -17998 -19712 -11494 -15605 -19392 -9509 -758 -9487 -10259 -7753 -13285 -13770 -11099 -11150 -1264
3299 -1264 12613 7720 -2236 -6275 -6724 -2639 6738 4872 10917 4264 -8985 -18662 -18974 -14199 198
$$ packed form
3400A5648J599q645p245O224J117m318l215j678l807M078L533Q05R606O393m77
3385A9618j6327k7913o217J3393K0117O673j639m436o306J418K789p193L978P638
3371E593O813j872j1889P190K0799Q08j8079j4399J1891J1861j0700j0077l22
3358b383O839K075K73o436m345l018n55j0035K777J6861L60q768q162r555j569
3343b5641R300J8421J4015m289k3252j3564K611O999l404N661J7213k506m869
3330c305r653j169M894m382j4015L129K1730K176m27J107K64L625p325M827l817
3315b341r490o167j714Q218m111l787R883Q751q729p72K506n532m85K671n1R886
3299a264J3877m893r956m039m49M085R377j866O045o653j3249r677l12M775J4397
$$ plain form
3284 198 -13965 -13469 -16921 -13802 -11553 595 386 -2595 -1273 -12323 -26503 -26306 -15221 -9028 -3537
3269 -3537 -7290 -13403 -8171 -3774 -5438 -8336 -10046 -16174 -3526 4788 -8450 -3208 -7882 -9936
3255 -9936 1868 -2483 -13427 -1558 -1327 -1417 -431 23 -1971 2765 18266 23336 11485 6219 2110
3240 2110 -3886 -16052 -14131 -7739 -4950 -8763 -10536 -5356 -1734 8794 9428 5089 4397 2384 4604
3225 4604 -264 -2029 -6671 -21775 -23856 -12203 -8882 -6597 6414 11313 15751 12241 21 -14447
3211 -14447 -14115 -16100 -26942 -27218 -26044 -16107 -5285 -1430 11090 1362 -6022 -9531 -26024 -39841
3197 -39841 -46157 -39154 -37595 -33677 -35783 -41058 -30284 -13670 -11716 -7231 5898 23013 20510 14624
3183 14624 18147 7904 -4840 -14976 -18431 -11702 -3774 2013 10989 23062 16249 15562 21994 22393
$$ packed form
3284A98j4163M96l452L119K249J2148k09k981J322j1050j4180J97J1085O193N491
3269c537l753o113N232M397j664k898j710o128J2648Q314j3238N242m674k054
3255i936J1804m351j0944J1869K31r0R86M54j994M736J5501N070j1851n266m109
3240B110n996j2166J921O392K789l813j773N180L622J0528O34m339o92k013K220
3225D604m868j765m642j5104k081J1653L321K285J3011M899M438l510j2220j4468
3211a4447L32j985j0842k76J174R937J0822L855J2520r728p384l509j6493j3817
3197c9841o316P003J559L918k106n275J0774J6614J954M485J3129J7115k503n886
3183A4624L523j0243j2744j0136l455O729P928N787Q976J2073o813o87O432L99
$$ plain form
3169 22393 22170 7944 -18879 -15442 2712 9306 11650 15202 22222 23817 16904 16222 23526 28252
3155 28252 28283 5475 5513 23634 28565 19842 5089 1356 6407 7908 921 -11459 -8826 1342
3141 1342 174 -4940 -1084 10337 9110 368 2564 926 3831 -5989 -11643 -11240 -4598 -2578 -6032
3126 -6032 -7248 -8997 -17618 -19952 -23011 -4101 1588 3310 -493 -6907 -19234 -23122 -8708 -7999
3112 -7999 -9406 -8566 -12239 -5504 -9266 -12749 -16047 -24836 -22884 -25729 -21674 -20943 -1613 8992 6108
3097 6108 2027 -3197 -9076 -1896 -6652 -8387 -2890 -785 -6600 -17755 -7905 -2831 -8336 6774
3083 6774 16986 23533 21806 5777 -4149 -7267 -243 6065 8203 8499 16313 19409 1126 484 3359
3068 3359 -1607 -725 9295 20298 28013 15566 959 -5669 -10212 -10112 1020 -3443 1342 -6884
$$ packed form
3169B2393k23j4226k6823L437J8154O594K344L552P020J595o913o82P304M726
3155B8252L1k2808L8J8121M931q723j4753l733N051J501o987j2380K633J0168
3141A342j168n114L856J1421j227q742K196j638K905r820n654M03O642K020l454
3126f032j216j749q621k334l059J8910N689J722l803o414j2327l888J4414P09
3112g999j407Q40l673O735l762l483l298q789J952k845M055P31J9330J0605k884
3097F108m081n224n879P180m756j735N497K105n815j1155R850N074n505J5110
3083F774J0212O547j727j6029r926l118P024O308K138K96P814L096j8283o42K875
3068C359m966Q82J0020J1003P715j2447j4607o628m543J00J1132m463M785q226
$$ plain form
3054 -6884 -15371 -11836 1436 8950 6950 6388 10033 11547 9149 2865 9881 9383 11520 14254 7516
3039 7516 -7480 -2400 3172 1488 -5479 -14673 -11891 -7239 7715 18657 12564 8149 2692 7728
3025 7728 10377 16753 12953 -1083 -17586 -7693 4387 2660 8657 17095 11285 7767 9212 9559
3011 9559 568 -3819 -11636 -20711 -32792 -25329 -18395 -4193 921 8119 11148 2623 -9727 -10825
2997 -10825 -19059 -11525 -8833 -4973 11585 4112 7987 -2471 -9111 3185 3586 140 10184 15016
2983 15016 1390 -5664 -472 -9702 -13509 366 9279 -673 -2389 1367 -7666 -14659 -7891 -1566
2969 -1566 10347 10776 10619 14766 6963 -11843 -4611 8501 15606 20587 26698 17067 9422 11236 13811
2954 13811 13594 15515 6594 -4911 5233 -3373 -18490 -29389 -9704 5692 10365 188 -7354
$$ packed form
3054f884q487L535J3272P514k000n62L645J514k398o284P016m98K137K734o738
3039G516j4996N080N572j684o967r194K782M652J4954J0942o093m415n457N036
3025G728K649O376l800j4036j6503R893J2080j727N997Q438n810l518J445L47
3011I559q991m387p817r075j2081P463O934J4202N114P198L029q525j2350j098
2997a0825q234P534K692L860J6558p473L875j0458o640J2296M01l446J0044M832
2983A5016j3626p054N192r230l807J3875Q913r952j716L756r033o993O768O325
2969a566J1913M29j57M147p803j8806P232J3112P105M981O111r631p645J814K575
2954A3811k17J921q921j1505J0144q606j5117j0899J9685J5396M673j0177p542
$$ plain form
2941 -7354 -7205 6705 4490 -688 12169 28124 35418 31906 25501 9289 -6813 -9261 -13358 -15028
2927 -15028 -14960 -22488 -12509 -917 2496 5614 3821 465 5449 4580 2630 -10525 -17368 -15193 -10882
2912 -10882 -6412 -4123 2012 -10534 -3152 -4799 3366 -2647 -18042 -34343 -36585 -19717 -9142
2899 -9142 -12824 -5368 -14425 -19699 -12104 -11118 -6986 -6048 -6270 5190 4059 4123 13368 8928 4543 1822
2883 1822 -3532 -10875 -6533 -18451 -20830 -19106 -9184 -5725 1626 7976 19836 13767 3314 620
2869 620 5798 1531 -10809 -18490 -19588 -17701 -19879 -25812 -17705 -14670 -10308 -2745 -8956 -692 -8458
2854 -8458 -4824 -285 -2283 -1717 -5056 -126 -5202 -10615 -5009 -10168 -12044 1170 2581 -10857 3846
2839 3846 20730 19505 10982 13580 18806 6525 -56 12377 18572 10989 -7819 -12890 9500 13129
$$ packed form
2941g354J49J3910k215n178J2857J5955P294l512o405j6212j6102k448m097j670
2927a5028O8p528R979J1592L413L118j793l356M984q69j950j3155o843K175M311
2912a0882M470K289O135j2546P382j647Q165o013j5395j6301k242J6868J0575
2899i142l682P456r057n274P595R86M132R38k22J1460j131O4R245m440m385k721
2883A822n354p343M342j1918k379J724R922L459P351O350J1860o069j0453k694
2869F20N178m267j2340p681j098J887k178n933Q107L035M362P563o211Q264p766
2854h458L634M539j998N66l339M930n076n413N606n159j876J3214J411j3438J4703
2839C846J6884j225q523K598N226j2281o581J2433O195p583j8808n071K2390L629
$$ plain form
2825 13129 -4830 -36 -1047 -5907 -3626 5768 6837 15429 15700 -2629 -3831 4642 5787 5228 3261
2810 3261 -7401 -10947 -15714 -12272 -9577 -7963 -16379 -12784 -9488 -5810 -3791 773 4192 3077 -6640
2795 -6640 -16495 -6055 5945 9909 5483 11629 20385 25136 22999 14543 3928 6587 1020 -5514
2781 -5514 -4789 -1435 -4066 -12630 -9814 -11118 -12298 -7670 -4269 -6855 -6736 -4302 -1080 9218 5886
2766 5886 -3498 5628 11288 546 -13728 -8895 -1536 -3348 4946 9276 1174 2789 3854 -3146
2752 -3146 -6156 -790 -4953 -4969 -6762 -6244 -24832 -31753 -6460 -539 -18183 -19946 -16301 -14578 -14398
2737 -14398 -2614 11471 6173 -11286 -4738 -4342 4606 6763 12670 11002 5082 -578 -1698 -3453
2723 -3453 -14940 -33359 -25065 -20163 -9820 7905 130 -12217 -8728 -11021 -8459 -5399 -12848 -12239
$$ packed form
2825A3129j7959M794j011m860K281R394J069Q592K71j8329j202Q473J145n59j967
2810C261j0662l546m767L442K695J614q416L595L296L678K019M564L419j115r717
2795f640r855J0440J2000L964m426O146Q756M751k137q456j0615K659n567o534
2781e514P25L354k631q564K816j304j180M628L401k586J19K434L222J0298l332
2766E886r384R126N660j0742j4274M833P359j812Q294M330q102J615J065p000
2752c146l010N366m163j6j793N18j8588o921K5293N921j7644j763L645J723J80
2737a4398J1784J4085n298j7459O548L96Q948K157N907j668n920n660j120j755
2723c453j1487j8419Q294M902J0343J7725p775j2347L489k293K562L060p449O09
$$ plain form
2709 -12239 -6582 4423 2828 -3442 -611 1054 -2342 3469 9872 1734 2759 12099 1542 8747
2695 8747 23587 24714 20733 30770 31228 21411 4478 -3494 13850 10322 8292 9068 -3810 -13156
2681 -13156 -5089 6484 -337 -2188 -1730 -6767 -9547 -23082 -15794 -9174 -5397 1046 -5147 -14861
2667 -14861 -2806 5653 9887 2352 -2288 15245 14779 -1381 -10944 -33676 -28157 -6644 -1652 -11162
2653 -11162 -18394 -9642 2285 4403 5879 8552 1656 -1070 3202 -5401 -12961 -3295 -4709 -12599
2639 -12599 284 11807 14582 15779 13793 7537 -1255 -1766 3410 13490 4906 4627 7730 5355
2625 5355 8618 3763 12837 4374 6358 17127 14162 13157 7070 -972 -3037 3319 -1825 -6088 1003
2610 1003 13464 -548 10730 11658 18611 13919 7383 3133 -3929 -6280 -9776 -19909 -25429 -19936
$$ packed form
2709a2239N657J1005j595o270K831J665l396N811O403q138J025R340j0557P205
2695H747J4840J127l981J0037M58r817j6933p972J7344l528k030P76j2878r346
2681a3156Q067J1573o821j851M58n037k780j3535P288O620L777O443o193r714
2667a4861J2055Q459M234p535m640J7533m66j6160r563k2732N519K1513M992r510
2653a1162p232Q752J1927K118J476K673o896k726M272q603p560R666j414p890
2639a2599J2883J1523K775J197j986o256q792n11N176J0080q584k79L103k375
2625E355L263m855R074q463J984J0769k965j005o087q042k065O356n144m263P091
2610A003J2461j4012J1278R28O953m692o536m250p062k351l496j0133n520N493
$$ plain form
2596 -19936 -19027 -22738 -16628 -16483 -10128 1350 13684 -165 -16613 -10729 -4806 -2501 -14095 -15296
2582 -15296 -10024 -3767 -4107 -12451 -1584 19447 19038 3298 -5294 6617 16917 17165 8812 9429
2568 9429 8656 3837 -9180 -20031 -9578 -13450 -20562 -18519 469 -7021 -2452 -4473 -1928 -12585
2554 -12585 -13361 -7734 -4321 -4999 -8851 -2384 25 -8503 -584 15732 24576 10021 -15338 -14190
2540 -14190 -14231 -11131 2307 7312 4275 6442 3876 6782 -8861 -10772 -25922 -24995 -14316 -12094
2526 -12094 -25690 -28003 -13487 -7563 -3693 4063 4222 11456 2325 2665 -3599 -4435 -2767 -11176 -15475
2511 -15475 -14417 -10062 -9804 -7912 -23927 -26177 -29908 -36344 -34577 -20176 -14885 -12311 -11929 -21457 -24192
2496 -24192 -23018 -25857 -36727 -27990 -23184 -30871 -26680 -7264 -18234 -17664 -5848 -3667 -6255 -11831
$$ packed form
2596a9936R09l711O110J45O355J1478J2334j3849j6448N884N923K305j1594j201
2582a5296N272O257l40q344J0867K1031m09j5740q592J1911J0300K48q353O17
2568I429p73m819j3017j0851J0453l872p112K043J8988p490M569k021K545j0657
2554a2585p76N627L413o78l852O467K409q528P919J6316Q844j4555k5359J148
2540a4190m1L100J3438N005l037K167k566K906j5643j911j5150R27J0679K222
2526a2094j3596k313J4516N924L870P756J59P234r131L40o264q36J668q409m299
2511a5475J058M355K58J892j6015k250l731o436J767J4401N291K574L82r528k735
2496b4192J174k839j0870Q737M806p687M191J9416j0970N70J1816K181k588n576
$$ plain form
2482 -11831 -8326 -141 2002 -1990 1214 -10898 -11867 -1739 -4174 -9338 -2548 -4667 -17538 -20506
2468 -20506 -7016 -2892 -10999 -7614 -19166 -8998 -4648 -10360 -13284 -18889 -20251 -17052 -21031 -11392
2454 -11392 -4413 927 -8051 -8109 -14019 -25690 -13459 -9999 -5926 -10713 -15564 -3839 16100 13920
2440 13920 9448 21669 47595 39541 24017 13183 10266 -3720 -12737 -21684 -21491 -18643 -16385 -13333
2426 -13333 -14949 -11008 -5283 -18071 -9431 140 2855 645 1587 8703 2900 34 12027 3046
2412 3046 -13147 -12083 -6132 -13672 -8642 -9162 8470 4733 -4002 5040 14558 32936 27486 15547
2398 15547 -1372 3183 14658 19423 16753 10539 2325 -5194 -13573 -18489 -13491 -3407 12755 16683
2384 16683 17902 12642 8341 -5294 -11637 5993 10749 10425 5354 -3208 -1501 -1516 -2682 -2719 -2225 18762
$$ packed form
2482a1831L505Q185K143l992L204j2112r69J0128k435n164O790k119j2871k968
2468b0506J3490M124q107L385j1552J0168M350n712k924n605j362L199l979R639
2454a1392O979N340q978n8n910j1671J2231L460M073m787m851J1725J9939k180
2440A3920m472J2221K5926q054j5524j0834k917j3986r017q947J93K848K258L052
2426a3333j616L941N725j2788Q640R571K715k210R42P116n803k866J1993q981
2412C046j6193J064N951p540N030n20J7632l737q735R042R518J8378n450j1939
2398A5547j6919M555J1475M765k670o214q214p519q379m916M998J0084J6162L928
2384A6683J219n260m301j3635o343J7630M756l24n071q562J707j5j166l7M94K0987
$$ plain form
2368 18762 14942 -1027 -4898 -11508 -11824 6937 5420 5379 -2555 7243 13315 3243 -1840 -12517
2354 -12517 -7202 6416 17565 10614 -9201 -14362 -6263 -6209 -3048 1177 6988 14838 14158 -996
2340 -996 -2443 2138 -2670 4545 9162 6099 2968 5493 -5845 -6635 -15377 -20448 -25918 -14791 -5844
2325 -5844 -5638 -14003 -27888 -19076 -11869 -14977 -8201 -952 -2444 -6561 -18808 -13666 -9244 -3402 9219
2310 9219 5612 -4875 -18301 -15621 -2445 -3526 1262 -3365 4488 -224 595 976 -1174 4242 4632
2295 4632 1778 4666 6460 -6467 -2525 13803 8491 -10945 -18392 -13607 -9721 -9280 -5912 -6262 -598
$$ packed form
2368A8762l820j5969l871o610l16J8761j517m1p934R798O072j0072n083j0677
2354a2517N315J3618J1149o951j9815n161Q099N4L161M225N811P850o80j5154
2340i96j447M581m808P215M617l063l131K525j1338p90q742n071n470J1127Q947
2325e844K06q365j3885Q812P207l108O776P249j492m117j2247N142M422N842J2621
2310I219l607j0487j3426K680J3176j081M788m627P853m712Q19L81k150N416L90
2295D632k854K888J794j2927L942J6328n312j9436p447M785L886M41L368l50N664
$$ [...]
##END NTUPLES=NMR SPECTRUM
##END=
