##TITLE=Analysis number 329906
Compound Code cc 31205
Project Code adrs
Chemist Name fudan
##JCAMPDX= 6.0         $$ Bruker NMR JCAMP-DX V2.0
##DATA TYPE= NMR SPECTRUM
##DATA CLASS= NTUPLES
##ORIGIN= Bruker BioSpin GmbH
##OWNER= nmr
$$ XWIN-NMR		Version 3.5
$$ Wed Oct 10 11:14:16 2007 GMT Daylight Time (UT+1h)  MAYBRIDGE\nmr@NMR_250MHZ
##.OBSERVE FREQUENCY= 250.131544655141
##.OBSERVE NUCLEUS= ^1H
##.ACQUISITION MODE= SIMULTANEOUS (DQD)
##.ACQUISITION SCHEME= undefined
##.AVERAGES= 16
##.DIGITISER RES= 18
##SPECTROMETER/DATA SYSTEM= dpx250
##.PULSE SEQUENCE= zg30
##.SOLVENT NAME= CDCl3
##.SHIFT REFERENCE= (INTERNAL, CDCl3, 0, 16.522)
##AUDIT TRAIL= $$ (NUMBER, WHEN, WHO, WHERE, WHAT)
$$ ##TITLE= Audit trail, XWIN-NMR		Version 3.5
$$ ##JCAMPDX= 5.01
$$ ##ORIGIN= Bruker BioSpin GmbH
$$ ##OWNER= nmr
$$ C:\u/data/dgb/nmr/ADRS/570/pdata/1/auditp.txt
$$ ##AUDIT TRAIL=  $$ (NUMBER, WHEN, WHO, WHERE, WHAT)
(   1,<2007-10-10 11:13:49.81 +100>,<MAYBRIDGE\nmr>,<NMR_250MHZ>,
      <created by zg, POWCHK disabled, PULCHK disabled
       configuration hash MD5:
       76 6E 9A 78 1E 09 19 81 EC 84 63 8F B0 6A 59 2D
       data hash MD5: 64K
       43 F6 61 0C DA D1 1C 3C A9 53 F4 34 34 70 C1 E9>)
(   2,<2007-10-10 11:14:05.97 +100>,<MAYBRIDGE\nmr>,<NMR_250MHZ>,
      <Start of raw data processing
       ef LB = 0.3 FT_mod = 6 PKNL = 1 SI = 32K 
       data hash MD5: 32K
       88 E9 60 6D CF 5B 4C BB 8C 95 2E 72 53 A9 9F B2>)
(   3,<2007-10-10 11:14:07.56 +100>,<MAYBRIDGE\nmr>,<NMR_250MHZ>,
      <apk 
       data hash MD5: 32K
       21 28 7F 4F 0A B2 61 80 A7 C2 E3 0A 02 23 0B C9>)
(   4,<2007-10-10 11:14:08.28 +100>,<MAYBRIDGE\nmr>,<NMR_250MHZ>,
      <abs ABSG = 5 
       data hash MD5: 32K
       FA E0 91 34 46 40 2E 4E FC 21 80 54 E6 50 CB 9E>)
$$ ##END=
$$ 
$$ hash MD5
$$ C4 51 90 BB 8F 5A ED 16 90 09 A4 74 E3 AF 33 FE
##$RELAX= 
##$RELAX= 
##$RELAX= 
##$RELAX= 
##$RELAX= 
##$RELAX= 
##$RELAX= 
$$ Bruker specific parameters
$$ --------------------------
##$DU= <C:\u>
##$EXPNO= 570
##$NAME= <ADRS>
##$PROCNO= 1
##$TYPE= <nmr>
##$USER= <dgb>
##$AMP= (0..31)
100 100 100 100 100 100 100 100 100 100 100 100 100 100 100 100 100 100 
100 100 100 100 100 100 100 100 100 100 100 100 100 100 
##$AQSEQ= 0
##$AQ_mod= 3
##$AUNM= <au_zg>
##$AUTOPOS= <9 >
##$BF1= 250.13
##$BF2= 250.13
##$BF3= 250.13
##$BF4= 250.13
##$BF5= 500.13
##$BF6= 500.13
##$BF7= 500.13
##$BF8= 500.13
##$BYTORDA= 1
##$CFDGTYP= 0
##$CFRGTYP= 5
##$CHEMSTR= <none>
##$CNST= (0..31)
1 1 145 1 1 1 1 1 1 1 1 1 1 1 1 1 1 1 1 1 1 1 1 1 1 1 1 1 1 1 1 1 
##$CPDPRG= <>
##$CPDPRG1= <>
##$CPDPRG2= <>
##$CPDPRG3= <>
##$CPDPRG4= <mlev>
##$CPDPRG5= <mlev>
##$CPDPRG6= <mlev>
##$CPDPRG7= <mlev>
##$CPDPRG8= <mlev>
##$CPDPRGB= <>
##$CPDPRGT= <>
##$D= (0..31)
0 1 0 0 0 0 0 0 0 0.06 0 0 0 0 0 0 0.0002 0 0 0 0 0 0 0 0 0 0 0 0 0 0 
0 
##$DATE= 1192011228
##$DBL= (0..7)
120 120 120 120 120 120 120 120 
##$DBP= (0..7)
150 150 150 150 150 150 150 150 
##$DBP07= 0
##$DBPNAM0= <>
##$DBPNAM1= <>
##$DBPNAM2= <>
##$DBPNAM3= <>
$$ [...]
##$SUBNAM7= <"">
##$SUBNAM8= <"">
##$SUBNAM9= <"">
##$SW= 20.6930455092707
##$SWIBOX= (0..15)
0 0 3 0 0 0 0 0 0 0 0 0 0 0 0 0 
##$SW_h= 5175.983436853
##$TD= 65536
##$TD0= 1
##$TE= 296.16
##$TE2= 300
##$TE3= 300
##$TEG= 300
##$TL= (0..7)
0 120 120 120 120 120 120 120 
##$TP= (0..7)
150 150 150 150 150 150 150 150 
##$TP07= 0
##$TPNAME0= <>
##$TPNAME1= <>
##$TPNAME2= <>
##$TPNAME3= <>
##$TPNAME4= <>
##$TPNAME5= <>
##$TPNAME6= <>
##$TPNAME7= <>
##$TPOAL= (0..7)
0.5 0.5 0.5 0.5 0.5 0.5 0.5 0.5 
##$TPOFFS= (0..7)
0 0 0 0 0 0 0 0 
##$TUNHIN= 0
##$TUNHOUT= 0
##$TUNXOUT= 0
##$USERA1= <user>
##$USERA2= <user>
##$USERA3= <user>
##$USERA4= <user>
##$USERA5= <user>
##$V9= 5
##$VALIST= <valist>
##$VCLIST= <CCCCCCCCCCCCCCC>
##$VD= 0
##$VDLIST= <DDDDDDDDDDDDDDD>
##$VPLIST= <PPPPPPPPPPPPPPP>
##$VTLIST= <TTTTTTTTTTTTTTT>
##$WBST= 1024
##$WBSW= 4
##$XGAIN= (0..3)
0 0 0 0 
##$XL= 0
##$YL= 0
##$YMAX_a= 270127
##$YMIN_a= -312314
##$ZGOPTNS= <>
##$ZL1= 120
##$ZL2= 120
##$ZL3= 120
##$ZL4= 120
##$ABSF1= 16.522
##$ABSF2= -4.171173
##$ABSG= 5
##$ABSL= 3
##$ALPHA= 0
##$AQORDER= 0
##$ASSFAC= 0
##$ASSFACI= 0
##$ASSFACX= 0
##$ASSWID= 0
##$AUNMP= <proc_1d>
##$AZFE= 0.1
##$AZFW= 0.1
##$BCFW= 0
##$BC_mod= 0
##$BYTORDP= 0
##$COROFFS= 0
##$CY= 12.5
##$DATMOD= 1
##$DC= 0
##$DFILT= <>
##$DTYPP= 0
##$F1P= 14.0000005364418
##$F2P= -0.99999901652339
##$FCOR= 0.5
##$FTSIZE= 32768
##$FT_mod= 6
##$GAMMA= 0
##$GB= 0
##$INTBC= 1
##$INTSCL= 1
##$ISEN= 128
##$LB= 0.3
##$LEV0= 0
##$LPBIN= 0
##$MAXI= 10000
##$MC2= 0
##$MEAN= 0
##$ME_mod= 0
##$MI= 0
##$NCOEF= 0
##$NC_proc= -3
##$NLEV= 6
##$NOISF1= 0
##$NOISF2= 0
##$NSP= 0
##$NTH_PI= 0
##$NZP= 0
##$OFFSET= 16.522
##$PC= 1
##$PHC0= 159.5074
##$PHC1= 7.331896
##$PH_mod= 1
##$PKNL= yes
##$PPARMOD= 0
##$PSCAL= 4
##$PSIGN= 0
##$REVERSE= no
##$SF= 250.13
##$SI= 32768
##$SIGF1= 0
##$SIGF2= 0
##$SINO= 400
##$SIOLD= 32768
##$SREGLST= <1H.CDCl3>
##$SSB= 0
##$STSI= 32768
##$STSR= 0
##$SW_p= 5175.98343685301
##$SYMM= 0
##$S_DEV= 0
##$TDeff= 65536
##$TDoff= 0
##$TI= <Analysis number 999999
Compound Code 99
Book Reference 9
Project Code 9>
##$TILT= no
##$TM1= 0
##$TM2= 0
##$TOPLEV= 0
##$USERP1= <user>
##$USERP2= <user>
##$USERP3= <user>
##$USERP4= <user>
##$USERP5= <user>
##$WDW= 1
##$XDIM= 32768
##$YMAX_p= 347734341
##$YMIN_p= -220684
$$ End of Bruker specific parameters
$$ ---------------------------------
##NTUPLES= NMR SPECTRUM
##VAR_NAME=  FREQUENCY,     SPECTRUM/REAL,   SPECTRUM/IMAG
##SYMBOL=    X,             R,               I
##VAR_TYPE=  INDEPENDENT,   DEPENDENT,       DEPENDENT
##VAR_FORM=  AFFN,          ASDF,            ASDF
##VAR_DIM=   32768,         32768,           32768
##UNITS=     HZ,            ARBITRARY UNITS, ARBITRARY UNITS
##FACTOR=    0.157963299565203, 1,           1
##FIRST=     4132.6476996994, 0,             0
##LAST=      -1043.33573715361, 0,           0
##MIN=       -1043.33573715361, -220684,     0
##MAX=       4132.6476996994, 347734341,     0
$$ Real data points
##PAGE= N=1
##DATA TABLE= (X++(R..R)), XYDATA
$$ [...]
##PAGE= N=2
##DATA TABLE= (X++(I..I)), XYDATA
18629B89423k6200573r601941K828531L674427p713598k0045816j9083683q971145
18621h4824375J123603P454263Q563170P312947N937644M963070M205480L452351
18613d1811847K786491K355267K111165J884050J656799J503608J429718J368456
18605b6716293J316809J208592J020007Q70215P78167P10757P27510P47779P04849
18596a8631608O14946N25956N24526M98826M73127N42009N25417N76514N07980
18587a3842307N14356M80972M15738L63762L30980L78886L67287K93893L27748
18578a0368685K98927K52666K59591L09381L24835L23879K59349L05284K15207
18569g819566K60044K36037J96219K31150K33063K08717K49729K34504K86882
$$ y = [289423, -25911150, -35513091, -32684560, -29010133, -36723731, -56769547, -75853230, -84824375, -83700772, -76246509, -67683339, -60370392, -54432748, -49469678, -45264198, -41811847, -39025356, -36670089, -34558924, -32674874, -31018075, -29514467, -28084749, -26716293, -25399484, -24190892, -23170885, -22300670, -21522503, -20811746, -20084236, -19336457, -18631608, -18016662, -17490706, -16966180, -16467354, -15994227, -15452218, -14926801, -14350287, -13842307, -13327951, -12846979, -12431241, -12067479, -11736499, -11357613, -10990326, -10696433, -10368685, -10069758, -9817092, -9557501, -9248120, -8923285, -8599406, -8340057, -8034773, -7819566, -7559522, -7323485, -7127266, -6896116, -6663053, -6454336, -6204607, -5970103, -5683221]
18560e683221K12884J95068J88606J79297J47103J38933J43036J80448K19539
18551d078307J60073J64967J93519K26947K81852K41720J45701J35811K10162
18542b317555J78442J89486J98451J23990K53662K95674K82161J86218K06107
18533d03364K14279K83107L62979K95849K92766L11344J84654K54596L58216L05558
18523B459984L36212L20054K21883L37128L64758L72167M47400M58831M10064
18514E728481N21063N85890O29162O44610O72830P92364Q84029J010998J209272
18505A2678699J278012J445628J659099J710750J917957K300102K846583L061836
18497B8898666K695132J054854k848946o982700m968645m027328n610111q368440
$$ y = [-5683221, -5470337, -5275269, -5086663, -4907366, -4760263, -4621330, -4478294, -4297846, -4078307, -3918234, -3753267, -3559748, -3332801, -3050949, -2809229, -2663528, -2527717, -2317555, -2139113, -1949627, -1751176, -1627186, -1373524, -1077850, -795689, -609471, -403364, -189085, 94022, 457001, 752850, 1045616, 1356960, 1541614, 1796210, 2154426, 2459984, 2796196, 3116250, 3338133, 3675261, 4040019, 4412186, 4859586, 5318417, 5728481, 6249544, 6835434, 7464596, 8109206, 8782036, 9574400, 10458429, 11469427, 12678699, 13956711, 15402339, 17061438, 18772188, 20690145, 22990247, 25836830, 28898666, 31593798, 32648652, 29799706, 22817006, 17848361, 13821033, 8210922, -157518]
18489a57518q090404r408963m933234k792671l758314n375427k475783j7888K691279
18480c4318923L554612L201260K644469K206673J826447J522884J288148J185106
18472a6889324J084696R84639R24178Q35397P35809P11169P32505O07147N56071
18463i717713O08894N69663M98262N19858N51425M79865M48124N14357O04591
18454d922674N40534O34200O79226P17664P63076Q74910R70265J009291J102896
18445B369388J265699J450247J709533J837603J698510R23838r56868l771333
18437F526617l042329k220133k693316m575014m419688n561526l410641j642600
18429b1038630j860513l226717j704401k38733J346063K134906J982391J539917
$$ y = [-157518, -8247922, -17656885, -22590119, -25382790, -29141104, -34516531, -36992314, -37010202, -34318923, -30764311, -27563051, -24918582, -22711909, -20885462, -19362578, -18074430, -16889324, -15804628, -14819989, -13895811, -13060414, -12324605, -11613436, -10880931, -10273784, -9717713, -9108819, -8539156, -8040894, -7521036, -6969611, -6489746, -6041622, -5527265, -4922674, -4382140, -3747940, -3068714, -2351050, -1587974, -713064, 257201, 1266492, 2369388, 3635087, 5085334, 6794867, 8632470, 10330980, 11254818, 10297950, 6526617, 3484288, 1264155, -1429161, -6004175, -10423863, -15985389, -19396030, -21038630, -22899143, -26125860, -27830261, -28068994, -26722931, -24588025, -22605634, -21065717]
18421b1065717J319017J132808R38890P66266O63715N72605N38975N16613M90951
18412a4125877M49873M26232L75226L40851M00249L38957K18238J83347J78938
18403a1213966J79328K31152K15683J47485J60706J84049J73881J79148J58592
18394i583942J17663J63206K41882J47919J55782L7229J01753R6709J23085K20271
18384h178443J59939P3336K6452K6239O9454O8665N1412K6781L0M3126J00867
18373g532142J25141J01365P7600O4386O3038J31661R5604P5756N6079O4305Q6018
18362f591189O9608M0686O7506Q5699M6680L3935J01066R4413M1285l9298K6052
18351f023557L8478J5295N4311N1858Q7485L8778K7107R0292P9103O628N2429
$$ y = [-21065717, -19746700, -18613892, -17675002, -16908736, -16245021, -15672416, -15133441, -14616828, -14125877, -13676004, -13249772, -12874546, -12533695, -12133446, -11794489, -11576251, -11392904, -11213966, -11034638, -10803486, -10587803, -10440318, -10279612, -10095563, -9921682, -9742534, -9583942, -9466279, -9303073, -9061191, -8913272, -8757490, -8720261, -8618508, -8521799, -8398714, -8178443, -8018504, -7945168, -7918716, -7892477, -7823023, -7754358, -7702946, -7676165, -7676135, -7633009, -7532142, -7407001, -7305636, -7228036, -7163650, -7100612, -6968951, -6873347, -6797591, -6741512, -6677207, -6591189, -6521581, -6480895, -6413389, -6327690, -6281010, -6247075, -6146009, -6051596, -6010311, -6049609, -6023557, -5985079, -5969784, -5915473, -5863615, -5776130, -5737352, -5710245, -5619953, -5540850, -5534222, -5481793]
18340e481793O0963J19851J5041k4705L7560Q2285O4658K2343Q7317J5891j642
18329e002231o922M4140O6205N6316L7020N5774N596j6403K3823P5748Q889Q6032
18317d566013J01401L5183N80M151L7251K5520K5891L0019J0996N8457r059N9484
18305d186139O04j101J13696R7123L3197K7122N6557J9179J6433L6272P1716L6587
18293c678754k7125j3118N0499M0034k2511R06O4913N3682n242p724K8279K8014
18281c488147j6557O7735Q2936M4495M3379R989K003m231j218J6437K2271R631
18269c211277l8335P6913J15345M7400O2957Q3710k829q3712m8501p418Q0478
18258b925269O0403M6178L7570m800K925R0374m2124R342J02033L4048r108J03972
$$ y = [-5481793, -5420830, -5300979, -5285938, -5310643, -5273083, -5190798, -5126140, -5103797, -5016480, -5000589, -5002231, -5009153, -4965013, -4898808, -4842492, -4805472, -4749698, -4744102, -4760505, -4736682, -4660934, -4652045, -4566013, -4464612, -4429429, -4428849, -4424698, -4387447, -4361927, -4336036, -4306017, -4295021, -4236564, -4245623, -4186139, -4185535, -4186636, -4072940, -3975817, -3942620, -3915498, -3858941, -3839762, -3823329, -3787057, -3715341, -3678754, -3705879, -3718997, -3668498, -3628464, -3650975, -3650069, -3585156, -3531474, -3536716, -3544440, -3516161, -3488147, -3504704, -3436969, -3354033, -3309538, -3266159, -3256170, -3254167, -3258398, -3259616, -3243179, -3220908, -3211277, -3249612, -3172699, -3057354, -3009954, -2946997, -2863287, -2866116, -2949828, -2998329, -3005747, -2925269, -2864866, -2818688, -2781118, -2785918, -2782993, -2692619, -2734743, -2725401, -2623368, -2589320, -2598428, -2494456]
18246b494456R0198m76N722j5125M1200L6011K6937M1092k9673K2224Q6458L9426
18234b150462Q2052K9588j9473L4410K0066K0527M7159N1827q186K3521J9435
18223a849536L1714L6118M0824P6909L7383K2070n037k1211R4784Q7679O4032
18212a384271R6923l2575J9123L0657M6296L8559q4770J1238M3136L4532O4580
18201a116572R1012Q9874N7973k3926K1151L3357M7577J15262J10936n128M653
18190e73831k977M3761R283N5451P9690Q5178P6360Q5517K1198L7611L5260L4532
18178a2967M0601O0234O8637N9987P0534J26687J08719J07421N7631K1756J40409
18167H49649J7642N1724J64315J07698Q5246J28217J7135o263L9653N1291Q6539
$$ y = [-2494456, -2404258, -2404734, -2399012, -2414137, -2372937, -2336926, -2309989, -2268897, -2298570, -2276346, -2189888, -2150462, -2068410, -2038822, -2058295, -2023885, -2003819, -1983292, -1936133, -1884306, -1892492, -1868971, -1849536, -1817822, -1781704, -1740880, -1663971, -1626588, -1604518, -1609555, -1630766, -1535982, -1448303, -1384271, -1287348, -1319923, -1300800, -1270143, -1223847, -1185288, -1270058, -1258820, -1215684, -1181152, -1116572, -1025560, -935686, -877713, -901639, -880488, -847131, -799554, -684292, -573356, -578484, -573831, -576808, -533047, -523764, -468313, -388623, -303445, -227085, -141568, -120370, -82759, -47499, -12967, 27634, 87868, 156505, 216492, 287026, 413713, 522432, 629853, 687484, 709240, 849649, 867291, 919015, 1083330, 1191028, 1276274, 1404491, 1421626, 1415363, 1455016, 1506307, 1592846]
18156A592846J27948J57868J53010J57492J29015J20886K46593J74226J68113
18147C027997J30840R2265R6309J04682J99493K10124K34487K52898K78821K30975
18137D858891K89253L36029L52850L62683M09810M06630M96571N56203N81381
18128H650301O18108P57420P92778Q87609R94256J124071J242827J436054J715754
18119A8219178J993471K406719K707153K717318L050788M310640N766034O062083
18111D7233384K478009p324455l1725670m1108441k1690655r118957N519465Q316292
18103d7421028O756705N054317L955944L139529K461088K079446J784310J496002
18095b0693687J273082J101937R63649Q38291O65512O33863N94429N70687N19976
$$ y = [1592846, 1720794, 1878662, 2031672, 2189164, 2318179, 2439065, 2685658, 2859884, 3027997, 3158837, 3251102, 3347411, 3452093, 3651586, 3861710, 4096197, 4349095, 4627916, 4858891, 5148144, 5484173, 5837023, 6199706, 6609516, 7016146, 7512717, 8068920, 8650301, 9268409, 10025829, 10818607, 11706216, 12700472, 13824543, 15067370, 16503424, 18219178, 20212649, 22619368, 25326521, 28043839, 31094627, 35405267, 41171301, 47233384, 49711393, 42386938, 10661268, -30447173, -52137828, -61256785, -55737320, -47421028, -40664323, -35610006, -31654062, -28514533, -26053445, -23973999, -22189689, -20693687, -19420605, -18318668, -17355019, -16516728, -15851216, -15217353, -14622924, -14052237, -13532261]
18086a3532261M51243M19724M17580L47314L13385K96429L15274L60338L64751
18077a0246223K47816K05491K57559K03133J91842J56426K43182J95119K10456
18068h335199K28247J37664J09340J40211J41259Q1954J85365J43360O9080J05242
18058f993477J88847J22902j7688k8190J0211N5960J17338Q5618m5917n6162l1390
18047f591948q578O4009O7198R3637M6890R5811R3729P5630M5992m713O9199J05891
18035e847253J52247P1526r308l003P1956J6373M4454J10774M5006J4493K4619
18024e308116Q1485R3031K5021K4756P0064Q3412L4019L6032L6280K6878L4506
18013d762632J0201L1890O5160K028N2854M7262J0395O206K3415k3761K0729J3962
$$ y = [-13532261, -13081018, -12661294, -12243714, -11896400, -11583015, -11286586, -10971312, -10610974, -10246223, -9998407, -9792916, -9535357, -9332224, -9140382, -8983956, -8740774, -8545655, -8335199, -8106952, -7969288, -7859948, -7719737, -7578478, -7496524, -7311159, -7167799, -7098719, -6993477, -6804630, -6681728, -6699416, -6727606, -6717395, -6661435, -6544097, -6458479, -6504396, -6560558, -6591948, -6600526, -6536517, -6469319, -6375682, -6328792, -6232981, -6139252, -6063622, -6017630, -6022343, -5953144, -5847253, -5695006, -5623480, -5632788, -5635791, -5563835, -5547462, -5503008, -5392234, -5347228, -5332735, -5308116, -5226631, -5133600, -5108579, -5083823, -5013759, -4930347, -4896328, -4860296, -4824016, -4797138, -4762632, -4752431, -4720541, -4655381, -4653353, -4600499, -4553237, -4542842, -4536636, -4513221, -4536982, -4516253, -4502291]
18001d502291O6586O5237J3067L2452N971J0087N5335j0389P1786n508J2585J8594
17989d166488O396m2662J11421O7352m605L2028J18577J24009R939j28127r512
17978c881672j9226m3604m8771L7650P6158J7440o976Q2490J1981k878J5956M2531
17966c718921O9311O4929R081L8175Q633k6924j06477p0700k8566O6862K3800
17955c670797J646q8202n7532j2196R1059P8149K2529k3806J4332M2911K5884
17944c576023M8367o354K649L0571K0616M2643k633l722o934J4434M4340K5742
17932c366304j9955K9612o116M2453M1254K9780J530m7295N626P2139N0857p6760
17920c243179k3516N152Q7400O2409M9050K6355J6264K0403Q032N8606j6179j3900
$$ y = [-4502291, -4435705, -4370468, -4357401, -4324949, -4318978, -4308891, -4253556, -4263945, -4192159, -4197667, -4185082, -4166488, -4160092, -4202754, -4091333, -4023981, -4028586, -3996558, -3877981, -3753972, -3744033, -3872160, -3881672, -3900898, -3944502, -3993273, -3955623, -3879465, -3862025, -3869001, -3786511, -3774530, -3777408, -3761452, -3718921, -3649610, -3584681, -3575600, -3537425, -3528792, -3555716, -3662193, -3732893, -3761459, -3694597, -3670797, -3669151, -3757353, -3814885, -3827081, -3736022, -3657873, -3635344, -3659150, -3644818, -3601907, -3576023, -3527656, -3534010, -3531361, -3500790, -3480174, -3437531, -3440164, -3443886, -3450820, -3436386, -3392046, -3366304, -3386259, -3356647, -3362763, -3320310, -3279056, -3249276, -3247746, -3295041, -3289415, -3217276, -3166419, -3243179, -3266695, -3261543, -3174143, -3111734, -3062684, -3036329, -3020065, -2999662, -2991630, -2933024, -2949203, -2963103]
17908b963103J7204J7960l9400j13687l2090M9855J214L5330J298n4751r2948
17897c173118o9465N7555N6563N8285M0131L28r579K5277J0459o0035j6491O7035
17885c013055L7520k6941O42R3867k8700n4856q603K277J4174O41J0100j2119
17873b985053M9780N562l2105J03434P3639J3567O4700n1080k9092j6730o49m1471
17861b845498n679j3874J7492l5376N0662O7797J1604n2847Q505P0168P0695j0424
17849b666775K732r993j514k630N5278J5021k1725j3429N5544L8123m1098m8150
17837b638616K648K0667k671L7177N5901j9834j2730N664O100J0799j1604l0124
17825b576623L7250J2297j0383n60J1431k0330M1940k3895L5265q938M4109K2986
$$ y = [-2963103, -2945899, -2927939, -2967339, -3081026, -3113116, -3063261, -3062047, -3026717, -3025419, -3080170, -3173118, -3242583, -3185028, -3128465, -3070180, -3030049, -3029721, -3039300, -3014023, -3003564, -3063599, -3080090, -3013055, -2975535, -3002476, -3001834, -2907967, -2936667, -2991523, -3000126, -2997849, -2983675, -2983034, -2972934, -2985053, -2935273, -2929711, -2961816, -2858382, -2784743, -2771176, -2706476, -2757556, -2786648, -2803378, -2804027, -2845498, -2851177, -2865051, -2847559, -2882935, -2832273, -2764476, -2752872, -2805719, -2797214, -2727046, -2656351, -2666775, -2664043, -2674036, -2675550, -2678180, -2622902, -2607881, -2629606, -2643035, -2587491, -2549368, -2590466, -2638616, -2635968, -2615301, -2617972, -2580795, -2524894, -2544728, -2557458, -2551794, -2545694, -2534895, -2546499, -2576623, -2539373, -2527076, -2537459, -2538019, -2526588, -2546918, -2504978, -2528873, -2493608, -2502546, -2458437, -2435451]
17813b435451J8494q2882l2777P4833K9477k0958n8405j473R341L7749j0971m1543
17801b514566M7427j9657L6797P8498m338m8430P0011M3243q523j4755n3347l769
17789b391409R018L1862j3757j9706N090O7431J8650o5750q554R814L5076N9706
17777b262529P988J6375O2256L850l2910n0119j5490P785r821P5773N155k1747
17765b213434j8583M619Q908K3544q7270j3073k4133M6052M2508K425p866K8797
17753b207506j453K9612j4642n0111N8488J24559M9806k5644K471l7216j581J560
17741b071657j7459j1781k376k7677j3475Q2441J4174O085k9041k6199m1299M7135
17729b091129J4232o3026K4015N70P224M4018J9149o133L499L5057j926n99j0187
$$ y = [-2435451, -2416957, -2499839, -2532616, -2457783, -2428306, -2449264, -2507669, -2509142, -2499801, -2462052, -2473023, -2514566, -2467139, -2486796, -2449999, -2371501, -2375839, -2424269, -2354258, -2311015, -2319538, -2334293, -2387640, -2391409, -2382391, -2350529, -2364286, -2383992, -2378902, -2311471, -2292821, -2358571, -2367125, -2357311, -2322235, -2262529, -2254541, -2238166, -2175910, -2172060, -2204970, -2255089, -2270579, -2262794, -2272615, -2196842, -2191687, -2213434, -2232017, -2227398, -2218490, -2194946, -2282216, -2295289, -2319422, -2273370, -2230862, -2228437, -2236303, -2207506, -2208959, -2179347, -2193989, -2244100, -2185612, -2061053, -2011247, -2036891, -2034420, -2071636, -2073217, -2071657, -2089116, -2100897, -2103273, -2130950, -2144425, -2061984, -2047810, -2041725, -2070766, -2096965, -2138264, -2091129, -2076897, -2139923, -2115908, -2115338, -2108114, -2064096, -2044947, -2051080, -2047581, -2012524, -2014450, -2015049, -2025236]
17716b025236K8601L2485L1959l1513k5620m6130K995L8478K7136m6887O5356
17705a948376O7611K6256K511q2571m8435K6783P3403j835o6667j2053k9553L9672
17693a953254L6907n7672k7274J5679N9507K4772J7265o971K5871l9601k9194
17682a933965J0142N1648q614n5305J5557k6551K3803k4896N15J0888j983j817
17670a940578l245M553L8022r541J3374K8139L3030K1551M967k0484k730r020
17658a841962M7546k967k3690n1468J178L9748K279r347k2112L3633P796j0239
17646a829605n9771m282M0651M7392N1672R772L477k2111P186p272n3181k7182
17634a843254Q335M2236o971M3563N3963K5288K9720l866l3304n8115Q331O935
$$ y = [-2025236, -1996635, -1964150, -1932191, -1963704, -1989324, -2035454, -2032459, -1993981, -1966845, -2013732, -1948376, -1880765, -1854509, -1851998, -1934569, -1983004, -1956221, -1882818, -1884653, -1951320, -1963373, -1992926, -1953254, -1916347, -1974019, -2001293, -1985614, -1926107, -1901335, -1884070, -1891041, -1865170, -1904771, -1933965, -1923823, -1872175, -1880789, -1936094, -1920537, -1947088, -1923285, -1948181, -1947666, -1936778, -1938761, -1940578, -1943823, -1939270, -1901248, -1910789, -1897415, -1869276, -1836246, -1814695, -1809728, -1830212, -1832942, -1841962, -1794416, -1797383, -1821073, -1872541, -1871363, -1831615, -1829336, -1838683, -1860795, -1827162, -1819366, -1829605, -1889376, -1893658, -1853007, -1805615, -1753943, -1744171, -1740694, -1762805, -1755619, -1762891, -1816072, -1843254, -1834919, -1792683, -1799654, -1756091, -1702128, -1676840, -1647120, -1650986, -1684290, -1742405, -1734074, -1727139]
17622a727139O2032K9051K84k2575j8750k9784n363K4053J167L3827N5403m3542
17610a641336l21N490m2943n7312k5258J6927J2149j7654J7096m1327k2961J5068
17598a782382J06489K3374J0260K592l7691l4339P821K6935j9501k1359J2800
17587a705001k0207l9729J1681M2513O7086O9588J2291k3873K100m0743K8903
17576a595391N3604K1066l7944o0091l6390J1153L8272K234j7230p4370n8326
17565a753413Q283P2160Q8705L3326l9012l7098k1395J6333K7235N3958m893j14350
17553a670161J445Q2577m686k2699O275k5001Q102K1136K8057k8574L0710o037
17541a578856j3078K3353j3174m3437m7582k2627M9046N715K2277J5793l8952
$$ y = [-1727139, -1665107, -1636056, -1635772, -1658347, -1677097, -1706881, -1712244, -1688191, -1687024, -1653197, -1597794, -1641336, -1641657, -1636167, -1679110, -1736422, -1761680, -1744753, -1732604, -1750258, -1733162, -1774489, -1797450, -1782382, -1675893, -1652519, -1642259, -1639667, -1677358, -1711697, -1703876, -1676941, -1696442, -1717801, -1705001, -1725208, -1764937, -1753256, -1710743, -1643657, -1574069, -1561778, -1585651, -1583551, -1624294, -1595391, -1541787, -1520721, -1558665, -1618756, -1655146, -1643993, -1605721, -1603487, -1620717, -1695087, -1753413, -1745130, -1672970, -1584265, -1550939, -1589951, -1627049, -1648444, -1632111, -1604876, -1550918, -1555811, -1670161, -1668716, -1586139, -1590825, -1613524, -1607249, -1632250, -1624148, -1603012, -1574955, -1603529, -1572819, -1578856, -1591934, -1568581, -1581755, -1625192, -1672774, -1695401, -1646355, -1640640, -1618363, -1602570, -1641522]
17530a641522K7050L2705m603P6446K4170m0420J2272Q406M9639M5791j4541j8478
17518a443085k0488m7665j9055l348M3745J6127L2097k5536k396N0051j2361k9669
17506a461583j2473k5342m0465J5388R9738R256l4476L7281k603k01j112m3000
17494a459592J6353N8680q413q3084L2197N3775J5637k0922R500o924J0283O992
17482a375518p528j6920O390K4107J3598o507O8246O65l8781j1852K2721j056
17470a322435p6364l0202M3256k5700l7542K7751Q3639L4438m3490m709L6175
17459a315183k3751l828N5471Q107l0378n3786M1479J30033P0997K788L3213m1627
17447a126465l2457K4135j9773P138j41451k34011j21755m9568K8201K7290k0930
$$ y = [-1641522, -1614472, -1581767, -1586370, -1509924, -1485754, -1526174, -1513902, -1505496, -1455857, -1410066, -1424607, -1443085, -1463573, -1511238, -1530293, -1533641, -1489896, -1473769, -1441672, -1467208, -1469604, -1419553, -1431914, -1461583, -1474056, -1499398, -1539863, -1524475, -1424737, -1415481, -1449957, -1412676, -1415279, -1415480, -1416592, -1459592, -1443239, -1384559, -1392972, -1476056, -1443859, -1390084, -1374447, -1395369, -1385869, -1392793, -1382510, -1375518, -1383046, -1399966, -1393576, -1369469, -1355871, -1362378, -1294132, -1293467, -1332248, -1344100, -1321379, -1322435, -1398799, -1429001, -1385745, -1411445, -1448987, -1421236, -1337597, -1303159, -1346649, -1351358, -1315183, -1338934, -1342762, -1287291, -1279184, -1309562, -1363348, -1321869, -1191836, -1120839, -1118051, -1084838, -1126465, -1158922, -1134787, -1154560, -1147422, -1288873, -1522884, -1644639, -1694207, -1666006, -1638716, -1659646]
17436a659646J15061J1958j7548K7343P5040L7415K0834l030l518m8231k8343
17425a472665J8155J8994K069K4601O941J3324K5380j0530p730m5364O3180L0282
17413a333363j9680n922O2J3517K4000o2999n8810P995K8682M891j8653O5093
17401a355187P4086M7208q83j32254n1583J0564O5818N1877n0411l7116j4153
17390a392034K1337N0956K8851J0387J2602L3731m3983j4390N567m911K4341K4697
17378a242849L5379m799K3312L4327o1291j07625l9575O1831P3465N9981K2636
17367a145208l6711k3005J5617j903l8776k4715L6148K7747l2641p0811j8922
17356a313180j3781K3949k177M5552K289j2436K626r12o059K4780M2926l973k5496
$$ y = [-1659646, -1544585, -1532627, -1550175, -1522832, -1447792, -1410377, -1389543, -1392573, -1396091, -1444322, -1472665, -1454510, -1435516, -1433447, -1408846, -1401905, -1388581, -1363201, -1373731, -1381461, -1426825, -1363645, -1333363, -1353043, -1358965, -1358903, -1345386, -1321386, -1384385, -1443195, -1435200, -1406518, -1401627, -1420280, -1355187, -1281101, -1233893, -1234776, -1367030, -1418613, -1408049, -1342231, -1290354, -1340765, -1377881, -1392034, -1370697, -1319741, -1290890, -1280503, -1267901, -1234170, -1278153, -1292543, -1286976, -1291887, -1267546, -1242849, -1207470, -1212269, -1188957, -1154630, -1215921, -1323546, -1363121, -1301290, -1227825, -1167844, -1145208, -1181919, -1204924, -1189307, -1191210, -1229986, -1254701, -1218553, -1190806, -1223447, -1294258, -1313180, -1326961, -1303012, -1305189, -1259637, -1257348, -1269784, -1267158, -1268070, -1274129, -1249349, -1206423, -1210396, -1235892]
17343a235892K0591N9219M5605J2814n6900m4840N8400M521o9460k1857K1455
17332a206344L2395l73j1379O603k809j1963n3900k0785K7342J849P3353L7083
17320a128928n3597M769j22N2384J0358J4049l1168K1544M5908j3690j0754k5668
17308a114915O473K0846p991l9790k9390l7082L838L6330O6706j3646l1697M7172
17296a093146K514l6504P6259J2208m1015k8111k9833k9523l2281j6017l4039
17285a249488l67j4296J6498O5934N0266P2601k7128n9438l1631M6464l564j7699
17273a151848m974P815J3781L910K6858K9013m1115k1330k4125L0773l1854K1643
17261a141453P8088L0377m7563K1288K2331l2073K216N009p7630j7798L4789j6649
$$ y = [-1235892, -1215301, -1156082, -1110477, -1097663, -1154563, -1199403, -1141003, -1136482, -1205942, -1227799, -1206344, -1173949, -1174322, -1185701, -1179098, -1181907, -1193870, -1247770, -1268555, -1241213, -1239364, -1166011, -1128928, -1182525, -1177756, -1177878, -1125494, -1115136, -1101087, -1132255, -1110711, -1064803, -1078493, -1089247, -1114915, -1108442, -1087596, -1095587, -1135377, -1164767, -1201849, -1198011, -1161681, -1094975, -1108621, -1140318, -1093146, -1090632, -1127136, -1050877, -1038669, -1079684, -1107795, -1137628, -1167151, -1199432, -1215449, -1249488, -1249855, -1264151, -1247653, -1181719, -1131453, -1058852, -1085980, -1145418, -1177049, -1130585, -1134149, -1151848, -1156822, -1149007, -1135226, -1131316, -1104458, -1075445, -1116560, -1137890, -1162015, -1131242, -1163096, -1141453, -1063365, -1032988, -1080551, -1059263, -1036932, -1069005, -1066789, -1061780, -1139410, -1157208, -1122419, -1139068]
17249a139068J1665L4172J5390j4637m3K013k9484P28l6335P7543O4504L8511
17237i75041p361L406J467K5732N5882r4429K2605n114m5717L2460L3385Q91k8255
17224i80089j4226M696j8622k6418o5692m6367k1898J1562L3388M74R42K0729
17212a101521P0298O2411n092m2420m1158l718L8670M8107L1384K259k2226k1020
17200i84026o328n0400o6053N1452N2058j0107l4977N6953K3769K6422J5592m3311
17188i68956l1245m469M1891Q5451K2643O747K4209l7163l0655K4983j309K8290
17176h39583k0749N6540O3964M3297m639L3100j7544K4345J4360j23873l22202
17165a092984k60106n8447J3674L393j8586O1014R2308J8846L6120K0141j3790
$$ y = [-1139068, -1127403, -1093231, -1077841, -1092478, -1092521, -1090508, -1119992, -1119264, -1155599, -1078056, -1013552, -975041, -982402, -978996, -977529, -951797, -895915, -990344, -967739, -972853, -1018570, -986110, -952725, -951834, -980089, -994315, -989619, -1008241, -1034659, -1100351, -1146718, -1168616, -1157054, -1123666, -1123192, -1122250, -1101521, -1031223, -968812, -973904, -1016324, -1057482, -1061200, -1022530, -974423, -943039, -940780, -963006, -984026, -990354, -1040754, -1106807, -1055355, -1003297, -1013404, -1048381, -991428, -967659, -941237, -925645, -968956, -1000201, -1004670, -962779, -877328, -854685, -847938, -823729, -860892, -891547, -866564, -867873, -839583, -860332, -803792, -739828, -696531, -701170, -668070, -685614, -661269, -646909, -770782, -1092984, -1353090, -1411537, -1397863, -1394470, -1413056, -1352042, -1259734, -1240888, -1204768, -1184627, -1198417]
17154a198417L7369K6568K5441Q539k9808k9775K3090K3480J775L9273J7939K8453
17142a026073r477k2895j1123m0346K8734L7958J9835k4171K7630L1288p048q371
17130a004059k7788j4053L4767J4304J0338K1619o2536k552M7799m6356m2307
17119a070824L7802J9009L0296M9983M3846n747l1466l7811l8728n751Q243K9676
17107i71472K3951M094n0539p745K0987p543K3801K858m6627Q2491L1924k4228
17095i18048K0679J0595l2474n9670K5890j1583J2479J9762p416K5172J8120p727
17083i04221p198l3701M5873N4220M255l8589J0156j6743k7241k2797l7305n65
17071i73856K5368O4920m959o5199M135p482l16N0511M7927m4578m0262N2885
$$ y = [-1198417, -1161048, -1134480, -1109039, -1100500, -1130308, -1160083, -1136993, -1113513, -1111738, -1072465, -1054526, -1026073, -1035550, -1058445, -1069568, -1109914, -1081180, -1043222, -1023387, -1047558, -1019928, -988640, -995688, -1004059, -1031847, -1045900, -1011133, -996829, -986491, -964872, -1027408, -1029960, -982161, -1028517, -1070824, -1033022, -1014013, -983717, -933734, -889888, -895635, -927101, -964912, -1003640, -1009391, -1001148, -971472, -947521, -943427, -993966, -1001711, -980724, -988267, -964466, -961608, -1008235, -925744, -893820, -918048, -897369, -886774, -919248, -978918, -953028, -964611, -952132, -932370, -939786, -914614, -896494, -904221, -911419, -945120, -899247, -845027, -840772, -879361, -869205, -885948, -913189, -935986, -973291, -973856, -948488, -883568, -888527, -953726, -949591, -957073, -957389, -906878, -858951, -903529, -943791, -890906]
17059h90906M3576k2806m1408k2559n882K0895O4864l5823l2892K9647l241j7442
17047i13977q078O919N4211m187n3184m9440M945K0801J9664o3074p5258M901
17035a055757N8675O9197Q3197Q376k286l4157r0457l220M0793K7453J7134M7682
17023h33370L6658r702l0507K0505j2453J4557j8338o780K1635K0316J139j3678
17011h10018N628O1445N1886M3806j1877o7729j25702j03036L9142M8649N0807
17000h16999P054p453L2500l035k6477n1729j2225L0413r946j119k49L2447J9010
16987h07808j5187n6553j0989L2851N8512k8927l221K9101m9407p6984M2972J1397
16975h74243k9562j0610L9482r87J9150L3209k347L395M4764M6557Q278K7666
$$ y = [-890906, -847330, -870136, -911544, -934103, -939985, -919090, -854226, -890049, -922941, -893294, -896535, -913977, -922055, -915136, -860925, -865112, -918296, -967736, -962791, -941990, -922326, -985400, -1060658, -1055757, -997082, -927885, -844688, -836312, -838598, -872755, -963212, -966432, -925639, -898186, -881052, -833370, -796712, -806414, -836921, -816416, -828869, -814312, -832650, -839430, -817795, -797479, -796340, -810018, -804390, -742945, -691059, -647253, -659130, -726859, -852561, -955597, -916455, -867806, -816999, -809945, -817398, -784898, -787933, -814410, -866139, -878364, -847951, -857897, -859016, -859265, -826818, -807808, -822995, -879548, -890537, -857686, -799174, -828101, -831322, -802221, -851628, -928612, -885640, -874243, -903805, -914415, -874933, -875920, -856770, -823561, -825908, -822513, -777749, -731192, -722914, -695248]
16963f95248j3993j3127o4906m5890K655L4020J1377k3472O547q936l818J9077
16951g95714L6455K0203K4671K5809J1460m2752Q536J865k8069l5756m7436L5035
16939g85693j7808L7090k0692k2706M2118L0476j2292l8543k0141J3127k1239
16928h16303L5626l652k9358N1968N598O877m005m0973J110m0485L7992L9861
16916g55744r684N450q547L7011j8027R834j9853N573l1166P841j2060k2374k4150
16903h35896N6612M5037M3610j8996l9247N522n006Q709j0211L2583l1425m3047
16891g91755k8005P528P1955j8050P432N5587M5815k2371n0594k167J8706j7352
16879g23271J9603k6763K6976l8845n8331m3760M331M6770K6458j1498k4581L9671
$$ y = [-695248, -709241, -722368, -787274, -833164, -830509, -796489, -785112, -808584, -802037, -810973, -814791, -795714, -759259, -739056, -714385, -688576, -677116, -719868, -711332, -709467, -737536, -773292, -820728, -785693, -803501, -766411, -787103, -809809, -767691, -737215, -749507, -788050, -808191, -795064, -816303, -780677, -784329, -813687, -761719, -756121, -749244, -753249, -794222, -793112, -833597, -795605, -755744, -765428, -759978, -768525, -731514, -749541, -739707, -759560, -753987, -785153, -777312, -789372, -811746, -835896, -779284, -734247, -690637, -709633, -748880, -743358, -748364, -739655, -749866, -717283, -748708, -791755, -819760, -812232, -740277, -758327, -750895, -695308, -649493, -671864, -722458, -724625, -705919, -723271, -703668, -730431, -703455, -742300, -800631, -844391, -840060, -793290, -766832, -778330, -802911, -763240]
16867g63240J7167r024k165m752m038J7532L1587k7611r468M0117N9353K2116
16855f32426m7837m3412j8613k0291L7640M5057J112m3722N9809k4775n0649R415
16843g28692j2429K6753K7176O9844j1356k6764j0177k6836k1445M345L0314N3563
16831f25704l0898n5257J6736L8576L156n4689m2184J5568L997O1202L468p9860
16819g45889k1717K5189j9807L7365k9731K4262j0608M6982O4911n1414q812J6067
16807f73202K4112m999m0655j3839j3618K8921j4660n0461l5728M6928P8531m3491
16795g12161r7399l1785K1915J7567K9045M1942k1331K4229K1056J9065M3597
16784f44260J1668n2699K7654L9143K4243m6616m4167k7464N0936R371o0786k1116
$$ y = [-763240, -746073, -755097, -757262, -762014, -766052, -748520, -716933, -744544, -754012, -713895, -654542, -632426, -680263, -723675, -742288, -762579, -724939, -679882, -678770, -722492, -662683, -687458, -738107, -728692, -741121, -714368, -687192, -617348, -628704, -655468, -665645, -692481, -713926, -709581, -679267, -625704, -656602, -711859, -695123, -656547, -653391, -708080, -750264, -734696, -730699, -669497, -666029, -745889, -767606, -742417, -762224, -724859, -754590, -730328, -740936, -693954, -629043, -680457, -689269, -673202, -649090, -654089, -694744, -708583, -722201, -693280, -707940, -758401, -794129, -747201, -668670, -712161, -809560, -841345, -819430, -801863, -772818, -730876, -752207, -727978, -706922, -687857, -644260, -632592, -685291, -657637, -618494, -594251, -640867, -685034, -712498, -661562, -652191, -712977, -734093]
16772g34093J5468q816l1758J196P4730J5478M84p195M0602K7105L2065j7303
16760e92037l1389k6996k563k6r223J3902K9304k658N193n8411m8552K0886J8584
16747f83986l6167N953P7496M6833M0137J4003m8142l2451L77k5122L2613J4254
16735e94202M1802j9327p5633O366O4439j486l9708l2400p247M5128l9523q659
16723f60450O8413l5248j5460n48K4172m1903J1884P8378m7728q2018j2724L0250
16711f82982K4842l634m0238J3775R8416N347l9989j2509M2531K6119k6599l7956
16699f32877j2996M7833m823L6262L7535j7323o3445o9294K4542M5932k5587l9614
16687f73855J2575O1928Q502j5525k861M0439l288L1803l3826j9558k7051J2264
$$ y = [-734093, -718625, -727441, -759199, -758003, -683273, -667795, -667311, -674506, -633904, -606799, -574734, -592037, -623426, -650422, -652985, -653011, -662234, -648332, -619028, -621686, -616493, -674904, -723456, -702570, -683986, -720153, -714200, -636704, -589871, -549734, -535731, -583873, -616324, -615947, -641069, -608456, -594202, -552400, -571727, -647360, -640994, -576555, -578041, -617749, -650149, -657396, -612268, -651791, -660450, -592037, -627285, -642745, -643293, -619121, -661024, -649140, -570762, -618490, -700508, -713232, -682982, -658140, -661774, -702012, -688237, -589821, -584474, -624463, -636972, -594441, -568322, -594921, -632877, -645873, -598040, -602863, -566601, -529066, -546389, -609834, -679128, -654586, -608654, -634241, -673855, -661280, -599352, -590850, -606375, -609236, -568797, -572085, -540282, -574108, -593666, -620717, -608453]
16675f08453M4543j5549j3781j3894j4169L7788J932J0344j6274l017l2962l021
16663f26513J4979p777j0536M1480O5843j1874m5235L4304M3545L9225L0455n8483
16651d90587l1246J8663j0171K3444m8114m4576j108k4091p336j4597L5651K8646
16639e65422O7506m1900o9180L5645R3031p704l5711j910j3428l1791m3415K4986
16627e89293K0735j653r948J628k1271j9931n6060j9961L7741P6579K2582k1841
16615e80693j4839R108M6916M9492O6646k5942l6695k5983j688p289l6563m9024
16603f06554O173J2556o1907J4293L8549Q2452o148l4365m2887l6199j8301P343
16591f44995K0688q627J3663L1440M292M38L6518K6464l3130k9162j1565J8143
$$ y = [-608453, -563910, -579459, -593240, -607134, -621303, -583515, -581583, -571239, -587513, -590530, -623492, -626513, -611534, -619311, -629847, -588367, -522524, -534398, -579633, -545329, -501784, -462559, -432104, -490587, -521833, -503170, -513341, -489897, -538011, -582587, -583695, -607786, -615122, -629719, -594068, -565422, -497916, -539816, -608996, -573351, -480320, -488024, -523735, -525645, -539073, -570864, -614279, -589293, -568558, -570211, -580159, -578531, -599802, -619733, -675793, -695754, -658013, -581434, -558852, -580693, -595532, -586424, -539508, -490016, -423370, -449312, -486007, -511990, -513678, -520967, -557530, -606554, -600381, -587825, -649732, -635439, -596890, -514438, -520586, -554951, -597838, -634037, -652338, -644995, -624307, -632934, -619271, -587831, -583539, -583101, -546583, -520119, -553249, -582411, -593976, -575833]
16579e75833m9162n0148l1691L8846J01260Q8928j4024O046j5045k9627l3811
16568e64261k2464J2229P2368L084j8906L9801k2046l0369J8362N3005l4954k8316
16556e22467L4288J9348k8075j6252J1320k2499O992K8935l85N5737L1031n067
16544d07094K1314m7635m0851o212m0740N656N271J0579J6423k039m7581k4718
16532e57627k5633o5933j6435o48Q5960L3619J3843k3427k5965k4841N1876K4355
16520e30856j7726J9709j0886o9776m7991P013L1538O9153K0208L000L3711K6995
16508d65908L8509M5349m4652p6471j9826K1499m3702L3834J9028O9818L8657
16497c83865Q441m1620m708m0308N6907K2495q201j6256L5739L0937n6109k8675
$$ y = [-575833, -624995, -675143, -706834, -667988, -566728, -477800, -491824, -485778, -500823, -530450, -564261, -586725, -574496, -502128, -499044, -517950, -478149, -500195, -530564, -512202, -459197, -494151, -522467, -488179, -468831, -496906, -513158, -501838, -524337, -517345, -488410, -488795, -433058, -402027, -407094, -385780, -433415, -474266, -480478, -521218, -515562, -510291, -499712, -483289, -485328, -532909, -557627, -583260, -649193, -665628, -666276, -580316, -546697, -532854, -556281, -582246, -607087, -555211, -530856, -548582, -528873, -539759, -609535, -657526, -650513, -618975, -549822, -529614, -526614, -492903, -465908, -427399, -382050, -426702, -503173, -522999, -501500, -545202, -511368, -492340, -422522, -383865, -375424, -417044, -421752, -462060, -405153, -382658, -390859, -407115, -371376, -340439, -396548, -425223]
16485d25223n768K1246q6133k221j5835Q622L7240M5394q664k6439k0630k9305
16473e07716L5011K6731p538k5805K3427l1573l330P215K2841K3150o299k9662
16461d73548l5858M211n3282j5304K5936M8943M850J3641J5425l2379n834K1136
16449d82063L0505j8463j4556R273k1494m286K6173P907k2137j4504l9785K5014
16437e18416L6835k9313K1442j348j6710j0880K2107j4270m4670q233L50P9676
16425d83430J9838J9409l690L4987j1371j9130k0698m47k8754p8812j4540n876
16413e92514L7823R5196j9236j5544M0154k2104R694N201k8694M3152J6725j0630
16401d40777p8008O0201P395K8604M3037m684n8639l2315J7582L8975j2660l3234
$$ y = [-425223, -430991, -409745, -495878, -498099, -513934, -505312, -468072, -422678, -431342, -457781, -478411, -507716, -472705, -445974, -453512, -479317, -455890, -487463, -490793, -483578, -460737, -437587, -443886, -473548, -509406, -505195, -558477, -573781, -547845, -498902, -494052, -480411, -464986, -497365, -503199, -482063, -451558, -470021, -484577, -475304, -496798, -501084, -474911, -467004, -489141, -503645, -543430, -518416, -481581, -510894, -489452, -490800, -507510, -518390, -496283, -510553, -555223, -563456, -563106, -483430, -463592, -444183, -447873, -412886, -424257, -443387, -464085, -464532, -493286, -572098, -586638, -592514, -554691, -459495, -478731, -494275, -454121, -476225, -466531, -461330, -490024, -446872, -430147, -440777, -518785, -458584, -451189, -422585, -379548, -384232, -442871, -475186, -457604, -418629, -431289, -464523]
16389d64523L4048j1071p868l2290K1564K550l3492N6389k5557J5541P5j7794
16377d62428j942L7455k7045l6395j7082j0946k586K7387P6357k0645k8579J5829
16365d50620j861j0249J2193o332j4874P601l0416l5108j7430J2291J9211M1964
16353d73630L2504N188k1770O54L3794l600q040l8913K2670J5554k6219J520R861
16340d50427J7431l7505P505K1353p92o8543l2429J3563k022l9002N4190N5264
16328d61414J1577K557J5498M2285k0969m5579p727L4952K5793j2005M2847J2137
16316c60048k5197J6127m98n0044j9598J0879N9312K6788k3187K7834j62m903
16304c42697M043M2460j0567l966l0334n0899o3322K4688O7306O813L0909P5667
$$ y = [-464523, -430475, -441546, -449414, -481704, -460140, -457590, -491082, -434693, -460250, -444709, -444634, -462428, -464370, -426915, -453960, -490355, -507437, -518383, -520969, -493582, -417225, -437870, -466449, -450620, -452481, -462730, -450537, -456869, -471743, -464142, -494558, -529666, -547096, -534805, -515594, -473630, -441126, -435938, -457708, -457054, -423260, -426860, -434900, -473813, -451143, -435589, -461808, -460288, -450427, -432996, -470501, -462996, -441643, -442435, -510978, -543407, -529844, -531866, -570868, -516678, -461414, -449837, -447280, -431782, -389497, -410466, -456045, -463772, -428820, -403027, -415032, -372185, -360048, -385245, -369118, -369616, -419660, -439258, -428379, -369067, -342279, -365466, -337632, -337794, -342697, -338654, -296194, -306761, -310727, -341061, -391960, -455282, -430594, -363288, -356475, -325566, -249899]
16292b49899l0978l1669o1443M7609m8142l6848M0985P358o154m9261J3742K0599
16280c84101l3522M7750N4701j3594l0704m0854O3227P9495k297l2318j06684
16269c98901o9709r352L0208L1313K6311j2358o395L9567l5820O661P1923K7847
16257b98705J1401J5471n1097q6060k9523M572L5124Q2488M1933k6988J9274K9392
16245b52718K560j8200j5057K315j0381R767N644J4297J8876n394l4699p947p656
16232b98593j2283j1229r8336n238N9914j4259L0931J3409q3687m7399K7320N5474
16220c83976P8236O213J0985j5780m2516p101M7056O063q3797n734k2497j1814
16208d24662l4677j0578J3203O3602O2322o228n9848j1407L3194K1294K5915J7723
$$ y = [-249899, -280877, -312546, -373989, -326380, -374522, -411370, -370385, -363027, -369181, -418442, -404700, -384101, -417623, -369873, -315172, -328766, -359470, -400324, -337097, -257602, -259899, -292217, -398901, -468610, -477962, -447754, -416441, -390130, -402488, -408883, -369316, -405136, -398475, -326552, -298705, -287304, -271833, -322930, -408990, -438513, -433941, -398817, -316329, -274396, -301384, -282110, -252718, -250158, -268358, -283415, -281100, -291481, -281714, -276070, -261773, -242897, -248291, -282990, -290937, -298593, -310876, -322105, -420441, -425679, -365765, -380024, -349093, -335684, -419371, -466770, -439450, -383976, -305740, -299527, -288542, -304322, -346838, -353939, -306883, -300820, -384617, -390351, -412848, -424662, -459339, -469917, -456714, -393112, -330790, -337018, -396866, -408273, -375079, -353785, -327870, -310147]
16196c10147j0050j5188N3310q427o4775j790k3565l8640L488j7171M9401K4723
16184c58831m031Q822k8093l4636j2868L0055O08m6530K2697O6918K8837K7206
16172b99846k3095o2169O4530L2640n4495m5493M0943O2158J3939l8723l5777
16161c45388q893N1014n7671m8806M5510L9415O2575K0470j7175o3521J7656L8298
16149b66516K9177L331o9060n1749l4409m8598K8915N499k1069L3441N8325M9423
16137b83290L4991j5594q8954K045k1491o2182N103N2786M8998J3710R429m6112
16125c50561m5841N5084P8045P27q082o965J5752j0936j958Q122O0855k4548j4458
16112b44764k0460m2094m1276L4480J0533n2157M5399l138m177L8150J6458r273
$$ y = [-310147, -320197, -335385, -282075, -290502, -355277, -357067, -380632, -419272, -415784, -432955, -383554, -358831, -362862, -354040, -382133, -416769, -429637, -399582, -398974, -445504, -422807, -355889, -327052, -299846, -322941, -385110, -320580, -287940, -342435, -387928, -346985, -284827, -270888, -309611, -345388, -354281, -303267, -360938, -409744, -364234, -324819, -262244, -241774, -258949, -322470, -304814, -266516, -237339, -234008, -303068, -354817, -389226, -437824, -408909, -403410, -424479, -391038, -332713, -283290, -248299, -263893, -352847, -350802, -372293, -434475, -429372, -376586, -327588, -313878, -304449, -350561, -396402, -341318, -263273, -262546, -270628, -277593, -261841, -272777, -274735, -266613, -205758, -230306, -244764, -265224, -307318, -348594, -314114, -303581, -355738, -310339, -313477, -317654, -279504, -263046, -272319]
16100b72319K007j1229j9909l1395M5898M4300m6362p416K1036l0173o452M5911
16088b66103n4439J7956n656j1458n0901M034K7924R968M5082O447m6931l177
16076c27254K4655j5317j6852j5126N3841J9340k9134L9974L4949R583R305L493
16064b08543o0399k5308L9582k2714j4028l527n2142K6956L5292j6920n2554p49
16052c55054O7995m331n6244J1497R132L4020m8929o1526Q0873M8354J3188j8469
16040b79494J0779o263L6170N5459j5571k2843K5094j7609l5363l213L8577K8139
16028a86138l9464K3782o4486m0402J5492k4635J7356N3276r799j2357L4706J2605
16016b20064L0801L4888k7660M4851J9440m6940k1300O843m8210n7034J1544K3073
$$ y = [-272319, -270312, -281541, -301450, -332845, -286947, -242647, -289009, -296425, -275389, -305562, -312014, -266103, -320542, -302586, -308242, -319700, -370601, -366567, -338643, -328675, -283593, -277146, -324077, -327254, -302599, -317916, -334768, -349894, -296053, -276713, -305847, -265873, -230924, -221341, -212036, -208543, -268942, -294250, -254668, -277382, -291410, -294937, -347079, -320123, -284831, -301751, -354305, -355054, -287059, -291390, -347634, -336137, -327005, -292985, -341914, -403440, -322567, -274213, -261025, -279494, -268715, -274978, -238808, -183349, -198920, -221763, -196669, -214278, -249641, -252854, -214277, -186138, -225602, -201820, -266306, -306708, -291216, -315851, -298495, -245219, -255018, -267375, -232669, -220064, -189263, -154375, -182035, -137184, -117744, -164684, -185984, -179141, -227351, -284385, -272841, -249768]
16004b49768Q8055k3513k9590p2504m9339N1258P3372j1694q820M6689j7364L845
15992a99373j619q246k9918K14P3052k0835j13648m786O4476J7918k4427j1120
15980b58312Q095l5326k8504K3134N1176K7826m531j4628k5540J2323J5225j9425
15968b48487Q665K5584n3722l8854O0120m6480n463P1847Q8470J0805l9217J318
15956a65414j069l8052n1295J7284q891n3350J0953L0228N7120O4136k903J9570
15944a21683l1830n3159j8851q791j4151P8685Q282k2901k3376l9383k3813j6950
15932b87921K0301P4337k0015J5325J4479M107N211K413k3863k7383p1241j8852
15920c13102M5976L1455p402n718q268m375p151L756P727L3872J7292j0357n6503
$$ y = [-249768, -161713, -185226, -214816, -287320, -336659, -285401, -212029, -223723, -232543, -185854, -203218, -199373, -200992, -209238, -239156, -238942, -165890, -186725, -300373, -305159, -240683, -222765, -247192, -258312, -250217, -285543, -314047, -290913, -239737, -211911, -216442, -231070, -256610, -244287, -229062, -248487, -239822, -214238, -267960, -306814, -246694, -293174, -298637, -226790, -138320, -127515, -166732, -165414, -166483, -204535, -255830, -238546, -247437, -300787, -289834, -259606, -202486, -138350, -141253, -121683, -153513, -206672, -225523, -234314, -248465, -169780, -161498, -184399, -207775, -247158, -270971, -287921, -267620, -193283, -213298, -197973, -183494, -179387, -174176, -171763, -195626, -223009, -294250, -313102, -267126, -235671, -243073, -248791, -257059, -261434, -268585, -264829, -257102, -223230, -205938, -216295, -272798]
15907b72798l2779L251N7706K4881J0374K502k8257n228k8660K0096q569O1129
15895a96352J1876l1165K2728O9777J149p8846l2830R814N973l6875k2498O955
15883b70294K3151J7318L5879j8778O2074n0628j6669o917j8492R578L1238K760
15871a99780J7257P4762O2466L268n2898p1764k2648k4846M8080L2734j9405n7122
15859b09896j0181K1899L1829k1375j1696o13M1539L5481j7864j6273L9687L540
15847a13923J1501m9883j2635p507J8166L9213j2956k1963J2934K3181k6898l3985
15835a74755K6102l9044l9025P8548m3533k3122M5863l3975M7037q33k6712J7478
15823a65971J1619k494j3275o0391J0509K1944M3789J4319K2105j3210j4046n7397
$$ y = [-272798, -305577, -302326, -244620, -219739, -209365, -206863, -235120, -240348, -269008, -248912, -257481, -196352, -184476, -215641, -192913, -123136, -121987, -200833, -233663, -223849, -217876, -254751, -277249, -270294, -247143, -229825, -193946, -212724, -150650, -201278, -217947, -224864, -243356, -233778, -202540, -199780, -182523, -107761, -45295, -42027, -94925, -166689, -189337, -214183, -166103, -133369, -152774, -209896, -220077, -198178, -166349, -187724, -199420, -200033, -158494, -123013, -140877, -157150, -117463, -113923, -102422, -152305, -164940, -172447, -154281, -115068, -128024, -149987, -137053, -113872, -140770, -174755, -148653, -187697, -226722, -148174, -191707, -214829, -168966, -202941, -155904, -156737, -183449, -165971, -154352, -156846, -170121, -230512, -220003, -198059, -154270, -139951, -117846, -131056, -145102, -202499]
15811b02499k6899N448k774q023K4540M4406J8221K155K1527k0045K5525m1166
15799a59584o4389L534M236K48K2451K7987j1894m1658j2018j6664O534N0411
15787a90806P9381J6916j4892j2771L89K6501J1636l1688m7595K351o307J0170
15775a56715R179k0338N6678k7385m1904M262K7900M064O6775P689J9174m4619
15763i5240j1961K8584J6428M9603r2816m4940J2666m4633Q870K0491K62K5914
15751a26772l933L0760j9013K728k342k5129p5914p1664N142M6157R1172M5398
15739a03410l0582k3797M9332L4230j8487L532k2204L5517N235j0762N3297M4600
15727A6501k3265m2774n4868m4082M1738Q799m9847J754N439L1632Q9275m0236
$$ y = [-202499, -229398, -223950, -226724, -234747, -210207, -165801, -147580, -145425, -123898, -143943, -118418, -159584, -223973, -220439, -216203, -215955, -193504, -165517, -177411, -219069, -231087, -247751, -241217, -190806, -111425, -94509, -109401, -122172, -121783, -95282, -83646, -115334, -162929, -160578, -166885, -156715, -147536, -167874, -111196, -138581, -180485, -176223, -148323, -144259, -77484, -69795, -50621, -95240, -107201, -78617, -62189, -12586, -105402, -150342, -137676, -182309, -173439, -152948, -152686, -126772, -130705, -99945, -118958, -116230, -118572, -143701, -219615, -291279, -286137, -239980, -148808, -103410, -133992, -157789, -108457, -74227, -92714, -89182, -111386, -75869, -70634, -81396, -28099, 16501, -6764, -49538, -104406, -148488, -106750, -97951, -147798, -146044, -140605, -108973, -19698, -59934]
15715e9934o2610j5299K6682J7717k2455k9527l982K568K91R64J8994j4802l2003
15702a73396p574M0582N8201j5898l2140k5477K2659m14k1163q843l909O809L6928
15689a23635N2480j3627q757m7452n1123O9151M3725l7864M564k9193j3843L974
15677a51600K6097N7845j293k8745l116l3373L2912j3720K3412N3227L240j05236
15665a40350j6824K8006R141J5082K0282r230K6541K0988n1653n5636K5757M0744
15653h7152L8180L2346j9009o98k8291m7463m6767L2776K3915M6246L5743J3006
15641g168r1252m0500j1688k8764N8273n8599l9596N827M5131P8612M4548k63
15629d5439m4422j690J4732k4616J0040O3308O3400n5629j5259l5545m6048J0410
$$ y = [-59934, -122544, -137843, -111161, -93444, -115899, -145426, -149408, -146840, -146549, -145585, -126591, -141393, -173396, -180970, -140388, -82187, -98085, -130225, -155702, -133043, -133457, -154620, -163463, -167372, -160563, -123635, -71155, -84782, -93539, -140991, -192114, -122963, -79238, -117102, -112538, -141731, -155574, -151600, -125503, -67658, -68951, -97696, -100812, -134185, -101273, -114993, -91581, -38354, -35114, -140350, -157174, -129168, -120027, -104945, -84663, -93893, -67352, -46364, -98017, -153653, -127896, -87152, -48972, -16626, -35635, -36333, -64624, -112087, -158854, -126078, -102163, -55917, -20174, -7168, -98420, -138920, -150608, -179372, -121099, -179698, -219294, -213467, -168336, -89724, -45176, -45439, -89861, -91551, -76819, -101435, -91395, -28087, 35313, -20316, -35575, -71120, -117168, -106758]
15617a06758p408Q288L7016N1551L2731k3467k2096l7298n8625m165q573J1212
15605a27592m1838o420M0351O8428M9233j0348q130q7910p1659Q897M2319L0036
15593a14633k9056K0181K6016O5151K3930q348K4272k4449p0013k9181M986K6755
15581h4389N262j8872l4914K6390P3838L5029p587J3804p5323m8230j385l644
15569a20021j753Q841K8397O277M7962k8097J553l1132K8010l581l573M7596L1385
15556A1864k4852n4211L5825o385k3159l1315K4107L8819n3149n92O1838M8745
15544B7535j4222m7199r7086n939K7890j9192J0150J8593N818P553L3307L5031
15532a7761L2804K4797J5846J7792P627p0561m8822K5220k3152j7450M7849K5015
$$ y = [-106758, -114166, -105878, -68862, -17311, 15420, -8047, -30143, -67441, -126066, -130231, -138804, -127592, -169430, -175850, -135499, -67071, -17838, -28186, -36316, -124226, -195885, -186988, -144669, -114633, -143689, -123508, -97492, -32341, -8411, -16759, 7513, -16936, -86949, -116130, -111144, -84389, -79127, -97999, -132913, -106523, -32685, 2344, -5243, 8561, -66762, -114992, -116377, -120021, -121774, -112933, -84536, -78259, -30297, -58394, -56841, -87973, -59963, -63544, -67117, -19521, 11864, -12988, -67199, -31374, -37759, -60918, -92233, -68126, -29307, -82456, -83048, -21210, 27535, 13313, -33886, -130972, -136911, -109021, -128213, -118063, -99470, -93652, -86099, -52792, -17761, 15043, 39840, 55686, 73478, 81105, 10544, -38278, -13058, -36210, -53660, -5811, 19204]
15520A9204k7478n7562r408J14l2750K1026M4768q685J5422M3498j9837m798Q993
15507g493k2695L83k2582m9776j2973o423O4292L1528m6744J5154L2315j0594
15495c5608K3725O607l9349j1849J6087L403k4519J31J1948o179l1037O5259R1131
15482F9750K1121r30n7443o7453M4847K8785K2882o940j839l0462n4941K3056
15470i567o725o0612J8860M1963j4763k1785P125N7689j1475n2030L7970O6195
15458E2845p6514q1565J7749M2805K648J2325K0108j2194j7422k1365K1961k0074
15446e8693m1623k5584L9698K2335j4564j0321M7424O6965j1704k2433p062n342
15434b0904l1935k6895L5994J5679R234J0142J6354L5576J491m472n6105q2340
$$ y = [19204, -8274, -65836, -75244, -75130, -107880, -86854, -42086, -50771, -35349, 8149, -11688, -16486, -7493, -30188, -29805, -52387, -102163, -115136, -121559, -57267, -25739, -72483, -57329, -25014, -35608, -11883, -5276, -44625, -56474, -40387, -36984, -61503, -61372, -49424, -55603, -86640, -21381, 69750, 90871, 89941, 32498, -34955, 9892, 38677, 61559, 54619, 52780, 22318, -32623, -9567, -16292, -76904, -58044, -16081, -30844, -52629, -45504, 12185, 710, -51320, -13350, 52845, -23669, -105234, -87485, -44680, -42032, -29707, -9599, -21793, -39215, -60580, -38619, -58693, -100316, -125900, -86202, -63867, -78431, -88752, -41328, 25637, 13933, -8500, -15562, -20904, -52839, -79734, -43740, -28061, -18827, -8685, 7669, 43245, 44736, 40264, -15841, -98181]
15422i8181r726Q358L9844P066l686J8982j4247k0671j12L3198j2484k6383K068
15409g5974K0770R988j4267l6888L7068L2534M9080k3004o7987n0162L3511M2029
15397d3302p660Q773m5279L6416P3150J93m1011k9453l6796m674P6384P008m5401
15384e1652m3079N2791J23425k6542l8581m2230l5024L7099J4491K5602K4771
15373D1071j5586l8926O1601K7942p8684k8183O790J4422j3531o595k1801J8294
15361c3186M0170l3389r53j5991k2493L637K2621K3532J4056J5167L872L2688
15349D9731L2134N784j3815p2383k5957J0006j1078N8267K7222J4528j0241r761
15337E4437j1093o4085R276L4885P638m3434l1476j1819K4527R1421n7083o5277
$$ y = [-98181, -107907, -99549, -59705, -52639, -56325, -37343, -51590, -72261, -72373, -39175, -51659, -78042, -75974, -55204, -45216, -59483, -96371, -59303, -26769, 22311, -693, -68680, -118842, -85331, -43302, -50962, -42189, -87468, -51052, 22098, 22291, -18720, -48173, -84969, -89643, -13259, -6251, -51652, -94731, -41940, 81485, 54943, 16362, -25868, -60892, -23793, -9302, 16300, 41071, 25485, -13441, 48160, 76102, -2582, -30765, -23975, -9553, -23084, -29679, -51480, -33186, 6984, -26405, -27358, -43349, -65842, -62205, -39584, -16052, -1996, 13171, 17043, 49731, 81865, 87649, 73834, 1451, -24506, -14500, -25578, 32689, 59911, 74439, 64198, 54437, 43344, -20741, -11465, 23420, 31058, -12376, -43852, -55671, -31144, 60277, 3194, -62083]
15325f2083P94P3227K0084j6286P3234J7580K697l3603Q953N7116l3435n5234
15313E3044j7156K0352O977k5482j4973k8055l642M1781R017L328K1203J5607
15301H2001O63l1433P5371j9603k2822l468k4423j3889L5685J2002K5525j0713
15289A04896l3421p415l7889o4053j18185J0369O4902K4977P5380l4010L5935
15278B1486R9465R423n9052J8990j5406k0155L0827p010k1283r0K0101Q293P0152
15265A55741J3302k1106p0994n1404o328k1358k593L3207P332m3967L2289K451
15253B6572L0920j8809l3681M1960N7584p0267l2685M9201j8945k1850L0726N8294
15241I9020m294r269m7465n34O929m1877k4571J3865N0477J0768j7437j6675J4482
$$ y = [-62083, -61289, 11938, 32022, 15736, 88970, 106550, 109247, 75644, 84597, 141713, 108278, 53044, 35888, 56240, 63217, 37735, 22762, -5293, -8935, 32846, 41863, 45191, 66394, 82001, 82664, 51231, 126602, 106999, 84177, 80709, 56286, 42397, 78082, 90084, 115609, 104896, 71475, 64060, 26171, -37882, -156067, -145698, -80796, -55819, 19561, -14449, 21486, 120951, 130374, 71322, 90312, 74906, 54751, 85578, 78568, 57285, 57195, 77296, 85589, 155741, 169043, 147937, 76943, 25539, 19211, -2147, -4740, 28467, 35799, -8168, 24121, 26572, 57492, 38683, 5002, 46962, 104546, 34279, 1594, 50795, 31850, 10000, 40726, 99020, 94726, 85457, 37992, 37458, 44387, 2510, -22061, -8196, 42281, 53049, 35612, 18937, 33419]
15228C3419P1187Q8424n9609k1744O198n5492K9145O6570J067n6325r199k1082
15216G2559j2119J4322Q578J3651K9682J3096q3163o3186j1055K9800L1384l0899
15204A2650l4019j5722j6375J7926M1162Q2250Q7345J3601M3013m750r0281l4021
15192A02779l6683k4426N3121N0770M5306j7910n6937p1420k9464j2798N0846
15181E3184L0075K0385R019Q364K8196L6144k6244o3843n1749M6386M3536k0529
15169A12924l5261K07L0590J3739K0338j9707P9999k3314j892N1814n574l8398
15157A85465k2124k0722n828P9214p421Q805p4149n845J5226O6924l8526n7477
15145A23542k0396j0563k887L985o050p379J6411O022l4858o0528K7352L4114
$$ y = [33419, 104606, 193030, 133421, 111677, 117875, 62383, 91528, 158098, 159165, 102840, 93641, 72559, 60440, 74762, 83340, 96991, 126673, 139769, 56606, -6580, -17635, 12165, 43549, 12650, -21369, -37091, -53466, -35540, 5622, 87872, 175217, 188818, 231831, 227081, 136800, 102779, 66096, 41670, 94791, 145561, 190867, 172957, 116020, 44600, 15136, 2338, 53184, 83259, 103644, 112663, 121027, 149223, 185367, 159123, 95280, 43531, 89917, 133453, 112924, 77663, 77870, 108460, 122199, 142537, 122830, 202829, 179515, 177623, 229437, 223863, 185465, 163341, 142619, 136791, 216005, 208584, 217389, 143240, 137395, 152621, 219545, 181019, 123542, 103146, 92583, 89696, 93681, 87631, 80252, 96663, 102685, 67827, 7299, 34651, 68765]
15133F8765R901q919k6163L7787J08145k2410p0413O748J3563J9032L1275L5349
15121B02660J3356K39m7891m2566K3955J4202L4040l805m6549m9179K7185K0815
15109A46462L8168Q293o2874j6342n4735K4892k848k604q3855N58M382j5409j8157
15096c4069L2096O0928R8476j2525J3165M1638j5513N1417m614K4854r827p3395
15084A72631M9869N5704l0346m6285k2308k0746o6941J6889O6601K5863J4764
15073B15695K3507l2860j7472O021n0123k830m3794j0708r352J2000K576o292
15061H6368M476k4323k5029m917M4369J3549J3946M0207L2186J1394P813K2761
15049B22800l7278p379O8523o2906l1248J0179M3039R156J0104k3726p073M751
$$ y = [68765, 78666, 69747, 43584, 81371, 189516, 167106, 96693, 103441, 117004, 136036, 167311, 202660, 216016, 216255, 168364, 125798, 149753, 163955, 197995, 194190, 147641, 98462, 125647, 146462, 184630, 192923, 130049, 113707, 58972, 83864, 81016, 78412, -5443, -4885, -503, -15912, -34069, -1973, 58955, 157431, 144906, 158071, 199709, 184196, 235613, 230999, 255853, 246026, 172631, 222500, 278204, 247858, 201573, 179265, 158519, 91578, 108467, 175068, 200931, 215695, 239202, 206342, 188870, 194891, 144768, 141938, 98144, 87436, 78084, 90084, 92660, 86368, 90844, 66521, 41492, 36575, 80944, 94493, 108439, 148646, 180832, 192226, 200039, 222800, 185522, 178143, 246666, 183760, 152512, 162691, 205730, 214886, 224990, 201264, 194191, 198942]
15037A98942J3823m30m6685j3479K7863j1336K5760L1397L8226K5397n4696n7610
15025A77172r603j8172n5463k5400N1866O8370O4796l0629j1664q983p5105o6258
15013F0927l1131K3769P1417N1687j3139o209Q1027N3601k218n0140p5872n0631
15001A13088o776l430N5770N5381k8344q2212k8702M6704K8979M0319K5260l968
14989B12069O5948j2442k9504l4595Q166M9791l0518J8055L0932n6940n1429n9491
14977A10042O0670M4079o7957L3036q580K0991N1526L4564j0023j6270J0596l3
14965B62641M380m453M0935l8775k9373l2586M44k872J5325j9731q338K5000j5524
14952A97073k0096J9426M0646L6588M5144J3219J7269j6050K0766j7537m4669
$$ y = [198942, 212765, 212335, 165650, 152171, 180034, 168698, 194458, 225855, 264081, 289478, 234782, 177172, 167569, 149397, 93934, 68534, 120400, 188770, 253566, 222937, 211273, 202290, 127185, 60927, 29796, 53565, 124982, 176669, 163530, 157321, 238348, 291949, 289731, 239591, 163719, 113088, 106312, 102882, 158652, 214033, 185689, 103477, 74775, 121479, 150458, 190777, 216037, 212069, 278017, 265575, 236071, 201476, 209642, 259433, 228915, 246970, 277902, 220962, 169533, 110042, 170712, 214791, 146834, 179870, 171290, 192281, 243807, 278371, 268348, 252078, 262674, 262641, 267021, 262568, 303503, 264728, 235355, 202769, 203213, 200341, 215666, 195935, 187597, 212597, 197073, 176977, 196403, 237049, 273637, 318781, 332000, 349269, 333219, 353985, 336448, 291779]
14941B91779r657J0571j9190j3087j8041L5057m2045m0259K4820j070P210j002
14929B25086n0458p669N485Q385j0070l6868O690K7766K5757k3201k2047L4157
14917A83013N3352k5904q254p887J4242k652o910j3600K3478l0234p15K5699k8655
14904A74973k5433P5935N6048l917j2147M623n739k8463O3530l1295m1520J3478
14892B40073J2528K2686L6961N447o2590K0071J6799K610k739K8197o1945m7712
14880B10386M5961J8147L0489L7848K5990n1489k3871J0142l1370q6803M3655
14869B29085K8909k9042K138M6932Q652M1023K8053j341K0273K4190j9679m3398
14857C35795j8223l453n2903k2770J1179K0030l7844k6630j4118K8605Q0331Q3665
$$ y = [291779, 282122, 292693, 273503, 260416, 242375, 277432, 235387, 195128, 219948, 218878, 226088, 225086, 174628, 166959, 172444, 180829, 170759, 133891, 140581, 168347, 194104, 170903, 148856, 183013, 236365, 210461, 202207, 194320, 208562, 205910, 199000, 185400, 208878, 178644, 177929, 203628, 174973, 149540, 225475, 281523, 277606, 265459, 270082, 264343, 235880, 299410, 268115, 226595, 240073, 252601, 275287, 312248, 317695, 255105, 275176, 291975, 294585, 291846, 320043, 258098, 210386, 256347, 274494, 304983, 342831, 368821, 317332, 293461, 303603, 272233, 185430, 229085, 257994, 228952, 231090, 278022, 286674, 327697, 355750, 354409, 374682, 398872, 379193, 335795, 317572, 314119, 261216, 238446, 249625, 269655, 231811, 205181, 191063, 219668, 299999, 383664]
14845C83664L1654q2829p8723L8152P071P432j8350M7324O838J1148O897m6933
14833C13345m1879k4826k7293O948P1653P08J5745L7190l0759m0149k37Q559K1794
14820C10799r830k7031m7308k253M2979K8864J1595L1365m1314L515J6520K5609
14808C43510J5285j6427Q546K7178j6512k211K521k6898r2305j6305N015N5884
14796B87281N3626M199k7682K6418J5930K0325q21L6347N588l4835r359o8713
14784C08304j4933l0502j424J8612N4499j556O851j2814J3220M6841K616k1622
14772C68092m2465k4989M9760J4698k8915k1589L0817J0501j0211L7609M1632
14761D24940o9006Q641N1032l1250l0253k7303L2334J8342l4829o7512P9422K8864
$$ y = [383664, 415318, 332489, 253766, 291918, 298989, 306421, 288071, 335395, 342233, 353381, 360278, 313345, 271466, 246640, 219347, 226295, 297948, 298656, 314401, 351591, 320832, 280683, 280446, 289005, 310799, 300969, 273938, 226630, 224377, 267356, 296220, 307815, 339180, 297866, 301381, 317901, 343510, 358795, 342368, 350914, 378092, 361580, 359369, 361890, 334992, 242687, 226382, 231397, 287281, 340907, 345106, 317424, 343842, 359772, 380097, 379276, 415623, 421211, 386376, 377017, 308304, 293371, 262869, 261445, 280057, 334556, 333000, 339851, 327037, 340257, 387098, 389714, 368092, 325627, 300638, 350398, 365096, 336181, 314592, 345409, 355910, 345699, 383308, 424940, 355934, 364575, 415607, 384357, 354104, 326801, 359135, 377477, 342648, 275136, 354558, 383422]
14749C83422K556k531R250k6473r146j1335M3041r024J6924m890k2880j3574K6397
14736C81737N1491m4784j2230R5129J5411M334k1354j5817n4883m8387O131J3112
14724C69890L348j6544J263R240M8889L3890J8524n868N8819p466k6726j6839
14712D70420m495J6315k898l1906l1394o6975m3823P6109O3440m0310R166l5197
14700C78452j5061M5216P6738n280k1838q1631J3911J2555n2047m1920L8368L8025
14688C85488J7805Q349J4490n2548j7442m489j1450O7234O6512k0028m0194J5547
14676D29274k3841L796M9228J5828j3633m1419J635L656j3115P2631K0270r2005
14664D12305j4363j3311k2354p614O626O4489m3195m1941P0344M9819N0585L261
$$ y = [383422, 385978, 383447, 392697, 366224, 357078, 345743, 388784, 379760, 396684, 391794, 368914, 355340, 381737, 433228, 388444, 376214, 471343, 486754, 491088, 469734, 453917, 399034, 350647, 356778, 369890, 373238, 356694, 357957, 367197, 416086, 449976, 468500, 462632, 521451, 513985, 487259, 470420, 465925, 482240, 479342, 447436, 416042, 349067, 305244, 381353, 444793, 404483, 413649, 378452, 363391, 408607, 485345, 480065, 458227, 376596, 390507, 403062, 351015, 309095, 347463, 385488, 403293, 411642, 426132, 373584, 356142, 351653, 340203, 407437, 473949, 453921, 413727, 429274, 405433, 409229, 458457, 474285, 460652, 419233, 420868, 424524, 411409, 484040, 504310, 412305, 397942, 384631, 362277, 354663, 361289, 425778, 382583, 340642, 410986, 460805, 511390, 514651]
14652E14651n494n0861p5393N0777J917k5772r586q853l5938J3235J3987M7218
14640D29888J0651K9348k0580L4466J6716j4743k7077j3j5557j390j8589L6870
14628D59990J8046m4676K8295N1568N4059N4146k469k8954q7688l7749r336j5644
14616D39588n814O478j6864J4497L445q38n684k1592J3873K3718O5596N899N4204
14603E76506n8487m7297l8788L4684k4211m7151J0865K663p510L4693M9934l758
14591D82143k5318M1279P8983N0207m0555k3089n2623k757M8207K2016r5411k8069
14579D55013K2803K8695M4426M9387n393k2418k955m654k1209m872L811j914L6853
14566E77573M3403K2400Q740k1852m1550j6242j5298J5708m7684n4972R0793N2166
$$ y = [514651, 509157, 458296, 382903, 433680, 435597, 409825, 400239, 391386, 355448, 368683, 382670, 429888, 440539, 469887, 449307, 483773, 500489, 485746, 458669, 458656, 443099, 441709, 423120, 459990, 478036, 433360, 461655, 513223, 567282, 621428, 618959, 590005, 502317, 464568, 455232, 439588, 433774, 440252, 423388, 437885, 441330, 440492, 434808, 413216, 427089, 450807, 516403, 522302, 576506, 518019, 470722, 431934, 466618, 442407, 395256, 406121, 408784, 401274, 435967, 485901, 482143, 456825, 498104, 577087, 627294, 586739, 563650, 511027, 508270, 556477, 578493, 483082, 455013, 477816, 506511, 550937, 600324, 594931, 572513, 569558, 564904, 543695, 538823, 542634, 540720, 577573, 620976, 643376, 652116, 630264, 588714, 572472, 557174, 572882, 525198, 470226, 561019, 613185]
14554F13185J5348P326k3343r159k1490j5250P737k0976M4585O5873O3547M0408
14542G67791r9661j22338L279L3585K3357J8175j9338l0140n5712k3222L1612
14531E27388L2577m2736m6900L9221O0821M7054O4050j6451n8868J5375M90M3072
14519F65093k5454K9694k3372n486K0060o8631J4189M309L0028K5447n0131m7835
14507E67911N267J2658J7374k8297l8708k1793M0792M6596M9574K9057j7636m8673
14495F14122p0023K9949J11462L1290p3917R974O7670n3829n8395q873M2425M017
14483F45872L9610L4041m7385O0241k1371m0744k4998n2818q618K778J650K4975
14471F13233n0607l0424L1060K519L9965J8402K3907j3823K1816J7923j8329Q01
$$ y = [613185, 628533, 635859, 612516, 603357, 581867, 566617, 574354, 553378, 597963, 663836, 727383, 767791, 668130, 545792, 549071, 582656, 606013, 624188, 604850, 574710, 518998, 495776, 527388, 559965, 517229, 470329, 509550, 570371, 617425, 681475, 665024, 606156, 621531, 622021, 665093, 639639, 669333, 645961, 640475, 660535, 591904, 606093, 610402, 640430, 665877, 615746, 567911, 573178, 585836, 603210, 574913, 536205, 514412, 555204, 601800, 651374, 680431, 662795, 614122, 544099, 574048, 685510, 716800, 642883, 652857, 720527, 666698, 608303, 599430, 641855, 645872, 685482, 719523, 672138, 732379, 711008, 670264, 645266, 592448, 583830, 586608, 588258, 613233, 562626, 532202, 563262, 565781, 605746, 624148, 648055, 634232, 656048, 673971, 655642, 656443]
14459F56443M5490j7517n7997k605N3003n5482j8415R6978m3504m8677K7795k1563
14447F13949M0377O1311J409k7679j7666M9208J1677l561l1566l2599O6743j1293
14435G20310p7835N982j6573j7945Q7430M5660p870k8056N297j0402N6174K8977
14423G91149l8464m8851O913L5156n0169p185N2774L8477k5693J7115M2488M363
14411H18073J2088L1335M704j3345q7414n9287K6353J9523K5443j8408n4415j7809
14399F86841J1030J6764R8946q307K524j6746k1661J5966j5135n6557K969L0602
14387G47236L3669K4071o188J0866P5639L0228j5836k2126q299q144M419K1256
14375H86791N552m517m9063N1119J14593k0690m2221n2402j10515l4026K1810
$$ y = [656443, 701933, 684416, 626419, 623814, 676817, 621335, 602920, 699898, 656394, 607717, 635512, 613949, 654326, 715637, 717046, 689367, 671701, 720909, 732586, 729025, 697459, 664860, 731603, 720310, 642475, 648457, 631884, 613939, 701369, 747029, 739159, 711103, 716400, 705998, 762172, 791149, 752685, 703834, 710747, 745903, 695734, 688549, 741323, 779800, 754107, 771222, 813710, 818073, 830161, 861496, 866200, 852855, 765441, 706154, 732507, 752030, 777473, 759065, 704650, 686841, 697871, 714635, 813581, 805274, 807798, 791052, 769391, 785357, 770222, 713665, 716634, 747236, 780905, 804976, 798788, 809654, 885293, 915521, 899685, 877559, 869260, 861116, 865535, 886791, 892343, 887826, 838763, 889882, 1004475, 983785, 941564, 889162, 778647, 744621, 766431]
14364G66431N1M6559L5756k2499J0647J7058j8447K517l6668J6570L9324K5963
14352H83262l557K3302k7951l9961j4085J6052M9094L4710j0256o8089l5374k6710
14340G80437N0016P562L5749L9381l033m2807q9592K5152k4512Q1540L5194M7792
14328I42879k1577k0244k3846m064J4778J416k773L9099j9194N1317J7194m2321
14316I32664J876K3818M3122l7616m2448n5201l6436j7843N469j3980M0304L1648
14304H75377M9108o897J4169j6374p994l7128L8477p3678K9314O7364k259K9943
14292I59422J2976N62k3653N2458p819q780k9130j6320M3322O2518k2126O160
14280A029590K6256k9886l2091r507K3773J1254m0781q7477k6804J25992L7826
$$ y = [766431, 766482, 813041, 848797, 826298, 836945, 854003, 835556, 838073, 801405, 817975, 857299, 883262, 879705, 903007, 875056, 835095, 821010, 837062, 886156, 920866, 910610, 842521, 807147, 780437, 830453, 838015, 873764, 913145, 910112, 867305, 777713, 802865, 778353, 859893, 895087, 942879, 921302, 901058, 877212, 873148, 887926, 889342, 886569, 925668, 906474, 957791, 974985, 932664, 934540, 958358, 1001480, 963864, 921416, 866215, 829779, 811936, 817405, 803425, 843729, 875377, 924485, 917588, 931757, 915383, 907389, 870261, 908738, 835060, 864374, 931738, 929479, 959422, 972398, 972960, 949307, 1001765, 993946, 985166, 956036, 939716, 983038, 1045556, 1023430, 1029590, 1055846, 1025960, 993869, 984362, 1008135, 1019389, 978608, 891131, 864327, 990319, 1028145]
14269A028145m4689n1644K7150R0774L1681k378J9932k3749n2926k2009l1384
14258I68903j6968J6787J3399k0872q503J0464P6384N2185m1904j5989M0338O2572
14246A136796m2838m8695M3386L5880O740j4180o999k8381K3430J8036j9818m8822
14234A054535j9421m715n327K9940J3949Q143J6315N2269k6317j3927k2253M3364
14222A126555j4730m5817j7039j7485L3069J6401M3740L1478j8130L7713k2791
14211A152964m572J73M0321M2711k7164l8350j2585l2131M4979m7649N658P8916
14199A203271K7060l0402k1033j4308o010P423O9334m6473k5328N8959R8953M1842
14187A363288k2179N101q846j5488o492p931p4871j1708N0699k0212o7829l3884
$$ y = [1028145, 983456, 931812, 958962, 1049736, 1081417, 1079039, 1098971, 1075222, 1022296, 1000287, 968903, 951935, 968722, 982121, 961249, 952746, 963210, 1039594, 1091779, 1049875, 1033886, 1074224, 1136796, 1093958, 1045263, 1088649, 1124529, 1131269, 1117089, 1110090, 1081709, 1105139, 1123175, 1103357, 1054535, 1035114, 1030399, 1025072, 1055012, 1068961, 1077104, 1093419, 1145688, 1119371, 1105444, 1083191, 1126555, 1111825, 1066008, 1048969, 1031484, 1064553, 1080954, 1124694, 1156172, 1138042, 1175755, 1152964, 1148392, 1148565, 1188886, 1231597, 1204433, 1166083, 1153498, 1121367, 1166346, 1118697, 1124355, 1203271, 1230331, 1199929, 1178896, 1164588, 1158578, 1166001, 1235335, 1188862, 1163534, 1222493, 1321446, 1363288, 1341109, 1346210, 1337364, 1321876, 1315384, 1307453, 1232582, 1220874, 1271573, 1251361, 1183532, 1149648]
14175A149648K3144R395n478L6175J9274J2033P002J0387J8596M0728L1707k362
14163A350249j145K2840N0952L566r070k3572k6643j1519O4580Q3213N166j2173
14151A496444l6804k1413j2955j1268O9773K9248o0182m7565M6890k5199k1449
14140A405520O546P0657j1067M1014p690l2182M9233l354R019J4236M7956j6040
14128A573848J8897K7398q366K504M8560P1675L5839L1947N9015L5815K2476K5475
14116A945083J04210R1722N3633P7309K7596j41494n31586n67400l18616k01671
14106E38786J0568P5438J32533J10102P2184o2N4563P0410L116l4981K2797N6242
14094A111696J04877M0072n8766J4956P9821L8987Q446k1315q167K7886K9207
$$ y = [1149648, 1172792, 1182187, 1176709, 1212884, 1232158, 1244191, 1251193, 1261580, 1280176, 1320904, 1352611, 1350249, 1349104, 1371944, 1422896, 1426462, 1417392, 1393820, 1367177, 1355658, 1420238, 1503451, 1508617, 1496444, 1459640, 1438227, 1425272, 1414004, 1483777, 1513025, 1452843, 1405278, 1452168, 1426969, 1405520, 1412066, 1482723, 1471656, 1512670, 1504980, 1472798, 1522031, 1518677, 1527696, 1541932, 1589888, 1573848, 1592745, 1620143, 1611777, 1614281, 1662841, 1734516, 1770355, 1802302, 1861317, 1897132, 1919608, 1945083, 2049293, 2141015, 2194648, 2271957, 2299553, 2158059, 1626473, 1059073, 740457, 538786, 549354, 624792, 757325, 867427, 939611, 939549, 994112, 1064522, 1067638, 1032657, 1055454, 1111696, 1216573, 1256645, 1197879, 1212835, 1292656, 1331643, 1340089, 1318774, 1310607, 1338493, 1367700]
14083A367700N1012L947m9982j4622l208J7416R3477L1220k1130j7790j0734K3032
14071A470338K960L095R3148M5346k6186L5472L138Q802n0755o939J4550K8444
14059A621413m1406P166M8134J1522J9578m2930o1236L6675L6061K8973r985k8022
14047A625943l318m721p523k9524p9603N124K6627k8770O8339O3145L5443J6203
14035A687365k5354m7533J7621K4178L2722K0905Q615l9092n938R479P1j1327
14023A671712M2442j96k537k0438N6187R0213L6493k7154j950K5000j739o4403
14011A803630L0084N3386K858j0715p3783j4340P0120J0976K7594o0060k3143
14000A816607M4211K4119M6437p5753n807O7286l6196P195L2848N6396j3548J4991
$$ y = [1367700, 1418712, 1422659, 1372677, 1358055, 1354847, 1372263, 1465740, 1496960, 1475830, 1458040, 1447306, 1470338, 1473298, 1476393, 1569541, 1614887, 1588701, 1624173, 1627311, 1636113, 1585358, 1578419, 1592969, 1621413, 1580007, 1587173, 1635307, 1646829, 1666407, 1623477, 1562241, 1598916, 1634977, 1663950, 1653965, 1625943, 1622625, 1617904, 1610381, 1580857, 1501254, 1506378, 1533005, 1504235, 1572574, 1635719, 1671162, 1687365, 1662011, 1614478, 1632099, 1656277, 1688999, 1709904, 1718519, 1679427, 1673489, 1682968, 1683039, 1671712, 1714154, 1713958, 1711421, 1690983, 1747170, 1837383, 1873876, 1846722, 1844772, 1869772, 1868033, 1803630, 1833714, 1887100, 1889958, 1879243, 1805460, 1791120, 1861240, 1872216, 1899810, 1839750, 1816607, 1860818, 1884937, 1931374, 1855621, 1849814, 1917100, 1880904, 1888099, 1920947, 1977343, 1963795, 1978786]
13988A978786k4111j734j3770K4595J8433M0029L1439j9405J2404K8260j2178
13977B062748j5198O0618J8308K9480p57J164M6258K4547k7237q181j4328n8703
13965B118719o85N272L0583J4635K8757k1959n4933l507L0102M2469j3996n5026
13953B120431K4578K4857N7018J9048m169r777L5088L1632K7263J8949l8048k081
13941B304789J1126O9771M3199j2670K024n4329k600k3324K4937J100M4144L1453
13929B439620J1971O9888N4657J8591q2916m2519k0233L9457P5218L1151O9164
13918B664049k230o225j1549M2601k467l8421K5345j6986k0719L985N4568N4998
13906B746949J4380l803l3882J2287j1782R474L5699l6500P4096L5367N0799j3284
$$ y = [1978786, 1954675, 1952941, 1939171, 1963766, 1982199, 2022228, 2053667, 2034262, 2046666, 2074926, 2062748, 2047550, 2108168, 2126476, 2155956, 2155199, 2156363, 2202621, 2227168, 2199931, 2191750, 2177422, 2118719, 2118034, 2123306, 2153889, 2168524, 2197281, 2175322, 2120389, 2116882, 2146984, 2189453, 2175457, 2120431, 2145009, 2169866, 2226884, 2245932, 2241763, 2231986, 2267074, 2298706, 2325969, 2344918, 2306870, 2304789, 2315915, 2385686, 2428885, 2416215, 2418239, 2363910, 2361310, 2337986, 2362923, 2364023, 2408167, 2439620, 2451591, 2521479, 2576136, 2594727, 2511811, 2469292, 2449059, 2488516, 2563734, 2594885, 2664049, 2661819, 2655594, 2644045, 2686646, 2684179, 2645758, 2671103, 2654117, 2633398, 2637383, 2691951, 2746949, 2761329, 2757526, 2723644, 2735931, 2724149, 2733623, 2769322, 2732822, 2806918, 2842285, 2893084, 2879800]
13894B879800l5820L586N2411J0508m2374j8191M8845L6447K5461m5306p9500
13883B835867m462o8360k7411J22639O0024m143k9758M1320K546L7856O8593K1226
13871C055937J5566m583L7429J914r453Q507j6424M5005K8432M8983J996K3886
13859C237195l0576K1336l731K8888Q228Q4909J00868q615N5850L7249J6314P53
13847C548668r009L562q4096l6560O4473R6739N212M8531J9715J989K9000m417
13835C683807K3467L3550O1133N7183J4036j1132K3084P883N7413L0507l6465
13824C944466o971M6564J9096M9259L1405L5899K1928N696J9602K1222o0575J4182
13812D141773N9816P4633N285O6957K2823o8559L4590M7535J2826O0485J2122
$$ y = [2879800, 2843980, 2847566, 2899977, 2910485, 2868111, 2849920, 2898765, 2935212, 2960673, 2915367, 2835867, 2831405, 2763045, 2735634, 2858273, 2918297, 2914154, 2884396, 2925716, 2928262, 2966118, 3034711, 3055937, 3071503, 3066920, 3104349, 3106263, 3096810, 3105317, 3088893, 3133898, 3162330, 3211313, 3213309, 3237195, 3206619, 3227955, 3224224, 3253112, 3261340, 3346249, 3447117, 3438502, 3494352, 3531601, 3547915, 3548668, 3539659, 3543221, 3459125, 3422565, 3487038, 3583777, 3588989, 3637520, 3657235, 3659224, 3688224, 3683807, 3707274, 3740824, 3801957, 3859140, 3873176, 3862044, 3885128, 3893011, 3950424, 3980931, 3944466, 3937495, 3984059, 4003155, 4052414, 4083819, 4119718, 4141646, 4147342, 4166944, 4188166, 4127591, 4141773, 4201589, 4276222, 4281507, 4348464, 4371287, 4302728, 4337318, 4384853, 4397679, 4458164, 4470286]
13801D470286J04597M5826N5782l216J9742J1694k0553J082r308O6888N4806N6538
13789D854164K9878N605M7015N0764L7688O7263J21685P7587l6828m500Q526M9404
13777E308251J21096J7763R415R5666J7521m4426J0037Q8189Q1555Q8506j0200
13766E783373N7729Q1712P8381M8886N0237K5747J09235M6878J68383J70526J1156
13755F632243r2587q0857k8950J16464J08910O0850M6131L1169J04541P3833M5108
13744G016855M6303O8042J33791J33714K9107K0599N6817Q6289N7684K8664O1947
13733G739812Q2357R4494J62724N1101J09920P4002L2085O4417J07621J16580
13723H635113N5844O9683P9974R4968J62729J49412J28934J04395P7215R2863
$$ y = [4470286, 4574883, 4620709, 4676491, 4673275, 4693017, 4704711, 4684158, 4685240, 4675932, 4742820, 4797626, 4854164, 4884042, 4889647, 4936662, 4987426, 5025114, 5092377, 5214062, 5291649, 5254821, 5250321, 5258847, 5308251, 5429347, 5447110, 5456525, 5552191, 5569712, 5525286, 5535323, 5623512, 5705067, 5793573, 5783373, 5841102, 5922814, 6001195, 6050081, 6100318, 6126065, 6235300, 6282178, 6450561, 6621087, 6632243, 6539656, 6458799, 6429849, 6546313, 6655223, 6716073, 6762204, 6793373, 6897914, 6971747, 7016855, 7063158, 7131200, 7264991, 7398705, 7427812, 7448411, 7505228, 7591517, 7649201, 7677865, 7739812, 7822169, 7916663, 8079387, 8130488, 8240408, 8314410, 8346495, 8410912, 8518533, 8635113, 8690957, 8760640, 8840614, 8935582, 9098311, 9247723, 9376657, 9481052, 9558267, 9651130]
13713I651130R9544J12011J46756J19414J22525J12167J90114J45457J87171J83567
13703A1069856J86633Q1594J21678K17897J98829J72261J89388J20262K38404
13694A2596802L06399K06589K41789K22983K54692J71664K03495L17071L82214
13685A4903698K73441K60818K90808L39897K94684L16491L61413M00992L79827
13676A7822069L42093M52255M63448N31536N43067N29081N56890N61529N84035
13667B2386003N91702O80901O89742P41427P55693P71211Q38850Q38488J000809
13658B9294826J132274J217210J344675J421215J592063J762322J912873K083292
13650D1760750K339917K508788K836663L195619L638550L992952M367344M841009
$$ y = [9651130, 9750674, 9862685, 10009441, 10128855, 10251380, 10363547, 10553661, 10699118, 10886289, 11069856, 11256489, 11338083, 11459761, 11677658, 11876487, 12048748, 12238136, 12358398, 12596802, 12903201, 13109790, 13351579, 13574562, 13829254, 14000918, 14204413, 14521484, 14903698, 15177139, 15437957, 15728765, 16068662, 16363346, 16679837, 17041250, 17442242, 17822069, 18164162, 18616417, 19079865, 19611401, 20154468, 20683549, 21240439, 21801968, 22386003, 22977705, 23658606, 24348348, 25089775, 25845468, 26616679, 27455529, 28294017, 29294826, 30427100, 31644310, 32988985, 34410200, 36002263, 37764585, 39677458, 41760750, 44100667, 46609455, 49446118, 52641737, 56280287, 60273239, 64640583, 69481592]
13642F9481592N362604O616162P961733Q881673R349886J1068140J4779506J8132379
13634A51633675J6417676J257642l6158379j12291376j20118927o7231426k3429877
13627a89920992J6710437K4043835K0466945J6276859J3023243J0538664Q566058
13620h0294951O932409N578088M370570L814684L513316L323401L047943K732876
13612d6981664K497396K233117K009288J743834J597161J473369J303195J238101
13604c2886203J195697J098411J144161J121443J004698R18551Q65029P41139
13596b4797074P35910P41331O85021N85152N16247N45574M51094M23805M30610
13587a9682330M21810M04402M05739L77369L94407M01398L68487L40174K81543
$$ y = [69481592, 74844196, 81460358, 89422091, 98303764, 107653650, 118721790, 133501296, 151633675, 168051351, 169308993, 133150614, 20859238, -99259689, -166491115, -189920992, -173210555, -149166720, -128699775, -112422916, -99399673, -88861009, -80294951, -73362542, -67784454, -63413884, -59599200, -56085884, -52762483, -49714540, -46981664, -44484268, -42251151, -40241863, -38498029, -36900868, -35427499, -34124304, -32886203, -31690506, -30592095, -29447934, -28326491, -27321793, -26403242, -25538213, -24797074, -24061164, -23319833, -22634812, -22049660, -21533413, -20987839, -20536745, -20112940, -19682330, -19260520, -18856118, -18450379, -18073010, -17678603, -17277205, -16908718, -16568544, -16287001]
13578a6287001K99244L24169K51754K33914K74796K47635K61324K48633K05703
13569a3939829K54412K64194J99918J96353J36344J06122K83169K29659J56538
13560a2113120J36810J81914J42026J19282R9635P1168J76341J93979J21638M7692
13550a0822635J39527J27061J46928J77208J46626J52085J07430J39238Q5746
13541i600786Q6145J48244N8386L4558Q8187J30681J31546N8089Q1472Q9751N8406
13530h635321P4166N9955O2425J9911M4187J17607J50028J22640J17186P3160
13520g794056L3743P7903N7956P4972N3121Q8876M4098K7457j9060N9404J14289
13509g181297R8434M5023R0497J48457J82913J08541r48P070K768j1151j5179
$$ y = [-16287001, -15987757, -15663588, -15411834, -15177920, -14903124, -14655489, -14394165, -14145532, -13939829, -13685417, -13421223, -13221305, -13024952, -12888608, -12782486, -12499317, -12269658, -12113120, -11976310, -11794396, -11652370, -11533088, -11433453, -11362285, -11185944, -10991965, -10870327, -10822635, -10683108, -10556047, -10409119, -10231911, -10085285, -9933200, -9825770, -9686532, -9600786, -9514641, -9366397, -9308011, -9273453, -9185266, -9054585, -8923039, -8864950, -8783478, -8693727, -8635321, -8561155, -8501200, -8438775, -8418864, -8374677, -8257070, -8107042, -7984402, -7867216, -7794056, -7760313, -7682410, -7624454, -7549482, -7496361, -7407485, -7363387, -7335930, -7354990, -7295586, -7181297, -7082863, -7037840, -6947343, -6798886, -6615973, -6507432, -6508380, -6501310, -6498542, -6509693, -6524872]
13498f524872P0748O8258K0276k754M5891O3286N3321M1976O8293K9747J098N7748
13486f006984K7270N6565M5373J1787k522L6209O8174P8435K4100J1549K7722
13475e622322n070O9041R9073j595K6991p435o1091L2565O9728L0883j9669K1261
13463e367640O5427N3144P3034M9663m0375M937N5577P3566M6573l0286m696M6096
13451d974980P7382K4000K6567M4188k3680J5633L6842K3112P0497O6760J2208
13440d601471n1420M6337P6738O265J4024m2859j122O0335O478K3014O3946O9436
13428d330299K7999k4116P565r327L0418j2393L6808O8989M0435J1192k8320M111
13416d176938K599R982N3913L1122K0430Q0151R5184K3316l6575k5275J9441L6716
$$ y = [-6524872, -6454124, -6385866, -6365590, -6368344, -6322453, -6259167, -6205846, -6163870, -6095577, -6065830, -6064732, -6006984, -5979714, -5923149, -5877776, -5865989, -5868511, -5832302, -5764128, -5685693, -5661593, -5650044, -5622322, -5627392, -5558351, -5459278, -5460873, -5433882, -5441317, -5502408, -5469843, -5400115, -5369232, -5388901, -5367640, -5302213, -5249069, -5176035, -5126372, -5166747, -5161810, -5106233, -5032667, -4986094, -5016380, -5021076, -4974980, -4897598, -4873598, -4847031, -4802843, -4826523, -4810890, -4774048, -4750936, -4680439, -4613679, -4601471, -4652891, -4606554, -4529816, -4523551, -4509527, -4552386, -4553508, -4493173, -4486695, -4463681, -4399735, -4330299, -4302300, -4326416, -4318851, -4328178, -4297760, -4310153, -4273345, -4204356, -4163921, -4152729, -4181049, -4176938, -4174339, -4164357, -4110444, -4079322, -4058892, -3978741, -3883557, -3860241, -3896816, -3922091, -3902650, -3865934]
13404c865934L7767k8273r850l1762P5O0687L7846K8038N157K5480r559J6866
13392c733462K6063j9043l5540k3036O6441L2027M6999M0205k190l0027L9716
13381c591847N8088j1946j6809J2596L0341J4999n535J595J9842L91J9074K7169
13369c442042L2994O996j2572m1737K5136J00078P790l2604J6634M3405l865k2500
13357c322287R919L1893J9720L3101K1387k8492M2236j5398K508j0530n2759L7211
13345c231491N7675p10L5718N1875n2387j4717M4114J406N8705N3882L0744M591
13333b960595l2411j0561l1603P709P8841Q014p519j2235M5268L05q206N1120
13321b871873j7758m3477P167j3270n834l7329m4402J05012K2743J9864J5853
$$ y = [-3865934, -3828167, -3856440, -3866290, -3898052, -3897977, -3837290, -3799444, -3771406, -3766249, -3740769, -3750328, -3733462, -3707399, -3726442, -3761982, -3785018, -3718577, -3686550, -3639551, -3599346, -3601536, -3631563, -3591847, -3533759, -3545705, -3562514, -3549918, -3519577, -3504578, -3510113, -3508518, -3488676, -3488285, -3469211, -3442042, -3409048, -3402052, -3414624, -3456361, -3431225, -3331147, -3323357, -3355961, -3339327, -3295922, -3299787, -3322287, -3312368, -3280475, -3260755, -3227654, -3206267, -3234759, -3192523, -3207921, -3205413, -3215943, -3268702, -3231491, -3173816, -3174526, -3138808, -3086933, -3139320, -3154037, -3109923, -3108517, -3049812, -2995930, -2965186, -2960595, -2993006, -3003567, -3035170, -3027461, -2948620, -2940606, -2948125, -2960360, -2915092, -2914787, -2922993, -2871873, -2889631, -2933108, -2925941, -2939211, -2945045, -2982374, -3026776, -2921764, -2899021, -2879157, -2863304]
13310b863304J299r09j5861p416Q623L1760O0232k6835l1618o131N4517M939O431
13297b784273l0800j1672L3177M1419M8168j340L7183k2901j991P0446K1509p272
13285b608347j4336R279N4401o909p5360n6969K6979J0882P960M3218j5485l6631
13273b661318N8478O3786P4836K8715k9016m3504J8775j8929J3996J7418j091
13262b477854J5042K4302M8903L1507l9262l3613K0609L1498M67k1647k8668k3339
13250b452055j1939J9234J5806l2180J0073N8343K5445k066o7410J3011L5639
13239b388099L524l8928l0806P674N5045J8120m4203Q109L8027R211O2029N1537
13227b248760k5531j3094K3052K7717J6922j4294p051M0901N3180J0128m8302
$$ y = [-2863304, -2862005, -2862914, -2878775, -2886191, -2877568, -2845808, -2785576, -2812411, -2844029, -2850160, -2795643, -2790704, -2784273, -2815073, -2826745, -2793568, -2752149, -2703981, -2705321, -2668138, -2691039, -2693030, -2622584, -2601075, -2608347, -2622683, -2613404, -2559003, -2565912, -2641272, -2698241, -2671262, -2660380, -2652420, -2609202, -2624687, -2661318, -2602840, -2539054, -2464218, -2435503, -2464519, -2508023, -2489248, -2508177, -2494181, -2476763, -2477854, -2462812, -2438510, -2389607, -2358100, -2397362, -2430975, -2410366, -2378868, -2378401, -2400048, -2428716, -2452055, -2463994, -2444760, -2428954, -2461134, -2451061, -2392718, -2367273, -2369339, -2436749, -2423738, -2388099, -2384575, -2423503, -2454309, -2446635, -2391590, -2373470, -2417673, -2409564, -2371537, -2362326, -2300297, -2248760, -2274291, -2287385, -2264333, -2236616, -2219694, -2233988, -2241039, -2200138, -2146958, -2136830, -2185132]
13216b185132n9038j1046K5562M0623L8500l3382p1100k1378j6467J3452J9951
13205b259455N5340L6242Q879O1348N2751N3464j8924k6440o2780l1640K7961
13194b103254L3039k6196L919M6368l5298N2960N7676j3657J6743j6295J454K4907
13182a957634K7240k8683j9660J9262J7j8104k4489o2867J3318J64226R4763k2907
13170a815518n9851J938N2002K5852M154l8163p519j2628N4830K4039P7953O5952
13158a626959P8901L7726n2960o2973K437J14646N0420N1187R7800J15395O9448
13147a124932r2759l37769o12235m22245k73313o6294J46493J76743L8299L869
13137b564143K6464J11960P4703J7631M7495m511K168M8176Q0799K3261R775l4172
$$ y = [-2185132, -2244170, -2255216, -2229654, -2189031, -2150531, -2183913, -2255013, -2276391, -2292858, -2279406, -2259455, -2204115, -2167873, -2158994, -2097646, -2044895, -1991431, -2010355, -2036795, -2099575, -2131215, -2103254, -2070215, -2096411, -2092492, -2046124, -2081422, -2028462, -1970786, -1984443, -1967700, -1983995, -1982541, -1957634, -1930394, -1959077, -1978737, -1959475, -1959458, -1977562, -2002051, -2064918, -2051600, -1887374, -1792611, -1815518, -1875369, -1873431, -1821429, -1795577, -1791423, -1829586, -1837105, -1849733, -1794903, -1770864, -1692911, -1626959, -1548058, -1510332, -1563292, -1626265, -1623828, -1509182, -1458762, -1407575, -1309775, -1194380, -1124932, -1217691, -1555460, -2167695, -2589940, -2863253, -2929547, -2783054, -2606311, -2568012, -2564143, -2537679, -2425719, -2351016, -2333385, -2285890, -2290401, -2288233, -2240057, -2159258, -2135997, -2126222, -2160394]
13125b160394J5610P0539K7135j0522K356P0275O2357N1678l677n233j3394l3091
13113a926361j7389J1845N4733n6011k5183N4217L6033K432l8930k0546J9312
13102a905848K224m7145O7720O739q4257L7114O0313L9443k1245l0010j3701R423
13090a879230j3753k2837j765Q6630O8662o177l7007m7232k577m8239N4279J00600
13078a748646k4919j07260j21516L855J3558P9264K1665j2293j6390O1475P3604
13067a777603J8361p3975l4613P1690P091j1741O4263M7713k8027n3097l3448
13056a803386j7703O7984N5710J1901O2303L475j8135j4105K0552o0628k2181
13045a714213l9168n220L1736L4162k8993j639j9954L9134J7130k8847j6976p0362
$$ y = [-2160394, -2144784, -2074245, -2047110, -2057632, -2055276, -1985001, -1922644, -1870966, -1874643, -1879876, -1893270, -1926361, -1943750, -1931905, -1877172, -1933183, -1958366, -1904149, -1868116, -1865684, -1904614, -1925160, -1905848, -1903624, -1950769, -1883049, -1876310, -1960567, -1923453, -1863140, -1823697, -1844942, -1874952, -1888653, -1879230, -1892983, -1915820, -1917585, -1830955, -1762293, -1768470, -1805477, -1852709, -1855286, -1903525, -1849246, -1748646, -1773565, -1880825, -2002341, -1998486, -1984928, -1905664, -1883999, -1896292, -1912682, -1851207, -1777603, -1759242, -1833217, -1867830, -1796140, -1789049, -1800790, -1736527, -1688814, -1716841, -1769938, -1803386, -1821089, -1753105, -1697395, -1685494, -1623191, -1619716, -1637851, -1651956, -1631404, -1692032, -1714213, -1753381, -1758601, -1726865, -1692703, -1721696, -1723335, -1743289, -1704155, -1687025, -1715872, -1732848, -1803210]
13033a803210m0943M9743L8853R5579J9126j6353K3518K6133K5185n0308M9540
13022a583137L3746j3145k1149l7941p112m4442L8688L0936j9047k8506k6587
13011a677696q698L6267n3915J6956Q0916j918l1401n0017j3006O2657r454N9046
12999a590263K9545k8858j8432M9970L3164l33l7716L7245j7295n9472k683N4099
12987a551029L929n4521M8209R030j0640o7936r293L7610k1486n5563L6557O0308
12975a574825K4078L2561q3570o7745Q0593P4745K1853O880L876K4749o3104o5097
12963a585006l6968L1562M7168L982k0448P549k6314j7815N0884o432j7497N4324
12951a515011L8411l4350n525O5177J8317n2997M9093K9888r1447j6682r244J1315
$$ y = [-1803210, -1844153, -1794410, -1755557, -1659978, -1640852, -1657205, -1633687, -1607554, -1582369, -1632677, -1583137, -1549391, -1562536, -1583685, -1621626, -1628738, -1673180, -1634492, -1603556, -1622603, -1651109, -1677696, -1686394, -1650127, -1704042, -1687086, -1606170, -1608088, -1639489, -1689506, -1702512, -1639855, -1649309, -1590263, -1560718, -1589576, -1608008, -1558038, -1524874, -1525207, -1562923, -1525678, -1542973, -1602445, -1605128, -1551029, -1547100, -1601621, -1553412, -1544382, -1555022, -1622958, -1632251, -1594641, -1616127, -1671690, -1635133, -1574825, -1550747, -1518186, -1601756, -1669501, -1588908, -1514163, -1492310, -1485430, -1481554, -1456805, -1519909, -1585006, -1621974, -1590412, -1543244, -1539262, -1559710, -1552161, -1578475, -1596290, -1545406, -1551838, -1569335, -1515011, -1476600, -1510950, -1516475, -1451298, -1432981, -1485978, -1436885, -1406997, -1498444, -1515126, -1524370, -1513055]
12939a513055J3125j7518m8782J1932O1070N0051L4449M2681j2909L207L2787
12928a342962l0641k8905m4723k1179n528K3542q506r254J9835q332L5924j0024
12916a430753m164K3891K3131m9007J4102O2255n691j4269K8992n3687m5934L6459
12904a414675L6495R2829O613m5403m5712q4415K4342L7489K6626j729J5137K9308
12892a323095J2839n182R724N1532k2093q7509L6828L475o2016l1316K4755K1519
12880a370539N8751p1006k9904j6634L5195j6345l2430o9264O7500L4376l7268
12869a447568J6256O6226j1707l645j2170K6426j2390M7018M7984m063k0273m3797
12857a351703k8268P4353L5975j6933o6263M4254k3129o5492N025J6058L3057
$$ y = [-1513055, -1499930, -1517448, -1566230, -1554298, -1493228, -1443177, -1408728, -1366047, -1378956, -1375749, -1342962, -1373603, -1402508, -1447231, -1468410, -1473938, -1450396, -1458902, -1468156, -1448321, -1456653, -1420729, -1430753, -1434917, -1411026, -1387895, -1436902, -1422800, -1360545, -1366236, -1380505, -1351513, -1405200, -1451134, -1414675, -1378180, -1285351, -1278738, -1324141, -1369853, -1454268, -1429926, -1392437, -1365811, -1367540, -1352403, -1323095, -1310256, -1315438, -1305714, -1254182, -1276275, -1363784, -1326956, -1323481, -1385497, -1416813, -1392058, -1370539, -1311788, -1382794, -1412698, -1429332, -1394137, -1410482, -1442912, -1512176, -1444676, -1410300, -1447568, -1431312, -1365086, -1376793, -1380438, -1392608, -1366182, -1378572, -1331554, -1283570, -1287633, -1307906, -1351703, -1379971, -1305618, -1269643, -1286576, -1352839, -1308585, -1331714, -1397206, -1392181, -1376123, -1343066]
12846a343066O7567K4233o4985j6142M4331l9211n1036Q9706K0915L7263J4007
12835a216418p3839m6208M5631L5902k0556k980K9684n253l5399k7923K0602K8975
12823a267782M7996L0207n5826k1683N3503N100m4411m0073O0293P1634l393n8915
12811a223350n6089J6240P557l7396K5622o860j7038J3637M3280o307K008k212
12799a240908J6441M830k7929j7484j4994k5864Q654M6793M687j4761k4644m3142
12787a328321J3693J5605Q7156N2419l6988R556K3545k1956m5268j5176K4839
12776a220896L1523l4760m1170j4053P2583M0000K3849L5512r18k6962l9906N779
12764a169419J0739J7235k5095J8035k8681K3158L1497K782j3283l6889k3876
$$ y = [-1343066, -1275499, -1251266, -1316251, -1332393, -1288062, -1327273, -1378309, -1288603, -1267688, -1230425, -1216418, -1290257, -1336465, -1290834, -1254932, -1275488, -1278468, -1248784, -1254037, -1289436, -1317359, -1296757, -1267782, -1219786, -1189579, -1245405, -1267088, -1213585, -1208485, -1252896, -1292969, -1232676, -1161042, -1164435, -1223350, -1279439, -1263199, -1255642, -1293038, -1267416, -1274276, -1291314, -1277677, -1234397, -1240704, -1238696, -1240908, -1224467, -1219637, -1247566, -1265050, -1280044, -1305908, -1297254, -1250461, -1245774, -1260535, -1285179, -1328321, -1314628, -1299023, -1211867, -1159448, -1196436, -1186880, -1163335, -1185291, -1230559, -1245735, -1220896, -1189373, -1224133, -1265303, -1279356, -1206773, -1166773, -1142924, -1107412, -1108330, -1135292, -1175198, -1169419, -1158680, -1141445, -1166540, -1148505, -1177186, -1154028, -1122531, -1119749, -1133032, -1169921, -1193797]
12753a193797l409m7536K4624Q6949j1191L910L6908Q211q5821l1426R154M0776
12741a162648j4954R675L7098k5492k1038n0704k8864K1533M0167L1263M4544
12730a119420j1485m2497O361n079K7790N5597K8490n5857j0984j0159q333J4244
12718a131332L8465N034k0418o8263L3594M3922j2463k6676N128N1127k8832K0463
12706a090251k6945l3587L3873M6807M109m4573L687J8499j5034L9444j978r791
12694a075740m750M674j8234P956k3983k2021j1875P2251n3756k6197L1741K8050
12682a091884N4027L6670j7101j0213j9146l7542k7214N0878O3873J5110N9679
12671i22863J1543m8261l9613K783l2658m7979l451L8467j3252K3181k9666m4530
$$ y = [-1193797, -1197206, -1244742, -1220118, -1133169, -1144360, -1140450, -1103542, -1095331, -1181152, -1212578, -1203424, -1162648, -1177602, -1167927, -1130829, -1156321, -1177359, -1228063, -1256927, -1235394, -1195227, -1163964, -1119420, -1130905, -1173402, -1167041, -1172120, -1144330, -1088733, -1060243, -1116100, -1127084, -1137243, -1145576, -1131332, -1092867, -1087833, -1108251, -1176514, -1142920, -1098998, -1111461, -1138137, -1133009, -1081882, -1110714, -1090251, -1117196, -1150783, -1116910, -1070103, -1065994, -1110567, -1106880, -1088381, -1103415, -1063971, -1065949, -1075740, -1080490, -1075816, -1094050, -1086094, -1110077, -1132098, -1143973, -1071722, -1125478, -1151675, -1119934, -1091884, -1037857, -1001187, -1018288, -1028501, -1047647, -1085189, -1112403, -1061525, -997652, -982542, -922863, -911320, -959581, -999194, -996411, -1029069, -1077048, -1080499, -1042032, -1055284, -1032103, -1061769, -1106299]
12659a106299k0090K3325O4362M6596q059l4820l675j3796K2017l1940l0305L5736
12647a056948N7716j1376J5477n0922J4050N5335L8391l3996j8649J0836O385
12636i73701j3695q3063n4271P1835K0671N896n98M1840J3754k6193R256J4876
12624i73393l6750j3427l2616n4155j0330O6569O8331q628k6317O694j1452M9713
12612i75761M503l5573j6401K218j7922K7587O8055O6091j0280K3504n5614q237
12600i27830K6832k1274l0664P5895j9148o7219j3953J5784M0060O2237M7764
12589h11516k0358p968M2396o5840n1132l6744K3645J5668Q893m035j1845L027
12577i15809k9073o675K9254k4041j1008J2334O8222O1121j2107m8192k4825l1015
$$ y = [-1106299, -1126389, -1103064, -1038702, -992106, -1000165, -1034985, -1038660, -1052456, -1030439, -1062379, -1092684, -1056948, -999232, -1010608, -995131, -1046053, -1032003, -976668, -938277, -972273, -990922, -980086, -973701, -987396, -1070459, -1124730, -1052895, -1032224, -1026328, -1026926, -985086, -971332, -997525, -988269, -973393, -1010143, -1023570, -1056186, -1110341, -1120671, -1054102, -985771, -994399, -1020716, -1014022, -1025474, -975761, -971258, -1006831, -1023232, -1021014, -1038936, -1011349, -943294, -877203, -887483, -863979, -919593, -927830, -900998, -922272, -952936, -877041, -896189, -963408, -977361, -961577, -921517, -859280, -811516, -831874, -839842, -797446, -863286, -914418, -951162, -927517, -911849, -902956, -906991, -918836, -915809, -944882, -951557, -922303, -946344, -957352, -945018, -876796, -815675, -827782, -875974, -900799, -931814]
12565i31814o5994j0648K8340P8262J2438m6906l877N174R691J0720l9403J9931
12553i34086N4784P7238j7631k4414M662l5532p0261q449O735J8754P181o9902
12541i90921o2166n6604R962q646j8207j6029K5923R170N4673M8856j0630k5841
12529a040460R1390J7017l2156O2248K2830p6031m4846m2061j4944J8704n831
12518a044140k8019J4960N9459K0788j0781k070j4917J2569L623k5425R238J3003
12506i91712M6972n90l430O282l8732l2472m8243m5106l0711n0933K1480N7783
12494a109412J481M4169O7427j5588m9076r440M6641Q716l0496j1777J00720q406
12482i65041p4321n8804Q768O1093k0324K5240L0973M4815K79n9592J2517J7823
$$ y = [-931814, -997808, -1008456, -980116, -901854, -889416, -936322, -940199, -935025, -925334, -914614, -954017, -934086, -879302, -802064, -819695, -844109, -839447, -874979, -945240, -953689, -946954, -928200, -921019, -990921, -1053087, -1109691, -1099729, -1108375, -1126582, -1142611, -1116688, -1107518, -1052845, -1003989, -1014619, -1040460, -949070, -932053, -964209, -901961, -879131, -955162, -1000008, -1042069, -1057013, -1038309, -1044140, -1072159, -1057199, -997740, -976952, -987733, -989803, -1004720, -992151, -988528, -1013953, -1004715, -991712, -944740, -945330, -948760, -942478, -981210, -1013682, -1061925, -1107031, -1137742, -1188675, -1167195, -1109412, -1107931, -1063762, -996335, -1011923, -1060999, -1070439, -1023798, -1015082, -1045578, -1057355, -956635, -965041, -1039362, -1098166, -1089398, -1028305, -1048629, -1023389, -992416, -947601, -947322, -1006914, -994397, -976574]
12470i76574l982J8080J5649J8222J4599o5973o7713l2486O0715J5654O1482J5598
12458i26729l6416k5233l9378j6121M6625K0445K3662J6181K2055M5928l5100
12447i04081l7385J4323L0314K5910R50K769p388m7460n2946O755O5113J986r377
12434i10517J3722o8906j3214R667k5912k2574K6137M9663N4173K1288k8908J3119
12422h82262k2159j0413m075j3692k0408K8623k5851o6884K9355N3129M6277m5219
12410i33579P11L451M2513j9850m9646O840J4690N5414l9437L030j6591j098L9632
12397h93920q033P910R836J3940k2491l7712J5900R162o148M0999J5185k3804
12385h79176q5890k0166M5937N0168j9511P450k1659k0340l9222O360O1614Q043
$$ y = [-976574, -980556, -962476, -946827, -928605, -914006, -979979, -1047692, -1080178, -1019463, -1003809, -942327, -926729, -963145, -988378, -1027756, -1043877, -997252, -976807, -953145, -936964, -914909, -868981, -904081, -941466, -927143, -896829, -870919, -869969, -867200, -874588, -922048, -974994, -968239, -903126, -901140, -910517, -896795, -965701, -978915, -969248, -995160, -1017734, -991597, -941934, -887761, -866473, -895381, -882262, -904421, -914834, -918909, -932601, -953009, -924386, -950237, -1017121, -987766, -934637, -888360, -933579, -932868, -929417, -886904, -906754, -956400, -949560, -934870, -879456, -918893, -915863, -932454, -933552, -893920, -901953, -894043, -884207, -870267, -892758, -930470, -914570, -905408, -911556, -870557, -855372, -879176, -965066, -985232, -939295, -889127, -908638, -901188, -922847, -943187, -982409, -976049, -914435, -906392]
12373i06392L9020N0291J1420p466j0816l3386n7842n0749k033L4570m96L7012
12361h96867M7415m5821o2205j7962K5831L9542j0239J0283j7640n6035O7296
12350i16402J536j4196J24n190R368L1895K8453J923L2823L6342k88k6524j2535
12337h32671n2861k8064j0424L5745M0259N2652O865o565q0273j9988o651L5025
12325h66951o5823j3366K7323K177K3818p986R786k2158n198j416N1350M56L31
12312h67657o206k8162m0904p181P472K1082M9580M5342k7238j9790o15L4247
12300h40030L7184P07O5162R992l7401j2653J7493o5948o796o087j1904o317M5898
12287h10700L7288M2542j5207k1926J4597n7159k5280k4130k3445O577J1133J6546
$$ y = [-906392, -867372, -817081, -805661, -813127, -823943, -857329, -915171, -965920, -967953, -933383, -933879, -896867, -849452, -895273, -957478, -975440, -949609, -910067, -920306, -910023, -927663, -983698, -916402, -914866, -929062, -928938, -934128, -924760, -892865, -864412, -862489, -829666, -793324, -793612, -820136, -832671, -885532, -913596, -924020, -888275, -848016, -795364, -788499, -795064, -875337, -895325, -901976, -866951, -932774, -946140, -918817, -916640, -892822, -900808, -891022, -913180, -918378, -919794, -868444, -867988, -867657, -873863, -902025, -942929, -950110, -942638, -921556, -871976, -826634, -853872, -873662, -874277, -840030, -802846, -802139, -736977, -726985, -764386, -777039, -759546, -825494, -832290, -838377, -850281, -856598, -810700, -773412, -730870, -746077, -768003, -753406, -810565, -835845, -859975, -883420, -876843, -865710, -849164]
12275h49164L00M52j0203j7551K5597M4657P64l2465m4471K0572M325M4678O1689
12262g50820j1823q0919k6953K2561K230Q2094R6928q053p3195j4530k6529J7233
12250g71776j2319J3807Q820p8128l7463R261J5124M6274j6124O609M3166o083
12238g78832q3197L2351M0888n4023l1591O9346M3982L2556n8187o2374j3858
12227h62939L9343P2201j1309l0098K2435O278k5902j607k3371J9152P727j1452
12215g99542r795K4618Q276j9718k3560r104q202p652L0895K8097o741K42K365
12202g89821k8007L4489j8433j4100L1056M0485L0771k7156j4307L1239M0798
12191f82986l1777n0301L0324q295n7489n0876L7938J4682O2581M131K0386J1751
$$ y = [-849164, -848864, -848412, -858615, -876166, -850569, -805912, -805148, -837613, -882084, -861512, -857187, -812509, -750820, -762643, -843562, -870515, -847954, -845724, -763630, -666702, -674755, -747950, -762480, -789009, -771776, -784095, -770288, -761468, -839596, -877059, -867798, -852674, -806400, -822524, -815915, -772749, -778832, -862029, -829678, -788790, -842813, -874404, -805058, -761076, -728520, -786707, -849081, -862939, -823596, -751395, -762704, -792802, -770367, -764089, -789991, -791598, -814969, -795817, -788090, -799542, -809337, -784719, -776443, -796161, -819721, -828825, -837027, -844679, -813784, -785687, -792428, -792186, -789821, -817828, -783339, -801772, -815872, -784816, -744331, -713560, -740716, -755023, -723784, -682986, -714763, -765064, -734740, -743035, -800524, -851400, -813462, -798780, -736199, -732068, -711682, -699931]
12179f99931P1390q0388k6130l7868k4424P388M0801M866j0409j3230m826K5332
12167g47429M9778l3752P985L5664r0713n4716k613M923L3549K7471m3362J4497
12155g98718M6969M1527J3614J6407P827K6586p412n8230n451K7790q903L7515
12143f60479l2389j2746j608j7681j7689k4071j8973J4679r530n339m9163J0194
12131h24795M1147J3347j6183m3322O113O1021j4729K6879J8765k3848k7740j9584
12119h02929p389j2808O197O5606n98J9177R827k6288K3913l8019m6905J0919
12107g99297L1841K1830j6543m4297j3224L6664m6866j3240O316O6600J2029j8939
12095g77126m0265q5828l7288R2417J4857L28J5546j4156j2601O921K9535R1188
$$ y = [-699931, -628541, -708929, -735059, -772927, -797351, -789963, -749162, -744296, -754705, -767935, -772761, -747429, -697651, -731403, -723418, -687754, -778467, -833183, -835796, -830873, -797324, -769853, -813215, -798718, -751749, -710222, -696608, -680201, -672374, -645788, -653200, -711430, -716881, -689091, -697994, -660479, -692868, -705614, -707222, -724903, -742592, -766663, -785636, -770957, -780487, -785826, -834989, -824795, -783648, -770301, -786484, -829806, -823693, -762672, -777401, -750522, -731757, -755605, -783345, -802929, -810318, -823126, -816929, -751323, -751921, -732744, -722917, -749205, -725292, -763311, -810216, -799297, -767456, -745626, -762169, -806466, -819690, -783026, -829892, -843132, -836816, -770216, -758187, -777126, -817391, -903219, -940507, -848090, -833233, -832905, -817359, -831515, -844116, -837195, -807660, -716472]
12083g16472j2566n1882j6918L4890J3486l0264j3723j078j881m180L0238l2812
12071h03162K7327j9067l4281O2267M6627k8348l5329m4977K6793K6427k1004
12060g96727J7340K7627M524k3000j8056K0476L4047N9796j6619k4039K5180M5959
12048f43492L2011k1440r9279l6613n533L5487L9335M7788J5754n5473l0967k4073
12036g46495M159Q2632J3498m103k0367J6432N8870j9282l7478l7234o5228k5870
12024g80466k4952M802Q6594R675l4853K1869l076K2688j753k0130K998p298L6110
12011f87792N324n3769o6257n7227O8519O2773K2210J3769O5895N008J5788n5865
11999f61624k4335n1826K2325O1450R90R230R758k8972o5580j4999k4075L2094
$$ y = [-716472, -729038, -780920, -797838, -762948, -749462, -779726, -793449, -794527, -796408, -800588, -770350, -803162, -775835, -794902, -829183, -766916, -720289, -748637, -783966, -828943, -802150, -775723, -796727, -779387, -751760, -747236, -770236, -788292, -767816, -733769, -673973, -690592, -714631, -689451, -643492, -611481, -632921, -732200, -768813, -774346, -738859, -699524, -651736, -635982, -691455, -722422, -746495, -742336, -659704, -646206, -650309, -670676, -654244, -595374, -614656, -652134, -689368, -754596, -780466, -805418, -800616, -714022, -704347, -739200, -717331, -720407, -697719, -699472, -719602, -716604, -723902, -687792, -682468, -736237, -802494, -859721, -791202, -728429, -706219, -692450, -626555, -621547, -605759, -661624, -685959, -737785, -715460, -654010, -653020, -643790, -634032, -663004, -728584, -743583, -767658, -735564]
11987g35564K7094j4130K7118M8165j1508k6376M6310L2348J989j5299L7020J3181
11975e69652j5755j3817J0328m1669n6858l1064J6705j0234K0745L4652R304k7658
11963f74973j7374r725J6177n948L3771M5517j1036l8863n4932n3747r707J0340
11951g70500P4362O7532J5164l7792k5818O8988L1081q1229l6027l8r028M0025
11939f63280k344k0735o886j6140J2124J7425j4195P905M8576m0598K214k4798
11927g00732k7278l5598N7696m126N9879M4448m3074j9939Q343Q76J0008J1867
11915f37630r616K0396j44j9326n038l0830k0420O7068N7626j4683l7096J1888
11903f17805o73l4094J6042O227k7606j384K7469N64K7209L5247l5623k1238r39
$$ y = [-735564, -708470, -722600, -695482, -647317, -658825, -685201, -638891, -606543, -604554, -619853, -582833, -569652, -585407, -599224, -588896, -630565, -687423, -718487, -701782, -712016, -691271, -656619, -647315, -674973, -692347, -702072, -685895, -691843, -658072, -612555, -623591, -662454, -717386, -771133, -780840, -770500, -696138, -628606, -613442, -651234, -677052, -608064, -576983, -658212, -694239, -694277, -703305, -663280, -665624, -686359, -693245, -709385, -697261, -679836, -694031, -686126, -637550, -678148, -675934, -700732, -728010, -763608, -705912, -710038, -650159, -605711, -648785, -668724, -660381, -659505, -649497, -637630, -647246, -626850, -626994, -646320, -651358, -682188, -702608, -635540, -577914, -592597, -629693, -617805, -618478, -652572, -636530, -630303, -657909, -659293, -631824, -631260, -604051, -568804, -604427, -625665, -626604]
11890f26604j464J0804J3282L0695q0991n5117M5724O5375J6250l6088m4969K6252
11878f36851M5918N2016L2797n0659r6168m5707l5617J857N7932O8654M789k5098
11866f26137K7132L4997R547o877k7867o4448j7139M2152l6181Q614k2119m7590
11854g25916j7111q678K8138K1067L9217M3519j0932p5169k5414M292N4504J7976
11842f54507O586n4573k3931j003R6731O3706n0933j1539J0645j2276J6985l0138
11830f44247l0883N6533O0152l2054k4766j8438j6146J0l0565K1659L3233q930
11818f34442r2970J8649O9272o487J344k0967K3472L240j4104l9277L2218M6696
11806f13356J9450N076n6910k7507j6030l9783R556Q0725j3189l8697K4206R951
$$ y = [-626604, -628068, -617264, -603982, -573287, -654278, -709395, -663671, -598296, -582046, -618134, -663103, -636851, -590933, -538917, -506120, -556779, -652947, -698654, -734271, -732414, -674482, -605828, -601039, -626137, -599005, -564008, -554461, -561338, -589205, -653653, -670792, -628640, -664821, -656207, -678326, -725916, -743027, -751705, -723567, -702500, -663283, -619764, -630696, -705865, -731279, -726987, -672483, -654507, -647921, -702494, -726425, -727428, -630697, -566991, -617924, -629463, -618818, -631094, -614109, -644247, -675130, -618597, -558445, -590499, -615265, -633703, -649849, -649839, -680404, -658745, -625512, -634442, -727412, -708763, -639491, -645978, -644634, -665601, -642129, -638889, -652993, -692270, -660052, -613356, -593906, -588830, -645740, -673247, -689277, -729060, -719504, -638779, -651968, -690665, -666459, -656508]
11794f56508L3610r840K5534K7929N798j4190o6007j7976K9485P629l8393P17
11782f72212P7011J2306j8856K2542K4747l9836M6871L0325l3721l4759l7423
11771f23005k2181K7053l4490j6505k1385L6540K3722P171k1164K9817l4004m166
11759f52597P2996k1346l1967K080N3390k1289l9627L0644J1851N9628O1743l3101
11747e07595n1859R070j9636q763j6919l5150j2184N5615n918K6875M5534m782
11735e25712L4135m9359p5579k2468L1825L2614K915k4856k1476j3995J4122j9102
11723f36936k6226J3638J4735L0856K3605r9719J0563L6048K8035N3184M113l1031
11711e79135J6428L8538K1992J7823M222k3414r331l5735l7208J5195j7021k4082
$$ y = [-656508, -622898, -632738, -607204, -579275, -573477, -587667, -653674, -671650, -642165, -634536, -672929, -672212, -595201, -582895, -601751, -579209, -554462, -594298, -547427, -517102, -550823, -585582, -623005, -645186, -618133, -652623, -669128, -690513, -653973, -630251, -623080, -644244, -614427, -648431, -652597, -579601, -600947, -632914, -630834, -577444, -598733, -638360, -607716, -595865, -536237, -474494, -507595, -559454, -550384, -570020, -578783, -595702, -630852, -643036, -587421, -593339, -566464, -520930, -525712, -491577, -540936, -616515, -638983, -607158, -574544, -571629, -596485, -617961, -631956, -617834, -636936, -663162, -649524, -634789, -603933, -580328, -680047, -669484, -633436, -605401, -552217, -548104, -579135, -562707, -524169, -502177, -484354, -480132, -503546, -512877, -548612, -585820, -570625, -587646, -611728]
11699f11728J6444m3009r558L3305l6094l981O5320k4422m8216J7596O2079O0551
11687e21713K9841N542J4894l8919o6410j7754L2J5422j7545k5446M8986L7150
11675e35920k7660l3743o0033r515L6100Q501j0276J188J7522L2651j1784M2517
11663e50452L5685j709m4801O368N140N642j4999M7M4375o1292n0862L0456K901
11650e93501K5565L9904J5223j0696n6494R505n271k9311M4814K5974L7998R623
11638d86667K1082j5749l48P169l3506m406N1098k6048m0472M1075k1064M847
11626e02989m1483j6378L2220j443L169m545n0240l6382M4571Q9689l9086l3273
11614e56170m2890J7161J9530m368j8770l2204J3998K7952l582r120l5849l6361
$$ y = [-611728, -595284, -638293, -647851, -614546, -650640, -654621, -589301, -613723, -661939, -644343, -582264, -521713, -491872, -486330, -471436, -510355, -576765, -594519, -594487, -579065, -596610, -622056, -573070, -535920, -563580, -597323, -657356, -666871, -630771, -622270, -632546, -631358, -613836, -581185, -592969, -550452, -514767, -516476, -561277, -554909, -549769, -544127, -559126, -559079, -514704, -575996, -626858, -596402, -593501, -567936, -528032, -512809, -523505, -579999, -570494, -575765, -605076, -560262, -534288, -496290, -486667, -465585, -481334, -481682, -474513, -508019, -512425, -461327, -487375, -527847, -486772, -507836, -502989, -544472, -560850, -528630, -530073, -526904, -531449, -581689, -618071, -573500, -483811, -522897, -556170, -599060, -581899, -562369, -566737, -585507, -617711, -603713, -575761, -579343, -588463, -624312, -660673]
11602f60673L8936L4345J4310j9803m8585j7319N0777K0475k073k5810O4838O5075
11590d85507n927o3158j2031K5535j3142j5989Q100O5505R514j2804L001k8224
11578e25127m0667K3532M2499n9084j5668k3955M310j2747M9399k0217N2433L5229
11566d90063l3951m4711l8788k868O4040j0145J3919j7403o3286j2575Q158K9169
11554e98504k0826j0412p25K2180j436k1185l5615L4825N7707j7348M52J7130
11542e73757J2167L6838k2929l770n166k8139k3911k848k837N7057J769p2724
11530f28250k9940O483N1401L080m388L9280J7537M4222r382n391q192k8871K9717
11517e22694M5295n851l2933l6281n9436K79O1773L6305J5454j1716k9333L3420
$$ y = [-660673, -621737, -587392, -573082, -592885, -641470, -658789, -608012, -587537, -589610, -615420, -550582, -485507, -491434, -554592, -566623, -541088, -554230, -570219, -562119, -496614, -487100, -499904, -496903, -525127, -565794, -542262, -499763, -558847, -574515, -598470, -594160, -606907, -557508, -577725, -525292, -490063, -524014, -568725, -607513, -610381, -546341, -556486, -542567, -559970, -623256, -635831, -627673, -598504, -619330, -629742, -630467, -608287, -609723, -630908, -666523, -631698, -573991, -591339, -590887, -573757, -561590, -524752, -547681, -551451, -556617, -584756, -608667, -611515, -614352, -557295, -555526, -628250, -658190, -651707, -600306, -597226, -601614, -562334, -544797, -500575, -509957, -515348, -523540, -552411, -522694, -477399, -483250, -516183, -552464, -611900, -611621, -549848, -513543, -498089, -509805, -539138, -505718]
11505e05718J1265J4846J0308l8152K1725O7169k259m044j4679l9067k2351m4598
11493e45555m113k0114M5742M9218Q000j4481j110k4481k5226j4272n08K7103
11481e19797J7879l1248J9355l144j7216j5042l42j380M371L745l6916P9M7707
11468e31949K8496j1930o7447L2440K8063l2428m0532Q581J15239O578o0784l3372
11456e59045M8232L1867L044j8092l9216k3102k9396J5455M7937O86j8012p090
11444e46732m199L3020K0895m8467k2753J4800N9N3446J8883k9074n1506L8962
11432e22666O4182L242k6364j7684K3543L2705p2941o569K1172n8407j7624j3337
11420e90748k218O106L5327N0472m097j0182j5552k7658L8261L812l9826R890
$$ y = [-505718, -494453, -479607, -469299, -507451, -485726, -418557, -420816, -424860, -439539, -478606, -500957, -545555, -549668, -569782, -524040, -474822, -466822, -481303, -482413, -506894, -532120, -546392, -546900, -519797, -501918, -533166, -513811, -516955, -534171, -549213, -549555, -550935, -546564, -542819, -579735, -579656, -531949, -503453, -515383, -582830, -550390, -522327, -554755, -595287, -586706, -471467, -464889, -525673, -559045, -510813, -478946, -475902, -493994, -533210, -556312, -585708, -570253, -522316, -521630, -539642, -546732, -550931, -517911, -497016, -545483, -568236, -553436, -553377, -499931, -481048, -510122, -561628, -522666, -458484, -455242, -481606, -499290, -475747, -443042, -515983, -522552, -501380, -559787, -577411, -590748, -592966, -586860, -551533, -501061, -505158, -515340, -530892, -558550, -520289, -516477, -556303, -546413]
11408e46413L7119J7420K0705L7524k8697m1879j6883m3124J9622M1672n5021
11397e57955K1405r57J2386L4055k0096j1950P2630k9753n2298k2867L1962J2492
11385e10946P066O653K3892o789K2383l1395l1923n1772J4834N3409o5950j2230
11373e82768L4298M1920K2353L5602k2419j0645Q68n2160J4128J9635J0182L4320
11361d54686p0942j8646M3435j7221J782k7299K1397L2829j2641n9538J9857j3774
11349e55447k0344j5341L2658P7726L9555r386j419K5224j1486k2910k5370o626
11337d93166j6221l7148N0504L3313k4559J6792k330k1585M0170O328K2849l8535
11325d63588K2081k2595l8973M3566O8879k0067q9945j1722J020n0294j2971r793
$$ y = [-546413, -509294, -491874, -471169, -433645, -462342, -504221, -521104, -564228, -544606, -502934, -557955, -536550, -537507, -525121, -491066, -511162, -523112, -450482, -480235, -532533, -555400, -523438, -510946, -503880, -497227, -473335, -480124, -457741, -489136, -521059, -572831, -557997, -504588, -570538, -582768, -548470, -506550, -484197, -448595, -471014, -481659, -480791, -532951, -518823, -499188, -489006, -454686, -525628, -544274, -500839, -518060, -516278, -543577, -522180, -489351, -501992, -561530, -541673, -555447, -575791, -591132, -558474, -480748, -441193, -450579, -451998, -426774, -438260, -461170, -486540, -493166, -509387, -546535, -496031, -462718, -487277, -470485, -472815, -494400, -454230, -447902, -425053, -463588, -441507, -464102, -503075, -459509, -390630, -410697, -500642, -512364, -511344, -561638, -574609, -584402]
11313e84402l2764p213j1110J08532Q8083o8703k6051K9632N1718j5551r337M9429
11301d27737l8179M62j8114k6708Q7252j1173m1461M4867l6469k6205j7601L783
11289e07283M7294J3816k0025n3180j7506L1609o145j8720M9969K7683q049L2804
11277d27733k4588m0970K3303N1363J2432m0040n0704J8968Q7525M0193m4833
11266c95084o2309k6447l3473m1257N486M6833N5236J7823L0103K4011m5580k0719
11254d45377o793n2593l8935K924L5617M9192j9603J1033M2789K4837m1181k0564
11242d58654L0252L478L1568r61k1034j2929L4993l3198n4276K019K7454j353
11230d52641K5790J6360m2493n4985M6202J267K0051M9037P1457p782o0676q2327
$$ y = [-584402, -617166, -624379, -635489, -526957, -438874, -507577, -533628, -503996, -452278, -467829, -477166, -427737, -465916, -465454, -483568, -510276, -423024, -434197, -475658, -430791, -467260, -493465, -511066, -507283, -459989, -446173, -466198, -519378, -536884, -505275, -511420, -530140, -480171, -452488, -460537, -427733, -452321, -493291, -469988, -418625, -406193, -446233, -496937, -477969, -390444, -350251, -395084, -457393, -483840, -517313, -558570, -553084, -506251, -451015, -433192, -403089, -379078, -424658, -445377, -452170, -504763, -543698, -540774, -505157, -455965, -475568, -464535, -421746, -396909, -438090, -458654, -428402, -424924, -393356, -394317, -415351, -428280, -393287, -426485, -480761, -478742, -451288, -452641, -426851, -410491, -452984, -507969, -461767, -460500, -440449, -391412, -319955, -327737, -388413, -470740]
11218d70740l9223N7156M6736l0951K6428q013J1365K0704J4287j5720k6651j2949
11206d27571K8298J9340J0120j3208n2948l6843m9090m0719M0176J3580O0582
11195d48283K6365m3538j9322M8594K5573l1470m5151J0207j1985j118j1390K4958
11183d76560n673K5216n75M288J9658J8286L567L2946J5032m6082l7180j8927
11171d66004P133M6641N4193L7011L0820o6266k9314k6542Q262m385k5949K9417
11159d04983j9963Q912M9379l8172J811L2248n4641k7622l7881j4743n3364J0104
11147e48915P1557q490K7391N7555K1551K5854l7978k0631j0030k0103p97k4030
11135d67066n347P24j2022K7993r058L1390n982m2469k4700j6880j084L7596K2632
$$ y = [-470740, -509963, -452807, -406071, -437022, -410594, -418607, -407242, -386538, -372251, -387971, -414622, -427571, -399273, -379933, -369813, -383021, -435969, -472812, -521902, -562621, -522445, -508865, -448283, -421918, -465456, -484778, -436184, -410611, -442081, -487232, -477025, -489010, -490128, -501518, -476560, -482233, -457017, -457592, -453304, -433646, -415360, -411793, -378847, -363815, -409897, -447077, -466004, -458871, -412230, -358037, -321026, -290206, -356472, -385786, -412328, -404066, -408451, -434400, -404983, -424946, -416034, -366655, -404827, -403016, -370768, -425409, -453031, -490912, -505655, -559019, -548915, -477358, -485848, -458457, -400902, -379351, -353497, -391475, -412106, -422136, -442239, -443036, -467066, -472413, -471689, -483711, -455718, -464776, -433386, -439368, -481837, -506537, -523417, -524501, -486905, -464273]
11122d64273K5042k2222j256k4626p457N1090J8929n6064p9710O9289M1641Q42
11110d48775Q624j8150k7147J0152J0753Q7103l3845m4249K3707j8336o117n5061
11098e11341l4964O4148O4015K6554j886J4016N3791j00640o8936q893L5965O072
11086d62099m393J6910J1608J3741j0106L629J7906K806L8286l971l5899J512
11074d10070j3570o2166m8292O6566M4587J3454K8029J9624l8723p7239n2407
11063e30207K6000P0710N9182p2553m155M3818j2976k1185M4754M3895l6297k1029
11051d10043k2337j0376k0822M7706k2941k6073O3729J9144j5896K6837q70p89
11039c72731O8710j5893j2049m2864L2226n178j8548K7718K865k1211p240l810
$$ y = [-464273, -439231, -461453, -462709, -487335, -494792, -443702, -424773, -480837, -560547, -491258, -449617, -448775, -440151, -458301, -485448, -475296, -464543, -377440, -411285, -455534, -431827, -450163, -456280, -511341, -546305, -482157, -418142, -391588, -393474, -379458, -325667, -426307, -495243, -504136, -468171, -462099, -466492, -449582, -437974, -424233, -434339, -430710, -412804, -409998, -371712, -375683, -411582, -410070, -423640, -485806, -534098, -467532, -422945, -409491, -381462, -361838, -400561, -477800, -530207, -504207, -433497, -374315, -446868, -451023, -407205, -420181, -441366, -396612, -352717, -389014, -410043, -432380, -442756, -463578, -415872, -438813, -464886, -401157, -382013, -397909, -371072, -371942, -372731, -304021, -319914, -331963, -374827, -342601, -347779, -366327, -338609, -335744, -356955, -364195, -368005]
11027c68005p2277j0121N1642J2414J2715j2766r500m5965J9843L3783J0504j8677
11015c96410k401k2684M0363l2260m0298m0038J7381M4447O7958K781r0932j4513
11003d66606N473j7644K1402J3042j0871r056O3008n061n309L2565p485K7780
10991c58762j6437l8369k4816q331J9662K70N3236M3375l3415o03o7324K7133
10979d04381J8671K4258M4079m7582l8076K5258K0343J2174k7839m3719l098M1719
10967c78193P584L0821J002l3990N6383K2752l6176o5758K4874M799l565N0960
10955c18507J2190M4781n0240m1613k0417l4197k2512k0650l0787L3605Q966l668
10943d43049J7699N4818N0459J972m2579L301L0070l1341m2220K374J5198K0960
$$ y = [-368005, -440282, -450403, -398761, -386347, -373632, -386398, -395898, -441863, -422020, -388237, -377733, -396410, -398811, -421495, -381132, -413392, -453690, -493728, -476347, -431900, -363942, -361161, -452093, -466606, -461133, -478777, -457375, -444333, -455204, -464260, -401252, -406313, -411622, -379057, -386542, -358762, -375199, -413568, -438384, -446715, -427053, -426783, -373547, -330172, -363587, -364190, -431514, -404381, -385710, -361452, -317373, -364955, -403031, -377773, -357430, -345256, -373095, -416814, -419912, -378193, -370609, -339788, -338786, -372776, -316393, -293641, -329817, -395575, -370701, -365902, -369467, -318507, -306317, -261536, -311776, -353389, -373806, -408003, -430515, -451165, -481952, -448347, -439381, -443049, -425350, -370532, -320073, -318101, -360680, -357379, -327309, -358650, -400870, -398496, -383298, -362338]
10931c62338K3110L399K9114J0311N5787p9634n0339J6182K6718k697K338o0948
10919c88997n0956K5744K4526k088L941J6388P538p695j7579k596m320k527l4820
10906d33441K7127K9227n582N70K8299N2779O6033l8224l9430K860j128j8009
10894c28919m2831n385o668Q3001J5357n1712R214M4642n526p0140j5032J1259
10882c62740N7104J5085l3223l7814j1884J6775N3093M3950m3593q454K0950l820
10870b94571K3885J6051L1633j5769m8280j2686P958l4710m9899j3622j7817J4076
10858c93751O85K4088O2963Q4076R126k6206p5065o357N2799L1143q939l7046
10846b82484n0441M2248J836K9715m654k6409J0459L5153J602L2589p831o0754
$$ y = [-362338, -339228, -335829, -306715, -296404, -240617, -320251, -370590, -354408, -327690, -330387, -328049, -388997, -439953, -414209, -389683, -391771, -387830, -371442, -363904, -371599, -389178, -391774, -396094, -398621, -433441, -406314, -377087, -382669, -382099, -353800, -301021, -234988, -273212, -312642, -309782, -310910, -328919, -371750, -377135, -383803, -300802, -285445, -337157, -327943, -283301, -288827, -358967, -373999, -362740, -305636, -290551, -323774, -361588, -373472, -356697, -303604, -259654, -303247, -311701, -290751, -294571, -270686, -254635, -223002, -238771, -287051, -299737, -291779, -326489, -376388, -390010, -407827, -393751, -393066, -368978, -306015, -221939, -212813, -239019, -314084, -320441, -267642, -236499, -245438, -282484, -332925, -290677, -288841, -259126, -263780, -290189, -279730, -244577, -242975, -210386, -218217, -278971]
10834b78971L5723J2712j1418j4581q345o4305n2061L1749O3607J1969j8251M0737
10822b51435J8534l2724k7828L4321M9800j214l056q3984l6244J882R056J0392
10810c12500M5750J5537p2263k0532L2215K8601L9750j0320k0989l2175L5951
10799b70975N1381L4772k5165n0034p6419k6342P3621j2529o5407l2681R0542
10788c09236K8779o065o0851l7832K520J0327Q1450M3980M2426J6514m5193M182
10776b28999O9487L2450L9695n2301m3943J2257M2179K2905k3544k0578R6649
10765e3743R6107O7808P5000J9303N2961j1010j6775M7985O0110N2627N3963m894
10753D39442k48027n97300m96555k59176L4190J14487K3886M0484O9216J7005
$$ y = [-278971, -243248, -230536, -241954, -256535, -264880, -329185, -381246, -349497, -285890, -273921, -292172, -251435, -232901, -265625, -293453, -259132, -209332, -210546, -213602, -297586, -333830, -331948, -322892, -312500, -266750, -251213, -323476, -344008, -311793, -283192, -243442, -253762, -274751, -306926, -270975, -219594, -184822, -209987, -260021, -336440, -362782, -289161, -301690, -367097, -399778, -309236, -280457, -286522, -347373, -385205, -382685, -372358, -290908, -246928, -204502, -187988, -233181, -228999, -159512, -127062, -87367, -139668, -183611, -171354, -129175, -106270, -129814, -150392, -53743, 42364, 110172, 185172, 204475, 257436, 246426, 229651, 277636, 337746, 390373, 444336, 439442, 191415, -405885, -902440, -1161616, -1127426, -1012939, -989053, -948569, -879353, -862348]
10743h62348N3480R9006M4704J8775N9601j335o436L5958P631j346j2716M109
10731e60917L6315O840K1294p53k9508K1870J2185L7309N4225L2588K0686K0681
10719c27185p5785k1115P927N44K6665j7548O761l4533L0377O0050r165j2977
10707c65984j1868k887k2411m0255J6143M5525M0992M6633k7985p0289k6505K2608
10695c96283M2371J3205p084l8928J7317k9789l0296K0718J0632j8295l6146K7487
10683d25091j4166N168N0911L0330K9551k2211l3734J1891o145J7767l9275Q187
10671c86817l082n1192L993R959J6358M4674M7576j2549P920M5130q671K8314
10659b58387n3271j09673J9330J4178J5620M7194l5033P89M2945L99p2466o7450
$$ y = [-862348, -808868, -709862, -665158, -646383, -586782, -588117, -594553, -558595, -550964, -552310, -565026, -560917, -524602, -517762, -496468, -497221, -526729, -504859, -492674, -455365, -401140, -368552, -347866, -327185, -402970, -424085, -416158, -415614, -388949, -406497, -399736, -434269, -403892, -343842, -353007, -365984, -377852, -380739, -403150, -443405, -427262, -381737, -340745, -294112, -322097, -392386, -418891, -396283, -353912, -340707, -347791, -386719, -369402, -399191, -429487, -408769, -398137, -416432, -452578, -425091, -439257, -434089, -383178, -352848, -323297, -345508, -379242, -367351, -373496, -355729, -395004, -386817, -389899, -441091, -437098, -427139, -410781, -366107, -318531, -331080, -323160, -278030, -286701, -258387, -311658, -421331, -402001, -387823, -372203, -325009, -360042, -359253, -316308, -315909, -388375, -455825]
10647d55825M8133K6164m599n4221J4304j5891M5202K6073k6860o0401K6060L3028
10635c98833j9253k8023L0967K4846k3635k6964k6649O0151K2085n3757j6807
10624d55872J8505O9017J0872l0730J6133q982M9500M9151L5511p846n285k8210
10612b88236p2750k0037p303Q202k2917j7720m2871k3105Q2799N0579j834N51
10600c54642n80l0599P3821m1661l6111p623k893k9260O340K1332j3121Q4258
10588c30739N7871r9146L580l1115K891J07698O993r4486k3399Q354M6302J2178
10576c33018j8530q27K1050N237m980j7720j4016J120N4668m070L8747J8169j1653
10563b65823j9415n7877k1181O0520j7030K3523k7651n6196L0561Q558k5958j1807
$$ y = [-455825, -407692, -381528, -386127, -440348, -426044, -441935, -396733, -370660, -397520, -457921, -431861, -398833, -418086, -446109, -415142, -390296, -413931, -440895, -467544, -407393, -385308, -439065, -455872, -437367, -368350, -357478, -388208, -372075, -381057, -331557, -282406, -246895, -254741, -260026, -288236, -360986, -381023, -388326, -380124, -403041, -420761, -463632, -486737, -403938, -353359, -355193, -354642, -355222, -385821, -312000, -353661, -389772, -397395, -400288, -429548, -423208, -401876, -414997, -330739, -272868, -372014, -368434, -399549, -396658, -288960, -281967, -376453, -399852, -391498, -345196, -333018, -351548, -352375, -331325, -326088, -331068, -348788, -362804, -361684, -307016, -311086, -272339, -254170, -265823, -285238, -343115, -364296, -303776, -320806, -297283, -324934, -381130, -350569, -342011, -367969, -379776]
10551c79776N7247K7632j3501l4181k7304j7924N4886O4786l3658q10M1046j7217
10539b78774n5760L207N0927Q37n8926L1298K653k7144j0346k99L4307J5391l9194
10526c31823j8613m0038M797M8515j6168L8219M5579N4514J1882m4168p9351j3173
10514c39828L4608l0376J703M9949J0375K9096j00237l5093L086K3047j259m1548
10502c96477j6262n9099O2770L9032m0889j3730L7652J9761N9072L1856O6070
10491b10244j1915n3000J9419l6983l8845k7968k2593P3871M1538Q706p8943j2082
10479c49039J2805J590L0341k352L4141M5826k5798P57J8249n1602p3689O4456
10467b94315O4855n4375l1386M3201K0110N0807j7166J9839n9432j9521K5159
$$ y = [-379776, -322529, -294897, -308398, -342579, -369883, -387807, -332921, -268135, -301793, -302603, -261557, -278774, -334534, -331327, -280400, -279563, -338489, -307191, -304538, -331682, -342028, -342327, -308020, -292629, -331823, -350436, -390474, -385677, -337162, -353330, -315111, -269532, -215018, -203136, -247304, -326655, -339828, -305220, -335596, -333893, -283944, -273569, -244473, -344710, -379803, -376717, -353670, -354929, -396477, -412739, -471838, -409068, -370036, -410925, -424655, -387003, -367242, -308170, -276314, -210244, -222159, -275159, -255740, -292723, -331568, -359536, -382129, -308258, -266720, -258014, -336957, -349039, -336234, -334644, -304303, -306655, -272514, -226688, -252486, -251729, -233480, -285082, -358771, -294315, -229460, -283835, -315221, -272020, -251910, -201103, -218269, -198430, -257862, -277383, -252224]
10456b52224L409j3947l7063R109R006j7262l2292N1145O066k8582k4563K3909
10444c03289J6433J0311o470L4657l0982n7162l459M1262N3277N1081J5684k4785
10432b03442l6415k0400n2843q488N4629J1727J2942j9079K341M8746L7075l5335
10420b08542r717J7288m9177j2036k1559l3183j0002J0443J04096M8451l7343
10409b01281k8588k4195k7046k3817J2034J7942k913j1715L4720l2041k6793M645
10397c09048l4416M2179L3118L8600J7462l8023j9462L3071j6474l4130P506N8085
10385b21532l664k4713m5448j3942Q130K6137j5366K2648p055k215L6720j2891
10373b53191n3090j3790j1612J0921L6632P3268K7131k9432q7844M2554q97k800
$$ y = [-252224, -248815, -262762, -299825, -290716, -281710, -298972, -331264, -280119, -274053, -302635, -327198, -303289, -286856, -276545, -283015, -248358, -279340, -336502, -339961, -298699, -245422, -194341, -178657, -203442, -239857, -260257, -313100, -321588, -266959, -255232, -242290, -261369, -259028, -210282, -173207, -208542, -218259, -200971, -250148, -262184, -283743, -316926, -326928, -316485, -212389, -163938, -201281, -229869, -254064, -281110, -304927, -292893, -274951, -277864, -289579, -254859, -286900, -313693, -309048, -343464, -301285, -268167, -229567, -212105, -250128, -269590, -236519, -252993, -287123, -279617, -221532, -225196, -249909, -295357, -309299, -301169, -275032, -290398, -267750, -274805, -277020, -240300, -253191, -306281, -320071, -331683, -320762, -284130, -210862, -183731, -213163, -301007, -258453, -259350, -262150]
10361b62150L3456k5263L2679N5860q358q671m462n1264m7957K3507J3376M005
10349b45242J6562M1198L204m645M4459o4820k8341l3614m7572p1227J3187J4839
10337c62012Q068Q8163L3352l7416o2051n030l3755n7217N6295N0223K6016M1799
10325b53565l1029K9230N4549O856K5063L3366j9009j4027l9765q3603k6800O671
10313c12063L8104l1841J2293j3351j1260K0584N9803L0917l0168l0426o932r15
10301b75255k9196P3138R4613k420l2510k5385J3111m5902l4359j2010J4474k308
10289b64009L2698k119l0746M9402K7790k9616l0284N955J7905N2744m374l7786
10277b12440m149P50j7632m3470P482L9283j1195k8982K1695K7833J2360j8329
$$ y = [-262150, -228694, -253957, -221278, -165418, -173776, -182447, -186909, -238173, -286130, -262623, -249247, -245242, -228680, -187482, -184278, -188923, -144464, -209284, -237625, -271239, -318811, -390038, -376851, -362012, -353944, -265781, -232429, -269845, -331896, -336926, -370681, -427898, -371603, -321380, -295364, -253565, -284594, -255364, -200815, -193959, -168896, -135530, -154539, -168566, -208331, -291934, -318734, -312063, -273959, -305800, -293507, -306858, -318118, -297534, -237731, -206814, -236982, -267408, -274340, -275255, -304451, -231313, -136700, -139120, -171630, -197015, -183904, -229806, -264165, -276175, -261701, -264009, -231311, -233430, -264176, -214774, -186984, -216600, -246884, -240929, -223024, -170280, -174654, -212440, -216589, -215839, -233471, -276941, -269459, -230176, -241371, -270353, -248658, -220825, -208465, -226794]
10265b26794l6260J9233J0865Q992r084n3223m9106L9045N4138J4426M274N319
10253b18175m3952l8577k6319m9541k3785L0709M2120J6165L7305J5219n4434
10242c13265n163J90N9381L3943Q8405n7779n3828l3096j8282O6325j824O903
10230b28090j5716K2085L4674Q354k6809M5823J5403o7625m475N5181o3625k7413
10218b52233N1866L5892j8881j6889K5979m009L380N6146p656J1291l4589k565
10206a52268j9354j6277k5342J3221K203J270K8635M8243J0320J2527o301o6200
10194a69323j4866Q929K4110L5209l5886q5133j5809n6298j2145P5589K4237j4054
10182b35440o054J7848J4839J9285K2323o8596r8295R06L400l855M6154K1893
$$ y = [-226794, -263054, -243821, -232956, -223964, -233048, -286271, -335377, -296332, -242194, -227768, -223494, -218175, -262127, -300704, -327023, -376564, -400349, -369640, -327520, -311355, -274050, -258831, -313265, -318428, -318238, -258857, -224914, -136509, -194288, -248116, -281212, -299494, -233169, -234993, -228090, -243806, -221721, -187047, -178693, -205502, -159679, -144276, -211901, -216376, -161195, -224820, -252233, -200367, -164475, -183356, -200245, -174266, -178275, -174895, -118749, -126405, -115114, -149703, -152268, -171622, -187899, -213241, -200020, -197817, -196547, -167912, -119669, -109349, -96822, -103123, -169323, -184189, -175260, -151150, -115941, -151827, -236960, -252769, -309067, -321212, -245623, -221386, -235440, -241494, -223646, -208807, -189522, -167199, -235795, -334090, -333184, -329784, -333639, -287485, -265592]
10170b65592M1526k50J7202j4627Q13j0655K3556N9158k1847j1685K8986N5426
10158i7989O361l6135p318m0172l4678N558k3248N9856P169l1568J0724r460L7070
10145a53830P9733K2949r451l5436j1036l8187j6518k8692j2313j2245k5925J2856
10133b28095O3199R1128m1294p9724l7074P0223J4784l4539J3030K0022m2331
10122a90671k0476J8237K8356P5549o300j16636j21855N3340O3249k7964J9454
10111b25717L498L6766L6626o875j5622K135M4503L6998l2009n1018J1466P0968
10099h8281J7012J352k6587k3862j2729L7795J2599K2310J2717l4269l2401m5718
10087a60062K5600k3360o7358o1582m7575J2067M2193R5207L3429j2582M7444
$$ y = [-265592, -224066, -224316, -207114, -221741, -220928, -231583, -208027, -148869, -170716, -182401, -153415, -97989, -91628, -127763, -135081, -175253, -209931, -204373, -227621, -167765, -160596, -192164, -181440, -190900, -153830, -74097, -51148, -60599, -96035, -107071, -145258, -161776, -190468, -202781, -215026, -240951, -228095, -164896, -73768, -115062, -194786, -231860, -161637, -146853, -181392, -168362, -148340, -190671, -211147, -192910, -164554, -89005, -95305, -211941, -333796, -280456, -217207, -245171, -225717, -222219, -185453, -148827, -155702, -171324, -169189, -124686, -87688, -119697, -170715, -159249, -88281, -71269, -69917, -96504, -120366, -133095, -95300, -82701, -60391, -47674, -81943, -114344, -160062, -134462, -157822, -225180, -286762, -334337, -322270, -280077, -184870, -151441, -164023, -116579]
10076a16579r374j3185k1847n0132M9874K5709O958L5738M4400m6135p2010k614
10064a69197P0598J4644R170q6819K3041M3236j3735l0338o0654k6717N4301N0021
10052a22449j9883l8464j0106j1584k2271j4653q730N581j0381N7796M4703R851
10040a40590p47J7261j8873l2955j9987K6605R347m793M7509l1389l341O069j142
10027a47026L197L081j7049o4481j324K9682M1025n249k3940O6443k6722j288
10015a43651M0308n473J3958N3852k6310j4107n7467n3443n9796O281J8838M3171
10003a83839J4109o4236M6795R6701M8261l6387r062k051j1740M019o0427j7196
9991a75053p78j338L3265j2924o6462r314K3341N4971O6338l6166l7823k7472
$$ y = [-116579, -125953, -139138, -160985, -211117, -161243, -135534, -128576, -92838, -48438, -94573, -166583, -169197, -98599, -83955, -74785, -161604, -138563, -95327, -109062, -139400, -200054, -226771, -172470, -122449, -142332, -180796, -190902, -202486, -224757, -239410, -248140, -242559, -252940, -195144, -150441, -140590, -141337, -124076, -142949, -175904, -195891, -169286, -159939, -164732, -117223, -148612, -151953, -145884, -147026, -143829, -140748, -157797, -222278, -223602, -193920, -152895, -158144, -182084, -115641, -142363, -143651, -103343, -108816, -94858, -41006, -67316, -81423, -138890, -192333, -252129, -245848, -227010, -183839, -169730, -233966, -187171, -90470, -42209, -78596, -87658, -89709, -101449, -97430, -157857, -175053, -175831, -177169, -143904, -156828, -223290, -232604, -209263, -154292, -87954, -124120, -161943, -189415]
9979a89415K3480N7772m4885K7079K9304O0152M8892k5720o7331l2370N4651K0490
9967c7901q4657p5604j9019Q510P2685K2470k762L8633J4685o6388m6972j4719
9955a91039j8389M0156P0640O5655K2624J7742J4234l6235j8264J9882L5836k8500
9943e658q2002o3411k6012L9108J5764k8680o5530j847Q1618O3919j8455k2246
9931a13432k017n6408q646L0111K4581K0661K9833L4387M2168j2953r2146o0836
9919a64697l6613K3661N8366N3564k0930q7424l0683j611r29r578N4882K1028
9907a40964j5264M3681p531m2666K562M0141Q2310L8414M625j4997k4673r7274
9895a31636m2584L7626M2433M64L128J1937N463M07j258m0296Q6493Q606o9820
$$ y = [-189415, -165935, -108163, -153048, -125969, -96665, -36513, 12379, -13341, -80672, -113042, -58391, -37901, -122558, -198162, -217181, -208671, -135986, -113516, -116278, -77645, -62960, -129348, -176320, -191039, -209428, -169272, -98632, -32977, -10353, 7389, 21623, -14612, -32876, -12994, 22842, -5658, -87660, -151071, -177083, -137975, -122211, -150891, -216421, -218268, -136650, -72731, -91186, -113432, -115449, -171857, -180503, -150392, -125811, -105150, -75317, -40930, 1238, -11715, -103861, -164697, -201310, -177649, -119283, -65719, -86649, -174073, -204756, -206367, -207296, -216874, -161992, -140964, -156228, -112547, -120078, -162744, -160182, -120041, -37731, 683, 5308, -9689, -34362, -131636, -174220, -136594, -94161, -93697, -90569, -78632, -73169, -72762, -74020, -114316, -27823, -19217, -89037]
9882h9037l6957k0792K3100J8932J1166M0482M397O037j0344n8389J2402J7816
9870h1187J6251Q07k9326j7721j4137j1638q074O8468L0591o3170L4389J215m2322
9857a15854j5563N953l102K6169J0773l9482P347N599J0706k2287R906J0551r905
9844a19189l8675J6985R2573Q8530J2013p8235k1699N5206o5030n4811j7918m0186
9832a70436L7108m195O2818j026k7629J8340k4300O492O5844j973n9452n794k2395
9819a26598j3847K2694J1518O1394K1963M6265m055J9270j5286k3331J5581K877
9807A8445L046J1909k0970q575k9585K1859Q0p7783o4934l274m5267M5613Q4362
9794f5074O9676J7600j0466k0095J6391J1334l3570O81J6544n2963m2820N983
$$ y = [-89037, -125994, -146786, -123686, -104754, -93588, -53106, -48709, -42672, -53016, -111405, -99003, -81187, -64936, -64129, -93455, -111176, -125313, -136951, -145025, -76557, -45966, -109136, -74747, -73532, -115854, -131417, -125464, -128566, -102397, -91624, -131106, -123759, -118160, -107454, -129741, -119835, -109284, -119189, -157864, -140879, -48306, 40224, 52237, -25998, -47697, 7509, -57521, -112332, -130250, -170436, -133328, -137523, -74705, -75731, -103360, -85020, -109320, -102828, -36984, -38957, -98409, -104203, -126598, -140445, -117751, -106233, -44839, -22876, 23389, 19334, 38604, 23318, -13, 15568, 18445, 21491, 33400, 12430, 3855, -25730, -3871, -3791, -81574, -146508, -149782, -195049, -149436, -65074, 4602, 22202, 11736, -8359, 8032, 19366, -14204, -13523, 3021, -49942, -92762, -86779]
9782h6779p943O8264M9407L6604O3041k7250p9053l8262j2551m681N404M6199
9770A2400K3850k6534l6463J1497R526j2046K7809j8447m0180J0728M3567j8925
9758a3218q517r149J5514K6893K4913o04K0205m0476j9267L1000m1310k0737L3092
9745a661N4886L790k4982N379k7444N975k249j225M0700O9268l5328K5441k29
9732A12321N8147K6515n0181j07843o1745N4366J00622N8719l1362J3763J287
9721A74609o621J3209m4510P578K9937l8673j02367k9355R80j2951J1190K7700
9709C0726j9805K609M5959j0026l5683M60j5514l4410J7453R7128N2174N3353
9697A84424K0722k6514p3582q8090n3623j0381j0451J7254O4624L0920N206J5050
$$ y = [-86779, -94722, -26458, 22949, 59553, 122594, 95344, 16291, -21971, -34522, -39203, -33799, 12400, 36250, 9716, -26747, -15250, -5724, -17770, 10039, -8408, -48588, -37860, 5707, -13218, -21735, -30884, -15370, 11523, 36436, 35832, 56037, 15561, -3706, 27294, -14016, -34753, -1661, 53225, 57015, 32033, 37412, 9968, 15943, 13694, 12469, 53169, 122437, 87109, 112550, 112321, 170468, 196983, 146802, 38959, -22786, 31580, 132202, 190921, 159559, 173322, 174609, 167988, 181197, 136687, 144265, 174202, 135529, 33162, 3807, 4787, -8164, 3026, 30726, 10921, 13530, 59489, 49463, 13780, 14240, -1274, -35684, -18231, 78897, 131071, 184424, 205146, 178632, 105050, 16960, -36663, -47044, -57495, -40241, 24383, 55303, 60509, 75559]
9685G5559L5489r099m9048n0351P4359K6584r285p715p0157J8251J612M5649J1284
9672I3132J6628p1625K9205L1421j5544K2022j8951n8359K7551P2189K5324m9408
9660A03585n9543K6909J5853k8090J5781K6602l2287j4817J5249N1075Q896J4936
9648A44149M5212J5607n951j4948k7935k2966k141M3274K0122N709k255M2546
9636B40423k8648q1759k5266N4082M7763n3648n8945K894j8491n5538l9493l9185
9624e5811J110O8383P0036J213k0229J2119P0288K1901k5569L3186M5240p5542
9612A46325q8186k0573P7983J4856J0046P2167K9125N345k7412l6562K8789L1191
9600B43094J1404Q522K7988Q900n0589l305n875j1114L872j1939k943J887P7063
$$ y = [75559, 111048, 101949, 52901, 2550, 76909, 103493, 94208, 86493, 16336, 34587, 36199, 81848, 93132, 109760, 38135, 67340, 98761, 83217, 105239, 86288, 27929, 55480, 127669, 152993, 103585, 44042, 70951, 86804, 58714, 74495, 101097, 68810, 53993, 69242, 120317, 129213, 144149, 189361, 204968, 199017, 184069, 156134, 133168, 131027, 174301, 194423, 200132, 197877, 240423, 211775, 130016, 104750, 158832, 206595, 152947, 94002, 96896, 78405, 22867, -16626, -55811, -54701, 13682, 83718, 84931, 64702, 76821, 147109, 169010, 143441, 176627, 221867, 146325, 58139, 37566, 115549, 130405, 140451, 212618, 241743, 247088, 219676, 183114, 211903, 243094, 254498, 263020, 291008, 299908, 249319, 246014, 240139, 229025, 232897, 220958, 218015, 219902, 296965]
9587B96965n402p2414p548J5358m9487l003N3187J3019j9611L846n0746q0316
9575I3848J541P6050P9524M2094k4552M5621N7650m3198n5063O917k2683j5709
9563B42040m6557l8578J0136J1805J9698k4149P534N4669O4940j1395j9286k3794
9551B47063K0906Q3175O3606j694m325m773P106r618j19168j13496r8954m7494
9539B2334Q738K7172K3919R3656N3306m7056o6147o3466o240J5973N3791Q5443
9527B01423n92m0058l6659K8282K8875k3582r699J8511j8985n9004L187K5948
9515A17647p9742J364O7555l2551Q206M1925L2572J4967l3993M9683J6453m3579
9503A60507K0902K7255j0057o8360o520M3377K7200K1167o4170l2899O9597K2437
$$ y = [296965, 291563, 219149, 211601, 226959, 177472, 174469, 227656, 240675, 221064, 224910, 174164, 93848, 95389, 171439, 250963, 293057, 268505, 314126, 371776, 328578, 273515, 280432, 257749, 242040, 195483, 156905, 167041, 178846, 198544, 174395, 181929, 236598, 301538, 290143, 270857, 247063, 267969, 351144, 414750, 413056, 408731, 403958, 411064, 401446, 282278, 168782, 69828, 22334, 31072, 58244, 82163, 175819, 229125, 182069, 115922, 52456, 46216, 62189, 115980, 201423, 200831, 160773, 124114, 152396, 181271, 157689, 147990, 166501, 147516, 88512, 91699, 117647, 37905, 39269, 106824, 74273, 82479, 124404, 156976, 171943, 137950, 187633, 204086, 160507, 181409, 208664, 198607, 130247, 123727, 167104, 194304, 215471, 151301, 118402, 187999, 210436]
9491B10436K6522K2072K5189j3009J074l7464l500p9222J7331K3408n609K434
9479A89662K4615K1857q095O8257Q2997l5732p1742k6368j6144R259K9747K0770
9467B89083k6997O2464N282n980k9518l5685j1814l206j453J9958L2524J0673
9455C05331n1156p4585j0899l3139N3583Q4265J2652j4637O6100J0897m6740K464
9443C04136K9919J8657L9913k3468n3385n3384o330O3989M5610o680J2186m2563
9431C28600k3989M6690j4573M474K6257r5319K4431N1088M2352J4278m344R216
9419D09161K9581j5158p8993l2342K5385M3795K9993n2556J2139j6162l9250J0326
9407C25919N4638N6705K8340j0940N8676N8552o3212o8136K420K7780P150k1536
$$ y = [210436, 236958, 259030, 284219, 271210, 272284, 234820, 231320, 152098, 169429, 192837, 187228, 189662, 214277, 236134, 228039, 296296, 379293, 343561, 271819, 245451, 229307, 238566, 268313, 289083, 262086, 324550, 329832, 323852, 294334, 258649, 246835, 243629, 242176, 262134, 294658, 305331, 254175, 179590, 168691, 135552, 189135, 273400, 286052, 271415, 337515, 348412, 301672, 304136, 334055, 352712, 392625, 369157, 315772, 262388, 256058, 320047, 365657, 358977, 371163, 328600, 304611, 351301, 336728, 341202, 367459, 272140, 296571, 347659, 390011, 404289, 399945, 409161, 438742, 423584, 344591, 312249, 337634, 381429, 411422, 358866, 371005, 354843, 315593, 325919, 380557, 437262, 465602, 454662, 513338, 571890, 508678, 440542, 442962, 470742, 477892, 456356]
9395D56356K1725N183p5582k0519j9767O093J1248N6574N0206K686J7434j0976
9383E00661J9245N2126m1466k607K3679k0031m7654k5459P0221M8949l4507j6379
9371E26778N1486j8649l4932o083j6870N579L7679K5790P7103L7235j7567m482
9359F63067n5473n694L5810j5571k409J6065o7600J4887Q9489n282L8607l959
9347G01937P537P234p3645K1326k2528L3146L5070N4659j5473o1202l8673k5939
9335F23449J3652j3865O0270K9828q143J9728l2563j9160l5539J4071O2320N7087
9323G71135J373J5542K0885O560l6279m1843O774L8100J1706k5999Q780N7694
9311H34428K326J0414o7717K5942l6349j9050L5981M5132j518k4130P111L0755
$$ y = [456356, 478081, 483264, 407682, 387163, 367396, 373489, 384737, 441311, 491517, 494203, 511637, 500661, 519906, 572032, 530566, 527959, 551638, 531607, 483953, 458494, 528715, 577664, 543157, 526778, 578264, 559615, 524683, 518600, 501730, 507309, 544988, 570778, 647881, 685116, 667549, 663067, 607594, 601900, 637710, 622139, 619730, 635795, 568195, 583082, 672571, 667289, 705896, 701937, 709474, 716708, 643063, 664389, 641861, 675007, 710077, 764736, 749263, 688061, 649388, 623449, 637101, 623236, 683506, 713334, 705191, 724919, 692356, 673196, 637657, 651728, 714048, 771135, 772508, 788050, 808935, 815495, 779216, 737373, 744147, 782247, 793953, 767954, 776734, 834428, 836754, 847168, 779451, 805393, 769044, 749994, 785975, 831107, 829589, 805459, 812570, 843325]
9299H43325Q3572K7967m2289o2026j3167J6637j5012K9320K3626l0630K814K6520
9287H90657o341L9337K6216M6651j4482q5192o032m0535k3189L1842L7887O0217
9275I57036N0787m2656j00043J7399L9633K0167M2946O4268r437M9620J5175m3796
9263A061099M7534R881K0014O0377L4427O665o4044j4009M6547p2978n3782M4783
9251A126514L8664k2285M512L8327j2573n285K6573O9804L7662l4176P787k3572
9239A251952K3488K9691K9639j9744N7980N4394O543q934k606L6282k9082l3299
9227A396304N397M4422M6840J9951J2070k4746j5527l1614K276O1770O9231J731
9215A588105K3757M0471P007J7690Q0753J8778L4777J8333L332q0576l3905M0852
$$ y = [843325, 926897, 954864, 912575, 850549, 837382, 854019, 839007, 868327, 891953, 861323, 864137, 890657, 884316, 923653, 949869, 996520, 982038, 896846, 890814, 850279, 827090, 858932, 896819, 957036, 1007823, 965167, 865124, 882523, 922156, 942323, 985269, 1049537, 1040100, 1089720, 1104895, 1061099, 1108633, 1118514, 1138528, 1198905, 1233332, 1239997, 1175953, 1161944, 1208491, 1135513, 1081731, 1126514, 1165178, 1142893, 1147405, 1185732, 1173159, 1167874, 1194447, 1264251, 1301913, 1267737, 1275524, 1251952, 1275440, 1305131, 1334770, 1315026, 1373006, 1427400, 1433943, 1425009, 1422403, 1458685, 1429603, 1396304, 1401701, 1446123, 1492963, 1512914, 1524984, 1500238, 1484711, 1453097, 1455373, 1517143, 1586374, 1588105, 1611862, 1652333, 1659340, 1677030, 1757783, 1776561, 1811338, 1829671, 1833003, 1752427, 1718522, 1759374]
9203A759374P1041K3534n1715k1249P9459J37045N3777k2408m2474L1475L9075
9192B056934L605j7430M3854O7048J3751l3390K6024R9931L611R172P4313M8772
9180B396195K6993M3435J05532j1567m2469j5634J8507N936P5323L9637N4837
9169B696725j4520O1337M2519L8920N811K1607K5806P688K7445M6885J7642J7872
9157B995737N3597J06550P9287M4013J8443J00546R3940j6994j5818L8154Q4252
9146C581707N9228J02912R1942O6140P1485J08631M0337N6574R5044N5196J17053
9135D446249L9114J08531J22927J10849J34955J27598J69739J69664Q5766P5787
9125E591179J42480J66988J76029J60596J50232J42224J81961J87477J75138K23748
$$ y = [1759374, 1830415, 1853949, 1802234, 1780985, 1860444, 1997489, 2051266, 2028858, 1986384, 2017859, 2056934, 2060539, 2043109, 2086963, 2154011, 2167762, 2134372, 2160396, 2260327, 2263938, 2273110, 2347423, 2396195, 2423188, 2466623, 2572155, 2560588, 2518119, 2502485, 2520992, 2526928, 2602251, 2641888, 2696725, 2682205, 2743542, 2786061, 2824981, 2830792, 2852399, 2878205, 2885893, 2913338, 2960223, 2977865, 2995737, 3049334, 3155884, 3235171, 3279184, 3297627, 3398173, 3492113, 3475119, 3459301, 3497455, 3581707, 3640935, 3743847, 3835789, 3901929, 3973414, 4082045, 4122382, 4178956, 4274000, 4329196, 4446249, 4485363, 4593894, 4716821, 4827670, 4962625, 5090223, 5259962, 5429626, 5515392, 5591179, 5733659, 5900647, 6076676, 6237272, 6387504, 6529728, 6711689, 6899166, 7074304, 7298052]
9115G298052K23455K27295J92150K51813L14822L59797L52435M20034M21885M22097
9105A0483835M67075N14530N23253N37235O82236P69836Q83254R38057J041559
9096A6840870J122769J257302J492702J722868K040250K288723K450273K526222
9088C1741979K794092L283637L603725K588439j567768j0162983k2708061k7430027
9080a7856967j9808416r610464l38092M053259M707373M164111L471788K915589
9072b8301819K466393K045510J761064J608891J422471J143482R78402R20013
9064a5955593P72273P16119O99138O20588N60839M89804N02268M51853L39816
9055a0802895L38856L97317L53499L44141L13300L25643K55343K71606K60076
$$ y = [7298052, 7521507, 7748802, 7940952, 8192765, 8507587, 8867384, 9219819, 9639853, 10061738, 10483835, 10950910, 11465440, 11988693, 12525928, 13208164, 13978000, 14861254, 15799311, 16840870, 17963639, 19220941, 20713643, 22436511, 24476761, 26765484, 29215757, 31741979, 34536071, 37819708, 41423433, 44011872, 42444104, 32281121, 9573060, -17856967, -37665383, -47275847, -47613939, -43560680, -38853307, -34689196, -31217408, -28301819, -25835426, -23789916, -22028852, -20419961, -18997490, -17854008, -16875606, -15955593, -15183320, -14467201, -13768063, -13147475, -12586636, -12096832, -11594564, -11142711, -10802895, -10464039, -10066722, -9713223, -9369082, -9055782, -8730139, -8474796, -8203190, -7943114]
9046g943114J72279K06086K07598J06842J28390J60151J90949J70092J59657J52990
9036f288080J41411J09200J15749J28160R8398J18906P5598j2211O2565J38417
9026e311887J59081J02913Q7471P4503J04751R8190N5917J0817N2009P2384L8271
9015d455580M502J4791R4543J21366O1810M648N6393K8844R0572L8549j401k1433
9003c962396Q3503R0153L6312L5704M4223L9938P2661N8333J1865l4813K6150
8992c498367K6825K8914P643O3331O3934O0449q010L0679L4717j4035L4038K1027
8980c148855M0168M0204N9690J0921L2825n58k1791k6111K7197M6265N837L57
8968b933851L1130N1631K3973J0132R0289J3177M1284k2485R175Q0243L324P3024
$$ y = [-7943114, -7770835, -7564749, -7357151, -7250309, -7121919, -6961768, -6770819, -6600727, -6441070, -6288080, -6146669, -6037469, -5921720, -5793560, -5695162, -5576256, -5500658, -5512869, -5450304, -5311887, -5152806, -5049893, -4962422, -4887919, -4783168, -4684978, -4629061, -4618244, -4566235, -4493851, -4455580, -4451078, -4436287, -4341744, -4220378, -4158568, -4153920, -4097527, -4068683, -3978111, -3939562, -3940963, -3962396, -3878893, -3788740, -3752428, -3716724, -3672501, -3632563, -3559902, -3501569, -3489704, -3524517, -3498367, -3471542, -3442628, -3434985, -3371654, -3307720, -3247271, -3255281, -3224602, -3189885, -3203920, -3169882, -3148855, -3108687, -3068483, -3008793, -2997872, -2965047, -2965605, -2987396, -3013507, -2986310, -2940045, -2934208, -2933851, -2902721, -2851090, -2827117, -2816985, -2726696, -2713519, -2672235, -2694720, -2685545, -2605302, -2601978, -2528954]
8956b528954M9474m4283K2267j7407Q8516L3786o8175n1976P362l800K4400M5658
8944b443132p558L0053n923R5231M2603o2324k628m9305N4360K5631j4239P423
8932b329808j8778K0300Q0888J429l3177N7423K907l1132O0739O8580l3836n7175
8920b211640N7072K5831j08148J001K7709Q6794K0588j4888K6161K5899j1318
8909b074939K9185K7143P8502k3122K338J7009l2375K349l5561M0156M4664L3247
8897a891404M2236j1824p1617Q161M6033M1737M941l0993k563K2936L4466l2634
8885a840525q1219m4438P5876O5046K0945K9551P46l0209k467M8714j0453k5904
8873a794337l431k86J5597j1188n2953o187M5008L324j0543P953Q7425O7735j9262
$$ y = [-2528954, -2479480, -2523763, -2501496, -2518903, -2430387, -2396601, -2464776, -2516752, -2509390, -2513190, -2488790, -2443132, -2450690, -2420637, -2426560, -2331329, -2288726, -2351050, -2353678, -2402983, -2348623, -2322992, -2337231, -2329808, -2348586, -2328286, -2247398, -2245969, -2279146, -2221723, -2218816, -2249948, -2189209, -2120629, -2154465, -2211640, -2154568, -2128737, -2236885, -2235884, -2208175, -2121381, -2100793, -2115681, -2089520, -2063621, -2074939, -2045754, -2018611, -1940109, -1963231, -1960893, -1943884, -1976259, -1973910, -2009471, -1969315, -1924651, -1891404, -1849168, -1860992, -1932609, -1924448, -1878415, -1836678, -1831737, -1862730, -1865293, -1842357, -1807891, -1840525, -1921744, -1966182, -1890306, -1825260, -1804315, -1774764, -1774018, -1804227, -1806694, -1757980, -1768433, -1794337, -1797768, -1798054, -1782457, -1793645, -1846598, -1852785, -1807777, -1804453, -1814996, -1807043, -1719618, -1651883, -1671145]
8860a671145l7349J1261l17K0037M0927J2860L1893j9044o4360k3084J00043L6350
8848a561928n590n1903K7638J475j9821M8168L1078k9793k3917L697L3577L4339
8836a512980P9218K8410J0379q5311n1677k6801l101r79K0635K0756K4190J8613
8824a478648J403r417j4897k3269j4309J8908P7313M4919m8187k4375j2368P673
8812a475254J3027q824M4640K9416k3615j4733L3046k4596j2978j630J8873j8007
8800a440635o153L1433M3580o199r18J2989q8290l2435K9573k0456M8723M1550
8788a387238M1829j9164M354N3368M1881l547n8614k3327r023K8806K6070J9520
8776a285085l1986p6026J2427J2636M313j5603j4449K1882K8840k9663j5977J4806
$$ y = [-1671145, -1708494, -1697233, -1697550, -1677513, -1636586, -1623726, -1591833, -1610877, -1675237, -1698321, -1598278, -1561928, -1567518, -1619421, -1591783, -1590308, -1610129, -1561961, -1530883, -1560676, -1584593, -1580896, -1547319, -1512980, -1433762, -1405352, -1394973, -1480284, -1531961, -1558762, -1561863, -1562842, -1542207, -1521451, -1497261, -1478648, -1477245, -1486662, -1501559, -1524828, -1539137, -1520229, -1442916, -1397997, -1446184, -1470559, -1482927, -1475254, -1462227, -1471051, -1426411, -1396995, -1420610, -1435343, -1402297, -1426893, -1439871, -1441501, -1422628, -1440635, -1446788, -1415355, -1371775, -1377974, -1378892, -1365903, -1454193, -1486628, -1457055, -1477511, -1428788, -1387238, -1345409, -1364573, -1360219, -1306851, -1264970, -1268517, -1327131, -1350458, -1359481, -1330675, -1304605, -1285085, -1317071, -1393097, -1380670, -1368034, -1363721, -1379324, -1393773, -1371891, -1343051, -1372714, -1388691, -1373885]
8764a373885N9378l598N025j0351m9781O2126P6027o530J3146n0077l272J7316
8752a264476K1172L7637j3286l3947p613O8581r482n0477m5123J0517P970N365
8740a273162M2938N8326L722n611J4835o1180J5277Q3644J5671k1435n4376K3543
8728a157808J5193j0451K5791l1701n0750m53j9522r41M779n012p6994j0023J8070
8715a299822N2947J4157k7314K0805M4100N740P5042L7045K3081j0769l0793j3035
8703a108816K1478n1223l0468K5341J2077M2798j2487L195L9827M136m7117k7337
8691a128596L2124K2037p1116J5676M6061M4049m2997m190R887j4892k2718J1061
8679a103614M4129K4050m5617l8378o0435l402K2442L1817K4146J2143K0904j3419
$$ y = [-1373885, -1314507, -1318105, -1313080, -1323431, -1373212, -1311086, -1235059, -1241589, -1228443, -1278520, -1281792, -1264476, -1243304, -1205667, -1218953, -1252900, -1260513, -1191932, -1201414, -1251891, -1297014, -1286497, -1278527, -1273162, -1230224, -1171898, -1168176, -1173787, -1158952, -1220132, -1204855, -1121211, -1105540, -1126975, -1181351, -1157808, -1142615, -1153066, -1127275, -1158976, -1209726, -1210179, -1229701, -1230642, -1225863, -1230875, -1307869, -1317892, -1299822, -1246875, -1232718, -1260032, -1239227, -1195127, -1189387, -1114345, -1077300, -1054219, -1064988, -1095781, -1108816, -1087338, -1138561, -1169029, -1143688, -1131611, -1088813, -1101300, -1098105, -1058278, -1054142, -1101259, -1128596, -1096472, -1074435, -1145551, -1129875, -1083814, -1039765, -1082762, -1086952, -1077065, -1091957, -1114675, -1103614, -1059485, -1035435, -1081052, -1119430, -1179865, -1183267, -1160825, -1129008, -1104862, -1092719, -1071815, -1085234]
8667a085234L7717J1353m0232p876K6022N2447M5760k2749O746L2765P755K3009
8655i12517o90J5772m5362j3648J1213q8955j3852J11072M5351J1124m2234k6669
8643i49395M0663j0081k7016J6055K0800J8470k7968k1984k1004j2922L3698r192
8631i49876K9544P823m4290k2513j0700o37k164J423l0404P674k8414m810o62
8618a048006L064K6510J225o471K452L4639M5497R751l2050K8593O178j0966Q987
8605i30597K6723R162j4864J3482l8809m5545J5467O7907l2767k2680n0656K088
8593a001089O4360k3246n5908k2926K3960J4666J8662J9776j0317k3559Q433j0961
8581i98149q1197M5275N3002N0805q099q4196M626M562K2769j9798l0210k5073
$$ y = [-1085234, -1047517, -1036164, -1076396, -1084272, -1058250, -1005803, -960043, -982792, -976046, -943281, -935526, -912517, -913207, -897435, -942797, -956445, -945232, -1034187, -1048039, -936967, -891616, -880492, -922726, -949395, -908732, -918813, -945829, -929774, -908974, -890504, -918472, -940456, -961460, -974382, -940684, -949876, -920332, -912509, -956799, -979312, -990012, -990649, -992813, -991390, -1021794, -1014120, -1042534, -1047344, -1048006, -1044942, -1018432, -1017207, -1023678, -1021226, -986587, -941090, -931339, -963389, -934796, -928618, -939584, -930597, -903874, -894712, -909576, -896094, -934903, -980448, -964981, -897074, -929841, -952521, -1003177, -1001089, -936729, -959975, -1015883, -1038809, -1014849, -1000183, -981521, -961745, -972062, -995621, -987188, -998149, -1079346, -1034071, -981069, -930264, -938363, -1022559, -1017933, -1013371, -990602, -1010400, -1040610, -1065683]
8569a065683J6003K2491K8132L8288j0840k6122k449J4873m4097j3672J7096k4121
8557a050101l9394J2414P8843N794L5264L219N2947Q3922K817j2934j2749J4168
8545h25790p6450l1136k4630O260M9760j010l6010m9006n3500K1832L6524Q5499
8533h97657L6691n2602j3271P4221j2942m6681n8182K8659P1803L8766n3683n2967
8521i37845l4458k373K6535L0250L9735O4534k5169l3137m3322m1680J5574K5231
8509i16125M4006o0464P879K5736K3515k4449o4501K7860L7743m738K2600p2724
$$ y = [-1065683, -1049680, -1027189, -999057, -960769, -971609, -997731, -1000180, -985307, -1029404, -1043076, -1025980, -1050101, -1089495, -1077081, -998238, -992444, -957180, -953961, -901014, -817092, -814275, -827209, -839958, -825790, -902240, -933376, -958006, -951746, -901986, -902996, -939006, -988012, -1041512, -1019680, -983156, -897657, -860966, -913568, -926839, -852618, -865560, -912241, -970423, -941764, -869961, -831195, -884878, -937845, -972303, -974676, -948141, -917891, -878156, -813622, -838791, -871928, -915250, -956930, -941356, -916125, -872119, -932583, -924704, -898968, -875453, -899902, -964403, -936543, -898800, -903538, -880938, -953662]
$$ [...]
##END NTUPLES=NMR SPECTRUM
##END=
