##TITLE=XTC-1111a_1
##JCAMPDX= 6.0         $$ Bruker NMR JCAMP-DX V2.0
##DATA TYPE= NMR SPECTRUM
##DATA CLASS= NTUPLES
##ORIGIN= BRUKER
##OWNER= patiny
$$ 1.79 TOPSPIN		Version 3.0
$$ 2012-05-19 18:08:44.917 +0200  patiny@icmbsg005
$$ Compression mode = diff/dup
##.OBSERVE FREQUENCY= 400.13188181139
##.OBSERVE NUCLEUS= ^1H
##.ACQUISITION MODE= SIMULTANEOUS (DQD)
##.ACQUISITION SCHEME= undefined
##.AVERAGES= 16
##.DIGITISER RES= 23
##SPECTROMETER/DATA SYSTEM= spect
##.PULSE SEQUENCE= zgpr
##.SOLVENT NAME= D2O
##.SHIFT REFERENCE= INTERNAL, D2O, 1, 11.69961
##AUDIT TRAIL= $$ (NUMBER, WHEN, WHO, WHERE, PROCESS, VERSION, WHAT)
$$ ##TITLE= Audit trail, TOPSPIN		Version 3.0
$$ ##JCAMPDX= 5.01
$$ ##ORIGIN= Bruker BioSpin GmbH
$$ ##OWNER= patiny
$$ $$ /opt/data/patiny/nmr/XTC-1111a_1/11/pdata/1/auditp.txt
$$ ##AUDIT TRAIL=  $$ (NUMBER, WHEN, WHO, WHERE, PROCESS, VERSION, WHAT)
(   1,<2012-05-19 18:08:43.414 +0200>,<patiny>,<icmbsg005>,<go>,<TOPSPIN 3.0>,
      <created by zg
	started at 2012-05-19 18:06:57.506 +0200,
	POWCHK enabled, PULCHK disabled,
       configuration hash MD5:
       77 C7 B7 C4 10 F4 BA 30 64 2E BB 52 82 F2 DA 41
       data hash MD5: 32K
       8B 02 EF 7E 90 8C 72 9B 0B 0B 9B AE 1C 22 E5 1C>)
(   2,<2012-05-19 18:08:43.778 +0200>,<patiny>,<icmbsg005>,<audit>,<TOPSPIN 3.0>,
      <user comment:
       ICON-NMR User ID: patiny
       data hash MD5: 32K
       8B 02 EF 7E 90 8C 72 9B 0B 0B 9B AE 1C 22 E5 1C>)
(   3,<2012-05-19 18:08:44.447 +0200>,<patiny>,<icmbsg005>,<proc1d>,<TOPSPIN 3.0>,
      <Start of raw data processing
       ef LB = 0 FT_mod = 6 PKNL = 1 SI = 16K 
       data hash MD5: 16K
       B9 F5 76 19 D7 03 FC 86 7F 3E 32 EA 3A DF B7 8D>)
(   4,<2012-05-19 18:08:44.556 +0200>,<patiny>,<icmbsg005>,<proc1d>,<TOPSPIN 3.0>,
      <apk 
       data hash MD5: 16K
       7E 7C B1 C8 47 7F 4D 54 88 67 BE 9E F9 58 04 FF>)
(   5,<2012-05-19 18:08:44.578 +0200>,<patiny>,<icmbsg005>,<proc1d>,<TOPSPIN 3.0>,
      <abs ABSG = 5 
       data hash MD5: 16K
       EF A6 3E 0D EE B4 08 30 7E 5A BE 62 A8 7C 83 A9>)
$$ ##END=
$$ 
$$ $$ hash MD5
$$ $$ 79 29 C3 94 69 94 51 13 D7 3B AD 23 7F AC 71 3B
##$RELAX= 
##$RELAX= 
##$RELAX= 
##$RELAX= 
##$RELAX= 
##$RELAX= 
##$RELAX= 
##$RELAX= 
##$RELAX= 
##$RELAX= 
##$RELAX= 
##$RELAX= 
##$RELAX= 
$$ Bruker specific parameters
$$ --------------------------
##$DATPATH= </opt/data/patiny/nmr>
##$EXPNO= 11
##$NAME= <XTC-1111a_1>
##$PROCNO= 1
##$ACQT0= -9.16730304209974
##$AMP= (0..31)
100 100 100 100 100 100 100 100 100 100 100 100 100 100 100 100 100 100
100 100 100 100 100 100 100 100 100 100 100 100 100 100
##$ANAVPT= -1
##$AQSEQ= 0
##$AQ_mod= 3
##$AUNM= <au_zgglp>
##$AUTOPOS= <25 >
##$BF1= 400.13
##$BF2= 400.13
##$BF3= 400.13
##$BF4= 400.13
##$BF5= 400.13
##$BF6= 400.13
##$BF7= 400.13
##$BF8= 400.13
##$BYTORDA= 0
##$CAGPARS= (0..11)
0 0 0 0 0 0 0 0 0 0 0 0
##$CFDGTYP= 0
##$CFRGTYP= 9
##$CHEMSTR= <none>
##$CNST= (0..63)
1 1 1 1 1 1 1 1 1 1 1 1 1 1 1 1 1 1 1 1 1 1 1 1 1 1 1 1 1 1 1 1 1 1 1 1
$$ [...]
##$TE2= 0
##$TE3= 0
##$TE4= 0
##$TEG= 300
##$TE_PIDX= 1
##$TE_STAB= (0..8)
2 2 0 0 0 0 0 0 0
##$TL= (0..7)
120 120 120 120 120 120 120 120
##$TP= (0..7)
150 150 150 150 150 150 150 150
##$TPNAME0= <>
##$TPNAME1= <>
##$TPNAME2= <>
##$TPNAME3= <>
##$TPNAME4= <>
##$TPNAME5= <>
##$TPNAME6= <>
##$TPNAME7= <>
##$TPOAL= (0..7)
0.5 0.5 0.5 0.5 0.5 0.5 0.5 0.5
##$TPOFFS= (0..7)
0 0 0 0 0 0 0 0
##$TUNHIN= 0
##$TUNHOUT= 0
##$TUNXOUT= 0
##$USERA1= <>
##$USERA2= <>
##$USERA3= <>
##$USERA4= <>
##$USERA5= <>
##$V9= 5
##$VALIST= <>
##$VCLIST= <>
##$VD= 0
##$VDLIST= <>
##$VPLIST= <>
##$VTLIST= <>
##$WBST= 1024
##$WBSW= 4
##$XGAIN= (0..3)
0 0 0 0
##$XL= 0
##$YL= 0
##$YMAX_a= 7467118
##$YMIN_a= -5633544
##$ZGOPTNS= <>
##$ZL1= 120
##$ZL2= 120
##$ZL3= 120
##$ZL4= 120
##$ABSF1= 11.69961
##$ABSF2= -2.293603
##$ABSG= 5
##$ABSL= 3
##$ALPHA= 0
##$AQORDER= 0
##$ASSFAC= 0
##$ASSFACI= 0
##$ASSFACX= 0
##$ASSWID= 0
##$AUNMP= <save_auto_nonLDAP.pm>
##$AXLEFT= 0
##$AXNAME= <>
##$AXNUC= <1H>
##$AXRIGHT= 0
##$AXTYPE= 0
##$AXUNIT= <>
##$AZFE= 0.1
##$AZFW= 0.1
##$BCFW= 0
##$BC_mod= 0
##$BYTORDP= 0
##$COROFFS= 0
##$CY= 15
##$DATMOD= 1
##$DC= 0
##$DFILT= <>
##$DTYPP= 0
##$ERETIC= no
##$F1P= 0
##$F2P= 0
##$FCOR= 0.5
##$FTSIZE= 16384
##$FT_mod= 6
##$GAMMA= 0
##$GB= 0
##$INTBC= 1
##$INTSCL= 1
##$ISEN= 128
##$LB= 0
##$LEV0= 0
##$LPBIN= 0
##$MAXI= 10000
##$MC2= 0
##$MEAN= 0
##$ME_mod= 0
##$MI= 0
##$NCOEF= 0
##$NC_proc= -4
##$NLEV= 6
##$NOISF1= 0
##$NOISF2= 0
##$NSP= 0
##$NTH_PI= 0
##$NZP= 0
##$OFFSET= 11.69961
##$PC= 1
##$PHC0= 87.61195
##$PHC1= 4.282542
##$PH_mod= 1
##$PKNL= yes
##$PPARMOD= 0
##$PPDIAG= 0
##$PPIPTYP= 0
##$PPMPNUM= 2147483647
##$PPRESOL= 1
##$PSCAL= 0
##$PSIGN= 0
##$PYNMP= <proc.py>
##$REVERSE= no
##$SF= 400.13
##$SI= 16384
##$SIGF1= 0
##$SIGF2= 0
##$SINO= 0
##$SIOLD= 16384
##$SPECTYP= <>
##$SREGLST= <1H.CDCl3>
##$SSB= 0
##$STSI= 16384
##$STSR= 0
##$SW_p= 5599.10414333707
##$SYMM= 0
##$S_DEV= 0
##$TDeff= 32768
##$TDoff= 0
##$TI= <>
##$TILT= no
##$TM1= 0
##$TM2= 0
##$TOPLEV= 0
##$USERP1= <>
##$USERP2= <>
##$USERP3= <>
##$USERP4= <>
##$USERP5= <>
##$WDW= 1
##$XDIM= 16384
##$YMAX_p= 285835813
##$YMIN_p= -743377
##$CURPLOT= <Cups-PDF>
##$CURPRIN= <$Cups-PDF>
##$DFORMAT= <normdp>
##$LAYOUT= <+/1D_X+nopp.xwp>
##$LFORMAT= <normlp>
##$PFORMAT= <normpl>
$$ End of Bruker specific parameters
$$ ---------------------------------
##NTUPLES= NMR SPECTRUM
##VAR_NAME=  FREQUENCY,     SPECTRUM/REAL,   SPECTRUM/IMAG
##SYMBOL=    X,             R,               I
##VAR_TYPE=  INDEPENDENT,   DEPENDENT,       DEPENDENT
##VAR_FORM=  AFFN,          ASDF,            ASDF
##VAR_DIM=   16384,         16384,           16384
##UNITS=     HZ,            ARBITRARY UNITS, ARBITRARY UNITS
##FACTOR=    0.3417421962486, 1,             1
##FIRST=     5598.76240114082, -51957,       -47616
##LAST=      0,             -52616,          -50764
##MIN=       0,             -743377,         0
##MAX=       5598.76240114082, 285835813,    0
$$ Real data points
##PAGE= N=1
##DATA TABLE= (X++(R..R)), XYDATA
$$ [...]
##PAGE= N=2
##DATA TABLE= (X++(I..I)), XYDATA
10593d279240M77595M97187L75313M83437L89318L93986L42842L75017L68033
10584e76512a66454A60022M90379K95539L87085M70695L89741M67147M37350N81637
10574C679595M79022O01515O37731O97192Q68675R50422J225612J445339J946542
10565A2531645K513035K703313J400249j511176n347659E678955g59759j058571
10557a818330q55756k423925n165349n559509j454637J217968K889038K534110
10549a0636390K003190J623362J478610J401906J385728a245983D03441K004148
10541B407589K132726J665336j89118k746807a282990m627039j269721o50944
10533g830694r59686l668921m187001k023681M93378J905261J854772J437442
$$ plain form
10593 -4279240 -3801645 -3304458 -2929145 -2445708 -2056390 -1662404 -1319562 -944545 -576512
10584 -576512 -166454 160022 650401 945940 1333025 1803720 2193461 2660608 3097958 3679595
10574 3679595 4158617 4760132 5397863 6095055 6963730 7914152 9139764 10585103 12531645
10565 12531645 15044680 17747993 19148242 17637066 12289407 5678955 -759759 -1818330
10557 -1818330 -2674086 -5098011 -10263360 -15822869 -17277506 -16059538 -13170500 -10636390
10549 -10636390 -8633200 -7009838 -5531228 -4129322 -2743594 -1245983 403441 2407589
10541 2407589 4540315 6205651 6016533 3269726 -1282990 -5910029 -7179750 -7830694
10533 -7830694 -8790380 -12459301 -16646302 -18669983 -18176605 -16271344 -14416572 -12979130
10525a2979130J038673Q27628P21650N72945N05380M48001L57358L91010L45804
10516g770681L38936J94634K86802K14357K84963J75841J49271K38330J22307
10507e765240J90041P6492K12520R3432J86547R7889M8140J86442P8755J29986
10497d464996M9023J77568N779Q4155O6088R6460J18475M5110R4202K1330Q3646
10486c623160N1600P6832P8676M3426P0594K3318J01180L2428L2351M744P5568
10475c032443K4621K8574P8097M0313O6713L1308L8407M8157K1543L5778K6537
10464b592395P2947N6155K1374J1909O599j4586J35726m2434Q8955K7154L2351
10453b196245N6612K9672k1376N1006P2553o7525N6160K4738M4348J778O3934
$$ plain form
10525 -12979130 -11940457 -11112829 -10391179 -9818234 -9312854 -8864853 -8507495 -8116485 -7770681
10516 -7770681 -7431745 -7237111 -6950309 -6735952 -6450989 -6275148 -6125877 -5887547 -5765240
10507 -5765240 -5575199 -5498707 -5286187 -5192755 -5006208 -4908319 -4860179 -4673737 -4594982 -4464996
10497 -4464996 -4415973 -4238405 -4232626 -4148471 -4082383 -3985923 -3867448 -3822338 -3728136 -3706806 -3623160
10486 -3623160 -3571560 -3494728 -3416052 -3372626 -3302032 -3278714 -3177534 -3145106 -3112755 -3108011 -3032443
10475 -3032443 -3007822 -2979248 -2901151 -2860838 -2794125 -2762817 -2724410 -2676253 -2654710 -2618932 -2592395
10464 -2592395 -2519448 -2463293 -2441919 -2430010 -2423411 -2437997 -2302271 -2344705 -2255750 -2228596 -2196245
10453 -2196245 -2139633 -2109961 -2131337 -2080331 -2007778 -2075303 -2019143 -1994405 -1950057 -1948279 -1884345
10442a884345K4419P9212n2696m48Q2924N2012J8546R0820Q414L8407p5973J1873
10430a606835j58695o0871P0896L4350R9573J3847K2917m5515Q8177L3225N8314
10419a450617L1036m2300k6887N9812R0776m2162O9387k8191R190J34087p5226
10408a271095k7218j0622j16582J9793Q5342L3995J2054L2257J07774m1756J0887
10397a165171m3002M6647O1396l4458M0801Q7495k5554K2934L1865n3553L3990
10386i96610Q8835m7010J7951K6248J1564Q1132M0225k5576L2255l9281o9835
10375h80102q1385Q6518o8071m5437j7803j3016M4595o1282M6646M4374j4549
10364i59512N0804J2555K2384M1322K206J7463J9197K4228k7766O9119L5865l1301
$$ plain form
10442 -1884345 -1859926 -1780714 -1833410 -1833858 -1750934 -1698922 -1680376 -1589556 -1581142 -1542735 -1618708 -1606835
10430 -1606835 -1765530 -1826401 -1755505 -1721155 -1621582 -1607735 -1584818 -1630333 -1542156 -1508931 -1450617
10419 -1450617 -1419581 -1461881 -1488768 -1428956 -1338180 -1380342 -1310955 -1339146 -1329956 -1195869 -1271095
10408 -1271095 -1298313 -1308935 -1425517 -1405724 -1320382 -1286387 -1274333 -1242076 -1134302 -1176058 -1165171
10397 -1165171 -1208173 -1161526 -1100130 -1134588 -1093787 -1006292 -1031846 -1008912 -977047 -1030600 -996610
10386 -996610 -907775 -954785 -936834 -910586 -899022 -817890 -777665 -803241 -770986 -810267 -880102
10375 -880102 -961487 -874969 -943040 -988477 -1006280 -1019296 -974701 -1035983 -989337 -944963 -959512
10364 -959512 -908708 -896153 -873769 -832447 -830241 -812778 -793581 -769353 -797119 -728000 -692135 -723436
10352g23436L4058M1961r6810Q3319M0663l3518q7734N4684J2383O8508K8360
10341e77562l8773Q170k4737L1261N4463j0653M505J8324Q604Q977K7844J607
10329d87970J9974J2503Q681K9278L5363o4413O611j1695k793n5230M8491r9232
10317e60432O1501K8659n0191R1283k3882K5999M1884l9457n5526Q9529L0238
10306c60395k1792K2786P6884m2198L6565q7513J3211n9338K0086L3493k7703
10295c95914q6010R0458k1235L8196j0577L4037J8444l4863N2325m9911J5501
10284c49549P6682l1367M2888m8780L5859k5909Q124N3847J0576j6380J749J3538
10272b28722J1247K3186m579l7771P7858n678m7279K2346O096J8552J6068J0825
$$ plain form
10352 -723436 -689378 -647417 -744227 -660908 -620245 -653763 -741497 -686813 -674430 -605922 -577562
10341 -577562 -616335 -608165 -632902 -601641 -547178 -557831 -553326 -535002 -526398 -517421 -489577 -487970
10329 -487970 -467996 -455493 -446812 -417534 -382171 -446584 -439973 -451668 -454461 -509691 -461200 -560432
10317 -560432 -498931 -470272 -520463 -429180 -453062 -427063 -385179 -424636 -480162 -390633 -360395
10306 -360395 -382187 -359401 -282517 -324715 -288150 -375663 -362452 -421790 -401704 -368211 -395914
10295 -395914 -481924 -391466 -412701 -374505 -385082 -351045 -332601 -367464 -315139 -365050 -349549
10284 -349549 -272867 -304234 -261346 -310126 -274267 -300176 -292052 -238205 -227629 -244009 -242260 -228722
10272 -228722 -217475 -194289 -198868 -236639 -158781 -164459 -211738 -189392 -183296 -164744 -148676 -137851
10260a37851j6906K734k0622M6074O866K312N992m5358d7489p1935m74l0911d5341
10246d9178q0057e6190m7220M7980n7400d3249j6523i528K833o2801a4214j119
10234a5333m0142k3018i34n9169D4107F091d465E1214k883J2778Q314e98o522
10221g120I4724C5879j0291Q9900k9070I815N3711B8291J5375J1456L2661K6046
10209A13829M553J8143m1652m5273N7004o153j2788N5983j6659n2073O6889n9582
10197H2221M1340J1661O0763l0128j2551j7318j8890N1416K0110k9234j1269J8290
10185A66411n5910Q1917J6667O883j4471n909P7168p4756L6917q799p501l8928
10173A79689M6059J4880p5032J17629l9469L8403m6397J745N3176j5043o331k7824
$$ plain form
10260 -137851 -154757 -152023 -172645 -126571 -119705 -117393 -111401 -156759 -47489 -119424 -119898 -150809 -45341
10246 -49178 -129235 -56190 -103410 -55430 -112830 -43249 -59772 -9528 -6695 -69496 -14214 -15333
10234 -15333 -55475 -78493 -934 -60103 44107 6091 -4465 51214 48331 61109 69423 -598 -7120
10221 -7120 94724 35879 25588 115488 86418 9815 63526 28291 43666 55122 87783 113829
10209 113829 118382 136525 94873 49600 106604 100451 87663 143646 126987 74914 141803 82221
10197 82221 123561 135222 195985 165857 153306 135988 117098 168514 188624 159390 148121 166411
10185 166411 110501 192418 209085 215968 201497 195588 272756 198000 234917 226118 218617 179689
10173 179689 225748 240628 165596 283225 243756 282159 235762 237507 290683 275640 269309 241485
10161B41485j5460J4540L8174J2034l098N18j3603N1458p0182R9028j01849N6351
10149C09396L53J0711j9580K3861L4528j2240n7842K2844j1811K0414K150l0930
10137B91854J08986K3346q3092m3515Q4526J1430l4271J7495j1840j4584M1527
10126C91862L2235m3441R3458r9206N2702R43K0978j6655J2065p5158o475L0135
10114C93443O2452k055j7416R2344q2527K9712k4666K4824k6115L684P391p919
10102D53152K6026Q50L2383m53j8549p129N9142q0254M1200L1135l2469N3486
10090E58520j2135p6960L4348m9977J09132l4069n4951Q1261o4645M5495L3639
10079E69658j1687m2238J2771L724J6140k4782N1789J6872l1212J9211m0758R154
$$ plain form
10161 241485 226025 240565 278739 290773 287675 288193 274590 326048 255866 354894 253045 309396
10149 309396 309749 320460 300880 324741 359269 347029 289187 312031 300220 320634 322784 291854
10137 291854 400840 424186 341094 297579 382105 393535 359264 376759 364919 350335 391862
10126 391862 424097 380656 474114 374908 427610 428553 449531 432876 444941 369783 363308 393443
10114 393443 455895 453840 436424 528768 446241 475953 451287 476111 449996 453680 461071 453152
10102 453152 479178 480028 512411 511958 493409 486280 545422 465168 506368 537503 505034 558520
10090 558520 546385 469425 503773 453796 562928 528859 473908 555169 490524 536019 569658
10079 569658 557971 515733 528504 532228 548368 523586 575375 592247 561035 580246 539488 548642
10067E48642M9930l5745l3518O7230M55l1134Q0745l8512J4676p767J3748J9996
10055F48746j0265l9265p90P1643p0126K9118K9943m5406m4062R2680j4674k5849
10043F21693j732K5778L6339M4770K3075k4366n7931J9636k7203j9433R763N8794
10031G09183k7811K1768M4422m1134l7837O9093j1937j9168P608M1484r025n607
10019G41039j7222J88K6389k4607Q3423k0579n4894L2574O7042j28970R4312j6057
10007G82638J8340j8099K4369k0496L8100K0826r6658J4705P8210L1471j3878
9996H59528p5515Q6530r8196M9037R9810r6014K1136k9056J3476M9285p9232J3967
9984H14756K1841M8529l48M366K1343k2443m6690J00340m9568l1007L6953N5303
$$ plain form
10067 548642 598572 562827 529309 596539 596994 565860 646605 608093 622769 615002 628750 648746
10055 648746 638481 599216 598426 670069 599943 629061 659004 613598 569536 662216 647542 621693
10043 621693 619961 645739 682078 726848 749923 725557 667626 687262 660059 640626 650389 709183
10031 709183 681372 703140 747562 706428 668591 737684 725747 706579 714187 755671 746646 741039
10019 741039 723817 724005 750394 725787 809210 788631 733737 766311 833353 704383 798695 782638
10007 782638 800978 782879 807248 786752 824852 845678 749020 763725 841935 873406 859528
9996 859528 784013 870543 772347 821384 921194 825180 846316 817260 830736 880021 800789 814756
9984 814756 836597 885126 884778 889144 910487 888044 841354 941694 892126 861119 898072 953375
9972I53375r9467L4233J9910j5565M0344J0164j0703J7142K3339k3864L0011l4563
9960I44356N4534m9311M6440L3409m3650j094J5635l6682j5213J3847M4754J5588
9948A022613L02l0799j2864J1189M4424Q606r6285Q4667J8286j02471P3949L3801
9936A055418p7M0287l2868L5213p0309j5483J7571M625P6233j8878R768L2801
9924A134301m6607N563m4914K9799O4643j789o173L1985j0027l1056O0148p6709
9912A109164P0914L1262j0887r208l9526l8085R6485j0513o846L3141n2086M1351
9900A215166k9325M9926N6578n8418k3701L6425l3201p511P1858l5353L8017P179
9888A287640K814j3537L4043N4470p8371Q464j9752N5619N423J148M728J9037
$$ plain form
9972 953375 853908 888141 908051 892486 932830 942994 932291 949433 972772 948908 978919 944356
9960 944356 998890 949579 996019 1029428 985778 984684 1000319 963637 948424 962271 1007025 1022613
9948 1022613 1022915 992116 979252 990441 1034865 1043471 947186 1031853 1050139 947668 1021617 1055418
9936 1055418 1055341 1095628 1062760 1097973 1027664 1012181 1029752 1034377 1110610 1091732 1101500 1134301
9924 1134301 1087694 1093257 1048343 1078142 1142785 1140996 1134823 1166808 1156781 1125725 1185873 1109164
9912 1109164 1180078 1211340 1200453 1191245 1151719 1113634 1210119 1199606 1192760 1225901 1173815 1215166
9900 1215166 1185841 1235767 1292345 1233927 1210226 1246651 1213450 1205939 1277797 1242444 1280461 1287640
9888 1287640 1290454 1276917 1310960 1365430 1287059 1295523 1275771 1331390 1336813 1337961 1342689 1361726
9876A361726j2614J0605M2129L905m8981Q2395o3139O7527o2869j6497J14520
9865A478707m2683K3286j9895k6138K3313J2186K0261O998L9760P4591P76J4881
9853A606043R509L7471N7546J6696L2900l0426N4388P8807J04776P1481j49333
9842A889858j70256m63448l25805L793J36774Q6826R0591n611Q541J07323l6199
9831A322387l6703J11989r760K4355L4092N8492l4490J0071Q3535n7553O8704
9820A575119j6221m0831J13852o2207k0449J3078L7843M0862L2244J5793n6031
9809A633052L4682K971k1272L4404l9616K2741L7727P5867r1777O0048P153J17
9797A756097N9244K6268l0719M0455j7115m4183Q82O1634N066N123L0562k8891
$$ plain form
9876 1361726 1349112 1359717 1401846 1405751 1356770 1439165 1376026 1443553 1380684 1364187 1478707
9865 1478707 1436024 1459310 1439415 1413277 1436590 1448776 1469037 1476035 1515795 1590386 1591162 1606043
9853 1606043 1615552 1653023 1710569 1727265 1760165 1729739 1784127 1862934 1967710 2039191 1889858
9842 1889858 1719602 1256154 930349 934142 1070916 1157742 1248333 1242722 1251263 1358586 1322387
9831 1322387 1285684 1397673 1387913 1412268 1446360 1504852 1470362 1480433 1563968 1506415 1575119
9820 1575119 1558898 1518067 1631919 1569712 1549263 1562341 1600184 1641046 1673290 1689083 1633052
9809 1633052 1667734 1670705 1649433 1683837 1644221 1666962 1704689 1780556 1688779 1748827 1755980 1756097
9797 1756097 1815341 1841609 1810890 1851345 1834230 1790047 1790929 1852563 1857629 1862752 1893314 1864423
9785A864423P1263l6725L7510n9642N7382m3689J17482n6256m4799M1966L8449
9774A987364J4439L2349L4131k7556L963O3062j3444J6547O857j1822K4685l2807
9762B097768J9378O6224o126J5097L5839l1817P2670o0571K0977N2733O129j1203
9750B277098j0180J2038J27604q0183L4282M9947Q60n0079J107N6190L036K9680
9738B451400Q481K8440J5181O631N6831q1756R3077j3747L8376M8903n434L3704
9726B680087j0014o033j9810M5544Q6320L4631J7021q5895R7292M6696j4747N0829
9714B921921j6597P486L0265K4509K8285P7834J4923M387J0210L0855K1286K7669
9702C183033n181K2931J42017L313k9600O216R6068N7775n3465P2435J9910K0794
$$ plain form
9785 1864423 1935686 1898961 1936471 1876829 1934211 1890522 2008004 1951748 1906949 1948915 1987364
9774 1987364 2001803 2034152 2068283 2040727 2044690 2107752 2094308 2110855 2117712 2105890 2130575 2097768
9762 2097768 2117146 2183370 2177244 2192341 2228180 2196363 2269033 2208462 2229439 2282172 2288301 2277098
9750 2277098 2266918 2278956 2406560 2326377 2360659 2410606 2411466 2361387 2362494 2418684 2421720 2451400
9738 2451400 2459881 2488321 2503502 2510133 2566964 2485208 2578285 2564538 2602914 2651817 2646383 2680087
9726 2680087 2670073 2664040 2644230 2689774 2776094 2810725 2827746 2741851 2839143 2885839 2871092 2921921
9714 2921921 2905324 2912810 2943075 2967584 2995869 3073703 3088626 3093013 3103223 3134078 3155364 3183033
9702 3183033 3177852 3200783 3342800 3346113 3316513 3322729 3418797 3476572 3423107 3495542 3515452 3536246
9690C536246O2835m4721R9653L6969j0127P792P8112M2472N2095P6671m0478J29436
9678D026955m2328P3361N5907M4023J0902O1073Q5236M7345m793Q5393J06638
9667D549712P92P4899M138P8338Q2429O9425N3235P8012M3652R6605M1218P0283
9655E242738J40705Q462Q3318O2100Q3150J00227R8744J28745R6582J8940J48301
9644F212012R0231J13016J82543O9429J68841J11625J14939J15402J55669J98942
9634G532649J30522J38513J97256J45498K04177J58331K45066J77276L13475K35844
9624I478607L05808K73055J94639L61218L59815L26151L53895L68319M41810M65739
9614A2929056N38574M67762O29792O76699P07278P46720R06226R63053J018913
$$ plain form
9690 3536246 3599081 3554360 3654013 3690982 3680855 3688647 3766759 3809231 3861326 3937997 3897519 4026955
9678 4026955 3984627 4057988 4113895 4157918 4168820 4229893 4315129 4362474 4357681 4443074 4549712
9667 4549712 4550504 4625403 4629541 4707879 4790308 4859733 4912968 4990980 5034632 5131237 5172455 5242738
9655 5242738 5383443 5391905 5475223 5537323 5620473 5720700 5819444 5948189 6044771 6063711 6212012
9644 6212012 6302243 6415259 6597802 6667231 6836072 6947697 7062636 7178038 7333707 7532649
9634 7532649 7663171 7801684 7998940 8144438 8348615 8506946 8752012 8929288 9242763 9478607
9624 9478607 9784415 10057470 10252109 10613327 10973142 11299293 11653188 12021507 12463317 12929056
9614 12929056 13467630 13935392 14565184 15241883 15949161 16695881 17602107 18565160 19584073
9605A9584073J206367J408750J411157J782024J967047K216892K610833L220576
9597C5407719L710889M633169N899106P734163J0096150J5870975J6924104l580947
9589I6695328k3430027D058833h7955841k5035616K1583405J7341121J0956870
9582f3110061R343973P091001N398201M237937L511761K975342K560456K208214
9574b5783176J851632J630769J436202J257083J183368R13017R90175P26369O90209
9565a5104352P61195O58231N70075N05142N11808N20249L37258M15649L36658
9556a0488087M10452K91439L01734K75451K67446K60101K40197K09339J77030
9547h054898K30742K01809K44811J19701J98959J30838K17640J52909Q4915J51155
$$ plain form
9605 19584073 20790440 22199190 23610347 25392371 27359418 29576310 32187143 35407719
9597 35407719 39118608 43751777 49650883 57385046 67481196 83352171 100276275 96695328
9589 96695328 73265301 4058833 -87955841 -112991457 -91408052 -74066931 -63110061
9582 -63110061 -53766088 -46675087 -41276886 -37038949 -33527188 -30551846 -27991390 -25783176
9574 -25783176 -23931544 -22300775 -20864573 -19607490 -18424122 -17511105 -16520930 -15794561 -15104352
9565 -15104352 -14343157 -13684926 -13114851 -12609709 -12097901 -11577652 -11240394 -10824745 -10488087
9556 -10488087 -10077635 -9786196 -9484462 -9209011 -8941565 -8681464 -8441267 -8231928 -8054898
9547 -8054898 -7824156 -7622347 -7377536 -7257835 -7058876 -6928038 -6710398 -6557489 -6472574 -6321419
9537f321419J12377J81128J10712J53142N4971J02393J20960J19023L8532J10395
9527e217786J61063Q2030Q2530Q5562P0117O7914R3591R3797R4615K5522J40457
9516d220588n134M7624O3163N1260Q9376R241Q5445J22109L3966L6254R4869N6983
9504c535432J8141J6870L8294Q0543j1298Q1318M8557N9213O822M3061N5408o144
9492c104647R8765P4627J4M7272L4986j2942L9566O3217j9934J1795J03338L6514
9480b627429J864O2949o387R0058l9795O5927P0329m1046J01979O463K4953j5303
9468b305438j0805N0865j0240P5037K0068m6941J15486p2932M7237M5703M1269
9457b050691k2320L9522K5306N9364n2281R3454k6008j5128J6772L8082j0347
$$ plain form
9537 -6321419 -6209042 -6027914 -5917202 -5764060 -5709089 -5606696 -5485736 -5366713 -5328181 -5217786
9527 -5217786 -5056723 -4974693 -4892163 -4806601 -4736484 -4668570 -4574979 -4481182 -4386567 -4361045 -4220588
9516 -4220588 -4225722 -4178098 -4114935 -4063675 -3974299 -3965058 -3879613 -3757504 -3723538 -3687284 -3592415 -3535432
9504 -3535432 -3517291 -3500421 -3462127 -3381584 -3392882 -3311564 -3263007 -3203794 -3196972 -3153911 -3098503 -3104647
9492 -3104647 -3005882 -2931255 -2931241 -2883969 -2848983 -2861925 -2822359 -2759142 -2779076 -2767281 -2663943 -2627429
9480 -2627429 -2625565 -2562616 -2569003 -2478945 -2518740 -2452813 -2382484 -2423530 -2321551 -2315088 -2290135 -2305438
9468 -2305438 -2316243 -2265378 -2275618 -2200581 -2180513 -2227454 -2111968 -2184900 -2137663 -2091960 -2050691
9457 -2050691 -2073011 -2033489 -2008183 -1948819 -2001100 -1907646 -1933654 -1948782 -1932010 -1893928 -1904275
9446a904275K8220M7451r321J00321j8457j7925M2917N6160J1082J5539j4916
9435a663204M6678n1371J22959p8260N8404p4279Q4600k691r085J5255O2924L158
9423a484912K7511j22664M9036N9390m0317J27361r810J262P4022j00979j2065
9412a432165J01771K0351o511M4159q3303J2890L9568J2173M8197m32n578N8185
9400a190695k6789n1009O4381M0249r746Q9798p035p5091M0880j7171l8641N1497
9388a129372P6876l4818J4822R1155q0078l071M6341l4635J7353N16M0930j5805
9376a009786R133Q5809K0147q7987P6410o030j5j1956M3179l7161j999O569J3517
9363i00170K6874K7189l2969K264L9430Q282m0844K2629L1995K8918j6727j1163
$$ plain form
9446 -1904275 -1876055 -1828604 -1837925 -1737604 -1756061 -1773986 -1731069 -1674909 -1663827 -1648288 -1663204
9435 -1663204 -1616526 -1667897 -1544938 -1623198 -1564794 -1639073 -1554473 -1557164 -1566249 -1550994 -1488070 -1484912
9423 -1484912 -1457401 -1580065 -1531029 -1471639 -1511956 -1384595 -1394405 -1393143 -1319121 -1420100 -1432165
9412 -1432165 -1330394 -1310043 -1316554 -1272395 -1355698 -1342808 -1303240 -1291067 -1242870 -1243302 -1248880 -1190695
9400 -1190695 -1217484 -1268493 -1204112 -1163863 -1173609 -1083811 -1090846 -1165937 -1125057 -1142228 -1180869 -1129372
9388 -1129372 -1052496 -1087314 -1072492 -981337 -1061415 -1064486 -1018145 -1052780 -1035427 -1034911 -993981 -1009786
9376 -1009786 -1000653 -914844 -894697 -982684 -906274 -912304 -912319 -924275 -881096 -918257 -920256 -913687 -900170
9363 -900170 -873296 -846107 -879076 -876812 -837382 -829100 -869944 -847315 -815320 -786402 -803129 -814292
9351h14292J04800k4717K3085j3031J0096P1833l4092K5496k0178P1813J3776
9340e85411m7902J01125p0793M1170Q1532M2422j8429J48519N8469M8055n982
9329b07225r6235l53214l93820k32779J39699J5491J20784k0438J37892J4730
9319h75115r476J6739K5937R9701q7470N7259O2695k869m0561J8018M3357m8457
9307g40242Q1150l0132O7696k1334M0920k5152N0349k3593N1725q3007P1503L1688
9295e28429J1601p0737m962Q3879j0531L9435j36041J28482J7572r7278J02382
9284d64627p0378r290O9937l3585K2407J2333K7194k5702J6337k2764q885R261
9272d77762k8612P4426l0996N2674k952l7067n321k8429J05153o4446J7000K7939
$$ plain form
9351 -814292 -709492 -734209 -711124 -724155 -714059 -642226 -676318 -650822 -671000 -599187 -585411
9340 -585411 -633313 -532188 -602981 -561811 -480279 -437857 -456286 -307767 -249298 -201243 -207225
9329 -207225 -303460 -656674 -1050494 -1283273 -1143574 -1128083 -1007299 -1027737 -889845 -875115
9319 -875115 -884591 -867852 -841915 -742214 -829684 -772425 -709730 -712599 -753160 -735142 -691785 -740242
9307 -740242 -659092 -689224 -621528 -642862 -601942 -627094 -576745 -600338 -548613 -631620 -560117 -528429
9295 -528429 -516828 -587565 -592527 -508648 -519179 -479744 -615785 -487303 -469731 -567009 -464627
9284 -464627 -535005 -544295 -474358 -507943 -485536 -473203 -446009 -471711 -455374 -478138 -487023 -477762
9272 -477762 -506374 -431948 -462944 -410270 -413222 -450289 -455610 -484039 -378886 -443332 -426332 -398393
9260c98393L1778k6863J8996K6977J1761l2328O3663n3920K6145q8877Q2532o994
9248c45523j9524K7493n5407J19503l6107o1549O9812q477r430L7553L0615j5559
9236b66600m8530l0811O1651L8646l9033r187K1645M5642l1849m2220J9247P2892
9224b08507n3378l9229Q2318L1562j12380N8980M753l836K3460j339N5633o8573
9212b30536L7053n9837L9296J3768p916K6359n5292N8770L6148m5077k6736N6517
9200a57483l0401l1088L8869K4961k7853k6558O8436n2802i5593m6673q828N4776
9188i6318J1832m1361e9502r421p833p6864g5377o9725N2503k6795m4939R858
9176a54475d8346l0862b6856q0160a1289j0769l1498J3159n0328m8564N6379b9424
$$ plain form
9260 -398393 -366615 -393478 -374482 -347505 -335744 -368072 -304409 -358329 -332184 -421061 -338529 -345523
9248 -345523 -365047 -337554 -392961 -273458 -309565 -371114 -301302 -309779 -319209 -281656 -251041 -266600
9236 -266600 -315130 -345941 -284290 -245644 -284677 -293864 -272219 -226577 -258426 -300646 -281399 -208507
9224 -208507 -261885 -301114 -218796 -187234 -299614 -240634 -235881 -239717 -216257 -217596 -161963 -230536
9212 -230536 -193483 -253320 -214024 -200256 -208172 -181813 -237105 -178335 -142187 -187264 -214000 -157483
9200 -157483 -187884 -218972 -180103 -155142 -182995 -209553 -141117 -193919 -95593 -142266 -151094 -96318
9188 -96318 -84486 -125847 -59502 -68923 -76756 -153620 -75377 -145102 -92599 -119394 -164333 -154475
9176 -154475 -48346 -79208 -26856 -107016 -11289 -22058 -53556 -40397 -90725 -139289 -82910 -29424
9163c4571k7401M265H407c2216l4680L3229b203I253e3097J4431N672J5577k7761
9150d5178a358n9078K0934E0598c2815J3217B8290A4005m008b5718B8159K3071
9138E1230A1153K5270A6784P0097l5923B2524j758D351N5909j8074J0925Q829
9126F1940k9968M4472J859R319l4754N6256C2510j0585O694K1771K2030L8297
9114A10717L9617m1928M5369m8244K2134k7975L5785m2790k8243O7935q706R081
9102A32752l8452k5162M3465N9185p569j756l761R410l7095N4858J1672l3013
9090A64534l3093J9722L9240k3996j0222j3161O1093j5880J6272K1176j00780
9079A24905Q3090O094k8789R883N8014l3584M8884m9944L4729m7916P1793l2356
$$ plain form
9163 -34571 -61972 -57707 8407 -32216 -66896 -33667 -2203 9253 -53097 -38666 -32994 -17417 -45178
9150 -45178 -1358 -60436 -39502 50598 -32815 -19598 28290 14005 9997 -25718 28159 51230
9138 51230 11153 36423 16784 86881 50958 22524 20766 4351 60260 42186 53111 61940
9126 61940 31972 76444 78303 87622 52868 109124 32510 21925 28619 50390 72420 110717
9114 110717 150334 108406 153775 105531 127665 99690 135475 92685 64442 132377 123671 132752
9102 132752 94300 69138 112603 171788 164219 162463 158702 168112 131017 185875 197547 164534
9090 164534 131441 151163 190403 166407 156185 143024 204117 188237 204509 225685 124905
9079 124905 207995 214089 185300 195183 253197 219613 268497 218553 253282 205366 277159 244803
9067B44803n1636N0456N295n5501Q0723K0760l8257J7479N611L1743m3984k042
9055B65450m42R21J8940M4206o9700K6083N5666k1192J2415L489m4664K9353q881
9042C11644K8368m3859L0749K5195L5540k7401m1141K9789N9155o872q0778J07947
9030D28336p322p952J1642m1969O5007l8523R08n144J5251l0004N4621N9814q1185
9017D23480N0045l7923l6158J33200o6254j0312N2056o1704M9721K9615j5032
9006E10734k869M3372j442k2333O167j5732M9516l1057J8610o1273Q0914j6520
8994E58087N6516K023n7569J11056m56l8357N0203j2501l0172P5781m3597Q7863
8982G58877j0444n8215O187N4459J4727l934J15498j03181K3940N9192m4967O1846
$$ plain form
9067 244803 193167 243623 248918 193417 274140 294900 256643 274122 279733 311476 267492 265450
9055 265450 265008 265929 284869 329075 259375 285458 341124 319932 332347 335836 291172 320525 311644
9042 311644 340012 296153 326902 352097 387637 360236 319095 348884 408039 401167 320389 428336
9030 428336 421014 413062 424704 382735 447742 409219 410127 404983 420234 390230 444851 504665 423480
9017 423480 473525 435602 399444 532644 466390 456078 508134 446430 496151 525766 510734
9006 510734 507865 551237 549795 527462 533629 517897 567413 536356 554966 493693 574607 558087
8994 558087 614603 616626 559057 670113 669657 631300 681503 669002 638830 714611 671014 758877
8982 758877 748433 690218 696405 750864 765591 761657 877155 773974 797914 857106 812139 873985
8970H73985q2477K7860N6276k841N7394O3113p6238M6150m0703k3384O6497J30244
8958A095876o5151m506O9705l4365K9110L4268K4812l0829M8194J7642m8021O5071
8946A201806Q0310O1015O6901l7407J6652O9461O507M6703O5799M7037J08452
8935A733236J5312J32431L8347J58765K1965j02798O0309N0424O270L0719J14727
8924B259707r0238K9112j2934p7498k12828j91725l28855k13207k39177j36805
8914G85552j33273o6094n5516j15702k03232e6173k45536l36949l05257l36631
8904a280546j08759n6854j954J8758N5361k4637Q709k2379j17352k3980L3295
8893a520338N772K6025L2983J70380K4838R5969O2481Q4091L4786L9446Q5873
$$ plain form
8970 873985 791508 819368 875644 872803 930197 993310 917072 963222 922519 899135 965632 1095876
8958 1095876 1030725 1026219 1095924 1061559 1090669 1124937 1149749 1118920 1167114 1184756 1136735 1201806
8946 1201806 1282116 1343131 1410032 1372625 1389277 1458738 1465245 1511948 1577747 1624784 1733236
8935 1733236 1748548 1880979 1919326 2078091 2100056 1997258 2057567 2107991 2114261 2144980 2259707
8924 2259707 2169469 2198581 2185647 2108149 1895321 1703596 1374741 1161534 922357 785552
8914 785552 652279 586185 530669 414967 211735 -56173 -301709 -638658 -943915 -1280546
8904 -1280546 -1389305 -1446159 -1448113 -1429355 -1373994 -1398631 -1389922 -1412301 -1529653 -1553633 -1520338
8893 -1520338 -1514566 -1488541 -1455558 -1285178 -1260340 -1164371 -1101890 -1017799 -983013 -943567 -857694
8882h57694J15743k2093P0827J2406P3366K7121K534L0796J12881m6561J762N636
8870d73276p76J056J3956R3484L2461q343j026J9874N1691k2707l7834M2065k58
8857b89633a30971o4552O376L3515j6903k3024N6826q5773Q1868j7784r532O851
8845a63103K6417L4838K4897k0234c3352n5941M927c4487a1909k68A8745f3646
8832i3146M2809J6858B3780a28300b4684o736c00m1495o7668b2265j3340B5939
8819D79d6465K1114n9348C0892j4076d0955C59J8964N939M8403q073j4653M6650
8806I7589p720K6176k5182l3547L8782r431R858N525Q8554j3886m3107M1619k5601
8793A49629m1753M3918L9446k8794O9001k4111o9706L0938M6867q053Q0655o048
$$ plain form
8882 -857694 -741951 -764044 -693217 -680811 -607445 -580324 -577790 -546994 -434113 -480674 -478912 -473276
8870 -473276 -474052 -472996 -459040 -365556 -333095 -341438 -342464 -322590 -270899 -293606 -331440 -289375 -289633
8857 -289633 -130971 -195523 -189147 -155632 -172535 -195559 -138733 -224506 -142638 -160422 -169954 -163103
8845 -163103 -136686 -101848 -76951 -97185 -33352 -89293 -84366 -34487 -11909 -12177 18745 -63646
8832 -93146 -50337 -33479 23780 -128300 -24684 -31420 -300 -41795 -109463 -22265 -35605 25939
8819 479 -46465 -25351 -84699 30892 16816 -40955 359 19323 25262 73665 65592 50939 97589
8806 97589 89869 116045 90863 57316 96098 86667 96525 102050 190604 176718 133611 175230 149629
8793 149629 107876 151794 191240 162446 231447 207336 137630 168568 215435 207382 288037 281989
8781B81989o2090P2849o7183R8310n993n3075k3648P7419J7293K0301k1544O4700
8769C99328p2379N6446J1215N204j5642K5916r603l8789J08387j19491R8928j2137
8757D37383J2598O6265j7397r2044O1468R4859J4583o2507Q2643J1851P742O2808
8745F80252n0755K3566L0322L8007m055j5398O8784O3381J4508j3605P4971r381
8733I00597J2720J10810O6619M8399J21551K19J42333R8012J51543J18630J82218
8722A953651J91623K1488j4178k43196o98764D72490b64187k53596J13232i1031
8711C02873L19354K25024L175k62091c1184q04466p91296l73062M0813K64492
8701a694703K82203K39485J92922Q8776N2126M8469J36352P3310J3243M6517R359
$$ plain form
8781 281989 219899 292748 225565 323875 317882 264807 241159 318578 335871 356172 334628 399328
8769 399328 326949 383395 394610 399814 384172 410088 400485 361696 470083 350592 449520 437383
8757 437383 449981 516246 498849 406805 468273 563132 577715 515208 597851 609702 617444 680252
8745 680252 629497 653063 683385 721392 717337 701939 770723 834104 848612 835007 909978 900597
8733 900597 913317 1024127 1090746 1139145 1260696 1260915 1403248 1501260 1652803 1771433 1953651
8722 1953651 2145274 2166762 2152584 1909388 1210624 472490 -264187 -517783 -404551 -91031
8711 302873 622227 847251 850426 588335 -31184 -835650 -1626946 -2000008 -1959195 -1694703
8701 -1694703 -1412500 -1173015 -980093 -891317 -839191 -790722 -654370 -581060 -567817 -521300 -511941
8690e11941J17124O5320j9674J05486L675k2205N7362L5450j8520O2223m4672
8679a70372N940l893M7600M8577m3545e5160k3023K6926J290j0034B1439R065
8667C0504c4129j2724F4748k8680K6197k131j0853J470B274R5772m7241O9019
8655A19824l5220J7521j1122N6134o3966M0035L7728R503m4422L5683n0797m371
8643A06530L7160k9128R1387l2532n1042k4447P3713l001K1511L7811l4425k9678
8631A63859j7750L607M2532N8444k8074p7229J40850r2056P2926j8851L7891J2239
8619B98388K2542n6573p3495P9940K0942m4122m7670M9669K7405J9263r1107O4292
8607B69474K364l0635R6329q3212m7345J05359j9292q543j3625J5551J4298L8905
$$ plain form
8690 -511941 -394817 -329497 -349171 -243685 -240010 -262215 -204853 -169403 -187923 -125700 -170372
8679 -170372 -164432 -168325 -120725 -72148 -115693 -55160 -78183 -51257 -49967 -60001 21439 30504
8667 30504 -34129 -46853 64748 36068 62265 60134 49281 50751 2274 98046 50805 119824
8655 119824 84604 102125 91003 147137 83171 123206 160934 170437 126015 161698 110901 106530
8643 106530 143690 114562 205949 173417 122375 97928 171641 168640 190151 227962 193537 163859
8631 163859 146109 149716 192248 250692 222618 145389 286239 194183 267109 248258 286149 298388
8619 298388 320930 264357 190862 270802 291744 247622 199952 249621 277026 296289 205182 269474
8607 269474 271838 241203 337532 254320 206975 312334 293042 284499 270874 286425 300723 339628
8595C39628n8863N0519m3668N6641l4897k2307J8888j9430O1361j9717K9696k1638
8583C36213M4021o531K0370r0683R7516j0898k9686o372M3699l8062j8810p246
8571C33531L8015r4125Q3649J1325k5904K5099K4087o5621M9630l7238L9634j6053
8559C66029L4177o100k0710J06768p7028K661k9907O677O7987j9175m681L2938
8547D59636r5996M4435M115j8360O5292j3943N6438r2508J12324m7032l1718o9504
8535C73179P5883P3776n7917J4879k8375k6229J9744J4301j7266L0551k0000j3625
8523D38901L3676n513j8418N131K5985R695p3019M1803M3195j2484M946O3727
8511E57625o2587K9005k3091K2476L0523r4913M2376K248n6359O4647K3059L8230
$$ plain form
8595 339628 280765 331284 287616 344257 309360 287053 305941 286511 347872 328155 357851 336213
8583 336213 380234 373703 394073 303390 400906 390008 360322 353950 397649 359587 340777 333531
8571 333531 371546 277421 361070 372395 346491 371590 395677 330056 379686 342448 382082 366029
8559 366029 400206 394106 373396 480164 403136 405797 375890 382567 450554 431379 426698 459636
8547 459636 363640 408075 412190 393830 459122 445179 501617 409109 521433 474401 442683 373179
8535 373179 449062 522838 464921 479800 451425 425196 444940 459241 441975 472526 452526 438901
8523 438901 472577 467064 448646 453777 479762 489457 416438 458241 501436 488952 493898 557625
8511 557625 495038 524043 500952 523428 553951 459038 501414 503662 447303 511950 535009 573239
8499E73239j08112j1629j2352J7089N4179L5996n2361L6447n916j9263P37O6079
8487E74133m9868K8454l4005k7551l227O8755k3570m8703N1707J7889J4067k9690
8475E38391J9561p468L1817J6743m1881L2810l0633j7291q817M8722j0823k0423
8463E50708K0959j4765P4114m8222j8854j1803O7116j0609J8465K337n0591N573
8451E84428L7290n100o597o995J6741m3855Q8839p1346L9872o282q2786N3753
8439E97962k6462M9422k2627L8766m0300M8378O6256o3136o5476N7834k1004M9984
8427F69597N1632q9398j7747j8971M043M5896L0092n9650j941j1344M7041j3252
8415F35998m9753R5277p4351O1022q6830r524k7718L2914K6809l3301J06891p1751
$$ plain form
8499 573239 465127 453498 441146 458235 512414 548410 496049 532496 526580 507317 508054 574133
8487 574133 524265 552719 518714 491163 487936 556691 533121 484418 536125 554014 568081 538391
8475 538391 557952 550484 582301 599044 557163 589973 559340 542049 533232 581954 571131 550708
8463 550708 571667 556902 631016 582794 563940 552137 619253 608644 627109 629446 578855 584428
8451 584428 621718 616618 610021 603026 619767 575912 664751 593405 633277 626995 544209 597962
8439 597962 571500 620922 598295 637061 596761 645139 711395 648259 582783 640617 619613 669597
8427 669597 721229 631831 614084 595113 599156 645052 675144 615494 613553 602209 649250 635998
8415 635998 586245 681522 607171 668193 581363 571839 544121 577035 603844 570543 677434 605683
8403F05683k2205J4818l9668M0438o2566J09899p1445P8841j0445l1551J6777
8392F28576l4617O4329n1959K4301N5360l4366j5304k2826O1602j0249k6484J2304
8380F50667n7846P9801K4256n5878M0797k4481K8988r808J245J1211l7214M3512
8368F95250k846R390K4767k9583n7163M5145n394K7012m8238L4224K1579q107
8356G06036J8610j8122q865K4342o026m676K1902n9582M2103O985O4099p3905
8344G12901N780L9592j2981L431m6667J1005J312R5645p3297R601r5537R4722
8332G45507J1384l2211J6864P936l064P0738q1144L4209j5358L3383p3276M3519
8320G58487R7437p0525j0979n6786N2798J069J3923M0434J8267r8604L7690N816
$$ plain form
8403 605683 583478 598296 558628 599066 536500 646399 574954 653795 643350 611799 628576
8392 628576 593959 658288 606329 630630 685990 651624 636320 613494 675096 664847 638363 650667
8380 650667 592821 672622 696878 641000 681797 657316 686304 676496 677741 688952 651738 695250
8368 695250 692404 701794 726561 696978 639815 684960 679566 706578 658340 692564 714143 706036
8356 706036 724646 706524 697659 722001 715975 711299 733201 673619 715722 722707 786806 712901
8344 712901 718681 758273 745292 748723 702056 713061 714373 810018 736721 746322 650785 745507
8332 745507 756891 724680 741544 749480 746416 817154 736010 770219 754861 788244 714968 758487
8320 758487 855924 785399 774420 717634 770432 771501 785424 825858 844125 745521 783211 789027
8308G89027Q1180j14111M4616R003J6078m2034L7504l7997O1194l9307J9169J1657
8296H35979p409L4592l9520m7472P5044l5761K2869M4034l7026m6231K0926j8113
8284H01912P5387q1189R0806m1469K137l35M8495o5841P8027R64q0394N1076L0819
8271I10395p874k2038m666m3715M5322k3063J8302j436Q257K8523R493j5048j6847
8258H85605J4507J2600m4124P5258k4316k1135M5891k9786l4328j094J00075L824
8246I82977m2827P0188k2994k6412P731J3693o6877J12725m5599k5606O7307q7127
8234I37179J33098o6622l662J5078K700Q98K555K5586j3792m4961P598l6300N0487
8221A009842L1984m2432J4950o1802M2216L6589m5274j1058j2401J400l2799j3034
$$ plain form
8308 789027 870207 756096 800712 809715 825793 783759 821263 783266 844460 805153 824322 835979
8296 835979 828570 863162 823642 776170 851214 815453 838322 882356 845330 799099 820025 801912
8284 801912 877299 796110 886916 845447 847584 847249 895744 829903 907930 908894 828500 879576 910395
8271 910395 902521 880483 875817 832102 877424 854361 872663 871227 879484 908007 917500 902452 885605
8258 885605 900112 912712 868588 943846 919530 898395 944286 914500 880172 879078 979153 982977
8246 982977 940150 1010338 987344 960932 968663 982356 915479 1028204 982605 956999 1024306 937179
8234 937179 1070277 1003655 999993 1015071 1017771 1018669 1021224 1046810 1033018 988057 995655 959355 1009842
8221 1009842 1041826 999394 1014344 952542 994758 1031347 986073 975015 962614 964014 931215 918181
8209I18181L9528k3840J9851n9366L7381k539J5825K7600k626r0629L0574M9779
8197I59719n6770m2206L2689K7846J48954j79029P30860j55402o44007K26628
8187A049282j8679P3353o9275Q589M3130o0102N1633o2233P8837k8086l700L7301
8175A100050o185k1996L6155o9155Q1430j24715J11230n399m3655M3973m0860
8164A060873l349o113M5844l050J0505m447J2042m934n9360L04N2860m5355L7804
8151A093624k7233L3728r9855N0212L955o0273K1511L6083J0903l2471k7889L509
8139A005804N1897l7669L9898j4384P835n3945M1398k0825P1579p211n8421K2487
8127A048443l8769M4746q272M039K7204j1691N911j4799L3152n1728Q0828q8059
$$ plain form
8209 918181 957709 933869 953720 894354 931735 929196 945021 972621 969995 879366 909940 959719
8197 959719 902949 860743 893432 921278 1070232 891203 1622063 1466661 822654 1049282
8187 1049282 1030603 1103956 1034681 1043270 1086400 1026298 1077931 1015698 1094535 1066449 1062749 1100050
8175 1100050 1093865 1071869 1108024 1038869 1120299 995584 1106814 1101415 1057760 1101733 1060873
8164 1060873 1057524 1051411 1097255 1094205 1104710 1100263 1112305 1107371 1048011 1048315 1101175 1055820 1093624
8151 1093624 1066391 1100119 1000264 1050476 1054431 994158 1015669 1051752 1062655 1030184 1002295 1005804
8139 1005804 1057701 1020032 1059930 1045546 1053381 999436 1040834 1020009 1091588 1084377 1025956 1048443
8127 1048443 1009674 1054420 1046148 1050187 1077391 1065700 1071611 1056812 1089964 1038236 1119064 1031005
8115A031005j7567O1246M0908m0072L9753P592m41J1829O5667J8317j8577k8293
8103A171367N2095K3622J6806p6740K2871R4708m5294J7017l4962J902Q141k4298
8091A227235J11027Q082L4714J993J0575O6942j3636Q7515q833P060O4526N5365
8079A652565L7438o453L8643J39446L8903J99119J65590K34548q85k71416p44021
8068A483477E46068A3587J74799K02441K00253K13516N2855Q8140J09133J7272
8058A071996J25741O8572J32412O0419J07584J28452J5848k8993J00525J14610
8048A897166O8069j56715n75527B31043e46757L8519K53869I996J78917R9968
8038B88881R4170j1301J17294Q2285o117J45451K4959J04071j4256o5509j6413
$$ plain form
8115 1031005 1013438 1074684 1115592 1075520 1115273 1122865 1122424 1134253 1199920 1218237 1199660 1171367
8103 1171367 1223462 1247084 1263890 1187150 1210021 1304729 1259435 1276452 1241490 1243392 1251533 1227235
8091 1227235 1338262 1346344 1381058 1383051 1393626 1460568 1446932 1534447 1525614 1532674 1597200 1652565
8079 1652565 1690003 1683550 1722193 1861639 1900542 2099661 2265251 2499799 2498914 2227498 1483477
8068 1483477 546068 13587 188386 390827 591080 804596 857451 945591 1054724 1071996
8058 1071996 1197737 1266309 1398721 1459140 1566724 1695176 1711024 1682031 1782556 1897166
8048 1897166 1965235 1808520 1232993 231043 -546757 -508238 -254369 9996 188913 288881
8038 288881 383051 371750 489044 571329 565212 710663 735622 839693 825437 759928 743515
8027G43515j31372k4704q4954N8726P7362M1177l71M2661k1669L6595O3374P442
8015H07782j9025N8067n648o6453O2557L3282l5208J7601R3432j2289J013L8847
8003I73958n3440M912O4044j4189k526q707K9040j0107O23M4682j2848n082K6941
7990A037301J0268J9260O63N769J3983j3343j8215R3561n4678k1318R1936m5966
7978A119221m806O2414n0135P6033o7301O9607o8469l5917J41882l6413K0695
7967A226811P473m184l7858L0598J6506j9719N6691m4257L3465J12479p7173L8230
7955A339062M7211R879N189n7465l573M0333q8494k8029P93Q2523j3560j5996
7943A317873O5425m1875k9327p2165p6958j233J9012L557L1667l1251P088M1230
$$ plain form
8027 743515 612143 587439 502485 561211 638573 679750 679379 722040 700371 736966 800340 807782
8015 807782 788757 846824 841176 774723 837280 870562 835354 852955 946387 934098 935111 973958
8003 973958 920518 925430 989474 975285 972759 964052 993092 982985 983608 1028290 1015442 1010360 1037301
7990 1037301 1047569 1066829 1067492 1073261 1087244 1073901 1055686 1149247 1094569 1073251 1165187 1119221
7978 1119221 1114415 1176829 1126694 1202727 1135426 1205033 1136564 1100647 1242529 1206116 1226811
7967 1226811 1234284 1230100 1192242 1222840 1239346 1219627 1276318 1232061 1265526 1378005 1300832 1339062
7955 1339062 1386273 1396152 1401341 1343876 1340303 1380636 1292142 1264113 1264906 1347429 1333869 1317873
7943 1317873 1383298 1341423 1312096 1239931 1162973 1161740 1180752 1184309 1215976 1184725 1191813 1233043
7931A233043K8198k6768N7089O3570l0187l6073J00237L845l4291L3293j1639
7920A380317Q4503j4687n2431o714J5678J0743P6049p0611N3659P7733q8118N990
7908A472111j1495m9731N4822J4526q839O7648n2757P640l0076j64221L3463l341
7896A329750j1405k8918P6873M8908l608p6159Q6044K7589l2799K144K0788L450
7884A442657R567O1348L8622o0391N1385j7088l5534M4754J1562M5257M5652Q599
7872A646390O5810k7157q832J2761l8645K5228K681K7992J05630k7760J7928j3122
7860A788904q706N101n5483k0993M8921O9889M7818r831K4683p3550O7469R3920
7848A978142q8681N6566Q4065Q4747r9850R2720L0966J3755M3781O6578J28124
$$ plain form
7931 1233043 1261241 1234473 1291562 1355132 1324945 1288872 1389109 1392954 1358663 1391956 1380317
7920 1380317 1464820 1450133 1397702 1390988 1406666 1417409 1493458 1422847 1476506 1554239 1466121 1472111
7908 1472111 1460616 1410885 1465707 1480233 1471394 1539042 1486285 1493925 1463849 1299628 1333091 1329750
7896 1329750 1318345 1289427 1366300 1415208 1411600 1335441 1421485 1449074 1416275 1418419 1439207 1442657
7884 1442657 1452224 1513572 1552194 1491803 1543188 1526100 1490566 1535320 1546882 1592139 1637791 1646390
7872 1646390 1712200 1685043 1676211 1688972 1650327 1675555 1678236 1706228 1811858 1784098 1802026 1788904
7860 1788904 1780198 1785299 1729816 1708823 1757744 1827633 1875451 1865620 1890303 1816753 1884222 1978142
7848 1978142 1889461 1946027 2030092 2114839 2014989 2107709 2138675 2152430 2196211 2262789 2390913
7837B390913M910R9643l6360P6538J58849J8865J73411J01931J74764J78066J61549
7826C503079K41373L04134M72970L94002K03670l98427j220699A708586g4222
7816a365411j26408M48988M82827a15986B07112K82696K56936K25976K72735J78120
7806A423575K46055K13934K62846L60248M26562M39006M63400M1382n38244j414423
7796A924341F3161a781808j119897j1437N58059M75391M04683K41823K30685J29239
7786h73262K40842J04854J25209N2491J69989g5243a5868A7937P0822P7418J2796
7775A78973J28217K1589J5979P6501k1650J7323P4144M5030n3023R8208K1017
7764F02308j2178k94P684J03301k4077K3445L768N6038k9548K1061K7911P7495
$$ plain form
7837 2390913 2395823 2495466 2459106 2535644 2694493 2713358 2886769 2988700 3163464 3341530 3503079
7826 3503079 3744452 4048586 4521556 4915558 5119228 4720801 3500102 1708586 -74222
7816 -1365411 -1491819 -1042831 -560004 -115986 207112 489808 746744 972720 1245455 1423575
7806 1423575 1669630 1883564 2146410 2506658 2933220 3372226 3835626 3877008 3338764 1924341
7796 1924341 63161 -1781808 -2901705 -2913142 -2355083 -1879692 -1475009 -1233186 -1002501 -873262
7786 -873262 -632420 -527566 -402357 -349866 -179877 -75243 -15868 17937 88759 166177 178973
7775 178973 307190 328779 344758 421259 399609 416932 491076 536106 483083 581291 602308
7764 602308 590130 589836 597520 700821 676744 700189 703957 759995 730447 751508 779419 856914
7752H56914o2220K3110m6558Q4657p060L8665l4132P6228j4983J472P5958m5411
7740I46640K6799k6780L0039k4509O712R4383k3579o3062Q5509k3092K3568j8982
7728A033646M7354n442M6987k7402L3991q4524R6290m4679l5872J20301L6599
7717A217249n6424J0261M98J7117j4203M878k0019P9162m6239O1459l512L7279
7705A287506l9676j6173N9350j03259J05838k2796K2596M2907J1272o0848K9633
7694A316350M8160k6922N7125m290p3312K8633M9848N242K5472K3919j6160J10063
7682A544128J6796m0706k7442j53554o8733j7149o0822L6756L9904P3385n8037
7671A284526L3865K7184M5497o6534O1908K6024J637J02813o6519N4487p235K8138
$$ plain form
7752 856914 794694 817804 771246 855903 848843 887508 853376 929604 914621 916093 992051 946640
7740 946640 973439 946659 976698 952189 958901 1053284 1029705 966643 1052152 1029060 1052628 1033646
7728 1033646 1081000 1075558 1122545 1095143 1129134 1044610 1140900 1096221 1060349 1180650 1217249
7717 1217249 1160825 1171086 1171584 1188701 1174498 1179376 1159357 1238519 1192280 1253739 1250227 1287506
7705 1287506 1247830 1231657 1291007 1187748 1293586 1270790 1293386 1336293 1347565 1286717 1316350
7694 1316350 1364510 1337588 1394713 1390423 1317111 1345744 1395592 1400834 1426306 1450225 1434065 1544128
7682 1544128 1560924 1520218 1492776 1339222 1270489 1253340 1192518 1229274 1269178 1342563 1284526
7671 1284526 1318391 1345575 1391072 1324538 1386446 1412470 1414107 1516920 1450401 1504888 1497653 1525791
7659A525791L0365j16709M4057o7476q3442j20975J63982n6900R647k3213P3316
7648A378443L7743L6856j3747N5401K751M4174K8111r056j8669p6627o9089j7379
7636A378912m6292J4411L1683j4165K2577j5619M6258M1940l4262L8857J2150
7625A476450j1199p664J44613r7757R2217K1256o60p4049m3945J7237j17561l3332
7613A365606L4534J4753O7443J4109L8164k2105K767n544l822M7530R135N6173
7601A618743o5162O2461j2539k8327J3521n5829L4130m357Q9682j4943k7734K5934
7589A635580l6041L5562j9813K9080R07P4270l7639j5733O1025j34270Q7464J0991
7577A691383k0083K2743k2059M403M0892k8318M0986J0497j9198j8182M5616k7057
$$ plain form
7659 1525791 1556156 1439447 1483504 1416028 1332586 1211611 1375593 1318693 1328340 1305127 1378443
7648 1378443 1416186 1453042 1439295 1494696 1497447 1541621 1569732 1560676 1542007 1465380 1396291 1378912
7636 1378912 1332620 1347031 1378714 1364549 1387126 1371507 1417765 1459705 1425443 1464300 1476450
7625 1476450 1465251 1457587 1602200 1504443 1596660 1617916 1617256 1543207 1499262 1516499 1398938 1365606
7613 1365606 1400140 1414893 1482336 1496445 1534609 1512504 1515271 1509727 1505905 1553435 1562570 1618743
7601 1618743 1553581 1616042 1603503 1575176 1588697 1532868 1566998 1562641 1652323 1637380 1609646 1635580
7589 1635580 1599539 1635101 1615288 1644368 1645275 1719545 1681906 1666173 1727198 1592928 1680392 1691383
7577 1691383 1671300 1694043 1671984 1676387 1717279 1688961 1729947 1740444 1721246 1703064 1748680 1721623
7565A721623R5944j09480N3521k195M6185m5061O3122n5926J2674l32J9187L4254
7553A833516j408j4661p5341P1100q387K1858J6483m0715m0954M6798J8744o041
7541A820992M3842r178m1405J2607J2809j0386L8455N142l4571k6545J9218J692
7529A832672L3294j7478L6243n1353M3875n0569N2527l0787N9503M851J7918J7638
7517A948334l939M4273q6788L1391M5848J3450m488l1449R4009l9888j127L4496
7505B044122J228k9901m396L7148K366J2832q4068P6882n7926M3932k0769j0694
7493B010756k9209J5240L9727K8420m8871R1579n3566L4224K7917Q131J4265l0196
7481B108417j4890m8481P7097M7007k860k5587K3088l4497K4277P763M2653j1639
$$ plain form
7565 1721623 1817567 1708087 1761608 1759413 1805598 1760537 1823659 1767733 1780407 1780075 1799262 1833516
7553 1833516 1832108 1817447 1742106 1813206 1804819 1826677 1843160 1802445 1761491 1808289 1827033 1820992
7541 1820992 1864834 1855656 1814251 1826858 1839667 1829281 1867736 1872878 1838307 1811762 1830980 1832672
7529 1832672 1865966 1848488 1884731 1833378 1877253 1826684 1879211 1848424 1907927 1912778 1930696 1948334
7517 1948334 1944395 1988668 1901880 1933271 1979119 1992569 1988081 1956632 2050641 2010753 2009626 2044122
7505 2044122 2045350 2015449 2011053 2048201 2050567 2063399 1979331 2056213 1998287 2042219 2021450 2010756
7493 2010756 1981547 1996787 2036514 2064934 2016063 2107642 2054076 2088300 2116217 2124348 2138613 2108417
7481 2108417 2093527 2045046 2122143 2169150 2166290 2140703 2163791 2129294 2153571 2161334 2203987 2192348
7469B192348P1244n752k3883M6721j18162J4930M6734L7613j7690l1890P2833
7458B285046J8880k5949j0786P8244q7337j0289Q2579q462m8613Q6280k9866l7108
7446B292619J9868l970l3205Q6847j0818N1345m6815N8622n8016L5444m2680M1362
7434B390603m8749K237J6808O1411n8581M1161Q8588p5876M0522J0277L5527K1473
7422B525401k241J330O885M9406R05n7753N4163p5448N2023l6570M2627L3717
7410B594445n3212M4364k6376L7561N0840r0011n167N2472k2254L4303r558K8629
7398B636036R627j4039N9794n3515M7790K6065M0475q7459M5672L761q043N1130
7386B757294k7658P9295q6555N5226O388N8225n2612N731N2509k3444L0788J9281
$$ plain form
7469 2192348 2263592 2257840 2233957 2280678 2162516 2177446 2224180 2261793 2244103 2212213 2285046
7458 2285046 2303926 2277977 2267191 2345435 2258098 2247809 2330388 2321926 2273313 2359593 2329727 2292619
7446 2292619 2312487 2308517 2275312 2362159 2351341 2402686 2355871 2414493 2356477 2391921 2349241 2390603
7434 2390603 2341854 2344091 2360899 2422310 2363729 2404890 2493478 2417602 2458124 2468401 2503928 2525401
7422 2525401 2523160 2524490 2531375 2580781 2581686 2523933 2578096 2502648 2554671 2518101 2560728 2594445
7410 2594445 2541233 2585597 2559221 2596782 2647622 2557611 2552444 2604916 2582662 2616965 2607407 2636036
7398 2636036 2645663 2631624 2691418 2637903 2685693 2711758 2752233 2664774 2710446 2714207 2706164 2757294
7386 2757294 2729636 2808931 2722376 2777602 2783990 2842215 2789603 2795334 2847843 2824399 2855187 2874468
7374B874468J1887k1315J29057n2137K5049O2704m5580K9023j4900L6723j3514
7363C021465M6643k4011J2457O477O470Q5734m8353N0429O6184l1145j5679R114
7351C185785J8171J9342l8826K9190Q9089k9923O1294J5166m6724M7220l1313
7340C318471k0789K0037k0253J06621q9070R6665m7772j7904j7420Q4545l2578
7329C380553Q33Q6823K2425M6580p7858Q4425o063o010N4343O444M933J21570
7317C718998o173M7759k555m4865L5326k4314L0520K8574j7752N1774n248L8529
7305C850573k2855Q08O3889N3122m2984M2720j467N1420J0825r511N0556J03886
7293D150982k3964L3558M1347M7685J3294J01830K7479M3890Q887K3722Q7963
$$ plain form
7374 2874468 2886355 2865040 2994097 2941960 2967009 3029713 2984133 3013156 2998256 3034979 3021465
7363 3021465 3068108 3044097 3056554 3063031 3069501 3155235 3106882 3157311 3223495 3192350 3176671 3185785
7351 3185785 3203956 3223298 3184472 3213662 3302751 3272828 3334122 3349288 3302564 3349784 3318471
7340 3318471 3297682 3317719 3297466 3404087 3315017 3411682 3363910 3346006 3328586 3413131 3380553
7329 3380553 3381386 3468209 3490634 3537214 3459356 3543781 3537718 3531708 3586051 3592495 3597428 3718998
7317 3718998 3712825 3760584 3758029 3713164 3748490 3724176 3754696 3783270 3765518 3817292 3812044 3850573
7305 3850573 3827718 3828526 3892415 3945537 3902553 3945273 3943806 3995226 4006051 3996540 4047096 4150982
7293 4150982 4127018 4160576 4201923 4249608 4262902 4364732 4392211 4436101 4444988 4468710 4556673
7282D556673J01263k7536J01505J9693l031J06631j2161J15491K8572J20689J2938
7271E120727J13750N9272m467j5158m917P5199R8817K1398N2046J51184J02178
7260E770029L3497O0837N7292J12958N2830O7150J10947J59726J11142J39680
7250F676088N6233q6836m10572m39905k65352J51443J88056K28754k94720n84270
7240E218919n96699l06492P0654J92299J12861J6655J5676M4123M6435J28664
7230D943095J0018Q5248j08091k17015j06305k6534M4288M5808J74832K24898
7220E070242K88791J65789K48891L57049L92397N12364K49302p6411n41903o90051
7210E976460m50842J03741L54893J36407l26406n05538k63147K83719O79404L27681
$$ plain form
7282 4556673 4657936 4630400 4731905 4751598 4748567 4855198 4843037 4958528 4987100 5107789 5120727
7271 5120727 5234477 5293749 5289282 5274124 5269207 5344406 5443223 5464621 5516667 5667851 5770029
7260 5770029 5803526 5864363 5921655 6034613 6087443 6154593 6265540 6425266 6536408 6676088
7250 6676088 6732321 6645485 6234913 5795008 5529656 5681099 5869155 6097909 5803189 5218919
7240 5218919 4622220 4315728 4386382 4578681 4691542 4708197 4723873 4767996 4814431 4943095
7230 4943095 4953113 5038361 4930270 4713255 4606950 4580416 4624704 4670512 4845344 5070242
7220 5070242 5359033 5524822 5773713 6130762 6523159 7035523 7284825 7208414 6666511 5976460
7210 5976460 5525618 5629359 5984252 6120659 5794253 5288715 5025568 5309287 5988691 6316372
7200F316372l90012j343593j759001A230948B45630r9158N99416Q87723P70333
7191B403944J98589m42795I53577e62128j251381r37709j72998M60632O19913
7182a843671N80510L98635L60138b30377a1732C39248K24339J95921K17326J35339
7172A112173Q5568J53992J52934K99217J52394J69510J04080k2851k4950J87105
7162B369172J81548J46607K17950J40389J91390J51232J19725J46730J84657J64397
7152D013797M9095J56439k8250J07945J25033J52662J10089J79549J91882J13392
7142E171633K10475K17791K28513P5096l30333n46397n94412l32116J43367K43375
7132D486992K98370o0462j35886k94520j25495K9870Q34k50021m19138m20584
$$ plain form
7200 6316372 5926360 4582767 2823766 1230948 245630 146472 745888 1633611 2403944
7191 2403944 2602533 2159738 953577 -562128 -1813509 -2751218 -2924216 -2463584 -1843671
7182 -1843671 -1263161 -864526 -504388 -230377 -11732 339248 563587 759508 976834 1112173
7172 1112173 1197741 1351733 1504667 1803884 1956278 2125788 2229868 2207017 2182067 2369172
7162 2369172 2550720 2697327 2915277 3055666 3247056 3398288 3518013 3664743 3849400 4013797
7152 4013797 4062892 4219331 4191081 4299026 4424059 4576721 4686810 4866359 5058241 5171633
7142 5171633 5382108 5599899 5828412 5903508 5573175 5026778 4432366 4100250 4243617 4486992
7132 4486992 4785362 4724900 4589014 4294494 4168999 4198869 4199703 3949682 3530544 3109960
7122C109960j49201K44299M25413L76564M22309M39046L89559K47491j22938m77381
7112D905121p25053p28640m23224j28804J26602J63673R0555J70008M8225m4239
7102C454224j0820R7580N2698N2182R997J8347m3099k1108j3589J20382K13051
7091C929845J54632J05123j11547m26985o19666n23715m29615k79157k06736M9168
7081A641347L35309J70120K56016o0745k6813l23646m48861o39548C6981i18751
7070a565475j00176L16429L85250M34318a49768C87890N26205O19217N26399L78364
7060B438075p3984o99211D10700e89064l8832b43877B42147L44309K37946L50612
7050A175014L38749P5046j34503q1730K82608L00286P4093n2943Q1771K85987
$$ plain form
7122 3109960 2960759 3205058 3630471 4007035 4429344 4868390 5257949 5505440 5382502 4905121
7112 4905121 4180068 3451428 3028204 2899400 3026002 3189675 3280230 3450238 3498463 3454224
7102 3454224 3443404 3540984 3593682 3645864 3655861 3674208 3631109 3610001 3596412 3716794 3929845
7091 3929845 4084477 4189600 4078053 3651068 3031402 2507687 2078072 1798915 1592179 1641347
7081 1641347 1976656 2146776 2402792 2342047 2315234 1991588 1542727 903179 36981 -918751
7070 -1565475 -1665651 -1349222 -963972 -529654 -149768 387890 914095 1533312 2059711 2438075
7060 2438075 2364091 1664880 410700 -589064 -627896 -243877 242147 586456 824402 1175014
7050 1175014 1513763 1588809 1454306 1372576 1655184 1955470 2029563 1976620 2058391 2344378
7040B344378K59149k69420p34415F55033B83352J49687M30837M09198N22185L59619
7030B154878L37339J61296K46157K52716M34889L25585L44478j55311k40149m29561
7020C432317k23244r9611L43022K91806k38757r13081j291377E22346j99062c4492
7009e91840n90509m74868K18931g05896I8757Q29475N71293M26525k36726G00757
6998g65896j445121j181889k67003N03095O54508N01429N32001M85295L75075
6989f08506b22450B15927M30585L97785M19289L10366M81489L12756K85712K92349
6979C146258J80228K36275Q4133J32847J32900k42973n46080p17306q99803F64819
6968H2367d12182m41809m25328l04153l11046l0311K65225L35361J14856R6470
$$ plain form
7040 2344378 2603527 2334107 1599692 655033 283352 433039 863876 1273074 1795259 2154878
7030 2154878 2492217 2653513 2899670 3152386 3587275 3912860 4257338 4102027 3861878 3432317
7020 3432317 3209073 3109462 3452484 3744290 3505533 2592452 1301075 522346 323284 -34492
7009 -591840 -1182349 -1657217 -1438286 -705896 98757 928232 1499525 1926050 1689324 700757
6998 -765896 -2211017 -3392906 -3659909 -3156814 -2502306 -2000877 -1468876 -983581 -608506
6989 -608506 -222450 215927 646512 1044297 1463586 1773952 2255441 2568197 2853909 3146258
6979 3146258 3326486 3562761 3646894 3779741 3912641 3669668 3123588 2406282 1506479 664819
6968 82367 -412182 -853991 -1279319 -1583472 -1894518 -1924829 -1659604 -1324243 -1209387 -1112917
6958a112917J87130J28358K96985a71902C16395L36444L46908J72710p5251j59116
6948I38090k25897k65357A74460o2568p821J79630J11165l4447J72824O568K8078
6937E67889J7733j55290q8032J31O0143J34526J66314L59632K19145K86209K07997
6926A776397J61149K38420J93487K81743J98463K50739Q6744J43128R802J01343
6916C441415K35132K41068J87923L23029J11252K24603r6983r7317j34747o6879
6906D368496l36994l09446K5648M28019L32343q2338m35103m05599r6169l8760
6896C450097m69274r42250p53465j04692R8746L41741L65535N82660M73403N20265
6886C562766N03142N66613P77564O96229M37982p8032o22041o05522K1467R2109
$$ plain form
6958 -1112917 -925787 -797429 -500444 -171902 316395 652839 999747 1172457 1097206 938090
6948 938090 712193 446836 174460 111892 104071 283701 394866 360419 533243 539811 567889
6937 567889 585622 430332 342300 342431 402574 537100 703414 1063046 1282191 1568400 1776397
6926 1776397 1937546 2175966 2369453 2651196 2849659 3100398 3187142 3330270 3340072 3441415
6916 3441415 3676547 3917615 4105538 4428567 4539819 4764422 4667439 4570122 4435375 4368496
6906 4368496 4031502 3722056 3747704 4175723 4508066 4425728 3990625 3585026 3488857 3450097
6896 3450097 2980823 2038573 1285108 1180416 1279162 1620903 1986438 2569098 3042501 3562766
6886 3562766 4065908 4632521 5410085 6106314 6544296 6466264 5844223 5238701 5260168 5352277
6876E352277n60193q93405r20849A218156i55344r76039j25918Q9932Q7853p33539
6866b613055j549792j232909J92461P26303O65928N54598N80536O83268P27449
6857a265213N76630c35774j91757p85115r86877j098845o66060K05989M08482
6848c449957M21073L15923J27568p3599j3983K91402K65563K59183J48884K26275
6838a481668K57994L63882K01587J61884J9305j44454o6271j65081k16590l17523
6828a386935k59836j50414L6039J85365J62328K07749J10617O6030j15691j67630
6818a312378k792J71567K56187L08517J49619P8140j58527l19442n48573n46433
6808a924115m97979K69849L47043K45660K08856J06307K72303K78915j0301l65233
$$ plain form
6876 5352277 4792084 3898679 2977830 1218156 -955344 -1931383 -2057301 -1967369 -1879516 -2613055
6866 -2613055 -4162847 -5395756 -5203295 -4476992 -3811064 -3256466 -2675930 -1992662 -1265213
6857 -1265213 -688583 -335774 -527531 -1312646 -2299523 -3398368 -4064428 -3858439 -3449957
6848 -3449957 -3028884 -2712961 -2585393 -2658992 -2672975 -2381573 -2116010 -1856827 -1707943 -1481668
6838 -1481668 -1223674 -859792 -658205 -496321 -477016 -621470 -687741 -852822 -1069412 -1386935
6828 -1386935 -1646771 -1797185 -1761146 -1575781 -1413453 -1205704 -1095087 -1029057 -1144748 -1312378
6818 -1312378 -1315170 -1143603 -887416 -578899 -429280 -351140 -509667 -829109 -1377682 -1924115
6808 -1924115 -2422094 -2152245 -1805202 -1559542 -1350686 -1244379 -972076 -693161 -703462 -1068695
6798a068695o57381p59302J30268N01841M16165L06066K70619K6379Q8807o2048
6788h07281J68933K87671A4613K75490L87753L17382m6877D14136e41567j078892
6778a620459p3084M60932N65779f0516D54411L22158j38923g0324j277906r61076
6768b309306m39948M32456O53953N27049M26364b36722E9867K95907J89354J63263
6758G08391J9997k67081q4070L00803M71747O81025M40723L17515j5407k60537
6748B313106o14881H47066b35861j304172j092381J58359K86089m0533Q829N10354
6738a709316N17641M38088b67189A89169L96795M80194M43574L82065J34802k68922
6728A757677o98330B83483h6562C36190M94717O01312M68669L78846Q7521m5314
$$ plain form
6798 -1068695 -1726076 -2485378 -2355110 -1853269 -1437104 -1131038 -860419 -834040 -745233 -807281
6788 -807281 -638348 -350677 14613 290103 677856 995238 948361 414136 -541567 -1620459
6778 -1620459 -1693543 -1232611 -666832 -60516 454411 776569 637646 -70324 -1348230 -2309306
6768 -2309306 -2749254 -2316798 -1662845 -1135796 -709432 -236722 59867 355774 545128 708391
6758 708391 728388 461307 377237 678040 1149787 1830812 2271535 2589050 2573643 2313106
6748 2313106 1698225 847066 -235861 -1540033 -2632414 -2474055 -2187966 -2228499 -2219670 -1709316
6738 -1709316 -1191675 -753587 -267189 189169 585964 1066158 1509732 1891797 2026599 1757677
6728 1757677 1059347 283483 -86562 336190 830907 1432219 1900888 2279734 2367255 2321941
6718B321941j18381J79521O18901P23528Q88139R61143Q05774M01250p33896k115952
6708C931968I40583a174728n45729P9729J90713N33574d6997I00066Q20244P47926
6698B468236R36262J005158J005816J203729J522244J533563R60852l68452k420354
6689G847054C320836a223672k701333k297438k146554l11383J292239J634824
6681e753317J375283J199071J241364g88073D05131J249270J437283J491177J344704
6672E927565O57616n31997k141240F06104b840239m094277m577661k568988P56995
6663a3324170J751820J564085J276260J135571R39319R68386R41195Q68986Q77410
6654c001138Q63680P95918N83543K11448m80460j446058k458085l327548k459523
$$ plain form
6718 2321941 2203560 2383081 3001982 3725510 4613649 5574792 6380566 6781816 6047920 3931968
6708 3931968 940583 -1174728 -1720457 -1640728 -1450015 -916441 -46997 900066 1720310 2468236
6698 2468236 3404498 4409656 5415472 6619201 8141445 9675008 10635860 10267408 7847054
6689 7847054 3320836 -1223672 -3925005 -6222443 -8368997 -8680380 -7388141 -5753317
6681 -5753317 -4378034 -3178963 -1937599 -788073 405131 1654401 3091684 4582861 5927565
6672 5927565 6585181 6053184 3911944 606104 -2840239 -6934516 -11512177 -14081165 -13324170
6663 -13324170 -11572350 -10008265 -8732005 -7596434 -6657115 -5688729 -4747534 -3878548 -3001138
6654 -3001138 -2137458 -1341540 -757997 -546549 -1027009 -2473067 -4931152 -8258700 -10718223
6645a0718223k71481Q92670R86200P57033P11078N70134N16608L75853M81403
6636e698725M09739M37324K84093M36918M51193J84540l4655m37722q30057q05766
6626e603118k29108Q5565K50888K04516K49272J83964J33783K36782J26565J57746
6616d203145J65219J27698J45625J57684P2367K30922J10984R7318J20626R4996
6606b879706R9349J17317Q2428K5997k2477j17096j90676r9326j07165p2737j80089
6595c344181J21930N7291L2110L6509J08110O038J20635L8680J48009L0211J79293
6584b465365J0880J15034K7057O2940N1089J15457n632L0903N5318J47726l2138
6573a886731q5848m4394j34497j7963L00P2204L0420J4996O71N8803K2713J25077
$$ plain form
6645 -10718223 -10989704 -10097034 -9110834 -8353801 -7642723 -7072589 -6555981 -6180128 -5698725
6636 -5698725 -5288986 -4851662 -4567569 -4130651 -3679458 -3494918 -3529573 -3967295 -4797352 -5603118
6626 -5603118 -5832226 -5746661 -5495773 -5291257 -5041985 -4858021 -4724238 -4487456 -4360891 -4203145
6616 -4203145 -4037926 -3910228 -3764603 -3606919 -3534552 -3303630 -3192646 -3095328 -2974702 -2879706
6606 -2879706 -2780357 -2663040 -2580612 -2554615 -2577092 -2694188 -2884864 -2984190 -3091355 -3164092 -3344181
6595 -3344181 -3222251 -3164960 -3132850 -3096341 -2988231 -2982193 -2861558 -2822878 -2674869 -2644658 -2465365
6584 -2465365 -2454485 -2339451 -2312394 -2249454 -2198365 -2082908 -2088540 -2057637 -2002319 -1854593 -1886731
6573 -1886731 -1972579 -2016973 -2151470 -2169433 -2169133 -2096929 -2066509 -2051513 -2050842 -1992039 -1969326 -1844249
6561a844249N0439L3635P899O2311m707J50830o578n79J4008R5030n4284J51196
6549a345049L1642O3407J8286o5040J19295K8581k5700N6332Q2984j6271K9575
6538a021958O5517N7453K8215J17609j2080J52206l2300J50959R9181N4598R7837
6527b42763a21076C5476K51945K75874M17644K51172j09299B15059a491658j850255
6517c341913k02627M91759M28934K77064J37772J98230J02451J00746J7793J68966
6507a620825M5251O8712Q9489M9908J35683K5505N4826n487M107O7596P9435K9218
6495i76582L0122O2609L751L3999L5756N2171k9465J08750k5697M410R5066o752
6483f11862P3487J41116N4973O4812J25903k4184d6204I8408J24754Q5116J81246
$$ plain form
6561 -1844249 -1793810 -1760175 -1752276 -1689965 -1694672 -1543842 -1550420 -1550999 -1536991 -1441961 -1496245 -1345049
6549 -1345049 -1313407 -1250000 -1231714 -1296754 -1177459 -1148878 -1174578 -1118246 -1035262 -1051533 -1021958
6538 -1021958 -956441 -898988 -870773 -753164 -765244 -613038 -645338 -494379 -395198 -340600 -242763
6527 -242763 -121076 35476 287421 563295 980939 1232111 1122812 215059 -1491658 -3341913
6517 -3341913 -3544540 -3052781 -2623847 -2346783 -2209011 -2010781 -1908330 -1807584 -1789791 -1620825
6507 -1620825 -1575574 -1506862 -1417373 -1367465 -1231782 -1206277 -1151451 -1156938 -1152831 -1085235 -1005800 -976582
6495 -976582 -946460 -883851 -880100 -846101 -810345 -758174 -787639 -678889 -704586 -700176 -605110 -611862
6483 -611862 -538375 -397259 -342286 -277474 -151571 -175755 -46204 98408 223162 308278 489524
6472D89524L5033p2710B3175d86021m28693r6395J36014L7059P2694n3317L7360
6461g81299j5542J22743J41867J72471J61320a1933A34519J58744J52210J15076
6451E60549k2886R346p9756j6121k03592a34367n67347l77357m44311l95236l10724
6440b229342L6774P3744J93540K01943J54581J90753J90805J69711J24388J60019
6430g33084J52249l115P2836j01955j59027k4244N0235k1946R395j05718l87912
6419a252286l84026m63646j6034J01114J44140K56776J89685N1426J01259O9883
6409a201709n0499J25171P4163R4431Q250M6725P4207j9310p6031p7856m2485
6398a044943j14909N7351J21638M3653R3132o33Q769Q4786L4486k1616N7361J497
$$ plain form
6472 489524 524557 451847 23175 -486021 -914714 -1011109 -875095 -838036 -765342 -818659 -781299
6461 -781299 -796841 -674098 -532231 -359760 -198440 -11933 134519 293263 445473 560549
6451 560549 537663 547009 467253 451132 247540 -134367 -701714 -1079071 -1523382 -1918618 -2229342
6440 -2229342 -2192568 -2118824 -1925284 -1723341 -1568760 -1378007 -1187202 -1017491 -893103 -733084
6430 -733084 -580835 -583950 -511114 -613069 -772096 -796340 -746105 -768051 -758656 -864374 -1252286
6419 -1252286 -1636312 -2099958 -2115992 -2014878 -1870738 -1613962 -1424277 -1372851 -1271592 -1201709
6409 -1201709 -1252208 -1127037 -1052874 -958443 -950193 -903468 -829261 -848571 -924602 -1002458 -1044943
6398 -1044943 -1159852 -1102501 -980863 -937210 -844078 -844711 -835942 -751156 -716670 -738286 -680925 -679428
6386f79428N6392o223N6933J3633n0504R5217J5877m8285L7040O0858M434p5522
6374e19578J02998n412L1826M6643l5375M5334k7860P4066m5648R2024j5200N5476
6362b00706m5576M825P1778j8049N463P1080L1689k1273m8238L2315c4461J7178
6350a7283b823l1922j8436A0147K3842a4799G9928k0343P379M0953l3093C0466
6337A73625o0792j6045N4048n382M7713n9737M2853K7243L4863J2419j8193R782
6325B42397J4789P1030q9420P7857K6316j8087J2376M1603l7747M9960J1254L6274
6313D38602L3505q7787J50155q1855N3562j729r311k991L6459K064M9500M357
6301E84531q659O719j3447M3320O1386q6054N5955K5446n5482k9886J35553o3850
$$ plain form
6386 -679428 -623036 -629259 -572326 -558693 -609197 -513980 -498103 -546388 -509348 -448490 -444056 -519578
6374 -519578 -416580 -421992 -390166 -343523 -378898 -333564 -361424 -287358 -333006 -240982 -256182 -200706
6362 -200706 -246282 -241457 -169679 -187728 -182265 -111185 -79496 -100769 -149007 -116692 -34461 -17283
6350 -17283 -2823 -34745 -53181 10147 33989 -14799 79928 59585 66964 107917 74824 30466
6337 173625 112833 96788 150836 145454 193167 133430 176283 203526 238389 250808 232615 242397
6325 242397 257186 328216 238796 316653 342969 324882 337258 378861 341114 391074 402328 438602
6313 438602 472107 384320 534475 452620 506182 504453 495142 492151 528610 530674 580174 584531
6301 584531 575872 582591 569144 612464 673850 587796 643751 669197 613715 583829 719382 655532
6289F55532M5748R6678n4672l3355P0840K4753O9608p4488k2627O3704J1482j8333
6277H34870L3479K6051j9251K3769N014L7631K9005m7092L0908N8695N471J6536
6265A035086M1919j9580Q225L474J16097j1685p7450J9857J4815k9354O2604n8821
6253A105187j7293M4707O0526k3020J9408L5428q39K7073J9297K8250K7178J1209
6241A337111L6648K1725l580N760j27341J27419q9824J08727N7630K0489l7406
6230A457358L866k1597K7226M2141l241P7392k6848J8668K8144L7190p283R4967
6218A727983j8140K0509l2651O2308L2869L4384k8896L1475J5221P6840l3207
6207A888695K1996m7768O1431M0533K9656J676P3143j8454J5811K0442M2209l001
$$ plain form
6289 655532 701280 797958 743286 709931 780771 805524 875132 800644 778017 841721 853203 834870
6277 834870 868349 894400 875149 898918 903932 941563 970568 923476 954384 1013079 1018550 1035086
6265 1035086 1077005 1057425 1065650 1069124 1185221 1173536 1096086 1115943 1130758 1101404 1164008 1105187
6253 1105187 1087894 1132601 1193127 1170107 1189515 1224943 1224104 1251177 1270474 1298724 1325902 1337111
6241 1337111 1373759 1395484 1391904 1397664 1270323 1397742 1307918 1416645 1474275 1494764 1457358
6230 1457358 1461224 1439627 1466853 1508994 1505753 1583145 1556297 1574965 1603109 1640299 1633016 1727983
6218 1727983 1709843 1730352 1697701 1760009 1792878 1827262 1798366 1829841 1845062 1921902 1888695
6207 1888695 1910691 1862923 1924354 1964887 1994543 1996219 2069362 2050908 2066719 2087161 2129370 2126369
6195B126369K4641L5339k3673N6171O1709J733Q0993k4472N3714K9206J7781j2493
6183B427018R1690p324R5650l9174O2469p8446Q8627Q814N4581P7535K567O1735
6171B845742M0832O1062L4719J1488J9335O6025P83k491R4877P3626L0382O5308
6159C341688M8993O1729M2375N8384j3220R5523M0556L9437O5818K1001J45847
6148C948131N1604N9371R1409P9681N8540J58364L1894j5286R0696P4323K1102
6137D649829J85375J76216Q6662Q3005J57886J59621K11992J81067J82336J60756
6127F234745K88177K61051K73249M12848K52945N13307L31809N06891M51339P71170
6117A0297531J022546J147886Q41077m28429k326360m066541A991149a025642
$$ plain form
6195 2126369 2151010 2186349 2162676 2218847 2280556 2282289 2363282 2338810 2392524 2421730 2439511 2427018
6183 2427018 2518708 2511384 2607034 2567860 2630329 2551883 2640510 2649324 2703905 2781440 2784007 2845742
6171 2845742 2886574 2947636 2982355 2993843 3013178 3079203 3079986 3077495 3172372 3245998 3276380 3341688
6159 3341688 3390681 3452410 3494785 3553169 3539949 3635472 3676028 3715465 3781283 3802284 3948131
6148 3948131 3999735 4059106 4150515 4230196 4288736 4447100 4478994 4463708 4554404 4628727 4649829
6137 4649829 4835204 5011420 5098082 5181087 5338973 5498594 5710586 5891653 6073989 6234745
6127 6234745 6522922 6783973 7057222 7470070 7723015 8236322 8568131 9075022 9526361 10297531
6117 10297531 11320077 12467963 13309040 12880611 10554251 6487710 1991149 -1025642
6108a872514P54934B23135J208908J042676Q28807P10226O78092P13222P51910
6099F156976R29451J140025J287427J105796O9122j740714l539593A304933a765091
6089b830164P23462f49413F41245J076357Q88034Q90516P35835R16746Q39855
6080E988588R31109R35207J106593J393783J778989J944688J457756m98013l534170
6071A1504530E077260b152060n364768j811411R34610K162070K141259J598341
6063b491959a065879A72123J010642J066717J113300J331594J656936J678475
6055H029787J199099l44988l067211b05300p088934n730984k272787L89813J866810
6046a3041382J719311J488550R47024Q34439O04775O10589N68429M76847N32974
$$ plain form
6108 -1872514 -1117580 223135 1432043 2474719 3303526 4013752 4691844 5405066 6156976
6099 6156976 7086427 8226452 9513879 10619675 10688797 8948083 5408490 1304933 -1765091
6089 -2830164 -2106702 -649413 641245 1717602 2605636 3496152 4231987 5148733 5988588
6080 5988588 6919697 7854904 8961497 10355280 12134269 14078957 15536713 15038700 11504530
6071 11504530 5077260 -2152060 -7516828 -9328239 -8393629 -6231559 -4090300 -2491959
6063 -2491959 -1065879 172123 1182765 2249482 3362782 4694376 6351312 8029787
6055 8029787 9228886 8883898 5816687 -205300 -7294234 -13025218 -15298005 -14908192 -13041382
6046 -13041382 -11322071 -9833521 -8886497 -8052058 -7447283 -6836694 -6268265 -5791418 -5258444
6037e258444M42948L78738L70742K71680L73660K14498K23638K25152K81163K43828
6027b232397J26835K75665J28725R8150K15131J17644J25055J58496J57628J14328
6017g14740J43300M8256K30359P3023h1054D8178P5718J12209Q8525J09215J01313
6006E35158J19307J01102J21817J52568K2576J46628N3453J58128Q3309J22169
5996A616215R3102J11048R9788J50221Q9480P9323J57139J73569N8168J78870
5986B806923J51652J27130J42073K01428J29489J21446J52960K71119J18503J95154
5976D417877K32478K35446K86331K71298K68550L85198L63732M33841M51297N49075
5966G895123O40422N76075P42732P60178J059145J314201J701644J845644J044062
$$ plain form
6037 -5258444 -4815496 -4436758 -4066016 -3794336 -3420676 -3206178 -2982540 -2757388 -2476225 -2232397
6027 -2232397 -2105562 -1829897 -1701172 -1603022 -1387891 -1270247 -1145192 -986696 -829068 -714740
6017 -714740 -571440 -523184 -292825 -219802 -81054 48178 123896 236105 324630 433845 535158
6006 535158 654465 755567 877384 1029952 1052528 1199156 1252609 1410737 1494046 1616215
5996 1616215 1709317 1820365 1920153 2070374 2159854 2239177 2396316 2569885 2628053 2806923
5986 2806923 2958575 3085705 3227778 3429206 3558695 3680141 3833101 4104220 4222723 4417877
5976 4417877 4650355 4885801 5172132 5443430 5711980 6097178 6460910 6894751 7346048 7895123
5966 7895123 8535545 9111620 9854352 10614530 11673675 12987876 14689520 16535164 17579226
5957A7579226j054615m185088E334747b384213n556626j733263J232283K228680
5949f213139J872662J428513J213075f66941B86244R55393R36742J065831J043755
5940D287965R93706J153248J570908J916035J897625R84390j358686m745462e10928
5930g371039l714190k71878J960911K053136J718671J298592J141802R10183R94099
5921a279713b85407H84849J348481J606797J260642K72339j685436b09301m546769
5912d756070l576954j116358Q19813J506815J258353J021305Q36856O81325O13983
5903b710932O78424N59473O82103a49207E21369P50488Q58394J161729J258812
5894D550792P53673n97246B091259b200206m304405k606472l21821R89951J315571
$$ plain form
5957 17579226 16524611 12339523 5334747 -2384213 -7940839 -9674102 -8441819 -6213139
5949 -6213139 -4340477 -2911964 -1698889 -666941 286244 1241637 2178379 3244210 4287965
5940 4287965 5281671 6434919 8005827 9921862 11819487 12803877 11445191 6699729 -510928
5930 -7371039 -11085229 -11357107 -9396196 -7343060 -5624389 -4325797 -3183995 -2273812 -1279713
5921 -1279713 -285407 884849 2233330 3840127 5100769 5373108 3687672 -209301 -4756070
5912 -4756070 -8333024 -9449382 -8629569 -7122754 -5864401 -4843096 -4006240 -3324915 -2710932
5903 -2710932 -2032508 -1473035 -790932 -149207 521369 1271857 2130251 3291980 4550792
5894 4550792 5304465 4707219 2091259 -2200206 -6504611 -9111083 -9432904 -8442953 -7127382
5885g127382J001445P56776N43082M12673L34676L65456K56957L81740K23082
5876b851495L99166K16036K36938K45000K06036J75719J78052K37568J83467J97514
5866e75999J72080J35868i8923K933c537E7162O1166J26364J79810K13117K94332
5855I31951J60809K9625o0102k69939k56910n1627K2893R9761K64475J55365J81180
5844A207481R3696J05817Q0321J09674P2819P4423O782J35620Q7236J12481J76815
5833B263165R3525L0760K15929J92155L5478J91483N9266K07971J25308J00334
5823C515374R8601J60947J16423J63630P3875J69581J82039J28140J43427J08693
5813D860730J66002J98392Q6621K19101J86442J94703K01469J83329J60389K27213
$$ plain form
5885 -7127382 -6125937 -5369161 -4826079 -4413406 -4078730 -3713274 -3456317 -3074577 -2851495
5876 -2851495 -2452329 -2236293 -1999355 -1754355 -1548319 -1372600 -1194548 -956980 -773513 -575999
5866 -575999 -403919 -268051 -98923 -95990 -3537 57162 118328 244692 424502 637619 931951
5855 931951 1092760 1122385 1062283 792344 535434 483807 506700 606461 870936 1026301 1207481
5844 1207481 1301177 1406994 1487315 1596989 1669808 1744231 1751013 1886633 1973869 2086350 2263165
5833 2263165 2356690 2387450 2603379 2795534 2831012 3022495 3081761 3289732 3415040 3515374
5823 3515374 3613975 3774922 3891345 4054975 4128850 4298431 4480470 4608610 4752037 4860730
5813 4860730 5026732 5225124 5311745 5530846 5717288 5911991 6113460 6296789 6457178 6684391
5803F684391K41606K01598K07850K21558K85990K68462K37551J85765K75158L37337
5793I147266L11901L58013K79372L45954L60475M30813N00705M10126M16739M95565
5783A3056929N14129N21796N76192N46749O97058P38853P93272Q31869Q17881
5774A9094728R58591J071262J252164J246538J448479J682083J745990J951274
5766C0451109K158314K531308K843438L221893L680050M514716N452197O301273
5758F1154298P768884J0104853J3756417K1023176K8934142J2547451k2795494
5751A32493727E0814625g4991734r8934593J3851603L2631513K3389648J5139152
5744h8914411J0890051Q791762P080948N793524M780505M236354L529375L092460
$$ plain form
5803 6684391 6925997 7127595 7335445 7557003 7842993 8111455 8349006 8534771 8809929 9147266
5793 9147266 9459167 9817180 10096552 10442506 10802981 11233794 11734499 12144625 12561364 13056929
5783 13056929 13571058 14092854 14669046 15215795 15912853 16651706 17444978 18276847 19094728
5774 19094728 20053319 21124581 22376745 23623283 25071762 26753845 28499835 30451109
5766 30451109 32609423 35140731 37984169 41206062 44886112 49400828 54853025 61154298
5758 61154298 68923182 79028035 92784452 113807628 142741770 155289221 132493727
5751 132493727 50814625 -74991734 -173926327 -160074724 -127443211 -104053563 -88914411
5744 -88914411 -78024360 -69232598 -62151650 -56358126 -51577621 -47341267 -43811892 -40719432
5736d0719432K651931K379767J990415J872206J622526J447532J342651J281314
5728b6131090J113767J061265R69707R38256P31782N90337M40524L96334O00717
5719a9288401O78137N26484N31567M47865M69962M78796L85756L01951M00054
5710a5067829L44997K83287L74780L15191K89518K32683L46605K68592K02349
5701a2409827K14010K47892J14820K01281J86727J77761K15627J53917K13758
5692a0684034J48489K79326L0032K38955J38162J24524J30849R3222K09901J55723
5682i134851O4573J84385Q4942P1742K07742R1804L9561J69001J32570Q4398J17003
5671g887130J11446Q0112J68527J09372M4329J81238r30J49079J22185P3017J00630
$$ plain form
5736 -40719432 -38067501 -35687734 -33697319 -31825113 -30202587 -28755055 -27412404 -26131090
5728 -26131090 -25017323 -23956058 -22986351 -22048095 -21316313 -20725976 -20285452 -19889118 -19288401
5719 -19288401 -18610264 -18083780 -17552213 -17104348 -16634386 -16155590 -15769834 -15467883 -15067829
5710 -15067829 -14722832 -14439545 -14064765 -13749574 -13460056 -13227373 -12880768 -12612176 -12409827
5701 -12409827 -12195817 -11947925 -11833105 -11631824 -11445097 -11267336 -11051709 -10897792 -10684034
5692 -10684034 -10535545 -10256219 -10226187 -9987232 -9849070 -9724546 -9593697 -9500475 -9290574 -9134851
5682 -9134851 -9070278 -8885893 -8800951 -8729209 -8521467 -8429663 -8390102 -8221101 -8088531 -8004133 -7887130
5671 -7887130 -7775684 -7695572 -7527045 -7417673 -7373344 -7192106 -7193036 -7043957 -6921772 -6848755 -6748125
5660f748125Q7459J70502M4403J35200M4811J27593J77338J35775Q3122J90833
5650e551089P5846K07038K00688J17348J93715K11199K20526K50035K94751K67961
5640c511982M46338N06515O45867h89458F84543O87403C99250c804537o005017
5631i809554n129554J534192J686778J130278P54893N22794M74369M41443J11493
5622h282868L48145K03636K26583J51118R4422K02975J26763J77783K269J58825
5612f590349R9209L1843N1640J60777L0744O8264L0462P9107O4152M9765Q1910
5601e842476N2046L82R5390N0061O4692j871J18866J8074O5059q8205J19869M7887
5589e300226M9594P1912K3752K4475K2583j8815Q2600L119P6496k2943J6204J08917
$$ plain form
5660 -6748125 -6660666 -6490164 -6445761 -6310561 -6265750 -6138157 -5960819 -5825044 -5741922 -5551089
5650 -5551089 -5475243 -5268205 -5067517 -4950169 -4756454 -4545255 -4324729 -4074694 -3779943 -3511982
5640 -3511982 -3065644 -2559129 -1913262 -889458 684543 1371946 399250 -3804537 -9809554
5631 -9809554 -14939108 -13404916 -11718138 -10587860 -9832967 -9310173 -8835804 -8394361 -8282868
5622 -8282868 -7934723 -7731087 -7504504 -7353386 -7258964 -7055989 -6929226 -6751443 -6749174 -6590349
5612 -6590349 -6491140 -6459297 -6407657 -6246880 -6216136 -6147872 -6117410 -6038303 -5974151 -5924386 -5842476
5601 -5842476 -5790430 -5790048 -5694658 -5644597 -5579905 -5581776 -5462910 -5444836 -5379777 -5467982 -5348113 -5300226
5589 -5300226 -5250632 -5178720 -5154968 -5130493 -5107910 -5126725 -5044125 -5041006 -4964510 -4987453 -4971249 -4862332
5577d862332k6439N2974M409J08990O478R6599J1821l4568K922M8656K6693M0496
5565d523301J8822O6738l6184J21632o5816O3880n7136J03245R8685p8507J5338
5554d272604O863J30454l0395M7500Q8617O7372k0888Q2444Q0474M217Q8621J51147
5542c576178J11885J02429P2539k61194n21392o51899j67513M5113K09410K08222
5532d428578O9672L412N9710P3714J9065Q3662K3278J4585O5696K919o724P7364
5520c942225J6528j1441K9119m89R205J10620p1774J31292n5154L5999j8537L0161
5508c736696m222L2929P1276k690k4547K3069j8738P207K5361K194N5570m7301
5496c616588J67100j17506J01574o5506J2162K9825k9388Q1876l1410j7551L8859
$$ plain form
5577 -4862332 -4888771 -4835797 -4831388 -4722398 -4715920 -4619321 -4607500 -4642068 -4639146 -4590490 -4563797 -4523301
5565 -4523301 -4504479 -4437741 -4473925 -4352293 -4418109 -4354229 -4411365 -4308120 -4209435 -4287942 -4272604
5554 -4272604 -4265741 -4135287 -4165682 -4118182 -4029565 -3962193 -3983081 -3900637 -3820163 -3815946 -3727325 -3576178
5542 -3576178 -3464293 -3361864 -3289325 -3550519 -4071911 -4723810 -4891323 -4846210 -4636800 -4428578
5532 -4428578 -4358906 -4355494 -4295784 -4222070 -4203005 -4119343 -4096065 -4081480 -4015784 -4012865 -4019589 -3942225
5520 -3942225 -3925697 -3937138 -3908019 -3908508 -3899303 -3788683 -3860457 -3729165 -3784319 -3748320 -3766857 -3736696
5508 -3736696 -3740918 -3707989 -3636713 -3639403 -3663950 -3640881 -3659619 -3652412 -3627051 -3624857 -3569287 -3616588
5496 -3616588 -3449488 -3566994 -3465420 -3530926 -3518764 -3488939 -3518327 -3436451 -3467861 -3485412 -3446553
5485c446553L7462p036O0197j165J1330L7202o0701K9763L0576L958k119O4218
5473c242868n0674P0785M37p6837O0751O9675j3041J1599l0941K3238K6132P367
5461c144377l4852O1328J6901l545k6002O1738k2967M4862n0714K2759j7026K0714
5449c071181P3283k9533n610Q5819n3215L9429m3193K0022M3874m4588o331M5546
5437b945678j8825N5680J1428L0448n8340M0399P46J0643J4228K6877j0231O1906
5425b780719p823k724l9162O7100L006q0983L9904J1806j723p9502P4402O392
5413b790026M7067J5313j04171J11156j09542J56318j8405n3393J7520M1865M0565
5402b645733l2539j2899l9497N4422O0443o4132L7831O173l1661L2227n772j5499
$$ plain form
5485 -3446553 -3409091 -3416127 -3355930 -3357095 -3345765 -3308563 -3369264 -3339501 -3308925 -3304967 -3307086 -3242868
5473 -3242868 -3293542 -3222757 -3222320 -3299157 -3238406 -3168731 -3181772 -3170173 -3201114 -3177876 -3151744 -3144377
5461 -3144377 -3179229 -3117901 -3101000 -3104545 -3130547 -3068809 -3091776 -3046914 -3097628 -3074869 -3091895 -3071181
5449 -3071181 -2997898 -3027431 -3033041 -2947222 -3000437 -2961008 -3004201 -2984179 -2940305 -2984893 -2991224 -2945678
5437 -2945678 -2964503 -2908823 -2897395 -2866947 -2925287 -2884888 -2884142 -2873499 -2859271 -2832394 -2842625 -2780719
5425 -2780719 -2788542 -2791266 -2830428 -2763328 -2760322 -2841305 -2801401 -2789595 -2791318 -2870820 -2796418 -2790026
5413 -2790026 -2742959 -2727646 -2831817 -2720661 -2830203 -2673885 -2692290 -2745683 -2728163 -2686298 -2645733
5402 -2645733 -2678272 -2691171 -2730668 -2676246 -2615803 -2679935 -2642104 -2635931 -2667592 -2635365 -2641137 -2656636
5390b656636Q1514n9339J8452N3769L4996J6818k1749l2394M8125j9550J0254
5379b525740m5127K4432O1108j9209j2082N9693L0856p6737N7319j6425n7405
5368b519317M9582j2861M43J3043L8406k2155O1504K3178l7546j4973M7444K6611
5356b346641l3617K0549m7002J8082L2316k4124M8447k0258L427J0259k1282M7880
5344b311964p1503N7130J618k3196K4319J1644J3787l9989J6630l9202P9780M0267
5332b240679o3311L9792N2975o3347M009p038M5987n2353O9601k4546L9592j1713
5320b211031o8286Q1745j1635L7126m9480n795M9481j4111K826N0077J6650k7500
5308b149933M6090j1272N718n0946L5657l0696o671O0969R95j3209J4707p932
$$ plain form
5390 -2656636 -2575122 -2634461 -2616009 -2562240 -2527244 -2510426 -2532175 -2564569 -2516444 -2535994 -2525740
5379 -2525740 -2570867 -2546435 -2485327 -2504536 -2516618 -2456925 -2426069 -2502806 -2445487 -2461912 -2519317
5368 -2519317 -2469735 -2482596 -2482153 -2469110 -2430704 -2452859 -2391355 -2368177 -2405723 -2420696 -2373252 -2346641
5356 -2346641 -2380258 -2359709 -2406711 -2388629 -2356313 -2380437 -2331990 -2352248 -2348821 -2338562 -2359844 -2311964
5344 -2311964 -2383467 -2326337 -2324719 -2347915 -2323596 -2311952 -2298165 -2338154 -2321524 -2360726 -2280946 -2240679
5332 -2240679 -2303990 -2264198 -2211223 -2274570 -2270561 -2277599 -2231612 -2283965 -2214364 -2238910 -2199318 -2211031
5320 -2211031 -2279317 -2197572 -2209207 -2172081 -2221561 -2227356 -2177875 -2191986 -2189160 -2139083 -2122433 -2149933
5308 -2149933 -2103843 -2115115 -2109397 -2160343 -2124686 -2155382 -2162053 -2101084 -2100089 -2113298 -2098591 -2106523
5296b106523L0358O4046j58376O3462Q828J8601L5628n0867m9180J04116l5818
5285b075725L5188n08k5456J2868M4617l0488J1305r25p147n5961R2909L887m4350
5272b039786O8418k6586M10J01085j45146Q4034k2637n029L3222q295j8873j3511
5260a992694K2228L9751p1434M5483L1846K794K1377J25n6078N169k4545O2826
5248a913152l379k2536M5821M9837k1093o5691N9721P016K901N1753l9880p640
5236a856322L8907o8410N080o86N0912k7927r0168J14368K190p5400N2636M8977
5224a805843O721k8382k0883N3764l8116L300r125M8623M334J938r3601J30203
5212a747067m9524M223K4757M9759l5185Q1241o1235J2312l8673j98J0623J3893
$$ plain form
5296 -2106523 -2076165 -2012119 -2170495 -2107033 -2098205 -2079604 -2043976 -2094843 -2144023 -2039907 -2075725
5285 -2075725 -2040537 -2041045 -2066501 -2053633 -2009016 -2039504 -2028199 -2029124 -2036271 -2092232 -1999323 -1995436 -2039786
5272 -2039786 -1971368 -1997954 -1997544 -1896459 -2041605 -1957571 -1980208 -1985237 -1952015 -1960310 -1979183 -1992694
5260 -1992694 -1970466 -1930715 -2002149 -1956666 -1924820 -1922026 -1900649 -1900524 -1956602 -1951433 -1975978 -1913152
5248 -1913152 -1916531 -1939067 -1893246 -1843409 -1864502 -1930193 -1870472 -1863456 -1860555 -1808802 -1848682 -1856322
5236 -1856322 -1817415 -1885825 -1880745 -1881431 -1830519 -1858446 -1948614 -1834246 -1832056 -1907456 -1854820 -1805843
5224 -1805843 -1799122 -1827504 -1848387 -1794623 -1832739 -1829439 -1838564 -1789941 -1785607 -1783669 -1877270 -1747067
5212 -1747067 -1796591 -1792368 -1767611 -1717852 -1753037 -1671796 -1733031 -1720719 -1759392 -1759590 -1748967 -1735074
5200a735074J7831l6462n0758P7494p200k2619L5191K0960n8882l2911Q3231k550
5188a711749Q972l7888j7673J04909j6619J839O880m6791j5P6424j14349Q4055
5176a662005j7288l9753K4413L9366M6010k0906J9838m6334P5979p7389N9015
5165a599054k0055K5155m4577K8528R012k5876J0461j5984N6335r4196R4667p8809
5153a654393P423P3627j0002J7403R323j5595j2143l348M8121J8509j01842M332
5141a618585L9247O436K5671k7601P1566o0435K059Q468O8180l3355o8771R4400
5129a492720m2773J6251K9287l5883k0374N0174p380l252K4802p778L0290n5501
5117a514857J1425J9856K6318m2852P911P964l4865N0189J9944l3417K1154L0799
$$ plain form
5200 -1735074 -1717243 -1753705 -1804463 -1726969 -1734169 -1756788 -1721597 -1700637 -1759519 -1792430 -1709199 -1711749
5188 -1711749 -1702777 -1740665 -1758338 -1653429 -1670048 -1668209 -1661329 -1708120 -1708135 -1631711 -1746060 -1662005
5176 -1662005 -1679293 -1719046 -1694633 -1655267 -1609257 -1630163 -1610325 -1656659 -1580680 -1658069 -1599054
5165 -1599054 -1619109 -1593954 -1638531 -1610003 -1600991 -1626867 -1616406 -1632390 -1576055 -1670251 -1575584 -1654393
5153 -1654393 -1646970 -1573343 -1583345 -1565942 -1556619 -1572214 -1584357 -1587705 -1539584 -1521075 -1622917 -1618585
5141 -1618585 -1579338 -1572902 -1547231 -1574832 -1503266 -1563701 -1561642 -1553174 -1484994 -1518349 -1587120 -1492720
5129 -1492720 -1535493 -1519242 -1489955 -1525838 -1546212 -1496038 -1503418 -1506670 -1481868 -1489646 -1459356 -1514857
5117 -1514857 -1503432 -1483576 -1457258 -1500110 -1492199 -1484235 -1519100 -1468911 -1448967 -1482384 -1461230 -1430431
5105a430431n38j1394l1723M1236j2062n928j781K5116k7446j330M2281j8839
5093a432839O1412o3765k9289L4921R4784p7777k8254O5561o8628M3232l9619
5082a440261O7523n030l7211r08o554N1097k0308J7810n6517l124J6133M0239
5070a377111j0847J4269k3664j1551P8689J0380q282k5641l4329N612k5095J04414
5058a303156q280m1763k7340O2073k9765N932l3697K7560N8109J6085q0064R697
5046a344609j0597Q546Q166r525P757M4372L4469k7502n629k0466N3687m0087
5034a301418N0325m9979j5052j7977Q8019J5906q2131P9187q1681J9782K8549
5023a266470J9675j2417O64k3162J6906M3418n6886N769L7228l5170J1143R0646
$$ plain form
5105 -1430431 -1430969 -1442363 -1474086 -1432850 -1444912 -1450840 -1452621 -1427505 -1454951 -1456281 -1414000 -1432839
5093 -1432839 -1371427 -1435192 -1464481 -1429560 -1334776 -1412553 -1440807 -1375246 -1443874 -1400642 -1440261
5082 -1440261 -1372738 -1377768 -1414979 -1415887 -1422441 -1371344 -1391652 -1373842 -1430359 -1433483 -1417350 -1377111
5070 -1377111 -1387958 -1373689 -1397353 -1408904 -1330215 -1319835 -1328117 -1353758 -1388087 -1382475 -1407570 -1303156
5058 -1303156 -1311436 -1353199 -1380539 -1318466 -1348231 -1342299 -1375996 -1348436 -1290327 -1274242 -1354306 -1344609
5046 -1344609 -1355206 -1346660 -1338494 -1348019 -1340262 -1295890 -1261421 -1288923 -1294552 -1315018 -1261331 -1301418
5034 -1301418 -1251093 -1301072 -1316124 -1334101 -1246082 -1230176 -1312307 -1233120 -1314801 -1295019 -1266470
5023 -1266470 -1246795 -1259212 -1258548 -1281710 -1264804 -1221386 -1278272 -1272503 -1235275 -1270445 -1259302 -1168656
5011a168656k6460o079o0327Q7082k0300n0292L5959O017k1615K9346K9341K2110
4999a143874k6399L5538n2870k2093M4731J1339n4675K3396R008j2356j6837M3819
4987a161273M284k3369M2304n9368K4136O1535k9318J2276J5510j3748L3461o5901
4975a159471P9822p1350K7894M748L9234r8201L2591j1416J2030P530J8658n2004
4963a169935O4157P118k2406L8876n0351P5152r0761Q4113k3170k6329J7691n8322
4951a154167J11028j27328P8221L5722k3896J4967O0636q2015N0350q0122M2718
4940a073886j9271P6063J2338k9572n9793P6796k5733q129k6192J9981k6680J6916
4928a067162M2549N3545r6494R6501o0677L8658k0989Q437l6875N1732R67m3088
$$ plain form
5011 -1168656 -1195116 -1201195 -1261522 -1174440 -1194740 -1245032 -1209073 -1203056 -1224671 -1195325 -1165984 -1143874
4999 -1143874 -1170273 -1134735 -1187605 -1209698 -1164967 -1153628 -1208303 -1184907 -1175899 -1188255 -1205092 -1161273
4987 -1161273 -1156989 -1180358 -1138054 -1197422 -1173286 -1111751 -1141069 -1128793 -1113283 -1127031 -1093570 -1159471
4975 -1159471 -1079649 -1150999 -1123105 -1118357 -1079123 -1177324 -1144733 -1156149 -1144119 -1136589 -1117931 -1169935
4963 -1169935 -1105778 -1098660 -1121066 -1082190 -1132541 -1057389 -1148150 -1064037 -1087207 -1113536 -1095845 -1154167
4951 -1154167 -1043139 -1170467 -1092246 -1056524 -1080420 -1065453 -1004817 -1086832 -1036482 -1116604 -1073886
4940 -1073886 -1093157 -1017094 -1004756 -1034328 -1094121 -1017325 -1043058 -1051187 -1077379 -1057398 -1084078 -1067162
4928 -1067162 -1024613 -971068 -1067562 -971061 -1031738 -993080 -1014069 -1005632 -1042507 -990775 -989808 -1032896
4916a032896K9465m4717N0083L3555m6227q249N173Q7178j2754l1886m691L4687
4904i41279m8969J6746k8571L6287M746n3000N5135k1529M5368m1450J4397M990
4892i57129m953O3470k4230p6416N1663J4683k6178K9630l613M0508o4716L3341
4880i23940N842J985k1432k7259N5094m3782Q801K8548m8156N6557o7143Q6079
4868h88806M9501p0969J1609n857J5826l6835R0133O762n2197M9963j32909N8154
4856i05625P1413n8451k6231K9322o907M3264l5345L8672J0247m5072M5220m05
4844h39898Q326N939J9728q4994M1749N3755l9762M5618k5877l6550J06247r5180
4832h40899K2951l3476j6249L4512K6746L314o2985J8336J7808M873L6546n1495
$$ plain form
4916 -1032896 -1003431 -1048148 -998065 -964510 -1010737 -1018986 -1013813 -926635 -939389 -971275 -975966 -941279
4904 -941279 -990248 -973502 -1002073 -965786 -961040 -1014040 -958905 -980434 -935066 -976516 -962119 -957129
4892 -957129 -962082 -898612 -922842 -999258 -947595 -932912 -959090 -929460 -933073 -892565 -957281 -923940
4880 -923940 -918098 -916113 -937545 -964804 -909710 -953492 -944691 -916143 -964299 -907742 -974885 -888806
4868 -888806 -839305 -910274 -898665 -904522 -888696 -925531 -835398 -828636 -880833 -830870 -963779 -905625
4856 -905625 -834212 -892663 -918894 -889572 -896479 -853215 -888560 -849888 -839641 -884713 -839493 -839898
4844 -839898 -831572 -825633 -805905 -890899 -849150 -795395 -835157 -789539 -815416 -851966 -745719 -840899
4832 -840899 -817948 -851424 -867673 -833161 -806415 -803101 -866086 -847750 -829942 -825069 -788523 -840018
4820h40018K0870N120K8070J9945o7854M5699K2473m4715k7273P8838j8067L3741
4808g43171m2249l9605N1822J2705J6960k8098K9322m9400N7601j7300k0J1652
4796g39781M98k3850J8162p939K0135l1310Q297K9444N0958j09391O0772k7179
4784g51184O6700L6763j25520J30130l9403o6558r858Q2767K0518k3202l6080
4773g14927J4115M542L0479l9382k7845O9659k718N670j2286r340j9741M1202
4761f60572j7255q08M7074k1755k0668L4564m9976K9477O1632J1682k0374n7290
4749f64269L7432j6762l6488L6922r041o652O1638j2897k576J9140p653k1649
4737f22855N2670P193J0042p8815J714N9917m6637j1223K5025M2544m9220n2889
$$ plain form
4820 -840018 -819148 -814028 -785958 -766013 -833867 -788168 -765695 -810410 -837683 -758845 -776912 -743171
4808 -743171 -785420 -825025 -773203 -760498 -743538 -771636 -742314 -791714 -734113 -751413 -751433 -739781
4796 -739781 -739283 -763133 -744971 -752910 -732775 -764085 -755788 -726344 -675386 -784777 -724005 -751184
4784 -751184 -684484 -647721 -773241 -643111 -682514 -749072 -758930 -676163 -655645 -678847 -714927
4773 -714927 -700812 -696270 -665791 -705173 -733018 -663359 -666077 -660407 -672693 -682033 -701774 -660572
4761 -660572 -677827 -678635 -631561 -653316 -673984 -639420 -689396 -659919 -598287 -586605 -606979 -664269
4749 -664269 -626837 -643599 -680087 -643165 -652206 -658858 -597220 -610117 -612693 -593553 -601206 -622855
4737 -622855 -570185 -562992 -552950 -631765 -630051 -570134 -616771 -627994 -602969 -560425 -609645 -662534
4725f62534J24207l4079m6184j9090R3967o878J577p8616N0475J1164K983j3020
4713e76028k2300J05090o6814j6051l3261O7346O5966o1242O4668m7431J228K1037
4701d97792n1339K0305k749Q248j6542m0300K2471Q3273L527l7465m546P521L7994
4688d67394M4827o2196o7j3685N7970m5840R128J4154n9840L1111j2864N9817
4676d44879k7245L5817J06J266n0288j0515M0001J4017j7087m9871J07300R479
4664c91899j7160Q132M3665m2802k8396N3639m6201M5947o6570N4098j2343l355
4652d03245l3455J3213M3341k920J7379m0514K4849M443l6509K6703j3801L790
4640c96726N6597l3137j3718M2866l2776k7424P8751n7268K5015P120m0554k421
$$ plain form
4725 -662534 -538327 -572406 -618590 -637680 -543713 -550591 -549014 -627630 -577155 -565991 -563008 -576028
4713 -576028 -598328 -493238 -560052 -576103 -609364 -542018 -476052 -537294 -472626 -520057 -518829 -497792
4701 -497792 -549131 -528826 -531575 -523327 -539869 -580169 -557698 -474425 -470898 -508363 -512909 -505388 -467394
4688 -467394 -422567 -484763 -484830 -498515 -440545 -486385 -477257 -463103 -522943 -491832 -504696 -444879
4676 -444879 -472124 -436307 -436201 -434935 -485223 -495738 -455737 -441720 -458807 -508678 -401378 -391899
4664 -391899 -409059 -400927 -357262 -400064 -428460 -374821 -421022 -375075 -441645 -387547 -399890 -403245
4652 -403245 -436700 -423487 -380146 -383066 -365687 -406201 -381352 -376909 -413418 -386715 -400516 -396726
4640 -396726 -340129 -373266 -386984 -344118 -376894 -404318 -325567 -382835 -357820 -350700 -391254 -393675
4628c93675L9595N1543l5560M1060R270p6644Q5493k0571P228R596k729n121j06328
4615c96843O8722O0351k6736J0297k137n567o397O4582l0787l507M3675o1300
4603b85647J0798N155N468j7533n842O5983l8367P4495r2749L3962j075Q480K0276
4590b16596l0605M7309m0644O9385j9679k1576j5696j186M5376j3961k9724m2259
4578b69856K2084P4734M3564q8541P5015p7424J0775R357M9331j5099L0726L5960
4566i9374k0936k9850j4023J5308M1505l5984J633K9455J2560o0852P0145d0118
4553a46889L5940L4846l3299M4864k6489K5502n4789J5498j5712e0846l9584n178
4541i5608d0052k2268b4994k3282j212l950p4670e8765b1372E276M316g0032J1686
$$ plain form
4628 -393675 -354080 -302537 -338097 -297037 -287767 -364411 -278918 -299489 -292261 -282665 -285394 -290515 -396843
4615 -396843 -328121 -267770 -294506 -284209 -286346 -291913 -298310 -233728 -264515 -268022 -224347 -285647
4603 -285647 -274849 -269694 -264226 -281759 -287601 -221618 -259985 -185490 -278239 -244277 -245352 -236872 -216596
4590 -216596 -247201 -199892 -240536 -171151 -190830 -212406 -228102 -229288 -183912 -197873 -227597 -269856
4578 -269856 -247772 -173038 -129474 -218015 -143000 -220424 -209649 -200292 -150961 -166060 -135334 -99374
4566 -99374 -120310 -150160 -164183 -148875 -107370 -143354 -141721 -112266 -99706 -160558 -90413 -40118
4553 -146889 -110949 -76103 -109402 -64538 -91027 -65525 -120314 -104816 -120528 -50846 -90430 -95608
4541 -95608 -40052 -62320 -24994 -48276 -49488 -53438 -128108 -58765 -21372 5276 9592 -70032 -58346
4528e8346n6714B474M259J3891n783R297D633c749D1436A4659J2299N7855a5772
4514D9482j0657J3628p935M7958l7879A0498J6289l351I896L9234L863l259L5898
4501H5632j2836B3884N795K3962R7389l2466r76Q578K295j5022P5315l6366k731
4488A49657R751p022M1031q0730N7271N689H0622P4671k9439L6030N8837j1870
4476B08851j394L9888o2496L0516K3966k7814O361n123P1801o7459M8292j5169
4464B50220M27Q796n828J1241n480M2430l999k2087O0349l7484k8754L3655k0118
4451B83368J0180J7206m7869M7336K3657M406p3144J00268m6203L2758q553J2614
4439C56024O080L5678M6134j4783n1469k1875M7572k6226M7508J3014k5223L2535
$$ plain form
4528 -58346 -115060 2474 6733 20624 14841 24138 4633 -3749 41436 14659 26958 84813 -15772
4514 49482 38825 52453 44518 92476 54597 10498 26787 23436 9896 49130 52993 49734 85632
4501 85632 72796 23884 29679 53641 151030 118564 117588 126166 128461 113439 188754 152388 149657
4488 149657 159408 152386 193417 112687 169958 175647 80622 155293 125854 161884 220721 208851
4476 208851 207457 247345 184849 215365 239331 211517 217878 212755 284556 217097 265389 250220
4464 250220 250647 259443 253615 264856 259376 301806 297807 275720 336069 298585 269831 303486 283368
4451 283368 293548 310754 262885 310221 333878 338284 265140 365408 319205 351963 343410 356024
4439 356024 362104 397782 443916 429133 377664 355789 403361 377135 424643 437657 412434 444969
4427D44969p03n7141P1842k7346O446r214O2057j5050P329J5603k6518N6199p4452
4414D54021P6890j6000J1204j4106J7527l5723M4228M4343M2669q7601M9197l1741
4402E54908j4792J770R2618j5749k825j9788O7431o3294M0035K9038k3083O1097
4390G07366m1547m687J6541K9379j3759k896L2455k5385J0783N034m449m486Q6336
4377G90685r3522O2432o889k7730M5091O7473q0839J20896p5924Q663J1030N5837
4365H77203j5447Q27J7514l4502J0895L5625k2403M9422J8304M4827q0791M4131
4353I45605o1183R7831o1005O6300j7238N1641m2615n7010J12660n8025Q5430
4342A062391j0838L6726J8774M863p614L7121j168K254p086J9171l6531N2617
$$ plain form
4427 444969 444266 387125 458967 431621 438067 428853 490910 475860 483189 498792 472274 528473 454021
4414 454021 530911 514911 526115 512009 529536 493813 538041 582384 625053 537452 586649 554908
4402 554908 540116 541886 634504 618755 615930 596142 663573 600279 640314 669352 646269 707366
4390 707366 665819 661132 677673 707052 693293 690397 722852 697467 708250 713284 708835 704349 790685
4377 790685 697163 759595 752706 724976 770067 837540 756701 877597 801673 810336 821366 877203
4365 877203 861756 862583 880097 845595 856490 892115 869712 919134 937438 982265 901474 945605
4353 945605 884422 982253 921248 987548 970310 1021951 979336 922326 1034986 976961 1062391
4342 1062391 1051553 1088279 1107053 1111916 1104302 1141423 1140255 1142509 1135423 1154594 1118063 1170680
4330A170680L8645k6821O6394p7526O0815R9793n3301l2199P874M846J26288o7132
4318A318356J5010J5982L7655k3348J3940L5364q758L6504m7715K0319J3268N6693
4306A483270N5302O473n6247L9617P5662L203J0194q3661P0763N4973L7736J2318
4294A709603Q2824j9599K0663R8180J9611l207J08932M5485N1752j03886j51384
4283A858974k14043k03209j429J54985L6601K2470L2616L6466P7754R992J11301
4272A922478R567K1448J04448Q0649Q1229K2048Q591j14825j76772k58578q0322
4261A619961J7164J60599K1904M1633O4276J642M5165M6594K8733N1021K6345
4250B125037O606p951O8675R8937P0748o6975O6984o0517J05192l992M2471N9385
$$ plain form
4330 1170680 1209325 1182504 1248898 1171372 1232187 1331980 1278679 1246480 1254354 1259200 1385488 1318356
4318 1318356 1333366 1349348 1387003 1363655 1377595 1412959 1404201 1440705 1392990 1413309 1426577 1483270
4306 1483270 1538572 1545045 1488798 1528415 1604077 1607280 1617474 1533813 1604576 1659549 1697285 1709603
4294 1709603 1792427 1772828 1793491 1891671 1911282 1908075 2017007 2062492 2114244 2010358 1858974
4283 1858974 1644931 1441722 1440293 1595278 1631879 1654349 1686965 1723431 1801185 1811177 1922478
4272 1922478 1932045 1953493 2057941 2138590 2219819 2241867 2250458 2135633 1958861 1700283 1619961
4261 1619961 1637125 1797724 1819628 1861261 1925537 1927179 1972344 2018938 2047671 2098692 2125037
4250 2125037 2131643 2123692 2192367 2291304 2362052 2295077 2362061 2301544 2406736 2402744 2445215 2504600
4238B504600k3055K7588P4367K2211O021K9998K0766N5445P7344l3707J7188J5680
4226B794446O6300M8394O2071n3560M6406M7242R2916N4883J0552M9227j5173
4215C203704k7467P4212M1236Q8706m7999J15848K7712Q2116j2546M3035q459
4204C580098M3169M3343R6320K9576Q4129N1468j1342J16576M9210M929M1676
4193D129152O7462O1341N6356N1039O1683O6623j3047J22595Q3950O1069R7550
4182D845773J1306J24253O461J3956J45923M6440J7256J77642K1605J10625R4184
4171E615424P5584L1262J53806N385K06205O6461J04497J09731J89807O049J06309
4160F670520N5931K02453J25625J47705P9256J56019J19582J63339R9836K49665
$$ plain form
4238 2504600 2481545 2509133 2583500 2605711 2611732 2641730 2662496 2717941 2795285 2761578 2778766 2794446
4226 2794446 2860746 2909140 2971211 2917651 2964057 3011299 3104215 3159098 3169650 3218877 3203704
4215 3203704 3176237 3250449 3291685 3380391 3332392 3448240 3475952 3558068 3545522 3588557 3580098
4204 3580098 3623267 3666610 3762930 3792506 3876635 3928103 3916761 4033337 4082547 4087476 4129152
4193 4129152 4196614 4257955 4314311 4365350 4427033 4493656 4480609 4603204 4687154 4748223 4845773
4182 4845773 4857079 4981332 4987793 5001749 5147672 5194112 5211368 5389010 5410615 5521240 5615424
4171 5615424 5691008 5722270 5876076 5881461 6087666 6154127 6258624 6368355 6558162 6564211 6670520
4160 6670520 6726451 6928904 7054529 7202234 7281490 7437509 7557091 7720430 7820266 8069931
4150H069931L1097L12714J13719J85441J85768J75010K25157K05271K15296K67631
4140I987035K35494L33711K55007K87904J60601J88153P5973J79246M19857L59692
4130A2482673M50742M23111L85945N13379M64435N59678N57705O08380O36820
4121A7082868P42577P34593R03097R36747R29958R32319J056889J103778J471199
4112B5894025J682917J885934K179258K525484K883490L452416L850430M728594
4104D9082548N895641Q031401J1025760R359979l010617k2584143A2420734c9260886
4095e9346211Q360926J2388834R871335P534776O237994N501352d172879A342132
4086F975871N893198O584114P976824J0600235J1280551K418944j4366555d97376
$$ plain form
4150 8069931 8101028 8413742 8527461 8712902 8898670 9073680 9298837 9504108 9719404 9987035
4140 9987035 10222529 10556240 10811247 11099151 11259752 11447905 11523878 11703124 12122981 12482673
4130 12482673 12933415 13356526 13742471 14255850 14720285 15279963 15837668 16446048 17082868
4121 17082868 17825445 18560038 19463135 20399882 21329840 22262159 23319048 24422826 25894025
4112 25894025 27576942 29462876 31642134 34167618 37051108 40503524 44353954 49082548
4104 49082548 54978189 63009590 74035350 83395329 80384712 57800569 12420734 -39260886
4095 -59346211 -50985285 -38596451 -28725116 -21190340 -14952346 -9450994 -4172879 1342132
4086 6975871 12869069 19453183 27430007 38030242 49310793 51729737 37363182 -497376
4077e2377109l4498044J902510J2085100J0198370P404862N383354M132737L573952
4069d2194268L105796K744022K577093K128427J890742J574706J430095J259785
4061b5483602J189274J059190R48687Q67850P85654P16171P40853N82960N29084
4052a8063879O41166N31592L96639M68035M19018M06445M50950L46692L00375
4043a4102967L25403K08848L53427K34455K78992K65248K54757K39217J39137
4034a1803483K75452K40919J81555K11958J93259J21835J72815J56490K16407
4025a0032793J26964J03507J59097O7598J91309J13852Q9850J19210J98733J02753
4015h759920J33752N4248J69248M3032J11678J29525O1996Q6706R2166O8440J12310
$$ plain form
4077 -52377109 -86875153 -84972643 -72887543 -62689173 -55284311 -49900957 -45768220 -42194268
4069 -42194268 -39088472 -36344450 -33767357 -31638930 -29748188 -28173482 -26743387 -25483602
4061 -25483602 -24294328 -23235138 -22286451 -21418601 -20632947 -19916776 -19175923 -18592963 -18063879
4052 -18063879 -17422713 -16891121 -16494482 -16026447 -15607429 -15200984 -14750034 -14403342 -14102967
4043 -14102967 -13777564 -13568716 -13215289 -12980834 -12701842 -12436594 -12181837 -11942620 -11803483
4034 -11803483 -11528031 -11287112 -11105557 -10893599 -10700340 -10578505 -10405690 -10249200 -10032793
4025 -10032793 -9905829 -9802322 -9643225 -9575627 -9384318 -9270466 -9180616 -9061406 -8862673 -8759920
4015 -8759920 -8626168 -8571920 -8402672 -8359640 -8247962 -8118437 -8056441 -7969735 -7877569 -7809129 -7696819
4004g696819L1602Q9006J36201Q3950J01043n515J54829l6072O7946J68956j6156
3993f921029N6858J14338L6120J08431K1534R8687J6408M1885J39862N7724k4053
3982f253235J03050K7486k1481Q2775J6110J29714p193O6605N8571L462Q65Q9262
3970e704009M16R5865L0223N6382N6366M9688R258N4014p2740J29681M6433M992
3958e243431P8804l530P0793K7217l5622M1751O224Q3363O8987J9233O241M7854
3946d832116J8925M1488K7686L5100Q100N3487J2307M6527j2752K3705K9392L9570
3934d508581p4605J06176J20876l8934M6574p115P900Q4850k7392O4974M6092
3923d179185J2770l044N0622m8787O7940Q0665L4133L2006P9318k1056J05270
$$ plain form
4004 -7696819 -7665217 -7576211 -7440010 -7356060 -7255017 -7260532 -7105703 -7141775 -7073829 -6904873 -6921029
3993 -6921029 -6864171 -6749833 -6713713 -6605282 -6583748 -6485061 -6468653 -6426768 -6286906 -6229182 -6253235
3982 -6253235 -6150185 -6122699 -6144180 -6061405 -6045295 -5915581 -5922774 -5856169 -5797598 -5794136 -5793271 -5704009
3970 -5704009 -5703593 -5607728 -5577505 -5521123 -5464757 -5415069 -5405811 -5351797 -5424537 -5294856 -5248423 -5243431
3958 -5243431 -5164627 -5168157 -5097364 -5070147 -5105769 -5064018 -5057794 -4974431 -4905444 -4886211 -4879970 -4832116
3946 -4832116 -4813191 -4771703 -4744017 -4708917 -4700817 -4647330 -4635023 -4588496 -4601248 -4577543 -4548151 -4508581
3934 -4508581 -4583186 -4477010 -4356134 -4395068 -4348494 -4355609 -4347709 -4262859 -4290251 -4225277 -4179185
3923 -4179185 -4166415 -4169459 -4118837 -4167624 -4099684 -4019019 -3984886 -3952880 -3873562 -3894618 -3789348
3912c789348J53068r36k0705k13050k15716p2923j08477M1433Q4460M7601Q3297
3901d011296n9076J40323L7641P1J37799j4690J04840L5302K8617J05415o3591
3890c558645o8540j74677k07665j08296j3172R3671P5845k0311P6256M5964M0299
3879c819271j0732K546R7731M1819Q036j3682N7907j2043k7135J18120l4031K7497
3867c563238m244j7174O596J57516j56425N5707Q0089J1534l0263K4463r849O7697
3855c377591l890k8917M8818N4738n7149L3692o609M8759R873m008M602L1852
3843c245830M3535m2181P0023n9731P5287l8478J2379M178o285K4284K2673k886
3831c143032R948J9178K3833j921m375L969L1346l8652P4259n1274M3207k7530
$$ plain form
3912 -3789348 -3636280 -3637216 -3657921 -3870971 -4086687 -4159610 -4268087 -4226654 -4142194 -4094593 -4011296
3901 -4011296 -4070372 -3930049 -3892408 -3892337 -3754538 -3769228 -3664388 -3629086 -3600469 -3495054 -3558645
3890 -3558645 -3627185 -3801862 -4009527 -4117823 -4130995 -4037324 -3961479 -3981790 -3905534 -3859570 -3819271
3879 -3819271 -3830003 -3827457 -3729726 -3687907 -3679871 -3693553 -3635646 -3647689 -3674824 -3556704 -3590735 -3563238
3867 -3563238 -3567482 -3584656 -3578060 -3420544 -3576969 -3521262 -3441173 -3429639 -3459902 -3435439 -3445288 -3377591
3855 -3377591 -3381481 -3410398 -3361580 -3306842 -3363991 -3330299 -3336908 -3288149 -3278276 -3282284 -3277682 -3245830
3843 -3245830 -3202295 -3244476 -3174453 -3234184 -3158897 -3197375 -3184996 -3180818 -3187103 -3162819 -3140146 -3143032
3831 -3143032 -3133084 -3113906 -3090073 -3091994 -3096369 -3092400 -3061054 -3099706 -3025447 -3076721 -3033514 -3061044
3819c061044L0407K6917l5618J0931M4193r565j7476Q2446j1002Q796L2181n5969
3807b954803P5678l0850j5096P9839r1322M0390N266j102J2465m819K9546J6732
3795b838076R383j5650K2441P988K6036j5404N8514n4595K6577M2809l6703N2152
3783b714528o3157L0849K4733p3667j6585J06206k3583Q2361j32856Q8256q3834
3772b775805N2239K9049J1534N6292j9497N50M5948m1472l9992O5568O501J6513
3760b592572m5852j3312N1574j9792M8476m497J4461J9518K2098o1005O6235r4164
3748b608832j5475P9354j5649M1825j6543Q8230m8738J37l2192J0009l8475Q6937
3736b469412n5144P8336k1199l2388K4810k5437O8665l7958J445N7886j6937j6038
$$ plain form
3819 -3061044 -3030637 -3003720 -3039338 -3028407 -2984214 -2993779 -3011255 -2928809 -2939811 -2931015 -2898834 -2954803
3807 -2954803 -2879125 -2909975 -2925071 -2845232 -2936554 -2896164 -2890898 -2892000 -2879535 -2884354 -2854808 -2838076
3795 -2838076 -2828693 -2844343 -2821902 -2813914 -2787878 -2803282 -2744768 -2799363 -2772786 -2729977 -2766680 -2714528
3783 -2714528 -2777685 -2746836 -2722103 -2795770 -2812355 -2706149 -2729732 -2647371 -2780227 -2691971 -2775805
3772 -2775805 -2723566 -2694517 -2682983 -2626691 -2646188 -2645638 -2599690 -2641162 -2681154 -2615586 -2609085 -2592572
3760 -2592572 -2638424 -2651736 -2600162 -2619954 -2571478 -2575975 -2561514 -2541996 -2519898 -2580903 -2514668 -2608832
3748 -2608832 -2624307 -2544953 -2560602 -2518777 -2535320 -2447090 -2495828 -2495691 -2527883 -2517874 -2556349 -2469412
3736 -2469412 -2524556 -2446220 -2467419 -2499807 -2474997 -2500434 -2431769 -2469727 -2468282 -2410396 -2427333 -2443371
3724b443371M1738p1232P4508j5458K9378p0228N1623Q003O0195p575n0269J9395
3712b373293J6283m3738K5190L8501J878p4541J7691m244L4397K2046j3081L7505
3700b315406q151r359M1749l5516k1812O810J09776j07941L862L5909j5728L1903
3688b283904m0958Q4474j22378R7243M2536m1796J1585l1831J5614M6364m6289
3677b269340M6164j9521p936K6592m1323N6633m81j2549k1665O1299k5541K056
3665b205612N0001n4697N7533j7021l8198J7561P2242l9289r0353J18314l9958
3654b169477l9485O685O6279O342K5607p6167P0249m5458M8627l2637j84L2365
3642b107254m5855L3208k8755P7735l5597n249J6721k4715K9269Q18j2500p585
$$ plain form
3724 -2443371 -2401633 -2472865 -2398357 -2413815 -2384437 -2454665 -2403042 -2395039 -2334844 -2342419 -2392688 -2373293
3712 -2373293 -2357010 -2400748 -2375558 -2337057 -2335179 -2409720 -2392029 -2396273 -2361876 -2339830 -2352911 -2315406
3700 -2315406 -2323557 -2332916 -2291167 -2326683 -2348495 -2341685 -2231909 -2339850 -2335988 -2300079 -2315807 -2283904
3688 -2283904 -2324862 -2240388 -2362766 -2265523 -2222987 -2264783 -2253198 -2285029 -2269415 -2223051 -2269340
3677 -2269340 -2223176 -2242697 -2250633 -2224041 -2265364 -2208731 -2209212 -2221761 -2243426 -2182127 -2207668 -2205612
3665 -2205612 -2155611 -2210308 -2152775 -2169796 -2207994 -2190433 -2118191 -2157480 -2247833 -2129519 -2169477
3654 -2169477 -2208962 -2202277 -2135998 -2129656 -2104049 -2180216 -2109967 -2155425 -2106798 -2139435 -2139619 -2107254
3642 -2107254 -2153109 -2119901 -2148656 -2070921 -2106518 -2111767 -2095046 -2119761 -2090492 -2089674 -2102174 -2109759
3630b109759k540K0317K3016l0206J874m8658J24363l2487k0261L3882j8197j441
3618b060097j3992O7114n0334k115n1885Q9002M1130n4806k041l4638M5744K1709
3606b005209l5433M3569M0284m3217P232q7602Q7661k4132o447Q421M4498j6970
3594a987345O7178o7338j7978j4237J0267N4773l6751K6270n3276N6202l0921
3583a993156L0802K0124j9669n470L4014n9867j944P0643j4379K8734k07j07o8678
3570a979160K5410j3060j1737O2953k862o613l0355Q6405p479m9253J1565l0199
3558a944385N027M2928l506R307q402L825k2637K0864l2658M8547k5192k6845
3546a933127J12061j9733m188r175m9324P6235o7410k0228J9563N0240l5156M3402
$$ plain form
3630 -2109759 -2112299 -2091982 -2068966 -2099172 -2097298 -2145956 -2021593 -2054080 -2074341 -2040459 -2058656 -2060097
3618 -2060097 -2074089 -2006975 -2057309 -2059424 -2111309 -2022307 -1981177 -2035983 -2038024 -2072662 -2026918 -2005209
3606 -2005209 -2040642 -1997073 -1956789 -2000006 -1992774 -2080376 -1992715 -2016847 -2023294 -2014873 -1970375 -1987345
3594 -1987345 -1920167 -1987505 -2005483 -2019720 -2009453 -1954680 -1991431 -1965161 -2018437 -1962235 -1993156
3583 -1993156 -1962354 -1942230 -1961899 -1967369 -1933355 -1993222 -1995166 -1924523 -1938902 -1910168 -1910375 -1910482 -1979160
3570 -1979160 -1953750 -1966810 -1978547 -1915594 -1918456 -1925069 -1955424 -1869019 -1876498 -1925751 -1914186 -1944385
3558 -1944385 -1939358 -1896430 -1899936 -1890629 -1899031 -1895206 -1917843 -1896979 -1929637 -1881090 -1906282 -1933127
3546 -1933127 -1821066 -1840799 -1844987 -1854162 -1903486 -1827251 -1894661 -1914889 -1895326 -1845086 -1880242 -1836840
3534a836840L593M1540m0788l1425j4734L3046k1564p820L1388K4753l4498j7063
3522a870412O8569M5724k4327q7474P0704k8136n030N4901m4702L5968m7014J7045
3510a814184L0113k4059L1648k1667n746L069P001J4239M6980r1672l265N6753
3498a770790M309J3247L0264j1527j7970O673o8327J06234o3118J9844K0104m7043
3486a778100J1509O7504l611q8643Q4350l6846k6815m184M2994p5783N7581J0961
3474a739083L7445m3220M2102l2912K5505m2323K3321l3033K2094L6226j2433
3463a716311p6042P4424l5495J7206P442J3909n3438K6125o034K6151K5970r602
3451a705695j2264N5713j31154O7968L4165L1081l1161M2223q8998K7110j8753
$$ plain form
3534 -1836840 -1833247 -1791707 -1832495 -1863920 -1878654 -1845608 -1867172 -1874992 -1843604 -1818851 -1853349 -1870412
3522 -1870412 -1801843 -1756119 -1780446 -1867920 -1797216 -1825352 -1830382 -1775481 -1820183 -1784215 -1831229 -1814184
3510 -1814184 -1784071 -1808130 -1776482 -1798149 -1803895 -1800826 -1793825 -1779586 -1732606 -1824278 -1827543 -1770790
3498 -1770790 -1766481 -1753234 -1722970 -1734497 -1752467 -1745794 -1814121 -1707887 -1771005 -1751161 -1731057 -1778100
3486 -1778100 -1766591 -1699087 -1702698 -1791341 -1706991 -1743837 -1770652 -1774836 -1731842 -1807625 -1750044 -1739083
3474 -1739083 -1701638 -1744858 -1702756 -1735668 -1710163 -1752486 -1729165 -1762198 -1740104 -1703878 -1716311
3463 -1716311 -1792353 -1717929 -1753424 -1736218 -1728776 -1714867 -1768305 -1742180 -1748214 -1722063 -1696093 -1705695
3451 -1705695 -1717959 -1662246 -1793400 -1725432 -1691267 -1660186 -1691347 -1649124 -1738122 -1711012 -1729765
3440a729765J04969k0398P341l8916o2089M0696L8988m8891N3259j1285K9021
3429a637070n1477J4306K2139k4102O44j4994Q5344o4609j1789Q3375o6300Q7367
3417a577166p5955m1939Q8989l2597L4812o0646J7815M9123p2471O4317p3615
3406a679333P4741j7597O7864l4572m0883J5788k2567j7276O6977l7350l1194
3395a655402O6652l4596K8767j8115j3267K0756J9592p6144P2964k5296n5515
3384a669604R1455l0405K0884M5646p2875Q71P2494j9287j4022R032L73L0758
3372a534680l7716M276l0169k1022M1676J5361L813Q098o2061J8571r56m515O2554
3359a536770j548P864n4170J5613j8977k004P3089k2186j8362K9974J5355m0317
$$ plain form
3440 -1729765 -1624796 -1645194 -1637853 -1676769 -1738858 -1698162 -1659174 -1708065 -1654806 -1666091 -1637070
3429 -1637070 -1688547 -1674241 -1652102 -1676204 -1675560 -1690554 -1605210 -1669819 -1681608 -1598233 -1664533 -1577166
3417 -1577166 -1653121 -1695060 -1606071 -1638668 -1603856 -1664502 -1646687 -1597564 -1670035 -1605718 -1679333
3406 -1679333 -1604592 -1622189 -1554325 -1588897 -1629780 -1613992 -1636559 -1653835 -1586858 -1624208 -1655402
3395 -1655402 -1588750 -1623346 -1594579 -1612694 -1625961 -1605205 -1585613 -1661757 -1588793 -1614089 -1669604
3384 -1669604 -1578149 -1608554 -1587670 -1542024 -1614899 -1614028 -1541534 -1560821 -1574843 -1565811 -1565438 -1534680
3372 -1534680 -1572396 -1568120 -1598289 -1619311 -1577635 -1562274 -1558461 -1550363 -1612424 -1593853 -1594809 -1599324 -1536770
3359 -1536770 -1538318 -1530454 -1584624 -1569011 -1587988 -1589992 -1516903 -1539089 -1557451 -1527477 -1512122 -1552439
3347a552439K8556K1532o7238P499J2695J6043J1635o3395L7123m0680P5322j9900
3335a533247J021q437q772o3149J08738m0790n4039J52473l8805j9382k0756l1721
3323a556866K5163j587N909O3160o8746L9174k5031O4135r1089J9715p150L2382
3311a500831N5780o3262k4606M2344j6472o952J2485j8863M7843m3600j5067M3802
3299a487399J2700k6603J0601O493p5746J14055r3378M6806K0086J1941j0172
3288a470616N8974p1062M348M3828p4066Q6642l4695R862M1224j06531R8846j21520
3276a534766N0561R7263q3701K970J3289K5975k1922l5014M7763j8330l1451N1352
3264a436011j5139n922K4114J0245k3416M0411K0201j17327J9071j2298M5955
$$ plain form
3347 -1552439 -1523883 -1502351 -1569589 -1562090 -1549395 -1533352 -1521717 -1585112 -1547989 -1588669 -1513347 -1533247
3335 -1533247 -1532226 -1540663 -1549435 -1612584 -1503846 -1544636 -1598675 -1446202 -1485007 -1504389 -1525145 -1556866
3323 -1556866 -1531703 -1533290 -1527381 -1464221 -1532967 -1493793 -1518824 -1454689 -1545778 -1526063 -1533213 -1500831
3311 -1500831 -1445051 -1508313 -1532919 -1490575 -1507047 -1513999 -1501514 -1520377 -1472534 -1516134 -1531201 -1487399
3299 -1487399 -1474699 -1501302 -1490701 -1484208 -1559954 -1445899 -1539277 -1492471 -1472385 -1460444 -1470616
3288 -1470616 -1411642 -1482704 -1478356 -1434528 -1508594 -1421952 -1456647 -1446785 -1405561 -1512092 -1413246 -1534766
3276 -1534766 -1484205 -1386942 -1470643 -1467673 -1454384 -1428409 -1450331 -1485345 -1437582 -1455912 -1487363 -1436011
3264 -1436011 -1451150 -1457072 -1432958 -1422713 -1446129 -1405718 -1385517 -1502844 -1483773 -1496071 -1450116
3253a450116J9738M1400p8276L3747k7448L4349n4012J7748M3939j3739J6717
3242a415953j9331j5724k3426O8419n5480j6306M6316O437J3878N338l649q274
3230a417755J5297l7720L6944N1751m3675K829l026l7038P8789j14503R0879r4997
3218a472225N9823p667N2492n8919j5333K7847j5422N4828m316m2338K0693j937
3206a402474K4872k4763k9283J977M7261n2479P4130m4182j1053R2511r5439N6783
3194a362139n7909J5397M7671N3935m6491j06773R3542r419J6244K4515o4034
3183a395461N3596l8932J9489m978K798J9539m9883r792N1151j4268K9013j3055
3171a350783K5782k997k6642k3984j3881P3302r1343N3309K7210o4322J8475j9558
$$ plain form
3253 -1450116 -1430378 -1388978 -1467254 -1433507 -1460955 -1426606 -1480618 -1462870 -1418931 -1432670 -1415953
3242 -1415953 -1435284 -1451008 -1474434 -1406015 -1461495 -1477801 -1431485 -1425048 -1411170 -1405832 -1409481 -1417755
3230 -1417755 -1402458 -1440178 -1403234 -1351483 -1395158 -1392329 -1395355 -1432393 -1353604 -1468107 -1377228 -1472225
3218 -1472225 -1412402 -1420069 -1367577 -1426496 -1441829 -1413982 -1429404 -1374576 -1378892 -1421230 -1400537 -1402474
3206 -1402474 -1377602 -1402365 -1431648 -1429671 -1382410 -1434889 -1360759 -1404941 -1415994 -1323483 -1418922 -1362139
3194 -1362139 -1420048 -1404651 -1356980 -1303045 -1349536 -1456309 -1362767 -1372186 -1355942 -1331427 -1395461
3183 -1395461 -1341865 -1380797 -1361308 -1366286 -1363488 -1343949 -1393832 -1403624 -1352473 -1366741 -1337728 -1350783
3171 -1350783 -1325001 -1327998 -1354640 -1378624 -1392505 -1319203 -1410546 -1357237 -1330027 -1394349 -1375874 -1395432
3159a395432M7787K7688k00q2312K6858J0802K2388j6029L2842k0988M589K8553
3147a313454M1372q3819J8228M8893j13350P4666M614l6197J8208p74l7072K913
3135a375772Q2186l1486p2395J4535M2415P7370J3490j17879K7443k196L3844
3124a308445q7988O2131O1825q2307M3580L779j3081J9527J7333q7149N6416l1887
3112a346266L5601l0094M451J41817j22876M8807p7061m5183O8854N609j5834
3101a332175M8645Q88k533m9205K0446K0184K1424o3499K8877k544j59m8518R2391
3088a265778o6007P0331l9904L1178j3527K4618n5820J2825M4743m475K5459o440
3076a242797k4420L849k6428k3309j426j3077Q6102m3812J4485m9093P2181k6869
$$ plain form
3159 -1395432 -1347645 -1319957 -1320157 -1402469 -1375611 -1364809 -1342421 -1358450 -1325608 -1346596 -1342007 -1313454
3147 -1313454 -1272082 -1355901 -1337673 -1288780 -1402130 -1327464 -1322850 -1359047 -1340839 -1341613 -1378685 -1375772
3135 -1375772 -1293586 -1325072 -1397467 -1382932 -1340517 -1263147 -1249657 -1367536 -1340093 -1342289 -1308445
3124 -1308445 -1396433 -1334302 -1272477 -1354784 -1311204 -1307425 -1320506 -1300979 -1283646 -1370795 -1314379 -1346266
3112 -1346266 -1310665 -1340759 -1336308 -1194491 -1317367 -1268560 -1345621 -1390804 -1321950 -1316341 -1332175
3101 -1332175 -1283530 -1282642 -1285175 -1334380 -1313934 -1293750 -1272326 -1335825 -1306948 -1309492 -1309651 -1358169 -1265778
3088 -1265778 -1331785 -1261454 -1301358 -1270180 -1283707 -1259089 -1314909 -1302084 -1257341 -1261816 -1236357 -1242797
3076 -1242797 -1267217 -1263368 -1289796 -1313105 -1314531 -1327608 -1241506 -1285318 -1270833 -1319926 -1247745 -1274614
3064a274614L3926M1650j04112M6170K1241m6865k5164L6000l8174J03301k0858
3053a227499l6317J6672l7317N1770p7661J4005O3823j09177R4185j1360L2245
3042a226631j5975j0935l8878J5755m9938L9602L1486R357n6295P8832P1182p7463
3030a229901l5263k918K2096m2760Q0752j00402R0864L274m6485J8295r898K2058
3018a230288o284n1065O2554o0108M2226m0074l9095O8674K1011j4127K8013m4697
3006a263260J2592l6534J5599m419L2147l4239Q2378o1716L1200M347o370M8811
2994a179464l3178m6437M8383o193J550J1809n5743J017R683Q0375p6272M1896
2982a202574m0750L4856K2087r1201K1736K7713K8586p1997N3763l1945l9302
$$ plain form
3064 -1274614 -1240688 -1199038 -1303150 -1256980 -1235739 -1282604 -1307768 -1271768 -1309942 -1206641 -1227499
3053 -1227499 -1263816 -1247144 -1284461 -1232691 -1310352 -1296347 -1232524 -1341701 -1247516 -1258876 -1226631
3042 -1226631 -1242606 -1253541 -1292419 -1276664 -1326602 -1287000 -1255514 -1246157 -1302452 -1223620 -1152438 -1229901
3030 -1229901 -1265164 -1268082 -1245986 -1288746 -1207994 -1308396 -1217532 -1214258 -1260743 -1242448 -1252346 -1230288
3018 -1230288 -1236572 -1287637 -1225083 -1285191 -1242965 -1283039 -1322134 -1253460 -1232449 -1246576 -1218563 -1263260
3006 -1263260 -1250668 -1287202 -1271603 -1276022 -1243875 -1278114 -1195736 -1257452 -1226252 -1221905 -1228275 -1179464
2994 -1179464 -1212642 -1259079 -1210696 -1216889 -1215339 -1203530 -1259273 -1258256 -1248573 -1168198 -1244470 -1202574
2982 -1202574 -1243324 -1208468 -1186381 -1277582 -1255846 -1228133 -1199547 -1271544 -1217781 -1249726 -1289028
2971a289028J15985p7533J8209J55j9799K890O1072M149j3430m0483L5691m1770
2959a243892J3351k902P1739n6846R115J5465R647j7000n0181Q1843n689m9395
2947a224745L0690j3486K2816l0206J2133M663J8486J7507q2997J928N9657R485
2935a174069L7048j07149M3741k7852r943J12131q1511M5677o7071M4884j4537
2924a198651q106J3526k3320L0429L1412p3179Q4656m5507L2532j5029o361k6307
2912a203905K3198o325Q2485r0015K9572J1123m5788j5194J1348L8041P135n921
2900a164246n8826M0020L2098J995j5761K7165j8861l9643K3355p485M236K9925
2888a146028L0652o8914J6537J8144M5466j04240n615O2547n5741M0894O5269
$$ plain form
2971 -1289028 -1173043 -1250576 -1232367 -1232212 -1252011 -1249121 -1188049 -1183900 -1197330 -1237813 -1202122 -1243892
2959 -1243892 -1230541 -1233443 -1161704 -1218550 -1209435 -1193970 -1184323 -1201323 -1251504 -1169661 -1175350 -1224745
2947 -1224745 -1194055 -1207541 -1184725 -1214931 -1202798 -1198135 -1179649 -1162142 -1245139 -1243211 -1183554 -1174069
2935 -1174069 -1137021 -1244170 -1200429 -1228281 -1238224 -1126093 -1207604 -1161927 -1228998 -1184114 -1198651
2924 -1198651 -1206757 -1193231 -1216551 -1186122 -1154710 -1227889 -1143233 -1188740 -1156208 -1171237 -1177598 -1203905
2912 -1203905 -1180707 -1187032 -1104547 -1194562 -1164990 -1153867 -1199655 -1214849 -1203501 -1165460 -1158325 -1164246
2900 -1164246 -1223072 -1183052 -1150954 -1148959 -1164720 -1137555 -1156416 -1196059 -1172704 -1180189 -1175953 -1146028
2888 -1146028 -1115376 -1184290 -1167753 -1149609 -1104143 -1208383 -1213998 -1151451 -1207192 -1166298 -1101029
2877a101029p4933j5341N5750K0654Q726p0003r4440J54882k6529M118j6678j2847
2865a167670l6401J00177o0572O7371l1595l9735k9476K9681N9486n4999M7464
2854a116269l759o1572N7678j6657k9838K9760P949K0536m5585J5941l6891M3741
2842a134966j4891l2082N164N5191l9152q462N8299j7196p057j7138l1358J9343
2830a164305J8225J7193l1485j347N7399m429k4102l1371Q385P3514j00904M9913
2818a133314Q4334o6102J3223p969j7377K2620L222l9318L0116j8082J7257L3209
2806a078181n2538j8151L2588k458j3075P822j5547M9993K5386o1101P8431q5375
2794a132206N0081l2638P6405m5313j8942J2463K892l7260Q531L3188k912K0297
$$ plain form
2877 -1101029 -1175962 -1191303 -1135553 -1114899 -1106173 -1176176 -1270616 -1115734 -1142263 -1138145 -1154823 -1167670
2865 -1167670 -1204071 -1103894 -1164466 -1097095 -1128690 -1168425 -1197901 -1168220 -1108734 -1163733 -1116269
2854 -1116269 -1120028 -1181600 -1123922 -1140579 -1170417 -1140657 -1132708 -1112172 -1157757 -1141816 -1178707 -1134966
2842 -1134966 -1149857 -1181939 -1176775 -1121584 -1160736 -1169198 -1110899 -1128095 -1135152 -1152290 -1183648 -1164305
2830 -1164305 -1146080 -1128887 -1160372 -1161719 -1104320 -1108749 -1132851 -1164222 -1155837 -1082323 -1183227 -1133314
2818 -1133314 -1048980 -1115082 -1101859 -1109828 -1127205 -1104585 -1101363 -1140681 -1110565 -1128647 -1111390 -1078181
2806 -1078181 -1130719 -1148870 -1116282 -1118740 -1131815 -1123993 -1139540 -1089547 -1064161 -1125262 -1046831 -1132206
2794 -1132206 -1082125 -1114763 -1038358 -1083671 -1102613 -1090150 -1087258 -1124518 -1115987 -1082799 -1085711 -1065414
2782a065414j4387L2063o5540o0482P1053q423n7117L0195k8047J2720l462N9223
2770a097618L5731p6212K3650k8280J33j2898J20005j33977J08230m8751K2188
2759a087799j1101j0469n0193L1049N1501k981l9171N5210K3439m1798l374K9204
2747a056483p4068j789j6503M8722J7668N87j5444K1209J0521l7136M9623j12325
2735a165418J07567j1596j6626p735K6929q9917O8678J684J7797j5440N7306k5951
2723a052722n9689K8113j9592p9479R8401K0230L4048m8682O1063j23925J01211
2712a041023l0466K1772j4342k3986J0924L5025J8166o0056K0637K2967j2680
2701a053062l9874O2536m6543R990J2437L2906n8088j9817K2810L5250p5732P3356
$$ plain form
2782 -1065414 -1079801 -1047738 -1113278 -1173760 -1102707 -1111130 -1168247 -1138052 -1166099 -1153379 -1156841 -1097618
2770 -1097618 -1061887 -1138099 -1114449 -1142729 -1142596 -1155494 -1035489 -1169466 -1061236 -1109987 -1087799
2759 -1087799 -1098900 -1109369 -1159562 -1128513 -1077012 -1079993 -1119164 -1063954 -1040515 -1082313 -1085687 -1056483
2747 -1056483 -1130551 -1132340 -1148843 -1100121 -1082453 -1081866 -1097310 -1076101 -1065580 -1102716 -1053093 -1165418
2735 -1165418 -1057851 -1069447 -1086073 -1093808 -1066879 -1156796 -1088118 -1086434 -1068637 -1084077 -1026771 -1052722
2723 -1052722 -1112411 -1084298 -1103890 -1183369 -1084968 -1064738 -1030690 -1079372 -1018309 -1142234 -1041023
2712 -1041023 -1071489 -1049717 -1064059 -1088045 -1077121 -1042096 -1023930 -1083986 -1063349 -1040382 -1053062
2701 -1053062 -1092936 -1030400 -1076943 -1066953 -1054516 -1021610 -1079698 -1099515 -1076705 -1041455 -1117187 -1043831
2689a043831k110l9927J6113L4327J82K3838m0143l7445L7113l3666P449Q5917
2677i92183p9017J9078m4365P6164l5132O3892q8008R5918q0718O4723p6241M7850
2665a028039j9553j21919J22107J7044o0266M3636N220l577J9908r739l4238L5117
2653a034299o7125J2227Q631L6708j0137l4688N9674k4351M067Q6626j28807M9575
2641a041899Q312l8736N3697l1092J8885k1737k001L3181m6315O6404n4483l5807
2629a091591P7455j7620J7188n2606O3055l2802k6148J5709K2711p435p9597L4276
2617a077405M1255o8035O4117M009J147J5130r461k9603L7234l9610P2792j003
2605i89433K0898q1927j0467M4135j3946L0806k4605K7728Q11k6609k6034K8180
$$ plain form
2689 -1043831 -1045941 -1085868 -1069755 -1035428 -1035246 -1011408 -1051551 -1088996 -1051883 -1085549 -1078100 -992183
2677 -992183 -1071200 -1052122 -1096487 -1020323 -1055455 -991563 -1079571 -983653 -1064371 -999648 -1075889 -1028039
2665 -1028039 -1047592 -1169511 -1047404 -1030360 -1090626 -1046990 -1041770 -1045347 -1025439 -1035178 -1069416 -1034299
2653 -1034299 -1101424 -1089197 -1080566 -1043858 -1053995 -1088683 -1029009 -1053360 -1049293 -962667 -1091474 -1041899
2641 -1041899 -1033587 -1072323 -1018626 -1049718 -1030833 -1052570 -1054571 -1021390 -1067705 -1001301 -1055784 -1091591
2629 -1091591 -1014136 -1031756 -1014568 -1067174 -1004119 -1036921 -1063069 -1047360 -1024649 -1032084 -1111681 -1077405
2617 -1077405 -1036150 -1104185 -1040068 -1036059 -1034912 -1019782 -1029243 -1058846 -1021612 -1061222 -988430 -989433
2605 -989433 -968535 -1050462 -1060929 -1016794 -1030740 -999934 -1024539 -996811 -996000 -1022609 -1048643 -1020463
2593a020463n031M943N2471p8682Q345L6327l4638l2402N7732k1400K8347l1911
2581a036362K7160l4332J3333k1841M3268k093k0722L8900o9364K2880O4918l9173
2569a013428O344l5447K02Q1379n1030M81J2496k3296j9803O8083K0264p5752
2557a029507j1323P5070m7155M1123J450o0587J3935k5161L8721o4082K2189O8401
2545i76926m0141P024n980L807k2145O4450m1743J1464m8712M2615M9854p4241
2533a030674M0526n0650M0396n0438N1762k6467M200p98J5519m8382M9698m6149
2521a051457J38089m5927j8552L8405n1586l4036J1318j6116M1949n4455N9965
2510i82403M916n5874P3485k0396K9661n0359n5205J29956m5707n6636O8341k9119
$$ plain form
2593 -1020463 -1025494 -1020551 -968080 -1046762 -1038417 -1002090 -1036728 -1069130 -1011398 -1032798 -1004451 -1036362
2581 -1036362 -1009202 -1043534 -1030201 -1052042 -1008774 -1010867 -1031589 -992689 -1062053 -1039173 -974255 -1013428
2569 -1013428 -1007084 -1042531 -1042329 -960950 -1011980 -1011499 -999003 -1022299 -1042102 -974019 -953755 -1029507
2557 -1029507 -1040830 -965760 -1012915 -971792 -970342 -1030929 -1016994 -1042155 -1003434 -1067516 -1045327 -976926
2545 -976926 -1017067 -1010043 -1016023 -1012216 -1034361 -969911 -1011654 -1000190 -1048902 -1006287 -956433 -1030674
2533 -1030674 -990148 -1040798 -1000402 -1050840 -999078 -1025545 -1021345 -1022143 -1006624 -1055006 -1005308 -1051457
2521 -1051457 -913368 -959295 -977847 -939442 -991028 -1025064 -1013746 -1029862 -987913 -1042368 -982403
2510 -982403 -977487 -1033361 -959876 -980272 -950611 -1000970 -1056175 -926219 -971926 -1028562 -960221 -989340
2498i89340K4374l1423Q2228r2266J5812k4864N9719m2193N1978k1392o8608K8264
2486a007711k71M0349k4311N611L9458n2519l617l8857P3701n7958O2436n3551
2474a017240L217l578L6887r541N039M6751n9578k1792Q0269j0491j06745Q6932
2462i69870l5869J6609n381L703o671M2799j05915R6413l7001L8463J998p9203
2450a039925R5147j02385O2469O1550q8210N0159n9879J47886m7073J6759r9359
2439a002861L3125L97J8844M9983o8368k3009J9000K96K301J4828l5587J4598
2427i76453l8732O4060K5091n8770L0438J0410m7530P4455j2995o0212N2861p2805
2415a010182N2006j5243N920J9464n1468O2221j8407k2382P3714m3606N627K8791
$$ plain form
2498 -989340 -964966 -996389 -914161 -1006427 -990615 -1015479 -955760 -997953 -945975 -967367 -1035975 -1007711
2486 -1007711 -1007982 -967633 -991944 -986333 -946875 -999394 -1003011 -1041868 -968167 -1026125 -963689 -1017240
2474 -1017240 -1014023 -1017601 -980714 -990255 -985216 -938465 -998043 -1019835 -939566 -950057 -1056802 -969870
2462 -969870 -1005739 -989130 -994511 -990808 -997479 -954680 -1060595 -964182 -1001183 -962720 -960722 -1039925
2450 -1039925 -944778 -1047163 -984694 -923144 -1011354 -961195 -1021074 -873188 -920261 -903502 -1002861
2439 -1002861 -969736 -969339 -950495 -900512 -968880 -991889 -972889 -972593 -970292 -955464 -991051 -976453
2427 -976453 -1015185 -951125 -926034 -984804 -954366 -943956 -991486 -917031 -930026 -990238 -937377 -1010182
2415 -1010182 -958176 -973419 -967499 -948035 -999503 -937282 -955689 -978071 -904357 -947963 -942336 -913545
2403i13545K5393k9101j01779J1132K7377K0381L4033R732k9861n822n2774L20
2391a004514J2579N9126q298k1349M3194k7619j0947P5376q5536K6231m4647L1346
2379i55058l7815O405j5403Q1527q284j5978K1202M5068q9002j8893J08659l1496
2367i09068j1021j3435j5552P630J2332n0922L2744K2798n6472L4118L4719p4124
2355i86253O1546k3708o021r648P668k467L8137j673L5293m3341P380m3419O4997
2342i01509j271l344p4555O2313J2642n0170K9125m2159L4657p1307P3324K7614
2330i04640l4345j3118k0724L2302K074L3934r4897J01624P804k4567m4181N3954
2318i04780j1238m1063L669P5469q3951R3916J448l4532n4311L1119Q303q233
$$ plain form
2403 -913545 -888152 -917253 -1019032 -1007900 -980523 -960142 -926109 -916377 -946238 -952060 -1004834 -1004514
2391 -1004514 -991935 -932809 -941107 -962456 -919262 -946881 -957828 -882452 -967988 -941757 -986404 -955058
2379 -955058 -992873 -986468 -1001871 -920344 -928628 -944606 -923404 -878336 -967338 -986231 -877572 -909068
2367 -909068 -920089 -933524 -949076 -941446 -929114 -980036 -947292 -924494 -980966 -946848 -912129 -986253
2355 -986253 -924707 -948415 -954436 -964084 -956416 -958883 -920746 -922419 -887126 -930467 -923087 -966506 -901509
2342 -901509 -902780 -906124 -980679 -918366 -905724 -955894 -926769 -968928 -934271 -1005578 -932254 -904640
2330 -904640 -938985 -952103 -972827 -940525 -938451 -904517 -999414 -897790 -889986 -914553 -958734 -904780
2318 -904780 -916018 -957081 -953412 -877943 -961894 -867978 -866530 -901062 -955373 -924254 -915951 -924184
2306i24184m415p3201Q9166m011p997K5348m3257J0851R5758j09960O935j9486
2294i58453M7713q566N6307j01782K4273L6762n2337J3517L336q708J02306n5924
2282i01556k7221q185l3474L0929l6613N1354m523N750N5013j8016j4399q327
2270i09268r687m4606P6958m2475N3116M3380j06228P7007J0928m0866j2608o1034
2258i65383R7483L0991p2653m6880p561J7536K6949O6124k4224l6488K082o163
2246i18187K8701M790j22562J57346j12328J7131M7159P3482j15776O314M0957
2235h92973k5045K6465m2755M9191q33k9137J0708q534k152J3925k8382P7510
2223h52012n1120M460M2372m4711L877M5718q5595J0464l5445O1104M9509K7572
$$ plain form
2306 -924184 -928599 -1001800 -912634 -916645 -924642 -899294 -942551 -931700 -835942 -945902 -938967 -958453
2294 -958453 -910740 -919306 -862999 -964781 -940508 -903746 -956083 -942566 -939230 -947938 -845632 -901556
2282 -901556 -928777 -936962 -970436 -939507 -976120 -924766 -929289 -923539 -868526 -886542 -900941 -909268
2270 -909268 -918955 -963561 -886603 -929078 -875962 -832582 -938810 -861803 -850875 -891741 -904349 -965383
2258 -965383 -867900 -836909 -909562 -956442 -964003 -946467 -919518 -853394 -877618 -914106 -912024 -918187
2246 -918187 -889486 -884696 -1007258 -849912 -962240 -945109 -897950 -824468 -940244 -933930 -892973
2235 -892973 -918018 -891553 -934308 -885117 -885950 -915087 -904379 -912913 -915065 -901140 -929522 -852012
2223 -852012 -903132 -898672 -856300 -901011 -897134 -851416 -937011 -926547 -961992 -900888 -851379 -823807
2211h23807m7523l1580j58k5151M2189k5895j1548j5485K607O3685k6763m0932
2199i40361O4880o2233K8960L6537K1159o3894Q5393j936o7601j495l5190M5280
2187h90501J8079K8195q2274N2178k0496j9485L3538K0927R724n0933M5167q5703
2175i41584J16259k5694p6359P4785k1822n0063J01675m8806n881k9670Q7639
2164h19521n0629J9155n3825J7770K4798q99j7503M3382l4288o619j2439O5914
2152h24704m2732n1802q103K6171L5403o6521R9620k5443p180n1100L2978M7009
2140h36404m7728P413L0226j7854L819p9221J10410M176p8318M6340J8752q4435
2128i22824M4533n519l4219R1485j47444P5504J6208k07j9866J4984M8837j8057
$$ plain form
2211 -823807 -871330 -902910 -903068 -928219 -886030 -911925 -923473 -938958 -936351 -872666 -899429 -940361
2199 -940361 -875481 -937714 -908754 -872217 -851058 -914952 -829559 -831495 -899096 -900591 -935781 -890501
2187 -890501 -872422 -844227 -926501 -874323 -894819 -914304 -880766 -859839 -850115 -901048 -855881 -941584
2175 -941584 -825325 -851019 -927378 -852593 -874415 -924478 -822803 -871609 -877490 -907160 -819521
2164 -819521 -870150 -850995 -904820 -887050 -862252 -863151 -880654 -837272 -871560 -878179 -890618 -824704
2152 -824704 -867436 -919238 -927341 -901170 -865767 -932288 -832668 -858111 -865291 -916391 -883413 -836404
2140 -836404 -884132 -876719 -846493 -864347 -860528 -939749 -829339 -825163 -903481 -857141 -838389 -922824
2128 -922824 -878291 -883810 -918029 -826544 -973988 -898484 -882276 -882483 -902349 -887365 -838528 -856585
2116h56585l3829O667N7887j2595o880l2611L435Q1010l7794L6439j14982M6171
2104h63667k4155k4581Q1423m9931M4124k5204j4870j3109M9492p0039O3510k2105
2092h69112Q599M8749q1914M2001n749K5704k4518N747j1256O0069k9167k2750
2080h53597j1538k6290N2064j280l6835J4710j2794J6498j3986m9700P908J07499
2068h07341j5230l0275K5263m5608K9006j0479j956q429J0323l3673M7043N255
2056h36101J6047m3330P5788n1128l0201M7472l9629p280L3185n626J8857m9153
2044h71099O6073n2403L1605j3080R125m7434L1670K814J2923M948m7847J865
2032h70840p129J5422L2041J4541n1942R933Q613L2305r000n5775P8408o4205
$$ plain form
2116 -856585 -890414 -883747 -825860 -838455 -845335 -877946 -874511 -793501 -831295 -794856 -909838 -863667
2104 -863667 -887822 -912403 -830980 -880911 -836787 -861991 -876861 -889970 -840478 -910517 -847007 -869112
2092 -869112 -860513 -811764 -893678 -851677 -857426 -831722 -856240 -850493 -861749 -801680 -830847 -853597
2080 -853597 -865135 -891425 -839361 -840641 -877476 -862766 -875560 -859062 -873048 -922748 -914840 -807341
2068 -807341 -822571 -852846 -827583 -873191 -844185 -854664 -856620 -865049 -854726 -888399 -841356 -836101
2056 -836101 -820054 -863384 -787596 -838724 -868925 -821453 -861082 -868362 -835177 -840803 -821946 -871099
2044 -871099 -805026 -857429 -825824 -838904 -829779 -877213 -845543 -842729 -829806 -824858 -872705 -870840
2032 -870840 -877969 -862547 -830506 -815965 -867907 -857974 -849361 -817056 -826056 -881831 -803423 -867628
2020h67628n3697M2658M5932l9390L3449Q258K8533j7002m0569J8533j3263L7471
2008h16715J7950m6975K4435m6878M6191k6898L1324j8333O885K0151j5391j3729
1996h37983L3169m4204k6505P3805l5450j9371L442p59n980l219r729P021M2881
1983h22882j904N313n4689j6257J09823m9436k1188L2566n67o9370J01276l7515
1971h24830j7346N4232n7923N1766k7800l3472K2365k5482j033J9477j9211N1717
1959h07540L5016l2852n328P088k5155l301l5507Q2482j07350R8733l4363l8010
1947h66087L0375k2632K0762J3492k6643j7759J1806O3171o3956L3734j5263Q3740
1935g55260p6757J933j3313L5223p090n8179K5201K3466M0919j7471m2183J02392
$$ plain form
2020 -867628 -921325 -878667 -832735 -872125 -838676 -830418 -801885 -818887 -859456 -840923 -854186 -816715
2008 -816715 -798765 -845740 -821305 -868183 -821992 -848890 -817566 -835899 -829014 -808863 -824254 -837983
1996 -837983 -804814 -849018 -875523 -801718 -837168 -856539 -853097 -853856 -859836 -863055 -872784 -865763 -822882
1983 -822882 -824786 -819473 -874162 -890419 -780596 -830032 -851220 -818654 -819221 -888591 -787315 -824830
1971 -824830 -842176 -787944 -845867 -794101 -821901 -855373 -833008 -858490 -859523 -840046 -859257 -807540
1959 -807540 -772524 -805376 -810704 -803616 -828771 -832072 -867579 -785097 -892447 -793714 -828077 -866087
1947 -866087 -835712 -858344 -837582 -824090 -850733 -868492 -856686 -793515 -857471 -823737 -839000 -755260
1935 -755260 -832017 -830084 -843397 -808174 -815264 -873443 -848242 -824776 -783857 -801328 -843511 -741119
1923g41119j179o8827m9296N1600K5481l4284m7229P1621n9916l777J02694j14948
1911h69179P4219K8706l7440p0567Q1738n823k7271k4435Q921l0208J03151m9903
1899h18091K5459n146n0299J0349M7381q4633L5404k4167M2087L4874q9467Q9575
1887g86674m4434L0618K7180j00744O0904L2338r1590J9510N7385J476M6264m3328
1875g91095O532j0559k7746l1251M6613p056K1911l786q902J6546k9214m7481
1863h65488K6478l059R911J224M5858k7314k6693P4725l3135O1094k1775o3742
1851h21916K4578n6340l00R0303k4039J9775k6398l6951L9447R406l6116N9305
1839g59246k7099l2001O5657n0297J877L8012r7478Q7084m73k7122J9538O375
$$ plain form
1923 -741119 -742298 -811125 -860421 -808821 -783340 -817624 -864853 -793232 -853148 -856925 -754231 -869179
1911 -869179 -794960 -766254 -803694 -874261 -792523 -798346 -825617 -850052 -841131 -871339 -768188 -818091
1899 -818091 -792632 -797778 -848077 -837728 -790347 -874980 -839576 -863743 -821656 -786782 -876249 -786674
1887 -786674 -831108 -800490 -773310 -874054 -813150 -780812 -872402 -852892 -795507 -794031 -747767 -791095
1875 -791095 -784563 -795122 -822868 -854119 -807506 -814562 -792651 -796437 -805339 -788793 -818007 -865488
1863 -865488 -839010 -842069 -832158 -830934 -785076 -812390 -839083 -764358 -797493 -736399 -758174 -821916
1851 -821916 -797338 -853678 -853978 -763675 -787714 -767939 -794337 -831288 -791841 -782435 -818551 -759246
1839 -759246 -786345 -818346 -752689 -802986 -801109 -763097 -860575 -773491 -773964 -801086 -781548 -775173
1827g75173m4871L8727N7303q8002L9725o5458P2320l3260n0844J4891M936O606
1815h23100o433n904p892P6314M8038j01161o515K1853L3608m3010k0M5447k2456
1802g91231j1214K4255k2124l9064N7771L8067q2719k5212Q2586m4882J4075n543
1790h05235j9387O3994K6664q7751M1231M3791m4109o9113R4071p754m4133K6374
1778g81357n1405O6210m906n2584m1565Q1224k2943l663N9851j3882k2146N404
1766g81762k2805J586P012J3622l8060O1875q1183Q6919J0551n5410L6824l0408
1754g91239k2288K9473J6536k0269l2023N9677J2455J1641o4073K9923l077L3304
1742g39960o5807K3609r293k6257L3894m5294M1706K0949m251k5232O2832n7394
$$ plain form
1827 -775173 -820044 -781317 -724014 -812016 -772291 -837749 -765429 -798689 -849533 -834642 -829706 -823100
1815 -823100 -829533 -835437 -843329 -767015 -718977 -820138 -826653 -804800 -771192 -814202 -814222 -768775 -791231
1802 -791231 -802445 -778190 -800314 -839378 -781607 -743540 -826259 -851471 -768885 -813767 -799692 -805235
1790 -805235 -824622 -760628 -733964 -821715 -780484 -736693 -780802 -849915 -755844 -763598 -807731 -781357
1778 -781357 -832762 -766552 -771458 -824042 -865607 -784383 -807326 -810989 -751138 -765020 -787166 -781762
1766 -781762 -804567 -802981 -795969 -782347 -820407 -758532 -839715 -752796 -742245 -797655 -760831 -791239
1754 -791239 -813527 -784054 -767518 -787787 -819810 -760133 -747678 -736037 -800110 -770187 -773264 -739960
1742 -739960 -805767 -782158 -791451 -817708 -783814 -829108 -787402 -766453 -770704 -795936 -733104 -790498
1730g90498O4178r4098L3062n0511M4136K7609m4569L7781o4055P6071l4383j9858
1718h15135M5188j4552n4911L2947J2725L8926k5073J1489k3885J4125j4056L4950
1706g57262k7721k71M0638J4663m6347N401M2550n1901m3550K0864R269L9758
1694g53909n0460N5995k6908L736R775P9161r7173N2836p7046J0724J791M3492
1682g47986L8490r4049K3628M5213m8760K1717K9541K1792j28065J22241j1850
1671g28088p6986M4532k8044N2837q4397O0045J645k2539m1449P4146l4496l4547
1659h17341M1981N0784j8454k3336n2520M2430k09M40j4712k1954M9252j1577
1647g75216K7355M6913m622q4405j9645L2P641M3283l3602L0845m6237M4869j5618
$$ plain form
1730 -790498 -726320 -820418 -787356 -837867 -793731 -766122 -810691 -772910 -836965 -760894 -795277 -815135
1718 -815135 -769947 -784499 -839410 -806463 -793738 -754812 -779885 -768396 -792281 -778156 -792212 -757262
1706 -757262 -784983 -785254 -744616 -729953 -776300 -770899 -728349 -780250 -823800 -802936 -793667 -753909
1694 -753909 -804369 -748374 -775282 -771546 -761771 -682610 -779783 -726947 -803993 -793269 -791478 -747986
1682 -747986 -709496 -803545 -779917 -734704 -783464 -761747 -732206 -710414 -838479 -716238 -728088
1671 -728088 -805074 -760542 -788586 -735749 -820146 -760101 -758456 -780995 -822444 -748298 -782794 -817341
1659 -817341 -775360 -724576 -743030 -766366 -818886 -776456 -776665 -776225 -790937 -812891 -763639 -775216
1647 -775216 -747861 -700948 -705570 -789975 -809620 -809588 -801947 -758664 -792266 -761421 -807658 -762789 -778407
1634g78407m3319O4513k2192J8748O2454j1318l3595n931j8457K0620j3322m4169
1622h04375K2159N0690l7216j1868m684R612L2227j24019J36783m8043L3820J8639
1610g26275l9011l5781P9409K4001m1808m0951N1607o416J4976n8950m3506J01634
1598g21071m7170J9736K4385l210j9265j6826p797n4017J1805M5852M6698m7416
1586g68296J2078N4242r097l658l5482J4202J7449m0749N1877l9145l0865M9643
1574g27801j6207K3989q5085Q7096l1262k9689M5382n520j5931O5706j24882M7790
1562g66414N3408k2733o0502O4571k1686P0766j06667L4522n9460N6785J618l297
1550g59089J6739L32l3579j2469M5170o574K0296j3200M147K6998n9506M7788
$$ plain form
1634 -778407 -821726 -757213 -779405 -760657 -698203 -709521 -743116 -749047 -767504 -746884 -760206 -804375
1622 -804375 -782216 -731526 -768742 -780610 -785294 -775682 -743455 -867474 -730691 -778734 -744914 -726275
1610 -726275 -765286 -801067 -721658 -697657 -739465 -780416 -728809 -735225 -720249 -779199 -822705 -721071
1598 -721071 -768241 -748505 -724120 -727330 -746595 -763421 -771218 -825235 -813430 -767578 -720880 -768296
1586 -768296 -756218 -701976 -711073 -714731 -750213 -736011 -718562 -759311 -707434 -746579 -777444 -727801
1574 -727801 -744008 -720019 -805104 -718008 -749270 -778959 -733577 -739097 -755028 -689322 -814204 -766414
1562 -766414 -713006 -735739 -796241 -731670 -753356 -682590 -789257 -754735 -814195 -757410 -755792 -759089
1550 -759089 -742350 -742018 -775597 -788066 -742896 -749470 -729174 -742374 -738227 -711229 -770735 -722947
1538g22947n2631M0615k2996K9288n955k7054L8188N3166k6746m6799K3368J6461
1526g04042n8007L1762q124L3466k0047j3914J6403K0150p7553K3154k8059J02613
1514f82198q9858N2164k2359k928k7349M8091l9197M7291j319k839l1716N8617
1502f93600j01464Q9038n3230N9370m4269K1992K0121l4794n4986Q6021J1345
1491f94456p8338L0972K5220k000m3099Q2063p0242M7558k1962j1201J3853k711
1479g24343M4328j12147P3041m0252J5471l3473p673M0589k4724R660m823k072
1467g66418P9104n1817M2620n6095k1242J5684O7418n0256M4251p4218O6052j2474
1455g17391l6093J7174n6023L0946N217m1171O6770J539n3710N8718N5799j15884
$$ plain form
1538 -722947 -775578 -734963 -757959 -728671 -734626 -761680 -723492 -670326 -697072 -743871 -720503 -704042
1526 -704042 -762049 -730287 -738411 -704945 -724992 -738906 -722503 -702353 -779906 -756752 -784811 -682198
1514 -682198 -772056 -719892 -742251 -745179 -772528 -724437 -763634 -716343 -717662 -720501 -752217 -693600
1502 -693600 -795064 -706026 -759256 -699886 -744155 -722163 -702042 -736836 -791822 -705801 -694456
1491 -694456 -772794 -741822 -716602 -718602 -761701 -679638 -749880 -702322 -724284 -735485 -721632 -724343
1479 -724343 -680015 -792162 -719121 -759373 -743902 -777375 -785048 -744459 -769183 -759523 -764346 -766418
1467 -766418 -687314 -739131 -696511 -752606 -773848 -758164 -690746 -741002 -696751 -770969 -704917 -717391
1455 -717391 -753484 -736310 -792333 -761387 -756170 -797341 -730571 -729032 -782742 -724024 -668225 -784109
1443g84109J03973q7306N6476k5970p808l1246J32995j07094L1241M028J0128
1432g04692k6354o6796N3777K3353m8255M3733k4442O0640k0143L2539o7484R799
1420g34325K1832M72O5676q3285N9485n212j00135M4448L0323k6003j8911L9636
1408g05999k1780m0232K3282J2951N482Q8610k6499o552j9298k6341m1136M7450
1396g10062K8439o9844L577N7925p480j8672j1686J3247j0835l818P198J7209
1384g04802m1234L0982l4959N4675m055p739o0911R5346k8093j1906r986K3284
1372f99398l8489K6169M185M2249n2545K7227p883l2166k134N7021o3438J3012
1360g26190K9529n2895P0138n392m3196k1821P1198m0325k0171M4865J6354j13546
$$ plain form
1443 -784109 -680136 -767442 -710966 -736936 -744744 -775990 -642995 -750089 -718848 -714820 -704692
1432 -704692 -731046 -797842 -744065 -720712 -768967 -725234 -749676 -689036 -709179 -676640 -744124 -734325
1420 -734325 -712493 -712021 -646345 -729630 -670145 -675357 -775492 -731044 -700721 -726724 -745635 -705999
1408 -705999 -727779 -768011 -744729 -731778 -726296 -637686 -664185 -670737 -690035 -716376 -757512 -710062
1396 -710062 -681623 -751467 -747890 -689965 -697445 -716117 -727803 -714556 -725391 -729209 -722011 -704802
1384 -704802 -746036 -715054 -750013 -695338 -699393 -707132 -768043 -672697 -700790 -712696 -722682 -699398
1372 -699398 -737887 -711718 -707533 -665284 -717829 -690602 -698485 -730651 -732785 -675764 -739202 -726190
1360 -726190 -696661 -749556 -679418 -684810 -728006 -749827 -678629 -718954 -739125 -694260 -677906 -791452
1348g91452P7582k7978P7716q6708P2987k6579J237m0723j2719O9208J0900k9621
1336g06150k952q379j4603r828L1444l7135J7393N5277K6822o7728j9872M5246
1324f90465k8451K2516M6378j00290K9175J9010k7941L5051m5784K0186k4498
1313g45113J3386m7057Q9784k2393q901K0083j0227J2011j4506l128l0970O6283
1301f80748l1434Q570k5461k4190O3530l1942M502k3839M0312J3948K0548j2482
1289f78686j2168j4215M0151l2788M850K4121q0472L0271k1702k0976M2881J3535
1277g05198m958K1391Q0828o2144m7287J8565n0561K9682O3776j5576m2283K3198
1265f90567L8368j05695L6763m765O2198m2985n6435Q3816l9024M6988n1905M1771
$$ plain form
1348 -791452 -713870 -741848 -664132 -750840 -677853 -704432 -703195 -743918 -756637 -687429 -676529 -706150
1336 -706150 -709102 -717481 -732084 -741912 -710468 -747603 -730210 -674933 -648111 -715839 -735711 -690465
1324 -690465 -718916 -696400 -650022 -750312 -721137 -702127 -730068 -695017 -740801 -720615 -745113
1313 -745113 -731727 -778784 -689000 -711393 -720294 -700211 -710438 -698427 -712933 -716061 -747031 -680748
1301 -680748 -712182 -703612 -729073 -753263 -689733 -721675 -717173 -741012 -700700 -686752 -666204 -678686
1289 -678686 -690854 -705069 -664918 -697706 -692856 -668735 -749207 -718936 -740638 -761614 -718733 -705198
1277 -705198 -710156 -688765 -607937 -670081 -717368 -698803 -749364 -719682 -655906 -671482 -713765 -690567
1265 -690567 -652199 -757894 -721131 -725896 -663698 -706683 -763118 -679302 -718326 -671338 -723243 -681472
1253f81472j2576o051O645q0747Q8104k7357N9406j6392r2009N5315K3203M51
1241f83480K7329j9957N2839j15396K6724J5413J1663k4463k4465M3982N8028
1230f31783j6585j3082o7583k6075P2562J8174o4908P8718j005J542k7362p5253
1218g52640N1611P8414l698q5121J598o739J1460j7068J847L8392k4704o250K8664
1205f84234L4140n8782k0792N3997m837L8860r4323l194j6194L9433N7370o704
1193f65260k624k8908K9935M094n7120P7420k6788r484k2894L4430l854k4247
1181f95300j646o5223N7495N8500j18002Q1541M7365m8698K1695m54j02981Q9399
1169f76309j6105N2426j2324l4248J8356M2901n7851L43k8939O7776m32m0774
$$ plain form
1253 -681472 -694048 -700099 -693454 -774201 -686097 -713454 -654048 -670440 -762449 -707134 -683931 -683480
1241 -683480 -656151 -676108 -623269 -738665 -711941 -696528 -684865 -709328 -733793 -689811 -631783
1230 -631783 -648368 -661450 -729033 -755108 -682546 -664372 -729280 -650562 -651567 -650025 -677387 -752640
1218 -752640 -701029 -622615 -626313 -711434 -709836 -716575 -705115 -722183 -720336 -681944 -706648 -712898 -684234
1205 -684234 -650094 -708876 -729668 -675671 -680508 -641648 -735971 -739165 -755359 -715926 -658556 -665260
1193 -665260 -667884 -696792 -666857 -662763 -719883 -642463 -669251 -678735 -701629 -667199 -671053 -695300
1181 -695300 -696946 -762169 -704674 -646174 -764176 -682635 -635270 -683968 -662273 -662727 -765708 -676309
1169 -676309 -692414 -639988 -652312 -686560 -668204 -625303 -683154 -682811 -711750 -643974 -644406 -685180
1157f85180M0126n1187M4311n4043R6383q5164j1938n38K169M5002q4714O7166
1145f77607l6545K4602k1042N8602m7778P9629r0413L650Q6529r4413M7217J6523
1133f51046n4253K0471l1100L371M3263j3453M3132o7466O5732j09603R1577m8119
1121g07494P7083o0129m9034O2441Q915K862J6979l4304M053m9663N6896j983
1109f73378R689k4165P1355l2480q602l9844J7272j7443k1228M6590k8389M3007
1097f57616M330k150q302J9476J4684j9027l3617j2737M6670p5319J12286o8846
1085f80168J0120l619k5216K8109j6716K1727j2819K9459l0689M3028j7748J1841
1073f42691j2778l2683J849J2319M7481k6508l1208m636M2138o1296M5334L1425
$$ plain form
1157 -685180 -645054 -696241 -651930 -705973 -609590 -694754 -706692 -707230 -705061 -660059 -744773 -677607
1145 -677607 -714152 -689550 -710592 -651990 -699768 -620139 -710552 -706902 -620373 -714786 -667569 -651046
1133 -651046 -705299 -684828 -715928 -712557 -669294 -682747 -639615 -707081 -641349 -750952 -659375 -707494
1121 -707494 -630411 -690540 -739574 -677133 -668218 -665356 -648377 -682681 -678628 -728291 -671395 -673378
1109 -673378 -663689 -687854 -616499 -648979 -657581 -697425 -680153 -697596 -718824 -672234 -700623 -657616
1097 -657616 -653286 -655436 -663738 -644262 -629578 -648605 -682222 -694959 -648289 -723608 -611322 -680168
1085 -680168 -670048 -673667 -698883 -670774 -687490 -665763 -678582 -649123 -679812 -636784 -654532 -642691
1073 -642691 -655469 -688152 -686303 -673984 -626503 -653011 -684219 -688855 -646717 -708013 -662679 -631254
1061f31254n5990K8484K5527r193o3423O3295K2640r9702M9761l880q758O3260
1049f19233l5066J5838J899m0349N0260n1789M7872q2780P8733o8075N8669p728
1037f51749o7657L4953k5381L7416Q718M7242n8227L9630m2426K7581l7363j2309
1025f99572O633J2972K4412R960o95q293j3137o1324P8445N731m9049M0028l2580
1012f86469j4145N1788k7472J8928l7091O4670m1765l0888J04434p5849n4657
1001g28516O1909p814r395j7003Q2458p575K728k6884m2591L2301J5356j7819
989f62845M5583o1356m0717M3460O1119k0642l8783J7710L7498J4492n9445j914
977f65840K0492k262l8942n813N7584j4984m4057l871K623K8475J319J325k8786
$$ plain form
1061 -631254 -687244 -658760 -633233 -642426 -705849 -642554 -619914 -719616 -669855 -673735 -682493 -619233
1049 -619233 -654299 -638461 -636562 -676911 -626651 -678440 -630568 -713348 -634615 -702690 -644021 -651749
1037 -651749 -719406 -684453 -709834 -672418 -663700 -616458 -674685 -635055 -677481 -649900 -687263 -699572
1025 -699572 -692939 -679967 -655555 -645595 -646290 -654583 -667720 -729044 -650599 -644868 -693917 -653889 -686469
1012 -686469 -700614 -648826 -676298 -657370 -694461 -629791 -671556 -702444 -598010 -673859 -728516
1001 -728516 -666607 -674421 -683816 -700819 -618361 -625936 -623208 -650092 -692683 -660382 -645026 -662845
989 -662845 -617262 -678618 -719335 -675875 -614756 -635398 -674181 -656471 -618973 -604481 -663926 -665840
977 -665840 -645348 -647610 -686552 -692365 -634781 -649765 -693822 -697693 -695070 -666595 -665276 -663951 -692737
964f92737N2212J7005k2892l2524N8157r8491J1099N4120J2809m0884K0116O5292
952e96718j8358k4424K1506o1391J4160L3398K1934p3290L1811L0298l5821O668
940f50227m8044R3043m2508j9380Q9354j25425O8497j338L5337q412o3856P59
928f72200n836l0038P4573j8377k4070l294J5355P3194J1846o9917r599j7269
916f75632M5217k4941K3180N175o7378Q010K4346Q830J235J2008N4890p0222P1910
903e83372l8190m928m0023k4403l3922Q3054K0017k0099K634l2596P0522m4415
891f45721q3210Q9190N5637p9520K964K3407k9665l69L670N85Q5169p9985L3179
878f24669l6117j1747L5355k1404l3255O2069k2491J5475k7009L4650j6564J8967
$$ plain form
964 -692737 -640525 -623520 -646412 -678936 -620779 -719270 -708171 -654051 -641242 -682126 -662010 -596718
952 -596718 -615076 -639500 -617994 -679385 -665225 -631827 -609893 -683183 -651372 -621074 -656895 -650227
940 -650227 -698271 -605228 -647736 -667116 -577762 -703187 -634690 -636028 -600691 -609103 -672959 -672200
928 -672200 -678036 -708074 -633501 -651878 -675948 -679242 -663887 -590693 -578847 -648764 -658363 -675632
916 -675632 -630415 -655356 -632176 -627001 -694379 -686369 -662023 -653193 -651958 -639950 -585060 -655282 -583372
903 -583372 -621562 -626490 -666513 -690916 -724838 -641784 -621767 -641866 -639232 -671828 -601306 -645721
891 -645721 -728931 -639741 -584104 -663624 -660660 -637253 -666918 -667287 -663617 -663032 -577863 -657848 -624669
878 -624669 -660786 -672533 -637178 -658582 -691837 -629768 -652259 -636784 -663793 -629143 -645707 -626740
866f26740N83l8407M1602L4706m3216k882k3332l6518j030J3384N6809r072N125
853f28988n0751P1502j00582Q5716o782l996J3131k8222k3655L4005m0936L4731
841f44827j572K210k3312K2533P1327M6649j60095L1143L1840j5841L9369q5605
829f86181O5833m4365m326M3856J919l0766L6202o353K0483k3330m805n4484R0038
816e96279L0121j00067L6804j8148l0642K1736M7597j7620N1369r9006L7506p3681
804g10310K2367O697K1816l6850J04991n1995O531l9884L5127J6163l069J1354
792f17062L5730r7650q132O8459m310K6304K9062o5044r963Q313l6094L5526k974
779f37835K6109l4622J7421j047O9134m6107m9197Q98J2964M0022j5004m978l9437
$$ plain form
866 -626740 -626157 -664564 -622962 -588256 -631472 -634354 -657686 -694204 -695234 -681850 -625041 -634113 -628988
853 -628988 -679739 -608237 -708819 -623103 -629885 -633881 -620750 -648972 -672627 -638622 -679558 -644827
841 -644827 -646399 -644189 -667501 -644968 -573641 -526992 -687087 -655944 -624104 -639945 -600576 -686181
829 -686181 -620348 -664713 -669039 -625183 -623264 -654030 -617828 -624181 -603698 -627028 -631833 -686317 -596279
816 -596279 -566158 -666225 -629421 -647569 -678211 -656475 -608878 -626498 -575129 -674135 -636629 -710310
804 -710310 -687943 -681246 -659430 -696280 -591289 -643284 -636753 -676637 -641510 -625347 -628416 -617062
792 -617062 -581332 -678982 -687114 -618655 -622965 -596661 -567599 -632643 -642606 -634293 -670387 -634861 -637835
779 -637835 -611726 -646348 -628927 -629974 -560840 -606947 -656144 -655246 -642282 -602260 -617264 -622242 -661679
766f61679M7861m2106M8412O251o1337J4554j37R0657n0435k6517n3136P9303
754f08309l4829j256k9882N4364L498K9586O081p5679M6309n7992M6779j1235
742f32565M7084n2125O818J006L220N7396q0605o230K3787j1641M2269K3835l3476
729f11227k1636N3523o7514P215K7956o6385N0876p194K3732p989L3407p6585
717f61821O5577K9858o8474L56N1779l0385q492j0559L2885m7770M4068K7254
705e75724n5527K3232k4781m2040N4085J1610l1967J7391L4615j8494n6520Q9233
693e74887j0408k1424j5803j07654J35026N615l7183l7454O1582m5752M7561n861
681f06642j8587Q754k8240P7146m507k0430n2674M3697o9719N5718J9001R381
$$ plain form
766 -661679 -613818 -655924 -607512 -601261 -662598 -648044 -648181 -557524 -607959 -634476 -687612 -608309
754 -608309 -643138 -644394 -674276 -619912 -616414 -586828 -580747 -656426 -610117 -668109 -621330 -632565
742 -632565 -585481 -637606 -630788 -629782 -626562 -569166 -649771 -656001 -632214 -643855 -601586 -577751 -611227
729 -611227 -632863 -579340 -646854 -639639 -611683 -678068 -627192 -634386 -610654 -618643 -585236 -661821
717 -661821 -596244 -566386 -634860 -634504 -582725 -613110 -621602 -632161 -599276 -647046 -602978 -575724
705 -575724 -631251 -608019 -632800 -674840 -620755 -609145 -641112 -623721 -589106 -607600 -664120 -574887
693 -574887 -585295 -606719 -622522 -730176 -595150 -589535 -626718 -664172 -602590 -648342 -600781 -606642
681 -606642 -625229 -616475 -644715 -567569 -572076 -592506 -645180 -601483 -671202 -615484 -596483 -587102
669e87102k7261n4190P0452j5446p636N8506o6137R756o849K3298o2782L5108
657f30283n0604O4469n5527J6299L0087j583J1018m2225Q6463m0747M063j2922
645f21492M6238o8109j0025Q7962l2250j229K493n1508J4596L5226l7915K697
633f33316n413m2512J15975j5454o9915M733J6096P0809j04682M9666L3162r3381
621f74232J00128j6801J1418k3247j3299j4284N624L5508k4637N0194k8147J5922
609e75853k4789R602J8252l3976J1069n760L1481q3323N9765n5411P9499o4253
$$ plain form
669 -587102 -614363 -668553 -598101 -613547 -621183 -562677 -628814 -619058 -625907 -602609 -665391 -630283
657 -630283 -680887 -616418 -671945 -655646 -625559 -627142 -616124 -658349 -571886 -612633 -608570 -621492
645 -621492 -575254 -643363 -653388 -565426 -597676 -598905 -596412 -647920 -633324 -598098 -636013 -633316
633 -633316 -638729 -681241 -565266 -580720 -650635 -645902 -629806 -558997 -663679 -614013 -580851 -674232
621 -674232 -574104 -590905 -579487 -602734 -616033 -630317 -624693 -589185 -613822 -563628 -591775 -575853
609 -575853 -600642 -591040 -572788 -606764 -595695 -601455 -569974 -653297 -593532 -648943 -569444 -633697
$$ [...]
##END NTUPLES=NMR SPECTRUM
##END=
