##TITLE=Analysis number 330488
Compound Code cc 50604
Book Reference 521/145
Project Code adrs
Chemist Name evam
##JCAMPDX= 6.0         $$ Bruker NMR JCAMP-DX V2.0
##DATA TYPE= NMR SPECTRUM
##DATA CLASS= NTUPLES
##ORIGIN= Bruker BioSpin GmbH
##OWNER= nmr
$$ XWIN-NMR		Version 3.5
$$ Thu Nov 29 13:51:28 2007 GMT Standard Time (UT+0h)  MAYBRIDGE\nmr@NMR_250MHZ
##.OBSERVE FREQUENCY= 250.131544655141
##.OBSERVE NUCLEUS= ^1H
##.ACQUISITION MODE= SIMULTANEOUS (DQD)
##.ACQUISITION SCHEME= undefined
##.AVERAGES= 16
##.DIGITISER RES= 18
##SPECTROMETER/DATA SYSTEM= dpx250
##.PULSE SEQUENCE= zg30
##.SOLVENT NAME= CDCl3
##.SHIFT REFERENCE= (INTERNAL, CDCl3, 0, 16.522)
##AUDIT TRAIL= $$ (NUMBER, WHEN, WHO, WHERE, WHAT)
$$ ##TITLE= Audit trail, XWIN-NMR		Version 3.5
$$ ##JCAMPDX= 5.01
$$ ##ORIGIN= Bruker BioSpin GmbH
$$ ##OWNER= nmr
$$ C:\u/data/dgb/nmr/ADRS/2500/pdata/1/auditp.txt
$$ ##AUDIT TRAIL=  $$ (NUMBER, WHEN, WHO, WHERE, WHAT)
(   1,<2007-11-29 13:51:04.74 +000>,<MAYBRIDGE\nmr>,<NMR_250MHZ>,
      <created by zg, POWCHK disabled, PULCHK disabled
       configuration hash MD5:
       76 6E 9A 78 1E 09 19 81 EC 84 63 8F B0 6A 59 2D
       data hash MD5: 64K
       C9 B2 B8 D4 5C CF 60 C9 6A 9B D5 5D C0 CC 11 2D>)
(   2,<2007-11-29 13:51:17.49 +000>,<MAYBRIDGE\nmr>,<NMR_250MHZ>,
      <Start of raw data processing
       ef LB = 0.3 FT_mod = 6 PKNL = 1 SI = 32K 
       data hash MD5: 32K
       81 27 45 09 0F C7 31 F7 40 B6 DC 5B EB CC 0E F9>)
(   3,<2007-11-29 13:51:19.00 +000>,<MAYBRIDGE\nmr>,<NMR_250MHZ>,
      <apk 
       data hash MD5: 32K
       05 D0 5C 7D 3A BF 57 3F 22 CF 4E E9 3A F3 48 F5>)
(   4,<2007-11-29 13:51:19.71 +000>,<MAYBRIDGE\nmr>,<NMR_250MHZ>,
      <abs ABSG = 5 
       data hash MD5: 32K
       23 D5 D4 4B 42 F9 F2 33 EE 1E 3C 27 63 58 B2 51>)
$$ ##END=
$$ 
$$ hash MD5
$$ D9 8E 8A D2 F8 BE A3 F1 6D 67 FE 0D 58 C5 74 89
##$RELAX= 
##$RELAX= 
##$RELAX= 
##$RELAX= 
##$RELAX= 
##$RELAX= 
##$RELAX= 
$$ Bruker specific parameters
$$ --------------------------
##$DU= <C:\u>
##$EXPNO= 2500
##$NAME= <ADRS>
##$PROCNO= 1
##$TYPE= <nmr>
##$USER= <dgb>
##$AMP= (0..31)
100 100 100 100 100 100 100 100 100 100 100 100 100 100 100 100 100 100 
100 100 100 100 100 100 100 100 100 100 100 100 100 100 
##$AQSEQ= 0
##$AQ_mod= 3
##$AUNM= <au_zg>
##$AUTOPOS= <15 >
##$BF1= 250.13
##$BF2= 250.13
##$BF3= 250.13
##$BF4= 250.13
##$BF5= 500.13
##$BF6= 500.13
##$BF7= 500.13
##$BF8= 500.13
##$BYTORDA= 1
##$CFDGTYP= 0
##$CFRGTYP= 5
##$CHEMSTR= <none>
##$CNST= (0..31)
1 1 145 1 1 1 1 1 1 1 1 1 1 1 1 1 1 1 1 1 1 1 1 1 1 1 1 1 1 1 1 1 
##$CPDPRG= <>
##$CPDPRG1= <>
##$CPDPRG2= <>
##$CPDPRG3= <>
##$CPDPRG4= <mlev>
##$CPDPRG5= <mlev>
##$CPDPRG6= <mlev>
##$CPDPRG7= <mlev>
##$CPDPRG8= <mlev>
##$CPDPRGB= <>
##$CPDPRGT= <>
##$D= (0..31)
0 1 0 0 0 0 0 0 0 0.06 0 0 0 0 0 0 0.0002 0 0 0 0 0 0 0 0 0 0 0 0 0 0 
0 
##$DATE= 1196344263
##$DBL= (0..7)
120 120 120 120 120 120 120 120 
##$DBP= (0..7)
150 150 150 150 150 150 150 150 
##$DBP07= 0
##$DBPNAM0= <>
##$DBPNAM1= <>
$$ [...]
##$SUBNAM7= <"">
##$SUBNAM8= <"">
##$SUBNAM9= <"">
##$SW= 20.6930455092707
##$SWIBOX= (0..15)
0 0 3 0 0 0 0 0 0 0 0 0 0 0 0 0 
##$SW_h= 5175.983436853
##$TD= 65536
##$TD0= 1
##$TE= 295.16
##$TE2= 300
##$TE3= 300
##$TEG= 300
##$TL= (0..7)
0 120 120 120 120 120 120 120 
##$TP= (0..7)
150 150 150 150 150 150 150 150 
##$TP07= 0
##$TPNAME0= <>
##$TPNAME1= <>
##$TPNAME2= <>
##$TPNAME3= <>
##$TPNAME4= <>
##$TPNAME5= <>
##$TPNAME6= <>
##$TPNAME7= <>
##$TPOAL= (0..7)
0.5 0.5 0.5 0.5 0.5 0.5 0.5 0.5 
##$TPOFFS= (0..7)
0 0 0 0 0 0 0 0 
##$TUNHIN= 0
##$TUNHOUT= 0
##$TUNXOUT= 0
##$USERA1= <user>
##$USERA2= <user>
##$USERA3= <user>
##$USERA4= <user>
##$USERA5= <user>
##$V9= 5
##$VALIST= <valist>
##$VCLIST= <CCCCCCCCCCCCCCC>
##$VD= 0
##$VDLIST= <DDDDDDDDDDDDDDD>
##$VPLIST= <PPPPPPPPPPPPPPP>
##$VTLIST= <TTTTTTTTTTTTTTT>
##$WBST= 1024
##$WBSW= 4
##$XGAIN= (0..3)
0 0 0 0 
##$XL= 0
##$YL= 0
##$YMAX_a= 333201
##$YMIN_a= -412707
##$ZGOPTNS= <>
##$ZL1= 120
##$ZL2= 120
##$ZL3= 120
##$ZL4= 120
##$ABSF1= 16.522
##$ABSF2= -4.171173
##$ABSG= 5
##$ABSL= 3
##$ALPHA= 0
##$AQORDER= 0
##$ASSFAC= 0
##$ASSFACI= 0
##$ASSFACX= 0
##$ASSWID= 0
##$AUNMP= <proc_1d>
##$AZFE= 0.1
##$AZFW= 0.1
##$BCFW= 0
##$BC_mod= 0
##$BYTORDP= 0
##$COROFFS= 0
##$CY= 12.5
##$DATMOD= 1
##$DC= 0
##$DFILT= <>
##$DTYPP= 0
##$F1P= 14.0000005364418
##$F2P= -0.99999901652339
##$FCOR= 0.5
##$FTSIZE= 32768
##$FT_mod= 6
##$GAMMA= 0
##$GB= 0
##$INTBC= 1
##$INTSCL= 1
##$ISEN= 128
##$LB= 0.3
##$LEV0= 0
##$LPBIN= 0
##$MAXI= 10000
##$MC2= 0
##$MEAN= 0
##$ME_mod= 0
##$MI= 0
##$NCOEF= 0
##$NC_proc= -2
##$NLEV= 6
##$NOISF1= 0
##$NOISF2= 0
##$NSP= 0
##$NTH_PI= 0
##$NZP= 0
##$OFFSET= 16.522
##$PC= 1
##$PHC0= 174.5683
##$PHC1= 7.388105
##$PH_mod= 1
##$PKNL= yes
##$PPARMOD= 0
##$PSCAL= 4
##$PSIGN= 0
##$REVERSE= no
##$SF= 250.13
##$SI= 32768
##$SIGF1= 0
##$SIGF2= 0
##$SINO= 400
##$SIOLD= 32768
##$SREGLST= <1H.CDCl3>
##$SSB= 0
##$STSI= 32768
##$STSR= 0
##$SW_p= 5175.98343685301
##$SYMM= 0
##$S_DEV= 0
##$TDeff= 65536
##$TDoff= 0
##$TI= <Analysis number 999999
Compound Code 99
Book Reference 9
Project Code 9>
##$TILT= no
##$TM1= 0
##$TM2= 0
##$TOPLEV= 0
##$USERP1= <user>
##$USERP2= <user>
##$USERP3= <user>
##$USERP4= <user>
##$USERP5= <user>
##$WDW= 1
##$XDIM= 32768
##$YMAX_p= 275355351
##$YMIN_p= -78926
$$ End of Bruker specific parameters
$$ ---------------------------------
##NTUPLES= NMR SPECTRUM
##VAR_NAME=  FREQUENCY,     SPECTRUM/REAL,   SPECTRUM/IMAG
##SYMBOL=    X,             R,               I
##VAR_TYPE=  INDEPENDENT,   DEPENDENT,       DEPENDENT
##VAR_FORM=  AFFN,          ASDF,            ASDF
##VAR_DIM=   32768,         32768,           32768
##UNITS=     HZ,            ARBITRARY UNITS, ARBITRARY UNITS
##FACTOR=    0.157963299565203, 1,           1
##FIRST=     4132.6476996994, 0,             0
##LAST=      -1043.33573715361, 0,           0
##MIN=       -1043.33573715361, -78926,      0
##MAX=       4132.6476996994, 275355351,     0
$$ Real data points
##PAGE= N=1
##DATA TABLE= (X++(R..R)), XYDATA
$$ [...]
$$ plain form
15089 18708 -2019 -9975 -304 -2839 1620 20558 13523 -2829 -25688 -35560 -11347 -7114 -21719
15076 -21719 12657 36686 31005 12082 -8753 -19435 -11361 3287 10313 -5362 4706 18737
15064 18737 -4390 -41806 -47543 -44768 -50193 -36820 -29676 -46743 -55236 -43247 -27666 -13405 -10009
15051 -10009 698 5352 8858 -15105 -23571 -4981 27986 30269 24043 34637 29237 24326 13659
15038 13659 19395 26555 1225 6141 11097 -979 6761 -1549 -24370 -38025 -23129 -12730 -9287
15025 -9287 -25648 -9979 956 -5912 8083 -2454 12734 12230 4506 28411 45679 29502 23066
15012 23066 40816 38049 46169 44331 41317 52255 49138 53515 72911 117618 184398 184873 129849
14999 129849 59918 52250 46271 41809 58026 67112 64922 40926 41830 38421 24792 38999 47518
$$ packed form
15089A8708k0727p956R671k535M459J8938p035j6352k2859r872K4213M233j4605
15076b1719L4376K4029n681j8923k0835j0682Q074J4648P026j5675J0068J4031
15064A8737k3127l7416n737K775n425J3373P144j7067q493J1989J5581J4261L396
15051a0009J0707M654L506k3963q466J8590L2967K283o226J0594n400m911j0667
15038A3659N736P160k5330M916M956j2076P740q310k2821j3655J4896J0399L443
15025i287j6361J5669J0935o868J3995j0537J5188n04p724K3905J7268j6177o436
15012B3066J7750k767Q120j838l014J0938l117M377J9396M4707O6780M75n5024
14999A29849o9931p668n979m462J6217R086k190k3996R04l409j3629J4207Q519
$$ plain form
14986 47518 35049 19088 4635 -6815 -12370 -17957 -29193 -42770 -58503 -37035 -10168 -9209
14974 -9209 -12429 -20475 -26553 -25914 -17750 -9285 -28513 -27782 -12676 -1443 2567 20859 22009 12409
14960 12409 34521 36376 35136 10745 1223 19815 26109 16475 11367 17787 18600 27109 35887 14891
14946 14891 17018 16569 7250 2468 17734 21394 16936 28157 20163 -116 11211 33747 27930
14933 27930 26266 15333 7937 1951 4082 -4480 -20012 -52 -11657 -25241 -38348 -31010 -11352
14920 -11352 -14732 -11445 -10171 -9135 -9616 -1083 -8779 -14990 -19741 -23432 -12953 -8617 -437 -6168
14906 -6168 5542 22712 25090 4606 3252 4703 -5270 11929 6670 -676 -13873 -6849 11708
14893 11708 6453 34660 48925 32403 9949 -1173 -7586 -18709 -16724 -16235 -25 10651 6056
$$ packed form
14986D7518j2469j5961j4453j1450n555n587j1236j3577j5733K1468K6867R59
14974i209l220q046o078O39Q164Q465j9228P31J5106J1233M010J8292J150r600
14960A2409K2112J855j240k4391r522J8592O294r634n108O420Q13Q509Q778k0996
14946A4891K127m49r319m782J5266L660m458J1221p994k0279J1327K2536n817
14933B7930j664j0933p396n986K131q562j5532J9960j1605j3584j3107P338J9658
14920a1352l380L287J274J036m81Q533p696o211m751l691J0479M336Q180n731
14906f168J1710J7170K378k0484j354J451r973J7199n259p346j3197P024J8557
14893A1708n255K8207J4265j6522k2454j1122o413j1123J985M89J6210J0676m595
$$ plain form
14880 6056 -5480 -6302 -4729 -7614 -21228 -14594 -17737 -12582 10998 12885 -1751 -10905 924 2140
14866 2140 -6683 10247 17082 -4840 -25230 -18967 -33019 -15118 25829 38794 38242 38866 28513
14853 28513 18232 26774 9811 -10094 882 15289 14632 1286 15392 -4889 1516 33790
14841 33790 25638 21388 28081 23807 13246 8551 13356 951 -24400 -24298 -28286 -34062 -13257 11835
14827 11835 18564 4004 4531 23329 20194 14474 8624 9565 18287 24383 12085 -3959 -1829 -4729
14813 -4729 -7534 -17837 -3828 -44 3162 -2206 -16212 -26518 -21835 -17239 -19083 -16369 1971
14800 1971 13197 6367 -7765 -15311 -14265 -4801 -13527 -25545 -32484 -36874 -23762 -28019 -24250 -19770
14786 -19770 -32647 -34471 -40930 -36201 -30926 -8753 5609 -12793 -38724 -36130 -25851 -1241 6809
$$ packed form
14880F056j1536q22J573k885j3614O634l143N155K3580J887j4636r154J1829J216
14866B140q823J6930O835k1922k0390O263j4052J7901M0947J2965n52O24j0353
14853B8513j0281Q542j6963j9905J0976J4407o57j3346J4106k0281O405L2274
14841C3790q152m250O693m274j0561m695M805j2405k5351J02l988n776K0805K5092
14827A1835O729j4560N27J8798l135n720n850R41Q722O096j2298j6044K130k900
14813d729k805j0303J4009L784L206n368j4006j0306M683M596j844K714J8340
14800A971J1226o830j4132p546J046R464q726j2018o939m390J3112m257L769M480
14786a9770j2877j824o459M729N275K2173J4362j8402k5931K594J0279K4610Q050
$$ plain form
14773 6809 -8694 -3617 6199 11735 13610 2227 -4790 18637 45449 28771 44581 44057 19703
14760 19703 -568 -15781 -7412 -4535 -1416 -1207 -17864 -9328 168 -4813 -22200 -23326 -2109
14747 -2109 2064 -7878 -9080 -19058 -25164 -15660 4903 2347 -5855 -961 -20453 -21490 -24297 -33687
14733 -33687 -23576 -2478 13576 29602 41668 25403 6955 -3033 -28594 -44582 -45426 -38708
14721 -38708 -37330 -46110 -45205 -36400 -7357 21426 19504 11940 -17063 -18022 -3017 21129 14006 11761
14707 11761 14910 8721 -13346 -5137 -2121 593 13141 27839 8513 -12971 -9425 -8656 4523
14694 4523 12039 1664 -6692 -19360 -25336 -20228 -13610 -22024 -41900 -58629 -46651 -37887 -35743
14681 -35743 -19463 -11995 -19452 -2409 -15829 -11911 -2122 10392 16348 6662 876 931 -10417 -5197
$$ packed form
14773F809j5503N077R816N536J875j1383p017K3427K6812j6678J5810n24k4354
14760A9703k0271j5213Q369K877L119K09j6657Q536R496m981j7387j126K1217
14747b109M173r942j202r978o106R504K0563k556q202M894j9492j037k807r390
14733c3687J0111K1098J6054J6026J2066j6265j8448r988k5561j5988q44O718
14721c8708J378q780R05Q805K9043K8783j922p564k9003r59J5005K4146p123k245
14707A1761L149o189k2067Q209L016K714J2548J4698j9326k1484L546P69J3179
14694D523P516j0375q356j2668n976N108O618q414j9876j6729J1978Q764K144
14681c5743J6280P468p457J7043j3420L918R789J2514N956r686n786N5j1348N220
$$ plain form
14667 -5197 -5840 -3667 208 -1976 -14012 4461 -7684 -4208 4458 -10197 -29156 -22743 -15406 4541
14653 4541 -4101 -13494 199 10189 -3125 -4535 -7605 -10322 -23855 -15367 -15749 -11434 1994 3924
14639 3924 -8467 5120 24423 18629 15446 414 -12408 -20000 -24764 -3316 2850 -10416 -11980
14626 -11980 -20109 -31326 -31431 -30450 -29569 -18371 -3021 4573 15669 -7089 -1116 21744 8401
14613 8401 -14319 -8544 -15954 -18148 -3921 7116 8058 -2096 -9766 -11327 -7725 -7236 -15227 -26158
14599 -26158 -31779 -12064 22987 38689 26643 40136 29929 6660 18267 29965 35309 50032
14587 50032 42362 27831 14856 10883 11882 3240 10796 2505 -14524 -4813 134 2444 -11402 1498
14573 1498 3819 19157 30763 21137 6526 2734 5308 -2615 2153 1181 18485 7062 4222 15172
$$ packed form
14667e197o43K173L875k184j2036J8473j2145L476Q666j4655j8959O413P337J9947
14653D541q642r393J3693R990j3314j410l070k717j3533Q488l82M315J3428J930
14639C924j2391J3587J9303n794l183j5032j2822p592m764K1448O166j3266j564
14626a1980q129j1217j05R81Q81J1198J5350P594J1096k2758N973K2860j3343
14613H401k2720N775p410k194J4227J1037R42j0154p670j561L602M89p991j0931
14599b6158n621J9715L5051J5702j2046J3493j0207k3269J1607J1698N344J4723
14587E0032p670j4531j2975l973R99q642P556q291j7029R711M947K310j3846J2900
14573A498K321J5338J1606r626j4611l792K574p923M768r72J7304j1423k840J0950
$$ plain form
14559 15172 10273 6950 10336 517 2902 12199 13387 29436 28511 10972 601 8610 1618 -12765
14545 -12765 -20242 -2123 9032 12603 7108 17368 35502 45083 23879 20767 30786 5934 -8227
14532 -8227 10092 -2673 -11960 -16760 -2132 12062 5500 -17938 -3457 16575 22684 21939 -7393
14519 -7393 -31705 -29287 -34981 -45596 -35600 -9166 15183 41975 42399 42442 41621 47255 43544 24919
14505 24919 18339 -2284 -26258 -8734 19105 28527 30251 22994 16511 5348 10408 11804 -596
14492 -596 -9620 4421 20346 839 -14156 -5995 -11505 -1409 8025 -4468 -11192 281 3842
14479 3842 6216 -3363 11224 24077 -803 -24279 -33271 -34347 -37649 -42897 -41894 -29928 -12161
14466 -12161 -2986 -7421 -23109 -19840 -33026 -45561 -50971 -43124 -17629 5565 18250 -208 -9163
$$ packed form
14559A5172m899l323L386r819K385R297J188J6049r25j7539j0371Q009o992j4383
14545a2765p477J8119J1155L571n495J0260J8134R581k1204l112J0019k4852j4161
14532h227J8319j2765r287m800J4628J4194o562k3438J4481K0032O109p45k9332
14519g393k4312K418n694j0615R996K6434K4349K6792M24M3q21N634l711j8625
14505B4919o580k0623k3974J7524K7839R422J724p257o483j1163N060J396j2400
14492e96r024J4041J5925j9507j4995Q161n510J0096R434j2493o724J1473L561
14479C842K374r579J4587J2853k4880k3476q992j076l302n248J003J1966J7767
14466a2161R175m435j5688L269j3186j2535n410P847K5495K3194J2685j8458q955
$$ plain form
14453 -9163 -9750 -17326 -46243 -45717 -22988 -6798 -7556 -447 19049 12183 15434 17430 21467 21421 6369
14438 6369 5412 9898 -7860 -7399 9684 9010 12455 29226 45792 21720 18680 -5622 -34031 -39875
14424 -39875 -16667 1489 -7626 -7301 -13198 -12350 -3983 -1065 -9964 -34891 -37479 -26767 -7724 -18249
14410 -18249 -15051 10910 17265 9576 5835 4819 7703 17556 9921 -13355 -15908 -28654 -29401 -9420
14396 -9420 -5858 -4836 5891 7555 7935 7375 4778 -7400 -9386 1114 -7426 -19737 -21008 199
14382 199 -2640 -6678 -5730 -2777 -7164 -11693 -6593 -877 -16723 -7852 5400 -4889 -9016 -14937
14368 -14937 -31692 -34065 -18563 -22488 -16140 10828 35166 31260 14186 18040 16284 -11639 -5465
14355 -5465 -3495 -14947 -11921 -17757 -26457 -12663 -565 10230 -5121 -16309 -28745 -42174 -44672
$$ packed form
14453i163n87p576k8917N26K2729J6190p58P109J9496o866L251J996M037m6j5052
14438F369r57M486j7758M61J7083o74L445J6771J6566k4072l040k4302k8409n844
14424c9875K3208J8156r115L25n897Q48Q367K918q899k4927k588J0712J9043j0525
14410a8249L198K5961O355p689l741j016K884R853p635k3276k553j2746p47J9981
14396i420L562J022J0727J664L80n60k597j2178j986J0500q540j2311j271K1207
14382A99k839m038R48K953m387m529N100N716j5846Q871J3252j0289m127n921
14368a4937j6755k373J5502l925O348K6968K4338l906j7074L854j756k7923O174
14355e465J970j1452L026n836q700J3794J2098J0795j5351j1188j2436j3429k498
$$ plain form
14342 -44672 -32077 1392 22842 11211 -10921 -32971 -20463 -9628 -6930 -15656 259 11272
14330 11272 4285 -8792 -36422 -47911 -39308 -28261 -24217 -19213 -2318 -3656 -21159 -12634 -10511
14317 -10511 -2221 2848 -1261 7676 25059 18192 17163 6949 -14647 -24848 -30642 -27958 -10708
14304 -10708 -10623 -17057 -37291 -40715 -22389 8400 22856 17335 23400 20450 18011 8303 -4965 -3645
14290 -3645 1717 -2424 -9207 -8977 533 18784 16110 -4505 18026 14891 2876 -7486 -23868
14277 -23868 -27399 -5106 23248 20465 11565 2442 -11850 -9024 -4770 2418 -4582 1407 -17047
14264 -17047 -22725 8411 1769 -8520 -31278 -48988 -20905 -9930 -14346 -5894 -13131 -44997 -58659
14251 -58659 -54322 -46282 -30953 -29537 -20623 -23768 -10336 613 12855 8216 5461 -23879 -30640
$$ packed form
14342d4672J2595L3469K1450j1631k2132k2050J2508J0835K698q726J5915J1013
14330A1272o987j3077k7630j1489Q603J1047M044N004J6895j338j7503Q525K123
14317a0511Q290N069m109Q937J7383o867j029j0214k1596j0201n794K684J7250
14304a0708Q5o434k0234l424J8326L0789J4456n521O065k950k439r708j3268J320
14290c645N362m141o783K30R510J8251k674k0615K2531l135j2015j0362j6382
14277b3868l531K2293K8354k783q900r123j4292K826M254P188p000N989j8454
14264a7047n678L1136o642j0289k2758j7710K8083J0975m416Q452p237l1866j3662
14251e8659M337Q040J5329J416Q914l145J3432J0949J2242m639k755k9340o761
$$ plain form
14238 -30640 -6471 -4105 2365 6572 9454 8924 4329 8693 12708 2686 3788 -7549 -6898 -5461
14224 -5461 13442 19431 2136 -7614 -16690 -33107 -21262 -8228 9306 15614 10888 3520 -4025
14211 -4025 1610 8951 -5585 -14352 -10904 7708 1584 -12993 -21981 -31155 -22985 -24194 -23528 -21698
14197 -21698 -28715 -21802 -8081 -29163 -35879 -27966 -38957 -32087 -10146 14867 -14958 -26930 -31050
14184 -31050 -19249 2161 -4081 -18694 -3366 -8152 -28581 -29270 -25015 -31426 -23783 -22226 -18081
14171 -18081 -22915 -26348 -22224 -16570 -25669 -23181 -14888 -11114 -4815 8398 2018 -2756 14360 16097
14157 16097 -5017 -1449 -10533 694 9772 -380 -24516 -10059 3229 -4100 -8782 15087 22622
14144 22622 28318 23014 19028 6649 -1362 -9486 -25975 -25638 -23737 -31020 -28821 -13751 -23503 -47519
$$ packed form
14238c0640K4169K366O470M207K882n30m595M364M015j0022J102j1337O51J437
14224e461J8903N989j7295r750r076j6417J1845J3034J7534O308m726p368p545
14211d025N635P341j4536q767L448J8612o124j4577q988r174Q170j209O66J830
14197b1698p017O913J3721k1082o716P913j0991O870K1941K5013k9825j1972m120
14184c1050J1801K1410o242j4613J5328m786k0429o89M255o411P643J557M145
14171a8081m834l433M124N654r099K488Q293L774O299J3213o380m774J7116J737
14157A6097k1114L568r084J1227R078j0152k4136J4457J3288p329m682K3869P535
14144B2622N696n304l986j2379q011q124j6489L37J901p283K199J5070r752k4016
$$ plain form
14130 -47519 -55863 -38179 -25901 -33468 -36499 -18094 3414 2009 -2265 10890 7205 -1912 2687
14117 2687 13914 21264 32368 28740 11692 -16443 -1558 8811 21608 58232 54550 28641
14105 28641 24536 23188 4768 -25869 -25757 -15036 -9844 -3265 -22 -12231 -24388 -6637 8832
14092 8832 12582 -565 -1869 -11444 -20157 -4655 -4203 -4579 9190 13066 -6587 -12980 -24945 -23817
14078 -23817 -11778 -11040 -11224 -4339 -4578 -9399 -27094 -33081 -28047 -26447 -22518 -20048 2715 17810
14064 17810 639 -29213 -34546 -30864 -24251 -6457 5784 13213 6864 -3209 -15503 -19507 -20473
14051 -20473 -18241 -35337 -43268 -29274 -23227 -18471 -6485 -11321 -11616 -2109 -8479 -11151 -5427 -2061
14037 -2061 -17082 -21408 -14033 -20263 2903 624 12558 25187 -1311 -19897 -2239 -1713 1363
$$ packed form
14130d7519q344J7684J2278p567l031J8405K1508j405m274J3155l685r117M599
14117B687J1227P350J1104l628j7048k8135J4885J0369J2797L6624l682k5909
14105B8641m105j348j8420l0637J12J0721N192O579L243j2209j2157J7751J5469
14092H832L750j3147j304r575q713J5502M52l76J3769L876j9653o393j1965J128
14078b3817J2039P38j84O885k39m821j7695n987N034J600L929K470K2763J5095
14064A7810j7171k9852n333L682O613J7794J2241P429o349j0073j2294m004r66
14051b0473K232j7096p931J3994O047M756J1986m836k95R507o370k672N724L366
14037b061j5021m326P375o230K3166k279J1934J2629k6498j8586J7658N26L076
$$ plain form
14024 1363 -4457 -2120 3711 -5315 -2929 14228 12123 11158 19153 9202 23614 21735 -14427 -12216
14010 -12216 1831 16388 11653 16305 11624 12843 20274 22321 10489 -2018 -7660 -4702 -7968
13997 -7968 -17151 -10364 -12691 -3716 -14523 -11609 -14193 -8121 10906 3162 2586 -1153 24351 44709
13983 44709 57530 46359 45633 47664 49318 47351 42135 42306 32258 25539 12300 16721 12922 7706
13969 7706 7240 22637 20265 -11827 -27966 -29157 -48294 -67069 -70503 -53209 -39359 -38230 -36697
13956 -36697 -34740 -23439 -28156 -29709 -25407 -23695 -1636 16210 23841 15316 -1375 6011 16286
13943 16286 16405 20494 24047 37329 20618 18739 -1208 -27725 -34210 -26948 -24541 -5699 6433
13930 6433 -2917 -12432 -8955 -10560 -23645 -25997 -31149 -35539 -19899 -5713 -10845 -20488 -11836 11190
$$ packed form
14024A363n820K337N831r026K386J7157k105r65P995r951J4412j879l6162K211
14010a2216J4047J4557m735M652m681J219P431K047j1832j2507n642K958l266
13997g968r183O787k327Q975j0807K914k584O072J9027p744n76l739K5504K0358
13983D4709J2821j1171p26K031J654j967n216J71j0048o719j3239M421l799n216
13969G706m66J5397k372l2092j6139j191j9137j8775l434J7294J3850J129J533
13956c6697J957J1301m717j553M302J712K2059J7846P631q525j6691P386J0275
13943A6286J19M089L553J3282j6711j879j9947k6517o485P262K407J8842J2132
13930F433r350r515L477j605j3085k352n152m390J5640J4186n132r643Q652K3026
$$ plain form
13916 11190 -2596 4512 -11339 -43406 -32196 -11353 10714 25420 6283 -14339 -17467 -24555
13904 -24555 -28449 -13382 -6978 -8450 -21919 -21637 -14424 -12921 -5475 -4434 -29065 -16037 5345
13891 5345 4252 -25751 -27713 -26432 -9514 2982 -7809 -6494 10680 41355 43410 21898 3376
13878 3376 -1135 12179 -3637 5938 13327 -558 -3995 6721 5281 7173 14749 33348 -457
13865 -457 -33286 -26042 -17170 -6832 -2345 -7458 -19112 2191 13347 -479 -630 3188 -6666 -6360
13851 -6360 -12392 -3588 10108 -11762 -18667 -12416 -5152 -9639 -11881 -5310 -14712 -19412 -19755 -9701
13837 -9701 3469 10553 24505 21737 20237 16845 5710 4101 5038 -2805 -4913 -9553 -3247 14375
13823 14375 13627 -10990 -7648 -16435 -25186 -12176 15140 39674 29356 27707 -2755 -18604 -14312
$$ packed form
13916A1190j3786P108j5851l2067J1210K0843K2067J4706j9137k0622l128p088
13904b4555l894J5067O404j472j3469K82P213J503P446J041k4631J3028K1382
13891E345j093l0003j962J281J6918J2496j0791J315J7174L0675K055k1512j8522
13878C376m511J3314j5816R575P389j3885l437J0716j440J892P576J8599l3805
13865d57l2829P244Q872J0338M487n113j1654K1303J1156j3826j51L818r854L06
13851f360o032Q804J3696k1870o905O251P264m487k242O571r402m700l43J0054
13837i701J3170P084J3952k768j500l392j1135j609R37p843k108m640O306J7622
13823A4375p48k4617L342q787q751J3010K7316K4534j0318j649l0462j5849M292
$$ plain form
13810 -14312 3961 4478 -5792 -18677 -37860 -28709 -23894 -11284 -13012 4547 -17905 -10313 4172
13797 4172 -9318 -7307 3708 8495 15353 22597 6373 -13469 -23307 -39130 -20435 -6702 11789
13784 11789 41295 42084 30737 29003 20083 22446 23326 25783 24494 2495 5972 -5071 -18968 -16992
13770 -16992 -15522 -25327 -33685 -46065 -53835 -38076 -28181 -21353 -16766 -13903 -7523 -8080 9029 4426
13756 4426 -4058 -14401 -32091 -31079 -18997 -13941 -18293 -27184 -22739 -35660 -33910 -32564 -28557 -10895
13742 -10895 -15087 -14423 -4989 5223 -7391 -19122 -36761 -43077 -22901 10266 -65 -15578 -13803
13729 -13803 -13163 -20666 -5974 4730 6730 -1137 -9520 -6895 -12320 -17135 -32522 -16352 9186
13716 9186 371 -20306 -34617 -33653 -27999 -12567 9367 7408 30328 29000 14421 4355 -1865
$$ packed form
13810a4312J8273N17j0270j2885j9183R151M815J2610j728J7559k2452P592J4485
13797D172j3490K011J1015M787O858P244j6224j9842r838j5823J8695J3733J8491
13784A1789K9506P89j1347j734q920K363Q80K457j289k1999L477j1043j3897J976
13770a6992J470r805q358j2380p770J5759R895O828M587K863O380n57J7109m603
13756D426q484j0343j7690J012J2082N056m352q891M445j2921J750J346M007J7662
13742a0895m192O64R434J0212j2614j1731j7639o316K0176L3167j0331j5513J775
13729a3803O40p503J4692J0704K000p867q383K625n425m815j5387J6170K5538
13716I186q815k0677j4311R64N654J5432K1934j959K2920j328j4579j0066o220
$$ plain form
13703 -1865 -16338 -22549 -4863 -30407 -64314 -68397 -71919 -46016 -40747 -42084 -44346 -34154 -727
13690 -727 2836 -10338 12213 11135 -9165 -22752 -11240 -918 11385 923 -13635 -24166
13678 -24166 -17106 2958 -3882 -6024 -2239 19278 18462 -1298 -24797 -39984 -45107 -47932 -36332
13665 -36332 -12140 -425 -9247 -17117 -13689 -9752 -10464 -17337 -3146 1773 -866 10543 22994
13652 22994 33573 52563 35985 5398 -8287 -35045 -40002 -26223 -14789 -4588 3360 3173
13640 3173 9341 17239 20452 6062 -19274 -26874 -22439 -8167 -20365 -17648 -13011 -16936 1338
13627 1338 7494 5797 -4742 -11966 -7215 -568 25874 19834 -3489 -13353 -6442 1088 -8573 -18429
13613 -18429 -34774 -44886 -37493 -26376 -328 -2887 -12733 -6451 -8573 -10191 -9069 -17153 -21067
$$ packed form
13703a865j4473o211J7686k5544l3907m083l522K5903N269j337k262J0192L3427
13690g27L563j3174K2551j078k0300j3587J1512J0322J2303j0462j4558j0531
13678b4166P060K0064o840k142L785K1517q16j9760k3499j5187n123k825J1600
13665c6332K4192J1715q822p870L428L937p12o873J4191M919k639J1409J2451
13652B2994J0579J8990j6578l0587j3685k6758m957J3779J1434J0201P948j87
13640C173O168P898L213j4390k5336p600M435J4272j2198K717M637l925J8274
13627A338O156j697j0539p224M751O647K6442o040k3323r864O911P530r661r856
13613a8429j6345j0112P393J1117K6048k559r846O282k122j618J122q084l914
$$ plain form
13600 -21067 -31167 -26997 -6608 -9161 -12853 -12173 -7165 19926 1934 -23407 -13544 -7229 -42431
13587 -42431 -45925 -49446 -25839 -1911 22582 26535 15197 12972 22945 32314 36506 47431 49319
13574 49319 47828 29151 8593 -9663 -15465 -22921 -7539 14116 1011 1830 -20045 -46309 -40380
13561 -40380 -36943 -55168 -53764 -26143 -16765 -29241 -11628 -10360 1093 -7740 -2648 -2766 8525
13548 8525 -160 -15382 -23658 -14464 -4094 -5293 7064 -7389 -40903 -54787 -41228 -20092 -9790
13535 -9790 -8892 -34590 -30596 -17769 8857 19142 17355 5658 15273 7799 -5560 9506 23171
13522 23171 28254 29074 10707 -3064 -4440 -23057 -23541 -25241 -23129 2428 3340 -7516 -14042 -14917
13508 -14917 -5865 1048 -1934 5545 8054 13843 11452 19065 20276 5254 -3971 -4618 -2732 8721
$$ packed form
13600b1067j0100M170K0389k553l692O80N008K7091j7992k5341R863O315l5202
13587d2431l494l521K3607K3928K4493L953j1338k225R973R369M192J0925J888
13574D9319j491j8677k0558j8256n802p456J5382K1655j3105Q19k1875k6264N929
13561d0380L437j8225J404K7621R378j2476J7613J268J1453q833N092j18J1291
13548H525q685j5222q276R194J0370j199J2357j4453l3514j3884J3559K1136J0302
13535i790Q98k5698L994J2827K6626J0285j787j1697R615p474j3359J5066J3665
13522B3171N083Q20j8367j3771j376j8617m84j700K112K5557R12j0856o526q75
13508a4917R052O913k982P479K509N789k391P613J211j5022r225o47J886J1453
$$ plain form
13494 8721 24279 10578 2905 16345 22268 14377 1599 -17943 -29903 -46812 -47006 -26822 -11185
13481 -11185 2460 -15010 -22203 -10627 2773 4913 8871 -12110 -41335 -42597 -39735 -43733 -33069
13468 -33069 -2607 8602 -2160 -12012 -13676 -9480 -29976 -25409 -20067 8543 25241 9222 2655
13455 2655 7371 14788 1251 7809 15626 14816 -6047 -15857 -13014 -24270 -18128 -4873 -8528 -14526
13441 -14526 753 -5961 -222 -771 -9550 -7334 17020 42896 34638 31249 29147 12391 -27562
13428 -27562 -28774 -38514 -29429 -21352 -14559 -17476 -25809 -34142 -25153 -19924 -14389 -5636 9290 -12051
13414 -12051 -22527 -35701 -56644 -45361 -30816 -14568 5971 37689 36135 7097 -18486 -38678
13402 -38678 -28722 -31771 -48035 -49855 -29607 -6466 22440 26501 8416 -9550 2743 -15313
$$ packed form
13494H721J5558j3701p673J3440N923p891j2778j9542j1960j6909j94K0184J5637
13481a1185J3645j7470p193J1576J3400K140L958k0981k9225j262K862l998J0664
13468c3069L0462J1209j0762r852j664M196k0496M567N342K8610J6698j6019o567
13455B655M716P417j3537O558P817q10k0863r810K843j1256O142J3255l655n998
13441a4526J5279o714N739n49q779K216K4354K5876q258l389k102j6756l9953
13428b7562j212r740R085Q077O793k917q333q333Q989N229N535Q753J4926k1341
13414a2051j0476j3174k0943J1283J4545J6248K0539L1718j554k9038k5583k0192
13402c8678R956l049j6264j820K0248K3141K8906M061j8085j7966J2293j8056
$$ plain form
13390 -15313 -24281 -36701 -39288 -36943 -26279 -16615 -18736 -29608 -42581 -26232 2672 15649 13024
13377 13024 1805 -1917 22785 21592 15289 14424 5689 11844 14881 -1117 -6484 12999 34432
13364 34432 35297 11105 1448 -438 -11138 -1608 3116 -22934 -12502 5612 18479 33433 27285
13351 27285 23756 20152 30468 31237 42911 50237 39431 13936 24586 38929 23793 5606 18709
13338 18709 7705 12853 5157 1071 10158 27189 17143 -7403 69 25203 14331 25254 37302
13325 37302 26332 1677 814 7103 13191 10551 20108 9780 9744 -1960 -16135 -20680 -27487 -17568
13311 -17568 -17443 -12052 9945 20221 20953 20134 11571 26871 33222 51146 41061 40251 24018 6203
13297 6203 17450 31584 42680 24450 1786 -18873 -17949 3415 6079 3854 1630 -10722 -12490
$$ packed form
13390a5313q968j2420k587K345J0664R664k121j0872j2973J6349K8904J2977k625
13377A3024j1219l722K4702j193o303q65q735O155L037j5998n367J9483K1433
13364C4432Q65k4192r657j886j0700R530M724k6050J0432J8114J2867J4954o148
13351B7285l529l604J0316P69J1674P326j0806k5495J0650J4343j5136j8187J3103
13338A8709j1004N148p696m086R087J7031j0046k4546P472K5134j0872J0923J2048
13325C7302j0970k4655q63O289O088k640R557j0328l6j1704j4175m545o807R919
13311a7568J25N391K1997J0276P32q19q563J5300O351J7924j0085q10j6233j7815
13297F203J1247J4134J1096j8230k2664k0659R24K1364K664k225k224j2352j768
$$ plain form
13284 -12490 -15698 -18251 -7664 7488 20622 8810 -6977 -7861 -8244 -12192 -11050 -6886 5988
13271 5988 24734 21892 17530 525 -6084 8211 10918 2994 25702 35981 63518 89217 89622
13258 89622 98910 71589 21219 -5970 -14917 -16833 -12981 2868 2606 26475 24628 6936 -2085
13245 -2085 -4911 -10997 -7517 -10768 -13279 -4751 -15753 -18225 -16057 -24488 -25913 -12110 13517 39575
13231 39575 29596 13422 -4432 -2232 -6243 8553 -488 1116 16036 33738 50192 31156 7743
13218 7743 24769 36672 63737 82258 89157 99339 77366 61272 39512 33370 27396 15047
13206 15047 5591 -10325 -25606 -33750 -9957 15181 18928 23360 15754 11657 1930 -11240 -17340
13193 -17340 -29616 -15828 1854 -626 -8665 -10699 -14989 -4887 -14616 -17918 -27058 -16186 -2993
$$ packed form
13284a2490l208k553J0587J5152J3134j1812j5787q84l83l948J142M164J2874
13271E988J8746k842m362j7005o609J4295K707p924K2708J0279K7537K5699M05
13258H9622R288k7321n0370k7189q947j916L852J5849k62K3869j847j7692r021
13245b085k826o086L480l251k511Q528j1002k472K168q431j425J3803K5627K6058
13231C9575r979j6174j7854K200m011J4796r041J604J4920J7702J6454j9036k3413
13218G743J7026J1903K7065J8521O899J0182k1973j6094k1760o142n974j2349
13206A5047r456j5916j5281q144K3793K5138L747M432p606m097r727j3170o100
13193a7340j2276J3788J7682k480q039k034m290J0102r729l302r140J0872J3193
$$ plain form
13180 -2993 3262 5450 2931 9234 30098 27587 35198 51704 43143 53230 80033 62189 41147
13167 41147 14400 6087 37297 44062 32716 9756 -7532 1264 9202 -4259 -9989 -1777 -6472
13154 -6472 -6332 21760 24790 16154 19053 13106 14556 4442 -14532 -24998 -11000 4732 -998
13141 -998 10147 -4680 -7852 -19357 -27801 -30470 -21652 -22821 -19370 -18060 -18610 -18222 -22719 -48949
13127 -48949 -50671 -40175 -22627 -39916 -38086 -33869 -33187 -37761 -16428 -8932 -3773 -3558 6394 -5456
13113 -5456 -31809 -35710 -22834 -38340 -38156 -24675 -23809 -8072 -6341 -628 -8483 -19835 -16655 -11798
13099 -11798 -33530 -38764 -36300 -32806 -16987 -23654 -18621 -22163 -27004 -25562 -12326 -19722 -18901 -20620
13085 -20620 -15701 -13512 -15864 -27426 -13947 5745 7492 8502 2100 -792 2276 927 5219 -7455
$$ packed form
13180b993O255K188k519O303K0864k511P611J6506q561J0087K6803j7844k1042
13167D1147k6747q313L1210O765j1346k2960j7288Q796P938j3461n730Q212m695
13154f472J40K8092L030q636K899n947J450j0114j8974j0466J3998J5732n730
13141i98J1145j4827l172j1505q444k669Q818j169L451J310n50L88m497k6230
13127d8949j722J0496J7548j7289J830M217O82m574K1333P496N159K15R952j1850
13113e456k6353l901J2876j5506J84J3481Q66J5737J731N713p855j1352L180M857
13099a1798k1732n234K464L494J5819o667N033l542m841J442J3236p396Q21j719
13085b0620M919K189k352j1562J3479J9692J747J010o402k892L068j349M292j2674
$$ plain form
13071 -7455 5604 5135 9147 26106 32014 21584 12668 -12009 -15745 -10388 2683 7887 19197
13058 19197 12615 2206 17897 15114 -5436 -36261 -32020 -16854 -10074 -5117 -12880 -3149 -9357
13045 -9357 -2330 5781 2703 -8887 -19061 -22747 -7464 -6363 -19309 -15639 -10108 -12843 -14889 -2518
13031 -2518 -5625 -19477 -12752 -8902 -9210 -8192 -15390 -8607 1330 -17438 -12692 -8301 -7840 -15018 -25575
13016 -25575 -33577 -38543 -44032 -52264 -57163 -52381 -25611 -28239 -26081 -22630 -4020 -2290 4179 441
13002 441 18258 32849 33938 6794 -10363 -14334 -1676 -14803 -17213 -9679 10495 -18994 -49465
12989 -49465 -43003 -17595 -13615 -12599 -4041 20403 2620 -4150 6824 15905 18742 11047 4514
12976 4514 -10295 339 26564 18921 3242 13208 -261 -25792 -10383 -4752 13158 4621 -4860
$$ packed form
13071g455J3059m69M012J6959N908j0430q916k4677l736N357J3071N204J1310
13058A9197o582j0409J5691k783k0550l0825M241J5166O780M957p763R731o208
13045i357P027Q111l078j1590j0174l686J5283J101j2946L670N531k735k046J2371
13031b518l107j3852O725L850l08J018p198O783R937j8768M746M391M61p178j0557
13016b5575q002m966n489q232m899M782K6770k628K158L451J8610J730O469l738
13002D41J7817J4591J089k7144j7157l971J2658j3127k410P534K0174k9489l0471
12989d9465O462K5408L980J016Q558K4444j7783o770J0974R081K837p695o533
12976D514j4809J0634K6225p643j5679R966j3469k5531J5409N631J7910q537r481
$$ plain form
12963 -4860 -29001 -45207 -48158 -22595 -9516 -9879 -27813 -23629 -7875 -15594 -23175 -18462 -29995
12950 -29995 -17031 -10587 -25214 -18056 -12188 -18015 -11699 15993 16893 1528 3656 23825 21133
12937 21133 -6962 -15257 -30395 -52445 -41306 -9807 -18124 -29110 -40947 -40390 -43098 -52237 -43666
12924 -43666 -21806 -10760 -10174 -15324 -12506 3770 11895 7367 6712 -14601 -39127 -38625 -33153 -26726
12910 -26726 -28797 -18813 -14718 -11821 8845 5816 -8715 -15560 -9134 -14848 -16904 7623 5890 9272
12896 9272 9713 14688 13558 13044 15464 -3757 -6741 -16789 -33384 -11583 2975 -14985 -26531
12883 -26531 -50830 -38805 -38065 -48548 -38450 -18599 -15505 -43966 -32649 5542 -13094 -31609
12871 -31609 -11710 -17236 -6790 -27818 -28333 -22140 -16202 -17084 -15892 2259 -1150 -9429 -6228 -742
$$ packed form
12963d860k4141j6206k951K5563J3079l63j7934M184J5754p719p581M713j1533
12950b9995J2964O444j4627P158N868n827O316K7692R00j5365K128K0169k692
12937B1133k8095q295j5138k2050J1139L1499q317j0986j1837N57k708r139Q571
12924d3666K1860J1046N86n150K818J6276Q125m528o55k1313k4526N02N472O427
12910b6726k071R984M095K897K0666l029j4531o845O426n714k056K4527j733L382
12896I272M41M975j130n14K420j9221k984j0048j6595K1801J4558j7960j1546
12883b6531k4299J2025P40j0483J0098J9851L094k8461J1317L8191j8636j8515
12871c1609J9899n526J0446k1028n15O193N938q82J192J8151l409q279L201N486
$$ plain form
12857 -742 13453 16008 31443 48362 40581 43620 54067 20464 -10958 -29464 -14835 11903 -6513
12844 -6513 -18280 -29996 -37839 -34522 -36759 -9268 2852 -8512 -15751 -4562 -20146 -23227 -6143
12831 -6143 -6716 -11994 -883 16857 12518 16197 38894 61109 64639 46520 48212 48468 72884 71140
12817 71140 72443 76270 97485 96058 93754 91864 80609 84365 74869 75685 71499 69842 61364 58521
12803 58521 37745 26372 22309 8963 -10027 8702 41070 68052 93796 99165 114087 126876
12791 126876 123160 122748 121824 124512 110231 115778 131118 122111 128708 131601 139128 153655 145111 117253
12777 117253 92009 77704 86195 72066 51540 63795 64690 74646 85922 82484 71733 63795 60919
12764 60919 54862 30889 39471 28932 37357 39023 53769 64213 62563 51418 55368 75733 86124
$$ packed form
12857g42J4195K555J5435J6919p781L039J0447l3603l1422j8506J4629K6738j8416
12844f513j1767j1716p843L317k237K7491J2120j1364p239J1189j5584l081J7084
12831f143n73n278J1111J7740m339L679K2697K2215L530j8119J692K56K4416j744
12817G1140J303L827K1215j427k304j890j1255L756r496Q16m186j657q478k843
12803E8521k0776j1373m063j3346j8990J8729L2368K6982K5744N369J4922J2789
12791A26876l716m12r24K688j4281N547J5340r007O597K893P527J4527q544k7858
12777A17253k5244j4305Q491j4129k0526J2255Q95R956J1276l438j0751p938k876
12764F0919o057k3973Q582j0539Q425J666J4746J0444j650j1145L950K0365J0391
$$ plain form
12751 86124 80617 78041 94134 107983 116371 125550 130467 132797 115158 81812 62258 65587 55067
12738 55067 37865 25164 35803 51374 47677 28412 17328 25836 25713 44370 67180 60824 56232
12725 56232 70361 69533 79573 84732 66300 49061 53920 50707 48219 64523 67797 68985 62100
12712 62100 49578 49640 59754 72900 57331 53861 58543 78654 93345 84925 80625 66444 92475
12699 92475 98675 77455 78008 102725 112713 89220 89198 93344 90440 73996 72492 70970 77750 73280
12685 73280 58832 50016 56841 77174 92361 95170 102944 103210 104012 110280 90021 85059 86853 53486
12671 53486 25931 19780 30550 40977 34879 36733 55349 88600 104606 120701 104718 98255
12659 98255 87202 88322 80298 94220 97537 89133 74260 47427 58581 58577 56143 42534 41613 36668
$$ packed form
12751H6124n507k576J6093J3849Q388R179M917K330j7639l3346j9554L329j0520
12738E5067j7202j2701J0639J5571l697j9265j1084Q508j23J8657K2810o356m592
12725E6232J4129q28J0040N159j8432j7239M859l213k488J6304L274J188o885
12712F2100j2522O2J0114J3146j5569l470M682K0111J4691q420m300j4181K6031
12699I2475O200k1220N53K4717R988k3493k2M146k904j6444j504j522O780m470
12685G3280j4448q816O825K0333J5187K809P774K66Q02O268k0259m962J794l3367
12671E3486k7555o151J0770J0427o098J854J8616L3251J6006J6095j5983o463
12659I8255j1053J120q024J3922L317q404j4873k6833J1154mk434j3609r21m945
$$ plain form
12645 36668 34249 34212 30235 40767 34347 16740 23050 24870 24515 51450 48331 44405 34752 37774
12631 37774 19300 15200 12409 10360 21390 13827 8285 11721 11415 31006 39398 44554 23656 -520
12617 -520 -8878 -622 16612 12014 22084 27442 20267 4568 -5895 -11565 176 12889 14094
12604 14094 10342 22714 22906 30078 46128 36928 36136 22617 -3062 -6546 11134 30586 27939
12591 27939 11817 5861 17609 33810 39659 49151 29682 34367 49549 60380 44490 38880 34937
12578 34937 25156 -2686 -8317 5270 31131 37992 17627 22077 8506 -2931 19879 33240
12566 33240 30515 10055 13595 15622 7228 21925 41189 44381 45124 38579 25140 16998 6169
12553 6169 7011 11530 11154 15865 17109 14388 8734 18609 20974 34359 13046 -16013 -14392 2268
$$ packed form
12645C6668k419l7l977J0532o420j7607O310J820l55K6935l119l926r653L022
12631C7774j8474m100k791k049J1030p563n542L436l06J9591Q392N156k0898k4176
12617e20q358Q256J7234m598J0070N358p175j5699j0463n670J1741J2713J205
12604A4094l752J2372J92P172J6050r200p92j3519k5679l484J7680J9452k647
12591B7939j6122n956J1748J6201N849R492j9469M685J5182J0831j5890n610l943
12578C4937r781k7842n631J3587K5861O861k0365M450j3571j1437K2810J3361
12566C3240k725k0460L540K027q394J4697J9264L192P43o545j3439q142j0829
12553F169Q42M519l76M711J244k721n654R875K365J3385k1313k9059J621J6660
$$ plain form
12539 2268 -6885 -22227 -28211 -7499 -16683 -15646 -29851 -25816 3234 28866 29545 10066 16320
12526 16320 11754 -180 -189 9418 20669 14975 28607 41307 49168 43949 54077 66464 63067 42143
12512 42143 12061 6813 -4190 16021 20384 76 -17845 -9234 594 16049 30396 45517
12500 45517 42867 31199 31998 23767 35091 37558 44187 24661 27285 22208 22358 17070 11673 21658
12486 21658 12181 -4367 -2614 2670 -3034 12056 27134 42022 64478 94065 110467 101219 82008
12473 82008 36907 15597 3832 19840 51096 64812 76459 92868 82083 73908 92468 109076
12461 109076 116133 115115 97088 78757 77299 91836 95735 86344 102710 110331 98726 85158 104889
12448 104889 107774 97490 102629 125023 149159 169571 176013 178325 168495 161347 151565 143424 147140
$$ packed form
12539B268r153j5342n984K0712r184J037j4205M035K9050K5632O79j9479O254
12526A6320m566j1934rR607J1251n694J3632J2700P861n219J0128J2387l397k0924
12512D2143l0082n248j1003K0211M363k0308j7921Q611R828J5455J4347J5121
12500D5517k650j1668P99q231J1324K467O629j9526K624n077J50n288n397R985
12486B1658r477j6548J753N284n704J5090J5078J4888K2456K9587J6402r248j9211
12473H2008m5101k1310j1765J6008L1256J3716J1647J6409j0785q175J8560J6608
12461A09076P057j018j8027j8331j458J4537L899r391J6366P621j1605j3568J9731
12448A04889K885j0284N139K2394K4136K0412O442K312r830p148r782q141L716
$$ plain form
12435 147140 156581 168305 159084 183302 195610 191087 205366 204802 185828 184366 193518 222443 235687
12422 235687 259324 264882 268842 306181 321031 348642 347102 334298 337769 359160 380649 415566
12410 415566 462170 486776 510736 565060 643340 721962 802842 907813 1031605 1123082 1262367
12399 1262367 1439226 1640702 1874515 2148462 2500029 2940590 3443053 4052373 4690307
12390 4690307 5257598 5658221 5800532 5724329 5533190 5346135 5245550 5269535 5427237 5760967
12380 5760967 6238414 6797462 7321909 7701253 7857685 7763901 7497518 7219588 7028963 6929446
12370 6929446 6991526 7262694 7707121 8323057 9066461 9853356 10654735 11416927 12124940 12833908
12360 12833908 13515006 14123381 14604754 14794465 14598480 14085256 13446192 12852910 12447146
$$ packed form
12435A47140R441J1724r221K4218J2308m523J4279n64j8974j462R152K8925J3244
12422B35687K3637N558L960L7339J4850K7611j540j2804L471K1391K1489L4917
12410D15566M6604K4606K3960N4324P8280P8622Q0880J04971J23792R1477J39285
12399A262367J76859K01476K33813K73947L51567M40561N02463O09320O37934
12390D690307N67291M00623J42311p6203j91139j87055j00585K3985J57702L33730
12380E760967M77447N59048N24447L79344J56432r3784k66383k77930j90625r9517
12370F929446O2080K71168M44427O15936P43404P86895Q01379P62192P08013P08968
12360A2833908O81098O08375M81373J89711j95985n13224o39064n93282m05764
$$ plain form
12351 12447146 12358673 12558122 12887771 13222549 13411687 13347267 13049148 12621042 12276228 12123916
12341 12123916 12212512 12613064 13417584 14587325 16040290 17602414 18957446 19755139 19828437
12332 19828437 19211736 18276233 17405357 16908557 16933505 17556579 18788866 20616402 22887106
12323 22887106 25322181 27567702 29243630 30151780 30417293 30241403 29729430 28776827 27173303
12314 27173303 24869057 22043213 19022820 16156847 13655813 11608952 10020666 8787522
12306 8787522 7820073 7046871 6482137 6057040 5749755 5576663 5488205 5440840 5454949 5542004
12296 5542004 5679102 5921182 6249244 6626688 7099189 7690080 8385104 9219744 10196318
12287 10196318 11340698 12664880 14208867 15993735 17943482 19974543 21991478 23792162
$$ packed form
12351A2447146q8473J99449L29649L34778J89138o4420k98119m28106l44814j52312
12341A2123916Q8596M00552Q04520J169741J452965J562124J355032P97693P3298
12332A9828437o16701r35503q70876m96800K4948O23074J232287J827536K270704
12323B2887106K435075K245521J675928R08150K65513j75890n11973r52603j603524
12314B7173303k304246k825844l020393k865973k501034k046861j588286j233144
12306H787522r67449p73202n64734m25097l07285j73092q8458m7365J4109Q7055
12296E542004J37098K42080L28062L77444M72501N90891O95024Q34640R76574
12287A0196318J144380J324182J543987J784868J949747K031061K016935J800684
$$ plain form
12279 23792162 25216948 26176890 26682693 26821921 26630665 26146924 25294338 24084723 22623993
12270 22623993 21086534 19674475 18516212 17675816 17170992 16942032 16944356 17029947 17076577
12261 17076577 17003382 16740327 16262427 15601007 14831560 14070922 13394566 12870613 12534976
12252 12534976 12328706 12272284 12323187 12403523 12435971 12406814 12332177 12228473 12127190 12084359
12242 12084359 12167899 12360114 12621218 12903837 13113190 13179044 13091302 12861970 12472769 12023291
12232 12023291 11538624 11007894 10413839 9800930 9228595 8696255 8265777 7925550 7697038
12223 7697038 7557274 7511994 7526341 7535036 7536282 7452882 7266366 6983133 6683436 6370489 6086564
12212 6086564 5857522 5713663 5650628 5625309 5635883 5619920 5509379 5283626 4935563 4514777
$$ packed form
12279B3792162J424786R59942N05803J39228j91256m83741q52586j209615j460730
12270B2623993j537459j412059j158263q40396n04824k28960K324Q5591M6630
12261A7076577p3195k63055m77900o61420p69447p60638o76356n23953l35637
12252A2534976k06270n6422N0903Q0336L2448k9157p4637j03704j01283m2831
12242A2084359Q3540J92215K61104K82619K09353O5854q7742k29332l89201m49478
12232A2023291m84667n30730n94055o12909n72335n32340m30478l40227k28512
12223G697038j39764m5280J4347Q695J246q3400j86516k83233k99697l12947k83925
12212F086564k29042j43859o3035k5319J0574j5963j10541k25753l48063m20786
$$ plain form
12202 4514777 4070758 3625976 3210881 2844027 2527835 2267440 2051080 1860647 1711445
12193 1711445 1560029 1444089 1368194 1303903 1232313 1153768 1082762 1027250 985791 913384 863458
12182 863458 835713 804823 749565 722013 701126 693060 673041 644005 632952 621059 591009 569271
12170 569271 548288 532777 546762 541092 522614 525377 504398 474526 450574 429568 421709 434200
12158 434200 437817 412618 382177 376356 392859 395478 390265 388079 366929 368870 383663 373207 351568
12145 351568 356468 324785 301012 295864 295676 295878 299688 295660 296385 292229 300980 296564 284920 277371
12131 277371 264045 282621 293925 267015 233266 230949 239155 212417 213780 230665 211354 213452
12119 213452 216450 212820 209129 209186 213342 216147 190120 189821 199181 175590 172663 187824 184411 178297
$$ packed form
12202D514777m44019m44782m15095l66854l16192k60395k16360j90433j49202
12193A711445j51416j15940p5895o4291p1590p8545p1006n5512m1459p2407m9926
12182H63458k7745l0890n5258k7552k0887q066k0019k9036j1053j1893l0050k1738
12170E69271k0983j5511J3985n670j8478K763k0979k9872k3952k1006p859J2491
12158D34200L617k5199l0441n821J6503K619n213k186k1150J941J4793j0456k1639
12145C51568M900l1683k3773n148j88K02L810m028P25m156Q751m416j1644p549
12131B77371j3326J8576J1304k6910l3749k317Q206k6738J363J6885j9311K098
12119B13452K998l630l691N7M156K805k6027k99R360k3591k927J5161l413o114
$$ plain form
12105 178297 168034 164110 157901 175914 171958 178519 176085 156303 136633 126224 135695 163991 151585
12092 151585 154102 183328 201558 193729 166947 135907 142985 172385 181690 182908 185155 188321 172671
12079 172671 158156 161005 173700 163071 159056 148186 144743 166159 181462 164949 148204 151626
12067 151626 149683 163020 155072 128573 114803 116092 135199 156367 166988 167025 157338 131093 133167
12054 133167 119915 125431 113809 112678 118859 124376 118142 108517 97254 82765 92048 92558 100362
12041 100362 106083 108349 104813 123954 134307 123508 107384 99434 108821 100073 95295 110269 113110
12028 113110 115578 103433 90563 69756 71042 74724 68057 84978 92868 81022 82811 80733 83446
12015 83446 93323 97299 76949 78718 83781 75596 76687 85254 87441 95685 108620 102290 93346 76071
$$ packed form
12105A78297j0263l924o209J8013l956O561k434j9782j9670j0409R471K8296j2406
12092A51585K517K9226J8230p829k6782l1040P078K9400R305J218K247L166j5650
12079A72671j4515K849J2695j0629m015j0870l443K1416J5303j6513j6745L422
12067A51626j943J3337p948k6499j3770J289J9107K1168J0621L7r687k6245K074
12054A33167j3252N516j1622j131O181N517o234r625j1263j4489R283N10P804
12041A00362N721K266l536J9141J0353j0799j6124p950R387q748m778J4974K841
12028A13110K468j2145j2870k0807J286L682o667J6921P890j1846J789k078K713
12015H3446R877L976k0350J769N063q185J091Q567K187Q244J2935o330q944j7275
$$ plain form
12001 76071 79151 68601 55565 64297 77247 88086 93580 96320 97506 98456 92960 70094 77208
11988 77208 89840 81343 77245 89799 106846 97169 93222 88996 78419 80248 88639 102285 107535
11975 107535 76518 60508 65636 76842 66323 44959 54959 76698 97219 67867 47237 39658
11963 39658 48807 49426 48311 26624 25514 34481 46845 43723 35816 30061 49675 54289 60270 72969
11949 72969 65019 81346 88312 77202 68777 79304 96450 72950 74220 105840 135642 167163
11937 167163 189563 188548 169885 174949 166299 150509 144252 128446 115357 116911 108908 108188 106005
11924 106005 106973 94957 96140 105900 118000 95463 97109 98122 102737 132192 142507 150619 154451
11911 154451 146955 149187 132746 109401 104719 108743 117132 129807 140691 147816 147743 160481 176821
$$ packed form
12001G6071L080j0550j3036Q732J2950J0839N494K740J186R50n496k2866P114
11988G7208J2632q497m098J2554J7047r677l947m226j0577J829Q391J3646N250
11975A07535l1017j6010N128J1206j0519k1364J0000K1739K0521k9352k0630p579
11963C9658R149O19j115k1687j110Q967J2364l122p907n755J9614M614N981J2699
11949G2969p950J6327O966j1110q425J0527J7146k3500J270L1620K9802L1521
11937A67163K2400j015j8663N064q650j5790o257j5806j3089J554q003p20k183
11924A06005R68j2016J183R760J2100k2537J646J013M615K9455J0315Q112L832
11911A54451p496K232j6441k3345m682M024Q389J2675J0884P125p3J2738J6340
$$ plain form
11898 176821 170494 167351 158898 134834 120804 118188 106948 100856 81935 80440 103593 106788 95898
11885 95898 74184 47209 24768 35510 56696 49981 53252 74773 77949 79406 89617 100386
11873 100386 104496 115217 125129 143278 148185 141484 160002 185270 137802 106520 99082 104008 99353
11860 99353 93025 81168 52894 57646 55628 51790 73876 73972 67390 62984 58601 58653 58862 71846 74775
11845 74775 69971 90374 102399 93787 79952 75823 115287 131884 145687 163494 155889 150023 129196
11832 129196 127146 111379 102700 88053 77282 72529 61189 49146 48216 45722 48557 61384 83620
11819 83620 81635 76848 93364 87136 80694 87838 84621 90304 88133 88685 88868 104393 116801 149672
11805 149672 184784 184902 180301 169366 152796 124548 119540 116828 95112 69379 58226 55007 59741
$$ packed form
11898A76821o327l143q453k4064j4030k616j1240o092j8921j495K3153L195j0890
11885I5898k1714k6975k2441J0742K1186o715L271K1521L176J457J0211J0769
11873A00386M110J0721R912J8149M907o701J8518K5268m7468l1282p438M926m655
11860I9353o328j1857k8274M752k018l838K2086R6o582m406m383N2K09J2984K929
11845G4775m804K0403J2025q612j3835m129L9464J6597J3803J7807p605n866k0827
11832A29196k050j5767q679j4647j0771m753j1340j2043r30k494K835J2827K2236
11819H3620j985m787J6516o228o442P144l217N683k171N52J83J5525J2408L2871
11805A49672L5112J18m601j0935j6570k8248n008k712k1716k5733j1153l219M734
$$ plain form
11792 59741 66158 48258 39373 76201 106467 99970 83976 81868 71778 72345 68660 86774 105298
11779 105298 101892 77264 66462 87814 82000 72934 61795 78523 94479 94320 101822 88001 84085
11766 84085 90076 88206 90100 78771 58296 46722 45577 52871 37065 15181 19894 38233 65156
11753 65156 48881 22759 22810 49045 51105 45617 39831 35144 35755 35705 17638 24312 43778 56136
11739 56136 51119 41088 39899 47361 42970 30930 28537 48395 47565 42969 56421 45427 33346
11726 33346 28837 46231 50390 34870 33215 16728 10578 25060 39959 34022 54995 57265 34217
11713 34217 23958 23333 25883 24607 42496 23927 19181 21036 -2322 -17362 -19805 -2137 10583
11700 10583 14496 17333 22917 21103 41189 36084 28716 3688 9482 29540 37828 58359 52677
$$ packed form
11792E9741O417j7900q885L6828L0266o497j5994k108j0090N67l685J8114J8524
11779A05298l406k4628j0802K1352n814r066j1139J6728J5956j59P502j3821l916
11766H4085N991j870J894j1329k0475j1574j145P294j5806k1884M713J8339K6923
11753F5156j6275k6122N1K6235K060n488n786m687O11n0j8067O674J9466J2358
11739E6136n017j0031j189P462m391j2040k393J9858q30m596J3452j0994j2081
11726C3346m509J7394M159j5520j655j6487o150J4482J4899n937K0973K270k3048
11713C4217j0259o25K550j276J7889j8569m746J855k3358j5040k443J7668J2720
11700A0583L913K837N584j814K0086n105p368k5028N794K0058Q288K0531n682
$$ plain form
11687 52677 42761 33509 25893 35956 34779 15331 5974 3431 -7874 -327 20508 44527 34797
11674 34797 7583 -14658 -9473 3264 24684 21736 13575 -5992 -31056 -12939 -6764 -4667 6436
11661 6436 20339 11563 14912 30233 35824 19101 22053 33120 40369 46719 48892 23618 10891
11648 10891 19179 17662 25084 25368 13866 5776 33124 55886 32096 21468 50545 55079 40557
11635 40557 17564 3210 -4069 4504 23241 17371 27606 21926 -2515 -4471 19350 50253 63222
11622 63222 49134 41914 18960 10924 -8490 -28301 -15935 -11304 -24966 -17563 4824 20959
11610 20959 19087 22789 44823 62293 58748 48238 28448 28826 45968 49429 42108 27846 30257
11597 30257 17442 3306 -17799 -21887 -9323 13863 26202 30038 29988 39971 57877 61538 70620
$$ packed form
11687E2677r916r252p616J0063j177j9448r357k543j1305P547K0835K4019r730
11674C4797k7214k2241N185J2737K1420k948q161j9567k5064J8117O175K097J1103
11661F436J3903q776L349J5321N591j6723K952J1067P249O350K173k5274j2727
11648A0891Q288j517P422K84j1502q090K7348K2762k3790j0628K9077M534j4522
11635D0557k2993j4354p279Q573J8737n870J0235n680k4441j956K3821L0903J2969
11622F3222j4088p220k2954q036j9414j9811J2366M631j3662P403K2387J6135
11610B0959j872L702K2034J7470l545j0510j9790L78J7142L461p321j4262K411
11597C0257j2815j4136k1105m088J2564K3186J2339L836n0R983J7906L661R082
$$ plain form
11584 70620 57916 45918 54425 28386 16883 6200 15760 27936 37625 34997 26064 17712 24381
11571 24381 28635 46335 43298 38423 25237 15089 4611 -15246 2586 7927 14754 25778 38027
11558 38027 29054 8771 -6207 -8238 -3487 -3678 7411 794 -102 29438 67047 57577 25647
11545 25647 18184 38655 22690 16352 40635 47545 22521 25442 51090 52703 38925 29017 40765
11532 40765 28126 5875 -1402 -7602 -15258 -5440 11976 25941 16079 -11449 -22047 -7094 -4898
11519 -4898 -8914 5218 34117 24166 20878 24576 26903 21930 18823 20412 -1655 -7305 -10609 7520
11505 7520 42607 36437 23115 -3311 -24248 -19840 -21527 -32003 -23391 -20089 -25162 -34364 -31263
11492 -31263 -9952 10468 36943 64542 69851 43029 24853 23683 35854 30304 31492 24020 10362
$$ packed form
11584G0620j2704j1998Q507k6039j1503j0683R560J2176R689k628q933q352O669
11571B4381M254J7700l037m875j3186j0148j0478j9857J7832N341O827J1024J2249
11558C8027q973k0283j4978k031M751j91J1089o617q96K9540L7609r470l1930
11545B5647p463K0471j5965o338K4283O910k5024K921K5648J613j3778r908J1748
11532D0765j2639k2251p277o200p656R818J7416J3965r862k7528j0598J4953K196
11519d898m016J4132K8899r951l288L698K327m973l107J589k2067n650l304J8129
11505G520L5087o170j3322k6426k0937M408j687j0476Q612L302n073r202L101
11492c1263K1311K0420K6475K7599N309k6822j8176j170J2171n550J188p472j3658
$$ plain form
11479 10362 -8066 -19003 3739 29214 41976 44034 11509 757 4080 -14130 -27089 -15950
11467 -15950 -7689 7071 1121 -13599 -6569 -11669 -20411 -22386 -1870 -2066 15367 35409 22737
11454 22737 9811 296 -3111 2103 17558 6507 -14879 -20818 -6210 9193 768 -2794 -15216
11441 -15216 -845 10579 13117 2610 11350 25205 22947 20983 4307 -3592 7826 27503 48343
11428 48343 35555 17587 23778 2969 31332 39831 16358 16668 31965 31949 35644 34136 26907 19123
11414 19123 14674 26471 10771 2860 -9462 -19717 -19306 -17604 -6379 8803 -4301 -21741 -37942
11401 -37942 -32934 -34750 -24970 -16263 -5728 20785 12505 -1490 6674 2046 12679 24961 35736
11388 35736 32255 19616 8660 6838 -5669 -9621 17152 35732 33075 35654 35105 41815 24794
$$ packed form
11479A0362j8428j0937K2742K5475J2762K058l2525j0752L323j8210j2959J1139
11467a5950Q261J4760n950j4720P030n100q742j975K0516j96J7433K0042j2672
11454B2737j2926r515l407N214J5455j1051k1386n939J4608J5403q425l562j2422
11441a5216J4371J1424K538j0507Q740J3855k258j964j6676p899J1418J9677K0840
11428D8343j2788j7968O191k0809K8363Q499k3473L10J5297j6L695j508p229p784
11414A9123m449J1797j5700p911j2322j0255M11J702J1225J5182j3104j7440j6201
11401c7942N008j816R780Q707J0535K6513q280j3995Q164m628J0633J2282J0775
11388C5736l481j2639j0956j822j2507l952K6773J8580k657K579n49O710j7021
$$ plain form
11375 24794 37758 31107 21261 8495 -12663 -7429 8208 24557 24833 14632 921 6129 21327
11362 21327 39206 39427 13916 7845 18306 6699 441 26192 27097 11889 4768 -16506 -19007
11349 -19007 -2642 4583 -15369 -41640 -29519 -3813 6013 5711 155 -24686 -26035 -7544 9305
11336 9305 13767 7650 15342 9833 323 11346 23073 19063 -1640 -1933 17793 29498 39816
11323 39816 5674 -12932 -911 9859 4564 -1665 2573 -6677 -39886 -39937 -7327 7158 7196 8388
11309 8388 29747 33343 37404 -3573 -28902 -18854 -9502 -8114 -12456 -21063 -32302 -34361 -47143
11296 -47143 -30100 -9429 -2190 6934 27583 22048 13940 11268 12936 -5602 -22564 -30344 -40414
11283 -40414 -35476 -34531 -25972 -26034 -14010 -23892 -21988 -12235 -6674 -8912 -9130 -8718 807 6647 11940
$$ packed form
11375B4794J2964o651r846j2766k1158N234J5637J6349K76j0201j3711N208J5198
11362B1327J7879K21k5511o071J0461j1607o258K5751R05j5208p121k1274k501
11349a9007J6365P225j9952k6271J2121K5706R826l02n556k4841j349J8491J6849
11336I305M462o117P692n509r510J1023J1727m010k0703k93J9726J1705J0318
11323C9816l4142j8606J2021J0770n295o229M238r250l3209n1L2610J4485L8J192
11309H388K1359L596M061m0977k5329J0048R352J388m342q607j1239k059j2782
11296d7143J7043K0671P239R124K0649n535q108k672J668j8538j6962p780j0070
11283d0414M938R45Q559o2J2024r882J904R753N561k238k18M12R525N840N293
$$ plain form
11268 11940 5872 -9281 -30572 -38515 -30095 -20275 -2085 8810 4835 19509 27041 8235 -3976
11255 -3976 1628 7909 9363 1103 -1460 -10296 16777 23313 10582 12889 17113 -2579 4217 -5293
11241 -5293 -12689 -5161 3492 -7541 -27563 -41487 -41033 -28409 -33196 -17586 -17164 -4787 4183 82
11227 82 7834 17626 14974 19349 29818 20444 4409 9439 7640 25550 23064 18582 19339 13435 19174
11212 19174 2376 19345 41652 35337 49927 44578 29676 2090 -11223 -4117 7686 14710
11200 14710 -4487 -18090 -31108 -40019 -44545 -27365 -13513 -12005 -942 11640 17633 49746
11188 49746 63318 40722 10867 3733 5936 24 -5414 -18253 -18866 -6786 9164 7547 -3248
11175 -3248 -1842 11795 11385 -331 -27170 -17725 -1741 15660 25617 31321 30863 2951 15257
$$ packed form
11268A1940o068j5153k1291p943Q420R820J8190J0895l975J4674P532j8806j2211
11255c976N604O281J454q260k563q836K7073O536j2731K307M224j9692O796r510
11241e293p396P528Q653j1033k0022j3924M54J2624m787J5610M22J2377Q970m101
11227H2P752R792k652M375J0469r374j6035N030j799J7910k486m482P57n904N739
11212A9174j6798J6969K2307o315J4590n349j4902k7586j3313P106J1803P024
11200A4710j9197j3603j3018q911m526J7180J3852J508J1063J2582N993L2113
11188D9746J3572k2596k9855p134K203n912n438j2839o13J2080J5950j617j0795
11175c248J406J3637m10j1716k6839R445J5984J7401R957N704m58k7912J2306
$$ plain form
11162 15257 27232 30866 27510 26686 13579 74 -27312 -23780 -4927 5484 -5577 -6517 3727
11149 3727 -11702 5457 10678 9597 6375 19356 4417 13522 13153 18128 25075 27030 4175 -20160
11135 -20160 -9592 13241 3510 32874 43813 19083 -9693 -8510 -16357 -39959 -49126 -38265
11123 -38265 -36069 -35065 -22817 -8879 -1697 7678 -6686 1308 4107 -7791 -20769 -14019 3909
11110 3909 -12005 -13241 2234 9086 -16646 -17783 -7559 3225 18095 10602 3482 -7575 1673
11097 1673 5347 9030 5759 -18862 -11201 -8668 -18361 -13273 -10205 -11779 -5334 -4680 8680 6835
11083 6835 11502 -6197 -32631 -14190 24569 10178 17103 26018 43614 22198 621 -15162
11071 -15162 -2889 1016 11238 9842 11697 3392 9089 16322 -16371 -26841 -35928 -42011 -28400
$$ packed form
11162A5257J1975L634l356q24j3107j3505k7386L532J8853J0411j1061r40J0244
11149C727j5429J7159N221j081l222J2981j4939R105l69M975O947J955k2855k4335
11135b0160J0568K2833r731K9364J0939k4730k8776J183p847k3602r167J0861
11123c8265K196J004J2248J3938P182R375j4364P994K799j1898j2978O750J7928
11110C909j5914j236J5475O852k5732j137J0224J0784J4870p493p120j1057R248
11097A673L674L683l271k4621P661K533r693N088L068j574O445O54J3360j845
11083F835M667j7699k6434J8441L8759j4391O925Q915J7596k1416k1577j5783
11071a5162J2273L905J0222j396J855q305N697P233l2693j0470r087o083J3611
$$ plain form
11058 -28400 -14033 -14355 -6014 1617 3578 10836 -4080 -21372 -25108 -32231 -30592 -35291 -47779 -24740
11044 -24740 6239 -12513 -25753 -8046 2790 -1134 -4796 -12381 -39206 -41605 -32715 -39108 -58872
11031 -58872 -69767 -45612 -31036 -22767 -25297 -35143 -15204 -4254 -12549 -14725 -11905 10428 5904
11018 5904 5846 13844 -5844 -19404 -11990 -7459 8093 19305 10593 -4663 -5199 7956 11221 -12020
11004 -12020 -17079 -3651 5310 -7638 -20595 -30590 -37388 -26062 -35630 -39780 -25588 -5927 -19388
10991 -19388 -21568 -303 15339 6341 -9082 -1848 8428 13695 6358 104 3914 13124 35063
10978 35063 14204 -4101 -18169 -25727 -29269 -3613 4739 281 -18946 -42176 -27848 -19450 -6845
10965 -6845 641 10152 -14261 -18289 -19192 -25013 -27185 -24729 -27696 -25778 -35701 -33234 -25136 5059
$$ packed form
11058b8400J4367l22Q341P631J961P258j4916j7292l736p123J639m699j2488K3039
11044b4740L0979j8752j3240J7707J0836l924l662p585k6825k399Q890o393j9764
11031e8872j0895K4155J4576Q269k530r846J9939J0950q295k176K820K2333m524
11018E904n8P998j9688j3560P414M531J5552J1212q712j5256n36J3155L265k3241
11004a2020n059J3428Q961j2948j2957r995o798J1326r568m150J4192J9661j3461
10991a9388k180K1265J5642q998j5423P234J0276N267p337o254L810R210K1939
10978C5063k0859j8305j4068p558l542K5656Q352m458j9227k3230J4328Q398J2605
10965f845P486R511k4413m028r03n821k172K456k967J918r923K467Q098L0195
$$ plain form
10951 5059 28044 15653 3824 5355 4999 -20345 -7720 -9786 -13142 -2253 -24669 -35331 -34788
10938 -34788 -23415 -1446 -1869 -12468 -15445 -3816 20842 40526 60395 25288 -11386 -26227
10926 -26227 -18493 39 -1559 -6600 -2980 -4768 -14347 -31123 -44747 -54570 -56981 -41833 -24190
10913 -24190 -10743 267 -13 -2048 -34827 -37631 -7141 12829 20518 22326 36559 32696 26676
10900 26676 -1020 -603 18227 -4464 -39734 -38520 -21837 -20501 -21997 -18637 -35297 -36095 -34537
10887 -34537 -18440 -14603 -13324 -12872 3369 15803 7434 482 999 10656 20347 12236 5756 5719 12202
10872 12202 22086 18628 -2204 3084 16971 7447 5149 13676 16639 7187 -4166 8039 -3583
10859 -3583 3026 -285 3643 13662 13743 5483 11835 4611 824 -3742 -10470 -29754 -3502 12618
$$ packed form
10951E059K2985j2391j1829J531l56k5344J2625k066l356J0889k2416j0662N43
10938c4788J1373K1969m23j0599k977J1629K4658J9684J9869l5107l6674j4841
10926b6227P734J8532j598n041L620j788r579j6776j3624r823k411J5148J7643
10913b4190J3447J1010k80k035l2779k804L0490J9970P689J808J4233l863o020
10900B6676k7696M17J8830k2691l5270J214J6683J336j496L360j6660p98J558
10887c4537J6097L837J279M52J6241J2434q369o952N17R657R691q111o480l7O483
10872A2202R884l458k0832N288J3887r524k298Q527K963r452j1353J2205j1622
10859c583O609l311L928J0019Q1q260O352p224l787m566o728j9284K6252J6120
$$ plain form
10845 12618 -24092 -37364 -39566 -43380 -33858 -18816 -12640 -1837 -18990 -30755 -41629 -31687 26078
10832 26078 48485 21301 13627 -7101 -57965 -60654 -32271 -31300 -22872 -10176 -13936 -10343 -23621
10819 -23621 -27600 -32220 -17323 -12242 11566 13872 5301 -15032 -34752 -38431 -38818 -27000 -10289
10806 -10289 -5034 -2990 -10987 -8029 14788 -1671 -19172 -17106 -567 -13244 -23575 -20958 -27739
10793 -27739 -32216 872 3527 -2273 10370 8145 6801 7150 3520 10314 9147 -2691 -16246 -35867
10779 -35867 -29069 -14271 -12596 -18984 -9607 19782 30217 12470 4554 38743 54378 45708 35416
10766 35416 28509 29665 9178 -5456 -2108 2036 5713 -5080 -3235 121 -8327 -2362 16420
10753 16420 24589 20537 24851 27832 24790 9720 8519 30136 39734 35483 31717 18546 545
$$ packed form
10845A2618l6710j3272k202l814R522J5042O176J0803j7153j1765j0874R942N7765
10832B6078K2407k7184p674k0728n0864k689K8383R71Q428J2696l760L593j3278
10819b3621l979m620J4897N081K3808K306q571k0333j9720l679l87J1818J6711
10806a0289N255K044p997K958K2817j6459j7501K066J6539j2677j0331K617o781
10793b7739m477L3088K655n800J2643k225j344L49l630O794j167j1838j3555j9621
10779c5867O798J4798J675o388R377K9389J0435j7747p916L4189J5635q670j0292
10766C5416o907J156k0487j4634L348M144L677j0793J845L356q448N965J8782
10753A6420Q169m052M314K981l042j5070j201K1617R598m251l766j3171j8001
$$ plain form
10740 545 -14346 -26738 -11113 -4242 -5354 2572 -4818 -441 4573 -14201 -4301 1585 -11986 -12431
10726 -12431 17266 8956 5911 25086 21334 209 -23788 -23414 -19803 -10100 -85 -1969 892
10713 892 -14573 -20285 -12939 6709 1203 -13058 -14320 -32525 -9119 6035 10840 12720 5944
10700 5944 -439 18349 18374 -10587 -16012 7098 21776 27883 2046 -25296 -33109 -26483 -26176 -13047
10686 -13047 3208 -9157 -10434 5090 -14725 -28128 -39807 -37656 -45990 -46614 -37943 -29520 -15684
10673 -15684 -25728 -33725 -53841 -51926 -13156 19520 21113 7674 8006 5678 1185 -4165 -4491 -1963
10659 -1963 -2505 894 33094 62372 42788 21667 14893 4923 8419 -7256 -152 5422 -15369
10646 -15369 -20761 -12523 -10212 10554 32856 26675 23077 41112 56477 65244 34614 19478 23766
$$ packed form
10740E45j4891j2392J5625O871j112P926p390M377N014j8774R900N886j3571m45
10726a2431K9697q310l045J9175l752k1125k3997L74L611R703J0015j884K861
10713H92j5465n712P346J9648n506j4261j262j8205K3406J5154M805J880o776
10700E944o383J8788K5k8961n425K3110J4678O107k5837k7342p813O626L07J3129
10686a3047J6255j2365j277J5524j9815j3403j1679K151q334o24Q671Q423J3836
10673a5684j0044p997k0116J915L8770L2676J593j3439L32k328m493n350l26K528
10659a963n42L399L2200K9278j9584k1121o774r970L496j5675P104N574k0791
10646a5369n392Q238K311K0766K2302o181l598J8035J5365Q767l0630j5136M288
$$ plain form
10633 23766 28218 13845 26359 28744 28448 28728 19723 5416 11019 42654 45416 11903 883
10620 883 -14098 -10214 -3762 2470 1790 -3941 -13328 -517 4703 -10360 -11427 -4096 -2960 10854
10606 10854 40623 31008 13233 10571 857 5642 -3288 -29604 -32196 1020 17357 -12455 -4321
10593 -4321 10334 8909 -11311 -32019 -28140 -18266 -15545 -11387 7449 2317 -2906 10947 7025
10580 7025 8035 31242 40188 36761 29594 13864 4155 3361 -21266 -19423 -1879 24783 24673 17179
10566 17179 5344 5154 -11224 -40186 -36178 -35024 -3564 1058 -31494 -41509 -29794 -11828 -19335
10553 -19335 -38519 -37939 -21452 -1985 -1886 -7599 -7669 12877 32793 34834 21800 28101 17654 33997
10539 33997 69008 52976 14190 1429 3794 11918 19431 17447 25862 28764 34791 24987 -2201
$$ packed form
10633B3766M452j4373J2514K385k96K80r005j4307N603L1635K762l3513j1020
10620H83j4981L884O452O232o80n731r387J2811N220j5063j067P331J136J3814
10606A0854K9769r615j7775k662r714M785q930k6316k592L3216J6337k9812Q134
10593d321J4655j425k0220k0708L879R874K721M158J8836n132n223J3853l922
10580G025J010K3207Q946l427p167j5730r709p94k4627J843J7544K6662j10p494
10566A7179j1835j90j6378k8962M008J154L1460M622l2552j0015J1715J7966p507
10553a9335j9184N80J6487J9467R9n713p0K0546J9916K041j3034O301j0447J6343
10539C3997L5011j6032l8786j2761K365Q124P513j984Q415K902O027r804k7188
$$ plain form
10526 -2201 -19716 -9104 -4372 -2293 19597 9242 -2406 6342 13237 19964 15324 3088 -20901
10513 -20901 -35775 -34178 -14575 -7068 -14293 -9460 -12391 -8621 -9837 -15457 -23344 -50906 -43397 -30766
10499 -30766 -3475 9597 3 -11047 -15461 -3712 18431 28077 18324 678 -293 16021 22594
10486 22594 26345 20325 12411 -13565 -12722 4384 26014 19185 -5476 3406 14516 7831 -8628
10473 -8628 13545 38647 27563 6852 -11674 -2053 24962 28649 11991 9439 29873 29264 -1391
10460 -1391 -17172 -6664 4603 36214 638 -23586 -5639 21985 40644 37087 18331 -19153
10448 -19153 -17267 -19085 -30728 -20359 -30128 -20689 -17124 -984 5794 5779 11249 1563 -3004 -8665
10434 -8665 -21860 -11165 -2663 -7213 -960 4156 11901 13362 -842 -17728 -12846 -5715 2411 -21254
$$ packed form
10526b201j7515J0612M732K079K1890j0355j1648Q748O895O727m640j2236k3989
10513b0901j4874J597J9603P507p225M833k931L770j216n620p887k7562P509J2631
10499c0766K7291J3072r594j1050m414J1749K2143R646r753j7646r71J6314O573
10486B2594L751o020p914k5976Q43J7106K1630o829k4661Q882J1110o685j6459
10473h628K2173K5102j1084k0711j8526R621K7015L687j6658k552K0434o09l0655
10460a391j5781J0508J1267L1611l5576k4224J7947K7624J8659l557j8756l7484
10448a9153J886j818j1643J0369r769R439L565J6140O778j5N470r686m567n661
10434h665j3195J0695Q502m550O253N116P745J461j4204j6886M882P131Q126k3665
$$ plain form
10420 -21254 -31789 -9567 -3181 -2521 -10737 -16763 -11259 -8214 -3734 -1335 -10061 -13029 -38379 -53857
10406 -53857 -60150 -25472 -18444 875 10513 316 8787 22351 30737 14576 14857 22371 28687
10393 28687 35428 46389 59650 67587 47745 24378 5490 -4193 -6944 4598 39618 34813 -1514
10380 -1514 3032 24701 12125 1135 -6101 -2277 8553 -5690 -4799 -22739 -17560 538 25813
10367 25813 27036 20211 9559 -10841 -22656 -27060 -21631 -18189 -21864 -12871 -9752 -26261 -34775
10354 -34775 -4388 11953 1291 -6934 -12848 -22782 -36815 -22976 -8638 -3535 -16515 -52333
10342 -52333 -58533 -38045 -19464 -27177 -29003 -24995 -23316 3576 -1908 9572 -2688 5980 18374
10329 18374 4567 3230 -1138 8394 5483 -2414 -13515 -27933 -27361 -25068 -11458 5831 22470
$$ packed form
10420b1254j0535K2222O386O60q216o026N504L045M480K399q726k968k5350j5478
10406e3857o293L4678P028J9319R638j0197Q471J3564Q386j6161K81P514O316
10393B8687O741J0961J3261P937j9842k3367j8888r683k751J1542L5020m805l6327
10380a514M546K1669j2576j0990p236L824J0830j4243Q91j7940N179J8098K5275
10367B5813J223o825j0652k0400j1815m404N429L442l675Q993L119j6509q514
10354c4775L0387J6341j0662q225n914r934j4033J3839J4338N103j2980l5818
10342e2333o200K0488J8581p713j826M008J679K6892n484J1480j2260Q668J2394
10329A8374j3807j337m368R532k911p897j1101j4418N72K293J3610J7289J6639
$$ plain form
10316 22470 41091 29081 26793 34859 19169 7544 20198 28694 33413 26118 11031 4746 -1001
10303 -1001 -14006 11338 37359 28749 6639 14954 13149 -4787 -12207 -8094 -4080 11860 10031
10290 10031 -3879 -11985 2820 2119 -1517 -13031 -6784 -13831 -10989 6294 -30080 -36150 -29865
10277 -29865 -24615 -8381 -15638 -8676 9490 14864 16053 7530 18670 3206 -11492 -3850 -17806
10264 -17806 -11975 -7091 -11357 -8404 -4859 -13215 -19280 -19433 -12038 -12749 -7545 -14568 -16077 -14014 -28088
10249 -28088 -21331 -10450 19015 27575 29097 6342 491 -14111 10954 21519 5893 3396 12628
10236 12628 19272 44046 46310 28173 8499 -565 -5419 -13684 -17089 -27454 -17444 -18565 -13712
10223 -13712 -2771 -8028 -19185 -13220 -19284 -40474 -38830 -24562 -21889 -19360 13891 14101 -2203
$$ packed form
10316B2470J8621j2010k288Q066j5690j1625J2654Q496M719p295j5087o285n747
10303a001j3005K5344K6021q610k2110Q315j805j7936p420M113M014J5940j829
10290A0031j3910q106J4805p01l636j1514O247p047K842J7283l6374o070O285
10277b9865N250J6234p257O962J8166N374J189q523J1140j5464j4698P642j3956
10264a7806N831M884m266K953L545q356o065j53P395p11N204p023j509K063j4074
10249b8088O757J0881K9465Q560J522k2755n851j4602K5065J0565j5626k497R232
10236A2628O644K4774K264j8137j9674r064m854q265l405j0365J0010j121M853
10223a3712J0941n257j1157N965o064k1190J644J4268K673K529L3251K10j6304
$$ plain form
10210 -2203 -17405 -10542 404 -3285 3397 -361 -18626 -9803 1391 730 -5331 -4093 -3245 -8295
10196 -8295 -8345 -27899 -53001 -53976 -45784 -61839 -46117 -30119 -41825 -29455 -22704 -22453 -13064 8522
10182 8522 21461 13050 16436 22518 10215 -8011 -19673 -17718 -19035 2175 24360 3123 -4767
10169 -4767 -7305 5122 -8 -8522 -11235 -13863 -15823 -12521 -24434 -36029 -21260 -24753 -22113 -37358
10155 -37358 -30584 -16353 -6085 2780 -11584 -30332 -44959 -42875 -36025 -25543 1990 25760
10143 25760 -6917 -16063 -4252 13386 23193 17460 14908 17164 12912 14747 -1687 -24531 -26594
10130 -26594 -26348 -17144 -4273 -13008 -4207 4124 21463 34696 27140 20434 22851 30670 40126 32404
10116 32404 22284 1054 19161 33774 8808 12119 -710 13820 35481 41693 15807 -370
$$ packed form
10210b203j5202O863J0946l689O682l758j8265Q823J1194o61o061J238Q48n050
10196h295n0j9554k5102r75Q192j6055J5722J5998j1706J2370O751K51R389K1586
10182H522J2939q411L386O082j2303j8226j1662J955j317K1210K2185k1237p890
10169d767k538J2427n130q514k713k628j960L302j1913j1595J4769l493K640j5245
10155c7358O774J4231J0268Q865j4364j8748j4627K084O850J0482K7533K3770
10143B5760l2677r146J1811J7638R807n733k552K256m252J835j6434k2844k063
10130b6594K46R204J2871q735Q801Q331J7339J3233p556o706K417P819R456p722
10116C2404j0120k1230J8107J4613k4966L311j2829J4530K1661O212k5886j6177
$$ plain form
10104 -370 5261 13330 10544 -3714 -12861 -12813 -9980 1708 -10460 -30614 -44000 -49215 -32821 -83
10090 -83 22623 24022 3131 -19030 -17064 -15650 -23481 -38163 -33464 -28371 -22600 -28267 -10517 18146
10076 18146 15397 -9145 -16292 -8976 14262 16019 11243 7542 -7886 -4498 -4326 10651 -7355
10063 -7355 -20614 -26175 -30164 -12028 897 -12325 -10639 -18032 -19053 -28884 -31567 -37766 -31849 -15734
10049 -15734 -2246 8143 2354 4698 2392 19743 16720 19497 12157 -2566 -18786 -9578 12371
10036 12371 4937 9981 8333 -6257 -13543 -21727 -21454 -9382 24100 38545 2793 -10680 -12401
10023 -12401 -17518 -40186 -41137 -22286 -5554 -71 -13806 -17981 -26398 -44772 -43798 -29634 -18315
10010 -18315 -27465 -38455 -2924 872 -8538 -4778 10004 3433 7025 -135 9468 -4913 -11001
$$ packed form
10104c70N631Q069k786j4258r147M8K833J1688j2168k0154j3386n215J6394L2738
10090h3K2706J399k0891k2161J966J414p831j4682M699N093N771n667J7750K8663
10076A8146k749k4542p147P316K3238J757m776l701j5428L388J72J4977j8006
10063g355j3259n561l989J8136J2925j3222J686p393j021r831k683o199N917J6115
10049a5734J3488J0389n789K344k306J7351l023K777p340j4723j6220R208K1949
10036A2371p434N044j648j4590p286q184K73J2072L3482J4445l5752j3473j721
10023a2401n117k2668r51J8851J6732N483j3735m175q417j8374R74J4164J1319
10010a8315r150j0990L5531L796r410L760J4782o571L592p160R603j4381o088
$$ plain form
9997 -11001 -37636 -65707 -48130 -11835 907 -1220 7468 29350 21152 15543 10716 6859 2629
9984 2629 3059 10905 7819 11450 24218 26085 20686 24495 11509 18755 15263 12673 6656 -4074
9970 -4074 -31042 -20863 -12 6810 12059 31108 24895 2661 -6037 -9553 -13306 -27613 -37374
9957 -37374 -19932 -44190 -43381 -27668 -15468 -9297 -24968 -3926 15947 23273 33057 29077 2846
9944 2846 -29727 -32195 -32614 -36578 -16867 -1665 -3837 -529 1259 -196 15479 3800 13033 24983
9930 24983 16398 -4480 -16656 -32936 -32662 -14877 6591 31657 22897 2187 -14856 -13740 -18302
9917 -18302 -26550 -32543 -44314 -58630 -44995 -26378 17243 13728 -1550 2009 10488 18046 28033
9904 28033 20551 13104 13191 8615 -3911 14896 -5134 -33235 -11696 13308 28680 28192 29563 23034
$$ packed form
9997a1001k6635k8071J7577L6295J2742k127Q688K1882q198n609m827l857m230
9984B629M30P846l086L631J2768J867n399L809j2986P246l492k590o017j0730
9970d074k6968J0179K0851O822N249J9049o213k2234q698l516l753j4307r761
9957c7374J7442k4258Q09J5713J2200O171j5671K1042J9873P326R784l980k6231
9944B846l2573k468m19l964J9711J5202k172L308J788j455J5675j1679R233J1950
9930B4983q585k0878j2176j6280K74J7785K1468K5066q760k0710j7043J116m562
9917a8302q248n993j1771j4316J3635J8617M3621l515j5278L559Q479P558R987
9904B8033p482p447Q7m576j2526J8807k0030k8101K1539K5004J5372m88J371o529
$$ plain form
9890 23034 -6929 -26224 -14810 373 7247 -10033 -3737 1136 -4359 -10636 -1173 1253 -18654
9877 -18654 -20351 -18 -7841 -12629 -961 -7552 -2329 4170 -2833 -11274 7645 16971 -3128 -13393
9863 -13393 -10676 87 12159 3154 15845 38311 53156 58828 29942 14301 16074 22635 14766
9850 14766 -1401 -13264 -23101 -15996 -23714 -28359 -15577 -7182 -31867 -52368 -39415 -27081 -33166
9837 -33166 -45391 -25242 -16243 -15564 -5724 -6072 -11508 21053 42281 34611 10470 3559 27467 18494
9823 18494 -5234 -3129 -5179 -8978 -7233 2203 -6971 -33651 -49618 -15241 -8514 -18226 -21736 -28644
9809 -28644 -33376 -11366 17630 33729 20243 -16317 -33930 -38923 -42396 -20767 -3148 -16924
9797 -16924 -28061 -33999 -26555 -27827 -20699 -14178 -9856 -3058 -2502 -29 330 5574 3981 -4607 1408
$$ packed form
9890B3034k9963j9295J1414J5183O874j7280O296M873n495o277R463K426j9907
9877a8654j697K0333p823m788J1668o591N223O499p003q441J8919R326k0099j0265
9863a3393K717J0763J2072r005J2691K2466J4845N672k8886j5641J773O561p869
9850A4766j6167j1863r837P105p718m645J2782Q395k4685k0501J2953J2334o085
9837c3166j2225K0149Q999O79R840l48n436L2561K1228p670k4141o911K3908q973
9823A8494k3728K105k050l799J745R436r174k6680j5967L4377O727r712l510o908
9809b8644m732K2010K8996J6099j3486l6560j7613m993l473K1629J7619j3776
9797a6924j1137n938P444j272P128O521M322O798N56K473L59N244j593q588O015
$$ plain form
9782 1408 1055 1539 -5483 7706 9056 23660 25705 28105 42116 36469 25520 19220 9089 15869
9768 15869 32241 32710 11737 2500 -6020 -18613 1948 17813 17432 17032 16876 -14447 -40679 -50396
9754 -50396 -39944 -31264 -23204 -15893 -5068 -12218 -26194 -9871 20156 26135 16391 18889 25333
9741 25333 20077 -2892 -11801 13489 26247 12927 9507 27323 25676 6779 -19802 -22498 -2725
9728 -2725 1996 -11751 -6266 -12549 -22738 -31002 -6309 1028 -10293 1979 5601 1103 -5190 -8327
9714 -8327 -5881 20464 4679 -1057 9562 -8918 -11718 11883 4923 -9718 -8448 -272 15292
9701 15292 22130 12089 -3806 7145 36227 22714 21291 23834 33553 2070 -22778 -16441 -8807
9688 -8807 -1223 36759 24314 2799 6460 -10306 -21836 -15397 -9700 -17270 6191 16135 28574
$$ packed form
9782A408l53M84p022J3189J350J4604K045K400J4011n647j0949o300j0131O780
9768A5869J6372M69k0973r237q520j2593K0561J5865l81m00j56l1323k6232r717
9754e0396J0452Q680Q060P311J0825p150j3976J6323L0027N979r744K498O444
9741B5333n256k2969q909K5290J2758j3320l420J7816j647j8897k6581k696J9773
9728b725M721j3747N485o283j0189q264K4693P337j1321J2272L622m498o293l137
9714h327K446K6345j5785n736J0619j8480k800K3601o960j4641J270Q176J5564
9701A5292O838j0041j5895J0951K9082j3513j423K543R719l1483k4848O337P634
9688h807P584L7982j2445k1515L661j6766j1530O439N697p570K3461R944J2439
$$ plain form
9675 28574 29045 1321 -18720 -30870 -33081 -42803 -32630 -24820 -3400 9044 -9208 -16005 -30762
9662 -30762 -34359 -13601 1827 -4595 12775 7797 -18819 -17632 -5899 -13962 -30084 -16926 -9763
9649 -9763 -15984 858 18712 9093 9135 3100 -591 -3567 -20497 -48026 -54376 -40098 -33398 -18072
9635 -18072 -18627 -16858 11240 17989 7833 4215 13423 9404 -1568 -21423 -19093 -17714 -8772 34627
9621 34627 42297 28470 10114 -3504 -23228 -36537 -44671 -42071 -7739 -10978 -2710 10540 11407
9608 11407 -4852 -21910 -6297 783 -23724 -9412 -5891 -18953 -2176 2130 -6392 21260 19356
9595 19356 8174 5242 3072 -13536 -16201 1689 -10858 -11549 -13682 -26070 -46817 -63075 -56046
9582 -56046 -44140 -46914 -54700 -41825 -21169 -6063 3186 1841 17531 11614 -6414 -4219 -9022
$$ packed form
9675B8574M71k7724k0041j2150k211r722J0173P810K1420J2444j8252o797j4757
9662c0762l597K0758J5428o422J7370m978k6616J187J1733q063j6122J3158P163
9649i763o221J6842J7854r619M2o035l691k976j6930k7529o350J4278O700J5326
9635a8072n55J769K8098O749j0156l618R208m019j0972j9855K330J379Q942M3399
9621C4627P670j3827j8356j3618j9724j3309q134K600L4332l239Q268J3250Q67
9608A1407j6259j7058J5613P080k4507J4312L521j3062J6777M306q522K7652j904
9595A9356j1182k932k170j6608k665J7890j2547o91k133j2388k0747j6258P029
9582e6046J1906k774p786J2875K0656J5106R249j345J5690n917j8028K195m803
$$ plain form
9569 -9022 -9405 -4833 6413 -3455 -15570 -14020 452 6643 16982 19976 14772 19232 15580 24069
9555 24069 38728 24276 18188 15399 -1258 -18320 -9437 -9502 -19276 -43970 -33249 -4491 8027
9542 8027 -55 -12147 -9505 -11731 11938 41811 35044 9029 -29429 -29329 -18424 -5465 8557
9529 8557 12244 25414 40282 27707 2359 -8642 -7903 -7607 -8211 11248 24059 26121 10884 3808
9515 3808 10132 -1604 -29883 -48393 -45784 -49654 -35802 -45129 -39369 -12935 6428 4611 1955
9502 1955 6722 18145 29445 37058 18071 13970 25906 -12857 -26769 -6162 18401 19488 9782
9489 9782 -6206 -21336 -12118 10586 14188 8268 8264 21340 34780 20120 26094 41161 29832 37994
9475 37994 23222 9897 9284 7033 13071 26857 23756 14809 15707 19586 7053 6438 -10784 -14409
$$ packed form
9569i022l83M572J1246r868j2115J550J4472O191J0339K994n204M460l652Q489
9555B4069J4659j4452o088k789j6657j7062Q883o5r774k4694J0721K8758J2518
9542H027q082j2092K642k226K3669K9873o767k6015l8458J00J0905J2959J4022
9529H557L687J3170J4868j2575k5348j1001P39K96o04J9459J2811K062j5237p076
9515C808O324j1736k8279j8510K609l870J3852r327N760K6434J9363j817k656
9502A955M767J1423J1300P613j8987m101J1936l8763j3912K0607K4563J087r706
9489I782j5988j5130R218K2704L602n920mJ3076J3440j4660N974J5067j1329Q162
9475C7994j4772j3325o13k251O038J3786l101q947Q98L879j2533o15j7222l625
$$ plain form
9461 -14409 -16307 -23607 -33374 -12035 -11527 3349 19428 15680 16124 8362 13038 23664 22670 3288
9447 3288 -1077 -984 -7755 10842 25399 34047 28347 14840 -1376 -15578 -10465 -4860 -18500 -17907
9433 -17907 -7296 -6880 10726 10910 11739 7139 3388 -8983 -15744 -7541 3644 -1125 -12569 7238
9419 7238 24751 37917 21823 12235 29425 36698 22615 -2382 -19364 -16799 -9630 21748 28030
9406 28030 5693 924 8192 -1164 -27677 -39047 -25304 -7050 -7490 -3585 -16310 -17083 1115
9393 1115 19674 35442 30587 41970 28082 25018 36674 72113 90021 92270 115772 124781 142923
9380 142923 178807 229482 260701 300286 366955 445536 511845 591940 705506 782722 832153
9369 832153 855605 850020 851131 803273 731254 656959 565243 471965 378132 305413 266543 214885
$$ packed form
9461a4409j898p300r767K1339N08J4876J6079l748M44p762M676J0626r94j9382
9447C288m365R3o771J8597J4557Q648n700j3507j6216j4202N113N605j3640N93
9433a7907J0611M16J7606J84Q29m600l751j2371o761Q203J1185m769j1444J9807
9419G238J7513J3166j6094r588J7190P273j4083k4997j6982K565P169L1378O282
9406B8030k2337m769P268r356k6513j1370J3743J8254m40L905j2725p73J8198
9393A115J8559J5768m855J1383j3888l064J1656L5439J7908K249K3502R009J8142
9380A42923L5884N0675L1219L9585O6669P8581O6309Q0095J13566P7216M9431
9369H32153K3452n585J111m7858p2019p4295r1716r3278r3833p2719l8870n1658
$$ plain form
9357 214885 148773 119144 115726 95809 79821 78243 103958 102773 84742 48807 30481 4877
9345 4877 6154 34324 21739 9943 5594 7359 20237 10535 -3960 13258 15584 10078 39681
9332 39681 48133 27288 -5366 -6893 22466 29339 25745 27027 37477 31569 32990 22608 13144
9319 13144 32444 53229 58013 37652 15975 5495 5247 -3556 -2024 16925 28449 17290 16079
9306 16079 6538 2000 38216 68532 73415 67467 68298 49336 30132 16134 30140 34233 37721
9293 37721 37987 33813 8533 14582 20540 45106 65128 57544 38374 26876 22929 29013 54370
9280 54370 96349 96743 93530 69781 39388 16081 -2335 -1620 11334 -4292 -5595 20864 27826
9267 27826 11880 6683 10101 25669 24580 25698 40366 37145 43775 12502 -4918 -16544 3406
$$ packed form
9357B14885o6112k9629l418j9917j5988j578K5715j185j8031l5935j8326k5604
9345D877J277K8170j2585j1796m349J765J2878r702j4495J7218K326n506K9603
9332C9681Q452k0845l2654j527K9359O873l594J282J0450n908J421j0382r464
9319A3144J9300K0785M784k0361k1677j0480k48q803J532J8949J1524j1159j211
9306A6079r541m538L6216L0316M883n948Q31j8962j9204j3998J4006M093L488
9293C7721K66m174k5280O049N958K4566K0022p584j9170j1498l947O084K5357
9280E4370M1979L94l213k3749l0393k3307j8416P15J2954j5626j303K6459O962
9267B7826j5946n197L418J5568j089J118J4668l221O630l1273j7420j1626J9950
$$ plain form
9254 3406 26990 -1461 -19518 -24100 -11107 8862 11626 19072 25639 29748 20661 20144 12155 7214
9240 7214 17261 28902 32203 36358 36040 42645 48255 65770 80731 64487 44149 41595 58546
9227 58546 93110 125008 139026 125852 132230 154727 134237 98942 75407 65142 35617 16631
9215 16631 15348 4962 -4117 6181 12256 -992 4025 11835 38095 48653 44757 51792 39817
9202 39817 25142 12753 -5636 681 15453 4888 -14574 -16689 1587 32214 47143 50468
9190 50468 38303 24874 21474 39027 31904 18717 44533 60818 57143 42876 7512 -11508
9178 -11508 1820 10324 8709 17165 52483 49526 28123 26836 35177 38881 41052 40772 40620 45700
9164 45700 61052 35059 29061 44343 74735 90861 122488 127614 125633 126236 146140 152107 142450
$$ packed form
9254C406K3584k8451j8057m582J2993J9969K764P446O567M109r087n17p989m941
9240G214J0047J1641L301M155l18O605N610J7515J4961j6244k0338k554J6951
9227E8546L4564L1898J4018j3174O378K2497k0490l5295k3535j0265k9525j8986
9215A6631j283j0386r079J0298O075j3248N017P810K6260J0558l896P035j1975
9202C9817j4675j2389j8389O317J4772j0565j9462k115J8276L0627J4929L325
9190E0468j2165j3429l400J7553p123j3187K5816J6285l675j4267l5364j9020
9178a1508J3328Q504j615Q456L5318k957k1403j287Q341L704K171k80j52N080
9164D5700J5352k5993n998J5282L0392J6126L1627N126j981O03J9904N967r657
$$ plain form
9151 142450 111794 100691 108910 124401 144338 146230 165456 176758 201520 243953 288034 325072
9139 325072 369952 386289 418060 481772 554517 631857 714357 820189 927398 1069194 1213251
9128 1213251 1404913 1612333 1884935 2284228 2787081 3426550 4160716 4872261 5334086 5289418
9118 5289418 4747115 3957564 3146338 2491162 1990618 1605087 1319762 1089509 910086 776701
9108 776701 666306 604111 562557 505855 458119 412838 371337 341551 326614 287212 295753 352091
9096 352091 373311 391984 403942 381883 363479 356710 329766 311088 305427 298382 287736 288607 272347
9083 272347 261863 247688 241767 218208 214098 216439 225980 193283 187902 217921 231048 219624 217220
9070 217220 206111 202807 228584 253813 274986 279724 275536 276015 290159 269160 242928 236596 235543
$$ packed form
9151A42450l0656j1103Q219J5491J9937J892J9226J1302K4762M2433M4081L7038
9139C25072M4880J6337L1771O3712P2745P7340Q2500J05832J07209J41796J44057
9128A213251J91662K07420K72602L99293N02853O39469P34166P11545M61825m4668
9118E289418n42303p89551q11226o55176n00544l85531k85325k30253j79423j33385
9108G76701j10395o2195m1554n6702m7736m5281m1501k9786j4937l9402Q541N6338
9096C52091K1220J8673J1958k2059j8404o769k6944j8678n661p045j0646Q71j6260
9083B72347j0484j4175n921k3559m110K341R541l2697n381L0019J3127j1424k404
9070B17220j1109l304K5777K5229K1173M738m188M79J4144k0999k6232o332j053
$$ plain form
9057 235543 246295 245200 267907 275584 295249 302876 309934 319357 324233 336629 365763 380346 362866
9044 362866 336469 349688 391351 424009 455355 488299 533205 602021 645352 705350 738487 754187
9032 754187 756944 753278 724445 702712 701391 713249 743434 789773 791434 802058 830481 846892
9020 846892 859285 901250 967332 999831 1040567 1088115 1116471 1171642 1244891 1317046 1418708
9009 1418708 1525707 1627667 1746163 1855036 1968174 2097693 2241508 2388261 2545008 2731499
8999 2731499 2938426 3186571 3483457 3873887 4343808 4885566 5525124 6300582 7233995 8379999
8989 8379999 9793000 11485203 13462455 15735310 18295549 21104720 24148392 27400809
8981 27400809 30890867 34955640 40253215 47341453 56653063 68931406 85655702 109845254
$$ packed form
9057B35543J0752j095K2707P677J9665P627P058R423M876J2396K9134J4583j7480
9044C62866k6397J3219M1663L2658L1346L2944M4906O8816M3331N9998L3137J5700
9032G54187K757l666k8833k1733j321J1858L0185M6339J661J0624K8423J6411
9020H46892J2393M1965O6082L2499M0736M7548K8356N5171P3249P2155J01662
9009A418708J06999J01960J18496J08873J13138J29519J43815J46753J56747J86491
8999B731499K06927K48145K96886L90430M69921N41758O39558P75458R33413J146004
8989H379999J413001J692203J977252K272855K560239K809171L043672L252417
8981B7400809L490058M064773N297575P088238R311610J2278343J6724296K4189552
$$ plain form
8973 109845254 145332661 192749714 244030736 275355351 256893405 203771828 149073768
8966 149073768 106980525 78143975 58997456 46211406 37428467 31237140 26722904
8959 26722904 23312847 20697738 18605495 16707610 14759311 12885425 11205511 9781871
8951 9781871 8645418 7742735 6991686 6348852 5810060 5355481 4982649 4638218 4324008
8942 4324008 4026635 3755573 3522236 3291861 3097573 2905728 2742979 2595815 2460287 2339191
8932 2339191 2226913 2109062 2034752 1955119 1847832 1776539 1684427 1614903 1564369 1489958 1437595
8921 1437595 1431507 1431483 1383818 1317358 1280711 1226346 1177714 1154616 1148033 1121579 1071628 1037334
8909 1037334 1002978 959345 911836 910066 909979 899186 902698 874287 843203 820884 828612 830362 821123
$$ packed form
8973A09845254L5487407M7417053N1281022L1324615j8461946n3121577n4698060
8966A49073768m2093243k8836550j9146519j2786050q782939o191327m514236
8959B6722904l410057k615109k092243j897885j948299j873886j679914j423640
8951I781871j136453r02683p51049o42834n38792m54579l72832l44431l14210
8942D324008k97373k71062k33337k30375j94288j91845j62749j47164j35528j21096
8932B339191j12278j17851p4310p9633j07287p1293r2112o9524n0534p4411n2363
8921A437595o088k4m7665o6460l6647n4365m8632k3098o583k6454m9951l4294
8909A037334l4356m3633m7509j770q7j0793L512k8411l1084k2319P728J750r239
$$ plain form
8896 821123 812638 765443 721196 683527 663458 650992 645016 649323 655249 652364 640386 617541 603433
8883 603433 593337 591729 581436 549477 515829 492928 486669 492339 496811 475856 444010 434655 442884
8870 442884 451423 451046 465073 474677 465915 434620 453896 468563 435191 394636 361028 348674 352840
8857 352840 336248 329840 329868 312455 298345 298460 309324 310314 289980 243873 219253 210904 214403 272913
8843 272913 345309 394959 403086 412847 398351 374656 336100 322780 305002 275314 264896 259093
8831 259093 268793 287322 278317 260867 271046 314401 303437 275120 253098 258610 276910 276265 279850
8818 279850 274876 291062 278860 245784 252529 240637 225402 218416 201799 231947 231021 201747 175000
8805 175000 183174 190697 196634 207403 207951 186458 200230 217702 199806 177808 175494 161253 160828
$$ packed form
8896H21123q485m7195m4247l7669k0069j2466n976M307N926k885j1978k2845j4108
8883F03433j0096j608j0293l1959l3648k2901o259N670M472k0955l1846r355Q229
8870D42884Q539l77J4027R604q762l1295J9276J4667l3372m0555l3608j2354M166
8857C52840j6592o408K8j7413j4110J15J0864R90k0334m6107k4620q349L499N8510
8843B72913P2396M9650Q127R761j4496k3695l8556j3320j7778k9688j0418n803
8831B59093R700J8529r005j7450J0179M3355j0964k8317k2022N512J8300o45L585
8818B79850m974J6186j2202l3076O745j1892j5235o986j6617L0148r26k9274k6747
8805A75000Q174P523N937J0769N48k1493J3772J7472j7896k1998k314j4241m25
$$ plain form
8792 160828 156365 149583 165814 190699 182298 168063 171405 165310 147151 132249 136360 149591 182232
8779 182232 204659 199779 206091 226885 223404 215030 207339 195355 200963 218389 229012 223670 205083
8766 205083 194039 196375 182317 164948 172499 187603 195873 173848 161246 154971 157810 163042 164577
8753 164577 172206 173748 156021 121221 130027 134339 109836 139722 166033 186344 165457 162526 160057
8740 160057 150829 156486 167701 185227 192840 193268 180386 182316 179778 201021 213797 190721 179211
8727 179211 162338 156557 162792 155383 151141 140429 125341 112912 103643 112493 153270 188653 170257
8714 170257 159177 164163 179966 189212 184926 172382 157602 159028 178625 199915 226144 233196 227517
8701 227517 198280 173229 158400 147337 130154 138852 135382 125759 107719 94742 97451 118929
$$ packed form
8792A60828m463o782J6231K4885q401j4235L342o095j8159j4902M111J3231L2641
8779A82232K2427m880O312K0794l481q374p691j1984N608J7426J0623n342j8587
8766B05083j1044K336j4058j7369P551J5104Q270k2025j2602o275K839N232J535
8753A64577P629J542j7727l4800Q806M312k4503K9886K6311K0311k0887k931k469
8740A60057r228N657J1215J7526P613M28j2882J930k538K1243J2776k3076j1510
8727A79211j6873n781O235p409m242j0712j5088j2429r269Q850M0777L5383j8396
8714A70257j1080M986J5803R246m286j2544j4780J426J9597K1290K6229P052n679
8701B27517k9237k5051j4829j1063j7183Q698l470r623j8040j2977K709K1478
$$ plain form
8689 118929 150002 146799 126414 123228 113382 109792 101169 94913 77391 62280 83404 104857 114882
8676 114882 140468 134596 152762 163694 152204 155482 133935 122342 120392 112218 118020 116518 110379
8663 110379 91940 93664 125109 173247 257160 320517 310600 244693 197082 164003 147468 127839
8651 127839 129145 140698 137446 129858 117334 116464 88234 82059 97337 124253 122570 130922 122338
8638 122338 113981 114110 113097 107273 98860 96791 85697 75859 95699 121019 135962 130282 124672 130098
8624 130098 135079 157196 159301 162170 174717 187363 185670 204844 211147 224855 250442 297181 295036
8611 295036 278205 248902 214568 206225 195656 164045 163032 175166 146517 131397 148564 151900
8599 151900 124692 132087 113146 120659 135635 139151 135451 130809 126891 124766 133677 122385 114071
$$ packed form
8689A18929L1073l203k0385l186r846l590q623o256j7522j5111K1124K1453J0025
8676A14882K5586n872J8166J0932j1490L278k1547j1593j950q174N802j502o139
8663A10379j8439J724L1445M8138Q3913O3357r917o5907m7611l3079j6535j9629
8651A27839J306J1553l252p588j2524q70k8230o175J5278K6916j683Q352q584
8638A22338q357J29j013n824q413k069j1094r838J9840K5320J4943n680n610N426
8624A30098M981K2117K105K869J2547J2646j693J9174O303J3708K5587M6739k145
8611B95036j6831k9303l4334q343j0569l1611j013J2134k8649j5120J7167L336
8599A51900k7208P395j8941P513J4976L516l700m642l918k125Q911j1292q314
$$ plain form
8586 114071 122242 138394 166619 171460 180450 211192 226373 258454 303957 318885 319850 361757 418947
8573 418947 493512 588735 665823 747242 819036 882821 939309 962577 941836 884679 814989 724231
8561 724231 621136 514990 435460 382013 336573 267155 213529 178956 157301 161823 150707
8550 150707 143118 131775 112245 115220 112037 125645 120239 94984 100407 73512 58930 65399 80089
8537 80089 92415 111748 105467 95456 89827 72120 74526 91503 108078 115769 107357 74602 65610
8524 65610 69180 83093 89628 105530 109116 105819 98576 82400 83112 79155 73781 68938 62819 45336
8510 45336 43368 39698 29175 36836 57784 79302 79326 94120 94154 70077 52808 32419 32843 50776
8496 50776 53814 58085 50713 41823 47378 66053 102102 107021 85591 81423 75874 71465 70808 81580
$$ packed form
8586A14071Q171J6152K8225M841Q990L0742J5181L2081M5503J4928R65M1907N7190
8573D18947P4565R5223P7088Q1419P1794O3785N6488K3268k0741n7157o9690r0758
8561G24231j03095j06146p9530n3447m5440o9418n3626l4573k1655M522j1116
8550A50707p589j1343j9530K975l183J3608n406k5255N423k6895j4582O469J4690
8537H0089J2326J9333o281j0011n629j7707K406J6977J6575P691q412l2755q992
8524F5610L570J3913O535J5902L586l297p243j6176P12l957n374m843o119j7483
8510D5336j968l670j0523P661K0948K1518K4J4794L4k4077j7269k0389M24J7933
8496E0776L038M271p372q890N555J8675L6049M919k1430m168n549m409o57J0772
$$ plain form
8482 81580 72402 69628 61681 63863 74181 55031 54354 63113 61406 79090 78896 50270 45945 65100
8468 65100 45217 46863 55728 35583 41374 37095 33612 41321 31183 30284 31308 25815 19765 31495
8454 31495 45748 49587 74436 80102 52465 29665 18916 23521 35727 51972 36077 33046 60682
8441 60682 74480 51565 37350 34946 24535 23561 29943 35984 21324 32791 33114 38316 48870
8428 48870 55360 38879 43096 47230 41196 52536 51073 47846 63861 61469 35538 31013 32013 44180
8414 44180 34174 27532 20333 26528 27194 37086 41260 46455 49035 48658 59422 73901 72535 54040
8400 54040 55196 48488 21803 33750 32652 30186 29917 36724 46897 43002 39271 51492 45336 37209
8386 37209 37137 49079 64657 61437 63040 53705 35745 52686 50539 53580 44989 35695 53702 50087
$$ packed form
8482H1580r178k774p947K182J0318j9150o77Q759j707J7684j94k8626m325J9155
8468F5100j9883J646Q865k0145N791m279l483P709j0138q99J024n493o050J1730
8454C1495J4253L839K4849N666k7637k2800j0749M605J2206J6245j5895l031K7636
8441F0682J3798k2915j4215k404j0411r74O382O041j4660J1467L23N202J0554
8428D8870O490j6481M217M134o034J1340j463l227J6015k392k5931m525J000J2167
8414D4180j0006o642p199O195O66R892M174N195K580l77J0764J4479j366j8495
8400E4040J156o708k6685J1947j098k466k69O807J0173l895l731J2221o156q127
8386C7209p2J1942J5578l220J603r335j7960J6941k147L041q591r294J8007l615
$$ plain form
8372 50087 33584 32621 14659 34974 47696 37758 46114 45604 33384 32605 19390 22391 14544 -4506
8358 -4506 8386 24323 1015 10302 20047 40641 46752 41930 29942 38153 41331 59045 63959
8345 63959 74746 85355 74768 52700 57099 79874 67515 33690 16877 20467 14607 21348 24700
8332 24700 17464 15713 35428 40166 34645 39186 40636 26079 33545 43636 51441 52898 45626 57345
8318 57345 62217 71997 51464 47421 65883 87300 86356 72780 65868 64923 50597 32385 26014 24759
8304 24759 48392 45523 30489 28404 47546 52171 41878 27660 19907 26414 32637 22285 -3772
8291 -3772 10 16922 19392 23695 49200 40289 25371 8207 26816 52757 66845 61830 52994
8278 52994 38865 30401 19837 29650 43058 47008 38078 15594 10257 24753 18213 11839 23564
$$ packed form
8372E0087j6503r63j7962K0315J2722r938Q356n10j2220p79j3215L001p847j9050
8358d506J2892J5937k3308R287R745K0594O111m822j1988Q211L178J7714M914
8345F3959J0787J0609j0587k2068M399K2775j2359l3825j6813L590n860O741L352
8332B4700p236j751J9715M738n521M541J450j4557P466J0091P805J457p272J1719
8318E7345M872R780k0533m043J8462K1417r44j3576o912r45j4326j8212o371j255
8304B4759K3633k869j5034k085J9142M625j0293j4218p753O507O223j0352k6057
8291c772L782J6912K470M303K5505q911j4918j7164J8609K5941J4088n015q836
8278E2994j4129q464j0564R813J3408L950q930k2484n337J4496o540o374J1725
$$ plain form
8265 23564 36629 47644 55192 51856 34842 29080 28550 32057 20219 2511 20090 37201 29925
8252 29925 15345 27141 26731 14916 16849 34193 42230 39331 29607 22187 16077 -7489 -2063 9505
8238 9505 16000 17917 16554 7784 -3032 -18260 -9204 -392 7693 13691 10890 13625 21708 21820 25477
8223 25477 14334 20911 11360 -1638 23572 63397 42486 29729 28434 26275 37135 39761 22914
8210 22914 31998 14790 16469 3458 3896 15723 38027 31992 27930 24665 22889 14931 23118 8901
8196 8901 6284 14981 16291 19915 3707 14124 9137 -4439 -4927 11159 23365 32656 38373 16541
8182 16541 13504 40464 40651 20212 7840 6102 -5365 -110 3765 -4654 6029 -4273 -2339
8169 -2339 -19390 -25672 -14448 -268 14764 4734 2197 -664 -9925 16270 31485 45587 50854
$$ packed form
8265B3564J3065J1015P548l336j7014n762n30L507j1838j7708J7579J7111p276
8252B9925j4580J1796m10j1815J933J7344Q037k899r724p420o110k3566N426J1568
8238I505O495J917j363q770j0816j5228R056Q812Q085N998k801K735Q083J12L657
8223B5477j1143O577r551j2998K5210L9825k0911j2757j295k159J0860K626j6847
8210B2914R084j7208J679j3011M38J1827K2304o035m062l265j776p958Q187j4217
8196H901k617Q697J310L624j6208J0417m987j3576m88J6086J2206R291N717k1832
8182A6541l037K6960J87k0439j2372j738j1467N255L875q419J0683j0302J934
8169b339j7051o282J1224J4180J5032j0030k537k861r261K6195J5215J4102N267
$$ plain form
8156 50854 58797 64942 33989 12240 23173 25088 10493 4367 1613 -6048 -12122 -13130 -5635 16941
8142 16941 20872 23331 20038 22947 7633 2896 18641 27414 34753 39837 18620 22022 1654 -18999
8128 -18999 -22514 -5133 11477 20336 16886 25888 32776 19830 29749 55507 51722 48647 43859 55916
8114 55916 47654 59780 65633 62826 28824 4223 1537 10332 17272 22308 45005 56074 53551
8101 53551 39610 23982 22756 20533 7537 24377 49912 45056 51729 45630 38636 28837 18565
8088 18565 11051 -5747 1642 22331 693 10096 23180 30501 32891 25170 34135 34780 33138 34532
8074 34532 33089 28963 36885 38293 27102 37955 47397 20080 29660 30655 27749 10592 2368 7657
8060 7657 5075 -4505 3512 8215 15852 25211 31378 25203 17799 20504 59524 73721 68353 92803
$$ packed form
8156E0854P943O145l0953k1749J0933J915j4595o126k754p661o074j008P495K2576
8142A6941L931K459l293K909j5314m737J5745Q773P339N084k1217L402k0368k0653
8128a8999l515J7381J6610Q859l450R002O888j2946R919K5758l785l075m788J2057
8114E5916q262J2126N853k807l4002k4601k686Q795O940N036K2697J1069k523
8101E3551j3941j5628j226k223j2996J6840K5535m856O673o099o994r799j0272
8088A8565p514j6798P389K0689k1638R403J3084P321K390p721Q965O45j642J394
8074C4532j443m126P922J408j1191J0853R442k7317R580R95k906j7157q224N289
8060G657k582r580Q017M703P637R359O167o175p404K705L9020J4197n368K4450
$$ plain form
8046 92803 93377 80878 78431 75185 81096 99040 84617 67519 51625 40561 33265 14713 30291
8033 30291 51329 55458 53162 57431 48795 56144 51516 38858 43005 62568 64527 69124 43839 34642
8019 34642 35479 62051 57493 32648 11367 24462 33229 42410 39904 14275 16729 11095 13366 52334
8005 52334 76047 88141 95657 109190 90538 81264 79645 54166 61816 38921 34746 48061 63807
7992 63807 82651 102109 81084 45508 34135 28199 21747 20147 1115 -2163 2383 9579 35750
7979 35750 42455 30247 31494 36690 51784 61338 65894 64897 51082 66071 57430 36700 48450
7966 48450 49965 61206 69754 61351 64645 84638 85919 89605 83917 83821 61622 32906 27186 28343
7952 28343 43055 52489 51144 48121 50534 36454 33221 51073 45634 45654 37622 16719 13288 16281
$$ packed form
8046I2803N74j2499k447l246N911J7944j4423j7098j5894j1064p296j8552J5578
8033C0291K1038M129k296M269q636P349m628j2658M147J9563J959M597k5285r197
8019C4642Q37K6572m558k4845k1281J3095Q767R181k506k5629K454n634K271L8968
8005E2334K3713J2094P516J3533j8652r274j619k5479P650k2895m175J3315J5746
7992F3807J8844J9458k1025l5576j1373n936o452j600j9032l278M546P196K6171
7979C5750O705j2208J247N196J5094R554M556r97j3815J4989q641k0730J1750
7966D8450J515J1241Q548q403L294J9993J281L686n688r6k2199k8716n720J157
7952B8343J4712R434j345l023K413j4080l233J7852n439K0q032k0903l431K993
$$ plain form
7938 16281 21845 21585 25022 32434 39182 36310 31928 48113 46566 23196 23822 30196 32629 36507 53589
7923 53589 51539 34745 47392 62630 49486 24364 -2440 25622 21987 30845 27605 15689 -6396
7910 -6396 -11543 11377 20415 30261 54096 59105 32602 18022 24672 25912 39990 37840 6908
7897 6908 -4827 11625 23949 23181 3224 -4987 26408 44633 39068 43090 40054 45758 48222 24204
7883 24204 22147 49793 62416 68253 42572 27389 8036 12302 17720 17761 4131 21508 44266
7870 44266 46591 47063 28975 32592 32450 4997 -17243 -34453 -25726 -5394 4382 31 16487 5203
7856 5203 2362 9267 21268 6452 4474 22315 20506 16534 11951 11665 -2698 -24390 -6772 13820
7842 13820 -4149 -18195 -942 27338 -5566 -16627 -25391 -31729 -41193 -34779 -30293 -5785 15163
$$ packed form
7938A6281N564k60L437P412O748k872m382J6185j547k3370O26O374K433L878J7082
7923E3589k050j6794J2647J5238j3144k5122k6804K8062l635Q858l240j1916k2085
7910f396n147K2920R038R846K3835N009k6503j4580O650J240J4078k150l0932
7897F908j1735J6452J2324p68j9957q211L1395J8225n565M022l036N704K464k4018
7883B4204k057K7646J2623N837k5681j5183j9353M266N418M1j3630J7377K2758
7870D4266K325M72j8088L617j42k7453k2240j7210Q727K0332R776m351J6456j1284
7856E203k841O905J2001j4816j978J7841j809l972m583k86j4363k1692J7618K0592
7842A3820j7969j4046J7253K8280l2904j1061q764o338r464O414M486K4508K0948
$$ plain form
7829 15163 21458 23117 7696 3482 2800 4555 -3084 18146 36013 39555 36816 37088 15838 15491
7815 15491 17287 -7354 -10789 -19028 -34313 -9737 13766 15728 9693 3931 12572 2123 2924 -1649
7801 -1649 -4975 10201 18800 13610 14033 49026 52307 19593 15198 23934 11304 17698 34484 32918
7787 32918 24999 21766 5888 9018 347 3002 16062 24882 8566 9156 25065 21035 18755 8606
7773 8606 28522 48970 34466 11780 18784 17564 30836 31060 23010 16080 15471 -8238 3036 31857
7759 31857 28224 38150 27112 22330 28780 22771 34536 56987 67808 55550 14081 -12005 -22635
7746 -22635 -14863 -13746 -8146 -4483 -17060 -8548 10362 24534 17270 17192 21177 32218 32058 14141
7732 14141 24765 30263 5135 857 -7435 -18667 -10332 -17254 -3499 1552 14458 35533 33935
$$ packed form
7829A5163O295J659j5421m214o82J755p639K1230J7867L542k739K72k1250l47
7815A5491J796k4641l435q239j5285K4576K3503J962o035n762Q641j0449Q01m573
7801a649l326J5176Q599n190M23L4993L281l2714m395Q736j2630O394J6786j566
7787C2918p919l233j5878L130q671K655J3060Q820j6316N90J5909m030k280j0149
7773H606J9916K0448j4504k2686P004j220J3272K24q050o930o09k3709J1274K8821
7759C1857l633R926j1038m782O450o009J1765K2451J0821j2258m1469k6086j0630
7746b2635P772J117N600L663j2577Q512J8910J4172p264p8L985J1041j60j7917
7732A4141J0624N498k5128m278q292j1232Q335o922J3755N051J2906K1075j598
$$ plain form
7719 33935 20345 -9143 -3313 30298 15745 6619 -15810 -39859 -15170 -8459 -12265 -22563 -17868
7706 -17868 20051 24625 20260 43813 38809 35185 23543 32445 33008 32104 4705 1087 13286 16857
7692 16857 27823 12665 -6605 -18202 -23012 -34679 -24650 -28028 -13545 5927 7013 13222 14748
7679 14748 10145 7778 -13612 -26194 -19987 -37487 -38062 -12895 7985 4968 -2440 13392 6270
7666 6270 16621 10206 -4646 4541 -456 -36088 -31975 -5832 -23083 -36429 -23389 -3668 6614
7653 6614 24890 14165 12588 24288 38488 36741 12861 8957 13323 9217 6347 19316 32803
7640 32803 29463 -4631 -31111 -27170 12765 32630 19632 8754 -4693 -13434 -10275 -12508 3764
7627 3764 -5253 -8192 15335 13121 -99 -3213 -21420 -6809 -18114 -2611 16993 16246 -1949
$$ packed form
7719C3935j3590k9488N830L3611j4553r126k2429k4049K4689O711l806j0298M695
7706a7868L7919M574m365K3553n004l624j1642Q902N63r04k7399l618J2199L571
7692A6857J0966j5158j9270j1597m810j1667J0029l378J4483J9472J086O209J526
7679A4748m603k367k1390j2582O207j7500n75K5167K0880l017p408J5832p122
7666F270J0351o415j4852R187m997l5632M113K6143j7251j3346J3040J9721J0282
7653F614J8276j0725j577J1700J4200j747k3880l904M366m106k870J2969J3487
7640C2803l340l4094k6480L941L9935J9865j2998j0878j3447q741L159k233J6272
7627C764r017k939K3527k214j3220l114j8207J4611j1305J5503J9604p47j8195
$$ plain form
7614 -1949 19 1579 -24721 -20763 360 -265 8077 33226 24942 20909 27191 13176 5666 -10292
7600 -10292 -20332 5226 16025 12484 -5288 -13234 -16549 -21617 -25202 -23591 -35398 -33905 -8218
7587 -8218 7485 6201 -3457 -24493 -19330 -5689 1670 12178 21778 14474 7705 21548 20663 18597
7573 18597 17775 28125 29734 13226 33606 18950 1856 -7335 -7526 9474 5887 946 -2567 329
7559 329 721 5204 -14936 -33541 -19089 -14126 -17642 -13870 10728 29238 35054 32330 26574 23655
7545 23655 31680 41516 33238 48166 47538 35285 30073 30565 34037 40655 45269 27596 11591 6969
7531 6969 -823 -14049 -15000 -14331 2412 13265 6708 12457 5762 -452 2129 -16035 -18239 13988
7517 13988 16470 17371 1068 -3196 -5199 13834 26532 17075 4509 -14381 -24749 -6705 22524
$$ packed form
7614a949J968J560k6300L958K1123o25Q342K5149q284m033O282j4015p510j5958
7600a0292j0040K5558J0799l541j7772p946l315n068l585J611j1807J493K5687
7587h218J5703j284r658k1036N163J3641P359J0508R600p304o769J3843q85k066
7573A8597q22J0350J609j6508K0380j4656j7094r191j91J7000l587m941l513K896
7559C29L92M483k0140j8605J4452M963l516L772K4598J8510N816k724n756k919
7545B3655Q025R836q278J4928o28j2253n212M92L472O618M614j7673j6005m622
7531F969p792j3226r51O69J6743J0853o557N749o695o214K581j8164k204L2227
7517A3988K482R01j6303m264k003J9033J2698r457j2566j8890j0368J8044K9229
$$ plain form
7504 22524 26396 -3543 -12788 -12174 -3200 4472 10329 30398 36939 9851 -7427 -6598 -32515 -48581
7490 -48581 -38945 -6020 15916 12289 14102 18729 4766 -282 -2100 4313 20455 25828 15547
7477 15547 6668 10773 -15051 -17511 -4124 -11628 -8279 -6884 7705 15079 15196 8354 9213 15707
7463 15707 14068 21486 17591 15016 27581 27646 21100 22997 37498 264 -15236 -8478 7695 18927
7449 18927 27863 46902 38496 16363 23804 27497 25043 2486 -10541 -12054 2077 -12129 -23562
7436 -23562 -16048 1894 806 15064 22767 10122 -3002 10987 34775 32489 11461 -5429 -2883
7423 -2883 -1544 4602 12764 17030 5263 -2287 -16556 -9551 -9750 -4430 22181 31523 12761 -6059
7409 -6059 -2442 -1278 -10674 -12703 -12056 -14479 1344 3902 9295 7961 -3745 -15863 -16845 -14285 -14932
$$ packed form
7504B2524L872k9939r245O14Q974P672N857K0069O541k7088j7278Q29k5917j6066
7490d8581R636L2925K1936l627J813M627j3963n048j818O413J6142N373j0281
7477A5547q879M105k5824k460J3387p504L349J395J4589P374J17o842Q59O494
7463A5707j639P418l895k575J2565O5o546J897J4501l7234j5500O758J6173J1232
7449A8927Q936J9039q406k2133P441L693k454k2557j3027j513J4131j4206j1433
7436b3562P514J7942j088J4258P703j2645j3124J3989K3788k286k1028j6890K546
7423b883J339O146Q162M266j1767p550j4269P005j99N320K6611R342j8762j8820
7409f059L617J164r396k029O47k423J5823K558N393j334j1706j2118r82K560o47
$$ plain form
7394 -14932 -11512 -8341 -8589 9502 24142 26777 22346 19663 16582 29663 11027 -3233 -16191
7381 -16191 -21319 10032 29133 12507 -9913 -5459 -3864 -8396 -15795 -5861 -6847 -15524 -11334 -1180
7367 -1180 -2571 -11985 -3989 391 2021 -12280 -23185 -19020 -25831 -15142 -10767 -21222 -17613 -22052
7353 -22052 -35759 -35793 -34939 -21667 -24563 -1364 -6186 -26910 -35111 -30781 -18860 10855 14183 7594
7339 7594 -775 4911 11050 1675 4397 989 -8321 9230 11633 -7215 -5493 -3522 -3013 -8826 -12665
7324 -12665 -4438 13326 -881 15714 47307 58366 29289 19747 24363 1722 -12315 -10715 -2678
7311 -2678 4918 16934 26516 18522 37383 43227 30083 15009 7273 10704 11993 10792 3993 14303
7297 14303 10867 -7442 -30780 -13861 -8484 2350 13469 10346 5205 3651 5860 5594 9751 989
$$ packed form
7394a4932L420L171k48J8091J4640K635m431k683l081J3081j8636j4260j2958
7381a6191n128L1351J9101j6626k2420M454J595m532p399R934r86q677M190J0154
7367a180j391r414P996M380J630j4301j0905M165o811J0689M375j0455L609m439
7353b2052j3707l4Q54J3272k896K3199m822k0724q201M330J1921K9715L328o589
7339G594q369N686O139r375K722l408r310J7551K403j8848J722J971N09n813l839
7324a2665Q227J7764j4207J6595L1593J1059k9077r542M616k2641j4037J600Q037
7311b678P596J2016R582p994J8861N844j3144j5074p736L431J289j201o799J0310
7297A4303l436j8309k3338J6919N377J0834J1119l123n141j554K209k66M157q762
$$ plain form
7283 989 -15893 4991 23951 26430 19047 21791 20567 33778 41209 41388 29198 -1339 -8208 -22242
7269 -22242 -26886 -12334 9150 27418 30212 21236 -7274 -19395 -17980 -22214 -29978 -26047 -13241
7256 -13241 -4059 -4700 10104 5435 15641 3031 4745 723 2944 -3471 -6703 -1601 1706 8776
7242 8776 6206 6471 5917 2384 -10782 -393 -1923 -19935 -21957 -2075 -2751 -4372 -3493 4946 16989
7227 16989 8561 -9663 -9981 12464 10275 23168 21621 35851 27557 29093 49012 46337 6244
7214 6244 -22222 -1607 7957 -4650 -26385 -23215 -5834 15787 4237 -12280 -35484 -27984 -8190
7201 -8190 4580 23272 37939 4195 -15207 -30459 -19304 -14055 -4571 4629 11593 555 -5056
7188 -5056 1960 22928 15995 -8960 -16085 -2753 10227 4442 27389 37220 31448 11064 1236
$$ packed form
7283I89j6882K0884J8960K479p383K744j224J3211P431J79j2190l0537o869j4034
7269b2242m644J4552K1484J8268K794q976k8510j2121J415m234p764L931J2806
7256a3241R182o41J4804m669J0206j2610J714m022K221o415l232N102L307P070
7242H776k570K65n54l533j3166J0389j530j8012k022J9882o76j621Q79Q439J2043
7227A6989q428j8224l18K2445k189J2893j547J4230q294J536J9919k675m0093
7214F244k8466K0615R564j2607k1735L170J7381K1621j1550j6517k3204P500J9794
7201h190J2770J8692J4667l3744j9402j5252J1155N249R484R200O964j1038n611
7188e056P016K0968o933k4955p125J3332J2980n785K2947R831n772k0384r828
$$ plain form
7175 1236 3778 27946 26064 18792 15004 17747 21975 14967 31941 46657 33297 14716 4312
7162 4312 2505 17927 14856 -7541 -21857 -40865 -33418 -10244 -20705 -28643 -25929 -1318 1252
7149 1252 -6477 5158 851 -8680 -27042 -19540 -1340 21441 24424 15490 5816 2511 4122 -3312
7135 -3312 -16198 -18814 -7191 -10197 -7834 -775 -6745 -3344 15317 -7789 -36744 -35847 -12865 18206
7121 18206 28922 30696 21630 1424 -7676 -2064 -1875 -1379 -17481 -31031 -12717 -4739 -5959 4052
7107 4052 3654 -1068 12018 21249 25938 34726 23668 14094 7871 6860 13461 25294 27294 29093
7093 29093 7259 1371 17481 24575 22378 17018 21254 46746 49331 46360 19423 -7239 463
7080 463 -6904 -24788 -42663 -44419 -29382 -18640 -41107 -43824 -20655 -5200 -15884 -26637 -8538
$$ packed form
7175A236K542K4168j882p272l788K743M228p008J6974J4716j3360j8581j0404
7162D312j807J5422l071k2397j4316j9008P447K3174j0461p938K714K4611K570
7149A252p729J1635m307r531j8362P502J8200K2781K983q934r674l305J611p434
7135c312j2886k616J1623l006K363P059n970L401J8661k3106k8955Q97K2982L1071
7121A8206J0716J774r066k0206r100N612J89M96j6102j3550J8314P978j220J0011
7107D052l98m722J3086R231M689Q788j1058r574o223j011O601J1833K000J799
7093B9093k1834n888J6110P094k197n360M236K5492K585k971k6937k6662P702
7080D63p367j7884j7875j756J5037J0742k2467k717K3169J5455j0684j0753J8099
$$ plain form
7067 -8538 3618 3870 -17430 -21118 -26139 -32848 -25407 -20091 -12392 -15570 -2937 11368 11474 -14238
7053 -14238 -20182 -9906 -1567 -7886 -5036 13945 11085 8491 -15284 -14869 5126 14457 14312 13032
7039 13032 20236 31630 53361 49811 26890 13770 4196 122 -17076 -32987 -31618 -18516 -10867
7026 -10867 -12279 -20522 -4142 -892 3856 13849 10522 -4092 -1868 -611 11743 9804 20151 -4466
7012 -4466 -21878 -10010 -11753 -25144 -35226 -33147 -5163 15209 5630 1031 2550 -878 13146
6999 13146 11348 17122 17577 1481 6308 25257 18986 572 -8277 1353 4125 -11050 6789 9734
6985 9734 4651 -16151 -18193 -12411 -12396 -5785 6821 5459 -2529 13834 -560 14988 18501 6639
6971 6639 8111 -7971 -11677 -28232 -7613 14612 1608 -18129 -20627 -28743 -36178 -18914 9260
$$ packed form
7067h538J2156K52k1300l688n021o709P441N316P699l178J2633J4305J06k5712
7053a4238n944J0276Q339o319K850J8981k860k594k3775M15J9995R331j45j280
7039A3032P204J1394K1731l550k2921j3120r574m074j7198j5911J369J3102P649
7026a0867j412q243J6380L250M748R993l327j4614K224J257J2354j939J0347k4617
7012d466j7412J1868j743j3391j0082K079K7984K0372r579m599J519l428J4024
6999A3146j798N774M55j6096M827J8949o271j8414q849R630K772j5175J7839K945
6985I734n083k0802k042N782J5O611J2606j362p988J6363j4394J5548L513j1862
6971F639J472j6082l706j6555K0619K2225j3004j9737k498q116p435J7264K8174
$$ plain form
6958 9260 19942 4246 13838 7293 4603 -9817 2692 2410 -12403 -21517 -12541 -16051 -21588 -1283
6944 -1283 9352 -3877 -4088 9155 7537 -7348 -20306 -47484 -44506 -28373 -19791 -7785 2717
6931 2717 -13460 -33751 -43366 -11284 -5902 -13268 -12593 -3289 -17809 -31262 -19670 -2436 15563
6918 15563 13889 -22637 -26434 -20237 -13806 -19793 -28217 -7889 -12522 -7557 8700 289 -12943 -3265
6904 -3265 12775 14491 -15678 -53636 -54223 -36821 -42228 -59484 -56763 -48362 -38696 -38489 -28071 -17173
6890 -17173 -5229 1261 -4554 -10311 -23496 -20177 -16578 3175 27363 5448 -31584 -12914 -2181
6877 -2181 12175 2283 -7733 -5584 -4205 -19692 -28045 -26070 -33694 -13737 5350 13495 -1499
6864 -1499 9385 -4140 -29700 -15166 294 9909 -437 -3870 2529 -3707 6621 23176 31313
$$ packed form
6958I260J0682j5696R592o545k690j4420J2509k82j4813r114Q976l510n537K0305
6944a283J0635j3229k11J3243j618j4885j2958k7178K978J6133Q582J2006J0502
6931B717j6177k0291r615L2082N382p366O75R304j4520j3453J1592J7234J7999
6918A5563j674l6526l797O197O431n987q424K0328m633M965J6257q411j3232R678
6904c265J6040J716l0169l7958n87J7402n407j7256K721Q401R666K07J0418J0898
6890a7173J1944O490n815n757j3185L319L599J9753K4188k1915l7032J8670J0733
6877b181J4356r892j0016K149J379j5487q353J975p624J9957J9087Q145j4994
6864a499J0884j3525k5560J4534J5460R615j0346l433O399o236J0328J6555Q137
$$ plain form
6851 31313 30214 37784 17131 -14016 -9216 18860 33207 37780 19508 -4556 -4859 -3883 -8871 -2865
6837 -2865 -6523 -16257 -17731 -394 17196 25207 1462 -2511 -6656 -17148 -25541 -12984 -466
6824 -466 13502 31982 33101 26830 22020 16865 11434 -6490 -9957 1861 23534 41245 30577
6811 30577 18454 14886 -10322 -33519 -25204 -5105 -38 -6041 10857 21503 -6228 -23757 -22747
6798 -22747 -38262 -41485 -35259 -35868 -24923 -14084 -4867 5938 16174 9600 -20818 -12606 -15774
6785 -15774 -15915 -24634 -41404 -25317 -11772 -11336 -24630 -9661 23595 13044 23302 24763 14338
6772 14338 5767 -3201 7803 -19593 -10264 9622 3486 9374 14403 20940 -5984 -29634 -5550
6759 -5550 -16204 -25423 -27109 -5106 -16785 3012 21230 9963 4176 -12160 -21421 -16598 -5144
$$ packed form
6851C1313j099P570k0653l1147M800K8076J4347M573j8272k4064l03R76m988O006
6837b865l658r734j474J7337J7590Q011k3745l973m145j0492q393J2557J2518
6824d66J3968J8480J119o271m810n155n431j7924l467J1818K1673J7711j0668
6811C0577j2123l568k5208k3197Q315K0099N067o003J6898J0646k7731j7529J010
6798b2747j5515l223O226o09J0945J0839R217J0805J0236o574l0418Q212l168
6785a5774j41q719j6770J6087J3545M36j3294J4969L3256j0551J0258J461j0425
6772A4338q571q968J1004k7396R329J9886o136N888N029O537k6924k3650K4084
6759e550j0654r219j686K2003j1679J9797J8218j1267n787j6336r261M823J1454
$$ plain form
6746 -5144 -1245 -9696 -8379 -9721 -5589 -78 -2362 -2140 14936 34611 39453 20222 4869 6015
6732 6015 474 -3393 5646 -16320 -27723 -19124 -9355 -12709 -25923 -37056 -40576 -31162 -24937 -8430
6718 -8430 10968 17426 21472 -180 17295 6428 11159 22507 17137 26923 33138 18156 13731
6705 13731 10468 6568 -6420 -3452 4240 -12874 -9392 30977 34569 26433 27412 18296 3234 9555
6691 9555 17951 13760 -458 607 -14022 -2209 12498 17312 -19190 -40210 -39553 -37775 -34434 -35210
6677 -35210 -31449 -9028 -6517 5797 18381 9173 377 9121 10860 -9304 -17389 -20281 -29127 -37653
6663 -37653 -21476 -31536 -31233 -24323 8276 23660 32069 29063 10195 1998 -6882 -3206 8923
6650 8923 -3861 -9018 7471 -2059 -14292 -11213 -23091 -5810 8227 2834 4542 3862 -731 7980
$$ packed form
6746e144L899q451J317j342M132N511k284K22J7076J9675M842j9231j5353J146
6732F015n541l867R039k1966j1403Q599R769l354j3214j1133l520R414O225J6507
6718h430J9398O458M046k1652J7475j0867M731J1348n370R786O215j4982m425
6705A3731l263l900j2988K968P692j7114L482M0369L592q136R79r116j5062O321
6691I555Q396m191j4218J065j4629J1813J4707M814l6502k1020O57J778L341p76
6677c5210L761K2421K511J2314J2584r208q796Q744J739k0164q085k892q846q526
6663c7653J6177j0060L03O910L2599J5384Q409l006j8868q197q880L676J2129
6650H923j2784n157J6489r530j2233L079j1878J7281J4037n393J708o80m593Q711
$$ plain form
6636 7980 25095 11576 4675 9122 -6181 -18305 -3746 8063 7681 -6515 -8363 -5334 -12592
6623 -12592 -24358 -17359 -13311 4055 -7632 -17790 -19177 -21594 -16644 -18055 -5334 27751 37145
6610 37145 12744 933 14086 24885 24872 16056 697 2710 10089 -3438 14930 28818 22895
6597 22895 -3912 1081 5279 4471 11312 2606 -3893 -7300 4165 4375 7056 12492 6345 15622 31569
6582 31569 30418 15995 5297 18169 13099 9097 6288 18595 30990 17859 -6012 -20070 -26579
6569 -26579 -26663 -11532 2541 -4299 -1181 14444 6511 10802 9546 7338 16002 32616 15067 -11771
6555 -11771 -34799 -31122 -24423 -24902 -7913 7725 10032 9213 24168 23360 35101 28736 24820 31006
6541 31006 22050 17798 16076 22123 23477 13762 -4087 12000 17424 20179 -5184 -458 -863 -22216
$$ packed form
6636G980J7115j3519o901M447j5303j2124J4559J1809l82j4196j848L029p258
6623a2592j1766O999M048J7366j1687j0158j387k417M950j411J2721L3085R394
6610C7145k4401j1811J3153J0799j3q816j5359K013P379j3527J8368J3888n923
6597B2895k6807M993M198q08O841q706o499l407J1465K10K681N436o147R277J5947
6582C1569j151j4423j0698J2872n070m002k809J2307J2395j3131k3871j4058o509
6569b6579q4J5131J4073o840L118J5625p933M291j256k208Q664J6614j7549k6838
6555a1771k3028L677O699m79J6989J5638K307q19J4955q08J1741o365l916O186
6541C1006q956m252j722O047J354r715j7849J6087N424K755k5363M726m05k1353
$$ plain form
6527 -22216 -17585 -8981 -9259 -6506 -764 3620 -6207 -5754 -22897 -33047 -19261 -29223 -25244 -3174
6513 -3174 -7188 -21002 -11386 19326 19586 19358 17163 16641 17476 1674 -9996 -11663 -2917 1383 18782
6498 18782 19053 -814 -10906 109 15824 29372 42026 24049 10616 26740 16612 -255
6486 -255 3534 5129 -19004 -30216 -25900 -29166 -18119 14686 19069 -750 -12375 -3017 -3564 -2346
6472 -2346 -3079 173 -13204 -41456 -35146 -23317 -30467 -46820 -50633 -49408 -54509 -59814 -42140 -2979
6458 -2979 158 1680 18099 13520 -3293 -23550 -28158 -20279 425 7414 7536 13120 15097 25246
6444 25246 12692 23956 38946 27733 5912 -1685 -22624 -22312 -21044 -16853 -21953 -24347 -26077
6431 -26077 -36434 -53317 -46930 -39039 -30474 -35800 -46230 -28867 -2288 11147 5663 21968 42082
$$ packed form
6527b2216M631Q604k78K753N742M384r827M53j7143j0150J3786r962L979K2070
6513c174m014j3814R616L0712K60k28k195n22Q35j5802j1670j667Q746M300J7399
6498A8782K71j9867j0092J1015J5715J3548J2654j7977j3433J6124j0128j6867
6486b55L789J595k4133j1212M316l266J1047L2805M383j9819j1625R358n47J218
6472b346p33L252j3377k8252O310J1829p150j6353l813J225n101n305J7674L9161
6458b979L137J522J6419m579j6813k0257m608P879K0704O989J22N584J977J0149
6444B5246j2554J1264J4990j1213k1821p597k0939L12J268M191n100k394j730
6431b6077j0357j6883O387P891Q565n326j0430J7363K6579J3435n484J6305K0114
$$ plain form
6418 42082 43043 20182 -913 -11134 -485 7002 3759 -8552 -10477 -2776 14736 8232 -13899
6405 -13899 -17249 -15679 12048 6591 5730 -7258 -23366 -13387 -14464 -24946 -40684 -38758 -11610
6392 -11610 -17111 -18498 -4448 -2716 -3283 -15123 -13662 -5786 -2338 -6663 -20086 -26531 -22444 -9590
6378 -9590 1865 22606 22758 25302 32243 38126 29277 8064 -4261 3790 3410 6184 4995 42886
6364 42886 39758 29842 27942 -7879 -27832 1259 17517 5008 -22993 -42220 -28883 -2926
6352 -2926 174 -1167 -1016 5799 1222 -8924 -30640 -40167 -28533 -17595 -14840 -2227 8100 17532
6338 17532 2490 -16535 -30762 -34010 -43365 -28859 -8510 2037 12698 15165 1520 3336 -1599
6325 -1599 -4279 -10553 -8306 -1995 12561 15443 76 -22815 -26244 3797 10390 7536 1916 -4831
$$ packed form
6418D2082R61k2861k1095j0221J0649P487l243j2311j925P701J7512o504k2131
6405a3899l350J570K7727n457q61j2988j6108R979j077j0482j5738J926K7148
6392a1610n501j387J4050J732n67j1840J461P876L448m325j3423o445M087J2854
6378i590J1455K0741J52K544O941N883q849k1213j2325Q051l80K774j189L7891
6364D2886l128r916j900l5821j9953K9091J6258j2509k8001j9227J3337K5957
6352b926L100j341J51O815m577j0146k1716r527J1634J0938K755J2613J0327R432
6338A7532j5042j9025j4227l248r355J4506K0349J0547J0661K467j3645J816m935
6325a599k680o274K247O311J4556K882j5367k2891l429L0041O593k854n620o747
$$ plain form
6311 -4831 -4913 -10348 -1024 -219 -3639 -33873 -42300 -34557 -16322 -3650 -10194 -4658 9568 22048
6297 22048 14705 -10539 -13112 -12714 -21988 -10551 -12895 -6446 11800 13962 -7488 -24672 -16116 1739
6283 1739 17144 8104 5560 -3782 -17177 -7540 -1280 15157 -7585 -11690 -9696 2099 -15791
6270 -15791 -46482 -42496 -35823 -33623 -10582 -1826 7992 18873 -10257 -15764 6671 19459 17265
6257 17265 90 -25780 -27826 -7545 -788 -905 3751 13122 16131 28390 33366 34674 53281 20298
6243 20298 -6521 6207 17225 15163 18483 1602 11227 12896 14217 17388 29160 29810 11126
6230 11126 1751 -5795 -3392 7239 7980 11883 22246 38567 33437 31819 20020 10667 7471 2993
6216 2993 6957 14153 9466 -338 -13534 -10343 4821 17826 4316 -15238 -17302 -24985 -18655 -5933
$$ packed form
6311d831q2n435R324Q05l420l0234q427P743J8235J2672o544N536J4226J2480
6297B2048p343k5244k573L98r274J1437k344O449J8246K162k1450j7184Q556J7855
6283A739J5405r040k544r342j3395R637O260J6437k2742m105J994J1795j7890
6270a5791l0691L986O673K200K3041Q756R818J0881k9130n507K2435J2788k194
6257A7265j7175k5870k046K0281O757j17M656R371L009J2259M976J308J8607l2983
6243B0298k6819J2728J1018k062L320j6881R625J669J321L171J1772O50j8684
6230A1126r375p546K403J0631P41L903J0363J6321n130j618j1799r353l196m478
6216B993L964P196m687r804j3196L191J5164J3005j3510j9554k064p683O330J2722
$$ plain form
6202 -5933 -13515 -19149 -24270 -118 9315 2632 -11731 -7242 10361 -12081 -4506 6849 17058
6189 17058 46311 55471 22785 -2524 -23478 -13953 -4184 -6884 -13524 6947 -8240 -11898 -11889 -16025
6175 -16025 -23203 -39430 -27663 -2604 -6769 -21372 -20603 -16522 -8203 3754 -1500 -10197 -4830 -11022
6161 -11022 -31787 -26756 -24874 -35603 -49583 -39152 -13076 -8827 -23437 -24764 -4320 11985 14291
6148 14291 11333 1461 -11227 -11085 -5844 2448 524 -2670 -19715 -27973 -15241 -14182 -15152 -4888
6134 -4888 -1126 3780 -3627 -1953 8205 -17199 -11325 10506 22651 17323 16265 20430 15247 14202
6120 14202 28623 25342 29371 24964 17271 10536 14583 16489 377 1855 15545 15317 11096 12450
6106 12450 -6823 -19779 -18130 -17425 -24026 -33683 -11333 9831 4180 27802 7676 -11483 -23552
$$ packed form
6202e933p582n634n121K4152R433o683j4363M489J7603k2442P575J1355J0209
6189A7058K9253R160l2686k5309k0954R525R769k700o640K0471j5187l658Rm136
6175a6025p178j6227J1767K5059m165j4603P69M081Q319J1957n254q697N367o192
6161a1022k0765N031J882j0729j3980J0431K6076M249j4610j327K0444J6305K306
6148A4291k958r872j2688J42N241Q292j924l194j7045q258J2732J059r70J0264
6134d888L762M906p407J674J0158k5404N874K1831J2145n328j058M165n183j045
6120A4202J4421l281M029m407p693o735M047J906j6112J478J3690k28m221J354
6106A2450j9273j2956J649P05o601r657K2350K1164n651K3622k0126j9159j2069
$$ plain form
6093 -23552 -19767 3725 5108 -10518 -12094 4178 2768 -3176 -33495 -47091 -23212 -9656 2916
6080 2916 14048 19425 9874 4629 18590 6471 -13726 -7544 -2542 -12739 -10721 -3567 15836
6067 15836 32698 43647 15118 -4589 2671 21105 5627 -2523 -8851 -9794 -3967 -7043 -29387
6054 -29387 -36988 -28306 -27455 -28819 -17682 -4692 -20621 -16520 -15231 -8806 878 -22964 -27439 -10026
6040 -10026 -4810 -12054 -17494 -17972 -26741 -44032 -32178 -8862 422 -1538 -13117 -7741 2378 13159
6026 13159 2962 9850 9910 16085 6970 -9499 13941 9211 -14275 -24097 -31025 -46523 -47897 -7664
6012 -7664 -3809 -22206 -21879 -17242 4438 -5957 -14427 -16566 -20882 -25272 -32452 -18914 -17359 -15479
5998 -15479 1309 17737 1970 -20969 -36228 -33411 -17490 -29950 -31005 -21759 -1180 -2394 -3554
$$ packed form
6093b3552L785K3492J383j5626j576J6272j410n944l0319j3596K3879J3556J2572
6080B916J1132N377r551n245J3961j2119k0197O182N002j0197K018P154J9403
6067A5836J6862J0949k8529j9707P260J8434j5478q150o328r43N827l076k2344
6054b9387p601Q682Q51j364J1137J2990j5929M101J289O425R684k3842m475J7413
6040a0026N216p244n440m78q769j7291J1854K3316R284j960j1579N376J0119J0781
6026A3159j0197O888O0O175r115j6469K3440m730k3486r822o928j5498j374M0233
6012g664L855j8397L27M637K1680j0395q470k139m316m390p180J3538J555J880
5998a5479J6788J6428j5767k2939j5259K817J5921j2460j055R246K0579j214j160
$$ plain form
5985 -3554 -17627 -42304 -22840 -7782 -649 -16289 -12615 -22565 675 20340 9399 17441 -1584
5972 -1584 -20354 -31046 -40979 -40137 -13676 -6693 -18806 -9712 -3537 -1828 11194 -5634 -16342
5959 -16342 -14756 -20227 -23467 -14318 -6047 -11890 -4616 15797 24052 7166 10807 6080 -9069 -15809
5945 -15809 -17904 -11200 -20172 3006 9965 13033 13221 -125 5918 6336 2630 -6150 -8749 -8092 -8202
5930 -8202 -5594 -597 10464 5544 -12447 6717 8400 -2069 -11594 2704 -3004 5769 8228 1214
5916 1214 -7069 -9635 -9837 -21561 -43095 -44119 -21539 -21309 -16733 2473 -22536 -9770 14884 11261
5902 11261 -2605 -28709 -38438 -16583 -16739 -17639 -11946 -16779 -24298 -27840 -21710 -13985 -5539 15543
5888 15543 18038 7768 -9040 15886 22839 20698 18297 20100 27898 16861 18462 6666 -1993
$$ packed form
5985c554j4073k4677J9464J5058P133j5640L674r950K3240J9665j0941Q042j9025
5972a584j8770j0692r933Q42K6461O983j2113R094O175J709J3022j6828j0708
5959a6342J586n471l240R149Q271n843P274K0413Q255j6886L641m727j5149o740
5945a5809k095O704q972K3178O959L068J88j3346O043M18l706q780k599O57j10
5930h202K608M997J1061m920j7991J9164J683j0469r525J4298n708Q773K459p014
5916A214q283k566k02j1724k1534j024K2580K30M576J9206k5009J2766K4654l623
5902A1261j3866k6104r729K1855j56r00N693m833p519l542O130P725Q446K1082
5888A5543K495j0270j6808K4926O953k141k401J803P798j1037J601j1796q659
$$ plain form
5875 -1993 -7061 -9109 8443 11677 -1349 -1382 6846 21740 33341 26301 5978 -15174 -1555 -6569
5861 -6569 224 -11625 -23799 -30451 -34625 -28260 -19021 -6385 -1375 5843 9954 23621 24007 4736
5847 4736 11294 38012 42162 20048 18487 9292 -6112 -5584 -18637 -12197 21225 33910 18127
5834 18127 15097 25198 14289 7619 9582 27669 20825 15884 31229 24423 29249 6598 -17050
5821 -17050 -2808 5933 -9656 -4833 -3743 9906 925 -4989 -7331 -7363 -2561 5541 6748 20628
5807 20628 19635 10721 24353 10654 -17429 -11854 -22239 -29622 -26380 -32844 -31265 -27144 -23098 -9701
5793 -9701 10104 11913 2163 16793 21518 4150 -8494 -20770 -2410 13021 17292 172 5069
5780 5069 -8284 -19963 -11008 -6689 -7126 5579 18777 21720 3053 -19327 -8101 2053 93
$$ packed form
5875a993n068k048J7552L234j3026l3Q228J4894J1601p040k0323k1152J3619n014
5861f569O793j1849j2174o652m174O365R239J2636N010P218M111J3667L86j9271
5847D736O558K6718M150k2114j561r195j5404N28j3053O440L3422J2685j5783
5834A8127l030J0101j0909o670J963J8087o844m941J5345o806M826k2651k3648
5821a7050J4242Q741j5589M823J090J3649q981n914k342l2M802Q102J207J3880
5807B0628r93q914J3632j3699k8083N575j0385p383L242o464J579M121M046J3397
5793i701J9805J809r750J4630M725j7368j2644j2276J8360J5431M271j7120M897
5780E069j3353j1679Q955M319m37J2705J3198K943j8667k2380J1226J0154j960
$$ plain form
5767 93 6390 -10587 -12033 -9950 -25830 -32515 -22857 1311 14744 19153 29889 24159 21686 26439
5753 26439 11190 -3829 -13258 -3612 1039 -18092 -32564 -38416 -18586 1035 268 15845 14849
5740 14849 5032 -9456 -34566 -25246 -12735 -11232 -13609 3159 7419 -6562 -15654 -17349 2845
5727 2845 8485 -3767 -12370 -13217 -932 9113 25886 21743 8569 -1318 -6757 -9416 -23058 -17087
5713 -17087 -13985 -8469 -3834 -20904 -8721 -759 -11477 -7677 25038 25690 17488 23856 20133 26956
5699 26956 30519 26569 24786 9698 -13903 -2105 7129 -6719 -28658 -29955 -27559 -25713 -33975
5686 -33975 -44431 -44105 -20827 -9289 -3 17861 26290 34440 7065 -13096 -37087 -19884 -14488
5673 -14488 -13803 -17479 -27694 -31596 -21158 -8903 -23612 -11566 7146 3329 -9725 6569 28607
$$ packed form
5767I3O297j6977j446K083j5880o685R658K4168J3433M409J0736n730k473M753
5753B6439j5249j5019r429R646M651j9131j4472n852J9830J9621p67J5577r96
5740A4849r817j4488k5110R320J2511J503k377J6768M260j3981r092j695K0194
5727B845N640j2252q603q47J2285J0045J6773m143j3174r887n439k659j3642N971
5713a7087L102N516M635j7070J2183P962j0718L800L2715O52q202O368l723O823
5699B6956L563l950j783j5088k3601J1798R234j3848k1939j297K396J846q262
5686c3975j0456L26K3278J1538R286J7864Q429Q150k7375k0161k3991J7203N396
5673a4488O85l676j0215l902J0438J2255j4709J2046J8712l817j3054J6294K2038
$$ plain form
5660 28607 22974 27139 5128 902 -7867 -17604 -21789 -34257 -31275 -22666 -6579 11292 23388
5647 23388 16330 15310 31487 23108 20318 12223 10695 4867 -18704 -39841 -39838 -28994 -30798 -17257
5633 -17257 -10272 15294 24790 5253 -3669 -1910 -2279 -1504 -9055 -19165 -15883 -22591 -19147 -30003
5619 -30003 -28243 -17144 2871 -19389 -14009 -4127 -5957 -17111 -18084 5992 9473 21416 -14211
5606 -14211 -20376 -1122 -609 -10596 -25972 -19845 -19257 -30925 -32170 -48005 -31181 -19068 -20932 -22715
5592 -22715 -38884 -18017 845 -3143 -17544 -9773 -1460 -1098 1490 17395 30255 36841 16788
5579 16788 -1289 4082 -2494 -3729 -316 7716 18701 -1632 -24352 -30768 -23051 -31627 -33013 -18377
5565 -18377 -6872 -6304 -5127 6002 -7660 -24254 -22321 -34466 -27921 -17959 -14782 -16482 -3247
$$ packed form
5660B8607n633M165k2011m226q769r737m185j2468K982Q609J6087J7871J2096
5647B3388p058j020J6177q379k790q095j528n828k3571k1137LJ0844j804J3541
5633a7257O985K5566R496j9537q922J759l69P75p551j0110L282o708L444j0856
5619c0003J760J1099K0015k2260N380R882j830j1154r73K4076L481J1943l5627
5606a4211o165J9254N13r987j5376O127N88j1668j245j5835J6824J2113j864j783
5592b2715j6169K0867J8862l988j4401P771Q313L62K588J5905J2860O586k0053
5579A6788j8077N371o576j235L413Q032J0985k0333k2720o416P717q576j386J4636
5565a8377J1505N68J177J1129j3662j6594J933j2145O545R962L177j700J3235
$$ plain form
5552 -3247 -19619 -33318 -22784 -725 13102 27698 31728 28831 19275 11922 18734 23125 10463
5539 10463 -12587 -8525 -11674 -17624 -32037 -24732 -5601 -3195 -2914 -9524 -8299 7949 21405 17422
5525 17422 16101 4009 6825 -5010 -12585 -6260 -28600 -40658 -27358 -14712 -16490 -49958 -56644
5512 -56644 -19215 8958 -2758 -49423 -57955 -51304 -41602 -25955 -21192 2625 7059 4622 -21282
5499 -21282 -34385 168 4793 -8499 -13173 -10606 -8670 -7717 -3614 -6724 -23160 -25160 -18847 -14037
5485 -14037 -20140 10688 12826 -840 -28283 -43953 -34645 -43448 -33488 9050 9600 5761 17298
5472 17298 22765 45324 48376 18622 -6755 -8998 -10004 -30888 -35697 -50015 -32930 -38004 -42319
5459 -42319 -21437 257 -10705 -23767 -13652 -1003 17102 20117 10147 7876 15045 12214 9557
$$ packed form
5552c247j6372j3699J0534K2059J3827J4596M030k897r556p353O812M391j2662
5539A0463k3050M062l149n950j4413P305J9131K406K81o610J225J6248J3456l983
5525A7422j321j2092K816j1835p575O325k2340j2058J3300J2646j778l3468o686
5512e6644L7429K8173j1716m6665q532O651R702J5647M763K3817M434k437k5904
5499b1282j3103L4553M625j3292m674K567J936R53M103l110j6436k000O313M810
5485a4037o103L0828K138j3666k7443j5670R308q803R960M2538N50l839J1537
5472A7298N467K2559L052k9754k5377k243j006k0884m809j4318J7085n074m315
5459d2319K0882K1694j0962j3062J0115J2649J8105L015r970k271P169k831k657
$$ plain form
5446 9557 10870 10783 6461 410 7568 14124 7291 13666 -6198 -29850 -27489 -26582 -16729 -27188 -35604
5431 -35604 -31454 -32001 -32344 -28259 -17689 -23166 -41016 -39582 -13718 -25126 -30761 -19988 -11288 -17904
5417 -17904 -1095 13815 6406 5514 4257 14662 13183 20303 23771 26808 16637 3426 -2433 301
5403 301 9661 -4409 -14296 -6681 6336 -12266 -32428 -18955 -14262 -21957 -19831 -37524 -29487 -10606
5389 -10606 4043 17701 17595 8388 -5871 -6606 -320 -1538 -19344 3286 21449 29433 24748 11468
5375 11468 8539 3620 -626 240 -16448 -18681 -15673 -21579 -20423 3587 31903 31314 20581 21670
5361 21670 14847 20809 18926 4937 5405 -12742 -13928 1568 318 13135 -410 -12219 -16908
5348 -16908 -13023 -14541 -24430 -14471 20797 30536 34534 41690 47915 36091 3012 -1834 11755 10397
$$ packed form
5446I557J313q7m322o051P158O556o833O375j9864k3652K361R07R853j0459q416
5431c5604M150n47l43M085J0570n477j7850J434K5864j1408n635J0773Q700o616
5417a7904J6809J4910p409q92j257J0405j479P120L468L037j0171j3211n859K734
5403C01R360j4070r887P615J3017j8602k0162J3473M693p695K126j7693Q037J8881
5389a0606J4649J3658j06r207j4259p35O286j218j7806K2630J8163P984m685j3280
5375A1468k929m919m246Q66j6688k233L008n906J156K4010K8316n89j0733J089
5361B1670o823N962j883j3989M68j8147j186J5496j250J2817j3545j1809m689
5348a6908L885j518r889R959L5268R739L998P156O225j1824l3079m846J3589j358
$$ plain form
5334 10397 9293 -3986 -3497 7326 -440 -8860 -9278 12306 18466 -1376 -2868 -594 934 3095
5320 3095 16424 16354 22629 20704 -14879 -38185 -38298 -17728 -23045 -16119 -13955 3187 -17263 -29644
5306 -29644 -7375 20303 37523 38608 16972 -11651 -21290 -2403 -171 -3200 -12817 5376 -1407
5293 -1407 -23082 -50930 -42031 -14155 2944 -8359 -16887 -5408 -16961 -11958 11889 16701 29565
5280 29565 21102 7053 4835 -9394 -4946 -484 333 17566 14282 7387 -8626 -37540 -45608 -32619
5266 -32619 -14013 -31320 -44271 -9684 3680 -12746 -21653 -29107 -19154 -16118 -10357 3737 16297
5253 16297 2766 -6607 418 -1434 2900 6630 -5010 -9398 -3150 -8818 -24489 -28305 -25811 -27455
5239 -27455 -23221 -21164 -16475 -16315 -8748 -16713 -32507 -30654 -22405 -27697 -49487 -55489 -39666 -37983
$$ packed form
5334A0397j104j3279M89J0823p766q420m18K1584O160j9842j492K274J528K161
5320C095J3329p0O275j925l5583k3306j13K0570n317O926K164J7142k0450j2381
5306b9644K2269K7678J7220J085k1636k8623r639J8887K232l029r617J8193o783
5293a407k1675k7848Q899K7876J7099j1303q528J1479j1553N003K3847M812J2864
5280B9565q463j4049k218j4229M448M462Q17J7233l284o895j6013k8914q068J2989
5266c2619J8606j7307j2951L4587J3364j6426q907p454R953L036N761J4094J2560
5253A6297j3531r373P025j852M334L730j1640m388O248n668j5671l816K494j644
5239b7455M234K057M689J60P567p965j5794J853Q249n292k1790o002J5823J683
$$ plain form
5225 -37983 -27456 3741 -14432 -29980 5058 13958 12209 -10169 -18022 -224 14682 19188 18055
5212 18055 22026 15007 -10360 -30362 -27855 -38898 -27137 -14486 -14520 -43884 -41571 -20495 -589
5199 -589 18003 11201 -596 -161 -13624 -33812 -23410 -15049 4844 -2223 -11400 -5305 3447 1162
5185 1162 12808 21241 8922 -5821 264 17447 20624 11526 -3467 -5803 -17350 13093 16184
5172 16184 12411 21385 14593 9113 -4259 -22737 -18271 -3065 7809 16633 18230 10065 -3793
5159 -3793 -6548 -4678 124 6105 3373 -1110 -15741 -21359 -9955 621 5881 4431 8154 6804
5145 6804 -1373 -20922 -21349 280 433 -14716 -12351 -4582 -737 16501 21853 6112 -2745 11884
5131 11884 5553 -8046 -1929 8941 10624 16973 -6510 -26179 -16287 -3500 -24484 -34310 -29905
$$ packed form
5225c7983J0527L1197j8173j5548L5038Q900j749k2378p853J7798J4906M506j133
5212A8055L971p019k5367k0002K507j1043J1761J2651l4k9364K313K1076J9906
5199e89J8592o802j1797M35j3463k0188J0402Q361J9893p067r177O095Q752k285
5185A162J1646Q433j2319j4743O085J7183L177r098j4993k336j1547L0443L091
5172A6184l773Q974o792n480j3372j8478M466J5206J0874Q824J597q165j3858
5159c793k755J870M802N981k732m483j4631n618J1404J0576N260j450L723j350
5145F804q177j9549m27K1629J53j5149K365P769L845J7238N352j5741q857J4629
5131A1884o331j3599O117J0870J683O349k3483j9669R892J2787k0984r826M405
$$ plain form
5118 -29905 -42028 -41806 -47693 -51124 -13888 2082 6634 2064 -32411 -43335 -27787 -16025 12992
5105 12992 5176 2541 8543 8655 -159 9104 23649 12740 7815 9353 -1103 16965 28501 33227
5091 33227 16004 -4236 -31924 -25678 -18480 -26555 -24131 -22026 -22792 -7237 -14900 -14207 -16457 -18620
5077 -18620 -14205 -27028 -37929 -25989 -40354 -51573 -37959 -33395 -25238 -12349 -6031 -14407 -15931
5064 -15931 -21494 -7769 4536 20047 11062 6931 13510 18391 22515 18450 19871 1162 4128 -5813
5050 -5813 -21500 -26308 -34965 -4658 8494 -2584 -17675 -32874 -17754 -17254 -27129 -30613 -38298
5037 -38298 -51470 -39917 -437 17789 24621 2036 16443 36089 61000 58126 39587 32787
5025 32787 44138 36012 20661 9841 9414 3438 -19942 -7561 24517 23053 22337 17963 32315
$$ packed form
5118b9905j2123K22n887l431L7236J5970M552m570l4475j0924J5548J1762K9017
5105A2992p816k635O002J12q814R263J4545j0909m925J538j0456J8068J1536M726
5091C3227j7223k0240k7688O246P198q075K424K105p66J5555p663O93k250k163
5077a8620M415j2823j0901J1940j4365j1219J3614M564Q157J2889O318q376j524
5064a5931n563J3725J2305J5511q985m131O579M881M124m065J421j8709K966r941
5050e813j5687m808q657L0307J3152j1078j5091j5199J5120N00r875l484p685
5037c8298j3172J1553L9480J8226O832k2585J4407J9646K4911k874j8539o800
5025C2787J1351q126j5351j0820m27n976k3380J2381L2078j464p16m374J4352
$$ plain form
5012 32315 39039 41299 23229 10989 -6745 -18391 -15249 -23476 -17403 1546 9199 26364 26620
4999 26620 11623 9739 25934 29617 21063 8978 -19344 -22050 -22914 -2789 11474 7436 -22399
4986 -22399 -33201 -2832 22595 27771 -1661 -22941 -23388 -28012 -4260 -3477 11656 11812 17440 27901
4972 27901 44522 43262 19787 13950 5570 -4612 -6191 -14056 -12493 -20827 -18978 -12578 -26264 -29483
4958 -29483 -27560 -13878 -11876 -14916 -25648 -42786 -19431 -1814 9195 8812 -14711 -34002 -33839
4945 -33839 -32729 -14708 8620 17502 15305 18395 20918 30913 26908 3542 20559 31801 26569
4932 26569 7363 -3583 -13396 -12572 -26661 -10885 8592 11172 13959 1227 -7686 -8901 -6272
4919 -6272 -17694 -16758 -7175 2694 19331 26326 20601 17917 29628 8272 7257 23776 21580 11848
$$ packed form
5012C2315O724K260j8070j2240j7734j1646L142q227O073J8949P653J7165K56
4999B6620j4997j884J6195L683q554j2085k8322k706q64K0125J4263m038k9835
4986b2399j0802L0369K5427N176k9432k1280m47m624K3752P83J5133J56N628J0461
4972B7901J6621j260k3475n837q380j0182j579p865J563q334J849O400j3686l219
4958b9483J923J3682K002l040j0732j7138K3355J7617J1009l83k3523j9291J63
4945c3839J110J8021K3328Q882k197L090K523R995m005k3366J7017J1242n232
4932B6569j9206j0946r813Q24j4089J5776J9477K580K787j2732q913j215K629
4919f272j1422R36R583R869J6637O995n725k684J1711k1356j015J6519k196r732
$$ plain form
4905 11848 -5464 -16598 -10178 9856 2332 -17905 -42610 -36352 -2640 -16048 -26381 -11905
4893 -11905 9448 17829 10016 9020 8927 21021 25192 25346 28583 23979 -6491 -13641 -15950 -1343 4702
4878 4702 6196 10340 -8765 -9865 16921 14316 11236 21733 17742 15833 23222 11548 8811 -1073
4864 -1073 -16463 -7783 3939 6766 9577 12261 14949 11092 5036 -8979 2588 4475 5032 11220
4850 11220 -7774 -33359 -33710 -16348 -8522 11487 5984 12646 -13433 -11756 -9839 10258 38886
4837 38886 35473 19648 20634 17000 -6653 8600 24751 7921 289 419 -4673 -4032 -16069 -5852
4823 -5852 5262 971 7196 12533 -11045 -27755 -28065 -7414 12246 35891 37389 24897 8314
4810 8314 10304 -9262 -10622 -1831 4727 5165 601 -21831 -24043 -16181 -11495 -13787 -5628 -6415 7103
$$ packed form
4905A1848j7312j1134O420K0034p524k0237k4705O258L3712j3408j0333J4476
4893a1905K1353Q381p813r96r3J2094M171J54L237m604l0470p150k309J4607O045
4878D702J494M144j9105j100K6786k605l080J0497l991j909P389j1674k737r884
4864a073j5390Q680J1722K827K811K684K688l857o056j4015J1567J887N57O188
4850A1220j8994k5585l51J7362P826K0009n503O662k6079J677J917K0097K8628
4837C8886l413j5825R86l634k3653J5253J6151j6830p632J30n092O41j2037J0217
4823e852J1114m291O225N337k3578j6710l10K0651J9660K3645J498j2492j6583
4810H314J990j9566j360Q791O558M38m564k2432k212P862M686k292Q159p87J3518
$$ plain form
4795 7103 4549 16451 14025 8892 -1052 -18496 -11042 -2838 -25503 -24673 -21372 8532 13465 9130
4781 9130 17178 18054 13958 -6923 -11911 10210 5541 -17274 -3325 -2845 -5841 -1700 6625 22036
4767 22036 21523 18479 18727 18542 10040 1601 33445 30678 11422 344 -15261 -9000 -10121 -9651 3344
4752 3344 -1800 -4682 12518 -10910 -13524 6426 19998 1166 18489 44290 42939 39105 25766
4739 25766 18196 22162 21767 23585 9274 6462 11161 10743 1309 -10021 -15536 -6084 -6407 -25722 -34165
4724 -34165 -36130 -35169 -24046 -10913 745 -5446 762 15313 -4637 -12679 -19952 -25703 -15664
4711 -15664 -2615 -12371 -17691 -5294 -4226 -11342 -2049 22425 17621 22027 17297 42236 46697 42953
4697 42953 27822 33158 19141 6073 10086 869 -9444 -2969 -13860 -24518 -21567 -32028 -33473
$$ packed form
4795G103k554J1902k426n133r944j7444P454Q204k2665Q30L301K9904M933m335
4781I130Q048Q76m096k0881m988K2121m669k2815J3949M80k996M141Q325J5411
4767B2036n13l044K48j85q502q439L1844k767j9256j1078j5605O261j121M70J2995
4752C344n144k882J7200k3428k614J9950J3572j8832J7323K5801j351l834j3339
4739B5766p570L966l95J818j4311k812M699m18r434j1330n515R452l23j9315q443
4724c4165j965R61J1123J3133J1658o191O208J4551j9950q042p273n751J0039
4711a5664J3049r756n320J2397J068p116R293K4474m804M406m730K4939M461l744
4697D2953j5131N336j4017j3068M013r217j0313O475j0891j0658K951j0461j445
$$ plain form
4684 -33473 -23349 -27696 -5053 3420 -16649 -20911 -32353 -33287 -27931 -4843 -4960 9152 3532 -9159
4670 -9159 -15135 -15710 -8684 -8075 8130 23807 16243 -14414 -7525 2828 -784 10372 14315 15927
4656 15927 11066 -13095 -9165 21869 36486 36490 7602 6687 -1677 -14251 -8775 -10361 -16578 -11921
4642 -11921 -11703 -28360 -42041 -37135 -29486 -27701 -46545 -54701 -42875 -36985 -35735 -41865 -26241 -4579
4628 -4579 8417 13586 -1371 -15805 -612 6911 715 -8026 -19147 -7629 -3105 -1988 5558
4615 5558 7313 -13025 -13835 -22747 -25314 -20677 -10850 -22233 -44684 -39268 -39609 -14227 12649 -64
4601 -64 -18536 -39519 -32587 -29410 -18294 -26214 -46008 -31273 -8546 -387 -5484 -10521 -15272 -25527
4587 -25527 -40003 -35843 -32548 -47994 -78926 -67091 -44709 -51004 -28906 14584 -195 -33379
$$ packed form
4684c3473J0124m347K2643Q473k0069m262j1442r34N356K3088j17J4112n620j2691
4670i159n976n75P026O09J6205J5677p564l0657O889J0353l612J1156L943J612
4656A5927m861k4161L930L1034J4617Mk8888r15q364j2574N476j586o217M657
4642a1921K18j6657j3681M906P649J785j8844q156J1826N890J250o130J5624K1662
4628d579J2996N169j4957j4434J5193P523o196q741j1121J1518M524J117P546
4615E558J755k0338q10q912k567M637R827j1383k2451N416l41K5382K6876j2713
4601f4j8472k0983O932L177J1116p920j9794J4735K2727Q159n097n037m751j0255
4587b5527j4476M160L295j5446l0932J1835K2382o295K2098M3490j4779l3184
$$ plain form
4575 -33379 -17515 -7576 641 8790 13131 -1850 -18051 -4456 2586 -16987 -23656 -20788 -12427
4562 -12427 8378 17187 27289 13391 441 980 -2950 -4808 4790 12854 1710 4399 13011 21166
4548 21166 27810 6759 -17907 -5143 10784 8814 8292 7240 14942 41131 33922 10000 8586
4535 8586 16839 1993 -2277 8377 -17050 -36969 -39243 -3054 6995 -14547 -27565 -17289 -7338
4522 -7338 17090 24115 -1097 -12501 -7493 4490 34103 27639 3654 4834 2891 -9956 -19668
4509 -19668 -6686 -6712 -3261 -18869 -31056 -40455 -1297 -251 13059 21391 13974 544 -9257 9020
4495 9020 16644 -2548 -9145 -2781 137 -2281 8575 18226 17100 22967 17717 -4805 -21702 -15529
4481 -15529 750 3688 -1329 -6390 -1424 -16924 -18862 -2549 -1032 11405 10255 12914 24496
$$ packed form
4575c3379J5864R939Q217Q149M341j4981j6201J3595P042j9573o669K868Q361
4562a2427K0805Q809J0102j3898j2950N39l930j858R598Q064j1144K689Q612Q155
4548B1166O644k1051k4666J2764J5927j970n22j052P702K6189p209k3922j414
4535H586Q253j4846m270J0654k5427j9919k274L6189J0049k1542j3018J0276R951
4522g338K4428P025k5212j1404N008J1983K9613o464k3985J180j943j2847r712
4509a9668J2982k6L451j5608j2187r399L9158J046J3310Q332p417j3430r801J8277
4495I020P624j9192o597O364K918k418J0856R651j126N867n250k2522j6897O173
4481a5529J6279K938n017n061M966j5500j938J6313J517J2437j150K659J1582
$$ plain form
4468 24496 7546 13569 18861 15556 -1562 4591 10340 9288 7374 22247 28569 14781 6828 16677
4454 16677 47 5635 -18255 -18712 -7386 -10527 -8469 -22112 -19178 -6637 -6084 14618 20921 7070
4440 7070 -20683 -19975 -13852 -11841 10640 7451 1637 -18083 -11966 9207 14701 -6112 -15787 -8445
4426 -8445 -17162 -37962 -33847 -20995 -18378 -7417 -6794 -16729 -18629 -25431 -43628 -41621 -33066 -22513
4412 -22513 -9259 -928 -31151 -35709 -14767 -9200 -24271 -29005 -29128 -34159 -30367 -20598 -9953 -3164
4398 -3164 7796 13907 2675 12638 25902 25829 -7042 -20814 -8575 -18119 -38696 -30577 -20088
4385 -20088 -34953 -44938 -37561 -26206 -7483 401 -6540 -29247 -14067 1886 2329 473 -17197
4372 -17197 -19832 -9456 -2610 1085 -1986 8813 28858 21740 15863 18666 15409 4337 7529 7383
$$ packed form
4468B4496j6950O023N292l305j7118O153N749j052j914J4873O322j3788p953R849
4454A6677j6630N588k3890m57J1326l141K058j3643K934J2541N53K0702O303j3851
4440G070k7753P08O123K011K2481l189n814j9720O117K1173N494k0813r675P342
4426h445q717k0800M115J2852K617J0961O23r935j900o802j8197K007Q555J0553
4412b2513J3254Q331l0223m558K0942N567j5071m734j23n031L792R769J0645O789
4398c164J0960O111j1232R963J3264p3l2871j3772J2239r544k0577Q119J0489
4385b0088j4865r985P377J1355J8723P884o941k2707J5180J5953M43j856j7670
4372a7197k635J0376O846L695l071J0799K0045p118n877K803l257j1072L192j46
$$ plain form
4358 7383 -7286 -5039 -9776 -25550 -12910 3245 -3657 867 11709 14570 32073 23266 5595
4345 5595 8870 -5172 -58 -3357 -8495 -11337 7352 29408 45996 27703 8207 4177 15259
4332 15259 15857 6430 15066 15915 10467 728 -1840 -13385 -21561 -31258 -38650 -14858 4612 9530
4318 9530 8722 -4254 -22859 -25101 -31737 -18888 -742 -3423 -16774 -20177 1813 29320 54104
4305 54104 46894 38978 12037 14653 8316 1797 7825 12130 24812 36509 26982 13291 29388
4292 29388 42558 30199 9767 -4354 1723 -10320 -14065 -14721 -8426 -6840 -25741 -20230 -8523
4279 -8523 -3480 -32166 -49940 -41666 -22741 -23620 -12959 -3837 9197 4701 -7187 -18993 -20048
4266 -20048 -15979 -2449 3691 -7520 -3682 -4667 -5500 2939 -1980 -150 -16226 -16894 13008 22308
$$ packed form
4358G383j4669K247m737j5774J2640J6155o902M524J0842K861J7503q807j7671
4345E595L275j4042N114l299n138k842J8689K2056J6588j8293j9496m030J1082
4332A5259N98r427Q636Q49n448r739k568j1545q176r697p392K3792J9470M918
4318I530q08j2976j8605k242o636J2849J8146k681j3351l403K1990K7507K4784
4305E4104p210p916k6941K616o337o519O028M305J2682J1697r527j3691J6097
4292B9388J3170j2359k0432j4121O077j2043l745o56O295J586j8901N511J1707
4279h523N043k8686j7774Q274J8925q79J0661R122J3034m496j1888j1806j055
4266b0048M069J3530O140j1211L838r85q33Q439m919J830j6076o68K9902R300
$$ plain form
4252 22308 21230 11577 -5258 -10712 7301 8977 -22880 -48085 -47442 -35322 -19054 -6171 -18411
4239 -18411 -20824 -16326 -6999 -30585 -25624 5578 7309 11032 9021 -3340 -18447 -31296 -37980
4226 -37980 -63170 -65390 -43248 -47733 -30372 -26922 -19619 -13512 -31642 -18417 -1696 -6840 -35019
4213 -35019 -49114 -36015 -25219 -7097 16268 16163 20733 2180 -23037 -20248 -18499 -3985 -10252
4200 -10252 -31815 -24260 -15238 -18842 -20128 -11347 -5909 -16845 -35905 -21162 -16813 -13473 -4576 -9830
4186 -9830 7841 -2623 -44252 -44133 -24067 -26087 -24185 -11093 -3310 5828 14183 9505 -383 -1080
4172 -1080 7984 4737 1425 -822 -7334 -22207 -31691 -19559 7536 28577 27327 40836 32412 14742
4158 14742 -20957 -21447 14117 8298 -6698 -16089 -29933 -44436 -33765 -12270 -21949 -32543 -31689
$$ packed form
4252B2308j078r653j6835n454J8013J676l1857k5205O43J2120J6268J2883j2240
4239a8411k413M498R327k3586M961L1202J731L723k011j2361j5107j2849o684
4226c7980k5190k220K2142m485J7361L450P303O107j8130J3225J6721n144k8179
4213c5019j4095J3099J0796J8122K3365j05M570j8553k5217K789J749J4514o267
4200a0252k1563P555R022l604j286Q781N438j0936j9060J4743M349L340Q897n254
4186i830J7671j0464m1629J19K0066k020J902J3092P783R138Q355m678r888o97
4172a080R064l247l312k247o512j4873r484J2132K7095K1041j250J3509q424j7670
4158A4742l5699m90L5564n819j4996r391j3844j4503J0671K1495r679j0594Q54
$$ plain form
4145 -31689 -24549 -6488 14690 12996 7526 6992 4797 10854 -3009 -35432 -38912 -38167 -17566 4169
4131 4169 7988 11192 -4914 -15120 -4222 -14162 -25819 -8264 -8712 -4035 5434 23136 35329
4118 35329 19646 11821 5191 -6739 -18053 -21734 -35433 -38818 -18655 -14253 -6804 -24638 -34188
4105 -34188 -2349 -8463 -27534 -9944 14991 4782 -873 -998 11235 2384 997 3456 -18931
4092 -18931 -22633 -10194 -23185 -6160 2043 6408 14846 -808 -8928 -2787 -1176 -15496 -10244
4079 -10244 5226 1761 4547 -11652 -36351 -29048 -21717 3205 -4420 -13395 -1818 10760 -3765
4066 -3765 6193 11425 16879 45718 30022 19006 8721 3283 -6815 16079 32968 21645 18285
4053 18285 5789 11961 20144 15083 13211 18075 10855 6160 17597 17663 25213 21954 9357 -13197
$$ packed form
4145c1689P140J8061K1178j694n470n34k195O057j3863l2423l480P45K0601K1735
4131D169L819L204j6106j0206J0898r940j1657J7555m48M677R469J7702J2193
4118C5329j5683p825o630j1930j1314l681j3699l385K0163M402P449j7834r550
4105c4188L1839o114j9071J7590K4935j0209n655j25J2233q851j387K459k2387
4092a8931l702J2439j2991J7025Q203M365Q438j5654q120O141J611j4320N252
4079a0244J5470l465K786j6199k4699P303P331K4922p625q975J1577J2578j4525
4066c765R958N232N454K8839j5696j1016j0285n438j0098K2894J6889j1323l360
4053A8285j2496O172Q183n061j872M864p220m695J1437O6P550l259j2597k2554
$$ plain form
4039 -13197 -793 -7926 -15857 10221 25902 7969 -17211 -22338 -14398 -18175 -17048 10632 7914
4026 7914 11815 2120 6050 -15889 -16176 1265 -2720 3063 3815 -2358 4178 15901 50 -16999
4012 -16999 -16884 -11377 -7135 -21020 -25966 -8941 5142 -6410 -17999 -18754 -28327 -38698 -18389
3999 -18389 9138 26850 23158 2155 -9036 -13302 3642 20892 3810 -24366 -32498 -31207 -21356
3986 -21356 -4288 18525 37038 53979 28266 3467 -9569 -428 2007 8815 -2100 -4379 -12594
3973 -12594 -2883 12365 -5984 -35327 -39119 -26338 -23118 -46298 -41103 -11856 -15866 -15037 3280
3960 3280 8214 11375 1114 653 1087 -19610 -11065 -6643 -21482 -17646 -5783 216 12499 11654
3946 11654 -8176 -418 -2719 -17228 -15291 -12513 7265 5040 -5899 4663 13416 13774 -5034
$$ packed form
4039a3197J2404p133p931K6078J5681j7933k5180n127P940l777J127K7680k718
4026G914L901r695L930k1939k87J7441l985N783P52o173O536J1723j5851j7049
4012a6999J15N507M242j3885m946J7025J4083j1552j1589p55r573j0371K0309
3999a8389K7527J7712l692k1003j1191m266J6944J7250j7082k8176q132J291R851
3986b1356J7068K2813J8513J6941k5713k4799j3036R141K435O808j0915k279q215
3973a2594R711J5248j8349k9343l792J2781L220k3180N195K9247m010Q29J8317
3960C280M934L161j0261m61M34k0697Q545M422j4839L836J1863N999J2283q45
3946A1654j9830P758k301j4509J937K778J9778k225j0939J0562Q753L58j8808
$$ plain form
3933 -5034 -23241 -27571 -14523 -2213 17818 33676 12230 -4050 -1804 -2685 2753 -26995 -15275
3920 -15275 5046 9064 -11612 -8306 2219 12166 17154 19928 18723 -10752 -25877 -17102 -21266
3907 -21266 -21245 -8366 12777 22401 15411 18587 17811 3613 -5275 624 2169 1597 -8617 -18270 704
3892 704 9541 14399 18428 37736 46440 35817 38627 28431 7301 6888 13279 15367 11813 9464
3878 9464 1960 7311 -10184 -26700 -23938 -23969 -5450 1221 -2440 1389 280 151 2892 3700 365
3863 365 9397 25420 17836 6678 -2088 -1132 -3211 11065 4523 -8131 11895 24945 19110 -6805
3849 -6805 -5359 1277 559 24115 20999 24758 17753 13269 6278 -7010 -14332 -23601 -14163 -9489 -15470
3834 -15470 -8780 -18045 -9980 2441 8496 17657 10127 15741 23322 20435 -3300 -13526 -12686 -22090
$$ packed form
3933e034j8207m330J3048J2310K0031J5858k1446j6280K246q81N438k9748J1720
3920a5275K0321M018k0676L306J0525R947M988K774j205k9475j5125Q775m164
3907b1266K1J2879K1143R624o990L176p76j4198q888N899J545n72j0214r653J8974
3892G04Q837M858M029J9308Q704j0623K810j0196k1130m13O391K088l554k349
3878I464p504N351j7495j6516K762l1J8519O671l661L829j109j29K741Q08l335
3863C65R032J6023p584j1158q766R56k079J4276o542j2654K0026J3050n835k5915
3849f805J446O636p18K3556l116L759p005m484o991j3288p322r269R438M674n981
3834a5470O690r265Q065J2421O055R161p530N614P581k887k3735j0226Q40r404
$$ plain form
3820 -22090 -14429 20596 21479 -2411 -8179 6273 27540 34717 23015 15737 2222 552 623 11219
3806 11219 16281 15627 25409 12083 -5983 -20670 -29361 -30824 -25971 -34435 -33043 -6520 14420 -1108
3792 -1108 -5164 -14456 -8410 -26347 -60411 -68766 -60262 -44563 -17984 -21901 -6536 -10869 -15100 -18900
3778 -18900 -10053 -13716 -4490 -602 -4962 7422 5212 14407 12907 2306 -11288 6140 -11102
3765 -11102 -10895 -10657 -6203 -5715 -15454 -13434 -432 6296 16697 18683 53675 64997 42506 4596
3751 4596 -1184 -5691 -5805 -11167 -12404 -26259 -36633 -39061 -13447 -2856 -3122 -5559 3682 -3906
3737 -3906 -17980 -31302 -33977 -31632 -27063 -21525 -7063 -16504 -3866 -3910 1159 10013 11478 8641
3723 8641 -6582 4025 25305 17163 26732 29335 39513 16512 15727 8836 8459 26923 32193 24290
$$ packed form
3820b2090P661L5025Q83k3890n768J4452K1267P177j1702p278j3515j670P1J0596
3806A1219N062o54R782j3326j8066j4687q691j463M853q464J392K6523K0940j5528
3792a108m056r292O046j7937l4064q355Q504J5699K6579l917J5365m333m231l800
3778a8900Q847l663R226L888m360J2384k210R195j500j0601j3594J7428j7242
3765a1102K07K38M454M88r739K020J3002O728J0401J986L4992J1322k2491l7910
3751D596n780m507j14n362j237j3855j0374k428K5614J0591k66k437R241p588
3737c906j4074j3322k675K345M569N538J4462r441J2638m4N069Q854J465k837
3723H641j5223J0607K1280q142R569K603J0178k3001p85o891l77J8464N270p903
$$ plain form
3709 24290 23494 38648 22311 14272 -11823 2376 -2200 -6120 -15462 -23216 -14973 -8637 -14022 9786
3695 9786 29681 19354 21203 12550 5644 16955 28980 10857 -378 2627 -13974 -14611 7211
3682 7211 18011 26628 31295 16370 12969 -1153 3979 19003 19349 5514 -18230 -13279 -1124
3669 -1124 11450 10510 3968 11340 4231 -10872 -5410 4084 13336 9077 2162 -1616 5064 -6424
3655 -6424 -9834 -28700 -55985 -51417 -28968 -26747 -38339 -40349 -16260 10603 29689 35158 40626
3642 40626 26198 9386 8984 15562 22286 4216 -19965 -14181 -4467 8899 15926 23877 16650 17449
3628 17449 14668 -1502 -13743 -14756 6218 -8346 -22117 -33973 -21106 -24641 -31078 -20121 -7971
3615 -7971 4237 9650 14287 2567 -2048 -6729 1254 15148 7827 8739 10135 6071 18998 22137
$$ packed form
3709B4290p96J5154j6337q039k6095J4199m576l920r342p754Q243O336n385K3808
3695I786J9895j0327J849q653o906J1311J2025j8123j1235L005j6601o37K1822
3682G211J0800Q617M667j4925l401j4122N132J5024L46j3835k3744M951J2155
3669a124J2574r40o542P372p109j5103N462R494R252m259o915l778O680j1488
3655f424l410j8866k7285M568K2449K221j1592k010K4089K6863J9086N469N468
3642D0626j4428j6812m02O578O724j8070k4181N784R714J3366P027P951p227P99
3628A7449k781j6170j2241j013K0974j4564j3771j1856J2867l535o437J0957J2150
3615g971J2208N413M637j1720m615m681P983J3894p321R12J396m064J2927L139
$$ plain form
3601 22137 25065 27208 -125 -7190 3163 11494 -13015 218 -8071 -14782 -24532 -30611 -9984
3588 -9984 -5869 -23103 -21713 -36981 -39519 -28453 -5408 3108 18578 18938 12814 12557 12740 -10542
3574 -10542 -3460 14729 2162 4649 8572 -2552 -14851 -7265 -17547 -40646 -43919 -28523 -13704
3561 -13704 -29039 -29464 -9781 -14920 -16108 1986 16135 8093 17065 9571 8057 16977 5804 -815
3547 -815 -13312 -24580 -15484 -6345 -18478 -15258 -1570 -1316 -10693 -10022 10198 4362 2145 27298
3533 27298 22675 -277 -6748 -11131 -19006 -34544 -32287 -2840 -13576 -17920 -5161 -17341 -30804
3520 -30804 -25042 -15961 4715 8957 1668 -2564 -13917 -29644 -39904 -38417 -31394 -40952 -32583 -15573
3506 -15573 6660 11343 6319 17026 3624 -1661 19037 19946 -4683 151 -3831 15134 41104
$$ packed form
3601B2137K928K143k7333p065J0353Q331k4509J3233q289o711r750o079K0627
3588i984M115j7234J390j5268k538J1066K3045Q516J5470L60o124k57J83k3282
3574a0542P082J8189j2567K487L923j1124j2299P586j0282k3099l273J5396J4819
3561a3704j5335m25J9683n139j188J8094J4149q042Q972p494j514Q920j1173o619
3547h15j2497j1268R096R139j2133L220J3688K54r377O71K0220n836k217K5153
3533B7298m623k2952o471m383p875j5538K257K9447j0736m344J2759j2180j3463
3520c0804N762R081K0676M242p289m232j1353j5727j0260J487P023r558Q369J7010
3506a5573K2233M683n024J0707j3402n285K0698R09k4629M834l982J8965K5970
$$ plain form
3493 41104 19053 -1862 -9035 -14627 -9191 12947 4543 -9806 -13762 3947 13323 7565 -11607
3480 -11607 -9243 -1037 1465 -558 3859 -10551 15919 21686 6474 1525 3902 30460 25212 24735
3466 24735 22195 7482 6615 -16124 -13785 -6284 -10479 -8839 -8325 1021 12731 22292 7565 7476 19875
3451 19875 36324 24808 25325 33495 12679 -7196 -29675 -34163 -23869 -2545 3779 -1735 8458
3438 8458 30559 43230 35629 18250 4210 1211 3938 -737 -8549 443 13340 351 19057
3425 19057 21123 -18023 -41116 -35025 -35790 -32986 -5235 -4170 -9900 6977 11209 4485 -1003 -5694
3411 -5694 9228 24439 17661 -2023 -4659 4775 -4569 3348 6753 -1975 -24589 -28293 -28928 -28729
3397 -28729 -19689 -19489 -9094 18644 31998 28713 30602 25061 12213 -16324 -28452 -36748 -22222
$$ packed form
3493D1104k2051k0915p173n592N436K2138q404j4349l956J7709R376n758j9172
3480a1607K364Q206K502k023M417j4410K6470N767j5212m949K377K6558n248m77
3466B4735k540j4713q67k2739K339P501m195J640N14R346J1710R561j4727q9J2399
3451A9875J6449j1516N17Q170k0816j9875k2479m488J0294K1324O324n514J0193
3438H458K2101J2671p601j7379j4040k999K727m675p812Q992J2897j2989J8706
3425A9057K066l9146k3093O091p65K804K7751J065n730J6877M232o724n488m691
3411e694J4922J5211o778j9684k636R434r344P917L405q728k2614l704o35J99
3397b8729R040K00J0395K7738J3354l285J889n541j2848k8537j2128q296J4526
$$ plain form
3384 -22222 2844 -3175 1579 26015 16064 15962 29314 21201 -150 14855 38790 31787 26308
3371 26308 50572 55474 37473 21739 -9305 -21554 -35934 -26337 -35637 -34059 3737 10280 -689
3358 -689 -11454 -31497 -29579 -8456 -846 -5153 -1078 -4111 190 -4232 -26393 -23891 3898 14316
3344 14316 4743 4846 26157 27070 21773 26024 44652 32905 -1523 -13560 -15509 -5252 -5928 -17540
3330 -17540 -11834 -12513 -8218 7355 -4813 -13043 8773 7068 -11385 -31959 -29068 -15067 2960
3317 2960 -4467 -9194 7442 29138 35197 10769 -1719 -6909 6900 11413 4639 -4572 17233
3304 17233 8971 -12001 401 4557 7121 -18042 -23903 -11575 3597 11012 6491 4422 -17767
3291 -17767 -29092 -27603 -7735 19059 19130 10923 12927 5490 -9209 10271 19206 24135 20990 340
$$ packed form
3384b2222K5066o019M754K4436r951j02J3352q113k1351J5005K3935p003n479
3371B6308K4264M902j8001j5734l1044j2249j4380R597r300J578L7796O543j0969
3358f89j0765k0043J918K1123P610m307M075l033M301m422k2161K502K7789J0418
3344A4316r573J03K1311R13n297M251J8628j1747l4428j2037j949J0257o76j1612
3330a7540N706o79M295J5573j2168q230K1816j705j8453k0574K891J4001J8027
3317B960p427m727J6636K1696O059k4428j2488n190J3809M513o774r211K1805
3304A7233q262k0972J2402M156K564k5163n861J2328J5172P415m521k069k2189
3291a7767j1325J489J9868K6794P1q207K004p437j4699J9480Q935M929l145k0650
$$ plain form
3277 340 -23688 -43701 -46080 -22179 5144 -2287 -26961 -45362 -34690 -37950 -48093 -34119 -6516
3264 -6516 9901 -7095 3352 5839 -789 -2283 -750 -31520 -46097 -33413 -3823 4789 -9298
3251 -9298 -28166 -55002 -53998 -10983 602 -316 -23670 -6582 8300 3298 -15316 -36697 -45557
3238 -45557 -17743 10350 7242 -3258 11215 -5115 -24374 -26250 -23017 -41905 -36970 -23318 -27421
3225 -27421 -13352 1894 16477 5830 -7621 -7948 -20633 -40632 -41748 -37126 -36706 -14963 11569
3212 11569 26171 16934 -7731 -19468 -22199 -10189 -11773 -16808 -13988 4835 16567 8031 -16508
3199 -16508 -9421 -11678 -23492 -23298 -35464 -21712 285 36972 34014 19015 26331 21713 16348
3186 16348 21111 29439 9949 -12000 -13371 -22863 -19595 -13158 -1241 1995 11823 9226 3744 5551
$$ packed form
3277C40k4028k0013k379K3901K7323p431k4674j8401J0672l260j0143J3974K7603
3264f516J6417j6996J0447K487o628j494J533l0770j4577J2684K9590Q612j4087
3251i298j8868k6836J004M3015J1585r18k3354J7088J4882n002j8614k1381q860
3238d5557K7814K8093l108j0500J4473j6330j9259j876L233j8888M935J3652m103
3225b7421J4069J5246J4583j0647j3451l27j2685j9999j116M622M20K1743K6532
3212A1569J4602r237k4665j1737k731J2010j584n035K820J8823J1732q536k4539
3199a6508P087k257j1814J94j2166J3752K1997L6687k958j4999P316m618n365
3186A6348M763Q328j9490k1949j371r492L268O437J1917L236R828k597n482J807
$$ plain form
3172 5551 6929 4725 -1976 -2891 66 2448 -18480 -38754 -26769 -20496 -1986 17592 15041 13653
3158 13653 13492 -1349 -17964 -23283 -11616 -4763 -13139 -31579 -17890 -16366 -20593 -6716 -15258
3145 -15258 -15878 -4840 14789 16690 28421 30861 19623 1962 -18377 -7508 -2872 10947 24535
3132 24535 12026 17181 18081 -7449 -19823 -19429 6766 14447 24656 22144 18646 -8668 -4650 -5197
3118 -5197 -9292 -16618 -23392 -17327 -2129 1804 4975 -5049 -7152 2939 2280 4246 1120 -20167
3104 -20167 -19111 -7209 -2373 -29792 -30303 -14829 15084 18889 14179 433 4206 16521 20968
3091 20968 24429 4266 -14162 -5703 878 -9645 4534 16220 14021 -17315 -46214 -44935 -56360
3078 -56360 -74350 -62358 -57429 -49211 -18455 1534 -6401 -22012 -20666 -2258 14304 14531 -2099
$$ packed form
3172E551J378k204o701r15K957K382k0928k0274J1985O273J8510J9578k551j388
3158A3653j61j4841j6615n319J1667O853q376j8440J3689J524m227J3877q542
3145a5258o20J1038J9629J901J1731K440j1238j7661k0339J0869M636J3819J3588
3132B4535j2509N155R00k5530j2374L94K6195P681J0209k512l498k7314M018n47
3118e197m095p326o774O065J5198L933L171j0024k103J0091o59J966l126k1287
3104b0167J056J1902M836k7419n11J5474K9913L805m710j3746L773J2315M447
3091B0968L461k0163j8428Q459O581j0523J4179J1686k199l1336k8899J279j1425
3078e6360j7990J1992M929Q218L0756J9989p935j5611J346J8408J6562K27j6630
$$ plain form
3065 -2099 22860 24451 33925 24541 16893 7163 -7154 -5344 10797 -1428 -3230 -3034 -11586 -7111
3051 -7111 -6087 -20643 -29766 -34540 -35800 -7523 3890 -1337 1123 16915 1290 -1379 -1057 -6639
3037 -6639 -16432 -6325 -1154 15197 4833 -6167 -10911 -16313 -10734 -9292 2305 9638 -4871
3024 -4871 -9531 -8000 -9950 -5043 15452 17060 23575 32453 44097 34343 11034 7184 13651 7770
3010 7770 15969 38788 45970 26718 -4102 -20252 -25222 -14518 -9829 -1192 1990 -8698 -13910
2997 -13910 -9602 4047 5793 5144 -8976 -14008 -17243 -23385 -14246 -12464 -31448 -36387 -27253 -3148
2983 -3148 6395 -10718 -14116 -22268 -35739 -65396 -56071 -19841 24695 23824 -9162 -20524 -14634
2970 -14634 -21966 -11287 -6021 -13915 -5003 -8704 -10397 -7437 -2173 -2528 -2471 -28 15135 19825 12837
$$ packed form
3065b099K4959J591R474r384p648r730j4317J810J6141j2225j802J96q552M475
3051g111J024j4556r123m774j260K8277J1413n227K460J5792j5625k669L22n582
3037f639r793J0107N171J6351j0364j1000m744n402N579J442J1597P333j4509
3024d871m660J531j950M907K0495J608O515Q878J1644r754k3309l850O467n881
3010G770Q199K2819P182j9252l0820j6150m970J0704M689Q637L182j0688n212
2997a3910M308J3649J746o49j4120n032l235o142R139J782j8984m939R134K4105
2983c148R543j7113l398q152j3471k9657R325L6230M4536q71l2986j1362N890
2970a4634p332J0679N266p894Q912l701j693K960N264l55N7K443J5163M690o988
$$ plain form
2955 12837 -2194 140 6705 -1891 -18360 -17471 564 -1478 -18666 -23078 -16058 -1372 2383 -18367
2941 -18367 -32321 -34559 -26466 -49262 -65557 -61753 -47685 -26872 -12141 543 -10501 -7494 4857
2928 4857 12004 27773 25921 28059 36046 25110 19321 -13 -14259 -18335 -7140 1744 10686 3852
2914 3852 4292 24599 39605 14720 -8349 2464 -13242 -10883 -7584 -23070 -33898 -11761 -21769
2901 -21769 -20744 582 6890 29590 28437 16474 -6411 -19833 -32613 -20448 -13564 5055 26833
2888 26833 35850 34003 31734 33566 16062 -6549 -4350 14995 24641 6430 3620 3059 -901 -5850
2874 -5850 -5385 3117 13150 42559 33659 19492 32151 34473 16176 14005 7126 -3940 -21711
2861 -21711 -12155 11110 15782 14096 -11772 -14928 9261 21910 24190 23851 12380 -4736 12801
$$ packed form
2955A2837j5031K334O565q596j6469Q89J8035k042j7188m412P020J4686L755k0750
2941a8367j3954k238Q093k2796j6295L804J4068K0813J4731J2684j1044L007J2351
2928D857P147J5769j852K138P987j0936n789j9334j4246m076J1195Q884Q942o834
2914C852M40K0307J5006k4885k3069J0813j5706K359L299j5486j0828K2137j0008
2901b1769J025K1326O308K2700j153j1963k2885j3422j2780J2165O884J8619K1778
2888B6833R017j847k269J832j7504k2611K199J9345R646j8211k810n61l960m949
2874e850M65Q502J0033K9409q900j4167J2659K322j8297k171o879j1066j7771
2861b1711R556K3265M672j686k5868l156K4189J2649K280l39j1471j7116J7537
$$ plain form
2848 12801 15205 21759 20116 18340 19796 6177 -11040 12680 53140 41423 5889 -9199 -15084
2835 -15084 -111 2922 3315 32876 36220 36103 26228 23717 10338 8574 -54 -4039 2450 12727
2821 12727 16064 19070 12810 10191 20977 18862 17010 -6709 6073 9161 -4156 -25436 -20587
2808 -20587 -23869 -13507 -21742 -36755 -7087 2985 1616 7118 7090 -4961 -12126 -13677 1983 -1495
2794 -1495 -20751 -17317 -11150 -19445 -962 954 7893 17497 24557 16136 -7128 -17153 -16558 -9140
2780 -9140 -12514 -5056 -2384 -9586 -4253 -11076 -7188 20850 -6957 -31272 -34020 -15023 -3127 16736
2766 16736 11732 16111 6005 -3796 -12320 -28237 -46232 -41769 -50399 -41679 -18255 -18179 -9621 8699
2752 8699 10691 -362 2855 11565 28217 38106 9453 -39492 -22312 -14216 -8442 -20801 -34934
$$ packed form
2848A2801K404O554j643j776J456j3619j7217K3720M0460j1717l5534j5088n885
2835a5084J4973L033L93K9561L344j17r875k511j3379j764q628l985O489J0277
2821A2727L337L006o260k619J0786k115j852k3719J2782L088j3317k1280M849
2808b0587l282J0362q235j5013K9668J0072j369N502k8j2051p165j551J5660l478
2794a495j9256L434O167q295J8483J916O939R604P060q421k3264j0025N95P418
2780i140l374P458K672p202N333o823L888K8038k7807k4315k748J8997J1896J9863
2766A6736n004M379j0106r801q524j5917j7995M463q630Q720K3424P6Q558J8320
2752H699J992j1053L217Q710J6652R889k8653m8945J7180Q096N774j2359j4133
$$ plain form
2739 -34934 -33803 -15815 -2624 -19081 -48706 -49960 -29100 -5888 -6719 -3700 7302 3245 -20431
2726 -20431 -14774 -3304 -13311 92 15993 17416 6178 1130 -127 9271 -7074 -8438 -5749
2713 -5749 -3260 -8072 438 -2121 4804 10672 8020 9062 2543 -8106 -5228 -703 3783 16177
2699 16177 17248 1770 19726 18178 5921 -17901 -12387 -5532 19400 22089 9195 23986 6125
2686 6125 3826 5470 903 5191 5000 -4202 -15616 -20612 -15518 -13527 -12192 -17744 -26804 -18322 6118
2671 6118 20814 28271 3291 -3783 -9626 -9828 4130 3305 -9099 -29865 -22130 513 4871 18077
2657 18077 34887 21942 23171 30356 28312 10782 -12382 -18825 -11582 10747 21927 14865 35473
2644 35473 43374 30417 20863 9236 2380 -18323 -27220 -20373 -24494 -29133 -36468 -33680 -13649 -16052
$$ packed form
2739c4934J131J7988J3191j6457k9625j254K0860K3212q31L019J1002m057k3676
2726b0431N657J1470j0007J3403J5901J423j1238n048j257R398j6345j364K689
2713e749K489m812Q510k559O925N868k652J042o519j0649K878M525M486J2394
2699A6177J071j5478J7956j548j2257k3822N514O855K4932K689j2894J4791j7861
2686F125k299J644m567M288j91r202j1414m996N094J991J335n552r060Q482K4440
2671F118J4696P457k4980p074n843k02J3958q25j2404k0766P735K2643M358J3206
2657A8077J6810j2945J229P185k044j7530k3164o443P243K2329J1180p062K0608
2644C5473P901j2957r554j1627o856k0703q897O847m121m639p335K788K0031k403
$$ plain form
2630 -16052 -20994 -21944 -18537 -29901 -23849 -9474 -9206 3557 859 -16244 -14149 24017 32707 -4430
2616 -4430 -27371 -35518 -38440 -35186 -38968 -26960 -28282 -29858 -17796 -22095 -29920 -19482 -25992 -43069
2602 -43069 -32795 -9093 -15404 -16933 -15094 3880 -10005 -30035 -19747 -13040 -8205 -4133 -6951
$$ packed form
2630a6052m942r50L407j1364O052J4375K68J2763k698j7103K095L8166Q690l7137
2616d430k2941q147k922L254l782J2008j322j576J2062m299p825J0438o510j7077
2602d3069J0274K3702o311j529J839J8974j3885k0030J0288O707M835M072k818
$$ [...]
##END NTUPLES=NMR SPECTRUM
##END=
