##TITLE=Analysis number 330460
Compound Code cc 50609
Book Reference 521/143
Project Code adrs
Chemist Name evam
##JCAMPDX= 6.0         $$ Bruker NMR JCAMP-DX V2.0
##DATA TYPE= NMR SPECTRUM
##DATA CLASS= NTUPLES
##ORIGIN= Bruker BioSpin GmbH
##OWNER= nmr
$$ XWIN-NMR		Version 3.5
$$ Tue Nov 27 13:50:38 2007 GMT Standard Time (UT+0h)  MAYBRIDGE\nmr@NMR_250MHZ
##.OBSERVE FREQUENCY= 250.131544655141
##.OBSERVE NUCLEUS= ^1H
##.ACQUISITION MODE= SIMULTANEOUS (DQD)
##.ACQUISITION SCHEME= undefined
##.AVERAGES= 16
##.DIGITISER RES= 18
##SPECTROMETER/DATA SYSTEM= dpx250
##.PULSE SEQUENCE= zg30
##.SOLVENT NAME= CDCl3
##.SHIFT REFERENCE= (INTERNAL, CDCl3, 0, 16.522)
##AUDIT TRAIL= $$ (NUMBER, WHEN, WHO, WHERE, WHAT)
$$ ##TITLE= Audit trail, XWIN-NMR		Version 3.5
$$ ##JCAMPDX= 5.01
$$ ##ORIGIN= Bruker BioSpin GmbH
$$ ##OWNER= nmr
$$ C:\u/data/dgb/nmr/ADRS/2340/pdata/1/auditp.txt
$$ ##AUDIT TRAIL=  $$ (NUMBER, WHEN, WHO, WHERE, WHAT)
(   1,<2007-11-27 13:49:43.56 +000>,<MAYBRIDGE\nmr>,<NMR_250MHZ>,
      <created by zg, POWCHK disabled, PULCHK disabled
       configuration hash MD5:
       76 6E 9A 78 1E 09 19 81 EC 84 63 8F B0 6A 59 2D
       data hash MD5: 64K
       37 FA 27 1F 93 E3 07 79 B1 8F 43 DF 3A E7 B5 A6>)
(   2,<2007-11-27 13:50:11.87 +000>,<MAYBRIDGE\nmr>,<NMR_250MHZ>,
      <Start of raw data processing
       ef LB = 0.3 FT_mod = 6 PKNL = 1 SI = 32K 
       data hash MD5: 32K
       5F BB 32 3E 03 E9 1D 9B AE 3E 8A 55 3E BE B3 F7>)
(   3,<2007-11-27 13:50:13.81 +000>,<MAYBRIDGE\nmr>,<NMR_250MHZ>,
      <apk 
       data hash MD5: 32K
       43 DC 8D 02 69 06 71 92 B5 A9 F6 6E 53 CC 78 11>)
(   4,<2007-11-27 13:50:14.90 +000>,<MAYBRIDGE\nmr>,<NMR_250MHZ>,
      <abs ABSG = 5 
       data hash MD5: 32K
       17 8A 69 88 FF E0 E7 7F 0D A5 12 9D 77 3B 27 99>)
$$ ##END=
$$ 
$$ hash MD5
$$ 62 63 5E B4 EF 29 68 E1 96 BD 20 6B 68 11 85 6C
##$RELAX= 
##$RELAX= 
##$RELAX= 
##$RELAX= 
##$RELAX= 
##$RELAX= 
##$RELAX= 
$$ Bruker specific parameters
$$ --------------------------
##$DU= <C:\u>
##$EXPNO= 2340
##$NAME= <ADRS>
##$PROCNO= 1
##$TYPE= <nmr>
##$USER= <dgb>
##$AMP= (0..31)
100 100 100 100 100 100 100 100 100 100 100 100 100 100 100 100 100 100 
100 100 100 100 100 100 100 100 100 100 100 100 100 100 
##$AQSEQ= 0
##$AQ_mod= 3
##$AUNM= <au_zg>
##$AUTOPOS= <14 >
##$BF1= 250.13
##$BF2= 250.13
##$BF3= 250.13
##$BF4= 250.13
##$BF5= 500.13
##$BF6= 500.13
##$BF7= 500.13
##$BF8= 500.13
##$BYTORDA= 1
##$CFDGTYP= 0
##$CFRGTYP= 5
##$CHEMSTR= <none>
##$CNST= (0..31)
1 1 145 1 1 1 1 1 1 1 1 1 1 1 1 1 1 1 1 1 1 1 1 1 1 1 1 1 1 1 1 1 
##$CPDPRG= <>
##$CPDPRG1= <>
##$CPDPRG2= <>
##$CPDPRG3= <>
##$CPDPRG4= <mlev>
##$CPDPRG5= <mlev>
##$CPDPRG6= <mlev>
##$CPDPRG7= <mlev>
##$CPDPRG8= <mlev>
##$CPDPRGB= <>
##$CPDPRGT= <>
##$D= (0..31)
0 1 0 0 0 0 0 0 0 0.06 0 0 0 0 0 0 0.0002 0 0 0 0 0 0 0 0 0 0 0 0 0 0 
0 
##$DATE= 1196171373
##$DBL= (0..7)
120 120 120 120 120 120 120 120 
##$DBP= (0..7)
150 150 150 150 150 150 150 150 
##$DBP07= 0
##$DBPNAM0= <>
##$DBPNAM1= <>
$$ [...]
##$SUBNAM7= <"">
##$SUBNAM8= <"">
##$SUBNAM9= <"">
##$SW= 20.6930455092707
##$SWIBOX= (0..15)
0 0 3 0 0 0 0 0 0 0 0 0 0 0 0 0 
##$SW_h= 5175.983436853
##$TD= 65536
##$TD0= 1
##$TE= 295.16
##$TE2= 300
##$TE3= 300
##$TEG= 300
##$TL= (0..7)
0 120 120 120 120 120 120 120 
##$TP= (0..7)
150 150 150 150 150 150 150 150 
##$TP07= 0
##$TPNAME0= <>
##$TPNAME1= <>
##$TPNAME2= <>
##$TPNAME3= <>
##$TPNAME4= <>
##$TPNAME5= <>
##$TPNAME6= <>
##$TPNAME7= <>
##$TPOAL= (0..7)
0.5 0.5 0.5 0.5 0.5 0.5 0.5 0.5 
##$TPOFFS= (0..7)
0 0 0 0 0 0 0 0 
##$TUNHIN= 0
##$TUNHOUT= 0
##$TUNXOUT= 0
##$USERA1= <user>
##$USERA2= <user>
##$USERA3= <user>
##$USERA4= <user>
##$USERA5= <user>
##$V9= 5
##$VALIST= <valist>
##$VCLIST= <CCCCCCCCCCCCCCC>
##$VD= 0
##$VDLIST= <DDDDDDDDDDDDDDD>
##$VPLIST= <PPPPPPPPPPPPPPP>
##$VTLIST= <TTTTTTTTTTTTTTT>
##$WBST= 1024
##$WBSW= 4
##$XGAIN= (0..3)
0 0 0 0 
##$XL= 0
##$YL= 0
##$YMAX_a= 339506
##$YMIN_a= -408742
##$ZGOPTNS= <>
##$ZL1= 120
##$ZL2= 120
##$ZL3= 120
##$ZL4= 120
##$ABSF1= 16.522
##$ABSF2= -4.171173
##$ABSG= 5
##$ABSL= 3
##$ALPHA= 0
##$AQORDER= 0
##$ASSFAC= 0
##$ASSFACI= 0
##$ASSFACX= 0
##$ASSWID= 0
##$AUNMP= <proc_1d>
##$AZFE= 0.1
##$AZFW= 0.1
##$BCFW= 0
##$BC_mod= 0
##$BYTORDP= 0
##$COROFFS= 0
##$CY= 12.5
##$DATMOD= 1
##$DC= 0
##$DFILT= <>
##$DTYPP= 0
##$F1P= 14.0000005364418
##$F2P= -0.99999901652339
##$FCOR= 0.5
##$FTSIZE= 32768
##$FT_mod= 6
##$GAMMA= 0
##$GB= 0
##$INTBC= 1
##$INTSCL= 1
##$ISEN= 128
##$LB= 0.3
##$LEV0= 0
##$LPBIN= 0
##$MAXI= 10000
##$MC2= 0
##$MEAN= 0
##$ME_mod= 0
##$MI= 0
##$NCOEF= 0
##$NC_proc= -3
##$NLEV= 6
##$NOISF1= 0
##$NOISF2= 0
##$NSP= 0
##$NTH_PI= 0
##$NZP= 0
##$OFFSET= 16.522
##$PC= 1
##$PHC0= 169.5405
##$PHC1= 6.465929
##$PH_mod= 1
##$PKNL= yes
##$PPARMOD= 0
##$PSCAL= 4
##$PSIGN= 0
##$REVERSE= no
##$SF= 250.13
##$SI= 32768
##$SIGF1= 0
##$SIGF2= 0
##$SINO= 400
##$SIOLD= 32768
##$SREGLST= <1H.CDCl3>
##$SSB= 0
##$STSI= 32768
##$STSR= 0
##$SW_p= 5175.98343685301
##$SYMM= 0
##$S_DEV= 0
##$TDeff= 65536
##$TDoff= 0
##$TI= <Analysis number 999999
Compound Code 99
Book Reference 9
Project Code 9>
##$TILT= no
##$TM1= 0
##$TM2= 0
##$TOPLEV= 0
##$USERP1= <user>
##$USERP2= <user>
##$USERP3= <user>
##$USERP4= <user>
##$USERP5= <user>
##$WDW= 1
##$XDIM= 32768
##$YMAX_p= 512909889
##$YMIN_p= -119194
$$ End of Bruker specific parameters
$$ ---------------------------------
##NTUPLES= NMR SPECTRUM
##VAR_NAME=  FREQUENCY,     SPECTRUM/REAL,   SPECTRUM/IMAG
##SYMBOL=    X,             R,               I
##VAR_TYPE=  INDEPENDENT,   DEPENDENT,       DEPENDENT
##VAR_FORM=  AFFN,          ASDF,            ASDF
##VAR_DIM=   32768,         32768,           32768
##UNITS=     HZ,            ARBITRARY UNITS, ARBITRARY UNITS
##FACTOR=    0.157963299565203, 1,           1
##FIRST=     4132.6476996994, 0,             0
##LAST=      -1043.33573715361, 0,           0
##MIN=       -1043.33573715361, -119194,     0
##MAX=       4132.6476996994, 512909889,     0
$$ Real data points
##PAGE= N=1
##DATA TABLE= (X++(R..R)), XYDATA
$$ [...]
19265 73247 62773 64668 52799 30411 -9023 -18458 980 11886 9189 36045 40184 11578
19253 11578 8146 23130 8005 -26380 -33681 -32522 -18577 -23548 4153 23314 293 -27937
19241 -27937 -9745 12375 17032 5348 -6825 13149 13924 1510 -9459 -2087 -2720 20338 3338
19228 3338 5343 -11230 -17384 -15929 -7600 17487 10460 -12450 -40485 -34655 -13112 -4111 11771
19215 11771 31656 15946 2348 -2323 -16224 -22555 -26761 -21411 -4518 -38729 -58707 -59588 -55273
19202 -55273 -34527 -31448 -33327 -21770 -34748 -57668 -65776 -28176 3141 24922 6346 -4649
19190 -4649 26728 4978 -11497 -35804 -28626 -25256 -30963 -27976 -19065 -17183 -27696 -13556 7008
19177 7008 32356 -744 -6268 -663 1691 1117 1906 23961 51044 49242 31359 8951 29964
19164 29964 52239 21129 -5331 -23454 -24605 5260 -13920 -22636 -26138 -13156 13835 28149
19152 28149 35202 26640 28295 -6926 -37930 -28228 -16510 -4134 12700 -12818 -16521 -25714 -26580
19139 -26580 -29269 -2551 12262 26594 15914 42251 32312 -5537 167 9301 4989 -9186 5287
19126 5287 -7816 -24590 -42970 -49861 -34245 -33248 -28838 -5952 1491 7003 -7646 4057 -6081
19113 -6081 5687 20261 4001 20234 24001 21230 15309 28702 24692 1610 14185 16015 -16616
19100 -16616 -14654 9268 5108 -13516 -14236 -7288 -22416 -36584 -46387 -58066 -79461 -64201 -79385
19087 -79385 -82931 -55939 -30442 -4600 8545 -9398 -29510 -59091 -100404 -55520 -27988 -19032
19075 -19032 4129 8220 4565 -4908 -2799 -4847 -13310 -58070 -76884 -34171 9374 14106 -4684
19062 -4684 -22381 -33781 -29815 -41918 -23318 8066 10069 3472 -41795 -38561 -5812 13769 21784
19049 21784 9568 -15396 -15242 -14241 4491 13930 14222 8287 12309 25936 29243 42686 53923
19036 53923 53848 36963 -3891 10736 14843 2358 -17953 2972 -10422 -14795 6603 22676 35112
19023 35112 22145 1068 -6939 -20534 -24133 -38417 -36723 -25607 -25584 -21095 -35940 -19767 -9710
19010 -9710 -4625 -7092 20323 -6961 -14679 -20309 -7191 578 6389 19935 -2614 -27948 -26643
18997 -26643 -29649 -10480 277 40 -2317 48217 46401 37258 27562 12083 -33749 -16847 9269
18984 9269 -8990 -9153 -1000 -9929 1784 -4103 -34231 -20270 -711 -19079 -28981 -30607 -26760
18971 -26760 -45405 -45361 -20035 -5500 -16306 -33205 -30670 -27910 -5034 -16813 -40268 -13503 14403
18958 14403 -41066 -56369 -30661 35317 73142 55123 20226 18158 41317 50481 58243 38863
18946 38863 42242 -7086 11771 44510 40917 23859 17001 -6894 -2648 5688 11402 8497 25728
18933 25728 9281 24454 15391 1885 37563 14061 -6771 5563 15260 48159 76024 52259
18921 52259 101592 115674 98125 99116 99434 108579 96838 77766 65080 67134 62321 76056 58075
18908 58075 48627 23864 23533 34641 27809 5953 -17653 7955 62858 78676 39931 2911
18896 2911 -8150 -11427 5715 15295 9367 -16616 -20554 -80 7336 13661 15552 -12503 -28155
18883 -28155 8743 12282 11084 -7319 -24964 -8333 -2818 27123 21913 -1382 22825 42655
18871 42655 29833 13475 -3137 -4992 2893 23241 22047 -16487 -31134 -13248 3702 11822
18859 11822 8233 -20370 -22850 -63301 -70305 -66545 -38293 -178 17235 17302 24131 11258 17993
18846 17993 47787 42707 -12145 -39791 -8271 16332 13370 -3614 -7028 -12199 -11549 -33482 -59594
18833 -59594 -49793 -49217 -47812 -45915 -32293 -4117 13809 21792 13974 15852 12645 -8027 -16654 -30029
18819 -30029 -9212 -9549 -10603 -36947 -67601 -45642 -15680 -36041 -67937 -46727 -31345 -5575
18807 -5575 -3272 -22107 -50185 -48879 -19640 -8295 -19712 -10789 22618 11778 -25056 -6457
18795 -6457 -11683 -18633 -18171 16843 29724 7948 -19005 -45 8915 5088 10648 17969 -7514
18782 -7514 -12949 -3 14906 470 -23957 -15860 -12281 13894 17676 26947 57381 82202 135251
18769 135251 228288 351455 305608 233367 167817 120773 74694 49259 44523 21892 17971 42434
18757 42434 64618 66537 51575 26218 -16519 -35324 -16158 -46813 -61468 -74430 -41349 -32295
18745 -32295 -40398 -31797 -34547 -16213 2066 18454 30521 22612 -8311 -20361 -40580 -59255
18733 -59255 -37635 -11438 -8900 -19387 -20986 -886 2463 -8070 -11944 -4932 -38205 -54435 -48373
18720 -48373 -1395 7152 1774 20644 9278 -9805 2939 -3620 -6412 -7134 -29529 -56707 -47394
18707 -47394 -53515 -24961 -61 1814 14424 19775 25876 -14624 -10750 -2220 -6989 -936 -7747
18694 -7747 -43936 -42753 -21795 4054 7379 -3802 4691 -13200 -32691 -7491 -29812 -60559
18682 -60559 -67595 -52276 -58475 -30605 -18416 -15577 -4605 -19609 -17203 -5719 -21630 -31501 -14275
18669 -14275 42743 60856 41488 31062 -772 4999 20605 -3515 -16315 -37154 -32110 -37059
18657 -37059 -58440 -66246 -76231 -71047 -45643 -46294 -35489 -21138 -30870 -6008 10875 -3007 -10321
18644 -10321 -6394 -10386 -31287 -52533 -43458 -51914 -33225 -39655 -48160 -39706 -34914 -27304 -15015
18631 -15015 -27324 -46746 -51585 -42229 -22767 -17008 -19890 -20809 -22499 850 -21451 -23733 -175
18618 -175 8003 25087 2446 -16760 -5847 -10002 30360 31863 -16006 -44186 -50284 -2537 24116
18605 24116 38844 33783 -8122 -39224 -32196 -13269 -11079 -10401 8301 2909 739 14377 18546
18592 18546 -4756 -39202 -49899 -20016 6297 8840 -7256 4882 11852 9833 8321 4342 -14986
18579 -14986 -466 -17137 -17852 2712 11020 5653 -13133 -3727 33402 46613 35924 20868 11898
18566 11898 3975 14959 19529 15125 18565 16173 8081 -35812 -32542 -9745 5336 -15026 -58893
18553 -58893 -51505 -9253 -3615 4808 -3351 -350 -15493 -10270 -16458 -13328 -5538 -26376 -27390 -15807
18539 -15807 -23142 -10280 38624 45331 13412 17947 13485 -3315 6734 41438 15418 -18018
18527 -18018 -2960 -38782 -75676 -86855 -54312 -44536 -57563 -67722 -53454 -9007 11667 556
18515 556 10931 2685 -18770 -17901 -36878 -67569 -68317 -75360 -52375 -36761 -38106 -29631 2243 29405
18501 29405 2880 -1344 1336 -14414 -37476 -50297 -5841 8506 -16564 -30297 -35148 -23252
18489 -23252 -34420 -5061 892 -13453 -689 1642 6939 6437 21301 10271 -997 10611 25183
18476 25183 21116 49155 55882 28424 -479 -24485 -29484 -48726 -41223 -17130 -20199 -30692 -22946
18463 -22946 -30743 -5803 18984 11669 5189 367 -27350 -16141 -11640 -10024 28647 21763 10504
18450 10504 1260 6714 15642 -2344 25315 53981 60609 43738 16895 15858 -8613 -52168 -80300
18437 -80300 -85966 -57019 -37384 1342 -12669 -13082 -30291 -44837 -22496 7357 3341 -18122
18425 -18122 5215 14901 -7533 -9216 -33269 -64302 -61861 -38376 -44184 -38391 -10686 -15839 -30490
18412 -30490 -16858 -17049 -10505 -14549 -19217 -1976 -5507 39567 56757 33769 28989 3048 -16289
18399 -16289 -33332 -15192 -18858 -13685 -4644 -9085 7439 30411 39221 61573 67348 59665 35305
18386 35305 -3059 5612 29689 25767 13776 12978 17813 43502 68405 43422 5583 -16739 -20439
18373 -20439 1257 7810 19199 -6465 -35690 -43102 -59095 -37838 3074 24492 67024 67852
18361 67852 21677 -373 8138 8964 13904 -13666 -6894 13058 -4836 1111 -20187 -27497 -7589
18348 -7589 -15357 -29895 -43116 -71808 -55275 -21248 -14596 -47493 -32497 -1040 6236 -5 7613
18335 7613 9296 10414 6336 -15055 -50165 -47253 -12256 -1909 -15917 -6002 -3345 -9666 -18528
18322 -18528 -32782 -36300 -5502 42152 68916 42227 24751 42630 24849 28467 59912 34551
18310 34551 -2680 -17618 18277 18072 16968 -7803 -44260 -33846 -10279 -4099 6804 17039
18298 17039 21350 -153 29257 41073 9076 19895 13946 4578 -2276 -5439 16888 30025 28546
18285 28546 6406 14805 41169 56846 59955 38513 38428 45966 17811 7094 11471 14122 -10057
18272 -10057 -3324 5571 -19366 -11874 -38433 -32255 -26936 -6437 28426 23075 9154 -45084 -67346
18259 -67346 -57428 -77942 -47484 -16500 1381 -5596 -11075 -24922 -21466 -13289 -18809 -15940 -19284
18246 -19284 -52956 -58135 -45759 -47567 -28505 -48287 -33804 -32069 -59102 -58381 -36872 9103 17343
18233 17343 23721 297 17657 16916 9964 -7918 -365 6952 8874 29519 32590 11347 -12545
18220 -12545 -14003 5270 22326 3187 -17740 -25229 -7467 -2572 -6711 12618 -5064 -28925
18208 -28925 -35800 -38451 -30631 -66314 -75582 -33740 -27789 -28371 -30881 -25827 -13284 7007 27692
18195 27692 -3295 -51327 -46748 -2841 44987 45616 44774 29857 10134 8205 882 -2298 -27041
18182 -27041 -24251 -25083 5867 40869 34578 16011 14113 -4501 -11041 6759 10143 2635 4188
18169 4188 15298 19852 33187 46044 40954 31009 41374 65189 47634 43959 64039 68242 80847
18156 80847 99673 97169 91311 67950 74234 70258 70833 84570 77826 80878 98730 127026 114351
18143 114351 115191 140928 165514 184270 204436 246679 246406 236249 264000 267067 309290 340877
18131 340877 367062 406625 472882 530129 563201 594471 651100 752648 919223 1084005 1252116
18120 1252116 1513852 1898869 2439577 3236393 4481973 6488635 9342424 13532391 20968067
18111 20968067 36484402 60361184 62765019 47458354 35725374 27117976 19094383
18104 19094383 12764530 8666050 6246670 4803478 3855277 3169773 2598403 2149428 1839921
18095 1839921 1601549 1391865 1227127 1085604 960354 818435 727611 671963 616180 530218
18085 530218 473982 386068 327803 342166 315892 264781 248563 247485 231792 215053 229701 212430
18073 212430 207775 227868 212095 178355 199166 189363 168917 139526 139802 132041 138434 134720 95249
18060 95249 79857 82565 84627 70752 64889 68958 59257 72041 81581 81783 81250 90102 116262 119315
18046 119315 84432 89604 82872 72152 86291 86849 96909 66402 27621 -13131 -47618 -15572
18034 -15572 10570 41012 71156 82251 60602 51032 27316 6028 11679 15565 35340 48791
18022 48791 19565 24174 28398 4085 3431 8412 18865 46543 36014 17995 25103 56548 72696
18009 72696 49854 44474 51184 39610 15387 19877 36421 65441 66927 54952 37772 -987
17997 -987 -16608 31896 45579 14932 -132 3537 -25208 -44979 -42461 -6023 -14684 -21033 -30171
17984 -30171 -33698 22684 67896 69325 60963 68085 77338 91288 83674 64989 20212 37727 48541
17971 48541 41237 20802 11170 -8307 -9116 3915 4614 28245 41514 18421 19814 30016 48605
17958 48605 52580 50653 44111 40387 29206 8298 36552 41900 25739 29727 38363 21025 29516
17945 29516 40100 16553 20602 45601 84902 55377 39695 51814 43756 28396 23841 14410
17933 14410 23273 18970 13398 2997 -38587 -29095 16532 59332 58569 23427 38960 15727 -40170
17920 -40170 -33411 -2840 13313 18647 38803 57877 32547 47844 52136 14731 -8791 8644
17908 8644 -2911 -4337 -35641 -71057 -80150 -40181 23442 8654 -889 24899 -4518 -43890
17896 -43890 -33657 -13806 37226 34031 22704 15306 38212 3205 -3711 13611 -5909 -12177
17884 -12177 -39511 -62014 -62707 -75718 -36213 19489 15060 -26004 -38670 -20007 -40677 -73465
17872 -73465 -37526 -32813 -66216 -73755 -17216 34592 56754 54471 34215 5060 -33788 -32038
17860 -32038 -9754 3142 694 -12859 -34922 -47329 -13761 -14490 -4719 -1675 -7833 -49811 -51208
17847 -51208 -42460 -7147 -25801 -33752 -7301 -9502 6862 57213 72406 45431 -1282 -28736
17835 -28736 -11429 -8007 -2466 9749 16929 14119 4782 7922 8502 1323 10402 10819 2570 -3075
17821 -3075 -12634 19718 19882 -7268 -14292 10930 36730 41460 22267 -8365 -19074 -35574 -19499
17808 -19499 2645 622 2908 -19000 -19010 514 14431 18825 2200 14059 52545 54472 38930
17795 38930 18694 8394 -19639 -33896 -40693 -51673 -43273 -34277 -44368 -26677 -4995 20824
17783 20824 19484 23759 44525 29111 -3446 -8484 -26661 -54754 -63670 -54919 -34026 -37193 -41022
17770 -41022 -21788 18008 35286 15099 6042 1386 -6837 -24583 -43165 -27960 -7219 -15002
17758 -15002 -3923 -817 -28655 -41482 -55416 -35284 -9823 3144 6233 9833 -4342 -2426
17746 -2426 25048 21174 27819 22559 22970 14597 21618 -5455 -21842 1599 12714 -16270 -49203
17733 -49203 -56429 -70622 -64979 -31733 -24203 -23085 -15330 -22765 26426 28714 7370 -13245 -9542
17720 -9542 3409 34342 41824 17922 -1583 7741 8822 -12343 -15282 23305 31789 50556 67515
17707 67515 54663 36005 33092 43993 54227 72971 105719 131303 131365 126472 106973 124171 135755
17694 135755 106627 88528 63926 65619 51303 36427 66212 88342 97474 75701 74863 63624
17682 63624 48444 56525 58568 24029 -7838 -23399 -35566 -14987 25737 9116 -9187 -9163 -12847
17669 -12847 -26772 -41902 -44651 -5935 23322 42003 59993 48478 51614 50066 51972 39994
17657 39994 15798 5097 14027 -5209 -53580 -85965 -48859 14699 21915 -10665 -10496 -5760 2228
17644 2228 54411 58183 32260 19821 13638 4989 -5236 -15663 5440 12015 10816 12420 18794
17631 18794 16939 10544 -8448 -20591 -10408 -9839 -27476 -41038 -44434 -42235 -8163 -4737 -16025
17618 -16025 141 32560 38935 7466 26325 24497 8633 -26663 -52422 -42873 16431 42178
17606 42178 28671 27783 43850 34977 41874 70309 61667 82031 43543 21044 27055 26183 65411
17593 65411 89025 55094 42653 47134 11964 -2417 24205 34241 51320 42764 17596 25079
17581 25079 36706 31909 6177 -10797 -7779 6147 22562 32975 48805 44614 56356 51131
17569 51131 33024 41889 72917 87708 64313 37740 47328 70355 79534 99696 96241 45809
17557 45809 -8189 13654 45285 54122 38102 44623 52835 35742 10169 9182 -13642 -21416 -24728
17544 -24728 7271 11392 9789 -41123 -68088 -50986 -23591 -24431 -50703 -56948 -45488 -10600 2990
17531 2990 -2402 -6542 -25782 -27569 -14463 -16021 -17816 -6905 12001 17655 47447 64736 20476
17518 20476 -51187 -51783 -26756 -42042 -51411 -17655 -21638 -15444 17397 64840 38540 14429 16189
17505 16189 22480 27669 28041 28721 16403 -17700 -39248 -42851 -42726 -51982 -46828 -30337 -50009 -25014
17491 -25014 -15260 -18938 -18662 -37039 -42056 -35557 -16616 14668 -8428 -4562 6604 -13182 -5041
17478 -5041 -21474 -53999 -70830 -11589 43508 50961 65063 53788 54395 66349 25769 39195
17466 39195 68165 30037 1533 9311 -2975 -31100 -44363 -5241 -2693 15902 40158 69651
17454 69651 61631 5486 -18522 -22816 -31706 9014 44020 108715 167489 247500 345543 373290
17442 373290 290175 227974 155255 80907 55622 27693 25800 38701 54217 35679 -9585 3029
17430 3029 6521 4231 703 11648 26696 8307 2670 -11397 -13783 1097 15133 15306 25578
17417 25578 21906 -9984 -12532 7681 38279 50473 47758 42103 6205 -2354 17540 18909 23420
17404 23420 27959 18536 26490 24401 42044 45587 44760 26000 32841 13965 -16175 7509 10602
17391 10602 -4936 -10505 -8169 23724 56614 23306 2036 -3000 19785 47173 50245 51442 29967
17378 29967 9604 26263 50841 35524 7791 11307 21454 24856 23748 9476 -49568 -42894
17366 -42894 1071 16215 9591 10939 -14282 -34254 -16723 10111 37041 3908 -16852 -21529
17354 -21529 -10462 -39653 -34868 -21858 -19303 4990 7925 12464 20485 25235 37141 33556 25751
17341 25751 40915 13204 13981 18654 23641 36458 30858 23633 11337 1083 -4188 -9022 -8378 16781
17327 16781 16254 18344 30433 52068 52801 34677 -7917 -6171 20772 49075 68150 69937 64194
17314 64194 57363 44420 60096 55691 60342 25561 3119 13050 30533 49549 67860 66904 42941
17301 42941 20890 32942 90096 85725 57813 67703 62863 58471 41893 27383 45499 52654 43668
17288 43668 11956 7552 40031 79683 81333 60291 25348 55925 60002 66004 73715 58592 30769
17275 30769 26459 50497 79904 82336 54152 33347 1893 36897 62328 55074 38287 7968
17263 7968 43918 107182 95873 89619 92923 77043 71887 68015 85542 63956 68332 72456 67927
17250 67927 89637 112645 134740 134830 127347 131419 134522 126266 146977 143395 127264 112439 102681
17237 102681 123131 141825 139152 132816 169320 191838 189584 210722 225216 253550 300334 324208
17225 324208 347257 374229 391984 456691 517743 576414 644008 726172 843266 958001 1083569
17214 1083569 1245391 1395717 1601420 1895878 2280767 2770266 3460696 4420274 5598015
17205 5598015 6847798 7952211 9135537 10821825 13182710 15774406 17743349 18990023
17197 18990023 20163294 21633452 23340210 24811802 25730471 26453913 26644168 25728999 24348135
17188 24348135 23275698 22698745 21997379 20233052 17690052 15235675 13255978 11643857
17180 11643857 10081812 8466823 6962122 5692627 4685167 3852547 3155607 2633758
17172 2633758 2244338 1931159 1703937 1492196 1326250 1188203 1077331 976086 871052
17163 871052 784908 712589 619371 559593 553613 531779 511657 482947 469432 428439 363228 324724
17151 324724 299629 289339 287657 299040 287166 261723 241402 261940 265382 228254 211646 202708
17139 202708 213605 209674 169399 160713 181762 204007 193925 192930 212794 214929 203527 171619
17127 171619 137842 125067 154223 174824 196047 206128 208058 198768 208180 241015 274891 297064
17115 297064 301836 314124 298467 306357 320817 356535 392687 436022 496482 565149 622613 679184
17103 679184 743445 861169 978761 1120484 1319449 1603861 1942656 2416461 3150610 4292989
17093 4292989 5843305 7400393 8654732 10091837 12156202 13923703 14281983 14234566 14729905
17084 14729905 15281068 14975900 14320202 14251026 14464165 13692926 12164171 10861134 9819439
17075 9819439 8517726 6996877 5678901 4663882 3887074 3308198 2906182 2673595 2597801
17066 2597801 2668127 2799518 3073885 3542888 4351990 5590163 7068194 8298944 9419554
17057 9419554 11068183 13069701 14037189 13957905 14145384 14779697 14896984 14262120 13873725
17048 13873725 14103630 13916213 12550519 11038159 9933951 8800069 7302165 5793850
17040 5793850 4554748 3585593 2812373 2239779 1819024 1517644 1331739 1174480 1033532
17031 1033532 940812 853585 774672 725875 656389 588044 522259 483156 460607 421730 369807
17020 369807 315062 288958 271469 264375 254350 209020 190724 184648 167350 172776 197519 190941
17008 190941 162423 151264 160043 151043 139020 136153 122000 84764 56270 77694 90807 42694
16996 42694 53619 53310 62168 89457 97936 99956 108693 99586 48032 22205 46414 59542 40167
16983 40167 11451 -8565 656 30057 5370 -14862 -4992 14971 48441 67753 57963 88917
16971 88917 91549 91110 87899 40529 2538 -23390 -39537 -15383 39876 42145 76694 94579 60797
16958 60797 42641 40411 23212 19627 28907 21552 55077 71600 56153 54339 93889 109053 98464
16945 98464 68516 38414 37184 20169 36235 35290 40527 5308 8288 41005 56035 52352 34905
16932 34905 18477 18569 50075 40761 28025 44533 31702 22830 29066 36678 27651 14017 24695
16919 24695 27372 30692 22012 29961 -1942 5622 26651 42637 39513 26099 18565 21584 575
16906 575 -10267 -5004 -4515 -34544 -16186 37417 42493 53219 55792 47078 40745 46694 21397 -2575
16892 -2575 -5084 3273 27654 29695 -5674 -20590 5573 25135 1698 -37242 -23293 -14594 -17598
16879 -17598 -15716 -17852 -34505 -29685 -4062 45196 56610 58474 30317 32995 30236 8840 8785
16866 8785 20271 38112 65736 60731 12691 -20055 -41511 -16351 123 -24351 -18402 -22125
16854 -22125 -24183 6077 -16488 -35694 -14776 -36330 -22842 8683 26094 41547 53483 36573
16842 36573 23727 18028 -2385 -14266 14728 -8154 -12379 21835 31387 41693 35160 -8682
16830 -8682 -43370 -12352 28764 32166 50801 19712 -12381 10913 29505 57742 49309 24792
16818 24792 13723 27093 50118 42270 12795 3237 -4700 -9614 -1421 -4334 -15826 -1857 13969
16805 13969 24431 3965 12575 22015 18430 -10903 -40689 -24140 -18008 -11329 -2076 -8328 25808
16792 25808 52159 42422 59999 70382 32912 17409 17416 -15253 -12381 3281 -7656 -19649 -4063
16779 -4063 4038 -11088 9356 27611 35031 24408 6182 -23640 -26626 -22075 -12679 -17166 -41985
16766 -41985 -21288 2368 -26036 -16913 -9535 -3236 -4249 2460 21347 25966 40753 74945 83720
16753 83720 78167 53080 37700 24844 46916 31153 16683 -4270 1295 3208 11287 -506
16741 -506 -15491 -12999 -43205 -33207 -8524 4735 3669 1941 -23444 -15693 23378 21737 2992
16728 2992 28070 17065 -18314 -25769 -23856 -42500 -26429 -24891 -54663 -50826 -20145 -11202 -22128
16715 -22128 -6250 6995 1084 6681 10871 -13003 -5538 -151 -37799 -63824 -38105 11840 35634
16702 35634 33021 45696 36882 2545 23969 47529 47563 59092 72451 69758 76723 75815 90548
16689 90548 78088 82900 88508 96459 84945 81658 99829 104419 113072 106161 125294 112186 111425
16676 111425 75023 42681 31366 3792 7956 29891 20822 -2137 -3432 -17097 -14834 14673
16664 14673 9847 -17100 -11391 3559 19006 10884 -27573 -22255 2159 22447 18649 -18389 -39378
16651 -39378 -8416 4206 10122 12380 2266 1270 -21774 -19437 -19426 -24096 -24941 1281 17745 22778
16637 22778 15531 -7489 -7991 3684 13499 15509 16987 5615 -25861 -44108 -48454 -59216 -57069
16624 -57069 -52611 -22416 1061 -6368 -1305 7310 -3691 -34794 -24846 2693 3064 13382 12553
16611 12553 33675 22668 1627 32950 39231 40240 59870 19443 -17142 -25899 -2590 28264
16599 28264 22784 33 24227 13531 -8310 22992 40667 31860 10485 11801 26835 37580
16587 37580 36987 28406 -888 15245 25196 15355 14495 13431 23028 24440 28477 35710 29407 12463
16573 12463 -21727 13561 45131 27795 19180 13061 21335 27811 64227 69648 64138 60836 58223
16560 58223 37078 22757 15891 30693 41700 33887 30031 24822 5186 35150 45178 46408 29645
16547 29645 20351 26236 27933 35408 34678 44510 48242 35720 52856 50974 37011 53025 64084
16534 64084 84675 73185 46803 58508 83023 80570 78303 78725 69311 58810 48601 27653 18974
16521 18974 2799 16037 5863 -2520 -16036 -24625 -23521 -25882 -19616 117 -9904 -13472 -14428
16508 -14428 -19439 -10053 -16210 -35826 -30800 -13257 14986 10210 -3251 -41900 -38411 -24516 1537
16495 1537 19987 24576 4494 4107 -5561 -20135 -39372 -13535 12231 27434 14591 15769 20178
16482 20178 21411 37810 15675 -17449 -35496 -20184 -16760 -28489 -41580 -53019 -38096 -8314
16470 -8314 -13951 -8599 26107 50283 22343 8787 -10341 1743 -28946 -32786 -29083 -35547 -48503
16457 -48503 -47251 -58933 -46390 -35407 -2933 19408 25343 -8249 -28147 -18147 -36367 -28054
16445 -28054 -21529 -13321 -5179 14427 14667 3415 -27326 -30702 -35711 -38596 -36346 -4834 44834
16432 44834 29769 19734 28933 50368 22223 -16185 -30752 -36780 -23010 7666 20668 7829
16420 7829 -4709 10561 7541 -21241 3032 1325 -7281 2702 15404 7996 -3051 9757 34194
16407 34194 37564 42863 38807 -1118 -21324 -11251 -11750 -32556 -31105 -31766 -36321 7167 21939
16394 21939 703 -13386 6877 26704 731 -5997 -24349 -43474 -30118 -11122 30071 52988
16382 52988 15500 -27763 -22225 3249 17308 44525 33504 23750 24421 5543 -22279 -24564 -27485
16369 -27485 -30488 9437 23637 -19097 -54264 -46404 -43781 -60237 -37960 -9955 4406 38523
16357 38523 38800 50412 48774 33064 19870 -16965 -13462 7378 6750 -13505 -1532 4330 -24208
16344 -24208 -34909 -36379 191 30029 -125 -20094 -5600 -2948 3410 1425 5259 -5227 -13381
16331 -13381 11539 25577 -686 -146 -672 -6857 -21566 -45896 -33839 -7263 -25997 -40001 -34969
16318 -34969 -6391 -4914 -18566 6868 14717 14042 16840 -4568 -7780 -57166 -56280 -37184 -14562
16305 -14562 26089 19772 14001 9828 30771 29541 1107 -35619 -28445 -11730 -15281 -19286 -7049
16292 -7049 -12514 -25758 -26755 2565 19240 42111 43978 34478 38368 26854 -5918 -33817 -2658
16279 -2658 -9464 -13110 -10230 -771 26611 16355 -103 3534 -3879 -4406 -27575 -42647 -20516
16266 -20516 -28431 -26190 1935 -2248 -3738 3958 3764 14470 17640 21853 11185 8363 14096 7255
16252 7255 -40 -12571 -16260 -35296 -74206 -67091 -23876 -14682 -45521 -36456 -7060 2163 -20409
16239 -20409 -25542 -41061 -59439 -63150 -60253 -35459 -25135 -4574 -1275 -446 -5990 10021 -2829
16226 -2829 -8115 -4252 1043 14163 14337 -24895 -35171 -3716 20243 -4954 -34998 -21685 -19306
16213 -19306 -16875 4124 12355 2927 10785 6487 28926 47804 55390 55702 67148 74099 22924
16200 22924 -10144 -4744 15589 29283 6979 -11248 9657 19374 24962 -78 -43229 -49452
16188 -49452 -20014 -30757 -39192 -52135 -45695 -21171 19310 29619 24079 1712 -35932 -62376
16176 -62376 -42200 -21139 -57048 -83185 -69636 -29723 5222 8714 3544 4037 -7192 -19738
16164 -19738 -40413 -41150 -28496 -39508 -39524 -20824 5612 -19329 -14925 -6569 1971 -613 2162 17591
16150 17591 7375 -5654 -24721 -17737 -27169 -10485 2884 10491 -1120 -6585 -13188 -6512 20299
16137 20299 1519 -6845 -31182 -39027 -36924 -26904 -4106 -5563 -17225 -21063 -23568 -28369 3056
16124 3056 15200 -20451 -17806 -6263 7237 -1818 5399 13640 -6174 774 13598 -22383 15172
16111 15172 5240 -9034 274 8145 5363 6139 -21685 -27698 -33382 -32518 -19889 -6840 -35774 -48740
16097 -48740 -64830 -24755 -23592 -12812 -17851 -3710 28820 64328 59247 49554 19424 14660 15378
16084 15378 19504 33584 18775 17907 -22605 -31266 -18461 -13148 10188 40957 20703 12220 15625
16071 15625 5961 1476 15461 6712 14707 44311 15591 -23563 -282 5437 1982 44123 59357
16058 59357 74516 59812 55393 19813 -18852 -27008 -5143 13123 4518 6143 36744 7054
16046 7054 11841 47197 50251 54753 21901 -13875 -43748 -59773 -50068 -2906 12198 -7766 -23807
16033 -23807 -26748 -16996 -32929 -31325 -16057 -2242 27163 25500 12241 -1973 -9954 -26244 -15807
16020 -15807 25194 17949 -30595 -30889 -3703 16579 35770 18515 13958 27105 44585 28784
16008 28784 -8919 -56832 -59575 -37956 -30575 -12272 -5578 16413 49321 53399 12696 -14311
15996 -14311 -43508 -44673 -30776 -24099 -23379 -21267 14245 18486 -21850 -24519 -17991 -56015 -73730
15983 -73730 -46320 -23046 -19068 -24054 -44540 -40770 -40760 -23565 -16679 2528 10517 17481 10817 13632
15969 13632 15243 -21317 -26952 -27124 -11927 -20910 -2841 -19744 -6358 27602 45614 31976 45649
15956 45649 45575 27332 31921 22081 16410 18849 22101 16204 -384 -16555 -25782 -8140 33827 32597
15942 32597 -18645 -46054 -69016 -64975 -52329 -40464 -20225 -1276 21274 14995 -3616 -28965
15930 -28965 -11242 16497 4040 -16614 -16659 -34824 -21032 -830 7552 -31157 -35650 -21540 -20039
15917 -20039 -28606 -15683 -18189 -14705 -9265 -17763 -3177 19047 9712 -2709 -8908 -22412 -47871
15904 -47871 -30454 2323 6062 12695 -714 -7103 -6490 -22768 -48022 -27096 16063 16595 34575
15891 34575 33149 667 33976 43879 40590 22715 -12467 8829 21640 22808 36503 18639
15879 18639 -35500 -55906 -3897 31162 40148 43969 10531 -13445 -15196 -3352 4093 -5106 6371
15866 6371 2654 -17661 13331 11715 14911 19188 14190 -9352 -14341 -33655 -47832 -40582 -44214
15853 -44214 -33703 -36207 -16066 26571 18964 -18430 9628 45887 31538 -1157 205 -29132
15841 -29132 -16416 -5354 5586 29922 33050 3942 -30212 -11589 17286 30399 22123 -11748
15829 -11748 -28506 -19031 -37354 -28689 -11603 -25826 -34229 -37664 -31994 -25182 -35317 -43823 -36822
15816 -36822 -28717 -17983 -12126 -416 -7652 -20280 -36834 -11107 13826 9561 -18053 -16954 -5736
15803 -5736 4174 -9283 -17699 -7690 -46305 -42973 -40880 -26759 -33259 -38374 -30871 -21572 -24163 -25880
15789 -25880 -5167 9222 19814 29075 -18388 -59439 -58907 -39860 -42601 -23315 -40997 -52752
15777 -52752 -27973 -15981 -24419 -24481 -31045 -30717 -40356 17355 44558 38152 48563 37588 24136
15764 24136 18403 -35360 -47029 -22423 -24145 -27091 -3707 9219 1141 -18806 -2803 21254
15752 21254 393 2550 7741 -2608 -5983 2078 -17231 -40866 -73034 -66519 -49211 -45643 -37219
15739 -37219 -12134 -12720 -20015 -49096 -49147 -27681 -12931 -19311 -37980 -51216 -35491 -24516 -35812
15726 -35812 -77477 -59089 -42393 -45366 -39533 -31142 -39626 -36485 -4787 -3497 -24786 10823 13769
15713 13769 -3347 414 -533 1849 1655 393 15502 33084 36509 10272 -18982 -10807 18607
15700 18607 26291 39647 27914 1647 -23888 -25183 3062 22500 28592 26078 25806 26236 3080
15687 3080 587 -5098 -6507 7030 20315 23956 47787 48538 36075 53188 30679 35356 17440
15674 17440 -16456 -46143 -17271 3313 7004 2247 270 -9202 21534 45028 60930 34119
15662 34119 4750 -5334 -9013 -18006 -26934 -34901 -15586 -2658 2677 -563 4697 35791 39726
15649 39726 8655 8655 6988 -29586 -58155 -29881 -5829 2172 5907 4107 9020 28193 31494 10696
15635 10696 17573 41557 45065 17572 -3312 -15197 -9523 -7486 4021 8649 6258 42433 45662
15622 45662 21497 31242 30000 18142 17810 16298 26672 25440 14778 -34749 -19315 -29413 -30835
15609 -30835 -4346 18286 19256 -6397 -15219 -26403 -44233 -36615 -20272 -11247 -21600 -6300 2722
15596 2722 24286 14184 -25481 -24343 21646 3663 -27421 -19342 16987 26782 3089 -9026
15584 -9026 -10136 -9550 16076 2444 -190 6432 35244 32335 5958 -23728 -27509 -31627 -28419 -25895
15570 -25895 -36377 -30628 -22131 -8914 9456 -17660 -49435 -4053 18437 27177 9524 1204
15558 1204 -1671 -7348 11713 18146 6542 12180 3561 -33869 -41064 -11669 24030 38590 17805
15545 17805 21794 5539 12085 12877 19027 22726 25007 4422 -2081 -19153 -30943 -38217 -8171
15532 -8171 -1408 -18954 -16986 -3708 -248 8199 -180 -741 -46891 -54994 -33001 -14328 3803
15519 3803 12248 8020 366 1476 -25181 -34479 -7642 7028 20459 44129 66574 68101 55369
15506 55369 44427 32718 38604 43463 10819 -24835 -26449 -11345 -8712 -33311 -21558 32808
15494 32808 43910 14134 -21396 -29656 -35432 -2363 1304 4714 7295 -17115 -28691 -22549 -18376
15481 -18376 -7672 -3374 -2788 -21810 -1388 9310 -2639 -38240 -48431 -40129 -17081 -1402
15469 -1402 -7440 -9261 23901 32711 -29846 -25558 2357 -11743 -4803 20239 71221 82597 43767
15456 43767 3001 -8850 13382 12188 9159 25218 53360 33894 3691 -11793 -12424 4192
15444 4192 36725 43570 -304 -18999 -15511 6911 19278 8122 -35275 -26936 -22822 -18634 -43077
15431 -43077 -78594 -95304 -101655 -58669 -33408 -27379 -11790 27742 15269 15759 15834 -25130 -30091
15418 -30091 -4432 17055 4500 3542 13748 19905 43614 66615 45182 -2812 -20206 3880
15406 3880 24738 20565 17225 30869 29716 2748 -10053 -15545 -51646 -30790 18341 24902 29915
15393 29915 58405 49388 31138 6571 7009 -16539 -10568 -10492 -32278 -17545 5555 21875 16654
15380 16654 -7025 -4461 -17746 -15585 -29338 -24775 2403 7627 19466 -4449 -27050 -23657 -40533
15367 -40533 -37502 -13070 4993 32328 27712 44077 37236 -6321 -22454 -1549 21801 23771
15355 23771 26747 17040 11402 -12034 -28660 10450 23040 15188 -2041 -13189 -23038 285 36674
15342 36674 31942 17031 13436 23376 8566 5704 5708 2692 -27036 -49634 -60224 -66992 -81539 -69636
15328 -69636 -26713 11141 4923 -9869 -1168 -14697 -3643 30488 16598 10576 -3375 -21015
15316 -21015 -8724 -14364 -16804 -7787 21567 22498 -23801 -60369 -58633 -42878 -46628 -21973 17768
15303 17768 8598 10124 19243 22717 9671 -11476 -28937 -11465 -11137 -11868 -20220 -41756 -27248
15290 -27248 -34389 -40068 -53354 -28532 -3421 18446 49359 36512 20302 -20227 -15499 -11132
15278 -11132 -23076 -23733 -20064 -2917 -16208 -20477 21557 37440 6185 -12501 17417 6506
15266 6506 33045 41817 42309 61775 27696 -12125 -19044 -12728 -18390 -41097 -50891 -35095 -8359
15253 -8359 10380 -19117 -2807 948 -11202 -28003 -38764 -56322 -60192 -30963 -17326 -11387
15241 -11387 -16638 -39244 -59219 -41297 -38475 -26692 -8058 -543 31856 13142 -2002 -48104
15229 -48104 -57265 -67319 -75320 -57716 -20971 -11297 -33061 -23483 -12503 -10680 -16916 9329 11765
15216 11765 -31185 -21562 20576 45958 44804 47570 45381 67350 60580 31485 -15542 -48447 -52480
15203 -52480 -36584 -1598 -11583 -29906 -7770 5673 -8347 -43543 -41068 -36772 -28783 -16316
15191 -16316 -10663 -24237 -22874 -20525 -27386 -49117 -61786 -45283 -11484 7951 27131 -1131
15179 -1131 -9425 5303 20055 15662 18068 10929 -1785 -998 -7661 13257 8879 15280 31765 24335
15165 24335 27381 58047 82458 68366 20179 -17134 -19422 8890 34873 36775 35753 21939
15153 21939 -7697 -25782 -29199 -39514 -36543 -29585 -23222 -30584 -45018 -55222 -49466 -45328 -54955
15140 -54955 -65813 -34803 -19185 -22397 21974 19516 7837 -6330 -11947 -16812 -33645 -58147
15128 -58147 -49485 -68236 -91329 -90866 -86866 -74939 -47472 -43624 -44372 -16976 24173 45225 26178
15115 26178 -16500 -39783 -43566 -24217 284 5793 26598 11323 9281 7578 -5242 -37692
15103 -37692 -30615 -5834 -14300 -22160 -20875 -14566 -6893 28009 43140 35662 31279 1257 8982
15090 8982 28946 9743 19301 1962 -31931 -26656 9967 27566 9782 -15322 -6650 1437 -23660
15077 -23660 -61250 -60901 -16129 17457 30427 42789 52895 39566 -20089 -28558 -51766 -30354
15065 -30354 -4314 13155 8246 -21366 -64892 -52617 -21123 20180 4835 2165 -20244 -23572
15053 -23572 -21639 -36283 -37430 -19143 -5470 -28717 -46015 -28338 -8845 3266 3453 -13162
15041 -13162 -37094 -35507 -35501 -21562 14206 6666 19723 30846 34063 33167 25767 -11303 -3368 3838
15027 3838 -4155 -5002 -18631 -35840 -39635 -30329 -44787 -51495 -28544 -38539 -58680 -61901 -17525
15014 -17525 28196 82915 84617 43914 -54 9024 15969 43496 49130 58248 50731 29501 13222
15001 13222 4262 -12288 -7492 -5249 6701 15993 -6711 -12856 -11888 2153 9232 20289 4530
14988 4530 18216 26866 -2332 -39519 -31102 -10153 -3611 -9935 9362 40890 51388 37184 17278
14975 17278 -3641 -35642 -38689 -13775 -6692 -8964 -4963 8242 43291 27311 7742 13607 33704
14962 33704 51893 22846 20659 40330 67232 36111 26854 19934 23706 27664 22880 2335 -5218
14949 -5218 12062 6668 -12631 15853 35747 15588 19922 45874 48171 37834 65433 50465
14937 50465 56592 52665 51466 35876 20603 19844 -847 -14292 -7954 -26173 -12084 -7 3489
14924 3489 33170 40264 50874 58487 54314 60042 59549 41361 -9824 -25195 -11527 3218 26277
14911 26277 35409 29424 9346 15218 26393 38789 24720 20754 13334 12619 -13822 -8224 -4860
14898 -4860 14158 34602 42709 24986 28841 41034 19758 1312 -5667 -11737 -11803 -4427 -13359 -17832
14884 -17832 -22087 -32591 -15494 -12080 2425 -9324 -19562 -6855 28793 44243 61513 64897
14872 64897 62019 74108 64401 12169 -7629 -22334 -9135 14685 12272 -18682 -16675 -16565 -5311
14859 -5311 -14786 -11281 -29648 -15889 14683 3914 -21283 -2658 28101 29871 14443 -21098
14847 -21098 -21584 -27909 -20861 -8800 -39441 -76049 -92740 -88292 -72267 -68770 -41734 -16343 -6451
14834 -6451 -25858 -22594 4825 22755 23745 27513 14871 -5811 -16253 5440 27331 36434 41521
14821 41521 21627 -19472 -31921 -21616 -28603 -16027 -18198 -1820 22256 40745 44860 26841
14809 26841 18508 27567 -8385 -12418 3658 17692 26671 7282 -40499 -40501 1755 42191 54416
14796 54416 67210 73032 27291 12556 6804 14812 30251 23893 1397 -11191 -32237 -67896
14784 -67896 -60711 -39680 -60339 -61048 -53622 -37419 -14328 8265 17870 -2402 -29209 -20723 -21605
14771 -21605 -26252 1973 10702 7019 17755 -10996 -24963 7305 18076 37276 43434 6879
14759 6879 -3473 -44197 -54568 -28159 -13991 -14641 -11416 -23134 -6556 -22486 -25853 -26285 -32556
14746 -32556 -48688 -12186 -12002 -46251 -37569 -32251 -40653 -27905 -4243 2104 -19504 -39758 -32318
14733 -32318 -18312 -9961 -15672 -38542 -31942 -672 -4834 -51912 -78153 -88626 -81788 -69280 -79048
14720 -79048 -53366 -12364 -29605 -48058 -77070 -62771 -51025 -44313 -31473 -26462 -23082 -25453
14708 -25453 4897 38756 38852 1142 -32862 -54203 -70644 -53386 -26459 -16940 -23289 -24724 -10677
14695 -10677 -22151 -46318 -31745 -43559 -64578 -40787 -27018 -28121 -41051 -32347 19014 4260
14683 4260 -33395 -24922 -37107 -46706 -9834 -8548 -25300 -1709 32011 45153 31746 35189 56776
14670 56776 77109 52825 21175 4083 -11046 2885 -17221 -27867 -19056 -5813 -27207 -20603
14658 -20603 -22269 3054 11264 15380 36669 25088 12868 -10513 -5458 15129 12632 26152 39533
14645 39533 47725 57632 29122 26319 48275 39597 20350 5752 2314 3544 3022 35646 49177
14632 49177 30946 -6658 -18771 -56955 -46160 -37124 -24018 -29225 -25329 -22509 -18029 -20364 -17824
14619 -17824 -19477 -49882 -49781 -38281 -35615 -41526 -42551 -20982 3400 -9485 -32700 -4468 -15104
14606 -15104 -8882 40 -707 -24122 -35593 -23653 -3874 -5040 -17446 5813 30972 33201 13467
14593 13467 10807 24898 22642 -11668 -29136 -34849 -30624 -8548 17303 17772 -8598 -25410 -25755
14580 -25755 5412 40235 36227 21750 6130 1625 -5230 -32037 -22583 24884 52833 10950
14568 10950 -10741 8352 23227 2993 -27175 -35588 -23220 -14971 -13760 -8879 -15501 7719 27349
14555 27349 16877 -28637 -45503 -50576 -52326 -35982 -350 17150 33232 42560 29914 -1345
14543 -1345 3164 31375 34201 24840 9204 -19347 -28313 -16110 1931 -30075 -61289 -52301 -24279
14530 -24279 -11262 21629 51640 42103 36039 38206 33594 17142 22007 1001 -32053 -14843 503
14517 503 30382 40910 12019 -28336 -30103 -7145 5436 -2165 -5463 -4463 -15317 -28640 -23124
14504 -23124 2 -22855 -45274 -35195 -11674 7752 -1122 1594 -5538 -13788 -12479 -18392 -2886
14491 -2886 -22319 -25651 -34957 -46900 -19205 7066 37595 49141 48383 28214 7932 -19009 -13544
14478 -13544 -30566 -51315 -20422 -14749 -27787 -20678 -15293 2113 -15508 -42559 -50165 5623
14466 5623 26875 30444 -23642 -44042 -47841 -12348 29015 59463 48316 45968 56686 79980
14454 79980 99043 144652 124558 146004 169821 187108 181706 137593 115230 102491 102826 95927
14442 95927 91834 61914 64860 73037 33584 10638 29064 41143 3407 17104 20999 16636 14584
14429 14584 -11391 21367 71211 63811 15585 -95 18672 20128 56298 81835 114806 99867
14417 99867 75396 103193 134305 157322 188032 206294 194622 200055 211745 211314 170832 138663
14405 138663 92486 96587 141390 138343 112202 107094 103581 87296 31691 -15031 4048 -1453
14393 -1453 -10699 26145 28712 -2820 -10352 -14030 11070 15690 6834 24658 40650 24162 2989
14380 2989 -3495 265 5948 636 4502 44799 61217 36491 26093 33653 14993 1378 12720
14367 12720 22987 18507 4638 -3683 -19251 -16908 288 17076 24171 15705 155 -2045 -22429
14354 -22429 -30748 -37301 -48032 -13468 10368 15658 18993 19356 2266 -7906 -9728 -52405 -49284
14341 -49284 -38477 -28044 -12934 -17801 -15947 1082 -14291 -23618 -10985 -25563 -34050 -16147
14329 -16147 -14648 -18635 -29264 -19966 -18869 -8252 -24827 -27729 -6241 13962 -7861 -25709 -56961
14316 -56961 -53042 -41041 -1738 3012 -16883 -8053 -1812 -14946 -21001 -3406 15598 20895 44297
14303 44297 47686 17163 13106 824 -595 -18062 -26751 -18443 -12397 -14207 14936 27573 -6743
14290 -6743 -3535 3560 -1738 15708 7669 6492 7633 4812 -6141 -21674 2540 26245 4296
14277 4296 1272 14975 41960 60508 89973 55750 24982 16945 21811 19776 2746 -11332 -24997
14264 -24997 -16511 -39661 -43661 -9363 35135 30455 34771 47848 44553 28617 15345 3232 14671
14251 14671 34214 36528 15552 19805 1305 -29222 -38530 -11803 -17098 -36945 -26619 14058
14239 14058 5057 -16347 -1622 33844 -10025 -4313 23259 25859 39304 36497 23979 52055
14227 52055 42435 3282 496 6691 10857 3581 -3498 10502 43649 45900 27494 6076 -5267
14214 -5267 9145 33262 19873 2278 -2794 7556 8784 -7629 -2820 -33413 -7507 21930
14202 21930 47136 30029 -1963 -30385 -20339 -14952 11848 2462 18304 21996 21563 8610 15695
14189 15695 9851 28764 41483 21860 18001 -4635 -23171 22914 -6550 -12230 12935 27706
14177 27706 23860 24212 53554 61951 38213 72108 63253 51566 18671 17341 47201 35888 49502
14164 49502 32046 27418 49235 59823 10934 -13803 -25598 -53901 -50442 -33969 -40000 -16929
14152 -16929 -1925 5974 -18291 -41169 -53545 -45481 -25698 598 -821 -18483 -30180 -41163
14140 -41163 -23004 -57240 -66328 -42347 -20735 16377 36172 49519 45010 30697 6390 5308
14128 5308 19252 16930 15934 32463 29778 23623 27559 35256 26213 8734 -1587 -18161 9180
14115 9180 38696 31509 43486 36885 36448 42626 22099 -1153 24808 24645 13989 17501 2661
14102 2661 -1882 6192 27374 9627 14877 12905 -178 25217 58977 74178 30830 -1011 10154
14089 10154 19060 31461 24780 16627 53523 82112 73832 73764 62392 28611 11292 34599 60777
14076 60777 69987 65468 60701 89927 97016 67435 32531 63206 88673 75095 85221 93491 91664
14063 91664 106416 121451 129406 141169 145426 104622 73670 64978 93193 110787 109274 108809 121948
14050 121948 126745 125423 145903 181921 199360 184546 174026 178639 187168 193717 204316 224289
14038 224289 217943 234554 274647 285323 294781 329156 346200 362659 368597 389113 394312 466557
14026 466557 550014 605217 663458 769347 872605 960068 1081146 1241519 1435700 1682948
14016 1682948 1998264 2367264 2777167 3310816 4023408 4976373 6218147 7929030 10304968
14007 10304968 13460502 17145888 20836873 24117395 27178244 30273840 33085892 34738852
13999 34738852 34748800 33503271 31711243 29615852 26892149 23463712 19804151 16414232
13991 16414232 13535883 11222320 9386278 8000737 7012504 6243493 5651912 5203401 4874462
13982 4874462 4627041 4476573 4441194 4502755 4635529 4834376 5182481 5686345 6379361 7343405
13972 7343405 8653465 10436266 12904342 16175820 19897533 23454339 26549747 29411709
13964 29411709 32292024 34713930 35839259 35262946 33540116 31381087 28863037 25736232
13956 25736232 22010035 18125020 14587005 11658437 9315024 7494483 6136365 5133171
13948 5133171 4364276 3749734 3226311 2775692 2400182 2098695 1855754 1649247 1452998
13939 1452998 1306377 1170050 1070928 976284 896613 819062 759292 674850 613962 610547 570013
13928 570013 536794 511990 478070 452544 448129 425115 377159 368174 363017 315765 288406 262247
13916 262247 274559 253516 263755 304288 314632 284042 245561 209738 207340 210869 175311 189585
13904 189585 190044 199583 185517 160492 141657 149561 142010 148178 175661 189155 164019 124363 130646
13891 130646 115793 117946 118440 122040 130668 165510 143733 155200 166185 154517 141235 129017
13879 129017 126245 122192 122134 79869 66313 84619 117259 112891 92882 81551 76045 111935 144459
13866 144459 129938 134926 133336 124905 119162 89478 72934 78866 96658 126206 142540 111324
13854 111324 71428 56459 55771 78774 108178 99191 88276 44244 18342 4964 26864 34938
13842 34938 37776 39310 62213 91763 76351 83711 116363 107967 113063 109045 98682 119327 101027
13829 101027 59341 55164 75143 68556 56002 46868 31410 44975 31331 46827 19249 14210
13817 14210 19768 54446 73708 62879 57943 63975 51023 15879 15513 10507 -8213 -27928 -30338
13804 -30338 -14218 -4351 30575 67942 53615 46344 32529 28059 43860 63129 53322 38213
13792 38213 58244 54164 17433 -19610 -773 28757 36707 12586 -7079 -21459 -23739 -3439
13780 -3439 34176 19659 -12834 -7179 9993 13114 -23896 -32713 -1666 6691 -6008 -20872 -16402
13767 -16402 -25739 -14773 3196 -11392 1249 32950 9858 -5648 5172 56587 74878 26102
13755 26102 27552 64136 65538 31370 9248 -12884 1548 24525 41643 57544 70082 60381
13743 60381 64517 104004 122792 88376 70854 38558 22886 18215 11673 45824 55107 40659
13731 40659 35895 35054 10722 5903 -13934 -16068 -1142 -5563 31918 47357 11699 31071 38941
13718 38941 28942 13296 23724 55392 32342 3262 -9915 -24147 -941 1192 -12500 -264
13706 -264 20143 38752 15040 -11020 -25953 -23383 1604 9628 18809 285 -14379 -15212 8600
13693 8600 18263 52968 51269 39449 26307 -4008 9277 20735 -2140 -7815 12816 25928
13681 25928 21654 28745 34876 34821 28173 10244 10752 26424 14494 -14058 -16876 13227 6695 17017
13667 17017 39934 38540 17238 20156 27476 47174 37582 34771 22126 2832 -23188 -30781 -9422
13654 -9422 22934 32001 -7584 -19085 -1490 -24338 -24141 11149 32236 33646 24611 5094 -42006
13641 -42006 -21111 17897 17879 5017 -18637 -8474 2554 13940 34026 54200 32194 10347
13629 10347 25061 7751 20058 31881 40180 39357 35793 32688 61296 43714 32305 64431 67788
13616 67788 36314 -3547 -36186 -17352 -2278 -21274 -29447 -14821 7609 23732 24591 13976
13604 13976 21559 -3346 -32538 -18301 5353 6378 9269 12185 957 9815 4835 5017 11559
13591 11559 24899 13865 14849 31502 33663 14660 -3642 -16240 -2887 639 15092 15723 1458
13578 1458 -3650 6939 -6732 -18441 -12720 18439 -996 -20452 11668 -8166 -11385 11956
13566 11956 27613 3441 -4998 -22034 -10229 -5774 -19071 -27416 -38176 -23998 -16375 7289
13554 7289 57395 82977 82581 61869 36647 72174 126283 159958 183443 193532 196011 194097 191821
13541 191821 182616 152059 105680 81536 56088 52308 46153 36227 44707 26267 16429 10825 10025
13528 10025 38767 75775 63780 59786 72226 63788 60228 55661 65827 72315 43369 50783 103721
13515 103721 136529 143733 146548 162733 146607 142063 165886 194048 188968 175970 164831 155646
13503 155646 136413 151641 145158 114843 91862 65009 41904 8997 7570 4758 1499 -16963
13491 -16963 -26785 -35938 -29468 -5562 19421 25069 866 -5522 239 -2826 -10606 -10362 -41129 -7226
13477 -7226 39144 41526 33731 35698 18266 13086 -3746 1802 3306 -15961 -29487 10691 19512
13464 19512 16593 8024 -19990 -26308 3262 26597 22893 32415 30962 31313 37954 36006 37652 24663
13450 24663 4068 -17247 4563 7588 23774 21079 -5533 -27013 -13047 -10017 -21401 -7357
13438 -7357 18569 5949 9114 8727 14862 16789 29553 12113 22877 2665 914 -1609 -46014
13425 -46014 -51275 -36040 -28244 13715 13335 26703 39214 35024 -4339 22016 7012 -19734 -13667
13412 -13667 -8293 -33864 -42978 -32049 -27009 -31091 -26447 -12040 -19978 -12650 -9707 -5094 1241 -3615
13398 -3615 -22267 2100 1186 -22899 -41518 -30138 -38016 -23699 -15096 -6937 -26400 -22194 -32881
13385 -32881 -41249 -20206 -14130 -23620 -31341 -29894 3671 30298 45126 9018 -19239 -19336 -8040
13372 -8040 3062 21398 13843 -13469 -46897 -38419 2602 -12105 -14818 -26496 -31362 -48803 -51007
13359 -51007 -41463 -37062 -24810 933 26698 32157 24902 5154 -9260 19066 37056 10882
13347 10882 -30010 -38350 -29198 -14678 -1106 14177 23695 25681 46962 43169 14104 10987 -8950
13334 -8950 -16937 -28474 -36641 -52251 -53298 -21265 3273 -847 12921 -2133 -29337 -26386 -4010
13321 -4010 -13202 5506 6139 12541 25461 51540 38547 7074 6360 -21909 -34816 -41229 -26974
13308 -26974 4668 7504 -6018 -2862 -7276 -19411 -27564 -32186 -21781 -5905 2176 18876 42662
13295 42662 60335 63047 52510 48191 49379 34234 25257 45937 50579 51404 71494 81129 69451
13282 69451 74608 88422 115183 91508 78563 93131 91305 56355 43833 52285 24983 -5539
13270 -5539 -16825 -20133 -32637 -38462 -5193 9636 -10317 24959 37702 14244 12420 990
13258 990 -3342 11154 24454 -2335 -20188 9380 6294 14272 40443 15564 22075 37188 40400
13245 40400 41337 61574 73470 74698 55408 52423 61788 105768 196514 256813 280026 234040 185111
13232 185111 152354 127204 87021 72010 79800 63993 72794 62276 73485 63712 26816 8458
13220 8458 25743 1019 -30169 -32286 -894 5364 10782 17139 -2252 20121 21825 32921 29220
13207 29220 17549 6790 -12611 -31015 -36393 -44274 -28507 18736 18760 26050 37735 42670 73254
13194 73254 91310 72065 123067 193954 258090 227955 210271 136721 115701 95752 100953 87017
13182 87017 46801 28050 39987 57158 54283 39683 48854 51064 88445 91100 70497 36106
13170 36106 3703 -14569 -22152 -14998 7654 -5679 -20487 -24761 -16295 -20053 -2810 -13624 9348
13157 9348 30796 22323 39047 41266 48457 67864 72349 49306 58613 109304 117570 127745 109576
13144 109576 96584 78279 31473 10952 40078 38985 37128 37487 22795 4883 -3701 -9570 -19057
13131 -19057 2187 11854 33907 29394 4405 -12709 -18862 -15795 11515 -5398 -22259 -3982
13119 -3982 10318 28017 20232 30546 27061 30552 26728 23259 24002 19210 59086 106644 117986
13106 117986 100645 92082 76248 67467 56695 -9551 -26800 14099 41477 37628 8157 9851
13094 9851 2344 -12189 -8842 -23010 590 30839 21436 3385 -10269 -13631 -30362 -12190 -4203
13081 -4203 -5725 -13637 4788 33878 40521 39112 57447 30812 -2273 2940 22253 24787 -15441
13068 -15441 -35541 -46945 -43335 -43054 -21849 -2905 5246 1178 -12051 -3568 -154 -29247 -21191
13055 -21191 18735 39686 23498 11371 5987 -13723 -30960 -37178 -29542 -7481 -7515 -29501 -37632
13042 -37632 -33729 -24464 -41295 -66627 -84499 -85756 -57005 -61618 -22369 33604 33767 3207 -25859
13029 -25859 -18528 11192 19160 14646 6488 18358 23047 -4634 -40665 -58893 -35028 -24803 -9706
13016 -9706 -7288 16701 29295 -1800 -23024 -26236 13064 34699 11710 -26339 -48500 -26314
13004 -26314 -142 -4921 -14306 -43374 -77856 -71281 -43467 -31625 -12229 -3250 -42482 -49627 -32347
12991 -32347 -11459 -25112 -43078 -34089 -39006 -48194 -50838 -39669 29552 50195 36844 6996
12979 6996 -25789 -17147 -6850 11325 26184 22646 16912 3211 -7652 -1203 -22668 -40714 -20835
12966 -20835 -5538 -13780 -43263 -56232 -81660 -82486 -76730 -68031 -63029 -74305 -44767 -28012 -38145
12953 -38145 -32169 -17335 -10496 3336 -9111 -13367 17593 -3024 -17760 -26836 -27289 -43555 -40107
12940 -40107 -33197 -9653 -24233 -12009 16193 53440 66970 54145 48128 9441 -16036 -43410
12928 -43410 -46690 -35685 14182 50445 51583 20881 13677 -9538 -21639 -28024 -34977 -23845 -20526
12915 -20526 -36956 -22933 3160 -16139 -524 20063 -487 -11487 -15088 -33752 -37656 -33225
12903 -33225 -12435 -15227 -24979 -14482 7771 -9236 -7977 -2797 -17766 -14593 -14470 -13061 -33932
12890 -33932 -17837 -17764 -24763 -9910 -7438 -18716 -10326 -6773 11685 -3328 -23605 -15384 -26618
12877 -26618 -11355 -12003 20273 40855 40135 7357 -31375 -14765 5568 -14435 -20285 -24617 -26173
12864 -26173 11186 -1095 8660 19309 7765 -19205 -27209 -13848 6411 -5470 4481 -7547
12852 -7547 -14600 -37052 -40090 -40727 -27904 -9289 -39156 -63793 -42566 -36292 -34162 -29203 -38749
12839 -38749 -57188 -44527 -50165 -47866 -60650 -66943 -59491 -54038 -42225 -2529 8649 26481 26811
12826 26811 45661 37561 21822 29379 29586 -6322 -14227 5067 31881 22174 -3607 -26302 -40527
12813 -40527 -40319 -7806 15201 -13125 -15320 -903 -34193 -53851 -30282 -38730 -77350 -65996
12801 -65996 -38284 -42001 -62456 -66531 -41043 -25870 -36205 -27925 -1492 5497 5939 14389 23646
12788 23646 21309 6715 837 -1584 -11781 -22093 -5926 -4193 -17549 -22760 -2625 -17276 -61913
12775 -61913 -67554 -63830 -60322 -47231 -29245 -9376 -30394 -29665 -15186 1753 6297 33605 32452
12762 32452 -7111 -25185 18205 30732 -10431 -26763 -910 18417 45874 21234 37719 11068
12750 11068 -26222 17713 49616 -3966 -39356 -32208 -23054 -51076 -82217 -44492 -33798 -18217
12738 -18217 -47012 -60351 -69295 -15259 7830 3286 -21717 -40059 -46642 -29891 8643 -11707
12726 -11707 -31250 -46385 -32127 16 -5686 -52838 -73001 -57591 -19025 4895 22195 46359
12714 46359 57766 56193 41884 54720 45465 24513 53930 67313 30767 21729 28811 10936
12702 10936 7054 -2107 18097 2125 -25696 -35360 -23776 -5642 -21960 -12181 43023 59956
12690 59956 71896 43578 37728 52286 70294 103214 131170 129662 113636 118482 147664 192564
12678 192564 209113 229243 244864 267518 280338 283841 293945 244261 208667 211751 210001 200228
12666 200228 163991 181093 209805 174335 130335 140841 149531 144267 134690 136022 174977 168476
12654 168476 152757 157623 193044 212709 248291 292904 310812 315474 300696 321450 342505 359421
12642 359421 348421 344324 312508 307077 342170 330880 305951 275657 240408 223792 251776 278704
12630 278704 299376 303636 291356 271812 263231 220527 171125 161647 163676 163075 144916 186754 195814
12617 195814 186234 199941 194555 215410 254752 277153 336203 428690 439995 407043 407405 366777
12605 366777 315941 298784 292343 262081 218456 202107 144985 99702 112139 111932 89821 70422
12593 70422 57238 62729 82271 73079 23906 -11760 -1647 3401 6748 -14303 -30623 -15612
12581 -15612 2183 -2888 -15533 -26641 -47720 -24988 375 -23948 -29031 -36397 -47341 -25074
12569 -25074 -26268 -294 13677 6681 -9606 -24663 -7989 2369 -2390 -3838 -16029 -27238
12557 -27238 -29907 -5533 21290 15094 8461 -35170 -24205 -35739 -37531 -55553 -65569 -47246
12545 -47246 -21511 -38137 -48065 -28211 -21213 -10891 -17146 -12300 3113 -558 -12033 -11870 -13919
12532 -13919 -3423 15907 8303 -32521 -31051 -46280 -54415 -11029 -22710 -17190 -26754 -41174 -12460
12519 -12460 -23099 -15760 -14789 -18345 -14774 -3849 -1437 39716 79699 84193 98707 82536 72077
12506 72077 83438 115181 112203 89760 86362 121104 136729 115892 101568 76272 54967 39684
12494 39684 52834 74515 66451 57310 61467 103111 108126 87589 47365 45951 61982 89718 96058
12481 96058 81808 23521 1120 37183 81855 74611 72431 108440 122044 167592 178446 146370
12469 146370 130629 120636 137899 127724 116093 131864 149525 165195 181483 174419 194976 252615
12457 252615 260456 266713 249259 204915 179913 182765 176856 160186 168074 149716 110450 81554
12445 81554 73919 97399 102437 88907 93300 96666 130598 141138 126450 151847 135965 129490 135324
12432 135324 132761 71114 50813 75883 81183 84659 80594 63665 37643 43740 53743 60209 76005
12419 76005 50855 48781 74985 111550 123637 135420 107036 101550 72414 90837 89301 96015
12407 96015 103564 106491 128067 154740 195709 208064 199477 206997 176452 170789 128928 110392 117252
12394 117252 119820 83729 55959 82758 106732 145465 151163 154629 162374 122580 90812 78970
12382 78970 68364 84748 92268 100373 99761 112782 108515 104287 118990 124721 117198 123956 114642 126943
12368 126943 159568 161122 189216 194527 204006 191722 168241 170400 164859 161568 193644 203219 163857
12355 163857 145151 157057 149302 139801 134382 125843 128000 165720 181919 186163 177045 165130 174713
12342 174713 173805 175115 147704 93613 135466 195761 197944 199634 213558 258008 296876 304067 363835
12329 363835 449963 492358 515107 531416 513310 504122 493125 501218 516389 508846 467815 445485
12317 445485 459007 453710 448676 466604 462722 458646 473370 455949 425674 429903 440620 476158
12305 476158 483883 486231 488813 523230 548263 558420 561216 599541 595787 570839 562984 580968 586295
12292 586295 605599 635189 687003 709706 722159 717273 716051 735375 777281 840437 891777 929656
12280 929656 984450 1045908 1124082 1202466 1259818 1290401 1340538 1438786 1494339 1550206 1610859
12269 1610859 1640266 1665748 1723081 1778128 1810720 1815831 1846818 1875226 1926908 1963914 2017592
12258 2017592 2098063 2162094 2259625 2374690 2527109 2684717 2821778 2917794 3017780 3124037
12248 3124037 3224233 3275711 3327033 3433635 3537955 3675411 3843170 4024608 4235857 4457778
12238 4457778 4690608 4985493 5302653 5646888 6007634 6433180 6914493 7466963 8089255
12229 8089255 8754410 9441709 10197862 10992006 11865447 12853977 14012656 15374300 16962320
12220 16962320 18870068 21210017 24073274 27556920 31843684 37183424 44016630 52910622
12212 52910622 64559068 79938784 100301456 127008669 161685434 205633529 257098512
12205 257098512 305959948 334011253 330437078 302027575 262170372 219818827 179879616
12198 179879616 145264056 117098156 95116966 78163239 65027057 54690078 46502482
12191 46502482 39938223 34660263 30386826 26847643 23865915 21358682 19267681 17527971
12183 17527971 16028735 14729439 13562546 12544349 11612451 10737531 9904071 9120557 8425824
12174 8425824 7834532 7324960 6857984 6462371 6135861 5826771 5553511 5314732 5112616
12165 5112616 4883216 4680427 4468393 4284341 4088995 3839604 3632647 3468286 3317400
12156 3317400 3170970 3024345 2893786 2756105 2616523 2504330 2411174 2319253 2235040 2157086
12146 2157086 2082321 2027825 1974063 1922161 1887442 1848641 1798290 1768504 1762949 1750953 1655773
12135 1655773 1588579 1547862 1517473 1473414 1397413 1331338 1287885 1281928 1265058 1191079 1140393
12124 1140393 1092953 1051955 1049623 1043055 1012625 993483 1001208 986008 940205 926801 909784 893478
12112 893478 854187 833839 827407 782196 753543 735207 739982 710988 687323 670092 629744 607538
12100 607538 599232 609668 602525 575641 558626 554965 560944 549465 544335 547444 533421 523938 480775
12087 480775 445451 428037 411959 399382 369772 355238 362389 360645 370450 375634 437016 469874
12075 469874 513262 537704 531027 536459 535200 524069 507076 508931 517364 491563 478187 434364
12063 434364 413412 422303 430707 430562 450150 457677 423732 409372 400388 366884 343258 353615 369530
12050 369530 352361 313073 331405 290721 248646 223696 237499 263249 275162 286510 289652 282818
12038 282818 255297 264657 282045 272910 261666 249003 240198 248359 281051 298307 270625 235615
12026 235615 218284 228391 219809 206548 212547 232332 226432 235747 259542 212303 211449 224939 207349
12013 207349 165994 138152 110112 107634 93167 89805 70139 70347 87200 83035 60836 86548
12001 86548 93834 85870 111574 104854 109313 115743 140180 150159 112548 102779 129187 137313 125815
11988 125815 120034 138911 156132 154678 125755 120271 128278 124731 113524 127631 126967 106686 84555
11975 84555 62252 76055 83821 91196 112820 127355 130100 136919 122832 111193 89438 100071
11963 100071 92949 110048 128875 145673 104048 89652 96316 68324 101807 125267 141927 176809
11951 176809 193673 153524 140625 131135 113994 130329 171249 182418 164371 135311 146684 142383
11939 142383 122944 104158 90372 77733 73690 69350 75593 93730 72402 62691 50743 33917
11927 33917 19784 52912 66429 61334 85453 101474 97328 110419 107934 122553 129467 136737 161949
11914 161949 136199 112622 132705 104471 54748 32556 34407 33848 56021 49631 37090 52471
11902 52471 56824 53159 52201 60699 87052 100977 101424 132521 184945 194022 185319 195891 184890
11889 184890 155720 153285 170226 183688 160878 157162 175469 169565 133953 98105 99698 56909
11877 56909 93283 99380 96231 119002 125609 107824 74328 71912 61904 24997 32727 56496 81100
11864 81100 57323 40802 70314 87415 71015 69951 49731 46063 57240 58074 67263 84051 95700
11851 95700 74554 55406 44389 61307 61457 74477 99174 85209 50971 50471 63458 73932
11839 73932 75150 64862 63131 88572 93240 86162 96730 76516 88246 104717 108325 101003 115244
11826 115244 133775 103572 62016 84718 131549 126154 103424 84610 70573 75224 72090 83786
11814 83786 114939 110722 90230 105804 118305 136389 130206 122077 164706 159593 165888 212104 261472
11801 261472 283903 312600 276279 271886 300669 280002 260845 231466 223389 206798 188456 190799
11789 190799 234009 252628 261076 307522 321623 286627 272237 301279 315825 298099 262746 247055
11777 247055 274727 323760 347368 319077 272087 264415 258053 286364 322014 353443 378503 380802
11765 380802 371848 389640 379247 361347 341113 337637 336502 329833 330640 348765 369172 382563 371045
11752 371045 396030 389170 377494 363062 332699 273442 254755 269019 285402 266880 243993 234247
11740 234247 276702 283342 272316 245836 240430 259435 259810 280257 273496 264393 257785 236101 218937
11727 218937 229496 207100 203257 222968 250986 236049 199465 166631 143748 119346 114703 116376
11715 116376 95811 90677 78386 70563 45142 62527 73883 53492 -8127 -15947 9991 17660
11703 17660 14786 26336 57204 78678 65788 51632 20506 21694 30065 19187 38719 63012
11691 63012 91043 83174 77845 53492 33755 37119 67780 61447 60205 61296 84883 63555 38180
11678 38180 9610 -15504 -12540 39536 34762 50970 79685 65163 48529 56033 76274 80781
11666 80781 75303 55939 10029 -4412 -13429 -6853 26055 74572 82705 37506 25118 40334
11654 40334 50999 50912 73925 37528 -14461 -14522 6212 16609 34155 66275 80982 33206 -13524
11641 -13524 -11787 -547 30457 51928 66161 69748 65894 53666 -2377 -1130 25562 36816
11629 36816 64180 92406 87205 91818 76206 89995 105049 67845 32601 37492 44295 57788
11617 57788 51795 42720 28455 27057 28733 56970 27764 24776 44629 62670 74573 68487 60708
11604 60708 51042 36772 11731 21914 9711 -9980 -12498 32384 26752 -11235 -12711 -3634 16295
11591 16295 19039 40868 62619 59908 50369 33781 31661 10780 14654 223 316 13755 2606
11578 2606 -4875 33033 45792 52644 34712 39296 52797 43344 33044 29698 41603 49215 48433
11565 48433 51273 42010 12204 16294 4733 10256 17394 41816 34404 1606 -16229 -13847 14538
11552 14538 7499 20109 31054 34164 22298 27075 9775 -16078 19974 47552 38734 9814
11540 9814 -9089 -28553 -42075 -3221 25097 5405 -366 -9954 -11845 16119 16403 7535 52901
11527 52901 82699 65549 42720 36914 56268 53258 36177 34096 27351 35744 46089 16174 10320
11514 10320 41820 34456 16290 -5998 -41509 -27325 -34967 -38289 -30879 -3243 20218 12935 -5696
11501 -5696 -1987 33591 64938 70290 28326 5598 7878 6964 20876 19998 30110 25513 24903 46521
11487 46521 42701 18101 -13086 -33963 -32744 -6340 -3480 9625 -6232 -22091 -27571 -34549 -42062
11474 -42062 -467 28255 13907 -1503 -13323 11850 22860 3606 23001 39114 38841 23987
11462 23987 29190 -1294 -9696 36 27703 16071 11201 13916 12318 -1681 17969 25260 33418
11449 33418 30178 2363 -9245 1549 24122 -6007 -12720 -26124 -3414 22743 3155 19808
11437 19808 75761 99351 86046 67275 62519 72447 58673 26800 22642 18825 26758 15735 19903
11424 19903 56230 58201 40265 26234 10641 -16639 -27040 -48157 -6148 42122 63080 52043
11412 52043 30083 23101 16374 11871 22877 47493 37301 -10195 -46149 -33406 -20408 -29350
11400 -29350 -4438 -6040 12715 6274 15713 20250 -3397 -23714 -40786 -15630 4757 31541
11388 31541 44014 22703 39485 37546 7025 1389 -20252 -40216 11197 51294 39019 903
11376 903 19956 4201 -25031 -20964 6577 31028 28212 11692 8428 25613 36795 45296 29169
11363 29169 -1812 4105 500 -17324 1777 21355 2214 732 14099 30804 -1656 -20397
11351 -20397 10589 42057 31382 11867 19090 3423 5979 -16085 15352 34959 12744 17383
11339 17383 34931 -2863 -37446 -54168 -42270 -27692 843 -1338 -12318 -15045 -8155 3048
11327 3048 7797 31018 45326 20166 -18776 -11215 5748 -10500 -10337 -8804 11982 12931 -9761
11314 -9761 -13522 -17892 -15601 -24393 -36877 -32914 -33516 -27904 -9019 1289 8397 3396 -31940 -35797
11300 -35797 -18901 -21762 6105 9011 -7238 -2415 11049 20168 20144 24457 10474 -1180 21420
11287 21420 7101 4119 13468 5292 -13406 -666 11325 26366 14959 1116 -5661 -12823 -40190
11274 -40190 -66251 -68174 -78832 -85134 -80205 -36685 22337 40183 30146 31026 17024 -5569 -20982
11261 -20982 -13636 -2535 13847 34289 24603 12569 356 15435 1551 9048 21067 24746
11249 24746 63101 59618 28541 11773 -11547 32041 53927 38890 33657 17394 -22411 -23329
11237 -23329 -12287 -23068 -5329 53399 56548 970 -28083 -24257 -32088 -26449 -6915 -4693 -24646
11224 -24646 -10675 7701 14545 30671 31600 37163 35813 33137 25569 4775 9844 -7616 -13668
11211 -13668 696 25809 54627 34505 22373 9840 -2472 4300 -33616 -57244 -50508 -20735
11199 -20735 4398 9384 2612 2220 2110 4028 14883 43893 51429 29737 41738 54308 49638
11186 49638 12051 24975 19652 -563 392 -23127 -21655 -3730 -17291 -29747 -27590 -24611 -19598
11173 -19598 11102 20590 335 9180 22134 -9530 -11296 -38040 -63117 -79364 -26461 -10696
11161 -10696 -19729 -7866 11778 13555 5755 8513 37994 29309 24699 15190 16777 -17622 -19482
11148 -19482 -24847 -29317 -50251 -55839 -66398 -52368 -61577 -63165 -52647 -38371 -43328 -33842 -18627
11135 -18627 1879 -12000 -23532 -14109 -18840 -7080 7120 -21515 -19379 22208 28331 23588 41642
11122 41642 45925 30966 -117 -31015 -38951 -37300 -43077 -23548 24526 39564 19590 -1081
11110 -1081 11115 36625 30886 35348 33061 -5805 -36897 -24560 9380 24002 12416 22356 11370
11097 11370 -12840 -12951 -16782 -24876 -27213 -16186 9609 -660 -28644 -31828 -27276 -12885 2277
11084 2277 -19451 -13942 -12439 1572 22632 25391 47380 41441 29945 14475 13176 4389 -10868
11071 -10868 -29476 -23179 20150 26679 11635 1485 -2245 6888 18685 24589 40161 17497 29529
11058 29529 7196 6895 15451 26353 38077 -12331 -42647 -30285 -34061 -28133 -14662 -5319 -15266
11045 -15266 -27682 -17060 -4379 -6895 -27822 -52823 -50118 -25367 -26305 -23657 -17448 848 18375
11032 18375 33311 13526 -15268 -40217 -39419 -21990 -22268 -17769 -7750 10034 4417 -19495 -33311
11019 -33311 -34996 -33125 -10543 -9287 -24184 -27586 -8717 -14246 -37891 -24198 -27742 -26487 -25418
11006 -25418 -11823 17665 28264 -230 -1525 -19349 -22463 10713 38429 16770 5234 8801
10994 8801 -15781 -16146 8922 20741 50248 56609 69896 82945 52489 23495 -19698 -70720
10982 -70720 -68203 -39756 -15385 -6099 -16766 -4695 2925 -3255 -35693 -42637 -14928 -3489 13591
10969 13591 19457 30761 17724 -30575 -33650 -25412 -2298 35958 58488 66753 53750 21546
10957 21546 19537 20289 -21823 -34882 -28513 -15016 -20975 -9761 -5431 11166 -3495 12179 -5536
10944 -5536 -11931 3411 9937 -11492 -17547 1418 15088 -8647 -29264 -30923 -15213 15188 23881
10931 23881 3609 14379 -295 -12925 -12867 3008 15066 -1650 17670 33999 16276 -38839
10919 -38839 -31393 -1917 6245 -10037 -34753 -41718 -22170 -13455 -5379 5789 45634 55098 31656
10906 31656 18219 13683 -10793 -26478 -15306 11097 10831 -21157 -11755 4601 3016 -8081 -26694
10893 -26694 -20575 3645 26499 18085 34670 45276 19006 -3989 -5762 10405 11111 249 6530
10880 6530 15115 2949 -6771 -27350 -72338 -68083 -27187 16641 20682 15398 -26663 -18479 -51934
10867 -51934 -60638 -51047 -37965 -1955 -5990 -29558 -28102 16322 16580 6077 25592 28064 50539
10854 50539 38276 15259 -3023 -28630 -47523 -61508 -60795 -37500 -20053 -22497 5483 -1400
10842 -1400 1753 24205 5090 16976 33930 11911 -19520 -4547 23838 19876 8235 32285
10830 32285 49313 19752 -13318 -11252 -20632 -18314 -34333 -34713 -12894 -23889 -34161 -31204 -23171
10817 -23171 -10181 10580 13004 46379 50721 4358 -33782 -21388 -11537 -4544 2421 6484 -2838
10804 -2838 -26605 -56346 -66744 -25365 2698 21551 24206 15417 -6802 -2324 -4552 -2596 2344
10791 2344 -19032 -33552 -18746 -13442 -23573 -55798 -53983 -50213 -19683 -27453 -11210 -25159 -18176
10778 -18176 -8998 -4501 -16851 -36508 -49320 -32558 -16984 -19957 -21289 -34752 -46722 -46221 -43713
10765 -43713 -70689 -79123 -30365 -19905 -60485 -58573 -35478 -6424 5349 24573 54518 57283
10753 57283 40704 15743 -3769 -4948 -15836 -17274 -15315 6116 -11614 -5334 -3847 -33334 -52994
10740 -52994 -24323 -22965 -38987 -37927 -7757 23838 23851 12389 4794 8041 -546 21931 7819
10727 7819 21620 4747 -21119 -31051 -36780 -24919 -11310 -6126 -5997 -10706 -3389 18028 37745
10714 37745 50071 44423 10552 -24546 -33194 -31742 -15959 -40698 -63529 -40097 -36578 -28861 -3521
10701 -3521 -7896 -41358 -60826 -53142 -60489 -51979 -49300 -30407 -31538 -14279 -8966 1468 25786
10688 25786 39667 47552 38451 10769 -21724 -34873 -17285 -16427 -16576 12679 49768 55298 19692
10675 19692 10152 6180 -22431 -28038 18181 34790 20137 9362 2336 -14788 -16911 -22475 -19178
10662 -19178 -12290 -43739 -34229 -11867 -8813 -18893 -8760 19116 2632 -9563 20623 43034
10650 43034 37071 2617 -23347 -25226 -35216 -40627 -20879 -20037 -24721 5695 20203 -19089 -44520
10637 -44520 -33532 -11713 9242 -11539 -25633 37917 39496 2019 -25516 -36895 -54087 -21112
10625 -21112 -18695 -50046 -25150 -6590 -8091 -19731 -34681 -36388 -52875 -73602 -56480 -12724
10613 -12724 20908 4185 -18890 -6867 -22222 -36271 -18834 5757 8703 -1579 -7840 -10261
10601 -10261 8869 15488 13071 10910 -14147 -40213 -30630 -54108 -54758 -18606 5468 12752 -2447
10588 -2447 -14454 -16885 -13373 5157 10695 -15618 -47137 -28866 1130 -6331 1971 -25295 -31378
10575 -31378 -44639 -45607 -91005 -59100 -19653 -34307 -66651 -67970 -37875 858 25985 26249 27850
10562 27850 17084 7332 -12419 -40857 -40298 -13609 -22079 779 26119 37842 41120 50877 45402
10549 45402 27982 35840 42480 16182 -19483 -17932 -21566 -21372 -23892 6960 -4933 28516 43599
10536 43599 62537 50659 15431 20170 44471 54654 42747 44020 38700 37687 -263 2966 -1691
10523 -1691 -5744 4420 14810 -8199 -4730 1445 -27306 -52024 -75783 -75577 -64637 -28052 -10884
10510 -10884 -5971 22724 16099 15831 25010 18068 23590 30107 25752 -2454 -6096 -5046 5404 6733
10496 6733 -4771 5815 4086 11946 7957 -6821 -25413 -27779 -20674 -12439 -16982 -41211 -22823
10483 -22823 -46451 -46077 -33498 -32187 -20568 -22085 -718 8648 108 -3666 -17520 -19784 -11114
10470 -11114 1097 -4736 -10660 -461 -16083 -9492 -21811 -37873 -37236 -2257 -11090 -4124 -5496
10457 -5496 5956 13766 1707 -7773 14177 33014 61187 75558 33201 7636 -3739 -22275
10445 -22275 -6323 6705 -14656 -10233 -15808 -44846 -23581 -24666 -30493 -33899 -36699 -39082 -28968
10432 -28968 -13071 9601 15937 -10887 -25188 -28486 -51864 -8009 20229 39913 12924 -35970
10420 -35970 -29644 6582 34915 20686 4448 1159 -9112 -9851 -14620 237 7047 9274 9854
10407 9854 24462 20196 5474 7907 -13402 -37584 -29927 -13602 -5768 30256 40321 44625 41529
10394 41529 43405 35739 9068 -3103 8253 14997 18149 18036 16038 7143 7445 -3924 -15858 -49874
10380 -49874 -51810 -77061 -81498 -29015 -1474 10584 316 -4774 13592 25288 21994 6596
10368 6596 -18896 6126 17373 3824 -19124 -30352 -21670 5841 29240 11168 -27185 -33564
10356 -33564 -6796 -2380 -5034 -3976 -7599 -23766 -23386 -19809 -29062 -23135 -1374 3679 -10074 -14290
10342 -14290 -7600 -9436 15029 35630 35941 24693 -7793 -30960 -37386 -31623 -24153 -32901 -68233
10329 -68233 -70791 -46494 -13909 -15305 -22781 -51973 -79848 -71711 -14631 -17236 -51442 -18965 -30427
10316 -30427 -27990 -14461 -11668 -24109 -45133 -40634 -18283 -24548 -3331 28262 54562 39864
10304 39864 2309 -7481 7046 29820 24875 18497 21811 22482 9459 14246 12712 10721 -12352
10291 -12352 4038 15052 17025 55061 40950 19791 23240 30170 29907 29408 27776 14557 -12803
10278 -12803 4230 -20651 -30497 -36442 -53512 -43532 -29545 -5051 13144 16814 -2938 -17035
10266 -17035 -1981 -13945 -26720 -39444 -28684 -24175 -47999 -42294 -17504 15207 21102 39530
10254 39530 53722 30609 29488 42124 25518 9680 23501 26158 -2745 -14219 -28626 -14972
10242 -14972 -14200 -35715 -11166 10114 18937 -2236 -7520 7564 -7098 -24835 -22094 4705 22044
10229 22044 39533 57362 51091 23816 18189 15804 -20785 -21394 5892 -3229 -10158 -7638 -24365
10216 -24365 7787 34225 19731 -7666 -19457 -17808 -32136 -49697 -35614 -29782 -38557 -21646
10204 -21646 -19215 -23029 -34268 -62764 -73245 -32549 -5979 -44428 -67082 -26611 -12285 -27109
10192 -27109 -32160 -19766 -380 -5872 -1360 -8115 -30435 -22666 4809 -3690 -12626 -12650 -22832 -13203
10178 -13203 -21648 -31701 -38636 -61506 -79888 -65453 -61692 -23016 19853 24066 37339 68642
10166 68642 52409 32245 36231 31565 -934 13161 23423 -4979 -41319 -41484 19085 41783
10154 41783 52100 30088 20641 -933 -6512 7548 20829 20244 6427 22703 27508 14795 -24504
10141 -24504 -8049 -5399 22796 33020 32039 38319 41467 21267 -8894 -53220 -50942 -23475 954
10128 954 14296 27438 42730 45842 42837 11742 11571 32016 32336 42266 25983 -9367 -12708 -14911
10114 -14911 -2589 -5260 22058 30626 21514 3540 17263 12224 13032 7619 -15081 -18245 -19291
10101 -19291 -5951 9234 33576 50301 34152 -8928 -35892 -9000 20451 2933 14199 26680
10089 26680 20871 39420 66359 54449 31931 20512 23151 31617 36098 34335 29973 3840 -3987
10076 -3987 -10268 -2880 -15383 5554 40941 39314 26857 31291 6551 -19208 -19267 9844 14997
10063 14997 -17002 -21799 15314 11419 -22655 -10679 823 -11671 -2909 16383 18986 15302 10367
10050 10367 42981 66346 88311 114795 111356 90987 75459 66429 60296 79223 70149 72630 74933
10037 74933 55436 60127 64740 45039 25559 19157 26579 27578 47309 45960 21698 20663 7088
10024 7088 10566 24090 31642 18910 18167 22434 24787 8488 -15535 8681 1801 -13173 -15999
10011 -15999 -11253 6231 29452 32168 27511 18107 -22841 -19258 -21672 -30348 -29531 -20822 -14394 -12308
9997 -12308 -3316 -16882 -38587 -7008 -624 17804 46889 21160 9941 43741 76529 86751
9985 86751 66598 45711 37151 38112 23126 12330 24413 7834 -15354 -27748 -5256 11462
9973 11462 19933 9602 -8857 4760 860 -12422 -8259 -3694 -2200 -36576 -42790 -52524 -41320
9960 -41320 7300 74189 84106 57378 32040 32310 31478 22029 5837 -2499 8850 54929 48696
9947 48696 44618 35194 19060 33733 25811 1782 -19019 -27819 -1861 23408 11479 -5186 7722
9934 7722 -11680 1651 26303 33525 26962 35729 52311 52186 58842 63205 64088 45112 46930 76976
9920 76976 90233 87253 59568 56511 37682 64262 74257 63729 72422 75550 70241 40027 55708
9907 55708 77406 62575 66284 94257 125930 114338 119541 101816 112097 137143 128437 157557
9895 157557 182097 219381 263541 272576 314104 376571 431649 474257 511857 574247 659308 757301
9883 757301 892321 1069299 1308078 1647103 2058339 2605171 3350184 4350508 5765794
9874 5765794 7733024 10176655 12278683 12822303 11821744 10201212 8460352 6791854
9866 6791854 5401795 4328371 3531292 2977353 2583438 2271004 1994472 1774270 1638082
9857 1638082 1545769 1493239 1423253 1348918 1319746 1325239 1411135 1525550 1613656 1762205 2010801
9846 2010801 2264395 2484511 2750043 3154713 3709272 4450526 5481326 6931196 8947212
9837 8947212 11984995 16555186 22636135 27679647 27941039 24420973 20091888 16009847
9829 16009847 12361915 9419906 7298362 5795273 4753343 4014840 3435953 2936935 2564209
9820 2564209 2262744 2004691 1819439 1669625 1553405 1450782 1399391 1390683 1384650 1381080 1381019
9809 1381019 1425513 1521418 1648142 1801497 2041117 2318441 2683323 3241715 4025816 5058213
9799 5058213 6452728 8387802 10625891 12262057 12279195 10918374 9118548 7357089 5786494
9790 5786494 4456628 3468948 2760859 2279646 1899278 1602380 1348254 1128263 960893
9781 960893 832489 740066 654679 566715 488930 452169 417289 402933 367216 358261 328611 305790
9769 305790 281427 240017 212701 183017 192494 202902 183479 161850 124777 134921 157477 167031
9757 167031 162003 152821 133509 107133 109006 91511 67262 56124 66705 53487 95414 120693
9745 120693 106899 98857 78704 69315 79096 78237 54418 37090 49708 44278 40514 22610 30903
9732 30903 9346 -588 20869 38907 58886 72140 76452 75132 69376 28070 15733 3881 -15122
9719 -15122 -1426 27465 50544 49124 21906 19325 13823 11120 12223 18715 11985 5041 19364
9706 19364 12145 7382 26043 50576 39707 30915 741 -11082 -7512 31471 58801 94443 85327
9693 85327 73739 57964 62445 61313 32031 22550 47071 9988 -11604 20582 26847 31035 53460
9680 53460 50466 27527 34606 45258 12196 11974 42868 65314 52175 34636 61053 70862 45822
9667 45822 8559 18528 12326 14357 17463 48511 61630 47482 34889 8971 5887 21703 428
9654 428 -37897 -24593 -8011 12611 46748 28998 36217 30086 5993 -5765 -960 2269 -1134
9641 -1134 7273 22051 4653 393 42459 34707 -7100 20037 50660 58962 53148 18074 11866
9628 11866 41641 55313 53124 19591 23958 17807 -3852 -1695 -8706 -25499 -31982 -20932 1325
9615 1325 16185 9340 14057 39190 32624 33555 56084 31880 7116 -11825 -17356 -29321 -44331
9602 -44331 -17924 17100 8401 24481 -759 -17819 -16353 -4987 -11218 7326 28717 53986
9590 53986 33527 34483 32739 -453 10955 28862 35450 26267 14380 33292 30301 32484 27826
9577 27826 37285 44361 -4497 -17808 -26993 -27989 -14438 -28260 -22510 -14008 -21833 -6546 17517
9564 17517 18140 39091 44741 42706 39372 61761 50681 33177 28189 31486 48933 50672 62367
9551 62367 77390 68939 30259 11239 19116 32820 47253 42864 45276 44819 32789 8129 -21698
9538 -21698 -47804 -39073 -11950 505 20645 13772 12966 12308 13786 19490 -2641 -25848 -40127
9525 -40127 8248 20050 46300 55690 59975 64091 65485 60636 34417 11820 -22100 -48084 -11163
9512 -11163 38979 27766 9390 -5796 -10495 9910 33546 18122 28058 29706 2658 -34056
9500 -34056 -16455 9172 41142 64868 53999 31796 16026 55389 58524 57670 64702 51601 35183
9487 35183 24324 23719 10983 14838 15292 40061 45299 17059 -4728 -27676 -12499 7077 1560
9474 1560 16260 29650 37068 35042 20012 35194 48239 34470 78807 103145 83811 60561
9462 60561 55100 38160 30811 44481 24433 7965 -1007 8545 -6010 4008 26604 45971 42147
9449 42147 -4947 -31757 -23395 -10955 -11984 -22428 -1799 2736 14562 22987 13174 -4117 -6884
9436 -6884 36394 36868 37799 51665 55364 43049 37680 22060 19181 -21824 -4062 -8527 -19695 -8833
9422 -8833 4252 2809 26774 12473 15610 11619 -4793 -21221 31172 50442 77291 103412 87988
9409 87988 61254 45571 1286 2595 25695 27377 39120 68714 71627 35664 5851 -1426 -19957
9396 -19957 678 -9824 -26465 -29699 -2007 12299 2993 15756 34260 62222 70528 79897 103953
9383 103953 95066 71032 42293 30750 84693 136667 165337 134821 113159 121374 126127 143732
9371 143732 172110 212471 215259 240840 283284 301012 299174 323757 407079 482616 593298 748313
9359 748313 907642 1111332 1295587 1412744 1520433 1584546 1632673 1619669 1543883 1441539
9349 1441539 1281887 1089028 911636 740482 588130 489628 396852 322891 259798 224289
9339 224289 184667 194563 174285 164336 139905 134203 120424 108648 82216 78977 96862 68130
9327 68130 32243 34743 18233 31325 38883 56740 90661 72135 39445 13288 37351 50091
9315 50091 69943 89022 63869 44443 35231 52273 28396 4353 -4434 24978 21974 26356 39920
9302 39920 71975 55244 38963 19896 18007 -1131 -22898 -32535 -21573 -5445 22808 28485
9290 28485 66419 69908 44027 35209 24869 26148 21714 30311 3602 30704 34747 16212 46943
9277 46943 73061 47619 53082 59265 43577 1133 -21142 -2859 31992 51269 85939 52852
9265 52852 15063 16472 38484 8078 26368 79521 140977 175154 178875 178574 145453 148845 157550
9252 157550 153577 132461 138997 160610 160365 153758 141142 157131 191280 194921 189854 178819 171261
9239 171261 185951 192965 195812 219013 204853 209913 237994 275921 282070 301365 280158 241479
9227 241479 251377 291270 311113 358983 417266 467376 545413 562845 608427 724112 822051 923380
9215 923380 1087105 1310393 1614407 2013260 2600021 3418514 4496320 5949119 8012074
9206 8012074 11053149 14796636 17061366 16252463 13788863 11216846 8826810 6735733
9198 6735733 5080291 3874033 3042352 2461046 2048811 1715902 1481035 1278525 1132428
9189 1132428 1025197 922119 834755 789720 686120 605970 538123 508911 480124 434778 381356
9178 381356 345209 327431 281313 248648 248204 244131 217825 235730 248491 262690 294359 315340
9166 315340 290179 250337 256591 236787 188580 197558 225457 246431 274871 314217 296576 277419
9154 277419 299582 314216 303826 270232 263360 262671 246145 217883 192692 181585 165671 150007
9142 150007 164601 159009 163811 136989 112143 108464 95098 107526 105685 97457 123108 153911 158957
9129 158957 169675 164111 173711 171280 179967 163454 165167 170243 156220 165192 140227 125756 153529
9116 153529 160929 184281 210331 210651 229306 219508 203671 173749 160127 176951 153486 149676 141247
9103 141247 125032 151586 135541 96781 79340 75063 80922 98706 90292 89914 88076 86908 90673
9090 90673 66153 79667 129010 182480 192369 184934 205334 287314 376587 453640 505611 553345
9078 553345 563105 556124 524979 519864 486317 426817 395739 372532 340181 330946 350084 396792
9066 396792 402788 379817 363515 339338 345878 367175 390977 376873 369150 376653 374203 340565 357517
9053 357517 384340 379398 365907 355331 336903 316089 287624 292274 269858 261516 286938 337976
9041 337976 378805 401151 410861 450312 500107 525360 494721 499321 487807 504667 529824 559520
9029 559520 592425 592064 604084 609779 607674 610796 608949 628026 659483 700176 707216 715981 736660
9016 736660 761483 793065 813385 883924 925707 945906 977258 1022600 1056702 1129575 1184237 1231499
9004 1231499 1295516 1342080 1385392 1419150 1468117 1511408 1564126 1624606 1691986 1792026 1956834
8993 1956834 2111450 2264149 2415027 2632655 2907276 3206481 3498408 3787452 4123586 4451422
8983 4451422 4773200 5170866 5632564 6093192 6642747 7273125 8045795 9047242 10263620
8974 10263620 11684842 13387263 15479637 17981170 21021246 24663219 28715032 32874669
8966 32874669 37452832 43540985 52240601 64942512 83620669 110691268 149219551 205675563
8958 205675563 291634504 410360509 510949151 512909889 442112962 360490391 285110042
8951 285110042 217423553 162385261 122256525 94762614 76078719 63006501 53456634
8944 53456634 46296660 40878371 36523664 32392266 28409908 24796952 21576636 18798779
8936 18798779 16477543 14570365 12944330 11594695 10452261 9451116 8562617 7789078
8928 7789078 7102421 6535808 6062759 5613696 5226784 4973283 4717066 4465601 4249251 4080574
8918 4080574 3919757 3769611 3602201 3436997 3291361 3120184 2924504 2747694 2593548 2474682
8908 2474682 2346604 2234715 2113481 2002014 1934532 1856478 1814961 1795010 1728466 1667796 1637449
8897 1637449 1618216 1567462 1517241 1465895 1431676 1404032 1367062 1328130 1281218 1225012 1193420
8886 1193420 1178126 1124896 1083938 1027170 974859 958188 970336 978089 964701 930987 896150 830408
8874 830408 830725 825047 850557 883703 892695 855834 838199 855351 861959 824871 768917 735709 727393
8861 727393 685779 646376 595412 555057 557140 551124 557529 549293 545428 570591 535022 533509 527412
8848 527412 470902 395260 414696 461530 473733 468746 468380 470340 447199 402501 357428 323722
8836 323722 309993 320905 296904 253434 248846 224135 240277 321630 476012 558482 541886 553683
8824 553683 559605 544700 550806 565148 571293 593017 600529 566671 519041 495469 486954 491520 450691
8811 450691 437047 428958 404918 398422 416508 439609 431282 368136 334952 320053 303111 313021
8799 313021 326288 337651 314265 292898 310979 324739 315078 316556 300343 310588 307628 296125
8787 296125 292514 315056 322324 290644 254396 254562 262706 283286 295905 261779 286953 320146 320128
8774 320128 300606 290211 259536 236873 238449 226126 196764 189051 198214 175617 174748 183014 156491
8761 156491 128536 103629 93821 124014 127588 111542 89099 109903 107494 105319 94097 98811 148463
8748 148463 164228 165486 146307 134224 130670 116995 130850 145631 144336 157447 156442 139575
8736 139575 161418 178160 148752 119155 116844 131332 92667 79901 74189 93550 102201 106209
8724 106209 82229 92208 110618 110959 110712 110807 118922 132859 174838 201117 187332 182864 200938 190003
8710 190003 159439 157568 144686 174322 168370 147704 151916 160420 183645 186561 157578 168466 182969
8697 182969 162161 172198 214217 200735 184831 198394 246039 281754 354350 415437 425062 383726
8685 383726 339717 306035 251767 238265 224304 190644 179804 152771 123952 164882 167927 150014
8673 150014 165364 164457 143563 147221 126054 88322 78538 81765 81854 58709 50736 26117 30609 49493
8659 49493 66404 50676 41337 32407 28815 6016 37554 105005 144251 166555 207221 280116
8647 280116 341597 481900 656263 813919 875616 790520 679857 576409 465213 362647
8637 362647 292352 251772 237942 209128 228805 218799 182228 173893 146038 141660 175841 173865
8625 173865 150846 147892 157399 188804 198845 168143 189624 206656 198516 196924 167472 178032
8613 178032 177282 160695 165098 157157 173275 150112 149897 172633 218182 224504 255380 301380 386375
8600 386375 487730 529914 539430 490087 421607 351558 278643 232925 182961 157393 143586 148696
8588 148696 145571 180928 158669 155727 157677 152647 174722 171273 168802 205356 215782 214504 201169
8575 201169 196890 204520 182148 168874 156728 179901 202979 203245 176032 208805 225106 263892
8563 263892 324424 376718 432997 537676 710628 880029 1074690 1264710 1449783 1571008
8553 1571008 1678821 1770049 1778493 1710008 1595956 1474768 1334237 1154484 975053 826548
8543 826548 716508 632438 525606 401038 336798 320734 305363 280792 225560 204129 181186
8532 181186 161011 126824 123977 96485 109685 117223 107708 73599 62963 72017 95270 133782
8520 133782 157729 157404 140614 124567 99138 85283 90042 79436 72064 84160 77413 92222 126217
8507 126217 118249 108598 117398 92563 102736 113709 104841 123677 119396 87702 64507 60187 104442
8494 104442 140981 106656 70355 51393 51179 58070 56130 68925 92333 81864 39401 51041
8482 51041 50787 35345 38385 18303 28645 30481 53331 52209 13765 20464 51229 50332 56802 89058
8468 89058 109449 127874 137441 142689 151726 127634 61266 22609 59666 68412 35904 57672 71324
8455 71324 95028 116946 104794 74594 68963 56558 50347 36211 32361 45104 33258 45437
8443 45437 75094 78322 63956 96910 116912 82597 43130 55499 111988 141605 86246 85077
8431 85077 94931 128165 122657 111279 123149 93827 84133 91619 99495 76772 65954 86294 80423
8418 80423 76105 61564 17695 32607 16511 17355 52674 91429 77080 76030 102670 125193 115397
8405 115397 105959 98961 90366 71751 45756 59118 58535 36540 56942 70903 61162 67238 81719
8392 81719 65288 45395 37770 63415 48799 25538 25411 31889 46805 59343 67702 74181 24877
8379 24877 32366 47331 18661 -23729 13057 68218 93651 78727 66525 80867 82859 50010
8367 50010 40945 33058 46065 84813 80776 84087 108335 117209 62552 14418 29569 23653 34682
8354 34682 46821 10974 -5386 17929 23838 45832 44598 23448 20355 29459 83093 108605 42788
8341 42788 -4207 1544 22187 53191 86682 58285 25932 39746 40825 37732 31850 26978 57768
8328 57768 54933 38922 24860 16482 10547 -13130 -33345 -6596 5761 25753 29036 18964 43421
8315 43421 47318 68123 89425 89441 96574 100621 89727 74137 75445 47062 30793 25062 13797
8302 13797 8810 -13812 -13555 4436 33601 75412 62175 64530 81509 44035 63148 44397 8428
8289 8428 22501 40768 28392 26231 63296 55409 60959 73556 76809 75267 62886 52363 9487
8276 9487 -287 8 18784 40976 35710 72177 52332 37125 46020 45024 26761 23264 -11906 -6523
8262 -6523 34200 37520 15074 31411 37430 11501 -13211 -3831 -5704 28835 35417 20649 46791
8249 46791 47834 47522 55446 73896 97955 98228 76318 97613 88651 67525 45231 32896 29555
8236 29555 7608 19635 42399 42585 38979 23145 8872 18952 23229 11149 15813 33205 29828
8223 29828 19781 21584 16280 11297 -20562 -9508 -27554 -27776 -36889 -26702 8988 1547 1561 -14600
8209 -14600 -42076 -9067 6249 -6059 1202 -24267 -54302 -1081 46784 44759 40630 42234 26724
8196 26724 19482 5119 28829 30967 24964 5393 5804 31645 66520 52559 16538 30139 39565
8183 39565 39025 52277 58229 36759 50803 51740 31483 23318 32183 56269 28343 14572 -1979
8170 -1979 27419 8639 22122 35182 27517 33662 26273 4427 -15103 -4673 8393 30318 39778
8157 39778 25817 3696 15810 32143 33265 -27496 -23250 -11407 -1551 61504 66963 34235 41692
8144 41692 44115 -12713 -9155 2344 15195 58404 48884 23279 10944 38041 39161 6064 3773
8131 3773 8681 17396 -5719 4613 29563 44116 35189 26730 25076 32173 30031 10503 10659 22065
8117 22065 15977 21545 27019 27148 32143 25139 11763 -3269 2852 18822 27334 21537 19916 24578
8103 24578 25398 35783 28009 14194 -22120 -25289 -19951 -21105 -6209 -20250 -18776 -22466 4218
8090 4218 33263 18852 14671 4875 -5582 -14956 -24647 -49711 -60033 -58372 -26821 -22609 -413
8077 -413 20611 25925 25898 10947 -26571 -18413 50025 58724 43992 47086 55653 49790 46448 21143
8063 21143 34169 16532 -15931 -3921 20453 22309 29747 -3621 7040 10265 9957 33817 43034
8050 43034 32376 34245 40131 50501 61364 31855 -3826 7133 3951 5109 27169 20429 -7922
8037 -7922 -3719 27908 8776 -2243 667 -1297 15861 11589 -1723 1492 -10509 7321 39102
8024 39102 56730 44887 40200 44864 1338 -9208 -4940 -35919 -20711 5214 -238 -645 3272
8011 3272 -8554 -6387 10538 28696 53572 34988 12366 9966 25915 38508 5482 4329 -7256
7998 -7256 10002 15811 -17365 5998 32232 8319 -22036 -16308 -14580 -29529 -31578 1115 20549
7985 20549 9260 6239 12334 37028 44984 48566 25672 22422 25186 25522 21034 32920 -13350 -28065
7971 -28065 4943 9778 -22029 19529 27328 48374 49723 31694 21665 44995 79109 71530 60418
7958 60418 48571 -5223 -13048 1445 24860 48141 48510 44229 59293 84414 74551 66007 66964
7945 66964 59022 25271 39008 34642 33415 63359 80972 84152 71919 63268 43784 25878 13539
7932 13539 12454 20443 20572 21899 24333 -6038 9602 -163 -848 11169 62483 74189 71269 62459
7918 62459 97427 74458 46517 70475 72437 64055 68096 92741 103758 80229 57841 24808
7906 24808 43556 62593 57398 42742 49460 29571 4390 -28558 -25483 -17354 -22283 -17348 -9820
7893 -9820 277 -2640 -4928 20627 22026 22230 31429 40312 61632 48286 51422 45076 39515 41630
7879 41630 47282 54036 37415 11574 1144 -27273 -37311 -25544 -45276 -41108 -198 -10896
7867 -10896 -18869 -17225 3880 332 -33456 -33138 -22198 -9822 1394 2602 -9128 -9040 2775 15725
7853 15725 5558 6093 18875 9053 -689 -7797 17374 65142 45372 33231 47471 -1921 -20409
7840 -20409 -3843 782 14368 5989 -12252 -11163 5382 34615 16178 -9418 -1097 14696 40135
7827 40135 41671 20771 15936 9376 13888 10487 17798 -99 19274 24628 13820 -18450 -34248
7814 -34248 -45305 -25603 -2428 8176 -8435 -25893 -26313 1205 1179 1895 618 -1881 -14994 -30067
7800 -30067 -51288 -21826 -9871 -18481 -12206 23626 33468 6799 6025 24527 27635 -2807 -11719
7787 -11719 10971 19807 50240 59042 42138 39688 12376 13758 17786 11716 10180 23860 13888
7774 13888 20692 -20954 -41991 -56014 -66759 -41650 -19826 -14985 -9485 12679 3548 686 -25535
7761 -25535 -26186 -13588 -8706 -12987 2566 48637 57923 49090 43485 32537 6861 3863 1032 -266
7747 -266 34277 28790 28556 32862 13028 8103 -6725 -20155 -43996 -43155 -24284 -42768 -38904 -5794
7733 -5794 5752 24700 30069 24706 13846 5104 -22789 -42024 -23283 -9081 15717 32302 20614
7720 20614 2053 16016 22434 3897 5851 18197 4184 8617 24527 31501 20792 22483 31935
7707 31935 22850 -2998 989 26326 15265 12455 -57 -3280 19385 32774 30030 -5937 -7710
7694 -7710 -5293 8615 21904 8701 -11032 -12874 1203 11390 -9098 -38981 -7115 1891 -10857
7681 -10857 -25111 -12351 8990 6128 7408 8759 10474 3371 14825 19048 4606 7007 -3617
7668 -3617 -6472 15320 25474 17288 10608 -3209 -26173 -20472 -12103 -18897 6685 26026 -13806
7655 -13806 -9384 32 15637 7698 6004 -1209 -14780 -32660 -48482 -41836 -5494 30081 52996
7642 52996 43142 39494 13359 1166 17718 33578 16713 -10699 -5817 -31845 -26011 -20871 -47028
7629 -47028 -60244 -41918 -41798 -11800 -6917 -25663 -12852 -8747 -15657 -26607 -12396 -8166 -32590
7616 -32590 19853 21340 20113 19551 1013 -9917 -28518 -22646 -11853 -17595 -26876 -6678 -559
7603 -559 -20513 -48425 -40174 -33088 -41434 -33697 -20210 -12126 -9944 6972 13404 28191 49030 49657
7589 49657 2016 -29377 -14242 31006 30732 11577 2367 -13196 8009 46984 33513 17809
7577 17809 9937 24326 24040 14763 7243 35004 42712 31415 21613 15789 6600 38377 48522 41063
7563 41063 38687 36361 43994 30914 44464 33030 23276 32340 16464 -13917 -11461 -4764 -17449
7550 -17449 -21021 -16843 -5129 -4867 21607 22370 31941 24552 4908 26242 55404 74932 99143
7537 99143 100359 71589 60555 51636 43779 46791 57601 -1898 -50638 -52278 -56418 -21502 -12451
7524 -12451 -8644 -11611 4514 51671 36651 5074 -4003 20531 22713 -4026 -3706 -9012 -24212
7511 -24212 -20940 -9825 -3113 -12407 1987 18206 24041 9720 8603 47773 64044 35940 18810
7498 18810 8079 27595 19397 5374 11153 -3030 11992 34832 34788 46831 63042 83618 95278
7485 95278 63613 41475 24004 -2698 4379 24467 32678 16027 35389 51876 36279 31724
7473 31724 61576 47915 3924 12706 37140 53894 55292 61885 32178 -5451 -26390 -23511 19984
7460 19984 36171 35272 10645 11379 23430 27904 6341 -48 -20525 -35028 -30509 -9689 -29692
7447 -29692 -47589 -37794 -39162 -63597 -48389 -33662 -11956 14812 24077 9505 4983 -6567 -14886
7434 -14886 -33147 -19125 794 -4744 -15209 5927 7191 17533 9369 9885 -8088 -11520 5692
7421 5692 21064 28747 1877 -15888 -18728 -19048 5278 26609 20258 9786 3285 -2559 23690
7408 23690 57542 16271 -11074 -28210 -22544 -24352 867 -1604 -13161 -29159 -48087 -20900
7396 -20900 -18108 -34050 -15300 10259 28902 56465 14150 -2457 -2077 991 6614 -6194 -17261
7383 -17261 -1433 -10706 -13512 -15145 -25999 -11099 22103 17496 22512 35603 39448 13404 -25966
7370 -25966 -52020 -10038 8428 -11522 -9205 -32934 -30790 -16559 -8890 -8602 12436 -357 -9443
7357 -9443 -15568 -21201 -2814 17978 37868 30034 19692 15534 2928 3627 -8388 -15044 -27341
7344 -27341 -13599 -4400 7943 1998 13601 6695 -25917 -54698 -27758 -26905 -27818 -34529 -6519
7331 -6519 9713 39633 35473 27903 41626 28137 21152 -11520 -22430 -23191 -11612 25640 51119
7318 51119 35072 45205 56062 19921 13008 44099 30349 18887 4626 -3968 2361 19654
7306 19654 -1115 14073 28829 -16607 -15874 1955 36027 48324 39254 50127 29284 4286
7294 4286 10949 20039 8920 -437 -18362 -23721 -28423 -15496 2104 -11322 -15258 -10064 3051
7281 3051 -12439 -22783 3123 -3255 -11374 1447 -12802 2486 14175 -12413 -23192 -19702 -9825
7268 -9825 14333 -7571 -15470 6839 -2195 -9178 -6436 19031 32815 21576 29939 23815 2782
7255 2782 -715 -21195 -6487 -9287 -24033 -27612 -7909 3656 -47615 -68361 -52560 -33264 -18113
7242 -18113 -11605 -2633 -2109 21548 19171 31339 17435 21016 -32635 -58885 -63494 -32940 -25804
7229 -25804 -16570 4670 11313 17007 26581 22118 -13723 -30215 -33571 -22521 -6688 -13570 -11250
7216 -11250 9123 7165 -2903 -21409 -19532 -26113 -22769 4809 4863 -22508 -25672 -18152 -25492 -56738
7202 -56738 -57173 -20378 -5337 16910 14858 31973 43643 31924 43569 13134 -760 -13452
7190 -13452 -22188 -41648 -36674 -43920 -26559 -39458 -59348 -70912 -33997 3205 28031 45555
7178 45555 7965 -2848 16958 31624 11034 -20660 -23776 6256 1177 -35293 -29397 -16974
7166 -16974 -6832 -7193 -19564 -35151 -1799 3899 2037 16408 2067 -2240 1692 13663 30883
7153 30883 44455 78984 63621 41377 8484 -28187 -51402 -41711 -7697 8950 12433 48777
7141 48777 66661 46695 22055 -30236 -56903 -52515 -27277 -19563 -25783 -9949 5434 9300 -13678
7128 -13678 -40313 -43684 -18838 -15209 -26927 -46596 -46734 -24941 2359 40498 18517 -18556 -5582
7115 -5582 19355 8136 5880 -1188 -9014 -27720 -27922 -28287 2340 19267 13888 1404 19910 25878
7101 25878 -4899 1130 -11815 1298 -11044 -45460 -6267 53 -12153 -39995 -34376 -30832 -20751
7088 -20751 9241 -2416 -39229 -69254 -53369 -35112 -20288 -17162 3124 5021 -2497 -24132
7076 -24132 -36385 -17630 -14973 -35010 -40816 -76506 -49386 -43910 -65586 -24312 27146 10802
7064 10802 10006 24999 19712 7491 9141 -11361 -3886 -21145 -24175 -8466 3213 8056 -13152
7051 -13152 -28291 -21924 -36228 -39628 -13866 -11367 -17859 -42971 -41025 -4954 12452 21682 27895
7038 27895 22338 20564 21522 40512 37784 32615 25768 -6159 -9391 -6351 -48535 -74350 -84222 -53085
7024 -53085 -26330 -10715 -3959 13936 13221 -35456 -33646 551 4736 -7591 -17287 -26706 -27061 -9691
7010 -9691 7908 -10118 -48959 -47260 -18070 6834 37276 61510 54931 22581 -14108 -27321
6998 -27321 -21236 15531 59242 60520 43976 43199 20096 4207 2180 -4171 -25273 -32893 -40537
6985 -40537 -17094 21405 744 -11578 3032 -17059 -67993 -71385 -33259 -10542 22080 20643
6973 20643 -3592 -2907 -11470 -9316 -11371 -28899 -10922 4607 3600 -13959 -33058 -7932 20591
6960 20591 14596 -686 -42728 -40935 -24300 -28064 -37334 -24233 -22944 -34589 -32866 -42486 -50061
6947 -50061 -13149 -5091 -6253 -11073 -30195 -5522 337 -32473 -47516 -27643 -51385 -49641 933
6934 933 5103 -20875 -13191 3683 14568 6023 6222 22157 40658 31067 -7109 -31202 -48978
6921 -48978 -55956 -6796 12214 17715 2144 -11422 -37059 -55891 -66372 -42486 -18467 -82
6909 -82 7609 -10717 5211 12384 -32243 -54674 -53616 -38078 -1370 29469 47332 17441 -11537
6896 -11537 -32811 7880 53142 35922 20355 -5129 -40589 -13083 16080 28597 -15645 -23145
6884 -23145 -6980 -14771 7143 9129 18426 51181 21063 -24928 -26431 -19764 -9323 -15214 -22112
6871 -22112 16732 32794 351 -2903 -11467 2628 19277 7591 -3676 8470 -6362 -11009
6859 -11009 388 17561 39151 27739 25685 43666 28257 15179 -4521 -15977 -32520 -35708
6847 -35708 -56878 -54106 -34675 -6671 25470 9174 -17549 -26864 -11566 6906 10590 11895 17478
6834 17478 26345 15806 39186 17075 -7859 -2759 19395 27437 20744 24426 31315 17870 37061
6821 37061 17610 -40240 -39988 -38228 -33572 -30365 -14749 -9538 7231 -12166 -22300 -28180 -35405
6808 -35405 -46939 -39214 -50646 -39129 -5745 10568 10746 59050 76056 63763 69951 88920 60766
6795 60766 44523 13467 28828 36726 7392 -7579 -8062 -689 -5872 -14784 -62326 -86759 -100192
6782 -100192 -60866 -39121 -44315 -49730 -31857 2747 -11433 -6289 -20416 -42239 -32674 -31255 5413
6769 5413 6649 1306 -18892 -14134 956 6839 24557 22292 -12021 -24958 -23530 -28516 -33069 -21593
6755 -21593 -30770 -41593 -18169 -687 -1932 -18087 -24697 11652 51848 59055 59903 44357 35753
6742 35753 46689 23403 -57 -29837 -41846 -24506 -14889 -23299 -36402 -15311 11762 9648
6730 9648 -16313 -17372 22134 11434 2385 33242 23111 1000 -6823 -5917 -1072 27 -8034 4369
6716 4369 23847 29369 -10323 -22066 -19040 -32878 -32334 -21004 -23696 -5282 10271 977 -21543
6703 -21543 -23237 -8703 -22900 14142 50271 30094 4412 -17305 -4774 13793 11691 18614
6691 18614 -2496 43482 55939 43016 34178 18283 11214 7882 18851 39306 55444 28069
6679 28069 32049 27004 -9271 -1607 5941 -12088 -39849 -43265 -42012 -20016 17337 7363 -1965
6666 -1965 39738 71565 20950 -22064 -23052 -31970 -12361 6175 31567 -130 15069 35853 4292
6653 4292 -14962 -18748 8195 13322 18228 22499 -9240 -5761 34727 39561 14318 2884 -22377
6640 -22377 -5845 7597 10508 16266 3074 6975 -1979 7706 -1904 -586 -4137 2784 -34019 -57293
6626 -57293 -22038 6732 1020 2870 8607 37433 16645 -22549 -13210 4301 -15740 -9392 -13157
6613 -13157 -4712 -13479 -21859 -5598 9137 5748 8843 -1628 10596 15253 -954 -2447 -13273
6600 -13273 7143 10287 151 -22266 -30542 -10363 -5612 -22837 -19883 -8032 -1042 18675 31633
6587 31633 34320 24589 16489 13831 37527 51605 48598 46075 16021 -12057 -18372 3816 20388
6574 20388 -11079 -22308 3807 16905 33903 40129 23811 -2554 -8075 -42390 -64289 -55405
6562 -55405 -27449 -8519 -10466 -20025 -5635 7099 2439 3492 -1652 12734 11132 14733 26229
6549 26229 -16436 -14872 15767 10881 -6265 -39316 -31031 -19919 1005 13560 -18494 -36956
6537 -36956 -40464 -53092 -50716 -61260 -118984 -119194 -64447 -51541 -51618 -29618 -13589 -21158 -7544
6524 -7544 -241 4395 12224 -12989 -37255 -56542 -51775 -30297 -23070 -32176 -44086 -48091 -65620
6511 -65620 -54295 -36772 -32061 -14908 -13963 -6290 -21665 -28527 -49178 -37072 -17533 -17786 -14206
6498 -14206 -7694 -27086 -37175 -34854 -34999 -14411 -772 -7057 -15818 5472 -1649 -16000 10512
6485 10512 48862 53666 50607 50893 71794 81886 53175 50543 50315 62517 68856 44968 18789
6472 18789 9016 9299 10656 1463 -17430 -36668 -30370 -24668 -15192 -35578 -28618 -13417 -41348 -44853
6458 -44853 -29561 -15838 -14187 -8807 -16523 -46130 -49036 -31581 -23638 -12890 -781 -6266 21147
6445 21147 43560 25373 7972 17670 14382 -17106 -10127 -7498 -23030 -18693 15001 23965 -17356
6432 -17356 -28653 -15524 -7556 -4373 1708 2583 -6792 -7817 -43165 -31028 -2450 21274 26183
6419 26183 45266 64679 32806 -13850 -45104 -24446 -10878 19279 52999 60572 60957 62969 73129
6406 73129 46541 -4091 -35639 -46218 -44550 -39772 -32209 -11035 -2188 -27594 -37507 -27822 7408
6393 7408 19482 11732 13616 -7414 -3710 5142 -16397 -10966 960 -3224 -7099 -30369 -12056
6380 -12056 19454 -32176 -40485 -8135 -8766 -8244 8603 -7431 3237 17850 -14767 -38377 -25268
6367 -25268 -13289 -6675 -19952 -64129 -68215 -91850 -50251 -21992 2494 -21961 -45884 -27513
6355 -27513 14884 22651 19444 19888 25355 16844 2152 -14130 -36098 -37685 1508 42643 37142
6342 37142 12299 2076 9256 -529 -21565 -43372 -22912 -6978 22156 46188 28184 26407
6330 26407 10385 -33374 -60928 -58407 -40755 -53386 -52540 -21019 -13699 -31459 -21778 -1048 15759
6317 15759 15790 12057 11291 -4765 -15555 -24721 -18324 -26227 -14576 12544 9640 -4794 -18023 -32534
6303 -32534 -46056 -40557 -52634 -47561 -71431 -51934 -30616 -3463 5581 -14498 -27710 -3467
6291 -3467 36462 37452 -7162 -32405 -40495 -44747 -35070 -2792 11886 16891 -872 -15458 -7002
6278 -7002 19922 38798 11486 3892 -732 -15889 -5689 2608 -22002 -23899 -8446 19227 25737
6265 25737 -1797 -18808 -19743 -19898 -29649 -50456 -79997 -74803 -48177 -32600 -42471 -48964 -53683 -71164
6251 -71164 -62028 -27875 -14854 -7278 -16222 -4596 11581 4445 -13793 -15669 -6779 4537 27028
6238 27028 19509 -26978 -40271 -24179 -26486 -47351 -30978 -11891 -11486 -3285 2738 19496 40740
6225 40740 25619 21734 268 -14069 -11844 -8287 -16240 -15397 -38195 -36796 -17582 35396 61840
6212 61840 64967 49868 40356 21049 -6880 -7342 -263 2046 23121 13334 1738 12459 15544
6199 15544 16980 11009 4500 6648 -29676 -46552 -51326 -33665 -41396 -40386 -38250 -33340 -38607 -39895
6185 -39895 -39087 -25611 -50201 -56103 -50187 -52986 -20033 -4856 -3864 -4571 15273 17367 -1759 -8806
6171 -8806 -1329 10800 -2130 -34094 -30082 -12116 -11711 -4898 5624 9538 9032 -4972 -17725 -41754
6157 -41754 -55402 -30574 8903 -4909 -50858 -47607 -18773 25724 21841 -33899 -41530 -25360
6145 -25360 -819 31254 28801 16021 -12861 -21301 -21313 23398 20754 9558 34610 27862 19825
6132 19825 42069 53548 27722 4468 -13688 19748 42567 40544 42798 42026 13134 -23055 -10134
6119 -10134 -658 -21532 -8400 17400 9433 6705 -11018 -43353 8389 46168 32526 36128 48004
6106 48004 24993 41926 56234 36082 38365 19561 24493 5771 -27422 -20522 2780 8626 4615
6093 4615 2317 -6518 -37295 -18312 13571 6828 6134 -6883 20017 35114 20323 -18345 -1961
6080 -1961 30323 10098 588 10348 -5590 -15154 -10194 23648 25888 -2315 1318 20781 26627
6067 26627 3959 47609 65928 42613 25785 26106 3496 -48466 -42812 -13634 -18981 -23544 -12464
6054 -12464 8504 10277 6305 -383 848 652 -820 9923 32427 2922 -10594 15751 1878
6041 1878 -8809 -12759 -28849 -17639 -26600 2339 10630 -13450 -24856 -14420 20392 12346 -29656
6028 -29656 -46564 -9608 5199 -27325 -28486 3328 12286 -3354 -24502 -56613 -66405 -36062
6016 -36062 -14865 -20032 -13009 15219 36628 22161 8278 17772 976 -4430 505 7933 19621
6003 19621 20532 5614 -11683 -15873 3882 14327 -9689 -49638 -48782 -35824 -42067 -48619 -69213
5990 -69213 -38585 -42774 -45909 -13999 8134 31947 41763 18350 -3350 -6959 -3271 -7639 -12272
5977 -12272 -32687 -64434 -38175 -19937 -17263 -10634 13449 4840 -5010 -19820 -36420 -34750 -30803
5964 -30803 -9055 2973 5200 15565 7410 14354 18831 46306 73865 57301 28139 23482 6391
5951 6391 -4435 -6414 -49276 -43740 -21790 724 -2978 -14753 -5419 -5111 -4744 -27622 -8844 16606
5937 16606 4228 -52746 -65727 -28210 4373 15358 3721 -28364 -41793 -25349 -2630 -8149
5925 -8149 -4488 -27745 -25603 -28609 -18913 -18417 -23909 -13750 -6702 9315 8383 22825 37217 27584
5911 27584 -9348 -24133 -12700 4257 9946 6989 -3717 -45327 -65312 -66257 -51604 -21863 -29426
5898 -29426 -31463 -21089 8168 17177 13198 -1368 -27350 -52161 -49594 -42763 -12711 -10254 -19261
5885 -19261 -33231 -24680 5065 27910 17313 -4856 -20335 -44662 -8474 -2787 -13590 -20417
5873 -20417 -32320 -29198 -33435 -46586 -22292 -42377 -35694 -15549 -23466 -20406 -18028 -10805 -7228
5860 -7228 -142 11418 20055 9267 -10503 -855 -6200 -3987 -4892 -3579 -23212 -20747 -3688 -34632
5846 -34632 -38491 -10280 -22374 -41320 -45297 -38275 -11566 2658 -27085 -47848 -30964 -8366
5834 -8366 13325 -16611 -49097 -45707 -39376 -36683 -30279 -7265 -12328 -3807 -13925 -49387 -48174
5821 -48174 -20695 1912 12283 -2503 -2293 -2526 -7231 -6512 -32831 -66103 -71374 -43067 -36031 -38887
5807 -38887 -15414 -7624 -12302 -24515 -27928 3489 1942 -33431 -17747 593 16060 48269 9743
5794 9743 -15046 -1712 20284 36550 54746 49506 35804 49655 53070 28576 2537 -1548 44146
5781 44146 38858 722 -29270 -60226 -76950 -62450 725 31847 15071 20762 58228 41830
5769 41830 7802 -29587 -18983 -3367 -9077 -6047 -9939 18960 49098 23219 5764 5239 10695
5756 10695 -1340 -2152 24754 19344 21342 -9218 -26938 -19968 343 17959 19069 26250 -8338
5743 -8338 -14099 -8958 -8362 -2932 -13787 -2308 46411 52145 29032 22195 16929 5222 13170 30226
5729 30226 43641 34025 14659 5302 29215 44657 21125 28743 44706 34660 15635 16136 2529
5716 2529 -3675 -2132 22816 44219 25768 7632 15459 57519 110130 103185 57784 30129 -7025
5703 -7025 -9710 -19240 -34068 -56824 -38053 -6860 -10830 -33960 -11150 43083 52175 33615 15059
5690 15059 9520 -18950 -14429 -7296 5119 26578 11350 -19717 -52618 -59155 -63714 -61930 -64555
5677 -64555 -51547 -56225 -51091 7532 21300 -16262 -21534 -38940 -48841 -43227 -36297 -26032 -27885
5664 -27885 -46314 -48320 -12510 -17106 -44012 -30415 1950 28810 25061 16346 6041 8514 -11858
5651 -11858 -20237 -13087 -909 -9419 -33940 -4471 -31434 -60652 -50087 -52164 -58740 -40546 -9945
5638 -9945 -1819 18352 28657 50737 38673 12165 -17567 20139 39472 32878 34810 65668 62586
5625 62586 33569 214 -2930 -5880 -10777 -12954 -3919 -33332 -71785 -65910 -86442 -83568 -46891
5612 -46891 -25213 -5068 11469 6723 6341 8090 22000 28560 27989 6723 -31265 -27038 7992
5599 7992 3521 -13393 -1139 -33766 -54712 -36912 -11530 301 9429 -21377 -21561 -6364 -3456
5586 -3456 -10077 4692 16857 -7186 -23206 -14313 -4257 -9558 -18369 677 948 -16859 -20579
5573 -20579 -8029 -21160 -12244 -13624 -4066 -4024 -19298 -36547 -38377 -40573 -39042 -25595 -11705 5568
5559 5568 29149 47478 38741 40978 22195 8153 30803 32411 2513 -8376 -4550 48250 44470
5546 44470 15646 3950 23779 9458 2588 -11778 -26485 -18347 -4755 -2189 2829 -28760 -30217
5533 -30217 -32812 -42549 -53400 -27586 -23442 2912 36483 1982 9784 31620 25661 18153 25016
5520 25016 17023 45627 56011 68943 70588 61809 57888 52288 44213 42181 39719 16930 16409 40728
5506 40728 45738 46038 18706 855 23983 24079 20787 5634 -18763 -7855 -15048 -21696 -15953 -38219
5492 -38219 -50201 -67747 -42865 -15459 -21485 -49237 -36663 -27613 -10198 3575 9679 -15843
5480 -15843 -36317 -16683 -12032 -26344 -18272 19615 18218 -15090 -17339 -46194 -47292 -27804 -24116
5467 -24116 -54819 -34126 -33753 -6486 -4826 869 21599 32053 12581 -19912 412 3475 -11475
5454 -11475 -32141 -1898 14426 22800 30717 35363 22713 8055 5895 2927 -6591 -15433 -1266
5441 -1266 -16059 -32832 -33447 -27252 -17477 -21186 74 43851 12954 -23767 -9849 -2665 -27128
5428 -27128 -27400 -17139 -9346 -28859 -15681 -11971 -7063 -16112 -15578 -1361 -7633 -11622 -9571 -11146
5414 -11146 -19161 10608 -501 -7543 23983 18842 -30550 -38171 -27257 -7176 7586 23055 36677
5401 36677 58341 64840 58204 49530 24012 6784 19157 -18171 -30204 -35747 -6773 -14614 -13987
5388 -13987 13953 -22209 -37151 -31916 -19252 -9019 22653 35425 19728 17758 26401 15051
5376 15051 6527 19965 16111 747 -5915 -19325 -14709 37324 65155 44157 32307 28854 38472
5363 38472 10686 4470 38551 36037 6102 -2914 -18803 -3308 4346 -10799 -6322 3506 23000
5350 23000 23094 -22814 -27429 -24681 -31318 -8979 -16262 -40187 -37296 -36697 -30348 -14801 -29838 -27709
5336 -27709 -26343 -32395 -14254 -15802 -33534 -16532 12557 27176 11477 13532 13045 -14461 -19783
5323 -19783 -17197 -4400 6693 20396 3608 11838 4570 12032 27252 31709 -4527 -13619 -10435
5310 -10435 3556 7750 22648 26287 15487 5952 10612 -5884 -10567 -14733 39327 32347 -24422
5297 -24422 -28128 -7265 -13331 -30319 -33508 -18270 -11428 -23531 -28462 -46655 -55197 -33934 -25683
5284 -25683 -3815 17475 2420 -10327 -5465 -5619 -7465 -20616 -27600 -38173 -32387 -22634 -35679
5271 -35679 -39301 -57390 -40789 2493 28807 964 -21760 -41125 -38247 -41075 -31382 -33260 -31615
5258 -31615 6299 10912 16732 5338 -1501 3197 9965 10585 -8297 -16909 6243 438 -24644 11918
5244 11918 -2964 -29716 9376 56178 83349 102040 109583 82732 44889 5918 -26516 -42731
5232 -42731 -54844 -45038 2477 11600 -38169 -23197 7212 32385 17970 -13010 -39707 -26365
5220 -26365 -7056 8218 3921 -35449 -29005 -27701 -53393 -33543 5115 13020 -3116 -1872 -15128
5207 -15128 -29532 -33921 -18589 -19239 -20100 -18138 -21444 9433 24442 22096 31951 41738 27788 -16047
5193 -16047 -2230 30430 48204 43540 47349 43064 39955 44299 38707 38178 27173 33864 -1681 -16291
5179 -16291 -15870 -27092 -10888 2280 26483 25351 -15123 -10907 -27973 -26074 -30318 -46527 -50147
5166 -50147 -30062 -34157 -61452 -55613 -64437 -46579 -18972 7803 -3741 -5205 5030 -8239 3874
5153 3874 -16150 -28336 -43162 -19338 5055 4339 -6835 -6528 2370 2741 -5284 22559 7011 -74
5139 -74 -3310 -23021 -8282 -3693 -20389 -22599 2482 16107 10938 13912 32378 32121 18809 42932
5125 42932 17453 2331 -8090 -17966 -5641 -8373 -46229 -47667 -36800 -31446 -6436 17455 35919
5112 35919 55451 64159 45409 29129 8164 -6040 -16529 -15501 -15388 -24430 -31095 -33501 -40120
5099 -40120 -58841 -28196 -10332 9237 -22750 -22206 26375 30895 24351 13441 -10298 -38124 -49847
5086 -49847 -49889 -15900 -21497 -42916 -18314 -8456 -22697 -32077 -37878 -51506 -66489 -66831 -28708 -13083
5072 -13083 -27442 -36548 -13935 -6439 -24107 -23302 -31036 -42323 -16362 -757 2105 3767 10108
5059 10108 26198 36958 40862 19643 6913 5648 14313 17442 2882 13547 15962 7805 -18057
5046 -18057 -29512 -12932 -15559 -9816 6596 5815 9057 1069 11122 47700 54204 42943 52063
5033 52063 55063 33782 9079 20200 40803 23440 -18184 3818 2681 34133 7501 -29576
5021 -29576 -24905 18284 9323 14431 5112 -17362 -49453 -23172 -15082 -271 24588 33792 15168
5008 15168 -6681 -2894 14356 -18598 -26693 -26077 -58089 -50658 -27329 -21538 -30416 -17857 4543
4995 4543 23103 27449 42321 40694 55366 54590 26879 9034 31382 52970 40111 34722 23492
4982 23492 13359 -7031 3404 19053 15725 -14247 -24502 -300 2867 19060 3829 -27718
4970 -27718 -46513 -24773 -1022 -6299 -32698 -13237 14587 -15618 -19809 -11725 2707 -1703 -10873
4957 -10873 -9534 -3955 6069 45455 36004 5920 6687 32481 11096 24638 37446 32121 22968
4944 22968 22626 4439 9867 -18257 -13372 -22023 -13049 204 8410 -3878 -61627 -62290 -37383 -37418
4930 -37418 -58630 -52812 -27665 -31386 -43227 -43428 -74602 -62869 -37594 -30920 -15061 -20200 -49455
4917 -49455 -42952 -36032 -13354 5271 8820 17739 5597 20578 25289 -1529 -14793 -16439 -64464
4904 -64464 -40118 -31575 -47533 -54783 -45813 -26857 -37545 -30627 -23289 -7798 29613 37898 25817
4891 25817 50651 25112 1539 12143 39263 31809 26593 12224 2806 -18479 -12162 -11245 -29907
4878 -29907 -27572 -33918 -18923 -14709 9687 -8731 -50559 -60042 -42149 -19057 319 -22006 -36047
4865 -36047 -43856 -42974 -36121 -39277 -51306 -40024 -19156 -41478 -73622 -76227 -41165 -4688 42390
4852 42390 75733 52726 26944 -1576 2868 6676 -20350 -31543 -26856 -29980 -42646 -52050 -67350
4839 -67350 -54760 -35888 -11146 -2361 3031 14969 -12430 -16166 -19889 -4455 13282 43316 76155
4826 76155 44150 -248 -13482 -20006 -14860 1206 14090 -1004 814 9676 39688 68558 20173
4813 20173 -14266 -19203 -53668 -49828 -23547 11374 13303 16702 38091 46368 45048 18741 3582
4800 3582 -8308 1985 15636 13052 20922 47439 58543 43585 -7820 -5028 16411 37681 23847
4787 23847 8732 -8801 -12689 -11077 -329 -406 28382 36701 39452 28858 8111 -16374 -16820 -9562
4773 -9562 -33789 -47498 -75785 -53211 -34360 -61091 -51313 -21355 6717 -2203 -33537 -54909
4761 -54909 -17308 -2230 20101 17865 37912 59820 61393 50759 27722 5441 -7292 12261
4749 12261 13289 -16679 -38542 -14632 3707 14314 354 2412 7242 -14737 -33863 -39856 -45616
4736 -45616 -63192 -67246 -82439 -83293 -60422 -67173 -64713 -58203 -68005 -49551 -58594 -37582 -21712
4723 -21712 -8910 6499 -5191 5529 -12368 -15171 10832 8799 -14375 -34529 -28579 -42486
4711 -42486 -44936 -20960 -17030 -16105 -17453 -32575 -23042 -6358 -14135 -11253 -29223 -5159 -2907 6099
4697 6099 13934 28338 11656 -2616 -26014 -23417 -29141 1854 4853 -17805 -6893 -1862 35428
4684 35428 55168 34040 15986 2679 -8940 -9023 6253 12895 10912 -3187 -10673 -6037 1399
4671 1399 3208 11330 -227 4823 -1392 12823 32337 37810 38940 37213 11989 -21138 -42774
4658 -42774 -48238 -25938 7356 16800 10397 24427 50766 68477 63306 81070 105331 73504 25810
4645 25810 23422 4447 27564 24774 36081 45524 30515 -11298 -23346 -45831 -62573 -49520
4633 -49520 -55721 -59028 -33130 -13228 739 -15128 -12538 -14900 -18798 -29525 -50392 -41757 -48047
4620 -48047 -22785 -16281 -14881 -29116 3957 3734 11942 24855 8857 -5617 -21116 -2290 29313
4607 29313 33899 18214 19416 17461 -11853 -13891 -1555 2505 20644 18552 -2771 -27073 -150
4594 -150 -5235 -7915 1054 -2793 -11359 -24224 -7579 -14747 -11784 -36214 -43384 -15897 1373 22022
4580 22022 19090 9968 -3856 -4286 5301 -3843 -13987 -25737 -18532 -27010 -34457 -41392 -24259 -14339
4566 -14339 -27360 -22055 3807 18363 8479 25010 27514 -4641 365 1645 -24813 -42435 -36013
4553 -36013 -33197 -11186 -7013 -23655 -5804 17166 10242 -20367 477 -4613 -6095 -5493 -35524
4540 -35524 -58237 -40962 -54750 -78585 -78413 -85820 -75678 -65920 -77373 -58533 -40607 -59487 -62515
4527 -62515 -2866 2497 -10805 -18049 -23903 -30797 -18351 -3042 -34501 -46191 -19346 -24744 -53339
4514 -53339 -48615 -45831 -39478 -13868 -16748 -16485 -44394 -50898 -50051 -14966 -26374 -4779 8091 22375
4500 22375 11071 32883 56528 58364 43363 18530 -2543 -22374 -22776 -35622 -30878 -26332 -30222
4487 -30222 -3349 -23755 -12329 5798 2666 -733 -15939 -30551 -17947 29490 6163 4527
4475 4527 21023 35066 42127 -203 -21108 -42148 -52903 -23525 7964 17948 524 25242
4463 25242 50878 36996 -6265 -35958 -25745 2648 -4132 -3429 4764 15365 20705 -9655 3949
4450 3949 11905 14442 -17005 -68834 -62887 -29761 -1106 -19867 -43611 -50735 -38418 -660 19862
4437 19862 -7699 -41018 -72261 -91981 -72675 -31187 20368 10322 16584 2806 -12956 28242
4425 28242 43351 25590 4516 1607 6931 -11989 -1565 25590 -25164 -34466 -11702 13959
4413 13959 1782 -19707 -10155 14637 3472 -29269 -45676 -20859 19629 13190 -2209 10777
4401 10777 19961 46049 67267 26755 -11649 -38590 -40986 -31149 -25832 -30927 -44068 -10947 17280
4388 17280 -19366 -24372 -18297 -27107 -45646 -27159 -26273 -7123 15795 -3257 -2838 26958 20932
4375 20932 9665 5170 12952 25540 30694 -1374 10589 8517 17967 28221 28753 36464 34986 17088
4361 17088 4871 34021 22731 8113 36940 35023 5091 6711 10508 -632 -15403 -798
4349 -798 15550 2032 -16393 -33087 -3414 15570 -1621 -18089 -33179 -31902 -17801 -17179 -19128
4336 -19128 -14655 4294 12155 4887 -15630 -28058 -16596 19529 21631 18 -37470 -69154 -90613
4323 -90613 -56712 -37413 -32817 -15717 12487 3055 -22360 -31541 -62840 -61197 -16609 28493 39986
4310 39986 12566 -40936 -51948 -64487 -55317 -65610 -69936 -50908 -63793 -51207 -38319 -44707
4298 -44707 -52509 -30946 -21726 -6200 3210 -41235 -59296 -44613 -50166 -74722 -67214 -33912 21289
4285 21289 48480 26081 12500 18342 -3870 -21948 2084 39886 42437 46738 20895 -2786
4273 -2786 -41028 -82958 -53501 -29819 -31238 -16580 10360 9340 -24903 -44297 -31767 4480
4261 4480 -9327 -7769 5490 10664 1067 -14541 17551 36785 21823 13599 -8475 -1047 22733
4248 22733 65828 50266 -13136 -31874 -11831 10864 19411 38360 29504 -322 18634 -289
4236 -289 6514 11655 -3765 -25957 -50201 -39487 -26529 -21570 -11167 -18771 -26782 -5300 55444
4223 55444 89835 71995 55057 19441 21860 30821 38522 37439 35400 25161 12936 24699 29690
4210 29690 30272 22377 13545 -648 -3310 10361 -17746 -47332 -16212 -1989 -19901 -29294 -38289
4197 -38289 -30638 -41519 -27356 -26105 -30215 -12812 25354 37181 21511 6821 34232 9685
4185 9685 -14455 5936 13216 -3506 -24285 1799 20466 -1554 790 30494 70429 70573 36159
4172 36159 23931 -15616 -92 15731 8015 -8090 -28883 -9434 -13285 -6481 -10987 -7095 26372
4159 26372 40584 35042 27955 14685 -10761 -19778 -4867 12381 26562 20945 6418 -2401 -5785
4146 -5785 2767 -3988 -2576 607 -12627 -27304 -30663 -37915 -38372 -47782 -19570 -17902 -36128 -62545
4132 -62545 -55387 -23134 -46720 -49747 -20237 12477 9658 1311 -2509 16409 43603 23602 23715
4119 23715 23134 4849 -6462 -31338 -31101 -15072 -7384 -1486 27252 34305 13333 -772 -6933
4106 -6933 -21611 -36277 -5114 -11880 -10471 -20274 -20401 -32909 -41531 -24384 -3177 16123 21521
4093 21521 12627 -1689 -25094 -39108 -19835 -12835 -41713 -25780 -18137 -45271 -32015 -50621
4081 -50621 -41486 -25234 -14939 865 22957 -4699 -38311 -51923 -76694 -64447 -41486 -4898
4069 -4898 20009 6818 -9582 -25128 -63624 -55567 -43048 -19776 18132 569 4111 9131 -18279
4056 -18279 -36107 -44191 -86118 -93239 -65203 -50509 -24415 6945 3928 -11151 -11798 -6886 144
4043 144 11818 769 -15476 -20520 4510 10448 -3606 -23473 -14035 -10010 -19854 -24585 -7105
4030 -7105 6642 16231 23240 32750 22317 29067 38348 43217 50285 52212 38263 609 -10285 -9731
4016 -9731 14961 32472 48318 24320 5590 -5580 -28382 -28584 667 1284 2487 -1563 -20743
4003 -20743 -12425 -11717 -11189 6166 26958 45807 7892 -1014 -19307 -15279 -15794 -32561 -22088 -8386
3989 -8386 4484 -9522 385 -4939 4861 -11806 -32741 -38679 -44802 -46117 -56690 -72261 -65016
3976 -65016 -53794 -22394 -20429 13063 10145 -8330 -16139 -29265 -40034 -2530 11245 4425 37622
3963 37622 14462 3652 3812 -29959 -49285 -35015 -8666 -19481 -48269 -49870 -12054 2341
3951 2341 -15114 -35723 -27016 4385 23692 11045 18212 18609 37427 42869 48752 47360 34206
3938 34206 41784 16938 -1192 13406 -7819 -17571 484 46002 42156 28897 26965 31317 23945
3925 23945 608 -5846 10138 18815 -2850 -18891 -22119 -36046 -20621 -12023 4340 -19315 -13474
3912 -13474 -41620 -50326 -31980 -32914 -26490 -50534 -22015 17579 26011 25654 21166 29640 14839 -12479
3898 -12479 -2072 11804 11490 13669 -1565 22906 27308 23256 -6728 -31108 -23338 -51834 -56683
3885 -56683 -49189 -11849 -4070 -8316 -19895 7781 31728 -5137 -4923 -10315 -37906 -41846 -43252
3872 -43252 -48610 -38339 -26819 -4642 -18967 -24689 -6102 -1252 -21727 -38915 -47797 -30342 -7932
3859 -7932 11529 31202 41017 27756 32034 29350 8922 -10063 -12089 25250 46225 27691 16241
3846 16241 11090 23857 20930 22538 44339 18239 -2834 6165 11387 19197 27870 -4874 -1071
3833 -1071 17206 22042 21066 17495 29024 21031 17534 27318 18837 23737 50059 31443 10998 -6885
3819 -6885 -534 -3059 -16863 -19452 4464 6891 -4416 283 3367 -28657 -11178 20447 22279
3806 22279 3425 -9974 -21703 -27677 -17742 403 11099 31113 73272 78910 35806 783
3794 783 -24966 -27276 -34882 -45451 -49041 -46635 -47868 -35761 -35575 -9109 1727 20993 18916 15913
3780 15913 20565 6658 -821 25052 30676 17490 -7798 -4744 14808 26114 1751 -54661 -49415
3767 -49415 -25060 5301 18739 34040 1230 -3091 17942 5847 10665 6308 5862 8263 15265
3754 15265 25273 22820 -7212 -17399 -45418 -64722 -54444 -52377 -43587 -59670 -70565 -41396
3742 -41396 -32618 -14639 -318 -3476 13005 19477 18898 -19345 -50294 -45851 -15357 -836 14231
3729 14231 32112 30334 24518 10171 15719 15653 5391 317 -19706 -33217 -35415 -40212 -32004 8649
3715 8649 14700 -14318 24382 51470 28945 23210 2163 -20142 -17442 -19785 -27790 -26691 -24386
3702 -24386 -37626 -45045 -26636 -34162 -65096 -62060 -35889 -29887 -24362 1547 7637 19221 31561
3689 31561 30979 7141 9482 40570 68858 52747 20665 -14139 -49804 -17594 4331 -15445
3677 -15445 -19572 -35195 -16559 1445 -10542 -25615 -41113 -49423 -37409 -38799 -10360 12610
3665 12610 -5647 -22514 2593 25368 45072 35732 45271 44187 26841 -5127 -12165 -25284 -19741
3652 -19741 -24485 -32448 -47959 -57376 -43725 -22800 -29797 -17037 -17399 6989 -2379 877 24004
3639 24004 16712 -21486 -49076 -37501 -23726 -12998 -16472 -67590 -75635 -40384 -24917 -38382
3627 -38382 -56896 -41933 1371 22347 20138 395 -7162 19369 -5883 -13329 -1189 23648
3615 23648 26786 -6124 -16584 -8192 -5469 -5318 19718 35842 50823 33737 19318 25572 35890
3602 35890 23271 24590 13027 11281 14330 1419 -10119 -32840 -60959 -73495 -48875 -21510
3590 -21510 -12636 886 17924 14247 5023 -22865 -12197 1224 38187 72478 46107 -2647
3578 -2647 -31802 -9648 26807 35212 49170 36288 13431 11328 12140 2997 8353 33949 49261
3565 49261 44988 34438 19316 32550 -11034 -51689 -44802 -42619 -11343 20092 2078 -30457
3553 -30457 -13014 18695 18147 12206 1803 -6367 9658 8388 4421 2619 1090 3269 7621 4528
3539 4528 -2660 33 -2069 -630 5176 -919 -29383 -7333 3227 -6902 -30759 -38749 -41705 -35938
3525 -35938 -13465 2966 -10192 6213 22600 30615 40552 67173 64119 39827 48860 48154 56953
3512 56953 35471 16997 -30183 -43892 -16320 -25019 -17838 -16901 -41368 -13844 24752 24982 27426
3499 27426 -1533 -1252 8609 11905 21701 31416 19750 33271 29312 33696 49421 33748 37187 54786
3485 54786 69721 75566 65955 56630 17712 14640 -15816 -43897 -67096 -49635 -6206 46328 48235
3472 48235 29009 49822 61713 26121 -5283 -34935 -21747 -3319 10277 18359 -7997 -24602
3460 -24602 -21451 5649 20526 11866 1443 -9399 -9963 -52527 -44186 -9940 15251 16930 15653
3447 15653 20416 16546 -11643 -5591 7959 5673 14422 43468 35406 19144 13180 11246 30158
3434 30158 8667 23330 31218 44639 56837 52614 20663 -2564 22043 5108 12609 24160
3422 24160 -10270 -8818 -16151 -19522 -4870 17210 46230 24389 -13017 -29013 -40050 -43200 -38796
3409 -38796 -22768 -6829 -4941 -9784 1031 -4166 -7802 -9423 10087 7021 -29449 -37830 -19446
3396 -19446 -10829 -23343 -53464 -41011 -33846 -19677 -42892 7499 34039 53475 34256 29505
3384 29505 48467 42411 4457 -30869 -61267 -34810 8091 17312 37468 50825 20129 1118
3372 1118 -4928 3942 12386 348 -4172 -8715 -5408 -9710 -13821 -1952 14161 10022 50109 55700
3358 55700 62352 49433 55537 43980 38228 22170 -3216 -20290 33684 60735 30488 5993
3346 5993 -609 -12858 1117 29553 10075 -15589 -23650 -22285 -7930 9955 11726 5440 -10824
3333 -10824 -19502 -5218 13944 38684 -4350 -33536 -13709 15016 -8045 -17099 -55763 -69110
3321 -69110 -46405 178 18014 12853 15755 -4025 4946 999 -17330 -20943 -4054 -25 16596
3308 16596 13603 7768 -3156 -25398 -25272 -15854 -23719 -56353 -63366 -76132 -44501 -12122 -3760
3295 -3760 -11861 -14584 -8952 -12001 15683 29612 27538 25836 -1206 -15470 -39515 -18853 6716
3282 6716 17114 18997 21365 12234 1357 -3869 415 10966 31287 51878 26730 -5914 396
3269 396 5621 -7959 -13355 -6989 14838 33282 24749 12829 51671 71670 61383 44102 34637
3256 34637 22017 12391 3118 1969 -11101 -22080 -33844 -12861 -15665 -14427 -14211 -26502 -32441
3243 -32441 -24017 -3169 4356 -10764 -4571 14486 28343 35833 33572 17676 14665 26568 28893
3230 28893 25493 -15658 -15835 1183 17157 36925 23152 23261 8289 -6892 11281 6120 -258
3217 -258 3086 8463 29299 12487 8423 4176 -14657 -22111 -9742 5933 -40006 -62689 -69382
3204 -69382 -64256 -34535 -27022 -9804 9287 9487 25128 15991 -4117 -24519 -36689 2575 11321
3191 11321 32839 46562 50040 25444 4221 1098 10988 9262 -22785 -778 28668 10970 -15370
3178 -15370 -22306 -35775 -49002 -40658 -29569 -46515 -42600 -7943 26785 -3612 -30004 -51688
3166 -51688 -81090 -58882 -29090 -32549 -20714 -24690 21814 53538 56677 6962 -17084 -5030
3154 -5030 -15757 -22070 -27685 -9258 -10476 -28815 -33334 -36354 -32567 -10697 7989 26237 18242
3141 18242 16987 11947 1875 -1953 23226 20073 7864 -6285 9378 55739 41211 -4374 -29321
3128 -29321 -25982 -10933 6591 17098 26805 29483 27808 43543 59098 79556 67742 17164 -10396
3115 -10396 21069 48332 15459 23581 47086 27020 -12006 -24695 -9808 31563 17697 4422
3103 4422 1439 -4154 8395 21485 9884 11630 -1670 11053 27007 27473 33465 54938 39754
3090 39754 30603 13907 40802 99991 90730 52204 52616 46405 39417 52544 45173 -11701 -4229
3077 -4229 14817 14540 33947 48221 28992 21099 40607 3943 689 3484 -2749 29653 38784
3064 38784 51261 9623 6206 30014 30526 30575 20959 -6203 -9185 -18836 -12344 29190 -12473 -2578
3050 -2578 21244 -17337 -43741 -64225 -42742 -24304 -19659 -13451 -13266 -14661 -29845 -51932 -57507
3037 -57507 -36111 10834 10558 4830 2363 -23413 -7289 1135 -12053 10875 544 16973 -1000
3024 -1000 -31139 -35364 -22531 -14264 -25049 -20916 -17453 -18833 -57367 -46834 -32091 -43660 -29975
3011 -29975 -26002 -16087 -31342 -40659 -23830 9484 22148 9995 7294 -235 -13198 -9771 -12785
2998 -12785 -2977 -16075 -22889 -34587 -52182 -41184 -28286 -1433 -754 -11002 -17878 -7963 1733
2985 1733 -25088 -45414 -40679 -21926 -21931 -36768 -45716 -52127 -53139 -70424 -61612 -47683 -58076 -38557
2971 -38557 4518 2481 12835 -5047 -17450 -21254 -23022 -46697 -48534 -13621 4850 -33016 -31806
2958 -31806 -20376 -30910 -38970 -21575 -7300 -25271 -18456 -24755 -8400 4561 -24254 -18265 -32674
2945 -32674 -60521 -65292 -52743 -23140 2617 10701 11502 1316 -2745 -16882 -15984 -32437 -30450
2932 -30450 10670 12898 11896 -8207 -30717 7104 29494 41923 26849 9961 2811 -7196
2920 -7196 -7029 19365 14179 -10175 -2370 -10501 -20593 -16662 -6213 15699 15833 -5834 9313 12467
2906 12467 -5764 -31524 -42371 -49183 -38689 -17288 5277 30141 41076 28247 22388 36838
2894 36838 20489 18331 29941 33584 50078 21482 -12098 -16038 -9084 -2090 16363 -1690 -32697
2881 -32697 -61192 -60942 -47409 -25641 -23812 -4765 -665 -28129 -17705 4869 33416 2991 -22384
2868 -22384 -29866 -6595 10088 18267 42646 35329 5261 -32008 -39904 -1166 17543 18383 -7259
2855 -7259 -13930 1706 15104 41896 25740 56140 53388 45308 63511 42476 25258 20057 41711
2842 41711 28167 -3159 6705 3661 -16258 -28057 -36557 -5719 8541 -3091 -3671 -29211 -51575
2829 -51575 -35372 -22685 -27733 -26714 -9127 -4277 -673 -15214 40556 32934 22842 21872 25207
2816 25207 -3535 -28813 -26044 -27783 -11480 -17823 -17142 13009 12946 -14470 -25566 -38857 -44108 -15239
2802 -15239 11018 3732 7461 23137 11672 36670 75553 87812 88542 82846 44531 1600 -17701
2789 -17701 -13400 8897 18602 25486 16774 14455 9577 -6626 -23520 -8845 2790 -5110 -12462
2776 -12462 -9696 -11898 -25608 -13037 10643 23843 20995 10679 18600 31277 32804 37001 38296
2763 38296 -9628 -38117 -41579 -9570 -6048 -4546 -5924 11517 21813 18257 25958 38176 53227
2750 53227 53631 59271 47188 9169 -31927 -35700 -55294 -41911 -33453 -13601 16531 53862 48772
2737 48772 21399 -3742 -20097 10875 6366 -16778 -21577 -9795 5568 9877 10264 1485 -33673
2724 -33673 -44734 -63975 -46687 -11101 -21223 -53449 -59898 -7908 -3790 931 13528 23320 2505
2711 2505 -14386 -32128 -27417 -25884 -58049 -40663 -9016 436 23897 22356 24577 17183 18683
2698 18683 170 -13348 5741 21082 -8038 -45083 -73522 -62555 -52722 -35521 -17408 -23626
2686 -23626 6203 27993 14736 -14969 -15569 -8131 -13467 -33614 -67405 -64408 -56754 -41465 -57622
2673 -57622 -43667 -30433 449 18928 17951 26011 34230 22409 16519 17071 30526 1345 -30051
2660 -30051 -7061 15222 11618 -11654 7543 3336 16823 1626 2194 -1361 5868 12089 6331
2647 6331 -3892 -3224 -18883 -20620 11598 30060 21831 -3285 3510 -17975 -16566 17014 24243
2634 24243 23885 12298 -10591 -7681 22411 18160 14732 -21248 -33430 -39677 -59524 -82124 -54803
2621 -54803 -19288 562 -17536 -22006 -11370 -3541 -3057 -20325 -37266 -10262 16766 30824 14098
2608 14098 -6655 9593 29846 23759 22141 597 -11509 -9832 -5867 -16159 -22563 -8481 -2937
2595 -2937 8965 6199 10056 -25213 -57885 -48334 -25220 5373 -1870 -4211 -23209 -14403 4279
2582 4279 22990 19575 12398 19872 33245 18480 23186 27538 38170 43457 9177 -15974 -8325
2569 -8325 -7417 -12311 -4029 12618 948 -8139 -35257 -31046 -35752 -53981 -18169 6743 40963
2556 40963 15456 -19360 -54783 -60835 -40621 -31604 -16562 -2532 -25312 -2381 17448 2105
2544 2105 -41101 -55742 -41016 -11310 -6558 -10929 -8855 -13329 -18084 -7671 -9726 -28213 -18982
2531 -18982 5619 19782 3058 -27880 -20080 -4402 -597 31305 50138 38523 26712 19172
2519 19172 -19963 -30348 -21247 -43764 -29693 -10431 -39740 -74471 -87360 -80651 -51428 -28535
2507 -28535 -14341 -18419 -10137 -4951 -393 3456 2423 -5667 -19994 -7205 -14437 -26350 -16419 -1033
2493 -1033 -5807 8745 17905 14087 -11248 -7768 3168 10337 -4717 -1083 -3060 -5408 -8045 -31874
2479 -31874 -25208 10041 46558 37570 12657 -5511 -11833 -48744 -45403 -38716 -58263 -79608 -57953
2466 -57953 -62069 -50961 -36864 -51314 -61340 -45027 -38971 -67210 -71301 -78496 -75995 -40081 -23596
2453 -23596 -30426 -30435 -25844 -3058 -61723 -99736 -62804 -32025 -16930 -19405 -35348 -23980 -1381
2440 -1381 -15343 6913 11874 17443 36680 56822 36317 26140 3607 192 3232 -16797 8081
2427 8081 42115 29296 29186 55467 55851 4915 -28843 -31748 -148 18118 43157 60028 41619
2414 41619 -10581 -26183 -1021 2554 11226 24469 56839 59472 41276 22930 469 -16637
2402 -16637 -10478 -2518 14456 19181 11230 21402 34344 11522 -20896 -30265 -17272 15921 36069
2389 36069 26904 19180 8528 -7985 -10589 -19257 -24384 -36852 -20127 -11847 -566 6017 -3602
2376 -3602 2013 -12218 -11018 -5289 -2683 -16467 -18451 13957 22312 -4769 -6375 -21554 -27169 -3875
2362 -3875 -15737 -21763 -465 -15226 -27618 -14631 4661 9534 8891 -28557 -60930 -26962 2932
2349 2932 5838 15340 32279 43422 27527 9603 -544 -38149 -57211 -56296 -35793 -31519 -29626
2336 -29626 -17335 -10304 -9082 -18837 5048 38681 54312 5373 -41141 -33321 -43593 -33160 3140
2323 3140 47601 66997 67518 62706 35200 7553 20106 42261 41681 40602 45499 62487 36983
2310 36983 8280 6666 -19814 -26453 3352 20536 34810 24124 47452 38021 28935 19670 5327
2297 5327 5769 -355 -4365 -28141 -48900 -39191 -22201 2508 10475 19684 -2832 -1772 21318 -1529
2283 -1529 -15927 -3225 14714 -4566 -9987 -22851 -24065 -37473 -15042 -7904 14567 13733 -644
2270 -644 -11903 -36294 -14306 -10776 -8216 20369 17964 307 -1717 -4307 -1516 -13627 -37969
2257 -37969 -57054 -52359 2050 36448 30324 1482 -14202 -11933 11597 17724 11065 -13144 -34368
2244 -34368 -48157 -22151 -20415 11173 26072 17531 18681 1164 -17257 2161 6915 -12991 -17233
2231 -17233 -25268 -29971 -34057 -32637 20092 61768 53489 45314 31424 10257 8449 -16055 -28052
2218 -28052 -2816 13024 17878 -6407 -11021 1127 12669 34489 36492 46834 35630 1816
2206 1816 -17792 -36099 -11464 20005 21293 -27642 -34815 -17322 -17856 -19312 -20250 -36748 -5207
2193 -5207 12002 25528 21313 -13652 -6264 -2591 -13870 -10933 -21758 -17465 12820 26432 -6054
2180 -6054 -24252 -10325 3153 12177 9085 3467 30434 51426 59717 54938 53400 57276 46862
2167 46862 35212 41156 26372 10772 3671 -6706 -13793 -5321 9767 15806 19035 -3589 -28363
2154 -28363 -4463 -6269 4974 2918 2146 2723 -13242 -25995 -23742 18559 33437 24562 45831
2141 45831 63251 61845 38297 38955 58173 69429 52772 38707 29110 28459 13880 -4219 18850
2128 18850 56019 48313 27219 1514 -16913 -13434 -16786 -36908 -17333 -27112 -41012 -29426 820
2115 820 30014 23446 -13497 30 1388 -9440 -27754 -35171 -23797 8601 -1000 4049 22865
2102 22865 19189 -6590 18137 19384 19774 -29125 -42940 -49808 -26699 -1666 -15548 -18124 5283
2089 5283 -10339 -13309 20928 31579 48378 71202 49253 50702 56255 59516 15880 -8917 -20654
2076 -20654 -14834 385 10907 5957 8 -1 15899 -1196 -42094 -50929 -12252 5191 4636 412
2062 412 8706 18768 21927 954 -7223 3192 10213 18008 -2957 -12335 1713 -21703 -7297
2049 -7297 -12384 -4904 -1633 13059 -3435 -9165 -10854 -25928 -35877 -39605 -33228 -33236 -34673 -47046 -35427
2034 -35427 -17667 3778 -14985 -3481 24811 -12975 -58028 -64460 -26276 -5154 5449 -29694
2022 -29694 -74863 -59003 -49719 -22530 -46731 -24938 4586 2947 -7084 -32389 -19680 14785
2010 14785 19607 4552 26772 25523 13689 14894 -18857 -8383 12062 11251 -3002 -9689 -20817
1997 -20817 -36771 -12471 -7248 32604 55234 14880 -2368 -4629 27111 -8200 -29924 -50337
1985 -50337 -61034 -68826 -85509 -54561 -23347 2423 1406 -29704 -9161 -16278 -9019 -11104 -8696
1972 -8696 -34431 -27646 10065 -863 -7144 -35483 -52278 -41282 2541 54996 48175 44676 38144
1959 38144 40905 21259 1144 13458 9170 4622 13712 24859 10365 6454 -15466 -23215 -21633
1946 -21633 -6232 13618 7643 2962 12549 -50 6474 -3232 -18878 -29589 -60119 -71761 -54385
1933 -54385 -27400 -7567 -13429 -16865 -27198 -37671 -32664 1590 29536 3837 5225 5912 4296
1920 4296 22149 2432 -10847 13597 16122 -2403 -4614 8610 2099 15092 26399 14209 25935
1907 25935 20680 11106 29581 30691 8817 11655 6083 -2 -25768 -23596 -12159 -5105 -2944 7089
1893 7089 15512 25896 34530 47962 54239 14894 19459 24534 49284 41523 888 -17566 -8489
1880 -8489 9733 1739 28748 13162 -4156 32782 52159 42973 786 -8552 -4039 3904 13299
1867 13299 36857 51865 53270 46938 66362 60577 32202 23836 10593 -15665 -11110 15779 36793
1854 36793 23604 21708 -5036 -30288 -42091 -49639 -29133 -5752 24664 41408 17459 -1878
1842 -1878 -11499 -16667 -30522 -40487 -45035 -44430 -27733 6693 16416 -6145 -3164 21708 43838 -3040
1828 -3040 -32950 3418 34282 66265 38652 20579 20242 25034 4225 -3677 20552 3779 -19843
1815 -19843 -41688 -15391 2626 15771 -4068 -25021 -45310 -26909 -12576 -43691 -59974 -49961
1803 -49961 -7934 9481 12701 15696 3174 -7251 7529 -7937 -40680 -21472 -1531 5521
1791 5521 14478 12761 4795 11664 16356 22877 -1891 -11648 -21368 -33610 -17769 -32702 -28402 -9978
1777 -9978 -25168 3724 12979 5140 -27581 -39691 -48188 -29899 614 11900 7447 12491 -3509
1764 -3509 4950 15052 12045 37162 26440 -677 -25503 -11814 5788 34511 25586 23802 24674
1751 24674 36966 29328 28726 10980 -10920 -7824 -15390 -9626 -3240 -952 9734 1523 6631 36805
1737 36805 10680 -2030 11455 35173 7566 1249 14875 33049 33238 15163 -22401 -40549
1725 -40549 -34469 -27217 -18796 20848 42405 28360 27364 21866 11372 12375 9629 10779 27923 25931
1711 25931 36218 43715 55993 41922 40809 23957 20854 15202 21825 -8177 -13983 -22610 -25678
1698 -25678 -39473 -75425 -80982 -50562 -28584 -38435 -41689 -36081 -5889 1200 29779 28377 8322
1685 8322 -5250 -4657 19830 5896 29585 23422 3204 20371 36778 15245 37228 55851 39206
1672 39206 21190 16683 -18480 2913 -3391 -14658 -10780 3628 9053 27365 27560 28385 32691 19094
1658 19094 -38332 -53804 -27520 -22654 2426 35583 87750 100756 58136 12092 -13611 -11735
1646 -11735 17265 29177 17774 19791 5339 1133 13579 33511 -9588 -14174 -13410 -22060 -8257
1633 -8257 -22946 -33202 -22113 -1542 -14315 1505 -5553 -4025 -19348 -23420 -17473 -28121 -24825
1620 -24825 26910 55051 44563 19625 24642 24499 24021 29140 44194 33073 31336 34743 30068 20284
1606 20284 -943 -5150 -4357 18889 18158 32498 54660 9382 -16371 1900 11304 10410 -2851
1593 -2851 -364 16888 31160 21756 18244 42364 37092 46331 36122 37834 21381 12630 -2331
1580 -2331 -30755 -46999 -37408 -21556 -3338 5773 13442 6444 -2708 -23929 -12948 6431 9943
1567 9943 612 8795 15524 28895 22787 23771 31472 40367 11815 29381 73320 68956 51411 62953
1553 62953 38616 25897 47874 24597 14243 -3487 -20250 -13816 13262 32226 30413 5676
1541 5676 -5808 9692 49271 57349 39404 18349 -18367 -22734 -20771 -16234 -252 46935 28744
1528 28744 53233 59636 30094 30267 29000 32641 22678 -2055 1453 20681 13916 29592 4919
1515 4919 1397 1576 -2001 -19404 -29985 -40404 -41030 -44234 -27435 -3820 8440 39695 60277
1502 60277 30473 25034 25457 -18237 -28645 -11569 1197 18240 -10986 -7458 -1775 3220 -10947
1489 -10947 -22798 -16852 2467 26753 -1020 -48065 -24339 -29641 -36593 -28676 13836 23168 15562
1476 15562 26411 30718 37623 46267 30501 12398 14157 53396 52191 25535 11822 -1645 -15037
1463 -15037 -16077 -6464 34725 36622 -1268 9208 56987 53788 15639 -14637 -10056 -18296 8167
1450 8167 10765 -11111 2374 32028 5526 -8959 11850 2798 -3378 -8762 21772 20987 -39766
1437 -39766 -55397 -42882 -25617 4705 1517 -12845 -4706 4244 9631 29893 -32060 -77242 -72091
1424 -72091 -37189 10581 13513 17179 -22324 -19480 3405 21019 14720 28862 28676 4396 -17842
1411 -17842 -14038 -26918 -28041 4323 3865 3938 48727 82738 81410 80323 29623 7523 -5264 -25006
1397 -25006 -21075 -8206 -101 -22854 -38547 -33638 -21576 -24433 -34531 -11607 25413 24822 3205
1384 3205 -12817 -4054 -16032 -53347 -39124 9310 32555 23575 -20110 -33611 -37604 -27126 -30519
1371 -30519 -15234 16725 -8428 -25642 -9103 -20079 -29452 -28335 -18212 4390 8647 -1366
1359 -1366 32703 31273 1207 -22119 -5160 -3961 -9135 -50247 -31833 -745 -8910 -895 13696
1346 13696 19069 -2528 -4373 2406 -5423 3068 16386 -18696 -30024 -26307 -34202 -7057 15386
1333 15386 27150 10900 25177 21216 23872 27570 54209 41656 769 -20304 -11588 -23399 -30862
1320 -30862 -18084 3063 -13659 9857 18963 37995 21737 -4090 -29113 -34674 3451 1772
1308 1772 -28983 -7946 -27291 -1367 9880 -14319 -18378 -20519 7182 12838 -6880 5665 -433
1295 -433 18908 21917 28840 25125 20962 32772 58043 65170 31799 -8975 -17333 -14027 4942 50697
1281 50697 47912 47665 45752 26708 31558 -4011 414 16657 24980 22583 19583 -10272 -57339 -66013
1267 -66013 -75638 -61577 -29091 -33938 -57857 -39372 -7944 3145 -20001 -25511 -10600 -18088 -1155
1254 -1155 497 -22038 -11031 -3421 -18118 -11784 -14483 -21749 -24188 -20830 -2485 7609 11948 5923
1240 5923 12598 4740 -6007 -17329 -51083 -30253 3036 20272 16304 10348 12195 -13179 -6436
1227 -6436 10227 14636 3480 29798 39736 56210 53092 15122 9690 17675 12846 23280 42224
1214 42224 47510 22725 -12415 -25228 -10279 -8311 24704 48181 60447 46454 5056 -22675
1202 -22675 -22638 -4745 15290 26369 -346 -6595 21318 51692 -1409 -46072 -55933 -39309 -33719
1189 -33719 -11365 674 1048 -4662 3986 18067 9143 -17242 -37887 -28054 -13209 -13134 3519 -5284
1175 -5284 -5124 29853 58468 63364 45673 29431 21675 -8339 117 21293 17765 29955 54550
1162 54550 83643 73599 41112 29448 6586 -10069 385 -25332 -38923 -35621 -28208 -12098
1150 -12098 1280 -12331 -42495 -44118 1676 8546 -777 664 -11893 -46341 -41456 -8436 44043
1137 44043 50219 14815 21997 49060 26113 3722 -28661 -13856 -8959 -15100 -4610 15333 5334
1124 5334 19898 669 5802 18776 -4748 5100 25885 6821 -11540 -1419 33547 28054 18661
1111 18661 28726 3714 -12581 -19888 -21201 -10165 -11449 23464 33568 40302 33632 9457 11958
1098 11958 64998 81252 58165 57057 57490 66021 57961 46299 10683 -8213 -10246 -17618 -11677
1085 -11677 -17576 -9511 10997 17952 299 4832 5179 -23743 -38759 -29800 13153 41430 63240
1072 63240 51669 49177 42859 29312 -1086 -14157 13547 20757 24652 26261 15033 -10424 -19148
1059 -19148 1866 23371 43861 60030 42377 45831 63024 58871 48724 29210 18904 4102
1047 4102 573 -7031 -5446 8618 43848 62689 39817 9344 11366 34936 33074 41859 63668
1034 63668 34726 9157 14449 45161 60098 60057 66776 60024 32003 21141 15071 8496 13680 47786
1020 47786 46512 26968 36765 38385 27333 -8582 -21196 -30557 -18386 -15637 -17977 -24522 3795
1007 3795 577 -37852 -16692 -11597 -21225 -9618 4173 10029 31815 22789 11608 3817 -5981
994 -5981 -23328 -53238 -38432 -7444 36779 28565 37895 27800 26338 30677 35640 9495 8176
981 8176 36136 33981 16110 924 9555 20838 13114 262 39980 53508 69012 85364 54678
968 54678 36474 10281 -16213 7797 -3036 9382 -4089 10854 30315 4765 -3361 -488
956 -488 -10167 3160 22704 38654 30064 23222 -8577 -41585 -12223 -6112 -6290 -15607 -38761 -51313
942 -51313 -49698 -28941 -4572 -1451 868 21609 -259 -17920 1248 22434 29209 22500 19836
929 19836 35628 57539 40773 25916 39402 24856 12495 5734 16654 22528 11216 -9833
917 -9833 -25417 -31981 -32985 -11688 -6834 -32948 -36424 -21720 -15672 -7381 -21982 -20661 -2414 19013
903 19013 35915 12403 16961 18527 6198 -496 1348 13040 29179 6031 762 5203 3949
890 3949 6335 17308 17038 12705 23505 44495 47282 25945 7704 11239 -7981 -26049 -31259 -11103
876 -11103 -11890 -4539 -14756 -26706 -34842 -6543 -19479 -36223 -4894 1375 -35108 -66830 -48606
863 -48606 -47788 -52865 -18886 -16488 -17013 -11627 16420 35405 12273 -4113 16665 52918 71310
850 71310 42310 38357 51392 38918 32402 56133 76632 71246 45484 40570 26066 -7793 -3706
837 -3706 -8548 7664 -13939 -21143 -38793 -39980 -29016 -14663 9834 24293 15095 -12757 5220
824 5220 28369 23382 40499 40938 19823 3445 25262 31709 50062 45791 32560 26304 22087 10485
810 10485 -9421 -47326 -33088 -8669 -12834 -9773 -2486 27812 50831 40197 43758 62115 56575
797 56575 71973 49000 6949 8621 28864 20546 10586 3647 3428 21205 34559 45940 52108
784 52108 61826 71419 46371 27680 16620 480 49286 55688 36960 23879 17741 31409 54279
771 54279 44468 24450 -8948 -4887 -6119 9116 28051 38683 59032 53364 56683 63345 16613
758 16613 9262 45147 50017 18555 728 19857 40568 29470 23271 6809 31182 14154 -14101
745 -14101 -25914 -9025 20549 12838 -25162 -42101 3753 36928 33808 29147 22237 63951 61672
732 61672 39034 163 -18521 -34963 -34883 88 17269 41422 64843 44756 25025 -14338 -16537
719 -16537 15748 47978 41213 18998 32636 52634 63073 64646 86768 69460 57041 71100
707 71100 50205 27941 34035 58832 55338 52685 32472 22562 32545 17213 9552 16894 67761
694 67761 75822 58537 47078 20716 -21875 -22929 6576 4045 -13531 -9997 17743 46451 53117
681 53117 51975 43789 31084 12508 -5978 16601 10224 -13697 -35174 -39176 -19217 3414 7187
668 7187 6057 25773 33949 9020 -2582 -5361 -2445 -8957 -55169 -51664 -29414 17654 55572
655 55572 50599 13478 1570 30957 40521 52920 23121 -6656 5545 23037 10882 5316 -1718
642 -1718 7755 8104 21067 23718 25185 20748 46085 47283 53560 66261 58993 47122 39489 51354
628 51354 71391 27465 -49047 -32638 11393 9509 -4379 -9597 11069 35052 42871 55969 61319
615 61319 96677 56811 34561 47153 48113 24228 17319 21401 1351 -19614 -4972 11996 14964
602 14964 25256 26682 42081 25832 24874 15870 17729 44024 58044 31138 17442 38461 58945
589 58945 66627 65264 36474 4490 -1395 24119 17052 -1413 6428 18725 29425 42226 55237
576 55237 55716 70696 76257 67167 47618 38875 22719 -16630 1485 8601 1850 28961 9408
563 9408 -55 -2799 1066 27954 54841 48163 33086 12290 6445 -25379 -31956 -24575 -39208 -33578
549 -33578 -9025 -23194 -22850 -18024 13595 40523 27869 278 -28192 -18102 38044 70514 85637
536 85637 99472 79937 74953 82543 89621 97578 81077 53041 35329 38847 57909 36317 2760
523 2760 -21322 2221 -4947 -20454 3143 17796 32035 7508 -6051 9351 24890 9578
511 9578 -3299 15032 14052 14840 20001 12531 37387 54772 52084 28629 22528 3830 -7725 834
497 834 5084 21557 32777 31051 18765 13308 22341 40240 10239 -28647 -1679 41239 55023
484 55023 16471 -3049 367 -18102 -15585 10574 26837 18261 12110 27436 31800 29187 16342
471 16342 42692 65617 60029 55765 62645 69375 70770 69543 95423 86395 25479 -15586 6431
458 6431 29782 30011 51108 69813 75096 72619 66826 71634 42848 292 -6096 -17542 -8495 4872
444 4872 19685 52958 87745 79123 57466 63034 41138 35299 40808 56669 39114 10426 -9983
431 -9983 -10658 15534 34012 12590 1436 304 25675 42165 48509 44955 33913 43621 33383
418 33383 61864 65931 62019 40891 34893 42187 65721 58163 44441 41222 28609 7471 9971
405 9971 15347 21564 3467 9242 16790 13212 22560 28639 36573 41037 53508 57823 65492 31640
391 31640 38071 21891 29644 29284 18199 15332 -3452 -2866 -279 -5572 -7740 6698 -746 4268
377 4268 37306 15011 -29386 -19799 15737 -28115 -40469 -26243 -6979 -18552 -9229 30241 61859
364 61859 71900 74767 43271 46117 66661 83156 97472 101669 73693 50942 20494 34126 31451
351 31451 25065 -106 -35572 -25318 -19854 -8885 4650 7156 1303 -15036 -3988 57231 67494
338 67494 58157 23122 1218 277 -1389 527 -21427 -44790 -32461 -32686 -18642 -13331 -25412 -37118
324 -37118 -21290 -769 7482 31444 28112 29260 48189 54099 57964 30392 43746 56043 64592
311 64592 30927 5190 23415 22370 40794 49687 77134 55646 47394 41592 32319 18688 5222
298 5222 6581 25509 32834 58645 50549 39107 27102 7175 9957 25220 63064 86521 78893
285 78893 43296 -1408 -17306 -16242 -26857 -20133 -3269 8831 7912 7496 25106 76000 91989
272 91989 67965 26708 2587 1154 5237 15078 22691 30003 30799 13762 -5867 26893 17655 -3551
258 -3551 6674 16052 33808 30142 47130 63275 60868 57666 35092 -1524 -8512 -18479 4192
245 4192 18792 20587 36511 34875 38904 43025 45894 32145 27696 51747 42591 22342 33868 37564
231 37564 63197 54599 52809 46677 55381 31765 7961 -2447 3769 3246 20713 55003 43900
218 43900 31230 20333 18577 23998 28988 22394 167 -813 31070 46370 47849 42125 38391 8
204 8 -11813 -9265 -22134 -19519 -2348 25409 27027 24695 27087 22333 25460 34558 32114 855 4601
189 4601 12101 -1855 2611 38178 45831 30600 18253 18081 40015 43384 20033 2630 12054 36313
175 36313 50327 60354 50159 41111 19211 8619 15970 32337 32844 25268 17031 28149 50178
162 50178 39744 21473 37503 32592 36155 21654 19222 21818 35563 31463 32290 6696 -12430
149 -12430 -7778 -20665 -31349 -8095 -10585 3327 26316 29387 13504 -3421 -5510 959 -10859
136 -10859 -24023 -6769 19968 45272 36969 31994 32723 32313 27484 27876 23566 17343 29225 26879
122 26879 39307 28528 41114 44134 39061 51530 58067 46345 46128 33792 22299 24646 29925
109 29925 12064 40012 39955 19027 15987 25435 44696 33457 51145 51682 45608 50790 33055 7835
95 7835 2067 27192 48883 47415 33659 44040 53649 58507 63030 49955 19181 31159 54616
82 54616 51653 33771 11942 -8560 1508 9209 33604 60874 54234 25336 17002 30014 23220
69 23220 51553 51844 58634 37758 17643 29176 15645 15144 16759 9668 12523 16604 13178 12511 17517
54 17517 16680 37627 38718 30987 20777 25736 36339 31756 37270 37608 18654 35238 27504 8772
40 8772 14950 29461 3962 19224 45098 25112 11059 12718 30331 41346 52984 31336 16837
27 16837 19472 16987 32703 63524 60292 48410 42728 11952 -5075 18741 30567 22990 33288
14 33288 52543 58270 35806 18580 12888 2105 -14175 -8701 6459 15521 4606 1740 -7949
1 -7949 1831
0 1831
$$ Imaginary data points
##PAGE= N=2
##DATA TABLE= (X++(I..I)), XYDATA
32767 43540 23092 18525 28077 37853 24408 19777 16578 13578 38064 50074 65948 51890 37461
32754 37461 32926 31762 21211 17120 28665 52447 69433 79092 67893 75506 75410 73490 87439
32741 87439 84851 64300 55027 65900 61507 44348 61693 54379 39506 38393 47523 60959 65479
32728 65479 62973 74688 71138 58596 47293 62407 71990 56589 17831 38481 51782 49993
32716 49993 62261 64397 55017 66136 56255 54654 75616 87510 79838 63231 67754 77375 98504
32703 98504 97454 99854 112807 102610 81552 75235 102076 110848 111592 89423 73817 71711 66175
32690 66175 77224 78089 73949 100807 115543 95605 100912 97629 110810 105723 79739 87384 93394
32677 93394 82437 87138 107956 111190 108922 113687 102500 98593 99686 97755 95786 84805 86199
32664 86199 81723 91734 79510 62596 59269 65482 84538 107786 110629 107853 125644 125344 143868
32651 143868 156616 146687 124756 118274 110902 112916 134585 127147 116768 133747 156684 157506 146162
32638 146162 128757 124238 121707 92590 82779 86663 100644 123510 131037 124987 139740 158510 137048
32625 137048 136493 130129 139210 134042 124740 123248 101501 92920 104134 111964 148747 154803 133417
32612 133417 135444 143992 144815 149549 140365 140612 126788 113909 121431 131695 138524 145118 146607 161008
32598 161008 161583 154236 139468 127133 137084 128343 113218 129535 125032 128482 140986 160682 156126
32585 156126 152043 158619 168493 189239 176827 178650 174070 184221 170163 160257 163720 156462 162059
32572 162059 155408 142138 119599 124733 155130 187079 193471 154555 120153 122570 138564 142751
32560 142751 133948 174309 189193 187490 196902 197253 181307 183885 202882 206885 217795 214512 184705
32547 184705 184105 197106 176564 168785 180263 178595 154754 187002 204167 206495 210447 215810 191978
32534 191978 196650 193340 192632 206773 214272 210576 194200 184089 189888 206097 195568 203423 187649
32521 187649 199817 216334 232612 218294 188561 202135 219671 226039 222258 233429 227878 216329
32509 216329 191866 183489 175440 185532 211310 207010 197587 197028 201114 222810 213169 183628 192389
32496 192389 227757 218596 237183 252176 248202 217320 187797 180316 181897 221414 233361 223382
32484 223382 243354 236467 210825 213354 207112 211063 215904 215043 215778 253280 270645 286755 298335
32471 298335 315484 295660 283980 290340 289577 273295 244816 229143 231835 247570 260723 253818
32459 253818 219699 199232 216667 204317 159027 169188 193648 189124 203650 196207 197802 214376
32447 214376 215503 206230 207287 207909 192380 193030 200372 219323 236909 220688 199091 206116 179386
32434 179386 171195 197919 189729 196365 219376 216673 217052 244687 255139 226350 199039 185992 193889
32421 193889 195862 232643 223107 209034 207933 207577 197061 184580 204318 221305 206340 192616
32409 192616 210792 233159 235750 243904 256041 261830 224643 225379 257727 287822 273582 274101 257830
32396 257830 238261 252097 252854 225683 227700 224513 200969 202107 217394 221317 214280 188501 206739
32383 206739 230245 255107 244851 234618 237588 251613 282673 261312 260042 259200 234718 234087 230889
32370 230889 221931 218140 189987 181785 188459 211791 227109 232702 251585 245494 239238 209733 222732
32357 222732 223438 240100 263287 285435 286412 275507 240213 219849 221190 206111 225655 249290
32345 249290 270761 292047 290197 300226 288765 318575 298312 262956 252615 267922 290333 276151
32333 276151 283232 270423 268449 266850 270941 265095 271084 269036 268732 260315 278087 301695 313687
32320 313687 306001 313381 304855 310447 288148 283029 282362 264937 289392 302889 331230 324280 313886
32307 313886 296843 310448 314232 294809 288296 279482 281889 277656 287894 307810 281558 271128
32295 271128 276711 295008 312973 295378 293981 317812 322661 311783 300301 286275 275287 280686
32283 280686 287507 297568 281659 283802 274280 248246 230553 231053 242694 256442 291059 301647
32271 301647 277306 269308 295925 286803 285579 303999 320825 325271 327216 310604 282189 262443
32259 262443 275091 263811 277972 283013 262467 230756 210832 220657 253470 269183 261975 266532
32247 266532 295273 297398 298299 272831 254607 245943 241551 269708 246109 214518 227759 264490
32235 264490 277248 298834 293372 307297 319699 337222 339248 336936 315112 283221 276664 275019
32223 275019 262729 275864 279963 286336 308631 319211 311868 309376 309957 262334 240561 260311 293765
32210 293765 295642 288018 294700 298649 298793 299741 265408 257440 274860 274068 282071 266121 284982 284704
32196 284704 267418 284237 282071 279179 300822 299897 299145 277561 247626 286480 315526 291061 281431
32183 281431 304267 304585 311034 290788 282907 315588 317133 306548 281457 255989 258092 272130 301794
32170 301794 304488 283034 264953 273506 299298 318726 330055 314020 297428 305907 323842 334228
32158 334228 302646 282886 286934 292146 296495 301370 296317 306392 284666 262571 255916 259436 277638
32145 277638 295008 293012 309344 312340 307208 290923 313912 327462 325007 294967 282883 280990
32133 280990 276521 263313 276718 280917 284667 272005 280140 280701 265623 288627 310054 291973 253441
32120 253441 259796 275469 256373 259866 253162 245776 239830 237309 234631 254999 280068 298662 309735
32107 309735 288711 267084 274891 276108 277367 267491 295679 297853 295566 304631 304648 296873 310829 300522
32093 300522 296402 301423 282538 282708 296035 295871 287859 276294 263190 260406 279178 285469 285721 260186
32079 260186 268182 298442 264740 240017 252020 237898 241677 252938 266751 256713 284451 312092
32067 312092 303224 317655 333050 293458 278450 299604 333095 309365 289173 277199 235519 238411
32055 238411 245401 280041 278754 291438 315715 313031 357869 351258 331209 317374 292641 276550
32043 276550 273287 260219 271083 259117 270573 254824 240453 266435 260312 259615 260576 292490 293601
32030 293601 267711 288479 294301 268163 265092 246907 226244 221437 257177 257634 263597 302175 317558
32017 317558 299244 287552 304177 297803 284346 276538 281947 275159 272333 241218 203736 225036
32005 225036 231396 239277 252301 282446 274620 260714 233153 267030 303569 290054 285563 279383
31993 279383 284636 329324 326704 329482 320275 304150 297456 302503 298925 305977 279444 281387 279014
31980 279014 288737 271765 274919 262276 276362 283075 267385 268042 299374 300310 276959 261916 267971
31967 267971 265283 269038 277844 245440 224864 239449 242558 252637 237678 268746 311256 291979
31955 291979 273328 276472 287017 287105 276659 268741 269160 290342 310034 328359 311347 295943 300657
31942 300657 285949 283573 285575 270244 265171 266252 288691 284271 268156 248959 243167 242311 248012
31929 248012 266432 276928 285326 282576 245476 239227 251116 297997 306338 307956 311665 289448 261625
31916 261625 255569 271495 291607 289544 271891 274016 259228 266691 265712 293313 323611 325056 315130
31903 315130 307263 306875 298585 288575 275779 284642 284971 269158 299743 319531 320913 293286 241288
31890 241288 251767 244092 240462 232015 244371 273679 250984 241595 291888 337111 331841 317042
31878 317042 308111 298732 285258 259165 250509 271390 294042 293305 294844 311131 297266 288631 274819
31865 274819 259420 274292 292344 268176 248730 262723 288028 272059 246797 236777 245663 266057
31853 266057 244440 248752 267569 258205 269837 272106 279150 294480 315335 336379 363415 349001
31841 349001 351895 338229 318582 297211 288822 296006 316841 309535 289499 294969 273955 245587
31829 245587 245846 231672 234418 223128 222974 227906 222506 215431 213820 246472 289702 271931 248928
31816 248928 252063 266765 299758 293146 274763 272408 278758 292937 319025 330512 320428 307704
31804 307704 304046 320999 322188 319497 295235 278994 266598 273322 296024 278551 293199 289718
31792 289718 262636 281230 259078 241959 245925 243958 252926 244574 258864 296943 285832 284717
31780 284717 293946 318757 340068 316012 285086 275482 284403 280251 277526 318653 315643 265375 251101
31767 251101 255414 260162 260918 264378 252100 272134 261782 245044 248666 253726 252637 244198 251819
31754 251819 272243 271679 266403 271267 274126 294496 281401 287460 315014 315971 292571 303025 325848
31741 325848 325790 321382 330038 314517 310237 293758 266660 257901 265960 285774 316667 327588 330836
31728 330836 320135 320465 293207 256102 274637 291047 274442 283648 282896 310540 307428 332523 340621
31715 340621 312984 315942 330175 338898 331656 277036 260692 249158 279025 294087 283994 281817
31703 281817 264575 222998 243238 263557 305362 289857 300595 303817 284799 283850 287128 286031
31691 286031 272020 264654 273459 262568 265149 269039 254826 268842 267836 270139 277308 306053 324054
31678 324054 317054 329720 317896 308884 293297 310966 319006 279717 253380 296391 299452 275757
31666 275757 274045 288227 273391 271422 273354 295080 323000 329180 309298 308779 313593 290802 306166
31653 306166 299201 302927 321617 343566 348707 338042 305871 304786 298550 282789 314988 336398
31641 336398 315534 292485 282292 281993 303989 287551 276129 286238 316968 316464 300813 284644
31629 284644 259993 263463 261324 274972 295588 289276 294946 290314 278916 287013 294115 291287 324581
31616 324581 345355 322801 328401 316696 312532 346477 339396 334833 326285 307928 301246 285081 324682
31603 324682 319923 304925 273914 229840 230178 250402 247065 261791 277653 294344 296796 263198
31591 263198 225532 240505 267533 273573 293280 287248 271081 270811 301266 330486 346454 347147 345095
31578 345095 347990 325687 299710 297216 300178 319555 316984 316060 324213 301231 281769 271703 274894
31565 274894 269971 261584 245108 266586 265311 235025 260943 291096 280926 247866 256360 267817
31553 267817 278858 301946 304656 302324 311351 319273 332062 329811 334287 373919 365482 328893 328274
31540 328274 309746 301759 300282 285384 276712 261091 256066 273236 315564 345642 360848 343618
31528 343618 320785 308555 296002 276385 295508 296806 273938 267747 259164 268493 274479 271142 291747
31515 291747 349907 359536 339118 322008 306638 286476 284922 316974 336997 314614 301985 296734
31503 296734 291417 307979 281267 265535 290749 327025 309844 301272 273968 284709 305012 304034
31491 304034 302952 312723 320623 318261 304862 316220 316532 320509 297604 298655 321418 336681 338367
31478 338367 300013 276358 270497 229005 233397 254555 266677 301461 301451 289970 284200 308347 316552
31465 316552 307191 297288 266511 261281 255019 260418 253422 246585 245888 260838 287660 293017 294932 299278
31451 299278 287198 296105 305938 295595 287010 266324 246699 291148 311138 303272 285463 257795
31439 257795 254203 261442 278977 287692 259494 279338 302099 316441 327813 309454 293142 294399
31427 294399 293554 268276 248333 297581 289854 277178 271057 286060 283975 260570 281401 307271
31415 307271 290111 262092 249756 261982 274840 269501 279031 308124 306726 289905 262381 248694
31403 248694 240420 253705 277401 314040 316474 286682 281923 228670 222361 264275 278409 270027
31391 270027 281343 300485 300765 291288 283510 305811 327560 319410 342457 356535 341352 336189 336272
31378 336272 327336 293323 299157 318638 306894 300300 322745 312908 331089 322461 307843 311369 309690
31365 309690 312277 309330 308837 301777 292046 308838 334873 352105 315176 276270 290365 308337 317207
31352 317207 341021 340525 310034 303009 286025 297146 276350 295561 310985 286131 265094 287859
31340 287859 302569 321331 339904 344633 332658 308839 333695 336046 337338 333120 309099 305221
31328 305221 299278 286805 263858 258044 263242 265569 277508 305254 307108 289549 274036 268491 267001
31315 267001 280255 272672 251442 266329 283952 302871 285600 286109 290706 291725 278220 273418 267298
31302 267298 253680 252242 290149 313120 308750 292631 284244 289539 265248 264099 284059 295078
31290 295078 291652 293940 290492 284530 274447 283658 303074 282114 260438 271839 253195 243169
31278 243169 235768 285413 291887 293729 297636 288054 274188 293797 293863 327688 326638 321160 329020 315685
31264 315685 329275 315379 264982 230699 208380 193600 193652 227625 248509 288851 300274 294462
31252 294462 280836 263001 265344 269763 292975 310346 299582 311039 324478 324586 314271 288911
31240 288911 274614 301806 328320 303983 308579 310496 270925 247682 252900 265613 276348 252529
31228 252529 249876 241181 255817 255966 247910 258197 280708 295796 313871 321240 273647 268246 312499
31215 312499 313540 323160 304974 289579 304995 330068 331079 334035 345449 322283 319530 286534
31203 286534 262926 278005 291787 298653 283884 264133 268437 267391 262928 238675 246256 244079 257019
31190 257019 260463 293344 332444 359293 340959 348467 340988 327345 352639 338294 317386 329261
31178 329261 316184 326264 321240 319583 314287 303993 311961 320649 312502 340383 346374 355184 344499
31165 344499 339273 331689 324793 299720 256847 246498 240247 268064 282395 268113 258821 250224 264929
31152 264929 304304 318764 303561 292479 287854 299816 304952 284899 263895 259114 267600 309761
31140 309761 322765 311814 307019 316857 304552 297295 308820 297760 293115 295025 271463 272143 308197
31127 308197 310862 307095 327807 339249 324181 318598 306472 317755 306828 286782 308926 313763
31115 313763 309800 318068 299989 303909 294127 305984 284898 266606 278953 293223 311674 321569
31103 321569 302581 316136 315860 282120 284547 264868 289321 340785 325828 277513 271240 283537
31091 283537 294249 346092 333765 296048 308629 307337 275472 278142 289837 306688 301461 293837
31079 293837 307410 287585 310779 337909 334149 311935 260306 264084 282618 285977 272691 276641
31067 276641 287998 281943 300594 327117 327306 298842 249046 263868 289266 302305 288962 261426
31055 261426 264996 291830 304760 314750 321233 334467 341603 343887 315555 272941 274612 290624 297431
31042 297431 283806 282897 282866 263038 293687 297946 309170 324145 306032 285490 310272 314820 308483
31029 308483 314596 317583 305942 292241 296020 289214 308947 326126 349537 355819 337872 297595
$$ [...]
##END NTUPLES=NMR SPECTRUM
##END=
