##TITLE=Analysis number 330411
Compound Code cc 50626
Book Reference 521/140
Project Code adrs
Chemist Name evam
##JCAMPDX= 6.0         $$ Bruker NMR JCAMP-DX V2.0
##DATA TYPE= NMR SPECTRUM
##DATA CLASS= NTUPLES
##ORIGIN= Bruker BioSpin GmbH
##OWNER= nmr
$$ XWIN-NMR		Version 3.5
$$ Thu Nov 22 12:19:05 2007 GMT Standard Time (UT+0h)  MAYBRIDGE\nmr@NMR_250MHZ
##.OBSERVE FREQUENCY= 250.131544655141
##.OBSERVE NUCLEUS= ^1H
##.ACQUISITION MODE= SIMULTANEOUS (DQD)
##.ACQUISITION SCHEME= undefined
##.AVERAGES= 16
##.DIGITISER RES= 18
##SPECTROMETER/DATA SYSTEM= dpx250
##.PULSE SEQUENCE= zg30
##.SOLVENT NAME= CDCl3
##.SHIFT REFERENCE= (INTERNAL, CDCl3, 0, 16.522)
##AUDIT TRAIL= $$ (NUMBER, WHEN, WHO, WHERE, WHAT)
$$ ##TITLE= Audit trail, XWIN-NMR		Version 3.5
$$ ##JCAMPDX= 5.01
$$ ##ORIGIN= Bruker BioSpin GmbH
$$ ##OWNER= nmr
$$ C:\u/data/dgb/nmr/ADRS/2090/pdata/1/auditp.txt
$$ ##AUDIT TRAIL=  $$ (NUMBER, WHEN, WHO, WHERE, WHAT)
(   1,<2007-11-22 12:18:34.29 +000>,<MAYBRIDGE\nmr>,<NMR_250MHZ>,
      <created by zg, POWCHK disabled, PULCHK disabled
       configuration hash MD5:
       76 6E 9A 78 1E 09 19 81 EC 84 63 8F B0 6A 59 2D
       data hash MD5: 64K
       97 1F 87 3D 37 DF 46 13 00 65 BA CC FD 4A 1A 7B>)
(   2,<2007-11-22 12:18:52.54 +000>,<MAYBRIDGE\nmr>,<NMR_250MHZ>,
      <Start of raw data processing
       ef LB = 0.3 FT_mod = 6 PKNL = 1 SI = 32K 
       data hash MD5: 32K
       E1 1D 73 DA 9E 3E BB F1 26 76 39 20 BD B6 53 80>)
(   3,<2007-11-22 12:18:54.49 +000>,<MAYBRIDGE\nmr>,<NMR_250MHZ>,
      <apk 
       data hash MD5: 32K
       75 24 B8 8C 0E 47 2E 0F A9 34 DE DF 65 A7 F3 0F>)
(   4,<2007-11-22 12:18:55.21 +000>,<MAYBRIDGE\nmr>,<NMR_250MHZ>,
      <abs ABSG = 5 
       data hash MD5: 32K
       A5 8A A0 2E EF C8 9E B6 C5 F4 27 FA 5E 38 F7 95>)
$$ ##END=
$$ 
$$ hash MD5
$$ 0A CF C0 FF 42 72 1B 9C 36 98 78 96 03 D8 4D 35
##$RELAX= 
##$RELAX= 
##$RELAX= 
##$RELAX= 
##$RELAX= 
##$RELAX= 
##$RELAX= 
$$ Bruker specific parameters
$$ --------------------------
##$DU= <C:\u>
##$EXPNO= 2090
##$NAME= <ADRS>
##$PROCNO= 1
##$TYPE= <nmr>
##$USER= <dgb>
##$AMP= (0..31)
100 100 100 100 100 100 100 100 100 100 100 100 100 100 100 100 100 100 
100 100 100 100 100 100 100 100 100 100 100 100 100 100 
##$AQSEQ= 0
##$AQ_mod= 3
##$AUNM= <au_zg>
##$AUTOPOS= <21 >
##$BF1= 250.13
##$BF2= 250.13
##$BF3= 250.13
##$BF4= 250.13
##$BF5= 500.13
##$BF6= 500.13
##$BF7= 500.13
##$BF8= 500.13
##$BYTORDA= 1
##$CFDGTYP= 0
##$CFRGTYP= 5
##$CHEMSTR= <none>
##$CNST= (0..31)
1 1 145 1 1 1 1 1 1 1 1 1 1 1 1 1 1 1 1 1 1 1 1 1 1 1 1 1 1 1 1 1 
##$CPDPRG= <>
##$CPDPRG1= <>
##$CPDPRG2= <>
##$CPDPRG3= <>
##$CPDPRG4= <mlev>
##$CPDPRG5= <mlev>
##$CPDPRG6= <mlev>
##$CPDPRG7= <mlev>
##$CPDPRG8= <mlev>
##$CPDPRGB= <>
##$CPDPRGT= <>
##$D= (0..31)
0 1 0 0 0 0 0 0 0 0.06 0 0 0 0 0 0 0.0002 0 0 0 0 0 0 0 0 0 0 0 0 0 0 
0 
##$DATE= 1195733913
##$DBL= (0..7)
120 120 120 120 120 120 120 120 
##$DBP= (0..7)
150 150 150 150 150 150 150 150 
##$DBP07= 0
##$DBPNAM0= <>
##$DBPNAM1= <>
$$ [...]
##$SUBNAM7= <"">
##$SUBNAM8= <"">
##$SUBNAM9= <"">
##$SW= 20.6930455092707
##$SWIBOX= (0..15)
0 0 3 0 0 0 0 0 0 0 0 0 0 0 0 0 
##$SW_h= 5175.983436853
##$TD= 65536
##$TD0= 1
##$TE= 295.16
##$TE2= 300
##$TE3= 300
##$TEG= 300
##$TL= (0..7)
0 120 120 120 120 120 120 120 
##$TP= (0..7)
150 150 150 150 150 150 150 150 
##$TP07= 0
##$TPNAME0= <>
##$TPNAME1= <>
##$TPNAME2= <>
##$TPNAME3= <>
##$TPNAME4= <>
##$TPNAME5= <>
##$TPNAME6= <>
##$TPNAME7= <>
##$TPOAL= (0..7)
0.5 0.5 0.5 0.5 0.5 0.5 0.5 0.5 
##$TPOFFS= (0..7)
0 0 0 0 0 0 0 0 
##$TUNHIN= 0
##$TUNHOUT= 0
##$TUNXOUT= 0
##$USERA1= <user>
##$USERA2= <user>
##$USERA3= <user>
##$USERA4= <user>
##$USERA5= <user>
##$V9= 5
##$VALIST= <valist>
##$VCLIST= <CCCCCCCCCCCCCCC>
##$VD= 0
##$VDLIST= <DDDDDDDDDDDDDDD>
##$VPLIST= <PPPPPPPPPPPPPPP>
##$VTLIST= <TTTTTTTTTTTTTTT>
##$WBST= 1024
##$WBSW= 4
##$XGAIN= (0..3)
0 0 0 0 
##$XL= 0
##$YL= 0
##$YMAX_a= 219882
##$YMIN_a= -279512
##$ZGOPTNS= <>
##$ZL1= 120
##$ZL2= 120
##$ZL3= 120
##$ZL4= 120
##$ABSF1= 16.522
##$ABSF2= -4.171173
##$ABSG= 5
##$ABSL= 3
##$ALPHA= 0
##$AQORDER= 0
##$ASSFAC= 0
##$ASSFACI= 0
##$ASSFACX= 0
##$ASSWID= 0
##$AUNMP= <proc_1d>
##$AZFE= 0.1
##$AZFW= 0.1
##$BCFW= 0
##$BC_mod= 0
##$BYTORDP= 0
##$COROFFS= 0
##$CY= 12.5
##$DATMOD= 1
##$DC= 0
##$DFILT= <>
##$DTYPP= 0
##$F1P= 14.0000005364418
##$F2P= -0.99999901652339
##$FCOR= 0.5
##$FTSIZE= 32768
##$FT_mod= 6
##$GAMMA= 0
##$GB= 0
##$INTBC= 1
##$INTSCL= 1
##$ISEN= 128
##$LB= 0.3
##$LEV0= 0
##$LPBIN= 0
##$MAXI= 10000
##$MC2= 0
##$MEAN= 0
##$ME_mod= 0
##$MI= 0
##$NCOEF= 0
##$NC_proc= -3
##$NLEV= 6
##$NOISF1= 0
##$NOISF2= 0
##$NSP= 0
##$NTH_PI= 0
##$NZP= 0
##$OFFSET= 16.522
##$PC= 1
##$PHC0= 174.2101
##$PHC1= 8.794923
##$PH_mod= 1
##$PKNL= yes
##$PPARMOD= 0
##$PSCAL= 4
##$PSIGN= 0
##$REVERSE= no
##$SF= 250.13
##$SI= 32768
##$SIGF1= 0
##$SIGF2= 0
##$SINO= 400
##$SIOLD= 32768
##$SREGLST= <1H.CDCl3>
##$SSB= 0
##$STSI= 32768
##$STSR= 0
##$SW_p= 5175.98343685301
##$SYMM= 0
##$S_DEV= 0
##$TDeff= 65536
##$TDoff= 0
##$TI= <Analysis number 999999
Compound Code 99
Book Reference 9
Project Code 9>
##$TILT= no
##$TM1= 0
##$TM2= 0
##$TOPLEV= 0
##$USERP1= <user>
##$USERP2= <user>
##$USERP3= <user>
##$USERP4= <user>
##$USERP5= <user>
##$WDW= 1
##$XDIM= 32768
##$YMAX_p= 346146818
##$YMIN_p= -184417
$$ End of Bruker specific parameters
$$ ---------------------------------
##NTUPLES= NMR SPECTRUM
##VAR_NAME=  FREQUENCY,     SPECTRUM/REAL,   SPECTRUM/IMAG
##SYMBOL=    X,             R,               I
##VAR_TYPE=  INDEPENDENT,   DEPENDENT,       DEPENDENT
##VAR_FORM=  AFFN,          ASDF,            ASDF
##VAR_DIM=   32768,         32768,           32768
##UNITS=     HZ,            ARBITRARY UNITS, ARBITRARY UNITS
##FACTOR=    0.157963299565203, 1,           1
##FIRST=     4132.6476996994, 0,             0
##LAST=      -1043.33573715361, 0,           0
##MIN=       -1043.33573715361, -184417,     0
##MAX=       4132.6476996994, 346146818,     0
$$ Real data points
##PAGE= N=1
##DATA TABLE= (X++(R..R)), XYDATA
$$ [...]
14774E8067m2296J2403M3525m0645k6294j0889L5466K8223o371j962m9773J871
$$ 58067 15771 28174 71699 31054 4760 -6129 29337 57560 51189 49227 -546 1325
14762A325L7349m665k8679j3030j7983Q478j8518J0978K3130j81o8200k6491L7083
$$ 1325 38674 34009 5330 -7700 -25683 -17205 -35723 -24745 -1615 -1796 -69996 -96487 -59404
14749e9404P383M2561J1384L9106M7040o744k8329m1688K0994l3784n0123o5467
$$ -59404 -52021 -9460 1924 41030 88070 81326 52997 11309 32303 -1481 -51604 -117071
14737a17071M4222L1692J0042N6362R219m2255J7508J018N581k4335n4193m726
$$ -117071 -72849 -41157 -31115 25247 34466 -7789 9719 10737 16318 -8017 -62210 -66936
14725f6936L0008L6100j6583K4270J3833r855j5665O8723l0478p1965k3684K0216
$$ -66936 -36928 -828 -17411 6859 20692 10837 -4828 63895 33417 -38548 -62232 -42016
14713d2016J9429J8383K0334K0981K8081K4155j6684K1904K5450o4410o7609k9457
$$ -42016 -22587 -4204 16130 37111 65192 89347 72663 94567 120017 55607 -12002 -41459
14701d1459o054K5346K1723l5912Q194N4890L7748k5388o2046j0699J6496K292
$$ -41459 -47513 -22167 -444 -36356 -28162 26728 64476 39088 -22958 -33657 -17161 -14869
14689a4869r306M8056k1460J059O9888k5634n5589k2641k1164k7151j9947N8966
$$ -14869 -24175 23881 2421 3480 73368 47734 -7855 -30496 -51660 -78811 -98758 -39792
14677c9792j0360r778N1737N076Q409N412Q604L1045K4094R56m8318k0864L0192
$$ -39792 -50152 -59930 -8193 -3117 5292 10704 19308 50353 74447 75403 27085 6221 36413
14664C6413r952k6402k1998J1062J3466K8716k5842p1570m0328L2091J6468L571
$$ 36413 26461 59 -21939 -10877 2589 31305 5463 -66107 -106435 -74344 -57876 -54305
14652e4305J9305L0823L6039k0660o0084L9926M5035k9478M502O802K1447J5835
$$ -54305 -35000 -4177 31862 11202 -48882 -8956 36079 6601 11103 17905 39352 55187
14640E5187k3504n7867l7112j4355l376N0706O498K9710O0430Q827n286n0301
$$ 55187 31683 -26184 -63296 -77651 -81027 -30321 -23823 5887 66317 75144 69858 19557
14628A9557j1972k5719J6614K8553L9177j3294m6440n476K7491O6250r788l3588
$$ 19557 7585 -18134 -1520 27033 66210 52916 6476 1000 28491 94741 84953 51365
14616E1365L6658j2993n894j0666l9474J5675L9706L6496l1883l2720l2115n1529
$$ 51365 88023 75030 69136 58470 18996 34671 74377 110873 78990 46270 14155 -37374
14604c7374K5247P756j8788M2372K1228m5685p4782n8311N451N8970J9112N0303
$$ -37374 -12127 -4371 -23159 19213 40441 -5244 -80026 -138337 -132886 -73916 -54804 -4501
14592d501K8980o589J1804j423R835l056l9277J05M498p482k9475R539j3577k2555
$$ -4501 24479 17890 29694 28271 38106 35050 -4227 -4122 376 -7106 -36581 -27042 -40619 -63174
14578f3174N571p254k61K0092N8227j0801K6409L2213m3126n453L3864k4042J3419
$$ -63174 -57603 -64857 -65118 -45026 13201 2400 28809 61022 17896 12443 46307 22265 35684
14565C5684j2302m259l6836J8197J727j3438j6032j5947J6446J5224q340L8258
$$ 35684 23382 19123 -17713 484 2211 -11227 -27259 -43206 -26760 -11536 -19876 18382
14553A8382L1834p1002K3109M4688k9373L2770K6296o6519p3322j5796L3868J6399
$$ 18382 50216 -20786 2323 47011 17638 50408 76704 10185 -63137 -78933 -45065 -28666
14541b8666L0960K5695J6439j9179j2668p490k0026k5952N9121K7095n6080r4165
$$ -28666 2294 27989 44428 25249 12581 5091 -14935 -40887 18234 45329 -10751 -104916
14529a04916K6131J08234N9410j5785o4095l9424M6043P3666K3180J390q5845
$$ -104916 -78785 29449 88859 73074 8979 -30445 15598 89264 112444 113834 27989
14518B7989p5327J024P145J7148j0137j665N4441l4747o4901m0746N9342J3775
$$ 27989 -47338 -46314 -39169 -22021 -32158 -33823 20618 -14129 -79030 -119776 -60434 -46659
14506d6659L5991k4349J8866J3421N1782K5782n804O807j8780j7579k8929K1389
$$ -46659 -10668 -35017 -16151 -2730 49052 74834 69030 75837 57057 39478 10549 31938
14494C1938M0000J7146l9934n2065K2036Q042L733P268J959j8254k0088J8733
$$ 31938 71938 89084 49150 -2915 19121 27163 30896 38164 40123 21869 1781 20514
14482B0514M0896L6294j7919j8711Q612m0954J2325L2796j267k8494j9111K6190
$$ 20514 61410 97704 79785 61074 69686 28732 41057 73853 72586 44092 24981 51171
14470E1171m3886o3684M0378L8725k2062M3763j2540o772l3238k0496j8716J3954
$$ 51171 7285 -56399 -16021 22704 642 44405 31865 25093 -8145 -28641 -47357 -33403
14458c3403k4637N3975Q730q414l1318L9000N24j4540r27o890n2405M9680N9991
$$ -33403 -58040 -4065 4665 -3749 -35067 3933 4457 -10083 -11010 -17900 -70305 -20625 39366
14445C9366Q842J3646o609j5236m6950n3299N0327J1376l999l90N3058K1304M9634
$$ 39366 48208 61854 55245 40009 -6941 -60240 -9913 1463 -2536 -2926 50132 71436 121070
14432A21070J4076m8928n9207n1727l884J0867O7952K1143J6719k0026k9520O130
$$ 121070 135146 86218 27011 -24716 -28600 -17733 50219 71362 88081 68055 38535 44665
14420D4665K4224j4836l0035O9891J4184q4603n6453m923N3325L8167k6912j5549
$$ 44665 68889 54053 24018 93909 108093 23490 -32963 -37886 15439 53606 26694 11145
14408A1145j0886k7346L741J8156O6510J8197l2869j7535m5698n9468J4853O5459
$$ 11145 259 -27087 -23346 -5190 61320 79517 46648 29113 -16585 -76053 -61200 4259
14396D259L2772O3703o347o3185n724K1699q639l2448N743L1879R868j4334j4613
$$ 4259 37031 100734 94387 31202 25478 47177 38538 6090 11833 43712 53580 39246 24633
14383B4633l9660k2130j0783L7642K8601k3788L2150J8644m8523O433k6308L326
$$ 24633 -15027 -37157 -47940 -10298 18303 -5485 26665 45309 -3214 3219 -23089 -19763
14371a9763M8498L5394k5346o0993J9785L0025P340O749K4721k668L267o7847
$$ -19763 28735 64129 38783 -22210 -2425 27600 34940 41689 66410 63742 67009 -838
14359h38L305k744j0434m534J1434j6509m659N098k474J851L1072k2122m2333
$$ -838 2467 -277 -10711 -15245 -3811 -20320 -24979 -19881 -22355 -20504 10568 -11554 -53887
14346e3887j3238J9050k2301k243P0291q249m4680Q731L382N2027J4724l5806
$$ -53887 -67125 -48075 -70376 -72619 -2328 -10577 -55257 -46526 -43144 8883 23607 -12199
14334a2199j7511k6283j4591O6312L2585j0500k6324j5803R176j0549o777M293
$$ -12199 -29710 -55993 -70584 -4272 28313 17813 -8511 -24314 -15138 -25687 -32464 -28171
14322b8171O676n677J7658M1809o5669j7214k1946O10N880j3715P981L2551K7605
$$ -28171 -21495 -27172 -9514 32295 -33374 -50588 -72534 -71924 -66044 -79759 -71778 -39227 -11622
14309a1622J484p0177k735L3038L373L0345l845M0412L4567m1031j2279l080N0730
$$ -11622 -10138 -80315 -83050 -50012 -46639 -16294 -20139 20273 54840 13809 1530 -1550 49180
14296D9180J8357J6851m7243p8981k0492L9897k8063J9804J7225r640J5622N2120
$$ 49180 67537 84388 37145 -41836 -62328 -22431 -50494 -30690 -13465 -23105 -7483 44637
14284D4637m979q4726q264L6455P148K9113N390m8590J8475M1105L9296n534K1689
$$ 44637 39658 -45068 -53332 -16877 -9729 19384 24774 -23816 -5341 35764 75060 69526 91215
14271I1215K5175J0293j9301j3343k1307k0457J377r079K2179J4007m3909m2467
$$ 91215 116390 126683 107382 94039 72732 52275 53652 44573 66752 80759 36850 -5617
14259e617J9860R041J683j3394Q732K4197k6370j9739j2074l81L4533K4931j6536
$$ -5617 14243 23284 24967 11573 20305 44502 18132 -1607 -13681 -14062 20471 45402 28866
14246B8866L8916J5766J0565J5546M7733m0225m6591k4009K738r512j8098m7548
$$ 28866 67782 83548 94113 109659 157392 117167 70576 46567 49305 39793 21695 -25853
14234b5853j8627K4779l183l7719M0581j993j9242J1589j4680N526k2430o9317
$$ -25853 -44480 -19701 -22884 -60603 -20022 -22015 -41257 -29668 -44348 -38822 -61252 -130569
14222a30569m1667N4138N9926J0288l3414P206M218J7686O4920O1929k5861m4991
$$ -130569 -172236 -118098 -58172 -47884 -81298 -74092 -69874 -52188 12732 74661 48800 3809
14210C809k9118k6866M4708K5783l9606l3569j7600J6802J1187M178L0847M1630
$$ 3809 -25309 -52175 -7467 18316 -21290 -54859 -72459 -55657 -44470 -40292 -9445 32185
14198C2185j9979m9717j912J171M092j3699n0398L9714L1151q320l4123J5479
$$ 32185 12206 -37511 -39423 -38252 -34160 -47859 -98257 -58543 -27392 -35712 -69835 -54356
14186e4356R344L1464J8038j9043J0108L6031J3900r984o209L6038l8575j7870
$$ -54356 -45012 -13548 4490 -14553 -4445 31586 45486 35502 29293 65331 26756 8886
14174H886j9427r422M970K1345K2851M351j8231P601J468k3948J1441j0384J980
$$ 8886 -10541 -19963 -14993 6352 29203 33554 15323 22924 24392 444 11885 1501 3481
14161C481O4953O255m363k8303l1099K231J499r45k6969M5529J9384m8353l6369
$$ 3481 68434 74689 70326 42023 10924 13155 14654 13709 -13260 32269 51653 3300 -33069
14148c3069M044N8134p171m3238J5694O9334P974m9184K8051L5601l2780J5705
$$ -33069 -29025 29109 21938 -21300 -5606 63728 71702 22518 50569 86170 53390 69095
14136F9095l3110k9397r718K2921q071q05j1634l7564L2824j768m1511k3105L453
$$ 69095 35985 6588 -3130 19791 11720 10915 -719 -38283 -5459 -7227 -48738 -71843 -68390
14123f8390K8225K7236J4N1449K2209K714j8680J4970M656p4696m681k627r526
$$ -68390 -40165 -12929 -12915 38534 60743 63457 44777 59747 64403 -10293 -14974 -17601 -27127
14110b7127o801K9189p696m105m7833k4220M7308L2444L4261j3855l1465L0398
$$ -27127 -33928 -4739 -12435 -16540 -64373 -88593 -41285 -8841 25420 11565 -19900 10498
14098A0498K3002l2816j0732j1749q495P4746L3988P297k1795q0391l2906l2355
$$ 10498 33500 684 -10048 -21797 -30292 44454 78442 85739 63944 -16447 -49353 -81708
14086h1708L036P845k003N9036Q866L5699k46j928n947J3706r46m8238l1429L8978
$$ -81708 -78672 -70827 -72830 -13794 -4928 30771 30525 28597 22650 36356 35410 -12828 -44257 -5279
14072e279N8939m9536k7158j8061k3353r17J32K6936N2792j8780m4761N4816N5923
$$ -5279 53660 4124 -23034 -41095 -64448 -65365 -65233 -38297 14495 -4285 -49046 5770 61693
14059F1693k1344L6979k9544m0841j0986M4019L2458J3594q611o56k4584j678
$$ 61693 40349 77328 47784 6943 -4043 39976 72434 86028 77417 76761 52177 50499
14047E0499n111m9318p6535k3800L4641L0811J9825m0106n150J8990N1440k5209
$$ 50499 45388 -3930 -80465 -104265 -69624 -38813 -18988 -59094 -64244 -45254 6186 -19023
14035a9023m6239L4939N9308l9938l3049p522M2660k492n7905P1j417J5604N1189
$$ -19023 -65262 -30323 28985 -10953 -44002 -51524 -8864 -11356 -69261 -69190 -70607 -55003 -3814
14022c814L2076J4921o1639n1823K9023K0554O1695J9294l8542j389J92k4264
$$ -3814 28262 43183 -18456 -70279 -41256 -20702 40993 60287 21745 20356 20548 -3716
14010c716K592M5941J2735l912j9086k0543K0963m7347n1595O11P4635J2951J2306
$$ -3716 -1124 44817 57552 53640 34554 14011 34974 -12373 -63968 -63357 11278 24229 36535
13997C6535J6909J2138N966k4733k6811m8928L7018j7168J1634K12L00j716M1791
$$ 36535 53444 65582 71548 46815 20004 -28924 8094 -9074 2560 2772 3072 1356 43147
13984D3147o973N9569J1366m2182n7624j7230R142P43l2451J1479L911l7117P135
$$ 43147 36174 95743 107109 64927 7303 -9927 -785 -42 -32493 -21014 -17103 -54220 -47085
13971d7085O1842m34n3143Q94M2121J6625l9673o81l0449R119L3228J7256l7920
$$ -47085 14757 14323 -38820 -37926 4195 20820 -18853 -19534 -49983 -40864 -7636 9620 -28300
13958b8300J8997L6169k3155L9M4842P499L428l0855q7836k0149J5923N2099K1162
$$ -28300 -9303 26866 3711 3750 48592 56091 59519 28664 -59172 -79321 -63398 -11299 9863
13945I863k1927j164K3075K2193J6010n5244m3779M3382j791q3769q028J4802
$$ 9863 -12064 -13228 9847 32040 48050 -7194 -50973 -7591 -9382 -93151 -101179 -86377
13933h6377L4509m175K1339R148M0212O92r821q574j0520q774L23q0025k5981
$$ -86377 -51868 -56043 -34704 -25556 14656 15348 5527 -3047 -13567 -22341 -22018 -102043 -128024
13920a28024O0066J4619j2414K3808L6249M8938J4263l1779p0463j0259l3413
$$ -128024 -67958 -53339 -65753 -41945 -5696 43242 57505 25726 -44737 -54996 -88409
13909h8409k8174m7911K2939O6489R4909J165l1129j1293j1528l1429l0318M0493
$$ -88409 -116583 -164494 -141555 -75066 19843 21008 -10121 -21414 -32942 -64371 -94689 -54196
13897e4196L0957j7939k5226j6531K7997N9537m0896k8320O691P176K1136l420
$$ -54196 -23239 -41178 -66404 -82935 -54938 4599 -36297 -64617 -57926 -50750 -29614 -33034
13885c3034M5384l3143n7067K6557J8004l631j1009k6075K358J6038L7000j6189
$$ -33034 12350 -20793 -77860 -51303 -33299 -36930 -47939 -74014 -71656 -55618 -18618 -34807
13873c4807J748L2177L0624O987n3819l0339l29N4060M4461j1731o207j1128q096
$$ -34807 -33059 -882 29742 36729 -17090 -47429 -47758 6302 50763 39032 32825 21697 13601
13860A3601P9763M5649l5648k8230n2030P939K1288m3651j7311J7689l2387o863
$$ 13601 93364 139013 103365 75135 23105 31044 52332 8681 -8630 9059 -23328 -30191
13848c0191p71k83M3554J7878l4471j7780o435P1190k804l2313l3372K161Q837
$$ -30191 -30962 -31245 12309 30187 -4284 -22064 -28499 42691 39887 7574 -25798 -23637 -14800
13835a4800L6465J3977Q611J1014l5442J0009L6496J9895k7448k849n0341j725
$$ -14800 21665 35642 44253 55267 19825 29834 66330 86225 58777 55928 5587 3862
13823C862P124k3304j0579o688k8208r03j805N979M3942L1020k5492M624J4868
$$ 3862 10986 -12318 -22897 -29585 -57793 -58696 -60501 -54522 -10580 20440 -5052 -428 14440
13810A4440L647j5460o976k17j9000K1348p937o0061J2867O5272L8415l4900q6976
$$ 14440 18087 2627 -4349 -4566 -23566 -2218 -10155 -70216 -57349 7923 46338 11438 -75538
13797g5538k8857M6852O0301N012m8620j9503J8846O0649L5638j1475k7104q2936
$$ -75538 -104395 -57543 2758 7770 -40850 -60353 -41507 19142 54780 43305 16201 -66735
13785f6735O932j0076Q667O9689K2984R990j6018L9144J6441l7201L69j4090K077
$$ -66735 -59803 -69879 -61212 8477 31461 41451 25433 64577 81018 43817 44186 30096 32173
13772C2173k1420l6156J2120R040k8255L3283L2981K9993m5011n8707n149J1612
$$ 32173 10753 -25403 -13283 -4243 -32498 785 33766 63759 18748 -39959 -45108 -33496
13760c3496L8548j6764p0242N120n529N8456N3944L9944J8203l3639m3470o058
$$ -33496 5052 -11712 -81954 -76834 -82363 -23907 30037 69981 88184 54545 11075 5017
13748E017o5786J3628q615L1063N7053J9518L5162q966j5672K7814P983K0081
$$ 5017 -60769 -47141 -55756 -24693 32360 51878 87040 78074 62402 90216 98199 118280
13736A18280o1384k5437L3939m393O879J4531n8445j8722J2016L0416K5758o292
$$ 118280 56896 31459 65398 61005 67884 82415 23970 5248 17264 47680 73438 67146
13724F7146j1773j8244R834Q624O1997j8705l4590l9620k904M5888m5692Q356
$$ 67146 55373 37129 46963 55587 117584 98879 64289 24669 21765 67653 21961 30317
13712C0317N5214j2479k7046Q78M765k5311p0108j8171K5563n06N155O029K7620
$$ 30317 85531 73052 46006 46884 51649 26338 -43770 -61941 -36378 -36884 -31729 -25700 1920
13699A920K8652k6407n4277m8497L9764N1265K3321L7230J5237l4447j2333n2503
$$ 1920 30572 4165 -50112 -98609 -58845 -7580 15741 52971 68208 33761 21428 -31075
13687c1075J4809j3714j3682O1924J5459k5874n969m2558k5453R666L3989O2753
$$ -31075 -16266 -29980 -43662 18262 33721 7847 1878 -40680 -66133 -56467 -22478 40275
13675D0275l4033J2122p051n0294J6444J9117j7417k7212N72K0829K4941j132
$$ 40275 6242 18364 11313 -38981 -22537 -3420 -20837 -48049 -47477 -26648 -1707 -2839
13663b839M973j2435k8214j6262J5382k3588N327J5984N2040j9696L1024O2056
$$ -2839 2134 -10301 -38515 -54777 -39395 -62983 -57656 -41672 10368 -9328 21696 83752
13651H3752M3333K3333o9214k7362k7943k3216L3779K2113M29k2770q684o834
$$ 83752 127085 150418 81204 53842 25899 2683 36462 58575 59004 36234 27550 20716
13639B0716o849l3250j8042J2809M5134o966n2029K0500K3236L1183k678j3927
$$ 20716 13867 -19383 -37425 -24616 20518 13552 -38477 -17977 5259 36442 33764 19837
13627A9837k7064m2038p96j0501J0214K2347m6202k4158N271K0498Q476M0133
$$ 19837 -7227 -49265 -50061 -60562 -50348 -28001 -74203 -98361 -93090 -72592 -64116 -23983
13615b3983N4490L330l7780l9115o138j8l9377J7757K2229N4472J9932m7191o4818
$$ -23983 30507 33837 -3943 -43058 -49196 -49214 -88591 -70834 -48605 5867 25799 -21392 -86210
13602h6210K3638P072M4369K4128n254J3172L4380k4835k917j8811p9028r652
$$ -86210 -62572 -55500 -11131 12997 7743 20915 55295 30460 27543 8732 -70296 -79948
13590g9948P574L433L9827L9233J074j9626J5972M2260k6584l8643K7186j4742
$$ -79948 -72374 -68941 -29114 10119 11193 -8433 7539 49799 23215 -15428 11758 -2984
13578b984n6108n3191R272l4327M3587N9827k323j466l2012k5136K2587J3396
$$ -2984 -59092 -112283 -103011 -137338 -93751 -33924 -36247 -37713 -69725 -94861 -72274 -58878
13566e8878L2614n468j2138K3369k4421J8817p824k7494M7526M5427M665m8111
$$ -58878 -26264 -31732 -43870 -20501 -44922 -26105 -33929 -61423 -13897 31530 36195 -11916
13554a1916k3685J2745K6377k502N596l7752L0693j0481p3862k440K1477O607
$$ -11916 -35601 -22856 3521 1019 6615 -31137 -444 -10925 -84787 -87227 -65750 -59143
13542e9143L245M3174K1825k5040o046K2350J4406R398R26j1031J7642J1902J7303
$$ -59143 -55898 -12724 9101 -15939 -21985 365 14771 24169 25095 14064 31706 43608 60911
13529F0911j2467n2544l7350K4580o045O71k209N1466k851m3789r571J9692J3110
$$ 60911 48444 -4100 -41450 -16870 -22915 -22244 -24453 27013 24162 -19627 -29198 -9506 3604
13516C604M1363M3258l2342l2484o465j5870l8796k4093j1260J2639K0243J7379
$$ 3604 44967 88225 55883 23399 16934 1064 -37732 -61825 -73085 -60446 -40203 -22824
13504b2824O4946O8681K4603k5011q5220m6595k2288J691J725o5803K2685M7668
$$ -22824 42122 110803 135406 110395 25175 -21420 -43708 -42017 -40292 -106095 -83410 -35742
13492c5742o893L4697J2450j1752m1037K9531J8389m2915p308O6994J3805J4063
$$ -35742 -42635 -7938 4512 -7240 -48277 -18746 -357 -43272 -50580 16414 30219 44282
13480D4282k6998j6634k2222M300N4434J3474P421m1643p8893o477j2455K7932
$$ 44282 17284 650 -21572 -17272 37162 50636 58057 16414 -62479 -68956 -81411 -53479
13468e3479N6679q548k9034m0503K1644r82M0151K7821J5661J9357n3925J5692
$$ -53479 3200 -5348 -34382 -74885 -53241 -54223 -14072 13749 29410 48767 -5158 10534
13456A0534k926k6735K5180O370K9494m5442k825k5538j5253m548J5620K4256
$$ 10534 7608 -19127 6053 12423 41917 -3525 -6350 -31888 -47141 -51689 -36069 -11813
13444a1813k3711J239Q182L9117l2475m0186K782j4670l2313J9299L1094K9064
$$ -11813 -35524 -34285 -26103 13014 -19461 -59647 -56865 -71535 -103848 -84549 -53455 -24391
13432b4391J2306l5853Q034K0615J2065J7810K8697K7297K7660n1661q9825j1531
$$ -24391 -12085 -47938 -39904 -19289 -7224 10586 39283 66580 94240 42579 -47246 -58777
13420e8777j9738N2091M2264L820k8011J8543K3503J4390O90N1753n8119l3419
$$ -58777 -78515 -26424 15840 19660 -8351 10192 33695 48085 48775 100528 42409 8990
13408H990M5167r585l572j6426l2790n1197O4895K0443j5244j3218o921m7058
$$ 8990 54157 44572 41000 24574 -8216 -59413 5482 25925 10681 -2537 -9458 -56516
13396e6516J6179L2096k8330n1019J3342O8255J58l2439K7178J9629J789J5035
$$ -56516 -40337 -8241 -36571 -87590 -74248 -5993 -5835 -38274 -11096 8533 10322 25357
13384B5357P603R017m1395j8659L6566N1992l8902m2671O751K2514K4053Q198
$$ 25357 32960 41977 582 -18077 18489 70481 31579 -11092 -4341 18173 42226 50424
13372E0424K6059R947m2957k0191n0317n9496J231M3558O4303N441o490k3558
$$ 50424 76483 86430 43473 23282 -27035 -86531 -85300 -41742 22561 28002 21512 -2046
13360b046j1638J8050j8110N746J6806J9969j9841q259q718M1145K735J1235K4977
$$ -2046 -13684 4366 -13744 -7998 8808 28777 8936 677 -8041 33104 35839 47074 72051
13347G2051L7255k1024j5749r211Q054l6755L871l688j4620j3099l847N46j0505
$$ 72051 109306 88282 72533 63322 71376 34621 38492 34804 20184 7085 3238 3784 -6721
13334f721K4613k1427k9859N0579n0114J7289N4114J5280j8413l1026Q94K7938
$$ -6721 17892 -3535 -33394 17185 -32929 -15640 38474 53754 35341 4315 5209 33147
13322C3147O67j2694m0603k5984j1960L4852N6125j5348J1964L1886l3504J0943
$$ 33147 33814 21120 -19483 -45467 -57427 -22575 33550 18202 30166 62052 28548 39491
13310C9491J6822k1901Q122j8530L258j1631j3322K4705K5231j2322k6533K6376
$$ 39491 56313 34412 42534 24004 27262 15631 2309 27014 52245 39923 13390 39766
13298C9766K439k7810K9859j1847k3303P076m7384m7993J6091j883J75O3564m496
$$ 39766 42205 14395 44254 32407 9104 16180 -31204 -79197 -63106 -64989 -64814 -1250 -5746
13285e746k0628k8379r820R412k5596m5916l5181P4871J23498K3440j7117j9242
$$ -5746 -26374 -54753 -64573 -55161 -80757 -126673 -161854 -86983 36515 59955 42838 23596
13273B3596j9269l5183j1544n8268n9000J4485N2722N8996K578K509K9426J0915
$$ 23596 4327 -30856 -42400 -100668 -159668 -145183 -92461 -33465 -30887 -28378 1048 11963
13261A1963j109k3039j841L988k679l3205j0151J3579L1464L1747j8956k6194
$$ 11963 10854 -12185 -14026 -10038 -12717 -45922 -56073 -42494 -11030 20717 1761 -24433
13249b4433M262J816m8019j8104L5976L2819j0786n905L2900o339K518J4051l2515
$$ -24433 -20171 -18355 -66374 -84478 -48502 -15683 -26469 -32374 526 -5813 -3295 10756 -21759
13236b1759j9981j8903l3838j7509r939M9506R0985M6636m983l3860l6812m2605
$$ -21759 -41740 -60643 -94481 -111990 -121929 -72423 18562 65198 60215 26355 -10457 -53062
13224e3062J755q580r159M7862K9520K9659j1532n7116J1020L8351O804m171L4552
$$ -53062 -51307 -59887 -69046 -21184 8336 37995 26463 -30653 -19633 18718 25522 21351 55903
13211E5903Q792l0757l2461K2297N548l1450j305L1869K2652M210L3584k3328
$$ 55903 64695 33938 1477 23774 29322 -2128 -3433 28436 51088 55298 88882 65554
13199F5554n1122k001n126P96Q289J0164L433O130M8303J3864k9090l7505M0334
$$ 65554 14432 12431 7305 8101 16390 26554 29987 36117 84420 98284 69194 31689 72023
13186G2023j3746k4023l5061l7033J1918K3061K2707M4755n390k793r172M040
$$ 72023 58277 34254 -807 -37840 -25922 -2861 19846 64601 59211 56418 47246 51286
13174E1286k6421m4831r968J3201L1905L3175m2215j3907j5374k2071J1239j6172
$$ 51286 24865 -19966 -29934 -16733 15172 48347 6132 -7775 -23149 -45220 -33981 -50153
13162e0153l7823l847J7791P3959L3113j1611m675L611q1660J1248N8075N6235
$$ -50153 -87976 -91823 -74032 -73 33040 21429 16754 20365 -61295 -50047 8028 64263
13150F4263K4534p449o8417n4066L1711O553N188L7916k7951j7238j570j2296
$$ 64263 88797 81348 12931 -41135 -9424 -2871 2317 40233 12282 -4956 -6526 -18822
13138a8822l540J4704M0993J2626j180k8504m1250j2051K2051j8731k3708n587
$$ -18822 -22362 -7658 33335 45961 44781 16277 -24973 -37024 -14973 -33704 -57412 -62999
13126f2999N6720J7620j1032l3964m632K0765J4786k0442j4860q815J2211J9138
$$ -62999 -6279 11341 309 -33655 -38287 -17522 -2736 -23178 -38038 -46853 -34642 -15504
13114a5504O59J9207J1664J4251k6399n634M960R038m972m0137j231R546p047
$$ -15504 -14845 4362 16026 30277 3878 -1756 3204 12242 7270 -32867 -34098 -24552 -31599
13101c1599j1270l3028r372M1432N1892M8762k5514m9100k1549j3471N0567L4504
$$ -31599 -42869 -75897 -85269 -43837 8055 56817 31303 -17797 -39346 -52817 -2250 32254
13089C2254M752k8680l1340l9336J2881j7433n330J4755K2738k1555O144J578
$$ 32254 37006 8326 -23014 -62350 -49469 -66902 -72232 -57477 -34739 -56294 -50150 -48572
13077d8572j5838k460N3137K0897K1623k6832k1321J0461k790P3577O5708L2813
$$ -48572 -64410 -66870 -13733 7164 28787 1955 -19366 -8905 -11695 61882 127590 160403
13065A60403j2944r6129n2919m2118l215L4710K3392k2531M875Q375M274l2243
$$ 160403 147459 51330 -1589 -43707 -46922 -12212 11180 -11351 -6476 1899 6173 -26070
13053b6070J5066N8473J1791k5755N275K1233o2103L0330K3992J7845l5062m5406
$$ -26070 -11004 47469 59260 33505 38780 60013 -2090 28240 52232 70077 35015 -10391
13041a0391j6126o902J9933J00274j6800l3392j2231q6874n3298l4728P0476J14474
$$ -10391 -26517 -33419 -13486 86788 69988 36596 24365 -62509 -115807 -150535 -80059 34415
13029C4415L0566p6244o4532L462M3295L5890o332k4912J780N952J3174k9531
$$ 34415 64981 -11263 -75795 -72333 -29038 6852 520 -24392 -22612 -16660 -3486 -33017
13017c3017J7602R684l199j6112p567K1157l130r174o034M147j5854J8760M1099
$$ -33017 -15415 -5731 -8930 -25042 -32609 -11452 -14582 -23756 -29790 -25643 -41497 -22737 18362
13004A8362j9544l3316l7236j2927l2370k2885K2302O1916J1288K4115j6112m1575
$$ 18362 -1182 -34498 -71734 -84661 -117031 -139916 -117614 -55698 -44410 -20295 -36407 -77982
12992g7982l7110o830M8503P267Q819J9931k981j770q274J5872j6120M881M3781
$$ -77982 -115092 -121922 -73419 -66152 -57333 -37402 -40383 -42153 -50427 -34555 -50675 -45794 -2013
12979b013L5849K3844j7093L445j3200J3891L623k5225L096k540j7401k762j3860
$$ -2013 33836 57680 40587 44032 30832 44723 48346 23121 26217 23677 6276 3514 -10346
12966a0346k1376N1020O1905k2595M1576n2656m5510N681q61l0840L894Q4064
$$ -10346 -31722 19298 81203 58608 100184 47528 2018 7699 6838 -24002 -20108 63956
12954F3956j6338J1097k0694m224p865l6664j2282O2059K8291M605k1918l41j1952
$$ 63956 47618 58715 38021 33797 25932 -10732 -23014 39045 67336 71941 50023 49682 37730
12941C7730k2408k0411l9693M9041M7824J9616l5483n6257M164K3396J0114J0877
$$ 37730 15322 -5089 -44782 4259 52083 71699 36216 -20041 -15877 7519 17633 28510
12929B8510N0569K1472j333j2089N030k1868k1910J8474J1139j9672l8018r445
$$ 28510 79079 100551 99218 87129 92159 70291 48381 66855 77994 58322 20304 10859
12917A0859k6664k2758L1277R121K2871l5551j3134K3650K7650l5810j9265k5
$$ 10859 -15805 -38563 -7286 1835 24706 -10845 -23979 -329 27321 -8489 -27754 -27779
12905b7779J2264q658J6316M943k7329L0423J4015K2406K4191k2092l0615k3925
$$ -27779 -15515 -24173 -7857 -2914 -30243 180 14195 36601 60792 38700 8085 -15840
12893a5840k972j0772k294j2967Q823M5032O9100k3020k9205j0758j4476K0363
$$ -15840 -18812 -29584 -31878 -44845 -36022 9010 78110 55090 25885 15127 651 21014
12881B1014m467p4930j24L0141J4317N091M1861P390l6071j60K5792K3848m8157
$$ 21014 16547 -58383 -58507 -28366 -14049 -8958 32903 40293 4222 4062 29854 53702 5545
12868E545N892m0182j765J4269J9288q338j8641J1494M3755K8503J0706j469O875
$$ 5545 11437 -28745 -30510 -16241 3047 -5291 -23932 -12438 31317 59820 70526 69057 75932
12855G5932l999m0934M3594K814K019Q566J3303L736k7551m115K3850k9533k4354
$$ 75932 71933 30999 74593 77407 79426 87992 101295 105031 77480 73365 97215 67682 43328
12842D3328K5284r821j2409n1328K1813O8010N2399k4674j9077j6331j9726M6461
$$ 43328 68612 58791 46382 -4946 16867 84877 137276 112602 93525 77194 57468 103929
12830A03929J7032j6838k0064N275J4129Q6515L1149R800N422j7757k0563M2127
$$ 103929 120961 104123 84059 89334 103463 189978 221127 230927 236349 218592 198029 240156
12818B40156j9939l6010m5136L9562n0184l9014K9947N970r6608k7540J5223l3129
$$ 240156 220217 184207 139071 178633 128449 89435 119382 125352 28744 1204 16427 -16702
12806a6702L344N9299M3952k1084k847K6856N114J9593k7634m974J5221k5852
$$ -16702 -13358 45941 89893 68809 65962 92818 97932 117525 89891 84917 100138 74286
12794G4286k5854K3504J5807J7870K0524R612K9170J2808k6580n1080l0136m58
$$ 74286 48432 71936 87743 105613 126137 135749 164919 177727 151147 100067 69931 69473
12782F9473N5698N9164k7013p3712o1246q384k9260p982N3560M4301r696J0132
$$ 69473 125171 184335 157322 83610 22364 13980 -15280 -23262 30298 74599 64903 75035
12770G5035K0438o8234o7231j1647j4383K5142L3500Q050K1300J3754O8571J9883
$$ 75035 95473 27239 -39992 -51639 -66022 -40880 -7380 670 21970 35724 104295 124178
12758A24178k8711j9219j6640k3268L3060P058m1272n3007R7621K9622j3346k9228
$$ 124178 95467 76248 59608 36340 69400 76458 35186 -17821 79800 109422 96076 66848
12746F6848k2120M5847J0608k3965l6649q769r431L6239Q4917J6426n1756n4960
$$ 66848 44728 90575 101183 77218 40569 31800 22369 58608 143525 159951 108195 53235
12734E3235j2994Q5553k2121l3687j6978m038k4941r664P310j8877N2969M756
$$ 53235 40241 125794 103673 69986 53008 48970 24029 14365 21675 2798 55767 60523
12722F0523j4643m201m535K5847J2316k2933K4124K1460k9287M2249P6110j7050
$$ 60523 45880 41679 37144 62991 75307 52374 76498 97958 68671 110920 187030 169980
12710A69980r2m2554J4267p264q334N235O374R350k9514k5382k4964O1339K0005
$$ 169980 169888 127334 141601 134337 126003 131238 137612 146962 117448 92066 67102 128441 148446
12697A48446k805l123k9578k436K2241J091j1797K4461j0619j3688J0910j3283
$$ 148446 145641 142518 112940 110504 132745 133836 122039 146500 135881 122193 133103 119820
12685A19820J5074l839P384m8757k6241K1495J4991K6286j5126j3695p621k1852
$$ 119820 134894 131055 138439 89682 63441 84936 99927 126213 111087 97392 89771 67919
12673F7919J5331j115J2126o4225j4481q420L1056q366J7356k1020k3134k7513
$$ 67919 83250 82135 94261 30036 15555 7135 38191 29825 47181 26161 3027 -24486
12661b4486M7395N7480P57m7427j4026j8495J249N030q497o589P46K3292m401
$$ -24486 22909 80389 81146 33719 19693 1198 2447 7477 -1020 -7609 -6863 16429 12028
12648A2028J1523L0912o632m7715P085o8623J7026J9933J3863K4962n9232l0212
$$ 12028 23551 54463 47831 116 7201 -61422 -44396 -24463 -10600 14362 -44870 -75082
12636g5082P564N2757L1396J2635j7027K1364P8914L1500o9318j28936J5850M2160
$$ -75082 -67518 -14761 16635 29270 12243 33607 112521 144021 74703 -54233 -38383 3777
12624C777k9655N515O1518N1577k5986o251R322j7971j1622j9791J267P455p380
$$ 3777 -25878 -20363 41155 92732 66746 60495 69817 51846 40224 20433 21700 29155 21775
12611B1775Q127O796k6338n6352M476p351O0059L5007K0526l7533j0192j0585
$$ 21775 29902 36698 10360 -45992 -41516 -48867 11192 46199 66725 29192 19000 8415
12599H415K0652L6350j7171j1546j3188N071N897p430L5743n620M7874j6239l9376
$$ 8415 29067 65417 48246 36700 23512 28583 34480 27050 62793 57173 105047 88808 49432
12586D9432m9049l9507k042K8330Q110J174N636l9029K0672K6553L1665J405k6633
$$ 49432 383 -39124 -41166 -12836 -4726 -3552 2084 -36945 -16273 10280 41945 43350 16717
12573A6717J5362j4040o496K3027L3276j1343K5330L6921K6859k1631j8399k5735
$$ 16717 32079 18039 11543 34570 67846 56503 81833 118754 145613 123982 105583 79848
12561G9848k7309m1107N910M1798l6502k0413N9119L3114N683l5410K6087L7929
$$ 79848 52539 11432 17342 59140 22638 2225 61344 94458 100141 64731 90818 128747
12549A28747j5094j5719J5958k3896O902n3659J3067N0085m4975k8625l5005m3376
$$ 128747 113653 97934 113892 89996 96898 43239 56306 106391 61416 32791 -2214 -45590
12537d5590L4281K9862k7636K8185O8714O6340j3783j3525l7505k2377K0329j5882
$$ -45590 -11309 18553 -9083 19102 87816 154156 140373 126848 89343 66966 87295 71413
12525G1413j6763K3702O054m982K2470o615k3503M5296J06979m1709p9825k4250
$$ 71413 54650 78352 84406 79424 101894 95279 71776 117072 224051 182342 102517 78267
12513G8267K4945m879j4279L2147j0674l635J92k8891m002k40j3532M040J9927
$$ 78267 103212 98333 84054 116201 105527 101892 102084 73193 69191 68951 55419 59459 79386
12500G9386L1759k1652j4115K7312o86k7721L3687P5104m5395J021J8342J018
$$ 79386 111145 89493 75378 102690 102004 74283 107970 183074 137679 138700 157042 158060
12488A58060J8528O195l5055K2941L4073n0691l214K3784O306K5131L7098p650
$$ 158060 176588 182783 147728 170669 204742 154051 150837 174621 180927 206058 243156 235506
12476B35506J0419j2521K5516o1869n2735J0218M2920j3502j1093K8536M3660
$$ 235506 245925 233404 258920 197051 144316 154534 197454 183952 172859 201395 245055
12465B45055K8986J9887j4918j7240N1940J9015l5868k1398j2237J4313M7909
$$ 245055 274041 293928 279010 261770 313710 332725 296857 275459 263222 277535 325444
12454C25444O5051J2253L621J3266Q46L8208J9861o659M056K4368N3975N4259
$$ 325444 390495 402748 406369 419635 420481 458689 478550 471891 475947 500315 554290 608549
12442F08549M9113P8566R6087O4593K1854J33559J09684J31503J63906K04987
$$ 608549 657662 736228 832315 896908 918762 1052321 1162005 1293508 1457414 1662401
12432A662401K88947L14768L48067M18101N77061O39220P30311P83485P77063
$$ 1662401 1951348 2266116 2614183 3032284 3609345 4248565 4978876 5762361 6539424
12423F539424O60717M81741K11472J9739j14351J9985J85607K49253L09782L69743
$$ 6539424 7200141 7681882 7893354 7913093 7798742 7818727 8004334 8253587 8563369 8933112
12413H933112L70965K14097L5728k60585l62897l53891k85390k25605j22571R0547
$$ 8933112 9304077 9518174 9553902 9293317 8930420 8576529 8291139 8065534 7942963 8033510
12403H033510L70080N49493P16293R74358J190596J383522J544788J657122J607225
$$ 8033510 8403590 8953083 9669376 10643734 11834330 13217852 14762640 16419762 18026987
12394A8026987J344366R53765L95235j33474n99192q52744r37957p86563m16658
$$ 18026987 19371353 20325118 20720353 20586879 19987687 19134943 18196986 17410423 16993765
12385A6993765j97189j34326o0492j67337l87034m95892n55284m40284k59658
$$ 16993765 16796576 16662250 16601758 16434421 16047387 15551495 14996211 14555927 14296269
12376A4296269J3193L55548P27090J135153J462576J627909J483445R76468K91170
$$ 14296269 14309462 14665010 15392100 16527253 17989829 19617738 21101183 22077651 22368821
12367B2368821n00798j010927j090724q80333m63636P3170O45194J196880J795276
$$ 22368821 21868023 20857096 19766372 18886039 18422403 18495573 19140767 20337647 22132923
12358B2132923K254854K490938K398245K038194J361118P38288J16700k79162
$$ 22132923 24387777 26878715 29276960 31315154 32676272 33414560 33531260 33252098
12350C3252098p11059j275886j905318k420505k789826k916445k775401k457512
$$ 33252098 32541039 31265153 29359835 26939330 24149504 21233059 18457658 16000146
12342A6000146k080080j800388j493920j212708j029713q83651p44138n85703
$$ 16000146 13920066 12119678 10625758 9413050 8383337 7499686 6755548 6169845
12334F169845m20001l86416m26087k35698k11999k10886j49343q1557j7416n3914
$$ 6169845 5749844 5363428 4937341 4701643 4489644 4278758 4129415 4047858 4030442 3976528
12324C976528j2326N6685J13595Q7505P1011J57999K27386K57533K71849L33733
$$ 3976528 3964202 4020887 4134482 4221987 4292998 4450997 4678383 4935916 5207765 5541498
12314E541498M60802N98203P24501Q12330Q98572J073332J271592J462543J734286
$$ 5541498 6002300 6600503 7325004 8137334 9035906 10109238 11380830 12843373 14577659
12305A4577659J901401K021035K114855K077599J933958J670360J240486Q78623
$$ 14577659 16479060 18500095 20614950 22692549 24626507 26296867 27537353 28415976
12297B8415976N37380J42361k33219o92845j061067j303184j390288j354079j262037
$$ 28415976 28953356 29095717 28862498 28169653 27108586 25805402 24415114 23061035 21798998
12288B1798998j017906o91453l04763o8474J20212K68930J87750K6989j41620
$$ 21798998 20781092 20089639 19784876 19716402 19836614 20105544 20293294 20320283 20178663
12279B0178663l89430o23488q02836q35350q11215o60895m32214k62639q2702
$$ 20178663 19789233 19165745 18362909 17527559 16716344 16055449 15623235 15360596 15277894
12270A5277894P1839J39831K18048K21287K09872J43143J38719J87730K85291
$$ 15277894 15349733 15489564 15707612 15928899 16138771 16281914 16420633 16608363 16893654
12261A6893654L42302M51182M90594M43464L03499j5954l76104o78307r28232
$$ 16893654 17235956 17687138 18177732 18621196 18924695 18908741 18532637 17854330 16926098
12252A6926098j107731j184388j152719j060229q62590p52646o00577m11572k47271
$$ 16926098 15818367 14633979 13481260 12421031 11558441 10805795 10205218 9793646 9546375
12243I546375j28234k8642J3561K7552J6791k523Q224r9246j96841k30624k24547
$$ 9546375 9418141 9389499 9403060 9430612 9447403 9444880 9453104 9353858 9157017 8926393 8701846
12232H701846k07104j62171j01051j09043j13200j94687l07873l93799n10126
$$ 8701846 8494742 8332571 8231520 8122477 8009277 7814590 7506717 7112918 6602792
12223F602792o04642n75862n32286m94388m50569m20314l56182l08978k56319
$$ 6602792 5998150 5422288 4890002 4395614 3945045 3524731 3168549 2859571 2603252
12214B603252k67976j85730j11948j13630p8933j06068j43973j20992r2560m8805
$$ 2603252 2335276 2149546 2037598 1923968 1845035 1738967 1594994 1474002 1381442 1332637
12204A332637r5229q6471m4478j4478k4654r2617l4778n4953m3634m3155L3646
$$ 1332637 1237408 1150937 1106459 1091981 1067327 974710 939932 884979 841345 798190 831836
12193H31836j065l0611l3116k6879k6055m6801l1526j4494K0030o9763k3318k4967
$$ 831836 830771 800160 767044 740165 714110 667309 635783 621289 641319 571556 548238 523271
12181E23271k2531L196J4821n445L687K1672k6077j4602j3250k7628L8531J7646
$$ 523271 500740 503936 518757 513312 516999 538671 512594 497992 484742 457114 495645 513291
12169E13291j3526K6421l3331r392l306n2172j7335K044K5706j513n3298o8299
$$ 513291 499765 526186 492855 483463 480157 427985 410650 412694 438400 436887 383589 315290
12157C15290Q534J3084k7215k1408L4498m2413L671J469K4092k535m2902j5892
$$ 315290 323824 336908 309693 288285 322783 280370 284041 285510 309602 307067 264165 248273
12145B48273j5608o3061J3551P1006L1780k0688k9937k3715L822k8086K1892L9149
$$ 248273 232665 169604 183155 254161 285941 265253 235316 211601 215423 187337 209229 248378
12133B48378l0051n7378O011J1868J0604M8163K1581j1511k4427K3327J9905m030
$$ 248378 218327 160949 166960 178828 189432 237595 259176 247665 223238 246565 266470 262440
12121B62440j7512l4092l6534o1699K7249N5507J2040N910k4331k991k1521j5823
$$ 262440 244928 210836 174302 112603 139852 195359 207399 213309 188978 185987 164466 148643
12109A48643j68k0827L0151J4420K8080L1837N291K755j0218J9166o379j9110
$$ 148643 148475 127648 157799 172219 200299 232136 237427 240182 229964 249130 242751 223641
12097B23641k4324J8468M6903m6218p2747m1098J3829l1918J6399L8309O8420
$$ 223641 199317 217785 264688 218470 145723 104625 118454 86536 102935 141244 209664
12086B09664j7841m5466l6590k5306J7269L8763N4058q463J8753m1748R206K2774
$$ 209664 191823 146357 109767 84461 101730 140493 194551 186088 204841 163093 172299 195073
12074A95073n1893k8395j3512o366L7494J7191m054l2037K1557m885k3906k2311
$$ 195073 143180 114785 101273 94907 132401 149592 145538 113501 135058 130173 106267 83956
12062H3956J7294J401n4023j7433J6086L0617m733Q192Q3381N9201r143k3297
$$ 83956 101250 102651 48628 31195 47281 77898 73165 81357 164738 223939 214796 191499
12050A91499J0705j3693n2456j1485L853L4341Q212l712L6198K0668P837j6485
$$ 191499 202204 188511 136055 124570 128423 162764 170976 167264 203462 224130 231967 215482
12038B15482m5146k9379l5415J7375K5942j1267l4933J5950K7681K7717N596o3443
$$ 215482 170336 140957 105542 122917 148859 137592 102659 118609 146290 174007 179603 116160
12026A16160J835M5336j9756o1504m672J3083N2020m6332k1370q093k4646K2073
$$ 116160 117995 163331 143575 82071 77399 90482 142502 96170 74800 66707 42061 64134
12014F4134J1916m1744k3390O5011O196j1999j2126K1003J5696j5432J2358j0872
$$ 64134 76050 34306 10916 75927 82123 70124 57998 79001 94697 79265 91623 80751
12002H0751j6055K790l1079k0455N2169M0490j289m6899j2650L8961J886o074
$$ 80751 64696 67486 36407 15952 68121 108611 107322 60423 47773 86734 88620 82546
11990H2546j0077k4112j8823L1912j3279K9104J00549K1560r1093q1427j5024
$$ 82546 72469 48357 29534 61446 48167 77271 177820 199380 108287 26860 11836
11979A1836J4138O9291Q7529n867l5523J2177J9767j464m1688j5757M1010K6730
$$ 11836 25974 95265 182794 176927 141404 153581 173348 171884 130196 114439 155449 182179
11967A82179j2535q170l5349n9969L8531o397J3167M5407j7447l0769k9873O664
$$ 182179 169644 161474 126125 66156 104687 98290 111457 156864 139417 108648 78775 85439
11955H5439k4882j2256J02598L9259n2861j5791J6644K1786K2947j2751o2030
$$ 85439 60557 48301 150899 190158 137297 121506 138150 159936 182883 170132 108102
11944A08102r907P3523K0314m1807m4302K1803M2924N110l3126j1655o593k1481
$$ 108102 98195 171718 192032 150225 105923 127726 170650 175760 142634 130979 124386 102905
11932A02905P1792L364J2707m4642m7675L5080L52k4081o5081k1866M0053M7600
$$ 102905 174697 178061 190768 146126 98451 133531 133883 109802 44721 22855 62908 110508
11920A10508k4716l8898j4150l6k054L2102K4506K8287M462q331J1934j0913q237
$$ 110508 85792 46894 32744 32708 30654 62756 87262 115549 120011 111680 123614 112701 104464
11907A04464n873K5141m7860k7148M2494R853K7607N701R776k1237k1836j731
$$ 104464 98591 123732 75872 48724 91218 101071 128678 134379 144155 122918 101082 99351
11895I9351J918r766M2130j2421l4594L606o336N776j0117m5049L1491M1577J2128
$$ 99351 101269 91503 133633 121212 86618 90224 83888 89664 79547 34498 65989 107566 119694
11882A19694J3674j5345j7488m6345K7567m7475j9822j4923K0045M4815L2907
$$ 119694 133368 118023 100535 54190 81757 34282 14460 -463 19582 64397 97304
11871I7304j3075k4604j8724L558P0687n3638l0685Q7655P174n0648K3369r73
$$ 97304 84229 59625 40901 44459 115146 61508 30823 118478 125652 75004 98373 97400
11859I7400j1121M4976N136L263O455l509L3065p83K404k7523n1527M064J5724
$$ 97400 86279 131255 136391 139654 146109 142600 175665 174882 177286 149763 98236 102300 118024
11846A18024L0265q052l3285m3198m9687r808L7724N3518k3177j0931M0088J9577
$$ 118024 148289 140237 106952 63754 14067 4259 41983 95501 72324 61393 101481 121058
11834A21058k6120j416J02N3134N738l9423n5122K225L5771K7646m1730j0978
$$ 121058 94938 93522 93624 146758 152496 113073 57951 60176 95947 123593 81863 70885
11822G0885P935M4327j6984n1239k0792N8336J8206o972K004M3142J054L428K9705
$$ 70885 78820 123147 106163 54924 34132 92468 110674 103702 105706 148848 149902 153330 183035
11809A83035r001o1799L5816m929l8523k6511K9789K9445j8887l2975m1882K1414
$$ 183035 174034 112235 148051 143122 104599 78088 107877 137322 118435 85460 43578 64992
11797F4992n3211l5705N5335O3641j2270Q922N2485k1527k1205N0054J6484l3482
$$ 64992 11781 -23924 31411 95052 82782 91704 144189 122662 101457 151511 167995 134513
11785A34513l8058r105l8265k0122j3343K6675K3663l3452k2860L6346j1184Q885
$$ 134513 96455 87350 49085 28963 15620 42295 65958 32506 9646 45992 34808 43693
11773D3693Q422m9618k0649K418J1160j908M4104j1391m4634j946M1174L2299
$$ 43693 52115 2497 -18152 -15734 -4574 -6482 37622 26231 -18403 -20349 20825 53124
11761E3124J2025K7254L8720l2327l187N285r272R152j7406o938R805j5723m9830
$$ 53124 65149 92403 131123 98796 95609 100894 91622 100774 83368 76430 86235 70512 20682
11748B0682o912k714k2065J7704K8361m284Q594j7236n2027o837M5588n82p546
$$ 20682 13770 11056 -11009 6695 35056 30772 39366 22130 -29897 -36734 8854 8272 726
11735G26k9736N757Q958J5421j1963k1910k0022l5716M964R7652J5495J4058l6199
$$ 726 -29010 -23253 -14295 1126 -10837 -32747 -52769 -88485 -83521 14131 29626 43684 7485
11722G485p151L2841L5579O313p9812l6209j9563K9069M772J9082k6106j5950
$$ 7485 334 33175 68754 75067 -4745 -40954 -60517 -31448 -26676 -7594 -33700 -49650
11710d9650M0293O680O457l066n573j8111M2590J6327j5599M458j0452n2193l0666
$$ -49650 -9357 -2677 3780 714 -4859 -22970 19620 35947 20348 24806 14354 -37839 -68505
11697f8505k623L7455M8689k521p5793N350K8409L1509j2325j2840j4789K8056
$$ -68505 -71128 -33673 15016 12495 -63298 -57948 -29539 1970 -10355 -23195 -37984 -9928
11685i928M6965J4764M4989K1410N037k2313l9148PL042k0428k407k436o0955
$$ -9928 37037 51801 96790 118200 123237 100924 61776 61783 64825 44397 41990 39554 -21401
11672b1401M512O748k891J5158L7287O1897m0092p0813l1932R171P936J0226j7466
$$ -21401 -16889 -10141 -13032 2126 39413 101310 61218 -9595 -41527 -32356 -24420 -14194 -31660
11659c1660j3815R675k6653J8590K4291J9636K0857j3867M8357j047l4943J3880
$$ -31660 -45475 -35800 -62453 -43863 -19572 64 20921 7054 55411 54364 19421 33301
11647C3301N1955J9866l211j8288m8407m6437j1989L846p03K6250K2872K5455
$$ 33301 85256 105122 101911 83623 35216 -11221 -23210 -19364 -20067 6183 29055 54510
11635E4510L8986J3399l7598m6880k5140l854q347J6014l1326m666o971l11M0325
$$ 54510 93496 106895 69297 22417 -2723 -6577 -14924 1090 -30236 -34902 -41873 -42184 -1859
11622a859M4683M7660l2426n645j3097n5775k5822K9514M2248O029l0987j5420
$$ -1859 42824 90484 58058 52413 39316 -16459 -42281 -12767 29481 35510 4523 -10897
11610a0897j9981l2523l0344K5281M8089L1474K9729K4843k8961k7388M7316p372
$$ -10897 -30878 -63401 -93745 -68464 -20375 11099 40828 65671 36710 9322 56638 49266
11598D9266j8926k2158J4554L3885L1659J7766n2876p611j8747j7591K2909j2269
$$ 49266 30340 8182 22736 56621 88280 106046 53170 45559 26812 9221 32130 19861
11586A9861P143l9105j6085J5326L173M4385K2912J4196j5652L1582n8224l7877
$$ 19861 27004 -12101 -28186 -12860 -9687 34698 57610 71806 56154 87736 29512 -8365
11574h365k3623k6435J3955k3938j2027L0523K2302K0843l138k8916k921M2661
$$ -8365 -31988 -58423 -44468 -68406 -80433 -49910 -27608 -6765 -9903 -38819 -41740 921
11562I21J819j5386L3263R882j6232k4932m4690J7370K9318k1616j4159J0328
$$ 921 2740 -12646 20617 30499 14267 -10665 -55355 -37985 -8667 -30283 -44442 -34114
11550c4114K0880K8849l354k5692J3758k6700n0796K4224j8876k5253J7568k5037
$$ -34114 -13234 15615 12261 -13431 327 -26373 -77169 -52945 -71821 -97074 -79506 -104543
11538a04543J2354O8217N3726k3409q0194n876L4899J4754q729M529N492o059
$$ -104543 -92189 -23972 29754 6345 -73849 -79725 -44826 -30072 -38801 -34272 -28780 -34839
11526c4839J1247r7K0102j8032L83l3484L8858l660k2075L5346m572n3972l244
$$ -34839 -23592 -23689 -3587 -21619 -21236 -54720 -15862 -19522 -41597 -6251 -10823 -64795 -68039
11513f8039K6794N2661M1277m9564j8520R52R006J2377M4524q21l8444j3640J6295
$$ -68039 -41245 11416 52693 3129 -15391 -14439 -5433 6944 51468 50647 12203 -1437 14858
11500A4858j3231L6259M0351J8529j9581l0711J0898n3550l0627n4050n9019l4809
$$ 14858 1627 37886 78237 96766 77185 46474 57372 3822 -26805 -80855 -139874 -174683
11488a74683M2531L2030K4723l7584J2828J5198J1495L6866P5747O544m0610k7223
$$ -174683 -132152 -100122 -75399 -112983 -100155 -84957 -73462 -36596 39151 45695 5085 -22138
11476b2138J0145j249j7493K8747p313K1261p485L7102l1874l1379M3104K8517
$$ -22138 -11993 -13242 -30735 -1988 -9301 11960 4475 41577 9703 -21676 21428 49945
11464D9945l9409n8901J3129l7873J5217M2191m0602K705O9258L4760J1367k2434
$$ 49945 10536 -48365 -35236 -73109 -57892 -15701 -56303 -53598 15660 50420 61787 39353
11452C9353k7495j5202J3209L3631j748k2056l1465K2267J4865j245M79K7728
$$ 39353 11858 -3344 9865 43496 41748 19692 -11773 10494 25359 24114 24593 52321
11440E2321K8762j1397k5260J0282J4406j2915P685L3753m5056m9207k3679k3302
$$ 52321 81083 69686 44426 54708 69114 56199 63884 97637 52581 3374 -20305 -43607
11428d3607J3101l2711j8309j8603l196L9514P0835M7817j8776k6047j5169K962
$$ -43607 -30506 -63217 -81526 -100129 -103325 -63811 7024 54841 36065 10018 -5151 -2189
11416b189J1210k3397O005L4946M523k2353L7055O620j8196k5438k9234N3274
$$ -2189 9021 -14376 -8371 26575 31098 8745 45800 52420 34224 8786 -20448 32826
11404C2826L5117J2043p1897m1879K3699N240o577L0517K0861K0979J0453j5679
$$ 32826 67943 79986 8089 -33790 -10091 -4851 -11428 19089 39950 60929 71382 55703
11392E5703l5686j7419q838J8746J0855j4639O523m379l606L8714k6343m7818
$$ 55703 20017 2598 -6240 12506 23361 8722 15245 10866 7260 45974 19631 -28187
11380b8187j7679L1150L4569j6577o473L1561M2589m2197o1236L274j3497K5344
$$ -28187 -45866 -14716 19853 3276 -3197 28364 70953 28756 -32480 -29206 -42703 -17359
11368a7359N1993m1034n1429K2741L5481l911j6622N8449L7582K2431j1468o7861
$$ -17359 34634 -6400 -57829 -35088 393 -3518 -20140 38309 75891 98322 86854 18993
11356A8993n2024O09l9517r301M6687o864m621K147K3452L4641l3777Q367j3363
$$ 18993 -33031 -32422 -71939 -81240 -34553 -41417 -46038 -43891 -20439 14202 -19575 -11208 -24571
11343b4571j2377P374o345l8063J5755J8113K4085o429J4855m735J1407n4447
$$ -24571 -36948 -29574 -35919 -73982 -58227 -40114 -16029 -22458 -7603 -12338 -931 -55378
11331e5378l9490J6716L8145K3636j5394p942M8588M5870j7424j4777k9915k2354
$$ -55378 -94868 -78152 -40007 -16371 -31765 -39707 8881 54751 37327 22550 -7365 -29719
11319b9719k276N440l8889M5873Q8479N2620m1565l1137l5447l8609K1039L5758
$$ -29719 -31995 -26555 -65444 -19571 68908 121528 79963 48826 13379 -25230 -4191 31567
11307C1567M990O210K8296k0114m5415o4986J3066K6347L1434K258o399J3577
$$ 31567 36557 42767 71063 50949 5534 -59452 -46386 -20039 11395 13653 7254 20831
11295B0831j1071L1056L7864J1134p6613j21259L279N0254L0747R333J0298M0266
$$ 20831 9760 40816 78680 89814 13201 -108058 -104779 -54525 -23778 -14445 -4147 36119
11283C6119j3937o407q409l5218k9159P3261j419j1462N853O3398J2972n5600
$$ 36119 22182 15775 7366 -27852 -57011 16250 14831 3369 9222 72620 85592 29992
11271B9992k3285l7263k8587M4334O5734m109k0164k742k9021n09n0774j6249
$$ 29992 6707 -30556 -59143 -14809 50925 46816 26652 23910 -5111 -5620 -56394 -72643
11259g2643j227K1339m199j6420j7953J069p284k8716J5817J0773M1820j9514
$$ -72643 -73870 -52531 -56730 -73150 -91103 -90034 -97318 -126034 -110217 -99444 -57624 -77138
11247g7138N358J3750M7489k9976m1899M9623J7755m703L3778r008k7307L6801
$$ -77138 -71780 -58030 -10541 -40517 -82416 -32793 -15038 -19741 14037 5029 -22278 14523
11235A4523M0568K1059k7041N858k6014m9898L6099l4868l0296l521J1441m9408
$$ 14523 55091 76150 49109 54967 28953 -20945 15154 -19714 -50010 -53531 -42090 -91498
11223i1498m3766J5636L8218M3407K2965J9152r572l0256k0245n095K8577j3590
$$ -91498 -135264 -119628 -81410 -38003 -15038 4114 -5458 -35714 -55959 -61054 -32477 -46067
11211d6067K055N297M5932M594l5312l5387N0910M4298p508j4531J6322J1788
$$ -46067 -44012 -38715 7217 11811 -23501 -58888 -7978 36320 28812 14281 30603 42391
11199D2391r186J4747L198Q476J5665o820J3582N47l0122j9216k3677l2864J7721
$$ 42391 33205 47952 51150 59626 75291 68471 82053 82600 52478 33262 9585 -23279 -5558
11186e558l1440L1077R524j4707r811Q706N6004j5437J6288k675k6601j6516O207
$$ -5558 -36998 -5921 3603 -11104 -20915 -12209 43795 28358 44646 41971 15370 -1146 5061
11173E061j6958l7502R894k266n4025J1533o494j9869j2192J3746J1472K1695
$$ 5061 -11897 -49399 -39505 -41771 -95796 -84263 -90757 -110626 -122818 -109072 -97600 -75905
11161g5905K1196P3662k8924m6071M4075K4063J2253k0533j805k986O0747j259
$$ -75905 -54709 18953 -9971 -56042 -11967 12096 24349 3816 2011 -975 59772 58513
11149E8513l8758l690k8782l4536n196N4923J4368j5726l3549J8353k5237j3592
$$ 58513 19755 16065 -12717 -47253 -52449 2474 16842 1116 -32433 -14080 -39317 -52909
11137e2909K1315l6562m601O3737K7044R330l4104K1866P4715k7762l549j1698
$$ -52909 -31594 -68156 -72757 -9020 18024 27354 -6750 15116 89831 62069 58520 46822
11125D6822k1329J1840o3862j9153M7482j6707k8445R981l3577Q3397N4189l2614
$$ 46822 25493 37333 -26529 -45682 1800 -14907 -43352 -33371 -66948 16449 70638 38024
11113C8024j5978K9801N374q797j3970N951m6634k5219K6600p855j2598Q162J3530
$$ 38024 22046 51847 57221 48424 34454 40405 -6229 -31448 -4848 -12703 -25301 -17139 -3609
11100c609J7426j3589K7115r276n510m4110m3146J634J7746K9679M8938K2118
$$ -3609 13817 228 27343 18067 12557 -31553 -74699 -73065 -55319 -25640 23298 45416
11088D5416j5928j4082J6212N599k7852L579K4621k0057m3116J4560L8622j9449
$$ 45416 29488 15406 31618 37217 9365 12944 37565 17508 -25608 -11048 27574 8125
11076H125j2024l8534k0284J7411K6807L5062k4258n1573M3600K4222l6492O5390
$$ 8125 -3899 -42433 -62717 -45306 -18499 16563 -7695 -59268 -15668 8554 -27938 37452
11064C7452N2367L3479J2466l9187l0649n4652j1023n6797k744L5403l156L147
$$ 37452 89819 123298 135764 96577 65928 11276 253 -56544 -59288 -23885 -27041 -23894
11052b3894J9843l802k1502M4148J0695P835j0578Q693R35l804j3974m7885o1490
$$ -23894 -4051 -7853 -29355 14793 25488 33323 22745 31438 32373 28569 14595 -33290 -94780
11039i4780l7111m66K9164K307K497L4066P0235J8570q5387j4186l019l2997j5758
$$ -94780 -131891 -132357 -103193 -100886 -98389 -64323 5912 24482 -60905 -75091 -78110 -111107 -126865
11026a26865L5037M7417J3723j3373K0238j8071J8267L4430l484n2062q924K702
$$ -126865 -91828 -44411 -30688 -44061 -23823 -41894 -23627 10803 7319 -44743 -53667 -50965
11014e0965m2507J5949m563j1959Q7090M0077J520J8788N308P743k2445r891m8143
$$ -50965 -93472 -77523 -82086 -94045 -6955 33122 34642 53430 58738 66481 44036 34145 -13998
11001a3998l9930K4704Q200j0422j5462j0934O8595J8103n6718k0546K30K9337
$$ -13998 -53928 -29224 -21024 -31446 -46908 -57842 10753 28856 -27862 -48408 -48178 -18841
10989a8841O273J6290j9744O830j2849q981L280k408J9084Q6059J4751n2486l2011
$$ -18841 -12568 3722 -16022 -9192 -22041 -31022 -27742 -30150 -11066 74993 89744 37258 5247
10976E247N6501j2770o8194j5498Q653J309k0969l4073j7087K1829N4926j1501
$$ 5247 61748 48978 -19216 -34714 -26061 -24752 -45721 -79794 -96881 -75052 -20126 -31627
10964c1627j5690J5366O6671K4427k0677q393K6641L562j5805l2825J6670J5510
$$ -31627 -47317 -31951 34720 59147 38470 30077 56718 60280 44475 11650 28320 43830
10952D3830p4486K1149J5796j6026K1297m6826J0788m0116j3996k5289k0615L6595
$$ 43830 -30656 -9507 6289 -9737 11560 -35266 -24478 -64594 -78590 -103879 -124494 -87899
10940h7899m106M7021K9531M0346n029k8642K2571j4855K9802J3312l3013k7087
$$ -87899 -92005 -44984 -15453 24893 19864 -8778 13793 -1062 28740 42052 9039 -18048
10928a8048K859N3729K7632q698m0809K0632k4765m8350M917K6576Q544L4113
$$ -18048 -15189 38540 66172 57474 16665 37297 12532 -35818 -30901 -4325 4219 38332
10916C8332J0886j1940n2020k2452j4997K0981L3574L859M3249K1751J964J0149
$$ 38332 49218 37278 -14742 -37194 -52191 -31210 2364 6223 49472 71223 73187 83336
10904H3336n36k1766m8610M0147M1140k4428p3995m4096k4955N096k8065K1792
$$ 83336 82800 61034 12424 52571 93711 69283 -4712 -48808 -73763 -68667 -96732 -74940
10892g4940M0552K8629M9567j380K031k6018k4068j998j6388k5507j4408M028
$$ -74940 -34388 -5759 43808 42428 44459 18441 -5627 -7625 -24013 -49520 -63928 -59900
10880e9900M2796L5564L827k281j1755k4345k9269K7557j0888j531J3366L0456
$$ -59900 -17104 18460 22287 20006 8251 -16094 -45363 -17806 -28694 -30225 -16859 13597
10868A3597j7979n301n2464k519J8990L500J0107R69L8007L3522J2538m5008l3768
$$ 13597 -4382 -9683 -62147 -64666 -45676 -42176 -32069 -31100 6907 40429 52967 7959 -25809
10855b5809J9491L7163q093n5316l6067K4378L1975j308k1695M6538Q495l5833
$$ -25809 -6318 30845 22752 -32564 -68631 -44253 -12278 -13586 -35281 11257 19752 -16081
10843a6081l8746l1461Q341N1604P7501Q418l961j2164m0015k43k7586j2459j5476
$$ -16081 -54827 -86288 -77947 -26343 51158 59576 55615 43451 3436 3193 -24393 -36852 -52328
10830e2328k5881J7415M1604O576Q424Q344K354M0397L1807l2950M266j4892n091
$$ -52328 -78209 -60794 -19190 -12614 -4190 4154 6508 46905 78712 45762 50028 35136 30045
10817C0045k5068l6084K7974M830L4972J7881j2056J648l1921l1609m3067M4594
$$ 30045 4977 -31107 -3133 1697 36669 54550 42494 44142 12221 -19388 -62455 -17861
10805a7861K5538o949k6603n192k6937l2894P2564J6635L1668j5959n8106l4574
$$ -17861 7677 728 -25875 -31067 -58004 -90898 -18334 -1699 29969 14010 -44096 -78670
10793g8670K3452J8395J9026J8121J1303K5669M424o6967K5394j8327l4494n0508
$$ -78670 -55218 -36823 -17797 324 11627 37296 41720 -25247 147 -18180 -52674 -103182
10781a03182p349K1331N0548l835k524L7995N9110M998k5610o148k5275j162k272
$$ -103182 -110531 -89200 -38652 -42487 -45011 -7016 52094 57092 31482 25334 59 -1103 -3375
10768c375l1337R543k690J0096J1467j8364o831j8617n8098J7016r31J8834J4524
$$ -3375 -34712 -25169 -27859 -17763 -6296 -24660 -31491 -50108 -108206 -91190 -92121 -73287 -58763
10755e8763K8720O72m913q957r735L8285P0009R472j2850l242n086j3111m1847
$$ -58763 -30043 -29371 -34284 -43241 -52976 -14691 55318 64790 51940 48698 43612 30501 -11346
10742a1346K4890O129l0226j076p362J8360K5170l6096l2924J1024J8580O5231
$$ -11346 13544 19673 -10553 -11629 -18991 -631 24539 -11557 -44481 -33457 -14877 50354
10730E0354k9033n2681q398N9435O117j6075O156k0815k9832m8642n0887p312
$$ 50354 21321 -31360 -39758 19677 25794 9719 15875 -4940 -34772 -83414 -134301 -141613
10718a41613M6374J2472k8803K8980J8685J2000N3881q800l6688p024O7318O215
$$ -141613 -95239 -82767 -111570 -82590 -63905 -51905 1976 -6824 -43512 -50536 16782 22997
10706B2997l7638j6360M933p491K6671J7245K3481Q166K058j7492n7187K7860
$$ 22997 -14641 -31001 -26068 -33559 -6888 10357 33838 42004 44062 26570 -30617 -2757
10694b757N558j6085K2856O5173O401o3459j4608M3286O444l2026o45k225m3163
$$ -2757 2801 -13284 9572 74745 81146 17687 3079 46365 52809 20783 20138 17913 -25250
10681b5250K7857M397k1362L8518k9364p2257j8117M6580N6949M9745m501K8223
$$ -25250 2607 7004 -14358 24160 -5204 -77461 -95578 -48998 7951 57696 53195 81418
10669H1418O909j9370r352P474j8513l4463L9652J1917j2946m3047k9181K7169
$$ 81418 88327 68957 59605 67079 48566 14103 53755 65672 52726 9679 -19502 7667
10657G667L0148n660k7210P137n81K7027o5637n8306n644K8388J1501j4468K2964
$$ 7667 37815 32155 4945 12082 11501 38528 -27109 -85415 -91059 -62671 -51170 -65638 -42674
10644d2674L5826k425L4945J988k1538l0055J3578M865L0503M8033j3240j0135
$$ -42674 -6848 -9273 25672 27660 6122 -23933 -10355 -5490 25013 73046 59806 49671
10632D9671l807P0143P395n1759j0044m1471l9845J9317L881N4769j3433m4357
$$ 49671 45864 116007 123402 71643 61599 20128 -19717 -400 3481 58250 44817 460
10620D60m5485l2482M28M7871K4750J0141M807N683k9120r172L2110k3007l014
$$ 460 -45025 -77507 -77079 -29208 -4458 5683 10490 16173 -12947 -22119 9991 -13016 -16030
10607a6030M0085J5368l2978m4934j8685N124K4711J4260k5061l3348L5782L2398
$$ -16030 24055 39423 6445 -38489 -57174 -52050 -27339 -13079 -38140 -71488 -35706 -3308
10595c308j8642L2313o00k100Q274J7271J419k3679j68P92o263K1157J511o0418
$$ -3308 -21950 10363 9763 7663 15937 33208 34627 10948 10780 11572 5309 26466 27977 -32441
10581c2441O396L0895l8840j5411r025J6419L8137J5527K1335K7737K2137O63
$$ -32441 -26045 4850 -33990 -49401 -58426 -42007 -3870 11657 32992 60729 82866 83529
10569H3529l4523n7038k9759J1631k8009j8497L1776L7646n110M5574j6337k8367
$$ 83529 49006 -8032 -37791 -26160 -54169 -72666 -40890 -3244 -8354 37220 20883 -7484
10557g484k9746j3499j6844q400K1957N4772k6851j9935N4332J6989O408j6611
$$ -7484 -37230 -50729 -67573 -75973 -54016 756 -26095 -46030 8302 25291 31699 15088
10545A5088m9406n3682j3801p288L1331Q1887Q665l2046M3586k2314m542O2943
$$ 15088 -34318 -88000 -101801 -109089 -77758 4129 12794 -19252 24334 2020 -2522 60421
10533F0421k3736l3444l101J9505j4317k7570K0768L5532q16m1164l6256k1493
$$ 60421 36685 3241 140 19645 5328 -22242 -1474 34058 33242 -7922 -44178 -65671
10521f5671j1759L4J3361M1713N6757l0047m9258L6372K8820k7638k1088M4572
$$ -65671 -77430 -77396 -64035 -22322 34435 4388 -44870 -8498 20322 -7316 -28404 16168
10509A6168m774l1321R153n024n987l967n788o8401Q581J5709j9559L1049M7976
$$ 16168 11394 -19927 -10774 -15798 -21785 -25752 -31540 -99941 -91360 -75651 -95210 -64161 -16185
10496a6185K1931P245O546n8517J876K1594J6279m4967N909l9024j6524R516J1194
$$ -16185 5746 12991 19537 -38980 -37104 -15510 769 -44198 -38289 -77313 -93837 -84321 -73127
10483g3127L090K8677K4807K9440K9858j9007p3849N179n627j678M4410L3161
$$ -73127 -70037 -41360 -16553 12887 42745 23738 -50111 -44932 -50559 -52237 -7827 25334
10471B5334k3703m6338j1109l77J2886L3519P6225k3839l5476N377R078o23R695
$$ 25334 1631 -44707 -55816 -56193 -43307 -9788 66437 42598 7122 12499 21577 20954 30649
10458C0649K3557m2489j4189n2681L83K4870M0333K7003j011K4844K7107k0936
$$ 30649 54206 11717 -2472 -55153 -54770 -29900 10433 37436 36425 61269 88376 67440
10446F7440k4222m3229J3682j1119L824k0969p990R542M1190k2238j8180j9053
$$ 67440 43218 -11 13671 2552 6376 -14593 -22583 -13041 28149 5911 -12269 -31322
10434c1322L5698N4667p9071j4537r376m7203L4294J7723K2893M9656k2239j4012
$$ -31322 4376 59043 -20028 -34565 -43941 -91144 -56850 -39127 -16234 33422 11183 -2829
10422b829j1533j1203N318l7171q546K7671j6395J6780J8743k4713l7704K7710
$$ -2829 -14362 -25565 -20247 -57418 -65964 -38293 -54688 -37908 -19165 -43878 -81582 -53872
10410e3872L5529J3588R194N8118J1597m9814l6570l9814k2731j6081J0325r584
$$ -53872 -18343 -4755 4439 62557 74154 24340 -12230 -52044 -74775 -90856 -80531 -90115
10398i0115j5889L2495M2342L5978L9515j0425j1227l454O95l5411J2928l0931
$$ -90115 -106004 -73509 -31167 4811 44326 33901 22674 19220 19915 -15496 -2568 -33499
10386c3499j0465K4771J1324M7756L7757m2316m4077J3565L149p7169J7463Q1770
$$ -33499 -43964 -19193 -7869 39887 77644 35328 -8749 4816 7965 -69204 -51741 30029
10374C0029j3138j8553j023L6181N890K2279j0062k7923j7881j8202N1415N279
$$ 30029 16891 -1662 -2685 33496 39386 61665 51603 23680 5799 -12403 39012 44291
10362D4291j4003M2707n1863n0372N0687p23o7033j6570J4759J0904m690p452
$$ 44291 30288 72995 21132 -29240 21447 20724 -46309 -62879 -48120 -37216 -41906 -49358
10350d9358L6947K5706K7924j3338m7438K636L6059j5235o3655m429M5064L7652
$$ -49358 -12411 13295 41219 27881 -19557 -16921 19138 3903 -59752 -64181 -19117 18535
10338A8535K5699K7539k2788l4459j5771J0071O654l5127j7082J7621j353k0000
$$ 18535 44234 71773 48985 14526 -1245 8826 15480 -19647 -36729 -19108 -20461 -40461
10326d0461L5948k1967m6584k621j2563K3172L3204N2063J5987J6438J6874n6365
$$ -40461 -4513 -26480 -73064 -75685 -88248 -65076 -31872 20191 36178 52616 69490 13125
10314A3125j8242j753J8421K3834M5993L5513k031p6663m1122k8522k9117L9830
$$ 13125 -5117 -6870 11551 35385 81378 116891 114860 38197 -2925 -31447 -60564 -20734
10302b0734j0080l363K3701k3309l600j4338K5107J1198j2898l5858J9948M2239
$$ -20734 -30814 -34177 -10476 -33785 -37385 -51723 -26616 -15418 -28316 -64174 -44226 -1987
10290a987j514j0849K5349q148n4853Q0Q343j449k7954j4177J009N2882L4718
$$ -1987 -3501 -14350 10999 2851 -52002 -51922 -43579 -45028 -72982 -87159 -86150 -33268 1450
10277A450k8219J2758L791L2912K6039o8306m4610Q230M6673M3822j8295l1585
$$ 1450 -26769 -14011 -10220 22692 48731 -19575 -64185 -55955 -9282 34540 16245 -15340
10265a5340J5180J3979L2218k2023n3263k6055l7175J5888k4152K420K3643P2617
$$ -15340 -160 13819 46037 24014 -29249 -55304 -92479 -76591 -100743 -98323 -74680 -2063
10253b063J1365k4151P070l3565l1986K5520P301M1732J9118p994o891j2506Q508
$$ -2063 9302 -14849 -7779 -41344 -73330 -47810 -40509 1223 20341 12347 5456 -7050 1458
10240A458J0206K7069R54l3333n0660l1126J3950Q5270P9653K2228n4436l5767
$$ 1458 11664 38733 39687 6354 -44306 -75432 -61482 23788 103441 125669 71233 35466
10228C5466k7739l1970k3120M1894j0457k6278k3992J8477N1585K4348j9717j5209
$$ 35466 7727 -24243 -47363 -5469 -15926 -42204 -66196 -47719 3866 28214 8497 -6712
10216f712R570P0811k3266k5027m9940J795L4487o768m9976K929k394o551K4332
$$ -6712 2858 73669 50403 25376 -24564 -22769 11718 4950 -45026 -42097 -44491 -51042 -26710
10203b6710n577j9757K0346J9912j7060j5028J1782J0921j201r832O428L6560
$$ -26710 -32287 -52044 -31698 -11786 -28846 -43874 -32092 -21171 -22372 -32204 -25776 10784
10191A0784L4703l0527m0298N2K3679K2500J6293l1936J3848l87N3361m6843l1534
$$ 10784 45487 14960 -25338 -25286 -1607 20893 37186 5250 19098 18711 72072 25229 -6305
10178f305k2257J9271J2965k1883L5101k094k9907P625M1304j2110n3643J6767
$$ -6305 -28562 -9291 3674 -18209 16892 14798 -15109 -7484 33820 21710 -31933 -15166
10166a5166J5527l5901n441O4849p697k1175j6970n0487Q868J9373L0752q299
$$ -15166 361 -35540 -40981 23868 16171 -5004 -21974 -72461 -63593 -44220 -13468 -21767
10154b1767K1694j0794p924J7796q506N3415J1162k7478l6213j0747J31K3560
$$ -21767 -73 -10867 -18791 -995 -9501 43914 55076 27598 -8615 -19362 -19231 4329
10142D329k7886L9555K9891n7503l5578L144L1910N3122M6406p7682m1229J5432
$$ 4329 -23557 15998 45889 -11614 -47192 -44048 -12138 40984 87390 9708 -31521 -16089
10130a6089l7528j5393j4676l34R520P1414P2918L9659k6572m6254m0466l910
$$ -16089 -53617 -69010 -83686 -84020 -74500 -3086 69832 109491 82919 36665 -3801 -7711
10118g711K7619j3635n0009L1532P109M543M7418j5947j234K8815j729l3034q0859
$$ -7711 19908 6273 -43736 -12204 -5095 -552 46866 30919 29685 58500 56771 23737 -57122
10105e7122j8420M5130J0761J4498Q338k6475m0876j5587N2292L0356k5919N016
$$ -57122 -75542 -30412 -19651 -5153 3185 -23290 -64166 -79753 -27461 2895 -23024 -18008
10093a8008K5846L575r196m128o226k3085k7930M6392R748l4985o9060l3466k2977
$$ -18008 7838 11413 2217 -1911 -8137 -31222 -59152 -12760 -3012 -37997 -107057 -140523 -163500
10080a63500K2184K4337K1123M8114q111P254K5170q968l280L0141K7998l4262
$$ -163500 -141316 -116979 -95856 -47742 -55853 -48599 -23429 -32397 -35677 -5536 22462 -11800
10068a1800m6766l63M8936L9807J3460n7306n1446j5039n237j6644O5766M5605
$$ -11800 -58566 -58929 -9993 29814 43274 -14032 -65478 -80517 -85754 -102398 -36632 8973
10056H973L8624n140k4562j6419j6725L572J6993p820j3213l7538k4800R7441
$$ 8973 47597 42457 17895 1476 -15249 -11677 5316 -2504 -15717 -53255 -78055 19386
10044A9386O9552l3401r0768k52M7750N3626n850j4080l3515k4106k2186j2613
$$ 19386 88938 55537 -35231 -35483 12267 65893 60043 45963 12448 -11658 -33844 -46457
10032d6457L6296J4249L2010k9581k0423k5220j5736L5900M2912k6787l07J0896
$$ -46457 -10161 4088 36098 6517 -13906 -39126 -54862 -18962 23950 -2837 -3144 7752
10020G752k4268k758P703J5546J7274n347K1157l4875j1499k0220n2643J4734
$$ 7752 -16516 -19274 -11571 3975 21249 15902 37059 2184 -9315 -29535 -82178 -67444
10008f7444K5180L8437j4130m1365j7597L1160Q1255m9235n0719Q227K7400L3487
$$ -67444 -42264 -3827 -17957 -59322 -76919 -45759 35496 -13739 -64458 -56231 -28831 4656
9996D656J063l4302m3277J9725L6678l3475m0413J9970K4254J0048k1723J0632
$$ 4656 5719 -28583 -71860 -52135 -15457 -48932 -89345 -69375 -45121 -35073 -56796 -46164
9984d6164j263L9333L5136l0324m5028j2005L7279J1748q008O4115L7677l6813
$$ -46164 -47427 -8094 27042 -3282 -48310 -60315 -23036 -11288 -19296 44819 82496 45683
9972D5683k8370k2017m1605j7306j0765K603N2526N0042M1410q66k0336m4298
$$ 45683 17313 -4704 -46309 -63615 -74380 -71777 -19251 30791 72201 71335 50999 6701
9960F701l0136K9953m8950K5034K2163R067l9965L5229o189p1794K9716P9821
$$ 6701 -23435 6518 -42432 -17398 4765 13832 -26133 9096 2907 -68887 -39171 40650
9948D0650n778k8557n3397J0910M6242K7065l0641J225m2683j6878k1419J6676
$$ 40650 34872 6315 -47082 -36172 10070 37135 6494 7719 -34964 -51842 -73261 -56585
9936e6585J1741l7778K6307N4699Q26k9239k164J7213K2132j9026K0602K7913
$$ -56585 -44844 -82622 -56315 -1616 -790 -30029 -32193 -14980 7152 -11874 8728 36641
9924C6641L1509n94m3209m9450J2390M6616K9141O626J760J1168j8229J353k9695
$$ 36641 68150 67556 24347 -25103 -12713 33903 63044 69670 71430 82598 64369 65722 36027
9911C6027J7050L975O832o888l634r824l7206m7843M109J7454P0214M0293K7993
$$ 36027 53077 57052 63884 56996 53362 43538 6332 -41511 -37402 -19948 50266 90559 118552
9898A18552J9490J0561j6394k5180k0023k8461K8476M585j3663L481k4678L1346
$$ 118552 138042 148603 132209 107029 87006 58545 87021 91606 77943 81424 56746 88092
9886H8092L20L7569j7619j7941k8480m1536n943L1949J5990o5063k5153O4906
$$ 88092 88412 125981 108362 90421 61941 20405 14462 46411 62401 -2662 -27815 37091
9874C7091J0563m2915n2132M3773L1293j0171L0634M7469j6667l6389n507p449
$$ 37091 47654 4739 -47393 -3620 27673 17502 48136 95605 78938 42549 37042 29593
9862B9593J0855M6220q499K1257q0670n9671j5871M877J6448K4079M5027K37k0163
$$ 29593 40448 86668 78169 99426 18756 -40915 -56786 -51909 -35461 -11382 33645 33882 13719
9849A3719J0900j2293l4581k9323l5942L7562J00362J9860p5703J0575M8057j4759
$$ 13719 24619 12326 -22255 -51578 -87520 -49958 50404 70264 -5439 5136 53193 38434
9837C8434m0921J910l9288L4473K4865L915J1604L12l194n709k3407J7898p692
$$ 38434 -2487 -577 -39865 -5392 19473 23388 34992 35304 32110 26401 2994 20892 13200
9824A3200k5062q044K1342J6999O7621M6623n666l7396n7368j1014p242l0382
$$ 13200 -11862 -19906 1436 18435 86056 132679 127013 89617 32249 21235 13993 -16389
9812a6389k8024J1443N0787R570j7657m8404r596K718n0403m0116M848L2981L3708
$$ -16389 -44413 -32970 17817 27387 9730 -38674 -48270 -45552 -95955 -136071 -131223 -98242 -64534
9799f4534O6896K3932J9986k6285j1473k6356l2941N746j7207l27J0799l3433
$$ -64534 2362 26294 46280 19995 8522 -17834 -50775 -45029 -62236 -62563 -51764 -85197
9787h5197P4183O4412l7657l4678j4465n068K013K4872m3487L2601Q6481o01O382
$$ -85197 -11014 53398 15741 -18937 -33402 -38470 -36457 -11585 -55072 -22471 64010 63409 69791
9774F9791j7439l1132m5169l3647O7323k2817l6982O6596m507m8205q081j4614
$$ 69791 52352 21220 -23949 -57596 9727 -13090 -50072 16524 12017 -36188 -44269 -58883
9762e8883l898J1857K1272L7988N053l1340O810J0559o31J1603L5806J3587J2912
$$ -58883 -62781 -50924 -29652 8336 13389 -17951 -11141 -582 -1213 10390 46196 59783 72695
9749G2695O94m6701k4974N3891p350k0344o1126j4504P820OO6675N2833K6147
$$ 72695 73389 26688 1714 55605 48255 27911 -33215 -47719 -39899 -39893 26782 79615 105762
9736A05762J5492l1360l2164J6547k1547m1943m1293j0124N1769K3497l169k3847
$$ 105762 121254 89894 57730 74277 52730 10787 -30506 -40630 11139 34636 31467 7620
9724G620L0014q115l1407J2454l7374o2215L5459N3796L2585m6105m6684J7466
$$ 7620 37634 29519 -1888 10566 -26808 -89023 -53564 232 32817 -13288 -59972 -42506
9712d2506K4736M2285r679j5738l493J1587m2820O044R943l720K7627J9585l1790
$$ -42506 -17770 24515 14836 -902 -4395 7192 -35628 -29584 -19641 -23361 4266 23851 -7939
9699g939P9Q443q17n3967K3134K5634L726M4061J0838o9318l3791K2543q21L0795
$$ -7939 -7860 583 -234 -54201 -31067 -5433 -1707 42354 53192 -16126 -49917 -27374 -28195 2600
9685B600J0541Q572N5796j1797l5632j2922k3252l1866m5176N5140M0430J4270
$$ 2600 13141 21713 77509 65712 30080 17158 -6094 -37960 -83136 -27996 12434 26704
9673B6704L2025L669K7945K353l1764m9112j3703k7631m8751j9947k928J9274
$$ 26704 58729 62398 90343 92696 60932 11820 -1883 -29514 -78265 -98212 -101140 -81866
9661h1866K5612J9459N374j5288K7417L20l1842q905K8388K5204K0426J5796J3386
$$ -81866 -56254 -36795 -31421 -46709 -19292 -18972 -50814 -59719 -31331 -6127 14299 30095 43481
9648D3481n411k8612j5793j4075j061O691K9899K9033O837j5120J5343k9811k8073
$$ 43481 38070 9458 -6335 -20410 -21471 -14780 15119 44152 50989 35869 51212 21401 -6672
9635f672Q3131K4385o0771m6189L8347j7984J9361j5904k0787M839l5067j4j9573
$$ -6672 76459 100844 40073 -6116 32231 14247 33608 17704 -3083 1756 -33311 -33325 -52898
9622e2898k8360r192K4338J2030N0640O8921p215m8743J9092J7845N7304m2321
$$ -52898 -81258 -90450 -66112 -54082 -3442 65479 58264 9521 28613 46458 103762 61441
9610F1441k6316o5627k3863N597J7733K957l0378J0004k6769R658R408L0070J5086
$$ 61441 35125 -30502 -54365 -48768 -31035 -28078 -58456 -48452 -75221 -65563 -56155 -26085 -10999
9597a0999k1560O41J8335J5549J2638m8426l5467k3030J6433M0267J2889M063
$$ -10999 -32559 -31918 -13583 1966 14604 -33822 -69289 -92319 -75886 -35619 -22730 -18667
9585a8667O923J2695p612M0567K2732J8387k1712p4221q093N2019J654l330R79
$$ -18667 -11744 951 -6661 33906 56638 75025 53313 -20908 -29001 23018 24672 21342 22321
9572B2321l092j0862J3005m690L5369K6137m9878k7396M237m879K5257k3764m4371
$$ 22321 19229 8367 21372 16682 52051 78188 28310 914 5151 272 25529 1765 -42606
9559d2606j2864j994M0602L7031j9541r724K6285n2498j4059K3525R203l3404
$$ -42606 -55470 -57464 -16862 20169 628 -9096 17189 -35309 -49368 -25843 -16640 -50044
9547e0044k8675M7510J9351K6397M512K5240M4291k2009l6576J883m5975J6554
$$ -50044 -78719 -31209 -11858 14539 19051 44291 88582 66573 29997 31880 -14095 2459
9535B459k9494n2131P509M1535M169n5663K7232P2742j6302J1025K3053k2308
$$ 2459 -27035 -79166 -71657 -30122 -25953 -81616 -54384 18358 2056 13081 36134 13826
9523A3826r959k8160Q948N1384J1627m0935j7344J392J386l4256l4155Q897L1285
$$ 13826 3867 -24293 -15345 36039 47666 6731 -10613 -9221 -7835 -42091 -76246 -67349 -36064
9510c6064k4756k5254L1688K9723j83j1191j1481l0827N468P905j7893J6825l6763
$$ -36064 -60820 -86074 -54386 -24663 -24846 -36037 -47518 -78345 -72877 -64972 -82865 -66040 -102803
9497a02803J9063Q0823J5575k3417J6817m1419j7517K9500L6040j8665L0097l357
$$ -102803 -83740 -2917 12658 -10759 6058 -35361 -52878 -23378 12662 -6003 24094 20737
9485B0737J6910J1340J4431j4909J6384P104l5146l8548L6992K6286K8008j3406
$$ 20737 37647 48987 63418 48509 64893 71997 36851 -1697 35295 61581 89589 76183
9473G6183o1071n3757l2441p898K2190L5660N1296K3729j2134Q615J739k8988
$$ 76183 15112 -38645 -71086 -78984 -56794 -21134 30162 53891 41757 50372 52111 23123
9461B3123j0118J2760L3387J4853l0595j9392J076J1888l8711m8179k8253p403
$$ 23123 13005 25765 59152 74005 43410 24018 25094 36982 -1729 -49908 -78161 -85564
9449h5564K2790O188j2095O1328J1071k9590J3699M2984j9787n1061J868K265
$$ -85564 -62774 -56586 -68681 -7353 3718 -25872 -12173 30811 11024 -40037 -38169 -35904
9437c5904L9880N5152q448Q879K9907k6508j3661q965l1291p4537n5485r891L4866
$$ -35904 3976 59128 50680 59559 89466 62958 49297 40332 9041 -65496 -120981 -130872 -96006
9424i6006M6806N4136p003o474p787r220J6608J3375p8809m1871Q581N1104K9250
$$ -96006 -49200 4936 -2067 -8541 -16328 -25548 -8940 4435 -74374 -116245 -107664 -56560 -27310
9411b7310K1391j4706M541N761M5575J0822k6146L6069K2895m9249M0704k9932
$$ -27310 -5919 -20625 -16084 -10323 35252 46074 19928 55997 78892 29643 70347 40415
9399D0415k3460l0799j4952k240M0542M8044K4381J4208N970L5456p796Q872q131
$$ 40415 16955 -13844 -28796 -31036 9506 57550 81931 96139 102109 137565 129769 138641 130510
9386A30510M3359N2131M6845K1196O4297L1467N5201R6845J16452R8816J05020
$$ 130510 173869 226000 272845 294041 358338 389805 445006 541851 658303 757119 862139
9375H62139Q6960J11413K3899K5576n3931q2573r9237r4320p1158j21962p2103
$$ 862139 949099 1060512 1084411 1109987 1056056 973483 874246 779926 708768 586806 514703
9364E14703n4052m9752r738p2346r7192j6884k0974j6936j5608k0920j4668j5789
$$ 514703 460651 410899 401161 328815 231623 214739 193765 176829 161221 140301 125633 109844
9352A09844O455l2851n2694k3001M6856Q7959m93k9989m5479m8604n687J5854
$$ 109844 116299 83448 30754 7753 54609 142568 142075 112086 66607 18003 12316 28170
9340B8170R592j6334R789L4406q764K9386j4897m9837K5398O0066r918j2673m927
$$ 28170 37762 21428 31217 65623 56859 86245 71348 21511 46909 106975 97057 84384 79457
9327G9457k5048n6502P570O3403j2083M645l0734l0488p241O4037K5625j3883
$$ 79457 54409 -2093 5477 68880 56797 61442 30708 220 -7021 57016 82641 68758
9315F8758l3581O2479J0899Q154n8990J6076Q6495o1357m4150j9797J7119K9343
$$ 68758 35177 97656 108555 116709 57719 73795 160290 98933 54783 34986 52105 81448
9303H1448K4600j6786l6559J151p333Q586N8875N8428m5863J927m5591j6319o379
$$ 81448 106048 89262 52703 53854 46521 55107 113982 172410 126547 128474 82883 66564 60185
9290F0185M889j4948l1372K2588l5757K4094O3160j9194k7383l465l9878Q440
$$ 60185 65074 50126 18754 41342 5585 29679 92839 73645 46262 42797 2919 11359
9278A1359J5493Q938m0265K6322N767n983L0994n3490j2067K1677j6351q694N036
$$ 11359 26852 35790 -4475 21847 27614 21631 52625 -865 -12932 8745 -7606 -16300 -11264
9265a1264k3526L0885l3905P369J4399N203j7809Q106p474L1696L8542Q107l6397
$$ -11264 -34790 -3905 -37810 -30441 -16042 -10839 -28648 -20542 -28016 3680 42222 50329 13932
9252A3932m6681k0552N393K4799M9031P5934K0155p565q972p287p0938k5333N588
$$ 13932 -32749 -53301 -47908 -23109 25922 101856 122011 114446 105474 98187 27249 1916 7504
9239G504J6771m655J0117N4798l3438j8995K1100M25J9174K2310N2174K3909K5453
$$ 7504 24275 19620 29737 84535 51097 32102 53202 53627 72801 95111 147285 171194 196647
9226A96647N700k8860n6086M5458m8869l8128j3091k3276p4J358k1836l0215J762
$$ 196647 202347 173487 117401 162859 113990 75862 62771 39495 39421 40779 18943 -11272 -9510
9213i510j132J0457l830j3115J4774R9222M3543O677M29p1531l3854l7456m0743
$$ -9510 -10642 -185 -4015 -17130 -2356 96866 140409 147086 147515 75984 42130 4674 -36069
9200c6069J6122L8403J0047j0241M37l3595o907K3316K4759J0690l0138k540n211
$$ -36069 -19947 18456 28503 18262 18699 -14896 -21803 1513 26272 36962 6824 4284 -927
9187i27k6985O4173O0968K9688K5239m7382m9344J4241N705L4605k3689O480L2808
$$ -927 -27912 36261 97229 126917 152156 104774 55430 69671 75376 109981 86292 92772 125580
9174A25580M2293n2527k8259K2718k4067k6395q119j1551m8545K5577M5505K9344
$$ 125580 167873 115346 87087 109805 85738 59343 51224 39673 -8872 16705 62210 91554
9162I1554k6667j00136m717N2393L6040L8677l9923k4742N226J7169K1095P58
$$ 91554 64887 -35249 -39966 12427 48467 87144 47221 22479 27705 44874 65969 66727
9150F6727o5149p335J7280K8643M1015O976J3651L7211K5905n569l0818k4321
$$ 66727 1578 -5757 11523 40166 81181 88157 101808 139019 164924 159355 128537 104216
9138A04216O940O99J4011J7417P953M2529J6017k375j0253K2842j3440k0525M039
$$ 104216 111156 111855 125866 143283 151236 193765 209782 207407 197154 219996 206556 186031 190070
9125A90070j6444j5100K6971L1804k5273k3245K4555K29l8707k3297M0523K547
$$ 190070 173626 158526 185497 217301 192028 168783 193338 193567 154860 131563 172086 174633
9113A74633n845J9281l7460j6088M439P0217K9070l7480N3877M7158j761R09M5032
$$ 174633 168788 188069 150609 134521 138960 209177 238247 200767 254644 301802 300041 300950 345982
9100C45982P1303J04586R0010P5948L5778M0047J36511K12837L25420L85860N03361
$$ 345982 417285 521871 611881 687829 723607 763654 900165 1113002 1438422 1824282 2327643
9089B327643O32697P19394J139247K327810N300793J0334687O269905l638797
$$ 2327643 2960340 3679734 4818981 7146791 12447584 22782271 29052176 25413379
9081B5413379p187375o985295m020879k146859j329017q29976n83145l82357k53593
$$ 25413379 18226004 11240709 7219830 5072971 3743954 2913978 2330833 1948476 1694883
9072A694883k12406j44729j33502j45670j41742q3437l8954n0302n3759p2622
$$ 1694883 1482477 1337748 1204246 1058576 916834 833397 794443 744141 690382 617760
9062F17760l6310M062K309k8531o6694p7092j6546J6058m0121Q253P3361P6981
$$ 617760 581450 585512 587821 559290 492596 415504 398958 415016 374895 383148 456509 533490
9050E33490K2824K8526l8568l6339n6658n3930o623J3830O8754O3666p561l7575
$$ 533490 556314 584840 546272 509933 453275 399345 392722 406552 475306 538972 531411 493836
9038D93836K2654M2022K9334N4294P8550j4023N274O296k9442J6553M8804O6885
$$ 493836 516490 558512 587846 642140 720690 706667 711941 718237 688795 705348 754152 821037
9026H21037N2869J7105L3423K3648N4716p637P3710L2481L2608P1503L4250R8100
$$ 821037 873906 891011 924434 948082 1002798 995161 1068871 1101352 1133960 1205463 1239713 1337813
9014A337813P7536R0898Q5376P7773R9525O5376R3243J47337J92163J66284K07310
$$ 1337813 1415349 1506247 1591623 1669396 1768921 1834297 1927540 2074877 2267040 2433324 2640634
9003B640634K87831L52868L44753L60481L60195M52795N71242O18591O77479P95987
$$ 2640634 2928465 3281333 3626086 3986567 4346762 4799557 5370799 5989390 6666869 7462856
8993G462856J001400J404386J623047J845919K259526K806358L281907L719676
$$ 7462856 8464256 9868642 11491689 13337608 15597134 18403492 21685399 25405075
8985B5405075M414176N709125P741287J0484631J3847795J8457446K6748690M1530103
$$ 25405075 29819251 35528376 43269663 53754294 67602089 86059535 112808225 154338328
8977A54338328O2839427P6862346N2106717n713309n0993844o6643892n7919233
$$ 154338328 217177755 294040101 346146818 340433509 289439665 222795773 164876540
8970A64876540m1930874k8914590k0006195j4124805j0141189p406070n566681
$$ 164876540 122945666 94031076 74024881 59900076 49758887 42352817 36786136
8963C6786136m276884l415460l041377k941814k834448k517885k158855j899814
$$ 36786136 32509252 29093792 26052415 23110601 20276153 17758268 15599413 13699599
8955A3699599j624101j391554j197986r40940q00624p21778n30275m45658m52486
$$ 13699599 12075498 10683944 9485958 8545018 7744394 7022616 6492341 6046683 5594197
8946E594197l80296l39930k47158k56603k58626k37602k57050j98968k13724j77908
$$ 5594197 5213901 4873971 4626813 4370210 4111584 3873982 3616932 3417964 3204240 3026332
8936C026332j68366j48611j86964j59103o6338n7189q2479j59385p0111l0086
$$ 3026332 2857966 2709355 2522391 2363288 2296950 2239761 2157282 1997897 1927786 1897700
8926A897700j29997q2930m5153k0524n3190n8742p2007P032o6000p5547j6227
$$ 1897700 1767703 1684773 1639620 1619096 1565906 1507164 1435157 1442189 1376189 1300642 1284415
8915A284415K5414k6917r4095q7958n5562N7703L1353p0499p0022k8766n2186
$$ 1284415 1309829 1282912 1188817 1100859 1045297 1103000 1134353 1063854 993832 965066 912880
8904I12880m7986J5128M8054K124k6433j2553J1803l0560J1026k7488l1033k1982
$$ 912880 864894 880022 928076 930200 903767 891214 903017 872457 883483 855995 824962 802980
8892H02980R054n6452k8599K4402l4500j06923j3693K6879L1937O8m9352m5409
$$ 802980 812034 755582 726983 751385 716885 609962 596269 623148 655085 655153 605801 560392
8880E60392m5892p302P2124L7509m012L800J9296j7529j7351m1933j1341j4766
$$ 560392 514500 507198 579322 616831 612819 616619 635915 618386 601035 559102 547761 532995
8868E32995l9509j8136J6976K6239J0473K6399J2338k4879j4149k8901m5455l3373
$$ 532995 493486 475350 492326 518565 529038 555437 567775 542896 528747 499846 454391 421018
8856D21018j2507L2028l1124j8825k2950J4735L2815M1954K6474j9450J5463J0723
$$ 421018 408511 440539 409415 390590 367640 382375 415190 457144 483618 464168 479631 490354
8844D90354l9972l3133l1512p535K8516j08539l415N3797J1103j7679K2676M6061
$$ 490354 450382 417249 385737 378202 406718 298179 294764 348561 359664 341985 364661 410722
8832D10722j1679n9016l8895O167l4820m6222N9698L5859n3443o7263N6768K9234
$$ 410722 399043 340027 301132 307299 272479 226257 285955 321814 268371 201108 257876 287110
8820B87110P23M69n008R594L1291j9859l5725l6159m3553J2692L8565N4697j0243
$$ 287110 287833 288302 283294 292888 324179 304320 268595 232436 188883 201575 240140 294837 284594
8807B84594O445p1251k4864L2568L6089M4426K0634N5396q417m2840l8341M2l1227
$$ 284594 291039 219788 194924 227492 263581 308007 328641 384037 375620 332780 294439 294481 263254
8794B63254k6481l5125l8887N1702N2646M770J1863p317J1115J5609j6069k0259
$$ 263254 236773 201648 162761 214463 267109 271879 283742 276425 287540 303149 287080 266821
8782B66821l2418k3757J2819O345M527N4119k972k6096l9426j160k0791k5356
$$ 266821 234403 210646 223465 229810 234337 288456 285484 259388 219962 218802 198011 172655
8770A72655j5402L8671M3623r589l6916j3098k0294J1370l1146m6128J6246k446
$$ 172655 157253 195924 239547 229958 193042 179944 159650 171020 139874 93746 109992 107546
8758A07546m5060L3551P2227j2814K285j278P0713m796k1226L0665K056o2807
$$ 107546 62486 96037 168264 155450 157735 156457 227170 222374 201148 231813 233869 171062
8746A71062r414Q671k0644p7266l3192K2037J4678q821N8465N3363M6734M804
$$ 171062 161648 170319 149675 72409 39217 61254 75932 67111 125576 178939 225673 230477
8734B30477j7114j749M519n6259n3638k0886R272N6511P1413k0137k2521j2255
$$ 230477 213363 211614 216133 159874 106236 85350 94622 151133 222546 202409 179888 167633
8722A67633J2749P7242L2569k3737l9337m4739k1615k147m3100P959M7483o828
$$ 167633 180382 257624 290193 266456 227119 182380 160765 158618 115518 123477 170960 164132
8710A64132K1980m299j3769n8147l5601R722M5389l1232j0148L8481j714p424
$$ 164132 186112 181813 168044 109897 74296 84018 129407 98175 88027 126508 124794 117370
8698A17370k153m7716l3113L3358N4179J9550n609O287k9002l3940N444M8339
$$ 117370 115217 67501 34388 67746 121925 141475 135866 142153 113151 79211 84655 132994
8686A32994K5286l3694l9181L420j7659K6270J4568k2421K7405L1675N5043K2893
$$ 132994 158280 124586 85405 88825 71166 97436 112004 89583 116988 148663 203706 226599
8674B26599m7454q3024n0347p512L3619M7140J0025J2113J6995m7524R47N7876
$$ 226599 179145 96121 45774 38262 71881 119021 129046 141159 158154 110630 111577 169453
8662A69453j4332m6348J5067K0856M2481m3241l8919K3950n0475K104L2917N6962
$$ 169453 155121 108773 123840 144696 187177 143936 105017 128967 78492 80596 113513 170475
8650A70475K4425k4842l3110K078k5111m8826O11M2045L1989L8560L3670L888
$$ 170475 194900 170058 136948 139026 113915 65089 65700 107745 139734 178294 211964 215852
8638B15852k1051M323m5163n4830k9174k069N160J5073q245J363O252L055l949
$$ 215852 194801 199124 153961 99131 69957 67888 73048 88121 79876 81239 87491 90546 86597
8625H6597j3325J3429j0156j1613N952l521k0976L0457K8324j6900l3652J1685
$$ 86597 73272 86701 76545 64932 70884 67363 46387 76844 105168 88268 54616 66301
8613F6301N0589j3341J3945L8809m0616l1597N0108k856M75j4697L53Q850R546
$$ 66301 116890 103549 117494 156303 115687 84090 134198 131342 131817 117120 117473 126323 135869
8600A35869K0107K4597j7379J4585j0944k0403l0108l939J9425J3312L0592P2373
$$ 135869 155976 180573 163194 177779 166835 146432 116324 112385 131810 145122 175714 248087
8588B48087J1180o8063L2665k0656o8002K2061O7121Q9491L5718J02437J12891
$$ 248087 259267 191204 223869 203213 135211 157272 224393 313884 349602 452039 564930
8577E64930J15058P5208R5565J02440R9533Q5729O6376K9478K1971q7450j23863
$$ 564930 679988 755196 850761 953201 1052734 1138463 1204839 1234317 1256288 1168838 1044975
8566A044975j53527j36336r9794n6704n4321j31195k7579k5173k1433p0833p2166
$$ 1044975 891448 755112 655318 598614 544293 413098 385519 360346 338913 268080 195914
8555A95914Q976k6068j8119J5883n1062m0870J7268J7206J4050L0996j264j5713
$$ 195914 204890 178822 160703 176586 125524 84654 101922 119128 133178 164174 162910 147197
8543A47197p984k3682l5817j8738L6048l02j1040N163Q917N952L4169J8724P54
$$ 147197 139213 115531 79714 60976 97024 96722 85682 90845 99762 105714 139883 158607 159361
8530A59361k0959j02959l8499K6136L7545p377K2203K7821l0042j4861J8569m2866
$$ 159361 138402 35443 -3056 23080 60625 53248 75451 103272 73230 58369 76938 34072
8518C4072K2117J0736j6877j87j5149N876K0397L2603M786j8741K5159p34p625
$$ 34072 56189 66925 50048 49861 34712 40588 60985 93588 98374 79633 104792 104058 96433
8505I6433L518j9695l7712J2472O416o386j5038L1534L204m4906n3772k6233L5716
$$ 96433 99951 80256 42544 55016 61432 55046 40008 71542 74746 29840 -23932 -50165 -14449
8492a4449R763O3841R703k5999n008r898j1232L2820N0675r601R006k3101Q1m0234
$$ -14449 -4686 59155 68858 42859 37851 27953 16721 49541 100216 90615 99621 76520 76601 36367
8478C6367j5253j0279J1599J0384k4668L0734R583l7321j8883N7618P788R617
$$ 36367 21114 10835 22434 32818 8150 38884 48467 11146 -7737 49881 57669 67286
8466F7286J3050N3011k2509q9413m750j7481L6N1402J0427o019N3942k0331p0692
$$ 67286 80336 133347 110838 21425 16675 -806 -770 50632 61059 55040 108982 88651 17959
8453A7959r875P714K5416l3518l5413N145K1424O5368R260o1926J4221p799o283
$$ 17959 8084 15798 41214 7696 -27717 -22572 -1148 64220 73480 11554 25775 17976 11693
8440A1693j3286Q087m6631N7257L4171J3095m1660p4L6219j5874J222J6880J3210
$$ 11693 -1593 6494 -40137 17120 51291 64386 22726 22652 58871 42997 44219 61099 74309
8427G4309R1197K8383m4901m4027n0537k5165R017L2925k8293k3630P135j6243
$$ 74309 165506 193889 148988 104961 54424 29259 38276 71201 42908 19278 26413 10170
8415A0170J6154M0787K6361J0602K1281n656k8777L6990K9438l2170J420R883
$$ 10170 26324 67111 93472 104074 125355 119699 90922 127912 157350 125180 126600 136483
8403A36483j2006l6444n7340N8437J9496k8434m1784k5824K0728L1286L0874l9448
$$ 136483 124477 88033 30693 89130 108626 80192 38408 12584 33312 64598 95472 56024
8391E6024j7856P299k1119k2034P745J0749l4370l8372N5845Q404j0143L3361
$$ 56024 38168 45467 24348 2314 10059 20808 -13562 -51934 3911 12315 2172 35533
8379C5533j9578k1606L8017L008n1728J902M5150L7694j8091J8577m045k0858
$$ 35533 15955 -5651 32366 35374 -16354 -14452 30698 68392 50301 68878 64833 43975
8367D3975J5263M1908o7368j0508j5553L4598K5195k9356l7206o232J1746N8403
$$ 43975 59238 101146 33778 23270 7717 42315 67510 38154 948 -5284 6462 64865
8355F4865k3517J6226P473k2614k2614L8705Q262j1752J0370J7676Q757m9266
$$ 64865 41348 57574 65047 42433 19819 58524 66786 55034 65404 83080 91837 42571
8343D2571p6010o1606p376N6375M4191O1177J8Q061N1252j6182r318K428k5249
$$ 42571 -33439 -95045 -102421 -46046 -1855 59322 59340 67401 118653 102471 93153 95581 70332
8330G0332J013l0378n2439L5288J8540K0992K1249n8833n2309L7095O0J1785k6692
$$ 70332 71345 40967 -11472 23816 42356 63348 84597 25764 -26545 10550 10610 22395 -4297
8317d297K013K0936J3903K3041L9589J4846q994o6613N0j0855M0931M0200K2855
$$ -4297 -2284 18652 32555 55596 95185 110031 101037 34424 34474 23619 64550 104750 127605
8304A27605q379m2639L522J8293k8227K8666L0600m8940m0413L173J8339N030
$$ 127605 119226 76587 80109 98402 70175 98841 129441 80501 40088 43261 61600 66630
8292F6630j4485k9473R322M9348k186m5849l9509M1596k2163k6081J3864J9321
$$ 66630 52145 22672 31994 81342 79156 33307 -6202 35394 13231 -12850 1014 20335
8280B0335J6633M024M012n2400K7570k2024j1687k5997K9240N985K75k3770j2804
$$ 20335 36968 40992 45004 -7396 20174 -1850 -13537 -39534 -10294 -4309 -4034 -27804 -40608
8267d0608M1107J9795M147k8569r386N862j9867K9002L3110K3589J8911l6037
$$ -40608 499 20294 24441 -4128 -13514 -7652 -27519 1483 34593 58182 77093 41056
8255D1056j3463P907J1452j2008R863l5881o0852l331N0874J1533M608K7274J659
$$ 41056 27593 35500 46952 34944 44807 8926 -51926 -55257 -4383 7150 11758 39032 40691
8242D0691k8876M1618k0381k1125M033p864R830l7378P926l8852L5339O6718M3699
$$ 40691 11815 53433 33052 11927 15960 8096 17926 -19452 -11526 -50378 -15039 51679 95378
8229I5378j9471k7474j4955Q744P053m4980j6725K8577J9889k7566j4315N6388
$$ 95378 75907 48433 33478 42222 49275 4295 -12430 16147 36036 8470 -5845 50543
8217E0543K7335k4039P79k1343m8058M2035J2062j8523k6469M0018K2090k7921
$$ 50543 77878 53839 54618 33275 -14783 27252 39314 20791 -5678 34340 56430 28509
8205B8509k0437o0622l4978L0623K5767q013L9229j9523m4506q580L785P2156
$$ 28509 8072 -52550 -87528 -56905 -31138 -39151 78 -19445 -63951 -72531 -68746 3410
8193C410O9877n349l5993j5329n0209J7979J2621j2892j7421J5426p628M5434
$$ 3410 73287 67938 31945 16616 -33593 -15614 -2993 -15885 -33306 -17880 -25508 19926
8181A9926O0926k2954j6255N031M940k5562q563K2616Q957K59j8769l1117J1378
$$ 19926 80852 57898 41643 46674 51614 26052 17489 40105 49062 49321 30552 -565 10813
8168A0813k6813M425J033L4426K6432L6303l8195j5158R599j5063n726j7482l9353
$$ 10813 -16000 -11575 -10542 23884 50316 86619 48424 33266 42865 27802 22076 4594 -34759
8155c4759l2700P1729q562j7144n852P2L8589Q655O2577J1003m1761Q093k6401
$$ -34759 -67459 4270 -4292 -21436 -27288 -27216 11373 20028 82605 93608 51847 59940 33539
8142C3539m7489K2873O060o063j7965P113L0980J7362k3698k389M0129L4070j2140
$$ 33539 -13950 8923 14983 8920 -9045 -1932 29048 46410 22712 20323 60452 94522 82382
8129H2382P639k9150r41N9041k8079p6518n9052j1452J1381J2120J6152l2670
$$ 82382 90021 60871 59930 118971 90892 14374 -44678 -56130 -44749 -32629 -16477 -49147
8117d9147q037l6986L3275O1855L4994M3130N0852j5368p6674j8103L302o108
$$ -49147 -57184 -94170 -60895 960 35954 79084 129936 114568 37894 19791 23093 16985
8105A6985j8383j2219J186N3637J160K315N729J3300l0198k0674M258J9014m1164
$$ 16985 -1398 -13617 -12431 41206 42366 44681 50410 63710 33512 12838 17096 36110 -5054
8092e054k2988j8025l3363k4967M8596R674P5899J1307m3047j5366k827K4841
$$ -5054 -28042 -46067 -79430 -104397 -55801 -46127 29772 41079 -1968 -17334 -20161 4680
8080D680j8592j2200m138N786j439L8418R639o3911J8719K5742m7489N0750k759
$$ 4680 -13912 -26112 -30250 -24464 -25903 12515 22154 -41757 -23038 2704 -44785 5965 3206
8067C206l3639N8169L0324j7968l4373l9701j5952J3515j7875K1973M2572L1947
$$ 3206 -30433 27736 58060 40092 5719 -33982 -49934 -36419 -54294 -32321 10251 42198
8055D2198N1396M4856L352l212m8246p806j9360k2763j1786k2313r371Q996R184
$$ 42198 93594 138450 141802 138590 90344 82538 63178 40415 28629 6316 -3055 5941 15125
8042A5125n2325L566M4090k4352N7502l115l4803J5076N2148j5751n20j4660L7606
$$ 15125 -37200 -33634 10456 -13896 43606 40491 5688 20764 72912 57161 56641 41981 79587
8029G9587N264n2845J9434N8369j5193k6342k176L329J9131n5156l9856k1001
$$ 79587 84851 32006 51440 109809 94616 68274 66098 69427 88558 33402 -6454 -27455
8017b7455J1183M1754l7513j2415J8005L123M2127P4699n181m6491j6212k8660
$$ -27455 -16272 25482 -12031 -24446 -6441 -3318 38809 113508 108327 61836 45624 16964
8005A6964P893L1370J0992L6587K9633j8797n1523J081O579j8088n6362J0694
$$ 16964 24857 56227 67219 103806 133439 114642 63119 64200 70779 52691 -3671 7023
7993G023M6147K7406M0225J2503n7404l2026P833J0444j5022p0429m9273J9470
$$ 7023 53170 80576 120801 133304 75900 43874 51707 62151 47129 -23300 -72573 -53103
7981e3103L4209l579L6164O7196K4770m8222n2762J082M6901K7767K322K2480
$$ -53103 -18894 -22473 13691 80887 105657 57435 4673 5755 52656 80423 82745 105225
7969A05225l0708k9734j0759K0963K7012k2371j8745k241r976m573J1207k5128
$$ 105225 74517 44783 34024 54987 81999 59628 40883 38642 28666 24093 35300 10172
7957A0172l6120q952J778M0975N0407L408K9986m7237o5048J1755M1137N8k9549
$$ 10172 -25948 -34900 -33122 7853 58260 61668 91654 44417 -20631 -8876 32261 32319 2770
7944B770j3476j9333J5192m288M1225J2157j2017j9584M8002p101j1722k7285
$$ 2770 -10706 -30039 -14847 -19135 22090 34247 22230 2646 50648 43547 31825 4540
7932D540K9929J6373R587l0607l3845J2607L1843m6498k0027K2349j9564m500
$$ 4540 34469 50842 60429 29822 -4023 8584 40427 -6071 -26098 -3749 -23313 -27813
7920b7813J6213J8914L3203J9947m268P8109j8019n9520m0201N020Q099o158p268
$$ -27813 -11600 7314 40517 60464 56196 134305 116286 56766 16565 21585 29684 23526 16258
7907A6258J7669l4047K4697L0551K3275K6390K925j696K6615j3597q0910o5976
$$ 16258 33927 -120 24577 55128 78403 104793 107718 106022 132637 119040 38130 -27846
7895b7846j526K4991M252k8107L781P6424J9145k1722j5910K1624j0324j4146
$$ -27846 -29372 -4381 -129 -28236 -24455 51969 71114 49392 33482 55106 44782 30636
7883C0636m0137q918j93l3900m8727L5310L9864j8084K7229N0111j8887j7924
$$ 30636 -9501 -18419 -18612 -52512 -101239 -65929 -26065 -44149 -16920 33191 14304 -3620
7871c620r965q451K5939j3867J1821L5146K4569J4761p4103m8006N787j3847j1339
$$ -3620 -13585 -22036 3903 -9964 1857 37003 61572 76333 2230 -45776 -39989 -53836 -65175
7858f5175M8120L889J2771J6849k2967k7663J7263J5577j697j384k6747K6071
$$ -65175 -17055 -13166 -395 16454 -6513 -34176 -16913 -1336 -3033 -4417 -31164 -5093
7846e093J1614O346j2669J4821k9565J4657L5526o086J7345K9015M107j3931k3643
$$ -5093 6521 12867 198 15019 -14546 111 35637 29551 46896 75911 80018 66087 42444
7833D2444o9642J5257M1986l3703o2196k579O9557q901J4943j6722J328J8642
$$ 42444 -27198 -11941 30045 -3658 -65854 -68433 1124 -7777 7166 -9556 -8228 10414
7821A0414k8173J3944J0200J5735m857j3976n7970o0730k980J7342N900L0093
$$ 10414 -17759 -3815 6385 22120 17263 3287 -54683 -115413 -118393 -101051 -95151 -65058
7809f5058p741J8511O2802M5146P357j1773r388L7302K206q8947m0334K1874R856
$$ -65058 -72799 -54288 8514 53660 61017 49244 39856 77158 79364 -9583 -49917 -28043 -18187
7796a8187k1031k2314R661O8882P1952k0720k2001j694m6584n0753j2901J2961
$$ -18187 -39218 -61532 -51871 17011 88963 68243 46242 44548 -2036 -52789 -65690 -52729
7784e2729K3881J7730J0487m865N168r50l6677N521q395n0076J1845O831J8900
$$ -52729 -28848 -11118 -631 -5496 -328 -1278 -37955 -32434 -40829 -90905 -79060 -72229 -53329
7771e3329M6022L1808j373q105l8439l6989P279N4568j1202M2278L4018Q662k0981
$$ -53329 -7307 24501 23128 15023 -23416 -60405 -53126 1442 -9760 32518 66536 75198 54217
7758E4217r920p677M886j1619J1920j1882l4741J2217N9764L8555m9536m366J4179
$$ 54217 44297 36620 41506 29887 41807 29925 -4816 7401 67165 105720 56184 51818 65997
7745F5997n2820J0404o018N3001K0896K7740j5616m3812k3771K0511K7389m2219
$$ 65997 13177 23581 17563 70564 91460 119200 103584 59772 36001 56512 83901 41682
7733D1682l5227J0852J9206q949j7336m093M9127L5718M0444Q304q212m3271m7247
$$ 41682 6455 17307 36513 27564 10228 6135 55262 90980 131424 139728 131516 88245 40998
7720D0998n4401k0959l7076j974N3324M3527j8720k6879l0204l8903o34N3293
$$ 40998 -13403 -34362 -71438 -73412 -20088 23439 4719 -22160 -52364 -91267 -91901 -38608
7708c8608p843N2470O0939l3653o6811k8606k2475j3008K8020L1387P550K1549
$$ -38608 -46451 6019 66958 33305 -33506 -62112 -84587 -97595 -69575 -38188 -30638 -9089
7696i089K7671N244j6623k6715l4845J8409M3124k28m094N3442m8558m0405O1308
$$ -9089 18582 23826 7203 -19512 -54357 -35948 7176 6948 2854 56296 7738 -32667 28641
7683B8641J5840m3397m558K7047L52m871l4483m6838J4139Q413L5273L7094K4562
$$ 28641 44481 1084 -3474 23573 23925 19054 -15429 -62267 -48128 -39715 -4442 32652 57214
7670E7214n052K6581k1732n9191K4045P8350K3829l2734m1766j2395p655K1803
$$ 57214 52162 78743 57011 -2180 21865 100215 124044 91310 49544 37149 29494 51297
7658E1297K1492m6621m063L3371m5592j6066N325J1898J2777l4158m2275J5258
$$ 51297 72789 26168 22105 55476 9884 -6182 -857 11041 23818 -10340 -52615 -37357
7646c7357J1197p416l9403l36j5340O6734r024l6494m5113P0510Q6674n831j09142
$$ -37357 -26160 -33576 -72979 -73315 -88655 -21921 -30945 -67439 -112552 -42042 44632 38801 -70341
7633g0341n9129k2172P2346J08471J361m566J4139j1794K4631L2603o1293l6622
$$ -70341 -129470 -151642 -79296 29175 30536 25970 40109 28315 52946 85549 24256 -12366
7621a2366j040M0277K2610l0544M355J3499M2323q703k934K4538m1895l4212j518
$$ -12366 -13406 26871 49481 18937 23292 36791 79114 70411 67477 92015 50120 15908 14390
7608A4390J3627k6568j2542q651j1745O109m111Q6113J6355l4517n836n593L2341
$$ 14390 28017 1449 -11093 -19744 -31489 -25380 -29491 56622 72977 38460 32624 27031 59372
7595E9372m805P245m2390l4351j295j5035m3596j6538n550N4696L0078L6149l2957
$$ 59372 54567 61812 19422 -14929 -16224 -31259 -74855 -91393 -96943 -42247 -12169 23980 -8977
7582h977l1613j9880j3015k5591M3633L6994M450J0405n866J3857L7k5188J955
$$ -8977 -40590 -60470 -73485 -99076 -55443 -18449 -13999 -3594 -9460 4397 4434 -20754 -18799
7569a8799j1535O289M4842K5092k0828q9458j6506K4251N1506K9110J1899K058
$$ -18799 -30334 -24045 20797 45889 25061 -64397 -80903 -56652 -5146 23964 35863 37921
7557C7921K1998k9579n4676j0844M9881J7565l6938M3002O8235k5490m4424L643
$$ 37921 59919 30340 -24336 -35180 14701 32266 -4672 38330 106565 81075 36651 40294
7545D0294k855L1057J215j9935m3327j8114J0132O7112j1354n2014O558j6778
$$ 40294 37439 68496 69711 49776 6449 -11665 -1533 65579 54225 2211 8769 -8009
7533h009M0055K307n9781j698N8338J1352m0985L3861l14l8249K2773N8790j6854
$$ -8009 32046 34353 -25428 -27126 31212 42564 1579 35440 35126 -3123 19650 78440 61586
7520F1586m8932J0860O9837o521o5929n498l4728l1691L2127k5564k3723l214
$$ 61586 12654 23514 93351 86830 20901 15403 -19325 -51016 -18889 -44453 -68176 -71390
7508g1390O1714k1236R333K0280k6691K2903M2817L10L773K9340m2439k6730J9344
$$ -71390 -9676 -30912 -21579 -1299 -27990 -5087 37730 38040 41813 71153 28714 1984 21328
7495B1328p116o358J7368n189j4176o1980K8087q529J8463N3946J9046k5653n6594
$$ 21328 14212 7854 25222 20033 5857 -56123 -28036 -36565 -18102 35844 54890 29237 -27357
7482b7357K4883Q600R509M3291J7749k2457o1656K3893j7509J6416j235l3719
$$ -27357 -2474 6126 15635 58926 76675 54218 -7438 16455 -1054 15362 14127 -19592
7470a9592J9018M4853m570n6463P788O8837J7169k0858j7093m1074k1521J0050
$$ -19592 -574 44279 39709 -16754 -8966 59871 77040 56182 39089 -1985 -23506 -13456
7458a3456J1174L220J3621K5454j6120M9097K24n6031j2027K2337j2616r049M0319
$$ -13456 -2282 938 14559 40013 23893 72990 73214 17183 5156 27493 14877 5828 46147
7445D6147K431p136J0551m0178j4908k6675k6659l1142j9389P1341J1168Q118
$$ 46147 48578 41442 51993 11815 -3093 -29768 -56427 -87569 -106958 -35617 -24449 -16331
7433a6331J4416p714j3015l109J9904R880M4244J0326l6932k6757K7758m465J1410
$$ -16331 -1915 -9629 -22644 -25753 -5849 4031 48275 58601 21669 -5088 22670 18205 29615
7420B9615J4937J0967K2901J5827l4095p2050n6337K4133M7389o883p147j0476
$$ 29615 44552 55519 78420 94247 60152 -11898 -68235 -44102 3287 -3596 -10743 -21219
7408b1219P263k5627k3961k0087J3563P0561L3607j2234k3480k4703j5982j630
$$ -21219 -13956 -39583 -63544 -83631 -70068 493 34100 21866 -1614 -26317 -42299 -43929
7396d3929k118l4346n0442J8289J19235N5988m4917L5307L0788J3336J4190l1184
$$ -43929 -46047 -80393 -130835 -112546 6689 62677 17760 53067 83855 97191 111381 80197
7384H0197o0077p3004m3920O2056N7241J4530j9353J9917J1607n115J3554m1962
$$ 80197 20120 -52884 -96804 -34748 22493 37023 17670 37587 49194 44079 57633 15671
7372A5671M6629M4147L311l0050n0877p63L7740P495k7543k1139j5009k849O761
$$ 15671 62300 106447 109758 79708 28831 28068 65808 73303 45760 24621 9612 6763 13524
7359A3524J9515m7872J2000J7981k3161j2042j4732L6730J2771o959l6499J5808
$$ 13524 33039 -14833 -2833 15148 -8013 -20055 -34787 1943 14714 7755 -28744 -12936
7347a2936K2187j6793k1101l9889j0061N9165L0772j9985l6648r262J4906K3591
$$ -12936 9251 -7542 -28643 -68532 -78593 -19428 11344 -8641 -45289 -54551 -39645 -16054
7335a6054L3235K2016l5790N073K090j667K8018K5810K4675j3277q092m0408j2841
$$ -16054 17181 39197 3407 8480 10570 8903 36921 62731 87406 74129 66037 25629 12788
7322A2788M5925l6307K497P48m0526J1982K5046N2808m353P158q349O684n393
$$ 12788 58713 22406 24903 25651 -14875 -2893 22153 74961 70608 77766 69417 76101 70708
7309G0708n8109l3019j7566j7088j3193j4884J6395N0059J7653J7403J7769n133
$$ 70708 12599 -20420 -37986 -55074 -68267 -83151 -66756 -16697 956 18359 36128 30995
7297C0995r504j4383O256O067j9851j0749n3754J8047M7845J7123j9262k6705
$$ 30995 21491 7108 13364 19431 -420 -11169 -64923 -46876 969 18092 -1170 -27875
7285b7875Q840l7808J5818M1419m5452j5926p782j2111L2189M9307l1325j3156
$$ -27875 -19035 -56843 -41025 394 -45058 -60984 -68766 -80877 -48688 619 -30706 -43862
7273d3862k3682L847q003J1103R0977j3711m7800j099J3897O045M0669j4648k9724
$$ -43862 -67544 -63697 -71700 -60597 30380 16669 -31131 -32230 -18333 -12288 28381 13733 -15991
7260a5991Q456l0241k8948j0609j5197j9416N8630K3682J655m0344n9331j9355
$$ -15991 -7535 -37776 -66724 -77333 -92530 -111946 -53316 -29634 -27979 -68323 -127654 -147009
7248a47009M6665K9729N5984N9711m400m4452K3951O0283j8113k5616k0598k8325
$$ -147009 -100344 -70615 -14631 45080 40680 -3772 20179 80462 62349 36733 16135 -12190
7236a2190k0832J63K6236K9205k3992O120l5271J1961O751P836j3861K3254j4262
$$ -12190 -33022 -32859 -6623 22582 -1410 4710 -30561 -18600 -11849 -4013 -17874 5380 -8882
7223h882m1111L2705j1159l2527k0559P0154O4036J0662L882k1282l9596L2516
$$ -8882 -49993 -17288 -28447 -60974 -81533 -11379 52657 63319 67201 45919 6323 38839
7211C8839L5851l5100n0426m056l3260p204m99M4478J8465J6067M1668j073J178
$$ 38839 74690 39590 -10836 -14892 -48152 -55356 -55855 -11377 7088 23155 64823 63750 64928
7198F4928j4228k3086l9066P720l7813J6435P895L1559r237j7776j752r379l9251
$$ 64928 50700 27614 -11452 -3732 -41545 -25110 -17215 14344 5107 -12669 -14421 -23800 -63051
7185f3051K1789k0666M741P745j4499j6015J5489N5429n136P811R387K1839K7831
$$ -63051 -41262 -61928 -57187 -49442 -63941 -79956 -64467 -9038 -14174 -6363 3024 24863 52694
7172E2694K4379N160l7304k2600j3499J6621J670m4454l6384k1200J0103l113
$$ 52694 77073 82233 44929 22329 8830 25451 27121 -17333 -53717 -74917 -64814 -67927
7160f7927j3141J9085P9649K5690q026o162n5571m2711j5928K2531K9196j973
$$ -67927 -81068 -61983 17666 43356 35330 29168 -26403 -69114 -85042 -62511 -33315 -35288
7148c5288N7709L1367K5022L1821q8343m5558M5025k0204j0793O3797J7028p2013
$$ -35288 22421 53788 78810 110631 22288 -23270 21755 1551 -9242 54555 71583 -430
7136d30o2654p275L986Q7256K8841M521j4734m7336j7756J5801K5352L4097L4426
$$ -430 -63084 -70359 -66373 20883 49724 54245 39511 -7825 -25581 -9780 15572 49669 84095
7123H4095K547O786k5590m7510J8631o3155l2695N5369k4601k7785l7967K302
$$ 84095 86642 93428 67838 20328 38959 -24196 -56891 -1522 -26123 -53908 -91875 -89573
7111h9573M5342O7437J6543K5663q72q621l1350L5650j0508j7928P986K2600L713
$$ -89573 -44231 23206 39749 65412 64540 55919 24569 60219 49711 31783 39769 62369 66082
7098F6082l4120n636k9239k5189j8634J7134M0610j3846K3840K2063N424j3688
$$ 66082 31962 26326 -2913 -28102 -46736 -29602 11008 -2838 21002 43065 48489 34801
7086C4801j8273J796k1449L2516O3169K5481n7422n2718l1537J0413j2895M1464
$$ 34801 16528 18324 -3125 29391 92560 118041 60619 7901 -23636 -13223 -26118 15346
7074A5346R868m6096N57p0733k046M4369l690J388K3435L7128l6451j2773M4617
$$ 15346 25214 -20882 -20325 -91058 -93104 -48735 -52425 -51037 -27602 9526 -26925 -39698 4919
7061D919Q0253L1064J1796j4846o1485l2752l9554l5811j821K2627J3166j8960
$$ 4919 85172 116236 128032 113186 51701 18949 -20605 -56416 -58237 -35610 -22444 -41404
7049d1404j4480j2140Q743J4341J7462R279m4136l9103K2772L5269m6232l4954
$$ -41404 -55884 -68024 -59281 -44940 -27478 -18199 -62335 -101438 -78666 -43397 -89629 -124583
7037a24583K5842L5469L5889J2090J5802P522k828r289J4027j4850L1416N8286
$$ -124583 -98741 -63272 -27383 -15293 509 8031 5203 -4086 9941 -4909 26507 84793
7025H4793K6894J4020l5676n3546m0955K770L1423m195K7438n2045p5202m5183
$$ 84793 111687 125707 90031 36485 -4470 -1700 29723 25528 52966 921 -74281 -119464
7013a19464M5521K3462j3410M0219M6609K1943j0691J2467n0348j4176q46L9807
$$ -119464 -73943 -50481 -63891 -23672 22937 44880 34189 46656 -3692 -17868 -18714 21093
7001B1093M1650l5210k1996n6727j7944M522N6824N0138M9755l9426k6047K1354
$$ 21093 62743 27533 5537 -51190 -69134 -64612 -7788 42350 92105 52679 26632 47986
6989D7986j6090j1447K4973j5207j6300P674K7707K380J1447j4192K4631o223
$$ 47986 31896 20449 45422 30215 13915 21589 49296 51676 63123 48931 73562 67339
6977F7339m830m2616J4786j1996k0520m761j3801q012k2614K2614J6500K268Q381
$$ 67339 62509 19893 34679 22683 2163 -2598 -16399 -24411 -47025 -24411 -7911 -5643 2738
6964B738J2073L2174p440n127J6617J3782m0707q0701j9635J2220j8706J461K0602
$$ 2738 14811 46985 39545 34418 51035 64817 24110 -56591 -76226 -64006 -82712 -81251 -60649
6951f0649r057J492l7775K1613N8445J4665k0429M9585J923j4993J071j0599l3540
$$ -60649 -69706 -68214 -105989 -84376 -25931 -11266 -31695 17890 19813 4820 5891 -4708 -38248
6938c8248j6975j0215K3277l3138n555k1189l6446J3127K1827K9771k1801K3558
$$ -38248 -55223 -65438 -42161 -75299 -80854 -102043 -138489 -125362 -103535 -73764 -95565 -72007
6926g2007M5765J7793K980k4949J0675P703l398k1452K3019Q153n7764J0266r008
$$ -72007 -26242 -8449 -5469 -30418 -19743 -12040 -15438 -36890 -13871 -5718 -63482 -53216 -62224
6913f2224k290P4135K2241J3977m7051m3298J518m086j0622k3527j1098K2419
$$ -62224 -64514 9621 31862 45839 -1212 -44510 -42992 -47078 -57700 -81227 -92325 -69906
6901f9906J2992m8371k9550k3866L1851M2313J3210k852l960J4085J8897K0961
$$ -69906 -56914 -105285 -134835 -158701 -126850 -84537 -71327 -74179 -78139 -64054 -45157 -24196
6889b4196J4519m3436K1642n824m519k4708j9022m176K5800K3220N0436K3038
$$ -24196 -9677 -53113 -31471 -37295 -41814 -66522 -85544 -89720 -63920 -40700 9736 32774
6877C2774k9188J3702J5247m0708o8340K3325K6318J5309J3644M9310j7806k6482
$$ 32774 3586 17288 32535 -8173 -76513 -53188 -26870 -11561 2083 51393 33587 7105
6865G105o888L5825L4355k7352l8030l9005M7727J492j2764k256P5660K2786n2984
$$ 7105 217 36042 70397 43045 5015 -33990 13737 15229 2465 209 75869 98655 45671
6852D5671l1206l0394k123k6483N848n651K1467K5404j2885k6204l784o757K438
$$ 45671 14465 -15929 -18052 -44535 -38687 -44338 -22871 2533 -10352 -36556 -40340 -47097 -44659
6839d4659J1239K9706k6747l5030j6339L827K3000j3698N9844j2742m432r094
$$ -44659 -33420 -3714 -30461 -65491 -81830 -78003 -55003 -68701 -8857 -21599 -26031 -35125
6827c5125L7891j6958l4203k7414j4069J805J5802j3406L921K1883l1156K247
$$ -35125 2766 -14192 -48395 -75809 -89878 -88073 -72271 -85677 -81756 -59873 -91029 -88782
6815h8782N0072j7357m7796J5805P7243M5721O5065O983J3768j0812l6151l589
$$ -88782 -38710 -56067 -103863 -88058 -10815 34906 99971 106954 120722 109910 73759 70170
6803G0170o113O167j7514k2783k9639J6007J1076k0717J9566R1509k1580l7064
$$ 70170 64057 70224 52710 29927 288 16295 27371 6654 26220 117729 96149 59085
6791E9085k6410l6227L4502J4127m6810R622J8474m2129M9743K1594J912J8020
$$ 59085 32675 -3552 30950 45077 -1733 7889 26363 -15766 33977 55571 57483 75503
6779G5503r298j9751J975k5415P777J6645n0287o4610l262M494K7672K3927l6232
$$ 75503 66205 46454 48429 23014 30791 47436 -2851 -67461 -70723 -66229 -38557 -14630 -50862
6766e0862l4753o076l2424l9021P2019O3750j3030M5099P1056P438k0817k4572
$$ -50862 -85615 -91691 -124115 -163136 -91117 -27367 -40397 4702 75758 83196 62379 37807
6754C7807K7520R463m2825K8402J0069q4400j1314r153J9214L170L6034L5598
$$ 37807 65327 74790 31965 60367 70436 -13964 -25278 -34431 -15217 -12047 23987 59585
6742E9585L5198J6714R473m913N085k4596r610K335M0823n4935j03329l2842K4072
$$ 59585 94783 111497 120970 116057 121142 96546 86936 89271 130094 75159 -28170 -61012 -36940
6729c6940j1302K0424q318N100M7392j1263J2434J1270k233m6146n1034m797L6787
$$ -36940 -48242 -27818 -36136 -31036 16356 5093 17527 28797 26564 -19582 -70616 -75413 -38626
6716c8626K6402k9419k70j1461L7411r127j72J9824L8828M7399K1830J5891l0365
$$ -38626 -12224 -41643 -41913 -53374 -15963 -25090 -25262 -5438 33390 80789 102619 118510 88145
6703H8145m9495q697J864n6072q675M3619K9427k112j9313j2398k868k4397k2016
$$ 88145 38650 29953 31817 -24255 -32930 10689 40116 38004 18691 6293 3425 -20972 -42988
6690d2988L6572L8582n6248j0114O196L2049l0990m4982L377K3407K7340j7158
$$ -42988 -6416 32166 -24082 -34196 -28000 4049 -26941 -71923 -68546 -45139 -17799 -34957
6678c4957m3316l398K8103J019l439R7529N5522J056m9334l3353j3002J0482P875
$$ -34957 -78273 -81671 -53568 -52549 -55988 41541 97063 98119 48785 15432 2430 12912 20787
6665B0787k6918k6480J6791J6677J351K6454N0571l0062j7322j9410M922n3296
$$ 20787 -6131 -32611 -15820 857 2208 28662 79233 49171 31849 12439 17361 -35935
6653c5935j5878J8726N9340p602k9482k79J4980M775L8174K6653k3439k6715j525
$$ -35935 -51813 -33087 26253 18651 -10831 -11110 3870 8645 46819 73472 50033 23318 21793
6640B1793n870p8463n381L0837o248J4314K1045Q505N4731K8079m3172m413n981
$$ 21793 15923 -62540 -67921 -37084 -43332 -29018 -7973 532 55263 83342 40170 35757 29776
6627B9776K6733L8654K5892J39M992k2941j7707q750J0737m0311m1855Q13j4289
$$ 29776 56509 95163 121055 121194 126186 103245 85538 76788 87525 47214 5359 6172 -8117
6614h117r342k6813K005N8871N5598q875m9127j1204N9508O341k2244j4362j7920
$$ -8117 -17459 -44272 -42267 16604 72202 63327 14200 2996 62504 68845 46601 32239 14319
6601A4319Q235K7045j2259j8401j5074j7736l9787l2318l1019J9819P490P703
$$ 14319 22554 49599 37340 18939 3865 -13871 -53658 -85976 -116995 -97176 -89686 -81983
6589h1983P1266N6517J7225l656l6793j0450q637k2224k7326Q369L0252N8451
$$ -81983 -10717 45800 63025 59369 22576 12126 3489 -18735 -46061 -37692 -7440 51011
6577E1011K8511M990o8816j9057m660n0305o6309K5579N1305L3237K4210m37N573
$$ 51011 79522 84512 15696 -3361 -8021 -58326 -124635 -99056 -47751 -14514 9696 9259 14832
6564A4832L1140L4584o116m5793o012Q444J2317j6191R686J5074J6306j8250L3571
$$ 14832 45972 80556 74440 28647 22635 31079 43396 27205 36891 51965 68271 50021 83592
6551H3592j8134o9517l5045J2649K708K0919j6983m2496L619J0490k5724p540
$$ 83592 65458 -4059 -39104 -26455 -23747 -2828 -19811 -62307 -58688 -48198 -73922 -81462
6539h1462O6655j2253m6035M8250O8004K5442J3461l210M594r453k9168l9798
$$ -81462 -14807 -27060 -73095 -24845 43159 68601 82062 78852 83446 73993 44825 5027
6527E027J4949j6693l02L1464k3473J5419m317j1156o475k4928k5108l1634J1455
$$ 5027 19976 3283 2981 34445 10972 26391 22074 10918 4443 -20485 -45593 -77227 -65772
6514f5772j5762J7747N4213n278K0579P726n9176n1556q589M3548J0821p651O021
$$ -65772 -81534 -63787 -9574 -14852 5727 13453 -45723 -97279 -105868 -62320 -51499 -59150 -53129
6501e3129k0044N209O4397K0252j1977n6467L6381N6442j2473K2197j215P91K4545
$$ -53129 -73173 -67964 -3567 16685 4708 -51759 -15378 41064 28591 50788 49573 50364 74909
6488G4909K4681l6955J0977j7021j2700m1170M243L3357L0695k246J820l8389
$$ 74909 99590 62635 73612 56591 43891 2721 6964 40321 71016 68770 70590 32201
6476C2201P551K4183k0647m1055l8091j1140K3688k7984L054J994k4588L5755
$$ 32201 39752 63935 43288 2233 -35858 -46998 -23310 -51294 -48240 -46246 -70834 -35079
6464c5079L1703o753M5015J282o6198J4450K1748K459m7275j6516j5980M8741
$$ -35079 -3376 -10129 34886 36168 -30030 -15580 6168 8627 -38648 -55164 -71144 -22403
6452b2403N4739p832J6083j1635k6403r745l2837k5286N8695J801P954l7843j802
$$ -22403 32336 24504 40587 28952 2549 -7196 -40033 -65319 -6624 -4823 3131 -34712 -36514
6439c6514J1416j4993J5523K5979M5381K5822K0081J9321l9755m5115r22j8845
$$ -36514 -25098 -40091 -24568 1411 46792 72614 92695 112016 72261 27146 26224 7379
6427G379k1249Q139l239j6485l3802R16J9077L6013n161N760J8393r751K7744
$$ 7379 -13870 -5731 -8970 -25455 -59257 -58341 -39264 -3251 -8412 -2652 15741 5990 33734
6414C3734j0841K2288l1685p9998j6582l3119k1257j4670L8637K5898j4008j9089
$$ 33734 22893 45181 13496 -66502 -83084 -116203 -137460 -152130 -113493 -87595 -101603 -120692
6402a20692q58L4517M2247M8848j4399n8425j9724K9709K1515m1144K720R6388
$$ -120692 -121550 -87033 -44786 4062 -10337 -68762 -88486 -58777 -37262 -78406 -75686 20702
6390B0702L3408Q608J0627l8454K5950j478m7111m408J0775J4123r756k0051J1576
$$ 20702 54110 62718 73345 34891 60841 59363 12252 7844 18619 32742 22986 2935 14511
6377A4511O1236O448o0358k970M107l4361j074j6412K0957J7367L3148N019k7309
$$ 14511 75747 82195 21837 18867 22974 -11387 -12461 -28873 -7916 9451 42599 47618 20309
6364B0309p361l189k9855j1523L8323J4085j9266l0960m521K264J0465L6447k09
$$ 20309 12948 9759 -20096 -31619 6704 20789 1523 -29437 -33958 -31694 -21229 15218 15009
6351A5009K760j0810p728p493l0622l3857j416k9692K2240N9054Q3297K0895j4690
$$ 15009 17769 6959 -769 -8262 -38884 -72741 -74157 -103849 -81609 -22555 60742 81637 66947
6338F6947l8881M439m6471Q005P224M0136N327k1348l6031l9326J8433J7570j503
$$ 66947 28066 32505 -13966 -5961 1263 41399 46726 25378 -10653 -49979 -31546 -13976 -15479
6325a5479l3955L8387N5663O602m725N861l1639M037l0457k1212P2777M0361j3809
$$ -15479 -49434 -11047 44616 51218 46493 52354 20715 24752 -5705 -26917 45860 86221 72412
6312G2412o201Q564J9256j3704k0382K1484P398O863n9814n8167l261k7831l3883
$$ 72412 66211 74775 94031 80327 59945 81429 88827 95690 35876 -22291 -25552 -53383 -87266
6299h7266L3596M9196l174N463N0627o522k4666J3498M6504K071O880J8816k3619
$$ -87266 -53670 -4474 -7648 -2185 48442 41920 17254 30752 77256 79327 86207 105023 81404
6286H1404o9486k5301k3319j6789L6860L612K1317m3802n0890M5855O1084N8309
$$ 81404 11918 -13383 -36702 -53491 -16631 -13019 8298 -35504 -86394 -40539 20545 78854
6274G8854N575j03211n7198K8106P954K3245j7251L5053r390o1845j5425P9662
$$ 78854 84429 -18782 -75980 -47874 -39920 -16675 -33926 1127 -8263 -70108 -85533 -5871
6262e871L1752r543J7508K132m2098l8625K3004j2672m0888K6987n339j3899m447
$$ -5871 25881 16338 33846 35978 -6120 -44745 -21741 -34413 -75301 -48314 -53653 -67552 -71999
6249g1999r799J0912j2712k9938K7335K0540L1688M1183K523k4102o564n0128
$$ -71999 -81798 -70886 -83598 -113536 -86201 -65661 -33973 7210 9733 -14369 -20933 -71061
6237g1061j7211j4389L1394K7933J4092l3360m1244j2064P5534M3989K1361k498
$$ -71061 -88272 -102661 -71267 -43334 -29242 -62602 -103846 -115910 -40376 3613 24974 22476
6225B2476j7734l7239l0440J8789L4576o452m4579r748M658L3491M9764j917j5438
$$ 22476 4742 -32497 -62937 -44148 -9572 -16024 -60603 -70351 -65693 -32202 17562 15645 207
6212B07l7808J5096J8730k7949K9716L7466K979j7560k7719r4525k3082P1273
$$ 207 -37601 -22505 -3775 -31724 -2008 35458 38437 20877 -6842 -101367 -124449 -53176
6200e3176K475Q952k24J7525L5774P5989k7766n916k4166o5221j3185o002K7096
$$ -53176 -50701 -41749 -41973 -24448 11326 87315 59549 53633 29467 -35754 -48939 -54941 -27845
6187b7845K9805L58n1879R820J1456J2818j0580M1650K4732n0575K7287K112j0642
$$ -27845 1960 2318 -49561 -39741 -28285 -15467 -26047 15603 40335 -10240 17047 19159 8517
6174H517N6l9136k7012R240Q138P625l2623k6624n158K0474N7285K7268j8976
$$ 8517 8573 -30563 -57575 -48335 -40197 -32572 -65195 -91819 -96977 -76503 -19218 8050 -10926
6161a0926k3886k9276j8221J2294M1303P1466M1010j8082k2649j2671r906l9664
$$ -10926 -34812 -64088 -82309 -70015 -28712 42754 83764 65682 43033 30362 20456 -19208
6149a9208k3208M3699J3987j9182o8772P79K8044O111L9577m809m8614j5834K377
$$ -19208 -42416 1283 15270 -3912 -72684 -71905 -43861 -37750 1827 -2982 -51596 -67430 -65053
6136f5053j267M3236K5519L256j4092o5779j6765K6682P3819J3557l6560J3955
$$ -65053 -66320 -23084 2435 5691 -8401 -74180 -90945 -64263 9556 23113 -13447 508
6124E08O0768K2746l4998l3694j05395m7264N3586K2353K0169K5890L4666M4333
$$ 508 61276 84022 49024 15330 -90065 -137329 -83743 -61390 -41221 -15331 19335 63668
6112F3668J2615l35j3971l7601k4982k3270l4373k1220O2390M0627q898J9507
$$ 63668 76283 75948 61977 24376 -606 -23876 -58249 -79469 -17079 23548 14650 34157
6100C4157K848k886l7113L7081p645n823K891M7641m3592j8496M9700J0065n8452
$$ 34157 37005 34119 -2994 34087 26442 20619 23510 71151 27559 9063 58763 68828 10376
6087A0376j4444N221K2572q239l0126j6826N2149J6261k4101N47J2936J9748L159
$$ 10376 -4068 1153 23725 15486 -14640 -31466 20683 36944 12843 13390 26326 46074 49233
6074D9233j4748k965j5696K3669K2158j2861J6250k374o7166j5002L7335l3107
$$ 49233 34485 31520 15824 39493 61651 48790 65040 62666 -4500 -19502 17833 -15274
6062a5274L841J0487L5005n3324l7935r434Q7957k512n7751r393L5093j7935j8251
$$ -15274 -11433 -946 34059 -19265 -57200 -66634 21323 18811 -38940 -48333 -13240 -31175 -49426
6049d9426O9039L0031J5358j6664k5133l6810m3257L5003K731J0069K2203k0928
$$ -49426 19613 49644 65002 48338 23205 -13605 -56862 -21859 -19128 -9059 13144 -7784
6037g784m8013l3934K4022O143j9301l2270K7637K7664R073O1791K273j0125l8665
$$ -7784 -55797 -89731 -65709 -59566 -78867 -111137 -83500 -55836 -46763 15028 17301 7176 -31489
6024c1489J9953j8689m9912k2383N5499O374L707N7692J8889j2062j7727o9154
$$ -31489 -11536 -30225 -80137 -102520 -47021 -40647 -36940 20752 39641 27579 9852 -59302
6012e9302o6330k7364N8906O4955K3127J7269J9230l1316k3958N375j9828r750
$$ -59302 -125632 -152996 -94090 -29135 -6008 11261 30491 -825 -24783 -19408 -39236 -48986
6000d8986K5071Q687K8965n236R404J7281N317K933n6870j0071p362K6370K9433
$$ -48986 -23915 -15228 13737 8501 17905 35186 40503 43436 -13434 -23505 -30867 -4497 24936
5987B4936J3271p065N971l0679k5280J9450m5490n6979L2391L4812N7594K6682
$$ 24936 38207 31142 37113 6434 -18846 604 -44886 -101865 -69474 -34662 22932 49614
5975D9614j7842k3135j9139l3139L2863N9529J0077k0931k603k6309K8697Q843
$$ 49614 31772 8637 -10502 -43641 -10778 48751 58828 37897 35294 8985 37682 46525
5963D6525j5401p198l0895r0369J3915K8759k9300N762l83j8907L167N6880O51
$$ 46525 31124 23926 -6969 -97338 -83423 -54664 -83964 -78202 -78585 -97492 -94325 -37445 -36794
5950c6794j3751m0419K9696M7460j3724l7037P378L8596K1196M648k6302j1635
$$ -36794 -50545 -90964 -61268 -13808 -27532 -64569 -57191 -18595 2601 7249 -19053 -30688
5938c0688l6337l1931N0699q479k0091K8596l07q56L0062K6913J3608N951R077
$$ -30688 -67025 -98956 -48257 -56736 -76827 -48231 -48538 -49394 -19332 7581 21189 27140 36217
5925C6217k6132m6473L611K3695J2684l0323l0857J6596L6068K9899N568m9898
$$ 36217 10085 -36388 -32777 -9082 3602 -26721 -57578 -40982 -4914 24985 30553 -19345
5913a9345l4538m065M4610K0581m1715n1392k1634M6062N4440K2302j9869j4920
$$ -19345 -53883 -57948 -13338 7243 -34472 -85864 -107498 -61436 -6996 15306 -4563 -19483
5901a9483l3888n573n085J025K3966L3473j565j2479j8572J2139K4083j9283l5914
$$ -19483 -53371 -58944 -64029 -63004 -39038 -5565 -7130 -19609 -38181 -26042 -1959 -21242 -57156
5888e7156k3355O321L4467Q390L4243J2625K1823M4334k0303o9981k974L8810
$$ -57156 -80511 -74190 -39723 -31333 2910 15535 37358 81692 61389 -8592 -11566 27244
5876B7244j287q014m8098o846K849r999k3928R765J8919k2416J0448L6358M7245
$$ 27244 25957 17943 -30155 -37001 -34152 -44151 -68079 -58314 -39395 -61811 -51363 -15005 32240
5863C2240j2761l9931k1096r346N8972K7032n8914q849O0471N622k6680o953M0352
$$ 32240 19479 -20452 -41548 -50894 8078 35110 -23804 -32653 27818 33440 6760 -193 40159
5850D0159j5714m9647J7097n4337L2224M2772n875Q359k8729j4404K758K3470
$$ 40159 24445 -25202 -8105 -62442 -30218 12554 6679 15038 -13691 -28095 -25337 -1867
5838a867M823n1952K2003O9282k2890R854k1465m6686J1502Q1885K5474l8108
$$ -1867 2956 -48996 -26993 42289 19399 29253 7788 -38898 -27396 54489 79963 41855
5826D1855l4445k3329M6129K293N41N0234J1953l7202l8206r956J4159j5485j6734
$$ 41855 7410 -15919 30210 32503 33044 83278 95231 58029 19823 9867 24026 8541 -8193
5813h193j0599l522n4113j5368M5160L1733R950J6537k1799m495M2002l878l178
$$ -8193 -18792 -22314 -76427 -91795 -46635 -14902 -4952 11585 -10214 -14709 27293 23415 20237
5800B0237M8151J3075m9658m8374k915K5090k7237m366N6228M3673J1916j5504
$$ 20237 68388 81463 31805 -16569 -19484 5606 -21631 -25997 30231 73904 85820 70316
5788G0316l1552K4140K735j9555m8676k2959J0051J2584k2250J0260j8912l0197
$$ 70316 38764 62904 65639 46084 -2592 -25551 -15500 -2916 -25166 -14906 -33818 -64015
5776f4015Q534K4117L7146r636O377j2299l0959L8516j3555l8832l6843j6371
$$ -64015 -55481 -31364 5782 -3854 2523 -9776 -40735 -2219 -15774 -54606 -91449 -107820
5764a07820N4039q112P641k6177l4231K7043M4760l0436k2545O2613P4731n3336
$$ -107820 -53781 -61893 -54252 -80429 -114660 -87617 -42857 -73293 -95838 -33225 41506 -11830
5752a1830p0400r62O1818L3632r1941M4902N8102J0707O774K024m0770J4119J730
$$ -11830 -82230 -83192 -21374 12258 -79683 -34781 23321 34028 40802 42826 2056 16175 17905
5739A7905m4579N405M6517n801L3201K532k120p429k5875L8036K3738l7526n0784
$$ 17905 -26674 -21269 25248 19447 52648 55180 53060 45631 19756 57792 81530 44004 -6780
5726f780K5291K4290J5145l1029j1059m1338n1017M1409L9954J1488p3626M717
$$ -6780 18511 42801 57946 26917 15858 -25480 -76497 -35088 4866 16354 -57272 -52555
5714e2555M1839O781l9059j6541R764L8250P917O515J0987k7612k2685o3011j3468
$$ -52555 -10716 -3935 -42994 -59535 -49771 -11521 -3604 2911 13898 -13714 -36399 -99410 -112878
5701a12878L0347K3725M123j1324L0363m771l3754J5383J01218K8990m8626m319
$$ -112878 -82531 -58806 -54683 -66007 -35644 -40415 -74169 -58786 42432 71422 22796 18477
5689A8477M9376K1531j8683j19370o5206K8821L0513O6025Q5796o363m4390l7465
$$ 18477 67853 89384 70701 -48669 -113875 -85054 -54541 11484 97280 90917 46527 9062
5677I062l183K3320p836m27N0212K5698J7503p4673m2353J519k5385l1450K8388
$$ 9062 5879 29199 21363 20936 71148 96846 114349 39676 -2677 -1158 -26543 -57993 -29605
5664b9605p823k2629M3020L1671K4016L277k3572l2650L536Q863J0611M8433k2027
$$ -29605 -37428 -60057 -17037 14634 38650 41927 18355 -14295 -10759 -1896 8715 57148 35121
5651C5121l0861K173p1823J1482K8312Q207J9596M0253n783J3200K6455l3592
$$ 35121 4260 6433 -65390 -53908 -25596 -17389 2207 42460 36677 49877 76332 42740
5639D2740q8239o4904K0180M382K8621P8436K4296k7724p451J1828N126q995K990
$$ 42740 -45499 -110403 -90223 -85841 -57220 21216 45512 17788 10337 22165 27291 18296 21286
5626B1286j8548p0312j8945L4280M5431P874L2783J8813n6463O33k8050j4591
$$ 21286 2738 -67574 -86519 -52239 -6808 1066 33849 52662 -3801 -3168 -31218 -45809
5614d5809L7105L8276J653m1474m2980m9780O03K6323L6846K7068M3623Q157j1552
$$ -45809 -8704 29572 31225 -10249 -53229 -103009 -102406 -76083 -39237 -12169 31454 39611 28059
5601B8059m0269K6288J9349J3761j072j6957m8181j7554o826k7621J8649O6217
$$ 28059 -12210 14078 33427 47188 46116 29159 -19022 -36576 -43402 -71023 -52374 13843
5589A3843J6987q588k7259j6134J585K5571m461j1758m301j2699j1778J7894M116
$$ 13843 30830 22242 -5017 -21151 -19566 6005 1544 -10214 -14515 -27214 -38992 -21098 -16982
5576a6982J3032j8281o1764r778K3064L4984L0885K5410J6396J811K5412j0916
$$ -16982 -3950 -22231 -83995 -93773 -70709 -35725 -4840 20570 36966 38777 64189 53273
5564E3273m5276K2888j4286N552j9567l9158m0265J6880j5077L2017O3705M7694
$$ 53273 7997 30885 16599 22151 2584 -36574 -76839 -59959 -75036 -43019 20686 68380
5552F8380k8867m9973m9354k351L2828M4431k3195m1108J4387K7444J4406r608
$$ 68380 39513 -10460 -59814 -62165 -29337 15094 -8101 -49209 -34822 -7378 7028 -2580
5540b580j1288j6257J9232j1415O1782J0124k6115n0094J9556K7068j284K6715
$$ -2580 -13868 -30125 -10893 -22308 39474 49598 23483 -26611 -7055 20013 18729 45444
5528D5444l4415p224J3158Q705l3666j9148L9903j2169j289l0044K0572k6807
$$ 45444 11029 3805 16963 25668 -7998 -27146 12757 588 -701 -30745 -10173 -36980
5516c6980J3676K3486o0572l0816k180K4190M9545r115n9436K1857L9750o099
$$ -36980 -23304 182 -60390 -91206 -93386 -69196 -19651 -28766 -88202 -66345 -26595 -32694
5504c2694K6027J4046J9099L620l8404Q365J4213P849o919j4049J6529Q500K1645
$$ -32694 -6667 7379 26478 30098 -8306 59 14272 22121 15202 1153 17682 26182 47827
5491D7827o0492J0913J9943l3285l6837m2051l0102K1378Q338K2451L0610J6385
$$ 47827 -12665 -1752 18191 -15094 -51931 -93982 -124084 -102706 -94368 -71917 -41307 -24922
5479b4922k2334j787l3968J27J6245l9293K1454J4348l8371J2082Q8157K4782
$$ -24922 -47256 -49043 -83011 -82884 -66639 -105932 -84478 -70130 -108501 -96419 -8262 16520
5467A6520r509p0610l1898J4949M0116O3922J8888M88l6630m2732k4206L8879
$$ 16520 7011 -63599 -95497 -80548 -40432 23490 42378 42866 6236 -36496 -60702 -21823
5455b1823L4373l963J6317j1010l2748N3720j2225l4444k9678l7301N3q25J0877
$$ -21823 12550 8587 24904 13894 -18854 34866 22641 -11803 -41481 -78782 -78729 -79554 -68677
5442f8677R518K5863K3274J3167k5026m3480m9743n55K6924N3894K3223p447l7056
$$ -68677 -59159 -33296 -10022 3145 -21881 -65361 -115104 -115659 -88735 -34841 -11618 -19065 -56121
5429e6121L5915L2777O733r834k0441l5050k3078k9033M3368O232R00j2940K5911
$$ -56121 -20206 12571 19304 9470 -10971 -46021 -69099 -98132 -54764 -48532 -47632 -60572 -34661
5416c4661j2006m9036M3573K0034L2248M5268J621j2880R676K7076j2069k2095
$$ -34661 -46667 -95703 -52130 -32096 152 45420 47041 34161 43837 70913 58844 36749
5404C6749n319m3217j2849j62j1684j463k0671m371K4156K5097K1575j1492n0696
$$ 36749 31430 -11787 -24636 -24798 -36482 -37945 -58616 -62987 -38831 -13734 7841 -3651 -54347
5391e4347j8668M4106O0423L4167K6843N658j4849p5308p1369Q996R522J9646
$$ -54347 -73015 -28909 31514 65681 92524 98182 83333 8025 -63344 -54348 -44826 -25180
5379b5180K6955k2664m5868J2783o767O1379O3872P2610o8457r5184j8596L4150
$$ -25180 1775 -20889 -66757 -53974 -60741 638 64510 137120 68663 -26521 -45117 -10967
5367a0967J8946K6772p7123P140M2506J4231j8613n5983L5556N3375M3173K1455
$$ -10967 7979 34751 -42372 -35232 7274 21505 2892 -53091 -17535 35840 79013 100468
5355A00468k2362K953K0309m3481n0339k653J7936K6104l2560j682r594K0948
$$ 100468 78106 81059 101368 57887 7548 4895 22831 48935 16375 14693 5099 26047
5343B6047J7366k7253k8712K858N013q800J0848N0163L0574m3872j220J477L2913
$$ 26047 43413 16160 -12552 -9694 -4681 -13481 -2633 47530 78104 34232 33012 34489 67402
5330F7402l0421k1745M228J2749K1424L321l0629j0233n479M1034M4996j5464
$$ 67402 36981 15236 19464 32213 53637 56958 26329 16096 10617 51651 96647 81183
5318H1183n2530l2410L4071R709n5344q384L4286L976j448k2795J0210j8100l7833
$$ 81183 28653 -3757 30314 40023 -15321 -23705 10581 14557 13109 -9686 524 -17576 -55409
5305e5409k8379L822L388L7320J6133l7995q793N9594R1020K3897Q556j256l4741
$$ -55409 -83788 -79966 -76578 -39258 -23125 -61120 -69913 -10319 80701 104598 113154 111898 77157
5292G7157n3876K5059L264j2485p0870l3649L9818L4095J7314L5385p580l928
$$ 77157 23281 48340 51604 39119 -31751 -65400 -25582 8513 25827 61212 53632 49704
5280D9704m916k1552m2199k5881m0776l4619M6107O6730O948p587O7196r521p0273
$$ 49704 44788 23236 -18963 -44844 -85620 -120239 -74132 -7402 -454 -8041 59155 49634 -20639
5267b0639j9130p825K897K9598k9646k6279J6429M9811p918J8517m1922m5991
$$ -20639 -39769 -47594 -44697 -15099 -44745 -71024 -54595 -4784 -12702 5815 -36107 -82098
5255h2098l966P3104m977l3580L033J6854J2101J0819R130l0572j6038L3473j0434
$$ -82098 -86064 -12960 -17937 -51517 -48484 -31630 -19529 -8710 420 -30152 -46190 -12717 -23151
5242b3151k2777j308M8406N4199P295Q516r054k5929J0630k1958N0834m117o1675
$$ -23151 -45928 -47236 1170 55369 62664 71180 62126 36197 46827 24869 75703 71586 9911
5229I911n1493%j1052J2248M4751p9604n0358J2098K2032J7018N0196K4977l4467
$$ 9911 -41582 -41582 -52634 -40386 4365 -75239 -125597 -113499 -91467 -74449 -24253 724 -33743
5216c3743o8419L830K2907J9035N918m3155J7688L7127j6742m405K7273K5900
$$ -33743 -102162 -98332 -75425 -56390 -50472 -93627 -75939 -38812 -55554 -59959 -32686 -6786
5204f786L2847J3678J5464j6891k8171K7023L8621k0197k2919J8032L315m724
$$ -6786 26061 39739 55203 38312 10141 37164 75785 55588 32669 50701 54016 49292
5192D9292R93m7096m8003k9631J1938J2882K2926k5237l3157R339N3313L0194
$$ 49292 50285 3189 -44814 -74445 -62507 -49625 -26699 -51936 -85093 -75754 -22441 7753
5180G753q931n47L4086j5013n2154k0902J6549L5542L0609L308J1799j4890l2510
$$ 7753 -1178 -1725 32361 17348 -34806 -55708 -39159 -3617 26992 30300 42099 27209 -5301
5167e301N8110l974k9498k6380k9191l2007K8234L0869l9994p1281n523M0358
$$ -5301 52809 48835 19337 -7043 -36234 -68241 -40007 -9138 -49132 -120413 -125936 -85578
5155h5578O9502M1303r62R354j9353m2708m4356k5760J6428K9024m56K080J607
$$ -85578 -16076 25227 24265 33619 14266 -28442 -72798 -98558 -82130 -53106 -53562 -51482 -49875
5142d9875O9651o954l8757K6219j8516K8869k0172l694O8247J4686p6022j235
$$ -49875 19776 12822 -25935 284 -18232 10637 -9535 -13229 55018 69704 -6318 -7553
5130g553m2780l438j286J119J4873J9028j5701j8612k5537J4852O834j1370J7807
$$ -7553 -50333 -53771 -55057 -53938 -39065 -20037 -35738 -54350 -79887 -65035 -58201 -69571 -51764
5117e1764M7413Q5098K2512j2231m2927l0689m8286J3924L5608K3862r549m7172
$$ -51764 -4351 80747 103259 91028 48101 17412 -30874 -16950 18658 42520 32971 -14201
5105a4201j9557K6733J0877Q4119J2225l2307j4826k162k1081J0279j3095L5384
$$ -14201 -33758 -7025 3852 87971 100196 67889 53063 50901 29820 40099 27004 62388
5093F2388l9794k5468J2164j1286l204j351j4135L4477L5220j021n8731o576j8218
$$ 62388 22594 -2874 9290 -1996 -5200 -6551 -20686 13791 49011 47990 -10741 -17317 -35535
5080c5535J2112q465m973n0255M0768Q9785J3713j5237m1184k7887L160M581J5729
$$ -35535 -23423 -31888 -36861 -87116 -46348 43437 57150 41913 729 -27158 -23998 -19417 -3688
5067c688J4326l4829L018J4733L1218N519m0741l408N6580l0783l3768l1834K7614
$$ -3688 10638 -24191 -21173 -6440 24778 30297 -10444 -13852 42728 11945 -21823 -53657 -26043
5054b6043L8194K255l1271J7289j4316Q207p512q865p922M0771O559j9685p4296
$$ -26043 12151 14406 -16865 424 -13892 -5685 -13197 -22062 -29984 10787 17346 -2339 -76635
5041g6635k3775J4174N981L4998K2704q603J3653Q9Q449J7682o4453L8923O2167
$$ -76635 -100410 -86236 -80255 -45257 -22553 -31156 -17503 -17414 -8965 8717 -55736 -16813 45354
5028D5354k1641K1874n901n3328m5254K3708M6214m6204m0280J3786K8211O329
$$ 45354 23713 45587 39686 -13642 -58896 -35188 11026 -35178 -75458 -61672 -33461 -27132
5016b7132m7953K7085J5274k2190L7698L1791K1585q305r913K6031j7362j1964
$$ -27132 -75085 -48000 -32726 -54916 -17218 14573 36158 27853 17940 43971 26609 14645
5004A4645r263k0042p2245n6629j2533O4008N0788P8142J9118Q403k110l0822
$$ 14645 5382 -14660 -86905 -143534 -156067 -92059 -41271 36871 55989 64392 62282 31460
4992C1460K1017J0824n5901o5412k6996k602K8746L5765j3020J8829L5044m9852
$$ 31460 52477 63301 7400 -58012 -85008 -87610 -58864 -23099 -36119 -17290 17754 -32098
4980c2098j1453L6827K2306n0566M1453m991m1866N708p027L4853n149j2052J246
$$ -32098 -43551 -6724 15582 -34984 6469 1478 -40388 -34680 -41707 -6854 -12003 -24055 -22809
4967b2809R3753j8480l068K4218l4382m5656l7977r47K7098M3684j6687k9430
$$ -22809 70944 52464 49396 73614 39232 -6424 -44401 -45348 -18250 25434 8747 -20683
4955b0683j8201l421L1435J8174j2090k175n2517j8687r079n66K5079N7975J2829
$$ -20683 -38884 -42305 -10870 7304 -4786 -6961 -59478 -78165 -87244 -87810 -62731 -4756 8073
4942H073l589M536n142m0372k3710j159j6043J4227K1272k034K350l2561M2410
$$ 8073 4484 9020 3878 -36494 -60204 -61363 -77406 -63179 -41907 -43941 -41591 -74152 -31742
4929c1742O6479R9163n0861l1238k5383m3483k7116K1062l5045j1814J1282k5833
$$ -31742 34737 133900 83039 51801 26418 -17065 -44181 -23119 -58164 -69978 -58696 -84529
4917h4529M931Q3375J3156k831k7319j4863q764J6649K8125K4557l6405L6936
$$ -84529 -79598 3777 16933 14102 -13217 -28080 -36844 -20195 7930 32487 -3918 33018
4905C3018j3181k5200k3172O287j7088l639K4997K0950Q293j9846m9701k1120
$$ 33018 19837 -5363 -28535 -22248 -39336 -42975 -17978 2972 11265 -8581 -58282 -79402
4893g9402K7661Q195K8056K7069K5791j1281j6228N6225l1159l4202l9212K8253
$$ -79402 -51741 -43546 -15490 11579 37370 26089 9861 66086 34927 725 -38487 -10234
4881a0234N4220l7043k7374q109j0200M0460K84J7712M1637k2914l8018k6975
$$ -10234 43986 6943 -20431 -28540 -38740 1720 2004 19716 61353 38439 421 -26554
4869b6554J4279l2795m8168J7907O810K6946l4478j02146K6758N7289l726M7751
$$ -26554 -12275 -45070 -93238 -75331 -68521 -41575 -76053 -178199 -151441 -94152 -97878 -50127
4857e0127J29200N6757o8770n1893l3590l8308L7504l967K9270K9755m3647l1546
$$ -50127 79073 135830 67060 15167 -18423 -56731 -19227 -23194 6076 35831 -7816 -39362
4845c9362j3325n936R044J2509l021O510k3296l109K8608m787k2812q837M1940
$$ -39362 -52687 -58623 -49579 -37070 -40091 -33581 -56877 -59986 -31378 -36165 -58977 -67814 -25874
4832b5874K2522n2572l0890n4870K0444O3811O1569P522r658K1713J0189Q190
$$ -25874 -3352 -55924 -86814 -141684 -121240 -57429 4140 11662 2004 23717 33906 42096
4820D2096q659p005j7204j5937m0903L4466m0098j9581j7101J4877M5548L0206
$$ 42096 33437 26432 9228 -6709 -47612 -13146 -53244 -72825 -89926 -75049 -29501 705
4808G05p3789O691K7441j3070M6583k4995l4917l5990Q732J969M8298L8142k4263
$$ 705 -73084 -66393 -38952 -52022 -5439 -30434 -65351 -101341 -92609 -90640 -42342 -4200 -28463
4795b8463L9405M335l9835K2082K2097J3545k378L6653M461l3614m2273L0680
$$ -28463 10942 15277 -24558 -2476 19621 33166 30788 67441 71902 38288 -3985 26695
4783B6695K4815k3348J586m2729r164l6028J4998N2033J3944J6066n274j1253
$$ 26695 51510 28162 29748 -12981 -22145 -58173 -43175 8858 22802 38868 33594 22341
4771B2341j8448N398M524o5307n4385J7777L7407l8307J2250m663L4409M6242
$$ 22341 3893 9291 13815 -51492 -105877 -88100 -50693 -89000 -76750 -81413 -47004 -762
4759g62j905p427k9728P068N2201L1436n177j4349j6674j3778J292j2506M844
$$ -762 -2667 -10094 -39822 -32754 19447 50883 45706 31357 14683 905 2197 -10309 -5465
4746e465L7568J4462L7454j5485n1587p4631J6182M1436J0213j5588K0584J0146
$$ -5465 32103 46565 84019 68534 16947 -57684 -41502 -66 10147 -5441 15143 25289
4734B5289l857l179m3693l0560J6708r561K3631L3016k040L6864j6653M170k3447
$$ 25289 21432 18253 -25440 -56000 -39292 -48853 -25222 7794 5754 42618 25965 30135 6688
4721F688l3564R435K4607L7316j460m409M5144n5532q032K4153j4318l9014j4364
$$ 6688 -26876 -17441 7166 44482 43022 38613 83757 28225 20193 44346 30028 -8986 -23350
4708b3350l353j3501L2236m016k2771n2523P137K3818J8401q924M263K3361K1384
$$ -23350 -26703 -40204 -7968 -11984 -34755 -87278 -80141 -56323 -37922 -46846 -42583 -19222 2162
4695B162L4693m6302l0056q967L0550N1962k7569l0424L0350K8306M743L1140
$$ 2162 36855 -9447 -39503 -48470 -17920 34042 6473 -23951 6399 34705 39448 70588
4683G0588k120o7512j0741p619L8854J5011m1260p014M0839J0688l5773n7959
$$ 70588 68468 956 -9785 -17404 21450 36461 -4799 -11813 29026 39714 3941 -54018
4671e4018j2909L5049L8044p41k4617l2774k7882K0976O766N7632M5427r181o6899
$$ -54018 -66927 -31878 6166 5425 -19192 -51966 -79848 -58872 -52106 5526 50953 41772 -25127
4658b5127j9929O0566O8482J6517j4224m0179k9345K8316j4445k4355K4208k7749
$$ -25127 -45056 15510 83992 100509 86285 46106 16761 45077 30632 6277 30485 2736
4646B736J0715P3009j8490l8207K808l135n8519o71M3784l5877j4190J3001k2318
$$ 2736 13451 86460 67970 29763 32571 29436 -29083 -29754 14030 -21847 -36037 -23036 -45354
4633d5354J0310k0588k6099o1482O246O1891J0950K2077K7493P7n3204j5840L7582
$$ -45354 -35044 -55632 -81731 -143213 -136967 -75076 -64126 -42049 -14556 -14479 -67683 -83523 -45941
4620d5941K2455q630k4101M221k1594k5705l6222J9095M2719q791r045M6948K7564
$$ -45941 -23486 -32116 -56217 -51996 -73590 -99295 -135517 -116422 -73703 -82494 -91539 -44591 -17027
4607a7027j0824j6791O606N7933O3950j4944l3748m5174J8654k1236k0947M0942
$$ -17027 -27851 -44642 -38036 19897 83847 68903 35155 -10019 8635 -12601 -33548 7394
4595G394K431j5j7855K9966J0217m5675k8240l1178k1742K7894M4155K3800J8918
$$ 7394 9825 9810 -8045 21921 32138 -13537 -41777 -72955 -94697 -66803 -22648 1152 20070
4582B0070N620K6448J546J2673l710k1966m9758l9624k3538K7767J5829M3305
$$ 20070 25690 52138 53684 66357 62647 40681 -9077 -48701 -72239 -44472 -28643 14662
4570A4662L3588j1344m9185m4943M3127M6714L7335L0600j0537p4073o6340j3419
$$ 14662 48250 36906 -12279 -57222 -14095 32619 69954 100554 90017 15944 -50396 -63815
4558f3815j9964O0644K9896l8385n2361J413M8962O97M1994L6566M4007k7254
$$ -63815 -83779 -23135 6761 -31624 -83985 -82572 -33610 -32913 9081 45647 89654 62400
4546F2400n0806j02899k4073k786L4677J00837K6061k5548j2878L2039j376P009
$$ 62400 11594 -91305 -115378 -118164 -83487 17350 43411 17863 4985 37024 35648 42657
4534D2657j2324p7465j3269P5933M2213m1001m2913J0075k9463q424N6572M9705
$$ 42657 30333 -47132 -60401 15532 57745 16744 -26169 -16094 -45557 -53981 2591 52296
4522E2296r401K2195J7248n5321j7334K1808j771K5292k8545K2963K7715O672
$$ 52296 42895 65090 82338 27017 9683 31491 29720 55012 26467 49430 77145 83817
4510H3817N625k834m5429r215l2760K4379K1986m962M3430k1909l4019j1095k1616
$$ 83817 89442 86608 41179 31964 -796 23583 45569 40607 84037 62128 28109 17014 -4602
4497d602j8030o8505k1581Q6884q27M598o5982k449O1843J222j2661J6514k2057
$$ -4602 -22632 -91137 -112718 -25834 -26661 -22063 -88045 -90494 -28651 -27429 -40090 -23576 -45633
4484d5633J1991p838L1638K9190L0860J2749O174K0016k8139n5352l1882J4836
$$ -45633 -33642 -41480 -9842 19348 50208 62957 69131 89147 61008 5656 -26226 -11390
4472a1390N5815l6932J63L9904J1707m3785K8305J6984j6589k2612k7092k7678
$$ -11390 44425 7493 7656 47560 59267 15482 43787 60771 44182 21570 -5522 -33200
4460c3200J792K8706j381P830q480P196l493M791n3543m0417J8982N7395N7950
$$ -33200 -31408 -2702 -4083 3747 -4733 2463 -1030 3761 -49782 -90199 -71217 -13822 44128
4447D4128m0561j1323N0453k6052j1857J5745K343j7301o8726j4367L7969J8753
$$ 44128 3567 -7756 42697 16645 4788 20533 22876 5575 -63151 -77518 -39549 -20796
4435b0796o058J2680k1231O439K904k3505k8471j2013J2788k5876j004J5104L8036
$$ -20796 -26854 -14174 -35405 -28966 -26062 -49567 -78038 -90051 -77263 -103139 -104143 -89039 -51003
4422e1003l145Q613l205N0935M265K9234M0227m8208k9380L9700k0426m107K3565
$$ -51003 -54148 -45535 -48740 2195 6460 35694 75921 27713 -1667 38033 17607 13500 37065
4409C7065j1089J3266N2172n682r192K412J1272j730k4740K551j0510k2142j1423
$$ 37065 25976 39242 91414 85732 76540 78952 90224 88494 63754 66305 55795 33653 22230
4396B2230m5079l9611O1466N7973j161k8210j9653l8849P891N6119J8394j8219
$$ 22230 -22849 -62460 -994 56979 55818 27608 7955 -30894 -23003 33116 51510 33291
4384C3291n9912q00M3948K463l2881k6334P3113k5123l0128K935k1339m648O7463
$$ 33291 -26621 -27421 16527 18990 -13891 -40225 32888 7765 -22363 -19428 -40767 -45415 22048
4371B2048L9654m1407p3900j6525L9576M6142J5144l9137K2886k3844m9067o579
$$ 22048 61702 20295 -53605 -70130 -30554 15588 30732 -8405 14481 -9363 -58430 -65009
4359f5009L7200j8080J5841j061R498J4108j8061j758K3689q282J8610k3670K4698
$$ -65009 -27809 -45889 -30048 -31109 -21611 -7503 -25564 -27322 -3633 -11915 6695 -16975 7723
4346G723M5173K3073p4974J9319j717k6291k9201q403J2595N4679K3955j0206
$$ 7723 52896 75969 995 20314 18597 -7694 -36895 -45298 -32703 21976 45931 35725
4334C5725o7058l9927j7220O5070L7226K8731K5943N334r54J4721N369k2314J5854
$$ 35725 -31333 -71260 -88480 -23410 13816 42547 68490 73824 72870 87591 92960 70646 86500
4321H6500o1226k8210J3564j3934l8543N1649K4656N948M943j6513K0573q2235
$$ 86500 25274 -2936 10628 -3306 -41849 9800 34456 40404 45347 28834 49407 -32828
4309c2828m2714J1233M5807K8210K539k9085l5000L4584N174j8037L8087K1570
$$ -32828 -75542 -64309 -18502 9708 12247 -16838 -51838 -17254 -12080 -30117 7970 29540
4297B9540o344J328j7087M7404O404n4452J2304L6756o3435K4143J4402j365m8727
$$ 29540 23196 24524 7437 54841 61245 6793 19097 55853 -7582 16561 30963 29598 -19129
4284a9129n0310L0207O3399M1823k0801Q329J0718K698m9220l0692J1989l3989
$$ -19129 -69439 -39232 24167 65990 45189 53518 64236 66934 17714 -12978 -989 -34978
4272c4978k0971L8839L440K3529K5566o134j8245o794Q611k0791J3500K3888K5192
$$ -34978 -55949 -17110 -13670 9859 35425 29291 11046 4252 12863 -7928 5572 29460 54652
4259E4652J6591L8268k0653j5580k5973K1435R132k7421k685J7051r096o1764
$$ 54652 71243 109511 88858 73278 47305 68740 77872 50451 47766 64817 55721 -6043
4247f043o0071k3587J1732J444O993J7647K817n369L1377k6637k1734k6782L8511
$$ -6043 -66114 -89701 -77969 -76525 -69532 -51885 -49068 -54437 -23060 -49697 -71431 -98213 -59702
4234e9702J271o784j6217K5545N0703r658j0209K8820O0897P448J2172L1323K84
$$ -59702 -58431 -65215 -81432 -55887 -5184 -14842 -25051 3769 64666 72114 84286 115609 115893
4221A15893l6253j429m6078M259n535k8019k7133j076L2225K4017J5609j5530
$$ 115893 79640 78211 32133 36392 30857 2838 -24295 -25371 6854 30871 46480 30950
4209C0950l0399k3753j4497l9458L2764J6337l1860L6221L5901o3225J9378J4184
$$ 30950 551 -23202 -37699 -77157 -44393 -28056 -59916 -23695 12206 -51019 -31641 -17457
4197a7457r788k2792L675N914J8376l2721m792m2238K2453Q7503K8612J4398K8818
$$ -17457 -27245 -50037 -46362 -40448 -22072 -54793 -59585 -101823 -79370 8133 36745 51143 79961
4184G9961l2438k1792r040K7679j0256n681n4659j1550K8596j0855k9290l1930
$$ 79961 47523 25731 16691 44370 34114 28433 -26226 -37776 -9180 -20035 -49325 -81255
4172h1255N907K625O0447K5862l0252n643J5806K3038K4086j7928l9837k3978
$$ -81255 -75348 -72723 -12276 13586 -16666 -22309 -6503 16535 40621 22693 -17144 -41122
4160d1122k3875j6022L911R2578K8528l0591n0635P706J7373K5209M77j9800n506
$$ -41122 -64997 -81019 -77108 15470 43998 13407 -37228 -29522 -12149 13060 13537 -6263 -11769
4147a1769K2662j0968N387M7831K5727o1978j8294k511l6819n814L1828R306J9897
$$ -11769 10893 -75 5312 53143 78870 16892 -1402 -3913 -40732 -46546 -14718 -5412 14485
4134A4485r119l7244K8614N0585K7669k1678o9773R23J4667J1022j9646p353O5231
$$ 14485 5366 -31878 -3264 47321 74990 53312 -16461 -15538 -871 10151 -9495 -16848 48383
4121D8383N344l3481q702J0297p4625J5375R124O278J6514J3096M703m9867m0806
$$ 48383 53727 20246 11544 21841 -52784 -37409 -28285 -22007 -5493 7603 12306 -37561 -78367
4108g8367l0191L2478O3040o875K4913q806q7390m4483M130M1683J2128L7394
$$ -78367 -108558 -76080 -13040 -19915 4998 -3808 -91198 -135681 -131551 -89868 -77740 -40346
4096d0346P057Q661j6584J2180O9645O185J5406n174j0874K3149j6404R818L281
$$ -40346 -33289 -24628 -41212 -29032 40613 46798 62204 57030 46156 69305 52901 62719 66000
4083F6000n8658O110k5661J3280J8639j8485R271k2238j0864K3870N922R78k6075
$$ 66000 7342 13452 -12209 1071 19710 1225 10496 -11742 -22606 1264 7186 8164 -17911
4070a7911L2729m3632k974J7790j9061M1809K1354r352k3256j7056k3717K0574
$$ -17911 14818 -28814 -31788 -13998 -33059 8750 30104 20752 -2504 -19560 -43277 -22703
4058b2703J4130k1750N09L4817K478j956j493J4014m0579N480k315j4491k5471
$$ -22703 -8573 -30323 -29814 5003 7481 5525 4032 18046 -22533 -17053 -19368 -33859 -59330
4045e9330l7915j0871M7137L3944M6988M0298j3341l4954J363n2375j93J3200
$$ -59330 -97245 -108116 -60979 -27035 19953 60251 46910 11956 13319 -39056 -39249 -26049
4033b6049J552J0117J8836m8145o801L8406K6228j3375m0867l936L6680j346L749
$$ -26049 -24497 -14380 4456 -43689 -50490 -12084 14144 769 -40098 -44034 -7354 -8700 -4951
4020d951P325j0814m3761m8467O0914P2004j8077L1241o223o2771K476J5408L1967
$$ -4951 2374 -8440 -52201 -100668 -39754 32250 14173 45414 39191 -23580 -21104 -5696 26271
4007B6271K1179m0060j4046J9428m185M030L0298K5274J1219j4401m751N4246
$$ 26271 47450 7390 -6656 12772 8587 12617 42915 68189 79408 65007 60256 114502
3995A14502K3292l4743n7757m5666J5721j8108L2429j7947r570O48m0461j9814
$$ 114502 137794 103051 45294 -372 15349 -2759 29670 11723 2153 2801 -37660 -57474
3983e7474K1904q548L040N8330P98K0275K797j808j4134j8279j3240K2234N495
$$ -57474 -35570 -44118 -41078 17252 18050 38325 41122 39314 25180 6901 -6339 15895 21390
3970B1390M2383n0143K4808j7241k4420m6636k8207K7412N2604M3408M5403R549
$$ 21390 63773 13630 38438 21197 -3223 -49859 -78066 -50654 1950 45358 90761 100310
3958A00310n5617j0935k5768j9059Q806j414m7137k7947K5231J8726J9505l586
$$ 100310 44693 33758 7990 -11069 -2263 -3677 -50814 -78761 -53530 -34804 -15299 -18885
3946a8885J2202J2070k5760m0128j3914K1970l3317j4950K6420M0192j0235j0825
$$ -18885 -6683 5387 -20373 -60501 -74415 -52445 -85762 -100712 -74292 -34100 -44335 -55160
3934e5160M6159m2396p2035K4669M0467M2662K9503R86k6998M0491L0766J1017
$$ -55160 -9001 -51397 -123432 -98763 -58296 -15634 13869 14855 -12143 28348 59114 70131
3922G0131l0852k4275j9266M3979j4461K7303r189O087N564l4700j6676Q466R803
$$ 70131 39279 15004 -4262 39717 25256 52559 43370 49457 55021 20321 3645 12111 21914
3909B1914N6190N6403K2918j1762q1920n6401K3575j8730N201n6409k2322M3574
$$ 21914 78104 134507 157425 145663 63743 7342 30917 12187 17388 -39021 -61343 -17769
3897a7769k2254j8966k7618n5216N4763J07743J7999l5029m549j9485k4076m1575
$$ -17769 -40023 -58989 -86607 -141823 -87060 20683 38682 3653 -896 -20381 -44457 -86032
3885h6032j0678K2842M9124M877j2066k3618j0644K9223J9489j986R548K6770
$$ -86032 -96710 -73868 -24744 -19867 -31933 -55551 -66195 -36972 -17483 -19469 -9921 16849
3873A6849q919j2649O401k0461k0091n005J8561L5268j9634l880m8165Q246J9389
$$ 16849 7930 -4719 1682 -18779 -38870 -43875 -25314 9954 -9680 -13560 -61725 -53479 -34090
3860c4090J1435M5639k1168l7391k6408j0120M2899N6259j3631j2971K3777p4327
$$ -34090 -22655 22984 1816 -35575 -61983 -72103 -29204 27055 13424 453 24230 -50097
3848e0097m1270P151K2052L5034J8708L7004j3514l7003J2051M0209J1025j8584
$$ -50097 -91367 -84216 -62164 -27130 -8422 28582 15068 -21935 -9884 30325 41350 22766
3836B2766J208k454n9206l8931P1942j1750r740l9673k3083K873J9635k7N1473
$$ 22766 23974 21520 -37686 -76617 -4675 -16425 -26165 -65838 -88921 -86048 -66413 -66440 -14967
3823a4967L1492j2717J4466J7345k638j9807r461Q693Q590k4001N381N772j0038
$$ -14967 16525 3808 18274 35619 32981 13174 3713 12406 20996 -3005 2376 8148 -1890
3810a890k8025K032J5225P22M1445n4916o1681P8945L4435j8662k1650R748L2407
$$ -1890 -29915 -27883 -12658 -11936 29509 -25407 -87088 -8143 26292 7630 -14020 -4272 28135
3797B8135K225l958j8356j6632j8354J1460L2388k4824L8326L6523k9300k7621
$$ 28135 30360 26402 8046 -8586 -26940 -15480 16908 -7916 30410 66933 37633 10012
3785A0012l2144L6266L7723j8655N64M6996K5445j9434o8783l2454L0537j7005
$$ 10012 -22132 14134 51857 33202 33766 80762 106207 86773 17990 -14464 16073 -932
3773i32p0758k8108M8494m304K3600O2303L4890k3150k3696J3781k1167Q085L7710
$$ -932 -71690 -99798 -51304 -55608 -32008 30295 65185 42035 18339 32120 10953 19038 56748
3760E6748L783r384m8111K2923l708J7275j9700l0502J3662L0005l1772k9260
$$ 56748 60531 51147 3036 25959 22251 39526 19826 -10676 2986 32991 1219 -28041
3748b8041r293k5671K5870P2173Q2842j1244p3904l6120l4614k9749k8274K845
$$ -28041 -37334 -63005 -37135 35038 117880 106636 32732 -3388 -38002 -67751 -96025 -93180
3736i3180L7895L3248r819l2437N3669j525r930P7185l8814m2901l239j055J992
$$ -93180 -55285 -22037 -31856 -64293 -10624 -12149 -22079 55106 16292 -26609 -29848 -30903 -28911
3723b8911j0041k9501J4922L4174N990l8981L618P7276l2802n0965L490k9518
$$ -28911 -38952 -68453 -53531 -19357 -13367 -52348 -48730 28546 -4256 -55221 -51731 -81249
3711h1249K5313K8718r723K1654O6866K3126l4021m8462j4336o4271Q2458o236
$$ -81249 -55936 -27218 -36941 -15287 51579 74705 40684 -7778 -22114 -86385 -3927 -10163
3699a0163o9490j9651j7502N8964P0658n5970n755J1491q665J0750K4382J4841
$$ -10163 -79653 -99304 -116806 -57842 12816 -43154 -48909 -37418 -46083 -35333 -10951 3890
3687C890L3785L0445m9280j4514k2192J0320m155l138R908k0045m3597J5570Q248
$$ 3890 37675 68120 18840 4326 -17866 -7546 -11701 -14839 -4931 -24976 -68573 -53003 -44755
3674d4755J5208J5022j718J2082l586M9565k6235L424j6300m2007J7721M8857
$$ -44755 -29547 -14525 -16243 -4161 -7747 41818 15583 19007 2707 -39300 -21579 27278
3662B7278L5304j901L856q748k1520l5721K2456m596n5430n0337J2756N0817l6939
$$ 27278 62582 60681 64537 55789 34269 -1452 21004 16408 -39022 -89359 -76603 -25786 -62725
3649f2725j4583J8884M5674K5575m8682R088K2332o546M5290J9033K9173M5216
$$ -62725 -77308 -58424 -12750 12825 -35857 -26769 -4437 -10983 34307 53340 82513 127729
3637A27729m7320n2607l2242m2501q4281K3760O8755K7644j8950k1437j3078J5290
$$ 127729 80409 27802 -4440 -46941 -131222 -107462 -38707 -11063 -30013 -51450 -64528 -49238
3625d9238K8268J1947O6160J0356m0613m8019R825j8584J3723j811p300l777j8599
$$ -49238 -20970 -9023 57137 67493 26880 -21139 -11314 -29898 -16175 -17986 -25286 -29063 -47662
3612d7662J6570L702j4501k064J3621N9294J7207n8994R236P6215Q517j6258K2577
$$ -47662 -31092 -27390 -41891 -43955 -30334 28960 46167 -12827 -3591 72624 81141 64883 87460
3599H7460J7001o5323M044K1438J5024K9352K0221j3090l8448k8307n7496p830
$$ 87460 104461 39138 43182 64620 79644 108996 129217 116127 77679 49372 -8124 -15954
3587a5954L1688J9522q358K0284j5018p3998m5793L512M4899q803j3871K9944
$$ -15954 15734 35256 26898 47182 32164 -41834 -87627 -84115 -39216 -48019 -61890 -31946
3575c1946L8597j0661k489K3190p53j5598L0275J8657n7060l5506o915L5789J1732
$$ -31946 6651 -4010 -6499 16691 15938 340 30615 49272 -7788 -43294 -50209 -14420 -2688
3562b688M306J7104N260l1835K2000O844k0821j5126j9440m2383k5697Q6985r183
$$ -2688 1618 18722 23982 -7853 14147 20991 170 -14956 -34396 -76779 -102476 -15491 -24674
3549b4674l7050l1207M2659L7665J5783L626K7016n2321l0507R0658q619J8487
$$ -24674 -61724 -92931 -50272 -12607 3176 6802 33818 -18503 -49010 41648 33029 51516
3537E1516j5426n0917r969J9058l3034k1769M8680K9922l6850K1803M0938m4500
$$ 51516 36090 -14827 -24796 -5738 -38772 -60541 -11861 18061 -18789 3014 43952 -548
3525e48K0484P1803l0801k6170r926j7287n642p6183m8204Q0013P3665L1651K2843
$$ -548 19936 91739 60938 34768 24842 7555 1913 -74270 -122474 -42461 31204 62855 85698
3512H5698j1417M125m1557o3075K1466N2819N437n2387o673N968k3323L4807L7352
$$ 85698 74281 78406 36849 -26226 -4760 48059 53496 1109 -5564 404 -22919 11888 49240
3499D9240m422O2536M5377m1621l8537n6308N608o414l5197r123J0140N1293J0800
$$ 49240 44818 107354 152731 111110 72573 16265 21873 15459 -19738 -28861 -18721 32572 43372
3486D3372L630j0293k3840j5235J0183l9195k2117O6150M5730n0474n6303l0631
$$ 43372 47002 36709 12869 -2366 7817 -31378 -53495 12655 58385 7911 -48392 -79023
3474g9023l2951p568N1538M2193P0930J7506j6507l3349n944r326J6068m7285
$$ -79023 -111974 -119542 -68004 -25811 45119 62625 46118 12769 6825 -2501 13567 -33718
3462c3718J1429J2312Q059K7439K3514k1824n8506j8241J885J1332l415J6518
$$ -33718 -22289 -9977 -1918 25521 49035 27211 -31295 -49536 -47651 -36319 -39734 -23216
3450b3216J165o679J2892L2203k911o8237n0694L9498L0860Q007l5338m1725K6006
$$ -23216 -22051 -28730 -15838 16365 13454 -54783 -105477 -65979 -35119 -27112 -62450 -104175 -78169
3437g8169m346K3837L5309n400j6154J1543K7197o7618N0702J6713j2164N6505
$$ -78169 -82515 -58678 -23369 -28769 -44923 -33380 -6183 -73801 -23099 -6386 -18550 37955
3425C7955P464j4534k4549M6517R917K3406q0022o0794K4174l8240j4834J4518
$$ 37955 45419 30885 6336 52853 62770 86176 6154 -54640 -30466 -68706 -83540 -69022
3413f9022p152P3247P124j4094n9172K9078k0142j3007k151K0870K8330L4614
$$ -69022 -76174 -2927 4197 -9897 -69069 -39991 -60133 -73140 -75291 -54421 -26091 8523
3401H523L8646k275j8373q022j8868m572J2281J8428Q676m1934j3050k3755P008
$$ 8523 47169 44894 26521 18499 -369 -4941 7340 25768 34444 -7490 -20540 -44295 -37287
3388c7287j5542k9831J3896J3099N1321M8502P668l2238R413J0456l634k0534
$$ -37287 -52829 -82660 -68764 -55665 -4344 44158 51826 19588 29001 39457 35823 15289
3376A5289j1753J3581P6854N7537j7777r2307n6300N607K7536L3721R950j6867
$$ 15289 3536 17117 93971 151508 133731 41424 -14876 -9269 18267 51988 61938 45071
3364D5071N273j9130k7457l5304M3500K6748m4059n9868K2732L7013M0638Q591
$$ 45071 50344 31214 3757 -31547 11953 38701 -5358 -65226 -42494 -5481 35157 43748
3352D3748K2518k5921q037k8758l8082r776o739K0978K0614K0305l531K6447M3503
$$ 43748 66266 40345 32308 3550 -34532 -44308 -51047 -30069 -9455 10850 7319 33766 77269
3339G7269k4900p1490L5594K7289L258k4753J8842K6006q4351l6963J7107K4210
$$ 77269 52369 -19121 16473 43762 47020 22267 41109 67115 -17236 -54199 -37092 -12882
3327a2882k4764O7313k3264l3335J7964M2610J5633J2769N6615p7982l9870L5801
$$ -12882 -37646 29667 6403 -26932 -8968 33642 49275 62044 118659 40677 807 36608
3315C6608j5924j092J3010j0064J8147p182J9777j3335o8569J2994J8771O2413
$$ 36608 20684 19592 32602 22538 40685 33503 53280 39945 -28624 -15630 3141 65554
3303F5554K6886l1870k0365l1253k9148l3588l9225J180J3148O0012L5519k2427
$$ 65554 92440 60570 40205 8952 -20196 -53784 -93009 -91829 -78681 -18669 16850 -5577
3291e577j8572K7768J0384L3961J766l0196J5703J2001k8609j3988j1748J8736
$$ -5577 -24149 3619 14003 47964 49730 19534 35237 47238 18629 4641 -7107 11629
3279A1629K4428k0041l7898P460k0944l96K3935J456k208l3084L3181J365J9743
$$ 11629 36057 16016 -21882 -14422 -35366 -35762 -11827 -10371 -12579 -45663 -12482 -11117 8626
3266H626J1892l3573k7564j7747m552K3613L2333J1768K4777N0195K6396j6666
$$ 8626 20518 -13055 -40619 -58366 -62918 -39305 -6972 4796 29573 79768 106164 89498
3254H9498l7049o0693j8898K807r498J9554j5818n2202r898K6816J6739J5263
$$ 89498 52449 -8244 -27142 -24335 -33833 -14279 -30097 -82299 -92197 -65381 -48642 -33379
3242c3379N0478L3013P886l8916j0637m721L1251l8918n3170J5158J8592J1594
$$ -33379 17099 50112 57998 19082 8445 3724 34975 -3943 -57113 -41955 -23363 -11769
3230a1769k1877k853k0121r005L2466K56l768j702o302l5675L1493M4772N1140
$$ -11769 -33646 -36499 -56620 -65625 -33159 -32903 -36671 -38373 -44675 -80350 -48857 -4085 47055
3217D7055J5004l2415k6182k66k2881L1389l3852l3668k49Q2918L2015l1824n7616
$$ 47055 62059 29644 3462 3196 -19685 11704 -22148 -55816 -56065 26853 58868 27044 -30572
3204c0572k6853J74L7789O231M1201q926M0164q291l7223n6850J3874P377K6382
$$ -30572 -57425 -57251 -19462 -13231 27970 19044 59208 50917 13694 -43156 -29282 -21905 4477
3191D477J04847k0322q0112m0853K190K8616K1543j6672j303J3162M474l8577
$$ 4477 109324 89002 8890 -31963 -29773 -1157 20386 3714 2411 15573 20047 -18530
3179a8530j2546L5680j6044l6588M6379M3099P57q41l9659Q559P51K8315k901
$$ -18530 -31076 4604 -11440 -48028 -1649 41450 42207 41366 1707 10266 11017 39332 36431
3166C6431j253k8647m9710j7622k7699q685N646L3122L9717O2043K0694l51l3368
$$ 36431 35178 6531 -43179 -60801 -88500 -97185 -91539 -58417 -18700 43343 64037 63686 30318
3153C0318k8069J5005J9381l9656k7305L700j829r085J0177J0064L700J6932M646
$$ 30318 2249 17254 36635 -3021 -30326 -26626 -28455 -37540 -27363 -17299 -13599 3333 7979
3140G979K9003J0267j4808l3583n7041q228J9578k5928K6597k1984M903L4651
$$ 7979 36982 47249 32441 -1142 -58183 -66411 -46833 -72761 -46164 -68148 -63245 -28594
3128b8594l449N036M321M2096l926R677J7001l16k8743n879P75O69K6748l936
$$ -28594 -32043 -27007 -22686 19410 15484 25161 42162 41846 13103 7224 7999 8668 35416 31480
3114C1480k7496j5668m028L7277m1467M290K4858N0963M214j6789j0707j2876
$$ 31480 3984 -11684 -15712 21565 -19902 -15612 9246 60209 64423 47634 36927 24051
3102B4051j0093k8906L1148M7240J5916K6968J3251m7535n4130j2215L0056k4496
$$ 24051 13958 -14948 16200 63440 79356 106324 119575 72040 17910 5695 35751 11255
3090A1255n9173K9282j1198m293L2190K452J7235N068K8633l8310k1783M0853
$$ 11255 -47918 -18636 -29834 -34127 -1937 515 17750 22818 51451 13141 -8642 32211
3078C2211l8116k8101J863K3265K2458P643l2617j4706j2808J7358L2124j7535
$$ 32211 -5905 -34006 -32143 -8878 13580 21223 -11394 -26100 -38908 -21550 10574 -6961
3066f961l52R031J5676L1445K0799m5329K529L8132M799o7511m9873l072O082
$$ -6961 -7313 1718 17394 48839 69638 24309 26838 64970 69769 2258 -47615 -50687 -44605
3053d4605J4628J4147M677j612J9443l709k6078m5858k4089M4733M4031K6827
$$ -44605 -29977 -15830 -11153 -12765 6678 2969 -23109 -68967 -93056 -48323 -4292 22535
3041B2535J0163j6159k1326j9174j1335L1839O4395P054j9833k3374l8986P940
$$ 22535 32698 16539 -4787 -23961 -35296 -3457 60938 67992 48159 24785 -14201 -6261
3029f261J7048o668p559k8799j4414o607J6454L8395N922K8902L7337j3681j4642
$$ -6261 10787 4119 -3440 -32239 -46653 -53260 -36806 1589 7511 36413 73750 60069 45427
3016D5427n5119p227k3276N5401j582j2925O623L5642M685j2511R179p0446l2840
$$ 45427 -9692 -16919 -40195 15206 13624 699 7322 42964 47649 35138 44317 -26129 -58969
3003e8969J1567l1603o099K7978L9571J6291K7684J9347j8337k3265k600n026
$$ -58969 -47402 -79005 -85104 -57126 -17555 -1264 26420 45767 27430 4165 1565 -3461
$$ [...]
##END NTUPLES=NMR SPECTRUM
##END=
