##TITLE=Analysis number 329995
Compound Code cc 58613
Book Reference 528/68
Project Code adrs
Chemist Name davee
##JCAMPDX= 6.0         $$ Bruker NMR JCAMP-DX V2.0
##DATA TYPE= NMR SPECTRUM
##DATA CLASS= NTUPLES
##ORIGIN= Bruker BioSpin GmbH
##OWNER= nmr
$$ XWIN-NMR		Version 3.5
$$ Thu Oct 18 09:40:14 2007 GMT Daylight Time (UT+1h)  MAYBRIDGE\nmr@NMR_250MHZ
##.OBSERVE FREQUENCY= 250.131544655141
##.OBSERVE NUCLEUS= ^1H
##.ACQUISITION MODE= SIMULTANEOUS (DQD)
##.ACQUISITION SCHEME= undefined
##.AVERAGES= 16
##.DIGITISER RES= 18
##SPECTROMETER/DATA SYSTEM= dpx250
##.PULSE SEQUENCE= zg30
##.SOLVENT NAME= CDCl3
##.SHIFT REFERENCE= (INTERNAL, CDCl3, 0, 16.4602)
##AUDIT TRAIL= $$ (NUMBER, WHEN, WHO, WHERE, WHAT)
$$ ##TITLE= Audit trail, XWIN-NMR		Version 3.5
$$ ##JCAMPDX= 5.01
$$ ##ORIGIN= Bruker BioSpin GmbH
$$ ##OWNER= nmr
$$ C:\u/data/dgb/nmr/ADRS/910/pdata/1/auditp.txt
$$ ##AUDIT TRAIL=  $$ (NUMBER, WHEN, WHO, WHERE, WHAT)
(   1,<2007-10-18 09:39:29.48 +100>,<MAYBRIDGE\nmr>,<NMR_250MHZ>,
      <created by zg, POWCHK disabled, PULCHK disabled
       configuration hash MD5:
       76 6E 9A 78 1E 09 19 81 EC 84 63 8F B0 6A 59 2D
       data hash MD5: 64K
       00 33 46 40 80 4A 95 EE 3F A1 2F 60 BD 96 10 1E>)
(   2,<2007-10-18 09:39:50.23 +100>,<MAYBRIDGE\nmr>,<NMR_250MHZ>,
      <Start of raw data processing
       ef LB = 0.3 FT_mod = 6 PKNL = 1 SI = 32K 
       data hash MD5: 32K
       15 0A 9F 87 53 7C B5 43 9E 51 D1 10 23 71 CB 7C>)
(   3,<2007-10-18 09:39:55.01 +100>,<MAYBRIDGE\nmr>,<NMR_250MHZ>,
      <apk 
       data hash MD5: 32K
       AC D4 8B AE 4D 44 26 DA 44 47 84 AB C1 1D 9A 38>)
(   4,<2007-10-18 09:39:56.57 +100>,<MAYBRIDGE\nmr>,<NMR_250MHZ>,
      <abs ABSG = 5 
       data hash MD5: 32K
       87 83 38 7C B2 8D 90 91 13 6E 49 CE 4A 8F 5E 04>)
$$ ##END=
$$ 
$$ hash MD5
$$ 0A E8 E3 27 D1 23 F2 01 D8 FE AF 4F 18 F9 C4 B1
##$RELAX= 
##$RELAX= 
##$RELAX= 
##$RELAX= 
##$RELAX= 
##$RELAX= 
##$RELAX= 
$$ Bruker specific parameters
$$ --------------------------
##$DU= <C:\u>
##$EXPNO= 910
##$NAME= <ADRS>
##$PROCNO= 1
##$TYPE= <nmr>
##$USER= <dgb>
##$AMP= (0..31)
100 100 100 100 100 100 100 100 100 100 100 100 100 100 100 100 100 100 
100 100 100 100 100 100 100 100 100 100 100 100 100 100 
##$AQSEQ= 0
##$AQ_mod= 3
##$AUNM= <au_zg>
##$AUTOPOS= <4 >
##$BF1= 250.13
##$BF2= 250.13
##$BF3= 250.13
##$BF4= 250.13
##$BF5= 500.13
##$BF6= 500.13
##$BF7= 500.13
##$BF8= 500.13
##$BYTORDA= 1
##$CFDGTYP= 0
##$CFRGTYP= 5
##$CHEMSTR= <none>
##$CNST= (0..31)
1 1 145 1 1 1 1 1 1 1 1 1 1 1 1 1 1 1 1 1 1 1 1 1 1 1 1 1 1 1 1 1 
##$CPDPRG= <>
##$CPDPRG1= <>
##$CPDPRG2= <>
##$CPDPRG3= <>
##$CPDPRG4= <mlev>
##$CPDPRG5= <mlev>
##$CPDPRG6= <mlev>
##$CPDPRG7= <mlev>
##$CPDPRG8= <mlev>
##$CPDPRGB= <>
##$CPDPRGT= <>
##$D= (0..31)
0 1 0 0 0 0 0 0 0 0.06 0 0 0 0 0 0 0.0002 0 0 0 0 0 0 0 0 0 0 0 0 0 0 
0 
##$DATE= 1192696767
##$DBL= (0..7)
120 120 120 120 120 120 120 120 
##$DBP= (0..7)
150 150 150 150 150 150 150 150 
##$DBP07= 0
##$DBPNAM0= <>
##$DBPNAM1= <>
$$ [...]
##$SUBNAM7= <"">
##$SUBNAM8= <"">
##$SUBNAM9= <"">
##$SW= 20.6930455092707
##$SWIBOX= (0..15)
0 0 3 0 0 0 0 0 0 0 0 0 0 0 0 0 
##$SW_h= 5175.983436853
##$TD= 65536
##$TD0= 1
##$TE= 295.16
##$TE2= 300
##$TE3= 300
##$TEG= 300
##$TL= (0..7)
0 120 120 120 120 120 120 120 
##$TP= (0..7)
150 150 150 150 150 150 150 150 
##$TP07= 0
##$TPNAME0= <>
##$TPNAME1= <>
##$TPNAME2= <>
##$TPNAME3= <>
##$TPNAME4= <>
##$TPNAME5= <>
##$TPNAME6= <>
##$TPNAME7= <>
##$TPOAL= (0..7)
0.5 0.5 0.5 0.5 0.5 0.5 0.5 0.5 
##$TPOFFS= (0..7)
0 0 0 0 0 0 0 0 
##$TUNHIN= 0
##$TUNHOUT= 0
##$TUNXOUT= 0
##$USERA1= <user>
##$USERA2= <user>
##$USERA3= <user>
##$USERA4= <user>
##$USERA5= <user>
##$V9= 5
##$VALIST= <valist>
##$VCLIST= <CCCCCCCCCCCCCCC>
##$VD= 0
##$VDLIST= <DDDDDDDDDDDDDDD>
##$VPLIST= <PPPPPPPPPPPPPPP>
##$VTLIST= <TTTTTTTTTTTTTTT>
##$WBST= 1024
##$WBSW= 4
##$XGAIN= (0..3)
0 0 0 0 
##$XL= 0
##$YL= 0
##$YMAX_a= 432759
##$YMIN_a= -504413
##$ZGOPTNS= <>
##$ZL1= 120
##$ZL2= 120
##$ZL3= 120
##$ZL4= 120
##$ABSF1= 16.46016
##$ABSF2= -4.233013
##$ABSG= 5
##$ABSL= 3
##$ALPHA= 0
##$AQORDER= 0
##$ASSFAC= 0
##$ASSFACI= 0
##$ASSFACX= 0
##$ASSWID= 0
##$AUNMP= <proc_1d>
##$AZFE= 0.1
##$AZFW= 0.1
##$BCFW= 0
##$BC_mod= 0
##$BYTORDP= 0
##$COROFFS= 0
##$CY= 12.5
##$DATMOD= 1
##$DC= 0
##$DFILT= <>
##$DTYPP= 0
##$F1P= 14.0000005364418
##$F2P= -0.99999901652339
##$FCOR= 0.5
##$FTSIZE= 32768
##$FT_mod= 6
##$GAMMA= 0
##$GB= 0
##$INTBC= 1
##$INTSCL= 1
##$ISEN= 128
##$LB= 0.3
##$LEV0= 0
##$LPBIN= 0
##$MAXI= 10000
##$MC2= 0
##$MEAN= 0
##$ME_mod= 0
##$MI= 0
##$NCOEF= 0
##$NC_proc= -3
##$NLEV= 6
##$NOISF1= 0
##$NOISF2= 0
##$NSP= 0
##$NTH_PI= 0
##$NZP= 0
##$OFFSET= 16.46016
##$PC= 1
##$PHC0= 158.6616
##$PHC1= 4.902646
##$PH_mod= 1
##$PKNL= yes
##$PPARMOD= 0
##$PSCAL= 4
##$PSIGN= 0
##$REVERSE= no
##$SF= 250.13001546578
##$SI= 32768
##$SIGF1= 0
##$SIGF2= 0
##$SINO= 400
##$SIOLD= 32768
##$SREGLST= <1H.CDCl3>
##$SSB= 0
##$STSI= 32768
##$STSR= 0
##$SW_p= 5175.98343685301
##$SYMM= 0
##$S_DEV= 0
##$TDeff= 65536
##$TDoff= 0
##$TI= <Analysis number 999999
Compound Code 99
Book Reference 9
Project Code 9>
##$TILT= no
##$TM1= 0
##$TM2= 0
##$TOPLEV= 0
##$USERP1= <user>
##$USERP2= <user>
##$USERP3= <user>
##$USERP4= <user>
##$USERP5= <user>
##$WDW= 1
##$XDIM= 32768
##$YMAX_p= 388624487
##$YMIN_p= -115431
$$ End of Bruker specific parameters
$$ ---------------------------------
##NTUPLES= NMR SPECTRUM
##VAR_NAME=  FREQUENCY,     SPECTRUM/REAL,   SPECTRUM/IMAG
##SYMBOL=    X,             R,               I
##VAR_TYPE=  INDEPENDENT,   DEPENDENT,       DEPENDENT
##VAR_FORM=  AFFN,          ASDF,            ASDF
##VAR_DIM=   32768,         32768,           32768
##UNITS=     HZ,            ARBITRARY UNITS, ARBITRARY UNITS
##FACTOR=    0.157963299565203, 1,           1
##FIRST=     4117.17990071788, 0,            0
##LAST=      -1058.80353613513, 0,           0
##MIN=       -1058.80353613513, -115431,     0
##MAX=       4117.17990071788, 388624487,    0
$$ Real data points
##PAGE= N=1
##DATA TABLE= (X++(R..R)), XYDATA
$$ [...]
16399c5537M8589J4306j323P122p697k1245l842j0082L350j2738o572L2437j279
$$ -35537 13052 27358 26035 33157 25460 4215 373 -9709 -6359 -19097 -25669 6768 5489
16386E489j2468K775R133J6017j3986L256M04j049M37K6752P492l5683l4216j331
$$ 5489 -6979 -4204 4929 20946 6960 10216 10620 9571 10008 36760 44252 8569 -25647 -26978
16372b6978k4543l358M8770P990m952p902O685p14j4560j8622n236k0480k0125
$$ -26978 -51521 -54879 -6109 1881 -3071 -10973 -4288 -5002 -19562 -38184 -43420 -63900 -84025
16359h4025j4551M964J9687K7665M4755P811J0167N725j672J6730N850l3078k2608
$$ -84025 -98576 -93612 -73925 -46260 -1505 6306 16473 22198 20526 37256 43106 10028 -12580
16346a2580j581j105j2747P59k0283K5232K0145r253K339K210j6359N419j137
$$ -12580 -14161 -15266 -28013 -27254 -47537 -22305 -2160 -11413 -9074 -6864 -23223 -17804 -18941
16333a8941J5730l1199k2439m888K2000J0158J560L0342J7702k6590j3305j1066
$$ -18941 -3211 -34410 -56849 -61737 -39737 -29579 -28019 2323 20025 -6565 -19870 -30936
16321c0936J1494K3454n28j5854k6977K847N36r11K5934J3441j6455j5710J0160
$$ -30936 -19442 4012 3484 -12370 -39347 -36500 -35964 -36875 -10941 2500 -13955 -29665 -19505
16308a9505J0122q49j5871k5052j085J0576K7526J8738J2060K1183O736k0410
$$ -19505 -9383 -10232 -26103 -51155 -52240 -41664 -14138 4600 16660 37843 44579 24169
16296B4169k6983M40p034J3685J3070j5128l0164k989K5597J1212J681K917o696
$$ 24169 -2814 -2374 -9408 4277 17347 2219 -27945 -30934 -5337 5875 7556 10473 3777
16283C777r925k0120M055J1127K6495o375Q078Q570j7890k4955K2914j8945j9129
$$ 3777 -6148 -26268 -22213 -11086 15409 9034 17112 25682 7792 -17163 5751 -13194 -32323
16270c2323j0189l9476O51l787R584O590P092K4534p16N26K3522k0432J4761M404
$$ -32323 -42512 -81988 -81337 -85124 -75540 -68950 -61858 -37324 -38040 -37514 -13992 -34424 -19663 -15259
16256a5259l1565L093K9397R906J9093J0639j7195l1490m7569M0447M4151n409
$$ -15259 -46824 -43731 -14334 -4428 14665 25304 8109 -23381 -70950 -30503 13648 8239
16244H239j1325p985l3078O614J1506K2269Q770j3257J8217J1977k3645p452P620
$$ 8239 -3086 -11071 -44149 -37535 -26029 -3760 5010 -8247 9970 21947 -1698 -9150 -1530
16231a530j9845o663k7391j3821K3740Q663K6223L6580M36m162j6479O124j4079
$$ -1530 -21375 -28038 -55429 -69250 -45510 -36847 -10624 25956 26392 22230 5751 11875 -2204
16218b204o95k8912l5202m844K2764J7466N966j5985j3940K7044o393o291J7714
$$ -2204 -2899 -31811 -67013 -71857 -49093 -31627 -25661 -41646 -55586 -28542 -34935 -41226 -23512
16205b3512Q229k5924m568o843o56P521J3478K5781K3866j7499k6763r045j9103
$$ -23512 -15283 -41207 -45775 -52618 -53274 -45753 -32275 -6494 17372 -127 -26890 -35935 -55038
16192e5038K6174J9013k2041q752Q402j2410J4367R375J0142K163p137r804o854
$$ -55038 -28864 -9851 -31892 -40644 -32242 -44652 -30285 -20910 -10768 -8605 -15742 -25546 -32400
16179c2400j548K9890K2456r934R502K6574l0737l6862k2427J7770J1384j3768
$$ -32400 -33948 -4058 18398 8464 17966 44540 13803 -23059 -45486 -27716 -16332 -30100
16167c0100J5788J5383k1071k7243K11J6372l07N97L959J0689J3233p697j375
$$ -30100 -14312 1071 -20000 -47243 -47032 -30660 -30967 -30370 -26411 -15722 -2489 -10186 -11561
16154a1561P79j4099m197J7430l206j1494Q711j1556j2306j5409J2841k830j1976
$$ -11561 -10782 -24881 -29078 -11648 -14854 -26348 -17637 -29193 -41499 -56908 -44067 -46897 -58873
16141e8873K3001L1233J4493k5034j2832j6281k5336N3934L3080r070Q770R806
$$ -58873 -35872 -4639 9854 -15180 -28012 -44293 -69629 -15695 17385 8315 17085 26891
16129B6891m463q317k1827k5089n1L0691J6236j3419J0925J3839l730l7609j6810
$$ 26891 22428 14111 -7716 -32805 -32856 -2165 14071 652 11577 25416 21686 -15923 -32733
16116c2733j8782k2659o237K9287K7007J6979R638J6023J461j8459k3483J2595
$$ -32733 -51515 -74174 -80411 -51124 -24117 -7138 2500 18523 19984 1525 -21958 -9363
16104i363J4445k907m985j5798j0021R538K6670L7473J4374j3643k4816j5369
$$ -9363 5082 2175 -2810 -18608 -28629 -19091 7579 45052 59426 45783 20967 5598
16092E598J9802j1214k8938j7478J3281J6248k1899R299j75l3048j8777L5969
$$ 5598 25400 14186 -14752 -32230 -18949 -2701 -24600 -15301 -15476 -48524 -67301 -31332
16080c1332O566J9267K426R058J0946q374J3632Q907j8858j9315k0126q971l907
$$ -31332 -24766 -5499 -3073 5985 16931 8557 22189 31096 12238 -7077 -27203 -36174 -40081
16067d0081j3536j88L0860K5954m6849k1208J313k6252P602Q990J0455J5959J5976
$$ -40081 -53617 -53805 -22945 3009 -43840 -65048 -63735 -89987 -82385 -73395 -62940 -46981 -31005
16054c1005Q639m692K9891j2356m0060q779L880J7370N728J3007j2680j0321k0725
$$ -31005 -22366 -27058 2833 -9523 -49583 -58362 -54482 -37112 -31384 -18377 -31057 -41378 -62103
16041f2103J0003L5906K1399J038j1806j4342K145k605k9005k4069K7895J9497
$$ -62103 -52100 -16194 5205 6243 -5563 -19905 -17760 -20365 -49370 -73439 -45544 -26047
16029b6047L161j412n607M618k782O085o157k695k9068j7746J8446J4623K6203
$$ -26047 -22886 -24298 -29905 -25287 -28069 -21984 -28141 -30836 -59904 -77650 -59204 -44581 -18378
16016a8378R763P747R952o252j3741J507J2331l908K1711J4315k1165p500L6746
$$ -18378 -8615 -868 9084 2832 -10909 -9402 2929 -979 20732 35047 13882 6382 43128
16003D3128j6594J023l3858j8997N920J7365J8983P842P139j4211j1154l6575
$$ 43128 26534 27557 -6301 -25298 -19378 -2013 16970 24812 31951 17740 6586 -29989
15991b9989O955J7146K1214j1273P53J4209K966M14o841j0482M819J0373K518
$$ -29989 -23034 -5888 15326 4053 4806 19015 21981 22395 15554 5072 9891 20264 22782
15978B2782j8884Q311j8203j5006N825N467k507J7810J3624j5914m3308j5873
$$ 22782 3898 12209 -5994 -21000 -15175 -9708 -12215 5595 19219 3305 -40003 -55876
15966e5876J4953M6725L115k3313m913p319j5056R801L0589j950P656k3351j8728
$$ -55876 -40923 5802 8917 -14396 -19309 -26628 -41684 -31883 -1294 -3244 4412 -18939 -37667
15953c7667N198K0569K6961O724j4306l6517l675K2253Q423o7k5612K0976P005
$$ -37667 -32469 -11900 15061 21785 7479 -29038 -32713 -10460 -2037 -2104 -27716 -6740 265
15940B65j1731L808N1509K943l9872j8510l8899j0317J4483J0006J1906K9678
$$ 265 -11466 -7658 43851 46794 6922 -11588 -50487 -60804 -46321 -36315 -24409 5269
15928E269J0149r508k8771J5690j2962r470J6302j3109j928j8911L706K3320L4356
$$ 5269 15418 5910 -22861 -7171 -20133 -29603 -13301 -26410 -28338 -47249 -43543 -20223 14133
15915A4133J2587k6809j5408K4782K8072j5661l0696l6811k6829n08K7371L6250
$$ 14133 26720 -89 -15497 9285 37357 21696 -9000 -45811 -72640 -73148 -45777 -9527
15903i527m47j8853k3765L026J45J7899J4724j1311m061J4386k6395Q885K0555
$$ -9527 -9974 -28827 -52592 -49566 -49421 -31522 -16798 -28109 -32170 -17784 -44179 -35294 -14739
15890a4739L1034o550r187l240j834J2076J1934q372j8553k5765k33K0086L1492
$$ -14739 16295 9745 558 -2682 -4516 7560 19494 11122 -7431 -33196 -33429 -13343 18149
15877A8149j5585m806K1019J2208K9729q399k9795j6545n107J7597k2550n542
$$ 18149 2564 -2242 18777 30985 60714 52315 22520 5975 868 18465 -4085 -9627
15865i627k055q603q944k405m390K5790J2074J147j4187l1838j5928J4117J0842
$$ -9627 -11682 -20285 -29229 -31634 -36024 -10234 1840 2987 -11200 -43038 -58966 -44849 -34007
15852c4007m2323j6723K4026J9794L12o003j6891J9788J0950Q501K1482P547J232
$$ -34007 -76330 -93053 -69027 -49233 -48921 -54924 -71815 -52027 -41077 -32576 -11094 -3547 -2315
15839b315l2730k0857P266K4211J8177P12q656J250l3952k4967R358K3859K6851
$$ -2315 -35045 -55902 -48636 -24425 -6248 -5536 -14192 -12942 -46894 -71861 -62503 -38644 -11793
15826a1793J2874l2619m963J6485J8883K9372N192m2626k1512K7546J7093p33
$$ -11793 1081 -31538 -36501 -20016 -1133 28239 33431 -9195 -30707 -3161 13932 13199
15814A3199R938n351k4538j2675J215J8715l678M67M779j5340P45J257J1312J4829
$$ 13199 23137 17786 -6752 -19427 -18212 503 -3175 -2708 2071 -13269 -12524 -11267 45 14874
15800A4874j8926M917J6165l759k4820l233m572J332n20L5247o115k4648j4279
$$ 14874 -4052 865 17030 13271 -11549 -14782 -19354 -18022 -18542 16705 10590 -14058 -28337
15787b8337M639K3852j0048R705j580K0111M0488j3609q536j7506n513j0280j5544
$$ -28337 -23698 154 -9894 -189 -1769 18342 58830 45221 36685 19179 13666 3386 -12158
15774a2158J0650K3853K546r922j0779J4105j0766J5768O52k1112k7149P156K7353
$$ -12158 -1508 22345 24891 14969 4190 18295 7529 23297 23949 2837 -24312 -17156 10197
15761A0197k0665J9076K0758n595m440l6797m5196L803K0700M185Q725r400j5757
$$ 10197 -10468 8608 29366 23771 19331 -17466 -62662 -58859 -38159 -33974 -25249 -34649 -50406
15748e0406R555K5898L9533m926l5200o972K881O844K2547N647l0535J0207K3352
$$ -50406 -40851 -14953 24580 19654 -15546 -22518 -19637 -12793 9754 15401 -15134 -4927 18425
15735A8425j5019j4405J2744L3504k536l0504k1923J9934o084k6412j9639j2695
$$ 18425 3406 -10999 1745 35249 32713 2209 -19714 220 -5864 -32276 -51915 -64610
15723f4610L7783K3441p843m53N07k643J3317O566j944k503J5050Q359k6230J607
$$ -64610 -26827 -3386 -11229 -11682 -11175 -13818 -501 6065 4121 1618 16668 25027 -1203 404
15709D04J1496N115J3635j9271l8436M623J6043J7101q0R44L603R760K1082k4776
$$ 404 11900 17015 30650 11379 -27057 -22434 -6391 10710 10630 11574 15177 24937 46019 21243
15695B1243J7439q266j538J0799K014n330J0507k0723M548J4679k620k7975p038
$$ 21243 38682 30416 28878 39677 41691 36361 46868 26145 30693 45372 42752 14777 7739
15682G739p547m1624j0428K3178k098K016M5985R599J932P863l4915m0661l2524
$$ 7739 192 -41432 -51860 -28682 -30780 -28764 17221 26820 28752 36615 1700 -38961 -71485
15669g1485J8905L7387K091k320j8395J860K0987L2094M222j5132k1007Q447P447
$$ -71485 -52580 -15193 -13102 -15422 -33817 -31957 -10970 21124 25346 10214 -10793 -2346 5101
15656E101j2261q236O0R651J5871o059j6652k5144K2226J3334j6207j8961K1760
$$ 5101 -7160 -15396 -15336 -5685 10186 4127 -12525 -37669 -15443 -2109 -18316 -37277 -15517
15643a5517L1642O76j8962j5554r539R046J2834P286j1825P599P980L0946K2826
$$ -15517 16125 16801 -2161 -17715 -27254 -18208 -5374 1912 -9913 -2314 5666 36612 59438
15630E9438O121p839K8406j3691j1229k8253l3502L118j809o768j2816K640j1525
$$ 59438 65559 57720 86126 72435 61206 32953 -549 2569 760 -6008 -18824 -16184 -27709
15617b7709j1476Q006J2636K8256p976O477K342L0945J2661j5512j1766L4482
$$ -27709 -39185 -31179 -18543 9713 1737 8214 10556 41501 54162 38650 26884 61366
15605F1366k699l3197L009J0424j5507k8859j6413j6991j9567P344M1828L3710
$$ 61366 58667 25470 28479 38903 23396 -5463 -21876 -38867 -58434 -51090 -9262 24448
15593B4448p109k1406k7689J2561j7976J0742R002j7410m378Q503J4000J845j1005
$$ 24448 17339 -4067 -31756 -19195 -37171 -26429 -17427 -34837 -39215 -30712 -16712 -14867 -25872
15580b5872K159p309J1295j5164J0149L7813J0284L021m806k9517j5520M532J165
$$ -25872 -23713 -31022 -19727 -34891 -24742 13071 23355 26376 21570 -7947 -23467 -18935 -17770
15567a7770o677j3164o403J3654K8237j1778J1605K555Q953J1410m3085P453O473
$$ -17770 -24447 -37611 -44014 -30360 -2123 -13901 -2296 259 9212 20622 -22463 -15010 -8537
15554h537j0657j0220n307M2256K936k1046j1068Q875l504q528p189K1255P339
$$ -8537 -19194 -29414 -34721 7535 10471 -10575 -21643 -12768 -16272 -24800 -31989 -10734 -3395
15541c395k631r264J7392j1008m003M231J4086j5977r293j4863j0949m294K5997
$$ -3395 -6026 -15290 2102 -8906 -12909 -8678 5408 -10569 -19862 -34725 -45674 -49968 -23971
15528b3971M6303L73j9645j5733K1259j3305j5648K0866J0826j6851j58M924l6725
$$ -23971 22332 22705 3060 -12673 8586 -4719 -20367 499 11325 -5526 -5684 -760 -37485
15515c7485k9230J697n039K2251J9384R045K7744J4280k4226K4557j0146l6387
$$ -37485 -66715 -65018 -70057 -47806 -28422 -19377 8367 22647 -1579 22978 12832 -23555
15503b3555j4031J880k4515J897J0185O682q31K6266M5614r088q16l234k7180
$$ -23555 -37586 -35706 -60221 -58324 -48139 -41457 -42288 -16022 29592 20504 19688 16454 -10726
15490a0726j4120j1318O268j156M619P719r022J2045r702R313K1304N533k3834
$$ -10726 -24846 -36164 -29896 -31052 -26433 -18714 -27736 -15691 -25393 -16080 5224 10757 -13077
15477a3077j2752K0249L4025J3466j5935l953k2294k1434N361J8040J8695k1354
$$ -13077 -25829 -5580 28445 41911 25976 22023 -271 -21705 -16344 1696 20391 -963
15465i63l1967J926M1482m697Q207l3371K1534J391j8912Q09K3470J1821m2280
$$ -963 -32930 -31004 10478 5781 13988 -19383 2151 3542 -15370 -14561 8909 20730 -21550
15452b1550j4585J4897p471p138k631J9140N2850M062r096L403J0895j476N994
$$ -21550 -36135 -21238 -28709 -35847 -38478 -19338 33512 37574 28478 31881 42776 41300 47294
15439D7294O263J9197M941j5784k4285Q65j6195K928k6741k9989j6056n892J815
$$ 47294 53557 72754 77695 61911 37626 38491 22296 25224 -1517 -31506 -47562 -53454 -51639
15426e1639Q244J0268k999J5486J9263j1268j5849R380O246P388r097J587o17
$$ -51639 -43395 -33127 -36126 -20640 -1377 -12645 -28494 -19114 -12868 -5480 -14577 -12990 -13607
15413a3607q095M0733m23r377r367j4296j1627J1259K8550j3217k7703l141R578
$$ -13607 -21702 19031 18608 9231 -136 -14432 -26059 -14800 13750 533 -27170 -30311 -20733
15400b0733j9170o515K1366K5964J2067j8303K5319l178k8485J5341L5145j2643
$$ -20733 -39903 -46418 -25052 912 12979 -5324 19995 16817 -11668 3673 38818 26175
15388B6175k8188J2157L1602K135K659M801k8379j5622K0073k1355l4538m5912
$$ 26175 -2013 10144 41746 43881 46540 51341 22962 7340 27413 6058 -28480 -74392
15376g4392J8352K3260K7462K895R918J6439J8568k3118q429K7869l6765o154
$$ -74392 -56040 -32780 -5318 -2423 7495 23934 42502 19384 10955 38824 2059 -4095
15364d095J1340M931j5218J204K850j0570L2527O370j8794R613j8233l2986K1867
$$ -4095 7245 12176 -3042 -1838 1012 -9558 22969 29339 10545 20158 1925 -31061 -9194
15351i194O765r597J1340J8762j370P642o688p796j6951j0895J7605L436K9603
$$ -9194 -2429 -12026 -686 18076 16706 24348 17660 9864 -7087 -17982 -377 3059 32662
15338C2662j3282k5414J9960J5692n64J8595j4744P264p048p168j8535n675Q397
$$ 32662 19380 -6034 13926 29618 29054 47649 32905 40169 33121 25953 7418 1743 10140
15325A0140r078o784j1328P284M423j0365j0021L572m749Q207m923J0844Q674
$$ 10140 1062 -5722 -17050 -9766 -5343 -15708 -25729 -22157 -26906 -18699 -23622 -12778 -4104
15312d104J3709j7081Q284J4383k1611k9794k3680p808m625J0714J9615l040M7606
$$ -4104 9605 -7476 808 15191 -6420 -36214 -59894 -67702 -72327 -61613 -41998 -45038 2568
15299B568J4053j2943l5862J4250L1841J9467J5995n935j5819r986J8725r94k2270
$$ 2568 16621 3678 -32184 -17934 13907 33374 49369 43434 27615 17629 36354 35360 13090
15286A3090K0879P77k2380m2420R368O283j2460k2731R623J0226k3522J4156M1454
$$ 13090 33969 34746 12366 -30054 -20686 -14403 -26863 -49594 -39971 -29745 -53267 -39111 2343
15273B343K8935l9889Q764J49J0237L787j325K5187M056k574j3488K118m698j411
$$ 2343 31278 -8611 153 302 10539 14326 13001 38188 42244 39670 26182 28300 23602 22191
15259B2191j3076m466j7523j7684N749J9744K5501K2924j0629j5668O056L2801
$$ 22191 9115 4649 -12874 -30558 -24809 -5065 20436 43360 32731 17063 23119 55920
15247E5920m0010j5433l487K2562J5538Q977J7018m7169k8145p30m597J0141n09
$$ 55920 15910 477 -3010 19552 35090 44067 61085 13916 -14229 -14959 -19556 -9415 -9924
15234i924J3490R573L712L494o129j231O365M935J1593r126n596J3341k798j0070
$$ -9924 3566 13139 16851 20345 14216 12985 19350 24285 35878 26752 21156 34497 31699 21629
15220B1629J3436m458l6961j6522p987K4255R330o081J4159k164k981J7031O381
$$ 21629 35065 30607 -6354 -22876 -30863 -6608 2722 -3359 10800 8636 5655 22686 29067
15207B9067k3090j2623o508J6616k4334o920j3319K4401J0305l5532L0983J8178
$$ 29067 5977 -6646 -13154 3462 -20872 -27792 -41111 -16710 -6405 -41937 -10954 7224
15195G224J1151o458l7920k2301m954j6545o181J5503M118l7730j7449J0010L5736
$$ 7224 18375 11917 -26003 -48304 -53258 -69803 -75984 -60481 -56363 -94093 -111542 -101532 -65796
15182f5796M0833K434k0339j7412L4480J7300L924J325J8739j3993m9Q618k8838
$$ -65796 -24963 -22529 -42868 -60280 -25800 -8500 -4576 -3251 15488 1495 1446 10064 -18774
15169a8774l0075K6141R906O313N070j1389j7682M650K424K2099K7019L883j1650
$$ -18774 -48849 -22708 -12802 -6489 -1419 -12808 -30490 -25840 -23416 -1317 25702 29585 17935
15156A7935p549K134J192P041L686o981L3839n583k6887m4624J1201L3968l8093
$$ 17935 10386 12520 13712 20753 24439 17458 51297 45714 18827 -25797 -14596 19372 -18721
15143a8721p63L0073L923j5088j2337r189N763J1138j102r40o291J848j7177M541
$$ -18721 -19484 10589 14512 -576 -12913 -22102 -16339 -5201 -6303 -7243 -13534 -11686 -28863 -24322
15129b4322M182J875j4292K5639K768k3775k708L5545r92j0861l768o776m463
$$ -24322 -20140 -18265 -32557 -6918 -4150 -27925 -30633 4912 3920 -6941 -10709 -17485 -21948
15116b1948N949j0394l716J2412R564l580J0403J2749K5832n546M084j8895k5884
$$ -21948 -15999 -26393 -30109 -17697 -8133 -11713 -1310 11439 37271 31725 35809 16914 -8970
15103h970J2083M600j6130k7481J5476N804j0071K1165J4292R192k2103l4377
$$ -8970 3113 7713 -8417 -35898 -20422 -14618 -24689 -3524 10768 19960 -2143 -36520
15091c6520l0380Q748K030n089M7551K0759l1237k2308J5900J6391j83j2874O334
$$ -36520 -66900 -58152 -56122 -61211 -13660 7099 -24138 -46446 -30546 -14155 -14338 -27212 -20878
15078b0878n566l315K3051j7115P12L270J5289N801k0K1650J3554m09q00k0335
$$ -20878 -26444 -29759 -6708 -23823 -23111 -19841 -4552 1249 1229 22879 36433 36024 35224 14889
15064A4889l1622k5636K552K0526j518p137L0937L5585j8840K641J4814j0392
$$ 14889 -16733 -42369 -39817 -19291 -20809 -27946 2991 38576 19736 22377 37191 26799
15052B6799k8970q387j4731j348o27K501P043L531K5500J5084p304j0274L78j0417
$$ 26799 -2171 -10558 -25289 -26637 -27264 -24763 -17720 -14189 11311 26395 19091 8817 9195 -1222
15038a222j7434R834k0351J1724M041j9205L0126K8591j4576j2497K5213J1681
$$ -1222 -18656 -8822 -29173 -17449 -13408 -32613 -2487 26104 11528 -969 24244 35925
15026C5925j9994o8443j2060K8785K7689j1932j0803P835l880J0519R60j662O818
$$ 35925 15931 -52512 -64572 -35787 -8098 -20030 -30833 -22998 -26878 -16359 -15399 -17061 -10243
15013a0243O355l580j6554j4856L7987j8266k3857O312J0465J6505l505J310k893
$$ -10243 -3888 -7468 -24022 -38878 -891 -19157 -43014 -36702 -26237 -9732 -13237 -11927 -14820
15000a4820k572k1523N482M6021J5374J4044J3651m10k8804M583N8207N6353M7471
$$ -14820 -17392 -38915 -33433 12588 27962 42006 55657 55247 26443 31026 89233 145586 193057
14987A93057Q7474J27201K51189M03739M56375K9413l54975l62970k86033k01786
$$ 193057 280531 407732 658921 1062660 1519035 1548448 1193473 830503 544470 342684
14977C42684j10011p9875l1464m6882m2706n070M799J0881K2437m806k0147l4733
$$ 342684 232673 152798 121334 74452 31746 26676 31475 42356 64793 59987 39840 5107
14965E107k2633J3502J654l1317j7296k1606j3697L1694L8790K9842L0496j605
$$ 5107 -17526 -4024 -2370 -33687 -50983 -72589 -86286 -54592 -15802 14040 44536 42931
14953D2931l5476N59p512j4399k8018k804J1530N833n028K1354K1208K3422k1493
$$ 42931 7455 8014 502 -13897 -41915 -44719 -33189 -27356 -32384 -11030 10178 33600 12107
14940A2107k103m726O28J2774J4321k8282j4780M82k061J577J3612k3310k4902
$$ 12107 10004 5278 5906 18680 33001 4719 -10061 -9579 -11640 -10063 3549 -19761 -44663
14927d4663p160K5647L0300L1767j207r347l8029m5470j8655M6079K9069l827
$$ -44663 -51823 -26176 4124 35891 34684 25337 -12692 -58162 -76817 -30738 -1669 -5496
14915e496o649K2121P59J2503P719j4622k065Q941j2020m865J9633N751j5775
$$ -5496 -12145 9976 10735 23238 30957 16335 14270 23211 11191 6326 25959 31710 15935
14902A5935k5755Q86l7363K66K6050K9914j905j4146K694R602m764j5858j2810
$$ 15935 -9820 -8934 -46297 -46031 -19981 9933 8028 -6118 -3424 6178 1414 -14444 -27254
14889b7254K1036L484j3816P838o805J9320J5367j6110J2375k693j4057O80K5815
$$ -27254 -6218 -2734 -16550 -8712 -15517 3803 19170 3060 15435 12742 -1315 -635 25180
14876B5180j0729l3972k3983J5497K3827L0605J1255j4415J2644r365r557L464
$$ 25180 14451 -19521 -43504 -28007 -4180 26425 37680 23265 35909 26544 16987 20451
14864B0451j7910J6517J0663l4521j8973j5168J2466J6039N532m273L60l100M216
$$ 20451 2541 19058 29721 -4800 -23773 -38941 -26475 -10436 -4904 -9177 -8817 -11917 -7701
14851g701o966j9142l992L88J3403L79P45L179j8508r536J2298L4160M5383j0331
$$ -7701 -14667 -33809 -37801 -37413 -24010 -23631 -22886 -19707 -38215 -47751 -35453 -1293 44090 33759
14837C3759k5628n750J7182k2739j2544K1376K8521k3031j3637n689Q144j9096
$$ 33759 8131 2381 19563 -3176 -15720 5656 34177 11146 -2491 -8180 -36 -19132
14825a9132K1821j2610k9045j7766P191k440K1269L3176L599o277l001J5799l105
$$ -19132 2689 -9921 -38966 -56732 -49541 -51981 -30712 2464 6063 -214 -3215 12584 9479
14812I479M5989O11m7123j5558M2186O540l8814l9611J8334k479q904K6973K3604
$$ 9479 55468 56079 8956 -6602 35584 42124 3310 -36301 -17967 -20446 -29350 -2377 21227
14799B1227j2584j6608n609M5232M372k1915p585L829k3958j6423q600J8707n458
$$ 21227 8643 -7965 -13574 31658 36030 14115 6530 10359 -13599 -30022 -38622 -19915 -25373
14786b5373K3889J3166J992o081K5054N92j2688o943k4418o882j3636P607R572
$$ -25373 -1484 11682 13674 7593 32647 33239 20551 13608 -10810 -17692 -31328 -23721 -14149
14773a4149K1267N738k7327J4290M3114N830l8995k4130j4693K1084Q888j5395
$$ -14149 7118 12856 -14471 -181 42933 48763 9768 -14362 -29055 -7971 917 -14478
14761a4478p405k080M179j7443p604j0106R320K5182q461L1047j4349j0237R268
$$ -14478 -21883 -23963 -19784 -37227 -44831 -54937 -45617 -20435 -28896 2151 -12198 -22435 -13167
14748a3167k0539k5868M769J0573k232J3401K4548K8413j3050j4041J5817m0792
$$ -13167 -33706 -59574 -54805 -44232 -46464 -33063 -8515 19898 6848 -7193 8624 -32168
14736c2168k2811j89J2040j670J8878Q894K2466J8428J020l2545K7133K1471k9025
$$ -32168 -54979 -55168 -43128 -44798 -25920 -17026 5440 23868 24888 -7657 19476 40947 11922
14723A1922l8720J4245J496J2977j8948o851j4029J0724r897K8185j3023J7401
$$ 11922 -26798 -12553 -11057 1920 -17028 -23879 -37908 -27184 -37081 -8896 -21919 -4518
14711d518p453k4378k2313J994L8941Q407J7666J934j465J9214J561o011k1036
$$ -4518 -11971 -36349 -58662 -56668 -17727 -9320 8346 10280 8815 28029 29590 23579 2543
14698B543j8514k346J7455j4068p835K7033J2438R139J3260R962J3033q507o263
$$ 2543 -15971 -18317 -862 -14930 -22765 4268 16706 25845 39105 49067 62100 53593 47330
14685D7330J316n3395k4238K3699J0957J1100j2569j6660J8092J5155M148r223
$$ 47330 48646 -4749 -28987 -5288 5669 16769 4200 -12460 5632 20787 24935 15712
14673A5712j2287k0367j0188J8208m91q375o834m01o662K2783K9412K8m1809n74
$$ 15712 3425 -16942 -27130 -8922 -9413 -17788 -24622 -25023 -31685 -8902 20510 20538 -21271 -21845
14659b1845O288k1086j2620J5813J5638J404p22K784K4989N559L7308J6424k3619
$$ -21845 -15557 -36643 -49263 -33450 -17812 -16408 -17130 -14346 10643 16202 53510 69934 46315
14646D6315j9574k6254r432j11L8957j3510m6362K236L3899J5183j6383k1564
$$ 46315 26741 487 -8945 -9056 29901 16391 -29971 -27735 6164 21347 4964 -16600
14634a6600j8796q888o068L5861M9063J8140J278l4290K99J88O561R112j1497
$$ -16600 -35396 -44284 -50352 -14491 34572 52712 53990 19700 19999 20187 26748 35860 24363
14621B4363P243J1675k8051P477J1885k9339k8991J8286J7383r468q904K431J7013
$$ 24363 31606 43281 15230 22707 34592 5253 -23738 -5452 11931 2463 -6441 -4010 13003
14608A3003j148k4716P235q964N621J5253J313L211k3719L094J5672R997j4537
$$ 13003 11855 -12861 -5626 -14590 -8969 6284 7597 10808 -12911 -9817 5855 15852 1315
14595A315k7121K7394R015J6797K6514j0168m0913Q521j6914J4916J5675j3000
$$ 1315 -25806 1588 10603 27400 53914 43746 2833 11354 -5560 9356 25031 12031
14583A2031P23p902l9582M538O248J4061Q105M418n413p301j6718J1608K4132
$$ 12031 12754 4852 -34730 -30192 -23944 -9883 -1778 2640 -2773 -10074 -26792 -15184 8948
14570H948l0930p183M500K3958J0463J326L3111o909n1116J477K9647k0221n366
$$ 8948 -21982 -29165 -24665 -707 9756 11082 44193 37284 -13832 -12355 17292 -2929 -8295
14557h295O680N111K218K0662k0939j6615L6564J7329J0113N261k7690l3313j2782
$$ -8295 -1615 3496 5714 26376 5437 -11178 25386 42715 52828 58089 30399 -2914 -15696
14544a5696l777N93L7536m181J6771J5057m5010r723M930l686j5869n672K284
$$ -15696 -19473 -18880 18656 14475 31246 46303 1293 -8430 -3500 -7186 -23055 -28727 -26443
14531b6443Q770m386L835j5260j1821Q576K2538L0257P99l8732l3517J1250K3849
$$ -26443 -17673 -22059 -18224 -33484 -45305 -36729 -14191 16066 16865 -21867 -55384 -44134 -20285
14518b0285k6507k8874J0294K8208K3012q066q341J9161P310q889j375J5928K1048
$$ -20285 -46792 -75666 -65372 -37164 -14152 -22218 -30559 -11398 -4088 -12977 -14352 1576 22624
14505B2624K479J417q250O733J1821j7542j8637j3559k9309q851Q30K2400p071
$$ 22624 25103 26520 18270 25003 36824 19282 645 -12914 -42223 -51074 -50244 -27844 -34915
14492c4915J403J5193K2144L146k9792l3n906J2887L8143k581j7398n650J2923
$$ -34915 -33512 -18319 3825 6971 -22821 -22854 -28760 -15873 22270 19689 2291 -3359 9564
14479I564j8807k348L6327L8685L2818j0681k6095j1976j3299m55O920K0748j2982
$$ 9564 -9243 -11591 24736 63421 96239 85558 59463 47487 34188 33733 40653 61401 48419
14466D8419l0508o114q977r052M3308K9883q977j3682j4505K295l962j6495j2353
$$ 48419 17911 11797 2820 -6232 37076 66959 57982 44300 29795 32090 28128 11633 -720
14453g20R022r230k966J6369N798k4139M7931L7222k637J8185o092j6028r732
$$ -720 8302 -928 -3894 12475 18273 -5866 42065 79287 76650 94835 88743 72715 62983
14440F2983j3748j5774o685j737k4021j0636M242O219K5850M502l5008M896J6831
$$ 62983 49235 33461 26776 25039 1018 -9618 -5376 843 26693 31195 -3813 1083 17914
14427A7914j967J5179K6865k3135k0483M769K8433J5899m1652q582k5689j1788
$$ 17914 15947 31126 57991 34856 14373 19142 47575 63474 21822 13240 -12449 -24237
14415b4237K018J3034M777r489j9316R99J549J2290J3051j481L4J1751R001O411
$$ -24237 -22219 -9185 -4408 -13897 -33213 -32214 -30665 -18375 -5324 -6805 -6771 4980 13981 20392
14401B0392k1754j1139k4430j0279O0006M3093p16k6553m0963k3071K771K6580
$$ 20392 -1362 -12501 -36931 -47210 12796 55889 55173 28620 -12343 -35414 -32643 -6063
14389f063K6107j1754m6100k2910P995J372K1210Q863L7040J5629m4071k6630
$$ -6063 20044 8290 -37810 -60720 -52725 -51353 -30143 -21280 15760 31389 -12682 -39312
14377c9312N9l0323Q526L1697J8450J2451R000P157j1475j699J644j4402k1259
$$ -39312 -39253 -69576 -61050 -29353 -10903 1548 10548 17705 6230 4531 6175 -8227 -29486
14364b9486J8915J3956k900R532l1468J461L9100J2288o665P75j5983N79J1999
$$ -29486 -10571 3385 485 10017 -21451 -19990 19110 31398 24733 25508 9525 10104 22103
14351B2103K8755J9059J02n776l6887O448K6838k1010k6630K6182K7622r393k4029
$$ 22103 50858 69917 70019 64243 27356 33804 60642 39632 13002 39184 66806 57413 33384
14338C3384k2778l095j7751k5831R235J1543K8749J9967L2683k475k8370k4720
$$ 33384 10606 7511 -10240 -36071 -26836 -15293 13456 33423 66106 63631 35261 10541
14326A0541k0704k1725N770J1044J895l5742J914K6370J8386N210R69P656k299
$$ 10541 -10163 -31888 -26118 -15074 -13179 -48921 -47007 -20637 -2251 2959 3928 11584 9285
14313I285k1389j5517p288O013l219J926L4834Q727R891K1010k6094k332j7813
$$ 9285 -12104 -27621 -34909 -28896 -32115 -30189 4645 13372 23263 44273 18179 15847 -1966
14300a966q895K7038K9488j157J710Q48K1886L7623J8570O060N1565O1791Q3275
$$ -1966 -10861 16177 45665 44508 46218 47066 68952 106575 125145 131205 182770 244561 327836
14287C27836P1709Q8182J18328L3399N820l0785o8320q3706r8897q5716o2800
$$ 327836 399545 487727 606055 639454 645274 614489 546169 462463 363566 277850 215050
14276B15050m1648l1071k5212q485k3206l2269q384o532k539l0603n489o244k2677
$$ 215050 173402 142331 117119 108634 85428 53159 44775 38243 35704 5101 -388 -6632 -29309
14263b9309J5086K1091J6913K1348Q187j5719L923j7502r949J0573j7679j1228
$$ -29309 -14223 6868 23781 45129 53316 37597 41520 24018 14069 24642 6963 -4265
14251d265M134K143N034J9331k382j5635Q884L1750n632j4383l0327k9810q445
$$ -4265 -131 2012 7046 26377 23995 8360 17244 48994 43362 28979 -1348 -31158 -39603
14238c9603J4144K9822R626j0698J5899j7796k3165K4161K6656j6962o485q660
$$ -39603 -25459 4363 13989 3291 19190 1394 -21771 2390 29046 12084 5599 -3061
14226c061q737P51J928l928K0819n149L4m107L262N4556J6250k4762n0147K5159
$$ -3061 -11798 -11047 -9119 -13047 7772 2623 2657 -1450 1812 56368 72618 47856 -2291 22868
14212B2868Q42k2340j0285J1529J6377n38q174J6443M833j7016q440j1668j0511
$$ 22868 23710 1370 -8915 2614 18991 18453 10279 26722 31555 14539 6099 -5569 -16080
14199a6080j8792P527K0726j4659k428J9685K2353j1195j0691M241l5527J5075
$$ -16080 -34872 -27345 -6619 -21278 -23706 -4021 18332 7137 -3554 687 -34840 -19765
14187a9765K5590O12P964J0718O422l2057p566M5049l62k1513J8365K0995k2319
$$ -19765 5825 6437 14401 25119 31541 -516 -8082 36967 36605 15092 33457 54452 32133
14174C2133k0457j2083k0067K9945L0544n959l0500l2497J920q345m662J7988
$$ 32133 11676 -407 -20474 9471 40015 34056 3556 -28941 -27021 -35366 -40028 -22040
14162b2040K1539J2982o096k8610j1370J9753J9762k1861J202J6368k498k9785
$$ -22040 -501 12481 6385 -22225 -33595 -13842 5920 -15941 -14739 1629 -869 -30654
14150c0654K3608J2426O616K0636j2719k8821j4094K2625K024j6551j7502J9697
$$ -30654 -7046 5380 11996 32632 19913 -8908 -23002 -377 1647 -14904 -32406 -12709
14138a2709K9899j4743k8051K51p259L5750K2074R934j2173j0185j1606J9442
$$ -12709 17190 2447 -25604 -25353 -32612 3138 25212 35146 22973 12788 1182 20624
14126B0624L9964K4853j2890r167m6877j6542P657p610J5876K2969M359j9545
$$ 20624 60588 85441 72551 63384 16507 -35 7622 12 15888 38857 43216 23671
14114B3671J1754P946l5652j0637j7520J0792Q331Q367M940o978k8681J77K980
$$ 23671 35425 43371 7719 -2918 -20438 -9646 -1315 7052 11992 5014 -23667 -23490 -20510
14101b0510J1213J3242k421J5389M388P212J3190n887k9356K392L5121J1625J0534
$$ -20510 -9297 3945 1524 16913 21301 28513 41703 35816 6460 8852 43973 55598 66132
14088F6132p813P403m272k2975p740k8362j1788M7774K1929k7768k8370K063L0156
$$ 66132 58319 65722 61450 38475 30735 2373 -9415 38359 60288 32520 4150 6213 36369
14075C6369L453J6157J0647k9586k0933K3089J2491M863l4566j6030J9535o461
$$ 36369 39822 55979 66626 37040 16107 39196 51687 56550 21984 5954 25489 19028
14063A9028j4112l241K3174j4993j1811O173L307K289N843K5670Q497m1882k5763
$$ 19028 4916 1675 24849 9856 -1955 4218 7525 9814 15657 41327 49824 7942 -17821
14050a7821k640K8748K9290j5187k993K220l7347Q565K0961N799M689J5167Q5
$$ -17821 -20461 8287 37577 22390 19397 21617 -15730 -7165 13796 19595 24284 39451 39536
14037C9536p397l873J8038j3639j4620J6825q040Q375j0264J5139q981j6943j3676
$$ 39536 32139 28266 46304 32665 18045 34870 26830 35205 24941 40080 31099 14156 480
14024D80J7289N949P8L944M108l6551L397j4703r994L876J9622J1833K7204L862
$$ 480 17769 23718 23796 27740 31848 -4703 -1306 -16009 -26003 -22127 -2505 9328 36532 40394
14010D0394k3076K818N07K327J2465K325k9545r610J9843L2576o928k1000j617
$$ 40394 17318 20136 20643 22970 35435 37760 8215 -1395 18448 51024 44096 23096 21479
13997B1479L2276M18R044j7020k0523m0097n841N026r36K3542J5650K0961J397
$$ 21479 53755 54173 63217 46197 25674 -14423 -20264 -15238 -16174 7368 23018 43979 45376
13984D5376j3803k2572R922K3106n410o629m9617k4909J1530J0084M2489Q499
$$ 45376 31573 9001 18923 42029 36619 29990 -19627 -44536 -33006 -22922 19567 28066
13972B8066k0728r017J0637K1023K9833K733k3111k4415k1449J490N03L862K2512
$$ 28066 7338 -1679 8958 29981 59814 62547 39436 15021 -6428 -4938 -4435 -573 21939
13959B1939J6824q943l9501j2753K9335r787j3223P57L0364K1867n707k8513N416
$$ 21939 38763 29820 -9681 -22434 6901 -2886 -16109 -15352 15012 36879 31172 2659 8075
13946H075j7099n493L3107L2913R408Q019O894l2530r886Q848L859J2860l6540
$$ 8075 -9024 -14517 18590 51503 60911 68930 75824 43294 33408 42256 46115 58975 22435
13933B2435l6513j5569J4553L9417j0036k6969p696m233O136J1697K4409j8634
$$ 22435 -14078 -29647 -15094 24323 14287 -12682 -20378 -24611 -18475 -6778 17631 -1003
13921a003o647J9609j8872J9923K2217j9789J6346J7001j2697M293o200L841R582
$$ -1003 -7650 11959 -6913 13010 35227 15438 31784 48785 36088 40381 34181 38022 47604
13908D7604J3027O991J3198o641j6899K515q123j8173j4299O744l720J7903j1456
$$ 47604 60631 67622 80820 74179 57280 59795 51672 33499 19200 25944 22224 40127 28671
13895B8671J2381K2544J984K8273j5288j5425k2745m1640O6K7437J4888Q438J6591
$$ 28671 41052 63596 65580 93853 78565 63140 40395 -1245 -1179 26258 41146 49584 66175
13882F6175J261K5799N940m504J6996J6817L6779M9437J5735K7171J3751k366
$$ 66175 67436 93235 99175 94671 111667 128484 165263 214700 230435 257606 271357 268991
13870B68991k0497m3083l7684n200j4913m9635l8519O768k7997j9615J7267J3675
$$ 268991 248494 205411 167727 162527 147614 97979 59460 66228 38231 18616 35883 49558
13858D9558N239J3320j9237J1119j2118r397m386m5761R753J4625k771n530J7172
$$ 49558 54797 68117 48880 59999 47881 38484 34098 -11663 -1910 12715 9944 4414 21586
13845B1586K4907j4208J4126L1791M2534R710N647L6235N7380j6014j5749J922
$$ 21586 46493 32285 46411 78202 120736 130446 136093 172328 229708 213694 197945 199867
13833A99867n59j3099m1081m1751k4273j6212l3519k2343K209k8975K1818L6630
$$ 199867 199308 186209 145128 103377 79104 62892 29373 7030 9239 -19736 2082 38712
13821C8712J8703m9276k420Q810P228O943K2878P466k1774L3833P744k8117J1770
$$ 38712 57415 8139 5719 14529 21757 28700 51578 59044 37270 71103 78847 50730 62500
13808F2500o520j1230l5097N385o582j2960j2953K2917n762o93O579J5702J5316
$$ 62500 55980 44750 9653 15038 8456 -4504 -17457 5460 -302 -995 5584 21286 36602
13795C6602K8295Q02j1953j3835j7099L0668J2592k4217k934j0598K0023J8241
$$ 36602 64897 65699 53746 39911 22812 53480 66072 41855 38921 28323 48346 66587
13783F6587j777L0747J1778o620K429r514J3411k3964o124k0230J4842K7964N108
$$ 66587 64810 95557 107335 100715 103144 93630 107041 83077 76953 56723 71565 99529 104637
13770A04637N2008J0453J1635K6339J0816l4089o378j662O471j0332j2111M92
$$ 104637 156645 167098 178733 205072 215888 181799 175421 173759 180230 169898 157787 158279
13758A58279J9088N8616j4858n0430l0146k4298j8926k7329K834J7259J7225J8045
$$ 158279 177367 235983 221125 170695 140549 116251 97325 69996 72830 90089 107314 125359
13746A25359j7500l6574J414j004j5663p283n344J756j0569l0542k1422K1655
$$ 125359 107859 71285 72699 71695 56032 48749 43405 45161 34592 4050 -17372 4283
13734D283R579K893K1082J543q197j1426Q636n13k7879j4993M856M4083L8410
$$ 4283 13862 16755 37837 39380 31183 19757 28393 27880 1 -14992 -10136 33947 72357
13721G2357j3439j1848l5495l3175O120r291k0173l135K435J3318Q187J2260J1232
$$ 72357 58918 47070 11575 -21600 -15480 -24771 -44944 -48079 -45644 -32326 -24139 -11879 -647
13708f47J2347K5468J1923L2381M71k9672l9838m39M977l839j2221q931n0J2981
$$ -647 11700 37168 49091 81472 81943 52271 12433 11994 16971 13132 911 -8020 -8070 4911
13694D911k988J3922P94l3536j9153J783R41J0528q47K9248L6306j945L240J0561
$$ 4911 1923 15845 16639 -16897 -36050 -34267 -33326 -22798 -23645 5603 41909 39964 43204 53765
13680E3765l3435J9055L993k3263k270j1350O923J0390l1266k0131K586J1550
$$ 53765 20330 39385 43378 20115 17845 6495 13418 23808 -7458 -27589 -25003 -13453
13668a3453j95K1807j408K293J8062q186j3771K6859K6721k6216Q48n723k1671
$$ -13453 -13648 8159 6751 9044 27106 18920 5149 32008 58729 32513 33361 27638 5967
13655E967q505O492K8039L0693k9532k1863J0414j305J212J311m295l656p007
$$ 5967 -2538 3954 31993 62686 33154 11291 21705 20400 21612 22923 18628 14972 7965
13642G965P560J9693l525r245j1480N02J0725Q789r6l189L6453N485j1079j454
$$ 7965 15525 35218 31693 22448 10968 11470 22195 30984 30888 27699 64152 69637 58558 57104
13628E7104k2678l9313O332K0148j5826r191K5080J2396j2140k294M2998J607
$$ 57104 34426 -4887 1445 21593 5767 -3424 21656 34052 21912 19618 62616 64223
13616F4223j9070n946l324r644j7009k2763n284L3770Q029N232j386r249M234
$$ 64223 45153 39207 35883 26239 9230 -13533 -18817 14953 22982 28214 26828 17579 21813
13603B1813J222O07M624N746Q814K3949R247k3787m5499k2345R805L2989J1569
$$ 21813 23035 23642 28266 34012 42826 66775 76022 52235 6736 -15609 -5804 27185 38754
13590C8754j7100O837K0007K4803k505k9599K4182K37l2069N216j732K0070J5211
$$ 38754 21654 28491 48498 73301 70796 41197 65379 65616 33547 38763 37031 57101 72312
13577G2312k2216k8072k884k5343O817J09j0424j947J2425k15k755q198J5713
$$ 72312 50096 22024 19140 -6203 614 723 -9701 -11648 777 562 -2193 -10391 5322
13564E322Q507o041K743r823k6617k493j2452j2808o970l92L6955m108L1800J6643
$$ 5322 13829 7788 10531 708 -25909 -28402 -40854 -53662 -60632 -61024 -24069 -28177 3623 20266
13550B0266j7419M012j3997p597j1922R703K4619L5607K323Q734q21m295n649
$$ 20266 2847 6859 -7138 -14735 -26657 -16954 7665 43272 45595 54329 53508 49213 43564
13537D3564q104j1738J4217N106j2064J856N981P839Q297m104k7211k4888k810
$$ 43564 35460 23722 37939 43045 30981 32837 38818 46657 54954 50850 23639 -1249 -4059
13524d059K8126K9729J2962j424p60k9015K0968J6746K3837J3675l0891l7474
$$ -4059 24067 53796 66758 65334 64574 35559 56527 73273 97110 110785 79894 42420
13512D2420m325l35p721J699K6947L2989n194j3952j4371k0257j8616N445J1430
$$ 42420 38095 37760 30039 31738 58685 91674 86480 72528 58157 37900 19284 24729 36159
13499C6159q30L71J3630k1564k0214L087k543J4229n327j1845N23l034K1233N829
$$ 36159 35329 35700 49330 27766 7552 10639 8096 22325 16998 5153 5676 2642 23875 29704
13485B9704j6454j9236L2684l546J8410O667k3364J563K7562J6102J6964K4315
$$ 29704 13250 -5986 26698 23152 41562 48229 24865 26428 53990 70092 87056 111371
13473A11371K0149K4493J0612N659m262L036k9255j4722P891J6961q469j3774
$$ 111371 131520 156013 166625 172284 168022 171058 141803 127081 134972 151933 143464 129690
13461A29690R882K8893L2847N4829M3033J7062L4077J07133J45090J24960J33917
$$ 129690 139572 168465 201312 256141 299174 316236 350313 457446 602536 727496 861413
13450H61413J22368J16300L7002K4799J7447o0179j06277j33442j41905j14182
$$ 861413 983781 1100081 1137083 1161882 1179329 1119150 1012873 879431 737526 623344
13440F23344j06575r3657p9379m8089l9172n4682n3155l1213M379K0000l5221
$$ 623344 516769 423112 343733 295644 256472 201790 148635 117422 121801 141801 106580
13429A06580l1368P801O949o027J13j8079k6922L990n604q968j9433j8190L7226
$$ 106580 75212 83013 89962 83935 84048 65969 39047 43037 37433 28465 9032 -9158 28068
13416B8068J4438n340j741p554N524J3790Q667j0709J114J1787J5608j2239l7403
$$ 28068 42506 37166 35425 27871 33395 47185 55852 45143 46257 58044 73652 61413 24010
13403B4010p038J9144J5377J1464L607l726K2796j0246N093J3349k7106P678L56
$$ 24010 16972 36116 51493 62957 66564 62838 85634 75388 80481 93830 66724 74402 74758
13390G4758m6776j9018K8503J9176j1002O264J6728o834K876L1248K064j7512
$$ 74758 27982 8964 37467 56643 45641 51905 68633 61799 64675 95923 97987 80475
13378H0475j1180K4331j6711j5042j0610j8191n118K3455J1150O409j1298o609
$$ 80475 69295 93626 76915 61873 51263 33072 27954 51409 62559 68968 57670 51061
13366E1061o058J6120p662J917J2552M441L2114K317k3731j9048L0069j0461n064
$$ 51061 45003 61123 53461 55378 67930 72371 104485 106802 83071 64023 94092 83631 78567
13353G8567J0548L344j2430P241J3838R858k2590j9508j3753K7575n817o63J6601
$$ 78567 89115 92459 80029 87270 101108 110966 88376 68868 55115 82690 76873 76210 92811
13340I2811K5227m371j7867j472k759J1556k270J464K4980K0786o252m442J4182
$$ 92811 118038 113667 95800 94328 91569 103125 100855 102319 127299 148085 141833 137391 151573
13327A51573J9953k1035q710R036j3580l201j4538k6445k6880J365k3350l5982
$$ 151573 171526 150491 141781 150817 137237 134036 119498 93053 66173 67538 44188 8206
13315H206K505o450L344L1800m17q123q345r446K0493L7253l907j4614k0576J9451
$$ 8206 10711 4261 7605 39405 38988 30865 22520 13074 33567 70820 66913 52299 31723 51174
13301E1174k1902j5239n838K4057Q272j6106P153L8107j133m1866k1741J6532
$$ 51174 29272 14033 8195 32252 40524 24418 31571 69678 68545 26679 4938 21470
13289B1470J1613M370r748o942N324L1641k935k090K2459Q612J1199k7832P427
$$ 21470 33083 37453 27705 20763 26087 57728 54793 52703 75162 83774 94973 67141 74568
13276G4568K2197N0675R308j2124M636M6465P015k4611k7790k1340j3550k6665
$$ 74568 96765 147440 156748 144624 149260 195725 202740 178129 150339 128999 115449 88784
13264H8784J7k6495P661L7670j8997r667O109J5788j3594q307N600K2564k6271
$$ 88784 88801 62306 69967 107637 88640 78973 85082 100870 87276 78969 84569 107133 80862
13251H0862l1189O867N318j6552j9341M0247J1177J3789K1221M451m257M728j0438
$$ 80862 49673 56540 61858 45306 25965 66212 77389 91178 112399 116850 112593 117321 106883
13238A06883K2298l342k5606l8928L722j150q908K4645m694j1819K3196k720N622
$$ 106883 129181 125839 100233 61305 65027 63877 54969 79614 74920 63101 86297 83577 89199
13225H9199j0187o129r805k7148k3346m341J2966p715j7N579o507J6321J5361
$$ 89199 79012 72883 63078 35930 12584 8243 21209 13494 13477 19056 12549 28870 44231
13212D4231K3562O709K980N593J841r720r764L5658N343o029K1659K4039K7091
$$ 44231 67793 74502 77482 83075 84916 75196 65432 101090 106433 100404 122063 146102 173193
13199A73193m754m243n05M18M693N164j3985L4706J6604n1760j4687R053M7238
$$ 173193 168439 164196 163691 164109 168802 173966 159981 194687 211291 159531 144844 153897 201135
13186B01135J3845k2924n071K4661j417j4588K3694J2030J6042j4452k8702J2996
$$ 201135 214980 192056 186985 211646 210229 195641 219335 231365 247407 232955 204253 217249
13174B17249M0100J7493o945M2485K358k46Q384o328k0496k5651k0792m055N04
$$ 217249 257349 274842 267897 310382 312740 312494 320878 314550 294054 268403 247611 243556 244060
13161B44060j1725k1420K8092L0932m6474K8169r78L6952j131L010l2488j6575
$$ 244060 232335 210915 239007 269939 223465 251634 250656 287608 286477 289487 256999 240424
13149B40424K2622K492J466J8394j7413l8185R386K7945L480J2716K2038Q244
$$ 240424 263046 265538 267004 285398 267985 229800 239186 267131 270611 283327 305365 313609
13137C13609J6544K9570M719q948j5708k3978J498K020m1569j6862L2439O3472
$$ 313609 330153 359723 364442 355494 339786 315808 317306 319326 277757 260895 293334 356806
13125C56806M5018r519K2248N3107N957k6413l5986k2358o966k3724l888L3076
$$ 356806 401824 392305 414553 467660 473617 447204 411218 388860 381894 358170 354282 387358
13113C87358Q034k5977J2395J3420k511j7065k1554J5608K5254L2199L3071J3410
$$ 387358 395392 369415 381810 395230 392719 375654 354100 369708 394962 427161 460232 473642
13101D73642J1928K310M0300J5792j6271k1256r374j1502L3792N8206N8495K1750
$$ 473642 485570 487880 528180 543972 527701 506445 497071 485569 519361 577567 636062 657812
13089F57812J9015R18k1323m976J6058O2599M7526Q532J8156N5987L2688K1476
$$ 657812 676827 677745 656422 651446 667504 730103 777629 786161 804317 860304 892992 914468
13077I14468L0418j6332K473K5504O364M9933L7820K6034K1894J8564J4553M5357
$$ 914468 944886 928554 931027 956531 962895 1012828 1050648 1076682 1098576 1117140 1131693 1177050
13065A177050M6556L8496L5902M2649O2832O4040N8706R1419Q4593P2813N0231
$$ 1177050 1223606 1262102 1298004 1340653 1403485 1467525 1526231 1617650 1702243 1775056 1825287
13054A825287O8158J12938J37085J35177J45456J46845J52575K10327K20246J93209
$$ 1825287 1893445 2006383 2143468 2278645 2424101 2570946 2723521 2933848 3154094 3347303
13044C347303K11873K75050K97032L18667M15667N01099N85061O84495P91821
$$ 3347303 3559176 3834226 4131258 4449925 4865592 5366691 5951752 6636247 7428068
13035G428068R87620J234944J456461J734458K122489K607641L256186M196801
$$ 7428068 8415688 9650632 11107093 12841551 14964040 17571681 20827867 25024668
13027B5024668N570257P552693J0424243J4266714J8416601K1630960K3565451
$$ 25024668 30594925 38147618 48571861 62838575 81255176 102886136 126451587
13020A26451587K6106058K7770756K1553853R216080K653537l02521r459584k1186428
$$ 126451587 152557645 180328401 201882254 211098334 213751871 213449350 203989766 182803338
13012A82803338k5995773k5955202k4650686k2280834j8605134j4509467j0697088
$$ 182803338 156807565 130852363 106201677 83920843 65315709 50806242 40109154
13005D0109154p637731n548718m180658l251034k613923k178980j842947j536331
$$ 40109154 32471423 26922705 22742047 19491013 16877090 14698110 12855163 11318832
12997A1318832j337217j168553r84705q69289p31279n96986n19038m83701m16683
$$ 11318832 9981615 8813062 7828357 6959068 6227789 5630803 5111765 4628064 4211381
12988D211381l68003l03862k68736k33942j82625j62726j68679j51253j34256
$$ 4211381 3843378 3539516 3270780 3036838 2854213 2691487 2522808 2371555 2237299
12979B237299j41396j04208j15111r0695q6540p9766o2973o3276q0831o0447n9721
$$ 2237299 2095903 1991695 1876584 1785889 1699349 1619583 1556610 1493334 1412503 1352056 1292335
12968A292335m9876m4719m8467m8950o2318p4064n5101k9304m9934n7837k7478
$$ 1292335 1242459 1197740 1149273 1100323 1038005 963941 908840 879536 829602 771765 744287
12957G44287j1716q65j1875n814m3830j5638j7323k1741l0758k945l060j0832
$$ 744287 732571 731706 719831 714017 670187 654549 637226 615485 584727 581782 578722 567890
12945E67890J1091j4049l4092M93j1891n2716n520O759o642m5440q566L7894N07
$$ 567890 578981 564932 530840 531333 519442 466726 461206 467965 461323 415883 407317 445211 445718
12932D45718k3075p175r354k5126k1447N240P789K9117N550o2248j1934J6637
$$ 445718 422643 415468 406114 380988 359541 364781 372570 401687 407237 344989 333055 349692
12920C49692l2916l3017N211K0947R849m7811l4194j9952r88l3061J2476L820
$$ 349692 316776 283759 288970 309917 319766 271955 237761 217809 216821 183760 196236 200056
12908B00056k1706J8813J0888j9737m605j161R511K7867J6231k6468j1929R290
$$ 200056 178350 197163 208051 188314 183709 182548 192059 219926 236157 209689 197760 207050
12896B07050j3293O522J0427j1104K2983P377k3222J9023l910j7403k2064Q078
$$ 207050 193757 200279 210706 199602 222585 229962 206740 225763 221853 204450 182386 190464
12884A90464q610r621l3420l6555k5663R412J1793l0449J6349J6510j9843m349
$$ 190464 181854 172233 138813 102258 76595 86007 97800 67351 83700 100210 80367 76018
12872G6018K6436P965o821j115j344k0939K5296k078m1644k4384j9453k612K9367
$$ 76018 102454 110419 103598 102483 101139 80200 105496 103418 61774 37390 17937 15325 44692
12859D4692K2335K082J1120j0627m723K8641L2080j8630k4949k6097r61k386q289
$$ 44692 67027 69109 80229 69602 64879 93520 125600 106970 82021 55924 54963 52577 44288
12846D4288l2807L849K4707Q285N059J7330Q891l3412j2127L185J8158P272J0455
$$ 44288 11481 15330 40037 48322 53381 70711 79602 46190 34063 37248 55406 62678 73133
12833G3133k6000k1705m01P619K9418L3723K4957J0315K2261O491j2412J199n423
$$ 73133 47133 25428 25027 32646 62064 95787 120744 131059 153320 159811 147399 148598 143175
12820A43175k2808l607L5819K2189K4645k310l3013j5347l128k560l2641l0984
$$ 143175 120367 116760 152579 174768 199413 197103 164090 148743 145615 143055 110414 79430
12808G9430R005L3895N481O67J2504o702l1426j4390K2591J4198j4900l7407N795
$$ 79430 88435 122330 127811 128478 140982 134280 102854 88464 111055 125253 110353 72946 78741
12795G8741J2693l5114j2991J4661l180j2991J1599R830j2612J486K5528J7693
$$ 78741 91434 56320 43329 57990 54810 41819 53418 63248 50636 52122 77650 95343
12783I5343N53J1791r058o926k6459k1639r864J1133K7624J7547p498j0870L568
$$ 95343 95896 107687 98629 91703 65244 43605 33741 44874 72498 90045 82547 71677 75245
12770G5245l970k0394k1181K593M6374o120n330K5883j0555k7685k109J415J3900
$$ 75245 71275 50881 29700 32293 78667 72547 67217 93100 82545 54860 52751 54166 68066
12757F8066l482j4281J0356l1778n847k1193k208K2319J1700O442k2607k7329
$$ 68066 64584 50303 60659 28881 23034 1841 -367 21952 33652 40094 17487 -9842
12745i842O32K2838L9582J4925j8698L02m978j4670N0930L8807k1273l5886J3024
$$ -9842 -9210 13628 53210 68135 49437 49739 44761 30091 81021 119828 98555 62669 75693
12732G5693j4173j6587j7299j754J877M797K2642M3480L751J449M693k3338K1656
$$ 75693 61520 44933 27634 25880 27757 32554 55196 98676 102427 103876 108569 85231 106887
12719A06887K0874k172k439j0069j1920m945k6474k0271n4068n2684k9447j0882
$$ 106887 127761 125589 123150 113081 101161 96216 69742 49471 -4597 -57281 -86728 -97610
12707i7610J5385J1509J8114M1921k3575k4640j0821K3249K7269K4165j8393l1133
$$ -97610 -82225 -70716 -52602 -10681 -34256 -58896 -69717 -46468 -19199 4966 -13427 -44560
12695d4560L912J5052K4382J1115k1772j2110J482R259K8512O776p896n476O403
$$ -44560 -40648 -25596 -1214 9901 -11871 -23981 -22499 -13240 15272 22048 14152 8676 15079
12682A5079k029k3225R905J5635j8833j8669l6472J7331J4601o407J0906K2169
$$ 15079 13050 -10175 -270 15365 -3468 -22137 -58609 -41278 -26677 -33084 -22178 -9
12670in789j6254L3597K3558M271k414P09r805p175r888k1939P384J7271j4772
$$ -9 -5798 -22052 11545 35103 39374 36960 37669 27864 20689 10801 -11138 -3754 13517 -1255
12656a255k2536l010r814K1367K7252L0213r333J5743j558j1482j4838j1611Q080
$$ -1255 -23791 -26801 -36615 -15248 12004 42217 32884 48627 47069 35587 20749 9138 17218
12643A7218j6047j2397J0600j2013j1415K9969J7823k987j2368K99N19K7570K310
$$ 17218 1171 -11226 -626 -12639 -24054 5915 23738 20751 8383 8682 9201 36771 39081
12630C9081k3602j6872N741L1318J7502j7218n388o952Q910j2534j3277Q604m81
$$ 39081 15479 -1393 4348 35666 53168 35950 30562 23610 32520 19986 6709 15313 14832
12617A4832O459J1703j398k7131j6011K4786J1975J894P89J9114m721q938R106
$$ 14832 21291 32994 31596 4465 -11546 13240 25215 27109 27898 47012 42291 33353 42459
12604D2459k139O117p236L017J3640J5069J4193M200M947j1847K133M0290L2880
$$ 42459 40320 46437 39201 42218 55858 70927 85120 89320 94267 82420 84553 124843 157723
12591A57723J9363J8857L7715O4630M9444N6995J10063J49351J08097J10044J47213
$$ 157723 177086 195943 233658 298288 347732 404727 514790 664141 772238 882282 1029495
12580A029495R3852K3581J5731m4965o8877j04883j28362j45607j40459j26999
$$ 1029495 1123347 1146928 1162659 1117694 1048817 943934 815572 669965 529506 402507
12570D02507r4514p5808m8138j0148l4280k6637k3997j1151r455M90O421j5061
$$ 402507 307993 232185 184047 173899 139619 112982 88985 77834 68379 68869 75290 60229
12558F0229j5306m580m089k9634j1559P388M092J1924j1904j0642M275j5140K5637
$$ 60229 44923 40343 36254 6620 -4939 2449 6541 18465 6561 -4081 194 -14946 10691
12545A0691J3066k8314p538J9273M937k2655j9345j3475J5754M7583k2477j3673
$$ 10691 23757 -4557 -12095 7178 12115 -10540 -29885 -43360 -27606 19977 -2500 -16173
12533a6173K0074K0823Q491q322j7184K797l417k4829j9045J4611J6851p668p76
$$ -16173 3901 24724 33215 24893 7709 10506 7089 -17740 -36785 -22174 -5323 -12991 -13767
12520a3767p93K5791K162k5905J1304Q441j1674o84P968k283n20l013K0280J84
$$ -13767 -14560 11231 13393 -12512 -1208 7233 -4441 -5125 2843 560 40 -2973 17307 17491
12506A7491r224m902j4275K480k676O585J095r445j5916L011K3370K6660j8215
$$ 17491 8267 3365 -10910 -8430 -11106 -4521 -3426 -12871 -28787 -25776 -2406 24254 6039
12493F039k3335J4148K6897K7189K305l711j3591p516k0410j4031r160j9792l453
$$ 6039 -17296 -3148 23749 50938 53243 49532 35941 28425 8015 -6016 -15176 -34968 -38421
12480c8421R146k1108j1759K6278K0198N301Q473n697j650M196R789l547L0041
$$ -38421 -29275 -50383 -62142 -35864 -15666 -10365 -1892 -7589 -9239 -5043 4746 1199 31240
12467C1240j3590k7628k569j2151m038J6373J2353M798K0993o349m859j2390k3416
$$ 31240 17650 -9978 -12547 -24698 -28736 -12363 -10 4788 25781 19432 14573 2183 -21233
12454b1233j9419K7662J6217o380M970j1670j9809J3303K5400J3880L6J9136M713
$$ -21233 -40652 -12990 3227 -3153 1817 -9853 -29662 -16359 9041 22921 22957 42093 46806
12441D6806m215l5529n6899j427L7829J5815j301j0648k666L653j0011j1629L0916
$$ 46806 42591 7062 -49837 -51264 -13435 2380 1079 -9569 -12235 -8582 -18593 -30222 694
12428F94j0408r836p94j6216m471K768J3833K6517K0358k3098k0068M222m814
$$ 694 -9714 -19550 -20344 -36560 -41031 -38263 -24430 2087 22445 -653 -20721 -16499 -21313
12415b1313j0714j6224K6133L9559k0373j6890M4873J7777k0069j2939j350J3213
$$ -21313 -32027 -48251 -22118 17441 -2932 -19822 25051 42828 22759 9820 8470 21683
12403B1683K0390l545l7268j1345J3306j7225J4637R59M80o813l3333j097p005
$$ 21683 42073 38528 1260 -10085 3221 -14004 633 1592 2072 -4741 -38074 -39171 -46176
12390d6176J5430J7962J6641j2814p355J9858k9568j5587K9772J5529O426K2812
$$ -46176 -30746 -12784 3857 -8957 -16312 3546 -26022 -41609 -11837 3692 10118 32930
12378C2930j601j0028l525o772l267j5808J191j1889P623J0617K0837r657k1047
$$ 32930 31329 21301 17776 11004 7737 -8071 -6880 -18769 -11146 -529 20308 10651 -10396
12365a0396Q304n56k9601m180n169J8042J8457K0713j3470Q421K1890j3174o808
$$ -10396 -2092 -2648 -32249 -36429 -41598 -23556 -5099 15614 2144 10565 32455 19281 12473
12352A2473k2504p588j0924K2773J8189K7630r248l2239o201L101K3999k822k4225
$$ 12473 -10031 -17619 -28543 -5770 12419 40049 30801 -1438 -7639 -4538 19461 16639 -7586
12339g586l8348J859n84N162m113k5656k69K3127M171j470K6665K4311J7597K80
$$ -7586 -45934 -44075 -44659 -39497 -43610 -69266 -69535 -46408 -42237 -43707 -17042 7269 24866 25146
12325B5146k4231k6330J0651J3409j604O07j4864k9632j4639J6659J1727J6017
$$ 25146 915 -25415 -14764 -1355 -2959 -2352 -17216 -46848 -61487 -44828 -33101 -17084
12313a7084J1352j2362P35j0671K3364j0681j3056o869j7536J4925K2463l458
$$ -17084 -5732 -18094 -17359 -28030 -4666 -15347 -28403 -35272 -52808 -37883 -15420 -18878
12301a8878J6745K5346r263l1084J4682p287j7913J6529m196j663k954l379J840
$$ -18878 -2133 23213 13950 -17134 -2452 -9739 -27652 -11123 -15319 -16982 -19936 -23315 -21475
12288b1475k1210j685L7564K0763l763j8024J4321P531J8702O963O7J0064j5642
$$ -21475 -42685 -44370 -6806 13957 10194 -7830 6491 14022 32724 39687 39754 49818 34176
12275C4176m6715l6818j144K0474K6125J4513k6186k1358n992J905L682m045n38
$$ 34176 -12539 -49357 -50501 -30027 -3902 10611 -15575 -36933 -42925 -41020 -37338 -41383 -41921
12262d1921K4441J3085j6281n449j994j3985K0693m274k8497k5467K4713L9003
$$ -41921 -17480 -4395 -20676 -26125 -28119 -42104 -21411 -25685 -54182 -79649 -54936 -15933
12250a5933o610L899J9473N602K231k2536n909K9611J6481k6700k2335n835N360
$$ -15933 -22543 -18644 829 6431 8662 -13874 -19783 9828 26309 -391 -22726 -28561 -23201
12237b3201K1962J4427r645j7287m870J3369K434k3094k7202J4205Q716k92m022
$$ -23201 -1239 13188 3543 -13744 -18614 -5245 -2811 -25905 -53107 -38902 -30186 -30478 -34500
12224c4500j0658n197L0929K6398J1015J3046J2968j4834J049r759l7416l4490
$$ -34500 -45158 -50355 -19426 6972 17987 31033 44001 29167 30216 20457 -16959 -51449
12212e1449n537L5274L3886L033P325J9606K311j1771k5234k3437J0597m757J4541
$$ -51449 -56986 -21712 12174 15207 22532 42138 44449 32678 7444 -15993 -5396 -10153 4388
12199D388J5913j1954l696L911L1227m98k9451M871J8360k108j7651j2749K2815
$$ 4388 20301 8347 4651 8562 39789 39291 9840 14711 33071 30963 13312 563 23378
12186B3378j987k5552m077k2K3694K7409J5993j2757l812L747j2656Q418j0624
$$ 23378 21391 -4161 -8238 -8260 15434 42843 58836 46079 42267 46014 33358 41776 31152
12173C1152k0544l5112O762K8788P613p929N579J8862J6297n158k572j4580m775
$$ 31152 10608 -24504 -17742 11046 18659 10730 16309 35171 51468 46310 43738 29158 24383
12160B4383p670M324O193j5696J0958K2110j2593l7524J0145j676m2542J143K54
$$ 24383 16713 21037 27230 11534 22492 44602 32009 -5515 4630 2954 -39588 -38445 -38191
12147c8191k3386j0708O118K4244K6363r257j4491J7400K9377r56l5856j039M918
$$ -38191 -61577 -72285 -66167 -41923 -15560 -24817 -39308 -21908 7469 6513 -29343 -30382 -25464
12134b5464k630P984J8309j9218J7828L8664r77j3620m8290p380j3989N737L2237
$$ -25464 -28094 -20110 -1801 -21019 -3191 35473 34496 20876 -27414 -34794 -48783 -43046 -10809
12121a0809J6960J7987q140j2484n724M658O860l2661o659J2629K8502L1054l7101
$$ -10809 6151 24138 15998 3514 -2210 2448 9308 -23353 -30012 -17383 11119 42173 5072
12108E072l8574r039j3593M3251K3913o715k5386k987K3058n221J3505l68K181
$$ 5072 -33502 -42541 -56134 -12883 11030 4315 -21071 -24058 -1000 -6221 7284 6916 9097
12095I097j1528k6186j1272J6222K0097L065j9054j4809K3484L6982j6337j8599
$$ 9097 -2431 -28617 -39889 -23667 -3570 -505 -19559 -34368 -10884 26098 9761 -8838
12083h838J4463J2147K286K249l588j977p783j2935J2382J7837l4488l3090k4525
$$ -8838 5625 17772 20058 22307 18719 16742 8959 -3976 8406 26243 -8245 -41335 -65860
12070f5860q737J2393J4226J0524J084o0888N118P3712L4525n44j5510J5484k615
$$ -65860 -74597 -62204 -47978 -37454 -36370 -97258 -92140 -18428 16097 15553 43 15527 12912
12057A2912l7723n139j3598j5099M3943M7737M322k1367j6457k9404K0431J3090
$$ 12912 -24811 -29950 -43548 -58647 -14704 33033 37355 15988 -469 -29873 -9442 3648
12045C648m976k715O846M5930l544l4586j5708J9008j4204M867J4888l136k7182
$$ 3648 -1328 -4043 2803 48733 45189 10603 -5105 13903 -301 4566 19454 16318 -10864
12032a0864O636K3445K0863L221k4301j8069N063J282j2520j95N527L256j0091
$$ -10864 -4228 19217 40080 43301 19000 931 5994 7276 -5244 -5439 88 3344 -6747
12019f747K3824j4256l5399k928K2285M0670K6526k7828j0000J2912j8552j478
$$ -6747 17077 2821 -32578 -35506 -13221 27449 53975 26147 16147 29059 10507 9029
12007I029q874k8098j8874K8109O283j4581j0736L780M1309L7263q043M104n511
$$ 9029 155 -27943 -46817 -18708 -12425 -27006 -37742 -33962 7347 44610 36567 40671 35160
11994C5160l152r23j3584K870L0942j7936j7521M0411K6874j145m0019l6855q715
$$ 35160 32008 31085 17501 20371 51313 33377 15856 56267 83141 81996 41977 5122 -3593
11981c593N40J6956L4274M0703k805j2255K928l4950k0757p293k1069k1803K2871
$$ -3593 -3053 13903 48177 88880 86075 73820 76748 41798 21041 13748 -7321 -29124 -6253
11968f253M0376L7338j6136m3030k3569o075j2457j842J3734j4490O462l374q673
$$ -6253 34123 71461 55325 12295 -11274 -17349 -29806 -31648 -17914 -32404 -25942 -29316 -37989
11955c7989l636J239k9651J8364K2423p66K6133K2629J8818J548n6579j1502Q973
$$ -37989 -41625 -40386 -70037 -51673 -29250 -30016 -3883 18746 37564 39112 -17467 -28969 -19996
11942a9996J7747J5619r888J2909L1126q575k1809k871q205k9947m414j0508Q624
$$ -19996 -2249 13370 3482 16391 47517 38942 17133 14262 6057 -23890 -28304 -38812 -30188
11929c0188J5098J2924K4041p391n351j2774Q031K3556K6526J8332k3208m1028
$$ -30188 -15090 -2166 21875 14484 9133 -3641 4390 27946 54472 72804 49596 8568
11917H568O04K482j2142J701l1198k752K1734O0129J7117k1795k8332j8439l1884
$$ 8568 9172 11654 -488 1213 -29985 -32737 -11003 49126 66243 44448 16116 -2323 -34207
11904c4207j6288J4670Q127k1663L0543J8358j866K9200j6654k9907J2213Q408
$$ -34207 -50495 -35825 -27698 -49361 -18818 -460 -2326 26874 10220 -19687 -7474 934
11892I34M281R763j8999J5550l1j3149q906R213J4428J0315m613l848k1733r057
$$ 934 5215 14978 -4021 11529 11498 -1651 -10557 -1344 13084 23399 18786 14938 -6795 -15852
11878a5852n803J6123R830K6179J6549m5823l7127K645L32J0498P584j3976K9222
$$ -15852 -21655 -5532 4298 30477 47026 1203 -35924 -33279 -32947 -22449 -14865 -28841 381
11865C81j2822n398l3853j4760Q009k7999J9165K1810J4404L825q97M6115j753
$$ 381 -12441 -17839 -51692 -66452 -58443 -86442 -67277 -45467 -31063 -27238 -28135 17980 16227
11852A6227p338L946j5719l1401K5634J5775q083j7127j3602J0951J563J4859
$$ 16227 8889 12835 -2884 -34285 -8651 7124 -959 -18086 -31688 -20737 -19174 -4315
11840d315m574r417J1790K091J5697J0565j2135J2795J7885l2334k8640J184K602
$$ -4315 -8889 -18306 -6516 -4425 11272 21837 9702 22497 40382 8048 -20592 -19408 -16806
11827a6806j886m869J721m035M888K3326k02q117J3892L3188k437J3686L771j6540
$$ -16806 -18692 -23561 -21840 -25875 -20987 2339 2137 -5980 7912 41100 38663 52349 56120 39580
11813C9580k4067l7646n754M382J182j2292j0388Q013J6961K3517j3380k7382
$$ 39580 15513 -22133 -27887 -23505 -22323 -34615 -45003 -36990 -20029 3488 -9892 -37274
11801c7274j8311L5417K0957M715K3105K0951m715j1882k8047m0442J7111J4048
$$ -37274 -55585 -20168 789 5504 28609 49560 44845 32963 4916 -35526 -18415 -4367
11789d367l703n682J1917K469l7827j8531J8534O543J9438K4693J7023R05J69
$$ -4367 -8070 -13752 -1835 634 -37193 -55724 -37190 -30647 -11209 13484 30507 31412 31581
11776C1581j30j7144j0141M38j9433R612l1047o33M4206j4845k901N914M0220
$$ 31581 31451 14307 4166 4604 -14829 -5217 -36264 -36897 7309 -7536 -10437 -4523 35697
11763C5697o300q889R329P934k3661m1970k6301L9045K2925j043k4N83j8830K0353
$$ 35697 29397 20508 29837 37771 14110 -27860 -54161 -15116 7809 6766 6742 7325 -11505 8848
11749H848J797k6526j7752q975J9354K678j9278L5034K0137j65m246j1056J9214
$$ 8848 10645 -15881 -33633 -42608 -23254 -20576 -39854 -4820 15317 15152 10906 -150 19064
11736A9064K1838K3331J52j2583o879N504J7021k8289j9854K5641o102k3559j8226
$$ 19064 40902 64233 64385 51802 44923 50427 67448 39159 19305 44946 38844 15285 -2941
11723b941O130Q693J3879L6452P547j9199n960r425J4517k2406j4938n999Q275
$$ -2941 3189 11882 25761 62213 69760 50561 44601 35176 49693 27287 12349 6350 14625
11710A4625M765M0271O479q974N101k0804k3173n3229k2333K4524L3421j2672
$$ 14625 19390 59661 66140 57166 62267 41463 18290 -34939 -57272 -32748 673 -11999
11698a1999j1587J2008M9562J2682m1945l6781k7304q466L4003R376k9878k0653
$$ -11999 -23586 -11578 37984 50666 8721 -28060 -55364 -63830 -29827 -20451 -50329 -70982
11686g0982L0047Q785J5224l714K6553P866L174J1599k0897j3639J5312K1237
$$ -70982 -40935 -32150 -16926 -20640 5913 13779 16953 28552 7655 -5984 9328 30565
11674C0565P158m846j5472j11K1210J9980L245l5140k2956l81R454k2857r887
$$ 30565 37723 32877 17405 17294 38504 58484 61729 26589 3633 3252 12706 -10151 -20038
11661b0038L1923L38k0269j4518M529L0367K3097j2232o0126p136J7555J2351
$$ -20038 11885 12223 -8046 -22564 -18035 12332 35429 23197 -36929 -44065 -26510 -14159
11649a4159r058O16J684L3708J9273m497j4118p500J3551k97L0826j2822k7238
$$ -14159 -23217 -22601 -20917 12791 32064 27567 13449 5949 19500 19203 50029 37207 9969
11636I969R74L0202p593n81k3057j9674J1270M814q03j1831m801K1523J0552k5841
$$ 9969 10943 41145 33552 32971 9914 -9760 1510 6324 5521 -6310 -11111 10412 20964 -4877
11622d877j0466K3767J6528p384l8068K8949K4804k1209O944R17k74r201m993
$$ -4877 -15343 8424 24952 17568 -20500 8449 33253 12044 18988 19905 19631 10430 5437
11609E437J7423P846j4047J3515J9920p410k5186r757l602j6580J851J2752L9006
$$ 5437 22860 30706 16659 30174 50094 42684 17498 7741 4139 -12441 -10590 2162 41168
11596D1168N122J5856j669o244j4046l429k0263j5720j4318J094R682o8K081N973
$$ 41168 46290 62146 60477 54233 40187 36758 16495 775 -13543 -12449 -2767 -2835 -754 5219
11582E219k6103ML0913K5118J4930j2055k7568o694J3059j5485L463J1803n876
$$ 5219 -20884 -20880 10033 35151 50081 38026 10458 3764 16823 1338 4801 16604 10728
11569A0728j6851k313j0797j455j3050J4550J6336J3499J1563K8088k9377k8409
$$ 10728 -6123 -8436 -19233 -20688 -33738 -19188 -2852 10647 22210 50298 20921 -7488
11557g488J8279J1374N068l5455k0023k2506k3294j5741M4118O659P024J2419
$$ -7488 10791 22165 27233 -8222 -28245 -50751 -74045 -89786 -45668 -39009 -31985 -19566
11545a9566J8101K9934J9946k1267j6709m087J679L1828J6893j5425P582n835
$$ -19566 -1465 28469 48415 27148 10439 6352 8031 39859 56752 41327 48909 43074
11533D3074j8290j5299O949q252j0759j5371J1593J4701N894n848K1621j8010
$$ 43074 24784 9485 16434 8182 -2577 -17948 -6355 8346 14240 8392 30013 12003
11521A2003k7991j3515J3402J4282K5254M213J386j2181k2056j478M790J5074
$$ 12003 -15988 -29503 -16101 -1819 23435 27648 29034 16853 -5203 -6681 -1891 13183
11509A3183k0663M00p956k0392K7906q987k6391M04O53J3983k766J7587K5006
$$ 13183 -7480 -7080 -15036 -35428 -7522 -16509 -42900 -42496 -41843 -27860 -30626 -13039 11967
11496A1967q343R652K795N197N699k610J9184j4948l1405k1549Q709J0367p175
$$ 11967 3624 13276 16071 21268 26967 24357 43541 28593 -2812 -24361 -15652 -5285 -12460
11483a2460L787O529J4941J3938K1336l8218N431J9646J4680J5691J2014J4903
$$ -12460 -8673 -2144 12797 26735 48071 9853 15284 34930 49610 65301 77315 92218
11471I2218j775l9617n7459O263R386k2337J7112L2586j476j7506L0174j6338
$$ 92218 90443 50826 -6633 -370 9016 -13321 3791 36377 34901 17395 47569 31231
11459C1231p222J1438R641k5825j2761j7126j1914J6969K348j1605j0817K8042
$$ 31231 24009 35447 45088 19263 6502 -10624 -22538 -5569 -3221 -14826 -25643 2399
11447B399K0881K479j7850J330o183l9802p919L0245K4003N065K0423k1540k0490
$$ 2399 23280 25759 7909 9239 3056 -36746 -44665 -14420 9583 14648 35071 13531 -6959
11434f959p127K03j0673J3220L7468M2659j564l0987j6701l2121J6068J6913O355
$$ -6959 -14086 -13883 -24556 -11336 26132 68791 67227 36240 19539 -12582 3486 20399 26754
11421B6754j5121l586L960P462j3844J3022n688j4298Q511K1463K4766K528K920
$$ 26754 11633 8047 12007 19469 5625 18647 12959 -1339 7172 28635 53401 55929 58849
11408E8849p167o228j2444k5461J9020J0697l0975o480K8581p129k6396M746K9727
$$ 58849 51682 45454 33010 7549 26569 37266 6291 -189 28392 21263 -5133 -387 29340
11395B9340J8069j6003n6710j9811J5600M8422K8423L122r903o312K4390J7555
$$ 29340 47409 31406 -25304 -45115 -29515 18907 47330 50452 40549 34237 58627 76182
11383G6182N915k8162m696r539j5841j5526k8499j8482J3481R881J8772j65L74
$$ 76182 82097 53935 49239 39700 23859 8333 -20166 -38648 -25167 -15286 3486 3321 3695
11370C695K3184Q598L2521M708l2644n1035l2882J6769L045K0547J8398L3721
$$ 3695 26879 35477 67998 72706 40062 -10973 -43855 -27086 -24041 -3494 14904 48625
11358D8625l810q363N234j534n593L4794R771l9903M069J5395k1353j4006M650
$$ 48625 44815 36452 41686 40152 34559 69353 79124 39221 43290 58685 37332 23326 27976
11345B7976k5985J4377Q456J4311j2060j2529P815j7100K2825N811k8683P270
$$ 27976 1991 16368 24824 39135 27075 14546 22361 5261 28086 33897 5214 12484
11333A2484K992J251k1806j2388O871J9689J6754j9520k5809R996K9676K8450
$$ 12484 15476 16727 -5079 -17467 -10596 9093 25847 6327 -19482 -9486 20190 48640
11321D8640j295o207k3900j0918p266l491j3368K3740L5718N252o851j046j305
$$ 48640 47345 41138 17238 6320 -946 -4437 -17805 5935 41653 46905 40054 39008 37703
11308C7703K0899l3173l2452N091k6547K1833M4465K1686k907J0835k7882n3668
$$ 37703 58602 25429 -7023 -1932 -28479 -6646 37819 59505 56598 67433 39551 -14117
11296a4117R072L1534L1641J2916k4241k9241J3965j9370j538K1059J4429P286
$$ -14117 -5045 26489 58130 71046 46805 17564 31529 12159 10621 31680 46109 53395
11284E3395j2343j7181o500l943r260O790J546k701J1323j2169j6560L9197J4786
$$ 53395 41052 23871 17371 13428 4168 10958 12504 9803 21126 8957 -7603 31594 46380
11271D6380O750j5192k3549M52N2257J2639j3877J7735k2058l1890k7891j0059
$$ 46380 53130 37938 14389 14841 67098 79737 65860 83595 61537 29647 1756 -8303
11259h303J7773K5726K0236j2037j9099J3856Q121K0063p606q934j0926l071l851
$$ -8303 9470 35196 55432 43395 24296 38152 46273 66336 58730 49796 38870 35799 31948
11246C1948J1439K3743j7843N784J2157m8520l5978R965L895p640N642p157J1749
$$ 31948 43387 67130 49287 55071 67228 18708 -17270 -7305 -3410 -11050 -5408 -12565 -816
11233h16L3673J9660Q805k2249k0925R100J8256o459l1057p785j3314q10N753
$$ -816 32857 52517 61322 39073 18148 27248 45504 39045 7988 203 -13111 -13921 -8168
11220h168r156j3679J3915M6267J4443J954J2485M545J1664p683j2140K3050m431
$$ -8168 -17324 -31003 -17088 29179 43622 45576 58061 62606 74270 66587 54447 77497 73066
11207G3066p2r704j7885q630M423L0225j2803n1878k3795K3381L8156M989l3973
$$ 73066 72994 63290 45405 36775 41198 71423 58620 6742 -17053 6328 44484 49473 15500
11194A5500J0631R296o085O681K2180J1571k5518k2859j7051j7427k9398J7475
$$ 15500 26131 35427 29342 36023 58203 69774 44256 21397 4346 -13081 -42479 -25004
11182b5004L2644J2462K7995J314R85K030j8656j4765L2415L0829j0739O921m765
$$ -25004 7640 20102 48097 49411 50396 52426 33770 19005 51420 82249 71510 78431 73666
11169G3666k0636k7893J0195p850k640j968O199J3278N654n720N055q015k534
$$ 73666 53030 25137 35332 27482 24842 22874 29073 42351 48005 42285 47340 39325 36791
11156C6791K1699m187J645j9954M023O010l891J6874j7020j3948l8k1194P281
$$ 36791 58490 54303 55948 35994 40017 46027 42136 59010 41990 28042 28004 6810 14091
11143A4091K9430J8518j792J8121N024j4851q815J320o836j2658J5419Q497j4285
$$ 14091 43521 62039 60247 78368 83392 68541 59726 61046 54210 41552 56971 65468 51183
11130E1183j9705J5917j6096j6178J1638J1282N114j5794n842Q64J2205K4819
$$ 51183 31478 47395 31299 15121 26759 38041 43155 27361 21519 22383 34588 59407
11118E9407k4296k2848j5444n72n021K5920K7542M5994M446l7620l2201j254j6144
$$ 59407 35111 12263 -3181 -3753 -8774 17146 44688 90682 95128 57508 25307 24053 7909
11105G909J3666K059o940J3486m871J442m624J4009m91l3086j954M201r132L406
$$ 7909 21575 23634 16694 30180 25309 26751 22127 36136 35645 2559 605 4806 -4326 -920
11091i20J8063r142P592J3631Q748L5240J7657j9350j6774L2112K7544j6359k8505
$$ -920 17143 8001 15593 29224 37972 73212 90869 71519 54745 86857 114401 98042 69537
11078F9537l4097J2098O837L957k2850k3356N009m853L0785L117q100J4878l2399
$$ 69537 35440 47538 54375 58332 35482 12126 17135 12282 43067 46184 38084 52962 20563
11065B0563l5004k0726R819O2319K3514l1634J0726j1157j7495p984J1864K8405
$$ 20563 -14441 -35167 -25348 36971 60485 28851 39577 28420 10925 2941 14805 43210
11053D3210L3708j0195J4706J0582k719l9678k2837J0991M0405R787j9629J366
$$ 43210 76918 66723 81429 92011 89292 49614 26777 37768 78173 87960 68331 69697
11041F9697j6623j1225r805j014j7843M325N4738L3460m9336k0792K9515R642
$$ 69697 53074 41849 32044 31030 13187 17512 72250 105710 56374 35582 65097 74739
11029G4739j1603J082Q99p505M576K7625j2251k0031J3495r292k8108k8k0727
$$ 74739 63136 64218 65117 57612 62188 89813 77562 57531 71026 61734 33626 33598 12871
11016A2871j0015J3728m940K0648J3499l4042j1325J4433K162J6022Q908j7104
$$ 12871 2856 16584 11644 32292 45791 11749 424 14857 17019 33041 41949 24845
11004B4845K5321L7440r69m191n633K4390o532q450k1178k1647l2651L4956N4099
$$ 24845 50166 87606 86637 82446 76813 101203 94671 86221 65043 43396 10745 45701 99800
10991I9800K121l3534l2323k3743J6737r980j1192K2019K866L197K2164K2460
$$ 99800 101921 68387 36064 12321 29058 19078 7886 29905 32771 35968 58132 80592
10979H0592J7631k4133Q026L1374k7496k1702J0812J410l8305J1651M7434O626
$$ 80592 98223 74090 82116 113490 85994 64292 75104 76514 38209 49860 97294 103920
10967A03920j9552K626l5717k4266j61N80K7242L7424P980N889M814j1629j7743
$$ 103920 84368 86994 51277 27011 26850 27430 54672 92096 100076 105965 110779 99150 81407
10954H1407K1432O524L0066K776k5189k2922k0603J2642p309J2096M391K0954
$$ 81407 102839 109363 139429 142205 117016 94094 73491 86133 78824 90920 95311 116265
10942A16265J3134j0844j8594K2166r786k7426j553N802j4523j2092m735K970
$$ 116265 129399 118555 99961 122127 112341 84915 83362 89164 74641 62549 57814 60784
10930F0784J9124P511K0377n981l4034k4253j7011j6233L3944Q525l022N159J4108
$$ 60784 79908 87419 107796 101815 67781 43528 26517 10284 44228 52753 49731 54890 68998
10917F8998M236J3973j5201J965p102K0149K818k4841J618N012l221m576K5490
$$ 68998 73234 87207 72006 73971 66869 87018 89836 64995 66613 71625 68404 63828 89318
10904H9318K0873R035k7668j5851J3262J8980J4586K2448j0331r136R749J1228
$$ 89318 110191 119226 91558 75707 88969 107949 122535 144983 134652 125516 135265 146493
10892A46493O799k9013l9228M11j0493N892j2649K2618j3933k76P590K2137M002
$$ 146493 153292 124279 85051 85462 74969 80861 68212 90830 76897 76621 84211 106348 110350
10879A10350r756L0053K0245N056K1023J8432j2543N756L3640M8157L3133M5613
$$ 110350 100594 130647 150892 155948 176971 195403 182860 188616 222256 270413 303546 349159
10867C49159N2991P7176J38788J42467K16497K74807K39837K24879K65473J96243
$$ 349159 402150 479326 618114 760581 977078 1251885 1491722 1716601 1982074 2178317
10857B178317j1387j62532k02275k36805k83771k88362k48994j70829j34407q4038
$$ 2178317 2166930 2004398 1802123 1565318 1281547 993185 744191 573362 438955 354917
10847C54917n2691l7119r575l1054k6293k0866p078j308J2166Q988Q753J0709
$$ 354917 302226 265107 255532 224478 198185 177319 170241 168933 181099 190087 198840 209549
10835B09549k6529j8451k7851k2683k7232Q474M2816J8646J0770j0350M777o494
$$ 209549 183020 164569 136718 114035 86803 95277 138093 156739 167509 157159 161936 155442
10823A55442j7003m745Q043j0249K9802K3571p844j1620K906p192J2554J8399
$$ 155442 138439 133694 141737 131488 161290 184861 177017 165397 168303 161111 173665 192064
10811A92064J5513m806l2906l5084j4255R292l815J3194r519K6798M304k3816
$$ 192064 207577 202771 169865 134781 120526 129818 126003 139197 129678 156476 160780 136964
10799A36964J9257j8708K006j4551O734K7867R485P950K7603K2985r606j4329
$$ 136964 156221 137513 139519 124968 131702 159569 169054 177004 204607 227592 217986 203657
10787B03657J7439J2748J2617M496M418k7420J555j9985q664k1043O661k1320
$$ 203657 221096 233844 246461 250957 255375 227955 229510 209525 200861 179818 186479 165159
10775A65159j4925K288J0951K4152M927L6955L4676m904j4461p635J8329P244
$$ 165159 150234 152522 163473 187625 192552 229507 264183 259279 244818 237183 255512 262756
10763B62756j4598k8500m90m8560n9378o159k0206m5807l2023O929j5481K612
$$ 262756 248158 219658 219168 170608 111230 105071 84865 39058 7035 13964 -1517 1095
10751A095O633J5058K4416Q952r178J5104K1257M5403J9139l2807J9913J0268
$$ 1095 7728 22786 47202 56154 46976 62080 83337 128740 147879 115072 134985 145253
10739A45253M1292K0627r693J4218M4931J8153M5793O9492P7765Q4674M2928p5515
$$ 145253 186545 207172 197479 211697 256628 274781 320574 390066 467831 552505 595433 519918
10727E19918j08898p5139k3680l5256k8868k5115m264K6335K3648L597j797J6961
$$ 519918 411020 335881 312201 276945 248077 222962 218698 245033 268681 272278 270481 287442
10715B87442O130J2397J2671K9145K2695K0659K685k0224n6176k5187j3621m5555
$$ 287442 293572 305969 318640 347785 370480 391139 393824 373600 317424 292237 278616 233061
10703B33061m2898m0301j1206J4136K3883n863J6177K5145J7093k5422k9379m968
$$ 233061 190163 149862 138656 152792 176675 170812 186989 212134 229227 203805 174426 169458
10691A69458j0814n229K8297K1477J8n819k4337o349J0210M117J6553M812k4341
$$ 169458 158644 153415 181712 203189 203207 197388 173051 166702 176912 181029 197582 202394 178053
10678A78053J0732M003M820r441j8953k244j8807J8123M2012k8591n9002N687
$$ 178053 188785 192788 197608 188167 169214 166970 148163 166286 208298 179707 120705 126392
10666A26392L0964o105r182k9445N388J6162o083J1524J1941k0090m6228J8174
$$ 126392 157356 151251 142069 112624 118012 134174 128091 139615 151556 131466 85238 103412
10654A03412L3389J0180L1274M6837J1591J0115L8898K5613j9797k2149k6294
$$ 103412 136801 146981 178255 225092 236683 246798 285696 311309 291512 269363 243069
10643B43069J0813K813L5427K6338J6178J8552j5069J1563K8535l929j5535L201
$$ 243069 253882 256695 292122 318460 334638 353190 338121 349684 378219 374290 358755 361956
10631C61956J1684k774Q887r243j3861j0675J7463L7467Q389l2678m902j1553
$$ 361956 373640 370866 379753 370510 356649 345974 363437 400904 409293 376615 371713 360160
10619C60160p932n526K0884K6671K5768K6848K1286L2246p770R155K1900R875
$$ 360160 352228 346702 367586 394257 420025 446873 468159 500405 492635 501790 523690 533565
10607E33565l6227m1770l2950k3118k4015o680N338j6727J808O217K7311J413
$$ 533565 497338 455568 422618 399500 375485 368805 374143 357416 359224 365441 392752 394165
10595C94165r724J2970J1502j192J3947L4940K1755J7729J6659j7367J2834R538
$$ 394165 384441 397411 408913 407721 421668 456608 478363 496092 512751 495384 508218 517756
10583E17756Q436O632J765l148M78P300P637k6800J8601q512J818L9953J7690
$$ 517756 526192 532824 534589 531441 531919 539219 546856 520056 538657 530145 531963 571916 589606
10570E89606K8428L748J707O0960N1109J6831J2642j0217m0797n1535l8495J0530
$$ 589606 618034 621782 623489 684449 735558 752389 765031 754814 714017 662482 623987 634517
10558F34517j5381R774l1561j4063K3148J4116j6464J3921m440j3819n696L3171
$$ 634517 619136 628910 597349 583286 606434 620550 604086 618007 613567 599748 594052 627223
10546F27223L5184n797Q032K7860K531J7217L4499K6128J3760j5941k3322M8135
$$ 627223 662407 656610 664642 692502 695033 712250 746749 772877 786637 770696 747374 795509
10534G95509O5574N1245J4902j3939Q146J0401L27K7540K0384N6538Q9481M2238
$$ 795509 861083 912328 927230 913291 921437 931838 932165 959705 980089 1036627 1126108 1168346
10522A168346j528K4010O0340M3310L8181M5630M6911L8588N9000P0093O8094
$$ 1168346 1166818 1190828 1251168 1294478 1332659 1378289 1425200 1463788 1522788 1592881 1660975
10511A660975P5171R6606J30926J62974J76655J73624J10766P698j2449p4791
$$ 1660975 1736146 1832752 1963678 2126652 2303307 2476931 2587697 2595395 2582946 2508155
10501B508155p9906l5411j1291N6170P8351N6729Q2262J15159J56207J56585J91918
$$ 2508155 2428249 2392838 2381547 2437717 2516068 2572797 2655059 2770218 2926425 3083010 3274928
10490C274928K10906K61668L21398L25316L41244M76953N18292N61210O45172
$$ 3274928 3485834 3747502 4068900 4394216 4735460 5212413 5730705 6291915 6937087
10481F937087P59723Q89565R43542R36433R34762R47384Q53006R13257J128068
$$ 6937087 7696810 8586375 9529917 10466350 11401112 12348496 13201502 14114759 15242827
10472A5242827J441931J826475K386758L222501M242221N564073P715380J0672513
$$ 15242827 16684758 18511233 20897991 24120492 28362713 33926786 41642166 52314679
10464E2314679J4674650K1198156L1301290M3823363N2721491M8623302M1706913
$$ 52314679 66989329 88187485 119488775 163312138 216033629 264656931 306363844
10457C06363844M5327267L6933376m491463l4095188l9419978m4442562n2433036
$$ 306363844 351691111 388624487 384133024 350037836 310617858 266175296 213742260
10450B13742260n1266656m2687051l1519932k1354460j4333467r972508p174299
$$ 213742260 162475604 119788553 88268621 66914161 52580694 42608186 35433887
10443C5433887n317912m253095l428454k680769k124018j776847j503562j227666
$$ 35433887 30115975 25862880 22434426 19753657 17629639 15852792 14349230 13121564
10435A3121564j003894r74820j015120r72362q94998q59393q33611p39347o12282
$$ 13121564 12117670 11142850 10127730 9155368 8260370 7400977 6567366 5828019 5215737
10426E215737m86448m12675l09920k84134k44637j81940j55245j06366j37587
$$ 5215737 4729289 4316614 4006694 3722560 3477923 3295983 3140738 3034372 2896785
10417B896785j69661j50791j38027j34445r4985j23421j14391r6068q3210n4088
$$ 2896785 2727124 2576333 2438306 2303861 2208876 2085455 1971064 1874996 1791786 1737698
10407A737698n2684q0379j20236j16702m3507k8693o8673p9206p5330n5381l5974
$$ 1737698 1685014 1604635 1484399 1367697 1324190 1295497 1226824 1147618 1072288 1016907 980933
10396I80933k4780o023l4575n318j8581l2082P107p118k1875j7816J238k6154
$$ 980933 956153 950130 915555 910237 891656 859574 866681 859563 837688 819872 821110 794956
10384G94956p079K3313j3219o1532n0972j1438j5687J1765J5438k7135l6163k7716
$$ 794956 787877 811190 797971 736439 685467 674029 658342 670107 685545 658410 622247 594531
10372E94531J3808L175k1466j2873j3836j2214j7946j0025n622J4266j6788k251
$$ 594531 608339 611514 590048 577175 563339 551125 533179 523154 517532 531798 515010 512759
10360E12759j1030m4305k7560j392k0713q160m9081M737K579k0234o118r670j8315
$$ 512759 501729 457424 429864 428472 407759 399599 350518 355255 357834 337600 331482 321812 303497
10347C03497J7505j4600j1834k8322K8543L9879r538q048p411j3673j2186L9143
$$ 303497 321002 306402 294568 266246 294789 334668 325130 317082 309671 295998 283812 322955
10335C22955N5820j2969j4456j4172J155n079j1523n668J427J3730J028K0834
$$ 322955 378775 365806 351350 337178 338333 333254 321731 316063 317490 331220 332248 353082
10323C53082j3089j3489q768L638m963j2930j7846j8127R884M4584K2998J5297
$$ 353082 339993 326504 317736 321374 316411 303481 285635 267508 277392 321976 344974 360271
10311C60271L5906k6368m0439l3175r4278n1568l5509l0885k9511j5565j1117
$$ 360271 396177 369809 329370 296195 201917 150349 114840 83955 54444 38879 27762
10300B7762K9462K4027J428L7295P785k6332L261O120l786L253Q364K3457J3955
$$ 27762 57224 81251 82679 119974 127759 101427 104688 110808 107022 110275 118639 142096 156051
10287A56051k4822m0705k4604L722K4888J3668j1665n954M397Q26J2328j797Q598
$$ 156051 131229 90524 65920 69642 94530 108198 96533 90579 94976 95802 108130 106333 114931
10274A14931k550N88R531K1962J5779K1144R953m00R28J0042L0382K7568m115
$$ 114931 112381 112969 122500 144462 160241 181385 191338 190938 191866 201908 232290 259858 255743
10261B55743P34k862L6671R351l1275l1825q878K426j1227k1271j5914K1950K520
$$ 255743 256477 253615 290286 299637 268362 236537 227659 230085 218858 197587 181673 203623 206143
10248B06143j4535O901j9243l1813k8512L744l1232j0119K4867K7570j2825J0844
$$ 206143 191608 198509 179266 147453 118941 122685 91453 81334 106201 133771 120946 131790
10236A31790R185k5072o794Q287k984R194n180j8431J9422J8052k2111n691K4541
$$ 131790 140975 115903 109109 117396 114412 123606 118426 99995 119417 137469 115358 109667 134208
10223A34208K1915j8590j3332r255j4378k1910K0792M062J6386K2321K5003j438
$$ 134208 156123 137533 124201 114946 100568 78658 99450 103512 119898 142219 167222 165784
10211A65784k6585J7514K1405o92j5667M782J1905j3707j8422q807O599J6144
$$ 165784 139199 156713 178118 177426 161759 166541 178446 164739 146317 137510 144109 160253
10199A60253j4840q448j8828j4084K329j1804k5855K2136J2917j4857L5421J9126
$$ 160253 145413 136965 118137 104053 106382 94578 68723 90859 103776 88919 124340 143466
10187A43466J4584L1573K267k287k3363j6565J3755K6693j0021O3753M7693K882
$$ 143466 158050 189623 191890 189603 166240 149675 163430 190123 180102 243855 291548 294430
10175B94430P6461J12319J07931K09189K47544L50799K46827n7270k44731l04756
$$ 294430 370891 483210 591141 800330 1047874 1398673 1645500 1588230 1343499 1038743
10165A038743k26912j49281j27284o3922k2721j1714k8097j3973n429m088l5933
$$ 1038743 811831 662550 535266 471344 448623 436909 408812 394839 389410 385322 349389
10154C49389m5955q0597n4251p4809n6432l0317j4264k3538j9747L124J5377K358
$$ 349389 303434 222837 168586 93777 37345 7028 -7236 -30774 -50521 -47397 -32020 -29662
10142b9662J2646K2105R660K2523J2559P141m709L675O251j651J355o380o360
$$ -29662 -17016 5089 14749 37272 49831 56972 52263 55938 62189 60538 61893 55513 49153
10129D9153Q786m1r047k2607J46K2938L1525l0598m1403k2966o748Q461L6283
$$ 49153 57939 57898 48851 26244 26390 49328 80853 50255 8852 -14114 -20862 -12401 23882
10116B3882M2931j4502l485O366J4464R4K2009j5118k3753k729j1471k4193J1576
$$ 23882 66813 52311 48826 55192 69656 69750 91759 76641 52888 50159 38688 14495 26071
10103B6071L4799K9327m206j1656p979m1650J9848M0914l97o1681J9788K5913
$$ 26071 60870 90197 85991 74335 66356 24706 44554 85468 85071 23390 43178 69091
10091F9091K0945j4432k9571K1094K9888j2746QL836l9085K100n66r521j3852
$$ 69091 90036 75604 46033 67127 97015 84269 84277 88113 49028 51128 50562 41041 27189
10078B7189K1710R900p012k007M4883l1186l7787K4681J5977K666K0088K9444
$$ 27189 48899 58799 51787 49780 94663 63477 25690 50371 66348 69014 89102 118546
10066A18546q540L6536L4633r215k71p369M3202O9973L8396P0754J20007J57797
$$ 118546 110006 146542 181175 171960 171689 164320 207522 277495 315891 386645 506652 664449
10054F64449J95096K72135K49878K15081K30938K56131J07988j17035j78487k28010
$$ 664449 859545 1131680 1381558 1596639 1827577 2083708 2191696 2074661 1896174 1668164
10044A668164k99145k80692k44705k06553j63870j15846n2392m8860l7315n561
$$ 1668164 1369019 1088327 843622 637069 473199 357353 304961 256101 218786 213225
10034B13225k102r372j60K7747N6607O2649J21368J34260L5583j08556j36712
$$ 213225 211123 201751 201591 229338 285945 348594 469962 604222 639805 531249 394537
10023C94537j09988n7631k8974l8364l7957j4146j2673R737O288k1563k2315q217
$$ 394537 284549 226918 197944 159580 121623 107477 94804 104541 110829 89266 66951 58734
10011E8734l911J0396M637j3556p169j884J6697K7780J1799J194n168J3294J6192
$$ 58734 54823 65219 69856 56300 49131 47247 63944 91724 103523 104717 99549 112843 129035
9998A29035R556l5711k2001J8853M4431L9313Q4554J22814P3308J1730p0445m3338
$$ 129035 138591 102880 80879 99732 144163 183476 268030 390844 464152 475882 405437 362099
9986C62099l4052l6081n1535m4206M984J4346j2024j3900m0824p1361n622L083
$$ 362099 328047 291966 240431 196225 201209 215555 203531 189631 148807 77446 71824 74907
9974G4907j8031N25N52N240l641L488R045J6101K5469K5721J6545J9568M5070
$$ 74907 56876 57401 57953 63193 59552 63040 72085 88186 113655 139376 155921 175489 220559
9961B20559K9525N2763O3462N7750N561m4419n9278l8074m5480m4658o440l0734
$$ 220559 250084 302847 366309 424059 429620 385201 325923 287849 242369 197711 191271 160537
9949A60537J126M2786J3868j482N2389O4943K0323k8827j1335Q240j4881j2037
$$ 160537 161663 204449 218317 216835 269224 334167 354490 325663 314328 322568 307687 295650
9937B95650K2884N2223P3449N4220L598n7436n7739m1488j2636j890m445n37Q108
$$ 295650 318534 370757 444206 498426 502024 444588 386849 345361 332725 330835 326390 325853 333961
9924C33961n179l6835n6802l3177j1420k7263k1519p206j7467J939J0948N0256
$$ 333961 328782 291947 235145 201968 190548 163285 141766 134560 117093 119032 129980 180236
9912A80236j2233J7355N5999J4170M699J6284k1211j9679k4268o416r483j3252
$$ 180236 168003 185358 241357 255527 260226 276510 255299 235620 211352 204936 195453 182201
9900A82201k2330m683J3240j0189K4858L7731m894k7850j3969J7308L0302K7833
$$ 182201 159871 155188 168428 158239 183097 220828 215934 188084 174115 191423 221725 249558
9888B49558J9227p125K808J892J1472j638j0175j6401J1976P7750J08647Q6522
$$ 249558 268785 261660 264468 266360 277832 276194 266019 249618 261594 339344 447991 534513
9876E34513O9880K0866o4360o9805q2989p6006p4670o5421M846j8963m6404q71
$$ 534513 604393 625259 560899 491094 408105 332099 257429 192008 196854 177891 131487 130616
9864A30616L8403k2816l1450L7437K9832p918K1719K2276K7314J9798M6872N6446
$$ 130616 169019 146203 114753 152190 182022 174104 195823 218099 245413 265211 312083 368529
9852C68529O0848N8336J35869J70847J86593J88014J16797k647j45287k22638
$$ 368529 429377 487713 623582 794429 981022 1169036 1285833 1283186 1137899 915261
9842I15261k08057j46483j21764n5684k4537j9666k3784R054j2474J3596j6725
$$ 915261 707204 560721 438957 383273 358736 339070 315286 324340 311866 325462 308737
9831C08737k0677J536P8110J01682N7091j528p8275p6286k3192j23L0455R2901
$$ 308737 288060 289596 367706 469388 526479 524951 446676 370390 347198 347075 377530 470431
9819D70431J38490J66089J32813Q3434k9365j12905j39245j60547j15020r8883
$$ 470431 608921 775010 907823 991257 961892 848987 709742 549195 434175 335292
9809C35292q3342l7033K08lj2870m596k2346k2841k5963L60K569j3215N488J8738
$$ 335292 251950 214917 215125 215122 202252 197656 175310 152469 126506 126866 129435 116220 121708 140446
9795A40446l843j3563l893J4972k315m2708o38J9483K6411Q155k0888O768J4672
$$ 140446 136603 123040 119147 134119 131804 89096 88458 107941 134352 142507 121619 128387 143059
9782A43059l240j3462O956L1212K4645J9994k1727l9374j2202l70j7365j692M5615
$$ 143059 139819 126357 133313 164525 189170 209164 187437 148063 135861 135491 118126 116434 162049
9769A62049L7960L9814L9496M2935O7063O3484J35734K23010J98027J91192Q5795
$$ 162049 200009 239823 279319 322254 389317 452801 588535 811545 1009572 1200764 1286559
9758A286559r870j18310j89114k05061j82254j22793n9474k9457m8593n0809l4120
$$ 1286559 1276689 1158379 969265 764204 581950 459157 399683 370226 321633 270824 236704
9747B36704k77J800j7816j9009k1954j5516N666M031j0585k1947J3458l13l117
$$ 236704 236427 238227 220411 201402 179448 163932 169598 173629 163044 141097 154555 154242 151125
9734A51125j3064J2796N0247L7515P6795R9054M8164M0585J1000M9275N2703m12
$$ 151125 138061 150857 201104 238619 315414 414468 462632 503217 514217 563492 616195 615783
9722F15783m1228p2639k5388n690n6019r7111n3911n492k6705l4918j9990K0423
$$ 615783 574555 501916 476528 470838 414819 317708 263797 258305 231600 196682 176692 197115
9710A97115j6854n193M278J4740J1330k4565m5653N1579P7003Q2908J01620P4301
$$ 197115 180261 175068 179346 194086 205416 180851 135198 186777 263780 346688 448308 522609
9698E22609J1174p9049r6150p0028o3400l5926k4083j583j8533m2535J6058N1664
$$ 522609 533783 454734 358584 288556 225156 189230 165147 163564 145031 102496 118554 170218
9686A70218j8506L290m426k2863j0247j7090J4653K0015j1253j4608J5092l2495
$$ 170218 151712 155002 150576 127713 117466 100376 115029 135044 123791 109183 124275 91780
9674I1780k2804r424J3112K5608K605R393K0856J6776m844l6172J5496K236j732
$$ 91780 68976 59552 72664 98272 100877 110270 131126 147902 143058 106886 122382 124618 122886
9661A22886l5086j2796o806j8L2646O001j2284j6152K44Q912K0028J4886r095
$$ 122886 87800 75004 68198 68180 100826 106827 94543 78391 78635 87547 107575 122461 113366
9648A13366l7951k6965M2530L1802j1136R579j1453q386J0764K7703P410J0695
$$ 113366 75415 48450 90980 122782 111646 121225 109772 101386 112150 139853 147263 157958
9636A57958k585k0087J349O277J0989L596k4370N781j2805l686j3395K3451J989
$$ 157958 155373 135286 136635 142912 153901 157497 133127 138908 126103 122417 109022 132473 134462
9623A34462m193M660K0468N1579J5503k4108j4459K1649k5735K2666J2720k7701
$$ 134462 130269 134929 155397 206976 222479 198371 183912 205561 179826 202492 215212 187511
9611A87511k8506o22m006k7449Q880K1113m184n910l7935j8002L0771J6244p708
$$ 187511 159005 158383 154377 126928 135808 156921 152737 146827 108892 90890 121661 137905 130197
9598A30197K403J3712Ql0672j7956J1540M1746L065n242k6447j1517j5692J5333
$$ 130197 132600 146312 146320 115648 97692 109232 150978 154043 148801 122354 110837 95145 110478
9585A10478K8691J7202K7695p217O96L770k678r632j2373R91j171M1569K2148
$$ 110478 139169 156371 184066 176849 177545 181315 178637 169005 156632 157623 156452 198021 220169
9572B20169L3567J624L213J0452J3178k9831m3713j5629K1337L348j7903j471
$$ 220169 253736 255360 258573 269025 282203 252372 208659 193030 214367 217715 199812 198341
9560A98341L5000J856j0369m3727m0725j0527J6188K3843O582J8169K3852j9932
$$ 198341 233341 235197 224828 181101 140376 129849 146037 169880 176462 194631 218483 198551
9548A98551m4262K8230r0j7920l8806P59K5162K7692M5696j3008m5224j5705K0393
$$ 198551 154289 182519 182429 164509 125703 126462 151624 179316 225012 212004 166780 151075 171468
9535A71468K7526n942k3927m106K338j752R381K477k044k5641l508m192m017J0766
$$ 171468 198994 193052 169125 165019 167357 165605 174986 177463 175419 149778 146270 142078 138061 148827
9521A48827O21J9158j1239j0762J1458j8962n021J3201J9169p552n992O144M59
$$ 148827 149448 168606 157367 146605 158063 139101 134080 147281 166450 158898 152906 159050 159509
9508A59509J4133P761J5587J7766J5714K352O63j410j3394j2443J6668k168p394
$$ 159509 173642 181403 196990 214756 230470 232822 233485 232075 218681 206238 222906 220738 213344
9495B13344Q258K1840l438K912m2234k255J7676K6790p191p49j1112j6712N545
$$ 213344 221602 243442 240004 242916 200682 198427 216103 242893 235702 234953 223841 207129 212674
9482B12674J1415K3347J1897J7710k77L290L107J412N761K1269o088J22L4205
$$ 212674 224089 247436 259333 277043 276766 280056 283163 284575 290336 311605 305517 305639 339844
9469C39844N4132Q6180N8300O6641J28685J50173J67165J76876J31312K5179r0229
$$ 339844 393976 480156 538456 605097 733782 883955 1051120 1227996 1359308 1384487 1294258
9458A294258j70191j79976j64930j30330p1882o9863n0081m0424l9891l7836l521
$$ 1294258 1124067 944091 779161 648831 576949 507086 457005 416581 376690 338854 335333
9447C35333j9166n5103k0943j4265K2039L7718K5750k818j2435n008r032q244
$$ 335333 316167 261064 240121 225856 247895 285613 311363 308545 296110 291102 282070 273826
9435B73826k97k3733k432J8340P067J6618k3972r186j1835n382K1992K2316L585
$$ 273826 273529 249796 247364 265704 272771 289389 265417 256231 244396 239014 261006 283322 286907
9422B86907j5359M292K3438p342P752N216j1296J6222m729J3312j1455K987P016
$$ 286907 271548 275840 299278 291936 299688 304904 293608 309830 305101 318413 306958 309945 316961
9409C16961j8277J100J7820J4267j2263j5339k867k7469q470J2464j1970J0114
$$ 316961 298684 299784 317604 331871 319608 304269 301402 273933 265463 277927 265957 276071
9397B76071L4855M991p466k3352l7537n189P305O597J3006L0477L0391j9257m2878
$$ 276071 310926 315917 308451 285099 247562 242373 249678 256275 269281 299758 330149 310892 268014
9384B68014J5935j0872K9333K2628J2591K1684Q308j2321q526r508j735o943k0027
$$ 268014 283949 273077 302410 325038 337629 359313 367621 355300 346774 337266 335531 328588 308561
9371C08561K6183J1224M430M884J031K389n058l8674j708J7933O540j6381j5249
$$ 308561 334744 345968 350398 355282 356313 358702 353644 314970 313262 331195 337735 321354 306105
9358C06105J2223M3416J133j1368K6384L234J4364K4358j1884Q749K3210l2596
$$ 306105 318328 361744 362877 351509 377893 381127 395491 419849 407965 416714 439924 407328
9346D07328N516K083J9691J0153j7777l753M845N873j1782k2599j127J6206K1132
$$ 407328 412844 414927 434618 444771 426994 423241 428086 433959 422177 399578 398451 414657 435789
9333D35789j402M0859J3942k2639l578K9100P496l0987L493n117r412K7746J4604
$$ 435789 434387 475246 489188 466549 462971 492071 499567 468580 472073 466956 457544 485290 499894
9320D99894l9879k9702K4598K6658K5595L8847L384k0361j4451j384N015m265
$$ 499894 460015 430313 454911 481569 507164 546011 549395 529034 514583 513199 518214 513949
9308E13949L11j52O506J4958r300j0142O023l618J5690P78k452P437K0900J5270
$$ 513949 514260 514108 520614 535572 526272 516130 522153 518535 534225 535003 532551 539988 560888 576158
9294E76158l646O08J737k584P238J3159o20j0527j7246K5517L7720J5081j0625
$$ 576158 572512 573120 574857 572273 579511 592670 592050 581523 564277 589794 627514 642595 631970
9281F31970R795N0853Q684N63j8148l868O908j4548k2695J8474O0106J6246L829
$$ 631970 641765 692618 701302 701865 683717 679849 686757 672209 649514 667988 728094 744340 748169
9268G48169P865J9690j1517J2146K2645j0216n953J7989K8166K8313K4116L0039
$$ 748169 756034 775724 764207 776353 798998 788782 782829 800818 828984 857297 881413 911452
9256I11452L5863r244m458J3658L719j4715j1357K5545K6738J4482L944K7201
$$ 911452 947315 938071 933613 947271 950990 936275 924918 950463 977201 991683 995627 1022828
9244A022828J6000M674k0154Q511L90J9688Q267J9042j1872J7753L0786K5193
$$ 1022828 1038828 1043502 1023348 1031859 1032249 1051937 1060204 1079246 1067374 1085127 1115913 1141106
9232A141106L9766K9660K6354J0499N480K1577M777M1264J7982k188m3694K5120
$$ 1141106 1180872 1210532 1236886 1247385 1252865 1274442 1279219 1320483 1338465 1336277 1292583 1317703
9220A317703K3057J7661K5787K8235M2839J4598j3977L5662L5047L4754P661J3548
$$ 1317703 1340760 1358421 1384208 1412443 1455282 1469880 1455903 1491565 1526612 1561366 1569027 1582575
9208A582575L3638L4933K6638J4324P230O1072N6917K5492r468M5715K2326M4119
$$ 1582575 1616213 1651146 1677784 1692108 1699338 1760410 1817327 1842819 1833351 1879066 1901392 1945511
9196A945511L0121K7877L0051J8442L6938P0591L6175O948J9791K6925O5888N5707
$$ 1945511 1975632 2003509 2033560 2052002 2088940 2159531 2195706 2202654 2222445 2249370 2315258 2370965
9184B370965L6533M1924M4780L0855M8147P4954P5610O5115M8165N6333O0797
$$ 2370965 2407498 2449422 2494202 2525057 2573204 2648158 2723768 2788883 2837048 2893381 2954178
9173B954178P6088N4296R0511J01420Q8451O8287P7596J11181R9274O5588Q5984
$$ 2954178 3030266 3084562 3175073 3276493 3364944 3433231 3510827 3622008 3721282 3786870 3872854
9162C872854J11638J39339J16069R0993J11962J13803J22554J14895J60345J31278
$$ 3872854 3984492 4123831 4239900 4330893 4442855 4556658 4679212 4794107 4954452 5085730
9152E085730J71230J89085J61209J41458J91850J92902J81200J89248K46572K62123
$$ 5085730 5256960 5446045 5607254 5748712 5940562 6133464 6314664 6503912 6750484 7012607
9142G012607K64702K42250K19851K74215K86549L04942L58570L66839L82942M00430
$$ 7012607 7277309 7519559 7739410 8013625 8300174 8605116 8963686 9330525 9713467 10113897
9132A0113897M17503M57738N08992N28996N11909N44146N79249O12221O80015
$$ 10113897 10531400 10989138 11498130 12027126 12539035 13083181 13662430 14274651 14954666
9123A4954666P09952P62008Q24571Q97470R37749J002021J051187J178684J240396
$$ 14954666 15664618 16426626 17251197 18148667 19086416 20088437 21139624 22318308 23558704
9114B3558704J303944J384929J491224J583645J687794J774744J834416J910374
$$ 23558704 24862648 26247577 27738801 29322446 31010240 32784984 34619400 36529774
9106C6529774K024143K144923K151285K167889K176069K167471K114031K030129
$$ 36529774 38553917 40698840 42850125 45018014 47194083 49361554 51475585 53505714
9098E3505714J882360J710898J459987J186403Q46028N05858J63503k18072o20079
$$ 53505714 55388074 57098972 58558959 59745362 60591390 61097248 61260751 61042679 60422600
9089F0422600r55813j291270j560139j751657j923684k040711k103572k172462
$$ 60422600 59466787 58175517 56615378 54863721 52940037 50899326 48795754 46623292
9081D6623292k211800k209792k146982k114360k031887j905677j836702j729554
$$ 46623292 44411492 42201700 40054718 37940358 35908471 34002794 32166092 30436538
9073C0436538j632789j564917j453398j351724j297103j239562j136408r98584
$$ 30436538 28803749 27238832 25785434 24433710 23136607 21897045 20760637 19762053
9065A9762053r90952r24222q88574q36636q06673p21333o46811o27033n81919
$$ 19762053 18771101 17846879 16958305 16121669 15314996 14593663 13946852 13319819 12737900
9056A2737900n31061m95734m82239m86934m64013l89311m06500l63422l40897
$$ 12737900 12206839 11711105 11228866 10741932 10277919 9888608 9482108 9118686 8777789
9047H777789l54560l19177k97629k85205k49411k42180k85578k68797j97216k13074
$$ 8777789 8423229 8104052 7806423 7521218 7271807 7029627 6744049 6475252 6278036 6064962
9037F064962j81663j70057j56856j96800j75286j51660j71754j41893j19869j13395
$$ 6064962 5883299 5713242 5556386 5359586 5184300 5032640 4860886 4718993 4599124 4485729
9027D485729j20122j09491j22069j33206j19564r1314o6311j03653r9222q1535
$$ 4485729 4365607 4256116 4134047 4000841 3881277 3789963 3723652 3619999 3520777 3439242
9017C439242q2492q1745n8323p6709q5879o8875p8100q9180o7941l1942n9732
$$ 3439242 3356750 3275005 3216682 3139973 3054094 2985219 2907119 2817939 2749998 2718056 2658324
9006B658324r9068l2816m1984n2856n8828o7547m8087n1344n4540l2997m5693
$$ 2658324 2559256 2526440 2484456 2431600 2372772 2305225 2257138 2205794 2151254 2118257 2072564
8995B072564n2585k0623j0886k0800l3905j2016n0261o5617j3498q756m2679l4947
$$ 2072564 2019979 1999356 1988470 1967670 1933765 1921749 1871488 1805871 1792373 1783617 1740938 1705991
8983A705991l5062j1729n2058m1447l9867n3337q866n922k3405k8899l9953m5872
$$ 1705991 1670929 1659200 1607142 1565695 1525828 1472491 1463625 1457703 1434298 1405399 1365446 1319574
8971A319574j4204j764l0148k947K3474m200j7678l8998o3512n2416j3260j9519
$$ 1319574 1305370 1303606 1273458 1270511 1293985 1289785 1272107 1233109 1169597 1117181 1103921 1084402
8959A084402k6916q371q923j1721j1156j7832l27p065j390j0221r988l5415k1274
$$ 1084402 1057486 1049115 1040192 1028471 1017315 999483 999156 992091 990701 980480 970492 935077 913803
8946I13803Q780l1675m789Q650m5750j8155q446R168j8555k1608j5397j5615k1914
$$ 913803 922583 890908 886119 894769 849019 830864 822418 831586 813031 791423 776026 760411 738497
8933G38497j803r085k139o248J589K9212M508j9388J5079p045l4657j6544J5044
$$ 738497 736694 727609 725470 719222 720811 750023 754531 735143 750222 743177 708520 691976 707020
8920G07020j2940j1863J3181j1648m0442l5013j1208k2853j4349j8564K533k095
$$ 707020 694080 682217 695398 683750 643308 608295 597087 574234 559885 541321 543854 541759
8908E41759J7506K1887j4620P05J4160m739j6250l6598j0022k183L5248j2387
$$ 541759 559265 581152 566532 567237 581397 576658 560408 523810 513788 511605 546853 534466
8896E34466N960m558j4254j8552j168l6089R107L3792K3750M131j4774j6540r698
$$ 534466 540426 535868 521614 503062 501894 465805 474912 508704 532454 536585 521811 505271 495573
8883D95573l1482l8916J2565J3897N290j8025k2149k0679P918o409j1466K4806
$$ 495573 464091 425175 437740 451637 456927 438902 416753 396074 403992 397583 386117 410923
8871D10923L2476j0101l8534p191O739J4524k4525j8255K0582R460l4170j7595
$$ 410923 443399 433298 394764 387573 394312 408836 384311 366056 386638 396098 361928 344333
8859C44333K0425K3665J1289l0011l1832p483p855K8627P356r302l2300K387j0470
$$ 344333 364758 388423 399712 369701 337869 330386 322531 351158 358514 349212 316912 319299 308829
8846C08829J9517k881m614j0571O047N707J0348K2657j9311k5135n292M430p444
$$ 308829 328346 325465 320851 310280 316327 322034 332382 355039 335728 310593 305301 309731 302287
8833C02287j5632j4849K672N113o953J1832P50l2267m826R955K2212N594N232
$$ 302287 286655 271806 274478 279591 272638 284470 285220 252953 248127 258082 280294 285888 291120
8820B91120j116J2005K7577Q816k5875k8341j2938k3341n677R76J1749Q52J313
$$ 291120 290004 302009 329586 338402 312527 284186 271248 247907 242230 243206 254955 255807 257120
8807B57120j4348j1068k17N027J0421k8995O780L3802o789j1614R625j7947j4751
$$ 257120 242772 231704 231487 236514 246935 217940 224720 258522 251733 240119 249744 231797 217046
8794B17046J1335J7247K947l6791K1689N606N724o092k1300k8702J0433O168n305
$$ 217046 228381 245628 248575 211784 233473 239079 244803 238711 217411 188709 199142 205310 200005
8781B00005j743l3669k6777K3998k5266l0222j4267j544J3347Q685L2223K1324
$$ 200005 198262 164593 137816 161814 136548 106326 92059 90515 103862 112547 144770 166094
8769A66094p813K9595M4324j0599l9715j5388q0l1846o898j4850k5178p034K8721
$$ 166094 158281 187876 232200 221601 181886 166498 166418 134572 127674 112824 87646 80612 109333
8756A09333K5894K2082n959l6920j9395P296L668J3782J9438N880K3351j0981
$$ 109333 135227 157309 151350 114430 95035 102331 105999 119781 139219 145099 168450 157469
8744A57469j5804o341J8120p474l2261k931J0843K665j9118m180P188K0563N1787
$$ 157469 141665 135324 153444 145970 113709 110778 121621 124286 105168 100988 108176 128739 180526
8731A80526j388k1676k5317m797N154m738k7497k2398n732K4522L7790l475q329
$$ 180526 179138 157462 132145 127348 132502 127764 100267 77869 72137 96659 134449 130974 122645
8718A22645p658M209K1750K5833k7708j5268j0330m042r701L410K028M4003o117
$$ 122645 114987 119196 140946 166779 139071 123803 113473 109431 99730 103140 105168 149171 143054
8705A43054L171r830k4752k0868M655K6153J521j2322k0068k3767J3303K9972
$$ 143054 146225 136395 111643 90775 95430 121583 123104 110782 90714 66947 80250 110222
8693A10222K2260Q530j415n709o537l4593j6916L1480K2835l875j4559J1566j0675
$$ 110222 132482 141012 139597 133888 127351 92758 75842 107322 130157 126282 111723 123289 112614
8680A12614l4285J9361J6478k035k4657r228L850Q769K4790j217m1227l8891N551
$$ 112614 78329 97690 114168 112133 87476 78248 82098 90867 115657 114440 73213 34322 39873
8667C9873K0076N9423J0749o063m0754j2716j0866o540O649K5681L3449J8241
$$ 39873 59949 119372 130121 124058 83304 70588 59722 53182 59831 85512 118961 137202
8655A37202n075j1444j026K28k1585j0885n093N774Q517J0526k322j0077p804
$$ 137202 132127 120683 119657 119885 98300 87415 82322 88096 96613 107139 104817 94740 86936
8642H6936K833O51k1141L1394J4255J5654O603J8505Q458K1654j5794j9817l178
$$ 86936 89769 90420 69279 100673 114928 130582 137185 155690 164148 185802 170008 150191 147013
8629A47013p156R660L654J0798L265j8777j1661j5714k8119k3052Q759J5182j8360
$$ 147013 139857 149517 153171 163969 167234 148457 136796 121082 92963 69911 78670 93852 75492
8616G5492j1334J620J1660q338j6695l560J814J4770K4466j1353l4914k9892R227
$$ 75492 64158 65778 77438 69100 52405 48845 50659 65429 89895 78542 43628 13736 22963
8603B2963N6899J5405J5340N407l3190k3241J2429L0301p73j1914l207K5812j1679
$$ 22963 79862 95267 110607 116014 82824 59583 72012 102313 101540 89626 86419 112231 100552
8590A00552j1055J7023K6292J9930J8594k2519K2706M7480M6926M2702m4608j7718
$$ 100552 89497 106520 132812 152742 171336 148817 171523 219003 265929 308631 264023 246305
8578B46305l1146l8759K3136l450m3121k1451m3650o836M55Q008K0502J1494k7596
$$ 246305 215159 176400 199536 196086 152965 131514 87864 81028 81483 89491 109993 121487 93891
8565I3891m1195K8783L178j6670o560j1544O789J3520r060j4187K7688P745l4572
$$ 93891 52696 81479 84657 67987 61427 49883 56672 70192 61132 46945 74633 82378 47806
8552D7806j0841m440N006k242O098J7785j845p347K5804J6968j9243L351n318
$$ 47806 36965 32525 37531 35289 41387 59172 57327 49980 75784 92752 73509 76860 71542
8539G1542R664K7282L3686M6376L1712j7796j7365J9701M657j9538l3090l2207
$$ 71542 81206 108488 142174 188550 220262 202466 185101 204802 209459 189921 156831 124624
8527A24624r963k5998j003J024j7540Q818L9113q497l7918l7507K010J9295J293
$$ 124624 114661 88663 87660 88684 71144 79962 119075 110578 72660 35153 37163 56458 57751
8514E7751J1857L6014k8658j3235j1869J456J7568k097j0033j8166j3633j6484
$$ 57751 69608 105622 76964 63729 51860 53316 70884 68787 58754 40588 26955 10471
8502A0471J4512K7j7016J4138M3678L763l6840j9187K4444K1557k0711j3311n120
$$ 10471 24983 25010 7994 22132 65810 69573 32733 13546 37990 59547 38836 25525 20405
8489B0405J6460K2780j5388K0150J4320k1542j1315j0556n857Q711r424m750R721
$$ 20405 36865 59645 44257 64407 78727 57185 45870 35314 29457 38168 28744 23994 33715
8476C3715J7941k64o567L614L565j5274j0981j5222j0184J949j84K353J3566J4234
$$ 33715 51656 51392 44825 48439 52004 36730 25749 10527 343 2292 2108 4461 18027 32261
8462C2261L6939j2522m0434k5491j0825J2462J9624L4765J2360j6039J0781l2326
$$ 32261 69200 56678 16244 -9247 -20072 -7610 12014 46779 59139 43100 53881 21555
8450B1555k5110r255J2351o802M602O962J3746M334K3737K0429j8165J1677L0004
$$ 21555 -3555 -12810 -459 -7261 -2659 4303 18049 22383 46120 66549 48384 60061 90065
8437I0065m671l6052j8687Q516k2107J4768J0608j7776K364j3524j1074J3032
$$ 90065 85394 49342 30655 39171 17064 31832 42440 24664 27028 13504 2430 15462
8425A5462J7151J7357K580p471p022r887O538L4049o645j1322j6348o545L73m540
$$ 15462 32613 49970 52550 45079 38057 28170 34708 68757 62112 50790 34442 27897 28270 23730
8411B3730q952k997N865J070L2599J4725J215R829j7297m955j0501k2500j0775
$$ 23730 14778 11781 17646 18716 51315 66040 67255 77084 59787 54832 44331 21831 11056
8398A1056L0464J1051j081L0059J0122l3891o575k1793K665l798m5457K4157L0319
$$ 11056 41520 52571 51490 81549 91671 57780 51205 29412 32077 28279 -17178 6979 37298
8385C7298k307j7918j5922j4450j9817L217N1303K5934r569j4686q004P888l438
$$ 37298 34991 17073 1151 -13299 -33116 -29899 21404 47338 37769 23083 15079 22967 19529
8372A9529p319L4888j4767j6252Q696K245p847O102R114o653J1469J6373j3180
$$ 19529 12210 47098 32331 16079 24775 27020 19173 25275 34389 27736 39205 55578 42398
8359D2398r838Q155J9857j1338j5055j2904J3391J9820J3639M3526L0763m6535
$$ 42398 32560 40715 60572 49234 34179 21275 34666 54486 68125 111651 142414 95879
8347I5879k9706Q322n2512k8228K238J4017Q012J5482O866j1501r593r185m1788
$$ 95879 66173 74495 21983 -6245 -4007 10010 18022 33504 40370 28869 19276 10091 -31697
8334c1697L5076K1054M922P010J3993j5745J0999K8734l3862k7861j6724J3572
$$ -31697 3379 24433 29355 36365 50358 34613 45612 74346 40484 12623 -4101 9471
8322I471K6957j3362j2697K5778J3505j6721o610j451M458n164N833j2589m630
$$ 9471 36428 23066 10369 36147 49652 32931 26321 24870 29328 24164 29997 17408 12778
8309A2778j5346j2451j2898n460J1167r01N1651K1747j3431o410l3439J6911J4797
$$ 12778 -2568 -15019 -27917 -33377 -22210 -23111 28540 50287 36856 30446 -2993 13918 28715
8296B8715q588j563p156l5650k6453J1658K5586k410J0034K1613K935K6442p184
$$ 28715 20127 18564 11408 -24242 -50695 -39037 -13451 -15861 -5827 15786 18721 45163 37979
8283C7979j9418K329L623k173j2619L3232j7179o5369J8555K0164k3140l208J5515
$$ 37979 18561 20890 24513 22340 9721 42953 25774 -39595 -21040 -876 -24016 -27224 -11709
8270a1709M313J3085J6703R108q694l4848j5610J045K953m341J4590j2802M626
$$ -11709 -7396 5689 22392 31500 22806 -12042 -27652 -26607 -23654 -27995 -13405 -26207 -21581
8257b1581L6502M1855l3183m2790J794n747j8085p300l2600n828p06Q957J7388
$$ -21581 14921 56776 23593 -19197 -17403 -23150 -41235 -48535 -81135 -86963 -87669 -78712 -61324
8244f1324K662J128N9600L1874l7879n792k1631m386J4023J6943j5675J8479L66
$$ -61324 -58662 -57534 2066 33940 -3939 -9731 -31362 -35748 -21725 -4782 -20457 -1978 -1612
8231a612j1580K954j5436J3170L6760j6166Q954M2576k74j6055k2227l782j9877
$$ -1612 -13192 -10238 -25674 -12504 24256 8090 17044 59620 59346 43291 21064 17282 -2595
8218b595p571J8689K978J0734R6r371Q288L0089l386k8687J3787K0204j4468k5006
$$ -2595 -10166 8523 11501 22235 22331 12960 21248 51337 47951 19264 33051 53255 38787 13781
8204A3781k9392m273l3117O863L5474L775k1529o071J4120J5282j950j5406L1449
$$ 13781 -15611 -19884 -53001 -46138 -10664 -6889 -28418 -34489 -20369 -5087 -7037 -22443 9006
8191I006K2865K342p724j0380j4555l969k609K0562P551K764K1899p767n408j1552
$$ 9006 31871 34213 26489 16109 1554 -2415 -5024 15538 23089 25853 47752 39985 34577 23025
8177B3025J4217j1295j5958l0648L1612K5626n1247j4056m83m658p820P522O521
$$ 23025 37242 25947 9989 -20659 10953 36579 -14668 -28724 -29207 -33865 -41685 -34163 -27642
8164b7642J845n164p962K5420j369j4592j6675J6416J9355j1828k3256j1086Q115
$$ -27642 -25797 -30961 -38923 -13503 -14872 -29464 -46139 -29723 -10368 -22196 -45452 -56538 -48423
8151d8423J5456J816L174K5686l971K325j2337l848J2016J9494N510K1133j441
$$ -48423 -32967 -31151 -27977 -2291 -6262 -3937 -16274 -20122 -8106 11388 16898 38031 36590
8138C6590J0750r1j4430k1073l1074p12K8722J6567k6760O449n780j2510J583
$$ 36590 47340 47249 32819 11746 -19328 -20040 8682 25249 -1511 4938 -842 -13352 -11769
8125a1769L393J5524k3225J2025n222k2618J8833M0992l2167k8151k2922J4417
$$ -11769 -8376 7148 -16077 -4052 -9274 -31892 -13059 27933 -4234 -32385 -55307 -40890
8113d0890L3493P456n579M81L111k1560j2583P016p057J4170J1576j3271l0386
$$ -40890 -7397 59 -5520 -5039 -1928 -23488 -36071 -29055 -36112 -21942 -10366 -23637 -54023
8100e4023j0235J5410L9580M058P30k907L135j7604n334J2125N7398K4040k752
$$ -54023 -64258 -48848 -9268 -5210 -4480 -7387 -4252 -21856 -27190 -15065 42333 66373 63621
8087F3621p474j4052j6159J2522m156k1340k4114j5254L031L0562P021l7174l7824
$$ 63621 56147 42095 25936 38458 34302 12962 -11152 -26406 -23375 7187 14208 -22966 -60790
8074f0790p375K8026K3060K0744K9832o083l4826n380J1491j0627p552R756O032
$$ -60790 -68165 -40139 -17079 3665 33497 27414 -7412 -12792 -1301 -11928 -19480 -9724 -3692
8061c692j56m902o930p277K3618J4785P757L6003j2475j3229l482o036p890j9182
$$ -3692 -3848 -8750 -15680 -22957 661 15446 23203 59206 46731 33502 30020 23984 16094 -3088
8047c088j2034L1182K1978j74l4109j8707J2766p146J5925j648J6641L8498k149
$$ -3088 -15122 16060 38038 37864 3755 -14952 -2186 -9332 6593 4945 21586 60084 57935
8034E7935k0100k6059O494k0427j5489P98Q17K454J8992Q736K1817J1526j2510
$$ 57935 37835 11776 18270 -2157 -17646 -16848 -16031 -13577 5415 14151 35968 47494 34984
8021C4984l3539J3777K433o376K517K588m853J5901M214N60k8862k7588j6969
$$ 34984 1445 15222 17655 11279 13796 16384 11531 27432 31646 32206 3344 -24244 -41213
8008d1213k581K4136J4360L6876R060l0545r822j4051k605j6497R112L4672M477
$$ -41213 -43794 -19658 -5298 31578 40638 10093 271 -13780 -16385 -32882 -23770 10902 15379
7995A5379qm573m447j2062J0140J6654K312J2340j718n490K0883l080l6229j9089
$$ 15379 15371 10798 6351 -5711 4429 21083 23395 35735 34017 28527 49410 46330 10101 -8988
7981h988k2080j626P173J3681j9783M467L7582Q508k1968m8178L3482l330j7413
$$ -8988 -31068 -32694 -25521 -11840 -31623 -27156 10426 18934 -3034 -51212 -17730 -21060 -38473
7968c8473k729J3272k3608K1561N399j2465K8186L2364J0811k2329J772j3697
$$ -38473 -41202 -27930 -51538 -29977 -24578 -37043 -8857 23507 34318 11989 13761 64
7956F4k7838L572J5427L0373K4375q711k9601K0686k6600k6753M6285J8923l015
$$ 64 -27774 -24202 -8775 21598 45973 37262 7661 28347 1747 -25006 21279 40202 37187
7943C7187N476k3672r537K1529M171M039J4951p693j2238k4279j2581J7694K2444
$$ 37187 42663 18991 9454 30983 35154 39193 54144 46451 34213 9934 -2647 15047 37491
7930C7491j3504r31N120l721k7345l2761K0736N4741j206k6817j9142N851J0180
$$ 37491 23987 23056 28176 24455 -2890 -35651 -14915 39826 38620 11803 -7339 -1488 8692
7917H692j942J2071K0868l1691m419K2798J798j4707O678o271m6877k3574K9574
$$ 8692 6750 18821 39689 7998 3579 26377 28175 13468 20146 13875 -33002 -56576 -27002
7904b7002J5595J7071m169q746J8751K6157K6236l921j0831O315J0470k2874l5631
$$ -27002 -11407 5664 1495 -7251 11500 37657 63893 59972 49141 55456 65926 43052 7421
7891G421m4726Q511k989O276K1058K0645O576k5015l0849n059m355j0078J4111
$$ 7421 -37305 -28794 -31783 -25507 -4449 16196 22772 -2243 -33092 -38151 -42506 -52584 -38473
7878c8473J2677J659L2770p378j2938j6674J7597M221l4284P007L479k3601j1067
$$ -38473 -25796 -24137 8633 1255 -11683 -28357 -10760 -6539 -40823 -33816 -30337 -53938 -65005
7865f5005J0919J4933N705k5463O60J1508M9867M231k8714j3100k818j7515O647
$$ -65005 -54086 -39153 -33448 -58911 -58251 -46743 3124 7355 -21359 -34459 -37277 -54792 -48145
7852d8145J3053J98j3473L4122L8882J3181j7388j937k4144K7320K4362R426j4793
$$ -48145 -35092 -34894 -48367 -14245 24637 37818 20430 18493 -5651 21669 46031 55457 40664
7839D0664r67p03j5995r382J2118k8886J3354r902k2911J5775K1781o931j63Q941
$$ 40664 39697 38994 22999 13617 25735 -3151 10203 301 -22610 -6835 14946 8015 7852 16793
7825A6793J3361m248k9389m3902o106K2423M2627J896K1926J0901k9019j4238
$$ 16793 30154 25906 -3483 -47385 -53491 -31068 11559 13455 35381 46282 17263 3025
7813C025O782l484N175j6078j7700P791K6584K947j5279L9838L1637k6301n2801
$$ 3025 9807 6323 11498 -4580 -22280 -14489 12095 15042 -237 39601 71238 44937 -7864
7800g864k1759Q668K7535n36k1543l3912J1931n493J1564L1889J9869q639k0886
$$ -7864 -29623 -20955 6580 6044 -15499 -49411 -37480 -42973 -31409 480 20349 11710 -9176
7787i176J050k967j0213J710O92Q984q466j4284j7054j6726K926K6029K8985k907
$$ -9176 -8126 -11093 -21306 -19596 -18904 -9920 -18386 -32670 -49724 -66450 -63524 -37495 -8510 -11417
7773a1417J5146R026n20k584J027j7578k4281k5529J136K7004K331r888Q901j1657
$$ -11417 3729 12755 12235 9651 10678 -6900 -31181 -56710 -55574 -28570 -26239 -36127 -27226 -38883
7759c8883M536K5808J730j2766p113K1741N0002K0672j9757j5388l4267j1913
$$ -38883 -34347 -8539 -6809 -19575 -26688 -4947 45055 65727 45970 30582 -3685 -15598
7747a5598n658J9018J2825N088O934r914j5932L6395p111k9851j4489M554j7583
$$ -15598 -21256 -2238 10587 15675 22609 12695 -3237 33158 26047 -3804 -18293 -13739 -31322
7734c1322o230o702N999K3268J5150j634q930j1756P078J0284j7592k5628O037
$$ -31322 -37552 -44254 -38255 -14987 163 -1471 -10401 -22157 -15079 -4795 -22387 -48015 -41978
7721d1978L463L0712J8899o104K774J1181o630R067J0388J6890o354N698l8018
$$ -41978 -38515 -7803 11096 4992 7766 18947 12317 21384 31772 48662 42308 48006 9988
7708I988j2227K6321P517K023r912J8512J4868l2132r461J0353l3099O762J3206
$$ 9988 -2239 24082 31599 33622 23710 42222 57090 24958 15497 25850 -7249 -487 12719
7695A2719J189j7883K780Q808k3442j7115k5011k612K2805j0311J2482L3712J8762
$$ 12719 13908 -3975 -1195 7613 -15829 -32944 -57955 -60567 -37762 -48073 -35591 -1879 16883
7682A6883R722l8103J647O426K5140N888M666j7929j4566K1381J0716k4063l3928
$$ 16883 26605 -11498 -9851 -3425 21715 27603 32269 14340 -226 21155 31871 7808 -26120
7669b6120r260O657j0884K4095M4349k3801j4191J8410J8446j3601o118K427k2384
$$ -26120 -35380 -28723 -39607 -15512 28837 5036 -9155 9255 27701 14100 7982 10409 -11975
7656a1975J4453N043j4596j2487J5316j26O780j8721J2250N2613j4721l3128J7204
$$ -11975 2478 7521 -7075 -19562 -4246 -4372 2408 -16313 -4063 48550 33829 701 17905
7643A7905K9191j1648n6270j244K3315Q004J3915J4645K0153k3197k9848J945
$$ 17905 47096 35448 -20822 -22066 1249 9253 23168 37813 57966 34769 4921 6866
7631F866K868j5445m244k76p692k1614n556J869L3101K4709l292l3115K5714l0095
$$ 6866 9734 -5711 -9955 -10231 -17923 -39537 -45093 -43224 -10123 14586 11294 -21821 3893 -26202
7617b6202j7335K9954K7279K3409J779J7440j0221l5644j6613K5516J7163m616
$$ -26202 -43537 -13583 13696 37105 38884 56324 46103 10459 -6154 19362 36525 31909
7605C1909k7846k879r832k1023J4006J6992L371r432l928j380N159Q063j8186
$$ 31909 4063 1184 -8648 -29671 -15665 1327 4698 -4734 -8662 -10042 -4883 3180 -15006
7592a5006l1569m376N504R975J9710J3679j1557J0309L8759J0052l243j0787o16
$$ -15006 -46575 -50951 -45447 -35472 -15762 -2083 -13640 -3331 35428 45480 42237 31450 30834
7579C0834k841k6181K687j01L3234K9913j8127L594j3077P947j6472n307p434
$$ 30834 27993 1812 4499 4398 37632 67545 49418 53012 39935 47882 31410 26103 18669
7566A8669p077r131p37J3686L832P964k991K396m746l1794l9374j3134p35J3029
$$ 18669 11592 2461 1724 15410 19242 27206 24215 26611 21865 -9929 -49303 -62437 -63172 -50143
7552e0143Q664N654L3308M4418j1281k6691k1107J9389p264J954K996j4543l416
$$ -50143 -41479 -35825 -2517 41901 30620 3929 -17178 2211 -5053 -3099 -103 -14646 -18062
7539a8062p441j7580N897K7662K2739K017J5974j4172m1263P263N786J9616K2183
$$ -18062 -25503 -43083 -37186 -9524 13215 15232 31206 17034 -24229 -16966 -11180 8436 30619
7526C0619k531j3916k0349K4736N943J0454k4795j7603N68J5743j3749K3230p879
$$ 30619 28088 14172 -6177 18559 24502 34956 10161 -7442 -6874 8869 -4880 18350 10471
7513A0471j4635J5933P27m3164l1950o778N421r736J5197J1592m542J7548K5725
$$ 10471 -4164 11769 12496 -30668 -62618 -69396 -63975 -73711 -58514 -46922 -51464 -33916 -8191
7500h191K1800j825j0226j2881J901O716j0172p664j652J5800K5308K7318j5110
$$ -8191 13609 11784 1558 -11323 -9422 -2706 -12878 -20542 -22194 -6394 18914 46232 31122
7487C1122j8172j2191j2898J6530r934r01K482j2117j3670J7386J2598p125L6646
$$ 31122 12950 759 -12139 4391 -5543 -6444 -3962 -16079 -29749 -12363 235 -6890 29756
7474B9756J3374q004K588k2002j995Q845O031k0740l6515p573P136J7586L774
$$ 29756 43130 35126 37714 15712 13717 22562 28593 7853 -28662 -36235 -29099 -11513 -7739
7461g739j5470J7640K4392m167K2959M748k7201l663q29J4427P402r042k3673
$$ -7739 -23209 -5569 18823 14656 37615 42363 15162 11499 10670 25097 32499 23457 -216
7448b16j576P805K0044J032k2831n297J431J4469O61k213j2872j0767J9938j7750
$$ -216 -1792 6013 26057 27089 4258 -1039 392 14861 15522 13309 437 -10330 9608 -8142
7434h142n276L783j9054P965j544J0658L555k747j6295R744j393Q541L5146l824
$$ -8142 -13418 -9635 -28689 -20724 -22268 -11610 -8055 -10802 -27097 -17353 -18746 -10205 24941 21117
7420B1117j4579j5252j1085j6638N597j2485k7033j0101K6507K0358j9235o31
$$ 21117 6538 -8714 -19799 -36437 -30840 -43325 -70358 -80459 -53952 -33594 -52829 -53460
7408e3460J5165J9454r833k1869j4803R209J273K8897N6048j4208m9769M047O965
$$ -53460 -38295 -18841 -28674 -50543 -65346 -56137 -54864 -25967 30081 15873 -33896 -29849 -22884
7395b2884O834K0858O183J7052L1616l6315o2468M062N7212J3267l0579l695N499
$$ -22884 -16050 4808 10991 28043 59659 23344 -39124 -35062 22150 35417 4838 1143 6642
7382F642J6496j473J6307J4995q279k3807l7672k5786q344O371O23K486k4980
$$ 6642 23138 21665 37972 52967 44688 20881 -16791 -42577 -50921 -44550 -43927 -41441 -66421
7369f6421q686J579L580l167Q850J5433K9419K4456J687r433L835R749j420p8
$$ -66421 -75107 -73528 -69948 -73115 -64265 -48832 -19413 5043 6730 -2703 1132 10881 9461 9383
7355I383k0361L131o39o372k6629K210M616j6267M061j2611m529J543M0964j5289
$$ 9383 -10978 -7847 -8486 -14858 -41487 -39277 -34661 -50928 -46867 -59478 -64007 -62464 -21500 -36789
7341c6789K153j0731J2103J6866L327n887j8840l487J4890R630M704M92j1265
$$ -36789 -34636 -45367 -33264 -16398 -13071 -18958 -37798 -41285 -26395 -16765 -12061 -11569 -22834
7328b2834k766K3973J8847l100l305R89K973k6806J1958m684J971K1016K2315
$$ -22834 -25600 -1627 17220 14120 10815 11804 14777 -12029 -71 -4755 -2784 18232 40547
7315D0547J7628j3936j9811K739m354k4228l3016R851K2785j2883m572L3219p567
$$ 40547 58175 44239 24428 27167 22813 -1415 -34431 -24580 -1795 -14678 -19250 13969 6402
7302F402j1159K3001K7223j4135k4635l076L26J0045J6240p470R455J5292l493
$$ 6402 -4757 18244 45467 31332 6697 3621 3947 13992 30232 22762 32217 47509 44016
7289D4016j4140j1732p960J4117R961J5489j1907r94l603k5412J5638J6201j4978
$$ 44016 29876 18144 10184 24301 34262 49751 37844 36850 33247 7835 23473 39674 24696
7276B4696J3997P344J4599k8261m2131k0410R330M271J2216N761M747j8705k8842
$$ 24696 38693 46037 60636 32375 -9756 -30166 -20836 -16565 -4349 1412 6159 -12546 -41388
7263d1388j9543J8371J0609L341r042J697J2150j4638K0941J4243k2066n828K531
$$ -41388 -60931 -42560 -31951 -28610 -37652 -35955 -23805 -38443 -17502 -3259 -25325 -31153 -28622
7250b8622J5292j58j2317j7489m905J413L4659l281o41L065j7133k2975N006K5340
$$ -28622 -13330 -13488 -25805 -43294 -48199 -46786 -12127 -15408 -16049 -12984 -30117 -53092 -48086 -22746
7236b2746L692O532K506k7612m98P679L0261m870J0064K8104Q612j397j9511j7387
$$ -22746 -19054 -12522 -10016 -37628 -38126 -30447 -186 -5056 5008 33112 41724 40327 20816 3429
7222C429j7604N787k2733N014J2492J6586K195P979J7215m7944m2084K3110j1140
$$ 3429 -14175 -8388 -31121 -26107 -13615 2971 5166 13145 30360 -17584 -59668 -36558 -47698
7209d7698q80K2061k262K3475Q745r056J3667L768j6509J5059Q791P639p824k5620
$$ -47698 -48578 -26517 -28779 -5304 3441 -5615 8052 11820 -4689 10370 19161 26800 18976 -6644
7195f644j3005l0762k0282L3819J9371J5134j8411l8931N894J1794J7608J7738
$$ -6644 -19649 -50411 -70693 -36874 -17503 -2369 -20780 -59711 -53817 -42023 -24415 -6677
7183f677L1484N340j7907k7503j9504N343K4756K293q983M83N435N597Q624j9012
$$ -6677 24807 30147 12240 -15263 -34767 -29424 -4668 -2375 -11358 -10875 -5440 157 8781 -10231
7169a0231k861k0974J0099p850q905j2770n419P659J2665L3053p33L3503K4622
$$ -10231 -13092 -34066 -23967 -31817 -40722 -53492 -58911 -51252 -38587 -5534 -6267 27236 51858
7156E1858j8167l2512K711q098M523l107J1580j2657Q178O712q415q411J6854
$$ 51858 33691 1179 3890 -4208 315 -2792 8788 -3869 4309 11021 2606 -5805 11049
7143A1049k6904r433J1405L038n393L529R506J9321O404j0443K957k2085O565
$$ 11049 -15855 -25288 -13883 -10845 -16238 -12709 -3203 16118 22522 12079 15036 -7049 -484
7130d84J3370j1477q459k8591K539o57k412J0865K1813J8800J8480k9320L832
$$ -484 12886 1409 -7050 -35641 -33102 -33759 -36171 -25306 -3493 15307 33787 4467 8299
7117H299J0876L752N712k8976l4198k4658R053K8953J2303L705j0137P884P449
$$ 8299 19175 22927 28639 -337 -34535 -59193 -50140 -21187 -8884 -5179 -15316 -7432 17
7104A7j9031R274J7765j116J1842j7887k8558j3952j079K2012J1040j452o293
$$ 17 -19014 -9740 8025 6909 18751 864 -27694 -41646 -42725 -20713 -9673 -11125 -17418
7091a7418m185q891k0341K1649J7981K0088L6358j0802j272L885P957j8078k8318
$$ -17418 -21603 -30494 -50835 -29186 -11205 8883 45241 34439 33167 37052 45009 26931 -1387
7078a387o874n84n407O28K0962J4058j4376m435K3462J4086O121j6575k2353k7416
$$ -1387 -8261 -8845 -14252 -13624 7338 21396 7020 2585 26047 40133 46254 29679 7326 -20090
7064b0090j584K7249K1662J7690m3234k8453j1095J4579l24Q613j0733j7031J6406
$$ -20090 -21674 5575 27237 44927 1693 -26760 -37855 -23276 -23600 -14987 -25720 -42751 -26345
7051b6345L0001N072p50K1363M141k7544O634M698j511k9796M93K3135J0290j8841
$$ -26345 3656 8728 7978 29341 33482 5938 12572 17270 15759 -14037 -13544 9591 19881 1040
7037A040j801M080l017M615J1330k1705j274j3550q23J7032P311j8994j778Q727
$$ 1040 -761 3319 302 4917 16247 -5458 -6732 -20282 -21105 -4073 3238 -15756 -17534 -8807
7023h807r091j7701o725J2659J269J8312m544J4741N761j3326k0408j1497K4379
$$ -8807 -17898 -35599 -42324 -29665 -28396 -10084 -14628 113 5874 -7452 -27860 -39357 -14978
7010a4978R333J2064j452O983j8663j4900j4120K7706J4236j6711j8860j1720
$$ -14978 -5645 6419 4967 11950 -6713 -21613 -35733 -8027 6209 -10502 -29362 -41082
6998d1082J3453L445O509L0017J7388j8152L490K1880j696N993P834j6863k889
$$ -41082 -27629 -24184 -17675 12342 29730 11578 15068 36948 35252 41245 49079 32216 29327
6985B9327Q835n961l2933k0006n717p646J0551L3155K4319J9300k1440k7526r564
$$ 29327 38162 32201 -732 -20738 -26455 -34101 -23550 9605 33924 53224 31784 4258 -5306
6972e306m407m567l0782K7049K8678P420J2591k9663l7101m70P078o511j0030
$$ -5306 -9713 -14280 -45062 -18013 10665 18085 30676 1013 -36088 -36558 -29480 -35991 -46021
6959d6021J2119L696M833L4277J5925j0961m987l1074j1085l363M602j4757k3916
$$ -46021 -33902 -30206 -25373 8904 24829 13868 8881 -22193 -33278 -36641 -32039 -46796 -70712
6946g0712m525J2199N735K8714K3861J5944j2609K2351L3011j5929l8377Q810
$$ -70712 -75237 -63038 -57303 -28589 -4728 11216 -1393 20958 53969 38040 -337 8473
6934H473k0057N537Q017j790J6652R890j2918k3966J716O242p682j8606j8886
$$ 8473 -11584 -6047 1970 180 16832 26722 13804 -10162 -8446 -2204 -9886 -28492 -47378
6921d7378j4878J4973K687L497r731k3243J9324M8884J3658P907l5827l7793R637
$$ -47378 -62256 -47283 -44596 -41099 -50830 -74073 -54749 -5865 7793 15700 -20127 -57920 -48283
6908d8283O2975l102j3455j035k5389j4727P540j731J8159L0860R25N080R479
$$ -48283 14692 11590 -1865 -2900 -28289 -43016 -35476 -37207 -19048 11812 12737 17817 27296
6895B7296K370k3451j2752k829J3419J4287k5930k9566J9316l6119J42M5147K2570
$$ 27296 29666 6215 -6537 -9366 4053 18340 -7590 -37156 -17840 -53959 -53817 -8670 13900
6882A3900j2508m1060J7246K3343o866N832L7910J5089k1715Q916j8435J3132
$$ 13900 1392 -39668 -22422 921 -5945 -113 37797 52886 31171 40087 21652 34784
6870C4784Q760m2221l059q603j2973j8342M803K556J999o15M23J2915P946J331
$$ 34784 43544 1323 -1736 -10339 -23312 -41654 -36851 -34295 -32296 -32911 -32488 -19573 -11627 -10296
6856a0296J9465J4281j3431K17j5433j3393N469K773r097J334K3163M3131j7290
$$ -10296 9169 23450 10019 10236 -5197 -18590 -13121 -10348 -19445 -18111 5052 48183 30893
6843C0893k0919k6573j0429K235J4219J7499K8167M662l7510p157m411m5513J5958
$$ 30893 9974 -16599 -27028 -24793 -10574 6925 35092 39754 2244 -4913 -9324 -54837 -38879
6830c8879L9196J9945p358l334j0001r409K1158J736J8369O114K780k6121l1361
$$ -38879 317 20262 12904 9570 -431 -9840 11318 13054 31423 37537 40317 14196 -17165
6817a7165J9607K7342r335j1211J6915q411k3764j0954P181K621J4607j943N608
$$ -17165 2442 29784 20449 9238 26153 17742 -6022 -16976 -9795 -7174 7433 5490 11098
6804A1098l011P807p301o441l225J8266L569k1209k479o112j2308R94M823q191
$$ 11098 8087 15894 8593 2152 -1073 17193 20762 -447 -2926 -9038 -21346 -20352 -15529 -23720
6790b3720Q270J817j8718k7589L766K592l146K2654K2739J6600J5737j8697k35
$$ -23720 -15450 -13633 -32351 -59940 -56174 -53582 -56728 -34074 -11335 5265 21002 2305 2070
6777B070L519q266j8028j9278K9804M582p332n610P528L590J2352j7691J23K4059
$$ 2070 5589 -2677 -20705 -39983 -10179 -5597 -12929 -18539 -11011 -7421 4931 -12760 -12637 11422
6763A1422L4350q945l1666j9696Q151J4505n135p195J0082j0718l727J4586J0610
$$ 11422 45772 36827 5161 -14535 -6384 8121 2986 -4209 5873 -4845 -8572 6014 16624
6750A6624J1222m248o646L399l097j0308q65j358l282M72K2732J4307k8719k2300
$$ 16624 27846 23598 16952 20351 17254 6946 6081 4723 1441 1913 24645 38952 10233 -12067
6736a2067N490j9663J3204J9418M1235j398j44J2120L556P003r686l184K026R177
$$ -12067 -6577 -26240 -13036 6382 47617 46219 46075 58195 61751 68754 59068 55884 57910 67087
6722F7087j6438j764j5454K159k862J5772r22J968n866K5970N7327N5864O0077
$$ 67087 50649 48885 33431 35590 32728 48500 47578 49546 43680 69650 126977 182841 242918
6709B42918P4460J14097J37268J82828K72613L01366J37162j63433k75601k89226
$$ 242918 317378 431475 568743 751571 1024184 1325550 1462712 1299279 1023678 734452
6699G34452k38962j69862j05998n4694m6081k6887k3680p904j2467j5570n093
$$ 734452 495490 325628 219630 164936 118855 91968 68288 60384 47917 32347 27254
6688B7254O759M466K838K928k7213k4747N848L1931J0487n984k8361k8489m58
$$ 27254 34013 38479 41317 44245 17032 -7715 -1867 30064 40551 34567 6206 -22283 -22741
6675b2741k26K4148K4553l134m5169m4511n822P4439L5186j4808p516l500L585
$$ -22741 -22967 1181 25734 22600 -22569 -67080 -72902 1537 36723 21915 14399 10899 14484
6662A4484j9367m706J9767o655j1820K071J4649p93J4449m64k3110j3237q038
$$ 14484 -4883 -9589 10178 3523 -8297 -6226 8423 7630 22079 21615 -1495 -14732 -22770
6649b2770l2688L8847K8556J4055n024k6908P87j4812N532o942J5265L1203j8157
$$ -22770 -55458 -16611 11945 26000 20976 -5932 -5145 -19957 -14425 -21367 -6102 25101 6944
6636F944l1618l0531k9286L3420M8389k450n500n940j1217J3137j93O883m777
$$ 6944 -24674 -55205 -84491 -51071 -2682 -5132 -10632 -16572 -27789 -14652 -14845 -7962 -12739
6623a2739m825J9574M87k7002R934K402l806J0186J1867k5492j3203R510J4309
$$ -12739 -17564 2010 2497 -24505 -14571 -12169 -15975 -5789 6078 -19414 -32617 -23107 -8798
6610h798j9666L102J4789N1898q739l9918q137L698j717r030l2055J2232J7195
$$ -8798 -28464 -25362 -10573 41325 32586 -7332 -15469 -11771 -13488 -22518 -54573 -42341 -25146
6597b5146K9878J1619O326l391r430o367N985o762j16J486q667m336J5182M588
$$ -25146 4732 16351 22677 19286 9856 3489 9474 2712 2596 4082 -4585 -8921 6261 10849
6583A0849J126p44L004l488j0351j5073o40K825j2980k976o792J23J2521k4846
$$ 10849 11975 11231 14235 10747 396 -14677 -15317 -12492 -25472 -28448 -35240 -35117 -22596 -47442
6569d7442k5382N360L2659K6837J0946j6599k6927K3142N256J5216o886j2860
$$ -47442 -72824 -67464 -34805 -7968 2978 -13621 -40548 -17406 -12150 3066 -3820 -16680
6557a6680m167K0256J3646j3416M083N547K83j9706k796J2569K5043n601j3559
$$ -16680 -20847 -591 13055 -361 3722 9269 9552 -10154 -12950 -381 24662 19061 5502
6544E502l1459R063J0352K79k8428j1626O39q429J2651J4578J2552j8266J6323
$$ 5502 -25957 -16894 -6542 -6263 -34691 -46317 -45678 -54107 -41456 -26878 -14326 -32592 -16269
6531a6269j95k4724k631J8894J1457K3929J7043K0262R368o217l0220n2418k3075
$$ -16269 -16464 -41188 -43819 -24925 -13468 10461 27504 47766 57134 50917 20697 -31721 -54796
6518e4796J9890L1625k6812m557L6090J2689j2080Q137P080O504o678O058q387
$$ -54796 -34906 -3281 -30093 -34650 1440 14129 2049 10186 17266 23770 17092 23150 14763
6505A4763k5213J3858o95k5581L724q957p714j7199j1945M308J1574M3193K6007
$$ 14763 -10450 3408 2713 -22868 -19144 -28101 -35815 -53014 -64959 -60651 -49077 -5884 20123
6492B0123j4209j8203k180J2023r813q264m872J733k4548J6503J450j9056J3213
$$ 20123 5914 -12289 -14469 -2446 -12259 -20523 -25395 -23662 -48210 -31707 -30257 -49313 -36100
6479c6100l413j7498q203J427K2386K7601j6725r210N525J8471J941r418N914
$$ -36100 -39513 -57011 -65214 -63787 -41401 -13800 -30525 -39735 -34210 -15739 -13798 -23216 -17302
6466a7302J0775j6311j430M369j4800o875K5659K7512j7691J2857n27J0572n617
$$ -17302 -6527 -22838 -24268 -19899 -34699 -41574 -15915 11597 -6094 6763 6236 16808 11191
6453A1191j191l617j3670K8038Q944j7589l0765r978N40j01J30j0786o729K1945
$$ 11191 10000 6383 -7287 20751 29695 12106 -18659 -28637 -28097 -28198 -28068 -38854 -45583 -23638
6439b3638K2080n748L710p614Q140p175j2630J9105J04J9341j0497K565j4970
$$ -23638 -1558 -7306 -3596 -11210 -3070 -10245 -22875 -3770 -3666 15675 5178 7743 -7227
6426g227o885J607K319k2467N656J6350k4111k2267m374L6823L801m449P421r14
$$ -7227 -14112 -12505 -10186 -32653 -26997 -10647 -34758 -57025 -61399 -24576 -20775 -25224 -17803 -18717
6412a8717N873k2277r325K6855L2162j021k0539k5025j158o85r701k397K0258
$$ -18717 -12844 -35121 -44446 -17591 14571 13550 -6989 -32014 -33172 -33857 -43558 -45955 -25697
6399b5697R975K9838J5221O22m7786j3901l826Q742p659r208j7649r016K5011
$$ -25697 -15722 14116 29337 29959 -17827 -31728 -35554 -26812 -34471 -43679 -61328 -70344 -45333
6386d5333R85O277K4046J7842N654j9227R125J3154j3110k601K3984K4124k7391
$$ -45333 -44348 -38071 -14025 3817 9471 -9756 -631 12523 -587 -3188 20796 44920 17529
6373A7529Q01N91L411j5907j3357q800k6956L495J9737j3532p213k2835j3276
$$ 17529 18330 18921 22332 6425 -6932 -15732 -42688 -39193 -19456 -32988 -40201 -63036 -76312
6360g6312J9615M0980j8164j7746J9002K4488j3415J3747K7850k0818k9185J5582
$$ -76312 -56697 -15717 -33881 -51627 -32625 -8137 -21552 -7805 20045 -773 -29958 -14376
6348a4376J3640J4570j4025j8240j9040j7675K1533l788o084J600Q257K8391j5169
$$ -14376 -736 13834 -191 -18431 -37471 -55146 -33613 -37401 -43485 -41885 -33628 -5237 -20406
6335b0406q675j9389J310L5442J5725j085m934K0619J895j1026j3319K7444J637
$$ -20406 -29081 -48470 -47160 -11718 4007 2922 -2012 18607 20502 9476 -3843 23601 25238
6322B5238N979J3065k7455j0984R517k987K8639k4506r903j2018l5057O502p98
$$ 25238 31217 44282 16827 5843 15360 12373 41012 16506 6603 -5415 -40472 -33970 -34768
6309c4768J9137J3354Q856J2356k1112l7045L0150j2235o94j2071O649j6390J466
$$ -34768 -15631 -2277 6579 18935 -2177 -39222 -9072 -21307 -22001 -34072 -27423 -43813 -42347
6296d2347J2890j4802q996J8292J2910J0073L9059L843q512J1238j34l3162r205
$$ -42347 -29457 -44259 -53255 -34963 -22053 -11980 27079 30922 22410 33648 33514 352 -8853
6283h853J0986L425q496J6650j9111J424K0161l3097p295J3230J0668n786r309
$$ -8853 2133 5558 -2938 13712 -5399 -3975 16186 -16911 -24206 -10976 -308 -6094 -15403
6270a5403k536M747J1289l030r867L578J6096J641j9911l729K8408O808j5520
$$ -15403 -17939 -13192 -1903 -4933 -14800 -11222 4874 6515 -13396 -17125 11283 18091 2571
6257B571j0468O123N442k4541l0506J5515M1956J3708r222j947J183l2246j0721
$$ 2571 -7897 -1774 3668 -20873 -51379 -35864 6092 19800 10578 8631 9814 -22432 -33153
6244c3153p632Q060K7697K2643k5829l53J3719J9301p554K53m385K2176m866j6463
$$ -33153 -40785 -32725 -5028 17615 -8214 -8567 5152 24453 16899 17152 12767 34943 30077 13614
6230A3614j0443k7620j5040K0481j91M692L0845K7017j0427n5603j5498J0110
$$ 13614 3171 -24449 -39489 -19008 -19199 -14507 16338 43355 32928 -22675 -38173 -28063
6218b8063J4398q43j184O885N47L524J8888N405k7738k6514j974m087p703J7768
$$ -28063 -13665 -14508 -15692 -8807 -8260 -4736 14152 19557 -8181 -34695 -36669 -40756 -48459 -30691
6204c0691J7050L091m033k618K5589r851K67M431M438k1758m6431J8687M6329
$$ -30691 -13641 -10550 -14583 -17201 8388 -1463 -1196 3235 7673 -14085 -60516 -41829 4500
6191D500M1800j7650l9074M771R648q510p079L373K1295k7272p739Q670J6331
$$ 4500 46300 28650 -10424 -5653 3995 -4515 -11594 -8221 13074 -14198 -21937 -13267 3064
6178C064J9081j0013L799n027m835l3896n874J5360Q783J6881O124j7908j1564
$$ 3064 22145 12132 15931 10904 6069 -27827 -33701 -18341 -9558 7323 13447 -4461 -16025
6165a6025l0469r756K4094K4752J8648L450J008k6871j5698j0045q674O968J4682
$$ -16025 -46494 -56250 -32156 -7404 11244 14694 15702 -11169 -26867 -36912 -45586 -38618 -23936
6152b3936J2874J9934k9122k1073k931O097J0872p055p818O269O29k27J1141l938
$$ -23936 -11062 8872 -20250 -41323 -44254 -38157 -27285 -34340 -42158 -35889 -35260 -35487 -24346 -28284
6138b8284N188l307J2073m900M133K7887J0399k0762l5769K9678K0816J891k153
$$ -28284 -23096 -26403 -14330 -19230 -15097 12790 23189 2427 -33342 -3664 17152 19043 16890
6125A6890k1671K607J5842K0799l9931l6367j3184M180N017Q883J3432p157K1276
$$ 16890 -4781 -2174 13668 34467 -5464 -41831 -55015 -50835 -45818 -36935 -23503 -30660 -9384
6112i384m311n51J5426J5270L863l0316k8830O366N5605P38j4570k746m17k3745
$$ -9384 -13695 -14246 1180 16450 20313 -10003 -38833 -32467 23138 23876 9306 6560 6143 -17602
6098a7602j9447l0122L4368K026K9897j644j5807j464O074J3325Q021j9919J0146
$$ -17602 -37049 -67171 -32803 -30777 -880 -2524 -18331 -19795 -13721 -396 7625 -12294 -2148
6085b148J6782p635n528J1566k2282Q152L504J3613k1454K4573n647j5307n803
$$ -2148 14634 6999 1471 13037 -9245 -1093 2411 16024 -5430 19143 13496 -1811 -7614
6072g614j4357j664J2285J1876J5646k6289l1631J3732P196O087l410J4569j2280
$$ -7614 -21971 -23635 -11350 526 16172 -10117 -41748 -28016 -20820 -14733 -18143 -3574 -15854
6059a5854q402J4961j4488O905J264K1594n305j7855k565J8026j491k5023K0439
$$ -15854 -24256 -9295 -23783 -16878 -15614 5980 675 -17180 -19745 -1719 -3210 -28233 -7794
6046g794K0250j2938j4464r70M004P21o67r779r363L110N889p754k0369p249K7773
$$ -7794 12456 -482 -14946 -15916 -11912 -11191 -11858 -21637 -31000 -27890 -22001 -29755 -50124 -57373 -29600
6031b9600M14O143J4689Q109J570n274j8553r638j4814Q407L7960J6090K7988
$$ -29600 -29186 -23043 -8354 -245 1325 -3949 -22502 -32140 -46954 -38547 -587 15503 43491
6018D3491k542l3108k7351p32J0877J9814J7967j7218m664Q900m6864k4192K5088
$$ 43491 40949 7841 -19510 -20242 -9365 10449 28416 11198 6534 15434 -31430 -55622 -30534
6005c0534K6429J4851j1431k3565k809Q572k4095K4458K8784k0874j3787p432
$$ -30534 -4105 10746 -685 -24250 -27059 -18487 -42582 -18124 10660 -10214 -24001 -31433
5993c1433K2876kj4033j5725n70K1318L797R990J8130j0458k117r552j3906l5543
$$ -31433 -8557 -8559 -22592 -38317 -38887 -17569 -13772 -3782 14348 3890 1773 -7779 -21685 -57228
5979e7228r068J1522j0541j752J6259J1329p978O905J3168O934J4140L7275J9916
$$ -57228 -66296 -54774 -65315 -67067 -50808 -39479 -47457 -40552 -27384 -20450 -6310 30965 50881
5966E0881k2930j695M0585k494k6995k6860j5448k0977J4547K0372J0908J0389
$$ 50881 27951 26256 66841 64347 37352 10492 -4956 -25933 -11386 8986 19894 30283
5954C0283q143l4941k4053j8630J8543M2811r389k8163J200Q382K1849J6171Q35
$$ 30283 22140 -12801 -36854 -55484 -36941 5870 -3519 -31682 -30482 -22100 -251 15920 16755
5941A6755o630q447Q165j3345k6103l658n456o699J3211K5908J0268k5962l5489
$$ 16755 10125 1678 9843 -3502 -29605 -33263 -38719 -45418 -32207 -6299 3969 -21993 -57482
5928e7482K5571M0961j6904j7726k211l525P62J3996N706j8102k6691J1511j514
$$ -57482 -31911 9050 -7854 -25580 -27791 -31316 -30554 -16558 -10852 -28954 -55645 -44134 -45648
5915d5648j642R166l398p339K1233n608J0390k4497r488Q811O347J8393m622j8700
$$ -45648 -47290 -38124 -41522 -48861 -27628 -33236 -22846 -47343 -56831 -48020 -41673 -23280 -27902 -46602
5901d6602L1776L9778m226P898J4482q776l9090k1655J0357J385j322j119O101
$$ -46602 -14826 24952 20726 28624 43106 34330 -4760 -26415 -16058 -14673 -15995 -17114 -11013
5888a1013K8700j2274l454J1152n112Q419k2234j6820K4593R573j639k405K464
$$ -11013 17687 5413 1959 13111 7999 16418 -5816 -22636 1957 11530 9891 7486 9950
5875I950j3092Q744L3707O912j7750j4032j7620j6891r298j400O909K3996k6840
$$ 9950 -3142 5602 39309 46221 28471 14439 -3181 -20072 -29370 -30770 -23861 135 -26705
5862b6705j9103K2592R453l666r066J0569m443k2020p175N0079O575k9979k4015
$$ -26705 -45808 -23216 -13763 -17429 -26495 -15926 -20369 -42389 -49564 515 7090 -22889 -46904
5849d6904J4478L7176N248K75j706j312J7306l1911J0323J0825q166J755j2738
$$ -46904 -32426 4750 9998 10273 8567 7255 24561 -7350 2973 13798 5632 7387 -5351
5836e351K4218K0077J9509l8885l1343M854j3781k3179j5584J02j1292j068M4516
$$ -5351 18867 38944 58453 19568 -11775 -6921 -20702 -43881 -59465 -59363 -70655 -71723 -27207
5823b7207M4777j0404q622J9723J3839j2609k5217n25l4198j4854J1354l521k506
$$ -27207 17570 7166 -1456 18267 32106 19497 -5720 -6245 -40443 -55297 -43943 -47464 -49970
5810d9970J6262J2640J5782J6992K4990j3338j7763k6368m332j3696r428K8068
$$ -49970 -33708 -21068 -5286 11706 36696 23358 5595 -20773 -25105 -38801 -48229 -20161
5798b0161J4802J4898J260J5374J1539K48k3402k3427j7240j3314j1391J6241
$$ -20161 -5359 9539 10799 26173 37712 37960 14558 -8869 -26109 -39423 -50814 -34573
5786c4573J3710j2964j6704L4151J9993K9557j3827l9163K3198m854K4671p128
$$ -34573 -20863 -33827 -50531 -16380 3613 33170 19343 -19820 3378 -1476 23195 16067
5774A6067k0252k4928J7079R482q359j6676j167K9290o277L785K2192O436p051
$$ 16067 -4185 -29113 -12034 -2552 -10911 -27587 -28754 536 -5741 -1956 20236 26672 19621
5761A9621p946J8706l606k963l325K176k0493j7954j806K023j1904J517r944J6130
$$ 19621 11675 30381 26775 23812 20487 22663 2170 -15784 -17590 -15567 -27471 -25954 -35898 -19768
5747a9768r784l0944J1234O345NN11O603l9257K4211L2192R458R111K3260K2568
$$ -19768 -29552 -60496 -49262 -42917 -42912 -42401 -35798 -75055 -50844 -18652 -9194 -83 23177 45745
5733D5745J10j9091r856n969k0716K868K2535P546j708Q171o307q126M7594P307
$$ 45745 45855 26764 16908 10939 -9777 -6909 15626 23172 21464 29635 23328 15202 62796 70103
5719G0103l9879j8517J9601j9417j5455K5923p711k6702j3299j4307M2779J1104
$$ 70103 30224 11707 31308 11891 -3564 22359 14648 -12054 -25353 -39660 3119 14223
5707A4223k6964K0229J2987J5919P388l0351k137N58j0559q906Q130J448k1502
$$ 14223 -12741 7488 20475 36394 43782 13431 11294 11852 1293 -7613 517 1965 -19537
5694a9537L488j4153J0147K634p454J2534K4675K9799K7694k4014k4330j5015
$$ -19537 -16049 -30202 -20055 -17421 -24875 -12341 12334 42133 69827 45813 21483 6468
5682F468J6684o484l2738k3019l896O769J552J8293J3548K4094J0390q760l0051
$$ 6468 23152 16668 -16070 -39089 -42985 -36216 -34664 -16371 -2823 21271 31661 22901 -7150
5669g150l6542j3441J5037m819J1745N470M4506J1666j3147k7874l6620R802J9968
$$ -7150 -43692 -57133 -42096 -46915 -35170 -29700 14806 26472 13325 -14549 -51169 -41367 -21399
5656b1399M254J3947n679j5959J0206M9237J7499L158K78m4105k5795J8156J4469
$$ -21399 -17145 -3198 -8877 -24836 -14630 34607 52106 55264 55542 11437 -14358 3798 18267
5643A8267j7264l2865J924J0269J0016R630J5187K700q845j2304J2436k129N307
$$ 18267 1003 -31862 -29938 -19669 -9653 -23 15164 17864 9019 -3285 9151 7022 12329
5630A2329j0059J8382O4l3211K0262j485n417j4121K0750L3218l7705k7302R985
$$ 12329 2270 20652 20716 -12495 7767 6282 865 -13256 7494 40712 3007 -24295 -14310
5617a4310M001r531l5080O913J9274K580j3691j2710K5184o147o66R451J3256
$$ -14310 -10309 -19840 -54920 -48007 -28733 -26153 -39844 -52554 -27370 -33517 -34183 -24732 -11476
5604a1476J565m417k636J0438K5052R82Q621K7379k2646J4269j7014k6981q267
$$ -11476 -9911 -14328 -16964 -6526 18526 19508 28129 55508 32862 47131 30117 3136 -5131
5591e131J9945O998L69p920o706m1241l1572j0796M13K2323J9590L2273j3981
$$ -5131 14814 21812 22181 14261 7555 -33686 -65258 -76054 -75641 -53318 -33728 -1455 -15436
5578a5436m2672J897J8210R441J5980l870j0473K259j2118J2650r658K0054J0674
$$ -15436 -58108 -56211 -38001 -28560 -12580 -16450 -26923 -24664 -36782 -24132 -33790 -13736 -3062
5565c062K6979R272n2463j3667K2352M2933O172k0249M882N526k0184L485r04
$$ -3062 23917 33189 -19274 -32941 -10589 32344 38516 18267 23149 28675 8491 11976 11072
5552A1072N97J2304k1713l1781j0100L5922J6397j9505J3459M892j924k3206j2875
$$ 11072 11669 23973 2260 -29521 -39621 -3699 12698 -6807 6652 11544 9620 -13586 -26461
5539b6461J865J7616J7131q881l3507K984L5322K3031p681p683J1362k9657K270
$$ -26461 -24596 -6980 10151 1270 -32237 -29253 6069 29100 21419 13736 25098 -4559 -2289
5526b289L479M102J9417L885o859l3612K963j0943J1057K7359p708Q886q089j4045
$$ -2289 1190 5292 24709 28594 21735 -11877 -8914 -19857 -8800 18559 10851 19737 11648 -2397
5512b397o422m284P645P19J4747J2124j2357l694J2584K7Q519m071j4067k7844
$$ -2397 -8819 -13103 -5458 -4739 10008 22132 9775 6081 18665 18692 27211 23140 9073 -18771
5498a8771l1110j7231P840J9293K6199N797J057j549m79O400M961J5340Q733M960
$$ -18771 -49881 -67112 -59272 -39979 -13780 -7983 -6926 -8475 -8954 -2554 2407 17747 26480 31440
5484C1440k1260K8640K8352q501m2631N984m876j1763R93K0826J6080j6375k1527
$$ 31440 10180 38820 67172 58671 16040 22024 17148 5385 6378 27204 43284 26909 5382
5471E382n0947j2181L765R514q163K0165K5850J2586k538J6229K9713j1318k7767
$$ 5382 -45565 -57746 -53981 -44467 -52630 -32465 -6615 5971 3433 19662 49375 38057 10290
5458A0290M538P815K156J1430r082J0432J2300l0418j7871l212N177j0937p020
$$ 10290 14828 22643 24799 36229 27147 37579 49879 19461 1590 -1622 3555 -7382 -14402
5445a4402L775p332m220J3406k3964k0715J3582L216k385O759M3997J1427L403
$$ -14402 -10627 -17959 -22179 -8773 -32737 -53452 -39870 -36654 -39039 -32280 11717 23144 26547
5432B6547l731k4078j0488L0847j7359k3404k0100K4189N279k5816j3706K4495
$$ 26547 22816 -1262 -11750 19097 1738 -21666 -41766 -17577 -12298 -38114 -51820 -27325
5420b7325L573q931O285k463P237K4934L9692Q625l9776m874k8650J55O747l647
$$ -27325 -23752 -32683 -26398 -28861 -21624 3310 43002 51627 11851 6977 -21673 -21518 -14771 -18418
5406a8418J8927J3479J4398J6583k3671k9661K7123J917l0464q118K3283K109
$$ -18418 509 13988 28386 44969 21298 -8363 18760 20677 -9787 -17905 5378 7487
5394G487J9798k0851l0324Q799J3102j5557J8215J443j1828P758q039K0576q865
$$ 7487 27285 6434 -23890 -15091 -1989 -17546 669 2112 -9716 -1958 -9997 10579 1714
5381A714j5387j9522L8183j5611k8470o759J7745J1988R625l701K371K4929j16
$$ 1714 -13673 -33195 4988 -10623 -39093 -45852 -28107 -16119 -6494 -10195 -7824 17105 16989
5368A6989P06o158K9716K0807R24j4952k9891q608R65J4594P859l2333M380K4197
$$ 16989 17695 11537 41253 62060 62984 48032 18141 9533 10498 25092 32951 618 4998 29195
5354B9195j5401j7373J0211J1527r617j3092K9247K7895j1191l6284j7199j4908
$$ 29195 13794 -3579 6632 18159 8542 -4550 24697 52592 41401 5117 -12082 -26990
5342b6990j9926P925m237J9179J8040P064n85l824j7510n905J150O041L514J1446
$$ -26990 -46916 -38991 -43228 -24049 -6009 1055 470 -3354 -20864 -26769 -25619 -19578 -16064 -4618
5328d618o56j2523J9027L8327j5538j7296o750J9719R404j6438J1407k5447J0153
$$ -4618 -5274 -17797 1230 39557 24019 6723 -27 19692 29096 12658 24065 -1382 8771
5315H771N173k720l2598j6248j0861K4083M422J3168j226j1165J1642J6955J1296
$$ 8771 13944 11224 -21374 -37622 -48483 -24400 -19978 -6810 -8036 -19201 -7559 9396 20692
5302B0692Q745r821J6677n42l1349P156k727m6619L8362L7135j7749p205r553
$$ 20692 29437 19616 36293 35751 4402 11558 8831 -37788 574 37709 19960 12755 3202
5289C202K1142k6041k6088L485l4670O714J7214O215J028K3331K4715j1544j0772
$$ 3202 24344 -1697 -27785 -24300 -58970 -52256 -35042 -28827 -27799 -4468 20247 8703 -2069
5276b069j4220K3507n968M212J0763j2062j9323l681J1544j6891m42L204r456
$$ -2069 -16289 7218 1250 5462 16225 4163 -15160 -18841 -7297 -24188 -24630 -21426 -30882
5263c0882J433R562j4595K0789L8831j3953l7918p372J2351J9879K0465j6791
$$ -30882 -29449 -19887 -34482 -13693 25138 11185 -26733 -34105 -21754 -1875 18590 1799
5251A799J9155M8530n6238n4948K9910k202l98Q018N499k1479j7626Q482K2193
$$ 1799 20954 69484 13246 -41702 -11792 -13994 -14392 -6374 -875 -22354 -39980 -31498 -9305
5238i305L1786J5024p53O195k9871k5144k4994K0319L794l2169l2923J159J1402
$$ -9305 22481 37505 36752 42947 13076 -12068 -37062 -16743 -12949 -45118 -78041 -76882 -65480
5225f5480N694M705K7287K1045L8109J9399J7321q142m3158j6021R016J8449j2836
$$ -65480 -59786 -55081 -27794 -6749 31360 50759 68080 59938 16780 759 9775 28224 15388
5212A5388o542J4145n179N501P830n549k1967k5008P526K7468J9914J6790p105
$$ 15388 8846 22991 17812 23313 31143 25594 3627 -21381 -13855 13613 33527 50317 43212
5199D3212l1915J1723R994l615m5238j3839J2909J5358L893o467J652q424r341
$$ 43212 11297 23020 33014 29399 -15839 -29678 -16769 -1411 2482 -3985 -2333 -10757 -20098
5186b0098L330o803j8757J3216m117j9109r378p14J1189O232N638K86J2120J7561
$$ -20098 -16768 -23571 -42328 -29112 -33229 -52338 -61716 -62430 -51241 -45009 -39371 -39085 -26965 -9404
5172i404j254J1590P238j2856p080K0231L677k0038j9493J2019q961J2073n287
$$ -9404 -10658 932 8170 -4686 -11766 8465 12142 -7896 -27389 -15370 -24331 -12258 -17545
5159a7545J8378J7191j2637k1j8990N390L1182l183j8811J1259K011j9423K892
$$ -17545 833 18024 5387 5366 -13624 -8234 22948 19765 954 12213 14224 -5199 -2307
5146b307K7446m196J7449q841j8903j6207o419J3937L0362n029j0630J940R446
$$ -2307 25139 20943 38392 29551 10648 -5559 -11978 1959 32321 27292 16662 18602 28048
5133B8048l9212k844K441k5035k150J0031J551L0390l137j0165L790Q119k0168
$$ 28048 -11164 -14008 -11567 -36602 -38752 -28721 -27170 3220 83 -10082 -6292 1827 -18341
5120a8341K325j0803j5842j6824K8112l007K5403Q534O955j1155R260L117j6891
$$ -18341 -16016 -26819 -42661 -59485 -31373 -34380 -8977 -443 6512 -4643 4617 7734 -9157
5107i157j5302J2758K0970Kq821J7035j8056k6144J41K242r703O778l186J1741
$$ -9157 -24459 -11701 9269 9271 450 17485 -571 -26715 -26574 -24332 -34035 -27257 -30443 -18702
5093a8702k258R870J089l658r049j6748j6550L2874K0011N743k5469j9546J0179
$$ -18702 -20960 -11090 -10001 -13659 -22708 -39456 -56006 -23132 -3121 2622 -22847 -42393 -32214
5080c2214K03O515M403J9865J3787p418o310P323k5649k1235Q205J0991N325K3667
$$ -32214 -32011 -25496 -21093 -1228 12559 5141 -1169 6154 -19495 -40730 -32525 -21534 -16209 7458
5066G458Q211k0157j6108L3399J2679k2188p267j9917k918j357m254j2325K2936
$$ 7458 15669 -4488 -20596 12803 25482 3294 -3973 -23890 -26808 -28165 -32419 -44744 -21808
5053b1808j2659Q451J0932N82N59N964K313K411P304m5746K342j1170j6763o387
$$ -21808 -34467 -26016 -15084 -14502 -13943 -7979 -5666 -3255 4049 -41697 -39355 -50525 -67288 -73675
5039g3675L0502J668J0627J5762M531j1940K84M647J0978J8199k1570l7408j740
$$ -73675 -43173 -41505 -30878 -15116 -10585 -22525 -22241 -17594 -6616 11583 -9987 -47395 -49135
5026d9135J0085M245j0138K3315j778k7349m617K8240K079k578L158J8661k4492
$$ -49135 -39050 -34805 -44943 -21628 -23406 -50755 -55372 -27132 -25053 -27631 -24473 -5812 -30304
5013c0304k9475j5494J9134K5571K0701q694K2341L5316J4921j991j2221k7365
$$ -30304 -59779 -75273 -56139 -30568 -9867 -18561 3780 39096 54017 52026 39805 12440
5001A2440m0851k3379L8735K3622L626l698j1539L506J9152k9701j6329K1037
$$ 12440 -28411 -51790 -13055 10567 14193 10495 -1044 2462 21614 -8087 -24416 -3379
4989c379q618J6839Q970o072k0228j8902l1758j116J3459K8844j105k5433J1593
$$ -3379 -11997 4842 13812 7740 -12488 -31390 -63148 -64264 -50805 -21961 -23066 -48499 -36906
4976c6906K3299K3022n558k0905K215p627j9114M5616K1096P619P009l5298n4238
$$ -36906 -13607 9415 3857 -17048 -14833 -22460 -41574 4042 25138 32757 39766 4468 -49770
4963d9770L557L520J3004N405L0426m627M72j035j1328R31R580M0580K738p586
$$ -49770 -46213 -42693 -29689 -24284 6142 1515 1987 952 -10376 -9445 135 40715 43453 35867
4949C5867k1927k5022K32j2889J4924k602k0945O363j8874J3704M0388K0088j5956
$$ 35867 13940 -11082 -10850 -23739 -8815 -11417 -32362 -25999 -44873 -31169 9219 29307 13351
4936A3351l6383J505q78q324l721l666k257L0870p247l358M517p722M94L3213
$$ 13351 -23032 -21527 -22405 -30729 -34450 -38116 -40373 -9503 -16750 -20108 -15591 -23313 -22819 10394
4922A0394L691Q567P117N339p268j957j1152J0735J4130K158j0614J4587J5942
$$ 10394 14085 22652 29769 35108 27840 25883 14731 25466 39596 41754 31140 45727 61669
4909F1669N826j1651k4375k0422k8589r117K3357J6715K855j6120k8911K7668
$$ 61669 67495 55844 31469 11047 -17542 -26659 -3302 13413 16268 148 -28763 -1095
4897a095p713K245j0563J2538N012K926k822J6553j7465O598o569m521M984k1440
$$ -1095 -8808 -6563 -17126 -4588 424 3350 528 17081 -384 6214 -355 -4876 108 -21332
4883b1332P818L7430l6948k5471r835k771M0662K6564J2945j5539j0488j0043
$$ -21332 -13514 23916 -13032 -38503 -48338 -51109 -10447 16117 29062 13523 3035 -7008
4871g008j931k315Q606L5411R969k5602k2855J1307j6236j8324L3443J8566M207
$$ -7008 -8939 -11254 -2648 32763 42732 17130 -5725 5582 -10654 -28978 4465 23031 27238
4858B7238J370k7052K115R68l096L843N29k4498j8008O144K8365m062J2022q598
$$ 27238 28608 1556 3671 4639 1543 5386 5915 -18583 -36591 -30447 -2082 -6144 5878 -2720
4844b720J081K8632r402j5846r513p524J0213K777k0585q536J8461M129J4576
$$ -2720 -1639 26993 17591 1745 -7768 -15292 -5079 -2302 -22887 -31423 -12962 -8833 5743
4831E743K15l216m1689q001K2779L7340n031P675j1562j4221j010o771j5067J1099
$$ 5743 5958 2742 -38947 -46948 -24169 13171 8140 15815 4253 -9968 -10978 -17749 -32816 -21717
4817b1717Q647K921J9158Q138J0215K643p75m630n061l2828l348m18K3263L0749
$$ -21717 -13070 -10149 9009 17147 27362 30005 29230 24600 19539 -13289 -16637 -17055 6208 36957
4803C6957K2833k3536m1589j6758J0149J0273J2256O798K1977Q511k7753j0124
$$ 36957 59790 36254 -5335 -22093 -11944 -1671 10585 17383 39360 47871 20118 9994
4791I994m490l1642j758k2745Q925J6709J8135Q664K153K1601K7800j6063j5638
$$ 9994 5504 -26138 -27896 -50641 -41716 -25007 -6872 1792 3945 25546 53346 37283 21645
4778B1645j6535J642j4157k597j538j1605N95J3929L2850l219k9081j4870l2255
$$ 21645 5110 6752 -7405 -10002 -11540 -23145 -22550 -8621 24229 21010 -8071 -22941 -55196
4765e5196l3534K1944O0311N2248J8994o345o5529k6397J3519J0876K8714J5912
$$ -55196 -88730 -66786 -6475 45773 64767 58422 -7107 -33504 -19985 -9109 19605 35517
4753C5517N679j3608m5426m889j205q004k1445M938K6153J3034M623n514J2770
$$ 35517 41196 27588 -17838 -22727 -23932 -31936 -53381 -48443 -22290 -9256 -4633 -10147 2623
4740B623L573P988K4103l0101j3878K1615k515l5023k7066P003j24O079j745n348
$$ 2623 6196 14184 38287 8186 -5692 15923 13408 -21615 -48681 -41678 -41802 -35723 -37468 -42816
4726d2816J4185L2628o784k485j5498J4304k6782k199N5040L28m2397q502J6120
$$ -42816 -28631 3997 -2787 -5272 -20770 -6466 -33248 -35447 19593 19921 -22476 -30978 -14858
4713a4858Q882n955O283M287k1227J0374M2228J8251j9095J5670J400j8722l320
$$ -14858 -5976 -11931 -5648 -1361 -22588 -12214 30014 48265 29170 44840 46240 27518 24198
4700B4198j0710j9609j2489L0217R641Q452k9856r678n71k6302j6138J9285Q969
$$ 24198 13488 -6121 -18610 11607 21248 29700 -156 -9834 -10405 -36707 -52845 -33560 -24591
4687b4591J23N628J2073J069R457j6429r722K6270O596m917k0996k9998P349L6931
$$ -24591 -24468 -18840 -6767 -5698 3759 -12670 -22392 3878 10474 5557 -15439 -45437 -38088 -1157
4673a157L292K6566P772Q82k8208k5428k4729P727L2298K6111Q007l3531l7984
$$ -1157 2135 28701 36473 37355 9147 -16281 -41010 -33283 -985 25126 33133 -398 -38382
4660c8382j0073J5440J9427Q618j484P564J4356l052R424j8543l1023J0060M764
$$ -38382 -48455 -33015 -13588 -4970 -6454 1110 15466 12414 21838 3295 -27728 -17668 -12904
4647a2904j2623j6267l912J2962j7638Q810J7058o092l756J6561j8548J1999M2945
$$ -12904 -25527 -41794 -45706 -32744 -50382 -41572 -24514 -30606 -34362 -17801 -36349 -24350 18595
4634A8595m672r815O747J7452k7753r244J8764K0940K1945N332k3588k7985M73
$$ 18595 13923 4108 10855 28307 554 -8690 10074 31014 52959 58291 34703 6718 7191
4621G191K4679j7123j3512j3589Q212J3794j7198j3953J191J3750J3835j0499
$$ 7191 31870 14747 1235 -12354 -4142 9652 -7546 -21499 -20308 -6558 7277 -3222
4609c222j7469k546l421j75K1222j8334l0219K3344M0285K9716R886j9368l3120
$$ -3222 -20691 -23237 -26658 -26833 -5611 -23945 -54164 -30820 9465 39181 49067 29699 -3421
4596c421j493J6815O395l9421j1574K3248Q449j1478o502P147q961k1673j9504
$$ -3421 -4914 11901 18296 -21125 -32699 -9451 -1002 -12480 -18982 -11835 -20796 -42469 -61973
4583f1973P446L7466L4066m812k7132p96K5601q635l0824k0307P224M3997O449
$$ -61973 -54527 -17061 17005 12193 -14939 -15735 9866 1231 -29593 -49900 -42676 1321 7770
4570G770k7195k3493J4005K071L7495J7987k6557o706k8674O122m947j748P316
$$ 7770 -19425 -42918 -28913 -26842 10653 28640 2083 -4623 -33297 -27175 -32122 -33870 -26554
4557b6554l9196q541K1294N329M6808K9305K399k736j8320K6545J4225j8024l4562
$$ -26554 -65750 -74291 -52997 -47668 -860 28445 30844 28108 9788 36333 50558 32534 -2028
4544b028P040j371j9450J4269J7012l9611m222M6165K3197L7112k2325k5186p844
$$ -2028 5012 3641 -15809 -1540 15472 -24139 -28361 17804 41001 78113 55788 30602 22758
4531B2758M143j9109k0602P579o58j2219k7376p385K0626n671m54J1258j8382
$$ 22758 26901 7792 -12810 -5231 -5889 -18108 -45484 -52869 -32243 -37914 -38368 -27110 -45492
4518d5492j2580M790K0352n64m35J4170J0979J1550j4503Q808k0351m4633o509
$$ -45492 -58072 -53282 -32930 -33494 -33929 -19759 -8780 2770 -11733 -2925 -23276 -67909 -74418
4505g4418L1053J345J0738N913L1316J0258k4027m898R788M923O774J3642J4213
$$ -74418 -43365 -42020 -31282 -25369 5947 16205 -7822 -12720 -2932 1991 8765 22407 36620
4492C6620J0978k8908k0231J624l338M902J6108n445Q182K1773M201j6076k1285
$$ 36620 47598 18690 -1541 83 -3255 1647 17755 12310 20492 42265 46466 30390 9105
4479I105k0664M465R739j1533K5072K6153k1336k2565n359j6768l4375p650M5837
$$ 9105 -11559 -7094 2645 -8888 16184 42337 21001 -1564 -6923 -23691 -58066 -65716 -19879
4466a9879K8L610N575J4240k4455J1122K09j2532j0334N387K9585K32m0083l0023
$$ -19879 -19851 -16241 -10666 3574 -20881 -9759 -9550 -22082 -32416 -27029 2556 2788 -37295 -67318
4452f7318m297K7771M3835J4047j9916j0446m079k7684J3103O554J8711k0355
$$ -67318 -71615 -43844 -9 14038 -5878 -16324 -20403 -48087 -34984 -28430 -9719 -30074
$$ [...]
##END NTUPLES=NMR SPECTRUM
##END=
