##TITLE=Analysis number 329863
Compound Code cc 58652
Book Reference 52/62
Project Code adrs
Chemist Name davee
##JCAMPDX= 6.0         $$ Bruker NMR JCAMP-DX V2.0
##DATA TYPE= NMR SPECTRUM
##DATA CLASS= NTUPLES
##ORIGIN= Bruker BioSpin GmbH
##OWNER= nmr
$$ XWIN-NMR		Version 3.5
$$ Fri Oct  5 08:43:40 2007 GMT Daylight Time (UT+1h)  MAYBRIDGE\nmr@NMR_250MHZ
##.OBSERVE FREQUENCY= 250.131544655141
##.OBSERVE NUCLEUS= ^1H
##.ACQUISITION MODE= SIMULTANEOUS (DQD)
##.ACQUISITION SCHEME= undefined
##.AVERAGES= 16
##.DIGITISER RES= 18
##SPECTROMETER/DATA SYSTEM= dpx250
##.PULSE SEQUENCE= zg30
##.SOLVENT NAME= DMSO
##.SHIFT REFERENCE= (INTERNAL, DMSO, 0, 16.5197)
##AUDIT TRAIL= $$ (NUMBER, WHEN, WHO, WHERE, WHAT)
$$ ##TITLE= Audit trail, XWIN-NMR		Version 3.5
$$ ##JCAMPDX= 5.01
$$ ##ORIGIN= Bruker BioSpin GmbH
$$ ##OWNER= nmr
$$ C:\u/data/dgb/nmr/ADRS/310/pdata/1/auditp.txt
$$ ##AUDIT TRAIL=  $$ (NUMBER, WHEN, WHO, WHERE, WHAT)
(   1,<2007-10-05 08:43:09.79 +100>,<MAYBRIDGE\nmr>,<NMR_250MHZ>,
      <created by zg, POWCHK disabled, PULCHK disabled
       configuration hash MD5:
       76 6E 9A 78 1E 09 19 81 EC 84 63 8F B0 6A 59 2D
       data hash MD5: 64K
       60 CD 3A 11 30 D7 6F F8 64 F6 A6 60 18 7D A8 E3>)
(   2,<2007-10-05 08:43:30.08 +100>,<MAYBRIDGE\nmr>,<NMR_250MHZ>,
      <Start of raw data processing
       ef LB = 0.3 FT_mod = 6 PKNL = 1 SI = 32K 
       data hash MD5: 32K
       C9 1B F9 FB 99 76 61 E6 AE 88 C2 27 23 FC 84 2B>)
(   3,<2007-10-05 08:43:32.41 +100>,<MAYBRIDGE\nmr>,<NMR_250MHZ>,
      <apk 
       data hash MD5: 32K
       F2 1A 69 CB 5E D5 2E 5E F5 C3 A4 96 FD EE 45 D6>)
(   4,<2007-10-05 08:43:33.18 +100>,<MAYBRIDGE\nmr>,<NMR_250MHZ>,
      <abs ABSG = 5 
       data hash MD5: 32K
       E3 B0 AB 7B F5 D3 A8 A3 FF 17 17 A8 A4 B5 8A 13>)
$$ ##END=
$$ 
$$ hash MD5
$$ 43 EB 17 52 20 F4 CB 0E 98 12 E7 F3 6A 13 D3 56
##$RELAX= 
##$RELAX= 
##$RELAX= 
##$RELAX= 
##$RELAX= 
##$RELAX= 
##$RELAX= 
$$ Bruker specific parameters
$$ --------------------------
##$DU= <C:\u>
##$EXPNO= 310
##$NAME= <ADRS>
##$PROCNO= 1
##$TYPE= <nmr>
##$USER= <dgb>
##$AMP= (0..31)
100 100 100 100 100 100 100 100 100 100 100 100 100 100 100 100 100 100 
100 100 100 100 100 100 100 100 100 100 100 100 100 100 
##$AQSEQ= 0
##$AQ_mod= 3
##$AUNM= <au_zg>
##$AUTOPOS= <2 >
##$BF1= 250.13
##$BF2= 250.13
##$BF3= 250.13
##$BF4= 250.13
##$BF5= 500.13
##$BF6= 500.13
##$BF7= 500.13
##$BF8= 500.13
##$BYTORDA= 1
##$CFDGTYP= 0
##$CFRGTYP= 5
##$CHEMSTR= <none>
##$CNST= (0..31)
1 1 145 1 1 1 1 1 1 1 1 1 1 1 1 1 1 1 1 1 1 1 1 1 1 1 1 1 1 1 1 1 
##$CPDPRG= <>
##$CPDPRG1= <>
##$CPDPRG2= <>
##$CPDPRG3= <>
##$CPDPRG4= <mlev>
##$CPDPRG5= <mlev>
##$CPDPRG6= <mlev>
##$CPDPRG7= <mlev>
##$CPDPRG8= <mlev>
##$CPDPRGB= <>
##$CPDPRGT= <>
##$D= (0..31)
0 1 0 0 0 0 0 0 0 0.06 0 0 0 0 0 0 0.0002 0 0 0 0 0 0 0 0 0 0 0 0 0 0 
0 
##$DATE= 1191570187
##$DBL= (0..7)
120 120 120 120 120 120 120 120 
##$DBP= (0..7)
150 150 150 150 150 150 150 150 
##$DBP07= 0
##$DBPNAM0= <>
##$DBPNAM1= <>
$$ [...]
##$SUBNAM7= <"">
##$SUBNAM8= <"">
##$SUBNAM9= <"">
##$SW= 20.6930455092707
##$SWIBOX= (0..15)
0 0 3 0 0 0 0 0 0 0 0 0 0 0 0 0 
##$SW_h= 5175.983436853
##$TD= 65536
##$TD0= 1
##$TE= 296.16
##$TE2= 300
##$TE3= 300
##$TEG= 300
##$TL= (0..7)
0 120 120 120 120 120 120 120 
##$TP= (0..7)
150 150 150 150 150 150 150 150 
##$TP07= 0
##$TPNAME0= <>
##$TPNAME1= <>
##$TPNAME2= <>
##$TPNAME3= <>
##$TPNAME4= <>
##$TPNAME5= <>
##$TPNAME6= <>
##$TPNAME7= <>
##$TPOAL= (0..7)
0.5 0.5 0.5 0.5 0.5 0.5 0.5 0.5 
##$TPOFFS= (0..7)
0 0 0 0 0 0 0 0 
##$TUNHIN= 0
##$TUNHOUT= 0
##$TUNXOUT= 0
##$USERA1= <user>
##$USERA2= <user>
##$USERA3= <user>
##$USERA4= <user>
##$USERA5= <user>
##$V9= 5
##$VALIST= <valist>
##$VCLIST= <CCCCCCCCCCCCCCC>
##$VD= 0
##$VDLIST= <DDDDDDDDDDDDDDD>
##$VPLIST= <PPPPPPPPPPPPPPP>
##$VTLIST= <TTTTTTTTTTTTTTT>
##$WBST= 1024
##$WBSW= 4
##$XGAIN= (0..3)
0 0 0 0 
##$XL= 0
##$YL= 0
##$YMAX_a= 390583
##$YMIN_a= -340176
##$ZGOPTNS= <>
##$ZL1= 120
##$ZL2= 120
##$ZL3= 120
##$ZL4= 120
##$ABSF1= 16.51974
##$ABSF2= -4.173433
##$ABSG= 5
##$ABSL= 3
##$ALPHA= 0
##$AQORDER= 0
##$ASSFAC= 0
##$ASSFACI= 0
##$ASSFACX= 0
##$ASSWID= 0
##$AUNMP= <proc_1d>
##$AZFE= 0.1
##$AZFW= 0.1
##$BCFW= 0
##$BC_mod= 0
##$BYTORDP= 0
##$COROFFS= 0
##$CY= 12.5
##$DATMOD= 1
##$DC= 0
##$DFILT= <>
##$DTYPP= 0
##$F1P= 14.0000005364418
##$F2P= -0.99999901652339
##$FCOR= 0.5
##$FTSIZE= 32768
##$FT_mod= 6
##$GAMMA= 0
##$GB= 0
##$INTBC= 1
##$INTSCL= 1
##$ISEN= 128
##$LB= 0.3
##$LEV0= 0
##$LPBIN= 0
##$MAXI= 10000
##$MC2= 0
##$MEAN= 0
##$ME_mod= 0
##$MI= 0
##$NCOEF= 0
##$NC_proc= -3
##$NLEV= 6
##$NOISF1= 0
##$NOISF2= 0
##$NSP= 0
##$NTH_PI= 0
##$NZP= 0
##$OFFSET= 16.51974
##$PC= 1
##$PHC0= 150.5515
##$PHC1= 7.661511
##$PH_mod= 1
##$PKNL= yes
##$PPARMOD= 0
##$PSCAL= 4
##$PSIGN= 0
##$REVERSE= no
##$SF= 250.130000565544
##$SI= 32768
##$SIGF1= 0
##$SIGF2= 0
##$SINO= 400
##$SIOLD= 32768
##$SREGLST= <1H.DMSO>
##$SSB= 0
##$STSI= 32768
##$STSR= 0
##$SW_p= 5175.98343685301
##$SYMM= 0
##$S_DEV= 0
##$TDeff= 65536
##$TDoff= 0
##$TI= <Analysis number 999999
Compound Code 99
Book Reference 9
Project Code 9>
##$TILT= no
##$TM1= 0
##$TM2= 0
##$TOPLEV= 0
##$USERP1= <user>
##$USERP2= <user>
##$USERP3= <user>
##$USERP4= <user>
##$USERP5= <user>
##$WDW= 1
##$XDIM= 32768
##$YMAX_p= 376263632
##$YMIN_p= -194525
$$ End of Bruker specific parameters
$$ ---------------------------------
##NTUPLES= NMR SPECTRUM
##VAR_NAME=  FREQUENCY,     SPECTRUM/REAL,   SPECTRUM/IMAG
##SYMBOL=    X,             R,               I
##VAR_TYPE=  INDEPENDENT,   DEPENDENT,       DEPENDENT
##VAR_FORM=  AFFN,          ASDF,            ASDF
##VAR_DIM=   32768,         32768,           32768
##UNITS=     HZ,            ARBITRARY UNITS, ARBITRARY UNITS
##FACTOR=    0.157963299565203, 1,           1
##FIRST=     4132.08236318251, 0,            0
##LAST=      -1043.9010736705, 0,            0
##MIN=       -1043.9010736705, -194525,      0
##MAX=       4132.08236318251, 376263632,    0
$$ Real data points
##PAGE= N=1
##DATA TABLE= (X++(R..R)), XYDATA
$$ [...]
$$ plain form
16888 -20384 9388 31362 35722 17592 14875 58934 72570 57117 67429 25000 -13465 -10325
16876 -10325 23822 40054 2326 -32968 -13931 -20106 -49405 -27078 -21347 -726 -8820 31240
16864 31240 -23184 -34786 4347 -16029 -31130 -40061 -25333 -49452 -49791 -50891 -45505 -48099 -66827
16851 -66827 -45953 -57637 -28700 -3871 7933 8822 -54673 -76598 -56145 -22372 22239 34898
16839 34898 23103 -2207 -29109 -15621 -7106 19041 5179 -64684 -49050 -11985 6837 27800
16827 27800 39279 41088 27124 -35427 -21514 -17838 -53965 -70612 -76646 -58174 -65812 -63921 -59327
16814 -59327 -44092 -16538 -37950 -44223 -29031 -36388 -30839 -17127 -36785 -46563 -30938 -16445
16802 -16445 -25879 -25163 -16956 2014 -2808 -1417 -13977 -24651 -8730 1371 -36863 354 -21366
$$ packed form
16888b0384K9772K1974M360j8130k717M4059J3636j5453J0312m2429l8465L140
16876a0325L4147J6232l7728l5294J9037o175k9299K2327N731K0621q094M0060
16864C1240n4424j1602L9133k0376j5101q931J4728k4119l39j100N386k594j8728
16851f6827K0874j1684K8937K4829J1804Q89o3495k1925K0453L3773M4611J2659
16839C4898j1795k5310k6902J3488Q515K6147j3862o9863J5634L7065J8822K0963
16827B7800J1479J809j3964o2551J3913L676l6127j6647o034J8472p638J891M594
16814e9327J5235K7554k1412o273J5192p357N549J3712j9658r778J5625J4493
16802a6445r434P16Q207J8970m822J391j2560j0674J5921J0101l8234L7217k1720
$$ plain form
16789 -21366 -24931 -19998 -19537 -34538 -5216 -15890 -38256 -24614 -13404 21536 1004 -9655
16777 -9655 21190 65817 62333 28740 3935 -2326 19784 19728 36200 83665 78779 62475 38222
16764 38222 26535 18618 -23380 -51666 -51695 -41377 -40006 -59696 -80861 -37329 -809 12971 44801
16751 44801 -4753 -17385 -42041 -29096 -3469 -8461 6722 32092 17424 15582 30104 5687
16739 5687 -13217 18614 36365 37870 -1368 26624 26845 27866 4898 -15865 -29011 -47421 -4540
16726 -4540 -2961 -46101 -47467 -36143 11987 17471 23381 36304 -7463 209 -36848 -12322 -15884
16713 -15884 -20848 -15943 -32038 -12356 -8944 -6592 -16323 -19927 184 50522 33616 -11237 -7970
16700 -7970 -7073 -15036 -53328 -41711 2900 21591 7672 -29561 -32963 -34682 -73020 -91115 -61494
$$ packed form
16789b1366l565M933M61j5001K9322j0674k2366J3642J1210L4940k0532j0659
16777i655L0845M4627l484l3593k4805o261K2110n6J6472M7465m886j6304k4253
16764C8222j1687p917m1998k8286k9J0318J371j9690k1165M3532L6520J3780L1830
16751D4801m9554j2632k4656J2945K5627m992J5183K5370j4668j842J4522k4417
16739E687j8904L1831J7751J505l9238K7992K21J021k2968k0763j3146j8410M2881
16726d540J579m3140j366J1324M8130N484N910J2923m3767P672l7057K4526l562
16713a5884m964M905j6095J9682L412K352r731l604K0111N0338j6906m4853L267
16700g970Q97p963l8292J1617M4611J8691j3919l7233l402j719l8338j8095K9621
$$ plain form
16687 -61494 -23470 -26700 -16886 -14403 -3284 24164 25075 -34995 -56462 -21614 26746 18322 -32210
16674 -32210 -78152 -65911 -82065 -86270 -55339 -19543 -19530 -38621 -30312 -28799 -8884 11616 -1079
16661 -1079 33942 33811 35038 -15118 -28337 -32626 -21986 -36057 -59414 -50796 -17261 -28461 -89960
16648 -89960 -120248 -87084 -52685 -15603 -18977 -28352 -32658 -13868 6403 -22156 -30153 2213
16636 2213 9991 11251 -20574 -54504 -89457 -97714 -45842 -21544 -20005 -38765 -37654 -5287 -15780
16623 -15780 -33843 -11342 14211 27619 -13513 -41594 -63449 -31631 -17244 -44955 -62588 -64272
16611 -64272 -40140 -2871 15784 23904 -10424 -46638 -71755 -62567 -53383 -64640 -71667 -47262
16599 -47262 3162 1823 -20737 -25871 -65043 -65749 -55186 -24756 -43509 -72600 -47801 -59424
$$ packed form
16687f1494L8024l230R814K483J1119K7448R11o0070k1467L4848M8360q424n0532
16674c2210m5942J2241j6154m205L0931L5796J3j9091Q309J513J9915K0500j2695
16661a079L5021j31J227n0156j3219m289J0640j4071k3357Q618L3535j1200o1499
16648h9960l0288L3164L4399L7082l374r375m306J8790K0271k8559p997L2366
16636B213P778J260l1825l3930l4953q257N1872K4298J539j8760J111L2367j0493
16623a5780j8063K2501K5553J3408m1132k8081k1855L1818J4387k7711j7633j684
16611f4272K4132L7269J8655Q120l4328l6214k5117R188R184j1257p027K4405
16599d7262N0424j339k2560n134l9172p06J0563L0430j8753k9091K4799j1623
$$ plain form
16587 -59424 -59069 -38378 -42791 -39168 -14135 -14209 -62548 -96939 -93065 -43662 10610 -4117 -39114
16574 -39114 -24596 -8288 5566 1460 -34965 -36064 -22706 -5384 -44958 -66228 -64230 -54326
16562 -54326 -15761 -32067 -30821 -15841 9128 -30829 -62652 -18671 19563 18234 5998 22119
16550 22119 25646 -4556 -22302 -12486 -28658 -37083 -68621 -91991 -37836 9086 35549 46745
16538 46745 30688 -12249 -29320 3250 -14957 -22764 -52829 -12755 -8601 -41790 -21419 -33690
16526 -33690 2262 21383 2603 -51443 -28895 -8633 -31300 -52365 -8865 8001 13468 -199
16514 -199 -8012 -12116 8793 -5367 -46725 -44879 -994 55104 53289 16496 -2814 -9191 14037
16501 14037 -16626 -36556 -1883 -32502 -63905 -94279 -72221 -20331 -5147 18634 32753 20333
$$ packed form
16587e9424L55K0691m413L623K5033p4m8339l4391L874M9403N4272j4727l4997
16574c9114J4518J6308J3854m106l6425j099J3358J7322l9574k1270J998R904
16562e4326L8565j6306J246J4980K4969l9957l1823M3981L8234j329j2236J6121
16550B2119L527l0202j7746R816j6172q425l1538k3370N4155M6922K6463J1196
16538D6745j6057m2937j7071L2570j8207p807l0065M0074M154l3189K0371j2271
16526c3690L5952J9121j8780n4046K2548K0262k2667k1065M3500J6866N467j3667
16514a99p813m104K0909j4160m1358J846M3885N6098j815l6793j9310o377K3228
16501A4037l0663j9930L4673l0619l1403l0374K2058N1890J5184K3781J4119j2420
$$ plain form
16489 20333 -29695 -38765 -21502 -27848 34710 59170 39077 -2039 -4752 -38475 -71828 -51199
16477 -51199 -43314 -37600 -20406 -28870 -35666 16119 49738 31943 28760 10540 -16107 -14410 -4428
16464 -4428 7353 -15246 -62718 -49779 -28503 -23482 1063 1373 -20590 -35731 -42766 -89563 -52288
16451 -52288 -2179 7610 -20035 -34678 -29452 -27615 -32618 -71954 -65890 -50284 -55859 -41774 17148
16438 17148 31588 58373 29996 -4597 289 18589 1217 -34389 -72429 -81544 -40520 -45615
16426 -45615 -63968 -25097 -21984 -8554 -23636 -47477 -41966 -28201 -44868 -33807 3981 36091
16414 36091 4570 10024 28126 -454 -32294 -26030 -19964 -18232 -25055 -32444 -46071 -57258 -22671
16401 -22671 -25187 -1524 24804 11817 -50218 -109363 -119795 -99428 -56187 -86372 -84195 -57432
$$ packed form
16489B0333n0028r070J7263o346O2558K4460k0093m1116k713l3723l3353K0629
16477e1199P885N714J7194q464o796N1785L3619j7795l183j8220k6647J697R982
16464d428J1781k2599m7472J2939K1276N021K4545L10k1963j5141p035m6797L7275
16451e2288N0109R789k7645j4643N226J837n003l9336O064J5606n575J4085N8922
16438A7148J4440K6785k8377l4593M886J8300j7372l5606l8040r115M1024n095
16426d5615j8353L8871L113J3430j5082k3841N511J3765j6667J1061L7788L2110
16414C6091l1521N454J8102k8580l1840O264O066J732o823p389j3627j1187L4587
16401b2671k516K3663K6328j2987o2035n9145j0432K0367M3241l0185K177K6763
$$ plain form
16389 -57432 -44880 -51890 -28138 -40393 -53256 -10505 -15433 829 15052 -4212 -23542 -11677
16377 -11677 -20766 -1999 -30446 -23266 2136 38071 52520 42314 -2047 5366 1176 -7870 -20158
16364 -20158 -24857 -48614 -54503 -46219 -23600 -13378 -26841 -27299 -45956 -73212 -114809 -110085 -83470
16351 -83470 -42468 -11873 -45655 -96436 -82557 -70459 -53314 -55413 -57046 -54790 -36001 -65704
16339 -65704 -84513 -50721 -8400 -3725 -25165 -65951 -14707 13466 1290 3740 3402 -8329
16327 -8329 -40136 -68168 -37927 7421 -22015 -45195 -14536 24506 13420 378 28439 59305
16315 59305 -530 -61734 -60949 -35890 -7851 -2711 -23858 -48467 -41979 8383 23609 48487
16303 48487 35440 19471 -371 -25182 -12233 -16189 -76736 -89654 -59895 -14280 18861 -4124
$$ packed form
16389e7432J2552p010K3752j2255j2863M2751m928J6262J4223j9264j9330J1865
16377a1677r089J8767k8447P180K5402L5935J4449j0206m4361P413m190r046j2288
16364b0158m699k3757n889Q284K2619J0222j3463m58j8657k7256m1597M724K6615
16351h3470M1002L0595l3782n0781J3879J2098J7145k099j633K256J8789k9703
16339f5704j8809L3792M2321M675k1440m0786N1244K8173j2176K450l38j1731
16327h329l1807k8032L0241M5348k9436k3180L0659L9042j1086j3042K8061L0866
16315E9305n9835o1204P85K5059K8039N140k1147k4609O488N0362J5226K4878
16303D8487j3047j5969j9842k4811J2949l956o0547j2918K9759M5615L3141k2985
$$ plain form
16291 -4124 -9848 5654 9221 -24578 -29693 -48820 -53233 -25900 -17560 -32187 -40848 -34503 -45592
16278 -45592 -41439 -44819 -55090 -69384 -52022 -26363 -62527 -74464 -53420 -63118 -49457 -23501
16266 -23501 -19113 -36621 -57617 -40819 -43475 -33917 -37039 -26207 -52944 -63325 -52462 -55128 -25764
16253 -25764 -26421 -40491 -7488 32360 22229 12217 6811 831 7698 31950 59004 37390 1773
16240 1773 4291 29806 23288 24388 6199 -20177 -37537 -3509 9768 29250 35038 38925 48016
16227 48016 42502 47082 36188 39326 50543 26060 -699 -23050 -23797 -38416 -39770 -28970 -18168
16214 -18168 -18939 -32195 -20177 -6600 31711 -3753 -8969 24774 -29295 -53483 -39485 -3257
16202 -3257 3717 43616 43977 7401 -26457 -11710 -4604 5660 48650 -784 -55547 -77182 -77899
$$ packed form
16291d124n724J5502L567l3799n115j9127m413K7333Q340j4627q661O345j1089
16278d5592M153l380j0271j4294J7362K5659l6164j1937K1044r698J3661K5956
16266b3501M388j7508k0996J6798k656R558l122J0832k6737j0381J0863k666K9364
16253b5764o57j4070L3003L9848j0131j0012n406n980O867K4252K7054k1614l5617
16240A773K518K5515o518J100j8189k6376j7360L4028J3277J9482N788L887R091
16227D8016n514M580j0894L138J1217k4483k6759k2351p47j4619j354J0800J0802
16214a8168p71j3256J2018J3577L8311l5464n216L3743n4069k4188J3998L6228
16202c257O974L9899L61l6576l3858J4747P106J0264M2990m9434n4763k1635p17
$$ plain form
16189 -77899 -38207 -63613 -46166 -58822 -51080 -22241 -19430 -25044 -35712 -46953 -58699 -31260
16177 -31260 -27931 -36369 -1020 8300 40308 42432 34625 18521 -33108 -22369 -50721 -69122 -31054
16164 -31054 -3086 -31400 -19011 -32998 -70269 -72009 -91229 -63486 -52919 -57624 -48989 -39895
16152 -39895 -18149 -6265 -64869 -49904 -17054 -15683 -27221 -32012 -11672 20559 36888 38745
16140 38745 22076 -11299 9830 12575 -27338 -22396 -15211 -24941 -28294 -15065 8963 -18642 -53735
16127 -53735 -73130 9265 85327 89495 51215 89682 84266 51984 17564 -2980 10441 -18280
16115 -18280 -6244 10042 -3009 -7199 15244 48508 34838 -17895 11903 8198 -29380 -29827
16103 -29827 -47422 -47749 -34929 -40939 -16713 14265 30096 -2440 -31005 -38009 -24056 -14098 -19441
$$ packed form
16189g7899L9692k5406J7447j2656P742K8839K811n614j0668j1241j1746K7439
16177c1260L329q438L5349R320L2008K124p807j6104n1629J0739k8352j8401L8068
16164c1054K7968k8314J2389j3987l7271j740j9220K7743J0567m705Q635R094
16152c9895K1746J1884n8604J4965L2850J371j1538m791K0340L2231J6329J857
16140C8745j6669l3375K1129K745l9913M942P185r730l353J3229K4028k7605l5093
16127e3735j9395Q2395P6062M168l8280L8467n416l2282l4420k0544J3421k8721
16115a8280J2036J6286j3051m190K2443L3264j3670n2733K9798l705l7578m47
16103b9827j7595l27J2820o010K4226L0978J5831l2536k8565p004J3953R958n343
$$ plain form
16090 -19441 -601 18138 35744 57634 41931 23761 6931 13330 37545 14227 -9132 -12352
16078 -12352 -36098 -36772 -10145 40138 53208 36293 -1534 -6638 10750 38852 56756 6802
16066 6802 -20782 -31203 -30923 -46008 -43849 -22684 32743 52751 67610 30481 -8953 -9569 2369
16053 2369 -16917 -2083 -24633 -35090 -48930 -104416 -121596 -62867 -27871 -18291 17660 37385
16041 37385 4952 -45509 -39166 -54677 -19355 9609 7855 -14391 -23655 -45243 -37928 -16699
16029 -16699 -40822 -42013 -37320 -28208 -21388 -10351 10134 21093 -17737 -94220 -73855 -47618
16017 -47618 -31007 32272 36156 -33700 -50787 -61954 -99211 -65009 -13560 2032 -2259 -29901
16005 -29901 -21510 -63393 -70872 -96712 -113919 -100210 -53200 -31486 -13107 16516 19243 11096
$$ packed form
16090a9441J8840J8739J7606K1890j5703j8170j6830O399K4215k3318k3359l220
16078a2352k3746o74K6627N0283J3070j6915l7827n104J7388K8102J7904m9954
16066F802k7584j0421K80j5085K159K1165N5427K0008J4859l7129l9434o16J1938
16053B369j9286J4834k2550j0457j3840n5486j7180N8729L4996R580L5951J9725
16041C7385l2433n0461O343j5511L5322K8964j754k2246r264k1588P315K1229
16029a6699k4123j191M693R112O820J1037K0485J0959l8830p6483K0365K6237
16017d7618J6611O3279L884o9856j7087j1167l7257L4202N1449J5592m291k7642
16005b9901Q391m1883p479k5840j7207J3709M7010K1714J8379K9623K727q147
$$ plain form
15993 11096 3591 -7820 1284 -7043 -30327 -55564 -57954 -60055 -47713 -39449 -61544 -37785 -58451
15980 -58451 -68070 -68577 -34142 11896 -12528 -3394 23383 54949 18686 -224 -29589 -73635
15968 -73635 -63832 -48628 -40990 -2723 -27031 -44376 -19383 19532 21942 5956 -23349 -21929
15956 -21929 -38103 -15477 8544 -24916 -50324 -33320 -1034 17643 21434 12744 6820 19256
15944 19256 9480 20450 22801 -13888 -15582 -59228 -52233 -25717 -27604 -36614 -28882 -6118 -160
15931 -160 -18117 -12983 -13334 -13552 27341 34755 -6981 -15781 -28475 -50909 -46695 -58648 -38169 -28344
15917 -28344 -3740 -31907 -26760 -3247 -11720 -27597 -32065 429 -17566 -49987 -51523 -33264
15905 -33264 -45097 -26773 -30122 -31732 -5268 12879 -16826 -29173 -17832 -57227 -73384 -64858
$$ packed form
15993A1096p505j1411R104q327k3284k5237k390k101J2342Q264k2095K3759k0666
15980e8451r619n07L4435M6038k4424R134K6777L1566l6263j8910k9365m4046
15968g3635R803J5204P638L8267k4308j7345K4993L8915K410j5986k9305J420
15956b1929j6174K2626K4021l3460k5408J7004L2286J8677L791q690n924J2436
15944A9256r776J0970K351l6689j694m3646O995K6516j887r010P732K2764N958
15931a60j7957N134l51k18M0893P414m1736q800j2694k2434M214j1953K0479R825
15917b8344K4604k8167N147K3513q473j5877m468L2494j7995l2421j536J8259
15905c3264j1833J8324l349j610K6464J8147k9705j2347J1341l9395j6157Q526
$$ plain form
15893 -64858 -65112 -56423 -26925 -23923 -30944 -67099 -107916 -128069 -76111 -36749 -31883 -14206 -26090
15880 -26090 -82001 -99640 -107253 -79320 -24647 3489 5044 -34565 -50745 -39206 -18886 2993
15868 2993 20444 29399 17203 33206 34090 38510 34842 5188 -19871 15063 22176 -11059 4097
15855 4097 -13600 -16373 -59145 -92548 -68039 -21503 18310 57915 44937 -26435 -84993 -96659
15843 -96659 -94280 -80578 -99887 -100825 -53695 17445 64232 62088 7738 -6624 -4626 -7919 -31215
15830 -31215 -55405 -25127 -752 28378 22085 45329 8598 -19316 -22417 -9913 -10428 -40424
15818 -40424 -36675 -7240 -770 -1438 -4139 -26092 -26096 -4271 4988 27853 13776 22008 64051 64530
15804 64530 9892 -62170 -79788 -75338 -56089 -71974 -41704 -30785 -62568 -90672 -80216 -59813
$$ packed form
15893f4858k54Q689K9498L002p021l6155m0817k0153N1958L9362M866J7677j1884
15880b6090n5911j7639p613K7933N4673K8136J555l9609j6180J1539K0320K1879
15868B993J7451Q955j2196J6003Q84M420l668k9654k5059L4934P113l3235J5156
15855D097j7697k773m2772l3403K4509M6536L9813L9605j2978p1372n8558j1666
15843i6659K379J3702j9309r38M7130P1140M6787k144n4350j4362J998l293k3296
15830c1215k4190L0278K4375K9130o293K3244l6731k7914l101J2504n15k9996
15818d0424L749K9435O470o68k701k1953mK1825R259K2865j4077Q232M2043M79
15804F4530n4638p2062j7618M450J9249j5885L0270J0919l1783k8104J0456K0403
$$ plain form
15792 -59813 -40093 -21368 5076 751 938 7888 -34908 -49381 -33504 -11720 -22671 -42006
15780 -42006 -60262 -34876 -25526 -26757 -9852 5036 -16744 -51074 -61157 -45725 -58365 -70730
15768 -70730 -83666 -83392 -68062 -49271 -36494 9525 3162 -24996 -25297 -31257 -63691 -29602 25659
15755 25659 17422 30919 42048 23092 3956 -14821 -18176 -25110 -8258 -56643 -69886 -45273
15743 -45273 -18031 6713 19271 19572 28945 28878 23409 729 8012 -20030 -39534 -41541 -44358 -68690
15729 -68690 -35083 -24714 -20238 -8569 -12122 -40936 -67526 -66189 -37258 -720 929 -27463
15717 -27463 -40774 -8128 6312 -14607 -37649 -18376 16317 33299 63027 66448 61543 30160
15705 30160 27362 25295 7811 -23949 -14081 35374 37438 53390 44196 56055 45210 23947 -38978
$$ packed form
15792e9813J9720J8725K6444m325J87O950m2796j4473J5877K1784j0951j9335
15780d2006j8256K5386R350j231J6905J4888k1780l4330j0083J5432j2640j2365
15768g0730j2936K74J5330J8791J2777M6019o363k8158l01n960l2434L4089N5261
15755B5659q237J3497J1129j8956j9136j8777l355o934J6852m8385j3243K4613
15743d5273K7242K4744J2558L01R373o7n469k2680P283k8042j9504k007k817k4332
15729f8690L3607J0369M476J1669l553k8814k6590J337K8931L6538J649k8392
15717b7463j3311L2646J4440k0919k3042J9273L4693J6982K9728L421m905l1383
15705C0160k798k067j7484l1760R868M9455K064J5952r194J1859j0845k1263o2925
$$ plain form
15692 -38978 -25979 1868 7892 8938 -33125 -42880 -33680 -39738 -45771 -43596 2134 24505 -31135
15679 -31135 -16800 -4723 -5649 20684 -26646 -67900 -67167 -78266 -88588 -74509 -39927 -74829
15667 -74829 -70136 -78484 -30512 -31254 -53831 -19324 16708 19422 -14833 -14553 26646 60015 51985
15654 51985 48639 51239 29686 7091 -16000 -38923 -50412 -32278 -14136 -4816 19063 35209
15642 35209 37500 14187 5841 25976 15628 41580 32854 8815 -25880 -54927 -65526 -64324
15630 -64324 -33991 841 -8904 -42285 -51166 -59739 -36743 -17145 -18478 -38299 -30357 -41168 -81252
15617 -81252 -68777 -39713 -17054 49306 53697 7049 -32439 -64183 -18173 11954 -11178 -19869
15605 -19869 -2111 20312 31147 11519 -14432 7160 12799 -40594 -45849 3083 43176 82519
$$ packed form
15692c8978J2999K7847O024J046m2063r755R200o058o033K175M5730K2371n5640
15679c1135J4335J2077r26K6333m7330m1254P33j1099j0322J4079L4582l4902
15667g4829M693q348M7972p42k2577L4507L6032K714l4255K80M1199L3369q030
15654E1985l346K600k1553k2595k3091k2923j1489J8134J8142R320K3879J6146
15642C5209K291k3313q346K0135j0348K5952q726k4039l4695k9047j0599J202
15630f4324L0333L4832r745l3381q881q573K2996J9598j333j9821P942j0811m0084
15617h1252J2475K9064K2659O6360M391m6648l9488l1744M6010L0127k3132q691
15605a9869J7758K2423J0835j9628k5951K1592N639n3393n255M8932M0093L9343
$$ plain form
15593 82519 92829 58049 31459 44130 18551 -11669 -34788 -39148 -35263 -33989 -34018 -49923 -39414
15580 -39414 -9067 -24448 -36040 -62786 -51115 -27302 8274 -17765 -50700 -51770 -70855 -54722
15568 -54722 -32586 -38813 -68535 -76547 -56721 -38192 -10516 -44749 -28524 6807 -9583 -35269
15556 -35269 -60669 -45427 -16343 -13856 -14269 -37663 -31733 -4968 19208 -21353 -58792 -52086 -25100
15543 -25100 -12072 -31606 -54005 -90510 -88209 -89204 -80496 -47195 -41752 -29840 6705 12680 -19193
15530 -19193 -23673 39389 42862 37111 -16258 -40061 -35352 -13769 -32527 -8909 -51983 -62649
15518 -62649 4287 11534 15404 16495 -2140 -13667 -44392 -53085 -49532 -80555 -84649 -48378 -23570
15505 -23570 15195 15690 14118 29667 44780 32873 26144 14488 9208 18557 -13621 -31164 -54236
$$ packed form
15593H2519J0310l4780k6590J2671k5579l0220k3119m360L885J274k9j5905J0509
15580c9414L0347j5381j1592k6746J1671K3813L5576k6039l2935j070j9085J6133
15568e4722K2136o227k9722q012J9826J8529K7676l4233J6225L5331j6390k5686
15556c5269k5400J5242K9084K487m13k3394N930K6765K4176m0561l7439O706K6986
15543b5100J3028j9534k2399l6505K301r95Q708L3301N443J1912L6545N975l1873
15530a9193m480O3062L473n751n3369k3803M709K1583j8758K3618m3074j0666
15518f2649O6936P247L870J091j8635j1527l0725q693L553l1023m094L6271K4808
15505b3570L8765M95j572J5549J5113j1907o729j1656n280R349l2178j7543k3072
$$ plain form
15492 -54236 -42599 -47858 -29797 11753 12720 -8075 -18575 26535 11707 11813 -30619 -22080 2235
15479 2235 -3388 -16468 -55852 -55152 -45836 -21993 -6264 6617 14164 -19748 -22635 12592 -22995
15466 -22995 -51162 -38046 7361 54763 22442 23376 31388 -3349 -16426 11204 7599 1846 -49876
15453 -49876 -68163 -52728 -21974 40853 61144 43984 -5559 -31123 -62844 -78962 -49992 -44378
15441 -44378 -30922 -19595 -13074 -33053 -24474 -29956 -12641 26526 30150 25421 21896 40416 10035
15428 10035 -9873 -24370 -14152 -4788 58 1864 22180 -10553 -23125 -47171 -1008 2451
15416 2451 -10693 170 -2319 -33109 -76803 -28310 3957 -4474 6941 40618 11865 -44923
15404 -44923 -55152 -57706 -46441 -39297 -43373 -71216 -87481 -73658 -52031 -81476 -61214 -24213
$$ packed form
15492e4236J1637n259J8061M1550R67k0795j0500M5110j4828J06m2432Q539K4315
15479B235n623j3080l9384P00R316K3843J5729J2881P547l3912k887L5227l5587
15466b2995k8167J3116M5407M7402l2321R34Q012l4737j3077K7630l605n753n1722
15453d9876j8287J5435L0754O2827K0291j7160m9543k5564l1721j6118K8970N614
15441d4378J3456J1327O521j9979Q579n482J7315L9167L624m729l525J8520l0381
15428A0035j9908j4497J0218R364M846J806K0316l2733j2572k4046M6163L459
15416B451j3144J0863k489l0790m3694M8493L2267q431J1415L3677k8753n6788
15404d4923j0229k554J1265P144m076k7843j6265J3823K1627k9445K0262L7001
$$ plain form
15392 -24213 -26478 -36257 -16800 -25955 -19032 -30339 -10030 3774 -1785 801 -23190 -22665 -19472
15379 -19472 11657 29241 45870 32306 44270 5106 -44162 -53970 -39076 -45580 -26815 -25234
15367 -25234 -27258 -12155 -15345 -13386 32493 46888 49274 12284 -28674 -41715 -57839 -71242
15355 -71242 -83100 -45047 -54076 -96107 -78178 -49542 -10545 8016 25150 14178 -34888 -26803
15343 -26803 -43530 -15541 23192 11314 -20885 -25787 -17533 2712 21749 11906 23523 -7496
15331 -7496 -15945 -33514 -6691 29226 83209 71711 11964 -35473 -43027 -76599 -101505 -92031
15319 -92031 -68508 -15359 -5358 29626 30904 -31262 -22648 -25702 -61525 -17679 58649 86940
15307 86940 65641 37865 -10239 -914 -17180 -47114 -26122 -25318 -29032 -28260 -41089 -23219 -775
$$ packed form
15392b4213k265r779J9457r155O923j1307K0309J3804n559K586k3991N25L193
15379a9472L1129J7584J6629j3564J1964l9164m9268r808J4894o504J8765J581
15367b5234k024J5103l190J959M5879J4395K386l6990m0958j3041j6124j3403
15355g1242j1858L8053r029m2031J7929K8636L8997J8561J7134j0972m9066Q085
15343b6803j6727K7989L8733j1878l2199m902Q254K0245J9037r843J1617l1019
15331g496q449j7569K6823L5917N3983j1498n9747m7437p554l3572k4906R474
15319i2031K3523N3149J0001L4984J278o2166Q614l054l5823M3846P6328K8291
15307H6940k1299k7776m8104R325j6266k9934K0992Q04l714P72j2829J7870K2444
$$ plain form
15294 -775 -1571 5114 -808 -11172 -24857 -33771 -6872 15020 -10403 -49995 -59910 -61611 -114015
15281 -114015 -127799 -86079 -51494 -35236 642 1329 -18274 954 -6787 -11068 -16295 -11371 11688
15268 11688 47836 34730 39290 65574 54811 48541 58503 59058 90448 58218 11611 6706 10636
15255 10636 -24272 -33714 7567 17190 25209 29002 37656 15305 28367 17346 15318 20995 -21686
15242 -21686 -40364 -18272 18576 36978 43196 41606 24884 -25018 -44304 30571 50962 42356
15230 42356 26158 -10896 -39983 -58968 -82971 -63834 6775 33346 13962 -10545 -24341 2068
15218 2068 30332 43830 76024 88680 42764 39942 79386 62653 23428 10259 32681 41154
15206 41154 41322 4707 -22917 -43583 -54030 -72487 -74593 -59940 -18239 -17315 -18041 63375 70033
$$ packed form
15294g75p96O685n922j0364j3685q914K6899K1892k5423l9592r915j701n2404
15281a14015j3784M1720L4585J6258L5878O87j9603J9228p741m281n227M924K3059
15268A1688L6148j3106M560K6284j0763o270R962N55L1390l2230m6607m905L930
15255A0636l4908r442M1281R623Q019L793Q654k2351J3062j1021k028N677m2681
15242b1686j8678K2092L6848J8402O218j590j6722m9902j9286P4875K0391q606
15230D2356j6198l7054k9087j8985k4003J9137P0609K6571j9384k4507j3796K6409
15218B068K8264J3498L2194J2656m5916k822L9444j6733l9225j3169K2422Q473
15206D1154J68l6615k7624k0666j0447j8457k106J4653M1701R24p26Q1416O658
$$ plain form
15193 70033 41646 -1238 31372 42561 23094 29127 40232 41082 19200 -26125 -8464 19315
15181 19315 -2700 -27660 3140 -411 -54865 -48972 -71840 -66605 -25725 6778 14563 22077 4158
15168 4158 21659 9450 7947 -16112 -52062 -32510 -25361 -65043 -53210 -16565 5587 -22018
15156 -22018 -41462 -11488 -15540 -11968 12943 2824 5633 5218 31886 22532 -1797 -51958 -47339
15143 -47339 -956 56105 54355 41391 42429 25922 28857 -17287 -44995 4150 32441 24237
15131 24237 -34523 -49904 -24566 -11746 -59385 -96100 -83977 -52218 -14777 3441 11299 9439
15119 9439 34316 50474 9836 -15445 -17424 -12241 -39781 -23892 -21586 -46836 -29106 8343
15107 8343 3133 1225 44233 29554 30682 16607 2403 -10363 3916 34937 38630 44780 46708
$$ packed form
15193G0033k8387m2884L2610J1189j9467O033J1105Q50k1882m5325J7661K7779
15181A9315k2015k4960L0800l551n4454N893k2868N235M0880L2503P785P514j7919
15168D158J7501j2209j503k4059l5950J9552P149l9682J1833L6645K2152k7605
15156b2018j9444K9974m052L572K4911j0119K809m15K6668r354k4329n0161M619
15143d7339M6383N7061j750j2964J038j6507K935m6144k7708M9145K8291q204
15131B4237n8760j5381K5338J2820m7639l6715J2123L1759L7441J8218P858j860
15119I439K4877J6158m0638k5281j979N183k7540J5889K306k5250J7730L7449
15107H343n210j908M3008j4679J128j4075j4204j2766J4279L1021L693O150J928
$$ plain form
15094 46708 30227 50556 13588 -6932 11339 17878 9211 130 -2489 -20994 -6325 4917
15082 4917 18644 14025 21690 40577 -17816 -57126 -19799 -27808 -41803 -50584 -76220 -127165 -127773
15069 -127773 -114493 -81766 -18457 8331 35215 -9085 -3469 2520 -32988 -30589 -29856 4586
15057 4586 57621 51067 -5542 -6867 10048 -2424 -2174 40936 50737 24694 -18110 -40412 -14183
15044 -14183 3677 10579 -9722 -34992 -86408 -95384 -83688 -55104 -40497 -40199 -34726 -28698 -8772
15031 -8772 -14639 22875 27834 6742 9026 -10329 -21887 -17583 -23655 -40663 474 -18610 -63449
15018 -63449 5768 -2380 -26029 -23036 -3591 35962 64180 54758 69702 34919 20299 -469
15006 -469 -20061 -43628 -48470 -33698 -47008 -30325 -44053 -65009 -63505 -50011 -52932 -50088 -75609
$$ packed form
15094D6708j6481K0329l6968k0520J8271O539q667r081k619j8505J4669J1242
15082D917J3727m619P665J8887n8393l9310L7327q009j3995q781k5636n0945o08
15069a27773J3280L2727O3309K6788K6884m4300N616N989l5508K399P33L4442
15057D586N3035o554n6609j325J6915j2472K50M3110R801k6043m2804k2302K6229
15044a4183J7860O902k0301k5270n1416q976J1696K8584J4607K98N473O028J9926
15031h772n867L7514M959k1092K284j9355j1558M304o072j7008M1137j9084m4839
15018f3449O9217q148k3649K993J9445L9553K8218r422J4944l4783j4620k0768
15006d69j9592k3567m842J4772j3310J6683j3728k0956J504J3494k921K844k5521
$$ plain form
14993 -75609 -28508 -28014 -44970 -60518 -90679 -120811 -83389 -12231 9914 -35489 -55203 -36595
14981 -36595 -13834 -24206 -26756 -35274 -43320 -63130 -91945 -114913 -124685 -62640 2409 54397
14969 54397 25949 -30531 -39184 -24327 -20078 -17431 -54016 -81460 -95167 -98657 -74044 -73876 -37517
14956 -37517 -38863 -71293 -63814 -21767 -30267 2091 -42945 -37234 -26068 10521 50688 26425
14944 26425 -19781 -6934 -929 -2126 22003 32990 50082 -9370 -12708 -34888 -43124 5038
14932 5038 43943 47285 45414 45345 37353 -18753 -23800 16728 25684 -16274 7399 36797 47459
14919 47459 16509 -24701 -34902 -15567 -17173 -5560 -13534 -3540 36459 69664 68786 43958 24252
14906 24252 31284 22971 -48731 -76730 -63723 -84729 -68604 -40926 -18589 -28976 -56648 -82500
$$ packed form
14993g5609M7101M94j6956j5548l0161l0132L7422P1158K2145m5403j9714J8608
14981c6595K2761j0372k550q518q046j9810k8815k2968r772O2045O5049N1988
14969E4397k8448n6480q653J4857M249K647l6585k7444j3707l490K4613J68L6359
14956c7517j346l2430P479M2047q500L2358m5036N711J1166L6589M0167k4263
14944B6425m6206J2847O005j197K4129J0987J7092n9452l338k2180q236M8162
14932E038L8905L342j871o9p992n6106n047M0528Q956m1958K3673K9398J0662
14919D7459l0950m1210j0201J9335j606J1613p974R994L9999L3205q78k4828j9706
14906B4252P032q313p1702k7999J3007k1006J6125K7678K2337j0387k7672k5852
$$ plain form
14894 -82500 -62769 -44905 -47624 -38150 1659 -13169 -42373 -54817 -42765 -26943 -7253 -17948
14882 -17948 -66395 -62335 -47792 -21633 -48090 -30255 7878 12610 3191 2481 106 32449 44129
14869 44129 63789 66627 73437 78763 66938 37650 -5376 4854 13237 -2589 12657 11411 -37974
14856 -37974 -79029 -53320 7799 24238 43380 42725 12150 14225 -23443 -56405 -49965 -57553 -79902
14843 -79902 -86071 -45077 -23838 -17108 2349 2974 -13983 -53334 -25017 58127 50575 39311 35890
14830 35890 3051 -31532 -51194 -72746 -81963 -57502 -34648 -50443 -52848 -37678 -37670 -8854 32591
14817 32591 64808 67113 81542 86254 105814 42289 2183 3088 -4671 -19775 -20063 -47712 -92930
14804 -92930 -82224 -60848 18011 44193 24816 5646 -30189 -61362 -46867 -28775 -56612 -49764
$$ packed form
14894h2500J9731J7864k719R474L9809j4828k9204j2444J2052J5822J9690j0695
14882a7948m8447M060J4543K6159k6457J7835L8133M732r419p10k375L2343J1680
14869D4129J9660K838O810N326j1825k9288m3026J0230Q383j5826J5246j246m9385
14856c7974m1055K5709O1119J6439J9142o55l0575K075l7668l2962O440p588k2349
14843g9902o169M0994K1239O730J9457O25j6957l9351K8317Q3144p552j1264l421
14830C5890l2839l4583j9662k1552r217K4461K2854j5795k405J5170QK8816M1445
14817C2591L2217K305J4429M712J9560o3525m0106R05p759j5104k88k7649m5218
14804i2930J0706K1376P8859K6182j9377j9170l5835l1173J4495J8092k7837O848
$$ plain form
14792 -49764 -46374 6995 21734 27974 57471 35643 -2868 13368 30640 7605 13012 37762
14780 37762 2514 -62450 -33411 -37599 -88254 -98387 -81611 -30603 4411 -2357 -40081 -65311
14768 -65311 -66087 -42084 -65318 -46573 -45356 -24052 -27551 -70426 -25748 40657 20983 11727 -10457
14755 -10457 -17781 -44088 -49839 -38519 -20871 -27598 -30088 -79147 -47044 -11661 -4559 18386 9192
14742 9192 -22254 -77762 -81033 -87580 -98544 -93408 -118636 -88468 -75385 -71117 -46201 9312 11987
14729 11987 16260 -9451 -38202 -57895 -74880 -43564 14551 -6238 -25307 -3346 -26891 -44046
14717 -44046 4521 21001 21936 -9979 -47728 -15941 -5419 14396 -528 36356 47715 50478
14705 50478 68702 90326 64893 27863 195 -17844 -3315 2171 -30370 -31131 4549 17547
$$ packed form
14792d9764L390N3369J4739O240K9497k1828l8511J6236J7272k3035N407K4750
14780C7762l5248o4964K9039m188n0655j0133J6776N1008L5014o768l7724k5230
14768f5311p76K4003k3234J8745J217K1304l499m2875M4678O6405j9674r256k2184
14755a0457p324k6307n751J1320J7648o727k490m9059L2103L5383P102K2945r194
14742I192l1446n5508l271o547j0964N136k5228L0168J3083M268K4916N5513K675
14729A1987M273k5711k8751j9693j6985L1316N8115k0789j9069K1961k3545j7155
14717d4046M8567J6480R35l1915l7749L1787J0522J9815j4924L6884J1359K763
14705E0478J8224K1624k5433l7030k7668j8039J4529N486l2541p61L5680J2998
$$ plain form
14693 17547 51825 40109 20749 20853 1172 10063 9899 41394 68045 76945 81381 30079 12293
14680 12293 49809 47592 -17730 -27848 -9479 32839 6991 -24327 -9286 57924 83637 58194
14668 58194 39561 26221 40003 45824 -15485 390 7335 -13705 20437 33568 41773 3054
14656 3054 -36403 -81300 -44436 -22483 -25022 -24040 18963 27364 14851 11004 -20294 -39091 -54333
14643 -54333 -54612 -64825 -49620 -37290 -19566 -15396 -57838 -77796 -61052 -66189 -60493 -32362 -37699
14630 -37699 -49619 -56039 -33458 -37121 -57871 -58203 -7667 -9387 -29187 -41619 -42506 -54446 -63667
14617 -63667 -49335 -16532 39247 55630 40402 -12882 -13390 -18836 -22287 -394 -28551 -22240 -26963
14604 -26963 -23696 -41425 -28390 -45677 -35176 -11911 15713 -4027 11504 6993 -14882 -5094
$$ packed form
14693A7547L4278j1716j9360J04j9681Q891j64L1495K6651Q900M436n1302j7786
14680A2293L7516k217o5322j0118J8369M2318k5848l1318J5041O7210K5713k5443
14668E8194j8633j3340J3782N821o1309J5875O945k1040L4142J3131Q205l8719
14656C054l9457m4897L6864K1953k539R82M3003Q401j2513l847l1298j8797j5242
14643e4333k79j0213J5205J2330J7724M170m2442j9958J6744n137N696K8131n337
14630c7699j1920o420K2581l663k0750l32N0536j720j9800j2432q87j1940r221
14617f3667J4332L2803N5779J6383j5228n3284n08n446l451K1893k8157O311m723
14604b6963L267j7729J3035j7287J0501K3265K7624j9740J5531m511k1875R788
$$ plain form
14592 -5094 39175 78139 59646 21382 24555 -1773 -890 -64700 -93295 -106881 -106438 -39455 -15893
14579 -15893 -5859 26781 47720 32546 14456 -33736 -32682 -33823 -17749 32972 22100 24427
14567 24427 11189 -18380 -41257 -27340 -28006 -53674 -63848 -30445 21569 20626 46776 84804
14555 84804 96293 89163 80857 63203 2571 -57082 -93020 -51188 13512 44028 41523 24827
14543 24827 7721 -46811 -71007 -87638 -72521 6109 41740 23550 -14022 -25067 -16051 -31769
14531 -31769 -24835 -20472 -7989 -22475 -18474 7285 7849 -2930 -17781 -46368 -44331 -11795 4177
14518 4177 33082 -9301 10296 18787 44169 32523 -3186 -32193 -5149 22653 67091 30332
14506 30332 11965 23771 37233 24056 -24248 -29245 32682 30152 16598 15064 5438 -2619 -8076
$$ packed form
14592e094M4269L8964j8493l8264L173k6328Q83o3810k8595j3586M43O6983K3562
14579a5893J0034L2640K0939j5174j8090m8192J054j141J6074N0721j0872K327
14567B4427j3238k9569k2877J3917o66k5668j0174L3403N2014r43K6150L8028
14555H4804J1489p130q306j7654o0632n9653l5938M1832O4700L0516k505j6696
14543B4827j7106n4532k4196j6631J5117P8630L5631j8190l7572j1045R016j5718
14531c1769O934M363J2483j4486M001K5759N64j0779j4851k8587K037L2536J5972
14518D177K8905m2383J9597Q491K5382j1646l5709k9007K7044K7802M4438l6759
14506C0332j8367J1806J3462j3177m8304m997O1927k530j3554j534r626q057n457
$$ plain form
14493 -8076 -55459 -97168 -79424 -24575 -7948 -67065 -90710 -55066 -17992 8933 -392 23023
14481 23023 24973 1359 -39850 -46202 -58534 -81928 -50486 -47195 -47789 -82319 -114299 -135638 -119987
14468 -119987 -73503 -59965 -85892 -82275 -54659 -24221 9893 1263 -5715 -7734 -33775 -23636
14456 -23636 -12783 -28348 -32796 -58929 -69187 -70334 -58490 -64668 -70596 -62836 -57034 -48459 -76931
14443 -76931 -87863 -76227 -90183 -100293 -85072 -39108 410 -23653 10279 991 -45907 -21323
14431 -21323 -12999 819 -14835 -9680 -26039 -76080 -80812 -92800 -49116 -3051 -1510 -12894
14419 -12894 -1234 25559 17337 21146 19178 44052 15538 -13882 -61735 -65690 -16104 7288
14407 7288 7217 4184 -11104 -20797 4458 -21763 -38724 29415 42304 -26005 -41104 -28539 -9277
$$ packed form
14493h076m7383m1709J7744N4849J6627n9117k3645L5644L7074K6925r325K3415
14481B3023J950k3614m1209o352j2332k3394L1442L291n94l4530l1980k1339J5651
14468a19987M6484J3538k5927L617K7616L0438L4114q630o978k019k6041J0139
14456b3636J0853j5565m448k6133j0258j147J1844o178n928P760N802Q575k8472
14443g6931j0932J1636j3956j0110J5221M5964L9518k4063L3932r288m6898K4584
14431b1323Q324J3818j5654N155j6359n0041m732j1988M3684M6065J541j1384
14419a2894J1660K6793q222L809j968K4874k8514k9420m7853l955M9586K3392
14407G288p1l033j5288r693K5255k6221j6961O8139J2889o8309j5099J2565J9262
$$ plain form
14394 -9277 -13722 -10384 -15348 26433 45992 -16165 -46939 -10210 -652 -14016 -41133 -54800 -50872
14381 -50872 -47048 -56096 -41571 -63657 -29056 -37746 -94008 -63832 -70914 -68237 -54005 -50871 -43659
14368 -43659 -15237 5794 29168 32974 27663 34924 12743 2452 -26820 -52877 -69210 -38504
14356 -38504 6939 32771 23206 7336 8925 -13175 -32597 909 2457 -10901 5736 30232
14344 30232 22049 24464 2663 -22052 -52085 -69323 -47671 -41465 -37171 22860 63753 76644
14332 76644 26129 -22249 -50290 -24106 -11306 18885 27605 26958 28045 964 -11994 4385
14320 4385 3339 4182 6563 21534 -12941 -22778 -35960 -28461 -29549 -51005 -37737 -12871 27521
14307 27521 74409 84693 88147 98490 81946 24923 29880 5157 -2913 16043 31552 41886
$$ packed form
14394i277m445L338m964M1781J9559o2157l0774L6729R558j3364k7117j3667L928
14381e0872L824r048J4525k2086L4601q690n6262L0176p082K677J4232L134P212
14368d3659K8422K1031K3374L806n311P261k2181j0291k9272k6057j6333L0706
14356c8504M5443K5832r565j5870J589k2100j9422L3506J548j3358J6637K4496
14344C0232q183K415k1801k4715l0033j7238K1652O206M294O0031M0893J2891
14332G6644n0515m8378k8041K6184J2800L0191Q720o47J087k7081j2958J6379
14320D385j046Q43K381J4971l4475r837j3182P499j088k1456J3268K4866M0392
14307B7521M6888J0284L454J0343j6544n7023M957k4723q070J8956J5509J0334
$$ plain form
14295 41886 40115 13020 11044 20180 6016 -28286 5544 47566 44832 -6457 -33687 -44180
14283 -44180 -1993 16017 40635 46094 40756 53238 47694 35859 -21467 -20527 -49279 -43389 -10857
14270 -10857 14795 -29050 -74743 -51338 -31920 -40243 -24818 -16100 12416 21440 11558 17518 -2334
14257 -2334 -19404 -13551 18398 12619 -18653 -34510 6561 26341 38717 51937 11073 -30015
14245 -30015 -6304 17554 10200 34629 51808 52089 8199 -59404 -104382 -99529 -97184 -35675 -9149
14232 -9149 -40362 -32127 -2466 22701 -21081 -66191 -47723 -2372 1779 22801 -8770 -40597
14220 -40597 -20402 8790 -3270 -14376 -52976 -46619 -33627 -64282 -67280 -91018 -56169 -25779
14208 -25779 -23059 -22166 -10881 20195 58273 62946 18147 525 -4015 21165 30508 43607 38312
$$ packed form
14295D1886j771k7095j976R136j4164l4302L3830M2022k734n1289k7230j0493
14283d4180M2187J8010K4618N459n338J2482n544j1835n7326R40k8752N890L2532
14270a0857K5652m3845m5693K3405J9418q323J5425Q718K8516R024r882N960j9852
14257b334j7070N853L1949n779l1272j5857M1071J9780J2376J3220m0864m1088
14245c0015K3711K3858p354K4429J7179K81m3890o7603m4978M853K345O1509K6526
14232i149l1213Q235K9661K5167m3782m5110J8468M5351M151K1022l1571l1827
14220d0597K0195K9192j2060j1106l8600O357J2992l0655k998k3738L4849L0390
14208b5779K720Q93J1285L1076L8078M673m4799j7622m540K5180R343J3099n295
$$ plain form
14195 38312 -2416 -20060 -3879 4918 3101 14838 7536 15799 -21691 -40318 -57749 -50660 -11165
14182 -11165 22378 20404 24917 38251 -4766 -11044 -11851 -16647 8451 23417 24840 26903 37137
14169 37137 37638 45092 28229 -4225 -6874 -1845 16431 3516 -5969 -12996 2407 -31328 -83995
14156 -83995 -77368 -86006 -71069 -76976 -92560 -126569 -112797 -67526 -68846 -66333 -63676 -21981 -9110
14143 -9110 -18117 -18288 -10945 26863 53587 77935 59728 28873 1694 16967 29814 19287 7672
14130 7672 13602 13078 -20537 -32002 -24004 -33385 -50448 -25875 -8267 4696 -606 -16463 -86940
14117 -86940 -93291 -41728 27818 10810 -23162 -23785 -34068 -36969 -55314 -60262 -49405 -49964 -52976
14104 -52976 -64477 -55222 -30630 3737 13641 25343 14848 4832 7876 12546 2984 11692 39982
$$ packed form
14195C8312m0728j7644J6181Q797j817J1737p302Q263l7490j8627j7431P089L9495
14182a1165L3543j974M513J3334m3017o278q07m796K5098J4966J423K063J0234
14169C7137N01P454j6863l2454k649N029J8276j2915r485p027J5403l3735n2667
14156h3995O627q638J4937n907j5584l4009J3772M5271j320K513K657M1695J2871
14143i110r007j71P343L7808K6724K4348j8207l0855k7179J5273J2847j0527j1615
14130G672N930n24l3615j1465P998r381j7063K4573J7608J2963n302j5857p0477
14117h6940o351N1563O9546j7008l3972o23j0283k901j8345m948J0857n59l012
14104e2976j1501R255K4592L4367R904J1702j0495j0016L044M670r562Q708K8290
$$ plain form
14091 39982 64103 46845 -9540 -33809 10030 46496 57326 6776 -22132 544 -20929 -75675
14079 -75675 -46123 24653 35543 27333 37669 70903 14476 -3409 -47257 -60979 -47349 -34879
14067 -34879 -38975 -45100 -46005 -60462 -41086 -14952 -15130 -12310 -31791 -57713 -41382 -21526 -3107
14054 -3107 39600 60493 43318 9050 15108 -619 -27957 -43454 -31979 -63880 -57406 968
14042 968 34391 40866 19209 -18514 -132 15896 -12675 -25141 -5818 25592 54231 43243
14030 43243 24248 6988 -4429 59870 37077 -6593 -25317 -49381 -42879 -60511 -99757 -103790
14018 -103790 -101090 -74662 -58913 -98588 -88230 -61797 -19131 -14205 -48797 -41845 -34027 -64733
14006 -64733 -64432 -86341 -104190 -81959 -64791 -66076 -58637 -68917 -57603 -60910 -56969 -42034 -46281
$$ packed form
14091C9982K4121j7258n6385k4269M3839L6466J0830n0550k8908K2676k1473n4746
14079g5675K9552P0776J0890q210J0336L3234n6427j7885m3848j3722J3630J2470
14067c4879m096o125r05j4457J9376K6134j78K820j9481k5922J6331J9856J8419
14054c107M2707K0893j7175l4268O058j5727k7338j5497J1475l1901O474N8374
14042I68L3423O475k1657l7723J8382J6028k8571j2466J9323L1410K8639j0988
14030D3243j8995j7260j1417O4299k2793m3670j8724k4064O502j7632l9246m033
14018a03790K700K6428J5749l9675J0358K6433M2666M926l4592O952P818l0706
14006f4733L01k1909j7849K2231J7168j285P439j0280J1314l307L941J4935m247
$$ plain form
13993 -46281 -44082 -53638 -49852 3926 19026 10240 4125 8918 12091 4581 3597 -10714 -76271 -76994
13979 -76994 -84214 -76806 -64436 -69161 -58209 16231 19990 51620 39703 -76117 -110932 -92814
13967 -92814 -56578 -33661 -24803 9890 26993 26566 14009 -21709 -4165 45197 51681 34373
13955 34373 28363 17773 43345 29859 -2328 -25396 -17772 -4263 -31763 -71924 -98545 -106431
13943 -106431 -48627 -11613 -1014 -33878 -54673 -34458 -8990 -35777 -48758 -22291 2949
13932 2949 9606 23290 -2387 -31967 -56755 -39931 -18629 -28159 -15698 8799 20526 -15676
13920 -15676 -30356 -8808 37888 -1491 18761 14380 7228 25217 23870 -28314 -34831 -55264
13908 -55264 -61069 -55518 -8639 -25523 -45671 -28840 -25375 -59932 -60151 -63860 -45390 -58818 -40087
$$ packed form
13993d6281K199r556L786N3778J5100q786o115M793L173p510r84j4311o5557p23
13979g6994p220P408J2370m725J0952P4440L759L1630j1917j15820l4815J8118
13967i2814L6236K2917Q858L4693J7103m27j2557l5718J7544M9362O484j7308
13955C4373o010j0590K5572j3486l2187k3068P624J3509k7500m0161k6621p886
13943a06431N7804L7014J0599l2864k0795K0215K5468k6787j2981K6467K5240
13932B949O657J3684k5677k9580k4788J6824K1302r530J2461K4497J1727l6202
13920a5676j4680K1548M6696l9379K0252m381p152J7989j347n2184o517k0433
13908e5264n805N551M6879j6884k0148J6831L465l4557k19l709J8470j3428J8731
$$ plain form
13895 -40087 -39873 -94822 -95337 -67021 -24543 29636 38743 58034 80905 61080 16428 16603 66759
13882 66759 80632 29202 34000 5660 15517 16165 58589 63842 38314 21869 57487 27416 -865
13869 -865 788 -25111 -12254 42590 23263 -43065 -46703 -20792 -13406 478 -7229 24916 40665
13856 40665 39359 14295 30058 41639 10434 -8725 -22994 -8533 -49840 -78723 -36326 -23851
13844 -23851 -32324 -11376 -14990 13623 17241 -3128 -14546 -30114 -25930 -37590 3701 26761
13832 26761 28294 26489 24441 -15640 -24263 -43203 -79723 -65017 -33065 12628 13899 -40451 -37222
13819 -37222 6531 37351 58276 28991 62691 53161 -11118 -16559 -2211 -2184 -16381 -31498 -32574
13806 -32574 -8811 30556 8134 -6479 -2486 46904 24096 -4183 17459 -4784 27054 34677
$$ packed form
13895d0087K14n4949n15K8316M2478N4179R107J9291K2871j9825m4652J75N0156
13882F6759J3873n1430M798k8340R857O48M2424N253k5528j6445L5618l0071k8281
13869h65J653k5899J2857N4844j9327o6328l638K5911P386J3884p707L2145J5749
13856D0665j306k5064J5763J1581l1205j9159j4269J4461m1307k8883M2397J2475
13844b3851q473K0948l614K8613L618k0369j1418j5568M184j1660M1291K3060
13832B6761J533j805k048m0081q623j8940l6520J4706L1952M5693J271n4350L229
13819c7222M3753L0820K0925k9285L3700r530o4279n441J4348K7j4197j5117j076
13806c2574K3763L9367k2422j4613L993M9390k2808k8279K1642k2243L1838P623
$$ plain form
13794 34677 -39205 -75666 -73814 -79323 -40173 -39211 -32318 -6327 12239 25475 34049 29583 6323
13781 6323 8707 -12802 -21544 5112 -15650 -63528 -111443 -101815 -84192 -70144 -47307 -14775
13769 -14775 -14418 -7852 -6799 -6250 856 17020 29306 -8187 -28693 -14735 13734 34983 3606
13756 3606 4581 49712 87721 82469 50125 48840 52193 12429 4275 11012 17010 22573 45055 27819
13742 27819 24679 45943 30460 15832 -18103 9230 32394 41751 32914 37620 22625 -29414
13730 -29414 -29578 -15186 18928 22792 26250 21016 -19988 -56716 -50820 -3248 -20716 -3481 37435
13717 37435 33972 36391 13000 30969 34160 34202 28434 73830 81204 39449 3869 20575 46104
13704 46104 20257 22178 49452 39961 21054 11884 -45725 -54334 -66319 -58008 -26652 18958 53921
$$ packed form
13794C4677p3882l6461J852n509L9150R62O893K5991J8566J3236Q574m466k3260
13781F323K384k1509q742K6656k0762m7878m7915R628J7623J4048K2837L2532
13769a4775L57O566J053N49P106J6164J2286l7493k0506J3958K8469K1249l1377
13756C606R75M5131L8009n252l2344j285L353l9764q154O737N998N563K2482j7236
13742B7819l140K1264j5483j4628l3935K7333K3164R357q837M706j4995n2039
13730b9414j64J4392L4114L864L458n234m1004l6728N896M7572j7468J7235M0916
13717C7435l463K419k3391J7969L191M2n768M5396P374m1755l5580J6706K5529
13704D6104k5847J921K7274r491j8907r170n7609q609j1985Q311L1356M5610L4963
$$ plain form
13691 53921 39510 30975 11190 7593 -50575 -13120 40152 30378 -30503 -36440 -13458 -19887 -24916
13678 -24916 -28330 -23586 -14587 -55508 -67737 -36396 -11614 -55797 -57930 -20371 -23633 -38210 -45271
13665 -45271 -13576 5016 24132 18111 24913 52551 36619 49168 59197 51650 17578 739
13653 739 -2680 8884 -10911 21919 6306 -11648 3992 16818 22127 17522 5754 -5896 29032
13640 29032 59612 23122 18638 8764 18984 2556 -27088 -13844 4602 -14892 20021 21527
13628 21527 -1701 -33693 -19910 -13219 -6672 11186 20971 65355 48289 26040 -19277 -31191
13616 -31191 -24478 -23418 -25561 -9913 17251 -5879 39973 45942 39239 15382 -25106 -42278 -33157
13603 -33157 -3254 12317 -54691 -60537 -29503 -28444 -8335 9713 -42781 -49616 -35183 -37213
$$ packed form
13691E3921j4411q535j9785l597n8168L7455N3272r774o0881n937K2982o429n029
13678b4916l414M744Q999m0921j2229L1341K4782m4183k133L7559l262j4577p061
13665d5271L1695J8592J9116o021O802K7638j5932J2549J0029p547l4072j6839
13653G39l419J1564j9795L2830j5613j7954J5640J2826N309m605j1768j1650L4928
13640B9032L0580l6490m484r874J0220j6428k9644J3244J8446j9494L4913J506
13628B1527k3228l1992J3783O691O547J7858R785M4384j7066k2249m5317j1914
13616c1191O713J060k143J5648K7164k3130M5852N969o703k3857m0488j7172R121
13603c3157K9903J5571o7008n846L1034J059K0109J8048n2494o835J4433k030
$$ plain form
13591 -37213 -41861 7234 24220 285 -22569 -24762 6831 21538 24531 23595 35892 -528 -52558
13578 -52558 -29028 -29653 -17435 55459 63997 28440 3387 29481 51211 7985 27072 48963
13566 48963 20145 -6287 -34214 -75877 -74719 -65566 -42249 641 34191 40238 1831 -30034
13554 -30034 11637 21389 -11392 11460 23376 26119 7969 -19568 17646 40880 54423 47329
13542 47329 10788 35456 7909 9288 15855 26444 31977 23602 -12456 -57734 -54522 3004 46200
13529 46200 67202 72342 84517 79598 70278 56771 61600 79078 89405 75247 93414 102606 81148
13516 81148 90096 100295 126125 164127 172031 160001 166401 191589 134647 95914 87956 80992 80425
13503 80425 87249 51735 5831 20549 37528 -13224 -7857 11874 21861 32191 24510 38996
$$ packed form
13591c7213m648M9095J6986k3935k2854k193L1593J4707K993r36J2297l6420n2030
13578e2558K3530o25J2218P2894Q538l5557k5053K6094K1730m3226J9087K1891
13566D8963k8818k6432k7927m1663J158R153K3317M2890L3550O047l8407l1865
13554c0034M1671R752l2781K2852J1916K743j8150k7537L7214K3234J3543p094
13542D7329l6541K4668k7547J379O567J0589N533q375l6058m5278L212N7526M3196
13529D6200K1002N140J2175m919r320j3507M829J7478J0327j4158J8167R192k1458
13516H1148Q948J0199K5830L8002P904j2030O400K5188n6942l8733p958o964n67
13503H0425O824l5514m5904J4718J6979n0752N367J9731R987J0330p681J4486
$$ plain form
13491 38996 21918 -12992 -1765 -34887 -23190 -6181 -54446 -66856 -46792 -11183 -34086 -53864
13479 -53864 -35353 5340 7739 -7971 -258 22050 38517 35726 2923 367 19531 -14896
13467 -14896 -25621 -40955 -10348 16531 -17457 -12884 14234 11641 5171 -2351 -33230 -4454
13455 -4454 26699 33788 21209 1947 -14998 16578 6076 36320 48090 -9719 -22338 -3955
13443 -3955 26969 54737 -14474 -55303 -54248 -16450 -25818 -16625 -20386 795 25562 50129 17162
13430 17162 -42901 -44082 -11748 -46371 -34149 -12488 -20087 -24913 7393 7169 32858 50309 37674
13417 37674 21169 -8802 -43513 -16469 28100 23096 -13545 -57546 -40798 10398 23501 -9934
13405 -9934 27236 78250 79379 18509 -37504 -33536 24523 65669 46310 55900 41489 18988
$$ packed form
13491C8996j7078l4910J1227l3122J1697J7009m8265j2410K0064L5609k2903j9778
13479e3864J8511M0693K399j5710P713K2308J6467k791l2803k556J9164l4427
13467a4896j0725j5334L0607K6879l3988M573K7118k593o470p522l0879K8776
13455d454L1153P089j2579j9262j6945L1576j0502L0244J1770n7809j2619J8383
13443c955L0924K7768o9211m0829J055L7798r368R193l761K1181K4767K4567l2967
13430A7162o0063j181L2334l4623J2222K1661p599m826L2306k24K5689J7451j2635
13417C7674j6505k9971l4711K7044M4569n004l6641m4001J6748N1196J3103l3435
13405i934L7170N1014J129o0870n6013L968N8059M1146j9359R590j4411k2501
$$ plain form
13393 18988 -50351 -53057 11779 -3508 -6372 13193 11629 21681 7626 25138 4944 -6536
13381 -6536 -20219 -42824 -57393 -61343 -23287 -15256 -4654 -1443 16468 -24497 -39965 -53953
13369 -53953 -48693 -6706 -52744 -53382 -18512 -14272 -18434 -22043 -33377 -28530 -36801 -7454 1355
13356 1355 -13694 -42069 -39696 -36481 -55120 -22446 -10426 -3921 -7263 -23287 -34056 -12634 -2111
13343 -2111 -531 -61503 -56467 -6620 -33793 -74826 -54421 -76258 -69213 -45152 908 -12349
13331 -12349 -54263 -48590 -78937 -73202 -36252 -6544 7330 -32355 -31963 -6840 -1751 742 27854
13318 27854 34735 23341 21729 5071 15321 43498 21495 -7932 -16606 -16114 -24441 -14046 -11612
13305 -11612 -30710 -7484 -18447 -33986 -38389 -23076 -10860 -8508 26329 40128 46361 34426
$$ packed form
13393A8988o9339k706O4836j5287k864J9565j564J0052j4055J7512k0194j1480
13381f536j3683k2605j4569l950L8056Q031J0602L211J7911m0965j5468j3988
13369e3953N260M1987m6038o38L4870M240m162l609j1334M847q271K9347Q809
13356A355j5049k8375K373L215j8639L2674J2020O505l342j6024j0769K1422J0523
13343b111J580o0972N036M9847k7173m1033K0405k1837P045K4061M6060j3257
13331a2349m1914N673l0347N735L6950K9708J3874l9685L92K5123N089K493K7112
13318B7854O881j1394j612j6658J0250K8177k2003k9427q674M92q327J0395K434
13305a1612j9098K3226j0963j5539m403J5313J2216K352L4837J3799O233j1935
$$ plain form
13293 34426 -11873 -52335 -80477 -43026 22909 54802 34980 -23289 -13085 5416 -2385 27335
13281 27335 23526 45193 56041 47092 35990 12006 10430 -7687 -35407 -41829 -14826 24238
13269 24238 45731 19701 -25473 -78506 -49754 -36513 -19505 -17248 17708 1735 -26829 -31014
13257 -31014 -2362 22702 64095 51108 65959 57865 34184 31975 19676 25020 -1003 7697
13245 7697 20212 26779 -853 -54684 -85054 -82447 -59451 -20999 -45915 -62746 -59728 -66412 -19961
13232 -19961 13643 -16462 -51994 -62556 -47513 -49207 -19478 -35030 -33723 -6470 12139 5786
13220 5786 11131 -7106 -10412 27150 88217 100142 45194 25965 17987 11310 13424 -38320 -42804
13207 -42804 -33917 -33380 20659 41024 -27159 -54828 -67689 -20721 -13129 -5392 -1352 -20647 -41339
$$ packed form
13293C4426m6299m0462k8142L7451O5935L1893j9822n8269J0204J8501p801K9720
13281B7335l809K1667J0848q949j1102k3984j576j8117k7720o422K7003L9064
13269B4238K1493k6030m5174n3033K8752J3241J7008K257L4956j5973k8564m185
13257c1014K8652K5064M1393j2987J4851q094k3681k209j2299N344k6023Q700
13245G697J2515O567k7632n3831l0370K607K2996L8452k4916j6831L018o684M6451
13232a9961L3604l0105l5532j0562J5043j694K9729j5552J307K7253J8609o353
13220E786N345j8237l306L7562O1067J1925n4948j9229p978o677K114n1744m484
13207d2804Q887N37N4039K0365o8183k7669j2861M6968P592P737M040j9295k0692
$$ plain form
13194 -41339 -31797 -41749 -45396 -71757 -25931 45795 23558 -29749 -62513 -54580 -31243 14378
13182 14378 36950 15635 -20307 -27461 -24956 -38749 -29175 -18052 -24358 -20572 -37704 -50408 -19275
13169 -19275 12121 1472 -4746 -10192 -18540 8181 9504 -33394 -47782 -33754 -15409 -29355
13157 -29355 -23303 -34717 -22027 780 -23949 10297 19511 18531 29553 59053 4548 -26457
13145 -26457 -22061 -5197 20391 -28654 -28265 -12474 -14186 -4536 50627 53594 37566 47221 45737
13132 45737 36671 33784 22960 4550 -23138 17077 23694 -6018 -3669 17269 52170 2236
13120 2236 -11801 18443 33365 -591 -47364 -29693 -12229 -23788 -7121 38005 42663 12073
13108 12073 -3699 9197 -16841 -24087 -11361 -11467 -47070 -86046 -49828 -9100 13469 56558
$$ packed form
13194d1339R542r952l647k6361M5826P1726k2237n3307l2764P933K3337M5621
13182A4378K2572k1315l5942p154K505j3793R574J1123o306L786j7132j2704L1133
13169a9275L1396j0649o218n446q348K6721J323m2898j4388J4028J8345j3946
13157b9355O052j1414J2690K2807k4729L4246R214r80J1022K9500n4505l1005
13145b6457M396J6864K5588m9045L89J5791j712R650N5163K967j6028R655j484
13132D5737r066k887j0824j8410k7688M0215O617k9712K349K0938L4901m9934
13120B236j4037L0244J4922l3956m6773J7671J7464j1559J6667M5126M658l0590
13108A2073j5772J2896k6038p246J2726j06l5603l8976L6218M0728K2569M3089
$$ plain form
13096 56558 66765 12770 -26026 -70827 -48152 -9892 42407 46883 11687 9638 699 -39477
13084 -39477 -14280 31223 35902 8399 30582 60590 41311 33131 12127 -64657 -82069 -93626
13072 -93626 -68301 -29422 -17191 -57176 -30930 -10039 -45125 -45178 -16340 -17906 39023 88114
13060 88114 82609 65276 46863 35776 30436 21831 -8407 -54770 -62554 -70444 -97835 -99019 -51012
13047 -51012 -8409 -19091 -27247 -15266 -15736 -396 27560 7557 10729 22905 8312 -11669
13035 -11669 -7734 -5871 -26669 -69491 -22290 7872 27642 37859 57195 36095 41677 37936
13023 37936 4577 4475 34224 53926 70872 45284 2320 -5635 -12374 8200 21815 33363
13011 33363 77198 93901 71639 40131 27938 37519 39131 55435 51495 2493 -18844 21170
$$ packed form
13096E6558J0207n3995l8796m4801K2675L8260N2299M476l5196k049q939m0176
13084c9477K5197M5503M679k7503K2183L0008j9279q180k1004p6784j7412j1557
13072i3626K5325L8879J2231l9985K6246K0891l5086n3K8838j566N6929M9091
13060H8114n505j7333j8413j1087n340q605l0238m6363p784p890k7391j184M8007
13047e1012M2603j0682q156J1981m70J5340K7956k0003L172J2176j4593j9981
13035a1669L935J863k0798m2822M7201L0162J9770J0217J9336k1100N582l741
13023C7936l3359j02K9749J9702J6946k5588m2964p955o739K0574J3615J1548
13011C3363M3835J6703k2262l1508j2193R581J612J6304l940m9002k1337M0014
$$ plain form
12999 21170 14572 4125 -24046 -36546 -9369 -4224 33106 54885 13397 -32163 -47224 -31524
12987 -31524 10499 25500 5947 -48536 -91305 -82470 -1336 36471 60752 65415 39726 8286
12975 8286 -17349 -13240 -44969 -60519 -23192 -15707 -43012 -55221 -29482 -7582 -36024 -21950
12963 -21950 13449 42038 39876 11290 -12922 -6237 -28416 -36726 14981 67005 63865 71004 58270
12950 58270 60218 56508 78218 41166 14135 1844 -13135 -18993 10825 -4037 -17281 -55750
12938 -55750 -66258 -20284 2024 280 12090 12735 -18755 -51514 -61237 -16503 13468 19515 14298
12925 14298 25408 21032 -11131 10247 -15671 -55745 -82190 -40979 -22377 -26269 -40345 -32128
12913 -32128 -44694 -26193 4796 19192 60949 75593 88950 88231 71537 43125 17656 -31173
$$ packed form
12999B1170o598j0447k8171j2500K7177N145L7330K1779m1488m5560j5061J5700
12987c1524M2023J5001j9553n4483m2769Q835Q1134L7807K4281M663k5689l1440
12975H286k5635M109l1729j5550L7327P485k7305j2209K5739K1900k8442J4074
12963b1950L5399K8589k162k8586k4212O685k2179q310N1707N2024l140P139j2734
12950E8270J948l710K1710l7052k7031j2291j4979n858K9818j4862j3244l8469
12938e5750j0508M5974K2308j744J1810O45l1490l2759r723M4734K9971O047n217
12925A4298J1110m376l2163K1378k5918m0074k6445M1211J8602l892j4076Q217
12913c2128j2566J8501L0989J4396M1757J4644J3357p19j6694k8412k5469m8829
$$ plain form
12901 -31173 -67444 -45406 -36558 -27298 -30225 -49133 -50968 -39658 -14568 -28200 -21852 -12103 -41225
12888 -41225 -51837 -55695 -6520 13470 30777 37144 1368 -709 27128 18516 -31091 -52693
12876 -52693 -54797 -22168 -12031 -17897 -4246 -19840 -14553 -42311 -34324 -31355 -40644 -57242 -57557
12863 -57557 -39359 -3490 33755 48567 38897 44317 3871 3632 20415 39712 4867 -7553
12851 -7553 -18936 14055 62771 46514 22653 -3472 -20663 -4682 320 -25570 -7727 -8849
12839 -8849 2994 3007 2365 6924 30847 30149 36303 23249 16858 23364 32582 45517 74002 42249
12825 42249 19185 12556 15782 19017 24943 -16606 -43211 -12302 29170 -3149 -56113 -44558
12813 -44558 5281 44758 45877 34020 36205 35056 36750 1364 -2307 -33436 -74539 -38877 -36090
$$ packed form
12901c1173l6271K2038Q848R260k927j8908j835J1310K5090j3632O348R749k9122
12888d1225j0612l858M9175J9990J7307O367l5776k077K7837q612m9607k1602
12876e2693k104L2629J0137n866J3651j5594N287k7758P987K969r289j6598l15
12863e7557J8198L5869L7245J4812r670N420m0446k39J6783J9297l4845j2420
12851g553j1383L2991M8716j6257k3861k6125j7191J5981N002k5890J7843j122
12839h849J1843J3o42M559K3923o98O154j3054o391O506R218J2935K8485l1753
12825D2249k3064o629L226L235N926m1549k6605L0909M1472l2319n2964J1555
12813d4558M9839L9477J119j1857K185j149J694l5386l671l1129m1103L5662K787
$$ plain form
12800 -36090 -24140 -51819 -68890 -51809 -40895 -29894 -20882 -40251 -52625 -57366 -22807 -28610
12788 -28610 -12069 3007 -5616 -41963 -27256 7790 30974 53420 14455 8138 11853 1292
12776 1292 36901 28604 18614 15563 26131 7118 24431 11873 33591 53420 60372 50811 37139
12763 37139 -16189 188 35690 6836 14197 21152 15932 -13350 -19630 7676 54857 39990
12751 39990 41961 -7125 -21526 4413 30076 21151 36449 49784 53032 32703 7916 16846
12739 16846 39637 -1676 -112655 -121693 -87273 -41504 -42278 -12902 -14168 -62115 -29678 15774
12727 15774 -2761 -14875 -10304 -21021 -9815 1004 5873 -1911 529 42548 351 -18045
12715 -18045 6469 30095 16172 -30084 -2617 9463 -30410 -68294 -50332 -36215 -24335 -28277
$$ packed form
12800c6090J1950k7679j7071J7081J0914J1001R012j9369j2374m741L4559n803
12788b8610J6541J5076q623l6347J4707L5046K3184K2446l8965o317L715j0561
12776A292L5609q297r990l051J0568j9013J7313j2558K1718J9829O952r561j3672
12763C7139n3328J6377L5502k8854P361O955n220k9282o280K7306M7181j4867
12751C9990J971m9086j4401K5939K5663q925J5298J3335L248k0329k4787Q930
12739A6846K2791m1313j10979r038L4420M5769p74K9376j266m7947L2437M5452
12727A5774j8535j2114M571j0717J1206J0819M869p784K440M2019m2197j8396
12715a8045K4514K3626j3923m6256K7467J2080l9873l7884J7962J4117J1880l942
$$ plain form
12703 -28277 -42535 -36925 -26240 -30443 -46753 -904 3952 64898 80758 18911 -10433 -61608
12691 -61608 -78241 -34883 -5288 -16222 -55585 -1047 40203 10964 -956 20572 -20311 -41112
12679 -41112 -51636 -48421 12103 -2289 -20761 -42512 -88559 -98848 -28963 13304 -3249 -10563
12667 -10563 -14595 18872 53714 83537 58075 20128 31119 21389 39433 32002 -18744 -22890
12655 -22890 -32930 -45464 -39759 -3852 30945 6317 -21824 -34445 -47771 -57123 -20591 30287
12643 30287 -9891 -18911 -39834 -23731 -9191 -9956 -24948 -22446 6734 -2178 -12036 -13861 -17475
12630 -17475 -12476 -52649 -50549 -56266 -29930 4787 36557 14107 17908 17788 30504 3433 -9733
12617 -9733 -8263 -21166 12205 38042 26579 -978 -15673 -15280 -5874 14949 14002 -29711 -46807
$$ packed form
12703b8277j4258N610J0685m203j6310M5849M856O0946J5860o1847k9344n1175
12691f1608j6633M3358K9595j0934l9363N4538M1250k9239j1920K1528m0883k0801
12679d1112j0524L215O0524j4392j8472k1751m6047j0289O9885M2267j6553p314
12667a0563m032L3467L4842K9823k5462l7947J0991r730J8044p431n0746m146
12655b2890j0040j2534N705L5907L4797k4628k8141j2621j3326r352L6532N0878
12643C0287m0178r020k0923J6103J4540p65j4992K502K9180q912r858j825l614
12630a7475M999m0173K100n717K6336L4717L1770k2450L801j20J2716k7071j3166
12617i733J470j2903L3371K5837j1463k7557j4695L93R406K0823r47m3713j7096
$$ plain form
12604 -46807 -34978 -11713 3097 668 -4831 -10100 4678 3346 42760 31577 -5184 7811
12592 7811 21430 557 15309 26725 12935 4388 3929 22787 18603 -29941 -61423 -68027 -62497
12579 -62497 -54044 -41489 -30151 5453 60107 88970 31449 7823 3883 71204 117278 98267
12567 98267 41943 40053 34662 2596 -34604 -29571 -20030 -31962 -6060 5675 3379 -965 10834
12554 10834 41527 23323 15040 8594 17563 40209 59428 43727 59215 67937 60664 30664 60928
12541 60928 41030 29460 -8610 23874 46988 21138 -19531 -78795 -63241 -10968 13813 2648
12529 2648 -10460 -21735 -20390 -20352 17245 35630 27721 40712 38508 -10618 -9723 14171 2714
12516 2714 19406 -3807 -23553 -51992 -25405 -6777 3925 -5388 -42780 -54240 -17426 10183
$$ packed form
12604d6807J1829K3265J4810k429n499n269J4778j332L9414j1183l6761J2995
12592G811J3619k0873J4752J1416j3790q547m59J8858m184m8544l1482o604N530
12579f2497Q453J2555J1338L5604N4654K8863n7521k3626l940O7321M6074j9011
12567I8267n6324j890n391l2066l7200N033R541j1932K5902J1735k296m344J1799
12554A0834L0693j8204q283o446Q969K2646J9219j5701J5488Q722p273l0000L0264
12541F0928j9898j1570l8070L2484K3114k5850m0669n9264J5554N2273K4781j1165
12529B648j3108j1275J345L8L7597J8385p909J2991k204m9126Q95K3894j1457
12516B714J6692k3213j9746k8439K6587J8628J0702r313l7392j1460L6814K7609
$$ plain form
12504 10183 29175 49562 28314 25611 636 -44740 -22088 -46637 -43674 -7835 -23073 -10973
12492 -10973 13655 13786 -10449 8394 16886 -22120 -33150 -4242 10664 -41464 -80660 -67461
12480 -67461 -38390 -14212 -4714 -17509 -73314 -96344 -51880 -50416 -39314 -24989 -10337 -12058
12468 -12058 -6466 -26570 -1502 -14646 -17018 -17262 -27800 -48414 -55372 -28330 -42337 -24985 -13088
12455 -13088 -32958 -68882 -59590 -19754 -13585 -45775 -44254 -7262 28066 32694 -7570 -74109
12443 -74109 -105810 -64138 -32771 -5192 3761 44624 21196 11797 3484 5562 16497 -2353
12431 -2353 -34889 -47794 -84772 -81825 -45415 -61488 -38457 -15603 31885 6937 -23375 -25062
12419 -25062 -23790 -31813 -48482 -53640 11809 21643 -66333 -77274 -56985 -41528 -40920 -35956 -32982
$$ packed form
12504A0183J8992K0387k1248k703k4975m5376K2652k4549K963L5839j5238J2100
12492a0973K4628J31k4235J8843Q492l9006j1030K8908J4906n2128l9196J3199
12480f7461K9071K4178R498j2795n5805k3030M4464J464J1102J4325J4652j721
12468a2058N592k0104K5068j3144k372k44j0538k0614o958K7042j4007J7352J1897
12455a3088j9870l5924R292L9836O169l2190J521L6992L5328M628m0264o6539
12443g4109l1701M1672L1367K7579Q953M0863k3428r399q313K078J0935j8850
12431b353l2536j2905l6978K947L6410j6073K3031K2854M7488k4948l0312j687
12419b5062J272q023j6669n158O5449R834q7976j0941K0289J5457O08M964K974
$$ plain form
12406 -32982 -58107 -30410 10845 32259 27973 16432 4765 -4862 -7441 -5841 -17155 -16724 -40017
12393 -40017 -58926 -23728 25354 51686 67103 54669 7268 -30113 -53290 -28064 -33603 -50481
12381 -50481 -41562 -66152 -53150 -30026 -4219 43669 -7522 -34264 -10340 11660 32190 46190
12369 46190 25343 -991 14483 45749 58647 72421 28884 -24617 -5572 9450 22244 -18588
12357 -18588 8521 -7533 -37867 -35369 -23510 -18144 -32767 16589 1655 2487 22825 58610
12345 58610 62152 34098 6231 10961 6782 -36836 -8627 -14663 -24858 -14385 -33916 -22106
12333 -22106 -999 -13336 -44224 -59370 -116736 -109926 -68466 -22382 -10993 -5428 15000 15373
12321 15373 -12344 -48474 -41475 -36477 -26935 7725 -2498 -27353 -32346 -54280 -58341 -28975 -25003
$$ packed form
12406c2982k5125K7697M1255K1414m286j1541j1667r627k579J600j1314M31k3293
12393d0017j8909L5198M9082K6332J5417j2434m7401l7381k3177K5226n539j6878
12381e0481Q919k4590J3002K3124K5807M7888n1191k6742K3924K2000K0530J4000
12369D6190k0847k6334J5474L1266J2898J3774m3537n3501J9045J5022J2794m0832
12357a8588K7109j6054l0334K498J1859N366j4623M9356j4934Q32K0338L5785
12345E8610L542k8054k7867M730m179m3618K8209o036j0195J0473j9531J1810
12333b2106K1107j2337l0888j5146n7366O810M1460M6084J1389N565K0428L73
12321A5373k7717l6130O999M998R542L4660j0223k4855m993k1934m061K9366L972
$$ plain form
12308 -25003 -6189 38493 71410 88308 46133 23449 -12632 -3725 -19251 -13324 7938 28747
12296 28747 60719 71672 52102 20123 -16261 -21163 -22287 4853 32046 93308 78325 30084
12284 30084 -7468 4565 -17092 -36455 -14555 -3364 6971 -4650 16459 28398 -9569 -21512
12272 -21512 5709 33796 35126 52005 25195 -20361 -6409 -20577 -41508 -70816 -76565 -35880
12260 -35880 14958 11448 -9104 -1446 -9702 -819 12005 17130 49489 67697 70338 82000 75849
12247 75849 48142 68818 107777 87956 57297 33841 7651 14827 30013 -1677 -4990 -21800
12235 -21800 1974 37262 23612 -7487 -36520 -31640 -8842 -9770 7191 4601 9893 -27325 -71562
12222 -71562 -71077 2124 59984 95159 73283 27410 41918 76603 79444 40258 50467 52650
$$ packed form
12308b5003J8814M4682L2917J6898m2175k2684l6081Q907j5526N927K1262K0809
12296B8747L1972J0953j9570l1979l6384m902j124K7140K7193O1262j4983m8241
12284C0084l7552J2033k1657j9363K1900J1191J0335j1621K1109J1939l7967j1943
12272b1512K7221K8087J330J6879k6810m5556J3952j4168k0931k9308n749M0685
12260c5880N0838l510k0552P658q256Q883J2824N125L2359J8208K641J1662o151
12247G5849k7707K0676L8959j9821l0659k3456k6190P176J5186l1690l313j6810
12235b1800K3774L5288j3650l1099k9033M880K2798r28J6961k590N292l7218m4237
12222g1562M85P3201N7860L5175k1876m5873J4508L4685K841l9186J0209K183
$$ plain form
12210 52650 21128 17897 28046 10984 7372 -13553 -56332 -50230 -28052 -56006 -96323 -111540
12198 -111540 -48280 -127 23151 -33126 -71600 -60354 6257 13701 14979 30531 -14122 -27007
12186 -27007 -18310 -1836 -13474 -7174 33353 46927 15096 -30240 1912 47072 34332 47646
12174 47646 -847 -42386 -27167 -25635 -6478 -4498 1671 5944 7576 35440 -3169 -21371 -48661
12161 -48661 -52889 -62773 -61834 -60141 -49671 -25477 -7705 -4582 -26244 -87892 -90394 -63591 -61082
12148 -61082 -11937 13277 -12532 -27817 -62957 -56524 -7370 24625 34717 28680 22652 19872
12136 19872 30080 6158 -4023 16616 9413 23836 -11539 24006 51001 71634 83856 91830
12124 91830 78416 67435 44494 -550 2263 37411 66627 69624 92778 136472 152425 138265
$$ packed form
12210E2650l1522l231J0149j7062l612k0925m2779O102K2178k7954m0317j5217
12198a11540O3260M8153K3278n6277l8474J1246O6611P444J278J5552m4653j2885
12186b7007Q697J6474j1638O300M0527J3574l1831m5336L2152M5160j2740J3314
12174D7646m8493m1539J5219J532J9157J980O169M273J632K7864l8609j8202k7290
12161d8661m228r884R39J693J0470K4194J7772L123k1662o1648k502K6803K509
12148f1082M9145K5214k5809j5285l5140O433M9154L1995J0092o037o028k780
12136A9872J0208k3922j0181K0639p203J4423l5375L5545K6995K0633J2222P974
12124I1830j3414j0981k2941m5044K813L5148K9216K997K3154M3694J5953j4160
$$ plain form
12112 138265 162940 197589 227161 289130 308646 271980 233972 195943 175562 139803 103323
12101 103323 53939 51036 81888 78285 22173 18327 67430 86985 93281 76406 77902 57691
12089 57691 31270 23647 32968 12140 -18001 -41211 -18911 4175 21808 31466 47330 49959
12077 49959 46555 39275 21332 8224 30702 53460 35169 -2257 5818 -18367 -46165 -18919
12065 -18919 -10420 15738 31649 35130 36075 15304 -8757 -28119 -39073 -38389 8625 21058 -28230
12052 -28230 -34915 -46064 -15625 10442 18051 30940 46629 28168 13509 26843 18899 -11936
12040 -11936 -950 47876 49923 13953 -24919 -42506 -53561 -38143 -38768 -29379 -27272 -49244 -15685
12027 -15685 -8624 2430 19347 21888 -32312 -58205 -32739 -13013 -6152 12809 18317 33259
$$ packed form
12112A38265K4675L4649K9572O1969J9516l6666l8008l8029k0381l5759l6480
12101A03323m9384k903L0852l603n6112l846M9103J9555O296j6875J496k0211
12089E7691k6421p623R321k0828l0141k3210K2300K3086J7633R658J5864K629
12077D9959l404p280j7943j3108K2478K2758j8291l7426Q075k4185k7798K7246
12065a8919Q499K6158J5911L481R45k0771k4061j9362j0954O84M7014J2433m9288
12052b8230o685j1149L0439K6067P609J2889J5689j8461j4659J3334p944l0835
12040a1936J0986M8826K047l5970l8872j7587j1055J5418o25R389K107k1972L3559
12027a5685P061J1054J6917K541n4200k5893K5466J9726O861J8961N508J4942
$$ plain form
12015 33259 50417 14491 2689 -10042 -8409 -13462 21507 55907 58711 56970 8154 -21595
12003 -21595 -14032 41469 62637 -17485 -50090 -37281 4439 16403 25040 27382 58374 31361
11991 31361 26224 4280 -41346 -38033 -32436 -24875 -1971 15686 9448 2086 7466 -16374 -9189
11978 -9189 -28042 -37004 -29052 -39746 -55036 -22307 -12753 -3080 16403 24364 23164 34549 35842
11965 35842 12318 -8557 -44260 -55617 -20122 -7355 23214 55013 67789 55229 25477 8956
11953 8956 11950 30917 46780 63849 37987 -6815 -17529 -27987 -31010 -37462 -72014 -87224
11941 -87224 -97552 -116354 -84977 -80690 -81557 -53124 -4680 -20967 -27103 2841 16305 -329
11929 -329 20736 40819 27812 -8031 -30228 -22080 -26577 -35145 -17837 30018 4092 -8130 6040
$$ packed form
12015C3259J7158l5926j1802j2731J633n053L4969L4400K804j741m8816k9749
12003b1595P563N5501K1168q0122l2605J2809M1720J1964Q637K342L0992k7013
11991C1361n137k1944m5626L313N597P561K2904J7657o238p362N380k3840P185
11978i189j8853q962P952j0694j5290L2729R554R673J9483P961j200J1385J293
11965C5842k3524k0875l5703j1357L5495J2767L0569L1799J2776j2560k9752j6521
11953H956K994J8967J5863J7069k5862m4802j0714j0458l023o452l4552j5210
11941h7224j0328j8802L1377M287q67K8433M8444j6287o136K9944J3464j6634
11929c29K1065K0083j3007l5843k2197Q148m497q568J7308M7855k5926j2222J4170
$$ plain form
11916 6040 18250 1359 1340 9301 3143 33057 38764 46408 15585 -17213 -7682 -29951 -61386
11903 -61386 -41546 9506 23530 17689 -26141 -43173 -54899 -37487 -12389 -11349 -70131 -85186
11891 -85186 -63689 -10627 1925 1574 13085 43816 64492 11160 6087 -2051 -11197 5144 5997
11878 5997 2323 29066 59586 29051 -13910 -6254 50855 29729 -3543 3990 1617 10895 -19769
11865 -19769 -1920 6807 -27478 -46557 -20505 23060 33352 37399 11865 8100 -5180 -9790
11853 -9790 -3631 -34118 -43196 -60010 -75487 -74003 -53820 -41966 -32371 -3637 -6087 3206 15134
11840 15134 -18043 -7713 -22682 -80495 -52672 -29261 -4121 33610 73015 79120 60812 76933
11828 76933 54259 18225 24148 -35337 -56226 -34537 -6027 -6774 -5964 -21012 -26116 7893 32297
$$ packed form
11916F040J2210j6891j9P961o158K9914N707P644l0823l2798R531k2269l1435
11903f1386J9840N1052J4024n841m3830j7032j1726J7412K5098J040n8782j5055
11891h5186K1497N3062J2552l51J1511L0731K0676n3332n073q138r146J6341Q53
11878E997l674K6743L0520l0535m2961P656N7109k1126l3272P533k373R278l0664
11865a9769J7849Q727l4285j9079K6052M3565J0292M047k5534l765j3280m610
11853i790O159l0487r078j6814j5477J484K0183J1854R595K8734k450R293J1928
11840A5134l3177J0330j4969n7813K7823K3411K5140L7731L9405O105j8308J6121
11828G6933k2674l6034N923n9485k0889K1689K8510p47Q10j5048n104L4009K4404
$$ plain form
11815 32297 24545 -5656 5056 -20842 -38376 -34517 -15987 -5157 -7625 4121 9689 -15202
11803 -15202 -9147 -22467 -22682 13925 20496 30526 20373 29926 62491 18975 -8704 -49824 -57366
11790 -57366 -18388 -27975 -48842 -41436 -40279 -77235 -73456 -49924 -46461 -23089 -6228 18157 -12790
11777 -12790 -20016 -33678 -9450 -12377 1469 316 -46888 -37174 -53698 -20251 -7461 -41748
11765 -41748 -25645 21188 31976 3058 7395 45068 60303 56285 6707 6447 25061 44258
11753 44258 15887 -4195 23804 67335 74784 50733 26456 23583 15998 49053 27416 39168
11741 39168 24210 -6923 -17943 -41150 -53983 -43535 -37195 -44219 -24347 -517 -39704 -70218
11729 -70218 -63130 -43566 -30926 -17261 -27914 -1114 33199 24187 23131 67055 29390 -26574
$$ packed form
11815C2297p752l0201J0712k5898j7534L859J8530J0830k468J1746N568k4891
11803a5202O055j3320k15L6607O571J0030j0153R553L2565m3516k7679m1120p542
11790e7366L8978r587k0867P406J157l6956L779K3532L463K3372J6861K4385l0947
11777a2790p226j3662K4228k927J3846j153m7204R714j6524L3447J2790l4287
11765d1748J6103M6833J0788k8918M337L7673J5235m018m9578k60J8614J9197
11753D4258k8371k0082K7999M3531P449k4051k4277k873p585L3055k1637J1752
11741C9168j4958l1133j1020k3207j2833J0448O340p024J9872K3830l9187l0514
11729g0218P088J9564J2640J3665j0653K6800L4313r012j056M3924l7665n5964
$$ plain form
11717 -26574 -38729 -69481 -70066 -24209 27722 48313 69481 812 -57958 -27712 -12757 -14150
11705 -14150 -53152 -48475 -28225 6818 14969 10440 -19347 36605 49317 12370 19384 7838
11693 7838 -22826 -40113 -43585 -39784 713 13320 35346 43933 2725 11623 27913 43879 47586
11680 47586 79552 68533 60557 77464 82364 74272 81475 100374 73076 11573 34002 44325
11668 44325 14379 -27975 -4345 7873 28046 44223 36773 54726 83155 66313 46007 43418
11656 43418 49859 45910 30727 46073 43541 19854 -18751 -7236 -35153 -46949 -11919 6232
11644 6232 34688 24640 12764 19533 -5446 3369 31365 86571 60487 34718 31977 20700
11632 20700 27572 7248 10469 35756 57460 61391 15982 37190 37590 -7310 -21589 -57821 -84721
$$ packed form
11717b6574j2155l0752n85M5857N1931K0591K1168o8669n8770L0246J4955j393
11705a4150l9002M677K0250L5043Q151m529k9787N5952J2712l6947P014j1546
11693G838l0664j7287l472L801M0497J2607K2026Q587m1208Q898J6290J5966L707
11680D7586L1966j1019p976J6907M900q092P203J8899k7298o1503K2429J0323
11668D4325k9946m2354K3630J2218K0173J6177p450J7953K8429j6842k0306k589
11656D3418O441l949j5183J5346k532k3687l8605J1515k7917j1796L5030J8151
11644F232K8456j0048j1876O769k4979Q815K7996N5206k6084k5769k741j1277
11632B0700O872k0324L221K5287K1704L931m5409K1208M00m4900j4279l6232k6900
$$ plain form
11619 -84721 -65527 -15754 -13498 -23379 -18889 200 -12598 -6035 19894 27658 -546 -30579 -22090
11606 -22090 9863 -15775 28520 64399 35198 -6341 11945 22058 61842 98992 112775 101386
11594 101386 74918 68420 67120 54014 47053 49780 51272 22054 -10571 -17024 -36162 -34886 -23676
11581 -23676 -7637 -11100 -23784 5173 26348 36665 28133 4237 25600 3108 -18004 -307
11569 -307 -15965 -30964 -17978 -2462 -19455 -23996 -40018 -43632 -24961 -31060 -42789 -51476 -84550
11556 -84550 -93689 -62022 -9742 18220 45470 45907 42885 56706 60911 27036 13820 28189 -378
11543 -378 35497 31057 4961 -44335 -60390 -50211 -21843 14505 21593 27801 59676 66901 92719
11530 92719 108225 103801 101891 86152 63768 21689 3409 -25743 -42222 -51885 -39730 -37859
$$ packed form
11619h4721J9194M9773K256r881M490J9089j2798O563K5929P764k8204l0033Q489
11606b2090L1953k5638M4295L5879k9201m1539J8286J0113L9784L7150J3783j1389
11594A01386k6468o498j300j3106o961K727J492k9218l2625o453j9138J276J1210
11581b3676J6039l463j2684K8957K1175J0317q532k3896K1363k2492k1112J7697
11569c07j5658j4999J2986J5516j6993m541j6022l614J8671o099j1729q687l3074
11556h4550r139L1667N2280K7962K7250M37l022J3821M205l3875j3216J4369k8567
11543c78L5875m440k6096m9296j6055J0179K8368L6348P088O208L1875P225K5818
11530I2719J5506m424j910j5739k2384m2079j8280k9152j6479r663J2155J871
$$ plain form
11518 -37859 -49251 -39984 -24484 -16510 -65390 -49667 -5038 -49898 -45746 -19415 -42880 -72275
11506 -72275 -60193 3097 53112 56778 43973 24916 42973 67066 88429 63686 42385 43788
11494 43788 64462 43024 43077 27769 131 15091 5723 -34325 7853 25659 1386 -10085
11482 -10085 -31688 -32992 -9211 -4903 20411 30152 20886 -172 -13325 -11124 23233 30647 47719
11469 47719 37180 22731 47774 64407 111085 101084 72983 56151 62212 85442 83371 64403
11457 64403 46000 21678 39761 51579 42128 21815 -7833 -10130 21396 21925 27190 37650 52314
11444 52314 77850 110140 132415 94944 28649 7514 7520 49037 87910 84051 47675 39615 40775
11431 40775 49760 18369 9662 36579 24486 64276 85730 90181 102538 118224 111021 97202
$$ packed form
11518c7859j1392R267J5500P974m8880J5723M4629m4860M152K6331k3465k9395
11506g2275J2082O3290N0015L666j2805j9057J8057K4093K1363k4743k1301J403
11494D3788K0674k1438N3j5308k7638J4960r368m0048M2178J7806k4273j1471
11482a0085k1603j304K3781M308K5314R741r266k1058j3153K201L4357P414J7072
11469D7719j0539j4449K5043J6633M6678j0001k8101j6832O061K3230k071j8968
11457F4403j8403k4322J8083J1818r451k0313k9648k297L1526N29N265J0460J4664
11444E2314K5536L2290K2275l7471o6295k1135OM1517L8873l859l6376q060J160
11431D0775Q985l1391q707K6917j2093L9790K1454M451J2357J5686p203j3819
$$ plain form
11419 97202 62417 59862 39259 -11766 -60033 -53698 -5935 13727 -766 -3477 -553 -2414 14099
11406 14099 82101 133161 104783 66648 81959 106259 79609 89899 76294 82500 96867 92777
11394 92777 103174 78377 74014 93045 122480 81817 79175 91412 63038 60220 45628 54920
11382 54920 70870 90356 75403 104326 171986 236395 251877 270716 359113 479549 617722
11371 617722 816817 1062796 1362877 1683992 1855418 1739330 1492800 1143280 844886 645568
11361 645568 520715 405471 329341 287575 222559 210564 232769 196425 158091 130990 107406
11350 107406 71555 92405 91007 89071 98661 114861 130370 140366 101573 102760 101463 102144 142550
11337 142550 198959 177837 130486 94633 108285 127152 138862 190171 220871 225504 205370 165044
$$ packed form
11419I7202l4785k555k0603n1025m8267O335M7763J9662j4493k711K924j861J6513
11406A4099O8002N1060k8378l8135J5311K4300k6650J0290j3605O206J4367m090
11394I2777J0397k4797m363J9031K9435m0663k642J2237k8374k818j4592R292
11382E4920J5950J9486j4953K8923O7660O4409J5482J8839Q8397J20436J38173
11371F17722J99095K45979L00081L21115J71426j16088k46530l49520k98394j99318
11361F45568j24853j15244p6130m1766o5016j1995K2205l6344l8334k7101k3584
11350A07406l5851K0850j398j936R590J6200J5509R996l8793J187j297O81M0406
11337A42550N6409k1122m7351l5853J3652J8867J1710N1309L0700M633k0134m0326
$$ plain form
11325 165044 224604 291830 248724 235098 208287 192985 161980 178567 172245 208507 250372 255588
11313 255588 270883 280074 282134 259744 303892 270085 233952 213048 211926 184847 179717 223268
11301 223268 261391 257668 231062 197040 146026 141758 119911 69650 69701 136543 163737 163904 153605
11288 153605 133769 140610 155734 116725 96460 65089 76823 114626 91309 122407 101922 60949
11276 60949 68058 82694 86663 74815 70808 49623 56611 78175 70809 66157 32216 4951 -11489
11263 -11489 -6560 2715 -9623 -77814 -67609 -68419 -45898 11348 84420 110134 72883 67786 31678
11250 31678 16524 20183 57366 23504 25774 34321 44574 49448 74461 62122 80063 85446 71487
11237 71487 70335 64301 65403 85818 106462 110366 109530 94246 89564 66748 70288 113306 134021
$$ packed form
11325A65044N9560O7226m3106j3626k6811j5302l1005J6587o322L6262M1865N216
11313B55588J5295R191K060k2390M4148l3807l6133k0904j122k7079n130M3551
11301B23268L8123l723k6606l4022n1014m268k1847n0261N1O6842K7194J67j0299
11288A53605j9836O841J5124l9009k0265l1371J1734L7803k3317L1098k0485m0973
11276F0949P109J4636L969j1848m007k1185O988K1564p366m652l3941k7265j6440
11263a1489M929R275j2338o8191J0205q10K2521N7246P3072K5714l7251n097l6108
11250C1678j5154L659L7183l3862K270Q547J0253M874K5013j2339J7941N383j3959
11237G1487j152o034J102K0415K0644L904q36j5284m682k2816L540M3018K0715
$$ plain form
11224 134021 93186 74541 54854 24493 15425 41990 63486 93271 131300 176831 203272 208310
11212 208310 232598 222755 180848 162568 146350 115766 88165 113862 113797 141443 147254 140505 109264
11199 109264 89397 49319 34650 15403 45412 63949 90181 99761 93518 89766 103351 66151
11187 66151 10576 45211 117326 129200 91655 100086 129491 119815 83079 29696 16484 42988
11175 42988 96013 99965 108945 115595 144723 148837 122510 78008 52469 73107 44501 61327
11163 61327 69720 46449 73779 74061 36741 72454 87224 105132 123582 117731 110071 98350 79155
11150 79155 104939 79579 105240 149705 193116 165436 123806 111287 152851 159109 113095 95307
11138 95307 117170 104412 95186 115696 83821 104386 121224 110280 135313 131150 115809 129948
$$ packed form
11224A34021m0835j8645j9687l0361r068K6565K1496K9785L8029M5531K6441N038
11212B08310K4288r843m1907j8280j6218l0584k7601K5697o5K7646N811o749l1241
11199A09264j9867m0078j4669j9247L0009J8537K6232R580o243l752J3585l7200
11187F6151n5575L4635P2115J1874l7545Q431K9405r676l6736n3383j3212K6504
11175D2988N3025L952Q980O650K9128M114k6327m4502k5539K0638k8606J6826
11163F1327Q393k3271K7330K82l7320L5713J4770J7908J8450n851p660j1721j9195
11150G9155K5784k5360K5661M4465M3411k7680m1630j2519M1564O258m6014j7788
11138I5307K1863j2758r226K0510l1875K0565J6838j0944K5033m163j5341J4139
$$ plain form
11126 129948 154354 208828 226394 239307 219551 207552 231081 215087 219886 255508 280610 291732
11114 291732 265288 287922 312509 301270 297408 258515 267228 222492 217470 269388 266062 290403
11102 290403 268422 216984 217308 250037 295699 313004 310793 296906 299994 316259 336369 362982
11090 362982 367080 360225 330639 330601 254518 204037 153511 174717 202115 212897 210156 199441 181064
11077 181064 188852 191414 195998 202090 215126 242740 234561 267953 268654 238772 179459 147282 174690
11064 174690 240469 313018 320564 299178 311422 325571 340871 322693 315603 356718 426344 450087
11052 450087 473136 486314 520209 567608 555646 576989 595694 590851 587509 607624 603960 607402
11040 607402 651985 712592 815580 925393 1001296 1090465 1159312 1132283 1096893 1145120 1185493
$$ packed form
11126A29948K4406N4474J7566J2913j9756j1999K3529j5994M799L5622K5102J1122
11114B91732k6444K2634K4587j1239l862l8893Q713m4736n022N1918l326K4341
11102B90403k1981n1438L24L2729M5662J7305k211j3887L088J6265K0110K6613
11090C62982M098o855k9586l8p6083n0481n0526K1206K7398J0782k741j0715j8377
11077A81064P788K562M584O092J3036K7614q179L3392P01k9882n9313l2177K7408
11064A74690O5779P2549P546k1386J2244J4149J5300j8178p090M1115O9626K3743
11052D50087K3049J3178L3895M7399j1962K1343J8705m843l342K0115l664L442
11040F07402M4583O0607J02988J09813P5903Q9169O8847k7029l5390M8227M0373
$$ plain form
11029 1185493 1238202 1311987 1336744 1354966 1363838 1433986 1472523 1451724 1400481 1308402 1237186
11018 1237186 1200563 1246210 1320688 1379583 1448951 1535744 1622085 1680739 1695189 1695384 1678147 1709514
11006 1709514 1732771 1808242 1901669 1998657 2100600 2273680 2441066 2528211 2601095 2699138 2845313
10995 2845313 2975503 3116798 3250842 3450019 3732151 4063744 4445093 4894306 5366782
10986 5366782 5934148 6538754 7312532 8253711 9320364 10285127 11123331 12108914 13406287
10977 13406287 15104379 16992602 18716572 20450488 22416248 25038962 28495481 32978414
10969 32978414 38910455 47041801 58703287 75692999 100621577 137129558 189077361
10962 189077361 256166106 327965563 376263632 361253705 305275607 232499979 169758647
$$ packed form
11029A185493N2709P3785K4757J8222Q872P0148L8537k0799n1243r2079p1216
11018A237186l6623M5647P4478N8895O9368Q6793Q6341N8654J4450J95j7237L1367
11006A709514K3257P5471R3427R6988J01943J73080J67386Q7145P2884R8043J46175
10995B845313J30190J41295J34044J99177K82132L31593L81349M49213M72476
10986E366782N67366O04606P73778R41179J066653R64763Q38204R85583J297373
10977A3406287J698092J888223J723970J733916J965760K622714L456519M482933
10969C2978414N932041Q131346J1661486J6989712K4928578L6507981N1947803
10962A89077361O7088745P1799457M8298069j5009927n5978098p2775628o2741332
$$ plain form
10955 169758647 125358062 94869672 73777511 58945752 48309922 40410089 34357657
10948 34357657 29464548 25292651 21760835 18801431 16436578 14580302 13193066 12137587
10940 12137587 11325429 10696037 10232846 9677210 8896150 8028251 7145286 6401833 5792698
10931 5792698 5307785 4964626 4636479 4323314 4056546 3874723 3667269 3444414 3226003
10922 3226003 3051483 2879276 2713445 2595815 2532774 2446688 2332440 2232396 2156817 2041900
10912 2041900 1964769 1899939 1829018 1781604 1716835 1623093 1573987 1542606 1539679 1492701 1461658
10901 1461658 1439633 1395119 1345131 1265998 1187877 1137879 1120533 1083483 1048531 992345 935299
10890 935299 918219 873343 819646 810044 827527 841971 853553 802082 785787 785239 778164 771539
$$ packed form
10955A69758647m4400585l0488390k1092161j4831759j0635830p899833o052432
10948C4357657m893109m171897l531816k959404k364853j856276j387236j055479
10940A2137587q12158o29392m63191n55636p81060q67899q82965p43453o09135
10931E792698m84913l43159l28147l13165k66768j81823k07454k22855k18411
10922C226003j74520j72207j65831j17630o3041q6086j14248j00044p5579j14917
10912B041900p7131o4830p0921m7414o4769r3742m9106l1381k927m6978l1043
10901A461658k2025m4514m9988p9133p8121m9998j7346l7050l4952n6186n7046
10890I35299j7080m4876n3697r602J7483J4444J1582n1471j6295n48p075o625
$$ plain form
10878 771539 754467 734240 720835 732590 719756 702310 707699 704954 722700 762095 777571 797467
10866 797467 746416 696451 662129 659894 652152 642427 683809 764594 802084 807940 809823 776375
10854 776375 753690 749078 755575 767030 813097 840893 845281 853851 811272 731000 640258 590043
10842 590043 585367 564304 505821 518274 585189 576715 549915 538331 555206 554009 522913 489909
10830 489909 431741 389372 344353 305459 338211 344265 314004 299285 310466 271390 258308 294699
10818 294699 263131 234189 210850 199432 213323 243937 238731 193623 155650 164306 177219 184628
10806 184628 195300 193045 208028 221559 249146 294225 304830 283809 271963 245706 234489 247316
10794 247316 202032 158581 177662 220486 219181 204427 207918 230518 242366 236682 234537 213195
$$ packed form
10878G71539j7072k0227j3405J1755j2834j7446N389k745J7746L9395J5476J9896
10866G97467n1051m9965l4322k235p742r725M1382Q0785L7490N856J883l3448
10854G76375k2685m612O497J1455M6067K7796M388Q570m2579q0272r0742n0215
10842E90043m676k1063n8483J2453O6915q474k6800j1584J6875j197l1096l3004
10830D89909n8168m2369m5019l8894L2752O054l0261j4719J1181l9076j3082L6391
10818B94699l1568k8942k3339j1418J3891L0614n206m5108l7973Q656J2913P409
10806A84628J0672k255J4983J3531K7587M5079J0605k1021j1846k6257j1217J2827
10794B47316m5284m3451J9081M2824j305j4754L491K2600J1848n684k145k1342
$$ plain form
10782 213195 186822 171701 158751 162621 137865 100413 94872 105566 111013 104398 142344 179198
10770 179198 190536 162293 163083 179799 170477 165324 204563 249327 309354 323242 277862 264427
10758 264427 239577 228643 233225 231821 260126 281653 273205 253802 230413 200249 221977 235119
10746 235119 229149 230991 216523 226610 221714 222476 224642 166558 174537 235324 257147 263586 233306
10733 233306 212845 191643 154377 155383 159660 164174 173238 208956 247715 258571 218593 167724
10721 167724 139247 131092 160440 196040 223767 246276 241116 226716 211226 222090 230640 238821
10709 238821 255850 255074 232571 214045 220858 226048 215350 198421 236157 199960 158010 171424
10697 171424 160203 202669 252761 271844 291498 283744 274585 225946 251032 300022 295011 251506
$$ packed form
10782B13195k6373j5121j2950L870k4756l7452n541J0694N447o615L7946L6854
10770A79198J1338k8243P90J6716r322n153L9239M4764O0027J3888m5380j3435
10758B64427k4850j0934M582j404K8305K1527q448j9403k3389l0164K1728J3142
10746B35119n970J842j4468J0087m896P62K166n8084P979O0787K1823O439l0280
10733B33306k0461k1202l7266J006M277M514R064L5718L8759J0856l9978n0869
10721A67724k8477q155K9348L5600K7727K2509n160j4400j5490J0864Q550Q181
10709B38821J7029p76k2503j8526O813N190j0698j6929L7736l6197m1950J3414
10697A71424j1221M2466N0092J9083J9654p754r159m8639K5086M8990n011m3505
$$ plain form
10685 251506 215833 230828 261800 288516 317180 322634 322707 301026 280359 256476 253470 283038
10673 283038 235903 231487 281984 307886 279620 246649 260281 306229 352094 327535 328535 349627
10661 349627 364427 389815 414648 430277 433823 421516 472269 470489 459877 487438 497504 572752
10649 572752 607574 597573 656389 691382 735176 769074 766425 800542 858645 890693 952792 1089517
10637 1089517 1262250 1416505 1597767 1889023 2145643 2365182 2564941 2741720 2967037
10628 2967037 3382997 3871580 4551645 5457201 6709500 8504316 10953952 14226516 18477716
10619 18477716 23618294 28993073 33341886 35437427 35076887 33367829 31623780 30847569
10611 30847569 31749754 34766012 40249488 48430794 58830017 69506414 76914379 78040080
$$ packed form
10685B51506l5673J4995L0972K6716K8664N454P3k1681k0667k3883l006K9568
10673B83038m7135m416N0497K5902k8266l2971J3632M5948M5865k4559J000K1092
10661C49627J4800K5388K4833J5629L546j2307N0753j780j0612K7561J0066P5248
10649E72752L4822j0001N8816L4993M3794L3898k649L4117N8103L2048O2099J36725
10637A089517J72733J54255J81262K91256K56620K19539J99759J76779K25317
10628B967037M15960M88583O80065R05556J252299J794816K449636L272564M251200
10619A8477716N140578N374779M348813K095541l60540j709058j744049p76211
10611C0847569R02185L016258N483476Q181306J0399223J0676397P407965J125701
$$ plain form
10603 78040080 73241530 65794627 59114303 55105913 54486276 57460448 64223187 74921505
10595 74921505 88450394 101490268 108724446 106251176 95480904 81620671 69375284
10588 69375284 60812270 56193043 55246207 57750990 63211087 70405763 76806335 78764621
10580 78764621 74116148 64462212 53405596 43960977 37366065 33447327 31692089 31714198
10572 31714198 33004000 34885512 36086288 35334332 32093340 27096596 21684917 16956662
10564 16956662 13264776 10537668 8549077 7061363 5968092 5181163 4574020 4080558
10556 4080558 3663418 3351665 3142246 2971333 2888298 2871159 2952052 3102092 3311741 3375825
10546 3375825 3118360 2764785 2401530 2057493 1815121 1664499 1506213 1359625 1262767 1171734
$$ packed form
10603G8040080m798550p446903o680324m008390o19637K974172O762739J0698318
10595G4921505J3528889J3039874P234178k473270j0770272j3860233j2245387
10588F9375284q563014m619227r46836K504783N460097P194676O400572J958286
10580G8764621m648473r653936j1056616r444619o594912l918738j755238K2109
10572C1714198J289802J881512J200776p51956l240992m996744n411679m728255
10564A6956662l691886k727108j988591j487714j093271p86929o07143m93462
10556D080558m17140l11753k09419j70913q3035j7139Q0893J50040K09649O4084
10546C375825k57465l53575l63255l44037k42372j50622j58286j46588r6858r1033
$$ plain form
10536 1171734 1058567 972020 922221 900692 872440 779012 744264 740482 710519 713632 690670
10525 690670 670673 637648 596248 569190 524980 521991 548399 566028 581936 549277 484054 453248
10513 453248 412884 408358 408749 405519 401566 367564 381945 402963 409773 394783 352761 335913 342455
10500 342455 381993 347751 299232 323727 354269 370828 398554 425107 420949 419548 370487 381350
10488 381350 364648 352823 282616 251599 285457 311509 282221 260465 286395 318358 285203
10477 285203 255954 229554 199001 172858 199579 185431 186986 257277 256702 216265 200593 232387
10465 232387 221520 200986 178781 173061 158384 134009 186880 234457 219474 210425 203782 200506
10453 200506 195462 143864 142906 141684 129854 126036 107011 112664 137327 144220 125853 96483 73045
$$ packed form
10536A171734j13167q6547m9799k1529k8252r3428l4748l782k9963L113k2962
10525F90670j9997l3025m1400k7058m4210k989K6408J7629J5908l2659o5223l0806
10513D53248m0364m526L91l230l953l4002J4381K1018O810j4990m2022j6848O542
10500C42455L9538l4242m8519K4495L0542J6559K7726K6553m158j401m9061J0863
10488C81350j6702j1825p0207l1017L3858K6052k9288k1756K5930L1963l3155
10477B85203k9249k6400l0553k6143K6721j4148J555P0291n75m0437j5672L1794
10465B32387j0867k0534k2205n720j4677k4375N2871M7577j4983r049o643l276
10453B00506n044n1598r58j222j1830l818j9025N653K4663O893j8367k9370k3438
$$ plain form
10440 73045 56332 121622 144167 146357 131954 111060 114516 123028 94632 66418 36968 36069 41916
10427 41916 63451 93650 26558 -4503 49198 64415 100214 112311 113100 122240 98673 85546
10415 85546 68827 77820 101309 123189 87227 123751 152580 129215 144626 157263 140611 149244
10403 149244 128306 111959 94976 87123 60942 60682 62832 78462 106906 104883 112128 102012 92750
10390 92750 104177 88547 99984 126377 102525 73243 40230 48010 54332 100617 141902 119252
10378 119252 174185 162739 107706 77633 66960 57775 80148 97386 97019 115303 110234 90500
10366 90500 101757 136934 149932 125925 101770 60079 -13440 -9754 43236 93543 106794 84968
10354 84968 100003 116722 112615 107527 113625 81733 51381 34575 4499 -15331 18496 21350
$$ packed form
10440G3045j6713O5290K2545K190j4403k0894L456Q512k8396k8214k9450q99N847
10427D1916K1535L0199o7092l1061N3701J5217L5799J2097P89R140k3567j3127
10415H5546j6719Q993K3489K1880l5962L6524K8829k3365J5411J2637j6652Q633
10403A49244k0938j6347j6983p853k6181k60K150J5630K8444k023P245j0116r262
10390I2750J1427j5630J1437K6393k3852k9282l3013P780O322M6285M1285k2650
10378A19252N4933j1446n5033l0073j0673r185K2373J7238l67J8284n069j9734
10366I0500J1257L5177J2998k4007k4155m1691p3519L686N2990N0307J3251k1826
10354H4968J5035J6719m107n088O098l1892l0352j6806l0076j9830L3827K854
$$ plain form
10342 21350 39240 79503 68253 73658 60841 13147 21778 45768 67829 81433 135721 165854
10330 165854 151720 143107 101627 52396 50889 54861 28571 12303 49883 92680 125449 83588
10318 83588 60278 44492 27623 27064 50658 63864 50779 33454 62561 94204 87459 136753
10306 136753 128665 85940 73650 91671 123392 148776 126490 124555 92492 70527 74563 56560
10294 56560 40565 11908 37716 54054 51420 59825 62255 72823 96492 107751 78527 22998
10282 22998 21618 102882 96313 111052 117466 138529 176249 231125 219856 246424 295302 323391
10270 323391 350989 370418 366310 364689 355905 439208 540820 696928 945723 1336948 1897843
10259 1897843 2656093 3509943 4366541 5377742 6383293 7188135 7637886 7793030 7650759
$$ packed form
10342B1350J7890M0263j1250N405j2817m7694Q631K3990K2061J3604N4288L0133
10330A65854j4134q613m1480m9231j507L972k6290j6268L7580M2797L2769m1861
10318H3588k3310j5786j6869n59K3594J3206j3085j7325K9107L1643o745M9294
10306A36753q088m2725j2290J8021L1721K5384k2286j935l2063k1965M036j8003
10294E6560j5995k8657K5808J6338k634Q405K430J0568K3669J1259k9224n5529
10282B2998j380Q1264o569J4739O414K1063L7720N4876j1269K6568M8878K8089
10270C23391K7598J9429m108j621q784Q3303J01612J56108K48795L91225N60895
10259A897843P58250Q53850Q56598J011201J005551Q04842M49751J55144j42271
$$ plain form
10250 7650759 7359693 6707596 5859468 4821500 3948906 3157978 2491889 1907685 1420589
10241 1420589 1022861 783393 595515 520063 493607 400684 342913 322021 297703 297855 260903
10230 260903 209338 209895 214765 208792 188558 114307 53899 34867 20181 30447 64772 67790
10218 67790 53773 13822 20195 60327 33135 11396 41578 50319 50843 25435 40794 57367
10206 57367 37440 16198 37803 46993 35497 3699 27041 74995 114778 109253 56816 38124
10194 38124 38986 67414 71064 97311 106336 92379 71042 81736 107881 129352 150808 161218
10182 161218 167305 175190 216723 247516 264684 231983 185614 204945 243221 261906 288745 346303
10170 346303 376233 429029 471533 481445 434904 386708 367331 362398 392474 409110 398474 458098
$$ packed form
10250G650759k91066o52097q48128j037968q72594p90928o66089n84204m87096
10241A420589l97728k39468j87878p5452k6456r2923n7771k0892k4318J52l6952
10230B60903n1565N57M870n973k0234p4251o0408j9032j4686J0266L4325L018
10218F7790j4017l9951O373M0132k7192k1739L0182Q741N24k5408J5359J6573
10206E7367j9927k1242K1605R190j1496l1798K3342M7954L9783n525n2437j8692
10194C8124Q62K8428L650K6247R025j3957k1337J0694K6145K1471K1456J0410
10182A61218O087P885M1533L0793J7168l2701m6369J9331L8276J8685K6839N7558
10170C46303K9930N2796M2504R912m6541m8196j9377m933L0076J6636j0636N9624
$$ plain form
10158 458098 569622 632114 625517 579529 536780 499348 438880 330704 331804 379620 384974 383747
10146 383747 447619 453077 398966 340884 306837 301063 314308 297534 271778 212692 155221 169921
10134 169921 222446 231381 247342 241758 221513 167574 108139 74452 48410 14186 2682 51313
10122 51313 59456 40634 32924 24267 62852 57853 62278 63799 46516 18034 35424 25021 14549
10109 14549 27535 30113 50136 69620 77390 59129 70387 57544 69059 81275 77514 69351
10097 69351 60941 15218 13652 43423 56605 56525 30763 48925 92692 86584 96139 74604 21278
10084 21278 -23883 -42225 -24073 37406 65701 59519 99937 124863 74918 -5663 287 8731
10072 8731 -14450 -56362 -55733 -22762 -17119 -14263 5200 44569 39822 28616 2820 -13603 31255
$$ packed form
10158D58098J11524O2492o597m5988m2749l7432o0468j08176J100M7816N354j227
10146C83747O3872N458n4111n8082l4047n774J3245j6774k5756n9086n7471J4700
10134A69921N2525Q935J5961n584k0245n3939n9435l3687k6042l4224j1504M8631
10122E1313Q143j8822p710q657L8585m999M425J521j7283k8482J7390j0403j0472
10109A4549J2986K578K0023J9484P770j8261J1258j2843J1515J2216l761q163
10097F9351q410m5723j566K9771J3182q0k5762J8162M3767o108R555k1535n3326
10084B1278m5161j8342J8152O1479K8295o182M0418K4926m9945q0581N950Q444
10072H731k3181m1912O29L2971N643K856J9463L9369m747j1206k5796j6423M4858
$$ plain form
10059 31255 58939 8939 -5053 -5049 -25960 -15838 9029 30681 28497 41071 31128 -2593 -2472
10046 -2472 11759 34968 43397 63810 28552 12215 7724 -21169 -28595 -38136 -45120 -51208 -28875
10033 -28875 -14850 -26478 -29726 -22948 7358 36159 1996 7696 -1198 -41434 -47484 -27379 -28795
10020 -28795 -42154 19308 42332 18053 38313 45120 29921 28210 19349 13930 28276 26786 17144
10007 17144 6921 21533 46508 45949 8764 57872 121389 41689 -29668 -25474 -34916 993
9995 993 20734 5843 42137 47836 56969 61802 44034 9182 46019 58659 33570 18660 26979
9982 26979 25527 19797 -1896 -3196 20716 53573 74993 73631 55000 15607 -9214 -11719 -46482
9969 -46482 -39741 -43148 -39516 -54876 -67467 4429 8243 -4508 -26409 -50880 -40788 -50141 -28960
$$ packed form
10059C1255K7684n0000j3992Mk0911J0122K4867K1652k184J2574r943l3721J21
10046b472J4231K3209Q429K0413l5258j6337m491k8893p426r541o984o088K2333
10033b8875J4025j1628l248O778L0306K8801l4163N700q894m0236o050K0105j416
10020b8795j3359O1462K3024k4279K0260O807j5199j711q861n419J4346j490r642
10007A7144j0223J4612K4975n59l7185M9108O3517p9700p1357M194r442L5909
9995I93J9741j4891L6294N699R133M833j7768l4852L6837J2640k5089j4910Q319
9982B6979j452n730k1693j300K3912L2857K1420j362j8631l9393k4821k505l4763
9969d6482O741l407L632j5360j2591P1896L814j2751k1901k4471J0092r353K1181
$$ plain form
9956 -28960 -358 -4933 -21135 -18020 -33348 9488 46513 32411 28053 27832 27276 33890 7651
9943 7651 -23191 -38424 -50204 -30699 55790 59645 56193 40447 35474 24202 16313 34585 41648
9930 41648 46108 70119 56074 27872 32103 40103 -6046 -47854 -68745 -106274 -77157 -29264
9918 -29264 -14187 -1582 -3309 21307 7265 -6585 5765 -15731 -18193 6489 -12859 -35012
9906 -35012 -28300 398 288 -21600 -34068 -4365 11608 9166 -5880 -5586 407 18213 33476
9893 33476 16479 15375 -25254 -13091 -12790 -36723 -20243 -914 -6108 -50366 -46246 -25043 16612
9880 16612 34401 50559 105995 159830 137730 112949 91278 23672 18035 70563 107708 63144
9868 63144 43190 32409 53048 63996 25532 4375 -1085 20364 29074 25683 50863 61479
$$ packed form
9956b8960K8602m575j6202L115j5328M2836L7025j4102m358k21n56O614k6239
9943G651l0842j5233j1780J9505Q6489L855l452j5746m973j1272p889J8272P063
9930D1648M460K4011j4045k8202M231Q000m6149m1808k0891l7529K9117M7893
9918b9264J5077J2605j727K4616j4042j3850J2350k1496k462K4682j9348k2153
9906c5012O712K8698j10k1888j2468K9703J5973k442j5046K94N993J7806J5263
9893C3476j6997j104m0629J2163L01k3933J6480J9329n194m4258M120K1203M1655
9880A6612J7789J6158N5436N3835k2100k4781k1671o7606n637N2528L7145m4564
9868F3144j9954j0781K0639J0948l8464k1157n460K1449Q710l391K5180J0616
$$ plain form
9856 61479 18420 -17972 25063 55950 75909 134903 131820 98520 61575 45561 76707 77280
9844 77280 88944 105470 55722 37584 38083 65707 18505 -17067 -19390 -7765 6221 4455 15334
9831 15334 65713 66919 60004 55667 70135 72403 53884 3697 -347 11227 -1105 3972 7421
9818 7421 16799 26552 103717 178067 210764 219870 193029 124837 97740 100798 133201 170894 170420
9805 170420 221521 286867 324879 304621 255801 206809 185902 184551 193388 191270 212793 255763
9793 255763 308540 394052 481500 491925 397031 298033 229736 203065 195168 178412 173322 183176
9781 183176 212012 274870 319700 279443 200811 113642 54096 51464 51514 73165 87103 115884
9769 115884 101137 104836 123326 128791 119699 71141 26492 46275 39865 54384 77109 88693
$$ packed form
9856F1479m3059l6392M3035L0887J9959N8994l083l3300l6945j6014L1146N73
9844G7280J1664J6526m9748j8138M99K7624m7202l5572k323J1625J3986j766J0879
9831A5334N0379J206o915m337J4468K268j8519n0187m044J1574j2332N077L449
9818G421R378R753P7165P4350L2697R106k6841o8192k7097L058L2403L7693m74
9805A70420N1101O5346L8012k0258m8820m8992k0907j351Q837k118K1523M2970
9793B55763N2777Q5512Q7448J0425r4894r8998o8297k6671p897j6756n090R854
9781A83176K8836O2858M4830m0257p8632q7169n9546k632N0K1651J3938K8781
9769A15884j4747L699J8490N465r092m8558m4649J9783o410J4519K2725J1584
$$ plain form
9757 88693 122905 79081 39555 -7473 8125 5117 45215 70554 56048 68653 74820 54005
9745 54005 4054 2260 -13575 14256 254 -26802 -13876 -7425 -29317 -6773 7129 28831
9733 28831 34788 -56 22526 -527 11712 18372 31038 28469 2454 554 67032 95231 63467
9720 63467 23347 43964 47399 33519 23559 -16452 9680 601 -36449 -50546 -29780 -12582
9708 -12582 -15750 1573 5166 14193 22905 2306 -27762 -27923 11452 34618 35039 3848 -1836 22725
9694 22725 26719 17007 6362 -27402 -15895 -13747 -25466 -32009 -8538 1093 14946 31573 -2161
9681 -2161 -22033 -3791 -849 4035 -18687 440 34773 -2095 -13884 -18929 2316 26157 -9107
9668 -9107 -27194 -15024 -28100 -41650 -24567 -12621 -21174 -3868 -4141 12067 -9445 -22791 -4047
$$ packed form
9757H8693L4212m3824l9526m7028J5598l008M0098K5339j4506J2605O167k0815
9745E4005m9951j794j5835K7831j4002k7056J2926O451k1892K2544J3902K1702
9733B8831N957l4844K2582k3053J2239O660J2666k569k6015j900O6478K8199l1764
9720F3467m0120K0617L435j3880r960m0011K6132r079l7050j4097K0766J7198
9708a2582l168J7323L593R027Q712k0599l0068j61L9375K3166M21l1191n684K4561
9694B2725L994r712j0645l3764J1507K148j1719o543K3471R631J3853J6627l3734
9681b161j9872J8242K942M884k2722J9127L4333l6868j1789n045K1245K3841l5264
9668i107j8087J2170j3076j3550J7083J1946q553J7306k73J6208k1512j3346J8744
$$ plain form
9655 -4047 19676 61860 50574 71798 90379 89231 103841 153241 272015 372091 427917 380042
9643 380042 288959 208055 152041 80329 -304 -16969 5866 -3938 25181 31424 50981 28034
9631 28034 30796 31778 34570 -4134 -43457 -46175 -75986 -24810 -19211 -37506 -19189 6678 39616
9618 39616 28012 32764 -1047 -65485 -42865 -10822 21102 31765 44735 34521 19652 -554
9606 -554 -5242 40840 45588 -8588 -76338 -49542 -48545 -67060 -60430 -107947 -128935 -95310 -38114
9593 -38114 -30484 -21774 -44370 -30220 4346 -14476 -11455 27053 17124 -16009 -10203 393 65967
9580 65967 57929 51303 74695 65252 18879 -1225 -4810 -5869 -32084 -33486 -21901 7570 -25782
9567 -25782 -36164 -15818 -23591 -35775 -37208 -20277 -405 21037 77210 80342 56329 54465 64015
$$ packed form
9655d047K3723M2184j1286K1224J8581j148J4610M9400J18774J00076N5826m7875
9643C80042r1083q0904n6014p1712q0633j6665K2835r804K9119O243J9557k2947
9631B8034K762R82K792l8704l9323k718k9811N1176N599j8295J8317K5867L2938
9618C9616j1604M752l3811o4438K2620L2043L1924J0663J2970j0214j4869k0206
9606e54m688M6082M748n4176o7750K6796R97j8515O630m7517k0988L3625N7196
9593c8114P630Q710k2596J4150L4566j8822L021L8508r929l3133N806J0596O5574
9580F5967q038o626K3392r443m6373k0104l585j059k6215j402J1585K9471l3352
9567b5782j0382K0346p773j2184j433J6931J9872K1442N6173L132k4013j864R550
$$ plain form
9554 64015 59487 71782 77894 59195 26104 3932 -31326 -29333 -13907 -18380 -19738 20252 68714
9541 68714 58591 14459 -19778 9316 1673 -11218 -56501 -66525 -19527 -52733 -37414 22390
9529 22390 46990 61671 32472 -18135 -55107 -61173 -11866 18306 18905 8729 6633 4940 11002
9516 11002 29309 14092 -8192 -7318 -12857 3456 -5308 15697 -7579 -20321 -13156 -26160 -33687
9503 -33687 2636 7975 8363 4381 18695 46130 61311 48041 16724 -40386 -54704 -35442 -7699
9490 -7699 20969 38788 25789 -16258 -45709 -57493 -61086 -69694 -82774 -33448 -16825 -26986
9478 -26986 19775 -2823 -3327 33407 39846 53799 28684 -53309 -78070 -76096 -24983 14334 -1677
9465 -1677 12099 39647 49853 27868 7248 -3428 -17413 -5243 -7611 14354 22861 11117
$$ packed form
9554F4015m528J2295O112j8699l3091k2172l5258J993J5426m473j358L9990M8462
9541F8714j0123m4132l4237K9094p643j2891m5283j0024M6998l3206J5319N9804
9529B2390K4600J4681k9199n0607l6972o066M9307L0172N99j0176k096j693O062
9516A1002J8307j5217k2284Q74n539J6313q764K1005k3276j2742P165j3004p527
9503c3687L6323N339L88l982J4314K7435J5181j3270l1317n7110j4318J9262K7743
9490g699K8668J7819j2999m2047k9451j1784l593q608j3080M9326J6623j0161
9478b6986M6761k2598n04L6734O439J3953k5115q1993k4761J974N1113L9317j6011
9465a677J3776K7548J0206k1985k0620j0676j3985J2170k368K1965Q507j1744
$$ plain form
9453 11117 7229 -25925 20905 49593 27195 41917 17911 -30432 -39422 -7270 44992 62189
9441 62189 46908 44511 34906 -14402 1437 46039 47931 24416 57840 89363 62991 27429
9429 27429 11117 -18333 -47022 -8109 42671 53428 41000 11309 11866 -13758 27295 63114
9417 63114 61063 46019 18983 -27252 -69769 -58866 -46442 -42382 -41337 -7582 20320 -16383
9405 -16383 -44621 -32958 -6775 2758 55264 67629 27293 26056 47500 31230 3863 -8070
9393 -8070 -3245 -3446 20807 -10105 -24525 7307 18328 20335 4167 1084 30261 44249 14135
9380 14135 22879 51460 53797 15896 -20606 -7131 -20226 -41032 -54099 -67861 -32927 11670
9368 11670 11070 27124 72715 39147 -50872 -62246 -44890 -11909 20427 32691 -17495 -43916
$$ packed form
9453A1117l888l3154M6830K8688k2398J4722k4006m8343q990L2152N2262J7197
9441F2189j5281k397r605m9308J5839M4602J892k3515L3424L1523k6372l5562
9429B7429j6312k9450k8689L8913N0780J0757j2428k9691N57k5624M1053L5819
9417F3114k051j5044k7036m6235m2517J0903J2424M060J045L3755K7902l6703
9405a6383k8238J1663K6183R533N2506J2365m0336j237K1444j6270k7367j1933
9393h070M825k01K4253l0912j4420L1832J1021K007j6168l083K9177J3988l0114
9380A4135Q744K8581K337l7901l6502J3475j3095k0806j3067j3762L4934M4597
9368A1670o00J6054M5591l3568r0019j1374J7356L2981L2336J2264n0186k6421
$$ plain form
9356 -43916 -48613 -63675 -70005 -63084 -23567 35677 16999 -20888 -27685 17479 62328 67697 57110
9343 57110 83717 24882 11226 54371 101773 114832 90232 86382 120943 71042 13105 -41213
9331 -41213 -44249 -40109 -44367 31979 64917 43834 52936 62622 32842 -23599 -11984 -23267 -2251
9318 -2251 31001 19868 37393 -2317 -50131 -49246 -14069 45783 83888 87700 75743 -4739 -42842
9305 -42842 16084 -4466 -25603 29247 35461 -5462 -4897 26277 55538 85803 61277 25817
9293 25817 9500 3468 43112 59767 58664 48190 24094 11045 11121 -19697 20390 13232 4597
9280 4597 22229 -5965 1722 10821 20648 25883 24594 20738 8893 10304 -14896 -35323 -54773
9267 -54773 -48491 -35955 -35286 -6761 -15366 -7825 17093 46353 -661 -61421 -64609 7887 36120
$$ packed form
9356d3916m697j5062o330O921L9517N9244j8678l7887o797M5164M4849N369j0587
9343E7110K6607n8835j3656M3145M7402J3059k4600l850L4561m9901n7937n4318
9331d1213l036M140m258P6346L2938k1083R102R686k9780n6441J1615j1283K1016
9318b251L3252j1133J7525l9710m7814Q85L5177N9852L8105L812j1957q0482l8103
9305d2842N8926k0550k1137N4850O214m0923N65L1174K9261L0265k4526l5460
9293B5817j6317o032L9644J6655j103j0474k4096j3049P6l0818M0087p158q635
9280D597J7632k8194P687R099R827N235j289l856j1845J411k5200k0427j9450
9267e4773O282J2536O69K8525q605P541K4918K9260m7014o0760l188P2496K8233
$$ plain form
9254 36120 27515 31685 18227 33167 16482 -6991 5148 -8204 8159 -1521 -3691 974 22311
9241 22311 9342 15864 42206 28725 17917 44638 30060 5844 -5281 -32458 -7623 21581
9229 21581 9298 50284 59666 47324 34217 38763 43741 15659 -2760 -27237 -14470 10695
9217 10695 -4427 -15896 -20751 6371 25430 24230 -11180 -47966 -42466 -13760 7905 25807
9205 25807 33278 19109 -24825 -38695 -4450 -2156 -18358 18249 45192 32961 11205 18196
9193 18196 23462 7010 -10798 10775 33923 5342 -18694 -17593 -24313 -20885 -3428 -29699 9798
9180 9798 35395 34762 20563 3409 -27112 -10898 14799 8782 13387 30769 12410 18394 38633
9167 38633 42346 33349 41422 52147 56238 19916 -20347 -38311 -31394 -7525 35382 6825 -53911
$$ packed form
9254C6120q605M170j3458J4940j6685k3473J2139j3352J6363r680k170M665K1337
9241B2311j2969O522K6342j3481j0808K6721j4578k4216j1125k7177K4835K9204
9229B1581j2283M0986R382j2342j3107M546M978k8082j8419k4477J2767K5165
9217A0695j5122j1469m855K7122J9059j200l5410l6786N500K8706K1665J7902
9205B5807P471j4169m3934j3870L4245K294j6202L6607K6943j2231k1756O991
9193A8196N266j6452j7808K1573K3148k8581k4036J101o720L428J7457k6271L9497
9180I798K5597o33j4199j7154l0521J6214K5697o017M605J7382j8359N984K0239
9167C8633L713q997Q073J0725M091l6322m0263j7964O917K3869M2907k8557o0736
$$ plain form
9154 -53911 -79526 -72184 -93540 -83961 -47035 -46558 -5883 51472 40355 -12355 -29316 -20368 6593
9141 6593 13007 14237 -6950 -23212 10530 11502 -24136 -37860 -9320 13007 43709 36890 3587
9128 3587 -34643 -60520 -48591 -61996 -17335 -43937 -28990 -8522 -32173 -50639 -28410 -3648
9116 -3648 -22982 674 45876 62060 43371 29984 6346 22103 17529 22303 21661 4065 16804
9103 16804 -27142 -32498 7679 -10629 -30425 -26343 -30422 1469 -16014 -18424 18631 29711 7801
9090 7801 11735 -8513 -59210 -59131 -3563 3832 17751 28263 42157 20886 18105 -2502 -10979
9077 -10979 -26671 -6761 6807 -16017 -28870 -19213 -37960 -34705 -16476 5403 3968 9237 -4969
9064 -4969 663 27406 23844 3499 -4689 2867 637 9395 19807 -4660 -59838 -75443 -72413
$$ packed form
9154e3911k5615P342k1356R579L6926M77M0675N7355j1117n2710j6961Q948K6961
9141F593O414J230k1187j6262L3742R72l5638j3724K8540K2327L0702o819l3303
9128C587l8230k5877J1929j3405M4661k6602J4947K0468k3651j8466K2229K4762
9116c648j9334K3656M5202J6184j8689j3387k3638J5757m574M774o42j7596J2739
9103A6804m3946n356M0177j8308j9796M082m079L1891j7483k410L7055J1080k1910
9090G801L934k0248n0697P9N5568P395J3919J0512J3894k1271k781k0607q477
9077a0979j5692J9910J3568k2824j2853R657j8747L255J8229K1879j435N269j4206
9064d969N632K6743l562k0345q188P556k230Q758J0412k4467n5178j5605L030
$$ plain form
9051 -72413 -46659 -13603 915 -22380 -12740 -3413 47555 63620 53976 11959 -22477 -12025
9039 -12025 -12592 12884 4306 12155 1177 -11874 14549 -24967 -34868 7043 -4219 -31528 23074
9026 23074 15219 -27417 -36306 -13701 52671 95287 80121 56887 75943 91244 74556 68811
9014 68811 60866 64404 63318 53029 36824 10397 -8172 8832 -939 -4295 37883 54612 31871
9001 31871 -8929 -937 5786 34720 12141 -11457 -4484 -11260 24230 8690 16680 32083 7598
8988 7598 47267 58184 48099 15614 -4377 15373 28057 -16480 1559 27324 30798 27565
8976 27565 32193 22924 12932 61428 55390 38768 59317 62958 26829 3501 -1547 -22872 -26139
8963 -26139 -9162 -7371 17355 19248 11214 6152 37318 54181 51211 24755 -3294 -4224 -21246
$$ packed form
9051g2413K5754L3056J4518k3295R640R327N0968J6065r644m2017l4436J0452
9039a2025n67K5476q578P849j0978j3051K6423l9516r901M1911j1262k7309N4602
9026B3074p855m2636q889K2605O6372M2616j5166k3234J9056J5301j6688n745
9014F8811p945L538j086j0289j6205k6427j8569J7004r771l356M2178J6729k2741
9001C1871m0800P992O723K8934k2579k3598O973o776L5490j5540P990J5403k4485
8988G598L9669J0917j0085l2485j9991J9750J2684m4537J8039K5765L474l233
8976B7565M628r269r992M8496o038j6622K0549L641l6129k3328n048k1325l267
8963b6139J6977J791K4726J893q034n062L1166J6863k970k6456k8049r30j7022
$$ plain form
8950 -21246 26353 27033 -17205 -55894 -70393 -20798 -779 18680 30154 51321 68213 42879
8938 42879 34956 67139 96157 70594 37347 32940 2134 5742 14627 30137 -1073 -6237 33209
8925 33209 19393 10291 27585 15134 -7218 -3064 -5830 7504 34593 75774 53675 48009 39009
8912 39009 39253 17513 6030 5900 -220 -23766 -35879 -7728 25608 51339 41236 66907 64002
8899 64002 47015 37550 12268 -1707 -41261 -91788 -127822 -124283 -54226 37054 51867 29206
8887 29206 -14170 -31680 -25326 15751 -1804 20877 59316 56728 22164 26340 24137 48526 85248
8874 85248 62500 27154 -7416 -3744 -6245 -1583 -15124 -44746 -72612 -62119 -22057 13879
8862 13879 70879 57086 39956 26818 980 -8874 -877 5580 22337 72511 70641 68075 71661
$$ packed form
8950b1246M7599O80m4238l8689j4499M9595K0019J9459J1474K1167J6892k5334
8938D2879p923L2183K9018k5563l3247m407l0806L608Q885J5510l1210n164L9446
8925C3209j3816r102J7294j2451k2352M154k766J3334K7089M1181k2099n666r000
8912C9009K44k1740j1483j30o120k3546j2113K8151L3336K5731j0103K5671k905
8899F4002j6987r465k5282j3975l9554n0527l6034L539P0057R1280J4813k2661
8887B9206m3376j7510O354M1077j7555K2681L8439k588l4564M176k203K4389L6722
8874H5248k2748l5346l4570L672k501M662j3541k9622k7866J0493M0062L5936
8862A3879N7000j3793j7130j3138k5838r854P997O457J6757N0174j870k566L586
$$ plain form
8849 71661 57086 35548 -2294 -41211 -11194 19196 37227 15428 22929 38848 19603 35032
8837 35032 40691 73136 58776 34099 10314 8893 -26423 -27610 -30914 -23867 22039 63840 43679
8824 43679 17174 11493 35498 58165 51858 66658 32077 24192 36662 -429 -8298 -12768 -21048
8811 -21048 -36852 -11723 46130 66475 32292 -24272 -19968 -43300 -39426 10970 1399 2601 220
8798 220 41345 44997 21285 10268 1497 6758 -24774 -78280 -47241 14910 11362 14423 44917
8785 44917 57382 58940 34560 49846 52162 38127 7730 -3511 31259 19921 -10800 -22764
8773 -22764 11032 17465 7741 28393 52798 79332 54646 45545 38305 -15891 -35095 -44022 -1949
8760 -1949 44840 59400 17683 3380 28720 18729 -13391 2494 30679 81966 74616 71273 63762
$$ packed form
8849G1661j4575k1538l7842l8917L0017L0390J8031k1799P501J5919j9245J5429
8837C5032N659L2445j4360k4677k3785j421l5316j187l304P047M5906M1801k0161
8824D3679k6505n681K4005K2667o307J4800l4581p885J2470l7091p869m470q280
8811b1048j5804K5129N7853K0345l4183n6564M304k3332L874N0396r571J202k381
8798B20M1125L652k3712j1017q771N261l1532n3506L1039O2151l548L061L0494
8785D4917J2465J558k4380J5286K316j4035l0397j1241L4770j1338l0721j1964
8773b2764L3796O433r724K0652K4405K6534k4686r101p240n4196j9204q927M2073
8760a949M6789J4560m1717j4303K5340r991l2120J5885K8185N1287p350l343p511
$$ plain form
8747 63762 20383 14644 -4434 -34984 -58489 -47561 -35722 -38235 -28214 6571 34471 22815
8735 22815 10265 -5156 27070 25343 41316 54639 42778 7489 9285 34335 80290 70630
8723 70630 19693 18217 25517 12926 12754 31207 1167 -37629 1427 -21453 -55778 -4225 16144
8710 16144 39819 117705 107599 75353 42887 34857 39824 46274 21997 33082 10435 34024
8698 34024 32193 45754 34839 11388 14547 58098 71884 87213 89177 77106 13711 29374
8686 29374 121005 142264 91587 80627 81485 56172 70252 135690 161647 148587 115395 104100
8674 104100 64823 36387 43161 43383 31414 59306 64057 76011 117265 92748 55955 43519
8662 43519 53931 28922 16344 20215 70409 137033 160474 129170 59821 3745 32555 62939
$$ packed form
8747F3762m3379n739j9078l0550k3505J0928J1839k513J0021L4785K7900j1656
8735B2815j2550j5421L2226j727J5973J3323j1861l5289J796K5050M5955r660
8723G0630n0937j476P300j2591j72J8453l0040l8796L9056k2880l4325N1553K0369
8710A6144K3675P7886j0106l2246l2466q030M967O450k4277J1085k2647K3589
8698C4024j831J3561j0915k3451L159M3551J3786J5329J964j2071o3395J5663
8686B9374R1631K1259n0677j0960Q58k5313J4080O5438K5957j3060l3192j1295
8674A04100l9277k8436O774K22j1969K7892M751J1954M1254k4517l6793j2436
8662D3519J0412k5009j2578L871N0194O6624K3441l1304o9349n6076K8810L0384
$$ plain form
8650 62939 66035 69524 61660 52016 17798 39575 10116 1020 -3803 -17452 -15962 -13267 -2912
8637 -2912 20438 60613 80159 82951 77213 63937 51503 46455 45075 3771 4704 22093 48498
8624 48498 46116 24173 42813 12800 18252 29472 8235 -24324 -8111 -11351 -13126 -15095 22254
8611 22254 2263 -20519 -6302 10011 50075 66223 68018 61256 65567 84307 90905 84968 88822
8598 88822 67054 42574 61737 62105 61408 51222 38426 37252 39594 56811 19732 44423 74527
8585 74527 55703 82707 108923 124945 125141 89687 81121 76805 95085 95213 73499 94531 86896
8572 86896 99806 96497 93989 74774 39370 107078 119975 80389 37674 47094 49859 115832 116391
8559 116391 79938 72863 81035 69915 47797 30031 23935 67975 87746 75088 63224 89966
$$ packed form
8650F2939L096L489p864r644l4218K1777k9459r096m823j3649J490K695J0355
8637b912K3350M0175J9546K792n738j3276j2434n048j380m1304R33J7389K6405
8624D8498k382k1943J8640l0013N452J1220k1237l2559J6213l240j775j969L7349
8611B2254j9991k2782J4217J6313M0064J6148J795o762M311J8740O598n937L854
8598H8822k1768k4480J9163L68o97j0186j2796j174K342J7217l7079K4691L0104
8585G4527j8824K7004K6216J6022J96l5454q566m316J8280J28k1714K1032p635
8572H6896J2910l309k508j9215l5404O7708J2897l9586m2715R420K765O5973N59
8559A16391l6453p075Q172j1120k2118j7766o096M4040J9771j2658j1864K6742
$$ plain form
8547 89966 93021 95965 99833 84155 74727 105444 142881 96951 64198 59879 69457 43093 57589
8534 57589 99453 109221 83560 79113 81810 79226 109214 107833 83143 41334 33046 73256 76953
8521 76953 39364 21469 36304 55337 65037 101118 95352 72542 39504 49708 59535 -5143
8509 -5143 -3746 55520 77202 63479 99550 101559 98259 116051 86189 56930 36730 24204 87338
8496 87338 103147 97394 80204 87377 29746 -7775 -956 39669 47404 30564 30996 74221 104934
8483 104934 64502 44761 75984 79059 50328 29951 621 41782 91752 76992 48920 41766
8471 41766 40955 24862 57352 89852 107528 79387 28270 14675 65413 93229 60157 50823
8459 50823 61086 69560 42446 64218 71685 59523 73654 78867 84727 98220 121720 133923 133687
$$ packed form
8547H9966L055K944L868j5678r428L0717L7437m5930l2753m319R578k6364J4496
8534E7589M1864R768k5661m447K697k584K9988j381k4690m1809q288M0210L697
8521G6953l7589j7895J4835J9033R700L6081n766k2810l3038J0204R827o4678
8509e143J397N9266K1682j3723L6071K009l300J7792k9862k9259k0200j2526O3134
8496H7338J5809n753j7190P173n7631l7521O819M0625P735j6840M32M3225L0713
8483A04934m0432j9741L1223L075k8731k0377k9330M1161M9970j4760k8072p154
8471D1766q11j6093L2490L2500J7676k8141n1117j3595N0738K7816l3072r334
8459E0823J0263Q474k7114K1772P467j2162J4131N213N860J3493K3500J2203k36
$$ plain form
8446 133687 109531 121060 96133 50261 53381 106757 131577 105382 49870 11383 -3209 -19684
8434 -19684 22926 72924 82678 87755 114274 114034 77324 20875 -26846 -30168 6915 43840 62741
8421 62741 100950 106300 37040 465 15198 34697 26002 -4633 -215 47622 94045 105194
8409 105194 60859 27369 19309 17630 28778 65579 101113 94331 154820 173230 134760 138760
8397 138760 144428 122149 105663 84348 95635 85655 40828 55076 57312 80048 106389 93425
8385 93425 58204 87747 72920 125947 150581 119304 93152 76888 59600 43939 6102 -7353
8373 -7353 758 48886 65192 37298 52642 86146 53811 25519 28597 47424 22251 40877
8361 40877 41718 104603 130217 115011 92632 100253 109487 111883 128670 132872 139030 131999 137695 111173
$$ packed form
8446A33687k4156J1529k4927m5872L120N3376K4820k6195n5512l8487j4592j6475
8434a9684M2610M9998R754N077K6519k40l6710n6449m7721l322L7083L6925J8901
8421F2741L8209N350o9260l6575J4733J9499q695l0635M418M7837M6423J1149
8409A05194m4335l3490q060j679J1148L6801L5534o782O0489J8410l8470M000
8397A38760N668k2279j6486k1315J1287r980m4827J4248K236K2736K6341j2964
8385I3425l5221K9543j4827N3027K4634l1277k6152j6264j7288j5661l7837j3455
8373g353Q111M8128J6306k7894J5344L3504l2335k8292L078J8827k5173J8626
8361D0877Q41O2885K5614j5206k2379P621R234K396J6787M202O158p031N696k6522
$$ plain form
8347 111173 109690 96017 85999 108492 141329 124401 116735 89747 36728 58759 60677 74659
8335 74659 81724 77959 79674 47651 68669 103547 105361 94754 96849 103101 127845 108397 97093
8322 97093 100887 56162 71390 58038 53887 55367 35488 35057 49158 75737 80372 87909 141588
8309 141588 195087 211248 165849 153639 124820 112434 93042 97545 117103 101386 94466 81866
8297 81866 105475 94336 58111 82177 102059 117189 123932 118747 112132 124180 70666 89106
8285 89106 80799 89365 130466 162121 179443 194002 163953 109887 116773 106243 65828 81615
8273 81615 101512 150388 137186 148039 159221 149296 152558 150775 122243 136644 124059 113002
8261 113002 141540 152795 91144 85988 81951 77740 59492 79632 124753 107032 86917 101715
$$ packed form
8347A11173j483j3673j0018K2493L2837j6928p666k6988n3019K2031J918J3982
8335G4659P065l765J715l2023K1018L4878J814j0607K095O252K4744j9448j1304
8322I7093L794m4725J5228j3352m151J480j9879m31J4101K6579M635P537N3679
8309A41588N3499J6161m5399j2210k8819j2386j9392M503J9558j5717o920j2600
8297H1866K3609j1139l6225K4066J9882J5130O743n185o615J2048n3514J8440
8285H9106q307Q566M1101L1655J7322J4559l0049n4066O886j0530m0415J5787
8273H1615J9897M8876j3202J0853J1182r925L262j783k8532J4401j2585j1057
8261A13002K8538J1255o1651n156m037m211j8248K0140M5121j7721k0115J4798
$$ plain form
8249 101715 87845 85344 115852 131125 125258 50585 41016 54893 97648 85856 103525 136699
8237 136699 153307 120380 81234 114029 84534 84623 129845 155421 138628 129979 157380 165193 175641
8224 175641 159735 130346 59912 93276 136530 141687 100300 104719 110764 91151 119490 121210
8212 121210 91292 43708 24459 41585 87731 104610 147046 178951 146865 113135 88731 125427
8200 125427 169451 173908 167185 124122 122439 119962 92374 81970 74811 64887 47300 23298 29454
8187 29454 67029 105486 101851 63807 69707 20049 46106 88348 122556 123114 111637 109794 120263
8174 120263 102027 60485 52722 56991 52496 88972 44201 20984 23490 41351 67424 61491 79973
8161 79973 108472 152094 154937 164692 145436 95661 67644 87950 120848 78687 63120 101561
$$ packed form
8249A01715j3870k501L0508J5273n867p4673r569J3877M2755j1792J7669L3174
8237A36699J6608l2927l9146L2795k9495Q9M5222K5576j6793q649K7401P813J0448
8224A75641j5906k9389p0434L3364M3254N157m1387M419O045j9613K8339J720
8212A21210k9918m7584j9249J7126M6146J6879M2436L1905l2086l3730k4404L6696
8200A25427M4024M457o723m3063j683k477k7588j0404p159r924j7587k4002O156
8187B9454L7575L8457l635l8044N900m9658K6057M2242L4208N58j1477j843J0469
8174A20263j8236m1542p763M269m495L6476m4771k3217K506J7861K6073n933J8482
8161G9973K8499M3622K843R755j9256m9775k8017K0306L2898m2161j5567L8441
$$ plain form
8149 101561 94652 79626 69187 39103 29333 8382 29634 34562 26522 45111 65566 72879 32607
8136 32607 65557 112052 147458 151925 124587 135551 97815 82208 96370 96432 87209 79518 82733
8123 82733 74976 52940 36213 2582 -12808 18816 30031 25445 2094 -12680 -278 4709
8111 4709 -50332 -16423 43938 70030 66493 59248 55318 25098 27297 68135 68762 71415 104162
8098 104162 65916 67198 55640 50077 83084 68243 1210 11845 36303 41212 104227 94916
8086 94916 31710 -4486 -5739 39826 33569 30197 70098 105903 110009 99645 89700 76538 68713
8073 68713 108254 109817 91605 70694 56823 60165 62705 56297 66545 40168 27657 16965 47903
8060 47903 65914 56440 37921 6811 -27240 -61417 -17744 27871 35057 47410 37360 27163
$$ packed form
8149A01561o909j5026j0439l0084r770k0951K1252M928q040J8589K0455P313m0272
8136C2607L2950M6495L5406M467k7338J0964l7736j5607J4162O2r223p691L215
8123H2733p757k2036j6727l3631j5390L1624J1215m586k3351j4774J2402M987
8111D709n5041L3909O0361K6092l537p245l930l0220K199M0838O27K653L2747
8098A04162l8246J282j1558n563L3007j4841o7033J0635K4458M909O3015r311
8086I4916o3206l6196j253M5565o257l372L9901L5805M106j0364r945j3162p825
8073F8713L9541J563j8212k0911j3871L342K540o408J0248k6377j2511j0692L0938
8060D7903J8011r474j8519l1110l4051l4177M3673M5615P186J2353j0050j0197
$$ plain form
8048 27163 21260 8552 25177 43389 32618 50165 20401 -24137 -53671 -44407 16556 20361
8036 20361 -22265 -7713 56990 46099 13124 25896 43867 80846 101654 108814 92678 50139
8024 50139 69365 93869 87995 84461 92328 84290 56370 50776 74814 57542 40489 56251 48578
8011 48578 70030 46740 51782 65346 33663 5395 18765 52955 69582 20727 -8100 2196
7999 2196 32397 56685 39184 30228 33563 19131 24968 15798 23307 38896 72281 110175 82271
7986 82271 33350 -14382 4408 19815 -16244 -34766 -5990 9410 16290 18937 -5846 -21326
7974 -21326 -1384 19449 57972 69131 83950 112467 61887 20294 -3216 -20035 4547 15983
7962 15983 21060 26308 30769 44590 71119 96319 73647 42301 48982 12662 1956 41111 39949
$$ packed form
8048B7163n903j2708J6625J8212j0771J7547k9764m4538k9534R264O0963L805
8036B0361m2626J4552O4703j0891l2975J2772J7971L6979K0808P160j6136m2539
8024E0139J9226K4504n874l534P867q038k7920n594K4038j7272j7053J5762p673
8011D8578K1452k3290N042J3564l1683k8268J3370L4190J6627m8855k8827J0296
7999B196L0201K4288j7501q956L335j4432N837r170P509J5589L3385L7894k7904
7986H2271m8921m7732J8790J5407l6059j8522K8776J5400O880K647k4783j5480
7974b1326J9942K0833L8523J1159J4819K8517n0580m1593k3510j6819K4582J1436
7962A5983N077N248M461J3821K6529K5200k2672l1346O681l6320j0706L9155j162
$$ plain form
7949 39949 6597 -51659 -25241 -3919 12977 11582 -6551 -32087 -3074 -2615 11375 -21842
7937 -21842 -34771 -18630 -14900 12769 4841 18833 47067 56700 47558 48762 55258 40896 25159
7924 25159 71912 84514 85768 72751 10027 6715 -802 5644 -5383 -37004 -27381 -7850 -31961
7911 -31961 -42898 14874 59960 80898 45541 11877 -19255 -24105 -14911 -19034 -18334 -2476 -13265
7898 -13265 -32416 -8275 24982 71756 59774 30389 28695 42079 23371 -8179 -16706 -41460
7886 -41460 -7788 14862 32634 28336 10130 -18353 -12853 -42847 -76709 -51047 -27573 -4571
7874 -4571 10963 -26658 -19697 -51274 -68303 -45670 -53359 -54798 -42005 -39364 -12766 28053 9991
7861 9991 -31082 -37186 -48505 -33927 -14467 834 34284 48998 33260 40501 36866 49636 54401
$$ packed form
7949C9949l3352n8256K6418K1322J6896j395j8133k5536K9013M59J3990l3217
7937b1842j2929J6141L730K7669p928J3992K8234R633r142J204O496j4362j5737
7924B5159M6753J2602J254j3017o2724l312p517O446j1027l1621R623J9531k4111
7911c1961j0937N7772M5086K0938l5357l3664l1132m850R194m123P00J5858j0789
7898a3265j9151K4141L3257M6774j1982k9385j694J3384j8708l1550q527k4754
7886d1460L3672K2650J7772m298j8206k8483N500k9994l3862K5662K3474K3002
7874d571J5534l7621O961l1577j7029K2633p689j439J2793K641K6598M0819j8062
7861I991m1073o104j1319J4578J9460J5301L3450J4714j5738P241l635J2770M765
$$ plain form
7848 54401 -10786 -21324 -20638 -3765 -761 29741 53226 60472 73634 71736 29550 37358 46241
7835 46241 20170 -7193 13319 35453 38314 41749 15285 8209 -1247 -20277 14709 10907 -10841
7822 -10841 4317 15708 20245 34662 58627 59855 11042 -8074 -17501 -13794 -42958 -60783 -84365
7809 -84365 -69739 -1258 14506 24094 -18090 -37946 -11194 -17548 -1548 61530 70647 45530
7797 45530 59148 62644 48745 16895 -23390 -31430 -26656 -6488 12333 23629 21332 38465 13016
7784 13016 -7067 -28627 -10096 18813 49886 44961 48576 24385 5800 -29022 -3469 -6323
7772 -6323 9967 9131 24402 20299 31412 39889 18326 24140 27840 4769 1258 -10454 3384
7759 3384 31969 42602 70600 67505 -617 -31609 -40815 -19951 -34664 -4081 -10595 -7240 7715
$$ packed form
7848E4401o5187j0538O86J6873L004L0502K3485P246J3162j898m2186P808Q883
7835D6241k6071k7363K0512K2134K861L435k6464p076r456j9030L4986l802k1748
7822a0841J5158J1391M537J4417K3965J228m8813j9116r427L707k9164j7825k3582
7809h4365J4626O8481J5764R588m2184j9856K6752o354J6000O3078R117k5117
7797D5530J3618L496j3899l1850m0285q040M774K0168J8821J1296k297J7133k5449
7784A3016k0083k1560J8531K8909L1073m925L615k4191j8585l4822K5553k854
7772f323J6290q36J5271m103J1113Q477k1563N814L700k3071l511j1712J3838
7759C384K8585J0633K7998l095o8122l0992r206K0864j4713L0583o514L355J4955
$$ plain form
7746 7715 -4172 -2580 -28126 -37494 -40672 -40661 9019 69075 62669 30057 -2543 5041 27724 14328
7732 14328 12265 24060 19046 9934 -12637 3414 33462 16637 -9003 -15990 -8518 -32826 -56803
7719 -56803 -72556 -26839 -8389 -26880 -35121 9746 12948 14769 20527 30728 15236 -31354 -21647
7706 -21647 29509 59389 39177 15621 -6644 -23715 -4329 17710 36738 57374 23151 5789
7694 5789 21878 43189 67173 31751 -1488 26290 69242 40926 16717 28625 24842 -13859
7682 -13859 -24860 -8409 1032 -3874 2396 25978 35132 51467 43757 35534 31346 56933 72773
7669 72773 49762 13221 4894 7985 22491 32315 -2090 -52617 -48518 -46154 -4925 -17837 -48156
7656 -48156 -506 7520 -5793 -33886 -54129 -5373 32897 29300 25747 48771 15019 -8874
$$ packed form
7746G715j1887J592k5546r368l178J1M9680O0056o406l2612l2600P584K2683j3396
7732A4328k063J1795n014r112k2571J6051L0048j6825k5640o987P472k4308k3977
7719e6803j5753M5717J8450j8491q241M4867L202J821N758J0201j5492m6590R707
7706b1647N1156K9880k0212k3556k2265j7071J9386K2039J9028K0636l4223j7362
7694E789J6089K1311K3984l5422l3239K7778M2952k8316k4209J1908l783l8701
7682a3859j1001J6451R441m906O270K3582R154J6335p710q223m188K5587J5840
7669G2773k3011l6541q327L091J4506R824l4405n0527M099K364M1229j2912l0319
7656d8156M7650Q026j3313k8093k0243M8756L8270l597l553K3024l3752k3893
$$ plain form
7644 -8874 -27634 -29140 -26295 -19463 30891 39640 -2888 -52471 -86583 -101453 -104381 -64924 -14968
7631 -14968 -15555 -62570 -79485 -69644 -65733 -71069 -46744 -31022 -10519 14265 -1153 -19043 -3113
7618 -3113 33262 26466 -8969 35649 51165 28911 6671 6301 34280 -8349 -16046 10611 10970
7605 10970 21059 21099 26559 23514 16149 40413 63928 67653 37286 17007 -8576 -2245 -3552 -7798
7591 -7798 19208 53921 78488 93161 77213 56473 49386 50373 28473 -4558 -5378 18075 33733
7578 33733 61154 47799 -4143 -32394 -41200 -21441 1162 30473 22682 19365 30510 26356 -35362
7565 -35362 -46802 -35128 -8527 -17022 -24988 -39062 5122 61045 39045 32424 56215 66750
7553 66750 59056 23935 19008 34756 39790 10956 4792 29708 5826 -8982 -23945 -10906 11509
$$ packed form
7644h874j8760j506K845O832N0354Q749m2528m9583l4112j4870k928L9457M9956
7631a4968n87m7015j6915R841L911n336K4325J5722K0503K4784j5418j7890J5930
7618c113L6375o796l5435M4618J5516k2254k2240l70K7979m2629p697K6657L59
7605A0970J0089M0N460l045p365K4264K3515L725l0367k0279k5583O331j307m246
7591g798K7006L4713K4567J4673j5948k0740p087R87k1900l3031q20K3453J5658
7578C3733K7421j3355n1942k8251q806J9759K2603K9311p791l317J1145m154o1718
7565c5362j1440J1674K6601q495p966j4074M4184N5923k2000o621K3791J0535
7553F6750p694l5121m927J5748N034k8834o164K4916k3882j4808j4963J3039K2415
$$ plain form
7540 11509 30137 38492 30024 -7467 -10767 -23862 -21789 -13888 -29475 7612 16788 22856 3405
7527 3405 9438 27651 -7111 -61856 19719 85156 41235 -19419 -46084 -40249 -41641 -4626 3738
7514 3738 -12696 25214 35856 23201 10750 -27752 -72423 -66901 -35701 -65294 -75855 -108239
7502 -108239 -75867 -44703 -20253 -29835 -20350 5715 1185 4177 2417 18016 8127 -11530 -5729
7489 -5729 -13675 15654 14466 6601 11751 -9698 577 13386 -4286 -2128 -11275 7458 -1318
7476 -1318 -560 19810 -15208 3425 27377 25561 19477 -1977 28065 27455 17847 20350 6668 3700
7462 3700 18169 29271 63497 92722 103856 103576 46502 52596 29103 9311 33747 24618 9629
7449 9629 -23924 -60152 -35100 -27636 14095 42593 37636 31224 14197 42947 26414 -34490 394
$$ packed form
7540A1509J8628Q355q468l7491l300j3095K073P901j5587L7087R176O068j9451
7527C405O033J8213l4762n4745Q1575O5437m3921o0654k6665N835j392L7015Q364
7514C738j6434L7910J0642j2655j2451l8502m4671N522L1200k9593j0561l2384
7502a08239L2372L1164K4450r582R485K6065m530K992j760J5599r889j9657N801
7489e729p946K9329j188p865N150k1449J0275J2809j7672K158r147J8733q776
7476a318P58K0370l5018J8633K3952j816o084k1454L0042o10r608K503j3682k968
7462C700J4469J1102L4226K9225J1134k80n7074O094k3493j9792K4436r129j4989
7449I629l3553l6228K5052P464M1731K8498m957o412j7027K8750j6533o0904L4884
$$ plain form
7436 394 31408 7623 -7350 -1633 -22905 7801 52865 40378 32466 233 23744 8728 10621
7423 10621 14876 -3202 -27074 -61300 -66229 -17614 -8640 7332 13988 -14030 -45640 -22017 -42221
7410 -42221 -68035 -46055 -18676 -12112 -28608 -19933 28221 33781 16202 27521 34420 28701 -21275
7397 -21275 -10399 548 15207 -16177 -24676 1816 12012 -24201 -9184 1203 -6277 -32358
7385 -32358 -68590 -77056 -1165 30661 5719 -22041 -47778 -41561 -15411 7692 -14501 -48626
7373 -48626 -73251 -92085 -72944 -24212 -22565 -61712 -55466 -41427 -18301 -6046 8562 20167
7361 20167 -3921 -12074 -13617 6066 3293 -15345 -4544 30219 -578 -21308 -3533 1133 4356
7348 4356 16311 44504 68322 52316 34023 -640 -29983 -41175 -46748 -36889 -17189 -55754
$$ packed form
7436C94L1014k3785j4973N717k1272L0706M5064j2487p912l2233K3511j5016J893
7423A0621M255j8078k3872l4226m929M8615Q974J5972O656k8018l1610K3623k0204
7410d2221k5814K1980K7379O564j6496Q675M8154N560j7579J1319O899n719m9976
7397b1275J0876J0947J4659l1384q499K6492J0196l6213J5017J0387p480k6081
7385c2358l6232q466P5891L1826k4942k7760k5737O217K6150K3103k2193l4125
7373d8626k4625j8834J9141M8732J647l9147O246J4039K3126J2255J4608J1605
7361B0167k4088q153j543J9683k773j8638J0801L4763l0797k0730J7775M666L223
7348D356J1955K8193K3818j6006j8293l4663k9343j1192n573R859J9700l8565
$$ plain form
7336 -55754 -67235 -49384 -22464 -12604 6039 29796 21199 -5594 -7035 -29729 -44053 -35573 -3804
7323 -3804 -8753 -52626 -36812 -34248 -71643 -55784 -13486 -31564 -80717 -58413 -24416 -14492 12911
7310 12911 3830 7726 21402 11876 -12480 826 29239 850 -30419 -47309 -59573 -45249
7298 -45249 -13222 -29827 -27725 -34202 -52122 -23361 -31429 14 5979 -36611 -75995 -43137 -11319
7285 -11319 -21746 -29142 -7875 10256 28961 52697 69360 74633 46597 30895 53860 48612
7273 48612 -61 -8165 11268 52627 49584 40453 28977 47625 72218 33825 20492 3653
7261 3653 -13027 -33667 -6248 13751 -17188 -11326 -9778 -14599 -6358 -25569 -2395 2419 -21944
7248 -21944 -36227 -43815 -55866 -3321 37287 41506 39990 21943 4509 -36277 -57830 -12005
$$ packed form
7336e5754j1481J7851K6920R860J8643K3757q597k6793j441k2694j4324Q480L1769
7323c804m949m3873J5814K564l7395J5859M2298j8078m9153K2304L3997R924K7403
7310A2911r081L896J3676r526k4356J3306K8413k8389l1269j6890j2264J4324
7298d5249L2027j6605K102o477j7920K8761q068L1443N965m2590l9384L2858L1818
7285a1319j0427p396K1267J8131J8705K3736J6663N273k8036j5702K2965n248
7273D8612m8673q104J9433M1359l043r131j1476J8648K4593l8393j3333j6839
7261C653j6680k0640K7419J9999l0939N862J548m821Q241j9211K3174M814k4363
7248b1944j4283p588j2051N2545M0608M219j516j8047j7434m0786k1553M5825
$$ plain form
7236 -12005 1928 -18228 -39590 3596 25860 -966 -17564 12229 52663 78241 79305 88218
7224 88218 56078 11281 36979 48679 -16343 -7606 -18714 -21735 7304 -22015 -3126 36488
7212 36488 39848 35418 45469 34521 24125 14284 15628 39438 49429 34974 9973 -5427 -45524
7199 -45524 -14051 22788 12426 -15825 -29290 -96472 -105381 -111000 -94627 -63954 -39802 -27946
7187 -27946 -18874 10795 -6923 -48420 -41369 -35109 -15119 -23472 -44440 -70843 -96638 -109296 -103328
7174 -103328 -83509 -81984 -39388 -8928 29089 25303 -12483 -38452 -50337 -48549 -49829 -57996 -49178
7161 -49178 -12582 -4916 -44630 -72785 -45526 10593 22161 42577 52072 41242 75052 67111
7149 67111 53458 13540 -12262 -57279 -74207 -36479 9363 17439 12328 -25761 -41509 -23800
$$ packed form
7236a2005J3933k0156k1362M3186K2264k6826j6598K9793M0434K5578J064Q913
7224H8218l2140m4797K5698J1700o5022Q737j1108l021K9039k9319J8889L9614
7212C6488L360m430J0051j0948j0396r841J344K3810R991j4455k5001j5400m0097
7199d5524L1473L6839j0362k8251j3465o7182q909n619J6373L0673K4152J1856
7187b7946R072K9669j7718m1497P051O260J9990q353k0968k6403k5795j2658N968
7174a03328J9819J525M2596L0460L8017l786l7786k5969j1885J788j280q167Q818
7161d9178L6596P666l9714k8155K7259N6119J1568K0416R495j0830L3810p941
7149F7111j3653l9918k5802m5017j6928L7728M5842Q076n111l8089j5748J7709
$$ plain form
7137 -23800 -2893 16206 -1724 -35186 -34365 3054 29654 -50780 -117362 -81489 -32935 -11069
7125 -11069 7505 -15546 -39250 -41028 17809 14720 5788 4722 21831 12785 -3625 -3330 3405
7112 3405 -16025 -53030 -26154 17016 26745 64051 66454 44351 45198 67335 59530 51387 39500
7099 39500 39632 52021 38073 11966 6974 18797 39806 40163 -14036 -52211 -93751 -130377 -127769
7086 -127769 -76370 -18223 15812 38732 60217 51609 35468 -8733 -71081 -75723 -60833 -56004
7074 -56004 -34096 -7747 29904 78306 52748 27246 -6035 -71784 -70467 -41533 -9945 -10080
7062 -10080 -39101 -49449 -26583 -20858 -41545 -65853 16871 4308 -34533 -22913 -20308 -12913
7050 -12913 14178 40508 63189 66855 7817 -6129 -8311 -6727 16758 10852 -7132 -46868 -88968
$$ packed form
7137b3800K0907J9099j7930l3462Q21L7419K6600q0434o6582L5873M8554K1866
7125a1069J8574k3051k3704j778N8837l089q932j066J7109r046j6410K95O735
7112C405j9430l7005K6876M3170R729L7306K403k2103Q47K2137p805q143j1887
7099C9500J32J2389j3948k6107m992J1823K1009L57n4199l8175m1540l6626K608
7086a27769N1399N8147L4035K2920K1485q608j6141m4201o2348m642J4890M829
7074e6004K1908K6349L7651M8402k5558k5502l3281o5749J317K8934L1588j35
7062a0080k9021j0348K2866N725k0687k4308Q2724j2563l8841J1620K605P395
7050a2913K7091K6330K2681L666n9038j3946k182J584K3485n906j7984l9736m2100
$$ plain form
7037 -88968 -78495 -82951 -108799 -93391 -84192 -74773 -41124 -15019 9047 13657 22362 16949 16628
7024 16628 12275 2533 40376 39289 38276 20605 -16559 -44390 -62497 -53067 36215 42789 13188
7011 13188 -16307 -20455 -16559 -26467 -8751 2834 -6892 -15056 2527 -6071 12066 -13833 -60370
6998 -60370 -78209 -82925 -44616 -4807 -4225 9112 2009 3822 16751 48291 73180 40410 67394
6985 67394 69609 61363 46311 29366 31783 13039 -1516 -10034 -2132 -6048 -32846 -81472 -100827
6972 -100827 -104635 -78178 -64092 -40731 -9145 22574 26836 20177 -9077 -34445 -51976 -67121
6960 -67121 -7736 3111 -8580 11547 2125 3815 -9272 -31919 -20612 -40170 -50863 -25331
6948 -25331 2137 12929 8514 7447 13638 15306 -24474 -78520 -78376 -57413 -48790 -21645 -16802
$$ packed form
7037h8968J0473m456k5848J5408R199R419L3649K6105K4066M610Q705n413l21
7024A6628m353r742L7843j087j013j7671l7164k7831j8107R430Q9282O574k9601
7011A3188k9495m148L896r908J7716J1585r726q164J7583q598J8137k5899m6537
6998f0370j7839m716L8309L9809N82J3337p103J813J2929L1540K4889l2770K6984
6985F7394K215q246j5052j6945K417j8744j4555q518P902l916k6798m8626j9355
6972a00827l808K6457J4086K3361L1586L1719M262o659k9254k5368j7531j5145
6960f7121N9385J0847j1691K0127r422J690j3087k2647J1307j9558j0693K5532
6948b5331K7468J0792m415j067O191J668l9780n4046J44K0963Q623K7145M843
$$ plain form
6935 -16802 -17002 9803 14495 -33461 -2536 49931 61199 28290 -5514 -26280 -67125 -67950 -23584
6922 -23584 14563 42895 19850 -36661 -67865 -79922 -53684 -17954 13982 7328 17482 -3224
6910 -3224 -8558 -21929 -25028 -38757 -55581 -57444 -86958 -88500 -26916 -15280 -11945 -30891 -60841
6897 -60841 -82954 -79745 -63518 -60157 -80867 -116626 -124632 -117200 -78336 -20274 -26643 -6011 44538
6884 44538 7135 -46171 13237 29811 12133 -37466 -63615 -58254 -64011 -89554 -94605 -81240
6872 -81240 -38540 -19940 -36089 -23065 -5332 -7669 -2794 4139 1203 32581 48491 52357 27003
6859 27003 1288 9752 -16063 -6551 -12459 -49586 -62979 -3734 1233 -26013 -4665 -1395 -6311
6846 -6311 -42534 -43669 -46625 -70259 -43558 -9312 -33457 -46061 -55608 -53380 -33001 -3276 -19817
$$ packed form
6935a6802k00K6805M692m7956L0925N2467J1268l2909l3804k0766m0845q25M4366
6922b3584L8147K8332k3045n6511l1204j2057K6238L5730L1936o654J0154k0706
6910c224n334j3371l099j3729j6824j863k9514j542O1584J1636L335j8946k9950
6897f0841k2113L209J6227L361k0710l5759q006P432L8864N8062o369K0632N0549
6884D4538l7403n3306N9408J6574j7678m9599k6149N361n757k5543n051J3365
6872h1240M2700J8600j6149J3024J7733k337M875O933k936L1378J5910L866k5354
6859B7003k5715Q464k5815R512n908l7127j3393N9245M967k7246K1348L270m916
6846f311l6223j135k956k3634K6701L4246k4145j2604r547K228K0379K9725j6541
$$ plain form
6833 -19817 -46891 -64463 -88307 -55138 -27333 -24219 -15810 -8937 -18518 8285 8173 -37268 -69680
6820 -69680 -98156 -96330 -69960 -14053 -8761 -5502 -35712 -7401 10415 19184 -7629 28781 54621
6807 54621 12857 -34725 -42834 -33243 -3631 6635 -17649 7316 33035 19669 -7244 -36766
6795 -36766 -58041 -86742 -70245 -39801 -2246 -30744 -982 1831 -12819 -70977 -93135 -59017
6783 -59017 -51759 -41232 -47918 -17110 36883 20151 4765 -24397 2933 29265 51207 42725
6771 42725 71697 33631 4802 -9377 6878 15929 -15551 -43205 -45712 -25818 -11154 38056
6759 38056 13890 -7140 19979 25266 26928 8145 787 1047 -36209 -73570 -67319 -48577 -79069
6746 -79069 -79471 -16751 10212 24476 20530 34982 53596 44572 38995 20632 9529 30811 2486
$$ packed form
6833a9817k7074j7572k3844L3169K7805L114Q409O873r581K6803j12m5441l2412
6820f9680k8476J826K6370N5907N292L259l0210K8311J7816Q769k6813L6410K5840
6807E4621m1764m7582q109R591K9612J0266k4284K4965K5719j3366k6913k9522
6795c6766k1275k8701J6497L0444L7555k8498K9762K813j4650n8158k2158L4118
6783e9017P258J0527o686L0808N3993j6732j5386k9162K7330K6332K1942q482
6771D2725K8972l8066k8829j4179J6255R051l1480k7654k507J9894J4664M9210
6759C8056k4166k1030K7119N287J662j8783p358K60l7256l7361O251J8742l0492
6746g9069m02O2720K6963J4264l946J4452J8614r024n577j8363j1103K1282k8325
$$ plain form
6733 2486 -6138 -41841 -41712 -19840 12662 21081 12030 20466 17515 33989 77163 61098 42384
6720 42384 23431 35060 47840 69649 80604 31142 1206 2238 -43532 -32216 -15302 -15137
6708 -15137 12466 1145 -16802 -18527 -36358 -54132 -24650 -37017 -41916 -9214 -9892 -7464 11429
6695 11429 -25095 -35768 -4823 1169 8457 25789 -9391 -62244 -26148 25485 45522 60129
6683 60129 80884 81488 37797 32744 38970 23819 29783 29923 29169 -8698 -33548 -25764 -7482 -23927
6669 -23927 -7472 17181 9412 -10210 -6570 -10759 -615 -47015 -36834 -31605 -32971 -9751 -40488
6656 -40488 -48546 -61123 -66710 -54246 -29408 -56921 -67130 -44853 -46523 -37877 -52801 -57695 -56865
6643 -56865 -57200 -85419 -81937 -75500 -68956 -59483 -11204 12511 16721 4606 9798 53989 118628
$$ packed form
6733B486q624l5703J29K1872L2502Q419r051Q436k951J6474M3174j6065j8714
6720D2384j8953J1629J2780K1809J0955m9462k9936J032m5770J1316J6914J65
6708a5137K7603j1321j7947j725j7831j7774K9482j2367m899L2702o78K428J8893
6695A1429l6524j0673L0945N992P288J7332l5180n2853L6096N1633K0037J4607
6683F0129K0755O04m3691n053O226j5151N964J40p54l7867k4850P784J8282j6445
6669b3927J6455K4653p769j9622L640m189J0144m6400J0181N229j366K3220l0737
6656d0488q058j2577n587J2464K4838k7513j0209K2277j670Q646j4924m894Q30
6643e6865l35k8219L482O437O544R473M8279K3715M210j2115N192M4191O4639
$$ plain form
6630 118628 197763 185431 137554 86174 85753 71704 69140 120759 140471 144895 188325 228196
6618 228196 282450 338830 485899 635346 850906 1279747 2122368 3566575 5775476 7916115
6608 7916115 7337014 5582906 3486703 2068471 1376108 1000010 788679 614009 427690
6599 427690 339371 283196 214819 165076 158439 132034 122697 102722 103676 141442 205740 327571
6587 327571 355458 265912 145933 76644 20678 -9130 2682 24325 49958 -9649 11588
6576 11588 28980 22651 171 7171 29709 70429 107766 105072 91467 40563 -34125 -35987 21255
6563 21255 54670 31700 -1908 -1419 -25794 -14655 18856 15521 -26400 -10326 10543 -21592
6551 -21592 -36487 -36076 -52219 -65659 -55330 -50480 5323 -25774 -52849 -58452 -71291 -60669 -55743
$$ packed form
6630A18628P9135j2332m7877n1380m21j4049k564N1619J9712M424M3430L9871
6618B28196N4254N6380J47069J49447K15560M28841Q42621J444207K208901K140639
6608G916115n79101j754108k096203j418232o92363l76098k11331j74670j86319
6599D27690q8319n6175o8377m9743o637k6405r337j9975R54L7766O4298J21831
6587C27571K7887q9546j19979o9289n5966k9808J1812K1643K5633n9607K1237
6576A1588J7392o329k2480P000K2538M0720L7337k694j3605n0904p4688j862N7242
6563B1255L3415k2970l3608M89k4375J1139L3511l335m1921J6074K0869l2135
6551b1592j4895M11j6143j3440J0329M850N5803l1097k7075n603j2839J0622M926
$$ plain form
6538 -55743 -59540 -77193 -49936 -13913 -24144 5085 5990 12965 63323 65902 44428 -17070 -12704
6525 -12704 966 44700 51399 29604 45464 71893 70689 24010 -8795 -18441 -25644 -18970 17122
6512 17122 47608 36702 44583 3433 -14010 12274 8557 -10187 -50881 -83848 5582 3733
6500 3733 -169 3701 4643 -40 -15258 -23507 -19494 6047 20492 -4059 -6818 -22712 -15904 -36649
6486 -36649 -34359 -14749 -57631 -87041 -64177 -24802 -65554 -82489 -60778 -67141 -82030 -94242
6474 -94242 -43344 -24068 -41989 -48715 -28850 -14156 -40429 -87690 -71953 -52208 -21723 6673
6462 6673 4121 -6260 1884 -9082 -50539 -76242 -65348 -17756 26226 41703 38691 -3697 -31981
6449 -31981 -18584 -36309 -13628 -23642 -2556 32799 39764 15413 -19044 -9851 -24658 -25074 -17922
$$ packed form
6538e5743l797j7653K7257L6023j0231K9229R05O975N0358K579k1474o1498M366
6525a2704J3670M3734O699k1795J5860K6429j204m6679l2805r646p203O674L6092
6512A7122L0486j0906P881m1150j7443K6284l717j8744m0694l2967Q9430j849
6500C733l902L870R42m683j5218q249M013K5541J4445k4551k759j5894O808k0745
6486c6649K290J9610m2882k9410K2864L9375m0752j6935K1711o363j4889j2212
6474i4242N0898J9276j7921o726J9865J4694k6273m7261J5737J9745L0485K8396
6462F673k552j0381Q144j0966m1457k5703J0894M7592M3982J5477l012m2388k8284
6449c1981J3397j7725K2681j0014K1086L5355O965k4351l4457R193j4807m16P152
$$ plain form
6436 -17922 -7282 21544 34333 16456 -12028 -19612 -12811 6439 7236 2013 -717 -7168 -34565
6423 -34565 -24627 -26029 -5183 -1269 -28573 -10608 9635 3639 -18581 -23767 31841 35808 29043
6410 29043 36026 61560 7962 -48726 -18738 5604 -33628 -57238 -52949 -10184 -34590 -7254
6398 -7254 24964 -3688 -55733 -57075 -37667 -11950 -63499 -62154 -26789 -19198 -72112 -100985 -73651
6385 -73651 -35090 -29245 -48400 -60419 -82180 -99379 -82986 -50794 -27842 1109 13985 -5344
6373 -5344 12099 29975 16401 19844 8558 -3212 -25182 -48779 -64291 -76766 -76664 -78399 -13322
6360 -13322 -24300 -49336 -40315 -14973 -1666 -14630 8922 42581 52100 18027 -33603 -79472
6348 -79472 -70058 -57778 -42146 -20514 338 -41096 -55985 -53083 3705 15492 -418 -33256
$$ packed form
6436a7922J0640K8826J2789j7877k8484p584O801J9250P97n223k730o451k7397
6423c4565R938j402K0846L914k7304J7965K0243n996k2220n186N5608L967o765
6410B9043O983K5534n3598n6688K9988K4342l9232k3610M289M2765k4406K7336
6398g254L2218k8652n2045j342J9408K5717n1549J345L5365P591n2914k8873K7334
6385g3651L8561N845j9155j2019k1761j7199J6393L2192K2952K8951J2876j9329
6373e344J7443J7876j3574L443j1286j1770k1970k3597j5512j2475J02j735O5077
6360a3322j0978k5036R021K5342J3307j2964K3552L3659R519l4073n1630m5869
6348g9472R414J2280J5632K1632K0852m1434j4889K902N6788J1787j5910l2838
$$ plain form
6336 -33256 -99374 -118797 -83181 -56189 -53968 -22602 -11254 -18592 -21508 -27355 -38457 14751 7568
6323 7568 27765 18917 9996 24866 -13303 -61631 -99396 -95853 -90479 -33698 -28572 -37307 -26502
6310 -26502 1881 10437 5947 -17268 -52849 -58638 -32688 -68533 -40700 -16290 5860 -9725
6298 -9725 -46334 -11138 -10393 4358 29576 52304 48549 39745 54212 59020 27794 7478 16489
6285 16489 42346 45619 24172 3077 6851 32876 18611 24938 27748 21358 39201 34907 27830
6272 27830 29218 21692 12048 -20006 -10701 19101 51913 15831 15612 3780 -34335 -79792 -85883
6259 -85883 -59739 -60943 -2615 19732 9704 38973 34646 19466 -25685 -49338 -33067 -58091
6247 -58091 -80169 -65937 -27676 -34491 -2097 -25248 -41617 -58416 -56877 -42694 -53340 -8131
$$ packed form
6336c3256o6118j9423L5616K6992K221L1366J1348p338k916n847j1102N3208p183
6323G568K0197q848q921J4870l8169m8328l7765L543N374N6781N126q735J0805
6310b6502K8383Q556m490k3215l5581n789K5950l5845K7833K4410K2150j5585
6298i725l6609L5196P45J4751K5218K2728l755q804J4467M808l1226k0316R011
6285A6489K5857L273k1447k1095L774K6025j4265O327K810o390J7843m294p077
6272B7830J388p526r644l2054R305K9802L2812l6082k19j1832l8115m5457o091
6259h5883K6144j204N8328K2347j0028K9269m327j5180m5151k3653J6271k5024
6247e8091k2078J4232L8261o815L2394k3151j6369j6799J539J4183j0646M5209
$$ plain form
6235 -8131 10177 -19238 -33035 -18739 15525 36753 13886 17969 14093 -1753 15829 19728 38901
6222 38901 65245 12380 -51191 -18435 -12551 -21768 -23877 -40188 -49902 -45400 -1853 21079 -14116
6209 -14116 -40881 -35054 -15877 -46769 -79747 -73202 -48315 -37850 -13995 1425 -9641 16325
6197 16325 37332 16151 26812 62259 71632 45072 47277 72641 64579 50270 38543 -37233
6185 -37233 -83863 -54911 7800 13922 -30673 -51275 -72238 -49098 -53099 -46309 -68260 -53673
6173 -53673 -10334 13853 16108 11238 -8938 -25019 -28384 -29517 -11558 -33181 -27222 -4818 -2387
6160 -2387 -11491 -40353 5479 22195 416 -7071 -35885 -62669 -60630 -58888 -72852 -79914 -76376
6147 -76376 -104890 -91576 -75605 -80461 -68052 -38922 -22560 -11988 760 -16208 -88114 -124365
$$ packed form
6235h131J8308k9415j3797J4296L4264K1228k2867M083l876j5846J7582L899J9173
6222C8901K6344n2865o3571L2756N884r217k109j6311r714M502M3547K2932l5195
6209a4116k6765N827J9177l0892l2978O545K4887J0465K3855J5420j1066K5966
6197A6325K1007k1181J0661L5447R373k6560K205K5364q062j4309j1727p5776
6185c7233m6630K8952O2711O122m4595k0602k0963K3140m001O790k1951J4587
6173e3673M3339K4187K255m870k0176j6081l365j133J7959k1623N959K2404K431
6160b387r104k8862M5832J6716k1779p487k8814k6784K039J742j3964p062L538
6147g6376k8514J3314J5971m856J2409K9130J6362J0572J2748j6968p1906l6251
$$ plain form
6135 -124365 -87879 -40385 -65106 -74652 -86468 -101498 -44299 -7784 16777 11534 15868 46372
6123 46372 13795 -65267 -76323 -68819 -58306 -38499 -29045 -46533 -87204 -45772 14545 -8026
6111 -8026 -18250 -33416 -50002 -18705 17876 43283 20228 -51024 -53984 -41480 -29513 9825
6099 9825 19071 -14387 -30255 -22684 -60994 -72713 -63274 -29129 28467 57583 20 -36410 -37418
6086 -37418 -61929 -48425 -1964 12015 -24695 -38577 -11405 21923 -17013 -30752 -17960 16774
6074 16774 23283 -3337 -17920 9204 46384 34402 18160 2332 -10752 8785 -10665 -12412
6062 -12412 419 -12556 -31046 -39112 -51171 -55464 -109835 -129321 -111793 -90648 -75475 -57453
6050 -57453 -54178 -33965 -45734 -58895 -28369 17087 1753 29306 -1491 -56289 -45061 -34468
$$ packed form
6135a24365L6486M7494k4721r546j1816j5030N7199L6515K4561n243M334L0504
6123D6372l2577p9062j1056P504J0513J9807R454j7488m0671M1432O0317k2571
6111h026j0224j5166j6586L1297L6581K5407k3055p1252k960J2504J1967L9338
6099I825R246l3458j5868P571l8310j1719R439L4145N7596K9116n7563l6430j008
6086c7418k4511J3504M6461J3979l6710j3882K7172L3328l8936j3739J2792L4734
6074A6774O509k6620j4583K7124L7180j1982j6242j5828j3084J9537j9450j747
6062a2412J2831j2975j8490q066j2059m293n4371j9486J7528K1145J5173J8022
6050e7453L275K0213j1769j3161L0526M5456j5334K7553l0797n4798J1228J0593
$$ plain form
6038 -34468 -26804 62 -258 -26328 -48407 -75467 -49714 -17759 -3103 3151 -3278 -28203 -70594
6025 -70594 -38624 -24415 7224 5931 503 -14081 6146 19447 9824 33283 7575 -48298
6013 -48298 -92143 -27654 -10274 -21053 -28018 -24411 -8748 -7986 17420 6072 -17938 16286 41232
6000 41232 22635 27734 -6241 19449 8344 -43388 -51490 -50208 -34784 -16449 -18625 -34928 -52100
5987 -52100 -47660 -56921 -61173 -64662 -89819 -112980 -126138 -105505 -75005 -54601 -23538 12063 4225
5974 4225 -37801 -57044 -19911 -11715 -27533 -56358 -21032 -8568 -14135 -29322 -37516 -63271 -58464
5961 -58464 -26109 26802 13294 218 -13549 18399 28793 39531 28975 -2217 -28341 3953
5949 3953 -13182 -51357 -55569 -55264 -54001 -67380 -27186 15457 41520 43149 -24502 -32540 5791
$$ packed form
6038c4468P664K6866l20k6070k2079k7060K5753L1955J4656O254o429k4925m2391
6025g0594L1970J4209L1639j293n428j4584K0227J3301r623K3459k5708n5873
6013d8298m3845O4489J7380j0779o965L607J5663P62K5406j1348k4010L4224K4946
6000D1232j8597N099l3975K5690j1105n1732q102J282J5424J8335k176j6303j7172
5987e2100M440r261m252l489k5157k3161j3158K0633L0500K0404L1063L5601p838
5974D225m2026j9243L7133Q196j5818k8825L5326J2464n567j5187q194k5755M807
5961e8464L2355N2911j3508j3076j3767L1948J0394J0738j0556l1192k6124L2294
5949C953j7135l8175m212L05J263j3379M0194M2643K6063J629o7651q038L8331
$$ plain form
5936 5791 -3209 10829 34606 16215 -29222 -58567 -46172 -26695 10151 19726 -3101 4111 12011
5923 12011 27099 103730 83567 13283 34582 10336 -3324 -22583 -35890 -36790 -10214 -62
5911 -62 -30178 -95984 -94146 -49815 -40570 -19349 22954 20047 1421 -8503 13145 -10875 -24483
5898 -24483 -38433 -34025 -58117 -58670 -44983 -27424 -38369 -26241 -51898 -80684 -92554 -46797
5886 -46797 33238 21683 914 -17835 -47357 -67528 -96740 -97005 -78100 -72983 -38990 -5432
5874 -5432 -8246 -21332 -53372 -82821 -101114 -72893 -15395 13027 43311 43084 2233 -50979 -81278
5861 -81278 -63086 -86581 -59738 -41842 -39323 -21769 -10464 -11237 -3843 8770 -34513 -44494 -51485
5848 -51485 -26854 -10450 -5977 -28636 -47650 -27799 3929 18869 23713 26446 4231 -13912
$$ packed form
5936E791r000J4038K3777j8391m5437k9345J2395J9477L6846R575k2827P212P900
5923A2011J5088P6631k0163p0284K1299k4246j3660j9259j3307r00K6576J0152
5911f2l0116o5806J838M4331R245K1221M2303k907j8626r924K1648k4020j3608
5898b4483j3950M408k4092n53J3687J7559j0945J2128k5657k8786j1870M5757
5886d6797Q0035j1555k0769j8749k9522k0171k9212k65J8905N117L3993L3558
5874e432k814j3086l2040k9449j8293K8221N7498K8422L0284k27m0851n3212l0299
5861h1278J8192k3495K6843J7896K519J7554J1305p73P394J2613m3283r981o991
5848e1485K4631J6404M473k2659j9014J9851L1728J4940M844K733k2215j8143
$$ plain form
5836 -13912 8431 654 11783 -5384 -39008 -79443 -64490 -42626 -39827 -67537 -80467 -35940
5824 -35940 -8916 -24621 -26948 2922 41179 10933 -32064 -52372 -6466 -36440 -68759 -75988
5812 -75988 -91832 -74553 -12831 39147 56709 24768 5906 6411 -2041 520 12001 4151 14556
5799 14556 39359 31180 3879 -24555 -22584 -46273 -44455 -41739 -61148 -80838 -82440 -57199 -67145
5786 -67145 -43584 -24559 -35939 -18619 6626 -10663 -12062 -4465 -38551 -44330 -24036 -58
5774 -58 -6786 23722 46273 66197 47761 -65620 -67349 -50476 -58598 -70338 -46186 -12237 -12113
5761 -12113 -25575 -31286 -39277 -33693 -34125 -21675 29514 31015 -3512 -10473 -26474 -36150 -54936
5748 -54936 -26069 23753 23188 -423 2814 7838 15686 -2034 -61181 -53620 -38460 -1626 17727
$$ packed form
5836a3912K2343p777J1129j7167l3624m0435J4953K1864K799k7710j2930M4527
5824c5940K7024j5705k327K9870L8257l0246m2997k0308M5906k9974l2319p229
5812g5988j5844J7279O1722N1978J7562l1941j8862N05q452K561J1481p850J0405
5799A4556K4803q179k7301k8434J971k3689J818K716j9409j9690j602K5241r946
5786f7145K3561J9025j1380J7320K5245j7289j399P597l4086n779K0294K3978
5774e8o728L0508K2551J9924j8436j13381j729J6873q122j1740K4152L3949J24
5761a2113j3462n711p991N584m32J2450N1189J501l4527o961j6001r676j8786
5748e4936K8867M9822n65k3611L237N024P848j7720n9147P561J5160L6834J9353
$$ plain form
5735 17727 -3909 -7028 13074 558 -39029 -17420 37726 57651 15742 -11880 -12327 -910
5723 -910 -56901 -47962 7199 9556 5241 -9439 -47375 -44063 -34013 -8228 14689 28086 16873
5710 16873 -18977 -8425 19180 32702 68668 31510 9246 -3952 -12072 -1138 -23257 -9999
5698 -9999 -2932 -8589 -22746 -11435 -33198 -41555 -73445 -76271 -53837 -40542 -13480 -29497 -42082
5685 -42082 -32188 4902 -6059 -20111 -2962 -8789 -13356 -25380 -14973 8897 -41881 -63609
5673 -63609 -45737 -41253 -20654 -21584 -679 34553 -17340 -61556 -32514 -20085 -34088 -33029 -12548
5660 -12548 8871 -15101 -31843 -72183 -83383 -77937 -60486 -39523 48 10887 5445 21709
5648 21709 15878 -30134 -32487 -35793 -20764 -25475 -37898 -54835 -67491 -76865 -111632 -102139 -83556
$$ packed form
5735A7727k1636l119K0102j2516l9587K1609N5146J9925m1909k7622m47J1417
5723i10n5991Q939N5161K357m315j4680l7936L312J0050K5785K2917J3397j1213
5710A6873l5850J0552K7605J3522L5966l7158k2264j3198q120J0934k2119J3258
5698i999P067n657j4157J1311k1763q357l1890k826K2434J3295K7062j6017j2585
5685d2082R894L7090j0961j4052J7149n827m567j2024J0407K3870n0778k1728
5673f3609J7872M484K0599r30K0905L5232n1893m4216K9042J2429j4003J059K0481
5660a2548K1419k3972j6742m0340j1200N446J7451K0963L9571J0839n442J6264
5648B1709n831m6012k353l306J5029m711j2423j6937j2656r374l4767R493J8583
$$ plain form
5635 -83556 -94483 -43913 -17917 -19237 -3560 -34312 -52122 -22611 21530 -12570 -30997 -69331
5623 -69331 -69571 -49747 -43589 -12687 -31561 -61276 -72312 -82144 -69908 -47741 -18276 8309 -17874
5610 -17874 -53461 -68469 -70640 -69134 -80913 -85939 -61710 -40908 -60216 -53388 -18013 -51 -28669
5597 -28669 -73120 -67981 -64882 -64181 -58538 -63297 -73854 -38269 3410 -3368 -40227 -63011 -29803
5584 -29803 -6853 7977 3472 -30738 -12499 14503 -2633 41065 48211 -9637 -10179 -22509 -35868
5571 -35868 -44482 -30415 13449 -10236 -30661 20989 7851 -21524 -35613 -36152 -42966 -48449 -44080
5558 -44080 -53551 -49132 -40184 -28846 -56158 -29336 -46109 -70773 -108411 -116865 -100013 -30886 -25567
5545 -25567 -41783 -43361 -11758 21208 40500 26103 14341 23930 17320 -7928 -55173 -43724
$$ packed form
5635h3556j0927N0570K5996j320J5677l0752j7810K9511M4141l4100j8427l8334
5623f9331k40J9824O158L0902j8874k9715j1036r832J2236K2167K9465K6585k6183
5610a7874l5587j5008k171J506j1779n026K4229K0802j9308O828L5375J7962k8618
5597b8669m4451N139L099P01N643m759j0557L5585M1679o778l6859k2784L3208
5584b9803K2950J4830m505l4210J8239K7002j7136M3698P146n7848n42j2330j3359
5571c5868q614J4067M3864k3685k0425N1650j3138k9375j4089n39o814n483M369
5558d4080r471M419Q948J1338k7312K6822j6773k4664l7638q454J6852O9127N319
5545b5567j6216j578L1603L2966J9292j4397j1762R589o610k5248m7245J1449
$$ plain form
5533 -43724 -60360 -48565 18496 9582 -27217 -29790 -43900 -56041 -16180 -19200 -30530 -67991
5521 -67991 -67089 -76103 -31049 -268 -28138 -29539 -31678 -49224 -81057 -93079 -54752 -41713 -24160
5508 -24160 10354 -20916 -22018 -2035 -23069 -33358 -20236 34599 42565 37148 60528 15020
5496 15020 -32238 -35435 -20626 -27478 -44280 -73883 -71220 -38459 -2097 24958 -5388 -17369
5484 -17369 -23757 -16270 -30578 -33020 -57277 -98800 -91527 -104805 -83311 -26166 27238 22979 13825
5471 13825 16622 56490 80360 78378 44726 27961 4142 13934 28414 16500 4532 -14901
5459 -14901 -11964 -21224 -21419 -29315 -45882 -45545 -15225 -12694 -35443 -18109 21352 -4369 -37706
5446 -37706 -52647 -28289 17998 -13856 -10778 -1717 28230 14433 3225 16157 -10664 -49232
$$ packed form
5533d3724j6636J1795O7061q914l6799k573j4110j2141L9861l020j1330l7461
5521f7991R02r014M5054L0781k7870j401k139j7546l1833j2022L8327J3039J7553
5508b4160L4514l1270j102J9983k1034j0289J3122N4835P966n417K3380m5508
5496A5020m7258l197J4809o852j6802k9603K663L2761L6362K7055l0346j1981
5484a7369o388P487j4308k442k4257m1523P273j3278K1494N7145N3404m259r154
5471A3825K797L9868K3870j982l3652j6765k3819R792J4480j1914j1968j9433
5459a4901K937r260j95p896j6567L37L0320K531k2749J7334L9461k5721l3337
5446c7706j4941K4358M6287l1854L078R061K9947j3797j1208J2932k6821l8568
$$ plain form
5434 -49232 -39879 -51497 -81455 -66592 -42481 -18294 -12207 -22675 -63826 -47176 -38167 -60412
5422 -60412 -49081 -51213 -64525 -61506 -45138 3282 -9798 -28284 -34633 -15058 25180 26774 18688
5409 18688 20303 -22703 -36464 -22455 -16415 -32442 -14050 14793 15219 25414 16237 34220 11278
5396 11278 -54461 -87045 -79562 -31783 -2621 30430 76803 60435 55900 50948 24899 -12534
5384 -12534 -17166 31433 41739 5583 -7113 -6582 16702 58284 31860 9345 20578 37135
5372 37135 21873 23817 24549 66109 66595 28955 28568 58747 38568 17667 -283 -25367 -22210
5359 -22210 -12404 -43064 -41565 34462 32723 -9589 -11813 -28968 -32579 -28313 -19527 -13676 -318
5346 -318 -45298 -44666 -5310 -18550 -61204 -39080 -33995 -30617 -41541 -23377 33134 56755 69751
$$ packed form
5434d9232R353j1618k9958J4863K4111K4187O087j0468m1151J6650R009k2245
5422f0412J1331k132j3312L019J6368M8420j3080j8486o349J9575M0238J594q086
5409A8688J615m3006j3761J4009O040j6027J8392K8843M26J0195r177J7983k2942
5396A1278o5739l2584P483M7779K9162L3051M6373j6368m535m952k6049l7433
5384a2534m632M8599J0306l6156j2696N31K3284M1582k6424k2515J1233J6557
5372C7135j5262J944P32M1560M86l7640l87L0179k0179k0901j7950k5084L157
5359b2210R806l0660J499P6027j739m2312k224j7155l611M266Q786N851J3358
5346c18m4980O32L9356j3240m2654K2124N085L378j0924J8164N6511K3621J2996
$$ plain form
5333 69751 51831 3716 10054 33532 37183 9509 -24132 12587 17124 9840 -10104 -18002 -8158
5320 -8158 -6063 -11940 -12949 12738 58950 55354 29566 26107 41285 17474 -28929 -31809 15416
5307 15416 31055 14410 -32824 -57981 -57353 -52832 -66384 -85226 -82146 -56150 -20176 672 -19115
5294 -19115 -17303 -12294 -40676 -33385 -11799 1653 -27371 -45400 -27047 -15343 -30419 -48552
5282 -48552 -57325 -51804 -16754 -10820 -34504 -72871 -75837 -53761 -25408 -5304 -16034 -33174 -35920
5269 -35920 -27141 -36518 -27248 -9156 3915 8753 13537 24412 58071 71094 35244 -9852 -1670
5256 -1670 -5121 -2677 15299 -814 -3610 29813 56047 25898 -15786 4034 20657 17048 46975
5243 46975 33612 22960 -5261 -29638 -43319 -58655 -42495 -34355 -57917 -63023 -70252 -80528
$$ packed form
5333F9751j7920m8115O338K3478L651k7674l3641L6719M537p284j9944p898R844
5320h158K095n877j009K5687M6212l596k5788l459J5178k3811m6403k880M7225
5307A5416J5639j6645m7234k5157O28M521j3552j8842L080K5996L5974K0848j9787
5294a9115J812N009k8382P291K1586J3452k9024j8029J8353J1704j5076j8133
5282d8552q773N521L5050N934k3684l8367k966K2076K8353K0104j0730j7140k746
5269c5920Q779r377R270J8092J3071M838M784J0875L3659J3023l5850m5096Q182
5256a670l451K444J7976j6113k796L3423K6234l0149m1684J9820J6623l609K9927
5243D6975j3363j0652k8221k4377j3681j5336J6160Q140k3562n106p229j0276
$$ plain form
5231 -80528 -80213 -52388 -28006 -32498 -84475 -80801 -52475 -16852 -29247 -60112 -52733 -28550 11888
5218 11888 24828 14597 -6292 -1991 -39698 -37305 -28243 -45058 -38588 -40842 -34933 -56449 -61180
5205 -61180 -47772 -30563 -10492 -6542 -6590 -12267 -51328 -55964 -25960 -11576 -17280 30309 55245
5192 55245 17127 43 -39916 -49114 -66594 -59043 -19947 -2323 -21660 -25144 -14340 -35970
5180 -35970 -51985 -22033 -53133 -75425 -31169 -31795 -37003 -22599 11037 3683 8144 26126 5019
5167 5019 8640 20531 49995 52434 61173 20109 -19748 -61396 -64476 -58606 -77096 -84380 -69108
5154 -69108 -28517 9334 11817 831 -26690 -25057 761 527 -22892 -67098 -44891 -24457 -11555
5141 -11555 -20670 3832 -9511 -42113 -39287 -76776 -77531 -79423 -49343 -48085 -61078 -46563 -22404
$$ packed form
5231h0528L15K7825K4382m492n1977L674K8326L5623j2395l0865P379K4183M0438
5218A1888J2940j0231k0889M301l7707K393R062j6815O470k254N909k1516m731
5205f1180J3408J7209K0071L950m8n677l9061m636L0004J4384n704M7589K4936
5192E5245l8118j7084l9959r198j7480P551L9096J7624j9337l484J0804k1630
5180c5970j6015K9952l1100k2292M4256o26n208J4404L3636p354M461J7982k1107
5167E019L621J1891K9464K439Q739m1064l9857m1648l080N870j8490p284J5272
5154f9108M0591L7851K483j0986k7521J633K5818k34k3419m4206K2207K0434J2902
5141a1555r115K4502j3343l2602K826l7489p55j892L0080J258j2993J4515K4159
$$ plain form
5128 -22404 -2589 32405 45861 22259 44702 35580 -4139 -4888 -24625 -17802 36086 11810 -18488
5115 -18488 -39161 -64639 -80714 -36657 28885 36942 35584 13389 -9069 -19018 -55449 -83207
5103 -83207 -83560 -86570 -131477 -102883 -50714 -6657 -44300 -60602 -11675 -80 -40426 -41950 -47496
5090 -47496 -53446 -3267 -4302 -25819 -15811 10206 17614 -1925 -29504 -36692 -64452 -62760 -16978
5077 -16978 34971 15855 -63306 -104607 -131751 -125409 -122173 -90145 -49667 18020 21887 -30921
5065 -30921 -48174 -44259 -56522 -50882 -33353 20441 23000 8059 1409 -9537 -4840 14341 47539
5052 47539 -7532 -32291 40 17068 7775 -4582 -9301 -14944 34660 54506 50896 35596 49403
5039 49403 22134 -4677 20747 9555 -3023 -5399 6451 41518 35817 28062 -1929 -25201
$$ packed form
5128b2404J9815L4994J3456k3602K2443r122l9719p49j9737O823N3888k4276l0298
5115a8488k0673k5478j6075M4057O5542Q057j358k2195k2458r949l6431k7758
5103h3207l53l010m4907K8594N2169M4057l7643j6302M8927J1595m0346j524n546
5090d7496n950N0179j035k1517J0008K6017P408j9539k7579p188k7760J692M5782
5077a6978N1949j9116p9161m1301k7144O342L236L2028M0478O7687L867n2808
5065c0921j7253L915j2263N640J7529N3794K559j4941o650j0946M697J9181L3198
5052D7539n5071k4759L2331J7028r293j2357m719n643M9604J9846l610j5300J3807
5039D9403k7269k6811K5424j1192j2578k376J1850L5067n701p755k9991k3272
$$ [...]
##END NTUPLES=NMR SPECTRUM
##END=
