##TITLE=Analysis number 330061
Compound Code cc 59004
Book Reference 546/52
Project Code adrs
Chemist Name craigr
##JCAMPDX= 6.0         $$ Bruker NMR JCAMP-DX V2.0
##DATA TYPE= NMR SPECTRUM
##DATA CLASS= NTUPLES
##ORIGIN= Bruker BioSpin GmbH
##OWNER= nmr
$$ XWIN-NMR		Version 3.5
$$ Tue Oct 23 14:36:23 2007 GMT Daylight Time (UT+1h)  MAYBRIDGE\nmr@NMR_250MHZ
##.OBSERVE FREQUENCY= 250.131544655141
##.OBSERVE NUCLEUS= ^1H
##.ACQUISITION MODE= SIMULTANEOUS (DQD)
##.ACQUISITION SCHEME= undefined
##.AVERAGES= 16
##.DIGITISER RES= 18
##SPECTROMETER/DATA SYSTEM= dpx250
##.PULSE SEQUENCE= zg30
##.SOLVENT NAME= CDCl3
##.SHIFT REFERENCE= (INTERNAL, CDCl3, 0, 16.522)
##AUDIT TRAIL= $$ (NUMBER, WHEN, WHO, WHERE, WHAT)
$$ ##TITLE= Audit trail, XWIN-NMR		Version 3.5
$$ ##JCAMPDX= 5.01
$$ ##ORIGIN= Bruker BioSpin GmbH
$$ ##OWNER= nmr
$$ C:\u/data/dgb/nmr/ADRS/1190/pdata/1/auditp.txt
$$ ##AUDIT TRAIL=  $$ (NUMBER, WHEN, WHO, WHERE, WHAT)
(   1,<2007-10-23 14:35:56.32 +100>,<MAYBRIDGE\nmr>,<NMR_250MHZ>,
      <created by zg, POWCHK disabled, PULCHK disabled
       configuration hash MD5:
       76 6E 9A 78 1E 09 19 81 EC 84 63 8F B0 6A 59 2D
       data hash MD5: 64K
       0B E4 B5 E5 DB D3 5E 43 8F EF E7 97 08 CC 78 F2>)
(   2,<2007-10-23 14:36:12.21 +100>,<MAYBRIDGE\nmr>,<NMR_250MHZ>,
      <Start of raw data processing
       ef LB = 0.3 FT_mod = 6 PKNL = 1 SI = 32K 
       data hash MD5: 32K
       1F 48 5C FF 1D 46 65 82 E7 2A 7A 0A 09 8B AB 5E>)
(   3,<2007-10-23 14:36:13.87 +100>,<MAYBRIDGE\nmr>,<NMR_250MHZ>,
      <apk 
       data hash MD5: 32K
       A0 03 77 09 B1 91 3A 3E DB 97 EF B1 8D 79 0F 90>)
(   4,<2007-10-23 14:36:14.60 +100>,<MAYBRIDGE\nmr>,<NMR_250MHZ>,
      <abs ABSG = 5 
       data hash MD5: 32K
       4F 54 D3 E3 50 B3 FC 62 11 6E E3 16 06 7C 02 F7>)
$$ ##END=
$$ 
$$ hash MD5
$$ 0E 41 12 0F 52 26 C8 2E 04 96 5C A8 15 50 19 0C
##$RELAX= 
##$RELAX= 
##$RELAX= 
##$RELAX= 
##$RELAX= 
##$RELAX= 
##$RELAX= 
$$ Bruker specific parameters
$$ --------------------------
##$DU= <C:\u>
##$EXPNO= 1190
##$NAME= <ADRS>
##$PROCNO= 1
##$TYPE= <nmr>
##$USER= <dgb>
##$AMP= (0..31)
100 100 100 100 100 100 100 100 100 100 100 100 100 100 100 100 100 100 
100 100 100 100 100 100 100 100 100 100 100 100 100 100 
##$AQSEQ= 0
##$AQ_mod= 3
##$AUNM= <au_zg>
##$AUTOPOS= <28 >
##$BF1= 250.13
##$BF2= 250.13
##$BF3= 250.13
##$BF4= 250.13
##$BF5= 500.13
##$BF6= 500.13
##$BF7= 500.13
##$BF8= 500.13
##$BYTORDA= 1
##$CFDGTYP= 0
##$CFRGTYP= 5
##$CHEMSTR= <none>
##$CNST= (0..31)
1 1 145 1 1 1 1 1 1 1 1 1 1 1 1 1 1 1 1 1 1 1 1 1 1 1 1 1 1 1 1 1 
##$CPDPRG= <>
##$CPDPRG1= <>
##$CPDPRG2= <>
##$CPDPRG3= <>
##$CPDPRG4= <mlev>
##$CPDPRG5= <mlev>
##$CPDPRG6= <mlev>
##$CPDPRG7= <mlev>
##$CPDPRG8= <mlev>
##$CPDPRGB= <>
##$CPDPRGT= <>
##$D= (0..31)
0 1 0 0 0 0 0 0 0 0.06 0 0 0 0 0 0 0.0002 0 0 0 0 0 0 0 0 0 0 0 0 0 0 
0 
##$DATE= 1193146555
##$DBL= (0..7)
120 120 120 120 120 120 120 120 
##$DBP= (0..7)
150 150 150 150 150 150 150 150 
##$DBP07= 0
##$DBPNAM0= <>
##$DBPNAM1= <>
$$ [...]
##$SUBNAM7= <"">
##$SUBNAM8= <"">
##$SUBNAM9= <"">
##$SW= 20.6930455092707
##$SWIBOX= (0..15)
0 0 3 0 0 0 0 0 0 0 0 0 0 0 0 0 
##$SW_h= 5175.983436853
##$TD= 65536
##$TD0= 1
##$TE= 295.16
##$TE2= 300
##$TE3= 300
##$TEG= 300
##$TL= (0..7)
0 120 120 120 120 120 120 120 
##$TP= (0..7)
150 150 150 150 150 150 150 150 
##$TP07= 0
##$TPNAME0= <>
##$TPNAME1= <>
##$TPNAME2= <>
##$TPNAME3= <>
##$TPNAME4= <>
##$TPNAME5= <>
##$TPNAME6= <>
##$TPNAME7= <>
##$TPOAL= (0..7)
0.5 0.5 0.5 0.5 0.5 0.5 0.5 0.5 
##$TPOFFS= (0..7)
0 0 0 0 0 0 0 0 
##$TUNHIN= 0
##$TUNHOUT= 0
##$TUNXOUT= 0
##$USERA1= <user>
##$USERA2= <user>
##$USERA3= <user>
##$USERA4= <user>
##$USERA5= <user>
##$V9= 5
##$VALIST= <valist>
##$VCLIST= <CCCCCCCCCCCCCCC>
##$VD= 0
##$VDLIST= <DDDDDDDDDDDDDDD>
##$VPLIST= <PPPPPPPPPPPPPPP>
##$VTLIST= <TTTTTTTTTTTTTTT>
##$WBST= 1024
##$WBSW= 4
##$XGAIN= (0..3)
0 0 0 0 
##$XL= 0
##$YL= 0
##$YMAX_a= 309052
##$YMIN_a= -408332
##$ZGOPTNS= <>
##$ZL1= 120
##$ZL2= 120
##$ZL3= 120
##$ZL4= 120
##$ABSF1= 16.522
##$ABSF2= -4.171173
##$ABSG= 5
##$ABSL= 3
##$ALPHA= 0
##$AQORDER= 0
##$ASSFAC= 0
##$ASSFACI= 0
##$ASSFACX= 0
##$ASSWID= 0
##$AUNMP= <proc_1d>
##$AZFE= 0.1
##$AZFW= 0.1
##$BCFW= 0
##$BC_mod= 0
##$BYTORDP= 0
##$COROFFS= 0
##$CY= 12.5
##$DATMOD= 1
##$DC= 0
##$DFILT= <>
##$DTYPP= 0
##$F1P= 14.0000005364418
##$F2P= -0.99999901652339
##$FCOR= 0.5
##$FTSIZE= 32768
##$FT_mod= 6
##$GAMMA= 0
##$GB= 0
##$INTBC= 1
##$INTSCL= 1
##$ISEN= 128
##$LB= 0.3
##$LEV0= 0
##$LPBIN= 0
##$MAXI= 10000
##$MC2= 0
##$MEAN= 0
##$ME_mod= 0
##$MI= 0
##$NCOEF= 0
##$NC_proc= -4
##$NLEV= 6
##$NOISF1= 0
##$NOISF2= 0
##$NSP= 0
##$NTH_PI= 0
##$NZP= 0
##$OFFSET= 16.522
##$PC= 1
##$PHC0= 157.1514
##$PHC1= 8.179453
##$PH_mod= 1
##$PKNL= yes
##$PPARMOD= 0
##$PSCAL= 4
##$PSIGN= 0
##$REVERSE= no
##$SF= 250.13
##$SI= 32768
##$SIGF1= 0
##$SIGF2= 0
##$SINO= 400
##$SIOLD= 32768
##$SREGLST= <1H.CDCl3>
##$SSB= 0
##$STSI= 32768
##$STSR= 0
##$SW_p= 5175.98343685301
##$SYMM= 0
##$S_DEV= 0
##$TDeff= 65536
##$TDoff= 0
##$TI= <Analysis number 999999
Compound Code 99
Book Reference 9
Project Code 9>
##$TILT= no
##$TM1= 0
##$TM2= 0
##$TOPLEV= 0
##$USERP1= <user>
##$USERP2= <user>
##$USERP3= <user>
##$USERP4= <user>
##$USERP5= <user>
##$WDW= 1
##$XDIM= 32768
##$YMAX_p= 452239793
##$YMIN_p= -120302
$$ End of Bruker specific parameters
$$ ---------------------------------
##NTUPLES= NMR SPECTRUM
##VAR_NAME=  FREQUENCY,     SPECTRUM/REAL,   SPECTRUM/IMAG
##SYMBOL=    X,             R,               I
##VAR_TYPE=  INDEPENDENT,   DEPENDENT,       DEPENDENT
##VAR_FORM=  AFFN,          ASDF,            ASDF
##VAR_DIM=   32768,         32768,           32768
##UNITS=     HZ,            ARBITRARY UNITS, ARBITRARY UNITS
##FACTOR=    0.157963299565203, 1,           1
##FIRST=     4132.6476996994, 0,             0
##LAST=      -1043.33573715361, 0,           0
##MIN=       -1043.33573715361, -120302,     0
##MAX=       4132.6476996994, 452239793,     0
$$ Real data points
##PAGE= N=1
##DATA TABLE= (X++(R..R)), XYDATA
$$ [...]
20267 -28452 -7593 26799 41486 46467 49979 23943 35096 42596 26375 27749 46431 21236
20255 21236 8488 7022 12113 25193 9178 -20190 -30715 -42679 -45963 -25850 -37619 -33642
20243 -33642 -3392 10239 4354 -2210 -29652 -24796 4254 9269 -668 -12473 1215 10577 12187
20230 12187 14036 27970 51824 45852 39400 35988 9725 -3593 -10966 -7180 12995 36249 22051
20217 22051 13257 -10633 -6798 -16682 -32234 -18380 -10310 -20983 -14992 14475 -9061 -20023 -38724
20204 -38724 -40102 -38976 -29792 -15368 -37910 -49215 -22908 -50086 -57869 -58855 -46666 -51827 -54318
20191 -54318 -49766 -36758 -10638 -13297 -16771 -31356 9527 28846 26775 16388 18537 8556 10824
20178 10824 -12237 -41771 -30710 -8817 -3912 -4186 -7716 -23565 -66097 -44810 -13198 -2657
20166 -2657 3008 6270 -17938 -33780 -40595 -3148 6704 15367 -2101 -21853 -23948 1782 -6501
20153 -6501 -7242 -3739 -9362 -3795 -8005 -16157 -12247 220 5062 26937 28114 15189 -17373 -27807
20139 -27807 -19707 -13239 6534 -17808 -34201 -22301 -27407 -27868 22458 42516 60230 73780 49719
20126 49719 27505 534 -8239 -36239 -43231 -22116 -24617 -28157 -1030 23658 30595 16921 36824
20113 36824 36452 20740 11519 2745 -2554 19726 34973 11584 811 28291 34541 4287 21740
20100 21740 56601 52582 46423 36819 9370 -8133 -11611 -8776 9756 12479 -3549 -17853 -5075
20087 -5075 -9755 -2442 11199 2612 807 5864 6908 17192 27039 -14271 -42673 -54310 -42410
20074 -42410 -30312 -35065 -27478 -23583 -25254 -7195 20581 -1053 -15208 -16713 -19600 -12545 6097
20061 6097 5371 -14975 -11986 -18762 2158 23756 24915 14631 -11592 -23932 -18253 7322 3585
20048 3585 -15568 -20097 27017 43604 17104 10575 16020 6575 -4540 -2071 14520 -926 -33504
20035 -33504 -49923 -42590 -24490 3665 32035 22902 1681 -27146 -16940 -20854 -8181 14231
20023 14231 9621 5577 38815 51955 57266 22875 -30563 -7009 7113 5948 4464 6552 28003
20010 28003 16671 11962 -6596 12939 24010 14530 -17241 -20565 -35043 -60470 -49513 -13323
19998 -13323 -9820 -25347 -30956 -8286 14822 6904 -5612 12931 6311 -9151 9380 9547 -2439
19985 -2439 6913 27099 36800 47299 40742 23604 -2825 -15015 14399 18812 14956 19474 27273
19972 27273 21927 14633 4527 35038 73692 51625 52688 52083 45212 25000 -14343 -9121 -8116
19959 -8116 -23149 -60441 -38811 1038 16850 20860 7428 21425 37595 33897 22574 15229
19947 15229 7837 7509 28486 28969 24448 10552 18855 29999 534 -9544 -26298 -15041 11586
19934 11586 -1235 16603 -7945 -33033 -43326 -28675 463 5373 20996 69234 81758 40500
19922 40500 25147 23635 -1320 -19588 4989 5818 27930 28501 37412 43745 40012 51302 54887
19909 54887 25067 -29129 -59324 -46718 -50522 -45715 -9950 25751 19777 7657 19019 10834
19897 10834 -9091 -2834 8660 9253 9549 23073 13827 7865 -4865 -5829 -30786 -26090 -12985 10649
19883 10649 5260 42174 47971 26245 29682 44399 76979 74496 51224 23071 5203 -11290
19871 -11290 3617 25378 1867 16349 31027 10622 -6047 21489 19954 -8210 -7830 -20980
19859 -20980 -7678 5505 -13871 -9803 -14922 -16689 3942 -12348 -58611 -44444 -453 25902
19847 25902 32535 18683 27884 50068 61739 51447 63291 47363 27466 25160 18290 7351
19835 7351 -372 -1349 -10028 -17570 -11245 -9035 -5419 22542 30611 35992 21032 19638 19724 47025 49587
19820 49587 78268 87055 59346 57759 69962 86760 60021 68551 84546 80204 79798 107701 134207
19807 134207 195677 257979 296878 329416 371953 445311 523672 539515 547246 562545 554634 533703
19795 533703 509807 473244 450292 379602 287878 243653 247322 211218 160537 154295 138619 105749
19783 105749 100236 88469 54478 33013 21472 36838 37308 26332 383 12189 -1537 20292
19771 20292 50370 58972 61336 32758 20896 4965 26135 24382 4339 4381 26251 48131 22535
19758 22535 8798 -11229 -20015 -38145 -47883 -38760 3316 17471 38871 48133 58422 41890
19746 41890 39570 43383 44408 43637 43988 30063 29097 803 -25077 13780 42467 33508 25273 33598
19732 33598 15320 -373 -3280 12503 17961 36157 45635 55367 45581 35047 65869 46169 23932
19719 23932 36639 18041 2881 5669 -11132 17333 27729 16148 9991 14426 21877 31234 44050
19706 44050 55425 40906 24805 4982 -8370 13978 21643 29618 18267 2888 13517 17546
19694 17546 53887 53936 48613 58328 40171 38327 37120 37728 31553 23319 -11868 -25753 -2478 -9744
19680 -9744 17266 46413 47854 32835 8213 15025 42799 49864 53919 21514 424 -5101 10556
19667 10556 28421 15752 32148 29967 -16625 -963 15904 -3927 8303 18612 54922 50966
19655 50966 19848 -12295 -22709 -38401 -45268 -33624 -1893 3720 -19245 5989 567 -22471
19643 -22471 -32429 -31753 -17502 -4363 6754 12133 11019 -668 50143 65140 28057 497 -3551
19630 -3551 -5113 -9653 13258 51535 60698 40108 24309 -18803 -9638 1938 -23082 -31985 9739
19617 9739 46063 51839 33457 36993 63355 55635 49877 61009 44108 40687 25835 32671 46755
19604 46755 41873 34595 29477 6919 20295 38442 50359 40999 22350 4524 26606 55101
19592 55101 54100 45912 28263 4162 13412 29105 36762 18018 -12198 -14274 -27299 -31601 -29787
19579 -29787 -14214 -4475 3963 26564 40488 18448 -19671 -18666 -4244 32790 53285 74555
19567 74555 81523 107302 110690 94043 68586 80797 74452 62555 69551 107039 106432 90010 75334
19554 75334 51862 54761 56139 53361 68365 63932 62194 74245 66766 46870 49406 72170 74044
19541 74044 40517 54251 52818 23343 67844 89577 88025 82544 53440 49750 29975 17901
19529 17901 23332 24714 35591 30050 28196 28112 78614 76760 45219 57401 68552 79996 68113
19516 68113 53607 63818 63770 63337 74578 64843 39979 53657 72861 76534 61223 34329 11226
19503 11226 17363 29536 6518 48513 95333 98340 81414 40455 18822 49720 72496 74441
19491 74441 92462 106139 88074 78606 62254 99482 133938 161857 179150 156877 168833 162494
19479 162494 137536 132492 106608 99044 119230 125432 130624 142203 132253 101589 113743 122100 96392
19466 96392 110536 119076 107016 70195 45033 73025 67891 51846 89804 129204 139684 106225
19454 106225 103841 98106 121259 168802 166512 153156 165398 188498 220480 253360 267607 246590
19442 246590 234866 225465 237872 226741 227756 217613 202173 186903 162480 119919 113620 134030
19430 134030 151186 164113 166417 147378 124548 129938 134529 133342 138792 139236 131934 126534 141306
19417 141306 162167 172259 216438 243680 263424 319712 360368 400299 484968 532679 589363
19406 589363 672157 732022 775455 762128 731641 713218 677293 619736 526448 426236 355535
19395 355535 324036 337295 344224 314827 291092 272909 249859 256756 255963 236374 205126 201934
19383 201934 215954 190928 180992 197094 228336 239630 237403 176170 156236 172631 175779 166912
19371 166912 178803 213823 221899 203410 203415 178327 150706 172899 184698 185540 219684 268969 302032
19358 302032 349863 375104 416631 471976 530055 584172 642133 708282 805031 896532 971171
19347 971171 1035308 1073395 1112254 1107708 1021814 943884 891593 834111 778353 712429 623852 545732
19335 545732 513523 496359 461390 427701 412115 381325 355856 309090 310626 298994 301358 292723
19323 292723 276080 281917 269623 271860 257724 249085 233950 218307 244846 263051 279936 285836
19311 285836 285768 314669 340904 368924 401739 439677 477666 507628 552427 584817 594419 610449
19299 610449 636275 682797 685088 676540 685349 698404 684356 672343 641160 617314 605151 587725
19287 587725 589809 607580 617481 602653 603078 620537 620459 624709 652365 678730 717444 741376 775142
19274 775142 801638 837669 871234 902815 961369 1023478 1106751 1173055 1276248 1405359 1520124
19263 1520124 1661666 1823387 2012740 2198100 2418664 2633187 2829416 3013733 3150406
19254 3150406 3303707 3458992 3598392 3750744 3891471 4046432 4202371 4441216 4783895
19245 4783895 5209450 5744134 6459147 7432566 8688366 10350382 12555829 15570623 19597322
19236 19597322 24863537 31464187 39340442 48440261 58798231 69994879 81019222 90799169
19228 90799169 98915840 105117100 108669265 108878008 105828130 100140807 92380756 82792868
19220 82792868 71933073 60840710 50464645 41221299 33285498 26607106 21239459 17075194
19212 17075194 13961647 11638061 9878203 8511288 7463204 6656822 6012576 5518746
19204 5518746 5159721 4880555 4644471 4483526 4369811 4272831 4168217 4080290 3973708 3851663
19194 3851663 3682766 3509735 3324064 3102887 2857984 2629146 2386083 2165964 1989731
19185 1989731 1827732 1718298 1646853 1571216 1477675 1394069 1329319 1296582 1274971 1236803 1186338
19174 1186338 1145022 1126865 1083804 1091732 1119595 1150164 1174546 1201629 1234202 1268872 1291566
19163 1291566 1359146 1406603 1426498 1412820 1406106 1347306 1276850 1210132 1148123 1070438 980232
19152 980232 871507 798065 739621 706159 673342 620617 575475 506536 456459 414176 419761
19141 419761 434402 417730 414904 411040 426313 417619 436856 442240 456130 443852 469454 501758
19129 501758 545812 566107 581505 588597 603838 608503 605944 588477 563974 509392 462341 434735
19117 434735 391923 352374 295638 275406 273990 267172 255475 259607 268547 278338 244526 244906 238420
19104 238420 231051 241853 232864 200607 191376 164462 177315 183775 144172 128331 131574 134521 133414
19091 133414 139912 137858 144622 175122 180467 200002 232792 228493 228077 218656 228219 229156 229702 239291
19077 239291 214743 183824 158226 140773 112183 63232 37190 60448 69903 61132 64502 67551
19065 67551 90182 117340 81885 64369 68081 66780 61050 84352 105825 112597 117900 118022 117651
19052 117651 129053 123422 115870 118645 149298 169829 169724 164497 157739 178639 155298 156372 194459
19039 194459 189105 160772 144418 160424 170672 150954 173433 184083 174529 156655 104762 67614
19027 67614 72310 66130 79758 66761 37636 32049 38769 37010 50324 65225 77518 88368 78949
19014 78949 49532 23444 16803 12833 4807 -5688 10614 40138 74031 97673 87267 72298
19002 72298 87022 88110 91177 83623 55128 76025 99936 103540 113486 109962 90549 67885 90560
18989 90560 114273 147307 166480 165965 161462 152055 96542 87107 99732 70453 58795 94409 74279
18976 74279 65730 71621 97879 99399 100846 113017 136588 147509 159487 152133 134044 151284 150622
18963 150622 156413 147211 181537 200789 222626 230085 216530 215265 197407 214569 219292 192188
18951 192188 194404 171039 149703 151468 153084 160381 173381 171449 116180 123661 140851 138105 125549
18938 125549 144256 146607 151097 157515 171574 138958 150468 162645 161361 143948 128402 148089
18926 148089 152070 129475 134471 144848 138994 142160 169017 193124 186554 181318 220240 246085 274431
18913 274431 305149 309418 276374 279934 318349 325870 286560 267248 286056 296889 305862 309751
18901 309751 305146 315108 313408 335083 328773 318950 353569 409205 417372 409647 419442 425114 426342
18888 426342 437584 469872 498509 524485 533414 540611 569260 598347 638719 688037 724413 750601
18876 750601 835689 917236 1004714 1093502 1195149 1328268 1481602 1663944 1839887 2051704
18866 2051704 2280319 2505194 2704279 2852115 2934593 2984664 3003426 3011312 3015662 3026605 3092366
18855 3092366 3144711 3260912 3444169 3687057 4030061 4475813 4991251 5664064 6521063 7591435
18845 7591435 9004911 10888098 13415844 16868497 21583820 27982771 36252869 46410490
18837 46410490 58497681 72257872 86519398 99524088 110419497 118586943 122596204
18830 122596204 121554370 116079036 107096206 95256278 81621049 67524463 54391197
18823 54391197 43005492 33555081 26116206 20460133 16288411 13238455 10989576 9305514
18815 9305514 7989413 6955597 6138031 5494470 4937488 4502777 4154867 3856705 3616055
18806 3616055 3463020 3360359 3263461 3202134 3156000 3126861 3106869 3064205 3012126 2934237 2803540
18795 2803540 2619166 2457195 2290501 2085486 1900563 1779129 1693680 1608166 1549672 1516695
18785 1516695 1475681 1433294 1409253 1377160 1354155 1316543 1292818 1287595 1304930 1334995 1407289
18774 1407289 1434461 1463246 1527873 1564303 1603366 1635597 1664624 1624899 1505150 1348767 1186725
18763 1186725 1059786 994782 917625 844123 807914 753308 735488 720844 720337 735501 745363 747069
18751 747069 744653 741396 743255 744424 746060 769201 809871 835867 807215 805149 808098 802589 801875
18738 801875 787573 792582 772530 682196 623907 586125 561474 533693 507008 509773 512682 469906
18726 469906 423263 425576 391212 383154 381316 351423 310606 298955 273729 265950 254056 262601
18714 262601 281286 257168 233664 225814 243676 228258 202458 185797 147467 133862 108572 92928
18702 92928 80020 90916 95635 63191 45234 87027 106266 102396 101312 97029 93098 91849 91943
18689 91943 100968 105009 123138 116823 97455 82632 65522 43244 -16534 -30984 -11381 12595
18677 12595 13912 -21561 -23878 -2401 -22741 -46781 -31931 -9504 -9371 9182 40122 61910
18665 61910 77667 89019 87368 95413 93748 90478 118939 148917 208632 250181 302635 357310
18653 357310 422929 462370 505466 544209 573087 596488 603314 606584 588784 550478 511812 491337
18641 491337 456651 386995 324952 284369 236090 209459 176210 119734 109253 102840 85919 64396
18629 64396 35603 25635 35302 21345 9611 13530 18330 17896 12810 9699 -25229 -37017 -44769
18616 -44769 -21600 -15986 10224 15376 11569 -1226 -31419 -14743 9137 32592 41263 6697
18604 6697 -20116 -36824 -37893 -25296 6913 20496 23018 27096 10751 -13664 -9217 -21455 8661
18591 8661 12944 -9734 -13346 -37901 -34596 -23850 7115 -4859 -12857 -2463 21910 31147 27403
18578 27403 12703 -46040 -48512 -12415 -8637 7022 18316 -6685 -48436 -36934 -1795 31664
18566 31664 46755 21093 16637 40348 54973 38360 33742 13472 -5449 -5278 -18862 -8491
18554 -8491 27806 44169 38928 44425 39531 45511 41324 29401 31806 -3001 -5274 37204 46100
18541 46100 18550 -1388 -3865 3036 29773 30763 19992 18534 -6699 -27621 -37070 -46246 -40098
18528 -40098 -3472 6953 -11135 -1662 14014 13821 5670 4421 7193 -18895 -44590 -66875 -50472
18515 -50472 -29795 -7232 -33338 -46371 -31680 -14342 -13692 11519 48122 55514 8584 -33530
18503 -33530 -26866 2082 16850 318 -34824 -35314 -5964 -824 -23253 16124 46906 37442 38826
18490 38826 24022 13954 6280 -7751 -20724 -21923 -3897 23058 30166 30369 22049 -12327 -31784
18477 -31784 -33238 -39387 -23189 -20579 -27061 -42412 -25950 -12483 28884 31760 -9102 -13649 -681
18464 -681 -13145 1140 -6261 -7578 10316 1871 -17524 -19295 -4874 6614 30184 21994 30883
18451 30883 26664 10318 6631 -1492 11619 6851 -6813 -6529 -611 17051 24315 -6991 -5054
18438 -5054 6052 -6932 -9244 29073 58401 36119 -1288 -17243 -21834 -36720 -42016 -26224
18426 -26224 -4569 686 -20711 -39203 -25435 -26992 -29861 -17068 -24255 -8271 1141 8715 23306
18413 23306 28052 24380 29505 17961 17938 11738 14332 18803 37249 33961 41042 52529 20459 -21573
18399 -21573 -40990 -51692 -69687 -72407 -30953 -12319 10941 30603 40647 25687 15295 -3560
18387 -3560 -10315 8032 11269 15038 41043 54957 53958 27976 6278 4554 6736 10128 4936 -1949
18373 -1949 -7930 -326 -1204 19456 14638 7668 -9047 11321 24430 10619 -13767 -2434 31050
18360 31050 40080 48895 59140 41383 14990 21427 61645 58101 31319 33179 50322 54018 38293
18347 38293 32815 34745 34751 31419 43815 24241 32735 36825 4284 -15077 -11160 30529 7975 213
18333 213 15997 12185 4634 18860 11639 17524 21936 895 -10303 -10476 -29374 -40008 -63235
18320 -63235 -67336 -25687 -11089 -9646 -12803 2202 22911 15567 -17696 -49874 -56547 -24368 -12198
18307 -12198 -20309 -28824 -28758 -31716 -20461 -39557 -53246 -74224 -107558 -96697 -74714 -89104 -77002
18294 -77002 -33522 -14500 -3899 1063 1922 -7034 10975 13306 11250 31662 24566 24483 21397 12057
18280 12057 -9691 -19582 -6077 -2782 -7926 5373 51855 63900 65763 45107 25391 29409 39265
18267 39265 30978 37849 24846 50743 98247 145781 162644 188928 270176 325333 385085 440189
18255 440189 513759 553857 589182 647029 648209 609016 584705 521996 439347 360509 280533 224159
18243 224159 185675 151183 128056 115929 112892 121457 139602 131236 96296 70176 52768 27374
18231 27374 39557 44241 27794 6930 15954 -2096 -5612 -13454 -18014 -31577 -8723 -18675 1815
18218 1815 2813 -1547 -1566 9405 7043 11694 7138 815 -4009 7402 12814 -857 -32623 -6452
18204 -6452 2512 -6378 -3794 29361 30457 12189 -4741 -4686 9830 10933 -1637 -17778 4582
18191 4582 17609 23565 41035 40084 16796 -32557 -32372 14549 31579 45905 40463 25929 -5561
18178 -5561 -25406 -12063 2722 8609 17193 32309 25859 43652 21431 41059 43777 40059 69404
18165 69404 58128 31838 36166 39929 20539 36776 52119 27829 45745 56388 69026 62461
18153 62461 82785 109521 89950 81394 106935 132855 161509 186072 198771 198091 198397 207024 224178
18140 224178 204328 195818 203330 202821 196456 202679 202179 235514 263763 280961 305611 339231 377376
18127 377376 458863 506888 569731 671172 788554 927311 1122973 1374871 1735540 2246010
18117 2246010 2987898 3987552 5297299 7098477 9888702 14982836 25157155 41864615
18109 41864615 52621516 47727163 35833097 21288886 12456340 8177228 5915605 4539294
18101 4539294 3559180 2812075 2230360 1815849 1519255 1333438 1195119 1050706 909471
18092 909471 791962 697828 602489 533095 439555 391305 339870 298560 282544 274366 260283
18081 260283 252442 220795 200373 195532 182059 154194 110972 112609 131966 127262 135313 157926
18069 157926 135054 116672 123830 89812 68338 60646 73656 88774 82390 80269 108233 110124
18057 110124 89204 25900 10525 24572 38155 49381 58678 73459 90712 96879 83768 64510
18045 64510 60761 65555 79352 95447 75574 53247 62391 58928 61101 62779 19474 2599 29817
18032 29817 11677 -3913 -18086 -17179 9313 14773 4466 -5093 -3616 -18778 2558 11803 1436
18019 1436 13736 44945 61238 55455 58508 68925 65397 61710 60561 42704 32067 15781 21868
18006 21868 37386 29947 46784 45235 60263 39392 8909 7496 70542 94755 92490 108383
17994 108383 122232 162782 181056 203766 230625 250641 269375 285990 285737 276397 278678 263059
17982 263059 279609 256855 235956 183965 153618 137985 139495 165200 164961 145579 120930 104157
17970 104157 68584 61403 78584 77486 47372 38087 36089 40196 16531 19882 37292 42082 59434
17957 59434 57144 34008 7326 -227 13240 17611 34401 34547 1601 -1201 -11561 -27199 -22065
17944 -22065 -8573 -10230 -9288 620 500 6635 12081 -3598 -17598 -25597 -20265 -17892 -20364 -20018
17930 -20018 -29125 -20987 -11199 -24919 -37852 -12836 4720 6012 7040 -8380 -7165 25803 30752
17917 30752 43020 23521 22290 17617 19782 11138 14078 16285 14035 -15001 -23213 -8063 -28030
17904 -28030 -42930 -29624 -39287 -53439 -28860 -28570 -23331 -5752 17269 21545 17662 12499 15909
17891 15909 1004 21112 36826 45893 33710 37291 11953 31067 46509 28133 25434 34612
17879 34612 18603 19534 -28600 -38994 -16670 5630 -16566 -35522 -31130 -35307 -16100 -23995 -6966
17866 -6966 -4869 7729 22211 4049 -14951 -34132 -23477 -31557 -25951 -20934 -11191 19379 32575
17853 32575 21812 31028 41087 24846 -5869 -21127 -24 23828 39183 42614 67313 75148
17841 75148 68936 43133 51253 72240 94884 124255 105868 63403 61534 40711 31706 35256 57422
17828 57422 62376 43088 30451 34636 26052 26185 51984 65702 54205 61172 42686 22129 2642
17815 2642 -15640 900 26840 15686 -7978 369 37601 36644 29367 26255 12588 -29547 -14912
17802 -14912 30960 38233 18848 -12197 -14724 -23889 -43791 -37762 -27352 -17452 8859 452 -25551
17789 -25551 -58566 -54673 -27979 -2172 6028 -11889 -31258 -24992 -14816 -18390 -32814 -34688 -34290
17776 -34290 -26831 -34268 -8807 26584 43976 36097 -4930 -33620 -23075 -9351 -9416 -19180 -33216
17763 -33216 -39643 -8276 -5094 -25867 -32787 -38178 -48444 -33373 -30362 -56580 -57999 -53936 -65706
17750 -65706 -61791 -41420 -37014 -29046 -25320 -3408 16669 2990 -11952 -15632 4665 15727 31179
17737 31179 35529 42871 31022 35766 34899 49380 35438 9430 14249 571 -2901 12418 22734
17724 22734 19418 19243 -9113 -7727 -9975 5651 8486 15203 51149 39548 34222 23592 39356
17711 39356 53559 61549 48803 1311 -27790 -30932 -18946 5478 14081 6284 19138 36917
17699 36917 47124 57804 67817 47874 29948 8914 12414 24032 30099 11576 8105 16102
17687 16102 17744 20756 10882 25264 44954 68431 65058 15350 4420 31892 27353 40400 87934
17674 87934 93830 60172 56131 71609 84742 92303 70051 71763 44507 24113 11037 17148 44272
17661 44272 32576 36693 17328 34175 64308 70206 58179 35612 -1597 -33031 -16196 19423
17649 19423 33236 26071 11468 -25604 -36418 -7953 7940 -3839 -13785 -24709 -31839 -19362
17637 -19362 3182 18212 28737 16103 8632 636 22792 34188 -6061 -28689 -5154 2738
17625 2738 6770 5265 6192 -9425 18022 45836 39894 37529 27102 -30844 -32067 -16514 -1352
17612 -1352 11252 23033 34636 13261 -9865 520 4404 7584 23100 8346 -3237 -25065
17600 -25065 -26388 8426 17136 30517 38140 32031 -4901 -14539 -2959 15347 17817 16717 -15165
17587 -15165 -38117 -42915 -11664 7995 12535 12361 -22050 -43508 -39263 -26815 1275 -8748 -6508
17574 -6508 2845 11458 25322 31700 -834 -11252 -26451 -55606 -39271 -32663 -16759 -19968 3430
17561 3430 5407 11279 -10458 -22069 -23391 -46363 -32659 -36460 -58528 -38883 -27806 -26650 -29057
17548 -29057 -13459 -48209 -61378 -46362 -11380 -2327 5449 13531 4970 1998 -22669 -47191 -42045
17535 -42045 -4290 22120 12841 -12401 -26820 -49923 -44152 -37051 -20548 -29351 -8463 -3978 -16786
17522 -16786 -5358 21429 11105 -16257 -13602 -22990 -24204 -17837 -24436 -32107 -33974 -13194 -2159
17509 -2159 -7150 -46929 -58832 -50510 -33814 -6064 13896 10930 3212 -5714 -2238 6285 -10916
17496 -10916 -35428 -40451 -1441 35721 50107 30792 1613 5183 8998 -1148 -12533 -17487
17484 -17487 -14922 3624 -1792 -5636 -40679 -45456 -44682 -61707 -36259 -12353 -23458 -27238 -23866
17471 -23866 -20574 -10047 -24254 -19170 -5884 -17708 -44035 -29726 -29107 -21907 -14119 -14486 -10550
17458 -10550 9852 28366 22022 11212 16947 20792 9878 -5442 -9214 7665 16236 42685 82627
17445 82627 107238 131942 204933 235773 226147 173004 107255 46964 30803 25394 30227 39768
17433 39768 23785 19264 6042 -11263 -6359 4770 -11854 -15992 -25656 -19441 -2692 -4417 -13400
17420 -13400 -21711 5401 23827 12947 3867 426 -6397 -5801 -27428 -59815 -53427 -52024 -56503
17407 -56503 -56328 -65132 -19978 -1153 16063 30176 23907 12497 23300 19830 1015 -18373 -12875
17394 -12875 252 8598 5861 3846 7449 6048 15646 31819 17952 -21719 -33577 -14514 -26263
17381 -26263 -41229 -37045 -47629 -61717 -58604 -45259 -39255 -21220 7120 21752 16099 -2471
17369 -2471 -10411 -12788 -4248 7737 6766 -12045 -32210 -16471 14165 44713 51724 29838 43787
17356 43787 51587 58661 54962 39803 -893 -35360 -66394 -57714 -31644 -13948 -839 6729 22036
17343 22036 17019 3572 13218 40998 35343 28975 22295 9459 -14263 -17819 -12362 6834 -10606
17330 -10606 -13296 -1163 -16603 -30497 -10215 -3510 -16670 -18328 -39326 -50355 -25498 -23568
17318 -23568 -29194 -9155 12347 17539 7827 8895 -7743 -15609 -2692 -2902 -24621 -36510 -21478
17305 -21478 -25805 -16503 -37760 -56427 -62260 -39325 -40449 -10301 18245 28312 22715 -3983 -17605
17292 -17605 -2813 -9871 -39970 -28605 -25745 -21954 4230 -6906 -24839 -18219 -23960 -13374 11486
17279 11486 18942 -2210 19892 13765 -2878 -30614 -19909 -19918 -32967 -38832 -25759 -11683 -5305
17266 -5305 17665 22951 6360 -10755 -7275 -16984 -17050 -15496 -14681 -27851 -32005 -12764 18851 -2177
17252 -2177 -14431 17827 20610 18573 13358 -16357 -18730 10493 9666 -21967 -22437 -19753 -22895 -2982
17238 -2982 -10470 -31944 -33198 -38962 -41457 -44010 -39715 -51364 -37590 -36143 -9072 -5556 -13546 -660
17224 -660 -1803 -6219 1494 -23936 -49099 -32316 -23313 -18659 -22281 -21242 -41374 -41613 -21494 -75
17210 -75 31062 37321 22249 -800 4397 135 -4919 2140 40826 52008 52308 29256 1688 -7903
17196 -7903 -13421 -20224 -32674 -61889 -28038 15895 7315 -10292 -14651 -18574 -17083 -14371 -19776
17183 -19776 11047 37025 10132 -14743 -23686 -16881 -45257 -27900 -28797 -48255 -53042 -50326 -37234
17170 -37234 -25808 -35753 -30439 -29217 -20098 -28170 -17102 10587 8244 1865 5496 14219 -67
17157 -67 -13473 -29375 -47733 -43784 -25092 -3277 16091 22227 22093 -24664 -48864 -30712 -5695
17144 -5695 -1282 -7610 -53779 -72571 -64398 -40419 -47446 -35823 -8440 9986 18918 -7511 -10435
17131 -10435 -4500 -1363 -17866 -32897 -46855 -49912 -44710 -29175 14642 22294 -10002 -37322 -55944
17118 -55944 -64183 -30684 -17540 -39579 -67987 -70262 -53823 -17043 12876 -1504 -21801 -17080
17106 -17080 -22496 -16152 -41967 -32238 -11005 -19932 -17698 -20060 -16834 -8527 -20563 -38167 -31295
17093 -31295 -18744 -3297 6786 -20700 -60831 -61188 -62632 -31926 -4390 -13323 -43425 -35533 -19451
17080 -19451 -15718 -30982 -22422 -17744 -18142 -13597 -10898 6113 -23765 -37811 -25086 -12352 -8458
17067 -8458 -554 1393 -55 -15773 -5343 9545 -11910 -43057 -68335 -63019 -29990 -6518 4609
17054 4609 -17383 -26407 -11769 -11805 -14161 1010 4561 25940 36070 13844 -552 5986 24322
17041 24322 28210 43230 35730 18578 -7100 -4776 10661 -1277 -19778 -33780 -49395 -54913
17029 -54913 -50949 -56352 -40719 -39973 -34346 -30979 -20969 -20746 -30500 -39897 -40253 -50160 -35469 -26370
17015 -26370 -37868 -34307 -19702 -35155 -30634 -19790 -25744 -13449 -4587 307 -12372 -18917 -13622
17002 -13622 -16043 -44969 -54191 -35903 -2823 20264 20062 8576 -902 -9157 -7367 -298 13136
16989 13136 14234 676 -47947 -24522 -32643 -67430 -35964 -2583 -14806 -40981 -38917 -31796
16977 -31796 -45285 -73292 -68184 -46527 -41293 -20034 10310 43700 51031 30989 30899 10199 221
16964 221 -11711 -9797 -42971 -53886 -27270 -12678 -1227 -16202 -29456 -29278 -47279 -49454 -21244
16951 -21244 -3435 -14899 -16897 -11157 -19475 -10364 -1178 -741 -22177 -28860 -1589 -5809 -5689 -7752
16937 -7752 10032 14000 3357 -6837 3523 -10475 -27924 -18945 -30239 -44438 -50057 -33234
16925 -33234 -21400 -28041 -35044 -52198 -52982 -34905 -20760 -29831 -47083 -40030 -20036 -13307 -10661
16912 -10661 1677 -1226 -12975 -3488 23143 40394 20832 -364 -12752 8764 30075 -15198
16900 -15198 -27221 -43930 -48262 -13104 -4151 9388 9561 -35325 -47643 -9207 24077 15667 23750
16887 23750 20324 26273 20494 13184 7377 -94 5609 -3936 -36431 -48800 -36696 -26613 -14211
16874 -14211 6367 -7947 -980 13421 -2119 -58064 -47834 13786 -707 -19108 -12751 -9594
16862 -9594 -7885 -10103 -21882 -24115 -21938 4715 7195 -28107 -53442 -53601 -59987 -35225 -24428
16849 -24428 -23291 -22820 -29039 -27574 6239 30468 37195 16089 -4230 -16522 -5903 14267 8516
16836 8516 -16250 -35491 -56083 -28310 -10256 -11233 -33898 -37827 -28816 -25475 -47646 -46000 -13761
16823 -13761 2875 12718 -13067 3385 15112 12401 -2361 -32794 -34500 -13945 -5617 -5860 -8923
16810 -8923 -12048 1035 13262 -4455 -12839 -22113 -25326 -48790 -58159 -46883 -26848 -20581 -17473
16797 -17473 -27965 -16995 -275 -8011 -37771 -42952 -27166 7468 7802 -12072 3124 20843
16785 20843 22856 25840 39777 25807 40450 49471 57324 59552 60295 49417 29188 23551 42687
16772 42687 45657 35530 44886 38308 18286 7253 6803 33215 44610 50985 33066 2666 10513
16759 10513 -1904 -15729 -25996 3287 31438 26711 41737 22887 23569 -26082 -22511 -19059 -14773
16746 -14773 -8260 -21808 -22234 8094 2823 -22707 -34159 -57877 -67379 -27864 17786 30204 15982
16733 15982 15760 -524 -8413 -31483 -21635 -15490 -33433 -29811 -12640 21908 14217 -2245 17002
16720 17002 18357 21351 17034 11756 19669 3526 -25726 -43060 -17085 1543 26868 32849 -19246
16707 -19246 -56930 -55454 -55435 -55530 -59876 -43342 -37515 -50914 -79572 -63207 -44787 -34786 -24724
16694 -24724 -10149 2182 -12206 -25656 13124 54260 71293 84121 61741 40982 44394 34037
16682 34037 18572 4378 31606 26928 -7113 -17584 -4236 3729 4342 13296 12722 42843 54817
16669 54817 23738 21311 15869 5803 5468 -2949 10291 33784 44324 2637 -36121 -37004 -47185
16656 -47185 -29326 -13025 3143 -7714 -13808 2195 -8021 -11862 8869 19251 4320 -14902
16644 -14902 -10969 13958 18197 -19203 -2059 15292 14645 -21216 -40399 -26132 -11672 4387
16632 4387 17646 28750 15501 -21167 -45949 -20313 -20410 18910 32085 13059 -2744 -7628 -13147
16619 -13147 8208 16343 20233 2191 13202 42149 79745 84375 93691 85980 73931 58322 36846
16606 36846 -6346 -21619 -9160 -6926 -24023 -4489 14941 36288 42087 39407 47717 16772
16594 16772 14283 11770 395 -25462 -30257 -45672 -40935 -41627 -35304 10967 25999 17056 8100
16581 8100 -2253 4931 5441 -4734 -19946 -29144 -19550 -19313 -21080 -23498 -30268 -42425 -46931 -22745
16567 -22745 -37903 -52848 -48519 -50835 -37347 -54636 -30333 -879 -11413 -2128 741 -8224 6084
16554 6084 9691 -4086 -9934 -540 22281 36857 26223 34855 21752 -2589 -3007 -24055 -34554
16541 -34554 -33053 -28863 -15990 10585 27670 29442 20242 -6255 -14016 -5123 -2361 8762 23572
16528 23572 9270 -4916 -10907 -19228 -26051 5409 8410 9054 -16240 -16794 -7383 8108 -13520
16515 -13520 -23784 -13880 -2462 -19658 -29129 -23778 -24013 -51319 -45111 -23137 5964 22894 -16066
16502 -16066 -4939 -773 8988 956 -15437 9885 15761 11725 25521 35595 51615 49226 40672
16489 40672 23523 38549 56683 60125 69182 49040 26113 56550 28942 40687 21400 -2755
16477 -2755 4157 -5918 -25217 -43543 -58733 -61588 -22282 -126 -3073 -13390 -15806 -29217 -40065
16464 -40065 -35708 -8758 -12959 -4283 8075 -14990 -2985 24973 7354 5873 -951 15453 40001
16451 40001 53741 53264 37156 19132 24183 23959 27715 29330 73783 62960 30106 13262 26356
16438 26356 28270 23611 22193 58115 58314 27603 2078 6959 33590 20534 -14196 -25901 -15918
16425 -15918 3245 29007 3843 -5847 -13410 -24934 -13940 -13626 1040 10263 455 22863 20507
16412 20507 10485 -2776 -21467 -26033 -14289 -18184 -34990 -67906 -79735 -21110 1701 -8389
16400 -8389 -8581 -35514 -45296 -34058 -11396 -4029 8683 30514 39613 48441 57053 45978 40559
16387 40559 34915 12607 -25699 -39741 -41031 -39017 -27726 -12244 -25618 -36550 -43424 -42569 -23243
16374 -23243 -23379 -27123 -12656 -19904 -8753 7751 9886 23581 29888 16851 -28952 -43394 2695
16361 2695 524 -44117 -80772 -96303 -75395 -34396 -11445 21972 14697 -6332 -5261 -5783 2991
16348 2991 19502 10927 25208 29893 2090 16058 30799 20859 47156 42876 29068 -3499 -10863
16335 -10863 -31270 -17271 14172 37425 41848 7710 -3917 7380 -9900 12031 23189 2668
16323 2668 -23025 -37881 -15002 3344 -6524 -21442 -16163 -9298 12331 -9928 -14799 -977 21821
16310 21821 44613 23517 9074 -15261 330 31887 45870 20478 29353 32377 28563 6668
16298 6668 -5432 -4404 13256 2372 -2920 3372 1425 12340 18258 21247 23208 -9841 -22684
16285 -22684 8422 13701 6656 -16463 -10822 1398 -32068 -28575 -28555 -9898 23724 27221 15916
16272 15916 4607 10455 -94 -39519 -58025 -66100 -51896 -12195 27270 46161 25259 -7930
16260 -7930 -17917 -15358 -17089 2857 9506 6553 -8050 4082 17168 -588 -20278 -33931 -26885
16247 -26885 -36536 -26431 -24471 -4171 -2445 640 17694 24157 26869 29519 -1680 -22383 -44963
16234 -44963 -22360 -1872 -12934 3770 9447 -1091 1154 34256 37528 22964 43622 53468
16222 53468 56173 44730 53605 24612 -44649 -58296 -30652 -8567 15923 5319 7139 -21231
16210 -21231 -17892 -24764 -30961 -9228 -325 -2872 4370 10264 42295 25566 3989 12705 -2329
16197 -2329 -18447 -12990 -44629 -65561 -45490 -11807 19616 35716 19085 11847 11276 15322 37975
16184 37975 48931 38341 34442 19030 11318 20976 30853 48360 18183 -5434 1626 8318 -271
16171 -271 -13484 -7019 -20581 -53459 -51681 -3312 13455 3378 -504 -2852 5452 -12784 -22793
16158 -22793 -11521 4951 32228 22331 21455 33110 12505 2420 16240 -5873 -2189 -9914 -7618
16145 -7618 378 -5143 -22402 -54291 -60569 -39000 -17700 3847 19574 7249 23505 6850
16133 6850 -25785 -23257 -5436 -9547 6255 18398 -3827 -29625 -21879 -22185 -44565 -25943 -30186
16120 -30186 -68124 -67378 -37642 340 9800 6371 -25279 -32257 -27543 -17189 4448 -7169 -16820
16107 -16820 -16204 -24453 -33452 -34959 -29683 -38661 -19736 -10331 -22123 -10848 -15114 -8633 -10748 -14982
16093 -14982 -8142 -11584 -12385 -335 17674 5995 1906 22534 11226 -11455 -17856 34990 53465
16080 53465 62663 39005 24468 18867 3188 -16415 -10656 -8511 -5190 -24206 -49388 -42816 -8033
16067 -8033 19566 27985 19016 246 19234 37983 24944 12034 -5190 -15822 -12274 -10919 -24252
16054 -24252 -22071 -809 30424 31110 29570 30377 28926 14141 33002 28212 12615 10329 -3730
16041 -3730 -25993 -10027 969 -6754 10731 9553 40045 24468 -10056 -30853 -24171 -8023
16029 -8023 -18775 -21819 -34105 -38744 -25827 12939 36000 36543 63405 69466 51050 33662 23968
16016 23968 42574 58276 52907 59334 75488 78306 86999 100017 92863 76824 63674 63444 55817
16003 55817 77834 66770 41875 20429 16832 31252 49515 57786 56354 47215 59498 55893 5489
15990 5489 -3127 6398 12250 25541 28340 8174 3106 36479 21186 11074 3753 21421 48680
15977 48680 38205 29661 13831 -10759 -28000 -23904 -2542 -10002 3455 19882 22454 38182
15965 38182 23539 17900 19110 33897 3305 -6247 16997 22716 20549 22633 32400 45074 47331
15952 47331 44058 5395 372 22408 36240 23166 22105 27489 31051 -7537 -31444 -14033 15190
15939 15190 -949 -22981 -2164 23767 44048 19830 1083 -11296 10814 30508 31826 -2207
15927 -2207 -26865 -13078 -12997 -11514 -7265 -18164 3522 26394 32829 33187 45765 43114 52790 53021
15913 53021 49200 25576 16338 31731 20894 4155 4150 -6172 -22589 -17947 1604 2963 11396
15900 11396 6023 -4660 9400 14177 -10411 1644 2508 5971 33548 52259 40401 28588 30521
15887 30521 44181 14346 -21357 -31453 -36381 -40662 -38151 -21349 -3639 -1058 1426 -6327 -13522
15874 -13522 -25457 -18257 22569 34706 35419 21060 12234 4516 -1016 10387 27113 10285 -34345
15861 -34345 -59143 -46251 -17491 -17600 -47209 -52026 -21540 -9300 -26264 -12272 -19480 -37923
15849 -37923 -36063 -27666 -27452 -19065 -18726 -16788 -9756 -30311 -49459 -39319 -6385 28596 32926 25478
15835 25478 11569 -1245 -5916 -18013 -7441 12621 -9349 -22124 -12661 -6185 -28050 -34063
15823 -34063 1108 30656 43900 8368 12670 22965 7785 -8213 -25866 -25273 -12620 -17531
15811 -17531 5218 17520 32679 27297 -6708 -32792 -46003 -51992 -33843 -26358 -49912 -44265
15799 -44265 -23768 -23441 -35862 -25334 -44747 -41555 -43740 -45448 -38400 617 17875 4669 -7646
15786 -7646 -32029 -59762 -75163 -70431 -65849 -81192 -76366 -55081 -44009 -62539 -63582 -33527 -11374
15773 -11374 -5231 -985 11111 -3713 -8725 -27353 -42399 -35480 -7552 -2404 -12032 -4503 20452
15760 20452 12316 -15732 -19456 -25095 -11856 -8267 -19582 -22560 -8532 -4990 24204 28510 46043
15747 46043 40789 44131 25148 17592 41739 16495 -1697 -4295 -28370 -8641 -3077 -22047 -34389
15734 -34389 -15720 -15006 8911 -1520 -5624 -11789 -15793 -22596 -37086 -47984 -11622 -9976 -20871
15721 -20871 -30165 -28623 9659 32946 35651 29855 17230 19760 31343 -7565 -8891 -10412 -12524
15708 -12524 -24009 -24772 -9742 -25785 -46027 -47463 -48693 -44926 -39392 -52162 -50723 -29075 -44731
15695 -44731 -28015 -8423 -437 -18178 -46317 -40490 -26328 -30920 -54272 -42333 -23907 -25632
15683 -25632 -27983 -32575 -43909 -31867 -18271 -17723 -7855 -30151 -56706 -32589 -30565 -40840 -54008
15670 -54008 -53733 -59456 -78133 -55653 -13324 -6019 -32014 -18377 709 10450 25460 18785 -13979
15657 -13979 -16772 -28080 -14523 7034 10335 -4499 -23374 -7914 25683 5366 -19692 -26467
15645 -26467 -31600 -37583 -33138 -19304 -30227 -28962 -17135 -10380 -788 8693 5644 17260 -2584
15632 -2584 -7854 21793 7691 -11095 3827 -6559 5109 22960 26090 17079 956 121 11925
15619 11925 35391 32714 11439 23622 30692 15291 -3978 -9858 -17060 -23722 -41393 -22893 10496
15606 10496 24383 8362 17563 14860 10421 41406 38894 9491 4379 17767 11065 22175 21151
15593 21151 29974 38564 19645 5027 -15510 5633 8790 16250 28631 26212 3370 11013 36253
15580 36253 19594 -11840 -20838 -11776 27123 41146 9494 -22675 1831 16807 23386 -4137
15568 -4137 -19395 -18185 -10960 -15557 -25480 -9605 -6111 -16641 -43045 -24703 26973 34802 19608
15555 19608 2522 3 17580 23237 6910 -14354 -10003 11933 4306 -16182 -6891 17827 31256
15542 31256 53932 37479 6199 38249 35002 1386 -8591 -14064 -16617 -14342 -7067 -15894 -16778
15529 -16778 -17722 -24789 -39157 -25073 -9061 -17229 -25844 -53274 -69001 -54773 -47806 -31150 4373
15516 4373 -9875 -32257 -45811 -46737 -33348 -7038 -2179 1470 14871 30223 18966 12275 5870
15503 5870 18736 11048 -3722 -11788 -26189 -30264 -24242 -31366 -35140 -51041 -28215 18604 38687
15490 38687 3597 -13036 -4040 -23863 -37825 -18756 -14293 6276 26222 18013 13254 33594
15478 33594 30787 18505 19137 31635 4564 1335 -17529 -17200 10682 16905 -17186 -30346 -11950
15465 -11950 -26322 -3731 10921 -10123 -41373 -42713 -79834 -67476 -29176 -24125 -49587 -39348
15453 -39348 -40146 -24378 6877 30014 4881 -24319 -37433 -50586 -45496 -56657 -44583 -7119
15441 -7119 21583 20301 -7426 -10687 975 -12377 10761 37225 51411 33355 25302 20799 38157
15428 38157 65182 63770 30136 -1266 -2785 -2098 12353 7248 -1099 -17525 -16348 -7958 -25028
15415 -25028 -42154 -11889 3072 -3075 -27137 -19527 -9482 6216 23628 7484 -18597 -32566
15403 -32566 -20838 -22959 -33753 -19873 -15276 -23623 -27317 -13949 -7107 15038 27644 8697 5514
15390 5514 11064 33040 62659 65412 19098 -25652 -31035 -49645 -52678 -44311 -14344 -12680 11931
15377 11931 45987 64916 86291 65906 53081 20772 -4823 14458 -25137 -59427 -50610 -29553
15365 -29553 -21738 -37001 -16039 1033 -3395 -16843 -64192 -66659 -28916 -13096 -4223 5791
15353 5791 10730 13366 6398 10824 23019 7698 2930 9483 10384 -6535 -25272 -25690 -37915 -10860
15339 -10860 -4167 -15593 -24865 -980 17863 23459 41938 44191 31215 33154 40243 30249 16961
15326 16961 12779 157 -7304 -288 12775 28440 40127 42180 45306 47936 33271 41782 35694
15313 35694 35241 18994 18102 28478 18383 -6375 -12248 18741 32497 16687 -3590 -4868 1804
15300 1804 15862 -4494 -1971 34747 14378 -2737 7124 13180 1736 -20908 -20080 -8320 -22242
15287 -22242 -15194 -11771 1448 14300 21319 18840 14776 18611 55663 53495 61803 41210 17124
15274 17124 1294 2526 -7078 11587 49728 58425 65357 62153 75678 78532 63214 61236 45498
15261 45498 44752 45177 61371 43447 13733 -8331 14588 33768 36939 41580 69278 62439 69598
15248 69598 41723 11936 -17355 -20217 -36395 -36522 -32155 -30121 -40709 -46702 -20082 -15039 -14259
15235 -14259 -3613 23898 27111 23001 24948 39525 48516 38090 13007 7915 9533 24052 10398
15222 10398 18349 20888 -2071 -19926 5801 -5283 -10675 2820 26784 17868 -2199 -24042
15210 -24042 -39018 -12800 -6858 -19877 3192 33856 -7541 -39995 -15642 -11406 -12579 -38687
15198 -38687 -30742 -35688 -18799 4796 16530 30083 14503 13206 452 -14072 -8875 16043
15186 16043 27890 46927 47980 36083 31215 25883 37550 48292 15675 20492 28120 27539 26913
15173 26913 28166 25257 33543 29244 34714 27388 18658 -915 3705 -17440 -31292 -19722 13322
15160 13322 32086 18599 -21088 -23443 -17430 -11154 -4689 -28800 -18250 -29274 -31646 8806 28810
15147 28810 46526 46254 26398 1073 -2662 26115 31594 39572 47980 35103 33949 39845 8830
15134 8830 7886 7102 -13249 -11559 -19308 -5869 14142 25557 30597 62563 77145 65911 10452
15121 10452 -6754 -32146 -22954 -14809 2030 27133 49039 49333 58555 68706 64012 60419 20374
15108 20374 3650 -3132 -21274 -11456 -11361 25900 43453 35871 36707 30725 2010 340 -14818 -13603
15094 -13603 -2715 -28281 -31933 -7382 4928 952 9757 -2041 -2283 27562 35562 27381 18089
15081 18089 20847 3051 -24780 -16812 -231 27362 32579 34038 3815 -12642 11330 22021
15069 22021 -7939 -28128 -6982 13363 14614 16642 25826 34530 15916 -2334 -20425 -38864
15057 -38864 -54140 -62831 -35032 -17532 -25819 -27499 -26213 -31150 -16892 3999 4425 -20849 -27475
15044 -27475 9042 -3986 -108 15432 23830 20241 15464 28530 20103 13284 28605 6262 -37707
15031 -37707 -58803 -37905 -12713 -185 -594 10878 14684 20887 16873 -8124 -1759 872 30177
15018 30177 19349 -6322 -14011 2337 25735 58091 36037 553 -967 -3836 -16025 -4010
15006 -4010 30125 16950 -22924 -39158 -21712 -3293 -7981 7870 16632 16933 9302 -26332 -50757
14993 -50757 -56087 -28764 -16958 -34516 -11909 17235 21201 22297 4619 419 -8381 -39460 -38285
14980 -38285 -24498 9923 17259 -1848 -10264 25459 56025 54375 19100 1101 -4905 -33972
14968 -33972 -53230 -10350 16806 34480 41467 41095 48538 56857 55912 19294 -1528 -10203 -10303 6478
14954 6478 25143 62527 67678 60387 73635 53417 18739 16716 -8039 2351 22136 26845 38571
14941 38571 37634 38905 24525 -7059 21062 36368 20646 2302 7524 3172 -21608 -34587 -13408
14928 -13408 -13618 -7770 14716 27595 54773 40702 18929 2926 27169 28897 15242 -1021
14916 -1021 2915 6910 6180 -3214 -15372 -35738 -41134 -7229 30386 -5124 -23347 11702 8695
14903 8695 10741 20412 2603 6265 12583 -8935 -12057 -32490 -23652 12935 58898 48746 42231
14890 42231 42422 54259 54580 20441 14352 11760 2320 6987 -3194 -33436 -11802 43418 34528
14877 34528 17217 16951 23874 41034 33670 20350 26972 45076 49039 42430 39992 54937 38725
14864 38725 30848 42787 29994 17407 9419 11872 35505 -1192 -12403 -31713 -57931 -51318
14852 -51318 -39061 -23580 -12149 11566 41711 16238 -19747 -15749 -1062 4215 11937 29844
14840 29844 38114 22027 16723 9472 23501 25431 24877 33595 20243 33457 34222 37858 37796 37114 41375
14825 41375 37442 36273 31679 27301 15850 47214 60753 33796 1281 -5271 -26669 -37897 -17965
14812 -17965 15317 27665 8567 5918 33588 38391 42135 31817 22077 5957 -1372 -13783 -11777
14799 -11777 -8156 8385 31465 38576 26170 43465 40649 25251 35131 43613 60497 90702 167653
14786 167653 212163 270815 301636 312960 306552 296611 297888 310931 313256 271123 220274 186271
14774 186271 146843 104316 73575 37076 13163 10957 20658 14974 11295 40095 27514 20066
14762 20066 26720 30487 24881 11230 -17960 -40604 -44821 -27391 -17912 -1758 4654 34364 40430
14749 40430 19713 18787 30328 49150 48001 65983 34275 12762 20985 44851 45674 42698 53945
14736 53945 33975 37039 29642 34395 62705 107283 117564 105780 111546 100924 101721 102923 113273
14723 113273 148327 151326 118294 124240 156346 172088 174916 164087 146555 124187 127898 124873
14711 124873 135805 123544 95331 95911 84765 94230 88028 79585 95221 82035 68712 111009
14699 111009 147211 161135 155683 176249 193381 215948 248304 266198 310937 349043 346291 368033
14687 368033 402942 417912 429759 434143 443617 456260 432560 407636 388560 343521 300991 289459
14675 289459 260936 238951 230763 185616 117003 85854 93037 84885 73225 81789 110149 122129
14663 122129 107734 115105 103925 94395 84502 66131 62841 82471 86100 88987 97568 78358 69229
14650 69229 89383 97439 59321 29354 21940 54194 61314 76058 72805 67917 53007 29669 38800
14637 38800 72171 70610 50401 47101 43683 71169 79857 77192 54273 69240 56955 44005 15630
14624 15630 19961 36025 27863 38764 62393 41408 17518 29466 31252 2709 4831 18392
14612 18392 17730 6422 27781 31010 68998 84658 56197 23705 24931 26811 28535 9036 -667
14599 -667 -18936 -26826 -25913 9449 12988 33248 30253 29935 26392 -474 -7386 -650 52 2321 5305
14584 5305 13236 13857 29087 25189 18437 26897 39433 28882 40498 66447 68914 52423 43352
14571 43352 48079 43735 61423 70038 77755 64785 41374 52896 49179 25771 29451 29276 9698
14558 9698 26256 16913 16005 26182 26221 1250 -5875 5179 15297 11320 -4773 -5619 -4165 10317
14544 10317 22082 12123 -19061 -23875 -6553 -2932 -809 10916 26326 681 -6818 4805 27084
14531 27084 33994 31003 51031 33769 17151 25667 12890 -15330 -25377 -12579 -34977 -22283
14519 -22283 -10035 23585 39738 43092 41171 24752 32368 15999 32962 38679 14131 7118 810
14506 810 15987 25102 34977 20159 11948 25361 35464 21815 1562 11174 8554 -28892 -10474
14493 -10474 1296 14691 38683 46628 67135 68592 56844 28435 14906 16330 3732 14930
14481 14930 14322 -2180 -32267 -31988 2735 32650 22705 18994 26408 30713 20238 23296 45976
14468 45976 63348 76523 79319 40992 23748 19454 12238 -2299 -17153 -20460 -27695 -21450 -6772
14455 -6772 -10399 -12198 11850 23840 26027 24276 18082 -5183 8702 24223 11918 -15357 -16469
14442 -16469 1179 -5411 17630 56529 67563 63094 48777 47105 47710 45055 45055 30766 25297 32768
14428 32768 31878 19319 12824 36622 37700 36460 50844 44539 44149 39424 16845 15960 9488 6209
14414 6209 -3421 12264 29770 27131 26451 56638 36595 15717 -10124 -23040 -9876 17680 -661
14401 -661 -30461 -24251 2469 6793 6535 10346 35082 28621 2895 -5609 10709 25055 29859 33360
14387 33360 16316 2809 3043 1400 27872 56753 66014 54815 41919 45613 43134 41338 51587
14374 51587 52310 35314 26112 8014 -7985 12861 18756 -5567 40165 67161 23520 1617
14362 1617 5495 21516 50234 51062 16931 2214 10428 31388 31747 37433 40217 22706 22186 38544
14348 38544 44424 58484 54593 53643 56206 77804 65889 65629 57944 41523 17704 -5232 175
14335 175 20891 36531 12371 25951 37327 18595 15670 32201 56175 50923 42511 56299 66183
14322 66183 35438 35890 37253 43171 43094 44714 75376 88026 92668 71511 80622 109043 92739 61016
14308 61016 29413 44750 37207 36153 11790 16284 31697 27418 46288 58276 23519 25441 10373
14295 10373 -4926 7578 -4709 28889 48368 37949 24052 25421 30265 18372 1150 1185 20039
14282 20039 17387 21707 7664 6063 28427 19277 10488 -30496 -35790 -21249 4914 15913 22469
14269 22469 50785 74527 51945 42234 47339 68517 92262 88246 77163 70912 61603 54711 71034
14256 71034 95704 101292 101797 106567 86579 77474 72216 52661 40094 33329 60770 82481 86081
14243 86081 93284 80745 89828 99053 62187 49897 38216 30375 25782 18124 30769 34829 52622
14230 52622 50876 31275 10282 10717 33437 39573 49407 51524 44119 39041 47609 18090 27455 52960
14216 52960 60243 61604 46680 25554 18668 21185 9781 5380 1645 24616 82843 83753 68081
14203 68081 76361 78991 60046 57390 73655 85288 95660 104238 71121 29994 45896 44160 40965
14190 40965 7131 -2592 27832 42400 29702 17768 16675 15398 -5122 -7346 26465 40415
14178 40415 34819 36229 60865 33283 22068 30608 34990 43314 47838 27427 21003 24581 26276
14165 26276 51088 50957 59460 42319 10146 8156 39837 64674 67723 55092 87840 66234 54262
14152 54262 45437 17373 -1792 32937 39793 51634 69858 64741 71362 74624 42340 18204 4026
14139 4026 11382 19726 49536 66334 68100 48941 13833 -1680 -13616 -17419 13669 14281 8413
14126 8413 -5680 22094 38160 21515 1601 14472 31421 38313 16898 -7500 2454 -18424
14114 -18424 -46450 -43056 -9636 -4026 -19895 -31745 -30651 -3219 12131 443 3123 -22978
14102 -22978 -15094 -19967 -19733 -40022 -7313 18254 20315 5507 25229 41709 44328 29882 4924
14089 4924 12438 29731 19658 36854 38475 24722 55408 47230 24962 25647 23126 36971 10927
14076 10927 -14613 -2986 10488 5663 -5895 -6595 32296 45980 16918 -1682 3673 -14363
14064 -14363 -14786 16408 40375 63062 68073 54842 52407 46940 16314 -8621 4131 29775 49795
14051 49795 67656 67019 50942 55589 83554 95397 87760 56890 40222 56917 54706 33855 52481
14038 52481 59532 47864 38057 25226 18784 25575 44641 42093 38750 38801 50476 63635 72526 56723
14024 56723 24165 25834 35097 8848 -24741 -24866 -25352 -45335 -27541 15086 45495 53347 63879
14011 63879 77375 75867 69753 43116 40714 30391 1410 -10929 -5928 -4680 -8420 5730 29098
13998 29098 20314 43137 85177 76374 36877 45228 80439 88704 59820 33733 17278 41548
13986 41548 28344 38300 37756 32353 38156 55959 33015 18621 12720 2867 7722 1803 14806
13973 14806 27625 17342 3190 -9696 -10179 16286 26192 -1749 -16529 29452 37365 49365
13961 49365 49651 20962 22816 44944 49166 29027 40319 37997 30943 30429 20614 73543 148783
13948 148783 205816 219529 200951 165713 141059 104631 79928 81663 53713 65207 64774 59019
13936 59019 38583 29851 48569 28525 5302 4275 16486 5566 -5708 -17642 -5636 14841
13924 14841 22444 5568 18626 5912 1595 18444 -2995 -8114 4695 18811 38956 28321
13912 28321 28897 32538 46909 77491 67761 48716 30066 20254 38373 66819 78245 71616 55586
13899 55586 46135 41746 48989 49003 37227 41559 43160 30058 43322 80741 116214 102159 73094
13886 73094 70681 69968 53535 61542 55855 38880 48177 49208 20692 3725 19005 21922 49462
13873 49462 56712 64638 64046 67736 69958 44154 17625 31545 75220 65541 46637 33536 46245
13860 46245 35548 34978 33410 1365 22149 13370 -6834 -10748 1329 35729 48426 43536 33527
13847 33527 48159 39943 44111 52018 56972 44255 10251 -8468 4446 35715 52341 77443
13835 77443 97776 83132 54618 33253 31480 8841 -474 4984 19240 45896 71787 57875
13823 57875 50728 67703 79655 91197 58300 41790 46290 53863 48990 70300 64631 57015 53206
13810 53206 72166 85429 85654 63295 49585 29728 3745 3054 44880 78524 61826 29598
13798 29598 31824 53231 47033 61951 74139 79425 62652 52136 84440 80293 64548 61195 56569
13785 56569 48385 24554 27016 29041 54153 53073 44861 28821 42761 63238 62449 50707 40505
13772 40505 11506 2684 30377 21499 29261 46171 56087 51557 55106 70919 86046 94658 95020
13759 95020 90462 81990 124831 142853 131356 139129 158806 137399 134588 142089 180676 194296 185361
13746 185361 205797 202381 172669 138474 136481 142447 138703 126325 110931 91423 93679 77215
13734 77215 55865 56714 68918 97920 121772 116451 120366 144677 167123 154374 166935 175480 194046
13721 194046 171711 147243 133061 115913 115413 126086 148501 147274 120694 111965 95255 69516
13709 69516 93847 69895 80114 94271 77532 82070 90093 79231 34308 37318 57669 91956
13697 91956 76009 56492 41630 46942 70866 83871 70471 68925 55042 47838 59953 48351
13685 48351 45692 54673 48486 61965 76929 100505 115651 130213 115827 130011 113216 137221
13673 137221 206286 228719 221323 208036 212081 226545 234364 226176 221565 221390 240070 253270 283675
13660 283675 272366 236874 222015 190975 179116 197116 178330 142246 130008 164759 208249
13649 208249 188495 180231 166688 154667 162566 159074 154881 185958 166941 158146 171163 167815 163945
13636 163945 172572 185192 198063 176858 167150 154678 129572 136887 143871 142888 127354 107023 91358
13623 91358 66770 61329 94194 87874 86249 104409 89583 58948 34687 43059 42490 44462 45006
13610 45006 67050 93849 110572 111138 121958 125115 120580 118103 105268 108577 91576 115907 150401
13597 150401 155633 143099 130372 126719 108117 110793 128514 162145 188339 181314 174078 139086
13585 139086 127599 162217 161107 172143 173673 157110 166061 188046 185757 181849 135392 129864 162898
13572 162898 176283 186167 173571 187621 211178 216763 184193 164820 191170 210745 182104 181020
13560 181020 186000 201052 177649 153476 183759 208763 203439 177442 139422 116141 125487 152620
13548 152620 145742 153019 161691 140772 139963 117447 124826 122308 119872 122178 119062 124451 107406 81318
13534 81318 81999 109348 127753 121689 137891 119216 118178 109228 121018 131890 147144 152989 137078
13521 137078 123750 114147 124662 138395 147415 158706 155600 152547 161756 155779 201870 203071 199719
13508 199719 188581 169003 172741 153020 138692 142249 161001 183561 206454 214989 217537 222219
13496 222219 218549 231932 223367 216091 189024 176241 196977 213769 229061 248801 256326 250579
13484 250579 261447 256706 237985 218528 204609 199759 219571 221777 212714 219259 235188 208482
13472 208482 184691 190221 167607 139327 151883 167958 169690 171391 155259 159862 155054 167644
13460 167644 191852 205479 214744 190258 181581 173520 200473 204970 213799 217881 206920 191953 183560
13447 183560 204255 190329 189718 205257 168732 190911 181373 172747 166838 162245 195022 211761 212543
13434 212543 215392 189938 173786 164214 174852 213263 216608 188903 180046 176870 207357 207680 192376
13421 192376 182865 166310 165564 176418 159631 166799 185591 185477 164504 147607 172137 211255 217710
13408 217710 224267 224916 228646 201289 197441 189165 182688 203342 216656 224655 241496 214706 192099
13395 192099 211540 228030 245264 239483 257582 277743 289724 287432 300719 309017 310527 340084
13383 340084 341089 302057 305640 294951 290910 302935 323727 328393 340331 338873 335223 328010 335136
13370 335136 325454 335016 334851 335314 358923 363031 385897 431412 442289 435586 403783 387237 409401
13357 409401 401437 392645 405081 438348 457934 458836 476786 492373 484174 482691 483688 482808 492957
13344 492957 504227 514058 525133 520677 546080 567628 589284 664363 716060 730462 773312 884265
13332 884265 997407 1080133 1155247 1281345 1414079 1571437 1726040 1973669 2266617 2642404
13322 2642404 3125285 3737070 4624968 5904554 7689983 9905485 12244741 14129915 15129993
13313 15129993 15468028 15825413 16931606 19071458 21840165 24200601 25020777 23938693
13305 23938693 21594917 19169789 17587535 17044448 17082109 16906761 15931690 14227019 12332724
13296 12332724 10832223 10072118 10139302 11033555 12556596 14379512 15983721 16940976 17224427
13287 17224427 17388489 18128595 19888637 22484116 24888960 25955275 25082934 22688223
13279 22688223 19900473 17782151 16702708 16315261 15906081 14825943 12940820 10610941
13271 10610941 8374595 6603606 5300879 4379214 3696111 3199384 2823600 2494810 2249386
13262 2249386 2088933 1949333 1799404 1674167 1575613 1477247 1416476 1365581 1329597 1339810
13252 1339810 1358651 1366317 1373852 1380352 1416336 1497678 1573115 1672413 1816628 1974415 2139864
13241 2139864 2364102 2673891 3081136 3599690 4321239 5252795 6548453 8446684 10978480
13232 10978480 13751364 16145282 17550535 18049459 18364726 19325224 21515750 24685909
13224 24685909 27713295 29203244 28426476 25929801 23027926 20849635 19926789 19905564 19866551
13215 19866551 19047594 17258728 15025493 13101623 11932214 11713355 12472231 14100688
13207 14100688 16176103 18086327 19346300 19848331 20035276 20687727 22411411 25149997
13199 25149997 28005441 29667087 29223109 26867859 23717710 21060808 19526208 18941943
13191 18941943 18524446 17481812 15571078 13086786 10533732 8425593 6876664 5754798
13183 5754798 4927595 4205743 3609095 3115842 2746201 2428576 2149534 1980267 1811402
13174 1811402 1654925 1536657 1402366 1295998 1225942 1163255 1077330 1041770 990131 950460
13164 950460 931560 897661 876495 851791 821041 787341 792717 799792 794039 793976 793283 795624 791352
13151 791352 779547 765795 780855 786580 796002 819918 860492 940837 1019023 1159690 1407206
13140 1407206 1699764 1930546 1974632 1824562 1527837 1258012 1059671 951236 876674 829214
13130 829214 784458 745971 722965 693245 666106 643846 635454 646105 674116 701303 703153 701737
13118 701737 705264 707516 690017 673217 640081 639019 651753 639260 630511 676870 648541 636728
13106 636728 649302 650174 659844 670778 695910 784885 831080 878820 948105 1092157 1317335 1637148
13094 1637148 1943546 2069618 1930569 1577863 1211363 987949 847123 750847 702273 673592
13084 673592 663854 703711 713722 709953 725444 705986 683315 646203 610831 585957 565536 537410
13072 537410 522420 496388 473897 494021 499911 489752 475543 448167 432455 442911 445254 452397
13060 452397 465142 427523 426694 434123 443362 455966 507212 556772 593094 675869 798682 948639
13048 948639 998276 980587 926820 848703 780678 714538 660478 613093 572847 559992 533004
13037 533004 479454 467295 458522 436103 425115 404100 412855 446969 506747 518212 506748 466577
13025 466577 447247 423535 399211 358911 350250 325045 318522 331714 365027 410667 465574 538816
13013 538816 584746 630736 660764 645995 616271 550199 491547 430940 379150 332954 286143
13002 286143 251816 217266 209555 233850 240129 241327 222361 201179 190981 206400 239619 201082
12990 201082 195532 196293 231631 245553 279654 296234 272686 261861 290953 332115 360151 389681
12978 389681 428812 473086 479164 514511 530231 493438 445010 421173 380933 344534 319680 282005
12966 282005 269822 260196 271405 284526 270352 265252 223940 207915 200069 205995 213180 221072 211049
12953 211049 199371 205390 192356 214190 238729 240883 254187 253267 239192 241015 247670 255774 229672
12940 229672 203420 216727 223617 237604 258489 249622 229051 236492 245517 245071 220645 195968 211635
12927 211635 212901 222606 262261 308731 324980 361172 420749 463103 489536 463873 432044 388998
12915 388998 333026 312547 277694 284643 279010 258203 225580 198022 166432 139720 147582 163544
12903 163544 159674 179957 195025 185264 166939 161360 166181 164324 160215 165678 158853 165028 188270
12890 188270 205892 214774 224988 223514 226022 236098 233171 211717 185758 188494 216205 227343
12878 227343 246112 286878 353280 392330 416556 433360 446625 448129 452336 443066 386860 322320
12866 322320 301754 299060 283415 288154 293093 303825 329940 334204 321966 308845 301822 306567 336446
12853 336446 363825 363558 359326 387729 418986 409375 367185 343013 299594 273736 272609 280920 290892
12840 290892 296933 268691 239045 266653 253879 268071 260199 255164 259185 262124 254832 240154 252064
12827 252064 253161 243241 239636 244581 235191 244710 242457 216113 213113 226077 242461 215303 206900
12814 206900 193272 187064 195176 180045 193789 238943 268509 296812 294729 303582 311784 305925 295670
12801 295670 295645 273366 251347 242773 250545 246750 234796 224183 219649 246824 255028 226787 216108
12788 216108 221803 223828 255652 282532 281887 254643 251766 264937 280756 313216 322003 330010 356117
12775 356117 380073 403554 401263 399488 386324 383909 394018 403406 404958 414231 414932 374231 343167
12762 343167 346696 380027 430687 447222 441237 434236 453767 487781 542211 600049 659335 722178
12750 722178 785223 827893 878268 918574 930431 976129 1011475 1021568 1049237 1088480 1124790
12739 1124790 1164086 1192992 1244736 1357458 1471258 1619579 1799034 2092480 2478423 2984317
12729 2984317 3692737 4565998 5534332 6515469 7417848 8227916 9004529 9757569 10332313
12720 10332313 10670225 10782236 10738506 10637251 10577660 10490457 10222892 9694884 8922692 8134751
12710 8134751 7490019 7089553 6992927 7212117 7734826 8531668 9463321 10330275 10942017 11301623
12700 11301623 11646615 12203672 13145769 14313361 15311023 15842053 15902248 15701654 15499152
12691 15499152 15464013 15624070 15901292 16111064 16012398 15540066 14676702 13606503 12534728
12682 12534728 11690740 11165305 10805740 10401077 9807930 8976348 8109878 7402590 6969011
12673 6969011 6786575 6846417 7137213 7708502 8559868 9507510 10316271 10793755 11026294 11206997
12663 11206997 11499622 11931725 12294925 12363545 12024140 11357209 10555831 9886004 9334249
12654 9334249 8772729 8091321 7287048 6529587 5974152 5734400 5772621 6112770 6783917 7737591
12644 7737591 8753437 9625652 10260206 10824168 11478756 12259711 13046322 13638816 13821588
12635 13821588 13613258 13195970 12834679 12556319 12206964 11670189 10860621 9963707 9179675
12626 9179675 8694811 8651473 9088565 9948950 11108959 12334479 13290136 13859320 14169871
12617 14169871 14497604 15104388 16132351 17393328 18434927 18901294 18792076 18410185 18224763
12608 18224763 18403377 18920661 19521287 19863907 19698084 18953029 17777515 16500906 15409534
12599 15409534 14627973 14109731 13560446 12779331 11646566 10316734 9075867 8153813 7659885
12590 7659885 7585124 7883966 8483743 9320664 10268335 11222464 11936452 12453320 12957062 13506650
12580 13506650 14106224 14610685 14760897 14411051 13623812 12574552 11465232 10504257 9644502
12571 9644502 8682653 7574600 6397513 5248609 4271513 3502874 2946350 2559000 2274986
12562 2274986 2092737 1972322 1870079 1783764 1723753 1656254 1599520 1541747 1474361 1371929
12552 1371929 1283051 1156687 1050844 975486 904330 838690 738213 670721 638394 617278 624344
12541 624344 621144 618192 598143 571617 556312 540798 512746 490742 527557 542033 491066 464039
12529 464039 460767 439218 431910 455138 491526 533567 537679 528944 525361 519115 495686 473284 474105
12516 474105 481835 519351 536227 529039 518338 557013 620423 683910 748955 768585 747222 735725
12504 735725 715787 691298 685824 664326 620123 553188 502019 478935 450925 405567 365611 342330
12492 342330 306749 286200 283049 281178 284560 277861 254283 267840 256672 236775 239862 246384 255316
12479 255316 243305 218436 205842 226657 261369 265083 246730 230011 238924 257303 230971 234028
12467 234028 237233 239287 243685 263998 260504 261824 256089 266473 266452 280486 270864 287792 293065 272942
12453 272942 286005 280052 257452 253851 209394 173482 166996 200561 211060 192416 195696 191192
12441 191192 193271 201600 178973 168885 166646 159052 154634 146503 159082 141688 133696 137284 129004
12428 129004 121317 117045 129234 142972 163620 187032 199656 191935 183744 197449 215057 247925
12416 247925 264572 243034 246808 217833 197520 196855 217322 231585 217205 219886 205412 195575
12404 195575 206725 218000 203283 167668 155680 145623 131445 140993 151800 169590 194860 205586
12392 205586 210579 224392 210540 182350 177057 197464 219209 219008 213162 211435 197333 216294 245918
12379 245918 253991 251382 240109 234780 257967 278469 285737 275930 235849 251100 258547 227823 191668
12366 191668 180518 185587 212611 229031 238538 235480 219705 197913 205004 187879 164737 145632
12354 145632 147648 158779 155265 144644 140812 168687 174432 173354 170601 199466 181432 158677 150411
12341 150411 161877 160935 151860 158778 187876 211805 232651 255103 227054 216023 215029 221047 195488
12328 195488 225312 258962 290748 283153 228265 214119 223468 188645 180219 191879 174254 209366
12316 209366 238526 222160 202228 172200 165768 162316 154873 182193 199214 188757 158975 182751
12304 182751 168955 168619 193878 180922 175241 188507 187316 156217 162723 169145 177148 165534 185064
12291 185064 179598 182164 213068 228552 224827 225139 218796 239232 256180 294977 306044 288542 278949
12278 278949 314372 315656 285622 297724 320915 319942 303543 281691 286216 296057 300999 316321 331616
12265 331616 337841 347181 362499 353746 348717 346335 364885 357596 362971 362517 378657 360628 342084
12252 342084 351665 368197 388095 409052 443532 470625 481840 484614 473902 478686 508050 534668
12240 534668 532999 541432 544065 563270 566287 590318 633303 641907 655838 704597 755942 795038
12228 795038 864880 973998 1075382 1206803 1351488 1533220 1734431 1975076 2315017 2780702
12218 2780702 3351302 4090737 5027257 6273748 7957031 10326564 13678081 18196696 23822466
12209 23822466 29982971 35702278 39840861 41418573 40060233 36092519 30467490 24367560
12201 24367560 18807001 14321460 10998804 8665933 7076735 5933397 5075998 4428388
12193 4428388 3895565 3428638 3025864 2702120 2455900 2248447 2080196 1929453 1811189
12184 1811189 1746539 1720128 1689346 1633357 1577930 1553912 1527227 1491719 1517834 1578161 1605681
12173 1605681 1673364 1771501 1888728 2020916 2228438 2544150 2942160 3439888 4048216 4830332
12163 4830332 5840968 7152348 8902321 11332906 14723160 19315182 25073545 31494500
12155 31494500 37568345 42091614 44087533 43034525 39212869 33466080 27053916 21035006
12147 21035006 16092976 12435057 9897540 8123645 6889462 5998427 5359191 4839774
12139 4839774 4481788 4239466 4061291 4007133 4110595 4350799 4746221 5363701 6251488 7476854
12129 7476854 9226601 11763039 15298503 19835736 25009052 30047051 33993060 35947256
12121 35947256 35354610 32376738 27788071 22531613 17520075 13374821 10286286 8120768
12113 8120768 6636777 5587585 4796178 4179228 3686633 3254758 2898418 2585059 2315044
12104 2315044 2112209 1938822 1814856 1697036 1599925 1535838 1494782 1449996 1405175 1383575
12094 1383575 1372839 1364923 1373892 1363074 1398668 1459703 1525905 1600048 1733342 1913155 2105618
12083 2105618 2344491 2697026 3180264 3788821 4559922 5575678 6953886 8852316 11546141
12074 11546141 15278920 20079938 25609258 31104696 35545156 37950699 37754861 34970829
12066 34970829 30257825 24656818 19180612 14557523 11057783 8564121 6833601 5621729
12058 5621729 4742479 4060448 3483154 2998556 2593373 2231882 1975138 1742321 1511920
12049 1511920 1348380 1251546 1164716 1076706 1002718 961393 919261 895111 877466 852135 809534
12038 809534 758663 722526 704389 683858 649695 637359 599574 562064 522384 521356 503668 457555
12026 457555 456051 444141 447999 466702 465910 462700 485894 497562 512541 498245 481654 466148
12014 466148 473228 481042 484354 504720 508029 496838 480794 479943 474577 474011 473193 478447 466307 499537
12000 499537 554181 624606 666753 657220 607793 564525 507273 433606 386469 356748 329612 324366
11988 324366 320910 316822 319423 329523 312385 305592 288100 255148 278671 294045 303690 310164 309080
11975 309080 313425 295839 317570 312556 327217 331588 341296 349886 377386 387378 376603 363859 374111
11962 374111 433634 471075 508277 570140 634799 731819 863868 1064963 1307588 1534518 1692935
11951 1692935 1698062 1569169 1305485 1015229 782804 643111 549943 481890 429123 397208
11941 397208 377351 355691 329221 316435 314973 324671 330574 314559 302373 290650 272812 249036
11929 249036 249372 262805 276524 292533 305108 300163 306706 329082 312738 303772 310866 307789 322728
11916 322728 362152 386181 414823 457193 538310 665461 827841 1026136 1248528 1479252
11906 1479252 1604019 1565742 1389427 1139000 911437 737649 617982 548418 506177 478984
11896 478984 471802 460898 433827 434639 456932 439437 402864 420960 416378 387322 368010 377473
11884 377473 375413 351547 367651 393386 404244 422339 428741 435080 451182 487162 521371 548130
11872 548130 574418 570311 578143 597482 598104 614642 659440 731450 843390 943867 1014295 1103075
11860 1103075 1178006 1221803 1231111 1223553 1257129 1316660 1371244 1433541 1458968 1521636 1638347
11849 1638347 1780148 1984512 2257713 2611751 3104372 3781791 4668226 5840703 7415571
11840 7415571 9368231 11584830 13801162 15635537 16742007 17015928 16545702 15549860 14302007
11831 14302007 12987445 11774512 10656971 9641461 8704254 7927994 7372036 7093541 7134436
11822 7134436 7590889 8456272 9733212 11354939 13149985 14830037 16148302 16976367 17179674
11813 17179674 16833979 16128440 15191317 14125878 12988720 11787616 10566816 9295968
11805 9295968 8024511 6801668 5761632 4896245 4215700 3731546 3358385 3091807 2909407
11796 2909407 2834660 2808678 2842010 2915441 3046134 3273774 3526458 3809128 4192360 4644042
11786 4644042 5248514 6151037 7424408 9082969 11129480 13466003 15817236 17869884
11778 17869884 19296014 19856082 19485785 18309211 16570861 14652742 12957071 11644433
11770 11644433 10835582 10492074 10423140 10506546 10691023 11003771 11505080 12355402 13663857
11761 13663857 15391566 17434591 19741417 22225083 24659761 26766610 28273467 28910813
11753 28910813 28526755 27161507 25016726 22432047 19733114 17227951 15067234 13190015
11745 13190015 11581453 10222768 9105844 8269617 7806457 7739446 8020009 8623689 9447218
11736 9447218 10406287 11332143 12081804 12655441 13008544 13038253 12751347 12238885 11514422 10573065
11726 10573065 9581043 8664238 7860824 7186256 6629386 6134936 5715682 5308636 4877111
11717 4877111 4420617 3973148 3556302 3202475 2926975 2713863 2585287 2492743 2496578 2586310
11707 2586310 2740866 2942146 3217480 3617711 4173559 4971044 6115199 7693674 9713414
11698 9713414 12075500 14525243 16703021 18161026 18565516 17844050 16194426 13976217
11690 13976217 11630067 9499033 7839189 6698606 6091890 5891570 5960147 6325883 6969868
11681 6969868 7894056 9024557 10338861 11617653 12750936 13607165 14150542 14384013 14255616
11672 14255616 13757620 12887185 11702784 10270873 8670671 7124635 5742892 4636883
11664 4636883 3794395 3150455 2665949 2320122 2019301 1783884 1590584 1424156 1293336
11655 1293336 1200207 1088415 990585 911195 870334 825920 772521 727600 745979 748425 709409
11644 709409 670589 668264 648456 625340 610517 575593 554317 542173 550524 554190 545467 571469
11632 571469 593677 619535 630983 652939 600907 508069 443098 397298 384300 388171 392135 377887
11620 377887 355652 364899 368887 354001 356916 347886 331461 324868 329015 379660 400305 393763 401966
11607 401966 409400 397107 364150 350445 348576 344445 327395 327049 313395 276242 249213 241169 221013
11594 221013 248304 290309 316058 328750 335844 316655 293935 287459 277288 291283 326579 336536
11582 336536 330193 320481 324154 310129 265300 278410 293397 262461 264333 253158 227112 208616
11570 208616 235317 244614 250813 235163 256400 276787 275576 255352 256634 257847 253829 275019 267771
11557 267771 270762 286606 269196 237798 232973 224011 218288 213269 208213 207570 197121 190157 184590
11544 184590 203394 203833 209374 218932 204494 181826 199824 216822 202069 184619 185564 182518 189402
11531 189402 202715 189838 178898 180473 208462 198516 166658 150773 177126 208666 225244 250447
11519 250447 249697 240353 242682 234967 236783 257550 252777 242853 258242 270034 254698 271443 253982
11506 253982 240974 227188 224392 218893 205527 197297 218180 245426 261491 287723 274834 255754
11494 255754 219155 219139 228964 218475 215411 227257 246564 267999 269766 230516 228416 235820 247998
11481 247998 239255 218344 219516 235391 252134 233370 252391 242502 238140 228893 230341 233071 232456
11468 232456 219899 209782 215042 213811 208591 207610 224006 219254 211812 223690 229452 245466 259308
11455 259308 277046 279437 276882 281272 267316 243713 235518 238802 227238 216138 244065 239304 203301
11442 203301 172725 163144 157749 166701 196968 205668 225475 242633 231037 210361 209105 215096 218387
11429 218387 228753 240904 238427 235279 244454 244563 234336 204459 206865 225336 253211 261365 265835
11416 265835 298870 296479 253460 237808 222131 219922 213813 230387 249336 260833 282087 295253
11404 295253 307506 339775 344249 335564 366311 411619 433492 449315 433528 427340 382304 340061
11392 340061 322648 305057 338052 332410 302681 283257 291203 300772 321503 350175 364718 387462
11380 387462 410231 411091 417613 410147 415154 410847 388893 369144 310200 246293 233661 248521 266476
11367 266476 235386 226297 235217 240487 232650 221356 213035 234638 257278 232511 228966 227224 231506
11354 231506 236920 231704 228472 212736 195141 183868 217652 256357 271501 287479 315104 326501
11342 326501 318528 328957 325287 351518 378700 400121 421158 468690 537414 646544 688250 639102
11330 639102 598167 627546 747591 926887 1119161 1107107 991043 798898 677645 628180
11320 628180 594329 582244 569373 549575 532875 535265 536599 507474 472860 436167 432999 431095
11308 431095 422108 423651 406810 391048 392254 369787 351181 354030 352260 350051 391737 429439 443989
11295 443989 425721 392602 364177 352382 323275 294325 261102 244289 258911 263991 244643 255395
11283 255395 277333 282076 303935 304093 271450 243453 228937 226290 233939 262845 259034 235555 233441
11270 233441 237542 238866 239714 248812 248621 260005 272316 275829 285792 294175 303470 311048 284226 252149
11256 252149 269050 276017 264734 290730 296829 300948 306803 322754 357861 384558 392771 326047
11244 326047 329895 393301 410092 376132 326420 298512 290807 302901 317373 313611 305216 302954
11232 302954 289839 262138 270434 287383 300321 296386 300084 310594 300510 308759 296058 293378
11220 293378 278171 266527 258410 217096 186303 184394 166006 162444 170910 159513 161147 161177 169166
11207 169166 177207 175564 192362 173480 187364 193294 216155 216919 231722 241292 210346 189967 174951
11194 174951 164750 180814 185933 188214 169922 188837 205157 207026 182885 141069 129437 139031
11182 139031 134899 153262 163968 141391 134111 130286 155194 185604 184613 179784 166025 140810 146126
11169 146126 165781 169009 145043 129756 137417 142045 137899 121710 114930 129115 152519 172521
11157 172521 165859 157246 160654 164311 141198 122646 122532 121086 151032 180600 188752 165071 138784
11144 138784 132904 133308 151668 166132 169779 158244 154160 158127 168183 171639 184124 180530 186958
11131 186958 188494 192623 182857 187490 191707 192198 226006 261905 254681 224055 208711 182581 170932
11118 170932 153739 157150 173092 179518 178560 170891 175195 202854 201290 195777 228698 252522 243173
11105 243173 230769 243068 269516 270951 251568 246472 249750 222391 227496 233956 210100 209617 200075
11092 200075 237335 247644 233632 242698 234243 195997 179353 215097 230106 220185 211526 208580
11080 208580 230172 256645 276072 306068 352837 395030 442257 453949 424256 370510 330145
11069 330145 321283 287928 262940 251548 243484 222014 204670 195999 174206 162179 178264 165354
11057 165354 156654 156465 176410 207568 217724 230962 237826 252010 307749 332235 310582 322186
11045 322186 348609 340395 331267 361417 348533 323583 331509 316698 286705 257285 242763 209881
11033 209881 199820 223089 244252 247558 221062 208007 240672 262402 292903 325032 348061 329458
11021 329458 336026 347045 349716 321491 311318 329895 340586 359273 363499 400547 446745 487422
11009 487422 475544 442498 386092 357542 346104 337099 330551 334792 338801 336782 324155 304280
10997 304280 333916 366735 410598 423292 449704 464272 460241 404264 353565 316330 282205 243990
10985 243990 209133 206963 181545 194103 263218 276928 234878 204055 178412 182428 185913 199128
10973 199128 199600 189469 194139 214773 227847 229964 233239 211157 188354 181519 187730 196229 223644
10960 223644 239767 210402 204705 203726 195431 189155 177243 180073 176630 179949 152056 148774 151750
10947 151750 138433 111099 102495 110747 139138 166942 157404 165298 173982 178410 177359 174746 181971
10934 181971 220851 249947 253724 263251 297450 336037 320986 317345 325728 320710 315430 307127 305593
10921 305593 378864 481185 530067 516003 415230 312261 226214 206822 209231 194432 180814
10910 180814 169035 156821 150930 143073 155990 170489 160355 171375 163048 152830 166934 152938
10898 152938 152324 164067 161701 154491 153494 156738 170868 196202 178243 142897 132625 148930 177697
10885 177697 208935 217416 222795 236669 207313 185606 173150 169995 177883 183075 172785 193831
10873 193831 161830 126909 133924 149131 145003 141887 129050 110037 99864 122235 138900 132246
10861 132246 140378 151900 168870 166362 198741 224235 220084 205978 196781 168113 168174 183008 188923
10848 188923 193191 191487 177482 154129 167694 182344 168580 191829 233328 273066 355265 435871
10836 435871 475864 455693 404233 345318 308406 291304 283057 268777 211486 204508 182501 154443
10824 154443 187698 189772 185279 200727 196047 224285 226400 238519 235055 219637 212912 210754 215189
10811 215189 192670 194380 209338 207326 208781 216138 215730 196077 183032 200312 185354 186042 221184
10798 221184 209022 244374 272390 284382 281627 274279 263629 257205 258138 281168 249648 254927 269067
10785 269067 301839 329863 331151 331503 318711 297401 284677 320889 357992 392919 413629 406650
10773 406650 386250 381399 367422 393615 428236 439172 443633 464105 482435 491748 487966 474651
10761 474651 475566 482477 572627 652881 688796 759789 850131 984322 1147501 1365339 1658792
10750 1658792 2041082 2427022 2739949 3047418 3362683 3548904 3554555 3426163 3233283 3055713
10740 3055713 2866757 2724821 2652668 2745868 3081220 3670350 4494923 5399237 6238996 6864723
10730 6864723 7268937 7479341 7554834 7419901 6977173 6339439 5645795 5044834 4580750 4229909
10720 4229909 3938142 3744333 3628773 3584214 3585525 3667248 3903187 4256139 4761010 5484204
10710 5484204 6529698 8051994 10011392 12189289 14074183 15303639 15893418 16080132
10702 16080132 15927509 15145849 13688446 11801733 9920093 8406097 7315516 6612965
10694 6612965 6170725 5851578 5667300 5590504 5584185 5678528 5924795 6352884 6972558 7866267
10684 7866267 9120512 10834485 13022368 15389106 17486364 19040330 20182458 21032412
10676 21032412 21447533 21159666 20039304 18279378 16369245 14646146 13133038 11757611
10668 11757611 10471592 9350804 8469185 7891323 7614804 7591020 7807948 8271336 8937685
10659 8937685 9784527 10892306 12383161 14359778 16884795 19894569 23020751 25787229
10651 25787229 27936383 29428264 30009888 29420808 27676808 25079742 22051465 18826980
10643 18826980 15746048 13155147 11197142 9875945 9065722 8610678 8422572 8374375 8424998
10634 8424998 8637883 9038781 9701031 10688453 12191719 14204357 16490912 18676370 20486045
10625 20486045 21840008 22750981 23073837 22586162 21307692 19356888 17124665 14874189
10617 14874189 12816139 10971146 9395134 8127533 7182519 6531046 6129498 5921216 5870394
10608 5870394 5996270 6214918 6508099 6881751 7392653 8019794 8725109 9597324 10716507
10599 10716507 12106066 13551068 14708276 15352344 15388137 14975133 14209771 13122633 11598729
10590 11598729 9721117 7887950 6405462 5390108 4780425 4427655 4252185 4185560 4158187
10581 4158187 4175365 4222240 4263327 4390361 4694421 5221101 5974089 6882483 7832796 8653825
10571 8653825 9269035 9633182 9945994 10186837 9810830 8699298 7176614 5636448 4452867
10562 4452867 3641126 3098833 2729043 2475628 2288905 2135583 2001519 1861930 1736700
10553 1736700 1643542 1526884 1394042 1303648 1178737 1052738 966979 891086 822980 768468
10543 768468 733685 691931 657255 633634 591713 561156 538687 542970 566755 567748 537250 512202
10531 512202 503557 475210 456881 453098 451008 453860 494006 525244 528936 521182 517372 554681 633771
10518 633771 696715 752550 868036 1032769 1272742 1598152 1796514 1832670 1813135 1855256
10508 1855256 1884623 1775222 1547270 1260361 1032396 905302 846934 823363 790658 777039
10498 777039 737619 676077 660740 662254 664653 673249 662821 657647 645168 640041 637355 619818 597802
10485 597802 582507 585107 587866 631187 643888 648908 667264 695178 733065 797416 862201 883763
10473 883763 908028 908482 887111 884757 849756 764561 712079 647895 612811 607082 597935 619697
10461 619697 627956 640659 682395 729150 811300 915879 981394 953387 894201 809040 745275
10450 745275 716157 682548 662949 620742 592086 574727 554249 562877 582388 571905 589324 608468
10438 608468 612442 622914 619968 632376 651670 657902 646957 663771 691375 722708 750641 747086
10426 747086 750927 787646 813640 806115 772742 755949 772547 819541 850378 869493 918315 937803
10414 937803 969092 1018975 1070008 1097747 1117336 1163927 1217038 1273843 1344900 1463096 1632798
10403 1632798 1840625 2069775 2251998 2378070 2514131 2714011 2952157 3079475 3054060 2920556
10393 2920556 2791578 2776383 2853578 2868703 2829185 2778906 2774687 2904072 3177141 3522520 3760520
10382 3760520 3896324 4021438 4228296 4422511 4468729 4469054 4494667 4641521 4903327 5224349
10372 5224349 5637827 6154725 6822179 7660926 8539930 9401888 10436655 11639120 12904747
10363 12904747 14163277 15502205 17098066 19126989 21779752 25187614 29695625 35894721
10355 35894721 44513043 56499709 73708893 100059220 141685105 201751163 265827342
10348 265827342 314794770 359552087 411161644 452239793 451278243 416827690 371970645
10341 371970645 327936497 275372508 216008402 157723726 112957113 84369044 66509878
10334 66509878 54713525 46388039 40268976 35569060 31815096 28651583 25884277 23412497
10326 23412497 21319540 19558299 18025706 16591473 15309666 14267383 13361467 12450983
10318 12450983 11518028 10640556 9858270 9129741 8456584 7810674 7213017 6664394 6162495
10309 6162495 5702996 5323725 5023821 4775440 4584497 4430577 4312751 4176757 4056118
10300 4056118 3935258 3784955 3623948 3510033 3437775 3381577 3387682 3396323 3252628 3043557
10290 3043557 2790419 2592420 2496881 2434159 2339906 2258396 2210394 2172398 2146520 2139842 2098499
10279 2098499 2051338 2026746 1973966 1945023 1917670 1913923 1910656 1932266 1964815 1986002 2035107 2074286
10267 2074286 2173298 2296980 2294054 2171574 1993371 1832961 1703656 1585198 1502761 1431572
10257 1431572 1406465 1381448 1357924 1367891 1357874 1361653 1365279 1369300 1354026 1357421 1383100 1363536
10245 1363536 1337635 1296474 1273559 1223502 1178510 1153129 1142974 1133983 1133764 1125370 1139364 1209567
10233 1209567 1358931 1562585 1803295 1997241 2098703 2238174 2586404 3157153 3499265
10224 3499265 3310051 2736337 2101281 1621199 1370700 1223316 1084448 978003 909197 880460
10214 880460 854392 820643 825723 864888 855808 872678 874327 873913 877386 871762 849951 818768 823283
10201 823283 836342 810630 772659 781563 782861 737383 693824 673702 638426 633119 577608 554301
10189 554301 509676 460103 481694 499011 471762 454935 432948 437883 440756 456618 469249 504555
10177 504555 474575 478616 487065 490929 488132 522653 551364 568323 587969 587691 589051 581302 584624
10164 584624 608315 634583 634116 635435 604538 620321 641756 669848 705988 719506 726273 719539
10152 719539 743301 782983 816557 831090 805139 781412 703846 630121 630983 735472 893023
10141 893023 1103366 1255277 1204085 1063356 869376 668915 554783 523731 499091 490752
10131 490752 535819 695909 842875 852916 761856 642645 525247 482731 467760 441596 424732
10120 424732 413195 424587 424737 442829 451199 425560 401805 419618 421095 436304 480399 485300
10108 485300 480352 485388 509148 549233 557011 546302 560613 611628 673741 730695 844867 951592
10096 951592 930043 883841 791583 668867 561621 516539 488096 462690 419512 415172 409390
10085 409390 402663 376225 371261 386342 404370 402787 423817 448811 503886 551618 583852 553661
10073 553661 521092 474141 458699 470161 484571 531063 581481 677808 816577 1018562 1130166
10062 1130166 1075028 931185 750218 641301 585532 549049 504604 506583 494312 487263 482495
10051 482495 488014 516466 539818 556691 571555 595971 587343 554186 517423 470109 457997 449171
10039 449171 403434 376113 374683 378083 403433 398142 384075 379588 383641 373485 388348 399148
10027 399148 395975 371112 359896 370503 388834 402380 423358 438805 446936 472040 549487 628601
10015 628601 633295 577927 528227 452723 418320 393503 355959 340201 368035 393326 377600 376746
10003 376746 395393 419063 419891 418734 444368 477895 543603 595714 655863 811518 990498 1056619
9991 1056619 1014566 887044 748635 670433 643308 622359 617607 641149 649383 620251 617839 621449
9979 621449 621401 659077 665112 658267 684160 723249 774476 837079 897149 966061 1077284 1215198
9967 1215198 1313121 1320694 1291076 1275974 1358899 1473579 1553649 1633053 1720205 1802221 1879599
9956 1879599 1964380 2103283 2274177 2401072 2404319 2347533 2332657 2414751 2543099 2671943 2759659
9945 2759659 2905393 3166790 3427035 3659673 3921803 4197840 4314559 4207033 3976377 3752845
9935 3752845 3574080 3410267 3296984 3233550 3264948 3361621 3474750 3633905 3818853 4129199
9925 4129199 4554673 5074682 5604319 5983103 6207562 6359407 6539164 6815687 7152565 7538210
9915 7538210 8020106 8687685 9641292 10736935 11376476 11176822 10341594 9312109 8492178
9906 8492178 7957731 7670327 7514667 7467856 7477976 7494932 7431768 7328581 7271331 7298726 7459761
9895 7459761 7713159 8047541 8459698 8900973 9286880 9471334 9489247 9456408 9486339 9555576
9885 9555576 9563143 9484710 9312133 9125547 9024393 8977679 8989891 9087273 9215091 9301140 9411096
9874 9411096 9616409 9952696 10413535 10892458 11300491 11584486 11758024 11920330 12094306 12222970
9864 12222970 12359357 12482874 12611084 12718559 12824343 12829286 12741048 12612988 12522657 12472948
9854 12472948 12484605 12541623 12627167 12728585 12854891 13047128 13256493 13399052 13478079 13481466
9844 13481466 13447000 13386821 13300168 13163624 12978004 12743385 12506835 12275966 12185749 12405421
9834 12405421 13154992 14674781 16745125 18553914 19205139 18645467 17565426 16710703 16382721
9825 16382721 16544470 17017108 17612268 18057924 18220539 18069574 17607659 17034015 16450906
9816 16450906 15850374 15142048 14237889 13139127 11984864 10986746 10245184 9826729 9697724
9807 9697724 9744202 9948148 10286952 10675187 11063773 11405308 11652178 11884479 12206434 12714875
9797 12714875 13367966 14116016 14763406 15129165 15156049 14882864 14472039 13996682 13558448 13112772
9787 13112772 12647977 12131443 11582896 11027766 10579653 10197699 9903412 9695715 9602521 9606165
9777 9606165 9766489 10133455 10764688 11525648 12251472 12739442 12934134 12920049 12811802 12723236
9767 12723236 12703733 12660088 12615512 12604253 12563779 12318572 11816363 11053386 10146813 9236128
9757 9236128 8447724 7821564 7355408 6948711 6427360 5732255 4959235 4222360 3573772 3044611
9747 3044611 2651353 2361780 2170185 2004541 1868542 1779201 1707668 1630073 1543018 1494200
9737 1494200 1410489 1333591 1281198 1231384 1189110 1150936 1106733 1072160 1010082 970976 964548 963586
9725 963586 966328 942198 919739 888548 908414 912926 904234 897082 881037 887384 883592 876055 868015
9712 868015 870358 895381 913574 926750 943081 940128 949740 943182 918741 937014 946164 952525 938985
9699 938985 945110 985091 1004626 1028950 1027825 1026020 1036284 1050452 1078073 1075973 1078283 1075104 1043515
9686 1043515 992771 971986 951823 923393 917831 894894 908543 894795 911695 937880 960815 972942
9674 972942 969841 973667 1018593 1035183 1051555 1071395 1090707 1104938 1119980 1134011 1133375 1157068
9662 1157068 1181971 1199768 1218639 1222209 1207699 1186484 1195883 1225623 1269786 1291164 1275429 1267302
9650 1267302 1277396 1298327 1306167 1333717 1352802 1345699 1319645 1328420 1328836 1332354 1332820 1340038 1318483
9637 1318483 1284640 1264020 1249555 1245909 1265472 1303438 1314620 1336040 1332290 1333581 1307207 1264223
9625 1264223 1231395 1193404 1185695 1179808 1140111 1137450 1138722 1143581 1145880 1154646 1157396 1167429 1177879
9612 1177879 1201798 1171703 1154068 1141450 1112691 1126475 1138877 1153307 1176283 1159740 1193303
9601 1193303 1221015 1255114 1248892 1242569 1239944 1311940 1379293 1420809 1472074 1536265 1590944 1660177
9589 1660177 1703685 1717262 1717506 1694100 1666433 1668594 1699185 1687737 1722742 1769279 1827750 1886515
9577 1886515 1918323 1958594 2029824 2111799 2207995 2334141 2464934 2635391 2803108 2942311
9567 2942311 3145979 3462277 3875337 4342465 4864004 5310858 5622251 5825985 5988874 6156103
9557 6156103 6245543 6174178 5984616 5818056 5737731 5787036 6007123 6400887 6997782 7923436
9547 7923436 9277955 11112489 13412944 15895784 17980524 19094434 18828806 17312790
9539 17312790 15122866 12834562 10872339 9391845 8401232 7864015 7635197 7657751 7946209
9530 7946209 8557967 9441773 10489174 11509240 12310518 12916667 13532807 14469184 15878135
9521 15878135 17570434 19128007 20125982 20270705 19547465 18224002 16542801 14786697 13265691
9512 13265691 12185392 11790215 12177553 13286486 14820833 16292636 17117663 17061900 16116476
9503 16116476 14533192 12698137 10932187 9480701 8399559 7712254 7336140 7253081 7410538
9494 7410538 7831811 8544199 9539204 10789577 12351087 14159608 16142141 18127863 19950167
9485 19950167 21491174 22568482 22910927 22493316 21547934 20638890 20415415 21156479 22731178
9476 22731178 24692818 26510828 27858285 28798104 29441872 29827373 29958888 29896015 29634392
9467 29634392 29217933 28801426 28604565 28736688 29090207 29297612 28821201 27396001 25210631
9458 25210631 22729573 20583714 19219373 18851006 19338134 20405465 21782727 23361281
9450 23361281 25089734 26712139 27855787 28187014 27663715 26625064 25524621 24707471 24374955
9441 24374955 24418459 24724606 25223841 25980527 27000637 28030860 28392701 27452008 25134203
9432 25134203 22001395 18866143 16266695 14410468 13269081 12796558 12962691 13830418 15351001
9423 15351001 17503618 20168428 23137044 26137893 28893157 31119665 32364529 32254568
9415 32254568 30731164 28233052 25446935 22975521 21031958 19590689 18455651 17647141
9407 17647141 17355019 17761261 18988435 20820107 22720459 24320619 25694177 27217558
9399 27217558 29339881 32080932 35006812 37555292 39115988 39323944 37988390 35196021
9391 35196021 31302978 26902074 22645083 19099571 16608132 15202833 14811278 15288593
9383 15288593 16426588 17865075 19097341 19651519 19513357 18885380 18185541 17649525 17242188
9374 17242188 16836432 16257409 15455103 14375480 13059454 11625234 10136841 8765610 7632169
9365 7632169 6788250 6241328 5954852 5879071 6026597 6430791 7027943 7688609 8159408 8261656
9355 8261656 7921497 7253473 6501535 5850876 5325343 4991176 4839950 4821930 4950124 5166430
9345 5166430 5524808 6070177 6826104 7857721 9116985 10445184 11623481 12424809 12668644
9336 12668644 12275163 11367123 10182097 8977188 7960795 7265035 6928911 6964319 7389704
9327 7389704 8197741 9260082 10392977 11401584 12085605 12326629 12213795 12007585 11983780
9318 11983780 12342461 13223798 14428135 15623438 16426800 16720621 16704569 16799590 17060368
9309 17060368 17135951 16821738 16228653 15714186 15327383 14713391 13496559 11732875 9801699
9300 9801699 8102657 6830272 5926801 5336239 4959474 4747871 4705685 4796002 5047058 5496998
9290 5496998 6203998 7242317 8409438 9325276 9781885 9808976 9683427 9652282 9731375 9754437
9280 9754437 9751564 9852825 10063365 10095224 9671266 8807900 7753192 6809619 6074349 5535301
9270 5535301 5136306 4904589 4856710 4979997 5274759 5786193 6530481 7480148 8572081 9648806
9260 9648806 10567793 11185847 11329836 11058143 10697160 10458005 10501375 10737282 11081726 11557005
9250 11557005 12410039 13733155 15266580 16371716 16466211 15549368 14208447 13194229 12965000
9241 12965000 13513785 14487577 15477695 16016287 15805041 15076608 14225441 13554604 13148249
9232 13148249 12618913 11688544 10397933 9042485 7868236 7049850 6620685 6501641 6649366
9223 6649366 7138416 7950575 9088226 10344379 11443429 12555784 14008084 15959012 18089266
9214 18089266 19682787 20029149 18965086 16900199 14485491 12348413 10853994 10013222
9206 10013222 9540576 9179446 8808742 8440522 8095477 7624595 7041742 6435886 5887931
9197 5887931 5486935 5282095 5241945 5401211 5757384 6401551 7374126 8576227 9670037
9188 9670037 10384193 10655909 10785435 11273772 12535960 14411352 16288977 17429008 17424332
9179 17424332 16419076 14601047 12374515 10197725 8326151 6910078 5934435 5282575
9171 5282575 4877479 4628418 4478123 4419522 4456582 4576120 4764761 5064077 5598205 6404101
9161 6404101 7614028 9333906 11454712 13683661 15526618 16328554 15760150 14093219 11872968
9152 11872968 9792757 8204746 7209200 6585623 6183517 5939430 5782089 5723007 5648644
9143 5648644 5450126 5148307 4816194 4566464 4458738 4469015 4629734 4898584 5286533 5768604
9133 5768604 6268428 6704598 6927993 6697631 6123398 5467135 5007365 4865191 5021901 5270289
9123 5270289 5384397 5257993 4881360 4343220 3784708 3289714 2906843 2612545 2408782 2244430
9113 2244430 2109403 2056486 2023472 2012579 2067572 2143618 2281653 2508147 2779847 3075652
9103 3075652 3211554 3133889 2917386 2650210 2447297 2328488 2308114 2389222 2588404 2896683
9093 2896683 3324151 3803974 4212637 4393204 4327877 4055030 3588310 3066873 2603928 2280428
9083 2280428 2054017 1903415 1834355 1832317 1850195 1944732 2091078 2280667 2419834 2460241 2395527
9072 2395527 2221620 2047219 1922165 1876047 1898520 2009325 2171615 2299968 2325872 2216607
9062 2216607 1979682 1761884 1574484 1445776 1369383 1312738 1268413 1238966 1207771 1197619 1183213
9051 1183213 1142438 1097237 1061722 1063390 1028825 984699 942675 926493 871876 824622 818655 854082
9039 854082 880619 905480 935073 950675 962358 944342 925596 904599 877447 858702 840423 849133
9027 849133 828596 792485 758876 723748 724721 721210 714332 715181 700756 713100 705510 682548 672960
9014 672960 706370 723763 746402 781853 804213 806334 772485 722310 705484 666385 660037 632618
9002 632618 616494 611043 606208 607617 645540 640494 615008 607461 612729 624800 636419 619906 612669
8989 612669 616057 633809 648835 632573 668572 691093 691842 684698 678111 663572 663045 663556 631535
8976 631535 620380 612644 581124 564567 583739 563397 517918 510119 497362 497264 503849 515132 534234
8963 534234 548683 519246 478144 472648 460304 454932 443890 443057 415383 404877 417427 413774 411854
8950 411854 402492 428593 444881 435817 420733 409730 381672 368345 389598 387581 365815 348245
8938 348245 338351 338792 358066 327425 304128 319768 317802 303412 302448 309922 314141 298087 308953
8925 308953 305558 348024 362870 357345 372948 380370 377357 373743 372306 372201 355446 344092 348752
8912 348752 332454 318795 340206 362317 350559 329162 309305 337382 367238 352703 317970 315792
8900 315792 321645 348033 375352 368162 353662 380747 423960 417999 377162 356389 334664 301778
8888 301778 276951 271968 254199 257247 261606 284317 273298 257054 278616 297110 304234 316253
8876 316253 345244 365831 361231 337448 350341 369654 366567 345613 362879 376165 354720 347097
8864 347097 358503 343620 334531 349557 355673 361675 334379 321899 322322 329226 311238 304338 284025
8851 284025 286945 277199 271847 287457 280992 281979 315632 355007 370999 322660 302205 307758 324324
8838 324324 349212 408948 463245 469674 474210 442296 434159 409509 396428 368873 342197 319484
8826 319484 325804 360553 364119 337770 345502 356164 293709 269156 283753 326179 328449 352442
8814 352442 411347 419662 432734 435504 469326 502221 480541 493940 512193 479882 441753 407840
8802 407840 386940 373296 353540 302752 278283 284640 290748 281159 265919 256650 253523 273079 296358
8789 296358 277910 277813 290555 292557 329651 333168 314026 316198 357403 376688 365498 370872 373770
8776 373770 371584 389629 395508 366867 343067 313528 290625 281692 307297 310048 287147 278130 278859
8763 278859 302570 323727 316354 336741 331471 324907 305115 289683 314532 335777 349842 380361
8751 380361 389489 355026 355890 390277 425353 430271 409230 398234 402739 402230 371856 366084 376094
8738 376094 393271 406468 394646 373444 342511 357560 386436 398532 361729 359482 349248 335520
8726 335520 345071 367275 375578 367485 365529 376091 375750 355139 344598 358894 376103 389030 370218
8713 370218 345876 362446 367772 382626 399422 405009 408769 401633 396815 384454 369714 380437 379848
8700 379848 357973 344727 310613 283989 289118 282124 284044 291834 302875 339410 342485 316412 320821
8687 320821 325425 299102 322964 315955 276014 280995 300821 276874 265723 264093 283701 293800
8675 293800 322685 348670 324240 314820 330151 330026 321033 292952 295905 302498 322881 338202 348212
8662 348212 365287 401460 432610 431741 432012 425789 426223 441414 441833 473094 464294 453541 459348 456422
8648 456422 456665 434198 445955 440491 473752 480368 483010 481770 473207 489823 534522 574623 623059
8635 623059 702847 810397 986756 1338315 1827274 2131834 2022292 1650992 1203779 899095
8625 899095 749607 688467 643810 602217 580201 575854 536324 532558 540353 551242 540814 562606
8613 562606 576694 602380 633997 652049 737764 849561 878760 863337 832756 858077 927794
8602 927794 979818 1000251 956660 918259 942022 984441 1027155 1068561 1164664 1251605 1362970
8591 1362970 1525644 1728510 1992936 2431503 3139840 4214631 5104828 5076202 4506185 3716690
8581 3716690 3103767 2752720 2540865 2349554 2184190 2011441 1833280 1648003 1457638 1311773
8571 1311773 1224126 1139695 1089461 1075591 1036150 986786 928432 866474 824208 804560 789904
8560 789904 816451 875463 950611 938375 896929 801757 684544 624415 624150 598885 565165 586648
8548 586648 584287 584045 633066 696350 786367 905332 1144855 1616743 2067725 2118879 1893582
8537 1893582 1505535 1179878 1067432 1057004 1083653 1184379 1370134 1700033 2056692 2173760
8527 2173760 1958931 1598514 1250961 1000282 879576 818388 762353 711001 690409 660298
8517 660298 649785 642526 655578 702987 759725 792058 786717 747460 670739 630578 623229 603430
8505 603430 596301 591028 570015 552439 532600 525793 549543 551980 537057 557915 574686 552595
8493 552595 530884 550315 644596 759538 858485 951683 1124267 1512366 2177485 3065221 3625931
8482 3625931 3475970 2839377 2065800 1504526 1174356 973861 850467 745821 690705 677140
8472 677140 672143 687581 723368 719673 686404 630410 572753 516053 485456 474333 497464 573581
8460 573581 596765 565135 531445 567807 586702 590908 559715 510960 482972 490813 484043 483656 511145
8447 511145 535034 590115 643210 704980 777112 878579 1051088 1370319 1900282 2535848 2963695
8436 2963695 3027431 2754208 2261206 1771244 1388051 1097296 905593 748768 658856 597977
8426 597977 533906 509775 507817 501012 497786 477996 462032 472592 488618 484734 481279 473876 500291
8413 500291 521598 530056 532311 551658 556096 569441 633110 665324 662036 615917 597120 610145
8401 610145 616079 598267 620752 660499 727093 817882 977716 1251391 1632976 2201921 2752888
8390 2752888 3090619 3101304 2735833 2199729 1642539 1221040 964345 793729 679474 605537
8380 605537 559593 523753 489504 492594 496764 441689 403967 384030 346869 344950 352929 336563
8368 336563 372524 387554 405163 476910 527296 583305 636070 630217 607778 541612 545614 516249
8356 516249 479154 472943 486885 486494 505496 547572 615350 695374 795953 977500 1256116 1519249
8344 1519249 1646586 1575172 1332371 1064648 806715 618734 504716 422763 347928 321131
8334 321131 310466 315114 316858 337106 339907 313675 290469 269162 255322 253655 252950 260176 271509
8321 271509 262040 272734 285971 290282 284237 261816 295698 304226 297252 292374 259437 238408 255543
8308 255543 270537 270226 266120 239993 228502 222916 225188 234548 210239 205769 201769 199607 207770 201568
8294 201568 180243 184153 177599 187589 180726 182877 153076 142963 170605 187050 170175 159640 159657
8281 159657 160413 167808 133761 111686 140358 162473 160282 119500 131751 166836 179366 182353 161694
8268 161694 128053 111792 109622 110080 98878 97857 96192 91525 113344 121699 137029 169857 173326
8255 173326 145720 147744 144611 130915 106530 93471 105931 103529 122316 145500 162764 157770
8243 157770 142403 131073 120915 106693 92947 119736 143472 137128 139013 162288 198591 194593
8231 194593 179214 166375 168482 145680 140412 123073 96150 75386 78486 86895 98686 94506 64022
8218 64022 55109 86027 144164 159051 155526 186020 191604 193937 211649 217995 234749 289550 322143
8205 322143 336273 323712 283969 235200 215550 186574 167190 155681 144336 139888 146960 123709
8193 123709 136941 154144 134513 139330 149648 136964 149666 146100 155158 116522 82833 94092
8181 94092 127428 117060 120176 113527 125868 147912 153918 141368 140645 112283 122023 126915 136257
8168 136257 153005 145544 151136 205079 254469 299220 343595 428047 517880 544996 531601 454014
8156 454014 366188 295333 233328 188992 146785 141082 146232 148337 173634 162625 149766 140688
8144 140688 148506 156488 137784 115043 107178 139827 138818 175908 210489 207056 181362 171622 156367
8131 156367 174400 173903 172445 171673 169357 190634 214006 190479 196592 268079 288780 312478 312232
8118 312232 343615 406642 438049 461333 457350 409931 361483 325198 306654 265222 234677 222460
8106 222460 221258 244979 234504 223139 236176 229622 208716 206181 174505 170507 164924 150447 138134
8093 138134 102553 105254 119055 145964 181057 188131 182318 175143 166438 184311 201544 213438 208300
8080 208300 214446 260285 309911 331045 346479 394181 409938 419465 452766 486039 480423 439471
8068 439471 383164 331315 308103 279846 234988 252644 296847 327331 345745 340004 339042 318440
8056 318440 282558 267851 269902 266684 274349 277120 268481 269122 276065 281653 268278 252093 238827
8043 238827 234821 243808 243598 248424 254834 249118 268724 319776 348466 374196 420772 450203 444477
8030 444477 445562 468851 487100 503200 509302 507002 523263 539918 502540 457353 427380 410094
8018 410094 409731 415271 390590 353152 342412 348609 356974 367979 409880 423332 414588 402468 408128
8005 408128 414482 434293 420450 408327 412303 415476 414132 407152 409738 418779 408185 396012 424469
7992 424469 464860 494114 527993 575002 593992 602516 648833 742371 824717 875070 855502 814930
7980 814930 747673 691621 651321 637991 644842 632908 612132 599949 563849 543636 517692 458448
7968 458448 419842 410851 391847 347961 325426 323988 323330 335502 347225 378005 393173 415403
7956 415403 408477 417783 403917 378880 373946 388263 416018 438874 422159 425677 434227 472319 495926
7943 495926 523303 556978 592174 616239 610080 596284 597536 575625 537507 548762 566039 535535
7931 535535 490312 435843 383333 336751 322190 317997 316942 311725 323227 330468 327106 326547 304833
7918 304833 326216 318551 300312 270010 257444 264675 260538 243181 256760 283297 292492 291451 283947
7905 283947 290230 301383 323997 318939 324974 303395 294688 284850 273316 265220 282956 273756 256314
7892 256314 269446 266877 241111 217426 192980 189582 188109 183820 162191 154136 137723 127867 131723
7879 131723 156320 157166 134536 147752 153816 149526 162255 164106 169642 159070 137736 138459 142678
7866 142678 167520 141108 124300 132545 141185 141086 132721 120667 97985 107576 110153 98744 103823
7853 103823 124971 128221 118972 110365 90327 68377 30326 24693 83066 93776 107509 105238 87666
7840 87666 71206 64344 42208 41757 49173 52588 44121 52537 75763 76699 78662 88105 71427 49910
7826 49910 34841 55771 62237 27262 40625 47831 27083 18440 31671 49438 64114 87657
7814 87657 94727 110861 90810 82881 59688 45842 53407 34855 10176 4737 16244 28116 49564
7801 49564 65965 97718 117417 96580 93215 67482 59315 70777 56453 54118 68585 62963 88220
7788 88220 80118 71092 59524 74291 67820 64325 54933 86232 126049 112441 85595 64927 56995
7775 56995 32152 15659 923 -23983 -24253 -18797 -29475 -9051 7737 15704 36002 29434 22012
7762 22012 52080 64878 54143 40921 54774 91245 88995 94999 92214 77674 42620 26867
7750 26867 24427 15458 33742 22768 3919 21255 41768 49178 30394 30466 55161 47588 60047
7737 60047 75149 42037 10998 3339 10185 16518 17848 26134 38175 14748 15187 6995 -1405 3111
7723 3111 26896 32837 -2291 -38338 -13675 3844 6048 20454 16558 19159 37648 52433 39243
7710 39243 45439 70220 62774 50179 24295 7023 5408 35652 81197 71671 47734 24795 5978
7697 5978 -20517 4655 24399 30556 7501 4409 30223 18491 4582 -788 10588 18712 31512
7684 31512 42656 36739 48488 56079 58809 48860 -2849 1271 8941 18811 42354 59966 49875
7671 49875 34528 33120 38283 29382 6203 -4172 -16522 5480 21654 8253 20212 33338
7659 33338 -5738 -10984 -22441 -15958 27977 16651 4709 9413 8390 6068 -7 -5112 14396
7646 14396 17404 -7612 2716 19296 15447 29421 6214 277 9404 -4594 8743 39219 50407
7633 50407 56728 50995 64931 53525 19758 -1459 21060 36102 64260 78645 52696 45106
7621 45106 48600 34108 50902 50990 37441 32685 39706 66076 57153 54294 33493 29557 23049 27186
7607 27186 38816 13149 1710 17380 40064 50700 25998 8505 -11059 -15407 222 18726
7595 18726 12213 7911 27985 28939 40136 61187 66211 40549 23796 20470 28031 49439 63078
7582 63078 47280 29261 48175 48014 40548 34436 27623 1571 -7149 24655 36192 34655 18394
7569 18394 28154 29854 19583 18772 24868 43321 54160 49029 34859 1828 265 12304 14141
7556 14141 37168 67127 67718 53483 39076 45092 65842 63407 31542 25057 13406 28075 47011
7543 47011 55635 35307 19106 24096 38339 50943 62370 67070 52729 70741 49771 6885
7531 6885 12981 25795 7425 -5264 21230 36454 23509 -5537 -12141 3095 13699 7445 2200
7518 2200 -11820 -5376 11862 8124 -3698 13010 33407 15994 -17287 -14973 13145 22496 2995
7505 2995 6455 34237 26422 13281 14848 143 10186 7790 -16434 -27133 -7246 26962 36600
7492 36600 36747 50959 66115 59680 55371 53767 60972 23482 4922 36978 42231 45589 61570
7479 61570 70690 70295 62455 25774 8510 -17022 -11380 6157 17109 16378 54920 56648 44148
7466 44148 26725 25213 28795 25737 46460 70174 41534 -18188 -35567 -22821 -14126 -27889 -20874
7453 -20874 5393 13513 10359 -7809 -34588 -27864 -7384 12756 27356 18638 39943 36909 18694
7440 18694 28166 25165 13381 8783 12901 -2831 -37593 -40620 -18300 -11887 -2068 -15460 -22342
7427 -22342 -23001 -7594 20225 33841 8036 -19414 -9377 -6555 -16963 -2379 -83 -16353 7873
7414 7873 31026 41185 38652 13838 28852 42510 31302 -17263 -22967 -3541 -5047 42096 54017
7401 54017 72873 57700 23307 2 19184 37644 37820 37464 17324 17125 19292 13807 556
7388 556 -20837 -13034 -2800 8198 31194 28252 31122 9132 18682 5986 -448 -19165 -24571
7375 -24571 20106 59320 32754 22248 17832 39030 40990 609 -7156 6039 915 8115 6072
7362 6072 -8124 -838 30826 38288 29776 37409 40972 42971 31993 17595 12826 -6807 -10206 9360
7348 9360 10814 18237 18558 7036 10559 16133 1373 -11690 -16563 -39182 -29661 5094 5626 7762
7334 7762 41330 18814 -24062 -51371 -30139 -18530 -40426 -44486 -32880 -25312 -9219 12157
7322 12157 460 -29622 -22725 -22666 -8779 18980 25467 28579 44420 43826 27404 -9567 -23071
7309 -23071 -21101 -14190 -27528 -43581 -40947 -25196 -15 -18662 -12328 -13611 1232 12635 5225
7296 5225 7512 25974 38048 23642 10108 -3981 -23824 -10133 -31114 -30111 -10549 -2643 2883
7283 2883 32086 46533 19936 -19150 -17245 -8914 -668 2813 -6982 -11273 11437 2889 11013 33760
7269 33760 36820 35728 23478 -4143 -5342 23102 21855 10495 -1521 -7801 14042 35652 41163
7256 41163 23328 4024 20526 11731 6011 -20665 -26272 3248 -17112 -30338 -28289 -10029 -3123
7243 -3123 -3600 -6788 -13752 -14900 7894 25280 39329 28512 19824 42338 28875 41658 38766
7230 38766 22886 18875 16519 26626 26124 18734 18877 25275 34081 15843 116 27177 9806 7712
7216 7712 -5933 -33903 -1220 23000 4057 -1084 20314 32763 30124 21620 40910 45097 45308
7203 45308 32700 14538 -2674 7604 11546 19839 41498 36338 40770 4832 -12282 -27316 -24038
7190 -24038 -17817 -1766 -5843 -14367 -24681 -26433 -11222 -6424 -13635 1355 25931 43120 37245
7177 37245 32378 20746 29147 43180 43055 27490 36162 26189 17902 -7777 -4317 18383 48568
7164 48568 58271 57443 30000 7182 25461 18007 -2719 35571 17694 5526 -5014 -16227 -31091
7151 -31091 -22870 -14806 4921 9150 30681 32922 25267 28216 29846 41864 29669 29821 29556 21020
7137 21020 35974 44939 22998 18777 29407 36586 48108 73729 72932 63587 25104 20846 12345
7124 12345 6745 -10835 5479 17923 29609 24565 16819 3171 3673 3839 15996 29906 29134 15241
7110 15241 9828 -2827 5434 28466 31922 15603 40859 43787 39497 41841 6774 -29747 -60537
7097 -60537 -44473 -6149 23226 30767 29706 33904 -2149 -5903 522 -6468 -11315 -30943 -8336
7084 -8336 9624 11066 24398 8483 -12158 -2399 -6773 -10418 11957 57460 41668 35646 30367
7071 30367 2604 -17499 -31176 -22123 -16179 3329 622 -14827 -22044 -14747 -19433 -19062 -15916 -10175
7057 -10175 18196 2763 4793 12275 21838 12500 26178 33726 10999 12721 34500 50116 55731
7044 55731 64421 46804 17235 16042 21115 46451 51138 46354 37152 26070 18311 -1473 1368
7031 1368 21294 19011 -18799 -30121 -15374 -14244 5547 16231 19066 -106 -9958 1970 14306
7018 14306 16751 32384 18118 -22034 -28193 -29854 4389 11888 27466 37788 42036 36454 19331
7005 19331 13941 -19227 -29068 -28658 -19536 -19467 -26264 -29974 -19828 -12406 -24817 -39281 -55057 -69574
6991 -69574 -49604 -1349 13546 -6559 -3143 -4963 16327 46650 56896 72833 30019 12823
6979 12823 32043 78394 95666 82087 48172 37251 8079 9360 19751 36776 17934 14535
6967 14535 20217 23069 57701 42016 30960 28856 18400 9309 -12879 -14585 -764 -24694 -21962
6954 -21962 -26440 -17124 -32511 -48168 -37592 -36890 -19152 -9583 1880 7007 31586 45027 49774
6941 49774 44481 43301 47865 36408 16285 4961 1878 5498 5075 -404 582 -2714 4624 983
6927 983 -9261 -33636 -7071 26209 23038 25892 -900 626 14203 5420 3837 -3543 -10084 -13153
6913 -13153 -6482 13353 7017 -22602 -21772 -14395 -1896 11619 30669 35507 25796 2067 23424
6900 23424 10750 319 4236 15563 -3893 -20542 -1335 4531 5923 -13920 -20172 4469 18576
6887 18576 18870 20874 4046 -13972 -16206 -31862 -54503 -36598 -9806 11707 14668 2978 2509
6874 2509 -5759 -14774 -10710 -13433 -21239 -14894 15180 17241 15126 7615 236 -7806 6239 26403
6860 26403 8548 -16653 -22366 -22974 -165 3613 -22920 -28221 2989 -8339 -43051 -42425 -29836
6847 -29836 -9133 42870 66287 59931 65688 56469 30218 20795 12705 24200 36690 22869 8301
6834 8301 4898 2756 -7346 -16848 -6824 13854 23973 9050 18314 41835 38742 34629 28683
6821 28683 12252 13415 18632 4944 -23022 -20156 -27834 -16473 4366 41380 41639 6680 18109
6808 18109 23631 24260 16692 36104 36047 19431 -1577 -2170 -18917 -15975 -1960 -8384 4288 -5994
6794 -5994 20293 33756 14466 -7740 30317 60069 59062 37183 21830 10576 -20402 -22537
6782 -22537 22190 56811 56412 38461 28073 19451 20577 12886 7765 36295 73442 59514 43994
6769 43994 51782 37300 13866 -7450 -4160 26297 56132 33088 23783 11954 2727 -12948 -10307
6756 -10307 18081 30250 33396 12713 25080 20247 19825 7476 18126 63725 55720 32795 1111
6743 1111 14117 47175 52319 22883 12769 46696 59171 59250 21521 -3041 -6247 15475 -12644
6730 -12644 -24054 -19777 -13154 2518 19826 10909 -23278 -7780 11224 12568 14366 25221 19459
6717 19459 -11920 23513 32370 47853 44301 44752 46643 31718 41936 29915 27594 33216 73158
6704 73158 83550 75930 52199 22845 20232 21068 4987 -8298 -29257 -7259 1960 12613 1689
6691 1689 -7465 -8537 -24554 -31835 -10830 -153 -9522 9710 -8391 -10880 124 -11563 -7275
6678 -7275 2859 -9389 -19878 -4209 7889 22364 -5406 -5963 -3522 -1788 2637 -18801 -43658
6665 -43658 -10282 23231 18366 7906 -2599 -6606 -1018 516 -20597 -7357 -27843 -33228 -12605
6652 -12605 -10066 -42459 -20533 7279 15754 5969 494 416 -31338 -32287 -21807 -18563 -9918 -7891
6638 -7891 21153 39485 21596 10282 2618 11828 47605 45397 29298 25069 27878 21846 25096
6625 25096 41098 59339 79302 62925 30236 33153 33611 -4876 -8867 1350 -7478 -21518 -26649
6612 -26649 -10022 2871 -15049 -27037 -37555 -58315 -28604 -17547 -13345 -16460 -22310 -11035
6600 -11035 4605 7526 -18170 -25276 2651 10006 -11834 -12775 -2354 2242 10727 6965 24471
6587 24471 14835 -6909 -15466 -6611 4259 -10294 -31805 -11953 19617 22366 13531 1763 4550
6574 4550 -10404 -42307 -23348 -39143 -16278 -11662 -30364 -26317 -39404 -44125 -35666 -36634 -7853
6561 -7853 16159 8254 -502 -1733 9513 2325 -6613 -2615 17404 31086 30120 18232 25728 24008
6547 24008 17908 15219 14098 21076 33678 22347 17413 12940 24696 38733 22130 -30 -5479
6534 -5479 17028 29896 8477 -6531 -5622 -12245 -6804 7404 30125 28105 22958 24979 21780 7044
6520 7044 952 -13255 -18996 -15770 -3591 4718 2913 13193 17355 427 -3133 -20778 -31009
6507 -31009 -42386 -21944 -18579 -20207 -24306 -21732 7565 30418 16817 -7100 5571 29711 10818
6494 10818 12196 -15689 -35404 -19697 -14970 -15039 -3534 22064 20688 -7707 -34354 -42641 -34256
6481 -34256 -22032 10 24730 37928 35241 24904 12841 8269 19931 46014 63931 61191
6469 61191 23724 -2938 3166 -9309 -27683 -12929 -33290 -52986 -69765 -60508 -53231 -27066
6457 -27066 405 23304 3217 23615 15997 17410 55637 78668 46260 10148 6499 -15530
6445 -15530 -4396 32522 31158 14672 -16945 -20647 -4760 7628 4963 22708 7495 573 13746
6432 13746 8114 -12470 -39120 -14904 25922 35412 27096 20798 13375 25051 4946 5783 8185
6419 8185 5031 -9737 -10828 -22587 -15901 15184 45451 45523 11758 28537 34852 887 -13681
6406 -13681 -23148 -42791 -28327 28076 38764 39109 32644 27451 8128 -23677 -35204 -23912 -15410
6393 -15410 3783 14657 38795 38421 29804 25490 6555 -3448 -1483 13825 9761 867 22428
6380 22428 41281 43055 33156 34675 3199 -10896 1238 -2299 10221 25424 6495 -3524 -15964
6367 -15964 -7886 677 -833 1537 -19904 -41770 -35133 -22377 -45976 -49914 -36400 -49002 -67746
6354 -67746 -59821 -38468 -37077 -54163 -31742 -8646 5846 20863 3056 -7688 -20024 11298
6342 11298 41657 37451 19009 -3393 -16305 -16383 5532 13456 3018 -27891 -17764 -4707 -28040
6329 -28040 -26384 4916 34985 8329 -4345 14745 55701 51895 33406 19725 5441 -7942
6317 -7942 4176 19848 19150 -4935 -42708 -32063 -24630 -31487 1481 -1466 -17612 -46475 -15373
6304 -15373 3121 -9213 823 8143 7779 2584 16085 8216 -19820 -8905 -8889 7182 8331 -1255
6290 -1255 -22095 8452 40944 23384 2620 -21554 -2080 -11201 -16817 11178 4 -6089 2278
6277 2278 17954 33067 16889 21903 28459 50579 47336 31142 31196 -7377 -4039 -7925 -9459 7558
6263 7558 22682 21127 27871 28061 6087 -7666 11060 7563 -9354 -44580 -29677 9768 -6922
6250 -6922 -4767 -20804 -41462 -35066 -40283 -37552 -53027 -25623 2023 -8833 -19298 -22853 -31067
6237 -31067 -31277 -11615 5037 8008 10453 -778 -1636 39800 30534 8204 -1224 4350 19663 18229
6223 18229 15164 32264 35158 36638 13280 17704 4894 16450 33382 38140 54686 50135 5200
6210 5200 -30289 -49377 -61956 -54168 -27438 1403 3603 -5235 19654 12817 3599 33453 57516
6197 57516 32743 10719 4708 -4878 -2558 11423 -5920 -41178 -35902 -31384 -54059 -27393 9622
6184 9622 41248 17541 446 -3030 -20630 -52540 -53061 -35532 -13912 -4959 -16618 -18195 7133
6171 7133 6435 -646 -4444 -1538 -4649 -12054 -2722 9344 29440 43001 8437 -5309 5031 90
6157 90 -27449 -33103 -9184 6808 17577 -9538 679 12418 16645 41476 49894 33355 547
6144 547 9069 11874 -7000 853 -7542 -40770 -21823 11201 41569 30862 16698 -2081 9013
6131 9013 37282 56466 38230 14425 -9499 -7170 -27723 -53271 -8542 22159 -3490 -30105
6119 -30105 -20720 -29503 -5509 16292 30915 26909 32536 32124 3169 12796 18156 14607 7340 -82
6105 -82 -1511 28029 29221 4650 10855 2730 -21615 3781 -2461 -37606 -54894 -24620 -30888 -21748
6091 -21748 -8639 865 17797 15734 -3016 -20729 -21484 -8673 -4938 -3662 3897 24803 26504
6078 26504 12256 12783 -2378 10170 -3182 -40081 -40256 -36110 -32789 -42301 4295 1944 -26248
6065 -26248 -26065 -24793 -22727 -24079 -21820 -33651 -31101 -23993 -12236 -11119 3323 8082 10930 31638
6051 31638 19871 1593 -15177 -30998 -62720 -59285 -45537 -26980 -15803 -14288 -13898 9913 28218
6038 28218 45679 57862 72932 71665 55896 10886 -17377 -39877 -33679 -17425 3750 -4869
6026 -4869 4647 7159 12129 18613 47735 33183 39131 33515 20710 5418 -8186 1031 11281
6013 11281 -951 -16894 -8413 -12850 -22347 -13268 -9433 96 18182 48128 47659 45720 61383 37619
5999 37619 21147 21312 11178 -9668 -22670 1351 -4633 8658 15805 2206 -25647 -27803 -61162
5986 -61162 -57244 -35454 -27426 -19559 13871 34937 16300 -20905 -61522 -53583 -45517 -31265 -26327
5973 -26327 -32801 -27492 -11602 -8148 1690 -12545 -34915 -23305 -31206 -33659 -4947 25666 5518
5960 5518 -23436 -41814 -43162 -38697 -9906 -6713 4414 -13810 -9413 -145 -42708 -31033 2811
5947 2811 -11695 -10763 -26225 -19226 -1647 -26368 -46371 -32089 -13243 -12197 -16334 -324 6646
5934 6646 19872 -17203 -16064 -9212 -7604 -17206 3212 27298 -14136 -21502 15 19109 18144
5921 18144 26396 51835 32500 -11989 -45695 -38095 -22302 -14821 -5069 22279 13810 18302 1212
5908 1212 -7566 27887 27486 37578 49983 19122 15833 13989 12428 31822 26512 16577 16145 21746
5894 21746 4969 25899 26233 32239 31695 31606 16332 699 -19269 -39897 -42019 -30013 -17125 -11028
5880 -11028 -7117 -4410 12983 21320 20918 -5809 7315 45267 39946 8398 -4791 -30517 -36963
5867 -36963 -14678 4765 -19613 -23624 -18173 -20301 -16812 -51538 -55033 -39187 -10542 -14194 -12748
5854 -12748 -534 -10006 -2601 6789 20254 11143 -24429 -40297 -26403 -38912 -5233 12053 -6033
5841 -6033 -13546 -23594 -19375 -29112 -46773 -52837 -51421 -33415 -13364 -10752 25212 31506 12652
5828 12652 13915 -21654 -35243 -39013 -38781 -29457 -5776 8253 6744 14258 5782 22856 45001
5815 45001 -8060 -38983 -27160 -9998 2788 22586 29397 -3449 -7603 15086 3526 -5704
5803 -5704 17480 25865 19018 1290 -40991 -35825 -29705 -26670 -37360 -31831 -1807 35395 42944
5790 42944 33661 8718 911 -9679 -18598 -2019 25564 19657 6152 -18772 -24467 -8043 11073
5777 11073 7575 22103 28771 26241 4565 7162 27825 54274 44329 55945 42866 14368 5927
5764 5927 21610 37453 41804 32326 32387 43323 63434 37946 43138 38997 38145 23530 8098 3769
5750 3769 21723 25550 -20163 -50560 -54668 -41114 -42125 -31493 -1213 13509 8304 401 8503
5737 8503 -75 12869 -1408 -23080 -24244 -21587 -24003 -21716 -14085 5697 21815 35668 3733
5724 3733 -16489 -33077 -15870 -1493 18799 34512 19256 9815 8414 25298 20576 -2100 9203
5711 9203 11098 -12021 -29474 -40857 -17629 9907 18180 -11429 -28298 -3872 17441 -13608
5699 -13608 944 6754 1383 17786 -7961 -25164 -34330 -14003 11906 2796 -28457 -34822 -4052
5686 -4052 -127 19210 32199 42571 22074 4880 -26236 -20697 -366 -6518 5717 -664 -28334
5673 -28334 -2862 -14797 -41756 -24713 -9805 4373 17337 20351 19380 -1711 4382 2413 -903
5660 -903 -3604 -22884 -64487 -41247 -13403 -9067 -11084 1071 -1731 25339 37997 30042 35615
5647 35615 21180 13841 3659 -1020 -5111 -4036 5926 9236 4026 30270 53776 51076 47711 67602
5633 67602 59810 37752 20908 5695 8718 7874 8534 -3070 -27167 -27571 -48958 -43227 -20657 109
5619 109 15540 11958 27417 23725 22349 9756 6103 26972 46335 53002 56261 27126 -6634
5606 -6634 -5189 -15624 -19739 -12519 -5088 16326 22133 17022 34368 4128 970 10455 10616 10396
5592 10396 42092 41660 25326 23398 4606 -3339 -17749 -35481 -42302 -38417 -29285 -20242 830
5579 830 -16622 -33123 -36487 -29259 -24647 -35441 -25517 -857 10513 -9375 -14448 -19684 -11607 40873
5565 40873 9649 14950 51977 49620 17385 27600 19956 2394 10398 12902 4526 16528 30773
5552 30773 46432 20220 17146 581 -26882 -12672 23609 7242 19645 5348 -15798 20936
5540 20936 58357 46194 34660 28455 -17698 -13613 6268 -19700 -7005 -6139 11961 12015 -1076
5527 -1076 5858 15001 -2034 -40862 -50291 -38050 -27956 -25028 -29713 -21007 10598 26060 17543
5514 17543 10811 2373 -3404 -15773 -21971 -49831 -44163 -47162 -62946 -78894 -58137 -46243 -30073
5501 -30073 -5944 11534 27670 7746 -8398 -16340 -25120 -1865 11777 15952 -20381 -25857 -10770
5488 -10770 -6456 -4218 -17249 -47773 -38554 -38729 -14635 11408 6089 29331 46665 29181 11795
5475 11795 1072 14979 35537 57524 58940 49930 39026 14556 -33035 -49401 -51707 -40615
5463 -40615 -12714 28104 17854 6368 1964 7335 -1666 -13997 -1640 13220 11849 18487 12828
5450 12828 5029 231 -11115 -26659 -15069 -2386 10785 -37411 -48607 501 518 -14144 -6766
5437 -6766 22096 13763 6204 -2905 -32113 -64466 -72538 -51130 -14587 -1017 9916 9335 14038
5424 14038 -682 12110 18930 -12562 -31914 -33055 -24894 -17637 26776 47190 52935 39554 21039
5411 21039 1406 -30071 -43983 -62792 -65144 -59448 -53346 -40760 -27010 5061 31916 6720
5399 6720 -16038 -25030 -29851 -28481 -20311 -6667 20267 31458 16330 27 9624 40948 33510
5386 33510 3761 5934 8391 20103 23123 -2984 -14986 4607 3440 -15435 -59091 -49544 -48446
5373 -48446 -24196 8426 31169 41127 -5108 -13551 -24405 -20284 -16598 -11706 1507 11445 15113
5360 15113 11203 13440 4073 -15496 -30142 -19558 -7587 -471 -989 -22620 -27575 -37848 -43937
5347 -43937 -32344 -27236 -34419 -50954 -53832 -12580 15978 32885 8314 -42017 -39139 -24880 -21780
5334 -21780 17366 19970 3397 -916 4369 -9531 10911 21280 3635 -28509 -32993 -14838 -4726
5321 -4726 -15316 5506 14801 5906 9088 9165 1896 2096 -1561 6851 -6298 -18476 -26112 676
5307 676 38384 4403 -13276 -11967 -38200 -16210 9188 4019 39692 43671 15736 9935 17176
5294 17176 11408 20403 10775 977 291 25488 30485 10972 -2899 10164 6893 9912 -22024 -50356
5280 -50356 -67500 -52859 -31224 -14161 -5779 -9397 1999 -9437 -12148 -26027 -39551 -43205 -15862
5267 -15862 -10379 -3982 8753 22312 36021 39898 40099 6718 7243 8112 15825 36009 19472 3556
5253 3556 -4070 -14493 2668 4924 4758 -17691 -34271 -15387 -17808 -37675 -50975 -55058 -30437
5240 -30437 -1174 10227 19451 19161 4819 -7830 -27017 -20578 -4847 8450 8702 52007 36663
5227 36663 -6187 -13617 -34261 -11461 16534 29986 9215 -26366 -28218 14 14649 9701
5215 9701 -20326 -35290 -11211 -10230 -5109 -237 6853 23567 24427 11756 5125 -18685 -5276 23495
5201 23495 8718 -31777 -43685 -20956 3584 18508 -4177 -31241 -21941 -19490 -16104 -13557 -5958
5188 -5958 7417 37925 16789 -4088 -201 16732 22125 -9421 -28429 -29572 -31336 -18091 -1378
5175 -1378 9263 24226 23391 7890 20555 15328 6633 17496 12343 13423 14274 8884 -15917 4452
5161 4452 968 -20853 6384 21282 16823 13400 4311 20143 18375 8734 -7274 3316 8275
5148 8275 6510 -7977 3716 6229 20496 24563 -257 -9205 -9145 -15682 -10584 -3735 -14552 -20708
5134 -20708 -34890 -35711 -16983 -598 36503 23733 14103 28237 35072 9795 -26697 -32774 10247
5121 10247 10704 9905 12435 6614 2158 41119 51679 50793 35291 -18989 -41362 -11125 -1387 13647
5107 13647 19983 7398 -13570 -20889 -15093 -4374 13698 27928 26197 29474 28315 5698 -4005
5094 -4005 -2228 19113 8073 8563 945 -25247 -27111 -10753 801 7100 14104 5188 -2894 -3790
5080 -3790 19636 20094 -10645 -2936 -22841 -73425 -52686 -28763 -9440 7843 17570 10693 -7793
5067 -7793 -6127 12005 37397 45775 45166 19856 -21079 -34759 -23977 -17331 -7569 7184 92
5054 92 -2599 3194 16734 30817 31590 54977 48050 60831 33723 22516 30922 45330 37591 43697
5040 43697 47183 24827 -3437 -6346 -22706 -28286 2147 15496 16356 1738 15039 22071 -3002
5027 -3002 -16064 -6365 -14879 16832 21872 24861 12288 -101 -9100 -9210 9220 1767 -13822 -12140
5013 -12140 -4902 -12122 -19082 -37346 -42383 -55246 -42670 1220 -2562 -6334 5873 26245 30738
5000 30738 50731 32069 30669 46029 48034 37313 28152 28552 22719 17692 9463 -2615 2941 -14536
4986 -14536 6439 14888 21287 3471 -36048 -31039 -11587 2502 -6294 -6738 -12022 553 50790
4973 50790 69795 66702 38897 -4436 788 46504 56224 37316 22130 10216 -11591 -16111 -13863
4960 -13863 -22430 -8982 -9830 6174 19927 24258 33431 23824 17127 29076 36535 40190 29499 31906
4946 31906 -9298 -19476 -14338 -8126 12764 8991 -38694 -19615 -1340 17671 23086 16715 18096
4933 18096 -15658 -3828 13446 13303 5800 -7267 -7592 -16360 234 180 22929 34694 24577 4095
4919 4095 -23316 -33796 -24941 -35837 3606 7285 -30909 -41299 -41147 -14900 -23770 -11585 -13398
4906 -13398 -17548 -19516 -18905 -11863 -41923 -66209 -53131 -21915 -20129 -22556 -6461 -6423 -8547 -614
4892 -614 -16435 -37409 -31890 -24772 -33438 -12448 -13027 -38406 -38406 -13533 -31162 -52415 -22243 -2486
4878 -2486 -12 25890 6793 -32098 -9885 21847 28313 11828 -10025 -3886 10473 -25050 -20974
4865 -20974 -23427 -42214 -45458 -53175 -37226 3312 218 -10199 -10236 -948 -14494 326 5576 8191
4851 8191 5877 15310 -4018 3354 -46 4138 3819 -6678 -10978 14944 -3476 -10776 -15866 -3759
4837 -3759 -1062 -45820 -39403 -4896 8483 8268 13126 -4110 -3999 -8844 -26804 -46958 -46185 -22794
4823 -22794 3184 32065 30481 27333 31716 32912 20178 -8043 -35672 -39525 -44748 -18460 6494
4810 6494 -8204 3785 489 24589 24491 11457 15068 17342 6578 -9050 -4646 30213 7354
4797 7354 -24612 -49482 -40124 -40920 -16075 -9136 -14905 -19828 11219 22752 -16414 -11702 9654
4784 9654 2838 2136 -5641 -5262 29070 31391 13571 28045 27039 15386 -4692 -23906 -29460 15217
4770 15217 -3898 -39408 -53722 -38540 -11461 -6350 -17813 -1684 -1531 -33215 -41356 -29233 -24152
4757 -24152 -23418 -22046 -36000 -24668 -4892 -38906 -72026 -44141 -10224 27740 512 -25893
4745 -25893 -2966 -8457 -19850 -24106 10279 37979 35794 25256 11580 -10331 -26234 -14829
4733 -14829 4839 -10347 -14655 -3004 25978 160 -2178 -9146 -10467 -11585 -3210 20881 32740
4720 32740 -3644 -19739 -28986 -17747 -35546 -17482 870 49926 50046 25722 14607 8646 11404
4707 11404 18336 6668 -5569 -27719 -60929 -82545 -59484 -48796 -37186 -26879 -46138 -59779
4695 -59779 -36386 -17267 -5433 -6312 2448 9096 -499 -1942 -3193 -6885 -8191 -12989 -10918 -6505
4681 -6505 7933 14574 4822 -19363 -50171 -61248 -45210 -26074 -11995 -12417 -21231 -53841 -43704
4668 -43704 -40063 -34858 6595 18810 -6180 -26233 -38360 -36746 5504 26417 4902 -9438
4656 -9438 17665 12760 -21925 -36355 -23701 -24746 -42289 -24982 -10614 17065 4912 -8106
4644 -8106 -17009 -32788 -15246 -39277 -29214 -19414 -10733 7166 39626 25316 -15953 -21302 -29624
4631 -29624 -5311 23675 7161 14074 41888 32147 -3618 -6412 -26768 -40195 -57607 -28164
4619 -28164 10698 44945 41970 28754 14277 -10383 -32985 -46200 -32910 -30111 -5147 -2096
4607 -2096 6214 18531 19499 -8248 -31761 -24424 -5233 256 -4664 -7541 -1090 -20074 -35307 -10662
4593 -10662 5591 -1589 2581 15691 30859 794 -7711 -1236 10206 -14303 -27790 -24870 -4783
4580 -4783 32998 39481 20940 13369 -21968 -12627 11958 12804 47311 39103 27901 23404 4181
4567 4181 -29108 -37574 -23266 -37679 -40852 -36869 -30257 -17076 857 18070 43165 36407 47022
4554 47022 54063 40578 33123 39505 16325 10168 -7758 -17488 5987 13617 4187 -19530 -11948
4541 -11948 8923 32658 26188 25157 9864 -24357 -41044 -16747 -16889 -10935 -4567 -9785 5973
4528 5973 6258 -6155 -34221 -38100 -29677 -46041 -57834 -34200 -4812 -741 37228 19218 -12816
4515 -12816 -4300 4806 -29913 -30024 2416 -6712 -13680 30683 57052 38361 18980 2376 -29160
4502 -29160 -16730 8852 27505 18215 -15364 -25341 -6273 4042 13302 -138 -3468 -19787 -443
4489 -443 -1677 -5444 -21249 -42664 -49253 -51725 -54479 -27817 -15660 -6113 -2235 -24135 -39285 -43266
4475 -43266 -37607 -22419 -2996 -7066 11799 11021 -17446 -20401 -10386 12642 -4889 -10794 -6162
4462 -6162 14622 15439 9623 24789 18348 25241 26626 18785 8681 -883 -1678 17427 43492 30890
4448 30890 -16995 -29274 17547 41158 24735 30010 6883 -6948 -17416 -38298 -56257 -50811
4436 -50811 -25944 -23636 -9932 16075 23719 12197 17069 30391 10255 -9295 -10237 -36340 -25555
4423 -25555 -11209 -5816 34582 40935 25574 11156 -8176 -3148 15782 15006 -9086 -18436 490
4410 490 36242 20748 7934 -13996 -28009 -23527 -3350 -6401 -32887 -24208 2696 7325 3486
4397 3486 37727 38999 2594 -6348 16715 8117 10686 -12866 -9240 36717 52384 26002 8467
4384 8467 9979 9390 6665 -5967 -1657 3726 -10351 8020 -5643 -11549 3698 -5034 -9840 -24868
4370 -24868 -37299 -16095 -18475 -2326 12984 23058 10722 28233 13650 -12376 -9393 11391
4358 11391 18844 3857 2373 2953 -16855 -13208 -2617 4722 8888 1108 -31277 -36509 -26198 -8855
4344 -8855 -5904 3837 8044 24290 20387 -6290 -8095 25272 51351 61200 24059 -12910 -34238
4331 -34238 -33863 -31836 -15755 -1562 -5942 -5826 -22951 -47426 -36333 -927 -7373 -6788 12973 13410
4317 13410 2835 -8016 -27119 -25063 -17995 2115 -4070 6710 36845 16593 -10289 -24719
4305 -24719 -40755 -55976 -60115 -61639 -73018 -56517 -38635 -35390 -43348 -43158 -17499 -5457 -20663
4292 -20663 -8740 -14654 -35662 -49253 -38713 -13250 13970 -1117 -15860 -28937 -44218 -48168
4280 -48168 -38233 -34917 -17795 -6994 -8033 -43956 -31420 -17323 -18991 -9325 -18526 -3414 2512
4267 2512 661 12318 21945 20410 1733 -1644 4725 29604 33723 40452 34478 5284 -23148 -19577
4253 -19577 -4586 -16618 -37816 -16808 5903 -5077 -19609 7561 19070 -1682 17554 18557
4241 18557 -15759 -21126 -1478 -11340 -15401 -14670 -8259 -1825 -15251 13577 34266 14856 17291
4228 17291 25894 10123 5628 2669 5779 4283 -9890 -3099 -1557 -5948 -10625 -1297 12863 19513
4214 19513 14608 16965 20786 34838 33614 25210 6056 33102 52608 36416 13949 16840 20005
4201 20005 35817 42683 31494 24113 41050 35445 34280 21390 7837 -7036 -1294 6830 -32178
4188 -32178 -25045 -25509 -15790 -5365 -13181 15977 9451 -7139 -14723 18022 15939 -2627 -18966
4175 -18966 -39251 -50146 -59841 -50512 -26105 -25675 -5121 6243 -29118 -14058 3220 545 12447
4162 12447 4153 -20332 -25126 -5503 7600 30683 41283 42371 36970 7903 -78 -8155 -28275
4149 -28275 -21229 -7133 5126 20001 9503 6393 650 -9290 -10197 12535 10197 -6244 -27852
4136 -27852 -37805 -20440 -1697 -15169 -23548 -25611 -46628 -31189 -32382 -26975 -50662 -39048 -22822
4123 -22822 -20491 -6276 -5687 -17564 -20524 -20420 -24960 -15475 -19107 -16462 -32753 -7593 -819 -431
4109 -431 30803 18072 5645 4365 -2742 -9826 -19889 -13012 1539 -9004 -22889 -8903 6278
4096 6278 -5 -3711 6147 21093 15302 -9648 230 326 12214 25922 51935 31516 35613 23813
4082 23813 7310 31220 36600 25591 18739 17671 -17493 -29745 -22251 -6334 23703 17989 -9798
4069 -9798 -26207 -8632 -1956 5417 -26664 -20353 -15500 -29956 -11376 3917 26075 27622 7762
4056 7762 -2633 -4084 -17786 -52792 -30325 3390 1043 -25366 -47902 -15352 -23575 -19542 6972
4043 6972 -381 -1675 -32574 -44926 -16587 29118 29494 12950 12149 9579 4338 18495 3875 5566
4029 5566 19882 34571 52838 21824 1252 4122 46 -23167 -5459 41002 28568 1199
4017 1199 -2340 22151 40361 11009 -25578 -21667 -33576 -32867 -33570 -30112 8149 27352 13046
4004 13046 -8424 -17171 13560 40468 48204 14046 -17800 -32779 -26467 -14959 15535 42710
3992 42710 34840 16387 -12264 -19212 -651 5638 -6052 -25354 -29998 -30403 -29713 -17967 4301
3979 4301 10376 -22166 -39393 -32820 -23263 -46755 -57297 -67914 -81709 -63091 -31538 -19851 -24959
3966 -24959 -13903 -3847 -7389 -20573 -19454 6500 30115 53529 59733 31232 8760 -33843
3954 -33843 -57477 -31929 3475 12967 16416 -3323 -19057 -10469 19700 26782 15796 3375 -5428
3941 -5428 -20388 -33860 -20076 -15769 -4877 26509 33942 3174 -2298 6860 -4639 13894 20518
3928 20518 826 -1537 -5995 -19280 -40454 -39215 -16797 -7546 17958 5203 14106 21537 21236
3915 21236 26076 14936 15201 7058 -11792 -23236 -41941 -49545 -60776 -53440 -51680 -55530 -39922
3902 -39922 -23733 -1596 9115 17586 4874 6708 -31010 -52784 -38879 -59489 -41907 10193
3890 10193 8814 -3200 -4442 -22662 -33575 -25719 12220 13956 3478 -28411 -39063 -50466 -40369
3877 -40369 -46851 -45250 -31800 -6305 5927 5060 -8595 -27312 -23379 -14759 2248 40012 8858
3864 8858 -11733 -19823 -8093 19155 49829 33467 20990 11191 -10060 -27582 -30236 -41257 -24610
3851 -24610 8387 27160 6084 -25263 -12708 -31671 -67281 -90872 -71696 -60044 -76086 -94777
3839 -94777 -80526 -35308 -20867 -12158 -5890 -16888 2607 446 17971 39089 28602 -6173
3827 -6173 -24780 10047 21985 2673 -20203 -23276 -11062 -26271 -25964 -26202 -9913 16573 -4418
3814 -4418 -36530 -23811 13969 32317 -14230 -34047 -32032 -4943 -8415 -30454 -38848 -41836 -34767
3801 -34767 1524 16058 8046 -13807 -31510 -42185 -13742 -13013 -7433 -7912 -45907 -55465 -17293
3788 -17293 3413 13314 16764 37020 63534 39349 14379 -13691 -46754 -13902 2904 -13392
3776 -13392 -24627 -38711 -53385 -36442 -13106 4051 -3217 23541 38692 17760 8473 21080
3764 21080 18001 38145 37810 17428 -2381 -29162 -30001 -4897 -5957 -9670 8951 -4266 -11374
3751 -11374 3021 10471 -8974 -60996 -60001 -47927 -44398 -44985 -18242 -38866 -70794 -33496 19440
3738 19440 23765 7193 26783 38202 25068 -10077 -12485 -13048 -14463 1518 2315 -34245 -31117
3725 -31117 -34909 -10377 -2321 -22094 -21351 -31683 -20401 -7652 -11207 -11824 -21435 -53955 -61085 -40345
3711 -40345 -12499 -19160 -21968 -578 39403 13734 -11991 -4980 -10078 -17623 -26651 -19021 -24432
3698 -24432 -33202 -21477 -9397 18952 24201 25571 -8583 -18985 729 17266 2333 -19345
3686 -19345 -38295 -58075 -28681 14032 19011 988 -44698 -34294 -8709 -5272 -11455 7628
3674 7628 14489 32865 15055 27764 29287 15730 17794 23639 16930 11795 -6334 -28258 -24422
3661 -24422 -27412 -4340 35200 39983 24580 16112 12119 648 569 23824 28564 33652 17011 -1689
3647 -1689 -4355 7099 17810 20872 1146 2439 3901 15952 23435 24761 5802 -6417 -4446
3634 -4446 -1990 -24095 -8227 21540 21580 -1667 -1122 13957 26116 15526 -7146 8359 -9164
3621 -9164 4293 11731 12729 15447 10069 -5695 -5099 -12143 -35374 -19105 7932 28177 23778 25931
3607 25931 6331 -7036 -14642 -19600 -34255 -16251 2042 -1383 -2771 25817 40601 36459 24531
3594 24531 6782 -2011 2253 1867 -12041 6153 25492 28825 35718 47585 22748 -9142 -4683
3581 -4683 9044 30375 55224 54431 24374 5729 -7519 -14217 -35633 -25311 -1530 -14093 -23185
3568 -23185 21313 39547 19548 2435 16142 7721 10135 5341 -8164 13500 2029 -12368
3556 -12368 8687 23278 22475 18819 3386 -1301 10312 17527 17620 19090 25865 34868 12453 -4692
3542 -4692 5209 34232 19160 -28966 -29660 -20615 -5371 -7914 -16744 -7983 16952 26701 11232 -20118
3528 -20118 -18297 -23374 -35815 -31135 -21533 -31256 -30324 -36948 -49878 -63577 -72427 -40530 -9070 -3475
3514 -3475 -2043 3783 36848 51419 32073 20562 -7676 -20206 -20699 -15248 -23206 -665 18123
3501 18123 28593 33999 24162 29425 21228 12500 19318 36255 43665 26044 -15001 -68452 -86302
3488 -86302 -62955 -46000 -32882 -20741 -39261 -40529 -31290 -46983 -34972 -20523 -39456 -33078
3476 -33078 -34893 -29079 -36677 -46410 -43684 -35561 -14358 23962 47385 31623 15200 -17539 -22605
3463 -22605 -33416 3070 15958 26069 37499 16567 82 -15261 -19206 -12631 -12901 -19628 -6905
3450 -6905 9923 34489 23432 -25790 -24359 -16309 -22494 -24334 -32961 -12785 -7381 -12307 684
3437 684 24268 34425 20405 18970 10156 8390 8327 -10004 -14227 12230 15107 30988 49613 42471
3423 42471 48718 62316 62844 32076 19083 14468 19200 22535 15495 27267 33087 2567 -33027
3410 -33027 -47213 -57217 -36592 -15901 15240 36852 -1067 -27358 -24564 -1339 27616 20415
3398 20415 29392 20911 19682 -746 -9137 -9212 -5985 -766 5883 9565 19524 25514 -7812 -8792 -10439
3383 -10439 -16902 -23691 -4968 795 1930 -16612 -16733 11808 7839 -15387 -23049 -3664 -9445 5352
3369 5352 3179 7318 26562 8637 -731 17376 13151 -26895 -5070 5108 17040 26992 53226
3356 53226 48661 39324 25800 18885 6470 19374 42499 37972 17266 -1388 -6827 -8079 -3142
3343 -3142 -305 27768 46527 63584 21552 -23457 -34513 -32489 -27843 -14956 10155 24810 -5621
3330 -5621 -31571 -27617 -23699 -34710 -20192 -29515 -17949 16463 37885 43225 38802 10468 6408
3317 6408 -325 -23685 -16609 31958 27887 -298 -2901 -4917 -29622 -58016 -42069 -11809 -1149
3304 -1149 -29978 -37894 -17304 -28600 -33487 -28101 -26037 -8072 2080 4630 -8387 -24838 -9469
3291 -9469 12981 33734 32560 21146 -1622 -386 30545 30030 8700 11087 4144 -3710 15321
3278 15321 -2909 -16408 -34686 -29405 -24984 -9631 -4029 -21809 -28605 -12533 -8406 -11386 7382
3265 7382 17527 20807 30960 23295 1117 -14467 -8872 -1640 -6752 -2682 19206 43361 38810
3252 38810 15284 34549 57591 47070 10926 -25834 -12023 13764 36661 4134 -24016 7061
3240 7061 25752 26555 27196 35731 16517 19894 3767 12424 28926 44406 65487 38725 20845
3227 20845 23895 26924 33770 27307 27623 23411 12235 25448 -2587 -23810 -22921 -7624 -4034 15250
3213 15250 17448 30630 25900 9011 -22228 -14105 6297 11852 23091 12575 7490 -700 -8460
3200 -8460 -21309 -45 12977 -10264 -18170 -22763 15157 9958 -20913 -10391 16904 -8680 -32023
3187 -32023 -35710 -17098 392 -9971 -24067 -20934 -25706 -24922 -6106 19960 14857 19498 14196
3174 14196 12806 -3603 5496 6183 9661 -22833 -26688 -17459 1680 10413 23556 45233 41724 32939
3160 32939 38358 47825 31961 13457 -12011 -8515 3999 -4763 -13462 -9548 -5458 4669 -2819
3147 -2819 -11293 -3618 5193 19739 14464 18611 19759 4288 4188 1780 10272 19468 12700 -12621
3133 -12621 -19537 -19383 -19444 -42339 -43070 -15221 -6946 -9822 -12856 12433 18694 33465 16825 -5276
3119 -5276 15344 43660 28740 16521 22723 16961 13479 18593 -1617 -24404 -18390 -7507 6667
3106 6667 9855 -1782 -12 -17384 -40389 -416 15945 12513 7654 -13262 6875 41983 38475
3093 38475 20746 25870 39682 41974 56034 43869 31430 18672 -4832 -20618 -8301 -24326
3081 -24326 -29548 -54345 -70528 -70971 -59175 -59689 -36669 -23002 1222 -2209 -10815 -7963 -22006
3068 -22006 -31842 -30470 -19645 -11892 -2284 1485 2472 2096 6039 12774 14189 24499 35149 36044 36126
3053 36126 25333 25093 6212 5088 4579 -3787 -1655 -1591 -6475 -10465 -22762 -16386 -7336 -540 -7575
3038 -7575 -1452 7725 21188 51258 53837 24913 14889 1588 -7373 7329 10535 -10062 -6994
3025 -6994 20044 33274 25756 32058 47825 58034 32896 18640 45264 37085 18104 7794 28406
3012 28406 20015 32088 21652 -17164 -6267 2884 -5437 -11362 -8701 6519 11233 4252 -27197
2999 -27197 -49162 -62246 -41341 -28159 -18160 20775 34855 -3754 -14821 -26783 -50725 -24728
2987 -24728 -13512 -8977 -17447 -31023 -34572 -54729 -60136 -49050 -28607 -23370 -29668 -48329 -47139
2974 -47139 -30056 3526 -14252 -25 44189 40341 28739 15172 -3247 -32573 -35033 -31341
2962 -31341 -378 19471 24875 28620 15290 -6719 6663 14129 -17286 -1957 14098 12550 -950
2949 -950 -9083 -222 1650 -21995 -15824 10791 13927 -14932 -18453 -14744 -32078 -34794 -27254 -3631
2935 -3631 -3819 -11900 -17125 -15183 17973 5150 -21200 -17856 -15372 -28091 1750 21935 7013
2922 7013 2731 -3781 -102 -8736 -25947 -40612 -24421 -178 11514 5152 8996 18055 13809 -19440
2908 -19440 -13938 -6262 -2410 3846 957 -23078 -23796 -1104 1181 6850 34472 22447 2115 25080
2894 25080 21191 10401 19743 12729 21541 22380 5284 -3491 -4349 3671 23530 -489 -11251 -8611
2880 -8611 14448 24123 14932 4941 14354 33276 20771 19919 36740 12598 -16000 -25201 -25592 -13658
2866 -13658 1734 -2804 -702 8911 -9860 7147 12371 7760 -6667 7951 12466 18094 48953
2853 48953 56143 41512 55104 50117 14117 4632 30041 57724 61551 60398 38398 23487 4355
2840 4355 -4805 16930 28381 26889 28698 29665 39950 31492 18498 3569 14535 9108 3779 -1996
2826 -1996 -8267 -16831 8796 6702 9077 29408 28595 -6823 -33567 -21390 -7255 -15489 -21420 -8307
2812 -8307 -8945 5948 -1374 11963 43022 44857 48680 38221 15405 -6103 8902 28705 18872
2799 18872 -3570 3134 4137 -38598 -56705 -50820 -56992 -42562 -14819 -1303 6874 6062 23225
2786 23225 29184 24459 11307 -5974 -21365 -10491 -1635 27632 16185 -2648 -23168 -28631 -28100
2773 -28100 6901 15441 -539 5712 28979 12111 -2015 -26643 -13389 7984 22589 15646
2761 15646 -20190 -11280 -148 25972 19155 -4474 -22972 -24199 -23612 -23313 -19330 20350 20082 464
2747 464 -10557 -24650 -37751 -38465 -29461 -28547 -18735 -9518 -459 -3668 15623 7342 -11715 1605
2733 1605 -6750 -13910 -7282 -18960 13983 33100 17041 -15429 -33255 -40502 -36055 -31954 -23017
2720 -23017 -58737 -52336 -35606 -25992 -17194 -7028 -26817 -9931 7409 -6200 -4173 -9198 -31559
2707 -31559 -15111 8230 32208 63883 54841 37682 55440 28750 747 -7280 -12660 -18591 -6406
2694 -6406 14337 1129 -10746 2891 -14481 -39390 -35937 -34654 -30720 -60790 -61029 -65343 -49202
2681 -49202 -45026 -30544 -25290 -13066 -29020 -30141 -33210 -23762 511 5061 3606 146 2645 -7220
2667 -7220 -12885 12209 24837 33559 -2752 -11827 -4596 -1034 -24017 -17485 -17325 -9051 -5828 -21422
2653 -21422 -26202 -52967 -53530 -33134 -37378 -14305 -13645 -12705 -4223 7338 -2235 -6586 -12754 -9410
2639 -9410 -6388 966 10252 6677 -3940 -8719 -11024 -7873 1491 24790 48638 59492 37696 6019
2625 6019 10504 -7700 -14541 -14201 -39676 -32331 -27981 -38321 -32412 -4781 -2737 -11704 16172 33095
2611 33095 14678 -2386 5062 17316 -3308 -19454 -4400 198 -12012 -18434 -5873 -9541 -8972
2598 -8972 24996 51241 58463 58015 35530 28114 40283 24543 12827 -8424 -6779 4883 9471
2585 9471 1141 53257 81384 55047 7713 -8996 -12110 -32694 -35389 -32665 -15406 -10772 -17728
2572 -17728 -18138 -30209 -27731 -12560 -158 -1083 -18497 3778 672 -19013 -23756 -56405 -66105
2559 -66105 -32549 13134 19972 6848 -14526 -43614 -40249 -25556 -37975 -36165 -33467 -44246 -57064
2546 -57064 -20926 -12481 -22305 -6078 26601 16192 -6710 -7184 14573 32241 13082 3582 -16894
2533 -16894 -21315 -18565 -20501 -31317 -28300 -25352 -26014 3088 29355 22592 7657 17471 8797 1986
2519 1986 -3493 5008 1466 8914 23163 20875 3765 4142 2539 4301 11293 12972 11585 -15145
2505 -15145 -31994 -21349 2449 -621 -16380 -5696 -107 -8886 -18655 -12479 -21197 -33079 196
2492 196 20119 19284 19590 26781 25334 33134 8127 5396 -2449 -27517 -22700 -21478 -14058 -138 -1904
2477 -1904 -3330 -2956 538 14226 39403 52702 49773 41370 37908 15547 941 -1902 -1905 18087
2463 18087 20502 -2991 918 12819 24714 17694 11557 -507 -19236 -24539 -2140 10172 -30887
2450 -30887 -29824 -18810 -24951 -20585 -11974 -12880 10783 -9664 -37178 -41333 -49855 -15149 25314
2437 25314 19409 -18443 -21037 64 29236 13157 30187 22974 -15628 -25293 -13673 -1352 11409
2424 11409 19255 34230 31369 5478 13075 22309 14612 -10619 -14591 -12705 -19958 -30516 -37008 -33454
2410 -33454 -49574 -79313 -98478 -74319 -23730 12063 5198 -14521 -14692 4549 23781 51216
2398 51216 38307 28387 15674 7980 2732 26369 35959 47343 47171 41316 43672 17529 359
2385 359 -314 -18553 -13360 -7160 12778 21294 54909 75929 35930 16262 20796 8597 7856 20989
2371 20989 50036 55326 34513 12621 -771 -17471 1539 24170 13530 12176 -1634 -9480
2359 -9480 208 -2028 16418 786 -22346 -33639 -37424 -38783 -24793 -11936 -8972 22041 17470
2346 17470 23436 13961 10874 19151 19226 23133 45212 19777 13545 58641 65690 19364 -6768 -32049
2332 -32049 -50847 -62289 -57365 -23353 -51590 -56085 -20324 4396 12682 8660 22856 23708 12773
2319 12773 5250 -13456 -5695 -5027 19537 42590 51909 28312 28525 46702 46220 30154 26682 10181
2305 10181 17451 11762 27236 43087 -3909 -6252 -16506 -47716 -46577 -53381 -48039 -32431 -3923
2292 -3923 -13643 -19944 -25005 -16933 -2503 -21531 -44052 -29085 -19088 -4961 -471 -25181 -19407
2279 -19407 -4628 -16943 -40520 -50051 -39723 -32522 -30771 -14943 1011 -20097 -29363 -26533 -51904
2266 -51904 -72347 -62679 -36592 -31145 -16451 -162 537 15008 3701 8326 33320 32535 4073
2253 4073 16684 -4096 -8193 -20592 -22803 -28738 -3503 16190 10174 -12731 -16513 -11288 -25142
2240 -25142 -40304 -31851 -40507 -29231 -29823 3316 11736 27622 7506 4647 22273 38860 27975
2227 27975 -4520 -3003 -22933 -8295 -5683 -36557 -31073 1627 25813 32351 21347 22485 29172
2214 29172 53408 35286 37423 45159 40126 23265 8889 14290 18075 7558 15891 22784 23951
2201 23951 21268 10735 -19853 -36723 -30742 -17426 -3042 4164 -1738 9705 8550 -1826 -10157
2188 -10157 -2841 16702 26700 13102 -6525 -25763 -18349 1456 2695 20384 33907 17294 20452
2175 20452 11619 3585 8032 -7486 -24924 -9933 36592 27965 -14505 -10939 -2881 3398 27932
2162 27932 35792 41317 16463 23895 40273 25751 10607 17259 15691 -130 10343 -15426 -20469
2149 -20469 22369 -137 -7424 -20263 -12471 -9547 -10337 -12525 -18739 -15055 40254 68415 53514
2136 53514 43567 787 -33463 -25750 -32052 -25674 -6411 -23165 -44221 -34549 -15306 -4796 -14377
2123 -14377 -11338 -19277 -20701 -5443 -15750 -26260 -34997 -42023 -27775 -6678 20366 38656 -6805
2110 -6805 -49533 -51806 -38790 -7312 15787 -3449 -16609 -31782 -27053 -31250 -39606 -37217 7513
2097 7513 32721 25467 6500 -622 -9103 -3971 16295 27221 34479 42673 55534 32654 -1155
2084 -1155 -2112 5465 -17091 -39198 -31232 -24914 -444 -2692 -26201 -19520 7933 17260 9111 24316
2070 24316 -7909 -37675 -34269 -20615 -5067 -15865 -35464 -14655 11426 28398 -16846 -36773
2058 -36773 -31821 -28382 -19189 -20680 -12253 35582 36228 -7687 -17160 -14333 17632 34049 17335 6219
2044 6219 -6255 8424 15255 -16019 -4530 304 -20398 -16699 5752 29716 7047 -21709 -35636
2031 -35636 -24917 5781 9684 -19626 -33789 -24602 -8535 16357 22719 15861 22800 8759 -5713
2018 -5713 -21468 -17359 5086 19964 31535 19492 29060 19272 -4740 -20585 -12222 -462 -2797
2005 -2797 -30574 -21534 -24745 -24837 -30614 -22696 -15037 -25441 -26658 5266 12144 -10571 -8274 -11757
1991 -11757 -19270 -31640 -37520 -30237 -23366 -21319 -22360 4077 33372 30155 -7142 499 31853
1978 31853 8391 18197 -3180 -27334 -41564 -40707 -30331 -30249 -25828 -25110 -47416 -34162 10273 5291
1964 5291 9551 36848 34134 37988 24974 20508 8203 -5471 -24512 -56675 -32697 -860 16085
1951 16085 -3279 -39856 -38025 227 31803 38526 24860 2896 286 5635 -6164 -36743 -44086
1938 -44086 -14613 -6285 -24806 -33727 -21312 -24046 -10304 -32443 -36861 -25499 -16922 -20463 -31779
1925 -31779 -8233 27957 15198 15593 15906 6070 -13580 -41316 -59138 -32763 -12175 -12348 -25729
1912 -25729 -15726 -15815 10030 40381 22282 -18611 -18999 15489 30425 24237 6078 -859 18740
1899 18740 18089 -7350 9126 38976 20762 -23448 -40441 -35902 -18134 -19697 -22020 -5766 -7893
1886 -7893 10168 31003 39608 40235 17124 21594 32560 23760 22853 22197 20176 16270 5955 -3229
1872 -3229 -14119 -9506 -6435 -14497 -4753 13411 25238 43683 55380 66489 70771 44744 55455
1859 55455 63916 42198 43134 80784 80357 36039 25333 1515 -39310 -50423 -39817 -42131 -32240
1846 -32240 -18695 -18431 -1007 -4382 -14482 -22529 -37881 -43887 -15958 -8115 -5147 -2075 8363
1833 8363 12455 2923 -4549 3098 -21917 -48756 -59576 -33765 -18529 -10159 30679 9579 -1679
1820 -1679 13329 35441 20773 20639 15052 4495 -7264 7723 15231 3374 14917 16289 14111
1807 14111 22396 28817 748 -15108 5834 39236 55377 65444 73580 71982 61085 68667 67932
1794 67932 33275 32122 24622 41772 24827 -3592 -5342 11971 31116 44282 36097 28755 12301
1781 12301 -13132 -12580 -13389 19458 35572 18242 -21066 -31046 -20247 -5139 1810 -3200 -13942
1768 -13942 -26743 -12315 29547 38560 40770 18520 -10455 1813 -20145 -24856 -29270 -48779 -41343
1755 -41343 -30748 -24402 -451 21025 12683 1416 12548 26677 55918 74846 68771 65187 81094
1742 81094 56517 43989 30512 28202 4587 19629 9170 -683 6704 37529 28653 -14886 -29365
1729 -29365 -25527 -15687 -23967 -38511 -56860 -37135 -46765 -59957 -30004 -4405 2255 136 -27503
1716 -27503 -23068 8636 11923 14254 11145 10287 21814 51724 46387 6961 4143 4994 12513 6807
1702 6807 -48650 -54660 -26685 -19121 1142 2959 -7067 -6053 13831 17281 16157 14207 -8299
1689 -8299 -19679 -29246 -43970 -22685 -6586 -13498 -18742 10451 35636 37627 -11512 -21171 -9908
1676 -9908 -14957 -31909 -33710 -44420 -34708 -2501 -14289 -20587 -17349 -15376 -22351 -47656 -43341 -30138
1662 -30138 -35284 -33121 -33367 -7734 22691 39069 31865 17133 28708 60451 50468 25257 -16606
1649 -16606 -9005 -4085 -4116 3203 3939 14702 40732 38345 33834 46774 21597 -6725 -19274 -22782
1635 -22782 -27194 -11673 2951 5899 3103 4254 44453 38995 -1483 -17967 -40331 -49534 -23185
1622 -23185 17637 8428 21384 9729 39848 35110 2604 -16991 3884 7297 36032 61020
1610 61020 33876 5874 -2328 10155 9494 9192 5553 -17592 -33447 -28033 4062 -3255 1232 24871
1596 24871 13091 7541 -3531 -4329 -2643 729 6581 16178 17064 -2008 -24931 -22505 -5871 3288
1582 3288 20981 22367 34164 26386 19611 19737 12905 5483 16648 7307 4566 22817 37747 35889
1568 35889 16405 17606 11807 -3236 13140 30417 20087 18611 24631 -6470 -12873 -18609 -28179
1555 -28179 -36618 -25240 -15367 8481 363 -9083 -11262 -28790 -12574 -2739 -7338 -2856 13937
1542 13937 -5799 -11655 5339 -9827 -10296 1480 -18159 11527 19547 19788 8364 22978 31081
1529 31081 22250 30424 9769 2416 -15171 -37989 -42608 -38869 -32070 -43650 -26512 19419 21311
1516 21311 34560 47150 38566 8593 2878 -30757 -26818 -6643 1910 -12060 -38283 -37474 -5503
1503 -5503 4919 -29219 -32496 -30223 -27783 -16713 8682 -5572 -14201 -9783 2309 -1172 -10695
1490 -10695 -16472 -45571 -41874 -42859 -52068 -39820 24767 26263 5775 17747 9942 -17221 8647
1477 8647 792 -1877 14123 21577 4633 -8878 -5370 -2838 11742 18933 32004 44525 53265
1464 53265 56120 63580 47384 10227 7362 17886 14952 21839 40504 14494 31821 28290 10824
1451 10824 22183 32912 21960 3132 14532 33496 36650 19025 6147 -3652 5239 40173
1439 40173 12206 -32718 -46888 -24922 -27413 -47558 -46550 -55982 -45412 -27661 -4053 10020
1427 10020 -4844 -26260 -6987 12566 13248 -1978 5538 20240 11261 5934 -4787 -4323 -11051
1414 -11051 -2022 8178 -16266 -14271 -185 4910 11729 -6982 -13976 -6572 -14884 -2253 19359
1401 19359 42932 26832 15903 13107 10420 14651 18307 27787 15182 -1251 -14394 -15937 -11577
1388 -11577 23042 11686 -7714 -15816 6398 7844 9402 -7156 -2381 14644 -1444 -4233 -13815
1375 -13815 -29888 -31088 -10827 5952 -16132 -21103 19792 15721 -31766 -30477 -19258 -25839 -35301
1362 -35301 -42082 -25349 -13316 -17157 -20644 -37679 -3281 -4571 -7775 -22740 -29271 -28322 -14983
1349 -14983 11534 5788 -4428 11233 16895 16393 17917 26146 39455 7091 -1719 -18329 -8047
1336 -8047 10999 1884 -38074 -34020 -13899 2847 -4362 -25232 -28430 -27614 -18754 -9298 -11615 20996
1322 20996 43058 43044 18106 8417 6357 4201 15216 1340 -5978 -14088 -14416 -398 4789 -2784
1308 -2784 -11014 -25374 -34461 -42496 -58792 -40809 -28646 -25812 -25644 -23889 -29833 -48013 -43201 -9909
1294 -9909 -10031 -11154 -27851 1545 23187 20941 20560 14803 3377 7659 -15347 -7758 710 -24470
1280 -24470 -20504 38485 35227 1558 4981 28438 15584 23456 5728 -12983 11878 270 -22913
1267 -22913 625 -240 1629 -7528 -24335 -24300 -1752 41981 47369 30251 20331 1066 -26436 -39854
1253 -39854 -15468 11527 16064 -3757 -6670 -29482 -40925 -24681 -39860 -42132 -31195 -1288
1241 -1288 3097 -529 4689 12730 7261 -3289 -33209 -37776 -7618 2625 2075 9605 19567 13023
1227 13023 15568 26888 3716 -1824 -1406 2379 6497 15772 17517 16987 25818 59240 44573 1199
1213 1199 -1661 18153 18070 11904 6731 -15298 -12066 -21797 -28090 -9336 -5613 27853 43263 39476
1199 39476 38481 14541 9859 18954 52119 62832 45457 35089 1109 -20757 -8212 26625 31863
1186 31863 2638 -9637 -3621 -674 -5471 -980 -7542 -21904 -19836 -22300 -31232 -38636 -19740 -12092
1172 -12092 24248 17184 7503 28528 22311 6091 -32492 -45251 -20351 -26004 -15610 -1490 18873
1159 18873 15390 3195 8442 3636 2961 -749 -4486 4197 15115 2436 34432 23249 6240
1146 6240 17411 28910 21388 17649 -32609 -47211 -32827 -11394 14925 25626 31839 38260 19733
1133 19733 18146 26775 30609 16879 -4262 -24562 9170 21288 4039 11061 15545 -1534 29013
1120 29013 17659 7664 35837 65957 56222 42459 19329 -14189 -21330 -414 15777 24814 29303
1107 29303 33756 33680 14499 4008 31782 35306 15903 21222 48502 61140 43178 26616 24520
1094 24520 1852 -22492 -45731 -34796 -9508 -4870 15701 7794 -24452 -19955 -31029 -13648
1082 -13648 -2664 -19549 -24047 -24794 -18066 -21162 -19464 -33226 -42343 -16701 -8254 -15437 -39073 -19664
1068 -19664 -5731 -6661 -3101 -7411 8056 19510 -26 6033 12201 40821 40007 15572 -9725
1055 -9725 12199 10069 5909 17567 24091 34167 8032 1061 27646 28607 19691 6488 -7797
1042 -7797 -2973 -362 -10223 -19066 -33455 -31920 2997 -4553 -27795 -8744 1277 -10360 -14968
1029 -14968 -10584 -2955 557 -3403 11808 39760 34559 3925 4651 1576 -2876 7699 37013 54598
1015 54598 40431 18031 17486 3871 -1423 10441 13901 26747 18514 5200 23239 29706 17391
1002 17391 13732 14599 -1333 1582 14773 23984 17744 14563 24792 25495 32370 36047 34791 37960
988 37960 53993 26135 5878 27155 28694 40252 46079 55460 75603 74258 49580 24510 31951
975 31951 53880 39578 36522 38788 23349 25136 26782 18761 15965 19115 33941 29313 40605 46302
961 46302 28787 16094 11191 -4070 -30981 -16779 -12694 -13670 9088 14895 28041 11331 -22244
948 -22244 -23939 3633 -2744 -12432 24485 2871 -51116 -55532 -11783 -28246 -25976 -14570 -16362
935 -16362 -4926 -18864 -27530 2255 10353 5071 -15751 -11490 -2233 9550 -3778 -3037 2858 15248
921 15248 38266 39135 16499 -9014 -7189 3407 17664 29675 22759 23514 3684 -31869 -44305
908 -44305 -29167 -19255 -11126 9498 10364 11959 -10159 -15545 6133 -5490 9316 31935 62333
895 62333 46931 24706 14484 12084 -14823 -18764 -42376 -48307 -37196 -32213 -16235 31666 52258
882 52258 47699 38906 15980 -15003 -33396 -31587 -41360 -45308 -25814 -22574 -5772 11794 10074
869 10074 4121 3697 1846 14203 -2496 1058 37195 70689 71985 27917 -4445 -20889 -5135
856 -5135 7907 1380 9010 -5453 -20277 6696 24802 26267 5074 6509 5441 -17004 1129
843 1129 11547 1261 -357 -4733 -3833 4389 8283 -51 -1660 -35843 -50283 -31424 -11792 30836
829 30836 68224 39340 15581 29948 22570 23301 26802 13986 -19781 -24105 -12188 609 3892
816 3892 -25065 -18385 8907 32048 32367 2407 -14125 -18109 -16056 -33396 -35237 924 10512 27786
802 27786 43891 16438 -7263 2666 21682 10295 -755 17853 32643 10776 11354 -3087 -21895
789 -21895 -23711 -41459 -22063 -29795 -48979 -20830 1511 11270 649 -13541 -24756 -32344 -11995
776 -11995 -17399 4932 7278 10329 26035 -402 -30147 -10120 21163 6809 -4171 4313 4349
763 4349 -3116 -9600 -22450 -15242 2694 -7211 -13470 -11363 -10294 -2532 9531 -883 -43266 -43052
749 -43052 -15668 817 9491 13815 -1355 -15797 4134 17898 7474 31539 21781 -21599 -34744
736 -34744 -20486 10418 21836 48539 28032 4227 -18332 -32753 -35145 -48654 -35138 -5101
724 -5101 7600 -1313 -16251 -32264 9286 39401 38138 63475 52389 2399 -9616 -4794 12814
711 12814 16281 17153 16542 17007 5236 -7606 -4363 13391 35274 20928 -5069 -7649 21009 29178
697 29178 36677 50729 50635 1310 -387 19841 10149 423 -31006 -23723 -7129 -20139 -17674 15647
683 15647 16714 24003 30715 5430 1010 12088 15528 8963 -4412 -47930 -40567 -19480 -40391
670 -40391 -7313 44802 40815 34873 20010 -8175 -47844 -45103 -26018 -24317 -21398 -13965 -20407
657 -20407 -42037 -19634 16361 -19110 -43827 -20137 -15717 6194 24331 34758 27391 18448 16563
644 16563 -12021 -29630 -21296 -10412 -26471 -11848 17290 30902 26097 15235 -17073 -10187 -8193
631 -8193 -25124 -21508 -24490 -50467 -41114 -30301 -2212 -5969 -12012 9629 17327 207 -16222
618 -16222 -25289 -2209 8115 11861 21049 23288 7454 6384 2872 -7937 8827 -16167 -62532
605 -62532 -64248 -35406 -6155 -6168 20683 43010 44775 29563 750 -8699 -23549 8801 11517
592 11517 -16873 -38574 -36562 -36441 -7818 -1169 20986 6397 21481 39432 26810 3333 -6386
579 -6386 -2694 -24467 -18680 -18504 -26836 -16627 1360 36752 38146 20000 5110 2249 19584 14989
565 14989 -4072 -36718 -40399 -12944 -12778 -2496 2571 -24033 -29157 -5008 26614 36863 22564
552 22564 36431 33319 4557 4399 26787 37006 33970 24435 39110 22340 -13128 -18950 -12971
539 -12971 -14240 -20985 -8218 534 15470 16223 33378 43497 31637 -5392 -16467 -16513 -14668 5826
525 5826 2052 12273 -697 -7056 -19680 936 -305 806 6551 -2478 1271 8009 22232 19448
511 19448 17484 7892 20007 17984 -544 -9124 19551 24512 1176 -19028 -41577 -47487 -33573
498 -33573 -8420 -24346 -60553 -78508 -71200 -30795 -41983 -38182 -34513 -29481 -27937 -8882 25130
485 25130 54498 62240 35125 9435 1283 31869 9186 -13049 -16667 2725 -19007 -50587 -49945
472 -49945 -30667 -11186 19212 7310 -32903 -24918 13187 17633 2109 -13242 -10501 6949 9274
459 9274 -2613 9700 26328 36331 31463 11767 -10508 -22790 -28433 -10747 -21317 -38134 -28529
446 -28529 -30658 -27313 -1681 35825 35787 24960 7393 766 -19136 -9975 2303 -10272 -11785 -5806
432 -5806 3268 948 1366 14275 8981 -8906 6080 20770 10834 -14985 -9727 -7855 -19737 -38425
418 -38425 -8509 -15132 -36123 -15611 -2287 -17056 -31008 -15990 -34011 -38410 -27189 -26550 -962
405 -962 6451 -13604 5270 6227 28309 35342 23346 -17984 -14615 -12161 -8002 7393 38586 35100
391 35100 48893 43538 34521 38738 30993 20490 29506 39981 25101 1073 8379 29414 49019
378 49019 51435 64571 71598 46557 -748 11745 8427 10893 68197 63479 24269 8392 4265
365 4265 -921 -4421 12326 30849 27572 30118 9093 -2689 10874 20004 16090 -4840 -19129
352 -19129 -10632 -11822 -35899 -20065 -1969 23310 45540 49344 35773 9954 8735 6959 452
339 452 -15285 -10539 4396 7879 -6265 -6511 2746 5503 10088 30875 19433 -2803 616 -17097
325 -17097 -28095 -14317 -1938 12759 4994 -9450 -9607 1125 22156 13067 -8314 -21819 -14886
312 -14886 -26223 -41422 -22829 -19661 -30174 -48811 -47485 -13967 -13484 -37244 -58837 -53836 -38676
299 -38676 -47831 -43975 -34852 -15719 -8357 12445 1640 -12957 5293 14797 16063 907 8789
286 8789 30495 20795 -5521 -7693 11791 24439 22398 15739 9576 4790 11337 14574 -3584 -12141
272 -12141 6970 20665 20010 -3246 -21160 -13678 -10044 -8229 -5383 -17331 -3633 9133 -3688
259 -3688 -38164 -36597 -22190 50 21613 28621 9984 532 -21324 -23549 -21004 -5439 18631
246 18631 27406 26707 4040 -749 -6648 -21826 7773 16098 13331 11519 -2067 9796 9546 17404
232 17404 12096 15885 818 11518 10627 19995 23672 12199 8547 -3699 -796 2513 11970 6891
218 6891 34239 40195 -4034 -24566 -6167 17571 33114 32897 30439 -5269 -20030 -22192 -12547
205 -12547 -13543 -12649 916 2442 7772 16929 -296 -7760 -13464 -38641 -31908 -12816 8132 7437
191 7437 -3696 -25399 -40927 -28395 1851 5211 8394 850 -12090 -1357 7197 19271 17980
178 17980 24000 34131 10599 2737 18156 28338 26774 14929 6782 3991 -6405 -21825 -8455
165 -8455 -4259 -5318 5012 6479 21879 39687 31102 19422 4991 1883 14839 1316 -4311
152 -4311 -3031 -4935 -9593 -23050 -15652 -22976 -35518 -25956 -16599 -8195 -12180 -10264 -861 3227 14654
137 14654 -176 -20330 -24673 -37341 -26820 -19756 -5046 10958 16280 6791 -10393 -12315 -9730
124 -9730 -2296 15498 17552 8177 -7092 13404 13192 20123 43717 40719 28324 -7753 -11348 9142
110 9142 4746 -9607 -13545 -9787 -1519 7047 12788 -1045 -621 9549 14226 13114 13549 -456 -1594
95 -1594 20484 20429 17146 6710 11843 12153 2346 -7847 -5765 -582 4517 13829 10318 24735 25766
80 25766 23824 13005 10957 10660 7244 12559 16200 9102 8848 15643 12274 23601 10665 14027 17125
65 17125 27877 32387 8891 -26756 -17087 1119 4507 -10761 -26692 -32240 -31482 -27961 -35156 -33996
51 -33996 -13864 -5974 -24304 -27756 -16588 -4337 9594 30863 52216 47697 38851 33797 20734
38 20734 15301 16847 11765 751 -7444 -10771 -18344 -33071 -28846 1840 14433 24264 24777 5083
24 5083 -15809 -7027 4270 -9273 -13069 4476 905 -3642 -19529 -18624 -11066 11702 -713 6287
10 6287 8402 6544 16841 9444 17806 3005 -9599 6811 15328 10091
0 10091
$$ Imaginary data points
##PAGE= N=2
##DATA TABLE= (X++(I..I)), XYDATA
32767 131609 131478 109537 105702 111614 120945 123543 116258 118430 135670 144187 140409 136486 145656 130723
32753 130723 128366 139487 156347 175147 166994 168184 150290 143418 133852 138908 162376 188573 186198
$$ [...]
##END NTUPLES=NMR SPECTRUM
##END=
