##TITLE=XTC-1675_2
##JCAMPDX= 6.0         $$ Bruker NMR JCAMP-DX V2.0
##DATA TYPE= nD NMR SPECTRUM
##DATA CLASS= NTUPLES
##NUM DIM= 2
##ORIGIN= BRUKER
##OWNER= patiny
$$ 1.79 TOPSPIN		Version 3.0
$$ 2012-05-20 09:08:01.937 +0200  patiny@icmbsg005
$$ Compression mode = diff/dup
##.OBSERVE FREQUENCY= 400.13157934134
##.OBSERVE NUCLEUS= ^1H
##.ACQUISITION MODE= SIMULTANEOUS (DQD)
##.ACQUISITION SCHEME= Echo-Antiecho
##.AVERAGES= 4
##.DIGITISER RES= 23
##SPECTROMETER/DATA SYSTEM= spect
##.PULSE SEQUENCE= hmbcetgpl3nd
##.SOLVENT NAME= D2O
##.SHIFT REFERENCE= INTERNAL, D2O, 1, 7.306194
##AUDIT TRAIL= $$ (NUMBER, WHEN, WHO, WHERE, PROCESS, VERSION, WHAT)
$$ ##TITLE= Audit trail, TOPSPIN		Version 3.0
$$ ##JCAMPDX= 5.01
$$ ##ORIGIN= Bruker BioSpin GmbH
$$ ##OWNER= patiny
$$ $$ /opt/data/patiny/nmr/XTC-1675_2/14/pdata/1/auditp.txt
$$ ##AUDIT TRAIL=  $$ (NUMBER, WHEN, WHO, WHERE, PROCESS, VERSION, WHAT)
(   1,<2012-05-20 09:07:59.976 +0200>,<patiny>,<icmbsg005>,<go>,<TOPSPIN 3.0>,
      <created by zg
	started at 2012-05-20 08:45:52.885 +0200,
	POWCHK enabled, PULCHK disabled,
       configuration hash MD5:
       77 C7 B7 C4 10 F4 BA 30 64 2E BB 52 82 F2 DA 41
       data hash MD5: 4K * 128
       51 53 31 FC 9D 45 8E F0 9B EF F9 B7 B9 A6 0E 22>)
(   2,<2012-05-20 09:08:00.039 +0200>,<patiny>,<icmbsg005>,<audit>,<TOPSPIN 3.0>,
      <user comment:
       ICON-NMR User ID: patiny
       data hash MD5: 4K * 128
       51 53 31 FC 9D 45 8E F0 9B EF F9 B7 B9 A6 0E 22>)
(   3,<2012-05-20 09:08:00.979 +0200>,<patiny>,<icmbsg005>,<proc2d>,<TOPSPIN 3.0>,
      <Start of raw data processing
       xfb same F2: SI = 2K WDW = 3 SSB = 4 FT_mod = 6 PKNL = 1 F1: SI = 1K ME_mod = 2 NCOEF = 32 WDW = 4 SSB = 2 FT_mod = 6 PHC0 = 0 PHC1 = 0
       data hash MD5: 2K * 1K
       7D D8 42 D3 CC 4C BE 47 6C 4E A6 2D FA 11 FA 45>)
(   4,<2012-05-20 09:08:01.090 +0200>,<patiny>,<icmbsg005>,<proc2d>,<TOPSPIN 3.0>,
      <abs2 F2: ABSG = 5 ABSF1 = 7.306194 ABSF2 = 0.5879471
       data hash MD5: 2K * 1K
       C4 44 D4 C3 0C B3 86 7C E5 6F 90 26 EC AF C2 36>)
(   5,<2012-05-20 09:08:01.269 +0200>,<patiny>,<icmbsg005>,<proc2d>,<TOPSPIN 3.0>,
      <abs1 F1: ABSG = 5 ABSF1 = 210.754 ABSF2 = -11.10083
       data hash MD5: 2K * 1K
       F6 A7 7B F2 C0 CF E8 FD 6F 40 3A 21 5C 9D B9 2F>)
$$ ##END=
$$ 
$$ $$ hash MD5
$$ $$ 95 B5 18 B3 11 B7 94 6F 3A 76 0A B5 40 65 92 8D
##$RELAX= 
##$RELAX= 
##$RELAX= 
##$RELAX= 
##$RELAX= 
##$RELAX= 
##$RELAX= 
##$RELAX= 
##$RELAX= 
##$RELAX= 
##$RELAX= 
$$ Bruker specific parameters
$$ --------------------------
##$DATPATH= </opt/data/patiny/nmr>
##$EXPNO= 14
##$NAME= <XTC-1675_2>
##$PROCNO= 1
##$ACQT0= 1000000
##$AMP= (0..31)
100 100 100 100 100 100 100 100 100 100 100 100 100 100 100 100 100 100
100 100 100 100 100 100 100 100 100 100 100 100 100 100
##$ANAVPT= -1
##$AQSEQ= 0
##$AQ_mod= 3
##$AUNM= <au_getlinv>
##$AUTOPOS= <38 >
##$BF1= 400.13
##$BF2= 100.612769
##$BF3= 400.13
##$BF4= 400.13
##$BF5= 400.13
##$BF6= 400.13
##$BF7= 400.13
##$BF8= 400.13
$$ [...]
##$SIGF1= 7.306194
##$SIGF2= 0.5879471
##$SINO= 0
##$SIOLD= 2048
##$SPECTYP= <>
##$SREGLST= <1H.DMSO>
##$SSB= 4
##$STSI= 2048
##$STSR= 0
##$SW_p= 2688.17204301075
##$SYMM= 0
##$S_DEV= 2365262
##$TDeff= 4096
##$TDoff= 0
##$TI= <>
##$TILT= no
##$TM1= 0
##$TM2= 0
##$TOPLEV= 100
##$USERP1= <>
##$USERP2= <>
##$USERP3= <>
##$USERP4= <>
##$USERP5= <>
##$WDW= 3
##$XDIM= 2048
##$YMAX_p= 254431205
##$YMIN_p= -418267076
##$CURPLOT= <Cups-PDF>
##$CURPRIN= <$Cups-PDF>
##$DFORMAT= <normdp>
##$LAYOUT= <+/2D_inv.xwp>
##$LFORMAT= <normlp>
##$PFORMAT= <normpl>
$$ Bruker specific parameters for F1
$$ ---------------------------------
##$ACQT0= 0
##$BF1= 100.612769
##$FnMODE= 6
##$NUC1= <13C>
##$O1= 10043.8343986724
##$SFO1= 100.622812834399
##$SW= 221.832681201688
##$SW_h= 22321.4283611104
##$TD= 128
##$ABSF1= 210.754
##$ABSF2= -11.10083
##$ABSG= 5
##$ABSL= 0
##$ALPHA= 0
##$AQORDER= 0
##$ASSFAC= 0
##$ASSFACI= 0
##$ASSFACX= 0
##$ASSWID= 0
##$AUNMP= <>
##$AXLEFT= 0
##$AXNAME= <F1>
##$AXNUC= <13C>
##$AXRIGHT= 0
##$AXTYPE= 0
##$AXUNIT= <>
##$AZFE= 0.1
##$AZFW= 0.5
##$BCFW= 0
##$BC_mod= 0
##$BYTORDP= 0
##$COROFFS= 0
##$CY= -3
##$DATMOD= 1
##$DC= 0
##$DFILT= <>
##$DTYPP= 0
##$ERETIC= no
##$F1P= 210.76350402832
##$F2P= -11.0913240743493
##$FCOR= 0.5
##$FTSIZE= 1024
##$FT_mod= 6
##$GAMMA= 0
##$GB= 0
##$INTBC= 1
##$INTSCL= 1
##$ISEN= 128
##$LB= 0
##$LEV0= 0
##$LPBIN= 256
##$MAXI= 10000
##$MC2= 5
##$MEAN= 0
##$ME_mod= 2
##$MI= 1
##$NCOEF= 32
##$NC_proc= -11
##$NLEV= 6
##$NOISF1= 0
##$NOISF2= 0
##$NSP= 0
##$NTH_PI= 0
##$NZP= 0
##$OFFSET= 210.754
##$PC= 4
##$PHC0= 0
##$PHC1= 0
##$PH_mod= 1
##$PKNL= no
##$PPARMOD= 1
##$PPDIAG= 0
##$PPIPTYP= 0
##$PPMPNUM= 2147483647
##$PPRESOL= 1
##$PSCAL= 1
##$PSIGN= 0
##$PYNMP= <>
##$REVERSE= no
##$SF= 100.612769
##$SI= 1024
##$SIGF1= 210.754
##$SIGF2= -11.10083
##$SINO= 0
##$SIOLD= 1024
##$SPECTYP= <>
##$SREGLST= <>
##$SSB= 2
##$STSI= 1024
##$STSR= 0
##$SW_p= 22321.42836111
##$SYMM= 0
##$S_DEV= 2365262
##$TDeff= 256
##$TDoff= 0
##$TI= <>
##$TILT= no
##$TM1= 0
##$TM2= 0
##$TOPLEV= 0
##$USERP1= <>
##$USERP2= <>
##$USERP3= <>
##$USERP4= <>
##$USERP5= <>
##$WDW= 4
##$XDIM= 128
##$YMAX_p= 254431205
##$YMIN_p= -418267076
$$ End of Bruker specific parameters
$$ ---------------------------------
##NTUPLES= nD NMR SPECTRUM
##VAR_NAME=  FREQUENCY1,    FREQUENCY2,      SPECTRUM
##SYMBOL=    F1,            F2,              Y
##.NUCLEUS=  13C,           1H
##VAR_TYPE=  INDEPENDENT,   INDEPENDENT,     DEPENDENT
##VAR_FORM=  AFFN,          AFFN,            ASDF
##VAR_DIM=   1024,          2048,            2048
##UNITS=     HZ,            HZ,              ARBITRARY UNITS
##FACTOR=    21.7982698838965, 1.31258400537634, 1
##FIRST=     21204.543296753, 2686.85945900537, 1133476
##LAST=      -1095.08679447308, 0,           -2696549
##MIN=       -1095.08679447308, 0,           -418267076
##MAX=       21204.543296753, 2686.85945900537, 254431205
##PAGE= F1=21204.54329675
##FIRST=     21204.543296753, 2686.85945900537, 1133476
##DATA TABLE= (F2++(Y..Y)), PROFILE
$$ [...]
##PAGE= F1=5793.166488838
##FIRST=     21204.543296753, 2686.85945900537, 223428
##DATA TABLE= (F2++(Y..Y)), PROFILE
953 601075 4271447 -2826919 3706512 1456595 -4123620 1725306 1573960 -649629 -5940013
944 -5940013 -82720 2355340 -3369845 4997778 -965625 3262168 1898174 -2912306 1464392
934 -2039462 2880501 -221293 -719782 4447407 85517 247656 -4222332 -4076714 2981587
924 1889508 2330830 251458 3720466 -137164 -6890895 -2094 -519860 1833478 4226901
915 4226901 2016476 -1430722 -1127772 1277993 91597 757660 -1920240 564658 248252
905 2158492 -2871051 1761811 -1508524 2257844 -6555295 5498993 -658696 -36612 -3637550
896 -3637550 3283714 -3989794 5607218 -3344614 620173 642493 -3137979 -4485920 -1684699
886 2092481 -607130 -341224 2182336 -3528155 5792546 -1436189 1093006 -74389 1427977
876 424622 3180514 -3071782 628840 2406912 -677099 2434131 -7012069 2673427 -2139648
866 3059339 -2144896 353550 -708598 2533503 -2514650 1466135 6428251 -7960830 -3922126
856 582255 -1853700 -3987999 3091927 -1114695 942166 -1045338 -252952 -2396316 3930000
846 213264 -5421096 603960 -3489893 5171274 -6785984 3944089 633992 -978833 3674635
836 -1774000 4130303 594381 -1995441 -2619347 2390975 13033 -913038 -648341 -4633003
827 -4633003 2976913 -2073980 1317213 -2536674 -367755 5748994 1965755 4758769 1866569
817 -5246275 1806938 -2707607 1783629 -3071351 3671254 5486291 -4523976 -812999 2383910
807 1092766 -2362425 6493168 -1561441 -646611 -1043258 -1780705 357803 -1128703 1131500
797 1092336 1470025 2222456 -330128 1734405 -2407908 842175 886263 -1421195 -4855734
788 -4855734 2133409 302084 -1487425 -2127160 -205716 -248226 1153642 -3563558 2240190
778 -1051379 -724132 -1339929 -2979487 1497393 47134 -3541802 2992865 -1081609 -4012287
769 -4012287 -1103544 782212 4640116 -2424550 1351220 750838 2306326 480639 567939
760 567939 1486439 -401068 1352740 -2985586 -174227 -212055 1433175 -2827131 3196239
750 1716640 -5340322 -233151 -4344538 -563293 667940 608656 5912707 1297226 -1688790
740 1577500 2459944 901929 -450434 2186916 -3829136 1931540 -5243369 4733424 -243770
730 2275047 -2634914 3068279 -695608 -1650772 1245211 -2126912 -698240 2643292 1195165
720 4390836 -5635547 -3232499 -1056421 1438559 1255952 -963630 -12360268 -9323616 -7047150
711 -7047150 -1608564 11981593 15432231 -6450065 8241557 1551127 -3313692 -7532373
703 -7532373 -13930900 -5987811 -5562127 -10280863 9934076 16213013 12087806 11441265 6725552
694 6725552 -12636475 -4718287 -2509240 605768 10819 -1282456 -3238000 -346046 970312
684 5822404 -1279101 -51000 -2502952 -140326 -1707919 2566570 -146416 -203797 1090999
674 4176972 12546409 -4291517 -7315994 -12518329 -9196927 -1096193 -7377551 -2365807
665 6037813 12077527 13085996 6446745 -3919239 -4335836 -6728467 -3618896 -457022 -10023276
656 -10023276 -11876396 1612504 837494 11656688 3666057 -1031649 3406238 3498733 -2671539
646 -1465341 -16839 -1712327 -1056390 -2127994 -2944110 369858 6215757 -3780998 2448700
636 197669 1370019 1899991 -359804 3955021 -1227457 335352 377822 3307744 792930
626 -539329 4566909 3663620 1868905 1878710 13586054 21584874 -40191521 -106958713 -29187473
616 69992271 37178094 4182926 3615901 4537357 532731 8588103 -28582 1122838 1193565
607 1193565 -726620 -1968895 -1147089 -824419 -3893407 5936485 1961769 -4006037 1238141
597 1205174 3033465 -1510048 -115441 623442 2902003 -91635 4156301 -7367461 2330797
587 512588 -212600 3877931 -2891929 2886621 958006 2829209 -3061405 1764917 -1549895
577 -535498 6198546 -1221161 -3461934 -7215154 7131979 540341 624872 1726427 -588837
567 1805693 1533534 -1311667 -385114 821206 821669 826950 736046 -2686334 1122372 4266296
557 4266296 313497 -4434832 2340021 -1820005 1114151 -873338 848550 -2439805 5113574
547 -2310580 -946809 -771346 -503719 -391562 733808 2577586 -1848818 844522 814244 -3121793
536 1192989 -4721424 -2897381 -114249 -1349047 -1091322 1135234 762821 -1230948 607997
526 -3515607 -1696984 -2681261 -1198962 -49728 -7031488 2622997 2067524 3059519 614660
516 2596416 -5194285 584461 -1097649 1020720 -2819971 3490501 -3706657 -4277639 -732887
506 4133211 508760 2188598 81598 257725 2082931 -3349189 359090 1158270 -416551
496 -1390006 -722696 3073825 -1124345 -702559 3625546 -2891251 37735 -1968573 801319
486 -3191567 955879 805609 5768365 -4706988 86104 1071431 -4527662 6585717 -4186857
476 7089723 -243404 -412668 -924866 1954203 3199948 -3297907 1028160 2913879 1122284
466 -219254 5044771 -2492366 1881475 -207893 -150097 -2669393 1025528 -1009884 -478667
456 -96595 1940722 1447954 -2363037 -1583616 4180846 -2323106 1748887 1642466 6435128
447 6435128 -869782 -1983492 -5756059 2187627 1958221 298004 -4980016 -3174547 3957253
437 3658027 -1107327 -895618 1963406 -3038802 2514087 -749022 538588 -3247957 381025
427 -1910494 969100 3751124 -3216391 -5158855 1928675 2852503 2198175 -969190 -1704368
418 -1704368 -868207 1564732 2970639 -1009135 2878887 -5615097 165125 154903 -1222308
408 2073351 1439823 -558202 1815977 2578971 -2769994 4344505 -2462807 -1148658 -1523672
399 -1523672 428933 4746047 -165129 -1646165 338242 2109878 -2927710 1253703 4040716
390 4040716 -1705147 -1410591 247471 2337265 -3808655 3634526 -1503267 -589444 -3457098
381 -3457098 -2862601 -58075 -1151950 2505067 2554761 1223956 -4703342 4271262 1921132
371 3178072 2777288 -4885545 2921642 -2097405 738504 -2936360 -1904164 -1584432 3994862
361 -738812 2317816 -1002238 -4743567 -1896774 20861 1551437 7036312 1618622 39091
351 -1530602 1846182 -3461292 818859 -9078635 1658629 -379526 4111815 -5150174 5141532
341 -3582402 2299664 285418 -3183080 -1135357 -661629 -1759737 3384789 1922294 -2352855
331 2640720 -385737 -4078477 869618 -4757442 6163202 -2618340 4377621 -2208931 59197
321 -777015 1348662 1427951 -1196222 -74149 -3755937 -2346351 2439303 -358016 -1146041
312 -1146041 -574130 5303779 -3492810 -611214 -5543615 6133372 -4070352 5465972 2345553
302 -1024471 -1149432 -3956336 -214066 -298322 1164276 -6011438 341878 -878531 -760922
293 -760922 29613 3066306 -3095036 -6027416 -4298299 367684 2504179 -2052875 4814182
283 -1398411 241235 -1296873 3972576 258882 445475 1319263 -1651562 -552662 6850456
273 -7417946 3438228 516726 -2313133 -1466962 817720 1360595 -1161282 -2391346 -1368679
264 -1368679 -916184 3161069 -1367890 2950312 22636 622111 -3294259 3122390 1581464
255 1581464 -1438253 -3251110 2673965 4616231 -2962746 1962899 -3390647 -1028061
246 2689869 -6817654 7109993 -2628136 277722 2401115 7983420 766672 -4232895 -257175
236 2190437 -2088455 -1085022 576313 -4070904 -2960022 1499828 -2429181 2528102 3590535
227 3590535 1764397 -2065385 -959396 -4273207 217600 -1453579 3889043 52914 -1379633
217 1025393 -1543532 -3056259 48365 179169 4915138 1460390 1606137 -697427 3550459
207 -784878 -1665216 -2346066 5245796 -1345503 2655227 -548488 -812870 1288980 983632
198 983632 1931591 530565 -4664255 1099930 266406 806946 -4966172 -18111344 -55740740
189 -55740740 12423208 21039042 51290002 44989470 39785749 -16439007 -25453779 -51676998
181 -51676998 -35725359 15186423 -1664385 300049 422946 1758790 -472818 3774535
172 3025977 3063302 1946242 1183883 -965343 -2372899 82853 -9934959 1388985 1965503
163 1965503 2594707 -2166 -1950552 912329 388109 -420496 -1421655 -2754279 3572413
153 2222552 -2622812 -1811686 -4427473 -1820693 554191 4360278 -3387817 4126581 -305192
143 1734957 2996741 -970451 -458729 1882773 -4456111 -477406 -1692666 4182047 -2541792
133 -1172189 -403202 2613371 326222 5271486 -445536 1638192 -5539948 3351174 1949180
124 1949180 -1959286 6532432 593345 -3647189 -626057 -2688671 1500829 385886 -1249640
114 -23785 3597498 -1120400 -318679 1079770 2553029 -3871165 -1788961 827105 3431579
105 3431579 -5690438 -1683654 -3427265 2253377 689807 -5854971 -459506 2133355 2901818
96 2901818 -4733105 2128723 -1521805 2210333 547422 3456304 -1676192 3125988 -2057146
86 -6837025 559725 1819352 567320 453321 2549380 -706202 256491 3420378 2376439
77 2376439 3909004 -3031696 1176766 -3088456 1690688 1982194 -2551579 865783 2365912
68 2365912 -3443486 -85518 2902894 -944424 -3938423 1640545 -1604628 -938774 -6009795
59 -6009795 -1029450 -146002 2524935 -5911940 519114 -1570964 -268908 -3249479 1381392
49 1862909 -2779505 1744145 -1157188 -2637459 1412051 -416970 1358937 985000 798099
40 798099 40030 -2105647 2130818 2312502 -1741080 -550810 110574 -758015 -2258282 1029351
29 -476817 3125728 -244235 -4313726 -704166 -189696 1012836 3105482 -1474708 -2086721
20 -2086721 -720325 2753633 -2880523 -605781 2110953 -1854753 -1279365 -1371792 2101080
10 -3485032 -677231 6773367 -2577340 1967976 -1181120 4836947 -3283730 -403535 -2071290
1 -2071290 -256782
##PAGE= F1=5771.368218954
##FIRST=     21204.543296753, 2686.85945900537, 556711
##DATA TABLE= (F2++(Y..Y)), PROFILE
2047 556711 -1080242 1117761 1529266 -453508 409503 4850219 1597442 52371 -2632882
2037 542576 -768366 88688 1412979 150047 -898772 -1414300 -919734 335087 -117106 2327493
2026 -1412849 -2590379 3155610 2455430 1377895 3585053 -3699050 556641 -2077964 -3581080
2017 -3581080 2238368 2821128 -2580114 -81971 3366627 3707121 4918645 -2709193 -5595537
2008 -5595537 -3624640 -385462 3121997 -3886955 -200259 -1242679 -3010498 1296856 -3272143
1998 -123932 -1727852 -1105568 136349 -288234 3586630 2237995 1913413 -2033404 2802056
1988 -5001232 1899328 1447177 1284617 -648480 -2062027 470658 -1621494 -1642930 -457298
1978 -161066 1029139 2311169 -307548 -1997992 1320125 -1056083 -2829190 2108435 -2753509
1968 248748 4285709 -4464783 3536151 741536 1437867 1265467 333645 -6080019 1519690
1958 170421 453732 1317176 -2386780 -1637327 2720026 380282 6857 662465 -2766683 -3735125
1948 -3735125 3459707 -5557244 -569385 -1156153 665169 -3853553 -774392 -5303992 -924563
1938 2001729 -633483 -4548561 -333720 -2254402 -2593106 2154533 -827294 -2954063 -346335
1928 4835069 2779230 536933 457492 -973333 5220038 -2152192 -3754646 -369259 782238
1918 94872 3280709 -4364700 -1034325 -1739418 4500762 -1355613 -1651992 1441354 2568485
1909 2568485 -2590712 1698925 -2915368 3762872 2823231 272087 -3150426 -2881847 7525569
1899 2236657 -1299558 -1048196 2717485 -3240921 4407601 201189 1903389 -2765524 5365563
1889 4639697 -387541 709319 -2775982 2040948 -226752 4658033 913481 -4865340 1014669
1879 -855483 4582355 -98436 -412195 -969402 1647866 6793261 -721472 -935553 -1097386
1870 -1097386 1548005 -3545328 -883820 -398600 533822 3194809 -3321954 2368809 -1083844
1860 -972051 2010543 -336729 181841 5118751 -1731475 1723124 -1433930 -1352409 -1925675
1851 -1925675 -1999404 3343310 105787 243093 -775205 1331192 -1813473 -2459470 -775136
1841 3940766 2413067 843316 -2778193 -1003246 -359459 -201568 -119703 1545557 -2976611
1831 -3353762 -301909 -1151834 1010310 -2932673 -2742622 3164387 -112609 -576675 -4159490
1822 -4159490 -3006407 2132893 -513461 -7901653 -507673 25202 4086488 -2745953 -503632
1812 -5464297 5059705 3409142 1368504 -4266500 -1224560 -75268 3618701 1591361 314655
1802 -4501724 916097 -1637355 42080 -1445427 5363176 2097476 -4439915 -1569274 -2317112
1793 -2317112 1289578 -4430067 -2181219 138914 -777658 -2008446 8116521 -3874315 -2496568
1784 -2496568 -1836692 -2593345 2432454 1427587 -4903214 1379157 1304472 10433530 -2137003
1774 -5021057 2507358 1393194 2157546 -1405081 1452391 1427473 813766 3005580 -1380780
1764 -4698326 -225678 2125069 1124818 518298 -3631136 3403484 1160312 2679582 1300203
1754 -1100505 -902854 -1006093 1044948 -805113 -2890164 2046100 -1629298 1580754 -854772
1744 223781 -5045011 -2955382 1247719 2032162 -328787 1111678 3986099 1059620 -1374481
1734 -949630 391444 147966 1217554 984291 2787568 -3997390 859640 -1419569 879998
1724 -643055 -3095917 -3631810 5582982 3846220 -517531 1586655 2230859 281241 -4219556
1714 1127297 2154042 4937633 -1969092 2478453 -2055821 -1664633 -4416518 -251768 3268551
1704 973949 -8618329 542031 1313626 1981813 -2308642 1162386 2041296 -3300655 -5654267
1695 -5654267 -1528573 2465392 1329116 -2303593 -1429441 -227535 -504211 867034 4580327
1686 4580327 874432 483893 -1212120 -2097528 3167402 1857888 -591433 349150 3646841
1677 3646841 266057 4755053 -2722190 676061 1152839 -113444 -290481 -4930194 349499
1667 710203 1884069 -810310 -2103541 -737795 3741450 3164035 -6045631 -370222 -1949494
1658 -1949494 4491860 -895924 3020714 -2395726 -895726 2429097 24533 1458415 2104552
1649 2104552 1310346 -1534462 893247 2111290 -709424 -762212 -2063271 -2984025 -1730439
1640 -1730439 5407243 -827792 -442939 1993238 3472850 -5290156 -1771540 5208316 -1672747
1630 982621 1169981 -1103046 3000432 295209 -1800133 -1338694 -3525469 245977 -2402832
1620 -653437 -4424723 125606 5203428 -574601 -1150836 2039327 -2762837 2634217 237593
1610 -912122 4016553 1103559 -1665116 -3473310 4004800 2318041 -2518054 -1132383
1601 -4130460 1649402 -1895098 -153410 -1980266 2709098 -925694 1095172 140700 2221551
1592 2221551 -1096629 -835219 718894 3624472 3096393 1526327 1241912 286233 -2516907
1582 -1312937 2726352 513406 -3358260 64788 2824890 -2562450 72856 1782562 536789
1572 -9287671 5144339 577920 3070741 -442707 37103 1043296 2426764 398326 3572273
1563 3572273 -2719425 282174 2927273 2929552 -4611700 -3047281 3453203 -1299237 5299469
1553 -3984893 -2296357 -708391 -1848411 -1112710 -2070356 1451359 -4099766 222060 5483431
1544 5483431 412205 -1495278 6201295 2949911 202307 -2000186 5475222 2245131 -4412260
1534 -3115280 981735 1084296 -2398983 -1799677 5621472 2540569 1758663 727060 1480304
1525 1480304 1315516 -3737658 4240789 442365 -2099604 4702527 -846118 1135754 140473
1515 -1308723 -2924852 2164247 1009293 925714 -2146478 -1193685 -1870675 3688524 -141995
1505 -2295739 1104528 2537891 269760 -2213903 -1234684 2836959 -1445608 -694706 1653243
1495 538784 -276453 -817500 420093 -1941030 1408075 -637806 -4159168 2864637 2238638
1486 2238638 2767532 -342553 2049745 2434399 -1047320 -2983596 3578296 -371165 403233
1476 -523619 -3497224 837999 1566578 -2714838 -2523567 1147054 -958711 1378949 -1834862
1466 4627558 370968 408482 332692 1650384 -1136237 -2309535 3497427 51245 -3761655
1456 607962 2514809 -3311734 428603 -708882 -2067795 28431 2418167 -6038967 306037
1446 -19048 -2773418 -936325 -78442 2081625 1000896 1084215 -2573169 -2138147 616536 -2517170
1435 -1524760 4735954 -5974071 1554239 -34432 2902622 -854149 1301186 -6564956 -1001217
1425 2191629 -3144548 6081231 -4071283 150318 2090449 -4730544 5180499 1028620
1416 3024384 1351934 1273874 5866 908051 3140883 -421945 -116627 -4931357 -4198593 3649465
1405 -7237262 3197921 3236239 -1005272 -502563 1322568 1408776 1599279 -2151885 151130
1395 -2069941 392526 -1112159 -400951 962690 -412092 70174 1053861 -1454879 3177527
1385 1486305 -2375315 -1265095 235046 2092303 -1295884 1332027 -4900602 1222436
1376 6829289 -1121483 5473239 461750 62154 -2493885 2540911 -116889 655865 2901815
1367 2901815 2611414 -3461513 4554865 -1907714 -852086 -968778 -2764830 -1702345 1636418
1357 666191 1013734 -3027400 148833 1018574 2799156 -8046577 1201600 2560070 1825342
1348 1825342 -9569981 5104592 -4948777 -3894550 4942518 -1298563 314994 3333789
1340 3333789 2257878 -5610114 -6215931 3286741 -1354245 -1539279 -516521 -3812 -1095106
1331 -1095106 3630121 -975334 -1818926 3756315 -520907 1751197 -5977400 -3073822 -888921
1321 2122658 -1234623 189150 -4184371 -5132046 1169327 1883484 -1994970 1298253 -746883
1311 357457 405110 -3395071 3059707 1441058 980453 279764 -2384377 -3971815 513385
1301 -4118120 -2232526 1311195 -1051725 -1864577 4485150 5739914 -2235960 1038277
1292 -1547229 -758838 -3597876 -3190611 -2288219 7850160 -1651513 2194076 -576385 -3384568
1283 -3384568 1157775 394500 1029109 5236599 -4913616 404256 1383197 -4991220 -5278794
1274 -5278794 2211065 -242465 590301 3694702 -2627760 3499292 -3542080 -647451 1299951
1264 -2489021 -2786501 1225534 -5601244 593572 -3007105 883000 -2462563 102691 -981331
1254 770719 -1258987 4230549 -2317774 -580292 2328231 60976 -490365 2112680 3486545
1245 3486545 -4846861 -513057 4132611 941373 -3306212 1677165 3276765 -3723866 432004
1235 -584012 -3759910 4993031 -1964617 2649603 -1578827 2051968 1185164 4410994 6844736
1226 6844736 -2636088 -4198696 39551 -1028128 -3619860 2605033 -74643 1416184 4063868
1217 4063868 -322908 -1109002 -3417157 -3368347 3564407 1403207 2278281 1875879 -2727601
1207 -1105066 4711298 -2683506 -3544691 -725538 718093 3565412 -2403260 2401640 -5048825
1197 595281 86402 4634327 -4370048 -1220636 174691 -3293780 3373338 -5452895 3867622
1187 -352223 3829660 649917 -1727004 -408433 -1401057 -2140882 2734400 -2760801 1243913
1177 -6428084 -2822469 -1319242 2736971 -337761 -3494490 -2222632 -646402 -2049062 2584689
1167 -1089513 -531939 5184278 -2777080 811846 3442444 3651567 -48877 -2307653 2502986
1157 742071 124021 -652551 -1728498 -281467 692450 -4988667 3073798 528937 -27866
1147 4628929 -5387334 98373 1490377 -2850867 3197670 3182455 -2274542 193030 -197158
1137 -10417982 768548 1470994 -4482367 5199633 3288872 -1556144 -1430529 3025647 -1885100
1127 5093731 -5520359 -3560002 585762 2601629 -2275703 1083279 -2098325 1523038
1118 1452028 474492 -635815 -3095411 -401059 -7236916 3251101 1645932 -2946723 133729
1108 -1594965 7210161 -814634 -2679516 6658505 -1081083 -1126739 -1324261 1264568 570617
1098 1315410 -1103646 729947 984393 -986567 -1942414 3804035 1759429 1621092 -2730918
1088 -2276232 -2185965 -2321378 -456860 -4852536 4554681 -2211844 -998782 -2378377 3344811
1078 1391441 -1695173 2538574 -7082114 1883465 2720988 -1442092 1794170 -3018510
1069 -876832 3790202 377453 -1492751 -331650 -5484735 -2161065 3847885 -732706 446978
1059 -3057500 1395650 -1453753 4351416 4242851 -1213081 -2069956 1259468 -2709000 -1830387
1050 -1830387 4675829 -2772797 719397 -97309 705174 2885251 -2948586 -3776990 1802849
1040 1043572 3399551 -125427 -851814 2850162 895647 -1223948 725337 754618 -101350
1030 -3279705 2436664 -550580 -4391969 1884353 -1359125 -353248 8315409 -2278098 -163995
1020 -8537779 3547903 3184027 -3935094 1292399 2490872 -4922754 936506 -423358 -4511521
1011 -4511521 1205383 3977849 503320 -410069 3459586 153175 2694626 -1112316 -886192
1002 -886192 -1231290 -368786 -2205859 -489099 2224517 -662168 -1430526 1587851 3928494
993 3928494 1989113 -1491423 -2122221 -2034496 3116860 -3039147 3664661 -2912606 -1041991
983 179962 -2017590 -4199953 -2101516 3884634 1579982 -4188631 223981 -1206715 -781678
974 -781678 139310 3122317 3842229 -1759918 7219063 -3850903 3999950 373433 1354054
965 1354054 1376534 2612538 1513373 -3646178 -2187068 1060626 5572601 2233625 3057659
956 3057659 1855389 -2658698 1143698 3338079 -1672313 3253333 1716494 -5197847
947 1983661 1733403 -521982 -5377835 141692 2496951 -3465960 5130377 -1192274 2575379
937 2083850 -1954688 1998217 -1637488 3350707 -1114589 -643686 5044657 97503 -449392
927 -3972592 -3531347 3811115 1739591 2745778 -124444 3051500 17568 -8784052 182350
917 -167077 1484370 4650118 1204105 -1304901 -1750815 1214591 -281820 -385325 -2064954
908 -2064954 197068 -351276 2188363 -3053271 1981111 -756309 2244982 -6793947 6167960
898 -148304 -800885 -4063821 4166430 -3854564 5795467 -2999768 420195 168151 -2131597
888 -3070027 -560837 1215346 -32031 -9386 1554807 -3032236 5708188 -1850624 1617047
878 156809 1332338 895107 3271924 -3544374 244518 2070443 -456145 3463105 -8738574
868 3403396 -1935387 2495354 -2079575 562420 -1352723 2851608 -2228922 2119084 6139434
859 6139434 -7588636 -3965208 -123649 -2012869 -4078666 2655347 -686524 1296234 -2174304
849 204470 -2311276 3703208 355588 -6116798 554745 -2277041 4652722 -6527205 3769063
839 906658 -1283281 3864814 -2009268 3941478 480744 -1349115 -3296081 2907146 355918
829 -1266296 -2011972 -4859135 2273500 -1210486 1007711 -2563268 49437 5448384 2407047
819 4204540 2087182 -4952120 1770510 -2571502 2508888 -3561515 3345011 5983947
811 5983947 -4806568 -607215 2547840 792710 -2046159 5884248 -644946 -518865 -1813716
802 -1813716 -1270716 48793 -1355046 1398424 1670128 1057877 2820158 -230550 1195754
792 -2012780 846975 379657 -1466211 -4988227 2327953 861206 -1924182 -1171400 -738720
783 -738720 -206521 1376550 -4066739 3401343 -1036467 -702744 -1970290 -2932527 1106004
773 -298460 -3531168 2737213 -1241535 -3375889 -1112688 439227 4709010 -1946540 -566266
763 1115162 2149963 330937 796874 1148611 -2003021 2030402 -3268219 284693 -203389
753 1500350 -3119470 3790982 1909713 -5231253 -842962 -4411678 -1104396 26571 304466
744 304466 6373974 2361424 -1752812 1303282 2662729 1248618 -77033 2438786 -4555390
734 2812722 -5001725 4381512 -83177 2892326 -2679439 3872041 -1258312 -1280692 1279668
724 -1854144 -2304170 2363146 877434 4970994 -5817168 -3938897 -808994 2465322 804548
714 -1792520 -17720235 -9780811 -9131717 -1396113 21823175 22678320 -3210264 8893286
705 2835070 -6349192 -11283300 -22226250 -12042042 -11443454 -14254383 16375389 25556960
697 25556960 16560323 15876740 10510002 -18724697 -6083174 -2337819 -177697 628738 -1546361
687 -3346250 -395332 1300466 5185136 -838308 992602 -2774512 -284779 -1790461 2630609
677 -613440 -301804 2567796 6012396 16807608 -7442086 -12088963 -17144189 -15204574 -767706
667 -12635186 -2660467 8823021 17985500 22136696 8286830 -4351210 -7200917 -8483936
659 -8483936 -6553006 -333673 -13910619 -13605233 1811146 1454337 16294552 4393503 -1068563
649 3843379 3203259 -1818195 -2163196 -137869 -2263018 109157 -1819829 -2373695 -136170
639 7085105 -4210291 2973879 383692 647370 865821 -640380 4183726 -1248605 1159899
629 -278596 2907479 2183795 -1248836 4815311 3943731 3762102 6484718 20490516 34120280
620 34120280 -65039412 -181818498 -49090123 112887943 63013454 7567490 6097964
613 6097964 6004939 1678451 8223720 199344 1782270 884763 387315 -2585813 -907702
603 -848482 -3415344 5577521 2040513 -3343391 1298690 514389 2876657 -1071873 -422688
593 906515 3275761 -661702 4234310 -7269986 1718512 -299479 177726 4184168 -3276173
583 3017703 1328552 2741120 -3009724 1641077 -1591078 -685403 6018472 -670356 -2924139
574 -2924139 -7409142 5573974 398772 1068021 982195 -192969 1523192 1522551 -1437584 -769466
564 -769466 1171486 583857 1101972 131610 -1573028 778443 3835563 836840 -4407398
554 2537251 -2540718 1456455 -1094613 1171840 -2243969 5902040 -1921532 -1263120 -283144
544 -533652 -655750 688245 2198807 -1484518 240953 976655 -4529580 2836053 -3868241
534 -2801682 -781862 -1264053 -933895 1888119 -220965 -1007598 792861 -3627239 -2620503
525 -2620503 -2040897 -1166621 140621 -6792699 3743657 1411949 2902768 1058550 1990949
516 1990949 -4852606 1406334 -222205 -598589 -1979170 3387501 -3722930 -4329234 -1013659
506 3923526 1173919 2316807 -261193 -366280 2065268 -3649408 354918 950418 -227518
496 -877121 -893158 2877166 -1749974 -351793 3484878 -2604446 -43536 -2412014 830332
486 -2666555 1072446 1283582 6102947 -6104773 565195 -312802 -4265170 6675428 -4410431
476 7342443 -935625 32629 -1303208 1869066 3360539 -2899149 -350216 3427643 789571
466 -448895 5375823 -2723499 1689113 -430430 128736 -1669222 1018847 -1584657 -860783
457 -860783 -198784 2836987 1716687 -2964039 -1550496 4041330 -2187032 1979536 306064
447 6277456 -704720 -1381401 -6534929 2132085 1521641 222468 -4531039 -3077169 3785610
437 4510031 -921873 -730929 1870111 -3340824 2434117 118172 42771 -3134978 1671474
427 -2101364 1129991 4115638 -3310246 -4167853 1594332 2717664 2160458 -1267325 -969799
418 -969799 -1228336 2007010 2140165 -1916942 2504859 -5214587 195187 -243531 -781669
409 -781669 1658409 1970852 -714003 1243695 2444373 -2015381 4572834 -2419114 -2252935
400 -2252935 -809871 440165 4363202 421348 -2015083 485974 2112391 -3292089 1128663
390 4093057 -1759133 -1846937 -1001549 1665118 -3162850 3535979 -1668328 -1007776 -3370920
381 -3370920 -3131882 20172 -1943052 2573990 2837897 492808 -4097489 4066351 1511473
371 2470322 2479839 -5286908 2789386 -1002868 907432 -2561837 -2130113 -1879375 4029380
361 -1350861 2779491 -744134 -4809887 -2270863 322761 1255008 6706881 1479448 -162217
351 -1352992 1896944 -2994223 648817 -9100923 1466428 -67208 3992216 -5245304 5567522
341 -3027889 1624379 -300601 -3330342 -1347766 -37736 -2341103 3216587 1753504 -1958968
331 2190221 227 -3870139 409700 -5605964 6144128 -2978019 4620630 -2197807 822455
321 -589197 1190605 1103704 -1142746 -411139 -3363706 -2782349 2210897 -593486 -900510
312 -900510 -776724 3886577 -3211827 -28213 -6047255 5979701 -3994637 5359235 2383288
302 -908249 -702294 -4282543 -580883 114450 465148 -5461718 532402 -1741185 549514
292 -68951 2074792 -2599366 -5553904 -4109324 11847 3728484 -2121128 4281986 -1461886
282 358898 -1124678 3427540 199640 547004 1438601 -2234451 -171500 6873674 -7338966
272 2728647 579146 -2376221 -1814492 1092368 943532 -1189041 -2675218 -1133262 -1720968
263 -1720968 3131647 -755831 3499574 -36792 845708 -2943600 3454854 984251 -1945852
253 -3308783 3181550 4109239 -2345852 1750400 -3371976 -1729553 3281594 -6707715 7558170
243 -2545075 854906 2261293 9044709 702094 -4877663 -887600 2280525 -3084540 -1610989
234 -1610989 1075970 -4950814 -3140721 1095673 -2591362 1732189 3992053 1644811
225 -2121611 -1133638 -4096616 216310 -1333711 4241279 -140263 -740555 453541 -2108537
215 -2698785 -64302 538764 5170725 1838351 1444074 -666078 3054173 -1024537 -1270396
206 -1270396 -2238844 5313618 -2461169 3467014 -985578 -841494 1066687 865348 1956724
197 1956724 272956 -4081509 1928928 126454 602657 -8088527 -28055430 -92124577 20463630
187 38922654 87505583 71371725 64955233 -20766641 -43438762 -80880571 -56961416
180 -56961416 24436321 -600439 1057065 1123144 1851967 -344914 4726855 2619464 3482287
171 3482287 2220876 958154 -762607 -2232055 253827 -9352043 392419 2189773 4521011
162 4521011 -952899 -1025261 1276460 511475 -1036955 -1515199 -2742396 2491635 2736286
153 2736286 -2212333 -1951056 -4181837 -1923694 -509167 4185542 -3733977 4784636 -883825
143 2806940 2708045 -1033794 -182000 1317414 -4707955 -1711620 -141329 3633283 -2464317
133 -1617771 252821 3056953 177053 4474002 -272905 901766 -6395168 3006271 2135117
124 2135117 -2373939 6011745 943232 -4782944 -675931 -2371277 1437359 260008 -1208705
114 384333 3222407 -1211573 240845 953643 2843445 -3706482 -1523562 565594 3690000
105 3690000 -4609925 -1845010 -4751943 2674739 910164 -5567195 -798688 2653664 3457015
96 3457015 -4530417 1626522 -1062569 2181860 -207100 3263073 -1615659 3543449 -2058049
86 -6847227 195233 1740130 415570 63168 1455650 -192279 704717 3720265 2902904 4051588
76 4051588 -3258872 1512411 -3388993 2147736 1840257 -3051092 1203686 2837287 -2895842
66 -355552 3118422 -822054 -4036920 1785339 -1762408 -1637346 -5785741 -1054976 142402
56 2669167 -6643723 467305 -1876080 -131960 -2581478 1836625 536627 -2652800 1528088
46 -1446546 -2009049 537532 -208943 923907 338463 261211 -503166 -1653672 2360729 2461309
36 2461309 -1301790 -839102 -445477 -487591 -2092002 925876 -695445 2624992 -184237 -3752782
26 -3752782 -1353808 -278534 1295189 2733284 -672194 -1951797 -730242 2947996 -2991321
16 -978697 1775318 -1546897 -1221528 -1355779 2348552 -3289792 -445497 6272224 -1599454
6 1022383 -380364 3772888 -2991368 -757800 -1679582 -590698
##PAGE= F1=5749.56994907
##FIRST=     21204.543296753, 2686.85945900537, 1161460
##DATA TABLE= (F2++(Y..Y)), PROFILE
2047 1161460 -535738 1017469 1838355 -697538 647837 5157775 1472042 513204 -2863888
2037 617805 -71031 363940 923241 994 -489768 -1403302 -787156 270887 -155827 2488000
2026 -767655 -2890909 2615049 2608095 1577772 4000630 -3863083 1159950 -2391629 -2657788
2017 -2657788 2759174 2980263 -2716774 49488 3641934 3957796 4051590 -1962347 -4697624
2008 -4697624 -3581675 -20810 3964124 -3542479 119470 -1402511 -2707176 1494826 -3892130
1998 125565 -2044576 -1112036 -1005198 2169882 3364772 2277489 2255505 -2381952 3139160
1988 -4760505 2062058 2673588 1709132 -699867 -2202530 -569852 -1037733 -1793887 475813
1978 630557 823935 2026771 -270678 -1347328 1147554 -1070910 -2588533 2896492 -2514069
1968 -312481 5401318 -4808084 3077889 1477201 1313793 1671970 302893 -4820404 991077
1958 112409 646755 2085666 -2553400 -1155885 3124681 484235 302466 1245422 -3179909
1948 -3079278 3017424 -5586832 -505735 -1544082 852172 -1686624 -469897 -5065208 -1523605
1938 1518442 -1514027 -4319003 -470067 -2438965 -2888724 2342437 -1693484 -2349585 -151236
1928 5241680 2442663 330248 997142 -993535 4726311 -2773223 -3149949 -710498 1761159
1918 -969684 4291605 -4837137 -933562 -2140466 4800450 -1272935 -2214942 811514 2830158
1909 2830158 -2426328 1622372 -2968577 5337896 2675177 486053 -2529561 -3077821 6275954
1899 2654810 -1879897 -401939 2489066 -3403549 5320427 -185074 2164431 -1922781 4857699
1889 4852290 223892 639544 -3357845 2098343 -232447 4371230 1047921 -4001528 797225
1879 -80744 4222753 31246 -736517 -1034704 2528174 6826942 -649551 -900702 -1454628 1909255
1868 -2967191 -635538 -1056966 723817 2806136 -2656674 1784434 -1122056 -612725 1929199
1858 190212 -26535 5654353 -1411130 803013 -849043 -1523826 -1961030 -2096220 1749961
1848 329503 1045860 -1521866 1927314 -2328579 -3193127 -410079 2971929 2281340 216233
1838 -2541808 -1359538 18641 359287 -316637 1465206 -2823998 -3056636 452720 -2463846
1828 879941 -2771847 -2974754 2307876 -216942 691258 -4165706 -3140312 1169270 -813940
1818 -7773235 72076 -14549 3567302 -3223203 -190573 -5658821 5138760 3002952 1536707
1809 1536707 -4490787 -836890 -698644 4148556 1452784 -451780 -4253602 569811 -1399334
1799 602248 -1342273 5094094 2151643 -3975377 -1951981 -2164500 1312925 -4346377 -1770067
1789 530350 -819897 -1915970 8381407 -4758293 -2062270 -2354970 -1993740 2784316 1803374
1780 1803374 -5147960 1333702 668748 9983890 -2223551 -5454856 2037138 2358178 2414929
1771 2414929 -1496220 1855000 2205428 398134 3416504 -1723048 -4104465 -1106182 2265737
1761 1699416 554999 -2895841 3437552 1239799 3122234 1677514 -1276754 -96446 -1048139
1752 -1048139 1535048 -1533799 -3006790 1584574 -1674859 1296878 -451799 296357 -5408985
1742 -2317611 1726651 1470708 -254386 357367 4094615 459734 -1408600 -1043850 87555
1732 1205036 1335662 416971 3598484 -3230605 465586 -1183894 1767359 -298369 -3563802
1723 -3563802 -3410852 3508913 4620654 -750986 1656894 1629082 1020722 -5625350 724761
1713 1764547 5603684 -2646180 2370452 -1538217 -1599299 -4852626 -322341 3473893 1801662
1704 1801662 -8313332 222261 848859 2339978 -2258721 984343 2393998 -3512517 -5344325
1695 -5344325 -946801 2768308 643238 -2221851 -1498652 177061 -466220 828561 4162897
1686 4162897 304596 248734 -648139 -2565870 2388944 2349884 -39172 -250135 4630397 303074
1675 4407175 -2326456 -162868 1024976 -1580921 -84841 -4970253 -901733 1534970 2107305
1666 2107305 -1658260 -1971815 -906582 4269076 3274097 -6047073 -338786 -1848474 4439317
1656 -1664539 3996821 -2550589 -908575 2686855 836522 1031370 2675628 1492926 -505672
1646 651910 755419 -573598 -728239 -1743325 -3068254 -2202043 5846879 -956861 -50032
1636 2157675 3100347 -4856688 -2398414 5353382 -1106466 1189424 1025951 -909461 2642836
1626 -320062 -793391 -1079748 -2747295 551552 -2544361 -513555 -4421117 -379685 4980891
1616 -572080 -1096484 1967813 -2873898 2113209 267146 -1283251 2589054 2321668 -1399321
1606 -3936171 4309075 1981816 -2679226 -1026630 -3124402 1135953 -2136593 176366
1597 -2434835 3053704 -1284380 2118771 379688 1188023 -1531623 -1094180 203408 3797952
1588 3797952 3691745 1675717 1127375 640101 -2350424 -306296 2787470 371919 -3869022
1578 -356693 2740956 -2068443 -441293 1576470 1523227 -8993187 4918333 -205091 3323175
1568 -92079 -104717 1361821 1495332 486595 3632999 -2672349 1066830 3403990 2702492
1559 2702492 -3785780 -3210623 3157263 -939977 4581755 -3949830 -2216478 -405260 -3168581
1550 -3168581 -1328341 -926264 1101432 -4208248 5464 6374923 -1335836 -900290 6933997
1540 2088098 839756 -2135511 5239657 2618337 -4652164 -2432419 735558 664287 -2563934
1530 -1935520 5216930 2303964 1858035 824834 757090 2907009 -3838671 3859089 838916
1520 -1982202 4450302 -428088 831846 -767449 -1892720 -2310122 754757 919047 1025561
1511 1025561 -2488639 -991125 -1863722 3152800 -388970 -3017174 1479075 3316564 -267962
1501 -1851319 -620511 2473733 -934059 -365860 1657506 -224938 -164369 -2336779 1029853
1491 -1620124 2514772 -956584 -4341329 2760380 1906993 2169186 -267812 2402732 1908260
1482 1908260 -1023626 -2526400 3041061 -168022 239098 -1335363 -2351385 296419 2566548
1473 2566548 -2681445 -2500587 1418971 -1124502 1445284 -1923018 4691926 531899 615980
1464 615980 671842 807552 -1134940 -2261660 3204695 -219924 -3321062 758082 1919140
1455 1919140 -2788286 530952 -822727 -1327665 -367035 1316250 -4199753 110813 -385700
1445 -2709359 -1781880 -23578 2572047 981721 630860 -2529890 -2251126 239799 -2684102
1435 -1397322 4898153 -5740348 1749277 -295179 2654446 -232495 212962 -6875859 -841731
1425 2322167 -3151139 6537952 -5043191 676638 2189773 -3708215 4973147 1217694
1416 2858445 1354647 1495710 -305586 721157 2150172 -309305 406452 -4258060 -4310902
1407 -4310902 3489536 -6497868 2191605 3299395 -1776758 -141103 1433142 1776827 1465442
1398 1465442 -2662321 330918 -2581316 963252 -3318866 90455 1242923 -586146 118133
1388 192472 -534194 3428471 676255 -2578587 -742142 268342 2043026 -1440329 1268306
1378 -4139266 1594701 6079211 -275815 5157596 99481 1201124 -2445201 2876673 -242512
1368 1018582 3401174 2608904 -4211130 5035904 -1751049 -939201 -1544377 -3331093 -807117
1358 1128754 753661 1104576 -3119509 1611537 21523 2514287 -7374309 1470084 1582958
1349 1582958 1558223 -8299460 5449774 -4652840 -3757818 5415763 -1858482 478286 3276348
1340 3276348 2157184 -6120559 -4978131 2232039 -416912 -1879127 42170 -7581 -985495
1331 -985495 2855632 -953157 -1966290 3445099 49576 2445195 -6324254 -589719 -1196906
1322 -1196906 2006958 -1553740 -249442 -4230362 -5141803 1071761 2042700 -1741344 1100022
1312 -1294223 1089501 198142 -3851565 2737990 1847229 462055 580742 -2362697 -3518014
1303 -3518014 -646005 -3979433 -2133560 1618329 720474 -2678719 3657364 5567437 -2595565
1293 207416 -1784950 -650993 -3189319 -4104719 -2211860 7558355 -1138104 1150173 -21696
1283 -3624720 1050644 333697 1166379 6215320 -5540193 647160 1259470 -4362015 -6149451
1274 -6149451 1924354 30184 1056606 4067356 -2527958 3023319 -2979731 -166452 -228849
1265 -228849 -3034532 -2717333 897401 -5916363 377385 -3156029 1245306 -2374123 180491
1255 -778536 531432 -1074547 4450606 -1455187 -1379952 2281249 -1367259 455576 2407857
1246 2407857 2655102 -3404875 -294020 3909764 517690 -2883031 1569823 3439089 -3386970
1236 588774 -535798 -3729105 5330204 -2055282 2705031 -1171817 1496675 1575226 4109924
1227 4109924 6759329 -2613290 -5154486 37160 -1534937 -2588406 2791519 -120762 815241
1217 4286205 -100779 -1452978 -3382185 -2798753 2434812 1506312 2089390 2460782 -3778457
1207 -815714 4700522 -2699132 -3597791 -2478743 1690024 3183913 -2329724 2757245 -4958095
1197 -883688 1431280 4306933 -4434317 -3065421 779736 -2599754 4714395 -4633367 3178865
1187 -1000688 4098981 -30507 -1534844 -767762 -1074761 -2497327 2088125 -1896589 1272904
1177 -6539926 -2017939 -1583946 2945863 -671515 -3514818 -1484252 -308641 -293745 2559450
1167 -983385 -702330 5135437 -3325041 1252089 3231177 3233066 698413 -2175740 2501533
1157 469380 13953 -248577 -2036134 -73436 883606 -5617262 3540985 528153 510745 3690290
1147 3690290 -5659693 820413 1375691 -2783258 3260648 3313641 -2086991 -57216 -28519
1137 -10553716 1624395 1384468 -3007237 4077950 3059570 -1818019 -1439810 2580220
1128 -215810 4212299 -4490876 -3009274 184533 2114817 -2896402 1554818 -2338941 799279
1118 2056094 -382627 -731179 -2939240 -230466 -6655809 3691311 2043979 -2729422 -601020
1108 -1100202 6315985 -928050 -2512862 6550081 -356844 -747466 -1743910 1252041 480030
1098 2130653 -1511618 1051970 760883 854954 -2463480 4272088 2129672 1923174 -2275185
1088 -3320264 -2045596 -1801704 -674784 -4933710 4225539 -1782668 -1648552 -2379381 4065156
1078 751061 -2257881 3259385 -7109285 1588288 2414336 -1304105 1532392 -3344455 -1582777
1068 4440438 84169 -2132390 70506 -4964961 -2906715 3759520 62492 296067 -2504548
1058 1715607 -1332603 4131186 4264388 -816967 -1959532 1708876 -2994959 -965751 4877261
1048 -2150569 409050 -892230 608981 2328848 -2709039 -2730180 1970407 215334 2995286
1039 2995286 7349 -807186 3080371 1116021 -629299 487091 845483 -11306 -3588188 1977707
1028 -769482 -4098653 1842637 -870930 -979106 8700303 -1395855 -402385 -7305917 3264054
1018 2330728 -4566302 601199 3079128 -4742768 414331 -378207 -5135192 1366572 3200768
1009 3200768 1202680 -1010943 3400906 70821 3427426 -1393214 -825555 -1633391 -210252
999 -2108073 -648202 2208711 -862925 -1350707 1469241 4052467 1339364 -597500 -2139668
990 -2139668 -2457324 3657407 -2413310 2910771 -3057699 -539458 -74598 -1701743 -4192018
981 -4192018 -1177479 3393945 1903980 -3844613 880375 -657758 -548120 -257659 3457046
971 3969767 -1691043 6513560 -4549709 3972176 -567816 1593387 1548587 2452500 2149967
962 2149967 -3398920 -1929524 1683472 5385918 2354868 2834097 931697 -2280361 1618920
952 2343121 -581736 2577080 2069324 -5976842 2207517 1716754 -224576 -4543543 379937
942 2519413 -3591117 4953955 -1237548 1880375 2086350 -921591 2143304 -1245088 3741877
932 -1966425 -449791 5485781 93468 -979775 -3700262 -2879469 4534288 1473840 3002656
923 3002656 -705716 2160253 229710 -10084436 287865 236230 1159081 4851738 522984
913 -1124358 -2347163 1126596 -520814 -1573157 -2243801 -178146 -837854 2196948 -3224502
903 2093252 30852 2233355 -6894289 6677036 347079 -1445843 -4298186 4925644 -3635054
893 5793433 -2589323 326032 -300273 -1209137 -1283072 580496 186940 521066 403951 1031816
883 1031816 -2545698 5568754 -2251537 2007995 393937 1196772 1199349 3225741 -3875298
873 -120621 1766365 -92814 4312878 -10041330 4070200 -1485172 1922671 -1981566 780257
863 -1807721 3034202 -1910608 2576037 5579168 -6804542 -3981514 -805680 -2081377 -4077597
854 -4077597 2017854 -99900 1586139 -2965323 652761 -2142867 3229827 605829 -6727845
844 520926 -1227443 3921298 -5990187 3765510 960423 -1256976 3915371 -2125978 3406548
834 363262 -770569 -3948123 3441036 656035 -1556234 -3116262 -4836890 1472510 -515873
824 795856 -2561246 430797 4979550 2601431 3716032 2160509 -4535143 1707128 -2364740
814 3069317 -3778896 3145210 6450415 -4937502 -471304 2540504 506503 -1629983 5195988
804 558169 -373290 -2737578 -800471 -216267 -1623070 1844024 2170981 455258 3291685
795 3291685 -99473 712556 -1456699 815795 -100028 -1352680 -4948425 2485032 1490781
786 1490781 -2247822 -178117 -1195737 -59264 1545134 -4419058 4441217 -1013889 -699690
777 -699690 -2575801 -2827767 618053 -381617 -3511964 2395422 -1353924 -2540514 -1072894
767 141502 4702256 -1440315 -2399465 1547112 1872829 169029 1043638 804942 -3662243
757 2636266 -3481167 833473 -167379 1476140 -3236370 4276326 1964123 -5019109 -1378552
747 -4288368 -1617653 -611126 -99315 6711424 3500522 -1730026 913653 2856668 1453439
738 1453439 290579 2501405 -4999749 3679619 -4437961 3985620 -66075 3415708 -2706662
728 4593452 -1788529 -666247 1216714 -1601282 -3723611 2007732 548825 5564295 -5848432
718 -4527332 -632614 3355417 281585 -2718402 -23025089 -9819595 -11003950 -1028730 32013941
708 30228270 249149 9292505 4243788 -9703518 -15594065 -30697252 -18963472 -18335459
700 -18335459 -17936421 23563490 35555664 20892173 19965487 14009395 -24327742 -7446122
691 -2118542 -905850 1198787 -1829139 -3383680 -512732 1672564 4467224 -392539 1946528
681 -2844814 -342355 -1972621 2668705 -1052145 -333806 3810639 7912633 21745942 -10694688
671 -17538464 -22572165 -21817877 -374895 -18581210 -3022936 12052664 24465119 32420261
663 32420261 9852275 -4966539 -9946976 -9407838 -9847993 -204420 -17630828 -14959651 1653496
653 1913640 20508998 4949606 -1077609 4251685 2875701 -686674 -3001397 -178094 -2691400
644 -2691400 1237197 -1480680 -1863289 -663004 7658734 -4330376 3374742 508187 -66008
634 -186946 -925530 4369760 -1157252 1795414 -786376 2317114 3406822 -1784789 4574053
624 4146861 6001913 11898009 27932295 46642472 -93072949 -262492691 -70983822 159645157
615 91335526 10956635 8786081 7134300 2982822 7655696 376336 2431165 709894
606 1417243 -3195593 -537589 -914194 -2806715 5080895 1949592 -2578973 1280039 -217541
596 2721936 -480068 -684669 1165097 3442202 -1217813 4177210 -7045202 1371566 -1143683
586 490641 4568303 -3486388 2910709 1862490 2445613 -2866498 1431158 -1564014 -795787
577 -795787 5517017 -207083 -2182314 -7347285 3701766 363534 1402788 299832 139687
567 1259212 1421727 -1391534 -1130228 1661803 417725 1120459 -314533 -334510 447926 3251737
557 3251737 1312507 -4087062 2643126 -3157415 1805874 -1228689 1356829 -1855288
548 6593290 -1485858 -1616665 -138986 -570006 -1059651 685926 1828959 -1056428 -333380
538 1128439 -5912279 4309691 -2729999 -2665369 -1568113 -1042225 -811004 2517474 -1386300
528 -572823 996144 -3586557 -3396111 -1363435 -1066087 237780 -6089582 4449885 741141
518 2714926 1559758 1222395 -4388049 2225204 629411 -2104004 -1058250 3096291 -3635576
508 -4222746 -1332288 3805465 1730137 2396799 -460709 -980414 2014202 -3659627 395222
498 478857 -24052 -156532 -1138610 2606044 -2276216 61632 3264879 -2327895 -179498 -2874765
488 -2874765 843564 -2200961 1035519 1815065 6353532 -7390720 1030273 -1629150 -3663268
479 -3663268 6511907 -4456457 7237210 -1461818 484233 -1618999 1697950 3365493 -2468006
469 -1634857 3795152 398925 -619250 5431534 -2832674 1466675 -624205 462402 -632706
459 1154485 -2183715 -1108215 -360890 3630818 1853100 -3274465 -1515280 3782196 -1968173
449 2017348 -1067244 5924924 -450084 -581285 -7184218 2270741 1022927 90612 -3915448
439 -2987922 3631215 5290278 -775002 -531347 1716357 -3406775 2121716 994158 -447832
429 -2999314 2852210 -2188048 1234703 4493670 -3411157 -3057375 1353181 2542159 1976954
420 1976954 -1488511 24987 -1485445 1931596 1340806 -2873630 2105292 -4636199 181722
410 -730481 -251069 1167639 2387582 -805494 449557 2235299 -1253761 4520450 -2196333
400 -3322122 -16889 348711 3671054 1045508 -2331927 628272 2070464 -3555607 927220
390 4027719 -1951021 -2250560 -1980174 771569 -2447441 3184307 -1699841 -1417080 -2979800
381 -2979800 -3059571 136625 -2679191 2441580 3107836 -268273 -3502233 3572117 1214646
371 1473763 1979748 -5476200 2638421 -1845 1090510 -2071655 -2220368 -2155783 3954336
361 -1817243 3061297 -418895 -4661052 -2618727 699701 865680 6198491 1128019 -413355
351 -1022946 1885398 -2467045 518324 -8915974 1300715 357879 3798016 -5228840 5882432
341 -2400526 913544 -792789 -3550619 -1499239 410100 -2989882 3158936 1345970 -1686350
331 1811070 465966 -3616815 799 -6364869 5797134 -3119640 4659939 -2125670 1562426
321 -424949 980151 831491 -981306 -925410 -2744667 -3120500 2123695 -877598 -753252 -919581
311 -919581 2189439 -2982956 585993 -6319568 5361268 -3715546 5123029 2351686 -790251
301 -273471 -4541532 -865183 498845 -434481 -4825356 623247 -2414569 1771174 -243352
291 969263 -1856382 -5021159 -3776194 -282332 4830112 -2076569 3630165 -1557939 646069
281 -936162 2817469 194617 648195 1586651 -2878797 168515 6833377 -6955101 1790191
271 693405 -2227690 -2325654 1559167 619068 -1254432 -2824072 -963516 -2362346 2986681
261 -112715 3860221 -178741 1204007 -2392945 3641628 441909 -2407306 -3247607 3240441
251 3486962 -1478032 1493320 -3158376 -2408390 3771883 -6205890 7865831 -2318493 1197618
241 1931337 9871064 686723 -5250652 -1430209 2336392 -3993733 -2192522 1530790 -5258925
231 -3222952 561267 -2399625 738604 4240284 1510752 -2049200 -1396628 -3628510 296085
221 -1110628 4540422 -239049 -36290 -37526 -2629484 -2214918 96155 734685 5338599 2044117
210 1201066 -579689 2511888 -1180762 -792418 -2042832 5422422 -3450334 4223294 -1316308
200 -751450 657027 685167 1940019 75067 -3348245 2654660 77701 487749 -11401508 -39088325
190 -39088325 -132168159 29714039 58899990 127767304 100594048 92521783 -24692869
182 -63924258 -113502856 -80209393 34276939 1153786 1877198 1967320 1924456 -108557 5622185
172 2189749 3696102 2507592 720652 -441421 -1996793 475781 -8151965 -577255 2264923
162 6290179 -1699093 -267459 1733279 596782 -1445817 -1497033 -2505753 1457578 3230042
153 3230042 -1715299 -1981442 -3822203 -1896308 -1476314 4101405 -4037224 5422415 -1367720
143 3757753 2553085 -1082315 104997 684881 -4609541 -2796536 1656485 3123790 -2300345
133 -1908950 971605 3450493 45819 3655998 -130779 207056 -7010583 2717013 2116029
124 2116029 -2606291 5294034 1362791 -5669789 -624077 -2046623 1593063 226186 -1259689
114 904026 2912129 -1272595 780480 718327 3204555 -3271648 -1209386 215500 3996834
105 3996834 -3278111 -1902051 -5862078 3173190 1158681 -5050830 -1103130 3215862
96 3987677 -3998519 1039109 -457516 2108115 -988702 3073805 -1405349 3978049 -1890474
86 -6639545 -72435 1700888 266103 -159323 397103 335600 1197328 3980803 3481179 3991042
76 3991042 -3122942 1791092 -3556027 2702075 1621417 -3253007 1638974 3295476 -2261283
66 -402476 3267974 -655106 -3823927 1901717 -1588817 -2202566 -5190981 -1030971 525960
56 2931681 -6932487 595280 -1965248 50810 -1745973 2316785 -698454 -2237831 1423640
46 -1639007 -1268252 -325954 152045 500377 -99285 -315369 -743290 -1183203 2758247 2472623
36 2472623 -701675 -1057454 -833897 -173674 -1730789 903174 -795154 2251897 3037 -2985665
25 -1715478 -449634 1658229 2443209 246092 -1722719 -512236 2967477 -2935509 -1039733
15 1423536 -1076028 -1031157 -1014487 2645611 -2928044 -79522 5761241 -209906 66621 485428
5 485428 2891856 -2424344 -920418 -1149343 -786214
0 -786214
##PAGE= F1=5727.771679186
##FIRST=     21204.543296753, 2686.85945900537, 1467162
##DATA TABLE= (F2++(Y..Y)), PROFILE
2047 1467162 -210317 711916 1861971 -1305170 563083 4936632 1085634 661897 -3149964
2037 376894 588496 322934 114153 -342540 -350769 -1468652 -859562 -36954 -444160 2383923
2026 -206954 -3378930 1729131 2515488 1481989 4138414 -4148726 1250577 -2723607 -1870997
2017 -1870997 3083590 2654157 -2943785 -370988 3702880 3918205 2585856 -1436572 -3832731
2008 -3832731 -3608554 161727 4372857 -3161742 106102 -1550933 -2424861 1431038 -4548446
1998 191236 -2484834 -1281265 -2177147 4102226 2850502 2080789 2428220 -2894704 3146811
1988 -4406740 2157993 3556542 2145241 -1023005 -2465441 -1822034 -525555 -1985866 1338957
1978 1213133 455120 1668206 -483587 -948707 728408 -1146191 -2335333 3540471 -2269654
1968 -1091116 6226742 -5178329 2460085 2016692 830560 1855671 246546 -3587526 306745
1958 -177868 785010 2687688 -2713319 -701115 2939555 584573 377844 1449871 -3372931
1948 -2269441 2396266 -5493738 -605504 -1889632 1021095 151114 -465294 -4645293 -2262716
1938 1218956 -2362035 -4071677 -674582 -2591822 -3252028 2250081 -2523668 -1854983 -150086
1928 5418623 1975223 51151 1473252 -1157339 4265569 -3501559 -2573816 -1205890 2651165
1918 -1883420 4836466 -4998656 -916679 -2435326 4811782 -1060092 -2936049 371820 2864266
1909 2864266 -2166851 1447756 -3056493 6654243 2408802 538391 -1719259 -3209790
1901 -3209790 4524972 2955203 -2526761 244189 2144924 -3524094 6003667 -628117 2150427
1891 -1014147 4226135 4667789 755056 441808 -3857071 2071358 -238357 3991005 981144
1881 -3055335 474359 672433 3648654 69103 -1046406 -1210173 3285594 6537532 -625096
1871 -942744 -1703568 2114909 -2335055 -380499 -1648185 684696 2269979 -1937949 1201432
1861 -1216976 -391825 2046430 674348 -538516 5832488 -1064371 -241778 -236275 -1784408
1852 -1784408 -1847597 -2240073 84223 497380 1852561 -2272641 2381567 -2867035 -3907840
1843 -3907840 -154284 1991460 1973097 -436645 -2253057 -1893806 395139 977908 -658449
1833 1310167 -2760672 -2873569 1181044 -3547411 648220 -2575856 -3265441 1550040 -405947
1823 2044876 -3980217 -3326636 214953 -1084315 -7570455 690421 -162534 2962943 -3714382
1813 317645 -5777397 4963476 2580751 1560370 -4443490 -429478 -1431389 4410722 1355422
1803 -1194868 -3838567 149015 -1104862 1035276 -1206392 4602381 2236299 -3554578
1794 -2282278 -1943527 1290576 -4152707 -1311794 802101 -886195 -1706862 8298318 -5543779
1784 -1694619 -2707007 -1384018 3155962 2108117 -5258899 1147073 76003 9008635 -2045227
1774 -6012981 1587961 3210158 2575643 -1493005 2140173 2968541 -30021 3678031 -2076613
1764 -3256448 -1977905 2361188 1921632 611253 -2003464 3278480 1190352 3491075 2072031
1755 2072031 -1383283 481130 -858650 1809383 -2220158 -3089167 1114624 -1488155 935429
1745 -22759 433919 -5759783 -1639123 2065509 867462 -180356 -318163 4043443 -183602
1735 -1348180 -1213604 -242385 2239262 1364152 -86045 4265290 -2378062 104682 -901021
1725 2568591 134011 -3856194 -3172540 959717 5365903 -1050757 1715664 1031848 1614752
1716 1614752 -6871240 618493 1157019 6025991 -3176321 2141610 -1027151 -1358307 -4979500
1707 -4979500 -530586 3565633 2489874 -7809532 -43888 176655 2726398 -2149760 805351
1697 2509185 -3618581 -4811179 -337613 2893305 -81888 -1882435 -1456000 526270 -480946
1687 795892 3111228 -333866 84551 -157264 -2840442 1553369 2894719 463603 -888782
1677 5524192 279357 4087199 -1927987 -982239 791823 -2989540 145824 -4875198 -1786871
1667 2245383 2215781 -2630290 -1565422 -1170460 4582546 3256880 -5666639 -339656 -1608627
1658 -1608627 4322172 -2427203 4698846 -2625765 -935832 2790525 1586763 723383 3043956
1649 3043956 1704346 619556 299229 -443282 -482998 -733663 -1485311 -3250389 -2595671
1640 -2595671 6108708 -1097192 307785 2264362 2564960 -4236994 -2966793 5208063 -506283
1630 1284720 851992 -662151 2263914 -868305 218648 -760295 -2105267 855421 -2548752
1620 -212152 -4450815 -1013294 4550625 -587466 -955715 1697229 -2804238 1508240 314452
1610 -1635892 1129063 3212536 -1215681 -4355543 4431005 1513050 -2692208 -970872
1601 -1903109 451561 -2464100 527249 -2765297 3242798 -1506997 3079306 443073 197355
1591 -1891816 -1353312 -177368 3750408 4182382 1749832 912344 1104882 -2173310 870071
1581 2721199 237392 -4201411 -767770 2558587 -1604852 -925156 1427852 2359366 -8155853
1571 4183861 -885090 3302115 467184 -352879 1750087 250449 561612 3457928 -2452501
1561 1743411 3681716 2321462 -2745641 -3360254 2716577 -522089 3365205 -3801740 -2122354
1552 -2122354 -192006 -4208079 -1371944 -68207 584278 -4014611 -247837 7211809 -2766088
1542 -371746 7026021 1026786 1565117 -2358144 4802291 2819318 -4789527 -1588073 636367
1532 136155 -2670459 -2006390 4615171 1919101 1875141 846802 -110077 4295769 -3714494
1522 3506807 1078816 -1854522 3863691 -52979 603758 -1634096 -2369557 -1630445 -713818
1512 831517 1068627 -2865614 -763985 -1882833 2466414 -687281 -3723435 1950037 3820370
1503 3820370 -785116 -1441120 -46140 2000938 -379738 -12651 1250458 -949437 -42078 -3680756
1493 -3680756 1661260 -1121543 3374790 -1289726 -4495553 2425620 1288429 1352417 -188803
1483 2717848 1355612 -1030773 -2026509 2384468 13206 55786 -2095371 -1176375 -215255
1473 3494017 -2506062 -2406582 1642779 -1298011 1481408 -2211712 4715010 582184 801845
1464 801845 978745 -52202 -1144115 -2168192 2931835 -465063 -2837260 942039 1137026
1455 1137026 -2192480 585850 -984263 -660838 -830954 99884 -2104764 -245506 -905406
1446 -905406 -2615866 -2682226 -374 2872463 924332 141440 -2486056 -2313672 -156638 -2751123
1436 -2751123 -1399988 4808582 -5358886 1933967 -524200 2129879 396080 -868024 -7069712
1427 -7069712 -715142 2407300 -3106240 6739917 -5653166 840175 2329981 -2854770 4585261
1417 1365351 2533868 1188158 1601100 -482114 504523 1161249 -286494 942600 -3359002
1407 -4370733 3213974 -5652851 1104744 3012939 -2310258 136253 1501904 1981511 1224201
1398 1224201 -3142767 372932 -2907092 1610080 -5353033 501987 1419859 -702317 79598
1388 -695535 43974 3613788 -247514 -2724825 -265068 276030 1937261 -1551240 1103279
1378 -3365923 1851234 4934423 322750 4678055 -414167 2375836 -2343457 3029962 -199793
1368 1414426 3618932 2359685 -4744696 5300352 -1524360 -1098056 -2128701 -3526449
1360 -3526449 95294 450162 665661 937214 -3151776 2855947 -1034284 2106232 -6458637
1350 1655261 504468 1267825 -6909950 5546010 -4225446 -3548176 5616433 -2459155 738201
1340 3000153 1884167 -6391622 -3645038 1233229 477083 -2273861 429378 46763 -1032545
1330 1976589 -935627 -2078374 2891740 719222 3221951 -6329972 1696380 -1487964 1626999
1320 -1838785 -706954 -4282688 -5190221 885788 2045352 -1442399 828086 -1830847 1631952
1310 52836 -4318938 2233174 2159626 -106283 778135 -2305269 -3008778 -1790860 -3856258
1301 -3856258 -2006939 1670881 2390834 -3367482 2274012 5181614 -2816307 -791157 -2028979
1292 -2028979 -592589 -2755518 -4843476 -2201721 6955346 -752807 119274 513215 -3684502
1282 828914 136938 1246476 6887628 -5966415 872413 1019087 -3720878 -6943675 1540078
1272 294971 1345858 4275336 -2415046 2336328 -2312254 160880 -1883610 -3437938 -2743670
1263 -2743670 379725 -6109373 153548 -3261782 1443919 -2083103 123450 -634251 391670
1253 -1060245 4563345 -688113 -2402825 2121202 -2492061 1145979 2617711 1690858 -1644858
1243 -127937 3585887 -131956 -2295422 1393980 3327989 -2963623 560782 -583969 -3697349
1234 -3697349 5318058 -2112960 2702349 -778118 1017684 1762797 3773132 6570697 -2581857
1224 -6023395 30316 -2154127 -1459497 2766678 -165651 155024 4293049 -11572 -1913105
1215 -1913105 -3356338 -2110933 1041766 1407419 1642567 2916216 -5019674 -664640 4391669
1205 -2221342 -3641004 -4018454 2425016 2639735 -2223194 3066796 -4706282 -2374587 2900741
1195 3818509 -4393964 -4888379 1366065 -1978251 5768460 -3880765 2259950 -1550106
1186 4066335 -630999 -1422759 -1310222 -762316 -2757918 1312644 -998317 1217959 -6636665
1176 -1235408 -1937899 2986362 -774398 -3613667 -959505 -89965 1108784 2359327 -915576
1166 -908697 4830992 -3490022 1585419 2649277 2663399 1405991 -2071922 2475097 46790
1156 -158295 -21940 -2295184 106736 1024619 -6118641 3769919 600309 1009953 2545864
1147 2545864 -5776560 1547439 1303757 -2789062 3281931 3116879 -1946399 -353923 47542
1137 -10001811 2441313 1153949 -1554502 2809716 2511065 -1972131 -1458733 2047879
1128 1430811 3174418 -3472798 -2381699 -266485 1448109 -3589268 1933756 -2595359
1119 30221 2556947 -1284206 -983154 -2760920 -39538 -5835593 3947261 2173109 -2425861
1109 -1390279 -597916 5078872 -1044768 -2268977 6102906 531721 -423539 -2077714 1299576
1099 332560 2657861 -1949606 1162537 497799 2426895 -3041928 4487109 2511177 2115482
1090 2115482 -1899866 -4081639 -2055070 -1203566 -902328 -4918748 3874897 -1509841 -2341043
1081 -2341043 -2285459 4429630 64406 -2772607 3772300 -6732507 838137 2067292 -1186208
1071 1203178 -3598215 -2335081 4885047 -184142 -2762378 414073 -3980204 -3603072 3593469
1061 777957 160795 -2026626 1752757 -1324034 3891419 3998351 -708636 -1791139 1942636
1051 -3153383 -197880 4663231 -1564675 169433 -1727832 502785 1704964 -2551010 -1688124
1042 -1688124 2085377 -551607 2490305 -127641 -824282 3206937 1285758 61265 246453
1033 246453 831851 -59479 -3916866 1345215 -969132 -3704573 1542528 -196243 -1570696
1024 -1570696 8541613 -586992 -698649 -5808113 2796632 1439604 -4815147 -87499 3538353
1014 -4589193 -230093 -275940 -5661745 1255249 2351172 1840071 -1604137 3124229 -138225
1004 3718060 -1500369 -872843 -2084375 -19169 -1928142 -775277 2068087 -1155818 -1309164
995 -1309164 1101663 3983648 675195 -58644 -2184134 -2856841 4024598 -1774359 2084811
985 -3140932 -114818 -278468 -1421493 -4106672 -342501 2751258 1973548 -3342493 1541034
975 -104960 -370052 -607209 3696026 3913832 -1556130 5687621 -5137867 3713497 -1409391
965 1622799 1650781 2307236 2612618 -2883380 -1762826 2298091 4975365 2289983 2478322
956 2478322 -47573 -1999901 1955256 1341289 311174 1698385 2454870 -6477053 2323094
946 1470741 190093 -3561781 564231 2411998 -3796413 4444505 -1113724 1152528 1864219
937 1864219 79678 1905931 -929972 4000172 -2733343 -202046 5705747 29827 -1375170
927 -3476349 -2191966 5056372 1046755 3048550 -1493288 1187446 426898 -10567743
918 240680 624866 828343 4794301 -3278 -985241 -2899797 972724 -645209 -2668954 -2474767
908 -2474767 -595503 -1194950 2152520 -3370363 2068360 765347 2179663 -6905150 6933673
898 755023 -1971393 -4396184 5465935 -3384125 5568133 -2179761 328638 -782583 -431615
889 -431615 659549 1633138 -963696 986317 849341 609984 -2135895 5349856 -2686116
879 2240204 612205 996136 1333762 3021150 -4082635 -476884 1499196 360731 4882309
870 4882309 -10771618 4584745 -851821 1374919 -1908407 963249 -2063922 3050342 -1610725
860 2807663 4743949 -5729835 -3973664 -1424186 -2080025 -4017927 1197041 591973 1796807
851 1796807 -3427038 1063155 -1941223 2520177 922499 -7239904 474003 -454141 2990305
841 -5238829 3944317 806557 -946080 3815352 -2130235 2556947 253156 -365696 -4494474
832 -4494474 3918879 874652 -1773052 -3883397 -4571829 609025 -33061 672811 -2583444
822 725589 4331631 2539718 3345398 2090427 -4008852 1575073 -2114675 3384590 -3701128
812 3053971 6789593 -4912898 -391683 2330915 250190 -1151613 4519290 1956587 -223148
802 -3780311 -400835 -425943 -1927304 2453998 2548332 -358427 3604181 37477 308874 -779430
791 710042 -527739 -1095396 -4714894 2595054 2129678 -2431162 743629 -1557568 166179
781 1630132 -4554947 5212218 -989130 -733716 -3140049 -2665912 73421 -132930 -3499216
772 -3499216 1992510 -1413825 -1550112 -967154 -116892 4638144 -922697 -3974853 2003605
762 1506491 3851 1313733 472265 -5155180 3111258 -3595865 1436879 -90859 1375219
752 -3159297 4645866 1892688 -4733414 -1790069 -3981349 -2051516 -1192189 -576746 6949903
742 4547258 -1609334 436212 3065081 1505646 621570 2393566 -5111571 4478747 -3588398
732 3587437 -160686 3825152 -2685733 5232476 -2247916 166180 1039132 -1379136 -4795413
723 -4795413 1614404 241183 6085732 -5677352 -4965386 -486162 4077322 -296461 -3701573
714 -3701573 -27530692 -9432346 -12445743 -459459 40993615 37021068 3545028 9417981
706 9417981 5656868 -12897584 -19855585 -38171235 -25699186 -25301285 -20758234 30532906
697 44745092 24595713 23191399 16819558 -28512862 -8740836 -1861099 -1510437 1684954
688 -2027236 -3321092 -711533 2108701 3745419 52848 2775862 -2691101 -271858 -2193038
679 -2193038 2700722 -1429104 -227069 4749637 9677965 26880903 -13708213 -22929069
671 -22929069 -28044000 -28141436 82505 -24371984 -3396727 15350187 30588376 42444446
663 42444446 11041586 -5654512 -12153987 -9457238 -13181905 -30214 -20642946 -15718794
655 -15718794 1201590 2204916 23828274 5314804 -1013875 4646798 2557857 658181
646 -3848954 -109684 -2948119 2328795 -1074932 -1427644 -1150902 7913560 -4086421 3676885
636 616024 -615543 -1138842 -1155745 4551121 -928687 2184912 -1021179 1609638 4422873
627 4422873 -2053774 3961339 4296042 8435574 17459287 34995593 57264984 -120291280
618 -336669320 -91852630 203502661 118044217 13889724 11379996 7836708 4418143
611 4418143 6981797 552433 2999955 760304 2330112 -3741924 -8182 -970462 -2055833
602 -2055833 4520229 1755819 -1702941 1218695 -847311 2639641 310507 -813141 1441645
592 3395054 -1667838 4055385 -6641593 1317523 -1869432 761213 5044995 -3447679 2641600
582 2579873 2001377 -2552525 1195059 -1433096 -804061 4832956 137174 -1229839 -6978615
573 -6978615 1751158 495584 1667946 -228518 452301 1099104 1295039 -1100888 -1396456
564 -1396456 2322821 391291 948105 -451406 982435 227041 2597970 1768129 -3440179
554 2704183 -3577609 2196931 -1202254 1479180 -1244695 7134722 -960126 -1924018 -249701
544 -523774 -1514382 790742 1529708 -535065 -765606 1338150 -7068003 5481149 -1306617
534 -2405711 -2350126 -604522 -643252 3075767 -2540230 84535 1310712 -3333674 -3906331 -626144
523 -823680 320626 -4993541 4769273 148391 2578224 2161536 421196 -3798779 3013133
513 1475246 -3322494 -19915 2673672 -3396593 -3891727 -1560168 3865350 2236451 2499960
504 2499960 -400207 -1482791 1995213 -3306886 546533 -122502 247919 785179 -1358270
494 2360726 -2592191 596368 2997054 -2003906 -319828 -3234556 929654 -1739753 913892
484 2435018 6567316 -8329382 1520282 -2689935 -2685951 6128018 -4213174 6895289 -1721242
474 971498 -1749490 1534075 3282957 -1918735 -2672801 4060643 96622 -659154 5303063
464 -2753653 1294427 -713704 913178 419173 1510063 -2702027 -1123210 -503450 4342965
454 1939042 -3242766 -1409334 3509062 -1610423 1971868 -2301202 5470246 -50605 411400
444 -7586964 2680093 605807 -8998 -3079128 -2870558 3588606 5981097 -607340 -224477
434 1581867 -3165760 1722157 1904566 -834457 -2774201 3897049 -2093003 1349308 4939718
425 4939718 -3432957 -1929709 1312262 2428907 1712810 -1547938 1269872 -1531139 1478046
415 681569 -3693445 1773078 -3873241 208489 -1179618 421595 736551 2741022 -783747
405 -406744 2045234 -437627 4246238 -1737865 -4155342 861459 272803 2797052 1730329
396 1730329 -2514304 801289 2063235 -3642998 731626 3947571 -2248774 -2529956 -2557201
387 -2557201 -223522 -1624935 2755289 -1533816 -1741007 -2219287 -2577497 364370 -3235461
377 2193205 3399594 -912560 -2890669 2879518 1111471 355211 1355637 -5398254 2573579
367 840874 1348919 -1438718 -2105507 -2309673 3859696 -2055934 3237110 2914 -4202370
357 -2867690 1202712 458216 5629656 657368 -646941 -484826 1888068 -1846164 488739
347 -8434891 1227496 904935 3611467 -5026095 6107754 -1652340 265158 -1058272 -3786288
338 -3786288 -1489703 702392 -3594592 3305402 798027 -1504818 1584972 1032344 -3258758
328 -269874 -6902029 5190101 -2982608 4566469 -1929502 2263396 -265300 780219 676785
319 676785 -655874 -1514667 -1913505 -3314809 2273827 -1145392 -687208 -910798 450514
309 -2739923 1237451 -6318426 4417378 -3194837 4812218 2327984 -634556 163832 -4671969
299 -1017022 884063 -1414574 -4111362 648860 -2835512 2880700 -454739 -115408 -878382
290 -878382 -4405813 -3272258 -443703 5769000 -1882596 2935726 -1621214 1125689 -698471
280 2228043 264713 780166 1773346 -3509118 461774 6776477 -6232724 689402 883972
271 883972 -1886570 -2910433 2243809 349946 -1318388 -2789817 -851418 -2777382 2734857
261 526177 4026045 -370782 1701376 -1654195 3715525 2657 -2798670 -3058477 2846396
251 2831836 -407381 1207395 -2712532 -3012156 4079254 -5356879 8011103 -1969055 1330829
241 1436807 10362823 716452 -5323331 -1852172 2358615 -4723867 -2777449 1895267 -4929053
231 -3212185 -70008 -1888126 -397197 4320625 1361768 -1848275 -1739893 -2931567 434858
221 -800282 4747902 -245914 676438 -412067 -3089803 -1648273 485950 716201 5383708
212 5383708 2060521 888589 -452027 1937313 -1253126 -272029 -1800023 5537974 -4306937
202 4815267 -1539542 -565770 60276 447254 1816384 -74720 -2584128 3195146 87055 432672
192 432672 -14625880 -49740286 -170158594 38922169 78007619 166274100 128504889
185 128504889 118460098 -27899057 -83942851 -145116530 -102207626 43246361 3346589
177 2620102 2847273 1911028 159224 6363590 1667107 3655313 2728865 418916 -98649
167 -1747778 694192 -6581409 -1518676 2124352 7664066 -2302540 213487 2167402 567370
157 -1699727 -1472377 -2149941 496914 3596656 -1259890 -1986865 -3456332 -1825992 -2357530
148 -2357530 3984728 -4357978 5872796 -1817126 4377487 2441468 -1226820 289645 -108846
138 -4260425 -3747589 3341595 2600425 -2173064 -2131063 1589242 3646747 -165564 2737815
128 -161264 -518243 -7444241 2352855 1775284 -2789699 4288080 1667687 -6331839 -615554
118 -1877617 1834292 134406 -1552411 1355002 2534438 -1408423 1085030 276692 3478663
109 3478663 -2793290 -1027437 -353922 4176816 -1997124 -2013005 -6880418 3553407 1259658
99 -4545552 -1530856 3632960 4278501 -3348336 221377 60675 1816005 -1914517 2681864
89 -1236524 4209423 -1767155 -6416321 -423083 1498275 -81446 -386871 -755757 641429
79 1468967 3954736 3883244 3486789 -2858789 1767054 -3814472 3111911 1109924 -3376138
69 1865675 3473902 -1797881 -486655 3103178 -636014 -3599493 1728722 -1302048 -2855458
60 -2855458 -4529021 -1179718 727353 3038926 -7017065 630544 -2060849 1703 -1055608
50 2525838 -2013757 -1844241 1181578 -1993176 -900748 -1385073 353693 -159907 -601105
41 -601105 -1189722 -976954 -1024028 2994637 2031521 -279588 -1535799 -1297417 -121957 -1524266
31 -1524266 628193 -1085541 1697069 -47714 -2333349 -2097618 -1033736 1689743 1943795
22 1943795 890064 -1751183 -429998 2474978 -3099280 -1095748 679369 -844232 -1078669
13 -1078669 -749585 2602147 -2797895 29086 4912215 1131212 -1184379 943316 1920420
4 1920420 -2001265 -1278766 -899367 -1223594
0 -1223594
##PAGE= F1=5705.973409302
##FIRST=     21204.543296753, 2686.85945900537, 1768125
##DATA TABLE= (F2++(Y..Y)), PROFILE
2047 1768125 190942 513503 1904599 -1957526 453695 4489090 742723 795130 -3193532
2037 122978 1487040 267562 -637754 -599007 -193297 -1298109 -834538 -304052 -653420 2324854
2026 473487 -3703072 838184 2434437 1365683 4272302 -4290776 1115241 -2811893 -1016865
2016 3429256 2150882 -2970942 -1063032 3819984 3846409 846409 -880026 -2877493 -3442393
2007 -3442393 410911 4598101 -2517524 5239 -1404082 -1966658 1345731 -4939800 308185
1997 -2805055 -1373610 -3066133 5493812 2302354 1895133 2651792 -3306470 3023144 -3734927
1987 2397199 4267304 2780466 -1383382 -2612876 -2952713 116604 -1988887 2273222 1754175
1978 1754175 166673 1466718 -697506 -615459 289720 -1066046 -1864819 4209134 -1847472
1968 -1835024 6914637 -5360643 1952513 2532810 184671 1985242 378867 -2279109 -284905
1958 -499806 1053329 3260090 -2679340 -111746 2408136 872754 355648 1470572 -3215972
1948 -1168108 1828662 -5125550 -659863 -1989027 1376625 1693249 -581990 -3902884 -2932690
1939 -2932690 1211213 -2877566 -3613268 -765587 -2445803 -3508918 2058678 -3105061 -1342870
1929 -179819 5548126 1569263 -116388 1967768 -1273140 4028678 -4174172 -1899408 -1673517
1920 -1673517 3532357 -2454488 5068631 -4694444 -825948 -2478637 4677378 -563873 -3631100
1911 -3631100 302470 2814395 -1691822 1335702 -3012968 7690240 2196010 563303 -657425
1901 -3133162 2595106 3228329 -3055391 981291 1846863 -3439118 6533473 -969520 1976033
1891 20178 3620143 4280736 1305078 229626 -4082919 2123585 -123015 3663490 791659
1881 -1967160 182971 1457459 3040780 120427 -1206683 -1351188 3966721 6079401 -554953
1871 -927547 -1730009 2285603 -1573487 -43983 -1997071 545599 1728135 -1072097 781422
1861 -1255947 -212243 2455124 1187771 -1201855 5770171 -602765 -1211405 477516 -1993957
1851 -1477024 -2310088 -1382842 708310 2727577 -2879119 2754893 -3267378 -4434897 76831
1841 1154391 1605191 -956063 -1848000 -2399932 869680 1692268 -1024080 1201699 -2655202
1831 -2679701 1948138 -4222928 414567 -2229403 -3455901 1015856 -577330 3447062 -3526136
1821 -3447889 -519727 -1186688 -7242326 1421107 -326511 2429152 -4085892 1050401 -5725613
1811 4617069 2320816 1541491 -4048584 71772 -2096407 4457216 1382633 -1793152 -3150310
1802 -3150310 -224867 -694975 1418573 -944170 3989986 2407618 -3175442 -2404908 -1574364
1793 -1574364 1321382 -3761087 -747927 1030253 -863705 -1308213 7942978 -6061851 -1308940
1783 -2773305 -738272 3628682 2335666 -5106773 915504 -359279 7779314 -1500056 -6543695
1774 -6543695 1266725 3988945 2684343 -1314298 2413904 3750191 -347943 3849394
1765 -2334402 -2182715 -2664282 2492876 1770024 755287 -965888 2994782 1113944 3844488
1756 3844488 2545762 -1337097 880465 -388127 1919044 -2754407 -3029344 776806 -1040774
1746 598027 468399 698872 -5976765 -940591 2337539 334252 -36182 -770242 3886561
1736 -752912 -1102636 -1378701 -501868 3235916 1348996 -379483 4802609 -1402387 -139753
1726 -516439 3276372 740091 -3881630 -2864963 -1670633 6062303 -1291614 1842435 537294
1716 2117467 -7758390 883073 485203 6205600 -3412216 1875492 -441419 -1006303 -4616344
1707 -4616344 -820063 3658334 3072620 -7150350 -165773 -604953 3145334 -1885009 698957
1697 2470380 -3513834 -4061830 324618 2926780 -737265 -1262201 -1223913 877961 -485069
1687 852032 1566115 -912172 80131 223075 -2858959 780274 3551399 1017338 -1463452
1677 6291270 259385 3876854 -1457835 -1641105 513505 -4088015 489288 -4603621 -2176333
1667 2843889 2281835 -3553601 -914514 -1404753 4724366 3178006 -4904690 -292916 -1170225
1658 -1170225 4240832 -3044217 5127976 -2557936 -894832 2778707 2369273 608054 3258508
1649 3258508 1967047 1843394 -62887 -1264621 -379430 -682124 -1241595 -3369560 -2835701
1640 -2835701 6274872 -1176356 694745 2380020 1979265 -3377233 -3413267 4856997 159603
1630 1331382 743614 -298414 1951994 -1249609 1242989 -321624 -1587165 1215379 -2342152
1620 277674 -4450235 -1639991 4046830 -544821 -641871 1329881 -2498532 964103 448156
1610 -1884354 -204489 3851689 -1024577 -4687280 4473442 995286 -2465238 -872054 -522808
1601 -522808 -271494 -2773128 941538 -2884768 3338529 -1511968 3966476 404224 -608188
1591 -2057773 -1508790 -348376 3561639 4586112 1836768 683539 1731070 -1904795 2202179
1581 2604509 181572 -4246814 -1074882 2360202 -1125972 -1299014 1414118 3077861 -6796266
1571 3069236 -1319576 3118129 1227512 -607668 2262726 -1096908 699129 3134584 -2015313
1561 2353051 3803938 1884998 -1502719 -3422456 2221021 5543 1839662 -3464126 -1939942
1552 -1939942 -31500 -4761387 -1173406 580905 -12907 -3455909 -451694 7964989 -3682371
1542 126978 6570316 -48968 2427451 -2583351 4277190 2934559 -4706624 -519643 726725
1532 -393824 -2629010 -1925121 3963352 1476180 1954254 857519 -1000109 5496673 -3292043
1522 3300502 1224552 -1653755 3105958 334569 532188 -2298175 -2626495 -823110 -1998116
1513 -1998116 831056 1138004 -3147814 -467151 -1847624 1768717 -942401 -4310431 2586539
1503 4094552 -1171495 -943519 546229 1534605 215306 430176 545657 -1505365 149753
1493 -4677092 2363340 -438375 3972067 -1510865 -4530528 1932262 530916 453206 -35590
1483 3075441 909803 -965375 -1423459 1782154 241759 -69767 -2679366 17753 -581436 4381389
1472 -2109290 -2167430 1886001 -1366231 1552477 -2535394 4760536 607755 1014300 1323474
1463 1323474 -784563 -1067402 -1893872 2776188 -581467 -2263978 1259602 331031 -1490159
1453 678263 -1124299 35299 -1242383 -1078207 141556 -678111 -1433580 -2431389 -3482593
1444 -3482593 80739 3050251 912620 -265946 -2358716 -2227043 -443742 -2622928 -1443449
1435 -1443449 4564888 -4796522 2186873 -624494 1435846 1090899 -1776983 -7034300 -547995
1425 2510568 -2901783 6802486 -5814222 727699 2583531 -2160307 4134314 1538826
1416 2166278 945005 1684740 -369397 345564 385809 -269772 1520282 -2204673 -4239640
1407 -4239640 2930574 -4689436 105823 2523860 -2508769 405614 1650025 2102072 974427
1397 -3469877 327008 -2843360 2347939 -6919966 878561 1582138 -654127 50356 -1464824
1387 282802 3836608 -1125984 -2721995 220447 357338 1847215 -1532230 946932 -2573159
1377 2055880 3673401 708452 4160964 -941967 3567436 -2094384 3074942 98899 1963970
1368 1963970 3625761 1974248 -4880215 5425590 -1149290 -1220104 -2598652 -3255532 1012240
1358 -277638 546945 656080 -3026112 3851164 -1930999 1675644 -5262021 1824964 -518932
1348 1090193 -5443855 5482184 -3630701 -3157976 5630779 -2913786 1179203 2599728
1340 2599728 1558068 -6305941 -2248739 470333 1354205 -2612124 716895 251443 -1139994
1330 1145781 -849812 -2055858 2251861 1514638 4115661 -5916094 3641494 -1644233 1135244
1320 -1966805 -1070411 -4232520 -5160809 726310 1990846 -1021198 580263 -2237628 2017076
1310 77850 -4647888 1657881 2462088 -634942 961673 -2119920 -2378463 -2736352 -3653635
1301 -3653635 -1754427 1566097 3922990 -3806353 604459 4682528 -2828349 -1759156
1293 -1759156 -2181699 -464328 -2259497 -5249939 -2163754 6224552 -415291 -710645 1089782
1283 -3381453 609634 -105019 1354659 7268024 -6034787 1143792 788710 -3057784 -7482632
1274 -7482632 1190524 624066 1588630 4389589 -2193715 1575844 -1475546 404293 -3401518
1264 -3590368 -2763581 -207398 -6030126 30246 -3243295 1570614 -1522101 47598 -496730
1254 438324 -1070774 4612577 39218 -3441045 1958058 -3115974 1623136 2809683 731921
1244 344855 57450 3257486 -848556 -1487483 1246645 3037454 -2401068 441664 -646784
1234 -3542631 5002620 -2035629 2723567 -293304 778571 1847273 3492721 6377650 -2451445
1224 -6622006 117871 -2732859 -266523 2644252 -114407 -411777 4184604 37499 -2355409
1214 -3263132 -1258881 -396430 1216093 1080737 3302935 -6176655 -572730 3905502 -1245184
1204 -3532352 -5090752 2934706 2064270 -2008163 3396074 -4183270 -3674398 4411534 3315039
1195 3315039 -4193642 -6393339 1999286 -1382082 6527116 -3146187 1267593 -1900461
1186 3828888 -990051 -1311913 -1918617 -406085 -2818638 554907 -25055 1168090 -6621380
1176 -428117 -2266537 2932260 -584983 -3651748 -603261 62306 2074948 2082734 -797362 -1070242
1166 -1070242 4407100 -3311985 1850935 1891714 2115477 2086371 -1918889 2528087 -402654
1156 -312349 88468 -2424302 351221 1171592 -6326217 3824545 811585 1523907 1382997
1147 1382997 -5605446 2298180 1366788 -2774545 3315527 2663745 -1747362 -592914 120270
1137 -8725405 3301879 876601 -194178 1580137 1755198 -1898972 -1393222 1532024 2948619
1128 2948619 2154231 -2471662 -1655372 -651490 756406 -4227503 2339473 -2766572 -666904
1118 3032717 -2104919 -1302000 -2491963 237503 -4757530 4066427 2118366 -1975925 -2106817
1109 -2106817 -41204 3662852 -1075107 -1871605 5427066 1676741 -112909 -2256885 1474650
1099 211881 2909657 -2287907 1128907 286883 3665542 -3547594 4512535 2914666 2302656
1090 2302656 -1532770 -4433276 -2121083 -507254 -1065872 -4738958 3587778 -1364139 -2932841
1081 -2932841 -2023575 4493672 -566087 -3121320 4108504 -5912947 -202891 1792519 -1011987
1071 910418 -3695637 -3002754 5153064 -325306 -3273758 753483 -2624101 -4091556 3410676
1061 1439779 149577 -1612090 1533265 -1335974 3714557 3550992 -807780 -1492782 1989622
1051 -3071452 473223 4132327 -968997 47252 -2463242 458770 1127558 -2419802 -656849
1041 2232096 -1162174 1985265 -437807 -839283 3287146 1461848 900718 65957 773988
1032 773988 -151252 -4178981 661297 -1063480 -3176925 1068080 737347 -2038544 7914039
1022 147198 -963227 -4130954 2250298 624226 -4567400 -643862 3925859 -4393463 -889164
1012 -73465 -5962305 946004 1528812 2435357 -2085049 2710600 -400463 3569032 -1392025
1002 -972990 -2512687 242744 -1640564 -786679 1895405 -1472395 -1268046 598795 3771756
993 3771756 89694 148647 -2192826 -3152774 4216418 -1107808 1269086 -3110971 274262
983 -381050 -1142737 -3900860 420161 2014518 1845909 -2660083 2201961 450104 -210169
973 -842140 3911642 3732881 -1315584 4903166 -5536181 3290736 -2049991 1525835 1752978
964 1752978 2247346 2933556 -2080800 -1637313 2917914 4444971 2072272 2070599 -915044
954 -1804116 2179108 474976 987453 750766 2888567 -6656543 2355679 1050787 743775
945 743775 -2484812 715936 2259435 -4043964 3691839 -780736 444916 1484007 1032588
936 1032588 1411352 -668590 4164784 -3304334 105619 5735384 -58885 -1603137 -3282531
927 -3282531 -1458621 5375506 503600 2921821 -2391104 335390 609665 -10047303 44935
917 1011086 535714 4533480 -299872 -907249 -3325148 787629 -614897 -3499822 -2698213
908 -2698213 -1019771 -1351282 2091877 -3409401 1952294 1436867 2084763 -6805390 6927757
898 1069718 -2324666 -4359584 5776212 -3097930 5166196 -1778600 471024 -1231384 221538
888 2569170 2566876 -2133716 1363633 1324740 329600 -1798354 5069683 -3138373 2359213
878 845229 760199 1366938 2702172 -4143806 -783946 1303007 901334 5142912 -10806466
868 4926629 -82646 919588 -1861838 1122884 -2088498 2926360 -1331807 2838450 3710167
859 3710167 -4458920 -3895695 -1904621 -1995027 -3888577 267802 1367792 1962243 -3571079
849 1444385 -1717998 1635336 1295293 -7606085 422403 20041 1926329 -4326183 4319757
839 500516 -391524 3595175 -2007047 1484391 189237 -185352 -4834181 4301417 1006857
829 -1883157 -4251478 -4066347 -253583 235351 648608 -2650163 911541 3534484 2260343
820 2260343 3140428 1916319 -3378671 1357242 -1832895 3412371 -3313177 3055561 6933603
811 6933603 -4727698 -338554 1919667 51429 -637439 3935907 3435887 -70974 -4878424
802 -4878424 -85226 -561234 -2247752 3189296 2769700 -1374084 3750239 156882 7569 -29673
791 502462 -877772 -718032 -4278979 2653018 2720839 -2459045 1490564 -1816671 435124
781 1608960 -4443598 5583442 -971777 -824296 -3653722 -2456355 -489243 458121 -3512230
771 1553540 -1428903 -477429 -795546 -362490 4532525 -422895 -5177683 2423701 1072080
761 -164072 1587456 151475 -6289440 3384750 -3612882 2036527 16516 1195022 -2902490
751 4879562 1694512 -4417482 -2063594 -3534610 -2387449 -1691535 -1121813 7095309 5296461
742 5296461 -1413995 -121138 3267727 1380469 857897 2123858 -4903579 5118761 -2549025
732 3194872 -355808 4078361 -2619842 5758624 -2634417 1128201 701693 -1230801 -5453211
723 -5453211 1186921 -55797 6427965 -5298349 -5268640 -366315 4583458 -949775 -4729470
714 -4729470 -30584548 -8695512 -13330189 299094 47264080 41936757 6282979 9232862
706 9232862 6901438 -15482709 -23379675 -43570878 -31139119 -31297037 -22325332 36141883
697 51588457 27174983 25064513 18547975 -30591209 -9925626 -1636272 -1991647 1997542
688 -2109315 -3196322 -1060601 2564604 3018888 432656 3399658 -2369583 -101276 -2449214
679 -2449214 2681400 -1776929 12946 5292792 11031170 31468511 -16178209 -27456141
671 -27456141 -32707900 -33226716 522271 -29104168 -3791898 18184651 35283994 50446703
663 50446703 11709375 -6344012 -13525036 -8770033 -16222214 150933 -22555772 -15782885
655 -15782885 468504 2260225 25807346 5399408 -919886 4966483 2207491 2047961 -4650576
645 5770 -3081158 3298989 -656646 -1145879 -1631635 7772679 -3544317 3825574 667268
635 -965403 -1962282 -1361923 4680714 -642938 2196507 -978828 769877 5131972 -2077993
625 3041121 4322460 10727771 22326525 40588242 64222053 -142211216 -391842317
618 -391842317 -108456196 237127796 138720455 15892142 13435111 7994432 5827454
611 5827454 6200175 676517 3323612 1003458 3012285 -4274857 590968 -1067644 -1266378
602 -1266378 3870680 1426347 -818572 1050747 -1358166 2592323 1211094 -833965 1664233
592 3037997 -2035227 3828497 -6124207 1444205 -2449903 922278 5497721 -3215980 2194911
582 3356103 1367081 -2113036 884602 -1283388 -766978 4008792 234601 -197711 -6387454
573 -6387454 -146889 725509 1794861 -653723 673196 997158 1091445 -631509 -1619915 3038461
562 442398 549775 -279261 2204650 81793 1841855 2107810 -2583662 2646366 -3849079
552 2539192 -1077973 1489404 -531063 7369882 -427867 -2230281 -615525 -436363 -2048920
543 -2048920 930663 1228295 -21107 -1080982 1543537 -7944221 6102694 247885 -2075087
533 -3130084 -25088 -484134 3487503 -3617688 827514 1689396 -2958095 -4183369 61600
523 -507285 338389 -3728720 4652176 -415404 2434460 2765132 -406014 -3216355 3620208
513 2198445 -4241944 1025778 2058026 -3103704 -3419955 -1713832 4027334 2626048 2561580
504 2561580 -122069 -1915213 1935852 -2687297 731747 -843910 502396 1800489 -1587413
494 2100943 -2738720 1166808 2581188 -1708991 -543460 -3510372 1034552 -1364090 645266
484 3033752 6671917 -8876672 1938166 -3499073 -1468682 5442267 -3724536 6321697
475 -1779794 1385208 -1717040 1338753 3048447 -1306842 -3478207 4137322 -110861 -648289
466 -648289 4965574 -2570440 1110880 -769780 1397708 1327842 2002603 -3177012 -960818
456 -685774 4864219 1921797 -2988145 -1303563 3188327 -1203336 1816499 -3357942 4876191
446 401010 1438106 -7774991 3250763 264304 -121959 -2125180 -2816270 3597439 6451359
437 6451359 -495160 118014 1408837 -2705673 1276782 2733010 -1156074 -2533618 4662292
427 -1888739 1402322 5367730 -3428145 -996005 1432775 2340778 1309172 -1513334 2599581
417 -1406358 711490 118106 -4336919 1464712 -3054225 231897 -1595603 1145738 359155
407 2954776 -725179 -1288929 1838176 348649 3696285 -1136040 -4701649 1699883 200543
397 1764607 2365542 -2611262 915858 2042077 -3612277 500965 3842291 -2728157 -2727218
388 -2727218 -2762119 -1308245 -781347 2286183 -1241221 -2024043 -1183292 -1789512 649930
378 -3617567 1808346 3617128 -1415474 -2343493 1985435 1147098 -806843 589391 -5125366
368 2573507 1378736 1624478 -752631 -1839958 -2346768 3729458 -2112054 3283052 444211
358 -3477745 -3055508 1756370 4735 5020389 75407 -898952 199530 1877208 -1203141 515727
347 -7679989 1211342 1478528 3410523 -4667735 6180355 -842136 -320420 -1076270 -4045371
338 -4045371 -1326810 794143 -4138316 3627934 136392 -1455349 1495493 1619493 -2837232
328 -408372 -7184991 4342043 -2608588 4343350 -1634341 2847678 -164992 576677 613879
319 613879 -194949 -2139855 -970252 -3395326 2644068 -1402937 -746257 -735335 -1152037
310 -1152037 -2479078 1866884 -6084480 3255043 -2474160 4423655 2325267 -464786 579897
300 -4673746 -1055677 1247284 -2393936 -3379728 600411 -3010790 3823683 -709480 -1097589
291 -1097589 252026 -3730920 -2629693 -455269 6489488 -1551235 2237947 -1623006 1762143
281 -414431 1706432 393649 939610 1974885 -4067248 678649 6715546 -5190988 -511336
271 1146137 -1401990 -3498118 3126988 82993 -1354858 -2554382 -791444 -2937814 2381067
261 1122097 3998689 -575573 2323344 -757748 3719203 -293311 -3101266 -2734337 2056174
251 2232021 796125 922508 -2013629 -3476088 4165772 -4220010 7993088 -1504071 1319614
241 843205 10478574 808052 -5067642 -2102563 2378928 -5167648 -3283274 2171966 -3933913
231 -3079067 -713008 -1076158 -1552047 4269100 1246396 -1481930 -2086173 -2037679 663690
221 -367206 4887882 -111472 1402294 -577998 -3410363 -977390 1086777 523226 5347941
212 5347941 1961640 597341 -218736 1421794 -1162880 326870 -1471853 5703234 -4944984
202 5240268 -1567794 -224642 -609691 262258 1633365 -90390 -1795798 3590710 227132
192 515740 -17313968 -58203786 -199727854 46680668 93172740 196759348 150618002
185 150618002 138526177 -29964637 -99993419 -170473252 -119178543 49973491 5773821
177 3289418 3793822 1904073 527678 7021270 1145704 3489596 2974020 169775 335243
168 335243 -1402287 1023238 -4748787 -2257521 1900346 8652102 -2652045 523953 2654537
159 2654537 544958 -1669204 -1352217 -1589426 -181703 3939676 -758803 -1842873 -2984651
150 -2984651 -1584268 -2960039 3937649 -4529181 6199820 -2066588 4717163 2503425
142 2503425 -1333633 503716 -894176 -3544839 -4350714 4791275 2268197 -1946138 -2111230
133 -2111230 2203914 3774199 -280123 1910933 -224975 -1074283 -7497458 2062384 1303656
124 1303656 -2777846 3221956 1976618 -6527401 -494634 -1710865 2314187 144238 -1907108
114 1873168 2273235 -1403534 1288312 -117537 3825296 -2173807 -808487 -915060 4401590
104 -730814 -1984890 -7593085 3975788 1408870 -3920198 -1864398 4096491 4503287 -2427813
94 -571204 641773 1531649 -2706133 2289418 -906814 4425048 -1492442 -5981509 -626431
84 1351188 -399145 -379531 -1708870 930062 1706878 3844432 4322445 2779786 -2281189
74 1663806 -3936264 3587759 570791 -3190413 2058240 3592306 -1282897 -393991 2875010
64 -483712 -3178812 1514455 -644561 -3317464 -3601082 -1209179 990106 3232417 -6652057
54 823322 -1867130 -14673 -276415 2719336 -3041000 -1232641 1102847 -2208131 -772672
44 -2271176 651595 -713865 -876199 -2023184 -928125 -893788 3332133 1453226 237204 -1984770
33 -1468143 -11788 -1197926 400771 -1238067 1272028 -52438 -1484256 -2171010 -1671022 1651316
22 1610373 1549672 -1710839 -178813 1840525 -3180526 -789159 -117708 -544948 -1026111 -268683
11 2551231 -2573612 210156 4114339 2656554 -2269395 1288382 1290094 -1400735 -1465545
2 -1465545 -584766 -1515728
0 -1515728
##PAGE= F1=5684.175139418
##FIRST=     21204.543296753, 2686.85945900537, 1986403
##DATA TABLE= (F2++(Y..Y)), PROFILE
2047 1986403 585839 358355 1899426 -2692010 254288 3789721 379205 852594 -3079634
2037 -198606 2514084 145118 -1304970 -850495 -87761 -951021 -771819 -601009 -818523 2258604
2026 1120513 -3873726 -57742 2279282 1155168 4330280 -4378326 725825 -2752898 -237732
2016 3668808 1472052 -2863087 -2033169 3921013 3670892 -1128402 -370125 -2021997 -3162823
2007 -3162823 643157 4578592 -1733504 -251935 -1023768 -1473992 1153831 -5096070 385608
1997 -3088035 -1475239 -3697422 6104087 1663783 1647900 2817745 -3668427 2665921 -2881798
1987 2663555 4683305 3463831 -1848857 -2722801 -3942902 766956 -1890328 3113884 2121830
1978 2121830 -106806 1334367 -968595 -454163 -239337 -925839 -1287395 4760220 -1385553
1968 -2579414 7334295 -5452516 1513338 2902151 -695195 1947459 604947 -1073772 -829269
1959 -829269 -936543 1340014 3656305 -2565244 480321 1541641 1234199 90820 1235794
1950 1235794 -2896506 50550 1265874 -4635479 -744511 -1939781 1826709 2751596 -896217
1940 -2998299 -3600223 1278665 -3054660 -3042251 -838322 -2041005 -3759229 1686542 -3519813
1930 -951674 -338794 5548955 1144326 -264204 2299020 -1418442 3911338 -4882186 -1266560
1920 -2193829 4209734 -2788864 4924801 -4078172 -772403 -2404057 4294078 84637 -4360695
1910 474019 2575005 -1155752 1189474 -2936290 8207718 1942567 445845 439309 -2968708
1900 576929 3314073 -3536668 1640246 1507656 -3244516 6750803 -1304916 1529162 989260
1891 989260 2927413 3664907 1723118 -116320 -4111112 2169240 -14142 3279777 336461
1881 -929535 -180086 2089410 2339085 52206 -1329617 -1544422 4385278 5387881 -587644
1871 -957435 -1675215 2315278 -851286 213330 -2199135 221116 1091831 -208048 439654
1861 -1356571 -199228 2982425 1566726 -2076149 5383443 -171928 -2128571 1136473 -2239428
1851 -985963 -2415421 -2639407 840025 3503224 -3424711 2899506 -3591981 -4842762 162715
1841 373064 1082975 -1413222 -1485814 -2894175 1315684 2314188 -1505211 1031000 -2598976
1831 -2556140 2601340 -4571101 60515 -1837712 -3605906 593016 -840052 4635687 -2959221
1821 -3604520 -1055982 -1209933 -6957857 2118433 -623196 1899302 -4417251 1792632 -5636540
1811 3994010 2168743 1372321 -3468446 526665 -2729146 4162896 1398990 -2345186 -2325120
1802 -2325120 -639135 -323574 1628660 -676176 3162222 2506511 -3017260 -2392010 -1187615
1792 1296024 -3289860 -225487 1093108 -846870 -865585 7218245 -6372745 -1015561 -2665441
1783 -2665441 -232515 4072625 2284065 -4784633 541425 -739563 6382245 -722521 -7069295
1774 -7069295 974722 4540568 2594513 -1089072 2583944 4369324 -641691 3810449 -2593778
1764 -1119128 -3187658 2545672 1079889 855454 9835 2473253 923968 4048150 2963958
1755 2963958 -1259379 980707 193834 1739896 -3232446 -2918837 509963 -542554 199172
1745 865534 950131 -6125020 -424377 2434081 -209226 56253 -1064970 3500629 -1319695
1735 -779712 -1639961 -785529 4005368 1153194 -521906 5055001 -458748 -381893 -166975
1725 3709197 1397315 -3756000 -2624380 -4179991 6500103 -1530915 1925896 45643 2416224
1716 2416224 -8314611 1364441 -283411 6004546 -3408148 1475995 110454 -805549 -3823657
1707 -3823657 -1303390 3681995 3413393 -6546665 -246386 -1561672 3414372 -1562711 551804
1697 2197537 -3284147 -3293512 880054 2777539 -1391688 -534992 -915992 1111583 -602176
1687 896443 -421055 -1485202 134851 301952 -2763750 11770 4198595 1550614 -2050578
1677 6714999 130284 3667627 -1027958 -2184067 81458 -4827025 850289 -4312731 -2179693
1668 -2179693 3180159 2204734 -4414067 -248169 -1666999 4582757 2933141 -3991183 -287892
1658 -663030 4115961 -3559359 5143681 -2461327 -882400 2528705 3103338 573096 3207093
1649 3207093 2127116 2982969 -498296 -1707790 -371581 -653003 -1130736 -3431557 -3028510
1640 -3028510 6260033 -1295722 1002066 2401578 1284318 -2405740 -3856923 4240534
1631 751064 1227652 622609 67846 1616500 -1544306 2119226 116885 -1318766 1509067
1621 -2035377 796612 -4518598 -2289338 3443211 -538584 -260178 806749 -2082250 454741
1611 564664 -2116649 -1428250 4171512 -898969 -5042734 4373672 355155 -2082838 -804180
1601 785079 -1070102 -3120189 1289209 -2887649 3253382 -1405358 4622159 184164 -1273325
1591 -2086517 -1626385 -419068 3163629 4769237 1863122 360945 2394550 -1632770 3490511
1581 2357930 105531 -4086614 -1352203 2062346 -746307 -1654859 1439606 3561394 -5153296
1571 1601661 -1552813 2739467 2003637 -928985 2782263 -2478596 810562 2598630 -1490346
1561 2788090 3672119 1333822 -247899 -3482111 1605097 520527 90711 -3034669 -1758404
1552 -1758404 -35825 -4837584 -845888 959280 -751619 -2666969 -683502 8437273 -4117117
1542 484397 5572671 -1114210 3304238 -2881934 3626621 2899820 -4456240 648716 865522
1533 865522 -975024 -2516737 -1772938 3231631 911843 2077623 760032 -1944433 6397004
1523 -2679836 3177912 1192493 -1477256 2207705 632180 521364 -2772670 -2729122 6308
1513 -3028184 839421 1156655 -3365044 -214063 -1839605 1038997 -1216852 -4826858 3281024
1503 4048108 -1485704 -477111 1061044 1033153 689088 866248 -450060 -1930840 309166
1493 -5353035 3019069 266967 4163494 -1659033 -4510152 1232109 -356545 -550533 107965
1483 3392432 545998 -888764 -816201 1255130 427760 -225934 -3134857 1072936 -850871
1473 5108154 -1577424 -1870093 2064075 -1374491 1571537 -2866472 4739475 544148 1148410
1464 1148410 1624263 -1404766 -964787 -1477951 2668113 -626420 -1712265 1643747 -484129
1454 -800685 737644 -1320962 726467 -1633119 -2214785 2257529 -1240247 -1971652 -2248924
1445 -2248924 -4184980 156674 3034622 884771 -630638 -2219692 -2049190 -649186 -2364934
1436 -2364934 -1580438 4134955 -4171440 2433065 -658992 553341 1757063 -2537895 -6820567
1427 -6820567 -420736 2544350 -2580851 6702351 -5629338 326881 2861378 -1734220 3592054
1417 1656782 1728785 577368 1701533 3964 181712 -144574 -319288 2012533 -935568 -3929068
1407 -3929068 2597732 -3736723 -784625 1847472 -2464582 603692 1845493 2088703 669321
1397 -3672810 106374 -2360966 3035919 -7928609 1129928 1675031 -491759 -15455 -2125352
1388 -2125352 85729 4048068 -1944104 -2631004 626703 464160 1698946 -1444227 766283
1378 -1880621 2140466 2444703 800907 3583605 -1488123 4612358 -1753430 2955613 566991
1368 2626397 3372106 1438654 -4612465 5356297 -698776 -1338555 -2978723 -2615441 1808236
1358 -1057929 415922 275901 -2797985 4481328 -2598938 1187424 -3910068 1909857 -1480368
1348 1016114 -4057693 5221983 -2973226 -2639104 5420288 -3184787 1726276 2044888 1169922
1339 1169922 -5919790 -950658 -51662 2101448 -2918009 851059 550534 -1335173 371690
1329 -760005 -1945296 1547144 2318920 5005458 -5187009 5054887 -1699043 571890 -1962326
1319 -1364884 -4105986 -5072635 570712 1857849 -542776 319091 -2540604 2153961 230821
1309 -4829403 994315 2709743 -1172456 1090571 -1858952 -1698924 -3444840 -3419234 -1418856
1299 1285260 5176501 -4023237 -1158072 4050880 -2709984 -2632267 -2282029 -285341 -1798637
1290 -1798637 -5333437 -2139067 5422149 -169029 -1307387 1642199 -2715682 381441 -425845
1280 1442149 7265287 -5742748 1390087 576337 -2461072 -7742638 878985 955738 1792605
1271 1792605 4359371 -1901164 760190 -547812 514406 -4653060 -3527300 -2798017 -859211
1261 -5677324 -20642 -3148057 1597992 -777282 -51435 -436926 607234 -1064799 4514245
1251 668288 -4397986 1769378 -3228342 1831385 2927776 -214062 2324577 209676 2896865
1242 2896865 -1589936 -542476 1098995 2555002 -1779133 212708 -764726 -3273462 4350657
1232 -1851880 2728642 263549 786273 1815122 3236140 6145163 -2248660 -6926855 271698
1222 -3244735 840017 2424876 -2597 -856534 3950130 25508 -2760946 -3153504 -328545 -1768584
1212 -1768584 927454 435692 3569287 -7058583 -570668 3259546 57779 -3267681 -5606138
1203 -5606138 3132480 1475248 -1735965 3690092 -3422554 -4712131 5737627 2822063
1194 -3896486 -7440252 2624075 -872114 6903160 -2487601 250771 -2086884 3387681 -1095808
1184 -1229980 -2575831 -63911 -2703913 -151578 940820 1100326 -6518674 342454 -2567499
1174 2750765 -172746 -3603182 -461979 99090 2487352 1726901 -652676 -1220795 3893692
1164 -2940174 1989289 1048664 1643399 2656616 -1750977 2653172 -861865 -473877 41559
1154 -2460177 642334 1274330 -6205995 3684294 1107744 1989683 284416 -5149751 2979414
1144 1537379 -2749906 3302031 1951391 -1492297 -780503 175004 -6898621 4169598 550648
1134 936023 460940 817169 -1595465 -1258282 1028414 4155935 1212448 -1593288 -917789
1125 -917789 -966503 91242 -4773555 2783692 -2853848 -1281626 3459128 -2828437 -1690645
1116 -1690645 -2167947 560142 -3526742 4012193 1881105 -1431666 -2722629 515158 2147012
1107 2147012 -1033510 -1353913 4565003 3037418 138287 -2327203 1737164 105765 2842636
1098 2842636 -2504770 935027 119777 4465042 -3946288 4331828 3256710 2483884 -1202271
1088 -4378869 -2235310 198277 -1192639 -4428763 3343289 -1382947 -3380813 -1627812
1079 4256802 -1139478 -3291973 4219528 -4749347 -1422804 1606655 -798442 663402 -3657575
1069 -3553999 5196897 -339442 -3655666 1055268 -1120402 -4329304 3181413 1992416
1061 1992416 265899 -1326912 1027989 -1360949 3584942 2962585 -1094063 -1089518 1805636
1051 -2746872 969659 3337771 -397020 -13511 -3054503 458221 617319 -2341138 272466
1041 2406916 -1615168 1495822 -895956 -869145 3299823 1616889 1846649 -83742 650416
1031 -272569 -4371693 -34170 -1051551 -2574360 440894 1888866 -2387541 6877204 738576
1021 -1184298 -2458801 1657479 -97949 -3845022 -1030794 4224088 -4166438 -1531544 186180
1011 -5997670 450408 748501 2935654 -2432943 2171558 -712642 2965971 -1113874 -1138865
1002 -1138865 -2912302 531075 -1297368 -687852 1711326 -1820460 -1257397 20133 3400683
993 3400683 -403659 21607 -2176835 -3347217 4168339 -471191 457555 -2986587 601711
983 -407373 -899757 -3605536 1062954 1185077 1525249 -1865533 2789890 934713 -95846
973 -974175 4106888 3419988 -1006989 4236767 -5752175 2716263 -2476942 1320705 1857578
964 1857578 2265412 3087289 -1069842 -1563781 3480841 3837806 1687579 1626376 -1578382
954 -1727563 2258672 -194098 1391447 -186011 3309608 -6564208 2277566 466763 1382930
945 1382930 -1434856 797078 2084382 -4354208 2745886 -292309 -253768 969175 1867647
936 1867647 734414 -491759 4222615 -3652891 412608 5559794 -198498 -1703875 -3149394
927 -3149394 -728412 5444718 -157334 2615739 -3346968 -291627 720678 -8547570 -346458
917 1354005 265186 4084259 -378491 -955617 -3608153 552696 -459241 -3999466 -2905759
908 -2905759 -1471808 -1309232 1994767 -3323649 1741692 1991160 1869037 -6626815 6619179
898 1236250 -2520702 -4247695 5817882 -2830612 4595830 -1445590 731943 -1646645 733979
888 4202474 3319248 -3263276 1611676 1767596 164655 -1563747 4687644 -3630712 2369494
878 1078349 469090 1325490 2273150 -4096619 -1053031 1139288 1476258 5046218 -10165363
868 5049144 697102 561938 -1880944 1231485 -1918392 2648695 -1117910 2652924 2540706
859 2540706 -3133413 -3746913 -2231810 -1865503 -3720846 -729604 2154592 2074132 -3482331
849 1757650 -1525618 602182 1666823 -7833755 332728 181539 767072 -3366913 4829948
839 60548 303637 3251136 -1793437 258321 163122 -289489 -4929936 4518803 1014876
829 -1899147 -4247811 -3386140 -1092494 260832 690807 -2808887 935704 2596325 1781308
820 1781308 3081573 1648753 -2699316 1007388 -1569851 3100240 -2665065 3085430
811 6800856 -4427217 -321263 1289183 -103363 -150383 3459999 4824248 44660 -5988366
801 105141 -641318 -2596566 3950171 2777132 -2584004 3707555 199680 -211538 702131
791 143743 -1163600 -287517 -3684597 2624090 3180639 -2362547 1944417 -2008330 677395
781 1437649 -4120318 5437390 -1003003 -1017026 -4140709 -2242814 -1061563 1308809 -3596123
771 1078201 -1440960 559098 -596590 -656194 4377708 22 -5983767 2719624 562089 -359053
760 1808034 -186177 -6953112 3370666 -3573766 2544669 112382 906455 -2520873 4936251
750 1346256 -4131374 -2228159 -3029465 -2644741 -2119596 -1751681 7130454 5536036 -1201082
740 -769561 3405755 1043827 921487 1689748 -4447032 5484551 -1460523 2786078 -656567
730 4120056 -2538943 6117099 -2972906 2086733 148913 -1216854 -5717902 707728 -380256
720 6485101 -4743744 -5482737 -293181 4828194 -1713431 -5796115 -31747467 -7738650 -13627038
711 -13627038 1192619 49762505 44072856 8141327 8708286 7798480 -17102635 -25525073
703 -25525073 -46143204 -34352304 -35376757 -22478977 39353772 54867190 28253136
696 28253136 25255999 18914986 -30250820 -10950166 -1534280 -2383619 2036850 -2087084
687 -3075676 -1637784 2969670 2244522 666431 3735661 -1969986 114552 -2758299 2545687
677 -2147337 343505 5372561 11707717 34692980 -17843762 -30379151 -35770353 -36241882
669 -36241882 833131 -31972265 -4235177 20026502 37628274 54856035 11737804 -6965454
660 -13904010 -7584896 -18615309 281371 -23168744 -15146951 -528810 2017444 26179669
652 26179669 5110467 -863297 5134481 1762493 3291220 -5376216 84200 -3169386 4044403
642 -302950 -1091205 -2161163 7182331 -2819766 3756663 605550 -1139230 -2656843 -1595075
633 -1595075 4697320 -409106 1711851 -712431 -234888 5450128 -1922529 1878008 4143379
624 4143379 12472098 25723466 43749665 66349797 -154846481 -418267076 -118006762
616 254431205 149742997 16631551 14525926 7545154 7016893 5286155 678959 3244530
608 3244530 1362804 3357177 -4863905 1140336 -1271974 -567669 3093574 912324 -50127
598 701330 -1778305 2522020 2087728 -802548 1738364 2283124 -2371859 3435922 -5584872
588 1601472 -2898021 896024 5779295 -2884842 1551972 4022084 495057 -1626578 437085
578 -1222187 -765218 3073298 -32479 749985 -5694474 -1895924 951988 1705265 -1068091
568 714845 877273 742512 -89863 -1874339 3646319 479378 -113312 138116 3145165 -52823
557 935421 2215854 -1676759 2378475 -4056818 2722090 -952378 1315981 126388 7156092
548 7156092 4491 -2606579 -1233617 -378709 -2709868 1002298 823587 363539 -1341722
538 1655379 -8547887 5949214 1740602 -1758320 -3936834 575414 -415731 3654262 -4592022
528 1485026 2047723 -2590110 -4306370 567908 -220050 214625 -2539462 4073126 -1035629
518 2190948 3239235 -1277820 -2792568 3897879 2658277 -4913452 1930565 1180749 -2890365
508 -2933744 -1856120 4162430 2811026 2487563 274978 -2358399 1733635 -1958402 837875
498 -1702079 621493 2696711 -1894645 1749256 -2805675 1650363 1897516 -1547682 -950303
489 -950303 -3762217 1064583 -1186296 140871 3465046 6578344 -9087147 2157020 -4146253
479 -208792 4369251 -3091786 5495453 -1766598 1584078 -1594021 1042187 2568367 -730874
469 -4135313 3911045 -266575 -714447 4372932 -2414379 812568 -909542 1787055 1906956
460 1906956 2487759 -3692343 -735968 -1008056 5056940 1709025 -2694502 -1312145 2738020
450 -884961 1479063 -4255849 4067111 759984 2290433 -7838416 3780277 -72289 -338470
441 -338470 -1220881 -2950995 3534558 6551465 -560424 368814 1089839 -2184214 794941
431 3312133 -1505600 -2406429 4984747 -1713572 1268977 5638094 -3506606 -474075 1610311
421 2177522 664618 -1524220 3785099 -1226299 -326169 -469255 -4844992 1074953 -2360922
411 152883 -2046817 1762444 -45102 2898140 -760127 -2224800 1515563 957068 2772325
402 2772325 -561858 -5006468 2313715 48765 545912 2776603 -2741585 822547 1889829
393 1889829 -3596103 129820 3641408 -3507260 -2961891 -2728076 -2530721 -70321 1718798
383 -974306 -2379530 -70609 -909219 860317 -3919753 1202985 3580558 -1841182 -2003965
374 -2003965 831759 1173357 -1997622 -393962 -4814922 2522452 1430135 1774451 -183054
364 -1567939 -2357388 3468843 -2127515 3101298 749392 -2643549 -3305454 2187265 -605035
354 4307079 -680438 -1290554 868958 1734995 -698056 463335 -6781550 1125472 1893586
345 1893586 3075098 -4284962 5962945 -132805 -941356 -945470 -4403182 -1131704 573599
335 -4708817 3966748 -697075 -1659930 1417108 2038786 -2505512 -530413 -7304884 3201769
325 -2157942 3901802 -1375920 3153395 -272058 251451 498796 258186 -2864015 -126182
315 -3499489 3071517 -1766260 -1070282 -500952 -2576423 -2307234 2308792 -5785471 1880560
305 -1724450 3843793 2233380 -419193 831191 -4670127 -1127630 1450485 -3404873 -2803131
296 -2803131 356782 -3084813 4444163 -1132875 -2036247 1313630 -3145357 -2019166 -440493
286 6842410 -1230182 1444918 -1665773 2370940 -217888 1160551 430898 987840 2032958
277 2032958 -4621771 661493 6519375 -4016195 -1868053 1332141 -962551 -4164434 4017772
267 -363539 -1479202 -2258277 -911077 -2983259 1794703 1503838 3648973 -893572 2894764
257 105307 3552534 -565840 -3452675 -2424675 827973 1614335 1887459 517992 -1224662
247 -3896223 3872386 -3032192 7661214 -1093453 1081749 68477 10061232 811875 -4646213
237 -2306258 2264093 -5409592 -3803100 2212413 -2492333 -2967709 -1446644 -174022 -2759965
228 -2759965 3952780 1039989 -1100503 -2519581 -1169161 835307 39749 4810750 23852
218 1966929 -638380 -3701394 -365818 1660035 30999 5090687 1647011 226602 -7674 859150
207 -1029954 841777 -1216935 5756765 -5485454 5322384 -1522295 120644 -1429045 42081
197 1249170 -97241 -1179797 3692302 358866 603229 -19242767 -63058349 -215674167
189 -215674167 51422917 101627064 213651722 162843111 148936844 -30774404 -109205942
182 -109205942 -185054801 -128053124 53163739 7963399 3673997 4609946 1778319 835696
173 7449366 502476 3114589 3107365 -138361 699972 -1116898 1338091 -2998971 -2866148
164 -2866148 1503106 9101442 -2884842 555741 3034255 414522 -1481633 -1290898 -990123
155 -990123 -647870 4120275 -361848 -1676670 -2563818 -1294425 -3368314 3815173 -4641263
145 6226699 -2214230 4608470 2597615 -1521692 621977 -1743410 -2639268 -4682280 5646521
135 2059082 -1748286 -1952978 2646292 3701771 -390613 1091413 -448680 -1546899 -7278329
126 -7278329 1714586 629925 -2712352 2064086 2137989 -6342887 -390447 -1667645 2881511
116 126255 -2418145 2305331 2016346 -1344324 1256716 -495402 4094281 -1613380 -671207
106 -1529215 4543604 264791 -1930527 -8107275 4294517 1503666 -3340998 -2191468 4491528
96 4538823 -1410165 -1383152 1121251 1172192 -3406750 1793077 -540553 4496147 -1191043
86 -5476228 -782607 1156762 -780017 -241084 -2510142 1084597 1786873 3532407 4675127
77 4675127 1808251 -1567246 1382124 -4037225 3991191 -61768 -2828593 2060857 3537870
68 3537870 -839046 -265828 2495208 -292707 -2732835 1163562 253394 -3674952 -2570007
59 -2570007 -1191959 1200105 3384685 -5993914 1052454 -1475039 -97524 462434 2788561
50 2788561 -3809508 -539718 1103248 -2364919 -1048104 -2999468 916655 -1193537 -1035241
41 -1035241 -2855553 -723489 -880905 3637389 690944 734090 -2499427 -1388246 85100 -872670
30 126442 -1321316 870107 -119582 -550414 -2026544 -2379382 1418375 1404361 2115613 -1684173
19 124055 1037199 -3288578 -213734 -1024700 -283078 -956058 287104 2409701 -2350237 364231
8 3311866 4141016 -3168506 1417134 943769 -748261 -1555818 -299240 -1719545
0 -1719545
##PAGE= F1=5662.376869535
##FIRST=     21204.543296753, 2686.85945900537, 2123159
##DATA TABLE= (F2++(Y..Y)), PROFILE
2047 2123159 965510 255516 1857436 -3454007 -16401 2928684 9515 860614 -2827863
2037 -557088 3617290 -10156 -1778868 -1098380 -22696 -420570 -655240 -913536 -902503 2207753
2026 1671076 -3835278 -869813 2058243 863905 4328506 -4418065 164521 -2563551 416327
2016 3767228 734658 -2611594 -3152878 4018204 3418564 -3167713 110795 -1331626 -2766325
2007 -2766325 864572 4362718 -855216 -627031 -400202 -996839 868153 -4962500 427953
1997 -3321227 -1577570 -4020686 5909152 979821 1362791 2910138 -3934004 2091961 -1905161
1987 2932684 4804834 4125219 -2378227 -2776530 -4687162 1394766 -1683192 3808986 2298747
1978 2298747 -332389 1276130 -1252805 -454112 -820964 -724540 -621724 5151087 -921674
1968 -3248087 7479268 -5459777 1190413 3109840 -1742231 1750078 922293 -22684 -1268532
1959 -1268532 -1454543 1637579 3850219 -2384142 1051287 500562 1646307 -422915 798891
1949 -2507285 1302917 768603 -4081561 -827900 -1746637 2373328 3314681 -1349820 -1996810
1940 -1996810 -4219252 1295599 -2811891 -2360744 -875226 -1350436 -3988116 1174109 -3757173
1930 -694345 -601964 5458238 730637 -375536 2417470 -1558305 3899242 -5584113 -695887
1920 -2729465 4605668 -2905170 4494946 -3221766 -754881 -2239076 3691566 851323 -5055182
1910 829056 2168807 -606655 1030140 -2814892 8149697 1663678 196684 1463401 -2726469
1900 -1327751 3181238 -3927315 2169140 1160731 -2926971 6638962 -1614144 848195
1891 1827479 2148305 2929669 1980571 -578073 -3920233 2232310 79395 2845243 -376380
1881 -14265 -593634 2516256 1602304 -140143 -1411472 -1747482 4495865 4535081 -746462 -1011731
1871 -1011731 -1571715 2231054 -216349 361069 -2260871 -232050 398583 622842 200305
1861 -1507905 -343203 3556025 1771010 -3082019 4735415 205742 -2893753 1713060 -2483311
1851 -401776 -2542512 -3596905 901196 4135932 -3874635 2812100 -3779080 -5092471 129299
1841 -332836 448834 -1770616 -1196546 -3281640 1726997 2785003 -2060875 804525 -2563314
1831 -2452620 3118671 -4589311 -404110 -1385622 -3657398 280191 -1172490 5483965 -2321145
1821 -3774436 -1319482 -1131570 -6760378 2760187 -1035975 1420146 -4665896 2435998
1812 -5529863 3139506 2163654 1072001 -2760978 919015 -3250992 3564536 1388014 -2833554
1802 -1407642 -1058180 -19400 1674640 -403131 2160260 2497487 -3100822 -2217850 -792452
1792 1227758 -2733206 235297 1001445 -810210 -411497 6179956 -6443393 -794085 -2398781
1783 -2398781 89380 4475030 1896460 -4284181 58729 -1058573 5006756 240210 -7475606
1773 732108 4843804 2297178 -832929 2678696 4757995 -882963 3583200 -2834938 -171290
1763 -3460812 2530057 -119439 902108 850315 1738928 661505 4095606 3314279 -1155777
1753 806438 824265 1291272 -3639411 -2735550 361564 -118549 -220354 1139324 1160464 -6149016
1742 -146976 2377962 -724605 95092 -1171215 2901561 -1836859 -374868 -1966625 -1069045
1733 -1069045 4503663 769974 -475116 5011861 416316 -621026 130127 3829314 2082640
1724 2082640 -3493419 -2464795 -6299152 6600469 -1709176 1970467 -435394 2533413
1715 -8498451 1986028 -1069688 5448090 -3123740 970449 631785 -880817 -2617593 -1957984
1706 -1957984 3678063 3509739 -6057915 -281857 -2626166 3476068 -1176694 363478 1742830
1697 1742830 -2909669 -2583628 1287093 2473617 -1996622 234024 -539442 1226075 -845430
1687 940575 -2614055 -2000097 253129 44204 -2595103 -697773 4828839 2104020 -2614339
1677 6708800 -104047 3456977 -638792 -2555980 -487791 -5094261 1238974 -4062567 -1846427
1667 3245010 1999801 -5080481 312808 -1912274 4178828 2536892 -3075883 -297209 -116523
1657 3973149 -3919981 4753298 -2339450 -889290 2045317 3811803 607945 2901626 2143374
1648 2143374 3962217 -955775 -1723937 -452155 -622124 -1152164 -3343481 -3178650 6088126
1638 -1448941 1227511 2337103 527014 -1351584 -4313186 3431796 1238343 986310 513172
1629 513172 425463 1266454 -1736402 2801930 535835 -1286049 1714822 -1645910 1284282
1619 -4641333 -2888483 2818538 -559143 167151 178380 -1584661 48598 661363 -2321362
1609 -2464630 4223553 -806725 -5413024 4169837 -368253 -1537417 -741474 1900283 -1886001
1599 -3458291 1539977 -2779438 3019488 -1210146 5016148 -182619 -1767050 -1948403 -1677372
1590 -1677372 -412048 2601608 4717314 1856291 -37481 3064015 -1350783 4627659 2008590
1580 5705 -3730201 -1579789 1678787 -476454 -1992364 1499318 3805007 -3397722 -47052
1570 -1559988 2242306 2705558 -1278867 3280911 -3730388 901983 1890111 -918387 3050428
1560 3302883 706317 919486 -3527049 903868 986867 -1666520 -2528701 -1574962 -208070
1550 -4413489 -427644 1112642 -1588825 -1719796 -929980 8536400 -4079418 695117 4182353
1541 4182353 -2065933 4155325 -3229489 2907724 2748667 -4016025 1857669 985441 -1563693
1531 -2328825 -1550756 2459893 258488 2302755 546242 -2883228 7002492 -1918208 3141081
1521 999909 -1334761 1299280 827546 545873 -3006596 -2678245 830120 -3683773 860280
1511 1130693 -3468105 -30609 -1859529 332997 -1489406 -5236502 3992539 3697147 -1715186
1501 -74178 1491781 533800 970922 1278653 -1605467 -2195720 413928 -5697018 3585647
1491 911054 3930456 -1705319 -4419134 384741 -1276728 -1604482 240507 3656477 311617
1481 -793424 -226576 894341 557382 -432096 -3446807 1926516 -1005445 5638471 -930613
1471 -1528983 2173518 -1297986 1532089 -3103552 4643748 406529 1179711 1878636 -1862506
1461 -824667 -910681 2603567 -590071 -1219253 2087930 -1224996 -165775 765498 -1570236
1451 1454129 -1964364 -3235928 4042564 -1897509 -2448759 -2088619 -4732797 235184 2840398
1442 2840398 856514 -928580 -2072593 -1773270 -738986 -1982019 -1785193 3574868 -3527391
1432 2665058 -629942 -446041 2368814 -3141049 -6426349 -346762 2492408 -2121025 6488568
1422 -5161091 -266390 3136162 -1582490 2998659 1707808 1265296 111684 1680919 634037
1412 15423 -374747 -423933 2358249 358798 -3394646 2237375 -2847913 -1489649 1070840
1402 -2238669 739248 2110410 1974321 326785 -3725375 -294027 -1416045 3599355 -8305832
1392 1244461 1708967 -215823 -97576 -2637945 -525378 4252637 -2631293 -2457504 934245
1382 606601 1482192 -1297476 588760 -1322413 2111270 1431127 613903 2977749 -1998933
1372 5421295 -1322680 2687664 1148963 3394152 2890720 813370 -3919834 5105686 -193190
1362 -1428828 -3241592 -1685920 2414660 -1819895 352974 -127192 -2476772 4743036 -2935646
1352 669218 -2486505 1904582 -2328014 1081366 -2817328 4798197 -2296780 -2008729 5016213
1342 -3200318 2343901 1373907 773399 -5264348 162457 -308272 2665716 -3160027 846034
1332 933881 -1578340 -293780 -674359 -1747452 850832 3069797 5813966 -4225225 5897576
1322 -1645813 43293 -1810391 -1566073 -3877584 -4895383 445113 1688770 -24292 59508
1312 -2725306 2023115 505671 -4815213 279753 2913715 -1716945 1178087 -1533220 -993145
1303 -993145 -3850597 -3157003 -1001529 874911 6099593 -4012682 -2752594 3331036 -2498290
1293 -3309210 -2322659 -33841 -1416201 -5090601 -2125026 4643426 -1294 -1619786 2158076
1283 -1696802 180669 -804323 1505744 6874577 -5073473 1586335 445524 -1940286 -7685279
1274 -7685279 651670 1272817 2010703 4190264 -1532099 -41049 427227 499135 -5487791
1264 -3254072 -2818506 -1516510 -5034546 9125 -2977771 1550602 90815 -130068 -472476
1255 -472476 861436 -944912 4237349 1196437 -5139534 1569234 -2834837 1786767 2966618
1246 2966618 -1102015 4106164 322469 2521565 -2271015 490082 964876 1928379 -1137211
1236 -91363 -931286 -2865070 3418285 -1555240 2722899 912552 1047901 1703972 3011886
1227 3011886 5872395 -1951746 -6917758 500495 -3631595 1768111 2156089 167373 -1117200
1217 3628675 -21004 -3068738 -3042423 628297 -2925204 581195 -217495 3713573 -7436595
1207 -639884 2522551 1524421 -2825719 -5498387 3003178 931566 -1424639 3933374 -2445268
1197 -5400984 6702550 2398401 -3523609 -7914669 3222621 -458178 6896903 -1913536
1188 -700008 -2122578 2799959 -933331 -1156677 -3213978 247800 -2412558 -738558 1853292
1178 1032763 -6319289 1060603 -2799950 2455776 420907 -3411526 -517923 24142 2366043
1169 2366043 1336571 -467792 -1356017 3357863 -2461941 1997115 240024 1323916 3092390
1160 3092390 -1563970 2877835 -1275086 -625949 -155639 -2406932 998589 1326539 -5715876
1150 3390555 1464207 2377837 -636761 -4403687 3537460 1815175 -2686153 3221729 1047530
1140 -1149688 -889971 236666 -4734958 5030697 217628 1789875 -455889 -225051 -1036408
1131 -1036408 -1035892 568237 4961607 430196 -893525 -216168 -1178725 -464891 -5144596 3302048
1120 -2821375 -1771600 3849532 -3408879 -2106517 -1787563 923230 -2222579 3803727 1515176
1110 -815503 -3173930 1057049 653960 -901473 -719478 3623892 4567327 335697 -2304127
1100 2080502 41908 2492696 -2552142 616911 23782 4821963 -4169927 3983827 3503105
1091 3503105 2686041 -901471 -3918088 -2344683 856467 -1275208 -3988539 3150643 -1535354
1081 -3613864 -1104484 3792457 -1624084 -3248310 4111987 -3332914 -2651263 1557535
1072 -525172 506214 -3476457 -3929661 5025736 -199436 -3867181 1329615 343968 -4264002
1062 2919093 2430526 536313 -1180728 283605 -1349393 3518133 2328553 -1484807 -574676
1052 1406263 -2161635 1270623 2402275 167011 -37095 -3431952 518949 226982 -2293684
1042 1055441 2642206 -1877400 1076640 -1419781 -885760 3271010 1765657 2883679
1034 2883679 -197566 484101 -367758 -4452596 -663550 -895880 -1917847 -257798 3222579
1024 -2592092 5585523 1181081 -1306430 -925609 1096141 -682489 -2684070 -1186468 4461762
1014 -3876246 -2083635 498808 -5703645 -163759 61849 3339812 -2592124 1567489 -1022269
1004 1999257 -674650 -1330108 -3224270 843275 -904271 -455603 1581433 -2160987 -1253288
995 -1253288 -519644 2909910 -753026 -355513 -2101837 -3405770 3879597 129401 -323993
985 -2737666 893128 -337851 -675289 -3204807 1593236 325219 1078311 -994282 3285452
975 1328196 484 -975247 4331300 3020417 -625742 3784901 -5760929 2063049 -2649419
965 1073750 2014408 2392698 3108236 93188 -1497411 3972306 3244712 1192632 1210058 -1918805
954 -1735879 2221801 -578688 1548655 -982822 3701896 -6215258 2124637 -204280 2098581
944 -477967 828423 1955910 -4687652 1725204 325360 -897538 408718 2580122 -850 -370071
934 -370071 4221585 -3726814 713031 5232360 -358247 -1670591 -3040788 4756 5287889
925 5287889 -870618 2192923 -4243842 -586566 763721 -6196178 -912426 1676297 55750
915 3531153 -224374 -1120502 -3692045 309765 -163005 -4098804 -3028812 -1913710 -1031898
906 -1031898 1897384 -3049995 1495870 2444025 1492216 -6342397 6056841 1268034 -2529204
896 -4058411 5640981 -2577684 3937133 -1174697 1138740 -1963821 1158927 5408400
888 5408400 3909481 -4229389 1763473 2171365 136854 -1385703 4225837 -4107891 2339909
878 1359958 166512 1297704 1809582 -3923750 -1234109 1013474 2097366 4639962 -8898750
868 4992703 1406798 359232 -1927929 1334687 -1543722 2273097 -939299 2307782 1390075
859 1390075 -1815518 -3463615 -2340516 -1668982 -3475220 -1682605 2943899 2189792 -3189881
849 2029280 -1341134 -476517 2049215 -7877128 244039 128503 -370923 -2415459 5452382
839 -422817 1097189 2857714 -1463344 -971000 230938 -630346 -4703657 4588078 943687
829 -1767170 -3873098 -2542906 -1813872 102470 841101 -3017840 831950 1615047 1206951
820 1206951 3198265 1379103 -1956994 568153 -1297066 2505728 -1756032 3150743 6418216
811 6418216 -3988677 -274394 519768 -154718 328355 3151238 6027565 166348 -6974464
801 217975 -607617 -2903181 4705155 2606805 -3857711 3554112 191420 -295694 1408049
791 -316417 -1322414 207339 -2912211 2562008 3519829 -2100404 2100074 -2090506 909189
781 1170722 -3564573 4808910 -1035882 -1262830 -4538333 -1983605 -1549988 2364298 -3700565
771 657118 -1405106 1522118 -326991 -966760 4258568 378677 -6340214 2904642 59628
761 -510787 2006558 -477593 -7018877 3096598 -3438099 2970774 244345 576094 -1986061
751 4876236 923077 -3827715 -2232467 -2455867 -2757166 -2401996 -2383974 7135488 5203356
742 5203356 -935671 -1415905 3511345 578085 843162 1197204 -3741655 5574383 -371488
732 2433512 -962125 4008530 -2374800 6352821 -3189409 3000096 -551644 -1286200 -5563952
723 -5563952 263780 -669876 6284915 -3962384 -5553161 -184279 4891796 -2506194 -6774527
714 -6774527 -30769735 -6601590 -13284892 2251347 48235264 43081990 9041068 7948514
706 7948514 8312137 -17440770 -25731842 -45519367 -34696159 -36792108 -21204789 39610181
697 54100538 27772963 23796847 17933469 -27506935 -11632896 -1523500 -2619778 1834647
688 -1884143 -2917138 -2385938 3363972 1474080 798493 3838541 -1474046 431261 -3023149
678 2348315 -2471027 820369 5079709 11636133 35983293 -18406062 -31072248 -36562811
670 -36562811 -36549884 1020903 -32339227 -4630740 20597561 37196594 54819190 11188833
661 -7330811 -13179392 -6063616 -19912343 427920 -22387677 -13775549 -1633554 1566530
652 25052176 4503348 -788966 5208427 1289669 4338644 -5885807 169660 -3171595 4595203
642 35887 -1181658 -2669074 6263678 -1921373 3548260 508065 -1072241 -3102935 -1774775
633 -1774775 4676496 -207682 794554 -184302 -1302975 5461230 -1540346 671878 3819346
624 3819346 13403583 27250072 44017673 63491510 -155574704 -411271294 -118717424
616 252243565 149318148 16115237 14485111 6631303 7931813 4348278 632282 2791198
608 2791198 1877811 3427705 -5433079 1657355 -1502832 53128 2297361 310133 626698
599 626698 250729 -2018167 2514713 2931107 -640903 1716690 1223512 -2592676 2965055
589 -4974314 1781529 -3102707 762305 5892433 -2412616 854516 4546639 -498398 -1034511
580 -1034511 -53530 -1202611 -729559 2202181 -591720 1601056 -4877761 -3282687 1220361
570 1487039 -1422240 651910 812628 339388 556423 -2075116 4123119 562988 -907504
560 846445 3795841 -91378 -4040 2142553 -728794 1977222 -4135603 2802284 -769642 1052033
549 721789 6559376 395681 -2962704 -1924104 -264712 -3376329 1061837 378521 670342
540 670342 -1457779 1748586 -8762545 5040454 3144032 -1380827 -4638360 1228260 -354268
530 3650342 -5293039 2057193 2459077 -2198734 -4204235 939991 99830 44902 -1471159
520 3218109 -1631673 1922783 3625868 -2043299 -2491002 3913285 2898783 -5251427 2718006
510 175327 -2715072 -2392182 -1893987 4302453 2888580 2364017 845004 -2722188 1468812
500 -1122281 930390 -2535709 671109 3460984 -2170240 1404525 -2717707 2106034 1028523
490 -1434884 -1441664 -3876732 1104509 -1129625 -494647 3771070 6396837 -8891195 2244585
480 -4574148 1067473 3046099 -2251703 4582999 -1643283 1625111 -1282008 769288 1949618
471 1949618 -105953 -4567940 3472539 -241504 -798879 3681275 -2227734 488167 -1060567
461 2143143 2187486 2999417 -4142648 -388968 -1372603 4996888 1406504 -2358852 -1351370
452 -1351370 2265282 -597414 1081046 -4837618 3170257 1076972 2965812 -7680980 4230620
442 -296206 -547484 -344874 -3185830 3467666 6364099 -718809 597784 720706 -1572099
432 487352 3683996 -1776713 -2319071 4947675 -1512377 1030657 5821011 -3576658 -318618
422 1935353 2034520 -102395 -1525189 4811944 -917044 -1380239 -1005126 -5079521 703677
412 -1754767 82939 -2401366 2317415 -363346 2659199 -800817 -3042563 1188092 1450898
403 1450898 1606639 16100 -4943831 2742737 -63033 -670528 3010643 -2813389 596117
393 1702052 -3519224 -268432 3491102 -4456072 -3143901 -2400155 -3719791 576862 1185433
384 1185433 -674078 -2698291 1114163 50402 1075654 -4034624 519663 3327210 -2055240
374 -1781286 -402475 1250424 -2984778 -1428148 -4404352 2509020 1085166 1875571 326977
364 -1216692 -2218029 3207147 -2031547 2823180 993222 -1654412 -3515727 2542526 -1253838
354 3648565 -1437258 -1714145 1580235 1568004 -260930 422094 -5667893 1069843 2200172
345 2200172 2707009 -3789413 5568105 532720 -1473802 -565461 -4685837 -815056 187139
335 -5175074 4361119 -1523441 -1994391 1445935 2330567 -2192096 -529094 -7147096 1974703
325 -1569553 3392988 -1062984 3272465 -484176 -77702 413168 787297 -3516972 646483
315 -3525094 3602448 -2116178 -1544867 -94186 -3595517 -2095500 2646104 -5360377 532700
305 -889739 3202997 2170825 -393708 1017559 -4552550 -1143856 1599657 -4243875 -2301939
296 -2301939 45753 -2972194 4847645 -1603953 -2772969 2325123 -2555717 -1377988 -295163
286 6956559 -830527 702121 -1613275 2998194 1119 732188 470841 1029237 2036050 -4994381
275 508041 6295922 -2678922 -3175336 1537472 -504675 -4749561 4940334 -903889 -1561176
266 -1561176 -1809056 -1080913 -2827387 1104933 1766230 3111133 -1169731 3479845 985914
256 3366539 -695697 -3743453 -2033088 -586258 1141789 2864609 127329 -282644 -4125764
247 -4125764 3328379 -1786073 7130694 -655283 793428 -709384 9255394 828927 -3991849
237 -2345995 2134323 -5312218 -4188033 2140815 -635652 -2771556 -2094963 851819 -3796939
227 3497211 872786 -610360 -2860203 -297482 1057644 521051 4628859 265713 2456565
218 2456565 -457920 -3826090 279289 2203008 -607805 4732515 1281883 -74787 305722
208 390577 -726752 1363694 -937726 5787524 -5803338 5171804 -1280441 566533 -2213081
198 -46694 792481 27187 -657008 3624043 594206 813700 -20024778 -63195121 -214846580
189 -214846580 52245050 102034758 213916057 162955014 147773650 -30091617 -109630108
182 -109630108 -185778567 -126815660 52373063 9718115 3837646 5357380 1671926 1177328
174 1177328 7767909 -114923 2712650 3255161 -359434 1097400 -796176 1765495 -1388660
164 -3175384 1110105 9187203 -2886960 479122 3412258 323435 -1019732 -1179712 -262611
154 -750536 4262023 53190 -1359103 -2096378 -821772 -3439560 3738732 -4534110 6059447
144 -2108277 4186379 2832588 -1643220 782810 -2453097 -1484357 -4588779 5880282 2147894
134 -1445727 -1512797 3012913 3570575 -331679 451664 -689874 -1775657 -6666888 1439835
124 -45488 -2479972 1056260 2275477 -5655257 -171651 -1599736 3632937 210754 -2906531
114 2761929 1907179 -1071115 1144253 -630375 4387872 -1041351 -465344 -1992953 4737663
104 1024610 -1706203 -8282519 4626433 1708295 -2700297 -2338682 4964253 4536237 -216281
94 -1990954 1599706 918944 -3809926 1361665 -8831 4559216 -725811 -4795682 -738664
84 1075270 -1052510 167653 -2966265 1256437 1866071 3176302 5074728 797116 -652115
74 1096647 -3977067 4437580 -588383 -2181378 1996063 3472989 -327213 11485 2143101
65 2143101 75966 -2169982 848996 1486719 -3764883 -1339763 -952599 1504267 3620665
56 3620665 -4970263 1448885 -740918 -86188 1294592 2887500 -4128479 352939 1342389
47 1342389 -2297662 -1547518 -3344237 1272960 -1377129 -949456 -3470598 -249029 -805443
38 -805443 4026903 -21405 1354232 -2912320 -871780 350880 -412290 -32149 -1150592 624840
27 -92856 588215 -1517607 -2906236 1145156 1528436 2741485 -1499708 607104 300289
17 -3272407 753337 -1824138 97127 -699979 1024004 2353265 -1966324 642559 2684467
8 2684467 5603307 -3636407 1516096 1021621 73261 -1381312 112817 -1649642
##PAGE= F1=5640.578599651
##FIRST=     21204.543296753, 2686.85945900537, 2073962
##DATA TABLE= (F2++(Y..Y)), PROFILE
2047 2073962 1211040 103988 1685666 -4279523 -435409 1922035 -450228 752577 -2564108
2037 -1012865 4634209 -251976 -2056181 -1431288 -74537 195970 -561531 -1308924 -963940
2028 -963940 2104776 1997625 -3635479 -1590434 1712059 433520 4211641 -4489048 -543388
2018 -2332657 838055 3633097 3816 -2287442 -4326481 4056311 3063018 -5134286 522638
2008 -890746 -2312643 1021868 3957571 11499 -1121372 400635 -628567 459427 -4547028
1998 395774 -3534300 -1714324 -4050571 4964508 259697 1023854 2876782 -4094827 1305876
1988 -908268 3144946 4624869 4654899 -2952584 -2786696 -5131020 1938234 -1390922 4300051
1978 2260080 -503913 1270028 -1530715 -607371 -1430899 -483372 87164 5326701 -505347
1968 -3778506 7351312 -5410934 1005963 3137172 -2866225 1407558 1309855 841233 -1556353
1958 -2014848 1934119 3830231 -2153913 1580208 -534525 2074507 -1153115 226957 -2134613
1948 2501166 398525 -3521682 -875278 -1420701 3010913 3442575 -1857150 -961614 -4733047
1939 -4733047 1157340 -2109536 -1571486 -842737 -382374 -4162132 585414 -3806353 -548927
1929 -917001 5333846 374681 -417492 2322061 -1638998 3981824 -6196551 -176056 -3217046
1920 -3217046 4683918 -2816382 3919110 -2189776 -745774 -1985724 2944444 1717726
1912 1717726 -5606152 1308464 1661577 -63971 911714 -2610897 7568987 1403271 -130162
1902 2349333 -2384135 -2912876 2852994 -4152156 2559766 878875 -2444487 6249839 -1839360
1892 48502 2523112 1326756 2230253 2099268 -1076465 -3468215 2363925 194597 2409442
1883 2409442 -1258750 762401 -986241 2751629 931900 -402661 -1403744 -1863996 4331583
1873 3651169 -995163 -1018966 -1408363 2121618 340291 435435 -2162385 -687849 -257817 1441843
1862 128202 -1637050 -567198 4150893 1820859 -4073449 3961119 568049 -3361844 2245420
1852 -2630708 294959 -2619342 -4161976 966619 4647189 -4139911 2570817 -3709895 -5103909
1843 -5103909 84772 -895108 -181791 -1952562 -939385 -3428137 2156306 3122692 -2580288
1833 584127 -2461179 -2256953 3551773 -4246992 -898625 -799996 -3500492 133105 -1482536
1823 5959396 -1592229 -3872325 -1208164 -876929 -6620362 3393281 -1470526 1092449
1814 -4728035 2938865 -5364214 2191085 2374938 730003 -1927502 1302772 -3532413 2802148
1804 1399689 -3178589 -400125 -1381133 262930 1642638 -59369 1105123 2420777 -3340939
1794 -1815435 -329920 1198483 -2016982 688796 844546 -663879 84666 4976705 -6201662
1784 -549437 -1941945 268476 4889353 1221163 -3548526 -421257 -1251572 3866167 1380317
1774 -7583498 626043 4960274 1871935 -499220 2792189 4919049 -979160 3277457 -2971739
1764 646883 -3351146 2532058 -1650599 958598 1571166 903063 441192 4059115 3656941
1755 3656941 -964765 473949 1505984 685332 -3898985 -2396627 432914 158236 -546587
1745 1340268 1369906 -5931307 -60397 2272247 -1107265 147876 -1012724 2196672 -2192995
1735 178036 -2245993 -1259786 4788743 274890 -161735 4759958 1256885 -787892 429559
1725 3699599 2825795 -3052328 -2325043 -7774522 6379440 -1706908 2047238 -838810 2571874
1715 -8250070 2705875 -1737321 4666618 -2479503 458969 1187289 -1240814 -1023991 -2675701
1706 -2675701 3744795 3444766 -5634270 -210852 -3654248 3357838 -665350 196780 1235890
1697 1235890 -2316785 -1930687 1577579 2111255 -2439691 1045970 -44234 1290271 -1165150
1687 1057096 -4678879 -2350186 494045 -472279 -2331834 -1236750 5497254 2768392 -3058499
1677 6282528 -372483 3300756 -229435 -2658419 -1102784 -4784181 1718321 -3858794 -1200937
1667 3119602 1746595 -5372881 722500 -2047600 3611978 2071419 -2251852 -231018 491702
1657 3889535 -4034003 4059001 -2135088 -851883 1410413 4563038 754978 2425596 2039498
1648 2039498 4768418 -1324947 -1275162 -551216 -517085 -1236856 -2981296 -3238869 5835489
1638 -1574915 1421613 2252710 -195458 -196089 -4740391 2577962 1651319 680877 486339 813611
1628 813611 958156 -1767626 3310675 963586 -1393386 1862351 -1149033 1733958 -4744505
1618 -3324149 2292925 -547742 649439 -453246 -990447 -153418 781872 -2442309 -3199573
1609 -3199573 4113739 -670548 -5725435 3941526 -1082153 -787472 -617475 2771666 -2626264
1599 -3698498 1710290 -2531091 2729901 -918544 5192134 -608088 -2040332 -1587272 -1598110
1590 -1598110 -314728 1970943 4479113 1883392 -453797 3746120 -1017178 5555290 1630316
1580 -81725 -3171275 -1703040 1262498 -280749 -2275729 1622497 3856332 -1663467 -1644823
1571 -1644823 -1307609 1741019 3290217 -1583719 3763676 -4672556 1014340 1090328 -306786
1561 3189904 2764987 75907 1944629 -3510385 190729 1398933 -3178389 -1938705 -1356293
1552 -1356293 -502646 -3494421 61985 1125200 -2441019 -674889 -1148149 8234480 -3606101
1542 797470 2602459 -2798116 4963587 -3570146 2205077 2546421 -3355307 3055671 1039891
1532 -2086706 -2042065 -1242328 1696410 -419247 2689578 235734 -3733932 7366090 -1038926
1522 3191990 700089 -1211388 530428 935598 589267 -2954308 -2474154 1635790 -3874826
1512 914532 1083884 -3398961 81843 -1892647 -286903 -1722483 -5489806 4685265 3098306
1503 3098306 -1842509 256164 1855784 82734 1024643 1664872 -2748821 -2270625 456938
1493 -5719142 4030540 1431997 3319900 -1622961 -4234206 -523324 -2122036 -2646672 374743
1483 3857603 253179 -671508 334032 780075 625413 -705942 -3604610 2548974 -1030402
1473 5956200 -192005 -1153896 2222881 -1114348 1438791 -3159800 4478414 218849 1096633
1464 1096633 2093139 -2116166 -635611 -205254 2577227 -467279 -816026 2575843 -1820681
1454 382298 764563 -1855931 2248540 -2201273 -4074779 5338759 -2601344 -2800936 -1967741
1445 -1967741 -5091019 321737 2493904 846962 -1146555 -1925476 -1401606 -693828 -1492011
1436 -1492011 -2028907 2949529 -2904195 2869331 -551891 -1480827 2899278 -3607413 -5872225
1427 -5872225 -344477 2338670 -1511621 6200417 -4492428 -940177 3372914 -1682879 2384865
1417 1676676 811718 -428782 1648610 1464837 -161466 -306328 -577198 2493878 1572587
1408 1572587 -2620437 1858337 -2074540 -1960703 267008 -1924681 814551 2440694 1795199
1399 1795199 -48354 -3625885 -869136 -41837 3964140 -8083823 1214034 1680885 141558
1389 -188845 -2994786 -1486521 4428930 -3147287 -2228856 1116373 773390 1174762 -1127370
1379 421007 -924483 1969555 738097 176174 2350962 -2446049 5912709 -830345 2276422
1369 1746511 4209303 2214869 147905 -2848233 4674374 322027 -1490760 -3389387 -594947
1359 2757697 -2502119 407200 -504672 -2105159 4654240 -2902113 129814 -1105611 1789186
1349 -3048019 1280566 -1780560 4227308 -1662634 -1329810 4435730 -2944528 2959473
1340 607732 397749 -4420214 1002934 -333884 2977270 -3336126 700225 1355804 -1848891
1330 -841413 -626758 -1499640 199255 3682864 6434017 -3158770 6188212 -1519263 -376013
1320 -1541463 -1685683 -3556214 -4636789 338908 1500702 483259 -215153 -2821108 1598483
1310 850290 -4607655 -478539 3054715 -2297425 1205838 -1194103 -318069 -3951419 -2909563
1301 -2909563 -547765 357928 6645953 -3817567 -3980088 2543808 -2267301 -3746408 -2333739
1292 -2333739 266021 -1180691 -4587414 -2162847 3927578 70114 -1665333 2592457 -426211
1282 2446 -1250703 1503008 6101117 -4087555 1671446 422891 -1519761 -7346416 506601
1272 1518311 2246566 3858509 -1125847 -799355 1356358 337258 -5839044 -2831576 -2836469
1263 -2836469 -2157580 -4162355 77155 -2774829 1415462 968880 -188761 -652197 1111719
1253 -660460 3725576 1587346 -5600504 1320108 -2037058 1485920 2887538 -1937453
1244 5496220 349490 2106361 -2860016 1511682 813145 1174550 -556393 -473252 -1179186
1235 -1179186 -2349836 2256718 -1192755 2669439 1621023 1481350 1512032 2780980 5508824
1226 5508824 -1580507 -6667196 761150 -3896210 2404626 1839961 338999 -1192020 3217416
1216 -118719 -3270083 -2995441 1510193 -3783839 170200 -855986 3695553 -7178597 -803586
1206 1719341 2938429 -2258746 -4822694 2521816 439544 -1145733 4062741 -1347516
1197 -5734676 7124904 2043530 -3141391 -7831348 3727016 -187328 6508743 -1473158
1188 -1549499 -2085027 2084749 -572242 -1115060 -3809854 466472 -2006750 -1198316 2619203
1178 933878 -6068575 1666366 -2976840 2017758 1098361 -3086736 -779337 -194908 1776893
1168 910055 -282202 -1521580 2807411 -1985849 1838602 -485774 1160235 3338541 -1404631
1158 3171072 -1642454 -799986 -536848 -2323976 1382196 1276858 -4900021 2952110 1799205
1149 1799205 2606961 -1338391 -3440654 3873024 2137837 -2608617 3012315 -6057 -748030
1140 -748030 -953453 277450 -2535512 5804552 -131074 2323641 -1155837 -1337193 -270366
1130 -766688 127185 5285519 -187741 -462357 358186 -1318025 -895999 -5313880 3855549
1120 -2689551 -2155661 4163219 -3863054 -2555888 -1403177 1267376 -977994 3423234 1031127
1110 -208056 -3456893 1522564 -751674 -719964 -32283 2673415 6119280 445643 -2257233
1100 2441906 -5392 1876790 -2448386 168044 -30321 4740951 -4214345 3468694 3583326
1091 3583326 2872392 -678727 -3135363 -2448438 1358951 -1362044 -3473272 2960104 -1817553
1081 -3629469 -521832 3146898 -2049765 -3023488 3756259 -1823891 -3776392 1626782 -227707
1071 423345 -3205631 -4139488 4613621 56078 -3931742 1538444 1559538 -3928040 2590221
1061 2707127 917858 -1217281 -673283 -1305335 3469170 1697009 -1936918 -1869 776847
1051 -1374509 1324401 1408230 694805 -101180 -3596790 602700 -52998 -2302459 1605829
1041 2910664 -1977232 725841 -1972409 -910077 3179637 1872178 3927779 -327649 249745
1031 -436086 -4434901 -1209353 -619228 -1279563 -985045 4613571 -2688026 4170818 1438747
1021 -1327329 313282 589886 -1150060 -1220772 -1122390 4618001 -3543087 -2527895 807528
1011 -5092348 -870725 -536763 3605932 -2568744 909383 -1324454 759878 -137519 -1548691
1002 -1548691 -3435714 1127434 -513007 -134886 1517576 -2500742 -1272565 -958021 2299890
992 -964950 -918223 -1983819 -3352344 3323446 647456 -1109427 -2381918 1130885 -202671
982 -495337 -2729746 1977943 -540692 534439 -138420 3631931 1570925 66084 -872053
972 4583325 2535403 -218894 3561993 -5598045 1365223 -2592790 800898 2222149 2603569
963 2603569 2994332 1284404 -1435456 4336262 2700815 617820 835989 -1900341 -1824288
954 -1824288 2060411 -670438 1467199 -1571085 4002920 -5678596 1898803 -920076 2833735
944 288900 794053 1886010 -5039956 711058 984818 -1475142 -148917 3134174 -726325
934 -312220 4170514 -3546826 963377 4774788 -547735 -1542843 -2952337 704067 4902466
925 4902466 -1603488 1685438 -5005305 -541157 709119 -3293602 -1657784 1967192 -97021
915 2923598 108909 -1412414 -3579549 61487 235705 -3820792 -3040721 -2346898 -541648
905 1792901 -2583132 1235097 2780871 869321 -5967724 5279921 1149833 -2373858 -3824849
896 -3824849 5282667 -2372879 3237321 -990602 1667071 -2157143 1511569 6056672 4335249
887 4335249 -4955126 1826066 2488604 216567 -1245389 3675513 -4539011 2294487 1697376
878 1697376 -142264 1324091 1352812 -3651993 -1318450 880009 2739046 3964303 -7175338
868 4779808 1921884 318898 -1991800 1446341 -1006313 1817742 -794802 1827707 387186
858 -583223 -3028009 -2221572 -1424149 -3146793 -2517608 3690127 2323850 -2758174 2245815
848 -1169899 -1531153 2421482 -7746984 162514 -51629 -1405261 -1561026 6104494 -895912
838 1910762 2459021 -1032499 -2089991 404774 -1161258 -4148253 4507656 813915 -1475835
828 -3200558 -1596728 -2363507 -201927 1107897 -3254650 614141 663988 611228 3464893
819 3464893 1164985 -1175174 62910 -1014451 1686884 -641062 3226059 5811688 -3427922
809 -169132 -322506 -81911 790444 3006762 6938796 307277 -7727341 277842 -436490 -3127850
799 -3127850 5392810 2278488 -5054855 3350926 132555 -232591 2055997 -840906 -1330319
790 -1330319 746823 -1991702 2495205 3731378 -1671965 1957636 -2056158 1121483 845971
781 845971 -2808282 3778900 -1050339 -1532506 -4813037 -1667282 -1895872 3495439 -3795656
771 350895 -1305796 2346624 21775 -1283089 4228408 720384 -6273464 2979942 -381540
761 -575388 2186874 -687084 -6473424 2589486 -3201061 3305621 430689 245394 -1304728
751 4739879 475790 -3474035 -2064822 -1828744 -2694537 -2503584 -2960534 7160907 4288323
742 4288323 -611905 -1988307 3589113 57163 641558 730428 -2832185 5387485 648180
732 2177526 -1195508 3789123 -2088463 6483190 -3238919 3802097 -1331444 -1402516 -5032402
723 -5032402 -83519 -889281 5860822 -2952740 -5452345 14005 4842397 -3259757 -7551618
714 -7551618 -27761807 -5351409 -12356287 3456581 43171489 39141100 9025806 7050330
706 7050330 8429802 -16403382 -23786211 -41917151 -32096073 -35289020 -18747157 36855725
697 49538806 25882800 20951612 15785459 -22815384 -11817524 -1580594 -2668263 1422444
688 -1473175 -2706012 -3243834 3760990 722308 861738 3760197 -889998 875541 -3175233
678 2125404 -2697032 1456375 4513852 10825946 35031629 -17719071 -29310243 -34837294
670 -34837294 -34004733 1073018 -30032608 -4906462 19810037 34039177 50299616 10159298
661 -7303416 -11439030 -4398940 -19796132 634869 -20375907 -11751149 -2707613 999408
652 22747965 3637331 -665929 5230928 836772 5148243 -6088873 286013 -3074166 4967647
642 385913 -1335828 -3109520 5153195 -894317 3266715 430717 -761882 -3221103 -1844551
633 -1844551 4672966 -40520 -454254 578585 -2355552 5253524 -927134 -416855 3397339
623 13307841 26818080 41397315 56361651 -143978862 -372568120 -110406673 230994564
615 137763543 14523113 13296452 5417637 8512786 3461806 586884 2025402 2540197
607 2540197 3288756 -5924280 2135059 -1700219 588333 1566526 -309100 1220631 -234393
597 -2038736 2628933 3693602 -310356 1630771 -37691 -2649077 2479240 -4274813 1956334
587 -3005696 582331 5826293 -1793995 220295 4874472 -1512438 -318157 -515998 -1198887
578 -1198887 -618980 1527469 -1360645 2325873 -3948639 -4175497 1544521 1210599 -1700345
568 538586 843554 -52465 1296679 -2163873 4410563 723004 -1718662 1812936 4148966
559 4148966 14598 -884417 1918390 221326 1497956 -4055958 2815006 -510860 764289
549 1219557 5662572 777021 -3240852 -2539348 -47314 -3959311 1131129 -73776 929953
539 -1384689 1864096 -8549238 3461350 4407425 -909593 -5147940 1921380 -252041 3520992
529 -5620031 2520189 2950048 -1790680 -3859260 1200697 474659 -111710 -567631 2257938
519 -2163352 1664994 3934401 -2599797 -2294721 3739341 2940316 -5246574 3376161 -836652
509 -2571498 -1798321 -1796476 4431806 2921155 2239936 1579177 -2963865 1186809 -236411
499 1035132 -3233694 681586 4049065 -2351185 1117960 -2457694 2552468 36059 -1322126
489 -1946936 -3797385 1189641 -1155775 -1192984 3956852 6198652 -8315274 2233012 -4796852
479 2283323 1595361 -1211683 3693472 -1431896 1530301 -753544 598944 1261338 595758
469 -4773650 2877893 17551 -894711 2996169 -2002931 175875 -1202795 2475930 2179001
460 2179001 3509367 -4481328 66852 -1731233 4725713 1067311 -2029934 -1389982 1812494
450 -336422 682298 -5032707 2258861 1346220 3421367 -7276776 4491997 -380043 -697436
441 -697436 459592 -3478384 3399188 5938583 -941332 810777 337360 -912178 478372
431 3840419 -1932233 -2260989 4615612 -1301926 707321 5930710 -3615966 -494496 2421027
421 1928056 -928851 -1534893 5618894 -490654 -2286434 -1489903 -5005093 376599 -1253267
411 60446 -2612831 2782362 -572949 2261928 -827231 -3663564 887856 1818584 272520
401 549284 -4510015 2966134 -106326 -1782219 3049331 -2817204 243588 1491846 -3393611
391 -658761 3447097 -5494367 -3270187 -1828007 -4794331 1150950 708564 -369984 -2952229
382 -2952229 2266625 990337 1283396 -3961880 -185173 2812293 -2039455 -1663014 -1620158
373 -1620158 1339347 -3649413 -2424993 -3922369 2510537 386925 1908283 745132 -813302
363 -1918277 2973414 -1859161 2481909 1156813 -579817 -3684717 2771797 -1925719 3092042
353 -2124645 -2163492 2280727 1374708 77494 376211 -4405246 1034853 2351231 2293309 -3211539
342 5017221 1095004 -1915317 19054 -4828098 -420715 -311255 -5535141 4711708 -2282522
332 -2441263 1550397 2421448 -1946879 -427859 -6746208 756517 -910984 2845829 -733974
322 3190158 -805822 -418264 306944 1341199 -4065276 1256255 -3494141 4138304 -2466401
312 -2168124 447878 -4182318 -1853719 2840292 -4887814 -707693 -58459 2499114 2106212
303 2106212 -419396 1102948 -4362909 -1157102 1661960 -4866182 -1926668 -343093 -2739169
294 -2739169 5010222 -2143929 -3324895 3166796 -2017445 -798437 -80805 6838146 -420944
284 -6992 -1491457 3529095 196333 394326 453172 1009242 1917847 -5172574 167293 5987490
274 5987490 -1337647 -4382365 1692446 -119831 -5272179 5725982 -1595970 -1642505 -1295338
265 -1295338 -1334631 -2572978 281695 1849851 2358841 -1420499 3962070 1757188 3132126
256 3132126 -751951 -4042936 -1646194 -2088865 777360 3551710 -297532 672312 -4214937
246 2509330 -656800 6345700 -293923 440538 -1502763 8056453 767363 -3247407 -2308928
237 -2308928 1914467 -4968307 -4499104 1901195 1360024 -2587169 -2688914 1831213 -4651904
227 2827432 669056 -132373 -3133618 402674 1229675 961056 4249915 498795 2751192
218 2751192 -136253 -3874058 835562 2494454 -1440265 4179317 815303 -390094 617273
208 -77274 -361799 1757034 -762097 5653684 -6013137 4697732 -965985 971135 -3013518
198 -79870 168034 158013 -367455 3284974 797546 1018544 -19671490 -58584439 -197448756
189 -197448756 48676427 94354981 197371960 150705201 135026263 -28091609 -101229725
182 -101229725 -172319331 -115544308 47646022 10662300 3609360 5842667 1463863 1382319
174 1382319 7836969 -812422 2200703 3277191 -620791 1363418 -621888 2150852 -196603
164 -3313602 623690 8856037 -2829758 196177 3620894 136968 -464574 -1189113 394379
154 -665914 4200280 330235 -1056611 -1781780 -329067 -3363043 3538887 -4359854 5532872
144 -1909824 3327312 3007278 -1849408 821902 -3119350 -345534 -4257271 5258256 2370846
134 -1216278 -978927 3093288 3216005 -263139 -161433 -1117951 -1938925 -5896568 1047299
124 -843761 -2297844 113109 2198266 -4723503 -39612 -1687019 4322464 190638 -3522235
114 3018589 1743296 -784134 786029 -657173 4461388 -715721 -384655 -2456071 4768729
104 1277811 -1527594 -8342702 4736221 1831846 -2236196 -2496882 5295592 4294446 864509
94 -2538279 1817697 583301 -4096686 800588 436649 4380551 -335598 -4226337 -729249
84 887232 -1425337 585050 -3292725 1217066 1732533 2559570 5261409 -403727 126408
74 597847 -4014752 4641592 -1210065 -1554672 1604821 3172778 -11065 143088 1594931
65 1594931 329319 -1800801 338055 2706531 -3849835 -228146 -748870 1631000 3639983
56 3639983 -3948494 1713865 29152 -247728 1927964 2743062 -4281123 1128000 1529448
47 1529448 -2290788 -2454181 -3544559 1400932 -1498177 -948025 -4104794 149060 -929715
37 4162522 -883691 1786982 -3506442 -226323 503417 -138537 -374323 -1010092 196460 -273371
26 1563685 -984859 -3469789 536709 1691037 3110445 -1466385 913329 -616185 -3454674
17 -3454674 1716674 -2767721 269730 -582709 1557062 2069175 -1751977 700432 1901655
8 1901655 6577723 -3966372 1305920 1116585 670699 -1290431 295635 -1642914
##PAGE= F1=5618.780329767
##FIRST=     21204.543296753, 2686.85945900537, 2055386
##DATA TABLE= (F2++(Y..Y)), PROFILE
2047 2055386 1515252 108231 1596953 -4894942 -777482 1088432 -793627 748031 -2139091
2037 -1348343 5667157 -363571 -1898107 -1671803 -61831 1037763 -325187 -1605817 -831965
2028 -831965 2113266 2230413 -3118101 -1996070 1412970 30194 4142733 -4453409 -1159089
2018 -1940903 1139416 3390282 -461790 -1782691 -5260510 4160839 2765492 -6708696
2009 996462 -575270 -1698251 1221100 3538706 918875 -1572771 1437797 -301004 51639
1999 -3737528 392087 -3616738 -1783248 -3694839 3550683 -360196 735529 2791407 -4030805
1989 447624 113457 3350747 4263943 5048022 -3449411 -2671787 -5157087 2427562 -952417
1979 4635112 2080755 -540255 1368811 -1713927 -817137 -1971951 -159175 850708 5304798
1970 5304798 -118156 -4059520 7025603 -5290432 1018315 3021021 -3906139 988697 1777859
1961 1777859 1545633 -1620695 -2537509 2248731 3631632 -1866467 2075723 -1365604 2495146
1951 -2012507 -393190 -1834861 3570644 216699 -3004718 -852454 -980576 3719608 3242336
1942 3242336 -2329222 36578 -5097519 783942 -988234 -703855 -722719 789357 -4266617
1932 -34526 -3695081 -500714 -1254333 5200543 85581 -395749 2006436 -1650046 4096418
1922 -6663949 270335 -3639614 4390484 -2596065 3293536 -1104690 -771388 -1699407 2082735
1912 2597918 -5966210 1774369 1064971 390410 820138 -2361536 6521989 1129797 -546646
1902 2976200 -1997105 -4100795 2294054 -4224973 2732816 649017 -1851984 5578243
1893 -2013748 -809623 2990261 424170 1618700 2017375 -1614118 -2832591 2493442 270546
1883 1923069 -2293271 1297288 -1389674 2724837 313991 -778829 -1371147 -1908491 3846804
1873 2752414 -1399364 -1025654 -1292876 1964097 717883 370028 -2021559 -1133030 -906711
1864 -906711 2147426 149521 -1791042 -911020 4619505 1614329 -5031833 3069644 825936
1854 -3544512 2646590 -2725085 978810 -2711059 -4431684 977059 4928191 -4278164 2131451
1844 -3418219 -4961207 9026 -1398615 -831320 -2059142 -809887 -3376402 2503518 3215669
1835 3215669 -3099453 274622 -2362843 -2020125 3810421 -3695425 -1488806 -172555 -3200309
1826 -3200309 46872 -1831997 5914557 -910040 -3975960 -821868 -545749 -6658652 3908605
1816 -1983447 840404 -4672646 3113752 -5263645 1140506 2668056 271922 -1138320 1568714
1806 -3633515 1873329 1316646 -3474164 510420 -1682945 406822 1454473 248053 -45998
1796 2156630 -3792335 -1317156 85039 1115505 -1245927 1020712 544423 -500346 475485
1786 3594653 -5778877 -361695 -1456959 187505 5190009 172644 -2718147 -960644 -1440608
1777 -1440608 2936498 2489425 -7419314 560803 4785692 1236970 -228457 2831027 4687983
1768 4687983 -1023216 2834528 -3102339 1169269 -2943570 2461616 -3450037 910893
1759 2027989 -92189 195094 3838154 3872833 -807835 -66486 2064358 -127834 -4124043 -2012747
1748 623620 40289 -848776 1347993 1437103 -5552909 -262448 2045679 -1440955 98559 -719930
1737 1331707 -2468159 754118 -2536393 -1449384 4769943 -424943 278902 4231245 1918360
1727 -992692 608934 3235796 3464407 -2580477 -2316817 -8631354 5709243 -1600081 2045760
1717 -1283817 2461108 -7733091 3280871 -2343386 3636191 -1606949 -133666 1656977
1708 -2006294 686620 -3510234 3788888 3141713 -5363981 -157390 -4676555 2935449 -152515
1698 -64502 635993 -1621515 -1489777 1620484 1613586 -2788683 1735157 439064 1204134 -1682685
1687 1141661 -6466002 -2614642 735619 -1292959 -2120108 -1675409 6085660 3440952 -3461008
1677 5323325 -768400 3083692 91785 -2584496 -1828473 -4035279 2174329 -3870718 -451663
1667 2744687 1361236 -5307172 799170 -2158998 2830643 1461734 -1750646 -163251 1017434
1657 3771222 -3993855 3032198 -1948529 -870688 564025 5249074 895735 1716173 1691752
1648 1691752 5245663 -1654799 -544268 -750653 -431340 -1458292 -2411028 -3317191 5418840
1638 -1766988 1479625 2064752 -944195 923078 -5239278 1687428 1877679 241625 456343
1629 456343 1121546 596408 -1736908 3533215 1280158 -1669596 1840239 -670144 2004631
1619 -4890796 -3642569 1826932 -589058 1041611 -1128720 -426606 -212206 828297 -2565376
1609 -3671800 3808844 -557068 -6033035 3624068 -1826728 58689 -508282 3247349 -3345482
1599 -3893361 1689218 -2253220 2357593 -661513 5091120 -1127876 -2195808 -1093998
1590 -1462750 -243745 1242422 3996607 1880681 -956529 4323036 -720404 6114339 1178326
1580 -240506 -2543790 -1793727 746903 -235425 -2589512 1718594 3657695 -177192 -3083620
1571 -3083620 -904036 1226947 3618648 -1887353 4121989 -5276310 1075964 171569 229269
1562 229269 3156624 2031047 -594170 2686084 -3493553 -565056 1647626 -4323713 -1369503
1552 -1175199 -961987 -2240254 495457 980602 -3319931 300397 -1394466 7456611 -2870452
1542 744638 936789 -3336583 5614548 -3941373 1503949 2265051 -2557684 4089697 895681
1532 -2559234 -1731087 -928837 888092 -1139002 3181920 -233281 -4506682 7467428 -168033
1522 3228323 273800 -1172276 -50572 895860 546192 -2679024 -2214556 2328794 -3648148
1512 942770 960705 -3190802 53309 -2001922 -846570 -1955799 -5620681 5245199 2256645
1502 -1932630 442947 2108403 -352571 771540 1955200 -3773653 -2208958 368267 -5519447
1492 4257523 1720250 2368458 -1463709 -4002146 -1465796 -2856694 -3679463 465771 3919936
1483 3919936 343218 -581464 799753 905878 571907 -1124609 -3662505 2884364 -975662
1473 6007829 554226 -806742 2175230 -862287 1251906 -3031525 4209174 -39666 850495
1463 2231455 -2185294 -436016 557179 2538881 -304122 -569751 3039504 -2263776 780599
1453 698039 -2190006 3076383 -2354026 -4714607 6021773 -3328114 -3012639 -1932841 -5283800
1444 -5283800 386860 1999004 845973 -1311840 -1818677 -973728 -537690 -950901 -2307259
1435 -2307259 2301075 -2359079 3004667 -471332 -2488936 3304536 -3994065 -5218729
1427 -5218729 -451474 2053737 -771988 5846780 -3727176 -1599214 3522207 -2001055 1759792
1417 1536623 384519 -1033336 1616653 2389309 -371766 1222 -780212 2359295 2592465
1408 2592465 -1625930 1457049 -1464405 -2182230 -509700 -1630000 827955 2810183 1592649
1399 1592649 -457241 -3390614 -1592480 1657396 4077496 -7381511 1047011 1586762 527484
1389 -281707 -3204263 -2682301 4548037 -3469630 -1973205 1161475 951894 766395 -968448
1379 270129 -684000 1734404 402179 -446485 1715419 -2801463 6050182 -300500 1744222
1369 2258864 4997693 1407386 -492802 -1474874 4083916 814570 -1514148 -3416789 536613
1359 2803584 -3018961 625222 -801741 -1714930 4281829 -2489531 -398038 141902 1576249
1350 1576249 -3618614 1611986 -956596 3553391 -1098779 -656919 3729928 -2409933 3521488
1340 -202425 95711 -3453785 1540259 -160332 3011338 -3419263 451844 1794935 -2091202
1330 -1246893 -615905 -1213567 -351058 4118874 6802648 -2082928 6042255 -1327691 -593111
1320 -1165181 -1706113 -3119838 -4277688 272551 1348903 967380 -482604 -2828752 922855
1310 1242138 -4190038 -1230391 3155008 -2895834 1198085 -853751 314207 -3734607 -2677688
1301 -2677688 -68076 -192280 6849879 -3445187 -4663584 1763674 -2039585 -3882000 -2296986
1292 -2296986 627556 -1097111 -3866729 -2253258 3339408 81863 -1441787 2954618 1003473
1282 -113057 -1718441 1443572 5053160 -2832387 1643539 581548 -1157184 -6741031 483368
1272 1691561 2542457 3405708 -670831 -1436824 2197340 74580 -5638881 -2276026 -2807363
1263 -2807363 -2704471 -3098003 191197 -2521801 1240340 1802033 -175266 -952402 1327605
1253 -121247 3007601 1872495 -5692909 1038434 -913586 1006081 2727309 -2669141 6425025
1243 312844 1690291 -3276989 2488660 676948 384569 -44011 -866508 -1468407 -1707532
1234 -1707532 1010836 -753169 2601265 2412335 2035468 1308320 2570233 5073253 -1085635
1224 -6219389 1073943 -3989088 2736488 1545495 520344 -1026779 2785109 -212403 -3296094
1215 -3296094 -3007626 2289673 -4225027 -242854 -1395663 3555508 -6171591 -1009053 945352
1205 4175878 -1569875 -3632357 1778507 70284 -898830 4091892 -171699 -5667646 6968747
1195 1818623 -2736741 -7209474 4145480 -19485 5857261 -1132249 -2199876 -1985481 1342541
1185 -35069 -1047966 -4265590 611511 -1483607 -1461372 3231189 848982 -5738325 2182345
1175 -3039314 1490875 1838567 -2581398 -1155948 -498690 937860 523523 -59973 -1681983
1166 -1681983 2315788 -1515839 1574603 -1027985 1208920 3436900 -1239585 3570974
1157 -1893070 -946017 -1044497 -2192531 1828381 1160674 -3758113 2469835 2109407 2681583
1148 2681583 -1726052 -2276036 3978431 2515505 -2467472 2708573 -1071833 -246022 -930108
1139 -930108 347745 -508905 6481296 -424656 2618487 -1572107 -2402234 708518 -417454
1129 -241813 5190161 -582232 -285730 807856 -1343528 -1124390 -5189369 4460153 -2404333
1119 -2382105 4438118 -4137486 -2964431 -987262 1613461 165498 2945966 523846 388853
1110 388853 -3499093 1936829 -1939480 -457156 717931 1864019 7584684 526206 -2172128
1100 2835968 15214 1115221 -2146132 -332924 3421 4354433 -4012683 2875728 3526194
1091 3526194 3076737 -504443 -2062541 -2471311 1685047 -1424710 -2858535 2797432 -2129006
1081 -3366132 123676 2456663 -2376916 -2589905 3216326 -305624 -4637257 1855055 131347
1071 467573 -2826370 -4135381 4027248 452011 -3809377 1724427 2446268 -3308581 2243630
1061 2861170 1427528 -1386879 -1716390 -1162303 3461337 1185313 -2330606 642875 -456
1051 -392313 1176427 505946 1237773 -204026 -3498096 740744 -170479 -2315552 1923640
1041 3247227 -1880940 506354 -2447210 -890420 3078671 1972272 4948654 -458730 -3948
1031 -413163 -4267890 -1596869 -186463 -658114 -1621881 5973550 -2650446 2834142 1563342
1022 1563342 -1182335 1215345 220512 -1465367 441630 -808105 4737725 -3123378 -2790397
1013 -2790397 1121409 -4141693 -1575759 -994514 3767176 -2317958 269289 -1550552 -564419
1003 496133 -1727903 -3472801 1397425 -107785 272078 1585297 -2780105 -1263429 -1186718
994 -1186718 1641178 -996025 -1526985 -1780912 -3159429 2558333 1106110 -1878734 -1880041
985 -1880041 1360645 25135 -323122 -2151858 2248722 -1326315 -15391 664805 3842496
976 3842496 1671571 150320 -641826 4911046 2023467 218660 3601593 -5255124 714252
966 -2295208 565967 2525107 2915774 2804436 2419789 -1321462 4579555 2277152 60198
956 562387 -1482670 -1926125 1825605 -449680 1226990 -1860143 4202641 -4975823 1658392
946 -1587573 3579122 837367 732740 1915133 -5351333 -172637 1636284 -1918590 -617155
936 3550879 -1344766 -279136 4122444 -3117920 1171876 4258959 -732463 -1318743 -2829805
927 -2829805 1373652 4341891 -2276322 1173291 -5522067 -159015 576841 -175781 -2530427
918 -2530427 2261964 -162259 2346974 585270 -1784945 -3256500 -153293 723504 -3194578
908 -2885149 -2736435 156108 1705214 -1903970 1010842 3027263 -34883 -5490957 4384818
898 909706 -2060883 -3544362 4830742 -2216571 2573285 -878686 2308715 -2176859 1829617
888 6122553 4632849 -5353650 1843358 2699280 389037 -1093884 3064577 -4859899 2267701
878 2114542 -430976 1452020 964871 -3290874 -1281118 709886 3394879 3103113 -5196952
868 4466040 2146268 453790 -2036681 1598966 -341522 1313202 -660084 1256208 -331110
858 523390 -2422497 -1872701 -1140632 -2718962 -3158903 4360642 2493257 -2231568 2400400
848 -1000773 -2484958 2775369 -7468084 103965 -257838 -2253348 -873437 6695352 -1303477
838 2678107 2105390 -517769 -2993311 689418 -1805631 -3289991 4293381 656428 -1022246
828 -2327585 -614919 -2695934 -604036 1498070 -3486766 307739 -183991 61155 3837902
819 3837902 1054233 -382294 -476624 -721211 724907 601646 3284834 5027745 -2770721
809 10733 -1165240 119910 1224934 2991191 7478050 473044 -8152512 305427 -120693
799 -3243892 5953095 1814270 -6018082 3152557 17798 -33687 2610746 -1390542 -1188834
790 -1188834 1299408 -984830 2439674 3804193 -1102965 1536392 -1919463 1293528 492794
780 -1917148 2478266 -1044099 -1808036 -4952971 -1304951 -2071984 4529952 -3866385 191179
770 -1151075 2953737 428770 -1607151 4304668 1010595 -5869357 2938992 -737078 -537478
761 -537478 2329174 -807071 -5411531 1876508 -2892130 3522150 658859 -73164 -519592
752 -519592 4542337 24725 -3061095 -1756047 -1189340 -2468400 -2435805 -3456403 7215043
742 2838445 -259579 -2448803 3610518 -466930 314037 334823 -1810207 4922493 1505561
732 2012931 -1321596 3478480 -1686012 6484434 -3122241 4397723 -2134891 -1561103 -4229481
723 -4229481 -318282 -1047150 5230914 -1782106 -5197491 304937 4705720 -3940876 -8057210
714 -8057210 -23179681 -4092519 -10998260 4718471 35647822 32892942 8221888 6069714
706 6069714 8142304 -14155054 -19903912 -36093246 -27077897 -31179993 -15562624 31539681
697 42067588 22877932 17139691 12767805 -16979951 -11427658 -1715848 -2560019 804093
688 -903414 -2484104 -4174292 4116069 -54830 846040 3513865 -281401 1411599 -3210938
678 1861606 -2827441 2188013 3738124 9341780 31852869 -15853215 -25358195 -30857569
670 -30857569 -29029113 930667 -25428435 -5054603 17761968 28638184 42066140 8732683
661 -6857874 -8979838 -2818640 -18193854 882648 -17542334 -9296885 -3684269 363312
652 19697818 2535546 -527712 5186352 390885 5652189 -5992405 395223 -2931183 5123766
642 706500 -1523908 -3504126 3943306 145488 2919106 361560 -304336 -3021714 -1818514
633 -1818514 4671374 28389 -1938453 1445466 -3382913 4863295 -164326 -1326102 2863625
623 12035812 24613207 36319989 46296200 -122020515 -309791366 -94590430 194565043
615 117348580 12115417 11061475 4018448 8664865 2618021 520972 995043 3247830
607 3247830 2952605 -6346147 2496621 -1876620 963299 907165 -952131 1676993 -753133
597 -1898631 2842547 4247863 136899 1442136 -1443413 -2580847 1966339 -3550707 2034662
587 -2653651 344394 5514872 -1107535 -317834 4889367 -2517773 450669 -956027 -1256688
578 -1256688 -472430 1076817 -2305124 2834707 -2998885 -4583813 1858470 874075 -1965477
568 356110 926381 -446710 2029268 -2161318 4379250 908954 -2510252 2881452 4151230
559 4151230 226029 -1692987 1505327 1063085 923221 -3870736 2724385 -242129 442491
549 1513692 4508900 1102628 -3465445 -3027342 231384 -4455160 1150535 -576939 1104120
539 -1171604 1960239 -7990981 1316919 5418076 -401139 -5475869 2558896 -144727 3236001
529 -5593761 2786272 3454421 -1450787 -3349695 1303809 843807 -279426 85573 1283524
520 1283524 -2672765 1369929 4100816 -2942853 -2248637 3403775 2738925 -5003989 3821546
510 -1792345 -2526403 -1236266 -1634701 4455588 2892747 2086669 2371016 -3126719 860160
500 559204 1101799 -3778768 611668 4357474 -2459696 856899 -2100413 2934792 -1074778
490 -1233600 -2460352 -3560300 1272948 -1297051 -1956131 3961643 5976170 -7496576 2088605
480 -4915632 3293314 86709 -76803 2843611 -1233645 1260918 -81582 533266 507457 1319341
470 1319341 -4839944 2123442 460465 -1067307 2338995 -1801592 -157325 -1386970 2725069
460 1852907 3915479 -4739689 530185 -2102112 4233513 674689 -1813696 -1463551 1342693
450 -162128 266932 -4874549 1338124 1497949 3571522 -6679147 4401622 -382796 -805697
441 -805697 1085355 -3841358 3265739 5279414 -1257751 949009 -85987 -314484 785136
431 3728851 -2004553 -2280882 4031937 -1162946 263768 5933566 -3665249 -980891 3011369
421 1803569 -1801055 -1629247 6120020 -30407 -2977542 -1978636 -4674372 60669 -912633
411 64734 -2704960 3078032 -720302 1687052 -867417 -4084397 590554 1999423 -1193483
401 942018 -3795090 2934083 -115253 -2751001 2843953 -2793275 -261615 1224352 -3281762
391 -1049189 3501205 -6559209 -3382343 -1117568 -5729922 1607517 249500 -131550 -3149013
382 -3149013 3241615 1789199 1428859 -3757511 -894177 1973545 -1839091 -1663270 -2759514
373 -2759514 1364682 -3943184 -3324040 -3425975 2457871 -613435 1823196 1016974 -415689
363 -1498552 2762291 -1676960 2080203 1199608 479193 -3836011 2811185 -2629575 2647532
353 -2703841 -2652374 2895667 1129562 272828 291184 -3109809 990174 2296367 1800183
344 1800183 -2605903 4329945 1479951 -2288469 719385 -4790733 -21180 -865420 -5811007
335 -5811007 4901138 -2933271 -2985540 1682424 2245238 -1822270 -265376 -6167574 -363125
325 -253636 2281658 -433628 2905463 -1223676 -777340 131130 1864266 -4486223 1629942
315 -3418508 4583783 -2826708 -2912609 1077323 -4368995 -1589223 2877062 -4434307 -1779983
305 691415 1748614 2012351 -506893 1071908 -4135932 -1198328 1626831 -5232166 -1692751
295 -793789 -2430260 4943758 -2744437 -3709857 3766775 -1557246 -343838 157996 6541785
286 6541785 -41362 -676141 -1303019 3886110 356734 143992 360639 912786 1658329 -5117131
275 -356621 5578136 -122938 -5394167 1774337 159909 -5714802 6241833 -2424357 -1718407
266 -1718407 -761251 -1647898 -2280629 -637187 1768503 1434252 -1604702 4285038 2357931
$$ [...]
##END NTUPLES=nD NMR SPECTRUM
##END=
