##TITLE=XTC-1153_2
##JCAMPDX= 6.0         $$ Bruker NMR JCAMP-DX V2.0
##DATA TYPE= nD NMR SPECTRUM
##DATA CLASS= NTUPLES
##NUM DIM= 2
##ORIGIN= BRUKER
##OWNER= patiny
$$ 1.79 TOPSPIN		Version 3.0
$$ 2012-05-21 08:41:30.120 +0200  patiny@icmbsg005
$$ Compression mode = diff/dup
##.OBSERVE FREQUENCY= 400.13188181139
##.OBSERVE NUCLEUS= ^1H
##.ACQUISITION MODE= SIMULTANEOUS (DQD)
##.ACQUISITION SCHEME= Echo-Antiecho
##.AVERAGES= 2
##.DIGITISER RES= 23
##SPECTROMETER/DATA SYSTEM= spect
##.PULSE SEQUENCE= hsqcetgpsisp2.2
##.SOLVENT NAME= D2O
##.SHIFT REFERENCE= INTERNAL, D2O, 1, 11.697
##AUDIT TRAIL= $$ (NUMBER, WHEN, WHO, WHERE, PROCESS, VERSION, WHAT)
$$ ##TITLE= Audit trail, TOPSPIN		Version 3.0
$$ ##JCAMPDX= 5.01
$$ ##ORIGIN= Bruker BioSpin GmbH
$$ ##OWNER= patiny
$$ $$ /opt/data/patiny/nmr/XTC-1153_2/13/pdata/1/auditp.txt
$$ ##AUDIT TRAIL=  $$ (NUMBER, WHEN, WHO, WHERE, PROCESS, VERSION, WHAT)
(   1,<2012-05-21 08:41:29.068 +0200>,<patiny>,<icmbsg005>,<go>,<TOPSPIN 3.0>,
      <created by zg
	started at 2012-05-21 08:22:47.862 +0200,
	POWCHK enabled, PULCHK disabled,
       configuration hash MD5:
       77 C7 B7 C4 10 F4 BA 30 64 2E BB 52 82 F2 DA 41
       data hash MD5: 1K * 256
       1A 2B 67 45 8D 57 D7 B4 75 75 AD F0 00 4A 34 44>)
(   2,<2012-05-21 08:41:29.163 +0200>,<patiny>,<icmbsg005>,<audit>,<TOPSPIN 3.0>,
      <user comment:
       ICON-NMR User ID: patiny
       data hash MD5: 1K * 256
       1A 2B 67 45 8D 57 D7 B4 75 75 AD F0 00 4A 34 44>)
(   3,<2012-05-21 08:41:29.921 +0200>,<patiny>,<icmbsg005>,<proc2d>,<TOPSPIN 3.0>,
      <Start of raw data processing
       xfb same F2: SI = 1K WDW = 4 SSB = 2 FT_mod = 6 PKNL = 1 PHC0 = 0 PHC1 = 0 F1: SI = 1K ME_mod = 2 NCOEF = 32 WDW = 4 SSB = 2 FT_mod = 6
       data hash MD5: 1K * 1K
       35 7B D6 7A BD 8E 9B C2 4B F4 CC 3B B3 7A 8B D6>)
(   4,<2012-05-21 08:41:30.016 +0200>,<patiny>,<icmbsg005>,<proc2d>,<TOPSPIN 3.0>,
      <abs2 F2: ABSG = 5 ABSF1 = 11.697 ABSF2 = -2.290992
       data hash MD5: 1K * 1K
       D2 5B AC B9 76 FF CA 18 4E 52 FD A1 1D B2 DC 16>)
(   5,<2012-05-21 08:41:30.109 +0200>,<patiny>,<icmbsg005>,<proc2d>,<TOPSPIN 3.0>,
      <abs1 F1: ABSG = 5 ABSF1 = 179.9984 ABSF2 = -40.017
       data hash MD5: 1K * 1K
       CF 58 3D FB 6F 93 C3 6D 58 87 A7 FE 1E 58 BE 8C>)
$$ ##END=
$$ 
$$ $$ hash MD5
$$ $$ 6A 54 3D BE FF A5 1C 74 08 9B D5 29 B9 8D 15 BE
##$RELAX= 
##$RELAX= 
##$RELAX= 
##$RELAX= 
##$RELAX= 
##$RELAX= 
##$RELAX= 
##$RELAX= 
##$RELAX= 
##$RELAX= 
##$RELAX= 
$$ Bruker specific parameters
$$ --------------------------
##$DATPATH= </opt/data/patiny/nmr>
##$EXPNO= 13
##$NAME= <XTC-1153_2>
##$PROCNO= 1
##$ACQT0= 0
##$AMP= (0..31)
100 100 100 100 100 100 100 100 100 100 100 100 100 100 100 100 100 100
100 100 100 100 100 100 100 100 100 100 100 100 100 100
##$ANAVPT= -1
##$AQSEQ= 0
##$AQ_mod= 3
##$AUNM= <au_zg>
##$AUTOPOS= <32 >
##$BF1= 400.13
##$BF2= 100.612769
##$BF3= 400.13
##$BF4= 400.13
##$BF5= 400.13
##$BF6= 400.13
##$BF7= 400.13
##$BF8= 400.13
$$ [...]
##$REVERSE= no
##$SF= 400.13
##$SI= 1024
##$SIGF1= 11.697
##$SIGF2= -2.290992
##$SINO= 0
##$SIOLD= 1024
##$SPECTYP= <>
##$SREGLST= <13C.H2O+D2O>
##$SSB= 2
##$STSI= 1024
##$STSR= 0
##$SW_p= 5597.01492537312
##$SYMM= 0
##$S_DEV= 1694091
##$TDeff= 1024
##$TDoff= 0
##$TI= <>
##$TILT= no
##$TM1= 0
##$TM2= 0
##$TOPLEV= 100
##$USERP1= <>
##$USERP2= <>
##$USERP3= <>
##$USERP4= <>
##$USERP5= <>
##$WDW= 4
##$XDIM= 1024
##$YMAX_p= 80680995
##$YMIN_p= -398308133
##$CURPLOT= <Cups-PDF>
##$CURPRIN= <$Cups-PDF>
##$DFORMAT= <normdp>
##$LAYOUT= <+/2D_inv.xwp>
##$LFORMAT= <normlp>
##$PFORMAT= <normpl>
$$ Bruker specific parameters for F1
$$ ---------------------------------
##$ACQT0= 0
##$BF1= 100.612769
##$FnMODE= 6
##$NUC1= <13C>
##$O1= 7041.95747781
##$SFO1= 100.619810957478
##$SW= 220
##$SW_h= 22136.3584106452
##$TD= 256
##$ABSF1= 179.9984
##$ABSF2= -40.017
##$ABSG= 5
##$ABSL= 0
##$ALPHA= 0
##$AQORDER= 0
##$ASSFAC= 0
##$ASSFACI= 0
##$ASSFACX= 0
##$ASSWID= 0
##$AUNMP= <>
##$AXLEFT= 0
##$AXNAME= <F1>
##$AXNUC= <13C>
##$AXRIGHT= 0
##$AXTYPE= 0
##$AXUNIT= <>
##$AZFE= 0.1
##$AZFW= 0.5
##$BCFW= 0
##$BC_mod= 0
##$BYTORDP= 0
##$COROFFS= 0
##$CY= -3
##$DATMOD= 1
##$DC= 0
##$DFILT= <>
##$DTYPP= 0
##$ERETIC= no
##$F1P= 0
##$F2P= 0
##$FCOR= 0.5
##$FTSIZE= 1024
##$FT_mod= 6
##$GAMMA= 0
##$GB= 0
##$INTBC= 1
##$INTSCL= 1
##$ISEN= 128
##$LB= 0
##$LEV0= 0
##$LPBIN= 512
##$MAXI= 10000
##$MC2= 5
##$MEAN= 0
##$ME_mod= 2
##$MI= 1
##$NCOEF= 32
##$NC_proc= -11
##$NLEV= 6
##$NOISF1= 0
##$NOISF2= 0
##$NSP= 0
##$NTH_PI= 0
##$NZP= 0
##$OFFSET= 179.9984
##$PC= 4
##$PHC0= 0
##$PHC1= 0
##$PH_mod= 0
##$PKNL= no
##$PPARMOD= 1
##$PPDIAG= 0
##$PPIPTYP= 0
##$PPMPNUM= 100
##$PPRESOL= 1
##$PSCAL= 1
##$PSIGN= 0
##$PYNMP= <>
##$REVERSE= no
##$SF= 100.612769
##$SI= 1024
##$SIGF1= 179.9984
##$SIGF2= -40.017
##$SINO= 0
##$SIOLD= 1024
##$SPECTYP= <>
##$SREGLST= <>
##$SSB= 2
##$STSI= 1024
##$STSR= 0
##$SW_p= 22136.3584106452
##$SYMM= 0
##$S_DEV= 1694091
##$TDeff= 512
##$TDoff= 0
##$TI= <>
##$TILT= no
##$TM1= 0
##$TM2= 0
##$TOPLEV= 0
##$USERP1= <>
##$USERP2= <>
##$USERP3= <>
##$USERP4= <>
##$USERP5= <>
##$WDW= 4
##$XDIM= 128
##$YMAX_p= 80680995
##$YMIN_p= -398308133
$$ End of Bruker specific parameters
$$ ---------------------------------
##NTUPLES= nD NMR SPECTRUM
##VAR_NAME=  FREQUENCY1,    FREQUENCY2,      SPECTRUM
##SYMBOL=    F1,            F2,              Y
##.NUCLEUS=  13C,           1H
##VAR_TYPE=  INDEPENDENT,   INDEPENDENT,     DEPENDENT
##VAR_FORM=  AFFN,          AFFN,            ASDF
##VAR_DIM=   1024,          1024,            1024
##UNITS=     HZ,            HZ,              ARBITRARY UNITS
##FACTOR=    21.6175375103957, 5.46583488805969, 1
##FIRST=     18110.137220953, 5591.54909048506, 1385202
##LAST=      -4004.60365218182, 0,           -352183
##MIN=       -4004.60365218182, 0,           -398308133
##MAX=       18110.137220953, 5591.54909048506, 80680995
##PAGE= F1=18110.13722095
##FIRST=     18110.137220953, 5591.54909048506, 1385202
##DATA TABLE= (F2++(Y..Y)), PROFILE
$$ [...]
##PAGE= F1=3107.566188738
##FIRST=     18110.137220953, 5591.54909048506, 864799
##DATA TABLE= (F2++(Y..Y)), PROFILE
0B184758
$$ plain form
0 2184758
##PAGE= F1=3085.948651228
##FIRST=     18110.137220953, 5591.54909048506, 1598360
##DATA TABLE= (F2++(Y..Y)), PROFILE
1023A598360m48565m13461b7946r08710o3316L00468a09317p01151k294804O94777
1013b410495H70867K39191g79519o6852A36446a33965E39949L410615J476355
1004E426919j655841j246723a77852k640896n0375h48843C26166N7048N09980
995H93194J359627k65542D82486A89087P35375J911040Q04585A283673f2693A649308
984A445704a228301k299269k30520P11303R72680Q02094d66247A247045Q29460
975B076505A020813L46996O65928r60919i070l03976B94586J440682k2737m13677
965A298854J42861F09162a897897j016165a081309b4628j309917n60327M45737
956a449135L64498L03427j725393j994387K004939B050191Q90106H36401i92669
$$ plain form
1023 1598360 1149795 736334 -27946 -936656 -999972 -699504 -109317 -810468 -3105272 -2410495
1013 -2410495 870867 1110058 -779519 -846371 136446 -133965 539949 3950564 5426919
1004 5426919 3771078 2524355 -177852 -2818748 -2869123 -848843 326166 383214 893194
995 893194 2252821 1987279 482486 189087 924462 2835502 3640087 1283673 -62693 1649308
984 1445704 -1228301 -3527570 -3758090 -3046787 -2074107 -1272013 -466247 1247045 2076505
975 2076505 1020813 1367809 2033737 1072818 -9070 -313046 294586 1735268 1712531 1298854
965 1298854 1441715 609162 -1897897 -2914062 -1081309 -24628 -1334545 -1894872 -1449135
956 -1449135 -1084637 -781210 -2506603 -4500990 -2496051 2050191 2940297 836401 -992669
946a025706A16755R7480e45699a57034A519133l33429f32521K90489A320509M73766
936A794275l52454m75732g27246j734932J208143F35009A16332b773636j137035
927c910671Q5743k30903J011523a035306b48738F67841J513455H92374a154629
917c5215A965755q38613D71945Q32109K60151o8512n35658c83954j707296J03907
907a987343D432J599261N22658A045281l30077P85329R9483G49803g61357j578536
897b339893J105911d75579j411867J7972O48154j287519q60695m2887a067388
887C225661J431456A760507h27733J0256c04704I0543K595419J972381q33795
878C824548j875931j84579N25766L84354n2320l83136F26941d06146B31332J34253
$$ plain form
946 -1025706 116755 214235 -545699 -157034 1519133 1185704 -632521 -342032 1320509 1794275
936 1794275 1441821 966089 -727246 -2462178 -1254035 635009 116332 -2773636 -3910671
927 -3910671 -3824928 -4055831 -3044308 -1035306 -248738 667841 2181296 892374 -1154629
917 -35215 1965755 1127142 471945 1304054 1564205 1495693 960035 -383954 -2091250 -1987343
907 -1987343 4432 1603693 2126351 1045281 715204 1500533 1600016 749803 -761357 -2339893
897 -2339893 -1233982 -475579 -1887446 -1869474 -1221320 -2508839 -3369534 -3412421 -1067388
887 3225661 4657117 1760507 -827733 -817477 -304704 90543 2685962 4658343 3824548
878 3824548 1948617 1764038 2289804 2674158 2621838 2238702 626941 -406146 231332 365585
868C65585j54002J283517k15664D86493M57633N89278r6414N79883Q423E05822
857f10215n81915q92825j133634K0050J382882A92052J021868A87679a664768
847a976231f91452H50673l02966i80429P4977D64186J359629Q82496O24995j102353
837B228953B12162f32259o8712I15898J152063a01689j077613H35517J43660a390942
826a141187F01272A65586G1870J666295p71956l54485P48164l43601C06212L90773
816F96985j32217f77004j159856M31074A3820N78148g23324j510198j98498n52952
806b984972j501049l07502J687657J304492q4336o0642f07779A216645E46352
796a353866j95516D30967P09358C06270e84617k89745k31834m3231J05850o63090
$$ plain form
868 365585 211583 1495100 1279436 486493 944126 1533404 1436990 2016873 2025296 505822
857 -610215 -1192130 -2084955 -3218589 -3198539 -1815657 192052 1213920 187679 -1664768
847 -1976231 -691452 850673 547707 -980429 -905452 464186 1823815 2706311 3331306 2228953
837 2228953 212162 -632259 -700971 915898 2067961 -101689 -1179302 835517 979177 -1390942
826 -1141187 601272 165586 71870 1738165 966209 611724 1359888 1016287 306212 696985
816 696985 564768 -677004 -1836860 -1405786 13820 591968 -723324 -2233522 -2432020 -2984972
806 -2984972 -4486021 -4793523 -3105866 -1801374 -1885710 -1946352 -607779 1216645 546352
796 -1353866 -1549382 430967 1140325 306270 -584617 -874362 -1106196 -1149427 -1043577 -1706667
786a706667K42710a17233I63983O33680K73767C94786a971863n01717M32443e32141
775I23126M32094p8990H7521a831300k26939g8981H41711e2363q3366A767640
764A757682d16365m84125E41473J070213R45381m57764g25197j617827P99703
755a543321l93393k920509k26439b212171D00707N44660d36605j195226d11429
745C70975a520258m81106f40949K16228i3696A274594N23443C21164b588342j505064
735d093406J578053R28035l67089q3234j24976a025692A62783L00843J30144M62880
725A056650R4825J42918C38532i91041M70685A802528O44856A045714L04050J652048
715C001812k4370A192584m28615A08987b679615l478100l55231L237068C823J146876
$$ plain form
786 -1706667 -1463957 -117233 963983 1597663 1871430 394786 -1971863 -2473580 -2041137 -532141
775 923126 1355220 1276230 87521 -1831300 -2058239 -78981 841711 -52363 -135729 1767640
764 1757682 -416365 -900490 541473 1611686 2557067 2099303 -725197 -2343024 -1543321
755 -1543321 -1936714 -4857223 -5083662 -2212171 400707 945367 -436605 -1631831 -411429
745 370975 -1520258 -2001364 -640949 -424721 -93696 1274594 1798037 321164 -2588342 -4093406
735 -4093406 -2515353 -1587318 -1954407 -2037641 -2162617 -1025692 162783 463626 593770 1056650
725 1056650 1151475 1294393 338532 -991041 -520356 1802528 2447384 1045714 1349764 3001812
715 3001812 2977442 1192584 763969 108987 -2679615 -6157715 -6512946 -3275878 3823 1150699
705A150699D89136F9515J262750J430423k48343G3559b193324h26514D70323b589538
694e400689J477473e78787A263289L2868A40641a001568K97447B23770B8237a066983
683i60775L85941r52742o36636n76260L78715E87801J376361G46220P34167L85735
673A866122E40097I2728Q84222R47705O82407R6215K0847J22178j018708f93978
662a652674a25488I11377D53076R67138N25798C26461a439484k24082Q21680c40725
651b27592o17570l67104e60828G05735N91498M72637K58407E72521a963813o40204
641b604017J218843a98816A27134N96365J720735K11417F91914a034715K43954
632g90761A309965P00163B35121e50208D30031J265705J07706l19757A97313a743439
$$ plain form
705 1150699 489136 69515 1332265 2762688 2514345 73559 -2193324 -826514 470323 -2589538
694 -5400689 -3923216 -578787 1263289 1296157 140641 -1001568 -704121 223770 28237 -1066983
683 -960775 -574834 -1527576 -2164212 -2740472 -2361757 587801 1964162 746220 1480387 1866122
673 1866122 540097 92728 976950 1924655 2607062 2703277 2724124 2846302 1827594 -693978
662 -1652674 -125488 911377 453076 1420214 1946012 326461 -1439484 -1663566 -841886 -340725
651 -227592 -845162 -1212266 -560828 705735 1297233 1769870 2028277 572521 -1963813 -2604017
641 -2604017 -1385174 -198816 127134 723499 2444234 2655651 691914 -1034715 -790761
632 -790761 1309965 2010128 235121 -550208 430031 1695736 1803442 1483685 197313 -1743439
621b132874J026363J75726o04793q69738j473759o90893J039759J747880O23024
612a159305J85457j50108j422875J1304M93388q34192p69579R77859a106485e51574
601d94035C27269J80607i3302q75264k96085d82571B90348d83563j723492m13902
591b620957c89836C176723J495793j882264G63380C71918b58934r41309A9548
581B703206J104275j234513l98426K11418j32725H31314e72938b74859I17824
571A277090n93383a030493j881416P02310g10830k34150m55888f31042A423066
561C226684r05656F77165C11330M47995j13060N27749L85015C43336g79736L06251
551d73485j92036j205612o02152J195519C27211L34984K91435J97494n23817C02946
$$ plain form
621 -2132874 -1106511 -930785 -1535578 -2405316 -3879075 -4569968 -3530209 -1782329 -1159305
612 -1159305 -973848 -1123956 -2546831 -2535527 -2042139 -2876331 -3645910 -2668051 -1106485 -551574
601 -494035 327269 507876 -93302 -968566 -1264651 -482571 290348 -483563 -2207055 -2620957
591 -2620957 -389836 3176723 4672516 2790252 763380 371918 -258934 -1200243 19548
581 2703206 3807481 2572968 2174542 2385960 2253235 831314 -572938 -274859 917824
571 1277090 683707 -1030493 -2911909 -2209599 -710830 -944980 -1400868 -631042 1423066
561 3226684 2321028 677165 311330 759325 646265 1174014 1559029 343336 -779736 -473485
551 -473485 -665521 -1871133 -2473285 -1277766 327211 662195 953630 1151124 627307 302946
540F00792k02783a390922o50965L10301m60329J1286c48803A266734J656976K7603
530B951313A311794k29243O77824j9933K93013K8103e5867j530768e24902C26352
519A68498q3480J125709J393973j115633A89900G7921b25246j045656J9348D99726
508B205572M8617q30590k39995C53961i96149m65008F8732J307921b93983m54868
498g48851A793009P49836p22432k43964k41259R29790J834635j202282b22665
488b169953j166689L94831a231533C70284a64105l048412o26871H2339K298761
479B381100n33859r9953M09994q16855A13690j727Q15749A05438b080714h25687
468B286824L58111A263268Q41567N46813q7921l43986m14370j36573J58802M44279
$$ plain form
540 600792 398009 -1390922 -2041887 -1731586 -2191915 -2180629 -348803 1266734 2923710 2951313
530 2951313 1311794 1082551 1760375 1740442 2033455 2061558 -55867 -1586635 -524902 326352
519 168498 85018 1210727 2604700 1489067 189900 77921 -225246 -1270902 -1251554 499726
508 2205572 2254189 1423599 1183604 353961 -996149 -1461157 68732 1376653 -293983 -748851
498 -748851 1793009 2542845 1820413 1576449 1335190 2264980 4099615 2897333 -222665
488 -2169953 -3336642 -2941811 -1231533 370284 -164105 -3212517 -3839388 82339 2381100
479 2381100 1847241 1747288 2157282 1340427 113690 111963 927712 105438 -2080714 -825687
468 2286824 2644935 1263268 2104835 2651648 2563727 2219741 1805371 1668798 1827600 2271879
458B271879J090003m82954A051857D24434J22098p4033j1148J140878J297647
449B899876n39465c60160k741847k59708N87585M51662g66562F0107J82648J438843
439A681598J296096H53650a939278N43342N14145j705433l66236e95602H26694
429D77318j87489M59156M15618B74709j30875b32839q23772j62189e44110J93070
419c51040o79491k19769L38740j057096j203975J144563e92737j61952a08231
409A432807o1110a10637m17337o61422n58948e86436E4787a52250A163071K31035
399A394106a055212j628550a301721a18486q31725k25237B67775e66958j921793
390b488751r29751M91603a345466E26051J547901J94249H13128g69505j140302
$$ plain form
458 2271879 3361882 2878928 1051857 424434 546532 472499 461351 1602229 2899876
449 2899876 2360411 -360160 -3102007 -3361715 -2774130 -2322468 -766562 60107 242755 1681598
439 1681598 2977694 853650 -1939278 -1395936 -881791 -2587224 -2953460 -595602 826694
429 477318 289829 748985 1164603 274709 143834 -232839 -1056611 -1218800 -544110 -351040
419 -351040 -1030531 -1250300 -911560 -1968656 -3172631 -2028068 -592737 -754689 -108231
409 1432807 1371697 -110637 -527974 -1189396 -1748344 -586436 54787 -152250 1163071 1394106
399 1394106 -1055212 -2683762 -1301721 -118486 -950211 -1175448 267775 -566958 -2488751
390 -2488751 -3418502 -2926899 -1345466 526051 2073952 2268201 813128 -769505 -1909807
381a909807r84902l0101N98410L62220N40947j718303j134682m64104L36571a366137
370B796697j50467A132026J697113j318602m82407a469252k899869j529899K620301
361c278719B755817M661760k021824c494659K24446L29395m51218r04142L79846
352c916332J151593c40179A947846o4968h11193r93274b22969G42141i61385j211662
342b173047I68022L951011J84574A475062a828602Q06156B008796Q43079N38435
333C390310J83387A389619c9367n29786q47764p86072q62893r70860J096566J118656
323a821520r5746L75003g39701f9591r09162k07250F77395J225169H83077C81728
312A038771j6691M39514O68585A025830G5361M80882b49662k755242o13672J764555
$$ plain form
381 -1909807 -2894709 -2924810 -2326400 -1964180 -1423233 -3141536 -4276218 -4740322 -4403751 -1366137
370 2796697 2646230 1132026 2829139 1510537 1028130 -1469252 -4369121 -5899020 -3278719
361 -3278719 2755817 7417577 5395753 -3494659 -3270213 -2940818 -3392036 -4296178 -3916332
352 -3916332 -2764739 -340179 1947846 1882878 -811193 -1804467 -222969 742141 -961385 -2173047
342 -2173047 968022 4919033 5103607 1475062 -1828602 -1022446 2008796 2851875 3390310
333 3390310 3573697 1389619 -39367 -569153 -1416917 -2202989 -3065882 -4036742 -2940176 -1821520
323 -1821520 -1917266 -1542263 -739701 -69591 -978753 -1186003 677395 1902564 883077 381728
312 1038771 1022080 1461594 2130179 1025830 75361 556243 -249662 -3004904 -3618576 -1854021
302a854021J42524j592076M62571h69139f0907F5060L41266K38154J002708K47732
292A894920d6775j494767j037861n95523F0426L192069j307258H59012K023148
283B882160K056426q64623j730646A99206a452790G5841K423684K05320k56276
274B448569O42272o81665B65139a299142N45021G48044M76705c64271j636235
265b000506c91256A583271l79370c29889j421008j363193j08214J589226D31037
255F07009a174307m27674A35909h55965j585481g00330E13328j16444J294598
246A691482M37510F13906i7424G99758K99418m21437j47639L46745l77688H6261
235A186066K19676o94435K45499L82849l44832k80424L07005J50823D4556b644683
$$ plain form
302 -1854021 -1711497 -3303573 -2841002 -869139 -60907 65060 406326 644480 1647188 1894920
292 1894920 -46775 -1541542 -2579403 -3174926 60426 3252495 1945237 859012 2882160
283 2882160 4938586 4073963 2343317 199206 -1452790 75841 2499525 2704845 2448569
274 2448569 3090841 2409176 265139 -1299142 -754121 748044 1224749 -364271 -2000506
265 -2000506 -391256 1583271 1203901 -329889 -1750897 -3114090 -3222304 -1633078 431037
255 607009 -1174307 -1601981 135909 -855965 -2441446 -700330 513328 396884 1691482
246 1691482 2128992 613906 -97424 799758 1099176 677739 530100 876845 499157 86261
235 1186066 1405742 711307 956806 1339655 994823 714399 1021404 1172227 44556 -2644683
224b397202A450745K420189n52308A391201c58661n60910I47387J852204J59539
215B959130r88561o0755J75102k03982F20864b229417k791060J478363A392263
205D128098j548847H56668l79794K7549a284570j424185b80609B756457N64802
196C321259A468826D32100k2832e1170F32739J267778j1629A3710i69223n24894
186a494117j891050k80858J637242M15660o86730R53111E81826M13836A33539
176f676A308860l62319g21744j98319A37089L46004c73137n29339A410674K063003
166C473677A506213e14142D85379J381870i5020j910472d66529B309097k73628
157B035469E98590N12009R44493m74624M48955k12726e2703k60018A207545M25126
$$ plain form
224 -2397202 1450745 3870934 3318626 1391201 -358661 -919571 947387 2799591 2959130
215 2959130 1970569 1909814 2084916 1880934 620864 -2229417 -5020477 -3542114 1392263
205 4128098 2579251 856668 476874 504423 -1284570 -2708755 -280609 2756457 3321259
196 3321259 1468826 432100 409268 -51170 632739 1900517 1888888 13710 -969223 -1494117
186 -1494117 -3385167 -3666025 -2028783 -1613123 -2299853 -1346742 581826 995662 133539
176 -6676 1308860 946541 -721744 -920063 137089 483093 -373137 -902476 1410674 3473677
166 3473677 1506213 -514142 485379 1867249 -95020 -2005492 -466529 2309097 2035469
157 2035469 598590 1110599 2055092 1580468 2029423 1816697 -52703 -312721 1207545 1632671
147A632671G90110l90797g56470q50101R2531M44667F8905a340254l215319j23359
137d678932a849273A058032J559759L40672j135009C98208p7198F1006b573869
127c159467a281798e40143p16878m07819j90640J91750F91J869167K57892r16988
117A210762j93986j65134h62091j589203K1811e68688A45140a329137p90269I8786
106B469701I06870b923098q63335c85637A557767l26382m71638A11927d69012
96d47980m42350j163964d12257B454904k85822a66568r79461l754c12660A365831
85E17713b993652j800434K265605c94505A3389M1442M52388A19727g26968m40770
75a167738L39852c11792k44684r84228J02067N85491k35099j329150j363762Q9037
$$ plain form
147 1632671 790110 399313 -756470 -1606571 -1514040 -1069373 68905 -1340254 -4555573 -4678932
137 -4678932 -1849273 1058032 2617791 2958463 1823454 398208 321010 61006 -2573869
127 -3159467 -1281798 -540143 -1257021 -1664840 -1855480 -1663730 691 1869858 2127750 1210762
117 1210762 1016776 851642 -862091 -2451294 -2429483 -568688 145140 -1329137 -2119406 98786
106 2469701 906870 -2923098 -3786433 -385637 1557767 1231385 759747 111927 -469012
96 -447980 -890330 -2054294 -412257 2454904 2169082 -166568 -1146029 -1149783 -312660 1365831
85 517713 -2993652 -4794086 -2528481 -394505 13389 54831 507219 119727 -726968 -1167738
75 -1167738 -827886 -311792 -556476 -1540704 -1438637 -853146 -1088245 -2417395 -3781157 -3692120
65c692120J661584c35489o4086q14108K37754K95697Q0433p77811j639499p42743
55c759852J684448A33262F368a530044a81408B599782J947937q14191A684303
45A926493R09365K64880J699697j323386a200876j121286G43893J551963p13425
36A582431F51250B97335M25852R59231p43691i67152k246303n09707J490628i92729
25a283446j52942b10486B432285J164152l46134j238497E74163I4553M76770O39537
15A210860Q5871a02160r04324j52428n60198j291852Q6935d24256B233872M0599
5B274471H33269D00771K27460J06203J157192
0A891626
$$ plain form
65 -3692120 -2030536 -335489 -399575 -1213683 -975929 -680232 -599799 -1377610 -3017109 -3759852
55 -3759852 -2075404 133262 6368 -1530044 -181408 2599782 4547719 3733528 1684303
45 1926493 2835858 3100738 4800435 3477049 -1200876 -2322162 743893 2295856 1582431
36 1582431 651250 297335 723187 1682418 938727 -967152 -3213455 -3723162 -2232534 -992729
25 -1283446 -1436388 -210486 2432285 3596437 3250303 2011806 574163 94553 571323 1210860
15 1210860 1296731 -102160 -1006484 -1158912 -1719110 -3010962 -2924027 -424256 2233872 2274471
5 2274471 833269 400771 628231 734434 1891626
0 1891626
##PAGE= F1=3064.331113718
##FIRST=     18110.137220953, 5591.54909048506, 2050585
##DATA TABLE= (F2++(Y..Y)), PROFILE
1023B050585j42091o03144E41909f49288m88623P6639g9992l7391k000629P39989
1013a378023A783165j38514g10125l17211b59711j78822F72528L755551J616193
1004F044272j370075j523501b7255l086821J98338g08608F8854J6416J255779
995A341049J883189p11583E76565j16523O88792J256368R85868j418901E98626
985A326009E71117a261658p42374j9135k74376J96397K70740n8737O45813d06420
974b30869H67654J052508q17951b71861o56334b60128A163541m10806j91398J028107
964A589444m54186a318773j365761a303225d4764o65538l60199k92407j082155
955b445063o40348q68542p62876K307015A523039J200322I52300h15014K12995
$$ plain form
1023 2050585 1908494 1305350 541909 -649288 -1137911 -1061272 -79992 -117383 -2118012 -1378023
1013 -1378023 1783165 1644651 -710125 -1027336 -259711 -438533 672528 4428079 6044272
1004 6044272 4674197 3150696 -27255 -3114076 -2915738 -708608 68854 85270 1341049
995 1341049 3224238 2512655 576565 460042 1148834 2405202 3391070 1972169 598626
985 1326009 571117 -1261658 -2004032 -2023167 -2297543 -2101146 -1830406 -1889143 -1243330 -406420
974 -230869 867654 1920162 1102211 -271861 -928195 -260128 1163541 752735 561337 1589444
964 1589444 1135258 -1318773 -2684534 -1303225 -44764 -710302 -1070501 -1362908 -2445063
955 -2445063 -3085411 -3953953 -4716829 -2409814 1523039 2723361 952300 -815014 -602019
946f02019G04633A61033a085636K92163G82711J11173B2980J86543J151784L66804
936A728111m94324m63422f31879j419828f17029A036415B36754a701329n71700
927b273029k52562r52882M78652J280244K88998f20787A362420o38075a517160
917e40622A689859E47211f60393H9694N54930P22979O10436q70588a387920q12474
907b200394f30171I66316L48490F14153Q9171Q94950l57025B17571a239603j515069
897b754672J321061d52461j563034j4447R99369n07964l70872J41772c34134B952665
886C685591I72860a008861L21980K81660H252K802247J516158j602854H05167
876A293655J263019P10534k36681k04834j286904F9791K7679b00437o78552B84869
$$ plain form
946 -602019 704633 161033 -1085636 -793473 782711 893884 22980 209523 1361307 1728111
936 1728111 1233787 770365 -631879 -2051707 -617029 1036415 236754 -1701329 -2273029
927 -2273029 -2525591 -3478473 -2999821 -1719577 -1430579 -620787 1362420 724345 -1517160
917 -540622 1689859 547211 -660393 89694 644624 1367603 1978039 1107451 -1387920 -2200394
907 -2200394 -630171 966316 1314806 614153 703324 1598274 1241249 217571 -1239603 -2754672
897 -2754672 -1433611 -452461 -2015495 -2029942 -1030573 -1538537 -1909409 -1767637 -334134 2952665
886 3685591 972860 -1008861 -686881 -405221 8252 2810499 4326657 2723803 805167
876 1293655 2556674 3267208 3030527 2825693 1538789 69791 97470 -200437 -878989 284869
865H37436k09776L17557L44314p9945O32367K49421E43678a081955q84332p3390
855b039677l25609N8650J014100D15438P82927E45313a113091o25447e65094F14018
844c48390j772523M85681C39412K185014Q66687n65093A003427d59813l61842
835h21655c99246A562089P79219a84592r47298H84348J19372a907298o12825g19070
824c21980A57932J901252m66467l10554P79885o39566D42528Q85976K40061f52417
813b369193J182086G25786J16551e48529j133791n37871q60592j263373m55749
804d799905R15082O46401K93789J190275D99471J475278H37009a002807J75982
795h26825A063460M84787D44320c04990C5452G779h07865n77446p04740L71182
$$ plain form
865 837436 627660 945217 1289531 1209586 1841953 2091374 543678 -1081955 -1966287 -2039677
855 -2039677 -2365286 -2306636 -1292536 415438 1198365 545313 -1113091 -1738538 -565094 614018
844 -348390 -2120913 -1635232 339412 2524426 3391113 2826020 1003427 -459813 -821655
835 -821655 -399246 1562089 2341308 -184592 -1131890 884348 1003720 -1907298 -2520123 -719070
824 -321980 157932 2059184 1592717 1282163 2062048 1422482 442528 1328504 1568565 -652417
813 -2369193 -1187107 725786 842337 -548529 -1682320 -2220191 -3080783 -4344156 -4799905
804 -4799905 -3884823 -3238422 -2944633 -1754358 499471 1974749 837009 -1002807 -826825
795 -826825 1063460 1548247 444320 -304990 35452 7779 -807865 -1385311 -2090051 -1718869
785a718869f85611b07243H65629J215703H77520a629236q24928N94788A16854
775A387693Q3339m558B44358a672221L48273A071946M38466A28772f7800A567159
764A444492b37031l08248F20720P76846O07231m78997i32647j300707L05923q94504
754b821935k433703K82623b239257D68691J074992F72239b16651G46253k781a588343
743b157588h10994l6799J78373I08690Q94950F66825b432701j810542J315138
734b928105O71491n43087L38151N96708Q89702B30031J002550J28757L97055Q59823
724B618216J51053A172344d29550e8731A998400P22547j237106N24454J554062
715C562357k99252A407234p03436b73907k845477l184500K91974b479148A85462
$$ plain form
785 -1718869 -685611 -207243 865629 2081332 877520 -1629236 -2454164 -1859376 116854
775 1387693 1471032 1466474 244358 -1672221 -1323948 1071946 1510412 128772 -67800 1567159
764 1444492 -237031 -545279 620720 1397566 2004797 1525800 -932647 -2233354 -1927431 -2821935
754 -2821935 -5255638 -4973015 -2239257 468691 1543683 672239 -216651 746253 743472 -1588343
743 -2157588 -810994 -847793 -669420 908690 1803640 666825 -2432701 -4243243 -2928105
734 -2928105 -2256614 -2799701 -2461550 -1864842 -975140 230031 1232581 1361338 1758393 2618216
724 2618216 2769269 1172344 -429550 -58731 1998400 2720947 1483841 2008295 3562357
715 3562357 3263105 1407234 703798 -273907 -3119384 -6303884 -6011910 -2479148 185462
705E70166c63380N4813A715826J421865o82818a29828j777780D4643J391028a509533
694d485255R48794c4677B129489m08081a26233j113428d87373E72025e2193q03293
684h55486b19612q1435j658153o08816k09290P9061d37781E91186A07338J263858
674A371196K87762B61484b34702A071522J785717J047327l42367m15639o15148
665B531412A159290a065807l14669E57349R13207C41151N0955J005250m26776
656I70580d31602k57460C21524L76514b69199j100410j02220e74927A071283J261089
646B332372L52872j15340A189575a667774j057691R56252f82883J78322a19401
636B075941J107246A232450i31896J26784I08467J43630e06431m88636c00859
$$ plain form
705 570166 -363380 -308567 1715826 3137691 2454873 -129828 -1907608 44643 1435671 -1509533
694 -4485255 -3536461 -34677 2129489 1721408 -126233 -1239661 -487373 572025 -52193 -855486
684 -855486 -219612 -301047 -1959200 -2568016 -2777306 -2698245 -437781 591186 107338 1371196
674 1371196 1658958 261484 -234702 1071522 2857239 3904566 3562199 3146560 2531412
665 2531412 1159290 -1065807 -1380476 557349 1470556 341151 392106 1397356 970580
656 970580 -431602 -689062 321524 698038 -269199 -1369609 -1471829 -574927 1071283 2332372
646 2332372 2685244 2569904 1189575 -1667774 -2725465 -1769213 -682883 -504561 -119401
636 2075941 3183187 1232450 -931896 -805112 908467 1052097 -506431 -995067 -300859
626A036523N50983K54232G62936a444778p46389R52271q4962l76958k08769j376672
616c286257j270603L81401J447372N09725L95451N26440r86965m13955p5584n13023
606c285998m9852J107234a056520M99201a44998F11905M82024J64912C8051a424769
595a187833b88276k43124j226009n10269e62150B823641J145837A930784F74228
585G31735c3778j073414A73947K374042J438231p83104r90950l26702L11389p26367
575A470486A62190P5118J153749L85230H34367i10506j157415O81139d89937l33980
565h23917R430A96761J580187J301612o49356r00603m9702m77857A73959R44743
555A118702N32167B41783a045511J77612J22802r38741p91511P09356b65908H61021
$$ plain form
626 1036523 1587506 1841738 762936 -1444778 -2191167 -1238896 -1323858 -1700816 -1909585 -3286257
616 -3286257 -4556860 -4175459 -2728087 -2218362 -1822911 -1296471 -2283436 -2697391 -2772975 -3285998
606 -3285998 -3335850 -2228616 -1056520 -557319 -144998 611905 1093929 1258841 38051 -1424769
595 -1187833 -288276 -531400 -1757409 -2267678 -562150 2823641 3969478 1930784 674228
585 731735 -33778 -1107192 173947 2547989 3986220 3203116 2212166 1885464 2196853 1470486
575 1470486 162190 237308 1391057 1776287 834367 -910506 -2067921 -1386782 -489937 -823917
565 -823917 -814487 196761 1776948 3078560 2429204 1528601 1478899 1001042 173959 1118702
555 1118702 1650869 241783 -1045511 -867899 -745097 -1683838 -2475349 -1765993 -265908 861021
544A990910K29489o82646l16719R9737D09711a611203K58735d22910q38675j1987
534a273572G61353J176791J254518J99603A446264n80719N18802m41451l57453
525E85443M07401d26707j099428M03410K25403c30746C26958L19187M82321C61215
514c83631f6512j74229j274653m66413b36165A586071k03796m57968L93685k88877
504A029115f90736j395832g82590I69322c70416o43736A445730Q93995l10927
495B028798j51999m21395N67328J611908j351046f20535k052671j073999L22220
486c424985a486784I34363K1323a785042q94838E40695J644056q69701l68491
477I46559M21221E98258B1794O18162M46663f65664k119288J243492A365115r490
$$ plain form
544 1990910 2220399 1537753 1221034 1320771 409711 -1611203 -1352468 -422910 -1261585 -1273572
534 -1273572 761353 1938144 3192662 3392265 1446264 865545 1384347 942896 585443
525 585443 992844 -426707 -1526135 -1122725 -897322 -330746 326958 646145 1128466 361215
514 -383631 -66512 -240741 -1515394 -1981807 -236165 1586071 1382275 924307 1317992 1029115
504 1029115 -690736 -2086568 -782590 969322 -370416 -1014152 1445730 2339725 2028798
495 2028798 1876799 1455404 2022732 3634640 2283594 -620535 -2673206 -3747205 -3424985
486 -3424985 -1486784 934363 955686 -1785042 -2679880 540695 2184751 1315050 946559
477 946559 1367780 598258 21794 639956 1086619 -665664 -2784952 -1541460 1365115 1355625
467A355625a04625I16741Q84067P9810j90770k38925K94000n4727J3120R81830
457B685146r68356e52626j42268B37635e26973m05424I65977K557974j4184I83697
446a799861q81495k29137M66486e08781E7205i7969H51861Q43752d78478k940027
436c418505N2552L88757j190691M17359g50782F45779a58837l66290L6858K884
426d85385n80305M19753j69588q26967m00180N86071K53997n97750P4375Q20426
416i05553j083814j626159J226717h50785m78685L32617f4761m35505j090084
407a590350k22771l11281l01793Q31096J86386J02979a72441r62949k765480j108132
397e009002J291728J607715n3503K9740h48286q16363j708208n49751O37134J368639
$$ plain form
467 1355625 -104625 916741 1800808 1880618 1689848 1450923 1744923 1690196 1703316 2685146
457 2685146 1716790 -552626 -694894 237635 -526973 -932397 965977 3523951 3509767 983697
446 -1799861 -2681356 -2910493 -2444007 -508781 57205 -97969 851861 1695613 -478478 -3418505
436 -3418505 -3365953 -2977196 -4167887 -3750528 -750782 645779 -158837 -525127 -488269 -485385
426 -485385 -1065690 -645937 -815525 -1642492 -2042672 -1456601 -1202604 -1800354 -1725979 -905553
416 -905553 -1989367 -3615526 -2388809 -850785 -1329470 -996853 -64761 -500266 -1590350
407 -1590350 -1813121 -2124402 -2426195 -1595099 -1408713 -1305734 -172441 -1135390 -3900870 -5009002
397 -5009002 -3717274 -2109559 -2163062 -2133322 -848286 -1664649 -3372857 -3922608 -3285474 -1916835
387a916835a58939A311854j21577f62673k026703j787411j360292l25631K99806
378e862904O33675J346489q06200j796678j015358k33212K554910a937164p31574
369b668738k093993l87267j645780j179685k951869m039303m672332k776764j9939534
360d2355265k3434142J8732235e895906I893062D180028A759456F29008L59315
352I88323J621398Q35312J447687l15372B225431j062494R88448P83886A037174
342B43249L473883L437987l59792C196805F4177J051620K606981R26302R37461
333E586541m90162A945988F83942L59614o8328I9601a442457j521376R13497h93051
322a226214N31295H88851J491827F86020a342935c69852A604047O54712K57423
$$ plain form
387 -1916835 -158939 1311854 1190277 -662673 -2689376 -4476787 -5837079 -6162710 -5862904
378 -5862904 -5229229 -3882740 -4688940 -6485618 -7500976 -7734188 -5179278 -1937164 -2668738
369 -2668738 -4762731 -5149998 -6795778 -7975463 -10927332 -14966635 -19638967 -22415731 -42355265
360 -42355265 -65789407 -47057172 -5895906 9893062 4180028 1759456 629008 988323
352 988323 2609721 3445033 4892720 4577348 2225431 1162937 2151385 2935271 1037174
342 243249 3717132 7155119 6795327 3196805 64177 1115797 3722778 4649080 5586541
333 5586541 5096379 1945988 683942 1043556 975228 99601 -1442457 -2963833 -2050336 -893051
322 -1226214 -694919 888851 2380678 686020 -1342935 -369852 1604047 2258759 2516182
313B516182N25684m60561j17615j65458E63284d87159B73639j04055a600393l56534
303a956927b61837a15364j128418N07973b80283j96376f5636B91109l6243J077750
293A332616L74649b93687j260933p47574j27516E09318K842168A505734b9544
283B090624K411581n74361j733095G84320e45053B08729K202513O17397m17043
274B611596N62086q33433B4424a553805e28284I24899l31022a202058p70040A02019
263A638226A39760a962515r26848l65510M38901J278751C04088N99023c43702
253i338A265786e12853j454982C37134J078421o48711J318796n5738B11466h6288
242A279991K20179G03278d4084j01481n80762j47838A121224O46192C78585a81406
$$ plain form
313 2516182 3041866 2581305 2463690 2298232 563284 -487159 273639 169584 -1600393 -1956927
303 -1956927 -261837 -115364 -1243782 -735809 -280283 -476659 -65636 291109 254866 1332616
293 1332616 1707265 -293687 -1554620 -2302194 -2429710 509318 3351486 1505734 -29544
283 2090624 4502205 3927844 2194749 784320 -545053 208729 2411242 3028639 2611596
274 2611596 3173682 2340249 24424 -1553805 -528284 924899 593877 -1202058 -1972098 102019
263 1638226 139760 -1962515 -2889363 -3254873 -2815972 -1537221 304088 903111 -343702
253 -9338 1265786 -512853 -1967835 337134 1415555 766844 2085640 2029902 211466 -86288
242 1279991 1500170 703278 -44084 -145565 -726327 -874165 1121224 1767416 378585 -181406
231C32214M58333C84752D1656N83398M89397C38932h78487A349264K262998k87563
221C324699I92228a151101j50749A157763K044463l66825A139637J8728P26910
212A885275j22352A24712b566208k103212J483605A397805K523913j663858E42188
202D035a75106r50634r2913A058691J647666k0348I81783E3790f111o35302b24548
190H87933Q77725p31900A69932g85475k397789j173813J469486P96206n36194
181b627579J299914A256725P89813I53117q3742J085336r49011a630469m80349
172b110818b69970G06082e38490r70897H20522K282519A259298e15729G42259
162B284239F93872a206378d68415A605710l49534B47378R70214J863593j80370
$$ plain form
231 332214 790547 384752 41656 625054 1114451 338932 -878487 1349264 3612262 3324699
221 3324699 992228 -1151101 -1301850 1157763 3202226 2835401 1139637 1158365 1885275
212 1885275 1762923 124712 -2566208 -4669420 -3185815 1397805 3921718 2257860 542188
202 4035 -175106 -1125740 -1218653 1058691 2706357 2686009 981783 53790 -6111 -641413 -224548
190 887933 1765658 1033758 169932 -785475 -3183264 -4357077 -2887591 -2091385 -2627579
181 -2627579 -1327665 1256725 2046538 953117 869375 1954711 1005700 -1630469 -2110818
172 -2110818 -269970 706082 -538490 -1509387 820522 3103041 1259298 -515729 742259
162 2284239 693872 -1206378 -468415 1605710 1256176 247378 1217592 3081185 2900815
153B900815o14161j139283c3325E4506J006940K84854j57525j22661g17808q94138
143a611946d39299D45613Q2552a360138k583248P37119h14142A074508N34174
134A608682O3510D70177g24697J55720J16582k275781q37816J647935Q35470l42070
124a424657l86153p04936K72921i7391A743046k56483p24338l8983C31662a093754
113b054046J28300e52671e3752j476171q76566b56900B199200D23256c354986
103d525116a881491D20563O86589k51475m00902b25515m15821r88123j208328
94b837787a030672I76055l80688i19352m12953J66271M36959C35087e52821l037457
84c590278j380290b216270a92207j68795g7025A148556m93733c99809J1884A90145
$$ plain form
153 2900815 2286654 1147371 -33325 54506 1061446 1346300 1188775 1066114 -717808 -1611946
143 -1611946 -439299 445613 528165 -1360138 -3943386 -3206267 -814142 1074508 1608682
134 1608682 1672192 470177 -724697 -568977 -452395 -2728176 -3565992 -1918057 -1082587 -1424657
124 -1424657 -1810810 -2515746 -2242825 -97391 1743046 1486563 762225 723242 331662 -1093754
113 -2054046 -1925746 -552671 -53752 -1529923 -2406489 -256900 2199200 423256 -3354986
103 -4525116 -1881491 420563 1107152 855677 454775 -225515 -641336 -1629459 -2837787
94 -2837787 -1030672 976055 595367 -919352 -1332305 -1166034 -729075 335087 -552821 -3590278
84 -3590278 -4970568 -2216270 -192207 -361002 -77025 1148556 654823 -399809 -387925 190145
73A78855b22452j207168p01880l1501O9653k45935q37699m44751Q38060J312540
63a471133j6726o54847m5234Q39953b25725l83647k123622j257888J504656b35923
52A74546a043436d45394A712824K246820m1113j502018M28823Q35299j3494J466624
42E133765j506073a156643q52898A017247J235848j004531A78794m2374J289344
33A425764J200906q14145c73954k790530k33082a505398d23260J3244i0391F84713
22B334111R31336J53866j083889A152275M6926N44859N70719K17872H93241b82481
11a50339m71272j302100K77079a3036A490462m91971m95171K76292C88350g6745
0A731219
$$ plain form
73 178855 -222452 -1429620 -2131500 -2163001 -2093348 -2339283 -3176982 -3621733 -2783673 -1471133
63 -1471133 -1487859 -2142706 -2187940 -1347987 -225725 -609372 -2732994 -3990882 -2486226 -235923
52 174546 -1043436 -445394 1712824 3959644 3918531 2416513 2845336 3680635 3667141 5133765
42 5133765 3627692 -1156643 -2009541 1017247 2253095 1248564 178794 136420 1425764
33 1425764 2626670 1812525 -373954 -3164484 -3397566 -1505398 -423260 -410016 -90391 684713
22 2334111 3265447 3419313 2335424 1152275 1199201 1744060 2314779 2532651 893241 -282481
11 -150339 -621611 -1923711 -1646632 -13036 1490462 998491 503320 779612 388350 -76745
0 1731219
##PAGE= F1=3042.713576207
##FIRST=     18110.137220953, 5591.54909048506, 2440284
##DATA TABLE= (F2++(Y..Y)), PROFILE
1023B440284O5674p70780G89271e93497p26817m4671h1067C97580a047813a66046
1012B691763n93872g84098o36808N48398j84515A86982L696063J606879p86595
1003D703329j517204I6752b871749K94313e81871a07314j5331A759747K069247
994C828994j280398C20324K06703R92050P30755N48367q39522H87412k5729d23153
983a583373P83648a06880o89663p38074m81261o66933n7839M36700J070286F21427
972B059556o53486a26570j010252L37319C35630a82735d7746A445142p4530f33409
961b142948O75906c521B97972p4643h70869k338006j303091j16561P19465a077043
950A647777R24966A157446e62962a24789A246799B49722a290769K12322C19689
$$ plain form
1023 2440284 2505958 1735178 789271 -593497 -1320314 -1364985 -81067 397580 -1047813 -166046
1012 2691763 2097891 -784098 -1420906 -872508 -1057023 186982 3883045 5489924 4703329
1003 4703329 3186125 96752 -2871749 -2577436 -581871 -107314 -122645 1759747 3828994
994 3828994 2548596 320324 527027 1519077 2249832 2798199 1958677 887412 861683 -423153
983 -1583373 -799725 -106880 -796543 -1534617 -2015878 -2682811 -2740650 -2303950 -1233664 621427
972 2059556 1406070 -126570 -1136822 -799503 335630 -182735 -47746 1445142 1370612 -633409
961 -2142948 -1467042 -3521 297972 223329 -870869 -3208875 -4511966 -4628527 -3909062 -1077043
950 1647777 2572743 1157446 -562962 -124789 1246799 249722 -1290769 -1078447 319689
940F83856j49842O5526P96264Q0572F16961B51822d59432q60383e1976G61801
929b90733l67318J70656p12309j247765p031L87336r2960N34784G3202M4439a722206
917h80993A114900i1378j474731O45693a37921A009275J413045n32084i77052
907b226760i59169D39904J23868j26981N10042P14394F07859g24085j056023r21655
897b701763a287785b04135j549289l84270R85917K03337L17136e0160E34192J854817
887B389009Q4844D56403g68457c52880j09874f7003B655208R11774A117905d53741
876I74080J888221R43982j89177l34097j065488F23816B9007h76182j149533h62349
865C68168J88904R3388J55220k38509M24370L92742B56707a419477j214435L71187
$$ plain form
940 683856 534014 599540 1395804 1476376 616961 251822 -459432 -1319815 -51976 761801
929 -290733 -658051 -487395 -1199704 -2447469 -2454500 -2067164 -2160124 -1625340 73202 117641 -1722206
917 -880993 1114900 -91378 -1566109 -920416 -137921 1009275 2422320 1890236 -977052
907 -2226760 -959169 439904 563772 436791 946833 1661227 607859 -724085 -1780108 -2701763
897 -2701763 -1287785 -204135 -1753424 -2137694 -1151777 -948440 -631304 -50160 534192 2389009
887 2389009 2473853 456403 -768457 -352880 -462754 -67003 2655208 3566982 1117905 -453741
876 974080 2862301 3806283 3617106 3283009 2217521 623816 29007 -876182 -2025715 -862349
865 368168 557072 650460 805680 567171 991541 1384283 256707 -1419477 -2633912 -2262725
855b262725M62121K26756O42707B95357O01193p4342e27277j091688P54452i0842
844a254089j703904O60839c39436B161786Q01489j161385a52880r53201j02726
835a208807c05565A795186K61104c90364n17862G92267P1130b182358j175908
826c358266a462986d95826D52291J758272l64951n11002O53059o73346B89575
816A532431M48297h68886j842392h07833A411962m43371e70606p83691n90378
807a944675o83735o77685p82625O1376J85373L88267a356073A442509J190548
798B633057A218000e40016a78034A454467K22986D89386d9726H32180J67576e42658
787a688748k34963P34457L20665l83035A46736K020810p44601a040708j337476
$$ plain form
855 -2262725 -1800604 -1573848 -931141 295357 896550 822208 -527277 -1618965 -864513 -90842
844 -1254089 -2957993 -2297154 -339436 2161786 2963275 1801890 -152880 -1106081 -1208807
835 -1208807 -305565 1795186 2056290 -390364 -908226 792267 863397 -2182358 -3358266
826 -3358266 -1462986 -495826 452291 2210563 1845612 1334610 1987669 1314323 289575
816 1532431 1980728 -868886 -2711278 -807833 1411962 968591 -570606 -1354297 -1944675
807 -1944675 -2628410 -3306095 -4088720 -4027344 -3841971 -3453704 -1356073 1442509 2633057
798 2633057 1218000 -540016 -178034 1454467 1677453 489386 -49726 832180 999756 -542658
787 -1688748 -1923711 -1189254 -868589 -1251624 146736 2167546 1422945 -1040708 -2378184
778b378184M60917A09799J087053K61451K30887D68126a311013d93774A941791
768A720660A01591a14426H94538l02615b29250r2398D98432P38229M08612o06683
758A038590a082939q85646L5431j246825j987953M18816K228908f8082A507313
748A381703o39424N41671m13218a236126o70693Q97514l66723J4427B91819J206936
738A498755o85250b039813j845389Q40545L79216k21435Q76178i46516j10267
729a056783b90699A404049J55300N6704J300677J14898A444721A03025L61592
720D64617J368661N05641j025580N72928J120416m39198j208577F61189g79060
710c411532k168246J110517a289122C49951A2107a201834K65167A564022J335256
$$ plain form
778 -2378184 -1917267 109799 1196852 1458303 1689190 468126 -1311013 -493774 1941791
768 1720660 101591 -114426 894538 591923 -229250 -321648 498432 1236661 1645273 1038590
758 1038590 -1082939 -1968585 -1933154 -3179979 -5167932 -4749116 -2520208 -68082 1507313
748 1381703 742279 1283950 870732 -1236126 -1906819 -1009305 -1376028 -1361601 291819 1498755
738 1498755 813505 -2039813 -3885202 -3044657 -2665441 -2886876 -2010698 -946516 -1056783
729 -1056783 -290699 1404049 1559349 1616053 2916730 3031628 1444721 103025 464617
720 464617 1833278 2338919 1313339 1886267 3006683 2567485 1358908 661189 -779060
710 -3411532 -5579778 -4469261 -1289122 349951 12107 -1201834 -936667 1564022 2899278
701B899278r86357c65017j083714D67074J471424A17319b436575J68160I60046
691C201079j182693c94435r26023i7814I90083F3807d16457E61657E8967b049682
680b426502O5669l51662J223380P42511L42465A133756m9245c89732l99766G51305
669B968390J210660o00971m91860j084704D79062a026098J98656A191526O20383
660A811909A28157h71396B58542O76494C34979O8543J100826K04944e5093j569684
650a624777K6210e21433A230375J548585M53047k74237j178491i15745j252810
641b168555L82694O08787K43L01475A640471J773722A598296f99985J21487E92043
630A20263i74032j07241K57043D04643J107814P13303p78675d83505r59516N84387
$$ plain form
701 2899278 1912921 -365017 -1448731 467074 1938498 117319 -2436575 -2268415 960046
691 3201079 2018386 -394435 -1320458 -97814 990083 63807 -416457 561657 58967 -2049682
680 -2426502 -2360833 -2712495 -1489115 -746604 -404139 1133756 1084511 -389732 -789498 751305
669 2968390 4179050 3578079 3086219 2001515 479062 -1026098 -827442 1191526 1811909
660 1811909 128157 -871396 258542 935036 334979 403522 1504348 1709292 -55093 -1624777
650 -1624777 -1598567 -521433 1230375 2778960 3232007 2957770 1779279 -915745 -2168555
641 -2168555 -1785861 -1177074 -1176831 -875356 1640471 3414193 1598296 -699985 -578498 592043
630 120263 -974032 -1081273 -824230 404643 1512457 2225760 1447085 -483505 -1443021 -858634
620h58634l72564k40727K88361j267506j975285l40960J208741P28385Q06315
611b023874i57442m45761p65442o57432l29654N52757J138125g10017a61759E56440
600A036855M23913O20515G43969a594617k41205g20138K21010o19053m33405d93537
589B488388P68790A302840n25955N59076o18765b97590E00741J608942J582559
580C692242m14175j573295G81899P51989L54133r28513l41882P45326K26427G08828
569e26700l12458K91369J34878l03062K90358E61008R96952P83660q1698Q0145
559B340067J90909A153213f0494A385953M88473B39132a350067k06980M18361
550a138686l56552o75598R5725h95328A057769K002343K26114r08455m84767k04342
$$ plain form
620 -858634 -1231198 -1471925 -1183564 -2451070 -4426355 -4767315 -3558574 -2830189 -2023874
611 -2023874 -957442 -1403203 -2168645 -2826077 -3155731 -2602974 -1464849 -710017 -161759 556440
600 1036855 1460768 2081283 743969 -1594617 -1835822 -720138 -499128 -1118181 -1551586 -493537
589 2488388 3257178 1302840 776885 1335961 717196 -297590 500741 2109683 3692242
580 3692242 3278067 1704772 781899 1533888 1888021 959508 617626 1362952 1589379 708828
569 -526700 -839158 -547789 -412911 -715973 -425615 561008 1557960 2341620 2259922 2340067
559 2340067 2530976 1153213 -60494 1385953 1874426 239132 -1350067 -1557047 -1138686
550 -1138686 -1495238 -2170836 -2075111 -895328 1057769 3060112 3286226 2377771 1893004 1688662
540A688662E03979a360347c97048A073007B45080l9756J746415M10325Q25139
531C187203M52907A513847E73285K75892C7166f68715D42013E5477i03945n98047
521a501992j63970c81919F64605I3232c42700m05862j75007g0055A02325a337303
510b198922e38749A206446E83875B40348R04779L0607f90842j746195R54436A46768
499i76031n42121I16523J044384K56936o6528q01859P6015J142548j145467g46934
488b428806n35535J43125a383230A383349P09752F4994h97624A156764P48062
479A904826E88822a10142A18137b42854A66565J251592o0122a416898k143745
470c560643J105864a03042m20694j108748b23949A029236K09058J4298n6907N19160
$$ plain form
540 1688662 503979 -1360347 -397048 1073007 245080 205324 1951739 2362064 3187203
531 3187203 3640110 1513847 573285 849177 37166 -668715 442013 55477 -903945 -1501992
521 -1501992 -1665962 -381919 664605 93232 -342700 -748562 -923569 -70055 102325 -1337303
510 -2198922 -538749 1206446 583875 240348 1145127 1175734 -690842 -2437037 -1482601 146768
499 -976031 -1518152 916523 1960907 2217843 2151315 1349456 1425471 2568019 1422552 -746934
488 -2428806 -2964341 -2821216 -1383230 1383349 2093101 64994 -897624 1156764 1904826
479 1904826 588822 -110142 118137 -242854 166565 1418157 1358035 -1416898 -3560643
470 -3560643 -2454779 -103042 -523736 -1632484 -223949 1029236 1238294 1252592 1195685 1714845
460A714845k81203n37108M18213f0683k213202P20984a10703j682868o42898B42280
449C724357Q32464j918577b53210j669115p39289Q03728C50292J06112h4283B49462
438D59444a669058k623916l64948j08535r14778J049743a051109E67854f66752
428a387306j5279j56051l04917h78456K66408q65774q49591L27635K80466m84283
418b203595K24459i23390q75025j808308J242960f95378p60836l94785P4692p27083
408b503390o53208J48628K38208o6619j47061m89504O56139R36696j872665k509093
398f261869n68168Q99090J579850P47931M17464R83096o28854r30590J1912M99614
388c250524P26091a081216B48594b90890j921907j984657k218214j614736o00444
$$ plain form
460 1714845 1433642 896534 1314747 -60683 -2273885 -1552901 -110703 -1793571 -2436469 242280
449 3724357 4556821 2638244 -253210 -1922325 -2661614 -1857886 350292 456404 -84283 249462
438 459444 -1669058 -4292974 -4657922 -4766457 -5681235 -4631492 -1051109 567854 -666752
428 -1387306 -1402585 -1558636 -1863553 -878456 -612048 -1477822 -2327413 -1999778 -1719312 -2203595
418 -2203595 -1979136 -923390 -1798415 -3606723 -2363763 -695378 -1456214 -1850999 -1776307 -2503390
408 -2503390 -3156598 -3007970 -2769762 -2836381 -2983442 -3472946 -2816807 -1880111 -3752776 -6261869
398 -6261869 -6830037 -5930947 -4351097 -3603166 -3185702 -2202606 -2831460 -3762050 -3750138 -3250524
388 -3250524 -2524433 -1081216 248594 -290890 -2212797 -4197454 -6415668 -8030404 -8630848
379h630848l35130O20191J654628M41445j711754j353659j104429J211565J716469
370g491522j481636k897863l446951j432040l151794k440468o124937j0742186
362c9209397j4988812p0046742p8085172N8168442g742862C6397916j6796367
355A9601549o398038k023412o35296J145685k061307o78399q36698j033289j016829
346F063966o7894j54033k041585J19974L235202K553891p08622k996083k399549
337C605267J075958J500625N09473Q39822j373966B492157q75070J410926N51219
328C579232q99212H53079i28791c99266D98522A66863O98178J845118J975894
319D686053j816436e30480k99509A429294K411183J204525P0282q53229k64879
$$ plain form
379 -8630848 -8965978 -8345787 -6691159 -6249714 -7961468 -9315127 -10419556 -9207991 -7491522
370 -7491522 -8973158 -11871021 -15317972 -16750012 -19901806 -22342274 -28467211 -39209397
362 -39209397 -54198209 -124244951 -202330123 -144161681 -7742862 36397916 19601549
355 19601549 13203511 11180099 10544803 11690488 9629181 8950782 8114084 7080795 6063966
346 6063966 5996072 5842039 3800454 3920428 7155630 9709521 9000899 6004816 3605267
337 3605267 4681225 6181850 6691323 7531145 6157179 2492157 1617087 3028013 3579232
328 3579232 2680020 853079 -928791 -399266 498522 166863 865041 2710159 4686053
319 4686053 2869617 -530480 -829989 1429294 3840477 5045002 5115284 4262055 3997176
310C997176q33615G22371c56348F76561N72795D18109A39202J533886M53933o55536
300A471485J53734G02379a65544F00393L22890C35859P48354M82447C0365g44739
289a112002K67653A220755K088003A196755f15813A231890K485865o5931j692188
280A959636p24316C31650M2737J901903J423427j58725K04210j133078C33965
270a003621A13735J156558e841j982257M03000A336060P32822g56534k355177
261c111711j97899L64258O88793J066365E25098J104405m13626J036754K81460
252B534091f1668j315188A119170P41271p72102J690479l81411a03062l09504
243d12566A297509L39542o70206a07537o99676p84394J26865A054089R57866B56193
$$ plain form
310 3997176 3163561 722371 -356348 676561 1249356 418109 139202 1673088 2127021 1471485
300 1471485 1625219 702379 -165544 600393 923283 335859 1084213 1566660 30365 -744739
289 -1112002 -844349 1220755 3308758 1196755 -615813 1231890 3717755 3651824 1959636
280 1959636 1235320 331650 374387 2276290 3699717 3540992 3745202 2612124 333965
270 -1003621 113735 1270293 -5841 -1988098 -1585098 1336060 2068882 -756534 -3111711
261 -3111711 -3309610 -2945352 -2256559 -1190194 525098 1629503 1215877 2252631 2534091
252 2534091 -61668 -1376856 1119170 1860441 1088339 2778818 2397407 -103062 -412566
243 -412566 1297509 1637051 966845 -107537 -807213 -1591607 -1464742 1054089 2011955 256193
232i35548L37537D18508A79517g93837a70644A829337J362144A240465J06430
223A346895J703223K24482A294055h22384j65312A191985J799394m42976I55871
213I60044Q33140j68797A2646a925591j254371J424849A991291J959132j664943
204B285480H16149C21736b02499q7973E97734J489316J10002j77306H28348a66187
193b86143l75623O6116a0267A551198N30037o18434A80956b241959j662511R25034
183b979436Q41564m60458a212360A631613R10894j265970J82084J232298j204653
174A486266a966272q56012c11073A324987h1886j260130G30614K169688A186847
164d96374G07689J599333q26356a7064k40053H95983k48918B62354J255769K403617
$$ plain form
232 -935548 -598011 418508 179517 -793837 -170644 1829337 3191481 1240465 1346895
223 1346895 3050118 3274600 1294055 -822384 -987696 1191985 2991379 2548403 955871
213 960044 1793184 1624387 12646 -1925591 -3179962 -1755113 1991291 3950423 2285480
204 2285480 816149 321736 -202499 -290472 597734 2087050 2197052 2019746 828348 -166187
193 -286143 -661766 -595650 -10267 1551198 2081235 1462801 180956 -2241959 -3904470 -2979436
183 -2979436 -2137872 -2598330 -1212360 1631613 2542507 1276537 1458621 2690919 1486266
174 1486266 -1966272 -2822284 -311073 1324987 -81886 -1342016 730614 2900302 1186847
164 -496374 707689 2307022 1480666 -17064 -257117 895983 647065 262354 1518123 3921740
154C921740L84728j821885F00563D0211M37870O42077K25088K12277k44328i58397
143a645525E76080J337568p71215i30851j803110J139285A71728Q21637k01010
134G92355j01494e65352r28673K15564L34208j512271r38635J042064P12897L04517
124a335681m0855j017358L66379B76332J345384E67438f7903G8200d42349j168629
114a610978k31916O40294b71C43897a071442j089673e81658A620067D7339c124514
103d481858J556402g24965G19688J4310j71522a63571p03442j173800r36715a425294
92b72585m55893r05603J58230N18170P8720M09889p17416k197754r38455b045420
81c08234j37138C54892J610312p93381A6964M26882P48075l57318C45506a213714
$$ plain form
154 3921740 4306468 2484583 600563 40211 478081 1120158 1345246 1557523 1313195 -958397
143 -1645525 576080 1913648 1142433 -930851 -2733961 -1594676 171728 993365 792355
134 792355 690861 -565352 -1494025 -1278461 -944253 -2456524 -3395159 -2353095 -1640198 -1335681
124 -1335681 -1376536 -2393894 -2027515 276332 1621716 567438 -67903 78200 -442349 -1610978
114 -1610978 -1842894 -1202600 -271 343897 -1071442 -2161115 -581658 1620067 47339 -3124514
103 -4481858 -2925456 -724965 719688 733998 562476 -163571 -867013 -2040813 -2977528 -1425294
92 -272585 -728478 -1634081 -1475851 -957681 -878961 -469072 -1186488 -3384242 -4322697 -2045420
81 -308234 -445372 354892 1965204 1171823 16964 443846 1191921 834603 345506 -1213714
70b773621o33855L89161P59675n2586n06873n2750N46472N0978k21514l40816
60b835729R15980b42860R1040k122186j440406J141052e37737D19577b88735k25214
50e13949H78934K364104N39285j063227M47384R08981k2862R51981j838165a315007
39a868349H63438Q14293D84397f58664c01771A795888J322500r49697a14506k720569
29b835075P7945h26984f625A52772P99511N37311N53123M77731P78480o44244
19B654684j102521J55287O73890N77783M18713j575838D75930J71455B47766i73679
8h02118e0523D89098b27788A80904Q74654A63954g22569A286871
$$ plain form
70 -2773621 -3407476 -3018315 -2258640 -2311226 -2818099 -2870849 -2324377 -2273399 -2494913 -2835729
60 -2835729 -1919749 -242860 -151820 -2274006 -3714412 -2573360 -537737 419577 -288735 -513949
50 -513949 878934 3243038 3782323 2719096 3166480 4075461 4052599 5004580 3166415 -1315007
39 -1868349 863438 1677731 484397 -658664 -301771 1795888 3118388 2168691 -114506 -2835075
29 -2835075 -2757130 -826984 -6625 152772 952283 1489594 2042717 2520448 3298928 2654684
19 2654684 1552163 1707450 2381340 2959123 3377836 1801998 475930 647385 247766 -973679
8 -802118 -50523 489098 -227788 180904 1055558 163954 -722569 1286871
##PAGE= F1=3021.096038697
##FIRST=     18110.137220953, 5591.54909048506, 2243425
##DATA TABLE= (F2++(Y..Y)), PROFILE
1023B243425K03499q98431B67599a128629o65460J3300d09121C07893d28627F87865
1012C202672r77431a121015r99074L45870l21746J007842B223883J511892k33803
1003C501972j079507B632b299468K92792e86406K10655k7314A807609J846819
994C654428A813896e39712G5638J586110N54331k32166p59516F03387A83843a468085
983b200154c27561A292973m93419g22129j269132r28836j27812j8416J312487
974a753838E89857J648627n06465C69606g65615l19061M99780m13932d39070A040895
963A222265f5073j449965j65490e7078A310315K45694a17772l038440j586712
954d742924K58268K046821I49326J430315J26698j225550d69948A20257J387464
$$ plain form
1023 2243425 2446924 1548493 267599 -1128629 -1794089 -1780789 -409121 307893 -428627 687865
1012 3202672 2225241 -1121015 -2120089 -1774219 -2095965 -1088123 2223883 3735775 3501972
1003 3501972 2422465 2632 -2299468 -2006676 -586406 -375751 -403065 1807609 3654428
994 3654428 1813896 -539712 75638 1661748 2216079 1983913 1224397 603387 183843 -1468085
983 -2200154 -327561 1292973 799554 -722129 -1991261 -2920097 -3047909 -3066325 -1753838
974 -1753838 589857 2238484 1732019 369606 -765615 -1084676 -584896 -998828 -439070 1040895
963 1222265 -65073 -1515038 -1680528 -57078 1310315 1556009 -117772 -3156212 -4742924
954 -4742924 -4484656 -2437835 949326 2379641 2506339 1280789 -469948 120257 1507721
945A507721D28028a102846J53278B52995L95851N8489L377P24169l48187b57982
934d23492a94395j62683C87918f5776j279792b75519F57024b30986r62251l83236
924a576473l73381k30296J00493O85900M51585q47633Q52638C70720h28927j407871
914b236798P44932d60764F53247J622930l30203g07995j184133h20329B79510
904C28778L79626P90671L32719A7953a831904m91559J13818g79770B35265a146929
893b103575P14264O76577A81618J006674J24057M34446l64263C76026c2649B72325
882b67219D3784K316612L08660c57901r29289A120815K153008Q16824N3981m79490
872C665138q59203A371386H6005a514431j291027J347674H7307K44751r7830J42762
$$ plain form
945 1507721 428028 -1102846 -949568 252995 648846 707335 710712 1434881 1086694 -257982
934 -423492 -194395 -357078 387918 -65776 -1345568 -275519 657024 -230986 -1193237 -1576473
924 -1576473 -1949854 -2180150 -2079657 -1393757 -942172 -1789805 -937167 370720 -828927 -2236798
914 -2236798 -1491866 -460764 653247 2276177 1945974 -707995 -1892128 -820329 279510
904 328778 708404 1499075 1831794 17953 -1831904 -2323463 -2209645 -779770 235265 -1146929
893 -2103575 -1389311 -712734 181618 1188292 1312349 1746795 1382532 376026 -32649 272325
882 -267219 43784 2360396 2669056 -357901 -1287190 1120815 3273823 4090647 4144628 3665138
872 3665138 2805935 1371386 86005 -1514431 -2805458 -1457784 87307 332058 234228 376990
862C76990b19342o9436B07806a43230j337820j421377L81049R93462M72225M20502
852f35189I4617N51950M72020G304a578182J64535M74028q61150j243492O36414
842b407847a067684A131351P56613H67011f27807o74615k01003b97769A783080
832A530417d79423J40043I04748n5826a904090j373099a468545b85693H99201
822B254395m42493q73562L01619n49801a96788A207483N82251a021175j501553
813b522728a17823B159994r85239e96797n60201l01051o0609o594j225918o95364
803c446534o9646K76172h04701A954482R80533j374811G7568L22864J236664N5051
793A692147F30094B09284J230822N04190B274a577051N19238A90510d86313j361030
$$ plain form
862 376990 -219342 -288778 207806 -143230 -1481050 -2902427 -2521378 -1527916 -1055691 -635189
852 -635189 94617 646567 1118587 7304 -1578182 -1413647 -939619 -1800769 -3044261 -2407847
842 -2407847 -1067684 1131351 1887964 867011 -627807 -1302422 -1503425 -297769 1783080
832 1530417 -479423 -339380 904748 848922 -1904090 -3277189 -1468545 -285693 899201
822 2254395 1811902 938340 1239959 690158 -196788 1207483 1789734 -1021175 -2522728
813 -2522728 -117823 2159994 1174755 -596797 -1156998 -1458049 -1518658 -1525252 -2751170 -3446534
803 -3446534 -3516180 -3240008 -804701 1954482 2935015 1560204 77568 400432 1637096 1692147
793 1692147 630094 209284 1440106 1944296 2274 -1577051 -1057813 190510 -486313 -1847343
783a847343c91599B140451m8891a09143j883219N9673c21584E50283Q30555O29230
773B010068I05660f24923D40456K086036r21563B6086g6618A22291c99850J87088
763b12762R7633B34727R03947N53995p35509i32986n13786P062j415866j707532
753d563108K78383J480584a014689H22690O99609l71903J21343l20636b57489
743i71489N6244o72456q6853a45708A150613l55758a458147j622351L11628J98166
733b570704N45673e42345D78855a149297n0955I52663J79861n31213J194968J40189
723A936468q96801n19498M72999N16106J37474q15227J97994L32494j43680R4844
713A313173m65834a072946k209901q42824J715448a18823D91496b39331j323767
$$ plain form
783 -1847343 -391599 2140451 2091560 -109143 -1992362 -1932689 -321584 550283 1380838 2010068
773 2010068 905660 -624923 440456 2526492 1604929 26086 -76618 122291 -399850 -212762
763 -212762 -115129 234727 1138674 1692669 957160 -932986 -1446772 -1439710 -2855576 -4563108
753 -4563108 -4284725 -2804141 -1014689 822690 1522299 1150396 1271739 951103 -257489
743 -971489 -915245 -1587701 -1674554 -145708 1150613 794855 -1458147 -3080498 -2768870 -2570704
733 -2570704 -2025031 -542345 478855 -1149297 -1200252 952663 1132524 601311 1796279 1936468
723 1936468 1039667 520169 993168 1509274 1646748 831521 1029515 1362009 1218329 1313173
713 1313173 847339 -1072946 -3282847 -4125671 -2410223 -118823 491496 -239331 -1563098
704a563098K47516A227423J109925A135552d72320k37870G88547J647199k92079
695B143667A09340e41763B190315K066164k035057d46210n51748F32689R94242
686A626931F35538k69194Q96696D16594a736165o104J53923p53356K11253P01682
676a428767c96155I20242B12467a305196o4212B91949K202511J060192o69009
667B885643k49525j163936a7985m84354A38254J606034J30602h3589j774843R02287
657i56145C90863L35325O16950J036561m0694C03784a574613j0342d52366A172520
646B583800O50808j58300p60809C31462i90301n10326q7992j08895L27518A227470
635C338508j571552c76310J83810C59934f18244m13794K98628l25399a94695A452471
$$ plain form
704 -1563098 -1315582 1227423 2337348 1135552 -472320 -710190 788547 2435746 2143667
695 2143667 109340 -541763 2190315 4256479 2221422 -446210 -997958 632689 1626931
686 1626931 635538 366344 1263040 416594 -1736165 -1742269 -1588346 -2341702 -2130449 -1428767
676 -1428767 -396155 920242 212467 -1305196 -1369408 291949 2494460 3554652 2885643
667 2885643 2636118 1472182 -17985 -502339 138254 1744288 1874890 -83589 -1858432 -956145
657 -956145 390863 726188 1343138 2379699 2339005 303784 -1574613 -1584955 -452366 1172520
646 2583800 3234608 3076308 2315499 331462 -990301 -1500627 -1588619 -1697514 -1369996 1227470
635 3338508 1766956 -376310 -192500 359934 -618244 -1032038 -733410 -1058809 -194695 1452471
624B451704m31234H50415g7453j8737o19996j87853M50181j222066k462806q78101
614e016831J035286J183426J249110b89632j7128r10231r84646k58482Q20960
605a639159g19528L28210C37035R16837J8889Q9212P87764I61488a660100m62440
595b122540h89636M11866j44327l95145L68664A818167O91224A046890O641J011179
585B064710k39100r01174k68450N39428J558484j82500F39343g30316C12827J446210
575A759037l38807F77195J36550j42955A11660a09457D41346A01562e45451j95909
565g41360L02832C69938O12667L45607N28432J082596K91640A199392f1335A672020
554A918931A03386a809670o93675N52661L13478l05673m65353P14718I35167K750819
$$ plain form
624 2451704 2020470 850415 -77453 -96190 -716186 -904039 -453858 -1675924 -4138730 -5016831
614 -5016831 -3981545 -2798119 -1549009 -289632 -306760 -1216991 -2201637 -2460119 -1639159
605 -1639159 -719528 -391318 337035 1253872 1272761 1361973 2149737 961488 -1660100 -2122540
595 -2122540 -889636 -477770 -622097 -1017242 -648578 1818167 2509391 1046890 1053531 2064710
585 2064710 1825610 924436 655986 1195414 2753898 2571398 639343 -730316 312827 1759037
575 1759037 1420230 677195 813745 670790 111660 -109457 441346 101562 -545451 -741360
565 -741360 -438528 369938 982605 1328212 1856644 2939240 3230880 1199392 -61335 1672020
554 1918931 103386 -1809670 -2503345 -1950684 -1637206 -1942879 -2408232 -1693514 935167 3685986
544C685986J65393j159974o41935m96940D53002i54276C81443J823451m52966
535A751928j35789J050281l58268N80722O33521A290967D6565P3854h60910o21707
525a482617D15509O83962a03147j717054j74977a07457H31125d77728j002302
516a480030j15276K59670a15226D08634a104157j056967f31932I67911F9627d82891
505D30734j36160a354592j314291N82041R85055j152308k87055a03496A058148
495A750688R2480G58674l01372P48351n28087f31885r89337J91307j19128M40885
485a108158A428390J259631j214728F51173Q59273j72207e42645r60055J12816
476a389884L18016B92753J693384o00316b175185k217589J102856a541085q31607
$$ plain form
544 3685986 3851379 2691405 2049470 1552530 453002 -954276 381443 2204894 1751928
535 1751928 1616139 2666420 2308152 2888874 3522395 1290967 46565 120419 -860910 -1482617
525 -1482617 415509 1099471 -103147 -1820201 -1995178 -107457 831125 -477728 -1480030
516 -1480030 -1595306 -1335636 -115226 408634 -1104157 -2161124 -631932 967911 69627 -482891
505 430734 294574 -1354592 -2668883 -2086842 -1101787 -2254095 -2541150 -103496 1058148
495 1750688 1843168 758674 457302 1205653 677566 -631885 -1621222 -1429915 -1549043 -1108158
485 -1108158 1428390 2688021 1473293 651173 1510446 1338239 -542645 -1502700 -1389884
476 -1389884 -1071868 292753 1986137 1385821 -2175185 -4392774 -3289918 -1541085 -2372692
467b372692o92973a313038B96229L81081J01768L2602M62317n31728c51872l28268
457f80140j531991j726576J676981f78196k404191q54075h71104B968063J800889
448D768952j111121G18364a554883q46478a091486A202820l81378a0261j77554
439a87815l84259j953891j997147o59846q96812r95613J391433a731539B69357
429a265647j172163L17455j3958k06136h83568E7536h10874j379566j28053J41008
419b177485l71799K25482J015808m13717j663484J092393e18026r29362j407030
410b854418q40856q29237k42979O63711P51208j00321j396181r42820J373734
401d418159Q87529k148048j984726l48531L69408J130368J303407P88566O90064
$$ plain form
467 -2372692 -3065665 -1313038 296229 677310 779078 811680 1273997 742269 -351872 -680140
457 -680140 -2212131 -3938707 -2261726 -678196 -3082387 -3936462 -871104 2968063 4768952
448 4768952 3657831 718364 -1554883 -2401361 -1091486 1202820 821442 -10261 -187815
439 -187815 -572074 -2525965 -4523112 -5182958 -6079770 -7075383 -5683950 -1731539 269357
429 -1265647 -2437810 -2120355 -2134313 -2340449 -883568 57536 -810874 -2190440 -2318493 -2177485
419 -2177485 -2549284 -2323802 -1307994 -1721711 -3385195 -2292802 -518026 -1447388 -2854418
410 -2854418 -3695274 -4524511 -4767490 -4103779 -3352571 -3452892 -4849073 -5791893 -4418159
401 -4418159 -3530630 -5678678 -7663404 -8011935 -7642527 -6512159 -5208752 -4420186 -3730122
392c730122l01354O7410M87191J54665k4110J051757J068190r80825j606900j459130
382e273228k329542j688826o44089r22154K93807J377537J225168q48157j340557
373a0150041k039604n15861K09257k114469l129365m725769j845049n641099j801813
364c1753813q370625j6651979k8970164j22084032j34029327J00025106h805563
356F5694797k7867484j0807412l650548k634779j91569m436389l387104j554673
348A1164839O56264r57666j261804j467228k029977J114988K531799J663683o67041
339A0747857k234030j528869R91295K99273l52998K75533k047528B547918m41594
330B106324K239041R56878p93891j826203I37576J43301L56467j24693R61857
$$ plain form
392 -3730122 -4031476 -3964066 -3476875 -3322210 -3346320 -2294563 -1226373 -2207198 -3814098 -5273228
382 -5273228 -7602770 -9291596 -9935685 -10857839 -10564032 -9186495 -7961327 -8809484 -10150041
373 -10150041 -12189645 -12705506 -12496249 -14610718 -17740083 -22465852 -24310901 -29952000 -31753813
364 -31753813 -40124438 -56776417 -85746581 -207830613 -341859940 -241834834 -8805563
356 65694797 37827313 27019901 23369353 20734574 20543005 16106616 12719512 11164839
348 11164839 11821103 10863437 9601633 8134405 6104428 7219416 9751215 11414898 10747857
339 10747857 8513827 6984958 7976253 8275526 7922528 8198061 6150533 2547918 2106324
330 2106324 4345365 5302243 4508352 2682149 937576 1080877 1437344 1312651 2274508
321B274508J588902J827767j390102C96497a071037A047258L614524J970529m66336
312F165975r40000J15420j099255A304196B76605J168774R42777k66664l75018
303A746474J174498Q02433k90455m25286A347699C55888R75497K49064C95574
293E34785O14583D79040A72024F8350L98683J054392J104929E06592a209956B68072
282B620113L90852A461531l46712D65277A13826J703101K262987L76025l28385
273D127554j462240F18735d11249D48708R51154e55345k187736a270061B602037
263B350730a689015k276207N88088O74531N91109a045791G17673J493043M04456
254B615172J277301p39253H8705a063265A216762K53053n79951K199379l65771
$$ plain form
321 2274508 3863410 5691177 4301075 396497 -1071037 1047258 4661782 6632311 6165975
312 6165975 5225975 5341395 4242140 1304196 276605 1445379 2388156 2121492 1746474
303 1746474 2920972 3723405 3432950 3007664 1347699 355888 1331385 1580449 395574
293 534785 1149368 479040 172024 68350 467033 1521425 2626354 506592 -1209956 268072
282 2620113 3010965 1461531 1114819 465277 113826 1816927 4079914 4455939 4127554
273 4127554 2665314 618735 -411249 448708 1399862 -555345 -2743081 -1270061 2602037
263 2350730 -1689015 -3965222 -3377134 -2702603 -2111494 -1045791 717673 2210716 2615172
254 2615172 3892473 3153220 88705 -1063265 1216762 1469815 889864 3089243 2723472
245B723472e43309p41938E43480O74862j87775a68452j221585p87461L51036G96223
234B023646B88460a360292j24428b98276R8305j424957K82067A565793K832866
225D398659j621789A039587R91284R75339j018512B45457d66383E06401J247160
216A753561P3521q17886l1644N95286l67218f4062q81283n41387a07917B707509
205C909425j648992j072301k70156H6652N57282J318652L98986j170121K1164
196A212615m09677c31197k52740J88525k61041j86137A013561J559237l16390
187B256408I00674i79695j513891J26671M57400n30152J211379A420990O57796
178B078786H49758O72740J709166j074837a704455j254992a55672A875646E29653
$$ plain form
245 2723472 -543309 -1285247 543480 1218342 1030567 -168452 -1390037 -2177498 -1826462 796223
234 2023646 288460 -1360292 -1484720 -298276 -199971 -1624928 -1342861 1565793 4398659
225 4398659 2776870 1039587 2030871 3006210 1987698 245457 -466383 506401 1753561
216 1753561 1827082 1009196 977552 1572838 1205620 -64062 -945345 -1486732 -107917 2707509
205 3909425 2260433 1188132 917976 86652 643934 1962586 2361572 1191451 1212615
196 1212615 802938 -331197 -583937 -395412 -656453 -842590 1013561 2572798 2256408
187 2256408 900674 -979695 -2493586 -2366915 -1909515 -2439667 -1228288 1420990 2078786
178 2078786 849758 1522498 3231664 2156827 -1704455 -2959447 -155672 1875646 529653
168h04780H49795J848071A128735f66570A58649J592785N0529H97360a06034B06434
157B60275L23274J233614K283663R65113B501023C60559E5524N66509O08311M03190
147A633534J50772p74411a519105l70818I20306J576881j049750c36613j092012
138a428625e14433F15654L3060A74150A6860a111094o89873l6657L74006m45398
128a909016p81006K42438M47670i97698M59349j122501L52483H48795N83334c93739
117a059139K88954n35638j077890K86343f73495H37137L78228b9078j371234O57534
107g42778H67549b54589k256666j376082M78957a687411A39336L11366j26784
98C23918d20448p18784p96869m35014P75439N13267l87297o80901M91593g10272
$$ plain form
168 -804780 849795 2697866 1128735 -666570 158649 1751434 1801963 897360 -106034 206434
157 260275 583549 1817163 4100826 5065939 2501023 360559 55524 622033 1230344 1633534
147 1633534 1784306 1009895 -1519105 -1889923 920306 2497187 1447437 -336613 -1428625
138 -1428625 -514433 615654 648714 174150 16860 -1111094 -1800967 -1837624 -1463618 -1909016
128 -1909016 -2690022 -2447584 -1999914 -997698 -538349 -1660850 -1308367 848795 1432129 -393739
117 -1059139 -770185 -1305823 -2383713 -2097370 -673495 837137 1215365 -29078 -1400312 -742778
107 -742778 867549 -254589 -2511255 -3887337 -3408380 -1687411 139336 450702 323918
98 323918 -420448 -1139232 -1936101 -2371115 -1595676 -1082409 -1469706 -2150607 -1659014 -710272
87h68169j99944l43072j049958n30732J035331f79719b81378I90134J492030j022423
77A459741D50714P34846Q31984m60040p00928a209812k141664r66451O05485J372991
67b339451Q07532J07865o78258n90015J22235M67018m92573M59204f08563a25788
56a694705j228639O31460f72501F99891k01050c45648C68804K232425P53903q43670
46B511462L36038J147644J35461J60354k136656a502286l09653C36171L42156
37F78327e55957j099190P45870A676128J348572j101455b25132k004441L01419
28a928154d17840B4591P2529J240417O89019l74513j59197J392326J16341j134398
18A867115j95217P57449O42800O13329j230691j213967J0820m55599c81894k47842
$$ plain form
87 -868169 -1068113 -1411185 -2461143 -2991875 -1956544 -679719 -281378 990134 2482164 1459741
77 1459741 450714 1185560 2017544 1557504 856576 -1209812 -3351476 -4317927 -3712442 -2339451
67 -2339451 -1531919 -1424054 -2102312 -2692327 -2570092 -2103074 -2595647 -2136443 -608563 -125788
56 -1694705 -2923344 -2291884 -672501 699891 498841 -345648 368804 2601229 3355132 2511462
46 2511462 2847500 3995144 4130605 4290959 2154303 -1502286 -1811939 336171 678327
37 678327 -555957 -1655147 -909277 1676128 3024700 1923245 -225132 -2229573 -1928154
28 -1928154 -417840 24591 97120 1337537 2026556 1652043 1492846 2885172 3001513 1867115
18 1867115 1671898 2429347 3072147 3685476 2454785 1240818 1251638 796039 -381894 -629736
8f29736J18919K9021m85991H0826J179395F3319a111328E88165
$$ plain form
8 -629736 -510817 -481796 -967787 80826 1260221 63319 -1111328 588165
##PAGE= F1=2999.478501186
##FIRST=     18110.137220953, 5591.54909048506, 1955396
##DATA TABLE= (F2++(Y..Y)), PROFILE
1023A955396L53805j026725d12433j191523k63028K15918e48882F7748l3193J398639
1013A433194K221545j176167a107989j350798J50971n66520M63626C64862J485620
1004A850482K6762l69267A49249a125191K58213a95501o6021j7518A805516J209554
994C015070G51479a552894e72696A655873P23885r44310D44963k13875b77774
984b104213n64987c48868B112910J14634B73558a633872q56295L92192k12374
975b310349Q83493I38780J540823m22088p97088C87860g05513m10898k36504c46233
964G45585K18609D38310h34925r92874a70949B096777N85503H87858b133129j591601
954c724730J69125f73519C047873M58028r08678A292511e58520G2366J381972
$$ plain form
1023 1955396 2309201 1282476 -412433 -1603956 -1866984 -1651066 -548882 67748 34555 1433194
1013 1433194 3654739 2478572 -1107989 -2458787 -2307816 -2874336 -2410710 364862 1850482
1004 1850482 1877244 1507977 149249 -1125191 -866978 -195501 -261522 -279040 1805516 3015070
994 3015070 751479 -1552894 -572696 1655873 2379758 1435448 444963 231088 -277774
984 -2104213 -2669200 -348868 2112910 2227544 273558 -1633872 -2490167 -2097975 -2310349
975 -2310349 -1426856 938780 2479603 2057515 1260427 387860 -705513 -1116411 -1352915 -346233
964 745585 964194 438310 -834925 -1827799 -170949 2096777 2682280 887858 -2133129 -3724730
954 -3724730 -3555605 -673519 3047873 3505901 2597223 1292511 -558520 72366 1454338
945A454338F85828e04369J06398F36127K90408l09249m2719Q64770F44608a121407
934a010020A73744N06803J0544a092764j432642g80084F52903A32810h4930n67911
924f52841p42103r2786l95748p58635L30510M69036g77701L54300j294549j052811
914b770761J175455b44843D60626J170356k15542d40226p39173b78036E39711
904G44832N56086Q15571n6997c53734k514304K8735J276319b09671E48437e71831
893b037759M03878h07508B87319J241810J56579n94020E12504R07L45008R5970
883I54389A00619J01964J597621j71043a406523j60498A604521J943979K20466
874C768966L09829l57512n04658j066850A13851b127122r44826a431011a34543
$$ plain form
945 1454338 685828 -504369 -397971 636127 926535 617286 574567 1439337 644608 -1121407
934 -1010020 173744 680547 691091 -1092764 -2525406 -780084 652903 132810 -84930 -652841
924 -652841 -1394944 -1487730 -1883478 -2642113 -2311603 -1842567 -777701 -423401 -1717950 -2770761
914 -2770761 -1595306 -244843 460626 1630982 1415440 -440226 -1179399 -278036 539711
904 744832 1300918 2116489 2059492 -353734 -2868038 -2839303 -1562984 -209671 548437 -571831
893 -2037759 -1633881 -807508 287319 1529129 1685708 1091688 512504 513411 858419 954389
883 954389 100619 202583 1800204 1629161 -1406523 -1567021 1604521 3548500 3768966
874 3768966 4078795 3721283 3216625 2149775 113851 -2127122 -3071948 -1431011 -134543
864a99960j44264a4841j052667p29376O16658N61439p56905j344725J07631J090606
854a522180O66255L74472a46650D74620P78705A91809a729817l67158L37742k59402
844b018635m76097N39484L66819a74632F31340l15130c94181p17470o47843e12971
833A487593o36715e69799C22423Q75081k52800a206647j332073a192761g2270
823A112015Q92346o12654A41768i5795m27757o69145B19077Q14199a007717q57551
813a865268F81747K059789A306724g51539n01573K21714b65022B62977a278311
803b513354k68551J28772d64427A658586Q06340r97355E57313J40059P74749P2887
793A545008p51043B99040J313575J032742G84569a089291A19920J726067A09788
$$ plain form
864 -199960 -344224 -14841 -1067508 -1796884 -1180226 -618787 -1375692 -2720417 -2612786 -1522180
854 -1522180 -855925 -481453 -146650 474620 1253325 191809 -1729817 -2096975 -1759233 -2018635
844 -2018635 -2494732 -1955248 -1588429 -174632 631340 316210 -394181 -1111651 -1759494 -512971
833 1487593 850878 -569799 322423 1197504 944704 -1206647 -2538720 -1192761 -72270
823 1112015 2004361 1391707 141768 -95795 -523552 -1192697 219077 1033276 -1007717 -1865268
813 -1865268 681747 2741536 1306724 -751539 -1253112 -1031398 -265022 262977 -1278311
803 -2513354 -2781905 -2653133 -464427 1658586 2464926 1467571 557313 697372 1472121 1545008
793 1545008 793965 299040 1612615 2645357 784569 -1089291 119920 1845987 109788
783b177840i88868A754422Q73914H76104a443743m75907R00700d05997A059485
773B165686p98705A90913J056717J440068A168502a56577e3779n69226p04144
764a327149b29924b2171k59965H04824J073499p04117e70563k85935J13061j429718
754b173155j598638O2475O92061Q24268d64600I58928P509j42476J67481R5199
744A086641D44470e37666q89043o2546b74697G62905l06216i84997j203608j03465
734b292070K03538f22675A395525M47738a306156j038157a61118C051a177675
724e21884a87951f509F20330O80214j66567j75146B61280d27165o31592c56086
713A345173j59231a091274j697036K60745f81524E19248r0304b03549j122966
$$ plain form
783 -2177840 -988868 1754422 2628336 876104 -1443743 -1919650 -1018950 -405997 1059485
773 2165686 1366981 190913 1247630 2687698 1168502 -156577 -53779 -623005 -1327149
764 -1327149 -229924 -22171 -282136 804824 1878323 1174206 -570563 -856498 -743437 -2173155
754 -2173155 -3771793 -3709318 -3017257 -2192989 -464600 958928 966437 823961 991442 1086641
744 1086641 444470 -537666 -1426709 -1489255 -274697 762905 456689 -984997 -2188605 -2292070
734 -2292070 -2088532 -622675 1395525 1843263 -1306156 -2344313 -161118 3051 -1177675
724 -521884 -187951 -6509 620330 1300544 1133977 958831 261280 -427165 -1058757 -356086
713 1345173 1185942 -1091274 -2788310 -2527565 -681524 519248 428944 -203549 -1326515
704a326515Q1549I00797P33787B50487e23625A42741J125828J953314Q82150j856302
694B247731I47671K222561J702318B257701b47429q163A650721Q05781q27990
685A628512k87611L12533E62464a197777L83047O2666r70392m54963Q60474G7029
674G10464h68886j445750N02647f1533A797340O14481o09156J41225r28643b96183
663C62302J127156O95675n34073b22424j980887M28888c40808G56745J164034
654A920779P95615l30545F54653a290849j93054d12701I68685R68155P81928J47637
644B866405j25211q69185E02357a069805p23573o5505L87335I30801K102393j256405
634A776789a0297B25832l0102a014636L72000g935j005503L18424A384382J135341
$$ plain form
704 -1326515 -1244966 900797 1634584 250487 -523625 142741 1268569 3221883 4104033 2247731
694 2247731 947671 3170232 4872550 2257701 -247429 -255592 1650721 2456502 1628512
685 1628512 1340901 1653434 562464 -1197777 -814730 -752064 -1722456 -2177419 -1316945 77029
674 710464 -868886 -2314636 -1811989 -61533 1797340 2411821 1802665 1943890 1015247 -296183
663 362302 1489458 2185133 1651060 -222424 -2203311 -1774423 -340808 756745 1920779
654 1920779 2716394 2385849 654653 -1290849 -1483903 -412701 968685 1936840 2718768 2866405
644 2866405 2741194 1872009 502357 -1069805 -1793378 -1858883 -1471548 930801 3033194 1776789
634 1776789 -10297 225832 195730 -1014636 -642636 -7935 -1013438 -695014 1384382 2519723
624B519723j25801k02947o63210o83722E6627a37100A07819a140828k445425j065009
614d651262Q98460J684372e31181E09819J17400a71901q79559j51414e18856a82684
603b82640G36073R85486n42668l53333P80122G81389a425433l37494f74408K67784
593d06624M4225n30492k31349H14262R88890n73598L41703J330778K72331q69495
583B304871E83150g0319A309806n8629f28311j509942a065227A120972L29784
574A450756E25678G9588e47486j90723C17099J306774F66356e81360j16808L2567
564f65601c5192E86750Q723Q59639J887439K78145A341803B73130J616580j13326
554A776384a07202k129920j096090M93511Q68728J76636q40722J60579D87083
$$ plain form
624 2519723 2393922 2190975 1527765 844043 56627 -137100 107819 -1140828 -3586253 -4651262
614 -4651262 -3752802 -2068430 -531181 509819 627219 -171901 -1051460 -1202874 -518856 -182684
603 -282640 736073 1721559 1178891 825558 1605680 781389 -1425433 -1762927 -674408 -406624
593 -406624 -362399 -892891 -1124240 814262 1803152 1229554 1571257 2902035 3174366 2304871
583 2304871 583150 -70319 1309806 1251177 -628311 -2138253 -1065227 1120972 1450756
574 1450756 525678 79588 -547486 -738209 317099 1623873 666356 -581360 -698168 -665601
564 -665601 -35192 586750 595473 1455112 3342551 3620696 1341803 273130 1889710 1776384
554 1776384 -107202 -2237122 -3333212 -2839701 -1970973 -1794337 -2635059 -2474480 487083
544C728590N3127j360011n90151o41575C57798d56587I19629J905159R6934l29423
534B592299J67877q19742O43856O59661I68618d60875k0138q98364k08462I30711
523B443688G26296a936201J79639E59965L89338h03169j024327P8255M97130c6204
512E92935h87147r94913d73183A040798B12252g92647K27267p89470j029011k00944
502b584805K94900L0818j415042m3302a320835a38743F30158L17199e0999l70124
492d21123B77961L39589e0866k33244E35971A39988e26928A283654J449903o11125
482B122432n78674O7099G35040a730370j033042L10223J014614D96933J822846
473B319779j044188b575864k199324J352432J309443j176031n38712J840823a03978
$$ plain form
544 3728590 3781717 2421706 1831555 1189980 357798 -456587 919629 2824788 2921722 2592299
534 2592299 2760176 1940434 2584290 3243951 968618 -460875 -481013 -1379377 -1587839 930711
523 2443688 726296 -1936201 -1756562 559965 949303 -803169 -1827496 -1749241 -1252111 -36204
512 592935 -887147 -1882060 -473183 1040798 212252 -792647 -565380 -1354850 -2383861 -2584805
502 -2584805 -2289905 -2259087 -3674129 -3717431 -1320835 -138743 630158 947357 -50999 -421123
492 -421123 277961 617550 -50866 -284110 535971 139988 -526928 1283654 2733557 2122432
482 2122432 1543758 1610857 735040 -1730370 -2763412 -2453189 -1438575 496933 2319779
473 2319779 1275591 -2575864 -4775188 -3422756 -2113313 -3289344 -3828056 -1987233 -103978
463E63790L0467k5213J26840a08448j498396q78172j358020j047147K312589a174289
452c752719j078488b008372A569211K547870l65764I78751a441737o08360b73858
442A874444p75395A75525b00553p15928j625506j298927q11828j705146j333396
433g691284J346491b414633g9228j620013j564239Q69584L57439l57987f42444
423A116947C56087a478819p22446j92489k77985R3344P64271K50759j225167P03838
413b084694b93991r08339k378823j578904p29343J06089J195971R97364n08508
404d098484k354808q17921K054120R96258j830903j569058n02108o6438M78007
395g711335J418127R63833N28568Q5340Q50858O36265k43137n45789P08637O80494
$$ plain form
463 563790 594257 569044 695884 -108448 -1606844 -2485016 -3843036 -4890183 -2577594 -1174289
452 -3752719 -4831207 -2008372 1569211 4117081 3751317 978751 -1441737 -2050097 -273858
442 1874444 1099049 175525 -200553 -916481 -2541987 -3840914 -4652742 -6357888 -7691284
433 -7691284 -6344793 -2414633 -79228 -1699241 -3263480 -2393896 -2036457 -2394444 -642444
423 1116947 356087 -1478819 -2201265 -2393754 -2671739 -2578395 -1814124 -1563365 -2788532 -2084694
413 -2084694 -293991 -1202330 -3581153 -5160057 -5889400 -5783311 -4587340 -3589976 -4098484
404 -4098484 -6453292 -7271213 -5217093 -4220835 -6051738 -7620796 -8122904 -8189342 -7711335
395 -7711335 -6293208 -5329375 -4800807 -4715467 -3864609 -3228344 -3471481 -4017270 -3308633 -2628139
385b628139j347578r96797o07488k069726j506974l67383j117003j96594O74975
376a0162707R93608M34207r65650k793187k021773p43802k232021k152587l048284
367b2692196l213893p016826j781792r404589j8507153l5806667j43754346j56130671
359c98308133J18756409h664401H0680995l1655885j2638626n217899m830222
352B6338363j647627m557969n185027k295009J620316p73132k071892k509155
344H918868j776417J742286J697605R92716l25402j687630r29477J029991l48544
335I313996j407739n31774k138283B205175j61053K544912J220445n98812j715163
326C495504j474006j01345l16054J59003J328100J000008R96738q08485H74250
$$ plain form
385 -2628139 -3975717 -4972514 -5580002 -7649728 -9156702 -9524085 -10641088 -10837682 -10162707
376 -10162707 -9169099 -8734892 -9700542 -12493729 -14515502 -15259304 -17491325 -19643912 -22692196
367 -22692196 -25906089 -32922915 -34704707 -44109296 -62616449 -98423116 -242177462 -398308133
359 -398308133 -279551724 -8664401 80680995 49025110 36386484 31168585 26338363
352 26338363 24690736 20132767 14947740 12652731 14273047 13499915 11428023 8918868
344 8918868 7142451 8884737 10582342 11575058 11249656 9562026 8632549 9662540 9313996
335 9313996 7906257 7374483 5236200 2205175 2044122 4589034 5809479 5210667 3495504
326 3495504 2021498 1920153 1604099 1763102 3091202 4091210 5087948 4279463 874250
316a143428E70399L825300K225522p93880o07436Q95658q98400B249300q62388
307A386912J086865Q39279k10522n81610N90601R00457r3653r06211A444704n98106
297H46598Q80445J32190B75205b25112F24250L50206j24996j54251K33737L70577
287A299523J21257e57958j196194e09987A572018O01545I33346l45260a38874
277d92853A201534K725349Q34066q61921j654243E62714c31635A49800J160173
268A309973g64326k443347a122204C458734j122214b485518j950614J212992N67213
259b655927K46330a112663H60063J584858Q43089Q61660j316729a36323r40743
250a077066F68274k63078A89741K610628o7145a001858j343894f77981D16865
$$ plain form
316 -1143428 570399 4395699 6621221 5827341 5219905 6115563 5217163 2249300 1386912
307 1386912 2473777 3313056 3102534 2520924 3111525 4011982 3918329 3012118 1444704 846598
297 846598 1727043 1859233 275205 -225112 624250 974456 849460 695209 928946 1299523
287 1299523 1420780 -557958 -1754152 -509987 1572018 2173563 933346 588086 -138874
277 -492853 1201534 3926883 4760949 3899028 2244785 562714 -331635 149800 1309973
268 1309973 -764326 -3207673 -1122204 3458734 2336520 -2485518 -4436132 -3223140 -2655927
259 -2655927 -2409597 -1112663 860063 2444921 3288010 4149670 2832941 -136323 -1077066
250 -1077066 668274 405196 189741 2800369 2733224 -1001858 -2345752 -677981 416865
240G77470d57088j464787m99592M68498D52020J524223E79107a380982p18517
231b099499R86353M14923j608981k74816D26359L291833o58395C25035L83399
222G08434J835329J81260j262040a93545p98837c74091F72785K50477M5604K17453
212A186319D65249c35114J56615j11017A084446K137197M78316j694447p22921
203A282591o0315B80002Q95278J248315n77537d4139C57318M25487d33281m80989
193i14270a32539m26865r98449A37389K143764o592j132413B35317e63179p14365
183a277544k83504p66251Q47808F60915J65961a45584A080015K313934o24034
174B769915i64422j579147B7025J956287H41157c69451H18201J481143I55151
$$ plain form
240 777470 -457088 -1921875 -2421467 -1952969 452020 1976243 579107 -1380982 -2099499
231 -2099499 -1113146 -698223 -2307204 -2582020 426359 3718192 3059797 325035 708434
222 708434 2543763 2725023 1462983 -193545 -992382 -374091 672785 923262 968866 1186319
212 1186319 465249 -335114 -178499 -289516 1084446 3221643 3699959 2005512 1282591
203 1282591 1222276 280002 1175280 2423595 1846058 -44139 357318 782805 -433281 -914270
193 -914270 -132539 -559404 -1557853 137389 2281153 2274561 1142148 235317 -563179 -1277544
183 -1277544 -1561048 -2327299 -1479491 660915 826876 -145584 1080015 3393949 2769915
174 2769915 -964422 -2543569 27025 1983312 841157 -369451 818201 2299344 955151
164a076739J99768G06208P69849l68401a67760j74076A53423R41574R07476J543100
154C545573J215231B290619D27588f2625C47853R45057Q53711k85492B97627b260113
143b373342C26549J434802o65477A18879d58491J62523B80856b9379l75287j04501
133e09167o56050m79336n91172K81444O71533m00539n48083J38290e64459C52449
122f70898J91775A255639k06920a192381p32555L25087m77834j200475L77455
113b900703g08038A505446O72449r48257c92940l17379A04702e76908j324277
104a901185j221719k88278J046585e75818a68k62185p72519m49965J08879Q4867
94a291091l97180J63744o3344q13499M11978f74851k10966o76548J44505K08698
$$ plain form
164 -1076739 -876971 706208 1476057 1107656 -167760 -341836 153423 1094997 2002473 3545573
154 3545573 4760804 2290619 427588 -62625 347853 1292910 2146621 1861129 297627 -2260113
143 -2373342 326549 1761351 1095874 118879 -458491 -295968 280856 -29379 -404666 -509167
133 -509167 -1165217 -1644553 -2235725 -1954281 -1282748 -1683287 -2231370 -2093080 -564459 352449
122 -670898 -479123 1255639 1048719 -1192381 -1924936 -1599849 -2077683 -3278158 -2900703
113 -2900703 -708038 1505446 2177895 1229638 -392940 -710319 104702 -576908 -1901185
104 -1901185 -3122904 -3411182 -2364597 -575818 -168 -262353 -1034872 -1484837 -1375958 -1291091
94 -1291091 -1688271 -1524527 -1587871 -2401370 -1989392 -674851 -885817 -1562365 -1417860 -1209162
84a209162k31337m41809P26913I84J433528R34515j013188o35252Q52535Q53940
74B427062l30361I59110a694732k198958q61588O20081J445659a125750A54693
64g09371j918497J61116a163287m13578l82463P46681e38437n86624o48240J51028
54a622273e67441I09112J06270d5677B76974J879886N82899q62556J28942J444285
44C450430K93484p79764G92914a524390j74001d05333j16436j133470r02209J040834
34a516614A071504J271918A118833f66512q48785M04913c85190p5421k35292I38730
23B182715r47211C59845J860089J101657j152661q55033O80236P04276P18339
14C416748p11910p71944j92543p12806b64166p83774j09348K7527J12540C13990
$$ plain form
84 -1209162 -1440499 -1882308 -1155395 984 1434512 2369027 1355839 720587 1573122 2427062
74 2427062 2096701 959110 -1694732 -3893690 -4755278 -4135197 -2689538 -1125750 154693
64 -709371 -2627868 -2466752 -1163287 -1576865 -1959328 -1212647 -538437 -1125061 -1773301 -1622273
54 -1622273 -567441 909112 1015382 -45677 276974 2156860 2739759 1877203 2006145 3450430
44 3450430 3743914 2964150 792914 -1524390 -1698391 -405333 -521769 -1655239 -2557448 -1516614
34 -1516614 1071504 2343422 1118833 -666512 -1515297 -1110384 -385190 -460611 -695903 938730
23 2182715 1235504 359845 2219934 3321591 2168930 1313897 1994133 2698409 3416748
14 3416748 2704838 1932894 1740351 1027545 -264166 -1047940 -1157288 -1129761 -1017221 313990
3A459466A73954a230593b22506
$$ plain form
3 1459466 173954 -1230593 -222506
##PAGE= F1=2977.860963676
##FIRST=     18110.137220953, 5591.54909048506, 1507471
##DATA TABLE= (F2++(Y..Y)), PROFILE
1023A507471N83345I13382a133572p70846M21813M44010M36830K22674A33711
1013A792715K009005j110242g56219j601568m8905q52592k22310a201101D78416
1003D76196K41559k35173j68657K48045N4158B97057P97J474558K65567d21628
992b502044J165158A274040J053567A103487b6383B6178d38273j872119o17884
983b928276g40915B268062Q11212A089289a158844n38245d88343l3174Q0681A461334
972B559055m20352N5814k05685B90175a089552j20741A56651N53047L6570O0917
962H07185b93795j651818d37831B365756R61539j354777c86625j514938k72863
953b174426I07645L664963m0047j805766A117264h04030b25997A116990k11424
$$ plain form
1023 1507471 2090816 913382 -1133572 -1904418 -1482605 -1038595 -601765 -379091 133711
1013 1792715 3801720 2691478 -756219 -2357787 -2406692 -3259284 -3481594 -1201101 478416
1003 476196 717755 482582 313925 561970 616128 297057 297854 1772412 2037979 -421628
992 -2502044 -1336886 1274040 2327607 1103487 -26383 26178 -438273 -2310392 -2928276
983 -2928276 -740915 2268062 3079274 1089289 -1158844 -1697089 -488343 -521517 -440836 1461334
972 2559055 2138703 2194517 1988832 290175 -1089552 -1210293 156651 709698 746268 807185
962 807185 -293795 -1945613 -437831 2365756 3327295 1972518 -386625 -1901563 -2174426
953 -2174426 907645 4572608 4532561 2726795 1117264 -804030 -225997 1116990 905566
944I05566C11069O7696R19920J92452D42583k01866J001643A57989a757605M24718
934a332887E90713R79534p35671a932163j422835J503673d06646a06037E37957
924C9759e63537K60050p75774k177708l81488J656477e48725n52091j555468n25478
914c181762a296265D23469J22676J84345j54268e0454p7043E53470O51133N26654
904A731257K90672N37664k68389c59227l118507L59067i59615A57615L41030c32442
893a962870K77559O70172b19469A031887N85243F00245b3040F76739Q95796p7694
883A494841E56647k68805O62871m36054a856096N41367B193376J334085p09750
874B817711L82899J35710R4357n92071A25722b525541j68761h39957c78125o12163
$$ plain form
944 905566 311069 378765 1298685 1491137 442583 240717 1242360 157989 -1757605 -1332887
934 -1332887 590713 1570247 834576 -1932163 -3354998 -1851325 -406646 -106037 537957
924 39759 -563537 -303487 -1079261 -3256969 -3638457 -1981980 -548725 -1100816 -2656284 -3181762
914 -3181762 -1296265 423469 546145 730490 576222 -50454 -127497 553470 1204603 1731257
904 1731257 2021929 2559593 2291204 -359227 -3477734 -3118667 -959615 157615 498645 -332442
893 -1962870 -1685311 -1015139 -219469 1031887 1617130 600245 -23040 676739 1572535 1494841
883 1494841 556647 287842 950713 514659 -1856096 -1314729 2193376 3527461 2817711
874 2817711 3200610 3336320 3430677 2838606 125722 -2525541 -2694302 -839957 -378125 -990288
864i90288J1478c42685j416248j308530P84109i42478j10152r09636j83428P12996
854a432698O81447c35452P3835D61522P54568A8004a900682o00730L02214K86624
844a912574L60400N25116n79552M65693a73071C93635l771f33721j276015h55494
833A084524B55102f57364I13186P63717m18129a93489j287889M82887g3249I71560
822A524103G52536g36763q26311m28524m63815a082764A75368e97123j83961A509754
811C094074A329433i93923n75479P40497F07707Q44707A5070a502048n82629Q0650
801b004027d58978F34048O21865l84020r0885l1380L44401K79326l24209B92314
790A395523J657494j327419b95825A230754J957396E82909b420211O98094A044501
$$ plain form
864 -990288 -978810 -342685 -1758933 -3067463 -2283354 -942478 -1052630 -1962266 -2145694 -1432698
854 -1432698 -751251 -335452 -261617 461522 1216090 18004 -1900682 -2501412 -2199198 -1912574
844 -1912574 -1552174 -1027058 -1606610 -1140917 -173071 393635 389864 -633721 -1909736 -855494
833 1084524 255102 -657364 913186 1676903 1258774 -193489 -1481378 -998491 -73249 971560
822 1524103 752536 -736763 -1563074 -1991598 -2455413 -1082764 175368 -597123 -781084 1509754
811 3094074 1329433 -993923 -1569402 -828905 607707 1452414 15070 -1502048 -2084677 -2004027
801 -2004027 -458978 634048 1255913 871893 781008 749628 1094029 1373355 1049146 292314
790 1395523 3053017 1725598 -295825 1230754 3188150 582909 -2420211 -1722117 1044501
780B936475j219183h48655r57598K11097L24120E31936J518347k80353p18916
771A051014Q27597O49704F16339c59338f2098j098736p43958a74542C5346i23439
760A44774J788585l91396f8001k32280a10095j334298j552746m8839O4143k05462
750c187297J251185d1921D68690j99326P80753J400362m46536G8345i17564Q6960
740h30604f7593C36990a92350n73639o75931k98533L59714G52910K273303l94006
730B632207a467535j946487J697619Q0024j616546O0943P22384J197609D00373
720A319065m02351k59372a25414j946817j463815a611130A494133N3994h59482
710b085360P50423A43432K77043F1942b0544n82602j43530G09955K67401e87555
$$ plain form
780 2936475 1717292 -848655 -1806253 -1595156 -1271036 531936 2050283 1769930 1051014
771 1051014 1878611 2528315 616339 -359338 -62098 -1160834 -1904792 -174542 35346 -923439
760 144774 1933359 1541963 -68001 -300281 -110095 -1444393 -2997139 -3045978 -2981835 -3187297
750 -3187297 -1936112 -41921 468690 269364 1050117 2450479 2003943 78345 -917564 -830604
740 -830604 -67593 336990 -192350 -765989 -1441920 -1740453 -1380739 752910 3026213 2632207
730 2632207 -1467535 -3414022 -1716403 -1636379 -3252925 -3191982 -2469598 -1271989 400373
720 1319065 916714 657342 -125414 -2072231 -3536046 -1611130 1494133 1548127 -859482
710 -2085360 -1334937 143432 420475 61942 -20544 -603146 -746676 709955 977356 -587555
699f27116H54778J150200K303956J191972k167064j664979J812125J273895B130014
689B00639O05100J973854N70809n38445n57715o50396C77343f86095c6863j13636
679a50499r17617o31596f98610F49207k20729a960900j204158J156386a77122
669A200506K2437n09171M72793E77812d56299A272937J701611n00061A200259
659b56058j578265j20348i32050E59147J492239M08139n86009H45125i37517m59934
649a397451d47712F95918M39732P40683M60303O07410L24851j454430g15150j026759
639a741909J57827L91504G51662J799362r21952B72592K07459D0287a031801B2777
628G89617h83883j95453A285224J188322M5137N94059k82187j186263G60238k46418
$$ plain form
699 -627116 854778 2004978 4308934 5500906 3333842 1668863 3480988 4754883 2130014
689 200639 805739 2779593 3350402 2811957 2254242 1603846 377343 -686095 -36863 -150499
679 -150499 -1068116 -1699712 -698610 649207 428478 -1960900 -3165058 -2008672 -177122
669 1200506 1222943 713772 1186565 577812 -456299 1272937 2974548 2474487 1200259
659 -256058 -1834323 -1954671 -932050 559147 2051386 2459525 1873516 845125 -937517 -1397451
649 -1397451 -447712 695918 1135650 1876333 2336636 2944046 3268897 1814467 -715150 -1741909
639 -1741909 -1584082 -1192578 751662 2551024 1629072 272592 480051 40287 -1031801 22777
628 789617 -883883 -1079336 1285224 2473546 2518683 3112742 2830555 1644292 760238 513820
618E13820k03900i70826j846736q84265P64012i04558F52254N20059q7602n08526
608E76185B09811J65481K50142G449e17322H21096R25704F72069e1075F71056
597C21382i15265O4185b07504j03405o3580q37205o34465c95152A070384N05941
587A576325O08854J487845P82638r84856B79283a510789d51084N3306j345222
578a743000j324235P93730I3313R36621B44362e75713j050751P4423F66140J820753
568B486893A166719c36050j50364m35906c62985F32154k60929P03163K326959
559C401347K52823A573910G66030J099497m70318d14952k140426j261432L43585
550c473225J220671O01367j018027m60029c17007C068547r2870j426637k04849
$$ plain form
618 513820 309920 -970826 -2817562 -3701827 -2937815 -904558 652254 1172313 1084711 576185
608 576185 209811 375292 625434 7449 -517322 821096 1746800 672069 -51075 671056
597 321382 -915265 -851080 -207504 -310909 -374489 -1211694 -1846159 -395152 1070384 1576325
587 1576325 2185179 3673024 4455662 3470806 279283 -1510789 -451084 -397778 -1743000
578 -1743000 -3067235 -2273505 93313 1029934 244362 -575713 -1626464 -1552041 666140 2486893
568 2486893 1166719 -336050 -486414 -922320 -362985 632154 371225 1074388 3401347
559 3401347 3654170 1573910 766030 1865527 1395209 -414952 -2555378 -3816810 -3473225
550 -3473225 -2252554 -1651187 -2669214 -3129243 -317007 3068547 2975677 1549040 1344191
541A344191n40104B23981d0721A156519J697398N66916n99886o32831q16922R81197
531B352391N42543F67319g80820j5285o14736K71768A626902J917816A309823
521a866465P34022A390254l81271h76932n51586K31673N68837A59517L23860h61914
510a554829a99044A366437m20022e95208j029825j632529j36137J211360J76607
501b005732r34588j755638P9459K217791J021648M49376c84833m47113q6246A36133
490A286540l74520L19479J162714n91617B83529Q16628J209110l98038l90080
481A521149r3820B45785b644301q71164Q48345a232061G05043J648859A073736
471b496402j915118J754482J039700j393280p48671J604623a51122I13590q6803
$$ plain form
541 1344191 804087 223981 -40721 1156519 2853917 3420833 2820947 2188116 1371194 2352391
531 2352391 2894934 667319 -780820 -796105 -1410841 -1139073 1626902 3544718 1309823
521 -1866465 -1132443 1390254 1008983 -876932 -1428518 -1196845 -628008 159517 483377 -861914
510 -1554829 -199044 1366437 946415 -595208 -1625033 -3257562 -3393699 -2182339 -2005732
501 -2005732 -2940320 -4695958 -4616499 -2398708 -1377060 -927684 -384833 -831946 -918192 136133
490 1286540 912020 1231499 2394213 1802596 283529 1100157 2309267 1911229 1521149
481 1521149 1427329 245785 -2644301 -3515465 -2667120 -1232061 705043 2353902 1073736
471 -2496402 -4411520 -2657038 -1617338 -3010618 -3759289 -2154666 -151122 913590 826787
462H26787k06382B33071h24999j614054r51827q86648m71846K276776J024390
453a448208k104928j214140K031753I8524K729349R2483F00928a442050j73935
444a615985D25492J780274j041343C80825j67389d35815j172606p51778q21479
435c181678k202353j682102R12577b760764c65002j456285j720676J374035P81716
426a386212p21204b71734B253020m95722c06296j313488o33553k15509j54032
417b622878M16988R98759o39126J06597f3613o60238k927433j958266n14951L94048
407e730453J601861Q80589j171904k582930m6519K473255J088099j327954j471494
398f287450p87463k26585p8335J065644Q13884N18014M24811J102115L69059n12484
$$ plain form
462 826787 620405 233071 -824999 -2439053 -3390880 -4277528 -4749374 -2472598 -1448208
453 -1448208 -3553136 -4767276 -2735523 98524 2827873 2920356 600928 -1442050 -1615985
444 -1615985 425492 2205766 1164423 380825 213436 -435815 -1608421 -2360199 -3181678
435 -3181678 -5384031 -7066133 -6153556 -2760764 -365002 -1821287 -3541963 -2167928 -1386212
426 -1386212 -2107416 -271734 2253020 1757298 -306296 -1619784 -2253337 -2468846 -2622878
417 -2622878 -2205890 -1207131 -1846257 -1739660 -63613 -723851 -3651284 -5609550 -6124501 -5730453
407 -5730453 -4128592 -3248003 -4419907 -7002837 -7049356 -4576101 -3488002 -4815956 -6287450
398 -6287450 -7074913 -7301498 -7379833 -6314189 -5500305 -4982291 -4557480 -3455365 -3086306 -3598790
388c598790o21114M95637K23973j557725k81153L17392j504626j046086J53799
379g418693q06673n94291j88007j45292J558017l40625l197481k906854r52635
370a4992534j510821r2110k3081m485740o197275k336957q570996j5126112l0527297
361h3862923j20750680j30119950J01479387g281760G1458289k5412102j0290917
354C5755270n632231n996050k292700k319050m837681k819446J201792k82066
346A2777838k144332k806931j310879J758248J096887N82581q568j494435p27361
337G723048J382263j31636k291067j250505j529591A752923j73049K247407J453973
328E281254m23288j642523j107111j69514q74776L81683J708500L58327k61155
$$ plain form
388 -3598790 -4219904 -3724267 -3500294 -5058019 -5339172 -5021780 -6526406 -7572492 -7418693
379 -7418693 -8225366 -8819657 -9007664 -9152956 -7594939 -7935564 -11133045 -14039899 -14992534
370 -14992534 -16503355 -16595465 -16618546 -21104286 -27301561 -29638518 -38209514 -53335626 -83862923
361 -83862923 -204613603 -334733553 -233254166 -7281760 71458289 46046187 35755270
354 35755270 30123039 24126989 21834289 19515239 14677558 11858112 13059904 12777838
346 12777838 10633506 7826575 6515696 8273944 9370831 9953412 9944844 8450409 7723048
337 7723048 9105311 8973675 6682608 5432103 3902512 1752923 1579874 3827281 5281254
328 5281254 4857966 3215443 2108332 1938818 1064042 1445725 3154225 3512552 3251397
319C251397n00153F52267a009214B22420L016751J855836p43801N6196J772878
310F180280l60846k473944n49497Q10411K83730n80958q05848j09091O18379m2438
300B970178j003273q23245O4080M54444l5590C505h98565C38291J246479l60008
290A224762n85700o3807K35982A59806a640597l99426h22535H98898N37392F71173
279A14786i46108o6736H14510K543774Q15818j243771A375124A19050i47743K52932
269f94811A207882c65765k728531a006505C786148j609267b807462j514400J513191
260b808671J84699j37644a072716A172363J296007O51758l8961j279413e39586
250a212779a53239o52264K04830B145879K63080a204213j730423J272683b74626
$$ plain form
319 3251397 2751244 652267 -1009214 222420 3239171 5095007 4351206 4407402 6180280
310 6180280 5819434 3345490 2795993 3606404 3890134 3309176 2503328 2394237 3012616 2970178
300 2970178 1966905 1143660 1207740 1662184 1626594 3505 -898565 338291 1584770 1224762
290 1224762 639062 575255 811237 159806 -1640597 -2040023 -822535 898898 1436290 671173
279 114786 -946108 -1012844 814510 3358284 4174102 2930331 1375124 119050 -947743 -694811
269 -694811 1207882 -365765 -3094296 -1006505 3786148 2176881 -2807462 -4321862 -2808671
260 -2808671 -2623972 -2761616 -1072716 1172363 2468370 3120128 3081167 1801754 -539586
250 -1212779 -153239 -805503 -600673 2145879 2408959 -1204213 -2934636 -1661953 -274626
240D13032h50749j341454J2623M57963C09924J849578q72958h16183j214651N65649
230a465185N48196j529258q36388h96225B037601K06130e21172K7116B087432
220C283587r40717c29109k493601J44984e81528F01037L31840r9282c53475l95512
210g48987A92166O8417J394109J865102l608A711165o30373j07087A75164J020716
200A195880R20824I79502i82348b02046H69996b62560p67212H3628b55478j637497
190a892975g47475A510654K93221o80258J99222J62715A31894a029799j133985
181b163784M10442a61171k44159o28707E31478K759378j5518A64617a562141B88314
170A678843G78836a60342E98844J176701H04061a404987n05762c02101H85463
$$ plain form
240 413032 -850749 -2192203 -2179580 -1721617 309924 2159502 1286544 -816183 -2030834 -1465185
230 -1465185 -916989 -2446247 -3282635 -896225 2037601 2243731 -521172 -494056 2087432
220 3283587 2342870 -329109 -2822710 -2677726 -581528 601037 932877 833595 -353475 -748987
210 -748987 192166 260583 1654692 3519794 3516186 1711165 1080792 973705 175164 1195880
200 1195880 2116704 979502 -982348 -202046 869996 -262560 -1029772 83628 -255478 -1892975
190 -1892975 -747475 1510654 1803875 1123617 1322839 1485554 131894 -1029799 -2163784
181 -2163784 -1753342 -161171 -405330 -1034037 531478 3290856 3275338 164617 -1562141 288314
170 1678843 778836 -160342 598844 1775545 804061 -1404987 -1910749 -302101 885463
160H40404a82227j73690E70457J275203M02658N08742R47664j601759H48079a06913
149d582A531601J444615r06412b79082k415796l6317h08127G7567J66281K20052
139D63900B02098f07141J11906k53540j72206P2499K03566k38041j257672J36155
129b004474d96682K4906j162466j19923b299A187735D49764n6514J075323F43439
118a442742p04375K13427m11319j444050L3812a152049A848049J189000n69508
109B467541G20133c08227K1723m55813n75321r19016n95348L67875a103757c60521
98g48159q41641m5309c77797C0866a610039N2216N37822j109128j03967g45220
87g94252r27817N96311A69189p8101a493143K20170E45314J211646J29082p83222
$$ plain form
160 840404 -182227 -355917 570457 1845660 2248318 2757060 3704724 2102965 848079 -106913
149 -4582 1531601 2976216 2069804 -279082 -2694878 -2731195 -808127 77567 243848 463900
139 463900 202098 -607141 -495235 -748775 -920981 -848482 -644916 -882957 -2140629 -2004474
129 -2004474 -496682 -471776 -1634242 -1754165 -2299 1187735 449764 393250 1468573 643439
118 -1442742 -2147117 -1933690 -2345009 -3789059 -3755247 -1152049 1848049 3037049 2467541
109 2467541 720133 -308227 -286504 -742317 -1317638 -2236654 -2832002 -2464127 -1103757 -360521
98 -748159 -1589800 -1635109 -377797 30866 -1610039 -1557823 -1020001 -2129129 -2233096 -745220
87 -794252 -1722069 -1125758 169189 91088 -1493143 -1272973 545314 1756960 1886042 1102820
77A102820j93760P26251Q44395o2130F89218b456138j662039l11304M01454J026757
67c001270i12863A705000o61486b066379J31717A50040E319a276042l30916O12655
57i94303d60678J91469p7468E2109J146755J00110D68853L19466J418331J50871
47B357521j054600j66540J610807L14861A422149c80213o61825j50775K82166
38i10647m86042r37912n57500J198848D06453J034081A45270a099778M03426b47154
27d51028p30351o61914A24831K018390A034217d85086A593473K081299j045282
18B629490A074434L99657O90283O67219j75388n4332k73726A154993d61303j120194
8a581497Q0407L80935c21696I91009Q61924F55966i84336J76320
$$ plain form
77 1102820 909060 1635311 2479706 2417576 689218 -2456138 -4118177 -4429481 -4028027 -3001270
67 -3001270 -912863 1705000 1043514 -2066379 -1934662 150040 5319 -1276042 -1606958 -994303
57 -994303 -460678 -269209 -346677 52109 1198864 1298974 468853 788319 2206650 2357521
47 2357521 1302921 1136381 2747188 3062049 1422149 -380213 -1042038 -1192813 -910647
38 -910647 -1396689 -2334601 -2892101 -1693253 406453 1440534 145270 -1099778 -696352 -247154
27 -451028 -1181379 -1843293 124831 2143221 1034217 -485086 1593473 3674772 2629490
18 2629490 1074434 1474091 2164374 2831593 2656205 2601873 2328147 1154993 -461303 -1581497
8 -1581497 -1501090 -1120155 -321696 991009 1852933 655966 -984336 -808016
0h08016
$$ plain form
0 -808016
##PAGE= F1=2956.243426166
##FIRST=     18110.137220953, 5591.54909048506, 794023
##DATA TABLE= (F2++(Y..Y)), PROFILE
1023G94023Q69399C40044a836326j94751h24869b86493n01001l33644c27844A470963
1012C314857p54747c02669j668236k71349j126271q60369J948406a64251q7425
1003b51676A45333N87245P20185K83201j53713m23832j5061N22343p70098a520160
992c231397J075372C33088J282743F92488a24784F7810d11350j901023q15474
983c127847a400477A781796J284737A328694i05631j19865I11382L83794F41099
973A766067M52846m92486R25971P05571A470612f58890j51302G29464J06904k67997
963E68371L26501a46189k033282i96102A912704J382790m50485j325212D107h47990
952A868426L199341j78478k282314F38279a175060N02069E38483L25641Q4394
$$ plain form
1023 794023 1663422 340044 -1836326 -2031077 -824869 -286493 -787494 -1121138 -327844 1470963
1012 3314857 2560110 -302669 -1970905 -2242254 -3368525 -4228894 -2280488 -164251 -251676
1003 -251676 145333 732578 1452763 1735964 1582251 1158419 1143358 1665701 895603 -1520160
992 -3231397 -2156025 333088 1615831 692488 -124784 67810 -411350 -2312373 -3127847
983 -3127847 -1400477 1781796 3066533 1328694 -905631 -1025496 911382 1295176 641099
973 1766067 2218913 1726427 2652398 3357969 1470612 -658890 -810192 729464 836368 568371
963 568371 894872 -146189 -2179471 -996102 1912704 3295494 2845009 1519797 4107 -847990
952 1868426 5067767 4889289 2606975 638279 -1175060 -672991 538483 864124 948518
943I48518L7613Q55382K10783B71471c27089E66890e08148j654527P25648H59722
932A997806F82529b436751j178987O92518R60674h25477C95424j80770m4307O99838
922H70185A4475c115444j502545K243627e47750j101304j901711J6515h80917
912A170623m31757c32199j68277B77961O82228M03131O26799Q50956l08292r36
902B531847k34752a32578l394604M60016f20640C5357a29639n62400j299865M46639
892a545265L10701O0663g7988A130760B99807c05303F12098J121207j29554p85552
882H18199D1781b63802m38016j189750h78374B436870N44595A339021K03363Q50629
872B393013Q56559j15950E2017b621390P58239i2022p68153j161544L43028g53546
$$ plain form
943 948518 986131 1841513 2052296 271471 -327089 566890 -508148 -2162675 -1437027 859722
932 1997806 682529 -2436751 -3615738 -2923220 -1962546 -825477 395424 214654 170347 870185
922 870185 14475 -3115444 -4617989 -2374362 -547750 -1649054 -3550765 -3534250 -880917
912 1170623 738866 -332199 -500476 277961 960189 1363320 1990119 2841075 2532783 2531847
902 2531847 2297095 -132578 -3527182 -3067166 -620640 35357 -129639 -692039 -1991904 -1545265
892 -1545265 -1234564 -1173901 -77988 1130760 299807 -305303 612098 1733305 1603751 818199
882 818199 41781 -263802 -701818 -1891568 -878374 2436870 2981465 1339021 1542384 2393013
872 2393013 3249572 3133622 52017 -2621390 -1863151 -92022 -860175 -2021719 -1678691 -753546
861b253542j527955R98790a016194M33262j91685k67160p066M73695a68055j00981
851b69036D82565M59139d58915j475566l95187K23093M40641g07307a6073j130504
841a146577k87903b60823I47302K86989a72389j805930P47727F70870a71272o38431
831h09703A211784R52643m03788H77608e66346n92191d52597D51663M28957D4417
820a452207j283499n74647k99472J395685c50136B04315K63896J714269R27485
811C109965A140754a317788p01076R92420F08337J011007p65760g13785j071796
802a785581J50579Q04358J2300d06232a29502F50775l9875M1138N74217J20446
792A346701B48834O34014K171659n24076E32283J340849J809308E90174b790659
$$ plain form
861 -2253542 -3781497 -2782707 -1016194 -582932 -774617 -1041777 -1048843 -575148 -168055 -269036
851 -269036 482565 941704 -458915 -1934481 -2329668 -2106575 -1665934 -707307 -16073 -1146577
841 -1146577 -1434480 -260823 947302 1234291 -172389 -1978319 -1230592 670870 -171272 -809703
831 -809703 1211784 2164427 1760639 877608 -566346 -1158537 -452597 451663 880620 44417
820 -1452207 -2735706 -3310353 -3609825 -2214140 -350136 204315 468211 2182480 3109965
811 3109965 1140754 -1317788 -2018864 -1026444 608337 1619344 853584 -713785 -1785581
802 -1785581 -1635002 -830644 -818344 -406232 -129502 650775 610900 652038 1226255 1346701
792 1346701 248834 882848 3054507 2530431 532283 1873132 3682440 590174 -2790659
782b568804A79523K756653p35726d12142j219749j43222N2760a08525A611021
772B010562j85085M58061j24880I5179e58103a90492j279428n49284A4663J11007
762A25670a509400P23205A612091J93977C84853F9447J20543i55965j410551J2388
752b354128k73073j014026N45562a065728d3370j29489A060985K356811j67512
743C250284G63725b39059C9197K34504b12915q44112K26410j30312k64491N42579
733f82841A542657K074242j065407a562533k582280P65568o9690j592456j60381
724e201772J219474J762221b2895A103208q0306n5982a74425l241996j874810
715e291231b175280A693364P6245e09616q79955N74030c039k74484l37334H4775
$$ plain form
782 -2568804 179523 2936176 2200450 -412142 -1631891 -1775113 -1722353 -108525 1611021
772 2010562 1825477 2283538 2158658 95179 -558103 -190492 -1469920 -2019204 14663 125670
762 125670 -1509400 -786195 1612091 1806068 384853 69447 189990 -955965 -2366516 -2354128
752 -2354128 -2627201 -3641227 -3095665 -1065728 -43370 -172859 1060985 3417796 3250284
743 3250284 763725 -239059 39197 273701 -212915 -1057027 -830617 -960929 -1225420 -682841
733 -682841 1542657 3616899 2551492 -1562533 -4144813 -3379245 -3448935 -5041391 -5201772
724 -5201772 -3982298 -2220077 -22895 1103208 1022902 966920 -174425 -3416421 -5291231
715 -5291231 -2175280 1693364 1769609 -509616 -1389571 -815541 -3039 -277523 -614857 84775
704B80567f7399F56698j60386a234880L50955A142094J640288K544606O48245
695E975233k751066A471282J481295R27299A934425H88650J113497J764956L30428
686D097531k50850r75411A177077g0204l30142B77329C7842e64874l87163e1043
675I12979F5319b740902q25646J652940g0163H53581C67667d4579E57244I3091
664f29918A934179K269551j609719F87161a34511p93310n66527L83073C77196
654A856064m5555p15744k41912f15719p14849d98717D84053N1450N42360N97469
644A675332J231303J229557j568756e23934q59008N20254K91374G19182J299886
635B019068o11252D38197P3212b9651n81149G72248N60817h33305m17213A251973
$$ plain form
704 280567 -67399 656698 496312 -1234880 -883925 1142094 2782382 5326988 5975233
695 5975233 3224167 1471282 2952577 3879876 1934425 888650 2002147 3767103 4097531
686 4097531 3846681 2871270 1177077 -70204 -400346 277329 37842 -564874 -952037 -51043
675 912979 65319 -2740902 -3566548 -1913608 -70163 853581 367667 -44579 557244 93091
664 -629918 1934179 4203730 2594011 687161 -134511 -927821 -1494348 -1111275 377196
654 1856064 1810509 1094765 852853 -615719 -1330568 -498717 484053 535503 1077863 1675332
644 1675332 2906635 4136192 2567436 -523934 -1382942 -862688 -571314 719182 2019068
635 2019068 1407816 438197 511409 -29651 -610800 772248 1333065 -833305 -1250518 1251973
624B470993L6871R14591N8834j343979r61277l52442A60833a049981q40874m52169
614b343024O13690C77139J321058o2888m94757k20989L19771P77743k40396a6247
603i46841F14760P45163g5514q86707b68498J33005m3895C51490J5211a11938
592d52804j196692q14845J013801C46648J469418R55157J516638J166066j203599
583D250328b2637k710116O33240K69108m22387r46728K38642i51580D27639F3044
572h51035j248449K24538A038642J986786j324213C25363B4175h97857b91782
562A193272n09416Q4494K336968L40597j535219o46836L69274p14514f88443j898856
552b587299j115857K78113J410471Q51478j103356j138239a252920A899962k55174
$$ plain form
624 2470993 2507864 3422455 3481289 2137310 1176033 823591 160833 -1049981 -1890855 -2343024
614 -2343024 -1729334 377139 1698197 1635309 1140552 919563 1239334 2017077 1776681 -16247
603 -946841 614760 1359923 -75514 -962221 -268498 -135493 -179388 351490 366701 -111938
592 -452804 -1649496 -2464341 -1450540 346648 1816066 2771223 4287861 5453927 4250328
583 4250328 -22637 -2732753 -2099513 -1830405 -2252792 -3199520 -2960878 -951580 427639 63044
572 -851035 -2099484 -1874946 1038642 3025428 1701215 325363 24175 -897857 -291782
562 1193272 683856 768350 3105318 3445915 1910696 1263860 1633134 918620 -688443 -2587299
552 -2587299 -3703156 -3425043 -2014572 -1163094 -2266450 -3404689 -1252920 1899962 1644788
543A644788C34144N09258j77475A85191J16527R67885J266589P60795q76297j132915
533A287775m03953J416795L60396F25292f57005K5501k45324c27916B194003J853426
523D047429A602595a515227b78181B172186A078673g10413J63483h5386D77877
513E13345A35814i88356k27485A89315J752763J27350D5163b392505k204129P61787
503c834847a420298K60486j633227j958670P4102J820373O16000q2941P23047
494a601128M30066M09983H65101J637870l43106M84248J202713o11526A317798
484A162192O45809n57153l72363L02665A40446b836766n35011J505829d66522
474I70249J299690A010235a851105j273552a049440b72201j479265j166654J144866
$$ plain form
543 1644788 334144 843402 665927 185191 301718 1269603 2536192 3296987 2420690 1287775
533 1287775 883822 2300617 2661013 625292 -657005 -631504 -876828 -327916 2194003 4047429
523 4047429 1602595 -1515227 -278181 2172186 1078673 -710413 -546930 -85386 477877
513 513345 135814 -988356 -1215841 189315 1942078 2069428 45163 -2392505 -4596634 -3834847
503 -3834847 -1420298 -1159812 -2793039 -4751709 -4677607 -2857234 -2241234 -2324175 -1601128
494 -1601128 -1171062 -761079 865101 2502971 2159865 2644113 3846826 3235300 1317798
484 1162192 1808001 1250848 878485 1181150 140446 -2836766 -3371777 -1865948 -466522
474 970249 2269939 1010235 -1851105 -3124657 -1049440 -272201 -1751466 -2918120 -1773254
465a773254A53952J471942n6886m10612B51756i63001j397146n20575k49970k19517
455c350209J472018N86125j159076j084519J044363f20521A554354J43946C7470
445a272577K99096A087989J259152A129923m66825L77002j96606A47396c34287
435a026026k159057j803780K20382b383929c37800j084611j523822a360994c24556
425a472203B53029K993578p3845A227233d94196j030603k05205n00660R2241d74284
414e83328n56133C02910H4416b714052j926843l26381O26012J798557N07148j784238
404c819797k021225J083207b257406Q90632j151028j615146q47543o0741l28243
395e369475M01878L38625N68131O14423P67315k02097n13779k31741M24998k03623
$$ plain form
465 -1773254 153952 1625894 1569008 1158396 251756 -963001 -2360147 -2880722 -3130692 -3350209
455 -3350209 -1878191 -1292066 -2451142 -3535661 -2491298 -620521 1554354 1698300 37470
445 -1272577 -973481 1087989 2347141 1129923 663098 1040100 843494 147396 -334287
435 -1026026 -3185083 -4988863 -4768481 -2383929 -337800 -1422411 -2946233 -1360994 -324556
425 -1472203 253029 3246607 3172762 1227233 -494196 -1524799 -1730004 -2230664 -2138423 -474284
414 -583328 -1139461 302910 84416 -2714052 -4640895 -4967276 -4341264 -2542707 -2035559 -3819797
404 -3819797 -5841022 -4757815 -2257406 -1366774 -2517802 -4132948 -4980491 -5041232 -5369475
395 -5369475 -4967597 -4628972 -4060841 -3446418 -2679103 -2881200 -3394979 -3626720 -3201722 -3405345
385c405345j575913L34262J060728q34384m02337P34444j72375p12526r74698
376e948144j458154K064983L50161l203093l160302o12818K4299K134260J693103
367h115705m389118l694489k756495o456623r031365j7051311p0124754p5353235
359a96973095O0332738d881064D4619916j3785911n369860m457048n476669j806902
351A3723526O58558k469112k897229p9435M42807j630543k375554q02237J233355
342E804136Q87014L73393k310j529241p26110K005793P23903k687703j592671
333C256204m20030j188235n02801J500513J704221l69645j687340q28960j13701
324A350226B77138M71263J949693q8107A138709D74124B7268d80516B94131J575185
$$ plain form
385 -3405345 -4981258 -4646996 -3586268 -4420652 -4822989 -4088545 -4260920 -4973446 -5948144
376 -5948144 -7406298 -5341315 -4991154 -8194247 -11354549 -11967367 -11943068 -9808808 -8115705
367 -8115705 -12504823 -16199312 -18955807 -25412430 -34443795 -51495106 -121619860 -196973095
359 -196973095 -136640357 -4881064 44619916 30834005 25464145 21007097 15530428 13723526
351 13723526 14382084 11912972 9015743 8936308 9379115 7748572 5373018 4570781 5804136
342 5804136 6691150 7064543 7062233 5532992 4806882 6812675 7536578 4848875 3256204
333 3256204 2836174 1647939 1145138 2645651 4349872 3980227 2292887 1463927 1350226
324 1350226 277138 748401 2698094 2609987 1138709 474124 27268 -480516 294131 1869316
314A869316J047066l63762Q05769K416007K35433j675788j09216M69038n22619
305D171244j155675r57503p11350P1998m4368o40776J48804O50029j94905k55168
295A082330b02317r01211F34013J799869r40599B28142B869N14888e70322j628277
285b198599L73515e47807G44765L17264k18386A59887a207860L11801A042502
275B760385J03354j421495C33129d94085j482921L26286A341273o59400b275883
265f99297C752114j601559b404251j103669J449198k54362l38071e35282A905635
255B585756j73759r90608E81006h45699l69683M04965p99879O19536A538954L23256
245A862210i86550j586568P97284c97445B42060a060582r25296N47650L44274
$$ plain form
314 1869316 2916382 2552620 3358389 5774396 6009829 4334041 4224825 4693863 4171244
305 4171244 3015569 2058066 1346716 1418714 1374346 733570 882374 1532403 1337498 1082330
295 1082330 -202317 -1103528 634013 2433882 1493283 228142 2869 517757 -570322 -2198599
285 -2198599 -1825084 -547807 744765 1062029 843643 159887 -1207860 -896059 1042502
275 2760385 2863739 1442244 333129 -494085 -1977006 -1650720 1341273 681873 -2275883
265 -699297 3752114 2150555 -2404251 -3507920 -2058722 -2313084 -2651155 -535282 1905635
255 2585756 2411997 1421389 581006 -845699 -1215382 -810417 -1610296 -990760 1538954 1862210
245 1862210 -986550 -2573118 -1775834 -397445 242060 -1060582 -1985878 -1438228 -1093954
236a093954E51742K109748k89218C96911a004107J21344M38650j279706j264958
227b988777J318701E12412N01801a126937r5808A749672J729974r19750h29752
217d305105l8493a581884I2681P97240k46751a026955j73039A83681J35454J394560
207A713695J912537j32197A589051F84576A42782c21252H14784O18189B15275
197a323899b96791A067755B27870g84973B26873k2085a746567L78746F49809N75733
187A225542j48493J102810R77280A550875c54415j560087R233f32026k58572l88444
177a279042A60797K783346N39273A301377c38236E20363N17066C48089b22292
167A92307R33803m50810a446775j073039h62508D57271N3006D8939K49220J157335
$$ plain form
236 -1093954 551742 2661490 2372272 396911 -1004107 -882763 -444113 -1723819 -2988777
227 -2988777 -1670076 512412 1014213 -1126937 -1222745 1749672 3479646 2559896 -829752
217 -4305105 -4343598 -1581884 92681 889921 643170 -1026955 -1199994 183681 319135 1713695
207 1713695 3626232 3494035 1589051 684576 142782 -321252 814784 1432973 215275
197 -1323899 -296791 1067755 227870 -784973 226873 204788 -1746567 -1367821 649809 1225542
187 1225542 1077049 2179859 3157139 1550875 -354415 -1914502 -1905269 -632026 -890598 -1279042
177 -1279042 160797 2944143 3483416 1301377 -338236 520363 1037429 348089 -222292
167 192307 1126110 675300 -1446775 -2519814 -862508 457271 510277 48939 298159 1455494
157A455494J165983j08344l84992K83396m25350o45988f7930j05502A982885J907695
147C890580j486465d48946k161617j71523P38455O0176i24137F07855o2105a092043
136a397023j7051j43923L80536A30759R7771a510742J8475B96704K48716i64279
125a222292D44023J233637l16488k77737K42110A61182a196093m82641n3863l78287
115b110884j598734n42692a864977A600539J775672k02447A478215A93479c90583
105h85061m9794n03322m82827k00868O27904g06307k44354r46890K24755E40682
94I88756a578131N4996b17454j315650r03534a033782L10809q74082g33642A199032
83A142095i16733j17597A126858P37708o88143n13696R4208L68593Q08710K01178
$$ plain form
157 1455494 2621477 2513133 2128141 2411537 1986187 1340199 -67930 -173432 1982885 3890580
147 3890580 2404115 -448946 -2610563 -2782086 -2043631 -1983455 -924137 607855 545750 -1092043
136 -1397023 -1414074 -1557997 -1177461 130759 228530 -1510742 -1492267 296704 545420 -964279
125 -1222292 444023 1677660 1361172 1083435 1325545 161182 -1196093 -1678734 -1732597 -2110884
115 -2110884 -3709618 -4252310 -1864977 1600539 3376211 3173764 1478215 193479 -390583
105 -885061 -934855 -1438177 -1921004 -2121872 -1493968 -706307 -950661 -1897551 -1672796 540682
94 988756 -1578131 -1523135 -217454 -1533104 -2436638 -1033782 -722973 -1597055 -733642 1199032
83 1142095 -916733 -1034330 1126858 1864566 1176423 662727 756935 1125528 1934238 2135416
73B135416a14561l320093o62386N19544K489L17825i35229B707395k88527a386899
62a364724A185553J49666e13706j243754L07709b7675A080273P6239k55629M08572
52A309455k01562k69827O77269R96544l41095H65454C04674J467714J66366b35423
41a318803c72160j96310o69541o92053p06774j20410J226527b61712C06813a006069
30a625082b03840C26943g03017j445111j047008a015404A672707G50177a179673
20H20028K760313p78831G84413j756N59104M36051K29311P67351j59328H65685
9a227493r96185N84638Q16524D31897J145024M91180j009862h22809n54181
0a376990
$$ plain form
73 2135416 -114561 -3434654 -4097040 -3577496 -3575007 -3257182 -935229 2707395 2418868 -1386899
62 -1364724 1185553 1335219 -513706 -1757460 -1449751 -27675 1080273 1156512 900883 1309455
52 1309455 1107893 838066 1515335 2511879 2170784 865454 304674 1772388 1938754 -235423
41 -1318803 -372160 -568470 -1238011 -1930064 -2636838 -2757248 -1530721 -261712 306813 -1006069
30 -1625082 -203840 326943 -703017 -2148128 -3195136 -1015404 1672707 750177 -1179673
20 820028 3580341 2801510 784413 782657 1341761 1777812 2007123 2774474 2615146 865685
9 -1227493 -2223678 -1639040 -822516 431897 1576921 2068101 1058239 -822809 -1376990
0 -1376990
##PAGE= F1=2934.625888655
##FIRST=     18110.137220953, 5591.54909048506, 9860
##DATA TABLE= (F2++(Y..Y)), PROFILE
1023I860J103901b77506j969762M27274I840L81173a047044q70133P77554E71665
1012B229836j49779A80760a337795n30860j370751j306703J789455a06653L6577
1003g0076k398G77233J184435L52706J56320k35191j08385m79841B3755b167298
992c433923P01215i35153B83079A26546M2261K88481b07715j998695j058878J252123
982b013165A002738J354149I66021i55756K40997A571999P75529r74890L26351
973A698989j50376o01286J477686J573716j552380A2836c24293A154113q4350
964A069763E27517K40341c70670k103352P72213I68222J818512O39693k81057
955C145370A533673A75037K006982K455891k08696B161798F834a400838M90743
$$ plain form
1023 9860 1113761 -277506 -2247268 -1819994 9840 391013 -1047044 -1917177 -1139623 571665
1012 2229836 2080057 180760 -1337795 -1868655 -3239406 -4546109 -2756654 -106653 -70076
1003 -70076 -72474 777233 1961668 2314374 2470694 2235503 2127118 1647277 23755 -2167298
992 -3433923 -2732708 -935153 283079 126546 168807 457288 -207715 -2206410 -3265288 -2013165
982 -2013165 1002738 2356887 966021 -955756 -714759 1571999 2347528 1372638 1698989
973 1698989 1548613 947327 2425013 3998729 2446349 12836 -324293 1154113 1069763
964 1069763 527517 767858 -370670 -2474022 -1701809 968222 2786734 3426427 3145370
955 3145370 1533673 175037 2182019 4637910 4429214 2161798 6834 -1400838 -910095
946i10095B827N74348O36435J9404Q01054L51600B56904i81042M19480p26988
936a288550r83333R65712I62731R57741B95937b496041p01898r7073K32030J461179
926a601803c55475f4084F14708J068110n42119b207509k660777J956259h39581
916a961427k149643M17223d94719A741613q57514a413140l06447C58942J481503
907A840445J49087O82631J017066r55507o72746n1888B01336b939346L99878d73133
896d91545o54280l32161n52453Q53939j02211q80893Q57212E20579k08888b99947
885C66427R73038o2621n11972e50363j083023j89218J44553e09097B121754j56176
875A965578b39863j19779A101220J524203K71863a2804k224296g90884D61916
$$ plain form
946 -910095 2827 577175 1213610 1233014 2034068 2385668 256904 -981042 -561562 -1288550
936 -1288550 -2271883 -1306171 962731 1920472 295937 -2496041 -3197939 -3295012 -3062982 -1601803
926 -1601803 -355475 -64084 614708 1682818 1140699 -2207509 -4868286 -2912027 -839581
916 -1961427 -4111070 -3693847 -494719 1741613 884099 -1413140 -1719587 358942 1840445
907 1840445 1989532 2672163 3689229 2733722 2060976 2009088 201336 -2939346 -2539468 -473133
896 -491545 -1145825 -1477986 -2030439 -1176500 -1278711 -2159604 -1302392 520579 311691 -299947
885 366427 1339465 1276844 764872 -550363 -1633386 -1822604 -1678051 -509097 2121754 1965578
875 1965578 -239863 -359642 1101220 2625423 2897286 -12804 -2237100 -790884 461916
865a579753j468528P48295J067011j224463j210269J237276f86871E4491N90608
856F45099q0809b31358a11619A36909a38890E03225P2637i07820o26566K05604
846a328782l3837N0659b46346G68139c16988o12641C61056J350934M6861A25899
835a816470M78754D61609b75441o05840A273098J347965j13657o07640D4056a521508
824a035701a76999C28017d40031j263940j472644p90509j35469J525964a64973
814A307942L52649R86717K21803H32407a528270p93636Q11049b61271H97624L48667
804A246291b02874j639638K51817K48479p78215K00391P78258C17592J91220p8374
794D30438P81276M72187C29030K563K352043L00567A209319P46480J293705A17256
$$ plain form
865 -1579753 -3048281 -2299986 -1232975 -2457438 -3667707 -2430431 -686871 54491 645099
856 645099 564290 -231358 -111619 136909 -138890 503225 575862 -907820 -1534386 -1328782
846 -1328782 -1362619 -1311960 -246346 768139 -316988 -929629 361056 1711990 1758851 125899
835 -1816470 -1337716 461609 -275441 -881281 1273098 2621063 2507406 1899766 44056 -1521508
824 -1035701 -176999 328017 -440031 -1703971 -3176615 -3967124 -4102593 -2576629 -164973
814 1307942 1660591 2647308 2869111 832407 -1528270 -2321906 -1510857 -261271 897624 1246291
804 1246291 -202874 -1842512 -1590695 -1342216 -2120431 -1920040 -1141782 317592 508812 430438
794 430438 1211714 1683901 329030 331593 2683636 2984203 1209319 1955799 3249504 117256
783c233195L3076d22562B763451m23199a66027j194658Q019j26329e72254A045936
772B160580L53699K9269p57446b13096m49839K46272j109760q9295D61683n2593
762D09090a748244R6494I82539Q78308F75463B09416r8419g27795j056420J79689
752a604526k99967j385331j76644a637689b97933r0028I71615K802961J34378
743C908954A411459D74112L68926l22283h70272r85897Q72219L40925p7179a18034
732A537159J413643j176124a452816k876939l95864k47054j010945K33202J653113
723d097303J696022d11750H65992O94743L44767A58378d012400j749513a942238
713A863080p5231a49786o59616L1964J42058n07409l09769d2133I72875m74254
$$ plain form
783 -3233195 -3200119 -422562 2763451 2340252 -166027 -1360685 -1352666 -1478995 -572254 1045936
772 2160580 2514279 2543548 1786102 -213096 -662935 -416663 -1526423 -1615718 461683 409090
762 409090 -1748244 -1651750 982539 1860847 675463 209416 110997 -727795 -1784215 -1604526
752 -1604526 -1904493 -3289824 -3466468 -1637689 -297933 -387961 971615 3774576 3908954
743 3908954 1411459 474112 843038 520755 -870272 -1856169 -983950 -643025 -720204 -118034
732 1537159 2950802 1774678 -1452816 -4329755 -4725619 -4972673 -5983618 -5750416 -4097303
723 -4097303 -2401281 -411750 865992 1560735 1905502 158378 -4012400 -5761913 -1942238
713 1863080 1787849 -149786 -809402 -777438 -635380 -1142789 -1452558 -42133 972875 498621
703D98621J93806B92939a544838K49689H32961K331035K559073k52841B301308
693F46600J114637P63258o90907k8368J317671J249514R4816n9195j345683F11334
682e38514J23267c31k02796j09616N3286B28561M23427b93071k597850m46511
672c337432a598352F8151N64218e9322k83225A59690d94255m64676B098588K634626
662D733214k265527B57355j27491o400f62080j67321C74155J132602m68012C69829
651F95991d04801q56776e21143C70057o5027L02887M68025J543608J597311j665788
641B551073e32990k81109A11775J05721N49227P17136l51590D28633j34895C1917
630A54310J171396n1044a051355j72939A283558J243215j24361O55690K41061
$$ plain form
703 498621 692427 292939 -1544838 -1295149 832961 3163996 5723069 5470228 2301308
693 646600 1761237 2524495 1833588 1805220 3122891 4372405 4467221 4408026 3062343 611334
682 -538514 -415247 -331 -203127 -312743 -259457 228561 651988 -293071 -2890921 -3337432
672 -3337432 -1598352 68151 632369 -59322 -342547 159690 -494255 -958931 2098588 4733214
662 4733214 2467687 257355 129864 123464 -662080 -829401 374155 1506757 1038745 369829
651 695991 -404801 -1261577 -521143 370057 305030 607917 1075942 2619550 4216861 2551073
641 2551073 -532990 -814099 111775 217496 766723 1483859 1132269 428633 293738 31917
630 154310 1325706 1274662 -1051355 -1224294 1283558 2526773 2402412 3058102 3299163
621C299163j103498j087840n25367c06245r55361K35895M9125M43542A350921
611B302845m37713q41088j49580Q33904J606001n29778a22170j287141A44082
601E85004i37214p92061P11038d58150E23349P91896n85978I5593e01063j461226
591a962289q35536O11495d60468A592624J429252J488492J336264j402485b36516
581c527656J77638O61427O47383o09216m86328J329381a91850a8176p81605j149672
571a949453L59454A368193J767228j054358r96222m85735f03583H7487J745097
562A832584p59290C40988J980970O07741q58483o89109l00903B87314a029068
552b449711o83630M24596a168092b60833j243710j842932J087427C12633a13410
$$ plain form
621 3299163 2195665 1107825 582458 -306245 -1261606 -1025711 -976586 -533044 1350921
611 2302845 1865132 1024044 874464 1708368 3314369 2784591 -122170 -1409311 144082
601 585004 -937214 -1729275 -1018237 -458150 523349 1315245 729267 95593 -501063 -1962289
591 -1962289 -2797825 -2186330 -460468 1592624 3021876 4510368 5846632 4444147 -236516
581 -3527656 -3350018 -2688591 -2041208 -2650424 -3136752 -1807371 -191850 -18176 -799781 -1949453
571 -1949453 -1589999 1368193 3135421 2081063 1084841 599106 -603583 87487 1832584
562 1832584 1073294 340988 2321958 2929699 2071216 1382107 1081204 287314 -1029068
552 -2449711 -3133341 -2708745 -1168092 -260833 -1504543 -3347475 -2260048 312633 -113410
542a140862B67607L60386F0867K97084Q35908P37887O27414j059399B64673J88026
532D52699J715704K02435G01934b57575K6374Q5189C32949J781192J404699A384356
521a125249C26100K043768H33319g49173D7355Q72631N67498F35222f43317q35217
511a478534L06326C80194J994014N32538E01810b957479k118024J375992g07907
501a92093j904708j873179K0523J177969k6943n17666Q84061a115866b65965A818768
490C559121m13691K10400J075352l98456j887123q61510n220C80525a49518G81798
479B18786b434566j89748g06677B34881P24619R62605H95419a140109l61269F25792
468I74430e40773j504958O64309B78858J736681K61084n04369E27017f68994r24771
$$ plain form
542 -1140862 267607 627993 60867 357951 1193859 1931746 2559160 1499761 264673 452699
532 452699 2168403 2370838 701934 -257575 -231201 -146012 332949 2114141 3518840 1384356
521 -1125249 326100 2369868 833319 -749173 47355 919986 1487484 635222 -643317 -1478534
511 -1478534 -1172208 380194 2374208 2906746 501810 -2957479 -5075503 -3699511 -707907
501 -192093 -2096801 -3969980 -3949457 -2771488 -2798431 -3316097 -2432036 -1115866 -265965 1818768
490 3559121 3145430 3355830 4431182 4032726 2145603 1284093 1278873 380525 -149518 781798
479 218786 -2434566 -2624314 -706677 234881 959500 1922105 895419 -1140109 -1501378 625792
468 974430 -540773 -2045731 -1381422 278858 2015539 2276623 1772254 527017 -668994 -1593765
458a593765J87028L62035l35279J35984J93096p2521n80908K84313d49649E50744
447C56786f52983n47665d97399A417744O96532G50602j01883J032885M75739l38354
437A818989m92636m17577f42560j599714m88169J139888b76449o13552r76123
428a866124d79562D60180i75379E01379K965676M49766j422888F94966e52654
418h31323r18775j24828B07811J81904f89428D64349L05172a231625j572301k81851
408c085777P83744e04266J47584j996513j033938a347569H04633K07075e67545
398b276017m46796L42362k66988l13091l05898N44325N84385P1030q05133k04878
388c076699M45426M43619n03788j420469P12690J448643l36541K07301h78863
$$ plain form
458 -1593765 -1406737 -1044702 -1379981 -1243997 -1050901 -1123422 -1704330 -1420017 -449649 550744
447 356786 -652983 -1200648 -497399 1417744 2114276 750602 648719 1681604 2157343 1818989
437 1818989 1326353 908776 -642560 -2242274 -2730443 -1590555 -276449 -890001 -1866124
428 -1866124 -479562 460180 -975379 501379 3467055 3916821 2493933 694966 -552654
418 -831323 -1750098 -1874926 207811 389715 -689428 464349 769521 -1231625 -2803926 -3085777
408 -3085777 -2302033 -504266 -356682 -2353195 -3387133 -1347569 804633 1011708 -567545
398 -2276017 -2722813 -2380451 -2647439 -2960530 -3266428 -2722103 -2137718 -2066688 -2871821 -3076699
388 -3076699 -2631273 -2187654 -2691442 -4111911 -3399221 -1950578 -2287119 -2079818 -878863
378d47518n81317j518428k074680J910747R24522k867877l056631j18848J867674
369e962356b523539J029153k871290j171097k391374m119322l923465m595018
361b0565952k4101275k5978099K1326944b437890A6792884m337439j230751k321615
353H903079l782796p81755K487417M04994k387668q46031R85248j129856j642475
344B210157m66359M59021R19418L13073k80267j528152o26481K582617J622338
335E205365k470826A288178Q03691l17465G20880N98286J912688m59938I13939
325A09211l926f60561b09719A694989k23760f75309j135838g93363A64397L21587
315D85984R3015K14398J29035J372577K622227N71388r81269L58291K46579j277130
$$ plain form
378 -447518 -1028835 -2547263 -4621943 -2711196 -1786674 -4654551 -7711182 -7830030 -5962356
369 -5962356 -2523539 -1494386 -4365676 -5536773 -7928147 -12047469 -15970934 -20565952
361 -20565952 -44667227 -70645326 -49318382 -2437890 16792884 12455445 11224694 8903079
353 8903079 5120283 4338528 6825945 7230939 4843271 3997240 4982488 3852632 2210157
344 2210157 1743798 2202819 3122237 3435310 3155043 1626891 1000410 3583027 5205365
335 5205365 2734539 1288178 2091869 1774404 720880 1319166 3231854 2771916 913939
325 109211 105285 -660561 -209719 1694989 1471229 -675309 -1811147 -793363 164397 485984
315 485984 578999 793397 922432 2295009 4917236 5488624 4507355 4865646 5112225 3835095
305C835095j684423r68450A90290b52468J9121N844F73251Q82626F69139A70596
294e15055n09071A187196J919235A485763c99743m0990C84242g98695j425217
285b223912Q11148b15750F01999J17065K59584m64664g97218a96495A643429N18916
275B162345I94628d58058m10538m22775j891897O56267A467219K88567a245446
265d08725C303783j201030a654731q08409J125423n35474k09006C76256K448818
256B825074p5886j350932a93170m35316n53581o0069o9529o83597i85620A010069
245I47517g14167q40409M53920e3165B10959a091904m17578f46302J94465H70818
234C027759K72971j440549F95784j85753J57601c34129j544617J40712c39340
$$ plain form
305 3835095 2150672 1182222 190290 -252468 -233347 -227503 673251 1555877 669139 170596
294 -515055 -1024126 1187196 3106431 1485763 -399743 -440733 384242 -798695 -2223912
285 -2223912 -1412764 -215750 601999 719064 978648 513984 -797218 -196495 1643429 2162345
275 2162345 994628 -458058 -868596 -1291371 -3183268 -2527001 1467219 1755786 -1245446
265 -408725 3303783 2102753 -1654731 -2463140 -1337717 -1873191 -2082197 376256 2825074
256 2825074 2749188 1398256 -193170 -628486 -1182067 -1242136 -1311665 -1995262 -985620 1010069
245 947517 -714167 -1554576 -1100656 -53165 210959 -1091904 -1509482 -646302 -451837 870818
234 3027759 3300730 1860181 695784 510031 667632 -334129 -1878746 -1738034 -339340
224f8847j364867j29543A287470J722931j138440a695437l407934O8525b291589
214f41834F40481k32125a627336j36900b31707a261A327181K034682P8491A561541
203H3060a192062o7945A60958N11064c20210r40513a67890A123288l63926c27693
192A79761L79840a328586l78917a18067G03051L03863J579138J392482j422990
183B555544B56323a691312k82400f61002K42432l75456b8051B241575Q58135j219011
173A880699E43852r0028A17862c81320j38414J62841C15523J28155a195133j287040
163b482173g97950D93795J9599P7551Q72463J038452N61965m84650q06678l97270
153A375227M67676l17554e3274K5164B536902J950017j859940b45143j803906
$$ plain form
224 -68847 -1433714 -1563257 1287470 3010401 1871961 -1695437 -5103371 -5034846 -2291589
214 -641834 640481 408356 -1627336 -1764236 -231707 -1261 1327181 3361863 3440354 1561541
203 83060 -1192062 -1260007 160958 672022 -320210 -1260723 -167890 1123288 759362 -327693
192 179761 559601 -1328586 -1707503 -118067 703051 1006914 2586052 3978534 2555544
183 2555544 256323 -1691312 -1973712 -661002 -418570 -794026 -28051 2241575 3099710 1880699
173 1880699 543852 453824 117862 -381320 -519734 -356893 315523 443678 -1195133 -2482173
163 -2482173 -797950 493795 513394 590945 1463408 2501860 3063825 2579175 1772497 1375227
153 1375227 1842903 1525349 -53274 -28110 2536902 4486919 2626979 -245143 -2049049
144b049049m48487m92000q02754J668724E04432J20163a421543o90942J25308
135a987177m05665P81777G41230N32786d93500J02I44095Q3833e50263k40695
125g90958E82622J097116J58753l69630o48601c93765k56928o8129m38973l61956
115a519751j423849j041418J486647H02586K224044N5606j479855E01491d02665
105a071322L56639m286j29207o43747k76144P32707L27042j026729R8569I50526
94A255120a631808N4194D51261g90691j698326J083957f09869m73835b11881A745862
83A618084b66762k13670A655444K58835F09525A82479O1869A16909P27983L38212
73A183104a243178k995892N27729J354178m52938m13255i51360C071632K3117
$$ plain form
144 -2049049 -2497536 -2989536 -3792290 -2123566 504432 624595 -1421543 -2112485 -1987177
135 -1987177 -2392842 -1611065 741230 1274016 -493500 -493398 944095 1027928 -550263 -790958
125 -790958 582622 1679738 1838491 1468861 820260 -393765 -650693 -718822 -1157795 -1519751
115 -1519751 -2943600 -3985018 -2498371 802586 3026630 3082236 1602381 501491 -402665
105 -1071322 -714683 -718969 -848176 -1491923 -1768067 -1035360 -708318 -1735047 -1636478 950526
94 1255120 -1631808 -1577614 451261 -790691 -2489017 -1405060 -609869 -1083704 -211881 1745862
83 1618084 -266762 -480432 1655444 1914279 609525 182479 244348 116909 844892 1183104
73 1183104 -1243178 -4239070 -3711341 -2357163 -2810101 -3223356 -951360 3071632 3094749
64C094749f87935j38312A650726K62485A23073a470590j74620A20110J871117
55A991227N54127p52393n22287F16025M01005J257829P42768p03460H21695b22204
44G18931o8689a571792k60651B79881E2036a255824o82346m77355L22459i22478
33e81497j17714j284972k2664B161P02586h68228k046849j225447a975150I48816
22D31135a559590H2495K896531m13477E13009A80141L23670O0421M11821J462345
12B438398R6134B56829b293674l58941J234140c35785I66688R82326J85431q04651
2A329794g25437j028785
0a754222
$$ plain form
64 3094749 -687935 -826247 1650726 1913211 123073 -1470590 -1645210 120110 1991227
55 1991227 2545354 1792961 1270674 616025 1017030 2274859 3017627 2314167 821695 -222204
44 718931 650242 -1571792 -1832443 279881 52036 -1255824 -1938170 -2415525 -2093066 -922478
33 -581497 -699211 -1984183 -2006847 2161 704747 -868228 -2915077 -4140524 -1975150 948816
22 431135 -1559590 82495 2979026 2565549 513009 180141 503811 564232 976053 2438398
12 2438398 2534532 256829 -2293674 -2652615 -1418475 -335785 966688 1949014 2134445 1329794
2 1329794 -725437 -1754222
0 -1754222
##PAGE= F1=2913.008351145
##FIRST=     18110.137220953, 5591.54909048506, -487094
##DATA TABLE= (F2++(Y..Y)), PROFILE
1023d87094F75790f24169j419593R67583I83397l1947a098539j203256N21273
1014a780522d52950I42453O00882p47611c99141q28120j592680j496093J722867
1005b593167D38513M55167A72930N07458J176242M41061Q56684L02662k71505
996C185532j188900e3195j878771q47983J32494O89481Q32984c45645H62347M09605
986A271952B75487a889425j234758R93748D83126J020210C68777a091930M24831
977f67099A513677R34833q05428k05829m56527B89567J453309K095822p73970
968C064728H55718B40174J215893L835o50547j14491f60066j904617M24665A43558
957B331673J540657M52969j674785I92450J222749J650823l46739A616037c70343
$$ plain form
1023 -487094 675790 -624169 -2043762 -1076179 983397 951450 -1098539 -2301795 -1780522
1014 -1780522 -452950 942453 1543335 795724 -399141 -1227261 -2819941 -4316034 -2593167
1005 -2593167 438513 893680 172930 680388 1856630 2297691 3154375 3457037 3185532
996 3185532 1996632 -53195 -1931966 -2779949 -2647455 -1957974 -1124990 -345645 862347 1271952
986 1271952 275487 -1889425 -3124183 -2130435 483126 1503336 368777 -1091930 -667099
977 -667099 1513677 2448510 1643082 1437253 980726 289567 1742876 3838698 3064728
968 3064728 855718 240174 1456067 1459902 809355 694864 -660066 -2564683 -2140018 143558
957 2331673 3872330 4325299 2650514 992450 2215199 3866022 3519283 1616037 -370343
947a062060d69017e8712C28845Q94996J2471O91417N14886E51473a395734l42525
937a738259j27992n9107h23860A090806N13571d4106j971297r2181l91186l64364
927b863134R99678P16388c82943H66714J219705R8354f36319l443050Q66863a194850
916a858993k118899N72077g0356B125251I34911b317594n76174A36928K286691
907B423619N0201O94527R57889j324141j301977P0455E82589a750533L14900b05333
896i74219j007271j44802L13450e13766m21801j716302N87437B12259N86762A32994
885B44924N14953L8504l00988a225269j475061K24489J210016b46541A381202
875H13483a357249l71906h1048A704915N09868A10922a226232C50140L16972b306118
$$ plain form
947 -1062060 -469017 -58712 328845 1223841 1236312 1927729 2442615 551473 -1395734 -1738259
937 -1738259 -1866251 -1925358 -823860 1090806 1604377 -44106 -2015403 -2107584 -2498770 -2863134
927 -2863134 -1863456 -1147068 -382943 866714 2086419 2184773 -636319 -4079369 -3212506 -1194850
916 -1858993 -3977892 -3405815 -70356 2125251 934911 -2317594 -2893768 136928 2423619
907 2423619 2473820 3168347 4126236 2802095 1500118 1570573 582589 -1750533 -1435633 -205333
896 -974219 -1981490 -2126292 -1812842 -513766 -935567 -2651869 -2064432 212259 799021 132994
885 244924 759877 798381 497393 -1225269 -2700330 -2475841 -1265825 -246541 1381202
875 813483 -1357249 -1729155 -81048 1704915 2214783 110922 -1226232 350140 667112 -2306118
864c686248J091558R98194o76289l88180a197385A31780P42951J158826K55162
855B288719I53076k14733o4957A57147M09756j86005h98767d47198E15121A5745
844g57616a64756A180479m94321A96307J190424R85150n75959B72418a216911
834h51975F57825G2179f09791A358267J763117M12600o69941D67524a686112K25563
824a460549e51016A32692d46054q63123j370631r58400R5302J714663G86316J683584
814B469900J08529L12738l66172E87078a391292q06226K10759M40815a76908A350012
803A14596a974292K69335K9364j083368K5890R79448C2253O32537k3792P11967
793A352965O27325E98699d8040B021597R36026j338479O273N69808f03199k916611
$$ plain form
864 -3686248 -2594690 -1596496 -2272785 -2660965 -1197385 131780 874731 2033557 2288719
855 2288719 953076 738343 673386 157147 566903 380898 -898767 -447198 515121 15745
844 -757616 -164756 1180479 686158 196307 1386731 2371881 1795922 272418 -1216911
834 -851975 657825 72179 -609791 1358267 3121384 3533984 2864043 467524 -1686112 -1460549
824 -1460549 -551016 132692 -446054 -1309177 -2679808 -3638208 -3542906 -1828243 786316 2469900
814 2469900 2578429 2891167 2524995 587078 -1391292 -2197518 -1986759 -1545944 -176908 1350012
803 114596 -1974292 -1704957 -1675593 -2758961 -2733071 -1753623 32253 664790 640998 1352965
793 1352965 1980290 598699 -48040 2021597 2957623 1619144 1625417 2195225 -603199 -3519810
783c519810K99172c81240B612202l43943d4674r43180c69824j32616q0591F32759
772B328739P79196m08320j172316b49068m07535n4391o78623N74752A179444k28209
762I51235a473443o09398C18886J378174G04455H2231b65435l69845m86092L05729
752h15643j04886j264810p26251J354861b73326k09907F82719K791149M22546
743C896414A915964q36128K26622D45837a562215p46655a003509c55906J57674
734a98232B40459O17253N22686o04561a100975k892606j489689l90483K0426J167600
724d685727J838135J059071f28882G70043J640072P37204G00738c722858j211133
715d933991a187201A862348k77978A07452c81398m12429l05846o60645n18890
$$ plain form
783 -3519810 -3220638 -381240 2612202 2268259 -44674 -987854 -369824 -502440 -583031 632759
772 2328739 3107935 2699615 1527299 -249068 -656603 -710994 -1389617 -814865 1179444 951235
762 951235 -1473443 -2082841 318886 1697060 704455 82231 -265435 -635280 -1121372 -815643
752 -815643 -920529 -2185339 -2911590 -1556729 -273326 -483233 682719 3473868 3896414
743 3896414 1915964 1079836 1306458 445837 -1562215 -2308870 -1003509 -355906 -198232
734 -198232 240459 857712 1380398 775837 -1100975 -3993581 -5483270 -5873753 -5853327 -4685727
724 -4685727 -2847592 -1788521 -628882 770043 2410115 3147319 700738 -3722858 -4933991
715 -4933991 -1187201 1862348 1584370 107452 -381398 -793827 -1099673 -1760318 -2279208
706b279208d84751A177143m90446Q032l43416a485596l38000a21535B663891K359640
696E023531q41867A166914c03802B87544P84163Q30682R27845J080073M74185
687D384492j56245N005j460969A58921g73947N8220j13426L8678c39979I0527
676a6522o7799m51556j753594k53010J267955g6306A96391b80437l1009e5976
665a214956l45544A617491K619432A958665d9087D30796M32958A13231b88250
655E27384N74717C19600a45211C89711c56202q16487e29547B75910P9662J57233
645E12805J15562J448383J413590j693059g45175b69077I96752q4998j48966J56548
635I19336j55116A85456a59728A90898Q26243M14152D29444a646563N23497A272643
$$ plain form
706 -2279208 -484751 1177143 686697 694729 351313 -1485596 -1823596 -121535 2663891 5023531
696 5023531 4181664 1166914 -303802 287544 1071707 1902389 2830234 3910307 4384492
687 4384492 4228247 4233252 2772283 158921 -773947 -715727 -829153 -790475 -339979 90527
676 -16522 -84321 -535877 -2289471 -2542481 -1274526 -76306 196391 -280437 -311446 -55976
665 -1214956 -1560500 1617491 4236923 1958665 -49087 430796 863754 113231 -288250
655 527384 1102101 319600 -145211 389711 -356202 -1172689 -529547 275910 355572 512805
645 512805 628367 2076750 3490340 1797281 -745175 -269077 996752 911754 762788 919336
635 919336 764220 185456 -159728 190898 1017141 1431293 429444 -1646563 -1123066 1272643
624B505975l50171m0992K40001n68067D77728b80516p34469n05138d63798a907
613B53086J429874O09328m17815q74884m25127Q94912K421926m58625a99018j549056
603a748074e21387P730j311465m66192P48620f25793I26539O42963E99408A47362
592e23286j540843p95244K36843J201514G34571J944863J467644J266551j448831
583C964798c79466l460009j89407J216539a256794n30477j226893O30299g19378
573a02992n52035p99190N90707A547469J222059p25261o04139n73769b28044D77482
562A986237r88475c58929A081119J002955l09189H38575A58651e62374r82639
553a545013p67233p0899P67395F2325Q34512f14699k486936j50515a520401o03433
$$ plain form
624 2505975 2155804 2114812 2354813 1786746 477728 -280516 -1014985 -1520123 -463798 -1907
613 253086 1682960 2292288 1874473 999589 574462 1469374 3891300 3432675 -199018 -1748074
603 -1748074 -521387 -513657 -1825122 -2291314 -1542694 -625793 926539 1569502 599408 147362
592 -523286 -2064129 -2859373 -2622530 -1421016 734571 2679434 4147078 5413629 3964798
583 3964798 -379466 -3839475 -4028882 -2812343 -1256794 -1787271 -3014164 -2383865 -719378
573 -102992 -655027 -1454217 -863510 1547469 2769528 2044267 1440128 866359 -228044 477482
562 1986237 997762 -358929 1081119 2084074 1774885 838575 158651 -562374 -1545013
553 -1545013 -2312246 -2383145 -1615750 62325 896837 -614699 -3101635 -3252150 -1520401 -2123834
543b123834o57439e22002C91604c74450c4622H34034K46645K79557C08623f74831
532h589A696643J24520F69239A17313E8019K92147J03286O64222P45820E81197
521i41459C07318J291969e2324j369630c07799A176444O26242A16576a969811
511b456045Q42310A39024K162272N84788A70419c515492j273998J538438d54033
501D06171a342171j503872K3890L59959p94512n77860J118121h42954A24598K151548
491B276146J625852m91478m12445R75761M1234j612544j178925m88627d23310
481a167765B25860K9867a758630n2673c5905B68039J88987Q06288E53489h86619
470c29148A587820k65246c02525j540942L53230b30769A509575Q47328l84178
$$ plain form
543 -2123834 -2781273 -522002 391604 -374450 -34622 834034 1080679 1360236 308623 -674831
532 -8589 1696643 1821163 669239 117313 58019 350166 453452 1117674 1863494 581197
521 -941459 307318 1599287 -52324 -1421954 -307799 1176444 1802686 116576 -1969811
511 -2456045 -1613735 139024 2301296 2886084 170419 -3515492 -4789490 -3251052 -454033
501 406171 -1342171 -2846043 -2822153 -2462194 -3256706 -3834566 -2716445 -842954 124598 2276146
491 2276146 3901998 3410520 2998075 3973836 4015070 2402526 1223601 734974 -423310
481 -1167765 225860 255727 -1758630 -1811303 -35905 268039 457026 1263314 553489 -886619
470 -329148 1587820 1322574 -302525 -1843467 -1490237 -230769 1509575 2356903 1972725
461A972725F95209b77233l62999A86835P66268B73005i67738j01715b26444d397
450A2137L38617e8896p75092o05756q1517e23038A227675K18759f0025I5035J506084
439A601119J107957k13542o94311M131n49713A20709h39247N501L94909j79642
429f18479k15970b000D33170i79301A86310K375824R79095n27316j493429B89090
418a73553j347429j92012D35228J39368g09149A96607P49841A26582i39163m16582
408a355745e35134A146093J01091c47946j95947A761066J553764r23465g1841
398a527401L82089c26891p3624q45003q71400L59016L21932o07313j131828L37742
388b837369J121281M63016o15385j143450Q35167g46992k59526d81526A010521
$$ plain form
461 1972725 695209 -277233 -640232 186835 953103 273005 -967738 -1069453 -226444 -4397
450 12137 350754 -58896 -833988 -1439744 -1521261 -523038 1227675 1446434 -60025 95035 1601119
439 1601119 2709076 2495534 1801223 1805354 1255641 120709 -839247 -833746 -438837 -618479
429 -618479 -834449 -2000 433170 -979301 186310 2562134 3541229 3013913 1520484 289090
418 -173553 -1520982 -1712994 435228 574596 -709149 196607 946448 126582 -939163 -1355745
408 -1355745 -535134 1146093 1247184 -347946 -543893 1761066 3314830 2391365 -71841
398 -1527401 -1145312 -326891 -400515 -1245518 -2116918 -1757902 -1435970 -2043283 -3175111 -2837369
388 -2837369 -1716088 -1253072 -1868457 -3011907 -2176740 -746992 -1006518 -481526 1010521
378A720633m34164d24602j581836e16075G56554a550741k874362J93299a013084
368B297298q17922C68535J4251h32141k075169j532901O01084k242249j797634
359g879010J777733g87543G56629E6088J63365a87400k137524j46540G1306K063972
349B135278H19293j03316Q94001C95475f72614m27691k81217e25146a28568m98143
339f26711j271893l19268D83314K012964G42505a71988A609951L83361C40998
329A62650J964237o23368f10513j096640J28219J5554M05833C51082j02129a773845
318c248407a326783G62047k35628d04037k09083a18975A484440K396406M16508
309D297354p81418O96948K90476j699076H16728I600h18293o26999K25993f03752
$$ plain form
378 1720633 1286469 -424602 -2006438 -516075 756554 -1550741 -4425103 -4231804 -1013084
368 2297298 1479376 368535 382786 -832141 -2907310 -4440211 -3839127 -6081376 -7879010
359 -7879010 -6101277 -787543 756629 56088 219453 -187400 -2324924 -2471464 71306 2135278
349 2135278 819293 715977 1609978 395475 -672614 -1100305 -1381522 -525146 -128568 -626711
339 -626711 -1898604 -2217872 483314 2496278 742505 -171988 1609951 1993312 340998
329 162650 2126887 1503519 -610513 -1707153 -1578934 -1563380 -1157547 351082 248953 -1773845
318 -3248407 -1326783 762047 526419 -404037 -613120 -118975 1484440 3880846 4297354
309 4297354 3515936 4212884 4503360 2804284 816728 9600 -818293 -1445292 -1219299 -603752
298E50565O64109b42987o98167j3182Q8724A596264J652614A154401i45405d52123
287C44182f97391j129736P52561b83282D6240N9715N63312J82072A41334P10709
277H52043J424494o30019h75449j451641L11475l8091j990225J032975A407271
267B292796d53246J94929B586159o72315i92067o51838P38913n27593K53139A460216
256C687864p19922E62004a178480m37082J5806K39040k81559l88204f75940E91139
245b51745m48969K81125a2990E42120k24290h79794n6865a48561f2755A005329
234B871639P69224m27426n35040k90382j40370q29380c29416q62794d34326j08458
224e42784q24730k43802F02425J337720E63337b630804k425406L56809K063598
$$ plain form
298 550565 1214674 -242987 -941154 -954336 -865612 1596264 3248878 1154401 -945405 -452123
287 344182 -697391 -1827127 -1074566 -283282 46240 105955 669267 851339 141334 852043
277 852043 2276537 1646518 -875449 -2327090 -2015615 -2053706 -4043931 -3010956 1407271
267 2292796 -453246 -258317 2586159 1913844 -992067 -1643905 -904992 -1432585 -1179446 1460216
256 3687864 2967942 562004 -1178480 -1615562 -1599756 -1360716 -1642275 -2030479 -675940 591139
245 -251745 -700714 -419589 -12990 542120 317830 -879794 -936659 -148561 -62755 1005329
234 2871639 3640863 3213437 2678397 2388015 2247645 1418265 -329416 -1192210 -434326 -542784
224 -542784 -1367514 -1611316 602425 1940145 563337 -2630804 -5056210 -4699401 -2635803
215b635803J236383A71524B6682b127317j99986h23144M05221G40858J974901
206B715759N00794A570020e51755k015565K77296c79831B02615e57559n13502
197a071061g6139I15578K11372B33311D2010O64344g96100r22445f20588C56307
186I28028J600607J403890r22625G36429a461612m41712b75100H19493B45426
176e8620A250035Q48390m81809F88591b0745q26208k48320L19750j4307L08523
166d81307A27026f49146j014170b0242A201682m3469L34447J415497N24492m48399
156B984250o77512o75756o89533P02092l74551h1262D97733K592403J385048j984441
146B490743A48736a156971p35394j455150j455368J849685B77998L25492a331882
$$ plain form
215 -2635803 -1399420 171524 26682 -2127317 -2327303 -823144 -417923 740858 2715759
206 2715759 3216553 1570020 -551755 -2567320 -2290024 -379831 202615 -557559 -1071061
197 -1071061 -76139 915578 1126950 233311 42010 706354 -796100 -1718545 -620588 356307
186 928028 2528635 3932525 3009900 736429 -1461612 -1903324 -275100 819493 245426
176 -58620 1250035 2098425 1616616 688591 -20745 -846953 -1095273 -775523 -789830 -481307
166 -481307 127026 -649146 -1663316 -20242 1201682 1158213 1492660 2908157 3432649 2984250
156 2984250 2306738 1630982 941449 1643541 1268990 -81262 497733 3090136 4475184 2490743
146 2490743 148736 -1156971 -1892365 -3347515 -4802883 -2953198 277998 603490 -1331882
136b335574j9529q50751J163178I23605R66045F43518J37817O27955m91874e06049
125e84954D25874Q73502N80530l10350A38683h95320f722D10209d58286k98674
115g56960p79638j200135J07967a94065B155326J52265A130715D43591e08112
105a258871d67397G4611K45595f92757j193219O21874a2215r92901n28338F79157
94H88017a655404j6207H03433d1330k172334O31127c11930g9841E80081J378365
84A958446k76503C16112q0552J848624j3782D84918a65270l22544o22560e34506
73b26363k068150k118954J590432i22637q21625r35524f91563C018003J64694
64C182697A04196a94431A590250N4109F02665f12573p29396G9791K239114J114981
$$ plain form
136 -2335574 -2355103 -3205854 -2042676 923605 1889650 643518 781335 1409290 917416 -506049
125 -584954 425874 1299376 1879906 1569556 138683 -895320 -6722 410209 -458286 -756960
115 -756960 -1536598 -2736733 -2628766 -194065 2155326 2307591 1130715 443591 -508112
105 -1258871 -467397 74611 320206 -692757 -1885976 -1264102 -12215 -1005116 -1533454 679157
94 888017 -1655404 -1671611 803433 -41330 -2213664 -1582537 -311930 -79841 580081 1958446
84 1958446 1681943 316112 235560 2084184 2070402 484918 -165270 -487814 -1110374 -534506
73 -226363 -2294513 -4413467 -2823035 -922637 -1744262 -2679786 -691563 3018003 3182697
64 3182697 104196 -194431 1590250 1644359 602665 -612573 -1341969 79791 2318905 3433886
54C433886r07813A228500A73957R51000J858736P07532q38661A322564b34327
44a27158k50699j793934L26434G31909j53985h75779m59546k54530O80584A74602
33b67332q93881j214651M23957A89742R14720f67253k310522j092071J827734
24b242112B96249m2075a428136c48058B056580o8708C68995b1637A4928c57720
13H459J821934L47185c90874k766929N85835g32875C29082R94477Q98767J5775
3B238101o36766d66940j215804
0a682744
$$ plain form
54 3433886 2526073 1228500 173957 1124957 2983693 3691225 2852564 1322564 -234327
44 -127158 -377857 -2171791 -1845357 731909 577924 -875779 -1335325 -1589855 -909271 174602
33 -267332 -1161213 -2375864 -1951907 189742 1104462 -667253 -2977775 -4069846 -2242112
24 -2242112 296249 254174 -1428136 -348058 2056580 1987872 368995 -21637 14928 -357720
13 8459 1830393 2177578 -390874 -3157803 -2571968 -732875 329082 1323559 2222326 2238101
3 2238101 1601335 -466940 -1682744
0 -1682744
##PAGE= F1=2891.390813634
##FIRST=     18110.137220953, 5591.54909048506, -617162
##DATA TABLE= (F2++(Y..Y)), PROFILE
1023f17162C64991f55864o52745D775J796956n81371h98873j215288J35218O59792
1013a319151b76573A064219L36062E88718e61276j794014j441962J628685H57327
1003A853573E21464k50369Q15322N47905J632879J067798m20756j361909F15561
993i50923n63310m72378n21604K70410f82265A536810N41888G45894a561541j238107
983b799648J019812C13889M33274c26474j043571L86673G67980Q26276l50675
974A243581l13433l13624i2614G04569K079210K03301A431581E48822Q51306K64318
964A664446n46624E31539a055954j530372K95455c26919B051942J912323P00085
955D664350j523038A439493N79749R90527o55469I15753d97302K00685D77225
$$ plain form
1023 -617162 364991 -655864 -1308609 4775 1801731 1220360 -898873 -2114161 -1978943 -1319151
1013 -1319151 -276573 1064219 1400281 588718 -561276 -2355290 -3797252 -2168567 857327
1003 1853573 521464 271095 1086417 1634322 3267201 4334999 3914243 2552334 615561
993 -950923 -1514233 -1986611 -2508215 -2237805 -682265 1536810 2078698 745894 -1561541 -2799648
983 -2799648 -1779836 313889 747163 -326474 -1370045 -983372 767980 1594256 1243581
974 1243581 930148 616524 -92614 704569 2783779 2987080 1431581 548822 1400128 1664446
964 1664446 1117822 531539 -1055954 -2586326 -2290871 -326919 2051942 3964265 4664350
955 4664350 3141312 1439493 2019242 3009769 2354300 915753 -497302 -296617 477225
945B26969C9992Q06973N794M56795N56069G39704a684839j135116N39984Q54687
935a425284c25056A044244n0393d42387r83450M68547p7968n35556n9749j12226
925a742789f62854G63546J063677Q40428H98451b664959o06647J588563J3402
916a669641j745800M72995A29457J916902E01425c294202q93946g09777B322608
906B533615N42420P34277j202405H85914p4382k54148f03715b54335H8493a263075
895b383962j6064R05064D2086e07134k160257L07082A22701J303904G01069A81284
884H9218O2635a37700j836012j387519O57715a012382c53146B20827d05555j568011
874a973566l83067a065969C97039N71039A71833G862J072885B36720c053790r00867
$$ plain form
945 226969 39992 846965 852759 1309554 1865623 739704 -1684839 -2819955 -2279971 -1425284
935 -1425284 -325056 1044244 993851 -442387 -1425837 -957290 -1035258 -1570814 -1630563 -1742789
925 -1742789 -662854 763546 1827223 2667651 898451 -2664959 -3271606 -1683043 -1669641
916 -1669641 -3415441 -2942446 129457 2046359 501425 -3294202 -4188148 -709777 2322608
906 2533615 3076035 3810312 2607907 885914 811532 557384 -603715 -254335 88493 -1263075
895 -2383962 -2400026 -1494962 42086 -507134 -2667391 -2360309 122701 1426605 701069 181284
884 89218 151853 -137700 -1973712 -3361231 -2703516 -1012382 -353146 220827 -405555 -1973566
874 -1973566 -2356633 -1065969 397039 968078 171833 7862 1080747 236720 -3053790 -3954657
864c954657J265072P47038q4244O77222B87614O99696M49598J301488N28087j393691
854A872792l56764m39503B60023J47876j53924d59044A034279J530907j061644
845A503542b01759l33837I42148L69093r5582Q27736L14669A098270F9856c67104
834G9640R59768m25587e0322A495930J991805R94025r73521F90178a539424j07771
824a647195f77016A67579a50374m03923j076015r91995M26512c50971A930369
814C111188l13624j32555o78149C49082i93761p42677o04275m27428a163974A141642
803A51935b078955J45775J27777r27089q6428Q71589a73004I97066J30041K46684
793A373791N16212G82832c66779I98799J289254p09339n74230j19376a369529
$$ plain form
864 -3954657 -2689585 -1942547 -2026791 -1349569 287614 987310 1436908 2738396 3266483 1872792
854 1872792 1516028 1076525 260023 407899 253975 -459044 1034279 2565186 1503542
845 1503542 -201759 -535596 942148 1311241 1215659 2043395 2358064 1098270 69856 -367104
834 79640 1039408 613821 -50322 1495930 3487735 4481760 3508239 690178 -1539424 -1647195
824 -1647195 -677016 167579 -150374 -554297 -1630312 -2622307 -2195795 -350971 1930369
814 3111188 2797564 2665009 1986860 349082 -993761 -1736438 -2340713 -2768141 -1163974 1141642
803 151935 -2078955 -1933180 -1805403 -2732492 -2818920 -1947331 -173004 997066 1127107 1373791
793 1373791 1890003 782832 -366779 998799 2288053 1578714 1004484 885108 -1369529
783c533876R87004B88906K195225m70126f6184o20382G67040Q7990a37824D75833
772B466986R58462q39033A250882a93180n12460m40789j18906C1745J906783l59625
762A578903h19875j122049a15434A316210C50165c95750m46943K74665J88337
753c79691a21579C5833g45793j012520P16889b21581m99331G8196K511766P09998
743C299960j130798p34122j87237f2384k093165r2333g62827d0572C27460N3614
733C81074a20455j87794A06596e90596k762596k239864m38555J224343K298540
724b508728h49865P8659R8683H72123K406671Q97589A194462b714799n54263c59188
713A619684l60017B69667E562d13235m70833r64131j013519a111450H81830l89982
$$ plain form
783 -3533876 -2546872 288906 2484131 2014005 -66184 -686566 767040 855030 -137824 475833
772 2466986 3425448 2586415 1250882 -193180 -705640 -1146429 -1265335 31745 1938528 1578903
762 1578903 -819875 -1941924 -115434 1316210 350165 -395750 -842693 -568028 -379691
753 -379691 -121579 35833 -745793 -1758313 -1041424 -221581 -720912 78196 2589962 3299960
743 3299960 2169162 1435040 1247803 -62384 -2155549 -2247882 -762827 -40572 327460 381074
733 381074 -120455 -308249 106596 -590596 -3353192 -5593056 -6031611 -4807268 -2508728
724 -2508728 -849865 -771206 -672523 872123 3278794 4176383 1194462 -2714799 -3269062 -359188
713 1619684 1259667 269667 5562 -413235 -884068 -1848199 -2861718 -1111450 881830 491848
$$ [...]
##END NTUPLES=nD NMR SPECTRUM
##END=
