##TITLE=Analysis number 330153
Compound Code cc 59046
Book Reference 546/54
Project Code adrs
Chemist Name craigr
##JCAMPDX= 6.0         $$ Bruker NMR JCAMP-DX V2.0
##DATA TYPE= NMR SPECTRUM
##DATA CLASS= NTUPLES
##ORIGIN= Bruker BioSpin GmbH
##OWNER= nmr
$$ XWIN-NMR		Version 3.5
$$ Thu Nov  1 10:58:21 2007 GMT Standard Time (UT+0h)  MAYBRIDGE\nmr@NMR_250MHZ
##.OBSERVE FREQUENCY= 250.131544655141
##.OBSERVE NUCLEUS= ^1H
##.ACQUISITION MODE= SIMULTANEOUS (DQD)
##.ACQUISITION SCHEME= undefined
##.AVERAGES= 16
##.DIGITISER RES= 18
##SPECTROMETER/DATA SYSTEM= dpx250
##.PULSE SEQUENCE= zg30
##.SOLVENT NAME= CDCl3
##.SHIFT REFERENCE= (INTERNAL, CDCl3, 0, 16.522)
##AUDIT TRAIL= $$ (NUMBER, WHEN, WHO, WHERE, WHAT)
$$ ##TITLE= Audit trail, XWIN-NMR		Version 3.5
$$ ##JCAMPDX= 5.01
$$ ##ORIGIN= Bruker BioSpin GmbH
$$ ##OWNER= nmr
$$ C:\u/data/dgb/nmr/ADRS/10/pdata/1/auditp.txt
$$ ##AUDIT TRAIL=  $$ (NUMBER, WHEN, WHO, WHERE, WHAT)
(   1,<2007-11-01 10:57:51.46 +000>,<MAYBRIDGE\nmr>,<NMR_250MHZ>,
      <created by zg, POWCHK disabled, PULCHK disabled
       configuration hash MD5:
       76 6E 9A 78 1E 09 19 81 EC 84 63 8F B0 6A 59 2D
       data hash MD5: 64K
       A1 01 52 4B 48 F0 1F 0A 0A EA 9B A0 BC F4 95 30>)
(   2,<2007-11-01 10:58:08.71 +000>,<MAYBRIDGE\nmr>,<NMR_250MHZ>,
      <Start of raw data processing
       ef LB = 0.3 FT_mod = 6 PKNL = 1 SI = 32K 
       data hash MD5: 32K
       80 23 43 EB 20 60 D3 52 24 4D BC AF 6A 7D 94 70>)
(   3,<2007-11-01 10:58:10.47 +000>,<MAYBRIDGE\nmr>,<NMR_250MHZ>,
      <apk 
       data hash MD5: 32K
       9F 16 24 3C 7B 88 AE E2 77 79 61 31 0D 1C 4C 2A>)
(   4,<2007-11-01 10:58:11.33 +000>,<MAYBRIDGE\nmr>,<NMR_250MHZ>,
      <abs ABSG = 5 
       data hash MD5: 32K
       CE ED 00 F4 F3 C2 E2 10 57 51 33 60 9B A7 8F 76>)
$$ ##END=
$$ 
$$ hash MD5
$$ BE 12 88 EE 8E F7 B3 E5 BA 9E D8 73 7C A3 01 E2
##$RELAX= 
##$RELAX= 
##$RELAX= 
##$RELAX= 
##$RELAX= 
##$RELAX= 
##$RELAX= 
$$ Bruker specific parameters
$$ --------------------------
##$DU= <C:\u>
##$EXPNO= 10
##$NAME= <ADRS>
##$PROCNO= 1
##$TYPE= <nmr>
##$USER= <dgb>
##$AMP= (0..31)
100 100 100 100 100 100 100 100 100 100 100 100 100 100 100 100 100 100 
100 100 100 100 100 100 100 100 100 100 100 100 100 100 
##$AQSEQ= 0
##$AQ_mod= 3
##$AUNM= <au_zg>
##$AUTOPOS= <4 >
##$BF1= 250.13
##$BF2= 250.13
##$BF3= 250.13
##$BF4= 250.13
##$BF5= 500.13
##$BF6= 500.13
##$BF7= 500.13
##$BF8= 500.13
##$BYTORDA= 1
##$CFDGTYP= 0
##$CFRGTYP= 5
##$CHEMSTR= <none>
##$CNST= (0..31)
1 1 145 1 1 1 1 1 1 1 1 1 1 1 1 1 1 1 1 1 1 1 1 1 1 1 1 1 1 1 1 1 
##$CPDPRG= <>
##$CPDPRG1= <>
##$CPDPRG2= <>
##$CPDPRG3= <>
##$CPDPRG4= <mlev>
##$CPDPRG5= <mlev>
##$CPDPRG6= <mlev>
##$CPDPRG7= <mlev>
##$CPDPRG8= <mlev>
##$CPDPRGB= <>
##$CPDPRGT= <>
##$D= (0..31)
0 1 0 0 0 0 0 0 0 0.06 0 0 0 0 0 0 0.0002 0 0 0 0 0 0 0 0 0 0 0 0 0 0 
0 
##$DATE= 1193914670
##$DBL= (0..7)
120 120 120 120 120 120 120 120 
##$DBP= (0..7)
150 150 150 150 150 150 150 150 
##$DBP07= 0
##$DBPNAM0= <>
##$DBPNAM1= <>
$$ [...]
##$SUBNAM7= <"">
##$SUBNAM8= <"">
##$SUBNAM9= <"">
##$SW= 20.6930455092707
##$SWIBOX= (0..15)
0 0 3 0 0 0 0 0 0 0 0 0 0 0 0 0 
##$SW_h= 5175.983436853
##$TD= 65536
##$TD0= 1
##$TE= 295.16
##$TE2= 300
##$TE3= 300
##$TEG= 300
##$TL= (0..7)
0 120 120 120 120 120 120 120 
##$TP= (0..7)
150 150 150 150 150 150 150 150 
##$TP07= 0
##$TPNAME0= <>
##$TPNAME1= <>
##$TPNAME2= <>
##$TPNAME3= <>
##$TPNAME4= <>
##$TPNAME5= <>
##$TPNAME6= <>
##$TPNAME7= <>
##$TPOAL= (0..7)
0.5 0.5 0.5 0.5 0.5 0.5 0.5 0.5 
##$TPOFFS= (0..7)
0 0 0 0 0 0 0 0 
##$TUNHIN= 0
##$TUNHOUT= 0
##$TUNXOUT= 0
##$USERA1= <user>
##$USERA2= <user>
##$USERA3= <user>
##$USERA4= <user>
##$USERA5= <user>
##$V9= 5
##$VALIST= <valist>
##$VCLIST= <CCCCCCCCCCCCCCC>
##$VD= 0
##$VDLIST= <DDDDDDDDDDDDDDD>
##$VPLIST= <PPPPPPPPPPPPPPP>
##$VTLIST= <TTTTTTTTTTTTTTT>
##$WBST= 1024
##$WBSW= 4
##$XGAIN= (0..3)
0 0 0 0 
##$XL= 0
##$YL= 0
##$YMAX_a= 440023
##$YMIN_a= -510116
##$ZGOPTNS= <>
##$ZL1= 120
##$ZL2= 120
##$ZL3= 120
##$ZL4= 120
##$ABSF1= 16.522
##$ABSF2= -4.171173
##$ABSG= 5
##$ABSL= 3
##$ALPHA= 0
##$AQORDER= 0
##$ASSFAC= 0
##$ASSFACI= 0
##$ASSFACX= 0
##$ASSWID= 0
##$AUNMP= <proc_1d>
##$AZFE= 0.1
##$AZFW= 0.1
##$BCFW= 0
##$BC_mod= 0
##$BYTORDP= 0
##$COROFFS= 0
##$CY= 12.5
##$DATMOD= 1
##$DC= 0
##$DFILT= <>
##$DTYPP= 0
##$F1P= 14.0000005364418
##$F2P= -0.99999901652339
##$FCOR= 0.5
##$FTSIZE= 32768
##$FT_mod= 6
##$GAMMA= 0
##$GB= 0
##$INTBC= 1
##$INTSCL= 1
##$ISEN= 128
##$LB= 0.3
##$LEV0= 0
##$LPBIN= 0
##$MAXI= 10000
##$MC2= 0
##$MEAN= 0
##$ME_mod= 0
##$MI= 0
##$NCOEF= 0
##$NC_proc= -4
##$NLEV= 6
##$NOISF1= 0
##$NOISF2= 0
##$NSP= 0
##$NTH_PI= 0
##$NZP= 0
##$OFFSET= 16.522
##$PC= 1
##$PHC0= 157.5406
##$PHC1= 4.25202
##$PH_mod= 1
##$PKNL= yes
##$PPARMOD= 0
##$PSCAL= 4
##$PSIGN= 0
##$REVERSE= no
##$SF= 250.13
##$SI= 32768
##$SIGF1= 0
##$SIGF2= 0
##$SINO= 400
##$SIOLD= 32768
##$SREGLST= <1H.CDCl3>
##$SSB= 0
##$STSI= 32768
##$STSR= 0
##$SW_p= 5175.98343685301
##$SYMM= 0
##$S_DEV= 0
##$TDeff= 65536
##$TDoff= 0
##$TI= <Analysis number 999999
Compound Code 99
Book Reference 9
Project Code 9>
##$TILT= no
##$TM1= 0
##$TM2= 0
##$TOPLEV= 0
##$USERP1= <user>
##$USERP2= <user>
##$USERP3= <user>
##$USERP4= <user>
##$USERP5= <user>
##$WDW= 1
##$XDIM= 32768
##$YMAX_p= 511057395
##$YMIN_p= -377970
$$ End of Bruker specific parameters
$$ ---------------------------------
##NTUPLES= NMR SPECTRUM
##VAR_NAME=  FREQUENCY,     SPECTRUM/REAL,   SPECTRUM/IMAG
##SYMBOL=    X,             R,               I
##VAR_TYPE=  INDEPENDENT,   DEPENDENT,       DEPENDENT
##VAR_FORM=  AFFN,          ASDF,            ASDF
##VAR_DIM=   32768,         32768,           32768
##UNITS=     HZ,            ARBITRARY UNITS, ARBITRARY UNITS
##FACTOR=    0.157963299565203, 1,           1
##FIRST=     4132.6476996994, 0,             0
##LAST=      -1043.33573715361, 0,           0
##MIN=       -1043.33573715361, -377970,     0
##MAX=       4132.6476996994, 511057395,     0
$$ Real data points
##PAGE= N=1
##DATA TABLE= (X++(R..R)), XYDATA
$$ [...]
$$ plain form
15964 10370 15361 31854 17463 -8747 16233 75871 46607 7759 2915 13874 32585 57806
15952 57806 43302 37173 29608 12544 9414 -31212 -32851 -28239 -9435 1228 -20289 -59554 -60539
15939 -60539 -59825 -60155 -56069 -61627 -55226 -34256 -24749 -74008 -75827 -47193 -10180 1683 16689
15926 16689 19345 5119 16176 2364 -40746 -22406 -4916 32272 23246 -6036 -22512 -42702
15914 -42702 -50898 -72237 -42825 41851 57260 51724 8935 -14241 28315 9512 -12174 -17955
15902 -17955 -9501 9601 -5332 -16158 -15808 13380 -27991 -31611 -25424 7605 -10698 -59400 -62145
15889 -62145 -72474 -55542 -692 4958 -2766 -35938 -63089 -40422 -14886 14477 24816 16603
15877 16603 7901 -19134 -11894 -5011 -47730 -46895 -17727 -1210 26080 46457 50139 14951 -12928
$$ packed form
15964A0370M991J6493j4391k6210K4980N9638k9264l8848m844J0959J8711K5221
15952E7806j4504o129p565j7064l130m0626j639M612J8804J0663k1517l9265r85
15939f0539P14l30M086n558O401K0970R507m9259j819K8634L7013J1863J5006
15926A6689K656j4226J1057j3812m3110J8340J7490L7188r026k9282j6476k0190
15914d2702q196k1339K9412Q4676J5409n536m2789k3176M2556j8803k1686n781
15902a7955Q454J9102j4933j0826L50K9188m1371l620O187L3029j8303m8702k745
15889f2145j0329J6932N4850N650p724l3172k7151K2667K5536K9363J0339q213
15877A6603q702k7035P240O883m2719Q35K9168J6517K7290K0377L682l5188k7879
$$ plain form
15864 -12928 -28054 -27097 -43097 -50733 -56089 -12162 -7124 -7673 -11497 -15630 -28377 -23949 -43474 -26719
15850 -26719 -19618 -630 34217 9692 2793 10952 61774 63220 33349 1028 -6480 -1862 -4736
15837 -4736 -50991 -81384 -41456 -20794 4223 12270 -5925 -25700 -54911 -59129 -23764 -13010
15825 -13010 -27377 -32887 -94361 -126136 -93335 -41793 -70566 -36310 -37433 -42747 -29104 -19522
15813 -19522 -14265 -3423 -23368 -32252 -23929 -44182 -83099 -90631 -69856 -78748 -53386 -51098 -21683
15800 -21683 -20604 -26598 -21058 -8674 21595 31242 43522 14523 29168 8908 18582 -6034 -35157
15787 -35157 5 18556 9390 -1600 -4349 -20676 -35199 -7956 -1915 19339 29490 15918
15775 15918 -20747 -11032 -11602 -8863 -29819 -63598 -73358 -60821 -17884 -15103 -10442 10719 -4158
$$ packed form
15864a2928j5126R57j6000p636n356M3927N038n49l824m133j2747M428j9525J6755
15850b6719P101J8988L4847k4525o899Q159N0822J446k9871l2321p508M618k874
15837d736m6255l0393L9928K0662K5017Q047j8195j9775k9211m218L5365J0754
15825a3010j4367n510o1474l1775L2801N1542k8773L4256j123n314J3643R582
15813a9522N257J0842j9945q884Q323k0253l8917p532K0775q892K5362K288K9415
15800b1683J079n994N540J2384L0269R647J2280k8999J4645k0260R674k4616k9123
15787c5157L5162J8551r166j0990k749j6327j4523K7243O041K1254J0151j3572
15775A5918l6665R715n70K739k0956l3779r760J2537M2937K781M661K1161j4877
$$ plain form
15762 -4158 6871 -1967 -51976 -105381 -118653 -100369 -68037 -69461 -72848 -36538 -12788 36911
15750 36911 57107 31672 -28794 -53510 -45807 -23462 -2944 -12857 -30960 85 65984 77920
15738 77920 51339 52703 46410 18305 4831 -9484 10324 83529 72071 50619 62919 29811
15726 29811 -3818 28600 48667 29561 -13470 2923 -5699 -10646 -8510 10092 25721 32734
15714 32734 -13465 -34295 -5838 -2914 -10216 -31901 -58670 -56819 -2953 25210 18046 32612
15702 32612 12439 6059 51935 34748 -6493 -31778 -31617 -23195 -15159 24371 35089 -8734 -47209
15689 -47209 -14137 15978 36518 5774 3951 15293 -28361 -71557 -56002 -33294 -58616 -59654
15677 -59654 2063 39794 -522 -12651 25739 31141 28311 22497 -12116 1874 14882 -5801
$$ packed form
15762d158J1029q838n0009n3405j3272J8284L2332j424l387L6310K3750M9699
15750C6911K0196k5435o0466k4716P703K2345K0518r913j8103L1045O5899J1936
15738G7920k6581J364o293k8105j3474j4315J9808P3205j1458k1452J2300l3108
15726B9811l3629L2418K0067j9106m3031J6393q622m947K136J8602J5629P013
15714C2734m6199k0830K8457K924p302k1685k6769J851N3866K8163p164J4566
15702C2612k0173o380M5876j7187m1241k5285J61Q422Q036L9530J0718m3823l8475
15689d7209L3072L0115K0540l0744j823J1342m3654m3196J5555K2708k5322j038
15677e9654O1717L7731m0316j2129L8390N402k830n814l4613J3990J3008k0683
$$ plain form
15665 -5801 -16081 5214 1864 -11746 -7844 -17460 1696 25887 5619 11299 21414 21439 2709
15652 2709 -4050 -43656 -21308 -4166 24795 57621 25279 13079 5620 -9004 -957 -15100
15640 -15100 -29822 -16311 -39683 -41805 -8239 4975 11800 -4820 -26712 -27256 -13424 -13903 -20181
15627 -20181 2763 -15166 -23885 -21414 -36672 -58039 -114106 -93963 -77195 -80441 -30329 28784
15615 28784 79192 71385 17239 6275 9545 -4299 22544 19444 -17978 -35582 456 34318
15603 34318 8337 -9704 -20231 -11944 47856 47059 33304 44200 48756 -2440 -19097 28136
15591 28136 9336 -10377 -20408 -16010 -7674 16306 22860 6998 -16469 -27131 -38614 -32846
15579 -32846 -12832 -42049 -50653 -23993 6639 7452 27561 40751 15754 -21724 -43247 -10938
$$ packed form
15665e801j0280K1295l350j3610L902r616J9156K4191k0268N680J0115K5j8730
15652B709o759l9606K2348J7142K8961L2826l2342j2200p459j4624Q047j4143
15640a5100j4722J3511k3372k122L3566J3214O825j6620k1892n44J3832m79o278
15627b0181K2944j7929q719K471j5258k1367n6067K0143J6768l246N0112N9113
15615B8784N0408p807n4146j0964L270j3844K6843l100l7422j7604L6038L3862
15603C4318k5981j8041j0527Q287N9800p97j3755J0896M556n1196j6657M7233
15591B8136j8800j9713j0031M398Q336K3980O554j5862k3467j0662j1483N768
15579c2846K0014k9217q604K6660L0632Q13K0109J3190k4997l7478k1523L2309
$$ plain form
15567 -10938 -26999 -35111 23005 57183 42601 15786 30122 40605 20182 -25020 -33606 -48401
15555 -48401 -50734 -83387 -75507 -55993 -62987 -53744 -5864 16356 19968 14381 -11083 -32686 -18181
15542 -18181 -19499 -12668 -10870 -33877 -14846 698 -58516 -62410 -47490 -78314 -48892 -41573 -32417
15529 -32417 -25010 -6254 -894 15221 26175 -2675 7552 9571 -15792 -32199 -9921 11905
15517 11905 45301 27144 22099 33614 52829 54927 42462 17107 -7028 -5467 471 15587
15505 15587 17848 -1273 8786 -18146 12191 -1950 5303 7418 -278 7996 37234 -6137 -29329
15492 -29329 -17284 -44590 -39739 -34468 -4867 9704 12103 40547 30781 3813 5964 -2149 17033
15479 17033 27889 504 -22960 -21536 -28127 -18091 8710 5275 7057 -845 -22 21849 14798
$$ packed form
15567a0938j6061q112N8116L4178j4582k6815J4336J0483k0423m5202q586j4795
15555d8401k333l2653P880J9514o994R243M7880K2220L612n587k5464k1603J4505
15542a8181j318O831J798k3007J9031J5544n9214l894J4920l0824K9422P319R156
15529c2417P407J8756N360J6115J0954k8850J0227K019k5363j6407K2278K1826
15517A1905L3396j8157n045J1515J9215K098j2465k5355k4135J561N938J5116
15505A5587K261j9121J0059k6932L0337j4141P253K115p696Q274K9238m3371k3192
15492b9329J2045k7306M851N271K9601J4571K399K8444r766k6968K151q113J9182
15479A7033J0856k7385k3464J424o591J0036K6801l435J782p902Q23K1871p051
$$ plain form
15466 14798 -8403 -16801 -6426 4815 21469 16246 2091 -23862 -51133 -46063 -49629 -31213
15454 -31213 -4025 25889 11300 22377 76492 65638 59187 24213 4936 37494 39838 36341
15442 36341 30735 21235 -20990 -34890 -38441 -47895 -15571 -37973 -50388 -53875 -43449 -35730 -46641
15429 -46641 -31647 -23025 -28119 -24536 -44790 -45031 -49042 -22909 48093 71883 90059 50068 22188
15416 22188 7639 -5600 17190 25061 16296 34986 54023 28413 -12252 -29915 -28288 -58332
15404 -58332 -69211 -15837 2049 -1255 -36972 -55203 -20832 -11756 -4658 1251 -5283 37065 27899
15391 27899 29143 17931 11674 -457 47472 35566 -7435 -29606 -18540 -41532 -43290 -37687
15379 -37687 -45400 -52976 -39188 -62353 -68639 -73763 -78865 -30098 -17859 -16350 -2554 10819 61672
$$ packed form
15466A4798k3201q398J0375J1241J6654n223j4155k5953k7271N070l566J8416
15454c1213K7188K9914j4589J1077N4115j0854o451l4974j9277L2558K344l497
15442C6341n606r500m2225j3900l551r454L2324k2402j2415l487J0426P719j0911
15429d6641J4994Q622n094L583k0254k41m011K6133P1002K3790J8176l9991k7880
15416B2188j4549j3239K2790P871q765J8690J9037k5610m0665j7663J627l0044
15404e8332j0879N3374J7886l304l5717j8231L4371R076P098N909o534M2348r166
15391B7899J244j1212o257j2131M7929j1906m3001k2171J1066k2992j758N603
15379c7687p713p576J3788k3165o286n124n102M8767J2239J509J3796J3373N0853
$$ plain form
15366 61672 92432 16082 -8546 17602 27706 -7259 -11687 -4303 -14415 -27230 -36890 -30682
15354 -30682 -34498 -27917 4701 21732 34196 13047 23318 7514 3693 20452 22738 16163 -7001
15341 -7001 -14695 -5507 -60867 -93927 -70471 -63848 -53275 -44969 -29355 -31335 5904 5050 9086
15328 9086 -16030 -45891 -62036 -43278 -22056 -12771 12272 15708 34072 15161 -22616 -50187
15316 -50187 -46037 -17639 -16845 -23759 -54354 -48812 -3322 -15459 -23253 16296 8659 -10110 -13850
15303 -13850 -32290 -32493 -8589 -23191 -20974 -35046 -34268 -8432 6958 31416 29200 29490 3328
15290 3328 7844 60535 67283 50030 5725 23993 54076 64373 86639 119544 152032 137223
15278 137223 133134 131799 95712 96714 56344 38154 58041 42176 47134 85998 98864 112894
$$ packed form
15366F1672L0760p6350k4628K6148J0104l4965m428P384j0112j2815r660O208
15354c0682l816O581L2618J7031J2464k1149J0271j5804l821J6759K286o575k3164
15341g001p694R188n5360l3060K3456O623J0573Q306J5614j980L7239q54M036
15328I086k5116k9861j6145J8758K1222R285K5043L436J8364j8911l7777k7571
15316e0187M150K8398P94o914l0595N542M5490j2137p794L9549p637j8769l740
15303a3850j8440k03K3904j4602K217j4072P78K5836J5390K4458k216K90k6162
15290C328M516N2691O748j7253m4305J8268L0083J0297K2266L2905L2488j4809
15278A37223m089j335l6087J002m0370j8190J9887j5865M958L8864J2866J4030
$$ plain form
15266 112894 88322 77325 94315 108222 114418 97758 74551 19925 -392 4981 28416 23976
15254 23976 -6282 -8447 -16089 736 24750 20802 6135 15207 19714 24862 -3601 13332 15316
15241 15316 15710 1601 -8588 -6037 6123 3848 -19122 -28861 42415 59921 17054 -16309 -34879
15228 -34879 -28250 -21370 -7056 53265 89697 89830 70587 54583 32460 15666 26794 28403 70861
15215 70861 77143 66299 29219 20791 16686 14402 13181 16259 10303 -16788 -12971 -23584 -27458
15202 -27458 -18668 -29494 -52393 336 46599 102784 114979 155843 186437 222250 219183 158234
15190 158234 108268 106168 68569 28178 51079 61018 31882 -4367 -20793 -50812 -58235 -29533
15178 -29533 -20495 -11215 6699 33167 15921 -24268 -51854 -55778 -44441 -15722 11561 15435
$$ packed form
15266A12894k4572j0997J6990J3907O196j6660k3207n4626k0317N373K3435m440
15254B3976l0258k165p642J6825K4014l948j4667R072M507N148k8463J6933J984
15241A5316L94j4109j0189K551J2160k275k2970r739P1276J7506m2867l3363j8570
15228c4879O629O880J4314O0321L6432J33j9243j6004k2123j6794J1128J609M2458
15215G0861O282j0844l7080q428m105k284j221L078n956k7091L817j0613l874
15202b7458Q790j0826k2899N2729M6263N6185J2195M0864L0594L5813l067o0949
15190A58234m9966k100l7599m0391K2901R939k9136l6249j6426l0019p423K8702
15178b9533R038R280J7914K6468j7246m0189k7586l924J1337K8719K7283L874
$$ plain form
15166 15435 -10222 -2945 -2733 -31434 -26734 -23518 -28252 -46784 -7682 2805 16454 27747 22903
15153 22903 -6808 -70069 -58991 -38759 -56663 -60493 -22587 -27044 -25431 -35871 -19143 -22401
15141 -22401 -31936 8329 -23074 -49758 -52043 -75263 -30161 14948 36048 55260 44678 1463
15129 1463 -35221 -31285 -27692 -30322 -62100 -56987 -36193 -26075 -23612 -5293 -28220 -42811 -28063
15116 -28063 -40755 -57734 -61160 -19571 -30966 -52171 -40127 -34595 -14441 -3889 -58410 -74091
15104 -74091 -55912 -82983 -54585 -20180 -2854 19330 41788 22567 -8562 -25995 -48715 -33276
15092 -33276 -26075 -10643 -43891 -73684 -61848 -76018 -52446 -27415 -3656 -1115 -3827 -899
15080 -899 9184 -19170 -47945 -30997 4928 37755 31488 6411 3880 4177 7922 13929 -17667
$$ packed form
15166A5435k5657P277K12k8701M700L216m734j8532L9102J0487J3649J1293m844
15153B2903k9711o3261J1078K0232j7904l830L7906m457J613j0440J6728l258
15141b2401r535M0265l1403k6684k285k3220M5102M5109K1100J9212j0582m3215
15129A463l6684L936L593k630l1778N113K0794J0118K463J8319k2927j4591J4748
15116b8063j2692j6979l426M1589j1395k1205J2044N532K0154J0552n4521j5681
15104g4091J8179k7071K8398L4405J7326K2184K2458j9221l1129j7433k2720J5439
15092c3276P201J5432l3248k9793J1836j4170K3572K5031K3759K541k712K928
15080h99J0083k8354k8775J6948L5925L2827o267k5077k531K97L745O007l1596
$$ plain form
15067 -17667 -65598 -97618 -100172 -76880 -53970 -8925 16129 5802 -9303 -13857 -7732 -11131
15055 -11131 -53590 -56678 -65943 -31893 -30296 -6021 5712 -7802 -2581 -17362 -24731 -50755 -68831
15042 -68831 -87209 -52055 -29019 -43095 -44384 -33268 -49084 -32519 -8556 11702 13568 29778
15030 29778 9922 25728 11977 -29227 -15648 6486 -42601 -40949 -32371 -13335 -18894 -41105
15018 -41105 -25762 25729 -12375 14228 40240 -5653 -29859 -23384 -34684 -13293 -48801 -42445
15006 -42445 11610 29345 22604 -9285 651 14590 20609 25280 36743 -11882 -24022 -939
14994 -939 -16819 32124 39175 10062 -11829 10877 21646 15534 31328 16291 610 9003 6277
14981 6277 -13061 -177 44694 48693 29308 12316 299 1770 1900 25598 47678 49321 34244
$$ packed form
15067a7667m7931l2020k554K3292K2910M5045K5054j0327j5105m554O125l399
15055a1131m2459l088r265L4050J597K4275J1733j3514N221j4781p369k6024j8076
15042f8831j8378L5154K3036j4076j289J1116j5816J6565K3963K0258J866J6210
15030B9778j9856J5806j3751m1204J3579K2134m9087J652Q578J9036n559k2211
15018d1105J5343N1491l8104K6603K6012m5893k4206O475j1300K1391l5508O356
15006d2445N4055J7735o741l1889R936J3939O019M671J1463m8625j2140K3083
14994i39j5880M8943P051k9113k1891K2706J0769o112J5794j5037j5681Q393k726
14981F277j9338J2884M4871L999j9385j6992j2017J471J30K3698K2080J643j5077
$$ plain form
14968 34244 19949 -398 2651 1062 -17809 -55970 -61494 -56973 -2335 -2392 -34571 -8084 -37759
14955 -37759 -34287 -8245 -23382 -31772 1912 6503 -20867 -15223 -29344 -10642 -16766 -53494 -48400
14942 -48400 -39724 -33006 -37066 11180 51659 44566 -1240 -36915 -71613 -66118 -76026 -74691 -96142
14929 -96142 -73710 891 25206 -6758 -41502 -51763 -58265 -57506 -42161 -3417 -9875 -23049
14917 -23049 -26528 -71046 -63787 -61382 -50104 -9334 26584 41796 720 -17613 -52399 -49311
14905 -49311 -34401 -46451 -45777 -45835 -57439 -71383 -113313 -100628 -54196 -57095 -58934 -4826 15209
14892 15209 -21304 -38889 -32686 -62037 -62934 -18102 -4861 -28839 -45259 -67128 -70753 -85983
14880 -85983 -72926 -58262 3507 -16661 -66997 -116599 -153685 -106995 -59340 -13103 -27110 -8238
$$ packed form
14968C4244j4295k0347L049j589j8871l8161n524M521N4638n7l2179K6487k9675
14955c7759L472K6042j5137q390L3684M591k7370N644j4121J8702o124l6728N094
14942d8400Q676O718m060M8246M0479p093m5806l5675l4698N495r908J335k1451
14929i6142K2432P4601K4315l1964l4744j0261o502P59J5345L8744o458j3174
14917b3049l479m4518P259K405J1278M0770L5918J5212m1076j8333l4786L088
14905d9311J4910j2050O74n8j1604j3944m1930J2685M6432k899j839N4108K0035
14892A5209l6513j7585O203k9351q97M4832J3241k3978j6420k1869l625j5230
14880h5983J3057J4664O1769k0168n0336m9602l7086M6690M7655M6237j4007J8872
$$ plain form
14868 -8238 18406 22724 7368 -11178 -25509 -47614 -85678 -98830 -57268 -57256 -45560 -35565 -4011
14855 -4011 19871 -6909 -36729 -82905 -44918 -634 -11956 -23704 -67119 -56092 -19230 20085
14843 20085 21979 1908 -3706 -22864 -64964 -29942 15317 -4648 -29220 -4913 13049 17953
14831 17953 31352 47804 58799 49496 41130 30191 -9077 -789 17124 10800 18873 4752 -1918
14818 -1918 -11689 -3610 5347 42235 36213 45352 42342 33121 -7918 -75359 -47949 7911 7282 -15077
14804 -15077 -24331 -23307 -27775 -38542 -27626 -12284 13527 30562 23367 27155 57612 71962 15104
14791 15104 -55678 -48686 -77006 -73332 -47651 -26363 -19613 -12375 -43153 -67473 -52703 -26634
14779 -26634 -27998 -34690 -23459 -23073 -31586 994 10343 -13474 -11214 21929 44240 32250 24829
$$ packed form
14868h238K6644M318j5356j8546j4331k2105l8064j3152M1562J2J1696R995L1554
14855d011K3882k6780k9820m6176L7987M4284j1322j1748m3415J1027L6862L9315
14843B0085J894k0071n614j9158m2100L5022M5259j9965k4572K4307J7962M904
14831A7953J3399J6452J0995r303q366j0939l9268Q288J7913o324Q073j4121o670
14818a918r771Q079Q957L6888o022R139l010r221m1039o7441K7410N5860o29k2359
14804a5077r254J024m468j0767J0916J5342K5811J7035p195L788L0457J4350n6858
14791A5104p0782O992k8320L674K5681K1288O750P238l0778k4320J4770K6069
14779b6634j364o692J1231L86q513L2580R349k3817K260L3143K2311j1990p421
$$ plain form
14766 24829 -12134 -14077 -690 -25295 -28416 -14978 28685 54271 68656 42003 40311 34550
14754 34550 25707 23459 52141 56950 19320 31524 49280 60765 75626 70757 67463 77691 69943
14741 69943 63893 12156 -49684 -41410 -4477 15997 38995 41703 20340 -20203 3257 4511
14729 4511 16051 38848 51148 12360 24414 53921 55051 11059 -11009 -14407 34454 53097
14717 53097 55547 84822 99363 114957 133310 117400 104999 75623 77981 89280 103994 106614
14705 106614 72696 17143 17986 22285 31062 39245 43584 21321 47364 56736 96711 130278 116116
14692 116116 104269 110836 102169 112184 120871 133334 94473 56261 87048 123967 113150 98972
14680 98972 65385 30835 12731 52227 109416 88444 68736 57893 3392 -1625 5542 -3211
$$ packed form
14766B4829l6963j943J3387k4605l121J3438M3663K5586J4385k6653j692n761
14754C4550q843k248K8682M809l7630J2204J7756J1485J4861m869l294J0228p748
14741F9943o050n1737o1840Q274L6933K0474K2998K708k1363m0543K3460J254
14729D511J1540K2797J2300l8788J2054K9507J130m3992k2068l398M8861J8643
14717E3097K450K9275J4541J5594J8353j5910j2401k9376K358J1299J4714K620
14705A06614l3918n5553Q43M299Q777Q183M339k2263K6043R372L9975L3567j4162
14692A16116j1847O567q667J0015Q687J2463l8861l8212L0787L6919j0817j4178
14680I8972l3587l4550j8104L9496N7189k0972j9708j0843n4501n017P167q753
$$ plain form
14668 -3211 -5899 3672 22946 54154 35347 -24644 -35174 -10470 -16629 23448 81899 84940 64976
14655 64976 2914 -4836 12578 2601 -23280 -27120 -45336 -67740 -83201 -57161 4854 15793
14643 15793 -11703 -30487 -35841 -32300 -40568 -23346 -26921 -44630 -36833 3520 -4849 -28007 -17816
14630 -17816 17654 19126 -4477 4171 23482 38245 31422 -11991 -24879 -3605 40479 68020
14618 68020 59149 1185 -45854 -63581 -58992 -56806 -86961 -45155 5315 10018 25842 33958 33700
14605 33700 40351 2035 -51711 -50185 -60346 -42776 -17658 4523 37019 -11723 -23583 -23767
14593 -23767 -27402 102 20880 -6062 -24745 1685 -39778 -84636 -63323 -55976 -55654 -49234 -33106
14580 -33106 -37509 -27309 -30900 -76550 -55642 -27522 -15230 -13818 -34741 -32005 9580 29164
$$ packed form
14668c211k688R571J9274L1208j8807n9991j0530K4704o159M0077N8451L041j9964
14655F4976o2062p750J7414r977k5881l840j8216k2404j5461K6040O2015J0939
14643A5793k7496j8784n354L541q268J7222l575j7709P797M0353q369k3158J0191
14630a7816L5470J472k3603Q648J9311J4763o823m3413j2888K1274M4084K7541
14618F8020q871n7964m7039j7727M589K186l0155M1806N0470M703J5824Q116k58
14605C3700O651l8316n3746J526j0161J7570K5118K2181L2496m8742j1860j84
14593b3767l635K7504K0778k6942j8683K6430m1463m4858K1313P347L22O420J6128
14580c3106m403J0200l591m5650K0908K8120J2292J412k0923K736M1585J9584
$$ plain form
14568 29164 -24167 -61975 -55987 -77841 -33617 -31581 -43845 -7460 -10452 -26090 1299 47542
14556 47542 63029 33903 35992 -10092 -6892 21920 15106 5751 2874 -10109 -21002 -50301 -48541
14543 -48541 -90284 -85238 -64867 -40821 -28570 -51637 -86307 -79631 -41060 -58690 -56701 -13325
14531 -13325 -14483 -32058 -21990 -34034 -75661 -90367 -44652 8864 45784 46004 44473 37148 1313
14518 1313 -18918 -15496 -36428 -36749 -32594 31417 17427 -43891 -28974 8068 -3815 15977 17689
14505 17689 -6405 -47893 -36377 -21749 3709 29006 -19706 -51503 -54388 -35856 3259 -1766
14493 -1766 -7729 9984 9891 -6233 -25114 -60336 -73316 -41191 -19676 -17895 -21036 -12924 -28922
14480 -28922 -8050 29893 12721 15906 11312 -967 -17643 -19501 8557 22327 -16632 -3876
$$ packed form
14568B9164n3331l7808N988k1854M4224K036j2264L6385k992j5638K7389M6243
14556D7542J5487k9126K089m6084L200K8812o814r355k877j2983j0893k9299J760
14543d8541m1743N046K0371K4046J2251k3067l4670O676L8571j7630J989M3376
14531a3325j158j7575J0068j2044m1627j4706M5715N3516L6920K20j531p325l5835
14518A313k0231L422k0932l21M155O4011j3990o1318J4917L7042j1883J9792J712
14505A7689k4094m1488J1516J4628K5458K5297m8712l1797k885J8532L9115n025
14493a766n963J7713r3j6124j8881l5222j2980L2125K1515J781l141Q112j5998
14480b8922K0872L7943j7172L185m594j2279j6676j858K8058J3770l8959J2756
$$ plain form
14468 -3876 30654 9409 1470 26385 17296 -20417 -18008 -235 -1102 9948 42895 46750 29307
14455 29307 17518 1499 13911 19037 1880 19311 30101 21908 -9048 -9944 3368 3640 17662
14442 17662 -8707 8960 26323 26017 -9774 -24111 -28752 -2259 17152 20861 19831 -17777 -45722
14429 -45722 -13851 -14549 3017 19109 9099 -9409 -38780 -50146 -61852 -36752 -1272 1885
14417 1885 -15596 -8921 -6633 -29688 -3646 6912 19135 16629 25554 332 -27543 -42142 -39286
14404 -39286 -82920 -68197 -52083 -32931 -3786 -12396 -10043 24931 66890 40879 8679 -265
14392 -265 13220 8556 17741 -1584 -28057 -42680 -28659 -23227 -6433 3302 17218 27108 44643
14379 44643 44505 -3283 -31809 -32525 797 -24622 -11015 -29321 -63095 -51031 -21311 -13535 -8098
$$ packed form
14468c876L4530k1245p939K4915r089l7713K409J7773q67J1050L2947L855j7443
14455B9307j1789j6019J2412N126j7157J7431J0790q193l0956q96J3312K72J4022
14442A7662k6369J7667J7363l06l5791j4337m641K6493J9411L709j030l7608k7945
14429d5722L1871o98J7566J6092j0010j8508k9371j1366j1706K5100L5480L157
14417A885j7481O675K288k3055K6042J0558J2223k506Q925k5222k7875j4599K856
14404c9286m3634J4723J6114J9152K9145q610K353L4974M1959k6011l2200q944
14392b65J3485m664R185j9325k6473j4623J4021N432J6794R735J3916R890J7535
14379D4643j38m7788k8526p16L3322k5419J3607j8306l3774J2064K9720P776N437
$$ plain form
14366 -8098 2549 17762 18433 11503 -18172 -23604 -23411 -40112 16118 15879 6981 -17674 -83794 -97762
14352 -97762 -49820 -61230 -70321 -41560 -51549 -29000 11779 -7436 -51136 -80531 -63026 -22043
14340 -22043 -29240 -60745 -55423 -15229 31446 4780 20352 28607 -11414 -24552 7306 51482
14328 51482 40150 16614 29982 25935 -16319 -43022 -49172 -52222 -59328 -49565 -31402 -44771 -36801
14315 -36801 -25519 -36359 -28515 -26048 -44476 -68868 -81647 -47035 -40003 -27050 -10182 15938
14303 15938 24141 -2731 -2834 9331 -20513 -29792 -21278 12433 33344 30382 26129 2934 3264
14290 3264 44037 47666 48384 58679 21038 -11154 -8264 -20081 -7902 18597 -9491 -32834 -24191
14277 -24191 -19302 -21673 1470 -7678 -7893 18741 983 -48658 -43678 -32098 8229 20492 1333
$$ packed form
14366h098J0647J5213O71o930k9675n432J93j6701N6230k39q898k4655o6120j3968
14352i7762M7942j1410r091K8761r989K2549M0779j9215m3700k9395J7505M0983
14340b2043p197l1505N322M0194M6675k6666J5572Q255m0021j3138L1858M4176
14328E1482j1332k3536J3368m047m2254k6703o150l050p106R763J8163j3369P970
14315c6801J1282j0840P844K467j8428k4392j2779L4612P032J2953J6868K6120
14303A5938Q203k6872j03J2165k9844r279Q514L3711K0911k962m253k3195L30
14290C264M0773L629P18J0295l7641l2192K890j1817J2179K6499k8088k3343Q643
14277b4191M889k371K3143r148k15K6634j7758m9641M980J1580M0327J2263j9159
$$ plain form
14264 1333 17004 31632 45770 20709 5520 -14859 -30183 -30750 -14189 8755 21273 -25613
14252 -25613 -57262 -35710 -20499 -63826 -60878 -29569 -6810 3439 -22421 6932 9253 7340
14240 7340 33353 39885 35906 3315 -33693 -3163 50489 -2462 -33644 -25057 30657 77949
14228 77949 53407 -875 -13725 4948 -34539 -61676 3337 19083 -13525 -23830 -62289 -27096
14216 -27096 10807 12499 38231 -3376 -33101 -10734 2336 -1129 -8808 -2406 13731 17256 9268
14203 9268 40873 15423 18251 32487 31076 22316 26129 11653 -1845 1093 -9034 -11586 -17938
14190 -17938 -26001 20925 3184 -12738 2260 8550 11152 27946 -7794 -8130 20901 28707 -4278
14177 -4278 6262 -3366 -21250 -36955 -24210 3577 4077 19584 18470 23351 44220 9884 -28988
$$ packed form
14264A333J5671J4628J4138k5061j5189k0379j5324n67J6561K2944J2518m6886
14252b5613l1649K1552J5211m3327K948L1309K2759J0249k5860K9353K321j913
14240G340K6013O532l979l2591l7008L0530N3652n2951l1182Q587N5714M7292
14228G7949k4542n4282j2850J8673l9487k7137O5013J5746l2608j0305l8459L5193
14216b7096L7903J692K5732m1607k9725K2367J3070l465p679O402J6137L525p988
14203I268L1605k5450K828J4236j411q760L813j4476j3498K938j0127k552o352
14190a7938q063M6926j7741j5922J4998O290K602J6794l5740l36K9031P806l2985
14177d278J0540r628j7884j5705J2745K7787N00J5507j114M881K0869l4336l8872
$$ plain form
14164 -28988 -49520 -57355 -34972 2600 -30822 -36580 -8104 -14155 -18235 -20951 -21139 -4655 26301
14151 26301 22381 52208 55016 36140 30914 -16879 -26082 -60980 -106614 -100143 -80513 -31314 -3131
14138 -3131 -21953 -42484 -32644 -27253 -44939 -77945 -88569 -62757 -69655 -36952 4417 17177
14126 17177 -11333 -21847 -25532 -17999 35155 71895 58041 10824 15123 5413 -6939 -42074
14114 -42074 -59272 -38059 -15085 14266 10365 6648 -7458 -55609 -70207 -86481 -113559 -94073
14102 -94073 -73583 -61711 -35007 -25536 -5294 -4412 1488 12325 -8519 -8977 24616 35133 21896
14089 21896 12461 12465 9768 31693 38139 40848 8961 -35025 -19331 -25561 -16231 -11276 -19031 -39877
14075 -39877 -36019 -37987 -44457 -9349 17437 34266 23517 -3380 28128 39389 17844 -4386
$$ packed form
14164b8988k0532p835K2383L7572l3422n758K8476o051m080k716j88J6484L0956
14151B6301l920K9827K808j8876n226m7793r203l4898m5634O471J9630M9199K8183
14138c131j8822k0531R840N391j7686l3006j0624K5812o898L2703M1369J2760
14126A7177k8510j0514l685P533N3154L6740j3854m7217M299r710j2352l5135
14114d2074j7198K1213K2974K9351l901l717j4106m8151j4598j6274k7078J9486
14102i4073K0490J1872K6704R471K0242Q82N900J0837k0844m58L3593J0517j3237
14089B1896r435Mk697K1925O446K709l1887m3986J5694o230R330M955p755k0846
14075c9877L858j968o470L5108K6786J6829j0749k6897L1508J1261k1545k2230
$$ plain form
14063 -4386 1418 -3861 -13284 -23057 -34156 -35984 -62710 -56778 -39315 -24054 -14683 -5106 -3470 9501
14049 9501 11174 -11001 -34539 -46704 -7932 29630 38927 26461 30435 43936 56003 30054
14037 30054 -822 23229 45875 68460 77502 55881 50583 27762 28447 13164 13660 26174 24020
14024 24020 35661 19366 4230 10247 39593 32697 7172 -2959 26903 15529 13498 50393
14012 50393 27571 -3968 -45333 -54370 -41202 -55463 -88992 -89108 -66214 -19529 18107 84097
14000 84097 64043 54659 54954 32859 45303 48775 43548 40507 31593 48345 67516 46013 72016
13987 72016 95043 112744 43920 28429 11311 9127 43864 60742 85028 52877 49794 65280
13975 65280 32127 14076 25605 -1284 21397 50576 45802 -5954 14562 25527 -1853 -28966
$$ packed form
14063d386N804n279r423r773j1099j828k6726N932J7463J5261R371R577J636J2971
14049I501J673k2175k3538j2165L8772L7562R297j2466L974J3501J2067k5949
14037C0054l0876K4051K2646K2585R042k1621n298k2821O85j5283M96J2514k154
14024B4020J1641j6295j5136O017K9346o896k5525j0131K9862j1374k031L6895
14012E0393k2822l1539m1365r037J3168j4261l3529j16K2894M6685L7636O5990
14000H4097k0054r384K95k2095J2444L472n227l041q914J6752J9171k1503K6003
13987G2016K3027J7701o8824j5491j7118k184L4737J6878K4286l2151l083J5486
13975F5280l3153j8051J1529k6889K2681K9179m774n1756K0516J0965k7380k7113
$$ plain form
13963 -28966 -34306 -3705 34339 84096 57551 216 -17104 -18474 8174 60935 63121 63763 42319
13950 42319 33409 23769 16124 6143 30806 49152 47459 14770 -38665 -10448 -30021 -20507 9897
13937 9897 34954 48578 61942 -1220 -19032 24445 25855 16692 5784 -17004 -10755 -22280
13925 -22280 -1730 12417 44634 39422 23990 13340 19692 3102 7407 -8516 -8450 -12067 3601
13912 3601 33275 7857 -31472 -56848 -27192 -37804 -31875 -41071 -46223 -47952 -14352 29555 27471
13899 27471 10285 -21542 -42848 -18930 10981 49755 35785 9069 16895 16046 31468 46761
13887 46761 40847 31563 -1174 -30586 -42622 -56506 -11608 29449 21456 17703 -23357 3456
13875 3456 9818 16419 -3459 -7449 5266 7426 -9587 -14526 -19234 -33096 11155 36583 42688
$$ packed form
13963b8966n340L0601L8044M9757k6545n7335j7320j370K6648N2761K186O42k1444
13950D2319q910r640p645r981K4663J8346j693l2689n3435K8217j9573R514L0404
13937I897K5057J3624J3364o3162j7812M3477J410r163j0908k2788O249j1525
13925b2280K0550J4147L2217n212j5432j0650O352j6590M305j5923O6l617J5668
13912C601K9674k5418l9329k5376K9656j0612N929r196n152j729L3600M3907k084
13899B7471j7186l1827k1306K3918K9911L8774j3970k6716P826q49J5422J5293
13887D6761n914r284l2737k9412j2036j3884M4898M1057p993l753m1060K6813
13875C456O362O601j9878l990J2715K160j7013m939m708j3862M4251K5428O105
$$ plain form
13862 42688 24081 14498 30682 41147 27202 37204 32786 30345 27631 6693 -9961 -16863 -34687
13849 -34687 -16150 -33728 -32024 -21793 -27122 -17124 -19557 7076 45916 52774 12447 -45779 -40420
13836 -40420 24363 -13543 -35400 -14281 -25572 -5496 35309 53106 63268 52847 44167 70823
13824 70823 71651 24245 1814 9549 45031 43966 -22793 -59116 -8231 6358 22270 18162 -8818
13811 -8818 -28629 -32742 -20732 -24148 2141 4513 -6842 -37349 -62868 -60576 -41848 14971 2526
13798 2526 13313 44617 57611 92166 101004 95152 77605 83206 103173 87983 88998 117873 175424
13785 175424 195759 148486 114454 99035 71711 46251 36549 45800 53317 37683 36459 93125
13773 93125 76122 84790 94857 122655 116185 104727 49589 71938 119920 106598 70750 26042
$$ packed form
13862D2688j8607r583J6184J0465j3945J0002m418k441k714k0938j6654o902j7824
13849c4687J8537j7578J704J0231n329R998k433K6633L8840O858m0327n8226N359
13836d0420O4783l7906k1857K1119j1291K0076M0805J7797J0162j0421q680K6656
13824G0823Q28m7406k2431P735L5482j065o6759l6323N0885J4589J5912m108k6980
13811h818j9811m113J2010l416K6289K372j1355l0507k5519K292J8728N6819j2445
13798B526J0787L1304J2994L4555Q838n852j7547N601J9967j5190J015K8875N7551
13785A75424K0335m7273l4032j5419k7324k5460r702R251P517j5634j224N6666
13773I3125j7003Q668J0067K7798o470j1458n5138K2349M7982j3322l5848m4708
$$ plain form
13761 26042 72660 107422 123969 138498 119196 90162 88006 106595 118670 167783 179230 125654
13749 125654 74237 42377 27748 23810 21251 10777 18669 56628 54607 27897 16087 1632
13737 1632 16074 23122 10551 26571 44036 30922 40099 -1602 -5655 25183 53629 33711
13725 33711 26016 11023 24221 1339 -9105 33435 98775 108372 69616 28323 27887 79463
13713 79463 72847 60787 66936 71117 101714 113220 139803 157610 126171 125386 142631 152410 172121
13700 172121 167139 169729 168672 176689 168602 136014 101389 97169 122747 125238 95052 79115 84665
13687 84665 115515 118353 85074 85138 101928 113777 125292 97457 95516 87376 104992 126197 121236
13674 121236 131418 151463 133144 124665 101140 140639 155271 140411 104223 65637 72623 92164
$$ packed form
13761B6042M6618L4762J6547J4529j9302k9034k156J8589J2075M9113J1447n3576
13749A25654n1417l1860j4629l938k559j0474P892L7959k021k6710j1810j4455
13737A632J4442P048j2571J6020J7465j3114R177m1701m053L0838K8446j9918
13725C3711p695j4993J3198k2882j0444M2540O5340R597l8756m1293m36N1576
13713G9463o616j2060O149M181L0597J1506K6583J7807l1439p85J7245R779J9711
13700A72121m982K590j057Q017q087l2588l4625m220K5578K491l0186j5937N550
13687H4665L0850K838l3279O4J6790J1849J1515k7835j941q140J7616K1205m961
13674A21236J0182K0045j8319q479k3525L9499J4632j4860l6188l8586O986J9541
$$ plain form
13662 92164 94588 117718 126576 85494 82497 55170 20428 41926 88563 127027 105880 92949
13650 92949 87262 76619 46278 45873 40058 64995 99650 103010 56616 33355 44942 35300 13775
13637 13775 3196 45371 56351 44810 59341 97756 78733 81820 109996 158536 181421 150896
13625 150896 158942 170317 171086 154697 149345 113250 81525 105877 127016 110100 110862 81941 38264
13612 38264 68443 81066 42211 39003 39060 37861 78186 108674 82289 33069 81565 103319 97730
13599 97730 92288 64122 37561 11936 26818 67480 89693 94620 81248 68006 75379 69571
13587 69571 86143 121006 113574 63174 55041 38495 36069 61740 62517 82685 126080 112260 85486
13574 85486 71409 56682 64508 29961 46016 44461 48411 51475 35637 22537 15945 55493 98624
$$ packed form
13662I2164K424K3130Q858m1082k997k7327l4742K1498M6637L8464k1147j2931
13650I2949n687j0643l0341m05n815K4937L4655L360m6394k3261J1587r642k1525
13637A3775j0579M2175J0980j1541J4531L8415j9023L087K8176M8540K2885l0525
13625A50896Q046J1375P69j6389n352l6095l1725K4352K1139j6916P62k8921m3677
13612C8264L0179J2623l8855l208N7j199M0325L0488k6385m9220M8496K1754n589
13599I7730n442k8166k6561k5625J4882M0662K2213M927j3372j3242P373n808
13587F9571J6572L4863p432n0400q133j6546k426K5671P77K0168M3395j3820k6774
13574H5486j4077j4727P826l4547J6055j555L950L064j5838j3100o592L9548M3131
$$ plain form
13561 98624 123640 128963 71034 70020 77970 48755 63488 110769 96715 94190 146825 159729
13549 159729 174818 151021 144821 144852 153788 149916 122409 116550 157959 188117 214884 174642 145522
13536 145522 180333 200006 192484 181125 142467 141906 139687 103192 87569 92040 87551 67570 100782
13523 100782 161369 180496 180294 204835 181910 143518 113458 112895 124217 168774 184620 152244
13511 152244 147883 155551 171680 146719 125459 72067 37991 58662 97160 107144 109558 61558
13499 61558 76601 116308 100553 80311 77466 56882 65350 64957 78630 87438 101704 95311 84475
13486 84475 84776 49869 40100 20388 32291 29781 13161 33919 21936 19450 21437 50732 74497
13473 74497 95640 116431 123563 112665 75839 47325 36611 32013 62987 59665 115291 120057
$$ packed form
13561I8624K5016N323n7929j014P950k9215J4733M7281j4054k525N2635J2904
13549A59729J5089k3797o200L1Q936l872k7507n859M1409L0158K6767m0242k9120
13536A45522L4811J9673p522j1359l8658n61k219l6495j5623M471m489j9981L3212
13523A00782O0587J9127k02K4541k2925l8392l0060n63J1322M4557J5846l2376
13511A52244m361P668J6129k4961k1260n3392l4076K0671L8498R984K414m8000
13499F1558J5043L9707j5755k0242k845k0584Q468l93J3673Q808J4266o393j0836
13486H4475L01l4907r769j9712J1903k510j6620K0758j1983k486J987K9295K3765
13473G4497K1143K0791P132j0898l6826k8514j0714m598L0974l322N5626M766
$$ plain form
13461 120057 104628 66308 57168 59270 72302 81162 101037 128427 114225 121839 89198 59910
13449 59910 79615 99242 106455 108831 100545 100771 111243 119074 111260 79830 56491 104603 136533
13436 136533 120786 115275 80809 96718 172304 235570 265162 280180 297773 293918 311679 354210
13424 354210 408957 427005 420721 404367 381876 393761 397417 450500 481229 483846 489067 508246
13412 508246 512732 464175 449764 431152 453085 479000 492794 500231 527622 547143 539902 545460
13400 545460 539112 524752 457119 438081 445283 466868 510769 550241 575334 627129 688978 667657
13388 667657 618982 590252 656530 677672 650687 664056 708176 788839 850990 874098 923871
13377 923871 981308 1009566 1076582 1145599 1223850 1348488 1522707 1734278 1965521 2241156
$$ packed form
13461A20057j5429l8320r140K102J3032Q860J9875K7390j4202P614l2641k9288
13449E9910J9705J9627P213K376q286K26J0472P831p814l1430k3339M8112L1930
13436A36533j5747n511l4466J5909P5586O3266K9592J5018J7593l855J7761M2531
13424C54210N4747J8048o284j6354k2491J1885L656N3083L0729K617N221J9179
13412E08246M486m8557j4411j8612K1933K5915J3794P437K7391J9521p241N558
13400E45460o348j4360o7633j9038P202K1585M3901L9472K5093N1795O1849k1321
13388F67657m8675k8730O6278K1142k6985J3369M4120Q0663O2151K3108M9773
13377I23871N7437K8258O7016O9017P8251J24638J74219K11571K31243K75635
$$ plain form
13367 2241156 2623598 3130067 3777013 4608871 5663200 6893294 8169866 9388067 10482756
13358 10482756 11336848 11981413 12526067 13168080 14033360 15222890 16693822 18191129 19424201
13349 19424201 20219987 20390077 20006490 19199285 18289379 17540957 17053421 16896198 16993820
13340 16993820 17236128 17513556 17758919 17904631 17958684 17890945 17701301 17459557 17182639 16951899
13330 16951899 16938141 17303072 18077422 19186682 20389607 21328308 21738451 21504595 20686536
13321 20686536 19454368 18108987 16891979 15961119 15338064 14886863 14382332 13696027 12730761
13312 12730761 11567450 10237060 8932021 7674280 6565610 5652459 4932217 4357022
13304 4357022 3883410 3513315 3256352 3048346 2882768 2744569 2630383 2538718 2512038 2499356
$$ packed form
13367B241156L82442N06469O46946Q31858J054329J230094J276572J218201J094689
13358A0482756Q54092O44565N44654O42013Q65280J189530J470932J497307J233072
13349A9424201P95786J70090l83587q07205r09906p48422m87536j57223R7622
13340A6993820K42308K77428K45363J45712N4053o7739j89644k41744k76918k30740
13330A6951899j3758L64931P74350J109260J202925R38701M10143k33856q18059
13321B0686536j232168j345381j217008r30860o23055m51201n04531o86305r65266
13312A2730761j163311j330390j305039j257741j108670r13151p20242n75195
13304D357022m73612l70095k56963k08006j65578j38199j14186r1665k6680j2682
$$ plain form
13294 2499356 2482694 2503630 2528708 2582276 2684656 2797773 2954090 3198892 3528162 3954114
13284 3954114 4468980 5103547 5962999 7056697 8266565 9582903 10853850 11917132 12743566
13275 12743566 13388388 13979002 14666460 15623430 16952360 18534797 20090753 21349967 22086319
13266 22086319 22204242 21731950 20841033 19859243 19092713 18672694 18598033 18727593 18976826
13257 18976826 19239816 19447032 19499754 19482073 19328794 19074562 18709645 18383211 18206888 18321857
13247 18321857 18863649 19850673 21066698 22224498 23032772 23239272 22810400 21818769 20530282
13238 20530282 19257184 18236622 17541356 17100977 16772858 16372024 15783163 14936529 13886540
13229 13886540 12779950 11828084 11122913 10721305 10610185 10652476 10738861 10828114 10874473 10916040
$$ packed form
13294B499356j6662K0936K5078N3568J02380J13117J56317K44802L29270M25952
13284C954114N14866O34567Q59452J093698J209868J316338J270947J063282Q26434
13275A2743566O44822N90614O87458R56970J328930J582437J555956J259214P36352
13266B2086319J17923m72292q90917r81790p66530m20019p4661J29560K49233
13257A8976826K62990K07216N2722j7681j53279k54232l64917l26434j76323J14969
13247A8321857N41792R87024J216025J157800Q08274K06500m28872r91631j288487
13238B0530282j273098j020562o95266m40379l28119m00834n88861q46634j049989
13229A3886540j106590r51866p05171m01608j11120M2291Q6385Q9253M6359M1567
$$ plain form
13219 10916040 11042222 11304942 11694423 12102032 12339842 12370333 12147333 11731504 11253349
13210 11253349 10817637 10474993 10280309 10203029 10221273 10270074 10372253 10621341 11140690 11912721
13200 11912721 12969790 14113856 15243362 16193162 16900097 17519950 18135023 18860272 19738789
13191 19738789 20697321 21509377 21875446 21680070 20975936 20004333 18852129 17715609 16818477
13182 16818477 16105881 15502832 14819116 13990073 13111416 12256851 11554351 11078917 10799719
13173 10799719 10713611 10736717 10774765 10792203 10773395 10840139 11061358 11382348 11728198 11940460
13163 11940460 11931340 11679267 11184978 10574761 9965630 9423725 8976158 8611206 8215544 7797239
13153 7797239 7274243 6710755 6195693 5740151 5366773 5163909 5117827 5344606 5814728 6443456
$$ packed form
13219A0916040J26182K62720L89481M07609K37810L0491k23000m15829m78155
13210A1253349m35712l42644j94684p7280J8244M8801J02179K49088N19349P72031
13200A1912721J057069J144066J129506R49800P06935O19853O15073P25249Q78517
13191A9738789R58532Q12056L66069j95376p04134r71603j152204j136520q97132
13182A6818477p12596o03049o83716q29043q78657q54565p02500m75434k79198
13173A0799719q6108K3106L8048J7438j8808O6744K21219L20990L45850K12262
13163A1940460r120k52073m94289o10217o09131n41905m47567l64952l95662m18305
13153G797239n22996n63488n15062m55542l73378k02864m6082K26779M70122O28728
$$ plain form
13143 6443456 7135454 7788272 8360697 8823951 9205343 9586635 10039940 10556651 11137487
13134 11137487 11711358 12183239 12377472 12246664 11964057 11573579 11180392 10860377 10675818
13125 10675818 10656839 10668370 10677955 10743831 10937754 11421335 12173673 13205628 14404780 15533841
13115 15533841 16513715 17270084 17887151 18549079 19336142 20329606 21419502 22422196 23019998
13106 23019998 23118088 22617955 21658458 20538479 19457622 18544327 17803160 17065516 16282115
13097 16282115 15399349 14430577 13454158 12559526 11876454 11502480 11313979 11230848 11186302 11160476
13087 11160476 11130970 11189684 11390083 11725121 12084622 12309706 12318494 12091804 11601716 10956939
13077 10956939 10248932 9591411 9057003 8552838 8080308 7537470 6911204 6173257 5374692
$$ packed form
13143F443456O91998O52818N72425M63254L81392L81292M53305N16711N80836
13134A1137487N73871M71881J94233j30808k82607l90478l93187l20015j84559
13125A0675818j8979J1531R585O5876J93923M83581P52338J031955J199152J129061
13115A5533841R79874P56369O17067O61928P87063R93464J089896J002694N97802
13106B3019998R8090n00133r59497j119979j080857r13295p41167p37644p83401
13097A6282115q82766r68772r76419q94632o83072l73974j88501q3131m4546k5826
13087A1160476k9506N8714K00399L35038L59501K25084Q788k26690m90088o44777
13077A0956939p08007o57521n34408n04165m72530n42838o26266p37947p98565
$$ plain form
13068 5374692 4604310 3928842 3363360 2885180 2488790 2177363 1925854 1739984 1624440
13059 1624440 1502438 1333189 1216534 1137930 1058129 961676 907685 921114 868919 825335 810716
13048 810716 782134 701490 686339 666812 623642 581584 577475 573959 547348 517955 485726 462795
13036 462795 429054 397578 446119 461680 451628 477996 455581 413652 396465 375113 316311
13025 316311 303751 302387 312541 338727 363977 354189 343036 347460 335215 285494 354300 384579
13013 384579 348773 313479 311829 340020 331221 342992 327090 337466 350076 344463 325364 308843
13001 308843 313497 293573 248781 244685 250976 257752 248048 250250 263916 237712 232454 254845 268412
12988 268412 255196 244514 223396 247101 237839 205602 196050 230360 188754 192621 211469 209694
$$ packed form
13068E374692p70382o75468n65482m78180l96390l11427k51509j85870j15544
13059A624440j22002j69249j16655p8604p9801r6453n3991J3429n2195m3584j4619
13048H10716k8582q0644j5151j9527m3170m2058m109l516k6611k9393l2229k2931
13036D62795l3741l1476M8541J5561j0052K6368k2415m1929j7187k1352n8802
13025C16311j2560j364J0154K6186K5250r788j1153M424j2245m9721O8806L0279
13013C84579l5806l5294j650K8191q799J1771j5902J0376J2610n613j9099j6521
13001C08843M654j9924m4792m096O291O776r704K202J3666k6204n258K2391J3567
12988B68412j3216j0682k1118K3705r262l2237r552L4310m1606L867J8848j775
$$ plain form
12976 209694 196677 190861 176502 153898 163959 168106 170084 162179 170630 145673 135684 119947 108716
12963 108716 117333 139612 149882 168680 172844 179131 201113 171295 143935 133276 134672 186555
12951 186555 208545 150800 99024 95219 83567 105868 120169 129146 128345 143272 178556 195218
12939 195218 147658 121913 104079 81296 84991 94828 108515 98339 102472 114121 99361 102085
12927 102085 109434 122423 125455 107622 124095 117939 103386 85117 77680 39140 49522 134977
12915 134977 148560 120235 139876 164115 122069 121448 175616 235781 251420 229702 209664 187859
12903 187859 158690 198317 187639 150006 144394 113912 104911 94216 100287 119658 135368 177574
12891 177574 209482 235764 209216 159956 122607 151000 185643 191955 184608 183504 199171 219995
$$ packed form
12976B09694j3017n816j4359k2604J0061M147J978p905Q451k4957r989j5737j1231
12963A08716Q617K2279J0270J8798M164O287K1982k9818k7360j0659J396N1883
12951A86555K1990n7745n1776l805j1652K2301J4301Q977q01J4927L5284J6662
12939A95218m7560k5745j7834k2783L695R837J3687j0176M133J1649j4760K724
12927A02085P349J2989L032j7833J6473o156j4553j8269p437l8540J0382Q5455
12915A34977J3583k8325J9641K4239m2046o21N4168O0165J5639k1718k0038k1805
12903A87859k9169L9627j0678l7633n612l0482r001j0695O071J9371J5710M2206
12891A77574L1908K6282k6548m9260l7349K8393L4643O312p347j104J5667K0824
$$ plain form
12879 219995 227800 204270 195048 184425 161565 141138 133942 142268 159138 168158 145145 177335
12867 177335 165245 173121 157845 99523 56027 93340 77392 80005 60313 42801 50641 67060
12855 67060 62459 44189 55840 76816 57292 62665 48223 44456 62592 68396 69988 86389 114551
12842 114551 135383 85303 87423 136176 163849 146810 118899 151960 231406 281255 226617 165688
12830 165688 173399 200152 208936 201753 170616 203512 227208 213513 191577 146586 113211 126372
12818 126372 134916 146381 134069 115168 154050 195948 194627 162789 152837 166653 176060 176219 168403
12805 168403 179104 210331 188079 181027 195979 181138 199971 230143 229590 181958 143855 143273
12793 143273 158659 134727 111950 123211 148384 166203 150136 116881 134358 125538 70378 65588
$$ packed form
12879B19995P805k3530r222j0623k2860k0427p196Q326J6870R020k3013L2190
12867A77335j2090P876j5276n8322m3496L7313j5948K613j9692j7512P840J6419
12855F7060m601j8270J1651K0976j9524N373j4442l767J8136N804J592J6401K8162
12842A14551K0832n0080K120M8753K7673j7039k7911L3061P9446M9849n4638o0929
12830A65688P711K6753Q784p183l1137L2896K3696j3695k1936m4991l3375J3161
12818A26372Q544J1465j2312j8901L8882M1898j321l1838r952J3816R407J59p816
12805A68403J0701L1227k2252p052J4952j4841J8833L0172n53m7632l8103n82
12793A43273J5386k3932k2777J1261K5173J7819j6067l3255J7477q820n5160m790
$$ plain form
12781 65588 59585 45354 87709 142118 147741 136612 104227 100113 68740 55635 57395 87492
12769 87492 51642 34857 30386 48660 67793 69199 109879 118822 84885 58506 65373 95875
12757 95875 123309 130383 120467 99842 112893 134347 114827 95710 102891 113328 124678 133889
12745 133889 118798 119773 92679 109964 193578 176781 129346 101218 87896 69855 70355 75256
12733 75256 69231 100297 117185 82744 63656 79529 118730 126532 109493 102097 77848 57882
12721 57882 71463 55711 49881 30830 42707 99221 92315 87065 79951 72645 63481 92715 134753
12708 134753 139146 123155 102222 113473 161263 149824 98988 85495 80090 52496 54279 57352
12696 57352 59655 94596 109634 104072 99594 111158 95424 112696 108181 95910 115735 132444
$$ packed form
12781F5588o003j4231M2355N4409N623j1129l2385m114l1373j3105J760L0097
12769H7492l5850j6785m471J8274J9133J406M0680Q943l3937k6379O867L0502
12757I5875K7434P074r916k0625J3051K1454j9520j9117P181J0437J1350R211
12745A33889j5091R75k7094J7285Q3614j6797m7435k8128j3322j8041N00M901
12733G5256o025L1066J6888l4441j9088J5873L9201P802j7039p396k4249j9966
12721E7882J3581j5752n830j9051J1877N6514o906n250p114p306r164K9234M2038
12708A34753M393j5991k0933J1251M7790j1439n0836j3493n405k7594J783L073
12696E7352K303L4941J5038n562m478J1564j5734J7272m515j2271J9825J6709
$$ plain form
12684 132444 119141 86848 117685 114792 135902 136849 116341 111872 121379 149266 155133 158258 182033
12671 182033 161392 176185 200012 226483 272102 272747 282050 281296 257487 250088 194666 117412 118149
12658 118149 145303 150198 134225 154037 176353 128878 87844 110185 114952 136875 155493 169485
12646 169485 193732 215304 196099 162760 189181 216641 257786 252662 257014 275861 295841 252664
12634 252664 228496 214709 191029 149874 108750 117085 126554 91267 60819 116994 108770 67586
12622 67586 63455 42226 19008 28207 12261 -7321 5145 -1396 -578 39243 87996 76845 14477
12609 14477 -31662 -16405 3059 -19721 24599 4799 -6859 23251 45925 81505 102563 104103
12597 104103 80147 64934 46388 53644 74071 57563 55106 38084 1481 4498 8201 29451
$$ packed form
12684A32444j3303l2293L0837k893K1110R47k0508m469R507K7887N867L125K3775
12671A82033k0641J4793K3827K6471M5619O45R303p54k3809p399n5422p7254P37
12658A18149K7154M895j5973J9812K2316m7475m1034K2341M767K1923J8618J3992
12646A69485K4247K1572j9205l3339K6421K7460M1145n124M352J8847J9980m3177
12634B52664k4168j3787k3680m1155m1124Q335R469l5287l0448N6175q224m1184
12622F7586m131k1229k3218R199j5946j9582J2466o541Q18L9821M8753j1151o2368
12609A4477m6139J5257J9464k2780M4320j9800j1658L0110K2674L5580K1058J540
12597A04103k3956j5213j8546P256K0427j6508k457j7022l6603L017L703K1250
$$ plain form
12585 29451 18756 33199 28697 20411 42278 43138 23440 17956 14362 20947 12378 9614 -5408
12572 -5408 12394 33378 38302 -32404 -50671 -13290 -4912 25620 62040 48001 34889 20410
12560 20410 28822 50070 76896 109297 92755 132184 127445 140956 174136 173939 163813 173869
12548 173869 161355 140463 115184 84371 90084 80597 38709 -5012 1584 49197 40792 49881
12536 49881 51360 -373 -47139 -42169 -26923 12518 21873 9222 35739 62530 60310 32741
12524 32741 14219 44048 47865 34249 40450 55861 61777 89573 140988 138547 99124 58424
12512 58424 52627 58953 68595 85109 97320 112316 128057 112755 64721 52407 20839 -9664
12500 -9664 -9498 -7568 -3530 1834 -11533 1799 7134 29718 30909 -664 -22166 3714 9691
$$ packed form
12585B9451j0695J4443m502q286K1867Q60j9698n484l594O585q569k764j5022
12572e408J7802K0984M924p0706j8267L7381Q378L0532L6420j4039j3112j4479
12560B0410Q412K1248K6826L2401j6542L9429m739J3511L3180j97j0126J0056
12548A73869j2514k0892k5279l0813N713r487m1888m3721O596M7613q405R089
12536D9881J479n1733m6766M970J5246L9441R355j2651K6517K6791k220k7569
12524C2741j8522K9829L817j3616O201J5411N916K7796N1415k441l9423m0700
12512E8424n797O326R642J6514J2211J4996J5741j5302m8034j2314l1568l0503
12500i664J66J930M038N364j3367J3332N335K2584J191l1573k1502K5880N977
$$ plain form
12487 9691 -32067 -18254 -10600 9114 38254 74640 106175 99293 58879 34507 5827 20434
12475 20434 37166 15260 20578 20293 14741 20272 -13879 -1269 -727 54256 66429 38101 31354
12462 31354 28454 38149 33277 27033 51739 90264 88197 74367 101972 85895 47855 41110 74780
12449 74780 59945 19033 49171 65457 96128 141569 177791 160614 121093 116383 83826 86021
12437 86021 58819 53244 69185 75311 68313 40880 5419 8102 2513 -7975 44353 84634 116758
12424 116758 120340 92559 52836 22342 34007 34649 3188 -5485 24836 35361 52463 55438
12412 55438 60187 71105 64898 35862 -16368 -29580 -35835 -40362 -3051 -31148 -57096 -16284
12400 -16284 42356 70381 71871 119335 110092 78614 64947 39333 12005 16247 5302 -16688
$$ packed form
12487I691m1758J3813P654J9714K9140L6386L1535o882m0414k4372k8680J4607
12475B0434J6732k1906N318k85n552N531l4151J2610N42N4983J2173k8328o747
12462C1354k900R695m872o244K4706L8525k067j3830K7605j6077l8040o745L3670
12449G4780j4835m0912L0138J6286L0671M5441L6222j7177l9521m710l2557K195
12437H6021k7202n575J5941O126o998k7433l5461K683n589j0488N2328M0281L2124
12424A16758L582k7781l9723l0494J1665O42l1461q673L0321J0525J7102K975
12412E5438M749J0918o207k9036n2230j3212o255m527L7311k8097k5948M0812
12400a6284N8640K8025J490M7464r243l1478j3667k5614k7328M242j0945k1990
$$ plain form
12388 -16688 -40258 -28439 6883 62703 77340 33288 5020 -26246 -20591 -28019 7575 52596
12376 52596 88075 27587 8174 35466 -777 -32105 8844 44530 57435 56998 56009 52602 -722
12363 -722 11349 53878 86542 80791 44053 22466 6339 28589 35447 2748 -33296 -35950 -36255
12350 -36255 -27708 -23281 -22559 4367 23740 28027 37472 32127 29529 48666 73146 90150 71138
12337 71138 31920 779 40658 72392 100465 126684 108387 79117 69489 54854 65440 50579
12325 50579 12180 -27861 -33226 -13723 24692 49497 48128 -5815 -61883 -47602 -34398 -40472
12313 -40472 -28812 36508 71083 32019 -7555 19953 59566 42427 13179 1416 -4271 2323
12301 2323 62522 85473 44552 47118 38396 19357 5719 12997 30197 87452 86244 43953 7111
$$ packed form
12388a6688k3570J1819L5322N5820J4637m4052k8268l1266N655p428L5594M5021
12376E2596L5479o0488j9413K7292l6243l1328M0949L5686J2905m37r89l407n3324
12363g22J2071M2529L2664n751l6738k1587j6127K2250O858l2699l6044k654l05
12350c6255Q547M427P22K6926J9373M287R445n345k598J9137K4480J7004j9012
12337G1138l9218l1141L9879L1734K8073K6219j8297k9270r628j4635J0586j4861
12325E0579l8399m0041n365J9503L8415K4805j369n3943n6068J4281J3204o074
12313d0472J1660O5320L4575l9064l9574K7508L9613j7139k9248j1763n687O594
12301B323O0199K2951m0921K566q722j9039j3638P278J7200N7255j208m2291l6842
$$ plain form
12288 7111 17333 13576 24394 -10904 4368 10430 -2458 -15345 2358 18777 15628 49479
12276 49479 55336 70587 63241 24977 870 54397 63573 35262 3049 -22303 -36395 -41197
12264 -41197 -8635 3731 3022 -863 34826 25991 31419 32694 22419 19863 8377 -41719 -49482
12251 -49482 -23546 24932 50814 57571 72812 43135 -11331 -19279 -5402 31917 17235 8275
12239 8275 -9798 -13932 9281 14235 11308 -20869 -36267 7245 15661 46461 108258 110314 39291
12226 39291 8433 17172 24635 56282 72007 94685 116685 194608 216809 259356 292783 328265
12214 328265 320277 299291 317945 320555 268748 270638 287205 319604 303577 303213 283778 244534
12202 244534 247588 240773 216550 217331 184417 137206 136240 89785 43865 5183 -968 -18076 -19422
$$ packed form
12288G111J0222l757J0818l5298J5272O062j2888j2887J7703J6419l149L3851
12276D9479N857J5251p346l8264k4107N3527R176k8311l2213k5352j4092m802
12264d1197L2562J2366p09l885L5689q835N428J275j0275k556j1486n0096p763
12251d9482K5936M8478K5882O757J5241k9677n4466p948J3877L7319j4682q960
12239H275j8073m134K3213M954k927l2177j5398M3512Q416L0800O1797K056p1023
12226C9291l0858Q739P463L1647J5725K2678K2000P7923K2201M2547L3427L5482
12214C28265p988k0986J8654K610n1807J890J6567L2399j6027l64j9435l9244
12202B44534L054o815k4223P81l2914m7211r66m6455m5920l8682o151j7108j346
$$ plain form
12189 -19422 -15942 3881 39737 88478 122406 98349 81091 65473 46910 36700 40565 55073
12177 55073 18425 -7248 -22008 -1141 59886 93642 43910 23442 19136 -6809 4805 12949
12165 12949 8651 -18200 3891 83205 113620 79097 26047 29741 56743 54313 53134 54022 54396
12152 54396 62432 75746 72069 40014 16287 -50441 -77175 -43394 12638 25059 33201 20769
12140 20769 17678 3021 14569 7035 -39204 -31529 23554 57811 72179 89305 58077 48550
12128 48550 16452 35899 24591 54489 89199 65608 51397 55964 35528 13198 33904 24139
12116 24139 17188 35821 50195 34516 53934 36630 11199 22111 42708 20191 -20283 -4170
12104 -4170 24193 -2227 -2680 30984 42116 55237 110316 102900 93691 96920 72410 45719 22774
$$ packed form
12189a9422L480J9823L5856M8741L3928k4057j7258j5618j8563j0210L865J4508
12177E5073l6648k5673j4760K0867O1027L3756m9732k0468m306k5945J1614Q144
12165A2949m298k6851K2091P9314L0415l4523n3050L694K7002k430j179Q88L74
12152E4396Q036J3314l677l2055k3727o6728k6734L3781N6032J2421Q142j2432
12140B0769l091j4657J1548p534m6239P675N5083L4257J4368J7126l1228r527
12128D8550l2098J9447j1308K9898L4710k3591j4211M567k0436k2330K0706r765
12116B4139o951J8633J4374j5679J9418j7304k5431J0912K0597k2517m0474J6113
12104d170K8363k6420m53L3664J1132J3121N5079p416r209L229k4510k6691k2945
$$ plain form
12091 22774 16401 21252 26101 33361 70489 45202 23023 12067 91365 117420 71326 51239
12079 51239 49341 9543 -15607 18197 16022 44940 27940 6466 7504 49639 22959 25728
12067 25728 50314 44494 31801 35290 50221 32246 8357 -1778 -12706 -18802 -16094 -8814 -13083
12054 -13083 -57123 -35301 -39623 -29348 -13546 -10382 -11194 8042 16745 -53565 -103009 -77665 -76314
12041 -76314 -66692 -70365 -85878 -80902 -58401 -60483 -58204 -29636 -21286 -14630 12485 38151 468
12028 468 -31568 -260 -15724 -24675 35012 62742 31966 30962 55419 46722 17714 209 15288
12015 15288 39210 32816 43669 59495 43886 30645 3327 4459 24293 57577 49486 34359
12003 34359 72613 62779 21492 11310 13837 15037 -3488 -28647 -34599 -11314 30232 41986
$$ packed form
12091B2774o373M851M849P260L7128k5287k2179j0956P9298K6055m6094k0087
12079E1239j898l9798k5150L3804k175K8918j7000k1474J038M2135k6680K769
12067B5728K4586n820j2693L489J4931j7975k3889j0135j0928o096K708P280m269
12054a3083m4040K1822m322J0275J5802L164q12J9236Q703p0310m9444K5344J351
12041g6314R622l673j5513M976K2501k082K279K8568Q350O656K7115K5666l7683
12028D68l2036L1308j5464q951N9687K7730l0776j004K4457q697k9008j7505J5079
12015A5288K3922o394J0853J5826j5609j3241k7318J132J9834L3284q091j5127
12003C4359L8254r834m1287j0182K527J200j8525k5159n952K3285M1546J1754
$$ plain form
11991 41986 74562 68001 31152 38940 76142 85023 82475 76977 72624 56709 22121 43436 46578
11978 46578 5281 -45189 -40370 -3638 18494 47181 36559 13062 -38704 -39716 -50402 -34996
11966 -34996 -19069 14990 10494 1243 -3014 10294 31115 42300 53669 56465 47195 31863 26472
11953 26472 29454 57772 48662 22303 43503 42414 13009 -12724 -33591 -37225 -26782 -34888 -10577
11940 -10577 26295 47215 14370 16105 19266 -18252 -5565 25972 36434 36789 34901 54255 66682
11927 66682 68949 68935 44141 3475 -12079 15081 33634 6975 12203 39965 73182 79185 72515
11914 72515 55379 40384 26405 -6033 -21036 5992 42109 19082 -8413 25932 72689 72741
11902 72741 75581 66718 61268 77279 85323 76741 74621 33929 18793 34229 75671 30133 55684
$$ packed form
11991D1986L2576o561l6849P788L7202Q881k548n498m353j5915l4588K1315L142
11978D6578m1297n0470M819L6732K2132K8687j0622k3497n1766j012j0686J5406
11966c4996J5927L4059m496r251m257J3308K0821J1185J1369K796r270j5332n391
11953B6472K982K8318r110k6359K1200j089k9405k5733k0867l634J0443q106K4311
11940a0577L6872K0920l2845J735L161l7518J2687L1537J0462L55j888J9354J2427
11927F6682K267j4k4794m0666j5554K7160J8553k6659N228K7762L3217O003o670
11914G2515j7136j4995j3979l2438j5003K7028L6117k3027k7495L4345M6757N2
11902G2741K840q863n450J6011Q044q582k120m0692j5136J5436M1442m5538K5551
$$ plain form
11889 55684 98466 90063 49897 58524 84520 110643 107829 90547 87167 74641 22846 -26000
11877 -26000 -21591 -51706 -21154 26550 31058 17056 3903 56000 59522 23200 -17016 -7429
11865 -7429 18378 7519 10027 7615 -6069 -6754 -7720 -31686 -49844 -52556 -49751 -6531 43598
11852 43598 16397 5474 26440 81593 96477 76859 59995 11148 -17899 -15992 -5424 -43975
11840 -43975 -69880 -22545 -5756 -21768 -27004 -58989 -76071 -56220 -26061 -5851 -4600 27349
11828 27349 42587 35002 37315 64431 39044 4860 16710 27712 61058 57783 66943 86648
11816 86648 140359 140527 116736 105605 87324 99439 97365 67630 67566 42908 47043 105851 134247
11803 134247 131122 114473 69742 65889 90870 91334 104833 138867 122345 117005 132675 116337
$$ packed form
11889E5684M2782q403m0166Q627K5996K6123k814j7282l380j2526n1795m8846
11877b6000M409l0115L0552M7704M508j4002j3153N2097L522l6322m0216R587
11865g429K5807j0859K508k412j3684o85r66k3966j8158k712K805M3220N0129
11852D3598k7201j0923K0966N5153J4884j9618j6864m8847k9047J907J0568l8551
11840d3975k5905M7335J6789j6012n236l1985j7082J9851L0159K0210J251L1949
11828B7349J5238p585K313K7116k5387l4184J1850J1002L3346l275R160J9705
11816H6648N3711J68k3791j1131j8281J2115k074k9735o4k4658M135N8808K8396
11803A34247l125j6649m4731l853K4981M64J3499L4034j6522n340J5670j6338
$$ plain form
11791 116337 118331 149314 137163 137630 104195 18037 -12863 7582 2939 40122 49418 28818
11779 28818 29133 65824 111401 89565 41809 20925 17187 35135 42688 39581 50353 59630 67285
11766 67285 77921 59153 59596 71000 62124 62128 88914 107088 93004 78171 40458 66632 96436
11753 96436 103017 117358 110856 66810 82990 99568 136908 190576 211347 206580 145532 90371
11741 90371 67688 78087 97990 95015 147302 224709 233796 237820 207302 188099 153044 169891
11729 169891 181890 175326 188946 216093 180245 144125 83676 81612 133429 158969 122202 74048
11717 74048 42977 63791 96468 84333 108752 100506 82025 78324 109440 109727 108260 84797 31337
11704 31337 34717 60413 46095 33035 54237 62901 57749 102752 87268 45214 31838 26748
$$ packed form
11791A16337J994L0983j2151M67l3435q6158l0900K0445m643L7183R296k0600
11779B8818L15L6691M5577k1836m7756k0884l738J7948P553l107J0772R277P655
11766F7285J0636j8768M43J1404q876MK6786J8174j4084j4833l7713K6174K9804
11753I6436O581J4341o502m4046J6180J6578L7340N3668K0771m767o1048n5161
11741I0371k2683J0399J9903k975N2287P7407R087M024l0518j9203l5055J6847
11729A69891J1999o564J3620K7147l5848l6120o0449k064N1817K5540l6767m8154
11717G4048l1071K0814L2677j2135K4419q246j8481l701L1116K87j467k3463n3460
11704C1337L380K5696j4318j3060K1202Q664n152M5003j5484m2054j3376n090
$$ plain form
11692 26748 15202 16247 25060 35015 32435 36580 17567 19091 55805 106657 102660 106959 83313
11679 83313 64647 94597 104810 89227 79804 94972 78533 22249 2285 16894 50920 57858
11667 57858 76664 107778 108608 90709 48257 42574 57476 26130 30572 12741 59191 99625
11655 99625 120304 74580 55280 47851 64831 88003 89345 95141 125018 166990 190181 201139
11643 201139 243518 233399 229766 183678 163243 119174 130430 127047 171717 186308 126561 94037
11631 94037 97032 79991 68702 60149 48629 4043 30393 36777 39641 52036 85245 102207
11619 102207 109704 101678 133701 137281 138532 143410 149774 173201 201949 177762 133104 100075 65264
11606 65264 49484 84068 104944 82020 41053 5093 27510 66781 22798 23138 71149 41324
$$ packed form
11692B6748j1546J045Q813R955k580M145j9013J524L6714N0852l997M299k3646
11679H3313j8666K9950J0213j5583r423J5168j6439n6284j9964J4609L4026O938
11667E7858J8806L1114Q30j7899m2452n683J4902l1346M442j7831M6450M0434
11655I9625K0679m5724j9300p429J6980K3172J342N796K9877M1972K3191J0958
11643B01139M2379j0119l633m6088k0435m4069J1256l383M4670J4591n9747l2524
11631I4037K995j7041j1289q553j1520m4586K6350O384K864J2395L3209J6962
11619A02207P497q026L2023L580J251M878O364K3427K8748k4187m4658l3029l4811
11606F5264j5780L4584K0876k2924m0967l5960K2417L9271m3983L40M8011k9825
$$ plain form
11594 41324 28794 62034 54915 54741 53754 64940 57582 72235 113798 103030 99270 80456 68184
11581 68184 75524 75458 60238 15172 -19731 10046 57268 67833 81332 82949 85311 121629 134439
11568 134439 109062 104896 105989 117229 102374 62923 88208 120682 142614 131077 130634 119837
11556 119837 128883 171658 188358 200854 227731 205234 151278 114570 118029 127329 124303 127928
11544 127928 114970 89832 124314 127026 115812 127642 134275 75223 54722 38813 57022 88023
11532 88023 113030 132957 134783 99704 70979 96255 119751 129712 122351 92649 79174 72434
11520 72434 84481 78623 80742 64542 31897 31112 43660 14268 23546 80016 96240 70089 75231
11507 75231 71407 87838 77849 82536 100997 102577 75904 73528 49666 48740 65825 89739 94999
$$ packed form
11594D1324j2530L3240p119j74r87J1186p358J4653M1563j0768l760j8814j2272
11581F8184P340o6j5220m5066l4903K9777M7222J0565J3499J617K362L6318J2810
11568A34439k5377m166J093J1240j4855l9451K5285L2474K1932j1537m43j0797
11556A19837R046M2775J6700J2496K6877k2497n3956l6708L459R300l026L625
11544A27928j2958k5138L4482K712j1214J1830O633n9052k0501j5909J8209L1001
11532H8023K5007J9927J826l5079k8725K5276K3496R961p361k9702j3475o740
11520G2434J2047n858K119j6200l2645p85J2548k9392R278N6470J6224k6151N142
11507G5231l824J6431r989M687J8461J580k6673k376k3862r26J7085K3914N260
$$ plain form
11494 94999 103012 109181 109552 105534 112479 139279 130072 142227 171845 150847 116004 123770 113310
11481 113310 154696 169369 113681 84879 72609 83537 105612 116416 131307 158198 159871 189034
11469 189034 188299 199785 184980 178833 182718 189469 210989 259649 260158 252425 287065 280773 229615
11456 229615 218640 190830 183209 148651 134889 182242 208586 167315 145010 119811 132724 118187
11444 118187 144308 183448 192967 207196 208807 227021 244663 236344 234413 264736 290203 285702
11432 285702 268043 239704 229820 251771 262891 308105 325929 374556 380919 390379 432325 488717
11420 488717 519212 535932 549595 578392 661406 708363 786008 852963 930422 1059362 1161556
11409 1161556 1241007 1387726 1605357 1890268 2250708 2654275 3161542 3836587 4756374 5920647
$$ packed form
11494I4999Q013O169L71m018O945K6800r207J2155K9618k0998l4843P766j0460
11481A13310M1386J4673n5688k8802j2270J0928K2075J0804J4891K6891J673K9163
11469A89034p35J1486j4805o147L885O751K1520M8660N09p733L4640o292n1158
11456B29615j0975k7810p621l4558j3762M7353K6344m1271k2305k5199J2913j4537
11444A18187K6121L9140R519J4229J611J8214J7642q319j931L0323K5467m501
11432B85702j7659k8339r884K1951J1120M5214J7824M8627O363R460M1946N6392
11420D88717L0495J6720J3663K8797Q3014M6957P7645O6955P7459J28940J02194
11409A161556P9451J46719K17631K84911L60440M03567N07267O75045R19787J164273
$$ plain form
11399 5920647 7441464 9415829 11742938 14181571 16320709 17733617 18136100 17512053
11391 17512053 16076738 14139178 12104560 10265834 8784890 7737691 7046695 6651570
11383 6651570 6548043 6671923 7060366 7726870 8720868 10226024 12302953 14788076 17272063
11374 17272063 19184543 20067056 19671054 18149414 15932511 13411040 10963844 8836575
11366 8836575 7190588 6012873 5120579 4415813 3836928 3352586 2966879 2645558 2378989
11357 2378989 2146452 2019047 1910201 1839733 1826119 1826717 1843822 1817262 1758941 1727858 1753021
11346 1753021 1742079 1714114 1736400 1825230 1892738 1961934 2093044 2268900 2479011 2757715
11336 2757715 3082224 3479790 4017495 4678729 5618005 6836446 8426427 10549757 13188250
$$ packed form
11399E920647J520817J974365K327109K438633K139138J412908M02483o24047
11391A7512053j435315j937560k034618j838726j480944j047199o90996l95125
11383F651570j03527J23880L88443O66504R93998J505156K076929K485123K483987
11374A7272063J912480Q82513l96002j521640k216903k521471k447196k127269
11366H836575j645987j177715q92294p04766n78885m84342l85707l21321k66569
11357B378989k32537j27405j08846p0468j3614N98J7105k6560n8321l1083K5163
11346A753021j0942k7965K2286Q8830O7508O9196J31110J75856K10111K78704
11336B757715L24509L97566N37705O61234R39276J218441J589981K123330K638493
$$ plain form
11327 13188250 16060610 18746807 20796875 21820587 21646557 20437436 18707734 16978821
11319 16978821 15564117 14786700 14899899 15909006 17649294 19708228 21781243 23455005
11311 23455005 24457352 24796682 24836333 24918033 25351150 26114845 26799198 27006475 26372027
11302 26372027 24852542 22743424 20381368 18129371 16404694 15469540 15405682 16088411 17352348
11293 17352348 18823783 20031340 20503368 19969381 18458394 16320172 13919847 11588701
11285 11588701 9566960 7990804 6769461 5832860 5113655 4538491 4063308 3663263 3334042
11276 3334042 3067591 2835512 2665279 2538790 2442236 2344087 2232723 2137941 2098919 2049194
11266 2049194 1966218 1908110 1852509 1810236 1798313 1788993 1796578 1868933 1913361 2026863 2178661
$$ packed form
11327A3188250K872360K686197K050068J023712j74030j209121j729702j728913
11319A6978821j414704p77417J13199J009107J740288K058934K073015J673762
11311B3455005J002347L39330L9651Q1700M33117P63695O84353K07277o34448
11302B6372027j519485k109118k362056k251997j724677r35154o3858O82729J263937
11293A7352348J471435J207557M72028n33987j510987k138222k400325k331146
11285A1588701k021741j576156j221343r36601p19205n75164m75183m00045l29221
11276C334042k66451k32079j70233j26489r6554r8149j11364r4782l9022m9725
11266B049194q2976n8108n5601m2273j1923r320P585P2355M4428J13502J51798
$$ plain form
11255 2178661 2365898 2638144 3001689 3424222 3954760 4644701 5624245 6991216 8758843
11246 8758843 11005225 13578965 16145594 18198327 19200661 18926220 17588545 15564891
11238 15564891 13300670 11154772 9422516 8131674 7231324 6696595 6473573 6474155 6673547
11229 6673547 7110079 7894962 9064664 10700222 12761173 14931869 16885159 18116985
11221 18116985 18329771 17513620 15888919 13792775 11561461 9453043 7683105 6301641
11213 6301641 5251742 4412365 3762817 3226807 2799518 2460837 2148270 1897675 1690796
11204 1690796 1520170 1421829 1375309 1319021 1271128 1220751 1162865 1105672 1094631 1068787 994526
11193 994526 889367 813657 783393 760701 737106 692620 669127 657227 599644 576372 601555
$$ packed form
11255B178661J87237K72246L63545M22533N30538O89941R79544J366971J767627
11246H758843K246382K573740K566629K052733J002334k74441j337675k023654
11238A5564891k264221k145898j732256j290842r00350n34729k23022N82J99392
11229F673547M36532P84883J169702J635558K060951K170696J953290J231826
11221A8116985K12786q16151j624701k096144k231314k108418j769938j381464
11213F301641j049899q39377o49548n36010m27289l38681l12567k50595k06879
11204A690796j70626r8341m6520n6288m7893n0377n7886n7193j1041k5844p4261
11193I94526j05159p5710l0264k2692k3595m4486k3493j1900n7583k3272K5183
$$ plain form
11182 601555 609669 553862 513265 486073 479939 444073 411874 410495 398020 385422 351904 337774
11170 337774 358627 339338 302903 303309 305657 318975 309542 322377 307639 321674 354669 328623
11158 328623 287197 255741 270137 286606 315509 299118 275857 289796 310502 354570 383110
11147 383110 373092 318455 282599 284504 299653 297161 313675 328931 306892 323288 354467 337919
11135 337919 332891 324205 326182 303260 298367 292766 314853 342804 332036 319880 288632 282603 307648
11122 307648 333746 349462 351124 335457 272464 219338 216847 236004 272859 313468 317893 344554
11110 344554 318235 274349 274796 294558 298276 287219 258731 253811 285291 303019 311228 343385
11098 343385 399199 467893 464859 461214 431533 439435 409971 415677 430257 443455 415168 399557
$$ packed form
11182F01555Q114n5807m0597k7192o134l5866l2199j379j2475j2598l3518j4130
11170C37774K0853j9289l6435M06K348J3318r433J2835j4738J4035L2995k6046
11158C28623m1426l1456J4396J6469K8903j6391k3261J3939K0706M4068K8540
11147C83110j0018n4637l5856J905J5149k492J6514J5256k2039J6396L1179j6548
11135C37919n028q686J977k2922m893n601K2087K7951j0768j2156l1248o029K5045
11122C07648K6098J5716J662j5667o2993n3126k491J9157L6855M0609M425K6661
11110C44554k6319m3886M47J9762L718j1057k8488m920L1480J7728Q209L2157
11098C43385N5814O8694l034l645k9681P902k9464N706J4580J3198k8287j5611
$$ plain form
11086 399557 405477 371023 340188 350973 348753 395424 447012 438929 453514 505235 523627 560249
11074 560249 579714 575915 615352 665233 674869 716719 769114 806863 890134 974682 1040824 1103611
11062 1103611 1121083 1183208 1344959 1476456 1595278 1734834 1953257 2217628 2559028 2991933
11052 2991933 3531214 4256257 5150782 6282604 7717057 9635514 12200604 15616504 20006129
11043 20006129 25077043 30152321 34229475 36361972 36171807 33850498 29973098 25303307
11035 25303307 20694139 16659663 13426041 10948439 9036568 7541407 6374241 5428479
11027 5428479 4662159 4054972 3525168 3078653 2721108 2469441 2264601 2132610 2026677
11018 2026677 1991038 1926624 1884021 1851723 1812445 1778087 1728162 1737854 1747448 1732196 1710197 1668077
$$ packed form
11086C99557N920l4454l0835J0785k220M6671N1588q083J4585N1721J8392L6622
11074E60249J9465l799L9437M9881R636M1850N2395L7749Q3271Q4548O6142O2787
11062A103611J7472O2125J61751J31497J18822J39556K18423K64371L41400M32905
11052B991933N39281P25043Q94525J131822J434453J918457K565090L415900M389625
11043B0006129N070914N075278M077154K132497j90165k321309l877400m669791
11035B5303307m609168m034476l233622k477602j911871j495161j167166r45762
11027E428479p66320o07187n29804m46515l57545k51667k04840j31991j05933
11018B026677l5639o4414m2603l2298l9278l4358m9925R692R594j5252k1999m2120
$$ plain form
11006 1668077 1687674 1714582 1716494 1760893 1798381 1812919 1813206 1890464 2040992 2217243 2375337
10995 2375337 2600591 2887274 3214458 3598827 4036910 4618174 5307048 6134371 7215989
10986 7215989 8636320 10480892 12981299 16258831 20559959 25809267 31518096 36585051
10978 36585051 39851142 40621322 38886700 35277425 30591679 25763957 21465964 18089309
10970 18089309 15668435 14107000 13263726 13004447 13313911 14263096 15966487 18603826 22206152
10961 22206152 26455480 30694566 33916038 35328271 34653632 32103465 28258828 23839652
10953 23839652 19497122 15757396 12769224 10500583 8818203 7475784 6395091 5545122
10945 5545122 4853019 4254217 3785930 3381868 3064581 2808363 2557339 2344587 2178133
$$ packed form
11006A668077J9597K6908J912M4399L7488J4538K87P7258J50528J76251J58094
10995B375337K25254K86683L27184L84369M38083N81264O88874Q27323J081618
10986G215989J420331J844572K500407L277532M301128N249308N708829N066955
10978C6585051L266091P70180j734622l609275m685746m827722m297993l376655
10970A8089309k420874j561435q43274k59279L09464R49185J703391K637339L602326
10961B2206152M249328M239086L221472J412233o74639k550167l844637m419176
10953B3839652m342530l739726k988172k268641j682380j342419j080693q49969
10945E545122o92103n98802m68287m04062l17287k56218k51024k12752j66454
$$ plain form
10936 2178133 2074445 1972048 1889909 1794391 1731996 1668155 1639803 1606769 1475684 1397131 1403340
10925 1403340 1399736 1404799 1420847 1446329 1470446 1476708 1506251 1567767 1670128 1772159 1919681
10914 1919681 2131206 2306114 2544760 2846654 3174701 3595985 4167367 4905446 5790666
10905 5790666 6857009 8272772 10123006 12629226 15979520 20379935 25607272 30988838
10897 30988838 35341697 37620785 37338298 34755700 30527573 25525485 20684791 16525342
10889 16525342 13325792 10985504 9319768 8131274 7372205 6958635 6741414 6463245 5981178
10880 5981178 5401704 4788278 4155746 3537183 3007490 2630421 2371293 2146677 1988000
10871 1988000 1843304 1729794 1635912 1541268 1402380 1308098 1213324 1137798 1086277 1019350 970727
$$ packed form
10936B178133j03688j02397q2139r5518o2395o3841k8352l3034j31085p8553O209
10925A403340l604N063J6048K5482K4117O262K9543O1516J02361J02031J47522
10914A919681K11525J74908K38646L01894L28047M21284N71382P38079Q85220
10905E790666J066343J415763J850234K506220L350294M400415N227337N381566
10897C0988838M352859K279088k82487k582598m228127n002088m840694m159449
10889A6525342l199550k340288j665736j188494p59069m13570k17221k78169m82067
10880E981178n79474o13426o32532o18563n29693l77069k59128k24616j58677
10871A988000j44696j13510r3882r4644j38888r4282r4774p5526n1521o6927m8623
$$ plain form
10860 970727 922916 951502 926007 884766 885997 908585 972785 1036344 1132671 1225783 1266123 1278655
10848 1278655 1266242 1199339 1072174 967727 877309 807400 728258 666795 643582 613501 570014
10837 570014 530807 527008 577309 568924 586050 630022 679584 689769 653287 616319 582756 515796
10825 515796 524604 549754 543946 554692 532428 533206 514297 487789 480301 489002 550150 580359 557765
10812 557765 538082 566625 593126 609915 609529 608277 600728 536111 504432 489311 478399 500183
10800 500183 509755 489825 497110 547542 610335 646126 667691 686382 781828 857370 925580 1013366
10788 1013366 1071538 1128901 1125255 1105686 997631 862909 810654 734460 654708 652464 673847
10777 673847 650026 622856 631225 661101 719187 766247 799559 826260 835863 873111 833888 772159
$$ packed form
10860I70727m7811K8586k5495m1241J231K2588O4200O3559R6327R3112M0340J2532
10848A278655j2413o6903j27165j04447r0418o9909p9142o1463k3213l0081m3487
10837E70014l9207l799N0301q385J7126M3972M9562J0185l6482l6968l3563o6960
10825E15796Q808K5150n808J0746k2264P78j8909k6508p488Q701O1148L0209k2594
10812E57765j9683K8543K6501J6789l86j252p549o4617l1679j5121j0912K1784
10800E00183R572j9930P285N0432O2793L5791K1565J8691R5446P5542O8210Q7786
10788A013366N8172N7363l646j9569j08055j34722n2255p6194p9752k244K1383
10777F73847k3821k7170Q369K9876N8086M7060L3312K6701R603L7248l9223o1729
$$ plain form
10765 772159 674621 563794 491908 502699 474421 402465 373897 400861 391795 351717 346782 398625
10753 398625 404614 393759 391252 393597 379201 410421 433252 445303 434512 423075 412553 427456
10741 427456 480222 509234 513002 503891 491969 485801 520530 515518 538463 586070 607443 655578
10729 655578 702384 721440 735349 746123 839897 931048 1045411 1251640 1475751 1798757 2164580
10718 2164580 2524685 2898560 3248299 3479222 3588049 3623394 3627106 3649413 3562020 3513310
10708 3513310 3581249 3765067 4069182 4629720 5409036 6340012 7379060 8417999 9214619
10699 9214619 9578208 9473932 8850701 7926983 6861503 5749253 4762662 3974057 3371548
10690 3371548 2957113 2600682 2318804 2128185 1974961 1817445 1658765 1565079 1488797 1398944
$$ packed form
10765G72159r7538j10827p1886J0791k8278p1956k8568K6964r066m0078m935N1843
10753C98625N989j0855k507K345j4396L1220K2831J2051j0791j1437j0522J4903
10741D27456N2766K9012L768r111j1922o168L4729n012K2945M7607K1373M8135
10729F55578M6806J9056J3909J0774R3774R1151J14363K06229K24111L23006L65823
10718B164580L60105L73875L49739K30923J08827L5345L712K2307q7393m8710
10708C513310O7939J83818L04115N60538P79316R30976J039048J038939P96620
10699I214619L63589j04276o23231r23718j065480j112250r86591p88605o02509
10690C371548m14435l56431k81878j90619j53224j57516j58680r3686p6282q9853
$$ plain form
10680 1398944 1353680 1335499 1333825 1337843 1315551 1369605 1396804 1437541 1499247 1590735 1652639 1745415
10668 1745415 1803992 1886927 2026365 2218167 2406424 2617857 2848541 3183214 3588862 4074228
10658 4074228 4805887 5756553 6841481 8008941 9059615 9791819 10056265 9837324 9225648
10649 9225648 8356725 7394840 6564174 5936119 5560210 5381537 5356336 5482240 5691594 6037488
10639 6037488 6540284 7184252 7953918 8858458 9983577 11391647 13213334 15653987 18806423
10630 18806423 22909023 28113089 34253105 40824917 46961881 51632704 54023284 53712371
10622 53712371 50857761 46249231 40704294 35061071 29968214 25738958 22453641 19900541
10614 19900541 18021297 16665205 15672110 14993217 14680754 14732279 15039956 15661907 16740121
$$ packed form
10680A398944m5264j8181j674M018k2292N4054K7199M0737O1706R1488O1904R2776
10668A745415N8577Q2935J39438J91802J88257K11433K30684L34673M05648M85366
10658D074228P31659R50666J084928J167460J050674P32204K64446k18941o11676
10649I225648q68923r61885q30666o28055l75909j78673k5201J25904K09354L45894
10639F037488N02796O43968P69666R04540J125119J408070J821687K440653L152436
10630A8806423M102600N204066O140016O571812O136964M670823K390580l10913
10622E3712371k854610m608530n544937n643223n092857m229256l285317k553100
10614A9900541j879244j356092r93095o78893l12463N1525L07677O21951J078214
$$ plain form
10605 16740121 18358027 20681442 23899639 28124639 33538109 39975445 46755754 52929999
10597 52929999 57330147 59029134 57840536 54167785 48889320 43056210 37672249 33415362
10589 33415362 30435114 28696903 28218468 28860633 30566694 33529797 37900229 43682664
10581 43682664 50514157 57546714 63385950 66592758 66416095 63072784 57437027 50588164
10573 50588164 43732394 37752454 33052529 29685599 27504117 26228194 25688746 25876055
10565 25876055 26862903 28763925 31761977 36097013 41735748 48485512 55417737 61264121
10557 61264121 64562222 64462197 60996012 55020320 47605982 39982368 33050681 27252813
10549 27252813 22688141 19162412 16400728 14218405 12505942 11125062 9986334 9005811
$$ packed form
10605A6740121J617906K323415L218197M225000N413470O437336O780309O174245
10597E2929999M400148J698987j188598l672751n278465n833110n383961m256887
10589C3415362k980248j738211m78435O42165J706061K963103M370432N782435
10581D3682664O831493P032557N839236L206808j76663l343311n635757o848863
10573E0588164o855770n979940m699925l366930k181482j275923n39448J87309
10565B5876055R86848J901022K998052M335036N638735O749764O932225N846384
10557F1264121L298101j00025l466185n975692p414338p623614o931687n797868
10549B7252813m564672l525729k761684k182323j712463j380880j138728r80523
$$ plain form
10541 9005811 8181823 7508507 6958747 6517348 6146333 5896625 5730288 5623215 5546502 5507773
10531 5507773 5597739 5823445 6194917 6649975 7300857 8120703 9138253 10233274 11192650
10522 11192650 11809987 11972257 11628898 10844075 9808051 8719429 7698076 6882008 6266148
10513 6266148 5858541 5516643 5233683 4994303 4849752 4723607 4592094 4511537 4501216 4573363
10503 4573363 4736553 4919889 5075839 5278212 5456023 5635189 5863451 6114999 6464121
10494 6464121 6911188 7457980 8125141 8944492 9923737 11043219 12404100 14082565 16207681
10485 16207681 18698956 21450453 24221834 26655960 28539038 29962267 31287584 32965160
10477 32965160 35433230 39093285 44368353 51659749 61536111 74837612 92823604 117337036
$$ packed form
10541I005811q23988o73316n49760m41399l71015k49708j66337j07073p6713l8729
10531E507773Q9966K25706L71472M55058O50882Q19846J017550J095021R59376
10522A1192650O17337J62270l43359p84823j036024j088622j021353q16068o15860
10513F266148m07607l41898k82960k39380j44551j26145j31513q0557j0321P2147
10503D573363J63190J83336J55950K02373J77811J79166K28262K51548L49122
10494F464121M47067N46792O67161Q19351R79245J119482J360881J678465K125116
10485A6207681K491275K751497K771381K434126J883078J423229J325317J677576
10477C2965160K468070L660055N275068P291396R876362J3301501J7985992K4513432
$$ plain form
10469 117337036 151773161 202174044 275938285 372360275 465405671 511057395 501509630
10462 501509630 461830904 396882518 313449547 236376254 178893937 138692911 110130474
10455 110130474 89234413 73501615 61354186 51754355 44143779 38120897 33292024
10448 33292024 29502505 26347008 23523141 20981042 18739833 16731715 14918528 13453947
10440 13453947 12281741 11310781 10528244 9960593 9490841 9081052 8699702 8336529 7916825
10431 7916825 7460794 7044515 6630358 6196433 5799616 5469319 5207928 4994813 4833745
10422 4833745 4709591 4543421 4344233 4078048 3878469 3728276 3554703 3416221 3325054 3231462
10412 3231462 3174312 3112789 3048425 2988839 2899103 2806449 2736259 2673482 2620430 2559488 2501992
$$ packed form
10469A17337036L4436125N0400883P3764241R6421990R3045396M5651724r547765
10462E01509630l9678726o4948386q3432971p7073293n7482317m0201026k8562437
10455A10130474k0896061j5732798j2147429r599831p610576o022882m828873
10448C3292024l789519l155497k823867k542099k241209k008118j813187j464581
10440A3453947j172206r70960p82537n67651m69752m09789l81350l63173m19704
10431G916825m56031m16279m14157m33925l96817l30297k61391k13115j61068
10422D833745j24154j66170j99188k66185j99579j50193j73573j38482r1167r3592
10412C231462n7150o1523o4364n9586q9736r2654p0190o2777n3052o0942n7496
$$ plain form
10401 2501992 2445834 2364302 2320771 2357124 2368829 2322828 2282430 2265700 2223607 2210519 2195118
10390 2195118 2225353 2225065 2227670 2234985 2216727 2202299 2217920 2228432 2230542 2266167 2308747 2317071
10378 2317071 2345750 2365371 2396808 2439153 2471468 2515248 2574430 2649338 2783000 2867077 2920484
10367 2920484 3018336 3048263 2996802 2962510 2945419 2885467 2872279 2844539 2821708 2832029 2882236
10356 2882236 2968493 3073857 3183450 3286910 3445737 3642942 3830638 4051734 4253703 4454200
10346 4454200 4669134 4970277 5355294 5846213 6492815 7296484 8250987 9420671 10609323
10337 10609323 11814228 13164116 14598926 16065079 17596127 19402654 21517182 24058786
10329 24058786 27241144 31130867 36160986 42817633 51695530 63685073 80747401 106274105
$$ packed form
10401B501992n6158q1532m3531L6353J1705m6001m0398j6730m2093j3088j5401
10390B195118L0235k88K605P315j8258j4428J5621J0512K110L5625M2580Q324
10378B317071K8679J9621L1437M2345L2315M3780N9182P4908J33662Q4077N3407
10367B920484R7852K9927n1461l4292j7091n9952j3188k7740k2831J0321N0207
10356B882236Q6257J05364J09593J03460J58827J97205J87696K21096K01969K00497
10346D454200K14934L01143L85017M90919O46602Q03669R54503J169684J188652
10337A0609323J204905J349888J434810J466153J531048J806527K114528K541604
10329B4058786L182358L889723N030119O656647Q877897J1989543J7062328K5526704
$$ plain form
10321 106274105 143784172 192169861 240640356 283351891 332363657 384847351 414109799
10314 414109799 411908154 400975731 385969785 350010205 295914747 244595288 200150207
10307 200150207 157134449 119953921 92789250 73905600 60467276 50531604 42836291
10300 42836291 36746253 31946037 28042594 24762162 22096664 19885080 17897896 16118360
10292 16118360 14613288 13324476 12094722 10957524 9988926 9173885 8429574 7785818 7224415
10283 7224415 6737141 6332330 5999784 5765983 5569954 5322089 5033285 4744815 4418566
10274 4418566 4118458 3841145 3555453 3330271 3141587 2960350 2818957 2694520 2576591
10265 2576591 2468961 2350915 2313302 2265366 2198617 2124231 2063003 2012528 1921684 1832979 1775770
$$ packed form
10321A06274105L7510067M8385689M8470495M2711535M9011766N2483694K9262448
10314D14109799k201645j0932423j5005946l5959580n4095458n1319459m4445081
10307B00150207m3015758l7180528k7164671j8883650j3438324r935672p695313
10300D2836291o090038m800216l903443l280432k665498k211584j987184j779536
10292A6118360j505072j288812j229754j137198r68598q15041p44311o43756n61403
10283G224415m87274m04811l32546k33801j96029k47865k88804k88470l26249
10274D418566l00108k77313k85692k25182j88684j81237j41393j24437j17929
10265B576591j07630j18046l7613m7936o6749p4386o1228n0475r0844q8705n7209
$$ plain form
10254 1775770 1708179 1663387 1654125 1662473 1623748 1526245 1482641 1440579 1424699 1418553 1454920 1458999
10242 1458999 1433340 1415189 1419961 1453397 1458743 1475411 1517797 1582418 1673433 1714664 1718039 1709172
10230 1709172 1709288 1711155 1683970 1614069 1528820 1450877 1366833 1270979 1199499 1159276 1153320 1147233
10218 1147233 1104398 1104829 1105244 1099549 1085913 1061462 1051377 1076778 1077513 1109896 1107169 1127710 1164175
10205 1164175 1117228 1084397 1039865 971063 962180 974562 928906 864877 890682 891904 931024 1008722
10193 1008722 1167672 1281834 1427361 1636266 1797058 1895279 1969025 2045670 2030233 1960187
10183 1960187 1930136 1865493 1783455 1692728 1633013 1616005 1554297 1547131 1564526 1575087 1538590
10172 1538590 1504821 1514699 1490498 1407817 1371216 1332311 1335025 1344718 1366754 1404701 1411574 1349466
$$ packed form
10254A775770o7591m4792r262Q348l8725r7503m3604m2062j5880o146L6367M079
10242A458999k5659j8151M772L3436N346J6668M2386O4621R1015M1231L375q867
10230A709172J16J867k7185o9901q5249p7943q4044r5854p1480m0223n956o087
10218A147233m2835M31M15n695j3636k4451j0085K5401P35L2383k727K0541L6465
10205A164175m6947l2831m4532o8802q883J2382m5656o4029K5805J222L9120P7698
10193A008722J58950J14162J45527K08905J60792R8221P3746P6645j5437p0046
10183A960187l0051o4643q2038r0727n9715j7008o1708p166J7395J0561l6497
10172A538590l3769R878k4201q2681l6601l8905K714R693K2036L7947O873o2108
$$ plain form
10160 1349466 1257407 1183696 1070515 990880 942468 847161 820127 804603 763173 751942 780435
10149 780435 802472 796114 835738 894997 933714 970274 1035910 1087847 1177908 1244094 1323230 1419972
10137 1419972 1555732 1668743 1725338 1736529 1764981 1742994 1740467 1773643 1822905 1838952 1903005
10126 1903005 2045562 2241715 2495647 2857519 3342995 4031491 5024219 6480427 8541514
10117 8541514 11407863 14723947 17383113 18367578 17735647 16072231 13561691 10789002
10109 10789002 8360980 6538339 5234834 4291941 3596489 3055586 2666726 2340194 2093783
10100 2093783 1894777 1715072 1596919 1484404 1382062 1274070 1172935 1110400 1059466 1037325
10090 1037325 988589 928319 866532 837915 820757 773098 742885 737570 716311 677790 668219 668088
$$ packed form
10160A349466r2059p3711j13181p9635m8412r5307k7034j5524m1430j1231K8493
10149G80435K2037o358L9624N9259L8717L6560O5636N1937R0061O6186P9136R6742
10137A419972J35760J13011N6595J1191K8452k1987k527L3176M9262J6047O4053
10126A903005J42557J96153K53932L61872M85476O88496R92728J456208K061087
10117H541514K866349L316084K659166R84465o31931j663416k510540k772689
10109A0789002k428022j822641j303505r42893o95452n40903l88860l26532k46411
10100B093783j99006j79705j18153j12515j02342j07992j01135o2535n0934k2141
10090A037325m8736o0270o1787k8617j7158m7659l0213n315k1259l8521r571j31
$$ plain form
10078 668088 661534 616570 615208 614308 628476 709969 839005 954422 1114200 1183831 1255490 1315535
10066 1315535 1340000 1406506 1497788 1581880 1625460 1674719 1702424 1697644 1666759 1569393 1434557
10055 1434557 1298445 1212126 1159816 1076442 1010170 1002684 1021721 1047094 1068534 1165789 1357876
10044 1357876 1628011 1982934 2475395 2913533 3166731 3148468 2954948 2618223 2175491 1795223
10034 1795223 1501957 1308929 1126201 969860 862930 796862 796560 778471 740191 692672 671598
10023 671598 673792 653985 652371 663712 714455 746202 704628 679109 671307 628516 583952 545695
10011 545695 510484 504766 524448 496415 444874 389116 346905 333067 329440 286452 302823 319556
9999 319556 338091 379061 424494 495167 582682 606995 574726 528671 495034 476831 477756 476174
$$ packed form
10078F68088o554m4964j362r00J4168Q1493J29036J15417J59778O9631P1659O0045
10066A315535K4465O6506R1282Q4092M3580M9259K7705m780l0885r7366j34836
10055A434557j36112q6319n2310q3374o6272p486J9037K5373K1440R7255J92087
10044A357876K70135L54923M92461M38138K53198j8263j93520l36725m42732l80268
10034A795223k93266j93028j82728j56341j06930o6068l02j8089l8280m7519k1074
10023F71598K194j9807j614J1341N0743L1747m1574k5519p802m2791m4564l8257
10011E45695l5211n718J9682k8033n1541n5758m2211j3838l627m2988J6371J6733
9999C19556J8535M0970M5433P0673Q7515K4313l2269m6055l3637j8203R25j582
$$ plain form
9987 476174 401864 381306 419535 480166 473885 462721 474230 487681 515035 518064 485831 490207
9975 490207 559488 645855 736717 866634 1029628 1227850 1503560 1857142 2154478 2297459
9965 2297459 2247355 2084120 1867275 1587293 1326764 1082768 913329 769468 652888 623998
9955 623998 604769 596047 551098 492356 428291 407717 372970 342413 363043 379677 383554 366574
9943 366574 354829 370266 443171 483094 507751 491270 496937 508652 496087 530634 578782 625403
9931 625403 711889 872753 964545 1084197 1213662 1264412 1267077 1252382 1177268 1062994 1028889
9920 1028889 933821 874152 918991 1028234 1150899 1398016 1651430 1884269 2096394 2357214
9910 2357214 2557915 2550702 2465036 2440841 2310783 2041108 1750447 1538842 1307835 1129065
$$ packed form
9987D76174p4310k0558L8229O0631o281j1164J1509J3451K7354L029l2233M376
9975D90207O9281Q6367R0862J29917J62994J98222K75710L53582K97336J42981
9965B297459n0104j63235k16845k79982k60529k43996j69439j43861j16580k8890
9955F23998j9229q722m4949n8742o4065k0574l4747l0557K0630J6634L877j6980
9943C66574j1745J5437P2905L9923K4657j6481N667J1715j2565L4547M8148M6621
9931F25403Q6486J60864R1792J19652J29465N0750K665j4695p5114j14274l4105
9920A028889r5068n9669M4839J09243J22665K47117K53414K32839K12125K60820
9910B357214K00701p213q5666k4195j30058k69675k90661k11605k31007j78770
$$ plain form
9900 1129065 975130 872716 795230 697235 670857 640301 615912 617952 650874 699021 714298
9889 714298 724973 751037 729595 663743 582025 549316 518559 510007 502202 498492 524412 542087
9877 542087 541800 544462 541831 470291 440985 424680 428379 409650 418093 420859 429091 459061 478713
9864 478713 482186 470449 483723 458071 444556 437695 457957 483184 526002 554328 580821 617733
9852 617733 656194 718690 761994 808295 822688 783990 753967 667702 605012 609371 607836 607581
9840 607581 578896 533727 515524 478690 406586 385894 418028 418936 402033 406654 392293 376650
9828 376650 392438 412080 417990 378567 376855 384848 417459 457725 503913 499921 483090 445572
9816 445572 404723 436737 466213 490752 500858 484720 438976 369527 323242 338652 389073 416286
$$ packed form
9900A129065j53935j02414p7486r7995k6378l0556k4389K040L2922M8147J5277
9889G14298J0675K6064k1442o5852q1718l2709l0757q552p805l710K5920J7675
9877E42087k87K662k631p1540k9306j6305L699j8729Q443K766Q232K9970J9652
9864D78713L473j1737J3274k5652j3515o861K0262K5227M2818K8326K6493L6912
9852F17733L8461O2496M3304M6301J4393l8698l0023q6265o2690M359j535k55
9840F07581k8685m5169j8203l6834p2104k0692L2134R08j6903M621j4361j5643
9828C76650J5788J9642N910l9423j712P993L2611M0266M6188l992j6831l7518
9816D45572m0849L2014K9476K4539J0106j6138m5744o9449m6285J5410N0421K7213
$$ plain form
9804 416286 429768 421327 383101 341127 322467 302060 344131 380723 395211 390202 367153 359033
9792 359033 369554 378279 389511 456513 452518 393857 367383 366092 388001 398758 413963 427812
9780 427812 447459 418032 353559 356011 395245 404310 411943 392678 443459 442638 426646 456278 440916
9767 440916 435433 471641 490853 500600 513786 538908 511600 495303 477269 486671 446442 381599
9755 381599 390008 425656 430298 423284 425740 412731 396940 455450 491118 450074 438605 464201
9743 464201 490391 474256 500588 509074 521392 551310 572407 586769 539919 505761 486432 482043
9731 482043 480525 491539 498673 519886 531164 546475 544605 546117 539310 542571 576199 585430 574553
9718 574553 551999 569643 637639 706937 748471 775792 788961 857303 953773 1040082 1116384 1232498
$$ packed form
9804D16286J3482q441l8226m1974j8660k0407M2071L6592J4488n009k3049q120
9792C59033J0521Q725J1232O7002l995n8661k6474j291K1909J0757J5205J3849
9780D27812J9647k9427o4473K452L9234R065P633j9265N0781q21j5992K9632j5362
9767D40916n483L6208J9212R747J3186K5122k7308j6297j8034R402m0229o4843
9755C81599Q409L5648M642p014K456j3009j5791N8510L5668m1044j1469K5596
9743D64201K6190j6135K6332Q486J2318K9918K1097J4362m6850l4158j9329m389
9731D82043j518J1014P134K1213J1278J5311j870J512o807L261L3628R231j0877
9718E74553k2554J7644O7996O9298M1534K7321J3169O8342R6470Q6309P6302J16114
$$ plain form
9706 1232498 1392324 1557097 1781185 2017319 2232091 2472136 2735683 2949640 3161968 3370073
9696 3370073 3583988 3794360 4035556 4284298 4502503 4657261 4713685 4743569 4740673 4682463
9686 4682463 4673935 4755259 4882106 4992107 5171158 5465603 5830638 6227628 6717062 7241131
9676 7241131 7793027 8354276 8966591 9560981 10173517 10808571 11442969 12028102 12545033 12979517
9666 12979517 13240338 13326928 13258663 13177489 12997080 12758191 12512377 12217893 11906232 11622832
9656 11622832 11404751 11234353 11131711 11165404 11292300 11521487 11779405 12135357 12633913 13096772
9646 13096772 13564614 14066495 14521535 14957226 15340524 15614308 15834745 15926751 15808966 15477905
9636 15477905 15065988 14566695 13981449 13351334 12725550 12164882 11592190 11008565 10507516
$$ packed form
9706A232498J59826J64773K24088K36134K14772K40045K63547K13957K12328K08105
9696C370073K13915K10372K41196K48742K18205J54758N6424K9884k896n8210
9686D682463q528Q1324J26847J10001J79051K94445L65035L96990M89434N24069
9676G241131N51896N61249O12315N94390O12536O35054O34398N85133N16931M34484
9666A2979517K60821Q6590o8265q1174j80409k38889k45814k94484l11661k83400
9656A1622832k18081j70398j02642L3693J26896K29187K57918L55952M98556M62859
9646A3096772M67842N01881M55040M35691L83298K73784K20437R2006j17785l31061
9636A5477905m11917m99293n85246o30115o25784n60668n72692n83625n01049
$$ plain form
9627 10507516 10094805 9792062 9556816 9425764 9400768 9435999 9579498 9745307 9955692 10206377
9617 10206377 10465341 10765087 11057086 11293276 11406202 11418505 11304365 11050777 10731123 10387086
9607 10387086 10048835 9733378 9449918 9204113 8966656 8767971 8681931 8683814 8779374 9023315
9597 9023315 9398934 9855141 10322217 10807414 11348111 11925752 12509274 13147808 13713731 14178547
9587 14178547 14505550 14713319 14774344 14676849 14506202 14250515 13947807 13711383 13478136 13243048
9577 13243048 13011131 12823374 12749727 12765972 12891302 13090931 13371318 13807528 14290341 14854371
9567 14854371 15428588 16019645 16567491 17096985 17600650 18078295 18449622 18648086 18686017 18484902
9557 18484902 18089294 17516802 16827852 16101311 15420198 14799288 14210622 13624651 13096134
$$ packed form
9627A0507516m12711l02743k35246j31052k4996L5231J43499J65809K10385K50685
9617A0206377K58964K99746K91999K36190J12926J2303j14140k53588l19654l44037
9607A0387086l38251l15457k83460k45805k37457j98685q6040J883R5560K43941
9597I023315L75619M56207M67076M85197N40697N77641N83522O38534N65923M64816
9587A4178547L27003K07769O1025r7495j70647k55687l02708k36424k33247k35088
9577A3243048k31917j87757p3647J6245J25330J99629K80387M36210M82813N64030
9567A4854371N74217N91057N47846N29494N03665M77645L71327J98464L7931k01115
9557A8484902l95608n72492o88950p26541o81113o20910n88666n85971n28517
$$ plain form
9548 13096134 12599456 12228418 12057294 11980693 11938853 11928345 11992802 12203809 12649775 13165997
9538 13165997 13654190 14068264 14305425 14232456 13830467 13192634 12423435 11614343 10841995 10219515
9528 10219515 9687901 9171023 8676221 8180445 7645100 7096309 6549614 6118601 5837863
9519 5837863 5681323 5701510 5878159 6196852 6559242 6887605 7052465 6994520 6731320 6357798
9509 6357798 5911519 5467756 5178370 5027025 5013747 5146834 5459513 5894688 6398129 6954368
9499 6954368 7455458 7890915 8334296 8793254 9324643 9914689 10403602 10698419 10724398 10460912
9489 10460912 10003913 9385220 8774268 8196311 7823988 7731456 7818083 8152700 8799003 9742046
9479 9742046 11051896 12720962 14559628 16313109 17808093 18907416 19702311 20295276 20751917
$$ packed form
9548A3096134m96678l71038j71124p6601m1840j0508O4457K11007M45966N16222
9538A3165997M88193M14074K37161p2969m01989o37833p69199q09092p72348o22480
9528A0219515n31614n16878m94802m95776n35345n48791n46695m31013k80738
9519E837863j56540K0187J76649L18693L62390L28363J64860n7945k63200l73522
9509F357798m46279m43763k89386j51345j3278J33087L12679M35175N03441N56239
9499F954368N01090M35457M43381M58958N31389N90046M88913K94817K5979k63486
9489A0460912m56999o18693o10952n77957l72323r2532Q6627L34617O46303R43043
9479I742046J309850J669066J838666J753481J494984J099323P94895N92965M56641
$$ plain form
9470 20751917 21130220 21341711 21224482 20732884 19819049 18557164 17148274 15746697 14506367
9461 14506367 13523364 12873109 12593389 12715429 13283480 14256417 15633752 17280365 19086292
9452 19086292 20853528 22376921 23563658 24387767 24923920 25150409 25129567 24939628 24661887
9443 24661887 24262338 23795741 23285729 22746426 22225888 21725833 21183682 20588064 20013901
9434 20013901 19516372 19239852 19221674 19430673 19820545 20196750 20423889 20464026 20318986 20039494
9424 20039494 19812958 19644783 19609565 19727085 19966217 20320658 20789148 21404827 22276032 23400426
9414 23400426 24661433 25942156 27025747 27730105 28076225 27928395 27418469 26594668 25490733
9405 25490733 24217173 22830175 21319792 19763906 18351805 17127921 16216510 15725059
$$ packed form
9470B0751917L78303K11491j17229m91598r13835j261885j408890j401577j240330
9461A4506367r83003o50255k79720J22040N68051R72937J377335J646613J805927
9452A9086292J767236J523393J186737Q24109N36153K26489k0842j89939k77741
9443B4661887l99549m66597n10012n39303n20538n00055n42151n95618n74163
9434B0013901m97529k76520j8178K08999L89872L76205K27139M0137j45040k79492
9424B0039494k26536j68175l5218J17520K39132L54441M68490O15679Q71205J124394
9414B3400426J261007J280723J083591P04358L46120j47830n09926q23801j103935
9405B5490733j273560j386998j510383j555886j412101j223884r11411m91451
$$ plain form
9397 15725059 15691771 16141720 16985962 18198642 19777678 21778738 24080166 26504065 28905241
9388 28905241 30978946 32612763 33770052 34330774 34315661 33744333 32694849 31174361 29192890
9379 29192890 26983054 24726641 22708801 21059333 19888642 19194075 18934582 19005834 19378540
9370 19378540 20151278 21377869 23095852 25260419 27686605 30111224 32221585 33830327
9362 33830327 34793206 35189037 35107004 34646701 33861220 32773449 31380889 29679899 27761278
9353 27761278 25831550 24044212 22523224 21316349 20423280 19749785 19278885 18938365 18808865
9344 18808865 18955433 19431991 20152521 21040405 21901833 22645029 23198223 23574523 23708504
9335 23708504 23582803 23196303 22510115 21628510 20662527 19638527 18566479 17479211 16392796
$$ packed form
9397A5725059l3288M49949Q44242J212680J579036K001060K301428K423899K401176
9388B8905241K073705J633817J157289N60722j5113n71328j049484j520488j981471
9379B9192890k209836k256413k017840j649468j170691o94567k59493P1252L72706
9370A9378540P72738J226591J717983K164567K426186K424619K110361J608742
9362C3830327R62879L95831q2033m60303p85481j087771j392560j700990j918621
9353B7761278j929728j787338j520988j206875q93069o73495m70900l40520j29500
9344A8808865J46568M76558P20530Q87884Q61428P43196N53194L76300J33981
9335B3708504j25701l86500o86188q81605r65983j024000j072048j087268j086415
$$ plain form
9326 16392796 15333284 14331506 13332718 12312532 11324774 10447304 9715842 9136762 8723896
9317 8723896 8456690 8220828 8083042 8079838 8195040 8388920 8633090 8844947 8947755 8910067
9307 8910067 8752345 8499778 8245260 8051266 7884919 7671712 7344937 6873675 6312461 5671224
9297 5671224 5024442 4424841 3921660 3458682 3068641 2799869 2606898 2455140 2354647 2257691
9287 2257691 2190282 2163482 2228882 2296845 2348109 2411437 2562555 2738388 2899604 3036899 3106913
9276 3106913 3074792 2914977 2688098 2453376 2198776 1976475 1757550 1586254 1453058 1374123
9266 1374123 1316063 1263116 1244690 1203534 1145514 1099882 1100522 1081057 1078534 1057288 1036205 1053993
9254 1053993 1058183 1067410 1084117 1066123 995987 956407 965643 1017804 993068 973259 996888 985686
$$ packed form
9326A6392796j059512j001778r98788j020186r87758q77470p31462n79080m12866
9317H723896k67206k35862j37786l204J15202J93880K44170K11857J02808l7688
9307H910067j57722k52567k54518j93994j66347k13207l26775m71262n61214o41237
9297E671224o46782n99601n03181m62978l90041k68772j92971j51758j00493r6956
9287B257691o7409k6800O5400O7963N1264O3328J51118J75833J61216J37295P0014
9276C106913l2121j59815k26879k34722k54600k22301k18925j71296j33196p8935
9266A374123n8060n2947j8426m1156n8020m5632O40j9465k523k1246k1083J7788
9254A053993M190R227J6707j7994p0136l9580R236N2161k4736j9809K3629j1202
$$ plain form
9242 985686 1003745 999209 1025322 1068082 1077871 1074734 1093890 1162969 1206774 1234185 1308546 1390890
9230 1390890 1479104 1571844 1707380 1839859 2030836 2257607 2544398 2933703 3461557 4163964
9220 4163964 4951280 5772259 6315408 6478595 6315532 5910481 5313405 4718395 4143292 3693397
9210 3693397 3346243 3116376 2945439 2878303 2849434 2899331 2981610 3077814 3245798 3497961
9200 3497961 3926335 4482929 5205284 6105210 7189653 8329605 9393764 10219591 10651388
9191 10651388 10552152 9929513 8954797 7837894 6736556 5767497 4999528 4407782 3997501
9182 3997501 3710941 3482600 3273690 3186304 3112342 3091007 3134237 3184792 3378845 3641989
9172 3641989 4004669 4458013 5034780 5697390 6233901 6460768 6333171 6007540 5526582 4975802
$$ packed form
9242I85686J8059m536K6113M2760R789l137J9156O9079M3805K7411P4361Q2344
9230A390890Q8214R2740J35536J32479J90977K26771K86791L89305N27854P02407
9220D163964P87316Q20979N43149J63187j63063m05051n97076n95010n75103m49895
9210C693397l47154k29867j70937o7136k8869M9897Q2279R6204J67984K52163
9200C497961M28374N56594P22355Q99926J084443J139952J064159Q25827M31797
9191A0651388r9236o22639r74716j116903j101338r69059p67969n91746m10281
9182C997501k86560k28341k08910q7386p3962k1335M3230N0555J94053K63144
9172C641989L62680M53344N76767O62610N36511K26867j27597l25631m80958n50780
$$ plain form
9162 4975802 4486964 4123766 3927363 3863778 3918965 4110965 4376308 4789339 5373351 6226167
9152 6226167 7428449 8918838 10565834 12083220 13053121 13283057 12806080 11838449 10605747
9143 10605747 9327354 8199408 7334883 6802730 6558296 6528095 6777298 7223351 7720205
9134 7720205 8171225 8554770 8874739 9210244 9674964 10427297 11590370 13225655 15317128
9125 15317128 17650401 19951124 21815112 22795097 22627940 21389947 19400745 17049436
9117 17049436 14741901 12781335 11305525 10267170 9710410 9526359 9577410 9814122 10067126
9108 10067126 10223851 10137116 9880156 9581711 9332184 9238142 9418408 9938307 10769530 11774899
9098 11774899 12636604 13122250 12994532 12278193 11210250 9951435 8691314 7640960 6868279
$$ packed form
9162D975802m88838l63198j96403o3585N5187J92000K65343M13031N84012Q52816
9152F226167J202282J490389J646996J517386R69901K29936m76977r67631j232702
9143A0605747j278393j127946q64525n32153k44434l0201K49203M46053M96854
9134G720205M51020L83545L19969L35505M64720P52333J163073J635285K091473
9125A5317128K333273K300723J863988R79985j67157j237993j989202k351309
9117A7049436k307535j960566j475810j038355n56760j84051N1051K36712K53004
9108A0067126J56725q6735k56960k98445k49527r4042J80266N19899Q31223J005369
9098A1774899Q61705M85646j27718p16339j067943j258815j260121j050354p72681
$$ plain form
9089 6868279 6349564 6071794 6028731 6168759 6494430 6878646 7310117 7778074 8307124 8926834
9079 8926834 9514532 9848316 9782976 9382141 8785654 7991076 7231387 6646561 6320057 6270437
9069 6270437 6468582 6871069 7502024 8378591 9386258 10247653 10755411 10858942 10615783
9060 10615783 10268206 9931211 9899515 10210002 10953921 12097380 13359007 14410876 15011961
9051 15011961 14956238 14234103 13166101 12016582 10985832 10239678 9835539 9869291 10326374
9042 10326374 11148596 12236353 13411584 14501103 15278543 15501756 15108060 14200039 13019436
9033 13019436 11801847 10752158 10040328 9732405 9774610 9951402 9987744 9740050 9240659
9024 9240659 8551042 7728145 6953486 6338293 5925361 5735590 5754021 5990460 6399969 6874257
$$ packed form
9089F868279n18715k77770m3063J40028L25671L84216M31471M67957N29050O19710
9079H926834N87698L33784o5340m00835n96487p94578p59689n84826l26504m9620
9069F270437J98145M02487O30955Q76567J007667Q61395N07758J03531k43159
9060A0615783l47577l36995l1696L10487P43919J143459J261627J051869O01085
9051A5011961n5723p22135j068002j149519j030750p46154m04139L3752M57083
9042A0326374Q22222J087757J175231J089519P77440K23213l93696r08021j180603
9033A3019436j217589j049689p11830l07923M2205J76792L6342k47694m99391
9024I240659o89617q22897p74659o15193m12932j89771J8431K36439M09509M74288
$$ plain form
9014 6874257 7406185 7845963 7944754 7700615 7219177 6542849 5793943 5039815 4450170 3986665
9004 3986665 3651971 3423315 3247285 3171787 3205620 3303848 3534675 3917988 4429338 5064170
8994 5064170 5695576 6070762 6037969 5706174 5191161 4555937 3960639 3516228 3227113 3004621
8984 3004621 2838333 2725169 2680208 2686466 2728201 2801733 2896439 3023137 3227143 3533832 3904277
8973 3904277 4448096 5205423 6110832 7168372 8122211 8759224 8912701 8600802 7848982
8964 7848982 6884620 5901709 5020134 4272327 3707917 3303579 2981678 2766900 2599255 2452803
8954 2452803 2379484 2371660 2375593 2405146 2467959 2621962 2842842 3146240 3546947 3994938 4494481
8943 4494481 4826400 4908986 4780530 4419576 3962557 3455330 2918904 2517996 2212995 1983699
$$ packed form
9014F874257N31928M39778R8791k44139m81438o76328p48906p54128n89645m63505
9004C986665l34694k28656j76030p5498L3833R8228K30827L83313N11350O34832
8994E064170O31406L75186l2793l31795n15013o35224n95298m44411k89115k22492
8984C004621j66288j13164m4961O258M1735P3532R4706J26698K04006L06689L70445
8973C904277N43819P57327R05409J057540R53839O37013J53477l11899p51820
8964G848982r64362r82911q81575p47807n64410m04338l21901k14778j67645j46452
8954B452803p3319p824L933K9553O2813J54003K20880L03398M00707M47991M99543
8943D494481L31919Q2586j28456l60954m57019n07227n36426m00908l05001k29296
$$ plain form
8933 1983699 1816594 1678173 1537367 1416346 1323917 1274702 1233509 1186824 1139318 1135706 1123012
8922 1123012 1071709 1039336 1026969 1015182 993560 955845 908150 908375 928942 939750 946175 959045
8910 959045 920936 884283 866236 835440 830600 840115 843693 843400 796744 808767 845609 833331 781945
8897 781945 781257 759349 759008 735992 708108 696030 716800 746756 775223 778877 743882 739236 767352
8884 767352 757557 755362 789641 775901 726531 729640 724362 741348 764011 765096 775551 752689 736953
8871 736953 748605 761685 759012 747389 718677 738463 737954 773037 817310 797765 765352 729174
8859 729174 725074 756747 772706 763940 703398 700789 725784 735286 729494 673607 700220 700143 696003
8846 696003 706891 725054 731134 746133 740070 722890 684232 671264 660163 669424 689189 694131
$$ packed form
8933A983699j67105j38421j40806j21021r2429m9215m1193m6685m7506l612j2694
8922A123012n1303l2373j2367j1787k1622l7715m7695K25K0567J0808O425J2870
8910I59045l8109l6653j8047l0796m840R515L578k93m6656J2023L6842j2278n1386
8897G81945o88k1908l41k3016k7884j2078K0770K9956K8467L654l4995m646K8116
8884G67352r795k195L4279j3740m9370L109n278J6986K2663J085J0455k2862j5736
8871G36953J1652J3080k673j1623k8712J9786n09L5083M4273j9545l2413l6178
8859G29174m100L1673J5959q766o0542k609K4995R502n792n5887K6613p7m140
8846F96003J0888J8163O080J4999o063j7180l8658j2968j1101R261J9765M942
$$ plain form
8834 694131 716482 718783 693549 684921 662817 641488 646054 695285 704467 704756 667048 656686 703341
8821 703341 698826 713431 673385 702770 716494 702785 713481 713730 729914 711544 690449 715370
8809 715370 703449 689676 719920 738321 735727 760955 749470 724940 707252 702028 694778 705085
8797 705085 769456 806264 808331 777904 756426 783784 762386 748224 731332 738880 776458 765242
8785 765242 778149 783107 785462 793614 800958 800462 806771 834591 851483 847760 829653 820752 794460
8772 794460 776815 815292 813666 792244 818124 802865 774400 772390 789342 835192 845501 843770
8760 843770 845535 877636 875750 852955 844265 832829 853755 877267 862475 851596 865056 909924
8748 909924 929458 938176 921989 900122 940919 933463 926160 928754 944882 960378 946351 955385 956622
$$ packed form
8834F94131K2351K301k5234q628k2104k1329M566M9231R182K89l7708j0362M6655
8821G03341m515J4605m0046K9385J3724j3709J0696K49J6184j8370k1095K4921
8809G15370j1921j3773L0244J8401k594K5228j1485k4530j7688n224p250J0307
8797G05085O4371L6808K067l0427k1478K7358k1398j4162j6892P548L7578j1216
8785G65242J2907M958K355Q152P344m96O309K7820J6892l723j8107q901k6292
8772G94460j7645L8477j626k1422K5880j5259k8465k010J6952M5850J0309j731
8760H43770J765L2101j886k2795q690j1436K0926K3512j4792j0879J3460M4868
8748I09924J9534Q718j6187k1867M0797p456p303K594J6128J5496j4027R034J237
$$ plain form
8735 956622 965605 973629 975732 983977 1014377 1037141 1056241 1075314 1127564 1150619 1173877 1197461
8723 1197461 1233008 1265614 1347841 1394013 1411141 1443323 1453461 1492088 1545685 1605794 1656437
8712 1656437 1743673 1871042 1988356 2142693 2363240 2598428 2903536 3306209 3805884 4430576
8702 4430576 5240234 6277267 7589660 9031198 10444457 11614294 12306559 12385378 11879952
8693 11879952 10955443 9798245 8575315 7419352 6424151 5644285 5046655 4672338 4400463
8684 4400463 4198759 4125911 4118569 4202751 4384598 4609486 4958495 5550293 6368187 7389430
8674 7389430 8585945 9782097 10827333 11593085 11853182 11587338 10830054 9861855 8724952
8665 8724952 7600198 6605518 5767586 5098829 4576515 4169811 3841677 3587010 3362608
$$ packed form
8735I56622Q983Q024K103Q245L0400K2764J9100J9073N2250K3055K3258K3584
8723A197461L5547L2606Q2227M6172J7128L2182J0138L8627N3597O0109N0643
8712A656437Q7236J27369J17314J54337K20547K35188L05108M02673M99675O24692
8702D430576Q09658J037033J312393J441538J413259J169837O92265P8819n05426
8693A1879952r24509j157198j222930j155963r95201p79866n97630l74317k71875
8684D400463k01704p2848p342Q4182J81847K24888L49009N91798Q17894J021243
8674G389430J196515J196152J045236P65752K60097k65844p57284r68199j136903
8665H724952j124754r94680q37932o68757n22314m06704l28134k54667k24402
$$ plain form
8656 3362608 3178970 3065536 3036547 2983016 2923605 2900108 2887941 2854222 2886178 2948394 3003200
8645 3003200 3104136 3280313 3500224 3805525 4169221 4578897 5113125 5762788 6579977 7594036
8635 7594036 8822119 10226465 11729969 13172849 14346442 15180252 15781863 16200952 16503729
8626 16503729 16770690 16930470 16851809 16605120 16314138 16123874 16182254 16493270 16940597 17335675
8616 17335675 17534664 17353924 16825657 16092532 15330742 14799747 14702820 15009394 15612572 16292859
8606 16292859 16892306 17284766 17369185 17228879 16993608 16656588 16275198 15870347 15470321 15073511
8596 15073511 14774901 14618712 14716872 14993059 15200523 15179683 14810842 14032269 12892800 11578430
8586 11578430 10208513 8938244 7870305 7036914 6361596 5873258 5563848 5384966 5260593
$$ packed form
8656C362608j83638j13434k8989n3531n9411k3497j2167l3719L1956O2216N4806
8645C003200J00936J76177K19911L05301L63696M09676N34228O49663Q17189J014059
8635G594036J228083J404346J503504J442880J173593Q33810O01611M19089L02777
8626A6503729K66961J59780p8661k46689k90982j90264N8380L11016M47327L95078
8616A7335675J98989j80740n28267p33125p61790n30995r6927L06574O03178O80287
8606A6292859N99447L92460Q4419j40306k35271l37020l81390m04851m00026l96810
8596A5073511k98610j56189R8160K76187K07464k0840l68841p78573j139469j314370
8586A1578430j369917j270269j067939q33391o75318m88338l09410j78882j24373
$$ plain form
8577 5260593 5151582 5035204 4937821 4823785 4735542 4687437 4674299 4742366 4868827 5081180
8567 5081180 5441526 5942458 6580547 7381651 8380071 9441156 10464203 11309022 11968878
8558 11968878 12346618 12548762 12746999 13094853 13644059 14338838 15035201 15589082 15946339
8549 15946339 16124189 16194382 16243689 16222182 16106141 15773012 15215135 14506189 13761107 13153572
8539 13153572 12828146 12822277 13112765 13479597 13751065 13877625 13812538 13655631 13527799 13556853
8529 13556853 13862395 14314132 14804200 15148671 15263750 15162359 14919727 14575509 14165482
8520 14165482 13675738 12989037 12132124 11122585 9970370 8840107 7768528 6828962 6086725
8511 6086725 5538263 5055958 4642306 4341691 4093349 3911928 3739642 3585310 3480962 3376131
$$ packed form
8577E260593j09011j16378r7383j14036q8243m8105j3138O8067J26461K12353
8567E081180L60346N00932O38089Q01104R98420J061085J023047Q44819O59856
8558A1968878L77740K02144J98237L47854N49206O94779O96363N53881L57257
8549A5946339J77850P0193M9307k1507j16041l33129n57877p08946p45082o07535
8539A3153572l25426n869K90488L66832K71468J26560o5087j56907j27832K9054
8529A3556853L05542M51737M90068L44471J15079j01391k42632l44218m10027
8520A4165482m89744o86701q56913j009539j152215j130263j071579r39566p42237
8511F086725n48462m82305m13652l00615k48342j81421j72286j54332j04348j04831
$$ plain form
8501 3376131 3301975 3251567 3207098 3197477 3207613 3235620 3274097 3329928 3406652 3502412 3609363
8490 3609363 3762420 3899280 4129401 4476538 4882615 5433296 6203754 7101010 8049757 8888948
8480 8888948 9404571 9520279 9242474 8663790 7898636 7095986 6374948 5757623 5300800 4965511
8470 4965511 4790536 4684092 4635845 4579025 4576342 4677765 4834846 5081825 5414356 5852668
8460 5852668 6398293 7052015 7696615 8307339 8701582 8769308 8514060 8033325 7383567 6643465
8450 6643465 5977407 5403743 4940506 4625602 4371628 4100603 3926401 3803334 3677412 3571065
8440 3571065 3518007 3493128 3441862 3370333 3317470 3267719 3255890 3248215 3228806 3206468 3202608 3208728
8428 3208728 3232050 3254860 3268481 3229611 3234046 3250147 3275334 3274711 3277735 3305454 3328269 3319935
$$ packed form
8501C376131p4156n0408m4469r621J0136K8007L8477N5831P6724R5760J06951
8490C609363J53057J36860K30121L47137M06077N50681P70458Q97256R48747Q39191
8480H888948N15623J15708k77805n78684p65154q02650p21038o17325m56823l35289
8470D965511j74975j06444m8247n6820k683J01423J57081K46979L32531M38312
8460E852668N45625O53722O44600O10724L94243O7726k55248m80735o49758p40102
8450F643465o66058n73664m63237l14904k53974k71025j74202j23067j25922j06347
8440C571065n3058k4879n1266p1529n2863m9751j1829p675j9409k2338l860O120
8428C208728K3322K2810J3621l8870M435J6101K5187o23L024K7719K2815q334
$$ plain form
8416 3319935 3331693 3322554 3279217 3267074 3324201 3358872 3369003 3378224 3409653 3422948 3414097 3393200
8404 3393200 3439302 3532165 3553889 3543583 3528105 3554609 3539659 3553341 3566929 3556568 3576072
8393 3576072 3618085 3657559 3659685 3631635 3668138 3698361 3675366 3684490 3692969 3741960 3771456 3751459
8381 3751459 3724152 3747949 3797603 3838481 3889264 3912717 3930860 3902099 3877626 3904801 3900414 3877195
8369 3877195 3894369 3946839 3954802 3961902 3955846 3952840 3981348 3989425 3988036 3989459 4003238 4049769 4097592
8356 4097592 4143873 4150504 4150890 4140336 4142942 4141085 4152304 4203540 4227547 4208189 4204546 4203434 4257990
8343 4257990 4293056 4301717 4336121 4357172 4366915 4328166 4294017 4356732 4373726 4348580 4393717 4413751
8331 4413751 4376930 4402690 4451315 4458368 4430051 4415836 4392573 4404348 4442578 4444477 4436299 4465106
$$ packed form
8416C319935J1758r139m3337j2143N7127L4671J0131R221L1429J3295q851k0897
8404C393200M6102R2863K1724j0306j5478K6504j4950J3682J3588j0361J9504
8393C576072M2013L9474K126k8050L6503L0223k2995R124Q479M8991K9496j9997
8381C751459k7307K3797M9654M0878N0783K3453J8143k8761k4473K7175m387k3219
8369C877195J7174N2470P963P100o056l006K8508Q077j389J423J3779M6531M7823
8356D097592M6281O631L86j0554K606j857J1219N1236K4007j9358l643j112N4556
8343D257990L5066Q661L4404K1051R743l8749l4149O2715J6994k5146M5137K0034
8331D413751l6821K5760M8625P053k8317j4215k3263J1775L8230J899q178K8807
$$ plain form
8319 4465106 4518790 4530418 4505462 4502167 4527038 4568930 4604681 4561565 4518594 4507759 4553958 4570604
8307 4570604 4596975 4616562 4629212 4659652 4684423 4682515 4667675 4692180 4710504 4686514 4657651 4670037
8295 4670037 4710172 4733731 4729043 4712616 4717134 4692446 4682338 4697876 4730508 4757908 4752732 4750293
8283 4750293 4730956 4712541 4707463 4726512 4713852 4721216 4703449 4679393 4671647 4667545 4671867 4665746 4641011
8270 4641011 4670200 4710283 4703263 4645242 4616573 4618293 4609898 4601344 4604985 4580271 4578654 4542171 4534230
8257 4534230 4569840 4588243 4587379 4569870 4568271 4567413 4555449 4552414 4571590 4565760 4544728 4520817 4504762
8244 4504762 4467274 4447854 4424967 4390159 4377584 4345891 4351389 4345618 4332015 4356181 4388744 4348470
8232 4348470 4277640 4244338 4269877 4258693 4241618 4222341 4191820 4182585 4150751 4162866 4202605 4195513
$$ packed form
8319D465106N3684J1628k4956l295K4871M1892L5751m3116m2971j0835M6199J6646
8307D570604K6371J9587J2650L0440K4771j908j4840K4505J8324k3990k8863J2386
8295D670037M0135K3559m688j6427M518k4688j0108J5538L2632K7400n176k439
8283D750293j9337j8415n078J9049j2660P364j7767k4056p746m102M322o121k4735
8270D641011K9189M0083p020n8021k8669J720q395q554L641k4714j617l6483p941
8257D534230L5610J8403q64j7509j599q58j1964l035J9176n830k1032k3911j6055
8244D504762l7488j9420k2887l4808j2575l1693N498n771j3603K4166L2563m0274
8232D348470p0830l3302K5539j1184j7075j9277l0521r235l1834J2115L9739p092
$$ plain form
8220 4195513 4172606 4108325 4076375 4101211 4082901 4038075 4004181 4012250 3978398 3939163 3936509 3921540
8208 3921540 3876665 3847210 3854008 3827660 3828308 3843726 3783987 3728779 3747724 3752452 3712127 3706453
8196 3706453 3680859 3644833 3619884 3601948 3572068 3544597 3559902 3574864 3560821 3534022 3528010 3520891
8184 3520891 3508589 3487151 3440951 3407587 3418250 3445867 3435852 3428325 3425325 3425964 3444594 3482131
8172 3482131 3487508 3473882 3471303 3437195 3408808 3381908 3304959 3251598 3236586 3236966 3159648 3108550
8160 3108550 3049028 3027974 3037778 3014625 3005905 2998053 3017200 3014759 2995441 2996593 3005711 3062649 3119327
8147 3119327 3143552 3126459 3057090 3013614 2953423 2931139 2904838 2808205 2726357 2688595 2703083
8136 2703083 2705967 2675017 2703931 2730275 2740369 2788071 2811696 2767997 2739146 2713999 2673313 2639332
$$ packed form
8220D195513k2907o4281l1950K4836j8310m4826l3894Q069l3852l9235k654j4969
8208C921540m4875k9455O798k6348O48J5418n9739n5208J8945M728m0325n674
8196C706453k5594l6026k4949j7936k9880k7471J5305J4962j4043k6799o012p119
8184C520891j2302k1438m6200l3364J0663K7617j0015p527l000O39J8630L7537
8172C482131N377j3626k579l4108k8387k6900p6949n3361j5012L80p7318n1098
8160C108550n9522k1054R804k3153q720p852J9147k441j9318J152R118N6938N6678
8147C119327K4225j7093o9369m3476o0191k2284k6301r6633q1848l7762J4488
8136B703083K884l0950K8914K6344J0094M7702K3625m3699k8851k5147m0686l3981
$$ plain form
8124 2639332 2586226 2582606 2551506 2514973 2475729 2437121 2416482 2401049 2405459 2392621 2356587 2340364
8112 2340364 2322544 2340698 2323027 2346026 2340266 2312240 2352662 2359691 2368596 2342764 2295644 2286852
8100 2286852 2237605 2161435 2111241 2063294 2052927 2044127 2036832 2028768 2000838 2003319 2037948 2043409
8088 2043409 2030425 2015211 1976506 1980579 1965977 1961565 1975444 1886897 1843831 1790499 1794669 1816560
8076 1816560 1801043 1812512 1818343 1788089 1757821 1728323 1696447 1686584 1695424 1693030 1691472 1699824 1685787
8063 1685787 1628795 1611619 1632025 1658037 1635811 1617319 1615652 1614491 1581459 1540958 1550670 1556622
8051 1556622 1562246 1572920 1566744 1549268 1586431 1595716 1580246 1507888 1483165 1489791 1475951 1455466
8039 1455466 1487994 1527893 1477557 1440924 1449849 1463959 1493792 1483520 1474986 1416387 1399271 1429752
$$ packed form
8124B639332n3106l620l1100l6533l9244l8608k0639j5433M410j2838l6034j6223
8112B340364j7820J8154j7671K2999n760k8026M0422P029Q905k5832m7120q792
8100B286852m9247p6170n0194m7947j0367q800p295q064k7930K481L4629N461
8088B043409j2984j5214l8705M073j4602m412J3879q8547m3066n3332M170K1891
8076A816560j5517J1469N831l0254l0268k9498l1876r863Q840k394j558Q352j4037
8063A685787n6992j7176K0406K6012k2226j8492j667j161l3032m0501R712N952
8051A556622N624J0674o176j7476L7163R285j5470p2358k4723O626j3840k0485
8039A455466L2528L9899n0336l6633Q925J4110K9833j0272q534n8599j7116L0481
$$ plain form
8027 1429752 1398525 1377130 1349656 1306142 1282365 1316359 1347812 1320152 1320801 1306697 1304480 1301747
8015 1301747 1278477 1236092 1219127 1222698 1224606 1257854 1263017 1254280 1257089 1243681 1235653 1231712 1203464
8002 1203464 1175172 1169419 1184423 1164404 1166264 1209460 1179606 1169470 1152183 1115096 1120446 1152597
7990 1152597 1167337 1134293 1138097 1148631 1143676 1154457 1173098 1137103 1112422 1075076 1069328 1091517
7978 1091517 1090630 1085993 1103717 1092200 1073113 1013527 998698 1055759 1069437 1040323 1024157 995146
7966 995146 944188 905380 912129 969833 998594 969840 955129 957691 954923 981217 996345 938070
7954 938070 925532 932379 946961 947079 978353 996924 984308 968337 938809 903937 862785 908177
7942 908177 929150 924279 917033 898239 885681 894039 889172 859923 877133 882663 869350 860223 826766
$$ packed form
8027A429752l1227k1395k7474m3514k3777L3994L1453k7660O49j4104k217k733
8015A301747k3270m2385j6965L571J908L3248N163q737K809j3408q028l941k8248
8002A203464k8292n753J5004k0019J860M3196k9854j0136j7287l7087N350L2151
7990A152597J4740l3044L804J0534m955J0781J8641l5995k4681l7346n748K2189
7978A091517q87m637J7724j1517j9087n9586j4829N7061J3678k9114j6166k9011
7966I95146n0958l8808O749N7704K8761k8754j4711K562k768K6294J5128n8275
7954I38070j2538O847J4582J18L1274J8571j2616j5971k9528l4872m1152M5392
7942I08177K0973m871p246j8794j2558Q358m867k9249J7210N530j3313r127l3457
$$ plain form
7929 826766 848415 859955 826302 800945 819607 794242 745638 734060 760503 720715 709665 736850
7917 736850 777299 760672 764802 771969 785890 780591 763277 759042 763154 780226 799020 794172 795846
7904 795846 793707 825829 817715 769956 740704 763918 775111 764204 743285 720306 709279 696648
7892 696648 686645 720323 750580 775155 752358 734670 720688 727346 685279 677366 684573 677716
7880 677716 725170 737045 707675 681460 667902 620316 624439 611617 615513 631895 625798 607078
7868 607078 609488 602593 603588 610037 594396 577208 574886 616302 624539 594746 628338 607401 578710
7855 578710 565393 535882 492231 465876 493513 533377 531091 505754 510429 508429 495645 488421
7843 488421 476888 498079 521115 500382 472308 446346 468122 504218 488537 490115 450445 479411
$$ packed form
7929H26766K1649J1540l3653k5357J8662k5365m8604j1578K6443l9788j1050K7185
7917G36850M0449j6627M130P167J3921n299j7314m235M112J7072J8794m848J674
7904G95846k139L2122q114m7759k9252K3214J1193j0907k0919k2979j1027j2631
7892F96648j0003L3678L0257K4575k2797j7688j3982O658m2067p913P207o857
7880F77716M7454J1875k9370k6215j3558m7586M123j2822L896J6382o097j8720
7868F07078K410o895R95O449j5641j7188k322M1416Q237k9793L3592k0937k8691
7855E78710j3317k9511m3651k6355K7637L9864k286k5337M675k000j2784p224
7843D88421j1533K1191K3036k0733k8074k5962K1776L6096j5681J578l9670K8966
$$ plain form
7831 479411 508529 521076 487815 490004 492841 482335 472954 494909 507223 496099 504591 490751
7819 490751 486408 507696 535477 523694 518569 465520 438887 426598 432318 447006 457061 435206
7807 435206 451951 443199 458102 489811 471478 417992 395664 403799 374249 415476 438086 433487
7795 433487 411714 380242 381382 377010 389000 381651 375731 402837 408344 396543 371177 357365 364567
7782 364567 408454 444874 427820 413419 415094 431845 414307 375219 408948 437099 450969 456573
7770 456573 431741 381665 368087 405700 419270 437290 430280 448159 426969 379847 349884 369862
7758 369862 372796 341520 306680 327255 346505 384559 377563 346708 331940 352291 373504 367825
7746 367825 370547 344716 364701 372012 376929 386275 363636 362343 372319 348751 317304 322214 336213
$$ packed form
7831D79411K9118J2547l3261K189K837j0506r381K1955J2314j1124Q492j3840
7819D90751m343K1288K7781j1783n125n3049k6633j2289N720J4688J0055k1855
7807D35206J6745q752J4903L1709j8333n3486k2328Q135k9550M1227K2610m599
7795D33487k1773l1472J140m372J1990p349n920K7106N507j1801k5366j3812P202
7782C64567M3887L6420j7054j4401J675J6751j7538l9088L3729K8151J3870N604
7770D56573k4832n0076j3578L7613J3570J8020p010J7879k1190m7122k9963J9978
7758C69862K934l1276l4840K0575J9250L8054o996l0855j4768K0351K1213n679
7746C67825K722k5831J9985P311M917R346k2639j293R976k3568l1447M910J3999
$$ plain form
7733 336213 346552 346624 354295 341097 323659 291043 268608 277603 336083 365101 376098 380709 371915
7720 371915 336614 354672 380327 396440 376217 372430 360775 338674 309696 279851 275247 298374
7708 298374 305723 356013 370799 358791 358517 356590 322847 320921 308521 276614 264136 265892 257618
7695 257618 264567 279836 273972 280361 293474 288460 295147 296358 264126 284854 298292 297404 265978
7682 265978 292456 315517 288742 262429 248396 263452 291957 305974 324025 312566 280066 271573
7670 271573 286239 297667 277407 281161 311393 300173 317557 296610 298212 265954 221688 182943
7658 182943 209736 211891 248096 242023 232645 236965 232913 198129 243991 222575 211713 225473 224238
7645 224238 270699 255872 220880 190117 160922 211356 234351 242536 243028 234620 245927 268626
$$ packed form
7733C36213J0339P2P671j3198j7438l2616k2435Q995N8480K9018J0997M611q794
7720C71915l5301J8058K5655J6113k0223l787j1655k2101k8978k9845m604K3127
7708B98374P349N0290J4786j2008k74j927l3743j926j2400l1907j2478J756q274
7695B57618O949J5269n864O389J3113n014O687J211l2232K0728J3438q88l1426
7682B65978K6478K3061k6775k6313j4033J5056K8505J4017J8051j1459l2500q493
7670B71573J4666J1428k0260L754L0232j1220J7384k0947J602l2258m4266l8745
7658A82943K6793K155L6205o073r378M320m052l4784M5862k1416j0862J3760j235
7645B24238M6461j4827l4992l0763k9195N0434K2995Q185M92q408J1307K2699
$$ plain form
7633 268626 301130 297103 258381 260112 268221 245900 224433 240287 283275 294565 238133 218011
7621 218011 258260 266801 262455 243591 224614 242276 248683 227204 223867 241919 248132 241552 211342
7608 211342 195253 223388 227855 190934 184790 229954 252114 273860 247681 236678 243490 261456
7596 261456 254433 236963 240121 215826 206846 235425 240418 215310 201549 209615 226600 260469 230696
7583 230696 174005 136373 175221 207185 246280 229064 192378 170235 164658 167804 154447 187999
7571 187999 216104 210320 189651 183242 173168 171703 204772 202626 172440 139349 162913 196258
7559 196258 229956 220155 185162 171050 216318 235749 205354 193674 184769 169782 177616 196262
7547 196262 230164 249210 234399 207673 191130 199186 183965 155050 113492 117407 144615 136445
$$ packed form
7633B68626L2504m027l8722J731Q109k2321k1467J5854M2988J1290n6432k0122
7621B18011M0249Q541m346j8864j8977J7662O407k1479l337J8052O213o580l0210
7608B11342j6089K8135M467l6921o144M5164K2160K1746k6179j1003O812J7966
7596B61456p023j7470L158k4295q980K8579M993k5108j3761Q066J6985L3869k9773
7583B30696n6691l7632L8848L1964L9095j7216l6686k2143n577L146j3357L3552
7571A87999K8105n784k0669o409j0074j465L3069k146l0186l3091K3564L3345
7559A96258L3698r801l4993j4112M5268J9431l0395j1680q905j4987P834J8646
7547A96262L3902J9046j4811k6726j6543Q056j5221k8915m1558L915K7208q170
$$ plain form
7535 136445 147098 138459 119848 127189 110246 82359 88535 70350 75362 80089 60435 82361 92024
7522 92024 97440 108524 130722 176094 187734 201247 214725 190803 162387 150418 119541 99230
7510 99230 129643 149922 199430 191206 136323 132246 136510 153050 149148 133559 108227 128853 150707
7497 150707 148206 104555 79032 71718 76515 93808 90925 115955 134755 146526 176166 227810
7485 227810 203538 166131 143755 135115 105654 74749 108780 106577 79039 76431 71038 97739
7473 97739 78074 80815 107358 119586 119117 128160 139209 134566 138065 147974 151360 100901 88535
7460 88535 88191 84487 99335 116840 111381 125825 105661 92729 94436 112462 87327 89635 122231
7447 122231 125065 133610 129385 110005 126566 111394 104737 112285 96487 56491 80021 76635 94577
$$ packed form
7535A36445J0653q639j8611P341j6943k7887O176j8185N012M727j9654K1926R663
7522I2024N416J1084K2198M5372J1640J3513J3478k3922k8416j1969l0877k0311
7510I9230L0413K0279M9508q224n4883m077M264J6540l902j5589k5332K0626K1854
7497A50707k501m3651k5523p314M797J7293k883K5030J8800J1771K9640N1644
7485B27810k4272l7407k2376q640k9461l0905L4031k203k7538k608n393K6701
7473I7739j9665K741K6543J2228m69R043J1049m643L499R909L386n0459j2366
7460H8535l44l704J4848J7505n459J4444k0164j2932J707J8026k5135K308L2596
7447A22231K834Q545m225j9380J6561j5172o657P548j5798l9996K3530l386J7942
$$ plain form
7434 94577 77203 63551 95457 87206 66310 46106 60409 77941 80790 75740 92627 129962
7422 129962 139312 150294 146734 114219 109052 102234 123673 146379 141652 157991 171653 165111 137133
7409 137133 161356 181144 166099 150687 136535 105855 83815 113294 119351 101875 109485 84340
7397 84340 93805 114415 123032 110110 142564 194807 148912 128834 112148 100244 103595 90698
7385 90698 91531 119731 96998 114613 120048 77386 45331 52260 76905 74294 71215 88078 125039
7372 125039 112333 58199 76911 110705 96027 63113 66951 88273 61041 37589 39647 65201
7360 65201 46513 72458 88743 104574 121946 102641 72610 93814 123651 73332 57151 66720
7348 66720 87995 116013 118838 88674 76696 47301 42218 71980 80292 67110 86264 52539
$$ packed form
7434I4577j7374j3652L1906q251k0896k0204J4303J7532K849n050J6887L7335
7422A29962R350J0982l560l2515n167o818K1439K2706m727J6339J3662o542k7978
7409A37133K4223J9788j5045j5412j4152l0680k2040K9479O057j7476P610k5145
7397H4340R465K0610Q617j2922L2454N2243m5895k0078j6686j1904L351j2897
7385I0698Q33K8200k2733J7615N435m2662l2055O929K4645k611l079J6863L6961
7372A25039j2706n4134J8712L3794j4678l2914L838K1322k7232k3452K058K5554
7360F5201j8688K5945J6285J5831J7372j9305l0031K1204K9837n0319j6181R569
7348F6720K1275K8018K825l0164j1978k9395n083K9762Q312j3182J9154l3725
$$ plain form
7336 52539 29165 36898 61597 104916 78673 52253 16642 52359 76896 112191 127538 135440
7324 135440 115782 105716 104022 115528 81968 59740 19876 26693 83278 115345 89329 38473
7312 38473 45616 50612 49436 47564 73379 111778 123466 110612 108899 104217 104226 112621 118558 73071
7298 73071 48633 83674 91494 86478 80239 71108 94483 111357 141081 181399 159282 127329 107302
7285 107302 91590 78392 52915 31425 3639 28720 86229 132815 167031 139191 108831 84466
7273 84466 52429 56116 41837 29756 56999 102626 92546 91815 105812 126173 100324 91276 93310
7260 93310 84735 87461 120747 94442 60217 48344 34484 71123 40298 36976 87260 96441 54614
7247 54614 24809 38990 44277 73011 54060 48186 59506 71362 119736 139927 121047 104906
$$ packed form
7336E2539k3374P733K4699M3319k6243k6420l5611L5717K4537L5295J5347P902
7324A35440j9658j0066j694J1506l3560k2228l9864O817N6585L2067k6016n0856
7312C8473P143M996j176j872K5815L8399J1688j2854j713m682RQ395N937m5487
7298G3071k4438L5041P820n016o239r131K3375J6874K9724M0318k2117l1953k0027
7285A07302j5712j3198k5477k1490k7786K5081N7509M6586L4216k7840l0360k4365
7273H4466l2037L687j4279j2081K7243M5627j0080p31J3997K0361k5849r048K034
7260I3310q575K726L3286k6305l4225j1873j3860L6639l0825l322N0284R181m1827
7247E4614k9805J4181N287K8734j8951n874J1320J1856M8374K0191j8880j6141
$$ plain form
7235 104906 72334 64996 32584 26299 35396 43255 38677 25247 50381 65413 82970 66016 55383
7222 55383 67146 88813 90804 74739 67137 75916 71640 94025 93209 76910 92696 85860 98170
7209 98170 108188 82871 31474 18379 31082 60299 89093 74893 57112 62171 59299 40847
7197 40847 48031 62899 65961 44305 33582 59714 118571 110470 32280 41677 109070 97915 81115
7184 81115 25627 24936 26302 81917 82917 48482 51238 68078 78020 72138 70909 42946 53820
7171 53820 98153 99630 130914 128403 93392 39618 13497 42340 30364 49956 46149 24065
7159 24065 31199 54962 38180 81270 83328 48607 75109 81198 58665 23631 38076 38293 27808
7146 27808 34444 39030 48977 54455 64840 68831 37354 24486 45300 89885 113373 89477 38730
$$ packed form
7235A04906l2572p338l2412o285R097P859m578j3430K5134J5032J7557j6954j0633
7222E5383J1763K1667J991j6065p602Q779m276K2385q16j6299J5786o836J2310
7209I8170J0018k5317n1397j3095J2703K9217K8794j4200j7781N059k872j8452
7197D0847P184J4868L062k1656j0723K6132N8857q101p8190R397O7393j1155j6800
7184H1115n5488o91J366N5615J000l4435K756J6840R942n882j229k7963J0874
7171E3820M4333J477L1284k511l5011n3774k6121K8843j1976J9592l807k2084
7159B4065P134K3763j6782M3090K058l4721K6502O089k2533l5034J4445K17j0485
7146B7808O636M586R947N478J0385L991l1477j2868K0814M4585K3488k3896n0747
$$ plain form
7133 38730 41741 60987 37656 46868 96697 106673 121791 134358 111005 63041 21177 -3429
7121 -3429 -12687 8845 71962 123351 128378 101583 102112 99038 59394 39020 35611 19133 3594
7108 3594 -19348 7292 41557 45104 49092 108345 143473 131933 91426 42040 42942 50037 88776
7095 88776 100643 104732 106337 61057 15578 10151 19361 31767 46303 40478 84795 120523 82444
7082 82444 26039 12412 52441 44676 22113 56408 59161 18945 49593 89427 114432 68409
7070 68409 41908 43738 45849 44306 22560 -21539 2790 32555 67261 90311 67823 6234
7058 6234 -1285 -8064 56720 74462 75660 74202 95514 104169 112458 111552 109955 133188 117514 92790
7044 92790 83870 94540 138484 137433 71629 71362 92685 77437 100383 100962 103230 82814 27252
$$ packed form
7133C8730L011J9246k3331R212M9829R976J5118J2567k3353m7964m1864k4606
7121c429r258K1532O3117N1389N027k6795N29l074l9644k0374l409j6478j5539
7108C594k2942K6640L4265L547L988N9253L5128j1540m0507m9386R02P095L8739
7095H8776J1867M089J605m5280m5479n427R210J2406J4536n825M4317L5728l8079
7082H2444n6405j3627M0029p765k2563L4295K753m0216L0648L9834K5005m6023
7070F8409k6501J830K111j543k1746m4099K4329K9765L4706K3050k2488o1589
7058F234p519o779O4784J7742J198j458K1312Q655Q289r06j597K3233j5674k4724
7044I2790q920J0670M3944j051o5804k67K1323j5248K2946N79K268k0416n5562
$$ plain form
7031 27252 2738 11622 49295 54825 44645 56228 78428 49200 38496 40534 35874 46247 46875
7018 46875 37390 12957 -4030 -207 6931 32754 4600 -5588 31249 63976 55850 54910 20220
7005 20220 -538 18879 37192 58516 89223 92610 66874 69916 51824 29720 -5105 -16128
6993 -16128 39881 69683 97877 98144 57340 74440 109631 121431 99868 20533 -32226 -30301
6981 -30301 -18622 -22224 31304 32060 15223 -9720 -29051 -2374 39263 52186 20733 -6499
6969 -6499 24668 35111 38855 60161 63089 46766 40839 39636 82042 105580 60615 49105 73791
6956 73791 73182 79800 99797 95305 85666 56041 1611 20755 50356 23822 48886 49060 23367
6943 23367 6908 12794 31128 17801 14007 31553 30507 20843 18229 28587 52593 53711 80471
$$ packed form
7031B7252k4514Q884L7673N530j0180J1583K2200k9228j0704K038m660J0373O28
7018D6875r485k4433j6987L823P138K5823k8154j0188L6837L2727q126r40l4690
7005B0220k0758J9417J8313K1324L0707L387k5736L042j8092k2104l4825j1023
6993a6128N6009K9802K8194K67m0804J7100L5191J1800k1563p9335n2759J925
6981c0301J1679l602N3528P56j6837k4943j9331K6677M1637J2923l1453k7232
6969f499L1167J0443L744K1306K928j6323n927j203M2406K3538m4965j1510K4686
6956G3791o09O618J9997m492r639k9625n4430J9144K9601k6534K5064J74k5693
6943B3367j6459N886J8334j3327l794J7546j046r664k614J0358K4006J118K6760
$$ plain form
6930 80471 57190 34605 42762 39170 -3182 -1770 49755 88654 116277 104711 80461 104416
6918 104416 114710 111586 88336 26433 9148 24171 50595 97449 91528 51762 42299 54579
6906 54579 59526 9385 10477 15852 -2534 9194 37443 48408 63986 51217 60861 101298 110602
6893 110602 85296 61320 27014 42787 88068 104192 60153 57006 54557 81789 105534 95489
6881 95489 68681 56432 57137 54440 65755 44473 14684 -597 10065 16316 11013 26930 19758
6868 19758 38046 71588 105122 102138 66181 29399 27196 37141 34990 34296 -763 -31077 -15142
6855 -15142 41824 78032 73136 48646 69214 97020 100423 66977 61520 62087 57243 19103 9799
6842 9799 45303 79074 74478 80163 56339 57850 75706 86052 79342 72357 63155 56025 49051 13749
$$ packed form
6930H0471k3281k2585Q157l592m2352J412N1525L8899K7623j1566k4250K3955
6918A04416J0294l124k3250o1903j7285J5023K6424M6854n921l9766r463J2280
6906E4579M947n0141J092N375j8386J1728K8249J0965J5578j2769R644M0437R304
6893A10602k5306k3976l4306J5773M5281J6124m4039l147k449K7232K3745j0045
6881I5489k6808j2249P05k697J1315k1282k9789j5281J0662O251n303J5917p172
6868A9758J8288L3542L3534k984l5957l6782k203R945k151o94l5059l0314J5935
6855a5142N6966L6208m896k4490K0568K7806L403l3446n457N67m844l8140r304
6842I799L5504L3771m596N685k3824J511J7856J0346o710o985r202p130o974l5302
$$ plain form
6828 13749 25315 43002 39545 22129 7831 6734 17895 30031 9401 22980 44995 51115
6816 51115 51087 50519 66921 67118 12021 -5539 21004 16147 -7344 3817 24953 93914 121680
6803 121680 98570 67880 77028 80094 66698 28199 -5790 -6545 -44529 -35479 -1417 12767 59473
6790 59473 96627 119589 128190 104699 87275 55439 35718 29300 40470 49496 12203 -7874
6778 -7874 -15767 -662 25885 57024 39502 17352 13598 23948 9750 16373 737 19585 36998
6765 36998 -5 19750 53041 75116 28864 45511 29031 17464 38796 12726 -3567 24426
6753 24426 16877 22744 51328 28691 36462 33751 3166 -13827 21052 46155 27302 19804 40638
6740 40638 48277 40133 7263 19375 40867 36860 40504 45660 27359 18968 20682 -26315 -38834
$$ packed form
6828A3749J1566J7687l457j7416j4298j097J1161J2136k0630J3579K2015O120
6816E1115k8n68J6402J97n5097j7560K6543m857k3491J1161K1136O8961K7766
6803A21680k3110l0690R148L066j3396l8499l3989p55l7984R050L4062J4184M6706
6790E9473L7154K2962Q601k3491j7424l1836j9721o418J1170R026l7293k0077
6778g874p893J5105K6547L1139j7522k2150l754J0350j4198O623j5636J8848J7413
6765C6998l7003J9755L3291K2075m6252J6647j6480j1567K1332k6070j6293K7993
6753B4426p549N867K8584k2637P771k711l0585j6993L4879K5103j8853p498K0834
6740D0638P639q144l2870J2112K1492m007L644N156j8301q391J714m6997j2519
$$ plain form
6727 -38834 -27200 -22443 -42747 -68 -3036 -29330 -10382 -5573 -872 34837 27574 27633 16738
6714 16738 17686 20906 9098 -863 37279 43203 10957 14819 40407 49538 73809 92069 56241
6701 56241 15925 29478 37547 22660 -1286 -9579 5802 33997 72193 66898 22492 39367
6689 39367 42469 42683 54374 31346 37096 27777 11216 1036 -14869 8977 45576 47710 51481
6676 51481 16871 34348 -5611 -11696 10663 -2685 1526 -28055 -48714 -29305 -30808 491
6664 491 15037 -6512 27819 53562 40959 35587 26433 -7981 -16486 -41297 -1361 31021 -19295
6651 -19295 -53842 -64050 -60766 -38781 -13102 -30222 -9556 44995 59960 74404 71703 78627
6639 78627 49437 26605 -44722 -82345 -56309 -38572 -36115 30063 60487 65048 76187 51534
$$ packed form
6727c8834J1634M757k0304M2679k968k6294J8948M809M701L5709p263N9j0895
6714A6738R48L220j1808r961L8142N924l2246L862K5588R131K4271J8260l5828
6701E6241m0316J3553Q069j4887k3946q293J5381K8195L8196n295m4406J6875
6689C9367L102K14J1691k3028N750r319j6561j0180j5905K3846L6599K134L771
6676E1481l4610J7477l9959o085K2359j3348M211k9581k0659J9409j503L1299
6664D91J4546k1549L4331K5743j2603n372r154l4414q505k4811L9936L2382n0316
6651a9295l4547j0208L284K1985K5679j7120K0666N4551J4965J4444k701O924
6639G8627k9190k2832p1327l7623K6036J7737K457O6178L0424M561J1139k4653
$$ plain form
6627 51534 42924 40534 27757 1439 -32797 -28072 -10131 24835 315 -3355 29710 55268 18864
6614 18864 26099 17743 -25855 -31305 5839 58053 38708 27491 15954 25944 35992 62950 54434
6601 54434 27385 11008 -51091 -46415 -14087 -26938 53533 89066 56282 38792 1759 -6149
6589 -6149 -2885 -1925 16694 41308 17358 -9756 -17568 -54261 -65374 -33480 -23758 -11073 4709
6576 4709 -15699 -10306 7802 21208 440 19415 37977 34717 31618 20280 19453 20509 -21808
6563 -21808 -58191 -71831 -69274 -2744 45609 36944 44328 27704 29611 5752 34560 48454 56080
6550 56080 7289 8253 17692 -16296 -23629 -19729 -22157 -7186 -10241 -23911 -3317 21276 9246
6537 9246 -12161 -41003 -1576 55205 22313 -17013 -21213 -15972 4935 33519 68784 35306
$$ packed form
6627E1534q610k390j2777k6318l4236M725J7941L4966k4520l670L3065K5558l6404
6614A8864P235q356m3598n450L7144N2214j9345j1217j1537R990J0048K6958q516
6601E4434k7049j6377o2099M676L2328j2851Q0471L5533l2784j7490l7033p908
6589f149L264R60J8619K4614k3950k7114p812l6693j1113L1894R722J2685J5782
6576D709k0408N393J8108J3406k0768J8975J8562l260l099j1338q27J056m2317
6563b1808l6383j3640K557O6530M8353q665P384j6624J907k3859K8808J3894P626
6550E6080m8791R64R439l3988p333L900k428J4971l055j3670K0594K4593j2030
6537I246k1407k8842L9427N6781l2892l9326m200N241K0907K8584L5265l3478
$$ plain form
6525 35306 18381 38154 63588 58179 23711 4168 8787 21088 23210 14887 -5363 -14956 -47028
6512 -47028 -34343 6361 6398 1411 -12133 247 10985 13262 -14087 -21658 -44612 -33660 -19878
6499 -19878 5908 -11211 -17232 -8635 -294 24919 13504 16331 29493 52925 65479 80884 89942
6486 89942 84657 52999 37257 34402 29656 10360 24759 40794 46228 22277 -9054 -22025 -11400
6473 -11400 -6795 -4337 -5317 -3097 -8641 -28227 -25559 -21495 -9443 -5248 21348 42413 35945 -2457
6459 -2457 656 27187 43529 38386 24539 11289 10589 56150 25916 4386 3939 26313 36315
6446 36315 4341 1891 5472 13522 18545 26750 8859 -4632 14205 58606 54192 14714 23037
6433 23037 21035 -10796 -21431 -16366 -28599 -16847 -3834 -19059 -21606 -10606 -15395 -22148 3633
$$ packed form
6525C5306j6925J9773K5434n409l4468j9543M619J2301K122q323k0250r593l2072
6512d7028J2685M0704L7m987j3544J2380J0738K277k7349p571k2954J0952J3782
6499a9878K5786j7119o021Q597Q341K5213j1415K827J3162K3432J2554J5405R058
6486H9942n285l1658j5742k855m746j9296J4399J6035N434k3951l1331j2971J0625
6473a1400M605K458r80K220n544j9586K668M064J2052M195K6596K1065o468l8402
6459b457L113K6531J6342n143j3847j3250p00M5561l0234k1530m47K2374J0002
6446C6315l1974k450L581Q050N023Q205j7891j3491J8837M4401m414l9478Q323
6433B3037k002l1831j0635N065j2233J1752J3013j5225k547J1000m789o753K5781
$$ plain form
6420 3633 45062 13301 -10020 -55552 -21001 3603 192 1158 -17749 -4622 34400 40205 29638
6407 29638 13120 30189 10845 -19625 -13740 36560 31968 13763 998 936 -8444 -18826 -10897
6394 -10897 14767 -31226 -60404 -62438 -67509 -47824 -38368 -22067 31184 44076 34244 43162 60517
6381 60517 51654 58347 68267 26531 -28818 -8244 4349 61666 102256 86537 58645 36264
6369 36264 54471 30374 423 -15659 -32686 -27776 -23114 -47843 -14686 -11416 -58711 -78319
6357 -78319 -38611 1952 21770 54447 39473 10491 18116 14924 26558 34232 51745 34569
6345 34569 -32752 -42472 -22394 -16162 -60858 -25263 32335 30117 17520 32949 58796 46664
6333 46664 64730 59498 18952 -6607 -16680 -35476 -21079 -2134 -2580 11785 23966 -9344
$$ packed form
6420C633M1429l1761k3321m5532L4551K4604l411R66j8907J3127L9022N805j0567
6407B9638j6518J7069j9344l0470N885N0300m592j8205j2765o2r380j0382P929
6394a0897K5664m5993k9178k034n071J9685R456J6301N3251J2892r832Q918J7355
6381F0517q863O693R920m1736n5349K0574J2593N7317M0590j5719k7892k2381
6369C6264J8207k4097k9951j6082j7027M910M662k4729L3157L270m7295j9608
6357g8319L9708M0563J9818L2677j4974k8982P625l192J1634P674J7513j7176
6345C4569o7321r720K0078O232m4696L5595N7598k218j2597J5429K5847j2132
6333D6664J8066n232m0546k5559j0073j8796J4397J8945m46J4365J2181l3310
$$ plain form
6321 -9344 -79801 -77662 -65251 -63921 -51165 -19106 -19769 -31126 -41368 -46465 -18580 13781 34422
6308 34422 21801 21502 24039 18887 46026 50840 44133 68377 90762 83994 79236 44729 16124
6295 16124 44709 59050 28191 16894 36910 26625 32940 51282 46268 40715 54797 100140
6283 100140 79403 68681 55375 16034 -6438 -27768 959 18907 18341 23163 33688 15628
6271 15628 3207 17025 7503 31122 50869 59351 -3027 -38899 8566 24013 31312 1970
6259 1970 -21913 -23670 -23757 -47444 -50571 16473 35226 26593 2638 -6247 6297 -15006 -36927
6246 -36927 -2064 21215 20935 14722 -20231 -12306 37671 63383 61398 31034 7337 -22024 -37353
6233 -37353 -35920 -16364 14101 30306 2330 -40053 -58650 -26239 44709 72821 85114 50123
$$ packed form
6321i344p0457K139J2411J330J2756L2059o63j1357j0242n097K7885L2361K0641
6308C4422j2621k99K537n152K7139M814o707K4244K2385o768m758l4507k8605
6295A6124K8585J4341l0859j1297K0016j0285O315J8342n014n553J4082M5343
6283A00140k0737j0722j3306l9341k2472k1330K8727J7948n66M822J0525j8060
6271A5628j2421J3818r522K3619J9747Q482o2378l5872M7465J5447P299k9342
6259A970k3883j757q7k3687l127O7044J8753q633k3955q885J2544k1303k1921
6246c6927L4863K3279k80o213l4953P925M9977K5712j985l0364k3697k9361j5329
6233c7353J433J9556L0465J6205k7976m2383j8597L2411P0948K8112J2293l4991
$$ plain form
6221 50123 24581 16498 9802 -23616 -39390 -4597 11624 -30107 -27952 -14240 -11172 -8341 3364
6208 3364 -4246 -24678 -25457 -13811 9250 26044 14483 6007 -21620 -50471 -46796 -71176 -62714
6195 -62714 -14804 -9228 -21722 -35405 -23000 -14571 -48196 -52764 -34109 -9907 -30601 -46310
6183 -46310 -52110 -5728 17204 32472 29537 28995 35822 34857 24161 19210 7498 16499 19461 32212
6169 32212 80719 85425 58870 36129 27349 16399 42827 57772 57407 45741 18912 -9890 -7065
6156 -7065 -25240 -62586 -71252 -35249 -20651 4134 -4657 -52813 -55279 -2530 11069 48551 51196
6143 51196 6168 -20175 -14989 -46145 -51652 -49269 -52028 -23397 1114 31481 46257 44791 41152
6130 41152 64662 66789 27801 -21249 -17081 -11909 -7888 6499 -28455 -14730 14925 29054 20360
$$ packed form
6221E0123k5542q083o696l3418j5774L4793J6221m1731K155J3712L068K831J1705
6208C364p610k0432p79J1646K3061J6794j1561q476k7627k8851L675k4380Q462
6195f2714M7910N576j2494j3683J2405Q429l3625m568J8655K4202k0694j5709
6183d6310n800M6382K2932J5268k935n42O827r65j0696m951j1712R001K962J2751
6169C2212M8507M706k6555k2741q780j0950K6428J4945l65j1666k6829k8802K825
6156g065j8175l7346q666L6003J4598K4785q791m8156k466N2749J3599L7482K645
6143E1196m5028k6343N186l1156n507K383k759K8631K4511L0367J4776j466l639
6130D1152K3510K127l8988m9050M168N172M021J4387l4954J3725K9655J4129q694
$$ plain form
6117 20360 -3957 -18209 27023 66299 54185 46962 45599 22286 -2241 -10352 16245 19944 205
6104 205 13604 49650 9756 -7760 6811 38373 45380 20655 51214 58534 59742 66040 31649
6091 31649 34177 7686 -16837 -37289 -42362 -19375 -729 -1405 -34252 -802 17681 -17778 -42162
6078 -42162 -18297 17089 51542 27305 -4289 -36659 -27721 -27787 -19404 -13585 -10086 5148 4653 25712
6064 25712 38668 13278 -25401 -5970 33143 41880 13148 2330 -14954 -26896 -3356 24380
6052 24380 41310 24732 18766 -15878 -49064 -19548 771 30301 31075 24228 15633 16327 -2399
6039 -2399 -6995 18294 62139 45963 12875 -21950 -39749 -43306 -13938 21098 18084 29529 46222
6026 46222 58045 28391 -11374 -25077 -15091 -6456 -28660 -1290 12143 -10298 3477 25786
$$ packed form
6117B0360k4317j4252M5232L9276j2114p223j363k3313k4527q111K6597L699j9739
6104B05J3399L6046l9894j7516J4571L1562P007k4725L0559P320J208O298l4391
6091C1649K528k6491k4523k0452n073K2987J8646o76l2847L3450J8483l5459k4384
6078d2162K3865L5386L4453k4237l1594l2370Q938o6Q383N819L499J5234m95K1059
6064B5712J2956k5390l8679J9431L9113Q737k8732j0818j7284j1942K3540K7736
6052B4380J6930j6578n966l4644l3186K9516K0319K9530P74o847q595O94j8726
6039b399m596K5289M3845j6176l3088l4825j7799l557K9368L5036l014J1445J6693
6026D6222J1823k9654l9765j3703R986Q635k2204K7370J3433k2441J3775K2309
$$ plain form
6014 25786 26055 12030 193 -42963 -82882 -54186 -33309 -47442 -44086 -33125 -34370 -35505 -38619
6001 -38619 -27561 -36442 -34849 -39934 -96953 -71123 -60300 -18898 -27299 -31896 -35358 -49900 -55188
5988 -55188 -34537 -11842 -13884 -1845 18989 13254 30651 15594 3422 9948 62151 84466
5976 84466 39513 -28548 -65195 -69237 -87901 -68819 -84084 -79252 -28592 10697 -3289 -7630
5964 -7630 2317 10147 2488 -19975 -20668 3106 31960 15389 -10884 9340 -7835 -17180 -13345
5951 -13345 -20653 -38761 -24191 -55303 -66918 -58867 -26618 -30307 8190 7619 6488 16381 4532
5938 4532 34236 20112 11833 -21542 -37618 -40942 -46386 -45065 -77971 -76900 -72552 -78321 -74417 -42995
5924 -42995 -38545 -2089 -5042 -35655 -40491 -93547 -96480 -58973 2068 16657 33022 9782 23811
$$ packed form
6014B5786K69j4025j1837m3156l9919K8696K0877j4133L356J0961j245j135l114
6001c8619J1058q881J593n085n7019K5830J0823M1402q401m597l462j4542n288
5988e5188K0651K2695k042J2039K0834n735J7397j5057j2172O526N2203K2315
5976H4466m4953o8061l6647m042j8664J9082j5265M832N0660L9289j3986m341
5964g630R947P830p659k2463o93K3774K8854j6571k6273K0224j7175r345L835
5951a3345p308j8108J4570l1112j1615Q051L2249l689L8497n71j131R893j1849
5938D532K9704j4124q279l3375j6076l324n444J321l2906J071M348n769L904L1422
5924d2995M450L6456k953l0613m836n3056k933L7507O1041J4589J6365k3240J4029
$$ plain form
5911 23811 63674 87586 28777 -36248 -34838 -14551 -12834 1456 -6150 -8721 -9361 -54897 -34821
5898 -34821 -20472 -27914 -28428 -25780 -38142 -57503 -51529 -5008 28551 23488 13457 -24955 -39448
5885 -39448 -63886 -59675 -43009 -10089 22308 19895 24903 18355 -4034 19606 16668 -44603 -47901
5872 -47901 -47548 -43003 18754 20978 18247 367 -3214 3774 1163 -41972 -38482 353 46608 35335
5858 35335 5200 10146 9286 -31104 -26673 -15458 34673 60006 17532 -13742 18226 68703 36253
5845 36253 -16442 -19152 -2049 29495 8234 22188 18594 -15624 -31919 -37632 -23987 -24091 -33514
5832 -33514 -27739 -49466 -84694 -78578 -77857 -13675 28420 74714 81854 43042 42299 38985 34767 50872
5818 50872 72394 36369 13480 17574 8758 -4874 37687 16422 28811 69658 -2005 -48419
$$ packed form
5911B3811L9863K3912n8809o5025J410K0287J717J4290p606k571o40m5536K0076
5898c4821J4349p442n14K648j2362j9361N974M6521L3559n063j0031l8412j4493
5885c9448k4438M211J6666L2920L2397k413N008o548k2389K3640k938o1271l298
5872d7901L53M545O1757K224k731j7880l581O988k611m3135L490L8835M6255j1273
5858C5335l0135M946q60m0390M431J1215N0131K5333m2474l1274L1968N0477l2450
5845C6253n2695k710J7103L1544k1261J3954l594l4218j6295n713J3645j04r423
5832c3514N775k1727l5228O116P21O4182M2095M6294P140l8812p43l314m218J6105
5818E0872K1522l6025k2889M094q816j3632M2561k1265J2389M0847p1663m6414
$$ plain form
5806 -48419 -12344 14811 -9001 -13837 -6914 34420 65068 39356 6769 14020 62832 52098
5794 52098 26705 -5715 -11287 -14904 -34113 -58851 -31087 -9813 13765 2982 -28893 -32969
5782 -32969 -9168 25118 34672 22612 -11194 -31875 -44318 -37691 -34584 2372 63498 46144
5770 46144 34845 15071 727 3848 -28840 -73213 -102188 -81404 -36311 -44121 -54546 -38859
5758 -38859 -25553 10258 -8330 17739 16444 19414 31390 52051 26899 1093 26316 25471 23732
5745 23732 53653 32364 -11914 -5250 5834 25173 54579 61423 37074 8278 -23974 -7508
5733 -7508 8156 13366 -15004 -40360 -19139 12363 13566 -9041 -12320 -46066 -18459 -23457 -28164
5720 -28164 4507 48874 48088 52450 72458 48931 -8018 -13901 11325 3827 12555 29899 60625
$$ packed form
5806d8419L6075K7155k3812m836O923M1334L0648k5712l2587P251M8812j0734
5794E2098k5393l2420n572l617j9209k4738K7764K1274K3578j0783l1875m076
5782c2969K3801L4286R554j2060l3806k0681j2443O627L107L6956O1126j7354
5770D6144j1299j9774j4344L121l2688m4373k8975K0784M5093p810j0425J5687
5758c8859J3306L5811j8588K6069j295K970J1976K0661k5152k5806K5223q45j739
5745B3732K9921k1289m4278O664J1084J9339K9406O844k4349k8796l2252J6466
5733g508J5664N210k8370k5356K1221L1502J203k2607l279l3746K7607m998m707
5720b8164L2671M4367p86M362K0008k3527n6949n883K5226p498Q728J7344L0726
$$ plain form
5707 60625 74233 66716 40945 62145 29153 -20945 -30936 -11634 -23311 -34181 -32548 -32641 -59634
5694 -59634 -21675 49276 58178 47054 27356 -4150 -9908 405 -11685 -18614 24771 -4034
5682 -4034 -46178 -11133 -2420 -1820 -11485 12853 19409 42705 14139 -26467 -39092 416 5251
5669 5251 29452 -4747 -25341 -9508 -941 -2576 -6990 -28210 -19831 -31845 -27187 -19927 -10385
5656 -10385 -3822 -19607 -23680 -6620 -23776 -52958 -47908 -37961 15842 58767 46464 11445 31783
5643 31783 41672 17060 20163 -29 -14178 -18681 -19489 -23536 -26906 -19296 -29686 -52114 -60122 -30775
5629 -30775 -29527 -25506 -10283 -6457 -4945 -11440 -8125 39922 68242 49808 10671 11633 7970 -7901
5615 -7901 -9806 38330 13850 -44675 -43480 -4003 10284 -24288 -46540 -23785 -14366 14777 29865
$$ packed form
5707F0625J3608p517k5771K1200l2992n0098r991J9302j1677j0870J633r3k6993
5694e9634L7959P0951Q902j1124j9698l1506n758J0313j2090o929M3385k8805
5682d034m2144L5045Q713O00r665K4338O556K3296k8566m0606j2625L9508M835
5669E251K4201l4199k0594J5833Q567j635m414k1220Q379j2014M658P260R542
5656a0385O563j5785m073J7060j7156k9182N050R947N3803M2925j2303l5019K0338
5643C1783R889k4612L103k0192j4149m503q08m047l370P610j0390k2428q008K9347
5629c0775J248M021J5223L826J512o495L315M8047K8320j8434l9137R62l663j5871
5615g901j905M8136k4480n8525J195L9477J4287l4572k2252K2755R419K9143J5088
$$ plain form
5602 29865 -23022 -38622 -2335 -17678 5783 1534 -27151 -37709 -15319 18098 3786 -11662
5590 -11662 -2279 -2896 -50236 -52355 -46751 -47115 -54338 -62255 -53022 -44119 -44361 -48898 -42574 -58104 -38086
5575 -38086 959 31732 48798 73894 69550 7012 -1016 13083 -17405 -15381 -22841 -5836 40218
5562 40218 40681 9703 12726 36788 7725 -21666 -50624 -33475 -28310 -25240 2590 40429 13844
5549 13844 17688 14763 -16702 5909 -36373 -35247 -10849 -21925 8064 25740 34369 -3058 -48195
5536 -48195 -30301 -29704 -34474 -21149 5604 2349 -2166 15671 22940 57329 68352 72152 70854
5523 70854 63782 48905 6869 -10004 18516 33961 30056 16828 11451 6749 -17508 8478 49408
5510 49408 74321 37040 69796 112791 105996 91874 87274 63341 35201 23266 1087 -17183
$$ packed form
5602B9865n2887j5600L6287j5343K3461m249k8685j0558K2390L3417j4312j5448
5590a1662R383o17m7340k119N604l64p223p917R233Q903k42m537O324j5530K0018
5575c8086L9045L0773J7066K5096m344o2538q028J4099l0488K024p460J7005M6054
5562D0218M63l0978L023K4062k9063k9391k8958J7149N165L070K7830L7839k6585
5549A3844L844k925l1465K2611m2282J126K4398j1076K9989J7676Q629l7427m5137
5536d8195J7894N97m770J3325K6753l255m515J7837P269L4389J1023L800j298
5523G0854p072j4877m2036j6873K8520J5445l905j3228n377m702k4257K5986M0930
5510D9408K4913l7281L2756M2995o795j4122m600k3933k8140j1935k2179j8270
$$ plain form
5498 -17183 10173 32879 -17618 -30899 -40807 -47637 -61936 -47426 6105 784 -18772 -32521
5486 -32521 -40855 -9948 10452 -11606 3302 19754 20896 17837 -27777 -40479 -49476 -59353 -51749
5473 -51749 -30741 -31593 -73798 -33456 -19006 5972 18814 8157 -1205 -825 6351 -13709 -18103
5460 -18103 8714 35672 60069 37113 42667 61920 52723 40108 -8066 -40608 -2681 29204
5448 29204 45140 63868 16394 4205 49102 51299 34785 18409 41815 27938 33354 15458
5436 15458 -7087 -16482 -16844 3656 -15471 -48501 -59662 -33545 14638 15147 30147 24354 5661
5423 5661 -4795 14625 35371 17268 -16578 -25107 -33491 26409 17808 22130 35667 6401 35712
5410 35712 62429 27857 -2989 -6766 882 -26308 -23779 733 -10576 -52684 -30784 -5536
$$ packed form
5498a7183K7356K2706n0497j3281r908o830j4299J4510N3531n321j9556j3749
5486c2521q334L0907K0400k2058J4908J6452J142l059m5614j2702q997r877P604
5473e1749K1008q52m2205M0342J4450K4978J2842j0657r362L80P176k0060m394
5460a8103K6817K6958K4397k2956N554J9253r197j2615m8174l2542L7927L1885
5448B9204J5936J8728m7474j2189M4897K197j6514j6376K3406j3877N416j7896
5436A5458k2545r395l62K0500j9127l3030j1161K6117M8183N09J5000n793j8693
5423E661j0456J9420K0746j8103l3846q529q384N9900q601M322J3537k9266K9311
5410C5712K6717l4572l0846l777P648k7190K529K4512j1309m2108K1900K5248
$$ plain form
5398 -5536 17058 17513 -8217 -14586 -17010 -11165 -19408 -22504 -24496 -827 32345 33639 18958 301
5384 301 -2793 -3527 -20481 -27873 -9274 -18408 -3464 29081 41997 3646 10318 -7140 -3063 -17652
5370 -17652 -5030 43822 84557 69140 15772 17943 9743 -26921 -39091 -38856 -47796 -48930 5238
5357 5238 17080 19214 30686 647 -4585 -15691 -15375 -20213 -6306 35853 17382 21412 20016
5344 20016 25316 23213 -3730 -34036 -84406 -80489 -27647 3589 16697 12987 556 -2843 10366
5331 10366 -1750 34490 36644 9973 12742 4259 -25436 -13093 7375 -22268 -59244 -60053 -34126
5318 -34126 787 2208 -4578 -26410 -9895 -42686 -46732 -31469 -27317 -35112 -33298 -22708 -9987
5305 -9987 -29798 -28782 -44996 -24597 25595 83186 70598 4299 -13734 -15990 3159 41102
$$ packed form
5398e536K2594M55k5730o369k424N845q243l096j992K3669L3172J294j4681j8657
5384C01l094p34j6954p392J8599r134J4944L2545J2916l8351O672j7458M077j4589
5370a7652J2622M8852M0735j5417n3368K171q200l6664j2170K35q940j134N4168
5357E238J1842K134J1472l0039n232j1106L16m838J3907M2159j8471M030j396
5344B0016N300k103k6943l0306n0370L917N2842L1236J3108l710j2431l399J3209
5331A0366j2116L6240K154k6671K769q483k9695J2343K0468k9643l6976q09K5927
5318c4126L4913J421o786k1832J6515l2791m046J5263M152p795J814J0590J2721
5305i987j9811J016j6214K0399N0192N7591j2588o6299j8033k256J9149L7943
$$ plain form
5293 41102 24645 22372 6958 -16405 -26502 -4446 2178 13150 4492 -21801 -14340 -17577 -44670
5280 -44670 -38699 11035 49259 51053 28452 25117 35733 24001 -11017 -15155 -20275 -29147 -83223
5267 -83223 -93765 -78142 -49845 -21531 -33228 -42085 -6354 11852 -10609 -33154 -41469 -40268
5255 -40268 -45135 -51486 -38580 -41485 -34800 -27071 -29095 -3399 11034 698 -47073 -40642 -26477
5242 -26477 -9601 -9023 20066 12381 -4773 -9360 -36304 -56256 -18067 24868 26495 33252 28483
5229 28483 -8161 -53089 -84839 -78739 -60172 -62460 -42777 -18617 -17264 -45471 -55126 -40911 -46696
5216 -46696 -25220 -50573 -43587 -26869 -54215 -85855 -89227 -77033 -34153 -54340 -23107 -20082
5204 -20082 -12098 -21166 -1802 14290 -3094 2859 -3865 -34366 -62295 -74256 -68554 -61306 -47085
$$ packed form
5293D1102j6457k273j5414k3363j0097K2056O624J0972q658k6293P461l237k7093
5280d4670N971M9734L8224J794k2601l335J0616j1732l5018m138n120q872n4076
5267h3223j0542J5623K8297K8314j1697q857L5731J8206k2461k2545q315J201
5255d0268m867o351J2906k905O685P729k024K5696J4433j0336m7771O431J4165
5242b6477J6876N78K9089p685j7154m587k6944j9952L8189M2935J627O757m769
5229B8483l6644m4928l1750O100J8567k288J9683K4160J353k8207r655J4215n785
5216d6696K1476k5353O986J6718k7346l1640l372J2194M2880k0187L1233L025
5204b0082P984r068J9364J6092j7384N953o724l0501k7929j1961N702P248J4221
$$ plain form
5191 -47085 -21188 -15482 -45595 -47068 -65880 -31971 -14588 -20601 -21133 -7493 -6369 16265 21305
5178 21305 2815 17363 5885 21742 25194 -24465 -74470 -59374 -86651 -83176 -45222 -12399
5166 -12399 21541 4588 -31553 -5289 4166 -6357 -26286 -8993 -14012 -31515 -32714 -9151
5154 -9151 -27513 -76038 -95272 -57235 -41429 -31380 -12182 6363 -11053 -2066 2510 28515
5142 28515 24380 -7173 -9561 2666 17390 -4605 -28931 -12128 9610 27120 3379 32396
5130 32396 63094 44478 44501 34120 21487 -1027 -3896 -30917 -15592 6158 43227 75708 50617
5117 50617 19934 -4476 -4325 -40784 -50013 -45284 -10774 56863 84317 95890 42037 -2965 20471
5104 20471 37249 13827 -12055 -13374 1410 16280 14300 11266 5457 -23491 -29002 -10405 -1990
$$ packed form
5191d7085K5897N706l0113j473j8812L3909J7383o013n32J3640J124K2634N040
5178B1305j8490J4548j1478J5857L452m9659n0005J5096k7277L475L7954L2823
5166a2399L3940j6953l6141K6264R455j0523j9929J7293n019j7503j199K3563
5154i151j8362m8525j9234L8037J5806J0049J9198J8545j7416Q987M576K6005
5142B8515m135l1553k388J2227J4724k1995k4326J6803K1738J7510k3741K9017
5130C2396L0698j8616K3j0381j2633k2514k869k7021J5325K1750L7069L2481k5091
5117E0617l0683k4410J51l6459r229M729L4510O7637K7454J1573n3853m5002K3436
5104B0471J6778k3422k5882j319J4784J4870j980l034n809k8948n511J8597Q415
$$ plain form
5091 -1990 4718 -12930 -3653 -1641 -13424 -36583 -9386 -18499 -27370 -36114 -23579 -37847 -21094
5078 -21094 -8483 39717 32313 -8812 -26667 14974 48054 38892 35876 34802 14353 -1844 23905
5065 23905 18172 19429 -3209 6889 -4141 6811 -40286 -46104 -30677 -33257 -14673 9084 246
5052 246 -12959 -34454 -85691 -76989 -45131 -59735 -65023 -58654 -57431 -87528 -75780 -48926 -30906
5039 -30906 4057 18617 28328 26836 53992 30247 15671 34198 34346 -12410 -40859 -41100 -20593
5026 -20593 -6386 -17706 -18003 -28793 -11070 33179 1833 -25470 8135 528 -8029 -22857 530
5013 530 -9740 -28655 4236 41647 18561 7230 15060 47308 18467 -2877 -27018 -32444 -10117
5000 -10117 2475 -12198 6872 -6410 -12727 27580 44590 33889 38873 21163 -24045 -52554
$$ packed form
5091a990O708j7648R277K012j1783k3159K7197r113q871q744J2535j4268J6753
5078b1094J2611M8200p404m1125j7855M1641L3080r162l016j074k0449j6197K5749
5065B3905n733J257k2638J0098j1030J0952m7097n818J5427k580J8584K3757q838
5052B46j3205k1495n1237Q702L1858j4604n288O369J223l0097J1748K6854J8020
5039c0906L4963J4560R711j492K7156k3745j4576J8527J48m6756k8449k41K0507
5026b0593J4207j1320k97j0790J7723M4249l1346k7303L3605p607q557j4828K3387
5013E30j0270j8915L2891L7411k3086j1331P830L2248k8841k1344k4141n426K2327
5000a0117J2592j4673J9070j3282o317M0307J7010j0701M984j7710m5208k8509
$$ plain form
4988 -52554 -69804 -90671 -83166 -91007 -36288 -18086 -4054 -3183 -5586 -43746 -44146 -6857 -18362
4975 -18362 -37861 -35486 -36157 -20485 10470 -19624 -62292 -73683 -76130 -42320 -13988 18156 4937
4962 4937 13852 24029 29720 39458 25753 -9246 -18072 20303 36084 38134 55210 37743 22928
4949 22928 18544 37827 28227 -13371 -5158 27299 -1312 -3317 28308 48248 43611 23493 9613
$$ packed form
4988e2554j7250k0867P505p841N4719J8202J4032Q71k403l8160m00L7289j1505
4975a8362j9499K375o71J5672L0955l0094m2668j1391k447L3810K8332L2144j3219
4962D937Q915J0177N691R738j3705l4999q826L8375J5781K050J7076j7467j4815
4949B2928m384J9283r600m1598Q213L2457k8611k005L1625J9940m637k0118j3880
$$ [...]
##END NTUPLES=NMR SPECTRUM
##END=
