##TITLE=Analysis number 330176
Compound Code cc 61902
Project Code adrs
Chemist Name endeavour
##JCAMPDX= 6.0         $$ Bruker NMR JCAMP-DX V2.0
##DATA TYPE= NMR SPECTRUM
##DATA CLASS= NTUPLES
##ORIGIN= Bruker BioSpin GmbH
##OWNER= nmr
$$ XWIN-NMR		Version 3.5
$$ Fri Nov  2 11:02:57 2007 GMT Standard Time (UT+0h)  MAYBRIDGE\nmr@NMR_250MHZ
##.OBSERVE FREQUENCY= 250.131544655141
##.OBSERVE NUCLEUS= ^1H
##.ACQUISITION MODE= SIMULTANEOUS (DQD)
##.ACQUISITION SCHEME= undefined
##.AVERAGES= 16
##.DIGITISER RES= 18
##SPECTROMETER/DATA SYSTEM= dpx250
##.PULSE SEQUENCE= zg30
##.SOLVENT NAME= CDCl3
##.SHIFT REFERENCE= (INTERNAL, CDCl3, 0, 16.522)
##AUDIT TRAIL= $$ (NUMBER, WHEN, WHO, WHERE, WHAT)
$$ ##TITLE= Audit trail, XWIN-NMR		Version 3.5
$$ ##JCAMPDX= 5.01
$$ ##ORIGIN= Bruker BioSpin GmbH
$$ ##OWNER= nmr
$$ C:\u/data/dgb/nmr/ADRS/160/pdata/1/auditp.txt
$$ ##AUDIT TRAIL=  $$ (NUMBER, WHEN, WHO, WHERE, WHAT)
(   1,<2007-11-02 11:02:27.67 +000>,<MAYBRIDGE\nmr>,<NMR_250MHZ>,
      <created by zg, POWCHK disabled, PULCHK disabled
       configuration hash MD5:
       76 6E 9A 78 1E 09 19 81 EC 84 63 8F B0 6A 59 2D
       data hash MD5: 64K
       56 97 9A A6 4C 8B C3 FF 4B 1D BF B6 AC 5A 36 7C>)
(   2,<2007-11-02 11:02:44.53 +000>,<MAYBRIDGE\nmr>,<NMR_250MHZ>,
      <Start of raw data processing
       ef LB = 0.3 FT_mod = 6 PKNL = 1 SI = 32K 
       data hash MD5: 32K
       46 1D 72 3F A4 B0 21 7E DF A6 CA C6 5D 2B 0F 76>)
(   3,<2007-11-02 11:02:46.36 +000>,<MAYBRIDGE\nmr>,<NMR_250MHZ>,
      <apk 
       data hash MD5: 32K
       43 CF AB 36 A1 F5 CD E1 B9 5B 4E 97 5D 3A 1A 99>)
(   4,<2007-11-02 11:02:47.09 +000>,<MAYBRIDGE\nmr>,<NMR_250MHZ>,
      <abs ABSG = 5 
       data hash MD5: 32K
       5D 60 B0 C7 C3 58 92 5D 3F 63 82 26 FC 6A 83 50>)
$$ ##END=
$$ 
$$ hash MD5
$$ 8A B0 AC 9F E8 7B AD 58 D8 6A 59 E2 18 51 6B 73
##$RELAX= 
##$RELAX= 
##$RELAX= 
##$RELAX= 
##$RELAX= 
##$RELAX= 
##$RELAX= 
$$ Bruker specific parameters
$$ --------------------------
##$DU= <C:\u>
##$EXPNO= 160
##$NAME= <ADRS>
##$PROCNO= 1
##$TYPE= <nmr>
##$USER= <dgb>
##$AMP= (0..31)
100 100 100 100 100 100 100 100 100 100 100 100 100 100 100 100 100 100 
100 100 100 100 100 100 100 100 100 100 100 100 100 100 
##$AQSEQ= 0
##$AQ_mod= 3
##$AUNM= <au_zg>
##$AUTOPOS= <5 >
##$BF1= 250.13
##$BF2= 250.13
##$BF3= 250.13
##$BF4= 250.13
##$BF5= 500.13
##$BF6= 500.13
##$BF7= 500.13
##$BF8= 500.13
##$BYTORDA= 1
##$CFDGTYP= 0
##$CFRGTYP= 5
##$CHEMSTR= <none>
##$CNST= (0..31)
1 1 145 1 1 1 1 1 1 1 1 1 1 1 1 1 1 1 1 1 1 1 1 1 1 1 1 1 1 1 1 1 
##$CPDPRG= <>
##$CPDPRG1= <>
##$CPDPRG2= <>
##$CPDPRG3= <>
##$CPDPRG4= <mlev>
##$CPDPRG5= <mlev>
##$CPDPRG6= <mlev>
##$CPDPRG7= <mlev>
##$CPDPRG8= <mlev>
##$CPDPRGB= <>
##$CPDPRGT= <>
##$D= (0..31)
0 1 0 0 0 0 0 0 0 0.06 0 0 0 0 0 0 0.0002 0 0 0 0 0 0 0 0 0 0 0 0 0 0 
0 
##$DATE= 1194001346
##$DBL= (0..7)
120 120 120 120 120 120 120 120 
##$DBP= (0..7)
150 150 150 150 150 150 150 150 
##$DBP07= 0
##$DBPNAM0= <>
##$DBPNAM1= <>
##$DBPNAM2= <>
$$ [...]
##$SUBNAM7= <"">
##$SUBNAM8= <"">
##$SUBNAM9= <"">
##$SW= 20.6930455092707
##$SWIBOX= (0..15)
0 0 3 0 0 0 0 0 0 0 0 0 0 0 0 0 
##$SW_h= 5175.983436853
##$TD= 65536
##$TD0= 1
##$TE= 296.16
##$TE2= 300
##$TE3= 300
##$TEG= 300
##$TL= (0..7)
0 120 120 120 120 120 120 120 
##$TP= (0..7)
150 150 150 150 150 150 150 150 
##$TP07= 0
##$TPNAME0= <>
##$TPNAME1= <>
##$TPNAME2= <>
##$TPNAME3= <>
##$TPNAME4= <>
##$TPNAME5= <>
##$TPNAME6= <>
##$TPNAME7= <>
##$TPOAL= (0..7)
0.5 0.5 0.5 0.5 0.5 0.5 0.5 0.5 
##$TPOFFS= (0..7)
0 0 0 0 0 0 0 0 
##$TUNHIN= 0
##$TUNHOUT= 0
##$TUNXOUT= 0
##$USERA1= <user>
##$USERA2= <user>
##$USERA3= <user>
##$USERA4= <user>
##$USERA5= <user>
##$V9= 5
##$VALIST= <valist>
##$VCLIST= <CCCCCCCCCCCCCCC>
##$VD= 0
##$VDLIST= <DDDDDDDDDDDDDDD>
##$VPLIST= <PPPPPPPPPPPPPPP>
##$VTLIST= <TTTTTTTTTTTTTTT>
##$WBST= 1024
##$WBSW= 4
##$XGAIN= (0..3)
0 0 0 0 
##$XL= 0
##$YL= 0
##$YMAX_a= 511465
##$YMIN_a= -509764
##$ZGOPTNS= <>
##$ZL1= 120
##$ZL2= 120
##$ZL3= 120
##$ZL4= 120
##$ABSF1= 16.522
##$ABSF2= -4.171173
##$ABSG= 5
##$ABSL= 3
##$ALPHA= 0
##$AQORDER= 0
##$ASSFAC= 0
##$ASSFACI= 0
##$ASSFACX= 0
##$ASSWID= 0
##$AUNMP= <proc_1d>
##$AZFE= 0.1
##$AZFW= 0.1
##$BCFW= 0
##$BC_mod= 0
##$BYTORDP= 0
##$COROFFS= 0
##$CY= 12.5
##$DATMOD= 1
##$DC= 0
##$DFILT= <>
##$DTYPP= 0
##$F1P= 14.0000005364418
##$F2P= -0.99999901652339
##$FCOR= 0.5
##$FTSIZE= 32768
##$FT_mod= 6
##$GAMMA= 0
##$GB= 0
##$INTBC= 1
##$INTSCL= 1
##$ISEN= 128
##$LB= 0.3
##$LEV0= 0
##$LPBIN= 0
##$MAXI= 10000
##$MC2= 0
##$MEAN= 0
##$ME_mod= 0
##$MI= 0
##$NCOEF= 0
##$NC_proc= -5
##$NLEV= 6
##$NOISF1= 0
##$NOISF2= 0
##$NSP= 0
##$NTH_PI= 0
##$NZP= 0
##$OFFSET= 16.522
##$PC= 1
##$PHC0= 10.15447
##$PHC1= -2.665517
##$PH_mod= 1
##$PKNL= yes
##$PPARMOD= 0
##$PSCAL= 4
##$PSIGN= 0
##$REVERSE= no
##$SF= 250.13
##$SI= 32768
##$SIGF1= 0
##$SIGF2= 0
##$SINO= 400
##$SIOLD= 32768
##$SREGLST= <1H.CDCl3>
##$SSB= 0
##$STSI= 32768
##$STSR= 0
##$SW_p= 5175.98343685301
##$SYMM= 0
##$S_DEV= 0
##$TDeff= 65536
##$TDoff= 0
##$TI= <Analysis number 999999
Compound Code 99
Book Reference 9
Project Code 9>
##$TILT= no
##$TM1= 0
##$TM2= 0
##$TOPLEV= 0
##$USERP1= <user>
##$USERP2= <user>
##$USERP3= <user>
##$USERP4= <user>
##$USERP5= <user>
##$WDW= 1
##$XDIM= 32768
##$YMAX_p= 453477742
##$YMIN_p= -107497
$$ End of Bruker specific parameters
$$ ---------------------------------
##NTUPLES= NMR SPECTRUM
##VAR_NAME=  FREQUENCY,     SPECTRUM/REAL,   SPECTRUM/IMAG
##SYMBOL=    X,             R,               I
##VAR_TYPE=  INDEPENDENT,   DEPENDENT,       DEPENDENT
##VAR_FORM=  AFFN,          ASDF,            ASDF
##VAR_DIM=   32768,         32768,           32768
##UNITS=     HZ,            ARBITRARY UNITS, ARBITRARY UNITS
##FACTOR=    0.157963299565203, 1,           1
##FIRST=     4132.6476996994, 0,             0
##LAST=      -1043.33573715361, 0,           0
##MIN=       -1043.33573715361, -107497,     0
##MAX=       4132.6476996994, 453477742,     0
$$ Real data points
##PAGE= N=1
##DATA TABLE= (X++(R..R)), XYDATA
$$ [...]
16760C924k3206j3601J2445J0336K484j303O73N071J968j5322l3311O376L2629
$$ 3924 -19282 -32883 -20438 -10102 -7618 -8921 -8248 -3177 -1209 -16531 -49842 -43466 -10837
16747a0837M4204j8598l0211j7701L767L8168r889k8306L5454R063l4793l037
$$ -10837 33367 14769 -15442 -33143 -29376 8792 -1097 -29403 6051 15114 -19679 -22716
16735b2716r02N801N77J8606R497j7390j5087K7540k7012q751J8848J2833K5459
$$ -22716 -23618 -17817 -17240 1366 10863 -6527 -21614 5926 -21086 -29837 -10989 1844 27303
16722B7303N628Q862k3570k6043r018M505m715k777n987J3450J5913J9027q050
$$ 27303 32931 41793 18223 -7820 -16838 -12333 -17048 -19825 -25812 -12362 3551 22578 14528
16709A4528r42J3481O837N294l7313P486J9598K938j1434Q140K7095J9182j3555
$$ 14528 13586 27067 33904 39198 1885 9371 28969 31907 20473 28613 55708 74890 61335
16696F1335j8815n114j5327l611K1090J1755k8284o166j1222k6489J224L075o038
$$ 61335 42520 37406 22079 18468 39558 51313 23029 16863 5641 -20848 -19624 -16549 -22587
16683b2587o993Q115P754M0258K8994j9769l7573m718J8870J5987K8490R741m2969
$$ -22587 -29580 -21465 -13711 26547 55541 35772 -1801 -6519 12351 28338 56828 66569 23600
16670B3600o8694j1051J1599J5814P588J4962J1939j189k1229r581j1020J1830
$$ 23600 -45094 -56145 -44546 -28732 -21144 -6182 5757 4568 -16661 -26242 -37262 -25432
16658b5432j1882l785o406j4873n107J0927J3044J3069M3800O540k0626k5673
$$ -25432 -37314 -41099 -47505 -62378 -67485 -56558 -43514 -30445 13355 19895 -731 -26404
16646b6404M358L2876k419o36Q902L552L401k1882Q102O498J2096l870j624k93
$$ -26404 -22046 10830 8411 7775 16677 20229 23630 1748 9850 16348 28444 24574 22950 22657
16632B2657k071M667J29m54k9828P002K0881k1255j4879J0552j8800J5129J6187
$$ 22657 20586 25253 25382 24928 -4900 2102 22983 1728 -13151 -2599 -21399 -6270 9917
16619I917O671q224n40K70O141J5973r225j2580k3203k9113m565L7432L4773J4503
$$ 9917 16588 8364 7824 8094 14235 30208 20983 8403 -14800 -43913 -48478 -11046 23727 38230
16605C8230q676j1573o127k6594r745M218J1320L237J0283J8632j6274J1199L237
$$ 38230 29554 17981 11854 -14740 -24485 -20267 -8947 -5710 4573 23205 6931 18130 21367
16592B1367k1516k7299q03m822q950P780J9574Q814J1453p223m482K276j1010
$$ 21367 -149 -27448 -28251 -33073 -42023 -34243 -14669 -5855 5598 -1625 -6107 -3831 -14841
16579a4841k6178j9471K3539K2151j519q708J0486M2742R337l958m7166j9137
$$ -14841 -41019 -60490 -36951 -14800 -16319 -25027 -14541 28201 37538 33580 -13586 -32723
16567c2723N265j348L0924L6397k8755K472J6003p490k4529l2160Q365K6253K953
$$ -32723 -27458 -28806 2118 38515 9760 12232 28235 20745 -3784 -35944 -27579 -1326 1627
16554A627l2312M175M4190K4991j6855j6088O901j434j5438l4775l1860O560J8068
$$ 1627 -30685 -26510 17680 42671 25816 9728 16629 15195 -243 -35018 -66878 -60318 -42250
16541d2250J3320K1518J5958r153o818m734k2574n522P437j1141K4272L0258N601
$$ -42250 -28930 -7412 8546 -607 -7425 -12159 -34733 -40255 -32818 -43959 -19687 10571 16172
16528A6172j1458j9721k1263J2410J9376K198n341J9299J7928j2339P785j0544
$$ 16172 4714 -15007 -36270 -23860 -4484 -2286 -7627 11672 29600 17261 25046 14502
16516A4502j4331k3901J4001J3268j7726J694K8131J5071k2759N420l4980j3172
$$ 14502 171 -23730 -9729 3539 -14187 -12493 15638 30709 7950 13370 -21610 -34782
16504c4782J3122J1410K7938j1416j4482J3814M139J0901j7767l736K127k587
$$ -34782 -21660 -10250 17688 6272 -8210 5604 9743 20644 2877 -859 1268 -1319
16492a319J3820J942l2687r330J7758o610Q564n898m65J2613K4878j9315j5199
$$ -1319 12501 14443 -18244 -27574 -9816 -16426 -7862 -13760 -14225 -1612 23266 3951 -11248
16479a1248R447L307n731J813p601q156N70L8019n684p168K2242N4349K037k6885
$$ -11248 -1801 1506 -4225 -2412 -10013 -18169 -17599 20420 14736 7568 29810 84159 86196 59311
16465E9311l8647k1657O866p736j9489j0810K182n928r26J9000m03r924J944n358
$$ 59311 20664 -993 5873 -1863 -21352 -32162 -29980 -35908 -36834 -17834 -18237 -28161 -26217 -31575
16451c1575N777K0023n646j5195L659K5749j2534k8233n185K7732K3198J0936
$$ -31575 -25798 -5775 -11421 -26616 -22957 2792 -9742 -37975 -43160 -15428 7770 18706
16439A8706j1907k0423O142P498K4876j3199q488L162N619K0384p562n157k2620
$$ 18706 6799 -13624 -7482 16 24892 11693 3205 6367 11986 32370 24808 19651 -2969
16426b969q051j3599J6830J8216O294O583K536k2639l495O065j8125j5286J4925
$$ -2969 -11020 -24619 -7789 10427 16721 23304 25840 3201 -294 5771 -12354 -27640 -12715
16413a2715K5033k010k1778j0781j0924k6285j4434J4481L0369M98J3105K2279
$$ -12715 12318 10308 -11470 -22251 -33175 -59460 -73894 -59413 -29044 -28546 -15441 6838
16401F838l207j610O983k1147k1531j2982q636p576J7696K6254P237l0923l1747
$$ 6838 3631 2021 9004 -12143 -33674 -46656 -55292 -62868 -45172 -18918 -11681 -42604 -74351
16388g4351J7222N247M191P594J8144K904k2537M126J0511k0642q967K0669L04
$$ -74351 -57129 -51882 -47691 -40097 -21953 -19049 -41586 -37460 -26949 -47591 -56558 -35889 -35585
16375c5585J236L0048J3190K4006j0228k7631k6261J3963o03M062K0064q674j693
$$ -35585 -34349 -4301 8889 32895 22667 -4964 -31225 -17262 -17865 -13803 6261 -2413 -4106
16362d106k5204K334J9084L421O22K726q267j2640l79m654j1656L3485R842j1399
$$ -4106 -29310 -26976 -7892 -4471 -3849 -1123 -9390 -22030 -22409 -27063 -38719 -5234 4608 -6791
16348f791L750K1671O976O505q754N027j4247J4439J1124l1121j8763O160J0261
$$ -6791 -3041 18630 25606 32111 23357 28384 14137 28576 39700 8579 -10184 -4024 6237
16335F237j5010q202J9421J1912j8274K0967j119K6183L142k1977j8364j3747
$$ 6237 -8773 -16975 2446 14358 -3916 17051 15932 42115 45257 23280 4916 -8831
16323h831j2053q625j4204K9333K5296L1381J90O38p497k6359r248j2875j8274
$$ -8831 -20884 -29509 -43713 -14380 10916 42297 42487 43125 35628 9269 21 -12854 -31128
16310c1128J5984N959L759J1028l920m334L8911K877m2582R90J9823q259k8358
$$ -31128 -15144 -9185 -5426 5602 1682 -2652 36259 39136 -3446 -2456 17367 9108 -19250
16297a9250j3604j5710k105P217p950K1559L3493K4709O030k6050J0505k3942
$$ -19250 -32854 -48564 -50669 -43452 -51402 -29843 3650 28359 34389 8339 18844 -5098
16285e098r00p84k9333j7600J0007k6459J5697K0892J743J199O518j385j7371
$$ -5098 -5998 -6782 -36115 -53715 -43708 -70167 -54470 -33578 -31835 -30636 -24118 -25503 -42874
16272d2874L0029P826j2452j7120j5047J952O455j42J2812J078J518K0205L744
$$ -42874 -12845 -5019 -17471 -34591 -49638 -47686 -41231 -41373 -28561 -27483 -25965 -5760 -2016
16259b016q137j2114N286j635j9675l0730l426L1433J6879J571K598M989R030
$$ -2016 -10153 -22267 -16981 -18616 -38291 -69021 -72447 -41014 -24135 -22564 -19966 -14977 -5947
16246e947r882j4100k08K2471J2833R102L566j5033n206N139j0169l391k0770
$$ -5947 -15829 -29929 -30137 -7666 5167 14269 17835 2802 -2404 2735 -7434 -10825 -31595
16233c1595j2534l485j571o674J9275K6077Q6J2092J306p765R834K622k4506k220
$$ -31595 -44129 -47614 -49185 -55859 -36584 -10507 -10421 1671 2977 -4788 5046 7668 -16838 -19058
16219a9058L4278o863k1954L515m501J07p59q429j9192L123O55J9927P678l7761
$$ -19058 15220 8357 -13597 -10082 -14583 -14476 -15235 -23664 -42856 -39733 -39078 -19151 -11473 -49234
16205d9234j8412N392m21N1332O542j6151j2197R344o28m921Q283o52r715K658
$$ -49234 -67646 -62254 -62675 -11343 -4801 -20952 -33149 -23805 -24433 -29354 -21071 -21723 -31438 -28780
16191b8780q36j6977r1n374J490J5863N03J6525j9698r177K1048j1481J9732K2118
$$ -28780 -29616 -46593 -46684 -52058 -50568 -34705 -34202 -17677 -37375 -46552 -25504 -36985 -17253 4865
16177D865K928N776j8778k1548K0812K3440J6666n286r097L596j4462Q888j2044
$$ 4865 7793 13569 -5209 -26757 -5945 17495 34161 28875 19778 23374 8912 17800 5756
16164E756l848j859j5551j2964q91J9998n639J0265J5200j5887j0857K8886L371
$$ 5756 1908 49 -15502 -28466 -29357 -9359 -14998 -4733 10467 -5420 -16277 12609 15980
16151A5980l54q748q351k3247j6836L1601M60k6782j5712J8908K2463L018p607
$$ 15980 15626 6878 -1473 -24720 -41556 -9955 -9495 -36277 -51989 -33081 -10618 -7600 -15207
16138a5207k3158K4772K8089j2610j4054Q208k3623j2020q105l836r8j1315L4621
$$ -15207 -38365 -13593 14496 1886 -12168 -3960 -27583 -39603 -47708 -51544 -51642 -62957 -28336
16125b8336L599J3910J2694J8294n459r339k2342P08M315K0560j5694j9446m528
$$ -28336 -24737 -10827 1867 20161 14702 5363 -16979 -16271 -11956 8604 -7090 -26536 -31064
16112c1064K1366j385Q09o344J708K2062O163O399R60j172k1053O087K7527J5409
$$ -31064 -9698 -11083 -10274 -16618 -14910 7152 13315 19714 20674 19502 -1551 4536 32063 47472
16098D7472J6079j0576j1460j8602q620n172j5152j4593J2531j124k0027J4632
$$ 47472 63551 52975 41515 22913 14293 9121 -6031 -20624 -8093 -9217 -29244 -14612
16086a4612J6177j1932Q727J8830l910j657p047P987n579k1550M443r413k8551
$$ -14612 1565 -10367 -1640 17190 13280 11623 4576 12563 6984 -14566 -10123 -19536 -48087
16073d8087K311K4955L9017q276m344L375j832k3856n347j9728J895K8037K335
$$ -48087 -45776 -20821 18196 9920 5576 8951 7119 -16737 -22084 -41812 -39917 -11880 -9545
16060i545J6717N791k426k3857K0163l2470j299j360l5483m208M987K2305K1450
$$ -9545 7172 12963 10537 -13320 6843 -25627 -26926 -28286 -63769 -67977 -62990 -40685 -19235
16047a9235M4380J1172p254q971r300j8403j0220j2302K1345N762K527K0560l099
$$ -19235 25145 36317 29063 20092 10792 -7611 -17831 -30133 -8788 -3026 -499 20061 16962
16034A6962j4693J6366R430j8678k202k0210L383L587k1946k2245N978J3334J2485
$$ 16962 2269 18635 28065 9387 7185 -13025 -9642 -6055 -28001 -50246 -44268 -30934 -18449
16021a8449j315P912J7203J6818j9876k3072j1779n375j9334J775R961M501K1245
$$ -18449 -19764 -11852 5351 22169 2293 -20779 -32558 -37933 -57267 -55492 -45531 -41030 -19785
16008a9785K873L71J0626p262l095J1596L045m145J843j8231m597R016J5352J355
$$ -19785 -16912 -16541 -5915 -13177 -16272 -4676 -1631 -5776 -3933 -22164 -26761 -17745 -2393 -1038
15994a038K973k5553l6206Q781K5989j1948J648L1544K9905j153J913k0320j8528
$$ -1038 1935 -23618 -59824 -51043 -25054 -37002 -35354 -3810 26095 24942 26855 6535 -11993
15981a1993q604J911O288L103k3109j5816K3368O625L1068J2154m40K374l0444
$$ -11993 -20597 -18686 -12398 -9295 -32404 -48220 -24852 -18227 12841 24995 24555 26929 -3515
15968c515k6603J6508K1651j59n772R740n876L77n534k3866r650R180J474l6694
$$ -3515 -30118 -13610 8041 7882 2110 11850 5974 6351 817 -23049 -32699 -23519 -22045 -58739
15954e8739k718r9J8653K2412r056P4n208j9748K5997L9670N962K514l4528j8971
$$ -58739 -61457 -61556 -42903 -20491 -29547 -29473 -34681 -54429 -28432 11238 17200 19714 -14814 -33785
15940c3785j1J611K5254J6907J2935K82J080M320j8898l178Q577k3476k0557j9704
$$ -33785 -33796 -32185 -6931 9976 22911 23193 24273 28593 9695 6517 15094 -8382 -28939 -48643
15926d8643j903J3783J8312J2688q717K8873J5080k1332m8141J202K0663k199
$$ -48643 -50546 -36763 -18451 -5763 -14480 14393 29473 8141 -40000 -38798 -18135 -20334
15914b0334k3744n282K6929J1517L2002M208l3232j6463p831J1604k478l672J2221
$$ -20334 -44078 -49360 -22431 -10914 21088 25296 -7936 -24399 -32230 -20626 -23104 -26776 -14555
15901a4555J2491k6191K437J9698J7077K427k3812j019j5745R855J8955j8027
$$ -14555 -2064 -28255 -25818 -6120 10957 13384 -10428 -11447 -27192 -17337 1618 -16409
15889a6409N208m979M024p697M218p397K0384N933L722l4982l9111n028J6263
$$ -16409 -11201 -16180 -12156 -19853 -15635 -23032 -2648 3285 7007 -27975 -67086 -72114 -55851
15876e5851R311J9527J8146o600j4149k6505j0390J4301L1996K4151j1383R152
$$ -55851 -46540 -27013 -8867 -15467 -29616 -56121 -66511 -52210 -20214 3937 -7446 1706
15864A706p249j2584m674p831j0482m054J0156N876J0245m210K29p510k2921J9958
$$ 1706 -5543 -18127 -22801 -30632 -41114 -45168 -35012 -29136 -18891 -23101 -22872 -30382 -53303 -33345
15850c3345K2449q382r198J859O791R903l900k4907Q492r852J3145K7948N369
$$ -33345 -10896 -19278 -28476 -26617 -19826 -9923 -13823 -38730 -30238 -40090 -26945 1003 6372
15837F372k1422j557P772K2798l8039l0825j8953k580K6062L289r023Q126J9263
$$ 6372 -15050 -16607 -8835 13963 -24076 -54901 -73854 -76434 -50372 -47083 -56106 -47980 -28717
15824b8717M7582q141k5668j0162N155K07j4074L709m542K932R896j2543P465
$$ -28717 18865 10724 -14944 -25106 -19951 -19744 -33818 -30109 -34651 -31719 -21823 -34366 -26901
15811b6901O181J3229J6415N27J9608J1518j1364q110j3775J5707P962J2707n867
$$ -26901 -20720 -7491 8924 9451 29059 40577 29213 21103 7328 23035 30997 43704 37837
15798C7837l8847k4256p185J1845J4751p635K264J1959l359j0409j8673K4779
$$ 37837 -1010 -25266 -32451 -20606 -5855 -13490 -11226 733 -2626 -13035 -31708 -6929
15786f929K4694K5982j6506k2271n233r060l3930j1252O27q178J2548L1666L42
$$ -6929 17765 43747 27241 4970 -263 -9323 -43253 -54505 -53878 -62056 -49508 -17842 -17500
15773a7500n382k7n117j7083J9780L994L355K601J3073M936r539o903j385J6010
$$ -17500 -22882 -22909 -28026 -45109 -25329 -21335 -17980 -15379 -2306 2630 -6909 -13812 -15197 813
15759H13k0278J254J2535k0484j9318P912K2646P704P488O127j1776K5314K0844
$$ 813 -19465 -18211 -5676 -26160 -45478 -37566 -14920 -7216 272 6399 -5377 19937 40781
15746D0781j6966q625O905n0759j0936J5751N46K3031Q706L943j1596J0450r191
$$ 40781 23815 15190 22095 -28664 -39600 -23849 -23303 -272 8434 12377 781 11231 2040
15733B040K492K5506k631k609k0895q720k7047j4825j1593M532J3432J398J9762
$$ 2040 4532 30038 27407 24798 3903 -4817 -31864 -46689 -58282 -53750 -40318 -38920 -19158
15720a9158L28j7212O764J9282k599j5853n111K0079K9111j3552l0754k5517o717
$$ -19158 -18830 -36042 -29278 -9996 -12595 -28448 -33559 -13480 15631 2079 -28675 -54192 -60909
15707f0909J6316J035P053J7273j2016j8355m874K6699J2826j316k573K750J2278
$$ -60909 -44593 -43558 -36505 -19232 -31248 -49603 -54477 -27778 -14952 -16268 -18841 -16091 -3813
15694c813K5923K3441j1739j5943l5753k8297n248L998L068j8336O232M7502J6074
$$ -3813 22110 45551 33812 17869 -17884 -46181 -51429 -47431 -44363 -62699 -56467 -8965 7109
15681G109p794J4978R15J8286J7214o281o823l5438j5238K7580J4803l4638k8183
$$ 7109 -685 14293 15208 33494 50708 44427 37604 2166 -13072 14508 29311 -5327 -33510
15668c3510J9519K2400j5136N835R8m349K4980j1492l3495R954K4805Q70k0776
$$ -33510 -13991 8409 -6727 -892 -794 -5143 19837 8345 -25150 -15196 9609 10479 -10297
15655a0297M741J5402k573m029j1444n150j906Q12l5934p484P546K0890J5274
$$ -10297 -5556 9846 7273 3244 -8200 -13350 -15256 -14444 -50378 -57862 -50316 -29426 -14152
15642a4152K2161j5801j7015L035L1733K2393P516j9763j3433j8486j2837r829
$$ -14152 8009 -7792 -24807 -21772 9961 32354 39870 20107 6674 -11812 -24649 -34478
15630c4478J6666J4515j8025J0788k003j5846j9361J2441n994k1125R912J6538
$$ -34478 -17812 -3297 -21322 -10534 -12537 -28383 -47744 -35303 -41297 -62422 -52510 -35972
15618c5972J4969L909j3455J7545R490L761r130k6096j7007K0689R090Q877j7870
$$ -35972 -21003 -17094 -30549 -13004 -3514 247 -8883 -34979 -51986 -31297 -22207 -13330 -31200
15605c1200K842N479J278k68o548J8286j0641P740Rj9250J6385Q436p46K6463
$$ -31200 -28358 -22879 -21601 -21869 -28417 -10131 -20772 -13032 -13023 -32273 -15888 -7452 -8198 18265
15591A8265N464k379j8718P121r566j4927N194p636l1002r12P802K6403q699j1900
$$ 18265 23729 21350 2632 9753 187 -14740 -9546 -17182 -48184 -49096 -41294 -14891 -23590 -35490
15577c5490J9671P022m6172j7652J3011N1504J0719n191l0310k972n287J3410
$$ -35490 -15819 -8797 -54969 -72621 -59610 -8106 2613 -2578 -32888 -35860 -41147 -27737
15565b7737J8392J2141j2905k5796O083K2078J7820R679J0180O003k5477j2585
$$ -27737 -9345 2796 -10109 -35905 -29822 -7744 10076 19755 29935 35938 10461 -2124
15553b124J6402J4988k8916j0656J0071J3872K005j2092j5529j6345J2316J5270
$$ -2124 14278 29266 350 -10306 -235 13637 15642 3550 -11979 -28324 -16008 -738
15541g38o064k659K928K4873O335r491q667J2423Q49l1192R544l937J9351M317
$$ -738 -6802 -9461 -6533 18340 24675 15184 6517 18940 19789 -11403 -1859 -5796 13555 17872
15527A7872j6634k935j7049j5980j7396j1069K0788N341J4824R232K5562Q638
$$ 17872 1238 -1697 -18746 -34726 -52122 -63191 -42403 -37062 -22238 -13006 12556 21194
15515B1194K0184p89j0433k5936k7083Q972K3919p811j1117o913l53J6437n481
$$ 21194 41378 40589 30156 4220 -22863 -13891 10028 2217 -8900 -15813 -16166 271 -5210
15502e210k8422l062J6024J8545j0482j45J5326l2267J214k266j7684J8204J5378
$$ -5210 -33632 -36694 -20670 -2125 -12607 -12752 2574 -29693 -28479 -30745 -48429 -30225 -14847
15489a4847R13J1722k8113k4664r864K785K9105K260j1389L407Q750l297L2813
$$ -14847 -13934 -2212 -30325 -54989 -64853 -62068 -32963 -30703 -42092 -38685 -29935 -33232 -419
15476d19m165k5124N864K450J361K0544L2636n380k7008l3233q626j635L9021
$$ -419 -4584 -29708 -23844 -21394 -20033 511 33147 27767 759 -32474 -41100 -42735 -3714
15463c714J849k6265j8123K0732K1488k6049l002J9220n357K4726k784k7391k2709
$$ -3714 -1865 -28130 -46253 -25521 -4033 -30082 -33084 -13864 -19221 5505 2721 -24670 -47379
15450d7379n688J9166K2565r705k350K4359k892l5937R334J9947o733j590j801
$$ -47379 -53067 -33901 -11336 -21041 -23391 968 -1924 -37861 -28527 -8580 -15313 -16903 -18704
15437a8704K3710J365j848J4557P779k0366j0935J386j7794m119J6049J2925p731
$$ -18704 5006 6371 4523 19080 26859 6493 -4442 -3056 -20850 -24969 -8920 4005 -3726
15424c726L923k7402j2982m321q423J0674L5999K0682J8372J402J0596j9214k4030
$$ -3726 197 -27205 -40187 -44508 -52931 -42257 -6258 14424 32796 34198 44794 25580 1550
15411A550J8155J9680M116k4937k2185J7836J6904N163j1854j5345j8116L733
$$ 1550 19705 39385 43501 18564 -3621 14215 31119 36282 24428 9083 -9033 -5300
15399e300J1402j7777j6117q646M386J7701L4337o160k8043j3639R711j5011j4873
$$ -5300 6102 -11675 -27792 -36438 -32052 -14351 19986 13826 -14217 -27856 -18145 -33156 -48029
15386d8029Q679L7210J0125m428J6990L0568q668n6513k3067J7134J8789p404
$$ -48029 -39350 -2140 7985 3557 20547 51115 42447 -14066 -37133 -19999 -1210 -8614
15374h614n396P430J7679r15J7426j1360j29J0799l438j4180j8961k543Q668K6118
$$ -8614 -14010 -6580 11099 10184 27610 16250 16121 26920 23482 9302 -9659 -12202 -3534 22584
15360B2584K7717j455l1800k2683k3235j5467j854k3712j8797M0996N868N259
$$ 22584 50301 48846 17046 -5637 -28872 -44339 -46193 -69905 -88702 -47706 -41838 -36579
15348c6579J4026J7911K9215k3152m6373k3983K5779L3811J5174j9058O473M541
$$ -36579 -22553 -4642 24573 1421 -44952 -68935 -43156 -9345 5829 -13229 -6756 -2215
15336b215n203p819l4454K017K7015J4602o194q634L1502K8284Q267o956k8612
$$ -2215 -7418 -15237 -49691 -47674 -20659 -6057 -12251 -20885 10617 38901 47168 40212 11600
15323A1600k716J7280n047o611k2646j9764n046O804K133j0053J7790n814R970
$$ 11600 8884 26164 21117 14506 -8140 -27904 -32950 -26146 -24013 -34066 -16276 -22090 -12120
15310a2120n124M846j6577P129K9941J8414k546j4991k3591q164M547L1745J1475
$$ -12120 -17244 -12398 -28975 -21846 8095 26509 23963 8972 -14619 -22783 -18236 13509 24984
15297B4984l6943l2103J406o03K0195K2256j0011k4521m158J3379R590j070j3985
$$ 24984 -11959 -44062 -42656 -43259 -23064 -808 -10819 -35340 -39498 -26119 -16529 -17599 -31584
15284c1584J1254p167J649L4498K9368O915m0591j031j6927j4528J2805J2749
$$ -31584 -20330 -27497 -25848 8650 38018 44933 4342 3311 -13616 -28144 -15339 -2590
15272b590q482P057K0069O564l711k4014N370K247L829J1380n528J3577j0672
$$ -2590 -11072 -4015 16054 22618 18907 -5107 263 2510 6339 17719 12191 25768 15096
15259A5096k0997J8298o956k8163j3920K1719O16m857J151j0834J6650K656r862
$$ 15096 -5901 12397 5441 -22722 -36642 -14923 -14307 -19164 -18013 -28847 -12197 -9541 -19403
15246a9403j455p206K3075J7458k2060k0839M4158P264m283l080k6617j5369K3921
$$ -19403 -20858 -28064 -4989 12469 -9591 -30430 13728 20992 16709 13629 -12988 -28357 -4436
15233d436j1641j3976J417j858k8657m214J8762J9607Q377J4625L75R292o875
$$ -4436 -16077 -30053 -28636 -30494 -59151 -63365 -44603 -24996 -16619 -1994 -1619 7673 798
15220G98k1646r742J5542o106J632J5637l1016o077J5816j622J4621l054o032
$$ 798 -20848 -30590 -15048 -21154 -19522 -3885 -34901 -40978 -25162 -26784 -12163 -15217 -21249
15207b1249n32j2629M135J20j0412J4737J8216r293l5306j2732K8700J8015l901
$$ -21249 -21781 -34410 -30275 -30155 -40567 -25830 -7614 -16907 -52213 -64945 -36245 -18230 -22131
15194b2131l30j0413r950O915J0198J0862O076L831l0338o284l057L163o500J6763
$$ -22131 -22461 -32874 -42824 -35909 -25711 -14849 -8773 -4942 -35280 -41564 -44621 -41458 -47958 -31195
15180c1195j257L423j549l676K8960P736j4870p316N73J3534J2438M862n47NQ736
$$ -31195 -32452 -29029 -30578 -34254 -5294 2442 -12428 -19744 -19171 -5637 6801 11663 11116 11121 19857
15165A9857q983l0033J114J2185J0502j2063M455m663K789j2967M650j4843K1239
$$ 19857 10874 -19159 -18045 -5860 4642 -7421 -2966 -7629 -4840 -17807 -13157 -28000 -6761
15152f761j14P925j0008L011J3049J921k2633j7057J2006K5979J8343j1206k6640
$$ -6761 -6875 1050 -8958 -5947 7102 9023 -13610 -30667 -18661 7318 25661 14455 -12185
15139a2185J1222J092j1024o447j8684R464L387k787K1232J4999j2954O913j3223
$$ -12185 -963 129 -10895 -17342 -36026 -26562 -23175 -25962 -4730 10269 -2685 4228 -8995
15126h995j6829j569L088K8453M0403l0687l5212m237k103j9525O469L9464R213
$$ -8995 -25824 -27393 -24305 4148 44551 13864 -21348 -25585 -27688 -47213 -40744 -1280 7933
15113G933m083n116j6033m924J4754j2511j8256K2017J464R715j2269J0917J6170
$$ 7933 3850 -1266 -17299 -22223 -7469 -19980 -38236 -16219 -14755 -5040 -17309 -6392 9778
15100I778j3649L497l125J0434K225j1417j7517j1206J4341J0380j7529K5233
$$ 9778 -3871 -374 -3499 6935 9160 -2257 -19774 -30980 -16639 -6259 -23788 1445
15088A445l925p864j6452Q819m310O582j688j5476K0485J6896M025j999J613K1412
$$ 1445 -2480 -10344 -26796 -17977 -22287 -15705 -17393 -32869 -12384 4512 8537 6538 8151 29563
15074B9563R050k7783m1854j4134J5705J2184L144j3777L4669p417r426J387j1835
$$ 29563 38613 10830 -31024 -45158 -29453 -17269 -14125 -27902 6767 -650 -10076 -8689 -20524
15061b0524K9535N1454r726j3080j3360j3937k5k5189m5270n245J2818Q159j4811
$$ -20524 9011 60465 50739 37659 24299 10362 10337 -14852 -60122 -65367 -52549 -44390 -59201
15048e9201R902j7554K4846M8327o26P924j3129k3073k956k1413p901J5387r992
$$ -59201 -49299 -66853 -42007 6320 5694 13618 489 -22584 -25540 -46953 -54854 -39467 -49459
15035d9459N943J8205O006L89l246N946k6003j1128l18J4363M1503R048j8204
$$ -49459 -43516 -25311 -19305 -18916 -22162 -16216 -42219 -53347 -53665 -39302 2201 11249 -6955
15022f955k5427j8298o433J2737J6746J6686l050j0352j7570K7306L0145J0220
$$ -6955 -32382 -50680 -57113 -44376 -27630 -10944 -13994 -24346 -41916 -14610 15535 25755
15010B5755j296k0947r523o627j3349O71O002N03n048J4444R299K7898M824j2596
$$ 25755 24459 3512 -6011 -12638 -25987 -25316 -19314 -18811 -23859 -9415 -116 27782 32606 20010
14996B0010j9032j3127p16Q210j1225l074M2471J1711j7554j2027j3946j542j4359
$$ 20010 978 -12149 -12865 -4655 -15880 -18954 23517 35228 17674 5647 -8299 -9841 -24200
14983b4200l0492k3117q783M0059K3391J3720L0035k5364j2111K4988J6539m687
$$ -24200 -54692 -77809 -86592 -46533 -23142 -9422 20613 -4751 -16862 8126 24665 19978
14971A9978k5885o467j956o854J7449o928o405J897K0083K5332r146k1115j298
$$ 19978 -5907 -12374 -14330 -21184 -3735 -10663 -17068 -15171 4912 30244 21098 -17 -1315
14958a315J896j0839l543j2249m061J9022J127j2230j808R012K009j406n367L0361
$$ -1315 581 -10258 -13801 -26050 -30111 -11089 -9962 -22192 -24000 -14988 -12979 -14385 -19752 10609
14944A0609J6400k8669k4168q42J4493r258o240K46r200J0761J0221J947l5452
$$ 10609 27009 -1660 -25828 -26670 -12177 -21435 -27675 -27429 -36629 -25868 -15647 -13700 -49152
14931d9152j57m424r931K9062l660R199L6259Q845k496n592L724N018j5812q788
$$ -49152 -49309 -53733 -63664 -34602 -38262 -29063 7196 16041 13545 7953 11677 16695 883 -7905
14917g905O022j8095K686P986N073l918l130J0981N742j4843Q11J5384L593K503
$$ -7905 -1883 -19978 -17292 -9306 -4233 -8151 -11281 -300 5442 -9401 -8590 6794 10387 12890
14903A2890k700M158J1448K055M463n66J2554J022k7654P753q128k6879k8173
$$ 12890 10190 14348 25796 27851 32314 31748 44302 45324 17670 25423 17295 -9584 -37757
14890c7757J540r142J8230K0614q17K2684m855k7843k572O030J7799L2416k696
$$ -37757 -36217 -45359 -27129 -6515 -7332 15352 10497 -17346 -19918 -13888 3911 36327 33631
14877C3631j2993j6060k0320J2927K2025O067N365j3589n36J6416n814m1559j5303
$$ 33631 20638 4578 -15742 -2815 19210 25277 30642 17053 16517 32933 27119 -14440 -29743
14864b9743k3127K3719K9256k3227K0572P318j1352m072j0030j3341L0148L6133
$$ -29743 -52870 -29151 105 -23122 -2550 4768 -6584 -10656 -20686 -34027 -3879 32254
14852C2254j1868J3114O857k9046k0008Q238j6054k0797K6153J6208K0569j6997
$$ 32254 20386 33500 40357 11311 -8697 -459 -16513 -37310 -11157 5051 25620 8623
14840H623m1201j4283J3212P038j918j6403k2317k5679P800K5517J2568N134j5471
$$ 8623 -32578 -46861 -33649 -26611 -28529 -44932 -67249 -92928 -85128 -59611 -47043 -41909 -57380
14827e7380o670k559K7401O110p030M050J6791J0063K8267L009k5801k8268j5147
$$ -57380 -64050 -66609 -39208 -33098 -40128 -36078 -19287 -9224 19043 22052 -3749 -32017 -47164
14814d7164j658K5232j5992J450n70N049k6597Q207L2490K7492J2393j4437m0901
$$ -47164 -48822 -23590 -39582 -38132 -38702 -33653 -60250 -52043 -19553 7939 20332 5895 -35006
14801c5006J1179M420M0744J0739k8939m659n340k1308j4666L8142j4594k928
$$ -35006 -23827 -19407 21337 32076 3137 -1522 -6862 -28170 -42836 -4694 -19288 -22216
14789b2216J6993J426j5300L11J9119m572l0312k1463J3384K89N944j8443R80
$$ -22216 -5223 -3797 -19097 -18786 333 -4239 -34551 -56014 -42630 -42341 -36397 -54840 -53860
14776e3860K8462J1952k410n512r69J1212J7916n127p774J9677K3329l6060l997
$$ -53860 -25398 -13446 -15856 -21368 -22337 -11125 6791 1664 -6110 13567 36896 836 -3161
14763c161N658j2383L6n790K058L823N31Q691l3995p14K982j986p314j2224Q373
$$ -3161 2497 -9886 -9850 -15640 -13582 -9759 -9228 -537 -34532 -35246 -32264 -34250 -41564 -53788 -45415
14748d5415l040j5206K7251L6080K2912k0705o89J7239p217k235M982p303J3174
$$ -45415 -48455 -63661 -36410 -330 22582 1877 1188 18427 11210 8975 13957 6654 19828
14735A9828j4689J780j4363j0913J8076Q175J2197j775k6820P010j2723J3624
$$ 19828 5139 6919 -7444 -18357 -281 7894 20091 18316 -8504 -1494 -14217 -593
14723e93J2024k0169j2J9506j905l4163j6809j0207J1341J277K7641J5448j5353
$$ -593 11431 -8738 -8750 10756 8851 -25312 -42121 -52328 -40987 -39710 -12069 3379 -11974
14710a1974Q98J4419j2928R256O39R919K2436J0627p631J81j201M797m7013k7185
$$ -11974 -11076 3343 -9585 -329 310 10229 32665 43292 35661 35842 34641 39438 -7575 -34760
14696c4760N802j3851j4934o615J0857k032m571J7985K6252L7339J1978k030m879
$$ -34760 -28958 -42809 -57743 -64358 -53501 -55533 -60104 -42119 -15867 21472 33450 31420 26541
14683B6541J1655r923k7242p18K5263q024o005q936J0089l2866Q600J1572N898
$$ 26541 38196 28273 1031 313 25576 17552 11547 2611 12700 -20166 -11566 6 5904
14670E904j8250J3029m166j3737m381K6326O472j8072J237J6048j9868j0744M215
$$ 5904 -12346 683 -3483 -17220 -21601 4725 11197 -6875 -5638 10410 -9458 -20202 -15987
14657a5987j407J8394k938j8455k3926J871K7711Q495P103Q72j7267N39l380K3755
$$ -15987 -17394 1000 -1938 -20393 -44319 -42448 -14737 -6242 861 1733 -15534 -14995 -18375 5380
14643E380j8399q456k6609J1174O34J7221k147m48L803r281m390L6080p638j8462
$$ 5380 -13019 -21475 -48084 -36910 -36276 -19055 -21202 -21650 -17847 -27128 -31518 4562 -3076 -21538
14629b1538k135K300J5589K1912M330n981o630j8649N351O900N545o357k555L277
$$ -21538 -23673 -21373 -5784 16128 20458 14477 7847 -10802 -5451 1449 6994 637 -1918 1359
14615A359K7920O282l7095P327J1321k263l2147r02J0127J5490J087L3874k0856
$$ 1359 29279 35561 -1534 5793 17114 14851 -17296 -18198 -8071 7419 8506 42380 21524
14602B1524j1856J433j7931j89k8031k1768J2761Q040N2011j4390J840M554k7188
$$ 21524 9668 11101 -6830 -7019 -35050 -56818 -44057 -36017 15994 1604 3444 7998 -19190
14589a9190l218n426J6279P354j3808J0948M295n069k828j1483n670k722J9252
$$ -19190 -22408 -27834 -11555 -4201 -18009 -7061 -2766 -7835 -10663 -22146 -27816 -30538 -11286
14576a1286K311M214n695l7510K6111L1074j3795r937r03J3755j0104k9534m32
$$ -11286 -8975 -4761 -10456 -47966 -21855 9219 -4576 -14513 -15416 -1661 -11765 -41299 -41731
14563d1731R391p199J1110l428R031q636K1446l299l0490J180J0239P263J1052
$$ -41731 -32340 -39539 -28429 -31857 -22826 -31462 -10016 -13315 -43805 -42625 -32386 -25123 -14071
14550a4071L125l0573r890J3310M7720K5162q586l0171n871l8095k9945p92J0528
$$ -14071 -10946 -41519 -51409 -38099 9621 34783 26197 -3974 -9845 -47940 -77885 -78677 -68149
14537f8149M6541o038k8433K3191J7018k5514k4124l951M0785L1696k80k9990
$$ -68149 -21608 -27646 -56079 -32888 -15870 -41384 -65508 -69459 -28674 3022 2742 -27248
14525b7248q079K141N707J870N201L259K9339q302J5729N509k0100j4671j9045
$$ -27248 -35327 -33186 -27479 -25609 -20408 -17149 12190 3888 19617 25126 5026 -9645 -28690
14512b8690j9318K82L3903Q384l1919j781L0457m803l3678j7094j2057J3166K7313
$$ -28690 -48008 -47726 -13823 -5439 -37358 -39139 -8682 -13485 -47163 -64257 -76314 -63148 -35835
14499c5835MJ5170N497k2789j3205K2831J9312n183j92j900o715J7471o43J4717
$$ -35835 -35831 -20661 -15164 -37953 -51158 -28327 -9015 -14198 -14390 -16290 -23005 -5534 -6177 8540
14485H540j0588j2001j5900l500J0855p633O158j623L445J0409j729K980J7367
$$ 8540 -2048 -14049 -29949 -33449 -22594 -30227 -24069 -25692 -22247 -11838 -13567 -10587 6780
14472F780K1625o681j3169n215N90j816n309j345J343R811o68J4904j79j3620
$$ 6780 28405 21724 8555 3340 3930 2114 -3195 -4540 -3197 6614 5946 20850 20671 7051
14458G051K0671K5507P914n93k1350L677p298O516n366L368o15r176j1837k2858
$$ 7051 27722 53229 61143 60550 39200 42877 35579 42095 36729 40097 39482 30306 18469 -4389
14444d389M729Q35k7257O966J5021j1410j5372o517R035L501J2158L591j4350
$$ -4389 340 1175 -26082 -19116 -4095 -15505 -30877 -37394 -28359 -24858 -12700 -9109 -23459
14431b3459o088M392p965N404L627K783K839Q82J6617M6979J7222j9941k5734
$$ -23459 -29547 -25155 -33120 -27716 -24089 -21306 -18467 -17585 -968 46011 63233 43292 17558
14418A7558k4034p003k474j0337R356j6870l8317J4818J3726K9352j7119M976
$$ 17558 -6476 -13479 -15953 -26290 -16934 -33804 -72121 -57303 -43577 -14225 -31344 -26368
14406b6368m415j7681k60p610j2450J1916J4518K155m944O330n319K2883K601
$$ -26368 -30783 -48464 -48724 -56334 -68784 -56868 -42350 -40195 -45139 -38809 -44128 -21245 -18644
14393a8644k1965L6460J177n744J1984J2029m525j166M74l4509j5000j5081n444
$$ -18644 -40609 -4149 -2972 -8716 3268 15297 10772 9606 10080 -24429 -39429 -54510 -59954
14380e9954n715j023K6640K8391J1013j7105k6621k2971O924J2405J4724P341
$$ -59954 -65669 -66692 -40052 -11661 -648 -17753 -44374 -67345 -60421 -48016 -33292 -25951
14368b5951j1332J5899J0216J2587P467p86M506j4992l823k809K9912J7038M31
$$ -25951 -37283 -21384 -11168 1419 8886 8100 12606 -2386 -6209 -9018 20894 37932 38363
14355C8363l9687j2030m960j7648l2574q771K0335K8792N016k2261J0034K8244
$$ 38363 -1324 -13354 -18314 -35962 -68536 -77307 -56972 -28180 -23164 -45425 -35391 -7147
14343g147J2139m56Q912j4966n118j4316K5760L2194K3074J7097m5774k1257N47
$$ -7147 4992 4536 13448 -1518 -6636 -20952 4808 37002 60076 77173 31399 10142 10689
14330A0689j7534q124j4849L948P602J6079R741k1212k7848O138K8745K9333J8842
$$ 10689 -6845 -14969 -29818 -25870 -18268 -2189 7552 -13660 -41508 -35370 -6625 22708 41550
14317D1550O673j0164p187N612N062j7555k57J2804J649K275k2888M540j5201
$$ 41550 48223 38059 30872 36484 41546 23991 23734 36538 38187 40462 17574 22114 6913
14304F913o506M560J1127O445J5472nm354O091J272j7139l6695k8473R15L8203
$$ 6913 407 4967 16094 22539 38011 38006 33652 39743 41015 23876 -12819 -41292 -40377 -2174
14290b174P922J1821m299M923K950o004j0599j3018R339N005p920L404J5889R225
$$ -2174 5748 17569 13270 18193 21143 15139 4540 -8478 861 5866 -2054 1350 17239 26464
14276B6464k3637r353j2185J9252p423k5901N293K2452K427L60J063P5J2310m29
$$ 26464 2827 -6526 -18711 541 -6882 -32783 -27490 -5038 -2611 -2251 -1188 -1113 11197 10768
14262A0768l586p593J0762J422l1023k0318K2127R933J4421J0436o291r956k080
$$ 10768 7182 -411 10351 11773 -19250 -39568 -17441 -7508 6913 17349 11058 1102 -978
14249i78k1264k0768J0406J0764K2855l348j3727n700j6879K3535J0678j6391
$$ -978 -22242 -43010 -32604 -21840 1015 -2333 -16060 -21760 -38639 -15104 -4426 -20817
14237b0817N40K7370l392l2010l6495p885k0647L44L5809p366n40K2565K9059
$$ -20817 -20277 7093 3701 -28309 -64804 -72689 -93336 -92992 -57183 -64549 -65089 -42524 -13465
14224a3465J9572J0008J3392P626N404K228j4056m0957k0959j5310K4754K6624
$$ -13465 6107 16115 29507 37133 42537 44765 30709 -10248 -31207 -46517 -21763 4861
14212D861M272J4800m8880j2877L4212l485P362o872K942j9245l0007J1519J2682
$$ 4861 9133 23933 -24947 -37824 -3612 -7097 265 -6607 -3665 -22910 -52917 -41398 -28716
14199b8716j089J5287K763j1461J1883p049j4035j099k1416J252k620k830q427
$$ -28716 -29805 -14518 -11755 -23216 -11333 -18382 -32417 -33516 -54932 -53680 -56300 -59130 -67557
14186f7557J7177j1159J8643K7217J5208J8600J7233j3462j6353k4894r633L6785
$$ -67557 -50380 -61539 -42896 -15679 -471 18129 35362 21900 5547 -19347 -28980 7805
14174G805L5096n378k9678l4291j967M255K3370K3485O738m913r21l4118l544
$$ 7805 42901 37523 7845 -26446 -28413 -24158 -788 22697 29435 24522 23601 -10517 -14061
14161a4061J4333J0122k0989r805L878j0172m728J9990j6438k9837K511M4175
$$ -14061 272 10394 -10595 -20400 -16522 -26694 -31422 -11432 -27870 -57707 -55196 -11021
14149a1021K9278R041r504J1727L77J8014l3806p654l7281L162J4010j2012l1295
$$ -11021 18257 27298 17794 29521 29898 47912 14106 6452 -30829 -27667 -13657 -25669 -56964
14136e6964J7623J2566q684J1419j7294J4838k1945J5890M565J6694m990j4204
$$ -56964 -39341 -26775 -35459 -24040 -41334 -26496 -48441 -32551 -27986 -11292 -16282 -30486
14124c0486K9686j33k7551j3026R090K8250q3j2171O255k535q377k7383N095N791
$$ -30486 -800 -933 -28484 -41510 -32420 -4170 -4253 -16424 -10169 -12704 -21081 -48464 -43369 -37578
14110c7578J1780l342J9304J4244r274j580j935P301L520J120J4721Q219j7631
$$ -37578 -25798 -29140 -9836 4408 -4866 -6446 -8381 -1080 2440 3560 18281 26500 8869
14097H869l6721k2380J3483K0146J0447j0876j5291l2704j008J9477N0579J3679
$$ 8869 -27852 -50232 -36749 -16603 -6156 -17032 -32323 -65027 -66035 -46558 4021 17700
14085A7700j6808J6620l1325l494L4801J4622l3841l1409L341J2240K729J9490
$$ 17700 892 17512 -13813 -17307 17494 32116 -1725 -33134 -29793 -17553 -14824 4666
14073D666l430o01M913q404p74M661k7823j0153k3999j061J7249j1773L5476K9725
$$ 4666 1236 635 5548 -2856 -3630 1031 -26792 -36945 -60944 -62005 -44756 -56529 -21053 8672
14059H672J2316k2460j3283r479j5024k8291p513J9125J4221J1627J5077K13K4478
$$ 8672 20988 -1472 -14755 -24234 -39258 -67549 -75062 -55937 -41716 -30089 -15012 -14799 9679
14046I679O165j3101k674j22J8905k4398J1886J8464k2762j3221P486j0791k5442
$$ 9679 15844 2743 69 -53 18852 -5546 6340 24804 2042 -11179 -3693 -14484 -39926
14033c9926J732k4697P019L2422M707O973l159r774j3844j3022J8648K3540L8502
$$ -39926 -38194 -62891 -55872 -23450 -18743 -11770 -14929 -24703 -38547 -51569 -32921 -9381 29121
14020B9121J0414p692j2964r648P604J7021j9944j6547J6928j6686l271K100R854
$$ 29121 39535 31843 18879 9231 16835 33856 13912 -2635 14293 -2393 -5664 -3564 6290
14007F290N26j715K295J7397J3855k2663J0338N232l4728j3930O667k4483j3199
$$ 6290 6816 5101 7396 24793 38648 15985 26323 31555 -3173 -17103 -10436 -34919 -48118
13994d8118K3439K664j6235J190L851J9262J9684n457j5076o539j2414L9892K837
$$ -48118 -24679 -22015 -38250 -37060 -33209 -13947 5737 280 -14796 -21335 -33749 6143 8980
13981H980j0962J373j8496k9632j9241o128J1995L7259L4723Q815K1736J981P541
$$ 8980 -1982 -609 -19105 -48737 -67978 -74106 -62111 -24852 9871 18686 40422 42403 49944
13968D9944j1152l7225r955J9882j4511j8702j7822J5920L2515k2041k2614o88
$$ 49944 38792 1567 -8388 11494 -3017 -21719 -39541 -23621 8894 -13147 -35761 -36449
13956c6449L883J5716q14J7444R132m334l0355N886J6710L557o2j0263P952j2420
$$ -36449 -32566 -16850 -17664 -220 8912 4578 -25777 -19891 -3181 376 314 -9949 -1997 -14417
13942a4417j9603o244j4965N395p451J5264K9166L1071J8897r01P774J1585J0550
$$ -14417 -34020 -40264 -55229 -49834 -57285 -42021 -12855 18216 37113 36212 43986 55571 66121
13929F6121j015k3646j6455L0294J0575k8757k1393O046l647n348J4099j3318
$$ 66121 65106 41460 25005 55299 65874 37117 15724 21770 18123 12775 26874 13556
13917A3556k733N821k057m632J813p660j1089n03J3096k411j7111J52K5062O901
$$ 13556 10823 16644 14587 9955 11768 4108 -6981 -7484 5612 3201 -13910 -13758 11304 18205
13903A8205J3590l324j0206j3248k2935r254N5J0401J6625J184P845K6984K131
$$ 18205 31795 28471 18265 5017 -17918 -27172 -27117 -16716 -91 1093 8938 35922 38053
13890C8053k5799r315M66L206L498o7j574k0533j8317Q269J8723J0777J2297l537
$$ 38053 12254 2939 3405 6611 10109 10042 8468 -12065 -30382 -22113 -3390 7387 19684 16147
13876A6147q912M636l429j5904j2629L917k474j357K7845J9807k0249j6364j5897
$$ 16147 7235 11871 8442 -7462 -20091 -16174 -18648 -20005 7840 27647 7398 -8966 -24863
13863b4863L562J564J2411J1612Q084l7162j0817P269n782J6755L595j247J3053
$$ -24863 -21301 -19737 -7326 4286 12370 -24792 -35609 -28340 -34122 -17367 -13772 -15019 -1966
13850a966Q66l286R444j8695l1552j1810M2118J7894J8481J2936J808K211R498
$$ -1966 -1100 -4386 5058 -13637 -45189 -56999 -14881 3013 21494 34430 36238 38449 47947
13837D7947j6740j426j9722m224K3955Q287j0445l3702O340J7303o937j5509m114
$$ 47947 31207 29781 10059 5835 29790 38077 27632 -6070 270 17573 10636 -4873 -8987
13824h987Q097r360j5161J1426J054o318j0622J788L2583K3893j1458M0246j2478
$$ -8987 -890 -10250 -25411 -13985 -12931 -19249 -29871 -28083 4500 28393 16935 57181 44703
13811D4703m2550q387o456r222Q892K0280L0247J3623l6554K658P193k1410j3217
$$ 44703 2153 -6234 -12690 -21912 -13020 7260 37507 51130 14576 17234 24427 3017 -10200
13798a0200k0458j5046l581j3474K9778R392J1272n219L596N349Q144o876k693
$$ -10200 -30658 -45704 -49285 -62759 -32981 -23589 -12317 -17536 -13940 -8591 -447 -7323 -10016
13785a0016J4112l431K205q859l831j0462J596L022j1102r438K2743M8896O95
$$ -10016 4096 665 2870 -5989 -9820 -20282 -18686 -15664 -26766 -36204 -13461 35435 36130
13772C6130l1462k4452N771j211K697l473m845J8229R630J1768k6603L655N267
$$ 36130 4668 -19784 -14013 -15224 -12527 -16000 -20845 -2616 7014 18782 -7821 -4166 1101
13759A101J961K2236K001j9354J9019J353l008j1884J1493Q228K937k088k2276
$$ 1101 3062 25298 27299 7945 26964 28317 25309 13425 24918 33146 36083 33995 11719
13746A1719L3667l97k0211k0803j7898q020k506J5486J1977R759K1869J4754P439
$$ 11719 45386 44989 24778 3975 -13923 -21943 -24449 -8963 3014 12773 34642 49396 56835
13733E6835k7404k1078j0990R32J2425p980j1753j8833k2201j1271L8434J0862
$$ 56835 29431 8353 -2637 -1705 10720 2740 -9013 -27846 -50047 -61318 -22884 -12022
13721a2022J034M639k0863M736K5172j6651P460J071k5377J5077j5970j704Q611
$$ -12022 -10988 -6349 -27212 -22476 2696 -13955 -6495 -5424 -30801 -15724 -31694 -33398 -24787
13708b4787R552K984j0964N549L4001P466j2068m1006p151Q115k6348Mm543L3765
$$ -24787 -15235 -12251 -23215 -17666 16335 23801 11733 -29273 -36424 -28309 -54657 -54653 -59196 -25431
13694b5431M159n622J3431o360J67R436l3386R11K6043R744P420o431j7859R58
$$ -25431 -21272 -26894 -13463 -19823 -19656 -10220 -43606 -42695 -16652 -6908 512 -5919 -23778 -22820
13680b2820K6631j52M563P622J085M523j5422P674n115j1843k021l0288J2180
$$ -22820 3811 3659 8222 15844 16929 21452 6030 13704 8589 -3254 -5275 -35563 -23383
13667b3383L2970j048k9712j9124j5583j1837n775K2499K7227J1577L0645r114
$$ -23383 9587 8539 -21173 -40297 -55880 -67717 -73492 -50993 -23766 -12189 18456 9342
13655I342K493N375l2833k5025K3191J0541O531N110r560L1814J6646p34J0274
$$ 9342 11835 17210 -15623 -40648 -17457 -6916 -385 4725 -4835 26979 43625 42891 53165
13642E3165j2985m039J1900p974j9945k864n985k5512l5532J2111L6083l933r36
$$ 53165 40180 36141 48041 40067 20122 17258 11273 -14239 -49771 -37660 -1577 -5510 -6446
13629f446k5231j1057J1751o197J7598m768k2054o627L5371J1290O852J5778L1841
$$ -6446 -31677 -42734 -30983 -37180 -19582 -24350 -46404 -53031 -17660 -6370 482 16260 48101
13616D8101o289L929j076j2724j5944j2360N766R920k2268j1076M904j427j2097
$$ 48101 41812 45741 44665 31941 15997 3637 9403 19323 -2945 -14021 -9117 -10544 -22641
13603b2641L1417O850k1789j2434N727J2196j2126k3263j233J0729J0432P032
$$ -22641 8776 15626 -6163 -18597 -12870 -674 -12800 -36063 -37296 -26567 -16135 -9103
13591i103j9689k5759O705m267K2023J6925m871L0565K1098k4447k1948J0783
$$ -9103 -28792 -54551 -47846 -52113 -30090 -13165 -18036 12529 33627 9180 -12768 -1985
13579a985j8946o043J248J6266L946j0230K3484J0031j0419J0249M662l4078p5245
$$ -1985 -20931 -26974 -25726 -9460 -5514 -15744 7740 17771 7352 17601 22263 -11815 -87060
13566h7060j4430L6681M2382m386r504K0800Q355J0426k0563l8234j4215R659
$$ -87060 -101490 -64809 -22427 -26813 -36317 -15517 -7162 3264 -17299 -55533 -69748 -60089
13554f0089J2260J3439q133k9L765J1273M426J5039K8115j182j3946k4687q499
$$ -60089 -47829 -34390 -42523 -42552 -38787 -27514 -23088 -8049 20066 18884 4938 -19749 -28248
13541b8248J5316J1978J268k501l5607l0630K2767K8051J0003j7126p860O40k3551
$$ -28248 -12932 -954 314 -2187 -37794 -68424 -45657 -17606 -7603 -24729 -32589 -31949 -55500
13528e5500p60K6266J2123q278K1776J631o576j017r438J3045J7077k2040q159
$$ -55500 -56260 -29994 -17871 -26149 -4373 -2742 -9318 -10335 -19773 -6728 10349 -11691 -19850
13515a9850K309K9565J9683n818O885j096k6222j2212j1616j0516o74q795L6894
$$ -19850 -17541 12024 31707 25889 32774 31678 5456 -6756 -18372 -28888 -29562 -38357 -1463
13502a463K5538q351j1027j0530n397j5732O131M286K3265p867p638n133j9335
$$ -1463 24075 15724 4697 -5833 -11230 -26962 -20831 -16545 6720 -1147 -8785 -13918 -33253
13489c3253k1234L89L4512J2838j9732j4593K668j8819k4457L0818M3477K686
$$ -33253 -54487 -54098 -19586 -6748 -26480 -41073 -38405 -57224 -81681 -50863 -7386 -4700
13477d700j6913n0124m93J6596j011J2769j357n074J1248J517J1730k114N221
$$ -4700 -21613 -71737 -72230 -55634 -56645 -43876 -45233 -50307 -39059 -37542 -25812 -27926 -22705
13464b2705k216M721J4477p401j436O48k0966j2691J6793J5397m504k3484n929
$$ -22705 -24921 -20200 -5723 -13124 -14560 -13912 -34878 -47569 -30776 -15379 -19883 -43367 -49296
13451d9296J939J6325j5444Q206L6782K5839o549q626P556l5518j2315J1943K3020
$$ -49296 -47357 -31032 -46476 -38270 -1488 24351 17802 9176 16732 -18786 -31101 -19158 3862
13438C862j5275K210K5583J1488P603p941j1136l3324Q098Q272L638K9322k0520
$$ 3862 -11413 -9203 16380 27868 35471 27530 16394 -16930 -8832 -560 3078 32400 11880
13425A1880j4175k5249J1008j978j6591j2219J0091J0485K557N625k8978j5543
$$ 11880 -2295 -27544 -16536 -18514 -35105 -47324 -37233 -26748 -24191 -18566 -47544 -63087
13413f3087M0903L3382O982j5136l0715j3998Q744o590k6276J4172K3897q423
$$ -63087 -22184 11198 18180 3044 -27671 -41669 -32925 -39515 -65791 -51619 -27722 -36145
13401c6145o232r05J7482J0755m884j8010O132K2697J17j4612M482j126N642M521
$$ -36145 -42377 -43282 -25800 -15045 -19929 -37939 -31807 -9110 -8993 -23605 -19123 -20249 -14607 -10086
13387a0086k0051q565J1726n66p79J1470O850j1293K1542j1005j3610J155K6068
$$ -10086 -30137 -38702 -26976 -27542 -28321 -16851 -10001 -21294 248 -10757 -24367 -23212 2856
13374B856K4334j6742K2299p491j8066k151l757k834k817k9975l139L0272M2277
$$ 2856 27190 10448 32747 25256 7190 5039 1282 -1552 -4369 -34344 -37483 -7211 35066
13361C5066M881j5923k0716r352k3639M568L9101K576j9426k9889j8440M944L3261
$$ 35066 39947 24024 3308 -6044 -29683 -25115 13986 16562 -2864 -32753 -51193 -46249 -12988
13348a2988l368o155p120J4565J8132k6083n904P587l5421k2751K2485q081k7885
$$ -12988 -16356 -22511 -29631 -15066 3066 -23017 -28921 -21334 -56755 -79506 -57021 -65102 -92987
13335i2987K0967n996K2795N257J8287o07J3529J2395o093P378q519k2237m806
$$ -92987 -72020 -78016 -55221 -49964 -31677 -32284 -18755 -6360 -12453 -5075 -13594 -35831 -40637
13322d0637J7722K7457J1m828j7487L137P025O531O958O516Q99j9515k3781K197
$$ -40637 -22915 4542 4553 -275 -17762 -14625 -7600 -1069 5889 12405 13304 -6211 -29992 -27795
13308b7795J0033N85L0276q116r419l1666j1497K3666J0917J0831O766j2736j7047
$$ -27795 -17762 -17177 13099 4983 -4436 -36102 -47599 -23933 -13016 -2185 4581 -8155 -25202
13295b5202o811J7501j5689J952L2703K776k7149j4314J813J1848n000o624K2027
$$ -25202 -32013 -14512 -30201 -28249 4454 7230 -19919 -34233 -32420 -20572 -25572 -32196 -10169
13282a0169L4695N554J6282n006j7342l700J5322K2383k7307l4754j8216P112
$$ -10169 24526 30080 46362 41356 24014 20314 35636 58019 30712 -4042 -22258 -15146
13270a5146K894J3346P883O995k4569k1724J0838m025J0643k682J7903n338k6523
$$ -15146 -12252 1094 8977 15972 -8597 -30321 -19483 -23508 -12865 -15547 2356 -2982 -29505
13257b9505n968J3890L7559P061p826K4220n197O174j2645M560K58m8142j7905
$$ -29505 -35473 -21583 15976 23037 15211 39431 34234 40408 27763 32323 32581 -15561 -33466
13244c3466M970k6346o316L6996K4499M966j4607P603L033K4559J9794l1048j927
$$ -33466 -28496 -54842 -61158 -24162 337 5303 -9304 -1701 1332 25891 45685 14637 12710
13231A2710j239n635J1924m710k2025r265R826J8553K611j0203J1122l593j1688
$$ 12710 11471 5836 17760 13050 -8975 -18240 -8414 10139 12750 2547 13669 10076 -1612
13218a612k4954n139j0807K2707P26Q994o565p31j146J8958j2351L044L0921J2454
$$ -1612 -26566 -31705 -42512 -19805 -19079 -10085 -16650 -17381 -18527 431 -11920 -8876 22045 34499
13204C4499k9914j6730J8612M647k3870P955L519L519J6618M25k6312k5217j2866
$$ 34499 4585 -12145 6467 11114 -12756 -4801 -1282 2237 18855 19280 -7032 -32249 -45115
13191d5115l603j005j0259K6394R526j3003M0428K2072j2372o120o399j1283j2026
$$ -45115 -48718 -49723 -59982 -33588 -24062 -37065 3363 25435 13063 6943 544 -10739 -22765
13178b2765L157M149j5832k0297J1030K5307o576j281K2800J5921j819M799j3100
$$ -22765 -19608 -15459 -31291 -51588 -40558 -15251 -21827 -23108 -308 15613 13794 18593 5493
13165E493j8031K581J8048Q752j4796K8560J0635j148k2071j8197k1435K8088
$$ 5493 -12538 -9957 8091 16843 2047 30607 41242 40094 18023 -174 -21609 6479
13153F479K5406K9104j9581m0346m0994m448P643o092j2158O933q686o353J0473
$$ 6479 31885 60989 41408 1062 -39932 -44380 -36737 -42829 -54987 -48054 -56740 -63093 -52620
13140e2620J5109j0794l437J5196p90O192j340K9609K5571p927j3745k9429j20
$$ -52620 -37511 -48305 -51742 -36546 -37336 -31144 -32484 -2875 22696 14769 1024 -28405 -28525
13127b8525L336o233q839j4459O601q856J7502L8172M3588P944j1738j1903k3801
$$ -28525 -25189 -31422 -40261 -54720 -48119 -56975 -39473 -1301 42287 50231 38493 26590 2789
13114B789j3213j6836k2429J6194Q535K9470J7599J0186k6175k2543L565M981
$$ 2789 -10424 -27260 -49689 -33495 -24960 4510 22109 32295 6120 -16423 -12858 -7877
13102g877j943l823j5303O858k442j9223L0704j031j5442M1001L786k8455j0272
$$ -7877 -9820 -13643 -28946 -22088 -24530 -43753 -13049 -14080 -29522 11479 15265 -13190 -23462
13089b3462j5709K357j583j041L3750O545O316J4917q346N117k0007O060K1146
$$ -23462 -39171 -36814 -38397 -39438 -5688 857 7173 22090 13744 18861 -1146 4914 26060
13076B6060K300j786l7932q164N142J7051j2110k0618p446K3790J5068j0396p99
$$ 26060 28360 26574 -11358 -19522 -14380 2671 -9439 -30057 -37503 -13713 1355 -9041 -9840
13063i840j46k0553J0203K6100J1554j3580p994q777n456L0309K1545J0482J4066
$$ -9840 -9986 -30539 -20336 5764 17318 3738 -4256 -13033 -18489 11820 33365 43847 57913
13050E7913j2013m775j5856j2526j9573j3612l370j4821K1603n284M717K1205
$$ 57913 45900 41125 25269 12743 -6830 -20442 -23812 -38633 -17030 -22314 -17597 3608
13038C608M2272n262l689l5655k0365K5833J4466l071L4949Q335k9129j8060k6694
$$ 3608 45880 40618 36929 1274 -19091 6742 21208 18137 53086 61421 32292 14232 -12462
13025a2462p952K8273R776j4472k2307J4900l727p212J650J6644P191q170J8288
$$ -12462 -20414 7859 17635 3163 -19144 -4244 -7971 -15183 -13533 3111 10302 2132 20420
13012B0420o817K150n210K6240K2512K1155k8681l5211o382J0939j4118R09k089
$$ 20420 13603 15753 10543 36783 59295 80450 51769 16558 10176 21115 6997 7906 5817
12999E817m901j1193O427L7134N565k9363j2505K8021l694j5729j9584R4K7914
$$ 5817 916 -10277 -3850 33284 38849 9486 -3019 25002 21308 5579 -14005 -13911 14003
12986A4003P429r439j6690K4304K7470j2006m3039j5778K4575J2777p609m905
$$ 14003 21432 11993 -4697 19607 47077 35071 -7968 -23746 829 13606 5997 1092
12974A092j5236J0871j588P592M384K8002J6741r09m1069J1856k712k0622K241
$$ 1092 -14144 -3273 -4861 2731 7115 35117 51858 50949 9880 21736 19024 -1598 643
12961F43O182J5832J4215k4440j0313m593J3221M7051O633k0918j5452j982J715
$$ 643 6825 22657 36872 12432 2119 -2474 10747 57798 64431 43513 28061 26079 27794
12948B7794k0572j3783k119J17J1693r778N092J9489j3977j1388N681L5089Q563
$$ 27794 7222 -6561 -8680 -8563 3130 -6648 -1556 17933 3956 -7432 -1751 33338 41901
12935D1901J124j8917o141O271m1181K6936J536Q176j5245q543K6856J6111r857
$$ 41901 43025 24108 17967 24238 -16943 9993 11529 19705 4460 -4083 22773 38884 29027
12922B9027j4352L5828J9044l9395j0553Q841q882J2309J0252N637q517J5474
$$ 29027 14675 50503 69547 30152 19599 28440 19558 31867 42119 47756 39239 54713
12910E4713l0577R876q377M611k980j2082j1064l7453j9308J9261J8407o125N635
$$ 54713 24136 34012 25635 30246 27266 15184 4120 -33333 -52641 -33380 -14973 -21098 -15463
12897a5463J9026L554J1277j0413P409J805l388j4196k6787J8937K3968K6073
$$ -15463 3563 7117 18394 7981 15390 17195 13807 -389 -27176 -8239 15729 41802
12885D1802k393m0976L400J5766P755j2407k446J1252j984j9432k6153J6912J6429
$$ 41802 39409 -1567 1833 17599 25354 12947 10501 21753 19769 337 -25816 -8904 7525
12872G525q773p639Q756o759j9274J1748P602o416j939o573R393O758K3185q702
$$ 7525 -1248 -8887 -131 -6890 -26164 -14416 -6814 -13230 -15169 -21742 -12349 -5591 17594 8892
12858H892m8437l0759J6607M0733J3987n248j3580n686J8129j901O962J3441k4649
$$ 8892 -39545 -70304 -53697 -12964 1023 -4225 -17805 -23491 -5362 -7263 -301 13140 -11509
12845a1509j8860L03J167l773L5775K4614L626k6106j9911j3265K6057K031m016
$$ -11509 -30369 -30066 -28899 -32672 3103 27717 31343 5237 -14674 -27939 -1882 149 -3867
12832c867L306m480J8178k7192j4348J3275k563j7363p325J0706R220L186p898
$$ -3867 -561 -5041 13137 -14055 -28403 -15128 -17691 -35054 -42379 -31673 -22453 -19267 -27165
12819b7165M759K935j6332r557N50j4416J3081M167M7L3743J1935j4053j309J4850
$$ -27165 -22406 -19471 -35803 -45360 -44810 -59226 -46145 -41978 -41931 -8188 3747 -10306 -11615 3235
12805C235O173K1448j7184q087j5569k0178j7937J1357N7248M5278k8840J773
$$ 3235 9408 30856 13672 5585 -9984 -30162 -48099 -36742 20506 65784 36944 38717
12793C8717r829k5737J1583J1372j1426l234j6442j7934J5144J2769J9725j4457
$$ 38717 28888 3151 14734 26106 14680 11446 -4996 -22930 -7786 4983 24708 10251
12781A0251K216K716k8388R87q16k9187P496M2364J8757j7657R547j3598q547
$$ 10251 12467 15183 -13205 -12218 -13034 -42221 -34725 7639 26396 8739 18286 4688 -3859
12768c859j626R80J0348p710J4217j5953q201j5413o708q41R1L6572R970r333
$$ -3859 -5485 -4505 5843 -1867 12350 -3603 -11804 -27217 -33925 -34766 -34675 1897 11867 2534
12754B534K2757J3627r001j8916j66P476o415O204l635k5412j0017K233j174j0498
$$ 2534 25291 38918 29917 11001 10835 18311 11896 18100 14465 -10947 -20964 -18731 -19905 -30403
12740c0403Q478k448Q851O258J8238j2753j9218K972J5100L6073P019k4078q512
$$ -30403 -21925 -24373 -15522 -9264 8974 -3779 -22997 -20025 -4925 31148 38167 14089 5577
12727E577M27l130K2046L765j3790k2425O470J3108q447L0644J5580n141k9778
$$ 5577 6004 2874 24920 28685 14895 -7530 -1060 12048 3601 34245 49825 44684 14906
12714A4906p195m424J8712K9j9473r969k7686P956L7933K342J3268j2703n366
$$ 14906 7711 3287 21999 22028 2555 -7414 -35100 -27144 10789 13131 26399 13696 8330
12701H330l033n572R211j3940J3008K0669l659j1478j7994j1703O230K6215K571
$$ 8330 5297 -275 8936 -5004 8004 28673 25014 13536 -4458 -16161 -9931 16284 18855
12688A8855l1385m472j3596L032K7702R580O991j7569l3551k580J4103L1307J7366
$$ 18855 -12530 -17002 -30598 -27566 136 9716 16707 -862 -34413 -36993 -22890 8417 25783
12675B5783k0394o284M668J171p268j5415J1364L5068k6631k4018j2838P280K7380
$$ 25783 5389 -895 3773 4944 -2324 -17739 -6375 28693 2062 -21956 -34794 -27514 -134
12662a34J4100L2696J506J1806j4292m8262o649K0920J614J9996l1993k5689K4856
$$ -134 13966 46662 48168 59974 45682 -2580 -9229 11691 13305 33301 1308 -24381 475
12649D75K711j0059J2056j7598R258J7084o825l4959r378J0298j3244J2072K1141
$$ 475 3186 -6873 5183 -12415 -3157 13927 7102 -27857 -37235 -26937 -40181 -28109 -6968
12636f968L1482K0539P804j2828p042m257K6555P578k0987r429o440J1389k545
$$ -6968 24514 45053 52857 40029 32987 28730 55285 62863 41876 32447 26007 37396 34851
12623C4851J708j0210j1586J5190o416J1070j451j6648K529K2347j140q036j3834
$$ 34851 36559 26349 14763 29953 23537 34607 33156 16508 19037 41384 40244 32208 18374
12610A8374j2527L809n956J804j5745L656L354R929l786q006L0216K2084R849
$$ 18374 5847 9656 3700 5504 -10241 -6585 -3231 6698 2912 -5094 25122 47206 57055
12597E7055j2837j8441J9165Q41k58J377j9547j3788m706K0985j3231k4855J0970
$$ 57055 44218 25777 44942 45783 45525 46902 27355 13567 8861 29846 16615 -8240 2730
12584B730K758Q561N440Q32l6373k4181o322L1622j5174j7083j5418k318O755
$$ 2730 5488 14049 19489 20321 -16052 -40233 -46555 -14933 -30107 -47190 -62608 -64926 -58171
12571e8171L8787J6637k0749j8392R784J3186L1560M598m5547m2637J1473L8719
$$ -58171 -19384 -2747 -23496 -41888 -32104 -18918 12642 17240 -28307 -70944 -59471 -20752
12559b0752K2133K8189K3857o300m6606j9174J4549K6064P902j330L815J2431
$$ -20752 1381 29570 53427 47127 521 -18653 -4104 21960 29862 28532 32347 44778
12547D4778N705l470j1627J0192k0023J1565K7015k470m4971l1107j5481J6272
$$ 44778 50483 47013 35386 45578 25555 37120 64135 61665 16694 -14413 -29894 -13622
12535a3622J9640J9502j6171l7997m961N786l3623L4221L6198J3244P644k5920
$$ -13622 6018 25520 9349 -28648 -33609 -27823 -61446 -27225 8973 22217 29861 3941
12523C941j0543o743k4910P782K27Q482j8784J1031Q561L0056J3948k4364K5977
$$ 3941 -6602 -13345 -38255 -30473 -30246 -21764 -40548 -29517 -20956 9100 23048 -1316 24661
12510B4661j0244j4662K2985L3516j4714l1139R701l277K077j5132J6575L748
$$ 24661 14417 -245 22740 56256 41542 10403 20104 16827 18904 3772 20347 24095
12498B4095m019m025l2454j5959Q797M101J6771M742j4244K8492P147J1319j5699
$$ 24095 20076 16051 -16403 -32362 -23565 -19464 -2693 2049 -12195 16297 23444 34763 19064
12485A9064L879j8152M673J7913m905k3884p946J4677j9499m695J6167K8410N615
$$ 19064 22943 4791 9464 27377 22472 -1412 -9358 5319 -14180 -18875 -2708 25702 31317
12472C1317j2564k6801N070M701J1589n018O056q669j8165j4863J0438M923K900
$$ 31317 18753 -8048 -2978 1723 13312 8294 14350 5681 -12484 -27347 -16909 -11986 -9086
12459i086P574p637P949L41J1944J1655J0552k0449O252p36j3006p475q046o631
$$ -9086 -1512 -9149 -1200 -859 11085 22740 33292 12843 19095 18359 5353 -2122 -10168 -16799
12445a6799l817J7061Q270J5169O750j7746o34J0896p140Q249J2412j7661k1634
$$ -16799 -20616 -3555 4715 19884 26634 8888 8254 19150 12010 20259 32671 15010 -6624
12432f624J877K5016P508p049m636K2789j984k4224J3234j907j2054j1568J0212
$$ -6624 -4747 20269 27777 20728 16092 38881 36897 12673 25907 24000 11946 378 10590
12419A0590J0590j3108n407P043J1826j5861j6985L469L3172K1349J4037l1819
$$ 10590 21180 8072 2665 9708 21534 5673 -11312 -7843 25329 46678 60715 28896
12407B8896j5520j5103k433J8392L981k7336j8674j42J2678J4435j4720L948p803
$$ 28896 13376 -1727 -4160 14232 18213 -9123 -27797 -27939 -15261 -826 -15546 -11598 -19401
12394a9401J837K8655L3590K1865m732J4998j2122l6542j9976J3476L563J1179
$$ -19401 -17564 11091 44681 66546 61814 76812 64690 28148 8172 21648 25211 36390
12382C6390J13n170J4589J0340j9408J3565m468k0289j864J9700M453m650m612
$$ 36390 36503 31333 45922 56262 36854 50419 45951 25662 23798 43498 47951 43301 38689
12369C8689j1179J243O906J8643r365k2286o202j6644N756J093K2316J3537L620
$$ 38689 27510 28753 35659 54302 44937 22651 16449 -195 5561 6654 28970 42507 46127
12356D6127M273j1038k8241m8173J4094q459J4084J4998j5475o984K4467L0535
$$ 46127 50400 39362 11121 -37052 -22958 -31417 -17333 -2335 -17810 -24794 -327 30208
12344C0208J6818m22O28j484j960j0162k9488M44J716L1235K7162O695j1540k9559
$$ 30208 47026 46604 47232 45748 43788 33626 4138 4582 6298 37533 64695 71390 59850 30291
12330C0291k9010q599J4366M734o604J8839M68P544J6331J4888k0452k8577j5851
$$ 30291 1281 -7318 7048 11782 5178 24017 24485 32029 48360 63248 42796 14219 -1632
12317a632P369K9838O235J6087J2416l154M505O521j2807r159P859j9802r621
$$ -1632 5737 35575 41810 57897 70313 67159 71664 78185 65378 56219 64078 44276 34655
12304C4655M491j6472k9628j9597J8148M5857M3782J4558n215k8476l4073j9447
$$ 34655 39146 22674 -6954 -26551 -8403 37454 81236 95794 90579 62103 28030 8583
12292H583N440K4711j6867K017K3717K0631N940j6204m755j2023j2651j211q914
$$ 8583 14023 38734 21867 23884 47601 68232 74172 57968 53213 41190 28539 27328 18414
12279A8414J5186J8780R210j3145k4763n631M872J219J5100Q072J4907N22j0339
$$ 18414 33600 52380 61590 48445 23682 18051 22923 24142 39242 47314 62221 62743 52404
12266E2404m182k0484k5993K9712K4431q921j9816K1499K9813k049k7870l2355
$$ 52404 48222 27738 1745 31457 55888 46967 27151 48650 78463 76414 48544 16189
12254A6189j1518j458j5093j8020M352J8283K5201p299n965n413K1369K799j33
$$ 16189 4671 3213 -11880 -29900 -25548 -7265 17936 10637 4672 -741 20628 23427 23294
12241B3294p258K0355O648k0490l240J409J8254L2915R506j1175m9481m6378j7166
$$ 23294 16036 36391 43039 22549 19309 20718 38972 71887 81393 70218 20737 -25641 -42807
12228d2807L0787K6919k4052J8161q408r273J6045J2598K5594K3216O564n910
$$ -42807 -12020 14899 -9153 9008 600 -8673 7372 19970 45564 68780 75344 69434
12216F9434j5109j8163k4673j0589K7790k0501j1675K3449L12J0011K4106j2994
$$ 69434 54325 36162 11489 900 28690 8189 -3486 19963 20275 30286 54392 41398
12204D1398P191j3139p550R029R944r24L478J3650O17J1549L924L981q034j5197
$$ 41398 48589 35450 27900 36929 46873 45949 49427 63077 63694 75243 79167 83148 75114 59917
12190E9917j5429L3424J0396j9158k8284j1586k5423M3426K9735q959J521j9939
$$ 59917 44488 77912 88308 69150 40866 29280 3857 47283 77018 68059 69580 49641
12178D9641k2200l4291j8446K3040L2920J8114l234l3928k5432m189q819J2278
$$ 49641 27441 -6850 -25296 -2256 30664 48778 45544 11616 -13816 -18005 -26824 -14546
12166a4546K6639J1733K301q566j3577M565K0778J326q136j4266K4347J6412j1339
$$ -14546 12093 23826 26127 17561 3984 8549 29327 30653 22517 8251 32598 49010 37671
12153C7671j5188O237q166l4291n51J0099K4344O589k840K348R311m804j3009
$$ 37671 22483 28720 20554 -13737 -14288 -4189 20155 26744 23904 26252 35563 30759 17750
12140A7750j8359N741N048K4859j7714K299J3990K4946j4643o465J4348L9226
$$ 17750 -609 5132 10180 35039 17325 19624 33614 58560 43917 37452 51800 91026
12128I1026L3732J1070m0648m0320j0831j2266o84J1031j7665j7745l577j5888
$$ 91026 124758 135828 95180 54860 44029 31763 31079 42110 24445 6700 3123 -12765
12116a2765Q267K1192k84J4500J3208K3750J4931j8843n1478k0342L3426K4848
$$ -12765 -4498 16694 16410 30910 44118 67868 82799 63956 12478 -7864 25562 50410
12104E0410M420o53j6177k3033K6276L9014q742l3519r067k4873j5347K099J2101
$$ 50410 54830 54177 38000 14967 41243 80257 71515 37996 28929 4056 -11291 -9192 2909
12091B909n358J9903K9596o621j4360L2067L5257k5854l4534j2779k2895R37J0341
$$ 2909 -2449 17454 47050 40429 26069 58136 93393 67539 33005 20226 -2669 -1732 8609
12078H609m812l70J5125J1400J864j2582j631M743l416l599k431K3375o95Q28
$$ 8609 3797 3427 18552 29952 31816 19234 17603 22346 18930 15331 12900 36275 35580 36408
12064C6408K789J5100J1128J4880j863k5563R102J0981M874k7359L888l880R207
$$ 36408 39197 54297 65425 80305 78442 52879 61981 72962 77836 50477 54365 50485 59692
12051E9692K0286j1402p874L975L1052J3123K352k954j5242j2159K4161p700j0927
$$ 59692 79978 68576 60702 64677 95729 108852 111204 108250 93008 80849 105010 97310 86383
12038H6383R73j361J1562j4729k290k2929j1539J3957J2431j8896k2084M225K4207
$$ 86383 87356 85995 97557 82828 80538 57609 46070 60027 72458 53562 31478 35703 59910
12025E9910J0363k2190J335J4349j9961j014j2085p065j680J3670k411j1630Q706
$$ 59910 70273 48083 49418 63767 43806 42792 30707 23642 21962 35632 33221 21591 30297
12012C0297P852L0576n673k9729J3515K4999o780o217q844j3157P434L839L077
$$ 30297 38149 68725 63052 33323 46838 71837 65057 58840 49996 36839 44273 48112 51189
11999E1189Q071J3948o387K643j0396j8041j137J4104J2662j788k757k9432j5871
$$ 51189 59260 73208 66821 69464 59068 41027 39890 53994 66656 64868 62111 32679 16808
11986A6808J2242K7023M9047l7317k1165R277J6445K6477N41j5925l4091o581
$$ 16808 29050 56073 105120 67803 46638 55915 72360 98837 99378 83453 49362 42781
11974D2781m513N349l0336N861J5156M4770J0990l6912k9216J5834j4419j1367
$$ 42781 38268 43617 13281 19142 34298 79068 90058 53146 23930 39764 25345 13978
11962A3978q677J334R429J232q147L0236K9511K1305k881J3704j2943n171k341
$$ 13978 5301 6635 16064 17296 9149 39385 68896 90201 87320 101024 88081 82910 80569
11949H0569k5088O426K4465K3511l102k4271j3579l0827J2527J9698R475R182
$$ 80569 55481 61907 86372 109883 106781 82510 68931 38104 50631 70329 79804 88986
11937H8986j4015k405k966j2455l9714o235J2000K2965j1000J2890K1617m084
$$ 88986 74971 72566 69600 57145 17431 11196 23196 46161 35161 48051 69668 65584
11925F5584n4188k8366K4234N622K1302J5650j0460J0419L2332J3649o915k3015
$$ 65584 11396 -16970 7264 12886 34188 49838 39378 49797 82129 95778 88863 65848
11913F5848k4438j1178J1m308K6993j2141k1200K6724J4203j2652k7898l7057
$$ 65848 41410 30232 30243 25935 52928 40787 19587 46311 60514 47862 19964 -17093
11901a7093M3767N9039Q090q674k085j7802O99j2035o42k9511r856K3914l1212
$$ -17093 26674 85713 93803 85129 83044 65242 65941 53906 53264 23753 13897 37811 6599
11888F599j5988J0156J1651J2448J737j4555j0750J1158n470P145N097l636L2835
$$ 6599 -9389 767 12418 24866 26603 12048 1298 12456 6986 14131 19228 15592 48427
11875D8427J5918J8046o247P834L211j5407j5655j7503P103J5888J2658K9254
$$ 48427 64345 82391 76144 83978 87189 71782 56127 38624 45727 61615 74273 103527
11863A03527j1860l1974J7089K5224l9842N201K6670q854K235k59l1742l1657
$$ 103527 91667 59693 76782 102006 62164 67365 94035 85181 87416 87157 55415 23758
11851B3758J0189k368J5092P485J4283K7408j0941k0016J5196n75m2483l534j0749
$$ 23758 33947 31579 46671 54156 68439 95847 84906 64890 80086 79511 37028 33494 22745
11838B2745Q18L0526r452j6186Q449K9246R801K489K1442L2451M613m1203j9244
$$ 22745 23563 54089 44637 28451 36900 66146 75947 78436 99878 132329 136942 95739 76495
11825G6495k0582Q584j530p291L094L2249l537l404Q73N595k9518r550j1307j6621
$$ 76495 55913 64497 62967 55676 58770 91019 87482 84078 84951 90546 61028 51478 40171 23550
11811B3550l922L4397R666J7118j3200j1610L0207J2733L843j5319R062J4255
$$ 23550 19628 54025 63691 80809 67609 55999 86206 98939 102782 87463 96525 110780
11799A10780J6962N033k5550k7143p149o009k491L6049j788l8484l4654J1835
$$ 110780 127742 132775 107225 80082 72933 66924 64433 100482 98694 60210 25556 37391
11787C7391J127J4360J1985N400J261k4747j3043j9030K7248K6944P863j7212
$$ 37391 38518 52878 64863 70263 71524 46777 33734 14704 41952 68896 76759 59547
11775E9547k2479J8265P82r230K3223J4959k2410j0931j7924O415P85K2640n519
$$ 59547 37068 55333 56115 46885 70108 85067 62657 51726 33802 40217 41002 63642 58123
11762E8123k0907K1250J1608l3438j4684J6419k472J0148M5355K337K4012Q302
$$ 58123 37216 58466 70074 36636 21952 38371 35899 46047 91402 93739 117751 126053
11750A26053m3452k7678p701k0453M990R580N853Q772L710o377J6874J0625j9424
$$ 126053 82601 54923 47222 26769 31759 41339 47192 55964 59674 53297 70171 80796 61372
11737F1372m023J5664j2786j6370N483K255J209L982N853P270k935K2742J2039
$$ 61372 57349 73013 60227 43857 49340 51595 52804 56786 62639 69909 66974 89716 101755
11724A01755N008n5336j0751P280q78J0778J2693L2124P814L046k5142j9247J6185
$$ 101755 106763 51427 40676 47956 47078 57856 70549 102673 110487 113533 88391 69144 85329
11711H5329J1330L615j764k9253j4294r300J5455P38K582J214k2250N034r157
$$ 85329 96659 100274 98510 69257 54963 45663 61118 61856 64438 65652 43402 48436 39279
11698C9279k0753m901J3988M1497L2769n619K7573R433k4731p014P827j2933J8355
$$ 39279 18526 13625 27613 69110 101879 96260 123833 133266 108535 101521 109348 96415 114770
11685A14770j2836k0103L366K9304K8418P856k9257j8556n780m234j5896Q353
$$ 114770 101934 81831 85197 114501 142919 150775 121518 102962 97182 92948 77052 85405
11673H5405K4834j8130l138K9434p920k3889k4756M239K1750J6847J2384j410
$$ 85405 110239 92109 88971 118405 110485 86596 61840 66079 87829 104676 117060 115650
11661A15650L4146j4459l5564k231J6083j13j4435k9698J0116J446R149M797K085
$$ 115650 149796 135337 99773 97542 113625 113512 99077 69379 79495 80941 90090 94887 96972
11648I6972J8866k3142j0904J4486J5890R239j0973r28n63O621k4968J6257l245
$$ 96972 115838 92696 81792 96278 112168 121407 110434 109506 108943 115564 90596 106853 103608
11635A03608k2375j5033Q47P167L6880O248k4811J3022L2783r194l8701j5071
$$ 103608 81233 66200 67047 74214 111094 117342 92531 105553 138336 129142 90441 75370
11623G5370J2782L1255J6795k313q659q270J5658m493q389k2931j7535j4863J2062
$$ 75370 88152 119407 136202 133889 125230 116960 132618 128125 119736 96805 79270 64407 76469
11610G6469m730n897K1549J178j5742J3876R899q320j1312k745J0017j311K2527
$$ 76469 71739 65842 87391 88569 72827 86703 96602 88282 76970 74225 84242 82931 105458
11597A05458J0597J0909Q621J9038K0130k2801k4764J5407j0041J3089J5980Q279
$$ 105458 116055 126964 135585 154623 174753 151952 127188 142595 132554 145643 161623 169902
11585A69902l7238j3498j1225k791J4617J0852j8945J0655J2763K2792J1476p782
$$ 169902 132664 119166 107941 105150 119767 130619 111674 122329 135092 157884 169360 161578
11573A61578k5858k1624J981J555K355N037j6739j4962J2630K4802J1663K2765
$$ 161578 135720 114096 116077 117632 119987 125024 108285 93323 105953 130755 142418 165183
11561A65183k7651k674l209l0796n992p244l666K7108L0787K2529O681l48L7262
$$ 165183 137532 134858 131649 100853 94861 87617 83951 111059 141846 164375 171056 170708 207970
11548B07970J5676J0029K1197L8322K9318L6887K1023K401l2283m5824m0764p393
$$ 207970 223646 233675 254872 293194 322512 359399 380422 382823 350540 304716 263952 256559
11536B56559k0816l2918p231M44n384n730L3819P798K1661R311K6817K7139R0868
$$ 256559 235743 202825 195594 196038 190654 184924 218743 226541 248202 257513 284330 311469 402337
11523D02337J04572Q5200N9660j4800q9976j17581j00932n0861m4763j843j4890
$$ 402337 506909 592109 651769 636969 546993 429412 328480 277619 232856 231013 216123
11512B16123K4338r905l9344K947L6272J6993k3779m3082N4266N6704L0808M5848
$$ 216123 240461 230556 191212 194159 230431 247424 223645 180563 234829 291533 322341 368189
11500C68189K9561J478m7990m0627l8474n4694k7125J5228j1374j2329L3423M632
$$ 368189 397750 399228 351238 310611 272137 217443 190318 205546 194172 181843 215266 219898
11488B19898J3316L0299K407m1734M0032J3927j5416J763N2588N6578N1320O0222
$$ 219898 233214 263513 265920 224186 264218 278145 262729 264492 317080 373658 424978 485200
11476D85200O6986O2563m569o1451q9557q4661q2892l7109j2394P37L4195J909
$$ 485200 552186 614749 610180 548729 459172 374511 291619 254510 242116 242853 277048 278957
11464B78957J5613J5714K8875L4841N3378N9080Q4458J13772J92162K29333J41769
$$ 278957 294570 310284 339159 374000 427378 486458 570916 684688 876850 1106183 1247952
11453A247952J2636j25426k16020k03777j40250p4024n0495j9696k7686k6415
$$ 1247952 1260588 1135162 919142 715365 575115 501091 450596 430900 403214 376799
11443C76799j9906r282J6997K0519J3409o272L8841N2895O8636J02760P2996K1031
$$ 376799 356893 347611 364608 385127 398536 392264 431105 484000 552636 655396 728392 749423
11431G49423J340n8723r8760p3831k9958o2192j1977l2999l9619M463j9287j9726
$$ 749423 750763 692040 593280 519449 489491 427299 415322 382323 342704 347167 327880 308154
11419C08154P931k910M399p595k42l6219k1733J3152P9340P7241O1971J04650
$$ 308154 316085 313175 317574 309979 309737 273518 251785 264937 344277 421518 483489 588139
11407E88139J09864N3850J0679l7982m4177l1458j3943j2141l274P18K1693N087
$$ 588139 698003 751853 762532 724550 680373 648915 634972 622831 619557 620275 641968 647055
11395F47055K3330m2993q9321o6340j9506N0583Q7399J29381J01609M6816k0541
$$ 647055 670385 627392 538071 471731 452225 502808 590207 719588 821197 868013 847472
11384H47472o9186p1095j00240j01461l1401P961Q106l174M7846L9377K467o427
$$ 847472 778286 707191 606951 505490 474089 482050 490156 486982 534828 574205 576672 570245
11372E70245q062k1502j6896n564O20L6718N8939N6285K8918J5541m0769p8820
$$ 570245 562183 540681 523785 518221 518841 555559 614498 670783 699701 715242 674473 595653
11360E95653p3318o7365k4506M919K0210M425J7285K6634M2967L8572K7114M3652
$$ 595653 522335 454970 430464 435383 455593 460018 477303 503937 546904 585476 612590 656242
11348F56242R6922J12623P2315P1631R8629Q8668N0186J7851L9827K1668K8155
$$ 656242 753164 865787 938102 1009733 1108362 1197030 1247216 1265067 1304894 1326562 1354717
11337A354717m2535p1543r1674j03264q3747m8822r339L5772L8679N5478J22060
$$ 1354717 1312182 1240639 1148965 1045701 961954 913132 903793 939565 978244 1033722 1155782
11326A155782J81247K31016L30892L89566L17111J16616o6121j11691r6092o9840
$$ 1155782 1337029 1568045 1898937 2288503 2605614 2722230 2656109 2544418 2448326 2378486
11316B378486k544L1233J8476M3460O4566O9771P9028J4535n4882j28117j56506
$$ 2378486 2375942 2407175 2425651 2469111 2533677 2603448 2682476 2697011 2642129 2514012 2357506
11305B357506j31673j5088J17871J45891J00579o1274k32623k85564k99339k51614
$$ 2357506 2225833 2210745 2328616 2474507 2575086 2513812 2281189 1995625 1696286 1444672
11295A444672j58775p2935m7386l5074j8163L1326M6733O0241J12789J39539J00316
$$ 1444672 1285897 1212962 1165576 1130502 1112339 1143665 1190398 1250639 1363428 1502967 1603283
11284A603283J11140J22790O6161J1069n2216j11336j47493j10047r4242p7982
$$ 1603283 1714423 1837213 1903374 1914443 1862227 1750891 1603398 1493351 1399109 1321127
11274A321127r4745j17764j38111q8470o1191m8308m3082l557J4959L8502O9704
$$ 1321127 1226382 1108618 970507 882037 820846 772538 729456 725899 740858 779360 849064
11263H49064J44074K26552K79854L14979K44497M2696j91633k94516l26558k25603
$$ 849064 993138 1219690 1499544 1814523 2059020 2101716 1910083 1615567 1289009 1063406
11253A063406j15738o1786k9517j5450L4186K0822J740L8167N9023J06240J43572
$$ 1063406 947668 885882 856365 840915 875101 895923 897663 935830 994853 1101093 1244665
11242A244665K38000L19548K76551J11026r4437k41859l34342k58356j72280j28056
$$ 1244665 1482665 1802213 2078764 2189790 2095353 1853494 1519152 1260796 1088516 960460
11232I60460j01694q9013m8851n4606l2194m706j1111j2481j5801o340m4655m3386
$$ 960460 858766 769753 720902 666296 634102 629396 618285 605804 590003 583663 539008 495622
11220D95622l8201l1418n942L1522L0541j2255k6212k2486j3913p909l3239Q46
$$ 495622 457421 426003 420061 451583 482124 469869 443657 421171 407258 399349 366110 366956
11208C66956K7006L6700K684j8120l1164j5192M0985K4221Q412o541j9383m9893
$$ 366956 393962 430662 433346 415226 384062 368870 409855 434076 442488 435947 416564 366671
11196C66671p7619l2879n003j4756j3617J09k7268K1068K9276L4263K1343Q846
$$ 366671 289052 256173 251170 236414 222797 222906 195638 216706 245982 280245 301588 310434
11184C10434j7091O301p94K9677K2499o884K8543L6236M8521M9199Q3969R9862
$$ 310434 293343 299644 298850 328527 351026 344142 372685 408921 457442 506641 590610 690472
11172F90472J36905J30372P7744L1168L1437K3262J3735O2937Q9972Q8295J22547
$$ 690472 827377 957749 1035493 1066661 1098098 1121360 1135095 1198032 1288004 1376299 1498846
11161A498846J26529J24363M4948L2858N1762J2788N153J621r271J7567o329o0104
$$ 1498846 1625375 1749738 1794686 1827544 1879306 1892094 1897247 1898868 1889597 1907164 1900835 1840731
11149A840731k4491L2972J19237J91132L03368M27713M96279N45691O19135N74907
$$ 1840731 1816240 1849212 1968449 2159581 2462949 2890662 3386941 3932632 4551767 5126674
11139E126674N61313O20587P92291J132701J669495K615348M011403N701535O984495
$$ 5126674 5687987 6308574 7100865 8233566 9903061 12518409 16529812 22231347 29215842
11130B9215842O589827L625362j033068n128768o934965o300749m446466k597351
$$ 29215842 35805669 39431031 38397963 33269195 26334230 20033481 15587015 12989664
11122A2989664j220058l22883J84643N29301P68193R01401J157952J704863K656535
$$ 12989664 11769606 11446723 11631366 12160667 12928860 13830261 14988213 16693076 19349611
11113A9349611M235878O785722J0264775J3813903J4861676J0538674J309350
$$ 19349611 23585489 30371211 40635986 54449889 69311565 79850239 81159589
11106H1159589q677909j4825873j5236281j1851787p824309m769696k767566j520043
$$ 81159589 72481680 57655807 42419526 30567739 22743430 17973734 15206168 13686125
11098A3686125p85246l76582r9355J39536M43051Q88194J566642K752969M532252
$$ 13686125 12900879 12524297 12424942 12564478 13007529 13895723 15462365 18215334 22747586
11089B2747586O634448Q056241P040741K760719l104958p523952q694994p196478
$$ 22747586 29382034 37438275 44479016 47239735 44134777 36610825 27915831 20719353
11081B0719353m856560k973065j659009q23808j94182K40440N27963P24933Q70349
$$ 20719353 15862793 12889728 11230719 10406911 10212729 10453169 10981132 11706065 12576414
11072A2576414R40363J020904J259563J719085K669159M214154O384254R293643
$$ 12576414 13516777 14537681 15797244 17516329 20185488 24399642 30783896 40077539
11064D0077539J2894719J5361266J3287551N358334n183464j2840652j4975485
$$ 40077539 52972258 68333524 81621075 86979409 81795945 68955293 53979808
11057E3979808j2410155q466312n094875k501449o70900N29429J241727J756984
$$ 53979808 41569653 33103341 28008466 25507017 24836117 25365546 26607273 28364257
11049B8364257K215627K926208M353088O815632J0803260J7007286K5095483L1726647
$$ 28364257 30579884 33506092 37859180 44674812 55478072 72485358 97580841 129307488
11041A29307488L0771283J7764476l768847k3702572l3772568l2077828k3773090
$$ 129307488 160078771 177843247 174074400 150371828 116599260 84521432 60748342
11034F0748342j5239303r196301n396967l083934j652162p08997m9564N88497
$$ 60748342 45509039 36312738 30915771 27831837 26179675 25470678 25421114 26009611
11026B6009611J432088K657486M443750O926733J0343351J4410424J6381715J2095775
$$ 26009611 27441699 30099185 34542935 41469668 51813019 66223443 82605158 94700933
11018I4700933J706750r536374j6382306j7038079j3460492r418918o429166m234103
$$ 94700933 96407683 86871309 70489003 53450924 39990432 30571514 24142348 19908245
11010A9908245k709141j632179q42914k97749J49456N48272Q06342J074980J423488
$$ 19908245 17199104 15566925 14724011 14426262 14575718 15123990 15930332 17005312 18428800
11001A8428800J932464K715974L933534N654273P785221R685872R966094P559787
$$ 18428800 20361264 23077238 27010772 32665045 40450266 50136138 60102232 67662019
10993F7662019K433543l526835p973489r495517q439669o556873m816424l396477
$$ 67662019 70095562 66568727 58595238 49099721 40660052 34103179 29286755 25890278
10985B5890278k121821r46399M4932P74491J397007K111408L230943N013929P776260
$$ 25890278 23768457 22822058 22866990 23641481 25038488 27149896 30380839 35394768 43171028
10976D3171028J1898786J6848760K0128397J8299018R995370j277881j0149703
$$ 43171028 55069814 71918574 92046971 110345989 120341359 119063478 108913775
10969A08913775j3296243j1032831p120445m199086k448905j441020p67167p33487
$$ 108913775 95617532 84584701 77464256 73265170 70816265 69375245 68608078 67874591
10961F7874591j858692l733087n262830o174361n634810l495943k05120L600632
$$ 67874591 66015899 62282812 57019982 50845621 45210811 41714868 41509748 45110380
10953D5110380O672020P384277M483135j201564o713676r634274r263618o872494
$$ 45110380 51782400 59166677 63649812 62448248 55734572 46100298 36836680 29964186
10945B9964186m246536k246749o77248O56399J860385K713437L035966K724177
$$ 29964186 25717650 23470901 22793653 23450052 25310437 28023874 31059840 33784017
10937C3784017J935536J367918J501166J921114K222146J891996J003492o3719
$$ 33784017 35719553 37087471 38588637 40509751 42731897 44623893 45627385 45563666
10929D5563666j217108k416959l244538l401029l005321k495075j904096j101045
$$ 45563666 44346558 41929599 38685061 35284032 32278711 29783636 27879540 26778495
10921B6778495r823R99477J936374K997340M255689N914029Q159167J1019498
$$ 26778495 26768672 27768149 29704523 32701863 36957552 42871581 51030748 62050246
10913F2050246J4090786J7305978K0146900K0725394J9140471J5556069R949197
$$ 62050246 76141032 93447010 113593910 134319304 153459775 169015844 178965041
10906A78965041M616692Q31690m72959L49113J76437k688112q554328j4617247
$$ 178965041 183581733 184413423 183940464 184289577 184466014 181777902 173223574 158606327
10898A58606327j8230567j7477993j2349629n737132L84858O027858J1777512
$$ 158606327 140375760 122897767 110548138 104811006 105195864 111223722 123001234
10891A23001234J8106549K5045623L3170837M3749243N4291929N5862224M0456253
$$ 123001234 141107783 166153406 199324243 243073486 297365415 353227639 393683892
10884C93683892J5105311m439285j2727643j1245693k318205J0582332K2256467
$$ 393683892 408789203 404349918 391622275 380376582 378058377 388640709 410897176
10877D10897176K4586052J6031422J963092q658681j2208028j0971894q336062
$$ 410897176 435483228 451514650 453477742 444819061 432611033 421639139 413303077
10870D13303077r008249j3999232j6913705j3772278q190740n272756r178953
$$ 413303077 404294828 390295596 373381891 359609613 351418873 346146117 336967164
10863C36967164k0370420l3428355m2283439m2409725l4368949k3731959j5363051
$$ 336967164 316596744 283168389 240884950 198475225 164106276 140374317 125011266
10856A25011266r799495m836435Q44710O972759J2745181J6037470J5075524J2065129
$$ 125011266 115211771 110375336 111220046 118192805 130937986 146975456 162050980 174116109
10848A74116109R750799R235616R186221P672122N154781N75926o466486j4153834
$$ 174116109 183866908 193102524 202288745 209960867 215115648 215691574 209225088 195071254
10840A95071254k0100386k2120508k1302145j9211898j5723175j1389422p245448
$$ 195071254 174970868 152850360 131548215 112336317 96613142 85223720 77978272
10833G7978272l540258O4040L679902P551470J1579156J4712788J6681041J9768258
$$ 77978272 74438014 74502054 78181956 85733426 97312582 112025370 128706411 148474669
10825A48474669K5178267K9931435K9152529J8257635r34981j8730377k7940718
$$ 148474669 173652936 203584371 232736900 250994535 250059554 231329177 203388459
10818B03388459k9419252k6449513k1998362j7740428j2663164o727644j010700
$$ 203388459 173969207 147519694 125521332 107780904 95117740 88390096 87379396
10811H7379396M190130R655498J6263418K4293876L3132216M0304907M0447767
$$ 87379396 91569526 101225024 117488442 141782318 174914534 215219441 255667208
10804B55667208K9635286J0431110j2046640l2309543m2342916l9600308l1281950
$$ 255667208 285302494 295733604 283686964 251377421 209034505 169434197 138152247
10797A38152247k4819209k0608576j7165471j4128598j1389188q705403o434108
$$ 138152247 113333038 92724462 75558991 61430393 50041205 41335802 34901694
10790C4901694m794827l611765k768725k106311j560770j150420p70397k90243
$$ 34901694 30106867 26495102 23726377 21620066 20059296 18908876 18138479 17848236
10782A7848236K50601Q84659J180872R51071N58515K92257k05360j005518j666078
$$ 17848236 18098837 18983496 20164368 21115439 21673954 21966211 21760851 20755333 19089255
10773A9089255j915077j995899j957801j704127j420657j133881q05176n13457
$$ 19089255 17174178 15178279 13220478 11516351 10095694 8961813 8156637 7643180
10765G643180l16709k35726k27933k62088k70864k23423j29322n2386R440M0811
$$ 7643180 7326471 7090745 6862812 6600724 6329860 6106437 5977115 5924729 5934169 5974980
10755E974980P1471J12367R8797J76236L02524M54746O48646Q50574J032012J145686
$$ 5974980 6046451 6158818 6257615 6433851 6736375 7191121 7839767 8690341 9722353 10868039
10745A0868039J238285J414132J878383K623897L619471M630601N247034N500958
$$ 10868039 12106324 13520456 15398839 18022736 21642207 26272808 31519842 37020800
10737C7020800O620055Q614679Q573310M240134j882258o301803q327364q496431
$$ 37020800 43640855 52255534 60828844 65068978 63186720 56884917 48557553 40061122
10729D0061122p302019n226770l307981k209235j558058p17371L54482J546229
$$ 40061122 32759103 27532333 24224352 22015117 20457059 19739688 20094170 21640399
10721B1640399K903909M624645O933912R526506J0383337P682662J313611o445106
$$ 21640399 24544308 29168953 36102865 45629371 56012708 63695370 65008981 58563875
10713E8563875j1120690j1310067r161038o562302m312614k735145j967841j767988
$$ 58563875 47443185 36133118 26972080 20409778 16097164 13362019 11394178 9626190
10705I626190j567891j206708r15639o99030n53723m62927l75957k98066k76150
$$ 9626190 8058299 6851591 5935952 5236922 4683199 4220272 3844315 3546249 3270099
10696C270099k26785j83617j47471q7254o6181k6509m2185m1581o4795j16196
$$ 3270099 3043314 2859697 2712226 2624972 2558791 2532282 2490097 2448516 2383721 2267525
10686B267525j13663j25767j25820j34409j27686j11472j03270j08032m5226J115
$$ 2267525 2153862 2028095 1902275 1767866 1640180 1528708 1425438 1317406 1272180 1273295
10676A273295l612J2146o218J0842N817p493M0080L4840N4720M8390K5326l3193
$$ 1273295 1269683 1281829 1275611 1286453 1292270 1284777 1324857 1359697 1414417 1462807 1488133 1454940
10664A454940m8649o1019p8912m8882m2538l2513l835k6507k0130k3996K400Q582
$$ 1454940 1406291 1345272 1266360 1217478 1174940 1142427 1138592 1112085 1091955 1067959 1070359 1078941
10652A078941L0292j0637j0171J2723K1780K3201N0221N5034N6569N7189L0615
$$ 1078941 1109233 1098596 1088425 1101148 1122928 1146129 1196350 1251384 1307953 1365142 1395757
10641A395757k7679o0301q9900o5942p3684p1072k224J4504n050l151K510L7493
$$ 1395757 1368078 1307777 1217877 1151935 1078251 1007179 1004955 1019459 1014409 1011258 1013768 1051261
10629A051261M3448M1838O9050O0430N7236J31910J29702J46058Q9176n8032j62421
$$ 1051261 1094709 1136547 1205597 1266027 1323263 1455173 1584875 1730933 1820109 1762077 1599656
10618A599656j95916j98275j28662q3343n0573n5583k1988n349M1737M8544N4524
$$ 1599656 1403740 1205465 1076803 993460 942887 887304 865316 859967 901704 950248 1004772
10607A004772O2268N4189M7696L8590Q1733P8168R1967M7086J3678p1256r2345
$$ 1004772 1067040 1121229 1168925 1207515 1289248 1367416 1459383 1506469 1520147 1448891 1356546
10596A356546j01795o0812l3686l3087p1368m1138m0298o577K7206K2550J8749
$$ 1356546 1254751 1193939 1160253 1127166 1055798 1014660 974362 967785 994991 1017541 1036290
10585A036290m239L9845P3007Q6522J00599P1440N3523q980L324M178N553j0362
$$ 1036290 1032051 1071896 1144903 1231425 1332024 1403464 1456987 1448007 1451331 1455509 1461062 1450700
10573A450700K473k2428k3765k0362j9759R283K6415J5569J3648L3484K5141O1031
$$ 1450700 1453173 1430745 1406980 1386618 1366859 1376142 1402557 1418126 1431774 1465258 1490399 1551430
10561A551430P1004Q4679R9342O4117M7620m4298m7280K109k3655j17260j59875
$$ 1551430 1622434 1707113 1806455 1870572 1918192 1873894 1826614 1828723 1805068 1687808 1527933
10550A527933j36967j04745l6385l6325l6854l7161j8273J4778L2829R5670O2467
$$ 1527933 1390966 1286221 1249836 1213511 1176657 1139496 1121223 1136001 1168830 1264500 1326967
10539A326967O0943O0324L2703L7910j7571K0089L6462n1303j24402r6274r1206
$$ 1326967 1387910 1448234 1480937 1518847 1501276 1521365 1557827 1506524 1382122 1285848 1194642
10528A194642q0259j9312L8370L8198J4005J9684j994J5288J3518K2380M4152
$$ 1194642 1114383 1095071 1133441 1171639 1185644 1205328 1203334 1218622 1232140 1254520 1298672
10517A298672L0158L898N248P573J728r566k8017n7085l6859k0844j5422j0946
$$ 1298672 1328830 1332728 1337976 1345549 1347277 1337711 1309694 1252609 1215750 1194906 1179484 1168538
10505A168538N4611N5005K7122L5569Q5984R8466P3554J10184Q8073O4199P7688
$$ 1168538 1223149 1278154 1305276 1340845 1426829 1525295 1598849 1709033 1797106 1861305 1938993
10494A938993Q1105R8854Q6602M9295M6195N1337K1899L1660O0649J03240Q2451
$$ 1938993 2020098 2118952 2205554 2254849 2301044 2352381 2374280 2405940 2466589 2569829 2652280
10483B652280J48947J96002J99791K79396L84831M42846N26018O42711Q16549
$$ 2652280 2801227 2997229 3197020 3476416 3861247 4304093 4830111 5472822 6289371
10474F289371J002657J178979J427330J622766J660010J630150J757463K239958
$$ 6289371 7292028 8471007 9898337 11521103 13181113 14811263 16568726 18808684
10466A8808684L241813M913941P186258R363548R779175O481475J471666j800852
$$ 18808684 22050497 26964438 34150696 43514244 53293419 59774894 61246560 59445708
10458E9445708k404619j179833N4557L12514q91088k711304l666984l236078j771660
$$ 59445708 57041089 55861256 55915813 56228327 55337239 52625935 48958951 45722873 43951213
10449D3951213p5853J712961L569137N332115P640308J0437765J2594190J2683443
$$ 43951213 43875360 45588321 49157458 54489573 62129881 72567646 85161836 97845279
10441I7845279R837866M663123l72499j712352n11800p0399r07962r59895j79509
$$ 97845279 107683145 112346268 111973769 110261417 109749617 109679218 108771256 107811361 107631852
10432A07631852l89552j438128k629801l458189l649559l627247l344734k080192
$$ 107631852 107242300 105804172 103174371 99716182 96066623 92439376 89094642 87014450
10424H7014450P35932L534421L996635K576768n68170m252414n668828l446582
$$ 87014450 87750382 91284803 95281438 97858206 97290036 93037622 87368794 83922212
10416H3922212L06920K593490L300485L207638K540274K625312L517704L390693
$$ 83922212 84229132 86822622 90123107 93330745 95871019 98496331 102014035 105404728
10408A05404728J756838j186417n242382q544613r475822p493750m901642m566565
$$ 105404728 107161566 105975149 100732767 92188154 82712332 75218582 70316940 65750375
10400F5750375n548385n585366m969375m076739k808551j593603k75300J549515
$$ 65750375 60201990 54616624 49647249 45570510 42761959 41168356 40893056 42442571
10392D2442571K916055K997414K204025J877929K271586K368702J782324m601
$$ 42442571 45358626 48356040 50560065 52437994 54709580 57078282 58860606 58856005
10384E8856005j591154j494578m8334J990505K971807K150613J13498k19171K976852
$$ 58856005 57264851 55770273 55721939 57712444 60684251 62834864 62948362 62729191 65706043
10375F5706043O679287P424890M452660o77109m278261n211407l746547j601588
$$ 65706043 72385330 79810220 84262880 83585771 79307510 74096103 70349556 68747968
10367F8747968j779709l587465m530571l694624j175621K077049N348982Q816406
$$ 68747968 66968259 63380794 58850223 55155599 53979978 56057027 61406009 70222415
10359G0222415J1447736J0151531N551676L566741P536157J3898024J8013475
$$ 70222415 81670151 91821682 97373358 100940099 108476256 122374280 140387755
10352A40387755J6098664O850240k275851n279822l556345q16336j922116n904589
$$ 140387755 156486419 163336659 161060808 155780986 152224641 151408305 149486189 143581600
10344A43581600p077115n740442n942948p763420p821855n435253l164136l087881
$$ 143581600 136504485 130764043 124821095 117057675 109235820 103800567 100636431 97548550
10336I7548550m222550l504602J40407M809072Q512092R546426P289407M556662
$$ 97548550 93326000 89821398 89961805 94770877 103282969 112829395 120118802 124675464
10328A24675464L967969M866220N531021L749816n98305l187003j372545L12623
$$ 124675464 128643433 133509653 139040674 142790490 142192185 139005182 137632637 137945260
10320A37945260k851037q340859j2654228j5171454j5910732j4153163j0743801
$$ 137945260 135094223 126753364 114099136 98927682 83016950 68863787 58119986
10313E8119986p494340m821719k672550j297759l58805R40898K353858L214013
$$ 58119986 50625646 45803927 43131377 41833618 41474813 42415711 44769569 47983582
10305D7983582L346177K603990R90687l97712n11966M26641Q74593j12815k679187
$$ 47983582 51329759 53933749 54924436 54526724 54014758 54441399 55315992 55203177 52523990
10296E2523990o306096q569308q191435o404655m606855l308138k416874j693191
$$ 52523990 46217894 37648586 29457151 23052496 18445641 15137503 12720629 11027438
10288A1027438j188431j042179j055913r26441p62446n77335m49991m33006m04480
$$ 11027438 9839007 8796828 7740915 6814474 6052028 5474693 5024702 4591696 4187216
10279D187216l48410k92636k36585k14628j61110j30533j10772j12082j26699
$$ 4187216 3838806 3546170 3309585 3094957 2933847 2803314 2692542 2580460 2453761
10270B453761r8686p8067n1498o4916r9031o1597k8689k5674l3571m2520l6319
$$ 2453761 2355075 2277008 2225510 2160594 2061563 1999966 1971277 1945603 1912032 1869512 1833193
10259A833193j3830p4533n6007l199o0931o3886m5608k8974l0128m2063k1399
$$ 1833193 1819363 1744830 1688823 1685624 1624693 1560807 1515199 1486225 1456097 1414034 1392635
10248A392635N298J3766M161j0063O288J7022J0052k327r772M918p428M1590L6448
$$ 1392635 1397933 1411699 1415860 1405797 1412085 1429107 1439159 1436832 1427060 1431978 1424550 1466140 1502588
10235A502588p453j9398m2338p3065o2127m9259k1894j0903k3404l2025q009J1772
$$ 1502588 1495135 1475737 1433399 1360334 1298207 1248948 1227054 1216151 1192747 1160722 1152713 1164485
10223A164485N6152J7135k0812l1867o6972n0982k8536k1940j26q124K0646R86
$$ 1164485 1220637 1237772 1216960 1185093 1118121 1067139 1038603 1016663 1016537 1008413 1029059 1030045
10211A030045l3370K6767L3513K2143L0199L7883p413K3905M8195K6657L113K115
$$ 1030045 996675 1023442 1056955 1079098 1109297 1147180 1139767 1163672 1211867 1238524 1241637 1243752
10199A243752p226p552j5184J0722J7769J3540l9306n8065q5396o3576m0364m4599
$$ 1243752 1236526 1228974 1213790 1224512 1242281 1255821 1216515 1158450 1073054 1009478 969114 924515
10187I24515j7469j4006j7024k5081O281j2850p171M573J875j0431q779j7044
$$ 924515 907046 893040 876016 850935 857216 844366 837195 841768 843643 833212 824433 807389
10175H07389n307N786J7897M571O322J1175L869Q346J0720J8486K2021J2314Q78
$$ 807389 802082 807868 825765 830336 836658 847833 851702 860048 870768 889254 911275 923589 924467
10162I24467p52O37Q124K4948P1665Q2471N8893M1500J6487O671k9410o1746m0195
$$ 924467 923715 924352 932476 957424 1029089 1111560 1170453 1211953 1228440 1235111 1205701 1143955 1103760
10149A103760K2203N7855Q2109N0032K7619K7379K8893N0322O876n560m0166p4797
$$ 1103760 1125963 1183818 1265927 1315959 1343578 1370957 1399850 1450172 1457048 1451488 1411322 1336525
10137A336525k5653m76L8825O5749P0573O2659J3845n1193n970L7198O8121N1179
$$ 1336525 1310872 1310396 1349221 1414970 1485543 1548202 1562047 1510854 1504884 1542082 1610203 1661382
10125A661382L8385J783n6038j45705q7380l4049j9369m1219o3493r1526p2903
$$ 1661382 1699767 1701550 1645512 1499807 1412427 1378378 1359009 1317790 1254297 1162771 1089868
10114A089868n6044n9296n2779m5611j9787l4439k2283J0841K1131P481k9233
$$ 1089868 1033824 974528 921749 876138 856351 821912 799629 810470 831601 839082 809849
10103H09849n6839k6504J4089J6778O232j2793R704K2575j325M545J9210L3529
$$ 809849 753010 726506 740595 757373 763605 750812 760516 783091 781766 786311 805521 839050
10091H39050J9392n296K585N6295N5804k514n1474n5313p2892m9066k6551l7390
$$ 839050 858442 853146 855731 912026 967830 965316 913842 858529 785637 736571 710020 672630
10079F72630n6791l2301j7696J1406J6187M6595O5520Q1358O9793J05902O5975
$$ 672630 615839 583538 565842 577248 593435 640030 705550 786908 856701 962603 1028578
10068A028578L6194L2444L4157N257j6476l3629m013j1885J5786J3138l2843m8208
$$ 1028578 1064772 1097216 1131373 1136630 1120154 1086525 1082512 1070627 1086413 1099551 1066708 1018500
10056A018500r3865j05446n6701l0382j0311Q481j165M655j841L9928N3409L8170
$$ 1018500 924635 819189 762488 732106 721795 730276 729111 733766 731925 771853 825262 863432
10044H63432N9817N4939K0482J0314P019n2526o6297o1301k3901Q985M5075J4383
$$ 863432 923249 978188 998670 1008984 1016003 963477 897180 835879 811978 820963 866038 880421
10032H80421j2453l0991r58K1218l488l466k82K9338K6088M489o754m623P705
$$ 880421 867968 836977 836019 857237 853749 850283 850001 879339 905427 909916 903162 898539 906244
10019I06244K7417J2370J3332j3307l0074l2046l4662n1612j4550L6351K3622
$$ 906244 933661 946031 959363 946056 915982 883936 849274 797662 783112 819463 843085
10008H43085L1714P5865M8454M5278L7286M6422L9382o955n0342j1056j9909l0935
$$ 843085 874799 950664 999118 1044396 1081682 1128104 1167486 1160531 1110189 1099133 1079224 1048289
9996A048289j137r205K7822K375k1652o7428l9032j9520k1656p393k8725N939
$$ 1048289 1047152 1037947 1065769 1068144 1046492 979064 940032 920512 898856 891463 862738 868677
9984H68677k6980n4742l8015p5477o4106n9634k6847K4994L3124K6748K1244K5003
$$ 868677 841697 786955 748940 673463 609357 549723 522876 547870 580994 607742 628986 653989
9972F53989L1682m275j2029O480R20K3586K4997j4116N745J844K5766M1618n212
$$ 653989 685671 681396 669367 675847 676767 700353 725350 711234 716979 718823 744589 786207 780995
9959G80995k7312m3658m3990j784k4453j6860o646J812r951o02j9051j4757q890
$$ 780995 753683 710025 666035 664251 639798 622938 616292 618104 608153 607551 588500 573743 564853
9946E64853J9533K1747P1338Q5975O7914M8684M3803N3111K7686K3433P532L5702
$$ 564853 584386 606133 677471 763446 831360 880044 923847 976958 1004644 1028077 1035609 1071311
9934A071311M3173J4711L7777K6873o021l9041j4494k2961n8858o2706n1089P454
$$ 1071311 1114484 1129195 1166972 1193845 1187824 1148783 1134289 1111328 1052470 989764 938675 946129
9922I46129N740K462k4159j6636K2992J4825J2191K8943Q1263O5590M4217N0823
$$ 946129 951869 954331 930172 913536 936528 951353 963544 992487 1073750 1139340 1183557 1234380
9910A234380M1391K3551J7091M2259K7927J5493l7902n7417p4175j02150p9829
$$ 1234380 1275771 1299322 1316413 1358672 1386599 1402092 1364190 1306773 1232598 1130448 1050619
9899A050619p3150q8268o1679n5552k1577J7184P065K5191K5714Q151K2167M4136
$$ 1050619 977469 889201 827522 771970 750393 767577 774642 799833 825547 833698 855865 900001
9887I00001O0124P8759N0654N6731O1759M8567J17669J83601J99273J95745K22198
$$ 900001 960125 1038884 1089538 1146269 1208028 1256595 1374264 1557865 1757138 1952883 2175081
9876B175081K02024J71366J93120J44589K5220l3780l9024p2730j03977j55957
$$ 2175081 2377105 2548471 2741591 2886180 2911400 2877620 2838596 2765866 2661889 2505932
9866B505932j31121j03762j08010j39288j58531j94272k16625j93173j27867p8099
$$ 2505932 2374811 2271049 2163039 2023751 1865220 1670948 1454323 1261150 1133283 1055184
9856A055184o5492j8799k1153K3661K9830K0897K3277J3814O283J5690K7166N2207
$$ 1055184 989692 970893 949740 973401 1003231 1024128 1047405 1061219 1067502 1083192 1110358 1162565
9844A162565N9290N1948K7114O0814M4869L4678L7091M4701M7813O4063P2907
$$ 1162565 1221855 1273803 1300917 1361731 1406600 1441278 1478369 1523070 1570883 1634946 1707853
9833A707853J20166J31254J56761J76964J71629J51339J72077K13111J96010K59313
$$ 1707853 1828019 1959273 2116034 2292998 2464627 2615966 2788043 3001154 3197164 3456477
9823C456477L01371L72617N11927O74407Q22756R88417J212272J427632J726044
$$ 3456477 3757848 4130465 4642392 5316799 6139555 7127972 8340244 9767876 11493920
9814A1493920K101642K621437L379541M485463O084406P945454R146274R168421
$$ 11493920 13595562 16216999 19596540 24082003 30166409 38111863 47258137 56426558
9806E6426558Q843831Q504343P349304M832008J297790l073626p940942j1790078
$$ 56426558 65270389 73774732 81124036 85956044 87253834 84180208 76239266 64449188
9798F4449188j2968440j1590436q822661o168295m238042k917544j952288j300582
$$ 64449188 51480748 39890312 31067651 24899356 20661314 17743770 15791482 14490900
9790A4490900q01609l37699M9297L71358O47204Q97099J248004J773316K438128
$$ 14490900 13689291 13351592 13400889 13772247 14419451 15316550 16564554 18337870 20775998
9781B0775998L254209M299500N538172O236296N785151N197965O031218P690492
$$ 20775998 24030207 28329707 33867879 40104175 45889326 51087291 57118509 64809001
9773F4809001P846462M784010L133m685859r164528j1359108j0287262q052577
$$ 64809001 72655463 77439473 77442606 72756747 63592219 52233111 41945849 33893272
9765C3893272o151099m558702l119374j928655j143372q04852n21075p0049M34345
$$ 33893272 27742173 23183471 20064097 18135442 16992070 16187218 15666143 15596094 16030439
9756A6030439R15672J349087J831693K556232L321761L971298M215143M757894
$$ 16030439 16946111 18295198 20126891 22683123 26004884 29976182 34191325 38949219
9748C8949219O272404P414363O956959O738149Q140667R175409Q926142Q065793
$$ 38949219 45221623 52635986 59592945 66331094 74471761 83647170 92573312 100639105
9740A00639105O679070M794197K243231j28637j143932k631507m960166q132472
$$ 100639105 107318175 112112372 114355603 114226966 113083034 110451527 105491361 97358889
9732I7358889j1600985j3205268j2050149r122912n766122k743362k42586J838234
$$ 97358889 85757904 72552636 60502487 51379575 45613453 42870091 42627505 44465739
9724D4465739L777038N661435P251178Q592767R910882J1609072J3171539J2142638
$$ 44465739 48242777 53904212 61155390 69748157 79659039 91268111 104439650 116582288
9716A16582288Q039901M268788M127557M832943J566580m707559j0021746j1861050
$$ 116582288 124622189 128890977 133018534 137851477 139418057 134710498 124688752 112827702
9708A12827702r075401k996705K097256K323139j449309o038049j0252052j2712142
$$ 112827702 103752301 100755596 102852852 105175991 103726682 97688633 87436581 74724439
9700G4724439j1968019r137493o131444l468022q37096J745119M115836N644157
$$ 74724439 62756420 53618927 47487483 44019461 43182365 44927484 49043320 54687477
9692E4687477N468462L771657K221686K021716K350258J432593q93549l510988
$$ 54687477 60155939 63927596 66149282 68170998 70521256 71953849 71060300 67549312
9684F7549312n782772o401868m832772k067110Q08746K683467K962086K986798
$$ 67549312 61766540 55364672 50531900 48464790 49273536 51957003 54919089 57905887
9676E7905887L553861L403175K887397J604890r47799l283327n361411o761535
$$ 57905887 61459748 64862923 67750320 69355210 68407411 65124084 59762673 53001138
9668E3001138o897418o058491m344090k272031j99171J682435L430177N107946
$$ 53001138 46103720 40045229 35701139 33429108 33229937 34912372 38342549 43450495
9660D3450495O283420O794951P430523Q802975R582980P937487O782438P888748
$$ 43450495 49733915 56528866 63959389 72762364 82345344 90282831 97065269 104954017
9652A04954017Q849309Q418402O970346L587253j748979n049302l816450k560203
$$ 104954017 113803326 122221728 129192074 132779327 131030348 125981046 122164596 119604393
9644A19604393n569651j0544856j4611082j5270691j2052744p680274m858358
$$ 119604393 114034742 103489886 88878804 73608113 61555369 53875095 49016737
9637D9016737l895364l379212k239487o23622R83225K792827N014182P028746
$$ 49016737 45121373 41742161 39502674 38879052 39862277 42655104 47669286 54698032
9629E4698032P717441Q226198R858575J0809407Q340175J960521m720753p866959
$$ 54698032 62415473 70641671 80500246 91309653 99649828 101610349 96889596 89022637
9621H9022637p215652n136416m364119n991884r068031j1175749j0614957q161311
$$ 89022637 81806985 76670569 72306450 66314566 57246535 46070786 35455829 27294518
9613B7294518n526944l523571k247576j571999j308382j195769r93462o87532
$$ 27294518 21767574 18244003 15996427 14424428 13116046 11920277 10926815 10239283
9605A0239283m02795k08921q591J98655L81642M09562M42137O56938J035588J606579
$$ 10239283 9836488 9627567 9618976 9817631 10199273 10608835 11050972 11707910 12743498 14350077
9595A4350077K285809L092578L997129M605688M831215M939472N048260M015619
$$ 14350077 16635886 19728464 23725593 28331281 33162496 38101968 43150228 47165847
9587D7165847R62474q62812o67669j239060l191410m649121m876428n167057n285143
$$ 47165847 48128321 47265509 46597840 45358780 42167370 37518249 32641821 27474764 22189621
9578B2189621m383733l081982j978984j209191o87840k76987L4932L02788N63732
$$ 22189621 17805888 14723906 12744922 11535731 10847891 10570904 10605836 10908624 11472356
9569A1472356Q14726J086501J427072J922034K533914L502626N023335O385516
$$ 11472356 12287082 13373583 14800655 16722689 19256603 22759229 27782564 34168080
9561C4168080O300282N498677N295424L999780J89017m700222q023341r008328
$$ 34168080 40468362 45967039 51262463 55262243 55451260 50751038 42727697 33719369
9553C3719369p918754n746669l647168k320305j960740k009410j777519j383032
$$ 33719369 25800615 20053946 16406778 14086473 12125733 10116323 8338804 6955772
9545F955772j033122p51541n21545l99580l38766l20547l81922l86706l69082
$$ 6955772 5922650 5171109 4649564 4249984 3911218 3590671 3208749 2822043 2452961
9536B452961k93447j77234j49160j55225j16295j06751j31233r2803n0609m5034
$$ 2452961 2159514 1982280 1833120 1677895 1561600 1454849 1323616 1230813 1180204 1135170
9526A135170l5345o9077n5656l6178k9472o1167k9935k0063l4989j2585K3385
$$ 1135170 1099825 1030748 975092 938914 909442 848275 818340 798277 763288 750703 774088
9515G74088K7781M437k0646l0651j8590o274n719k8560m5058m682m301l6096r108
$$ 774088 801869 806306 785660 755009 736419 730145 724426 695866 650808 646126 641825 605729 596621
9502E96621J5229L5933K9364J2575R174J5593k8978m0448K2030N693L892J5625
$$ 596621 611850 647783 677147 689722 698896 714489 685511 645063 667093 672786 676678 692303
9490F92303J9627M1974N1459K2902P3017P2399N6916K9485J2545M0738K5937K8434
$$ 692303 711930 753904 805363 828265 901282 973681 1030597 1060082 1072627 1113365 1139302 1167736
9478A167736O735m8400p5028j11709j02653m9695l8465j3664n2371p2019n9217
$$ 1167736 1174471 1126071 1051043 939334 836681 786986 748521 734857 682486 610467 551250
9467E51250m5945n5897p689m066l8577m3351m8253k7648k0006n415L892p10l3653
$$ 551250 505305 449408 441719 437653 399076 355725 307472 279824 259818 254403 258295 257585 223932
9454B23932J3856P640k498j1442R617r07K491j328k195P621O175n88J064J751
$$ 223932 237788 245428 242930 231488 241105 240198 242689 241361 239166 246787 252962 252374 253438 255189
9440B55189J413k4230j9456P702K2325J5201J5125L9729j7170k7599J2858K1790
$$ 255189 256602 232372 212916 220618 242943 258144 273269 312998 295828 268229 281087 302877
9428C02877o093P8k0012l0837l4277k6629l1773J8226K6824J2847O813k1647n957
$$ 302877 296784 296862 276850 246013 211736 185107 153334 171560 198384 211231 218044 196397 190440
9415A90440J6168L486K5371L9516M1588N911K3295L737j4597j8218L1545j2533
$$ 190440 206608 210094 235465 274981 316569 322480 345775 349512 334915 316697 348242 335709
9403C35709k0920j5040l5151k5410m238K949k055O555J2661k25M145J1920N922
$$ 335709 314789 299749 264598 239188 234950 237899 235844 242399 255060 254835 258980 270900 276822
9390B76822K2101L2984L8576M6729P0830R2875J17646R6026P623p4166p9167q8364
$$ 276822 298923 331907 370483 417212 488042 580917 698563 794589 802212 728046 648879 560515
9378E60515j07511o4652l1455j5242n659j4002r683k0217m3219k045J5141p277
$$ 560515 453004 388352 356897 341655 335996 321994 312311 292094 248875 246830 261971 254694
9366B54694j0486Q659j3586J1121K5773p730K2742M0471K3678M0936M1529J1249
$$ 254694 244208 252867 239281 250402 276175 268445 291187 331658 355336 396272 437801 449050
9354D49050M9354R9649Q5073J6281n5786m8468n9002n4595k5656j6772k8953j3997
$$ 449050 498404 598053 683126 699407 643621 595153 536151 481556 455900 439128 410175 396178
9342C96178n013r545j40j2153J5977j2148k6673l1000k1875L0246J0156J4092
$$ 396178 391165 381620 381480 369327 385304 373156 346483 315483 293608 323854 334010 348102
9330C48102M4151K6499R023L1929J0320K9949M7582O5204Q5195R4611R6818N9771
$$ 348102 392253 418752 427775 459704 470024 499973 547555 612759 697954 792565 889383 949154
9318I49154J3716P320k267m337j5336n4545r0807o2872p5241p6338l0645p601
$$ 949154 962870 970190 967923 963586 948250 893705 802898 740026 664785 588447 557802 550201
9306E50201j699R223j4104K7992N7512M2556P3659Q5000J14719R7047M2356J4808
$$ 550201 548502 557725 543621 571613 629125 671681 745340 830340 945059 1042106 1084462 1099270
9294A099270J0091J632L5937O2678N1930R372k6446k5526r125O791M0949K6913
$$ 1099270 1109361 1110993 1146930 1209608 1261538 1270910 1244464 1218938 1209813 1216604 1257553 1284466
9282A284466m5974p2042l1905q114L2112L4923N3717Q4570M2671L8178R9247J13795
$$ 1284466 1238492 1166450 1134545 1126431 1158543 1193466 1247183 1331753 1374424 1412602 1511849 1625644
9270A625644R9402P7228J11264Q8641N5288K5724M329M9696O7273R2970O3428
$$ 1625644 1725046 1802274 1913538 2002179 2057467 2083191 2087520 2137216 2204489 2297459 2360887
9259B360887Q6677J40915J35702J88800J69076J26357J35366J25634J15709M7409
$$ 2360887 2447564 2588479 2724181 2912981 3082057 3208414 3343780 3469414 3585123 3632532
9249C632532K2163L4672K7133L0291M3525L9506L1579k9926k0821o6481q1246
$$ 3632532 3654695 3689367 3716500 3746791 3790316 3829822 3861401 3831475 3810654 3744173 3662927
9238C662927l6245m2677m4028o8572j08090j27477j23851j13523r6268j35306
$$ 3662927 3626682 3584005 3539977 3471405 3363315 3235838 3111987 2998464 2902196 2766890
9228B766890j61202j96574j70185j60067r5340p2093j09644j15775j39757j22774
$$ 2766890 2605688 2409114 2238929 2078862 1983522 1911429 1801785 1686010 1546253 1423479
9218A423479j29138q5183q9925q3184o0758k8343l0727m9596j9333J5562J9141
$$ 1423479 1294341 1209158 1119233 1036049 975291 946948 916221 866625 847292 862854 881995
9207H81995N0409N9199O0515Q544l2432k3261l9898p8485p6688n8839p9400r1700
$$ 881995 932404 991603 1052118 1060662 1028230 1004969 965071 886586 809898 751059 671659 579959
9195E79959n4934m7721m2820m3934l4285l2724k1515K0746j2933k5219j8651r614
$$ 579959 525025 477304 434484 390550 356265 323541 302026 322772 309839 284620 265969 256355
9183B56355j293m507M807J7J1102O756L9291R659k8496m634P993j2144o864J6763
$$ 256355 255062 250555 255362 255379 266481 273237 312528 322187 293691 289057 297050 284906 278042 294805
9169B94805O8995P2178Q2160K7803n5402l7060l4563m4231m8331l2559j8681n0000
$$ 294805 363800 435978 518138 545941 490539 453479 418916 374685 326354 293795 275114 225114
9157B25114j7275K8817K1338j6929n824R489o022r271O002j0920j9616j2333p714
$$ 225114 207839 236656 257994 241065 235241 244730 238708 229437 235439 224519 204903 192570 184856
9144A84856k230K3656J1341K5878N4090N7785R3866M3070j2767n7798o6541n7583
$$ 184856 182626 206282 217623 243501 297591 355376 449242 492312 479545 421747 355206 297623
9132B97623m2642l4848l3456J037L0897m971k3809k4279k5716j3037k0900o019
$$ 297623 254981 220133 186677 187714 218611 213640 189831 165552 139836 126799 105899 99880
9120I9880j6210j579K827k263p135j1705J8178k843j6747j0573K375J0683q500
$$ 99880 83670 82091 84918 82655 75520 63815 81993 79150 62403 51830 54205 64888 56388
9107E6388J4105L4645M4258m64j9924j9935K905J0508m322L961j7527J0347j0529
$$ 56388 70493 105138 149396 148932 129008 109073 111978 122486 118164 122125 104598 114945 104416
9094A04416J3585J1936J2487J2764k1682k1812j3143L554r484q285P352p446J6194
$$ 104416 118001 129937 142424 155188 133506 111694 98551 102105 92621 84336 91688 84242 100436
9081A00436p124q004k934K7260r9J7947P13k604K390O553k7501k3602k4125l67
$$ 100436 93312 85308 82374 109634 109535 127482 128195 125591 127981 134534 107033 83431 59306 58939
9067E8939K1260M8461j357k1709J7031n677q260o039k0354J6854K2674k0176k6835
$$ 58939 80199 128660 127303 105594 122625 116948 108688 102649 82295 99149 121823 101647 74812
9054G4812j0375M341J7381J1552J6545R374j0129M378j0278l8016K0563K3137
$$ 74812 64437 68778 86159 97711 114256 123630 113501 117879 107601 69585 90148 113285
9042A13285R969L1435j781L62j6636m79r862k010j515k9309j8025k0352j7334
$$ 113285 123254 154689 152908 153270 136634 136155 126293 124283 122768 93459 75434 55082 37748
9029C7748K2432M4166q305l5265K344j775M97K3745L7763K4637J0464l5218k1824
$$ 37748 60180 104346 96041 60776 63120 61345 61842 85587 123350 147987 158451 123233 101409
9016A01409q205K316Q642J0099P477j4422j5285j6255q518j158L979j5634K784
$$ 101409 93204 95520 104162 114261 121738 107316 92031 75776 67258 66100 70079 54445 57229
9003E7229J9813m43J1262L0605K4926j2923k1291k8407j9574k6343k1005J9810
$$ 57229 77042 76599 87861 118466 143392 130469 109178 80771 61197 34854 13849 33659
8991C3659J6289L49N158n563O110l478R952M407J795j173O011J0796Q468L0614
$$ 33659 49948 50297 55455 49892 56002 52524 62476 66883 68678 67505 73516 84312 92780 123394
8977A23394N552j3746j8664K6282J2203k3609j8113j2817k090k6547j7180k3277
$$ 123394 128946 115200 96536 122818 135021 111412 93299 80482 78392 51845 34665 11388
8965A1388K8315K2495j6163J2595K3666L1994K0485l280J472l9747l3653k8814
$$ 11388 39703 62198 46035 58630 82296 114290 134775 131495 132967 93220 59567 30753
8953C0753j4794L4170J8072J3448k1832N16J1905k426o358j4498k5957n516J8371
$$ 30753 15959 50129 68201 81649 59817 60333 72238 69812 63454 48956 22999 17483 35854
8940C5854L2995R303O580j7509j4510J2993K575k2656q490o182J0150K4418L453
$$ 35854 68849 78152 84732 67223 52713 65706 68281 45625 37135 30953 41103 65521 68974
8927F8974j0091j6889Q462K862o950J3855J5750K275k296j3125k0729K028n856
$$ 68974 58883 41994 50456 53318 46368 60223 75973 78248 75952 62827 42098 44126 38270
8914C8270K6385K3018P407k1521k4265r597k3675K114K8717m003J5159M769M994
$$ 38270 64655 87673 95080 73559 49294 39697 16022 18136 46853 42850 58009 62778 67772
8901F7772m60k7439k2327K7966N509j9644K563q017j9735p030J3118M2333j6048
$$ 67772 67312 39873 17546 45512 51021 31377 33940 25923 6188 -842 12276 54609 38561
8888C8561j6244j485j764j8170L4P370j1467J5034K7963J2201J1185O61J2941
$$ 38561 22317 20832 19068 898 932 8302 -3165 11869 39832 52033 63218 63879 76820
8875G6820n063n277k9818k4628n539K6344Q626K1300J7688J9350K090j3480j9741
$$ 76820 71757 66480 36662 12034 6495 32839 41465 62765 80453 99803 101893 88413 68672
8862F8672k2382j0165J1401N500M515k196K982L521j3134k9875k5036J5668M9376
$$ 68672 46290 36125 47526 53026 57541 55345 58327 61848 48714 18839 -6197 9471 58847
8849E8847N1952o213k102K6019J8716R784l1827m5588l0164k8747q375R689K2828
$$ 58847 110799 104586 102484 128503 147219 157003 125176 79588 49424 20677 12302 21991 44819
8836D4819J3838K387j5652j0770q117p897k1593K1618L7142k52J5810k491k8128
$$ 44819 58657 61044 45392 34622 26505 18608 -2985 18633 55775 55523 71333 68842 40714
8823D0714m924q62p118j4131L6513M6914M822k9389j4173J0818k505l9795j2056
$$ 40714 35790 34928 27810 13679 50192 97106 101928 72539 58366 69184 66679 26884 14828
8810A4828k9715r399J0872K9465L1315K4646L8935L461j0914J3425k0550p489
$$ 14828 -14887 -24286 -13414 16051 47366 72012 110947 114408 103494 116919 96369 88880
8798H8880j0985j0182K739j7057r708J1383k788q509R571o730j4623n965j9251
$$ 88880 77895 67713 70452 53395 43687 55070 52282 43773 53344 46614 31991 26026 6775
8785F775Q984J4365J8414L8044N5j3141j4795j2341k566J6411l3588k2442O202
$$ 6775 15759 30124 48538 86582 86637 73496 58701 46360 43794 60205 26617 4175 10377
8772A0377J8214J7101p732q341J646J0611j1972k2804r892J710Q331K6896k8582
$$ 10377 28591 45692 37960 29619 31265 41876 29904 7100 -2792 -1082 7249 34145 5563
8759E563j5980K3270K2431k1309j7112N893O385r015j5181R455R074q01K0827
$$ 5563 -10417 12853 35284 13975 -3137 2756 9141 126 -15055 -5600 3474 2673 23500
8746B3500p14l3389R327L090l50P514L246j4443Q802J1211K5238p336k2708k5929
$$ 23500 22786 -10603 -1276 1814 1464 8978 12224 -2219 6583 17794 43032 35696 12988 -12941
8732a2941K141K1752J5663j3704l652L022j1646l285J5892Q289m926M540l215
$$ -12941 -10800 10952 26615 12911 9259 12281 635 -2650 13242 21531 16605 21145 17930
8719A7930k1386j2704j4383J47K0331K1084K8284J1709j6949l0340j6793K3044
$$ 17930 -3456 -16160 -30543 -30396 -10065 11019 39303 51012 34063 3723 -13070 9974
8707I974l84K3918K7845K6236k923j5083j1548m176k3184l068R07l5420k011K3303
$$ 9974 9590 33508 61353 87589 84666 69583 58035 53859 30675 27607 28514 -6906 -8917 14386
8693A4386J9496j2542j8311o939J1638M028M827j9144q612l842q656l651O651
$$ 14386 33882 21340 3029 -3910 7728 11756 16583 -2561 -11173 -15015 -23671 -27322 -20671
8680b0671J5853o915K827J265K063J4155J6438j0318j1603o956J8762O219R210
$$ -20671 -4818 -11733 -8906 -7641 -5578 8577 25015 14697 3094 -3862 14900 21119 30329
8667C0329j486k7741R379q452M272j624k3817n796M2030K0867K006k4312K079
$$ 30329 28843 1102 10481 2029 6301 4677 -19140 -24936 17094 37961 39967 15655 17734
8654A7734J6337k740j113j2044J5314j3359q038o308J2451N541l094j0572j0620
$$ 17734 34071 31331 30218 18174 33488 20129 12091 5783 18234 23775 20681 10109 -511
8641e11P583J705m912l151k0839J1964Q868j5005j7372R099R092K566M062J1298
$$ -511 7072 8777 3865 714 -20125 -8161 707 -14298 -31670 -22571 -13479 -10913 -6851 4447
8627D447l0563K1305R764J1264L3722K8113Q357k0169j4626J1305K9120J5969
$$ 4447 -26116 -4811 4953 16217 49939 78052 86409 66240 51614 62919 92039 108008
8615A08008l264l3137k4004J1192L976Q51J7682K1121j847k9242m413O206j0092
$$ 108008 104744 71607 47603 58795 62771 63622 81304 102425 100578 71336 66923 73129 63037
8602F3037m3995j6013J2669r498J6737K6192o784l9074l300J5455m36p554K8373
$$ 63037 19042 3029 15698 6200 22937 49129 42345 3271 -29 15426 14990 7436 35809
8589C5809M8891P406l468L392o565k9857P775J050J3016L0382J952o5136J2025
$$ 35809 84700 92106 88638 92030 85465 55608 63383 64433 77449 107831 109783 44647 56672
8576E6672K3823L260j581p204L9539K5203P58P338k5190m7188k0831j6037j0164
$$ 56672 80495 83755 82174 74970 114509 139712 140470 147808 122618 75430 54599 38562 28398
8563B8398j343j313L5775q428k9440J7325K5288j1075j4410K607K0586k5210N328
$$ 28398 27055 25742 61517 53089 23649 40974 66262 55187 40777 43384 63970 38760 44088
8550D4088J0297k0320n252J1192o912j3718k471K3249K0701j8752j6416o638j7897
$$ 44088 54385 34065 28813 40005 33093 19375 16904 40153 60854 42102 25686 19048 1151
8537A151j0414j2726J3455n942m218j8940J5846J5230L1539K1144r883k8161J0041
$$ 1151 -9263 -21989 -8534 -14476 -18694 -37634 -21788 -6558 24981 46125 36242 8081 18122
8524A8122J6172K481j613R68L240Q288n966j5130K6393R717j6651k7872k4633
$$ 18122 34294 36775 35162 36130 39370 47658 41692 26562 52955 62672 46021 18149 -6484
8511f484K0313K7322l573l9207L766K7553J542k2729j8088r291J5483K3690k0613
$$ -6484 13829 41151 37578 -1629 2137 29690 31232 8503 -9585 -18876 -3393 20297 -316
8498c16k1140n614q83M4269j8379j4795M22m232J7059J7189N604M070l23J1187
$$ -316 -21456 -27070 -27953 16316 -2063 -16858 -16436 -20668 -3609 13580 19184 23254 22931 34118
8484C4118j2113k662J8920j4488j0137J3488J5639k8654k6028N955J5777K9974
$$ 34118 22005 19343 38263 23775 13638 27126 42765 14111 -11917 -5962 9815 39789
8472C9789K500O690k4425k712N866Q008j8114j6543L621L903K5959m763j6129
$$ 39789 42289 48979 24554 21842 27708 35716 17602 1059 4680 8583 34542 29779 13650
8459A3650J3620K3171J1956M692m2686k7748j006q756R996J8625k359K4815L0260
$$ 13650 27270 50441 62397 67089 24403 -3345 -4351 -13107 -3111 15514 13155 37970 68230
8446F8230j6671p404k4237k4514o318J3860p498L898R285r028k9541O285j5070
$$ 68230 51559 44155 19918 -4596 -10914 2946 -4552 -654 8631 -397 -29938 -23653 -38723
8433c8723j8053J0231K8964K5027P5L4339K626j7022j8557k1857K065L358j7621
$$ -38723 -56776 -46545 -17581 7446 7521 41860 44486 27464 8907 -12950 -10885 -7527 -25148
8420b5148Q601L1657K1954P357j0086k176K97j335R309J1369j0122j2980M866
$$ -25148 -16547 15110 37064 44421 34335 32159 32456 31121 40430 51799 41677 28697 33563
8407C3563k398q139j7082j0062J1748Q320P900J3909j8799j7997J0933j952O003
$$ 33563 31165 23026 5944 -4118 7630 15950 23850 37759 18960 963 11896 9944 15947
8394A5947n815J1298J3343l180l5093P232K5614O718q834l1241j7415L1097L8183
$$ 15947 10132 21430 34773 31593 -3500 3732 29346 36064 27230 -4011 -21426 9671 47854
8381D7854K89p533k8224j4621r57j2664l309M101J6999J5366n129O155K9513R073
$$ 47854 48143 40610 12386 -2235 -3192 -15856 -19165 -15064 1935 17301 12172 18327 47840 56913
8367E6913o466J546M016j7706j1914m56l003k84L395K1402L515l3906l1984J681
$$ 56913 50447 51993 56009 38303 26389 25933 22930 22646 26041 47443 50958 17052 -14932 -13251
8353a3251J5698O745K1342j3044m967R14L609k697j709O139O891O065j4600j8371
$$ -13251 2447 9192 30534 17490 12523 13437 17046 14349 12640 18779 25670 31735 17135 -1236
8339a236j0949j1405K5374n739k6910M94R345J0500M31k0253J6507o805k0107
$$ -1236 -12185 -23590 1784 -3955 -30865 -30371 -21026 -10526 -10095 -30348 -13841 -20646 -40753
8326d0753j958K965L4037N5892K5175p618m3910j62j6017j9737P76q252n382J0452
$$ -40753 -42711 -39746 -5709 50183 75358 67740 23830 23668 7651 -12086 -11310 -19562 -24944 -14492
8312a4492J7206j8947M207K8573k7283n109J8897K8705o169l1898j2485K7324
$$ -14492 2714 -16233 -12026 16547 -10736 -15845 3052 31757 25588 -6310 -18795 8529
8300H529L6474j3294k3692l48k708J3446J277J6038l1419j6500L5075J9678o751
$$ 8529 45003 31709 8017 7669 4961 18407 19684 35722 4303 -12197 22878 42556 35805
8287C5805j8261k7191J9524m737k0005j8645K289K8547k618j1454J4353J1329
$$ 35805 17544 -9647 9877 5140 -14865 -33510 -31221 -2674 -5292 -16746 -2393 8936
8275H936m74J0234j3672k1362k9554K5935J7697R834J2198M873q546k3037M841
$$ 8936 8462 18696 5024 -16338 -45892 -19957 -2260 7574 19772 24645 16099 -6938 -2097
8262b097J3538J4923P558N882k5810j0801J3708p214J1283J0453j2381N38q719
$$ -2097 11441 26364 33922 39804 13994 3193 16901 9687 20970 31423 19042 19580 10861
8249A0861K031K9960L726k5108j6202J8172J7992l428j1199j237Q396p154j3408
$$ 10861 12892 42852 46578 21470 5268 23440 41432 38004 26805 25568 33964 26810 13402
8236A3402j492j3612p431P294L3115K1482M82j163k3865p86J1350j3030l324l0207
$$ 13402 11910 -1702 -9133 -1839 31276 52758 53240 52077 28212 27426 38776 25746 22422 -7785
8222g785K108j0116q14N715N0919L868m1084k1145K3781J6425j687L4300Q864
$$ -7785 -5677 -15793 -16607 -10892 40027 43895 2811 -18334 5447 21872 20185 54485 63349
8209F3349J2637o680j2917k0870l1853r147j3639Q592R950j011r760j7160J0129
$$ 63349 75986 69306 56389 35519 3666 -5481 -19120 -10528 -578 -1589 -11349 -28509 -18380
8196a8380R496R203k6216O02K6834J3758R94m897J476j0041l700j3158O912p093
$$ -18380 -8884 319 -25897 -25295 1539 15297 16291 11394 12870 2829 -871 -14029 -7117 -14210
8182a4210L861K1359j2945n736j0729K6402J0575K560l7461q463l418k32P023
$$ -14210 -10349 11010 -1935 -7671 -18400 8002 18577 21137 -16324 -24787 -28205 -28437 -21414
8169b1414J4998J1254j4499J2838J7063N428k0091O01K0828k06o396j4185k2777
$$ -21414 -6416 4838 -9661 3177 20240 25668 5577 6178 27006 26800 20404 6219 -16558
8156a6558p771J1433l515q876J3664k2368J2933J0639j3657k519J3784R179J3988
$$ -16558 -24329 -12896 -16411 -25287 -11623 -33991 -21058 -10419 -24076 -26595 -12811 -3632 10356
8143A0356q202p352j6568p570n88Q156K6095J1365J0958K921m973J5057r935k2388
$$ 10356 2154 -5198 -21766 -29336 -29924 -21768 4327 15692 26650 29571 24598 39655 29720 7332
8129G332k587J3352Q325n578k9422l0237n80K3175M2207p330j0577Q881l655j4537
$$ 7332 4745 18097 26422 20844 -8578 -38815 -39395 -16220 25987 18657 8080 16961 13306 -1231
8115a231Q363J8542j57p85j2434K116j9166k3333n453P352K1934J190J0017J0407
$$ -1231 7132 25674 25517 24732 12298 14414 -4752 -28085 -33538 -26186 -4252 -3062 6955 17362
8101A7362M312m03r445k7149j0884J6492J5267L357j4529J456J593l7687j0598
$$ 17362 21674 21271 11826 -15323 -26207 -9715 5552 8909 -5620 -4164 -2571 -40258 -50856
8088e0856P019J4K3973O861o675K4772M651m674K8086p71j5082P766n690k4342
$$ -50856 -43837 -43823 -19850 -12989 -19664 5108 9759 5085 33171 32400 17318 25084 19394 -4948
8074d948J963K4753N867k7976k1109J7251M0237K9081r695j4499p450j2494j2830
$$ -4948 -2985 21768 27635 -341 -21450 -4199 36038 65119 55424 40925 33475 20981 8151
8061H151l2677L0359P833J1911J3123r679j5967k8675k213J6526r491M840J2304
$$ 8151 -24526 5833 13666 25577 38700 29021 13054 -15621 -17834 -1308 -10799 -5959 6345
8048F345J2260J3209L156j271l719J7049j3886l5786j6071M879N858K3093O693
$$ 6345 18605 31814 34970 33699 29980 47029 33143 -2643 -18714 -13835 -7977 15116 21809
8035B1809j4889o852K8078N956J1813k9104k2434Q157P513J0728J3038J4197l6601
$$ 21809 6920 68 28146 34102 45915 16811 -5623 2534 10047 20775 33813 48010 11409
8022A1409j8054O388n588k1029O182K7018J2984n730k0961K680J7768o034j6200
$$ 11409 -6645 -257 -5845 -26874 -20692 6326 19310 13580 -7381 -4701 13067 7033 -9167
8009i167K2243J4638o238J6536k135m2898k254R400J0859j432j6992J0573J7065
$$ -9167 13076 27714 21476 38012 35877 -7021 -9275 125 10984 9552 -7440 3133 20198
7996B0198L0825P32l2894J865J9053R096r003j3905J5381l877J2413r510j1000
$$ 20198 51023 51755 18861 20726 39779 48875 39872 25967 41348 37471 49884 40374 29374
7983B9374j2202k688j865K0043L55k81J1237r034m305L643N484R967p508k6429
$$ 29374 17172 14484 12619 32662 33017 32736 43973 34939 30634 34277 39761 49728 42220 15791
7969A5791k7515r427J6422K1908K895m009k3453R41K6314P154p769j5186J9193
$$ 15791 -11724 -21151 -4729 17179 20074 16065 -7388 -6447 19867 27021 19252 4066 23259
7956B3259k99k3465O394M639J5196R150O179k2682k3245M532J0695J7756j0423
$$ 23259 22960 -505 5889 10528 25724 34874 41053 18371 -4874 -342 10353 28109 17686
7943A7686J0804O583l3584j6409J8145J2820j758R3J5289K97J443N284j800j4317
$$ 17686 28490 35073 1489 -14920 3225 16045 14287 14380 29669 29966 31409 36693 34893 20576
7929B0576j8540k635j4809j9566Q059L2075J4939Q651P560K3049j802l9946k4796
$$ 20576 2036 -599 -15408 -34974 -26915 5160 20099 28750 36310 59359 57557 17611 -7185
7916g185K2256N350j5567J869j371K4385K4027j7966l9736o079J1791j038l521
$$ -7185 15071 20421 4854 6723 5352 29737 53764 35798 -3938 -10017 1774 736 -2785
7903b785J238j35k4820J0948K0294J7891J9129r009J256J456J787O797N053M342
$$ -2785 -1547 -1682 -26502 -15554 4740 22631 41760 32751 34007 35463 37250 44047 49100 53442
7889E3442K636p353l4333k549k59l578r559R096K6661J6062J939l0954k0330L179
$$ 53442 56078 48725 14392 11843 11584 8006 -1553 7543 34204 50266 52205 21251 921 4100
7875D100Q695N795k1215j508J1888O703J8831n790j3961N027q211k7304n225J6216
$$ 4100 12795 18590 -2625 -4133 7755 14458 33289 27499 13538 18565 10354 -16950 -22175 -5959
7861e959m209k914O715j2894J637J8176R976j025j2188L595K698j8326k0937K165
$$ -5959 -10168 -13082 -6367 -19261 -17624 552 10528 9503 -2685 910 3608 -14718 -35655 -33490
7847c3490K4586J6219j0857l1457j2255L3012J8194J9655N404j3757J7923j797
$$ -33490 -8904 7315 -3542 -34999 -47254 -14242 3952 23607 29011 15254 33177 31380
7835C1380m953P074o343L09N110l8353j1986k225j231j618P351J0916l433j7674
$$ 31380 26427 33501 27158 27467 32577 -5776 -17762 -19987 -21218 -22836 -15485 -4569 -8002 -25676
7821b5676j8069L992K1536J8332l624P653q045j8292L105l810k2096J6109K0160
$$ -25676 -43745 -39753 -18217 115 -3509 4144 -3901 -22193 -19088 -22898 -44994 -28885 -8725
7808h725J9698L355J1342J9851J9283K8k2742R088j0112j8143J4152n319k7727
$$ -8725 10973 14328 25670 45521 64804 64832 42090 51178 41066 22923 37075 31756 4029
7795D029j7523k0391R755J8173j3376J024L760k8943j0737P037K7829j6010j3313
$$ 4029 -13494 -33885 -24130 -5957 -19333 -18309 -14549 -43492 -54229 -47192 -19363 -35373 -48686
7782d8686K3467K6951P364l3885r904K4451o482J229l87j2368M461R315K2335
$$ -48686 -25219 1732 9096 -24789 -34693 -10242 -16724 -15495 -15882 -28250 -23789 -14474 7861
7769G861J7981K805r053k464J2186J792n868j4277j3825j401j7958j2752J9479
$$ 7861 25842 28647 19594 17130 29316 31108 25240 10963 -2862 -4263 -22221 -34973 -15494
7756a5494N174k8287p956J5345q967N036L907K1630J658Q027r534J2544j880q563
$$ -15494 -10320 -38607 -46563 -31218 -40185 -35149 -31242 -9612 -7954 73 -9461 3083 1203 -7360
7742g360J3619K4223j0392r742O125K811j5391n137K5228j3692l2670k7348r624
$$ -7360 6259 30482 20090 10348 16473 19284 3893 -1244 23984 10292 -22378 -49726 -59350
7729e9350L3932j231Q12M0267K0786q957j2240k6515j624Q914j0054l950J051
$$ -59350 -25418 -26649 -25837 14430 35216 26259 14019 -12496 -14120 -5206 -15260 -19210 -18159
7716a8159m829K856Q89l0376J7156L9742L480L133j138o119k0681M377K4631k7040
$$ -18159 -22988 -20132 -19243 -49619 -32463 7279 10759 13892 12754 6635 -14046 -9669 14962 -12078
7702a2078L610K5318q256l500J4492J02j1055j4642l340l1301j8710J7536L2831
$$ -12078 -8468 16850 8594 5094 19586 19688 8633 -6009 -9349 -40650 -59360 -41824 -8993
7689h993J8032j2089J9732J7079k0714M741r303J3333k6250k4736J7452K1689
$$ -8993 9039 -3050 16682 33761 13047 17788 8485 21818 -4432 -29168 -11716 9973
7677I973J7525k987j3349Q309m62k3248n123P662K0788J0539M233q530j351j2169
$$ 9973 27498 24511 11162 19471 19009 -4239 -9362 -1700 19088 29627 33860 25330 23979 11810
7663A1810j3580o643k1449J9222K2230J1412L906j6079l6086j4987J1058J5351
$$ 11810 -1770 -8413 -29862 -10640 11590 23002 26908 10829 -25257 -40244 -29186 -13835
7651a3835j753j516j3854N039q038J5997q35J602k5832N377K3258J1866L745j3500
$$ -13835 -15588 -17104 -30958 -25919 -33957 -17960 -18795 -17193 -43025 -37648 -14390 -2524 1221 -12279
7637a2279n337j5487m321J691R015P549J0877p357l215k738O632L648M798R448
$$ -12279 -17616 -33103 -37424 -35733 -26718 -19169 -8292 -15649 -18864 -21602 -14970 -11322 -6524 2924
7623B924P90k5961L055L6496J2220j9625j3656k6978j0454K7147n042L356J9280
$$ 2924 3714 -22247 -19192 17304 29524 9899 -3757 -30735 -41189 -14042 -19084 -15728 3552
7610C552J5426M54k7007j3652Q214j9096o938J7893K9320K484P74P642O676j228
$$ 3552 18978 19432 -7575 -21227 -13013 -32109 -39047 -21154 8166 10650 11424 19066 25742 24514
7596B4514L1065L431k1028l1108j5697l798j8535k515Q576j437k1529L580J9558
$$ 24514 55579 59010 37982 6874 -8823 -12621 -31156 -33671 -25095 -26532 -48061 -44481 -24923
7583b4923K6484Q976J1548j63K5515l077l6014j0541J7985r3j618p474p935p101
$$ -24923 1561 10537 22085 21922 47437 44360 8346 -2195 15790 15697 14079 6605 -1330 -8431
7569h431j766j6673P488K9784J2127J10Q336r905k5265j1827j0405K8773K6087
$$ -8431 -10197 -26870 -19382 10402 22529 22639 30975 21070 -4195 -16022 -26427 2346 28433
7556B8433J726K508k89j0510k471k6632j8528J6768J2215J3555m756l120N103
$$ 28433 30159 32667 32378 21868 19397 -7235 -25763 -8995 3220 16775 12019 8899 14002
7543A4002j819J9545J6742m0555k5115q771J2423Q25j2218L816R228J2323L450
$$ 14002 12183 31728 48470 7915 -17200 -25971 -13548 -12723 -24941 -21125 -11897 426 3876
7530C876L2557J1859j2232J2683j6405R272Q38K006j6341j4284K1891K0947l8441
$$ 3876 36433 48292 36060 48743 32338 41610 42448 44454 28113 13829 35720 56667 18226
7517A8226l3921k4569m868J8043K9552M0293J72k0316m447P460K1889K5235K4200
$$ 18226 -15695 -40264 -45132 -27089 2463 42756 42928 22612 18165 25625 47514 72749 96949
7504I6949l3111j3030k3995m0579p035R702q38K2591J1160N376j7277J6388L566
$$ 96949 63838 50808 26813 -13766 -20801 -11099 -11937 10654 21814 27190 9913 26301 29867
7491B9867l4603j1537j3994K465l078j6388K5638L8523o173k6397j16Q263m899
$$ 29867 -4736 -16273 -30267 -27802 -30880 -47268 -21630 16893 10720 -15677 -15793 -7530 -12429
7478a2429l945K2915N910k104N190k3308j5335K4883J3524k796k8412l597O490
$$ -12429 -16374 6541 12451 10347 15537 -7771 -23106 1777 15301 12505 -15907 -19504 -13014
7465a3014n763r792J1761q573N305K5511K2657R756L054q347l0905n29J1400j1730
$$ -13014 -18777 -28569 -16808 -25381 -20076 5435 28092 37848 40902 32555 1650 1121 12521 791
7451G91k48k059R72r321J1880J3869K1626k3409l8477k8524j1417K67J0386L051
$$ 791 543 -1516 -544 -9865 2015 15884 37510 14101 -24376 -52900 -64317 -64050 -53664 -50613
7437e0613L8069K2125J626j7127J0301q443j5965o071K5061K9220J309k6891o745
$$ -50613 -12544 9581 11207 -5920 4381 -4062 -20027 -26098 -1037 28183 29492 2601 -4144
7424d144j36j1799O109k014k3242j400K2025n741j3991r59J8017R331r77N238
$$ -4144 -4280 -16079 -9970 -11984 -35226 -36626 -14601 -20342 -34333 -35292 -17275 -7944 -8921 -3683
7410c683R410o971j4116K1656M987J2471k175l4157P070J5865M277J1848k4648
$$ -3683 5727 -1244 -15360 6296 11283 23754 21579 -12578 -5508 10357 14634 26482 1834
7397A834j2440J0091n927J0153J7431k09o092r90p956N639Q904m206j3717L27
$$ 1834 -10606 -515 -6442 3711 21142 20933 14841 13851 5895 11534 20438 16232 2515 2842
7383B842L793J0728L0361J7672j8656l2114J0671j9289j6121J5470J3972o620
$$ 2842 6635 17363 47724 65396 46740 14626 25297 6008 -10113 5357 19329 12709
7371A2709J937j9878j8630K6654L5355K882q609j1431O129K3233j3513j3022n238
$$ 12709 14646 -5232 -23862 2792 38147 41029 32420 20989 27118 50351 36838 23816 18578
7358A8578l842l238j8074l7155J1093K5522j491l6980J2804J0862K2231J3910
$$ 18578 14736 11498 -6576 -43731 -32638 -7116 -8607 -45587 -32783 -21921 310 14220
7346A4220k0141J1159j061m07j1812M417L621K0483P562j3900J8967k2838j3063
$$ 14220 -5921 5238 4177 3770 -8042 -3625 -4 20479 28041 14141 33108 10270 -2793
7333b793k389K524K044J5472m249r471J4640M839j0557O043k9301r192q71J3461
$$ -2793 -5182 -2658 -614 14858 10609 1138 15778 20617 10060 16103 -13198 -22390 -23261 -9800
7319i800j8125j0589K1611J9300K722p895j2753R179J3222J950k1274R311j956
$$ -9800 -27925 -38514 -16903 2397 5119 -2776 -15529 -6350 6872 8822 -12452 -3141 -5097
7306e097j6353m513j6483j3415K958K9433p813j9917J3321O068j14K210J0791
$$ -5097 -21450 -25963 -42446 -55861 -52903 -23470 -31283 -51200 -37879 -31811 -31925 -29715 -18924
7293a8924Q036M3369k18l8474k6553L5862K2585J78k4828j9208j8647K6641K2768
$$ -18924 -10888 32481 32263 -6211 -32764 3098 25683 25861 1033 -18175 -36822 -10181 12587
7280A2587J887j1359R443R221j584o70j5235k5433j321K1059r568j7669l7747
$$ 12587 14474 3115 12558 21779 20195 19525 4290 -21143 -22464 -1405 -10973 -28642 -66389
7267f6389M0961J9459r724J5889J9351j2904l7342k6578j4444M325M2972Q446
$$ -66389 -25428 -5969 -15693 196 19547 6643 -30699 -57277 -71721 -67396 -24424 -15978
7255a5978j2040j487K4234M2687q812q830R224m522r124J1687p594P40j6565o590
$$ -15978 -28018 -29505 -5271 37416 28604 19774 28998 24476 15352 27039 19445 20185 3620 -2970
7241b970l013O902j8743j2017L0799P448j9542n336J729J6184R417K214k8541
$$ -2970 -5983 919 -17824 -29841 958 8406 -11136 -16472 -14743 1441 10858 13072 -15469
7228a5469M09J8738k412L020K2511m098o918M272R888L6109j183j2283j1068j2533
$$ -15469 -15060 3678 1266 4286 26797 22699 15781 20053 29941 66050 64867 52584 41516 28983
7214B8983K51J0385N689j1988l7872l918J2636r768J6894R36j6765J8706K3862
$$ 28983 29234 39619 45308 33320 -4552 -8470 4166 -5602 11292 12228 -4537 14169 38031
7201C8031j9882J0777k0241k7732J7680j189j4165q172K5232J05J150M278k1651
$$ 38031 18149 28926 8685 -19047 -1367 -2556 -16721 -24893 339 444 1594 5872 -15779
7188a5779K293K0099o736J2654J6798n538K407j5409M944O326l6054r120j1283
$$ -15779 -13486 6613 -123 12531 29329 23791 26198 10789 15733 22059 -13995 -23115 -34398
7175c4398J0575J5990k249j8272j3271L620L5112j743j2346O964J3721r597k3611
$$ -34398 -23823 -7833 -10082 -28354 -41625 -38005 -2893 -4636 -16982 -10018 3703 -5894 -29505
7162b9505j0837Q727K6843j0229j0594J7978J8575R21j4824p700R644L4759o981
$$ -29505 -40342 -31615 -4772 -15001 -25595 -7617 10958 11879 -2945 -10645 -1001 33758 26777
7149B6777n905K1790q320l4233n609P055m432o875j0630J6427R697P278R468l717
$$ 26777 20872 42662 34342 109 -5500 1555 -2877 -9752 -20382 -3955 5742 13020 22488 18771
7135A8771j3788l3918k0606o608K2300P113p756M09k897l852K761J7649j1366
$$ 18771 4983 -28935 -49541 -56149 -33849 -26736 -34492 -34083 -36980 -40832 -38071 -20422 -31788
7122c1788K0974q715L516L1857K375j2449o908l1471j6274M0331K5393j0600J1201
$$ -31788 -10814 -19529 -16013 15844 18219 5770 -1138 -32609 -48883 -8552 16841 6241 17442
7109A7442J0666N644o895j495N32j3299j3713l0580k4906j0693J7734J1505L7161
$$ 17442 28108 33752 26857 25362 25894 12595 -1118 -31698 -56604 -67297 -49563 -38058 -897
7096h97Q514K767k2741j474Q159n560Q304J4462j2802L708J8949k3605q226l6137
$$ -897 7617 10384 -12357 -13831 -5672 -11232 -2928 11534 -1268 2440 21389 -2216 -10442 -46579
7082d6579j0894l442L0483L1113J9684l1487l1086J0052K7334q71k0253j540N5
$$ -46579 -57473 -60915 -30432 681 20365 -11122 -42208 -32156 -4822 -5693 -25946 -27486 -27431
7069b7431k0573P995K0146Q153q756R90M117L741j3568J1739m192L747J6386q300
$$ -27431 -48004 -40009 -19863 -11710 -20466 -19476 -15359 -11618 -25186 -13447 -17639 -13892 2494 -5806
7055e806j4281r76K1324j4655q679K8279R565k2771K1075R346n609k4951k610
$$ -5806 -20087 -21063 261 -14394 -23073 5206 14771 -8000 13075 22421 16812 -8139 -10749
7042a0749J4289Q813N532k2385j3294p500k960K8090Q907l1328k7190j4345L7092
$$ -10749 3540 12353 17885 -4500 -17794 -25294 -28254 -164 8743 -22585 -49775 -64120 -27028
7029b7028J8119m156j2320l6085j5306K7786M85j478j1128j22K507K9966M711
$$ -27028 -8909 -13065 -25385 -61470 -76776 -48990 -48505 -49983 -61111 -61233 -58726 -28760 -24049
7016b4049j440J5353R94k6225l394K3408J7972j535L840l997N83J5200k1865j8950
$$ -24049 -25489 -10136 -9142 -35367 -38761 -15353 2619 1084 4924 927 1510 16710 -5155 -24105
7002b4105J3818n354j4373n703R683n252J1264m692J0051Q736J1071M740l3895
$$ -24105 -10287 -15641 -30014 -35717 -26034 -31286 -20022 -24714 -14663 -5927 5144 9884 -24011
6989b4011J685j791O968J4344j3119m515r091J1365O2p890n606K5224L4892R658
$$ -24011 -22326 -24117 -17149 -2805 -15924 -20439 -29530 -18165 -18103 -25993 -31599 -6375 28517 38175
6975C8175j6411m5202m0513K2017j0306K9k759L357P321l7849J0144L0835M2604
$$ 38175 21764 -23438 -63951 -41934 -52240 -52211 -54970 -51613 -44292 -82141 -71997 -41162 1442
6962A442K3334j8172J0109N168l1656k4285L943J1860J8344L3953R636r118k7585
$$ 1442 24776 6604 16713 21881 -9775 -34060 -30117 -18257 87 34040 43676 34558 6973
6949F973j852J7699k642k1842j2005j0562p743R693p154N858L197N618J7625J7253
$$ 6973 5121 22820 20178 -1664 -13669 -24231 -31974 -22281 -29435 -23577 -20380 -14762 2863 20116
6935B0116j1168k0656R112O722K398N786R139j6079m329R940j9633l5441K3589
$$ 20116 8948 -11708 -2596 4126 6524 12310 21449 5370 1041 10981 -8652 -44093 -20504
6922b0504L2560J9897j5604k8784k0976K421L3376R078J0263m212j8098r373K378
$$ -20504 12056 31953 16349 -12435 -33411 -30990 2386 11464 21727 17515 -583 -9956 -7578
6909g578J223P318J3241k2974M936J863j7156j620K5238l535j6028j1370k2214
$$ -7578 -6355 963 14204 -8770 -3834 -1971 -19127 -20747 4491 956 -15072 -26442 -48656
6896d8656K5300J5276M412M1375K0080k2874n6924j2686L4929J1740K875Q483
$$ -48656 -23356 -8080 -3668 37707 57787 34913 -22011 -34697 232 11972 14847 23330
6884B3330o778K122r75j6219l151K8720j5431q698J2735O205l4512j6376K1348
$$ 23330 16552 18674 17699 1480 -1671 27049 11618 2920 15655 21860 -12652 -29028 -7680
6871g680N870J3718Q134P689m0244j5251n388J2030J2285j56J147j5248j0387
$$ -7680 -1810 11908 20042 27731 -12513 -27764 -33152 -21122 -8837 -8993 -7846 -23094 -33481
6858c3481R198J6895j9555J7300L2434M541j2917j4995n351k0617J2128K0140
$$ -33481 -24283 -7388 -26943 -9643 22791 27332 14415 -580 -5931 -26548 -14420 5720
6846E720k3166N899J3178k4610k436K9221m891K722j2112j9890J6125M3305J1124
$$ 5720 -17446 -11547 1631 -22979 -25415 3806 -1085 1637 -10475 -30365 -14240 29065 40189
6833D0189J401j2427k1440j5969n076k0496P009K5328J0539m018J9851J848K247
$$ 40189 41590 29163 7723 -8246 -13322 -33818 -26809 -1481 9058 5040 24891 26739 28986
6820B8986k461k7666J399J9132j0426l0470j709J5138m966J0934L1948M936N996
$$ 28986 26525 -1141 258 19390 8964 -21506 -23215 -8077 -13043 -2109 29839 34775 40771
6807D0771l3504k6065Q210o870r44N919j0431J2225M197K240L2268K7331Q232
$$ 40771 7267 -18798 -10588 -17458 -18402 -12483 -22914 -10689 -6492 -4252 28016 55347 63579
6794F3579k1214m7836k6798J8027j17r16k7322R483Q727j4903J3881J6431P00
$$ 63579 42365 -5471 -32269 -14242 -14359 -15275 -42597 -33114 -24387 -39290 -25409 -8978 -8278
6781h278J3188r270L52O601J4317j1380j1608k7226L582L5740j3651J353O223
$$ -8278 4910 -4360 -4008 2593 16910 5530 -6078 -33304 -29722 6018 -7633 -6280 -57
6768e7j7200Q497k7496l0489K5139K0103J8821q766K503j5934P635r277j8652
$$ -57 -17257 -8760 -36256 -66745 -41606 -21503 -2682 -11448 -8945 -24879 -17244 -26521 -45173
6755d5173N911N910k2984k737J2939J2802Q028N198J3289l9803j4162K1112L9045
$$ -45173 -39262 -33352 -56336 -59073 -46134 -33332 -25304 -20106 -6817 -46620 -60782 -39670 -625
6742f25J6568M808j3366r946k9222j8707K0746L5418K6212L7991L1976K1063l7833
$$ -625 15943 20751 7385 -2561 -31783 -50490 -29744 5674 31886 69877 101853 122916 85083
6729H5083m6778j2499l425K26J0933K2323k0500j2325m685k562j839K871J2355
$$ 85083 38305 25806 22381 22607 33540 55863 35363 23038 18353 15791 13952 16823 29178
6716B9178M883J5538K4852R620J605J921K6606M6718Q7224N7112k5490J1145K7189
$$ 29178 34061 49599 74451 84071 85676 87597 114203 160921 248145 305257 279767 290912 318101
6703C18101m4940q0918p1807m8280k2837j6249p216p220m467K5212J3751l3714
$$ 318101 273161 192243 120436 72156 49319 33070 25854 18634 14167 39379 53130 19416
6691A9416k833P974j9051k1168J3891J6598N393Q271L977l149j8572l3393j9167
$$ 19416 16583 24557 5506 -15662 -1771 14827 20220 28491 32468 29319 10747 -22646 -41813
6678d1813j761m963J6441K8968r691j426j4588J0627J7020K3745p341n212r523
$$ -41813 -43574 -48537 -32096 -3128 -12819 -14245 -28833 -18206 -1186 22559 15218 10006 483
6665D83m967L151J151l599j8164k410P070p052M3867L9146R121k8298j3675J1202
$$ 483 -4484 -1333 -182 -3781 -21945 -24355 -17285 -24337 19530 58676 67797 39499 25824 37026
6651C7026J2229j8924k0970j4086L6119K7929j6563j5957J4195O693l4269K42
$$ 37026 49255 30331 9361 -4725 31394 59323 42760 26803 40998 47691 13422 13664
6639A3664n394n997n935P029r757K093Q363k6468J7904j2103n511k5392M098L3723
$$ 13664 8270 2273 -3662 3367 -6390 -4297 4066 -22402 -4498 -16601 -22112 -47504 -43406 -9683
6625i683m122n798J3614j0594o578Q722J7355J0858r104j6184J4245p898k2524
$$ -9683 -13805 -19603 -5989 -16583 -23161 -14439 2916 13774 4670 -11514 2731 -5167 -27691
6612b7691j8131j7396o447K3196K1411O926K2595R656p778m635O743j3686p3j8455
$$ -27691 -45822 -63218 -69665 -46469 -25058 -18132 4463 14119 6341 1706 8449 -5237 -5310 -23765
6598b3765K7521K0608p400K0107l2193n627P828k6193P527N152P777m4364k4934
$$ -23765 3756 24364 16964 37071 4878 -749 7079 -19114 -11587 -6435 1342 -43022 -67956
6585f7956K4895K5818K8351K858q450j0427j0946J1649K8160K0j1214l200k0757
$$ -67956 -43061 -17243 11108 13966 5516 -4911 -15857 -4208 23952 23972 12758 9558 -11199
6572a1199k6585J5652J0203r27M997K9190J5813j3216j192J8572l631j3326J1178
$$ -11199 -37784 -22132 -11929 -12856 -7859 21331 37144 23928 22736 41308 37677 24351 35529
6559C5529l7049j6591m600Q042O511q416l540l9754N058J9565K7018j6585n062
$$ 35529 -1520 -18111 -22711 -14669 -8158 -16574 -20114 -59868 -54810 -35245 -8227 -24812 -29874
6546b9874p657n553J8271k191P715k625j3009l5714J7576J722L328K2394J4343
$$ -29874 -37531 -43084 -24813 -27004 -19289 -21914 -34923 -70637 -53061 -51339 -48011 -25617 -11274
6533a1274J4411K1802k1879q323J794j8183l1715J083J3252K4628N159K0214q14
$$ -11274 3137 24939 3060 -5263 -3469 -21652 -53367 -52284 -39032 -14404 -9245 10969 10155
6520A0155M255m385j94L113o115R499m830j1079m814k1196q000R773K0427M417
$$ 10155 14410 10025 9831 12944 6829 16328 11498 419 -4395 -25591 -33591 -23818 -3391 1026
6506A026J0044M954m6173K613J1809K5480N76R465L641q908p76l030n394K0284
$$ 1026 11070 16024 -30149 -27536 -15727 9753 10329 19794 23435 14527 13751 10721 5327 25611
6492B5611J64n412k0676M842k81J5753j268l2792m930K0403J0380k4886J4001
$$ 25611 25775 20363 -313 4529 4248 20001 18733 -14059 -18989 1414 11794 -13092 909
6479I09K6369j7756j2831J0841J5248k1680m217L1991o085j950k3225j4818k803
$$ 909 27278 9522 -3309 7532 22780 1100 -3117 28874 22789 20839 -2386 -17204 -20007
6466b0007n813j4899K6062J369k1502p266J0667R877K9367J9330j659p234k0461
$$ -20007 -25820 -40719 -14657 -13288 -34790 -42056 -31389 -21512 7855 27185 25526 18292 -2169
6453b169k5717J3340M2404J3345j3696q187R915j1888o217j1810Q62l353j5872
$$ -2169 -27886 -14546 27858 41203 27507 19320 29235 17347 11130 -680 182 -3171 -19043
6440a9043J3624Q367n251K237j4895k05J7349l92j9060j0051o113L085J2356K2065
$$ -19043 -5419 2948 -2303 -66 -14961 -15166 2183 1791 -17269 -27320 -33433 -30348 -17992 4073
6426D073L2488j7446k4655n947J540r868R096J4234n249j3043K4007J3316k17
$$ 4073 36561 19115 -5540 -11487 -9947 -19815 -10719 3515 -1734 -14777 9230 22546 22329
6413B2329k5661q367K5963j5362N172j4030j2300J6803r280K4403M943j0100K1302
$$ 22329 -3332 -11699 14264 -1098 4074 -9956 -22256 -5453 -14733 9670 14613 4513 25815
6400B5815n373k2873k5190k9019K1664J9775K0654J7573k0630j1776j519k0767
$$ 25815 20442 -2431 -27621 -56640 -34976 -15201 5453 23026 2396 -9380 -10899 -31666
6388c1666Q764J0402M566L415o947k2396j0586j084L1410K2763j2131j7276k469
$$ -31666 -22902 -12500 -7934 -4519 -11466 -33862 -44448 -45532 -14122 8641 -3490 -20766 -23235
6375b3235J4390j7321J1902j645l2871n135n833J3730N0970K1910k8770j4L878
$$ -23235 -8845 -26166 -14264 -15909 -48780 -53915 -59748 -46018 4952 26862 -1908 -1922 1956
6362A956k571j4765l8437L017K7359Q622K4208K3164k6373p221J9920J6030O012
$$ 1956 -615 -15380 -53817 -50800 -23441 -14819 9389 32553 6180 -1041 18879 34909 40921
6349D0921M586l811n0313k2351P434L989m0419o46J5566K6788O823M5251O943
$$ 40921 45507 41696 -8617 -30968 -23534 -19545 -59964 -60610 -45044 -18256 -11433 33818 40761
6336D0761Q60l4709j1928R070n539k0919N377K8986J7508k8196J848J5779o454
$$ 40761 41621 6912 -5016 4054 -1485 -22404 -17027 11959 29467 1271 3119 18898 12444
6323A2444j0290n991l074P282J0412j8966J220K1289K794l1548k4807L280K1655
$$ 12444 2154 -3837 -6911 371 10783 -8183 -6963 14326 17120 -14428 -39235 -35955 -14300
6310a4300P332p79l175k9704O318N296k279j2939l146J03j8858J7862J0079q326
$$ -14300 -6968 -7747 -10922 -40626 -34308 -29012 -31291 -44230 -47376 -47273 -66131 -48269 -38190 -46516
6296d6516j4012K819K4902N662m970K3989j5006J0691R159O62k1972K5544L426
$$ -46516 -60528 -57709 -32807 -27145 -32115 -8126 -23132 -12441 -3282 -2620 -24592 952 4378
6283D378k3597L913q784K1217M321J5260J2767m096k5819j5773l066q893P449
$$ 4378 -19219 -15306 -24090 -2873 1448 16708 29475 25379 -440 -16213 -19279 -28172 -20723
6270b0723J2236o903l2399j2882n243K0831j677k0042J8653K7720J9690j1018
$$ -20723 -8487 -15390 -47789 -60671 -65914 -45083 -46760 -66802 -48149 -20429 -739 -11757
6258a1757K674o765K6680K4955k7726q510J6449Q246k4325J2921l419k6890k3728
$$ -11757 -9083 -15848 10832 35787 8061 -449 16000 24246 -79 12842 9423 -17467 -41195
6245d1195Q133K0649M255m654r16K0189j0117j2712K46N782k3778K1122L0535
$$ -41195 -33062 -12413 -8158 -12812 -13728 6461 -3656 -16368 -16122 -10340 -34118 -12996 17539
6232A7539n197j6197k0960J623J7338n12k4697p61J2968J254j955r6J1125J2090
$$ 17539 12342 -3855 -24815 -23192 -5854 -6366 -31063 -31824 -18856 -17602 -19557 -19653 -8528 3562
6218C562j2255J1183l606k909J5432j604k4575k1251O080j278n914j4624J0070
$$ 3562 -8693 2490 -1116 -4025 11407 9803 -14772 -36023 -29943 -31221 -37135 -51759 -41689
6205d1689K5747L13j2252R740O82J4909Q857q015l354j5709j7545r060n240K5142
$$ -41689 -15942 -15629 -27881 -18141 -17459 -2550 6307 -1708 -5062 -20771 -38316 -47376 -52616 -27474
6191b7474J4221L206k023J7489N303m21k5144L736K8360L928j7585q68M4456J8840
$$ -27474 -13253 -10047 -12070 5419 10722 10301 -14843 -11107 17253 21181 3596 2728 47184 66024
6177F6024L362r495j7210J3146j1095j797n382l3254k1128k0067j647J1225K0763
$$ 66024 69386 59891 42681 55827 44732 42935 37553 4299 -16829 -36896 -38543 -27318 -6555
6164f555n093M3464J6p094k6448q934k1885J2022n192R681K3591J9893j0352l5190
$$ -6555 -11648 31816 31832 24738 -1710 -10644 -32529 -20507 -25699 -16018 7573 27466 17114 -18076
6150a8076J0052M3149J5334k4257j9593p098j4222m3145L142J5044L2358K2823
$$ -18076 -8024 35125 50459 26202 6609 -489 -14711 -57856 -54714 -39670 -7312 15511
6138A5511k3995m829j1612J1558J0487M754k7054J3495l2574k2032J1172J1448
$$ 15511 -8484 -13313 -24925 -13367 -2880 1874 -25180 -11685 -44259 -66291 -55119 -43671
6126d3671j860K1894L6847j4614o897P721J959l6653j2301k1915p586Q900M5376
$$ -43671 -45531 -23637 13210 -1404 -8301 -580 1379 -35274 -47575 -69490 -77076 -68176 -22800
6113b2800N4009Q298k8692j5052L541m727J6524j4332r35N375J0602J0812j2985
$$ -22800 31209 39507 10815 -4237 -696 -5423 11101 -3231 -4166 1209 11811 22623 9638
6100I638l1116N310j1349j4112o349j8808j4482J678L1793L2660R883k3579N888
$$ 9638 -21478 -16168 -27517 -41629 -47978 -66786 -81268 -79590 -47797 -15137 -5254 -28833 -22945
6087b2945l733O160j2485N959J2373n835O629k2155Q199K6584M39M444M1264Q311
$$ -22945 -26678 -20518 -33003 -27044 -14671 -20506 -13877 -36032 -27833 -1249 -810 3634 44898 53209
6073E3209m9983j5616L419j4974j6870q648K909j299J1020K0059k54J340j0678
$$ 53209 3226 -12390 -8971 -23945 -40815 -49463 -46554 -47853 -36833 -16774 -17028 -15688 -26366
6060b6366n509L9054k1993k1224j5090J2216J8949K1154p1k2625j8498m068K4238
$$ -26366 -31875 7179 -14814 -36038 -51128 -38912 -19963 1191 1120 -21505 -40003 -44071 -19833
6047a9833K3605Q973l0628L616p980J830j0987l5100J3101Q751K0969M1862K156
$$ -19833 3772 12745 -17883 -14267 -22247 -20417 -31404 -66504 -53403 -44652 -23683 18179 20335
6034B0335R042k691K383J0388m637j7483j5783j122m8198k0577j272M4578M457
$$ 20335 29377 26686 29069 39457 34820 17337 1554 432 -47766 -68343 -69615 -25037 -20580
6021b0580j4543P537o450J1590J0530N96L702R013P03j9704K0376N1818J9893
$$ -20580 -35123 -27586 -34036 -22446 -11916 -11320 -7618 1395 2098 -17606 2770 54588 74481
6008G4481j9006j1151l1586m1610J981K4126O700K804r622k8130m0094K1129L6888
$$ 74481 55475 44324 12738 -28872 -26891 -2765 3935 6739 -2883 -31013 -71107 -49978 -13090
5995a3090J5452J180L96j7055k3495j5634Q97r94K1722l332j1495K0154J4123
$$ -13090 2362 3542 3938 -13117 -36612 -52246 -51349 -52343 -30621 -33953 -45448 -25294 -11171
5982a1171J6263j115l7119j7852J7141K4976Q215P633o67k5949j6282J8812j5604
$$ -11171 5092 3977 -33142 -50994 -33853 -8877 -662 6971 6304 -19645 -35927 -17115 -32719
5969c2719j0067K2067K481r97o161q887r608Q385K1993k400j1719j0778K1986
$$ -32719 -42786 -20719 -18238 -19235 -25396 -34283 -43891 -35506 -13513 -15913 -27632 -38410 -16424
5956a6424O673k0366k6532J1876L0840J3505R441N658l884l65q940P881j9739
$$ -16424 -9751 -30117 -56649 -44773 -13933 -428 9013 14671 10787 10422 1482 9363 -10376
5943a0376k5806j2738K1396K7267L8159J8714j2814m1273m1899M84K0190J2113
$$ -10376 -36182 -48920 -27524 -257 37902 56616 43802 2529 -39370 -38886 -18696 -6583
5931f583j1540J7512j3985m801j1277n436O987p476O437J5479K5479L9458R560
$$ -6583 -18123 -611 -14596 -19397 -30674 -36110 -29123 -36599 -30162 -14683 10796 50254 59814
5918E9814k1339m7459J17K3830K0883p816j6358J686j9213k5955r044J0668K2570
$$ 59814 38475 -8984 -8867 14963 35846 28030 11672 13358 -5855 -31810 -40854 -30186 -7616
5905g616J2222Q757J4846j1323k1916o285j9335N54p302m249P254O401N988j1493
$$ -7616 4606 13363 28209 16886 -5030 -11315 -30650 -30096 -37398 -41647 -34393 -27992 -22004 -33497
5891c3497r04L6751r211p501l9m822q074J1406Q970m751k3536m652L5321K6236
$$ -33497 -34401 2350 -6861 -14362 -14401 -19223 -27297 -15891 -6921 -11672 -35208 -39860 -4539 21697
5877B1697j1299r496l2348q645k2962K1743J2702k688k181J1894K132j5336j2593
$$ 21697 10398 902 -31446 -40091 -63053 -41310 -28608 -31296 -33477 -21583 -19451 -34787 -47380
5864d7380J2913N825r729p960J6150K4542J9611M886n415k725j7503J6786L929
$$ -47380 -34467 -28642 -38371 -46331 -30181 -5639 13972 18858 13443 10718 -6785 10001 13930
5851A3930k0283Q391k642Q86j286l777o972M437J6201O581K3992n645l5334r018
$$ 13930 -6353 2038 -604 282 -1004 -4781 -11753 -7316 8885 15466 39458 33813 -1521 -10539
5837a0539J5809r194k048K6619m082l1310k3860j1176J1665L4116K3360m0785
$$ -10539 5270 -3924 -5972 20647 16565 -14745 -38605 -49781 -38116 -4000 19360 -21425
5825b1425j2522P307m43J2700J8263q934j2055j1313J8853J096j4350n173n69
$$ -21425 -33947 -26640 -27083 -14383 3880 -5054 -17109 -28422 -9569 -8473 -22823 -27996 -28565
5812b8565J3590j9570r828L708K2829N451L178J1414k6038k969K5967K4753k0749
$$ -28565 -14975 -34545 -44373 -40665 -17836 -12385 -9207 2207 -23831 -26800 -833 23920 3171
5799C171l5425l8045J8225K4155K0110R315j190j5413j892P567j876J693J236
$$ 3171 -32254 -70299 -52074 -27919 -7809 1506 316 -15097 -16989 -9422 -11298 -9605 -8369
5786h369k0516l2295L552K0447J3348K1431J0982J0019k0449l613J7776K2062
$$ -8369 -28885 -61180 -57628 -37181 -23833 -2402 8580 18599 -1850 -5463 12313 34375
5774C4375L1646j6696l5479j1168J186L551q030m567k3827j2229L993K1409k1146
$$ 34375 66021 49325 13846 2678 3864 7415 -615 -5182 -29009 -41238 -37245 -15836 -36982
5761c6982j6998l4605K8799L6015J471k6001K8667J416j1688k4306J188L0825
$$ -36982 -53980 -88585 -59786 -23771 -22300 -48301 -19634 -18218 -29906 -54212 -53024 -22199
5749b2199K9103J3040J6712J8805j3478l2617o371l1683J7465M0934k9460j8603
$$ -22199 6904 19944 36656 55461 41983 9366 2995 -28688 -11223 29711 251 -18352
5737a8352j4159l352L2149R870j0580j5205j7953K705J9191K7682J4032J743k0116
$$ -18352 -32511 -35863 -3714 6156 -4424 -19629 -37582 -34877 -15686 11996 26028 27771 7655
5724G655k6246K439j2934J2516p891k3341L900k496L0213K0232k4878j2480j972
$$ 7655 -18591 -16152 -29086 -16570 -24461 -47802 -43902 -46398 -16185 4047 -20831 -33311 -35283
5711c5283J1983J5055N414k5821M440J947j6438J1098N724Q815L786M569R700
$$ -35283 -23300 -8245 -2831 -28652 -24212 -22265 -38703 -27605 -21881 -13066 -9280 -4711 4989
5698D989K4548p54j869O005k5218n938m448k889J520j1680l890n628K247p197
$$ 4989 29537 28783 26914 32919 7701 1763 -2685 -5574 -4054 -15734 -19624 -25252 -23005 -30202
5684c0202j6473j5928N065L0031K7350J9607j7474j2734K9973J5650k343l2752
$$ -30202 -46675 -62603 -57538 -27507 -157 19450 1976 -10758 19215 34865 32522 -230
5672b30k5671p548n952j1514M414M5471j2361j2703r674K9922J9409L306m335
$$ -230 -25901 -33449 -39401 -50915 -46501 -1030 -13391 -26094 -35768 -5846 13563 16869 12534
5659A2534K224j5109k8812l789J6383j8831q629j2284O926K2901J5595j3639j0746
$$ 12534 14758 -351 -29163 -32952 -16569 -35400 -44029 -56313 -49387 -26486 -10891 -24530 -35276
5646c5276K5248L945K0020J3669Q661k6261k5925o697J0680J9278k9867m5446
$$ -35276 -10028 -6083 13937 27606 36267 10006 -15919 -22616 -11936 7342 -22525 -67971
5634f7971j0108n585N374Q575J683L5862J3631j0198j900n642j8226n245J5924
$$ -67971 -78079 -83664 -78290 -69715 -68032 -32170 -18539 -28737 -30637 -36279 -54505 -59750 -43826
5621d3826J619N179J7710R779J3500q294N206L768M948Q045J1421m014n027N783
$$ -43826 -42207 -37028 -19318 -9539 3961 -4333 873 4641 9589 17634 29055 25041 20014 25797
5607B5797k8658l8116N325Q127N18L0088M72j4273j265J2181O111k687r125j700
$$ 25797 -2861 -40977 -35652 -27525 -27007 3081 3553 -10720 -11985 196 6307 3620 -5505 -7205
5593g205q18k1797L296J6502o028r522j3063K6904K5225m31R505k032k8051j5585
$$ -7205 -8023 -29820 -26524 -10022 -16050 -25572 -38635 -11731 13494 13063 22568 20536 -7515 -23100
5579b3100k7075j0477J6877L1872O773n695k206m589J0441K0665J412K1813q32
$$ -23100 -50175 -60652 -43775 -11903 -5130 -10825 -13031 -17620 -7179 13486 14898 36711 35879
5566C5879l6322l1976L0087m148l636L197K323K597r432Q056M474l2612k5997
$$ 35879 -443 -32419 -2332 -6480 -10116 -6919 -4596 -1999 -11431 -3375 1099 -31513 -57510
5553e7510O13J9319K8063J5131l237j0932N300J0676J2961j0996j7920N002M642
$$ -57510 -56897 -37578 -9515 5616 2379 -8553 -3253 7423 20384 9388 -8532 -3530 1112
5540A112N322L541k2823K0673K0858j5289j533p304m941k9609r158L4112J0138
$$ 1112 6434 9975 -12848 7825 28683 13394 11861 4557 -384 -29993 -39151 -5039 5099
5527E099J2219j64k7827j5284k684Q730r226p840J7747J5814j3163m4937m804
$$ 5099 17318 17154 -10673 -25957 -28641 -19911 -29137 -36977 -19230 -3416 -16579 -61516 -66320
5514f6320M7119M6145n632J3266j3581j9656k3346n763l317j1527K5100K0647
$$ -66320 -19201 26944 21312 34578 20997 1341 -22005 -27768 -31085 -42612 -17512 3135
5502C135O726J3699N201K1835k2734l8587J4376K6539k6407j5782J5328j5270
$$ 3135 9861 23560 28761 50596 27862 -10725 3651 30190 3783 -11999 3329 -11941
5490a1941N540J5429k4566O691P340J428k655L689K8929K8133q075l2973j6523
$$ -11941 -6401 9028 -15538 -8847 -1507 -79 -2734 955 29884 58017 49942 16969 446
5477D46J4877n916k5716L343L685O025J9828J6113k7409N537j9445k2028K4492
$$ 446 15323 9407 -16309 -12966 -9281 -3256 16572 32685 5276 10813 -8632 -30660 -6168
5464f168K1310K4003l3587k5970N358P876J24L644J939r525L3742K3359k7540
$$ -6168 15142 39145 5558 -20412 -15054 -7178 -7054 -3410 -1471 -10996 22746 46105 18565
5451A8565j7678J6459j3536O916q675K659m088j9839J6182Q995j3510p755n961
$$ 18565 887 17346 3810 10726 2051 4710 622 -19217 -3035 5960 -7550 -15305 -21266
5438b1266j107K1127O095q545J5991q658k924k5676k4582l487J0037J4430L7654
$$ -21266 -22373 -1246 4849 -3696 12295 3637 713 -24963 -49545 -53032 -42995 -28565 9089
5425I089N0894j5263k9876j5251L613M971K061N453j6426K6750K622k7231k6480
$$ 9089 59983 44720 14844 -407 3206 8177 10238 15691 -735 26015 28637 1406 -25074
5412b5074J4569K1683o646j5469r334l1832k279K0409r691j7495N973Q387r146
$$ -25074 -10505 11178 4532 -10937 -20271 -52103 -54382 -33973 -43664 -61159 -55186 -46799 -55945
5399e5945o258J9072m316O176R263K0922J5091P742J0382J19L637p200Q02j1286
$$ -55945 -62203 -43131 -47447 -41271 -32008 -11086 4005 11747 22129 22248 25885 18685 19487 8201
5385H201k2121J0982K5396Q056k0891Q801K601P383J8020J132k6150k7974j2161
$$ 8201 -13920 -2938 22458 30514 9623 18424 21025 28408 46428 47560 21410 -6564 -18725
5372a8725q5Q035j1028j0648K3551J2187J0927Q987j0747j5521K864r499l832
$$ -18725 -18810 -10775 -21803 -32451 -8900 3287 14214 23201 12454 -3067 -203 -9702 -13534
5359a3534k042j1352J1281K130m028N000j5609K5037k325j0851j950l79K9116
$$ -13534 -15576 -26928 -15647 -13517 -17545 -12545 -28154 -3117 -5442 -16293 -18243 -18622 10494
5346A0494j0008k970N696j0825j6732M87O950N787j0459q175K7858R035j4220
$$ 10494 486 -2484 3212 -7613 -24345 -23858 -16908 -11121 -21580 -29755 -1897 7138 -7082
5333g082O313m302J5700p848p757k2353M227J5605j5372m410M63J5939j4539J1916
$$ -7082 -769 -5071 10629 2781 -4976 -27329 -23102 -7497 -22869 -27279 -26816 -10877 -25416 -13500
5319a3500m04m803l6431l2521K2255j145K0294K0841K8758K2989J0038j2251j1973
$$ -13500 -13904 -18707 -55138 -87659 -65404 -66549 -46255 -25414 3344 26333 36371 24120 12147
5306A2147N740j4604k9219J0716J8334K683R58j9779j2853K3691L0567j6151q14
$$ 12147 17887 3283 -25936 -15220 3114 5797 6755 -13024 -25877 -2186 28381 12230 11416
5293A1416j4568k2644J5951J385j290qL9876K2372n399j1627k445j8746j5678
$$ 11416 -3152 -25796 -9845 -8460 -9750 -9758 30118 52490 47091 35464 33019 14273 -1405
5280a405J4423k930J1978l0339j3832L995J9350J8048j3627j1075J389J6211O520
$$ -1405 13018 10088 22066 -8273 -22105 -18110 1240 19288 5661 -5414 -4025 12186 18706
5267A8706n724j5146j5576j3296l172j9641j4191j2694L7292J1946R035J7101
$$ 18706 12982 -2164 -17740 -31036 -34208 -53849 -68040 -80734 -43442 -31496 -22461 -5360
5255e360Q88k8693J4174K3361j8545j9375n000M123R328M5638M329l0409k0836
$$ -5360 -4472 -33165 -18991 4370 -14175 -33550 -38550 -34427 -25099 20539 24868 -5541 -26377
5242b6377r835J8306p912j6830N228K0510k0586O025p53K269L7530K4314M054
$$ -26377 -36212 -17906 -25818 -42648 -37420 -16910 -37496 -31471 -32224 -29955 7575 31889 35943
5229C5943j4796J390J9062m861k9089K4811L130k6282n813o388J0581J1890K043
$$ 35943 21147 22537 41599 36738 7649 32460 35590 9308 3495 -2893 7688 19578 21621
5216B1621k1696J1856J0835l706n559n324o619K429j628N185j5672M274K7137
$$ 21621 -75 11781 22616 18910 13351 8027 1408 3837 2209 7394 -8278 -4004 23133
5203B3133J1668r697j7950j5668j5046o47j0357P358M734Q851J334O601j0919
$$ 23133 34801 25104 7154 -8514 -23560 -24207 -34564 -27206 -22472 -13621 -12287 -5686 -16605
5190a6605j3356m137J7465J1020j1308K2571L2880k661L085l702m8269p275P600
$$ -16605 -29961 -34098 -16633 -5613 -16921 5650 38530 35869 38954 35252 -13017 -20292 -12692
$$ [...]
##END NTUPLES=NMR SPECTRUM
##END=
