##TITLE=Analysis number 324588
Compound Code tl 00927
Book Reference 451/181
Project Code adrs
Chemist Name evam
##JCAMPDX= 6.0         $$ Bruker NMR JCAMP-DX V2.0
##DATA TYPE= NMR SPECTRUM
##DATA CLASS= NTUPLES
##ORIGIN= Bruker BioSpin GmbH
##OWNER= nmr
$$ XWIN-NMR		Version 3.5
$$ Mon Nov 27 11:46:30 2006 GMT Standard Time (UT+0h)  MAYBRIDGE\nmr@NMR_250MHZ
##.OBSERVE FREQUENCY= 250.131544655141
##.OBSERVE NUCLEUS= ^1H
##.ACQUISITION MODE= SIMULTANEOUS (DQD)
##.ACQUISITION SCHEME= undefined
##.AVERAGES= 16
##.DIGITISER RES= 18
##SPECTROMETER/DATA SYSTEM= dpx250
##.PULSE SEQUENCE= zg30
##.SOLVENT NAME= DMSO
##.SHIFT REFERENCE= (INTERNAL, DMSO, 0, 16.522)
##AUDIT TRAIL= $$ (NUMBER, WHEN, WHO, WHERE, WHAT)
$$ ##TITLE= Audit trail, XWIN-NMR		Version 3.5
$$ ##JCAMPDX= 5.01
$$ ##ORIGIN= Bruker BioSpin GmbH
$$ ##OWNER= nmr
$$ C:\u/data/dgb/nmr/ADRS/1140/pdata/1/auditp.txt
$$ ##AUDIT TRAIL=  $$ (NUMBER, WHEN, WHO, WHERE, WHAT)
(   1,<2006-11-27 11:45:56.47 +000>,<MAYBRIDGE\nmr>,<NMR_250MHZ>,
      <created by zg, POWCHK disabled, PULCHK disabled
       configuration hash MD5:
       49 4B E0 1D 92 C2 6B 37 9F E6 65 BC 52 41 86 1D
       data hash MD5: 64K
       C5 41 27 2C A9 76 16 0C 58 96 9C 61 63 22 74 BC>)
(   2,<2006-11-27 11:46:16.64 +000>,<MAYBRIDGE\nmr>,<NMR_250MHZ>,
      <Start of raw data processing
       ef LB = 0.3 FT_mod = 6 PKNL = 1 SI = 32K 
       data hash MD5: 32K
       0D 8F 50 17 6E 00 11 F6 50 97 B3 17 69 43 96 91>)
(   3,<2006-11-27 11:46:18.75 +000>,<MAYBRIDGE\nmr>,<NMR_250MHZ>,
      <apk 
       data hash MD5: 32K
       66 C9 09 A0 2F 0D 33 04 B8 3D 4E 89 60 7C B8 88>)
(   4,<2006-11-27 11:46:19.50 +000>,<MAYBRIDGE\nmr>,<NMR_250MHZ>,
      <abs ABSG = 5 
       data hash MD5: 32K
       37 32 9D AB 29 A7 B6 86 A1 3D F4 B1 52 4A 23 23>)
$$ ##END=
$$ 
$$ hash MD5
$$ EB BB 41 2A B7 D3 DF C6 9E 3D 07 69 19 CC 95 94
##$RELAX= 
##$RELAX= 
##$RELAX= 
##$RELAX= 
##$RELAX= 
##$RELAX= 
##$RELAX= 
$$ Bruker specific parameters
$$ --------------------------
##$DU= <C:\u>
##$EXPNO= 1140
##$NAME= <ADRS>
##$PROCNO= 1
##$TYPE= <nmr>
##$USER= <dgb>
##$AMP= (0..31)
100 100 100 100 100 100 100 100 100 100 100 100 100 100 100 100 100 100 
100 100 100 100 100 100 100 100 100 100 100 100 100 100 
##$AQSEQ= 0
##$AQ_mod= 3
##$AUNM= <au_zg>
##$AUTOPOS= <47 >
##$BF1= 250.13
##$BF2= 250.13
##$BF3= 250.13
##$BF4= 250.13
##$BF5= 500.13
##$BF6= 500.13
##$BF7= 500.13
##$BF8= 500.13
##$BYTORDA= 1
##$CFDGTYP= 0
##$CFRGTYP= 5
##$CHEMSTR= <none>
##$CNST= (0..31)
1 1 145 1 1 1 1 1 1 1 1 1 1 1 1 1 1 1 1 1 1 1 1 1 1 1 1 1 1 1 1 1 
##$CPDPRG= <>
##$CPDPRG1= <>
##$CPDPRG2= <>
##$CPDPRG3= <>
##$CPDPRG4= <mlev>
##$CPDPRG5= <mlev>
##$CPDPRG6= <mlev>
##$CPDPRG7= <mlev>
##$CPDPRG8= <mlev>
##$CPDPRGB= <>
##$CPDPRGT= <>
##$D= (0..31)
0 1 0 0 0 0 0 0 0 0.06 0 0 0 0 0 0 0.0002 0 0 0 0 0 0 0 0 0 0 0 0 0 0 
0 
##$DATE= 1164627955
##$DBL= (0..7)
120 120 120 120 120 120 120 120 
##$DBP= (0..7)
150 150 150 150 150 150 150 150 
##$DBP07= 0
##$DBPNAM0= <>
##$DBPNAM1= <>
$$ [...]
##$SUBNAM7= <"">
##$SUBNAM8= <"">
##$SUBNAM9= <"">
##$SW= 20.6930455092707
##$SWIBOX= (0..15)
0 0 3 0 0 0 0 0 0 0 0 0 0 0 0 0 
##$SW_h= 5175.983436853
##$TD= 65536
##$TD0= 1
##$TE= 294.16
##$TE2= 300
##$TE3= 300
##$TEG= 300
##$TL= (0..7)
0 120 120 120 120 120 120 120 
##$TP= (0..7)
150 150 150 150 150 150 150 150 
##$TP07= 0
##$TPNAME0= <>
##$TPNAME1= <>
##$TPNAME2= <>
##$TPNAME3= <>
##$TPNAME4= <>
##$TPNAME5= <>
##$TPNAME6= <>
##$TPNAME7= <>
##$TPOAL= (0..7)
0.5 0.5 0.5 0.5 0.5 0.5 0.5 0.5 
##$TPOFFS= (0..7)
0 0 0 0 0 0 0 0 
##$TUNHIN= 0
##$TUNHOUT= 0
##$TUNXOUT= 0
##$USERA1= <user>
##$USERA2= <user>
##$USERA3= <user>
##$USERA4= <user>
##$USERA5= <user>
##$V9= 5
##$VALIST= <valist>
##$VCLIST= <CCCCCCCCCCCCCCC>
##$VD= 0
##$VDLIST= <DDDDDDDDDDDDDDD>
##$VPLIST= <PPPPPPPPPPPPPPP>
##$VTLIST= <TTTTTTTTTTTTTTT>
##$WBST= 1024
##$WBSW= 4
##$XGAIN= (0..3)
0 0 0 0 
##$XL= 0
##$YL= 0
##$YMAX_a= 234053
##$YMIN_a= -422871
##$ZGOPTNS= <>
##$ZL1= 120
##$ZL2= 120
##$ZL3= 120
##$ZL4= 120
##$ABSF1= 16.522
##$ABSF2= -4.171173
##$ABSG= 5
##$ABSL= 3
##$ALPHA= 0
##$AQORDER= 0
##$ASSFAC= 0
##$ASSFACI= 0
##$ASSFACX= 0
##$ASSWID= 0
##$AUNMP= <proc_1d>
##$AZFE= 0.1
##$AZFW= 0.1
##$BCFW= 0
##$BC_mod= 0
##$BYTORDP= 0
##$COROFFS= 0
##$CY= 12.5
##$DATMOD= 1
##$DC= 0
##$DFILT= <>
##$DTYPP= 0
##$F1P= 14.0000005364418
##$F2P= -0.99999901652339
##$FCOR= 0.5
##$FTSIZE= 32768
##$FT_mod= 6
##$GAMMA= 0
##$GB= 0
##$INTBC= 1
##$INTSCL= 1
##$ISEN= 128
##$LB= 0.3
##$LEV0= 0
##$LPBIN= 0
##$MAXI= 10000
##$MC2= 0
##$MEAN= 0
##$ME_mod= 0
##$MI= 0
##$NCOEF= 0
##$NC_proc= -4
##$NLEV= 6
##$NOISF1= 0
##$NOISF2= 0
##$NSP= 0
##$NTH_PI= 0
##$NZP= 0
##$OFFSET= 16.522
##$PC= 1
##$PHC0= 210.2248
##$PHC1= 7.827999
##$PH_mod= 1
##$PKNL= yes
##$PPARMOD= 0
##$PSCAL= 4
##$PSIGN= 0
##$REVERSE= no
##$SF= 250.13
##$SI= 32768
##$SIGF1= 0
##$SIGF2= 0
##$SINO= 400
##$SIOLD= 32768
##$SREGLST= <1H.DMSO>
##$SSB= 0
##$STSI= 32768
##$STSR= 0
##$SW_p= 5175.98343685301
##$SYMM= 0
##$S_DEV= 0
##$TDeff= 65536
##$TDoff= 0
##$TI= <Analysis number 999999
Compound Code 99
Book Reference 9
Project Code 9>
##$TILT= no
##$TM1= 0
##$TM2= 0
##$TOPLEV= 0
##$USERP1= <user>
##$USERP2= <user>
##$USERP3= <user>
##$USERP4= <user>
##$USERP5= <user>
##$WDW= 1
##$XDIM= 32768
##$YMAX_p= 534269271
##$YMIN_p= -198850
$$ End of Bruker specific parameters
$$ ---------------------------------
##NTUPLES= NMR SPECTRUM
##VAR_NAME=  FREQUENCY,     SPECTRUM/REAL,   SPECTRUM/IMAG
##SYMBOL=    X,             R,               I
##VAR_TYPE=  INDEPENDENT,   DEPENDENT,       DEPENDENT
##VAR_FORM=  AFFN,          ASDF,            ASDF
##VAR_DIM=   32768,         32768,           32768
##UNITS=     HZ,            ARBITRARY UNITS, ARBITRARY UNITS
##FACTOR=    0.157963299565203, 1,           1
##FIRST=     4132.6476996994, 0,             0
##LAST=      -1043.33573715361, 0,           0
##MIN=       -1043.33573715361, -198850,     0
##MAX=       4132.6476996994, 534269271,     0
$$ Real data points
##PAGE= N=1
##DATA TABLE= (X++(R..R)), XYDATA
$$ [...]
21655H1159K95m2288o5272o3675R622Q083j4873J4354L6883j9426l0445k1423
21643a07006O4624M2621k3314r117N2218j3089n941K8506j9260J1607k2417m6192
21631d6760J7696M9488R48l0185K3210j9334r888K2646Q989o43m4171k2998r670
21618f0672j8233N2754N0233K9547k8165o6953K609P678N7830l1171m5796L551
21606d6788J2291n122j3475l2491l6096N5695M5952K9801k8613L8316k4604m9098
21594e4232n4561J1635K4368p957r644l6237O001L8048L5792K2271k1433K2677
21582b3272K9330n7264R855M5615L7953j2750m4833M0648M1680P651j009l1526
21570D2078q9205j6816M8101J2685m1552K0044J9151p690k669l9258m5231n641
$$ plain form
21655 81159 81454 39166 -26106 -89781 -80159 -72076 -86949 -72595 -35712 -55138 -85583 -107006
21643 -107006 -42382 239 -23075 -32192 20026 6937 996 29502 10242 21849 -568 -46760
21631 -46760 -29064 20424 21372 -8813 14397 -4937 -14825 7821 16810 16167 -28004 -51002 -60672
21618 -60672 -78905 -26151 24082 53629 25464 -41489 -38880 -31202 26628 -4543 -50339 -46788
21606 -46788 -34497 -39619 -53094 -85585 -121681 -65986 -20034 9767 -18846 19470 -5134 -54232
21594 -54232 -108793 -97158 -72790 -80747 -90391 -126628 -120627 -82579 -46787 -24516 -45949 -23272
21582 -23272 6058 -51206 -41351 4264 42217 29467 -15366 25282 66962 74613 73604 42078
21570 42078 -47127 -63943 -15842 -3157 -44709 -24665 -5514 -13204 -15873 -55131 -100362 -106003
21558a06003K7696K8136K9273K4086j5419m7852j7687M2308J0136K4119J77k006
21546c036j3911l7578n1084l8645L5449L3957k2311J2843M7433j3408J2764P0149
21534C2622M0566j2299o8806l8170K3728k581l7043q093L6722J5778r938n230
21522c2744j9317m22K6805j0648O972J7276k8188k027M6533q337P966l5049O028
21509b5152N5441n210k3671K8024J2747m4973j3042j1641J3475j6292k3301J4623
21497c8972L347J7533j0116j3230p845J0211O5521k0787l7880Q974m8645Q419
21485f3470m4222j7844M0120P217M5638j106O469M1889l0433R959k1863k974M9748
21472A9128M4263M246l2869j8664k7247K0348j7744L809J4956J5868m8417j6263
$$ plain form
21558 -106003 -78307 -50171 -20898 3188 -12231 -60083 -77770 -35462 -25326 -1207 -1030 -3036
21546 -3036 -16947 -54525 -105609 -144254 -108805 -74848 -97159 -84316 -36883 -50291 -37527 32622
21534 32622 73188 60889 -7917 -46087 -22359 -24940 -61983 -70076 -33354 -17576 -27514 -32744
21522 -32744 -52061 -52483 -25678 -36326 -29354 -12078 -40266 -42293 4240 -4097 3869 -31180 -25152
21509 -25152 30289 25079 1408 29432 42179 -2794 -15836 -27477 -14002 -30294 -53595 -38972
21497 -38972 -35625 -18092 -28208 -41438 -49283 -39072 26449 5662 -32218 -23244 -71889 -63470
21485 -63470 -107692 -125536 -85416 -78199 -32561 -33667 -27198 14691 -15742 -5783 -27646 -30620 19128
21472 19128 63391 67637 34768 16104 -11143 9205 -8539 -4730 10226 26094 -22323 -38586
21460c8586n5903J2293K5870K0183J3608Q675N3027j0619l2170n3131j8618L810
21448g1561M5716L9943K7428o4011K546O5082K2056m5654j4586q708k9693k4790
21436e6232r898J5260k1293j3701P747L8031J811M4653L5083J677q595k5002j1236
21423a695N2689k7661m1235k2810L0584O1315L9827k8363l3415l4815k7676l3783
21411f7038J1850K4406K2069n8635l8931m1546q016M2644N4786L3823K7147M0593
21399D3152N4212j9870l9353l4101j3367M5414k3072o9228k7045J538M6n911n7642
21386a45227n387M0803M6300K3017k8669j3412L7760q660J8338k0361M1502M5119
21374C1123N932m0809K0754O377m4394q1088o118J4977j559Q519O30L0096N1062
$$ plain form
21460 -38586 -94489 -82196 -56326 -36143 -22535 -13860 39167 28548 -3622 -56753 -75371 -71561
21448 -71561 -25845 14098 41526 -22485 -19939 45143 67199 21545 6959 -1749 -31442 -56232
21436 -56232 -66130 -50870 -72163 -85864 -78117 -40086 -38275 6378 41461 43138 34543 9541 -1695
21423 -1695 50994 23333 -17902 -40712 -10128 51187 91014 62651 29236 -5579 -33255 -67038
21411 -67038 -55188 -30782 -8713 -67348 -106279 -147825 -155841 -113197 -58411 -24588 2559 43152
21399 43152 97364 77494 38141 4040 -9327 36087 13015 -56213 -83258 -81720 -81674 -87585 -145227
21386 -145227 -150614 -109811 -63511 -40494 -69163 -82575 -44815 -53475 -35137 -55498 -13996 31123
21374 31123 37055 -3754 17000 23377 -21017 -102105 -108223 -93246 -94805 -86286 -85656 -55560 -4498
21361d498o809K44L5645K7171k1784n9957o1688n790J2883N9583Q363K955j01687
21348a15369k1102N5926N1194M4714P44o599k486j727J530q157j8804j9918K4528
21335a5526m3087M159K3368K1819M1083n7199p7830K3553L1013R115M788L2037
21323b707r04j9099m8082M3776N7830J7740p0909m3970K6711J5305L3201o318
21311B574k4696J554j7851J2908l816j8176O9408K3021q106l5935J1166L1300
21299D3351k3346K5354k5178N1384J5310k0057n5317j9159J6219l4800j9449k1327
21287f7015L7008K1245K3672k9661j8493o564q002K9112L7775n9678l2779j8988
21275i2368J0331Q6764k8412k0381m353L9692n2888k5504L3695J5899m6574M9557
$$ plain form
21361 -4498 -11307 -11063 24582 51753 29969 -29988 -91676 -97466 -84583 -25000 -16637 -13682 -115369
21348 -115369 -136471 -80545 -29351 15363 16107 9508 7022 5295 6825 -1332 -20136 -40054 -15526
21335 -15526 -58613 -54454 -31086 -9267 31816 -25383 -103213 -79660 -48647 -39532 -34744 -2707
21323 -2707 -3611 -22710 -70792 -27016 30814 48554 -22355 -66325 -39614 -24309 8892 2574
21311 2574 -22122 -20568 -38419 -25511 -29327 -47503 21905 44926 36820 885 12051 43351
21299 43351 20005 45359 20181 71565 86875 66818 11501 -7658 8561 -26239 -45688 -67015
21287 -67015 -30007 -8762 14910 -14751 -33244 -39808 -47810 -18698 19077 -40601 -73380 -92368
21275 -92368 -82037 4727 -23685 -44066 -48419 -8727 -61615 -87119 -53424 -37525 -84099 -34542
21263c4542N0885K373o0997j855N7154j08j3862L028m5452J3914j6647J50J7227
21250b8732K1120M2146K6366j8668l8742K6335M9960n5349o219o945l8702R26
21238b6504K548O6168J7746n3158o0373q851K2504P349k8237j2927o745J5688
21226f4792k310J3136k6119K4669k952K2494L2332j7957j6233l03K4422M0370
21214B6757l152m8229l9772l8547r649K0358J3674k6706j6807L4237K2997k8025
21202i2864k621M2261J4180j3111l4390j1310M1548k8770l5957M5152L8465j1418
21190d8835Q661j0825o249l0080L4210N1107l717l078j7787j1952j606l802K2265
21177b1688J3279J8820L6928j0923q5186J7502M9610O798J6474l911n1266j4752
$$ plain form
21263 -34542 16343 18716 -42281 -44136 13018 12910 -952 2076 -43376 -29462 -46109 -45959 -28732
21250 -28732 -7612 34534 60900 42232 3490 29825 79785 24436 18217 11272 -27430 -26504
21238 -26504 -23956 42212 59958 6800 -53573 -62424 -39920 -32571 -60808 -73735 -80480 -64792
21226 -64792 -67102 -53966 -80085 -55416 -58368 -35874 -3542 -21499 -37732 -38035 -13613 26757
21214 26757 23605 -24624 -64396 -102943 -112592 -92234 -78560 -105266 -122073 -87836 -64839 -92864
21202 -92864 -95485 -53224 -39044 -52155 -86545 -97855 -56307 -85077 -121034 -75882 -37417 -48835
21190 -48835 -40174 -50999 -57248 -87328 -53118 -2011 -5728 -8806 -26593 -38545 -40151 -43953 -21688
21177 -21688 -8409 10411 47339 36416 -48770 -31268 18342 25140 41614 37703 -13563 -28315
21165b8315j889j9060k8537L4561j7673n262N6859K9127l3125m9723M4326K2479
21153C768m0452k5132J2357J5390L9180L681j9331o5231K4241N5978M7990J1522
21141F3961j1931M4256m1699m9024L118J0236L3908L496j1804M8195L553k7037
21129F9228k9689l2393m4249o2354J2020J08475j2375m4933R588P203J1431j904
21117i952n801k8319k8651R558j9807m1815R6523J3486m623J1726K9937J2165
21105C4427M2470o2533n3320O696M7719K1044L7626J3075j3864o6154q9250j237
21093h3301J4442P944M3985L567J239K1279j04246l2438P2831K1870k3003K6839
21081b8992N181n0316P072k5437k6409q652M9466O9303M6528k0117j3056l2495
$$ plain form
21165 -28315 -30204 -49264 -77801 -43240 -60913 -66175 -9316 19811 -13314 -63037 -18711 3768
21153 3768 -36684 -61816 -49459 -34069 5111 8792 -10539 -75770 -51529 4449 52439 63961
21141 63961 52030 96286 54587 5563 8681 18917 52825 56321 44517 92712 96265 69228
21129 69228 39539 7146 -37103 -99457 -87437 21038 8663 -36270 -26682 -19479 -8048 -9952
21117 -9952 -15753 -44072 -72723 -63165 -82972 -124787 -28264 -14778 -19401 -7675 22262 34427
21105 34427 76897 14364 -38956 -32260 15459 36503 74129 87204 73340 7186 -82064 -83301
21093 -83301 -68859 -60915 -16930 -13363 -12124 9155 -95091 -127529 -54698 -32828 -55831 -28992
21081 -28992 -23811 -74127 -67055 -92492 -118901 -127553 -78087 -8784 37744 17627 4571 -27924
21069b7924l3447L4035J2647J8978J4162L398J5301j0950l2518P220R610k6416
21057a5904N7521o064m4321J4053K9975K6445J5445J7132l4890j8829J0217l4628
21045A6152k1940P2100m8790q1997j4307N6647O3876L3826j3808J4022j3195m8491
21033A4095l8567K2076M933l4396R260J5859j1820R294P088O570j4563M1666O3385
21020I4880k8549n8532l3473q892K8906K002O924L9514k0415m8860L379M4845
21008B1729J9893M2091P95q3174k6153k5456K8264K9518L5256P551j2605J446
20996C9155o3888m1556l5168k9693M4197M0355K806j7285L3878M3798L2040K0323
20984F8962o2395l5291q527j0657m987L049o517J3592l850j2275q269R409J2719
$$ plain form
21069 -27924 -61371 -27336 -14689 4289 18451 21849 37150 26200 -6318 902 10512 -15904
21057 -15904 41617 35553 -8768 5285 35260 61705 77150 94282 59392 40563 50780 16152
21045 16152 -5788 66312 17522 -64475 -78782 -22135 41741 75567 61759 75781 62586 14095
21033 14095 -24472 -2396 2537 -31859 -22599 -6740 -18560 -9266 -2178 4392 -10171 31495 94880
21020 94880 66331 7799 -25674 -34566 -5660 -3658 3266 42780 22365 -26495 -23116 21729
21008 21729 41622 83713 84508 1334 -24819 -50275 -22011 7507 42763 50314 37709 39155
20996 39155 -24733 -66289 -101457 -131150 -86953 -46598 -43792 -61077 -27199 16599 48639 68962
20984 68962 6567 -28724 -37251 -47908 -52895 -49846 -56363 -42771 -46621 -58896 -67165 -57756 -45037
20971d5037j6132q099k9035k33M1499L0389l6766j9704K2292M9380k6851j0027
20959d8324K8274N4313M5209l415o5634k6586J3603j1434M8811k2955r240J5211
20947A7833J7432J3773J1258K1857l4125m8584k1012Q58o6491l5M6162L7936J4276
20934A1138n0972K8286K1746k534m9151n5105k5776P013O3332K5481j1985M6984
20922H457m247J4059J0327n1722l500K6224J6196k4977k3534L2731P312j0245
20910b919m7160n4839k8584L4566O0831N2100j705J0018j8963O97j1705j5686
20898b3349N9158J4925k0431m9786J3112L5572K8661L5705L109m7255J2147j5542
20886D6026k3015M1698k3845L4085k2077m8696l5581k3846o35J8288J4959j052
$$ plain form
20971 -45037 -61169 -69268 -98303 -98536 -57037 -26648 -63414 -83118 -60826 -11446 -38297 -48324
20959 -48324 -20050 34263 79472 76057 10423 -16163 -2560 -13994 34817 11862 2622 17833
20947 17833 35265 49038 60296 82153 48028 -556 -21568 -20710 -87201 -87236 -41074 -3138 11138
20934 11138 -39834 -11548 10198 7664 -41487 -96592 -122368 -115355 -52023 -26542 -38527 8457
20922 8457 4210 18269 28596 -23126 -26626 -402 15794 -9183 -32717 14 7326 -2919
20910 -2919 -50079 -104918 -133502 -98936 -38105 13995 12290 22308 3345 4042 -7663 -23349
20898 -23349 35809 50734 30303 -19483 -6371 29201 57862 93567 96676 49421 61568 46026
20886 46026 23011 64709 40864 74949 52872 4176 -31405 -55251 -55886 -37598 -22639 -23691
20874b3691K5665j9040o1703K8942J0492K6336k6745K1048M8572J6583k1082o0573
20862c5196j1466L0100J315j0324k420j3015L2384k3035l6213p245O6533M9924
20850D1342j9667j3468J0437o053m0419n6654n0786j8567N312o822K7148L6624
20838i1573M6356P2572O990m373l2015J060n6797J9474K4672j6022L8282J1195
20826A9821J2557K0919n1570m3027J6657n6499r477L5974M0365M335K890J8802
20814A1747j7385k2536j0363L1598j6044k0321N743M6287k2125q870M4193p161
20802A4763j4715J1142L1654k7452j5164J4224K814L7848J1837o3010j25814M7806
20790g4067M6331K435j6515m405J4912N0172k6025l5675L1431K3840m1411P5J6932
$$ plain form
20874 -23691 1974 -17066 -78769 -49827 -39335 -12999 -39744 -18696 29876 46459 25377 -35196
20862 -35196 -46662 -16562 -15247 -25571 -27991 -41006 -8622 -31657 -67870 -75115 -8582 41342
20850 41342 21675 8207 18644 12591 -27828 -84482 -135268 -153835 -148523 -155345 -128197 -91573
20838 -91573 -45217 27355 34345 29972 -2043 -983 -57780 -38306 -13634 -29656 8626 19821
20826 19821 32378 53297 1727 -41300 -24643 -81142 -90619 -54645 -14280 -9945 -7055 11747
20814 11747 -5638 -28174 -38537 -6939 -22983 -43304 -37561 8726 -13399 -22269 21924 14763
20802 14763 48 11190 42844 15392 228 14452 17266 55114 66951 3941 -121873 -74067
20790 -74067 -27736 -25301 -41816 -46221 -31309 18863 -7162 -42837 -11406 12434 -28977 -28902 -11970
20777a1970L541k6776j23l6391m211M1496K7573J1105m1416k2908k6142m47J1940
20764g4729J0975L5255M5475J571l0354j5565L9350j4331m3272j2047J7765N8824
20752A8917L6091q967o161K3433r978n858n655j3905m9490j6518k068r204j5770
20739f5133l977N519M1255J0256L8528K927m3937j4708M2112P346Q998o0534j5816
20726d7164N4971j9061k5429L363n7166l1809K3892J2488N2473L1357L9065n4731
20714a7751m9227N693N5497N1891j3675j9260j6897j809n8135q110l843P8551
20702B925K8343l0236j7745k6960J6629L7472n3600n826J4063J5403L8940J9729
20690C9137k0606m7128l0254J2853J0127L93J0931k0254m542M168k1646O1936
$$ plain form
20777 -11970 -8429 -35205 -35328 -71719 -75930 -34434 -6861 4244 -37172 -60080 -86222 -86669 -74729
20764 -74729 -63754 -28499 16976 18547 -11807 -27372 11978 -2353 -45625 -57672 -39907 18917
20752 18917 55008 46041 39880 63313 53335 47477 41822 27917 -21573 -38091 -40159 -49363 -65133
20739 -65133 -69110 -63591 -22336 -12080 26448 29375 -14562 -29270 12842 20188 29186 -31348 -47164
20726 -47164 7807 -11254 -36683 -33320 -90486 -122295 -98403 -85915 -33442 -2085 36980 -17751
20714 -17751 -66978 -61285 -5788 46103 32428 13168 -3729 -5538 -63673 -71783 -75626 2925
20702 2925 31268 1032 -16713 -43673 -27044 10428 -43172 -48998 -34935 -19532 19408 39137
20690 39137 18531 -28597 -58851 -45998 -35871 -35478 -24547 -44801 -49343 -45175 -66821 -4885
20678d885J2455l1703J6354l8900l9798K7820J3620K3338n45k120P508K0038j7843
20665a4661l2450j3772K8871K8647p783l8313j2350N8459j0181k9000M5785j3059
20653i807q791m2624J8989M3214N5070p6156l7802m2516K7179L3405J378l1657
20641g0118J0590N9289k088l7630j5053j4842R52r709j0940j8212K9798M8796
20629b9167J4240P6634J4840m5070n9113n966L7809K2496m3494k5095k1751M4454
20617a9183K1437K3217k388n2364n2644K9825Q0083m0354p0992m14M9820M5208
20605A1251K8837j2723k7047K6778K3419l6171k4025M431M5980L1097l6795j046
20593C3986M992l0307j4981M1944j0859r3695l8269L9769M8330k2011o3993N198
$$ plain form
20678 -4885 7570 -24133 -7779 -46679 -86477 -58657 -45037 -21699 -22244 -24364 -16856 3182 -14661
20665 -14661 -47111 -60883 -32012 -3365 -11148 -49461 -61811 -3352 -13533 -42533 3252 -9807
20653 -9807 -18598 -61222 -42233 981 56051 -20105 -57907 -100423 -73244 -39839 -38461 -70118
20641 -70118 -59528 -239 -2327 -39957 -55010 -69852 -68900 -78609 -89549 -107761 -77963 -29167
20629 -29167 -14927 61707 76547 31477 -27636 -33602 4207 26703 -16791 -41886 -63637 -19183
20617 -19183 2254 25471 23083 -29281 -81925 -52100 27983 -12371 -83363 -83777 -33957 11251
20605 11251 40088 27365 318 27096 50515 14344 -9681 -5250 40730 71827 35032 33986
20593 33986 38978 8671 -6310 35634 24775 -68920 -107189 -67420 -19090 -41101 -105094 -99896
20581i9896N4437Q3808j0141n7272r904K455P4246j0969r541M1799K9325n2460
20569C5887l1715k7410l7635L653k5051L3608N4657o5063j5301O0070J5942j1994
20557a0352p1431K122Q628p749p94L1157o67j0780p077L1422K9358j9833R970
20544a6026J7444m6025p219J8170k0679k5972M0641L2621j3985K5458K2743K0382
20532D7553m1207o8651o467J1776j5187l0177J8346O7402K6429k3225n2993N2611
20520a3790j9461j5813J5741M02K9320J7266j3334j5083k4014j8400L7743J5270
20508d153K0796N089J1259M0741o84p7459k9065O336l0952L6062K0947Q301l2256
20495b5038j9396l2200j9367J623K9866M6052J0461o991K5915J8148N666q350
$$ plain form
20581 -99896 -45459 38349 28208 -29064 -38968 -36513 37733 26764 17223 59022 88347 35887
20569 35887 4172 -23238 -60873 -57220 -82271 -48663 5994 -59069 -74370 -14300 1642 -10352
20557 -10352 -81783 -79661 -71033 -78782 -79576 -48419 -49086 -59866 -66943 -35521 -6163 -25996 -16026
20544 -16026 1418 -44607 -51826 -33656 -54335 -80307 -39666 -7045 -21030 4428 27171 47553
20532 47553 6346 -62305 -68772 -56996 -72183 -102360 -84014 -16612 9817 -13408 -66401 -13790
20520 -13790 -33251 -49064 -33323 -32921 -3601 13665 331 -14752 -38766 -57166 -19423 -4153
20508 -4153 16643 21732 32991 73732 73048 -4411 -33476 -27140 -58092 -22030 -1083 7218 -25038
20495 -25038 -44434 -76634 -96001 -94378 -64512 -18460 -7999 -14990 10925 29073 34739 26389
20483B6389R013q5778l8108N8570r911k6679M1119N3130L1942J2136j9765k0592
20471C1466R703M8932l2202m9615j4259j8653j4204J9081m648K6589M1362J8753
20459F2305n3304n228k2671q741j2871j9533N308l113O1999N5247L7332O420k7269
20446G5881O316k7790l3847k9622l692J6749J0285j8183P899q452J3762m395m1348
20433c6437O4852p132j4892k7607o466N104K4765O327l4857l2259J2142j2321
20421e8781j8359L8298K3746J2492m5765M7056M9338K3303k9207l4753j2537j6179
20409b1348j5296L1914j3872n2606K3898N3686K5518O818m4398j1195L792J0368
20397b721q722K3648Q5002L4336J3274J6048n4676P499M984m1314m4106L0691
$$ plain form
20483 26389 35402 -50376 -88484 -29914 -39825 -66504 -25385 27745 59687 71823 52058 31466
20471 31466 41169 90101 57899 8284 -5975 -24628 -38832 -19751 -24399 2190 43552 62305
20459 62305 9001 3773 -18898 -27639 -40510 -60043 -54735 -57848 4151 59398 96730 103150 75881
20446 75881 82197 54407 20560 -9062 -12754 3995 14280 -3903 3996 -4456 9306 4911 -36437
20433 -36437 28415 21283 6391 -21216 -27682 -22578 2187 8514 -26343 -58602 -46460 -58781
20421 -58781 -77140 -38842 -15096 -2604 -48369 -1313 48025 71328 42121 7368 -5169 -21348
20409 -21348 -36644 -4730 -18602 -71208 -47310 6376 31894 38712 -5686 -16881 -13089 -2721
20397 -2721 -11443 12205 97207 131543 144817 160865 106189 113688 118672 77358 33252 63943
20385F3943j4966l5151k0199p312L6278o112J9050p084M4082k2968m537R397J7832
20372G2253p512p822L2890K3534k8566n8203j5114k6186p054q907k9780j1150
20360g1617k2230m532M4919R0194L5990k6059m6250P3738N1814l9684L111O993
20348I6387n5571m7981m3744M7487M2317n8644j7583M9332Q6710m6637m5742J8065
20336B4396P642J7671K8562J9617j7004M7062l8372p3871m430O2675L858O346
20324H4152l3754k5750J0600P2778M1509k0936p1351k6613N1016N4518k4491n8389
20312E3289K1826l9849k9710L1552P187J5961L7280L6829k9702k0988l0171N0069
20300A03573P6467J2145J5039M6391N6513J5511M551n024l6835j6079Q52l7293
$$ plain form
20385 63943 48977 13826 -6373 -13685 22593 16481 35531 28447 72529 49561 45024 54421 72253
20372 72253 64741 56919 89809 113343 84777 26574 11460 -14726 -21780 -30687 -60467 -71617
20360 -71617 -93847 -98379 -53460 36734 72724 46665 415 74153 125967 86283 89394 96387
20348 96387 40816 -7165 -50909 -3422 38895 -19749 -37332 12000 98710 52073 6331 24396
20336 24396 32038 49709 78271 97888 80884 127946 89574 15703 11273 73948 77806 84152
20324 84152 50398 24648 35248 108026 149535 128599 57248 30635 81651 136169 111678 53289
20312 53289 75115 35266 5556 37108 44295 60256 97536 134365 104663 83675 53504 103573
20300 103573 180040 192185 207224 253615 310128 325639 330190 325166 288331 272252 273104 235811
20288B35811k1467K7942J0330o882j6701J3636J0440O3502J3979p1667n966j6322
20276B36635n0437n3876m042Q421J7909r432K5300N2887M582K1255K9622J5167
20264B93991J4993k5364L3645Oj12272n1463J1139L0934j1428J6167M6958L5125
20252B82431j4527K079L32l9379J9985k7363k3950j8019K9278n1407j5693l2406
20240A11361k6918j3013r938N15l1144K1363M5081k1515m6403N175K2938R13l9607
20227A8808M536j5810N1489N2849k0559j6229Q697p842n4030M5780K5319j5548
20215G7460K817K3501Q287O961K9324K193m8701N5751J1324m946J4138j756K5263
20202B01616P3530L0894j0189o3084m2129l4711P9253L1399l2049p739P9286L7811
$$ plain form
20288 235811 214344 242286 252616 245734 229033 242669 253109 316611 330590 258923 252957 236635
20276 236635 186198 132322 128280 136701 154610 145178 170478 223365 227947 249202 278824 293991
20264 293991 308984 283620 317265 317271 204999 153536 164675 195609 184181 200348 247306 282431
20252 282431 267904 269983 270315 230936 250921 223558 199608 181589 210867 159460 143767 111361
20240 111361 84443 71430 61492 62007 30863 52226 97307 75792 29389 34564 57502 58415 18808
20227 18808 23344 7534 59023 111872 91313 75084 83781 75939 21909 67689 93008 77460
20215 77460 80277 103778 112065 119026 148350 150543 101842 157593 168917 163971 178109 176353 201616
20202 201616 275146 306040 295851 232767 190638 155927 235180 266579 234530 226791 306077 343888
20190C43888j2024J3843P171N617j0399p4057q0370k3125n95j4763k7521o890
20178A20775p856P916n5598k8909L1241j463j0262j7235P9999N9198k7414k4605
20166A25787j9942P689K0097K6070p2292o2041N6922O8084j4056r550N6112P2614
20154B55494K9802J8729M3929k608n2345p8985r239m791L9565K5095k8663K0540
20142B56523n347l9533O560L1529q579k1280m1763n9302j1383M4392j1678j762
20130A38377m5045m2908j9948K4884K168Q662q351j0249j97m484n7443J2997p45
20117b282o5136J8426J904K8030J7204K6348N4261P278n7386m7898K2663K7K1517
20104B4956Q237j1364L772M304o500j1081j7101k8964J3824k2103p447j2204K0571
$$ plain form
20190 343888 331864 345707 352878 358495 348096 274039 193669 170544 169949 155186 127665 120775
20178 120775 112919 120835 65237 36328 67569 66106 55844 38609 118608 177806 150392 125787
20166 125787 105845 113534 133631 159701 87409 25368 82290 150374 136318 126768 182880 255494
20154 255494 285296 304025 347954 345346 293001 214016 204777 199986 239551 264646 235983 256523
20142 256523 251176 211643 218203 249732 241153 219873 178110 118808 107425 151817 140139 138377
20130 138377 93332 50424 30476 55360 57528 66190 57839 47590 47393 42909 -14534 -1537 -2282
20117 -2282 -67418 -48992 -47088 -19058 -1854 24494 78755 86033 28647 -19251 3412 3439 24956
20104 24956 33193 21829 25601 29905 23405 12324 -4777 -33741 -19917 -42020 -49467 -61671 -41100
20091d1100j9708O281j7732K7227O8692J3961l930l8088l7279j3406j886J9125
20079c7843L7066K2779j7192J0630M061L931j5600J2876m703j2733K3474k4596
20067B150j4693M1349j9704l0568K3741J4553K1171l1262K0075J133n3647l8441
20055f4143J6174N9856Q2188j5591l3836k2364l3453L8155K9505k756m640j3409
20043C5686j1546L4132K2158l6836m017J3187M7185J7154l2119m4713n3560m1600
20031e4889K2543L0853l5470m104K3900J1583j7104m18K4903l2466Q596L7488
20019A5415L1559N735l595J496L5098n940n181j4591p263j5679J1372J5795k5858
20006C8363m5635K19J2346J881m621J204J5091j7688J4166M9881J4121o8539j5836
$$ plain form
20091 -41100 -60808 -54527 -72259 -45032 23660 37621 33691 -4397 -41676 -55082 -56968 -37843
20079 -37843 -777 22002 4810 15440 19501 23432 7832 20708 16005 3272 26746 2150
20067 2150 -12543 28806 9102 -21466 2275 16828 37999 6737 26812 27945 -25702 -64143
20055 -64143 -47969 11887 94075 78484 44648 22284 -11169 26986 56491 53735 49095 35686
20043 35686 24140 58272 80430 43594 39577 52764 99949 117103 84984 40271 -13289 -54889
20031 -54889 -32346 -1493 -36963 -41067 -17167 -5584 -22688 -23106 1797 -30669 -22073 15415
20019 15415 46974 52709 49114 50610 85708 79768 74587 59996 52733 37054 48426 64221 38363
20006 38363 -7272 -7053 5293 7174 2553 3757 18848 1160 15326 65207 79328 10789 -5047
19993e047L592J2859m385j9859m8565K5708M4431o075L9650N6569N0105J0906
19981A59889k3739k4679K056K0404K9824l2995j0493J8183m1725L2101K8044n0183
19969A06687Q31M7623O2535K5162L5027k1287Q846N7200N1658J89529J92470R6513
19957H52794j35633j96670j22829o8931m9415k0951k2227N454M8235J05542J06825
19946E02194J67577J35899K0050j75388j95400j26893m2481J2463j4204m7983
19936B35834l6830j4277L1420k2795l4087l9151k8471R325J017M0705J660l5274
19924A09076L116L1991L4307M8280R775m4045j11O2141P2614J02530J38933J69108
19912G37715P2764j60874j33732j40180n7441n7257n5432K1003O9451P4769J22071
$$ plain form
19993 -5047 -1455 11404 7019 -12840 -61405 -35697 8734 2659 42309 98878 148983 159889
19981 159889 136150 111471 113527 133931 163755 130760 120267 138450 96725 128826 156870 106687
19969 106687 107518 155141 217676 242838 277865 256578 265424 322624 374282 563811 756281 852794
19957 852794 717161 520491 397662 328731 279316 258365 236138 241592 289827 395369 502194
19946 502194 669771 805670 825720 650332 454932 328039 285558 298021 283817 235834
19936 235834 199004 184727 216147 193352 159265 120114 91643 100968 101985 142690 144350 109076
19924 109076 112192 144183 178490 226770 236545 192500 192389 254530 327144 429674 568607 737715
19912 737715 810479 649605 515873 375693 318252 260995 205563 226566 296017 370786 492857
19901D92857J20324J23945P8714j9291j95674j85345q5419j5559o3393o4567K9275
19890B15867J0691m7478o418k1956J5393K7941M2500j7640l0676j339o217O171
19878A86839j3415M6213M0472k2324k2601R588M1066Q421L8203j7959p8136k7619
19866A88748j7403m2140J5982j451K6108J0474r370M7517k090m4116k3740n9169
19854H9350J5527L8344M3147N0282j4921l7408k5588q741J5128L1302M5433l762
19842B38093m398l6505l5676l0825O9216J5187L5961N3449k7754k6318k3703p685
19830B19042m2321M0286M0562l9476m5349L7698K9305j0516L1905M3391K8716
19819C33243l0261j2351M6752r05k3830n9569l9124k2173J1678J6695k5878J268
$$ plain form
19901 492857 613181 737126 815840 796549 600875 415530 330111 314552 251159 186592 215867
19890 215867 226558 179080 172662 150706 166099 194040 236540 218900 188224 186885 180668 186839
19878 186839 173424 219637 260109 237785 215184 224772 265838 274259 312462 294503 216367 188748
19866 188748 171345 129205 145187 143736 169844 180318 170948 218465 216375 172259 148519 89350
19854 89350 104877 143221 186368 236650 221729 184321 158733 149992 165120 196422 241855 238093
19842 238093 233695 197190 161514 130689 199905 215092 251053 304502 276748 250430 226727 219042
19830 219042 176721 217007 257569 218093 172744 210442 239747 229231 261136 304527 333243
19819 333243 302982 290631 337383 336478 312648 253079 213955 191782 203460 220155 194277 195545
19807A95545K8437j3289j0902J2612M1355O0251p305j2976L2698k8696k9774R282
19795B77238J2369J5262j4485M5466M9115j644K6692K5634j4164m7856J1441O1552
19783D46620k0235l4084q968K0947L9727K9048n741L3588K5962P669j4937k8677
19771D90919J7297Q0562N5270J8945J4095O0941O3124J32707J48786Q2064L1200
19760A195910l5462o0520l1014m0752L0134J46748J84276J25694J68995J88890
19750A872899J92506K10620J6940o1701j5903l9808k1269M1328Q7068J48606J55321
19739B586607K61751L05911L38085M46759N44564P18155Q58799J117166J469804
19730H647601J976459L084418M853899P451100J0804786J3123253J1733173K601273
$$ plain form
19807 195545 223982 210693 199791 212403 253758 314009 306704 293728 326426 297730 267956 277238
19795 277238 289607 304869 290384 335850 384965 383321 410013 435647 421483 373627 385068 446620
19783 446620 426385 392301 383333 404280 444007 473055 467314 500902 526864 534533 519596 490919
19771 490919 508216 588778 644048 662993 677088 738029 801153 933860 1082646 1164710 1195910
19760 1195910 1160448 1099928 1068914 1028162 1058296 1205044 1389320 1515014 1684009 1872899
19750 1872899 2065405 2276025 2292965 2231264 2215361 2175553 2154284 2195612 2282680 2431286 2586607
19739 2586607 2848358 3154269 3492354 3939113 4483677 5201832 6060631 7177797 8647601
19730 8647601 10624060 13708478 18562377 26013477 36818263 49941516 61674689 64275962
19722F4275962j0567203j3381349q926229m560392j429605J070532L843079P953413
19714C8278208J3917230K0626966K4055004J9397757m142738k9177918k6972235
19707E5982274j6402937r288710n486374l490442k182819j295327m71164L86909
19699A7751410J489200L098741N500166R201753J3802559J6629697J4407356N2178
19691H1933060j7352556j6872046r482421l913310j52259L046875O763735J1929500
19683E5900578J9404580K8087523L4369435L2338583J2765354p295034k0856243
19676A54714776l5942512l4037038k2852903j3837583q148503m473785j487213
19669C3935239J911437O125475J0578353J2945364J0071772m407148j8437380
$$ plain form
19722 64275962 53708759 40327410 31401181 26840789 25411184 26481716 30324795 38278208
19714 38278208 52195438 72822404 96877408 116275165 112132427 82954509 55982274
19707 55982274 39579337 30290627 24804253 21313811 19130992 17835665 17364501 17751410
19699 17751410 19240610 22339351 27839517 37041270 50843829 67473526 81880882 81933060
19691 81933060 64580504 47708458 38226037 34312727 34160468 37207343 43971078 55900578
19683 55900578 75305158 103392681 137762116 170100699 182866053 175571019 154714776
19676 154714776 118772264 84735226 61882323 48044740 39896237 35422452 33935239
19669 33935239 35846676 41972151 52550504 65495868 75567640 71160492 52723112
19662E2723112j6329411j0013120n979620l679181k368843j647494j229435r58887
19654A0517121o51703m31160m28053m43193m79745m90652l28503n6102J41480
19645G349490K96543L87292L57854L69040M23873O53474J013475J480041K284478
19636A4615560L787537O488176J1084955J7693656K4231292K6162530J6494848
19629A20558554j4297161l2023720k3922500j3450296p070815l316810m84304
19622B5992948K521095O236034J0560908J3806916J3123422L728093j3472853
19615F2496563j8967445j3713483q464216n192311l398614k382859j669863j226948
19607G480824q57107o06420m07154k70897l31500n62702n48673m35785l43855
$$ plain form
19662 52723112 36393701 26380581 20400961 16721780 14352937 12705443 11476008 10517121
19654 10517121 9865418 9434258 9006205 8563012 8083267 7592615 7264112 7208010 7349490
19645 7349490 7646033 8033325 8391179 8760219 9184092 9837566 10851041 12331082 14615560
19636 14615560 18403097 24891273 35976228 53669884 77901176 104063706 120558554
19629 120558554 106261393 74237673 50315173 36864877 29794062 26477252 25992948
19622 25992948 28514043 34750077 45310985 59117901 72241323 75969416 62496563
19615 62496563 43529118 29815635 21351419 16159108 12760494 10377635 8707772 7480824
19607 7480824 6623717 6017297 5610143 5339246 5007746 4445044 3896371 3460586 3116731
19598C116731k00027p0697k3182m8053q7535j85405k01089r6195j44623k18199
19588A841726k32753j41471o8410n9013m9486Q25j559J9655j06491j17156M144
19577A090011J0539p3043j31984j22224j7215m1745n2513J433L2293K3248O9988
19566G88788M8525O9880l6757j33983j37561p8140j1156J291k6131j2513N8480
19555E30723k6530o7847J3173M5211N2159l4620k2611l1739p1858O808r508K4045
19543D07406J3256O9899O3545r973q4824L3478Q5893O0634N6759P115l7674m5065
19531F20449l9786n7480k8554R791L302n6163m152M4059J7387Q677M9289K6728
19519E93547O3199L5225n6394j29761m8168o7247n0549k6103O083K6073J5425
$$ plain form
19598 3116731 2916704 2846007 2822825 2774772 2687237 2501832 2300743 2204548 2059925 1841726
19588 1841726 1608973 1467502 1399092 1340079 1290593 1291418 1289859 1309514 1203023 1085867 1090011
19577 1090011 1100550 1027507 895523 773299 756084 714339 661826 663259 695552 718800 788788
19566 788788 837313 907193 870436 736453 598892 520752 509596 510887 484756 472243 530723
19555 530723 504193 436346 449519 494730 546889 512269 489658 457919 386061 392869 383361 407406
19543 407406 420662 490561 554106 544133 459309 492787 578680 639314 696073 703188 665514 620449
19531 620449 580663 523183 494629 504420 507722 451559 447407 491466 508853 517530 566819 593547
19519 593547 656746 691971 635577 505816 457648 390401 339852 313749 319832 345905 361330
19508C61330O0894Q5409N3396N5832K1965q8469r2975p5356l0624m3143o0003
19497B48256j2170P470L7415K6100K658L5285O07m3290m3952k306j4466l900n7499
19484A80208q5026j6052N1085K8203L1547J3348j0816n3003L5709J8349j9351
19473A74201o6471l5692L1452L6617j7626m4362P177J8511j2719l224j4829J6938
19461H9973P2821J2288J8689m1269k0258N3577o239j6909j7037J8215M459L6021
19449B04331R898j089J7988N673R499l2948k5170k3628M8932l7004o6175j677
19437A08630l8322j2043N92Q124j1226j8285r80L5186r077l5146m0193M7275J8464
19424E2999m2550l407M3166M4622k2594m3155K3170L6997J6200R713l884O365
$$ plain form
19508 361330 422224 507633 561029 616861 638826 550357 457382 382026 351402 308259 248256
19497 248256 236086 243556 280971 307071 309729 345014 345621 302331 258379 256073 241607 237707 180208
19484 180208 95182 79130 130215 158418 189965 203313 192497 139494 175203 193552 174201
19473 174201 107730 72038 103490 140107 122481 78119 85296 103807 91088 87864 73035 89973
19461 89973 162794 175082 193771 152502 132244 185821 179582 162673 145636 163851 168310 204331
19449 204331 214229 213140 231128 236801 246300 213352 188182 164554 213486 176482 110307 108630
19437 108630 70308 58265 58857 66981 55755 37470 36490 71676 62599 27453 -12740 34535 52999
19424 52999 10449 7042 50208 94830 72236 29081 52251 89248 105448 115161 111277 117642
19412A17642J9024J4561q189o0730M791k176k7411q537P7132L2067k0894o2273
19400G5007l5206q641J9259J3084O1259N822q4755j2153j7312j1912O1659M7905
19388A14016j5690J1159m8222l6285K4717L0387K2067N5135k659k8633l4723k8273
19376F2996n420J3555J9485K9902J7507K7191j3445l4635K3813J2087J9928n1965
19364A20999j800K2288l7658j9337j2669o543n0180k8677k9877K2018N3053L7766
19352F9383K0204j5442j6073J468l3365Q600J6230m9914K3100O6429R300M6927
19340A46847k3895j45186n8650K2435M0296M6056L9926m9504M299L0553n5104
19329a927K3694Q7878r265P865l9368n3165k9181O0373J3121K450J4366k4386
$$ plain form
19412 117642 136666 151227 143038 82308 87099 84923 57512 48975 126107 158174 137280 75007
19400 75007 39801 31160 50419 63503 124762 130584 45829 33676 16364 4452 66111 114016
19388 114016 98326 109485 61263 24978 49695 80082 102149 157284 154625 125992 91269 62996
19376 62996 57576 71131 90616 120518 138025 165216 151771 117136 140949 153036 172964 120999
19364 120999 119199 141487 103829 84492 71823 65280 15100 -13577 -43454 -21436 31617 69383
19352 69383 89587 74145 58072 59540 26175 34775 51005 1091 24191 90620 99920 146847
19340 146847 122952 -22234 -80884 -58449 -18153 27903 67829 18325 22624 53177 -1927
19329 -1927 21767 109645 100380 108245 68877 15712 -13469 46904 60025 62475 76841 52455
19317E2455l0100N8162k362o8557N835J558N9493N9520k224n3131o2457k3272
19305e080k9113j1089L6821j6472l3426P2054K9078j326k5805K4907Q0622N7865
19293A79036o5976n8680j5694p831M0673L4643J5789l2957J2152K4905Q4783R7066
19281C07909N2503Q9421N3651p3077j23974n4014k9000m6812K229L7574J5377
19270B31787K3935P4477Q9871J13711J10603K6345j64022k36247q4770k4867M651
19259A65474J5124n0586k7461j2926r049l4616K1979N4623N3051q4590l7546L8477
19247I1954L0903O721P4052O2160J5070J23198J55009O4575j1144q9299j67933
19236C55266j41994l4708j4717Q650N0695J0845J2928R7123J19636N4305N0274
$$ plain form
19317 52455 22355 80517 78155 9598 15433 16991 76484 136004 133780 80649 18192 -5080
19305 -5080 -34193 -45282 -8461 -24933 -58359 13695 42773 41447 15642 40549 121171 179036
19293 179036 113060 54380 38686 30855 71528 106171 121960 89003 101155 126060 210843 307909
19281 307909 360412 449833 503484 430407 306433 252419 223419 176607 178836 216410 231787
19270 231787 255722 330199 420070 533781 644384 670729 506707 270460 185690 160823 165474
19259 165474 180598 130012 102551 89625 80576 45960 67939 122562 175613 91023 53477 91954
19247 91954 122857 129578 203630 265790 280860 404058 559067 623642 612498 523199 355266
19236 355266 213272 178564 163847 172497 223192 234037 246965 344088 463724 518029 568303
19225E68303l5614j37840j00898p3640n222k3401l6781K5949J0173l0665o2967
19214I7397L4621L2668j4527j6158m1720j3867o5187k4341n939N627N5498L8725
19202H2797k5509J8689N231J7299j1635o8217l1239M38J1000m772J3515K6915
19190C4512M980j4181M9379M0726k0120l3188p476j8206K334j8504M8735N4816
19178A23807n1406j0454r531k2858J5363O5250M0593r399m7289L2108n4428o3143
19166H613M0235J2975l2020l1574M8036O7463k225J1758J9282O4262K7781L6048
19154B70634L5983M3181N0869m864k0229q216M949L2941L9730J4460j6352P821
19142D50907k9718N158N6631l412m8106n8562M4054K4430j4697k6540n2797m4913
$$ plain form
19225 568303 532689 394849 293951 220311 215089 191688 154907 180856 191029 160364 97397
19214 97397 132018 164686 150159 134001 92281 78414 13227 -11114 -17053 -11426 44072 82797
19202 82797 57288 75977 81208 98507 86872 18655 -12584 -12146 -1146 -5918 7597 34512
19190 34512 39492 25311 74690 115416 95296 62108 54632 36426 38760 20256 68991 123807
19178 123807 72401 61947 52416 29558 44921 110171 150764 141365 94076 126184 71756 8613
19166 8613 48848 61823 29803 -1771 46265 113728 111503 123261 142543 206805 234586 270634
19154 270634 306617 349798 400667 395803 375574 367358 372307 405248 444978 459438 443086 450907
19142 450907 421189 426347 482978 479566 431460 372898 416952 441382 426685 400145 347348 302435
19130C02435k7220k3581J9142k3144j5455n2777l9473l2626J7071O6551j2711
19119A78212o9366M4563M511J4606O5742M8235K5176O1681j7344k8855K3074K7030
19107C77265K3739O0541L1364j8539K3974j5513k7286j5268J534m6606l1888n5225
19095C08092l8097J7205l7025P44n245N301k1537j3469K6800J479n2018l8544
19083A53686k8985q8111k4662N945J1983j6567L3315M3691m856j5890k2860m4020
19071B669j7534M6439K9645l5570j8313O1506j5579q208k7238l4181j3118M3114
19059A3632j4308l0025l3886M7363O5662m0373L1587K8386L6743j1747k0536j8263
19047E4235O207l9237m7966J7214N0270m7612q558O3090l9140p2372N6127O855
$$ plain form
19130 302435 275215 251634 270776 247632 232177 179400 139927 107301 124372 190923 178212
19119 178212 108846 153409 157920 172526 238268 286503 311679 373360 356016 327161 350235 377265
19107 377265 401004 461545 492909 474370 498344 482831 455545 440277 441811 395205 363317 308092
19095 308092 269995 287200 250175 250919 245674 250975 229438 215969 242769 244248 192230 153686
19083 153686 124701 36590 11928 17873 29856 13289 46604 90295 85439 69549 46689 2669
19071 2669 -14865 31574 61219 25649 7336 68842 53263 45055 17817 -16364 -29482 13632
19059 13632 -676 -30701 -64587 -17224 48438 8065 39652 68038 104781 93034 72498 54235
19047 54235 60442 21205 -26761 -9547 40723 -6889 -15447 47643 8503 -63869 -7742 -887
19035h87N531k2192J7446j2715m6243J3182N0537k508j2844J9389j2452o667M9408
19022C8985k2463l6981O0183J6766j0216K7280j39o492j0187j2521l2418l0075
19010a8278L3598L2638M8606J5056l3861k1070J5308j7186j7080l4830q267L0808
18998B5442j7857l0009M0554L2815N038J2915K8665O059L764m9576p5353q9797
18986a07340k6961N8264N0794M1403k3033k6350k702M5667L671N967P762l8150
18974a1008n5754M8346J5962L7815M3082n3816o9833j7697M2471L6954K2357j1284
18962B7595l7995k8244r926J6879m851Q564R651p12Q667l2457n0406n8409N141
18949a46503J9332M8821K1124K298n95Q544j9302K8869Q1186L7959n0458o5748
$$ plain form
19035 -887 4644 -17548 -102 -12817 -59060 -45878 4659 2151 -10693 8696 -3756 -10423 38985
19022 38985 16522 -20459 39724 56490 46274 73554 73415 66923 56736 44215 11797 -18278
19010 -18278 15320 47958 96564 111620 77759 56689 71997 54811 37731 2901 -5366 25442
18998 25442 7585 -22424 18130 50945 55983 68898 97563 103622 107386 57810 -17543 -107340
18986 -107340 -134301 -76037 -25243 16160 -6873 -33223 -35925 9742 13413 19380 27142 -11008
18974 -11008 -66762 -18416 -2454 35361 78443 24627 -45206 -62903 -20432 16522 38879 27595
18962 27595 -10400 -38644 -48570 -31691 -36542 -27978 -18327 -19039 -10372 -42829 -93235 -151644 -146503
18949 -146503 -127171 -78350 -57226 -54928 -55523 -46979 -66281 -37412 43774 81733 31275 -34473
18937c4473n9102k9292O7777P0309k9076K0493J8104k4183p0744m1413K7907N1832
18925c1861q617j0199O0123L5478M4465O3925n2324l5364o8193m7925M35J6504
18913c3553P0203O2967l065q5982m4807k1311M4635K5788L415l7606o2385R783
18901g1918M2J4502J3738L4148l0068l2046O8016K3895j1290M5328n6280k5342
18889b7275q331n5105M3918K7286j4061m2164L5942J0652k0490L5599N2448l4356
18877D063n6734j2100k0180j748K6009k3492M7685k0428P365j2855M1856k5221
18865d5780M40L9666M6403j0173r19j2126o346J4674j378K5707m5968k0697M1233
18852B4736Q4229J46j4519o7942l081J9443o1228p5833M9120q969k1601K2504
$$ plain form
18937 -34473 -93575 -122867 -55090 15219 -13857 6636 24740 557 -70187 -111600 -83693 -31861
18925 -31861 -40478 -50677 9446 44924 89389 153314 100990 65626 -2567 -50492 -50057 -33553
18913 -33553 36650 99617 96552 10570 -34237 -55548 -10913 14875 18290 -19316 -81701 -71918
18901 -71918 -71876 -57374 -43636 -9488 -39556 -71602 -3586 20309 9019 54347 -1933 -27275
18889 -27275 -35606 -90711 -46793 -19507 -33568 -75732 -39790 -29138 -49628 -14029 38419 4063
18877 4063 -52671 -64771 -84951 -86699 -60690 -84182 -36497 -56925 -49560 -62415 -20559 -45780
18865 -45780 -45340 -5674 40729 30556 29637 17511 11165 25839 24461 50168 4200 -16497 24736
18852 24736 108965 109111 94592 26650 23569 43012 -18216 -94049 -44929 -53898 -75499 -52995
18840e2995J3525J1717k3449J0387J1516m1338l064K904K4777j1782o7762k5642
18828a51206P9576M3820Q112k0121j7236M6852j0857K2155R821l0089Q761K3550
18816A3138J0520M867o4522j2875J4859M6557Q908J9352Q005k2996n7795k584
18804c4566j117q722K3084J8545j9041n997l5404j0894L7794k1378P698k800R834
18791d2964J1610L6714N6672K8145m1616j6250l3974m2201l181j2927K6393M8430
18779A4851m846k9627q391L2242M7802m6051o3932J6557L7080N0387j8639L4917
18767F2350k8616j6198q024l9692j0549K8847L8899k3892K0993K4629l6186o3609
18755e1048l0221l3312K8993K0353L7456J3098j491M364p6964L2471P2450l919
$$ plain form
18840 -52995 -39470 -27753 -51202 -40815 -29299 -70637 -73701 -70797 -46020 -57802 -125564 -151206
18828 -151206 -71630 -27810 -19698 -39819 -57055 -10203 -21060 1095 10916 -19173 -10412 13138
18816 13138 23658 28525 -35997 -48872 -34013 12544 21452 40804 48809 25813 -31982 -34566
18804 -34566 -35683 -44405 -21321 -2776 -21817 -27814 -63218 -74112 -36318 -57696 -49998 -52798 -42964
18791 -42964 -31354 5360 62032 90177 48561 32311 -1663 -43864 -47045 -59972 -33579 14851
18779 14851 10005 -19622 -28013 4229 52031 5980 -57952 -41395 -4315 46072 27433 62350
18767 62350 33734 17536 9512 -30180 -40729 -11882 27017 3125 24118 48747 12561 -51048
18755 -51048 -81269 -114581 -85588 -65235 -27779 -14681 -16172 -11808 -88772 -56301 16149 12230
18743A2230j5140L5627K5971l672Q440k2291k0415k9706K1511J5660m1609J5908
18731B514J2042M008p822k201K7902l4474p0412J1102j7033J3185K0313J8019
18719b2857m535J7012K2055k5214N295K348n0086O202J9103O722J3909j7820q0181
18706a08047q5697n106Q8045R4180P4535L3941k6174P8799k3793o4493q46J5881
18694G1225k1834l8249L0151O6895J6686j9925m7279n6058l3537K3303J6077J2464
18682A9919q692m8472K7203K1741k5357J4904L5463l938l6119L848o1864k8912
18670i0276L5709M5025l5109J2798R4272L4521q3964J8437j761m7711l2513j3723
18658f4295k4246R4812N0724J0465n0466j0606K6933k1578j0796q150Q811N326
$$ plain form
18743 12230 -2910 32717 58688 55016 63456 41165 20750 -8956 12555 28215 -13394 2514
18731 2514 14556 18564 10742 8541 36443 1969 -68443 -57341 -74374 -61189 -40876 -22857
18719 -22857 -27392 -10380 11675 -13539 -8244 -5896 -55982 -49780 -30677 -23955 -10046 -27866 -108047
18706 -108047 -193744 -198850 -110805 -16625 57910 91851 65677 144476 120683 56190 55344 71225
18694 71225 49391 11142 41293 108188 124874 104949 57670 1612 -31925 -8622 7455 19919
18682 19919 11227 -37245 -10042 11699 -13658 1246 36709 32771 -3348 500 -61364 -90276
18670 -90276 -54567 -9542 -44651 -31853 62419 96940 12976 31413 29652 -18059 -50572 -64295
18658 -64295 -88541 6271 56995 67460 16994 6388 33321 11743 947 -7203 1608 6934
18646F934L6213J0310m0368L876K9107j2278k2434P762p960N15K6327n7361j3993
18633c3350K3831m147J5544J778Q30m697M8342l1695q886j3071J0026l7254K3526
18620i223O198k5832j252L3863K3963O2495K6061k0411j8341k9471n8167k4286
18608c4403J4886J1317j714l232K9048M878m1430K0841J3435K9945O0178N7107
18596A60856N4099Q5617M2469J9426n4674j076k565m5695l189k2546k2465n0831
18584A59426r0691m6006j7169K8591K4497J1190l261n7226K4080Q896N8240J8335
18572A18902j5616J6322K289n62K1556L4772L1316m3364j2755O6985j0096O843
18560B16592J9539n581l4329n4360K6538k8841o3601K5836K8958N2943L4974J935
$$ plain form
18646 6934 43147 53457 13089 16965 46072 33794 11360 19122 11162 11677 38004 -19357 -33350
18633 -33350 -9519 -13666 1878 3656 4486 -211 48131 16436 7550 -5521 4505 -32749 -9223
18620 -9223 -3025 -28857 -30109 3754 27717 90212 116273 95862 77521 48050 -10117 -34403
18608 -34403 -19517 -8200 -9914 -13146 15902 20780 -20650 191 13626 43571 103749 160856
18596 160856 214955 300572 343041 362467 307793 306717 304152 258457 255268 232722 210257 159426
18584 159426 68735 22729 5560 34151 58648 69838 66577 9351 33431 42327 100567 118902
18572 118902 103286 119608 121897 121335 142891 177663 208979 165615 152860 219845 209749 216592
18560 216592 236131 230550 196221 141861 168399 139558 75957 101793 130751 183694 218668 220603
18548B20603L4462L0179q451k7043n1078L460O826k7908K6219J1591p8316j6892
18536A23652j1441l5802m8701P865k861j100j9970J1082L3138L7056m8504l0392
18524A4022k8732j577N8787N2622o7225Q485P7009P1883R8244n526j6872M2136
18512C03256k9101j06241j07163m5332K7579K0898m7350k4567N43J0000j3486
18501a0964J6486O2382L9927l5980q2633k4902k4696j5835j1295J8580L7286K1463
18489a0181L9487J1071o7320n4061O4132J8678m224j5377j5229k5848K3310O2971
18477B7409p854L1077L6255K604q0196o0462r341N6642N6833O660l843k1679n080
18464B9025k4152N5873Q729k1493n0305J8727k6084m5391m9903R599J9394J4504
$$ plain form
18548 220603 255065 285244 276793 249750 198672 202132 208958 181050 207269 218860 140544 123652
18536 123652 112211 76409 27708 35573 32712 31612 11642 22724 55862 92918 44414 14022
18524 14022 -14710 -16287 42500 95122 27897 36382 113391 185274 283518 277992 261120 303256
18512 303256 274155 167914 60751 15419 42998 63896 16546 -8021 -7478 2522 -10964
18501 -10964 5522 67904 107831 71851 -10782 -35684 -60380 -76215 -87510 -68930 -31644 -10181
18489 -10181 29306 40377 -26943 -81004 -16872 1806 -2418 -17795 -33024 -58872 -35562 27409
18477 27409 19555 50632 86887 89491 9295 -51167 -60508 -3866 52967 59627 55784 34105 29025
18464 29025 4873 60746 69475 47982 -2323 16404 -9680 -55071 -104974 -95375 -75981 -61477
18452f1477J2763J245K3766M463j7479k3696K6436J1707n6356M2268M2824k706
18440C758l4552l1364K2276M5773J0058M4769l6265l7518R710k2863J5803k131
18428a2546M0425l20n0954N750K6191j1852K3792L9351k0055K1022j156n1208
18416H440m650k070N5763J8906L283l0138M753m5931p6979m418L9958M129M4739
18403A5785k0818L403k9878K2345O6090j2331m4499L0167R022m6959l0677J708
18391c6642K8241R97q287Q997J1929k3733J2106J4656l8387J4013m171l4921q058
18378f3260N3413M7894k2188n022J3434l436J826p423M373K7223N2740J5896k0654
18365I4816j1447k36l8678m540O6615M5419q6029l7143l3526M2317Q7709m1732
$$ plain form
18452 -61477 -48714 -47469 -23703 -19240 -36719 -60415 -33979 -22272 -78628 -36360 6464 3758
18440 3758 -30794 -62158 -39882 5891 15949 60718 24453 -13065 -3355 -26218 -10415 -12546
18428 -12546 27879 27559 -23395 -17645 8546 -3306 20486 59837 39782 60804 59648 8440
18416 8440 3790 1720 57483 76389 79672 49534 54287 8356 -68623 -73041 -33083 -28954 15785
18403 15785 -5033 -1630 -31508 -9163 56927 44596 97 30264 39286 -7673 -38350 -36642
18391 -36642 -8401 -7404 -15691 -6694 5235 -18498 -6392 8264 -30123 -16110 -20281 -55202 -63260
18378 -63260 -9847 38047 15859 10837 24271 20835 22661 15238 19611 46834 99574 115470 94816
18365 94816 83369 83133 44455 39915 106530 151949 65920 28777 -4749 37568 125277 83545
18353H3545J945J4664j1753l7587L8150J4480J0447k7858o2530o7394J7150K6211
18341e30j5343j6012L1670O993K6466K0384k242M2266r832k7743q278K154m4463
18328E490Q315K0866m0029j2011L3005O4247j8317k6300l1028J6761M9597K1068
18316I1664L4870M0643l583n1479j67k2986q7356j3346M1035Q0873k359k0784
18304H7025l2130L0929K5316l7861p742k4367J3707K7916m3174O903j5280J3123
18292D4365J5980k0009l8228k6354j6867j4077M7067J10200J3163k8710n461L5462
18280A16531K2863n2932k0892J1834J3074l8106k9605L4576M5571J4661J5062
18269A32637l462m4278J1469K0591q800K2303K3832M3094r629l0414l7671n2074
$$ plain form
18353 83545 85490 100154 88401 50814 88964 103444 113891 86033 23503 -43891 -26741 -530
18341 -530 -15873 -31885 -215 6778 33244 53628 51386 93652 83820 56077 47799 49953 5490
18328 5490 13805 34671 -5358 -17369 15636 79883 61566 35266 4238 20999 70596 91664
18316 91664 126534 167177 163594 112115 111948 88962 1606 -11740 29295 110168 107809 87025
18304 87025 54895 85824 111140 73279 65537 41170 54877 82793 39619 46522 31242 44365
18292 44365 60345 40336 2108 -24246 -41113 -55190 -8123 102077 115240 86530 81069 116531
18280 116531 139394 86462 65570 77404 90478 52372 22767 57343 102914 117575 132637
18269 132637 129175 84897 96366 116957 108157 130460 154292 197386 187757 157343 119672 67598
18257F7598Q531j1632j7417M0740m1091o5387r035L91L5946J174o2190J3772N2954
18244A4354J9265j7840j7875J8064L5666P0799J9663K4035n494n3474l7097j0246
18232E9820m5194J1038N0703L8103j997J2079m4322J5169j3971p14k6190m080
18220E0444j004k5868m1579J6086l7199j6625K2700J5598M2974M8012q524L687
18208F8702n52k9645m01j4332p04N0948J1697k2972L0251K2379M246m0232j3891
18195F5494P568l0969n8795M9401L5821k2591J9170J3397P0389K5619j3831l7230
18183A23443K5051M5924P1511k5183o3972n3159j9367o324j5033p048J2873k1154
18171F7562l9147Q25P6660J2241o9024O034L8740J5854j2915m7954J2822P1414
$$ plain form
18257 67598 76129 64497 47080 87820 46729 -18658 -27693 -27302 8644 9818 -52372 -38600 14354
18244 14354 33619 15779 -2096 15968 51634 122433 142096 166131 160637 107163 70066 59820
18232 59820 14626 25664 76367 114470 112473 124552 80230 95399 81428 80714 54524 50444
18220 50444 49440 23572 -18007 -1921 -39120 -55745 -33045 -17447 25527 73539 65015 68702
18208 68702 68150 38505 38104 23772 23068 74016 85713 62741 92992 115371 119617 79385 65494
18195 65494 73062 42093 -16702 32699 68520 45929 65099 78496 148885 174504 160673 123443
18183 123443 148494 194418 265929 240746 176774 123615 104248 97924 82891 75843 88716 67562
18171 67562 28415 29240 105900 118141 49117 55151 93891 109745 96830 48876 61698 133112
18159A33112O3946k3603m9286Q903O1080N0419l7897J4491N4785n0174k5160j6555
18147A84061J3585K7800n8085l1050k5552K2277L0795L8775j3402K0339L8467
18136B48010m4282k1647P777K526N2380N8276J7700n737N6619P503j0869L6558
18124D04814J6191L8384Q9808R1835M0989R3965Q3139R485q890m0384m2403j02549
18112F74384j08592m9779n5741k673Q4678Q8141K5411n4251o5167N953K9190N0352
18100F21906J4209K2938q694m1262M3506Q2568O4688N4359P0176L3731O7007J26392
18088A151524J27650P0600J48356J98313R1088l7722l4882P8099Q4039K04331
18078B081396L51600L93434L74160L89943N74707P70580R65693J231436J772074
$$ plain form
18159 133112 197058 173455 124169 133072 194152 244571 206674 221165 275950 225776 200616 184061
18147 184061 197646 225446 167361 136311 110759 133036 163831 202606 189204 209543 248010
18136 248010 203728 182081 189858 192384 244764 303040 320740 315003 371622 379125 368256 404814
18124 404814 421005 459389 549197 641032 682021 775986 859125 868610 859720 819336 776933 674384
18112 674384 565792 516013 460272 457599 542277 630418 655829 601578 536411 542364 571554 621906
18100 621906 636115 659053 650359 609097 652603 735171 799859 854218 924394 958125 1025132 1151524
18088 1151524 1279174 1349774 1498130 1696443 1787531 1749809 1714927 1793026 1877065 2081396
18078 2081396 2432996 2826430 3200590 3590533 4165240 4935820 5901513 7132949 8905023
18069H905023K642653L974067O205283R784977J4708477J8960247J8853358Q959790
18061I2993875j3426278k3918450j8126435j1001082o649774m109096k771499
18054A2991261j995716j537822j164930q45050o17488m35218k37023o8014k8765
18045F061235Q5752L18114M30148N94115R14331J202580J678045K588337M098838
18036A7971495O337793R954318J4603003J8023459J6740323N038361j5198044
18029G3470708k1454071j5412614r205657n349399l072483j547665m69310M16494
18021A7376003J694321L612817O566344J0753863J5385619J7603949J3836691
18014H6829607k143643j9791122k0223201j3345335q073066n107923l426371k394915
$$ plain form
18069 8905023 11547676 15521743 21727026 31512003 46220480 65180727 84034085 92993875
18061 92993875 79567597 55649147 37522712 26521630 19871856 15762760 12991261
18054 12991261 10995545 9457723 8292793 7447743 6830255 6395037 6158014 6090000 6061235
18045 6061235 6146987 6465101 6895249 7489364 8403695 9606275 11284320 13872657 17971495
18036 17971495 24309288 34263606 48866609 66890068 83630391 88668752 73470708
18029 73470708 52016637 36604023 27398366 22048967 18976484 17428819 16959509 17376003
18021 17376003 19070324 22683141 29249485 40003348 55388967 72992916 86829607
18014 86829607 84685964 64894842 44671641 31326306 23253240 18145317 14718946 12324031
18006A2324031j760675j383273j111466q41761n14530l06061k81433j97830k0735
17997E906267J55712L24475M36488O38358Q43423J199280J699177K799287M587131
17988A8589598P595691J2102906J6755893J8430630J3010919o705676k2643748
17981E7136213j9340094j1817924o911968m354602k928758k164137j612400j196691
17973F809639r29284o74759n07381m70026m68782l99329l22741k61445k40164
17964B535728j46887j20310q5937j47210j98757j81672j64594j81334j30442o0851
17954A117734p4852j1222n0351j7738q061K4794O6815Q558P5395O89j00830k8232
17942A002699k9143m1241l2568o0376q3186k1725n1841l5040m7966l799J1482
$$ plain form
18006 12324031 10563356 9180083 8068617 7226856 6712326 6406265 6124832 5927002 5906267
17997 5906267 6061979 6386454 6822942 7461300 8304723 9504003 11203180 14002467 18589598
17988 18589598 26185289 38288195 55044088 73474718 86485637 79779961 57136213
17981 57136213 37796119 25978195 19066227 14711625 11782867 9618730 8006330 6809639
17973 6809639 5880355 5205596 4698215 4228189 3759407 3360078 3037337 2775892 2535728
17964 2535728 2388841 2268531 2182594 2035384 1836627 1654955 1490361 1309027 1178585 1117734
17954 1117734 1042882 1031660 981309 963571 955510 980304 1047119 1055677 1131072 1131761 1030931 1002699
17942 1002699 973556 932315 899747 839371 756185 734460 682619 647579 599613 595814 607296
17931F07296l4233j7346j6558J0376Q908N6351R6506o2478k9459p2971o6154k2106
17919D58132K5100k7754k3097K4666j2090m1227k066p247j0886M0391o128L0488
17907D48282O2715J4183n3454j2385Q6355Q3676R3596P3678Q5006K7516J6301
17896I25469j6817P204l038l2323n2893o5484j2525n5517l7263P6560R3655N1583
17884H78611K9678K8878j1313j03744p9386j05672j33564n3925o944m6857q8109
17873C07653k5045m5778K0726j6568K4267l0595N59N1906l7344L1605N767J7405
17861C04558p672L6554m3747n0703k1999o583m2833l5588J7957K8064j3765J5746
17849A79989N1906j8850L87M5102N1658j7748m3000l0597l5162o1789l091J4672
$$ plain form
17931 607296 573063 555717 539159 549535 558443 614794 711300 648822 619363 546392 480238 458132
17919 458132 483232 455478 432381 457047 444957 403730 401664 394417 383531 423922 417794 448282
17907 448282 510997 525180 471726 459341 545696 629372 722968 796646 881652 909168 925469
17896 925469 908652 915856 912818 880495 827602 762118 749593 694076 656813 733373 827028 878611
17884 878611 908289 937167 925854 822110 742724 637052 503488 449563 442619 395762 307653
17873 307653 282608 236830 257556 240988 265255 234660 235219 287125 249781 281386 287153 304558
17861 304558 296886 333440 289693 238990 216991 210408 167575 131987 149944 178008 164243 179989
17849 179989 231895 213045 213432 258534 310192 292444 249444 218847 183685 121896 118805 133477
17837A33477j990q047J1354l4674J4521K3090l872k1960M0658O92m700k5209J300
17824A24640J9935L5405l2300P671J416K0434j1234n8197M6804K5823L2595k4145
17812A88847m1872ql7722m8691J2865M0293J0563n542n092J4331L1404M0238L2252
17799B31866k4358J1482K4275k4233p9039L4319o465j1099j2204N626J9863j221
17787A68812k4806o0453k1674K6777M7108J6907k3853L8385L040j1647K6258j7128
17775A67726k029K8389m8730k52N2204k9772l8085M7103J1820L2970j0826p7169
17763A33349k0239J4053J2596r593j2953k4251N0515J708K1796l4795J559N9049
17751A92794K0097l2651k7409k7264Q881n4074K3161M1276J5571l806J1671K7459
$$ plain form
17837 133477 131487 123440 134794 100120 114641 137731 133859 111899 152557 153249 148549 123340 124640
17824 124640 144575 179980 147680 155351 156767 177201 165967 107770 154574 180397 212992 188847
17812 188847 146975 146967 109245 60554 73419 113712 124275 118733 113641 127972 159376 199614 231866
17799 231866 207508 218990 243265 219032 139993 174312 167847 156748 144544 150170 170033 168812
17787 168812 144006 83553 61879 88656 135764 152671 128818 167203 170243 158596 184854 167726
17775 167726 165697 194086 145356 145104 197308 167536 129451 176554 188374 221344 210518 133349
17763 133349 113110 127163 139759 130166 117213 92962 143477 145185 166981 132186 133745 192794
17751 192794 212891 180240 152831 125567 134448 80374 103535 144811 160382 156576 168247 195706
17739A95706J4674l6892m6941M0590P894p1307m7629j7829K3338N1664P7438J3715
17727B04421K1002p822n2652l5825L8271L5900L8037k0933m0571j3975j5201M9090
17715A99742M1751j7756p9925m118r592L2478O4806M4605K9509m7109k6073J659
17703B29977M6571m2654k5039M6330J8613m3934l158L7786m0227p3573L075O3659
17691B17426J7659n1794l508K0087l5120l0483L7070j4789m3280J1557N1052J1916
17679A87793K7525M2885O9393K7165J4609l346o9052j2012N63m4703K5275J5360
17667B81455K5658J3051m0675o5955n001k738M8379k3865J4915N2821N0714N3839
17655D02598q41m5015m0154J5395l2888L158M2264N4083k0930L7561k6418k6451
$$ plain form
17739 195706 210380 173488 126547 167137 175031 103724 56095 38266 61604 113268 190706 204421
17727 204421 225423 217601 164949 129124 167395 203295 241332 220399 179828 165853 150652 199742
17715 199742 241493 223737 143812 139694 130102 162580 227386 271991 301500 254391 228318 229977
17703 229977 276548 233894 208855 255185 273798 229864 226706 264492 224265 150692 153767 217426
17691 217426 235085 183291 179783 199870 164750 134267 171337 156548 113268 124825 175877 187793
17679 187793 215318 258203 327596 354761 369370 366024 296972 284960 285523 240820 266095 281455
17667 281455 307113 320164 279489 213534 208533 205795 254174 230309 245224 298045 348759 402598
17655 402598 401757 356742 316588 331983 299095 302253 344517 398600 377670 415231 388813 362362
17643C62362m1404j3367M5242M6880J8837N0958P0027O8058J8665M4792P3618
17632G44668J02093J74215J94245J72776J71802O8978R988n6987k2911J25651
17622A684518K31289J53249L2639K160j12481q1196M6285P1711J10848K02436
17612B341458K75825L07256L76663N10750O59157R01503J140782J454907J836648
17603I804949K440083L679873O023504J0284256J7209698K6157332L3904285L4217625
17595A43721605J1525197j1783975l0490582l8853674k6464661j4857282q637939
17588B4158689n456527l721446k583763j825164j339181j112807r79006q33799
17580F306996p18419n00135l26045j99485j9531l1360o0812j13467j46993L8298
$$ plain form
17643 362362 320958 307591 352833 399713 418550 469508 539535 607593 626258 671050 744668
17632 744668 846761 1020976 1215221 1387997 1559799 1628777 1638765 1581778 1558867 1684518
17622 1684518 1915807 2069056 2101695 2103855 1991374 1910178 1956463 2028174 2139022 2341458
17612 2341458 2617283 2924539 3301202 3811952 4471109 5372612 6513394 7968301 9804949
17603 9804949 12245032 15924905 21948409 32232665 49442363 75599695 109503980 143721605
17595 143721605 155246802 143462827 112972245 74118571 47653910 32796628 24158689
17588 24158689 18702162 14980716 12396953 10571789 9232608 8119801 7140795 6306996
17580 6306996 5588577 5088442 4762397 4562912 4543381 4512021 4451209 4337742 4190749 4229047
17570D229047J27032R0807N7835j25499j25044j86578k8913N8917L1354R620Q1428
17559D220006J41338K71482M62442P05621Q93197J124006J464004J792138K258531
17550A3332765L064621M566312P398600J2649470K1127231L1663306M0539127
17543A34341432L9910017J2052714j4625533l7307635m6266155l1124165j7503130
17536C9477545j0212643o489138m342006l016379k260798j743675j522370j324091
17528H566445j137392r67866q20230o50550n11834m44981l51340k43973j19266
17519C319013l0585L8945m2417k01758k38045k38115j76503n4267M3681R6735
17509B516684j08670k32925l39618l11970k42734j41389p8206j4030L0363k5481
$$ plain form
17570 4229047 4356079 4446886 4504721 4379222 4254178 4067600 4038687 4097604 4128958 4138578 4220006
17559 4220006 4361344 4632826 5095268 5800889 6694086 7818092 9282096 11074234 13332765
17550 13332765 16397386 20963698 28362298 41011768 62138999 93802305 134341432
17543 134341432 174251449 186304163 171678630 134370995 88104840 56980675 39477545
17536 39477545 29264902 22775764 18433758 15417379 13156581 11412906 9890536 8566445
17528 8566445 7429053 6461187 5640957 4990407 4478573 4033592 3682252 3438279 3319013
17519 3319013 3288428 3327373 3284956 3083198 2845153 2607038 2430535 2376268 2419949 2516684
17509 2516684 2408014 2175089 1835471 1523501 1280767 1139378 1061172 1047142 1077505 1052024
17499A052024l2312O5321j4976L5838L3441k7327j0116j28136q2894o6522q4544
17488G39797j9046l7585n8973K9533K0076M6030O9643M0485Q0028p088p7386q5722
17476G39792o4966k3226k8975J0549L2557J5287J46057K47931K68252K66516R3034
17465A702808p7480k72013l76548k23530r9866l5454r5057n6858j2702j2562K3028
17454D63766O8938N1823Q834L2265O4910l3349n254j9672j1258o7068l6635K7697
17442E44997k2280M791J5317k0658q0561k5940k8988j5822L6355j8478K4932L0356
17430D44021K3044J0756M187j4963p209M280l3900L6831m5498k124J08719N8100
17418E86244J2410M2849P5881J3775n917p6460K4699L9773m3669M0090K7475L5109
$$ plain form
17499 1052024 1019712 1085033 1070057 1105895 1139336 1112009 1101893 973757 890863 824341 739797
17488 739797 720751 683166 624193 653726 673802 719832 789475 829960 909988 902900 825514 739792
17476 739792 674826 651600 622625 633174 665731 681018 827075 1075006 1343258 1609774 1702808
17465 1702808 1625328 1353315 976767 753237 653371 617917 522860 466002 453300 440738 463766
17454 463766 532704 584527 593361 625626 690536 657187 651933 632261 621003 553935 517300 544997
17442 544997 522717 527508 542825 522167 441606 415666 386678 370856 407211 388733 413665 444021
17430 444021 467065 477821 482008 467045 459836 464116 430216 467047 421549 419425 528144 586244
17418 586244 598654 641503 717384 731159 725242 648782 673481 713254 669585 709675 737150 772259
17406G72259N7772N1188N7731k3529M9058R9999R4718J20178J58567K40100L02157
17395A980198L77887K47413K04144J85572J86144L23853M63864O85737O63201
17386E318013O48593O63692O63818Q73111J225807K042223L209603N046045Q429142
17377B8120047J4459134K3376971L3073042L9182914K6788282l43844k2587117
17370A42069429m3600905l3366460j8020752r297074m413045r18520K508920P200867
17362D2162460J4626965K5249425L5863706M1705355K5002669j1539495l0926271
17355A42144814m5294794l5180062j9982147j1323079o949028m761705l422911
17348A5231088k467084j766387j195403p72083n00534n07372n57972o84905o80631
$$ plain form
17406 772259 830031 881219 938950 915421 964479 1064478 1159196 1279374 1437941 1678041 1980198
17395 1980198 2358085 2605498 2809642 2995214 3181358 3505211 3969075 4654812 5318013
17386 5318013 5966606 6630298 7294116 8167227 9393034 11435257 14644860 19690905 28120047
17377 28120047 42579181 65956152 99029194 138212108 165000390 164656546 142069429
17370 142069429 98468524 65102064 47081312 37784238 33371193 32452673 34961593 42162460
17362 42162460 56789425 82038850 117902556 159607911 184610580 173071085 142144814
17355 142144814 96850020 61669958 41687811 30364732 23415704 18653999 15231088
17348 15231088 12764004 10997617 9802214 9030131 8529597 8022225 7464253 6779348 6098717
17339F098717n65646n28988m64634n23925n00453m65521l71229k22847k73929
17330B181545k36284j32203j52644j04104j14678j11121r3652l8872n8781q4228
17320A054978l6095m478l6668n7434j5440l493l9287q7978j06312l6840n6283
17309E74670M753n878k5867m9480q4016k405K4128K9661M661j7765r471N424L948
17296D52363L7093N0194n442M3186l5908q2757o4234m5672M8658P428j9475O1172
17284D46606J658O759l2612J8401Q7808J08531J17258J47157K15867P0649q7189
17273A100893k02303j95239j52048j09728n4185n642L0426l6345n0348O692J8485
17262C50658J0900L2346J7414Q145K7847R1805K50824L12177L92978L63719Q4911
$$ plain form
17339 6098717 5533071 5004083 4539449 4015524 3515071 3049550 2678321 2455474 2181545
17330 2181545 1945261 1813058 1660414 1556310 1441632 1330511 1236859 1197987 1139206 1054978
17320 1054978 1018883 1014405 977737 920303 904863 901370 862083 774105 667793 630953 574670
17309 574670 579423 573545 547678 498198 414182 411777 435905 465566 470227 452462 442991 448415 452363
17296 452363 489456 539650 534208 577394 541486 458729 394495 348823 397481 404909 385434 446606
17284 446606 448264 455023 422411 440812 528620 637151 754409 901566 1117433 1188082 1100893
17273 1100893 898590 703351 551303 441575 387390 381748 412174 375829 325481 332173 350658
17262 350658 361558 393904 411318 419463 447310 539115 789939 1102116 1495094 1858813 1943724
17251A943724k63143m34651l87804j69877j08801p2003J046K7138L0448n602O699
17240E67174Q976R1932J21884R3558J26325N0852j252o3876n2809N6667Q3697
17229A083128P4410o9532j90494j90640j55527p9610j08301j11129q1113N6552
17219B27744M6367l4149n3241n1542k1831n4981k1379L7139O2317K7004K3064
17208A86512K403M5353Q1714L2160m2148m5196m0600K11J4098J5677J01673N0689
17196D02546P687M0397M6473L7427Q5555R0789J45668Q0774k6107m2888N9598
17185I27919J52441K56255J87015k7141k68508m03532k37726j21361o2923k8724
17175C73715o5855m8312j8888l3059j08234l5552L6201N4779O5795K8550j3675
$$ plain form
17251 1943724 1680581 1245930 858126 688249 579448 507445 508491 535629 566077 560475 567174
17240 567174 576150 668082 789966 883524 1009849 1060701 1059449 995573 942764 999431 1083128
17229 1083128 1157538 1088006 897512 706872 551345 471735 363434 252305 171192 227744
17219 227744 274111 239962 186721 135179 113348 58367 36988 74127 136444 163448 186512
17208 186512 188915 234268 315982 348142 305994 260798 220198 220409 234507 250184 351857 402546
17196 402546 410233 450630 497103 534530 620085 710874 856542 937316 911209 868321 927919
17185 927919 1080360 1336615 1523630 1496489 1227981 824449 586723 465362 402439 373715
17175 373715 307860 259548 240660 207601 99367 63815 100016 154795 220590 249140 235465
17164B35465k2429n2616r070R168l5620q167M0990p324m7316J2898M4253J0928
17152A71160j9354K213J15796P2215l5120k7176o2276j7450P549L1483r041k2686
17140B07313o3850l9889J0939K4379L8452L1033j6507M5882K8767p864K018Q310
17128B68983J6703P761p2675l0943m17k2392K1659p1320m792j431n600J6699J4332
17115A36567l4228M8335N3665P5442M9225j1482M764m8897q2275m5423K1308N0301
17103B17302O2931M3861m4464k8217K4297k315K6283O4697q739N3387j0741K245
17091D00527N9929j5486k6305J0367O3291k2692j3483P3554P8598K9631O3196
17080G01127R7181R4310J14004J71363J15084m1771r8792r3943q4751n7533J8211
$$ plain form
17164 235465 213036 160420 151350 160518 124898 116731 157721 150397 103081 115979 160232 171160
17152 171160 151806 154019 269815 342030 306910 279734 217458 200008 207557 239040 229999 207313
17140 207313 143463 103574 114513 138892 177344 208377 191870 237752 266519 258655 260673 268983
17128 268983 285686 293447 220772 189829 189412 167020 188679 117359 112567 111136 105536 122235 136567
17115 136567 102339 150674 204339 279781 329006 317524 322288 273391 191116 145693 167001 217302
17103 217302 280233 324094 279630 251413 275710 273395 299678 364375 355636 409023 398282 400527
17091 400527 460456 444970 418665 429032 492323 469631 456148 529702 608300 637931 701127
17080 701127 798308 892618 1006622 1177985 1293069 1251298 1152506 1058563 973812 916279 934490
17069I34490J3861Q8027J16184J31996J61345K16708K74129L44877K36493J25452
17059B643562N9093O7800J72467K71930M30755N29433O17992O51459R10095J346024
17049G700610K065999L276158N337181Q896353J4574048K1346228K5374074K1793152
17041A10363803l607352l0923190k6314757j4957667q316416m612516k233745
17034A9398160m60894J272395L573404P050176J2216762J8411776K2106707J8824179
17026A02392665k815969k7552890k4888815j4894986q878230n738158l744590
17019A3879027k459428j758171j308616r63523n92505k60884j44955j86106k51737
17010E953102k49158j45762j84180k88178l81184l44616j21153N6730J89269L55214
$$ plain form
17069 934490 948351 1036378 1152562 1284558 1445903 1662611 1936740 2281617 2518110 2643562
17059 2643562 2702655 2770455 2942922 3214852 3645607 4175040 4793032 5444491 6354586 7700610
17049 7700610 9766609 13042767 18379948 27276301 41850349 63196577 88570651 110363803
17041 110363803 106756451 75833261 49518504 34560837 26244421 21631905 19398160
17034 19398160 18937266 20209661 23783065 30833241 43050003 61461779 83568486 102392665
17026 102392665 99576696 72023806 47134991 32240005 23361775 17623617 13879027
17019 13879027 11419599 9661428 8352812 7389289 6796784 6535900 6390945 6204839 5953102
17010 5953102 5703944 5558182 5374002 5085824 4704640 4360024 4238871 4295601 4484870 4840084
17000D840084L97763M29672O21316J059226J729187K760157M560638P612624J2283318
16991C6293985J7779149K0895168J7489933m750402k6281962k1381425j2066663
16984B7977783o738448l844364j918269m45112R93485K880978N869564J0487656
16976C5263273J6114909J9519764J6886651l660336k6045131k1564689j2177390
16969B4337051o967504m283869k779291j938405j361360j011947p80775n71015
16961D642885l70579k67888k47741k77048k46032k16812k47184k96115l19350
16952B154136k40697j72992j67724j30263j06015m9211l8598m7335p3213o8191
16942A059897M6506J8369N2439l023k43926k12768r5361n0639L6856k417l6507
$$ plain form
17000 4840084 5237847 5667519 6288835 7348061 9077248 11837405 16398043 24010667 36293985
16991 36293985 54073134 74968302 92458235 87707833 61425871 40044446 27977783
16984 27977783 21239335 17394971 15476702 15031590 16025075 18906053 24775617 35263273
16976 35263273 51378182 70897946 87784597 84124261 58079130 36514441 24337051
16969 24337051 17369547 13085678 10306387 8367982 7006622 5994675 5213900 4642885
16961 4642885 4272306 4004418 3756677 3479629 3233597 3016785 2769601 2473486 2154136
16952 2154136 1913439 1740447 1572723 1442460 1336445 1287234 1248636 1201301 1128088 1059897
16942 1059897 1106403 1124772 1177211 1174188 930262 717494 622133 571494 608350 605933 569426
16931E69426p6226k0569j5722L335n051j655l7891Q82M647J22J6836k0833k8165
16918C89136q352q772K8805N080L756K0470l3734K6696N0467p949J1621k7729
16906D49495j2833l5540k3054j0229M8358l7186m7928K797L4205n982l3578j8393
16894C10132j3074L623n5983q4585m709N8998J2731n8219m0057K2323k9806M085
16882A25459n313Q080k0805K1249M3976N0359m5382o4428k3401K1047L3561l4229
16870A10173j8577j9154p6271k6469O1049O3940J4019M4050N647n841K2609k4961
16858A50214n1534J5185K4997N142l2205M0549M2746N4715K6699K6744J0289N7287
16846C70828J35591J61290J46442O4585J042j5140q7388q7870n5548j06558r4340
$$ plain form
16931 569426 493200 472631 456909 460244 455193 453538 415647 416529 421176 421298 438134 417301 389136
16918 389136 380784 372012 400817 405897 409653 430123 396389 423085 473552 465603 477224 449495
16906 449495 436662 401122 378068 367839 416197 379011 331083 333880 368085 362103 328525 310132
16894 310132 297058 300681 244698 160113 155404 214402 227133 168914 128857 151180 121374 125459
16882 125459 120146 128226 107421 128670 172646 223005 177623 113195 89794 110841 144402 110173
16870 110173 91596 72442 -3829 -30298 30751 94691 108710 152760 158407 152566 175175 150214
16858 150214 98680 113865 138862 144004 111799 152348 195094 249809 276508 303252 313541 370828
16846 370828 506419 667709 814151 878736 879778 864638 777250 689380 633832 527274 432934
16835D32934l1214N674J3779M5209O1915R3962P6698O1140j3018q2521n6126r2414
16823E16018r0401m6026l2505q1040l8817L8425j2054l7312m2418l8116j3866
16812A21888k3676k0969K9494J6604J2114o037J7592L7823K7934J5410l4910k2838
16800A70429n7562l3131K098p425P119j224L0603m1641O3O2324M6861O1471j4527
16787B25458L8012n022l7627n69n388j4547J1111R3860N6751Q7600J9673N0240
16775E19552P6232M6256J20322K09657K63689J36069K10398K24902J49955M4355
16765B001387q7629k04603k76525k82544j99192j29012j10920j44775n3343j00993
16755D11851q0372n4690m5667K775k8625j8167N614J3808O521m9280j8025J0541
$$ plain form
16835 432934 401720 407394 421173 466382 528297 622259 698957 760097 747079 664558 608432 516018
16823 516018 425617 379591 347086 266046 227229 265654 253600 216288 173870 135754 121888
16812 121888 98212 77243 106737 123341 135455 129418 147010 184833 212767 228177 193267 170429
16800 170429 112867 79736 81834 74409 81528 80304 110907 69266 69329 131653 178514 239985 225458
16787 225458 263470 258448 220821 220252 214864 200317 211428 305288 362039 449639 469312 519552
16775 519552 595784 642040 762362 972019 1235708 1371777 1582175 1807077 1957032 2001387
16765 2001387 1913758 1709155 1432630 1150086 950894 821882 710962 566187 512844 411851
16755 411851 331479 276789 231122 233897 205272 187105 192719 206527 213048 163768 145743 156284
16743A56284k4654k9006j7574J7316J4618n7032L0019K0295L4904J6125J2595
16732A73890j6724L4262j7807l4454L9252L3139n3137m6025L030n0520J4507Q8702
16720A68115K3872R836l3618j0337P477k2691M587o1657o8691o380N7231O040
16708G3784k9770m5980p421Q3223N3503n8058l9600J7647N9407L8595J3932k1101
16696A38161j0443K2348q5422j01912K5051O0100K1240L4546J0060O174k5842
16685I4061k1963k9877J7004J7408M7944l8181l5389J5644k4271l425P9779k6399
16673I2335o8166p769q351O3479P4963L093q0138n0286M332M951R480q018k8633
16660A272j8178l1284N8063O0894O516k0812J4073M2571L7063o4573k2792m0563
$$ plain form
16743 156284 131630 102624 85050 102366 116984 59952 89971 110266 145170 161295 173890
16732 173890 157166 191428 173621 139167 178419 211558 158421 112396 115426 64906 79413 168115
16720 168115 191987 201823 168205 157868 165345 142654 147241 85584 16893 10513 67744 73784
16708 73784 44014 -1966 -9387 73836 127339 69281 29681 47328 106735 145330 159262 138161
16696 138161 127718 150066 64644 -37268 -12217 47883 69123 103669 113729 119903 94061
16685 94061 72098 42221 59225 76633 124577 86396 51007 66651 42380 38955 118734 92335
16673 92335 24169 16400 8049 71528 146491 149584 69446 19160 23492 28443 37923 29905 1272
16660 1272 -16906 -48190 9873 70767 77283 56471 70544 113115 150178 85605 62813 22250
16648B2250l6555J5005K9289L7928r158q793K435j1488j7539k6288l4651o1794
16636i9359N0352O9110J0734o08j6467M964J4329q461M9550l3922k5948k3070
16624h796l010N0633n5131l5954J3760k2039K8693L2514R6695m0531k1174k3324
16612A2336k0116N3227J0945m8994r737r404M2941N3893K8753L1839Q86L3000
16600A79569N787p6022k4735K8602l5665N8069M4349m9374n3633J8499M3061L1140
16588A69647l5540m3306k517J7837l77k4680K085K0048l19n8145k7688J7924k1764
16575A3205J4977l178j6463J1190L0933n381O917L7296J3491J83k0322q655j7264
16562E6929K749l8964m2449O240j0175J6954O0907m3757k629J9727K484k270M2217
$$ plain form
16648 22250 -14305 700 29989 67917 58759 49966 52401 40913 23374 -2914 -37565 -99359
16636 -99359 -49007 20103 30837 30229 13762 18726 33055 24594 74144 40222 14274 -8796
16624 -8796 -11806 38827 -16304 -52258 -38498 -60537 -31844 670 97365 56834 35660 12336
16612 12336 -7780 45447 56392 7398 -2339 -11743 31198 85091 113844 145683 146569 179569
16600 179569 185356 109334 84599 113201 77536 135605 179954 130580 76947 95446 138507 169647
16588 169647 134107 90801 88284 106121 105744 81064 83149 103197 102878 44733 17045 34969 13205
16575 13205 28182 25004 8541 19731 50664 45283 52200 89496 102987 103170 82848 74193 56929
16562 56929 59678 20714 -21735 -15495 -25670 -8716 52191 8434 5805 25532 28016 25746 67963
16549F7963k591M2871L0431K1764j9372l2277N117k4532r6871J3611J6664L481
16537B6259j7823K6094m128m9848r239M9123M1583j7139m9780J7414R2014K0699
16525A25229K1425j6821O2505J16817M0369K1564K0224K3207o5850l5438k5758
16514B87473m6313j2819J4759K0959M7472K8179R6323J7890k0576j1044q2587
16503C39716j02059l3813k9923m76l3747K4754J1227k5258j6207j8514M6697N480
16491A67877n7147k7291J6630J8753M3329j3437n268m4529k9212O7494J05032
16480B42231M5466q656L5591L3651j2659M4533L3859J9047L9898N6710M0921j4718
16468E55874J2148L8557k3258n5044m1493k8115k8590n1269j568K9728j0732n518
$$ plain form
16549 67963 65372 108243 138674 160438 141066 108789 113906 89374 -7497 6114 22778 26259
16537 26259 8436 34530 30402 -19446 -28685 20438 62021 44882 -4898 12516 104530 125229
16525 125229 146654 129833 192338 309155 349524 371088 391312 414519 348669 313231 287473
16514 287473 241160 228341 243100 264059 311531 339710 436033 453923 433347 422303 339716
16503 339716 237657 203844 173921 173445 139698 164452 175679 150421 134214 115700 162397 167877
16491 167877 110730 83439 100069 118822 162151 148714 143446 98917 69705 137199 242231
16480 242231 287697 279041 314632 348283 335624 380157 414016 433063 472961 529671 570592 555874
16468 555874 568022 606579 583321 528277 486784 458669 430079 378810 377242 406970 396238 390720
16456C90720M2499N5820l4622n67J9245k9004p4999p3002o6173l5309k9577P085
16444A72116K6987l0646p1759J5479L9808N650r811P50l0549K4807p210k0778
16432A14844k573q80l094J6172k58J560L0348K645j1057k5791K5229O6952M3107
16419B57204l2263p352J0536m984k2126K6680J2965J9911l3308k6857l7761l0473
16407A32172l3944l0059K8893J7824K1836J6581O076L1901L962K8732L6774K2084
16395B82832j9231J3534j3927p806n2750N344O1286J6324r7102k974M3491j6480
16383B12541k6640r227n5255K9507L8639J1922k483j6316N2840M7806K3076j4879
16371B91531j5374m7249J4911L3194n5179j4263J092k693J1676j4400r927N6795
$$ plain form
16456 390720 433219 489039 454417 453850 473095 444091 369092 296090 229917 194608 165031 172116
16444 172116 199103 168457 96698 112177 151985 157635 147824 148574 118025 142832 135622 114844
16432 114844 112271 111391 108297 124469 124211 125771 156119 158764 147707 121916 147145 214097 257204
16419 257204 224941 217589 228125 223141 201015 227695 240660 260571 227263 200406 162645 132172
16407 132172 98228 68169 97062 114886 136722 153303 159379 191280 195242 223974 260748 282832
16395 282832 263601 277135 263208 255402 202652 207996 269282 285606 188504 185530 229021 212541
16383 212541 185901 176674 121419 150926 189565 201487 199004 182688 235528 283334 306410 291531
16371 291531 276157 228908 243819 277013 221834 207571 208663 205970 217646 203246 193319 250114
16359B50114M7926K7685P6913m531L5213J0089M6610M9629l8690j2744n4756n9605
16347C73853l3360m6759j9321k1819Q827M7265M3582N2909Q4195L9191k1856n2873
16335D53834k0897N3641L3185r285m0480o0370k0081L5928K4925J5745M688o274
16323D64559j0338m2463k527M1663N8650j3413k5114j4865P5062K5240r933K2857
16311E69378m9529K207P8697M2381J5724k9437l0607j6762J9181J1387N0487R1876
16299G54983n4412j3596L001M2299M7108k5970N493R9934N3060O1723M3170N097
16287A021890K6288Q1637k8458m5319M7699O4013J8531Q138M7661R2942Q2337
16276A417359M791J08436O1781P4764P2968L6353P3757M4400M1462L3554Q8963
$$ plain form
16359 250114 298040 325725 402638 398107 433320 443409 490019 539648 500958 488214 433458 373853
16347 373853 340493 293734 274413 252594 261421 308686 352268 405177 489372 528563 506707 453834
16335 453834 432937 486578 519763 510478 469998 409628 389547 425475 450400 466145 470833 464559
16323 464559 454221 411758 409231 450894 509544 496131 471017 456152 531214 556454 546521 569378
16311 569378 519849 522056 600753 643134 658858 629421 598814 582052 601233 612620 663107 754983
16299 754983 700571 686975 689976 732275 779383 753413 758906 858840 911900 973623 1016793 1021890
16287 1021890 1048178 1129815 1101357 1056038 1103737 1167750 1186281 1194419 1242080 1335022 1417359
16276 1417359 1422150 1530586 1592367 1667131 1740099 1776452 1850209 1894609 1936071 1969625 2058588
16265B058588J18884L9285O3366J01802J30165R0310Q8936J30453J06200J92828
16255C120817K27828K67796J90482J51588K10364K83328L26531L08941L11920
16246E399595M09870L88359M29884N25346O28182O42304P13788Q27622Q93210
16237A0858160J109934J328796J596927J829197K177684K683333L332745L986978
16229B8903754N018258O556123Q425716J1115815J4653609J9566753K6980288
16222A21220316L8383883N5251940P6096888R3103904R2425010N7787330j5381162
16215E18888109q4996467j02993407q4380561n9891396m1149375k9062007k1648699
16208I4766197j6831210j3244167j0332633q034741o372459n157966m304232l605025
$$ plain form
16265 2058588 2177472 2216757 2280123 2381925 2512090 2602400 2691336 2821789 2927989 3120817
16255 3120817 3348645 3616441 3806923 3958511 4168875 4452203 4778734 5087675 5399595
16246 5399595 5809465 6197824 6627708 7153054 7781236 8423540 9137328 9964950 10858160
16237 10858160 11968094 13296890 14893817 16723014 18900698 21584031 24916776 28903754
16229 28903754 33922012 40478135 48903851 60019666 74673275 94240028 121220316
16222 121220316 159604199 214856139 290953027 384056931 476481941 534269271 518888109
16215 518888109 433891642 330898235 246517674 186626278 145476903 116414896 94766197
16208 94766197 77934987 64690820 54358187 46323446 39950987 34793021 30488789 26883764
16200B6883764k931022k548373k212576j913693j648709j426384j245235j084126
16192A1873646r85914q59487p13972o64648n84373n53538n33860m24398m09437
16183F144019l77440l01442k67676k40215j70782k40536k63064k13371k25794
16174C843699k50727j20363j77768k13702j25449o8448j34516q9738j24445r5493
16164B443050j25748n3771k5511j08199j19776j21581n6011j4385j3663n2849
16154A751556o9585o0828n8026o9435j7783n805p5251k7498k1951n5368K5607
16143A315633l7816p1560o9784m0405K8055L2526j3811l9063q0893J2884j5900
16132A019866l7535j7943K4359N798J6515R602Q3530r530n0708k5732O8928J06363
$$ plain form
16200 26883764 23952742 21404369 19191793 17278100 15629391 14203007 12957772 11873646
16192 11873646 10887732 10028245 9314273 8649625 8065252 7511714 6977854 6553456 6144019
16183 6144019 5766579 5465137 5197461 4957246 4786464 4545928 4282864 4069493 3843699
16174 3843699 3592972 3472609 3294841 3081139 2955690 2887242 2752726 2662988 2538543 2443050
16164 2443050 2317302 2263531 2238020 2129821 2010045 1888464 1832453 1818068 1804405 1751556
16154 1751556 1681971 1621143 1563117 1493682 1475899 1470094 1394843 1367345 1345394 1290026 1315633
16143 1315633 1277817 1206257 1136473 1096068 1124123 1156649 1142838 1103775 1022882 1035766 1019866
16132 1019866 982331 964388 988747 994545 1011060 1020662 1104192 1094662 1043954 1018222 1087150 1193513
16120A193513K6577J7421r103k9320j0445l0906L8074R6190L0587k0756J14124
16109A415956J29573R8424Q9948Q7272K8549J3118n4355o7453p2968r0768o3842
16098A513454j3974m6069j7459K7764R3068J53576J34904K31647J98995K13267
16088B489173J01492j07031k21243k38444k95901k25304k23773j92918j06826
16079I79225r1040k2566j9156o5078m7312n9672j4041j6287N349P67L345O2416
16067G15950j6160n8045j27210o2908q8507m6022N7461k210N1943j2979R83r581
16055D02715m0073k5200m1907k3248K3070M9608J16020J4664p882j6509k2909
16044D28349M0609N5932n295n3239m9448l0200l1718m4078l8932L329O1827L5471
$$ plain form
16120 1193513 1220090 1237511 1228408 1199088 1188643 1157737 1195811 1292001 1322588 1301832 1415956
16109 1415956 1545529 1643953 1733901 1821173 1849722 1862840 1808485 1741032 1668064 1577296 1513454
16098 1513454 1499480 1453411 1435952 1463716 1556784 1710360 1845264 2076911 2275906 2489173
16088 2489173 2590665 2483634 2262391 2023947 1728046 1502742 1278969 1086051 979225
16079 979225 888185 865619 846463 781385 734073 674401 660360 644073 649422 650189 653534 715950
16067 715950 699790 641745 514535 451627 363120 317098 374559 372349 424292 411313 412296 402715
16055 402715 362642 337442 295535 272287 295357 344965 460985 475649 467767 451258 428349
16044 428349 468958 524890 519595 466356 416908 386708 354990 310912 271980 275309 337136 372607
16032C72607k4065k4576m0722l4812k8353p6742j8310K9506P946J4393J0323K6718
16020B13913M5127L0191o6042k730n3717k1685K1026p331P986L1134J5073k5249
16008A87696M076j1344j8381N9816j483m2774j6458j2503m3916l446L6731K9114
15996A67128K2096j509K6290R612k7198m2068R24l234j1284j9056O547J0329n1081
15983H7496j6775P581O8924L9043m7296j1107L3604J8827P637k3520p089k5310
15971A32015J3225j9663r365l635j3657k8m2177k5300P3309J2207l8708J0551
15959H8774Q301l4886o909J3918N3748L5378q1746o5041j0307j0859j0236M6618
15947B6753K1545L907k085j5422M5745Q564p025J22J9945M1967j3048k5738m2629
$$ plain form
16032 372607 348542 323966 283244 248432 220079 143337 125027 154533 162479 176872 187195 213913
16020 213913 259040 289231 223189 220459 166742 145057 166083 158752 166738 197872 212945 187696
16008 187696 191772 180428 162047 221863 220380 177606 161148 148645 104729 101283 138014 167128
15996 167128 189224 187715 214005 223617 196419 154351 155275 152041 140757 121701 128248 138577 87496
15983 87496 70721 78302 147226 186269 138973 127866 161470 180297 187934 164414 157325 132015
15971 132015 145240 125577 116212 112577 98920 98892 56715 31415 104724 116931 78223 88774
15959 88774 97075 62189 55280 69198 122946 158324 76578 11537 1230 -9629 -19865 26753
15947 26753 48298 52205 50120 34698 80443 89007 81982 82104 102049 144016 130968 105230 62601
15934F2601j1334j1365L4353J316N1528J9413n5355j6401Q498n8983l9922J9382
15922C731M2805J7328j5969k7411k5842p882J1966l3368N3793M3310M8664J3557
15910A24682P6341O7527j0768J8722m7196n4735K0915j9787o9801r368K3681m5137
15898G5076p757M3399j4203j0552K9135M1914j7485M543J3159j6980L4459M0834
15886B15542l3307n2291n0574J7409k6408k3294n3274m7238N4985O3227j5885
15875D8892r1072K7257L6247K0068l2557m1033K5511K6029M336M0503n7L7035
15863A01159K4489l4562p7202k1174N4194Q7114k3762o3146J1793J0876K6985
15852I6764l3856k2620j0322N5365O263l5281o8741M985N414j0368L9758q462
$$ plain form
15934 62601 51267 39902 74255 75571 127099 146512 91157 74756 83254 24271 -15651 3731
15922 3731 46536 63864 47895 20484 -5358 -13240 -1274 -34642 19151 62461 111125 124682
15910 124682 201023 268550 257782 276504 229308 174573 195488 175701 105900 96532 120213 75076
15898 75076 67319 110718 96515 85963 115098 157012 139527 144070 157229 140249 174708 215542
15886 215542 182235 129944 79370 96779 70371 47077 -6197 -53435 1550 64777 48892
15875 48892 -42180 -14923 21324 41392 8835 -32198 -6687 19342 23678 64181 64124 101159
15863 101159 125648 91086 13884 -7290 46904 134018 110256 47110 58903 69779 96764
15852 96764 62908 40288 29966 85331 91594 56313 -12428 -7443 -2029 -12397 27361 18899
15840A8899j8838L0268K334o000L5604M2986O3506L098m9452l4298L909J1937
15828A03953K8869K3389j816o7290q1562J9302J29060Q5816M7643J23058l683
15817D06739j06619q7949l8379l3144q7690p344j2093L671J0943m2685O4411O5842
15805A35703k7881N790j7976N745k9588p3163l7224P682N7720M4727k6515j5977
15793B9043K1285L3822q823r849k7006O369N1530O861l7041r6156k4732M5891
15781h806M0429P894m1189m0309M9676L8953J0679M2161L3622K2741l4166K029
15769A23714J5397m8418m1748K85M0868J4367j4952J8352k6562j9509P5036J2695
15757A49525o0429k7266k424j4773K5219n449J0464p759l5330J6171K3809k1484
$$ plain form
15840 18899 61 30329 32663 26663 62267 105253 168759 171857 122405 88107 92016 103953
15828 103953 132822 156211 154395 87105 5543 24845 153905 239721 287364 410422 406739
15817 406739 300120 212171 173792 140648 52958 45614 33521 37192 48135 5450 69861 135703
15805 135703 107822 113612 95636 101381 71793 -1370 -38594 -30912 26808 71535 45020 29043
15793 29043 50328 84150 75327 65478 38472 44841 96371 103232 66191 -29965 -54697 -8806
15781 -8806 31623 39517 -1672 -41981 7695 46648 57327 99488 133110 155851 121685 123714
15769 123714 139111 90693 48945 49230 90098 104465 89513 107865 81303 61794 136830 149525
15757 149525 89096 61830 59406 44633 69852 64403 74867 67108 31778 47949 71758 50274
15745E0274J2441J01518J0413n5521j1706m0661l5085o279L518k6159M45k536
15733F62K7238N95j876n9092k2723K8552J9666M0476o4626n4806k9410O4512L3167
15720a7665O478L1544M2027l3944n1502j8118J7133J2545J6742l6969R509K8002
15708E782j8614j1213M4070J2424K5686m2892L0824p304l8775K6759L7252L1503
15696I5502j1615l0963L5108r153J6584n242l1384k3770M3502p133l6415k0005
15684A5016K2855M5322J7413j1209m4805m328J6688J6909K3542M9282M5471M5138
15672B37294O0968P4854L0740j2642N4438K9207K5199J00645K24414K17675J83180
15661A225972J80876K07881J84346O1415o6533q8523k45611k96888j70560j54257
$$ plain form
15745 50274 62715 164233 174646 119125 107419 66758 31673 25394 28912 2753 3198 662
15733 662 27900 28495 26619 -32473 -55196 -26644 -6978 33498 -31128 -85934 -115344 -50832 -17665
15720 -17665 -11187 20357 62384 28440 -23062 -41180 -24047 -11502 5240 -31729 -22220 5782
15708 5782 -12832 -24045 20025 32449 58135 15243 46067 38763 -12 26747 63999 95502
15696 95502 83887 52924 88032 78879 95463 90221 58837 35067 78569 71436 35021 15016
15684 15016 37871 83193 100606 89397 44592 40264 56952 73861 97403 146685 192156 237294
15672 237294 298262 373116 403856 391214 445652 474859 500058 600703 825117 1042792 1225972
15661 1225972 1406848 1614729 1799075 1860490 1793957 1705434 1459823 1162935 992375 838118
15651H38118j58122o6995o3045j27061j31519Q233K844o073n8366r0604j5281
15640A32129L823n2164l7882M4568L0971m4040m2101K1601L9192O1393l2816m5371
15628G9303j4886k8181o8239l1461L3222k2931K47M5923O0077M4282l1383k3852
15616D2121L5240J0392N3005p900j9914o37j7105k4212r44j6000L0326N0435m3369
15603I1438j7239j6316o7121p6723N8811N7317K1230L2586Q655m5972m87P014
15591E3193k1701j9732r412n2M5046m6874m3978O0840N0154J5435m8965J3616
15579D7570l6178k9751K1779k7782k7046j1889O2694L3658j6871J372j9710M905
15567B751J2371j0829k2823J6183J7247J5280M2292q632m1925L2499j130N98K6358
$$ plain form
15651 838118 679996 613001 549956 422895 291376 299609 302453 296380 238014 147410 132129
15640 132129 135952 83788 45906 90474 121445 77405 35304 56905 96097 157490 124674 79303
15628 79303 64417 36236 -32003 -63464 -30242 -53173 -52926 -7003 53074 97356 65973 42121
15616 42121 77361 87753 140758 132858 112944 112307 95202 70990 70046 54046 84372 134807 91438
15603 91438 74199 57883 -9238 -85961 -27150 30167 51397 83983 92638 46666 46179 53193
15591 53193 31492 11760 2348 2296 47342 468 -43510 17330 67484 82919 33954 47570
15579 47570 11392 -18359 3420 -24362 -51408 -63297 -603 33055 16184 17556 -2154 2751
15567 2751 15122 4293 -18530 -2347 14900 30180 72472 63840 21915 54414 53284 53882 80240
15554H0240m2363o0748l7009M3091N5846J501p840n9654k0684M6167l516k8089
15542c3058l6997k9108J3100k159j7189K3844K2880M1446O9131J0601o400m891
15530E1200o512l0075l0007j6802L0887N3211q37k6644o8726m9220K3560L8902
15518c1063K7606M2017L4885K1168O633o4857n9294k9284K7643K6713L4786l0087
15506F866L6839k9401m4009p693N4664l8804j9738P1007M5787n4624m6877n6088
15494h2071J953N2819M5038j859j7017j8761L7892Q5636k0698q3852o2799J5026
15482d8693L0329k2945j8390j5173m694L7132K0866N824K8147J2988J7335Q976
15470E1702N0013o8253l7040R102n1783M55L8668K9497q526l2595k3045L0268
$$ plain form
15554 80240 37877 -22871 -59880 -16789 39057 40558 32718 -26936 -47620 -1453 -4969 -33058
15542 -33058 -70055 -99163 -86063 -88222 -105411 -81567 -58687 -17241 51890 62491 56091 51200
15530 51200 44688 14613 -15394 -32196 -1309 51902 51065 24421 -44305 -93525 -69965 -31063
15518 -31063 -3457 38560 73445 94613 101246 36389 -22905 -52189 -24546 2167 36953 6866
15506 6866 43705 14304 -29705 -37398 17266 -21538 -41276 29731 75518 20894 -25983 -82071
15494 -82071 -80118 -27299 17739 15880 -1137 -19898 17994 103630 82932 -920 -63719 -48693
15482 -48693 -18364 -41309 -59699 -74872 -79566 -42434 -21568 -15744 12403 25391 42726 51702
15470 51702 101715 33462 -3578 5524 -46259 -45804 -7136 22361 13835 -18760 -41805 -11537
15458a1537M678M281J2681J9431o2681J9688j7976J5608K5487M7462K5080l0640
15446E1562k8615K1181R834L71j7605n8823l5751K5807J8378J5648K6935k7569
15434A353n333k5119J6639j2044n467m2917j438J5547j6150j717l1279J1926J2409
15421h3590L6837N2677J6715j8591l1276M4877J123o2509R928J0862N3356j012
15409B9397m8891j1966j7271K0580l8909l7229P8131N3042j8431j6498k4395m414
15397c6854R706j6983M2184J9591K2452J6436j3875l5919k7124R854Q977o462
15385h017K3768r686K4547l4930n5744N2136L9843j9797m9868L6836L7559J2329
15373D8976k8325k3054J6043l9499L5713J6818K4110j263J394J7161l6669p4221
$$ plain form
15458 -11537 -6859 -2578 10103 29534 -33147 -13459 -31435 -15827 9660 57122 82202 51562
15446 51562 22947 44128 53962 54333 36728 -22095 -57846 -32039 -13661 1987 28922 1353
15434 1353 -3980 -29099 -12460 -24504 -29971 -72888 -74326 -58779 -74929 -76646 -107925 -95999 -83590
15421 -83590 -46753 5924 22639 4048 -27228 17649 18772 -43737 -33809 -22947 30409 29397
15409 29397 -19494 -31460 -48731 -28151 -67060 -104289 -26158 26884 8453 -8045 -32440 -36854
15397 -36854 -27148 -44131 -1947 17644 40096 56532 42657 6738 -20386 -10532 -1555 -8017
15385 -8017 15751 6065 30612 -4318 -60062 -7926 31917 12120 -37748 -912 36647 48976
15373 48976 20651 -2403 13640 -25859 9854 26672 50782 49519 50913 68074 31405 -42816
15361d2816q513j0025J9375M7292J9695J0748Q958N516l538m6917K2621K8315
15349E0711K3300n378k1730l6467l9694M6208K9445l0456j2693m6654J5062L2163
15337C817K5649j3878p0926J6997k681k5248Q174O5558R706n0031l1749L75L1802
15324c2435Q964k0581l4778o184L6292Q908o674q274K8421O0686m2745n6603J2818
15311e2185k285l4784j8545m133M6590L6388o1367m330N5687l0760l5474P812
15299i7386N1538n490j7900N3624J3465l4293m406l9875j0828L4735K2293L080
15287c1443m3287j2472J5555O0036k8471o2132K0792L1238M1337K6585j07041
15276h9303l9293L5695P2097O0373l3473o9909j796L9543J5608k5447K9169k0784
$$ plain form
15361 -42816 -51329 -61354 -41979 5313 25008 35756 44714 50230 46692 -225 22396 50711
15349 50711 74011 68633 46903 10436 -29258 16950 46395 15939 3246 -43408 -28346 3817
15337 3817 29466 15588 -55338 -38341 -41022 -66270 -58096 7462 17168 -32863 -64612 -64237 -32435
15324 -32435 -23471 -44052 -78830 -85014 -48722 -39814 -46488 -54762 -26341 34345 -8400 -65003 -52185
15311 -52185 -54470 -89254 -107799 -111932 -65342 -28954 -90321 -94651 -38964 -69724 -105198 -97386
15299 -97386 -45848 -51338 -69238 -15614 -2149 -36442 -40848 -80723 -91551 -56816 -34523 -31443
15287 -31443 -74730 -87202 -71647 -11611 -40082 -102214 -81422 -50184 -8847 17738 -89303
15276 -89303 -128596 -92901 -20804 39569 6096 -63813 -65609 -26066 -10458 -35905 -6736 -27520
15264b7520O463M995k6112N934O884k1290j1304r947L3577L4669m172K6704J1966
15251C0847j6956m8910m6548L5250L2277J0125O627J9405L0952K6497m764p541
15239F7261k0053n3177l3153P684L534M8411L7192J1006o1965n5503O9618L0022
15227E0877l9879j0460n7014p955Q579J116O0930Q8365Q109l0791l3770k4149
15215A3958m1582L622K9591J0523k7619K4863O4290L4976j750l5823l3726J2609
15203E3932n5601l9930l7045J826P9635J4513m4413J4676K3766M9492m367m8259
15191H225m1133m3923K1188O4300l2700p0092K5902l6721P307K8987L764R35L3554
15178c0407K5022n6589K0986J9670k1182M3709j0446m4313L5775M2874j8353O131
$$ plain form
15264 -27520 -21057 -16062 -42174 -36240 -29356 -50646 -61950 -71897 -38320 -3651 -7823 18881 30847
15251 30847 13891 -35019 -81567 -46317 -14040 -3915 2712 22117 53069 79566 74802 67261
15239 67261 47208 -5969 -39122 -31438 -27904 20507 57699 68705 6740 -48763 20855 50877
15227 50877 10998 538 -56476 -64431 -55852 -54736 6194 94559 102668 71877 38107 13958
15215 13958 -27624 -24002 5589 16112 -11507 13356 77646 112622 110872 75049 41323 53932
15203 53932 -1669 -41599 -78644 -76818 2817 17330 -27083 -12407 11359 60851 56484 8225
15191 8225 -32908 -76831 -55643 8657 -24043 -94135 -68233 -104954 -97647 -68660 -64896 -63961 -30407
15178 -30407 -5385 -61974 -40988 -21318 -42500 1209 -9237 -53550 -17775 25099 6746 12877
15166A2877n7952k6200K5897J1838L3296L9790j5911Q451N0459l4740m9980m7153
15154d9328K4678K5455j5857n7330k110P4507O4582R142p7744k5097K1509m0913
15142d8506K143L6872M7411n327k7586k6069R124j3038R204L3472M5613R999k6441
15129D6871k4142l2677l987o323j8194J100R339J2884O368l664K4581R474Q360
15116B9990J9024m4977l9509n886N4633k1801M700j9385l1662Q380K1705q032
15104c2820L1197k3023J7218j786p23K0015o279M3564l68q1052j7338J5005j925
15091c8315J581K0831m813k8650L3184O0859J3253l1814o0402p123J4157N8238
15079C0986K3223M4118L6756J2349q1693n4547n2473J4110j4477k2545K0979J8890
$$ plain form
15166 12877 -45075 -71275 -45378 -33540 -244 39546 23635 32086 82545 47805 -2175 -49328
15154 -49328 -24650 805 -15052 -72382 -74492 15 64597 73739 -4005 -29102 -7593 -48506
15142 -48506 -46363 -9491 37920 32593 5007 -21062 -11938 -24976 -15772 17700 63313 73312 46871
15129 46871 22729 -9948 -13935 -20258 -38452 -37352 -28013 -15129 -8761 -12425 12156 21630 29990
15116 29990 49014 4037 -35472 -41358 13275 -8526 -3826 -23211 -54873 -46493 -24788 -32820
15104 -32820 -1623 -24646 -7428 -9214 -9937 10078 3799 47363 46995 -34057 -51395 -36390 -38315
15091 -38315 -36734 -15903 -20716 -49366 -16182 44677 57930 26116 -34286 -41409 -27252 30986
15079 30986 54209 98327 135083 147432 65739 11192 -41281 -27171 -41648 -64193 -43214 -24324
15067b4324N3481L5618j0758R810L35k3759o436J7140Q573P368N424M3302l1918
15054H3856m0041K0523l9732o8211K6798R955Q23k7119J1859k7610m371L9314
15042a3956p586J047N3870L8235p9107l8594O1089Q876j5054l3979q579n903O239
15029c3402P432r978m4967Q112K5097O6328K8605P471R56p4343k1364K1375n2112
15016g0790k3474L8594K0852K4703L720j9791l6276J3776k5034M879m702M083
15004f9460J8947M6740K8462K6537O575J5660n1573p7851J4211M890n6662j3383
14992a06907N3320J2696L3808J9755m7271k5185r300n4993K1929O263M6948M6125
14980b812j8452l1100M7949l9263l1843O532P963l4077j3858n403L4400L9934
$$ plain form
15067 -24324 29157 64775 54017 63827 64162 40403 33967 51107 59680 67048 72472 115774 83856
15054 83856 43815 64338 24606 -43605 -16807 -6852 -6029 -33148 -21289 -48899 -53270 -13956
15042 -13956 -21542 -20495 33375 71610 -7497 -46091 14998 23874 8820 -25159 -33738 -39641 -33402
15029 -33402 -25970 -35948 -80915 -72803 -47706 18622 47227 54698 55654 -18689 -40053 -18678 -70790
15016 -70790 -94264 -55670 -34818 -10115 -6395 -26186 -62462 -48686 -73720 -68841 -73543 -69460
15004 -69460 -50513 -3773 24689 51226 57801 73461 21888 -55963 -41752 -36862 -93524 -106907
14992 -106907 -53587 -40891 -7083 12672 -34599 -59784 -69084 -124077 -102148 -95885 -48937 -2812
14980 -2812 -21264 -52364 -4415 -43678 -75521 -68989 -61026 -95103 -108961 -114364 -79964 -40030
14968d0030k4479J7158J4907n1699L0582r177n351J0940J1693M2933J0050N4910
14956F2437M5674l4090l6305k7264n2447L5145p704n7321j6283L9196j6727m0713
14944a06402q886j0140Q624j6096M4548N3640N7691L9668j038j3478n671q6188
14932d3728r2041P5320M3053J8298P47l3193k4308M0447J0044j1473L509n4170
14920f7495J5971K9959J9833J5593N79q026L080l6744q3869k3907M8264J7095
14908f9667k9534l5752K8442N4837J5046K0509k463J1217L6182R704j5507m4310
14896b1296k9445l1371N1451P4226N4062j8241l6408l9665n2868R668m604k6949
14884g1440o078L6186M126m3542J4919M8170l6052o3160M5103K9575R760J7494
$$ plain form
14968 -40030 -64509 -47351 -32444 -84143 -53561 -62738 -68089 -57149 -45456 -2523 7527 62437
14956 62437 108111 74021 37716 10452 -41995 -6850 -14554 -71875 -88158 -48962 -65689 -106402
14944 -106402 -115288 -125428 -116804 -132900 -88352 -34712 22979 62647 61609 48131 42460 -43728
14932 -43728 -135769 -60449 -17396 902 1649 -31544 -55852 -15405 -5361 -16834 -13325 -67495
14920 -67495 -51524 -21565 -1732 13861 14440 6414 9494 -27250 -111119 -135026 -86762 -69667
14908 -69667 -99201 -134953 -106511 -51674 -36628 -16119 -18582 -7365 28817 38521 23014 -21296
14896 -21296 -50741 -82112 -30661 43565 97627 79386 42978 3313 -49555 -39887 -44491 -71440
14884 -71440 -77518 -41332 -37206 -80748 -65829 -17659 -53711 -116871 -71768 -42193 -32433 -14939
14872a4939N0388L2687o0126l2324J8521K1628k4729j7235k7769l274m81M4020
14860a3633j4158n8224K5497n457k6005J8015L2103K8010l621k3987K7018M6069
14848C1627K8158p713k6032m6568m4042K1221j2912J1774K5833P2644J0331K291
14836F6612K4332o8165o2194j8182K1179l672n2587N1326O20j1324k5493q203
14824h5751l814K8820k5871k3463K2976k9753r161L9972O7133J8982q706j2621
14812b1257q198L947q26L6880j0576J1277L8930k9600m4281p6316k258M1685M4963
14799a5630M8556L4134o6110m7084N569J6095j174j7867K5357l3809J8078N3504
14787A9619j4104p3175k4425O599P0M8365M9484O736k5094K5567L0413j5442l988
$$ plain form
14872 -14939 35449 68136 8010 -24314 -5793 15835 -8894 -26129 -53898 -57172 -57653 -13633
14860 -13633 -27791 -86015 -60518 -65975 -91980 -73965 -41862 -13852 -17473 -41460 -14442 31627
14848 31627 59785 52072 26040 -20528 -64570 -43349 -56261 -44487 -18654 53990 64321 66612
14836 66612 90944 22779 -39415 -57597 -36418 -40090 -92677 -41351 -40731 -52055 -77548 -85751
14824 -85751 -89565 -60745 -86616 -110079 -87103 -116856 -126017 -86045 -18912 70 -8636 -21257
14812 -21257 -29455 -25508 -26334 10546 -30 11247 50177 20577 -23704 -100020 -102278 -60593 -15630
14799 -15630 32926 67060 950 -46134 -40565 -24470 -25644 -43511 -18154 -51963 -33885 19619
14787 19619 5515 -67660 -92085 -85486 -85416 -37051 12433 19169 -5925 19642 50055 34613 30625
14774C0625k5756k123m1580K3731O6112L0376n6125k3985J0430M9670L505l5946
14762B8934o6417n9703k4711O8142O6606j4336k6000k8896r288K8389o835P0524
14750B6409L4254j7969R576n0829m8383K8553j1834n1546L3396L7015j3502j5568
14738d0428l3054j2841Q8784L6637K0793J8767P20l8640l196j468m7014k2609
14726c3549j5890K8131J9474k3102R2304L302k5052l2170j048j4100j9990n11
14714b2201K7098Q631k9227k3641k6881j9264M0614J6107l1907k1794R044Q8441
14702A5020R574q166j18o3516l0476J9103L7619J01305L7730j3653o5941l9859
14690a378l4382l985L2462P1020J7535p608j9512j4744K8855K0636J1170m6484
$$ plain form
14774 30625 4869 2746 -38834 -15103 51009 81385 25260 1275 11705 61375 64880 28934
14762 28934 -37483 -97186 -121897 -53755 12851 -1485 -27485 -56381 -65669 -37280 -44115 26409
14750 26409 60663 42694 52270 1441 -46942 -18389 -30223 -81769 -48373 -11358 -24860 -40428
14738 -40428 -73482 -86323 2461 39098 59891 78658 79378 40738 37542 36074 -10940 -33549
14726 -33549 -49439 -21308 -1834 -24936 67368 70670 45618 13448 12400 -1700 -21690 -22201
14714 -22201 4897 13528 -15699 -39340 -66221 -85485 -44871 -28764 -60671 -82465 -73421 15020
14702 15020 24594 16428 16310 -47206 -77682 -58579 -20960 80345 118075 104422 38481 -1378
14690 -1378 -35760 -39745 -7283 63737 81272 73664 54152 39408 68263 88899 100069 53585
14678E3585l9727p6368p4132M6652M4599K3181m8615m4918K7210L5553M0138j7734
14666c0576R927J6154j0870k6117j2316n3627o976J2823M988N0474K4143L1963
14654I990K9125j076q279p533p3247k9370J0093O598L594K5942K1126J3129L1469
14641C1561k278m87M8479L427j5404n4558j0769J989m9894o1825O940J574J9673
14628h1572K9774k1165l109K7476J8235j8041j8003K8439j7018k0857K3378q028
14616f0491J0391Q5581k0676m3372L4749J796l4042L6504m5349q901o652J814
14604d8648M9317J9749O359j2377l4092m0152m1977L681P0586K2770q647q174
14592b1605J8873q322K2127N4956l3804L837J557j2127Q965m0929n5286L4190
$$ plain form
14678 53585 13858 -62510 -136642 -89990 -45391 -22210 -70825 -115743 -88533 -52980 -12842 -30576
14666 -30576 -20649 -4495 -15365 -41482 -53798 -107425 -114401 -101578 -96590 -46116 -21973 9990
14654 9990 39115 38039 29760 22227 -51020 -80390 -70297 -63699 -60105 -34163 -13037 92 31561
14641 31561 29283 28796 77275 80702 65298 10740 -29 1960 -47934 -109759 -102819 -101245 -81572
14628 -81572 -51798 -72963 -76072 -48596 -30361 -48402 -66405 -37966 -54984 -75841 -52463 -60491
14616 -60491 -50100 35481 14805 -28567 6182 7978 -26064 10440 -34909 -43810 -50462 -48648
14604 -48648 669 20418 26777 14400 -19692 -59844 -101821 -98140 -27554 -4784 -13431 -21605
14592 -21605 -2732 -11054 11073 66029 32225 36062 37619 25492 34457 -6472 -61758 -27568
14580b7568k1793m2977p027O6200P3819l5029m1295P111n040J6263L138j2410
14568b6608l3684Q27J228k8666k5267L416N6957l8935k2684N2735Q9965P189J5980
14555E2453K5855l6599l4070p3680l4738K2092L4983P5034K4019l2339k5551K888
14543C47K0130m2058m2576l4562M2130M8017k7074K1754r241l3213k2587O168
14531g2765M6605k331o5321R470Q6644K018n895N1589K4530m3661j2555o0472
14519d2144j6199j2833K9595L6254o279j200M3303N2947o9740n5181m1260J5964
14507f6773k1699j0555m70N4244N2573n050r125l2897o946J9284j1511L3102J1538
14494E715n4812l1021L1789P065L1944j9424j0621K6622M546j031n492J5231p952
$$ plain form
14580 -27568 -49361 -92338 -99365 -33165 40654 5625 -35670 -28559 -33599 -17336 -14198 -26608
14568 -26608 -60292 -59465 -58237 -86903 -112170 -108754 -51797 -90732 -113416 -60681 29284 36473 52453
14555 52453 78308 41709 7639 -66041 -100779 -78687 -43704 31330 55349 23010 -2541 347
14543 347 20477 -21581 -64157 -98719 -56589 -8572 -35646 -13892 -23133 -56346 -78933 -72765
14531 -72765 -26160 -28491 -93812 -84342 2302 4320 -1575 50014 74544 30883 18328 -42144
14519 -42144 -58343 -71176 -41581 -5327 -11606 -12806 30497 83444 13704 -41477 -82737 -66773
14507 -66773 -88472 -99027 -99497 -45253 7320 2270 -6855 -39752 -46698 -27414 -38925 -5823 5715
14494 5715 -49097 -80118 -48329 -41264 -9320 -28744 -39365 -12743 -8197 -9228 -14720 511 -7441
14481g441N7148M5214l4034q0324l0784k4694O4636K1911k0221o803k0987l7950
14469g4329J1640J390K9726L0419p141k5753J6733M0083L8195r924o8764k0576
14457c8301K1241Q515M5295L2667Q229n183J561J4642l3411l0472j409k6173j7067
14444a9866j0846N382O0137J932l3989L6731M3390k8659j16521M703P5760l3514
14432a5360k2970m578k34J573r449N1239M1294m4682k9121Q266J7727n2163P41
14419e7717J3469J1077j2728M2199j8576l5457L2386M0170P0655l8725n7751n0498
14407f1496K4899M5898M267L562j4345l7287j3603o172j0707L1343J3324K4019
14395C702k5036p3381J2453P4438Q351K0365L3448J3452O209N6434n3244l1312
$$ plain form
14481 -7441 49707 94921 60887 -19437 -50221 -74915 -10279 11632 -8589 -15392 -36379 -74329
14469 -74329 -62689 -61299 -31573 -1154 -8295 -34048 -17315 22768 60963 51039 -17725 -38301
14457 -38301 -17060 -8545 36750 69417 77646 72463 74024 88666 55255 24783 23374 -2799 -19866
14444 -19866 -30712 -25330 34807 36739 2750 39481 82871 54212 -62309 -57606 18154 -15360
14432 -15360 -38330 -42908 -43142 -41569 -51018 221 41515 -3167 -32288 -24022 -6295 -58458 -57717
14419 -57717 -44248 -33171 -45899 -3700 -22276 -57733 -25347 14823 85478 46753 -10998 -61496
14407 -61496 -36597 9301 13568 17130 2785 -34502 -48105 -54277 -64984 -33641 -20317 3702
14395 3702 -21334 -94715 -82262 -7824 527 20892 54340 67792 74001 130435 77191 45879
14383D5879q1702l4048K4906r903p73K9266K7012P266k5755r717L1718R987K2149
14370C6285k1321p0040r530L8884J3983m2341p681m666n158L4255L402m0675l4188
14357a08791O643Q5631O4432m5621m1760j0179j6596L9970K8155Q526J9701L6234
14345F6345l2230j2697K0687q194j597K6538j4540l2889l2432j0145j2941J3044
14333c1051K9853j6246J1933J7141K0545K0163K2408M589m069k1377o6663q4391
14321i7165M6632M4518j4836J6705k3501j9822K2465l3180j9502L339R068L1473
14309c3806M8595k6277l6781K0980L3275K3138K0071j4095j6668O1564K8906p1384
14297C7518n4212l1750L5420K5320J6188R004m0200J4814M8114m4680j4064k0496
$$ plain form
14383 45879 -35823 -69871 -44965 -54868 -55641 -26375 637 7903 -17852 -27569 4149 14136 36285
14370 36285 14964 -55076 -64606 -25722 -11739 -54080 -61761 -66427 -71585 -37330 -33928 -74603 -108791
14357 -108791 -102148 -16517 47915 2294 -39466 -49645 -66241 -26271 1884 10410 30111 66345
14345 66345 34115 21418 42105 33911 32314 58852 44312 11423 -21009 -31154 -44095 -31051
14333 -31051 -1198 -17444 -5511 11630 32175 52338 74746 79335 75266 53889 -12774 -97165
14321 -97165 -50533 -6015 -20851 -4146 -27647 -47469 -25004 -58184 -77686 -74347 -65279 -33806
14309 -33806 14789 -11488 -48269 -27289 5986 29124 49195 35100 18432 79996 108902 37518
14297 37518 -16694 -48444 -13024 12296 28484 37488 -2712 12102 60216 15536 1472 -19024
14285a9024P418N1650L6607p3096j1022J0364l494l2245j655J8924K2948n972
14273A403J4547l3947J116p742J0662M680j120K0829j5795m8233k2273K8764l3563
14260h0672J5749M8313P063k5932r082J4309J914L933L06k1284L1423O1071P224
14247E4335l0892m1450N020N7634J3698l6505k4708o2968N2087N5613l7028k1892
14235a7056L2565L5906l6243k8705M8585R992p5642l101l2021K9108j4946K9152
14223b2406r86q515q604l5705j9565J3548j545L2725j8983r682o400M148M3383
14210c8587J2801j222q784p115k4352J2444q570L0183l111J6968k6553k95K5926
14197b0267P2105L9452l6729p1172K2974k5043r647N774k0486j334j9750p5239
$$ plain form
14285 -19024 -11606 40044 76651 3555 -7467 2897 -597 -32842 -34497 -15573 7375 1403
14273 1403 15950 -17997 -16881 -24623 -13961 -9281 -10401 10428 -5367 -53600 -75873 -47109 -80672
14260 -80672 -64923 -16610 -9547 -35479 -44561 -30252 -28338 -24405 -24099 -45383 -13960 47111 54335
14247 54335 23443 -18007 -12987 44647 58345 21840 -2868 -65836 -13749 41864 4836 -17056
14235 -17056 15509 51415 15172 -13533 35052 45044 -30598 -33699 -65720 -36612 -51558 -22406
14223 -22406 -23392 -31907 -40511 -76216 -95781 -82233 -83778 -51053 -70036 -79718 -86118 -81970 -38587
14210 -38587 -25786 -27008 -35792 -42907 -67259 -54815 -63385 -33202 -36313 -19345 -45898 -46193 -20267
14197 -20267 51838 91290 54561 -16611 6363 -18680 -28327 -22553 -43039 -44373 -64123 -139362
14185a39362N3382O3484M6402M0442K1298j3287l5298l1282J6940L5025K0196
14174G7940j03275k6358k235O33M6704K1440l470l3117m7675N992L1324j1252
14162d3349q251P6552M6440l1190k1366k9556J4689R749m2403J4128p680k1445
14150d3682j3222K712K8577M4294J7477m6488l1582K0356j0941m4863K351J1233
14138f3778l6890K3970K9611r346K9582O2678O7165k979j8730L0755j9668M5619
14126A37989n9980o2986j1334j5377L9524p144l7125L196J3241M451L0842j8664
14114A6633q426K412O9878M2941o1463q3847q4425j5547K8432L7349L0295M5367
14102A9599l5024o0776n0377M1694L0301r528k9679J9588L4812m8477k1830Q1054
$$ plain form
14185 -139362 -85980 -22496 23906 64348 85646 72359 37061 5779 22719 57744 77940
14174 77940 -25335 -51693 -53928 -53295 -6591 14849 11379 -21738 -69413 -63421 -32097 -43349
14162 -43349 -51600 24952 71392 40202 18836 -10720 3969 13718 -28685 -14557 -22237 -43682
14150 -43682 -56904 -54192 -25615 18679 36156 -10332 -41914 -21558 -32499 -77362 -75011 -63778
14138 -63778 -100668 -76698 -47087 -56433 -26851 35827 102992 100013 81283 112038 92370 137989
14126 137989 78009 15023 3689 -11688 27836 20692 -16433 -13237 4 4455 35297 16633
14114 16633 8207 10619 80497 123438 61975 -21872 -106297 -121844 -93412 -56063 -25768 19599
14102 19599 -15425 -76201 -126578 -84884 -54583 -64111 -93790 -74202 -39390 -87867 -109697 -28643
14090b8643O3709K9861j4285l7756l451O27n7690j3622L2729k77P102k0090l0619
14077g2405o3716K4575Q3295L1229j0382K6012j788J7421n0546j347K2421J4175
14065A8944m3366q299K9432l4605K6250L1354K5873l8521l3738K6061j7683r883
14053b8181J436k1781K9663j0698K035m4630J2388L2401L5253J2382N212O5212
14041I0692q1742m1878j3222k6763O6650K2577l5988n4003m6047K0072k1910L8426
14029h3136O5437O332L9625k7078k0963n5810l6952R5519L6992j6360k9736k9492
14017e5622q599j3181L8071N1049L4392n439P338N911L3671K6398m0179r4479
14005b0669K227j279j2281n332L4804j0782m6141K4791O1271K8411n8551L1657
$$ plain form
14090 -28643 35066 64927 50642 12886 9435 10062 -47628 -61250 -28521 -28798 -21696 -41786 -72405
14077 -72405 -136121 -111546 -28251 2978 -7404 18608 16820 34241 -16305 -17652 4769 18944
14065 18944 -24422 -32721 -3289 -37894 -11644 19710 45583 7062 -26676 -615 -18298 -28181
14053 -28181 -26745 -48526 -18863 -29561 -27526 -72156 -59768 -27367 7886 20268 25480 90692
14041 90692 8950 -32928 -46150 -72913 -6263 16314 -19674 -73677 -119724 -99652 -121562 -83136
14029 -83136 -17699 -11367 28258 1180 -19783 -75593 -112545 -17026 19966 3606 -26130 -55622
14017 -55622 -64221 -77402 -39331 11718 46110 40671 48009 53920 87591 113989 73810 -20669
14005 -20669 -18442 -19721 -32002 -37334 -2530 -13312 -59453 -34662 26609 55020 -3531 28126
13993B8126K4968M5285m6915q5327N3k2534j6138L1324J6698L2826Q269J2180
13981B8815j0525L8035O479m2830j0651k9383l9768K895o573N0685p882J3832
13969f871L5067j1750j7308L7343J0705j1335m249m9156l9614K171J36982k4884
13957E7101q0071M6040j7139l7295J2990L726M3346L2585l5687j6659L2826R265
13945E1028j2627J1637j6162p9063k6554N141O207M3873j7830m0627N914N1344
13933a7719J5634m1607l8284J2233J054K3079j191Q91M961j5667J3803M9533M4585
13920E1305k2367n3984k0253J922m1574J1034O5215k4466j5783N3091J7950j9974
13908B116m2315O022L3463k0195j0763n9089J7799O9259K8958l703j2199J2880
$$ plain form
13993 28126 53094 98379 51464 -33863 -33810 -56344 -72482 -41158 -24460 8366 16635 28815
13981 28815 18290 56325 62804 19974 9323 -20060 -59828 -56933 -63506 -12821 -20703 -6871
13969 -6871 28196 16446 -862 36481 47186 35851 31602 -17554 -57168 -54997 81985 57101
13957 57101 -22970 23070 5931 -31364 -18374 -14648 28698 61283 25596 8937 41763 51028
13945 51028 38401 50038 33876 -45187 -71741 -66600 -60393 -16520 -34350 -74977 -69063 -17719
13933 -17719 -2085 -43692 -81976 -69743 -68689 -45610 -46801 -45910 -40949 -56616 -42813 6720 51305
13920 51305 28938 -25046 -45299 -43377 -84951 -73917 -8702 -33168 -48951 4140 22090 2116
13908 2116 -40199 -34177 -714 -20909 -31672 -90761 -72962 -3703 25255 21552 9353 22233
13896B2233j9335N1518P717m5749k0812k7921J7431L1933k1174L8977J9852Q185
13884F2855j705j7720J9561K0662l2392o9565o440M3300Q8879J4367p1916o6728
13872a6842K9142L8509K7232J83k6471k3025J4871Q2572k9420n1451l4633K206
13860A2873k9153L4512K8162p3920j1385K4134k8373K8344L9201l8136j170J4652
13848b59o04K3060Q1703J8988q5257n9230M261J2323k8182k6988k2297k2008O6423
13835c8067K4618J1957j7241K792M1448N439o658k6702m2942n3807L9117O123
13823e3923J4461L2489k152q465K6469J9218O361k9578j205j5684m268k7933k0982
13810f5192J7382L3968k2845o497M0822L4100K2989L3360M6645J0437O652j7058
$$ plain form
13896 22233 2898 54416 62133 16384 -4428 -32349 -14918 17015 -4159 34818 54670 62855
13884 62855 61150 43430 62991 83653 51261 -18304 -24744 18556 107435 121802 49886 -16842
13872 -16842 12300 50809 78041 78224 51753 28728 43599 126171 96751 45300 10667 12873
13860 12873 -16280 18232 46394 -27526 -38911 -14777 -43150 -14806 24395 -13741 -14911 -259
13848 -259 -863 22197 103900 122888 37631 -21599 -17338 -5015 -33197 -60185 -82482 -104490 -38067
13835 -38067 -13449 -1492 -18733 -15941 25507 30946 24288 -2414 -45356 -99163 -60046 -53923
13823 -53923 -39462 -6973 -9125 -17590 8879 28097 34458 4880 3675 -12009 -16277 -44210 -65192
13810 -65192 -47810 -13842 -36687 -43184 -2362 31738 54727 88087 134732 145169 151821 134763
13798A34763p5058l2091j0881l3397J4259O7679J3742j1773m1215M804j7983n2236
13786c9387J6168N3632K7295N8367k1789o7587l5700O725M2888N947m8074k8621
13774c0136j4036P8783J3458N050l8230L45K8702J328o083J8684M55l5886m0544
13761a8110L6538K6993k7715N14M6209k0906o5221L3558L3585k8917J2051L4673
13749F3252k4674k1738j6429k5171K8452O0222o196j3321r536K0323m2757n9477
13737d7050q106P4709M0281n9078j3555j312L8167L1076l9831K5605J9338R6j0105
13724E0235m5396L2390K0107k7970L8770q477J5271k518l9443K3400l7097j6247
13712C025J9024K3697Q146l8503K8178j1872n2252r673L2730P609J1533p0371
$$ plain form
13798 134763 59705 27614 16733 -16664 -2405 65274 79016 67243 26028 30832 12849 -39387
13786 -39387 -23219 30413 57708 116075 94286 26699 -9001 -2276 40612 46559 -1515 -30136
13774 -30136 -44172 34611 48069 53119 14889 15234 43936 45264 39181 57865 58320 22434 -18110
13761 -18110 18428 45421 17706 18220 64429 43523 -21698 11860 45445 16528 28579 63252
13749 63252 38578 16840 411 -24760 3692 63914 57718 44397 34861 55184 12427 -47050
13737 -47050 -55156 19553 59834 756 -12799 -14111 24056 55132 15301 40906 60244 60340 50235
13724 50235 4839 37229 57336 29366 68136 59659 74930 72412 32969 56369 19272 3025
13712 3025 22049 45746 53892 15389 43567 31695 -20557 -30230 2500 10109 21642 -48729
13700d8729k5845j7889K1913K4330l7965J1467L4608j5050P5360J0689m6949p5522
13688h9582r009J03666R502n7795j4223L5457j3586l8716N2225J6856N373J3596
13676A3764K2364K251j1535j9178m0442J1265M9375K2942o0408J6069J396J5509
13664B3372N7395L560l4538K2890m96n6977l0991R8l0040k0632K2335O3081m873
13651A4184j5404j7004k3608M520r077l4482r55N9512k4167N920M6293J4117Q12
13638B0661J3589j2864o1440J875O259L3198P0581l0956Q440K6069o589m213q563
13625E6047j3663m0877j2187k6520K8630N5222o449J2566k5004L4371K1725m3696
13613D0165n667n1171L2339K630o7964m0688k2025M5126N5434M1347k1769l3691
$$ plain form
13700 -48729 -74574 -92463 -70550 -46220 -84185 -72718 -38110 -53160 22200 32889 -14060 -89582
13688 -89582 -98591 5075 14577 -43218 -57441 -21984 -35570 -74286 -22061 -5205 168 13764
13676 13764 36128 38379 26844 7666 -32776 -21511 27864 50806 -9602 6467 7863 23372
13664 23372 80767 84327 49789 72679 72183 15206 -15785 -15687 -45727 -66359 -44024 19057 14184
13651 14184 -1220 -18224 -41832 -37312 -46389 -80871 -81826 -22314 -46481 -40561 5732 19849 20661
13638 20661 34250 21386 -40054 -38179 -31920 1278 71859 40903 49343 75412 68823 64610 56047
13625 56047 42384 1507 -10680 -37200 -8570 46652 40203 52769 27765 62136 83861 40165
13613 40165 34498 -16673 15666 18296 -49668 -90356 -112381 -67255 -11821 29526 7757 -25934
13601b5934r839j1685k1618J4595K9107N5472k5240J1779N988k917K1529l1839
13589I398l0621J671l563N693L2565L1660j989j9050m5550l5444P6079R5854l4119
13576H2584J0632J8892m8624n9464k3419o167J1500M0804J3349n0115p473P1675
13564E4174j2811o6527J7599O103M8872K8093k6428o7105R658K4785m046N314
13552A7681j2209J7468L3603P1173P66o1700m2723r432L3579K3038l1277J262
13540D1229J6030j0336J3095m067k154N0380l897k7097j4219J8286K0571l781
13528I4040l7347j9125J0823J1187j4238n504m3741K307M1473L9983L3704m4046
13516F9516j06684m1234L5596J3367l03k8033J4620R887M861J5944K7441J0140
$$ plain form
13601 -25934 -35773 -47458 -69076 -54481 -25374 30098 4858 16637 22625 19708 41237 9398
13589 9398 -21223 -19552 -23115 -17422 15143 46803 44814 25764 -19786 -55230 20849 116703 82584
13576 82584 93216 112108 63484 4020 -19399 -25566 -14066 26738 40087 -10028 -17501 54174
13564 54174 41363 -25164 -7565 -1462 47410 75503 49075 -18030 -8372 16413 12367 17681
13552 17681 5472 22940 56543 127716 128482 66782 24059 14627 48206 71244 39967 41229
13540 41229 57259 46923 60018 55951 53797 104177 100280 73183 58964 77250 97821 94040
13528 94040 56693 37568 48391 59578 45340 39836 -3905 -1598 39875 79858 113562 69516
13516 69516 -37168 -78402 -42806 -29439 -29742 -57775 -43155 -33268 -28407 -12463 14978 25118
13504B5118J4821J156J237m2526j521P999M7027N6527l3819j3180p359j4408j4754
13491B6318k1242L395k5802K667P439l397N3654O654l8238k3767j6122r657K0757
13478a7341J9041K3920k9038o1758K7308p061j9910R001j9055o508O8007k1082
13466c4476j9581j9264q690O6195M1062L1280j8099l7477k3407J1L8838J5636
13454C2028k4485l5719M830m14k6899o466N9638j6718j6386j1558M0780L6669
13442C5300j9870r728k9893j3617O1871K2374l21N725O149L515J7514l133k8774
13429D7112l8420j1610J5993J964J8033L0910k9793j7286J985l361O795j4018
13417H304k1059N330j1663k8691M440j1660J435L9567J7927L2177j5756K1065
$$ plain form
13504 25118 39939 41095 42332 -194 -1715 6284 53311 109838 76019 62839 55480 41072 26318
13491 26318 5076 8471 -17331 -14664 -7225 -10622 43032 49686 11448 -12319 -28441 -38098 -17341
13478 -17341 1700 25620 -3418 -65176 -37868 -44929 -64839 -55838 -74893 -81401 -13394 -34476
13466 -34476 -54057 -73321 -82011 -15816 25246 56526 38427 950 -22457 -22446 16392 32028
13454 32028 7543 -28176 -23346 -23760 -50659 -57125 2513 -14205 -30591 -42149 -1369 35300
13442 35300 15430 5702 -24191 -37808 24063 46437 46116 51841 57990 61505 79019 75886 47112
13429 47112 8692 -2918 13075 15039 33072 63982 34189 16903 18888 15527 22322 8304
13417 8304 -12755 -7425 -19088 -47779 -43339 -54999 -53564 -13997 3930 36107 20351 41416
13405D1416m7902k996M7552K9402j9704o529l0789p677O008J2741l8589Q096L4117
13392B5146p222k9444k5033m523j3219J1684J978K941K2047p525q552j8720N4913
13379D471O460k7812k6399J3761j5582m548L2222L1844o0714o0478j8338Q5756
13367c9357Q4441K1891K667m7556m5372J1901N461O052q000N5443M0490j3025
13355G5036n7217l3662o656K0919k2903l502L7231k6051J1018L5452j4837J9198
13343C4026K2194l1014n0771j2869j2443P334K0590L1101J4558N9766j621p216
13331G3635o1555k4640Q274L5227M8761K846J2273l4322j8342j007m6355p497
13319a2702j3268n114K4284K6537L5400J1032K2517j2271p552J1958Q189L0043
$$ plain form
13405 41416 -6486 -9482 38070 67472 47768 41239 10450 2773 8781 21522 -17067 -8971 25146
13392 25146 17924 -11520 -36553 -41076 -54295 -42611 -40633 -37692 -15645 -23170 -31722 -50442 4471
13379 4471 10931 -16881 -43280 -29519 -45101 -49649 -17427 14417 -46297 -106775 -125113 -39357
13367 -39357 45084 66975 69642 22086 -23286 -11385 -5924 128 -7872 47571 88061 75036
13355 75036 17819 -15843 -22499 -1580 -24483 -27985 9246 -16805 -5787 29665 14828 34026
13343 34026 56220 25206 -25565 -38434 -50877 -43543 -22953 8148 22706 82472 80851 73635
13331 73635 12080 -12560 -4286 30941 79702 82548 94821 60499 42157 41150 -5205 -12702
13319 -12702 -25970 -31084 -6800 19737 55137 66169 88686 76415 68863 80821 89010 119053
13307A19053j8195K40K4234k0119n4023k2318J3309m9482m5111m300L3196J7917
13295e599K571L124k9037J0861M0233N624k4453J9518J8478m5227j035l3520P160
13282c1302J5238J6289K1318k9030l1995k1513l0082K4336n353K0804M8597J7370
13270A4677Q47j5030j1781J5579j0101K2310Q868L1039O710j6606j3915p675M711
13257B9633L5125K3894K0859J2436n3033q5087r178M699J4348O7014M8449j4962
13245I4197L7334l0263m2159m2455n7428J5607k5541l9904L4874J8128k806r813
13233e0229L0537M2133j2162k6877m9267k1K6368K7602M0884K2309j9697l560
13221B8020n168j353M5595j9808k2081P771M5046M91k4401j2067j8952J7352j8157
$$ plain form
13307 119053 100858 101098 125332 105213 51190 28872 42181 -7301 -52412 -56712 -23516 -5599
13295 -5599 -3028 96 -28941 -18080 22153 27777 3324 22842 41320 -3907 -4942 -38462 -31302
13282 -31302 -16064 225 21543 -7487 -39482 -60995 -91077 -66741 -72094 -51290 -2693 14677
13270 14677 15524 494 -11287 4292 -5809 16501 25369 56408 63118 46512 32597 24922 29633
13257 29633 64758 88652 109511 121947 68914 -16173 -25351 -20652 -6304 60710 109159 94197
13245 94197 131531 101268 59109 16654 -40774 -25167 -50708 -90612 -55738 -37610 -40416 -50229
13233 -50229 -19692 22441 10279 -16598 -65865 -65886 -39518 -11916 28968 51277 31580 28020
13221 28020 22852 21499 67094 47286 25205 32976 78022 78513 54112 42045 23093 40445 22288
13208B2288J5122j9857j0388K5082k072K7344j6824K3367l1696m8726J9284L162
13196F086k0917m3265K4630M1960M0548n563p6022J4268Q532m0791M3355K9900
13184B2721Q749O763q10m2763N2322K9346K4776k1414l8478l657J8827K832n3574
13171E640n8007J2004j0530O3741P304j9056J6523L319l2467k2192J2728M1870
13159B0877R945l0940j2869K3496J3632k9857N68J5799P49j1874m9510N5921O5245
13146G1182J4291J0409j4471o6530m4580L1759J1290j9578m8378L9041K8726n33
13134A2628P8674N167k0533n4678M9412Q4681l553p6444K1505o103l7230p7145
13122b3619m3989N6983m331m5612M6014J6595n6815M1836K0025n4378n8955k1344
$$ plain form
13208 22288 37410 17553 7165 32247 30175 57519 40695 64062 32366 -16360 2924 6086
13196 6086 -14831 -58096 -33466 8494 49042 43479 -32543 -18275 -9743 -50534 -7179 22721
13184 22721 31470 38233 37423 -5340 46982 76328 101104 79690 41212 37555 56382 59214 5640
13171 5640 -52367 -40363 -50893 12848 20152 1096 17619 20938 -11529 -33721 -20993 20877
13159 20877 30822 -118 -12987 10509 24141 -5716 -5148 10651 11400 -474 -49984 5937 71182
13146 71182 85473 95882 81411 14881 -29699 2060 13350 -6228 -54606 -15565 13161 12628
13134 12628 91302 96469 75936 21258 70670 155351 151798 75354 96859 90756 53526 -23619
13122 -23619 -67608 -10625 -14956 -60568 -14554 2041 -54774 -12938 7087 -47291 -106246 -127590
13110a27590N1585N2145K6589O9940L2869l6349q694P670J5044j2334k548k8371
13098C9956M0785Q341O901m9111p6518R294M014K5180L7354j4593r2176l6292
13086i6865J596J3942L2025l5501p97M0913N6733r667l1462q3694L9296O4957
13074h524p292j526L572N6485N1579k9547l6925j0254n0976l7323J6151K8548
13062b6032p411k4453J103j6693N8204K2621J6948N5589L5634j4765n979n2514
13050D2252q702m1698n5177L0177J668J8800R9602J268m0277j8525l6888j27J8586
13037A0959J1885n310N7287j1853j5616j3702o709Q4006L2093k927Q385J4671
13025A63169l4739n5395r995n860L0219k7052o3592P0530L9392R141M4796L331
$$ plain form
13110 -127590 -76005 -23860 2729 72669 105538 69189 60495 68165 83209 70875 68327 39956
13098 39956 80741 89082 95983 46872 -29646 -20352 -16338 8842 46196 31603 -60573 -96865
13086 -96865 -95269 -81327 -49302 -84803 -85600 -44687 12046 2379 -29083 -112777 -73481 -8524
13074 -8524 -15816 -17342 -13770 42715 94294 64747 27822 17568 -33408 -70731 -54580 -26032
13062 -26032 -33443 -57896 -56793 -73486 -15282 7339 24287 79876 115510 100745 94766 42252
13050 42252 33550 -8148 -63325 -33148 -31480 -12680 86922 88190 47913 29388 -7500 -7627 10959
13037 10959 22844 17534 74821 62968 47352 33650 26941 110947 143040 140113 148498 163169
13025 163169 128430 73035 63040 57180 87399 60347 -3245 67285 106677 115818 160614 163945
13013A63945m3088o2956m8941n0624M9351M9810O7621k0367r5202l2159N3287
13002C0677R7724O960k8933L9028m8690m0945l2074o764P3600p797n593j7955
12990E9238l1474R447k7054l8130m0695L1071N5736L1488J075m5312K7127J6385
12978D8902P089j940K9212l2299m3853J0217l620L0794M2170n436r232J253J0487
12965H3744k3982j4217k0610m0155m88J9556K4593L8251K0807j9821n3800j9462
12953e584M4778M6914p926l844n6791m7194J4626n757L7644P555K709N4802p595
12940G4337N071k6352n3206J4320J8020K0530o854J816P255J2819j8714k7029
12928B2013k7641l5714j198L5269L3364K0190p24J0859k2743j7455k1957n570
$$ plain form
13013 163945 120857 57901 8960 -41664 7687 57497 125118 104751 9549 -22610 30677
13002 30677 128401 135361 106428 145456 96766 55821 23747 16983 90583 82786 77193 59238
12990 59238 27764 37211 10157 -27973 -68668 -37597 18139 49627 50702 5390 32517 48902
12978 48902 55991 54051 83263 50964 7111 17328 13708 44502 86672 81236 72004 73257 83744
12965 83744 59762 45545 24935 -15220 -15708 3848 28441 66692 87499 67678 13878 -5584
12953 -5584 39194 86108 78182 74338 17547 -29647 -15021 -20778 16866 24421 27130 81932 74337
12940 74337 79408 53056 -150 14170 32190 52720 45866 47682 54937 67756 49042 22013
12928 22013 -5628 -41342 -42540 -7271 26093 46283 45559 56418 33675 16220 -5737 -11307
12916a1307N1927J2818o445K5301m6742J0563N0830N8640j5281k0801N146k3685
12904I0964p0429K6004L0281o0429l0917p485J4094L0677k5422m9467M8433P0993
12892F7297j4122k5734j2664j0891j0849M1362P587m3344J2768K6466j3523q69
12880B3484M9581L7774m5794k6747K0520L0575O431J5361m3012N724j1719k3445
12868C8733K0229K2694l0905j3392K2022k082J0498l279k0870m4440M841J7625
12856B1674M0442N892p0005l7201K3474J8253m206k6696R802N0304J7894N6640
12844A06267L3121j2535l7015l2911j9788j9175q339M8615k3603J934j1854K621
12832B7338M0904J6438k284l6161j5387M9521K449K696l4197l237N1543j8536
$$ plain form
12916 -11307 40620 53438 46993 72294 25552 36115 86945 145585 130304 109503 114649 90964
12904 90964 20535 46539 76820 16391 -14526 -22011 -7917 22760 -2662 -52129 -3696 67297
12892 67297 53175 27441 14777 3886 -6963 34399 41986 -1358 11410 37876 24353 23484
12880 23484 73065 110839 65045 38298 58818 89393 95824 111185 68173 73897 62178 38733
12868 38733 58962 81656 50751 37359 59381 57299 67797 64518 43648 -792 4049 21674
12856 21674 62116 68008 -1997 -39198 -15724 2529 -1677 -28373 -18571 31733 49627 106267
12844 106267 139388 126853 89838 56927 37139 17964 9625 58240 34637 36571 24717 27338
12832 27338 68242 84680 82396 46235 30848 80369 82818 85514 51317 48080 99623 81087
12820H1087J005K0042q484j8772J5759O439m4856N8014K1807l2233m8901l087
12808D7820p932j858j8796k7753k8932O685J3249J5301j0572L8M7572j4053J5630
12795C6399J377J0938K7308l5264J0112o420j5194K5330M6168J7703k6386j5761
12783G6310M7810L3270m0560k2651r006J4935N0159k6309n7627n0514j4207J5668
12771A7278O5526l617j4993m3601Q070P7153l6751j949N5620J8474L087l9194
12759A05103j0435n7452l6942J1740K8283K0064L4281O2488j3028j7505p8q811
12747A17708p16k9000k1183J9934J9645L9439J9570o4679n0278n5867Q883M4438
12735D7894N625P903j2935L84J6533q842q2326J2060O8859J4830O857K0638J5640
$$ plain form
12820 81087 82092 102134 93650 74878 90637 97076 52220 110234 132041 99808 50907 47820
12808 47820 39888 38030 19234 -8519 -37451 -30766 -17517 -2216 -12788 -12750 34822 20769 36399
12795 36399 37776 48714 76022 40758 50870 44450 29256 54586 100754 118457 92071 76310
12783 76310 124120 157390 116830 94179 85173 100108 150267 123958 66331 15817 1610 17278
12771 17278 82804 79187 64194 20593 28663 105816 69065 67116 122736 141210 144297 105103
12759 105103 94668 37216 274 12014 40297 60361 94642 157130 144102 126597 126519 117708
12747 117708 116992 87992 66809 86743 106388 145827 165397 100718 50440 -5427 3456 47894
12735 47894 53519 61422 48487 48871 65404 56562 -25764 -13704 55155 69985 76842 97480 113120
12722A13120j8906K2962J8909j2486o5586j5799P285M4536J2235j6493J5417k1638
12710H3556N321J4130j7698n4657l713M2418J6089l8741j7659k1891L8482l130
12698D2507N7269K6113M9l3831L2296P1047K2373k3870J6259o9783l0430q7955
12686B2044l1657M1897M1366L2399p421j324o44L0102j1734n4345p804J1654k0505
12673D4028M0158j3644m5007L7742J3311O848k9719p604L4149J1992k0824o247
12661F5183r947j9350O4117N3683K0919k7705j08980K1062L2142J157K3857j4235
12649A01903k8851L6580J4981l7550k8348m298J1120P487K9184J6014n1504j8108
12637D8610K8133M9714N121J8942J703k9729r97P0941N9736j6457J0543P441r302
$$ plain form
12722 113120 94214 117176 136085 123599 58013 42214 49499 94035 106270 89777 105194 83556
12710 83556 88877 103007 85309 30652 26939 69357 85446 46705 29046 7155 45637 42507
12698 42507 99776 125889 125938 92107 124403 195450 217823 193953 210212 140429 109999 22044
12686 22044 -9613 32284 73650 106049 98628 97304 96660 126762 115028 60683 52879 64533 44028
12673 44028 84186 70542 25535 63277 76588 83436 53717 46113 80262 92254 71430 65183
12661 65183 55236 35886 100003 153686 174605 146900 37920 58982 91124 92281 116138 101903
12649 101903 73052 109632 124613 87063 58715 54417 65537 73024 102208 118222 66718 48610
12637 48610 76743 126457 131578 150520 152223 122494 121497 192438 252174 235717 246260 253701 244399
12624B44399j144k3587l2296m753m89p802L933k4172l7381L0429l5689k7116K1713
12611A06045K3314j7684J7095J1014J2318K9108k6481Q470K1593r167l0747l3268
12599A11610l0269m4039M0753K8774K7703Q284o5680j7992M5216M6626m714m3682
12587A02590l166K6L3576K0681k1785j1520L640k6714J6542k2494M845l103J0097
12574A03215O1563j9833j2872l9746J2639K0893L4926n485j2591K279M5008J3529
12562B03525n0925o1464o788K2793m045J5854K4218j559o3591O509L0561N9736
12550A74824k6511j1503K0349l934L1747k2411p990J0635J2320Q038J2903k6302
12538A72165j3897m4828k4854m5428K9768N1236N0663M310j8233k7651j4763j2344
$$ plain form
12624 244399 243255 219668 187372 182619 182130 174328 178261 154089 116708 147137 111448 84332 106045
12611 106045 129359 111675 128770 139784 152102 181210 154729 163199 184792 175625 144878 111610
12599 111610 81341 37302 78055 106829 134532 142816 77136 59144 104360 150986 146272 102590
12587 102590 99424 99450 133026 153707 131922 120402 124042 97328 113870 91376 96221 93118 103215
12574 103215 164778 144945 132073 92327 104966 125859 160785 155300 142709 144988 189996 203525
12562 203525 152600 91136 84348 107141 103096 118950 143168 141609 78018 84527 115088 174824
12550 174824 148313 136810 157159 153225 184972 162561 154571 165206 177526 185564 198467 172165
12538 172165 158268 113440 88586 43158 72926 124162 174825 179135 160902 133251 118488 106144
12526A06144L40m905j5484k856J9229N6603N6348J3759j1716J6463M042J7807
12514B55774J3711k9833k6925j416J1608n6609k6560M1801J8135l2484o1713o837
12502I8652L5169N336J968K0418R735J8474L0159n7549l9596J6612j1745K636
12490A30269L084J3302J0848m0274L3942K6268Q619m493m7219J1592R8954j8411
12478B26481k9201J2283N2067j7717o9748K8544L7726l5621J0348m267q4635j6848
12466A09412J7083m814K0129k7273L192M2792L9375M6552K378k315J1321L3424
12454B91256j712J989n1728m8493k807l0913k6512r500l7810J1904M0686L8199
12442A74559l4988J5074J9568M1509J9054m6215l7555l0509L079l7947J2282K1023
$$ plain form
12526 106144 106484 101579 86095 83239 102468 159071 215419 229178 217462 233925 237967 255774
12514 255774 269485 239652 212727 211311 222919 166310 139750 181551 199686 167202 105489 98652
12502 98652 133821 139157 141125 161543 171278 189752 219911 162362 122766 139378 127633 130269
12490 130269 133353 146655 157503 117229 151171 177439 186058 181565 134346 145938 244892 226481
12478 226481 197280 209563 261630 243913 174165 202709 240435 204814 215162 210895 126260 109412
12466 109412 126495 121681 141810 114537 117729 160521 199896 246448 248826 246511 257832 291256
12454 291256 289544 291533 239805 191312 188505 157592 131080 121580 83770 95674 136360 174559
12442 174559 139571 154645 174213 215722 234776 188561 151006 120497 123576 85629 97911 118934
12430A18934M5902K7038J1754J2578j4367M5409n0836K4351N6905k1236m353K6735
12418B78814l2926m2518L764M1607M6170j6191p207o4126p0097K7051P300j497
12406A70144M790m1936J8960P4697O0023j4486K7954J4817m3823P635K6378N6031
12394C61184M1026o862q9846k2575N100L3511Q743p6002O960J1226l590M5651
12382C14526j2376l4466o934M2065r499R528J6621l5562L1449M0162K8666J0982
12370C95162O097J0706m0554o3218r557j221K787M622O487l5421l6019J3980K1004
12357B74855k456K4965J3482k0080M0080j0427k3362j496M682K3066J8848j7311
12345C24846l9050j1738M2275M156N7408n8084k9266K1283J8632L0225M6169J1514
$$ plain form
12430 118934 164836 191874 203628 216206 201839 247248 196412 220763 277668 256432 252079 278814
12418 278814 245888 203370 207134 248741 294911 278720 271513 207387 137290 164341 171641 170144
12406 170144 174934 132998 151958 226655 286678 272192 300146 314963 271140 278775 305153 361184
12394 361184 402210 395348 305502 282927 288027 321538 330281 254279 261239 272465 268875 314526
12382 314526 302150 267684 260750 302815 293316 302844 319465 283903 315352 355514 384180 395162
12370 395162 401259 411965 371411 308193 298636 297415 300202 304824 311311 275890 239871 253851 274855
12357 274855 272399 297364 310846 290766 330846 320419 297057 295561 300243 323309 342157 324846
12345 324846 285796 274058 316333 320489 377897 319813 290547 311830 330462 360687 406856 418370
12333D18370n3313k3697L7735L7048k8296m6782m6051j9025P3419M3084L4894
12322D27386J3563l0434J5626l5742O815J8375K357k9937J8490J0471L0278M5226
12310D92474m7293n3512M1836K7227L8111l6066n1830j8358l7316L2735P0619
12299D58627l8559l0185K9211j7114n1219l7155K1894L3459R94k828J0007N3937
12287D31069N7778k5421m4372k4162L4878m1749l5285Q998M2134M2769L1658j4994
12275D63301K9702k1421L8786M2660k0002j5575J237J4144k0645K2658K0568O394
12263E61807l0347p600K4087J5839m6349j4973q541q425J2677O403j1136Q218
12251E01660L1213O7542L8852J4713L8386K1126m6546n1329n806J7433N6561O880
$$ plain form
12333 418370 365057 341360 379095 416143 387847 341065 295014 275989 349408 392492 427386
12322 427386 440949 410515 426141 390399 397214 415589 417946 388009 406499 416970 447248 492474
12310 492474 445181 391669 433505 460732 498843 462777 410947 392589 355273 388008 458627
12299 458627 420068 389883 419094 401980 350761 313606 335500 368959 369953 367125 377132 431069
12287 431069 488847 463426 419054 394892 429770 388021 352736 361734 403868 446637 478295 463301
12275 463301 493003 471582 510368 553028 533026 517451 518688 532832 512187 534845 555413 561807
12263 561807 531460 523860 547947 563786 517437 502464 493923 485498 498175 504578 493442 501660
12251 501660 532873 600415 639267 653980 692366 713492 666946 615617 609811 627244 683805 690685
12239F90685j4486m0162o193K5998J7807L2239J9125M0564l7513j4868L3242j2190
12227G34248k4k8188l1201n668P4452K8327j1277k6817k7227J4714L5751P1575
12215H28665M0071k3991q454J101l8188m0380J5839r570j36l9636r202M1426M0166
12202G97711J3434l494m754j2519L4798N7447p433k178K328N029J0603O276n926
12189H91322L518L136l7499J1497K0752J5582L5348l3675J3629M1515L6190K9325
12177A030640K774m1702Q1713L1232q532j4799J7352J2553k6885J6030J0549J6632
12165A127557J7745r956J8900L0827k2084k9212K4664j3112J327L8508j418K431
12153A186177J7074j0905M895K8934K0019k8273J005p569P4094J8202J1207k4864
$$ plain form
12239 690685 676199 636037 629844 655842 673649 705888 725013 765577 728064 713196 746438 734248
12227 734248 734224 706036 674835 669167 743619 771946 760669 733852 706625 721339 757090 828665
12215 828665 868736 844745 836291 837392 799204 758824 774663 765093 764957 725321 716119 757545 797711
12202 797711 811145 807651 802897 790378 825176 882623 875190 873012 875340 880369 890972 897248 891322
12189 891322 894840 897976 860477 871974 892726 908308 943656 909981 923610 965125 1001315 1030640
12177 1030640 1033414 991712 1073425 1104657 1096125 1081326 1098678 1111231 1084346 1100376 1110925 1127557
12165 1127557 1145302 1135346 1154246 1185073 1162989 1133777 1158441 1145329 1146656 1185164 1183746 1186177
12153 1186177 1203251 1192346 1197241 1226175 1246194 1217921 1218926 1211357 1285451 1303653 1314860 1289996
12141A289996m2852k0227J6005R0870M7247j2723n994j678K597M2937j0861N6286
12129A451603K8546l5531j3751K2472M377K0872R5238N8945j8207Q725O678K7507
12117A657474K8785O166O9454j5996J067L8483N3318O8869K3394M2085L7877J0391
12105B021367m228J9342L2100N3767Q338N7004R9992P6811K4897O7746O6914Q4146
12093B608196J3649K4668L3515j0356K160N1840l8553o616N9481L7249L7260j0291
12081B802202N767p966l601M9482L8466m5254J0514O3414M3533K9766J7156L9396
12069C042875N4737k3198Q613j5434N1124Q9626M7376K7452O0572N4038k486N1306
12057C446601L6834L1596R6580N7778K4252Q4921O1658R638K7001P6632R0440
$$ plain form
12141 1289996 1247144 1226917 1242922 1333792 1381039 1368316 1362322 1360644 1363241 1406178 1395317 1451603
12129 1451603 1480149 1444618 1430867 1453339 1457716 1478588 1573826 1632771 1614564 1623289 1629967 1657474
12117 1657474 1686259 1692425 1761879 1745883 1746950 1785433 1838751 1907620 1931014 1973099 2010976 2021367
12105 2021367 2017139 2036481 2068581 2122348 2130686 2187690 2287682 2364493 2389390 2457136 2524050 2608196
12093 2608196 2621845 2646513 2680028 2669672 2671832 2723672 2685119 2678503 2737984 2775233 2812493 2802202
12081 2802202 2807969 2800003 2796402 2845884 2884350 2839096 2849610 2913024 2956557 2986323 3003479 3042875
12069 3042875 3097612 3074414 3083027 3067593 3118717 3208343 3255719 3283171 3343743 3397781 3395295 3446601
12057 3446601 3483435 3515031 3611611 3669389 3693641 3778562 3840220 3849858 3876859 3953491 4043931
12046D043931N1579P3595O6610L5531O0678P4378R3658R8687M397P1411J02884
12035D777339M2169R5755Q7130L0704R3675J39389Q3292O0458O3924J04139J03753
12024E681727P3653Q4549J10071J07607J01756P7779Q3431J53903J40999N1002
12014F666477J11446J04380J29379J37287J71927J16840N9198J05966Q2671J50365
12004G835936J53409J42869J93218J88586J57846J77494J71344Q0790R2817J79138
11994I373447J78448J31337K26040K58320J58087J34976J48579K34586K07415
11985A1051235J52675J48105K55184K12177J24720J70512K18704K06819K16888
11976A2757019J63300J79813J75095K27991J79429J59574J63755J51054K09975
$$ plain form
12046 4043931 4095510 4169105 4235715 4271246 4331924 4406302 4499960 4598647 4603044 4674455 4777339
12035 4777339 4819508 4915263 5002393 5033097 5126772 5266161 5349453 5409911 5473835 5577974 5681727
12024 5681727 5755380 5839929 5950000 6057607 6159363 6237142 6320573 6474476 6615475 6666477
12014 6666477 6777923 6882303 7011682 7148969 7320896 7437736 7496934 7602900 7685571 7835936
12004 7835936 7989345 8132214 8325432 8514018 8671864 8849358 9020702 9101492 9194309 9373447
11994 9373447 9551895 9683232 9909272 10167592 10325679 10460655 10609234 10843820 11051235
11985 11051235 11203910 11352015 11607199 11819376 11944096 12114608 12333312 12540131 12757019
11976 12757019 12920319 13100132 13275227 13503218 13682647 13842221 14005976 14157030 14367005
11967A4367005K14096J27110J70245J98815J88354J37573J24984J46392J78558
11958A5853132J19697J12846Q9897R7666O2555Q9016R4732R8366O6488N2169K6697
11947A6763261k5887K7753L7200J3998k5000l402k1843q5197o5553P126m0788
11936A6581668q9101o1812j46831j40763j14299j48446j68592j55836j05682o4838
11926A5385468r7005j55848j51432j58634k19936k40789j56756j64797k43501
11917A3796770j45201j65458k06687k49276j77479j92652j59376j69691k03164
11908A2127786j82743k01402j86778k11796k44281j50899j37417j22301j48527
11899A0541642j35116k00550j65649j51431j92099k11418k08824j26739j62332
$$ plain form
11967 14367005 14581101 14708211 14878456 15077271 15265625 15403198 15528182 15674574 15853132
11958 15853132 15972829 16085675 16175572 16273238 16335793 16424809 16519541 16617907 16684395 16736564 16763261
11947 16763261 16737374 16765127 16802327 16816325 16791325 16787923 16766080 16680883 16615330 16622456 16581668
11936 16581668 16492567 16430755 16283924 16143161 16028862 15880416 15711824 15555988 15450306 15385468
11926 15385468 15288463 15132615 14981183 14822549 14602613 14361824 14205068 14040271 13796770
11917 13796770 13651569 13486111 13279424 13030148 12852669 12660017 12500641 12330950 12127786
11908 12127786 11945043 11743641 11556863 11345067 11100786 10949887 10812470 10690169 10541642
11899 10541642 10406526 10205976 10040327 9888896 9696797 9485379 9276555 9149816 8987484
11890H987484j69876j87666j34588j72883j47314j82687j52763j72565j19335
11881G547807j00721j33144j25851r3894j42025j18343j43149j41938j00076l4061
11871F414605r1230j33899o4820m2025j15582j03990j17199q7266q1778p4071
11861E502745n0958j45933o8131o8252j70575j13235o2912m8294q6334m1030o5848
11850D581243o8767j584p2144o5908p8528j03513n4141k0986j7968r6479j03043
11839C898182r3636k3069k4389K5998k0279j32311j66105o5263k1990o1839l2389
11828C282910r0234l3963L9758Q891o8149p4331m8342n3690q124m4726m9166j4676
11816B846158l7044q7903k7660p100k5426m5577q1329m7216l1590l6179n4490
$$ plain form
11890 8987484 8817608 8629942 8495354 8322471 8175157 7992470 7839707 7667142 7547807
11881 7547807 7447086 7313942 7188091 7094197 6952172 6833829 6690680 6548742 6448666 6414605
11871 6414605 6323375 6189476 6124656 6082631 5967049 5863059 5745860 5658594 5576816 5502745
11861 5502745 5451787 5305854 5237723 5169471 4998896 4885661 4822749 4774455 4688121 4647091 4581243
11850 4581243 4512476 4510892 4438748 4372840 4294312 4190799 4136658 4115672 4097704 4001225 3898182
11839 3898182 3804546 3781477 3757088 3783086 3762807 3630496 3464391 3399128 3377138 3315299 3282910
11828 3282910 3192676 3158713 3198471 3207362 3139213 3064882 3016540 2962850 2954726 2910000 2860834 2846158
11816 2846158 2809114 2721211 2693551 2686451 2661025 2615448 2534119 2486903 2455313 2419134 2364644
11805B364644j0367k1856q479l0339m0795r601j3636K487Q700l8867l5368j9842
11793B146681j6101k7374j993m7515q1910p3608n4142r876J2507l1223k2117j7521
11781A775808m1369k4267J8815j001J6726J1729p8671j4485p405j6155j5611o168
11769A617946m4442L610l7825m287M4411l8888l6315k4319l9542j6510M0189J7473
11757A481501l5878n4787q35o388m2341l9174l7397L3296M8394m987q403j8646
11745A314355j4429l497k2271o7815m5397N8082j870j4409l7218p740j1808m2707
11733A103276N5676P825n3369J4159l1004m1093j4388K3941j5149m4808r122k3196
11721I72748m4662k0660K3997n203L8956j1726n1658L957j5558r83J1510j3850
$$ plain form
11805 2364644 2354277 2332421 2323942 2293603 2252808 2243207 2229571 2232058 2240758 2201891 2166523 2146681
11793 2146681 2130580 2103206 2101213 2053698 1971788 1898180 1844038 1834162 1846669 1815446 1793329 1775808
11781 1775808 1734439 1710172 1728987 1727986 1744712 1756441 1677770 1663285 1655880 1639725 1624114 1617946
11769 1617946 1573504 1577114 1539289 1535002 1579413 1540525 1504210 1479891 1440349 1423839 1464028 1481501
11757 1481501 1445623 1390836 1390001 1383613 1341272 1302098 1264701 1297997 1346391 1341404 1333001 1314355
11745 1314355 1299926 1296429 1274158 1206343 1160946 1219028 1217158 1202749 1165531 1157791 1145983 1103276
11733 1103276 1158952 1166777 1113408 1127567 1096563 1055470 1041082 1065023 1049874 1005066 995944 972748
11721 972748 928086 907426 931423 926220 965176 953450 901792 905749 890191 889208 900718 886868
11709H86868m8705n3686j3690N7227L8221m7174M789K4573L2348J3709K7799m1879
11697H80400k6187M388M2416m3043K0016j5855p92k1553K5791m4779n5787k0692
11685G44323J413K3505n5403l1985K0621N4963K1306m6594j8165K4711J1098j0946
11673G38847k3459q0792L4729P8933j4264l0339J2968k5994j3357O837j8983j4269
11661F50857J01987J4914p872j8934j8455k6047n2433K670j700m6451m1182J6499
11649E73853J0619K2841J5709n976l2880l3075J0309j7722m2626K5189J5433K5530
11637E67204p86k5040K8956p639j07934j1383J4760K6988J7119n11n860R658o8831
11624D36701k0730J6356k7665p7932L7162K3374K7745J3471N4371L3498j5549
$$ plain form
11709 886868 838163 784477 770787 828014 866235 819061 823850 848423 880771 894480 922279 880400
11697 880400 854213 858601 901017 857974 877990 862135 861343 839790 865581 820802 765015 744323
11685 744323 745736 769241 713838 681853 702474 757437 778743 732149 713984 738695 749793 738847
11673 738847 715388 634596 669325 748258 733994 703655 716623 690629 677272 684109 665126 650857
11661 650857 752844 767758 759886 740952 722497 696450 644017 646687 644987 598536 557354 573853
11649 573853 584472 607313 623022 617046 584166 551091 561400 543678 501052 526241 541674 567204
11637 567204 566418 541378 570334 562695 454761 443378 458138 485126 502245 501734 495874 505532 436701
11624 436701 415971 432327 404662 326730 363892 387266 415011 428482 482853 516351 500802
11613E00802R444L618p3634J6076J0775k6860k5236m738j7033r302P406M350P4987
11600D70655n582n5921K0004J5754J0035L2139J5490n0m6050r467r390m2566l2493
11587C62558k8088J1118K5606K9927K9941j456l259j1403k8990L9501n5818k8828
11575C40809L8369k5036o1070p086J9098L1601Q951j4154j540M6448Q666J8184
11563D03240J628K622k0301n1484J8961P0134k0664k0479K2497K3488m1477l5322
11551C52843m3606p683O1385q153P080p967o2579K60K5111K1655j6534J4997k4755
11538C12054o314j0298r882l0249N989l151J4934j0340j5729L9098K3823O339
11526C16274O3305K3300n2244n9236R950P329L995P740L818l1178o1360n205J6487
$$ plain form
11613 500802 510246 513864 440230 456306 467081 440221 414985 410247 393214 383912 391318 395668 470655
11600 470655 465073 409152 429156 444910 454945 487084 502574 502524 456474 447007 437617 395051 362558
11587 362558 334470 345588 371194 401121 431062 429606 426347 414944 385954 425455 369637 340809
11575 340809 379178 354142 293072 285986 305084 336685 345636 331482 329942 376390 385056 403240
11563 403240 404868 407490 387189 335705 354666 424800 404136 383657 406154 429642 388165 352843
11551 352843 309237 301554 362939 354786 361866 353899 291320 291580 316691 338346 321812 336809 312054
11538 312054 305740 295442 285560 255311 261300 258149 273083 262743 247014 286112 309935 316274
11526 316274 379579 402879 350635 291399 301349 308678 312673 320413 324231 293053 231693 226488 242975
11513B42975l3754k9012L986Q189J7239O4086R7864J3321l3797j2764k4722q3646
11501B29965K6967P496M9095J4016k6972k9142p345k4007m3691M9066j558j8108
11489B25782M0716r953K2127N6328n8660j2699L3175K3573r679P807N121n4075
11477B69563k3597k5201p665M1934j2048j7708K0888L4087o171n3656J4759K3429
11465B58614J8241j2490J6820k7634j1503J7999m901k9927j3707L8348J5042l0942
11453B33960l9911N714O2701K0473q7354q401J2738K7161j4702q159K1067r855
11441B15432l9415o0460K6869J4237J2578q507j2238K5076n3640q152Q1366k45
11429A92901J0391l3853L9210L1180l922J4700j1250k2326N789M6893j3624m5074
$$ plain form
11513 242975 209221 180209 184195 192384 209623 273709 371573 384894 351097 338333 313611 229965
11501 229965 256932 264428 313523 327539 300567 271425 264080 240073 196382 245448 243890 225782
11489 225782 266498 256545 278672 335000 276340 263641 296816 320389 310710 318517 323638 269563
11477 269563 245966 220765 213100 255034 242986 225278 246166 280253 274082 220426 235185 258614
11465 258614 276855 264365 281185 253551 242048 260047 255146 225219 211512 249860 264902 233960
11453 233960 194049 199763 262464 282937 195583 187182 199920 227081 212379 204220 225287 215432
11441 215432 176017 115557 142426 156663 169241 160734 148496 173572 119932 111780 193146 192901
11429 192901 203292 169439 208649 239829 235907 250607 239357 217031 222820 269713 256089 211015
11417B11015J1723J2654j5848J1340j2266j5925J5515J1082j0568j1322j26J07
11405B07381l7742j6186K251J6656k6922n10p511K6564o4913k5567Q8646Q3202
11393B45349J7213L325j3874k2937l1219m8171n2460J8100R299K5855j4090j6753
11381A19637L8954J6431L4753p206n8036l4973K0690L811k5471O886K4648o8899
11369G1225K0114N8799K1522M9461L6390j4847n8688l9499J4458j4760k5356k8197
11357I0622l7124k6613n015j1385L5164O1250N4571K4289N9473n6811P762J0731
11345B06914m0831j8680J6762r847m2245l5123l0473L8149M7946M698l4678R231
11333A11823m727J8960K6633N656p272m9863j396K8890n7138j2663R938L79R160
$$ plain form
11417 211015 222738 235392 219544 230884 218618 202693 218208 229290 218722 207400 207274 207381
11405 207381 169639 153453 155704 172360 145438 144928 137417 163981 99068 73501 162147 245349
11393 245349 262562 265887 252013 229076 197857 149686 97226 115326 124625 150480 136390 119637
11381 119637 158591 175022 209775 202569 144533 109560 130250 134061 108590 115476 140124 71225
11369 71225 91339 150138 171660 221121 257511 242664 183976 144477 158935 144175 118819 90622
11357 90622 53498 26885 21870 10485 45649 106899 161470 185759 245232 188421 196183 206914
11345 206914 166083 147403 164165 154318 112073 76950 46477 84626 132572 137270 102592 111823
11333 111823 107096 126056 152689 158345 151073 101210 99814 128704 71566 58903 68841 69220 78380
11320G8380j3891m0798M512M0731l505k5060o993j3836J9151K2207M5624k4679
11308H1843m446L9952L3554l137k2262O50j672l9120L3475k947l789k4747m590
11295H2764r663J8738J8542p949L1069R754j2590n359J4026L5314j2123n1542
11283A10981m4641J5119M3842K417q778o971q433l4781J5440M2577J9513n0906
11271I5379m1730M237P0105n609o9562n476j1345L4915L5382m3307M3494k9499
11259G6984j2877J9368K3435l3782J0430J5206m0680J6082q078J7973j489k3377
11247E9195J0358l3269l0347j0634m4719M2250J01586P2406j0744o0499n2282
11236D3301j4670J3777o140L2317j9376k0467J1879L0796j4216l4015K4899l819
$$ plain form
11320 78380 64489 23691 28203 68934 65429 40369 33376 19540 38691 60898 106522 81843
11308 81843 77397 117349 150903 147766 125504 126154 124482 85362 118837 115890 112101 87354 82764
11295 82764 73101 91839 110381 102432 133501 143255 130665 125306 139332 174646 162523 110981
11283 110981 66340 81459 125301 127718 118940 111969 103536 68755 84195 126772 146285 95379
11271 95379 53649 57886 127991 122382 52820 47344 35999 70914 106296 62989 106483 76984
11259 76984 64107 83475 106910 73128 83558 98764 58084 74166 66088 84061 82572 59195
11247 59195 69553 36284 5937 -4697 -49416 -7166 94420 166826 156082 95583 43301
11236 43301 28631 42408 36268 68585 49209 28742 40621 71417 57201 23186 48085 44266
11224D4266k6129l0280M060L6307k4065L4068L886P756k7339p3457j6735N4501
11212a3161L0493K1238J6583M40N5641L9617k1375j9791l2258l5542M3270M9451
11200A34606j2001R938l0557m4036K534m7550l8423k1872l297j4463J00253J0828
11188D5960j0843L4474k2152M876j4020Q586j5855k5433l2613k4803J7227K4867
11176i729N3409l7389K7718J1294j7969n986m4415L0249L2676N9800L4188m7363
11164H6483p0027k3381J91J0551L6290M4030k6854J0951N6507J5590o5276M8263
11152A23318J0257m5245m7065p7360l3987K9454M4110L2628K5140q627K5558L0726
11140A08907l6273m1525K2542K0729k9589o93J8961M6959n928k9695n259m3718
$$ plain form
11224 44266 18137 -12143 -8083 28224 4159 38227 42113 49869 22530 -50927 -67662 -13161
11212 -13161 17332 38570 55153 55593 111234 150851 129476 109685 77427 41885 85155 134606
11200 134606 122605 132543 101986 57950 60484 12934 -25489 -47361 -50658 -65121 35132 45960
11188 45960 35117 69591 47439 52315 38295 46881 31026 5593 -27020 -51823 -34596 -9729
11176 -9729 43680 6291 34009 45303 27334 21348 -23067 7182 39858 99658 133846 86483
11164 86483 16456 -6925 -6734 3817 40107 84137 57283 68234 124741 140331 75055 123318
11152 123318 133575 88330 41265 -36095 -70082 -40628 3482 36110 61250 52623 78181 108907
11140 108907 72634 31109 53651 74380 44791 44098 63059 110018 104090 74395 69136 25418
11128B5418M9260M4313J3354n9785k4017m7537k7097N6511N8501m9685l4965N0130
11116E4401M5797J520j3808k8908l6862l8219N6031P1105J7717N862k0149n1977
11104F2510l0736j6631R964Q7037O0495K1232n7654o6398R96J0003N142j7744
11092F8216l9274L061l1205J6338J9077l604J508J2173P4157K8644o5878n9941
11080B3272j9897k6591k5142p348N2637j3572J5200P9709J5330n3518K255K297
11068D4632j9719L4618o810J2887p7510k9091j5245J6074L3376J4865n320J0151
11056A2908J934J7483J7214K658N34n2436N7705K1929k7180j0195N7605K426P008
11043A09593R794k19j0232K6457J05419J38057j9625l3630O4685L9893l584m9139
$$ plain form
11128 25418 74678 118991 132345 72560 48543 1006 -26091 30420 88921 39236 4271 54401
11116 54401 100198 101718 87910 59002 22140 -16079 39952 111057 128774 134636 114487 62510
11104 62510 31774 15143 25107 112144 172639 193871 136217 69819 70815 80818 85960 68216
11092 68216 28942 32003 798 17136 36213 32609 34117 46290 120447 149091 83213 23272
11080 23272 3375 -23216 -48358 -55706 -3069 -16641 -1441 78268 93598 40080 42335 44632
11068 44632 24913 59531 52721 65608 -11902 -40993 -56238 -40164 -6788 8077 2757 12908
11056 12908 14842 32325 49539 52197 52731 295 58000 79929 52749 42554 100159 102585 109593
11043 109593 119387 119168 108936 135393 240812 378869 359244 325614 390299 430192 426608 377469
11031C77469j1433o2180n2736K183r560N5162J2271M2182Q5496P4724q1964j21750
11019C09864j6374k5644k4082o9306M1287P3876N5115L4980J7278n946l5338q7109
11007B68601m5673l3686j4944l743j3171r352K4493J5996J541K6570n8118M676
10995A63190M3218n2388n9547l3168j0288n0831k7832J4521J0494M4894N5366
10984I7629J9296j2651k2240l8538j4471L4838n113J454J6255k4791J7197O3232
10972A32097p16l8004k6841j8201n1703k9609J1775O0223o268j9446J8322l8407
10960f778K6415M5837l364r9105l2479L0422K1932P2408K1456j9535K336k3858
10948C5687l845M898l5613N521N52K6243k4054J3692l736L9835J7966o993k6700
$$ plain form
11031 377469 366036 303856 251120 253303 243743 298905 311176 353358 438854 513578 431614 309864
11019 309864 293490 267846 243764 174458 215745 289621 344736 379716 396994 391048 355710 268601
11007 268601 222928 189242 174298 170555 157384 148032 172525 188521 190062 216632 158514 163190
10995 163190 206408 154020 94473 61305 51017 186 -27646 -13125 -2631 42263 97629
10984 97629 116925 104274 82034 43496 29025 63863 58750 60204 76459 51668 68865 132097
10972 132097 131381 93377 66536 48335 -3368 -32977 -21202 39021 32753 13307 31629 -6778
10960 -6778 19637 65474 62110 -36995 -69474 -39052 -17120 55288 76744 57209 59545 35687
10948 35687 31842 36740 1127 6648 7200 33443 9389 23081 19345 59180 77146 70153 43453
10935D3453j8981l9009J2547J6854k3401l5463n0204J5496K7541N171N917L235
10923c6844N2756M3657J0100J2792m5840k5174N3421K4093j6166j4200l4344J1430
10911C5681K6543l8996j3433k7225l7983J8971L0053L3089M4354k5749l6783P279
10899A5801o550p781J5048K4639k8147M1044q372P418j3631l2300M6877j9674
10887C4372o7016j4640P871M1973M4518n603o165L84J6374l1284P28N3396M0505
10874A15413k446k6991j2567n39L5431j8306m0690J5500K0770L6996r263j4696
10862I8612J4833j3596j3928J3242n0273Q199P775k5350J027K2508j6952l2704
10850A3393R968P580L3839m2078j02614l9130P716J8388O9376L7109M5306N6093
$$ plain form
10935 43453 24472 -14537 -1990 14864 -8537 -44000 -94204 -78708 -51167 -45996 -40079 -36844
10923 -36844 15912 59569 69669 82461 36621 11447 64868 88961 72795 58595 24251 35681
10911 35681 62224 23228 9795 -17430 -55413 -36442 -6389 26700 71054 45305 8522 15801
10899 15801 9251 1470 16518 41157 13010 54054 45682 53100 39469 7169 54046 34372
10887 34372 -32644 -47284 -39413 2560 47078 41475 35310 35694 52068 20784 21512 74908 115413
10874 115413 112967 85976 73409 72870 108301 89995 49305 64805 85575 122571 113308 98612
10862 98612 113445 99849 85921 99163 48890 57089 64864 39514 40541 63049 46097 13393
10850 13393 23361 30941 64780 22702 -79912 -119042 -111326 -92938 -23562 13547 58853 114946
10838A14946j9674k3024m2961j6747m139j4663Q707R896M3834l837j4335O379
10826D4382K3217j0107m9513l1470j7046O2670R8340R54k7917n7367j8084N3588
10814G1647j9217q1252J6420L6445J7291J2641N8214P855r481J3861j4099J2681
10802A23006M6436L0920l0746o7223l3331L763k6681j6384K1802j5266o2279k1436
10790d7419L0244k9526N535j306L8303O0744K8944l5225n2835p569M2907J5102
10778D7899M3320N153m8634j0627m2100k8134N2798L5683J4412N5090L361q3271
10766D4950l8992j7141O479K4303m956K1992p669L0287j7767j6250O6923k8167
10754F3992m4811K9997K5642m9916m0534N29r365O2185m854j3359j1790J6801
$$ plain form
10838 114946 95272 72248 29287 12540 8401 -6262 2445 12341 56175 52338 38003 44382
10826 44382 67599 57492 7979 -23491 -40537 22133 120473 121427 93510 36143 18059 71647
10814 71647 52430 -28822 -12402 24043 41334 53975 112189 120044 110563 124424 110325 123006
10802 123006 169442 200362 169616 102393 69062 72825 46144 29760 51562 36296 -25983 -47419
10790 -47419 -17175 -46701 -41166 -42472 -4169 56575 85519 50294 -2541 -10110 32797 47899
10778 47899 91219 96372 47738 37111 -4989 -33123 19675 55358 69770 124860 128221 44950
10766 44950 5958 -11183 -4704 19599 14643 36635 28966 59253 41486 25236 92159 63992
10754 63992 19181 49178 74820 24904 -15630 -15101 -24466 37719 32865 19506 7716 24517
10742B4517p332J7004n131N586K5418j4447j0898l9086j1754J6722P405J1290
10730A9294L8905M3090R765m961j9906r3883k6986L8248J9027l1265n07J6117
10718F938J0924l414j1814j156j0301K8702O727M1631n4768k1596N9429J1742
10706F3044k5382m1713j169O7059N7439P777o4884l5408P357p92J6714j0755l0494
10693H793O4863j6056j7999M4669J8147k8574K273r976l9745j6403l0K1053K3650
10680E4665j3383j510L1917L23j5319J4504K994n3229j768J6438j9641J6870O1600
10667I4461L5947J9978l5378q3498K7220M7841N2233L9957N3811J7806r908p235
10655B53235n918N4065J6698n5504n0688K302l0482K3970P872K2576M633J4280
$$ plain form
10742 24517 17185 34189 29058 34644 60062 45615 34717 -4369 -16123 599 8004 19294
10730 19294 58199 101289 111054 106093 86187 -7696 -34682 3566 22593 -8672 -9179 6938
10718 6938 17862 14448 2634 1478 -8823 19879 26606 68237 13469 -8127 51302 63044
10706 63044 37662 -4051 -5220 61839 119278 127055 62171 26763 34120 33328 50042 39287 8793
10693 8793 73656 57600 39601 84270 102417 73843 76116 66140 26395 9992 9962 31015 54665
10680 54665 41282 39772 71689 72012 56693 71197 74191 20962 19194 35632 15991 32861 94461
10667 94461 130408 150386 115008 31510 58730 106571 158804 198761 252572 270378 260470 253235
10655 253235 247317 301382 318080 262576 211888 214190 183708 207678 215550 238126 242759 257039
10643B57039L5937N9236K5298N4261N6421J27467Q7511K4755Q9207J16376J22194
10632A055702J57094J84122J85727J87727K62901L17361M21049N13191P14688
10623C999562J110328J534047K115080K854070L582940M035691L694898K302963
10615B5229579L94155j112938j480889r11444J32601J516371L232841N308043
10607C2308319P206240Q138225P116125L412448j801432n334877n623883l876718
10599D1544447j372866J253203M021933O896153R375344J0167541P841535J813934
10591H1541224n854063j0351290j0102252p512210m427369j646127R28848L237491
10583D5814252M900620N232744L287536j109663n989717q452027p838560n777657
$$ plain form
10643 257039 292976 352212 377510 431771 488192 615659 703170 727925 817132 933508 1055702
10632 1055702 1212796 1396918 1582645 1770372 2033273 2350634 2771683 3284874 3999562
10623 3999562 5109890 6643937 8759017 11613087 15196027 19231718 22926616 25229579
10615 25229579 25623734 24510796 23029907 22118463 22251064 23767435 27000276 32308319
10607 32308319 39514559 47652784 54768909 58181357 56379925 51045048 45421165 41544447
10599 41544447 40171581 41424784 45446717 52342870 61718214 71885755 79727290 81541224
10591 81541224 75687161 65335871 55233619 47721409 43294040 41647913 42576761 45814252
10583 45814252 50714872 55947616 59235152 58125489 52135772 43683745 35845185 30067528
10575C0067528l568025j858854m80164O19302J226964J164562K51245j590960
10567B5831598l372848m134617l860271l089540k336805j708144j308285r62267
10559E058821o93000n42097m68575m00086l21452k97836j83863j73666k11017
10550A767229j53624j26741p3768r2083j31723r9059n5112m6772k6024m6990r7779
10539H17554q2877n6994m7806M35N5004q690j25450k4811j9940m1407p1513j9267
$$ plain form
10575 30067528 26499503 24640649 24160485 24779787 26006751 27171313 27422558 25831598
10567 25831598 22458750 18324133 14463862 11374322 9037517 7329373 6021088 5058821
10559 5058821 4365821 3823724 3355149 2955063 2633611 2335775 2151912 1978246 1767229
10550 1767229 1613605 1486864 1413096 1321013 1189290 1090231 1035119 988347 962323 915333 817554
10539 817554 734677 677683 629877 630312 685316 676626 551176 526365 506425 465018 393505 374238
$$ [...]
##END NTUPLES=NMR SPECTRUM
##END=
