##TITLE=Analysis number 325030
Compound Code btb 01373
Project Code adrs
Chemist Name fudan
##JCAMPDX= 6.0         $$ Bruker NMR JCAMP-DX V2.0
##DATA TYPE= NMR SPECTRUM
##DATA CLASS= NTUPLES
##ORIGIN= Bruker BioSpin GmbH
##OWNER= nmr
$$ XWIN-NMR		Version 3.5
$$ Thu Dec  7 10:55:37 2006 GMT Standard Time (UT+0h)  MAYBRIDGE\nmr@NMR_250MHZ
##.OBSERVE FREQUENCY= 250.131544655141
##.OBSERVE NUCLEUS= ^1H
##.ACQUISITION MODE= SIMULTANEOUS (DQD)
##.ACQUISITION SCHEME= undefined
##.AVERAGES= 16
##.DIGITISER RES= 18
##SPECTROMETER/DATA SYSTEM= dpx250
##.PULSE SEQUENCE= zg30
##.SOLVENT NAME= CDCl3
##.SHIFT REFERENCE= (INTERNAL, CDCl3, 0, 16.522)
##AUDIT TRAIL= $$ (NUMBER, WHEN, WHO, WHERE, WHAT)
$$ ##TITLE= Audit trail, XWIN-NMR		Version 3.5
$$ ##JCAMPDX= 5.01
$$ ##ORIGIN= Bruker BioSpin GmbH
$$ ##OWNER= nmr
$$ C:\u/data/dgb/nmr/ADRS/500/pdata/1/auditp.txt
$$ ##AUDIT TRAIL=  $$ (NUMBER, WHEN, WHO, WHERE, WHAT)
(   1,<2006-12-07 10:55:15.22 +000>,<MAYBRIDGE\nmr>,<NMR_250MHZ>,
      <created by zg, POWCHK disabled, PULCHK disabled
       configuration hash MD5:
       49 4B E0 1D 92 C2 6B 37 9F E6 65 BC 52 41 86 1D
       data hash MD5: 64K
       BD E0 B7 60 FB CF 7F 4A BB B5 14 EF C7 8C F1 9F>)
(   2,<2006-12-07 10:55:28.44 +000>,<MAYBRIDGE\nmr>,<NMR_250MHZ>,
      <Start of raw data processing
       ef LB = 0.3 FT_mod = 6 PKNL = 1 SI = 32K 
       data hash MD5: 32K
       F7 F4 F9 03 BD 46 79 90 7E EB 82 70 CB DE 2C E4>)
(   3,<2006-12-07 10:55:30.02 +000>,<MAYBRIDGE\nmr>,<NMR_250MHZ>,
      <apk 
       data hash MD5: 32K
       4F 5B 07 5B C4 2B 25 CD 36 D6 DA 31 38 81 3C F3>)
(   4,<2006-12-07 10:55:30.72 +000>,<MAYBRIDGE\nmr>,<NMR_250MHZ>,
      <abs ABSG = 5 
       data hash MD5: 32K
       E6 8B FE A1 2B 19 6A C7 8B B5 E0 32 3C B6 B7 84>)
$$ ##END=
$$ 
$$ hash MD5
$$ 32 7E 70 BD 26 D4 A6 A1 53 06 DF F5 C9 2D 02 0A
##$RELAX= 
##$RELAX= 
##$RELAX= 
##$RELAX= 
##$RELAX= 
##$RELAX= 
##$RELAX= 
$$ Bruker specific parameters
$$ --------------------------
##$DU= <C:\u>
##$EXPNO= 500
##$NAME= <ADRS>
##$PROCNO= 1
##$TYPE= <nmr>
##$USER= <dgb>
##$AMP= (0..31)
100 100 100 100 100 100 100 100 100 100 100 100 100 100 100 100 100 100 
100 100 100 100 100 100 100 100 100 100 100 100 100 100 
##$AQSEQ= 0
##$AQ_mod= 3
##$AUNM= <au_zg>
##$AUTOPOS= <14 >
##$BF1= 250.13
##$BF2= 250.13
##$BF3= 250.13
##$BF4= 250.13
##$BF5= 500.13
##$BF6= 500.13
##$BF7= 500.13
##$BF8= 500.13
##$BYTORDA= 1
##$CFDGTYP= 0
##$CFRGTYP= 5
##$CHEMSTR= <none>
##$CNST= (0..31)
1 1 145 1 1 1 1 1 1 1 1 1 1 1 1 1 1 1 1 1 1 1 1 1 1 1 1 1 1 1 1 1 
##$CPDPRG= <>
##$CPDPRG1= <>
##$CPDPRG2= <>
##$CPDPRG3= <>
##$CPDPRG4= <mlev>
##$CPDPRG5= <mlev>
##$CPDPRG6= <mlev>
##$CPDPRG7= <mlev>
##$CPDPRG8= <mlev>
##$CPDPRGB= <>
##$CPDPRGT= <>
##$D= (0..31)
0 1 0 0 0 0 0 0 0 0.06 0 0 0 0 0 0 0.0002 0 0 0 0 0 0 0 0 0 0 0 0 0 0 
0 
##$DATE= 1165488914
##$DBL= (0..7)
120 120 120 120 120 120 120 120 
##$DBP= (0..7)
150 150 150 150 150 150 150 150 
##$DBP07= 0
##$DBPNAM0= <>
##$DBPNAM1= <>
##$DBPNAM2= <>
##$DBPNAM3= <>
$$ [...]
##$SUBNAM7= <"">
##$SUBNAM8= <"">
##$SUBNAM9= <"">
##$SW= 20.6930455092707
##$SWIBOX= (0..15)
0 0 3 0 0 0 0 0 0 0 0 0 0 0 0 0 
##$SW_h= 5175.983436853
##$TD= 65536
##$TD0= 1
##$TE= 295.16
##$TE2= 300
##$TE3= 300
##$TEG= 300
##$TL= (0..7)
0 120 120 120 120 120 120 120 
##$TP= (0..7)
150 150 150 150 150 150 150 150 
##$TP07= 0
##$TPNAME0= <>
##$TPNAME1= <>
##$TPNAME2= <>
##$TPNAME3= <>
##$TPNAME4= <>
##$TPNAME5= <>
##$TPNAME6= <>
##$TPNAME7= <>
##$TPOAL= (0..7)
0.5 0.5 0.5 0.5 0.5 0.5 0.5 0.5 
##$TPOFFS= (0..7)
0 0 0 0 0 0 0 0 
##$TUNHIN= 0
##$TUNHOUT= 0
##$TUNXOUT= 0
##$USERA1= <user>
##$USERA2= <user>
##$USERA3= <user>
##$USERA4= <user>
##$USERA5= <user>
##$V9= 5
##$VALIST= <valist>
##$VCLIST= <CCCCCCCCCCCCCCC>
##$VD= 0
##$VDLIST= <DDDDDDDDDDDDDDD>
##$VPLIST= <PPPPPPPPPPPPPPP>
##$VTLIST= <TTTTTTTTTTTTTTT>
##$WBST= 1024
##$WBSW= 4
##$XGAIN= (0..3)
0 0 0 0 
##$XL= 0
##$YL= 0
##$YMAX_a= 319180
##$YMIN_a= -368066
##$ZGOPTNS= <>
##$ZL1= 120
##$ZL2= 120
##$ZL3= 120
##$ZL4= 120
##$ABSF1= 16.522
##$ABSF2= -4.171173
##$ABSG= 5
##$ABSL= 3
##$ALPHA= 0
##$AQORDER= 0
##$ASSFAC= 0
##$ASSFACI= 0
##$ASSFACX= 0
##$ASSWID= 0
##$AUNMP= <proc_1d>
##$AZFE= 0.1
##$AZFW= 0.1
##$BCFW= 0
##$BC_mod= 0
##$BYTORDP= 0
##$COROFFS= 0
##$CY= 12.5
##$DATMOD= 1
##$DC= 0
##$DFILT= <>
##$DTYPP= 0
##$F1P= 14.0000005364418
##$F2P= -0.99999901652339
##$FCOR= 0.5
##$FTSIZE= 32768
##$FT_mod= 6
##$GAMMA= 0
##$GB= 0
##$INTBC= 1
##$INTSCL= 1
##$ISEN= 128
##$LB= 0.3
##$LEV0= 0
##$LPBIN= 0
##$MAXI= 10000
##$MC2= 0
##$MEAN= 0
##$ME_mod= 0
##$MI= 0
##$NCOEF= 0
##$NC_proc= -5
##$NLEV= 6
##$NOISF1= 0
##$NOISF2= 0
##$NSP= 0
##$NTH_PI= 0
##$NZP= 0
##$OFFSET= 16.522
##$PC= 1
##$PHC0= 226.1372
##$PHC1= 1.499567
##$PH_mod= 1
##$PKNL= yes
##$PPARMOD= 0
##$PSCAL= 4
##$PSIGN= 0
##$REVERSE= no
##$SF= 250.13
##$SI= 32768
##$SIGF1= 0
##$SIGF2= 0
##$SINO= 400
##$SIOLD= 32768
##$SREGLST= <1H.CDCl3>
##$SSB= 0
##$STSI= 32768
##$STSR= 0
##$SW_p= 5175.98343685301
##$SYMM= 0
##$S_DEV= 0
##$TDeff= 65536
##$TDoff= 0
##$TI= <Analysis number 999999
Compound Code 99
Book Reference 9
Project Code 9>
##$TILT= no
##$TM1= 0
##$TM2= 0
##$TOPLEV= 0
##$USERP1= <user>
##$USERP2= <user>
##$USERP3= <user>
##$USERP4= <user>
##$USERP5= <user>
##$WDW= 1
##$XDIM= 32768
##$YMAX_p= 342432878
##$YMIN_p= -260715
$$ End of Bruker specific parameters
$$ ---------------------------------
##NTUPLES= NMR SPECTRUM
##VAR_NAME=  FREQUENCY,     SPECTRUM/REAL,   SPECTRUM/IMAG
##SYMBOL=    X,             R,               I
##VAR_TYPE=  INDEPENDENT,   DEPENDENT,       DEPENDENT
##VAR_FORM=  AFFN,          ASDF,            ASDF
##VAR_DIM=   32768,         32768,           32768
##UNITS=     HZ,            ARBITRARY UNITS, ARBITRARY UNITS
##FACTOR=    0.157963299565203, 1,           1
##FIRST=     4132.6476996994, 0,             0
##LAST=      -1043.33573715361, 0,           0
##MIN=       -1043.33573715361, -260715,     0
##MAX=       4132.6476996994, 342432878,     0
$$ Real data points
##PAGE= N=1
##DATA TABLE= (X++(R..R)), XYDATA
$$ [...]
16764a57855K4100O5298l2189j0436K8731N122J794L1521m7952o818P6544J8814
16752c326l8235n3000r240k7147p303L5786J4032j9337l6541q698O6563J8861
16740f7585o695m0924O4343N3328m656n4160m2981J0055K6058J8451J8349Q194
16728a8223j3613m9485o9216m2984Q6583K7329K5114L6692L8463M133K4624Q9256
16716A38673j791l433q004m3648j9878L6324O3360O1264P1905M5508Q4963R1056
16704E16299R9835L5174o8083q6675l3905L0604Q8188M4138k7641k0675q27m8440
16692E27992J7216M2547P288l9868l4055N2566j0168j24467j10512q7529r1417
16681A49593m0619j024K525J0070R870j1961j5971J8449K7137M5777j0582m0782
$$ y = [-157855, -133755, -68457, -100646, -111082, -82351, -77229, -75435, -43914, -91866, -98684, -22140, -3326, -41561, -94561, -103801, -130948, -138251, -102465, -88433, -107770, -144311, -153009, -86446, -67585, -74280, -115204, -50861, 2467, -2189, -56349, -99330, -89275, -63217, -44766, -26417, -18223, -31836, -81321, -150537, -193521, -106938, -79609, -54495, -17803, 20660, 24793, 49417, 138673, 136882, 133449, 125445, 81797, 61919, 98243, 161603, 222867, 294772, 340280, 425243, 516299, 616134, 651308, 583225, 496550, 462645, 493249, 581437, 625575, 597934, 577259, 576432, 527992, 545208, 587755, 595043, 555175, 521120, 573686, 563518, 439051, 328539, 241010, 149593, 108974, 107950, 110475, 120545, 130415, 118454, 102483, 120932, 148069, 193846, 183264, 142482]
16669A42482q9654k7516K9863p41o805K3717N1933N419K5553K5740J9437K9457
16657B28885Q1631M2814P3307K5069K2263N918k5941p4Q838J02504R0912k2881
16645F33245p8172j06719j31362q1864p2415j6123k0527K0403L6502J3963J7878
16634B14809K8564O7588O5142J8233R1574K6510m5264r9058l7644m7960r0735
16623A91759n0732k5905k9797l1170q0869o7911J534l1226m919r723m7163j3619
16611a99741N0539N2969J8227l5573m6880L8061J7684l2077J3165J1823j8071
16600a29874k9854J7635L7666M7504Q448l362j6307m3336J268K5152J2734M3431
16588b8895K0314K9709l6946j0801R566n3670n213J4661J133o536j0617J79K825
$$ y = [142482, 52828, 25312, 55175, 54434, 47629, 71346, 123279, 128698, 154251, 179991, 199428, 228885, 310516, 353330, 426637, 451706, 473969, 479887, 453946, 453872, 462710, 565214, 656126, 633245, 555073, 448354, 316992, 235128, 162713, 146590, 126063, 146466, 182968, 196931, 214809, 243373, 310961, 376103, 394336, 485910, 512420, 467156, 368098, 330454, 282494, 191759, 141027, 115122, 85325, 54155, -26714, -94625, -93091, -124317, -129236, -138959, -186122, -199741, -149202, -96233, -78006, -113579, -160459, -122398, -104714, -136791, -123626, -111803, -129874, -159728, -142093, -104427, -56923, -48475, -51837, -68144, -111480, -110212, -85060, -72326, -28895, -8581, 21128, -15818, -26619, -17053, -70723, -75936, -61275, -60142, -66678, -77295, -77116, -74291]
16575g4291l5942J8537k2142m0499K102M6593M2207L1775L9115J2778j2652n7984
16563e0403m3460l2925K9330L5117K4089k5177o0466N178J2650K7374K3338l697
16551e9052m3768p8648j3637N0405m0807k4979K8755m827L7090M1082P5527M6523
16539A3664j4083m4762l4534r786L2718M78n2143J6805k85J1721o612j6027k9394
16526a32240K3695M968K5273j4393k0447K8812l889m880K7038l0183O685k369
16514i1930j7578m3057m963N7078k0755K1718N3896j5450l8132p323k265j8130
16502a26891K4787K4963m9119k3257j3063O7687M7255L595k973M50J5661P1200
16490D0295l6988m3668j1435n3435M1043J05272j0792m9769L15J6011J6424O980
$$ y = [-74291, -110233, -91696, -113838, -154337, -152235, -105642, -63435, -31660, 7455, 20233, 7581, -50403, -93863, -126788, -97458, -62341, -38252, -63429, -123895, -118717, -106067, -78693, -55355, -59052, -102820, -181468, -195105, -144700, -185507, -210486, -181731, -186558, -149468, -108386, -32859, 13664, -419, -45181, -79715, -89501, -56783, -56305, -108448, -91643, -91928, -80207, -86819, -102846, -132240, -108545, -103577, -78304, -92697, -113144, -84332, -88221, -93101, -66063, -96246, -89561, -91930, -109508, -152565, -157528, -100450, -121205, -99487, -45591, -61041, -99173, -106496, -108761, -126891, -102104, -77141, -126260, -149517, -162580, -94893, -47638, -44043, -47016, -46566, -30905, 40295, 3307, -40361, -51796, -105231, -64188, 41084, 30292, -19477, -19162, -3151, 13273, 20253]
16478B0253l2905o639o026L8435M739q681K527o2563k4225N3027M555j0939M724
16465b3718l1786j7602l8798l9011K8441L7666J8944k8506N349K0314M589K6393
16453c7725k2251J7823j9716j8106l392M4053J9150k2488J8698N2547l931j4717
16441I945k3177M467r703j6025J9625K0881l8008l8913o991K971J1284J0959K3128
16428b9557k2288l2151j1158n5665N72L4217J2884r535K2423k7455J9438L5023
16416f3252M0770L6966l4384n6747l6626L439L4584M3435m8885l4029k7977j007
16404a43713J8408j9980J6929L9212L5429k7741j8891J7855L2739k1536l1648
16393a02937m8967p270k0783K1517J9934k3721M9799M682J4844q114J7978M4374
$$ y = [20253, -12652, -19291, -25317, 13118, 17857, 9176, 11703, -50860, -75085, -22058, -17503, -28442, -23718, -55504, -73106, -111904, -150915, -122474, -84808, -65864, -94370, -89021, -68707, -64118, -37725, -59976, -42153, -61869, -79975, -83367, -39314, -20164, -42652, -23954, 28593, 24662, 9945, -13232, -8765, -18468, -34493, -14868, 6013, -31995, -70908, -77899, -74928, -63644, -52685, -29557, -51845, -83996, -95154, -150819, -150247, -116030, -103146, -112681, -90258, -117713, -98275, -63252, -22482, 14484, -19900, -76647, -113273, -109834, -75250, -31815, -80700, -114729, -142706, -143713, -125305, -145285, -128356, -89144, -53715, -81456, -100347, -82492, -49753, -71289, -102937, -151904, -159174, -179957, -158440, -138506, -162227, -112428, -107746, -92902, -101016, -83038, -38664]
16381c8664J1594n020j9050j1671j5754L7729j3985m7681M1747n1580q6028L7585
16369a60778J04M7621O6021k8856l9700k1263K7051L6515J03720K0636m3967J5009
16357B2113N1637j240l2028k1479j1871l6193p961k7564J2162K6969K8987j6102
16345a2570q052j4278p3398J7777O2642J2820j9604k9937m577j6367j4424k5792
16333a25760O4508K8931j9094n3676n535K4618K4349J1509j5703m2523M8681j247
16321f0942j7482k0244L6101N0803J9524l9366k7406J6491j2506M1748L6349n3736
16309c0666m406K6570j3776r936M9637M2946p7827n9129m9943j5144l011j520
16297a46205J4912J6319k9237k2514Q0459L8985j9151K4400J4783m3515m3288
$$ y = [-38664, -27070, -32090, -51140, -62811, -78565, -40836, -54821, -102502, -60755, -112335, -198363, -160778, -160674, -113053, -47032, -75888, -115588, -136851, -109800, -73285, 30435, 51071, 7104, 22113, 73750, 72510, 40482, 19003, 7132, -29061, -37022, -64586, -52424, -25455, 3532, -12570, -20622, -34900, -108298, -90521, -27879, -15059, -34663, -64600, -69177, -85544, -99968, -125760, -61252, -32321, -51415, -105091, -110626, -86008, -61659, -50150, -65853, -108376, -59695, -60942, -78424, -98668, -62567, -11764, 7760, -31606, -59012, -42521, -55027, -13279, 23070, -30666, -35072, -8502, -22278, -32214, 17423, 60369, -17458, -76587, -126530, -141674, -144685, -146205, -131293, -114974, -144211, -166725, -86266, -47281, -66432, -42032, -27249, -70764, -114052]
16286a14052j5584N853M0207K4985k6744J158M3336J2630r159k919q002Q077k9238
16273f9452L7676N6230l125m4654M798k24k62J4105j2966o4333m8616j9146k3167
16260a73136k2208k9555L1955Q4719m8637n5149J8071J7177N644J3551Q6248J9129
16248e2191K2843p814k3888L5653M7625o0262j6025N9376o031J012k0630l2945
16236e3277L2910o815j8275j6881o5245M3398J4592M5494J6231M3898K0337k2359
16224C4008k2680o1328q8713j1641R1988M3180k768j0095p5162L3030Q5051j9411
16212d541J021n7788p040j7343j1643k443J7750P1029m6088l399O3163l1219q133
16199c6674K3340k9755l6714R167K3179N581P065j7987K9292J2233J9361k3844
$$ y = [-114052, -129636, -123783, -83576, -58591, -85335, -84177, -40841, -28211, -37370, -40289, -48291, -40214, -69452, -31776, 24454, 21329, -23325, -18527, -18751, -19013, -4908, -17874, -82207, -130823, -149969, -173136, -195344, -224899, -192944, -108225, -156862, -212011, -193940, -176763, -171119, -157568, -71320, -52191, -29348, -37162, -61050, -25397, 22228, -38034, -54059, 5317, -714, 298, -20332, -53277, -20367, -27182, -45457, -62338, -127583, -84185, -69593, -24099, -7868, 36030, 56367, 34008, 11328, -50000, -138713, -150354, -58366, -15186, -17954, -28049, -103211, -70181, 14870, -4541, -3520, -61308, -68348, -85691, -97334, -99777, -82027, -10998, -57086, -60485, 2678, -28541, -36674, -13334, -43089, -79803, -70636, -47457, -41876, -34811, -52798, -23506, -11273, 8088, -15756]
16187a5756j0842j3171l1819L1696L7093l7835m4804k4480J5817L6494O2254K4396
16175B9043J2306l8087p3748m3623K0032p375J9471L7037J1525J8199K3785M1447
16163E0012j7114l5080J2250N3439l3387J2879P385k9720m1469j778L0964k2492
16151a4111n7682n1097J5172O8156k8932K9521J3595J5154j106L3902k0360K534
16139D746k6932k7502j9397q367k2684j9438N873L0017M2467m283l2903J3431
16127f4972J1590N3369J5044p2654m5458O691O0346L7025j2312n1624l576M3789
16115b2742Q942M2401M9554m1731p5331r7103j0818J4349P642J02571L8885n9197
16103d2578l8L769q590J5723k840j0731O951N3581p124k860k1932L8351n580l0112
$$ y = [-15756, -26598, -39769, -71588, -39892, -2799, -40634, -85438, -109918, -94101, -57607, 4647, 29043, 41349, 3262, -70486, -114109, -94077, -101452, -81981, -44944, -33419, -15220, 8565, 50012, 32898, -2182, 10068, 63507, 30120, 42999, 50384, 20664, -20805, -22583, 8381, -14111, -71793, -122890, -107718, -39562, -68494, -38973, -25378, -10224, -11330, 22572, 2212, 4746, -22186, -49688, -69085, -77452, -100136, -119574, -113701, -83684, -41217, -45500, -78403, -64972, -53382, -13, 15031, -57623, -103081, -96390, -36044, 981, -11331, -62955, -66531, -22742, -13800, 28601, 78155, 36424, -38907, -136010, -146828, -132479, -124837, -22266, 16619, -42578, -42616, -38847, -47437, -31714, -34554, -45285, -38334, 15247, 8123, 5263, -16669, 21682, 16102, -14010]
16089a4010n776m807K988k3812Q405R888j2582m2186M2112J2996R821L9917J821
16076B4775J1783L8992j6055k1773j3511K4042J5878m1770l1036m0857n046K0540
16064c4038N3654m3782L0323K6206j4070l8829J8042n1332j4186K3699o102P6597
16052B6182l6700k1847l2614o463M8185L7159l4437p7013k415k1846Q3166L5893
16040b750m014p87q83K8404j2600m7740O433Q823L9135r686L3847J35k6617k2084
16026a0384M972L902M43l0242j2501l0612n482O0322K5956n5017p1067J3651m6063
16013a52122k0267M0055O3319K8615L7058l0431o625K0830J0664L558L943l3461
16001c4864K2476k449k1054R520M3317K3585k8995K8162J1417l621k8459j1574
$$ y = [-14010, -19786, -24593, -21605, -45417, -37012, -27124, -39706, -81892, -39780, -26784, -16963, 22954, 24775, 36558, 75550, 59495, 37722, 24211, 48253, 64131, 22361, -8675, -49532, -54578, -34038, 19616, -24166, 6157, 32363, 18293, -20536, -2494, -53826, -68012, -44313, -50415, 26182, -10518, -32365, -64979, -71442, -23257, 13902, -20535, -97548, -99963, -121809, -38643, -2750, -6764, -7551, -8434, 19970, 7370, -40370, -33937, -25114, 14021, 4335, 38182, 38317, 11700, -10384, -5412, -1510, -1067, -31309, -43810, -74422, -79904, -19582, 6374, -48643, -119710, -106059, -152122, -172389, -132334, -69015, -40400, -3342, -33773, -40398, -19568, -8904, -5346, -1403, -34864, -12388, -14837, -35891, -26371, 16946, 40531, 11536, 39698, 51115, 47494, 19035, 7461]
15989G461m5655o0511p171J8675J0052K0444Q461M4461j9063O921K6595M4279
15977E4949l4188L5240L9078j177L066j7002P118j6408l636Q414j5580l0448n9475
15964c0049L4124L5839m862j3814j9419j1004l3214L0307J0024n5033N23q00q839
15951f6217j1366L3548L6352j298j7059k3940r414k9942j2966J1252J2217l6350
15939a15183N3359O1604p2926k925L4114k8463m2444J3228O2825L2122M2457l1205
15927F563o5799J4424M2246M635K4322N778l4897l8668l6507k1836J6186P0378
15915a3175q128n4572k7876K3107L1982J9645R835j2357L3343N4975R181l2081
15903C3879k0258L2214k9208q6707k4235O7138R851p671k0672l2821K6136K4157
$$ y = [7461, -38194, -98705, -105876, -87201, -77149, -56705, -48244, -3783, -22846, -15925, 10670, 54949, 20761, 56001, 95079, 93902, 96968, 79966, 87084, 70676, 67040, 75454, 59874, 29426, -30049, 4075, 39914, 35052, 21238, 1819, -9185, -42399, -12092, -2068, -57101, -56578, -57378, -66217, -77583, -44035, -7683, -8981, -26040, -49980, -59394, -89336, -102302, -91050, -78833, -115183, -61824, -220, -73146, -76071, -41957, -70420, -112864, -99636, -36811, -4689, 37768, 6563, -59236, -44812, -2566, 2069, 26391, 32169, -2728, -41396, -77903, -99739, -83553, -13175, -21303, -75875, -103751, -80644, -48662, -29017, -19182, -31539, 1804, 56779, 65960, 33879, 13621, 45835, 16627, -70080, -94315, -27177, -17326, -24997, -45669, -78490, -52354, -28197]
15891b8197m0037j1448K0811K5454l6275N0674Q9873j4242L8398L869M724J6220
15879A19824k6825Q3165K7772l6116n3752j3991j2930m6642o7445M4513p1750
15868e4177n3256K5890J5679l521P2504M3352k0837K5302K1796N246o1052l0579
15856a3653L0343L4509k3385J0858m360m842l9235r686O9651K1324l9106n1913
15844a9495P922r018k6047o877m655n988J015L455J5000Q615P861k1118L1799
15831a7531R650K6154K7274n5225o1926l1236k9796O2276J0064j3350M3481J5185
15819a4980M1200J4193q128K4679j3767P200J8088k1278L808o2707o5818K3528
15807e3982K8151p520j4943l5135L9817K8777O8050Q877m2706L0978k3957o1196
$$ y = [-28197, -68234, -79682, -58871, -33417, -69692, -19018, 70855, 56613, 95011, 98880, 103604, 119824, 92999, 176164, 203936, 167820, 114068, 100077, 87147, 40505, -26940, 17573, -54177, -107433, -81543, -65864, -69385, 3119, 46471, 25634, 50936, 72732, 77978, 16926, -13653, 16690, 51199, 27814, 38672, 34312, 29470, -9765, -19451, 50200, 71524, 32418, -19495, -11573, -20591, -46638, -53515, -58170, -64158, -63143, -59688, -44688, -36073, -28212, -49330, -17531, -7881, 18273, 45547, -9678, -71604, -102840, -132636, -70360, -60296, -73646, -30165, -14980, 26220, 40413, 32285, 56964, 43197, 50397, 68485, 47207, 51015, -11692, -77510, -53982, -25831, -33351, -48294, -83429, -43612, -14835, 53215, 62092, 19386, 50364, 26407, -34789]
15795c4789l7380O5181K6231j5071K6698O6638K6772k5376K3889k0130k0057m0651
15783D1955K4213K5070J9597j9836p1971n4174L4235k7350J1261J9818k4267J2837
15771h612n8648o35M9994J1387J108J4440K0863K2265j528k6078j2729L1665N4394
15758I7886n4053j00919k7507K7652j950L8337J8338J1905M2051k7652k3573Q908
15746I423L4054k2636j6145P689N8131k2784o5558L4274N8358R366l12m2371J2544
15733E4033j4875o2892L9800M5429m6292Q570p898j6160K8257k7225J331J8651
15721B0729M7563k4871l5506L8452k9666K960K3514K0533M1770r9357n9680j3094
15709f6653L2617J4529K7452J960l2370m4530k4323L4186L2910M7147R51L5157
$$ y = [-34789, -72169, -6988, 19243, 4172, 30870, 97508, 124280, 98904, 122793, 102663, 82606, 41955, 66168, 91238, 110835, 90999, 19028, -35146, -911, -28261, -17000, 2818, -21449, -8612, -67260, -67895, -17901, -6514, -5406, 9034, 29897, 52162, 50634, 24556, 11827, 43492, 97886, 43833, -57086, -84593, -56941, -58891, -20554, -2216, 9689, 51740, 24088, 515, 9423, 43477, 20841, 4696, 12385, 70516, 47732, -17826, 16448, 74806, 84172, 83860, 41489, 54033, 39158, -23734, 16066, 61495, 15203, 23773, 15875, -285, 27972, 747, 2078, 20729, 68292, 43421, 7915, 46367, 16701, 19661, 43175, 63708, 105478, 6121, -53559, -66653, -34036, -19507, 7945, 9905, -22465, -66995, -91318, -57132, -24222, 22925, 23876, 59033]
15697E9033L7841m6642m8514J7158M5593m0617k4650N2992n1257k0932j3089l5217
15685f8301K7011p797K8950J4804l7574K0167j8590J7456l0412M824L1726M005
15673a3731k0564K0353R613K6344J5535J0587j7868k2122q0558N524K9848j5337
15661e2376j1830J0022l3873J9559J1437k627N5695L6595L3289j5789M637o3760
15649i021j8840K5295J0373l1358m312j312N8585M5523K534l056O554l1943j880
15636D7142j9136p811M4137j4425p2621k8087k7385J628J8625P0812K8582j8191
15624B3270J5358j2771K1506L8802K0780n8006r9727m8987k1089M3930O0586k0752
15612c7100m8010Q188P909K1487M033R442J3921J7780m094r267j3948R322K9187
$$ y = [59033, 96874, 50232, 1718, 18876, 64469, 23852, -798, 52194, 937, -19995, -33084, -68301, -41290, -49087, -20137, -5333, -42907, -22740, -41330, -23874, -54286, -49462, -17736, -13731, -34295, -13942, -4329, 22015, 37550, 48137, 30269, 8147, -72411, -66887, -37039, -52376, -64206, -54184, -88057, -68498, -57061, -59688, -3993, 32602, 65891, 50102, 54739, -9021, -27861, -2566, 7807, -23551, -27863, -29175, 29410, 74933, 77467, 74411, 80965, 49022, 47142, 28006, 20195, 64332, 49907, -22714, -50801, -78186, -76558, -57933, 12879, 41461, 23270, 38628, 25857, 47363, 86165, 106945, 48939, -50788, -99775, -120864, -76934, -16348, -37100, -85110, -76922, -69013, -47526, -43493, -34051, -20130, -2350, -6444, -15711, -29659, -20337, 8850]
15599H850N5186K6549n1136o3371n3802R061K4303J7880m633m1819j0162M0931
15587d2163M0114J0356j5723j4342K0953M4140k7108m7586M6909k4577k7803J3659
15575b3171o8076p3913K624P6173J5694O1166L6671l370L5716j0438M5810k1071
15563G3815o0082j7813n9744O9969L3865k2700n2650L4532L6065m3552k0110K3243
15551e162l1552l7276l0569k1941J00749N7473N2101p462k8263k0727l1547N1496
15539D7320K1010K1295j7076p8203J1717K7860J9171M2379k4113p7443K633P802
15527D352Q168L4997O815n3088j4673Q177J3564O1950O171l6855n9227j1029J6094
15514a4584k8264J5525m6935j8047q461O0979Q4731K0286j3058J7115j6903n66
$$ y = [8850, 64036, 90585, 39449, -23922, -77724, -68663, -44360, -26480, -31113, -72932, -83094, -42163, -2049, 8307, -7416, -21758, -805, 43335, 16227, -31359, 15550, -9027, -36830, -23171, -91247, -165160, -162536, -86363, -70669, -9503, 27168, 23798, 59514, 49076, 94886, 73815, 13733, -4080, -63824, 6145, 40010, 17310, -35340, -808, 35257, -8295, -28405, -5162, -36714, -73990, -104559, -126500, -25751, 31722, 83823, 76361, 48098, 27371, -4176, 47320, 68330, 89625, 72549, -5654, 6063, 33923, 53094, 95473, 71360, -6083, -3450, 4352, 12520, 47517, 54332, 1244, -13429, -5252, 8312, 70262, 76433, 39578, -19649, -30678, -14584, -42848, -27323, -74258, -92305, -100766, -39787, 44944, 65230, 52172, 69287, 52384, 51818]
15502E1818m4747l7576k5733j0806L5858J2997j349k8108j8827L4663l646j4492
15490d9948L4685M7680K0071j7083m3417k2208P2970l907n8088N8487K3195o8965
15478f528j6176n315j2111m0522K5024k5042J0417M3877L2243n6926M5145j2305
15466a8219k6959m7464m170K0705P2359M9095r494j08606J3181J6952m1M5692
15454C031p091M506l249j0576Q0161N7223m6954m7933K1983R652l1211l0676j4816
15441a5950L8128J1259K346K2110k4767K2177K5099k9426k6817J1902K3211M7431
15429A06703Q326l5776m3238k8127m5890q0009O4886P5456l0422K1195N3710j7146
15417D9668j2950L1552J2392L8787J1141n4789m629l5907M2902N3088L414R890
$$ y = [51818, 7071, -30505, -56238, -67044, -31186, -18189, -19538, -47646, -66473, -31810, -35456, -49948, -15263, 32417, 52488, 35405, -8012, -30220, 42750, 38843, -19245, 39242, 62437, -6528, -22704, -28019, -40130, -80652, -55628, -80670, -70253, -26376, 5867, -51059, -5914, -18219, -45178, -92642, -96812, -76107, -3748, 45347, 35853, -72753, -59572, -42620, -42661, 3031, -4060, 446, -2803, -13379, 66782, 124005, 77051, 29118, 51101, 60753, 29542, -1134, -15950, 22178, 33437, 35783, 57893, 33126, 55303, 80402, 50976, 24159, 36061, 59272, 106703, 115029, 79253, 36015, 7888, -38002, -118011, -53125, 22331, -8091, 13104, 66814, 49668, 36718, 68270, 80662, 119449, 130590, 75801, 71172, 35265, 78167, 131255, 134669, 144559]
15405A44559o6224m8007n3031j0034P3092n4781l9096K4153L9669L716q2307m4689
15393a12980J0156l6128Q3097M3807L0249K7436K2736k5239Q662k3767l5768p569
15381a5308M5301j4199j7536J3952K6712L298K2108l0142k5450r136l2917j1662
15369d4979L1451L2981k8306l1998P05k588k1106K3529M2502L686M5727m9184
15357B420J5299M0797J5648J5410k5856l1962K7605K259m6390K3666M4510n2829
15345C0577p9013J1125O9695k261J5587K2695n377k7377j6679K3255j4450l7671
15333i894k7020N2381M1442o4607K1037P2242K92m1790n2723l2878J1984J1559
15321a7975K9150k6311p677K3112K9490K116Q29k5751J8299J9705N9019k532n8832
$$ y = [144559, 78335, 30328, -22703, -32737, 40355, -14426, -53522, -29369, 10300, 14016, -68291, -112980, -102824, -138952, -55855, -12048, 18201, 45637, 68373, 43134, 51796, 28029, -7739, -15308, 29993, 15794, -1742, 12210, 38922, 42220, 64328, 34186, 8736, -400, -33317, -44979, -13528, 19453, -8853, -40851, -40146, -42734, -63840, -40311, 2191, 5877, 51604, 2420, 17719, 58516, 74164, 89574, 63718, 31756, 59361, 61620, 15230, 38896, 83406, 30577, -48436, -37311, 32384, 30123, 45710, 68405, 63028, 35651, 18972, 42227, 27777, -9894, -36914, 15467, 56909, -7698, 13339, 85581, 85873, 44083, -8640, -41518, -29534, -17975, 11175, -15136, -22813, 299, 29789, 31905, 32734, 6983, 25282, 44987, 104006, 101474, 42642]
15308D2642k9999K5678J1587P179n57K1567K8595n6540o5672j9795L4604m1769
15296d2480j1965M6169O2941L1810l9189K5995k102j5319j8006L5148j3639l8303
15284B1060j9276K4779m595Q351J5300m9908J7702K8789k4427K7989P583N4577
15272A07924J1906K636j3339N20J9497R904n1101j6746n112L5864K6169J5789
15260A43911j6622o9742M0260j681O170O7625M3904k6153n2556l3966k6986k0259
15248E3905l7293k563N781N2626M9459M5371j7776n6292k6537l4883n137K8442
15236E5103M1933M2242j2545m5954l5984m6862n6858q915M2827J9026J7576q970
15224B619J368l3936R359L5795N7363o2216j6856L7547o762k8140L4668l4625
$$ y = [42642, 12643, 38321, 49908, 57087, 56530, 78097, 106692, 50152, -15520, -35315, -711, -42480, -54445, -8276, 54665, 86475, 47286, 73281, 71179, 55860, 37854, 73002, 59363, 21060, 1784, 26563, 21968, 30319, 45619, -4289, 13413, 42202, 17775, 45764, 53347, 107924, 119830, 122466, 109127, 109647, 129144, 139048, 87947, 71201, 66089, 101953, 128122, 143911, 127289, 57547, 97807, 96126, 102296, 169921, 213825, 187672, 135116, 101150, 74164, 53905, 16612, 14049, 19830, 72456, 121915, 167286, 149510, 93218, 66681, 31798, 26661, 55103, 97036, 139278, 126733, 80779, 44795, -2067, -58925, -67840, -25013, -5987, 11589, 2619, 3987, -29949, -20590, 15205, 72568, 10352, -6504, 31043, 24281, -3859, 30809, -3816]
15212c816l8755O6536L258n716m275J7295j606M8457R554l3172q1038L403O5549
15199D5674k4438K9834L9330j4988R274o728j0608j1477o6378k0548L4105L6575
15187C9627n2944l4757n689k5224m1344J4382O2855J7316J0647M6927Q353J6264
15175E6413R2060o496j06684l1686M8925L5218N6087l310j7607l7613K3401L7460
15163A46168J8m7915m439K830k6436J6422J8389K0466N562M4087j5621r971n0069
15150I9491o7299o0903l8410J3346L8339O585L2760M2949m3861j1495M9668K5383
15138H6553l5056Q169P475o9700k2080J3046L4657n5648k4913K6848r590m486
15126d4725L900M331K5780K4580J8397K950l155R910J2291L190m6303q8810k1170
$$ y = [-3816, -42571, 23965, 27223, 21507, 17232, 34527, 32921, 81378, 90932, 57760, -23278, -19875, 45674, 21236, 51070, 90400, 75412, 84686, 77958, 67350, 55873, -10505, -31053, 3052, 39627, -13317, -48074, -53763, -78987, -120331, -105949, -43094, -25778, -15131, 31796, 40149, 56413, 148473, 141977, 35293, 3607, 52532, 87750, 143837, 140527, 122920, 85307, 108708, 146168, 146186, 98271, 93832, 96662, 70226, 86648, 105037, 125503, 131065, 175152, 159531, 149560, 99491, 32192, -28711, -67121, -53775, -15436, -8851, 23909, 66858, 22997, 11502, 61170, 86553, 51497, 59666, 67141, -2559, -24639, -11593, 23064, -32584, -57497, -30649, -40239, -44725, -40825, -36494, -10714, 13866, 32263, 35213, 32058, 41968, 54259, 57449, 11146, -77664, -98834]
15113i8834M4371K1225k089Q974N8253M4181n3222J5344m4532n1422o305R606
15101e4450M8560M5739L4028j8266k1532L217P253m4233l3288Q903N1759J2671
15089D0361M3895O8728j5922j5861J00872n2418j9769l4875j3217K5573N130m971
15077A27526n1064n4407n457L354j88l976K6997L237l2484l138Q349J3590J1809
15064D4148M1999l9493P555k0201m3570N3711l4234l6844o072K3642L8979O035
15052C5655R98l2480K3448J1528k2100j0005K7913L8237l52j711O9999m341J995
15039A38784m231j00394j5630q535l8245M379N9865K1593j4797K177J2075L8709
15027I5750m1741o7177L5125M54n8463P07K5769M5597O8721K5556n3086k9978
$$ y = [-98834, -54463, -33238, -35327, -26353, 31900, 76081, 22859, 38203, -6329, -57751, -64056, -54450, -5890, 39849, 73877, 55611, 34079, 37296, 44549, 316, -32972, -24069, 27690, 40361, 84256, 152984, 137062, 121201, 222073, 169655, 149886, 115011, 101794, 127367, 132497, 127526, 76462, 22055, 16598, 19952, 19764, 15788, 42785, 46022, 13538, 10400, 18749, 32339, 44148, 86147, 46654, 54209, 34008, -9562, 44149, 9915, -26929, -33001, -9359, 29620, 35655, 36653, 4173, 27621, 39149, 17049, 7044, 34957, 73194, 72842, 71131, 141130, 136789, 138784, 134553, 34159, 18529, 9994, -28251, -23872, 35993, 57586, 42789, 44966, 57041, 95750, 54009, -13168, 21957, 22411, -36052, -35345, -9576, 36021, 104742, 130298, 77212, 47234]
15015D7234M2386Q8607M5923j16667o6170j5678j3152Q131N2801L2979J2924k7743
15003I1575J9894k7815l4469M1054K2042k1403j2654J0787j2887k6761l8455K6119
14991C7027J6206O4328N6240k4911p3422l5373q760k0760l5366N0021N2166j7249
14979F0147l2910N4746N0359J1999k2562k8092m2117o273j4344k706l584N9775
14967H4438r640l050m9310L7917R569J983j3065j0561J8041r0781m821P5924L8917
14954H5561P847M425J5359q3082l3582J1750P009L6139J7157o6982p317J9909
14942A4193J2611K1874o562K1550N5445L0897o305k5056K595J6795m0491L1178
14930A28724J6607q693K6572j6903J4931k1135j4368P150o292n9748K4023J9680
$$ y = [47234, 89620, 178227, 224150, 107483, 41313, 25635, 12483, 20614, 73415, 106394, 119318, 91575, 111469, 83654, 49185, 90239, 112281, 90878, 78224, 89011, 76124, 49363, 10908, 37027, 53233, 117561, 173801, 148890, 75468, 40095, 31335, 10575, -24791, 25230, 77396, 60147, 27237, 81983, 132342, 144341, 121779, 93687, 51570, 45297, 30953, 28247, 24663, 84438, 74798, 71748, 22438, 60355, 69924, 71907, 58842, 48281, 66322, -24459, -29280, 46644, 85561, 93408, 97833, 113192, 30110, -3472, 8278, 15287, 51426, 68583, 1601, -5716, 14193, 26804, 48678, 42116, 63666, 119111, 150008, 143703, 118647, 121242, 138037, 97546, 128724, 145331, 136638, 163210, 146307, 161238, 140103, 125735, 132885, 126593, 66845, 90868, 110548]
14918A10548Q987l9191j157L7450k1806l1019L7280p295n8726m6873R016L7204
14906C4418p594K2994k6454k1805O262R78L3283L9173O5182m216l0274Q932M425
14893A25304o2719p503K8310j086j4766Q333R0166P050j8064J787J3934J0515
14881A81261K545j1448l5978o4839n1481J3199L389O9752K4500o9140j3159k8283
14869B0318N204O595Q6146k1737j2732k839p426M3521K1472J7019p5030L1095
14857A11606k1445j3384l91K3496k7590k5489J0966l4020n9788J2646J558J8607
14845c228K2565n9694n797K2332K6686r725q444K3348K1955j6650K467j3010K5842
14832B8647N8639K6048o5244q0459N8326M7320O803L1892M123l5984k7271M88
$$ y = [110548, 119535, 80344, 79187, 116637, 94831, 63812, 101092, 93797, 35071, -11802, -2786, 34418, 26824, 49818, 23364, 1559, 7821, 8799, 42082, 81255, 146437, 142221, 111947, 120879, 125304, 62585, 55082, 83392, 82306, 67540, 75873, 166039, 173089, 155025, 156812, 170746, 181261, 183806, 172358, 136380, 71541, 20060, 33259, 36648, 106400, 130900, 61760, 48601, 20318, 25522, 32117, 118263, 96526, 83794, 80955, 73529, 117050, 138522, 155541, 80511, 111606, 90161, 76777, 76386, 99882, 72292, 46803, 57769, 23749, -36039, -23393, -21835, -3228, 19337, -40357, -46154, -23822, 2864, -6861, -15305, 8043, 29998, 13348, 15815, 2805, 28647, 87286, 113334, 48090, -32369, 25957, 73277, 80080, 111972, 116095, 80111, 52840, 53328]
14820E3328J2454J5059m949k6274k1514M1986K531N4081k4353o3950L1305j7430
14808E2274J2101M7259K7843M6255j597l6413j2613j3503n1202J7273J5287k7045
14796G5919m2144Q8119K6547l6507M4928K0878n2856q7696k5299j609Q317K859
14784B1456L5447K5422J6681k5610K8239K3456j9421m4567L950j9869j8985j2312
14772A3887L9333N6073L0607j0155l3054o914L0338K2918K431r293j2962K0740
14760A43949l354l4971m7078o3597k7279L6576O253O96R6808K8386K3213J2817
14748A72419l2624J0628m097j0442k2526L8461M266n2415j5226o717K0312M001
14736A06040n7064K7447l165l4003p1998M8961O3133L4660K1823j9733j7982J3330
$$ y = [53328, 65782, 80841, 75892, 49618, 28104, 70090, 72621, 126702, 102349, 38399, 69704, 52274, 64375, 111634, 139477, 185732, 184135, 147722, 135109, 121606, 70404, 87677, 102964, 75919, 33775, 121894, 148441, 111934, 156862, 177740, 124884, 37188, 11889, 10280, 18597, 21456, 56903, 82325, 99006, 73396, 101635, 125091, 105670, 61103, 65053, 45184, 26199, 13887, 53220, 109293, 139900, 129745, 96691, 89777, 120115, 143033, 145464, 136171, 123209, 143949, 140595, 105624, 58546, -5051, -32330, 4246, 10499, 11195, 108003, 136389, 159602, 172419, 139795, 150423, 146326, 135884, 113358, 151819, 156085, 103670, 88444, 81727, 102039, 106040, 48976, 76423, 73258, 39255, -32743, 16218, 79351, 114011, 135834, 116101, 98119, 111449]
14724A11449J9655M1473m0272j7617l8406k3140L161K3003K394n1893l769O1055
14712H7093M3401K927Q982j2891k2638k7247N3883k7634l5594j8150P5920K2382
14700A50434K7822o8646R64K6642M2342j5556l0122q0283n6488R1214N7802r762
14688A36363j9385j8233K2450k2016m6522p784m2872L2026K4954l0840M8259J9413
14676I5813J1677J950P58N819J9966k9743j1164K5512L8655l351p5184o2909j3049
14663D750O6892M8097j6568o9991K2657L497K1379o013n5401J8217j5664L044
14651B4896J0142l2694M0006Q888l0978j2091Q7249P7316j4911l8966m8907l2893
14639C7057k6286L0424K2329J7431k5606j582L573L203j2936K2989N9720M6665
$$ y = [111449, 131104, 172577, 132305, 114688, 76282, 53142, 56303, 79306, 81700, 29807, 26038, 87093, 130494, 133421, 142403, 129512, 106874, 79627, 133510, 105876, 70282, 52132, 128052, 150434, 178256, 109610, 110574, 137216, 179558, 164002, 133880, 53597, -2891, 88323, 146125, 136363, 116978, 98745, 121195, 99179, 52657, 44873, 2001, 34027, 58981, 28141, 76400, 95813, 107490, 109440, 110198, 116017, 135983, 106240, 95076, 120588, 159243, 155892, 80708, 17799, 4750, 71642, 119739, 103171, 33180, 55837, 59334, 80713, 74700, 19299, 37516, 21852, 24896, 35038, 2344, 42350, 51238, 20260, 8169, 95418, 172734, 157823, 118857, 69950, 37057, 10771, 41195, 63524, 80955, 55349, 53767, 57340, 60543, 47607, 70596, 130316, 176981]
14627A76981k0210p5612l638k3380L8846Q89p807N3175r055p5994J6819M0642
14615A11656n802j5641P160l2054K5425L7887q568j1106K0712n071j3792M5967
14603A56773L9220l5729q5460n8448p54Q7575L7997J7839k3474o5960k1680n229
14591D2670m0083K4023J12566J4454o7612j5947M0670k9073L984J8614J5424m8464
14579G1226j9138L9665M1377J5576q3746k8883j8305O1944J09546k334J1560K2123
14567B20611j0232k8046P820n7186n9964L7519m96M2779n1933K3978M5533k610
14555A67773L2535K9863n804k7516o8428j1270M182j1264j0828l1495M5680k611
14543A10817L1294K8087m0536j9963K3203N0746o053L1472l6451P39j02351n2962
$$ y = [176981, 156771, 81159, 77521, 54141, 92987, 93876, 86069, 139244, 130189, 54195, 71014, 111656, 105854, 90213, 97373, 65319, 90744, 128631, 120063, 108957, 129669, 124598, 110806, 156773, 195993, 160264, 74804, 16356, 15602, 103177, 141174, 159013, 135539, 69579, 47899, 42670, 2587, 26610, 139176, 153630, 86018, 70071, 110741, 81668, 85652, 104266, 119690, 71226, 52088, 91753, 133130, 148706, 64960, 36077, 17772, 79716, 189262, 186928, 198488, 220611, 210379, 182333, 190153, 132967, 73003, 110522, 110026, 152805, 100872, 124850, 170383, 167773, 200308, 230171, 224367, 196851, 128423, 117153, 121335, 110071, 99243, 67748, 113428, 110817, 142111, 170198, 129662, 109699, 132902, 183648, 177595, 209067, 172616, 173355, 71004, 18042]
14531A8042r241M6940L8104m6606K7234O8340j4088k8573M1015J3128o1906l5391
14519E6998j820M6602L0871k7L901k96q939K3548M7138l00n6475l4034j2176o851
14505H8140n1849M7402N9729M9758K0608k6533q6120n890O7539M0063L428o740
14493A99535n4802p629k8328j932j3561k8800J2811J5634o317L9415l9463m208
14481H2355L8616K2947J1815K8793l8795j3136l837j924k0189j523J9310R735
14469A34167k4913K869J820j1292P3360Q0820n7486m4340n9040J9437K2214L3205
14457A70821m969K1136l4115m9799J7352l1144M5581P1435J801n9498j2023k6180
14445A10398O823j4305J5428L5481k7234P626o837L6925M8459o2465l921N0151
$$ y = [18042, 8801, 55741, 93845, 47239, 74473, 142813, 128725, 100152, 141167, 154295, 92389, 56998, 55178, 101780, 132651, 132624, 136525, 136229, 127290, 150838, 197976, 197676, 141201, 107167, 94991, 88140, 36291, 83693, 143422, 193180, 213788, 187255, 101135, 95245, 162784, 202847, 206275, 199535, 144733, 137104, 108776, 106844, 93283, 64483, 77294, 92928, 86611, 126026, 86563, 82355, 120971, 143918, 155733, 184526, 145731, 132595, 128758, 126834, 106645, 105122, 124432, 134167, 109254, 112123, 113943, 102651, 176011, 256831, 199345, 155005, 95965, 115402, 137616, 170821, 165852, 186988, 152873, 103074, 120426, 89282, 134863, 206298, 208099, 148601, 136578, 110398, 117221, 102916, 118344, 153825, 126591, 134217, 127380, 164305, 212764, 150299, 146378, 196529]
14433A96529j0839m447k0366J1705M519l8295J7090J4678j1481J0363o490k9361
14421A33605P1236K044K1299L696m1886r396K0940l4509n7749j6737J7314K9685
14409A39542L9120N0037k0490p0734j7327K3482J6658l8558o3440j9640L1719
14398G0369M7461j0227p9428j6949P8797M8135L0939m783p2138j442L5796J787
14386A28317j0872k7699J6319N0916K1524l739M577j8064n3862m4732L5759M0296
14374A38740m3331j190j3877L7008Q6867K321o2247m3046J3254M1141j1723O857
14362A50774j3328j9273M0390L4753l8388k1683j2383j9283J5458L8569j6371
14351A39235o4936J6801O4545J2434j8734J6459M2623j7991J6133j9223q063q955
$$ y = [196529, 185690, 181243, 160877, 172582, 177101, 138806, 155896, 170574, 159093, 169456, 162966, 133605, 204841, 206885, 228184, 231880, 189994, 180598, 201538, 167029, 109280, 92543, 109857, 139542, 178662, 228699, 208209, 137475, 120148, 143630, 160288, 121730, 58290, 38650, 70369, 117830, 107603, 28175, 11226, 90023, 138158, 169097, 164314, 92176, 90734, 126530, 128317, 117445, 89746, 106065, 156981, 178505, 174766, 179343, 161279, 107417, 62685, 98444, 138740, 95409, 94219, 80342, 117350, 204217, 206538, 144291, 101245, 114499, 155640, 143917, 150774, 137446, 118173, 158563, 193316, 154928, 133245, 120862, 101579, 117037, 155606, 139235, 74299, 91100, 155645, 168079, 149345, 165804, 208427, 190436, 206569, 187346, 179283, 170328]
14339A70328J144J0190j1155l225J4259L2641m591k6352k4846j4588m1701k1219
14327H0885o558J3354L7252l3945l4226K6345J3978p843o539o535j6136l696M5958
14314A02294R5986J1277k8833k8790O202M1171q601k0753K4639lL0137J8809p302
14301B36233o4518k8868K0586K1187k3062l6999l7412K9057K4904k4376L2181
14290A48913L7032M8486K712q9820n8945l221O0009N1976O822L2962l0406k7014
14278A79506l1852k2183l2829k4419L3441O230j3249J1768M982n273O145j6033
14266I6234O5775K5357k2665p2439k5990K2872M1401L0005L0846p616J0522k6133
14254A68169M5743l1456k6460J4871M5308N1347m8222m8736j2864M2353m368k465
$$ y = [170328, 171472, 181662, 170507, 167282, 181541, 214182, 209591, 183239, 158393, 143805, 102104, 80885, 74327, 87681, 124933, 90988, 56762, 83107, 97085, 89242, 82703, 76168, 60032, 56336, 102294, 198280, 209557, 180724, 151934, 158136, 199307, 190706, 169953, 194592, 194589, 224726, 243535, 236233, 171715, 142847, 163433, 184620, 161558, 124559, 87147, 116204, 141108, 116732, 148913, 185945, 234431, 237143, 147323, 88378, 85157, 145166, 197142, 203964, 236926, 206520, 179506, 147654, 125471, 92642, 68223, 101664, 107894, 94645, 106413, 111395, 106122, 112267, 96234, 162009, 187366, 164701, 92262, 66272, 89144, 130545, 160550, 191396, 183780, 194302, 168169, 213912, 182456, 155996, 170867, 216175, 267522, 219300, 170564, 157700, 200053, 195685, 193220]
14242A93220p423j3478m6448M081P2590J1282M2532o242n1862J071q252l6466
14230A54605k031q702k968N7439O074j4714q135o6974O125P272J9776J267l3276
14217A15758M3024l0979M7763l816n5955k1382M5775k5717l4150J7421J6127O8133
14205A82002L0472j2678n9881N702L9739r220m4549r014N799J0265L8036L6068
14193B12741o1459m0362K7742J1779j943N6985p304L1383O460N775p899k4281
14181B09617k1234J1997k9719p257L19J0524K7383k4990J203k5774l477K3644
14169A72236J6473J8508J0307J5191n0268j7536k17K3686K3838p801k0191O667
14157A90893k2199M4937J6993Q279m835K748Q037k5468J3754L098k0599j5472
$$ y = [193220, 185797, 172319, 125871, 129952, 202542, 213824, 256356, 250114, 198252, 199323, 191071, 154605, 152574, 143872, 140904, 198343, 204417, 189703, 181568, 114594, 120719, 127991, 147767, 149034, 115758, 158782, 127803, 175566, 171750, 115795, 94413, 140188, 114471, 80321, 97742, 113869, 182002, 212474, 199796, 139915, 145617, 185356, 176136, 131587, 122573, 128372, 138637, 176673, 212741, 151282, 110920, 138662, 150441, 148498, 205483, 198179, 229562, 236022, 241797, 233898, 209617, 188383, 200380, 170661, 163404, 163723, 174247, 201630, 176640, 177843, 152069, 148592, 172236, 188709, 207217, 217524, 232715, 182447, 164911, 164694, 188380, 212218, 204417, 184226, 190893, 168694, 213631, 230624, 238903, 234068, 236816, 244853, 219385, 233139, 236237, 215638, 200166]
14145B00166p662p064P0620k63j03227k9547J7288K5682M8450K4415l3805l232
14133B01821j2527O0464r450o1694n0773N1727k4286N0885m2075k7199M2017j0046
14121A68864j2559j1032P9669j4189k9479l4404J079L8099K6414K1951k8477k0339
14109A85597P459l520k3818n7414l5931K3383L6128L9990K2945j3212K9477K1209
14097B32293K2780J4086K7815P084m1233J3596m489j4082k3709k3854j7068j247
14085A91972m115k0143m284p2319k4283L2804L506k7152J7517j8054M7046K9061
14073A51556N4163K8446l0548K0628k3960m9526l807l0758N0560O5041m5576m4523
14061A41696m513n8891j8993O7468J9992P752m1408O6130K4086m512k1045l2297
$$ y = [200166, 192504, 185440, 256060, 255797, 152570, 123023, 140311, 165993, 214443, 238858, 205053, 201821, 189294, 249758, 240308, 178614, 127841, 179568, 155282, 206167, 164092, 136893, 178910, 168864, 156305, 145273, 224942, 210753, 181274, 146870, 147949, 186048, 212462, 234413, 205936, 185597, 193056, 189536, 165718, 108304, 72373, 95756, 131884, 171874, 194819, 181607, 211084, 232293, 255073, 269159, 296974, 304058, 262825, 276421, 271932, 257850, 234141, 210287, 193219, 191972, 187857, 167714, 163430, 91111, 66828, 99632, 103138, 75986, 93503, 75449, 122495, 151556, 205719, 234165, 203617, 224245, 200285, 150759, 146952, 116194, 166754, 231795, 186219, 141696, 137183, 78292, 59299, 126767, 146759, 154511, 113103, 179233, 203319, 198807, 177762, 145465]
14049A45465J9194K4057o172R170J4085o6909l9046P0009K1818p158J2629J3317
14037B10459j6892k8746L0019k1866K0456l056Q7770r789J6639K0425k1140L6652
14025C20931Q814k0295J2343m660N108k5456m2827k1124j3170m3254J6519O3941
14013B56870l3374r127L5717J8269j4l6873k8457k7633n384M7011J7410N1099
14001B85514n1374k292j8680J8422o16l596j5901l26L7129q252l2055j0794L9506
13988B36685k5439K2518J9584L324q859k7429r6586j0956K7706K7056O2862J7733
13976B48199Q072l4564K7653k6244l2712j9425L6601P433o8256j1770M4856K6145
13964B05988M5084k1358J5189L0167l4325M309K4062r1506R020n998m8090N7093
$$ y = [145465, 164659, 188716, 182544, 191714, 205799, 138890, 99844, 169853, 191671, 184513, 197142, 210459, 193567, 164821, 194840, 172974, 193430, 190374, 278144, 268355, 284994, 305419, 284279, 320931, 329745, 309450, 321793, 317133, 322241, 296785, 253958, 232834, 219664, 176410, 192929, 256870, 223496, 214369, 250086, 268355, 268341, 231468, 203011, 175378, 169994, 217005, 234415, 285514, 234140, 231848, 213168, 231590, 230974, 227378, 211477, 211151, 248280, 240028, 207973, 197179, 236685, 211246, 233764, 253348, 256672, 247813, 220384, 123798, 112842, 140548, 167604, 230466, 248199, 256271, 221707, 249360, 223116, 190404, 170979, 207580, 215013, 146757, 134987, 179843, 205988, 251072, 229714, 244903, 275070, 240745, 245054, 269116, 177610, 186630, 180632, 132542, 189635]
13952A89635O078l2476J0254M0895n156R449k7116o7173K8914O0722j2842j6674
13940A84510l0694n2377N052R996L8436N315n7899p043P7211P3391n8200L5335
13928B23033k8332l2522K1174L4260m627o0037P5268N0469J2262M530k4428J6606
13916B87656j7967j7117K1181r780K6427j5428k9684k7748n1707K2779J4901J886
13904B05399j4026m9533J0412L9532J07808Q3290j6230n3636q1597j917n227N724
13892B29999N8790N5720J5152k5644r190K433m3244l7725p3860p1233L1930L8861
13880A71989n135K0401P2671K5273j8637k2871k9810l9722P127J3582Q213k8745
13868A74336J2120N830N895O8205O2975J5490k5368l4321j5730O2022k3155l0680
$$ y = [189635, 195713, 163237, 173491, 214386, 209230, 218679, 191563, 124390, 153304, 214026, 201184, 184510, 153816, 101439, 106491, 116487, 154923, 160238, 102339, 95296, 172507, 245898, 187698, 223033, 194701, 162179, 183353, 217613, 212986, 152949, 228217, 278686, 290948, 295478, 271050, 287656, 269689, 252572, 273753, 263973, 290400, 274972, 245288, 217540, 165833, 188612, 203513, 205399, 191373, 141840, 152252, 191784, 299592, 382882, 366652, 313016, 231419, 229502, 224275, 229999, 288789, 344509, 359661, 334017, 324827, 327260, 284016, 246291, 172431, 101198, 133128, 171989, 166854, 187255, 259926, 285199, 266562, 243691, 213881, 174159, 181286, 194868, 203081, 174336, 186456, 192286, 198181, 266386, 329361, 344851, 319483, 285162, 269432, 331454, 308299, 277619]
13856B77619o22o0650L08j2016M924n3270o7465J3121N1306L3191J1142K8533
13844B26121P4117n1091l4605j9979K4950O5429L6748K682l5167l5972m7358l0137
13832A75738k0974M6448L8009j582M1476J2546J9941j8317n0881P519R035m4550
13820B14408j16J7512R110L7803Q610K0344r683n1817L302p388l8999M318j1134
13807A96270k5896n252K4139j7410K1554k8752M43O5484K6887L5926K3699M1098
13795C58190m2626o2287j5444J6802K3725K4146j9496m1736J5154L5637N7309
13784C49374J8118j340K716j4850o4084q779o369m036l2802m8959o5750L0429
13772A53668M8311L0226J0591K5775j6165k0600j0507J8674K207o1521j0637O3212
$$ y = [277619, 276997, 216347, 216655, 204639, 209563, 156293, 88828, 101949, 153255, 186446, 197588, 226121, 300238, 249147, 214542, 194563, 219513, 284942, 321690, 324372, 289205, 253233, 205875, 175738, 154764, 201212, 239221, 237639, 279115, 291661, 311602, 293285, 242404, 249923, 258958, 214408, 214292, 231804, 240914, 278717, 287327, 307671, 297988, 246171, 249473, 242085, 203086, 207404, 196270, 170374, 165122, 189261, 171851, 193405, 164653, 165096, 230580, 257467, 293393, 317092, 358190, 315564, 253277, 237833, 254635, 278360, 302506, 283010, 241274, 256428, 292065, 349374, 367492, 366152, 368868, 354018, 289934, 281155, 274786, 270750, 237948, 188989, 123239, 153668, 201979, 232205, 242796, 268571, 252406, 231806, 221299, 239973, 242180, 180659, 170022, 233234]
13760B33234j0525q322l127K2304K5745M7515K9487o7764k7290j3746r390k0169
13748A97952K3224J6689N7642m855m1504m817K6156O6235O317m6143j5179j1931
13736B69786K9366j330n6019q2768L3442O2839O2591J8753n6706n6306k4134J6869
13724B16383M8138N1735O43n3131m5848l337M3547m5790l1449L2332K1547O1856
13712B96626O6047k2114k1404k1332l638m7216k477j8748R897N8701O0037J3339
13700C67718Q678l0857p0966m2787Q504r68J4843J7626M9924Q293j2324l1660
13688B86024o345R833M227q105J7158J9397l878m442M045j7700m0478r06M6754
13675C05584L1463L5522j1418m6142p3314R676J6230N9850M847n0874m2604J0091
$$ y = [233234, 222709, 214387, 211260, 233564, 259309, 306824, 336311, 268547, 241257, 227511, 218121, 197952, 221176, 237865, 295507, 290652, 249148, 244331, 270487, 336722, 343039, 296896, 281717, 269786, 299152, 297822, 241803, 159035, 192477, 255316, 317907, 336660, 279954, 223648, 199514, 216383, 264521, 316256, 316899, 263768, 217920, 214583, 258130, 212340, 180891, 213223, 234770, 296626, 362673, 340559, 319155, 297823, 294185, 246969, 244492, 225744, 235641, 294342, 354379, 367718, 376396, 345539, 274573, 231786, 240290, 239322, 254165, 271791, 321715, 330008, 317684, 286024, 279679, 289512, 293739, 285634, 302792, 322189, 318311, 313869, 317914, 300214, 259736, 258830, 305584, 337047, 372569, 361151, 315009, 241695, 251371, 267601, 327451, 332298, 281424, 238820, 248911]
13663B48911N6144J7403l9878J8931K1635K940j203K4786J6809n0982r351J3495
13651C19640l713M2708L9110j0552j2965J6877k1208n4298r1072J5774N2035R078
13639C01414L1913L9769o5994K7194n417j9375J6722k3529K7330j2892j810l6
13627C15289J7539M9380m7496j1047Q1014M4146l5112j03p1164m1902K990L1951
13615C35485j8344k0936k7426Q208m4099L9569K8335l0975M2591j7391j4487J0455
13603B90985M778l3312l3313M2149L0372j7238J0212K7113L6349K3008L194j8588
13591C65709q181j7083j6418K1815j284K5140J8627m286k4786k8465K4646M3298
13579C98732L8224o0985j3881l259J381k0312L1693L2563m0993K4467K6409J2757
$$ y = [248911, 305055, 322458, 282580, 301511, 323146, 326086, 324883, 349669, 366478, 315496, 306145, 319640, 315927, 358635, 397745, 387193, 374228, 391105, 369897, 315599, 224527, 240301, 292336, 301414, 333327, 373096, 307102, 334296, 328879, 309504, 326226, 302697, 330027, 317135, 315325, 315289, 332828, 382208, 334712, 323665, 404679, 448825, 413713, 413610, 342446, 300544, 303534, 335485, 317141, 296205, 268779, 276987, 232888, 272457, 300792, 269817, 312408, 295017, 280530, 290985, 295763, 262451, 229138, 271287, 301659, 284421, 294633, 321746, 358095, 381103, 384297, 365709, 357528, 340445, 324027, 345842, 344558, 369698, 388325, 384039, 359253, 330788, 355434, 398732, 436956, 375971, 362090, 358831, 360212, 339900, 371593, 404156, 363163, 387630, 414039, 426796]
13567D26796L5689m770J3444m2959k4790m370l0257n8361r657L9187M6537K95
13555C86784m906j1443j7251J3306J0808m06L0670J3716K0899o127j6789k4643
13543C94618k3065M081L6122n3854p2002j4714M3774O5847M8751P878p0466n5835
13531C11135k4204k5106P131K9274J0159K8221Q8692J6676K5665p8256p3952P343
13519C22778L1884P2061K6879l0470n348K0128L8007k5387k0914j6131j854Q049
13507D19682p1533J5136K6137J2737K3028K4205N4247K6129n5016n7090N7207
13496D74869M2053l9453n6008l9489l1992m4340L0665P2415l4322k3475K3719
13485C74642j0789j635k250n015L1814N7847K7938N4726j8953j25670m2777j3363
$$ y = [426796, 462485, 457715, 471159, 428200, 403410, 399040, 368783, 310422, 300765, 339952, 386489, 386784, 381878, 370435, 353184, 366490, 377298, 376892, 407562, 421278, 442177, 436050, 419261, 394618, 371553, 375634, 411756, 357902, 285900, 271186, 314960, 380807, 429558, 437436, 366970, 311135, 286931, 261825, 268956, 298230, 308389, 336610, 425302, 441978, 467643, 389387, 315435, 322778, 354662, 426723, 453602, 423132, 417784, 437912, 475919, 450532, 429618, 413487, 411633, 419682, 348149, 363285, 389422, 402159, 425187, 449392, 503639, 529768, 474752, 417662, 474869, 516922, 477469, 421461, 381972, 349980, 305640, 336305, 408720, 374398, 350923, 374642, 363853, 362218, 359968, 354953, 386767, 444614, 472552, 527278, 508325, 382655, 339878, 326515]
13473C26515K8830K3055j6430J5107n575K0196j7160l098q384k7773K232J7657
13461C55172K8690O2858n075k5360K4013J4929m0795n1198n6419l5324K2522J3499
13449C07512K6192K5286O660K3778p065k5374J324M1391j9437j4586j041j3338
13437C51302O5015J8701M85M7142M3286j3849j3024R968l6091l1398p897J0427
13425D44067M1750K4601l2418m5680j4798M222P2865m2598q8361N588N3624L9759
13413D62621k1397N1280k3687o4417J502k5689R854O131M9401P1532L8364J9321
13401E74816o3099m9081m1758j5676K7401j3282n748l958R826o084q205K6708
13389D31860J2894K5528J1666n0729l9298q87J7865L2616R450K6967l0526O1523
$$ y = [326515, 355345, 378400, 361970, 377077, 371502, 391698, 374538, 371440, 363056, 335283, 337515, 355172, 383862, 446720, 441645, 416285, 440298, 455227, 414432, 363234, 306815, 271491, 294013, 307512, 333704, 358990, 365650, 389428, 382363, 356989, 358313, 399704, 380267, 365681, 364640, 351302, 416317, 435018, 435503, 482645, 525931, 512082, 499058, 509026, 472935, 441537, 433640, 444067, 485817, 510418, 478000, 432320, 417522, 421744, 494609, 452011, 363650, 369238, 422862, 462621, 441224, 492504, 468817, 404400, 405902, 380213, 390067, 396198, 445599, 517131, 555495, 574816, 511717, 462636, 420878, 405202, 432603, 419321, 413573, 409615, 419441, 413357, 405152, 431860, 444754, 470282, 481948, 431219, 391921, 391034, 408899, 441515, 450965, 477932, 447406, 508929]
13377E08929N9939n1450q3512j8277j441L90J0635j8925J3875M056l2324Q674
13365D00569N2539L5760L8395J5824J4004J0345k0554l6859l7111k3238n697j403
13353D42574k2067M8491J8509m2672K8971K3426l0801j4647J6105l9614q168L0849
13341D50956K7776o945K8265K8481J1917k2796j9026L1237M9990r92K2603n8639
13329E42827k461J0004k2146K0215Q879n3829k4507l0194K4352M6035m6073l2002
13317D41100K4450K2328L7321L3395L3362l5677l9399k3259k966K1894K8743k9607
13305E11685m8013l1554R3063O0920k6518j2945k5960j6612J779M0564J1487j6459
13293E41437l9630O3611P952p996o845r341N070K86K2658r183L395l490K0433
$$ y = [508929, 568868, 517418, 433906, 415629, 414188, 414578, 425213, 406288, 420163, 424219, 391895, 400569, 453108, 488868, 527263, 543087, 557091, 567436, 546882, 510023, 472912, 449674, 443977, 442574, 420507, 468998, 487507, 444835, 473806, 497232, 466431, 451784, 467889, 428275, 420107, 450956, 478732, 471787, 500052, 528533, 540450, 517654, 498628, 529865, 579855, 578863, 601466, 542827, 540366, 550370, 528224, 548439, 557318, 503489, 478982, 448788, 473140, 519175, 473102, 441100, 465550, 487878, 525199, 558594, 591956, 556279, 516880, 493621, 490655, 512549, 541292, 511685, 463672, 432118, 525181, 586101, 559583, 546638, 520678, 504066, 505845, 546409, 557896, 541437, 501807, 565418, 573370, 565374, 558529, 549188, 554258, 554544, 577202, 568019, 571414, 567924, 588357]
13280E88357j2515J1953m2116O4344K4119p7108k3133k7381M570k0663Q502J6619
13268E15548N96L8766J7418q6026r592N1675j0158M0804N7799K6463j0276J7603
13256F50620j0398O78J7812K995O1885l3421m5038l7202L359M6269K0467j0501
13244F67525l2205m0311p935J8064l8679M185P3838j6519K5344J7278j3646k8387
13232F28552K0493J266j8571j951P898J7374J0968N9262K1312n3427o1880N0996
13220F82292l2303k3499M1344K9602l4179l6967k5771O9086L6842n1101M3752
13209F99098O4624l780j4581K5161k5127o5586L2243Q8879M5827m306J9285K9384
13197H91121L8507L9696N1447O9900J16416J14493J93736J83809K00094J73812
$$ y = [588357, 575842, 587795, 545679, 610023, 634142, 557034, 533901, 506520, 511090, 490427, 498929, 515548, 516144, 554910, 572328, 486302, 476710, 528385, 518227, 559031, 616830, 643293, 633017, 650620, 640222, 640900, 658712, 661707, 723592, 690171, 645133, 607931, 611290, 657559, 678026, 667525, 635320, 595009, 587074, 605138, 566459, 570644, 644482, 627963, 653307, 670585, 656939, 628552, 649045, 650311, 631740, 629789, 637687, 655061, 666029, 725291, 746603, 693176, 631296, 682292, 649989, 626490, 667834, 697436, 663257, 626290, 600519, 669605, 706447, 655346, 699098, 763722, 759942, 745361, 770522, 745395, 679809, 712052, 800931, 846758, 842452, 861737, 891121, 929628, 969324, 1020771, 1090671, 1207087, 1321580, 1515316, 1699125, 1899219, 2073031]
13187B073031J30989M346k8303j41215k27966k22618j10676j78744r7689O628
13177A207783m0730K9529p964M6199J42547P9112J5570J3162J0284O0135J14049
13166A669676O2997J8689o1380P8923O3314Q5474J40437J27353O6223L4485P1735
13155B357926k7619j08103j14310j68158j50043m9332j4116j6802o8425m4238
13145A596780K6312J5876o3133o4068l3099l3737p0673r3927r1623o9232K7828
13134A147304P7112J23698J19329J03181Q8145J78424J68663J52291L9609k3162
13124B174594j05071k19993k26335k41224j42901j29911j26510j24118n1005r426
13114G98100J6641p532n8330j6337L8832K5712N490q075m6352m4479L3952j948
$$ y = [2073031, 2204020, 2208366, 2180063, 2038848, 1810882, 1588264, 1477588, 1298844, 1201155, 1207783, 1167053, 1196582, 1188618, 1234817, 1377364, 1456476, 1472046, 1485208, 1495492, 1555627, 1669676, 1732673, 1751362, 1689982, 1768905, 1832219, 1917693, 2058130, 2185483, 2251706, 2286191, 2357926, 2330307, 2222204, 2107894, 1939736, 1789693, 1740361, 1726245, 1709443, 1641018, 1596780, 1623092, 1638968, 1575835, 1511767, 1478668, 1444931, 1374258, 1280331, 1188708, 1119476, 1147304, 1224416, 1348114, 1467443, 1570624, 1658769, 1837193, 2005856, 2158147, 2197756, 2174594, 2069523, 1849530, 1623195, 1381971, 1239070, 1109159, 982649, 858531, 807526, 798100, 814741, 807209, 748879, 732542, 771374, 797086, 802576, 794501, 748149, 703670, 737622, 735674]
13102G35674k4043L0635j4105m6446n144J0162M7019K5286L2633K0084p4086k2015
13090G15654M2892l723Q622j3029M3397K8686n3442k424M9901r270J3099L755
13078H24118j7040J6600l8748m8077L448Q8837M8451k4414L879R910m540k1724
13066H40700r965k3774L27Q387J5317p62P283r90m9141K2508M4395K4762R05j3764
13052H66188k4689l6638L982P8958L3019l6923n3792J2676O7150o751m456m660
13040H94064R961k5274r9784m642R6372L9611j4095q1779m8196q858L4377O7714
13028H59471M0367m0338m1957L394J5869L2822P400q97Q5479p381l6224K2332
13016I40337N9856n71l0046K0449M7599M9252k5032n3938j0303K355m6580j358
$$ y = [735674, 711631, 742266, 728161, 681715, 676571, 686733, 733752, 759038, 791671, 811755, 737669, 715654, 758546, 754823, 763445, 750416, 793813, 822499, 769057, 766633, 816534, 807264, 820363, 824118, 807078, 823678, 784930, 736853, 740301, 829138, 877589, 853175, 857054, 866964, 862424, 840700, 830735, 806961, 807288, 815675, 830992, 830230, 837513, 836523, 787382, 809890, 854285, 879047, 879952, 866188, 841499, 804861, 808843, 887801, 920820, 883897, 830105, 842781, 909931, 903180, 898724, 894064, 904025, 878751, 778967, 774325, 870697, 910308, 896213, 814434, 766238, 757380, 791757, 859471, 899838, 859500, 817543, 820937, 836806, 869628, 877028, 876131, 961610, 954229, 918005, 940337, 1000193, 999622, 969576, 990025, 1037624, 1086876, 1061844, 1007906, 997603, 999958, 953378, 952020]
13004I52020N2771N6365K1300m7774m3523M5100O4510k9028o534k4644L4972O3583
12992A139118j1872o0506p5601l5572O5681N6831j2936J3771O6629L4863k0237
12981A160169p403k5493P321k358k089m6341N0207L0594m222l3491n1257N908
12969A081545M1564l5227R118M5575L6434K8438J2981n717k5099K2805j7086K5583
12957A220914o337k3893J2753j3493j2406N4229K6618l1730J3276L9340L4639
12946A313910j1131m4512o5790j7180k9393L6616J8342l204o675o2155l9740P9133
12934A168221K4680m8926M4902O2343M8003M444L8557J1031k7011j4593l8288
12923A273363o651J788j5035m6385J6935M7766j3992j8254J7225M4913K4764o797
$$ y = [952020, 1004791, 1061156, 1082456, 1034682, 991159, 1036259, 1100769, 1071741, 1065207, 1040563, 1075535, 1139118, 1127246, 1066740, 991139, 955567, 1021248, 1078079, 1065143, 1078914, 1145543, 1180406, 1160169, 1152766, 1127273, 1134594, 1132236, 1130147, 1083806, 1134013, 1164607, 1160385, 1126894, 1075637, 1081545, 1123109, 1087882, 1097000, 1142575, 1179009, 1207447, 1220428, 1214711, 1189612, 1212417, 1195331, 1220914, 1214577, 1190684, 1203437, 1189944, 1177538, 1231767, 1258385, 1226655, 1239931, 1279271, 1313910, 1302779, 1258267, 1192477, 1175297, 1145904, 1182520, 1200862, 1197658, 1190983, 1128828, 1089088, 1168221, 1192901, 1143975, 1188877, 1251220, 1299223, 1303667, 1342224, 1353255, 1326244, 1311651, 1273363, 1266712, 1268500, 1253465, 1207080, 1224015, 1271781, 1257789, 1239535, 1256760, 1301673, 1326437, 1319640]
12911A319640o4557n1936L4009p788L0279j2072o9994j1809K0375m73O5245J10100
12899A361019L6375J0040K8282N0443k1733n7710m0414n6618Q666O5282M6241
12888A429873O889M0708R609r829M5713L5090P906M0095k4073j071l2061m3369
12876A505480O0767L8695K8687J8233L3868J7203O7453O7082O5485P8092J0445
12865A991490J600n697M7944J46284Q0329O534K5077P1839J17495R4251P6049
12854B653195J6660K6031o8850m3649n0277q7461o3263m8988j0974P4j3198M0523
12842B349823K8156j7813l6307j3439L9197K4655L9360K7161J0646j9940M3117
12831B474616K1392P3277P4355L6802M3051N8565L0993N4107M9334L3197K988
$$ y = [1319640, 1255083, 1203147, 1237156, 1229368, 1259647, 1247575, 1177581, 1165772, 1186147, 1185674, 1250919, 1361019, 1397394, 1407434, 1435716, 1486159, 1464426, 1406716, 1366302, 1309684, 1318350, 1383632, 1429873, 1436762, 1477470, 1487079, 1477250, 1522963, 1558053, 1565959, 1606054, 1581981, 1580910, 1548849, 1505480, 1566247, 1604942, 1633629, 1651862, 1685730, 1702933, 1770386, 1837468, 1902953, 1981045, 1991490, 1993090, 1987393, 2035337, 2181621, 2261950, 2268484, 2293561, 2365400, 2482895, 2577146, 2653195, 2669855, 2695886, 2627036, 2583387, 2533110, 2445649, 2382386, 2333398, 2322424, 2322498, 2309300, 2349823, 2377979, 2360166, 2323859, 2310420, 2349617, 2374272, 2413632, 2440793, 2451439, 2431499, 2474616, 2496008, 2569285, 2643640, 2680442, 2723493, 2782058, 2813051, 2867158, 2916492, 2949689, 2952677]
12820B952677R025J2071K7912K7966P0992O2006J3921l6501m1080O6733Q2940
12809C248662Q8604J4623Q6804J07892O8846J01421J13142R9097R0186L6703M1309
12798D097289O5178P0477N8389L7153M8654J11080O5711P0051J16490P6655L2979
12787D850106L3704J14184J43126J20473J12974K03011J59792J89447K44178K36460
12777F407455K19220K56067K18678K60048K37191K27579K93159L41675L92345
12768H853417M19584N15559N13888N78368O93309O94812Q58723J046864J214746
12759A5389270J454608J708070J962845K166075K391261K726766L062363L531186
12751C4392444L935730M388619N089418O208715P715083R835874J2695409J6309511
$$ y = [2952677, 2961702, 2973773, 3001685, 3029651, 3100643, 3162649, 3176570, 3140069, 3098989, 3165722, 3248662, 3337266, 3351889, 3438693, 3546585, 3615431, 3716852, 3829994, 3929091, 4019277, 4055980, 4097289, 4162467, 4232944, 4291333, 4328486, 4377140, 4488220, 4553931, 4623982, 4740472, 4817127, 4850106, 4883810, 4997994, 5141120, 5261593, 5374567, 5577578, 5737370, 5926817, 6170995, 6407455, 6626675, 6882742, 7101420, 7361468, 7598659, 7826238, 8119397, 8461072, 8853417, 9273001, 9788560, 10302448, 10880816, 11574125, 12268937, 13127660, 14174524, 15389270, 16843878, 18551948, 20514793, 22680868, 25072129, 27798895, 30861258, 34392444, 38328174, 42716793, 47806211, 54014926, 61730009, 71565883, 84261292, 100570803]
12743A00570803K0748874K5871328L0915735L4041059L4169899L1280578K3717831
12736C01316107O871597j8017657l8148063m4241772l9186153k9900115k0408857
12729A18285087j2244018n683605o04334L538757P086197J0077432J2472143J4309609
12721A47237268J5433629J5367746J3642626J0447030O546796L621733L077782
12714B15374610N030268Q733892J3071737J7382756K0411748K0528452J7001404
12707C17534867R432279k535250j6892952k7570400l0232135k6289881j9645612
12700B03800916j2837967o946622k615733k18476M27134l18717k281801n708794
12692A73299940r992533j3300601j4091121j2281609q776319m532895o3150M695716
$$ y = [100570803, 121319677, 147191005, 178106740, 212147799, 246317698, 277598276, 301316107, 308187704, 290170047, 252021984, 207780212, 168594059, 138693944, 118285087, 106041069, 100357464, 99753130, 103291887, 110378084, 120455516, 132927659, 147237268, 162670897, 178038643, 191681269, 202128299, 208675095, 212296828, 215374610, 220404878, 229138770, 242210507, 259593263, 280005011, 300533463, 317534867, 326967146, 324431896, 307538944, 279968544, 249736409, 223446528, 203800916, 190962949, 184016327, 181400594, 181182118, 181609252, 181290535, 179008734, 173299940, 163307407, 150006806, 135915685, 123634076, 114857757, 110324862, 110261712, 114957428]
12684A14957428J0097310J5979448K2259699K8318817L2931416L4207003L0907456
12677B89658577K2227603O835635j5827691l9648677n2735070n1074966m0918523
12670A18516888k9982257k1331957j5262513j0995981p940480n741395m288144
12663B2974161l231643k493203j993162j713085j570092j431951j362639j154196
12655H024190j009441q28016p39065n95037m49273l59255k71135k48431k38287
12646C286250k65798k80273j58622j63784k25584j79546j01387j24142j38861
12637A648253j07752r3377j12530p1419M8940o5091l4674k4343m3549j2561k6229
12626A105668j2462N109j327O059m5403r4972o3492n8665j8417j0625L3052M8311
$$ y = [114957428, 125054738, 141034186, 163293885, 191612702, 224544118, 258751121, 289658577, 311886180, 318721815, 302894124, 263245447, 210510377, 159435411, 118516888, 88534631, 67202674, 51940161, 40944180, 33003700, 27262305, 22974161, 19742518, 17249315, 15256153, 13543068, 11972976, 10541025, 9178386, 8024190, 7014749, 6186733, 5447668, 4852631, 4403358, 4044103, 3772968, 3524537, 3286250, 3020452, 2740179, 2581557, 2417773, 2192189, 2012643, 1911256, 1787114, 1648253, 1540501, 1447124, 1334594, 1263175, 1312115, 1247024, 1212350, 1188007, 1144458, 1131897, 1105668, 1093206, 1098315, 1096988, 1103047, 1057644, 962672, 899180, 840515, 822098, 811473, 844525, 892836]
12614H92836k8806k4542j1081o355m864o7709R893N5492O4353J4572k5971K0205
12602H88023l9657l2742L6727Q4428R4908Q9172M9151K3111k820m3128n4654K7512
12590A120031J37308J18740J29767J22102J74909R8785j6684j67440j25321M7385
12580A639582L9990n2988p1060m655O6009M1385k7937O4070J07336R6512J07055
12569B005299O5702K5025J0331J1169J14798J76526J33369J27726J78469R7600
12559B946014k2321r1715j19731j37515j16265m0189J0297n9697o441O7912K01656
12548B632005K17698K08957J44066K48478L02924P3497k58934m23008l65402k43612
12538B536669o9330r3759j27239j38343p7679p4361p7175j1527o972J755L9994
$$ y = [892836, 864030, 839488, 828407, 822052, 817188, 749479, 759372, 814864, 879217, 893789, 867818, 888023, 848366, 815624, 852351, 936779, 1031687, 1120859, 1170010, 1193121, 1190301, 1147173, 1092519, 1120031, 1257339, 1376079, 1505846, 1627948, 1802857, 1901642, 1884958, 1717518, 1592197, 1639582, 1679572, 1626584, 1555524, 1550869, 1616878, 1658263, 1630326, 1694396, 1801732, 1898244, 2005299, 2071001, 2096026, 2106357, 2117526, 2232324, 2408850, 2542219, 2669945, 2848414, 2946014, 2923693, 2831978, 2712247, 2574732, 2458467, 2418278, 2428575, 2368878, 2362437, 2430349, 2632005, 2849703, 3058660, 3202726, 3451204, 3754128, 3827625, 3568691, 3145683, 2780281, 2536669, 2467339, 2373580, 2246341, 2107998, 2030319, 1955958, 1878783, 1867256, 1860284, 1862039, 1902033]
12527A902033l8840j25780j30016n4581R9492J4887R883L0240L9501n8754o2064
12516A626001k7565p9527o4595Q395M3138P3422J10673N7805N2355O9001L4903
12505A904006J590m6482K0878Q4658J03026j65094k44458k03242j40330p0434
12495A244118p1295k3979m543N448j3669L638j5614p8874q2188K7594J8793n934
12483A003495n117Q6938M6698l6675P1081p76j8197r5969K8574L9319J8111J040
12471A138522n0087o3989l1139K9113K5467k062J4061j8441K1146O8778O0362
12460A191731O3868l1381k1775k1799l2661j8090M1051M0814L2427j6056k8415
12449A199714N644N638l8948k6484J9037L5867o435l6684M6795R551K640j4921
$$ y = [1902033, 1863193, 1737413, 1607397, 1552816, 1652308, 1667195, 1677078, 1707318, 1746819, 1688065, 1626001, 1598436, 1518909, 1454314, 1462709, 1505847, 1579269, 1689942, 1747747, 1800102, 1869103, 1904006, 1905596, 1859114, 1879992, 1964650, 2067676, 1902582, 1658124, 1454882, 1314552, 1244118, 1172823, 1148844, 1144301, 1149749, 1136080, 1139718, 1124104, 1045230, 963042, 990636, 1009429, 1003495, 998378, 1085316, 1132014, 1095339, 1166420, 1165644, 1147447, 1051478, 1080052, 1119371, 1137482, 1138522, 1088435, 1024446, 993307, 1022420, 1047887, 1045825, 1059886, 1041445, 1062591, 1131369, 1191731, 1255599, 1224218, 1202443, 1180644, 1147983, 1129893, 1170944, 1211758, 1244185, 1228129, 1199714, 1205358, 1210996, 1172048, 1145564, 1164601, 1200468, 1194033, 1157349, 1204144, 1213695, 1216335, 1201414]
12437A201414K1456P2436K1786p3765k6181L6790M3301l3041J3830L4173J9822
12426A332021r83L3064J2425k6857m3314l2859P7597M0636K3033m3776J0528P295
12414A388810J2637M7807L9687m8369k0867k3264r385j428L8430p126n6518k3113
12402A337301L4359L1659N519K3553M3655k7788o373J4176j1842o317M2141J1693
12390A491736P9711L7023k686k4982N88N966P8204n388m258o722O7872L2549o9316
12377A680297o2897L2933K1606K3792J2940k2377q550k1848M7739J1050L0216
12366A744901L4982N1917q007J889N5624K2807m6074j6434N7495K0375j5196O6237
12354A970516K0690j1476k4607j2474m423P319N6757M8829L3595P962L0576L6756
$$ y = [1201414, 1222870, 1295306, 1317092, 1243327, 1217146, 1253936, 1297237, 1264196, 1278026, 1312199, 1332021, 1331038, 1364102, 1376527, 1349670, 1306356, 1273497, 1351094, 1391730, 1414763, 1370987, 1381515, 1388810, 1401447, 1449254, 1488941, 1440572, 1419705, 1396441, 1387056, 1385628, 1424058, 1416932, 1360414, 1337301, 1371660, 1403319, 1408838, 1432391, 1476046, 1448258, 1441885, 1456061, 1444219, 1437902, 1480043, 1491736, 1571447, 1608470, 1605784, 1580802, 1581390, 1587356, 1665560, 1660172, 1655914, 1649192, 1717064, 1749613, 1680297, 1617400, 1650333, 1671939, 1695731, 1708671, 1686294, 1677744, 1655896, 1703635, 1714685, 1744901, 1779883, 1831800, 1823793, 1825682, 1881306, 1904113, 1858039, 1841605, 1899100, 1919475, 1904279, 1970516, 1991206, 1979730, 1955123, 1942649, 1938226, 1945545, 2002302, 2051131, 2084726, 2092688, 2123264, 2160020]
12342B160020o157l935K7067M4729K2018O8484K9130j5194l6212r092J612L1311
12330B313781O6055K3374O9721m544J9031M5941O0059j1112K4643L0795J5704
12319B653448K5588L3894m3015J002M8154P0328m1076J0228O3440L3361K6354
12308B881706n804R658K6235K6073K1342N254L7453O1065M4918K9615j461M0980
12296C177034L8437L9639M9450N9345N0189R2332J23613O0630Q2075J24469J72377
12285D069590J66501K54116J80113J11058J43310J88243M1458j05388k19237j79599
12275D650165j25203n2515k7601q613j3891M0375R6285J06127M9787J07552R1265
12264D913733R9019J41263Q4274M1603Q5946J01627N6327P6679J34089J10933
$$ y = [2160020, 2153863, 2149928, 2176995, 2221724, 2243742, 2312226, 2341356, 2326162, 2289950, 2280858, 2282470, 2313781, 2379836, 2403210, 2472931, 2468387, 2487418, 2533359, 2593418, 2582306, 2606949, 2637744, 2653448, 2679036, 2712930, 2669915, 2670917, 2719071, 2789399, 2748323, 2758551, 2821991, 2855352, 2881706, 2875902, 2885560, 2911795, 2937868, 2959210, 2964464, 3001917, 3062982, 3107900, 3137515, 3136054, 3177034, 3215471, 3255110, 3304560, 3363905, 3414094, 3506426, 3630039, 3690669, 3772744, 3897213, 4069590, 4236091, 4490207, 4670320, 4781378, 4924688, 5112931, 5154389, 5049001, 4829764, 4650165, 4524962, 4472447, 4444846, 4436233, 4422342, 4462717, 4559002, 4665129, 4714916, 4822468, 4913733, 5012752, 5154015, 5238289, 5279892, 5365838, 5467465, 5523792, 5600471, 5734560, 5845493]
12254E845493J24748R5539J33303J60651P9661r479j18671r9929r0886o3584j4581
12243F042265j7466l6320J03342L3420K5407N8985M8312N5839M5372Jl9432K0013
12231F339738k716K4249J22368J24941J22458J57213J33070J98911L08674K76467
12221G805373J82779O5760M4792p4716j21038j53145j84007j29172k0204O7115
12211G483537J1545K336P754M7186N0574R3306O5830Q2056Q0405R8352J53699
12200H176580J55578J24084Q4720P8236M8978J18237Q7601J34744J37736Q9998
12190I236492J52339Q9889N5814J09788J58675J31864J54819J81404J37776Q1114
12180A0489974R6108J30153K11029J79247J52835J88068J74070J51601K10334
$$ y = [5845493, 5970241, 6065780, 6199083, 6359734, 6439395, 6429916, 6311245, 6211316, 6120430, 6056846, 6042265, 6024799, 5988479, 6091821, 6125241, 6150648, 6209633, 6257945, 6313784, 6359156, 6359157, 6319725, 6339738, 6337022, 6361271, 6483639, 6608580, 6731038, 6888251, 7021321, 7220232, 7528906, 7805373, 7988152, 8053912, 8098704, 8023988, 7902950, 7749805, 7565798, 7436626, 7416422, 7483537, 7495082, 7497418, 7505172, 7552358, 7602932, 7696238, 7762068, 7844124, 7924529, 8022881, 8176580, 8332158, 8456242, 8540962, 8619198, 8668176, 8786413, 8874014, 9008758, 9146494, 9236492, 9388831, 9478720, 9534534, 9644322, 9802997, 9934861, 10089680, 10271084, 10408860, 10489974, 10586082, 10716235, 10927264, 11106511, 11259346, 11447414, 11621484, 11773085, 11983419]
12171A1983419J90648J98170J21325J96886K29683J93201J51772J72591J19423
12162A3557118J90977J93936J69479J84578K10296K40865K59733K07422K30043
12153A5444447J98342J84731K39829L05780K94718L01861K31948K04981K75165
12144A7681802L13643L15288K77639K99609K73684K84682L64932K68551K94587
12135B0374417K74438L17593L92116L76294L13057K72672L34119M40211M36029
12126B3530946L52018L19413L70042L35547L92346L82624L92685L72220L80302
12117B6828143M34547L82679L26902L67402L91148M43293M12244M57839M63584
12108C0507781M39887M49498L80838L67705L98161L70509L69356L84014L94675
$$ y = [11983419, 12174067, 12372237, 12493562, 12690448, 12920131, 13113332, 13265104, 13437695, 13557118, 13748095, 13942031, 14111510, 14296088, 14506384, 14747249, 15006982, 15214404, 15444447, 15642789, 15827520, 16067349, 16373129, 16667847, 16969708, 17201656, 17406637, 17681802, 17995445, 18310733, 18588372, 18887981, 19161665, 19446347, 19811279, 20079830, 20374417, 20648855, 20966448, 21358564, 21734858, 22047915, 22320587, 22654706, 23094917, 23530946, 23882964, 24202377, 24572419, 24907966, 25300312, 25682936, 26075621, 26447841, 26828143, 27262690, 27645369, 27972271, 28339673, 28730821, 29174114, 29586358, 30044197, 30507781, 30947668, 31397166, 31778004, 32145709, 32543870, 32914379, 33283735, 33667749, 34062424]
12099C4062424L64236L87729L82731L88137L75907L87849K82451L14140K71425
12090C7217029L46715L21149K60950L04727K87066K85410K42083K21859K14972
12081C9701960J71357J60597J48099J62127J07059R8261N9202M4454L49N9244
12071D0712709J5454j1164Q569j3043q6593j46048j31081q3085p1143q2338k26479
12060C9885758k42620k06000j86596j95501k35471k77697l30609l02965l01027
12051C7607272l19607k85356l58756l46612l44268l57323m16771l97635k96587
12042C4484357l71892l98717m54082m03772l83742m11872l76765m09378l64238
12033C0909899m10105m03665m07301m27624l91578l91409l80586m11370m31378
$$ y = [34062424, 34426660, 34814389, 35197120, 35585257, 35961164, 36349013, 36631464, 36945604, 37217029, 37563744, 37884893, 38145843, 38450570, 38737636, 39023046, 39265129, 39486988, 39701960, 39873317, 40033914, 40182013, 40344140, 40451199, 40549460, 40608662, 40653116, 40653465, 40712709, 40728163, 40716999, 40725568, 40712525, 40625932, 40479884, 40348803, 40265718, 40194575, 40112237, 39885758, 39643138, 39437138, 39250542, 39055041, 38819570, 38541873, 38211264, 37908299, 37607272, 37287665, 37002309, 36643553, 36296941, 35952673, 35595350, 35178579, 34780944, 34484357, 34112465, 33713748, 33259666, 32855894, 32472152, 32060280, 31683515, 31274137, 30909899, 30499794, 30096129, 29688828, 29261204, 28869626, 28478217, 28097631, 27686261, 27254883]
12024B7254883m23563l65139l63722l75677l60825l28519l62876l77826l61893
12015B3934843l37045l38135l97420m22802l29411l43074l42249k67906k62219
12006B0894582k75930k94878k55433l33184l23660l02157l24617k87886k75843
11997A8220994k86312k76091k37115k44370k02765k80704k70525k44153l07573
11988A5871386k49339k18090j94776j78426k20886j84934k26407k54975k06410
11979A3937143j47834j97571j67793j39619j73682k26732j52005j68498j76060
11970A2387349k20774j47208j98017k49163j52937j10117j47341j04508j38611
11961A0918673j06704j34363j46479j07197j42739j67869j31119j60654j35454
$$ y = [27254883, 26831320, 26466181, 26102459, 25726782, 25365957, 25037438, 24674562, 24296736, 23934843, 23597798, 23259663, 22862243, 22439441, 22110030, 21766956, 21424707, 21156801, 20894582, 20618652, 20323774, 20068341, 19735157, 19411497, 19109340, 18784723, 18496837, 18220994, 17934682, 17658591, 17421476, 17177106, 16974341, 16693637, 16423112, 16178959, 15871386, 15622047, 15403957, 15209181, 15030755, 14809869, 14624935, 14398528, 14143553, 13937143, 13789309, 13591738, 13423945, 13284326, 13110644, 12883912, 12731907, 12563409, 12387349, 12166575, 12019367, 11821350, 11572187, 11419250, 11309133, 11161792, 11057284, 10918673, 10811969, 10677606, 10531127, 10423930, 10281191, 10113322, 9982203, 9821549, 9686095]
11952I686095j33806j34424j26986j07343n2487o5686p2478j27302k06206r9235
11942H560142q3257p3519m8547l6769q0208j50031j19244j11698q7391m7159p6863
11931G645456r2560o1980r4280q5931j01229p0318m8316p6905o4491m8723m3989
11920F856734n9872r3725q0355q2685m9278m6339p2670j09650k0335o1569r7394
11909F082862j47492r4703m3736L6094l105o4022p6554n7392o5095l3100n7447
11898E476310n3604p247q4604q4476p4361J3322J7643L892n4377j17083n1698
11887D983717r5015q6138n1775n2491n2829J5040n7736l6932K9060j0536n0185
11876D534180k8962j0498l4946p0993k9983J9927M3488l4342j08979o4933j5845
$$ y = [9686095, 9552289, 9417865, 9290879, 9183536, 9131049, 9065363, 8992885, 8865583, 8659377, 8560142, 8476885, 8403366, 8354819, 8318050, 8237842, 8087811, 7968567, 7856869, 7769478, 7722319, 7645456, 7552896, 7490916, 7396636, 7310705, 7209476, 7139158, 7090842, 7013937, 6949446, 6900723, 6856734, 6796862, 6703137, 6622782, 6540097, 6490819, 6444480, 6371810, 6262160, 6241825, 6180256, 6082862, 5935370, 5840667, 5796931, 5833025, 5829920, 5765898, 5689344, 5631952, 5566857, 5533757, 5476310, 5422706, 5415459, 5330855, 5246379, 5172018, 5185340, 5202983, 5206875, 5152498, 5035415, 4983717, 4888702, 4802564, 4750789, 4698298, 4645469, 4660509, 4602773, 4565841, 4594901, 4584365, 4534180, 4505218, 4494720, 4459774, 4388781, 4358798, 4378725, 4422213, 4387871, 4278892, 4213959, 4198114]
11865D198114k7610K0604k29j1230J2992l9498m1072j6665J3794j26n3659P30
11853D056145O4658R7522O6460J28973J35855J49253J54364R3199M2317L9592
11843E028338j5002q1017k07188k06344k14749j92191j04042n5517l359j0879
11833C938050j3183n0213m860J24884R8069J1871L8917K7060j6407j2704m6868
11822D094616m4412Q438O3121N3664K7264L0059P1682R7261M9373J9096l7616
11811D432546n1754j58628q9116q5896j01577p0946r4937j18285o0768l4093p5905
11800C490641k7243j00275p6161l9862J3586k2277j06604l4420L5641L7145Q7477
11789C257648J06780L8136J00664J03017J20878K1654l5665o7780j22186j96930
$$ y = [4198114, 4170504, 4191108, 4190879, 4179649, 4192641, 4153143, 4112071, 4095406, 4109200, 4109074, 4055415, 4056145, 4120803, 4218325, 4284785, 4413758, 4549613, 4698866, 4853230, 4946429, 4988746, 5028338, 5013336, 4932319, 4725131, 4518787, 4304038, 4111847, 4007805, 3952288, 3948929, 3938050, 3924867, 3874654, 3869794, 3994678, 4092747, 4104618, 4143535, 4170595, 4154188, 4141484, 4094616, 4050204, 4058642, 4121763, 4175427, 4202691, 4232750, 4304432, 4401693, 4451066, 4470162, 4432546, 4380792, 4222164, 4133048, 4047152, 3945575, 3874629, 3779692, 3661407, 3600639, 3566546, 3490641, 3463398, 3363123, 3286962, 3247100, 3260686, 3238409, 3131805, 3097385, 3133026, 3170171, 3257648, 3364428, 3402564, 3503228, 3606245, 3727123, 3748777, 3713112, 3645332, 3523146, 3326216]
11779C326216k61575j37884m3647p4990j17207q3414r3160p4049o1476K3513l4412
11768B367915k9727j1194M5346j4496n6915J8296L099k6618j5991k8194k5934
11757B225587l7486l8842o569o279k9499P1530O4627L912j5986j8572m023j2925
11745B195475q1122p2975j1291K9831Q05k6258J5383K7800o648k3813J7770j9001
11733B045956o706M6774k7733l6776m0926M8815K7254N2k4999k7728p072k9164
11721A967747l3309q140M1433M2791J4357J0182L5568k7740o0368k8487m6843
11710A907191K1720K8253M708O7906j8058m5058K7681L0290j5586n2846q8499
11699A867702j4833l0374N2771P7401N5316J3016j3115m8640o1083R937L8821
$$ y = [3326216, 3064641, 2926757, 2883110, 2808120, 2690913, 2607499, 2514339, 2440290, 2378814, 2402327, 2367915, 2338188, 2326994, 2372340, 2357844, 2300929, 2319225, 2322324, 2295706, 2279715, 2251521, 2225587, 2188101, 2149259, 2142690, 2136411, 2106912, 2178442, 2243069, 2246981, 2230995, 2212423, 2208400, 2195475, 2114353, 2041378, 2030087, 2059918, 2060723, 2034465, 2049848, 2077648, 2071000, 2047187, 2064957, 2045956, 2039250, 2086024, 2058291, 2021515, 1980589, 2029404, 2056658, 2056710, 2031711, 2003983, 1996911, 1967747, 1934438, 1926298, 1967731, 2010522, 2024879, 2035061, 2070629, 2042889, 1982521, 1954034, 1907191, 1928911, 1957164, 1961872, 2029778, 2011720, 1966662, 1994343, 2024633, 2009047, 1956201, 1867702, 1852869, 1822495, 1875266, 1952667, 2007983, 2020999, 2007884, 1959244, 1898161, 1908098, 1946919]
11688A946919L0839j0980O31J8535J2005M899l8525j5840j8529k6276J6794j1397
11676A909075K2599P0836J0426j9301N794l9309q0941j0560M6391K5065J5886
11665A955961K4603J1997J2396M7253r032o1277J4457M105o169p8163m2887L3534
11653A906778K5814N844m9773l9597M718l9590M5877M5978m799j7672J5412j9331
11641A879659p452N0428k6843J767M980n9421j7142j1656N416l5287j279O6927
11629A850097j4186l4467k0675m6244j2750J1127k0642l2861j0696n673R737P969
11617A680736J7969m254J9208l2849K2300L5505L6820j9500J2961K3150l0556
11606A761490l7193j9723r96K112P389J7451k2925K7963l595K5099j175n1261
$$ y = [1946919, 1977758, 1966778, 1967409, 1985944, 1997949, 2002848, 1964323, 1948483, 1929954, 1903678, 1920472, 1909075, 1931674, 2002510, 2012936, 1993635, 1999429, 1960120, 1879179, 1868619, 1915010, 1940075, 1955961, 1980564, 1992561, 2004957, 2052210, 2043178, 1981901, 1996358, 2000463, 1994294, 1916131, 1873244, 1906778, 1932592, 1938436, 1888663, 1849066, 1853784, 1814194, 1860071, 1906049, 1901250, 1883578, 1898990, 1879659, 1872207, 1922635, 1895792, 1897559, 1902539, 1843118, 1825976, 1814320, 1819736, 1784449, 1783170, 1850097, 1835911, 1801444, 1780769, 1734525, 1721775, 1732902, 1712260, 1679399, 1668703, 1663030, 1672767, 1680736, 1698705, 1694451, 1713659, 1680810, 1703110, 1738615, 1775435, 1755935, 1768896, 1792046, 1761490, 1724297, 1704574, 1703578, 1705690, 1713079, 1730530, 1707605, 1735568, 1731973, 1757072, 1755897, 1704636]
11594A704636j9052L6815j3984P32j2005j4314J8729O6824Q9472K3298n6881k1177
11582A803093R525K5512j7202R44j9805J8614k2560o5766k0934J9836N2755N6605
11570A840617L9844j2995N2207Q5663L7630j1706o2867N856k1501r74r739N948
11558A947983j4461M2435J13627L2948j5936J27613O6650L5716P8953P1948M7413
11547B534889J1416K8983O7699O3759R3499J62201J51248J75535N7159J4740k6393
11536C334735o239o3765r4195r8418j67657p6665j9859l6883k2143j2941l1885
11525B704085k1115J7775N928n0873L22J0843N0232N5024J7780o7860Q5650R8045
11513B905836J896J8924M6301M4875N5634Q3598N224K1455L4767L4393R304Q624
$$ y = [1704636, 1685584, 1722399, 1708415, 1709147, 1697142, 1682828, 1701557, 1768381, 1857853, 1881151, 1824270, 1803093, 1812618, 1838130, 1820928, 1821872, 1802067, 1820681, 1798121, 1732355, 1711421, 1731257, 1784012, 1840617, 1880461, 1867466, 1919673, 2005336, 2042966, 2031260, 1968393, 1974249, 1952748, 1951774, 1942035, 1947983, 1933522, 1975957, 2089584, 2122532, 2106596, 2234209, 2300859, 2336575, 2415528, 2487476, 2534889, 2546305, 2575288, 2642987, 2706746, 2800245, 2962446, 3113694, 3289229, 3346388, 3361128, 3334735, 3328496, 3264731, 3170536, 3072118, 2904461, 2827796, 2807937, 2771054, 2748911, 2735970, 2704085, 2682970, 2700745, 2706673, 2655800, 2656122, 2666965, 2717197, 2772221, 2790001, 2722141, 2807791, 2905836, 2907732, 2926656, 2972957, 3017832, 3073466, 3157064, 3162288, 3183743, 3218510, 3252903, 3262207, 3270831]
11501C270831L0098O6144l9129j3026N3274K9924P1396R1104Q5019P2669N6817
11490C775121P9731N4995J5421Q7863O5866P8947O9534Q6971O3904Q0281P0647
11479D529281N9099P5788P7920J47162L8227N8008N5465N3012R2786J65066K05792
11468E557606J23670J79044J88493J86692K25245K24597K45410K61687K78879
11459G471323K48010K94069L15380K96362L45471L17119L52359M84137O08284
11450A0732514O07477P23848P86597Q86371J068727J114599J379413J658989J810866
11441B0769401K114144K379187K770817L249479L704625M248437M801788N550813
11433D9588691O457647P709183R518309J2074314J5405674J9591624K4510628
$$ y = [3270831, 3300929, 3367073, 3327944, 3314918, 3368192, 3398116, 3469512, 3560616, 3645635, 3718304, 3775121, 3854852, 3909847, 3925268, 4013131, 4078997, 4157944, 4227478, 4314449, 4378353, 4458634, 4529281, 4588380, 4664168, 4742088, 4889250, 4927477, 4985485, 5040950, 5093962, 5186748, 5351814, 5557606, 5681276, 5860320, 6048813, 6235505, 6460750, 6685347, 6930757, 7192444, 7471323, 7719333, 8013402, 8328782, 8625144, 8970615, 9287734, 9640093, 10124230, 10732514, 11339991, 12063839, 12850436, 13736807, 14805534, 15920133, 17299546, 18958535, 20769401, 22883545, 25262732, 28033549, 31283028, 34987653, 39236090, 44037878, 49588691, 56046338, 63755521, 73273830, 85348144, 100753818, 120345442, 144856070]
11426A44856070K9491907L3317140L5013554L3956506K8399223J5647705m564487
11419C16117618k5849650l9447097m1811623l6343793k7721676j8943560j1110963
11412A14889256m487227R88262N514787R101838J1920057J4010361J4930035J3940980
11404A80808349J0910617O547349K640371P0555j029855n87640J577034O062414
11396B06999194J2516045J9404080K4666148K6634950K4107604J6272685L299939
11389C33900645j2256420k5630690l2144333l0673012k3639570j4879256p085761
11382A87591603k168035o94358j929249m532738p284782r914026j2377199j4015449
11374A34675767j3717992j1209257p162587k551913J904754O267163J0863258
$$ y = [144856070, 174347977, 207665117, 242678671, 276635177, 305034400, 320682105, 316117618, 290267968, 250820871, 209009248, 172665455, 144943779, 126000219, 114889256, 110402029, 111390291, 116905078, 126006916, 137926973, 151937334, 166867369, 180808349, 191718966, 198266315, 200906686, 200977241, 199947386, 199359746, 200936780, 206999194, 219515239, 238919319, 263585467, 290220417, 314328021, 330600706, 333900645, 321644225, 296013535, 263869202, 233196190, 209556620, 194677364, 187591603, 185423568, 184729210, 182799961, 178267223, 170982441, 161068415, 148691216, 134675767, 120957775, 109748518, 102585931, 100034018, 101938772, 108205935, 119069193]
11367A19069193J5773140K0852554K5177631K7596329K7361452K3849044J5743856
11360B75423199J553916j7654953l5591895m4382976m2169876l3885603k5111956
11353G8179856j8191578j3148007r455826o847522n066288l828821l089336k574839
11345A5977639k216305j909384j653038j405298j177261j003281q85929p07452
11337E019691n49250l88077l92529l77315l08378l07698k63575k05449j74329
11328B053091j65740k44016j74196j40307j84141j59434m9491m0258p1896p9046
11318G44566l8413m3111k0571r583k8349l1484o8559n6821l5868l773k7548m8400
11306C32086l7958n8109n1230m5611j0684k442L7898k2499j3577n7056j7894o8096
$$ y = [119069193, 134842333, 155694887, 180872518, 208468847, 235830299, 259679343, 275423199, 276977115, 259322162, 223730267, 179347291, 137177415, 103291812, 78179856, 59988278, 46840271, 37384445, 30536923, 25470635, 21641814, 18552478, 15977639, 13761334, 11851950, 10198912, 8793614, 7616353, 6613072, 5727143, 5019691, 4470441, 4082364, 3689835, 3312520, 3004142, 2696444, 2432869, 2227420, 2053091, 1887351, 1643335, 1469139, 1328832, 1144691, 985257, 935766, 895508, 823612, 744566, 706153, 663042, 642471, 632888, 604539, 573055, 504496, 447675, 411807, 408034, 380486, 332086, 294128, 236019, 184789, 139178, 128494, 126052, 163950, 141451, 127874, 70818, 52924, -15172]
11294a5172j6702m915j0382M7901O2318J9636J6089N8890K8353l706P376M3686
11282B33372Q961l8384p5166p5607n0123k2447J8368N299O112N0848m964J8276
11270G4545K482j2435J5890M1300Q0283O181N993l9692o9582O936N4331Q9487
11258B55719N9825q80k6774M1988K2756J328o453n292M7786O6156J0052J6492
11246D82703O6086P7303M5183j0896k3418n9870j02414m3332q6089q5167m0369
11235B19720q5064k1310l8392m7304k2919N413K4881J7143K2813P4807M6745J9893
11223B16426L2821k7288k0339k6527q2931k9818K1846m0392k2651n626m2946o5430
11211i2855l1827L24L6578K5260P6394J07595J9982p2254n5678k6238m2587j7038
$$ y = [-15172, -31874, -36789, -47171, 730, 63048, 82684, 98773, 157663, 186016, 182310, 189686, 233372, 242333, 203949, 128783, 53176, 3053, -19394, -1026, 4273, 10385, 61233, 56269, 74545, 77027, 64592, 80482, 121782, 202065, 208246, 214239, 174547, 104965, 111901, 166232, 255719, 315544, 314664, 287890, 329878, 352634, 353962, 347509, 342217, 390003, 456159, 466211, 482703, 548789, 626092, 671275, 660379, 636961, 577091, 474677, 431345, 345256, 260089, 219720, 134656, 113346, 74954, 27650, 4731, 10144, 35025, 52168, 74981, 149788, 196533, 216426, 249247, 221959, 201620, 175093, 92162, 62344, 84190, 43798, 21147, 15521, -27425, -92855, -124682, -124358, -87780, -62520, 13874, 121469, 141451, 69197, 13519, -12719, -55306, -72344]
11199g2344L6542m1519l5159M6840L0397J9594j2737l4213m4139J9206K7887j0289
11187f9934k572j3575J1914L6676k0699O038k322p419N6743P7362L0435n0347
11175E2300o8293l0217n1904k33O7736M5920L2846O3203L1610n1108k7648L1120
11163I5332J3850O649L2205j7140m0978j00834o933k2982l1649L1240K9414l2784
11151d4610n3058n6803N761j7259K1846J05425N8797K8762N562k0439k8416L0785
11139C6353J8957q0209m6524n28j0008k3091K2459R4182j439o0853J8418j1628
11127d3911k0656K8417j2097r167L0033J4331j9278O886j5051j6847l6523K5685
11115f8178k538L175j5029m4912j1282N1947J8873j627M0306M228k2006Q741j0249
$$ y = [-72344, -35802, -77321, -112480, -65640, -35243, -15649, -28386, -62599, -106738, -87532, -59645, -69934, -72506, -86081, -74167, -37491, -58190, -52152, -54474, -61893, -5150, 72212, 102647, 52300, -15993, -46210, -98114, -98347, -30611, 15309, 48155, 111358, 142968, 91860, 64212, 95332, 109182, 115831, 148036, 130896, 89918, -10916, -17849, -40831, -72480, -41240, -11826, -44610, -97668, -154471, -148710, -165969, -144123, -38698, 20099, 48861, 54423, 33984, 5568, 36353, 55310, -24899, -71423, -71951, -81959, -105050, -82591, 11591, 10152, -50701, -32283, -43911, -64567, -36150, -48247, -57414, -27381, -13050, -32328, -25442, -40493, -57340, -93863, -68178, -70716, -67541, -82570, -127482, -138764, -86817, -67944, -69571, -29265, -25037, -47043, -38302, -48551]
11102d8551L4335J4137o280N2572J353m9093k0349o88j1k8745n2474l5205O2143
11089g6856M2683l1779l5370j5405p0471j2302k3119q150k9946M2932l1697K9747
11077b19733N3288J1292J8782R726j4578m6317k3570K8639M5187l4725l0229J5387
11065a86851K8201J0614J5777l6062L5865K1499j7830j5442L243J603J3587P063
11053a18733k3409m7132m4679L6997m119J7660O6087P562j3103o2671J232J4597
11041a69711M523J5286R642j735l755J4912k4642j0787k2311J6467k2131O762
11029a87480N2593K5946p114j95J9560M4604l821k8136J0052k6954l5153J3893
11017a22205N8681L0178N504k986o910q6j52N8450J3445j881K5239M3682R7527
$$ y = [-48551, -14216, -79, -6359, 46213, 47566, -1527, -21876, -22564, -22575, -51320, -103794, -138999, -76856, -34173, -65952, -101322, -116727, -187198, -199500, -222619, -230769, -260715, -217783, -249480, -219733, -166445, -155153, -136371, -126645, -141223, -187540, -211110, -182471, -137284, -172009, -202238, -186851, -158650, -148036, -132259, -168321, -132456, -110957, -128787, -144229, -140986, -139383, -125796, -118733, -142142, -189274, -233953, -196956, -201075, -183415, -117328, -109766, -122869, -185540, -184308, -169711, -165188, -149902, -140260, -141995, -145750, -130838, -155480, -166267, -188578, -172111, -194242, -187480, -134887, -108941, -116055, -116250, -96690, -52086, -55907, -84043, -73991, -100945, -136098, -122205, -63524, -33346, -27842, -30828, -37738, -37824, -37976, 20474, 33919, 32038, 57277, 100959, 198486]
11004A98486P0757P5765Q615K5985P0074P4130J44144J33265J20718J42895K12226
10993A277060J18158R8185L148j03104j21078j17010j45994j56923j81351j62418
10983E08673m8520k5308M1322N5277O3002N4436L0797Q2755J04319J18949L4100
10972A019802M3666j1721l3308j7421R5749N4456N2870O7425J08138J17448J08644
10961A605748K2818k9392q8238j39939r3682j27406p7918n6505n3013k9418p2766
10950H60289k8798m9664o5407k5886l5114n3429k5966J8387p1203o7061P091Q3006
10938E46245K3080J01902J13868J57862J44374J45646Q9643N1556n0852j80986
10928A142338j51471k13988k07996j80579r8937p4628m0407n2593k5049o1915
$$ y = [198486, 269243, 345008, 353623, 379608, 449682, 523812, 667956, 801221, 921939, 1064834, 1277060, 1395218, 1493403, 1496551, 1393447, 1272369, 1155359, 1009365, 852442, 671091, 508673, 460153, 434845, 476167, 531444, 594446, 648882, 679679, 762434, 866753, 985702, 1019802, 1063468, 1051747, 1018439, 1001018, 1096767, 1151223, 1204093, 1271518, 1379656, 1497104, 1605748, 1628566, 1599174, 1510936, 1370997, 1277315, 1149909, 1071991, 1015486, 962473, 933055, 860289, 831491, 781827, 716420, 690534, 655420, 601991, 576025, 594412, 523209, 456148, 463239, 546245, 569325, 671227, 785095, 942957, 1087331, 1232977, 1322620, 1374176, 1323324, 1142338, 990867, 776879, 568883, 388304, 289367, 214739, 174332, 121739, 96690, 34775]
10918C4775o6533J7134M3019k961j913N441L528l7628r207j7542J5717n9120k7071
10905a02361j2392M8487K3917j1161j6464j097j443L9175J8508j6132j8331k1370
10893g0664K0728J5211n2007N96l3332j7348m7234L841k2292m4207k443O67m855
10880b53339K9739J1365L9967O477l507J3808J1268J393q0246k7140P7928O7529
10868a04758P492j2435j4110L99j9616J8283L0528N0292q645l764l3103m9569
10856a39006m2616K7738N1675M3231j186k1974k2110l2235L3911M8093m9751M5031
10844e9199L835k5931p517o3191m8047M5891K2046L5880R684N265l0306L1998
10832g9592K0054j4247L5495j6425k3171J0911J8121N2590n589m7759k8196K8461
$$ y = [34775, -31758, -14624, 28395, 25434, 23521, 28962, 32490, -5138, -14345, -31887, -16170, -75290, -102361, -114753, -66266, -42349, -53510, -69974, -71071, -72514, -33339, -14831, -30963, -49294, -70664, -49936, -34725, -86732, -86136, -119468, -136816, -184050, -180209, -202501, -246708, -249151, -248484, -253339, -223600, -212235, -172268, -165791, -169298, -155490, -144222, -142829, -223075, -250215, -172287, -104758, -97266, -109701, -123811, -123412, -143028, -124745, -94217, -43925, -52570, -56334, -89437, -139006, -181622, -153884, -102209, -58978, -60164, -82138, -104248, -136483, -102572, -54479, -104230, -59199, -55364, -81295, -88812, -152003, -200050, -154159, -132113, -96233, -86549, -81284, -111590, -79592, -59538, -73785, -38290, -54715, -77886, -66975, -48854, 3736, -1853, -49612, -77808, -49347]
10820d9347q728m3818j8469N331J6845K97m584P607n007l3436N608l964M2560
10807h9105N6409K5355l2800n8308m6379m9875m2284K8215k450J5888L454P7526
10795a14354L3438J3711M4427n944k9829l1995O403N1532N4771n9868k0511M786
10783e3433M7295j12p0501l4422J4627j3594M565J629P0550K5312n623l267n890
10770b2864m7812k0426J6693K3876J6822J630l9019M5226p360k90l7302L7031
10758c3795j8288j4451M1144k8025l4665N7751K1233n2085J6622k635j9868j6075
10746h3137R751K2250J0400J4758K894K9202J1974L2586r337n6720O14P5308m3856
10733A6687o7096n3425J9246K7998M2963J6649j5048L7523J3005P409j4115m0150
$$ y = [-49347, -58075, -101893, -120362, -115031, -98186, -97889, -102473, -94866, -99873, -133309, -127701, -131665, -89105, -32696, -7341, -40141, -98449, -144828, -194703, -236987, -208772, -211222, -195334, -191880, -114354, -80916, -67205, -22778, -28722, -58551, -90546, -84143, -32611, 22160, -37708, -58219, -53433, -6138, -6250, -76751, -111173, -96546, -110140, -105575, -103946, -33396, -8084, -13707, -16974, -22864, -70676, -91102, -74409, -50533, -33711, -32081, -71100, -25874, -33234, -33524, -70826, -33795, -52083, -66534, -25390, -53415, -88080, -30329, -9096, -61181, -44559, -47194, -67062, -83137, -73386, -51136, -40736, -25978, -23084, 6118, 18092, 50678, 41341, -15379, -14765, 60543, 16687, -50409, -103834, -84588, -56590, -13627, 3022, -12026, 25497, 38502, 45911, 31796, -8354]
10721h354j0251j1449K7368L8526k201o7798n3535j8737P470k5147J632J1096
10709a11380n6002J1939K2420M3758O5060j7163n8724L9171o571l3425K3130L2142
10697d5645O2473J8160p1081m4974N5972L7565L8718r43l7881k9903l4711m8083
10685a00333J1245M258J5170m8387k888L3829M4313K348m5982m6561k9590N9801
10673a02777J0862O655j2578N5944L1672p0967n1722K9162M1330k1945m484R3828
10661D980M1620o8720l8220N8067L6367J1659o5922k3459L7036L2249l7800j6116
10649b8259L8009K3952J102j9335M2562L3274l8225q0091K9686L4485j859K5629
10637F0930P1894J9762r7812q6430m3688j1422r277L4690K3859N3247R443o8363
$$ y = [-8354, -18605, -30054, -2686, 35840, 33639, -34159, -87694, -106431, -98961, -124108, -122476, -111380, -167382, -155443, -133023, -89265, -24205, -41368, -100092, -60921, -67492, -100917, -77787, -45645, 16828, 34988, -36093, -81067, -25095, 12470, 51188, 50245, 12364, -17539, -52250, -100333, -89088, -84830, -69660, -118047, -120935, -87106, -42793, -40445, -86427, -132988, -162578, -102777, -91915, -85260, -97838, -41894, -10222, -81189, -132911, -103749, -62419, -84364, -88848, 4980, 46600, -22120, -60340, -2273, 34094, 45753, -20169, -43628, -6592, 25657, -12143, -28259, 9750, 33702, 34804, 15469, 58031, 91305, 53080, -27011, 2675, 37160, 35301, 60930, 132824, 152586, 54774, -31656, -75344, -86766, -96043, -61353, -37494, 15753, 25196, -43167]
10625d3167j8847m350J0263M0927n9765m4451L3625M7295l507M3729n1151m1870
10613i1269K3518P472K7321k3614j4585K4707j0294N4415l730J225J1107M6600
10601E2873j2156o3798n31L7924K3212n3567n2177k7599k0154J5265N5733L8686
10589f289m2230M0436m2312J3025o96R6689P1851N263n6157k5227l5608q0893
10577f2148K8448L4968k6593p1111L1091N5499N8276J5502K030L2756j4455n0726
10565C3537j7230K7153o287l1204j7361m03J4428Q569n7623m7651j8151M9023
10553f3200P841N488R658K865L1877p415l273J6816N5436k1983j1308o157j2499
10540D146J5195k1752k6517K3023J2299j9852J4723j3356k5193N184j575K2642
$$ y = [-43167, -62014, -66364, -56101, -15174, -74939, -119390, -85765, -38470, -41977, 1752, -49399, -91269, -67751, -60279, -32958, -56572, -71157, -46450, -56744, -2329, -6059, -4834, 6273, 52873, 40717, -23081, -23612, 14312, 37524, -16043, -68220, -95819, -115973, -100708, -44975, -6289, -48519, -8083, -50395, -37370, -38066, 58623, 130474, 135737, 79580, 54353, 18745, -62148, -33700, 1268, -25325, -96436, -65345, -9846, 48430, 63932, 65962, 98718, 84263, 33537, 16307, 43460, 37173, 5969, -11392, -11795, 2633, 11202, -46421, -94072, -112223, -63200, -55359, -49871, -40213, -37348, -5471, -12886, -16159, 657, 56093, 34110, 22802, 16645, 4146, 19341, -2411, -28928, -5905, 6394, -13458, 1265, -12091, -37284, -32100, -33675, -11033]
10528a1033k1228K6259j7605k6817K2907O355K3948R275R62M057j666M820k4639
10515d405l654k0944J3589J0666j950j8255l586J9698O574R520k0632L278J872
10502h229n319J8224J2314n3627j4360L8310O7058o9951k8049R1658L3333m8657
10490C2705m7823j4210P5363j4896l8874J4940L8216k4621l249P643k8682L1249
10478B7761M2147j9855m8761m8113J1827O6372k1016n3364K5183m0841K5503j5770
10466d8927K472N3053K0651K3497j538j8929J1252q787p319J1003k5670l05K0094
10453C0547L112M0388n1453l4751L4423K5460l1280m3228J2446J9947N7808R130
10441G2549m6132l6879l2852K1712O9347J7097j7118k3310K615j9134K396l6104
$$ y = [-11033, -32261, -6002, -23607, -50424, -27517, -21162, 2786, 12061, 13023, 17080, 15414, 20234, -4405, -8059, -29003, -15414, -4748, -6698, -24953, -28539, -8841, -2267, 7253, -13379, -10101, -8229, -13548, 4676, 16990, -36637, -50997, -12687, 54371, -15580, -43629, 48029, 81362, 32705, -15118, -29328, 46035, 31139, -7735, 7205, 45421, 20800, 17551, 25194, -3488, 27761, 69908, 50053, 1292, -46821, -34994, 31378, 10362, -43002, -17819, -58660, -33157, -48927, -46455, 6598, 27249, 50746, 49208, 30279, 41531, 32744, 25425, 36428, 10758, 10453, 30547, 33659, 74047, 22594, -12157, 22266, 47726, 16446, -26782, -14336, 5611, 63419, 72549, 26417, -10462, -43314, -21602, 47745, 64842, 47724, 24414, 27029, 7895, 10291, -25813]
10429b5813n1520M9589O6072K0155j3472j4217o088J2917J8524J3998J0165m8955
10417C1355l4118k7417L5391k1801l708M5385k1994L868J4584J7267N451l8650
10405E613k0328k458k3123k8281N0282j4047r806M7437L3325N6914K3923J4729
10393A34180j3629j9438k4752l4932N5505r686J2779j2077P64l8305l6575K8668
10381D2502K4680J1033n4253m7063J2320O4403O0775m285n7125k9443o100K6692
10369D4136K9742L8595L4204j5157k9440n6842R254M3963k1774J2745j733k1515
10357F6178q2297j0425L1796r39J9487L8359O735L892K152m3466N228L0084O3405
10344A30189k8665J4288p120k0932k1905l3637k0828M0694j8971Q2j8755L1516
$$ y = [-25813, -77333, -27744, 38328, 58483, 45011, 30794, 24706, 37623, 56147, 70145, 80310, 31355, -2763, -30180, 5211, -16590, -20298, 25087, 3093, 6961, 21545, 38812, 44263, 5613, -14715, -17173, -40296, -68577, -18295, -32342, -42148, 5289, 38614, 95528, 119451, 134180, 120551, 101113, 76361, 41429, 96934, 87248, 100027, 87950, 88714, 50409, 13834, 42502, 67182, 78215, 23962, -23101, -10781, 53622, 114397, 110112, 52987, 23544, 17444, 44136, 73878, 112473, 146677, 131520, 102080, 45238, 54492, 98455, 76681, 89426, 87693, 66178, -16119, -26544, 5252, 4313, 23800, 62159, 68894, 72786, 74938, 31472, 36700, 66784, 130189, 101524, 115812, 108692, 87760, 65855, 32218, 11390, 52084, 33113, 33195, 14440, 45956]
10332D5956Q8836k1813m7407k82k48k6103j5776K2402J0100J3783j7382q07k8130
10319B3129l1987j3787J1244O8168K7349L4939J0534j719j3883K5819p500j9382
10307A12924N9698m7482l5303P589j8518n32O4942L997J841j3397n9828J1856
10295H7787Q556J5946j2911j1007M1047j0636m2731K198n270J3329J871N4672
10283A42851J3278n3789m160L9504l3918M162l2134K9519p762j2701J0835n0053
10271D5632J0306j6505K8793N6185K9033k7799k3890o2656m2341J0069j6176J0378
10259A029P5671J0205n687K7594L2522J5662p8619o8308k8213L3877J03162O4056
10247A82951k7389j7876J39l338k0913m5038M9816Q5719r766q7630j3419J4149
$$ y = [45956, 134792, 112979, 65572, 65290, 65042, 38939, 23163, 45565, 55665, 69448, 52066, 51259, 23129, -8858, -22645, -11401, 56767, 84116, 119055, 129589, 127870, 113987, 139806, 132306, 112924, 172622, 125140, 89837, 97426, 78908, 78376, 143318, 147315, 149156, 135759, 75931, 87787, 96343, 112289, 99378, 88371, 129418, 118782, 76051, 78249, 72979, 86308, 88179, 142851, 156129, 102340, 98180, 137684, 103766, 107928, 75794, 105313, 97551, 84850, 95685, 45632, 55938, 39433, 68226, 124411, 153444, 125645, 101755, 39099, -3242, 6827, -9349, 1029, 76700, 86905, 81218, 108812, 141334, 156996, 78377, 10069, -18144, 15733, 118895, 182951, 155562, 137686, 137825, 134487, 113574, 68536, 118352, 204071, 194305, 106675, 93256, 107405]
10235A07405L0116l5422q7460J2864K4353J876P721q753J4078N6598o715k0712
10223I5949l43M2151L889k773N3174j4021J3799k8926P434J4877n516J3632o0948
10210A32378j0009K2349Q818n6200J8502n139K9071Q629N2871K881m3510p1717
10198H8924l0692L41K8667N1956J5827L4401M1256M134l2964j5439k2245o8821
10186I5345k1243J7688J3446J9616k4095o805k091J2740J4436J2380M6956m1680
10174A36693o0886L7463K7410q46O5411j2648n5400j1663N1231o6659j1185K3753
10162A22674k4592j3300L2792j5921l9220N420j1367J6995K8911k7226L9345J0607
10150A25118k4069K7881K5751K9321j6675k3723K8810J8059n7669K9733P2628
$$ y = [107405, 137521, 102099, 14639, 27503, 51856, 53732, 61453, 52700, 66778, 123376, 116661, 95949, 95606, 137757, 141646, 138873, 192047, 178026, 191825, 162899, 170333, 185210, 179694, 193326, 132378, 122369, 144718, 153536, 97336, 115838, 110699, 139770, 148399, 201270, 204151, 160641, 88924, 58232, 58573, 87240, 139196, 155023, 189424, 230680, 234814, 201850, 186411, 164166, 95345, 74102, 91790, 105236, 124852, 100757, 93952, 91861, 104601, 119037, 131417, 178373, 136693, 75807, 113270, 140680, 139834, 205245, 192597, 137197, 125534, 176765, 110106, 98921, 122674, 98082, 84782, 117574, 101653, 62433, 67853, 56486, 73481, 102392, 75166, 114511, 125118, 101049, 128930, 154681, 184002, 167327, 143604, 172414, 190473, 132804, 162537, 235165]
10139B35165m6721o771m4061j7792J804k0157Q622l5219M580L0564M4930J7623
10127A72567n2100m0321O671N911P4358J02052P0105R855R95l9887j2821n4855
10115B42530j7038r910l807p439p7346K8790N3017O3038L2913O1251J2383k5734
10103C52648m5561k6405k4167J0108n9972p5496l6093K5232M6126j7129M3987
10092A93278j8254O5315J11649k8913l6937l6707j1196J6867M3352k7026N008
10081B76436k171q364L805O590R820R048L3880q172n1633j5780J7064K0754J1757
10068C03034O4389Q9461k7063l4979M1234Q7712l6997k2354J6382N7941J04068
10057F42828J33567J20769J37671K50282L59960L90805M26631M43027N64764L70762
$$ y = [235165, 188444, 181673, 137612, 119820, 121624, 101467, 110089, 74870, 79450, 110014, 154944, 172567, 120467, 80146, 86817, 92728, 167086, 269138, 339243, 349098, 350093, 310206, 297385, 242530, 225492, 215582, 211775, 204336, 126990, 155780, 208797, 271835, 304748, 365999, 378382, 352648, 307087, 280682, 256515, 266623, 206651, 131155, 95062, 120294, 166420, 149291, 193278, 175024, 240339, 351988, 323075, 286138, 249431, 238235, 255102, 298454, 271428, 276436, 274265, 265901, 269706, 276296, 286116, 295164, 329044, 320872, 269239, 253459, 270523, 291277, 303034, 367423, 456884, 429821, 394842, 436076, 523788, 486791, 464437, 480819, 538760, 642828, 776395, 897164, 1034835, 1285117, 1645077, 2035882, 2462513, 2905540, 3470304, 3841066]
10047C841066o14814j150072q48177m16881j98012j32527p3944n0629K8163K068
10037C86241j9409n0176k4042m5513m2582k118K0130r043K880L0472l482k9875
10025B13483p2526K5883R798K2038K1214L3828L5241n828o4685m1076k6445J8187
10013A69112M6603L4521M513r398k0816J7790k6315m435k1362m2301j3529L5300
10001A69683M1893O1916M7938N6873p1025m3205j6381J0973J5942l7340k788K0043
9989B54522K6682j4462p203m078L5476M2507l9747p3331m2835J6927O4257J9297
9977B78012J7516K46K0695k7662Q663L8558k828o7644l0648o76k646O4491N9399
9964C55476Q982k2072k399M765l1639n2919l9382K3696K0008m3492L1808L7123
$$ y = [3841066, 3226252, 2076180, 1228003, 811122, 613110, 480583, 406639, 356010, 384173, 386241, 366832, 316656, 292614, 247101, 204519, 202401, 222531, 213488, 216368, 246840, 243358, 213483, 140957, 166840, 176638, 198676, 219890, 253718, 288959, 283131, 218446, 177370, 150925, 169112, 215715, 250236, 254749, 245351, 224535, 242325, 216010, 211575, 190213, 147912, 134383, 169683, 211576, 273492, 321430, 378303, 307278, 264073, 247692, 258665, 274607, 237267, 234479, 254522, 281204, 266742, 259539, 255461, 290937, 333444, 293697, 220366, 177531, 194458, 258715, 278012, 295528, 295774, 316469, 288807, 297470, 336028, 333200, 265556, 234908, 234232, 231586, 296077, 355476, 364458, 342386, 339987, 344752, 313113, 260194, 220812, 244508, 264516, 221024, 252832, 289955]
9952B89955J3870p701k8205J5422P9816L1280l1927n6445l1525m4636O1497P958
9940B99359n2972J5465L5520K1142N050J7685j9440q2928n293M1831l7093l7653
9928B00673K6140N4518L3054n524j2191M051n3460q960O2507M3759l123J6890
9916C58334l2444j6752L785M8734L898l7161l1673L9929N4932K514k3857p924
9904C62315K8941l2151o0080k0076j7734L2964P8131j5587m1812m1054O658N626
9892B86141j066m379L4446k3395L310L2832J8091n062k8362j0384P8862l9451
9880C41583o054N2160j4138p5564L0104m58m1533m0916l0647P6349J3526J3795
9868C18207k89l958L1356M8418J3311n245K6748p4248l9644J0078K0625L26R455
$$ y = [289955, 303825, 296124, 267919, 283341, 363157, 394437, 362510, 306065, 274540, 229904, 291401, 299359, 246387, 261852, 297372, 318514, 323564, 341249, 321809, 238881, 233588, 275419, 238326, 200673, 226813, 281331, 314385, 308861, 296670, 300721, 247261, 238301, 300808, 344567, 341444, 358334, 325890, 309138, 312923, 361657, 365555, 328394, 296721, 336650, 391582, 394096, 370239, 362315, 391256, 359105, 299025, 278949, 261215, 294179, 372310, 356723, 314911, 273857, 280515, 286141, 285075, 280696, 315142, 291747, 295057, 327889, 345980, 340918, 312556, 302172, 381034, 341583, 335529, 387689, 373551, 297987, 328091, 327633, 286100, 245184, 214537, 290886, 304412, 318207, 317918, 313960, 345316, 393734, 407045, 401800, 428548, 354300, 314656, 324734, 345359, 345685, 355140]
9855C55140R2196M4837n197o3430o8082j4777L1004L904j4597J562K7389M3336
9843D33285l1042K2679N1281J7269M2847J5412m1656p7437l665K4905J8314M0471
9831E12663N729l2494o8750n5743k2282K9862O6153K0488k2303K7103P287n2739
9819D14974M931L23q2409J0862J636j2551k3199L7850K8478M4476j3786M426j5217
9806D00794l4919L5137R5085J7590j9575m2302k9915O099N6590Q2875L4639J5204
9794F17302r1307j9685J1137N620k212O2692L2377r0716O423K6370k6770K3490
9782E54721l0902j1910k5668n334j2803m1296k6733K4022k7426L9313j9603o217
9770D10164P729p20O836M1800K9673K2377r069M6682k0681J083M3210N0411j1865
$$ y = [355140, 447336, 492173, 486976, 423546, 355464, 340687, 371691, 375595, 360998, 362560, 389949, 433285, 402243, 424922, 476203, 493472, 536319, 551731, 510075, 432638, 428973, 453878, 472192, 512663, 518392, 485898, 417148, 361405, 339123, 368985, 435138, 455626, 433323, 460426, 467713, 414974, 419905, 420228, 337819, 348681, 350317, 337766, 314567, 352417, 380895, 425371, 411585, 416011, 400794, 365875, 401012, 496097, 513687, 494112, 451810, 421895, 427994, 484584, 567459, 602098, 617302, 525995, 506310, 517447, 523067, 520855, 583547, 615924, 525208, 531631, 558001, 531231, 554721, 523819, 511909, 486241, 480907, 468104, 426808, 400075, 424097, 396671, 435984, 416381, 410164, 417893, 417173, 424009, 465809, 495482, 517859, 508790, 555472, 534791, 535874, 579084, 629495, 617630]
9757F17630o0260j06534n3225M8928N2731K7825J2527m0621j3824K9697J5110
9746E29984j906n7201k6236M1406M5861p3648J4043M0805R332l1645j8332l2059
9734D40404N3583N1729l7009m0618k2704K6078Q7327L4981m0086j7154k4435N407
9722E17503n088J9307L357J3323J200L0039K037J9798K1104k9547N681P44q035
9709E91423K1279J937j5010k0770j1976m902j029J1790r150J9658R1511K836k1973
9696F55624o3492l7695J8037k592q315K0780K0657L2045J0832L229l729J84Mj7264
9682F28305k9727m8813q2562j0187O5113K5937K7334J0647k4553J7740M4295P7207
9670G00736m8915l0090k5018K4119J2798O3556J3293k6754J202k1591l2478L9106
$$ y = [617630, 557370, 450836, 397611, 446539, 499270, 527095, 539622, 499001, 485177, 514874, 529984, 528078, 470877, 444641, 486047, 531908, 458260, 472303, 513108, 522440, 490795, 472463, 440404, 493987, 545716, 508707, 468089, 445385, 471463, 558790, 593771, 553685, 536531, 512096, 517503, 512415, 531722, 535079, 548402, 549602, 579641, 581678, 601476, 622580, 593033, 598714, 599458, 591423, 612702, 614639, 599629, 578859, 566883, 561981, 560952, 572742, 563592, 583250, 674761, 677597, 655624, 592132, 554437, 572474, 569882, 561567, 582347, 603004, 635049, 645881, 649110, 645381, 645565, 645569, 628305, 598578, 549765, 467203, 457016, 522129, 548066, 575400, 586047, 561494, 579234, 623529, 700736, 651821, 621731, 596713, 620832, 633630, 697186, 710479, 683725, 684927, 663336, 630858, 669964]
9658F69964K9718o196K4917P8656l396l0444k1714k8231m3748j3404L0847J1966
9646F98935k9284o0436k8548N3899M9543K7815p694n6436Q056O3622k2087j3443
9634F83942J8016L2390K1523J7520P546m215o1246m1744K6257J4733k6998m537
9622F83187j413L0181L7878M1247k3331j2120l1679j6086L5779N5485k8382J6692
9610G87438K0227n3538l8714L9072M2904L1045K6425N7438l403L1489L014L6019
9598I79416P1443k174K5767L0323l881R9893Q2914P2024J03764J26600J22259
9587A708348Q3767R7221O3025r7552j31796j03669j03877o8934j15507n1134q988
9576A270904K2625K286L6029O1781J07898J62607Q7381R5591Q8959Q9538O8248
$$ y = [669964, 699682, 693486, 718403, 797059, 793663, 763219, 741505, 713274, 669526, 656122, 686969, 698935, 669651, 609215, 580667, 634566, 684109, 711924, 704230, 647794, 655850, 719472, 697385, 683942, 701958, 734348, 755871, 773391, 780937, 776722, 715476, 673732, 699989, 714722, 687724, 683187, 681774, 711955, 749833, 791080, 767749, 755629, 723950, 707864, 743643, 799128, 770746, 787438, 807665, 754127, 715413, 754485, 797389, 828434, 854859, 912297, 908894, 940383, 943397, 979416, 1050859, 1048685, 1074452, 1104775, 1100894, 1200787, 1283701, 1355725, 1459489, 1586089, 1708348, 1792115, 1889336, 1952361, 1854809, 1723013, 1619344, 1515467, 1446533, 1331026, 1279892, 1270904, 1293529, 1295815, 1331844, 1393625, 1501523, 1664130, 1751511, 1847102, 1936061, 2025599, 2093847]
9565B093847j3854q2436r2559n6534N1891j994m0485j8439k4166l7796k128N4544
9553A829891L2656K9632J24554J74287K97543L01996L54986K98373K87875K05816
9543C937609O6482l72176o32455n44082l88688k84332j35781n9824j0526O1253
9533A637480J35727P6580M3286k3420l5197m0294J9296M1119M0846Q2481O4004
9522B041908M9908j0411r8716j79386j39466j06426r3102r9151o7819p6821l275
9511A217243N8621Q8982Q3312O7023O8821N1557R1491Q0236M1102n3566P691r5180
9499A707333k42294k15678o1736k954p596p6556p2853n3550j8090N365K8031K2749
9487A012171n5946p6196m9621J0805M4472p454j2620K9431J3931j3565K6437J7536
$$ y = [2093847, 2079993, 1997557, 1904998, 1848464, 1900355, 1898361, 1857876, 1839437, 1815271, 1777475, 1775347, 1829891, 1862547, 1892179, 2016733, 2191020, 2488563, 2790559, 3145545, 3443918, 3731793, 3937609, 4004091, 3631915, 2999460, 2455378, 2066690, 1782358, 1646577, 1586753, 1576227, 1637480, 1773207, 1849787, 1893073, 1869653, 1834456, 1794162, 1813458, 1854577, 1895423, 1977904, 2041908, 2091816, 2081405, 1982689, 1803303, 1663837, 1557411, 1464309, 1365158, 1297339, 1220518, 1217243, 1275864, 1364846, 1448158, 1515181, 1584002, 1635559, 1727050, 1807286, 1848388, 1794822, 1802513, 1707333, 1465039, 1249361, 1187625, 1184671, 1177075, 1100519, 1027666, 974116, 956026, 961391, 989422, 1012171, 956225, 880029, 830408, 841213, 885685, 878231, 865611, 895042, 908973, 895408, 921845, 939381]
9475I39381n0053p2759r782j7809L8669K9340J2990J5669N6736k479K2321N9697
9463A021921l5705p6738j068Q7283M4520m9917o2440O7368k3424n682k2939j4649
9451I28530k3958L0524n0463k6768J6122M262J0471K3651M6455l0512k4822k099
9439I01393l103j1932Q726k9971K5367R953K6374J6447l8899m13J908J4415q777
9426I11488L4613K2893k6949P8J9283r996M243J4323M842n3789J8891L2192k0755
9413I51357k7689m058N6594k6377J8574P435L8670r696j0788j8065J2138k311
9401I85784j3631k6270l1350m1808M3292K0963o0496J1567J0182L2739N0318M827
9389I86117K2289M0207L497j4302n8195L350j9970k3166j8849j6050K8404j2469
$$ y = [939381, 889328, 816569, 806787, 788978, 827647, 856987, 869977, 885646, 942382, 939903, 962224, 1021921, 986216, 909478, 908410, 995693, 1040213, 990296, 927856, 995224, 971800, 966118, 943179, 928530, 904572, 935096, 884633, 857865, 873987, 878249, 888720, 912371, 958826, 928314, 903492, 901393, 898290, 886358, 895084, 865113, 890480, 900433, 926807, 943254, 904355, 903942, 905850, 920265, 911488, 946101, 968994, 942045, 942123, 961406, 951410, 955653, 969976, 974818, 921029, 939920, 972112, 951357, 923668, 919610, 976204, 949827, 968401, 975836, 1014506, 1004810, 994022, 975957, 988095, 985784, 972153, 945883, 914533, 872725, 916017, 936980, 876484, 888051, 898233, 930972, 981290, 986117, 1008406, 1048613, 1052110, 1037808, 979613, 982963, 962993, 939827, 920978, 904928, 933332, 920863]
9377I20863P0560J8477j6552l7289j6350K420P577m5675N295M0324M7951L6473
9365A034074k1037J3891k0368n9679l0504k4954r314m7140M8108N6664N9475M5155
9353A044371p4419j1561n47P868K9386k3221M598j7844n981n5504l9955M2874
9341I00065P2737J2006l8408n851R077K0247J2426k3771m4417K2628L3015M4552
9329A014306o155r9568j1117J5130L5868K9875n941L781n1356K0509r66j3330
9317I31036M881N713N2533M0065j7406l9320l0338m4366m8323L3144N5297J5742
9305I58658J9918P415K5554m6290p6365n7m2604l2499N5947M1632o761l2329K4237
9292H96456L0448j3798P6209M9047n5159j0907j7196J4650k2053n6759j5743L416
$$ y = [920863, 991423, 1009900, 993348, 956059, 939709, 942129, 949706, 904031, 909326, 949650, 997601, 1034074, 1013037, 1026928, 1006560, 946881, 916377, 891423, 882109, 834969, 883077, 939741, 999216, 1044371, 969952, 958391, 957844, 965712, 995098, 971877, 976475, 958631, 952650, 897146, 857191, 900065, 972802, 984808, 946400, 940549, 949626, 969873, 982299, 958528, 914111, 936739, 969754, 1014306, 1008151, 908583, 897466, 912596, 948464, 978339, 972398, 976179, 924823, 945332, 944366, 931036, 935917, 941630, 994163, 1034228, 1016822, 977502, 947164, 902798, 854475, 887619, 942916, 958658, 978576, 985991, 1011545, 965255, 888890, 888833, 846229, 813730, 869677, 911309, 904548, 872219, 896456, 926904, 913106, 989315, 1038362, 983203, 972296, 955100, 969750, 947697, 890938, 875195, 878611]
9280H78611J2946k5077K3731L402k2746l4739p2887k6563M9642O0106N6560K1142
9268I24128L05o38m6687n2737L2255O0342l1271k7665J0662k7959m5253l5291
9256G60191L4320k9421O798J4940r250r188j6795l1118K1872K1376J1038j6530
9244G58233J4125n0235j1436K3770q926L1545N0063j19r543o465n6597j2699M5185
9231G66901l3550J3661L3473k7508l1390k7477k0847n568o6959M2822M6227K6025
9219G15810J5810m3176O934K1496L2113L3170j9152k0689n4221o5799o6285j4056
9207E41955K9606K697M0275N7769L574j2441J0684j7425j3768K2909K208l6513
9195F31530l713j9062m0541O956K9397K8069l0797L0940q534L0816j7960j7067
$$ y = [878611, 891557, 866480, 890211, 893613, 870867, 836128, 763241, 736678, 786320, 846426, 902986, 924128, 924433, 923795, 877108, 824371, 856626, 916968, 885697, 858032, 868694, 840735, 795482, 760191, 794511, 765090, 771888, 786828, 777578, 768390, 751595, 720477, 742349, 763725, 774763, 758233, 772358, 722123, 710687, 734457, 725531, 757076, 807139, 807020, 797477, 791012, 734415, 721716, 766901, 733351, 747012, 780485, 752977, 721587, 694110, 673263, 667695, 600736, 643558, 689785, 715810, 731620, 688444, 695378, 716874, 748987, 782157, 763005, 742316, 688095, 622296, 556011, 541955, 571561, 574258, 614533, 672302, 675876, 663435, 674119, 656694, 642926, 665835, 668043, 631530, 627817, 608755, 568214, 575170, 604567, 632636, 601839, 632779, 624245, 655061, 637101, 620034]
9183F20034J237m59O374J6957n639J2961l9393m2336O4721M781k9242J1906P474
9170F29376O3347p1622p8123l003R872K1464N8952M367k3828o103L3016r138R111
9157F37688j2178J3554m5735k4614L475K6598M9431L7558j7918k2797l5607l0039
9145E79416Q410m878m1761O265N6249j9641k5353k8902M9214K5666o5919l4922
9133E03844l7030R6309O0452m4649o7344J6470K6088j589P628J2083n9009l7896
9121D75357j5258M6894J0735M3915k097j6817j1304m1928k2770j45L2044K9q4627
9108D14028m7117R0607J17114k471o0413Q324p087K0246j2326l0943m5628j4053
9096D30281j9002l550J8460j2455N0301J6675l4813n2661n6860k6174J3877N5134
$$ y = [620034, 621271, 620812, 627186, 644143, 638504, 651465, 612072, 569736, 634457, 639238, 609996, 621902, 629376, 692723, 621101, 542978, 539975, 549847, 571311, 630263, 634630, 610802, 604699, 637715, 628577, 637688, 625510, 639064, 593329, 568715, 572190, 598788, 648219, 685777, 667859, 645062, 609455, 579416, 587826, 582948, 541187, 547452, 603701, 584060, 558707, 529805, 579019, 604685, 538766, 503844, 466814, 563123, 623575, 578926, 511582, 528052, 554140, 552551, 560179, 572262, 513253, 475357, 460099, 506993, 517728, 561643, 559546, 542729, 531425, 489497, 466727, 466582, 498626, 498655, 414028, 366911, 457518, 574632, 572161, 511748, 520072, 512985, 533231, 520905, 489962, 444334, 430281, 411279, 407729, 426189, 413734, 464035, 480710, 445897, 393236, 336376, 310202, 324079, 379213]
9084C79213L6002L531K2285J0620m7645k8328k4531j4400J3893O082m7238q141
9072C01343N2769M8398Q367K4877J5065k074k8034m2662M8201M5558j4797l9820
9060D17191l7094J0118M4727k4810m6355J3986L0423J1725K7978o5424m687J8252
9048C96030J922L245P263J4444K7695k4775m2625P3453j1328k1358j1034J4718
9036D27650n9882q2518n165O7143Q75k2117K2106J8726j4232n8059O272p190k6090
9023B67519K6486O5112O985j2981o2330j6322K2753q288L9926R922j8052l1825
9011B88905M877K5080L0042k6430q208O4523r989m502p711q1073l4301J6941O3270
8998C21424k5427l5024j8756L3220K0347o2635K9636M1745r756Q315m4237P359
$$ y = [379213, 415215, 418746, 441031, 451651, 404006, 375678, 351147, 336747, 350640, 356722, 309484, 301343, 354112, 402510, 410877, 435754, 450819, 448745, 420711, 378049, 426250, 471808, 457011, 417191, 380097, 390215, 434942, 410132, 363777, 377763, 408186, 419911, 447889, 382465, 377778, 396030, 397952, 401197, 408460, 422904, 450599, 425824, 383199, 456652, 445324, 423966, 412932, 427650, 367768, 285250, 280085, 347228, 348103, 325986, 348092, 366818, 352586, 294527, 300799, 293609, 267519, 294005, 359117, 366102, 353121, 290791, 274469, 297222, 288934, 328860, 338782, 320730, 288905, 293782, 318862, 348904, 322474, 314266, 378789, 368800, 364298, 356587, 275514, 241213, 258154, 321424, 295997, 260973, 242217, 275437, 295784, 233149, 262785, 304530, 294774, 303089, 258852, 266211]
8986B66211Q722M486J5123M0310p046l6872m9541o6842J3577Q2461J7706o543
8974B81752j3880k4569r435L4438J7608n1550j5245K1764L1817M1265k06K5525
8962C39284l4184q4706j2919K3292n6985l9964K9112P919O5669P285J6963k1120
8950B39646m5572K3854M3869n0953j4191m734J7340K6434j1283k6609r572M3246
8938B31475M9825L9987K0764p6881k4596j8538l1708j6948O2877J3344J1744R771
8926B71116Q112N768m4543J3266k681j677n5211k1395k4899l2989M3175L5340
8914A93382j0624M8007o68j2113j4026k7526K9661l9780j4283L2373L9975R834
8902B34212o301j9364k2163l4242j1722Q8568M9990m0491K1372J9988j3291O582
$$ y = [266211, 274933, 279419, 294542, 334852, 327806, 290934, 241393, 174551, 188128, 270589, 288295, 281752, 267872, 243303, 233868, 268306, 285914, 234364, 219119, 240883, 272700, 313965, 313759, 339284, 305100, 220394, 207475, 230767, 173782, 133818, 162930, 170849, 236518, 243803, 260766, 239646, 194074, 217928, 261797, 210844, 196653, 191919, 209259, 235693, 224410, 197801, 188229, 231475, 281300, 321287, 342051, 265170, 240574, 222036, 190328, 173380, 236257, 249601, 261345, 271116, 279228, 284996, 240453, 253719, 251038, 249361, 194150, 172755, 147856, 114867, 158042, 193382, 182758, 230765, 230097, 217984, 203958, 176432, 206093, 166313, 152030, 184403, 224378, 234212, 227911, 208547, 186384, 152142, 140420, 228988, 278978, 238487, 259859, 279847, 266556, 273138]
8890B73138k8930j0976K9431K3924K9663j2904K9153J02021L3572j1616N898M2660
8878E05034N3552k8725n1765j20749o3199n0231k0878m0241k5738k0433m2234
8867I4393J0869O1666M9040Q877J4671K0094n3427k3252n6107m358M9189J3896
8855A85551j8088n4387K9603J2702k5355l5401N6747j3058K9121J7020r91O2341
8843B45805m5583m4004L2842l6883l3360K8681K3344k9913J6202J2080M6490r902
8831B05799l2855l5822j8348n2263j5794N3867N0269O339j4506n2798j4390Q971
8819H8469n083M2126L0645J1504j7346o5771j3607j1078M1649o469l6423K1316
8807G9932q075m6963K8369K6106q782m868O6907P9L7683K2024k5445N1466l5567
$$ y = [273138, 244208, 233232, 262663, 286587, 316250, 303346, 332499, 434520, 468092, 456476, 462374, 505034, 558586, 529861, 478096, 357347, 294148, 243917, 223039, 182798, 157060, 136627, 94393, 105262, 166928, 215968, 224845, 239516, 259610, 206183, 182931, 126824, 122466, 171655, 185551, 167463, 113076, 142679, 155381, 130026, 94625, 151372, 138314, 167435, 184455, 183464, 245805, 200222, 156218, 189060, 152177, 118817, 147498, 170842, 140929, 157131, 169211, 215701, 205799, 172944, 137122, 118774, 66511, 50717, 104584, 154853, 161192, 146686, 93888, 79498, 88469, 83386, 125512, 156157, 167661, 150315, 84544, 70937, 59859, 101508, 95039, 58616, 79932, 71857, 24894, 53263, 79369, 70587, 65719, 132626, 132705, 170388, 192412, 166967, 218433, 182866]
8794A82866l9558o5858o274J6926M3430r630m5088l6180J0324L629K0508k8451
8782D6644r259k2473k934Q3127L2427k8762K8016K2258j7220L3332j5401m0193
8770A09562m2909n34j025R4994J1623r1368m7693L0300k8292k5411J7302k7710
8758a161K9845m142O9076J3656l0277L7359M0046R015K8666o6279n2330P273j6631
8745F4116K1137J1660j8524k8078k3977K599j5035j8341P2449P6250M9666o8516
8733A25406m9197j4956K2151J8389n2068m6255l1402P0218R5622M1868o426j9343
8721A54007j3984p6613l4907M2734N1881J9899l2713m6109J5079P9410J6272J8963
8709A93919J1633O132q4482n6722k8502J2899K2677j8419k2809K076J530k0888
$$ y = [182866, 143308, 77450, 71176, 88102, 131532, 121902, 76814, 40634, 50958, 54587, 75095, 46644, 37385, 14912, 11978, 95105, 127532, 98770, 126786, 149044, 131824, 165156, 149755, 109562, 66653, 66119, 65094, 160088, 171711, 80343, 32650, 62950, 34658, 9247, 26549, -1161, 28684, 24542, 93618, 107274, 76997, 114356, 154402, 163417, 192083, 125804, 73474, 80747, 64116, 85253, 96913, 78389, 50311, 26334, 28933, 13898, -4443, 68006, 144256, 193922, 125406, 76209, 61253, 83404, 101793, 49725, 3470, -27932, 42286, 137908, 179776, 173350, 154007, 140023, 63410, 28503, 71237, 123118, 143017, 110304, 64195, 79274, 158684, 174956, 193919, 205552, 211684, 127202, 70480, 41978, 54877, 77554, 59135, 36326, 38402, 39932, 19044]
8697A9044J6811L303M0468p252l5499k7948j1778Q486j6420L1321P7083p8696
8685A8923k5551j2518Q15K6371l082N1839K3366N3206N2005N7878j0287j0327
8673B22638k8027j4212o7307k364L9543K6744q2689p9136J6400j0367L2001K0072
8661G3296m205q95L0526k6638l7232j5590J585P8760L2398k4029J3683k846J3959
8648A32772k3736l7694L681L3679n452j0165m7937j9132K1673K7286L1656K6312
8636A32943m8679J951K6542O589J1502k6857R585k372m9986l0442K0772N0548
8624A02096L5537k0913K4524O8201l900o8354l0885j6688m5983L7142J809j8072
8612F4514l9336q893N6848P2621K6208K9474k7739j7228J7057n5001l9429j5708
$$ y = [19044, 35855, 39158, 79626, 72374, 36875, 8927, -2851, 5635, -10785, 20536, 97619, 18923, -6628, -19146, -18331, 8040, 4958, 56797, 80163, 133369, 185374, 243252, 232965, 222638, 194611, 180399, 113092, 110728, 150271, 177015, 94326, 15190, 31590, 21223, 53224, 73296, 69091, 68196, 98722, 72084, 34852, 19262, 20847, 99607, 132005, 107976, 121659, 118813, 132772, 109036, 71342, 75023, 108702, 103250, 93085, 45148, 26016, 47689, 74975, 106631, 132943, 84264, 86215, 112757, 119346, 130848, 103991, 113576, 111204, 61218, 30776, 51548, 102096, 137633, 116720, 141244, 209445, 205545, 137191, 106306, 89618, 43635, 80777, 82586, 64514, 25178, 16285, 73133, 145754, 171962, 201436, 173697, 156469, 173526, 118525, 79096, 63388]
8600F3388J9968N8507N1662m822O957j0841r795P2284J6446p469J6405o6316q485
8587A97889j7528o3936L594L7913m0152l1948N0772j5199k6986k046j858j8483
8575G2032P075k644l4997l957j9386K815J5299k1558p284l7664J8209q705L8677
8562A7912M9266J0986k299p4255o186L1014K7624J0736K269j3314m2279j3058
8550a584J8076O5239k6639l2750M05Q0846L5440M0568N0823N170J9157M3222J9787
8537C17760n1909p0873o4576o708M699j511j5739k1520m7949M5230J9600J3400
8525A19904k8397j141n9887k0957n3463P493Q8755L1443j4821L269K3715K854
8513I8767J5491O2876q19L3325n8730k9667n9234j8925J2172K7825L2569L541
$$ y = [63388, 83356, 141863, 193525, 188703, 195660, 184819, 175024, 247308, 263754, 256285, 272690, 206374, 197889, 180361, 116425, 120019, 157932, 117780, 85832, 136604, 121405, 94419, 92373, 90515, 72032, 79107, 76463, 41466, 37509, 18123, 20938, 36237, 14679, 7395, -30269, -12060, -20765, 17912, 67178, 78164, 75865, 1610, -4576, 26438, 54062, 64798, 67067, 53753, 11474, -1584, 16492, 81731, 55092, 22342, 22747, 103593, 139033, 179601, 230424, 235594, 254751, 297973, 317760, 265851, 194978, 130402, 123694, 128393, 126882, 111143, 89623, 41674, 86904, 106504, 119904, 91507, 90366, 30479, 9522, -43941, -36448, 52307, 83750, 68929, 72198, 95913, 98767, 114258, 177134, 176315, 209640, 150910, 121243, 62009, 43084, 55256, 83081, 115650, 119191]
8501A19191p0592J7996j9690l0457m2662L0085O5414R51j2770q193L9713L2567
8489A21553k2376R163N0360P856m710l7740n1637K291j7531j3641L0422N6375
8477A30385L8521j6358k5205K0128L1650j7749j3652Q3385k4014r3845o2101K3512
8465G4657j6560M701j991l6954l2115j5205K3441M3459J9107M2550j7790l1577
8453E5723n0654J0985R027l3784l0519N7013M6461k850j0437k8874K7647p090
8441D2648K4273n5935n5255K698M015P544J0419k8961N99M549k7030m346j5279
8428i0061L8219L283N2740M4212Q31K1685Q354N3195k5897n3338q69k3684o290
8415B2380Q581Q996J0109K6150m1425o2608J3487R0762J0650M5549j5797p5982
$$ y = [119191, 48599, 66595, 46905, 16448, -26214, 3871, 69285, 70236, 57466, 49273, 88986, 121553, 99177, 108340, 158700, 166556, 161846, 124106, 72469, 74760, 57229, 43588, 74010, 130385, 168906, 152548, 127343, 147471, 179121, 161372, 147720, 231105, 207091, 113246, 51145, 74657, 58097, 62798, 60807, 23853, -8262, -23467, -26, 43433, 62540, 105090, 87300, 55723, 5069, 16054, 25081, -8703, -39222, 17791, 64252, 61402, 50965, 22091, 49738, 42648, 66921, 10986, -44269, -41571, -37556, -30012, -19593, -48554, -47955, -43406, -70436, -74782, -90061, -51842, -48559, 4181, 48393, 49224, 70909, 79263, 132458, 106561, 53223, 52354, 28670, 22380, 30961, 39957, 50066, 76216, 34791, -27817, -14330, 76432, 87082, 132631, 116834, 40852]
8403D0852o6551m144K039J7262L0016J836j9944j3187j170K207J6518K6580O212
8390C8526J8020l2110n201J0615p860j5349K3269J360k0470K1143j1809j3266
8378F868M7529L7679Q11m8503l6519m4301l2494M4698M9213j0360J3908l1084
8366b555K2530J9101J5886L1217n0894m7663k3196o469J9103M6511O1433q347
8354G6657k8674j4843N5776j9143o3137J1560K1635j9241N7269m7160m97M803
8342C5005o1325K5841M1882K5453k4706K372l5629l7182j3455L2956N8720l0530
8330A9402p5176L5165O5014k386K2966p318m7360m5118m2723l1661J7462L5316
8318e6417M9150k3198N040j5590k0083K7553J040M1028M7233k5877m010N410q6903
$$ y = [40852, -25699, -29843, -27804, -10542, 19474, 21310, 1366, -11821, -12991, -10784, 5734, 32314, 38526, 56546, 24436, 19235, 29850, 21990, 6641, 29910, 31270, 10800, 31943, 20134, 6868, 54397, 92076, 92887, 44384, 7865, -36436, -68930, -24232, 24981, 14621, 28529, -2555, 19975, 39076, 54962, 86179, 35285, -12378, -35574, -42043, -22940, 23571, 85004, 76657, 47983, 33140, 88916, 69773, 6636, 18196, 39831, 20590, 77859, 30699, 30202, 35005, -26320, -479, 41403, 66856, 42150, 44522, 8893, -28289, -41744, -8788, 49932, 19402, -55774, -20609, 44405, 42019, 64985, 57667, 10307, -34811, -77534, -109195, -91733, -56417, -7267, -30465, -25425, -41015, -61098, -33545, -32505, 8523, 55756, 29879, 25869, 31279, -55624]
8305e5624m1911J8671O853n056J8877q113n489j2884k737L8721L2432M7353J8395
8292D9488l9828o6008L2230L7242n6627j7093N0646M7066k4309L5458J4793k3645
8280C9413l46n7451k7279J0025l8202l6822L593N9510J5018J3333L0406M5618
8268E6816L3622Q749k5749j21286j5267k5582M1545K9146r265K5732L5972n540
8256B8893Q1078J7769j22312r7105k4330Q7551L8626m4130j0484O6822L620J4809
8244D0807m5363o7331o120P0079P8601k5110l7j2060p0103j7843K0589L1163J6314
8231A3586n444o3020k1328L3514L6395L0498l8778J4121K0259n6424j5309o391
8219e8321N6657L7191J5400l1050k059k382k8870l319J1608l4099K948J0958J5834
$$ y = [-55624, -97535, -78864, -72011, -77067, -58190, -66303, -71792, -84676, -87413, -48692, -16260, 31093, 49488, 9660, -56348, -24118, 13124, -43503, -60596, -9950, 37116, 12807, 48265, 63058, 39413, 39067, -18384, -45663, -35638, -73840, -110662, -107069, -47559, -32541, -19208, 11198, 56816, 90438, 99187, 73438, -47848, -63115, -88697, -47152, -18006, -27271, -1539, 34433, 28893, 109971, 127740, 5428, -91677, -116007, -28456, 10170, -33960, -44444, 22378, 25998, 40807, -4556, -71887, -78007, -7928, 70673, 45563, 45526, 33466, -36637, -54480, -33891, -2728, 13586, 8142, -54878, -76206, -42692, -6297, 24201, -14577, -456, 19803, -36621, -51930, -58321, -1664, 35527, 50927, 19877, 17818, 15436, -13434, -16753, -5145, -39244, -36296, -25338, -9504]
8206i504J8858J540R020j912j2901j0164J4946k5686p065k5642K8063M3547J4851
8193C7951l0874p0609m9762J4915R10N4897N4485L8549j9050k2301p995K4381
8181B5497M0515l4609K5089R3952k0179l9172o1802l6008p43J3185J3894J3043
8169C2662l6033j4393J2711J6533N476n78K1992m0441k0548k6540j9637K7720
8157d1076M0792J9021J1883j6536M991j8942j3010J9341m5623n3371J5644M3191
8145c3695J6028j7692p747k6182M6421J7836o9349r119K5609r813M556N0086J1433
8132a628l4506K4738J7182l3833k2735O963L6923M2366j7590k0550K7385l5181
8120a0466Q243J0145q928P6931k859m819J3255J4818j281k7993P346m9791J1121
$$ y = [-9504, 9354, 10894, 19914, 18002, 5101, -5063, 9883, -15803, -22868, -48510, -20447, 23100, 37951, 7077, -63532, -113294, -98379, -97469, -42572, 11913, 50462, 31412, 9111, 1116, 25497, 66012, 31403, 56492, 150444, 130265, 91093, 29291, -6717, -7460, 5725, 19619, 32662, -3371, -17764, -5053, 11480, 16956, 16378, 38370, -2071, -22619, -49159, -68796, -41076, -284, 18737, 30620, 14084, 19075, 133, -12877, 6464, -39159, -92530, -76886, -33695, -17667, -35359, -43106, -69288, -22867, -5031, -74380, -83499, -57890, -67703, -63147, -13061, -1628, -36134, -11396, 5786, -28047, -50782, -43819, -6896, 35470, 17880, -2670, 24715, -10466, -2223, 7922, -1006, 75925, 73066, 68247, 81502, 96320, 95039, 67046, 74392, 24601, 35722]
8107C5722O282J3452J6669k8588j0170k3399n3237j4300K7774L9387l981k5931
8095b0320m0823k3447Q2286K1795l3349l2751M448p9675n734L1867N2320J9154
8083b4229p237j280j816m9012l0118L9565J132M1765m810J984m7640N0162K7505
8070d029k4202n9581m1372K5691L3455L4100M2121K9992k641M08j2388L310M6832
8057G1696n906q1683k6540K137N4165K7804j4074R069M92m703n0901k5985J0834
8044c3595M0539L3574k2088l9497n463j3046k876P430J3939K1396J4986K8459
8032D3758k9031K4869o998j2833j2153j4949m832N508l4871k5804l1046J557J4313
8019h2512R299K5197M413N1029N3265L3862k4179n3177m1022m8721m030Q1592
$$ y = [35722, 42004, 55456, 72125, 43537, 33367, 9968, -43269, -57569, -29795, 9592, 5611, -20320, -61143, -84590, -2304, 19491, -13858, -46609, -42161, -121836, -127570, -95703, -43383, -24229, -31466, -32746, -34562, -83574, -113692, -74127, -72995, -31230, -36040, -34056, -81696, -31534, -4029, -28231, -87812, -129184, -103493, -70038, -35938, 6183, 36175, 33534, 33942, 21554, 24864, 71696, 65790, -15893, -42433, -40296, 13869, 41673, 27599, 36668, 37160, 32457, -18444, -44429, -33595, 6944, 40518, 18430, -21067, -26530, -39576, -42452, -35022, -21083, 313, 15299, 43758, 14727, 39596, 32598, 19765, 7612, -7337, -12169, -6661, -41532, -67336, -98382, -96825, -82512, -73213, -48016, -43603, 7426, 60691, 94553, 70374, 17197, -23825, -72546, -76576, 5016]
8007E016K1470R738j0423j5826k2253o214o11K6073J3350q270o3460L9435K5377
7994A3402k6975k2801j074l613p767K7133M0703L5627l8593N574j4983J9089J8998
7981D4720p4954K1410N0616L6020Q224n9493O578k7372r254L2559l9538l8466
7969d8950j5398p085N282m801m4709M5020L5961K7822j8797J083K5247M083N1224
7956E5982L5562n8668p6879l6667J5741l2688j6022p734J4075M0092L4539L818
7944b8849J8204l6035n6997M0920O2772k6059j6661M3363J6982j9300k1977M7694
7932B4057Q709o086n373n4175J1920K8794o7328m2048K5803M5861j9386m1079
7920i0331K684k37k0382P535J5686K4751M2889m2295l6899L6879M9232M8038K4947
$$ y = [5016, 26486, 36224, 25801, 9975, -12278, -18492, -19103, 6970, 20320, 12050, -51410, -11975, 13402, -13573, -36374, -37448, -41061, -48828, -21695, 19008, 54635, 16042, 21616, 6633, 25722, 44720, -30234, -8824, 41792, 77812, 86036, 26543, 33121, 5749, -3505, 29054, -10484, -48950, -64348, -71433, -66151, -70952, -115661, -70641, -34680, -6858, -25655, -24572, 675, 4758, 55982, 91544, 32876, -44003, -80670, -64929, -97617, -113639, -121373, -107298, -67206, -32667, -28849, -10645, -46680, -103677, -62757, 15, -26044, -42705, 658, 17640, -1660, -23637, 24057, 32766, 26680, 21307, -32868, -20948, 7846, -59482, -101530, -75727, -29866, -49252, -90331, -87647, -87884, -108266, -100731, -85045, -60294, -17405, -59700, -96599, -59720, -10488, 37550, 62497]
7907F2497q424l8693N208K5650j0998r145L676l8301J0537o799k4758M504K9851
7894D805l5151k8722M3779J5294K8587K2112J0060l8892o5596j0377R651K5079
7882a9371K6327L3975p782K8744k3437L6322P743J0415K1972j3957l9973p6859
7870a5881p6208L0393L2088k0515J123k8540k6658J8804L9047K5668k749j9113
7858d2541J8616k7092j204M0656K6636l7681J8240k9291L0876K8341l7602m6015
7846e8061n809j3804l4654o96K2708J3888K7118L5888k4257M3530k5736k0437
7834d0322l4613M2203J3059j6597p683l812k7941j05608r932M0771K2455Q497
7822a19523L8120N0091j7902k2654K3615p973l0819k9823k8569m9756L303J27406
$$ y = [62497, 54073, 15380, 20588, 46238, 35240, 26095, 29771, -8530, 2007, -4792, -29550, -25046, 4805, -30346, -59068, -15289, 5, 28592, 50704, 60764, 21872, -43724, -54101, -44450, -19371, 6956, 40931, 33149, 61893, 38456, 74778, 82521, 92936, 114908, 100951, 60978, -15881, -92089, -61696, -29608, -50123, -49000, -77540, -104198, -85394, -46347, -20679, -23428, -42541, -23925, -51017, -52221, -11565, 15071, -22610, -4370, -33661, -2785, 25556, -12046, -58061, -63870, -77674, -112328, -113024, -90316, -76428, -49310, -13422, -37679, 5851, -19885, -40322, -74935, -32732, -19673, -36270, -43953, -47765, -75706, -181314, -191246, -150475, -128020, -119523, -81403, -31312, -49214, -71868, -48253, -56226, -87045, -116868, -145437, -195193, -191890, -64484]
7810f4484M8365K0715L7564K965j4685n6749n2370J4829n0456m985M353M0724
7798g4214K5255M1240o829R299J9072j710M4517m409j5538j4659k9907j4839N5146
7785C2424J8293m9630j4129r714L1041L9415o2871n8984l9664J6035M7298O1976
7773A1490r110j3037j8755L1208M7764m1721n3120j1150k3678j6760K859j1884
7761a05894l9548J4739Q3077O9142K8871k1621j4368J7195M4819j0816q796l3298
7749B3502q8778n776P403l0657K9521J1232J1173Q755K4666m1111m1318k0751
7737a12139M0182O5553L5187j1675M228K373j247k7779l4294k8334n88Q698K7154
7724c2681L2868k3802m2701k2046N0247P522k4030p926P80k1153J2030M846k0565
$$ y = [-64484, -16119, 4596, 42160, 45125, 30440, -26309, -78679, -63850, -114306, -119291, -114938, -74214, -48959, -7719, -14548, -5249, 13823, 12113, 56630, 52221, 36683, 22024, -7883, -22722, 32424, 50717, 1087, -13042, -22756, 8285, 47700, -15171, -74155, -113819, -97784, -50486, 11490, 2380, -10657, -29412, 1796, 49560, 7839, -45281, -56431, -80109, -96869, -94010, -105894, -145442, -130703, -47626, 21516, 50387, 28766, 14398, 31593, 76412, 65596, 56800, 23502, -65276, -71052, -63649, -94306, -64785, -53553, -42380, -33625, -8959, -50070, -91388, -112139, -71957, -6404, 28783, 17108, 21336, 23709, 22462, -5317, -39611, -67945, -68533, -59835, -32681, 187, -23615, -66316, -88362, -38115, -30593, -54623, -62549, -61769, -82922, -70892, -66046, -86611]
7711h6611n881K4211J3387O165N9734N8595l8396q0249k57J5311N4685m1984j2509
7698c3799Q258n8174q779L2346J9218j6856m578L3653K8338j2177J6361M3465
7686D7276J8008k4508l8304m4513J5487O866M3049K2697J818n4688k4126m7508
7674g8446k853J5314k6432m5578N0737N9561k8389j8381O242L6163M2870J7913
7662B8721K6617o494l8031o6043m2422L5996Q3096n1263k4561K8120O7611l1099
7650A0248k7523o135j5629k3839k6373J7173M4781J5958k3274l3176l3429j6786
7638a18004k975K1651j9516J09095L8981L830l9516L158j2775j9996J4403q912
7626c0576J4125K7600J4734k2099J0038L2339n3059m4103l1260L4614J2581P743
$$ y = [-86611, -92492, -68281, -54894, -48729, 11005, 69600, 31204, -49045, -49302, -33991, 20694, -21290, -33799, -25541, -83715, -92494, -60148, -40930, -57786, -62364, -28711, -373, -12550, 3811, 47276, 65284, 40776, 2472, -42041, -26554, -19688, 23361, 46058, 47876, -6812, -30938, -78446, -81299, -65985, -92417, -137995, -87258, -27697, -56086, -74467, -68225, -32062, 10808, 28721, 55338, 48844, 10813, -55230, -97652, -61656, 21440, -29823, -54384, -26264, 41347, 10248, -17275, -23410, -39039, -62878, -89251, -72078, -27297, -11339, -34613, -67789, -101218, -118004, -120979, -99328, -118844, -9749, 29232, 33062, -6454, -3296, -16071, -36067, -21664, -30576, -16451, 11149, 25883, 3784, 13822, 46161, -6898, -51001, -82261, -47647, -35066, -27323]
7614b7323m8176l8313l3510L3200N4416J6323o017l1593r082M0604N5035l805
7602A759k0262j7090M2611M1370k5580l9485k6304j5287M4222K3913L3110m1730
7590A247n6599o4532K0750M9183Q827J8775K1633P268l364l7420l0850K9259N0807
7577A4984O393o8537k4834J1893M1240n7338j9774m183J7114L2889M1986j0742
7565a8909l5445n1726K0884k0008m5705N0049O9450J3718m6994n2889L008L3471
7553h1096K3047Q290j8353K1977K9125N27l3384J504o0135m276N5129L1897J4594
7540a1154O6864l5110p8100j9326K905K7869j0060J8011J5717N1250j5339n572
7528G955L942N6646K3246m6891m4672q466j9279o3056o222p366K0209P8589j3638
$$ y = [-27323, -75499, -113812, -147322, -114122, -59706, -43383, -49400, -80993, -90075, -49471, 5564, 1759, -18503, -35593, 7018, 48388, 22808, -16677, -42981, -58268, -14046, 9867, 42977, 1247, -55352, -119884, -99134, -49951, -41124, -22349, -716, 6552, 3188, -34232, -65082, -35823, 14984, 21377, -47160, -71994, -60101, -18861, -76199, -95973, -100156, -83042, -50153, -8167, -18909, -54354, -106080, -85196, -105204, -150909, -100860, -31410, -17692, -64686, -117575, -114567, -81096, -58049, -49759, -68112, -46135, -17010, -16483, -49867, -48363, -108498, -112774, -57645, -25748, -11154, 55710, 20600, -57500, -76826, -73921, -46052, -56112, -38101, -22384, 28866, 13527, 7955, 11897, 68543, 91789, 44898, 226, -8240, -27519, -90575, -96797, -104163, -83954, -5365, -19003]
7515a9003O616k982J3511k9276m7878K589L9998N0974O980k8704j2646j3065K443
7502c0443O1702Q544J4386K7053m2235m6273k0864J6858M0755O399l6075k4872
7490b5065O244j5283r789M2563K4462Q615n8239m3266l9780l3863l3228K714P6547
7477i7368q079j9571K4632K4277J3089n4498n3458M4788K3736J0534L4486L3874
7465b3558k9594j4786K8124N573J9316j0700j0012j7969k1490K0300l428l058
7453f1282q342k2657R492o763n5660M5901O3026Q359l524N3435N1800L3574l0486
7440G6873j9441j2368l1502p171K7628L6817P959o2551o5320K5587J4977m3208
7428e1720l1961J0489K1304R858M477L9059m0437L8865J8565j2552p9639k960
$$ y = [-19003, -12387, -15369, -1858, -31134, -79012, -76423, -36425, 14549, 21529, -7175, -19821, -32886, -30443, 31259, 39803, 54189, 81242, 39007, -7266, -28130, -11272, 29483, 35882, -193, -25065, -18821, -34104, -43893, -1330, 23132, 31747, -26492, -69758, -109538, -143401, -176629, -173915, -97368, -105447, -125018, -100386, -76109, -63020, -117518, -170976, -126188, -102452, -91918, -57432, -23558, -53152, -67938, -39814, -34241, -14925, -25625, -35637, -53606, -75096, -54796, -58224, -61282, -69624, -92281, -82789, -89552, -145212, -99311, -36285, -27926, -31450, 21985, 73785, 107359, 76873, 57432, 45064, 13562, 6391, 34019, 70836, 78795, 16244, -49076, -23489, -8512, -51720, -83681, -73192, -51888, -42030, -37553, 1506, -38931, -66, 18499, 5947, -73692, -76652]
7416g6652J5635q526N8619J0294O688N9711N6617m5889p7847n8454J9998K8311
7404a1495l2663K4661Q0155o2757o9037l3480j5797L2780P4719J5027m0218l4800
7392g2905l4059M5562O3349k596l5396k372n1608k9741K360O487K5797J1820m7503
7379a20805K1508M1951O9059M7941K9479l3935j8163m121P2650k3632l8917K6636
7367F9651l3077l9619l5062k4682K2919J3906l3236P6459K7840l2004m1960N303
7355b3562O9698j64o2964n7969O3819J7371j0130L1771k502n5706k022L8719j1609
7342e250o035n9996j2428K9032r555q812N668M922L531P742K2070k441L8750L0149
7328C7347J1318m1396J3816J8940K8956K1983O242o6302q5294K3448n012m0858
$$ y = [-76652, -61017, -69543, -10924, -630, 6058, 65769, 122386, 76497, -1350, -59804, -39806, -11495, -44158, -19497, 60658, -2099, -71136, -104616, -120413, -87633, -12914, 2113, -38105, -72905, -106964, -61402, 1947, -649, -36045, -38417, -90025, -119766, -117406, -110919, -85122, -73302, -120805, -99297, -57346, 11713, 59654, 89133, 55198, 37035, 32914, 105564, 81932, 43015, 69651, 36574, -3045, -38107, -62789, -39870, -25964, -59200, 17259, 45099, 13095, -28865, -23562, 46136, 45972, -16992, -74961, -11142, 6229, -3901, 27870, 25368, -30338, -32360, 6359, -5250, -11285, -71281, -83709, -54677, -64232, -73044, -67376, -62454, -58923, -51181, -29111, -31552, 7198, 37347, 48665, 7269, 21085, 40025, 68981, 90964, 97206, 30904, -54390, -30942, -35954, -76812]
7316g6812O8536l1918k0289L8135m9887K6822O8419L4415k4103k7435m2134J2414
7304b3837j4215k9420L8350J105j1944k757R309j766k4282O741k909K3515K0083
7291a2027n7934k6740O2058M4389K1193j9342l3087k522M6408j2805m5313n1686
7279h7408K183L1223N3318J336k8963k4733j0303p11J6965K7626R221k7102l6473
7266g3821N846J2274l7917m1646L2969Q213o699L5661O5707J0825l4381l7667
7254f0636J5O1387j3965J1430m527p665J6045K7214j9225L1080P8246l8447n7024
7241B3928o0303m10n153M8417K2631m1151j7672M8392j8046j5291J4308J2485
7229A2135R1757j3834r213l7170n9244m4539K7846M0230J799j4758K2120k1805
$$ y = [-76812, -8276, -40194, -60483, -22348, -72235, -45413, 23006, 57421, 33318, 5883, -36251, -23837, -38052, -67472, -29122, -28017, -39961, -42718, -33409, -35175, -59457, -52716, -55625, -32110, -12027, -69961, -96701, -34643, 9746, 30939, 11597, -21490, -24012, 22396, 9591, -35722, -87408, -85225, -54002, -684, 652, -28311, -53044, -63347, -64058, -47093, -19467, -10246, -37348, -73821, -67975, -55701, -93618, -135264, -102295, -94082, -100781, -65120, 587, 11412, -22969, -60636, -60621, 766, -13199, -1769, -6296, -13961, 2084, 29298, 10073, 41153, 119399, 80952, 23928, -36375, -36785, -41938, 6479, 29110, -12041, -29713, 18679, 633, -14658, -350, 12135, 103892, 90058, 80845, 43675, -15569, -60108, -32262, 7968, 9767, -4991, 17129, -4676]
7217d676j933k3837k4534k9625j0388M2749J7537j766k2795m9448o7262k8923
7205b04901J3054O6686R5388L8083l5330n8497J0998L5167k7722k3153N221O0915
7193b4091P6768k9097k5309n274n0534k9648L4498M0908O4j8716K9093o235k710
7180a0283k1762o882j920k6793j3997K3532L5680J4436R84l0415M739M0142K3785
7167C1246n7718l6670n96K581Q3228K9811l7420k4569k1674L8907N2461m7578
7155A2009q0200m5229O9O641L997l1608j1194L8527J6820m568M4888J9590J5545
7142a4713K1030K102l1231o7507N386O1435K140j2802k2678P208K5500K1771l983
7129f342k9559n2622j5745L0181L2588M4139K9786r786j4683k3613q1159r626
$$ y = [-4676, -6609, -30446, -54980, -84605, -94993, -52244, -34707, -36473, -59268, -108716, -175978, -204901, -191847, -125161, -29773, 8310, -27020, -85517, -74519, -39352, -67074, -90227, -85006, -24091, 52677, 23580, -1729, -7003, -57537, -87185, -52687, -11779, -11715, -30431, -1338, -7573, -10283, -32045, -38927, -40847, -67640, -81637, -58105, -22425, -7989, -7005, -37420, -32681, 7461, 31246, -26472, -63142, -63738, -61157, 22071, 51882, 14462, -10107, -31781, 7126, 59587, 12009, -68191, -113420, -113351, -106710, -102713, -134321, -145515, -106988, -90168, -94736, -49848, -30258, -14713, 6317, 8419, -22812, -90319, -84933, -23498, -21358, -34160, -56838, -49630, -24130, -2359, -6342, -35901, -88523, -104268, -74087, -41499, 2640, 32426, 22640, 7957, -15656, -96815, -106441]
7117a06441K3119O299M477K727K7438p905L6907J4473o1084N001P6235R638m9526
7104a8642j6371k0356L3306n617M1593j3017n273M2796k092K9897j6903n5918
7092f597k0255j1935K6189J2023J6506K363K0831j4395n3768m0005K952o920K8307
7079d4704J7391j8428j9523l4195r510K34L4808J8639P507L9360m5613l1401J9358
7066f6077K8276J9208M3513j0220j6327q250j9911j4037M701n619l470p3543l3910
7053a55666K4016O1948M4456J1645J6941r18J9266n5099l4080L6457L0802j3722
7041a3954n146Q731o6256m6452l5766L3679L0885M5365L001j4927L4882N7478
7029C1520K5538l2676l0372J1370K6235O595l3468k4681O0643l5376o3478n0005
$$ y = [-106441, -83322, -77023, -72546, -69819, -42381, -50286, -13379, 1094, -59990, -54989, 21246, 30884, -18642, -35013, -55369, -22063, -27680, 13913, 896, -4377, 38419, 36327, 66224, 49321, -6597, -26852, -38787, -12598, -575, 15931, 18294, 39125, 24730, -29038, -69043, -66091, -73011, -44704, -27313, -45741, -65264, -99459, -108969, -108735, -73927, -55288, -47781, -8421, -54034, -85435, -66077, -37801, -18593, 24920, 14700, -1627, -9877, -29788, -43825, -39124, -44743, -48213, -121756, -155666, -131650, -69702, -25246, -13601, 3340, 2422, 21688, -33411, -67491, -31034, -232, -13954, -19100, -10369, -76625, -123077, -158843, -125164, -94279, -48914, -45913, -60840, -25958, 31520, 57058, 24382, -5990, 5380, 31615, 38210, 4742, -19939, 40704, 5328, -58150, -108155]
7017a08155O930O1840L1098J2552J4623r977l8739l071m3056n0963j4736K2650
7005a19004K1421K4750M3001q026O8530j4753j1588j1370k6554j1094P289J5984
6993b1414j7257k2015j2149R409N584J2697K9990k3774l1282j7505K2237K6341
6981c9138P426Q409k1080l3089j9378M4888L4117k2418j9626P3766N7385j6555
6969E4707J12j8654r383J4802J1153j6121J7283J1259p0711o7612L4891J1657
6957b6617o906K9156j1655K2222Q334k0165m68P2380K7804n5398l6193o9755k1487
6944h8748k261j1220j5997N6797K9842j7279j1308O866K9970K7407m869J9323
6932A8523m5463J4317L0883L0370O096L8304J8986l7016o5678m1986M6302Q675
$$ y = [-108155, -101225, -39385, -8287, 4265, 18888, 8911, -29828, -32899, -75955, -126918, -141654, -119004, -97583, -72833, -29832, -37858, 30672, 15919, 4331, -7039, -33593, -44687, -37398, -21414, -38671, -60686, -72835, -63426, -57842, -45145, -15155, -38929, -70211, -87716, -65479, -39138, -31712, -23303, -44383, -77472, -96850, -51962, -17845, -40263, -59889, 13877, 71262, 54707, 54819, 36165, 26782, 41584, 52737, 36616, 53899, 65158, -5553, -73165, -38274, -26617, -33523, -4367, -16022, 6200, 14534, -5631, -6099, 66281, 94085, 38687, 2494, -67261, -88748, -91009, -102229, -118226, -61429, -31587, -48866, -60174, -53308, -23338, 4069, -800, 18523, -26940, -12623, 18260, 48630, 54726, 93030, 112016, 75000, 9322, -32664, 13638, 22313]
6920B2313l1625N2606Q484j70m4904n3576K6650N3725K629j6719P2077L6956p637
6907A20809J2012l3317K852M8214j6136o6945o1209j03574r254L8453J3580O4462
6895I947K717L938n5701r940L6437L1820N957o7J4394K933J5340N065j0957p52
6881E1131n6892l0806L6873K2049l0617o8226l459m4911L98p760K7641N5157K6756
6868b2666J8331J8935n6063r6120J2122O4434N0582q1559k4030J8050J8039M6463
6856c3482k5651O878N9945l4068n4904L5513N2483J4581P728K5493m2399k5014
6844a2897r212M2368k2231l9331m1157l7405K0631K1831K116K4254J2703p830
6832d6160R485L3857Q150m8180R777R8Q808n94M4140L349m6370k7370L0383K6692
$$ y = [22313, -9312, 43294, 51778, 51608, 6704, -46872, -20222, 33503, 36132, 19413, 91490, 128446, 120809, 132821, 99504, 102356, 150570, 134434, 67489, 6280, -97294, -106548, -68095, -54515, 9947, 12664, 16602, -39099, -49039, -12602, 19218, 25175, 25108, 39502, 42435, 57775, 62840, 51883, 51131, -5761, -36567, 306, 22355, -8262, -76488, -79947, -124858, -124460, -132220, -104579, -49422, -22666, -4335, 14600, -41463, -137583, -125461, -61027, -10445, -92004, -116034, -97984, -79945, -33482, -59133, -52255, 7690, -26378, -81282, -45769, 6714, 21295, 29023, 54516, 12117, -12897, -22109, 20259, -1972, -41303, -82460, -119865, -99234, -77403, -75287, -51033, -38330, -46160, -36675, -2818, 5332, -42848, -33071, -32973, -24165, -24759, 19381, 22730, -23640, -51010, -20627, 6065]
6818F065k7100J1490k6536n0231k9215M5316j417k8392N889N7861j2386J0045
6806c8611k2048l9543N9228J0438j5543j9861P457K4945k4713m7794Q7915O4415
6794D6285j8744o4832j6559O420K8837k1184j8415L195J9747J8214L961K6481
6782A3406J2584l8949j3601m8572l1923L2890O3060N0074K5165k4370q785l6860
6770e881K4313k5961m422j0564m0976L1808O8369J4254q0118l6262k5359J2251
6758g8548J333j5087K1149k3216l8821K6999j7430J7860L6004K6332P4903N5735
6746H7213J4587k8793p9299j3110j8538L1991P648k6295n2649l0052J7017J1861
6734g8419K0396P6993O9435j4196R518M4281M97j0934r646k1930M4393n230l5421
$$ y = [6065, -21035, -9545, -36081, -86312, -115527, -70211, -71628, -100020, -94131, -36270, -48656, -38611, -60659, -100202, -40974, -30536, -46079, -65940, -58483, -33538, -58251, -106045, -18130, 46285, 27541, -37291, -53850, -47430, -18593, -39777, -58192, -54997, -35250, -17036, -13075, 13406, 25990, -12959, -26560, -75132, -107055, -74165, -11105, 38969, 64134, 39764, 30979, -5881, 18432, -7529, -11951, -22515, -63491, -31683, 36686, 50940, -29178, -65440, -90799, -78548, -77215, -92302, -71153, -94369, -133190, -106191, -123621, -105761, -69757, -43425, 31478, 87213, 101800, 73007, -6292, -19402, -37940, -5949, 1699, -24596, -77245, -107297, -90280, -78419, -58023, 18970, 88405, 74209, 83727, 128008, 128505, 117571, 107925, 85995, 130388, 125158, 89737]
6721H9737j4112o1350r132M4729j1033j1303k9439J6070o99N3660j1590o4258
6709h720p799J1531K246j0433K2658M5885N411n2256k9750j995l1923q380Q479
6696e5046J6137O607R989Q2088j4806j7628M5026L0835j3569k8567k8704n0423
6684a8061n7762l9283J8357M1343L146K9710L9660j0395J6424Q747k5426n0852
6672d4392n4465L6171N9942O016k8093k1099m954J3438k2382P404l476k1685J500
6659g6075L8450k3648j0260K6797j2016m1009p676K3304O6708J3289j8501o1962
6647h2599l830M5414N5870k0882p934j5153j3703l5169k110K4473K4579M2080
6635A1036l4101K3046j4364K9546N8295p4282m2790M0130n820o165j3770m2659
$$ y = [89737, 75625, 14275, 5143, 49872, 38839, 27536, -1903, 14167, 13468, 67128, 55538, -8720, -16519, -4988, -2742, -13175, 9483, 55368, 60779, 8523, -21227, -23222, -55145, -63525, -55046, -38909, -32302, -22313, 59775, 44969, 27341, 72367, 103202, 89633, 61066, 32362, -18061, -75823, -115106, -96749, -55406, -52260, -22550, 17110, 6715, 23139, 31886, 6460, -44392, -98857, -62686, -2744, 3272, -24821, -45920, -50874, -37436, -59818, -52414, -55890, -77575, -76075, -37625, -61273, -71533, -44736, -56752, -97761, -105437, -82133, -15425, -2136, -20637, -82599, -86429, -41015, 14855, -6027, -13961, -29114, -42817, -77986, -80096, -55623, -31044, 11036, -23065, -19, -14383, 15163, 73458, -824, -43614, -3484, -9304, -15469, -29239, -71898]
6623g1898m0307O0164Q757j7823J4740k332q88J8583j6200N7623O2948O2363n6413
6610G9317j288J8505n0506k3036L9918J5239p849o344n8244m5751L838L3646j6847
6597a9402j2717k8434R467n15k1791K6915L1969k1109O1008K4218k2406J4545
6585D1748o13M1537k8727l58J4079k7518k9430J2453j3499k2640J1590J0355R427
6572A8404p6943M7184L6968N351k6335o8037n026O5436M4173m7172k1699j3100
6560d0796l4757N16L971Q8982j0993K3293k9109k2448j7935Q616J5562M109M6393
6547C5404k486k3191o6004p9035k350Q196L0397M3235n0300l5837N3361P5605
6535a3005k1142m1932k1608j287J357M6433P3560N879L6666l5043o2357l1856
$$ y = [-71898, -112205, -52041, -43284, -61107, -46367, -48699, -49587, -31004, -47204, 10419, 73367, 135730, 79317, 78029, 96534, 46028, 22992, 62910, 78149, 70300, 63956, 5712, -40039, -36201, -2555, -19402, -32119, -60553, -51086, -51601, -73392, -46477, -14508, -35617, 25391, 49609, 27203, 41748, 41135, 82672, 53945, 53587, 67666, 40148, 10718, 23171, 9672, -12968, -1378, 8977, 18404, -58539, -11355, 25613, 30964, 4629, -63408, -68434, -2998, 41175, -5997, -27696, -40796, -75553, -75037, -71066, 17916, 6923, 30216, 1107, -21341, -39276, -30660, -15098, -10989, 35404, 32918, 9727, -56277, -135312, -137662, -129466, -99069, -55834, -106134, -141971, -88610, -13005, -34147, -76079, -97687, -98974, -97617, -51184, 22376, 28255, 64921, 29878, -32479, -64335]
6523f4335Q99K8757L4886Q50j7231l7982m9503l2780L6197N6145j9629M63L3255
6510c0008J2025j9045m1317p888q648J3222L6939j5147N596L7667L2063k7921
6498a2462j5818o310K861q831J4781K197l0147p699K2826k2801r382K6250l0545
6485g5080l6409J4753N1243N6012K1960l584j1495k4326L6644O699j2989n9639
6473c6211K3116K9405O4237j5923K4118j6354k2320k7705k1072L3983N601m4827
6461c952q0393p241P4620M6265o0518p5108k5523j2316J07171M1685m6198p4953
6449a16461l324J4069j3750J7047O301M4247L0626l8976J9405M2608L9878k0685
6437B0985m5382K3914J4144o8351P160M6469n245j0691n820j8916k616l4926k8473
$$ y = [-64335, -63436, -34679, 207, 1057, -16174, -54156, -103659, -136439, -100242, -44097, -63726, -63263, -30008, -17983, -37028, -78345, -86233, -94881, -81659, -44720, -59867, -54271, -16604, 15459, -12462, -28280, -34590, -31729, -40560, -25779, -23582, -53729, -61428, -38602, -61403, -70785, -44535, -75080, -111489, -96736, -45493, 10519, 32479, 28895, 17400, -6926, 29718, 36417, 23428, -36211, -13095, 16310, 80547, 64624, 88742, 72388, 50068, 22363, 1291, 35274, 40875, -3952, -84345, -91586, -16966, 29299, -31219, -106327, -131850, -144166, -36995, 4690, -41508, -116461, -119785, -105716, -119466, -102419, -96118, -51871, -21245, -60221, -40816, 1792, 41670, 20985, -24397, -483, 13661, -54690, -47530, -1061, -6306, -16997, -22817, -41733, -44349, -79275, -107748]
6424a07748J1971q833n91k6216J067P2697L2546j0308J0025j9523j988m287M2651
6411h537O2239M111q515J9595k0559n5729n2892j7877M5457M3917K964m5813r4127
6398a25766R756L1555L249O335K6526m7253l0912K0565K2552K560M9636L3245
6386B048j0156k7902j3676L6870K6449n462J6641m8295o2651n738M6011j4259
6374f0120K7037L633q767j4244l2608Q040K7717J7234R232M3227L6436O704m0751
6361B2770j9453m5601j0377k3404J3812o1397Q694M0859P0252N4141N365k2983
6349C2678l3349k1857N9509L5587K2950L599l044p793o0641o0069J6913N324P727
6336b466L6126p430q3727R266J7741k190j2435P9847K5508j810n2330l8804M4228
$$ y = [-107748, -95777, -104610, -105201, -131417, -130350, -57653, -25107, -35415, -25390, -44913, -46901, -51188, -8537, 53702, 57813, 49298, 68893, 48334, -7395, -60287, -78164, -32707, 11210, 14174, -31639, -125766, -116010, -84455, -81206, -74871, -48345, -95598, -126510, -105945, -83393, -80833, -31197, 2048, -8108, -36010, -49686, -12816, 13633, 8171, 24812, -23483, -86134, -91872, -45861, -60120, -33083, -29450, -38217, -52461, -85069, -77029, -49312, -32078, -22846, 20381, 56817, 63521, 22770, 3317, -42284, -52661, -76065, -62253, -123650, -114956, -74097, -3845, 50296, 55661, 32678, -671, -22528, 36981, 72568, 95518, 99117, 96073, 88280, 27639, -32430, -15517, -10193, -2466, 33660, 26230, -57497, -48231, -30490, -32680, -45115, 34732, 60240, 58430, 6100, -32704, 11524]
6323A1524J8817k6958M7895K9198k0977k5979j085j3401k3879M6866O1485q4039
6311A9467J8032k0648j2582J1989j903N4026l0511o575o5995n9532K2310N6414
6299a5508j134K64k3613O239K7198k2213J1244J0089j9291j574l6957M5779J6025
6286c452K0690j3330j0743K3056J6471k7334j670k9672n0757K6255J7996K1097
6274a1393k0433j4270M6918j0057j0354m1250J990L9920n0911m5309L1639L4339
6262d9171R698O3073j1186o0606j3992J1946N5297l34K5871R895j1349o7733n0715
6249h9306N4420M5650k2404j59j1544K3565m849M7779J0749o6519P168L4635P0788
6236I9973P933q5517o7084J9842p558p7993q9623j0695N9917N0614M2433K7877
$$ y = [11524, 30341, 3383, 51278, 80476, 59499, 33520, 32435, 19034, -4845, 42021, 103506, 19467, 37499, 16851, 4269, 16258, 14355, 68381, 37870, 31295, -34700, -94232, -71922, -15508, -16642, -16378, -39991, -33752, -6554, -28767, -17523, -7434, -26725, -28299, -65256, -19477, -3452, 17238, 3908, -6835, 16221, 32692, 5358, 3688, -25984, -76741, -50486, -32490, -11393, -31826, -46096, 822, -9235, -19589, -60839, -58849, -18929, -69840, -115149, -83510, -49171, -39473, 23600, 12414, -48192, -62184, -50238, 5059, 4725, 30596, 40491, 29142, -38591, -89306, -34886, 10764, -11640, -11799, -23343, 222, -4627, 43152, 53901, -12618, -5450, 29185, 99973, 107906, 22389, -44695, -24853, -32411, -110404, -200027, -210722, -150805, -100191, -57758, -29881]
6224b9881j2678J3029k1948K6686J8457m1860J1040O0734K5413K9471J3186n6813
6212C4836l7203l2549J4210M3605k8734k2687L3431J8008n7175p6765j4913L7502
6200h8434N7406k2874j6616P900M8775O1827J4018n1226P799p1199K4144O3891
6188C5411N1256l4319l9013m4913L9309O1982j0168k1387o0569l6170j4486l33
6176g3400m3202j7055K2879J9334J0638r456k1582P8933L1702k5900J6608j1331
6164b1832J9113L8341K4133N6366k2785k9828k1464j7261n3380J9464M1220J1855
6152D3942J158k7202l80L2099m4830j5264k8528n657k2748m5349R562N5243k483
6139e0437M0972M426J7063K9715N0218M0690q484q0599k742k4836j9557m401m9364
$$ y = [-29881, -42559, -29530, -51478, -24792, -6335, -48195, -37155, 23579, 48992, 78463, 91649, 34836, -2367, -34916, -20706, 22899, -5835, -28522, 4909, 22917, -34258, -111023, -125936, -88434, -31028, -53902, -70518, -62618, -13843, 47984, 62002, 10776, 18575, -52624, -28480, 35411, 86667, 52348, 13335, -31578, 7731, 69713, 59545, 38158, -22411, -58581, -73067, -73400, -116602, -133657, -110778, -91444, -80806, -90262, -111844, -32911, -1209, -27109, -10501, -21832, -2719, 35622, 59755, 116121, 93336, 63508, 42044, 24783, -28597, -9133, 32087, 43942, 45100, 17898, 17518, 49617, 4787, -10477, -39005, -44662, -67410, -112759, -103197, -47954, -50437, -9465, -5039, 12024, 41739, 91957, 132647, 124163, 43564, 40822, 15986, -3571, -7972, -57336]
6126e7336M6892Q7566o802n3972q1802o0430p997J232O476N3040J5017K651N2910
6113b555L2290m9335q8476J0189N7231J1696K0123l3327k6829J1378Q675M060
6101d4880k2328l9550K8342j132o8225K8552K6126K7720K1983O988N2397K3017
6089C9010j4881o2270J7861j259n7857M2033L0400l4359m0769K092l9556j3205
6077a32760J0134K7174O9544K1236j7420j3284m1375l7924M7616L8476K3887M0411
6065C5715n7913q3484L0780K995l8856p3884L0671J1805R0476M9956l9259m524
6053d5522K5797J4885j1370k6521r078k7414k9937m5815K7456O3538J7607j4218
6041f0592j84K5484j2084j8710L6089l2573j4482K5638L5825K0337q07j3990l6470
$$ y = [-57336, -10444, 77122, 70320, 16348, -65454, -125884, -133881, -132649, -126173, -73133, -58116, -55465, -2555, 29735, -19600, -108076, -97887, -40656, -28960, -8837, -42164, -68993, -57615, -48940, -44880, -67208, -106758, -78416, -79548, -147773, -119221, -93095, -65375, -43392, -36404, 15993, 39010, 24129, -38141, -20280, -21539, -79396, -37363, -6963, -41322, -82091, -79999, -119555, -132760, -122626, -95452, -25908, -4672, -22092, -35376, -76751, -114675, -67059, -28583, -4696, 35715, -22198, -105682, -74902, -71907, -110763, -184647, -153976, -142171, -51695, -1739, -40998, -45522, -19725, -4840, -16210, -42731, -51809, -79223, -109160, -154975, -127519, -63981, -46374, -60592, -60776, -35292, -47376, -66086, -29997, -62570, -77052, -51414, -15589, 4748, 3941, -10049, -46519]
6028d6519k9354j0784q334K5626J4768J2041J0726l4702j7118J02212L7324l5831
6016B0055n5982k7142K5250K173Q13N5532M0773J0445p5233K3162P915J1732j7491
6003B2002K5488k7648n6484m0009L1584O9060q309j8258k0214L1828P7060J6396
5991A02496m080m264n3324p9292l3090l836m192j1434l806K0884J4083o5107J7815
5978a07147K6155K5900J9694Q9867P6133r308j0777j8727j5943l2292j5355J579
5966B9779j4970m7988j5026j9286l7662k0106P1167L2171k5485K6427k896q162
5954c2037J4223n323l0623N3491K1808Q595J4957J5369L7065j8508j00921m2233
5942f4137R23M4421M6121K6656m3808J3144j344n4389k7703K9407K6337J7951
$$ y = [-46519, -75873, -86657, -94991, -69365, -54597, -42556, -31830, -66532, -83650, 18562, 55886, 20055, -35927, -63069, -37819, -35646, -34833, 20699, 61472, 71917, -3316, 19846, 27761, 39493, 22002, 47490, 19842, -36642, -76651, -45067, 23993, 15684, -2574, -22788, 9040, 86100, 102496, 98416, 94152, 40828, -38464, -71554, -75390, -79582, -91016, -94822, -73938, -59855, -124962, -107147, -80992, -55092, -35398, 54469, 130602, 121294, 110517, 91790, 75847, 43555, 28200, 29779, 14809, -33179, -48205, -67491, -105153, -125259, -54092, -21921, -47406, -20979, -23875, -32037, -17814, -23137, -53760, -269, 21539, 30134, 45091, 60460, 97525, 79017, -21904, -64137, -63214, -18793, 27328, 53984, 10176, 23320, 21976, -32413, -60116, -30709, -4372, 13579]
5930A3579K3438K5483m6503j9239l0646J8776j0658K906p668K0996K0677K4165
5918C5306n3050m4585N2055P4802K741l7212J1682p151l0549p814R267K7469M4448
5905G7409m6797l3860l2328k456M8853M2759n240p618n9213j7113k1509j4459
5893g1572L0282M2785l065q39j0262j873q393l606r179J4466L7640Q087k4235
5880B36L1334L5099p0962K4608K1290K690l2767l4855j1702k6127p1521K1930
5868a10747O2899J8363J9156J7064j6141k0455j8608K6893J4642K4593Q905M8642
5856G5206K318K7819n8333j4734N559J3335m1559l3005L4924j1587k3206o997
5844c0260r849M962j6384k6807l7214K2385P0214K1208l8311L10L4819k6102m4695
$$ y = [13579, 37017, 62500, 15997, -3242, -33888, -15112, -25770, -22864, -30532, -9536, 11141, 35306, -17744, -62329, -10274, 64528, 67269, 30057, 41739, 34588, 4039, -3775, 5492, 32961, 77409, 30612, -3248, -35576, -38032, 10821, 53580, 48340, 40722, -18491, -35604, -57113, -71572, -41290, 1495, -1570, -2409, -12671, -14544, -22937, -26543, -35722, -21256, 16384, 24471, 236, 31570, 66669, -4293, 20315, 41605, 44295, 11528, -23327, -35029, -61156, -132677, -110747, -47848, -29485, -10329, 6735, -9406, -29861, -48469, -21576, -6934, 17659, 26564, 75206, 77524, 105343, 47010, 32276, 37835, 51170, 9611, -23394, 11530, -57, -23263, -30260, -40109, -35147, -51531, -78338, -115552, -93167, -22953, -1745, -40056, -39746, -4927, -31029, -75724]
5831g5724J8558L7333K8405N0883q52l509m5629p5453J1461Q1163J3687o28k8577
5818A1118n7092k4740K9980M4108K2256N749l0907k4991K8831L7115J6406j9443
5806C8390l7511k285R605k7291L7811k687N0098k3754p4499l9816k5154m98R1760
5793e831O0108K469k9509M4209o1984n7863J7753O8313J1787r207o7450M1606
5781A4401O0490j7153m6267K379P122L248j105J1440k1835k1075j0390l2474j7895
5768f9114L7985P010K8062J4132l0807n7314M3499O2624n0815m2761l885J0295
5756e1089k237K6793J9543l730L263K5397N7351R218M510k3565n0645l4381K4381
5743D809m06m2688k5589l3823l2376J3658O9525M6555l3987J8699N1799k2956
$$ y = [-75724, -57166, -19833, 8572, 59455, 58603, 55094, 9465, -65988, -54527, 26636, 40323, 39695, 11118, -45974, -70714, -40734, 3374, 25630, 31379, 472, -24519, 4312, 41427, 57833, 38390, 879, -1406, 8199, -19092, 18719, 16032, 66130, 42376, -32123, -71939, -97093, -97591, -5831, 54277, 56746, 27237, 71446, 9462, -48401, -30648, 37665, 49452, 40245, -27205, 14401, 74891, 57738, 11471, 13850, 20972, 24220, 23115, 34555, 12720, -8355, -18745, -51219, -69114, -31129, -24119, 3943, 18075, -12732, -70046, -26547, 36077, -14738, -57499, -61384, -51089, -53326, -26533, -6990, -10720, -7457, 17940, 75291, 84509, 89019, 65454, 14809, -19572, 4809, 4403, -38285, -63874, -97697, -130073, -116415, -46890, -335, -34322, -15623, 36176, 13220]
5731A3220l243j9007K4962L5990k0831j9074j9950k0739L7373P2724L7860l3367
5719H5918m6665k8115m7076L6267P9241M0555p33k3613m356k9282l9669J0022
5707C2494M6135m3269p701j9120K3816J8758n0891m217o969K1705m3629J9482
$$ y = [13220, 9977, -9030, 15932, 51922, 31091, 12017, -7933, -28672, 8701, 81425, 119285, 85918, 39253, 11138, -35938, 329, 79570, 120125, 119392, 95779, 91423, 62141, 22472, 32494, 78629, 35360, 27659, 8539, 32355, 51113, 222, -3995, -10964, 10741, -32888, -13406]
$$ [...]
##END NTUPLES=NMR SPECTRUM
##END=
