##TITLE=Analysis number 324939
Compound Code btb 06167
Book Reference d
Project Code adrs
Chemist Name ians
##JCAMPDX= 6.0         $$ Bruker NMR JCAMP-DX V2.0
##DATA TYPE= NMR SPECTRUM
##DATA CLASS= NTUPLES
##ORIGIN= Bruker BioSpin GmbH
##OWNER= nmr
$$ XWIN-NMR		Version 3.5
$$ Tue Dec  5 14:36:54 2006 GMT Standard Time (UT+0h)  MAYBRIDGE\nmr@NMR_250MHZ
##.OBSERVE FREQUENCY= 250.131544655141
##.OBSERVE NUCLEUS= ^1H
##.ACQUISITION MODE= SIMULTANEOUS (DQD)
##.ACQUISITION SCHEME= undefined
##.AVERAGES= 16
##.DIGITISER RES= 18
##SPECTROMETER/DATA SYSTEM= dpx250
##.PULSE SEQUENCE= zg30
##.SOLVENT NAME= CDCl3
##.SHIFT REFERENCE= (INTERNAL, CDCl3, 0, 16.522)
##AUDIT TRAIL= $$ (NUMBER, WHEN, WHO, WHERE, WHAT)
$$ ##TITLE= Audit trail, XWIN-NMR		Version 3.5
$$ ##JCAMPDX= 5.01
$$ ##ORIGIN= Bruker BioSpin GmbH
$$ ##OWNER= nmr
$$ C:\u/data/dgb/nmr/ADRS/360/pdata/1/auditp.txt
$$ ##AUDIT TRAIL=  $$ (NUMBER, WHEN, WHO, WHERE, WHAT)
(   1,<2006-12-05 14:36:36.52 +000>,<MAYBRIDGE\nmr>,<NMR_250MHZ>,
      <created by zg, POWCHK disabled, PULCHK disabled
       configuration hash MD5:
       49 4B E0 1D 92 C2 6B 37 9F E6 65 BC 52 41 86 1D
       data hash MD5: 64K
       30 F1 31 5F 51 C4 C9 DD 52 62 C3 FE EE C0 FD A7>)
(   2,<2006-12-05 14:36:47.19 +000>,<MAYBRIDGE\nmr>,<NMR_250MHZ>,
      <Start of raw data processing
       ef LB = 0.3 FT_mod = 6 PKNL = 1 SI = 32K 
       data hash MD5: 32K
       5C EB 77 AA 08 18 36 77 B6 50 67 AD 20 92 B6 84>)
(   3,<2006-12-05 14:36:48.79 +000>,<MAYBRIDGE\nmr>,<NMR_250MHZ>,
      <apk 
       data hash MD5: 32K
       F2 65 A3 E3 BA A3 87 94 0D 38 D5 37 2E 50 7D 49>)
(   4,<2006-12-05 14:36:49.47 +000>,<MAYBRIDGE\nmr>,<NMR_250MHZ>,
      <abs ABSG = 5 
       data hash MD5: 32K
       15 4C E4 F7 83 73 85 D2 AE 84 22 4F 7A FC 00 60>)
$$ ##END=
$$ 
$$ hash MD5
$$ AA BE 80 41 76 D3 45 61 5E BB 9C 4B AE EA 2F 6A
##$RELAX= 
##$RELAX= 
##$RELAX= 
##$RELAX= 
##$RELAX= 
##$RELAX= 
##$RELAX= 
$$ Bruker specific parameters
$$ --------------------------
##$DU= <C:\u>
##$EXPNO= 360
##$NAME= <ADRS>
##$PROCNO= 1
##$TYPE= <nmr>
##$USER= <dgb>
##$AMP= (0..31)
100 100 100 100 100 100 100 100 100 100 100 100 100 100 100 100 100 100 
100 100 100 100 100 100 100 100 100 100 100 100 100 100 
##$AQSEQ= 0
##$AQ_mod= 3
##$AUNM= <au_zg>
##$AUTOPOS= <56 >
##$BF1= 250.13
##$BF2= 250.13
##$BF3= 250.13
##$BF4= 250.13
##$BF5= 500.13
##$BF6= 500.13
##$BF7= 500.13
##$BF8= 500.13
##$BYTORDA= 1
##$CFDGTYP= 0
##$CFRGTYP= 5
##$CHEMSTR= <none>
##$CNST= (0..31)
1 1 145 1 1 1 1 1 1 1 1 1 1 1 1 1 1 1 1 1 1 1 1 1 1 1 1 1 1 1 1 1 
##$CPDPRG= <>
##$CPDPRG1= <>
##$CPDPRG2= <>
##$CPDPRG3= <>
##$CPDPRG4= <mlev>
##$CPDPRG5= <mlev>
##$CPDPRG6= <mlev>
##$CPDPRG7= <mlev>
##$CPDPRG8= <mlev>
##$CPDPRGB= <>
##$CPDPRGT= <>
##$D= (0..31)
0 1 0 0 0 0 0 0 0 0.06 0 0 0 0 0 0 0.0002 0 0 0 0 0 0 0 0 0 0 0 0 0 0 
0 
##$DATE= 1165329395
##$DBL= (0..7)
120 120 120 120 120 120 120 120 
##$DBP= (0..7)
150 150 150 150 150 150 150 150 
##$DBP07= 0
##$DBPNAM0= <>
##$DBPNAM1= <>
$$ [...]
##$SUBNAM7= <"">
##$SUBNAM8= <"">
##$SUBNAM9= <"">
##$SW= 20.6930455092707
##$SWIBOX= (0..15)
0 0 3 0 0 0 0 0 0 0 0 0 0 0 0 0 
##$SW_h= 5175.983436853
##$TD= 65536
##$TD0= 1
##$TE= 294.16
##$TE2= 300
##$TE3= 300
##$TEG= 300
##$TL= (0..7)
0 120 120 120 120 120 120 120 
##$TP= (0..7)
150 150 150 150 150 150 150 150 
##$TP07= 0
##$TPNAME0= <>
##$TPNAME1= <>
##$TPNAME2= <>
##$TPNAME3= <>
##$TPNAME4= <>
##$TPNAME5= <>
##$TPNAME6= <>
##$TPNAME7= <>
##$TPOAL= (0..7)
0.5 0.5 0.5 0.5 0.5 0.5 0.5 0.5 
##$TPOFFS= (0..7)
0 0 0 0 0 0 0 0 
##$TUNHIN= 0
##$TUNHOUT= 0
##$TUNXOUT= 0
##$USERA1= <user>
##$USERA2= <user>
##$USERA3= <user>
##$USERA4= <user>
##$USERA5= <user>
##$V9= 5
##$VALIST= <valist>
##$VCLIST= <CCCCCCCCCCCCCCC>
##$VD= 0
##$VDLIST= <DDDDDDDDDDDDDDD>
##$VPLIST= <PPPPPPPPPPPPPPP>
##$VTLIST= <TTTTTTTTTTTTTTT>
##$WBST= 1024
##$WBSW= 4
##$XGAIN= (0..3)
0 0 0 0 
##$XL= 0
##$YL= 0
##$YMAX_a= 385284
##$YMIN_a= -479315
##$ZGOPTNS= <>
##$ZL1= 120
##$ZL2= 120
##$ZL3= 120
##$ZL4= 120
##$ABSF1= 16.522
##$ABSF2= -4.171173
##$ABSG= 5
##$ABSL= 3
##$ALPHA= 0
##$AQORDER= 0
##$ASSFAC= 0
##$ASSFACI= 0
##$ASSFACX= 0
##$ASSWID= 0
##$AUNMP= <proc_1d>
##$AZFE= 0.1
##$AZFW= 0.1
##$BCFW= 0
##$BC_mod= 0
##$BYTORDP= 0
##$COROFFS= 0
##$CY= 12.5
##$DATMOD= 1
##$DC= 0
##$DFILT= <>
##$DTYPP= 0
##$F1P= 14.0000005364418
##$F2P= -0.99999901652339
##$FCOR= 0.5
##$FTSIZE= 32768
##$FT_mod= 6
##$GAMMA= 0
##$GB= 0
##$INTBC= 1
##$INTSCL= 1
##$ISEN= 128
##$LB= 0.3
##$LEV0= 0
##$LPBIN= 0
##$MAXI= 10000
##$MC2= 0
##$MEAN= 0
##$ME_mod= 0
##$MI= 0
##$NCOEF= 0
##$NC_proc= -4
##$NLEV= 6
##$NOISF1= 0
##$NOISF2= 0
##$NSP= 0
##$NTH_PI= 0
##$NZP= 0
##$OFFSET= 16.522
##$PC= 1
##$PHC0= 213.4388
##$PHC1= 6.380355
##$PH_mod= 1
##$PKNL= yes
##$PPARMOD= 0
##$PSCAL= 4
##$PSIGN= 0
##$REVERSE= no
##$SF= 250.13
##$SI= 32768
##$SIGF1= 0
##$SIGF2= 0
##$SINO= 400
##$SIOLD= 32768
##$SREGLST= <1H.CDCl3>
##$SSB= 0
##$STSI= 32768
##$STSR= 0
##$SW_p= 5175.98343685301
##$SYMM= 0
##$S_DEV= 0
##$TDeff= 65536
##$TDoff= 0
##$TI= <Analysis number 999999
Compound Code 99
Book Reference 9
Project Code 9>
##$TILT= no
##$TM1= 0
##$TM2= 0
##$TOPLEV= 0
##$USERP1= <user>
##$USERP2= <user>
##$USERP3= <user>
##$USERP4= <user>
##$USERP5= <user>
##$WDW= 1
##$XDIM= 32768
##$YMAX_p= 492562420
##$YMIN_p= -186448
$$ End of Bruker specific parameters
$$ ---------------------------------
##NTUPLES= NMR SPECTRUM
##VAR_NAME=  FREQUENCY,     SPECTRUM/REAL,   SPECTRUM/IMAG
##SYMBOL=    X,             R,               I
##VAR_TYPE=  INDEPENDENT,   DEPENDENT,       DEPENDENT
##VAR_FORM=  AFFN,          ASDF,            ASDF
##VAR_DIM=   32768,         32768,           32768
##UNITS=     HZ,            ARBITRARY UNITS, ARBITRARY UNITS
##FACTOR=    0.157963299565203, 1,           1
##FIRST=     4132.6476996994, 0,             0
##LAST=      -1043.33573715361, 0,           0
##MIN=       -1043.33573715361, -186448,     0
##MAX=       4132.6476996994, 492562420,     0
$$ Real data points
##PAGE= N=1
##DATA TABLE= (X++(R..R)), XYDATA
$$ [...]
27487 -12877 -9127 -17654 -20187 -25989 -62017 -68805 -36822 5174 41816 52113 51245 15628 -18963
27474 -18963 37768 53582 53529 47670 21971 27518 49257 34680 6538 -26632 -30631 -43074 -10166
27461 -10166 22567 59758 36051 29786 -15204 -76382 -109338 -76780 -38872 -46688 -54376 -33382
27449 -33382 28683 46798 50011 -266 -996 1596 -16051 -4261 2651 17147 12403 7845 33038
27436 33038 23600 34517 46789 18650 13122 3682 30763 13944 18491 31040 53535 30174
27424 30174 -33526 -29512 -23414 -17540 -40367 -27139 2140 31914 66780 63570 16019 -40305
27412 -40305 -77569 -58221 -46919 -13591 -8158 20248 7840 48358 59501 47977 17026 21881
27400 21881 41201 -14191 -73853 -52550 -33616 852 7115 26157 13436 38975 -6151 -5709
27388 -5709 -16659 8486 -14427 -29715 -17389 -25808 -26288 -13381 -56154 -78978 -79017 -54216 10070
27375 10070 -16001 -29794 -22784 -34167 -60866 -71411 -27000 -19451 -24996 -8555 26840 -25712
27363 -25712 15022 87169 100464 102002 67010 5453 -90094 -113980 -103209 -59469 -19489 -31474
27351 -31474 -50526 -45665 -68206 -85384 -108509 -93285 -45966 -22446 -28729 -16611 -78340 -70060
27339 -70060 -26267 -17605 -9666 -14734 -29233 -35523 -37381 -27236 -43724 -52606 -32563 -31688 -8289
27326 -8289 46576 13289 -31139 9193 -10077 -58705 -49324 -26970 -21978 -41400 -35806 -18006
27314 -18006 -66482 -43784 7008 33812 27054 35521 38097 20960 -22621 -60910 -5977 45615
27302 45615 69903 21663 42899 55367 32684 9248 -46094 -104749 -89639 -24170 21120 79787
27290 79787 84607 26006 29115 30366 6313 19009 -3235 -65261 -74950 -41223 14070 61297
27278 61297 87986 18887 20263 15178 -8530 -3824 -25952 -489 26184 -13531 -33031 -4405
27266 -4405 29381 22454 -2487 5766 -15346 -3324 43299 34279 -2243 -54638 -69163 -28139
27254 -28139 3201 -29640 -41162 3065 26968 30125 43699 64580 37103 -4281 -17287 17731
27242 17731 49670 41257 30736 -2232 -41611 -32685 -11527 -2844 5343 27914 11923 11764 35325
27229 35325 21962 -459 -7322 3911 -21274 -45238 -11616 27731 49669 57003 39577 24967
27217 24967 32025 -4078 -22561 -17022 36644 55741 47984 37352 -8232 -24833 -8004 21725
27205 21725 -8700 -10822 24804 -10388 -18736 -13515 -40353 -23563 -15654 4846 -8 26512 68025
27192 68025 44657 25577 69568 70761 79073 93667 82525 73897 54898 66280 38017 16211
27180 16211 21600 20804 -53022 -105381 -72873 4508 13573 -1710 -13569 -5106 8257 -3644 -14652
27167 -14652 -26879 44827 67989 37808 27326 32508 46155 41663 63757 79702 63517 57483
27155 57483 68681 35961 6422 -34015 -15441 6349 15235 -27091 -64072 -39557 -9785 -7341
27143 -7341 404 -1139 16129 16888 38765 23328 63243 72562 19853 12062 2464 -9391 -32005
27130 -32005 -677 7572 9655 13794 12001 32101 36341 27371 52700 55464 67618 55384 60507
27117 60507 29267 12663 -18182 -11915 3531 -13942 -34307 -33653 -34749 -23631 -4799 1087 -21396
27104 -21396 49476 74258 83245 68380 17822 -8270 4197 848 33188 74071 21369 -43795
27092 -43795 -39465 -82026 -74653 -46022 2562 26691 -6422 -42806 -38101 -95018 -70018 -13074
27080 -13074 -41683 -30808 13125 17456 8036 -13148 -37835 -52592 -24900 -35603 -87297 -114513
27068 -114513 -74763 -38000 4190 36403 43691 60917 57016 14303 27306 83274 100188 36878
27056 36878 2713 12515 43996 96559 52313 22491 19159 15359 25826 13132 1140 -2291
27044 -2291 8293 12260 7415 26964 711 5779 16731 -37327 -29044 8151 14986 48846 71673
27031 71673 69495 55611 39130 40140 61389 13442 9351 -1453 -26811 -63971 -43803 10289
27019 10289 63986 20126 6104 25681 38177 -268 -32661 -12660 70779 79156 34544 -3691
27007 -3691 33258 43319 3447 -5251 -48769 -70388 -71730 -44891 -12899 -6970 -21371 -18821 8028
26994 8028 29748 21917 65903 56683 2609 16720 38005 58565 66930 24935 65822 91398
26982 91398 83859 42580 59434 92480 78978 60017 39016 33545 30475 15213 -5820 -59197
26970 -59197 -80491 -78139 -26601 9233 33722 30900 34003 27228 39610 50372 -7409 -98959
26958 -98959 -46624 34730 48781 10699 -22734 -24788 11706 25323 74225 111040 120258 77448
26946 77448 36956 14895 5127 -25629 1258 -12701 -30985 6567 51025 79707 102579 81052
26934 81052 10989 -33034 -27472 -3489 18134 91649 132180 97492 79070 100080 55701 18510
26922 18510 35508 -6513 -41940 -24452 9056 44561 85409 51264 -3376 -25791 29938 42877
26910 42877 27829 43729 52290 -7931 15640 -3628 -4539 24887 29378 58116 48794 31899 30358
26897 30358 2204 6802 -23772 -6579 8021 -2533 -46293 -35943 3796 -8965 20028 16008
26885 16008 25116 88724 73967 58166 57951 76495 58543 52121 46177 28921 45744 828 7375
26872 7375 24346 44279 67514 40767 69706 97138 92674 66784 89660 73572 22325 34205
26860 34205 67620 37108 17006 40217 50891 69172 99051 107462 51454 47150 73751 127455
26848 127455 91194 67608 141314 191382 234587 242354 246548 251054 246103 245131 305162 379737 442027
26835 442027 468657 541152 603351 641680 680062 747899 757559 718667 697514 615372 558959 537592
26823 537592 522042 496149 468242 448984 333780 254815 223818 199199 171179 152743 128964
26812 128964 75768 47860 42112 26872 17373 27128 72604 54752 87038 44122 5289 11091
26800 11091 37747 41221 -9419 -5531 59632 43238 34212 89314 60918 23197 12113 10116
26788 10116 51024 55275 13458 -71563 -15656 30502 24098 39854 60266 27396 -15625 -31700
26776 -31700 -7076 -27237 -50842 -21846 -36673 -35239 -61604 -34404 32856 69157 66240 68432
26764 68432 53026 46496 55599 80622 61363 53729 90528 110171 104915 57781 25709 32399 93183
26751 93183 137564 145757 101491 72490 30435 16417 68054 53507 17611 28461 63525 22520
26739 22520 47825 72781 91652 93994 95640 69994 86625 98602 101305 83078 84730 71001
26727 71001 71101 74840 99049 117036 96017 56011 15537 -11245 41348 45242 21039 14965 -6179
26714 -6179 -36131 -71642 -74103 -43358 -77876 -30147 -31038 14068 48597 80389 81507 56973 38484
26701 38484 31722 38067 67361 79982 82889 30356 -8107 -21788 -14641 32674 83915 114291
26689 114291 117091 113306 75687 76886 56672 13238 -15128 -24738 32887 66555 104815 97741
26677 97741 90479 100030 87447 24179 1943 32074 23849 17076 31377 66785 104320 63068
26665 63068 42144 7544 19902 29456 73143 56365 75161 98748 165709 184076 138955 113314
26653 113314 69281 67117 53168 38696 52639 120066 143983 135975 141770 184621 194096 202683
26641 202683 290491 405402 430309 444557 452900 472978 496725 495270 577336 630773 628468 559437
26629 559437 501063 449423 420424 351823 366628 334772 320780 320843 300681 254178 230966 207537
26617 207537 171619 144938 128213 117218 118096 82022 34404 92026 138250 90944 75078 117758
26605 117758 167784 168866 210637 274659 246700 173859 163406 216014 231628 248247 259538 297232
26593 297232 370987 420656 508393 581051 656727 742417 721017 659901 586469 560080 564397 549601
26581 549601 570577 563362 545880 537386 535686 525208 452912 426909 379474 364270 367271 330010
26569 330010 273051 246201 231145 205214 147129 103329 74962 84039 86152 92421 111334 128965
26557 128965 121769 130659 128352 77332 82266 92114 70776 54230 56023 83581 100457 110252 99430
26544 99430 67784 52531 41925 63299 76410 42208 57461 88744 96319 101439 157337 153142
26532 153142 129245 123236 117925 108149 81350 84539 62864 40499 65254 54099 75100 55565
26520 55565 71110 96721 103065 50644 25178 54917 104934 116131 58819 15518 17449 50276
26508 50276 92105 106759 78874 78993 100010 113945 103152 105912 106401 107029 120034 111084 89303
26495 89303 123737 113144 69085 56194 113336 100252 138814 138052 137120 150403 164732 167746 168733
26482 168733 142370 153305 141754 161293 190508 144622 74985 56237 84690 118485 137320
26471 137320 173535 160018 141006 150342 145443 148364 154766 137806 165546 171314 156546 143283
26459 143283 141117 178067 154737 87059 133243 148884 149833 197656 271022 294295 283913 302538
26447 302538 253880 261195 247816 281965 271586 256199 246834 217560 258044 293638 293935 287267
26435 287267 240076 221673 254484 281077 286588 222965 193960 171749 163615 228183 264029 276226
26423 276226 255815 299115 344774 385592 355767 388452 424004 444242 390905 327151 321692 320709
26411 320709 336205 334842 329576 339672 359975 326589 349548 409952 452043 480816 493048 477912
26399 477912 453889 471021 501047 527110 528322 520890 522163 494623 503988 546244 621835 625339
26387 625339 594761 615720 617031 615105 629427 671453 663548 692360 732698 765614 731307 761967
26375 761967 806012 837638 833046 905344 975801 1028310 1079475 1044204 1109351 1210039 1281492
26364 1281492 1364416 1455807 1523610 1575852 1649461 1777987 1816292 1956122 2143648 2348517
26354 2348517 2495192 2709040 2957115 3203001 3433684 3704412 4001893 4374382 4740637
26345 4740637 5159116 5683340 6287027 6915051 7610583 8419710 9408824 10581618 12087302
26336 12087302 13980189 16343572 19317705 23196381 27951266 33647551 40305550 48016344
26328 48016344 56770549 66406955 76800691 87498376 98028883 107716797 115989000 122494533
26320 122494533 126915202 129335896 129839827 128435962 125027478 119608532 112257913 103249266
26312 103249266 93182909 82701024 72352393 62517262 53548101 45479091 38380402
26305 38380402 32307869 27154893 22901880 19533334 16803884 14573795 12780833 11341450
26297 11341450 10171158 9224931 8315738 7507032 6816173 6196610 5662767 5205536 4773899
26288 4773899 4448898 4152358 3833500 3533185 3299418 3094842 2787447 2504965 2332407
26279 2332407 2182013 2101114 1959372 1820273 1717192 1639173 1536728 1524764 1473559 1420926
26269 1420926 1360999 1251638 1163415 1090302 1040860 1005514 982329 947676 902484 871139 816337
26258 816337 792793 773227 781284 749024 704381 704496 690543 621117 595385 616109 617855 575241
26246 575241 530529 522920 516975 512290 550198 559427 542205 545596 560512 486544 435335 442783 441682
26233 441682 445714 425036 397303 396270 443488 391323 364855 386893 344609 364719 385747 398028
26221 398028 382211 376103 388494 399478 367140 320903 340213 302554 284734 345808 380159 330994
26209 330994 290433 304359 330754 326327 316771 293424 324725 344868 388281 378244 390789 404310
26197 404310 386043 408057 393972 382784 411665 456732 464947 440650 417256 428120 386029 347860
26185 347860 365644 333116 324400 323204 324171 306177 272873 282915 283155 267755 284173 291042 269171
26172 269171 293934 299635 288029 275828 283819 310160 299179 314740 349272 323105 250760 239970
26160 239970 219987 207563 248586 289154 252201 208053 202311 232570 239741 285088 299976 332363
26148 332363 353850 423084 472869 447168 398978 407592 409353 380444 367021 381534 377448 374159
26136 374159 311655 238663 273922 317625 352396 320467 279945 270279 240629 263389 337852 330031
26124 330031 261733 228368 279204 269941 215837 193463 210365 268301 257299 240434 228900 238718
26112 238718 309486 397749 388888 390245 409953 350174 309065 354428 399737 436205 433771 500899
26100 500899 531227 471306 387668 333964 331160 332028 356848 348875 333985 339803 331271 312422 321459
26087 321459 367196 340564 317869 303526 274602 226981 233661 262433 270828 275174 299298 353748
26075 353748 412589 360561 330859 318718 305257 307756 321541 357585 382316 405543 438261 463814
26063 463814 481255 532053 606023 616630 630176 644388 671657 672180 643967 598460 524916 443782
26051 443782 420226 417967 417171 411914 421467 435918 409053 382719 355240 343589 341760 323596 261355
26038 261355 241621 245917 265623 284050 332189 320418 332682 356188 342288 317876 324001 324786
26026 324786 297783 345217 395944 460789 501195 504164 539067 572648 530091 507862 508491 497930
26014 497930 499782 545300 622066 684663 783876 854296 840194 734479 674039 633113 561790
26003 561790 511316 467488 416639 362241 313632 301104 366990 381658 333049 321173 272740
25992 272740 262532 285334 309973 304860 257833 213632 222656 219066 190294 242822 268352 272413
25980 272413 270501 251204 297514 371927 370025 364119 335496 333485 331533 328091 375007 440316 482487
25967 482487 482113 486049 476267 446244 409615 377931 382438 366136 378883 399669 403950 408232 458049
25954 458049 469037 420562 370169 349011 383914 400625 394712 373793 319172 297709 341154 382644
25942 382644 402593 423197 382408 320867 306939 340404 392198 404719 452326 449115 450044 464543
25930 464543 497113 544733 575215 570650 563367 561992 550978 524011 522825 491961 416773 427080
25918 427080 409975 432814 440817 440645 420761 416979 416754 387317 392126 442191 419866 422463 432702
25905 432702 415978 360146 346859 314500 332294 333653 371972 409502 379989 389190 390776 401455
25893 401455 406784 450573 426360 448977 457421 461177 430218 430854 478000 521064 512210 514362 569637
25880 569637 595293 585525 603398 668258 698924 792322 824006 836261 831829 802096 792463 808022
25868 808022 825247 795818 719553 683087 682828 688203 700373 827182 948191 1060468 1170008
25857 1170008 1230365 1256641 1228630 1085190 966409 844519 723117 694751 677980 629193
25847 629193 640109 599921 646279 656245 580013 563514 586155 616795 592366 543924 535139 550401
25835 550401 583074 614663 602870 654537 705616 720628 692021 614882 601441 599973 622493 674785
25823 674785 710661 718192 713545 722199 747971 748792 789715 804120 865887 910908 929917 989766
25811 989766 1036052 1020282 1096562 1145470 1166331 1158510 1185166 1238299 1283551 1281781 1291374 1250748
25799 1250748 1160284 1139322 1119572 1118045 1076098 1018221 1023317 954663 908090 881447 811125 773568
25787 773568 795042 819238 778093 782932 774487 747800 737674 790601 795190 811834 835356 804534
25775 804534 810213 818126 820210 843706 851506 846210 840214 860179 896949 942807 974084 962272 963328
25762 963328 962685 952022 985148 980150 996637 986695 922896 917051 925340 984358 1002878 997142 1015533
25749 1015533 1060091 1050243 1038379 1054111 1074917 1057467 1082774 1070405 1086253 1126566 1136271 1123017
25737 1123017 1095520 1117027 1190582 1221718 1217649 1246412 1247818 1271310 1259558 1263375 1293055 1318010
25725 1318010 1321073 1351140 1386514 1426603 1457049 1437658 1481364 1530411 1509541 1459522 1487823
25714 1487823 1543317 1572302 1595070 1633974 1662606 1647652 1646730 1707691 1797985 1851687 1882873 1907844
25702 1907844 1961914 1960657 1984191 2033678 2039953 2121004 2187224 2130457 2085949 2038433 2076340 2150112
25690 2150112 2210272 2255546 2304055 2381364 2401570 2449446 2507539 2520929 2556842 2618792 2636583
25679 2636583 2687126 2778612 2868434 2946918 2985054 3054152 3078880 3115935 3230149 3314277 3390662
25668 3390662 3465290 3517368 3577974 3611557 3704741 3777959 3856756 3941588 3993255 4086556 4167174
25657 4167174 4220720 4284980 4321617 4413888 4497251 4550593 4645785 4733604 4755374 4828765 4992984
25646 4992984 5207037 5312352 5406504 5554771 5718972 5881704 6027460 6197053 6374400 6549723
25636 6549723 6731239 6870116 7049089 7242268 7528007 7778511 8003044 8275685 8554963
25627 8554963 8842264 9107726 9376594 9701262 10056820 10404997 10746875 11168043 11588057
25618 11588057 12014095 12450848 12905585 13414124 13857143 14325856 14846200 15448814 16133877
25609 16133877 16839783 17569135 18343189 19148981 19979374 20877127 21855161 22898113 24016037
25600 24016037 25189151 26389171 27677970 29073020 30577111 32229864 33988062 35870456
25592 35870456 37894366 40105001 42462726 44905304 47436558 50172899 53102034 56155669
25584 56155669 59414467 62858915 66455131 70256187 74151170 78132943 82064639 85967908
25576 85967908 89782788 93467346 96938993 100009684 102626620 104824978 106405631 107349071
25568 107349071 107578849 107104907 106004287 104296562 102004006 99259242 96123836 92643244
25560 92643244 88957938 85146647 81264601 77358579 73528410 69737211 66102664 62619053
25552 62619053 59249227 56046176 53032434 50137625 47438605 44891425 42431347 40188745
25544 40188745 38160798 36222125 34353155 32581158 30940286 29414217 27996726 26653385
25536 26653385 25387936 24151347 23026623 21965605 20988301 20089117 19260634 18455278 17660538
25527 17660538 16989415 16325747 15665878 15038576 14443324 13905452 13433095 12957148 12481003
25518 12481003 12030983 11539697 11076525 10731326 10370920 10062227 9739177 9435557 9174218
25509 9174218 8906859 8572461 8310423 8050048 7810703 7607199 7389481 7199029 6988104
25500 6988104 6833849 6670710 6452706 6294951 6120221 5950172 5813492 5666740 5553446
25491 5553446 5423832 5303475 5147892 5022169 4901881 4809973 4709894 4638358 4498644 4338643
25481 4338643 4246938 4174471 4090146 3975835 3855924 3764243 3740871 3732753 3628487 3561348 3476450
25470 3476450 3392922 3273527 3254620 3260442 3223273 3157503 3103575 3085605 2983096 2826455 2740675
25459 2740675 2666146 2608655 2567978 2527021 2481524 2463861 2444152 2453073 2426831 2357662 2328363
25448 2328363 2319354 2298305 2267031 2242230 2217591 2176871 2200908 2180497 2146574 2069278 2025791
25437 2025791 2017872 1945047 1876063 1877706 1925584 1888173 1899398 1879408 1819518 1794344 1750893 1717375
25425 1717375 1656742 1643462 1629337 1611508 1573470 1502444 1470427 1480659 1493106 1497941 1422014
25414 1422014 1348195 1323683 1295793 1308001 1336234 1285030 1256065 1239394 1242316 1281493 1298707
25403 1298707 1270964 1255440 1223261 1174370 1157447 1150243 1101287 1099258 1111578 1110210 1123636 1142513
25391 1142513 1151766 1172936 1144546 1084372 1090648 1096730 1046056 987271 984907 1037701 1002737 954017
25379 954017 952009 932154 939069 951359 944191 911696 908857 899778 900490 932099 989474 1016726 1069846
25366 1069846 1054323 1035067 1021547 967750 1013271 1069946 1131873 1163204 1163289 1181078 1217047 1243341
25354 1243341 1299736 1372426 1445907 1480675 1454199 1411757 1413977 1361482 1296665 1267315 1199530
25343 1199530 1098797 1068399 1062725 928263 847952 832728 795359 778446 780106 758886 774787
25332 774787 791719 744276 728749 697143 659969 647981 650562 688486 701200 656956 659853 667180
25320 667180 656972 648738 649658 641587 654086 656523 598474 614178 678610 631833 580346 572760 571240
25307 571240 604780 588999 570976 591308 606489 611009 627706 647252 709509 761365 796795 828883
25295 828883 907852 992908 1050137 1083265 1049679 1007521 962155 1009044 1093238 1150961 1182077
25284 1182077 1253745 1315805 1335010 1298171 1240076 1187006 1017070 877569 807065 754670 697497
25273 697497 606523 539050 544477 558349 539745 521295 479517 514514 504646 475285 466492 426917
25261 426917 414659 409202 392075 356485 385554 414819 384006 375522 374364 393270 403360 392160
25249 392160 402887 498936 552418 584641 632341 707109 731176 771839 847180 844185 810966 838117
25237 838117 840809 853156 799412 714341 620734 549098 510045 481032 445586 393071 383364 374350
25225 374350 403676 384707 348931 337403 326729 295924 257821 254725 249844 274477 250479 259881
25213 259881 272481 270573 255229 235069 258902 312785 299870 287289 283498 302358 312125 308883
25201 308883 276879 277084 284541 303983 297428 295053 265275 227070 211716 224484 241405 219451
25189 219451 236522 265422 283018 323534 339657 303210 271912 275491 261962 263087 291290 264902
25177 264902 237441 253774 247241 241549 264567 255464 230136 216007 190455 147429 211631 257854
25165 257854 202905 206042 267396 289982 323569 350159 318185 239588 211825 224019 183337 213294
25153 213294 275118 289742 272250 234082 191312 212979 219763 190676 179061 226846 238717 223163
25141 223163 229887 190630 175973 179318 197381 207418 214077 159352 167091 194148 183028 153834
25129 153834 116837 95142 82784 118804 122251 124248 152843 178677 173239 157476 128461 133501
25117 133501 188832 225239 275404 244847 206262 168655 155706 195207 250824 246203 236673 255663
25105 255663 258625 261316 263887 253355 260383 265351 275621 314533 289856 278310 254858 226146
25093 226146 201543 196847 198374 206297 199960 222126 240503 248556 262607 236080 195409 110984
25081 110984 113835 179043 210629 183448 182916 180729 205705 213970 210748 185117 192378 168512 164891
25068 164891 160183 158605 133446 94302 80171 135334 137855 130913 191750 253147 251383 219094
25056 219094 201085 202693 186914 230866 231518 226187 182893 192910 217098 206707 187934 212049
25044 212049 251188 191022 137617 169718 184605 172993 164732 184307 173804 189302 218181 225856
25032 225856 234250 194268 212952 224687 193691 162002 212330 213418 208511 223741 267404 313459
25020 313459 338018 266362 230734 281353 318692 297143 288904 230707 200805 260190 296795 261269
25008 261269 246972 234658 213148 195684 165638 174713 184470 179688 186385 161101 155224 203809
24996 203809 226657 187502 158168 154291 161788 197259 240597 252802 263596 225077 228219 254267
24984 254267 274253 281183 263948 246597 239139 284258 310930 330274 345925 318052 293850 276934
24972 276934 297063 343773 347890 328872 364867 322362 330619 320568 296980 278714 283277 273636
24960 273636 231025 217099 264850 309207 283763 282260 300503 252667 246716 245649 249993 261649
24948 261649 251288 285210 326817 377117 363866 358541 346151 322791 350698 372831 368303 304546
24936 304546 311034 386779 434646 426816 435566 420537 443116 466647 504439 521086 526793 524613
24924 524613 490270 498316 540164 586762 638496 642358 616186 588879 617350 624264 638020 743427
24912 743427 767433 736103 706073 724900 754378 797448 837169 851794 921381 976566 1005190
24901 1005190 969621 973929 979654 1042845 1122982 1168023 1233669 1321536 1395293 1456038 1577578
24890 1577578 1682306 1781685 1868735 1977264 2102786 2225875 2403566 2617558 2810673 3029261
24880 3029261 3306071 3624885 3998289 4371159 4767336 5171698 5617621 6075217 6584621
24871 6584621 7149751 7710947 8394871 9208971 10108898 11199986 12638392 14477457 16880293
24862 16880293 19988544 24046417 29125994 35281410 42565507 51057884 60672598 71336943
24854 71336943 82893976 94838761 106378309 116709971 125202214 131291299 134977237
24847 134977237 136596672 136092376 133418944 128517378 121119791 111626778 100677410 89008308
24839 89008308 77480268 66686610 56816734 48019563 40288705 33673439 28214956 23716356
24831 23716356 20134412 17369886 15169426 13427988 12015374 10873035 9904151 9080299
24823 9080299 8389413 7712667 7106366 6515589 6018339 5605706 5135600 4712218 4322309
24814 4322309 3946763 3694939 3382163 3105267 2896961 2704303 2505252 2335812 2185371
24805 2185371 2003679 1893698 1841362 1727008 1553400 1523955 1504877 1431678 1355827 1250959
24795 1250959 1203235 1155260 1153350 1069847 997057 998354 997210 937165 894114 862523 819062 827109
24783 827109 809074 730699 644648 653193 678321 708360 725047 756393 735101 769022 746808 711944
24771 711944 715883 656275 598566 543860 548514 533773 528179 543910 574703 559063 538178 486232
24759 486232 452575 402863 360852 394007 390802 352932 359348 404664 370148 342841 329836 363413
24747 363413 396487 421488 354903 351950 354670 337291 332718 334976 364263 366981 317348 339143
24735 339143 338820 361440 380506 353676 283003 250962 259445 284084 326839 368418 390718 324286
24723 324286 263229 251801 272141 299931 304211 307832 318797 272842 279738 306154 257667 214625
24711 214625 251725 313551 339955 332840 249838 167826 183587 266435 332184 339111 358133 363227
24699 363227 415912 544156 614832 655019 745870 783514 779494 755644 726564 673392 617547
24688 617547 548059 480236 398228 333281 263902 191537 177886 236256 183284 162777 170936 149598
24676 149598 170831 186158 124467 74176 55880 127637 164385 162719 159872 198945 177575 185254
24664 185254 155887 151679 146067 183575 181346 198785 197340 182856 224605 249709 216673 215088
24652 215088 196759 198924 192614 213413 221330 300709 394691 404867 372713 404336 467773 517397
24640 517397 579852 608610 577760 567752 496077 419372 350088 345869 306805 288658 264718 227421
24628 227421 216622 228962 216976 173521 160445 127942 147510 146013 145035 137939 145512 137790 56011
24615 56011 79126 106095 150766 164889 158154 131349 73124 60511 48060 18252 48606 53311
24603 53311 88863 95527 117302 101216 66647 73112 59573 81199 124006 143969 179079 183671
24591 183671 190384 142838 105196 50734 25901 31249 114359 167763 131395 108048 118287 80291
24579 80291 74645 88242 123807 131151 141278 131612 99230 89166 107329 96124 58750 27215
24567 27215 -13855 -5990 -2638 35226 42847 32684 22439 12677 -8202 35926 95360 151530
24555 151530 138064 91556 95018 59195 55435 66442 55113 27019 30320 43845 80215 117902
24543 117902 118699 40609 26557 50529 79051 27825 -7846 -5744 69189 91233 59238 53194
24531 53194 56578 26817 55073 35604 -36171 -46600 -8983 5987 22904 42005 76868 96723
24519 96723 118053 79868 67628 52436 79061 119071 96433 60903 61029 59137 108089 118742
24507 118742 92514 49930 39174 38356 29578 51273 30733 33125 14330 38004 54592 69350
24495 69350 99253 43906 -15100 -11934 -23606 -36652 -65433 -61950 5929 28364 -5211 44799
24483 44799 68852 39397 11090 24051 28899 39199 38018 93978 84934 95458 59927 -2098
24471 -2098 -4462 53994 50995 41651 12042 -22697 -2824 23724 31597 36998 33729 12978 39666
24458 39666 91466 70431 38225 34500 49542 46879 9874 -6633 -26561 -51716 -23151 -5532
24446 -5532 26705 27857 48081 79979 72376 54365 15351 38667 76271 36854 35437 69105
24434 69105 63887 16616 -6011 -24890 -36807 -4944 -31 -3728 -22197 41935 63562 -8974
24422 -8974 6858 42867 47268 38068 37685 45731 75109 85565 102400 86372 73296 30160 -7550
24409 -7550 2090 -11915 -13681 -24258 29114 18799 5438 -10314 9252 22493 35398 65639
24397 65639 117661 103231 94937 114130 102952 122350 113624 80520 62529 37843 23024 34084
24385 34084 37388 43364 100467 117255 86811 59726 50961 69739 72364 113503 130272 91106
24373 91106 15006 32155 26213 22338 23776 37716 41306 20180 40747 109075 120300 77826
24361 77826 33167 10842 17194 52279 87829 84469 152293 163326 172015 205314 231774 289666
24349 289666 333829 376745 369137 407416 542812 575227 574665 672272 732815 717297 667439 666770
24337 666770 697772 717863 731231 679245 637491 542361 429464 371365 390907 336952 287085
24326 287085 213005 128481 113961 152539 97913 46114 33102 22768 9217 4219 58728 68256
24314 68256 69327 88355 101580 123910 80171 37589 50602 78164 88616 70758 40309 40537
24302 40537 22433 -36432 2283 15489 7453 -3137 -7147 -33045 -37471 14860 53531 86646
24290 86646 110556 115156 90448 50731 -7673 -32171 -26699 -58000 -46729 -63985 -76776 -39638
24278 -39638 -48099 -74511 -51510 -28511 11498 -9789 -22116 30391 62648 19239 -31264 -25949
24266 -25949 -26436 -28981 -5786 2742 -11644 -4918 13392 4146 46860 16709 -38653 -19976 -7631
24253 -7631 -15776 -9253 12206 40210 27382 57145 103993 135887 92717 44050 57082 45191
24241 45191 -5240 -48162 -8091 8478 -3071 -27669 -50380 -56513 -55045 -32049 -1737 17933
24229 17933 35129 28662 26464 22 -13024 -30290 -17721 -20545 -32012 -20284 -5764 12200
24217 12200 26282 29026 15757 -1912 51460 47691 52307 40420 17369 -13930 -25267 -54651
24205 -54651 -56704 -37686 -12916 7558 8816 -23520 -48634 -33604 -18325 30636 116116 112425
24193 112425 30084 45032 62795 56188 27449 -22614 -94597 -71827 -33382 9446 58565 47276
24181 47276 -13556 -20938 23341 42148 54743 36814 2781 7660 26443 -27646 -56406 -59646
24169 -59646 -40074 2231 23864 100858 99179 83414 68282 66513 23916 17892 -1073 4763
24157 4763 48666 87619 102036 68981 74931 40712 22949 -37301 -78326 -40082 -19298 -17122
24145 -17122 -32897 -16889 -4540 15137 45565 2054 -57028 -37386 -23477 -28713 -32757 -23265
24133 -23265 -12490 -10544 -21923 -33386 -61543 -57825 -21327 33452 32408 17539 20206 40243
24121 40243 44410 18446 27186 7148 9743 -17459 -15949 46713 -7628 -51360 -45530 -2753 51556
24108 51556 68351 64534 37263 -20681 -95222 -75883 -34752 -22985 -27063 9319 4730 -16977
24096 -16977 -17606 -36817 -75827 -48918 3086 25462 -6876 6397 31149 16594 -17131 -6731
24084 -6731 15195 -25609 -78121 -24668 13886 22651 11111 28130 -26091 -25105 595 18927
24072 18927 20472 7517 42 9266 7918 19259 60971 37302 41111 55915 35988 2947 2188
24059 2188 3947 9747 21606 17971 13050 12620 43886 67049 21194 8236 -10050 22549 38848
24046 38848 -3584 -24098 -46692 -98616 -101552 -76149 -37407 14433 17624 -26691 19576 -5440
24034 -5440 -15742 20666 15481 5333 35794 24274 9147 61460 68141 54564 37848 64345
24022 64345 61431 61864 31476 9811 -22801 -66850 -88920 -71130 -24146 -75321 -114931 -77950
24010 -77950 -36489 -19477 -4460 1818 4175 -15864 -3014 -34544 -63958 -11757 9304 10863
23998 10863 11120 13510 -1937 -5182 11103 -29528 -115063 -84800 -105991 -109389 -105202 -82489 -35738
23985 -35738 -30209 -8966 -41870 -71468 -65440 -30709 -13671 -12755 25557 38124 64903 4166
23973 4166 -18234 -6209 -55346 -68566 -34587 -31198 -23048 -40803 -23352 -18989 -32638 -22075
23961 -22075 -36110 -73387 -52911 9692 -3768 -22383 56669 32768 -19157 2508 -5805 23334
23949 23334 -6875 -15741 5008 11678 5899 -31403 -46978 -59451 -71441 -37839 17004 -9456
23937 -9456 -21475 -54964 -33520 8415 5858 -31549 -29429 41460 14912 -65775 -89595 -56803
23925 -56803 -7239 39585 50524 14164 10972 -12031 -6226 15387 38650 29313 14454 27287
23913 27287 20070 63681 51990 -8131 5920 -14245 -72818 -78091 -47528 -55139 -28250 -32523
23901 -32523 -29497 -80262 -41590 16539 43557 27844 -5104 -3096 8957 5782 42309 44595
23889 44595 53960 71136 25990 -4390 7126 68527 87836 31797 38986 73263 54110 -6974
23877 -6974 -31747 -80599 -81782 -76209 -86227 -73941 -13579 -27529 -18262 11432 -19634 -19601 -422
23864 -422 -24127 6896 37325 20819 -8613 -39491 -91601 -115750 -33901 -32819 -25514 12496
23852 12496 -24097 -78214 -87385 -69415 -44149 -18585 -61987 -73947 -31755 -11779 6927 45401
23840 45401 47193 14876 -4194 -2328 13676 34536 30925 16445 3485 8329 1199 22983 53709
23827 53709 69405 59732 -20536 -35610 -16564 27980 10963 484 -12468 3276 4049 16667
23815 16667 8703 -3309 12571 23977 31310 800 -822 -23726 -46585 -42245 -30460 18950
23803 18950 46120 35248 3970 13465 23827 45381 59441 46896 -6033 7459 34095 26401
23791 26401 35167 37091 2772 5225 47236 89968 103662 90715 27291 -20657 -56122 -34729
23779 -34729 6415 -10170 -33774 -27452 -64484 -47862 15383 27918 -15322 -35836 -34430 -18564
23767 -18564 30269 52669 3559 -4102 -35050 -85507 -69295 -6346 49765 93424 81212 30138
23755 30138 50793 65653 55852 41415 -2892 -22345 20881 63662 63825 42113 41951 33150 43330
23742 43330 34291 -2633 -38614 -44224 -47115 -69703 -75867 -52483 -25797 -13657 29837 79366
23730 79366 60617 24554 17738 47456 41915 27870 7792 3790 48537 9002 -53266 -97252
23718 -97252 -64151 -37795 -69922 -77711 -47915 -13370 35700 -6557 -42596 -39950 -77889 -110149
23706 -110149 -101282 -110111 -69493 9255 28176 1835 -8090 10694 -3892 -14121 -20654 -1872
23694 -1872 -8867 7246 -30586 -38584 -1934 22260 7960 -10258 -35450 -36139 -6958 13990 13922
23681 13922 2904 28765 63841 54843 28489 10897 -5230 -14429 -36289 -7138 -22840 -46266
23669 -46266 -13692 21416 37550 29346 12606 36866 49279 62062 59960 66521 39128 -27894
23657 -27894 -11692 4436 -43795 -17613 2760 57083 54508 69542 28756 -9786 28533 64750
23645 64750 5937 -39651 -92469 -71902 -59836 -46535 -11496 -39948 -42160 14316 48859 21288
23633 21288 14182 74703 71157 24828 16666 55779 84961 74391 56858 21252 54171 56686
23621 56686 22139 18655 3205 -10800 -3996 45281 57389 34243 34984 8351 -3967 251 -5639
23608 -5639 -12236 19428 34708 -12494 13695 41864 8308 -3947 -24023 -47327 -64037 -29759
23596 -29759 -2936 38968 39063 11013 -16511 -12003 27375 5668 -9950 -26788 -45817 -26621
23584 -26621 -3960 -7813 36774 33858 19753 50772 69956 63032 38324 29653 50424 33823
23572 33823 58408 39113 25192 31214 52964 94640 47374 23886 20978 4120 7605 -36459
23560 -36459 -24342 7909 22597 64594 66497 31099 24817 24494 36687 10451 -21306 15061
23548 15061 10257 -14604 -34353 -31107 -47355 -38766 -6028 16378 28453 27274 14704 989
23536 989 31318 -32888 -59610 -31426 4250 36073 34015 68605 51394 21712 -12905 -13079 -36094
23523 -36094 -42485 -42515 -42621 -54819 -46709 -24325 -834 -5652 -23111 -46446 -4829 25741 42464
23510 42464 20919 42043 16824 25122 14960 77998 75714 52599 39430 -42739 -69124 -38841
23498 -38841 -32172 -54542 -37563 -8151 21334 33246 66953 106967 105380 72886 52981 51778
23486 51778 3844 4433 9560 -19924 -36684 -35331 -83143 -90856 -35568 7999 -955 -298 -13849
23473 -13849 -43236 -7683 -2365 24115 32388 35816 9674 -14407 -17368 -51864 -52279 -51756 -54290
23460 -54290 -30766 -16034 -18849 -37281 29744 63348 84731 4526 -23613 -53555 -60343 -32911
23448 -32911 14110 -5287 -17763 -6666 24653 79783 71797 55525 55791 5066 -18762 21665
23436 21665 29879 22106 -40930 -26121 -12412 -48315 -53849 9546 45389 27663 30830 40491 32176
23423 32176 26116 27854 31465 39086 40614 -2803 -69079 -76222 -82404 -57729 -86085 -119420 -117958
23410 -117958 -46382 -36445 -32977 -49797 -99133 -42569 19170 -2464 -389 -41990 -15477 -7587
23398 -7587 -12158 6702 26281 -1815 -34758 -62459 -57354 -61165 -65846 -43311 -50597 -18619 5460
23385 5460 30208 4289 2119 15704 35724 84304 86460 25622 5332 -13593 -49575 -33553
23373 -33553 -1779 22870 -13220 -47872 -30359 -33892 -95614 -138796 -134838 -123029 -44072 43008
23361 43008 73986 93651 22519 -49909 -58269 -33533 -18582 14208 -25860 -10716 25208 -7651
23349 -7651 -25571 -28197 -54124 -82287 -107697 -59502 6585 27205 -6236 -11788 29415 8225
23337 8225 -6428 -28807 -75960 -76493 -84685 -57208 -39415 -19846 -14161 -31621 -22219 -34459 -67006
23324 -67006 -91242 -92517 -51054 -6518 5973 -4914 -6374 14223 5357 -6080 -47919 -74688
23312 -74688 -67450 -21032 -45763 -28604 -2891 34379 11575 -35143 -43455 14692 69606 74943
23300 74943 25193 19462 25393 50816 75534 23143 52310 72800 57243 42664 -12037 -35009
23288 -35009 -27570 10037 6500 -13186 -30329 1587 26933 -718 -12503 -19184 -22633 6303
23276 6303 4990 15751 23275 -8184 -10672 20397 135 -4741 -7037 -20027 -33092 833 -10440
23263 -10440 -8947 12992 3315 4481 -11474 -53811 -28214 17615 47355 62007 47176 23841
23251 23841 -20798 -25361 -14197 -3281 -38903 -4449 11551 -13394 -12449 -383 520 -10225 1093
23238 1093 -1319 25687 37960 52352 41172 8543 8278 -2341 43819 43885 34973 10495 18767
23225 18767 49096 62546 52275 66812 39254 -164 -81019 -100886 -96760 -66260 -62010 -70945
23213 -70945 -56748 -38630 15925 25638 12984 -7155 -49545 -43698 -53919 -57279 -25994 -9167
23201 -9167 -14046 6482 18530 22754 49720 -19389 -67974 -48691 1768 -13652 -36508 -1641
23189 -1641 51480 21360 -27116 -64727 -97157 -78567 -44378 -34959 -28069 -40566 -4241 34644
23177 34644 20959 -7397 -7565 28069 67057 46227 35461 27425 18234 71732 77603 47280 35130
23164 35130 59402 78002 34713 16955 44464 66723 12101 -37990 -37243 -6387 4976 28701
23152 28701 14472 40800 71235 102513 75302 42374 19752 46041 69584 75288 101845 93836
23140 93836 86102 95687 98324 102757 98215 88906 86069 60628 50067 57689 59074 51066 88632 100122
23126 100122 114997 102802 149865 196971 222598 217619 210611 234929 227243 271077 320443 370988
23114 370988 335034 323147 333503 371698 489080 567315 551112 543068 599050 655652 636810
23103 636810 671916 732692 783013 792813 785127 777635 801867 802180 785101 800001 722418 681971
23091 681971 717685 688847 634782 625075 585213 531780 518136 491739 436976 377380 350918 351834
23079 351834 313209 282128 251684 246714 263374 221783 195280 196392 170087 147724 148952 164342
23067 164342 190876 155567 106120 88156 76574 73579 103660 119875 107497 79769 102077 113615
23055 113615 102775 81951 27683 -12044 594 19144 -2450 2649 -4349 16500 16127 38102
23043 38102 49199 55049 49250 8127 13555 -2544 10601 22440 58267 56382 28814 79508
23031 79508 101512 87027 70093 97702 93405 113692 88066 49105 -22008 -47054 -64916 -64703
23019 -64703 -35546 11634 34830 -603 -3194 3125 17768 56305 84748 55064 -1745 -26150
23007 -26150 -12527 1582 -57915 -50399 -8665 6584 15001 5650 -3157 -25928 -40760 -16534
22995 -16534 2502 -5722 -3860 -3103 1319 563 -5832 -18977 2433 8194 27524 14495 17142 34468
22981 34468 -3347 531 19550 20147 -4832 -19035 7707 17873 36496 -7440 -27385 -7332
22969 -7332 -10073 20606 34539 19323 -6869 -8134 1958 -32032 -55769 -24405 -8130 -19761
22957 -19761 -36481 -25961 -28644 19354 34970 47442 -15165 -5831 73847 89344 7028 -4308
22945 -4308 30678 10995 -12644 -58792 -89549 -36881 -3797 -1573 -10438 -27538 -11114 33794
22933 33794 -4263 -25978 -9889 -13628 -46403 -41791 20579 29403 6051 13827 -11051 -853
22921 -853 35887 46753 -967 -42098 -47138 -34530 -12003 -44815 -31008 -4987 -41583 -16382
22909 -16382 46327 47137 -12981 -30790 -44702 -40921 -43465 -7537 40008 42673 32679 6119 -15144
22896 -15144 -21229 -41788 -32249 21452 -10173 -59265 -49448 -8821 -5931 2061 -29106 -41479 -2422
22883 -2422 15148 52788 52347 3624 20153 -4535 -17597 11841 -19929 2444 27817 35310
22871 35310 -2907 82 -1953 -9899 -45218 -77723 -58870 -22815 34185 32606 10300 20202 67963
22858 67963 83801 29681 8902 -23904 -55353 -96801 -101111 -39926 -43516 -37145 -13051 -45926
22846 -45926 -98522 -89631 -42665 -30128 -78292 -58019 -42653 -72110 -72062 -74981 -88116 -103167 -82243
22833 -82243 -46000 17810 5909 1331 12281 14574 -11549 -24901 -24847 -42118 -68719 -88657 -130266
22820 -130266 -107005 -67972 -61166 -45618 -26381 -83834 -89116 -7466 -4767 -46223 -18328 -16947
22808 -16947 -56572 -91869 -80351 -66854 -58200 -85429 -30487 -27814 -45856 -48502 -86221 -123493
22796 -123493 -108496 -78744 -75523 -20470 -13110 -78538 -110748 -103314 -72596 -58461 -11268 55334
22784 55334 98747 83521 27532 4609 -3007 9064 -2552 17572 36189 -26711 -46337 -52554
22772 -52554 -50689 -66028 -56404 -26753 -23753 -41510 -33223 -29752 -60534 -59187 -24322 39211 43715
22759 43715 40091 33602 10788 12460 -33221 -44168 -14243 9928 -10858 -39332 -30622 -15907
22747 -15907 -16946 -43288 -40842 -27109 -59014 -65759 -83279 -30012 -10566 -23240 -17850 -97170
22735 -97170 -63031 -5761 -38392 -64642 -63156 -45571 -18220 -13928 -65914 -32665 19719 16248
22723 16248 31594 1942 -24187 23068 47583 8343 -11374 -6551 6222 -30784 -59936 -82981
22711 -82981 -76931 -86210 -79978 -57437 -18869 5298 17450 -16790 294 -11566 -12301 -20766 -13097
22698 -13097 16363 1185 -47344 -36239 -24261 -60027 -50878 -27693 -13736 18364 -156 8455
22686 8455 12583 -22054 -68615 -37209 -32303 -90301 -47953 -25712 5304 21442 -4092 -49649
22674 -49649 -15332 7468 -2245 5100 6615 -3638 -6628 4102 10837 40729 63961 82452 73831
22661 73831 73069 43078 5298 -8241 -28976 -102004 -100920 -82503 -45735 -48467 -44432 5136 36884
22648 36884 84883 76690 -3214 -30224 -34335 -18751 -7249 -33076 -23475 -31399 -30291 14882 43085
22635 43085 78848 113708 75802 81306 61257 52715 43331 8963 12166 -53138 -83248 -83662 -85799
22622 -85799 -27851 5122 21296 19535 14392 9233 -14433 -46323 -43832 -12573 -12361 -32930 -21691
22609 -21691 1610 27147 29701 -16448 -9094 -16077 15428 -13403 -3710 43933 34867 25091 23457
22596 23457 48735 36504 32625 15541 -20325 -36559 -53137 -28654 -63822 -27175 3352 -8142
22584 -8142 29002 -25331 -63716 -36124 -10042 -16637 -52946 -102899 -94401 -74499 -43389 -8305
22572 -8305 10086 31167 67447 16903 6939 12527 24321 6025 -26399 24361 21409 23372 40147
22559 40147 -11955 -28017 -70694 -78127 -56937 -64557 -52849 -51584 -22767 -17775 -29120 3197
22547 3197 26193 39444 8918 -17834 -2128 37971 210 -33638 -4823 11852 26630 40705
22535 40705 40329 43151 35845 26857 22863 -4412 -36838 -31026 -67878 -53880 -11604 18644 22098
22522 22098 29095 16434 16379 -31691 -84566 -120238 -94111 -61947 -53586 -48852 -15322 20279 47076
22509 47076 45167 -13338 -78467 -86035 -83728 -65424 -91357 -54051 10342 25314 18291 7938
22497 7938 -45902 -86086 -52190 -41787 -15580 -18003 -77196 -113715 -84338 -69537 -71695 -84519
22485 -84519 -22079 -48044 -57015 -35851 -35532 -15742 35072 55344 19029 4007 17315 -49208
22473 -49208 -103936 -104332 -80751 -71529 -30333 17585 11231 -32064 -7810 -14157 -60882 -82778 -52341
22460 -52341 -19001 -27209 -19090 -25225 -9320 -37225 -35033 -44533 -5033 -169 16661 55541 55383
22447 55383 54339 70756 41223 26777 29338 22609 -25901 -50002 -53094 -44838 14725 26949 17879
22434 17879 21868 9523 3487 19363 35039 10806 12423 8985 -17894 -62633 -56275 -57982 -71903
22421 -71903 -69572 -65165 -44623 -8424 22589 -23501 -58000 -33792 -2084 -17519 -60708 -63573
22409 -63573 -36964 -57956 -76699 -77788 -54785 -53891 -44903 -36051 -41502 -82711 -79618 -1958 -537
22396 -537 -19143 -61314 -105889 -97926 -95720 -67640 -13087 57499 99188 77517 -25135 -67862
22384 -67862 -20191 -8250 -14863 52205 71222 28661 -41799 -57727 -9376 27535 63908 42710
22372 42710 -60250 -79515 -60044 -34171 -19510 -25020 -11417 -14439 52657 74757 49549 30704
22360 30704 25410 -12358 -59052 -29409 4882 -56187 -80870 -68466 -69873 -87759 -79991 -61557
22348 -61557 -34306 -21514 -30805 -12825 -12107 -14045 8059 -14805 -52466 -55632 -14583 21762 23974
22335 23974 19504 7352 8653 -5981 -47913 -34150 -64854 -78075 -73618 -55070 -25138 -17003
22323 -17003 -43754 -34020 43683 12733 -26659 5594 44111 27640 -34121 -42092 15260 53307
22311 53307 86936 96705 67740 26865 -15066 -12323 -36258 -49987 -37278 -62486 -76201 -75854
22299 -75854 -70818 -29776 3456 23220 4335 -32233 -41245 -56899 -45556 -25151 7235 -22291
22287 -22291 -34368 2247 37227 28699 63417 36067 26081 -25288 -24655 17024 67751 117461
22275 117461 112144 41868 18188 -7799 8689 23908 -13349 -51448 -39276 -55549 -110608 -87717
22263 -87717 -29556 -33782 -58790 -62611 -43020 -23084 47689 52921 67319 39204 8755 -19735
22251 -19735 -17051 -7544 7937 10330 -15430 -335 26311 57884 46299 54336 22624 21492 -5181
22238 -5181 -35634 4569 26892 25232 37318 52992 19917 7947 27800 60574 76548 69514
22226 69514 78074 36856 34008 6937 4495 -36036 -6662 -16802 -27149 -22913 -21215 13032 30674
22213 30674 63899 141252 155074 79558 36272 22064 15099 45733 55445 32000 -14603 -47110
22201 -47110 -61992 -69096 -24328 -22785 -60842 -65518 -40883 -25914 -56669 -40626 25025 -8773
22189 -8773 -5015 11407 15124 68467 37696 10658 19720 1570 -44572 -61245 -39232 -67961
22177 -67961 -87031 -46412 -34850 10246 2034 2950 63695 68780 18745 -53328 -71879 -50866
22165 -50866 -24666 -35059 -15606 -49726 -79092 -85600 -84638 -113182 -109602 -60001 -25321 -27937 -20280
22152 -20280 20156 6373 -11664 -42881 -50996 -71186 -92172 -112345 -93228 -38715 -16369 -21295
22140 -21295 -74419 -60434 -54905 -43999 -68182 -83796 -94796 -78649 -75824 -93448 -110063 -94154
22128 -94154 -70535 9000 81982 104783 79134 32846 40787 51898 50252 60649 31153 4561
22116 4561 -50996 -69606 -58802 -62466 -38350 -6530 23803 1358 -16752 -35711 -54952 -17661
22104 -17661 -17191 -41811 -39331 -57128 -58659 -53278 -43460 -10024 5669 3548 -4656 20304 5963
22091 5963 -4379 35276 66833 44392 30924 89689 38045 -15533 -74678 -65205 -30973 -22127
22079 -22127 11600 26743 24740 12781 31944 37728 40930 22182 -21692 -37493 -13960 23119
22067 23119 30223 -29438 -48570 -43421 -18396 -6442 29570 14679 25413 43158 7795 -31859
22055 -31859 -38889 7626 16190 24105 26534 3638 9494 -18239 -46754 -24773 20743 24334 -30743
22042 -30743 -61761 -2944 76415 101058 63470 29404 26577 -24073 -10471 21352 -9946 -29366
22030 -29366 -14011 -4911 15047 -19401 -28026 -56034 -68343 -50473 -60565 -49579 -56998 -48252
22018 -48252 -52596 -99271 -108723 -63548 -1656 32861 2739 17294 47982 33357 18623 37154
22006 37154 7429 -43393 -21888 -25188 -61768 -69034 -42396 -15619 35351 33028 -36268 -43560
21994 -43560 -35821 -44145 -95825 -88867 -54530 -28426 -36577 -40883 -65269 -43518 -26774 -37712 -49813
21981 -49813 -58293 -58043 -10108 16756 -60421 -73147 -49147 -69952 -73264 -46980 -40862 -59674 -100874
21968 -100874 -78674 -22953 7259 7134 18399 -12034 -71318 -75681 -51629 -66633 -75468 -68186
21956 -68186 -20352 19127 5661 -58549 -56837 -43211 -67410 -74274 -35722 1011 34315 20045
21944 20045 4684 375 52552 115434 118339 48779 36162 41202 -2382 -40208 -24555 -34718
21932 -34718 -21250 3606 28674 21419 6655 -26030 -23820 -42554 -63257 -48563 -21747 -14838
21920 -14838 13793 29217 17805 8303 -64567 -115908 -151674 -140915 -84641 -44988 -21378 -17135
21908 -17135 -45017 -29453 19514 -30916 -58798 -102996 -96965 -57372 -66347 -86898 -58460 -39300
21896 -39300 -84197 -130796 -101681 -84202 -89616 -109204 -66732 -32948 -39049 -20161 -25351 -17237
21884 -17237 25509 -16231 -48280 -82865 -108880 -78415 -63989 -23047 18738 31744 31648 16006
21872 16006 34330 84203 107623 115745 118194 123661 103726 71542 41113 9551 -11777 -8514
21860 -8514 2540 30043 33517 44024 48904 63895 63314 48061 6852 -60226 -60504 -95981 -74811
21847 -74811 -17388 -3421 13147 6377 25120 20995 -1211 6510 24076 24701 38682 46350 -28483
21834 -28483 -39080 -19772 -33145 -50876 -27726 -1119 -34513 -68777 -67676 -73407 -38099 -50506
21822 -50506 -54974 -66288 -59303 34751 22685 -23433 -37426 -55811 -57043 -17033 329 -36405
21810 -36405 -52587 11198 13051 11125 -8387 -10216 -19606 -27930 -49855 -62466 -31054 -9393 747
21797 747 -57425 -52247 21316 22928 43025 63797 35786 27013 56952 40453 -9837 -50433 -61910
21784 -61910 -77885 -38197 -50185 -33420 1603 2910 -14696 4327 -14959 -42214 -73405 -58220
21772 -58220 -39237 -62193 -50305 -43797 6549 11406 -4329 -2336 -20441 -71007 -96416 -71647
21760 -71647 -78575 -68390 -83255 -40172 -9731 -37473 -7614 26643 72583 49569 -17792 -54925
21748 -54925 20485 85881 21058 -53964 -83775 -45691 6385 37867 -3341 -9517 -5301 -13010
21736 -13010 -54367 -61841 -32477 -5654 24496 19136 -60 -20377 -88160 -107141 -56313 -89789
21724 -89789 -139406 -127635 -117052 -91363 -88433 -73070 -34589 -3903 18794 13214 3282 -32170
21712 -32170 -40114 -32250 -37274 -24174 -40914 -97099 -130190 -70677 -51673 -3473 27097 7658
21700 7658 24483 -39764 -58365 -97694 -68766 11544 34327 14479 39090 49590 52368 594
21688 594 -23279 -13314 -17307 36345 41872 5753 31957 21323 -2240 26467 64958 71394 81628
21675 81628 79485 38127 12691 9822 -20822 -2221 38414 -14960 -44114 17731 62455 25168
21663 25168 -57542 -67623 -10696 27305 20202 627 11461 -6016 -45587 -83196 -109855 -134644
21651 -134644 -103751 -74999 -44673 -22868 -28188 5132 -33450 -92678 -54056 -15521 22116 54618
21639 54618 30031 -4275 24819 53361 16260 -14427 5366 -39433 -113188 -104227 -82420 -28636
21627 -28636 12376 46764 85922 42156 92 -2571 15667 23264 32875 -493 -12606 17259
21615 17259 24034 22401 62843 21671 -48192 -69403 -81919 -44696 17579 29583 -37134 -72619
21603 -72619 -33583 -19228 -50127 1524 26814 18201 8145 -14156 5726 33415 49500 32606
21591 32606 43620 46538 30895 28251 2914 -7754 -5688 5894 -4728 1105 42769 33400 19982
21578 19982 51613 47938 1111 -18163 -25829 -31279 -23612 -25551 -61221 -54824 -73591 -75130 -65541
21565 -65541 -32868 -60732 -33647 -27674 -51711 -17791 -26248 -48816 -18511 35063 50707 26499
21553 26499 9194 632 76240 97349 64601 33004 -20155 -4757 18844 27340 -11694 -58099
21541 -58099 -34949 -5292 14239 -29265 -32358 18327 56356 52313 73813 66978 46420 48906
21529 48906 51601 54759 38443 -20087 -45467 -51129 -13151 4133 27133 12014 -55696 -4327
21517 -4327 -35999 -30108 -29035 -53358 -4240 -8188 -26294 -26544 5130 -41907 -59881 -74130 -5264
21504 -5264 23815 43542 56185 61642 80850 57748 5314 -28712 -21329 7594 28461 24942
21492 24942 -7985 -12271 21772 34071 28404 24285 4024 -6063 32491 9345 8136 1622 -3095
21479 -3095 -6109 2811 6991 -11041 -29152 -42361 -2071 73492 79903 49650 -14444 -48336 -52041
21466 -52041 -40984 -6395 156 -5709 -31471 -63740 -61618 -19474 -12843 -4861 -20690 -53122 -46900
21453 -46900 -68424 -63621 -23868 -6129 -31976 -44540 -35275 -37743 -25458 -10147 -4844 -15652
21441 -15652 -7816 -37928 -3869 7891 -39500 -19290 13405 -43633 -53834 -49586 -68006 -45413
21429 -45413 6083 5042 -751 33243 41445 20718 -10641 18196 27168 -3299 -1734 49899 36921
21416 36921 -23862 -59390 -19019 2147 34249 60367 23390 -3271 -13620 -15143 -33372 -34120
21404 -34120 -9184 -49844 -57424 -39055 -22449 -47034 -74815 -79155 -39821 -32758 -41752 -29410
21392 -29410 -35585 -30454 -7466 15050 -6646 -9783 23893 25670 17642 -17246 -57966 -68719 -85656
21379 -85656 -59184 -50865 -64219 -42326 -19254 7217 25250 -5710 -31430 -14964 -4549 -5376
21367 -5376 -19216 -42679 -51760 4154 36674 26646 22340 48043 44928 14284 -20894 -81684
21355 -81684 -110386 -135506 -122331 -85950 -82821 -53143 -28361 -37519 11113 34196 35163 42647 34041
21342 34041 32427 20517 -7229 -10371 -28021 -55302 -19892 -7422 -17115 4946 21013 39008
21330 39008 12330 -20364 -30996 -11473 -27129 -39722 -22929 -33019 -68654 -39377 -8076 -39258
21318 -39258 -82007 -43718 -10945 -29054 -36695 14085 8246 -10593 -5893 25180 -32754 -39725
21306 -39725 -25288 -3253 14746 -14404 -20274 -33813 -54605 -76406 -66607 -25476 -18935 -42268
21294 -42268 -25168 7495 37081 59676 57530 83973 33646 -31965 -53898 -53791 39353 20193
21282 20193 -33873 -41437 -63031 1266 14484 -2116 13599 -16599 -43386 -54617 -41612 -60686
21270 -60686 -69826 -36640 -13466 -25910 -20678 -44755 -46263 29818 -38296 -82186 -41183 3031
21258 3031 29947 43959 22524 -34952 -43722 20932 13200 39526 50004 2498 2624 54394 4679
21245 4679 -30431 -41084 -1923 -10483 -17283 -10093 -50811 -35882 22708 -741 -47037 -71889
21233 -71889 -27591 -13388 25601 52644 26668 27666 42537 33310 36188 -6256 -31599 -20549
21221 -20549 -53757 -61465 -82083 -53446 -22250 573 -107 -24733 -46959 -52569 -21593 -17220 -59773
21208 -59773 -94557 -54475 -65488 -47910 -15991 -50658 -72924 -70576 -64301 -54317 -5121 34735
21196 34735 13785 33534 60887 30680 6812 18338 5192 38414 69496 5648 -40517 -54642
21184 -54642 -39810 -50281 -60430 -60624 -34449 -72904 -96418 -16769 31910 -24984 -60907 -68187
21172 -68187 -11592 25805 356 -20746 -10485 16065 6721 -18420 -36538 -45018 -20822 27470
21160 27470 62997 55881 1365 -32729 -57690 -109258 -147757 -141231 -109261 -94100 -80673 -18925
21148 -18925 9363 1436 15068 -351 -47342 -7330 35990 8733 -27396 -18402 5231 9008
21136 9008 3162 -30344 -56366 -37472 -42506 -61404 -58051 -10596 16094 5517 -5686 5990
21124 5990 17106 35582 34248 2456 -31679 -42605 -61866 -91016 -84069 -123018 -103717 -48940
21112 -48940 -36797 -20427 -12184 -58569 -50769 -6271 -32238 -3323 37147 89168 47131 -18338
21100 -18338 -47202 -36564 27420 78710 80663 32151 -14584 -16356 -13395 -4477 -22259 10195
21088 10195 24528 -7199 -35416 -54608 -59912 -53518 -22402 -19360 -41163 -58945 -83085 -30787
21076 -30787 -9267 -6418 45160 64652 40415 9670 3196 -13320 -34265 -47195 -20063 -88821
21064 -88821 -133741 -79286 -49607 -43764 -1541 61253 17013 -58903 -65276 -76193 -76208 -53997 -51308
21051 -51308 -24337 18524 82723 79000 73200 92177 71555 47982 30133 -4430 -45928 -11101
21039 -11101 -23105 -92151 -83343 -48940 -32596 7899 -18315 -11426 32176 87110 87327 37631
21027 37631 28759 48110 48944 58911 18629 9084 7677 -5369 12504 40644 37278 18934 -9711
21014 -9711 -19297 -19518 -32623 -93492 -77827 -53334 -41783 -28101 -26743 -21411 18901 13341 -47526
21001 -47526 -73136 -73327 -64653 8774 -452 -6403 -2271 6148 35074 50288 -3921 -27828 -9215
20988 -9215 24427 51907 41693 9309 -54094 -52348 3315 28221 15239 23404 42996 29394
20976 29394 21853 15760 165 -24973 -12726 -16109 -2182 16275 14398 -12731 -10799 -39250 -99107
20963 -99107 -53279 -9850 44575 47050 16908 21425 37090 59524 31836 2612 -26198 -34211
20951 -34211 -18252 5128 -8254 -17789 -25207 20394 -17698 -42189 -12494 -24779 -70193 -118067
20939 -118067 -74403 -79290 -81531 -109472 -135913 -83661 -17967 14476 20063 59874 27972 -3555
20927 -3555 -55869 -61538 -37396 -70232 -52036 -61536 -130456 -78703 -5761 43439 44630 3928
20915 3928 15336 50851 31581 2188 -11679 -54584 -83889 -67343 -25555 6184 14534 21469
20903 21469 13611 -24591 -17344 -72244 -70697 800 25920 37119 40236 -4334 6607 -8384
20891 -8384 -17053 3136 -17375 -80311 -84747 -90301 -87042 -96797 -54296 -30105 -38645 -24242 -43013
20878 -43013 -47227 -34916 -19055 -20860 -4405 6303 -27577 -55499 -50779 -23538 21102 7397
20866 7397 26130 49102 35609 39827 15598 61307 58316 70 -54819 -51780 -11284 -12157 -66917
20853 -66917 -46963 421 4558 -2192 3385 52935 30467 15890 3596 -47294 -105180 -97789
20841 -97789 -36149 53159 32186 43251 63799 45451 55067 49918 27347 4096 7423 -17252
20829 -17252 -10795 14578 13798 -10913 -39109 -51619 -17064 7745 -7963 -19326 -7303 -29122
20817 -29122 -59251 -68457 -52594 -6720 43612 59285 49023 49935 -6488 -44206 -16799 6122
20805 6122 -14181 9229 15552 -39987 -68788 -30250 894 18869 40094 32830 -16843 -60503
20793 -60503 -48481 -33664 -37084 -16081 201 -1805 17370 14135 2886 -2901 -27840 -8690
20781 -8690 39134 33961 43091 43080 41945 30920 18196 45225 52248 37927 5350 -4320 -8352 14967
20767 14967 4275 -36844 -39506 2473 -9152 -10839 7141 -27501 -62117 -80797 -78884 -61765
20755 -61765 -52611 -15817 -4001 38740 52662 61271 33176 21815 -18249 -12284 27394 2530
20743 2530 -33131 -57071 -94584 -87292 -94480 -26049 10102 10454 37051 3385 42936 69715 61436
20730 61436 52523 7125 -26492 -44211 -30109 -6287 -59616 -65993 -35004 -52787 -15572 21062
20718 21062 59996 71381 49625 -5533 -34698 -36222 -9267 17257 23951 13761 4589 19282
20706 19282 20776 7938 -8238 14849 6097 6145 4315 31079 8722 33993 33528 16977 37405
20693 37405 35157 -1911 25939 83187 58540 59782 69506 56287 27687 -1496 30908 60352
20681 60352 9274 -26594 2467 -25398 -16285 34732 16195 26511 46097 62705 123479 170312
20669 170312 193335 215845 305643 404093 439696 407082 317773 268414 233523 167666 95554
20658 95554 38910 58541 77950 105864 109878 102676 111239 104212 129064 115818 55100 40783
20646 40783 55434 93219 128872 131115 108145 160040 227712 282638 325506 418473 573332 770559
20634 770559 1046986 1292983 1437844 1376666 1110722 823436 598872 440932 348599 263383
20624 263383 199365 165897 184294 176375 156685 148097 123097 137195 148637 138592 92257 72984
20612 72984 65849 84326 104863 145275 178981 210866 249813 318598 408446 513200 708421
20601 708421 946465 1225681 1425592 1419544 1221472 921452 646409 484793 338150 245781
20591 245781 181941 125789 107275 91468 67307 61092 73737 85976 64769 12382 11949 78417
20579 78417 78561 49771 65654 91478 53987 11609 16700 54901 108631 227774 280998 364691
20567 364691 454594 525345 533817 465862 324732 214081 142416 82268 36441 13605 52544
20556 52544 92649 103245 108708 63486 -3111 -23967 -31835 9969 -27860 -45116 -36161 -16735
20544 -16735 -16373 -10516 -29155 -32215 5016 13083 -34470 -32410 25593 5531 -2079 -22806 -70463
20531 -70463 -46582 -30512 -39317 -38214 -9994 15654 18635 8259 22793 46331 26348 38108
20519 38108 14543 -44050 -68178 -11338 32004 1000 -21688 -27743 -9147 -50764 -69627 -69683
20507 -69683 -32934 8768 -6481 124 4105 -12766 26123 29503 -758 6139 -18643 -7393
20495 -7393 27115 17894 56 -7720 -5236 -1219 28164 -2232 -69331 -48927 7066 3935 -51565
20482 -51565 -38611 21019 53803 39225 53400 16758 16658 12850 29387 14262 -23277 4506
20470 4506 -23282 -44514 738 -1680 -15873 19862 25381 22054 14123 25574 -2527 -43099 -43597
20457 -43597 -45525 14912 52459 19291 52612 21196 -14414 -82865 -131704 -109915 -62680 -24011
20445 -24011 29237 43484 27653 -3706 -50084 -24319 -5309 30949 11687 -39807 -24367 2097
20433 2097 -20806 20129 -4086 -60972 -85104 -81270 -30512 22874 43628 12897 -21217 -11239
20421 -11239 -25577 -3049 8281 -14231 -32220 22138 38990 13895 3331 -12664 20175 81879
20409 81879 119463 115745 44763 -35274 -16062 -51818 -85161 -79896 -15645 22204 32685 17520
20397 17520 347 4710 7196 -9153 -24028 16359 91368 107796 82757 31650 -16100 -3505
20385 -3505 -8302 -43097 -44768 -10643 -18629 -25312 -15325 -28026 -2446 31014 -5123 -8686 -30662
20372 -30662 2395 19215 11488 -11458 -37037 -24870 703 -9966 -7978 27052 -26553 -62663
20360 -62663 -48550 -28353 13892 29900 2393 -869 -29805 -64192 -81786 -81000 -95511 -80554
20348 -80554 -64673 -41544 -36070 -21591 -22721 -6358 -836 -21538 -57375 -38661 8326 9360
20336 9360 -10449 -10877 -26940 -25187 -62809 -59496 -16083 -15760 -69122 -31261 27552 51373 28025
20323 28025 2125 54681 28935 -4174 1337 67813 55077 69850 58124 48899 46940 92830
20311 92830 63461 14506 -8010 2567 5845 31911 24256 -56863 -54817 -20124 -14613 7813
20299 7813 37361 33631 -4898 -67152 -78982 -65282 -25518 1461 -21747 -16480 -20444 13516
20287 13516 34182 11808 -13257 -21690 25578 44172 3358 -5535 -26004 -13137 -20374 920
20275 920 -27474 -73935 -116105 -128438 -70158 -22349 -47829 -1171 38864 33105 8910 4312
20263 4312 -10263 -53477 -33209 7716 1819 -63514 -53861 -22451 -81847 -46487 -33476 16345
20251 16345 52312 5578 5923 29090 -7342 -10105 -40626 -85189 -60032 -62719 -21190 -44939
20239 -44939 -61519 -94154 -105889 -80239 -37991 1818 8644 -1819 -12304 -10424 34709 -5319
20227 -5319 43455 61070 35900 -205 70001 117263 53541 16559 -21118 -40874 -36062 -19124
20215 -19124 2680 29935 -5539 -92108 -127968 -149308 -105110 -60355 -30678 -4958 -25647 -48400
20203 -48400 -65741 -72293 -73166 -55361 -19585 10580 48521 70477 81846 44780 14355 -13951
20191 -13951 -50672 -40668 -7123 25590 36808 -31869 -67158 -120368 -128022 -112860 -84297 -36019
20179 -36019 7690 26945 29458 49576 -4353 -53487 -18290 -20822 -64052 -24443 18692 26415
20167 26415 -18748 -31808 -26585 14438 21240 53483 26776 21361 20884 55410 17536 -4684 12598
20154 12598 6925 21050 13483 4548 18530 15681 -23594 -70013 -51987 7621 35258 78948
20142 78948 71300 103787 92983 72368 33307 15386 -2754 -12081 -24242 -7390 8535 -5678
20130 -5678 -30628 -33205 -18359 -46009 -36564 -13170 25129 25812 -69156 -84495 -66034 -7189 20158
20117 20158 28129 29415 70991 61388 13496 -57370 -71488 -49361 -60928 -32914 12982 60367
20105 60367 44834 42947 13611 22302 29660 -12488 -58923 -59517 -38414 -27066 17313 -844 43527
20092 43527 46898 11685 -9949 1279 49747 52842 8413 -43746 -32940 5567 -32558 -28856
20080 -28856 -9341 1318 -3932 -8104 3355 30122 32204 33500 2760 -19515 -16353 2233 3199
20067 3199 11045 -42101 -42936 5617 18051 31538 -16286 -15640 43818 -2836 -70695 -89212 -18604
20054 -18604 17509 -29814 -41921 -5133 23778 1716 -24089 -32153 -61842 -50049 8756 44729
20042 44729 50270 74887 36248 14961 25773 43713 58288 61784 11650 -37103 -48394 -31823
20030 -31823 -19118 24516 22287 3420 -3233 32857 1382 -51634 -45321 -38473 14076 34940
20018 34940 11628 -14010 -26927 -30654 -45568 -63998 -26096 45058 79368 69161 32051 7973
20006 7973 30743 61898 23283 -3854 5818 1783 7380 -32977 3575 17303 33120 11423
19994 11423 2030 -4544 15279 24861 9666 -11206 -15127 31079 13557 -38780 -85326 -70293
19982 -70293 -38812 -61268 -20730 -25405 -53585 -53602 -55400 -69037 -57221 -91284 -70703 -23650 -30920
19969 -30920 -45388 -60677 -60257 -41471 -46818 -13002 40914 -4097 -37856 -35995 -22324 14932
19957 14932 9966 27036 -2676 -13868 9076 22974 -18225 -33386 15715 43091 61901 48291
19945 48291 28134 14709 36079 40609 -21671 -40570 -42551 -62642 -60000 1928 37069 26061
19933 26061 26006 38944 61420 53006 60127 104219 152225 146603 94961 7135 -22616 9824 11205
19920 11205 27485 49825 83575 67434 38644 15769 6413 -5991 225 -17986 -15058 -46924
19908 -46924 -49475 -21162 -4285 10252 -28517 -35464 4581 27112 18325 53307 41988 44422
19896 44422 37941 33671 53969 48758 54338 57770 81315 54638 7240 -6363 -67872 -111645 -74148
19883 -74148 -61580 -8226 30799 15975 -18194 -13953 27736 23837 32775 24838 13880 225
19871 225 13542 14160 1637 -42200 -45853 -59534 -38218 5119 -457 12079 37013 36702 -19509
19858 -19509 7433 37580 -17346 22032 49226 52140 18355 -1188 939 -23943 -65304 -52787
19846 -52787 -70567 -109893 -75516 -72764 -33853 -10327 28247 32646 22678 25566 -15491 -27944
19834 -27944 20687 40011 47200 62930 31824 41755 67812 16993 -14282 -28915 -16360 -14168
19822 -14168 31239 70405 66591 51526 49210 7665 51556 90215 58365 56589 29328 9202
19810 9202 16466 -1598 -11302 -22821 -38345 -65394 -69327 -68766 -45187 -2547 31131 44459 41333
19797 41333 -14390 -36323 -60274 -124150 -141965 -81521 -35759 -31297 -50452 -45998 -21736 -32707
19785 -32707 -37930 -10303 -6797 -15547 -25627 -4441 18219 37093 16877 -52173 -99202 -59448
19773 -59448 -31501 -21873 -24569 6266 30889 56028 31564 14261 -28021 -21938 -21979 -21419 7267
19760 7267 49840 38954 -2997 -39231 -17108 -7715 13307 68003 104164 109558 71722 44139
19748 44139 32952 94463 63815 50865 73720 71521 81378 75413 32809 -7795 -2507 -22185
19736 -22185 -40646 -37592 -46012 -38235 11339 43960 23459 -15380 33066 48343 46039 38950 31202
19723 31202 20732 22400 14356 66543 61854 31856 12056 6897 43517 18872 -9431 7256
19711 7256 -847 -48550 -98438 -72340 -5533 28833 56437 28234 -29575 6820 23218 -15093
19699 -15093 -53707 -24464 -36981 -98796 -112332 -70876 -55169 -38369 8731 67260 94145 79476
19687 79476 38408 63734 70136 54429 72126 67905 60555 77424 47006 7869 18007 41333
19675 41333 49716 8202 -52536 -55291 -41057 -10498 6104 47801 125391 104834 101714 80422
19663 80422 61990 81958 89804 59504 82005 135863 173593 183436 174219 152490 99047 7478
19651 7478 12028 18362 -201 -34497 -19518 37459 79478 74903 76163 74166 120623 105885 118717
19638 118717 147182 149277 108953 84081 65089 47992 5815 4866 18961 29250 24935 14871
19626 14871 20886 28028 6333 -27385 -27200 10451 31437 30805 19001 51510 52527 89370 127020
19613 127020 151604 142157 97420 78889 48831 76179 89426 76155 65708 37699 30223 -7309
19601 -7309 -11939 29428 16477 11953 10554 10844 22211 17057 17276 5054 25870 37233 33825 41140
19587 41140 75203 87689 118051 110580 43586 14426 15901 -1954 -42543 -28458 9814 25917
19575 25917 48507 115373 135773 134262 155675 193541 181473 127773 109252 85229 66598 76911
19563 76911 59185 81173 114321 138099 132450 29936 33844 37402 19261 -37855 -5872 60764
19551 60764 108314 102150 101079 89337 66448 59136 75212 110131 154650 138437 129718 110627
19539 110627 130266 137843 121822 148910 138619 164603 193193 208428 273221 319309 319340 304909
19527 304909 214516 182917 222779 276836 255616 196907 180176 160042 148637 126736 98139
19516 98139 107313 132224 133172 151463 177272 168279 142382 162712 214531 253011 216481 241693
19504 241693 225260 206864 230659 280003 263748 277245 258384 248448 217910 155360 155394 223902
19492 223902 282244 330545 302713 282476 299875 273035 266122 271900 305691 328478 337237 371517
19480 371517 383902 425280 436630 427732 440933 406778 436282 433606 423712 444022 500889 492467
19468 492467 499450 497276 504750 534465 566652 603696 612627 625736 616349 627477 643868 675041
19456 675041 736101 786709 816800 850706 871120 896024 932915 974347 1035875 1118849 1161553
19445 1161553 1205680 1309780 1368486 1446846 1515816 1551104 1652401 1768402 1857725 1950004 2039363
19434 2039363 2165463 2381382 2532790 2686182 2870506 3065077 3325113 3595239 3912438
19425 3912438 4253511 4620396 4993842 5451516 6050190 6674420 7465851 8327548 9387250
19416 9387250 10644015 12217371 14198054 16730862 19996733 24225481 29855691 37677699
19408 37677699 48722083 64591841 87523703 119792245 160362895 200307620 223666899
19401 223666899 216696813 183050787 140728570 104307390 77817231 59398661 46547174
19394 46547174 37342748 30562877 25413279 21437253 18319879 15802171 13751681 12093124
19386 12093124 10694754 9484544 8475307 7620080 6927667 6310366 5749857 5270367 4892819
19377 4892819 4476411 4136103 3861197 3622761 3397550 3179823 2935773 2708508 2578571
19368 2578571 2459838 2355419 2283628 2157765 2065383 1981091 1881572 1730479 1635623 1596829
19358 1596829 1565540 1496343 1461747 1420010 1362812 1277420 1174774 1091477 1021255 976184 914650
19347 914650 875680 890971 835709 794201 771407 754002 719240 699746 675186 608871 604681 634241
19335 634241 592350 582009 554395 525711 518031 545701 568626 553472 545282 561585 572706 559827
19323 559827 522397 531188 513812 447547 418223 391858 348649 365618 355086 341920 315752 305414
19311 305414 322252 361092 362512 347646 356418 337421 315070 298450 293372 281837 321173 304683
19299 304683 311003 317606 300927 252824 249697 298433 283815 237713 209426 218746 262879 305243
19287 305243 299406 272216 223333 182903 159764 118216 174998 218498 227737 199734 233685 246821
19275 246821 220600 201451 227053 218839 187976 220821 203514 181204 164329 131739 141718 134156
19263 134156 109356 66765 71171 131308 176172 139015 121839 147251 165965 177230 212049 210954
19251 210954 180311 181331 155097 129920 177623 155860 123489 90283 86726 136924 127432 96601
19239 96601 79591 84404 50420 -29560 -33064 -20887 -1721 39103 26160 33558 74611 106285
19227 106285 97036 133746 97581 29074 29373 58120 46909 72619 55308 59459 97056 98791
19215 98791 106822 113674 83015 59025 75658 106853 64492 68461 26387 20082 96256 91845 59731
19202 59731 29599 57258 64790 71318 42858 44306 60987 90077 74604 65207 53577 53704 51312
19189 51312 55480 101908 143895 111190 44750 58850 97809 108113 75089 68143 89618 140495
19177 140495 145949 161846 160335 135033 119708 110334 56669 58549 105636 108082 105009 141246 149425
19164 149425 140694 124528 107149 128345 172589 208483 224408 230850 231652 247361 233573 249984
19152 249984 273399 339701 436731 502936 513344 511412 624636 825079 1007353 1388362 1981914
19141 1981914 2891370 4070176 5226451 5843120 5460538 4318944 3191840 2365819 1799067
19132 1799067 1377444 1054171 851804 752564 645431 557519 467183 406018 410720 414259 459712
19121 459712 427032 343638 334391 364876 384947 429297 457972 530331 679327 900867 1144305
19110 1144305 1438896 1930886 2695228 3689214 4775751 5522398 5365999 4410006 3258137
19101 3258137 2289494 1643646 1195316 934664 749258 600685 484614 427817 344972 272454
19091 272454 238413 217419 235198 301769 278892 212308 143415 124355 137536 140083 122554 106868
19079 106868 111243 116307 86513 79784 108161 121295 93543 105118 110261 107872 93126 77775
19067 77775 45698 8583 -417 -22772 3376 49937 74568 63824 110497 55810 46599 80144
19055 80144 67595 92728 85306 74423 66221 48071 22290 30319 -6891 27749 -29807 -31362
19043 -31362 -17583 -2229 39426 49573 8672 -14444 -11975 -10306 -28584 -57639 -25948 1736
19031 1736 6383 12761 37010 28732 65911 106558 109267 78825 30386 7968 -64293 -79356 -38132
19018 -38132 -221 74588 93845 104972 101715 87835 81930 79883 26418 3486 6592 -12318
19006 -12318 11983 46455 33899 -12527 -10535 20983 94110 119259 92595 87064 50101 15553
18994 15553 -16567 -69937 -92273 -28795 6786 -13580 9497 32836 7597 -28060 -34439 4706
18982 4706 2419 38209 50013 39253 40811 46452 71768 108315 107362 112140 122149 120043 139786
18969 139786 119765 68175 21729 -4233 -24761 -12239 -1251 -6999 11303 62899 72756 59921
18957 59921 67004 75838 84983 73418 37330 -44222 3205 54592 38438 7733 19792 30824
18945 30824 56222 85366 51343 52564 67270 63857 30371 -16094 -10540 4507 21856 -28116
18933 -28116 -44832 -63662 -33004 -10754 -22730 -49266 -44827 -12453 4678 -22028 -15124 -13938
18921 -13938 -7843 31454 83037 99922 52848 8690 2419 35025 35407 31536 34691 39835 52977
18908 52977 45491 29690 1912 -3014 2896 -8668 -12877 -6455 -38687 4207 27088 -20604 -17225
18895 -17225 -17007 -6959 -16289 -18586 -33974 -35862 -19936 -14676 -7057 -9761 -33520 -42356 -30792
18882 -30792 -16081 5952 24759 1389 3881 20177 21749 16020 22644 -1937 14598 45245
18870 45245 86472 100493 103989 84372 96168 105043 75074 44883 -10379 -23967 12409 11556
18858 11556 20795 29317 33335 -1270 -733 38808 5058 2211 16010 19858 67307 88793 68884
18845 68884 54093 41670 8275 20645 11840 -13437 -5703 -400 -5855 -9160 44057 52178 22381
18832 22381 37998 73243 69769 26621 35174 35387 7109 -7607 28448 25060 14374 -2670 10241
18819 10241 70416 102702 64953 43711 52600 54306 4139 2858 -11908 -19480 -64952 -53851
18807 -53851 -12613 22469 10191 24808 40328 45717 58846 54095 82797 70108 61106 45472
18795 45472 43911 67787 43208 4463 -11600 -27749 -9137 19567 23633 892 25626 19775
18783 19775 15447 6682 -9706 -14905 -12383 5173 49893 61316 65357 77089 38066 -4741 3302
18770 3302 -37842 -9204 14558 32376 10054 -7518 16522 -4268 8638 22197 50084 28072
18758 28072 30234 11810 14091 9794 52311 81226 46653 55801 98393 53818 13620 -18793
18746 -18793 -16991 -12945 -24777 -31006 -28389 10914 57639 21062 -36572 -12325 13408 19649 -7282
18733 -7282 -28566 -42581 -21349 -58029 -83827 -103162 -99045 -84509 -65698 -43154 -25564 -25371
18721 -25371 -35990 -44484 -30395 3451 68240 84336 30161 12968 28661 45494 45485 -6729 -55044
18708 -55044 -68610 -60836 -70992 -66746 -65476 -74120 -40603 -5931 81727 62240 -2092 -15502
18696 -15502 19175 31532 1949 -18873 143 -15314 -48789 -81205 -77272 -66948 -59498 -21588
18684 -21588 21428 37708 53950 100835 87327 70262 82897 81323 71484 66921 51313 29940
18672 29940 31272 29264 -18181 -57853 -42480 17705 19756 12681 -1437 28908 46134 49325 50247
18659 50247 44816 11239 -19905 15924 44612 56755 33702 49566 58983 70999 64072 38017
18647 38017 47942 27850 29763 57012 36023 -5056 27372 27549 44494 4991 -35315 -74360
18635 -74360 -45699 -46800 -44192 -78539 -62854 -40265 43517 63403 48182 81836 47637 1588
18623 1588 6512 35594 52943 14587 -11376 -142 43799 39329 27048 3037 -56345 -63301
18611 -63301 8154 68742 69241 17882 -670 37830 38142 40422 8933 -41615 -3568 -11503 -9656
18598 -9656 3079 11557 63043 61424 41671 17364 -6246 -6901 56264 91635 96179 52676 24964
18585 24964 42401 19382 43499 43892 -1831 -19863 -45852 -59102 -384 85541 98508 104661
18573 104661 123156 89087 64418 51021 28053 28234 44386 24244 -12469 12182 64617 74127
18561 74127 58028 -6866 -34487 9796 55739 49468 27452 -5874 12275 35139 -4642 -25728
18549 -25728 -6565 -1810 -58 5543 21401 43266 35323 68144 76156 28097 11377 58647 55323
18536 55323 30827 53810 82582 71320 -11989 -29850 -36709 -6572 -15751 8570 46231 62763
18524 62763 46261 94212 148067 180796 190962 184254 183869 151100 144445 107298 75008 91764
18512 91764 159590 201086 237513 283520 304221 293791 280924 284723 242491 205080 260331 285486
18500 285486 332609 323919 355898 381846 392213 349804 280022 255490 235321 222490 265682 292010
18488 292010 286737 264940 262139 302759 341243 320379 253663 208246 185101 184732 230819 253205
18476 253205 209701 171794 193964 196199 148347 136043 121231 112066 104998 79105 88008 97384
18464 97384 66257 82320 80972 82493 70220 24710 -1303 -7293 -26931 983 33009 25720
18452 25720 33384 41430 56897 56164 21312 -10228 25157 64430 58147 59068 41685 30294 67301
18439 67301 47036 19971 9502 -22641 -71451 -62379 -45648 43324 78649 55524 54235 -3923
18427 -3923 -56317 -67040 -33564 -36144 -60773 -26018 20678 21387 32146 26970 31598 66251 132431
18414 132431 141782 115524 99542 84914 84581 90488 62846 55299 68233 34284 45485 82555
18402 82555 80014 93683 85170 42816 9990 9822 61824 93872 106368 89855 64057 77056
18390 77056 106446 129683 142007 98957 43060 64978 72982 69892 33221 54930 76252 71369
18378 71369 77449 46384 40493 53595 35874 4174 -15687 2091 9952 -14163 -15205 25664
18366 25664 34681 35540 18063 60783 52008 1675 -51309 -43102 -22271 -53867 -74315 -108326 -50440
18353 -50440 -33537 58893 92829 37901 19843 16960 14618 41509 70727 72859 76240 98473
18341 98473 46705 4551 30390 62864 60756 10680 7445 25060 64023 73900 90049 107996
18329 107996 102484 71914 102129 160386 134807 64428 81951 95345 70942 45172 43498 9814
18317 9814 21904 45211 62377 56194 63257 81835 106019 38180 -18365 6852 41569 61590
18305 61590 110451 123070 85590 20390 24234 50573 50881 89531 98179 74902 55072 10389
18293 10389 -57884 -47255 12839 23743 65638 122366 107572 66114 100796 124188 103688 93338
18281 93338 91228 96651 143739 156969 116834 86878 87893 98892 91642 74552 71172 36825 43821
18268 43821 47729 38337 37504 64773 30038 17356 54210 22000 68 -20304 -16387 15156 54768
18255 54768 27579 -31631 -28161 -14973 -29310 -13051 14191 4389 35368 51289 68214 59335
18243 59335 86555 104082 79636 50571 48182 54333 33597 41990 44820 61119 55793 56501 73828
18230 73828 101993 125158 118841 122018 109945 76302 66564 80760 115357 114589 117306 139666 146496
18217 146496 145782 189083 200945 168059 176991 157989 126168 118233 114213 94769 82941 73151 109782
18204 109782 93655 109275 110668 90111 42253 29310 6623 7502 56088 77140 95125 120586
18192 120586 136591 131478 155321 210286 218762 221993 219057 231007 250473 206401 183547 199801
18180 199801 169286 182732 205755 214025 200022 172966 183667 242797 233174 198419 147890 187720
18168 187720 195239 213368 269007 265150 217107 172272 142008 224184 284392 267491 267822 294198
18156 294198 241951 215485 235245 216928 242641 241919 256047 262138 262129 303122 362181 387625 401369
18143 401369 420929 412777 413190 410198 429841 434303 406437 408540 457399 468009 468948 468334 475562 492221
18129 492221 495725 540653 604313 612744 657453 660674 697267 653232 706257 788389 799063 832062
18117 832062 936929 997882 1012101 1076526 1145936 1268605 1385442 1498214 1635072 1779161
18107 1779161 1908930 2114377 2346464 2586539 2817354 3121108 3546266 4013458 4617626
18098 4617626 5463100 6583829 7939302 9705271 11956382 14529714 17213289 19597353
18090 19597353 21294994 22061939 22050427 21769521 21768374 22394171 23957631 26620980 30406328
18081 30406328 35064835 40028900 44113562 46220554 45932856 43866562 41356506 39485491
18073 39485491 38948695 39980383 42767291 47211462 52812270 58477499 62417200 63134186
18065 63134186 60310752 55073729 49320486 44458446 41118230 39480272 39532124 41069026
18057 41069026 43500926 45843678 46922750 45797985 42369219 37587754 32679391 28573815
18049 28573815 25624195 23746805 22811339 22581821 22763720 22872711 22421471 21072466 18847236
18040 18847236 16214579 13577043 11227203 9283069 7743505 6542534 5598963 4903792
18032 4903792 4293739 3797971 3400414 3054471 2827416 2574224 2387427 2192266 2027916
18023 2027916 1875827 1743999 1604904 1531445 1457957 1370721 1249094 1152064 1113100 1073703
18013 1073703 988711 922974 869578 847286 812572 803026 802097 782793 725619 722855 637034 638716
18001 638716 612843 518791 494083 516234 558813 579704 562331 563942 529283 452901 471772 504769
17989 504769 465314 453914 472268 423390 433189 461886 454134 439593 437145 426991 399167 388934
17977 388934 373127 384387 387963 402763 380956 396819 407475 374890 368323 349271 331269 351342
17965 351342 390645 398423 391133 398143 351280 323831 313789 331703 304922 319464 368871 425677
17953 425677 460663 462199 455922 429705 382433 386082 382740 377935 406124 351570 413090 492446
17941 492446 506655 491967 476697 486715 524250 592553 673210 711100 804244 896930 1022085
17930 1022085 1197679 1425449 1715059 2014193 2268440 2509017 2670398 2787065 2831367 2827138
17920 2827138 2781528 2663777 2417857 2172870 1954823 1630490 1314783 1101214 941735 798244
17910 798244 709586 672957 594944 527604 470331 418834 411011 417708 397439 415444 413253 370064
17898 370064 383264 348787 336046 365009 379844 319056 286681 270517 228864 210097 184884
17887 184884 215402 293951 299256 298372 307437 330459 335073 328778 290155 307934 329948 345250 312658
17874 312658 287298 312155 332657 390937 407812 396062 378165 333084 329280 399323 444176 465723
17862 465723 487123 509688 561834 578395 600054 625111 645976 666359 693285 759421 853872
17851 853872 1046192 1283347 1497001 1716815 1984901 2237143 2478986 2670089 2742463 2797067
17841 2797067 2835289 2782272 2633419 2417063 2183017 1951045 1711823 1513876 1368667 1183476
17831 1183476 1039300 999528 976035 953074 884564 840617 836870 846260 852902 951084 1061850
17820 1061850 1173742 1274387 1425657 1624209 1745969 1885037 2035847 2101453 2145216 2135718
17810 2135718 2089094 2049688 1959284 1827494 1625027 1412830 1245884 1131047 980831 905958
17800 905958 800911 711669 687590 688670 662242 604277 587373 597272 594744 612572 586747 523129
17788 523129 488128 495827 511854 541778 562806 601624 615166 674556 685036 692632 657798 620169
17776 620169 625103 679474 728561 708366 684720 694366 659004 595675 545236 511889 466216 475824
17764 475824 459758 424699 375262 349702 373251 409450 393607 381595 415372 443984 417261
17753 417261 382660 401331 448943 442467 416525 346882 346573 338339 331343 318622 289306 245779
17741 245779 210525 224376 273416 258950 277702 330079 323589 300636 339500 395320 369832 365694
17729 365694 361079 342902 318917 310127 300242 312716 338296 379065 356215 288690 272396 254444
17717 254444 259365 266390 280693 294624 328248 335362 312342 319423 303685 300239 347175 386032
17705 386032 416517 513859 617624 662099 662365 722064 762120 828172 865867 887759 896820 903579
17693 903579 893831 866692 832453 803182 762076 745656 754427 735103 715881 666356 610006 559732
17681 559732 511286 496744 548803 594056 555610 482006 457594 498040 485522 513962 497405
17670 497405 510580 491623 436937 498690 511464 479451 498336 551092 615582 738529 759600
17659 759600 757251 826388 909506 964607 1061116 1135716 1139117 1174961 1208155 1248803 1246157 1237173
17647 1237173 1234707 1199081 1152805 1160471 1170790 1168409 1181799 1161104 1142248 1081411 1075086 1020789
17635 1020789 1001797 1032293 1087374 1107031 1187086 1267804 1290432 1286866 1285526 1247760 1247845 1285823
17623 1285823 1287099 1332660 1390100 1455444 1501110 1570333 1588836 1574051 1623730 1648175 1684491
17612 1684491 1777868 1825800 1802338 1797121 1803882 1836800 1899151 1913826 1915873 1917922 1904738 1889667
17600 1889667 1938448 1957503 1911694 1898564 1924854 2013325 2066692 2091947 2151753 2223161 2281784
17589 2281784 2358995 2483466 2618306 2719012 2831858 2930709 3060729 3166029 3275003 3396291
17579 3396291 3601800 3805204 4028387 4247377 4431497 4658789 4923838 5190880 5446363
17570 5446363 5748123 6110156 6540479 6970082 7391501 7819281 8223840 8551226 8832191
17561 8832191 9083014 9278795 9453406 9662235 9955151 10278553 10675548 11132975 11735348
17552 11735348 12505050 13421431 14488956 15759656 17254200 19033419 21042787 23299149
17544 23299149 25851836 28592887 31546345 34880280 38710185 43153670 48423284 54776484
17536 54776484 62711167 72923718 86482575 104803976 129610871 162757110 205506641
17529 205506641 257143188 314304648 370852538 420115580 457248381 480783737 492068421
17522 492068421 492562420 482175620 459573390 423525028 375407592 320097382 264101653
17515 264101653 213427369 171474040 138775232 114119042 95702921 81794068 71094144
17508 71094144 62678900 55945100 50397046 45582623 41384879 37673071 34464153 31536316
17500 31536316 28870963 26459793 24356025 22471404 20800793 19368372 18085344 17024860
17492 17024860 16204736 15514777 14897874 14381355 13934255 13560643 13322053 13146655 13039454
17483 13039454 13008022 12981023 13006629 13157419 13382121 13625340 13895189 14238346 14714164 15295732
17473 15295732 15980797 16870357 17916114 19191602 20720007 22522619 24571369 26878512
17465 26878512 29477439 32350262 35535885 39136448 43305486 48150287 53826282 60591700
17457 60591700 68906714 79682579 93953949 113185191 139132685 173563417 217339703
17450 217339703 269232958 325020163 377944130 421399903 451490446 468483297 475581371
17443 475581371 475361703 467406650 448830411 416734050 371644240 318299140 263489036
17436 263489036 213506447 171893200 139416677 114799238 96254050 82216963 71456846
17429 71456846 63038004 56231250 50643087 45803676 41663634 38162444 35087901 32392319
17421 32392319 30014914 27861553 25876881 24033937 22396275 20894774 19495804 18196574
17413 18196574 16929051 15734639 14540165 13493193 12536274 11682716 10959822 10299086 9721958
17404 9721958 9204587 8704340 8196973 7715491 7330153 7010213 6719381 6421197 6148835
17395 6148835 5927504 5707033 5484256 5265522 5060515 4884871 4702181 4555064 4385370
17386 4385370 4206084 4023524 3934289 3816177 3697263 3643968 3548095 3459705 3366634 3321962
17376 3321962 3251868 3196803 3116790 3056246 2953388 2861618 2840608 2786041 2703088 2629766 2547683
17365 2547683 2468766 2418236 2345502 2236719 2113548 2009877 1946437 1857164 1832779 1831165 1795287
17354 1795287 1791992 1773814 1747706 1673713 1686120 1668682 1719606 1743778 1722310 1663200 1680191
17343 1680191 1651842 1609985 1620502 1663364 1646247 1599469 1527984 1535069 1610474 1639063 1622045
17332 1622045 1609618 1560085 1502342 1465252 1446660 1417191 1376857 1332695 1333847 1336090 1352797 1364625
17320 1364625 1295572 1256019 1218599 1208267 1186333 1157168 1180799 1170526 1147830 1102940 1078433
17309 1078433 1062377 1092522 1115130 1092178 1082836 1104315 1078527 1022866 996051 992319 983140 1004360
17297 1004360 978340 989784 1018993 1007991 948253 931882 940996 867645 860084 868806 832914 784643
17285 784643 719837 702179 698341 646913 602752 599085 629193 606374 594823 617556 642097 632229
17273 632229 607980 636693 676520 726725 686713 646842 683442 671044 655421 663522 689452 699577
17261 699577 677063 707682 695159 690081 711912 746796 787640 802061 784715 706136 667759 685328
17249 685328 693607 689306 657795 631415 602123 613483 595580 578663 561355 489051 485169 503697
17237 503697 509646 514988 502215 491022 437506 452715 486856 462700 455138 510616 566482 633577
17225 633577 633164 587715 554372 496383 488744 539846 516921 455699 421916 406145 391410 349828
17213 349828 325061 365926 388736 363191 329218 383653 417187 381443 378130 399174 386895 396694
17201 396694 377684 350709 310146 324180 361186 400712 406065 402016 409173 402176 400360 391436 382855
17188 382855 405205 412629 409068 367951 298273 316675 306519 311854 328298 373303 406173 410646
17176 410646 394674 408961 435136 439633 430957 447908 414749 378056 375213 364414 301832 259459
17164 259459 311475 346854 391940 397633 388089 382602 387801 381333 340291 302226 350631 345388 328270
17151 328270 366405 348252 339844 358679 381481 384740 409712 406133 408280 463616 441078 385353
17139 385353 384353 441165 440199 440344 428043 430103 478752 506275 535667 585319 655487 767021
17127 767021 919954 1114780 1322640 1550538 1851821 2170649 2424600 2620083 2739093 2782665
17117 2782665 2737352 2672069 2531654 2323490 2054107 1821749 1544329 1286502 1104283 897899
17107 897899 743977 646174 577300 491454 470193 472065 452384 434993 450520 453175 455571 440115
17095 440115 390113 329999 301227 310090 295911 313505 355268 336328 301633 314039 293305 264385
17083 264385 236819 212727 228683 211568 215666 274094 249316 241071 273132 271462 284654 314594
17071 314594 218783 209747 211582 250737 265760 304724 326405 308814 318089 301596 301167 364398
17059 364398 396597 392574 425818 474781 534190 585064 598355 648382 730316 796210 912441
17048 912441 1144439 1397262 1665943 1929607 2166517 2415668 2551212 2606057 2628078 2592146
17038 2592146 2516611 2407527 2281496 2080958 1787895 1477323 1205384 1016469 876320 782609
17028 782609 663373 571752 479846 434514 380233 360607 379830 378561 311603 315140 305005 239204
17016 239204 229329 221104 256761 280531 262892 253517 204315 235176 273223 221933 188535 201611
17004 201611 255728 282840 258197 230308 248548 215145 180449 178575 162506 154781 154835 140147
16992 140147 114219 148751 164854 158669 152640 130095 143600 130847 92873 80363 98790 70617
16980 70617 42021 21926 66507 99542 82821 103632 128543 185903 176543 154087 218524 211128
16968 211128 216561 257748 222337 155606 95824 76018 85806 119103 161912 141147 122479 114848
16956 114848 148553 162689 111928 103396 133042 110096 70895 61527 86871 96737 136545 113184
16944 113184 93361 88705 92580 175437 205404 151632 126412 123038 75658 69114 86224 75055
16932 75055 45217 46697 -7469 37462 95935 101497 124971 117712 103016 81548 107143 124042
16920 124042 113200 112735 119817 73222 47335 35036 36588 88622 152333 181434 120149 112611
16908 112611 100273 119259 151266 85931 59071 41559 39374 79291 79563 32593 15226 79363
16896 79363 133049 159191 149980 129739 121183 121342 122378 94599 73620 86057 106581 115466 112595
16883 112595 125929 98061 89773 139456 187378 177366 93463 68079 104345 100850 48008 2815
16871 2815 47878 98986 100526 107093 123657 155013 137276 89896 86294 100051 126030 125704 121878
16858 121878 104439 110185 109855 73678 50096 47974 38127 25595 52687 64905 34317 26028 22366
16845 22366 9101 25248 12347 17333 6258 26880 41373 6796 -21200 18711 70498 103320
16833 103320 76220 65622 74617 86978 103211 95826 100144 145644 157927 163731 171462 155446
16821 155446 142400 161602 168176 163518 153766 139903 117548 82228 62232 34932 43876 43906 39407
16808 39407 48461 52937 104776 124053 130849 145488 120622 71630 56249 63087 73995 73105 67927
16795 67927 92398 92315 62189 29067 54463 68730 53571 88861 137044 145832 128852 138530 130172
16782 130172 92026 63989 44075 70308 65962 51890 42099 4675 29000 58595 53209 73519
16770 73519 79440 24168 37188 50907 17712 89 45565 62371 44741 -12861 1738 7317
16758 7317 16212 16702 26895 39010 71482 94055 143843 143834 76322 -4696 -17184 52556 29779
16745 29779 33975 45072 26982 35494 35239 48653 37347 -3017 -17520 -11650 -9535 13051 33209
16732 33209 25750 42732 69649 73068 78896 91919 89988 65213 27646 17342 33840 24984 14953
16719 14953 -7795 -54276 -53102 -16535 13176 56346 69033 92340 78231 39771 34606 53921
16707 53921 57475 59748 23788 38903 60864 42832 63198 70613 57692 20408 31051 55816
16695 55816 38791 11468 -29302 24152 63524 55195 38174 25314 30593 -30933 -31327 -23172 13190
16682 13190 77633 80835 30614 27179 14781 3183 -3503 -31501 -7001 39288 72975 73698 54157
16669 54157 19077 -22557 -34121 -36238 -40767 514 68739 93182 63192 28164 18940 14816
16657 14816 -17914 -35379 -33926 -16220 15718 26064 1043 10270 45962 31153 23671 25580
16645 25580 67681 23615 -49443 -61383 -17128 16563 19345 41196 51999 92309 94759 112284
16633 112284 118742 84226 23718 25561 41220 42888 17359 31708 26444 -473 46092 66976
16621 66976 32589 31113 45430 23469 41223 46305 22278 55725 85654 69253 87565 86779
16609 86779 56767 15099 43484 83699 86160 81183 62321 15116 -22372 -20423 18694 57864
16597 57864 16163 17975 86614 102002 81324 73470 74797 60153 80889 66248 50849 41634
16585 41634 56307 61107 68537 59432 37038 31819 28329 12003 -55235 -57074 -25617 31213 43461
16572 43461 22532 -9160 -13057 -7394 28904 42032 42831 35737 37399 35570 47446 76472 83878
16559 83878 71257 61551 45752 26218 78918 61172 12796 68309 94881 98685 46623 -6434
16547 -6434 -12460 1893 27468 41829 -2908 -23222 -59086 -62567 -47364 -6792 1340 3007 1553
16534 1553 25396 38493 -1664 -58463 -52266 -61230 -20552 41423 104485 86616 43446 40976
16522 40976 46239 78452 35283 -19766 -18960 -27386 -37070 -53139 7165 46574 42758 24097 22054
16509 22054 36472 83633 120764 129118 72847 40699 17604 3488 32401 55902 39649 63811
16497 63811 71687 60972 77838 81672 85897 37682 60272 75843 47802 59289 41005 29402
16485 29402 21669 -7252 6191 15695 31495 29849 -3858 3256 28045 37799 28614 5785 34616
16472 34616 28215 19727 16640 6276 -2104 29876 30016 28947 40612 42436 36200 19926 -2581
16459 -2581 -71565 -129427 -85642 -38037 -24721 -6311 67994 58218 54866 51727 68290 45719
16447 45719 387 15521 46081 75961 107483 77442 23040 29526 32411 63350 63147 33890
16435 33890 -6085 -72365 -81674 -47708 -47749 25278 62215 29216 38499 54264 74343 86140 58957
16422 58957 -1209 -1461 -14370 -23828 -57398 -68301 -10727 12241 -4 -7099 35347 59028
16410 59028 86268 66093 34487 32538 69672 45369 58144 82085 63823 -616 9933 41732
16398 41732 75865 74207 56210 72208 89204 85750 20560 13760 17986 18178 27086 37554 -578
16385 -578 -25690 -56690 -19643 25824 6120 25673 28662 73048 94185 59265 21974 19450
16373 19450 89727 90561 23226 19137 6353 -9702 -6657 23340 53852 27740 9737 -21869
16361 -21869 -36725 -4555 -18120 -37814 -65130 -47561 -31371 -8289 35574 18661 -18871 2411
16349 2411 38043 39562 30209 44448 89266 95589 95337 42659 -337 -31816 -65781 -54558 -4857
16336 -4857 41515 54300 -5528 13609 41941 48266 36741 48573 61731 63169 80869 91859
16324 91859 84781 40060 23438 20570 1409 -1345 -6031 4850 2248 -7863 4243 32956 67052
16311 67052 63315 48138 31694 50519 85348 55312 -8156 -17500 -10889 5979 40628 74055
16299 74055 71611 31168 13102 -12293 -35931 -27500 -27760 -32090 -54818 -31719 -23007 26704 48102
16286 48102 47473 19288 10680 -1079 -11957 2038 3294 12694 44207 46735 38552 52783 94444
16273 94444 69135 21807 1898 -17259 -43328 -46869 -44699 -57603 -24133 32781 17371 55507
16261 55507 36739 10433 36140 64429 69005 48086 37213 6933 39945 55848 27424 -18443
16249 -18443 3762 31888 32351 -15609 10293 36068 91013 76964 11026 -20840 -17603 -30392
16237 -30392 -92640 -92907 -43725 30216 74754 77311 52599 14556 -7692 -1579 -13724 -32108
16225 -32108 -36181 7966 25730 75024 92587 96810 67227 68083 25009 4508 -11229 -23409
16213 -23409 -24468 -44408 -46911 2502 27378 8699 -9660 -6534 21448 69052 63954 45524
16201 45524 23725 -13997 18629 88728 63232 -15031 -15138 4542 16717 -2446 18544 7901
16189 7901 -7879 6810 -12983 -4739 36660 20252 12853 29514 43760 61361 53818 29749
16177 29749 23032 -2753 -14173 19833 62601 54509 63635 42084 -401 4729 23756 49247
16165 49247 39918 -8600 -35026 -26105 -4886 12726 4428 -61481 -103225 -73135 -6145 -22791
16153 -22791 -30770 3633 27889 12229 -15 7085 22505 56003 46515 20720 20822 24807 11279
16140 11279 6592 -38993 -15988 39954 6197 -17847 -12256 -31176 -29318 -60785 -71092 -42792
16128 -42792 -16066 24085 20256 41726 47402 30252 25339 5305 -8637 18854 58150 81723
16116 81723 79435 94747 58202 47026 43843 -23961 -33016 -18757 -22675 -58283 -84139 -96756
16104 -96756 -82077 -58074 -15662 -11132 -1889 13548 -10299 -19360 -8300 -26111 -21974 17326
16092 17326 48694 44010 79874 87014 52451 -7358 -7375 54241 51773 13429 23922 56245 49577
16079 49577 31973 7273 -32763 -28273 5174 6584 426 -25256 -434 55015 112358 112540 101466
16066 101466 59127 38455 56823 76307 60917 24517 15010 4641 -5183 -3468 -8813 31224
16054 31224 58751 55751 27763 -44155 -16893 42721 42895 43240 16043 13818 21779 -29972 -47529
16041 -47529 -20554 11099 -1228 10326 17936 64852 79558 33100 7541 46859 86239 84801
16029 84801 46152 20532 14710 15074 -26100 -37834 22000 46069 43938 20670 17415 30400 27087
16016 27087 3527 -62734 -73234 -9745 21078 7621 -16813 -51054 -43030 -4444 71906 77599
16004 77599 73183 43271 25850 33550 69584 64908 44937 10222 15924 39700 32559 49862 100086
15991 100086 96137 57438 75583 46554 26879 47134 34309 31939 35339 -24807 -18042 -1881
15979 -1881 -9973 -11890 18161 49273 22062 15075 9660 12977 -14792 -11831 -1228 -14058 4624
15966 4624 -5016 6244 43150 56800 32031 15383 22017 -2900 28867 -10646 -19768 -25310 -5404
15953 -5404 5159 -5867 -34814 -38166 -59934 -89594 -30774 -270 75118 111235 44155 11521
15941 11521 -4017 -9820 3430 5044 27734 11267 72475 108581 107132 99717 67929 -5138
15929 -5138 14714 47588 35921 56485 44055 99149 93199 93638 107262 130971 130730 90860 82551
15916 82551 114417 75816 45778 19607 30918 31289 3381 -7926 32391 6971 22488 49351
15904 49351 59741 56479 79135 83886 53319 25043 -3569 217 -1145 29796 73615 73370 44802
15891 44802 33592 36835 22620 -21419 -25829 3450 -60634 -10824 31565 53453 34680 -18527
15879 -18527 -20956 14194 38967 1811 14770 29043 4515 2931 -15331 -64288 -76341 -91727
15867 -91727 -91361 -77230 -29209 24036 -5421 -52421 -52398 -12682 41673 49213 44149 11000 -17509
15854 -17509 36102 41800 48821 41127 18402 8807 -3688 -39666 -52999 -69683 -88135 -71804
15842 -71804 -3033 5028 5218 5416 -56835 -72256 -70130 -76749 -54469 -3437 12405 22778 -8822
15829 -8822 3967 21180 -5287 -20751 -23373 -10592 19165 31932 18959 14169 22029 27125 43806
15816 43806 29842 -34180 -30817 -9050 -1760 15729 71844 94555 51303 13330 33694 20565
15804 20565 5196 -47456 -67755 -35681 3031 29930 42248 29950 3504 13934 -8938 -26964
15792 -26964 -18699 -20461 -6217 -15451 -53326 -44262 -16944 -37086 -66630 -50595 -43686 6476 50304
15779 50304 21505 16448 -20892 -33543 -20133 -20823 -25674 -25089 17954 45576 33161 35753 832
15766 832 -20809 -24383 -13695 -37228 -28110 -62691 -73225 -33503 -7654 -10590 7689 17660 21815
15753 21815 -4947 4776 9578 26003 -4467 -24321 -46978 -46808 -5582 19476 28308 11477 222
15740 222 -12745 -95733 -122570 -91270 -326 -1431 14481 10097 17365 32421 33314 25040 64372
15727 64372 73785 17205 1827 -10398 6025 2694 -28995 -12532 -560 6225 16693 526
15715 526 -32186 -39252 -25706 -18491 -40164 -19233 -13552 -67818 11745 35219 8831 11976 -3889
15702 -3889 -37064 -10617 -1793 -55037 -28981 -30465 5830 797 401 -3942 -37603 -35657 -3975
15689 -3975 25598 44686 13892 -38242 -36514 -40826 -60763 -46062 -15909 -1162 2680 12248 2195
15676 2195 8999 32583 11602 44215 58583 28161 21322 19437 21337 -16836 -14478 -22657 -29530
15663 -29530 -14770 -9548 20659 46552 -16767 -36334 -4924 -13358 -21234 -24653 2590 46191
15651 46191 75801 106369 119336 123027 77915 62189 47579 45566 50915 28704 -34686 -42074
15639 -42074 5995 54301 -218 -40271 -35614 -9844 39849 11649 4515 -19614 -11562 -15568
15627 -15568 1612 14645 34880 25964 4663 7224 16072 44185 36023 5831 22510 37725
15615 37725 9883 -17129 -44601 -98106 -104778 -25964 -24178 9044 38165 -11161 -74962 -81689
15603 -81689 -70867 -38123 -39013 -62540 -29888 6627 45786 65898 17588 -23121 20971 1781
15591 1781 -37564 -28316 -38021 -28028 -25170 38208 30789 20746 36362 50445 46277 17221 14365
15578 14365 14766 -21874 -1693 -30592 -119690 -116580 -35030 -15547 393 11008 73580 128183
15566 128183 107592 48302 46073 61019 50842 57639 88717 105175 87481 25775 -23373 -5036
15554 -5036 17512 56246 46781 36379 -2125 -17863 -4437 8464 16792 25086 55939 38542
15542 38542 33263 15281 -21619 -13947 -38214 -35846 14225 27354 -4544 -33736 -34208 -28350 -54293
15529 -54293 -83298 -70118 -42407 -53837 -55135 -36024 -11882 16293 454 -21156 18463 53532
15517 53532 51652 30376 18399 4448 -27359 -42891 -41330 -47813 -48431 -14747 -43880 -84644 -114098
15504 -114098 -110641 -76612 -35098 -14186 11332 -37126 -51262 -28613 -10480 -36405 -85168 -113008
15492 -113008 -100970 -98160 -58229 -33306 -40569 -43927 -38484 -19420 -17267 -51408 -60669 -37611 -6029
15479 -6029 29254 74487 62772 63832 63735 64510 51754 59293 46486 -6562 -27285 5537 39094
15466 39094 -6996 1271 35392 33412 13757 -3457 26139 102311 84106 46030 49244 -6363
15454 -6363 -19670 22800 33995 45661 24664 43649 50838 40645 28096 -20952 -38797 -65794
15442 -65794 -43834 -20549 1446 2875 -50364 -24173 37143 63566 54106 -21298 -93224 -97613
15430 -97613 -102102 -89475 -82924 -87721 -55755 -66788 -25247 12252 21636 32466 210 -20331
15418 -20331 -21382 -7425 12191 20553 -4563 3280 1390 -38589 -49595 -7874 23983 -12803
15406 -12803 -44558 -19742 -976 75198 103654 45265 24676 47340 62226 19301 -10447 -20311
15394 -20311 -21876 15548 15151 1637 4519 -33035 -86300 -68737 -63140 -40268 -18417 -10347 -39501
15381 -39501 -41522 -2557 14500 -2129 -28828 -42158 -7168 -19310 -2956 40263 38369 -4359
15369 -4359 17741 26749 12278 37066 54659 69329 57487 76796 67153 24146 -22936 -48699
15357 -48699 -73391 -51759 -44770 -25939 -7854 3976 -44222 -45079 -70684 -91967 -98884 -81245
15345 -81245 -93938 -68710 -77035 -91128 -69163 -35987 -22304 16161 53699 35146 3703 5935
15333 5935 4963 19794 11252 -9275 6457 37149 51842 9778 -29722 -40441 -30932 -70606 -76859
15320 -76859 -52570 -49360 -28536 -10708 -14748 -25294 -2552 -2913 1951 14845 -7309 -16693 -9577
15307 -9577 -15927 -10715 -1975 28569 622 -33809 -29421 -41991 -18253 13373 62905 75255 21021
15294 21021 -31335 -77441 -59570 11086 29690 63681 84696 52752 27093 -21759 -3011 21220
15282 21220 59867 55780 14640 4420 27028 8014 -3281 4444 -43322 -3264 64908 55166
15270 55166 82076 33760 -60896 -92251 -96418 -59814 -10225 31077 71480 58074 32642 9110
15258 9110 -3312 4402 50786 70199 -4002 -22904 5816 18637 51857 24709 25417 7100
15246 7100 -86253 -102174 -26211 28739 67144 81235 -5043 -77922 -69431 -85316 -115100 -121160
15234 -121160 -60058 -41482 -7006 -2483 -27819 -19942 12246 16306 15004 26529 24271 16624 20467
15221 20467 31340 56846 12898 -55643 -57209 -17639 17212 56756 51525 21235 15256 43993
15209 43993 8766 -32374 -24692 -40956 -35268 3468 27778 575 -44717 -36631 -35689 -22341 -25651
15196 -25651 -1402 18784 -14926 -13351 -6285 -17933 -29251 -29181 -14221 -4626 -9340 -28526 -5379
15183 -5379 5421 18053 30823 10242 31330 17953 47 1200 -6316 44033 72780 74558
15171 74558 30996 40376 57619 134989 127698 63966 13191 -870 39219 8575 -10923 -9529
15159 -9529 2351 10179 5664 -28570 -39489 -74410 -69942 -37206 13934 24653 32951 11576 30401
15146 30401 3646 -42116 -75835 -41584 -4726 -40106 -78334 -64015 -39664 -35478 -35483 -31377 -17142
15133 -17142 11229 30766 944 20319 13293 -17568 -17678 -2672 9025 19989 31531 10192
15121 10192 -16586 2947 26085 18403 26001 -12936 -16437 39943 48713 50607 72876 70809 47111
15108 47111 -40304 -98086 -87487 -66123 -61910 -62791 -79379 -53688 -21018 40834 32713 -25422
15096 -25422 -21421 -55729 -52165 -54385 -51746 -35711 -7465 22855 3320 2780 15610 27418 40096
15083 40096 81101 35871 33396 43311 -5757 10976 18028 46705 61013 56398 92541 86754 36220
15070 36220 27625 68315 14664 -43650 -44095 -81540 -103447 -79792 -23149 -21692 -46228 8164
15058 8164 9130 33926 56740 54815 19904 2326 -36398 -56468 43792 66300 39989 11863
15046 11863 -120 58578 95874 68257 66149 53803 26943 -663 -21436 -11670 17056 33472
15034 33472 82095 90132 54969 42914 39496 25605 41758 61753 16781 3876 56621 82766
15022 82766 109219 89700 68871 85064 46019 4068 14044 20147 48375 67221 87730 71670
15010 71670 32550 33396 11132 -6316 -30307 -37351 -11941 -35965 -58080 -25967 41538 23929
14998 23929 11762 -2718 3166 40666 -2343 4602 16728 -227 8091 2386 13923 45904
14986 45904 2964 -18607 -27740 -41639 -56553 -45867 -31036 -29407 -28301 -16631 -14283 -61508
14974 -61508 -86879 -94644 -79238 -39011 -10687 -7171 -10619 -11991 -5372 8316 20744 -58056 -45503
14961 -45503 -12367 -10742 -21914 -13492 -36916 -21637 29018 6449 -16190 -16247 30644 10604 -50796
14948 -50796 -60250 -22773 15827 12832 -6068 -10312 -17072 -29424 -6179 -13355 -5183 6080 29742
14935 29742 -35017 -49100 -13571 -27913 -66533 -64690 -55893 -25585 549 734 34254 11112
14923 11112 -9946 960 22576 -22622 -34184 -7739 27645 11006 35706 4702 8752 35951
14911 35951 15223 18820 11923 23750 22394 9131 -49886 -58817 -35172 -16977 -15483 -27398 -27741
14898 -27741 -49534 -45503 -10804 14678 61733 77080 42572 18787 10139 32571 25636 16200
14886 16200 -7737 -5744 45495 73145 58725 61489 64085 35594 18407 7866 -6405 43138
14874 43138 43222 69393 59916 41004 31306 13051 5354 -29492 -3023 -16795 -75703 -91885 -55034
14861 -55034 -32473 -14676 -14758 10348 43043 26368 20209 35680 6368 16127 9274 -25607 -22828
14848 -22828 -12030 -1236 -38098 -26531 -5057 15389 -1047 -19584 -24680 10186 -6312 -23867
14836 -23867 -24657 23516 25969 -22317 -46598 -31937 -4846 30672 54216 35765 25284 11231
14824 11231 6461 9063 53754 49747 48100 5501 6817 -32383 2195 24271 56467 76091 38805
14811 38805 21012 -17649 1374 23153 52270 -22757 -91488 -80013 -28070 -26181 -39313 -23791
14799 -23791 -20444 -21547 16629 -12710 -14103 9283 18309 16335 12746 -23593 -41732 2878 34160
14786 34160 57112 79698 80013 44505 -14612 32510 33134 -5209 -35494 -37997 -12765 -23648 -11750
14773 -11750 9978 43981 54188 69470 85846 30090 36240 47114 45152 55548 43173 11061
14761 11061 -750 -33069 -33809 39462 47118 -4159 -9861 -34958 -55816 -18502 20921 39740
14749 39740 44205 -29844 -65579 -18890 -1740 5947 -42999 -19204 -7334 6107 35274 81508
14737 81508 90048 42358 5861 32094 76534 81473 59519 16468 15010 11940 -2872 44781
14725 44781 47191 22281 32531 10229 -48589 -77247 -38502 -1745 26425 23255 -20151 -19030
14713 -19030 8849 -20936 -20044 -6887 -3427 -28769 -73680 -69785 -48840 -16538 23710 1006
14701 1006 20009 34914 -21162 -34097 -21584 12297 34060 39659 5436 -2961 -41253 -33742
14689 -33742 -11687 -37467 -69648 -75549 -53159 6180 -4568 -29265 -39962 -72494 -32411 -15698
14677 -15698 7687 -19847 34939 79767 63642 47891 50444 85892 69807 61057 -11085 -4401
14665 -4401 -2596 24054 60752 2795 -12394 -2955 -26079 -26004 -19894 1285 18250 76983 62115
14652 62115 -1051 -54801 -93763 -25090 13677 -2064 -15129 -42864 -37433 -33658 -14238 -50806
14640 -50806 -69394 -26275 5306 17323 19192 1715 -25624 -2927 -3761 -37866 -27923 -12428
14628 -12428 3963 15017 22322 -1069 -12822 -848 5046 2710 -40938 -59481 -81663 -93294
14616 -93294 -74648 -56825 -28301 -52838 -68366 -49551 -25442 2579 -5949 27633 13863 -43987
14604 -43987 -69534 -36323 -16014 -23564 -22525 -56121 -59599 -3455 -6454 -41976 -22502 27393
14592 27393 25577 -12387 -41141 -54555 -65541 -19456 26023 7702 17080 16320 -24467 -44306
14580 -44306 -42682 11165 36813 61349 91626 51279 36911 19140 5884 56036 30466 9741
14568 9741 23326 5144 -42146 -25055 47788 90933 83857 50948 3186 -7438 -5824 -22009
14556 -22009 2763 -2172 8607 -10940 14719 -4995 19946 6282 -30695 -39870 -72227 -87352
14544 -87352 -62463 -2070 19052 -15281 -32339 -12020 23547 37657 -526 -41682 -50120 -66839
14532 -66839 -70589 -33270 28501 67481 23344 5353 3226 5373 31728 56336 44245 44724 -10039
14519 -10039 -97412 -106213 -90032 -29675 21215 26131 36016 65751 27036 -46945 -22844 -38846
14507 -38846 -49746 -39376 -27174 -25700 -58760 -45658 -62642 -52189 -27625 -26756 -76349 -101599
14495 -101599 -84419 -70459 -56098 -54528 -56704 -26797 21700 -3009 -33054 -26862 -15862 23994
14483 23994 28438 -41403 -66968 -50797 10846 52447 -8970 -48405 -7949 -9429 -49958 -81061
14471 -81061 -43730 24277 4288 -29869 -3148 -25247 -44349 -18747 9697 10681 -3592 -16871
14459 -16871 -35562 4904 11826 -9519 -33360 -23775 -56801 -54569 2550 -19303 -19600 18670 34531
14446 34531 34138 22519 -3537 -68505 -74217 -71655 -72345 -63774 -75508 -54348 12713 -34543 -23854
14433 -23854 -23543 -21412 -42064 -41402 -41072 -29976 -41200 -46464 -11164 23652 5907 -37085 -62955
14420 -62955 -52364 -39360 -17354 -1945 -28085 -16610 10988 18736 17190 1021 2293 77603
14408 77603 61797 -13727 -22296 3991 -12341 -61377 -63807 -65290 -36361 -45042 -37013 -27503 -24691
14395 -24691 1318 11707 8967 -55440 -65471 -63682 -36456 -27619 -24021 -60266 -51653 -33363 -20033
14382 -20033 -23812 -43735 -41922 -25439 17849 31569 37079 41489 22592 16428 21254 -32076 -76880
14369 -76880 -68004 -44392 -27237 -25989 -30023 -47295 -24258 -44216 -79549 -132860 -122603 -81089
14357 -81089 -77140 -89677 -62119 -13078 7220 11670 33752 15465 -19559 -11977 20761 9535
14345 9535 -19442 -27405 -7242 35795 14793 4677 17388 31822 11742 -52507 -28939 -28251
14333 -28251 -41956 -41304 -12182 1494 38821 7972 28574 77489 118237 88876 -5040 27733
14321 27733 55810 56542 18786 -6838 -14351 3044 19690 56137 31906 -27509 -35241 -16728
14309 -16728 -22857 26619 36166 -45332 -77103 -68047 22054 59913 17525 20628 35252 28297 16227
14296 16227 8590 30295 34260 71823 29257 17241 36460 28308 25410 -20313 -53187 -15979
14284 -15979 40110 24999 -27506 -79731 -50353 -45395 -17514 -13942 15454 45947 34999 38426
14272 38426 7567 -25223 -20315 23483 26314 29300 48485 45742 72670 100096 64403 16517
14260 16517 6727 7788 -6448 -16197 -1167 18542 27362 17852 11489 1807 -27207 -25507 29372
14247 29372 16667 28292 34026 -3800 -17894 -26835 -48044 -43749 -22797 -37228 -47222 -52010 -113948
14234 -113948 -90739 -28181 -69228 -91278 -94264 -40402 18155 55968 33330 31476 17514 -25425
14222 -25425 -73354 -97379 -46924 -49774 -61926 -12879 33310 67018 68190 21018 -25451 -5509
14210 -5509 5859 36876 8996 5331 -6165 -30946 -22585 -22515 -19563 -37393 -37459 -13159 -21027 -78327
14196 -78327 -59641 -42248 -56318 -85329 -16950 18820 -16199 9638 1752 45580 50837 33818
14184 33818 20435 15426 16167 8913 5146 37903 38725 17566 -16626 -22894 -23161 -3877 -32245 -39131
14170 -39131 -51252 -32734 -27565 -2877 -25309 -65096 -59762 -34214 -54278 -51383 -32833 -28287
14158 -28287 31941 28893 1051 42370 30087 21435 14703 8859 -20620 -50138 -59277 -66652 -46520
14145 -46520 -21031 -27346 -32277 7001 31604 -15514 -46239 -1931 14961 15760 41573 96744
14133 96744 62164 59963 82721 61672 61820 53613 12642 -31885 -16166 14209 25861 31936 32439
14120 32439 34061 630 553 35894 71149 51194 93753 78005 31369 17669 52005 48903 51929
14107 51929 18633 6870 9550 38775 12050 -33407 -50840 -64659 -58974 -43571 -43824 -62159
14095 -62159 -19552 23174 26964 -3363 -27184 -45755 -38264 -36517 -17403 9755 -12055 -1599
14083 -1599 -11242 -1758 44485 51255 46001 34906 19510 16166 18681 -14809 -17379 308 77074
14070 77074 59791 59716 13021 -33432 -5524 28816 37490 15197 -10618 -15715 -37582 -89679 -130811
14057 -130811 -90723 -6868 44302 2389 -26814 -8335 17197 14921 5326 13565 -24258 -29948
14045 -29948 -7017 -29328 -51118 -37182 -19157 -39686 -64717 -43420 -26379 -14371 -37993 -56364
14033 -56364 -59195 -119516 -131966 -104757 -74588 -83000 -42989 11716 8977 -14377 -39787 10748
14021 10748 -16192 11466 70075 83979 89629 80260 57964 50146 114771 88593 65777 64479
14009 64479 47868 26366 9975 -14048 8635 -9741 -5064 -6739 87739 65117 5118 -73976
13997 -73976 -70442 -13640 23100 25445 13823 1164 -6339 28639 72309 86232 33179 -14875
13985 -14875 -43500 -9668 -10415 -11067 41586 53155 55782 27333 86529 84203 26379 25079 26426
13972 26426 37633 23352 7380 40674 89774 122468 101522 39581 -21152 -16226 -25173 -55595
13960 -55595 -75606 -57296 -28631 -24871 -46908 -54983 -57991 -65382 13500 58082 34716 19512
13948 19512 33418 -40624 -73308 -63481 -47194 -61966 -86734 -96102 -55113 -17489 -5629 4879
13936 4879 -2157 -34600 -13695 -10516 -4904 6800 52334 55024 19982 36706 -6293 -42872 -9930
13923 -9930 38049 50634 35444 -32251 -21671 -9234 10445 26398 35893 -51149 -95428 90
13911 90 54668 58273 42730 14259 1395 -11589 -39774 -33440 -45378 -65022 -40394 -30297 -25768
13898 -25768 -2768 16929 -18572 28041 25143 37640 93940 62412 69687 31915 3598 -27046
13886 -27046 -57786 -89883 -99936 -49370 7729 35067 2733 102 20205 42669 -24052 -15985
13874 -15985 -30674 -46460 -16196 -13677 -21233 -28510 -38681 -79224 -79950 -21845 9141 62337 44298
13861 44298 7772 4521 993 7209 5654 33163 3713 -26218 -21391 -80502 -90685 -61802 -36909
13848 -36909 -27914 4163 -7617 -9461 4892 19677 -5262 -29188 -55568 -23931 -5970 -60230
13836 -60230 -65719 -40204 -31056 -16899 -19087 -19485 -18178 -34598 -73813 -51806 24150 97 2789
13823 2789 55440 84315 42871 4950 53119 50121 38260 38011 26235 12701 -20802 -26304 -38068
13810 -38068 -49565 -36890 6239 17869 5698 21738 51183 6941 -58084 -75189 -64141 -79001
13798 -79001 -47573 2211 -46465 -49081 -55813 -59648 -45995 -20994 -21097 24024 38513 32164 -18582
13785 -18582 -45451 -50654 -65683 -33838 7617 10975 42 -25623 3401 44463 61999 26814
13773 26814 1269 -17176 -35620 -72693 -86837 -14616 33365 50168 44206 29182 3806 -48936
13761 -48936 -61368 -55767 -92004 -27840 25682 47457 43521 -17761 -51546 -48112 -41303 -88571
13749 -88571 -95908 -66165 -85652 -78530 -42677 -15814 -8097 9059 70311 85038 55986 -9785
13737 -9785 -52037 -63500 -40368 -31831 -9177 4491 -29683 -82761 -102231 -64883 -45289 -47706
13725 -47706 -29758 14102 32164 45423 11446 -16496 -22888 -1972 90 14246 -22731 -64794
13713 -64794 -71963 -51399 -32490 20226 41050 31809 61148 81148 65815 54513 54171 21239
13701 21239 -2320 -8152 -53005 -82930 -52740 -50573 -12792 37504 45629 24782 15380 12311 26257
13688 26257 47164 -8668 -51412 -56822 -69188 -57660 -40352 -18112 -52568 -68266 -75656 -59112
13676 -59112 -16433 33327 30146 26987 51590 -11510 -64086 -33026 -1037 13299 47776 2238
13664 2238 -56530 -69900 -77292 -58990 -30606 -27757 12618 -20249 -72396 -27521 38149 53580
13652 53580 33125 -8731 -73677 -100874 -30985 45330 61079 20842 17266 59059 32108 -7125
13640 -7125 -3360 1798 -31263 -73949 -81535 -58345 6255 43990 11168 -6330 9341 21594
13628 21594 50138 67917 56584 -29234 -91168 -44359 14595 21680 37689 -1282 -27692 -1930
13616 -1930 13656 49897 51540 24913 4214 -8492 -28076 -60385 -68771 -29584 -19195 -31887
13604 -31887 -31582 -23433 -26086 -63345 -61076 -49804 -48754 -29051 23093 58784 42592 15819 -45836
13591 -45836 -51980 11724 17996 36095 57254 89286 104777 59456 22735 10661 40085 -8869
13579 -8869 -41483 -31313 -27826 -30879 1326 17156 -27579 -18150 12171 45831 59868 14173
13567 14173 4156 -17335 -64653 -73838 -34625 -21289 -51801 4593 30018 2526 5485 22807
13555 22807 -4343 -26647 -18769 -21084 -11140 10040 20827 40490 15980 -19621 -36829 -25422
13543 -25422 -6303 -4974 5192 -25362 -6233 -2528 -2013 28875 55389 71283 46964 33398
13531 33398 55550 94824 99779 49508 77502 66603 64828 68787 40692 19573 -156 -11544
13519 -11544 -13808 -31196 -21421 -4552 28071 -26475 -62450 -87246 -52295 -61198 -60259 -103723 -68925
13506 -68925 -24758 -46120 -20014 30368 38523 29347 -9319 -40511 -23328 -9714 -36065 -4132
13494 -4132 33475 -6866 -50511 -36086 -71354 -114762 -62972 -52098 -78259 -49290 -11125 -7702
13482 -7702 16437 18923 -10964 -10885 16818 1993 -8905 -4407 -9709 -45874 -26135 3475 24775
13469 24775 10924 13097 42691 -18575 -22816 -17044 -40972 -88743 -75407 -21149 14096 -2837
13457 -2837 -10744 -12449 -42137 -21083 5382 15735 5506 2633 -37518 -49475 -28455 -26815 -27790
13444 -27790 -86527 -89124 -45410 -38936 -13705 25340 36635 -16289 -31702 -9014 -19681 28627
13432 28627 44430 12034 1138 32313 -689 -36830 -53828 -54461 -38408 -60682 -51038 -33546
13420 -33546 -50029 -90227 -108313 -88787 -43827 -3248 -33859 -35037 -44992 -38079 -44945 2535
13408 2535 21238 24400 35546 60125 52734 28590 23332 27329 15657 -11720 -26405 -18232 -33611
13395 -33611 17948 47158 35840 18595 12029 37395 43654 41291 32504 28163 64722 64922 52092
13382 52092 34925 46318 55068 15958 -9507 -34035 -9233 29611 -14536 -33858 -42558 -40455
13370 -40455 -19622 -10608 21124 8592 -8189 10471 -5835 -36499 -62276 -83608 -17757 24797
13358 24797 27187 63696 23613 -10792 -34197 -54888 -43487 -29836 39836 35986 -23851 -44259
13346 -44259 -11513 16863 32373 8168 -25663 -48430 3040 -15092 -37656 297 29820 109258
13334 109258 121252 119275 106343 46126 22203 27249 39148 42124 33557 47491 19615 33006
13322 33006 58502 74927 81436 42298 -6175 6999 19194 11455 -4732 -1389 -16824 -56466
13310 -56466 -54687 -45530 -29603 1629 35008 45983 37393 46040 21569 54328 39213 -1878
13298 -1878 -14200 32097 53678 23417 -13583 -29019 -35193 -36350 -28009 6663 48 -22677 -61198
13285 -61198 -36705 -12435 -26979 -36806 -19121 -9009 1341 -7603 -15511 -33769 -25852 -29254 -48860
13272 -48860 -33525 -33972 -45365 -20510 -5251 -6471 -21369 -33086 -5880 -16484 -56661 -46359
13260 -46359 -2796 35163 58667 42427 37357 -2942 5890 19172 35881 -18855 -56665 -34998
13248 -34998 8779 16629 -28647 -13292 15139 -12415 -40309 -27523 -35723 -40404 -41125 -73571 -79901
13235 -79901 -29950 -15678 29688 96968 115714 36249 -335 -25449 -41194 -29478 -64803 -62410
13223 -62410 -89058 -106717 -47227 33867 19581 -31533 -28857 -17179 38257 97940 121355 108221
13211 108221 27107 -27990 -13815 53613 36302 10964 -24870 -19236 13926 22742 30981 -9215
13199 -9215 -54589 -59757 -49382 -12743 16281 21519 41131 -16147 -58907 -63560 -30760 -53926
13187 -53926 -68174 -37448 -11825 7792 -17964 -40025 -47858 -68581 -51151 -32359 -30528 -30834
13175 -30834 21456 72192 94036 94577 90461 46310 -10281 -46641 1636 41458 34308 4708
13163 4708 -14925 -4030 21939 28149 31809 18137 41303 27028 -44690 -31575 -83330 -81486
13151 -81486 -16717 -16364 40914 75585 208 -4043 -2628 -15261 8012 10561 3669 -4038 11852
13138 11852 36232 19149 9351 1425 12054 -278 -6453 -5953 4344 12829 -413 14659 30002
13125 30002 10343 -4343 8551 21849 35236 28358 -37812 -113096 -107896 -94974 -70794 10737
13113 10737 52087 11553 -11114 5636 -9697 -21136 -26551 -24485 -50822 -59507 -38341 -48705
13101 -48705 -58858 -70995 -51726 -145 9892 9385 17923 10626 -18016 -56988 -53634 -56683 -30547
13088 -30547 11963 1660 -94733 -108088 -22858 -5160 -38694 -38673 7989 48484 34028 8658
13076 8658 -23629 -20546 -10301 15155 8694 62245 98175 91296 59368 33505 46344 61274
13064 61274 43219 46585 32404 -3241 -2456 52086 55302 39415 69234 40822 14999 29693
13052 29693 41810 58323 31333 2362 -30812 -34954 -50638 -89824 -74083 -64916 -37885 -55167
13040 -55167 -60270 -69592 -71809 -61449 -5421 20846 20076 4377 12594 12706 43361 52431 88420
13027 88420 109202 70929 44627 59069 44345 51193 16881 -29701 5987 30593 -4639 -22129
13015 -22129 -28207 -22488 36361 64287 32335 8240 9823 29372 24178 -4244 24534 45872
13003 45872 63534 72375 81567 67361 51474 44940 33398 31318 83607 112478 126460 86126
12991 86126 46930 30314 50400 -15164 -17639 4448 18243 27312 32994 25991 44144 27395
12979 27395 -40639 -63659 -65008 -32850 -33547 -41753 -69298 -61974 -64323 -72369 -56477 -106801 -140432
12966 -140432 -101890 -91836 -135531 -144096 -67445 -57724 -67534 -4210 43267 21607 31290 52259
12954 52259 62064 10592 -44795 -31418 -3500 11556 -27785 -32561 -36670 -81163 -109751 -98729
12942 -98729 -41642 -7122 16285 27000 -67393 -67598 -92862 -53704 -31705 -37085 -44728 -12095
12930 -12095 9764 7584 -32554 -57066 -7565 25561 39239 -17133 -30452 -42186 -32896 -25706
12918 -25706 -31362 -31567 -59147 -39835 -13363 5423 15955 28235 50084 20055 -21858 -32441
12906 -32441 -42981 -31473 -31233 -8714 18367 10726 -22186 -70771 -84862 -23696 -26565 -48257
12894 -48257 -42594 -30452 -12952 -42437 -35746 -44684 -32485 -19580 -27294 -37634 -15564 -11325 -63555
12881 -63555 -56614 -38862 -75638 -90159 -100611 -64850 -48401 -80567 -76616 -66530 -69455 -108300
12869 -108300 -78579 -7373 66140 53948 12432 12404 22448 68883 63335 17226 -13882 -19605
12857 -19605 -54611 -88185 -113043 -100044 -50775 14239 31920 23413 23597 12458 11952 -28159 -67682
12844 -67682 -76260 -43912 32902 70301 31419 43648 64057 26699 13497 36628 92715 100821
12832 100821 80899 34313 12814 22460 74586 57381 60528 52939 30029 23137 12486 25454
12820 25454 64514 88311 24613 -18011 14465 49525 34182 31072 12842 -38112 -55788 -77823
12808 -77823 -50254 18837 27489 55540 34702 1429 14221 23545 -43234 -92442 -101223 -46943
12796 -46943 -23269 -4064 -149 -36438 -66509 -44147 -62619 -79567 -58786 -46272 36077 65261
12784 65261 56806 29634 -34650 15531 21901 12979 11883 3366 -10162 -11154 -6380 9519 -44220
12771 -44220 -56492 -30661 -65333 -28475 -31950 -47014 -89681 -84909 -24502 9660 660 -40721
12759 -40721 -1171 28958 14099 40505 7737 -59610 -91959 -109216 -97110 -71052 -78774 -37438
12747 -37438 -15779 -20753 5863 -2754 -14930 -32269 -89571 -68772 -38881 -41303 -49991 -83890
12735 -83890 -81509 -61785 -28385 -35224 -16373 4336 -25720 -68200 -63922 -91418 -106077 -54524
12723 -54524 -10887 33303 15417 -19730 -30637 24227 41188 52006 59995 108223 109195 79693
12711 79693 35501 28902 -422 20774 17904 13800 40208 13243 -15244 -75392 -66498 -17665
12699 -17665 -35278 -47250 -9546 -33699 -24378 17848 -11652 -20804 -42010 -49302 -68084 -45533
12687 -45533 -1409 -11084 -26162 -19918 -48196 -26237 4341 -19602 -12436 -38760 -56408 -5953
12675 -5953 -279 21624 62814 42351 4591 -29848 -22033 -14944 -36214 -6879 18276 17238 65848
12662 65848 64398 36014 2328 -39775 -100481 -99722 -80796 -83738 -27823 35386 79157 55508
12650 55508 31336 24819 49879 61921 75870 51130 19045 -9633 -33253 -59157 -34106 -209
12638 -209 5647 6596 13713 8944 450 -26654 -19162 5177 12330 -41309 -57304 -82349 -69025 -52742
12624 -52742 -78167 -61046 -21582 -23904 6456 35245 41416 3993 69518 83116 45383 32987
12612 32987 -2087 18547 -30748 -76082 -65365 -91014 -71324 -42546 -7042 -30611 -46222 -21308
12600 -21308 -16041 -42076 -13648 31817 71205 98688 89069 51300 22879 31072 37869 23174
12588 23174 25696 3840 980 -2740 -45221 -74479 -93061 -117695 -65674 -24525 -43145 -28060
12576 -28060 -23951 -227 6253 2866 -22328 -25046 -32597 -69648 -63643 -13349 -22161 -29659 -29193 3116
12562 3116 51636 78442 85324 44365 17259 -18217 -36290 -26496 3662 35932 54124 48264
12550 48264 17390 -16300 -31280 -10132 1660 20283 -7609 -5758 38630 40726 9903 -17050
12538 -17050 -24097 -38950 -79395 -79771 -80748 -70012 -46196 242 1779 -8771 -40815 -41880 -18220
12525 -18220 -45635 -39667 -10294 -2628 -9627 16763 -11641 -26375 -59870 -73941 -63949 -71592 -99332
12512 -99332 -141253 -146652 -139287 -81803 -16591 4545 7853 27300 35311 32918 24789 32280 -38493
12499 -38493 -55089 3627 12405 -12232 -33612 -801 17127 53654 35634 12960 19000 6908
12487 6908 5799 30489 93358 83157 59935 50980 44895 44821 49622 22994 17975 39208 -23586
12474 -23586 -41528 -67151 -52674 -5190 -31968 -24278 1845 21820 30156 38277 63485 15413
12462 15413 -32058 -19546 6978 45301 41302 42518 -5859 -65092 -70980 -20807 -9164 -50831
12450 -50831 -50198 855 10310 26825 18815 -9889 -1245 51779 44082 -49049 -57099 -9345 -27078
12437 -27078 -48367 -47914 -51285 -6684 2932 -1440 -14212 -24076 -16676 8645 30837 -3979 -8327
12424 -8327 -36198 -34965 16390 54941 27273 -34261 -78087 -49662 -33286 -45477 -85833 -86903
12412 -86903 -53163 -55150 -61292 -54179 -43204 -39265 -58463 -10670 12260 -24138 -95622 -88832 -9446
12399 -9446 -8584 -2774 43068 -3949 -52013 -72231 -69585 -7299 8839 -11403 -46932 -83816 -56155
12386 -56155 -22375 -14309 -54763 -53958 -70667 -56268 -16470 -8396 -17304 -8476 -7721 -56745 -103542
12373 -103542 -88207 -69253 -26811 43092 55633 27573 1207 8964 -3051 1106 18096 21096
12361 21096 -24712 -54405 -40939 -17330 -7563 -2293 -34614 -15842 5172 -15017 -66033 -63426
12349 -63426 -63779 -45579 17120 76274 72899 50756 65282 42646 47471 55636 33448 -16768 -18988
12336 -18988 16509 45135 45074 10930 -54000 -68710 -50673 -47651 -59684 -97038 -96359 -62282 -77092
12323 -77092 -102546 -71981 -60958 42568 38693 12845 -5762 5517 35530 42990 47081 23706
12311 23706 -2981 18371 11403 40498 21943 -19713 -12832 -22332 -29436 10759 19131 6329 35415
12298 35415 80702 80691 94447 84875 46731 9431 42558 59481 108133 101238 61934 22898 -4575
12285 -4575 -30566 -19060 13828 -5208 1318 53004 54197 33063 20714 -22403 -68228 -71513
12273 -71513 -14698 83046 86770 58721 29452 -953 -19044 -16525 -46991 -85383 -65054 -6441
12261 -6441 11067 -14491 -45538 -84519 -62490 -43767 -10103 26974 65042 57423 46674 24801
12249 24801 36734 48168 41254 31980 62541 47635 75453 71522 11944 5403 8241 -19426 -35274
12236 -35274 -15408 -20265 -37531 -53858 -39438 -56678 -1670 87497 71468 32480 -15317 -11156
12224 -11156 9868 16268 16508 44305 36805 14970 8501 4905 10823 -20907 -17913 -73923 -46311
12211 -46311 -16493 10741 40788 70178 61047 -4592 -55765 -72250 -41934 -27020 -30472 -499
12199 -499 49866 65730 30184 12740 10840 -46643 -57239 -76730 -43814 -26478 -55969 -10963
12187 -10963 51563 84252 72321 48656 7757 -18583 -29817 -29221 -76293 -42975 -15763 -2088
12175 -2088 56188 53300 29610 74374 61192 9036 -36705 -87093 -88019 -42491 -18845 -14623 -22191
12162 -22191 -17788 -22698 -42685 -56709 -72111 -45585 -31067 -69116 -61387 -28261 6780 8158
12150 8158 -18754 -45339 -77443 -48883 34290 61552 10266 -12477 32352 36032 28898 80461
12138 80461 96197 81871 26240 19329 14397 -20080 -14319 13716 51527 44617 -12934 -8110 33622
12125 33622 65338 73321 19598 -18588 -64309 -103377 -128857 -88082 -15474 15089 -16312 -29383
12113 -29383 -35449 -27884 34496 -15038 -42619 -51042 -40283 -25201 43883 41153 14309 -9773
12101 -9773 -20279 -39094 -40126 -38658 -48808 -59616 1397 -3844 3969 13147 -8482 -75825 -85303
12088 -85303 -43343 -11514 -12232 -56555 -61372 -19093 27564 47790 21670 7206 -9106 -7899
12076 -7899 23742 -14087 -55637 -43777 -10500 13014 -24963 -24786 533 16739 -7815 9638
12064 9638 40142 38833 44615 24958 22708 -20582 -44687 -9861 31578 41259 40621 35387 34263
12051 34263 51277 64117 70192 33413 43852 16643 -34673 -28320 -15201 -28276 -36705 -31751
12039 -31751 -12501 -13974 -30695 -1191 12821 -6681 -87413 -51504 36506 18288 -34299 -36656
12027 -36656 -48627 -11092 -18319 -62416 -47838 32246 42162 60889 16070 -14903 -17238 -43151
12015 -43151 -67678 -54769 -60090 -70551 -62223 -28126 -10838 21556 7549 7006 14762 22091 47120
12002 47120 54477 63522 36599 35755 65307 68825 37153 -5347 -13339 26306 1540 -801 10534
11989 10534 17964 10034 -17639 5842 -34805 -34195 -28188 -55695 -23803 -49944 -101930 -84054 -50725
11976 -50725 -9234 -28248 -38876 -18084 17 1881 5150 1830 -22317 -58773 -44384 -5211
11964 -5211 -6275 -16976 11807 38581 16682 33459 60391 73360 66914 52715 -9357 -55462
11952 -55462 -23414 -3001 -13582 -1916 -22221 -3440 14136 10933 22521 -4795 17913 1389
11940 1389 -20588 -7155 -48571 -74841 -43345 -47816 -17343 4455 -40317 -48632 -42770 -25789
11928 -25789 2514 -5436 -6230 -8513 8527 -24712 -48195 -66257 -71914 -11641 53855 49016 -7618
11915 -7618 -5269 -8467 -25335 -44275 -7397 35229 71338 18746 -48364 -50983 -10745 5499
11903 5499 16964 -10866 -62782 -87246 -85713 -57387 -30597 -12921 -9959 -36503 -42186 -48711 -78647
11890 -78647 -59681 -48979 -6413 6560 20175 38726 41486 56618 74556 46395 1886 8585
11878 8585 -18823 30777 55511 64060 55883 54652 42899 -6640 15405 23887 34299 23159 -73
11865 -73 6219 40430 30816 15277 33592 68025 77008 62322 43390 32390 -28874 -40327 18584
11852 18584 53224 -14138 -31370 14726 6127 -28507 -191 23388 25714 19879 -6501 1282
11840 1282 7810 29991 60920 77200 52518 35326 1689 -3941 -33450 -73504 -66317 -16170
11828 -16170 -10238 38631 52747 17307 51410 -7217 -31636 -24073 -33608 -63716 -1005 -9436
11816 -9436 -5623 -16946 -29570 -22055 -6040 41334 101864 107146 58760 -13670 -36278 11735
11804 11735 22329 70738 62194 24542 19445 37687 28241 4615 -42302 -64076 -9556 -3606
11792 -3606 6532 -9366 -17195 -7390 -13824 -24068 -24514 -17276 46987 54498 35686 26562 10790
11779 10790 -40017 -33057 -13858 3292 45961 57677 20711 -10382 -11782 -52634 -55321 -58368
11767 -58368 -72376 -40797 -39894 -38590 -49529 -39702 -23556 -43861 -20802 -10084 -36311 -56557
11755 -56557 -27784 -26324 -76736 -61370 -14974 -13706 -4772 9050 8112 12715 72501 31136 -26504
11742 -26504 -47236 -28890 -21553 -43427 -86566 -92034 -87161 -85663 -115021 -132654 -76142 -52017
11730 -52017 -40756 -57192 -42503 -7580 -2147 -40128 -32315 -8579 -11020 -39293 -29228 -52247
11718 -52247 -68872 -22534 12980 -30633 -41200 -6608 7616 -859 16184 56645 65805 101715
11706 101715 127618 126351 85032 77671 75769 32963 52120 52654 40157 -28735 -72619 -61596
11694 -61596 -45719 -8463 11732 2032 52899 41724 7063 -13054 -33560 -29828 -27103 -53045
11682 -53045 -20907 22957 3495 28809 53373 30750 35607 45189 14241 -14081 29690 -5323
11670 -5323 -912 427 35391 59605 57628 45561 -7783 4518 28215 -25380 -30608 -41950 -17256
11657 -17256 -11174 -33912 -46152 -40695 -53114 -40736 -58058 -91765 -120708 -103274 -36771 9107
11645 9107 28486 39415 53590 44412 32751 31457 45921 30999 -7499 4036 22553 1776
11633 1776 -21054 -30449 -18100 -32241 -44996 -26132 -27209 -43572 -21299 -22571 -5913 -14459 4610
11620 4610 -24745 -43388 -45236 -16290 12859 56074 49356 22545 -15665 -54654 -40135 -39986 -57190
11607 -57190 -70815 -38095 63934 75734 43879 -6975 -6147 -15955 -36428 -69983 -43490 -1565
11595 -1565 5489 -36014 -71034 -52594 -32558 -53256 -76147 -59093 -50790 -20096 9473 22054
11583 22054 45904 30664 -31531 -12491 -10654 -14968 -60141 -31400 -3176 4010 -21051 -7216
11571 -7216 -45121 -56026 -1662 31148 43717 44067 50233 1380 8106 -3215 6917 -7672 -7613
11558 -7613 -14506 -6192 12802 -19454 -66587 -49387 -11538 -19220 -19991 1448 45571 45249 70920
11545 70920 70292 65953 76057 92707 58088 25213 8856 -48090 -48035 -18354 -5071 -59358 -38708
11532 -38708 -5223 -36236 -41806 -27851 -51691 -38234 -30129 -22328 -7800 3174 28307 52433
11520 52433 40265 47484 55921 56539 36110 69635 59544 31029 77188 49146 31952 49629
11508 49629 41594 10735 -17399 -23138 -26488 -20295 14078 6950 -14237 -20237 -6932 5180 8037
11495 8037 -4360 7649 -33234 -26040 -50337 -40382 -6896 -17999 -57040 -30073 -14664 -9890
11483 -9890 -516 20915 18019 40821 4645 -51815 -61699 10578 72983 61031 -6229 -26060
11471 -26060 -47346 -28389 -37026 -33778 -2353 8101 7104 21988 10344 31234 45495 -40355
11459 -40355 -45177 -40507 -52879 -51081 2197 26216 20210 11149 28814 17963 11555 -318 -8548
11446 -8548 -4919 -12183 -4519 -45803 -22988 -10313 2182 -32927 -67745 -93242 -100861 -109468 -110664
11433 -110664 -53590 33870 59952 41804 28428 29067 65113 63446 32570 -52362 -71914 -19950
11421 -19950 -13491 -6508 16366 15962 4911 -17195 -37092 -11393 13410 66513 49422 54034 58066
11408 58066 56911 51638 47333 72519 64455 -2953 -9195 -18735 -7736 28570 32585 10792 663
11395 663 -7534 29411 20834 -30894 -46427 -10041 45182 49304 40380 20709 29549 53529 20702
11382 20702 -59358 -133638 -95616 15128 28816 -4945 -44184 -62136 -85877 -65571 -62998 -32181
11370 -32181 -35526 -45429 3000 11989 -35870 -31918 39703 91473 133075 127641 109195 58958 15447
11357 15447 29280 8118 12673 -58888 -94677 -78961 -90868 -44889 -26060 -43301 -79532 -63280
11345 -63280 -69296 -92598 -37484 -16565 -32308 -28673 -1530 -22464 -48476 -64187 7770 45674
11333 45674 55563 8635 -70080 -106359 -98972 -98943 -75630 -35555 -12897 -6464 2144 -4788 -45735
11320 -45735 -45503 45693 45357 71055 67395 27794 683 -27946 -46824 -77667 -61926 -2108 40521
11307 40521 16058 -13810 -54677 -19652 -310 14621 4423 3527 22351 7736 -14991 22976
11295 22976 6308 -19484 -19690 -47110 -53669 -36986 -22475 -17859 -33680 -36172 -18098 -25719 -2365
11282 -2365 -4750 5829 62203 77142 56078 33798 -6419 29680 50368 52353 31043 15529
11270 15529 15543 13391 -9931 -85144 -81928 -95330 -55095 -20707 -42901 -85194 -116238 -105469 -111120
11257 -111120 -131309 -127222 -68366 -13744 -9179 7113 -8318 -3093 26248 60058 45307 3820
11245 3820 -15605 -42421 -49100 -62195 -72682 -24854 -18800 -21534 20066 31508 -2736 -15448
11233 -15448 -6271 -58080 -49659 -17583 4139 21152 -16313 -35758 -38425 9106 31261 26223
11221 26223 -52641 -28311 -11383 -13951 2077 24835 37109 -16942 -57691 -42225 -8858 -29972
11209 -29972 -52437 -25286 -26108 -31515 -19512 -70257 -65990 -3238 35535 17931 -9686 -31633
11197 -31633 -31371 -51286 -38820 -37644 -41603 -36086 -75036 -63650 -36917 -41734 9419 2702 -32242
11184 -32242 -14224 -17611 -45718 -61039 -56072 -64114 -81661 -103549 -92349 -35330 -31450 -45434
11172 -45434 -12179 12445 39201 39370 14796 474 -10995 10411 12201 -7493 -3625 -18693
11160 -18693 12223 22160 29554 -225 -70870 -46678 -4802 41594 54647 29265 26251 60603
11148 60603 67358 33217 21253 46350 1404 -64341 -56035 1853 42315 42039 13510 -21833
11136 -21833 -26975 5518 15332 30270 24141 -12455 7718 45157 67506 77044 56434 22390
11124 22390 6855 -3620 617 18072 49447 96583 77056 31365 -16785 -23830 -100 49883
11112 49883 44982 15676 24813 30174 13256 21892 32005 58768 59513 38548 22071 1952 -23696
11099 -23696 -1330 30124 -8805 -61700 -19590 -20210 -62710 -15546 -14578 -20975 22765 4706 -34380
11086 -34380 -75657 -35238 -6669 -5343 -20681 2219 28979 30620 3495 -24222 -47745 -13676
11074 -13676 21505 -9004 -28986 -40739 -64829 -54262 -41687 -45313 -45815 -20363 -19354 -43085
11062 -43085 -10144 -23487 -9211 -21811 -13077 5754 8436 22905 51043 23556 13051 31942
11050 31942 10301 13922 54205 32123 1194 -21650 -34331 -45207 -44037 -21792 2279 4485
11038 4485 -58049 -52204 11014 30223 30993 -32106 -49104 -4764 32636 22034 -2648 -4145 18389
11025 18389 17206 1939 -18153 -76066 -82592 -59390 -23660 -7205 30355 79928 74571 67494
11013 67494 31223 547 -3200 -11589 -15092 26692 35258 3321 -26634 -51868 -43162 -37211 14075
11000 14075 -5791 -18759 -33457 -58515 -34254 -48690 -53584 -26448 -62460 -59991 -66890 -28970
10988 -28970 1858 -27834 -21108 -26556 -28689 -20700 26384 55146 73455 51387 16270 22797 40155
10975 40155 74773 73540 36462 31831 27420 -14142 3520 29477 10903 -20432 9174 25695
10963 25695 31870 49481 19722 2961 38361 52356 44675 33007 14769 24456 2957 -20349
10951 -20349 -25853 3588 25273 46631 -1541 -12196 38654 13760 4783 -12099 -46984 -82403
10939 -82403 -124319 -106758 -35663 1376 -27261 -46376 -37807 -1322 15379 44126 45612 58748
10927 58748 41446 13309 -46368 -62979 -3801 -5107 -42939 -26800 21684 5978 48728 42321
10915 42321 -17657 -55616 -61654 -39945 -7972 358 8116 37627 47043 30640 -14668 -22643 -42949
10902 -42949 -23135 -14498 -33893 -25447 -19021 4094 66360 38270 49662 83643 97381 72346
10890 72346 72523 62201 37030 40310 60852 53719 19475 19443 25335 52215 88667 64655 33446
10877 33446 -1063 -3485 17306 61689 97717 69126 22098 -3690 -15949 -32668 12749 35068
10865 35068 16555 -37405 -56416 -44954 -37718 47902 54789 48774 69906 38067 -41932 -84893
10853 -84893 -86500 -95871 -48634 -10520 -22512 1145 -181 7595 9927 -21250 -41431 -67327 -69548
10840 -69548 -42760 -37874 -43736 -44690 -49172 -34873 -21442 -55948 -92462 -96024 -89225 -59974 -41662
10827 -41662 -37562 -51794 -23464 17127 16733 10231 21413 56213 94254 46912 31644 -24318
10815 -24318 -63704 -37081 9594 -24782 -17832 -1315 -17444 -33703 -38422 -18361 145 -35428
10803 -35428 -30883 20754 92094 131366 126833 112438 75050 34684 -4668 -22410 -2503 5063
10791 5063 9439 24148 55503 67481 73086 91704 53498 44446 45071 -12774 -25645 -3500 21305
10778 21305 36608 42512 12666 5030 12642 36192 35224 -21483 -7524 -13613 -14141 20127 24062
10765 24062 -3194 -1238 41850 47714 82832 64592 67589 66289 67570 9900 -3191 -2953 -470
10752 -470 22308 -29521 -36514 -8213 2404 32624 56588 13439 1807 9665 8096 7612 -11799
10739 -11799 -20700 -15119 19686 9241 -8274 -2294 40908 36376 -1960 -35550 -4440 -16556
10727 -16556 -51766 -38484 -45260 -15301 -23434 -44768 -46548 -17459 23136 51822 10435 -39423
10715 -39423 -53078 -95261 -94570 -61916 -51923 -6956 54129 50190 -8101 -29044 -40311 -14616
10703 -14616 40145 14426 7546 -10110 -30626 -35503 19621 2748 -22441 -47768 -55172 -20066
10691 -20066 2664 -22049 -17152 -23263 -21125 28524 20667 57816 56606 12406 -6639 24460 48191
10678 48191 47585 17776 -12407 -24347 11879 7144 9040 5259 20407 13607 47288 37551 31821
10665 31821 7832 -28599 -83103 -114693 -71271 -49196 -94033 -111170 -23986 28925 5504 22754
10653 22754 14127 7418 12550 13186 45269 62925 74225 73263 26410 -10807 -16867 19075 13592
10640 13592 32325 65793 52812 57368 56083 25429 22480 1603 -25448 -44534 -63119 -49662
10628 -49662 -38967 -39289 -48257 -17475 41342 13740 -31300 -33839 -5726 47682 61185 55480 56184
10615 56184 27071 17465 6808 10228 34904 13367 -21277 -1262 38532 90098 100900 51540
10603 51540 32754 23244 24733 42352 -17416 -38154 -67051 -75973 -43424 -16753 -31220 -41628
10591 -41628 -71390 -49053 -25103 -28135 -24203 -41840 -57852 -77377 -50083 -58557 -84802 -95537
10579 -95537 -97633 -61456 -49250 -41594 7075 24312 6870 -18045 -15162 -34769 -9423 12585
10567 12585 26631 26022 26618 9930 -32431 -15125 38792 2620 -18067 -981 -21261 -16666 -39058
10554 -39058 -46748 -66224 -89040 -47308 -47919 -444 6519 -23077 -45691 -43225 -48603 -53569 -72011
10541 -72011 -57843 -63372 -25472 5722 -35113 -35580 -63613 -55282 -51283 -30960 -1462 34784 38304
10528 38304 -19712 -29251 -48594 -27411 4026 11015 -2782 20224 36631 32058 16204 75847
10516 75847 44966 35334 23614 23275 44561 92023 49273 24152 7034 -48687 -79327 -108389
10504 -108389 -108840 -51450 -39457 -49419 -47352 -35882 -43065 6137 4184 -39476 -14027 -22413 -1642
10491 -1642 13804 29646 39437 28146 -21179 -48592 -89011 -74401 -36849 -11226 -2141 10520
10479 10520 8275 -3017 957 21594 -3192 -57447 -122189 -87021 -30047 -30904 -66147 -16032
10467 -16032 -9599 16117 8607 -25346 -17633 -19611 -49917 -38967 -41335 15159 37744 43540 79187
10454 79187 84110 65292 53641 51747 -2813 -47274 -77918 -51669 -27536 -8197 24733 6420
10442 6420 -8084 -32063 -10844 1456 16468 28994 45962 56941 30274 11640 -4399 8094
10430 8094 10151 -15786 -31124 -21053 -11816 -3813 31002 39677 -23147 -76931 -62255 -25433 -28891
10417 -28891 -21100 42032 79879 83261 63842 45412 751 -22035 -57015 -74692 -70443 -57725
10405 -57725 -28048 23398 19620 -37458 -112551 -145385 -114315 -54007 11872 9500 -27819 -43445
10393 -43445 -34400 -16979 3981 -24368 11153 41462 30949 12180 2843 5293 -1845 -1100 26777
10380 26777 47545 69610 45066 -2169 -23541 14776 -18247 -20921 -1377 -9947 -6653 11562
10368 11562 -19017 -58417 -37137 -22902 -50008 -51542 -35819 -19538 -7520 31700 33358 12140
10356 12140 -9649 -25106 -45347 -42657 -85684 -111901 -61358 -17596 1012 4024 7205 -28079
10344 -28079 -46484 -7487 -20169 -24142 -48520 -5352 5260 -43821 -10507 88449 102845 39348
10332 39348 -17175 68 -32355 -49048 -8885 -17211 -77748 -62746 -15316 22611 35263 1354
10320 1354 -18915 -14378 1221 20512 18701 46114 52412 52723 6493 -15119 48111 27217 10860
10307 10860 7981 -21821 -2257 -40141 -47154 -39268 -16196 -15607 -35734 -53208 -76168 -44963 16056
10294 16056 3965 2606 -15510 -64519 -79324 -75287 -54692 -48626 -21349 31951 29823 22112 29547
10281 29547 17429 -2588 -11724 14637 11164 -12329 -38144 -11630 -19845 -31853 -29100 -41809
10269 -41809 -30435 -64371 -67783 -46097 -40208 -50314 -36696 -30300 -44622 -85594 -69930 -63374
10257 -63374 -73930 -71728 -9913 26592 37676 5679 14548 19748 66683 70360 14063 -4657
10245 -4657 44179 46616 16780 7337 16529 -16444 -21933 22872 -940 -5931 18826 39155 13821
10232 13821 32315 26927 -2615 -36632 -61984 -18732 8934 -3115 -22095 -39456 -12285 -8320
10220 -8320 -35827 -1141 23616 28518 6387 -39601 -85426 -70248 -62827 -44640 -72779 -118354
10208 -118354 -72069 -945 36032 17789 5203 -26073 -24173 -8853 14183 17136 -22447 -17885
10196 -17885 -23807 -40779 -28013 32198 22068 -25756 -58452 -67618 -68829 -66397 -39629 -20953
10184 -20953 23793 47528 59764 84196 22051 -56957 -68068 -61245 -16496 2525 -7514 16558
10172 16558 7398 -21722 -59910 -17702 2754 -32981 -34006 -3954 32227 -24009 -46946 6465
10160 6465 27906 -21113 -50286 -44670 -30218 -37073 -64162 -9376 26958 53945 38554 17156
10148 17156 17542 25233 13450 -39107 -35383 8272 33584 -12894 -37557 -7280 4285 -1072 -1016
10135 -1016 -18754 -20258 27128 17329 24273 73021 45210 21480 14244 4121 566 -20065 -27619
10122 -27619 18928 4437 -20092 -14337 -6948 2406 -10703 -36972 -43627 -9664 -9539 5307 -15271
10109 -15271 8715 16188 10144 14134 6639 5132 19975 25839 27130 14262 -17460 -87133 -85818
10096 -85818 -112889 -118523 -83145 -99883 -131806 -118763 -50885 -17488 -5124 -3099 -19444 -33468
10084 -33468 -51004 -42039 -1018 48405 83043 102618 88394 70017 39356 25919 9372 9022
10072 9022 -28781 -32419 23535 -16174 -23171 -34833 -21294 4093 10863 -10849 23431 68491
10060 68491 113882 95040 34782 -218 -23528 -28354 3887 6844 -15276 -12036 18549 3120
10048 3120 -5791 -37872 -92202 -98656 -50844 -63573 -52009 -34326 -66983 -85709 -74018 -51801
10036 -51801 -40742 -43651 -18122 7057 50765 74358 30106 17870 57956 58623 59499 12771 -21120
10023 -21120 -58902 -35920 -16894 -57793 -78996 -38216 -46684 -32133 -5853 -49356 -51927 -33786
10011 -33786 32365 48858 29036 45185 11760 -1843 -6176 14501 36216 18937 23154 -2306
9999 -2306 11380 17710 25563 24357 38410 17549 -25900 -54435 -30962 -39188 -49922 -33757 11053
9986 11053 26495 30150 22733 -27208 -40099 -28152 -27019 -28663 -53912 -31437 23983 50971 74384
9973 74384 67219 14637 -48763 -64412 25793 46342 62997 98753 70154 -17369 -32834 -3918
9961 -3918 19929 5226 32634 29665 -5057 13905 39478 43131 34513 61901 56813 48091 -3466
9948 -3466 -17267 -13569 -25579 14062 53103 54962 50841 -2932 -53926 -59830 -66674 -64675 -21130
9935 -21130 -18867 -7651 -60076 -75867 14180 56702 66684 100672 46710 45649 38776 17052 7893
9922 7893 -20914 -42062 -75081 -38801 -21206 -48049 -87396 -112710 -63016 -35180 -50125 -37789
9910 -37789 -10712 12093 -18227 -991 27026 40466 37393 1331 10705 -2919 -58170 -70761
9898 -70761 -38736 -49771 -56137 -89530 -68476 -20183 -17097 -6896 -28023 -85261 -74718 -53570
9886 -53570 -26432 -25535 -37760 -65362 -82477 -58445 -30746 -45514 -45504 -37816 -53981 -82511 -49353
9873 -49353 -29411 -59634 -62716 -53449 -5554 -9132 -2030 15732 -11717 -17220 12718 2559 -50759
9860 -50759 -55773 -55027 -29326 -7712 -15042 1503 -29273 -26221 -6313 -41721 -5140 6210 25867
9847 25867 37982 57982 49340 43060 86370 63159 37402 8512 -29616 -37351 -18376 -37954
9835 -37954 -21280 -35925 -49196 13797 55896 30072 40478 34478 21209 26678 -2741 -58586
9823 -58586 -61111 -18753 21482 12409 13178 -790 19756 61969 85787 35003 6429 -8138 -42847
9810 -42847 -54753 -30866 21237 36522 12120 6054 10191 -47988 -71249 -49765 -33580 -27062
9798 -27062 -30985 -55227 -69189 -25328 2429 11824 -16809 23754 11243 28863 44551 27206
9786 27206 9796 -18501 -53270 -38558 -6494 -52489 -36232 -1143 -3604 -71551 -61170 -42705
9774 -42705 -14135 66383 76114 20287 -11038 815 45536 93226 60249 -9322 -37965 -55727
9762 -55727 -67535 -67602 -50909 -27214 -10923 10478 19022 26448 68907 58896 -17274 -80335 -106019
9749 -106019 -47210 -3822 14537 -13471 -23168 -60692 -52497 -35235 22703 64212 11942 -25403
9737 -25403 -15711 -6669 -6220 7234 -1731 -37343 -69378 -98471 -57241 16698 29817 19715 -18524
9724 -18524 -240 51726 75143 73998 64722 54502 44612 13736 -3240 10909 38582 84804
9712 84804 85968 68696 47337 71188 54645 29044 11378 -12557 -13942 6380 -24024 -46255
9700 -46255 -70564 -42148 -14851 -17542 -29273 -9077 52664 9756 -7088 -13741 -40962 -25337
9688 -25337 2935 59817 49959 13699 -40625 -74745 -40712 -17186 -50943 -52056 -37614 -51373
9676 -51373 -5760 6258 42552 78125 87114 51139 -6046 -43869 -38530 3387 55886 44318
9664 44318 -1752 -17714 7294 -14011 16622 14657 44096 39492 17524 37193 9463 31560
9652 31560 43218 52750 34710 -725 4267 -22764 -27195 14992 64838 67612 56400 30131 38908
9639 38908 10757 -21024 -17316 -47179 -33349 4645 25539 65885 59872 49785 42668 28196
9627 28196 -29897 -29989 -40511 -35630 -70365 -1314 15248 37692 30199 26666 50316 25340 -15291
9614 -15291 -36880 -13863 -6826 12336 55987 64697 66130 58405 55451 42748 31294 38403 39103
9601 39103 -979 1716 -6890 -6465 -32771 -18870 -36355 -56245 -37940 -10853 -1002 -52145 -50425
9588 -50425 -56987 -53362 -66276 -25214 9247 3406 28727 45488 52043 72582 35594 8176 -22096
9575 -22096 11483 30879 -9579 12385 14444 28446 5324 26900 85739 72161 96287 59757
9563 59757 3989 10404 26286 15178 -505 -12288 -9711 -40548 -21773 9768 -8891 -34027
9551 -34027 -43017 -22315 -29574 21096 78120 94913 125029 129564 109639 67374 24672 37281
9539 37281 41340 55103 88647 75853 36568 28232 71290 69701 52362 26350 -35918 -59377
9527 -59377 -28554 -25696 -27504 -41759 -55229 -50937 -32322 -51908 -53790 -29173 -33290 -48594 -72166
9514 -72166 -27656 22155 35436 26273 22187 25900 39176 37802 60802 34290 -14226 -29034 -29285
9501 -29285 -8718 25761 30139 42865 54906 47493 -3137 9801 60103 57142 30958 26604 38387
9488 38387 74591 63088 28162 28126 -15851 6345 25238 14289 47237 38582 12792 54409 43395
9475 43395 24944 45338 56270 26574 -56613 -79577 -61802 -19790 8295 26355 20107 -14494
9463 -14494 -38414 -86948 -83578 -70136 -57519 -21782 24553 16888 60299 26875 13010 -24554
9451 -24554 -10027 -21039 57741 71766 40336 34329 27716 44218 9920 31196 47886 18167
9439 18167 -40165 -79978 -66553 -73544 -37610 2278 12681 -6997 -16668 5795 -2167 -50600
9427 -50600 -97124 -120110 -83417 -21014 -20739 -34568 -14005 38441 41418 28524 15517 -15859
9415 -15859 -26855 -19191 -23473 -4466 -11100 -57914 -38436 11 4190 -5476 8378 12781 21894
9402 21894 46706 34678 5685 6163 55116 72663 31533 4012 -24555 -64115 -90726 -65368
9390 -65368 -9947 37881 64557 19504 -1777 -14384 4821 33691 64292 52264 25416 22404
9378 22404 81 -33592 -42019 -36864 4766 6270 4345 -16535 -72927 -76974 -83145 -43230 -37895
9365 -37895 -71513 -8923 247 -40897 -26265 -47402 -39001 1719 -14555 -68396 -61604 -90486
9353 -90486 -96032 -7458 20677 -13590 -85669 -92332 -99961 -78177 7742 37528 46859 36714 50067
9340 50067 54245 22264 4787 31822 19946 17217 21400 44817 -8195 -4404 17537 21702 32189
9327 32189 45604 95571 119161 97323 70789 44211 90 7672 12510 -34510 -96456 -24887
9315 -24887 -50556 -42299 -34156 -43201 -39729 -9361 -13701 -1364 27896 42598 33824 -16305 -26916
9302 -26916 -4041 36141 55008 35458 27028 1989 -56639 -84602 -57126 -38065 -2130 -13176
9290 -13176 -8672 -4275 20875 28334 60545 50158 42818 3825 -43480 -54985 -39448 -6859 -20638
9277 -20638 7202 67864 -1489 -23168 -23705 -37993 -28251 33199 44309 38782 36933 -11796 -28719
9264 -28719 -18349 -18792 -67909 -57325 -37782 -28419 17850 46283 23981 4051 17313 -33266
9252 -33266 -94210 -75117 -69997 -104145 -95629 -79313 -45127 -9510 -16772 -64068 -105977 -50993
9240 -50993 -1445 24144 -9260 -11288 -19989 -17201 34804 37733 25627 66679 60627 80668 28582
9227 28582 -8252 -21004 -19432 11151 56804 31439 -19514 -45361 6658 38292 66828 102142
9215 102142 112765 79426 65731 54281 28986 10034 4650 18029 -2138 -29845 -18688 10719
9203 10719 -2035 -47452 -48813 -18501 -31234 -18146 2965 -2654 -39807 -57398 -29912 22075
9191 22075 17647 -8111 -30725 10607 62741 52148 22258 36895 57136 70029 34136 41385
9179 41385 34938 20070 -5257 -14817 -63858 -91528 -36261 -3537 -31868 -43709 -40919 -4732
9167 -4732 26411 14741 30256 72780 40765 12749 -9335 -31802 -98539 -69144 -13535 -2888
9155 -2888 7521 52298 42400 20293 1326 -32581 -21610 -30869 16689 41940 10682 31119
9143 31119 -21801 -71104 -119199 -123551 -83426 -28650 -621 -28187 -7498 -6728 4058 53097
9131 53097 66098 -1592 -36719 -29553 -13886 7365 -7363 -45777 -40485 -21801 -23663 -3398
9119 -3398 -21299 -55923 -54310 -15386 -28068 -62608 -77817 -17222 -1662 -18813 -65145 -39649
9107 -39649 -2103 12620 39778 52646 84760 92883 92534 53175 -7024 -21933 25540 29703 -24077
9094 -24077 -28138 -26798 22133 29516 -14764 7159 66903 42934 32026 39074 -34685 -57701 -38172
9081 -38172 17328 18525 57816 35864 -7105 -1721 -4114 -4716 -18251 -3894 -46118 -79010 -71585
9068 -71585 -69851 -68717 -68669 -35133 -57671 -94835 -138079 -106028 -47496 22155 25516 -41741 -27540
9055 -27540 -12736 -12734 -6050 22963 414 -43493 -36425 -70470 -71980 -68166 -75682 -27673 11032 31905
9041 31905 4664 18408 30114 49214 16296 7457 -21420 -20783 -41815 -67578 -59983 -17272 16909
9028 16909 26207 -7100 -48288 -77337 -75457 -91808 -53344 -2586 -7321 -56914 -76197 -52718
9016 -52718 -43035 -19303 -26547 339 25980 -14670 -58579 -20231 47201 43771 66860 20423
9004 20423 30571 48969 19587 31807 -3178 -26315 7160 40074 61639 63083 30980 -14984
8992 -14984 -36928 -63195 -49156 -32402 -14019 -14650 -25976 -21235 59485 89927 53432 23103
8980 23103 17940 6503 27950 65735 42457 18464 -18000 -69438 -105688 -51208 759 17575
8968 17575 -7184 38716 30078 20611 26494 29942 44258 47593 40858 35363 42323 26798 11953
8955 11953 18371 45650 17892 10770 49095 92185 43466 17585 -2572 21460 26864 29899 -10945
8942 -10945 -26923 -8051 39230 96708 56944 79897 106371 80986 68080 26853 -30876 -56493
8930 -56493 -58198 -45727 -38650 -44531 -40399 -14556 11176 -14322 -28572 15824 38743 78015 49074
8917 49074 14967 44262 37827 12042 28327 48994 45895 73584 32329 18887 -30339 -70247
8905 -70247 -41125 3888 27372 53062 64017 38506 37567 33407 -41674 -98887 -59465 -32511
8893 -32511 -8027 -4403 -39671 -36332 13529 5676 9693 47904 78496 41349 24375 34433 57267
8880 57267 66550 37069 58834 45833 45328 41423 33163 35388 18435 -131 -11596 4335 19940
8867 19940 29695 55667 55977 47590 35672 31967 -7011 1045 16348 -44059 -55990 -55029 -41758
8854 -41758 -25744 32491 87938 127008 73822 6922 -24770 -39389 26917 49635 50728 16912
8842 16912 8024 16740 -21672 -52493 -44350 -43882 -57965 -48686 -68307 -97595 -52070 -15040 -8724
8829 -8724 -38932 -10317 -17259 -55970 -60094 -15628 -3889 -57869 -23606 15318 -6306 12612
8817 12612 26477 31312 39073 68230 69714 73654 63515 67498 23720 -39177 -101662 -74073 -69312
8804 -69312 -64632 -73711 -81300 -66041 -35185 -38707 -41762 -42416 -89771 -68211 9044 13490 -9812
8791 -9812 8322 13102 9380 -8615 -23091 -20731 -34736 -85018 -117277 -123443 -61338 -38065 -5596
8778 -5596 24741 49158 49959 40136 13987 7438 -19836 -54218 -21594 19352 7800 17559 5496
8765 5496 -15357 -34148 -15718 40167 104356 109766 101564 100534 90681 54124 16206 -11217 -10067
8752 -10067 -35068 -23276 4178 -4238 -12739 -48449 9452 54668 38631 26604 52234 8431
8740 8431 -17622 -14495 -33481 -43209 13110 2283 32064 47914 60194 36726 -2488 36178
8728 36178 13965 13041 -3003 -6613 45803 32280 -3705 -27818 26957 49648 52536 13088 -59597
8715 -59597 -78483 -26063 3308 24160 -4161 -46309 -23409 28023 29220 -54561 -63474 -26875
8703 -26875 -21218 -33364 -9585 26243 51372 38343 -5009 18803 77806 79155 58246 94591
8691 94591 118635 116445 75746 71400 34775 -28141 -32725 -32897 -74503 -81450 -29570 1510 8675
8678 8675 -12500 -26561 -18189 -34916 -12427 -31078 -69776 -76837 -60870 20890 23631 -14817 -44233
8665 -44233 -67364 -62933 -62694 -56735 -45456 -54818 1147 4754 38747 45474 40520 49177 40569 43393
8651 43393 50774 40936 49740 96465 77231 10563 -3995 2293 1264 39275 39286 36831 12857 67218
8637 67218 65049 -5945 -84716 -72278 11560 72174 70639 60886 46256 22579 3160 -40797
8625 -40797 19277 66547 51328 27684 48672 58050 25730 -12308 -42449 -36009 -16020 3982
8613 3982 15293 60300 59515 -15565 3585 17345 1993 -11595 30827 30819 -3632 -13658 54157
8600 54157 74092 24790 5900 36410 -23046 -50074 -21195 -2480 -4260 -39193 -35020 -6445
8588 -6445 21481 59991 77070 19132 -26068 -63140 -81460 -41775 -38692 -48019 191 49043
8576 49043 19493 -20436 -37753 -47191 -29327 -2872 27490 19447 -5473 39387 68276 5762
8564 5762 101 26868 17707 1818 13039 54311 -14392 -86238 -93755 -88756 -80791 -85848 -47504
8551 -47504 -67875 -81149 -48710 -71426 -70018 -46605 -19733 -29415 -58385 -56799 -74449 -95754
8539 -95754 -64553 -52722 -35545 -11101 -21746 9876 37999 30935 32648 13746 21718 3696
8527 3696 26154 27587 25680 44862 53090 1313 -10109 -31669 -24853 -41899 -74119 -105659 -81163
8514 -81163 -10275 7292 -14444 -61410 -50926 -40699 -6110 -20555 -27869 -17063 -26006 -8164
8502 -8164 -7141 19514 -3023 10473 20270 29694 47827 17572 -14434 -17832 -2398 -25579 -17021
8489 -17021 4953 12230 -7057 13519 28870 -1353 -22371 -15338 14812 35015 25049 -2005
8477 -2005 -26933 -19295 -25880 -37819 -37964 -32041 -9253 -10856 -22586 -34224 320 -13288 -30205
8464 -30205 -53781 -43002 6956 7506 12463 6856 -15293 -22991 -46399 -40078 -12115 11743 5747
8451 5747 15583 -7652 -34111 -20238 2885 -2445 51055 85074 64189 6565 -16526 -26829
8439 -26829 -38946 -19860 8406 18571 36679 8232 3420 -9711 -5309 21983 27631 -14319
8427 -14319 -62129 -75436 -64140 2556 20981 4571 6006 -18365 -41176 -68729 -72722 -82073
8415 -82073 -67524 -20933 -1400 -31412 -33188 -19941 -5213 9457 -12974 -2180 34304 40086
8403 40086 19788 -25470 -3744 22590 -37501 -83858 -74868 -76780 -13495 -29397 -85135 -89214
8391 -89214 -97191 -49347 -13999 20210 10440 27372 43093 99934 118461 116146 51101 32192
8379 32192 28499 7583 -35588 -43049 -3288 -9149 -13609 18251 32498 49025 41389 41242 11086
8366 11086 -20194 -27074 -27861 109 32614 26916 34819 56865 38847 -1060 -59277 -52153 22736
8353 22736 52932 -1903 -72730 -23802 14779 17132 24400 36479 -28669 -83558 -114803 -84612
8341 -84612 -67978 -54861 -54520 -43508 -10595 21443 61358 76703 72061 49205 72292 60088
8329 60088 -11879 4690 30508 32098 33897 7622 -10585 11184 61533 49470 26911 7135
8317 7135 -15712 -22041 -50777 -73782 -111100 -89330 -72090 -43766 -15887 10018 71867 81856
8305 81856 70580 15282 -58525 -83321 -60449 -54015 -45801 14030 35971 49151 33576 19911
8293 19911 22220 21544 -7921 -18142 -16076 13757 -11668 7414 15382 -48750 -61258 -15411 -19227
8280 -19227 -56715 -54379 -15105 23505 48960 37012 32297 17296 -21086 13525 42560 17212
8268 17212 -7354 4913 -6605 19418 5312 -1551 -5835 -97115 -79672 -70575 -71235 -64429 -22150
8255 -22150 -32965 1028 15041 -30307 -28419 -11204 -13039 -38945 -7705 19728 19775 20735 21279 27428
8241 27428 73060 103813 53323 19274 3464 -38673 -22001 -34074 -24044 15726 2764 29325
8229 29325 72052 84945 148026 162800 116346 67744 71551 74799 108931 97052 77625 74417
8217 74417 40332 63996 77744 85574 88047 48991 26492 31196 26839 5768 -9372 12678 18641
8204 18641 3802 -11426 -2767 -8045 -16401 25203 8253 2008 27365 34792 12197 -31391 -24113
8191 -24113 -11964 -65101 -55712 -39209 10042 -1480 -38239 -16991 19482 -2844 -18418 -21333
8179 -21333 31200 45903 13568 -2946 59494 85336 40423 26299 -6580 18344 15375 -609
8167 -609 45759 65308 62646 26324 31527 -13240 -68410 -3630 50047 24798 28979 31062 -2679
8154 -2679 -36303 -72938 8119 49776 75946 69435 55419 32256 25151 31966 64089 114418 24414
8141 24414 9657 -19827 906 21200 46807 43465 45922 43371 45608 49866 67140 60693 51764
8128 51764 67329 100022 101562 54871 45735 14867 16431 10721 30198 46290 420 -3210 19310
8115 19310 24217 2681 -15679 -32632 -2168 34487 14 -14658 -25286 -32102 559 21119
8103 21119 29568 2537 -37641 -22179 -19227 -8365 3913 13606 38753 19910 -28303 -51199
8091 -51199 -98217 -114642 -92955 -36088 -69544 -91455 -43984 -1613 12912 2397 5567 19781
8079 19781 13571 2472 -18394 22582 13004 4186 -15667 30436 46838 -1109 21045 -3673
8067 -3673 775 -3231 -39029 -103356 -108408 -49820 -24168 -41305 -50575 -50077 -15781 13464 11533
8054 11533 -29796 -35849 -9989 -20145 -37131 -62154 -88925 -131293 -110672 -78387 -46517 -50434
8042 -50434 -44567 -10265 9460 -468 -34110 -27351 4877 -41910 -49094 -36565 -30537 18253 32588
8029 32588 -6102 13425 49742 50115 40042 29524 -20581 -4982 677 -43730 -52456 -25898 -17199
8016 -17199 -38180 -59311 -44144 -80162 -115729 -56129 -12430 -829 1833 -8772 -24728 22592
8004 22592 62176 65715 72913 83581 15107 20395 4853 33728 34454 -3456 -21395 -37263 4816
7991 4816 14461 67701 85899 30480 7403 16756 -27484 -61137 -73624 -73032 -72558 -51048 5442
7978 5442 8711 -41283 -51090 -31771 -33467 -39401 24055 36681 43712 46472 47578 51665 34337 59405
7964 59405 56294 51168 -176 -2744 35471 52609 45533 54863 56662 81610 70678 -16048 -47076
7951 -47076 -19625 -24579 -14116 -600 -3834 -17852 -68908 -65414 -15016 -37123 17435 10974 -23212
7938 -23212 -22688 -27719 -57587 -78497 -79214 -71695 -78822 -88886 -59871 -20959 34992 14484 -22770
7925 -22770 -30522 -23421 -32840 -3592 5071 19760 48738 33001 -47480 -16008 19452 21222 -33872
7912 -33872 -41529 -919 35085 55773 70267 56645 96572 89624 35850 -33422 -23526 24495
7900 24495 16448 3669 27592 15987 53708 67150 27150 40447 41018 -4723 -66709 -29628
7888 -29628 20436 42593 32997 11923 -5344 -8431 -13965 26444 49125 57727 42830 63017 52166
7875 52166 -31427 -40102 -44881 -19043 11095 -10448 10185 42140 69715 40943 8532 34998
7863 34998 10369 -71322 -60937 -27690 632 -28263 -50003 -29186 22703 20208 66217 78391
7851 78391 67758 48396 7332 -15324 28230 1136 -5398 33863 106052 107155 61951 9740
7839 9740 -48685 -51767 -21091 4130 22701 8162 -10481 -8265 -7665 -39893 -48036 -22569 7465
7826 7465 36658 39270 19237 -27263 -48690 -30903 -16720 8817 32775 48077 39760 44684 41805
7813 41805 -4279 -18981 26451 65239 80885 69862 30597 1262 -6886 -30231 -42676 -53530
7801 -53530 -54840 -32239 -30832 -35563 11946 42324 122610 124617 107600 64647 -6919 11265 39090
7788 39090 18947 -10657 -31423 -33932 30514 32955 35056 14612 34244 27242 27431 80065 47975
7775 47975 6097 60806 86085 36236 -12246 -49948 -87415 -122701 -107836 -93071 -86636 -52374
7763 -52374 -27717 -8501 12035 18039 -39455 -100623 -93697 -31770 31277 27545 16866 -18808
7751 -18808 -55026 -39331 -18340 -32853 -41136 23252 42045 -10210 -10976 -44763 -1524 4816 -43160
7738 -43160 -75911 -57706 -2473 27095 42708 63881 60322 33058 23668 9514 20860 14052
7726 14052 47350 42221 46405 72012 84667 57704 68670 96763 95008 60626 66241 102327 87418
7713 87418 84508 94532 108894 93629 72991 52775 20109 4366 48094 19327 -29999 -54266
7701 -54266 -43244 -20633 -12034 -6942 -6391 -37578 -18956 546 3917 12609 42269 26525 36804
7688 36804 33428 -21348 -52609 -45666 -38532 -33715 -46695 -34316 12137 48731 15640 28230 11624
7675 11624 5532 73771 111138 72714 42674 42650 23763 -1650 -15847 -6663 -1861 33514 41822
7662 41822 52724 76619 28266 -42569 -44618 19953 106690 83853 59748 52209 66016 75277
7650 75277 53579 39237 27148 3114 31657 -11549 -40500 -20124 -35466 -12144 18637 42925
7638 42925 62791 28683 -8182 -25591 -14712 56878 52032 12563 4745 1152 -10813 -7297 4276
7625 4276 61342 68177 55674 74888 109014 122147 110611 100381 65457 88651 45534 -1971
7613 -1971 -24135 8021 -14789 -16060 12883 16260 18497 24776 -23133 11531 64689 -346 -77351
7600 -77351 -82398 -51105 -25684 20997 17420 -73 41553 66132 52549 64782 46631 62870
7588 62870 11229 -9531 30867 31849 40915 23058 24535 8925 5278 12619 15892 44443 14478
7575 14478 -14314 -63861 -88622 -53113 -15223 38985 41668 11965 6437 -13284 36359 12392
7563 12392 -36301 -33396 -16969 18640 471 1229 -25674 -54380 -25997 17145 37687 45532 39932
7550 39932 31189 15566 -22099 1141 37152 64732 -9556 -14878 18013 727 -8629 54451
7538 54451 63455 78495 15580 -70265 -62794 -24708 21922 8800 4487 -19386 7151 11627 31787
7525 31787 54771 45265 26715 36915 77503 91539 64093 13839 -54670 -32669 5236 14071
7513 14071 29696 -23084 -74224 -88718 -42218 -31397 -46099 -42107 -13081 11539 8893 -1939
7501 -1939 -28151 13281 31141 1655 -32061 -50366 -52869 -93408 -37830 31080 64650 37368
7489 37368 -3444 -42091 -30243 -8960 18926 46508 22422 -23448 -27086 -1973 -32717 -32406
7477 -32406 437 15695 61440 40680 4333 -13864 -31257 -37006 -11959 43456 78488 115227
7465 115227 72335 60131 92106 92337 82092 89343 80497 96377 65439 42463 30297 38657 6965
7452 6965 22737 55106 52098 39618 28125 -2142 17061 48208 -3639 -36445 -31136 -18815
7440 -18815 -40350 -33743 8861 4649 -14191 -12455 31483 33150 48487 9608 -32843 -28367 -1304
7427 -1304 -6093 -21231 -157 -7121 38199 67954 65880 78135 60712 15250 -3558 -3258 3862
7414 3862 39760 38290 -31169 -59441 -10370 13890 23372 2050 -12889 -18489 -1315 13167 27298
7401 27298 12844 -5815 -36837 -48572 -72963 -71260 -30171 3477 42957 73428 32768 30077
7389 30077 6367 -9894 1879 26179 25094 -16410 -13405 1778 -921 -18292 -28717 -15888
7377 -15888 -16495 -15045 -25153 -32627 -5743 6562 -29483 -10868 22188 34132 37861 14821 -2971
7364 -2971 21348 -11006 -26084 20675 17406 -15907 -76520 -68373 -26534 2823 -44193 -25854
7352 -25854 -4924 4988 2111 -12396 -14085 -41292 -24467 -36692 -36855 -50153 -51405 -30706 -11818
7339 -11818 10703 44848 112097 130182 19883 -58534 -84918 -33445 30054 55277 48374 601
7327 601 -34210 -13365 21964 10104 57375 65176 12999 -47040 -13641 12655 5958 -17639 -1861
7314 -1861 26575 -31424 -33560 1870 62296 109252 110117 118438 150654 115919 19810 7928 9804
7301 9804 -8999 13909 65263 65870 57517 75671 98754 59117 4645 24935 7360 -33273 -30954
7288 -30954 4883 -6153 -91961 -142353 -112000 -86745 -126977 -91194 -15805 -26057 -79455 -54857
7276 -54857 -7078 -40089 -23245 17343 22876 20903 62517 56331 29041 1301 -23804 -21679 12889
7263 12889 26530 9511 26702 3465 3588 30404 66583 48829 53476 102501 63453 44788
7251 44788 42745 10975 -11461 34943 30517 37009 39540 15985 17192 -22078 -10016 2986 9509
7238 9509 31097 73713 44043 -30944 27265 33356 -6332 -106521 -73133 -8839 -790 -38391
7226 -38391 -26211 -24507 14650 14704 -9543 -65617 -56971 7408 -18532 -45190 -49142 -45991 -8572
7213 -8572 -2508 2260 -21186 -23844 -61704 -59737 -16844 5376 29414 20895 15508 13742 39569
7200 39569 49007 8277 2835 -8741 -9486 5665 15111 -2828 12629 6366 -9326 15315 82057
7187 82057 85818 58796 47052 -6924 -19536 -11906 -6488 17925 5615 -39849 -39338 -45616 -24261
$$ [...]
##END NTUPLES=NMR SPECTRUM
##END=
