##TITLE=Analysis number 325222
Compound Code cc 00803
Project Code adrs
Chemist Name ugmt
##JCAMPDX= 6.0         $$ Bruker NMR JCAMP-DX V2.0
##DATA TYPE= NMR SPECTRUM
##DATA CLASS= NTUPLES
##ORIGIN= Bruker BioSpin GmbH
##OWNER= nmr
$$ XWIN-NMR		Version 3.5
$$ Thu Dec 14 15:00:55 2006 GMT Standard Time (UT+0h)  MAYBRIDGE\nmr@NMR_250MHZ
##.OBSERVE FREQUENCY= 250.131544655141
##.OBSERVE NUCLEUS= ^1H
##.ACQUISITION MODE= SIMULTANEOUS (DQD)
##.ACQUISITION SCHEME= undefined
##.AVERAGES= 16
##.DIGITISER RES= 18
##SPECTROMETER/DATA SYSTEM= dpx250
##.PULSE SEQUENCE= zg30
##.SOLVENT NAME= CDCl3
##.SHIFT REFERENCE= (INTERNAL, CDCl3, 0, 16.5218)
##AUDIT TRAIL= $$ (NUMBER, WHEN, WHO, WHERE, WHAT)
$$ ##TITLE= Audit trail, XWIN-NMR		Version 3.5
$$ ##JCAMPDX= 5.01
$$ ##ORIGIN= Bruker BioSpin GmbH
$$ ##OWNER= nmr
$$ C:\u/data/dgb/nmr/ADRS/1590/pdata/1/auditp.txt
$$ ##AUDIT TRAIL=  $$ (NUMBER, WHEN, WHO, WHERE, WHAT)
(   1,<2006-12-14 15:00:25.31 +000>,<MAYBRIDGE\nmr>,<NMR_250MHZ>,
      <created by zg, POWCHK disabled, PULCHK disabled
       configuration hash MD5:
       49 4B E0 1D 92 C2 6B 37 9F E6 65 BC 52 41 86 1D
       data hash MD5: 64K
       80 85 12 1A FF 90 1E FC 24 9C 5E 6D F6 33 65 54>)
(   2,<2006-12-14 15:00:44.31 +000>,<MAYBRIDGE\nmr>,<NMR_250MHZ>,
      <Start of raw data processing
       ef LB = 0.3 FT_mod = 6 PKNL = 1 SI = 32K 
       data hash MD5: 32K
       C6 58 1D 2A 90 2A 35 A4 05 05 DC 82 93 F7 BA 39>)
(   3,<2006-12-14 15:00:45.87 +000>,<MAYBRIDGE\nmr>,<NMR_250MHZ>,
      <apk 
       data hash MD5: 32K
       3B 7E 42 F5 DE 0E 64 22 4E D8 94 66 A4 98 04 D6>)
(   4,<2006-12-14 15:00:46.57 +000>,<MAYBRIDGE\nmr>,<NMR_250MHZ>,
      <abs ABSG = 5 
       data hash MD5: 32K
       B4 99 60 0A 37 22 97 27 DF E0 C8 CE 49 EB 62 06>)
$$ ##END=
$$ 
$$ hash MD5
$$ 96 31 BF C7 D8 56 14 5D 86 5F 47 19 34 82 EC 3F
##$RELAX= 
##$RELAX= 
##$RELAX= 
##$RELAX= 
##$RELAX= 
##$RELAX= 
##$RELAX= 
$$ Bruker specific parameters
$$ --------------------------
##$DU= <C:\u>
##$EXPNO= 1590
##$NAME= <ADRS>
##$PROCNO= 1
##$TYPE= <nmr>
##$USER= <dgb>
##$AMP= (0..31)
100 100 100 100 100 100 100 100 100 100 100 100 100 100 100 100 100 100 
100 100 100 100 100 100 100 100 100 100 100 100 100 100 
##$AQSEQ= 0
##$AQ_mod= 3
##$AUNM= <au_zg>
##$AUTOPOS= <24 >
##$BF1= 250.13
##$BF2= 250.13
##$BF3= 250.13
##$BF4= 250.13
##$BF5= 500.13
##$BF6= 500.13
##$BF7= 500.13
##$BF8= 500.13
##$BYTORDA= 1
##$CFDGTYP= 0
##$CFRGTYP= 5
##$CHEMSTR= <none>
##$CNST= (0..31)
1 1 145 1 1 1 1 1 1 1 1 1 1 1 1 1 1 1 1 1 1 1 1 1 1 1 1 1 1 1 1 1 
##$CPDPRG= <>
##$CPDPRG1= <>
##$CPDPRG2= <>
##$CPDPRG3= <>
##$CPDPRG4= <mlev>
##$CPDPRG5= <mlev>
##$CPDPRG6= <mlev>
##$CPDPRG7= <mlev>
##$CPDPRG8= <mlev>
##$CPDPRGB= <>
##$CPDPRGT= <>
##$D= (0..31)
0 1 0 0 0 0 0 0 0 0.06 0 0 0 0 0 0 0.0002 0 0 0 0 0 0 0 0 0 0 0 0 0 0 
0 
##$DATE= 1166108424
##$DBL= (0..7)
120 120 120 120 120 120 120 120 
##$DBP= (0..7)
150 150 150 150 150 150 150 150 
##$DBP07= 0
##$DBPNAM0= <>
##$DBPNAM1= <>
##$DBPNAM2= <>
$$ [...]
##$SUBNAM7= <"">
##$SUBNAM8= <"">
##$SUBNAM9= <"">
##$SW= 20.6930455092707
##$SWIBOX= (0..15)
0 0 3 0 0 0 0 0 0 0 0 0 0 0 0 0 
##$SW_h= 5175.983436853
##$TD= 65536
##$TD0= 1
##$TE= 295.16
##$TE2= 300
##$TE3= 300
##$TEG= 300
##$TL= (0..7)
0 120 120 120 120 120 120 120 
##$TP= (0..7)
150 150 150 150 150 150 150 150 
##$TP07= 0
##$TPNAME0= <>
##$TPNAME1= <>
##$TPNAME2= <>
##$TPNAME3= <>
##$TPNAME4= <>
##$TPNAME5= <>
##$TPNAME6= <>
##$TPNAME7= <>
##$TPOAL= (0..7)
0.5 0.5 0.5 0.5 0.5 0.5 0.5 0.5 
##$TPOFFS= (0..7)
0 0 0 0 0 0 0 0 
##$TUNHIN= 0
##$TUNHOUT= 0
##$TUNXOUT= 0
##$USERA1= <user>
##$USERA2= <user>
##$USERA3= <user>
##$USERA4= <user>
##$USERA5= <user>
##$V9= 5
##$VALIST= <valist>
##$VCLIST= <CCCCCCCCCCCCCCC>
##$VD= 0
##$VDLIST= <DDDDDDDDDDDDDDD>
##$VPLIST= <PPPPPPPPPPPPPPP>
##$VTLIST= <TTTTTTTTTTTTTTT>
##$WBST= 1024
##$WBSW= 4
##$XGAIN= (0..3)
0 0 0 0 
##$XL= 0
##$YL= 0
##$YMAX_a= 262506
##$YMIN_a= -334875
##$ZGOPTNS= <>
##$ZL1= 120
##$ZL2= 120
##$ZL3= 120
##$ZL4= 120
##$ABSF1= 16.52183
##$ABSF2= -4.171343
##$ABSG= 5
##$ABSL= 3
##$ALPHA= 0
##$AQORDER= 0
##$ASSFAC= 0
##$ASSFACI= 0
##$ASSFACX= 0
##$ASSWID= 0
##$AUNMP= <proc_1d>
##$AZFE= 0.1
##$AZFW= 0.1
##$BCFW= 0
##$BC_mod= 0
##$BYTORDP= 0
##$COROFFS= 0
##$CY= 12.5
##$DATMOD= 1
##$DC= 0
##$DFILT= <>
##$DTYPP= 0
##$F1P= 14.0000005364418
##$F2P= -0.99999901652339
##$FCOR= 0.5
##$FTSIZE= 32768
##$FT_mod= 6
##$GAMMA= 0
##$GB= 0
##$INTBC= 1
##$INTSCL= 1
##$ISEN= 128
##$LB= 0.3
##$LEV0= 0
##$LPBIN= 0
##$MAXI= 10000
##$MC2= 0
##$MEAN= 0
##$ME_mod= 0
##$MI= 0
##$NCOEF= 0
##$NC_proc= -4
##$NLEV= 6
##$NOISF1= 0
##$NOISF2= 0
##$NSP= 0
##$NTH_PI= 0
##$NZP= 0
##$OFFSET= 16.52183
##$PC= 1
##$PHC0= 224.8055
##$PHC1= 6.049662
##$PH_mod= 1
##$PKNL= yes
##$PPARMOD= 0
##$PSCAL= 4
##$PSIGN= 0
##$REVERSE= no
##$SF= 250.130000040764
##$SI= 32768
##$SIGF1= 0
##$SIGF2= 0
##$SINO= 400
##$SIOLD= 32768
##$SREGLST= <1H.CDCl3>
##$SSB= 0
##$STSI= 32768
##$STSR= 0
##$SW_p= 5175.98343685301
##$SYMM= 0
##$S_DEV= 0
##$TDeff= 65536
##$TDoff= 0
##$TI= <Analysis number 999999
Compound Code 99
Book Reference 9
Project Code 9>
##$TILT= no
##$TM1= 0
##$TM2= 0
##$TOPLEV= 0
##$USERP1= <user>
##$USERP2= <user>
##$USERP3= <user>
##$USERP4= <user>
##$USERP5= <user>
##$WDW= 1
##$XDIM= 32768
##$YMAX_p= 343846131
##$YMIN_p= -245417
$$ End of Bruker specific parameters
$$ ---------------------------------
##NTUPLES= NMR SPECTRUM
##VAR_NAME=  FREQUENCY,     SPECTRUM/REAL,   SPECTRUM/IMAG
##SYMBOL=    X,             R,               I
##VAR_TYPE=  INDEPENDENT,   DEPENDENT,       DEPENDENT
##VAR_FORM=  AFFN,          ASDF,            ASDF
##VAR_DIM=   32768,         32768,           32768
##UNITS=     HZ,            ARBITRARY UNITS, ARBITRARY UNITS
##FACTOR=    0.157963299565203, 1,           1
##FIRST=     4132.60523979779, 0,            0
##LAST=      -1043.37819705522, 0,           0
##MIN=       -1043.37819705522, -245417,     0
##MAX=       4132.60523979779, 343846131,    0
$$ Real data points
##PAGE= N=1
##DATA TABLE= (X++(R..R)), XYDATA
$$ [...]
19776b8709O876L6536K8043k0028m9035l5094j3090O3633J9398M2100l6677m7635
$$ -28709 -21833 14703 42746 22718 -26317 -61411 -74501 -10868 8530 50630 13953 -33682
19764c3682r43n7303L1219O6533o242j0538m5518l9092k1990J0325L9061M0603
$$ -33682 -34625 -91928 -60709 5824 -418 -10956 -56474 -95566 -117556 -107231 -68170 -27567
19752b7567J7187K2845M6037N2776j6285l2349K1981m8545p4106J2632P1082M6289
$$ -27567 -10380 12465 58502 111278 94993 62644 84625 36080 -38026 -25394 45688 91977
19740I1977n4220j8955n12m0689J7837J5237R252l0551p8592J4886P8358J6648
$$ 91977 37757 18802 18290 -22399 -4562 10675 19927 -10624 -89216 -74330 4028 20676
19728B0676K1023J5448m9655j8054n5588m4084l0511N6339Q150l7514P3787J3808
$$ 20676 41699 57147 7492 -10562 -66150 -110234 -140745 -84406 -76256 -113770 -39983 -26175
19716b6175q9219q480O5546N6821O578k7297m5598K9275J7132m9702M6682L1619
$$ -26175 -115394 -123874 -58328 -1507 5071 -22226 -67824 -38549 -21417 -71119 -24437 7182
19704G182P5611K5552m5657Q325p0967o6755P1774M6761J1258l1862J480L6007
$$ 7182 82793 108345 62688 71013 46 -66709 5065 51826 63084 31222 32702 68709
19692F8709J7380l6861m0810P570L5474l4268l3723M7383o5762K6134J0220J9291
$$ 68709 86089 49228 8418 15988 51462 17194 -16529 30854 -34908 -8774 1446 20737
19680B0737J3117o6674q448L4709J5386k2816j8229L4530J2625l1348k8288k2677
$$ 20737 33854 -32820 -41268 -6559 8827 -13989 -32218 2312 14937 -16411 -44699 -67376
19668f7376J9683K361L1834M4491J729l3155O322L9846m6913l1426l5866N5714
$$ -67376 -47693 -45332 -13498 30993 32722 -433 5889 45735 -1178 -32604 -68470 -12756
19656a2756J4884J5568K4750L9199J9724p791q0372l6460J9586o141l1900l5751
$$ -12756 2128 17696 42446 81645 101369 93578 13206 -23254 -3668 -9809 -41709 -77460
19644g7460n5656R228K3939O0762N787J3973J453j6087P658m142j5392M1921K6995
$$ -77460 -133116 -123888 -99949 -39187 -33400 -19427 -17974 -34061 -26403 -30545 -45937 -4016 22979
19631B2979J7645J8393K5694n3105k5011N7309M3330p023q1223o8644L3905L6140
$$ 22979 40624 59017 84711 31606 6595 63904 107234 100211 18988 -49656 -15751 20389
19619B0389k3155k7385M5124O607o4054R322J1691R729J5285l8857n9980O1716
$$ 20389 -2766 -30151 14973 21580 -42474 -33152 -21461 -11732 3553 -35304 -95284 -33568
19607c3568J10575P2345R7051J8169l5543K2140J02802K6029n0745p1318k605
$$ -33568 77007 149352 246403 264572 229029 251169 353971 380000 329255 257937 255332
19596B55332K5821J1575J3144J0773K3277L9021K4129K1893L3815J10998O4242
$$ 255332 281153 292728 305872 316645 339922 378943 403072 424965 458780 569778 634020
19585F34020l3950j9124j18511l0518O8084P0005j6069l0304K6822j324l4889
$$ 634020 600070 580946 462435 431917 500001 570006 553937 523633 550455 549131 514242
19574E14242P068m4353J1153O98j5299L2021K2204K038K1496M6839L1201m2164
$$ 514242 521310 476957 488110 488808 473509 505530 527734 529772 551268 598107 629308 587144
19562E87144j30270j09898l1697l1728l2157J2938N666M4667j9983q3358M985
$$ 587144 456874 346976 315279 283551 251394 264332 269998 314665 294682 211324 216309
19551B16309M9942N2578k1565J964L8276L6505K8655j04796m3753p7841k7716
$$ 216309 266251 318829 297264 299228 337504 374009 402664 297868 254115 176274 148558
19540A48558J8868J4093M6843J5520N4795o7365m2109N6608K4675j1099N6178
$$ 148558 167426 181519 228362 243882 298677 231312 189203 245811 270486 259387 315565
19529C15565J6518l7741k7552P21n8479j38773p5416j064J8633l741j1330m1178
$$ 315565 332083 294342 266790 267511 209032 70259 -5157 -6221 12412 8671 -2659 -43837
19517d3837J8761J8719J23O2292P7748N2459R860n7196m8319j992K645O623J2614
$$ -43837 -25076 -6357 -6234 56058 133806 186265 196125 138929 90610 88618 91263 97886 110500
19504A10500p7761l9076K9781J4976k6634l071k0071K400L5404K3076j6295j7593
$$ 110500 32739 -6337 23444 38420 11786 8715 -11356 -8956 26448 49524 33229 15636
19492A5636o8169M638K1574O9127M9451q3654o9956K5236O0223M4452l5354l0626
$$ 15636 -52533 -47895 -26321 42806 92257 8603 -61353 -36117 24106 68558 33204 2578
19480B578j2158k5512n5319R1985P1940P752m2662j2390r886J432o4557k7770
$$ 2578 -9580 -35092 -90411 1574 73514 81266 38604 26214 16328 17760 -46797 -74567
19468g4567O2228J7590p6421l3307J291M9411P0114R293j0952k6481k1705k3334
$$ -74567 -12339 5251 -71170 -104477 -103186 -53775 16339 25632 14680 -11801 -33506 -56840
19456e6840K7799L8378O1356m292l8876l1403P036K5140j6008J6412J9299q5738
$$ -56840 -29041 9337 70693 66401 27525 -3878 3158 28298 12290 28702 48001 -37737
19444c7737j9317P8801K6738n5703o745J6025o10J7235J9704l5099K2593m9570
$$ -37737 -57054 21747 48485 -7218 -13963 2062 1452 18687 38391 3292 25885 -23685
19432b3685J6693N2315l7821k573J3717K688K6631L364m8342k5516J777M5678
$$ -23685 -6992 45323 7502 4929 18646 21334 47965 51329 2987 -22529 -20752 24926
19420B4926K4840j0760m1594r60M3566n4410q610L9208N1955J8809j7701L3408
$$ 24926 49766 39006 -2588 -3548 40018 -14392 -23002 16206 68161 86970 69269 102677
19408A02677K2236j05470q8377J3628l2588m9325K3507O0274Q6646r32P675Q544
$$ 102677 124913 19443 -68934 -55306 -87894 -137219 -113712 -53438 33208 32276 39951 48495
19396D8495j725R311q543K09n648l239Q308q541k595L192j9932Q1200K7865j05563
$$ 48495 46770 56081 47538 47747 42099 38860 47168 38627 36032 39224 19292 100492 128357 22794
19382B2794j19805j6291Q2617P0249O65k4822R3195j1812R179j02279r4154l0341
$$ 22794 -97011 -113302 -30685 39564 40229 15407 108602 96790 105969 3690 -90464 -120805
19370a20805N9260K3251J008k2076j203J5802L1799J7629k1897j5261j7089k839
$$ -120805 -61545 -38294 -37286 -59362 -60565 -44763 -12964 4665 -17232 -32493 -49582 -52421
19358e2421m7113M2476L6947l0939M4628O5776m4542K7218J5004K3126m9460J4700
$$ -52421 -99534 -57058 -20111 -51050 -6422 59354 14812 42030 57034 80160 30700 45400
19346D5400N6919p030J5201o0855l4846R828J9113K416P405j8419n0280K2934
$$ 45400 102319 95289 110490 49635 14789 24617 43730 46146 53551 35132 -15148 7786
19334G786O3276j166J6882q911m6616m9733l9853M1864M321o794r144l7039j1746
$$ 7786 71062 69896 86778 77867 31251 -18482 -58335 -16471 -12150 -18944 -28088 -65127 -76873
19321g6873N1121K289j0399L1390l3134K3065M2875k3032m7316l812P2627L2939
$$ -76873 -25752 -23463 -33862 -2472 -35606 -12541 30334 7302 -40014 -43826 28801 61740
19309F1740l4328k3264K0075l5622J9623K7386N1993P067m3008Q582q587l2059
$$ 61740 27412 4148 24223 -11399 8224 35610 87603 94670 51662 60244 51657 19598
19297A9598l798J95k7585j6758J2629M6291O1900M8967L615n5854L8365j1976
$$ 19598 15800 15995 -11590 -28348 -15719 30572 92472 141439 145054 89200 127565 115589
19285A15589o4047j1138N8186J2297j5992k7750j0179k706K8966Q114l074j9713
$$ 115589 51542 40404 98590 110887 94895 67145 56966 54260 83226 91340 88266 68553
19273F8553l2758J2252M1548K4249o775K0211m0520l9174o46K6921P595l667p1593
$$ 68553 35795 48047 89595 113844 107069 127280 86760 47586 46940 73861 81456 77789 6196
19260F196Q112O768L6315L9884j9794r571k2644m5584j5112L6603N7324K4045
$$ 6196 14308 21076 57391 97275 77481 67910 45266 -318 -15430 21173 78497 102542
19248A02542K2169n3757l0896M2128L8302l4071L5185L1330k9808k3989l6073
$$ 102542 124711 70954 40058 82186 120488 86417 121602 152932 123124 99135 63062
19237F3062l001O3004m573l2216O030K2428j9528J7224l8434j1770m5828N016
$$ 63062 60061 123065 118492 86276 92306 114734 95206 112430 73996 62226 16398 21414
19225B1414L5522k887K0191K3571k0526k8480k6871l8184J389L8941M3322K6772
$$ 21414 56936 54049 74240 97811 77285 48805 21934 -16250 -14861 24080 67402 94174
19213I4174m669M835r828n753m3446k9808K4404N2273M2928m2258J674j6592j24670
$$ 94174 89505 94340 84512 78759 35313 5505 29909 82182 125110 82852 84526 67934 -56736
19200e6736m2913j5224k0657M7751O7683j828k6673J8074k4950L7268N168O6404
$$ -56736 -99649 -114873 -135530 -87779 -20096 -21924 -48597 -30523 -55473 -18205 -13037 53367
19188E3367O554J4598M786L065r514q955K5350L695m2854l099P5325M1232m0913
$$ 53367 59921 74519 79305 82370 72856 63901 89251 92946 50092 46993 122318 163550 122637
19175A22637q0720l3745l6527K6370Q573R751l1992L6111M4423O4471l0581o1361
$$ 122637 41917 8172 -28355 -1985 6588 16339 -15653 20458 64881 129352 98771 37410
19163C7410M0036N3239k8901K4528O8926m6852p4352n5046l9085M183L2857M3018
$$ 37410 77446 130685 101784 126312 195238 148386 74034 18988 -20097 -15914 16943 59961
19151E9961N5908j5308k3769J7272m6483l1273o8537J4781N5427O9411M4380k0832
$$ 59961 115869 100561 76792 94064 47581 16308 -52229 -37448 17979 87390 131770 110938
19139A10938J1244M6474P412m884J7425Q573l6604j8576N9471R156n5282J1813
$$ 110938 122182 168656 176068 171184 188609 197182 160578 142002 201473 210629 155347 167160
19127A67160l8469o856O4255k866L5058J07620L9168o143Q9022L1031O885K6518
$$ 167160 128691 121835 186090 183224 218282 325902 365070 358927 447949 478980 485865 512383
19115E12383k1580J949l6744j1661J5996N7509M5463J38147J37035j269R595l1176
$$ 512383 490803 492752 456008 444347 460343 517852 563315 701462 838497 837228 846823 815647
19103H15647L4083R6224R5471J22510N2973J47760J55248J23816J31018J99131
$$ 815647 849730 945954 1041425 1163935 1216908 1364668 1519916 1643732 1774750 1973881
19093A973881K20530o467p3060J16581K05377K04950L77749N69176Q84236J179610
$$ 1973881 2194411 2187944 2114884 2231465 2436842 2641792 3019541 3588717 4472953 5652563
19083E652563J659605K633201L838981L718453J316796J563111M515631P017101
$$ 5652563 7312168 9945369 13784350 17502803 18819599 20382710 24898341 31915442
19075C1915442L383218m743805l722981R32580L768311K632278K361512P412844
$$ 31915442 35298660 30554855 26831874 27764454 31532765 34165043 36526555 43939399
19067D3939399J3376507J1821606J333515L217952J5287001K5200724J3938606
$$ 43939399 57315906 69137512 70471027 73688979 88975980 114176704 128115310
19060A28115310q453487j009985Q122541j981388j9777000k1510768q643017N686589
$$ 128115310 119661823 118651838 126774379 124792991 105015991 83505223 74862206 80548795
19052H0548795J9139226K8739373J5382066k0780229k8707394j1468565M492835
$$ 80548795 99688021 128427394 143809460 123029231 94321837 82853272 87346107
19045H7346107J3746265J0436202J241994q107280j5927547q978787N732451J8941267
$$ 87346107 101092372 111528574 112770568 104663288 88735741 79756954 85489405 104430672
19037A04430672K1389511n611288l0455521k4599018j1455540k342442M585945
$$ 104430672 125820183 120208895 89753374 65154356 53698816 51356374 55942319
19030E5942319R576821P288953o963138j5292561r948596k532900L412550R177305
$$ 55942319 65519140 72808093 65844955 50552394 40603798 38070898 41483448 50660753
19022E0660753J2360388N788395J50683P599297J7848462J3979835j4123871k0134458
$$ 50660753 63021141 68809536 68960219 76559516 94407978 108387813 94263942 74129484
19014G4129484p313649J056287l824885j3072472r821875k595081J524657p90422
$$ 74129484 66815835 67872122 64047237 50974765 41152890 38557809 40082466 39292044
19006C9292044k457650J827002O771226M600396p801784r417407l758013o05334
$$ 39292044 36834394 38661396 45432622 50033018 42231234 32813827 29055814 28450480
18998B8450480l051464o595371n404247l188156j902870j278669r93124o93528
$$ 28450480 25399016 18803645 13399398 10211242 8308372 7029703 6036579 5343051
18990E343051n39710m39754k39484k16683k00843k31596l06221k77943j25334
$$ 5343051 4803341 4363587 4124103 3907420 3706577 3474981 3168760 2890817 2765483
18981B765483j47107j72740k22674j96171j39180p6666n6455j47598o2613O818
$$ 2765483 2618376 2445636 2222962 2026791 1887611 1810945 1754490 1606892 1544279 1551097
18971A551097o4016j31233j01182p7551r7487n3286j3630k9196m0316l3630j7208
$$ 1551097 1487081 1355848 1254666 1177115 1079628 1026342 1012712 983516 943200 909570 892362
18960H92362r426o3907n3465l5540P66m1206n8311q9549k7602j6601j0490n6551
$$ 892362 882936 819029 765564 730024 730790 689584 631273 541724 514122 497521 487031 430480
18948D30480L8530P9884J7915j8306l9069j7210J8714k4252r462K0267m5066j2349
$$ 430480 469010 548894 566809 548503 509434 492224 510938 486686 477224 497491 452425 440076
18936D40076K6297m969m9239l5240J0967K8406N7447m1379k4523j9031j9552j975
$$ 440076 466373 461404 412165 376925 387892 416298 473745 432366 407843 388812 369260 367285
18924C67285m0154j533j2477M3006L2946R160q380k7749o9052j4412J6156p1625
$$ 367285 327131 325598 313121 356127 389073 398233 389853 362104 293052 278640 294796 223171
18912B23171L9662P1280K8930J1031q6678J2834P8795J5118p874L463k2697j9900
$$ 223171 262833 334113 363043 374074 287396 300230 379025 394143 386269 389732 367035 347135
18900C47135j43n0679n9838K0659M3703p1226n2032j4518l0774J2939J9467K2670
$$ 347135 346992 296313 236475 257134 300837 229611 177579 163061 132287 145226 164693 187363
18888A87363k1684k4944J2662j3936j2588L1971J0751K7350K8383l8292J7497
$$ 187363 165679 140735 153397 139461 126873 158844 169595 196945 225328 187036 204533
18877B04533M8722M965l4481K4831M093j9625l2857K4517J2540j2140o509M0061
$$ 204533 253255 258220 223739 248570 252663 233038 200181 224698 237238 225098 218589 258650
18865B58650n342k8078N411j9927N5281L2986j746j2266q4696o1417o509N7108
$$ 258650 253308 225230 230641 210714 265995 298981 297235 284969 200273 138856 132347 189455
18853A89455J5799J444K085n8381k0870L1051N4083Q4331l201l903k4116l5628
$$ 189455 205254 206698 208783 150402 129532 160583 214666 298997 295796 291893 267777 232149
18841B32149p74R597l3459l460l5896n6472m388K0317j9252j2079M1337M123O4528
$$ 232149 231375 240972 207513 204053 168157 111685 107297 127614 108362 96283 137620 141743 206271
18828B06271K5992m8718L2653M9018K4000j2357J7367M4101q04j6404r008k5114
$$ 206271 232263 183545 216198 265216 289216 276859 294226 338327 337523 321119 312111 286997
18816B86997J2312j6378p0201K6370n849n1208k6088l8416r430J2910Q566n4066
$$ 286997 299309 282931 212730 239100 233251 182043 155955 117539 108109 121019 129585 75519
18804G5519l944q417J404O3557Q557n3733J3271P7157K497m8685r1442l5513O4263
$$ 75519 71575 63158 64562 128119 136676 82943 96214 173371 175868 127183 35741 228 64491
18791F4491M8908M6963O350k6243l2434K3047K7190K4156L9713o642l6517n6359
$$ 64491 113399 160362 166712 140469 108035 131082 158272 182428 222141 215499 178982 122623
18779A22623l6903k114J9791L4248L1397l130k8758k4572M6881Q3245O2256R8350
$$ 122623 85720 83606 103397 137645 169042 165912 137154 112582 159463 242708 304964 403314
18767D03314J68922K00378j60933j25266j43532j92867m8764L2386l569o7927
$$ 403314 572236 772614 611681 486415 342883 150016 101252 133638 130069 62142
18757F2142p2154n486M6445M2965R0726M2633m4649p8017p7567k3533O5215j5380
$$ 62142 -10012 -15498 30947 73912 164638 207271 162622 84605 7038 -16495 48720 33340
18745C3340M1198J8777o2545j4943Q39p372J9330P4908j4688o1354m3234J0785
$$ 33340 74538 93315 30770 15827 16666 9294 28624 103532 88844 27490 -15744 -4959
18733d959j5635Q636N0611N9808M8127l1352j8532j5970k0923m3969J5160j1503
$$ -4959 -20594 -11958 38653 98461 146588 115236 96704 80734 59811 15842 31002 19499
18721A9499n278J4958Q964k3242J4058q633n2600J7203N0844j3232O7198R2140
$$ 19499 14221 29179 38143 14901 28959 20326 -32274 -15071 35773 22541 89739 181879
18709A81879p977q5555k0495j5168j6535R0L684K0257j1261m7889m7665j4314
$$ 181879 173902 88347 67852 52684 36149 36239 39923 60180 48919 1030 -46635 -60949
18697f0949K5014J20230J10393n3757n7878k0873P233M1017n0218m6925N551n1201
$$ -60949 -35935 84295 194688 140931 83053 62180 69413 110430 60212 13287 18838 -32363
18685c2363l1610k3213p3267L077J11389N7144j7445N1507M806n8396m52L4187
$$ -32363 -63973 -87186 -160453 -157376 -45987 11157 -6288 45219 50025 -8371 -8823 25364
18673B5364n7930l4335L6412L7953J786k521j6046l8107l580l865n071L0567j7664
$$ 25364 -32566 -66901 -30489 7464 9250 6729 -9317 -47424 -51004 -54869 -59940 -29373 -47037
18660d7037K9803P1204p3809p3665R057J0704M3822J8926M2490k5817p484O132
$$ -47037 -17234 53970 -19839 -93504 -84447 -73743 -29921 -10995 31495 5678 -1806 4326
18648D326n1786k455L7348J799q552O3805j2621k8355k0252m0822L6756J136k7224
$$ 4326 -47460 -49915 -12567 -10768 -19320 44485 31864 3509 -16743 -57565 -20809 -19673 -46897
18635d6897j7802L8632P8j6731L0353n179P3877l3070j2524J8725j0690k8979
$$ -46897 -64699 -26067 -25989 -42720 -12367 -17546 56331 23261 10737 29462 18772 -10207
18623a0207l4173J9449K3590K9794l6087m7115L9118M475J7355O3578l6599j6413
$$ -10207 -44380 -24931 -1341 28453 -7634 -54749 -15631 -11156 6199 69777 33178 16765
18611A6765j3101K5982N9099M5004L0935o412o1187q5434o0599N3221M5604L8695
$$ 16765 3664 29646 88745 133749 164684 158272 97085 11651 -48948 4273 49877 88572
18599H8572K3393m1797k4471j3032L1516N835J5489K3043l8389n0096o6592O338
$$ 88572 111965 70168 45697 32665 64181 70016 85505 108548 70159 20063 -46529 -40191
18587d0191M6814J6624J9810m4637m4491J8509J2204K8472m9244M8830R5499j906
$$ -40191 6623 23247 43057 -1580 -46071 -27562 -15358 13114 -36130 12700 108199 106293
18575A06293j9459l6852m8803p5684k1503J19842J5361o1358l729l2838o0116
$$ 106293 86834 49982 1179 -74505 -96008 23834 39195 -22163 -25892 -58730 -118846
18564a18846J3395J7364N2485Q1475M4151L0696k6779q278l3691K1177P0062k8410
$$ -118846 -105451 -88087 -35602 45873 90024 120720 93941 85663 51972 73149 143211 114801
18552A14801p1179o6304J6325N0978P3847Q8261Q7183M3506l7158q715L9938K2883
$$ 114801 43622 -22682 -6357 44621 118468 206729 293912 337418 300260 291545 331483 354366
18540C54366o181n5709o7724n5133K0240q385m684O5026P0128N3369j1842P0257
$$ 354366 348185 292476 224752 169619 189859 181474 176790 241816 311944 365313 353471 423728
18528D23728J37819J32257N625n2860o5344k6699O1352K6316k1308O707M3455
$$ 423728 561547 693804 699429 646569 581225 554526 615878 642194 620886 627593 671048
18517F71048k856j01746m5041j7383M4218L7831k5849k9897n0388K9444N080J7052
$$ 671048 668192 566446 521405 504022 548240 586071 560222 530325 479937 509381 514461 531513
18505E31513L7935o510l1700j29377O047l4801K1332l7994l6067J5747n5566p2239
$$ 531513 569448 562938 531238 401861 407908 373107 394439 356445 320378 336125 280559 208320
18493B08320k9997J2171L3044M9083M1654K891J02759P9849q3750j16934p6757
$$ 208320 178323 190494 223538 272621 314275 317166 419925 499774 416024 299090 222333
18482B22333L087K3273K7535J470M4172o254r7431k2595Q8384Q6640N0036k5459
$$ 222333 225420 248693 276228 277698 321870 315616 218185 195590 283974 370614 420650 395191
18470C95191q8942m8488k9298J8727n7206o7449k9428J804k6304q241l1500N0711
$$ 395191 306249 257761 228463 247190 189984 122535 93107 94911 68607 60366 28866 79577
18458G9577n595K059p886K2522K3850o413M3592J0575o2740k2186M134L2914l9395
$$ 79577 73982 76041 68155 90677 114527 108114 151706 162281 99541 77355 81489 114403 75008
18445G5008m0937L39J507K1315N6782j0105o7807m0368l5020P13L8524k1433j487
$$ 75008 34071 34410 35917 57232 114014 103909 36102 -4266 -39286 -38573 -49 -21482 -22969
18432b2969L877N6462K255L559J912L1672o6126m7312k5993J5653k413j2473m4600
$$ -22969 -19092 37370 39625 43184 45096 76768 10642 -36670 -62663 -47010 -49423 -61896 -106496
18419a06496j9141j2812L6958L1634J0494K973R950m3756j6877L6014J05949K5693
$$ -106496 -125637 -138449 -101491 -69857 -59363 -56390 -46440 -90196 -107073 -71059 34890 60583
18407F0583N2808L726m6263J3320J2133n5688L2168J767J5600R136r759j310K0259
$$ 60583 113391 117117 70854 84174 96307 40619 72787 74554 90154 99290 89531 88221 108480
18394A08480k8629k3181K3946r981K1888l6836n4409K7177j0276l9472o3760n7413
$$ 108480 79851 56670 80616 70635 92523 55687 1278 28455 18179 -21293 -85053 -142466
18382a42466P6997K1751J2013O6570K1462n2928r243R3170K3491p4835n5814q2387
$$ -142466 -65469 -43718 -31705 34865 56327 3399 -5844 87326 110817 35982 -19832 -102219
18370a02219r775R0977O3184m053q2947n4197K1536L4977j1500l6033O4130J01244
$$ -102219 -111994 -21017 42167 38114 -44833 -99030 -77494 -42517 -54017 -90050 -25920 75324
18358G5324K6320p1718l3457L4457l1117m9147l1615K5914N0289J1704J4954k8097
$$ 75324 101644 29926 -3531 30926 -191 -49338 -80953 -55039 -4750 6954 21908 -6189
18346f189N0348M9165o8801l5938J1891K2434l4639J6905j5420o1658l852Q029
$$ -6189 44159 93324 24523 -11415 476 22910 -11729 5176 -10244 -71902 -75754 -67725
18334f7725N8738K5516L9476M548q801o5928j1170k2807j1069O0535m0554J2440
$$ -67725 -8987 16529 56005 60553 51752 -14176 -25346 -48153 -59222 1313 -39241 -26801
18322b6801J01384P7956j4165j38421J31O0686m8231J7026M6388k7655k9544N2051
$$ -26801 74583 152539 138374 -47 84 60770 12539 29565 75953 48298 18754 70805
18310G0805L1242k7022r4183m5596Q177j9308N4768K8793k6544j1008N573N4154
$$ 70805 102047 75025 -19158 -64754 -56577 -75885 -21117 7676 -18868 -29876 -24303 29851
18298B9851k4967j9869K8445M4423K4722k6102m8667J8706m1641J7778M6777K0539
$$ 29851 4884 -14985 13460 57883 82605 56503 7836 26542 -15099 2679 49456 69995
18286F9995M227M854q3902k4188O6358K4725j8877M624q140o7J3623K9704r046
$$ 69995 74222 79076 -4826 -29014 37344 62069 43192 47816 39676 39609 53232 82936 73890
18273G3890q371j2142L166l9830r0471R052J9953p1947j7835K346j9138M2099
$$ 73890 65519 53377 56543 16713 -73758 -64706 -44753 -116700 -134535 -132189 -151327 -109228
18261a09228L6315O385n4254j2354K3566P647M7496N8242J443J3406M4396j8919
$$ -109228 -72913 -66528 -120782 -133136 -109570 -101923 -54427 3815 5258 18664 63060 44141
18249D4141k0590p1840n378m921J8792L2372k3055j6484J3918K7527l9890l0220
$$ 44141 23551 -48289 -53667 -58588 -39796 -7424 -30479 -46963 -33045 -5518 -45408 -75628
18237g5628P0849M4673l1895j0471J7206o729k9057l3910J8968k0554m0736L5696
$$ -75628 -4779 39894 7999 -2472 14734 8005 -21052 -54962 -35994 -56548 -97284 -61588
18225f1588O2885K307k9539n604M4953J0112k9773j9779n3814K8798K6381K1987
$$ -61588 1297 3604 -25935 -31539 13414 23526 -6247 -26026 -79840 -51042 -24661 -2674
18213b674m255j5684L1531R2622M9021j5610K0880o3260m1252R678j4929k9544
$$ -2674 -6929 -22613 8918 101540 150561 134951 155831 92571 51319 60997 46068 16524
18201A6524m4173L2459N8225j1608m3481n0347M3251K6473O606m965k0642n8049
$$ 16524 -27649 4810 63035 51427 7946 -42401 850 27323 33929 28964 8322 -49727
18189d9727k8382L5026N8567L3856M041m2706k8149K3019M7843m4878m0659J3178
$$ -49727 -78109 -43083 15484 49340 53381 10675 -17474 5545 53388 8510 -32149 -18971
18177a8971j9436K7917L420M5377n100Q3027J1925K3550M1808m6254m8593J7924
$$ -18971 -38407 -10490 -7070 38307 33207 116234 128159 151709 193517 147263 98670 116594
18165A16594l3690k2927K2998j3084M5434J3291o628k1982n7920J0493k9543j3938
$$ 116594 82904 59977 82975 69891 115325 128616 121988 100006 42086 52579 23036 9098
18153I098L1450O971L508r312M2977J7283m84l0985J1739L1283P4757J3692O391
$$ 9098 40548 47519 51027 41715 84692 101975 101491 70506 82245 113528 188285 201977 208368
18140B08368j054M1672j02J5652O0638L7971N0492O312K224L2383J10438J7887
$$ 208368 207314 248986 248884 264536 325174 363145 413637 419949 422173 454556 564994 582881
18128E82881L1050Q9918J32315K39830J22877Q6250K09353J80683K25167K90970
$$ 582881 613931 703849 836164 1075994 1198871 1285121 1494474 1675157 1900324 2191294
18118B191294L36543N95992R53089J288510K216981L874040P203154J3479173
$$ 2191294 2527837 3123829 4076918 5365428 7582409 11456449 18659603 32138776
18110C2138776K3401089L6990673L6704128k7202726m6393331k3408534j0913065
$$ 32138776 55539865 92530538 129234666 102031940 55638609 32230075 21317010
18103B1317010n858259l574992k620454j898830j385017j071987q98577p25372
$$ 21317010 15458751 11883759 9263305 7364475 5979458 4907471 4008894 3283522
18095C283522m56962l23812l34346l73790k12883o2335r7145j06380q4815j15633
$$ 3283522 2826560 2502748 2168402 1794612 1581729 1519394 1422249 1315869 1231054 1115421
18085A115421j48692j08076j7258k1486k1518n622L215r8146J0941M305j4546
$$ 1115421 966729 858653 841395 819909 798391 792769 795984 697838 708779 713084 698538
18074F98538l4348n3062n5091r876m2366n6883K1836l0844m7287m044k8126n6530
$$ 698538 664190 611128 556037 546161 503795 446912 468748 437904 390617 386573 358447 301917
18062C01917M6552K4872n6461o7140m3684Q053J0577p787J1508P0622j2352o530
$$ 301917 348469 373341 316880 249740 206056 214109 224686 216899 228407 299029 286677 280147
18050B80147M7157j9225N3972Q6122J12847J06157J01810o3188r8278q5616p6650
$$ 280147 327304 308079 362051 448173 561020 667177 768987 705799 607521 521905 445255
18039D45255j12713m2188p3670p9950O633L5421M740o6922P443K7595K0510r521
$$ 445255 332542 290354 216684 136734 143367 178788 183528 116606 124049 151644 172154 162633
18027A62633k6661m1755k1914k864J5638K3302r34l733p5972k5285K4350k2310
$$ 162633 135972 94217 72303 69439 85077 108379 107445 103712 27740 2455 26805 4495
18015D495k3424l0678j5073M7974J6457M3196N5334o4731l4894j1325K7556M5896
$$ 4495 -18929 -49607 -64680 -16706 -249 42947 98281 33550 -1344 -12669 14887 60783
18003F0783r330j0940P819n0149n800J5440J6425L9649j1311K957L3501l4830
$$ 60783 51453 40513 48332 -1817 -7617 7823 24248 63897 52586 55543 89044 54214
17991E4214M2103N0076M7715M298m5514q6000o9429L6211j0807L7088M3059l5943
$$ 54214 96317 146393 194108 198406 152892 66892 -2537 33674 22867 59955 103014 67071
17979F7071k2732n6615m0691j077L8678O2517K1282l3651m9163l849J8585K364
$$ 67071 44339 -12276 -52967 -54044 -15366 47151 68433 34782 -14381 -18230 355 2719
17967B719j0795L5981M3365m2860J4665K4607K164N66k7889L5841Q243n491L5200
$$ 2719 -8076 27905 71270 28410 43075 67682 69846 70412 42523 78364 86607 81116 116316
17954A16316M324P855m7098o2647n6112J0874R376L7305k4381m9477L6757R431
$$ 116316 120640 128495 81397 18750 -37362 -26488 -17112 20193 -4188 -53665 -16908 -7477
17942g477k8581q340J9420N5040M3066L2256J086o0058q6293k165Q68R437O4137
$$ -7477 -36058 -44398 -24978 30062 73128 105384 106470 46412 -39881 -42046 -41178 -31741 32396
17929C2396j023j386J3157L7053j4217M442j7509n6308o939M2781M9160L9114
$$ 32396 31373 29987 43144 80197 65980 70422 52913 -3395 -10334 32447 81607 120721
17917A20721n1217o2628n781R76L0560K8083M7977M7613k7648K5325r571n8665
$$ 120721 69504 6876 1095 2071 32631 60714 108691 156304 128656 153981 144410 85745
17905H5745p255N3397k803l8717j1647j4744q0527p611O7947N9840n8798l0812
$$ 85745 78490 131887 129084 90367 78720 63976 -16551 -24162 43785 103625 44827 14015
17893A4015l1644l7688j045k6793j1083L3892K643K2675Q932L0260O5555p423
$$ 14015 -17629 -55317 -56362 -83155 -94238 -60346 -57703 -35028 -26096 4164 69719 62296
17881F2296p2594r233k8922r612K1559J0183N5077M7141l822j09214l6213j2368
$$ 62296 -10298 -19531 -48453 -58065 -36506 -26323 28754 75895 72073 -37141 -73354 -85722
17869h5722N2498L4484K310N893j7920K0879J8509P513m380l4405l5260M299l0169
$$ -85722 -33224 1260 3570 9463 -8457 12422 30931 38444 34064 -341 -35601 -31302 -61471
17856f1471K0340L4141J0532l3295N5263M4912j03761K194O6601r082k7339p671
$$ -61471 -41131 -6990 3542 -29753 25510 70422 -33339 -31145 35456 26374 -965 -8636
17844h636L3460K9463q2781K0221J7881R33k6673K9946J6913J7348J1152l4600
$$ -8636 24824 54287 -28494 -8273 9608 10541 -16132 13814 30727 48075 59227 24627
17832B4627l4364J2808K6729J1062K6608j176j4192n4860j8600m0089l3638L7235
$$ 24627 -9737 3071 29800 40862 67470 66294 52102 -2758 -21358 -61447 -95085 -57850
17820e7850P3518M7035r2l8245j7453j4344p695r101R0721o675l2953k6822J3147
$$ -57850 15668 62703 62611 24366 6913 -7431 -15126 -24227 66494 59819 26866 44 13191
17807A3191M3290l4766o2594o949Q854K6607L936k1936Q52R460M3588Q984l0238
$$ 13191 56481 21715 -40879 -47828 -38974 -12367 -8431 -30367 -29515 -20055 23533 32517 2279
17794B279o217R101P4408N2489m4997m0783k9302M8591m0545n0223l6582K3632
$$ 2279 -3938 5163 79571 132060 87063 46280 16978 65569 25024 -25199 -61781 -38149
17782c8149o1178j109J3460Q9618M420l6823K5192K914j3002k1814m7604k2718
$$ -38149 -99327 -100436 -86976 2642 7062 -29761 -4569 -1655 -14657 -36471 -84075 -106793
17770a06793L6046J9544O4955q093m1757n467J5819L1573Q4242N1610o356k9944
$$ -106793 -70747 -51203 13752 5659 -36098 -41565 -25746 5827 90069 141679 135323 105379
17758A05379k7748l2177R244J5422j3281n3162k0107N7599K3009j9581r43m2264
$$ 105379 77631 45454 54698 70120 56839 3677 -16430 41169 64178 44597 43654 1390
17746A390l7161j7811n050K1470N4571l2241k4793K2554J08591K4879m5510n3602
$$ 1390 -35771 -53582 -58632 -37162 17409 -14832 -39625 -17071 91520 116399 70889 17287
17734A7287K0626l1573m2664m7263p3835l4014O9253P8638N7487j4903J2146N277
$$ 17287 37913 6340 -36324 -83587 -157422 -191436 -122183 -43545 13942 -961 11185 16462
17722A6462n1787K8865m599k1487L2485J3326j0335k2511l6389L060L3034L3208
$$ 16462 -35325 -6460 -11059 -32546 -61 13265 2930 -19581 -55970 -52910 -19876 13332
17710A3332l1851l4098J2844m3998R2157L9037J1131l863k7587J2666N0835L0158
$$ 13332 -18519 -52617 -39773 -83771 8386 47423 58554 54691 27104 39770 90605 120763
17698A20763k360j5625j0739M264n3578n1699K0761k0586K9302P043l325R378
$$ 120763 118403 102778 92039 96303 42725 -8974 11787 -8799 20503 27546 24221 33599
17686C3599L8559l2505J0060N0667K3601l3680n3969o1939M5497Q864K9052q8855
$$ 33599 72158 39653 49713 100380 123981 90301 36332 -25607 19890 28754 57806 -31049
17674c1049o235N3182J0368j3179k5391m1582M9708N5085L9015P262K6751j2095
$$ -31049 -37284 15898 26266 13087 -12304 -53886 -4178 50907 89922 97184 123935 111840
17662A11840K3876j1867j1615L6405l478n312n4372m8361J8637r930j8465K6868
$$ 111840 135716 123849 112234 148639 145161 139849 85477 37116 55753 45823 27358 54226
17650E4226k3647K3872K0518l4088l7197k5844L4485O5949J5997O250K7145L1517
$$ 54226 30579 54451 74969 40881 3684 -22160 12325 78274 94271 100521 127666 159183
17638A59183L608k5209l1884K3932q73L0745K0075k6803O609j4072k8380J5380
$$ 159183 162791 137582 105698 129630 128757 159502 179577 152774 159383 145311 116931 132311
17626A32311J7220l2503J2939J308m268J9447P0926K9510r0039j5282J28924M9712
$$ 132311 149531 117028 129967 131275 127007 146454 217380 246890 156851 141569 270493 320205
17614C20205j5311m3626j9762O8960J44084N4611J09515J70055J60317J83321
$$ 320205 304894 261268 241506 310466 454550 509161 618676 788731 949048 1132369
17604A132369J69431J27595R7138n9709o9477J1953O469P4069J24052J57030L07914
$$ 1132369 1301800 1429395 1526533 1466824 1397347 1409300 1415769 1489838 1613890 1770920 2078834
17593B078834L90710L99307L42373L60341L05226K83976M88559P48958R62823
$$ 2078834 2469544 2868851 3211224 3571565 3876791 4160767 4649326 5398284 6361107
17584F361107J608616K446309L989504O616553J1230785J8560349K7665174L0107085
$$ 6361107 7969723 10416032 14405536 21022089 32252874 50813223 78478397 108585482
17576A08585482K3688355K0187375k55152k4464193k6057925k6810019k4385312
$$ 108585482 132273837 152461212 152206060 127741867 101683942 74873923 50488611
17569E0488611j5558891q929461n598827l768646k820442k153132j602661j107724
$$ 50488611 34929720 26000259 20401432 16632786 13812344 11659212 10056551 8948827
17561H948827q67588n93854m30275l81714k08447J7338M78340J363666K783547
$$ 8948827 8081239 7487385 7057110 6675396 6466949 6484287 6962627 8326293 11109840
17552A1109840M930593P856487R267000L44928p852350n380781l545593k105508
$$ 11109840 16040433 23896920 33163920 33508848 25656498 20275717 16730124 14624616
17544A4624616k34784J323828K169014L33729l069727k853267j108093K47520
$$ 14624616 14389832 15713660 17882674 18216403 15146676 12293409 11185316 11432836
17536A1432836O67505p04088j943852j491568p47714l57062k37248k0804L41056
$$ 11432836 12100341 11396253 9452401 7960833 7213119 6856057 6618809 6598005 6939061
17527F939061P20309J386332K203418L578018N926866R803427J6078819K4221790
$$ 6939061 7659370 9045702 11249120 14827138 20754004 30557431 46636250 70858040
17519G0858040K7001344K1043057J9125603K488505k0764894k2533503k3188550
$$ 70858040 97859384 118902441 138028044 140516549 119751655 97218152 74029602
17512G4029602k3497774j6741800r723663n864446l702019k585994k009522j543526
$$ 74029602 50531828 33790028 24066365 18201919 14499900 11913906 9904384 8360858
17504H360858j177015q44587o20984n85820n97496n09865m85116m61507l26800
$$ 8360858 7183843 6339256 5718272 5132452 4534956 4025091 3539975 3078468 2751668
17495B751668k36426j32677j07286k3156N6304J7220R177r8495j91943j40556
$$ 2751668 2515242 2382565 2275279 2252123 2308427 2325647 2334824 2236329 2044386 1903830
17485A903830k22575k95707k01890r2029k5404m4971j12428k3359j9111n5955
$$ 1903830 1681255 1385548 1183658 1091629 1066225 1021254 908826 885467 866356 810401
17475H10401j00696q6301K4733l7506j09789l51m658q1400k2457J2466J7561J8194
$$ 810401 709705 623404 648137 610631 500842 500491 495833 414433 391976 404442 422003 440197
17463D40197J3526L369J743j23839k4449N8887p49l0672j3139l542L2799k8320
$$ 440197 453723 457092 458835 334996 310547 369434 368685 338013 324874 321332 354131 325811
17451C25811K0162L6061M6627K2309l7825P034M8535J17950J79541J95142j3532
$$ 325811 345973 382034 428661 450970 413145 420179 468714 586664 766205 961347 947815
17440I47815l24281j86485m3433q551j4909k9913r0796m0729K7361j5578o6019
$$ 947815 623534 437049 393616 385065 370156 340243 249447 208718 236079 220501 154482
17429A54482M7549J8787J03810M4971L1928K5311J9058k4790l2526m4361m3244
$$ 154482 202031 220818 324628 369599 401527 426838 445896 421106 388580 344219 300975
17418C00975k1905L441L6932J1935p9973k9774l5094J5756p3162k6787L2244k5499
$$ 300975 279070 282511 319443 331378 251405 221631 186537 202293 129131 102344 134588 109089
17406A09089k0573K6443o2240p426N8725J4862K9304j4104K9015J6893N8378k6238
$$ 109089 88516 114959 52719 45293 104018 118880 148184 134080 163095 179988 238366 212128
17394B12128o5946l0437m232l0412l174M0150K428P407M5074m9878o9068K3788
$$ 212128 146182 115745 111513 81101 77927 118077 120505 127912 172986 123108 54040 77828
17382G7828n4263K806K6016M9987O3115M1116j8760n1072o934n2986m3046O7577
$$ 77828 23565 26371 52387 102374 165489 206605 187845 136773 129839 76853 33807 101384
17370A01384L0778K5044O230j2216P237L0796J5751m7569J7330l8224j9328K2794
$$ 101384 132162 157206 163436 151220 158457 189253 205004 157435 174765 136541 117213 140007
17358A40007o7153m9946n725K9159o614n7115L7941O5744M1454l3508m4055J3624
$$ 140007 72854 22908 17183 46342 39728 -17387 20554 86298 127752 94244 50189 63813
17346F3813m9862m4112j960O2826K8398k2627j1202n9171J1071M7693M2274O8483
$$ 63813 13951 -30161 -32121 30705 59103 36476 25274 -33897 -22826 24867 67141 135624
17334A35624k3278k0274J3518j286k3160l0702m1723m5546N3500N5786K5232j3401
$$ 135624 112346 92072 105590 104304 81144 50442 8719 -36827 16673 72459 97691 84290
17322H4290m745l9679l6709O765M2442O0789O3915n5416m516K3361o9370P900
$$ 84290 79545 39866 3157 9922 52364 113153 177068 121652 117136 140497 71127 79027
17310G9027M3612o5542k5900m7776N6113J04430k0579m8357K2925l7776k0599
$$ 79027 122639 57097 31197 -16579 39534 143964 123385 75028 97953 60177 39578
17299C9578j5390K2916P1092n029n4314J4438N4695l9909l8106k804J1594n450
$$ 39578 24188 47104 118196 113167 58853 73291 127986 88077 49971 47167 58761 53311
17287E3311k3255L6945l010k290r569j2995r687l050J9920P600r758P547m356
$$ 53311 30056 67001 63991 61701 52132 39137 29450 26400 46320 53920 44162 51709 47353
17274D7353L6869j837o5751k5257j6537Q274n036J8453J2827K1981J342K8411
$$ 47353 84222 82385 16634 -8623 -25160 -16886 -21922 -3469 9358 31339 32681 61092
17262F1092j0533L2664k5480L278O163q338k0694Q376r472J5469Q202N8583J8926
$$ 61092 50559 83223 57743 61021 67184 58846 38152 46528 37056 52525 60727 119310 138236
17249A38236j0304j3516m9069n8576r919L0228m4517r189L6170L2435P0197j8587
$$ 138236 127932 114416 65347 6771 -3148 27080 -17437 -26626 9544 41979 112176 93589
17237I3589p1273M65j0469n3118j0994N7391J9855j535k9870J3113p043J5192
$$ 93589 22316 22781 12312 -40806 -51800 5591 25446 23911 -5959 7154 111 15303
17225A5303l2995J9335M4339J7692k7956j2598l6140o9027M567K9999j8593j2775
$$ 15303 -17692 1643 45982 63674 35718 23120 -13020 -82047 -77480 -47481 -66074 -78849
17213g8849k145N7309M6072l2077k3358J0127j7755J4447J7550J9652N8606J3062
$$ -78849 -80994 -23685 22387 -9690 -33048 -22921 -40676 -26229 -8679 10973 69579 82641
17201H2641k1524k0716k9025n8661n4084M7269L9826K5838j7596k6080J823k7824
$$ 82641 61117 40401 11376 -47285 -101369 -54100 -14274 11564 -6032 -32112 -30289 -58113
17189e8113l146o930k9087N4315M3682M973L621m861m5903j4343K1902M2610P6362
$$ -58113 -61259 -68189 -97276 -42961 721 5694 9315 4454 -41449 -55792 -33890 8720 85082
17176H5082R396n052L5536M71n3512Q294k133n894p7162l782l9757n7973k4810
$$ 85082 94478 89426 124962 125433 71921 80215 78082 72188 -4974 -8756 -48513 -106486 -131296
17163a31296O8096Q3724J3445j6946n9099m6680l179O4151O1653K015l0433j05464
$$ -131296 -63200 20524 33969 17023 -42076 -88756 -91935 -27784 33869 35884 5451 -100013
17151a00013J4272J5511l6098O731M5713M0864K0271j7004N4527K7373j3982K060
$$ -100013 -85741 -70230 -106328 -99597 -53884 -13020 7251 -9753 44774 72147 58165 60225
17139F0225j1261O694j3417n7746p7713k7648j0051J1835M0293K1723J1479k0088
$$ 60225 48964 55658 42241 -15505 -93218 -120866 -130917 -119082 -78789 -57066 -45587 -65675
17127f5675k4706K219j2731j7004M2535Q3933k1817j8862K5415L7301m8237N0543
$$ -65675 -90381 -88162 -100893 -117897 -75362 8571 -13246 -32108 -6693 30608 -17629 32914
17115C2914J6454J1476J5946l90j2699j6938K8001l1061j1501J6164j0101L1301
$$ 32914 49368 60844 76790 76400 63701 46763 74764 43703 32202 48366 38265 69566
17103F9566L3216j5924n9510J8576k4561m9519m6417K2046R2439L2681k5953m6864
$$ 69566 102782 86858 27348 45924 21363 -28156 -74573 -52527 39912 72593 46640 -224
17091b24k8010J4171J138P843K6575r804o948K0284j4647P7699O1040m3442n161
$$ -224 -28234 -14063 -12925 -5082 21493 11689 4741 25025 10378 88077 149117 105675 100514
17078A00514J9467l7869k1834J5710o81k6826l1169K6184L8272J2364m5640k981
$$ 100514 119981 82112 60278 75988 75307 48481 17312 43496 81768 94132 48492 45511
17066D5511M226j0127j3053m9242l9494J9036l5013j2162l6779m6450K0987M4478
$$ 45511 49737 39610 26557 -22685 -62179 -43143 -78156 -90318 -127097 -173547 -152560 -108082
17054a08082K8543P6M7176M9686k4914k891r360P2595J56878J84981J59135O8633
$$ -108082 -79539 -79463 -32287 17399 -7515 -10406 -19766 52829 209707 394688 553823 622456
17042F22456O0965L4565j8955j10138j01042r4361r9457r2596m9850o6327p6931
$$ 622456 683421 717986 699031 588893 487851 393490 294033 201437 151587 85260 8329
17031H329P099L013l8689J2622O5652K668L6845L2166L07R680K2728p8617k0265
$$ 8329 15428 18441 -20248 -7626 58026 60694 97539 129705 130012 139692 162420 83803 63538
17018F3538M4925k5726o213k744R050k1985l5236n2567K1499K7385K8429K8965
$$ 63538 108463 82737 76524 73780 82830 60845 25609 -26958 -5459 21926 50355 79320
17006G9320j7883j6336K5902K5632J7961J3058R809j256m7258k0816L5183p121
$$ 79320 61437 45101 71003 96635 114596 127654 137463 136207 88949 68133 103316 96195
16994I6195L0354k7667q4416j1649r089L0727J24668J20255J43653J24715Q4873
$$ 96195 126549 98882 14466 2817 -6272 24455 149123 269378 413031 537746 622619
16983F22619K9184o6704j00999j13780j19751q1999k9568j7431k5288N470l2686
$$ 622619 651803 585099 484100 370320 250569 168570 139002 121571 96283 101753 69067
16972F9067q1111J4440J1196J6140J7777l7376L619k4342n218j0615k7991K4138
$$ 69067 -12044 2396 13592 29732 47509 10133 13752 -10590 -15808 -26423 -54414 -30276
16960c0276j7103k0667N9866N7083O637j1994j7033j4344L0003M217J4728Q475
$$ -30276 -47379 -68046 -8180 48903 55540 43546 26513 12169 42172 46389 61117 69592
16948F9592m5227K3949o190j3763J2608M8934R766j3202q5790q1778R606L5922
$$ 69592 24365 48314 42124 28361 40969 89903 99669 86467 677 -81101 -71495 -35573
16936c5573K800k528N8273j2387n6835m8447M0701P6501k4176m1665K436K9084
$$ -35573 -32773 -35301 22972 10585 -46250 -94697 -53996 22505 -1671 -43336 -40900 -11816
16924a1816k618j5440Q683J338K4306J4055N0154L2418k3705n8442j0541N1455
$$ -11816 -14434 -29874 -21191 -19853 4453 18508 68662 101080 77375 18933 8392 59847
16912E9847r824j400J250m800n6373o614P6396L3687j9287k7617l6241k4526L8526
$$ 59847 50023 48623 49873 45073 -11300 -17914 58482 92169 72882 45265 9024 -15502 23024
16899B3024L4625j2797K6758J2524k554l5418p0551j2109K5622J7337J7789K5635
$$ 23024 57649 44852 71610 84134 81580 46162 -24389 -36498 -10876 6461 24250 49885
16887D9885m0387m6998r323l470K6697j4409J7912L4181J9183l948j242l8700
$$ 49885 9498 -37500 -46823 -50293 -23596 -38005 -20093 14088 33271 29323 28081 -10619
16875a0619k9989J9504n1575n6010M0612M8083r604m3387K3537J9478M940K0315
$$ -10619 -40608 -21104 -72679 -128689 -88077 -39994 -49598 -92985 -69448 -49970 -45030 -24715
16863b4715L8901m8923P657j8097L1679P060q0492q0753N5217J6877L7866R2759
$$ -24715 14186 -34737 -27080 -45177 -13498 -6438 -86930 -167683 -112466 -95589 -57723 35036
16851C5036J5158k0216j958L4771K9446R436l455m68j2346o3765n3975k7247L2623
$$ 35036 50194 29978 28020 62791 92237 101673 98218 97750 85404 21639 -32336 -59583 -26960
16838b6960O2405J228q9156n929J0219M7382n149k2485M5757L982j3834o343P5306
$$ -26960 35445 36673 -52483 -58412 -48193 -811 -5960 -28445 17312 21294 7460 1117 76423
16825G6423K4202n7228n2247N4313K5754Q232r866l31K7850l6058o4185n3204
$$ 76423 100625 43397 -8850 45463 71217 79449 69583 69252 97102 61044 -3141 -56345
16813e6345j8109n684m1869j2369K6398L5510o107k6349k2985R8378M0875m0043
$$ -56345 -74454 -80138 -122007 -134376 -107978 -72468 -78575 -104924 -127909 -29531 11344 -28699
16801b8699L0572P78l318m2390n3431Q7299O7062k3272n9438l1138M8317J7163
$$ -28699 1873 2651 -667 -43057 -96488 -9189 57873 34601 -24837 -55975 -7658 9505
16789I505M7590N9076L5101k0220n1501l9671k6771K3795p573k3384M8798j2491
$$ 9505 57095 116171 151272 131052 79551 39880 13109 36904 29331 5947 54745 42254
16777D2254m5962l0330k2032J6354L0770k3730o045m3165n286O1257P3791O9842
$$ 42254 -3708 -34038 -56070 -39716 -8946 -32676 -38721 -81886 -87172 -25915 47876 117718
16765A17718o9290n4776l491K5268L792k3573l6550J2958J2122m7583j4609r160
$$ 117718 48428 -6348 -9839 15429 19221 -4352 -40902 -27944 -15822 -63405 -78014 -87174
16753h7174j3581J04542K8142k3412j5163j4717R506N8034O8146n035m9228l1016
$$ -87174 -100755 3787 31929 8517 -6646 -21363 -11857 46177 114323 109288 60060 29044
16741B9044o1205m266N648P4179K7576j5264k7455j1884J6355L1081j8059l1135
$$ 29044 -32161 -36427 -30779 43400 70976 55712 28257 16373 32728 63809 45750 14615
16729A4615k7924j8984j1447j6958K702J11813l6841n2683m151P647K9706j7733
$$ 14615 -13309 -32293 -43740 -60698 -57996 53817 16976 -35707 -39858 -32211 -2505 -20238
16717b0238l1367J9661o74l1534q060o281K2907L3K9318J7564N489j2003j5921
$$ -20238 -51605 -31944 -32618 -64152 -72212 -78493 -55586 -55553 -26235 -8671 -3182 -15185 -31106
16704c1106j2732K6970n8877k5588N5947P9309L0241r656p4254l657P4124J6308
$$ -31106 -43838 -16868 -75745 -101333 -45386 33923 64164 54508 -19746 -23403 50721 67029
16692F7029P133l5084j4330j8188J4710k6752m1148l1735k4979p1585j0701O9423
$$ 67029 74162 39078 24748 6560 21270 -5482 -46630 -78365 -103344 -174929 -185630 -116207
16680a16207N6672L8681M3833j0570m6131O7K1530L368K9213j7484L7859k8290
$$ -116207 -59535 -20854 22979 12409 -33722 -33655 -12125 -8757 20456 2972 40831 12541
16668A2541k9591k3192J9087L4832J6913l6686j9422k2027K757Q7272K6294l4
$$ 12541 -17050 -40242 -21155 13677 30590 -6096 -25518 -47545 -44788 42484 68778 68744
16656F8744K446j2252j1176O1955J3587n3794m0926r109n9759m82K7264j921o845
$$ 68744 71190 58938 47762 109717 123304 69510 28584 19475 -40284 -40766 -13502 -15423 -22268
16643b2268m9029O3701L8747K0875m0766o6191K241R095j8586L2512j9243l6714
$$ -22268 -71297 -7596 31151 52026 11260 -54931 -52690 -43595 -62181 -29669 -48912 -85626
16631h5626M0566J4844J8037N706M1617J0109O558j1024m6947k7803j3091M9858
$$ -85626 -45060 -30216 -12179 -6473 35144 45253 51811 40787 -6160 -33963 -47054 2804
16619B804j4879R958n326L6556O68k8545k2648l9704L5051P3762j6520K740j3805
$$ 2804 -12075 -2117 -7443 29113 29781 1236 -21412 -61116 -26065 47697 31177 33917 20112
16606B0112J1577j7557j5099J1418K171L7217p353o9991l6075K2299k0042M2217
$$ 20112 31689 14132 -967 10451 12622 49839 42486 -27505 -63580 -41281 -61323 -19106
16594a9106M5245j9881j7933M4990m4683K1388O9719k2316k2716l018l2499p3015
$$ -19106 26139 6258 -11675 33315 -11368 10020 79739 57423 34707 31689 -810 -73825
16582g3825M5029O4340M4056k1599k3869q189L7951r614o1201j8117K8593j9054
$$ -73825 -28796 35544 79600 58001 34132 25943 63894 54280 -6921 -25038 3555 -15499
16570a5499l0004j4229M7455L8911k855l5203k3241M2099K9267K2118m0903l9092
$$ -15499 -45503 -59732 -12277 26634 23779 -11424 -34665 7434 36701 58819 17916 -21176
16558b1176k2813P240J8207M6693J0236K8057j9764R079L4528m6050m9289K3953
$$ -21176 -43989 -36749 -18542 28151 38387 66444 46680 55759 90287 44237 -5052 18901
16546A8901M0121k6986j2833j20o614k4628J2336J1105j270k6293M686K6494L6952
$$ 18901 59022 32036 19203 19083 12469 -12159 177 11282 10012 -16281 -11595 14899 51851
16533E1851K5021O883k3932k5288m1996L5695M2129q4800m5807J3711N614j059
$$ 51851 76872 83755 59823 34535 -7461 28234 70363 -14437 -60244 -46533 -40919 -41978
16521d1978J4572Q914k6784l8570M6619P478k1026K2538J3186j6813J2150J6098
$$ -41978 -27406 -18492 -45276 -83846 -37227 -29749 -50775 -28237 -15051 -31864 -19714 -3616
16509c616q722k6570r549r421R8243J8365j6200j9283k4367J2818O7476p578m2593
$$ -3616 -12338 -38908 -48457 -57878 40365 58730 42530 23247 -1120 11698 79174 71596 29003
16496B9003l0273k3616j3751L6995j7388k4218o2159m361R6191J9011j6978N906
$$ 29003 -1270 -24886 -38637 -1642 -19030 -43248 -105407 -109768 -13577 5434 -11544 -5638
16484e638k4766k0364l3670j6871j298O0932M1041K2724K9459m3166l4228N8721
$$ -5638 -30404 -50768 -84438 -101309 -102607 -41675 -634 22090 51549 8383 -25845 32876
16472C2876J8184M62J3363J101k1115k342k3728l461k4869J5732L4800O808J6931
$$ 32876 51060 51522 64885 65986 44871 42529 18801 15340 -9529 6203 41003 47811 64742
16459F4742O1184n7743o7373m7966J562N4698n0744n1145J6056O5729M9633N3205
$$ 64742 125926 68183 810 -47156 -45594 9104 -41640 -92785 -76729 -11000 38633 91838
16447I1838l5660j10393k0735M4999O3368J3407J2667M0219l3751n1988m7163
$$ 91838 56178 -54215 -74950 -29951 33417 46824 59491 99710 65959 13971 -33192
16436c3192r44j2677j1356m733M7750N5222l0096m2169J3454j932K4396L729n2713
$$ -33192 -34136 -46813 -58169 -62902 -15152 40070 9974 -32195 -18741 -20673 3723 7452 -45261
16423d5261J8013k2061k6420N8972J4136J7097K00N515l5372j3876L1284N697
$$ -45261 -27248 -49309 -75729 -16757 -2621 14476 14676 20191 -15181 -29057 2227 7924
16411G924n6241p87M564J3911K0850K2317N0218L6910l5724j5060l3809m8568
$$ 7924 -48317 -49104 -44540 -30629 -9779 12538 62756 99666 63942 48882 15073 -33495
16399c3495M190l0756J5889P821M8556K6113n8737q583O4064J7163p675j1054
$$ -33495 -29305 -60061 -44172 -36351 12205 38318 -20419 -29002 35062 52225 44550 33496
16387C3496l322k6713j6045L9370L6435j6402J3423k9909j5930J2206Q905P169
$$ 33496 30174 3461 -12584 26786 63221 46819 60242 30333 14403 26609 35514 42683
16375D2683j0603m1793q492L9633J8563o9621n2465o700P5926r84l7109N8930
$$ 42683 32080 -9713 -18205 21428 39991 -29630 -82095 -88795 -12869 -13853 -50962 7968
16363G968P0123k3933n9819K57J1522K2944L6438K8056j4605L1931J3250n998
$$ 7968 78091 54158 -5661 -5404 6118 29062 65500 93556 78951 110882 124132 118134
16351A18134j137m3773m2325n217L979K282j6023L9915L399k1726k244l3935j7631
$$ 118134 116997 73224 30899 25682 29661 31943 15920 55835 59234 37508 35264 1329 -16302
16338a6302K0558k8251n1161l5306k9146K9383N2495j7630k8139k6825k280P1727
$$ -16302 4256 -23995 -75156 -110462 -139608 -110225 -57730 -75360 -103499 -130324 -132604 -60877
16326f0877M4618o323k0890L7767p0n5965n5104K6798R1306K983k2849K5804L4625
$$ -60877 -16259 -22582 -43472 -5705 -5775 -61740 -116844 -90046 1260 4243 -18606 7198 41823
16313D1823m91M3281m260l2713k8469j7110j208L2685J5630j5063p6399o500O6861
$$ 41823 41332 84613 80353 47640 19171 2061 853 33538 49168 34105 -42294 -48794 18067
16300A8067K4276K9339j4096J1601k5681r177j614K4303J3086K1429n9933K1121
$$ 18067 42343 71682 57586 69187 43506 34329 32715 57018 70104 91533 31600 52721
16288E2721n5767M220K1237M3386j145p4025k0811k0087O7225M8417K0983n2628
$$ 52721 -3046 1174 22411 65797 64652 -9373 -30184 -50271 16954 65371 86354 33726
16276C3726j04335J7389J0213j3516k2118m3057m199K9645K5723J9403l372N10
$$ 33726 -70609 -53220 -43007 -56523 -78641 -121698 -125897 -96252 -70529 -51126 -54498 -53988
16264e3988N5781M4752n0126n3626M8293L9732k1596n7877j803L2162l2096o5036
$$ -53988 1793 46545 -3581 -57207 -8914 30818 9222 -48655 -50458 -18296 -50392 -115428
16252a15428J9259M4289K9725J0911k7303j6523M5383k3265L739Q697K8775O6686
$$ -115428 -96169 -51880 -22155 -11244 -38547 -55070 -9687 -32952 -29213 -20516 8259 74945
16240G4945O938p2046j1165o813P9097k2598p2385m0872M6460L8175j9538p0207
$$ 74945 81883 9837 -1328 -8141 70956 48358 -24027 -64899 -18439 19736 198 -70009
16228g0009p8064N9370M8875L2240J8977l6472m053K4931k9498P591j112j2062
$$ -70009 -148073 -88703 -39828 -7588 11389 -25083 -29136 -4205 -33703 -26112 -27224 -39286
16216c9286L320m351J3952K6406k9747l0997K9891L259J0413R665K5144J6115
$$ -39286 -35966 -40317 -26365 41 -29706 -60703 -30812 -27553 -17140 -7475 17669 33784
16204C3784l6005p445n0148K2220Q9521M9423n0302p265j8423L153n314O641L7482
$$ 33784 -2221 -9666 -59814 -37594 51927 101350 51048 43783 25360 28513 23199 29840 67322
16191F7322l0494N0262m0413r5006j2507K0677M6101n3240l031L1142N9330J1887
$$ 67322 36828 87090 46677 -48329 -60836 -40159 5942 -47298 -50329 -19187 40143 52030
16179E2030o5500M6847N751r4078r90L1446j9506l9529j5579K63O6478L6061q304
$$ 52030 -13470 33377 39128 -54950 -55940 -24494 -44000 -83529 -99108 -98845 -32367 3694 -4610
16166d610q2581R790L2390j8474J854j8430n2978J6379N9902m8716Q6350j3576
$$ -4610 -87191 -77401 -45011 -63485 -61631 -80061 -133039 -116660 -56758 -105474 -19124 -32700
16154c2700k3577K0394L2816Q9631K7191q9641J3506L0455o6093m2693J9303J3233
$$ -32700 -56277 -35883 -3067 86564 113755 24114 37620 68075 1982 -40711 -21408 -8175
16142h175j852l0277q4407J5003J1600J499J7069j774K0636O468L4224j2164K9407
$$ -8175 -10027 -40304 -124711 -109708 -98108 -96609 -79540 -81314 -60678 -54210 -19986 -32150 -2743
16129b743L6110k6793o8021J3642N2434j3795l3918j6268p7051m2454r02M9882
$$ -2743 33367 6574 -61447 -47805 4629 -9166 -43084 -59352 -136403 -178857 -179759 -129877
16117a29877P2092M3186J7283l5763p1502K6862P521L995K249L4639K1292p440
$$ -129877 -57785 -14599 2684 -33079 -104581 -77719 -70198 -66203 -63954 -29315 -8023 -15463
16105a5463K091n7284K0723o6l5014k1946L1911L1975Q744k3998K6186O8172N435
$$ -15463 -13372 -70656 -49933 -49999 -85013 -106959 -75048 -43073 -34329 -58327 -32141 36031 41466
16092D1466J609M2299l1416N695P173l1718m9621m8172J6668M1028O941k7009
$$ 41466 43075 85374 53958 59653 66826 35108 -14513 -62685 -46017 -4989 1952 -25057
16080b5057m2469o1322k9398n550J6486M4152K3578M80k1612L1501k1284n2408
$$ -25057 -67526 -128848 -158246 -163796 -147310 -103158 -79580 -79100 -100712 -69211 -90495 -142903
16068a42903O596O6461P1045o121k6646j4888k2868J3404J2778M7984J8984o730
$$ -142903 -136307 -69846 1199 -4922 -31568 -46456 -69324 -55920 -43142 4842 23826 17096
16056A7096j3412K4576R416p8406l6892n9842M6097K3188J546J5422J5045j9083
$$ 17096 3684 28260 37676 -40730 -77622 -137464 -91367 -68179 -66633 -51211 -36166 -55249
16044e5249K1879q933m3483L4855M1967L6349o0231p6877r539K0138M3174O3934
$$ -55249 -33370 -42303 -85786 -50931 -8964 27385 -32846 -109723 -119262 -99124 -55950 7984
16032G984k9169k6302O0401n536K2893j8958K8312k9426j07696K3245K5420J5243
$$ 7984 -21185 -47487 12914 7378 30271 11313 39625 10199 -97497 -74252 -48832 -33589
16020c3589O9983k343k6052R487J7619j4056p863J5030l33n782q0915N491N7571
$$ -33589 36394 34051 7999 17486 35105 21049 13186 28216 27883 22101 -58814 -53323 4248
16007D248M7383k5657l900J2825O5875j8705l0345k5681l7309l6807p415L1846
$$ 4248 51631 25974 22074 34899 100774 82069 51724 26043 -11266 -48073 -55488 -23642
15995b3642l757j5517n1406k7993M9269k8619J9207K1219O5879P0217Q7563j794
$$ -23642 -27399 -42916 -94322 -122315 -73046 -101665 -82458 -61239 4640 74857 162420 160626
15983A60626Q443m2263j7513l1271l6413n2235J5343J2820M9271l5987l2615j0624
$$ 160626 169069 126806 109293 78022 41609 -10626 4717 17537 66808 30821 -1794 -12418
15971a2418M6860k302n7842J6414L8901k5400m4423l099L1223M4377O979m9743
$$ -12418 34442 32140 -25702 -9288 29613 4213 -40210 -43309 -12086 32291 39270 -10473
15959a0473R695K8053J3351m8961n718L4970j6028J5640n767P693O650j2815J0667
$$ -10473 -778 27275 40626 -8335 -14053 20917 4889 20529 14762 22455 29105 16290 26957
15946B6957o4644m496N3595N6747Q3969k1885n7548m6382K2964K1835k0707k4805
$$ 26957 -37687 -42183 11412 68159 152128 130243 72695 26313 49277 71112 50405 25600
15934B5600m8385k9610J6170L7374J5436m9630o246O6146M5893k3098l8578r825
$$ 25600 -22785 -52395 -36225 1149 16585 -33045 -39291 26855 72748 49650 11072 1247
15922A247l128J4408l8503J0080K7370k6313n2451K6416M2365K0110j6849Q876
$$ 1247 -1881 12527 -25976 -15896 11474 -14839 -67290 -40874 1491 21601 4752 13628
15910A3628M5364l6669K1976J4028k7990k7583l5141j2133k5157L3434r609j4962
$$ 13628 58992 22323 44299 58327 30337 2754 -32387 -44520 -69677 -36243 -45852 -60814
15898f0814k1338R642O0155L8248j4038k0372K2961P9528l5725m1601J708m3535
$$ -60814 -82152 -72510 -12355 25893 11855 -8517 14444 93972 58247 16646 18354 -25181
15886b5181k7286k3213N8685O3239M3475k9859q7033N7009J5811m1149k7457r656
$$ -25181 -52467 -75680 -16995 46244 89719 59860 -27173 29836 45647 4498 -22959 -32615
15874c2615K7559O3435O2954n3298k843j8176M93J60k2751l9949L6552l8367j05
$$ -32615 -5056 58379 121333 68035 65192 47016 47509 47669 24918 -15031 21521 -16846 -16951
15861a6951J5991j0748j8822j9472k8898K6216J1917R216J0403q596L1521N5957
$$ -16951 -960 -11708 -30530 -50002 -78900 -52684 -40767 -31551 -21148 -29744 1777 57734
15849E7734L3160N102o6713p7346n5139M447L7793O271O4404K8470m290m2259
$$ 57734 90894 95996 29283 -48063 -103202 -98755 -60962 -54691 9713 38183 33893 -8366
15837h366j4016j3580k035J5882J0087m843P697N7732O6225m9568m3552m9244
$$ -8366 -22382 -35962 -37997 -22115 -12028 -16871 -9174 48558 114783 65215 21663 -27581
15825b7581K1213K0182o4563M4246N9302l547k0548o362K340J5196j3607K4997
$$ -27581 -6368 13814 -50749 -6503 52799 49252 28704 22342 24682 39878 26271 51268
15813E1268l1848p262J2466O723R257o4323J3347M2335K3554q816l5806K2309
$$ 51268 19420 12158 24624 31347 40604 -23719 -10372 31963 55517 46701 10895 33204
15801C3204k3103o3500J829P7904O1038n9967m2045R730k6859j9976l8285J442
$$ 33204 10101 -53399 -51570 26334 87372 27405 -14640 -4910 -31769 -51745 -90030 -88588
15789h8588L6696J0457O231L5494j3147N6159J8912J195o3593n8025Q198o714
$$ -88588 -51892 -41435 -35204 290 -12857 43302 62214 63409 -184 -58209 -50011 -56725
15777e6725M413L8874L4804j2872p912n143m1746J0956N3488q092l3518P250m1680
$$ -56725 -52312 -13438 21366 8494 582 -4561 -46307 -35351 18137 10045 -23473 -16223 -57903
15764e7903l349K9353N845M442j5076L7565Q016l7267l8924J5924j3257j2860
$$ -57903 -61252 -31899 -26054 -21612 -36688 877 8893 -28374 -67298 -51374 -64631 -77491
15752g7491m498L1157N0780O1763L5271k2638o0957K4079k5812P69J7265Q747
$$ -77491 -81989 -50832 -52 61711 96982 74344 13387 37466 11654 12423 29688 38435
15740C8435n3523o2620q6350J6286P4984K0804L4977L349K9216n74n1486j5670
$$ 38435 -15088 -77708 -164058 -147772 -72788 -51984 -17007 -13658 15558 14984 -36502 -52172
15728e2172q023l2493L9596J2027p944o857K341q321K6954l460M7897L6717j7110
$$ -52172 -60195 -92688 -53092 -41065 -49009 -55866 -53525 -61846 -34892 -38352 9545 46262 29152
15715B9152l543K0441o878o6683k0403M7637j1504k4717J0547O3436o437l2607
$$ 29152 25609 46050 39172 -27511 -47914 -277 -11781 -36498 -25951 37485 31048 -1559
15703a559M2830m257p1208l2710M9903M4456q308L3788o37Q0135l6086j15082
$$ -1559 41271 37014 -34194 -66904 -17001 27455 19147 52935 52298 132433 96347 -18735
15691a8735n9673P1559R9384l1766l0050r396N778J1209l3605L050r823l5714
$$ -18735 -78408 -6849 92535 60769 30719 21323 27101 38310 4705 7755 -2068 -37782
15679c7782m629K6666P0940N7380J6802l6344j0822n117P054r8933Q15M1972L581
$$ -37782 -42411 -15745 55195 112575 129377 93033 82211 77094 84148 -14785 -13970 28002 31583
15666C1583J4140k1496m3930K7493n636j17894n2692P7768Q3572J7432q686k6407
$$ 31583 45723 24227 -19703 7790 2154 -115740 -168432 -90664 -7092 10340 1654 -24753
15654b4753k267k2043K6380K6241M9249N0491L4838n3778j9117n5521n2720M9534
$$ -24753 -27020 -49063 -22683 3558 52807 103298 138136 84358 65241 9720 -43000 6534
15642F534r838k8740J2349L1300j982k4755m1596k566K9759K4405K4537J8769
$$ 6534 -3304 -32044 -19695 11605 9623 -15132 -56728 -59294 -29535 -5130 19407 38176
15630C8176N220k728n8285n931N8159k1169m5542q892J3056n1969m2110R93N8357
$$ 38176 43396 40668 -17617 -23548 34611 13442 -32100 -40992 -27936 -79905 -122015 -121022 -62665
15617f2665O0964J1136m0256n5073L3629M305q524o3370j4495Q3129M2178k8993
$$ -62665 -1701 9435 -30821 -85894 -52265 -47960 -56484 -119854 -134349 -51220 -9042 -38035
15605c8035K3757J363L1155J02444o2164o7336o6872M2372P6318L411j8402l61
$$ -38035 -14278 -12915 18240 120684 58520 -8816 -75688 -33316 43002 46413 28011 27650
15593B7650Q940n5084j3603M1512N366m0441j8786J5194q943p0339k0421J3403
$$ 27650 36590 -18494 -32097 9415 14781 -25660 -44446 -29252 -38195 -108534 -128955 -115552
15581a15552m2361K163J3771K6654K408K6513J2734M8416J1865K2404l891j4926
$$ -115552 -157913 -155750 -141979 -115325 -112917 -86404 -73670 -25254 -13389 9015 5124 -9802
15569i802k2270K4695k7110M4461l3719k2295P346K2724j585l731M8506J0830
$$ -9802 -32072 -7377 -34487 9974 -23745 -46040 -38694 -15970 -17555 -21286 27220 38050
15557C8050k4563p9418l6294J8393L0785k1600P137O9664l738m7179N537j766
$$ 38050 13487 -65931 -102225 -83832 -53047 -74647 -67510 2154 -1584 -48763 -43226 -44992
15545d4992o948M5438j176l7733j0688M8724j030m1502j3986P3739O6213o2947
$$ -44992 -51940 -6502 -7678 -45411 -56099 -7375 -8405 -49907 -63893 9846 76059 13112
15533A3112q9209l5609P5181k9899P086J3008o162M5756L1010K2073j2194Q291
$$ 13112 -76097 -111706 -36525 -66424 -59338 -46330 -52492 -6736 24274 46347 34153 42444
15521D2444k491j086M722l8753p280k010j667M2629P6784J8760l3740n2144N240
$$ 42444 39953 38867 43589 4836 -2444 -4454 -6121 36508 113292 132052 98312 46168 51408
15508E1408n5260l1943q2254k7974M589O321m984N9435L4337r226o308L9782l9904
$$ 51408 -3852 -35795 -118049 -146023 -141434 -135113 -140097 -80662 -46325 -55551 -61859 -22077 -61981
15495f1981j5452M9894N040j5634N0455J6915J4023P525J0656Q546k4721p4676
$$ -61981 -77433 -27539 -22499 -38133 12322 29237 43260 50785 61441 69987 45266 -29410
15483b9410k4215j5335K0923J837l634L3898R0924M6243J5160m9041j2623J1089
$$ -29410 -53625 -68960 -48037 -46200 -49834 -15936 74988 121231 136391 87350 74727 85816
15471H5816j7159m9367j6482k5542K6039j3758L5291K3019J2543o638J7660j9377
$$ 85816 68657 19290 2808 -22734 3305 -10453 24838 47857 60400 53762 71422 52045
15459E2045j6534Q203L0518J9463q549l7375k7580o0507j0178o474R486M1974
$$ 52045 35511 43714 74232 93695 85146 47771 20191 -40316 -50494 -56968 -47482 -5508
15447e508P6119j7577r2675m9891k00P4306K2494k9903J7765K8278J5586k6654
$$ -5508 70611 53034 -39641 -89532 -89732 -15426 7068 -22835 -5070 23208 38794 12140
15435A2140o6143l8148M711L1222k433j3335L8066Q3444K5866l837k7304O058
$$ 12140 -54003 -92151 -87440 -56218 -58651 -71986 -33920 49524 75390 71553 44249 50307
15423E0307J5093j964m577p192k9667M8415j1406l234jl9953k9000Q235K025q416
$$ 50307 65400 63436 58859 51667 22000 70415 59009 55775 55774 15821 -13179 -4944 -2919 -11335
15409a1335o5559J1869N9844k0780j6797M0674L1503j3129j2184j1248L9790L9627
$$ -11335 -76894 -65025 -5181 -25961 -42758 -2084 29419 16290 4106 -7142 32648 72275
15397G2275k8301K183r962m0384o5601J5559N7422K4840N079n4905p4584l380
$$ 72275 43974 46157 36195 -4189 -69790 -54231 3191 28031 33110 -21795 -96379 -99759
15385i9759R96N9813K4075Q269R675l4468r449l2282n1122N8224J1261k9956K7597
$$ -99759 -98763 -38950 -14875 -6606 3069 -31399 -40848 -73130 -124252 -66028 -54767 -84723 -57126
15372e7126M8152M161j8709N1652m352m4421N654K4130J0682Q380Q475m080k2998
$$ -57126 -8974 -4813 -23522 28130 23778 -20643 -14989 9141 19823 28203 36678 32598 9600
15359I600L3179k0887l3410J0123j8130P241O5335M4401j5791M2706M1859m9769
$$ 9600 42779 21892 -11518 -1395 -19525 -12284 53051 97452 81661 124367 166226 116457
15347A16457n6554n2008l6392j8780R469k0997R552N6976L4929l5357m5149l3951
$$ 116457 59903 7895 -28497 -47277 -37808 -58805 -49253 7723 42652 7295 -37854 -71805
15335g1805j8517K8473L4019M7333k0834n1514J8284P4104J6942o5328n544k002
$$ -71805 -90322 -61849 -27830 19503 -1331 -52845 -34561 39543 56485 -8843 -14387 -16389
15323a6389K0197j9738m7647j8696J6553O8478k1994J1771P692j1127l6171P4761
$$ -16389 3808 -15930 -63577 -82273 -65720 2758 -19236 -7465 227 -10900 -47071 27690
15311B7690N4260M947p9971m3234N749M6234n8022l4675L5805j5744k8311N7436
$$ 27690 81950 86897 6926 -36308 -30559 15675 -42347 -77022 -41217 -56961 -85272 -27836
15299b7836K041j197K3265j0036Q210n030l6134l2657M725M783M5319J0624n1237
$$ -27836 -25795 -26992 -3727 -13763 -5553 -10583 -46717 -79374 -74649 -69866 -24547 -13923 -65160
15286f5160J7889l2266L0797P8583J5726O832k4994J0198p119k9448J8074m0330
$$ -65160 -47271 -79537 -48740 29843 45569 52401 27407 37605 30486 1038 19112 -21218
15274b1218k7582K2080K3325P375j5843k5445J9553l006j300J1675R090K7551
$$ -21218 -48800 -26720 -3395 3980 -11863 -37308 -17755 -20761 -22061 -10386 -1296 26255
15262B6255L2709p682l6856M9864j4870k8605K4822n307p0077j1951L0317L8056
$$ 26255 58964 51282 14426 64290 49420 20815 45637 40330 -29747 -41698 -11381 26675
15250B6675J0022m4095p205k341m40M8985J534j7225j4160K033K532L4714j6273
$$ 26675 36697 -7398 -14603 -16944 -17384 31601 33135 15910 1750 3783 6315 41029 24756
15237B4756q5294M5271O0176K4512l8816n899l1426m8509n7779M165M9752N920
$$ 24756 -60538 -15267 44909 69421 30605 24706 -6720 -55229 -113008 -108843 -59091 -53171
15225e3171K2200R559j1550K410J0576m5548j9043K6457M8611k9157n673O205
$$ -53171 -30971 -21412 -32962 -30552 -19976 -65524 -84567 -58110 -9499 -38656 -44329 -38124
15213c8124q391K1456L7000k1314P2959N3845n0271j9177k7910m6623j9844L5779
$$ -38124 -46515 -25059 11941 -9373 63586 117431 67160 47983 20073 -26550 -46394 -10615
15201a0615J8212k0328k4966L8620L8795j9740n4861O1028K2439p4446P554K9468
$$ -10615 7597 -12731 -37697 923 39718 19978 -34883 26145 48584 -25862 -18308 11160
15189A1160J2232O6298M4211q0538m5804J0186J2934K5837R457l0575M8366r147
$$ 11160 23392 89690 133901 53363 7559 17745 30679 56516 65973 35398 83764 74617
15177G4617k4366k798K053l0735o7397o721K6409L1118J455P002k3205m4793j302
$$ 74617 50251 47453 49506 18771 -48626 -55347 -28938 2180 3635 10637 -12568 -57361 -58663
15164e8663O9685K508J9756K0131o7564j1937L0905j0535J262o3951K396M048
$$ -58663 11022 13530 33286 53417 -14147 -26084 4821 -5714 -4452 -68403 -66007 -61959
15152f1959J7592K5066m1902k0254n605K2275M4080j3797o160N158m8032n3550
$$ -61959 -44367 -19301 -61203 -81457 -87062 -64787 -20707 -34504 -40664 -35506 -83538 -137088
15140a37088L0680N2600n0315m105M1789j6635K1216k0909J0239M2567O4010p881
$$ -137088 -106408 -53808 -104123 -108228 -66439 -83074 -61858 -82767 -72528 -29961 34049 26168
15128B6168o1713j8991k0087p069N9331J7201j9259j0777Q302m480n4484m8035
$$ 26168 -35545 -54536 -74623 -81692 -22361 -5160 -24419 -35196 -26894 -31374 -85858 -133893
15116a33893j6869P8879M9607Q96Q823n1874m1842k4795P122N2759O3305m669
$$ -133893 -150762 -71883 -22276 -21380 -12557 -64431 -106273 -131068 -123946 -71187 -7882 -12551
15104a2551r247K2825q122K205L5641J7148R078l1604j5n031k8758l0588p317
$$ -12551 -21798 1027 -7095 -4890 30751 47899 56977 25373 25358 20327 -8431 -39019 -46336
15091d6336N9982L8056k8463K8222j0602k4621m6377j4295N0720k250Q393O442
$$ -46336 13646 51702 23239 51461 40859 16238 -30139 -44434 6286 4036 12429 18871
15079A8871q6479n1654K5039L0246M3441J9908k1170R294J8078L274r122q324
$$ 18871 -67608 -119262 -94223 -63977 -20536 -628 -21798 -12504 5574 8848 -274 -8598
15067h598N7859m4499l3421L0695M538m3212J1917r723j8288l0110N786l623N2714
$$ -8598 49261 4762 -28659 2036 6574 -36638 -24721 -34444 -52732 -82842 -77056 -80679 -27965
15054b7965M884M6135q508k8614j6554K1337L6049O6942p1954R952J1546J1628
$$ -27965 -23081 23054 14546 -14068 -30622 -9285 26764 93706 21752 31704 43250 54878
15042E4878K4141k8809n2134J4387l7560j4241K7685L4961n644m7757j9109k7629
$$ 54878 79019 50210 -1924 12463 -25097 -39338 -11653 23308 17664 -30093 -49202 -76831
15030g6831L6143n187K0583L7689o753L0526O3095o5809l8031l9720J9504Q2472
$$ -76831 -40688 -45875 -25292 12397 5644 36170 99265 33456 -4575 -44295 -24791 57681
15018E7681o852j2206L0760J5506j9407j2428K0258N5026M4035Q4024J12469J81442
$$ 57681 50829 38623 69383 84889 65482 53054 73312 128338 172373 256397 368866 550308
15006E50308K96959N79900R41398J118379l90487j374230p48875l58145k11419
$$ 550308 847267 1427167 2368565 3486944 3096457 1722227 973352 615207 403788
14997D03788j35523j42861l8813N4950K287o3344N2282J2901q7997K5930J8992
$$ 403788 268265 125404 86591 141541 143828 80484 132766 145667 57670 83600 102592
14986A02592p5927K8337R613l3686n3249L269M9574K6639J6871K9598l6803n3882
$$ 102592 26665 55002 64615 30929 -22320 -19051 30523 57162 74033 103631 66828 12946
14974A2946r160j2138O0272O1396L6244P4480p6795l3105j6435o8776o1640L1386
$$ 12946 3786 -8352 51920 113316 149560 224040 147245 114140 97705 28929 -32711 -1325
14962a325j1140l1484M0604K7367k148k0746N2035P350m749n7885n5764N0702
$$ -1325 -12465 -43949 -3345 24022 21874 1128 53163 60513 55764 -2121 -57885 -7183
14950g183N448k8501L1623J2473m6871o3463J5797M3851J5710m7579m803O993
$$ -7183 -1735 -30236 1387 13860 -33011 -96474 -80677 -36826 -21116 -68695 -73498 -66505
14938f6505N2805M4397J2278k8267j0102J693p6757Q7369l8686q6635K7374R7002
$$ -66505 -13700 30697 42975 14708 4606 6299 -70458 16911 -21775 -108410 -81036 15966
14926A5966N058q346L0971j5375p3251j2160L8884p950l5376L704N2375N6734
$$ 15966 21024 12678 43649 28274 -44977 -57137 -18253 -26203 -61579 -57875 -5500 51234
14914E1234j0458J0718M7172q695k3600m1480j07300l3765r619O6301P6322L3066
$$ 51234 40776 51494 98666 89971 66371 24891 -82409 -116174 -125793 -59492 16830 49896
14902D9896k7996o471j2876k8424O0650j4959j44221n0190M347p5173J8057P7892
$$ 49896 21900 15429 2553 -25871 34779 19820 -124401 -174591 -170244 -245417 -227360 -149468
14890a49468N3808J4640K8659L3914P517j2393J4236n2580n5143P2222N9032O139
$$ -149468 -95660 -81020 -52361 -18447 -10930 -23323 -9087 -61667 -116810 -44588 14444 20583
14878B0583K1193K8679J2915J8298l1779j3817J0809l1791m6518n7292K5755L1629
$$ 20583 41776 70455 83370 101668 69889 56072 66881 35090 -11428 -68720 -42965 -11336
14866a1336K2721j7j2577j4153k8962N9968P7395L7569j04474J3813M803k2299
$$ -11336 11385 11368 -1209 -15362 -44324 15644 93039 130608 26134 39947 44750 22451
14854B2451Q761M7709k2465m9174L2604k4479J4871K7694k1159o9597J6014K5413
$$ 22451 31212 78921 56456 7282 39886 15407 30278 57972 36813 -32784 -16770 8643
14842H643r0458L490J0283J6247K9732K5646J3740J6785N429m4789j1630n8252
$$ 8643 -81815 -78325 -68042 -51795 -22063 3583 17323 34108 39537 -5252 -16882 -75134
14830g5134p0632L489M8391M9326J4794n958J9177K6129K5236k0895k0604k1875
$$ -75134 -145766 -142277 -93886 -44560 -29766 -35724 -16547 9582 34818 13923 -6681 -28556
14818b8556k6651j0816K9182k3002p9797k8813K247L1654L379L1589k8490Q1823
$$ -28556 -55207 -66023 -36841 -59843 -139640 -168453 -166206 -134552 -131173 -99584 -128074 -46251
14806d6251O4943L8170K6856o4535j7779j1602O1877J594p024o9120k8130j9562
$$ -46251 18692 56862 83718 19183 1404 -10198 51679 53273 46249 -22871 -51001 -70563
14794g0563K0866L0962P9101M4612j5392l7222N2230M7546n7751k7622L326l9171
$$ -70563 -49697 -18735 60366 104978 89586 52364 104594 152140 94389 66767 70093 30922
14782C0922M0299K7170L481K4176j0646o4745p2639n3019L2619j5917J0659O7938
$$ 30922 71221 98391 101872 126048 115402 50657 -21982 -75001 -42382 -58299 -47640 20298
14770B0298j5525j8667K913l2060j752K7165k8580l4918k5867J4080M874K3104
$$ 20298 4773 -13894 -10981 -43041 -44793 -17628 -46208 -81126 -106993 -92913 -88039 -64935
14758f4935M547j1860K7348K5286q882P1275m367k2609k3505k3568J0546R073
$$ -64935 -60388 -72248 -44900 -19614 -28496 42779 38412 15803 -7702 -31270 -20724 -11651
14746a1651k2312R472K2284K2308K5247j3826M2736q0637j12226L6018O0723l6434
$$ -11651 -33963 -24491 -2207 20101 45348 31522 74258 -6379 -118605 -82587 -21864 -58298
14734e8298n3500J5579K3899N6278M4095J2781m8793j9762n4247L453J686L9005
$$ -58298 -111798 -96219 -72320 -16042 28053 40834 -7959 -27721 -81968 -78515 -76829 -37824
14722c7824M7904j9668k878N1797j3782m8454m4367K6184N1805p2305k8735P1371
$$ -37824 10080 -9588 -12466 39331 25549 -22905 -67272 -41088 10717 -61588 -90323 -18952
14710a8952J3614k8468l7073o124j6078L9982R6855N4210N82o0973k1474j5634
$$ -18952 -5338 -33806 -70879 -77003 -93081 -53099 43756 97966 98548 37575 16101 467
14698D67L3698m6088n8666L0409j5640J2156J8882j5700N2244Q0406N938j6397
$$ 467 34165 -11923 -70589 -40180 -55820 -43664 -24782 -40482 11762 92168 98106 81709
14686H1709N2726J7089M717N4052N0761M5833Q3086J36014J90815K08695m946
$$ 81709 134435 151524 156241 210293 261054 306887 389973 525987 716802 925497 920551
14675I20551j84507k23727j48484j21016j10909n9644J7214m1749k7512N672K5219
$$ 920551 736044 512317 363833 242817 131908 72264 89478 47729 20217 25889 51108
14664E1108J2070M3210R629O78k8247m3236K4386k7199p7435j6356N0658K2182
$$ 51108 63178 106388 116017 116695 88448 45212 69598 42399 -35036 -51392 -734 21448
14652B1448L0853j0593l8839M7754J1436q058k9196n0646Q823O2864o7929o1266
$$ 21448 52301 41708 2869 50623 62059 54001 24805 -25841 -17018 45846 -22083 -83349
14640h3349L7469K0273L8038J8612j1113j2350l5867J3818R313p685J9632N9766
$$ -83349 -45880 -25607 12431 31043 19930 7580 -28287 -14469 -5156 -12841 6791 66557
14628F6557M0620N7665J37602J69666K11224L54897M24112K60996r4545k74728
$$ 66557 107177 164842 302444 472110 683334 1038231 1462343 1723339 1628794 1354066
14618A354066k19278k59440k55562j24873j07948l8567o9772o9203m7142J3534
$$ 1354066 1134788 875348 619786 494913 386965 348398 278626 209423 162281 175815
14608A75815J6101k4927n6717p5363J2624l0614K1020O45l370k9349K0017L8437
$$ 175815 191916 166989 110272 34909 47533 16919 37939 38584 35214 5865 25882 64319
14596F4319J5326j9120m6092o742M0387N58l9507K88K2690p730K1292R854J9932
$$ 64319 79645 60525 14433 7691 48078 48636 9129 9417 32107 24377 45669 55523 75455
14583G5455j0422j4423l1152n1114k5068N5398L7076l8940K4807p120q83O6234
$$ 75455 65033 50610 19458 -31656 -56724 -1326 35750 -3190 21617 14497 13614 79848
14571G9848O7616O1053O4279N2879J42494K49899L02445J08890j72733l05932
$$ 79848 147464 208517 272796 325675 468169 718068 1020513 1129403 956670 650738
14561F50738k57560j38386o4931o3259L7923l823J0105k4988k8420j4766p012
$$ 650738 393178 254792 189861 126602 164525 160702 170807 145819 117399 102633 95621
14550I5621k6762n5952j4832K7308J5814R365q658P787m0317j0713k6704K5233
$$ 95621 68859 12907 -1925 25383 41197 50562 41904 49691 9374 -1339 -28043 -2810
14538b810M6389M3135m7302K0352N515K463n1328J2269k0447K625J6455N6596
$$ -2810 43579 86714 39412 59764 65279 67742 16414 28683 8236 10861 27316 83912
14526H3912j8397m8181l4522l8613J4093L2261K9007j2241l6943k116P423M1390
$$ 83912 65515 17334 -17188 -55801 -41708 -9447 19560 7319 -29624 -31740 -24317 17073
14514A7073m912R973k5435J4483P108J9152L1603P1075m1223q2835j9124l9428
$$ 17073 12161 22134 -3301 11182 18290 37442 69045 140120 98897 16062 -3062 -42490
14502d2490o720L5107O2187K3055k3808O739J00288J9515j5174o1422o0097l0135
$$ -42490 -49210 -14103 48084 71139 47331 54070 154358 173873 158699 97277 37180 7045
14490G045q566m702k0898p0840N7383M0897O6092K0262m0789j1668N6083m195
$$ 7045 -1521 -6223 -27121 -97961 -40578 319 66411 86673 45884 34216 90299 86104
14478H6104o393l9904l2662K5926L5501P923k8049q420K6308L0636p0317m6229
$$ 86104 79711 39807 7145 33071 68572 76495 48446 40026 66334 96970 26653 -19576
14466a9576k5057N1792N0456n241J4038J1229j0189l0591m207O7952O1431j7065
$$ -19576 -44633 7159 57615 52374 66412 77641 67452 36861 32654 100606 162037 144972
14454A44972l7214K4942l3900m9907k4937k345J2150j2851l5196M1925L1492J3892
$$ 144972 107758 132700 98800 48893 23956 21611 33761 20910 -14286 27639 59131 73023
14442G3023p179j3028q4236K0603Q12l4452l4442m976O615J7306N8998J1944l0097
$$ 73023 65844 52816 -31420 -10817 -10005 -44457 -78899 -83875 -77260 -59954 -956 10988 -19109
14429a9109N260L1932k5599L0381M6502j7252K485L2118J0783l2928P404N854
$$ -19109 -13849 18083 -7516 22865 69367 52115 54600 86718 97501 64573 71977 77831
14417G7831N7950M167j8296p4557o2043M9206r063l2043l0841j8705L1285L7277
$$ 77831 135781 139948 121652 47095 -14948 34258 25195 -6848 -37689 -56394 -25109 12168
14405A2168O365L847k4674l0159m928K3951N3158K6372j1220O5296K5874q6939
$$ 12168 18533 22380 -2294 -32453 -37381 -13430 39728 66100 54880 120176 146050 59111
14393E9111o7633J3063Q6321R4081k3940j9095j5678l6789k7489m8057q6026k8013
$$ 59111 -8522 4541 90862 184943 161003 141908 126230 89441 61952 13895 -72131 -100144
14381a00144K8067N3801P6189P0886q469l0369J415Q146M377j8135m2703m3124
$$ -100144 -72077 -18276 57913 128799 120330 89961 91376 99522 103899 85764 43061 -63
14369f3M3106N6692P0956l3495n8753k9891L8472r951o540M4163k5950k8791J9563
$$ -63 43043 99735 170691 137196 78443 48552 87024 77073 70533 114696 88746 59955 79518
14356G9518K0468R041n1723p5874j7708k0318R1329P0148p007n3008L109N4521
$$ 79518 99986 109027 57304 -18570 -36278 -56596 34733 104881 97874 44866 47975 102496
14344A02496k6764m5729n2496Q321o227k7646J9200P5895m964k0503N6809Q9203
$$ 102496 75732 30003 -22493 -14172 -20399 -48045 -28845 47050 42086 21583 78392 167595
14332A67595N6769m284q6471j6283n7148l5907r96N4052O3566K0823K3966l704
$$ 167595 224364 220080 133609 117326 60178 24271 23275 77327 140893 161716 185682 181978
14320A81978n9922m4390L9640K5258K8256k5014o9260r418M7450N5214K5713R421
$$ 181978 122056 77666 117306 142564 170820 145806 76546 67128 114578 169792 195505 204926
14308B04926l051j2618l430K835J43531J05433l9903j31541p0192m6931l502k8663
$$ 204926 201875 189257 185827 188662 332193 437626 397723 266182 195990 149059 145557 116894
14296A16894k3752m7785j7483L8023N89P820k588M5205k3350j139n2745k6379
$$ 116894 93142 45357 27874 65897 66486 74306 71718 116923 93573 92434 39689 13310
14284A3310K9771K6882L7574Q9681O5221m4301j4765j9157J932M502m1078J2499
$$ 13310 43081 69963 107537 197218 262439 218138 203373 184216 186148 190650 149572 162071
14272A62071L6229l9041k9895J8747j054L9688N0702j6289L5470L0054q06m6108
$$ 162071 198300 159259 129364 148111 147057 186745 237447 221158 256628 286682 285876 239768
14260B39768k5554j4501M4612N6841N297K5035l10J7574o8419K9199J26684Q9981
$$ 239768 214214 199713 244325 301166 306463 331498 331188 348762 280343 309542 436226 526207
14248E26207p005j21260q7637q720O429M5867j6947r101O5755K2316r500N2713
$$ 526207 519202 397942 310305 301585 308014 353881 336934 327833 393588 415904 406404 459117
14236D59117J5682P2149N6938R5793J08888J5732P10n96Q8684O0788R7335J52614
$$ 459117 474799 546948 603886 699679 808567 824299 825009 824413 913097 973885 1071220 1223834
14224A223834J48765J10803J07045J86893K13953K14403K28805K48652L52582
$$ 1223834 1372599 1483402 1590447 1777340 1991293 2205696 2434501 2683153 3035735
14215C035735L67456N20389P00062Q76325J078350J482412K000962K687380L481417
$$ 3035735 3403191 3923580 4623642 5499967 6578317 8060729 10061691 12749071 16230488
14206A6230488M881879P721941J3186678K2176595L4924145M6774407L7862227
$$ 16230488 21112367 28834308 42020986 64197581 99121726 145896133 183758360
14199A83758360n5515l6978057m7246962l3350321j9311760j1174756o826291
$$ 183758360 183702845 146724788 99477826 66127505 46815745 35640989 28814698
14192B8814698m457421l149988k289184j480495j843986k923173k448180j630042
$$ 28814698 24357277 21207289 18918105 17437610 15593624 12670451 10222271 8592229
14184H592229j162898q56041o56098n04391l42021k91756j77901j43584j54836
$$ 8592229 7429331 6573290 5917192 5412801 5070780 4779024 4601123 4457539 4302703
14175D302703j23624j41669j17546l0281K6995O5058P1725J71133K25248J46585
$$ 4302703 4179079 4037410 3919864 3889583 3916578 3981636 4053361 4224494 4449742 4596327
14165D596327K22006L33354M36321N27386N98414N40378O67387J013379J243493
$$ 4596327 4818333 5151687 5588008 6115394 6713808 7254186 7921573 8934952 10178445
14156A0178445J644407K182342L028514M168651N362181P058557J0625739J7475896
$$ 10178445 11822852 14005194 17033708 21202359 26564540 33623097 44248836 61724732
14148F1724732K9270144M8154921P2702218Q7270920M4723196l0824185m8913113
$$ 61724732 90994876 139149797 211852015 299122935 343846131 313021946 264108833
14141B64108833l4300638n0659618n8056514l7352427k1101579j3399314r614612
$$ 264108833 229808195 179148577 121092063 83739636 62638057 49238743 39624131
14134C9624131p188158n559541m508227l628035k762991k144514j711050j384509
$$ 39624131 32435973 26876432 22368205 18740170 15977179 13832665 12121615 10737106
14126A0737106j091917r46033p29500n70139n19452m60130m22366l29880k48570
$$ 10737106 9645189 8699156 7969656 7399517 6880065 6419935 5997569 5667689 5419119
14117E419119j55877k38545k08302j11383o0670m2833k1509P6727N0297J28553
$$ 5419119 5263242 5024697 4816395 4705012 4644342 4601509 4580000 4656727 4707024 4835577
14107D835577J55637K82554L23000K91074M29647N46350Q19215J352904J976968
$$ 4835577 4991214 5273768 5596768 5887842 6317489 6863839 7683054 9035958 11012926
14098A1012926K739335L098082K107713J856081L426338O271684J1202931J9522882
$$ 11012926 13752261 16850343 18958056 20814137 24240475 30512159 41715090 61237972
14090F1237972L2275683M7862645N4552056K2948962l5173533n8977965m3701477
$$ 61237972 93513655 141376300 195928356 218877318 183703785 124725820 81024343
14083H1024343k5314674j4531101q814823n869242m481280l969213l402580k660064
$$ 81024343 55709669 41178568 32363745 26494503 22013223 18044010 14641430 11981366
14075A1981366k021273j413648j064629r46859p74860n87287m59203m01063l96662
$$ 11981366 9960093 8546445 7481816 6534957 5760097 5172810 4713607 4312544 3915882
14066C915882l07558k67521k94081k66007j74166p4735q6660j52877j95614j52634
$$ 3915882 3608324 3340803 3046722 2780715 2606549 2531814 2445154 2292277 2096663 1944029
14056A944029j66231j56638q1381j16611O995O9654J4431q9645j23624k0697n2665
$$ 1944029 1777798 1621160 1539779 1423168 1430163 1499817 1514248 1424603 1300979 1280282 1227617
14045A227617j21515o6374j6213m4925l8886m25r9066q2521j3337k2026j0140
$$ 1227617 1106102 1039728 1023515 978590 939704 939279 840213 757692 744355 722329 712189
14034G12189Q915p170J9599L8547k9682o1378m1238l6444m8572l4534m5751K9975
$$ 712189 721104 713934 733533 772080 742398 681020 639782 603338 554766 520232 474481 504456
14022E04456J9824O4525N1718P937k2937m6381n4467n8740k4904k8881O056l4904
$$ 504456 524280 588805 640523 648460 625523 579142 524675 465935 441031 412150 418206 383302
14010C83302M1804M6791R50j6433J8942m5815n4990N3965M2075m0873p5077r4191
$$ 383302 425106 471897 472847 456414 475356 429541 374551 428516 470591 429718 354641 260450
13998B60450L032L0951K5012O2737O6436m9748k4265N7266J06820J4119K9057
$$ 260450 263482 294433 319445 382182 448618 398870 374605 431871 538691 552810 581867
13987E81867Q8277J47434L4506j55323k20789j57391n6629j8836M319L9648J60
$$ 581867 670144 817578 852084 696761 475972 318581 261952 243116 247435 287083 287243
13976B87243r883j100K762n3231K5515J953o4411K6753O8516k598N7312J01731
$$ 287243 277360 276260 279022 225791 251306 253259 188848 215601 284117 281519 338831 440562
13964D40562O3809L4378J6719k0434n5594p6208k6482o1826m4834m9966J6738
$$ 440562 504371 538749 555468 535034 479440 403232 376750 314924 270090 220124 236862
13953B36862K9447J6253K5243N628n4968L8797O0645J2100k4382n7073j8894j4829
$$ 236862 266309 282562 307805 313433 258465 297262 357907 370007 345625 288552 269658 254829
13941B54829k2408R005j8620l2435k7832l4044j619M1352R0987K9409l0618n4692
$$ 254829 232421 241426 222806 190371 162539 128495 126876 168228 259215 288624 258006 203314
13929B03314K1219N739q2377q371m2031K9890j8771j0902L2016J5333L2446M9998
$$ 203314 224533 230272 147895 139524 97493 127383 108612 97710 129726 145059 177505 227503
13917B27503J0689l9159k6360K8142n7607Q487N9372O045N864P457M3660K4173
$$ 227503 238192 199033 172673 200815 143208 151695 211067 217112 222976 230433 274093 298266
13905B98266O040q2987n0262K3436K549r297m0782J2495m8645j0291J639N0008
$$ 298266 304306 221319 171057 194493 197042 187745 146963 159458 110813 100522 102161 152169
13893A52169L3467j2692j7086M347L5820m350p7600o805K0541l3854j1589j1513
$$ 152169 185636 172944 155858 160205 196025 191675 114075 107270 127811 93957 82368 70855
13881G0855K3422K001L0463J2510o854k4878r768L3203K0623o515j9805j402m558
$$ 70855 94277 96278 126741 139251 132397 107519 97751 130954 151577 145062 125257 123855 119297
13868A19297q1703j4458N2109l5595r976O1957Q5031J4756j00506q9958P9281
$$ 119297 37594 23136 75245 39650 29674 91631 176662 191418 90912 954 80235
13857H0235K4853K4795K9539K8504r763p512n1285o9372q331L6451j1460K8295
$$ 80235 105088 129883 159422 187926 178163 170651 119366 49994 41663 78114 66654 94949
13845I4949J2044M467N762k3053k2441j8339j3517q4085m7445L9173P3457j4116
$$ 94949 106993 111460 117222 94169 71728 53389 39872 -44213 -91658 -52485 20972 6856
13833F856l8387N9768K9860L0512O4646m382l9912o5438J9511O0686L0388O4860
$$ 6856 -31531 28237 58097 88609 153255 148873 108961 43523 63034 123720 154108 218968
13821B18968n8382n8975o1696J0301J3160n9467l8590J5369m957M863N7091L5388
$$ 218968 160586 101611 39915 50216 63376 3909 -34681 -19312 -24269 -19406 37685 73073
13809G3073L2290j8996m123J7433m7427j604M32N829L162j4919M7349J3425K8782
$$ 73073 105363 86367 82244 99677 52250 50646 51078 56907 60069 45150 92499 105924 134706
13796A34706o1435l6198P362j3152J8879K6806K0140j2010n757k8766n8226K836
$$ 134706 73271 37073 44435 31283 50162 76968 97108 85098 79341 50575 -7651 -4815
13784d815L7405L1981N7483L345m8182o6672m3271K7279L199K3612J3816K5658
$$ -4815 32590 64571 122054 125399 77217 10545 -32726 -5447 -2248 21364 35180 60838
13772F0838L2790M241J6085j8892k8817K212K3398L7724l5997k7058q7593j560
$$ 60838 93628 97869 113954 95062 66245 68457 91855 129579 93582 66524 -21069 -22629
13760b2629N7317K0574p471k4466K067k2283J7744M2162j3660k8070l1158O6641
$$ -22629 34688 55262 47791 23325 25392 3109 20853 63015 49355 21285 -9873 56768
13748E6768K0319J0670j4875N759j0804o0275n655l322n8250j9686M6848N2859
$$ 56768 77087 87757 72882 78641 67837 7562 1907 -1415 -59665 -79351 -32503 20356
13736B0356M2785L6826k2691m4665k0506K3850K2736l2237q698K4663R0650J7996
$$ 20356 63141 99967 77276 32611 12105 35955 58691 26454 17756 42419 133069 151065
13724A51065m8145n0845K0316O5124O683N8801J21264J30964J97334K03067N2785
$$ 151065 102920 52075 72391 137515 144198 202999 324263 455227 652561 855628 908413
13713I08413p6900j69992k42154j22984j990n1978o4701m8964j9737K9097L8993
$$ 908413 831513 661521 419367 296383 294393 242415 177714 128750 109013 138110 177103
13702A77103K6253k2600K7571k0019r3785l5560M3340J123l5559n0759R959r061
$$ 177103 203356 180756 208327 188308 94523 58963 102303 103426 67867 17108 27067 18006
13690A8006o614O7845K7836k6775m0191K7718P987n043K9968M670q560k116K2202
$$ 18006 11392 79237 107073 80298 40107 67825 75812 70769 100737 105407 96847 94731 116933
13677A16933r535l7972j6273l2367j4662L0331M3247J01318K8278j7177j9253
$$ 116933 107398 69426 53153 20786 6124 36455 79702 181020 209298 192121 172868
13666A72868l3488K8635J13657J57352K14284K95130M11348L11422K9719k34405
$$ 172868 139380 168015 281672 439024 653308 948438 1359786 1671208 1700927 1466522
13656A466522k22588j00796k07160k84284j41114o3412n6233q1115n6926m1680
$$ 1466522 1243934 1143138 935978 651694 510580 447168 390935 309820 252894 211214
13646B11214m0735o6760M443l1068l4538L6330p490n7853k868M9812J4691J4187
$$ 211214 170479 103719 108162 77094 42556 78886 71396 13543 10675 60487 75178 89365
13634H9365P0795J8087j1090J646k2885k7381p0573L5170R133m2876o9503j2375
$$ 89365 160160 178247 167157 168803 145918 118537 47964 83134 92267 49391 -20112 -32487
13622c2487K5833k4147M515L1735k412K1482J2955R9517K7680N307l5167r862
$$ -32487 -6654 -30801 -26286 5449 3037 24519 37474 136991 164671 169978 134811 124949
13610A24949L4095R58p361L2807P4228J01223J52478K70671K27778K2572k21465
$$ 124949 159044 160002 152641 185448 259676 360899 513377 784048 1011826 1034398 812933
13599H12933l25147j79538q7791j05547m4766j0585J5015M6065L2830j9017k0741
$$ 812933 487786 308248 220457 114910 70144 59559 74574 120639 153469 134452 113711
13588A13711j335M0207l7106p3967k1620L4332n9324k2965K638J6253L5126l8128
$$ 113711 112376 152583 115477 41510 19890 54222 -5102 -28067 -25429 -9176 25950 -12178
13576a2178M5226N2056k6678j3591P946q5627j0524M4686J9659K2522k2349J304
$$ -12178 33048 85104 58426 44835 52781 -32846 -43370 1316 20975 43497 21148 22452
13564B2452L1698l3250n7578K8200O9829j0907j7254n041n313j9885J9992O9595
$$ 22452 54150 20900 -36678 -8478 61351 50444 33190 28149 22836 2951 22943 92538
13552I2538J2801j0136k7224K1640J6321n6296o9700j4546L8657m2528L780L1747
$$ 92538 105339 95203 67979 89619 105940 49644 -20056 -34602 4055 -38473 -34693 -2946
13540b946j1747l9519n759J03540M1906J7097m7585m2857n210K4256n9901l6853
$$ -2946 -14693 -54212 -59971 43569 85475 102572 54987 12130 6920 31176 -28725 -65578
13528f5578N978M4353O1704M0700M7689j831j0590J6698j08466m8842J7555n8126
$$ -65578 -59600 -15247 46457 87157 134846 133015 122425 139123 30657 -18185 -630 -58756
13516e8756m658j9642K4287Q7855j3951J4567K2690L8138J6014p2916p0775m443
$$ -58756 -63414 -83056 -58769 29086 15135 29702 52392 90530 106544 33628 -37147 -41590
13504d1590J0531K2223L8935K6763j0757K5955J6327j758p8317k7263l126L2231
$$ -41590 -31059 -8836 30099 56862 46105 72060 88387 86629 8312 -18951 -22077 10154
13492A0154J5150M8641K1987k6724M187J0565k7620N656M6758k003j5361J925
$$ 10154 25304 73945 95932 69208 73395 83960 56340 61996 108754 106751 91390 93315
13480I3315R589p5979j146Q4244j3413p9034j1606j3593k3380j5158J1193m669
$$ 93315 102904 26925 25779 110023 96610 17576 5970 -7623 -31003 -46161 -34968 -39637
13468c9637K8867N2517N586n4211n2652J1719K7173K3075l1283M1352M491k7179
$$ -39637 -10770 41747 47333 -6878 -59530 -47811 -20638 2437 -28846 12506 16997 -10182
13456a0182J8100L3560m3286j1452n0683n3448P7110M1239k3789l2117o9591m6112
$$ -10182 7918 41478 -1808 -13260 -63943 -117391 -40281 958 -22831 -54948 -124539 -170651
13444a70651M7110N7031R4600N7869k1967j2759k5623Q947P903m295j638L1733
$$ -170651 -123541 -66510 28090 85959 63992 51233 25610 34557 42460 38165 36527 68260
13432F8260J9975q194j6164p8640J254L0444L1424k9252j7806P3685L9587k289
$$ 68260 88235 80041 63877 -14763 -13509 16935 48359 19107 1301 74986 114573 112284
13420A12284l884q1277n3208L3733q922M0523M6228j1532K118J4903O760q436
$$ 112284 108400 27123 -26085 7648 -1274 39249 85477 73945 76063 90966 97726 89290
13408H9290K7841o0125n648J9423K2252L4648L5870l2338j4896l6037j0212J3925
$$ 89290 117131 57006 51358 70781 93033 127681 163551 131213 116317 80280 70068 83993
13396H3993j2909K8189r657k2260n3895n2841j7084O6166P0261J06q6121m7024
$$ 83993 71084 99273 89616 67356 13461 -39380 -56464 9702 79963 80069 -6052 -53076
13384e3076L1069N1472m236K4494P501o475M9504j5751k3273m0499l4080p629
$$ -53076 -22007 29465 25229 49723 57224 50749 100253 84502 61229 20730 -13350 -20979
13372b0979j5965N578O133O2129k2696K695k3672J3924j5925P138M6364J3982
$$ -20979 -36944 -31366 -25233 36896 14200 16895 -6777 7147 -8778 -1640 44724 58706
13360E8706m6766o721j645j9038m046K5419J6582Q187J262l1531j0248L1609J2524
$$ 58706 11940 5219 3574 -15464 -19510 5909 22491 30678 31940 409 -9839 21770 34294
13347C4294l1771l7267J8705O4999m609Q323j961K5611l0948n4233l0118K9921
$$ 34294 2523 -34744 -16039 48960 44351 52674 50713 76324 45376 -8857 -38975 -9054
13335i054L1634l3969K320j3162k1144l3563m3075k0740Q181J13433N9861j9165
$$ -9054 22580 -11389 -9069 -22231 -43375 -76938 -120013 -140753 -132572 -19139 40722 21557
13323B1557k1542N4947m4587o4377l5288L3350N3872M179j5236k7273q821m9306
$$ 21557 15 54962 10375 -54002 -89290 -55940 -2068 2111 -13125 -40398 -49219 -98525
13311i8525J4454R121K8873k7359j8251l8323O580L2056N5751M9227K7012k0914
$$ -98525 -84071 -74950 -46077 -73436 -91687 -130010 -123430 -91374 -35623 13604 40616 19702
13299A9702k1984l3561j6117K0014m5187J9003L3629n8995J5209P9316M434m9091
$$ 19702 -2282 -35843 -51960 -31946 -77133 -58130 -24501 -83496 -68287 11029 15463 -33628
13287c3628l6155P2437O0188M4106N7540n990k2637o4965j5044J9760j6199k407
$$ -33628 -69783 2654 62842 106948 164488 158498 135861 70896 55852 75612 59413 57006
13275E7006r639l4049l9193q121L7748L6548k7634m2344j7248o671j2558j972
$$ 57006 47367 13318 -25875 -33996 3752 40300 12666 -29678 -46926 -53597 -66155 -68127
13263f8127j2484K7868J6384N3718L8843j8633O98r082k7625O809J0374j4715
$$ -68127 -80611 -52743 -36359 17359 56202 37569 38267 29185 1560 8369 18743 4028
13251D028L4645K831l3786l9879J2718K3999N9146l022o19K6436j8211n1166n4771
$$ 4028 38673 41504 7718 -32161 -19443 4556 63702 60680 60061 86497 68286 17120 -37651
13238c7651K6896l752r2601K3803O3205M2807N9647j2284l826J224L9084N0369
$$ -37651 -10755 -14507 -107108 -83305 -20100 22707 82354 70070 66244 67468 106552 156921
13226A56921n0635n5810p9622n2048K8068L5228J5828K953J2656O3327k78n857
$$ 156921 106286 50476 -29146 -81194 -53126 -17898 -2070 883 13539 76866 76588 70731
13214G0731L765j9974Q995L6545k8550n9590j8124j1654n2414o8909K8740P5001
$$ 70731 74496 54522 63517 100062 71512 11922 -6202 -17856 -70270 -139179 -110439 -35438
13202c5438L3647j6184K3887K8495J7144j9917n6821p050L1931R1403m3969k5338
$$ -35438 -1791 -17975 5912 34407 51551 31634 -25187 -32237 -306 91097 47128 21790
13190B1790n786L49n6173l6893L73l6854J038k518O7639L4602r054K5825O4108
$$ 21790 16004 16353 -39820 -76713 -76340 -113194 -112156 -114674 -47035 -12433 -21487 4338 68446
13177F8446J1329k3757k0607L7030l6850o8647k1117M4984P316K3242L8812Q154
$$ 68446 79775 56018 35411 72441 35591 -33056 -54173 -9189 -1873 21369 60181 68335
13165F8335l2783k3520r386P718K5240l8745n2625l6449O6360J15297P169m5524
$$ 68335 35552 12032 2646 10364 35604 -3141 -55766 -92215 -25855 89442 96611 51087
13153E1087K5330K669j5978R477k2350o6798J9231N991j5371j0242M0922m2325
$$ 51087 76417 79086 63108 72585 50235 -16563 2668 8659 -6712 -16954 23968 -18357
13141a8357k0471P6974L0837j0433m4157J6047l7631O193n7779k5274O745N7210
$$ -18357 -38828 38146 68983 58550 14393 30440 -7191 -998 -58777 -84051 -77306 -20096
13129b0096j6997q130J1475j6102q26k0521O5270o367m9780K638J4902L430K2258
$$ -20096 -37093 -45223 -33748 -49850 -50676 -71197 -5927 -12294 -62074 -59436 -44534 -41104 -18846
13116a8846m0238l9623n3432P8254J1569J113r966L7383j2941r095N3983K0807
$$ -18846 -59084 -98707 -152139 -73885 -62316 -61203 -71169 -33786 -46727 -55822 -1839 18968
13104A8968n38J8691L5428j1943m8222J2385K1094l1364o8212l3415M0315N5974
$$ 18968 18430 37121 72549 60606 12384 24769 45863 14499 -53713 -87128 -46813 9161
13092I161L6602o0899o3558k6475n0464m058J2493M0332Q7206O742l6261j976
$$ 9161 45763 -15136 -78694 -105169 -155633 -159691 -147198 -106866 -19660 -12918 -49179 -51155
13080e1155m3907p6566M8155O1415j6517J9825O248k1472j1727J9938O1266K3463
$$ -51155 -95062 -171628 -123473 -62058 -78575 -58750 -52502 -73974 -85701 -65763 -4497 18966
13068A8966K6044J9939k0573m0147j6508J1978J855k2754n0327j7069M0393J486
$$ 18966 45010 64949 44376 4229 -12279 -301 1554 -21200 -71527 -88596 -48203 -46717
13056d6717K62K648K5246J1374K9153O836K6302o0765j18380l7447M8414P9226
$$ -46717 -46455 -43807 -18561 -7187 21966 28802 55104 -5661 -124041 -161488 -113074 -33848
13044c3848R479M2109K0113m8365m409J5280L2118l8719n4939J1932P882N3416
$$ -33848 -24369 17740 37853 -10512 -14921 359 32477 -6242 -61181 -49249 -41367 12049
13032A2049k9232j8317J2225J2835O1141K2253J9996m0042o175N2292K0173k0846
$$ 12049 -17183 -35500 -23275 -10440 50701 72954 92950 52908 46733 99025 119198 98352
13020I8352O332k3117m5634p32O668j5133l1467k434p889K4944n555m701k4302
$$ 98352 104684 81567 35933 35201 41869 26736 -4731 -7165 -15054 9890 4335 -366 -24668
13007b4668l5761N916N8787m964M7867j555q6761K3601J1356n2980N6852j1137
$$ -24668 -60429 -54513 4274 -690 47177 45622 -41139 -17538 -6182 -59162 -2310 -13447
12995a3447k2794K3464R8663M3722k7847n2518k9645K8120j5603J8269l0035k7719
$$ -13447 -36241 -12777 85886 129608 101761 49243 19598 47718 32115 50384 20349 -7370
12983g370K5181O4089R430N814l8432j654m9096k924L9530R980j8607o989K5463
$$ -7370 17811 81900 91330 97144 58712 57058 7962 5038 44568 54548 35941 28952 54415
12970E4415K3375m8819n2990M4725J3097p691J5160j3224K9256M7843m7846k9488
$$ 54415 77790 28971 -24019 20706 33803 26112 41272 28048 57304 105147 57301 27813
12958B7813L3641J262j2269J9912R436l2892L4859k162l0834j5816J2891J2697
$$ 27813 61454 62716 50447 70359 79795 46903 81762 79600 48766 32950 45841 58538
12946E8538m3275p8920L2275R641p877j1597j514R706Q063J092M1212J4280k5441
$$ 58538 15263 -63657 -31382 -21741 -29618 -41215 -42729 -33023 -24960 -23868 17344 31624 6183
12933F183K136k6132L949P556K0012M3271j4189l7274o183k6485L0893m7073l8384
$$ 6183 8319 -17813 -13864 -6308 13704 56975 42786 5512 -671 -27156 3737 -43336 -81720
12920h1720J6250J3183J9985L8771l004o4803q093P5532N6491j1060l1211n458
$$ -81720 -65470 -52287 -32302 6469 3465 -61338 -69431 6101 62592 51532 20321 14863
12908A4863R193m546R531k5186K7253M0524J7066m4906m928l7110l1580K7128
$$ 14863 24056 19510 29041 3855 31108 71632 88698 43792 38864 1754 -29826 -2698
12896b698J8382J1610j0047K7032L855o5463l6246k671O7482L1895L088J1374
$$ -2698 15684 27294 17247 44279 48134 -17329 -53575 -56246 11236 43131 46219 57593
12884E7593O4128N716o9390o3641r264r377L6403n725j9994k8954K4433R790j5606
$$ 57593 121721 127437 58047 -5594 -14858 -24235 12168 6443 -13551 -42505 -18072 -8282 -23888
12871b3888k5360K1480J9242o25N764k3863K4960L9908m797j1744k6829k1160
$$ -23888 -49248 -27768 -8526 -9151 -3387 -27250 -2290 37618 32821 21077 -5752 -26912
12859b6912l8729P3N5194k355J9409J4855l7549J8178j5303k1976J9556P570r333
$$ -26912 -65641 -65568 -10374 -12729 6680 21535 -16014 2164 -13139 -35115 -15559 -7989 -17322
12846a7322j8201k9411m5214M5125R4115N3865L9016l5853k6349k275l1801J355
$$ -17322 -35523 -64934 -110148 -65023 29092 82957 121973 86120 59771 57496 25695 27050
12834B7050m494k4762k5901k3131k1280n167J2056O0139L4455m3762o9542m441
$$ 27050 22556 -2206 -28107 -51238 -72518 -77685 -65629 -5490 28965 -14797 -84339 -88780
12822h8780N9260l3473n365M7957M1304M704M6979j9431N1258n0923q9794K9793
$$ -88780 -29520 -62993 -68358 -20401 20903 25607 72586 53155 104413 53490 -36304 -6511
12810f511K6258K1822N6536j3225J0149R803j0543o0125p5142o6158J1930P6934
$$ -6511 19747 41569 98105 84880 95029 104832 94289 34164 -40978 -107136 -95206 -18272
12798a8272N6193j9830r374K7588K0156j5857O120j1888k5839J7735j6421K7856
$$ -18272 37921 18091 8717 36305 56461 40604 46724 34836 8997 26732 10311 38167
12786C8167n202o9324l6892P05P0656M074j05827j6649R4404j6828k0400M0999
$$ 38167 32965 -36359 -73251 -72546 -1890 2184 -103643 -120292 -25888 -42716 -63116 -22117
12774b2117N6847L2455o2722J773n0354l2222K1721L1650n2533j9699O9632L9989
$$ -22117 34730 67185 4463 6236 -44118 -76340 -54619 -22969 -75502 -95201 -25569 14420
12762A4420k977l797j4444j7561R211j4796J0040O9863P133p119J714p93j036
$$ 14420 11443 7646 -6798 -24359 -15148 -29944 -19904 49959 57092 49973 51687 50894 49858
12749D9858k1434r247k2480K2968r842j6540k5509n7966k9992j514m603j5096
$$ 49858 28424 19177 -3303 19665 9823 -6717 -32226 -90192 -120184 -121698 -126301 -141397
12737a41397M9171K3348J6134N9222k0341j080l0967R078p121l4963K6687O4156
$$ -141397 -92226 -68878 -52744 6478 -13863 -14943 -45910 -36832 -43953 -78916 -52229 11927
12725A1927Q783k8730m6658J0178N333j5133K9615L8628m449k7326j7541L2516
$$ 11927 20710 -8020 -54678 -44500 -39167 -54300 -24685 13943 9494 -17832 -35373 -2857
12713b857O5191N5105j02105j08932n1767k2139N0984K953l4080O8656J3219J690
$$ -2857 62334 117439 15334 -93598 -145365 -167504 -116520 -113567 -147647 -78991 -65772 -64082
12701f4082N5236J8746J9805m9338o6753rl5925r569L8026J3705m401J7273K4833
$$ -64082 -8846 9900 29705 -19633 -86386 -86395 -122320 -131889 -93863 -80158 -84559 -67286 -42453
12688d2453L8642K5113o7628m8881k1519M4483P5493N3633n1333m0884K2714N7205
$$ -42453 -3811 21302 -46326 -95207 -116726 -72243 3250 56883 5550 -35334 -12620 44585
12676D4585j0859k9795o9835J3729J5370o358l6234K0648M7698L0331l8430J7960
$$ 44585 33726 3931 -65904 -52175 -36805 -43163 -79397 -58749 -11051 19280 -19150 -1190
12664a190J8512j5548l6774L1134K4548l391j2797k1591L2484M1963L908l9550
$$ -1190 17322 1774 -35000 -3866 20682 17291 4494 -17097 15387 57350 61258 21708
12652B1708j8794J2702J0053n0637l9056p529J7872Q3194R67n8990J2560O1119
$$ 21708 2914 15616 25669 -24968 -64024 -71553 -53681 29513 30480 -28510 -15950 45169
12640D5169q841q9893k4925K038l835P0972L5806k9311m6630o050L4982N1740
$$ 45169 36328 -53565 -78490 -76452 -80287 -9315 26491 -2820 -49450 -55500 -20518 31222
12628C1222J4154m8912m8410M7461N256l483p694q057K0723P020p191N9839L4034
$$ 31222 45376 -3536 -51946 -4485 771 -2712 -10406 -18463 2260 9280 2089 61928 95962
12615I5962o3986k9863K8942K3739K734l698j1066o2243j4644m201k9015o2598
$$ 95962 31976 2113 31055 54794 57528 53830 42764 -19479 -34123 -38324 -67339 -129937
12603a29937N4105J07912k9995n333j171k7605k1478K7397R642r289J5431j6507
$$ -129937 -75832 32080 2085 -3248 -4419 -32024 -53502 -26105 -16463 -25752 -10321 -26828
12591b6828m14J8910L9199L2866N2515M2679m6477j11329o9391N071J7434J4012
$$ -26828 -27242 -8332 30867 63733 116248 158927 112450 1121 -68270 -63199 -45765 -31753
12579c1753O545n6466k8027N6333N3854K6518O050k7378o1718j590o007l5394
$$ -31753 -25208 -81674 -109701 -53368 486 27004 33054 5676 -56042 -57632 -63639 -99033
12567i9033Q472N6872J3685n4106l5948N0793M180J9627O2278k6213j6628l2026
$$ -99033 -90561 -33689 -20004 -74110 -110058 -59265 -55085 -35458 26820 607 -16021 -48047
12555d8047J3162P1818M5085M4416n4464p4706J3382K8369K9118j0157o7507l8992
$$ -48047 -34885 36933 82018 126434 71970 -2736 10646 39015 68133 57976 -9531 -48523
12543d8523K6450L1588m609j9099l2298J5933M8172K0856k9982l126m5090m5418
$$ -48523 -22073 9515 4906 -14193 -46491 -30558 17614 38470 8488 5362 -39728 -85146
12531h5146k1466N2496J1935k4158M6704M6298n3006m6291K0870N1093M2339m6344
$$ -85146 -106612 -54116 -42181 -66339 -19635 26663 -26343 -72634 -51764 -671 41668 -4676
12519d676j8035j3787O103M311j8211M4420N2400q196L7191m4283o2232L8123
$$ -4676 -22711 -36498 -30395 -26084 -44295 125 52525 44329 81520 37237 -24995 13128
12507A3128P0571J0386m8030m6523m6642n0670p291L5673N2783j8315l788K1944
$$ 13128 83699 94085 46055 -468 -47110 -97780 -105071 -69398 -16615 -34930 -38718 -16774
12495a6774K4845j771M748n767o248m988J0396n0978j3822M1172L9694m5294l3203
$$ -16774 8071 6300 11048 5281 -967 -5955 4441 -46537 -60359 -19187 20507 -24787 -57990
12482e7990M8532k9281o5861j8437J35467N9001l2631j7448k1819r1894M2192
$$ -57990 -9458 -38739 -104600 -123037 12430 71431 38800 21352 -467 -92361 -50169
12471e0169L0983l4111K9054j9787L6252O7397m0770L1760L1115L8558j7796l2008
$$ -50169 -19186 -53297 -24243 -44030 -7778 59619 18849 50609 81724 120282 102486 70478
12459G0478m1062p138l7431J2774m727K4436m7672q3073K5495P9064j1878l7705
$$ 70478 29416 22278 -15153 -2379 -7106 17330 -30342 -113415 -87920 -8856 -20734 -58439
12447e8439j9368J332R958M98O3256K5360p5139o235M075L7528Q4958J8518q6093
$$ -58439 -77807 -76475 -66517 -66019 -2763 22597 -52542 -58777 -54702 -17174 67784 86302 209
12434B09k6104K5491k3254O7676K449k7012p6845k6679O08O9063k7732j13590
$$ 209 -25895 -404 -23658 44018 46467 19455 -57390 -84069 -83461 -14398 -42130 -155720
12422a55720l3203N8614M6189M1223O7162j6731p7553l6618O5110J6594m2918
$$ -155720 -188923 -130309 -84120 -42897 24265 7534 -70019 -106637 -41527 -24933 -67851
12411f7851n8339m07j1410M6761J21607k546K3632l5105J959k8766k6767j7611
$$ -67851 -126190 -126597 -138007 -91246 30361 27815 51447 16342 18301 -10465 -37232 -54843
12399e4843L2354l914k4955o3353j3396N474J742J3330m942M6849K7686J1337
$$ -54843 -22489 -26403 -51358 -114711 -128107 -122633 -120891 -107561 -112503 -65654 -37968 -26631
12387b6631L6950R1392L683m5476n356O130M7007k3650n8694J7506L2362N5284
$$ -26631 10319 101711 105394 59918 54562 60692 107699 84049 25355 42861 75223 130507
12375A30507R5484M7407l5293K0401k424J0109j4785K1937k4480M6670J45363
$$ 130507 225991 273398 238105 258506 256082 266191 251406 273343 248863 295533 440896
12364D40896O2314m2336k2875k0006K7537o1351o9739m9469k7706r7107o8843
$$ 440896 503210 460874 437999 417993 445530 384179 314440 264971 237265 140158 71315
12353G1315j7864K7246K5832l930p7332j5712n288j1256l4261N5643k4771l9585
$$ 71315 53451 80697 106529 102599 25267 9555 4267 -6989 -41250 14393 -10378 -49963
12341d9963L8753J0230r869l426j1746K2364k7063k1009N5348O1744j0444k3569
$$ -49963 -11210 -980 -10849 -14275 -26021 -3657 -30720 -51729 3619 65363 54919 31350
12329C1350K8632L6126J0677R251p1069j0853J24176O0332K5709L386j7669J6988
$$ 31350 59982 96108 106785 116036 44967 34114 158290 218622 244331 247717 230048 247036
12317B47036K6843M9801J17874N9163Q9386P0572O9256L2359M1023L4719J9191
$$ 247036 273879 323680 441554 500717 590103 660675 729931 762290 803313 838032 857223
12306H57223J6539p4499q8222m7917O899o1476j30250p3774j0933p2646j62644
$$ 857223 873762 799263 711041 663124 670023 608547 478297 404523 393590 320944 158300
12295A58300j15849k4392N5706N9037O724j2086P085K2124k9706k5635L355j5680
$$ 158300 42451 18059 73765 132802 139526 127440 134525 156649 126943 101308 104663 88983
12283H8983k691o0796m4795m557M8334Q832M7713J6828k1054Q585K7632k922M7725
$$ 88983 86292 25496 -19299 -23856 24478 33310 81023 97851 76797 85382 113014 110092 157817
12270A57817l954l2679K3903M8256n7849k4377P427J2687L5737J2409n687K0290
$$ 157817 153863 121184 145087 193343 135494 111117 118544 131231 166968 179377 173690 193980
12258A93980N6515M8748M1650L7007R2743j9638j5820O023l4016l8427j1732k4071
$$ 193980 250495 299243 340893 377900 470643 451005 435185 441208 407192 368765 357033 332962
12246C32962k9497J8097P867n2665l5106q64j204k7945n4451k4958l3896p479
$$ 332962 303465 321562 329429 276764 241658 240794 239590 211645 157194 132236 98340 90861
12234I0861r016j8941q842K2401M6821p2265n6197m944Q269m6997l3694R86P1258
$$ 90861 81845 62904 54062 76463 123284 51019 -5178 -10122 -1853 -48850 -82544 -81558 -10300
12221a0300O7164K2521k5217K6422j611M2016o8614m2283j9968O597j4036j1492
$$ -10300 56864 79385 54168 80590 78979 120995 52381 10098 -9870 -3273 -17309 -28801
12209b8801K3487M0659l5294L3259L8959l0882m6193k8611l1706L0452L0527M9367
$$ -28801 -5314 35345 51 33310 72269 41387 -4806 -33417 -65123 -34671 -4144 45223
12197D5223K0338j5405l5972Q718M1243J0172k6631r822J9956j2303k3491n6735
$$ 45223 65561 50156 14184 22902 64145 74317 47686 37864 57820 45517 22026 -34709
12185c4709K0441J454J7673K2303N524J153l0800l3378l4436L3578M0156J3601
$$ -34709 -14268 -12814 4859 27162 32686 33839 3039 -30339 -64775 -31197 8959 22560
12173B2560k1443N0192L0849R22l0255J470n8156m8681O8626P5780k0769n8527
$$ 22560 1117 51309 82158 83080 52825 54295 -3861 -52542 16084 91864 71095 12568
12161A2568k9737n013L3923j4425m9674L2226J9310k9955r066K2186M1833M1351
$$ 12568 -17169 -22182 11741 -2684 -52358 -20132 -822 -30777 -39843 -17657 24176 65527
12149F5527l2478j9167l6479J9971L0348j4729n1811K3268K8834P153k8687Q3524
$$ 65527 33049 13882 -22597 -2626 27722 12993 -38818 -15550 13284 20437 -8250 75274
12137G5274N1471r0833r4694p534p226N7254M977K1326N2736j4169m5204o483
$$ 75274 126745 35912 -58782 -66316 -73542 -16288 -11311 10015 62751 48582 3378 -3105
12125c105R2249J0821n7589m1896K1874K8750K9844k853p948k8707m5667k2546
$$ -3105 89144 99965 42376 480 22354 51104 80948 78095 70147 41440 -4227 -26773
12113b6773J2727J3553M1117M3119L3116l2582R591p344J1208n206m9256n1416
$$ -26773 -14046 -493 40624 83743 116859 84277 93868 86524 97732 92526 43270 -8146
12101h146n0148k3925O7184j247k6769L7313N1391K9815j3240n4720l4981N4161
$$ -8146 -58294 -82219 -15035 -16282 -43051 -5738 45653 75468 62228 7508 -27473 26688
12089B6688k9337m5476l739m6277n953N8245l740K6588K2641k7424N827M3014
$$ 26688 -2649 -48125 -51864 -98141 -104094 -45849 -49589 -23001 -360 -27784 -21957 21057
12077B1057n3240n8000k4877M9784O3987K6407j7335K8673J7005L0646N2477K2483
$$ 21057 -32183 -90183 -115060 -65276 -1289 25118 7783 36456 53461 84107 136584 159067
12065A59067m7006l7481J4594j1455o1582k4980M4314O7208M0518q760N001K8445
$$ 159067 112061 74580 89174 77719 16137 -8843 35471 102679 143197 134437 139438 167883
12053A67883L8917l0998K6469j8886n9107j5045O7110P2658P5261p6430p5956
$$ 167883 206800 175802 202271 183385 124278 109233 176343 249001 324262 247832 171876
12042A71876J0741M041M5166N1203J6342k342j6809m1288n5922m1871k1987N9365
$$ 171876 182617 186658 231824 283027 299369 297027 280218 238930 183008 141137 119150 178515
12030A78515K3820j2598l0644k1079r564j0932K0864m1878k867J1465M5930Q3853
$$ 178515 202335 189737 159093 138014 128450 117518 138382 96504 93637 105102 151032 234885
12018B34885L0154l0589l324k0154l0474O509j905l3595n0869L9915L7907j6268
$$ 234885 265039 234450 231126 210972 180498 187007 185102 151507 100638 140553 178460 162192
12006A62192L2550M1117L2407M6945q911j993k0554j8906j6988Q004K9009j4329
$$ 162192 194742 235859 268266 315211 306300 304307 283753 264847 247859 255863 284872 270543
11994B70543L3074L5447k5789l0301J4167M5507j7367J127P727L677l2437M442
$$ 270543 303617 339064 313275 282974 297141 342648 325281 326408 334135 337812 305375 309817
11982C09817L4582L9939M5422J7011K0461N3251N3759J8448K2049Q6480R0371
$$ 309817 344399 384338 429760 446771 467232 520483 574242 592690 614739 701219 791590
11971G91590N6163J06161P2268J01729J40627J84927J44417J55292J81394K12170
$$ 791590 847753 953914 1026182 1127911 1268538 1453465 1597882 1753174 1934568 2146738
11961B146738K37442K26530L22966L57010L62021M86190O21313Q12358J025053
$$ 2146738 2384180 2610710 2933676 3290686 3652707 4138897 4760210 5572568 6597621
11952F597621J347928J845224K799535M137590O299504R050798J1147839R968485
$$ 6597621 7945549 9790773 12590308 16727898 23027402 32078200 43226039 53194524
11944E3194524P254539O458119N734922M846369M592851N047251L892536j691659
$$ 53194524 60449063 66907182 72642104 77488473 82081324 87128575 91021111 89329452
11936H9329452n142575l141316k206658l674557n708081o922950q075632j0532171
$$ 89329452 84186877 81045561 78838903 75164346 69456265 62533315 54457683 43925512
11928D3925512j0506078p834742n204716l442413k475624j869363j515816j259050
$$ 43925512 33419434 25584692 20379976 16937563 14461939 12592576 11076760 9817710
11920I817710j037381r56465q25698o37565m81577l01692j85300j27335n0085
$$ 9817710 8780329 7823864 6998166 6360601 5879024 5577332 5392032 5264697 5214612
11911E214612J4082P0331P1536Q3284J11699J51437K61132L48908L89347N39311
$$ 5214612 5228694 5299025 5370561 5453845 5565544 5716981 5978113 6327021 6716368 7255679
11901G255679P45582R21146J068735J377297J938754K790208M061014O044724
$$ 7255679 8001261 8922407 9991142 11368439 13307193 16097401 20158415 26203139
11893B6203139Q936266J1759575J2512305J5055830J8464404J6841451J2443671
$$ 26203139 35139405 46898980 59411285 74467115 92931519 109772970 122216641
11886A22216641J0240038J1625153Q172399L157856M018261M867602k572819j0806151
$$ 122216641 132456679 144081832 152254231 155412087 159430348 164297950 161725131 150918980
11878A50918980r478271n991584r738714j4056247j4857635j4122553j6112475
$$ 150918980 141440709 135449125 125710411 111654164 96796529 82673976 66561501
11871F6561501j6446088j2193869q047257n393133l859839k984022k334207j830588
$$ 66561501 50115413 37921544 29874287 24481154 20621315 17637293 15303086 13472498
11863A3472498j484695j221381r83523q32971p09130n92926m59975l39864l20116
$$ 13472498 11987803 10766422 9782899 8949928 8240798 7647872 7187897 6848033 6527917
11854F527917l18399k29392j53208j81718j03483l2758M7178K09115L36355M58150
$$ 6527917 6209518 5980126 5826918 5645200 5541717 5508959 5556137 5765252 6101607 6559757
11844F559757N55105N73057P05403Q41729J058706J463743K282129L430498M969882
$$ 6559757 7114862 7687919 8393322 9235051 10293757 11757500 14039629 17470127 22440009
11835B2440009P085673R134068R075953P571860N865280N084244M355306L427449
$$ 22440009 29525682 38659750 47735703 55307563 61172843 66257087 70612393 74039842
11827G4039842M285465L702389R7419l719319m517990k878786l030136m816947
$$ 74039842 78325307 82027696 82125115 78405796 73887806 71009020 67978884 63161937
11819F3161937n879327p268415q753953r492011q061900n567472l668380k485187
$$ 63161937 57282610 50014195 41260242 31768231 23706331 18138859 14470479 11985292
11811A1985292j875913j442747j166972q84275p32569o58129o20015n06978l04376
$$ 11985292 10109379 8666632 7499660 6615385 5882816 5224687 4604672 4097694 3793318
11802C793318k77052k26498k60123k33150j97683k13395k04670j02015j03823
$$ 3793318 3516266 3289768 3029645 2796495 2598812 2385417 2180747 2078732 1974909
11793A974909p9888j00426q2016p7483p7495j02109j02510j07845k5621K1089
$$ 1974909 1895021 1794595 1712579 1635096 1557601 1455492 1352982 1245137 1219516 1240605
11783A240605j1412l1081o5184m6044p4430n8756j04811o007J7382n826j80m3035
$$ 1240605 1229193 1198112 1132928 1086884 1012454 953698 848887 842880 860262 854436 854256 811221
11771H11221m0091l6021o3918m4911L0752k5344j7727M7l904o7822L8635L5002
$$ 811221 771130 735109 671191 626280 657032 631688 613961 614008 610104 542282 580917 615919
11759F15919m0136m2370k6739l4222L390j6246K2227P918N2601o0259o0301j8295
$$ 615919 575783 533413 506674 472452 475842 459596 481823 489741 542342 482083 421782 403487
11747D03487j4314K0105J9090j8484o1891o2115N2491O5057k1225n6185K3778
$$ 403487 389173 409278 428368 409884 347993 285878 338369 403426 382201 326016 349794
11736C49794k0146K3719O4354r642k215Q9452P2274o847o641Q3717L6264n7633
$$ 349794 329648 353367 417721 408079 405864 495316 567590 560743 554102 637819 674083 616450
11724F16450l2630L9162m1087j00583o4727n3935k9875K828j9013j1138m5428
$$ 616450 583820 622982 581895 481312 416585 362650 332775 335603 316590 305452 260024
11713B60024k4359k5300O441N0937n93M829j6400J3534o775l1388k1281k5214
$$ 260024 235665 210365 216806 267743 267150 271979 255579 269113 262338 230950 209669 184455
11701A84455L1550O4423L2201J392m2084j0463M2380L6640j4894p7936k851J6247
$$ 184455 216005 280428 312629 314021 271937 261474 303854 340494 325600 247664 244813 261060
11689B61060l1799K8927K0053m6070l4103L555J7040L5345L5881K512m7676K4426
$$ 261060 229261 258188 278241 232171 198068 201623 218663 254008 289889 292401 244725 269151
11677B69151L412M9617M3195m182n9817m3883R487J3173N2178k545j03443n0619
$$ 269151 272563 322180 365375 361193 301376 257493 266980 280153 332331 329786 226343 175724
11665A75724j5383r786l0179R924P821l580J4563l5428L7498P8890J8303K2503
$$ 175724 160341 150555 120376 130300 138121 134541 149104 113676 151174 230064 248367 270870
11653B70870K5002m1174j5355J0844n8107j6754l1147l7050K1809L3879j661K1384
$$ 270870 295872 254698 239343 250187 192080 175326 144179 107129 128938 162817 161156 182540
11641A82540k2457n7760k3478M0541oQ722k885m6258l9235K2533L0978N8375K5801
$$ 182540 160083 102323 78845 119386 119380 128102 125217 78959 39724 62257 93235 151610 177411
11628A77411n774m9704k4153l3974K5100P3590m0986p0088k2785L13m5833L8567
$$ 177411 171637 121933 97780 63806 88906 162496 121510 51422 28637 28950 -16883 21684
11616B1684K8001Q3825O7672l9157K9068J4724n1757l3544K2240k0830j4062J7828
$$ 21684 49685 133510 201182 162025 191093 205817 154060 120516 142756 121926 107864 125692
11604A25692Q214N583n977Q974L2472j3105q3426P122L5113J678m3032l114J5441
$$ 125692 133906 139489 133512 142486 174958 161853 78427 85549 120662 122340 79308 76194 91635
11591I1635J3981J770J4172O834l9175k2183K2400J5444J54k8924l1869P5350
$$ 91635 105616 107386 121558 128392 89217 67034 89434 104878 105032 76108 44239 119589
11579A19589P6969l6115p6849o4502J0467k1575j6284K3488j8282l7666M5045
$$ 119589 196558 160443 83594 19092 29559 7984 -8300 15188 -3094 -40760 4285
11568D285P5919K7374q577p578M1904j021l4923K3654p983P143n398k7874n2215
$$ 4285 80204 107578 99001 91423 133327 132306 97383 121037 113054 120197 114799 86925 34710
11555C4710K9490O2485j9675q6228l9046J8123L6144M5233n88P114K7062n3836
$$ 34710 64200 126685 107010 20782 -18264 -141 36003 81236 80648 87762 114824 60988
11543F0988l3531j3932J6106k228L3371J3151l1596n4002K0818l602J0173l3545
$$ 60988 27457 13525 29631 27403 60774 73925 42329 -11673 9145 5543 15716 -17829
11531a7829l4329L7609l6441j6602N7623Q2961l065K5085l211j0613j5096L488
$$ -17829 -52158 -14549 -50990 -67592 -9969 72992 69927 95012 91801 81188 66092 69580
11519F9580M0039l4032O2515Q4144j4944J2309Q6265O0789K8932p984K8593P0920
$$ 69580 109619 75587 138102 222246 207302 219611 305876 366665 395597 387613 416206 487126
11507D87126L8470m826l2314k1283n9801J547N4068l0424l9711p3059o9600q4173
$$ 487126 525596 520770 488456 467173 407372 408919 462987 432563 392852 319793 250193 166020
11495A66020l3336P332K1650j6792k8236l0971l7411p0385m0150L4441q573j2742
$$ 166020 132684 140016 161666 144874 116638 85667 48256 -22129 -62279 -27838 -36411 -49153
11483d9153M2396j0496M3690L7284j2469L2136j8683J2911l533N09J5117m024
$$ -49153 -6757 -17253 26437 63721 51252 83388 64705 77616 74083 74592 89709 85685
11471H5685j7894K6084P295k1545m1762k7216J477J5838K377Q9889J02084N6454
$$ 85685 67791 93875 101170 79625 37863 10647 12124 27962 30339 120228 222312 278766
11459B78766Q8503J22330M1073O6767R9109R411M8895Q1687N3401K1734k9686
$$ 278766 367269 489599 530672 597439 696548 705959 754854 836541 889942 911676 881990
11448H81990k4321o5943l7485k6944k3526n1727l8470j28730j58169q7164n4539
$$ 881990 857669 791726 754241 727297 703771 652044 613574 484844 326675 239511 184972
11437A84972n2999k8569P154o9301L1526K7650l5343k0021j3760R833K5742M0420
$$ 184972 131973 103404 110558 41257 72783 100433 65090 45069 31309 41142 66884 107304
11425A07304J6378k2888K8022j1284l0802m6641m5557k6742K550M4378M8935K962
$$ 107304 123682 100794 128816 117532 86730 40089 -5468 -32210 -29660 14718 63653 66615
11413F6615L8380N731N864J3683J4528l3266l4623J0527j3925J0873K4715J27726
$$ 66615 104995 110726 116590 130273 144801 111535 76912 87439 73514 84387 109102 236828
11401B36828Q9412P1561j7987J8435J4022l4605k8926K1325M3097r55o5639Q581
$$ 236828 326240 397801 379814 398249 412271 377666 348740 370065 413162 412207 346568 355149
11389C55149J0146P860l381l1071m2672n4379j20045n7966O34K6078j2592l7784
$$ 355149 365295 373155 369774 338703 296031 241652 121607 63641 64275 90353 77761 39977
11377C9977n3281m1148M172L1164P1147L0159l1650k5535M2211J9155l7006k1947
$$ 39977 -13304 -54452 -50280 -19116 52031 82190 50540 25005 67216 86371 49365 27418
11365B7418L358N6694N799l5773o8148m8440L3581M6260R361k7301m470L785J6879
$$ 27418 30776 87470 93269 57496 -10652 -59092 -25511 20749 30110 2809 -1661 2124 19003
11352A9003N7176m568p752j6998k2412L6043M4576O757l0388L9436k5272k4404
$$ 19003 76179 71611 63859 46861 24449 60492 105068 111825 81437 120873 95601 71197
11340G1197n934K5420Q187m728q1577P244J39135R105n6997l8263K8869K5161
$$ 71197 65263 90683 98870 94142 12565 19809 158944 168049 111052 72789 101658 126819
11328A26819j0692o0519O730p4628m5227M0155J3438k3975o774k4130l6496k798
$$ 126819 116127 55608 62338 -12290 -57517 -17362 -3924 -27899 -34673 -58803 -95299 -98097
11316i8097M4339N5708O7165L0866n6863l623K0478J5152r072k1862J8741p737
$$ -98097 -53758 1950 69115 99981 43118 39495 59973 75125 66053 44191 62932 55195
11304E5195n4627j2856m8358r328J22516J6141R240J270m4747o6835J3085m148
$$ 55195 568 -12288 -60646 -69974 52542 68683 77923 79193 34446 -32389 -19304 -23452
11292b3452Q148M4177n569k4941l3558l3918k8297L7313O5630M8627j4731q7673
$$ -23452 -15304 28873 23304 -1637 -35195 -69113 -97410 -60097 5533 54160 39429 -48244
11280d8244o2520J2096O5792q380K9904J6441O920k3919j1026O4277K4651l9990
$$ -48244 -110764 -98668 -32876 -41256 -11352 5089 12009 -11910 -22936 41341 65992 26002
11268B6002m6781J5438j3461j7433j7083l0056k540P008M9042J4565J7302l4532
$$ 26002 -20779 -5341 -18802 -36235 -53318 -83374 -85914 -78906 -29864 -15299 2003 -32529
11256c2529n2186P275O100L2041Q0772m658n515j7724J7961j2210o774j8162q018
$$ -32529 -84715 -77440 -71340 -39299 41473 36815 31300 13576 31537 19327 12553 -5609 -13627
11243a3627j6616k2819R004N9716j8756j4258M5226P841k9823K7471l3051Q432
$$ -13627 -30243 -53062 -44058 15658 -3098 -17356 27870 35711 5888 33359 308 8740
11231H740l7043K300N9889O1879n0629p3809L6822k3840m3235k7806O6027L6709
$$ 8740 -28303 -26003 33886 95765 45136 -28673 8149 -15691 -58926 -86732 -20705 16004
11219A6004n1893k0170K7263m814M425J2850N0613o4356p0362l6110L1824O1021
$$ 16004 -35889 -56059 -28796 -33610 -29185 -16335 34278 -30078 -100440 -136550 -104726 -43705
11207d3705M0223J1960m3872k8980K2391L8383J6147l0612l3989J7823K761Q474
$$ -43705 -3482 8478 -35394 -64374 -41983 -3600 12547 -18065 -52054 -34231 -31470 -22996
11195b2996o954m2152j2515P2562J7060M986J27j1750l8987L9526p5213J0892
$$ -22996 -29950 -72102 -84617 -12055 5005 9991 10118 -1632 -40619 -1093 -76306 -65414
11183f5414R6112k1126o0037L6907R5975p173M2203k0847j19219k8212k5172P000
$$ -65414 30698 9572 -50465 -13558 82417 75244 117447 96600 -22619 -50831 -76003 -69003
11171f9003L7225l1664J2554L3294M6843m0124o1523m3186L5389K5625J4707M9167
$$ -69003 -31778 -63442 -50888 -17594 29249 -10875 -72398 -115584 -80195 -54570 -39863 9304
11159I304k64k6883l365k6315K776J5992j4206k7269k101k0397j8855N8282Q4048
$$ 9304 9040 -17843 -21208 -47523 -44747 -28755 -42961 -70230 -72331 -92728 -111583 -53301 30747
11146C0747j1660k0041O7264O6192o2265k3193P563m9269K1320L0121K8254l8035
$$ 30747 19087 -954 66310 132502 70237 47044 54607 5338 26658 56779 85033 46998
11134D6998k1157l3696j06643Q686j4513m493K7430O1924j384O1008L5629J9400
$$ 46998 25841 -7855 -114498 -105812 -120325 -124818 -97388 -35464 -36848 24160 59789 79189
11122G9189o5530J7888N234J1734N6014j4207q8311m2602m685n673L5871M6980
$$ 79189 13659 31547 36781 48515 104529 90322 2011 -40591 -45276 -50949 -15078 31902
11110C1902k7504q9456k9955L4282K3905N1211j7145J2152P1530j8945p2402k5724
$$ 31902 4398 -85058 -115013 -80731 -56826 -5615 -22760 -10608 60922 41977 -30425 -56149
11098e6149j4335L319J1965j9974k8381K556L1452k938o1565j8251J5679j7258
$$ -56149 -70484 -67165 -55200 -75174 -103555 -100999 -69547 -72485 -134050 -152301 -136622 -153880
11086a53880L2882P1805O7677M8304J26n0503k5476L9570M4183k5510l5167N61
$$ -153880 -120998 -49193 18484 66788 66914 16411 -9065 30505 74688 49178 14011 14572
11074A4572J1351j2496M8414o642l8637m6851n8803N0480M404k2433J6519K7184
$$ 14572 25923 13427 61841 55199 16562 -30289 -89092 -38612 -34208 -56641 -40122 -12938
11062a2938Q6494M4258o7970Q732l9457J5283J661k3141o817L135N8778N493o6978
$$ -12938 73556 117814 49844 58576 19119 34402 36063 12922 6105 9240 68018 73511 6533
11049F533j7524k6831k1742M9593L6370k2033l027R08R401k3151J091J7646K202
$$ 6533 -10991 -37822 -59564 -9971 26399 4366 1339 2247 11648 -11503 -10412 7234 9436
11036I436k7979n3557N9095P7581p3923J437L4338J9793j7026m8648K7995n380
$$ 9436 -18543 -72100 -13005 64576 -9347 -7910 26428 46221 29195 -19453 8542 3162
11024C162L062N097K640j8353R221k123l74l1471m2644l5181M5666O8111K8884
$$ 3162 6224 11321 13961 -4392 4829 2706 2332 -29139 -71783 -106964 -61298 6813 35697
11011C5697n7891l3601L6512P775j5815M654J3568M1759k0016n0762L2288M5883
$$ 35697 -22194 -55795 -19283 -11508 -27323 -22669 -9101 32658 12642 -38120 -5832 40051
10999D0051J9290k0379m1522J2711K9574R2817o1348k2890L8244k7647o9961n1772
$$ 40051 59341 38962 -2560 10151 39725 132542 71194 48304 86548 58901 -11060 -62832
10987f2832j5221K0622O0142n1357M644l163J1727k8945J7938N0410K7858J2519
$$ -62832 -78053 -57431 2711 -48646 -44002 -47165 -35438 -64383 -46445 3965 31823 44342
10975D4342M2946m8160m6077K5175q88J6714p690n941k0031J7580K0216j7479
$$ 44342 87288 39128 -6949 18226 17338 34052 26362 20421 390 17970 38186 20707
10963B0707m8755J2137k9696k0699j1352J9550M0940N1783r78J8485j3189m8442
$$ 20707 -28048 -15911 -45607 -66306 -77658 -58108 -17168 34615 33637 52122 38933 -9509
10951i509p5834O049L1777M8843k7767q63J3081K7018j0904m7007O1740j5865
$$ -9509 -85343 -79294 -47517 1326 -26441 -27304 -14223 12795 1891 -45116 16624 759
10939G59l8998l270J7945J3643L0346L1228m6230o1421l704L1293l817k8162M8926
$$ 759 -38239 -41509 -23564 -9921 20425 51653 5423 -55998 -59702 -28409 -32226 -60388 -11462
10926a1462j0061k7889Q3903K4078j1006O0722K5013p7419k8615j1313q089L8043
$$ -11462 -21523 -49412 34491 58569 47563 108285 133298 55879 27264 15951 7862 45905
10914D5905k1308j5682K593k431L0768J3336J8531j7572o0454j2709k8851L656
$$ 45905 24597 8915 11508 9077 39845 53181 71712 54140 -6314 -19023 -47874 -44218
10902d4218P1483J3123Q9986m1879l4195k4775l9195n8242N155K2578M3484L5006
$$ -44218 27265 40388 130374 88495 54300 29525 -9670 -67912 -62757 -40179 3305 38311
10890C8311p1997n8263m1601L317K0851N5463j0465K244J2031P477M1186k9128
$$ 38311 -33686 -91949 -133550 -130233 -109382 -53919 -64384 -62140 -50109 -42632 -1446 -30574
10878c0574J548P6958M1772m0223l1689r6586p024n328j8273O700O2876K0686
$$ -30574 -29026 47932 89704 49481 17792 -78794 -85818 -91146 -109419 -102719 -39843 -19157
10866a9157j7589k1780L5439L1309n6783J384n4785k282N2354L6870J5289j5750
$$ -19157 -36746 -58526 -23087 8222 -48561 -47177 -101962 -104244 -51890 -15020 269 -15481
10854a5481k0731l0089J5018L7650l1107l2516k4488J1074R664k3735n342O3926
$$ -15481 -36212 -66301 -51283 -13633 -44740 -77256 -101744 -90670 -81006 -104741 -110083 -46157
10842d6157K0285M9487K7743k6530J36J3549O208j4632m2196M6880M0250k1944
$$ -46157 -25872 23615 51358 24828 24964 38513 44721 30089 -12107 34773 75023 53079
10830E3079q1945J9462l3466j2657L99N784L4453l5507l6623J05491K8073o3537
$$ 53079 -28866 -9404 -42870 -55527 -55128 -49344 -14891 -50398 -87021 18470 46543 -16994
10818a6994k984M0511k3108k26N361k0851j4349O5696Q584j4529l9178n6220n015
$$ -16994 -19978 20533 -2575 -2801 2560 -18291 -32640 33056 41640 27111 -12067 -68287 -73302
10805g3302j5043M3494K5661P250N1854k756j53J0943N2247N4289m192o3466m7045
$$ -73302 -88345 -44851 -19190 -11940 39914 37158 37005 47948 100195 154484 150292 86826 39781
10792C9781r2467J9443Q424k3852M5972K8849j1675j7830J2013k365k4218j9863
$$ 39781 -52686 -33243 -24819 -48671 -2699 26150 14475 -3355 8658 6293 -17925 -37788
10780c7788k1832L857O1030p400J3499j1521l6909J5974L9360R286k5217k9594
$$ -37788 -59620 -55763 5267 -2133 11366 -155 -37064 -21090 18270 27556 2339 -27255
10768b7255M3419J2817o3873l7354K3333L3207m039K3723P042j477j8359o3918
$$ -27255 16164 28981 -34892 -72246 -48913 -15706 -19745 3978 11020 9543 -8816 -72734
10756g2734k681K4310M2584M7731P855n7822q7446J5294K5034J9442l3162j7304
$$ -72734 -75415 -51105 -8521 39210 47065 -10757 -98203 -82909 -57875 -38433 -71595 -88899
10744h8899M4250J01954L7761k9400K2097m7117q5967p1255L4299L8643K4940
$$ -88899 -44649 57305 95066 65666 87763 40646 -45321 -116576 -82277 -43634 -18694
10733a8694j1549m7301K5041O8765j5087k9102p187n1157l1252K2468M0573L8937
$$ -18694 -30243 -77544 -52503 16262 1175 -27927 -35114 -86271 -117523 -95055 -54482 -15545
10721a5545k0690j3937K866m1698l4136K6360L1334N5921Q448j8474j2154j1721
$$ -15545 -36235 -50172 -47306 -89004 -123140 -96780 -65446 -9525 -1077 -19551 -31705 -43426
10709d3426M836J6659m6134k9314M2751l3452l9206J0771L2060M1405q57j4855
$$ -43426 -38590 -21931 -68065 -97379 -54628 -88080 -127286 -116515 -84455 -43050 -43907 -58762
10697e8762K5806P7049J9612l6175k8881J4174M2416l3928o456m0030j9616k7518
$$ -58762 -32956 44093 63705 27530 -1351 12823 55239 21311 14855 -25175 -44791 -72309
10685g2309P889M1608O7564j8705K9667J1049m5958l6873N7375n5463L1297M2623
$$ -72309 -64420 -22812 44752 26047 55714 66763 20805 -16068 41307 -14156 17141 59764
10673E9764j0635j02068K099j1042J8457O5804K3783m4573j3293j094J2203J7688
$$ 59764 49129 -52939 -50840 -61882 -43425 22379 46162 1589 -11704 -12798 -595 17093
10661A7093m1990k2163j5984J3223P0326j6777L741K9438L11q732o9600M460K4538
$$ 17093 -24897 -47060 -63044 -49821 20505 3728 7469 36907 37218 28486 -41114 -36654 -12116
10648a2116N7783L8328j5991J3237M5496q990n0738m8956j6047j8748k068N4923
$$ -12116 45667 83995 68004 81241 126737 117747 67009 18053 2006 -16742 -18810 36113
10636C6113m6959K0349K2829o726O1680m9504j9986K663L4101O0428L5948m7314
$$ 36113 -10846 9503 32332 25606 87286 37782 17796 20459 54560 114988 150936 103622
10624A03622n9307n8679j1704J3634L4570J695o769l2991J4629L1924j9459m3605
$$ 103622 44315 -14364 -26068 -12434 22136 23831 17062 -15929 -1300 30624 11165 -32440
10612c2440k921L8320N8008j5803o7791R47K149R221K428l2792k0272Q9714N920
$$ -32440 -35361 2959 60967 45164 -22627 -21680 -19531 -10310 -7882 -40674 -60946 28768 34688
10599C4688p9883M249O064k2630k0923L2843K7161J9683J7188O2720m1555o7366
$$ 34688 -45195 -40946 -34882 -57512 -78435 -45592 -18431 1252 18440 81160 39605 -27761
10587b7761p349q60j0764j10092K155L641J0175O7415L5477n222q701j4852k1822
$$ -27761 -35110 -35970 -46734 -156826 -154671 -151030 -140855 -73440 -37963 -43185 -51886 -66738 -88560
10574h8560j9314N3694K9322p181N2394N4056J6594l2674k169k1540l7669N381
$$ -88560 -107874 -54180 -24858 -32039 20355 74411 91005 58331 56162 34622 -3047 2334
10562B334l1269M389r246j5817j9880n162n27Q212K6208J4031K388k7534k3645
$$ 2334 -28935 -24546 -33792 -49609 -69489 -74651 -75178 -66966 -40758 -26727 -24339 -51873 -75518
10549g5518M9111Q0228M9684j6913r3197q2066m2339l0833m4401N931N2584N6908
$$ -75518 -26407 53821 103505 86592 -6605 -88671 -131010 -161843 -206244 -200313 -147729 -90821
10537i0821O9979n3884r450K9949Q651R900o5479k7997J3364O8988M694l4876
$$ -90821 -20842 -74726 -84176 -54227 -45576 -35676 -101155 -129152 -115788 -46800 -42106 -76982
10525g6982J0878L8371K1828K6574j2777J1545J0434M95P186O3597J2570m5033
$$ -76982 -66104 -27733 -5905 20669 7892 19437 29871 30366 37552 101149 113719 68686
10513F8686m3465K8208N117j5062n4456k3177n18k8531J188m394N4143L2485l0377
$$ 68686 25221 53429 58546 43484 -10972 -34149 -34667 -63198 -62010 -66404 -12261 20224 -10153
10500a0153k0976L3724J3040L2304j8666q911n2758j2014N0170l152K2281k052
$$ -10153 -31129 2595 15635 47939 29273 20362 -32396 -44410 5760 2608 24889 22837
10488B2837l7588m094n4339k0242M5857J9734l6271L636J2055K5797N3329J9146
$$ 22837 -14751 -18845 -73184 -93426 -47569 -27835 -64106 -60470 -48415 -22618 30711 49857
10476D9857N3347j5882n3961n9875m7454Q4567K1017R008M795l5346m6057J7840
$$ 49857 103204 87322 33361 -26514 -73968 10599 31616 40624 45419 10073 -35984 -18144
10464a8144K9452l1567l684M5670N2147J3419K4604r110K6531P0635J5642l2730
$$ -18144 11308 -20259 -23943 21727 73874 87293 111897 102787 129318 199953 215595 182865
10452A82865J844M0348k2282K816l7726J8870j1354o9650p8087o3809J186J7127
$$ 182865 184709 225057 202775 205591 167865 186735 175381 105731 27644 -36165 -34979 -17852
10440a7852R042L855L8395J9127o2298k8224O422j8587o6439Q681J1822J3300
$$ -17852 -8810 -4955 33440 52567 -9731 -37955 -31533 -50120 -116559 -107878 -96056 -82756
10428h2756N2351L2564o1043j4635o1478m4718M372N7784J18209K5386o9014q326
$$ -82756 -30405 2159 -58884 -73519 -134997 -179715 -175343 -117559 650 26036 -42978 -51304
10416e1304Q545N6990N1081K1927m935o621k6408n5385m9317r548M0828k351O036
$$ -51304 -42759 14231 65312 87239 82304 75683 49275 -6110 -55427 -64975 -24147 -26498 -20462
10403b0462J7044j406O095m6979j2122m3629N1032R5059M2711p2820n8253p689
$$ -20462 -3418 -4824 1271 -45708 -57830 -101459 -50427 44632 87343 14523 -43730 -51419
10391e1419O1723q252n9027l5714N8138L719Q279L2398L5300n490j0747j5781
$$ -51419 10304 2052 -56975 -92689 -34551 -30832 -22553 9845 45145 39655 28908 13127
10379A3127j8487Q769N3563m2481o1277K3516j9228q99L8098K5887m5871j878
$$ 13127 -5360 3409 56972 14491 -46786 -23270 -42498 -43397 -5299 20588 -25283 -27161
10367b7161L062M986p292k3431l7986L7160L440k6622l519K4723K4536M3890J8787
$$ -27161 -24099 -19113 -26405 -49836 -87822 -50662 -47222 -73844 -77363 -52640 -28104 15786 34573
10354C4573k3274n1316m570n534l6516j5543k1923K0545j9880J294O1757j7879
$$ 34573 11299 -40017 -44587 -50121 -86637 -102180 -124103 -103558 -123438 -122144 -60387 -78266
10342g8266J8274P371n007o0540N8695O337j9870P681J6947M8833K9623l6296
$$ -78266 -59992 -52621 -57628 -118168 -59473 -53136 -73006 -65325 -48378 455 30078 -6218
10330f218j1948r515K4142J7873J7253j588J720p4188q8240L6859M6302q915n3198
$$ -6218 -18166 -27681 -3539 14334 31587 29999 31719 -42469 -130709 -93850 -47548 -56463 -109661
10317a09661j9709J1375L0154N391N6812P1882K1692l9147l0229j0006k0374q806
$$ -109661 -129370 -117995 -87841 -82450 -25638 46244 67936 28789 -1440 -11446 -31820 -40626
10305d0626M1272L0301M2330Q4368j8444n0387n3327n7772k3174j2724K6467k5849
$$ -40626 646 30947 73277 157645 139201 88814 35487 -22285 -45459 -58183 -31716 -57565
10293e7565j9609j7615Q150K5395P2026O3961q355l3762j5100O019k2500j1265
$$ -57565 -77174 -94789 -86639 -61244 10782 74743 66388 32626 17526 23545 1045 -10220
10281a0220l729M119K4010j2869m0322m64J6863l7242n8170J4737L5333P7864
$$ -10220 -13949 -9830 14180 1311 -39011 -39475 -22612 -59854 -118024 -103287 -67954 9910
10269I910r875n7003P8436O0598p1802l5495M4490J4638K689l6897r8218m5657
$$ 9910 35 -56968 21468 82066 10264 -25231 19259 33897 36586 -311 -98529 -144186
10257a44186N3137M1619O64J6499K6378J8165L1891m0279j1797K3126k3408l2774
$$ -144186 -91049 -49430 -48766 -32267 -5889 12276 44167 3888 -7909 15217 -8191 -40965
10245d0965L7626l1697m4450K7945p92R259j2898P2849K166R972L3102K3208p2441
$$ -40965 -3339 -35036 -79486 -51541 -52333 -43074 -55972 16877 19043 29015 62117 85325 12884
10232A2884n2396J5841k046R466K225L1733J7649L6187K876j4021p2784P395N1020
$$ 12884 -39512 -23671 -25717 -16251 -14026 17707 35356 71543 74419 60398 -12386 -4991 46029
10219D6029o382L543K3209M4225O797P864j0107r9512j1625J943N3537L180o0596
$$ 46029 39647 43190 66399 110624 117421 125285 115178 15666 4041 5984 59521 62701 2105
10206B105p8803k7517N2178K1375l3769l875P2704M198m2960o526M0851J1208
$$ 2105 -76698 -104215 -52037 -30662 -64431 -68306 4398 8596 -34364 -40890 -39 11169
10194A1169k74r572k67l3420J4184J5188M5588K1394o521K0634O560l3469K4773
$$ 11169 10895 1323 1056 -32364 -18180 -2992 42596 63990 57469 78103 84663 51194 75967
10181G5967J3498L3349K224J0907k9411j36890r0870J3205M1826K3790q675m9874
$$ 75967 89465 122814 125038 135945 106534 -30356 -121226 -108021 -66195 -42405 -51080 -100954
10169a00954j0949M8732k5403m5466O439l1472j632O8221M5370M8182m276r5475
$$ -100954 -111903 -63171 -88574 -134040 -127601 -159073 -160705 -92484 -47114 1068 -3208 -98683
10157i8683p3167j034L6980P2924J3272m6673K5426M9505Q0461Q16n386l0068
$$ -98683 -171850 -172884 -135904 -62980 -49708 -96381 -70955 -21450 59011 59827 54441 24373
10145B4373M662J034q2124l2413L3159J9337J8067K3841j7110j8269o306K73K1858
$$ 24373 29035 30069 -52055 -84468 -51309 -31972 -13905 9936 -7174 -25443 -31749 -31476 -9618
10132i618M0850k030k8909m9366K1038J7014M3505J6454j5915K0547N0914l8707
$$ -9618 31232 29202 293 -49073 -28035 -11021 32484 48938 33023 53570 104484 65777
10120F5777o913j4622o2890K2449L3878l2524m4450l7925L8908O9187K3168J0184
$$ 65777 58864 44242 -18648 3801 37679 5155 -39295 -77220 -38312 30875 54043 64227
10108F4227K40L1361r249m3094m5425J0412l5619j0695O0923L8690M0964k7231
$$ 64227 64467 95828 86579 43485 -1940 8472 -27147 -37842 23081 61771 102735 75504
10096G5504l7606k2130l5051K6797P2906M5877K7049j1387j1144m0022L4949J9608
$$ 75504 37898 15768 -19283 7514 80420 126297 153346 141959 130815 90793 125742 145350
10084A45350m0020o971K6786N0746m2734L8218j0680n006K8456Q0286N9530N8833
$$ 145350 105330 98359 125145 175891 133157 171375 160695 155689 184145 264431 323961 382794
10072C82794J05494J14073N2255J34628K55665L08862o9256j13802j0365J52497
$$ 382794 488288 602361 654616 789244 1044909 1353771 1284515 1170713 1160348 1312845
10062A312845K35346K58809K60326L27491N63690R50109J430563K426674M564334
$$ 1312845 1548191 1807000 2067326 2394817 2958507 3908616 5339179 7765853 12330187
10053A2330187Q522518J5564154K5820526L8286460P293266m4229374k9156068
$$ 12330187 20852705 36416859 62237385 100523845 107817111 63587737 34431669
10046C4431669j2976560o581100l855358k446923j746299j348161j000987p02689
$$ 34431669 21455109 14874009 11018651 8571728 6825429 5477268 4476281 3773592
10038C773592o16806m96479l46139k83937k03352j32960p0055L8004R4639k81794
$$ 3773592 3156786 2660307 2314168 2030231 1826879 1693919 1623864 1661868 1756507 1474713
10028A474713k99727j86020j28203j5193o8996n7678o4903n1922n780k1116r9939
$$ 1474713 1174986 988966 860763 845570 776574 718896 653993 602071 596291 575175 475236
10017D75236j4199l5358p8883m9867K4254M1313j9911j0029m6698n5000L093j6889
$$ 475236 461037 425679 346796 296929 321183 362496 342585 332556 285858 230858 233951 217062
10005B17062k4821P011k5473k8990M4043m3901k7443o5771m2305O5664M8928M5110
$$ 217062 192241 199252 173779 144789 188832 144931 117488 51717 9412 75076 124004 169114
9993A69114k4098k9474J6105K7607n2433n3548M5062o465o9152k0719N8434j3475
$$ 169114 145016 115542 131647 159254 106821 53273 98335 91870 22718 1999 60433 46958
9981D6958Q66k156J0026k2015J7922J5320n7016j8794M0346L9529m3393k5613
$$ 46958 47824 45668 55694 33679 51601 66921 9905 -8889 31457 70986 27593 1980
9969A980m6877K1816N0008j7930J3084P2757r984k6123n0133m0430l0766P2631
$$ 1980 -44897 -23081 26927 8997 22081 94838 84854 58731 8598 -31832 -62598 10033
9957A0033L9203J5674n2692l4740m2115m0522j1829L5399K9325M4253J097l9144
$$ 10033 49236 64910 12218 -22522 -64637 -105159 -116988 -81589 -52264 -8011 -6914 -46058
9945d6058m4972L2596N5380L6547J1771K2256M5781J2897k2217m6815k1020J2267
$$ -46058 -91030 -58434 -3054 33493 45264 67520 113301 126198 103981 57166 36146 48413
9933D8413K9940j464n3206m3848M5218P9423M3132K4137m4144J4141l3762O8378
$$ 48413 78353 76889 23683 -20165 25053 104476 147608 171745 127601 141742 107980 176358
9921A76358N1975p5803k5449o8313m9656L833M4233n0346k6103N0328k3333j1253
$$ 176358 228333 152530 127081 58768 9112 12945 57178 6832 -19271 31057 7724 -3529
9909c529M1582l7861m8497K552l2923k6135M6145N6937L4613M1618M1316l3064
$$ -3529 38053 192 -48305 -45753 -78676 -104811 -58666 -1729 32884 74502 115818 82754
9897H2754n2003k313N495j6219j9556k2964L8021J4625m7030J729n404o0291Q965
$$ 82754 30751 28438 33933 17714 -1842 -24806 13215 27840 -19190 -17461 -22865 -83156 -74191
9884g4191L8292l7884N664K0474J9696l3190n677o24l0469M5910M7061l9165l2520
$$ -74191 -35899 -73783 -68119 -47645 -27949 -61139 -66816 -67440 -97909 -51999 -4938 -44103 -76623
9871g6623K8554N9480Q7842K0879k3864n0202o3305j6966p857l5936m1538M4525
$$ -76623 -48069 11411 99253 120132 96268 46066 -17239 -34205 -42062 -77998 -119536 -75011
9859g5011O3909K1236K8375j5602o3493k1310j0090J6954l4527r731O208M9361
$$ -75011 -11102 10134 38509 22907 -40586 -61896 -71986 -55032 -89559 -99290 -93082 -43721
9847d3721L1732m3871M5278n122n449j5406j0295m520L402L3680L700K0051L6789
$$ -43721 -11989 -55860 -10582 -15704 -21153 -36559 -46854 -51374 -47972 -14292 -10592 9459 46248
9834D6248K8063j7851l4428o6795l2058j8018k4010K6680R5011k08O407n5543
$$ 46248 74311 56460 22032 -44763 -76821 -94839 -118849 -92169 2842 2634 9041 -46502
9822d6502m8129m4660k1022N0740M2832K9062J03396P783K2417K3842p7109l709
$$ -46502 -94631 -139291 -160313 -109573 -66741 -37679 65717 73500 95917 119759 42650 38941
9810C8941K8006n866J632j7117J2503n1746o9042m3739R8836O7810j9035m813
$$ 38941 66947 61081 62713 45596 58099 6353 -62689 -106428 -7592 60218 41183 36370
9798C6370J1348J4058M818k7989l3371N364J8784l5030m4266k4695P2474K9467
$$ 36370 47718 61776 66594 38605 5234 10598 29382 -5648 -49914 -74609 -2135 27332
9786B7332k8858K7445N0273M2262p5321l0907o0687k746l1021p44J0845P0150
$$ 27332 -1526 25919 76192 118454 43133 12226 -48461 -51207 -82228 -82972 -72127 -1977
9774a977Q253k7469Q614K3354j676q1611N924P2181O9312j12917l9347L2331M3503
$$ -1977 6276 -21193 -12579 10775 9099 -72512 -66588 5593 74905 -38012 -77359 -45028 -1525
9761a525k8976m2374N1035L0900o754L437n0749k1963L2055j6331K6730O3068
$$ -1525 -30501 -72875 -21840 9060 2306 5743 -45006 -66969 -34914 -51245 -24515 38553
9749C8553K564n0838r6247j2799P7441J787J9959P4656l6796J363n1683j1432
$$ 38553 41117 -9721 -105968 -118767 -41326 -39539 -19580 55076 18280 19643 -32040 -43472
9737d3472N2833M1537j8032J3776j9481Q825R038J6232M3930p490l167M6150m5437
$$ -43472 9361 50898 32866 46642 27161 35986 45024 61256 105186 97696 94529 140679 95242
9724I5242j03774m613L2661M9008J2414l6550j5412n4050k9649p082K8350L0086
$$ 95242 -8532 -13145 19516 68524 80938 44388 28976 -25074 -54723 -61805 -33455 -3369
9712c369K0337m1893l2763P3259J5535M2139j4204l3369l7824o6092k6035K7256
$$ -3369 16968 -24925 -57688 15571 31106 73245 59041 25672 -12152 -78244 -104279 -77023
9700g7023r092L2194L899J5770M5887j0486O555m8630J1989k7484K148L1129l396
$$ -77023 -86115 -53921 -50022 -34252 11635 1149 7704 -40926 -28937 -56421 -54273 -23144 -26540
9687b6540r064L1467M2108M575O1225J3017n8414n9640n1712K9631L1074j2l8461
$$ -26540 -35604 -4137 37971 42546 103771 116788 58374 -1266 -52978 -23347 7727 7715 -30746
9674c0746l9790J5189Q7109L8517K364p2530p5435m5300J0254q587N4911O7761
$$ -30746 -70536 -55347 31762 70279 72643 113 -75322 -120622 -110368 -118955 -64044 3717
9662C717M5955P633l7739j2587l3351j2053r824l975k3352K9234M8523N9540j5428
$$ 3717 49672 57305 19566 6979 -26372 -38425 -48249 -52224 -75576 -46342 2181 61721 46293
9649D6293l8350Q2830Q8712K9579k4722K3234K0551K7390r9956j04976m2439j0593
$$ 46293 7943 90773 179485 209064 184342 207576 228127 255517 155561 50585 8146 -2447
9637b447k7102k2625j9182O2605l102l2875j3550k0499K6064l059n468O5799j4392
$$ -2447 -29549 -52174 -71356 -8751 -11853 -44728 -58278 -78777 -52713 -55772 -61240 4559 -9833
9624i833j1919j2233j0560K626J9136k7216J9026M0441N1777K3654m2094l8274
$$ -9833 -21752 -33985 -44545 -41919 -22783 -49999 -30973 9468 61245 84899 42805 4531
9612D531q945l6664L0310R2250l5520j8854p099n947O7477p993m9590O79L3876
$$ 4531 -4414 -41078 -10768 81482 45962 27108 20009 14062 81539 73546 23956 24635 58511
9599E8511k614J3244L2183K3534L2021o5055k5484k4895k6455M9539k181n9686
$$ 58511 55897 69141 101324 124858 156879 91824 66340 41445 14990 64529 62348 2662
9587B662j7199J6467L1336J6867l3097j05520J5632J3037M0447M051M5349k2827
$$ 2662 -14537 1930 33266 50133 17036 -88484 -72852 -59815 -19368 -15317 30032 7205
9575G205J005J9443o6828m8279J1546N33J8196O0266R7400L0261J9451k9095r3199
$$ 7205 8210 27653 -39175 -87454 -75908 -75375 -57179 3087 100487 130748 150199 121104 27905
9562B7905m9856P5600M7861o6002m7051K1741p101K3510k4734o855P4835J1320
$$ 27905 -21951 53649 101510 35508 -11543 10198 3097 26607 1873 -4982 69853 81173
9550H1173o1476o3745K2459L4640L8945K4230J6369M3539l9857p5067j855K5365
$$ 81173 19697 -44048 -21589 13051 51996 76226 92595 136134 96277 21210 19355 44720
9538D4720k768K0249L3923N603n6593l3550n817l3929o5722j37K2609N9848M1918
$$ 44720 41952 62201 96124 101727 45134 11584 5767 -28162 -93884 -94021 -71412 -11564 30354
9525C0354K3555J9809n8306j9299L4893P6940R956o9755r2758N367P6269m9600
$$ 30354 53909 73718 15412 -3887 31006 107946 117902 48147 -44611 -39244 37025 -12575
9513a2575l4780K1675M1961Q364l7288n4396O6969M1746q20m6079p9271N6505
$$ -12575 -47355 -25680 16281 24645 -12643 -67039 -70 41676 40856 -5223 -84494 -27989
9501b7989N5442J881l111n977J8905M052j2945l3816k0630M1986k7720L5905P4254
$$ -27989 27453 29334 26223 20246 39151 43203 30258 -3558 -24188 17798 -9922 25983 100237
9488A00237k7987k6054n750m6246l7733L4828O0117M500m7315m3073L0372M7834
$$ 100237 72250 46196 40446 -5800 -43533 -8705 51412 55912 8597 -34476 -4104 43730
9476D3730l639n070k0587k2542l650L0411L8913k705o7701J102k337o271K1332
$$ 43730 40091 35021 14434 -8108 -11758 18653 57566 54861 -12840 -11738 -14075 -20346 986
9463I86o845K4481p4332n4099l3653M9389J288L8292O1676K8130n6634m9504J4705
$$ 986 -5859 18622 -55710 -109809 -143462 -94073 -92785 -54493 7183 35313 -21321 -70825 -56120
9450e6120M9052M5295J0960l6033J2639K729Q81J2244K6905k3067r7797j8479
$$ -56120 -7068 38227 49187 13154 25793 28522 29403 41647 68552 45485 -52312 -70791
9438g0791j8265N2437M2883p757J2285L8964J542Q181J2794K474m8396k6771k5762
$$ -70791 -89056 -36619 6264 -1493 10792 49756 51298 59479 72273 74747 26351 -420 -26182
9425b6182J5131M0487j5858m2561j0245L2342N0452l4536l5385k3027P091L4103
$$ -26182 -11051 29436 13578 -28983 -39228 -6886 43566 9030 -26355 -49382 -42291 -8188
9413h188l318n6429O4739O6115L1234J4654m5199o5990j337r281K0538j8863j5723
$$ -8188 -11506 -67935 -3196 62919 94153 108807 63608 -2382 -3719 -13000 7538 -11325 -27048
9400b7048N6117L301n2922j2025l8411O836M9206j42L6903J5216n2745J7972Q143
$$ -27048 29069 32370 -20552 -32577 -70988 -64152 -14946 -15088 21815 37031 -15714 2258 10401
9387A0401j3160J892J4738l8394P391M7382K3204J4139o446o6433n7599J6146
$$ 10401 -2759 -867 13871 -24523 -17132 30250 53454 67593 61147 -5286 -62885 -46739
9375d6739J0674L3769R5644m75q6823p8676K8198O1297M2834N4434K7220q2573
$$ -46739 -36065 -2296 93348 92873 6050 -72626 -44428 16869 59703 114137 141357 58784
9363E8784J3218j7300r0354J0062M3565k693o2054m6504o811j7778K8639K1947
$$ 58784 72002 54702 -35652 -25590 17975 15282 -46772 -93276 -100087 -117865 -89226 -67279
9351f7279j0828J5032L8545K0835N6603J2340J4718k4702r459p1846L9996J13037
$$ -67279 -78107 -63075 -24530 -3695 52908 65248 79966 55264 45805 -26041 13955 126992
9339A26992K7637p8628p4219m060N5169K4004n2389l8826j5801r692M5567R3357
$$ 126992 154629 76001 1782 -2278 52891 76895 24506 -14320 -30121 -39813 5754 99111
9327I9111O1643m5816j6909k8983p8105l4774j2722j4593L7641l6654Q194L8104
$$ 99111 160754 114938 98029 69046 -9059 -43833 -56555 -71148 -33507 -70161 -61967 -23863
9315b3863j1438n738n353m3123K611J00963p892l5827m1257R1L5116l3332m2863
$$ -23863 -35301 -41039 -46392 -89515 -86904 14059 6167 -29660 -70917 -70826 -35710 -69042 -111905
9302a11905m4494M1745J8763O4663J9076K7867L3208j484o5467M822J3134m7114
$$ -111905 -156399 -114654 -95891 -31228 -12152 15715 48923 47439 -18028 -13206 -72 -47186
9290d7186l1443j2716N3021L995M1303O9468o421r2991o6118J0723o519l2377
$$ -47186 -78629 -91345 -38324 -34329 6974 76442 70021 -22970 -89088 -78365 -84884 -117261
9278a17261M0560l304M5084P0155q120R4m421j9813q5341k9348L7899M7340l8153
$$ -117261 -76701 -80005 -34921 35234 27114 27208 22787 2974 -82367 -111715 -73816 -26476 -64629
9265f4629k9090j7130L1248K4632M0876M1046L5063q965m9091J2972l6323m980
$$ -64629 -93719 -110849 -79601 -54969 -14093 26953 62016 53051 3960 16932 -19391 -24371
9253b4371l4082O552J9925J7780l9304n716N3626l9973J3831K0833K9114K6838
$$ -24371 -58453 -51901 -31976 -14196 -53500 -59216 -5590 -45563 -31732 -10899 18215 45053
9241D5053J2660o8476l728L5787O7895J01788J1585j5150n6578l6875k3370L2451
$$ 45053 57713 -10763 -14491 21296 89191 190979 202564 187414 130836 93961 70591 103042
9229A03042j2304l6923L0598O239k5118n4459K969P7266L9476K8294R715p457
$$ 103042 90738 53815 84413 90652 65534 11075 14044 91310 130786 159080 168795 161338
9217A61338o7910J123O240q4554J9391L1424L6930N35J4862p2148j502K6289l0403
$$ 161338 93428 94551 100791 16237 35628 67052 103982 104517 119379 47231 45729 72018 41615
9204D1615l9606o478M252J8799O52j6530k4600N6680L8984l1431k7476m6945L4713
$$ 41615 2009 -4469 -217 18582 19234 2704 -21896 34784 73768 42337 14861 -32084 2629
9191B629M0909L3930L8278n326O2119o29j7693j2469k6398q526M377k6197q971
$$ 2629 43538 77468 115746 110420 172539 171910 154217 141748 115350 106824 111201 85004 76033
9178G6033j8404o8443L268N0094L7688J116j930n684l990j6970k2860j8352P585
$$ 76033 57629 -10814 -7546 42548 80236 81352 79422 73738 69748 52778 29918 11566 19151
9165A9151q292L5719M3916m154l8349J0782m9049l6085N143L3121P3517P0362
$$ 19151 10859 46578 90494 86340 47991 58773 9724 -26361 -21218 11903 85420 155782
9153A55782N5382L5528m7116l7758j9422J5341M9917N1900m5261j08511M910M2338
$$ 155782 211164 246692 199576 161818 142396 157737 207654 259554 214293 105782 110692 153030
9141A53030L6728M3494J0309r865k4814L079j6919q763L8464m592k4871J8443
$$ 153030 189758 233252 243561 233696 208882 211961 195042 186279 224743 220151 195280 213723
9129B13723L8983O2143N2495K0805J1396M0102J5445o078J8632K6005K0460O2607
$$ 213723 252706 314849 367344 388149 399545 439647 455092 449014 467646 493651 514111 576718
9117E76718Q9090O7725M981J387L8145J15814Q4056Q5347Q7599J39475J37045
$$ 576718 665808 733533 738514 739901 778046 893860 977916 1063263 1150862 1290337 1427382
9106A427382J75886K53128K59311L07530K58898M13071N78661P03641R21424J310724
$$ 1427382 1603268 1856396 2115707 2423237 2682135 3095206 3673867 4377508 5298932 6609656
9096F609656J683841K273980L152971L957935M646423M707272L377211L16691
$$ 6609656 8293497 10567477 13720448 17678383 22324806 27032078 30409289 30725980
9088C0725980k959311m561200m543341l859682k991477k200688j633061j266023
$$ 30725980 27766669 23205469 18662128 14802446 11810969 9610281 7977220 6711197
9080F711197j086535r26453p18645n02930m23296l27710k65866l09230k34454
$$ 6711197 5624662 4698209 3979564 3476634 3053338 2725628 2459762 2150532 1916078
9071A916078j64711j36551j68906j35790o9672m9271p0388n3275p4555q3158q9532
$$ 1916078 1751367 1614816 1445910 1310120 1240448 1191177 1120789 1067514 992959 909801 820269
9060H20269j07731k920m1637k0234n0061o6222M0670n6007L3558K3687q3611n7802
$$ 820269 712538 709618 667981 647747 597686 531464 572134 516127 549685 573372 489761 431959
9048D31959O706j3024o4243m6991m6624j6319p762O629n2307k099P4484m3176
$$ 431959 438665 425641 361398 314407 267783 251464 243702 250331 198024 195925 270409 227233
9036B27233k1906P910K1242K2014o3329n2315J2306K6235j2022l0837n705l5323
$$ 227233 205327 213237 234479 256493 193164 140849 153155 179390 167368 136531 130826 95503
9024I5503K0859m839l4848k8134k3518j0339L1560K8881K5604l2899j1279L3502
$$ 95503 116362 111523 76675 48541 25023 14684 46244 75125 100729 67830 56551 90053
9012I0053m998q192m5963l0115L0350M8715L7193M8780l5023o3232P551O399j2067
$$ 90053 85055 76863 30900 785 31135 79850 117043 165823 130800 67568 75119 81518 69451
8999F9451L3398k4482m2482k558k6346j241J0506J8702j815l4910m172J3472K0603
$$ 69451 102849 78367 35885 33327 6981 5740 16246 34948 33133 -1777 -5949 7523 28126
8986B8126J482j9193R39j1907L8994L7857P2579L489k6744k7925J3230l279K442
$$ 28126 29608 10415 11354 -553 38441 76298 148877 152366 125622 97697 110927 107648 110090
8973A10090q397m7199n6307K0370N3750J4958n1700l3156n5891J3178O0016L3039
$$ 110090 101693 54494 -1813 18557 72307 87265 35565 2409 -53482 -40304 19712 52751
8961E2751N0789J7371J6148j4592m6717p491m567j4136l4972k4258J272n1600
$$ 52751 103540 120911 137059 122467 75750 68259 63692 49556 14584 -9674 -8402 -60002
8949f0002n6980J8285Q3493O1692l6269J0996K660J1374L2197K2397k1479o1554
$$ -60002 -116982 -98697 -15204 46488 10219 21215 23875 35249 67446 89843 68364 6810
8937F810l1475J4820K8440J6028n4510p0887L4000O728J5970N1584L3541K9241
$$ 6810 -24665 -9845 18595 34623 -19887 -90774 -56774 -50046 -34076 17508 51049 80290
8925H0290J8232j5416m204J8284o463n262M568k2904j308o7474l0996P11M8155
$$ 80290 98522 83106 78902 97186 90723 85461 90029 67125 65817 -1657 -32653 -31942 16213
8912A6213O3057m3951j6022j2846k6244o3537P929J3031j1900k810Q1034j0494
$$ 16213 79270 35319 19297 6451 -19793 -83330 -75401 -62370 -74270 -77080 3954 -6540
8900f540l2910L1809N1863L7091m543M8801O857q2675l7122K3780j1178l3674
$$ -6540 -39450 -7641 44222 81313 76770 125571 132428 49753 12631 36411 25233 -8441
8888h441O4370L9687J0093l603o1216k9511K1301m969J8621N2490j0477n665q798
$$ -8441 55929 95616 105709 102106 40890 11379 32680 27711 46332 98822 88345 82680 73882
8875G3882J9331M400l382k5336l7798J2580M5867K8888J2926j3035n2190o1817
$$ 73882 93213 97613 94231 68895 31097 43677 89544 118432 131358 118323 66133 4316
8863D316o848L5250J3608o2290l0861Q6258N2340o572l8007Q312K4046r95j1221
$$ 4316 -2532 32718 46326 -15964 -46825 39433 91773 85201 47194 55506 79552 78557 67336
8850F7336k6048l223N7356K4445J1753K4518n2354p2550n1697k5425N4946m7088
$$ 67336 41288 38065 95421 119866 131619 156137 103783 31233 -20464 -45889 9057 -38031
8838c8031K7991O3600M324k2138m4157K7744L0371o2988j6296l2816O2092M8048
$$ -38031 -10040 53560 57884 35746 -8411 19333 49704 -13284 -29580 -62396 -304 47744
8826D7744j586k7392l0068j479J2386q64m1870p7914M7685Q0789K8383p4798k752
$$ 47744 46158 18766 -11302 -12781 -395 -1259 -43129 -121043 -73358 7431 35814 -38984 -41736
8813d1736N5189J0064K2101l7864J5240L5163L0966K2480l1554n7751n4405n1301
$$ -41736 13453 23517 45618 7754 22994 58157 89123 111603 80049 22298 -32107 -83408
8801h3408r837r848K0909L0257m1681n6713O5988N3911J9701o095L4351L5094
$$ -83408 -93245 -103093 -82184 -51927 -93608 -150321 -84333 -30422 -10721 -16816 17535 52629
8789E2629J0934N6187K7299m02p3891k3558l5214O950K6602N1507j9938M760K0697
$$ 52629 63563 119750 147049 146647 72756 49198 13984 20934 47536 99043 79105 83865 104562
8776A04562l6946q7952n4405K8747k8762M1920O6571o504k0359l6673q2448j5423
$$ 104562 67616 -20336 -74741 -45994 -74756 -32836 33735 27231 6872 -29801 -112249 -127672
8764a27672P4379O1903J7512J7928m5776k2358K9508K9354r497m4712j0253j4345
$$ -127672 -53293 8610 26122 44050 -1726 -24084 5424 34778 25281 -19431 -29684 -44029
8752d4029k4712N2408M1026o0350n0822L8163J9219L5990K2186P521l0655k2768
$$ -44029 -68741 -16333 24693 -35657 -86479 -48316 -29097 6893 29079 36600 5945 -16823
8740a6823j723M320K2997M5569l9992j5272k6447j4205k2097j2038N4330M4250
$$ -16823 -18546 -14226 8771 54340 14348 -924 -27371 -41576 -63673 -75711 -21381 22869
8728B2869o9j5213Q405N3015J0923k6919l637j4384M3886N1088J000O63L4522
$$ 22869 22800 7587 15992 69007 79930 53011 49374 34990 78876 129964 130964 131627 166149
8715A66149J9187m414K6619m3336p9780l1396m9148J00o204k5993q589j357l9137
$$ 166149 185336 180922 207541 164205 84425 53029 3881 3981 -2223 -28216 -36805 -38162 -77299
8702g7299J6853M1299J5045K5941J6433l1983k5691m1204J7384J6648j0702L1212
$$ -77299 -60446 -19147 -4102 21839 38272 6289 -19402 -60606 -43222 -26574 -37276 -6064
8690f064j7613J0909n430J7950J977n7235m3913N6941J8918J3865L2352j4328
$$ -6064 -23677 -12768 -18198 -248 1729 -55506 -99419 -42478 -23560 -9695 22657 8329
8678H329K7529n3656k859N422K1129K2833J9322o344m1206n3767k7231M6090l4364
$$ 8329 35858 -17798 -20657 -15235 5894 28727 48049 41705 499 -53268 -80499 -34409 -68773
8665f8773k9107M6670M3689j9782j6576O7771J9535j8970l858Q3330L0794j7631
$$ -68773 -97880 -51210 -7521 -27303 -43879 23892 43427 24457 20599 103929 134723 117092
8653A17092R388L729R47j8099k3433o0490j8343l1304j8510N2257L3083K085K5397
$$ 117092 126480 130209 131156 113057 89624 29134 10791 -20513 -39023 13234 46317 48402 73799
8640G3799j01m9085j7363M1253M2362m1307o1369k8484K5088K8388N6577P8939
$$ 73799 73698 24613 7250 48503 90865 49558 -11811 -40295 -15207 13181 69758 148697
8628A48697q916m0328m5028O4289M0038l0233j3433n4479o1962l1291M6471M6641
$$ 148697 139781 99453 54425 118714 158752 128519 115086 60607 -1355 -32646 13825 60466
8616F0466J3788J1480O1376k9523n0336j1119M5440j3186J2916l2618L9880K5069
$$ 60466 74254 85734 147110 117587 67251 56132 101572 88386 101302 68684 108564 133633
8604A33633K9791K507J1377m376J5746l038k7918N5996L1560J2215o668j1847
$$ 133633 163424 165931 177308 172932 188678 185640 157722 213718 245278 257493 250825 238978
8592B38978j5332L6680l7500o9358m6990l3750j3684k3421L0123K0110o53K3068
$$ 238978 223646 260326 222826 153468 106478 72728 59044 35623 65746 85856 85203 108271
8580A08271M4315m7352K8438j7060m5491R235p835P6090K2514j9831n0500j524
$$ 108271 152586 105234 133672 116612 71121 80356 72521 148611 171125 151294 100794 99270
8568I9270R792m1404n0959N1329N4620l3087j0404j1684j4098K8666j1346n2334
$$ 99270 109062 67658 16699 68028 122648 89561 79157 67473 53375 82041 70695 18361
8556A8361k9386M1331r085j8756m3296N0252N9559m634L873j4309m5174k4257
$$ 18361 -11025 30306 21221 2465 -40831 9421 68980 64346 68219 53910 8736 -15521
8544a5521m3679j7947Q2080K0707j6083n4089k3615n3711N7855M0939L912k405
$$ -15521 -59200 -77147 4933 25640 9557 -44532 -68147 -121858 -64003 -23064 -19152 -21557
8532b1557L3093n783j8884J4410j8271M5166K2503K3155j0011k6661J1981N219
$$ -21557 11536 5753 -13131 1279 -16992 28174 50677 73832 63821 37160 49141 54360
8520E4360n3721N114P643q420R727J7289p042k5327J4160M9457K8806K9330k1859
$$ 54360 639 5753 13396 4976 14703 31992 24950 -377 13783 63240 92046 121376 99517
8507I9517j8614l147r2394m8764O450K2763J4974L7804r895k5263J8895k665j6755
$$ 99517 80903 77756 -14638 -63402 -56952 -34189 -19215 18589 8694 -16569 2326 -339 -17094
8494a7094l386O140M357O133j888J2193k7779n756M0445k5978n2422j6958M4055
$$ -17094 -20480 -14340 -9983 -3850 -5738 6455 -21324 -27080 13365 -12613 -65035 -81993 -37938
8481c7938j2468o582R428L2107N009j5777o09k1076K472J2790j476P10l427j3424
$$ -37938 -50406 -56988 -47560 -15453 -10444 -26221 -26830 -47906 -45434 -32644 -34120 -33410 -36837 -50261
8467e0261J1653n129P2311N6566l5325k5656j0185n333K9142k9421j6987K0630
$$ -50261 -38608 -43737 28574 85140 49815 24159 13974 8641 37783 8362 -8625 12005
8455A2005L8109l3798k1941j0882j3010K8589L2249k4454o1960n0L6664j5055
$$ 12005 50114 16316 -5625 -16507 -29517 -928 31321 6867 -55093 -55143 -18479 -33534
8443c3534J1436N236K5247K4592M2663L6797m1413r4824l7513M7020M7321m028
$$ -33534 -22098 -16862 8385 32977 75640 112437 71024 -23800 -61313 -14293 33028 29000
$$ [...]
##END NTUPLES=NMR SPECTRUM
##END=
