##TITLE=Analysis number 325219
Compound Code cc 01311
Project Code adrs
Chemist Name aci
##JCAMPDX= 6.0         $$ Bruker NMR JCAMP-DX V2.0
##DATA TYPE= NMR SPECTRUM
##DATA CLASS= NTUPLES
##ORIGIN= Bruker BioSpin GmbH
##OWNER= nmr
$$ XWIN-NMR		Version 3.5
$$ Thu Dec 14 14:35:26 2006 GMT Standard Time (UT+0h)  MAYBRIDGE\nmr@NMR_250MHZ
##.OBSERVE FREQUENCY= 250.131544655141
##.OBSERVE NUCLEUS= ^1H
##.ACQUISITION MODE= SIMULTANEOUS (DQD)
##.ACQUISITION SCHEME= undefined
##.AVERAGES= 16
##.DIGITISER RES= 18
##SPECTROMETER/DATA SYSTEM= dpx250
##.PULSE SEQUENCE= zg30
##.SOLVENT NAME= CDCl3
##.SHIFT REFERENCE= (INTERNAL, CDCl3, 0, 16.5114)
##AUDIT TRAIL= $$ (NUMBER, WHEN, WHO, WHERE, WHAT)
$$ ##TITLE= Audit trail, XWIN-NMR		Version 3.5
$$ ##JCAMPDX= 5.01
$$ ##ORIGIN= Bruker BioSpin GmbH
$$ ##OWNER= nmr
$$ C:\u/data/dgb/nmr/ADRS/1110/pdata/1/auditp.txt
$$ ##AUDIT TRAIL=  $$ (NUMBER, WHEN, WHO, WHERE, WHAT)
(   1,<2006-12-14 14:35:02.96 +000>,<MAYBRIDGE\nmr>,<NMR_250MHZ>,
      <created by zg, POWCHK disabled, PULCHK disabled
       configuration hash MD5:
       49 4B E0 1D 92 C2 6B 37 9F E6 65 BC 52 41 86 1D
       data hash MD5: 64K
       9A D4 9B A5 4A 91 92 09 CB D3 AA C6 3D 7F 32 FC>)
(   2,<2006-12-14 14:35:17.81 +000>,<MAYBRIDGE\nmr>,<NMR_250MHZ>,
      <Start of raw data processing
       ef LB = 0.3 FT_mod = 6 PKNL = 1 SI = 32K 
       data hash MD5: 32K
       F6 9B EA C0 A3 E5 5D A1 E4 42 1A B1 6E 4D 2C 3A>)
(   3,<2006-12-14 14:35:19.53 +000>,<MAYBRIDGE\nmr>,<NMR_250MHZ>,
      <apk 
       data hash MD5: 32K
       87 02 83 06 5A 08 E8 DF E1 47 A2 EB 88 A0 6F A0>)
(   4,<2006-12-14 14:35:20.20 +000>,<MAYBRIDGE\nmr>,<NMR_250MHZ>,
      <abs ABSG = 5 
       data hash MD5: 32K
       04 06 BF 18 91 B4 E0 FF 5C 98 0F 11 4C FE CF 51>)
$$ ##END=
$$ 
$$ hash MD5
$$ A0 83 15 06 82 D8 5E 6E 2A 01 65 17 F5 F5 E1 91
##$RELAX= 
##$RELAX= 
##$RELAX= 
##$RELAX= 
##$RELAX= 
##$RELAX= 
##$RELAX= 
$$ Bruker specific parameters
$$ --------------------------
##$DU= <C:\u>
##$EXPNO= 1110
##$NAME= <ADRS>
##$PROCNO= 1
##$TYPE= <nmr>
##$USER= <dgb>
##$AMP= (0..31)
100 100 100 100 100 100 100 100 100 100 100 100 100 100 100 100 100 100 
100 100 100 100 100 100 100 100 100 100 100 100 100 100 
##$AQSEQ= 0
##$AQ_mod= 3
##$AUNM= <au_zg>
##$AUTOPOS= <21 >
##$BF1= 250.13
##$BF2= 250.13
##$BF3= 250.13
##$BF4= 250.13
##$BF5= 500.13
##$BF6= 500.13
##$BF7= 500.13
##$BF8= 500.13
##$BYTORDA= 1
##$CFDGTYP= 0
##$CFRGTYP= 5
##$CHEMSTR= <none>
##$CNST= (0..31)
1 1 145 1 1 1 1 1 1 1 1 1 1 1 1 1 1 1 1 1 1 1 1 1 1 1 1 1 1 1 1 1 
##$CPDPRG= <>
##$CPDPRG1= <>
##$CPDPRG2= <>
##$CPDPRG3= <>
##$CPDPRG4= <mlev>
##$CPDPRG5= <mlev>
##$CPDPRG6= <mlev>
##$CPDPRG7= <mlev>
##$CPDPRG8= <mlev>
##$CPDPRGB= <>
##$CPDPRGT= <>
##$D= (0..31)
0 1 0 0 0 0 0 0 0 0.06 0 0 0 0 0 0 0.0002 0 0 0 0 0 0 0 0 0 0 0 0 0 0 
0 
##$DATE= 1166106900
##$DBL= (0..7)
120 120 120 120 120 120 120 120 
##$DBP= (0..7)
150 150 150 150 150 150 150 150 
##$DBP07= 0
##$DBPNAM0= <>
##$DBPNAM1= <>
##$DBPNAM2= <>
##$DBPNAM3= <>
$$ [...]
##$SUBNAM7= <"">
##$SUBNAM8= <"">
##$SUBNAM9= <"">
##$SW= 20.6930455092707
##$SWIBOX= (0..15)
0 0 3 0 0 0 0 0 0 0 0 0 0 0 0 0 
##$SW_h= 5175.983436853
##$TD= 65536
##$TD0= 1
##$TE= 295.16
##$TE2= 300
##$TE3= 300
##$TEG= 300
##$TL= (0..7)
0 120 120 120 120 120 120 120 
##$TP= (0..7)
150 150 150 150 150 150 150 150 
##$TP07= 0
##$TPNAME0= <>
##$TPNAME1= <>
##$TPNAME2= <>
##$TPNAME3= <>
##$TPNAME4= <>
##$TPNAME5= <>
##$TPNAME6= <>
##$TPNAME7= <>
##$TPOAL= (0..7)
0.5 0.5 0.5 0.5 0.5 0.5 0.5 0.5 
##$TPOFFS= (0..7)
0 0 0 0 0 0 0 0 
##$TUNHIN= 0
##$TUNHOUT= 0
##$TUNXOUT= 0
##$USERA1= <user>
##$USERA2= <user>
##$USERA3= <user>
##$USERA4= <user>
##$USERA5= <user>
##$V9= 5
##$VALIST= <valist>
##$VCLIST= <CCCCCCCCCCCCCCC>
##$VD= 0
##$VDLIST= <DDDDDDDDDDDDDDD>
##$VPLIST= <PPPPPPPPPPPPPPP>
##$VTLIST= <TTTTTTTTTTTTTTT>
##$WBST= 1024
##$WBSW= 4
##$XGAIN= (0..3)
0 0 0 0 
##$XL= 0
##$YL= 0
##$YMAX_a= 525764
##$YMIN_a= -549803
##$ZGOPTNS= <>
##$ZL1= 120
##$ZL2= 120
##$ZL3= 120
##$ZL4= 120
##$ABSF1= 16.51139
##$ABSF2= -4.181782
##$ABSG= 5
##$ABSL= 3
##$ALPHA= 0
##$AQORDER= 0
##$ASSFAC= 0
##$ASSFACI= 0
##$ASSFACX= 0
##$ASSWID= 0
##$AUNMP= <proc_1d>
##$AZFE= 0.1
##$AZFW= 0.1
##$BCFW= 0
##$BC_mod= 0
##$BYTORDP= 0
##$COROFFS= 0
##$CY= 12.5
##$DATMOD= 1
##$DC= 0
##$DFILT= <>
##$DTYPP= 0
##$F1P= 14.0000005364418
##$F2P= -0.99999901652339
##$FCOR= 0.5
##$FTSIZE= 32768
##$FT_mod= 6
##$GAMMA= 0
##$GB= 0
##$INTBC= 1
##$INTSCL= 1
##$ISEN= 128
##$LB= 0.3
##$LEV0= 0
##$LPBIN= 0
##$MAXI= 10000
##$MC2= 0
##$MEAN= 0
##$ME_mod= 0
##$MI= 0
##$NCOEF= 0
##$NC_proc= -1
##$NLEV= 6
##$NOISF1= 0
##$NOISF2= 0
##$NSP= 0
##$NTH_PI= 0
##$NZP= 0
##$OFFSET= 16.51139
##$PC= 1
##$PHC0= 223.7935
##$PHC1= 6.903214
##$PH_mod= 1
##$PKNL= yes
##$PPARMOD= 0
##$PSCAL= 4
##$PSIGN= 0
##$REVERSE= no
##$SF= 250.130002652632
##$SI= 32768
##$SIGF1= 0
##$SIGF2= 0
##$SINO= 400
##$SIOLD= 32768
##$SREGLST= <1H.CDCl3>
##$SSB= 0
##$STSI= 32768
##$STSR= 0
##$SW_p= 5175.98343685301
##$SYMM= 0
##$S_DEV= 0
##$TDeff= 65536
##$TDoff= 0
##$TI= <Analysis number 999999
Compound Code 99
Book Reference 9
Project Code 9>
##$TILT= no
##$TM1= 0
##$TM2= 0
##$TOPLEV= 0
##$USERP1= <user>
##$USERP2= <user>
##$USERP3= <user>
##$USERP4= <user>
##$USERP5= <user>
##$WDW= 1
##$XDIM= 32768
##$YMAX_p= 361086687
##$YMIN_p= -135856
$$ End of Bruker specific parameters
$$ ---------------------------------
##NTUPLES= NMR SPECTRUM
##VAR_NAME=  FREQUENCY,     SPECTRUM/REAL,   SPECTRUM/IMAG
##SYMBOL=    X,             R,               I
##VAR_TYPE=  INDEPENDENT,   DEPENDENT,       DEPENDENT
##VAR_FORM=  AFFN,          ASDF,            ASDF
##VAR_DIM=   32768,         32768,           32768
##UNITS=     HZ,            ARBITRARY UNITS, ARBITRARY UNITS
##FACTOR=    0.157963299565203, 1,           1
##FIRST=     4129.99419609662, 0,            0
##LAST=      -1045.98924075639, 0,           0
##MIN=       -1045.98924075639, -135856,     0
##MAX=       4129.99419609662, 361086687,    0
$$ Real data points
##PAGE= N=1
##DATA TABLE= (X++(R..R)), XYDATA
$$ [...]
##PAGE= N=2
##DATA TABLE= (X++(I..I)), XYDATA
18538A087521M129O02O528N229J268L843O601L053N735R564J1297P537J2047J6050
$$ 1087521 1091650 1092252 1098780 1104009 1105277 1109120 1115721 1118774 1124509 1134073 1145370 1152907 1164954 1181004
18524A181004J8985K4846J9372j0861p3425j02110n8712L371K2072K1973J9397
$$ 1181004 1199989 1224835 1244207 1233346 1159921 1057811 999099 1002470 1024542 1046515 1065912
18513A065912K3477K3596K3327K2959K1790J91o1841j05972p6632q562J9732K1597
$$ 1065912 1089389 1112985 1136312 1159271 1181061 1181252 1119411 1013439 936807 928245 947977 969574
18501I69574J7410J2161J0092Q663J0263Q531Q098O582L502L014N754N846L002
$$ 969574 986984 999145 1009237 1017900 1028163 1036694 1044792 1051374 1054876 1057890 1063644 1069490 1072492
18488A072492M494L612K418q68L270K616l33J258K992K437O001N588K1K844Q686
$$ 1072492 1076986 1080598 1083016 1082148 1085418 1088034 1087701 1088959 1091951 1094388 1100389 1105977 1105998 1108842 1117528
18473A117528M020J231M905N766M675L084L021K212K690M017L404J602L068K797
$$ 1117528 1121548 1122779 1127684 1133450 1138125 1141209 1144230 1146442 1149132 1153149 1156553 1158155 1161223 1164020
18459A164020%J177L901P385L618k84K904L606O234J0194P796N095N660P329J0935
$$ 1164020 1164020 1165197 1169098 1176483 1180101 1179817 1182721 1186327 1192561 1202755 1210551 1215646 1221306 1228635 1239570
18444A239570J1162O012k0091n0722m1131m08J5620J1757N816P730J0966J4214
$$ 1239570 1250732 1256744 1236653 1185931 1144800 1144392 1160012 1171769 1177585 1185315 1196281 1210495
18432A210495J2997J3684J2668r396m5155n2873q230J1248J1576R500J0363Q760
$$ 1210495 1223492 1237176 1249844 1240448 1195293 1142420 1134190 1145438 1157014 1166514 1176877 1185637
18420A185637N843M075K824K362N601Q032N768L264L442O017M405K800L097N492
$$ 1185637 1191480 1195555 1198379 1200741 1206342 1214374 1220142 1223406 1226848 1232865 1237270 1240070 1243167 1248659
18406A248659L568M074J621M247P941N453O819J041O273N667L254J1465P425O925
$$ 1248659 1252227 1256301 1257922 1262169 1270110 1275563 1282382 1283423 1289696 1295363 1298617 1310082 1317507 1324432
18392A324432J1176J0599J3100O403k3087o0715l5612K629J4524J3969J0632R581
$$ 1324432 1335608 1346207 1359307 1365710 1342623 1281908 1246296 1248925 1263449 1277418 1288050 1297631
18380A297631R717J0547J6502J8406Q564j5925n5125n3453q123J1512J1086J2721
$$ 1297631 1307348 1317895 1334397 1352803 1361367 1345442 1290317 1236864 1228741 1240253 1251339 1264060
18368A264060R366P384N837O573O332P546M718N538N779O641p90J679O463R123
$$ 1264060 1273426 1280810 1286647 1293220 1299552 1307098 1311816 1317354 1323133 1329774 1328984 1330663 1337126 1346249
18354A346249L110O321R884P633p62L163J81J897k101K380M383M770M053P71M730
$$ 1346249 1349359 1355680 1365564 1373197 1372435 1375598 1375779 1377676 1375575 1377955 1382338 1387108 1391161 1391932 1396662
18339A396662Q062L905K647N452N804L048J698j112N447J490l131J592N856O406
$$ 1396662 1404724 1408629 1411276 1416728 1422532 1425580 1427278 1426166 1431613 1433103 1429972 1431564 1437420 1443826
18325A443826L452K076K125N944O255M874M89J482N062K053L284K857M849J392
$$ 1443826 1447278 1449354 1451479 1457423 1463678 1468552 1469041 1470523 1475585 1477638 1480922 1483779 1488628 1490020
18311A490020M78j838j557K988R049J1985Q048L701m69K302M948P421K878M78
$$ 1490020 1490498 1488660 1487103 1490091 1499140 1511125 1519173 1522874 1522405 1524707 1529655 1537076 1539954 1540432
18297A540432O96Pj941P989J3911Q786M992N024N543M018O884M633L659L444N606
$$ 1540432 1541128 1541135 1539194 1547183 1561094 1569880 1574872 1579896 1585439 1589457 1596341 1600974 1604633 1608077 1613683
18282A613683O703P384K685M699N418N753P089j72l646K995P684K921Q105O968
$$ 1613683 1620386 1627770 1630455 1635154 1640572 1646325 1653414 1653242 1649596 1652591 1660275 1663196 1671301 1678269
18268A678269Q320O730K510K835M203m6M096M332J3194P098K532L726M231J842
$$ 1678269 1686589 1693319 1695829 1698664 1702867 1702821 1706917 1711249 1724443 1731541 1734073 1737799 1742030 1743872
18254A743872P625L799M693O271R141R272P141K911K253P089P236P869J1733P674
$$ 1743872 1751497 1755296 1759989 1766260 1775401 1784673 1791814 1794725 1796978 1804067 1811303 1819172 1830905 1838579
18240A838579K520L545r26L044Q499J472O167P667R820L957M456M543N795Q619
$$ 1838579 1841099 1844644 1843718 1846762 1855261 1856733 1862900 1870567 1880387 1884344 1888800 1893343 1899138 1907757
18226A907757L119L516K278K717O863J2060R088O972N264O339J0403Q720J134
$$ 1907757 1910876 1914392 1916670 1919387 1926250 1938310 1947398 1954370 1959634 1965973 1976376 1985096 1986230
18213A986230K154M874N717O882J0339J1043R222M061P434N036K880R067J0443
$$ 1986230 1988384 1993258 1998975 2005857 2016196 2027239 2036461 2040522 2047956 2052992 2055872 2064939 2075382
18200B075382J0254J0348J0867J3026P150P759P575Q783J0397N990R569J1601
$$ 2075382 2085636 2095984 2106851 2119877 2127027 2134786 2142361 2151144 2161541 2167531 2177100 2188701
18188B188701L925J3485J3707J1590P174O302P541J0871J2480J3977J3043J3064
$$ 2188701 2192626 2206111 2219818 2231408 2238582 2244884 2252425 2263296 2275776 2289753 2302796 2315860
18176B315860Q937J0240J3887J5851J1437M692O451P255Q459J8992J6423Q326
$$ 2315860 2324797 2335037 2348924 2364775 2376212 2380904 2387355 2394610 2403069 2422061 2438484 2446810
18164B446810N709P418J4643J8264J3089J5577J6723J6523J3282R020J0006J3254
$$ 2446810 2452519 2459937 2474580 2492844 2505933 2521510 2538233 2554756 2568038 2577058 2587064 2600318
18152B600318J1328J2211K0016K1371K2309J9507K3763K6926K4174K0755K2388
$$ 2600318 2611646 2623857 2643873 2665244 2687553 2707060 2730823 2757749 2781923 2802678 2825066
18141B825066K3939K5030K4812K5332J9865K5050K9633L0812L2829L7114M0107
$$ 2825066 2849005 2874035 2898847 2924179 2944044 2969094 2998727 3029539 3062368 3099482 3139589
18130C139589L8915M0997M4941M6957M7883M8060N7090O1759P1056P7413Q3547
$$ 3139589 3178504 3219501 3264442 3311399 3359282 3407342 3464432 3526191 3597247 3674660 3758207
18119C758207R4783J13543J30775J60822J94811K45117L20274M30402N60788N63363
$$ 3758207 3852990 3966533 4097308 4258130 4452941 4698058 5018332 5448734 6009522 6572885
18109F572885j84314k555108l671495p97138N40060N64566M23144L19784K51876
$$ 6572885 6388571 3833463 161968 -635170 -95110 469456 892600 1212384 1464260
18100A464260K04411J64694J38570J18977J05722R7279Q5207P4603O9412O9996
$$ 1464260 1668671 1833365 1971935 2090912 2196634 2293913 2379120 2453723 2523135 2593131
18090B593131P2115O5080O2525N7432N0939M7689N0117N1479N1586M4481L8557
$$ 2593131 2665246 2730326 2792851 2850283 2901222 2948911 2999028 3050507 3102093 3146574 3185131
18079C185131M0943M5010M5707M9010N0226M2280M2740M9053M8700N1060N7598
$$ 3185131 3226074 3271084 3316791 3365801 3416027 3458307 3501047 3550100 3598800 3649860 3707458
18068C707458N3359M8488M0561M1109M9439N4278N0600N6872N5652N4425N6733
$$ 3707458 3760817 3809305 3849866 3890975 3940414 3994692 4045292 4102164 4157816 4212241 4268974
18057D268974N9275O5092O9920P1570O9120O2094O0640O2540P0221P6611P6458
$$ 4268974 4328249 4393341 4463261 4534831 4603951 4666045 4726685 4789225 4859446 4936057 5012515
18046E012515P7316P6164P9394R2074R4470R9678R6843J00579J01151J03879J15566
$$ 5012515 5089831 5165995 5245389 5337463 5431933 5531611 5628454 5729033 5830184 5934063 6049629
18035F049629J20102J19090J23406J36094J43857J52421J62622J79527J96137
$$ 6049629 6169731 6288821 6412227 6548321 6692178 6844599 7007221 7186748 7382885
18026G382885K12303K29377K49315K47987K07944J42875J26353J95903K88318
$$ 7382885 7595188 7824565 8073880 8321867 8529811 8672686 8799039 8994942 9283260
18017I283260L82050M30237M68319N28039N71735N65120N27324N80998P40201
$$ 9283260 9665310 10095547 10563866 11091905 11663640 12228760 12756084 13337082 14077283
18008A4077283R15332J071335J343064J760962K307589K969876L627077L235239
$$ 14077283 14992615 16063950 17407014 19167976 21475565 24445441 28072518 31307757
18000C1307757j514637j2095500j6452084j0999479M1181M024239M016718L647455
$$ 31307757 29793120 17697620 1245536 -9753943 -9712762 -5688523 -1671805 1975650
17992A975650L534291L698988M147901M776995M603271k8212j3037597k1193874
$$ 1975650 5509941 9208929 13356830 18133825 22737096 22708884 9671287 -11522587
17984a1522587j6256217k983097L963138M174578L292438K527399J949562J561937
$$ -11522587 -27778804 -30761901 -26798763 -22624185 -19331747 -16804348 -14854786 -13292849
17976a3292849J314683J117832R57046P94625O34937N26618N38088N86580N92845
$$ -13292849 -11978166 -10860334 -9903288 -9108663 -8473726 -7947108 -7409020 -6822440 -6229595
17967f229595N43471M35188L08879K59388K63774K54742K37520K54773K76531
$$ -6229595 -5686124 -5250936 -4942057 -4682669 -4418895 -4164153 -3926633 -3671860 -3395329
17958c395329K77976K66607K51485K41029K30036K16078K13614K14836K16767
$$ -3395329 -3117353 -2850746 -2599261 -2358232 -2128196 -1912118 -1698504 -1483668 -1266901
17949a266901K16638K11099K05561J99946J72854J20341J20429J76207K05995
$$ -1266901 -1050263 -839164 -633603 -433657 -260803 -140462 -20033 156174 362169
17940C62169K12833K16338K25739K24331J98893J71283J89219K43648K62157K41625
$$ 362169 575002 791340 1017079 1241410 1440303 1611586 1800805 2044453 2306610 2548235
17930B548235K30956K84896L42944L73676L97320M52684N15621N63533O00297
$$ 2548235 2779191 3064087 3407031 3780707 4178027 4630711 5146332 5709865 6310162
17921F310162O69366Q40259J098513J382585J784487K254119K152615q48304r504963
$$ 6310162 6979528 7819787 8918300 10300885 12085372 14339491 16492106 15643802 6138839
17912F138839j3631868l545451J973474K452837J972411J611297J583981J617442
$$ 6138839 -7493029 -11038480 -9065006 -6612169 -4639758 -3028461 -1444480 172962
17904A72962J688550J920447K017272N78757m746811j0335446m491583J077996
$$ 172962 1861512 3781959 5799231 6377988 1631177 -8704269 -13195852 -12117856
17896a2117856J879190J521233J127712R33767P88562N67599M35742M87943N16800
$$ -12117856 -10238666 -8717433 -7589721 -6655954 -5867392 -5299793 -4864051 -4376108 -3859308
17887c859308M88104M58720M34939M11116L77817L04662K18350K73941L39612
$$ -3859308 -3371204 -2912484 -2477545 -2066429 -1688612 -1383950 -1165600 -891659 -552047
17878e52047L06983K65645L22617M02798M45066M68637M99966N57459O09256O32543
$$ -552047 -245064 20581 343198 745996 1191062 1659699 2159665 2717124 3326380 3958923
17868C958923O35724P49675J016189J321909J642746K102770K504426J723668
$$ 3958923 4594647 5344322 6360511 7682420 9325166 11427936 13932362 15656030
17860A5656030l454620j3554837j1555587p30095K584171K517974J999474J761665
$$ 15656030 12201410 -1353427 -12909014 -13639109 -11054938 -8536964 -6537490 -4775825
17852d775825J804582J858611K013166K306993K065175j040538r130418j1681040
$$ -4775825 -2971243 -1112632 900534 3207527 5272702 4232164 -4898254 -16579294
17844a6579294k375853J917986K097612J579704J177166R78387P82374N71680
$$ -16579294 -18955147 -17037161 -14939549 -13359845 -12182679 -11204292 -10421918 -9850238
17836i850238N13960N26322M75443M25646L95053L53316L09920K69510J99608
$$ -9850238 -9336278 -8809956 -8334513 -7908867 -7513814 -7160498 -6850578 -6581068 -6381460
17827f381460J54099J84933J69914J26383J34505J60914J58329J46867J46251
$$ -6381460 -6227361 -6042428 -5872514 -5746131 -5611626 -5450712 -5292383 -5145516 -4999265
17818d999265J45998J32002J12039O9629L0814P1108R8136J01107R5997Q5964
$$ -4999265 -4853267 -4721265 -4609226 -4539597 -4508783 -4437675 -4339539 -4238432 -4142435 -4056471
17808d056471P9487Q1078P5320P1978O9029O2817O1559O5043O0390N3502N1275
$$ -4056471 -3976984 -3895906 -3820586 -3748608 -3679579 -3616762 -3555203 -3490160 -3429770 -3376268 -3324993
17797c324993M9434M6157M8067N0937N1703N0268M3879L8645L4188L4343L4202
$$ -3324993 -3275559 -3229402 -3181335 -3130398 -3078695 -3028427 -2984548 -2945903 -2911715 -2877372 -2843170
17786b843170L7884L9276L5941L1187L4385L2951L1996L8949L6309K9793K8058
$$ -2843170 -2805286 -2766010 -2730069 -2698882 -2664497 -2631546 -2599550 -2560601 -2524292 -2494499 -2466441
17775b466441K7226K6038K7865K7281K6559K4894K2595K6123K4472K3056K6093
$$ -2466441 -2439215 -2413177 -2385312 -2358031 -2331472 -2306578 -2283983 -2257860 -2233388 -2210332 -2184239
17764b184239K9068K4553J9048J5553K0425K6107K2630J7758J8292J7103J3125
$$ -2184239 -2155171 -2130618 -2111570 -2096017 -2075592 -2049485 -2026855 -2009097 -1990805 -1973702 -1960577
17753a960577J7473J9438K0292K3009K0743J4900J6683K0383J6312J6800J6458
$$ -1960577 -1943104 -1923666 -1903374 -1880365 -1859622 -1844722 -1828039 -1807656 -1791344 -1774544 -1758086
17742a758086J7119J4303J6234J8395J3410J5152J7483J3348J5567J8779J5270
$$ -1758086 -1740967 -1726664 -1710430 -1692035 -1678625 -1663473 -1645990 -1632642 -1617075 -1598296 -1583026
17731a583026J6569J4187J4536J8112J7751J3377R244J4860J4623J2288J2880
$$ -1583026 -1566457 -1552270 -1537734 -1519622 -1501871 -1488494 -1479250 -1464390 -1449767 -1437479 -1424599
17720a424599J1861J1858J0562J1714J6323J0438O214J1622R845Q540N601J2657
$$ -1424599 -1412738 -1400880 -1390318 -1378604 -1362281 -1351843 -1345629 -1334007 -1324162 -1315622 -1310021 -1297364
17708a297364J9163J3112J1010J3474J1619J0457Q775N445Q094J0561M563P620
$$ -1297364 -1278201 -1265089 -1254079 -1240605 -1228986 -1218529 -1209754 -1204309 -1196215 -1185654 -1181091 -1173471
17696a173471R210R313J1593J2945Q904O771O160Q856R258J1727J2569J4476J1125
$$ -1173471 -1164261 -1154948 -1143355 -1130410 -1121506 -1114735 -1108575 -1099719 -1090461 -1078734 -1066165 -1051689 -1040564
17683a040564M614N292N573J0769J6044O571k483M583R511J3313J0900J1042R787
$$ -1040564 -1035950 -1030658 -1025085 -1014316 -998272 -991701 -994184 -989601 -980090 -966777 -955877 -944835 -935048
17670i35048Q705J0199J0944R009P679P811Q706R692J2972J2770R917N428N760
$$ -935048 -926343 -916144 -905200 -896191 -888512 -880701 -871995 -862303 -849331 -836561 -826644 -821216 -815456
17657h15456O431J781O747J1338J1569Q443N103O497J2062R200N150R515Q241
$$ -815456 -809025 -807244 -800497 -789159 -777590 -769147 -764044 -757547 -745485 -736285 -731135 -721620 -713379
17644g13379Q525R101R264R217J0483J0574Q941R695Q303O182Q667O718L790R947
$$ -713379 -704854 -695753 -686489 -677272 -666789 -656215 -647274 -637579 -629276 -623094 -614427 -607709 -603919 -593972
17630e93972J1996R936J821j897N855J3126J5941J6527K1838K2879K4345K6313
$$ -593972 -581976 -572040 -570219 -572116 -566261 -553135 -537194 -520667 -498829 -475950 -451605 -425292
17618d25292K3153o468p5837j07646q6183j3387K7257L0481K3532K0805K0750
$$ -425292 -402139 -408607 -484444 -592090 -678273 -691660 -664403 -633922 -610390 -589585 -568835
17607e68835J6044J1853O569N194R378J0506J1488R803Q712J0485J1541P462M206
$$ -568835 -552791 -540938 -534369 -529175 -519797 -509291 -497803 -488000 -479288 -468803 -457262 -449800 -445594
17594d45594J0033J0074P214K420N929J3524J2212J0322J1683J2827J0581N614
$$ -445594 -435561 -425487 -418273 -415853 -409924 -396400 -384188 -373866 -362183 -349356 -338775 -333161
17582c33161L103Q096R529R665J2103J2818J3295O169k128J986J0958J4327J4939
$$ -333161 -330058 -321962 -312433 -302768 -290665 -277847 -264552 -258383 -260511 -258525 -247567 -233240 -218301
17569b18301O998R846K0829K2865K3292J3160k4734p2497q0392m0725J1702K6602
$$ -218301 -211303 -201457 -180628 -157763 -134471 -121311 -146045 -218542 -298934 -339659 -327957 -301355
17557c01355K2297J7942J5181J4704J7172J5600R781P690J9547K5637J6948J70
$$ -301355 -279058 -261116 -245935 -231231 -214059 -198459 -188678 -180988 -161441 -135804 -118856 -118686
17545a18686Q43P361P98M188J6380K0568K1462J1975J4000K4650L4057L9440L4009
$$ -118686 -117843 -110482 -109684 -105496 -89116 -68548 -47086 -35111 -21111 3539 37596 77036 111045
17532A11045J6555l0915o8564l9812o5407n3309J9633L7938L5297L2622K7639
$$ 111045 127600 96685 28121 -11691 -77098 -130407 -110774 -72836 -37539 -4917 22722
17521B2722K5242J9420J9246K6348K9835K8254K8349K8941J9320k2100o8912j7204
$$ 22722 47964 67384 86630 112978 142813 171067 199416 228357 247677 225577 156665 139461
17509A39461L1501M6182M8275M6002M2051M0155J8480l5134l7001R261l4499j34054
$$ 139461 170962 217144 265419 311421 353472 393627 412107 376973 339972 349233 314734 180680
17497A80680p6465L2052O1802O3268N8634N3010N2683N5803N9717O9230Q1624
$$ 180680 104215 136267 198069 261337 319971 372981 425664 481467 541184 610414 692038
17486F92038R5808J02119P8258m9849l03763k26793N0977J32866J48397J56295
$$ 692038 787846 889965 968223 918374 614611 387818 438795 571661 720058 876353
17476H76353J70685J97756K29680K48859K10185M0421l97572p94029l88525k58582
$$ 876353 1047038 1244794 1474474 1723333 1933518 1973939 1576367 782338 393813 135231
17466A35231p07637n80035L8989K82536L03989K78893K50823K16482J71696J86176
$$ 135231 -572406 -1152441 -1113452 -830916 -526927 -248034 2789 219271 390967 577143
17456E77143J92926n5911o10413o61231k50483m38291p33886k11535K14741K67158
$$ 577143 770069 714158 103745 -557486 -807969 -1246260 -1980146 -2191681 -1976940 -1709782
17446a709782K27418J85497J56213J34132J25829J13764Q7202j7697k22999k23504
$$ -1709782 -1482364 -1296867 -1140654 -1006522 -880693 -766929 -679727 -697424 -920423 -1143927
17436a143927m125Q2931Q2753P2902P2443O4123N9387N5223N8100O1060N7286
$$ -1143927 -1148052 -1065121 -982368 -909466 -837023 -772900 -713513 -658290 -600190 -539130 -481844
17425d81844N9391N6287J9645q4947j28802k6823M69n0117l0230L2481N7774N1464
$$ -481844 -422453 -366166 -346521 -431468 -560270 -587093 -586624 -636741 -666971 -634490 -576716 -525252
17413e25252M6294M2740L7849K2703k3544n9131j6635K2597L4156L1689K4027
$$ -525252 -478958 -436218 -398369 -375666 -399210 -458341 -474976 -452379 -418223 -386534 -362507
17402c62507K4744L3112K6561K4386K5856K5182L4992L7217L8537Q216n9850o7912
$$ -362507 -337763 -304651 -278090 -253704 -227848 -202666 -167674 -130457 -91920 -83704 -143554 -211466
17390b11466l6262o0904j9549K7301L3590L0060L1435K7915J2551k5382l3077
$$ -211466 -247728 -308632 -328181 -300880 -267290 -237230 -205795 -177880 -165329 -190711 -223788
17379b23788M595K1183J5408R399J5457R330N979J5354J8410K3287P003k9879
$$ -223788 -219193 -198010 -182602 -173203 -157746 -148416 -142437 -127083 -108673 -85386 -78383 -108262
17367a08262m3844j0007J7009J9318J7935J9340J3038J1702J3197J2964J2524
$$ -108262 -152106 -162113 -145104 -125786 -107851 -88511 -75473 -63771 -50574 -37610 -25086
17356b5086R737N268R756R993J0734J1553R421O912O842R203J1705O006O589P085
$$ -25086 -15349 -10081 -325 9668 20402 31955 41376 48288 55130 64333 76038 82044 88633 95718
17342I5718O506J0810J0541P235L428M333J0820J2415J9476J7491J5927J6441
$$ 95718 102224 113034 123575 130810 134238 138571 149391 161806 181282 198773 214700 231141
17330B31141J7426J1122j8745o1194m7690k269J7209K3528K0346J7115J6251J8810
$$ 231141 248567 259689 240944 179750 132060 129791 147000 170528 190874 207989 224240 243050
17318B43050J7246K0257J2228o041n4068n9237o546J5952J9705J7001J4599J2519
$$ 243050 260296 280553 292781 286740 232672 173435 166889 182841 202546 219547 234146 246665
17306B46665J2118J1788J2907N410P114J0744J1763R568R278J0349J2186J1083
$$ 246665 258783 270571 283478 288888 296002 306746 318509 328077 337355 347704 359890 370973
17294C70973N747M978R624N235O056K568Q029O887M331O657R169J0425O471P785
$$ 370973 376720 381698 391322 396557 402613 405181 413210 420097 424428 431085 440254 450679 457150 464935
17280D64935J1994R962N931M617L941J06J884O104R235J4119J0298O701Q763J0204
$$ 464935 476929 486891 492822 497439 501380 501486 503370 509474 518709 532828 543126 549827 558590 568794
17266E68794R964J1268Q468P093M266O841Q318Q516O230J2466J3854J5886J3109
$$ 568794 578758 590026 598494 605587 609853 616694 625012 633528 639758 652224 666078 681964 695073
17253F95073J1087J0776J1197J4533P108R127J0448R502R454P788J4352J1403
$$ 695073 706160 716936 728133 742666 749774 758901 769349 778851 788305 796093 810445 821848
17241H21848J0861R439P879R707Q843P476P222J3520J0711J1184J2818J2872J4642
$$ 821848 832709 842148 850027 859734 868577 876053 883275 896795 907506 918690 931508 944380 959022
17228I59022J1459Q680N558O046J0922J1397J2345J3756Q421J1964J3661J1502
$$ 959022 970481 979161 984719 990765 1001687 1013084 1025429 1039185 1047606 1059570 1073231 1084733
17216A084733Q870J1702J7123J8145J9605J5649J7790J7161J9960J5894J3618
$$ 1084733 1093603 1105305 1122428 1140573 1160178 1175827 1193617 1210778 1230738 1246632 1260250
17205A260250J5839J8263J7531K0343K2907K1464J2165J9498K2882K2258J8101
$$ 1260250 1276089 1294352 1311883 1332226 1355133 1376597 1388762 1408260 1431142 1453400 1471501
17194A471501R227J0411K3217K6082K5116K6717K2233K0040K2142K7449K7637
$$ 1471501 1480728 1491139 1514356 1540438 1565554 1592271 1614504 1634544 1656686 1684135 1711772
17183A711772K4414K5780K9095L1939L4361L7574L7591L1506K8587K9538L0756
$$ 1711772 1736186 1761966 1791061 1823000 1857361 1894935 1932526 1964032 1992619 2022157 2052913
17172B052913K9828K9441L3459L7121L7465L8934M3303M1640M5864M2443M2654
$$ 2052913 2082741 2112182 2145641 2182762 2220227 2259161 2302464 2344104 2389968 2432411 2475065
17161B475065M5243M9483N6689O1169N9034O0603O6942P1270P4100Q2587R1077
$$ 2475065 2520308 2569791 2626480 2687649 2746683 2807286 2874228 2945498 3019598 3102185 3193262
17150C193262P0444N821l4055j9374N2034R8594J08525J11348J14331J20643J33505
$$ 3193262 3263706 3269527 3235472 3216098 3268132 3366726 3475251 3586599 3700930 3821573 3955078
17139C955078J39275J47132J57847J68138J81665J94028J62231J04811R9516J63133
$$ 3955078 4094353 4241485 4399332 4567470 4749135 4943163 5105394 5210205 5309721 5472854
17129E472854K55502L00679L19301L35951L66389M17465M80404N30957N80181
$$ 5472854 5728356 6029035 6348336 6684287 7050676 7468141 7948545 8479502 9059683
17120I059683O21113O65278Q07154J065954J395917J757710K233784K875786L665049
$$ 9059683 9680796 10346074 11153228 12219182 13615099 15372809 17606593 20482379 24147428
17111B4147428L919655O63829j0368450k0114341j7880065n722640K773589L646212
$$ 24147428 28067083 28730912 18362462 -1751879 -19631944 -25354584 -22580995 -18934783
17103a8934783K977135K346821J857606J491204J239521J062423R00820O92470
$$ -18934783 -15957648 -13610827 -11753221 -10262017 -9022496 -7960073 -7059253 -6366783
17095f366783N06157M29186M61213M99714M89237M58685M19155L81927L46610
$$ -6366783 -5860626 -5431440 -4970227 -4470513 -3981276 -3522591 -3103436 -2721509 -2374899
17086b374899K78702K08772K06879K56641L02133L17404L10318K49387K02954
$$ -2374899 -2096197 -1887425 -1680546 -1423905 -1121772 -804368 -494050 -244663 -41709
17077d1709K13053K77273L46214L70005L82489L95160M19313M32639M07760M11273
$$ -41709 171344 448617 794831 1164836 1547325 1942485 2361798 2794437 3202197 3613470
17067C613470M79626N84201O78851Q32925J083318J364745J707087K177659K797653
$$ 3613470 4093096 4677297 5356148 6189073 7272391 8637136 10344223 12521882 15319535
17058A5319535L447890L056413j824651j3202889j8151779j2818975j247096L215282
$$ 15319535 18767425 21823838 19999187 6796298 -11355481 -24174456 -25421552 -22206270
17050b2206270L055934K400386J891012J497054J203467J003138Q55024P00690
$$ -22206270 -19150336 -16749950 -14858938 -13361884 -12158417 -11155279 -10300255 -9599565
17042i599565N45979M61313M33904M21437L92498L68003L34010K99084K65617
$$ -9599565 -9053586 -8592273 -8158369 -7736932 -7344434 -6976431 -6642421 -6343337 -6077720
17033f077720K21403J44315R6802J03893J49457J66519J59950J53338J41145J27700
$$ -6077720 -5856317 -5712002 -5615200 -5511307 -5361850 -5195331 -5035381 -4882043 -4740898 -4613198
17023d613198J19750J15857J17451J19138J18306J09407R4373N7834l644k3065
$$ -4613198 -4493448 -4377591 -4260140 -4141002 -4022696 -3913289 -3818916 -3761082 -3764726 -3787791
17013c787791J7627P1001Q2169P6992P3315O9176O2466N8148N6724M9998M6810
$$ -3787791 -3770164 -3699163 -3616994 -3540002 -3466687 -3397511 -3335045 -3276897 -3220173 -3170175 -3123365
17002c123365N2116N7830N1494M5001L6714L7651M0031L8950L6358L0528K8831
$$ -3123365 -3071249 -3013419 -2961925 -2916924 -2880210 -2842559 -2802528 -2763578 -2727220 -2696692 -2667861
16991b667861L2060L4074L4074L3586L2733K7552K4643K3433K6535J8962K0473
$$ -2667861 -2635801 -2601727 -2567653 -2534067 -2501334 -2473782 -2449139 -2425706 -2399171 -2380209 -2359736
16980b359736K6429K5727K5206K6213K4050K1201K0274K1198K4707K3431J9055
$$ -2359736 -2333307 -2307580 -2282374 -2256161 -2232111 -2210910 -2190636 -2169438 -2144731 -2121300 -2102245
16969b102245R379J1021J9685K1857K2715J7835J5442J3826J1974J1194J3914
$$ -2102245 -2092866 -2081845 -2062160 -2040303 -2017588 -1999753 -1984311 -1970485 -1958511 -1947317 -1933403
16958a933403J5104J6948J7813K1110J4389J0877J1588J7003J3264J1068J5843
$$ -1933403 -1918299 -1901351 -1883538 -1862428 -1848039 -1837162 -1825574 -1808571 -1795307 -1784239 -1768396
16947a768396J2555J3309Q762J0060J0643J4120J6362J5130J0910J1720J1872
$$ -1768396 -1755841 -1742532 -1733770 -1723710 -1713067 -1698947 -1682585 -1667455 -1656545 -1644825 -1632953
16936a632953J0742P251J1352J0858J5591J5563J0868J0903J2440J3372J2089
$$ -1632953 -1622211 -1614960 -1603608 -1592750 -1577159 -1561596 -1550728 -1539825 -1527385 -1514013 -1501924
16925a501924J0052R029R046O972N158N676P191J0459J0020J0139P122N991N595
$$ -1501924 -1491872 -1482843 -1473797 -1466825 -1461667 -1455991 -1448800 -1438341 -1428321 -1418182 -1411060 -1405069 -1399474
16912a399474P579J0802R035O787L368L354N677R102K571Q479O495Q098Q816Q043
$$ -1399474 -1391895 -1381093 -1372058 -1365271 -1361903 -1358549 -1352872 -1343770 -1341199 -1332720 -1326225 -1318127 -1309311 -1301268
16898a301268N446L034M110R506R201O809M551M659K816J649R723J2983J0847
$$ -1301268 -1295822 -1292788 -1288678 -1279172 -1269971 -1263162 -1258611 -1253952 -1251136 -1249487 -1239764 -1226781 -1215934
16885a215934O906M539P538O641K394N680P486P634O459K581N687N864N937N092
$$ -1215934 -1209028 -1204489 -1196951 -1190310 -1187916 -1182236 -1174750 -1167116 -1160657 -1158076 -1152389 -1146525 -1140588 -1135496
16871a135496O864R298J0625Q709K301J007k513K044M840L924L850M622L437O451
$$ -1135496 -1128632 -1119334 -1108709 -1100000 -1097699 -1096692 -1099205 -1097161 -1092321 -1088397 -1084547 -1079925 -1076488 -1070037
16857a070037O115K516P578Q106L036K953L357M397N978P778P181K735j361K605
$$ -1070037 -1063922 -1061406 -1053828 -1045722 -1042686 -1039733 -1036376 -1031979 -1026001 -1018223 -1011042 -1008307 -1009668 -1007063
16843a007063P053M728M429L978N531L437M004M67J669O750Q816L400M285N031
$$ -1007063 -1000010 -995282 -990853 -986875 -981344 -977907 -973903 -973436 -971767 -965017 -956201 -952801 -948516 -943485
16829i43485R80K897N418M355N662L82J557L982K928J537L626N219M426O135N452
$$ -943485 -942505 -939608 -934190 -929835 -924173 -923791 -922234 -918252 -915324 -913787 -910161 -904942 -900516 -894381 -888929
16814h88929L900N057N226L049M408k693k743L642N007J774K358K563L695j479
$$ -888929 -885029 -879972 -874746 -871697 -867289 -869982 -872725 -869083 -864076 -862302 -859944 -857381 -853686 -855165
16800h55165m813m599r95R711Q680M539M110M516N131M717q2N806L804J208J134
$$ -855165 -859978 -864577 -865572 -855861 -847181 -842642 -838532 -834016 -828885 -824168 -824250 -818444 -814640 -813432 -812298
16785h12298N009L425P250L134K08K463J804j70L260L613K868J042J632M326N011
$$ -812298 -807289 -803864 -796614 -793480 -793272 -790809 -789005 -789175 -785915 -782302 -779434 -778392 -776760 -772434 -767423
16770g67423L676p37J777M835N573M652K349K713N01j151O38N828O868M092J061
$$ -767423 -763747 -764484 -762707 -757872 -752299 -747647 -745298 -742585 -742084 -743235 -742597 -736769 -729901 -725809 -724748
16755g24748M533O207J873R62p01j067N5j98m246q058k015L349O619Q491Q288
$$ -724748 -720215 -714008 -712135 -711173 -711874 -712941 -712886 -713084 -717330 -725388 -727403 -724054 -717435 -708944 -700656
16740g00656J619O559K930K208K714N48J240PJ973L382K023L692Q42K65P111Q81
$$ -700656 -699037 -692478 -689548 -687340 -684626 -684078 -682838 -682831 -680858 -677476 -675453 -671761 -670919 -670654 -663543 -662662
16724f62662L616J798L079L604L087Q60q13L861N654K336M379L275n61j472N530
$$ -662662 -659046 -657248 -654169 -650565 -647478 -646618 -647431 -643570 -637916 -635580 -631201 -627926 -628487 -629959 -624429
16709f24429L824K546J223K980L925L156L939O69J001K729j201q767q431j620
$$ -624429 -620605 -618059 -616836 -613856 -609931 -606775 -602836 -602167 -601166 -598437 -599638 -608405 -616836 -618456
16695f18456K636P074L509M924Q96N86M698L513j340r4N106J822r63J758M423
$$ -618456 -615820 -608746 -605237 -600313 -599417 -598831 -594133 -590620 -591960 -592054 -586948 -585126 -586089 -584331 -579908
16680e79908K765K043o84J978K197J424K228L475K534K248N07P69K465O87o22
$$ -579908 -577143 -575100 -575784 -573806 -571609 -570185 -567957 -564482 -561948 -559700 -559193 -558424 -555959 -555272 -555894
16665e55894j906K215L225O196J642N89J492J783J276N434L846L582j782M141
$$ -555894 -557800 -555585 -552360 -546164 -544522 -543933 -542441 -540658 -539382 -533948 -530102 -526520 -528302 -524161
16651e24161K422M195M395L613M914K571r397q611k92K016r48k142N493P785L941
$$ -524161 -521739 -517544 -513149 -509536 -504622 -502051 -511448 -520059 -520351 -518335 -519283 -521425 -515932 -508147 -504206
16636e04206L372O18K34R35K624N64Q82q67M465O002L947O60K412L830O78K711
$$ -504206 -500834 -500216 -499982 -499047 -496423 -495859 -494977 -495844 -491379 -485377 -481430 -480770 -478358 -474528 -473850 -471139
16620d71139K151M103M589M106l40o72L697j67J963R59J373O107K846M568O059
$$ -471139 -468988 -464885 -460296 -456190 -456530 -457202 -453505 -453672 -451709 -450750 -449377 -443270 -440424 -435856 -429797
16605d29797Q252N710M589Q645J0201J1937J3925J8135K1483R431l2002r0208
$$ -429797 -421545 -415835 -411246 -402601 -392400 -380463 -366538 -348403 -326920 -317489 -349491 -439699
16593d39699r5870m8019L095J9165J5611J5378J2398P439P034L752N094R493N493
$$ -439699 -535569 -583588 -580493 -561328 -545717 -530339 -517941 -510502 -503468 -499716 -494622 -485129 -479636
16580d79636L444K60K402K342J372N970L868M714N583M885K9j249K442J562O727
$$ -479636 -476192 -475932 -473530 -471188 -469816 -463846 -459978 -455264 -449681 -444796 -444767 -446016 -443574 -442012 -435285
16565d35285J967Q82K160L172M427N398K675J069N170M763K091L758N231O057
$$ -435285 -433318 -432436 -430276 -427104 -422677 -417279 -414604 -413535 -408365 -403602 -401511 -397753 -392522 -386465
16551c86465M570Q898O490N953P833J2026J4794J5800J8955k90n2313r6230p9155
$$ -386465 -381895 -372997 -366507 -360554 -352721 -340695 -325901 -310101 -291146 -291436 -343749 -439979 -519134
16538e19134k0175J4109J7710J1031J1876J1028J2317O738M351N704N829M747
$$ -519134 -539309 -525200 -507490 -496459 -484583 -473555 -461238 -454500 -450149 -444445 -438616 -433869
16526d33869L270N332L664K187M636R51L290M638J912M739K350J82J038P10K316
$$ -433869 -430599 -425267 -421603 -419416 -414780 -413829 -410539 -405901 -403989 -399250 -396900 -396718 -395680 -394970 -392654
16511c92654Q88N336J704m040n247J365Q36k248M93J994J516J833M146L061K142
$$ -392654 -391766 -386430 -384726 -388766 -394013 -392648 -391812 -394060 -393567 -391573 -390057 -388224 -384078 -381017 -378875
16496c78875l169O78L418M148M422j973j265N43n733o227j167L020L592K070k954
$$ -378875 -382044 -381366 -377948 -373800 -369378 -371351 -372616 -372073 -377806 -384033 -385200 -382180 -378588 -376518 -379472
16481c79472K109O799O089K876n25J558K781J411J849M113L614R34j536M078J000
$$ -379472 -377363 -370564 -364475 -361599 -362124 -360566 -357785 -356374 -354525 -350412 -346798 -345864 -347400 -343322 -342322
16466c42322p501q063O70J648j616K989O634j299j264K630K084L180L769N122
$$ -342322 -349823 -357886 -357216 -355568 -357184 -354195 -347561 -348860 -350124 -347494 -345410 -342230 -338461 -333339
16452c33339j601j323K159q07m791K129L397K552o2m92l03K579K512M618Q27J061
$$ -333339 -334940 -336263 -334104 -334911 -339702 -337573 -334176 -331624 -331686 -332178 -332481 -329902 -327390 -322772 -321945 -320884
16436c20884M724r44l781J426N157p4k462J024J799L183M029p06j506k319P58
$$ -320884 -316160 -317104 -320885 -319459 -314302 -314376 -316838 -315814 -314015 -310832 -306803 -307509 -309015 -311334 -310576
16421c10576J243J199K815J816K364L159K091j659r201p945R47K282J735O97M825
$$ -310576 -309333 -308134 -305319 -303503 -301139 -297980 -295889 -297548 -306749 -314694 -313747 -311465 -309730 -309033 -304208
16406c04208K607K465j60K69K628J363N469P44J171j06n793k833j2J559J723L15
$$ -304208 -301601 -299136 -299296 -299027 -296399 -295036 -289567 -288823 -287652 -287758 -293551 -296384 -296396 -294837 -293114 -292799
16390b92799L332j97q63M489L316L958K748l671j295J862p52J826K126Q44K237
$$ -292799 -289467 -289664 -290527 -286038 -282722 -278764 -276016 -279687 -280982 -279120 -279872 -278046 -275920 -275076 -272839
16375b72839j336k92J045O45O34L060m71j540J195j03j375J318L487K316p87j71
$$ -272839 -274175 -274467 -273422 -272777 -272143 -269083 -269554 -271094 -269899 -270002 -271377 -270059 -266572 -264256 -265043 -265214
16359b65214J940L715J378r34K53p17j622J47J036M581J355k351L358Q27l303
$$ -265214 -263274 -259559 -258181 -259115 -258862 -259579 -261201 -261054 -260018 -255437 -254082 -256433 -253075 -252248 -255551
16344b55551j6N47k072K569J244K826K474J373r59P47J941j07J77K861j185j946
$$ -255551 -255567 -255020 -257092 -254523 -253279 -250453 -247979 -246606 -247565 -246818 -244877 -244984 -244807 -241946 -243131 -245077
16328b45077L926J719M424K244p19K578j938l551n784J630L475j415K795K351
$$ -245077 -241151 -239432 -235008 -232764 -233483 -230905 -232843 -236394 -242178 -240548 -237073 -238488 -235693 -233342
16314b33342j922k040J487O223L656L035j758p80K641K028j853L4L113J18j638
$$ -233342 -235264 -237304 -235817 -229594 -225938 -222903 -224661 -225441 -222800 -220772 -222625 -222591 -219478 -219360 -220998
16299b20998K178M35O20m57k630P30K740M79K889j142n08k630j099R73J942j571
$$ -220998 -218820 -218385 -217765 -218222 -220852 -220122 -217382 -216903 -214014 -215156 -215664 -218294 -219393 -218420 -216478 -218049
16283b18049J897M543K628P64J978n72p76j439K054J971k074L16L798R63J060
$$ -218049 -216152 -211609 -208981 -208217 -206239 -206811 -207587 -209026 -206972 -205001 -207075 -206759 -202961 -201998 -200938
16268b00938o46L491J599l381J333J421j08k481m116L979M406K057K648j522L62
$$ -200938 -201584 -198093 -196494 -199875 -198542 -197121 -197229 -199710 -203826 -199847 -195441 -193384 -190736 -192258 -191896
16253a91896L875p33m409l722P86R09K380J930j079J95J83J265O452K948j909
$$ -191896 -188021 -188754 -193163 -196885 -196099 -195190 -192810 -190880 -191959 -191764 -191581 -190316 -183864 -180916 -182825
16238a82825k285k232J135K372L891K903P8j471o0j073L207j610o081j865K530
$$ -182825 -185110 -187342 -186207 -183835 -179944 -177041 -176963 -178434 -178494 -179567 -176360 -177970 -184051 -185916 -183386
16223a83386O81J018J629J512K334L815j019j360K261K950j698j123m02k556l094
$$ -183386 -182705 -181687 -180058 -178546 -176212 -172397 -173416 -174776 -172515 -169565 -171263 -172386 -172788 -175344 -178438
16208a78438L536K756K479k80L93j509q11M458M732R95j737L511l27j542L614
$$ -178438 -174902 -172146 -169667 -169947 -169554 -171063 -171874 -167416 -162684 -161689 -163426 -159915 -160242 -161784 -158170
16193a58170L004k019J464J619K49j980j32M169J13k684l39j102l544j317n22
$$ -158170 -155166 -157185 -155721 -154102 -153853 -155833 -155965 -151796 -151683 -154367 -154706 -155808 -159352 -160669 -161191
16178a61191L003O562j692k610J391J444J162Q7K812K739J419j370j258m321j368
$$ -161191 -158188 -151626 -153318 -155928 -154537 -153093 -151931 -151844 -149032 -146293 -144874 -146244 -147502 -151823 -153191
16163a53191K233L693L820O38J592K302j963K412k9j743Q23j277K767K977J641
$$ -153191 -150958 -147265 -143445 -142807 -141215 -138913 -140876 -138464 -138493 -140236 -139413 -140690 -137923 -134946 -133305
16148a33305m40q1l25J302k475k151N60L28K761O77Q22n27j583O52j018L15M409
$$ -133305 -133745 -133826 -134151 -132849 -135324 -137475 -136915 -136587 -133826 -133149 -132327 -132854 -134437 -133785 -134803 -134488 -130079
16131a30079K992J210k102j574J972M350m81j177m75J361K627K321k854N62J161
$$ -130079 -127087 -125877 -127979 -129553 -127581 -123231 -123712 -124889 -125364 -124003 -121376 -119055 -121909 -121347 -120186
16116a20186p50O86J492k116q46J497K282m38j834l676L387P071n54n23J460j794
$$ -120186 -120936 -120250 -118758 -120874 -121720 -120223 -117941 -118379 -120213 -123889 -120502 -113431 -113985 -114508 -113048 -114842
16100a14842l81P7J851M111j04j557j11K15J244K011K253J252j969p80k734L740
$$ -114842 -115223 -115146 -113295 -109184 -109288 -110845 -110956 -110741 -109497 -107486 -105233 -103981 -105950 -106730 -109464 -105724
16084a05724K50R68J465J373p32J36p13k049O66K670L260K90l948J55M479J705
$$ -105724 -105474 -104506 -103041 -101668 -102400 -102264 -102977 -105026 -104360 -101690 -98430 -98140 -102088 -101933 -97454 -95749
16068i5749k70k34j449j239q34P63M442K107K336k5k962J856J285M62l800k491
$$ -95749 -96019 -96253 -97702 -98941 -99775 -99012 -94570 -92463 -90127 -90152 -93114 -91258 -89973 -89511 -93311 -95802
16052i5802K704M753J101L933k251j589m12k907L628K012r10j40J199k726M166
$$ -95802 -93098 -88345 -87244 -83311 -85562 -87151 -87563 -90470 -86842 -84830 -85740 -85880 -84681 -87407 -83241
16037h3241K555J024J714q57K133R09j804J820J533l711k587l356q82K281K811
$$ -83241 -80686 -79662 -77948 -78805 -76672 -75763 -77567 -75747 -74214 -77925 -80512 -83868 -84750 -82469 -79658
16022g9658K542J21J504k63L100q82O7J770L151K32j959k150j212L290k37k630
$$ -79658 -77116 -76995 -75491 -75754 -72654 -73536 -73469 -71699 -68548 -68316 -70275 -72425 -73637 -70347 -70584 -73214
16006g3214M74N590J427k484j66O39j025Q21Q4j526m88j044J938o73n18K203K163
$$ -73214 -72740 -67150 -65723 -68207 -68373 -67734 -68759 -67938 -67854 -69380 -69868 -70912 -68974 -69647 -70165 -67962 -65799
15989f5799j746q07K29J537M210L964J385J963P0r1K588K648l148o029j744M518
$$ -65799 -67545 -68352 -68123 -66586 -62376 -58412 -57027 -55064 -54994 -55085 -52497 -49849 -52997 -59026 -60770 -56252
15973e6252J697j469P77J723K53k088j664J692M343k67J59K997P50k859l384J703
$$ -56252 -54555 -56024 -55247 -53524 -53271 -55359 -57023 -55331 -50988 -51255 -51096 -48099 -47349 -50208 -53592 -51889
15957e1889L40J946J146K437J806l49J217K479j199k006j629K630J508L131N30
$$ -51889 -51549 -49603 -48457 -46020 -44214 -44563 -43346 -40867 -42066 -44072 -45701 -43071 -41563 -38432 -37902
15942c7902k697j369O04m78K943J302l06Q14j202K225L533K632j591k620K34q24
$$ -37902 -40599 -41968 -41364 -41842 -38899 -37597 -37903 -37089 -38291 -36066 -32533 -29901 -31492 -34112 -33878 -34702
15926c4702R35j099K167Q72j520j413L147Q63L23J254j347K079J428J101M323
$$ -34702 -33767 -34866 -32699 -31827 -33347 -34760 -31613 -30750 -30427 -29173 -30520 -28441 -27013 -25912 -21589
15911b1589O19j285Q45K726j974K774K885M85M681K015n15j562J699J110L685
$$ -21589 -20970 -22255 -21410 -18684 -20658 -17884 -14999 -14514 -9833 -7818 -8333 -9895 -8196 -7086 -3401
15896c401M243R83J794M008P502P227J2227N675j8568o0844m3440l74R806O678
$$ -3401 842 1825 3619 7627 15129 22356 34583 40258 21690 -39154 -82594 -82968 -73162 -66484
15882f6484N253N718M856M364N735L333N131k92N56K244k36j629j880L728Q58
$$ -66484 -61231 -55513 -50657 -46293 -40558 -37225 -32094 -32386 -31830 -29586 -29822 -31451 -33331 -29603 -28745
15867b8745R0K561L462N128L482k267k369N08K019N26K226J058L96N37k807k852
$$ -28745 -28655 -26094 -22632 -17504 -14022 -16289 -18658 -18150 -16131 -15605 -13379 -12321 -11925 -11388 -14195 -17047
15851a7047L859K959Q91K81L42k182J148J967L028j035k706l032J639j910J523
$$ -17047 -13188 -10229 -9338 -9057 -8715 -10897 -9749 -7782 -4754 -5789 -8495 -11527 -9888 -11798 -10275
15836a0275L840J207j371OJ914K832N75l056K25Q40J166J286O89J192O94p34j029
$$ -10275 -6435 -5228 -6599 -6593 -4679 -1847 -1272 -4328 -4103 -3263 -2097 -811 -122 1070 1764 1030 1
15819Al094j576K642N150J512P11q13j077j333L885P091n30j519N33J521p35J198
$$ 1 -3093 -4669 -2027 3123 4635 5346 4533 3456 2123 6008 13099 12569 11050 11583 13104 12369 13567
15802A3567k848k42K517J303J992k032N239L344k169l751n689j711N72K520K355
$$ 13567 10719 10477 12994 14297 16289 14257 19496 22840 20671 16920 11231 9520 10092 12612 14967
15787A4967O12K463O92m82j837J026M395k337l0K32O70J526K064j381p68l27R25
$$ 14967 15579 18042 18734 18252 16415 17441 21836 19499 19469 19701 20371 21897 23961 22580 21812 21485 22410
15770B2410L73M95k088L345q3M253j207o08M907M670j575m397j032O85l551J213
$$ 22410 22783 23278 21190 24535 24452 28705 27498 26890 31797 36467 34892 30495 29463 30148 26597 27810
15754B7810O23p68o02R46M617L001k446N08J457R97J232j294l758Q30J005K232
$$ 27810 28433 27665 27063 28009 32626 35627 33181 33689 35146 36143 37375 36081 32323 33153 34158 36390
15738C6390J157J615J722j866n04j700m039Q6K915J89o71l70J254L90l576L150
$$ 36390 37547 39162 40884 39018 38514 36814 32775 32861 35776 35965 35294 34924 36178 36568 32992 36142
15722C6142M590J160k125J289K220k21l154j515J977K297K956J398K633K425j021
$$ 36142 40732 41892 39767 41056 43276 43055 39901 38386 40363 42660 45616 47014 49647 52072 51051
15707E1051j008k244l305K402Q38J395j89Q02K36R84k491l388J225K634K275Q6
$$ 51051 50043 47799 44494 46896 47734 49129 48940 49742 49978 50962 48471 45083 46308 48942 51217 51303
15691E1303o44P40J791K121L109j724j841N11K505K198J939J986k838j392o7j181
$$ 51303 50659 51399 53190 55311 58420 56696 54855 55366 57871 60069 62008 63994 61156 59764 59697 58516
15675E8516J060J075m44m17J643J45k27j944K919J777J964K757Q35p23J023k289
$$ 58516 59576 60651 60207 59790 61433 61578 61351 59407 62326 64103 66067 68824 69659 68936 69959 67670
15659F7670O86O06J552K303q52k660l724N26J174J830M837L534K71j964k908j569
$$ 67670 68356 68962 70514 72817 71965 69305 65581 66107 67281 69111 73948 77482 77753 75789 72881 71312
15643G1312J566m95K039L984K862k147k520L300N008l669j141K013j663k269J542
$$ 71312 72878 72383 74422 78406 81268 79121 76601 79901 84909 81240 80099 82112 80449 78180 79722
15628G9722K310p8j715j112N22L609K52j983l844q68J954L881K104J468K678l43
$$ 79722 82032 81954 80239 79127 79649 83258 83510 81527 77683 76815 78769 82650 84754 86222 88900 88557
15612H8557l637k249K480L133J725l407J162O135J562O7M94Q23j069m400k227
$$ 88557 84920 82671 85151 88284 90009 86602 87764 93899 95461 95528 96022 96845 95776 91376 89149
15597H9149N047J603l40p93k063L47J078J002J107l033J492Q32J749R82J799M408
$$ 89149 94196 95799 95459 94666 92603 92950 94028 95030 96137 93104 94596 95428 97177 98159 99958 104366
15581A04366O67K929J66J296J883l153j508R6K005j345p01J003J883N049K198
$$ 104366 105033 107962 108128 109424 111307 108154 106646 106742 108747 107402 106701 107704 109587 114636 116834
15566A16834m02m69M592K655L948N526l846j8472k5207n009K912K919K382L721
$$ 116834 116432 115963 120555 123210 127158 132684 128838 110366 85159 80150 83062 85981 88363 92084
15552I2084M197K294m42j947L601O13K0J187Q31N280J873k113k089o75K283J213
$$ 92084 96281 98575 98133 96186 99787 100400 100420 101607 102438 107718 109591 107478 105389 104714 106997 108210
15536A08210K810K652J775Q79j810Q81J485k051k256K476K090K15L67j672L472
$$ 108210 111020 113672 115447 116326 114516 115397 116882 114831 112575 115051 117141 117356 117723 116051 119523
15521A19523R34k066k651r8J836L012K5L027q55k684J080L003J526q04j545J759
$$ 119523 120457 118391 115740 115642 117478 120490 120515 123542 122687 120003 121083 124086 125612 124808 123263 125022
15505A25022L117J110j513o97K596J116l319j71J534J216j943k628l073J477J020
$$ 125022 128139 129249 127736 127039 129635 130751 127432 127261 128795 130011 128068 125440 122367 123844 124864
15490A24864j021L76J055J222M447K208j301K517K514M59J227p10j132m468K37
$$ 124864 123843 124219 125274 126496 130943 133151 131850 134367 136881 137340 138567 137857 136725 132257 132494
15475A32494J998J240j109q04J795K834O03J060M800q35o08l12J983N6j541o40
$$ 132494 134492 135732 134623 133819 135614 138448 139051 140111 144911 144076 143468 143156 145139 145195 143654 143014
15459A43014K418K381o36Q83K89K556k25l97j101J779J430J908L88K37j977j393
$$ 143014 145432 147813 147177 148060 148349 150905 150680 150283 149182 150961 152391 154299 154687 154924 152947 151554
15443A51554M76r76M77M097M55k709l179j933P44J745j068k465m09M169M438K111
$$ 151554 152030 151054 151531 155628 156083 153374 150195 148262 149006 150751 149683 147218 146809 150978 155416 157527
15427A57527J426J905p83k704r52j138K32K752n58L024R96L154P60k991j921l054
$$ 157527 158953 160858 160075 157371 156419 155281 155513 158265 157707 160731 161727 164881 165641 162650 160729 157675
15411A57675L978N785K241Q43N54J785m447M77L198l030O26N093J625R61o03J71
$$ 157675 161653 167438 169679 170522 171076 172861 168414 168891 172089 169059 169685 174778 176403 177364 176761 176932
15395A76932K757l440j947J121Q92K36j42k761J921J353m9J594K548K008k12j048
$$ 176932 179689 176249 174302 175423 176315 176551 176409 173648 175569 176922 176873 178467 181015 183023 182811 181763
15379A81763k367l4Q5J40K583k269k376J700L665J426p88m047k71J15j208k804
$$ 181763 179396 179362 179447 179587 182170 179901 177525 179225 182890 184316 183528 179481 179210 179325 178117 175313
15363A75313M906N865K944n84q16L892O61n18l24n02j438L01M094q56J813n59
$$ 175313 180219 186084 189028 188444 187628 191520 192181 191663 191339 190837 189399 189700 193794 192938 194751 194192
15347A94192J112J208Q92j139j156j062l43M022K113K831L144j967l455L127J948
$$ 194192 195304 196512 197404 196265 195109 194047 193704 197726 199839 202670 205814 203847 200392 203519 205467
15332B05467k125Q09J713m25o90J151K130k227o150O70R111L411j355K78M01q49
$$ 205467 203342 204151 205864 205439 204749 205900 208030 205803 199653 200323 209434 212845 211490 211768 212169 211320
15316B11320j06j129q16n17K662k975O43K975L796j072j234J496p05L393L31j240
$$ 211320 211214 210085 209269 208752 211414 208439 209082 212057 215853 214781 213547 215043 214338 217731 218062 216822
15300B16822O22J261J397L22O70J365j924j874L716j599l43L422J341J536K504
$$ 216822 217444 218705 220102 220424 221094 222459 220535 218661 222377 220778 220435 223857 225198 226734 229238
15285B29238J767k299j56m83J13M297n89J181J369r54n171J981M163J735q23J99
$$ 229238 231005 228706 228550 228067 228180 232477 231888 233069 234438 233484 228313 230294 234457 236192 235369 235568
15269B35568L125J159o14l062R43L706N18J496L490j323m70J147K355J251l915
$$ 235568 238693 239852 239238 236176 237119 240825 241343 242839 246329 245006 244536 245683 248038 249289 245374
15254B45374l937L60L733O83r0q33J200L014J572j876m23K318m92j467J675K449
$$ 245374 241437 241797 245530 246213 246123 245290 246490 249504 251076 249200 248777 251095 250603 249136 250811 253260
15238B53260K268K905J369k898n0J664M07J562J725J164Q74L24L504N25J61j117
$$ 253260 255528 258433 259802 256904 256854 258518 258925 260487 262212 263376 264250 264574 268078 268603 268764 267647
15222B67647j799k528j655K452N12P00J775J235M946M096Q41K93r08j752J983
$$ 267647 265848 263320 261665 264117 264629 265329 267104 268339 273285 277381 278222 278515 277607 275855 277838
15207B77838L452N58m23J377K959o93k84L307k36Q12J499K758O59l201P70R36
$$ 277838 281290 281848 281425 282802 285761 285068 284784 288091 287855 288667 290166 292924 293583 290382 291152 292088
15191B92088N472J250M74O58l576j048l10L334K658j348l180j094J025K937L536
$$ 292088 297560 298810 299284 299942 296366 295318 295008 298342 301000 299652 296472 295378 296403 299340 302876
15176C02876N05J928N20J412K653K744j82r60k686M09Q78J330p90J731K589J537
$$ 302876 303381 305309 305829 307241 309894 312638 312456 311496 308810 309219 310097 311427 310637 312368 314957 316494
15160C16494J999K929o19j92n93J010L256K744L73q5J790L186M333L00J987l662
$$ 316494 318493 321422 320803 320611 320018 321028 324284 327028 327401 327316 329106 332292 336625 336925 338912 335250
15144C35250K397L339J448J371L221K739k590O98O570J251r71M43J034Q00O19
$$ 335250 337647 340986 342434 343805 347026 349765 347175 347873 354443 355694 354723 355166 356200 357000 357619
15129C57619L670K079P21p43l405j109K192K869K632L612J05N28K156k023J254
$$ 357619 361289 363368 364089 363346 359941 358832 361024 363893 366525 370137 370242 370770 372926 370903 372157
15114C72157J827J462K826J940n43m73L778M759L402J33RL750K075j330J071R360
$$ 372157 373984 375446 378272 380212 379669 379196 382974 387733 391135 391268 391277 395027 397102 395772 396843 406203
15098D06203J0381K840l23Q44L051J97K448L479M358N035J417J064M822L155L71
$$ 406203 416584 419424 419101 419945 422996 423193 425641 429120 433478 438513 439930 440994 445816 448971 449342
15083D49342J492K535L057L502M728K178n3M33J728M501M138M346L607L166N302
$$ 449342 450834 453369 456426 459928 464656 466834 466781 467214 468942 473443 477581 481927 485534 488700 494002
15068D94002K394N109Q924N698N527P385M183J623K068O720M924Q006P380N003
$$ 494002 496396 501505 510429 516127 521654 529039 533222 534845 536913 543633 548557 556563 563943 568946
15054E68946L835O417P253N885R111O650Q551Q601O538P583R273J3038J1272J0970
$$ 568946 572781 579198 586451 592336 601447 608097 616648 625249 631787 639370 648643 661681 672953 683923
15040F83923J2397J1337Q343J3740J6037J6604J6153J4746J4511J6527K2533K5267
$$ 683923 696320 707657 716000 729740 745777 762381 778534 793280 807791 824318 846851 872118
15028H72118K2136K6569K7720L0863L2430L8664L9755M1704M6288M6798N2262
$$ 872118 894254 920823 948543 979406 1011836 1050500 1090255 1131959 1178247 1225045 1277307
15017A277307O1827P5692P9936Q8949J04216J27621J60218J96007K36775K96706
$$ 1277307 1339134 1414826 1494762 1583711 1687927 1815548 1975766 2171773 2408548 2705254
15007B705254L90506N33795P12721Q35446L02892k257584n524784k570306M61150
$$ 2705254 3095760 3629555 4342276 5177722 5480614 3223030 -2301754 -4872060 -4410910
14998d410910Q27074O40219M62067L47736K70555K15239J75135J49569J28352
$$ -4410910 -3583836 -2943617 -2481550 -2133814 -1863259 -1648020 -1472885 -1323316 -1194964
14989a194964J14196J02702Q9331P5621O3017O1190N4890M5190L8687L6510K9408
$$ -1194964 -1080768 -978066 -888735 -813114 -750097 -688907 -634017 -588827 -550140 -513630 -484222
14978d84222L1593L2708K8645K2536K1637K1967K0477K3449J6990J7439J7157
$$ -484222 -452629 -419921 -391276 -368740 -347103 -325136 -304659 -281210 -264220 -246781 -229624
14967b29624J5443J6151J3092J4605J6512J1025R553R941Q794O958J3944J1178
$$ -229624 -214181 -198030 -184938 -170333 -153821 -142796 -133243 -123302 -114508 -107550 -93606 -82428
14955h2428O464P670O808O015Q194P196R045R308R923R845N743M051M061J721
$$ -82428 -75964 -68294 -61486 -55471 -47277 -40081 -31036 -21728 -11805 -1960 3783 7834 11895 13616
14941A3616J270O361P443P561N208N119L605J015L486O957M432J839J799Q15M794
$$ 13616 14886 21247 28690 36251 41459 46578 50183 51198 54684 61641 66073 67912 69711 70526 75320
14926G5320N054L466L905L450L021M846M875J426J014Q04M555O129M019L417o8
$$ 75320 80374 83840 87745 91195 94216 99062 103937 105363 106377 107181 111736 117865 121884 125301 125233
14911A25233n96K316J959J205K250J153o84L011M999J965L839K400ON349L513
$$ 125233 124637 126953 128912 130117 132367 133520 132836 135847 140846 142811 146650 149050 149056 154405 157918
14896A57918J156K470N917q94k60J504J067K646J075Q78L550N34J253N63j008
$$ 157918 159074 161544 167461 166567 166307 167811 168878 171524 172599 173477 177027 177561 178814 179377 178369
14881A78369L031L126j137J66J030J212K030L38K382K839M780k017L305J598k120
$$ 178369 181400 184526 183389 183555 184585 185797 187827 188165 190547 193386 198166 196149 199454 201052 198932
14866A98932L951K466M27N44J21O707L289j752q3J773K353J918J032j499k240
$$ 198932 202883 205349 205776 206320 206441 213148 216437 214685 214602 216375 218728 220646 221678 220179 217939
14851B17939K723K39j128M085K148J590j189M342M288l344J640O394J295k103
$$ 217939 220662 220901 219773 223858 226006 227596 226407 230749 235037 231693 233333 239727 241022 238919
14837B38919j039K137M548j570l47j911K538J908M88R29J623j99J225K250L054
$$ 238919 237880 240017 244565 242995 242648 240737 243275 245183 245671 246600 248223 248024 249249 251499 254553
14822B54553P29M434K015j538j264K557j472j725M534M528j599r51K177l329n12
$$ 254553 255282 259716 261731 260193 258929 261486 260014 258289 262823 267351 265752 264801 266978 263649 263137
14807B63137M397L475J922l560n246N632N441L600M91l89N529q95n466K136K653
$$ 263137 267534 271009 272931 269371 264125 269757 275198 278798 279289 278900 284429 283534 278068 280204 282857
14792B82857J729j044m36J78J768L251Q70j764J608J257L247K031Q54K008j097
$$ 282857 284586 283542 283106 283284 285052 288303 289173 287409 289017 290274 293521 295552 296406 298414 297317
14777B97317l492J755L072J186M579J447O55j453k491K384M063m349j055K484
$$ 297317 293825 295580 298652 299838 304417 305864 306519 305066 302575 304959 309022 304673 303618 306102
14763C06102p49Q46l18j525K863N484N206J278J139L736l565p74l65j895J373
$$ 306102 305353 306199 305881 304356 307219 312703 317909 319187 320326 324062 320497 319723 319358 317463 318836
14748C18836O796L025k810j015J892K164L577R04j487m286k330J036M366j300
$$ 318836 325632 328657 325847 324832 326724 328888 332465 333369 331882 327596 325266 326302 330668 329368
14734C29368J433K463m57j356K421J412l80l59l78L092K613p39P44P82J946n10
$$ 329368 330801 333264 332807 331451 333872 335284 334904 334545 334167 337259 339872 339133 339877 340659 342605 342095
14718C42095JK069Q69J529m12r64O6j147K003K89n56K588K301K854j170J569K988
$$ 342095 342096 344165 345034 346563 346151 345187 345253 344106 346109 346398 345842 348430 350731 353585 352415 353984 356972
14701C56972J049j915O6j213j323J091j607j903k07j794N018O406K100J643K035
$$ 356972 358021 356106 356172 354959 353636 354727 353120 351217 351010 349216 354234 360640 362740 364383 366418
14686C66418J454j329L85j24k76K245m88m008l683L093M267M182P086j322k626
$$ 366418 367872 366543 366928 366804 366528 368773 368285 364277 360594 363687 367954 372136 379222 377900 375274
14671C75274j220J415L348p5j874j659K993L783J403o37J982J584K13k228j268
$$ 375274 374054 375469 378817 378742 376868 375209 378202 381985 383388 382751 384733 386317 386530 384302 383034
14656C83034k08K140j461J95K659j103M21K591N61qL551L678L348L063j066K63
$$ 383034 382826 384966 383505 383700 386359 385256 385677 388268 388829 388821 392372 396050 399398 402461 401395 401658
14640D01658j295mR06j547K806J831j197N98m114k200K679L037j761j542J428
$$ 401658 400363 400359 401265 399718 402524 404355 403158 403756 399642 397442 400121 403158 401397 399855 401283
14625D01283J068J260K415N467J385j939R77K171N71j291l15K126o72j391l25
$$ 401283 402351 403611 406026 411493 412878 410939 411916 414087 414658 413367 413052 415178 414506 413115 412790
14610D12790o99j95L954O391K287k896j596O98j70J714L299j879k046J45J031
$$ 412790 412091 411896 415850 422241 424528 421632 420036 420734 420564 422278 425577 423698 421652 421797 422828
14595D22828K27K000o60L813J540R54n47o12K564N895L020k539m900k905J521
$$ 422828 423055 425055 424395 428208 429748 430702 430155 429543 432107 438002 441022 438483 433583 430678 432199
14580D32199J062K623P93Q46l7j72p75N262J052P29K191J473k21l4j565k02L798
$$ 432199 433261 435884 436677 437523 437486 437314 436539 441801 442853 443582 445773 447246 447025 446991 445426 445224 449022
14563D49022M17k133k54j008j114L334K578J532M179M95J195J398J017K223L867
$$ 449022 449439 447306 447052 446044 444930 448264 450842 452374 456553 457048 458243 459641 460658 462881 466748
14548D66748k44L18k198l414Q52L982L274J178J122j826k813K517L087J460J793
$$ 466748 466504 466822 464624 461210 462062 466044 469318 470496 471618 469792 466979 469496 472583 474043 475836
14533D75836j590k273J552M584J433l817k415J04J323N811N696O89j33p45l54
$$ 475836 474246 471973 473525 478109 479542 475725 473310 473414 474737 480548 486244 486933 486800 486055 485701
14518D85701K241P74m23K507j265J475L291N85n30l226j313K861M77k799J845
$$ 485701 487942 488716 488293 490800 489535 491010 494301 494886 494356 491130 489817 492678 493155 490356 492201
14503D92201N355L081J674N17j828N35J281k05J006l812j342M359K332l089K081
$$ 492201 497556 500637 502311 502828 501000 501535 502816 502611 503617 499805 498463 502822 505154 502065 504146
14488E04146J649j191M022J407K349J357m446R41o16K400L86L80L895L752J606
$$ 504146 505795 504604 508626 510033 512382 513739 509293 510234 509618 512018 512404 512784 516679 520431 522037
14473E22037L172k670j119l74k710J195K099M478P18k396J345J285K745k77P02
$$ 522037 525209 522539 521420 521046 518336 519531 521630 526108 526826 524430 525775 527060 529805 529528 530230
14458E30230K2K133J622L051M370J530k753j887K819L825j959j46L533J547J701
$$ 530230 530252 532385 534007 537058 541428 542958 540205 538318 541137 544962 543003 542857 546390 547937 549638
14443E49638l94j493P42Q458M609O085P186p218k8196j8751K059N027O808M242
$$ 549638 549244 547751 548493 556951 561560 567645 574831 567613 539417 520666 522725 527752 534560 538802
14429E38802L859j41J221K112L330J68j670K969L202p50J77R75j90J96p1K636
$$ 538802 542661 542520 543741 545853 549183 549351 547681 550650 553852 553102 553279 554254 554064 554260 554189 556825
14413E56825K243N40L413P301N21Q00J871rk253J184l67r07j42p10Q19j355K14
$$ 556825 559068 559608 563021 570322 570843 571643 573514 573505 571252 572436 572069 571162 571020 570310 571129 569774 569988
14396E69988L111k669K582J912N39J801K860J690K708N890J612l447j116M179
$$ 569988 573099 570430 573012 574924 575463 577264 580124 581814 584522 590412 592024 588577 587461 591640
14382E91640M030n0O32j592k030J570J864k652m75r43o02L945L991L644K374j281
$$ 591640 595670 595620 596252 594660 592630 594200 596064 593412 592937 591994 591392 595337 599328 602972 605346 604065
14366F04065K20R53J637M9L466Q44q41J743m43k140P38N214M885K640n39j181
$$ 604065 604285 605238 606875 606924 610390 611234 610393 612136 611693 609553 610291 615505 620390 623030 622491 621310
14350F21310P87J445J65J497R32J58J318k295k465j180O138O102J02k192j017
$$ 621310 622097 623542 623707 625204 626136 626294 627612 625317 622852 621672 627810 633912 634014 631822 630805
14335F30805j417j27J064K887M139M662o8l239J418J912R2Q48L769M406J08q08
$$ 630805 629388 629261 630325 633212 637351 642013 641945 638706 640124 642036 642128 642976 646745 651151 651259 650451
14319F50451k6k26j053J149K904O81J172J9P36N69K565J378j949p97k17J463J977
$$ 650451 650425 650199 649146 650295 653199 653880 655052 655071 655807 656376 658941 660319 658370 657573 657356 658819 660796
14302F60796J218L826K039R19j06J213Q59K0J103J104L302J71N417J288j813P67
$$ 660796 662014 665840 667879 668798 668692 669905 670764 670784 671887 672991 676293 676464 681881 683169 681356 682123
14286F82123L123J081m309j939K980j400L388M176L299K108O17j089q12K239J05
$$ 682123 685246 686327 682018 680079 683059 681659 685047 689223 692522 694630 695247 694158 693346 695585 695690
14271F95690k887J599K490J895M092J27p71k856K02J958O084L933K711N95L988
$$ 695690 692803 694402 696892 698787 702879 703006 702235 699379 699581 701539 707623 711556 714267 714862 718850
14256G18850J055j130M83L444n04k517k184q06K48Q71J189O07M117M651J905k102
$$ 718850 719905 718775 719258 722702 722198 719681 717497 716691 716939 717810 718999 719606 723723 728374 730279 728177
14240G28177R64J651L790Q43l821j804L759J887L133M945L907k057l853o52N195
$$ 728177 729141 730792 734582 735425 731604 729800 733559 735446 738579 743524 747431 745374 741521 740869 746064
14225G46064J958q94L252J687K516K417o31J275M44m46j98k155N900J736k641
$$ 746064 748022 747128 750380 752067 754583 757000 756369 757644 758088 757642 757444 755289 761189 762925 760284
14210G60284J428K956L241J26k708L86L537J180L389K960k64j955j277j634J722
$$ 760284 761712 764668 767909 768035 765327 765713 769250 770430 773819 776779 776515 774560 773283 771649 773371
14195G73371M462N488M753k014K441J000K206K386J178j161k146n04M184J684
$$ 773371 777833 783321 788074 786060 788501 789501 791707 794093 795271 794110 791964 791460 795644 797328
14181G97328j711j230Q38K465K707R30K144L118K801K792L500j227L003K658J31
$$ 797328 795617 794387 795225 797690 800397 801327 803471 806589 809390 812182 815682 814455 817458 820116 820247
14166H20247M05K44N99n36j060J684L250J076J742L062k412K559O217j331K278
$$ 820247 820652 820896 821495 820959 819899 821583 824833 825909 827651 830713 828301 830860 837077 835746 838024
14151H38024J933J292o12K38J803M92m195j313O019P810L301k160K326K867K759
$$ 838024 839957 841249 840637 840875 842678 843170 838975 837662 843681 851491 854792 852632 854958 857825 860584
14136H60584l380j792k236J316O734O713K763O71J71m627j464P941N687L91j489
$$ 860584 857204 855412 853176 854492 861226 867939 870702 871373 871544 866917 865453 873394 879081 879472 877983
14121H77983N56J778K319L373K013J953K491J078m15j89K476j294K97J916m41
$$ 877983 878539 880317 882636 886009 888022 889975 892466 893544 893129 892940 895416 894122 894419 896335 895894
14106H95894L108M028N425K424K641L59k548k71K640j445J333J045L422K612N099
$$ 895894 899002 903030 908455 910879 913520 913879 911331 911060 913700 912255 913588 914633 918055 920667 925766
14091I25766J925l154L033N922L83j71J6o06K968L600k52J277L704J502J15J736
$$ 925766 927691 924537 927570 933492 933875 933704 933720 933114 936082 939682 939430 940707 944411 945913 946028 947764
14075I47764j07K586N036K788j105K847J678j009R39K689J47r3J447L077l98k584
$$ 947764 947657 950243 955279 958067 956962 959809 961487 960478 961417 964106 964253 964160 965607 968684 968286 965702
14059I65702J744L718L003M069K031K516K777P91J062L69K915K439L900k125k397
$$ 965702 967446 971164 974167 978236 980267 982783 985560 986351 987413 987782 990697 993136 997036 994911 992514
14044I92514k11K755L445J836K332j33o04N076O137N028K97J494J992j21J515
$$ 992514 992303 995058 998503 1000339 1002671 1002538 1001934 1007010 1013147 1018175 1018472 1019966 1021958 1021837 1023352
14029A023352O46L271L459M271K084J501o87j023K940L473K421r86jL444j904
$$ 1023352 1023998 1027269 1030728 1034999 1037083 1038584 1037897 1036874 1039814 1043287 1045708 1044722 1044721 1048165 1046261
14014A046261M43K923J610J368K747J509m83N129M225J673R11L083J623L792P58
$$ 1046261 1046704 1049627 1051237 1052605 1055352 1056861 1056378 1061507 1065732 1067405 1068316 1071399 1073022 1076814 1077572
13999A077572O16K636J480L872L332J440K077J20L093M515M005M852Q822M086
$$ 1077572 1078188 1080824 1082304 1086176 1089508 1090948 1093025 1093145 1096238 1100753 1104758 1109610 1118432 1122518
13985A122518j063k485o31K623k84l53J269M661J969K210p34J193O695N274K290
$$ 1122518 1121455 1118970 1118339 1120962 1120678 1120325 1121594 1126255 1128224 1130434 1129700 1130893 1137588 1142862 1145152
13970A145152R17K596K747N176R81k076p37J83L701L173J372M130M060M32K673
$$ 1145152 1146069 1148665 1151412 1156588 1157569 1155493 1154756 1154939 1158640 1161813 1163185 1167315 1171375 1171807 1174480
13955A174480L087M905M319J948o45k53L123L846K992K467j81n120O47L162P140
$$ 1174480 1177567 1182472 1186791 1188739 1188094 1187841 1190964 1194810 1197802 1200269 1200088 1194968 1195615 1198777 1205917
13940A205917N109R39J500N238K716K410J132K446R50L57N095K774J212K043M931
$$ 1205917 1211026 1211965 1213465 1218703 1221419 1223829 1224961 1227407 1228357 1228714 1233809 1236583 1237795 1239838 1244769
13925A244769M899L727J157J273m72L532P054J73j886J588L370L766N819N317
$$ 1244769 1249668 1253395 1254552 1255825 1255353 1258885 1265939 1266112 1264226 1265814 1269184 1272950 1278769 1284086
13911A284086J312J934J839J229J828M442n50N840N149M857k037O59P123N848
$$ 1284086 1285398 1287332 1289171 1290400 1292228 1296670 1296120 1301960 1307109 1311966 1309929 1310588 1317711 1323559
13897A323559M707K693m56Q99L167K161L171M765N945O604M005J641J123L841
$$ 1323559 1328266 1330959 1330503 1331402 1334569 1336730 1339901 1344666 1350611 1357215 1361220 1362861 1363984 1367825
13883A367825K402m59N436O072o3k35p55M583K138J003N963N599Q297N995L669
$$ 1367825 1370227 1369768 1375204 1381276 1381213 1380978 1380223 1384806 1386944 1387947 1393910 1399509 1407806 1413801 1417470
13868A417470j678M30L122O705R114L833J75L985N746J393J577J708M305O349
$$ 1417470 1415792 1416222 1419344 1426049 1435163 1438996 1439171 1443156 1448902 1450295 1451872 1453580 1457885 1464234
13854A464234M946M318N322N704P086Q242L778O52l166K216K603J75N573P789
$$ 1464234 1469180 1473498 1478820 1484524 1491610 1499852 1503630 1504282 1501116 1503332 1505935 1506110 1511683 1519472
13840A519472R327Q373L934N775K529k263M152R163O274L634P152Q383P062M103
$$ 1519472 1528799 1537172 1541106 1546881 1549410 1547147 1551299 1560462 1566736 1570370 1577522 1585905 1592967 1597070
13826A597070M431M220M351Q051J2463Q615M272O099R695J1782J4331J9957J8082
$$ 1597070 1601501 1605721 1610072 1618123 1630586 1639201 1643473 1649572 1659267 1671049 1685380 1705337 1723419
13813A723419K0379J7596J7689J8435K136k4109m4322l7920j0198j944k2638m4146
$$ 1723419 1743798 1761394 1779083 1797518 1799654 1775545 1731223 1693303 1683105 1681161 1658523 1614377
13801A614377l3853k631J9387K8528K8724K8441L2022K2555j660k7197j7801J2525
$$ 1614377 1580524 1577893 1597280 1625808 1654532 1682973 1714995 1737550 1735890 1708693 1690892 1703417
13789A703417K4182J3124j5331j6714J3428J8307L892j8680l1468k3755r513j2392
$$ 1703417 1727599 1740723 1725392 1708678 1722106 1740413 1744305 1725625 1694157 1670402 1660889 1648497
13777A648497k0227k6725j9552O412K4932K5792J4099K095k0152r554J9926K1950
$$ 1648497 1628270 1601545 1581993 1588405 1613337 1639129 1653228 1655323 1635171 1625617 1645543 1667493
13765A667493m018l4136k2155J5267L3525L4293K5854K0117M465l6094o2664k9168
$$ 1667493 1663475 1629339 1607184 1622451 1655976 1690269 1716123 1736240 1740705 1704611 1641947 1612779
13753A612779J9465K3918k2489o9384n3718o291K0342K4727K3823J8134J8991
$$ 1612779 1632244 1656162 1633673 1564289 1510571 1504280 1524622 1549349 1573172 1591306 1610297
13742A610297J8133J7570J3471R036P463P697J1861J2643J3829J4777J1262N406
$$ 1610297 1628430 1646000 1659471 1668507 1675970 1683667 1695528 1708171 1722000 1736777 1748039 1753445
13730A753445P584O626O364J0993P557O782Q641R010N784O048Q617P626L729L880
$$ 1753445 1761029 1767655 1774019 1785012 1792569 1799351 1807992 1817002 1822786 1828834 1837451 1845077 1848806 1852686
13716A852686R503Q042M531N116Q889J0208N339N318P465M825P618R299M570L280
$$ 1852686 1862189 1870231 1874762 1879878 1888767 1898975 1904314 1909632 1917097 1921922 1929540 1938839 1943409 1946689
13702A946689O333O595Q140O940N804M585O841P935P421Q190N303P418J0963R164
$$ 1946689 1953022 1959617 1967757 1974697 1980501 1985086 1991927 1999862 2007283 2015473 2020776 2028194 2039157 2048321
13688B048321M318J103N666M794P209R484J0144R930N598J0235Q515R214O520
$$ 2048321 2052639 2053742 2059408 2064202 2071411 2080895 2091039 2100969 2106567 2116802 2125317 2134531 2141051
13675B141051P892N042N301J1561Q288O679L275L095P252O186O109P616J2284
$$ 2141051 2148943 2153985 2159286 2170847 2179135 2185814 2189089 2192184 2199436 2205622 2211731 2219347 2231631
13662B231631O869L793O792O096O883J2156R379M651L591M042J0048R950O542
$$ 2231631 2238500 2242293 2249085 2255181 2262064 2274220 2283599 2288250 2291841 2295883 2305931 2315881 2322423
13649B322423M327m1J2076J8833R080Q005L618O876Q461J0008Q897R730N403J836
$$ 2322423 2326750 2326709 2338785 2357618 2366698 2374703 2378321 2385197 2393658 2403666 2412563 2422293 2427696 2429532
13635B429532M817Q103Q040Q031L920L027L343L260j386n950q430k3017l1327
$$ 2429532 2434349 2442452 2450492 2458523 2462443 2465470 2468813 2472073 2470687 2464737 2456307 2433290 2401963
13622B401963j9000L1132Q5828O9722K6962J5562J3393J6567J9355J4606O930
$$ 2401963 2382963 2414095 2499923 2569645 2596607 2612169 2625562 2642129 2661484 2676090 2683020
13611B683020P604J5330J3592J1178P544L482N895J3495P491P027Q762Q575J1668
$$ 2683020 2690624 2705954 2719546 2730724 2738268 2741750 2747645 2761140 2768631 2775658 2784420 2792995 2804663
13598B804663J2922J1198J0201J3359R277J0270J0812J2452J3878J1549M326N561
$$ 2804663 2817585 2828783 2838984 2852343 2861620 2871890 2882702 2895154 2909032 2920581 2924907 2930468
13586B930468Q079O914J5208J5894R679J2279J3877J4808J6114J1039J2677J5660
$$ 2930468 2938547 2945461 2960669 2976563 2986242 2998521 3012398 3027206 3043320 3054359 3067036 3082696
13574C082696K3555J9792J9547J7915J4012J7385J8576O588K901J0370J5343J7457
$$ 3082696 3106251 3126043 3145590 3163505 3177517 3194902 3213478 3220066 3222967 3233337 3248680 3266137
13562C266137J4882J4652J2402J7083K1377J8550K1576J8986J3970Q147J3019
$$ 3266137 3281019 3295671 3308073 3325156 3346533 3365083 3386659 3405645 3419615 3427762 3440781
13551C440781J8370J6640J7434J1272J0841J7637J4922R205M933J0417J8945K0284
$$ 3440781 3459151 3475791 3493225 3504497 3515338 3532975 3547897 3557102 3562035 3572452 3591397 3611681
13539C611681J8422J6095J1523R387J1360L552O49J0787J9563K2820K2032K4374
$$ 3611681 3630103 3646198 3657721 3667108 3678468 3682020 3682669 3693456 3713019 3735839 3757871 3782245
13527C782245J6644J7807J7976K2545K4525K1332J6878J4656J6378K0541K1025
$$ 3782245 3798889 3816696 3834672 3857217 3881742 3903074 3919952 3934608 3950986 3971527 3992552
13516C992552J5685J6784J9345J8664K2824K9121K7196J5596J6160L4256L9536
$$ 3992552 4008237 4025021 4044366 4063030 4085854 4114975 4142171 4157767 4173927 4208183 4247719
13505D247719M0530L1131J7290K3924M2495M8099M0180J9453r69J0307K0469K7091
$$ 4247719 4288249 4319380 4336670 4360594 4403089 4451188 4491368 4510821 4509852 4520159 4540628 4567719
13493D567719K6537J7386J1364J2997K5726K8335K4861K4352L1499L2163K2706
$$ 4567719 4594256 4611642 4623006 4636003 4661729 4690064 4714925 4739277 4770776 4802939 4825645
13482D825645J8537K1270Q043r707n794K3137M5636M9349M1409M3138M7095M6149
$$ 4825645 4844182 4865452 4873495 4863788 4857994 4881131 4926767 4976116 5017525 5060663 5107758 5153907
13470E153907M5609M7062L6033K4699L4619M2159L2440L1429L9257N5017O5804
$$ 5153907 5199516 5246578 5282611 5307310 5341929 5384088 5416528 5447957 5487214 5542231 5608035
13459E608035P7128P5691O0388M3786K9023K8534M0019M3579M0730L8009M2983
$$ 5608035 5685163 5760854 5821242 5865028 5894051 5922585 5962604 6006183 6046913 6084922 6127905
13448F127905N3065M9114N0728N3970N4341N3332M5293M1958M1561N6924O8790
$$ 6127905 6180970 6230084 6280812 6334782 6389123 6442455 6487748 6529706 6571267 6628191 6696981
13437F696981O7171O5543P0764O4377O0515N4973L6697K9287L8577N3337P1826
$$ 6696981 6764152 6829695 6900459 6964836 7025351 7080324 7117021 7146308 7184885 7238222 7310048
13426G310048P9895P8155N6780L9796L5584L3129M0544O3860Q1699R6907J04874
$$ 7310048 7389943 7468098 7524878 7564674 7600258 7633387 7673931 7737791 7819490 7916397 8021271
13415H021271R8078J01588J01431R1947Q5053Q5720R2466R6801R6909J00721J07787
$$ 8021271 8119349 8220937 8322368 8414315 8499368 8585088 8677554 8774355 8871264 8971985 9079772
13404I079772J10649J09728J22814J24187J16162J06471J14192J33835J47695
$$ 9079772 9190421 9300149 9422963 9547150 9663312 9769783 9883975 10017810 10165505
13395A0165505J55117J44788J37110J35166J42231J53286J59011J63778J62168
$$ 10165505 10320622 10465410 10602520 10737686 10879917 11033203 11192214 11355992 11518160
13386A1518160J65596J83635K05854K23558K35177K32989K23230K22797K30029
$$ 11518160 11683756 11867391 12073245 12296803 12531980 12764969 12988199 13210996 13441025
13377A3441025K38204K45169K54703K61716K66363K84114L18902L79468M26440
$$ 13441025 13679229 13924398 14179101 14440817 14707180 14991294 15310196 15689664 16116104
13368A6116104M42503M42386M27093M16124M45691N65178O96031P99830R31017
$$ 16116104 16558607 17000993 17428086 17844210 18289901 18855079 19551110 20350940 21281957
13359B1281957J153860J362051J058211j107749n537123m843550j2921J484418
$$ 21281957 22435817 23797868 24856079 23748330 18211207 13367657 13354736 14839154
13351A4839154J458132J239384J065485R68452R10832R13537R75875J049494J058941
$$ 14839154 16297286 17536670 18602155 19570607 20481439 21394976 22370851 23420345 24479286
13342B4479286R77070Q71152R13950J187956J411445J477575J354944J212788
$$ 24479286 25456356 26327508 27241458 28429414 29840859 31318434 32673378 33886166
13334C3886166J468957J831029K061994K211747K316389K546140K940733L396356
$$ 33886166 35355123 37186152 39248146 41459893 43776282 46322422 49263155 52659511
13326E2659511L789897M297269N042891N910061O973577Q374023J0104574J2236474
$$ 52659511 56449408 60746677 65789568 71699629 78673206 87047229 97151803 109388277
13318A09388277J4877082J8597545K3150827K1388739o286437q1273703j57214157
$$ 109388277 124265359 142862904 166013731 187402470 181116033 99842330 -57371827
13311e7371827j09835206j5640075J9414283K1707679J7120938J3257941J1099171
$$ -57371827 -167207033 -182847108 -163432825 -141725146 -124604208 -111346267 -100247096
13304a00247096R396750P907223O865854O003687N257735M658573M055802L459352
$$ -100247096 -90850346 -82943123 -76077269 -70073582 -64815847 -60157274 -56101472 -52642120
13296e2642120L064847K839942K569662K245801J980528J761943J494020J191189
$$ -52642120 -49577273 -46737331 -44167669 -41921868 -39941340 -38179397 -36685377 -35494188
13288c5494188J185849J275489J242595J122648R07627P59549Q02048Q25915Q06286
$$ -35494188 -34308339 -33032850 -31790255 -30667607 -29759980 -29000431 -28198383 -27372468 -26566182
13279b6566182P99548P75102P28319O67162O24927O02355N84124N58777N26659
$$ -26566182 -25766634 -24991532 -24263213 -23596051 -22971124 -22368769 -21784645 -21225868 -20699209
13270b0699209M94725M78589M69052M53338M37194M21637M14022L93645L56477
$$ -20699209 -20204484 -19725895 -19256843 -18803505 -18366311 -17944674 -17530652 -17137007 -16780530
13261a6780530L05854K59708K62155K98495K98940K56291K23287K33024K49662
$$ -16780530 -16474676 -16214968 -15952813 -15654318 -15355378 -15099087 -14875800 -14642776 -14393114
13252a4393114K62856K47483K28756K22639K17333K09080J99271J91842J83221
$$ -14393114 -14130258 -13882775 -13654019 -13431380 -13214047 -13004967 -12805696 -12613854 -12430633
13243a2430633J66979J54849J51846J43952J42873J48161J56726J53564J46367
$$ -12430633 -12263654 -12108805 -11956959 -11813007 -11670134 -11521973 -11365247 -11211683 -11065316
13234a1065316J47322J41172J46185J41345J26415J09814J01342R8683J11999
$$ -11065316 -10917994 -10776822 -10630637 -10489292 -10362877 -10253063 -10151721 -10053038 -9941039
13225i941039J21620J14612J06520J01837J03978J03013R8008R5487R4699Q8533
$$ -9941039 -9819419 -9704807 -9598287 -9496450 -9392472 -9289459 -9191451 -9095964 -9001265 -8912732
13215h912732Q6654R8767J02941R6607P8944O8826P2581O6429O7840Q0749Q7690
$$ -8912732 -8826078 -8727311 -8624370 -8527763 -8448819 -8379993 -8307412 -8240983 -8173143 -8092394 -8004704
13204h004704Q1631P5757P3620P2385P0377O3908N5125M9519M8706O5253P3104
$$ -8004704 -7923073 -7847316 -7773696 -7701311 -7630934 -7567026 -7511901 -7462382 -7413676 -7348423 -7275319
13193g275319O8770O2533N5806N0761N6232O2353N0648L7531M8235O0900N7897
$$ -7275319 -7206549 -7144016 -7088210 -7037449 -6981217 -6918864 -6868216 -6830685 -6782450 -6721550 -6663653
13182f663653M6999M7029N1326N6114N5682N2627M9513M4490L9982M2246M6835
$$ -6663653 -6616654 -6569625 -6518299 -6462185 -6406503 -6353876 -6304363 -6259873 -6219891 -6177645 -6130810
13171f130810M9772N3412M4620L6092K8961J8444O922J1365K4850M1157M6053
$$ -6130810 -6081038 -6027626 -5983006 -5946914 -5917953 -5899509 -5892587 -5881222 -5856372 -5815215 -5769162
13160e769162M2887L9364L0571L5734L7723K7389K2616K3861K6679K7762K8324
$$ -5769162 -5726275 -5686911 -5656340 -5620606 -5582883 -5555494 -5532878 -5509017 -5482338 -5454576 -5426252
13149e426252K0304J4466K7103N8564O8173M9322L5758L3076L0179K7719K6517
$$ -5426252 -5405948 -5391482 -5364379 -5305815 -5237642 -5188320 -5152562 -5119486 -5089307 -5061588 -5035071
13138e035071K9599L3312L5393K7285K8382L4732L7841L8333L1101K9973L8014
$$ -5035071 -5005472 -4972160 -4936767 -4909482 -4881100 -4846368 -4808527 -4770194 -4739093 -4709120 -4671106
13127d671106M1153L1741J5054O812K294J8626L7035L2544J4470J0928J3123K2597
$$ -4671106 -4629953 -4598212 -4583158 -4576346 -4574052 -4555426 -4518391 -4485847 -4471377 -4460449 -4447326 -4424729
13115d424729K3809J5144J2570J2903J2922K0287K6143K6329K2405K1157K4931
$$ -4424729 -4400920 -4385776 -4373206 -4360303 -4347381 -4327094 -4300951 -4274622 -4252217 -4231060 -4206129
13104d206129L1373K4449J8786K5310K6624K2468J8309J3116R315Q752R731J1939
$$ -4206129 -4174756 -4150307 -4131521 -4106211 -4079587 -4057119 -4038810 -4025694 -4016379 -4007627 -3997896 -3985957
13092c985957J9341K6106K4415J7767J7378J6306J7090J5905J7035J3027J3675
$$ -3985957 -3966616 -3940510 -3916095 -3898328 -3880950 -3864644 -3847554 -3831649 -3814614 -3801587 -3787912
13081c787912J5669J9300J6240J7013J8842J4641P641P267R987J6154J7692J7744
$$ -3787912 -3772243 -3752943 -3736703 -3719690 -3700848 -3686207 -3678566 -3671299 -3661312 -3645158 -3627466 -3609722
13069c609722J4862J0558O278R030J3295J8721J7117J2634J2691J2552J6094J7447
$$ -3609722 -3594860 -3584302 -3578024 -3568994 -3555699 -3536978 -3519861 -3507227 -3494536 -3481984 -3465890 -3448443
13057c448443J7198J2088R921J2121J2552J0415M551J308O786J3557J2346R869
$$ -3448443 -3431245 -3419157 -3409236 -3397115 -3384563 -3374148 -3369597 -3368289 -3361503 -3347946 -3335600 -3325731
13045c325731P985J1373J0996J1919Q214J1194J5883J7541J8673K0770J4066P698
$$ -3325731 -3317746 -3306373 -3295377 -3283458 -3275244 -3264050 -3248167 -3230626 -3211953 -3191183 -3177117 -3169419
13033c169419Q524J2041R446J2456J5739J1952Q904J2030J0748J2144J2751J1062
$$ -3169419 -3160895 -3148854 -3139408 -3126952 -3111213 -3099261 -3090357 -3078327 -3067579 -3055435 -3042684 -3031622
13021c031622O739Q262J3604J8387J4522L524K556P500J5748J5571Q138J99J423
$$ -3031622 -3024883 -3016621 -3003017 -2984630 -2970108 -2966584 -2964028 -2956528 -2940780 -2925209 -2917071 -2916872 -2915449
13008b915449M428K120m995l1268o8181l5609L6343N2783L8964K6996K1098J6530
$$ -2915449 -2911021 -2908901 -2913896 -2945164 -3013345 -3048954 -3012611 -2959828 -2920864 -2893868 -2872770 -2856240
12996b856240J3428J3058J2528R670J2719J2908J6904J2854J0816J1834J2976
$$ -2856240 -2842812 -2829754 -2817226 -2807556 -2794837 -2781929 -2765025 -2752171 -2741355 -2729521 -2716545
12985b716545M325L83K401Q761Q740R708R452M683O209Q254J2497J1218N962O083
$$ -2716545 -2712220 -2711837 -2709436 -2700675 -2691935 -2682227 -2672775 -2668092 -2661883 -2653629 -2641132 -2629914 -2623952 -2617869
12971b617869J0224Q789J0000J0870M455N823R877J1469J2397J0556J0185J2456
$$ -2617869 -2607645 -2598856 -2588856 -2577986 -2573531 -2567708 -2557831 -2546362 -2533965 -2523409 -2513224 -2500768
12959b500768O004J328J952K945J0644J2319P937N658N421O267R492O715L953
$$ -2500768 -2494764 -2493436 -2491484 -2488539 -2477895 -2465576 -2457639 -2451981 -2446560 -2440293 -2430801 -2424086 -2420133
12946b420133M339M678R956M361L791K583N723O015Q931Q689L735L962R458Q537
$$ -2420133 -2415794 -2411116 -2401160 -2396799 -2393008 -2390425 -2384702 -2378687 -2369756 -2361067 -2357332 -2353370 -2343912 -2335375
12932b335375M264N829O386R968N913R98M257P931Q997R711O749Q678N590M063
$$ -2335375 -2331111 -2325282 -2318896 -2308928 -2303015 -2302017 -2297760 -2289829 -2280832 -2271121 -2264372 -2255694 -2250104 -2246041
12918b246041N664N416R999R722P121L753P292Q566M033j147M514J2071P875P793
$$ -2246041 -2240377 -2234961 -2224962 -2215240 -2208119 -2204366 -2197074 -2188508 -2184475 -2185622 -2181108 -2169037 -2161162 -2153369
12904b153369N344R183J1874Q425K367M714P385Q923P646N836L089N331Q543R994
$$ -2153369 -2148025 -2138842 -2126968 -2118543 -2116176 -2111462 -2104077 -2095154 -2087508 -2081672 -2078583 -2073252 -2064709 -2054715
12890b054715J0973P535P196J1282J1283J2662R829Q255P479L442P497J0312J5408
$$ -2054715 -2043742 -2036207 -2029011 -2017729 -2006446 -1993784 -1983955 -1975700 -1968221 -1964779 -1957282 -1946970 -1931562
12877a931562K1097K0023J8289J9986J3912j415o91N254m595l4201n8536k5814
$$ -1931562 -1910465 -1890442 -1872153 -1852167 -1838255 -1839670 -1840361 -1835107 -1839702 -1873903 -1932439 -1958253
12865a958253J8623K0335j3546n4956o2684j1854K3399L0074K8919K9300J7527
$$ -1958253 -1939630 -1919295 -1932841 -1987797 -2050481 -2062335 -2038936 -2008862 -1979943 -1950643 -1933116
12854a933116p998k4864K088L0008K9946J7823j6040k7443O206L0572K7480Q315
$$ -1933116 -1941114 -1965978 -1963890 -1933882 -1903936 -1886113 -1902153 -1929596 -1923390 -1892818 -1865338 -1857023
12842a857023j8631l0424j9975n416O903m798k7003k8907j4615O52O842p709j7508
$$ -1857023 -1875654 -1906078 -1926053 -1931469 -1924566 -1929364 -1956367 -1985274 -1999889 -1999237 -1992395 -2000104 -2017612
12829b017612O880K3259K3715J699k5279j5411J4294K5724K7511L1525K9262J8084
$$ -2017612 -2010732 -1987473 -1963758 -1962059 -1987338 -2002749 -1988455 -1962731 -1935220 -1903695 -1874433 -1856349
12817a856349m60l2231m6345k0626M513J2955j2037n2522m7665j5071R484J8831
$$ -1856349 -1856809 -1889040 -1935385 -1956011 -1951498 -1938543 -1950580 -2003102 -2050767 -2065838 -2056354 -2037523
12805b037523J9689J5621J5189J3832R008J1564J3437J1561J0452P387M879N967
$$ -2037523 -2017834 -2002213 -1987024 -1973192 -1964184 -1952620 -1939183 -1927622 -1917170 -1909783 -1904904 -1898937
12793a898937N415P467P546O319J1561J3102P746K062J938N403O423K932N003
$$ -1898937 -1893522 -1886055 -1878509 -1872190 -1860629 -1847527 -1839781 -1837719 -1835781 -1830378 -1823955 -1821023 -1816020
12780a816020N281M904N599N084O284L793n07J410O306R345P427M80J520J709
$$ -1816020 -1810739 -1805835 -1800236 -1795152 -1788868 -1785075 -1785582 -1784172 -1777866 -1768521 -1761094 -1760614 -1759094 -1757385
12766a757385M452M309L974K913K421O026M427L960P07M717K620R52M019L889
$$ -1757385 -1752933 -1748624 -1744650 -1741737 -1739316 -1733290 -1728863 -1724903 -1724196 -1719479 -1716859 -1715907 -1711888 -1707999
12752a707999L546M888N531M634K858K534M944L557K363J632M188K536K090K024
$$ -1707999 -1704453 -1699565 -1694034 -1689400 -1686542 -1684008 -1679064 -1675507 -1673144 -1671512 -1667324 -1664788 -1662698 -1660674
12738a660674L918O006J111M286L295M340K395n34p70L121N205K462L520J811
$$ -1660674 -1656756 -1650750 -1649639 -1645353 -1642058 -1637718 -1635323 -1635857 -1636627 -1633506 -1628301 -1625839 -1622319 -1620508
12724a620508M688K352J290L695N843M981J164P06J510M545L190K253K498L265
$$ -1620508 -1615820 -1613468 -1612178 -1608483 -1602640 -1597659 -1596495 -1595789 -1594279 -1589734 -1586544 -1584291 -1581793 -1578528
12710a578528M524N751O688N977J746j930j561p56J634J464K268N95m96L002L376
$$ -1578528 -1574004 -1568253 -1561565 -1555588 -1553842 -1555772 -1557333 -1558089 -1556455 -1554991 -1552723 -1552128 -1552624 -1549622 -1546246
12695a546246J37N840M744M099J542M006L740O99R22L725K038J631K769L521L005
$$ -1546246 -1546109 -1540269 -1535525 -1531426 -1529884 -1525878 -1522138 -1521439 -1520517 -1516792 -1514754 -1513123 -1510354 -1506833 -1503828
12680a503828L514N095J623j47N056K761j442J165L835M460K295J066O78K096
$$ -1503828 -1500314 -1495219 -1493596 -1493743 -1488687 -1485926 -1487368 -1486203 -1482368 -1477908 -1475613 -1474547 -1473869 -1471773
12666a471773N114M068J261j942R30L300L156K563o63K024L072r75k38M711P265
$$ -1471773 -1466659 -1462591 -1461330 -1463272 -1462342 -1459042 -1455886 -1453323 -1453986 -1451962 -1448890 -1449865 -1450103 -1445392 -1438127
12651a438127R46J244J033k478j56M631N124O452M258K675J505J199k260K20L718
$$ -1438127 -1437181 -1435937 -1434904 -1437382 -1437538 -1432907 -1427783 -1421331 -1417073 -1414398 -1412893 -1411694 -1413954 -1413734 -1410016
12636a410016L537J847K745K667K336J396L394L877K657L576L317j263k548j764
$$ -1410016 -1406479 -1404632 -1401887 -1399220 -1396884 -1395488 -1392094 -1388217 -1385560 -1381984 -1378667 -1379930 -1382478 -1384242
12622a384242L765P035j414K741J131J192M800N714k10j632J172J676K49K063
$$ -1384242 -1380477 -1373442 -1374856 -1372115 -1370984 -1369792 -1364992 -1359278 -1359488 -1361120 -1359948 -1358272 -1358023 -1355960
12608a355960P141K745J462K155j130j771K035L923M757M012j592j35J382M06
$$ -1355960 -1348819 -1346074 -1344612 -1342457 -1343587 -1345358 -1343323 -1339400 -1334643 -1330631 -1332223 -1332358 -1330976 -1330570
12594a330570Q59L970K130j094o11R28N590j274J451Q447M374l48j934P11J718
$$ -1330570 -1329711 -1325741 -1323611 -1324705 -1325316 -1324388 -1318798 -1320072 -1318621 -1310174 -1305800 -1306148 -1308082 -1307371 -1305653
12579a305653K201M318K962J967L410K688l31J765L378K399j492m67L731O347
$$ -1305653 -1303452 -1299134 -1296172 -1294205 -1290795 -1288107 -1288438 -1286673 -1283295 -1280896 -1282388 -1282855 -1279124 -1272777
12565a272777o79k487L002L214J45O453L415l49O39N51J128k49l54J267K308J226
$$ -1272777 -1273456 -1275943 -1272941 -1269727 -1269582 -1263129 -1259714 -1260063 -1259424 -1258873 -1257745 -1257994 -1258348 -1257081 -1254773 -1253547
12549a253547j834J375J127J718M553J577k36P62M208K421l45J702K433R00L759
$$ -1253547 -1255381 -1254006 -1252879 -1251161 -1246608 -1245031 -1245267 -1244505 -1240297 -1237876 -1238221 -1236519 -1234086 -1233186 -1229427
12534a229427o94k409M022K585J773L28L342M02J991N48j585M55L5K040M434m53
$$ -1229427 -1230121 -1232530 -1228508 -1225923 -1224150 -1223822 -1220480 -1220078 -1218087 -1217539 -1219124 -1218669 -1218634 -1216594 -1212160 -1212613
12518a212613m463J673M206J725L722P846J129k782j782j53J359K309L768P19
$$ -1212613 -1217076 -1215403 -1211197 -1209472 -1205750 -1197904 -1196775 -1199557 -1201339 -1201492 -1200133 -1197824 -1194056 -1193337
12504a193337j886R15N47m12O949L606J490K224L551J882j069J055J592k106j075
$$ -1193337 -1195223 -1194308 -1193761 -1194173 -1187224 -1183618 -1182128 -1179904 -1176353 -1174471 -1175540 -1174485 -1172893 -1174999 -1176074
12489a176074J009P16K833J775R45J470K432K009O15J198R63L531M024J245L74
$$ -1176074 -1175065 -1174349 -1171516 -1169741 -1168796 -1167326 -1164894 -1162885 -1162270 -1161072 -1160109 -1156578 -1152554 -1151309 -1150935
12474a150935L490J566L108L889K904k288j202J391K89n31m53J660K81J805K042
$$ -1150935 -1147445 -1145879 -1142771 -1138882 -1135978 -1138266 -1139468 -1138077 -1137788 -1138319 -1138772 -1137112 -1136831 -1135026 -1132984
12459a132984Q16K755R51k01P94M243J701J465K007J638K486k153J610n58J655
$$ -1132984 -1132168 -1129413 -1128462 -1128663 -1127869 -1123626 -1121925 -1120460 -1118453 -1116815 -1114329 -1116482 -1114872 -1115430 -1113775
12444a113775J358k189K021K254p58j067L156N343K482k124j842J196J835K016
$$ -1113775 -1112417 -1114606 -1112585 -1110331 -1111089 -1112156 -1109000 -1103657 -1101175 -1103299 -1105141 -1103945 -1102110 -1100094
12430a100094J335j78J563J980J812m31K65L438L128M288K31r44j521K146J646
$$ -1100094 -1098759 -1098937 -1097374 -1095394 -1093582 -1094013 -1093748 -1090310 -1087182 -1082894 -1082663 -1083607 -1085128 -1082982 -1081336
12415a081336J899K714J345J103J537q54K29o2L82J99j302J754j68K371K850K685
$$ -1081336 -1079437 -1076723 -1075378 -1074275 -1072738 -1073592 -1073363 -1073425 -1073043 -1072844 -1074146 -1072392 -1072560 -1070189 -1067339 -1064654
12399a064654J130M501P0l381q24P19K611N262M525P58n26K209K691k42k591J533
$$ -1064654 -1063524 -1059023 -1058953 -1062334 -1063158 -1062439 -1059828 -1054566 -1050041 -1049283 -1049809 -1047600 -1044909 -1045151 -1047742 -1046209
12383a046209L914N222L063l967k054j08K529M51K830j167J991N17L951M13K668
$$ -1046209 -1042295 -1037073 -1034010 -1037977 -1040031 -1040139 -1037610 -1037159 -1034329 -1035496 -1033505 -1032988 -1029037 -1028624 -1025956
12368a025956J955j211J630r68K27r08j844p00m84M614L262q4J001J628J207J340
$$ -1025956 -1024001 -1025212 -1023582 -1024550 -1024323 -1025231 -1027075 -1027775 -1028259 -1023645 -1020383 -1020467 -1019466 -1017838 -1016631 -1015291
12352a015291K845j534p62K150J139M521m6J146K208j437J156P40m996l312L493
$$ -1015291 -1012446 -1013980 -1014742 -1012592 -1011453 -1006932 -1006978 -1005832 -1003624 -1005061 -1003905 -1003165 -1008161 -1011473 -1007980
12337a007980J344J290L749M234K215J785O176J126l380m69J630J396J751j502
$$ -1007980 -1006636 -1005346 -1001597 -997363 -995148 -993363 -987187 -986061 -989441 -989910 -988280 -986884 -985133 -986635
12323i86635l4q1J120J929k474K226M487J850K213J517o4K51j564j698J293J99
$$ -986635 -986669 -986750 -985630 -983701 -986175 -983949 -979462 -977612 -975399 -973882 -973946 -973695 -975259 -976957 -975664 -975465
12307i75465J565J99J216K08M10L142L891J687l594p7L089J124J554Q17j0K52
$$ -975465 -973900 -973701 -972485 -972277 -971867 -968725 -964834 -963147 -966741 -966818 -963729 -962605 -961051 -960234 -960244 -959992
12291i59992K064j357n462p96N524K043r46K823k015J533K763K591Q23l04L77
$$ -959992 -957928 -959285 -964747 -965543 -960019 -957976 -958922 -956099 -958114 -956581 -953818 -951227 -950404 -950708 -950331
12276i50331L097K539j6K464j59l688J063J818J156K219J819J905j061j791k76
$$ -950331 -947234 -944695 -944711 -942247 -942406 -946094 -945031 -943213 -942057 -939838 -938019 -936114 -937175 -938966 -939242
12261i39242J836L85J760L812K959K327j241o82R66J67K437K637k68k976n28m84
$$ -939242 -937406 -937021 -935261 -931449 -928490 -926163 -927404 -928086 -927120 -926953 -924516 -921879 -922147 -925123 -925651 -926135
12245i26135j999m53q60L895N669N24k937l34M076K712M69P20J823M762P58R70
$$ -926135 -928134 -928587 -929447 -925552 -919883 -919359 -922296 -922630 -918554 -915842 -915373 -914653 -912830 -908068 -907310 -906340
12229i06340l83J800N6j277m611L46N951N323K624K355Q46j251k738k898J919
$$ -906340 -906723 -904923 -904867 -906144 -910755 -910409 -904458 -899135 -896511 -894156 -893310 -894561 -897299 -900197 -898278
12214h98278J676J580M485J548k215k299Q81K330N19L510L103m36k375j948J251
$$ -898278 -896602 -895022 -890537 -888989 -891204 -893503 -892622 -890292 -889773 -886263 -883160 -883596 -885971 -887919 -886668
12199h86668K604K2r78L6K802K290j041K057N352L956j020Q98m540j468K845J770
$$ -886668 -884064 -884042 -885020 -884984 -882182 -879892 -880933 -878876 -873524 -869568 -870588 -869690 -874230 -875698 -872853 -871083
12183h71083k377r75K309K623j624k454J223K038L345J672k642P00J652l14o2
$$ -871083 -873460 -874435 -872126 -869503 -871127 -873581 -872358 -870320 -866975 -865303 -867945 -867245 -865593 -865907 -865969
12168h65969R81q74P06K182M972K088k14p4n52J018O45j032k646j018K035M380
$$ -865969 -864988 -865862 -865156 -862974 -858002 -855914 -856128 -856202 -856754 -855736 -855091 -856123 -858769 -859787 -857752 -853372
12152h53372J33J464O95k540q72J157l61K537M512J389j816K810M90L25j556j67
$$ -853372 -853239 -851775 -851080 -853620 -854492 -853335 -853696 -851159 -846647 -845258 -847074 -844264 -843774 -843449 -845005 -845172
12136h45172L519J502N42j034o29n79N8o60j133K058J669K910Q11P12L349K180
$$ -845172 -841653 -840151 -839609 -840643 -841272 -841851 -841793 -842453 -843586 -841528 -839859 -836949 -836138 -835426 -832077 -829897
12120h29897R43k348J626j400L315P70l716q75L465K344j761j468m035k945Q057
$$ -829897 -828954 -831302 -829676 -831076 -827761 -826991 -830707 -831582 -828117 -825773 -827534 -829002 -833037 -835982 -827925
12105h27925O234L016L221k96J279K069J550P15n193n604J330j37M95N235O92
$$ -827925 -821691 -818675 -815454 -815750 -814471 -812402 -810852 -810137 -815330 -820934 -819604 -819741 -819246 -814011 -813319
12090h13319m26R29K42M4J042Q88k874o24J524m22r91J18O614K754q51L79J435
$$ -813319 -813745 -812816 -812574 -812530 -811488 -810600 -813474 -814098 -812574 -812996 -813987 -813869 -807255 -804501 -805352 -804973 -803538
12073h03538K259j018l734K779K922o32J504P21J293r33j389J359K397K514Q29
$$ -803538 -801279 -802297 -806031 -803252 -800330 -800962 -799458 -798737 -797444 -798377 -799766 -798407 -796010 -793496 -792667
12058g92667k32J23K701M65K814q60p59j70k7K07k017k342k160j110J376N415
$$ -792667 -792899 -792776 -790075 -789610 -786796 -787656 -788415 -788585 -788612 -788405 -790422 -792764 -794924 -796034 -794658 -789243
12042g89243J587q0m597k496N630K268J958J769K364J622K77L118k696l682r07
$$ -789243 -787656 -787736 -792333 -794829 -789199 -786931 -784973 -783204 -780840 -779218 -778941 -775823 -778519 -782201 -783108
12027g83108K902k740J246K90r18N42M110K238M401pr3q31K855L627k401RJ20
$$ -783108 -780206 -782946 -781700 -781410 -782328 -781786 -777676 -775438 -771037 -771044 -771137 -771968 -769113 -765486 -767887 -767878 -767758
12010g67758p47j664j415J334L426J674j114q8L498J29m080n45K157R76j29J251
$$ -767758 -768505 -770169 -771584 -770250 -766824 -765150 -766264 -766352 -762854 -762725 -766805 -767350 -765193 -764217 -764346 -763095
11994g63095n57J860L262j673k233J633K474K585q8L17J904L44k87j598N05N139
$$ -763095 -763652 -761792 -758530 -760203 -762436 -760803 -758329 -755744 -755832 -755515 -753611 -753267 -753554 -755152 -754647 -749508
11978g49508L795j60N21P0J370L541r4l680k079q46N11K508K084j385l098L081
$$ -749508 -745713 -745873 -745352 -745282 -743912 -740371 -740465 -744145 -746224 -747070 -746559 -744051 -741967 -743352 -746450 -743369
11962g43369J292Q77j002o90K323K405M014J672j398j493p97k674J181k59j074
$$ -743369 -742077 -741200 -742202 -742892 -740569 -738164 -734150 -732478 -733876 -735369 -736166 -738840 -737659 -737918 -738992
11947g38992m89J398K462R57l468K436K321M606J274N67n85q47J152J996o68k63
$$ -738992 -739481 -738083 -735621 -734664 -738132 -735696 -733375 -728769 -727495 -726928 -727513 -728360 -727208 -725212 -725880 -726143
11931g26143j245J84L252j891q17l548J160K243J234j083O49k221m17J981j374
$$ -726143 -727388 -727204 -723952 -725843 -726660 -730208 -729048 -726805 -725571 -726654 -726005 -728226 -728643 -726662 -728036
11916g28036J23L151K593K446L091K499M09j427M58O93o72Q03J249j082J600K507
$$ -728036 -727913 -724762 -722169 -719723 -716632 -714133 -713724 -715151 -714693 -714000 -714672 -713869 -712620 -713702 -712102 -709595
11900g09595l224o77K248j377q8K786K078M63J280l2n083q496m864M976M004K537
$$ -709595 -712819 -713496 -711248 -712625 -712713 -709927 -707849 -707386 -706106 -706138 -711221 -719717 -724581 -719605 -715601 -713064
11884g13064j62L002J489k724j394J306M402j78j605O28L575O08j039J121p07
$$ -713064 -713226 -710224 -708735 -711459 -712853 -711547 -707145 -707323 -708928 -708300 -704725 -704117 -705156 -704035 -704742
11869g04742J158J719j280L22l85j003m5L073q0j46K260L491L378K157k690l95
$$ -704742 -703584 -701865 -703145 -702823 -703208 -704211 -704256 -701183 -701263 -701409 -699149 -695658 -692280 -690123 -692813 -693208
11853f93208J227p73q69P19k115l04K064K169J860J647J45j904J207K480k206
$$ -693208 -691981 -692754 -693623 -692904 -695019 -695323 -693259 -691090 -689230 -687583 -687438 -689342 -688135 -685655 -687861
11838f87861k837J4o38M511L214j950k039M01P48j039p05L62L797k346k162k053
$$ -687861 -690698 -690684 -691322 -686811 -683597 -685547 -687586 -687185 -686437 -687476 -688181 -687819 -684022 -686368 -688530 -690583
11822f90583j583L049J891L28K666K223K792j159k061j17J650M285J347n28J64
$$ -690583 -692166 -689117 -687226 -686898 -684232 -682009 -679217 -680376 -682437 -682554 -680904 -676619 -675272 -675800 -675636
11807f75636j666K4R86j243L105K467L576k108j598l73k27j239Q1j118L569O26
$$ -675636 -677302 -677278 -676292 -677535 -674430 -671963 -668387 -670495 -672093 -672466 -672693 -673932 -673851 -674969 -671400 -670774
11791f70774J672J819l55K32k334Q83j064k12N46P06J749q97n39L333K453k52
$$ -670774 -669102 -667283 -667638 -667406 -669740 -668857 -669921 -670133 -669587 -668881 -667132 -668029 -668568 -665235 -662782 -663034
11775f63034J730j662m17J890N10M50M509m41k364j590j053L404K299J268K465
$$ -663034 -661304 -662966 -663383 -661493 -660983 -660533 -656024 -656465 -658829 -660419 -661472 -658068 -655769 -654501 -652036
11760f52036M38m857l874J023m95K217M331L107l437p27J970J166m20k513l562
$$ -652036 -651598 -656455 -660329 -659306 -659801 -657584 -653253 -650146 -653583 -654310 -652340 -651174 -651594 -654107 -657669
11745f57669J23K498P29J163M47J031J200j822K292J641K883j349k130N876J882
$$ -657669 -657546 -655048 -654319 -653156 -652709 -651678 -650478 -652300 -650008 -648367 -645484 -646833 -648963 -643087 -641205
11730f41205j121j010j864o10J252J644j225Q7R12K12J71L3j950q51J326O79K383
$$ -641205 -642326 -643336 -645200 -645810 -644558 -642914 -644139 -644052 -643140 -642928 -642757 -642724 -644674 -645525 -644199 -643520 -641137
11713f41137J538J718j39j241K936m0M74Q58k916n705k305M548L717R24J008J10
$$ -641137 -639599 -637881 -638020 -639261 -636325 -636365 -635891 -635033 -637949 -643654 -645959 -641411 -637694 -636770 -635762 -635652
11697f35652L217k187k919m508j800L859L111J919J007o12M455m10k228L062P70
$$ -635652 -632435 -634622 -637541 -642049 -643849 -639990 -636879 -634960 -633953 -634565 -630110 -630520 -632748 -629686 -628916
11682f28916N32j343r5J777M980K849n140n865R68M012L820J421K372k9p94j293
$$ -628916 -628384 -629727 -629822 -628045 -623065 -620216 -625356 -631221 -630253 -626241 -622421 -621000 -618628 -618657 -619451 -620744
11666f20744k886J084J065K61p82R29L569k22J249J013K420j358l536n132K175
$$ -620744 -623630 -622546 -621481 -621220 -622002 -621073 -617504 -617726 -616477 -615464 -613044 -614402 -617938 -623070 -620895
11651f20895N367o22l710p24L230K712K233K39J777R03j315j809R21J092R62r19
$$ -620895 -615528 -616150 -619860 -620584 -617354 -614642 -612409 -612170 -610393 -609490 -610805 -612614 -611693 -610601 -609639 -610558
11635f10558j643n27K97K054k020J87j722m41L545R46L946q75r64m576Q83M106
$$ -610558 -612201 -612728 -612431 -610377 -612397 -612210 -613932 -614373 -610828 -609882 -605936 -606811 -607775 -612351 -611468 -607362
11619f07362J91l93J32L026J95J418K910k128l258j688K95J616N06L667L067l724
$$ -607362 -607171 -607564 -607432 -604406 -604211 -602793 -599883 -602011 -605269 -606957 -606662 -605046 -604540 -600873 -597806 -601530
11603f01530j140q6j450J859P72j792J044K000j5j702m95J72J566k532k902J142
$$ -601530 -602670 -602756 -604206 -602347 -601575 -603367 -602323 -600323 -600338 -602040 -602535 -602363 -600797 -603329 -606231 -605089
11587f05089K261L328J591Q85L744L786k407j237K183n66q14j472j21n43P9l206
$$ -605089 -602828 -599500 -597909 -597024 -593280 -589494 -591901 -593138 -590955 -591521 -592335 -593807 -593928 -594471 -594392 -597598
11571e97598J320M967K951N2N74j760k229j677j207N573K516j263J838L118r45
$$ -597598 -596278 -591311 -588360 -588308 -587734 -589494 -591723 -593400 -594607 -589034 -586518 -587781 -585943 -582825 -583770
11556e83770j303k634J032K475N60m303j848J975M573J528K43l356r66L109M594
$$ -583770 -585073 -587707 -586675 -584200 -583640 -587943 -589791 -587816 -583243 -581715 -581472 -584828 -585794 -582685 -578091
11541e78091P9l11m162k877L79M35K492L15M67M88n01j495L367K194j033O34M066
$$ -578091 -578012 -578323 -582485 -585362 -584983 -584548 -582056 -581741 -581274 -580786 -581287 -582782 -579415 -577221 -578254 -577620 -573554
11524e73554P19l016r43k1j133J091j211l0P11J127J829p15K154N75L7K980Ok389
$$ -573554 -572835 -575851 -576794 -576815 -577948 -576857 -578068 -578098 -577387 -576260 -574431 -575146 -572992 -572417 -572380 -569400 -569394 -571783
11506e71783K111j809N63J666O88k838P80l176N1j11M540p64j973K607o51k298
$$ -571783 -569672 -571481 -570918 -569252 -568564 -571402 -570622 -573798 -573747 -573858 -569318 -570082 -572055 -569448 -570099 -572397
11490e72397n03J365K132j583M34j01K269L23K09K496N41k586k698q80O836K468
$$ -572397 -572900 -571535 -569403 -570986 -570552 -570653 -568384 -568061 -567852 -565356 -564815 -567401 -570099 -570979 -564143 -561675
11474e61675k647j61K702L061k932m177J314j590L156J265m90J634j528k182K08
$$ -561675 -564322 -564483 -561781 -558720 -561652 -565829 -564515 -566105 -562949 -561684 -562174 -560540 -562068 -564250 -564042
11459e64042N51M129K521o63M28n3j851j030J73N34J312K62k65J26P76J024J506
$$ -564042 -563491 -559362 -556841 -557504 -557076 -557129 -558980 -560010 -559837 -559303 -557991 -557729 -557994 -557868 -557092 -556068 -554562
11442e54562j870n52J251j576k388J139J219J898K535K742j795J088q29P76K610
$$ -554562 -556432 -556984 -555733 -557309 -559697 -558558 -557339 -555441 -552906 -550164 -551959 -550871 -551700 -550924 -548314
11427e48314j963p26k130J088K089J332J603J138J67O36k330M00j4L635L689J932
$$ -548314 -550277 -551003 -553133 -552045 -549956 -548624 -547021 -545883 -545716 -545080 -547410 -547010 -547024 -543389 -539700 -537768
11411e37768n089m813p23l50k605o67J357L620Q47J086M24l069r00K119M299m178
$$ -537768 -542857 -547670 -548393 -548743 -551348 -552015 -550658 -547038 -546191 -545105 -544681 -547750 -548650 -546531 -542232 -546410
11395e46410K311K723R34q2r1j086j246J328K224J416Q58k0k198R22K576l043
$$ -546410 -544099 -541376 -540442 -540524 -540615 -541701 -542947 -541619 -539395 -537979 -537121 -537141 -539339 -538417 -535841 -538884
11379e38884J5p83J194R23k040J860J436o47L650J917L90j669l491j475K46M186
$$ -538884 -538869 -539652 -538458 -537535 -539575 -537715 -536279 -536926 -533276 -531359 -530969 -532638 -536129 -537604 -537358 -533172
11363e33172L221L207m554m250R79K69q21K851L305J824j479L187K285k936j201
$$ -533172 -529951 -526744 -531298 -535548 -534569 -534300 -535121 -532270 -528965 -527141 -528620 -525433 -523148 -526084 -527285
11348e27285j212J530R32N05k848j971J135L961O80q32L152J108k493m129j57
$$ -527285 -528497 -526967 -526035 -525530 -528378 -530349 -529214 -525253 -524573 -525405 -522253 -521145 -523638 -527767 -527924
11333e27924J739o76K640J394M80r82j06J23l580n14J251j93J909K577J119J59
$$ -527924 -526185 -526861 -524221 -522827 -522347 -523329 -523435 -523312 -526892 -527406 -526155 -526348 -524439 -521862 -520743 -520584
11317e20584m003k170K774L126q89k484m76M087J884l590k400J011J495k208J148
$$ -520584 -524587 -526757 -523983 -520857 -521746 -524230 -524706 -520619 -518735 -522325 -524725 -523714 -522219 -524427 -523279
11302e23279K448K274K58j661L53J344p66k76L076J781J107j020K750j997k231
$$ -523279 -520831 -518557 -518299 -519960 -519607 -518263 -519029 -519305 -516229 -514448 -513341 -514361 -511611 -513608 -515839
11287e15839k27k50J796m43Q96J509j545r96k49j118J015L939L566k370j501l882
$$ -515839 -516066 -516316 -514520 -514963 -514067 -512558 -514103 -515099 -515348 -516466 -515451 -511512 -507946 -510316 -511817 -515699
11271e15699k173o19K481K738J205k893j578J81N598L399k101j356J733J831L45
$$ -515699 -517872 -518491 -516010 -513272 -512067 -514960 -516538 -516357 -510759 -507360 -509461 -510817 -509084 -507253 -506908
11256e06908J272m4J79k877p56j1k317p70k187J127P07L423L030L849o36m015
$$ -506908 -505636 -505680 -505501 -508378 -509134 -509145 -511462 -512232 -514419 -513292 -512585 -509162 -506132 -502283 -502919 -506934
11240e06934j038L225K086l77k981m087J523K516j598k98J963J516J322N208K300
$$ -506934 -507972 -504747 -502661 -503038 -506019 -510106 -508583 -506067 -507665 -507963 -506000 -504484 -503162 -497954 -495654
11225d95654k585k736q03r06K129R22j82J06m59K383J978Q73J485k270j70p69
$$ -495654 -498239 -500975 -501778 -502684 -500555 -499633 -499815 -499709 -500168 -497785 -495807 -494934 -493449 -495719 -495889 -496658
11209d96658j139K440J890j150p86Q37q5L11P69j60K88K94J504M229l104k764
$$ -496658 -497797 -495357 -493467 -494617 -495403 -494566 -494651 -494340 -493571 -493731 -493443 -493149 -491645 -487416 -490520 -493284
11193d93284q34N9K153R67J44r85N15j308J582k69J775R81j450j358k172j433
$$ -493284 -494118 -494059 -491906 -490939 -490795 -491780 -491265 -492573 -490991 -491260 -489485 -488504 -489954 -491312 -493484 -494917
11177d94917J579j664j974J024O25j141j669J718K631J198q18J303J948k18j572
$$ -494917 -493338 -495002 -496976 -495952 -495327 -496468 -498137 -496419 -493788 -492590 -493408 -492105 -490157 -490375 -491947
11162d91947P35q27q18L389j37J86O86k057J46K857L190j680q69K702K274k585
$$ -491947 -491212 -492039 -492857 -489468 -489605 -489419 -488733 -490790 -490644 -487787 -484597 -486277 -487146 -484444 -482170 -484755
11146d84755L48J480k538k634q19M165K830k970j207J95K635k158K001J674l051
$$ -484755 -484407 -482927 -485465 -488099 -488918 -484753 -481923 -484893 -486100 -485905 -483270 -485428 -483427 -481753 -484804
11131d84804k512J467j732J42L476R3J813M102j84j180Q26R10m793o04m62p9L289
$$ -484804 -487316 -485849 -487581 -487439 -483963 -483870 -482057 -477955 -478139 -479319 -478493 -477583 -482376 -482980 -483442 -483521 -480232
11114d80232K332J450K928K183m774n218N29K55J000N61O35j80j340p09J353j670
$$ -480232 -477900 -476450 -473522 -471339 -476113 -481331 -480802 -480547 -479547 -478986 -478351 -478531 -479871 -480580 -479227 -480897
11098d80897o89K144j0J332O23K838J135r22K109M815J387l117j021k883k033
$$ -480897 -481586 -479442 -479452 -478120 -477497 -474659 -473524 -474446 -472337 -467522 -466135 -469252 -470273 -473156 -475189
11083d75189L817L312M14k59l297k592J78l19J61J113K154r16j02N49l88l3J102
$$ -475189 -471372 -468060 -467646 -467905 -471202 -473794 -473616 -473935 -473774 -472661 -470507 -471423 -471525 -470976 -471364 -471397 -470295
11066d70295n19j375R12j013m16K098K914L268M346Q14j844j920j950P46M56o2
$$ -470295 -470814 -472189 -471277 -472290 -472706 -470608 -467694 -464426 -460080 -459266 -461110 -463030 -464980 -464234 -463778 -463840
11050d63840k499l97M24KK182R33k207J812O384J306m436l600k070K758O59P40
$$ -463840 -466339 -466736 -466312 -466310 -464128 -463195 -465402 -463590 -457206 -455900 -460336 -463936 -466006 -463248 -462589 -461849
11034d61849q51L11J815N73n683p36L573M553o00l877j159J131j537J273M690
$$ -461849 -462700 -462389 -460574 -460001 -465684 -466420 -462847 -458294 -458894 -462771 -463930 -462799 -464336 -463063 -458373
11019d58373j52j719n16J761J699J831R3l40n12k82j832L395j736k565k165O46
$$ -458373 -458525 -460244 -460760 -458999 -457300 -455469 -455376 -455716 -456228 -456510 -458342 -454947 -456683 -459248 -461413 -460767
11003d60767J963n98K057J147j133n92p3J527L826L748J931j321k18l009p23m080
$$ -460767 -458804 -459402 -457345 -456198 -457331 -457923 -457996 -456469 -452643 -448895 -446964 -448285 -448503 -451512 -452235 -456315
10987d56315j522L74P57k55J132J707l3m07j151J382l774M177K74l377K273N918
$$ -456315 -457837 -457463 -456706 -456961 -455829 -454122 -454155 -454562 -455713 -454331 -458105 -453928 -453654 -457031 -454758 -448840
10971d48840J463l704o39K795R25n773M270J641K32L76N60N010K580j603m627
$$ -448840 -447377 -451081 -451720 -448925 -448000 -453773 -449503 -447862 -447630 -447254 -446694 -441684 -439104 -440707 -445334
10956d45334j001M352K86k586p49L28J918Q10K366K35k344j187j50k196r92P72
$$ -445334 -446335 -441983 -441697 -444283 -445032 -444704 -442786 -441976 -439610 -439375 -441719 -442906 -443056 -445252 -446244 -445472
10940d45472K996J914o51n102p86Q72J77k461k26j137K48O02N509N882J002l334
$$ -445472 -442476 -440562 -441213 -446315 -447101 -446229 -446052 -448513 -448739 -449876 -449628 -449026 -443517 -437635 -436633 -439967
10924d39967R27J056M38K140k93m75k65O52L9r29k212j891J904P89j589M07P54
$$ -439967 -439040 -437984 -437546 -435406 -435699 -436174 -436439 -435787 -435748 -436677 -438889 -440780 -438876 -438087 -439676 -439269 -438515
10907d38515N9M019l051O78L76j745j035M19M058N95k055J378p51m02k984L57
$$ -438515 -438456 -434437 -437488 -436810 -436434 -438179 -439214 -438795 -434737 -434142 -436197 -434819 -435570 -435972 -438956 -438599
10891d38599K785n52p14L90J054j010O03J749K671j60j459J930N03J249n513j003
$$ -438599 -435814 -436366 -437080 -436690 -435636 -436646 -436043 -434294 -431623 -431783 -433242 -431312 -430809 -429560 -435073 -436076
10875d36076K291l483k244P90J577n09J443M13j321J10J625R80R40L343L02k47
$$ -436076 -433785 -437268 -439512 -438722 -437145 -437654 -436211 -435798 -437119 -437009 -435384 -434404 -433464 -430121 -429819 -430066
10859d30066K589j345m783M49L695K180J797Q77J870l98M01k891j609K349q91
$$ -430066 -427477 -428822 -433605 -433156 -429461 -427281 -425484 -424607 -422737 -423135 -422734 -425625 -427234 -424885 -425776
10844d25776j883l445J700J15J055P03k326j989L165K31J646J87L280l843J72
$$ -425776 -427659 -431104 -429404 -429289 -428234 -427531 -429857 -431846 -428681 -428450 -426804 -426617 -423337 -427180 -427008
10829d27008M319k328q59J203L49M03Q31j556j707j803l324M766J421O10J319
$$ -427008 -422689 -425017 -425876 -424673 -424324 -423921 -423090 -424646 -426353 -428156 -431480 -426714 -425293 -424683 -423364
10814d23364J730K424K933J8k017J375J882j153k237K234J463k215n51P17N66
$$ -423364 -421634 -419210 -416277 -416259 -418276 -416901 -415019 -416172 -418409 -416175 -414712 -416927 -417478 -416761 -416195
10799d16195j747o484j030O172L275M28j235k360j230J809j316j199M95L934j889
$$ -416195 -417942 -424426 -425456 -419284 -416009 -415581 -416816 -419176 -420406 -418597 -419913 -421112 -420617 -416683 -418572
10784d18572K69m36p33l49jK547J301M174Q58l666j673k383m34L923K49l073J434
$$ -418572 -418303 -418739 -419472 -419821 -419822 -417275 -415974 -411800 -410942 -414608 -416281 -418664 -419098 -415175 -414926 -417999 -416565
10767d16565K94M591N703l25r54n39k016l018k876o85k52K956J536P39J727k475
$$ -416565 -416271 -411680 -405977 -406302 -407256 -407795 -409811 -412829 -415705 -416390 -416642 -413686 -412150 -411411 -409684 -412159
10751d12159J094j409K889J599m485l622n19K643J302q34R5M623J313j934m859
$$ -412159 -411065 -412474 -409585 -407986 -412471 -416093 -416612 -413969 -412667 -413501 -413406 -408783 -407470 -409404 -414263
10736d14263l335R22J888K979p61K524R37k38L115J745l574n329n16K950M859
$$ -414263 -417598 -416676 -414788 -411809 -412570 -410046 -409109 -409347 -406232 -404487 -408061 -413390 -413906 -410956 -406097
10721d06097J624l437j482j497K17Q82q65k78N60l125k819J714Q52M33M007M338
$$ -406097 -404473 -407910 -409392 -410889 -410672 -409790 -410655 -410933 -410373 -413498 -416317 -414603 -413751 -413318 -409311 -404973
10705d04973R39J883J523m23n478m74K31k373L46K849K357J382J036j536j113
$$ -404973 -404034 -402151 -400628 -401051 -406529 -407003 -406772 -409145 -408799 -405950 -403593 -402211 -401175 -402711 -403824
10690d03824J08L650J370J92j656P13K280k081n282k200r38J051K173J832j937
$$ -403824 -403716 -400066 -398696 -398504 -400160 -399447 -397167 -399248 -404530 -406730 -407668 -406617 -404444 -402612 -404549
10675d04549O91l34k186O233L621j635j216K809O14m048l741J063L131M621K687
$$ -404549 -403858 -404192 -406378 -400145 -396524 -398159 -399375 -396566 -395952 -400000 -403741 -402678 -399547 -394926 -392239
10660c92239j560L40m20K708K031j083J3j561l804p01K497J556J967k457k223
$$ -392239 -393799 -393459 -393879 -391171 -389140 -390223 -390210 -391771 -395575 -396276 -393779 -392223 -390256 -392713 -394936
10645c94936J383L039K40r85k373j318K942N141L14m33j552n6J329l55J416k90
$$ -394936 -393553 -390514 -390274 -391259 -393632 -394950 -392008 -386867 -386553 -386986 -388538 -388594 -387265 -387620 -386204 -386494
10629c86494j972M40K146L519K459l64m120j0549n760J965J043K19K526J533L288
$$ -386494 -388466 -388026 -385880 -382361 -379902 -380266 -384386 -394935 -400695 -398730 -397687 -397468 -394942 -393409 -390121
10614c90121J649l570k128R82p87J131L279K490j912j286P73J63j009K054J462
$$ -390121 -388472 -392042 -394170 -393188 -393975 -392844 -389565 -387075 -388987 -390273 -389500 -389337 -390346 -388292 -386830
10599c86830k39j348j240J629P21q36l247k12J413K645L034L28k559n71J017J268
$$ -386830 -387069 -388417 -389657 -388028 -387307 -388143 -391390 -391602 -390189 -387544 -384510 -384182 -386741 -387312 -386295 -385027
10583c85027M73J135k5k99M36r66l206j413o96P27J498K932L656j84j181J670
$$ -385027 -384554 -383419 -383444 -383743 -383307 -384273 -387479 -388892 -389588 -388861 -387363 -384431 -380775 -380959 -382140 -380470
10567c80470L30l231m083q04j85K805K131q74j16j810j808M54K162L715K389k836
$$ -380470 -380140 -383371 -387454 -388258 -388443 -385638 -383507 -384381 -384497 -386307 -388115 -387661 -385499 -381784 -379395 -382231
10551c82231K49J540J628L270k77n15m189j174K442L51j345j268q99j231J205
$$ -382231 -381982 -380442 -378814 -375544 -375821 -376336 -380525 -381699 -379257 -378906 -380251 -381519 -382418 -383649 -382444
10536c82444Q33L558K062j429j517K36k295J169r40N57Q37M33J666L95J64k9l338
$$ -382444 -381611 -378053 -375991 -377420 -378937 -378701 -380996 -379827 -380767 -380210 -379373 -378940 -377274 -376879 -376715 -376744 -380082
10519c80082k65N395L857J681p34k798J005J373K016m71j259j157K361j652k756
$$ -380082 -380347 -374952 -371095 -369414 -370148 -372946 -371941 -370568 -368552 -369023 -370282 -371439 -369078 -370730 -373486
10504c73486r86J633Q18k693R53nj89J129k130j495R01kJ507m28q47K01K353P33
$$ -373486 -374472 -372839 -372021 -374714 -373761 -373766 -373955 -372826 -374956 -376451 -375550 -375552 -374045 -374473 -375320 -375119 -372766 -372033
10486c72033N33p81J812K007M96J296k365p84L433L362P24k131J125k769J877
$$ -372033 -371500 -372281 -370469 -368462 -367966 -366670 -369035 -369819 -366386 -363024 -362300 -364431 -363306 -366075 -364198
10471c64198J845j19M98o39l46m076o97R16o45L49Q37J669J363n68J407k378O95
$$ -364198 -362353 -362472 -361974 -362613 -362959 -367035 -367732 -366816 -367461 -367112 -366275 -364606 -363243 -363811 -362404 -364782 -364087
10454c64087k65l905k129J724N156j595n445j986J49k11r06N009J727j616jK433
$$ -364087 -364352 -368257 -370386 -368662 -363506 -365101 -370546 -372532 -372383 -372594 -373500 -368491 -366764 -368380 -368381 -365948
10438c65948L41K91j080L94J090J391J057J167L85r12j323l5l0p43L594L439j984
$$ -365948 -365607 -365316 -366396 -366002 -364912 -363521 -362464 -361297 -360912 -361824 -363147 -363182 -363212 -363955 -360361 -356922 -358906
10421c58906j521L228K493L25n97j669l241J192j79M16K141J529n98k036j475
$$ -358906 -360427 -357199 -354706 -354381 -354978 -356647 -359888 -358696 -358875 -358459 -356318 -354789 -355387 -357423 -358898
10406c58898l423J007M69K685J768j533m225P97j23J785L838K899J790l33n64
$$ -358898 -362321 -361314 -360845 -358160 -356392 -357925 -362150 -361353 -361476 -359691 -355853 -352954 -351164 -351497 -352061
10391c52061r37J783Q61j27k353M24J997m9l177j986J497l92k58K279j86m86J266
$$ -352061 -352998 -351215 -350354 -350481 -352834 -352410 -350413 -350462 -353639 -355625 -354128 -354520 -354778 -352499 -352685 -353171 -351905
10374c51905m59r45J688L253L80k145J116k120L417K310M03N87r86o74J652K221
$$ -351905 -352364 -353309 -351621 -348368 -347988 -350133 -349017 -351137 -347720 -345410 -345007 -344420 -345406 -346080 -344428 -342207
10358c42207J688j20p09M15j855K459M818j897l213n053j741J009j155l894j858
$$ -342207 -340519 -340639 -341348 -340933 -342788 -340329 -335511 -337408 -340621 -345674 -347415 -346406 -347561 -351455 -353313
10343c53313m508n220M040p4q29j374k767M688M366R12K087j179k304J982K958
$$ -353313 -357821 -363041 -359001 -359075 -359904 -361278 -364045 -359357 -354991 -354079 -351992 -353171 -355475 -353493 -350535
10328c50535l98K53j148K082J876r81n08J750k334K068J138j070L668L172j171
$$ -350535 -350933 -350680 -351828 -349746 -347870 -348851 -349359 -347609 -349943 -347875 -346737 -347807 -344139 -340967 -342138
10313c42138K187j148j337r9L62K963J018P58k506k722K11P19j246o05N645L596
$$ -342138 -339951 -341099 -342436 -342535 -342173 -339210 -338192 -337434 -339940 -342662 -342451 -341732 -342978 -343583 -337938 -334342
10297c34342L404l719k069M53K009j272k752m4K301K58j032J284K772J451k920
$$ -334342 -330938 -334657 -336726 -336273 -334264 -335536 -338288 -338332 -336031 -335773 -336805 -335521 -332749 -331298 -334218
10282c34218j223o33Q81O64k528K812L529O61j424J914L898N08l342L30K334J792
$$ -334218 -335441 -336074 -335193 -334529 -337057 -334245 -330716 -330055 -331479 -329565 -325667 -325159 -328501 -328171 -325837 -324045
10266c24045r02k016j804M51q28l450j598J602k059J839l576m482N788L983J354
$$ -324045 -324947 -326963 -328767 -328316 -329144 -332594 -334192 -332590 -334649 -332810 -336386 -340868 -335080 -331097 -329743
10251c29743j142l345j433J370K965L651j284K402L095L67Q52Q31J199J745k894
$$ -329743 -330885 -334230 -335663 -334293 -331328 -327677 -328961 -326559 -323464 -323097 -322245 -321414 -320215 -318470 -321364
10236c21364k73N492m06m865j123m04J404j850L081K828L573K94k959m519J371
$$ -321364 -321637 -316145 -316551 -321416 -322539 -322943 -321539 -323389 -320308 -317480 -313907 -313613 -316572 -321091 -319720
10221c19720J357r19N60K45K584K993J288p22k722k264L47K957J259J177l415
$$ -319720 -318363 -319282 -318722 -318477 -315893 -312900 -311612 -312334 -315056 -317320 -316973 -314016 -312757 -311580 -314995
10206c14995l563K71M699J331q08m47k249J175k1k86J607L116J383J855L062p73
$$ -314995 -318558 -318287 -313588 -312257 -313065 -313512 -315761 -314586 -314607 -314893 -313286 -310170 -308787 -306932 -303870 -304643
10190c04643p86k247k015k231J894J754j691J250P451J184k917J066L603p85q74
$$ -304643 -305429 -307676 -309691 -311922 -310028 -308274 -309965 -308715 -301264 -300080 -302997 -301931 -298328 -299113 -299987
10175b99987K29J632j093m64K558R14k451J398L550j859k636q90L161Q30N71L098
$$ -299987 -299758 -298126 -299219 -299683 -297125 -296211 -298662 -297264 -293714 -295573 -298209 -299099 -295938 -295108 -294537 -291439
10159b91439Q37J042J593L91N50j593o86m911J668N327q3j152j802K082J600K012
$$ -291439 -290602 -289560 -287967 -287576 -287026 -288619 -289305 -294216 -292548 -287221 -287304 -288456 -290258 -288176 -286576 -284564
10143b84564M355L388j620j342k846k314L045M042M362L546O140j503j382k468
$$ -284564 -280209 -276821 -278441 -279783 -282629 -284943 -281898 -277856 -273494 -269948 -263808 -265311 -266693 -269161
10129b69161l096J810K015k100j469J604P938M854J676O5K33L192M246O54K533
$$ -269161 -272257 -270447 -268432 -270532 -272001 -270397 -262459 -257605 -255929 -255864 -255631 -252439 -248193 -247539 -245006
10114b45006q71k61k11L467K586J620N96K157j54J016R15K963L528J981L298K658
$$ -245006 -245877 -246138 -246349 -242882 -240296 -238676 -238080 -235923 -236077 -235061 -234146 -231183 -227655 -225674 -222376 -219718
10098b19718M306N769N374O139N593J962J327J112J755K684K475N641Q769L772
$$ -219718 -215412 -209643 -204269 -198130 -192537 -190575 -189248 -188136 -186381 -183697 -181222 -175581 -166812 -163040
10084a63040K691Q879M735P260Q720O765J1578J1768J1777R516R376J1794J7150
$$ -163040 -160349 -151470 -146735 -139475 -130755 -123990 -112412 -100644 -88867 -79351 -69975 -58181 -41031
10071d1031J8210J4908O064J2734K3818L1137L2304L7180M3991M9960N7476P0860
$$ -41031 -22821 -7913 -1849 10885 34703 65840 98144 135324 179315 229275 286751 357611
10059C57611Q9340J11280J50941K11886K75961K82142r4868j343023j861960l06072
$$ 357611 446951 558231 709172 921058 1197019 1479161 1384293 41270 -1820690 -2126762
10049b126762K86335K68618J90561J39997J10959Q3318O4051O0355N0828M2617
$$ -2126762 -1840427 -1571809 -1381248 -1241251 -1130292 -1046974 -982923 -922568 -871740 -829123
10039h29123M1278L4320K7884K5328K3745K0226J0686M562J2106J3830J3891J2703
$$ -829123 -787845 -753525 -725641 -700313 -676568 -656342 -645656 -641094 -628988 -615158 -601267 -588564
10027e88564Q577Q306M753Q231R711Q799N285N474O769M140O737R701N519K581
$$ -588564 -579987 -571681 -566928 -558697 -548986 -540187 -534902 -529428 -522659 -518519 -511782 -502081 -496562 -493981
10013d93981K436L721N238Q994M362M621K696o85N507L063J385M992M735j0J780
$$ -493981 -491545 -487824 -482586 -473592 -469230 -464609 -461913 -462598 -457091 -454028 -452643 -447651 -442916 -442926 -441146
9998d41146J304O14j45M758J646K839L693L426J819O62J115l751J014O097N223
$$ -441146 -439842 -439228 -439373 -434615 -432969 -430130 -426437 -423011 -421192 -420530 -419415 -423166 -422152 -416055 -410832
9983d10832k133p9J202L244M104J908j482j807J340J028J155r50K202L95K217
$$ -410832 -412965 -413044 -411842 -408598 -404494 -402586 -404068 -405875 -404535 -403507 -402352 -403302 -401100 -400705 -398488
9968c98488J05k246k10P53K321J944K339K557P23n50p57m3J634O61M371K183J288
$$ -398488 -398383 -400629 -400839 -400086 -397765 -395821 -393482 -390925 -390202 -390752 -391509 -391552 -389918 -389257 -384886 -382703 -381415
9951c81415j264J074J713K478k780J926L28L358L003K849Q424K966j707q584j8462
$$ -381415 -382679 -381605 -379892 -377414 -380194 -378268 -377940 -374582 -371579 -368730 -360306 -357340 -359047 -367631 -386093
9936c86093o731J316O830K299K029J607l004L256O278R22j994Q67K070J897k842
$$ -386093 -392824 -391508 -384678 -382379 -380350 -378743 -381747 -378491 -372213 -371291 -373285 -372418 -370348 -368451 -371293
9921c71293j657q21l64K396K446K147J696l11l067j201L64M129K809l887K471
$$ -371293 -372950 -373771 -374135 -371739 -369293 -367146 -365450 -365761 -368828 -370029 -369665 -365536 -362727 -366614 -364143
9906c64143J789j709Q50J680J869N80j899j156J958L25L17q36M40N55k26J086
$$ -364143 -362354 -364063 -363213 -361533 -359664 -359084 -360983 -362139 -360181 -359856 -359539 -360375 -359935 -359380 -359606 -358520
9890c58520M3J940m53Q23P74j025n27J367P92J409j818j678K139J227J809L492
$$ -358520 -358477 -356537 -356990 -356167 -355393 -356418 -356945 -355578 -354786 -353377 -355195 -356873 -354734 -353507 -351698 -348206
9874c48206K865j947j353p0n86K366N62L051R94k300K417J938l125j378j197O4
$$ -348206 -345341 -347288 -348641 -348711 -349297 -346931 -346369 -343318 -342324 -344624 -342207 -340269 -343394 -344772 -345969 -345905
9858c45905O3m023m794P20J116J625R16j949L953J481k240q59J701M243N421j039
$$ -345905 -345842 -349865 -354659 -353939 -352823 -351198 -350282 -352231 -348278 -346797 -349037 -349896 -348195 -343952 -338531 -339570
9842c39570l684l983k68J388J942O94J647J903L953o92k508m97J639j626O66J809
$$ -339570 -343254 -347237 -347505 -346117 -344175 -343481 -341834 -339931 -335978 -336670 -339178 -339675 -338036 -339662 -338996 -337187
9826c37187n5j236p85k637m150j27K305L326K690J830M106J876Q45m581k425L505
$$ -337187 -337242 -338478 -339263 -341900 -346050 -346177 -343872 -340546 -337856 -336026 -331920 -330044 -329199 -333780 -336205 -332700
9810c32700L50k413j146k294M13K11N03K578O41l219J911Q78j608K524L01K119
$$ -332700 -332350 -334763 -335909 -338203 -337790 -337579 -337076 -334498 -333857 -337076 -335165 -334287 -335895 -333371 -333070 -330951
9794c30951R75J480m603l056P42K573M882K612k318P48m40J476L71m503j663j278
$$ -330951 -329976 -328496 -333099 -336155 -335413 -332840 -327958 -325346 -327664 -326916 -327356 -325880 -325509 -330012 -331675 -332953
9778c32953j145j918k969J759L081L618J857J998L974Q87K220l11p68q70l2n61
$$ -332953 -334098 -336016 -338985 -337226 -334145 -330527 -328670 -326672 -322698 -321811 -319591 -319902 -320670 -321540 -321572 -322133
9762c22133k384k050q62j157J766j974k486j377k20j091K663J388J183J110k769
$$ -322133 -324517 -326567 -327429 -328586 -326820 -328794 -331280 -332657 -332877 -333968 -331305 -329917 -328734 -327624 -330393
9747c30393k423K718M613K607l931J332l42n57j711j971J815K721K764Q88l232
$$ -330393 -332816 -330098 -325485 -322878 -326809 -325477 -325819 -326376 -328087 -330058 -328243 -325522 -322758 -321870 -325102
9732c25102J927Q31L52l36l87J942J809K62j43K449K832p11l149p53k714l575
$$ -325102 -323175 -322344 -321992 -322328 -322715 -320773 -318964 -318702 -318845 -316396 -313564 -314275 -317424 -318177 -320891 -324466
9716c24466O13q18J013K347P79j599K658L714Q00k098n93J024j1J26k508l70J712
$$ -324466 -323853 -324671 -323658 -321311 -320532 -322131 -319473 -315759 -314959 -317057 -317650 -316626 -316637 -316511 -319019 -319389 -317677
9699c17677J163O91m27l45j166Q71o07J340J453J550j149o81%l41L22J410L59
$$ -317677 -316514 -315823 -316250 -316595 -317761 -316890 -317497 -316157 -314704 -313154 -314303 -314984 -314984 -315325 -315003 -313593 -313234
9682c13234K118k827m376k332J705J613J242J753o05p96O93j826l211J49L562
$$ -313234 -311116 -313943 -318319 -320651 -318946 -317333 -316091 -314338 -314943 -315739 -315046 -316872 -320083 -319934 -316372
9667c16372M050j35L45j372o08K907L131j174k058k480M017M13M72K757j446k216
$$ -316372 -312322 -312457 -312112 -313484 -314092 -311185 -308054 -309228 -311286 -313766 -309749 -309336 -308864 -306107 -307553 -309769
9651c09769K062K995l28j154m216j628Pm47k39j467J865j824N66J642J72j15j712
$$ -309769 -307707 -304712 -305040 -306194 -310410 -312038 -312031 -312478 -312717 -314184 -312319 -314143 -313577 -311935 -311763 -311878 -313590
9634c13590n93N009M068j754m515P57J138j741L418K204q38j629L675k92o64K043
$$ -313590 -314183 -309174 -305106 -306860 -311375 -310618 -309480 -311221 -307803 -305599 -306437 -308066 -304391 -304683 -305347 -303304
9618c03304J615l091l382K24O9K736J507j089K73J699j975l026L775K647k363
$$ -303304 -301689 -304780 -308162 -307938 -307869 -305133 -303626 -304715 -304442 -302743 -304718 -307744 -303969 -301322 -303685
9603c03685j906J941L728J27j72n87k79K393M75j236l268j495K348K50O07q26
$$ -303685 -305591 -303650 -299922 -299795 -299967 -300554 -300833 -298440 -297965 -299201 -302469 -303964 -301616 -301366 -300759 -301585
9587c01585M85k17L80K396N468j384k610k26j525K63P89K81J136J406M867L248
$$ -301585 -301100 -301317 -300937 -298541 -293073 -294457 -297067 -297293 -298818 -298555 -297766 -297485 -296349 -294943 -290076 -286828
9571b86828l315q024n480o82J962M008p47K936K070k547j827n39k949L019L040
$$ -286828 -290143 -298167 -303647 -304329 -302367 -298359 -299106 -296170 -294100 -296647 -298474 -299013 -301962 -298943 -295903
9556b95903R96K31o82K611P45n05J385o78k683k74L696m264j067k552R9P67K659
$$ -295903 -294907 -294676 -295358 -292747 -292002 -292507 -291122 -291800 -294483 -294757 -291061 -295325 -296392 -298944 -298845 -298078 -295419
9539b95419o40J394L613N46p65M51L97J71M5J066j155m232j243L068K283k660
$$ -295419 -296059 -294665 -291052 -290506 -291271 -290820 -290423 -290252 -290207 -289141 -290296 -294528 -295771 -292703 -290420 -293080
9523b93080r74L30L354L4m2K684J532n514k556K325J555k588N94J745L234L95
$$ -293080 -294054 -293724 -290370 -290336 -290378 -287694 -286162 -291676 -294232 -291907 -290352 -292940 -292346 -290601 -287367 -286972
9507b86972j053J820N92O88R80r38o68K413q02k23l25K94l381k141J647r5J541
$$ -286972 -288025 -286205 -285613 -284925 -283945 -284883 -285551 -283138 -283940 -284163 -284488 -284194 -287575 -289716 -288069 -288164 -286623
9490b86623K497K84Q33q23n10M505l05n863m270K436J087K867O46J238J439l853
$$ -286623 -284126 -283842 -283009 -283832 -284342 -279837 -280142 -286005 -290275 -287839 -286752 -283885 -283239 -282001 -280562 -284415
9474b84415J865m57j383J667Q88j548q13K03K388j100j199j219QJ459J10l68j594
$$ -284415 -282550 -283007 -284390 -282723 -281835 -283383 -284196 -283993 -281605 -282705 -283904 -285123 -285115 -283656 -283546 -283914 -285508
9457b85508J139L695L829K11K385j878k920j763J206N43n42k275j769J888j38
$$ -285508 -284369 -280674 -276845 -276634 -274249 -276127 -279047 -280810 -279604 -279061 -279603 -281878 -283647 -281759 -281897
9442b81897j12k31L466L819K827k068j758r26J17N5k18l884O62J465j26P30J458
$$ -281897 -282009 -282240 -278774 -274955 -272128 -274196 -275954 -276880 -276763 -276708 -276926 -280810 -280148 -278683 -278809 -278079 -276621
9425b76621R57k662K599K26l711l40L451J671j104K055L163L364j367k113J973
$$ -276621 -275664 -278326 -275727 -275501 -279212 -279552 -276101 -274430 -275534 -273479 -270316 -266952 -268319 -270432 -268459
9410b68459J370k953j693Q51L57J252M215n35j724k163k559K840K128j528j698
$$ -268459 -267089 -270042 -271735 -270884 -270527 -269275 -265060 -265595 -267319 -269482 -272041 -269201 -267073 -268601 -270299
9395b70299k676r29K228J810J167p47l319m580K202N418M494K688j61j515L275
$$ -270299 -272975 -273904 -271676 -269866 -268699 -269446 -272765 -277345 -275143 -269725 -265231 -262543 -262704 -264219 -260944
9380b60944K987m64l664j912l21L041R96R83J042j766m789k532J624L983K146
$$ -260944 -257957 -258421 -262085 -263997 -264318 -261277 -260281 -259298 -258256 -260022 -264811 -267343 -265719 -261736 -259590
9365b59590L04J390k675m315J090K892r64L219q92o160k369q65J08Q29K54K290
$$ -259590 -259286 -257896 -260571 -264886 -263796 -260904 -261868 -258649 -259541 -265701 -268070 -268935 -268827 -267998 -267744 -265454
9349b65454k312L416N360n9J409K401m69m833l268K014n57k365L042J409L046
$$ -265454 -267766 -264350 -258990 -259049 -257640 -255239 -255708 -260541 -263809 -261795 -262352 -264717 -261675 -260266 -257220
9334b57220M921K111J243K60k180j024N62K33M344M520K07k623o265l303l174
$$ -257220 -252299 -250188 -248945 -248685 -250865 -251889 -251327 -251094 -246750 -242230 -242023 -244646 -250911 -254214 -257388
9319b57388j594K171M55M989N594m249l027L444J498k904J455L538J161j865k40
$$ -257388 -258982 -256811 -256356 -251367 -245773 -250022 -253049 -249605 -248107 -251011 -249556 -246018 -244857 -246722 -246962
9304b46962K610K012K09j981M73q94N43P91J494J843K878K979j98l044R34j153
$$ -246962 -244352 -242340 -242131 -244112 -243639 -244533 -243990 -243199 -241705 -239862 -236984 -234005 -234203 -237247 -236313 -237466
9288b37466J444o91p07J308O55o12j499j453J467J63n13k27L618j71j105Q14K143
$$ -237466 -236022 -236713 -237420 -236112 -235457 -236069 -237568 -239021 -237554 -237391 -237904 -238131 -234513 -234684 -235789 -234975 -232832
9271b32832J329Q04J538K414j009j724l315L77J476L767J052N185J936n37j661
$$ -232832 -231503 -230699 -229161 -226747 -227756 -229480 -232795 -232418 -230942 -227175 -226123 -220938 -219002 -219539 -221200
9256b21200j954j183K324K823J087K24J264r50l374Q7K352K792K315j199K458
$$ -221200 -223154 -224337 -222013 -219190 -218103 -217879 -216615 -217565 -220939 -220852 -218500 -215708 -213393 -214592 -212134
9241b12134J923o73n31K393J085m569l022k061J267K781L894P80n12J695L651
$$ -212134 -210211 -210884 -211415 -209022 -207937 -212506 -215528 -217589 -216322 -213541 -209647 -208867 -209379 -207684 -204033
9226b04033J764j042j325J51q06L30J323K040J079R72L083L717L151J559j258
$$ -204033 -202269 -203311 -204636 -204485 -205291 -204961 -203638 -201598 -200519 -199547 -196464 -192747 -189596 -188037 -189295
9211a89295K29J8q51l01m47K482K450k88N098K01J855R81Q54L88J563K470K317
$$ -189295 -189066 -189048 -189899 -190200 -190647 -188165 -185715 -186003 -180905 -180704 -178849 -177868 -177014 -176626 -175063 -172593 -170276
9194a70276L503j061k6j390N672N937N760M0K170J940J240O52l01M467N911M661
$$ -170276 -166773 -167834 -167860 -169250 -163578 -157641 -151881 -151841 -149671 -147731 -146491 -145839 -146140 -141673 -135762 -131101
9178a31101M039J680M176J327L169L456J978k7K964L808R98L974P320N110K630
$$ -131101 -127062 -125382 -121206 -119879 -116710 -113254 -111276 -111303 -108339 -104531 -103533 -99559 -92239 -87129 -84499
9163h4499M443R106M409J018K974L199O516O715P741O011P322Q200R207N918P028
$$ -84499 -80056 -70950 -66541 -65523 -62549 -59350 -52834 -46119 -38378 -32367 -25045 -16845 -7638 -1720 5308
9148E308J2411P098P333J2525J6344J1821J2487J4863J8511K1270K0994K2792
$$ 5308 17719 24817 32150 44675 61019 72840 85327 100190 118701 139971 160965 183757
9136A83757K4057K4366K5456K8956L7116M0495M6377N4243N8286P0246Q4270R8166
$$ 183757 207814 232180 257636 286592 323708 364203 410580 464823 523109 593355 677625 775791
9124G75791J15367J34490J48790J41761O2434j85689o42875j043379q95181l94316
$$ 775791 891158 1025648 1174438 1316199 1378633 1192944 550069 -493310 -1388491 -1782807
9114a782807m2077R6095J28103J19739J02903Q9022Q2501P2308O0371N5370M9205
$$ -1782807 -1824884 -1728789 -1600686 -1480947 -1378044 -1289022 -1206521 -1134213 -1073842 -1018472 -969267
9103i69267M5129M0166L2010L3054L1235K6581K2342J8212K0033J6999J4620J3682
$$ -969267 -924138 -883972 -851962 -818908 -787673 -761092 -738750 -720538 -700505 -683506 -668886 -655204
9091f55204J1303J1673J3349J3625J0454O163O847J0533R740R721N029O531Q896
$$ -655204 -643901 -632228 -618879 -605254 -594800 -588637 -581790 -571257 -561517 -551796 -546767 -540236 -531340
9078e31340O345O377P579P356J215J792N383O655L969N464J571L026O436Q064
$$ -531340 -524995 -518618 -511039 -503683 -502468 -500676 -495293 -488638 -484669 -479205 -477634 -474608 -468172 -460108
9064d60108N550J456J489o96K186P786O235N496M796O10j038J214L353K523K643
$$ -460108 -454558 -453102 -451613 -452309 -450123 -442337 -436102 -430606 -425810 -425200 -426238 -425024 -421671 -419148 -416505
9049d16505R88J301K778N352J811j265j49J543K69J940M818N024J689k040j074
$$ -416505 -415517 -414216 -411438 -406086 -404275 -405540 -405689 -404146 -403877 -401937 -397119 -392095 -390406 -392446 -393520
9034c93520r80O75R61M576J721K468j038J075O65n51L349l20j875K004J299L113
$$ -393520 -394500 -393825 -392864 -388288 -386567 -384099 -385137 -384062 -383397 -383948 -380599 -380919 -382794 -380790 -379491 -376378
9018c76378R04J590l51L094M859K430O42q31L510J845J209J81k022j211L953K480
$$ -376378 -375474 -373884 -374235 -371141 -366282 -363852 -363210 -364041 -360531 -358686 -357477 -357296 -359318 -360529 -356576 -354096
9002c54096l35J02J469k107j56J364M61K602J937J381q77j252K076j770n20p8
$$ -354096 -354431 -354329 -352860 -354967 -355123 -353759 -353298 -350696 -348759 -347378 -348255 -349507 -347431 -349201 -349721 -349799
8986c49799P32R73p6m179j730L980J933N402J805J585O48m299j202n13J673M124
$$ -349799 -349067 -348094 -348170 -352349 -354079 -350099 -348166 -342764 -340959 -339374 -338726 -343025 -344227 -344740 -343067 -338943
8970c38943N300K0j376J839O32q66j019K258O77n33M25K48k092L696K804M45J262
$$ -338943 -333643 -333623 -334999 -333160 -332528 -333394 -334413 -332155 -331478 -332011 -331586 -331338 -333430 -329734 -326930 -326485 -325223
8953c25223r44k894j161j891J376J409R32J431K517l2J739J295J159k564r46Q17
$$ -325223 -326167 -329061 -330222 -332113 -330737 -329328 -328396 -326965 -324448 -324480 -322741 -321446 -320287 -322851 -323797 -322980
8937c22980r92j288J722K168k168p35k87J60l59k508K55R68k48k246M66R91N324
$$ -322980 -323972 -325260 -323538 -321370 -323538 -324273 -324560 -324400 -324759 -327267 -327012 -326044 -326292 -328538 -328072 -327081 -321757
8920c21757q79K257M688J455J83R05k610k279M63J695n27M002k63j630K245J846
$$ -321757 -322636 -320379 -315691 -314236 -314053 -313148 -315758 -318037 -317574 -315879 -316406 -312404 -312667 -314297 -312052 -310206
8904c10206P50R56j239j446L073o274o72K121M53q03L589l93J032J784J04j21
$$ -310206 -309456 -308500 -309739 -311185 -308112 -314386 -315058 -312937 -312484 -313287 -309698 -310091 -309059 -307275 -307171 -307292
8888c07292l33l324L27J628J679q80k030L434M817M17j846J131n90j324P76K92
$$ -307292 -307625 -310949 -310622 -308994 -307315 -308195 -310225 -306791 -301974 -301557 -303403 -302272 -302862 -304186 -303410 -303118
8872c03118j172K62L544J039J1l435j249K139M29O71L44k121j678j394J25j413
$$ -303118 -304290 -304028 -300484 -299445 -299434 -302869 -304118 -301979 -301550 -300879 -300535 -302656 -304334 -305728 -305603 -307016
8856c07016r88J358K992M64k21J843n45P24L466j051J415J374K35o14M53M43j733
$$ -307016 -308004 -306646 -303654 -303190 -303411 -301568 -302113 -301389 -297923 -298974 -297559 -296185 -295950 -296564 -296111 -295668 -297401
8839b97401k006L095L490j513l123K137J68J725p10k083j734k008K325L296Q86
$$ -297401 -299407 -296312 -292822 -294335 -297458 -295321 -295153 -293428 -294138 -296221 -297955 -299963 -297638 -294342 -293456
8824b93456K134q13l679k353N816J454k474k337n03K105J722k64k381j372J19
$$ -293456 -291322 -292135 -295814 -298167 -292351 -290897 -293371 -295708 -296211 -294106 -292384 -292648 -295029 -296401 -296282
8809b96282K144K050J493j543k922k030m112j340K483N97j301j703M569L496k56
$$ -296282 -294138 -292088 -290595 -292138 -295060 -297090 -301202 -302542 -300059 -299462 -300763 -302466 -297897 -294401 -294657
8794b94657k40M254K567j801J145l1L39n54P89j736J870N27p73K553K939n171
$$ -294657 -294897 -290643 -288076 -289877 -288732 -288763 -288424 -288978 -288189 -289925 -288055 -287528 -288301 -285748 -282809 -287980
8778b87980m002k26K788J406k164N45K30j3O621J188J386R91n319q192k037K443
$$ -287980 -291982 -292208 -289420 -288014 -290178 -289633 -289403 -289416 -282795 -281607 -280221 -279230 -284549 -292741 -294778 -292335
8762b92335M645L494l074K319K22k55K73k742%j821K185L981m420k518J703l4
$$ -292335 -287690 -284196 -287270 -284951 -284729 -284984 -284711 -287453 -287453 -289274 -287089 -283108 -287528 -290046 -288343 -288377
8746b88377j827J693L197J625N38N61J864K176j35J232m52j190m3mJ4m226L283
$$ -288377 -290204 -288511 -285314 -283689 -283151 -282590 -280726 -278550 -278685 -277453 -277905 -279095 -279138 -279142 -279128 -283354 -280071
8729b80071K568r24J982L870m441l943K984M002O40L054k523L67K968n43m158
$$ -280071 -277503 -278427 -276445 -272575 -277016 -280959 -277975 -273973 -273333 -270279 -272802 -272435 -269467 -270010 -274168
8714b74168l095k117q641m326L859K759o42n76L260o84J299J804K23J413J135
$$ -274168 -277263 -279380 -288021 -292347 -288488 -285729 -286371 -286947 -283687 -284371 -283072 -281268 -281045 -279632 -278497
8699b78497m36J923L488p66k229N78J292R9l094k442j129J878J403k87O45K749
$$ -278497 -278933 -277010 -273522 -274288 -276517 -275939 -274647 -274548 -277642 -280084 -281213 -279335 -277932 -278219 -277574 -274825
8683b74825K235k963p70J712k558k198J099M910L006O30l309k2K552M33l811j364
$$ -274825 -272590 -275553 -276323 -274611 -277169 -279367 -278268 -273358 -270352 -269722 -273031 -273053 -270501 -270068 -273879 -275243
8667b75243j350K947J405R22k082K909K825l166k155r91L6Q84L676M85k821J080
$$ -275243 -276593 -273646 -272241 -271319 -273401 -270492 -267667 -270833 -272988 -273979 -273943 -273059 -269383 -268898 -271719 -270639
8651b70639j674k320r30J377N45J954L799j806K445L608K547l239j2193p153J622
$$ -270639 -272313 -274633 -275563 -274186 -273641 -271687 -267888 -269694 -267249 -263641 -261094 -264333 -276526 -283679 -282057
8636b82057L259K847O54L00N057J530l1q97O69K631k305l311K312L831M037n054
$$ -282057 -278798 -275951 -275297 -274997 -269940 -268410 -268441 -269338 -268669 -266038 -268343 -271654 -269342 -265511 -261474 -266528
8620b66528J623P7m089P23M101L155J08k480j899k797j646j843m290m409k673
$$ -266528 -264905 -264828 -268917 -268194 -264093 -260938 -260830 -263310 -265209 -268006 -269652 -271495 -275785 -280194 -282867
8605b82867l912n455k051K719J640P7k205k228L108J989L398K1j775p37K50M009
$$ -282867 -286779 -292234 -294285 -291566 -289926 -289849 -292054 -294282 -291174 -289185 -285787 -285766 -287541 -288278 -288028 -284019
8589b84019J905r11j602K242J362j229j355K563N127M124j642k023J287J459j860
$$ -284019 -282114 -283025 -284627 -282385 -281023 -282252 -283607 -281044 -275917 -271793 -273435 -275458 -274171 -272712 -274572
8574b74572k970J102k445K455N071Q87j178k064R25k080m785L16k077k042N54
$$ -274572 -277542 -276440 -278885 -276430 -271359 -270472 -271650 -273714 -272789 -274869 -279654 -279338 -281415 -283457 -282903
8559b82903L235K872M67m38l59r87K078J640k418J835l83j787J095M387M8k33
$$ -282903 -279668 -276796 -276329 -276767 -277126 -278113 -276035 -274395 -276813 -274978 -275361 -277148 -276053 -271666 -271618 -271851
8543b71851j058j192K259K16K571Q1l870k143J306O927J699J717m059j433Q87
$$ -271851 -272909 -274101 -271842 -271626 -269055 -268974 -272844 -274987 -273681 -266754 -265055 -263338 -267397 -268830 -267943
8528b67943J655J612J55j639m152m352K349j30J254K589L15l051k659J532J594
$$ -267943 -266288 -264676 -264521 -266160 -270312 -274664 -272315 -272445 -271191 -268602 -268287 -271338 -273997 -272465 -270871
8513b70871J765j448j354p14n32m073K561K144L411J503J08P70k434l096M8K477
$$ -270871 -269106 -270554 -271908 -272622 -273154 -277227 -274666 -272522 -269111 -267608 -267500 -266730 -269164 -272260 -272212 -269735
8497b69735K427k676q035m987p93P02k04Q99M998M887j231J074J961j836j541
$$ -269735 -267308 -269984 -278019 -283006 -283799 -283097 -283301 -282402 -277404 -272517 -273748 -272674 -270713 -272549 -274090
8482b74090J711K474P5j540J068j689O29j92J348J452j91j0j153L796L390j385
$$ -274090 -272379 -269905 -269830 -271370 -270302 -271991 -271362 -271554 -270206 -268754 -268945 -268955 -270108 -266312 -262922 -264307
8466b64307k088j311L808M909p34L69K367L79o001j039o333p936J101M565m19
$$ -264307 -266395 -267706 -263898 -258989 -259723 -259354 -256987 -256608 -262609 -263648 -269981 -277917 -276816 -272251 -272670
8451b72670J077j117n66L64R27J947L131m010k051k747K621M337K251L243j405
$$ -272670 -271593 -272710 -273276 -272912 -271985 -270038 -266907 -270917 -272968 -275715 -273094 -268757 -266506 -263263 -264668
8436b64668P42J977m231l765K10o21K040K259J209j703n37M06L11K91L024M77
$$ -264668 -263926 -261949 -266180 -269945 -269735 -270356 -268316 -266057 -264848 -266551 -267088 -266682 -266371 -266080 -263056 -262579
8420b62579j601j474o95L950J335l034l898j307K481P23Q18J018k30j041P44j898
$$ -262579 -264180 -265654 -266349 -262399 -261064 -264098 -267996 -269303 -266822 -266099 -265281 -264263 -264493 -265534 -264790 -266688
8404b66688k292j734K090M815L645k231n67K484m449k685L614K829n01J198J190
$$ -266688 -268980 -270714 -268624 -263809 -260164 -262395 -262962 -260478 -264927 -267612 -263998 -261169 -261670 -260472 -259282
8389b59282O34l66M40l355n504n84M639j683j111j60r78p96L133K230M16j5n13
$$ -259282 -258648 -259014 -258574 -261929 -267433 -268017 -263378 -265061 -266172 -266332 -267310 -268106 -264973 -262743 -262327 -262342 -262855
8372b62855j90j127K748L131j433k028K77J431k190l96P29j392J595K784Q30k863
$$ -262855 -263045 -264172 -261424 -258293 -259726 -261754 -261477 -260046 -262236 -262632 -261903 -263295 -261700 -258916 -258086 -260949
8356b60949r59J170L905j212j758j663k040L06J30O21L718n47m074L246J712J369
$$ -260949 -261908 -260738 -256833 -258045 -259803 -261466 -263506 -263200 -263070 -262449 -258731 -259278 -263352 -260106 -258394 -257025
8340b57025J185j546k284J954K457L433k13l446k135j301K249J099k790m77K550
$$ -257025 -255840 -257386 -259670 -257716 -255259 -251826 -252039 -255485 -257620 -258921 -256672 -255573 -258363 -258840 -256290
8325b56290M042M001j175J62P60L72q3P96n5J699K41j968k692m615m735l601j865
$$ -256290 -252248 -248247 -249422 -249260 -248500 -248128 -248211 -247415 -247470 -245771 -245530 -247498 -250190 -254805 -259540 -263141 -265006
8308b65006k060K429O043J661l729k832K425M707L970J849k763q35j86K766K217
$$ -265006 -267066 -264637 -258594 -256933 -260662 -263494 -261069 -256362 -252392 -250543 -253306 -254141 -254327 -251561 -249344
8293b49344q26J642J54p66k949l327R39k50K337L744L33k432K132R89L27J68l883
$$ -249344 -250170 -248528 -248374 -249140 -252089 -255416 -254477 -254727 -252390 -248646 -248313 -250745 -248613 -247624 -247297 -247129 -251012
8276b51012l057k040L50k238J93j414P17j171j307L562Q75P87j442l018K137o7
$$ -251012 -254069 -256109 -255759 -257997 -257804 -259218 -258501 -259672 -260979 -257417 -256542 -255755 -257197 -260215 -258078 -258145
8260b58145j659J218j253l39J298N806K116L756J55l819j360L726n57m012j463
$$ -258145 -259804 -258586 -259839 -260178 -258880 -253074 -250958 -247202 -247047 -250866 -252226 -248500 -249057 -253069 -254532
8245b54532j23L191R74J758N26j811K26j177J195J318O30n497j895M52kN11M74
$$ -254532 -254655 -251464 -250490 -248732 -248206 -250017 -249791 -250968 -249773 -248455 -247825 -253322 -255217 -254765 -254767 -254256 -253782
8228b53782k730K596J235o30J171k19k849j674J747J233J599j331j389J121K99
$$ -253782 -256512 -253916 -252681 -253311 -252140 -252359 -255208 -256882 -255135 -253902 -252303 -253634 -255023 -253902 -253603
8213b53603q80r17Q37N254K06k902J040k09k413j192J128J325J979O95m67P59
$$ -253603 -254483 -255400 -254563 -249309 -249103 -252005 -250965 -251174 -253587 -254779 -253651 -252326 -250347 -249652 -250119 -249360
8197b49360L063J200O46j168R14n20q85J682L18N96k995P47J344l274j681M881
$$ -249360 -246297 -245097 -244451 -245619 -244705 -245225 -246110 -244428 -244110 -243514 -246509 -245762 -244418 -247692 -249373 -244492
8181b44492M121k290m927j534K591K920P61J887Q38j176l49k985K163j99l295
$$ -244492 -240371 -242661 -247588 -249122 -246531 -243611 -242850 -240963 -240125 -241301 -241650 -244635 -242472 -242671 -245966
8166b45966m851j475k36J797J716L58j500L948M287r79k639j129J733K071K145
$$ -245966 -250817 -252292 -252528 -250731 -249015 -248657 -250157 -246209 -241922 -242901 -245540 -246669 -244936 -242865 -240720
8151b40720p39k608k309j896L546L017J243j584k425L22n14R98N83J432m46j043
$$ -240720 -241459 -244067 -246376 -248272 -244726 -241709 -240466 -242050 -244475 -244153 -244667 -243669 -243086 -241654 -242100 -243143
8135b43143N82j320m28K96L133M07l107l619r87j472L488L705l778k921L92R29
$$ -243143 -242561 -243881 -244309 -244013 -240880 -240473 -243580 -247199 -248186 -249658 -246170 -242465 -246243 -249164 -248772 -247843
8119b47843J96m36O46K210J183o7j571O76J209J953R26q67O90j950l03K883j056
$$ -247843 -247647 -248083 -247437 -245227 -244044 -244111 -245682 -245006 -243797 -241844 -240918 -241785 -241095 -243045 -243348 -240465 -241521
8102b41521l055K539K563p07o43p41O76k982k235L245K796q60m199n19K856J822
$$ -241521 -244576 -242037 -239474 -240181 -240824 -241565 -240889 -243871 -246106 -242861 -240065 -240925 -245124 -245643 -242787 -240965
8086b40965K75L348N14l142k915k937o25J187J83K501K143P90j18L065j202l554
$$ -240965 -240690 -237342 -236828 -239970 -242885 -245822 -246447 -245260 -245077 -242576 -240433 -239643 -239761 -236696 -237898 -241452
8070b41452P39L485L27j188j67k596j906J899K350K479K368j69K598K615l317
$$ -241452 -240713 -237228 -236901 -238089 -238256 -240852 -242758 -240859 -238509 -236030 -233662 -233831 -231233 -228618 -231935
8055b31935n659m85L61r51L280K148j841m54P26K790n08j277j578m16O97K18k102
$$ -231935 -237594 -238079 -237718 -238669 -235389 -233241 -235082 -235536 -234810 -232020 -232528 -233805 -235383 -235799 -235102 -234884 -236986
8038b36986j824k337p61J779L055O30K184j280l235N44l73k718q71J37L061K342
$$ -236986 -238810 -241147 -241908 -240129 -237074 -236444 -234260 -235540 -238775 -238231 -238604 -241322 -242193 -242056 -238995 -236653
8022b36653k834J000J403o14j197o41J143K130K388k322l110k481J169K274J700
$$ -236653 -239487 -238487 -237084 -237698 -238895 -239536 -238393 -236263 -233875 -236197 -239307 -241788 -240619 -238345 -236645
8007b36645k195j899K8J187K96j048k757l91K804K432m09m580l156K243K121L514
$$ -236645 -238840 -240739 -240711 -239524 -239228 -240276 -243033 -243424 -240620 -238188 -238597 -243177 -246333 -244090 -241969 -238455
7991b38455j47k80L379j175j795K206l22K414M98j859J37Q28j936j108o55j418
$$ -238455 -238602 -238882 -235503 -236678 -238473 -236267 -236589 -234175 -233677 -235536 -235399 -234571 -236507 -237615 -238270 -239688
7975b39688q32Q75L996K696j894j452P2L591l877m622j416j729K136O02J498R03
$$ -239688 -240520 -239645 -235649 -232953 -234847 -236299 -236227 -232636 -236513 -241135 -242551 -244280 -242144 -241542 -240044 -239141
7959b39141L316k021k698o01J51O59o6J728K395J808j719j572j666K862M835j432
$$ -239141 -235825 -237846 -240544 -241145 -240994 -240335 -240401 -238673 -236278 -234470 -236189 -237761 -239427 -236565 -231730 -233162
7943b33162j313l97N54J57l770p2q16k242K076n75L57k600k028J693M746M14m572
$$ -233162 -234475 -234872 -234318 -234161 -237931 -238003 -238819 -241061 -238985 -239560 -239203 -241803 -243831 -242138 -237392 -236978 -241550
7926b41550j6L278L479r8l640m49k590M46j092r85K177L537k12m601L70N56p42
$$ -241550 -241566 -238288 -234809 -234907 -238547 -238996 -241586 -241140 -242232 -243217 -241040 -237503 -237715 -242316 -241946 -241390 -242132
7909b42132K36J347k49K261o5j097j203K036j868j796M18L851L315L470o202k274
$$ -242132 -241896 -240549 -240798 -238537 -238602 -239699 -240902 -238866 -240734 -242530 -242112 -238261 -234946 -231476 -237678 -239952
7893b39952K673J22J923L532l5q48k358j26j652K458K404k973k646K29O10k118
$$ -239952 -237279 -237157 -235234 -231702 -231737 -232585 -234943 -235069 -236721 -234263 -231859 -234832 -237478 -237249 -236639 -238757
7877b38757o18q23k370r13M540J833O1J048L059R19l485k411j866K104M412k518
$$ -238757 -239375 -240198 -242568 -243481 -238941 -237108 -237047 -235999 -232940 -232021 -235506 -237917 -239783 -237679 -233267 -235785
7861b35785j237n12q97K517J321r87R16k59J774J970j328k090R39j011Q93N60
$$ -235785 -237022 -237534 -238431 -235914 -234593 -235580 -234664 -234923 -233149 -231179 -232507 -234597 -233658 -234669 -233776 -233216
7845b33216J711J682k490k637j869n19O022K363q61n173j827J568J239k954K264
$$ -233216 -231505 -229823 -232313 -234950 -236819 -237338 -231316 -228953 -229814 -234987 -236814 -235246 -234007 -236961 -234697
7830b34697K779J054J399K372Q1k719k359k984j166j42K942K681K075Q27l211
$$ -234697 -231918 -230864 -229465 -227093 -227012 -229731 -232090 -235074 -236240 -236382 -233440 -230759 -228684 -227857 -231068
7815b31068k055N32M026J883l158o711P89K890J135l173N66L779J174k147J645
$$ -231068 -233123 -232591 -228565 -226682 -229840 -236551 -235762 -232872 -231737 -234910 -234344 -230565 -229391 -231538 -229893
7800b29893M446j6j049l369k791j504L93P30m26R02J465l192K660J863R13Q51
$$ -229893 -225447 -225463 -226512 -229881 -232672 -234176 -233783 -233053 -233479 -232577 -231112 -234304 -231644 -229781 -228868 -228017
7784b28017L178J136k461o854l349j460K697M069K349P55l782m412K83K653Q29
$$ -228017 -224839 -223703 -226164 -233018 -236367 -237827 -235130 -231061 -228712 -227957 -231739 -236151 -235868 -233215 -232386
7769b32386J679J442j871l05L84N82k510J554J655J250j703k266J18O69j303P66
$$ -232386 -230707 -229265 -231136 -231441 -231057 -230475 -232985 -231431 -229776 -228526 -230229 -232495 -232377 -231708 -233011 -232245
7753b32245K575K524l20M063n78J005k315m365K171l12J058J118m72N63j487o83
$$ -232245 -229670 -227146 -227466 -223403 -223981 -222976 -225291 -229656 -227485 -227797 -226739 -225621 -226093 -225530 -227017 -227700
7737b27700J440n15J253J10J07M06j122J648J643L545k158l456j336l148j811
$$ -227700 -226260 -226775 -225522 -225412 -225305 -224899 -226021 -224373 -222730 -219185 -221343 -224799 -226135 -229283 -231094
7722b31094q28L990K960J786j276m408k616K080K846J154p63l3p38j332O99K553
$$ -231094 -231922 -227932 -224972 -223186 -224462 -228870 -231486 -229406 -226560 -225406 -226169 -226202 -226940 -228272 -227573 -225020
7706b25020k293Q2j262K802J219l124j376M4L127k8j036p3J331Q38J378J063n71
$$ -225020 -227313 -227231 -228493 -225691 -224472 -227596 -228972 -228928 -225801 -225829 -226865 -226938 -225607 -224769 -223391 -222328 -222899
7689b22899k852J372P8l087K242N311K458O87l451n868J389K789R46J474J61o33
$$ -222899 -225751 -224379 -224301 -227388 -225146 -219835 -217377 -216690 -220141 -226009 -224620 -221831 -220885 -219411 -219250 -219883
7673b19883n744r51K0L641R87l096k220L70K873Q03K112p31l238L49O89K250o55
$$ -219883 -225627 -226578 -226558 -222917 -221930 -225026 -227246 -226876 -224003 -223200 -221088 -221819 -225057 -224708 -224019 -221769 -222424
7656b22424m969J001M151M386j204n775o76K553K024p47L21L056k676l652k99
$$ -222424 -227393 -226392 -222241 -217855 -219059 -224834 -225510 -222957 -220933 -221680 -221359 -218303 -220979 -224631 -224930
7641b24930M309L588K539l433l434m89L53k853m145J536K729J409J846K337l247
$$ -224930 -220621 -217033 -214494 -217927 -221361 -221850 -221497 -224350 -228495 -226959 -224230 -222821 -220975 -218638 -221885
7626b21885j377M543l5k613O41L98K255K130k892n653j96l28L355L962j733m032
$$ -221885 -223262 -218719 -218754 -221367 -220726 -220328 -218073 -215943 -218835 -224488 -224684 -225012 -221657 -217695 -219428 -223460
7610b23460L070m1J47K245l08l465l787q98K761O399j007l620j084Q33j78K04
$$ -223460 -220390 -220431 -220284 -218039 -218347 -221812 -225599 -226497 -223736 -217337 -218344 -221964 -223048 -222215 -222393 -222189
7594b22189j2L517J169j113J487j435p81K581R18k532j633k91j95K259J836k141
$$ -222189 -222201 -218684 -217515 -218628 -217141 -218576 -219357 -216776 -215858 -218390 -220023 -220314 -220509 -218250 -216414 -218555
7578b18555l785j601j961L113J728K83J384J578K102j064k471j214K379n50r08
$$ -218555 -222340 -223941 -225902 -222789 -221061 -220778 -219394 -217816 -215714 -216778 -219249 -220463 -218084 -218634 -219542
7563b19542k628Q86j165L264K602j886l774l045K295M183P589j516j300j154k33
$$ -219542 -222170 -221284 -222449 -219185 -216583 -218469 -222243 -225288 -222993 -218810 -211221 -212737 -214037 -215191 -215424
7548b15424j924K36K656P32N8o97n584k402Q88J40J05K507j767N08L320j631j763
$$ -215424 -217348 -217112 -214456 -213724 -213666 -214363 -219947 -222349 -221461 -221321 -221216 -218709 -220476 -219968 -216648 -218279 -220042
7531b20042J313N21q95M93j930j891K560N39K764K583j059k707P73J641j674l734
$$ -220042 -218729 -218208 -219103 -218610 -220540 -222431 -219871 -219332 -216568 -213985 -215044 -217751 -216978 -215337 -217011 -220745
7515b20745J170J157M176p58K12j185j544k1Q98K394J165q71k640j685j195j299
$$ -220745 -219575 -218418 -214242 -215000 -214788 -215973 -217517 -217538 -216640 -214246 -213081 -213952 -216592 -218277 -219472 -220771
7499b20771J058M801k358k055K285J736J022o64k497j313J470L829J045k259q27
$$ -220771 -219713 -214912 -217270 -219325 -217040 -215304 -214282 -214946 -217443 -218756 -217286 -213457 -212412 -214671 -215498
7484b15498M21P96P68K48j35j504J489N546k390k957L85J981J967j491K724j25
$$ -215498 -215077 -214281 -213513 -213265 -213400 -214904 -213415 -207869 -210259 -213216 -212831 -210850 -208883 -210374 -207650 -207775
7468b07775k120j810k136J772P21j698k411j646K013K17j105K40j607j00J37J105
$$ -207775 -209895 -211705 -213841 -212069 -211348 -213046 -215457 -217103 -215090 -214873 -215978 -215738 -217345 -217445 -217308 -216203
7452b16203o94r99J604O11J864K537K4k908j505K443K161J12M36o68j174l12K083
$$ -216203 -216897 -217896 -216292 -215681 -213817 -211280 -211256 -214164 -215669 -213226 -211065 -210953 -210517 -211185 -212359 -212671 -210588
7435b10588J641Q00p37n577K42K167L183O170r78l432n690k411p85N598k106j309
$$ -210588 -208947 -208147 -208884 -214461 -214219 -212052 -208869 -202699 -203677 -207109 -212799 -215210 -215995 -210397 -212503 -213812
7419b13812r62P69j509J107M257k31j430j105L300K753j574J510k76r43k240p83
$$ -213812 -214774 -214005 -215514 -214407 -210150 -210381 -211811 -212916 -209616 -206863 -208437 -206927 -207203 -208146 -210386 -211169
7403b11169L52J613K242j092k143J364j637J64J960J379k586m88J311p3O58K59
$$ -211169 -210817 -209204 -206962 -208054 -210197 -208833 -210470 -210306 -208346 -206967 -209553 -210041 -208730 -208803 -208145 -207886
7387b07886Q95j491l730K430J821L050k854K43J104k675K453J106J980K239m507
$$ -207886 -206991 -208482 -212212 -209782 -207961 -204911 -207765 -207522 -206418 -209093 -206640 -205534 -203554 -201315 -205822
7372b05822k635l430o14L238L076j447j438L658J741j38j948k299j712k583J700
$$ -205822 -208457 -211887 -212501 -209263 -206187 -207634 -209072 -205414 -203673 -203811 -205759 -208058 -209770 -212353 -210653
$$ [...]
##END NTUPLES=NMR SPECTRUM
##END=
