##TITLE=Analysis number 325208
Compound Code cc 05704
Book Reference 518/29
Project Code adrs
Chemist Name colinb
##JCAMPDX= 6.0         $$ Bruker NMR JCAMP-DX V2.0
##DATA TYPE= NMR SPECTRUM
##DATA CLASS= NTUPLES
##ORIGIN= Bruker BioSpin GmbH
##OWNER= nmr
$$ XWIN-NMR		Version 3.5
$$ Thu Dec 14 13:55:37 2006 GMT Standard Time (UT+0h)  MAYBRIDGE\nmr@NMR_250MHZ
##.OBSERVE FREQUENCY= 250.131544655141
##.OBSERVE NUCLEUS= ^1H
##.ACQUISITION MODE= SIMULTANEOUS (DQD)
##.ACQUISITION SCHEME= undefined
##.AVERAGES= 16
##.DIGITISER RES= 18
##SPECTROMETER/DATA SYSTEM= dpx250
##.PULSE SEQUENCE= zg30
##.SOLVENT NAME= CDCl3
##.SHIFT REFERENCE= (INTERNAL, CDCl3, 0, 16.5289)
##AUDIT TRAIL= $$ (NUMBER, WHEN, WHO, WHERE, WHAT)
$$ ##TITLE= Audit trail, XWIN-NMR		Version 3.5
$$ ##JCAMPDX= 5.01
$$ ##ORIGIN= Bruker BioSpin GmbH
$$ ##OWNER= nmr
$$ C:\u/data/dgb/nmr/ADRS/1060/pdata/1/auditp.txt
$$ ##AUDIT TRAIL=  $$ (NUMBER, WHEN, WHO, WHERE, WHAT)
(   1,<2006-12-14 13:55:02.51 +000>,<MAYBRIDGE\nmr>,<NMR_250MHZ>,
      <created by zg, POWCHK disabled, PULCHK disabled
       configuration hash MD5:
       49 4B E0 1D 92 C2 6B 37 9F E6 65 BC 52 41 86 1D
       data hash MD5: 64K
       C2 2E FB 2F 1D 7B 91 F3 07 C6 5F 2A C3 C2 6F 52>)
(   2,<2006-12-14 13:55:17.54 +000>,<MAYBRIDGE\nmr>,<NMR_250MHZ>,
      <Start of raw data processing
       ef LB = 0.3 FT_mod = 6 PKNL = 1 SI = 32K 
       data hash MD5: 32K
       11 06 84 F3 56 AE DB FB B2 60 DE DF 71 7B 42 3E>)
(   3,<2006-12-14 13:55:19.25 +000>,<MAYBRIDGE\nmr>,<NMR_250MHZ>,
      <apk 
       data hash MD5: 32K
       F3 B9 CC C1 BD 28 1A 2A F6 59 A8 45 6C FB 4A 89>)
(   4,<2006-12-14 13:55:19.95 +000>,<MAYBRIDGE\nmr>,<NMR_250MHZ>,
      <abs ABSG = 5 
       data hash MD5: 32K
       2D 08 C3 84 F9 A6 E9 E2 AC 62 A3 21 1B C3 3C 0C>)
$$ ##END=
$$ 
$$ hash MD5
$$ 61 93 9D DC 7B 35 64 00 36 B6 64 69 C8 D6 B7 7B
##$RELAX= 
##$RELAX= 
##$RELAX= 
##$RELAX= 
##$RELAX= 
##$RELAX= 
##$RELAX= 
$$ Bruker specific parameters
$$ --------------------------
##$DU= <C:\u>
##$EXPNO= 1060
##$NAME= <ADRS>
##$PROCNO= 1
##$TYPE= <nmr>
##$USER= <dgb>
##$AMP= (0..31)
100 100 100 100 100 100 100 100 100 100 100 100 100 100 100 100 100 100 
100 100 100 100 100 100 100 100 100 100 100 100 100 100 
##$AQSEQ= 0
##$AQ_mod= 3
##$AUNM= <au_zg>
##$AUTOPOS= <16 >
##$BF1= 250.13
##$BF2= 250.13
##$BF3= 250.13
##$BF4= 250.13
##$BF5= 500.13
##$BF6= 500.13
##$BF7= 500.13
##$BF8= 500.13
##$BYTORDA= 1
##$CFDGTYP= 0
##$CFRGTYP= 5
##$CHEMSTR= <none>
##$CNST= (0..31)
1 1 145 1 1 1 1 1 1 1 1 1 1 1 1 1 1 1 1 1 1 1 1 1 1 1 1 1 1 1 1 1 
##$CPDPRG= <>
##$CPDPRG1= <>
##$CPDPRG2= <>
##$CPDPRG3= <>
##$CPDPRG4= <mlev>
##$CPDPRG5= <mlev>
##$CPDPRG6= <mlev>
##$CPDPRG7= <mlev>
##$CPDPRG8= <mlev>
##$CPDPRGB= <>
##$CPDPRGT= <>
##$D= (0..31)
0 1 0 0 0 0 0 0 0 0.06 0 0 0 0 0 0 0.0002 0 0 0 0 0 0 0 0 0 0 0 0 0 0 
0 
##$DATE= 1166104501
##$DBL= (0..7)
120 120 120 120 120 120 120 120 
##$DBP= (0..7)
150 150 150 150 150 150 150 150 
##$DBP07= 0
##$DBPNAM0= <>
##$DBPNAM1= <>
$$ [...]
##$SUBNAM7= <"">
##$SUBNAM8= <"">
##$SUBNAM9= <"">
##$SW= 20.6930455092707
##$SWIBOX= (0..15)
0 0 3 0 0 0 0 0 0 0 0 0 0 0 0 0 
##$SW_h= 5175.983436853
##$TD= 65536
##$TD0= 1
##$TE= 295.16
##$TE2= 300
##$TE3= 300
##$TEG= 300
##$TL= (0..7)
0 120 120 120 120 120 120 120 
##$TP= (0..7)
150 150 150 150 150 150 150 150 
##$TP07= 0
##$TPNAME0= <>
##$TPNAME1= <>
##$TPNAME2= <>
##$TPNAME3= <>
##$TPNAME4= <>
##$TPNAME5= <>
##$TPNAME6= <>
##$TPNAME7= <>
##$TPOAL= (0..7)
0.5 0.5 0.5 0.5 0.5 0.5 0.5 0.5 
##$TPOFFS= (0..7)
0 0 0 0 0 0 0 0 
##$TUNHIN= 0
##$TUNHOUT= 0
##$TUNXOUT= 0
##$USERA1= <user>
##$USERA2= <user>
##$USERA3= <user>
##$USERA4= <user>
##$USERA5= <user>
##$V9= 5
##$VALIST= <valist>
##$VCLIST= <CCCCCCCCCCCCCCC>
##$VD= 0
##$VDLIST= <DDDDDDDDDDDDDDD>
##$VPLIST= <PPPPPPPPPPPPPPP>
##$VTLIST= <TTTTTTTTTTTTTTT>
##$WBST= 1024
##$WBSW= 4
##$XGAIN= (0..3)
0 0 0 0 
##$XL= 0
##$YL= 0
##$YMAX_a= 295891
##$YMIN_a= -323580
##$ZGOPTNS= <>
##$ZL1= 120
##$ZL2= 120
##$ZL3= 120
##$ZL4= 120
##$ABSF1= 16.52892
##$ABSF2= -4.164255
##$ABSG= 5
##$ABSL= 3
##$ALPHA= 0
##$AQORDER= 0
##$ASSFAC= 0
##$ASSFACI= 0
##$ASSFACX= 0
##$ASSWID= 0
##$AUNMP= <proc_1d>
##$AZFE= 0.1
##$AZFW= 0.1
##$BCFW= 0
##$BC_mod= 0
##$BYTORDP= 0
##$COROFFS= 0
##$CY= 12.5
##$DATMOD= 1
##$DC= 0
##$DFILT= <>
##$DTYPP= 0
##$F1P= 14.0000005364418
##$F2P= -0.99999901652339
##$FCOR= 0.5
##$FTSIZE= 32768
##$FT_mod= 6
##$GAMMA= 0
##$GB= 0
##$INTBC= 1
##$INTSCL= 1
##$ISEN= 128
##$LB= 0.3
##$LEV0= 0
##$LPBIN= 0
##$MAXI= 10000
##$MC2= 0
##$MEAN= 0
##$ME_mod= 0
##$MI= 0
##$NCOEF= 0
##$NC_proc= -2
##$NLEV= 6
##$NOISF1= 0
##$NOISF2= 0
##$NSP= 0
##$NTH_PI= 0
##$NZP= 0
##$OFFSET= 16.52892
##$PC= 1
##$PHC0= 229.8399
##$PHC1= 5.850809
##$PH_mod= 1
##$PKNL= yes
##$PPARMOD= 0
##$PSCAL= 4
##$PSIGN= 0
##$REVERSE= no
##$SF= 250.129998269285
##$SI= 32768
##$SIGF1= 0
##$SIGF2= 0
##$SINO= 400
##$SIOLD= 32768
##$SREGLST= <1H.CDCl3>
##$SSB= 0
##$STSI= 32768
##$STSR= 0
##$SW_p= 5175.98343685301
##$SYMM= 0
##$S_DEV= 0
##$TDeff= 65536
##$TDoff= 0
##$TI= <Analysis number 999999
Compound Code 99
Book Reference 9
Project Code 9>
##$TILT= no
##$TM1= 0
##$TM2= 0
##$TOPLEV= 0
##$USERP1= <user>
##$USERP2= <user>
##$USERP3= <user>
##$USERP4= <user>
##$USERP5= <user>
##$WDW= 1
##$XDIM= 32768
##$YMAX_p= 448635055
##$YMIN_p= -222961
$$ End of Bruker specific parameters
$$ ---------------------------------
##NTUPLES= NMR SPECTRUM
##VAR_NAME=  FREQUENCY,     SPECTRUM/REAL,   SPECTRUM/IMAG
##SYMBOL=    X,             R,               I
##VAR_TYPE=  INDEPENDENT,   DEPENDENT,       DEPENDENT
##VAR_FORM=  AFFN,          ASDF,            ASDF
##VAR_DIM=   32768,         32768,           32768
##UNITS=     HZ,            ARBITRARY UNITS, ARBITRARY UNITS
##FACTOR=    0.157963299565203, 1,           1
##FIRST=     4134.37853588442, 0,            0
##LAST=      -1041.60490096859, 0,           0
##MIN=       -1041.60490096859, -222961,     0
##MAX=       4134.37853588442, 448635055,    0
$$ Real data points
##PAGE= N=1
##DATA TABLE= (X++(R..R)), XYDATA
$$ [...]
17299b3884K0741j0351o838J1879P813J5782R480j3488k6678K038l558p40J1260
17286f544M858j1270p126N086J437J48J711j91J8023L5024J2154K739q869j8112
17272B9068o534l611N92k5978k0051oL8245j4494j7067j7367j519Q70J0986q609
17258c5475m521M453R856Q758J4471P025r526k2840N82j4959j294K9944J2315
17245a211k5398J6094Q365q527o560O459J0009R264N257M217j9797J4009J8189
17232C0370P79k0267r781M44k3995j3283P285J6911J0213m088m725j7897k581
17219c0615P342R195J9603J946k4819J3468J2261j409Q720L128j2073Q6j4101
17206g268j5731l248J5630L406j295J9566k996k1885p990P513N825P598J1782
$$ plain form
17299 -23884 -3143 -13494 -20332 -8453 -640 15142 24622 11134 -15544 -13506 -17064 -17804 -6544
17286 -6544 -1686 -12956 -20082 -14996 -13559 -13411 -11700 -11891 6132 41156 53310 56049 47180 29068
17272 29068 22534 18923 19515 -6463 -26514 -26520 11725 -2769 -19836 -37203 -38722 -37852 -26866 -35475
17258 -35475 -39996 -35543 -25687 -16929 -2458 4567 -4959 -27799 -27217 -42176 -43470 -13526 -1211
17245 -1211 -26609 -10515 -2150 -10677 -17237 -10778 -769 8495 13752 17969 -1828 12181 30370
17232 30370 31149 10882 1101 1545 -22450 -35733 -28448 -11537 -1324 -5412 -10137 -28034 -30615
17219 -30615 -23273 -14078 5525 7471 -17348 -3880 8381 6972 15692 18820 6747 6833 -7268
17206 -7268 -22999 -26247 -10617 -7211 -8506 11060 8064 -13821 -21811 -14298 -8473 -875 10907
17193A0907j644q577j2877K228J0789N778M276j0749M154k100p547j4297j8720
17180c8379j180J0622K2589R779R216K3633k3618l2773N509r798O249M120J3448
17167e83K857j2479L115J958j254j199j5601j7090K0238J3079J939k324k433J4670
17153D893p300j3645L746J2618J8142n386r464n528k607J0347J5457j150M940
17140B5063q610j1052L204o756k0557N010N194j1254j7276o917K4591K5741o101
17127B80j0212k092Q738J2821k8783M281R60J5266k176J906p696k1829J874o409
17113c3071J4269L843L890Q486o462j6064Q810O485J0075R344K4335l627p334
17100B2979r99k051q834n439K970j5583j5653P22M456L3673J3720M575r279m672
$$ plain form
17193 10907 9263 686 -12191 -9963 826 6604 10880 131 4285 2185 -5362 -19659 -38379
17180 -38379 -39559 -28937 -6348 3431 12647 36280 12662 -20111 -14602 -24400 -18151 -14031 -583
17167 -583 2274 -10205 -7090 -5132 -6386 -7585 -23186 -40276 -20038 -6959 -5020 -7344 -9777 4893
17153 4893 -2407 -16052 -12306 312 18454 13068 3604 -1924 -4531 5816 21273 20123 25063
17140 25063 16453 5401 8605 1849 -18708 -13698 -8504 -19758 -37034 -43951 -19360 6381 280
17127 280 -9932 -12024 -3286 9535 -19248 -14967 -14007 1259 -917 989 -6707 -28536 -26662 -33071
17113 -33071 -18802 -14959 -11069 -2583 -9045 -25109 -16299 -9814 261 9605 33940 30313 22979
17100 22979 21980 19929 11095 5656 8626 -6957 -22610 -21888 -17432 16241 29961 34536 25257 20585
17086B0585j2380R342k97K268J055R194j8708k2788O697R145r232K0003K225L304
17072B0413j0346n546J5316M833p395l011P428j6195N923j939Q899J5956k4613
17059I723l5821J6141J2205q702J3203P224M778j4159q378j3501r040L243n33
17046b3617n380P458O79J663l43J9825j2741J6597K2407n696k776k43N77j4801
17032C609q444J9993J4615J6603p834o841k1098j1237K280R12k7276j3912K0557
17019a8073K0322k5492o675N981J4382k489j4778k856R168j4945p964K1739J6554
17006e126J0416J1168J8578k910N617j8709j1722m139k2441q171j996P124K3825
16993A514K9044m620L376j0473j2961j5350j3025J199L0734j295p669K1392N515
$$ plain form
17086 20585 8205 17547 17250 19518 20573 29767 11059 -11729 -5032 4113 -5119 14884 17109 20413
17072 20413 10067 4521 19837 24670 17275 14264 21692 5497 11420 9481 18380 34336 9723
17059 9723 -26098 -9957 2248 -6454 6749 13973 18751 4592 -3786 -17287 -26327 -23084 -23617
17046 -23617 -28997 -21539 -20860 -19197 -19540 285 -12456 4141 26548 20852 18076 17833 18410 3609
17032 3609 -4835 15158 29773 46376 38542 31701 10603 -634 1646 2558 -24718 -38630 -18073
17019 -18073 2249 -23243 -29918 -23937 -9555 -12044 -26822 -29678 -20510 -35455 -43419 -21680 -5126
17006 -5126 5290 16458 35036 32126 37743 19034 7312 3173 -19268 -27439 -29435 -22311 1514
16993 1514 30558 25938 29314 18841 5880 -9470 -22495 -21296 9438 8143 474 21866 27381
16980B7381p47l576j7690k5462k4517j2998M418J2037K4189K3895J4554O762%
16967B8246j061j1185O17o701o861j2618L522r530L874O175J3346q558r161j265
16953a1160j1093P381j5774n196J9537J6077l137J095J0524J802k7209k4046m216
16940d5415M689O58K6553K1672J9359O434q800q981N746P894J915J8399P153j1491
16926D5785r939j2034o305j1182J6256J994k7147M265r428m509j077J2827M953
16913D459K3747j515j2139j9974L20j4923j3341L425J3059O545K152L77J0497
16900B689j720m0164j0604L853q835J6131L2991M593J237q636L331J3330K4157
16887C2353j4204j1612j8823O850K990r479N378R706L503k667P539P297J2499
$$ plain form
16980 27381 26634 23058 5368 -20094 -44611 -57609 -53191 -41154 -16965 6930 21484 28246 28246
16967 28246 27185 16000 16617 9916 3055 -9563 -6041 -15571 -11697 -5522 7824 -734 -9895 -11160
16953 -11160 -22253 -14872 -30646 -35842 -16305 -228 -3365 -2270 8254 10056 -17153 -41199 -45415
16940 -45415 -40726 -40068 -13515 8157 27516 33950 25150 16169 21915 29809 31724 50123 57276 45785
16926 45785 35846 23812 17507 6325 22581 24575 -2572 1693 -7735 -12244 -13321 -494 4459
16913 4459 28206 26691 14552 -5422 -5102 -20025 -33366 -29941 -16882 -10337 -8185 -7808 2689
16900 2689 969 -39195 -49799 -45946 -54781 -38650 -5659 -1066 171 -8465 -5134 8196 32353
16887 32353 18149 6537 -12286 -5436 -2446 -11925 -6547 3159 6662 3995 11534 18831 31330
16874C1330Q082m857k1920o098j6062J767L304P562P029q271j7162j611J9506
16861B599K679k2851j9476K321J9476K2215P605K656N70p279n42j9207p038J4203
16847b069Q331o291m384p912J0541K6507K138p570O071R966j855l1788j4328J4729
16833B086K5350o362j5567J7043Q927j820k2667j5929L629J3853Q80k3267j3524
16820b7368J3111N182J1974J3588k310j1165N229L444k2857N18P037L427R430
16807I240J2603J5536J1916l3190j1242K3219j0163j3152k198k584m485j5226
16795a9726k3026J2937K2154J9663j1277k2963j3231k865l223j7478o693n3L8783
16782b6998J1528J303k504j5300N542M113k666J8697J7985L237L708j6471n695
$$ plain form
16874 31330 39412 34555 12635 6537 -9525 -7758 -4454 3108 10137 1866 -15296 -16907 2599
16861 2599 5278 -17573 -37049 -34728 -15252 6963 14568 17224 17794 10515 9973 -9234 -16272 -2069
16847 -2069 6262 -29 -4413 -12325 -1784 24723 26861 19291 25362 35328 33473 1685 -12643 2086
16833 2086 27436 21074 5507 22550 31477 29657 6990 -8939 -5310 8543 9423 -13844 -27368
16820 -27368 -14257 -9075 2899 16487 14177 3012 8241 11685 -11172 -10654 -3617 -190 9240
16807 9240 21843 37379 49295 16105 4863 28082 17919 4767 2569 -15 -4500 -19726
16795 -19726 -42752 -29815 -7661 12002 725 -22238 -35469 -38334 -41557 -59035 -65728 -65781 -26998
16782 -26998 -15470 -14167 -16671 -31971 -26429 -22316 -24982 -6285 11700 14937 18645 2174 -3521
16769c521k576L534O235J7916J5834K773j0630j4467q956j1157M507k60j3316
16756a4084l5635O994L5695O476m95j0466J5834q816k3767J89J302p659l918K8061
16742a0289L5332n997m305o196J061o149m122k4431r859K2603L6632L910n117
16729B3073j6185p391j9604q77j958O849L1827K696K364J6928j5929j5561j4470
16716h238N313l100K865n576j4804k874J3437n163o318q48Q808J2662J0905J6291
16702B3360p063j5191K012M98r394q417R413J7496r049M257r08k3583j9487N519
16688c0537j161O79k338Q287P141N838M73q387K484q209r750N321J5762J6385
16674A988o101k3071J0694R076m621j709r479k272K572J5404J5970J120P801k617
$$ plain form
16769 -3521 -6097 -2563 3672 21588 37422 40195 29565 15098 6142 -5015 -508 -768 -14084
16756 -14084 -49719 -42725 -7030 -554 -1049 -11515 4319 -4497 -28264 -28075 -26773 -34432 -38350 -10289
16742 -10289 25043 19046 14741 8545 9606 3457 -665 -25096 -34955 -12352 24280 28190 23073
16729 23073 6888 -503 -20107 -20984 -22942 -16093 15734 18430 20794 37722 21793 6232 -8238
16716 -8238 -2925 -6025 -3160 -8736 -23540 -26414 -12977 -18140 -24458 -25306 -16498 -3836 7069 23360
16702 23360 16297 1106 3118 3616 -5778 -14195 -4782 12714 3665 7922 7014 -16569 -36056 -30537
16688 -30537 -31698 -31019 -33357 -25070 -17929 -12091 -11618 -20005 -17521 -25730 -35480 -30159 -14397 1988
16674 1988 -4113 -27184 -16490 -7414 -12035 -13744 -23223 -25495 -22923 -7519 8451 9571 17372 14755
16660A4755k334k2262j701N027j3366p379j3103J2733L0993j0328l949P665n505
16647h754J6281J6057O778p584L183Q94K7085P763p498j3049l1829n889K7172
16634C0610O87k4205r522n309q475j2154J6929j0170m414J7751P033J8149J3829
16621C0739j911k338Q600p555j4125j3587j1122o254n078N57r340J0156N809M793
16607a0656j0471O800k152n555n080J5855O13r980o261j3881L0510O831l639K584
16593d482m976k2110Q58K1860j0078J2281R088p950k113n50q18j3973k7751K883
16579d7831K4822J6362J539L512P320q736k1714J4340J2088J0238r00j385k969
16566F686j0854L336O875N426j5286n272J3402r721R177j0157K527Q651Q975R024
$$ plain form
16660 14755 12421 -9841 -11542 -6515 -19881 -27260 -40363 -27630 3363 -6965 -10914 -3249 -8754
16647 -8754 7527 23584 30362 22778 25961 26855 53940 61703 54205 41156 9327 3438 30610
16634 30610 31297 7092 -2430 -7739 -16214 -28368 -11439 -21609 -26023 -8272 -1239 16910 30739
16621 30739 28828 26490 35090 27535 13410 -177 -11299 -17553 -22631 -22074 -31414 -21258 -15449 -10656
16607 -10656 -21127 -14327 -16479 -22034 -27114 -11259 -10646 -20626 -26887 -40768 -10258 -3427 -7066 -4482
16593 -4482 -9458 -31568 -30710 -8850 -18928 -6647 2441 -5509 -7622 -8172 -8990 -22963 -50714 -47831
16579 -47831 -23009 -6647 -5108 -1596 5724 -3012 -24726 -10386 1702 11940 11040 9655 6686
16566 6686 -4168 -832 6043 11469 -3817 -9089 4313 -5408 3769 -6388 -3861 4790 13765 22789
16552B2789k7292n797j6063Q67L7174J8398J464q334j91j1539k903J1263k915
16539A6921j1801k1820l506K1906n218Q052R07J5870q779k1573L818r951o651
16526b1825R744R73r488N007L145J4674J0008Q375k476k4240N04J407l753R84
16512f961j3010J462J4418Q446J6244j1491q016P723k135p625q018P489Q978J5996
16498B3500M805k1895L372j0943J3572l894k0743M449l759J625M10j6925J414
16485b5012K3101K0637j3819k3676p030K3656J9489J1305j5943k746r234n759
16473e031J3616L451j5647J1176K0418j1528n106o120k605j3425j1404M314J67
16460a7724M169K9899j565j4098o197M871R943L731M963L343j8253k142O088j5985
$$ plain form
16552 22789 -4503 -10300 -26363 -25496 11678 30076 31540 23206 23015 11476 8573 19836 16921
16539 16921 5120 -16700 -20206 1700 -3518 4534 5441 21311 12532 -9041 -5223 -15174 -21825
16526 -21825 -12081 -11108 -20596 -15589 -12444 2230 12238 20613 18137 -6103 -5599 -4192 -7945 -6961
16512 -6961 -19971 -18509 -4091 4355 20599 9108 1092 8815 6680 -945 -8963 -1474 7504 23500
16498 23500 28305 6410 9782 -1161 12411 8517 -12226 -7777 -11536 -9911 -9501 -26426 -25012
16485 -25012 -1911 18726 4907 -18769 -25799 -2143 17346 28651 12708 9962 728 -5031
16473 -5031 8585 12036 -3611 7565 27983 16455 11349 5229 2624 -10801 -22205 -17891 -17724
16460 -17724 -13555 16344 14779 681 -5516 -645 9298 13029 17992 21335 3082 940 7028 -8957
16446h957J1869l081q337l328L133J0035J9456L493l566j8340j3172j7661L72
16433b8084J1509o003k255j4147J6166J6540r89j2041j782J9917K8768K542j6317
16420A3824j2528p766K5864J3984j4251j0177j1135N678r47N837k530k841Q15
16407C827Q276Q08j7558J738M684k92N691j2735m410p499p329J2763j3185M424
16393b0797K1458j323j4966m204j3498j5700J5816K1517P851P117k726p836m567
16380a1858O80q527L1587n478k26J739K414r881K134K8025J4174k1979k1494n659
16366d349j7651j4503P248J9896J6708q807o267J6421o374k4101j2276o684J1654
16353b9085J6414n22R378J5107o156j4458J071r938n46J0474j1553k4605L140
$$ plain form
16446 -8957 2912 -169 -8506 -11834 -8701 1334 20790 24283 20717 2377 -10795 -28456 -28084
16433 -28084 -16575 -22578 -24833 -38980 -22814 -6274 -7263 -19304 -21086 -1169 27599 30141 13824
16420 13824 1296 -6470 19394 33378 19127 8950 -2185 3493 2546 8383 5853 3012 3827
16407 3827 12103 12911 -4647 -2909 1775 1483 7174 -5561 -9971 -17470 -24799 -12036 -25221 -20797
16393 -20797 661 -662 -15628 -19832 -33330 -49030 -33214 -11697 -3846 3271 545 -7291 -11858
16380 -11858 -11178 -19705 11882 6404 6178 7917 10331 450 2584 30609 44783 22804 1310 -4349
16366 -4349 -22000 -36503 -29255 -9359 7349 -1458 -7725 8696 2322 -21779 -34055 -40739 -29085
16353 -29085 -12671 -13193 -3815 11292 5136 -9322 -8251 -18189 -18735 -8261 -19814 -44419 -41279
16340d1279K1504P078p05m476M789j1072j868J9284J7492K269M464j4637L559
16327F402Q432L52j0989p096M687L442j135p992k1936m707P051J1283K4852j3846
16313a200j0809N402L675n494j9934J4386l036l645J8485m196j1939M011L605
16300a0689j5491k036M152K001m50L039J6083O927K3187J463j5358k7932l098
16287a8202M530p384N830j4365L552j6511k667J2339Q934N16J973J7576k517r734
16273a6130P322J9964O903K658Q713r447j5656m933j7112j0325J8772n772m0k250
16259a7333J5203M826q439Q479j147j0206k2005K4802K2561j1264j4663k08O890
16246b504j3799j1188K6561M55k1856n830n074L384L165k143K41J1606K1887J6949
$$ plain form
16340 -41279 -19775 -12697 -13402 -17878 -13089 -24161 -26029 -6745 10747 13016 17480 2843 6402
16327 6402 14834 15186 4197 -2899 1788 5230 4095 -3897 -25833 -30540 -23489 -12206 12646 -1200
16313 -1200 -12009 -6607 -2932 -8426 -28360 -13974 -17010 -20655 -2170 -6366 -18305 -14294 -10689
16300 -10689 -26180 -28216 -24064 -22063 -22513 -19474 -3391 3536 26723 28186 12828 -15104 -18202
16287 -18202 -13672 -21056 -15226 -29591 -26039 -42550 -45217 -32878 -23944 -23428 -21455 -3879 -6396 -16130
16273 -16130 -8808 11156 18059 20717 29430 19983 4327 -606 -17718 -28043 -9271 -15043 -15083 -17333
16259 -17333 -2130 2696 -5743 2736 1589 -8617 -30622 -5820 16741 5477 -9186 -9394 -2504
16246 -2504 -16303 -27491 -930 -475 -22331 -28161 -33235 -29851 -26686 -28829 -28588 -16982 4905 21854
16232B1854m396k7074k524j1787p551J793J0065O897l204J8407P270J1504J7085
16219C8339k1449r182J4086K824j6794j4040j3616Q617J1683r585L205P269j3567
16206a2210p699n266L034J4101J3421l27j0359j2902O277J5161J0773r921J526
16193E609M752J6766k809j8841j2621Q312J8308J4958Q49R388J8473j095k6217
16180C5832k4401j2568r038p510Q090J3875k2674j216M237L258J6448l109l410
16167b186N345r603l840R042L9845k969K853k2547p550j8601N07P053j2433J5435
16153C51O757j8156q254O66J4088J5580j4421m502n108o592p773o126J6190m634
16139b1934K39Q347K4944P56j046P303N756k0633N316m021J82J8869p249j8380
$$ plain form
16232 21854 17458 -9616 -12140 -23927 -31478 -29685 -19620 -12723 -15927 2480 9750 21254 38339
16219 38339 16890 7708 21794 24618 7824 -6216 -19832 -11215 468 -9117 -5912 1357 -12210
16206 -12210 -19909 -25175 -22141 -8040 5381 5054 -5305 -18207 -11930 3231 14004 4083 5609
16193 5609 10361 27127 24318 5477 -7144 1168 19476 34434 35283 44671 63144 62049 35832
16180 35832 11431 -1137 -10175 -17685 -9595 4280 -18394 -19610 -15373 -12115 4333 1224 -2186
16167 -2186 3159 -6444 -10284 -1242 38603 35634 38487 15940 8390 -10211 -9704 -2651 -15084 351
16153 351 7108 -11048 -19302 -18636 -4548 11032 -3389 -7891 -12999 -19591 -27364 -33490 -17300 -21934
16139 -21934 -21695 -13348 11596 12352 11306 18609 24365 3732 9048 5027 5209 24078 16829 -1551
16125a551R109k84j1672r194k1614p117m862L051J0620R700q291M072L4891q236
16111a378l296K6571L9979p997k1511m725j6647j5927j2207O865Q205J0520q300
16098A52m868K2223J1613k3210j3170J5447J4077j84j3236l1680n720Q773K3292
16085C509l106j5156j8734p450k985J5305K1116J6655J0483m503m165J1434l585
16072A8818j8534j0475O301L465R757J7544n376j7974q885J730P916J1470k5768
16059a0011l2327K061J0436J4805K647m26L1J5669K3138j6876k5177Q83J2553
16046b594o891j453M099J6833J7151j1271Q019k148J259j2635k5277O196J1918
16033C206M566J3252Q578J4467j719j0120j5400p141L966q767q26Q135k739p793
$$ plain form
16125 -1551 7558 7274 -4398 -13592 -35206 -42323 -47185 -44134 -33514 -23814 -32105 -28033 6858 -1378
16111 -1378 -4674 21897 61876 53879 32368 27643 10996 -4931 -17138 -10273 -2068 8452 152
16098 152 -4716 17507 29120 5910 -7260 8187 22264 22080 8844 -22836 -28556 -19783 3509
16085 3509 403 -14753 -33487 -40937 -43922 -28617 -7501 9154 19637 15134 10969 22403 18818
16072 18818 284 -10191 -3890 -425 9332 26876 21500 3526 -5359 -3629 4287 15757 -10011
16059 -10011 -42338 -40277 -29841 -15036 -12389 -12815 -12784 2885 26023 9147 -16030 -15147 -2594
16046 -2594 -9485 -10938 -6839 9994 27145 15874 23893 21745 23004 10369 -14908 -8712 3206
16033 3206 7772 21024 29602 44069 42350 32230 16830 9689 13655 4888 4062 12197 9458 1665
16019A665J0674N682m1960M87p689L231J7386J6048K287j0854J984o840j1484
16006a9383P721M84J818l393O331M764k0120l393K9926J7055j8650k1942l860
15993b2642J9800N657n30k082J3417J4705j5082N409p299p034L802j6367l4483
15980d2729o996n994K1804J7224J308J6405J4624l180P841l748L887j4383M886
15967A0949J7264l113r200k501N484K913o022q65q239r693l134O781j1258n762
15953a6396M481P992J6784P310p625l531q160j402M266J3986o117j030K077n627
15939G008k0879O745L8537Q994j4345j4165o261N668l958l917N262j6705j7891
15926b5907K6725O800K378J522k2052P460Q01j8849R211J8835P87m897L132l2516
$$ plain form
16019 1665 12339 18021 -23939 -23452 -31141 -27910 -10524 5524 7811 -3043 -1059 -7899 -19383
16006 -19383 -11662 -11178 -9360 -12753 -6422 -1658 -21778 -25171 4755 21810 3160 -18782 -22642
15993 -22642 -2842 2815 2285 203 13620 28325 13243 18652 11353 4319 8121 -8246 -42729
15980 -42729 -49725 -55719 -33915 -16691 -15383 1022 15646 12466 20307 16559 20446 6063 10949
15967 10949 28213 25100 15900 13399 18883 21796 15774 14909 6670 -3023 -6157 624 -10634 -16396
15953 -16396 -11915 -3923 12861 20171 12546 9015 855 -547 3719 17705 11588 10558 12635 7008
15939 7008 -13871 -7126 31411 40405 26060 11895 5634 11302 7344 3427 8689 -8016 -25907
15926 -25907 818 7618 9996 11518 -10534 -3074 -2273 -21122 -11911 6924 7711 2814 5946 -26570
15912b6570K489L2646J4187J4062K036j2982j6028k7871K1341J7280L590j7861
15900F319j9538m417K1544K391Q291r806P736J2181j915j1868R578P537k097j1895
15886A4041j2838K0458k2506j2298m386J0967Q28R407K0797o977k9028j273J026
15873a1782J6805L532K761O271K5981J6479l762j6366l0693N82J0358p986q22
15860A1358j1033k1516j1882J3119J3808J6490J3629j4736j1959r118L680J29
15848h031r64k0201j1298l884O316K9632n327r751N50J2457K9304L434j2980j3965
15834d708r588J7269J4635k80j9839o450j5344J1794J6492Q004n890K0960J4302
15821D1357r78q662q183q271q026J7021M443k5583j7501m40J6976r937k0408l893
$$ plain form
15912 -26570 -24081 8565 22752 36814 38850 25868 9840 -18031 3310 20590 24180 6319
15900 6319 -13219 -17636 3908 6299 14590 4784 12520 24701 22786 10918 20496 28033 25936 14041
15886 14041 1203 21661 -845 -13143 -17529 -6562 -5734 3673 24470 17493 -11535 -12808 -11782
15873 -11782 5023 8555 11316 17587 43568 60047 56285 39919 9226 9808 20166 12180 11358
15860 11358 325 -21191 -33073 -19954 -6146 10344 23973 9237 -2722 -11840 -8160 -8031
15848 -8031 -8995 -29196 -40494 -44378 -38062 -8430 -13757 -23508 -22958 -10501 18803 22237 9257 -4708
15834 -4708 -14296 2973 17608 17328 -2511 -8961 -24305 -12511 3981 11985 6095 27055 41357
15821 41357 40379 31717 23534 15263 7237 24258 28701 3118 -14383 -14823 2153 -7784 -28192 -32085
15807c2085J4874J8025K6115J5757J0742k0581p451n561r087j3938k31K3120n158
15794A4541k8328j477j091J1876R436J193k1198m652r088K5742O11j7840Q546
15781a1729J9096J4804j8205j417N016m024O3m073j681Q314j6358O118J4849m650
15767F123J655R538k807p411r153j8583M303k717N258K3095J0839p821p964k0127
15753a5772J2061J4761K3291R726m099p321j0839j6786Q868Q341j4455j3208m212
15740i644N705P117m637j3078P295J1129m356j3971L31L2853j3330j2342Q532
15727A604Q417j0738j9042n62P565J5893J1833o978l960P484j0444N838l966n787
15713b843J2797n938k5191J0041J1899P814j1256r322J1699O783p511J2480K523
$$ plain form
15807 -32085 -17211 814 26929 42686 53428 32847 25396 19835 10748 -3190 -3421 19699 14541
15794 14541 -13787 -15264 -16355 -4479 4957 6150 -15048 -19700 -28788 -3046 -2435 -20275 -11729
15781 -11729 7367 22171 3966 2549 7565 3541 3604 -469 -2150 6164 -10194 -4076 10773 6123
15767 6123 7778 17316 14509 7098 -2055 -20638 -16335 -19052 -13794 9301 20140 12319 4355 -15772
15753 -15772 -3711 11050 34341 44067 39968 32647 21808 5022 13890 22231 7776 -5432 -9644
15740 -9644 -3939 3178 -1459 -14537 -7242 3887 -469 -14440 -14109 18744 5414 -6928 1604
15727 1604 10021 -717 -19759 -20321 -12756 3137 14970 7992 4032 11516 1072 6910 2944 -2843
15713 -2843 9954 4016 -21175 -11134 765 8579 -2677 -11999 -300 6483 -1028 11452 13975
15700A3975j8032O872Q395j356k9088J2158K6267j84k2987J256K5404O375j0537
15687A8518j4165R980J0316O754Q05j7950Q268k131O745p363j7393Q557J2622
15674B3563o041p982j3026j0956J8729J4861j2055J8504M922k6911r644j7714
15662b3750j2658J1263p30J2380Q466J0087N445j1387J1214J6085M409K637k6314
15649G147j1293j0172N090O878P292Q621m669J347p978p654q917j0265K5763J5137
15635A6327J836j4072j0676o896k62k8113k657L1314J2425j2360j6142J1572n635
15622b3339R158J4446J4847J0375k3945n412N56J257K9464j1667k4152l425p082
15609a8919J4532M0040J264j6778k3763K321L199m639J7730J5108J8157j9542
$$ plain form
15700 13975 -4057 2815 11210 9854 -19234 -7076 19191 19007 -3980 -2724 22680 29055 18518
15687 18518 4353 14333 24649 31403 32208 14258 22526 20395 27140 19777 2384 10941 23563
15674 23563 17522 9540 -3486 -14442 4287 19148 7093 25597 30519 3608 -6036 -23750
15662 -23750 -36408 -25145 -25875 -13495 -5029 5058 10503 -884 10330 26415 30824 33461 7147
15649 7147 -4146 -14318 -9228 -2350 4942 13563 8894 10241 2263 -5391 -14308 -24573 1190 16327
15635 16327 18163 4091 -6585 -13481 -13743 -41856 -44513 -13199 -774 -13134 -29276 -17704 -23339
15622 -23339 -14181 265 15112 25487 1542 -3870 -3314 -2057 27407 15740 -8412 -11837 -18919
15609 -18919 -4387 35653 36917 20139 -3624 -1303 1896 -2743 14987 30095 48252 28710
15597B8710k4434J3114j1238p812P459J232J0030Q349l724j3680l321Q145q721
15584D109r037Q766m044j6891J6014J4688p536L048N754j1754l20N574K483Q001
15570A8855J2236M198j1696q083k7397j166P036J1828n316p533n005l998j2109
15557b8150Q627L5251o028K844k0064p123j8948K4918L0130J6959l367l1139l2054
15544b8144J4561K9576J6478N431r427p82q187j04J3146o028J2889J7093r865
15531D6637q055j0086j3122M50J4555n633j3001K724M230K3744j2811q67K5906
15518E4671N817k8270k4312j5395j5620M596J4170j567j2002p486J2718o95J2910
15505d65J6514J275J2679j6279m8022l506J7271K8215J8139R26J3841j2634j6751
$$ plain form
15597 28710 4276 17390 6152 -1660 5799 7031 17061 25410 21686 8006 4685 12830 4109
15584 4109 -4928 3838 -206 -17097 -1083 13605 6069 9117 14871 3117 2797 8371 10854 18855
15570 18855 31091 35289 23593 15510 -11887 -13053 -6017 5811 495 -7038 -12043 -16041 -28150
15557 -28150 -19523 15728 9700 12544 -7520 -14643 -33591 -8673 21457 38416 35049 3910 -28144
15544 -28144 -13583 15993 32471 37902 28475 27693 19506 19402 32548 26520 39409 56502 46637
15531 46637 38582 28496 15374 15824 30379 24746 11745 14469 18699 42443 29632 28765 54671
15518 54671 60488 32218 7906 -7489 -23109 -18513 -4343 -5910 -17912 -25398 -12680 -13375 -465
15505 -465 16049 17324 30003 13724 -34298 -37804 -20533 7682 25821 26747 40588 27954 11203
15492A1203O480O02j2801j4183R927O387k0762j0811J067O856l819J2718r435
15479a6571k1099L5725R743q160J1851Q155j6276j9771O125j221L93p356j0079
15466b8541O144j00J0421K3454L750j3017j216J802j5598L783J541P656M007R614
15452A3700k3912l957J8532J859j489J656j687J4279r955j2996l410K0037N422
15439A8079j1137j137l200q446r265J0942k591P863k551j1497l959R344j0644
15426a8199q615l397P354K509M224J4116P098j512K722J601j6690m46M159J1946
15412F870Q575j1037J1139K5124J3870j1690m4734k8242p348J0190J6437q67q235
15399a9948p993N300J7562J9567r07k698j1731j5949n977k271J5241M256J0787
$$ plain form
15492 11203 17683 18285 5484 -8699 1228 7615 -13147 -23958 -22891 -16035 -19854 -7136 -16571
15479 -16571 -37670 -1945 7798 -362 11489 19644 3368 -16403 -10278 -11499 -11106 -18462 -28541
15466 -28541 -22397 -22497 -12076 11378 15128 2111 895 2697 -12901 -9118 -7577 79 4086 13700
15452 13700 -10212 -14169 4363 6222 4733 6389 4702 18981 9026 -3970 -7380 12657 18079
15439 18079 6942 5805 2605 -5841 -15106 -4164 -6755 1108 -1443 -12940 -16899 -7555 -18199
15426 -18199 -26814 -30211 -22857 -20348 -16124 -2008 5090 3578 6300 7901 -8789 -9235 -5076 6870
15412 6870 15445 4408 15547 40671 54541 42851 -1883 -30125 -37473 -27283 -10846 -11713 -19948
15399 -19948 -27941 -22641 -5079 14488 13581 10883 -848 -16797 -22774 -25045 -9804 -5548 5239
15386E239n82k1522j5943Q551J7589J4475n379M424K4752L089n332l27m99j1387
15372A7148l475P48j5703n995l850j906L578J4732Q88q880j4966J5673Qj1075
15358a3075J5871n940j213J8636J0047K902R388M057j7573j2737L480M497j5880
15345B460k7357m131L7543J5477m817j2737j543P311k6157J3710Q622p462j4818
15332a3899K2255N125k890j0309J0176M740n594N279P557l620m286k1250r665
15319a6381R876J5156j6349r720p323k7878l649K1571L945R693j9480p66J0265
15306c1040J0328L510K0232K1794K5211L527j2061j536n936n752k0965p613j0715
15293a1016J8828j1607l167P698P660j892n479O455N645p465r899L743m447J5035
$$ plain form
15386 5239 4657 -16865 -32808 -24257 -6668 7807 2428 6852 31604 34693 29361 29034 28535 17148
15372 17148 13673 14421 -1282 -7277 -11127 -13033 -9455 5277 6165 -2715 -17681 -2008 -2000 -13075
15358 -13075 2796 -3144 -4357 14279 24326 27228 36616 40673 23100 10363 13843 18340 2460
15345 2460 -24897 -29028 8515 23992 19175 6438 4895 12206 -13951 -241 8381 919 -13899
15332 -13899 8356 13481 10591 282 10458 15198 9604 14883 22440 18820 14534 -6716 -16381
15319 -16381 -6505 8651 -7698 -17418 -24741 -52619 -56268 -34697 -30752 -21059 -40539 -41305 -31040
15306 -31040 -20712 -17202 3030 24824 50035 53562 41501 39965 34029 28277 7312 -301 -11016
15293 -11016 7812 -3795 -6962 736 8396 6504 1025 7480 13125 5660 -4239 -496 -4943 10092
15279A0092K4698O594l97k0991j1649L830n862o630P107q83J6617J3408m119j3526
15265A8289r088j3032J5214k990j4542K108k050j14J3390m02j5417J1621J2015
15252A5002Q567p634j657R27o812j880J5602j0903j5858j6087M51K5343j3933
15239h872k715o063K4837K8391k558j4198Q563O40j1911k256r267J4311R590o388
15225B2104M512J1393j6593k2522o800P544J0343j4877j4593r491Q970J4639N925
15212E54k111j3461o52j339M984J7813k277o853k714j550J1632N167j4303j2889
15198a7999j5145J0557P539k666Q35R975r808j7358M831P342J5557N928k49L817
15184C156J797k1129p765J4171Q739K6608J5659l2090l4861m112K5239Q625J2630
$$ plain form
15279 10092 34790 41384 40987 19996 8347 12177 6315 -315 6792 5909 22526 35934 31815 18289
15265 18289 9201 -3831 11383 8393 -6149 -4041 -6091 -6205 7185 6783 -8634 2987 15002
15252 15002 23569 15935 14278 15205 8393 6513 22115 11212 -4646 -20733 -20282 5061 -8872
15239 -8872 -11587 -17650 7187 35578 33020 18822 27385 28025 16114 13858 4591 18902 28492 22104
15225 22104 26616 38009 21416 -1106 -7906 -362 9981 -4896 -19489 -28980 -20010 -5371 554
15212 554 -1557 -15018 -15670 -17009 -12025 5788 3511 -3342 -6056 -7606 4026 9193 -5110 -17999
15198 -17999 -33144 -22587 -15048 -17714 -16879 -6904 -16712 -34070 -29239 -21897 -6340 -412 -661 3156
15184 3156 4953 -16176 -23941 -9770 -1031 25577 41236 9146 -25715 -29827 -4588 4037 16667
15171A6667J0839n209j6123o229r103J9070L296Q91j4095P81K722k4180r520r010
15157c9203J1302J5604J3270J3278o275p739J3203k406j1716k7102k0303j538
15145d9625J5147L2883K0172n229m2400J0659L9324n152j1886j2311R7J2435j1154
15132g040J2524L811j7283o947p658K2142J780l805J4025K881K3P579r740q160
15118D132J277j1661L939j2883j1767q722M435J0843O043J1098J9893J1523J4879
15105D3029j744j0077q093o10j9232q473j188j3862J6471J2940n881k9950M049
15092b2621J9520k052j4699O003J9810j386j7940j6902o596J7421J300J5626l166
15079e682r831j711J4019J0383n912r165o679P363l410j1401N914j159J1808o830
$$ plain form
15171 16667 27506 22297 6174 -55 -9158 9912 13208 14099 4 785 3507 -20673 -30193 -39203
15157 -39203 -27901 -12297 973 14251 7976 237 13440 11034 -682 -27784 -48087 -49625
15145 -49625 -34478 -1595 18577 13348 -29052 -18393 20931 15779 3893 -8418 -8321 4114 -7040
15132 -7040 5484 9295 -7988 -14935 -22593 -451 1329 -2476 11549 14430 14453 22032 12292 4132
15118 4132 5409 -6252 -2313 -15196 -26963 -35685 -31250 -20407 -14364 -3266 16627 28150 43029
15105 43029 41285 31208 23115 22505 3273 -5200 -6388 -20250 -3779 9161 3280 -26670 -22621
15092 -22621 -3101 -5153 -19852 -13849 5961 4575 -13365 -30267 -36863 -19442 -18142 -2516 -5682
15079 -5682 -15513 -17224 -3205 7178 1266 -7899 -14578 -7215 -10625 -22026 -16112 -17271 -5463 -12293
15065a2293J6242J36P55J2300j6086j3852L5987K1220k7678K383O151k917j1497
15052A0851j272N992J7400j3122p557j6532j0294O841L195m815o305J6431J0028
15039A0841j3181N126q086k7027J871j2079N753L2466J3245n096j5247p25L156
15026h983P758J3913J1887l012j1468K29N908k5895j7437N534L4913J5535N004
15013C3886M749n415j5954l781P602J846K010j2921n111K5349j8758j6499J1106
15000H109j0052j746j8538J712R894N074J4408J2071k3258j4742q82j1854l89
14987c0193j4311p664J4268N35q553J4833m815Q78J9819J9954J0350p019j221
14974F861n262l200o68j7366r89J1229J6106J3966M120j6148j0028N757K197J2321
$$ plain form
15065 -12293 3949 4085 4840 17140 1054 -12798 23189 44409 16731 19114 25265 22348 10851
15052 10851 9579 15571 32971 19849 12292 -4240 -14534 -7693 -4498 -9313 -15618 813 10841
15039 10841 -2340 2786 -5300 -32327 -30456 -42535 -36782 -4316 8929 3833 -11414 -12139 -8983
15026 -8983 -1225 12688 24575 21563 10095 10324 16232 -9663 -27100 -21566 13347 28882 33886
15013 33886 38635 33220 17266 13485 21087 22933 24943 12022 6911 32260 13502 -2997 8109
15000 8109 -1943 -3689 -22227 -20515 -10621 -5547 8861 20932 -2326 -17068 -17950 -29804 -30193
14987 -30193 -44504 -52168 -37900 -37365 -45918 -31085 -35900 -35022 -15203 4751 15101 8082 6861
14974 6861 1599 -1601 -2269 -19635 -20624 -9395 6711 20677 24797 8649 -1379 4378 6575 18896
14960A8896o333k1431M054l353O674O921Q343p10l397J2778j2299k3917J7302
14947C528J688j6815m36j5918J5814M831k994l680J8364J8229j0328q669J8113
14934B1727j604j3817j3774k626J6612J3065o256j802M05j612N475l767p186n843
14920a003o099O96k33L884k1362n517Q185K6726K5125M815k1131p088J4180J0915
14906C2093j2156j6191n804M733J4050k937j8171N005l731o418k372J0446Q838
14893G385J37L665k070j8245k2369n338m505K5787J3450q775j3051N565K8366
14880A0002Q631k6088j0436N514p05o738J4196p357K59j7459K823J0362j0887
14867b7883j9256J0869P569o267p505j0498K7546M8347N349p579r24j7590J365
$$ plain form
14960 18896 12563 -8868 -4814 -8167 -1493 5428 13771 13061 9664 22442 10143 -13774 3528
14947 3528 5216 -11599 -12035 -27953 -12139 -7308 -10302 -13982 4382 22611 12283 3614 21727
14934 21727 20123 6306 -7468 -10094 6518 19583 13327 11525 11930 10318 15793 12026 4840 -1003
14920 -1003 -7102 -6406 -6639 -2755 -24117 -29634 -21449 5277 30402 35217 14086 6998 21178 32093
14906 32093 19937 3746 -2058 2675 16725 13788 -4383 622 -3109 -9527 -11899 -1453 7385
14893 7385 7522 11187 9117 -9128 -31497 -36835 -41340 -15553 -2103 -10878 -23929 -18364 10002
14880 10002 18633 -7455 -17891 -12377 -13082 -19820 -5624 -12981 -12722 -30181 -27358 -16996 -27883
14867 -27883 -47139 -36270 -28701 -34968 -42473 -52971 -25425 22922 28271 20692 19768 2178 3543
14854C543j910J5701J8255k3053o444j6286K419J8535J742K928q888q354R430
14841G618j3533m793M293R765k490j6222q534M909O162K0562J4526j5483M722
14828A1502M657j4523n094P777j5826P855Q822J6791j5359m28J7929J5545M31
14815D0079k8961k0171K4096J8438j4160r239r929o131J2409j2667m847J1127
14803D4K0386n366o808M850J5214m20k3437k0506j5299N365n422J220P778K2434
14789C3l443p980j679J7849o721r001r598p3K662K0276R340j0103N963n45M04
14774G384m906N171J3033Q009j4127K338L936O017J7917m067l7771k0284O953
14761a0397L781J0890P678Q132K0661k699L625K0825k4925l326n054j7291r736
$$ plain form
14854 3543 1633 17334 35589 12536 6092 -10194 -7775 10760 12502 15430 6542 -1812 7618
14841 7618 -5915 -10708 -6415 3350 860 -15362 -23896 -18987 -12825 7737 22263 6780 11502
14828 11502 16159 1636 -3458 4319 -11507 -3652 5170 21961 6602 6174 24103 39648 40079
14815 40079 11118 -9053 15043 33481 19321 10082 153 -5978 6431 -6236 -11083 44
14803 44 20430 15064 8256 13106 28320 27900 4463 -16043 -31342 -25977 -31399 -30179 -22401 33
14789 33 -3410 -11390 -13069 4780 -1941 -10942 -20540 -20613 -17951 2325 11665 1562 7525 6980 7384
14774 7384 2478 7649 20682 28691 14564 16902 20838 26855 44772 40705 2934 -17350 -10397
14761 -10397 -6616 4274 11952 20084 40745 38046 41671 62496 37571 34245 29191 11900 2164
14748B164j122j6120J1949J7701m055j7113o300J898L924J9580N36j1003j4745
14735a2706L278l145J830l955R51P42J00M613J5339O219j0657J698J1889r080
14721G116K407M865l224O363j183j2626j5370N464j5828o913J4835P151j3751
14708b0694K004O596K1372J513L140J3126j89j5375q393n297J6976k0213k1370
14695b6804K1592j0695j6036J3395j3133l420J3956P61j672K0580M433p397j3022
14682a7462J0219K2082O265J445l1490K483J4755J0377P451n173j2619q691J8229
14669A7871J8132j7976j7561o097M235Q3M543J4733j0465j7261M225J5019J2326
14656B1807o842J349P343l396k882R7m980O394J5242r49J6259J891j6972j1597
$$ plain form
14748 2164 1042 -15078 -3129 14572 10517 -6596 -12896 -10998 -7074 12506 13042 2039 -12706
14735 -12706 -9428 -12573 -10743 -14698 -13747 -13005 -12905 -8292 7047 13266 2609 4307 16196 7116
14721 7116 9523 14388 11164 17527 16344 3718 -11652 -6188 -22016 -28929 -14094 -6943 -20694
14708 -20694 -18690 -12094 9278 10791 13931 27057 26868 11493 3100 -2197 14779 -5434 -26804
14695 -26804 -5212 -15907 -31943 -18548 -31681 -35101 -21145 -20384 -22056 -1476 2957 -4440 -17462
14682 -17462 -7243 14839 21104 22549 -8941 -6458 8297 18674 26125 20952 8333 -358 17871
14669 17871 36003 18027 466 -5631 -1396 -1313 3230 17963 7498 -9763 -5538 9481 21807
14656 21807 14965 16314 23657 20261 17379 17476 12496 18890 34132 33183 49442 51333 34361 22764
14642B2764j3925p809N039J3604P155j4786k2458o519N982J3830j193l661K279
14629C02Q606m389R821J7094L692J961k1117j6319j5725M672o295j3858K965L7219
14615H629K7029j6243m0829k8968J3267L4752K4290K3555j7212j8168r18R249
14603A8433N506J1425O36r89j6253r547l429N250L650j210m082j1824p441j5998
14589b5873j1535J9797K1315p571j1136J833M891J5900l107k0850q855J1936K635
14576a0620k991N290m12L1601J4364k6043j4437J446j4335m39n226J1379K3106
14563A2683j151K070k2191J1536J9722k0634J0061J1252j0256N305j1067o942
14551C88K92j5070P385k127m394J8100k098m604J0075k201p261M418M258J3936
$$ plain form
14642 22764 8839 1030 6069 19673 26828 12042 -10416 -16935 -10953 2877 1684 -1977 302
14629 302 8908 4519 14340 31434 35126 37087 15970 -349 -16074 -11402 -17697 -31555 -28590 8629
14615 8629 35658 19415 -21414 -50382 -37115 -2363 21927 45482 28270 10102 9184 18433
14603 18433 23939 35364 36000 35011 18758 9211 5782 11032 14682 13472 9390 -2434 -9875 -25873
14589 -25873 -37408 -17611 3704 -3867 -15003 -13170 -8279 7621 4514 -16336 -25191 -13255 -10620
14576 -10620 -13611 -8321 -8733 22868 37232 11189 -3248 -1802 -16137 -16576 -21802 -10423 12683
14563 12683 11532 13602 -8589 2947 22669 2035 12096 23348 13092 18397 7330 388
14551 388 680 -14390 -7005 -9132 -13526 4574 2476 -2128 7947 5746 -1515 2903 7161 21097
14537B1097J9649j9595l003J5907J1525M829j9243j6458n925k237J922j747K0786
14524B7507p613k4950j4507N754J5055R465Q596Q327q369j5485q6k4558l098J6936
14510g026m769K471N699j2669J2589j0556k1931j4778K1210M3760N153j7556o372
14497d775j1511j1159K841J3779j3885K636O943k300P023P999Q352Q866J817K749
14483A9375j4188j3733K794j72k6318K590K7985P09k0264J4340J9629N747N860
14470B4354j6787l882J8434j2923j2631J5017L216k942m059l769l375P447J0141
14457A8241j5220M656j479q06k696J062n912J578n146m008k3290l061J7311R246
14443i524J5954j7385j6833R133J4665j2147o300p848j1889O537L774n57j2201
$$ plain form
14537 21097 40746 21151 18148 34055 45580 50409 31166 14708 8783 6546 8468 6721 27507
14524 27507 19894 -5056 -19563 -13809 1246 10711 19307 27634 19265 3780 3694 -20864 -23962 -7026
14510 -7026 -11795 -9324 -3625 -16294 -3705 -14261 -36192 -50970 -29760 14000 19153 1597 -4775
14497 -4775 -16286 -27445 -24604 -10825 -24710 -22074 -15131 -17431 -10408 -2409 5943 14809 16626 19375
14483 19375 5187 -8546 -5752 -5924 -32242 -29652 -1667 -958 -21222 -6882 12747 18494 24354
14470 24354 7567 3685 22119 9196 -3435 11582 14798 11856 7797 4028 653 8100 18241
14457 18241 3021 7677 6198 5392 2696 3758 -2154 -576 -5722 -9730 -33020 -36081 -18770 -9524
14443 -9524 6430 -10955 -27788 -18655 -3990 -16137 -22437 -30285 -42174 -35637 -31863 -32420 -44621
14430d4621M597J3118o471l516o590M402J2826Q652N623m864o684j2273K5089
14417a0712J5628k05j876K920o837J4675J5805k1199k3250r783J3084N226J1125
14404D601O690j3073j9235l923Q304l678q662J6821Q831O40L8115R219l6091R340
14390A7899m981j042o000j5329k0673j0369K1588J3711q716N789O586O945j4070
14377h662M701J4471N684k811r623L326n877p806l04k134J3849J1159k713n583
14363G677k4963M085J7254k7185j564K9353J5710K706n35Q43p870k0199R111K2302
14349B6725j931o074M028j2103j082r567K1527J0194r896k1280j428J3917n4k802
14335A0174J090L868j3238M994j11N972J6335j6544R340J1173m884j8079j8642
$$ plain form
14430 -44621 -40024 -26906 -33377 -36893 -43483 -39081 -26255 -17603 -11980 -16844 -23528 -35801 -10712
14417 -10712 4916 4711 2835 5755 -1082 13593 29398 8199 -15051 -24834 -11750 -6524 4601
14404 4601 11291 -1782 -21017 -24940 -16636 -20314 -28976 -12155 -3324 -2684 35431 44650 8559 17899
14390 17899 12918 11876 5876 -9453 -30126 -40495 -18907 -5196 -13912 -8123 -1537 5408 -8662
14377 -8662 -3961 10510 16194 13383 3760 7086 1209 -6597 -6901 -9035 4814 15973 13260 7677
14363 7677 -17286 -13201 4053 -23132 -24696 4657 20367 23073 22538 23381 15511 -4688 4423 26725
14349 26725 24794 18720 22748 10645 9563 -4 21523 31717 21821 541 -887 13030 12976 10174
14335 10174 11264 15132 1894 6888 6777 12749 29084 12540 21880 33053 28169 10090 -8552
14322h552N797P829j0224K0276K9483j136j4780j1084J89J3920K7026J433j5644
14309D4533j9584r481L561k5835j0773J0046J0430j1708n062p010q4L333K7979
14296A0345J9297J489J289j1499L46j957j7925k1594M933R083j8552J4194K4401
14283A3850l653J283j6470k1843J1429J4682q157j2297l431R092K7960J1835k4433
14270a53j1815R38J8443k801P185J3552j7371k1248j5917R897J0125K8732n695
14257A3872l5429p896K1227K2395p693L902n706P181J8941j7581K996k2373L024
14244c140J4861N387J0179l1049l7638j2483o610K0076K2910J6221o848J7941
14232I807K709J8813R120J4443m964j6227k8629J0263J1429k0933K774k190p714
$$ plain form
14322 -8552 -2755 5074 -5150 15126 44609 43473 28693 17609 17798 31718 58744 60177 44533
14309 44533 24949 15468 19029 -6806 -17579 -7533 2897 -8811 -13873 -20883 -20967 -17634 10345
14296 10345 29642 31131 32420 20921 21267 19310 1385 -20209 -15276 -6193 -24745 -10551 13850
14283 13850 10197 11480 -4990 -26833 -15404 -722 -8879 -21176 -24607 -15515 12445 24280 -153
14270 -153 -11968 -11030 7413 4612 11797 25349 7978 -13270 -29187 -19290 -9165 19567 13872
14257 13872 -21557 -29453 -8226 14169 6476 10378 4672 11853 30794 13213 16209 -6164 -3140
14244 -3140 11721 17108 27287 -3762 -41400 -53883 -60493 -40417 -17507 -1286 -8134 9807
14232 9807 12516 31329 40449 54892 49928 33701 5072 15335 26764 5831 8605 6415 -1299
14219a299j1403m842j04J4128O66k0740q433L790J8174l123j4035k2992j846M3516
14205h543K8647J7209j5395j3979k1751l264J7022p904j9313M650Q133K896l827
14192a5419J6271J1676R071j632k2777K996L926k261M947M757J7183J4798j5262
14179B8274j4696l2794Q740K5600O394n286m133K856j5411Q076J5318p462k5953
14166a0477j6631J1140n052P937Q429R389J2318k6712k1943j0231J2241L3340
14154C748K4449k1823j3660N075M799P243J828p223L400J6912K3357k6538j9156
14141B411m497J0543O844p956L070j5354j017m277l963L303J2598J8228j5754
14128D179j0888M500J3505O455o448n953J5359M0657J0339k6411J16p339n492
$$ plain form
14219 -1299 -12702 -17544 -17648 -3520 -2854 -23594 -32027 -28237 -10063 -13186 -27221 -50213 -52059 -8543
14205 -8543 20104 37313 21918 7939 -13812 -17076 -54 -7958 -27271 -22621 -14488 -11592 -15419
14192 -15419 852 12528 21599 19967 -2810 186 4112 1851 6798 11555 28738 43536 28274
14179 28274 13578 -19216 -10476 15124 21518 16232 12099 14955 -456 7620 22938 15476 -10477
14166 -10477 -27108 -15968 -21020 -13083 -4654 4735 17053 -9659 -31602 -41833 -29592 3748
14154 3748 28197 6374 -7286 -2211 2588 9831 11659 4436 7836 24748 48105 21567 2411
14141 2411 -2086 8457 15301 7345 10415 -4939 -5956 -10233 -14196 -10893 1705 19933 4179
14128 4179 -6709 -2209 11296 17751 11303 5350 20709 61366 71705 45294 45410 38071 32579
14115C2579K0522N718O015K518l190j5775j7068Q256J2699q447J235o483k323
14102C6256M905q35j1800j3626R318J0361L694O672o961j1907l628R927M806N330
14088D2512k89p594j1615j9642K0864J2980J904k0451j0586K7570J7087J2524
14076F5264j2045k7804J389j480k0843j3938r649m133J3302O598M014K298J0359
14063A3332N893m394P248r090k3991o720P420Q085n506J005Q93j2299M753n322
14049a8693J4565L3632J1383j7582j2759O372J3865k0106j1917r099n843J1521
14037d661p641K3502m40j0614M803Q917q816l6K4726q161J6867K915j7453j7719
14023F189l764K0848L380o839j1459j2503m628j625k5228L493J3640Q16J1381
$$ plain form
14115 32579 53101 58819 64834 67352 64162 48387 31319 39575 52274 43827 45062 38579 36256
14102 36256 41161 40326 28526 14900 24218 34579 38273 44945 37984 26077 22449 32376 37182 42512
14088 42512 42223 34629 23014 3372 24236 37216 39120 18669 8083 35653 52740 65264
14076 65264 53219 25415 26804 25324 4481 -9457 -19106 -23239 -9937 -3339 675 2973 13332
14063 13332 19225 14831 22079 12989 -11002 -17722 -10302 -2217 -7723 -6718 -5825 -18124 -13371 -18693
14049 -18693 -4128 29504 40887 23305 10546 16918 30783 10677 -1240 -10339 -16182 -4661
14037 -4661 -12302 11200 10760 146 4949 13866 5050 5014 29740 21579 38446 41361 23908 6189
14023 6189 2425 23273 26653 19814 8355 -4148 -8776 -10401 -35629 -32136 -18496 -17680 -6299
14010f299N379k455J424P362j993K307Q634j1311j3622j0205J480k740l413J0326
13996a5126M288O03P128l766M588J2855j98j7896J0165M331K340P089O13L600
13982B0614j5759m25L904k829j118m853N459P725J6452j5716k2878p105N439l333
13968a4423m827L334K4460P601l814j8346n073J1100L290J738R026P524j7716
13955C874j7450k184O55j8737P79j2473O31J1561L1101M594j1580J3662J0159
13942A4592Q480k0562k0649L660O495M394L220k038j1567Q487K0213k062J4313
13929B6976K6178p669k1047j3054k6254J797J3063j4559l857l840p83J6169k197
13916i077P194Q53j4410J7524j3278J6382N108j7152q424J2164k2326K3072J1781
$$ plain form
14010 -6299 -920 -3375 -1951 5411 3418 5725 14359 3048 -10574 -20779 -19299 -22039 -25452 -15126
13996 -15126 -10838 -10235 -3107 -6873 -2285 10570 10372 -7524 2641 6972 9312 16401 17014 20614
13982 20614 4855 4430 8334 5505 4387 -466 4993 12718 29170 13454 -9424 -16529 -11090 -14423
13968 -14423 -19250 -15916 8544 16145 12331 -6015 -11088 12 3302 5040 14066 21590 3874
13955 3874 -13576 -15760 -15105 -33842 -33063 -45536 -44905 -33344 -2243 2351 -9229 4433 14592
13942 14592 23072 2510 -18139 -14479 -7984 -3590 -370 -2408 -13975 -5488 14725 12663 26976
13929 26976 53154 45485 24438 11384 -14870 -13073 -10 -14569 -18426 -22266 -23049 -6880 -9077
13916 -9077 -1883 -1030 -15440 2084 -11194 5188 10296 -6856 -15280 -3116 -25442 -2370 9411
13903I411j3187j6056K175M464j7790j7885P257J2328K2398k323j6076k0212J6629
13890b8867K0104J0018j2416K944L2766K9504q161j0600L508j523l0214k117J7514
13877B2460r626p825O243Q57k0816o255q559p564J8216L982L242j934m731J1965
13863c45P970j4177n685L116R009K923J4246k084M239J102Q954K689k2462o383
13849C112L3804J4824O367r502j1439M927J8562o119o595P554j2444j1280j0987
13836B0784n319j3885o991J8032J8942j167j8835l2772r104O185J2554J7422P835
13823A3681p020j3560L044o11R036K1537n737p919j8895k1706o260J6234R531
13810h645j4186M903J0047o321J6600J0981m777j855l804j8312j3736j2513j3914
$$ plain form
13903 9411 -3776 -19832 -17657 -13193 -30983 -48868 -41611 -29283 -6885 -9208 -25284 -45496 -28867
13890 -28867 -8763 1255 -11161 -8217 24549 54053 45892 35292 38800 37277 7063 4946 22460
13877 22460 12834 5009 11252 12109 -8707 -14962 -23521 -31085 -12869 -8887 -5645 -7579 -12310 -345
13863 -345 7625 -6552 -12237 -9121 -112 2811 17057 14973 19212 20314 29268 31957 9495 3112
13849 3112 36916 51740 58107 48605 37166 42093 60655 54536 47941 55495 43051 31771 20784
13836 20784 15465 1580 -5411 12621 31563 30396 11561 -21211 -30315 -24130 -11576 5846 13681
13823 13681 6661 -6899 -3855 -4466 4570 26107 20370 12451 -6444 -28150 -34410 -18176 -8645
13810 -8645 -22831 -17928 -7881 -14202 2398 13379 8602 6747 2943 -15369 -29105 -41618 -55532
13797e5532J1978K4128O031j869q452J430L645R357j2423J940K0695K1772Q848
13784C1548j7132l3625k744J1437k2805n135L3497K8401M968J6922o279l1197
13772G856p195J0769J5280n639k2826m878m363J2396o74j2649p898J1843R364
13759A386r813j9428J025Q061J8255r436r297j6255J1932j047j3368K699M005
13746c1281J9033J0794q813L645k444J486j3410j4062K1044J2748J3004m198m969
13733B577K8231k2624k0612m165p859M147L423K258K664q429p11J8807K612M262
13719D581r333p986j728K0219K0122R550k9784j0155j7070j8936j2210N201K1812
13706b5717K0356K847J4599o867p03j3056J9725q83j5032k532r823P936K3501
$$ plain form
13797 -55532 -43554 -19426 -13395 -15264 -23716 -22286 -18641 -9284 -21707 -19767 928 22700 31548
13784 31548 14416 -19209 -21953 -10516 -33321 -38456 -4959 23442 28410 45332 39053 7856
13772 7856 661 11430 26710 21071 -1755 -6633 -10996 1400 726 -11923 -19821 -7978 1386
13759 1386 -8427 -27855 -26830 -18769 -514 -9950 -19247 -35502 -23570 -24617 -37985 -35286 -31281
13746 -31281 -12248 -1454 -10267 -6622 -9066 -7580 -20990 -35052 -14008 -1260 11744 7546 2577
13733 2577 30808 8184 -12428 -16593 -24452 -20305 -16882 -14624 -11960 -20389 -21100 -2293 319 4581
13719 4581 -4752 -12738 -14466 5753 25875 35425 5641 -4514 -21584 -40520 -52730 -47529 -25717
13706 -25717 -5361 -2514 12085 5218 4515 -8541 11184 10301 -4731 -7263 -17086 -9150 14351
13693A4351R622J2463L605j5746j8508k7384K1629P89N525K40J470o010p236J6008
13679A0818J2583J281Q297k5054j2503P186J2219r003j1J92n683l726J7082O857
13665B0535Q729j7829o692J1067O13P037k626j4939Q032l3056l3810q464J1319
13652e0084P848k530J6683P881p216J8004J3936p566J9804J3558L131j0276m582
13639A8591N209L774m356l289L457q393p845L710j2177j3611J6326J7998p879
13626A1515n779j2875o746N560J0127N528O776r643j245l688j0370j2412r231
13613c2483J7180J0119P860Q274K330j0136l465R404q964m096K26m416j0573m016
13599b2756K3426N332j7756J266J3739j3735j0243M341J3950P80j7319P134J2456
$$ plain form
13693 14351 23973 36436 40041 24295 5787 -21597 32 821 6346 6586 8056 2046 -5190 10818
13679 10818 23401 24682 32979 7925 -4578 2608 14827 5824 5813 6005 322 -3404 13678 20535
13665 20535 29264 11435 4743 15810 16423 23460 20834 5895 13927 -19129 -52939 -61403 -50084
13652 -50084 -42236 -44766 -28083 -20202 -27418 -9414 4522 -3044 16760 30318 33449 23173 18591
13639 18591 23800 27574 23218 19929 23386 14993 7148 10858 -1319 -14930 1396 19394 11515
13626 11515 5736 -7139 -13885 -8325 1802 7330 14106 4463 3218 -470 -10840 -23252 -32483
13613 -32483 -15303 -5184 2676 10950 13280 3144 -321 9083 119 -3977 -3751 -8167 -18740 -22756
13599 -22756 670 6002 -11754 -10488 3251 -10484 -20727 -16386 -2436 -1656 -18975 -11841 615
13586F15q899J8239J2611k4074L896j1394L279J4337O604n258l540j0537m592
13573h713N807j8376L98K1775J6926n64j9410k8362j7161J6561K0922j163p77
13560a2137J1112J1793j3362l755J2634k2212N269N438Q569J3393J312j8221j4488
13547a4655J0823J2547L994O37m235j9432r299n135J3792k203q429J6865o993
13534a1723J137J1100o326k0554J5164M978q669j21J7769J033k2277m922J6457
13521f954j941P428K545N156J3711j7332K3643R895K408k0648k6202l421K682
13508i030O118j3054m872J5281P154l770q356j1615n663J3729L724m94P054J8307
13494A4513l59j8387j659K3031p315M763O493l6795J236O777j0281j2306O18J4788
$$ plain form
13586 615 -8284 9955 22566 -1508 2388 -9006 -5727 8610 15214 9956 6416 -4121 -8713
13573 -8713 -2906 -21282 -20884 891 17817 17253 -2157 -30519 -47680 -31119 -10197 -11360 -12137
13560 -12137 -1025 10768 -2594 -6349 6285 -15927 -10658 -5220 3349 16742 18054 -167 -14655
13547 -14655 -3832 8715 12709 13346 9111 -10321 -19620 -24755 -10963 -13166 -21595 -4730 -11723
13534 -11723 -10586 514 -5812 -26366 -11202 -6224 -14893 -15014 2755 3788 -18489 -23411 -6954
13521 -6954 -8895 -1467 1078 6234 19945 2613 26256 36151 38559 17911 -8291 -11712 -9030
13508 -9030 -2912 -15966 -20838 -5557 1597 -2173 -10529 -22144 -27807 -14078 -10354 -10848 -3794 14513
13494 14513 14154 -4233 -5892 17139 9824 14587 21080 -15715 -14479 -7702 -17983 -30289 -29671 -14883
13480a4883J9072R717j1739J3252k354J170K838L2010m438k5817p577K2147k74
13467C3124l694j0977j0902j060n478m86P789K2923J106k301l994j5431j9818
13454i199J1582J3347l390k838J3101J1192r398j9987j295m513M008j7402j0526
13441b5318Q792N650j5953P44K1536L471K24j1535j9577Q886K0749O906j0044
13428e469K206j3912J2487J0986J0768j0246j2582J1629N73J6294J1623o162n18
13415B7677k0281P494j8277j9142r679J8138J7146K475O172M558k2389l2903K871
13402c6140R199K795J850J6500O322j5757j038q517R049q17j789M20P789K4224
13388A4090r537l4353j5275K2998J124M952N340j9J804J8433K2626R322k3265
$$ plain form
13480 -14883 4189 13906 2167 15419 13065 14235 17073 49083 44645 18828 11251 33398 33124
13467 33124 29430 18453 7551 6491 1013 527 8316 31239 32345 30044 26050 10619 -9199
13454 -9199 2383 15730 12340 9502 22603 33795 24397 4410 3115 -1398 2610 -14792 -25318
13441 -25318 -16526 -10876 -26829 -26085 -4549 -1078 -854 -12389 -31966 -23080 -2331 4575 -5469
13428 -5469 -3263 -17175 -4688 6298 17066 6820 -5762 5867 6440 22734 34357 28195 27677
13415 27677 7396 14890 -3387 -22529 -32208 -14070 3076 5551 11723 16281 -6108 -39011 -36140
13402 -36140 -26941 -24146 -22296 -5796 526 -15231 -16269 -24786 -15737 -16554 -18343 -17923 -10134 14090
13388 14090 4553 -29800 -45075 -22077 -20953 -16001 -10661 -10680 -8876 9557 32183 41505 18240
13375A8240k3972j06m629k5645k582L6004K9711j3139O879l899k2245K065R931
13362F613p036j7268Q158k9763o166K0959o78k935Q961Q999k684J3650L52j9936
13348a8774j632Q26j0834K6377J253j4996J4939k261j11J2245J384K023O763N413
13334B2615p881n777K81j7831j4512L813K1316J1207K394j2796j8556J8078J0930
13321A3281J403M091j7114j7628J6271J7456J0290q000l291q393l6200R194J9462
13308H22q172j113l223j8077m815N063j12J3321k728j7351J6237K7343L665J897
13294A2757m460J8606r419j4466J996N971J683l579k1564M836P25J1955K585j966
13280E660q881J823p482J1406J1666k2389k985n68q327L78P276J8008R998k0407
$$ plain form
13375 18240 -5732 -5838 -10467 -36112 -38694 -2690 27021 13882 20761 16862 -5383 -3318 6613
13362 6613 -423 -17691 -9533 -39296 -45462 -24503 -25181 -28116 -19155 -10156 -12840 810 1162 -18774
13348 -18774 -20406 -19580 -30414 -4037 -2784 -17780 -2841 -5102 -5213 7032 8416 10439 17202 22615
13334 22615 14734 8957 9238 -8593 -23105 -19292 2024 13231 15625 2829 -15727 2351 13281
13321 13281 14684 18775 1661 -15967 304 17760 28050 20050 16759 8366 -27834 -18640 822
13308 822 -7350 -8463 -11686 -29763 -34578 -29515 -29627 -16306 -19034 -36385 -20148 7195 10860 12757
13294 12757 8297 26903 17484 3018 5014 10985 12668 9089 -12475 -7639 -6914 5041 7626 5660
13280 5660 -3221 -1398 -8880 2526 14192 -8197 -11182 -11750 -20077 -19699 -12423 5585 15583 -4824
13266d824q508l329K920K116L093J5028P932J4485k5152j7813J1433k259K004
13253b874J7299O110Q88j7086j8507k49M860O574k507l459M375k2374j0637J260
13239c6327J1925J3253K1430J8088r448j8388j947J688o879m503M298q45j9164
13226b6819O123K3313J5122N41Q356K4280p637j8551r287o564j2385K908q966
13213i566j1269J1076J2787n92J643k821J2513n667j2900r987j1975J327K8123
13200B692R858j8550J1632O167J7294J1363j3189j3171J070j3102j3816M718m89
13187g523n822K797L591o544j2692j7870m282J3004L1355L812j5448K0831P14
13174E923L471l409m426j831N041q624j3975m819q379j7075J0630K5997J3708
$$ plain form
13266 -4824 -13332 -16661 -13741 -11625 -8532 6496 14428 28913 3761 -14052 -2619 -4878 -2874
13253 -2874 14425 20535 21423 4337 -14170 -14419 -9559 -2985 -5492 -8951 -4576 -26950 -37587 -36327
13239 -36327 -24402 -11149 10281 28369 18921 533 -1414 274 -6605 -11108 -6810 -7655 -26819
13226 -26819 -20696 2617 17739 18280 26636 50916 43279 24728 15441 8877 -3508 -600 -9566
13213 -9566 -20835 -9759 3028 2436 4079 1258 13771 8104 -4796 -14783 -26758 -25431 2692
13200 2692 12550 -6000 5632 11799 29093 40456 27267 14096 15166 2064 -11752 -7034 -7523
13187 -7523 -13345 -10548 -6957 -13501 -26193 -44063 -48345 -35341 -3986 -174 -15622 5209 5923
13174 5923 9394 5985 1559 -272 4769 -3855 -17830 -22649 -31028 -48103 -37473 -11476 2232
13161B232L617n044j9015l344J710J2701q091n832J7135R327Q643K976M913p063
13147A4865q207J020L413J4261o366j5350j136Q347J830k4002j3724J2661n756
13134a8144N378j0938M18j3731n986K1163K8538J14j0649Q830L024m049j5372
13121a1404j479j424j899N629K957p746j475K6940J3618o180M401p750j8660j3521
13107a7993m448Q250J6299p438J7766j3022l685m382q424j3351J2513K624N110
13094a0181K7657P082R37J9008j0231l1423J5608J4876O609J563R886N175k3263
13081C3303k8926m250n932J1690M482j9376J6921K1485J3413j9053k7240J618
13069a865O159o381o789J6749K2113m333j3827n94l572r209k7794m524J7133J523
$$ plain form
13161 2232 5849 805 -18210 -21554 -19844 -7143 -15234 -21066 -3931 5396 14039 17015 21928 14865
13147 14865 6658 7678 11091 25352 18986 3636 2500 10847 12677 -11325 -25049 -12388 -18144
13134 -18144 -12766 -23704 -23286 -37017 -43003 -21840 6698 6812 -3837 4993 8017 3968 -11404
13121 -11404 -12883 -14307 -16206 -10577 -7620 -15366 -16841 10099 23717 17537 21938 14188 -4472 -17993
13107 -17993 -22441 -14191 2108 -5330 12436 -586 -4271 -8653 -17077 -30428 -17915 -15291 -10181
13094 -10181 17476 24558 25495 44503 34272 2849 18457 33333 39942 41505 51391 56566 33303
13081 33303 4377 127 -5805 5885 10367 -9009 7912 29397 42810 23757 -3483 -1865
13069 -1865 4294 -2087 -8876 7873 29986 25653 11826 11232 7660 -1549 -29343 -33867 -16734 -15211
13055a5211o198j010N567j651J0294Q852M669p994k0211l220O78J5851J4791l3028
13041b7821R354K6615K8567j390k4799r0P971j600k3543M440K1618J5641p784
13028B7179m1158J31K1333m292m416Q937j3110m707K212P93m284J5496Q259J5562
13014B7935m258j3394j0978J1219K1522J3091k03j4577j357N956j2770k6188Q42
13001c160K0283J8207K195L640n230P25l993O067j2281k7504k3668p056K7401
12988d374J5461r924k0470p871J0301K3915R242J4416n987p836k9415R639P166
12975D263p725o160k1038o558L4311K9185l0k94k3219j7253P613J2546K386q721
12961f94Q998n725J237K957J1939R634j8765n351J416p059k256J2086l011k0112
$$ plain form
13055 -15211 -21409 -22419 -16852 -18503 -8209 643 5312 -2682 -22893 -26113 -25435 -9584 5207 -27821
13041 -27821 -18467 8148 36715 35325 10526 10436 18407 16807 -6736 -2296 19322 34963 27179
13028 27179 -13979 -13848 7485 3193 -1223 7714 -5396 -10103 -7891 -7098 -11382 4114 12373 27935
13014 27935 23677 10283 -695 10524 32046 45137 44934 30357 29000 34956 22186 -4002 -3160
13001 -3160 17123 35330 37525 41165 35935 36660 32667 38734 26453 -1051 -24719 -31775 -4374
12988 -4374 11087 1163 -19307 -27178 -16877 7038 16280 30696 24709 16873 -12542 -2903 4263
12975 4263 -3462 -9622 -30660 -37218 -2907 26278 26248 25954 2735 -14518 -6905 5641 8027 -694
12961 -694 8304 2579 3816 6773 18712 28346 9581 4230 5646 -1413 -3669 8417 5406 -14706
12947a4706j3489K6876J7602K930q458m258n071l557J793J6089Q021r013Q73l508
12933A2124q381k0899R351K0372Q517J6116J3509J3153m2793L79J2251p532K4463
12920E0630k662j1379K609j8150j3882k473J216j0579k586K1661K340n615q177
12907B953j5221j9939O140L8860L388j952p867l437K271P49j9313m483L548J8302
12893C999J7890o26k2023j4662K3189J8589r885j5571K134L386n990r083J5599
12880F946N914L345J1069k435j470p031l125j4023m806L203q403l412J4913J4717
12866A5402n960R384M152J0j4545j9038P621l523k7175m025K4709P763J6192J0127
12852B1094J187n949j7333m707m722p83k765j926K318p254j5351J1067J5647L757
$$ plain form
12947 -14706 -28195 -1319 16283 19213 10755 6497 1426 -2131 -338 15751 23772 14759 15632 12124
12933 12124 3743 -17156 -7805 12567 21084 37200 50709 63862 21069 21448 33699 26167 50630
12920 50630 47968 36589 39198 21048 7166 4693 5909 -4670 -7256 14405 16745 11130 2953
12907 2953 -12268 -32207 -26067 12793 16181 14229 6362 2925 5196 5945 -13368 -17851 -14303 3999
12893 3999 21889 21263 -760 -15422 7767 26356 16471 900 3034 6420 430 -8653 6946
12880 6946 12860 16205 27274 24839 23369 16338 13213 -810 -5616 -2413 -10816 -14228 685 15402
12866 15402 9442 18826 22978 22988 8443 -10595 -2974 -6497 -33672 -37697 -12988 -5225 10967 21094
12852 21094 22281 16332 -1001 -5708 -10430 -11213 -13978 -15904 -13586 -20840 -36191 -25124 -9477 -5720
12838e720J8458K3297r749j2941j2116j5853j4262K2850P352k3010k8427J247
12826d8874J5632Q037R17K277k325J1750J1558J3980P011Q756j3491j3213j0877
12813h862Q263J4214M133J0033j8159j4727J433K997J769L235L576m625j2586
12800i306P767O788J2840O381R61l4501k7706j4705J1547K2194J6665P88j3881
12787a4168j6787J5517J035j786L770l566J1666K0866p22q591K7483P242k0808
12774B1151l628j0616j0325j2372j6251n585M210M850P859J5322j0839j304j4077
12761c1605K212R526K0135p646M222O525k893k0349m878J7126K7112Q923L241
12748C1651J0533k467k3761j2801J5224K716k1498k1963K0098m170m332k8280
$$ plain form
12838 -5720 12738 36035 26286 13345 1229 -14624 -28886 -6036 1316 -21694 -50121 -48874
12826 -48874 -33242 -25205 -24288 -22011 -24336 -12586 -1028 12952 19963 28719 15228 2015 -8862
12813 -8862 -599 13615 17748 27781 9622 -5105 -3672 -675 1094 4329 7905 3280 -9306
12800 -9306 -1539 5249 18089 24470 25431 -9070 -36776 -51481 -39934 -17740 -1075 -287 -14168
12787 -14168 -30955 -15438 -14403 -16189 -12419 -15985 -4319 16547 15825 7234 34717 41959 21151
12774 21151 17523 6907 -3418 -15790 -32041 -37626 -33416 -28566 -20707 -5385 -16224 -17528 -31605
12761 -31605 -29393 -19867 268 -7378 -3156 3369 476 -19873 -24751 -7625 19487 28410 31651
12748 31651 42184 39717 15956 3155 18379 21095 -403 -22366 -2268 -6438 -10770 -39050
12736c9050r247J2831j1064M811K8336J3385j554m075L290N1l387L1666K9087
12723E5080m77j3770m0362k3261r413M762l008K7812K2593O400L2230q391k0264
12710B9931k0428j2263L482K0886q101j393j2886M651k3569k1995O666j5300J2983
12697c7336J1035J4423J0492n885L916q117o85J6288J9216j877j6608q920j0906
12684a4964R657K7635K1539n715j4575k1888k6104L98K3430J5693K42j361N047
12671A9034m469o744j6795k839J0021j4195P520K6769J3016j1933l692p857j4817
12658f981J913m96K928J0549O496o683K301p736L520K988m876k0807p511K4666
12644B71P350r268j2497j7715L953J7784J9920j0533j5595l80M017p620J1920
$$ plain form
12736 -39050 -48297 -35466 -46530 -41719 -13383 2 -1552 -5627 -2337 -2286 -5673 25993 55080
12723 55080 54603 40833 471 -22790 -32203 -27441 -30449 -2637 19956 26356 58586 50195 29931
12710 29931 9503 -2760 722 21608 13507 12114 -772 3879 -19690 -41685 -35019 -50319 -37336
12697 -37336 -26301 -11878 -1386 -7271 -3355 -11472 -12157 4131 23347 21470 4862 -4058 -14964
12684 -14964 -5307 22328 43867 38152 23577 1689 -24415 -24017 -587 15106 15348 13987 19034
12671 19034 14565 7821 -8974 -11813 -1792 -15987 -8467 18302 31318 19385 15693 7836 -6981
12658 -6981 -5068 -5564 -2636 7913 14409 7726 10027 2291 5811 8799 3923 -16884 -24395 271
12644 271 7621 -1647 -14144 -31859 -27906 -10122 9798 -735 -16330 -16710 -12693 -20313 -8393
12631h393K5184K395k3364j2910J1000M846j3791Q317J6679j4139J5992j1189
12619F27j068O217j6819M473m290k2555l92K1797P284K1213n236o753p388j7733
12605b0623j4622N544K1590O010M912p2k0906j6330r359l187j1229K3942j7220
12592e1550J8238K4249Q672M051M556j1880n964J7892J8669q640k2530N320k0658
12579a9575n043N396O769J1955K8245j2414J0822P54m001L58J6127J1035k420
12566D8008o720k2608q496M703J413p297L145j0739j176j296m738j1673J732j1454
12552b7196p717L902M352J244j0424K4788J051j256K1146J5764O38P62j9982J956
12538I028M20o392k653j1592J03Q600n001J5465p913l1523l779J2296N87J8281
$$ plain form
12631 -8393 16791 19186 -4178 -17088 -6088 -1242 -15033 -6716 9963 -4176 11816 627
12619 627 -441 5776 -11043 -6570 -10860 -33415 -33807 -12010 -4726 16487 11251 4498 -2890 -20623
12605 -20623 -35245 -29701 -8111 -2101 2811 2739 -18167 -34497 -43856 -47043 -58272 -34330 -51550
12592 -51550 -33312 -9063 -391 3660 8216 -3664 -9628 8264 26933 18293 -4237 1083 -19575
12579 -19575 -24618 -19222 -12453 -498 27747 15333 26155 26909 22908 23266 39393 50428 48008
12566 48008 41288 18680 10184 14887 16300 9003 12148 1409 233 -1063 -5801 -17474 -15742 -27196
12552 -27196 -34913 -31011 -26659 -25415 -35839 -11051 -10000 -11256 9890 25654 26292 27054 7072 9028
12538 9028 9448 3056 403 -11189 -11086 -2486 -7487 7978 65 -31458 -35237 -22941 -22354 -4073
12524d073M316n634k4527K184J0585J5846l853J1016R351j7216l3632j7977J3966
12511c9648J4785j2319j532J9049K1659J6550M45l617N559J565m847J3875j0878
12498B0646m516Q047m608n532o456j725K993M418M784q274J4600M48k5650n755
12484f580R587J1660K081o932M843q068j0291r704J1777Q893J0728J5021J662
12471C4677k5820J693k049j3119M402P921J5404J0979j3462j3160j9704Q744J0629
12458G135q973K173L087J2657J2766m574L813O093O256L965K546j8954k7053p607
12444f670J7914L0117p245j5872m579j2792n455j6193Q269J6943N511k019M025
12431A1954k5348Q076K9171L696R162k6919k0510K1601J5247m458p249O124r532
$$ plain form
12524 -4073 243 -5391 -29918 -27734 -17149 -1303 -5156 5860 15211 -2005 -35637 -53614 -39648
12511 -39648 -24863 -37182 -38714 -19665 1994 18544 18989 15372 20931 22496 17649 31524 20646
12498 20646 16130 24177 19569 14037 7581 5856 8849 13267 18051 9777 24377 24825 -825 -6580
12484 -6580 3007 14667 16748 9816 14659 6591 -3700 -13404 -1627 7266 17994 33015 34677
12471 34677 8857 10550 8501 -4618 -216 7705 23109 34088 20626 7466 -12238 -3494 7135
12458 7135 -1838 335 3422 16079 28845 24271 28084 34177 40433 44398 46944 27990 937 -6670
12444 -6670 11244 41361 34116 18244 13665 873 -4582 -20775 -12506 4437 9948 7929 11954
12431 11954 -13394 -5318 23853 27549 36711 9792 -10718 10883 26130 21672 14423 20547 11015
12418A1015J9743q267j3371K1417J7849l489o626j8423j3776o79j5445j7215J6829
12405a0438J6574J4422j0347j2792j5776m953J7534J4445o416j0770M139L0954
12393B6576L45k690j5770n390k3104J63q02j984J71L565P661q648K767J1011J4907
12378H778P000O318k2795l01J4145j760k3266j7510N396J8272K8786n728j9243
12365a908o242r935k429j949j663J6191m984J3070N222j19q029j1066M093j1531
12351b1279j816P10J6016j0037K22k85Q023J8637R876m682N435j7446m652J5911
12337A4633j6113j4446J8406k945j244P599j8885k4842J3117L8734m901p344J2416
12324A4185p677R740J408l0391N246n33N62m040j7932K994J1719p883k3440k834
$$ plain form
12418 11015 30758 22491 9120 30537 48386 44897 38271 19848 6072 5393 -10052 -27267 -10438
12405 -10438 6136 20558 10211 -2581 -18357 -23310 -5776 8669 2253 -8517 -4378 26576
12393 26576 26921 24231 8461 3071 -20033 -19870 -20672 -22656 -22485 -18920 -11259 -19907 -17140 -6129 8778
12378 8778 15778 22096 -699 -1000 13145 11385 -11881 -29391 -23995 -5723 23063 17335 -1908
12365 -1908 -8150 -18085 -20514 -22463 -24126 -7935 -12919 151 5373 5254 -2775 -13841 -9748 -21279
12351 -21279 -23095 -22385 -6369 -16406 -16184 -16469 -8446 10191 20067 15385 20820 3374 -1278 14633
12337 14633 -1480 -15926 2480 -465 -1709 5890 -12995 -37837 -24720 14014 9113 1769 14185
12324 14185 6508 16248 17656 -12735 -7489 -8022 -7460 -11500 -29432 -26438 -14719 -22602 -46042 -48876
12310d8876j0410J6886J5367J1526K9221J3852j3743j9897j9538J0622J0388L198
12298a404K269l6160L039J6559J2719J0949j5126n361Q553k575l691J3222j1976
12285h983k339L044J4766N162k6291J3380J5874R686j9447r610J4609k253J173
12272H771N642K701m4928j2071L0150J6099j325N326l387k338j7640k9135NK9979
12258a2151J3940M908R482O788L39o335J432j0657p951J6235Q359p477j0162O94
12244G444m555K0134Q62j5615j259m19J902M492J0640N643p408j1900K091r799
12230B253j3998K5495P710l5019j0859O251j6296j3166J6814k287J3596j2302
12218c1808j5112J545J2590L5678K265j2407J1301J7602L699j3730k1678l670
$$ plain form
12310 -48876 -59286 -42400 -27033 -15507 13714 27566 13823 -6074 -25612 -14990 -4602 -1404
12298 -1404 865 -35295 -32256 -15697 -2978 7971 -7155 -12516 -3963 -6538 -10229 2993 -8983
12285 -8983 -11322 -8278 6488 11650 -14641 -1261 14613 24299 4852 -4758 9851 7598 8771
12272 8771 14413 17114 -27814 -39885 -9735 6364 5039 10365 6978 4640 -13000 -42135 -42130 -12151
12258 -12151 1789 6697 16179 22967 23306 16971 18403 7746 -205 16030 24389 16912 6750 7444
12244 7444 2889 23023 23885 8270 7011 6592 8494 12986 23626 29269 21861 9961 12052 2253
12230 2253 -11745 13750 21460 -13559 -24418 -18167 -34463 -47629 -30815 -33102 -19506 -31808
12218 -31808 -46920 -45375 -32785 2893 5158 -7249 4052 21654 25353 11623 -10055 -13725
12206a3725K550J5135j5104K00k7275O25J4592L643kK8305q443l747n892O424
12192b714J3651l253l766J3804J2080j2784n158O412O14m249J3024N021q448k7219
12178b985j8487R108K8956L1693K7370K0594j0932l0745l8251l4074q882J6313
12166a0322K1201j6896o875J1026J8689k374j5137n352l055O317J5512j1677j1430
12153a0373P664N249J275L460l696j2493J9689J8083j7993k6654J509J4549Q054
12140H323J2063j691j057J5950n58j2836m174K1928J2794J2472K4287O6459K8627
12127A82587k5702n1852m6537o315k4532q462J1782J9465k271m920k589M704j2879
12114C2479J0536J5211j9191k8348M610J1721j8367n273O649j627j1010L066J1633
$$ plain form
12206 -13725 -11175 3960 -11144 -10944 -38219 -37594 -23002 -19359 -19361 8944 501 -3246 -9138 -2714
12192 -2714 10937 7684 3918 17722 29802 17018 11860 18272 18886 14637 27661 32682 24234 -2985
12178 -2985 -21472 -12364 16592 48285 75655 96249 85317 54572 16321 -17753 -26635 -10322
12166 -10322 10879 -6017 -12892 -1866 16823 14449 -688 -6040 -9095 -2778 12734 1057 -10373
12153 -10373 -2709 2540 3815 7275 3579 -8914 10775 28858 10865 -15789 -14280 269 8323
12140 8323 20386 18695 17638 33588 33030 20194 16020 37948 50742 63214 87501 153960 182587
12127 182587 156885 105033 58496 52181 27649 19187 30969 50434 48163 43243 40654 45358 32479
12114 32479 43015 58226 39035 10687 15297 27018 8651 3378 10027 8400 -2610 456 12089
12101A2089j8550o084j9207o018J7162K0407L092j8452o925p728P957L1090J0775
12088A9608L169P564L9970N0362N9386K1360l8458n4786n5738k6157k0883j2726
12076g329J6922K2415m774m357o097o09j6282r229P681j7953q983M372J4828J4433
12062E038k099p791n607J9204m322K108K6409j1235p210J70M001J1691j2376M737
12048B2718n78j5954j4728P529O238L9435L7064N6q073K637l456j9301j4314M068
12034D3341j1096k6749j3467M087P720M15K692J6228J2259l514l224K1136K014
12021E1842k3440k1586l492k0909n275k64j061p73J4553n475K273J0472J2728
12008I593q29J450J8160k764j3733n229j7842k581N655Q026J0552Q204K024k3418
$$ plain form
12101 12089 -6461 -12545 -31752 -37770 -20608 -201 2891 -15561 -22486 -30214 -22257 8833 19608
12088 19608 22777 30341 70311 120673 180059 201419 162961 108175 52437 26280 5397 -7329
12076 -7329 9593 32008 27234 22877 16780 16171 -111 -9340 -1659 -19612 -28595 -24223 -9395 5038
12062 5038 2939 -4852 -10459 8745 4423 6531 32940 21705 14495 14665 18666 30357 17981 22718
12048 22718 22140 6186 -8542 -1013 5225 44660 81724 81780 73707 76344 72888 53587 39273 43341
12034 43341 32245 5496 -7971 -3884 3836 4251 6943 23171 35430 31916 28692 49828 51842
12021 51842 28402 6816 3324 -17585 -22860 -23124 -24185 -24958 -10405 -15880 -13607 -3135 9593
12008 9593 8764 10214 28374 25610 11877 6648 -11194 -13775 -8120 -94 10458 18662 20686 -2732
11994b732r467p453J0655K052J4742o278J558j0378p852J9208O407k427k2231
11981a4196J747J3239J4482k906j2816O114p147k5358k074J9056J8900m039j1750
11968f748j763j6128P394M408K1580O925l635M568j3543M437J5197j2674n218
11955D800l385J206M354J3745j50j3754r833n019J6300J3499q24j7484q582J0873
11941E746J4211r688P065k978k6021j9002K210L2329L097Q129L440J3079q496
11928B3121k615j4330p694N693R031Q851J3023j7061n190j2318j1876Q906O72
11915a787J0001M22l210k0004O81K9071r113k24K2441J9464P671j3897k3935J585
11901A9166N809l681k49j0357j1409M789N963k7700j9317N024J0455q876J519
$$ plain form
11994 -2732 -12199 -19652 -8997 -6945 7797 1519 3077 -7301 -15153 4055 10462 8035 -14196
11981 -14196 -12449 790 15272 12366 -450 5664 -1483 -26841 -28915 -9859 9041 5002 -6748
11968 -6748 -8511 -24639 -17245 -12837 8743 15668 12033 16601 3058 7495 22692 10018 4800
11955 4800 1415 2621 6975 20720 20570 6816 -3017 -8036 8264 21763 20939 3455 -5127 5746
11941 5746 19957 10269 17334 14356 -11665 -30667 -28457 3872 6969 15098 18538 31617 23121
11928 23121 20506 6176 -1518 4175 13206 22057 35080 18019 12829 511 -11365 -2459 -1787
11915 -1787 8214 8636 5426 -14578 -13897 15174 6061 5837 28278 47742 55413 41516 17581 19166
11901 19166 24975 21294 21045 10688 -721 4068 10031 -17669 -36986 -31962 -21507 -30383 -28864
11888b8864p637J1572M546k509J4000o554j0533K1016J2102o300j9043j5454J3238
11875b0420j4383J476J2784K28k6473O036R570M438O452j8009O481K0821o380
11862a7379K0514O956j6570k3346K301J0948J0408n093O688O379j5802k09K1496
11849G291J8706r702j6709m690L795J1204Q415K037m24j5117N924J505m897Q726
11835A6064P764q971j678p306m072k3669N579j1563l037K3805J142n734K878J556
11821g242j2666K2910Q711P93j1495m632q270k547J3397K5947j5145J346m264
11808F843j5573o710r386M774j7283J1897O994l724N577L009J7497p389N124j967
11794c17N862N067R946k409p102k4153R539l933n284J9794k90k2946j8376Q087
$$ plain form
11888 -28864 -36501 -24929 -20383 -22892 -8892 -15446 -25979 -4963 7139 839 -18204 -33658 -20420
11875 -20420 -34803 -33327 -20543 -20315 -46788 -40752 -31182 -26744 -20292 -38301 -31820 -10999 -17379
11862 -17379 3135 10091 -6479 -29825 -27524 -16576 -6168 -11261 -4573 1806 -13996 -14205 7291
11849 7291 25997 16295 -414 -5104 -1309 9895 18310 20347 19923 4806 10730 12235 7338 16064
11835 16064 23828 14857 13179 5873 1801 -21868 -16289 -27852 -30889 -7084 -5942 -11676 -8798 -7242
11821 -7242 -19908 3002 11713 12506 1011 -3621 -11891 -14438 -1041 24906 9761 11107 6843
11808 6843 -8730 -15440 -24826 -20052 -37335 -25438 -18444 -22168 -16591 -13582 3915 -3474 1650 -317
11794 -317 5545 10612 20558 18149 11047 -13106 -3567 -7500 -12784 7010 6720 -16226 -34602 -26515
11780b6515L6426O931j6766r115J199J434j0224o76P667J1282J6365K039l130
11767A6917L147O233j0848k2390N058K861J1716K4570M524j1140j9130j197K1070
11754C1391M570J849j5116k0146r848k3171K7022J0410q120J6789K4791o426k1876
11741A2119j2855o227k854K403J8278P060J7557j2404j2195j4912M622k024K761
11728A329j613p700l491J1222J501j7475J6420J0244j5644k600J7330p19j1652
11715b848M180K2353j5656k6655p338K0152K5901j1576k5061J9580J5503L281
11703B1816N446R888N624l607j291k0357r458l90j9913L174j3422R336Q700n1
11689d505L536J7890J4675j6026J057j1808k5571p868K1838M4167O597k5690k9506
$$ plain form
11780 -26515 9911 16842 76 -9039 -7840 -6406 -16630 -17306 -9639 1643 18008 20047 16917
11767 16917 20064 26297 15449 -6941 -1883 978 12694 37264 41788 30648 11518 10321 31391
11754 31391 35961 37810 22694 2548 -7300 -30471 -3449 6961 -1159 15630 40421 33995 12119
11741 12119 -736 -6963 -9817 -7414 10864 17924 35481 23077 10882 -4030 592 -1432 1329
11728 1329 -284 -7984 -11475 -253 1248 -16227 193 10437 -5207 -7807 9523 8804 -2848
11715 -2848 1332 23685 8029 -18626 -25964 -5812 20089 8513 -16548 3032 18535 21816
11703 21816 27262 37150 42774 39167 37876 17519 8061 7671 -12242 -9068 -22490 -13154 -4454 -4505
11689 -4505 -969 16921 31596 15570 16627 4819 -20752 -28620 -6782 37385 43982 18292 -11214
11676a1214N498O611r843P514R033k456L571p308j066Q635L000k311m010j5056
11662i402J1564o995J439J5171M207n82k1637j1240K0727k510k3483j0882J0866
11649b2757K6977j5294q313k96k276J2175N165j4969q979L1223K0101m63P598
11636B9892q151J0k0778M963j2564p312R114k1166n052Q244O472l391O707j5735
11622b8747j8580J5510K8281K535j163j0317P77Q555l696J2094J0675J1071k6364
11609F31k4681O914R659K2414K45j8814Q463O978j6017K4675o16l9106j3020J8076
11595a4199K2145J2457n134J1856j1718j3541k108J485O615J5190K95K541j3440
11582A2444r466J0365q232j1489Q65J2997J9005J2945j8022j8129J032k390k986
$$ plain form
11676 -11214 -5716 895 -8948 -1434 7599 5143 8714 1406 340 8975 11975 9664 5654 -9402
11662 -9402 2162 -4833 -3394 11777 15984 15402 -6235 -17475 3252 742 -22741 -33623 -22757
11649 -22757 4220 -11074 -19387 -19683 -21959 -9784 -4619 -19588 -28567 2656 22757 22294 29892
11636 29892 21741 21751 973 5936 -6628 -13940 -4826 -25992 -31044 -22800 -16328 -19719 -13012 -28747
11622 -28747 -47327 -31817 -3536 -1001 -2164 -12481 -11704 -3149 -6845 5249 15924 26995 631
11609 631 -24050 -17136 -7477 14937 15182 -3632 4831 11809 -4208 20467 19851 -19255 -32275 -14199
11595 -14199 7946 20403 15269 27125 15407 1866 -242 1243 7858 23048 23343 25884 12444
11582 12444 2978 13343 5111 -6378 -5513 7484 26489 39434 21412 3283 4315 1925 -1061
11569a061j5711k0003j1786J4655N950j1414J8022J1344n733Q213K270J3606J381
11556I733j2869l447J5331N990j3793o869o075J638K9195J0409j7751O156P259
11543B4907J015j5861k148O74j889n459j372P736k551O703O352r604J81n626l074
11528a6j0032N4K3913J4147N695j1219K836m775J0613k447r901q298j6550J099
11514d881r15p409Q53J6240n533N864L1130j5092j6656J2046J7442j2297J0854
11501C1646l993j1020P80m450J9069P202K4185l4724k3616Q345P442j3567P558
11488A4857O944J4769j8341k0574P642K4304n544l8993j1125m972Q233K1083J2880
11475A1163k280K0877o548k3783K9K4609M500j8419l3989J0923J8737M852m0807
$$ plain form
11569 -1061 -16772 -36775 -48561 -33906 -27956 -39370 -21348 -10004 -15737 -7524 -5254 8352 9733
11556 9733 -3136 -6583 8748 14738 945 -5924 -11999 -10361 18834 29243 11492 17648 24907
11543 24907 25922 10061 7913 8587 6698 1239 -133 7603 5052 11755 18107 8503 8684 3058 -16
11528 -16 -10048 -9994 13919 28066 33761 22542 25378 20603 31216 28769 18868 10570 -5980 -4881
11514 -4881 -5796 -13205 -12352 3888 -1645 4219 35349 20257 3601 15647 33089 20792 31646
11501 31646 27653 16633 17413 12963 32032 39234 63419 28695 5079 13424 20866 7299 14857
11488 14857 21801 36570 18229 -2345 5297 29601 24057 -14936 -26061 -31033 -22800 -1717 11163
11475 11163 8883 29760 23212 -571 -542 24067 28567 10148 -23841 -12918 5819 10671 -30136
11462c0136p18J5689q693j3709L4838K2985L703L105K256R137R723n613k2131
11449B0436q885K5433N785k248n44l936J2881K2997L6844R331q338r24L9585K8267
11435A76684N0005R7916J88529L12485N05146O78180M11950k93676o51619n37436
11425I38164l21148j93712j01437o2945m7974n6584k6989j4242q656k9049o604
11414F8824M275J5701K2490p426k9596j730J1026j4492J508K1869j1323l0505
11402E0621l0833K2879K121k01q700j8230k8528j4441J4405J4502R331K2905J6032
11389E1863k211j1270j0519l299k973M33p240k6780n88J1794P084O562R407P485
11375B9748j0252L889R371j7699p830J0372J0421j993N517J3081L44p504j1163
$$ plain form
11462 -30136 -30854 -15165 -23858 -37567 -2729 20256 23959 27064 29320 38457 48180 42567 20436
11449 20436 11551 36984 42769 40521 39977 36041 48922 71919 108763 118094 109756 108832 148417 176684
11435 176684 226689 324605 513134 825619 1330765 2008945 2420895 2127219 1475600 938164
11425 938164 617016 423304 321867 258922 210948 154364 127375 113133 104477 75428 68824
11414 68824 73099 88800 111290 103864 74268 72538 83564 69072 70580 92449 81126 50621
11402 50621 19788 42667 44788 44587 35887 17657 -10871 -25312 -10907 3595 12926 35831 51863
11389 51863 49652 38382 27863 24564 21591 22024 14784 -11996 -12584 -790 6294 12856 22263 29748
11375 29748 19496 23385 32756 15057 7227 17599 28020 26027 31544 44625 44969 37465 26302
11362B6302j2707q522J0840j1558q906n542M468R742o747n834r720p409r819J3496
11348b1916J4677j408Q486N603M499o863j5464R870j0388l199N143N706oj6306
11334b1566j033O142k7602o008J2360m549N731j487O365J7630l745n574K6923
11321C587J6524j6387J0691L752M165K6032l448n689R068K7237L680J4334m977
11308H8569K0105l41k7848j7371p096l532J307p022j1103q16N766K0331k752l0076
11294B8121P413K2279Q333l810l3327j7488J986K4273J1748l1686m590J5767J0678
11281C9697K043j7937O486L3985M3346N0758M0236P7236N4936J5226k7971o4479
11269B53562q5744o5166k1652k888j4759j8151j714M392J233L083K709j52o444
$$ plain form
11362 26302 13595 5073 15913 4355 -4551 -10093 -5625 4117 -2630 -8464 -18184 -25593 -35412 -21916
11348 -21916 -7239 -8647 -161 5442 9941 3078 -12386 -2516 -12904 -16103 -10960 -5254 -5260 -21566
11334 -21566 -22599 -16457 -44059 -50067 -37707 -42256 -36525 -38012 -31647 -14017 -17762 -23336 3587
11321 3587 20111 3724 14415 18167 22332 48364 44916 39227 48295 75532 79212 93546 88569
11308 88569 108674 108333 80485 63114 56018 52486 53793 46771 35668 34852 40618 60949 58197 28121
11294 28121 35534 57813 66146 62336 29009 11521 13507 37780 49528 17842 13252 29019 39697
11281 39697 41740 23803 30289 64274 107620 158378 198614 275850 330786 346012 318041 253562
11269 253562 167818 102652 81000 78112 63353 45202 43488 47880 49113 52196 54905 54753 48309
11256D8309o046k9674p130M981Q494n908J1286J1936j3100j6057J6539j6499j2319
11243e188J965M349J5158P228p989P163J3726M65Q473q065l136P978J2250k670
11229E1707j396k0296o257J3443J7026J9874j618k1896j4218j5257J134J5604
11217C7850p324L121n089M875K7748L323j6370k3458j8379m1543m3464n6672q4136
11204b19518l443N7122O0010L2318J2116J5970M3742L9170K0356Q883J1251K1351
11192I9328o72k077k726J2110L523r88K2846j9653o1084j2423o850j753P450j645
11178C5386J1582L4575K0358j6804n700o561p738p74j428N416P725j3025j4993
11165D8019r250R960J9312J9442J357K436L2449P683O987K9291J7987O938K2642
$$ plain form
11256 48309 42263 12589 5459 10440 18934 13026 24312 36248 23148 7091 23630 7131 -5188
11243 -5188 -3223 1126 16284 23512 15523 22686 36412 36877 45350 37285 34149 42127 54377 51707
11229 51707 50311 30015 23758 37201 54227 74101 72483 50587 36369 21112 22246 37850
11217 37850 30526 33647 28558 33433 61181 64504 48134 24676 6297 -35246 -78710 -135382 -219518
11204 -219518 -222961 -165839 -105829 -73511 -61395 -45425 -1683 37487 57843 66726 77977 99328
11192 99328 98656 96579 93853 105963 109486 108498 131344 111691 50607 38184 31334 29581 37031 35386
11178 35386 46968 81543 101901 85097 79397 72836 65098 64324 62896 68312 76037 63012 48019
11165 48019 38769 48729 68041 87483 88840 91276 123725 131408 138395 167686 185673 192611 215253
11152B15253K2592M9766J15789J30051J10728Q0782r094k08251l09396j65225
11142C2995o2887j151J2110n650R931j204n810m085o157N410J1345J1145J895
11129b113K4292K3847J6307J4058N704l343p287O927k5518q188K4702L1123J0958
11116A11469k8643j6591j2859r473L778K5135L8437J8747j0432j6209J8313P332
11104A29004o936L3109J6560p149k2697q633k5833m143R033P535K0620K1397K748
11091A64615j122J199j173k8705J0013K0641L0471P889j0978J0956J5372K547
11079B21725J556j847J7988O2696K7771J143O415K1238M2467L4779P1756O4985
11067E72672N3596O526k6688k733M5770N5299L4877L2880P8926Q6301N5894M1506
$$ plain form
11152 215253 237845 287611 403400 533451 644179 724961 715867 507616 198220 32995
11142 32995 -29892 -31043 -18933 -24583 -14652 -15856 -21666 -25751 -31908 -26498 -15153 -4008 -2113
11129 -2113 22179 46026 62333 76391 82095 78752 71465 78392 52874 44686 69388 100511 111469
11116 111469 82826 66235 53376 43903 47681 72816 111253 130000 119568 103359 121672 129004
11104 129004 122068 155177 171737 164588 141891 133258 107425 103282 112315 119850 140470 161867 164615
11091 164615 163493 164692 163519 134814 144827 165468 195939 203828 192850 203806 219178 221725
11079 221725 223281 221434 239422 302118 329889 331032 337447 358685 401152 435931 507687 572672
11067 572672 626268 632794 606106 603373 649143 704442 739319 772199 851125 937426 993320 1034826
11055A034826P2599N1691O0424P4795R5333J27876J17620J37828J82002K27076
11045B182070L51970N73802Q45548R72915M44994k84853m39262j75719O4045K65120
11035D800630M58235O75962Q79272J173373J580263K127206K801405L579545M612915
11026B2688806O540198J0239614J6958158K9454871N3176528R3214079J30962617
11019C63234871Q5400184m7890999j24242510j03242186o0943393l3916703k0048870
11012E8350394j2925410q944411o565147n153600m108441l201100k497580k013921
11004A2940784j689193j393680j169402r88465q21872o43174m10704j31713K48459
10995E941040L23142k97635q95712r09057o59736m53570l25548k37026k05079
$$ plain form
11055 1034826 1107425 1159116 1219540 1294335 1389668 1517544 1635164 1772992 1954994 2182070
11045 2182070 2534040 3107842 3953390 4926305 5371299 5086446 4647184 4471465 4535510 4800630
11035 4800630 5258865 5934827 6814099 7987472 9567735 11694941 14496346 18075891 22688806
11026 22688806 29229004 39468618 56426776 85881647 139058175 232272254 363234871
11019 363234871 448635055 400744056 276501546 173259360 112315967 78399264 58350394
11012 58350394 45424984 36480573 29915426 24761826 20653385 17452285 14954705 12940784
11004 12940784 11251591 9857911 8688509 7700044 6878172 6234998 5824294 5692581 5941040
10995 5941040 6264182 5966547 5070835 4161778 3502042 3048472 2722924 2485898 2280819
10986B280819j50338j41266j51762j10567l5384m6570q0086p3868r8182q8701
10976A304095q7630q1373n8341o0074p6046n8216k9440k9045P020O409k2416m4546
10964G70397j8634N951k77N531o947m5978k9671j2009k0204j5156j6445k1018
10952E95540j3955j0687k3793k6927j7283l1783k3331J271m908o909r774k4804
10940D02657l0358j7642k4903k5660L527N321P155k492l538K7230o095l3602n678
10927B95922M2617K2233m987j5325L373j1541n0932j2562K1846J5080N013r562
10915C01175q804P914J9261N5370M4141j3694n0759k5061J2012L6240O350K3330
10903D07475L866n947K004J6447K3517K0621M9789M7273L6271l1081j08623j50931
$$ plain form
10986 2280819 2130481 1989215 1837453 1726886 1691502 1644932 1564846 1490978 1392796 1304095
10976 1304095 1216465 1135092 1076751 1016677 940631 882415 852975 823930 830950 837359 814943 770397
10964 770397 751763 757714 757437 762968 756021 710043 680372 668363 648159 633003 616558 595540
10952 595540 581585 570898 547105 520178 502895 471112 447781 449052 444144 437235 427461 402657
10940 402657 372299 354657 329754 304094 307621 312942 320097 317605 314067 341297 335202 301600 295922
10927 295922 338539 360772 355785 340460 343833 332292 281360 268798 290644 305724 310737 301175
10915 301175 292371 300285 319546 374916 419057 405363 354604 329543 341555 377795 384145 407475
10903 407475 411341 405394 407398 423845 447362 467983 517772 565045 601316 570235 461612 310681
10891C10681J274J00042R6121k1785r8763r2718n5397l902j7272l4323k6020j4557
10879A43381K191q731k8328l1617Q737J7255J4336J5927L183k9989M848Q811l168
10866A16836J9584l014k8919j5685n14k267k0936j4060P417J0819q297j6785p021
10853C7158j9375l1545k813J5100J969O924K2984N476n800P982J6149k176M925
10840E6958L7544J8344K1162L0583M5164O1053O0864o589o7718p8914l6002k1394
10828A21055k7563k4386l7231k0071Q68R225J9379q10k0193J7002L2041j0632
10816E8684j2927j0183J6039Q666O314n393j4987j3836j132o301j5183o87J4016
10803B3090L920L3262r721k2705P916J2997K2857J7126J6148m990j9922j2604
$$ plain form
10891 310681 311955 411997 508118 486333 387570 294852 239455 235553 218281 183958 157938 143381
10879 143381 145572 136841 108513 76896 85633 102888 117224 133151 136334 106345 111193 120004 116836
10866 116836 136420 133406 104487 88802 88288 86021 65085 51025 58442 69261 60964 44179 37158
10853 37158 17783 -13762 -16575 -1475 494 7418 30402 35878 30078 38060 54209 52033 56958
10840 56958 94502 112846 134008 164591 209755 270808 331672 325083 257365 178451 142449 121055
10828 121055 93492 69106 31875 11804 12672 21897 41276 40466 20273 37275 69316 58684
10816 58684 45757 35574 51613 60279 66593 61200 46213 32377 31245 24944 9761 9074 23090
10803 23090 27010 60272 50551 27846 35762 48759 71616 88742 104890 99900 79978 67374
10791F7374J7418J6671j8576j5678J7417m233j1839ro741r314k2626m397K974
10778B8441P095N677r63O210J565j516K531j1035J5947K3381l1877m0169M74K6306
10764C2067p075n335l141N095R845J2048O921k4275j2105J4619K1271J6605k7343
10751C9197l1583n521J8107k877j7326o479J8231L5255L484m897q704m276q152
10738B4459j1313K6704J6645n846k8960l411k181p978j6956j3089K512J6964q54
10725c304N511q973K062J9598j6477p916n173l60Q773M5551J5973o458o044K238
10711D5001j0269p28K467J4J1399N268j6820J5360N128j3878j1075o090k245p882
10697A5650j0754q58j7473K071J8399J628J3291K3135j3632k202K1417k141p728
$$ plain form
10791 67374 84792 101463 82887 67209 84626 80393 68554 68545 61804 52490 29864 25467 28441
10778 28441 35536 41213 40250 46460 48025 46509 49040 38005 53952 77333 45456 5287 5761 32067
10764 32067 24992 19657 16516 21611 31456 43504 50425 26150 14045 28664 49935 66540 39197
10751 39197 7614 2093 20200 17323 -3 -6482 11749 47004 50488 45591 36887 32611 24459
10738 24459 13146 39850 56495 50649 21689 18278 16097 8119 -8837 -21926 -19414 -2450 -3304
10725 -3304 2207 -6766 -4704 14894 -1583 -9499 -14672 -15032 -6259 39292 55265 48807 42763 45001
10711 45001 34732 34004 36471 36485 47884 53152 36332 51692 56820 42942 31867 25777 23532 15650
10697 15650 4896 4038 -13435 -11364 7035 8663 21954 45089 31457 29255 50672 48531 40803
10684D0803j1673l674q363N111m892k4293j7288J8203N681L3015O512j7907l556
10671A7679n150j2680l207k769M425j1050J1661J4742Q74L3081J9032L230m603
10658F5265J298k2687j0433J0766J0872k5022j0771j4630j7105k291K3639O433
10646A5334n283j0865J0648O59p787Q655R142O789j7743Q352Q521o568O824N826
10632C2504p288l2348n253o248J1790J9528J3266k3926r840J1910J0837R723L6192
10619F0847L101m629l276j587J865K665L6705L2804M5308K6979N2061J23208J95681
10606E71732L29877N49535O94563K79949m32413o60849m78290k71218j62869j01277
10596C18740p2014n8151j5818k2779l8178p805k1521j4131J8221j3635m1332j3632
$$ plain form
10684 40803 29130 25456 17093 22204 17312 -6981 -24269 -6066 -385 32630 39142 21235 17679
10671 17679 12529 -151 -3358 -6127 -1702 -12752 -1091 13651 14525 47606 66638 69868 65265
10658 65265 66563 43876 33443 44209 55081 30059 19288 4658 -12447 -14738 8901 15334
10646 15334 10051 -814 9834 10493 2706 11361 20503 27292 9549 17901 26422 19854 26678 32504
10632 32504 25216 -7132 -12385 -18633 -6843 12685 25951 2025 -7815 4095 14932 24655 60847
10619 60847 63948 59319 56043 54456 56321 58986 95691 128495 173803 200782 252843 376051 571732
10606 571732 901609 1451144 2145707 2425656 1993243 1332394 854104 582886 420017 318740
10596 318740 246726 188575 172757 149978 111800 103995 82474 68343 86564 72929 31597 17965
10584A7965M766q815K31m024M0543K0574l259q239j9194J0436L6819J4627l5041
10571F7389j4699J61k2504k3320j8578K041J0876J5244J3953j6150k708J5642
10559B7347K3134j506j4016k0379J0984J7711j6710r351j6945J642j953R798R23
10546A0679n062N992R143K2588j1424k3788q249q082J261K4745R704j1055O968
10533B3420k962j2003Q10Q725J4376j261J3513m485j4165J8954o26k7805j8827
10520b336n529k0788p542K0342N904P561k129j1010K077M055j3578j672O748J685
10506a6212n737J9801O331j5200r857O48J0731J442K2076Q529P67k2412j5370
10493a4463J8103K3095o464k3018O097L58n400j3423k5105J1186J9191J4643J1107
$$ plain form
10584 17965 22731 13916 14147 10123 50666 71240 67981 59742 40548 50984 87803 102430 67389
10571 67389 52690 52851 30347 7027 -11551 -9510 1366 16610 30563 14413 11705 27347
10559 27347 50481 48975 34959 14580 25564 43275 26565 17214 269 1911 -42 9756 10679
10546 10679 5617 11609 20752 43340 31916 8128 -121 -8203 -6942 17803 27507 16452 23420
10533 23420 20458 8455 9265 17990 32366 31105 44618 40133 25968 44922 44296 16491 -2336
10520 -2336 -7865 -28653 -36195 -15853 -9949 -2388 -4517 -15527 -13450 -9395 -22973 -24645 -17897 -16212
10506 -16212 -21949 -2148 4183 -11017 -20874 -20226 -9495 -8053 14023 22552 23319 907 -14463
10493 -14463 3640 26735 20271 -2747 3350 3708 -1692 -15115 -40220 -29034 -9843 4800 15907
10480A5907o219r735j7430L137K5949j131l278J2110r045j8965l116r874r350
10467c1040l443J8812k943J1988J5650K0677m85j9771r725m89R212J2302L187
10454B3932n094k440o759K5788p824j1038n979j2666j6186m97M956N021q4Q545
10440c25K2182k0108j7017j170J1189J5367j324J2728J6043M532j2783m493R089
10427C3910o304j2132j9101J1789J5891p450j1377J0293j6801j3320J0994J1467
10415G859K6357J7166q833k6869r657J8132j4205j5777m033r933J109j1872P466
10402b3090K9313j6731l0547K7180K7243J0535r110l2232R54J9233R730J0686
10390B3164L469j4137K995O891J94R62k0122j055J5475j369j4520J5809J0893
$$ plain form
10480 15907 9688 -47 -17477 -14340 11609 10478 7200 19310 10265 -8700 -11816 -21690 -31040
10467 -31040 -34483 -15671 -18614 -6626 9024 29701 29216 9445 -280 -769 8443 20745 23932
10454 23932 18838 16398 9639 35427 27603 16565 10586 -2080 -18266 -18763 -13807 -8786 -8870 -325
10440 -325 21857 1749 -15268 -16438 -5249 10118 8794 21522 37565 42097 29314 24821 33910
10427 33910 27606 15474 -3627 8162 24053 16603 5226 15519 -1282 -14602 -3608 7859
10415 7859 34216 51382 42549 15680 6023 24155 9950 -5827 -9860 -19793 -18684 -30556 -23090
10402 -23090 6223 -10508 -41055 -13875 13368 23903 14793 -17439 -16485 2748 12478 23164
10390 23164 26633 12496 15491 22382 22576 23538 3416 2361 17836 16467 1947 17756 28649
10377B8649J3976j1430k1999j4638m463P526r733L255L231k1055l814J8982Q721
10364b792j328o918O353R308j2921J9010q147J1267Q122O532L321j7467r095l912
10350A333O534R014o047r295p66K4458j1388J814J5493k247j0007r227J4351L967
10336B7987j2587k0632m472j1019K668m769k392j673Q277O101J1261J6928k563
10323A3115j2835O081J147q513L232J371P318P470J7670p531k8700j8709K6768
10310G884L1610j476j1710j9606j0079m619J5727R895R344m651K3136J1230k4981
10297C1704k0280k1609k4312o747j884L2309R299o135l407N875L157k175k5515
10284b9720J0856L1952m976k1221J4391R025j943J8682j3398m959k106j4444l7893
$$ plain form
10377 28649 42625 31195 9196 -5442 -9905 -2379 -12112 -8857 -5626 -26681 -30495 -11513 -2792
10364 -2792 -4120 -11038 -4685 4623 -8298 10712 2565 13832 21954 28486 31807 14340 5245 1333
10350 1333 7867 16881 10834 1539 773 25231 13843 15657 31150 28903 18896 9669 24020 27987
10336 27987 15400 -5232 -9704 -20723 -18055 -22824 -25216 -26889 -18612 -12511 -1250 15678 13115
10323 13115 280 6361 7508 -1005 2227 3598 10916 18386 36056 28525 -175 -18884 7884
10310 7884 39494 38018 26308 6702 -3377 -7996 7731 17626 26970 22319 45455 56685 31704
10297 31704 11424 -10185 -34497 -41244 -43128 -10819 -1520 -7655 -11062 -5187 -2030 -4205 -29720
10284 -29720 -18864 13088 8112 -13109 1282 10307 8364 27046 13648 8689 6583 -7861 -45754
10271d5754Q640K728J6749J3985J6272P244o067l795n190j3127p272Q532K4898
10258A7843K8841j7878n241j6616l393j0507N961K0658k496J0650Q551p829K295
10245C0839j7624k4790n72o853m066j0936N14K341Q801J758O518J709N696L28
10231f337k117k035j341n088r30J7291l177j6563N391J4349K0972N887M453k0242
10217A0513j2498Q383r99q784o939Q072Q794j2614M470K2779k46N937Q737q938
10203B6667k1353j2246J8597Q448j4195J891N033M039o401J115N631r670j9737
10190a2181M83N685j7389P667Q663L464m820O129m237j1739j3782j994P126J2087
10176a4838J1280N380L282m180J1465j6309Q807L2881K1577k0671l4468j6857
$$ plain form
10271 -45754 -37114 -34386 -17637 -3652 12620 19864 13797 10002 4812 -8315 -15587 -7055 17843
10258 17843 46684 28806 23565 6949 3556 -6951 -990 19668 17172 27822 36373 28544 30839
10245 30839 13215 -11575 -12147 -19000 -23066 -34002 -33488 -31147 -22346 -20588 -14070 -12361 -6665 -6337
10231 -6337 -8454 -10489 -11830 -16918 -17848 -557 -3734 -20297 -14906 -557 20415 26302 30755 10513
10217 10513 -1985 6398 5399 -3385 -10324 -2252 6542 -6072 -1602 21177 20931 26868 35605 26667
10203 26667 5314 -6932 11665 20113 5918 7809 12842 16881 10480 11595 17226 7556 -12181
10190 -12181 -11698 -6013 -23402 -15735 -7072 -3608 -8428 -2299 -6536 -18275 -32057 -34051 -26925 -14838
10176 -14838 -3558 1822 5104 924 12389 -3920 4887 37768 59345 38674 4206 -12651
10164a2651k4155N685K319J7833J6878l282J3693J330P611j2914n574N471l481
10151H763j9019j1858r307R392K3354P816l731J815j070j1299q12L25Q417j5320
10137a2534l925L2229L899q884o144J5271M532K4698M539m764l1364k3487J47
10124e787L081N406N644R624J8474j3193R62R427k771k471m920l0137m4394J3224
10110c7831L1322P661M967J959o511l70K683Q396o536J9150m412j3689O419q949
10096D259j4091R399K5734m077j9835n244J05o553K9798p579k4128r20M788J7094
10082H750K6108L021r737l404J899L561n096j1231p598J8899r622k6361l303Q49
10068a3265Q076R869R905J0313p616j2709o683j8442L545K2693R233J9628m026
$$ plain form
10164 -12651 -36806 -31121 -28802 -10969 5909 2627 16320 17650 25261 12347 6773 12244 8763
10151 8763 -10256 -22114 -31421 -22029 1325 9141 5410 7225 6155 -5144 -5956 -5631 2786 -12534
10137 -12534 -16459 15770 19669 10785 4641 19912 24444 49142 53681 48917 17553 -5934 -5787
10124 -5787 -2706 2700 8344 17968 36442 23249 24211 33638 30867 28396 23476 -6661 -51055 -37831
10110 -37831 -6509 1152 6119 8078 1567 1197 3880 12276 5740 24890 20478 6789 13208 4259
10096 4259 -9832 -433 25301 21224 1389 -3855 -3750 -10303 19495 11916 -12212 -13132 -8344 8750
10082 8750 34858 37879 28142 24738 26637 30198 25102 13871 6273 25172 15550 -10811 -14114 -13265
10068 -13265 -5189 4680 14585 24898 17282 4573 -2110 -20552 -17007 5686 14919 34547 30521
10055C0521q83j6509j2304J3446l286j5336o589R335J1862K4577j922j6904m093
10042A1915P573K4009O340L076j9668j7567l805p579p739Q014j129m637j3589
10029a4786J6155K1691P769j0555K2309O932q603M024l2267k917K3630K4721j1645
10016D6458k6473j7442m067l2387k372L2611R602R321J4265Q544j2483k1976O860
10003A0461K726m467J1270j349j4907l4085P654K1120M201J478q485r87K1300
9990A5930M307j99j7316k3423k1566K6489r84l1189j2095K4527K8237M135j5124
9977a8271p608J4132P337J394K854l149r575n273J231k077J1664m347O351K472
9963b865J0149j5944J054K8930m854j3910j037O24J3667R055J005L9826L3142
$$ plain form
10055 30521 29638 13129 825 14271 10985 -4351 -10940 -1605 10257 34834 32912 16008 11915
10042 11915 19488 43497 49837 52913 33245 15678 11873 4294 -3445 4569 3440 -1197 -14786
10029 -14786 1369 23060 30829 20274 42583 49515 40912 44936 12669 9752 33382 58103 46458
10016 46458 19985 2543 -1524 -33911 -36283 -3672 5930 15251 29516 38060 25577 3601 10461
10003 10461 13187 8720 19990 18641 3734 -30351 -22697 -1577 2624 4102 -4383 -5370 15930
9990 15930 20237 20038 2722 -20701 -42267 -15778 -16762 -47951 -60046 -35519 -7282 -3147 -18271
9977 -18271 -25879 -11747 -4410 -3016 -162 -3311 -12886 -18159 -16928 -19005 -7341 -11688 -5337 -2865
9963 -2865 7284 -8660 -7606 21324 16470 2560 1523 2147 15814 24869 25874 65700 98842
9950I8842j6298l2807j5496N93n523j4395j4792r923L616m602j3325L798K0387
9937G5J7790m934k6097p447k610j0952P535J1154J5750K4056O555l038M438k3487
9923H788j2415J0142j4487p131p39L2407Q635k292m101R323M839Q473p733j5423
9909A8286J377J271j6127q394q104K509J7507L081j4946K562O673J212K713o695
9895B925k8729R058J7974J721k7350n272K5482j579J0167K1276j3562o141j653
9882D317q819L260J932M916N669j992j3261K5286K0697k8585j0555j5924l919
9869a6978P358L832k1012q944J2391j604j133m653L6570J0246j731o924j5527
9856h109j0054q918K1957N761j3488j934J1395j703K956J3322l711p820J03q63
$$ plain form
9950 98842 82544 49737 34241 34834 29311 14916 124 -9799 -6183 -10785 -24110 -20312 75
9937 75 17865 12931 -13166 -20613 -23223 -34175 -26640 -15486 264 24320 30875 27837 32275 8788
9923 8788 -3627 6515 -7972 -15103 -15842 16565 25200 22908 18807 28130 32969 41442 33709 18286
9909 18286 19663 20934 4807 -3587 -11691 -9182 8325 11406 -3540 -978 5695 6907 9620 2925
9895 2925 -25804 -16746 1228 2949 -24401 -29673 -4191 -5770 4397 25673 12111 5970 4317
9882 4317 -4502 -1242 690 5606 11275 9283 -3978 21308 42005 13420 2865 -13059 -16978
9869 -16978 -9620 -5788 -26800 -35744 -23353 -24957 -26090 -30743 5827 16073 14342 7418 -8109
9856 -8109 -18163 -27081 -5124 637 -12851 -14785 -3390 -5093 -2137 11185 7474 -346 -243 -1106
9842a106p072k810R820j288q53J1087J2627m180k2092M04j4645l926J270P752
9828a5012J6665R200j7000l972J2965J0870p435k699R090N646r133j6883K699
9815d999L834N599q868q679N300J7844K904O462m653o926j6429n812J1389J873
9801a161n339P761K0175N588k0294N031k2743j7127J2606P467R248K828L585n760
9787A865j443L470j7276L167O069j5582n260K4857R05j0674j3051j345j943k1429
9773d7670J7033R824j9023q834J1364K0385M901p701K201M762q636N604O207L00
9759i283J6166J324N543q189j121O64j1837j2827J4651P888k9663p705K8562P325
9745A498n019j9887j0452R210K4150K8221R025r401l0202o615P925N728O113M512
$$ plain form
9842 -1106 -8178 -10988 -1168 -2456 -3309 7778 20405 16225 -5867 -5463 -20108 -24034 -22764 -15012
9828 -15012 1653 10853 -6147 -10119 2846 13716 6281 3582 12672 18318 9185 -7698 -4999
9815 -4999 -1165 4434 -4434 -13113 -7813 10031 12935 19397 14744 7818 -8611 -14423 -3034 -1161
9801 -1161 -6500 1261 21436 27024 6730 11761 -10982 -28109 -15503 -8036 1212 4040 7625 1865
9787 1865 422 3892 -13384 -10217 -4148 -19730 -24990 -133 772 -9902 -22953 -24298 -26241 -47670
9773 -47670 -30637 -20813 -39836 -48670 -37306 -16921 -12020 -19721 -17520 -12758 -21394 -15790 -9583 -9283
9759 -9283 6883 8207 13750 5561 4440 5104 -6733 -19560 -4909 2979 -26684 -34389 -5827 1498
9745 1498 -3521 -23408 -33860 -24650 -500 27721 36746 27345 -2857 -9472 -1547 4181 10294 14806
9731A4806j1426j0460J5420o185k3440r050K9512j929k0414L779j728L5465j236
9718A3114j2188K1856R778P617l265O606j8248k9242j387M970Q848j9529k1206
9705c2276N093K2931K625j4173j9567j385J990K1619P076N729r381j3943J961
9692b1701P699K5874J3345J6926J9516q715k2391j7530j074o984J1160J5882j8045
9679A3962j0097M052o284k2953N670K3073J0172l4103j9837J6439K9022j0971
9667a855j6435J040J4485J5959M782P335J0148R181j5346K940K848J8062O449
9654E9593K530l2460n868J379J1362j800j695N610J730k7914K06J8997k2584j8513
9640i427k704J892K0982N477j1789J2040j8057k4890N866P242l140j2999M595
$$ plain form
9731 14806 3380 -7080 8340 2155 -21285 -30335 -823 -2752 -23166 -19387 -21115 14350 13114
9718 13114 926 22782 32560 40177 36912 43518 25270 -3972 -5359 -389 8459 -11070 -32276
9705 -32276 -27183 -4252 -1627 -15800 -35367 -36752 -34762 -13143 -6067 -338 -9719 -23662 -21701
9692 -21701 -14002 11872 25217 42143 61659 52944 30553 13023 11949 4965 16125 32007 13962
9679 13962 3865 7917 1633 -21320 -15650 7423 17595 -16508 -36345 -19906 9116 -1855
9667 -1855 -18290 -17250 -2765 13194 17976 25311 35459 44640 29294 32234 35082 53144 59593
9654 59593 62123 29663 23795 25174 36536 34736 33041 38651 40381 12467 12673 31670 9086 -9427
9640 -9427 -12131 -10239 10743 16220 4431 16471 -1586 -26476 -20610 -13368 -16508 -29507 -24912
9627b4912K7222j0364J48J0115n192n666j0837J144q13P460R438k950n289N713
9613d783K6714L775j5256J720J3637j9757o961K807K285J682J9924J3271K334
9600D1392j1111j6122k785q89P049k9946j4413n743Q180R485J4072n261J4001
9587G909o331l857r756k2747q22K4321Q355n713J2871J0434p834o499J7939J6556
9573C4826R76j3631j0082K338n365j2100j4061L822J1410J4640k2709j8738L07
9560b8367j6805r983J4200Q430K4749Q957j3262J265N694P470k451J806j7984
9547a6281j6513Q781J9611J6532n079j8321j9303K8538K0183n014j4685J7760
9535A6209j0545l787Q464Q440K940K551n273j7459q454J064Q819o303K998m929
$$ plain form
9627 -24912 2310 -8054 -7906 2209 -2983 -8649 -19486 -18342 -19155 -11695 -2257 -5207 -10496 -4783
9613 -4783 21931 25706 10450 12170 25807 6050 -911 1896 4181 5863 25787 39058 41392
9600 41392 30281 14159 11374 10485 17534 -12412 -26825 -32568 -24388 -14903 -831 -6092 7909
9587 7909 1578 -2279 -12035 -34782 -35604 -11283 -2928 -8641 4230 14664 6830 331 18270 34826
9573 34826 35802 22171 12089 14427 9062 -3038 -17099 -13277 -1867 12773 -9936 -28674 -28367
9560 -28367 -45172 -55155 -40955 -32525 -7776 1181 -12081 -10816 -5122 2348 -103 1703 -16281
9547 -16281 -32794 -24013 -4402 12130 7051 -11270 -30573 -2035 18148 13134 -1551 16209
9535 16209 5664 1877 10341 18781 21721 24272 18999 1540 -6914 -5850 2969 -3334 -336 -5265
9521e265O177Q927m841k509l903K0449n159m178M320k406l238o269K0885O098
9507B9088p388p086r504K05k0226N249J3056o48N70L1601N654j0924j7268j4511
9493b132k4869L948J1461j5037N169K918M959j1553n603J3786O412o383l032J1085
9479h871J4864M544k115j357N226j2177j9707J440J7677j5943M024J1984L25L368
9465C282p776j901J089L214K4336n632j9423o766O239J4693L487k237Q717l150
9451A8172o061J3886J4974k2815j0854j794k0258j1191k230L80j1627L4352L0764
9438B5698j0634l918m915r570k816J967l574k3397j1812n94K1585K3013M193N813
9424A1039j8546Q096j622q732m684j558q789N252P382J932J098q600j2989J3389
$$ plain form
9521 -5265 912 9839 4998 2489 -1414 19035 13876 9698 14018 11612 8374 2105 22990 29088
9507 29088 21700 14614 5110 5315 -14911 -9662 3394 2746 3316 34917 40571 29647 12379 -2132
9493 -2132 -27001 -23053 -11592 -26629 -21460 -18542 -13583 -25136 -30739 -16953 -10541 -16924 -19956 -8871
9479 -8871 5993 10537 8422 7065 12291 114 -19593 -18153 -476 -16419 -12395 -411 -86 3282
9465 3282 -4494 -6395 -5306 -2092 22244 16612 -2811 -9577 -3338 11355 14842 12605 21322 18172
9451 18172 12111 25997 40971 18156 7302 5508 -14750 -25941 -28171 -27791 -39418 -5066 25698
9438 25698 15064 11146 6231 -3339 -6155 -4188 -7762 -31159 -42971 -43565 -21980 1033 5226 11039
9424 11039 -7507 589 -1033 -9765 -14449 -16007 -24796 -19544 -12162 -10230 -9132 -17732 -30721 -17332
9410a7332M887P867J53J3001J9437N920j9344j6707L725N457j3014j1607j938
9397a9495J5499K939k7891j1927R581J6588M721J540M588o182K1207L792j9926
9384d966k673J5402K697O820l390p474j3979R951R99L226Q265r440j3015O293
9370a284J4937L068j505O702n0j2975j0581M189L319K792K8348R421k5156r091
9356A2134j2081o818K090K630J0209p03J5646j0803J4400p137P167K4384J3008
9343F4126O92k6019j2674l2499l2024m344J3707J2349K432L617M728P333K1881
9330B3305K4169Q713l813j3124q490O929O968j4847j6872k620j2851q341m662
9317a5536K3877K3386o060j7480m849q023J1043J2446J2932r300j5599N034o630
$$ plain form
9410 -17332 -12445 -4578 -4425 8576 28013 33933 14589 -2118 1607 7064 -5950 -17557 -19495
9397 -19495 -3996 -1057 -28948 -40875 -31294 -14706 -9985 -8445 -3857 -10039 11168 14960 -4966
9384 -4966 -7639 7763 10460 17280 13890 6416 -7563 2388 3387 6613 14878 5438 -7577 -1284
9370 -1284 13653 16721 15216 21918 21868 8893 -1688 2501 5820 8612 36960 46381 21225 12134
9356 12134 53 -6765 -4675 -2045 8164 7461 23107 12304 26704 19567 26734 51118 64126
9343 64126 64818 38799 26125 -6374 -38398 -42742 -29035 -16686 -14254 -10637 -5909 1424 23305
9330 23305 47474 56187 52374 39250 30760 37689 44657 29810 12938 10318 -2533 -10874 -15536
9317 -15536 8341 31727 25667 8187 3338 -4685 6358 18804 31736 22436 6837 11871 5241
9304E241m510J4633N431j2704N863J8161Q475J6432j1381L3583N029k2509l8354
9291B3390j7930N514K4450J5090K00o380J6026J900J4551l380r482p514K6042
9278H2477j7525k8880j826n477N669J3591J52J3907K4349J558n570r302j0292
9265F2831J2481K0230M570n326K334N604l345J5582J8410L067P174j823J7032
9252A58821R412J040M915K9576M0023Q356k5413N772L2766J8609J6042M1937K7185
9239C69041J5549K7337L6652L0253M2706N5264O9170Q5476R9594J09894J68680
9228A109616J86343K32304K69108L58520N00357O61177Q84910J244811J721052
9219G168198K383819L072367L273750K250035k37k182987l068641k862326k246964
$$ plain form
9304 5241 731 15364 20795 8091 13954 32115 40590 57022 45641 79224 84253 61744 23390
9291 23390 5460 10974 35424 50514 50714 44334 60360 62260 76811 73431 63949 56435 82477
9278 82477 64952 36072 34246 28769 34438 48029 48181 62088 86437 87995 82425 73123 62831
9265 62831 75312 95542 100112 94786 97120 102724 99379 114961 133371 136438 143612 141789 158821
9252 158821 168233 169273 174188 203764 243787 252143 226730 232502 265268 283877 299919 341856 369041
9239 369041 384590 411927 448579 478832 521538 576802 645972 731448 831042 940936 1109616
9228 1109616 1295959 1528263 1797371 2155891 2656248 3317425 4202335 5447146 7168198
9219 7168198 9552017 12624384 15898134 18148169 18147932 15964945 12896304 10033978 7787014
9210G787014j658805j226180r30316o97676n39716m16444k88299k60842k18352
9201A550384j94347j71870j40149r9741r8727r4180n6917o3408p6187o8573m3834
9190D42451m2262j6689k6933j9770q582k3161j9669k7819k9104k4732k1702j3166
9178A68862N343p517j4600M051M121j4495M478j1201j3209j6861j5445j0244O48
9165H3931j5146K7849J0054j0281Q175R193k539Q884k3507j4878l072J098j8430
9152F1331q98J621j465k706n468L970m256L394O422r345n127j6313K873L25O091
9137D0449L682J734M251J2961j180q247k824j2354j4175L254k841j0222j3959
9124E29J0220J2921N65l342k2395L021K4492q068O204N313m753J2293M103J8905
$$ plain form
9210 7787014 6128209 4902029 3971713 3274037 2734321 2317877 2029578 1768736 1550384
9201 1550384 1356037 1184167 1044018 944277 845550 751370 694453 631045 554858 486285 442451
9190 442451 400189 383500 356567 336797 328215 305054 285385 257566 228462 203730 182028 168862
9178 168862 174205 166688 152088 156139 160260 145765 150243 139042 125833 108972 93527 83283 83931
9165 83931 68785 96634 106688 96407 104582 113775 111236 120120 96613 81735 78663 79761 61331
9152 61331 60433 62054 60589 57883 52415 56385 52129 55523 61945 52600 47473 31160 34033 34358 40449
9137 40449 44131 45865 50116 63077 61897 53650 50826 38472 24297 27551 24710 14488 529
9124 529 10749 23670 24235 20893 -1502 1519 26011 17943 24147 29460 24707 37000 41103 60008
9110F0008K4200j1945n971j2790k2276J73m841j002J9927l592K273k5627j3566
9097D971K826n263J5834K3576j482K98q553j0235k2219j8111p837P898P890Q606
9083a801J5667N679J1000o921J1167j2309k0596r647J5865j354J4822J7292o270
9070C2594j0014P673o569J000k9824j0908J6776J3833l514j639N781O514m852
9057A6851j9121O86K473p786K419p813o25N550j4828o480J0239R055J1582j026
9043A176q710J0682j280j1603n857q680k250k350J6179R01N967j872k297k726
9029a2720M815J1320K1324p99k0734L507K772k7190r320J6500K4047J8378M166
9016C6066n949k1012k749k98Q55M002j3998O988K2845J3973o315j416j3466p715
$$ plain form
9110 60008 84208 72263 66292 53502 31226 31399 26558 25556 45483 41891 44164 18537 4971
9097 4971 7797 2534 18368 41944 40462 40760 32207 21972 -247 -18358 -26195 -18297 -10407 -1801
9083 -1801 13866 19545 30545 23624 34791 22482 1886 -7761 8104 6750 21572 38864 32594
9070 32594 22580 30253 23684 24684 -5140 -16048 728 14561 11047 9408 15189 21703 16851
9057 16851 -2270 -1584 889 -6897 -4478 -12291 -12916 -7366 -22194 -28674 -18435 -9380 2202 1176
9043 1176 -7534 3148 1868 -9735 -15592 -24272 -26522 -28872 -12693 -11792 -5825 -7697 -9994 -12720
9029 -12720 -7905 3415 24739 23940 3206 6713 9485 -17705 -27025 -10525 13522 31900 36066
9016 36066 30117 9105 6356 6058 6913 10915 -3083 3905 26750 40723 34408 32992 19526 11811
9002A1811k903J2231N543L813o456r315j2150K7320L3655r273l9315l0020N224
8989i835k0975r454j749J6307K8191N350r809O034p28q388L408o143o135N801
8975h125O675J5528J1467J6561j744l644j4049q320o783l839R10j4574L266J0269
8961C598N845r475p468M349J4470n350j509P139J3359O973m379P183J387J5829
8947E1951K184n273k942J0496K103J1164K1400M4180J08592J28656N1661o3005
8935C61167j11511q4979m5615j7418j4641j0413j6821k4390O127Q525j6277q747
8923B5007p033P398P465k3948K665M8j2489O685L817j2282q797O551J2585o079
8909A593K3784J4566j6258k2256R147O174p282j0250J9248J4411j0882p281j0955
$$ plain form
9002 11811 8908 21139 26682 30495 24039 14724 2574 29894 63549 54276 14961 -15059 -9835
8989 -9835 -30810 -40264 -42013 -25706 2485 7835 -1974 4060 3332 -5056 -1648 -7791 -13926 -8125
8975 -8125 -1450 14078 25545 42106 40362 36718 22669 14349 7566 3727 4637 -9937 -6671 3598
8961 3598 9443 -32 -7500 -3151 11319 5969 4460 11599 24958 31931 27552 34735 36122 51951
8947 51951 54135 48862 45920 56416 58519 69683 91083 135263 243855 372511 424172 361167
8935 361167 249656 164677 119062 101644 87003 76590 59769 35379 41506 50031 33754 25007
8923 25007 17974 25372 32837 8889 11554 11602 -887 5798 9615 -2667 -11464 -4913 7672 1593
8909 1593 25377 39943 23685 1429 10576 16750 9468 -782 18466 32877 21995 14714 3759
8896C759k5036j3454p45J1065Q614q354j4114o751M839L006M254J9301K5949R19
8882A3252J8381j0218k0113j5809J0326m866l206N872O202j1744K1J6272M621
8869H991l956J5124M251r518j6136O394N381J3942L310J0744r528j6861k0066
8856g928L389J6870L0603K1884j177j828j3656l0351j7526L653J843m553k1724
8843b0501k323O111M790M093K3803N498m0058j9021o583N017L2119Q481j7612
8830a6186j2137O358J9739J1516J1766n628j6388M275q548P977Q416q072J3979
8817A7067M649j3389o80q054J45J6131k5747l3366j54J2684K203k286K151O743
8803b1903R475o820m171J2853o131j4825k112J2326K6402J8486j2315j3262m966
$$ plain form
8896 3759 -21277 -34731 -35476 -24411 -15797 -24151 -38265 -45016 -40177 -37171 -32917 -13616 12333 13252
8882 13252 31633 21415 1302 -14507 -4181 -9047 -12253 -6381 -179 -11923 -11902 4370 8991
8869 8991 5035 20159 24410 14892 -1244 5150 10531 24473 27783 38527 28999 12138 -7928
8856 -7928 -4539 12331 42934 64818 63641 61813 48157 17806 280 3933 5776 1223 -20501
8843 -20501 -22824 -16713 -11923 -7830 15973 21471 -18587 -37608 -44191 -39174 -7055 1426 -16186
8830 -16186 -28323 -21965 -2226 9290 21056 15428 -960 3315 -5233 2744 11160 3088 17067
8817 17067 21716 8327 7647 -407 -262 15869 -9878 -43244 -43398 -30714 -28511 -30797 -28646 -21903
8803 -21903 -12428 -19248 -23419 -10566 -16697 -31522 -33634 -21308 5094 23580 11265 -1997 -6963
8790f963K1280l1515k0139J4175J6023J7787J2098L809k51j2060j5820j5582P85
8777a6373l992R821J8345L931M052l820j0080P172p485j378j1891J6132K1056
8764B5490J907j7216j7598n293L1959J4314K963j1816j2917m219R343j0830j1251
8751e164p328Q91j94J37j2431n568j4751M549K6J7467o596k614J360M583J3861
8736a1772K233J3509J7431J3790o484R7L438n425k2605r935K805J241M457K303
8722E083M655N447k06k116P323k100o403p566o30q25K802J1888J0196q132Q627
8707B8043J9074j3132l3688k9388R693M0867l904j6879j3671O332J4161K1745
8695B9253J7625m342j6628r824r890p96l189j7377j6233K2676n983j1071N118
$$ plain form
8790 -6963 14317 -17198 -37337 -23162 -7139 10648 22746 26555 26304 14244 -1576 -17158 -16373
8777 -16373 -20365 -10544 7801 11732 15784 11964 1884 9056 1571 193 -11698 4434 25490
8764 25490 27397 10181 -7417 -12710 19249 33563 36526 24710 11793 7574 16917 6087 -5164
8751 -5164 -12492 -11601 -11795 -11658 -24089 -29657 -44408 -39859 -39833 -22366 -28962 -31576 -30216 -25633 -11772
8736 -11772 -9539 3970 21401 35191 28707 28804 32242 26817 4212 -5723 -2918 -1677 2780 5083
8722 5083 9738 15185 14979 12863 20186 18086 11683 4117 3487 2662 5464 17352 27548 19416 28043
8707 28043 47117 33985 297 -29091 -19398 21469 17565 686 -12985 -6653 7508 29253
8695 29253 46878 42536 25908 16084 6194 5398 2209 -15168 -31401 -8725 -14708 -25779 -20661
8682b0661J1317Q590J176O932L4932K9647j6857j1555m781o125j450l312j2734
8669A5119q125J488J6387J852P187r492k1729J109J3603L427r974k8087o044K9171
8655E892R610n69k9505k140M562J4415J5849Q98J1231O116l767j8559q42j5721
8641b530J9899K2259j3424j3860n545j9358Q173K1665o228j9692M930Q77K6429
8628B3595M523o499J4355j234j7194n200q260j1967O509J2599P314J5287J97j5368
8614A8657K438m492P43J0000q126O221R759j4677p695Q262j911k263l1323K391
8600a2016L337L768K2381J6311j0357j6110J2102N47M377k5890j7687o65J2234
8587g668P5p30K7137K9561R260k2744l2627j74L167R818M020K440p943l083k1043
$$ plain form
8682 -20661 -9344 -754 422 7354 42286 71933 55076 43521 38740 32615 31165 27853 15119
8669 15119 6994 8482 24869 26721 33908 24416 2687 3796 17399 20826 10852 -17235 -23279 5892
8655 5892 15502 14933 -14572 -16712 -12150 2265 18114 19012 30243 36359 32592 14033 13191 -2530
8641 -2530 17369 39628 26204 12344 6799 -12559 -4386 17279 11051 -8641 -3711 -2834 23595
8628 23595 28118 21619 35974 34740 17546 12346 4086 -7881 -1372 11227 18541 33828 34025 18657
8614 18657 21095 16603 17346 27346 19220 25441 35200 20523 12828 21090 19179 16916 -14407 -12016
8600 -12016 -8679 -4911 17470 33781 23424 7314 19416 19963 24340 -1550 -19237 -19902 -7668
8587 -7668 -7593 -8323 18814 48375 57635 34891 2264 2090 5257 15075 19095 21535 13592 10509 -10534
8572a0534j5478J7381n23J4202L0399M686j6859M751J6876l977j4556J2552j3024
8559B5896p032J7792N2976Q7775P4529l002p6220o3306k6613k3234j6591k6190
8547A6780j734l086Q013K2537K0413L154j2878o541P518l2244k9368j5150K2610
8534B4J3989J5078n132j0659l752p65r478m953L606J592J0517O506l46K321o603
8519A1945j9325J5095K3537p00K8433N6419P2239R5197J07097J2751r4857j23292
8507A84539o8640k3573k0193p073k1897M770j8661j7372pJ6001N808q983k7722
8494c003k333J1168J0151J7099J30q626m203K147j5359p90k0178j330J9172K5089
8480B9134r403K353j0898O477J0675M131j3720J5971L1694o338q545p312M4888
$$ plain form
8572 -10534 -26012 -8631 -9154 5048 35447 40133 23274 28025 44901 40924 26368 38920 25896
8559 25896 18864 36656 89632 177407 251936 248934 172714 109408 82795 59561 42970 16780
8547 16780 15046 11960 19973 42510 62923 66077 53199 46658 54176 21932 -7436 -22586 24
8534 24 14013 29091 23959 13300 9548 8783 -695 -5648 -2042 -450 10067 16573 16227 18548 11945
8519 11945 -7380 7715 31252 30552 58985 115404 187643 282840 389937 402688 307831 184539
8507 184539 115899 92326 72133 65060 43163 47933 29272 11900 11893 27894 33702 24719 -3003
8494 -3003 -5336 5832 15983 33082 33212 24586 20383 22530 7171 6381 -13797 -15127 4045 29134
8480 29134 19731 22084 11186 17663 28338 32469 18749 34720 66414 60076 51531 44219 89107
8467H9107P9744M4856j7909l9545o2408k9510j0305j97l44k0583j3735R972O008
8454C5151r680K517o452m921P83l5257r723K7721L5420M697j1835k1672o215Q192
8440H726R330L342j4821o569J1858n254M345l632N561m979l3452o008J4380j858
8426a9031n436J0921J4262L665J4537J8847l595j4489p849l157j1073q215n178
8413a5791j4928J395K9751j9939j5839o633P423J5594J1617j8159j9503J8337
8401b6675L3526K651k0484q629J2888L695p860p826l048N088J7527q393r681O249
8387a0972j5288j8155R730P554J0069N020J485q778j5565P470l899L05N493J6429
8373i102K6451R761j5597m979j359j6025j488k677J1700j3603r283J1848K1028
$$ plain form
8467 89107 168851 213707 195798 156253 93845 64335 54030 53833 53489 32906 19171 29143 35151
8454 35151 25471 27988 21536 16615 17398 -17859 -27582 139 35559 40256 28421 6749 534 8726
8440 8726 18056 21398 6577 8 11866 6612 10957 7325 12886 7907 -25545 -31553 -17173 -19031
8426 -19031 -24467 -13546 716 4381 18918 37765 34170 19681 11832 8675 -2398 -10613 -15791
8413 -15791 -30719 -29324 427 -19512 -35351 -41984 -34561 -18967 -7350 -25509 -45012 -26675
8401 -26675 6851 9502 -10982 -19611 -6723 -3028 -10888 -18714 -21762 -16674 853 -7540 -17221 -10972
8387 -10972 -26260 -44415 -34685 -27131 -17062 -12042 -10557 -19335 -34900 -27430 -31329 -31024 -25531 -9102
8373 -9102 17349 27110 11513 6534 5175 -10850 -12338 -15015 -3315 -16918 -26201 -14353 6675
8360F675p916J3584J7566m054j359J2488m493r717j7142k8417J9957J1841j837
8347G176M524q625k5395j7551r301J4807K4091J369j1485j51l719O360J6388M112
8333B600q496O191j4726j2426K6172N740k432K647K899l722M602J790K806q09
8319A2836N552R007k692j7131l4260j5675n372K6230K667k3593J6966M9978j1529
8306A2984q645J7293J511k8135j6961M47k427j342J9322M887n230k0745o449J0816
8292b2674K5137J0694j0083j6702j8753n964j657J1159j0873l707K1997K8756
8280G330J9598L827k2128m673o809j2433L226K1068j1117o451k9994J6567K0444
8267a545J6125O989p03J7621R81n863l5955k8466Q920R127Q133R36J3976J4045
$$ plain form
8360 6675 -1241 12343 29909 25855 24496 36984 32491 22774 5632 -22785 -2828 9013 7176
8347 7176 11700 3075 -22320 -39871 -49172 -34365 -10274 -8905 -20390 -20541 -24260 -17900 -1512 2600
8333 2600 -5896 295 -14431 -26857 -685 5055 2623 5270 8169 4447 9049 10839 13645 12836
8319 12836 18388 27395 24703 7572 -26688 -42363 -47735 -21505 -18838 -42431 -25465 24513 12984
8306 12984 4339 21632 23143 -4992 -21953 -21506 -23933 -25275 -5953 -1066 -6296 -27041 -33490 -22674
8292 -22674 2463 13157 3074 -13628 -32381 -38345 -40002 -28843 -39716 -43423 -21426 7330
8280 7330 26928 30755 8627 3954 -2855 -15288 -12062 9006 -2111 -8562 -38556 -21989 -1545
8267 -1545 14580 21569 20866 38487 39468 33605 -2350 -30816 -21896 -12769 -4636 -3700 10276 24321
8253B4321P946j2360k0222j6342K932j4382L189J9095Q592j2582J4711J0199q768
8240F329k2580Q054m628M683P678m527p388O246K306N514m576l536k120K5055
8226A6510J6442j20j7447n688J920n64nJ2768r685K888P798l50l473j6171q761
8211c938K73M143J3781J1638j354Q107l323k2601j1117j5978J4040J2123o94L521
8197H621p282k146j8522l0504p97L3692R577k0048N396J544K7319K535q073j1150
8183i838P047M369J0293n57K3313N133l2290k9583l139K0221J362k609R405N911
8169I038j7886j424R703J921J5071O058j7880p678j4002j1262K3126J8030k683
8156A0132j4127j0827Q692j0587J405l924j7242j3200k59J7707J0097J1004J8688
$$ plain form
8253 24321 32267 19907 -315 -16657 -13725 -28107 -24918 -5823 2769 -9813 4898 15097 6329
8240 6329 -16251 -8197 -12825 -8142 -464 -4991 -12379 -6133 -3827 1687 -2889 -6425 -8545 16510
8226 16510 32952 32832 15385 9697 11617 11053 11048 23816 14131 17019 24817 24467 20994 4823 -3938
8211 -3938 -3665 478 14259 25897 24543 32650 29327 6726 -4391 -20369 -6329 5794 5100 8621
8197 8621 1339 -807 -19329 -49833 -50630 -16938 -7361 -27409 -22013 -20469 6850 9385 1312 -9838
8183 -9838 -2791 1578 11871 11314 34627 39760 7470 -22113 -25252 -5031 -3669 -6278 3127 9038
8169 9038 -8848 -10272 -569 1352 16423 22481 4601 -3077 -17079 -28341 -5215 12815 10132
8156 10132 -3995 -14822 -6130 -16717 -15312 -19236 -36478 -49678 -49937 -32230 -22133 -11129 7559
8143G559J9971q669m809J295r433j1078Q562P690r838n832Q847j87R444J6945
8129C0467J5609j4495j8211n24j0044j1525K3767M096j2622O270J2462J0550j3163
8116B2637M229K1293n59j1597k2828k2306L010p629r235J3353N619m444k237J4943
8102D249L584j687q417K134J5977k8295j2340J6887J1488j382j5896r089J5358
8089g429J9206J89N796j636k8706j585K864J984j1747j6531k2264J765J5929P532
8075c4633k320K4920K5634J7659o39j6484k4407j5023o884R168K318q237l997
8062c2925K6264J0130k3612j3529J0492l115J530R681R926J2643k2583j6282K6251
8049e129L1569L059o736j3388j4479r054M214J7476O870J8570j2167k6139m335
$$ plain form
8143 7559 27530 18861 14052 15347 5914 -5164 3398 11088 1250 -4582 4265 4078 13522 30467
8129 30467 46076 31581 13370 12846 2802 -8723 15044 19140 6518 12788 25250 35800 22637
8116 22637 26866 48159 47600 36003 13175 -9131 -6121 -13750 -22985 -9632 -4013 -8457 -10694 4249
8102 4249 7833 6146 -2271 -137 15840 -12455 -24795 -7908 3580 2198 -13698 -22787 -7429
8089 -7429 11777 11966 17762 16126 -12580 -14165 -11301 -9317 -21064 -37595 -59859 -58094 -42165 -34633
8075 -34633 -36953 -12033 13601 31260 30621 14137 -10270 -25293 -32177 -23009 -20691 -28928 -32925
8062 -32925 -6661 3469 -20143 -33672 -23180 -26295 -24765 -15084 -5158 7485 -15098 -31380 -5129
8049 -5129 26440 29499 22763 9375 -5104 -14158 -9944 7532 14402 32972 20805 -5334 -9669
8036i669K1726J0985Q745O061O070r995j4387l180m048O635j6236k6369K786J1491
8022i385R499p970J72K204r08r769j1161J7991L573j4521J0170J0201k234R824
8008G686M113Q055k743l629k9254j1496J0004O170J8385J2108N668k776k6036
7995c745Q167K0800j7292p305K240J8845N279p283j4919j8411o696J5604k443
7982g159j439L460L416J7149O007j3022k9538l0498K3224N651P990l27N959M587
7968d540k087J9353n479k1195k4794m389K6615K5564J992J6158m549r421l782
7955I446k2004l818J0499J6160n845j0748Q141P237J1260K0577l151j3996O248
7942C0006j463m654j1966n992k719n365J5233J1740O573r535p613k3642N545m481
$$ plain form
8036 -9669 12057 23042 31787 37848 43918 33923 19536 16356 12308 18943 2707 -23662 -20876 -9385
8022 -9385 114 -7856 -7684 -5480 -6388 -16157 -27318 -9327 -5754 -20275 -10105 96 -2138 7686
8008 7686 11799 19854 17111 13482 -15772 -27268 -17264 -11094 7291 19399 25067 22291 -3745
7995 -3745 4422 25222 7930 625 2865 21710 26989 19706 4787 -13624 -20320 -4716 -7159
7982 -7159 -8598 -5138 -1722 15427 21434 8412 -21126 -51624 -28400 -22749 -14759 -15086 -9127 -4540
7968 -4540 -6627 12726 7247 -13948 -38742 -43131 -16516 9048 11040 27198 22649 13228 9446
7955 9446 -12558 -16376 -5877 10283 4438 -6310 1831 9068 20328 40905 37754 23758 30006
7942 30006 28543 23889 11923 5931 3212 -2153 13080 24820 31393 21858 14245 -9397 -3852 -8333
7928h333R558R126j642j0854J1973q693n593J9801P334Q144N373j2535Q176L299
7914C5134K0q265k2858j9484J4142J2912J1362n986m799n316j2359n464m004P910
7900g055Q285R186K2449r05k4476k332J318O150j0013r834M571N847j0208N434
7886a583M457N406r847l507m954k429j0858J1114L2739O06j7589j6358n426Q275
7872i954M706j4346J4416j4236o76M7740O715j8861j071j2433q242J3653L788
7859A1199n92J071M829j3105q124n873J3026q371l336J4108j6498n987p90J2920
7845e523O672M731R268j0229j8904M560J127r45o481Q787J4059j8649m54O616
7831e365J8132M846k2000j112j963J8824R839M327l915n396j3663j436o075q639
$$ plain form
7928 -8333 1225 10351 8709 -2145 9828 1135 -4458 15343 22677 30821 36194 23659 31835 35134
7914 35134 35154 26889 4031 -15453 -1311 11601 22963 16977 12178 6862 -5497 -10961 -14965 -7055
7900 -7055 1230 10416 32865 31960 7484 5152 6470 12620 2607 -7227 -2656 3191 -7017 -1583
7886 -1583 2874 8280 -1567 -5074 -10028 -12457 -23315 -12201 20538 21144 3555 -12803 -18229 -9954
7872 -9954 -5248 -19594 -5178 -19414 -20090 27650 34365 15504 14433 2000 -6242 7411 11199
7859 11199 10607 11678 16507 3402 -4722 -10595 2431 -5940 -9276 4832 -11666 -17653 -18443 -5523
7845 -5523 1149 5880 15148 4919 -13985 -9425 -8298 -9243 -15724 -6937 7122 -11527 -11981 -5365
7831 -5365 12767 17613 -4387 -5499 -7462 11362 21201 25528 21613 16217 2554 1118 -4957 -13596
7817a3596l208J2844K0822j5918j5369K9883k360j6709Q024K1658K1742m962k8053
7804A4798j0045L096n630j6364K2192L4511P826j4967M86j5137k0216p678O653
7791d75J9304J5390j5267l9021M869j064J0324r086Q358P915Q980J2404j0444
7778A2187q377K627n706p086p783j662J0570l012q133J0916L991k019n592R580
7764E01J0481k0264j5579j097L896J922j06j9337J7583K1128K2657m498j52j2513
7750D622o040k519j0111R811K1118J3750k899l3108k0518J9834J8242p634R012
7737A3560O703k1832j2268J5487j1631J866J3651Q997r309j1613l193O186N200
7724A804k3541q314j130J4589J1031K425R40r117r048J894o419K615p164Q562
$$ plain form
7817 -13596 -16804 -3960 16862 944 -14425 15458 13098 -3611 4413 26071 47813 42851 14798
7804 14798 4753 7849 2219 -14145 8047 42558 50384 35417 35903 20766 550 -7128 -475
7791 -475 18829 34219 18952 -20069 -15200 -16264 -5940 -15026 -6668 1247 10227 22631 12187
7778 12187 3810 6437 731 -6355 -14138 -15800 -5230 -8242 -16375 -5459 -1468 -3487 -9079 501
7764 501 10982 -9282 -24861 -25958 -22062 -20140 -20246 -39583 -22000 -872 21785 17287 17135 4622
7750 4622 -1418 -3937 -14048 -4237 16881 30631 27732 -5376 -25894 -6060 12182 4548 13560
7737 13560 20263 -1569 -13837 1650 -9981 -8115 5536 14533 5224 -6389 -9582 -3396 1804
7724 1804 -21737 -30051 -31181 -16592 -5561 -3136 -2196 -11313 -20361 -18467 -24886 -22271 -29435 -20873
7710b0873K267J1383M389j0396M8J5335K8184J8675J6005J747j0288j4336j5412
7697B6728l0132k841R518L466j8545r482j105j9905o124J9296J973R109r6O6R418
7682h656J1877L720K78O428o519m634r683j2812l620j453J3036l481j645J6282
7668h82j0269r347O170K63m618J271R252r599N171r57j724R129J2774K1938j2592
7653A5980P911L300k0589j6238k4581j4958J8416K1958J3844M696J6306p066k5877
7640f898p698K346Q666R899j2792J856J2275o235j2405j1586o932J0304K3052
7627C852Q797j33K769j4909j8259K240k391J2330L666j981M534m826q57J0991
7613E823m548j1219j2287Q387R600K1379J5369N390P112n418j9699j848l535J0451
$$ plain form
7710 -20873 -18606 -7223 -2834 -13230 -13182 2153 30337 49012 65017 66764 56476 42140 26728
7697 26728 -3404 -6245 3273 6739 -11806 -21288 -22393 -42298 -48422 -29126 -27153 -18044 -18140 -18074 -8656
7682 -8656 3221 6941 7219 13647 7128 2494 -7189 -20001 -23621 -25074 -12038 -15519 -17164 -882
7668 -882 -11151 -20498 -14328 -14065 -18683 -17412 -8160 -17759 -12588 -13545 -15269 -6140 6634 28572 15980
7653 15980 23891 27191 6602 -9636 -34217 -49175 -30759 -8801 5043 9739 26045 18979 -6898
7640 -6898 -14596 -12250 -3584 6315 -6477 -4621 7654 1419 -10986 -22572 -29504 -19200 3852
7627 3852 12649 12516 15285 376 -17883 -15643 -18034 -5704 -2038 -4019 515 -4311 -5168 5823
7613 5823 1275 -9944 -22231 -13844 -4244 17135 32504 37894 45006 39588 19889 18041 14506 24957
7599B4957k8869j2594O751j4399j0995J2115J9244j360r495j5900J4283K543j1866
7586b5585j2542j307n938J0567J1884K2822Q235J463N028J5352K703l465n358
7573B3859k5256k452M03k289K103N552J4053j0601q187O519n585j8300p896J0128
7559a7949J930k670J7940K5427R764N113j8389j0869J2634J2090j0372k8531j9737
7546b3619Q312O380J2348J0160j4614p55P9l344K294o378j0618J170R623r783
7532a8745M16n952n959m632J2850Q734j5273K0458N745j6073L009J2059n995k1992
7518c1350j7169q192K4487J0294j1528m160j215J273N469P096M620J114k2768
7505d2029J257O659L6263P204q971j2351l266j5572K2829O629j0990K569j710
$$ plain form
7599 24957 -3912 -16506 -9755 -24154 -35149 -23034 -3790 -5150 -14645 -30545 -16262 -13719 -25585
7586 -25585 -38127 -39434 -45372 -34805 -22921 -99 8136 9599 14627 29979 32682 29217 23859
7573 23859 -1397 -3849 -3446 -5735 -3632 1920 15973 5372 -2815 3704 -1881 -20181 -28077 -17949
7559 -17949 -16019 -18689 -749 24678 34442 39555 21166 10297 22931 35021 24649 -3882 -23619
7546 -23619 -15307 -8927 3421 13581 -1033 -1788 -1709 -5053 -2759 -9137 -19755 -18585 -8962 -18745
7532 -18745 -18329 -24281 -30240 -34872 -22022 -13288 -28561 -8103 -2358 -18431 -15422 -3363 -9358 -31350
7518 -31350 -48519 -56711 -32224 -21930 -33458 -37618 -38833 -37560 -32091 -24995 -20375 -19261 -42029
7505 -42029 -40772 -34113 2150 9354 383 -11968 -15234 -30806 -7977 -1348 -12338 -9769 -11479
7492a1479m910O926K397O15m786p348J0879L840J0405L5318J791j4355K351j29
7478C1515o991o160p627k9543j4280J0053J8168p687K26k147k523N323k1489k6225
7464e9387J2254J9075K7314m692P681j948k0683L717J8284j641N651k91k3299
7451a7965j9912o680K33J5292R279R863L84J307M56j7542K95R497O071J5737m728
7436A587J5829n79k3927L43J7247K0845R287j0522k8564k6838N966K914j1753
7423b8165j1969K4421N962O369j9750j0106J216J5489K2624N662j4149j9792r530
7410c1718J1962P150j290o096P097L09P929L4364j4719l1199j4607J1690l422
7397b2550J5007J6750J3971P067m333k455k0894o307p159o598J3853j4195j6116
$$ plain form
7492 -11479 -16389 -9463 -7066 -6451 -11237 -18585 -7706 -3866 6539 41857 43648 29293 31644 31515
7478 31515 24524 18364 10737 -18806 -33086 -23033 -4865 -12552 -12326 -14473 -16996 -11673 -33162 -59387
7464 -59387 -47133 -28058 -744 -5436 2245 297 -20386 -16669 1615 -26 5625 5334 -17965
7451 -17965 -37877 -44557 -44324 -29032 -19753 -9890 -9506 -8199 -7743 -25285 -24990 -15493 -9422 6315 1587
7436 1587 17416 16837 -7090 -6747 10500 31345 40632 30110 1546 -25292 -19326 -16412 -28165
7423 -28165 -40134 -15713 -9751 -3382 -23132 -33238 -32022 -16533 6091 11753 -2396 -22188 -31718
7410 -31718 -19756 -12606 -13896 -19992 -12895 -12586 -4657 29707 14988 -16211 -30818 -19128 -22550
7397 -22550 -7543 9207 23178 30245 25912 23457 2563 -3744 -10903 -17501 -3648 -17843 -33959
7384c3959J5831R525n43r37m611j7375q426k0957K8023K6617J5944j0353o8l553
7370d842r45P771j356K3933n450k0821j7855J5953J7561O254j2113o172J8591
7357B0509r62j6752r555j4834j1407N355Q950J6362P901N59p710P872k946k0595
7343a7253q276Q111J0191L304j144J2085P017o589J0855j6569k6411j5802R70
7330c9511J7853J9458M394Q438J2555R335j0862l05k7301p081J5196O787P313
7317A6269J3070J0743k6866k3117O574k473K154n173j3369N132Q481P656J2776
7304A1857j5383j4780J1102n101L321M682j0720j0300J2390L4488O248j0711l1136
7291a4043o986M471R111j3116P610K2957l620n391p980p742j4137l079Q854k634
$$ plain form
7384 -33959 -18128 -8603 -9146 -10083 -14694 -32069 -40495 -61452 -33429 -6812 9132 -1221 -1289 -4842
7370 -4842 -5787 1984 628 24561 19111 -1710 -19565 -3612 13949 20203 8090 1918 20509
7357 20509 19547 2795 -6760 -21594 -33001 -27646 -18696 -2334 5567 6126 -1584 6288 3342 -17253
7343 -17253 -25529 -17418 -7227 -3923 -5067 7018 14035 7446 18301 1732 -24679 -40481 -39511
7330 -39511 -21658 -2200 2194 10632 23187 32522 21660 21355 -5946 -13027 2169 8956 16269
7317 16269 29339 40082 13216 -9901 -3327 -5800 -3646 -8819 -22188 -17056 -8575 -919 11857
7304 11857 -3526 -18306 -7204 -12305 -8984 -4302 -15022 -25322 -12932 21556 27804 17093 -14043
7291 -14043 -21029 -16558 -7447 -20563 -12953 10004 6384 993 -6987 -14729 -28866 -31945 -23091 -25725
7277b5725J4548K1776j4316o132p336N843J1718j0669o465J6269L6398J5236j1300
7264C9845j8052j0594j909j6050M6K4042K7835j591m593l21k9418j3478r199j9341
7250c2778J1195J7318J7987J135p845K0397j3122p106j7716j7370k673K989j0304
7237c7893J7359K0643K455m961k379L907J2194j0401l740J4448Q959j9172p802
7224f383K1545j1829j0069J8991j5036j5345j0892o117K1948J7745J0574l822
7212A1310j9924J062J2273R047P427j2767L730k734r943K3098L3367K1183q895
7199F8234k1056j4338J0216J307k0795j8722o711q308o188J9082o59j6837K5749
7186A0974k0579j8198m18K3610P74o611N078L5565j2513k0905K2849M956L07K859
$$ plain form
7277 -25725 -11177 10599 -3717 -9849 -17185 -11342 376 -10293 -16758 -489 35909 51145 39845
7264 39845 21793 11199 9290 -6760 -6714 17328 45163 43572 38979 38658 9240 -4238 -13437 -32778
7250 -32778 -21583 -4265 13722 14857 7012 27409 14287 7181 -10535 -27905 -30578 -27589 -37893
7237 -37893 -20534 109 2564 -2397 -4776 -869 11325 924 -2816 11632 20591 1419 -6383
7224 -6383 15162 3333 -6736 12255 -2781 -18126 -29018 -35135 -13187 4558 15132 11310
7212 11310 -8614 -7552 4721 13768 21195 8428 12158 9424 -519 22579 55946 77129 68234
7199 68234 47178 32840 43056 44363 23568 4846 -1865 -10173 -16361 2721 2062 -14775 10974
7186 10974 -9605 -27803 -28221 -4611 -3837 -10448 -5370 30195 17682 -3223 19626 24582 24889 27748
7172B7748K724l2087n671J494L385J4676M533o715q387j0873P229Q472L629L599
7158A3756J992k0451p83Q196O65j84r006r161J023J4027J0853J982j7332J0304
7144E881N615k1528l092n741k01J5394J0j2182L822n88J761l173r698o182m39
7129c0341O281K120R923K0305M992r667m938J561Q093N636J1278M796j7329k9345
7115a6635l076K44J2240J7787N860o010N726j006k823p596J3307m760j0519J4541
7101A7280L5257K129p992k9904l22K77K618q533k27J8434l4931q895J4977L563
7087C731M188L117j8994J696K112J1546o961k455Q025K647N755J3085o989n663
7073A4840j1215l1011j2055p174K3575K7832J2058j5197k6215M995Q561J0496
$$ plain form
7172 27748 30472 -1615 -7286 -5792 -2407 12269 16802 10087 1700 -9173 -1944 6528 10157 13756
7158 13756 15748 -4703 -5486 2710 3375 3191 -5815 -14976 -13953 74 10927 12909 -4423 5881
7144 5881 11496 -10032 -13124 -18865 -19066 -3672 -3662 -15844 -12022 -12610 -10849 -14022 -23720 -29902 -30341
7129 -30341 -24060 -21940 -12017 8288 13280 3613 -1325 236 8329 13965 25243 30039 12710 -16635
7115 -16635 -19711 -19467 -7227 10560 16420 10410 16136 15130 12307 4711 18018 13258 2739 17280
7101 17280 52537 54666 46674 16770 16448 16725 19343 10810 10583 29017 -5914 -14809 168 3731
7087 3731 7919 11036 -7958 -6262 -4150 7396 435 -2020 6005 8652 14407 27492 20503 14840
7073 14840 3625 -27386 -39441 -46615 -23040 4792 16850 1653 -24562 -19567 -11006 -510
7061e10K442L602p16j6957l0977R079J4142l58j586k35J6687l822M95L798J839
7046c077j5481J203J1275O735r020J010J4801L730j3082j316J6839p819j1577
7033e779M201J1201k460j4203O112j017j8078o086R655l074P847J1100j7751q610
7019b6942o519p337L452K2326J2215M919O509j092o157L029p89j7388q250n505
7005b7529J1031J3077j0163j5737Q644j2482N096k27N335P841K654N500K526k199
6991f633r102N60J570R810r534J8072J6548J115j3008k9571j4527Q195J7056R217
6977b32m528p721P164Q818p510O296J4991N55N483K5946J7235l627m50k594l6909
6962B2917l4849J2313Q905N137J7595N389p017j6353k4097p565Q968J1529j9687
$$ plain form
7061 -510 1932 5534 4818 -12139 -43116 -34037 -19895 -20253 -21839 -22074 -5387 -9209 -8714 -4916 -3077
7046 -3077 -18558 -17355 -6080 655 -8365 -7355 7446 11176 -1906 -3222 13617 5798 -5779
7033 -5779 -1578 9623 7163 -7040 -928 -1945 -20023 -26109 -16454 -19528 -11681 -581 -18332 -26942
7019 -26942 -33461 -40798 -37346 -15020 -2805 2114 8623 7531 1374 4403 3614 -13774 -22024 -27529
7005 -27529 -16498 -3421 -13584 -29321 -20677 -33159 -28063 -28290 -22955 -15114 -12460 -6960 -4434 -6633
6991 -6633 -15735 -15175 -13605 -3795 -13329 4743 21291 22406 9398 -20173 -34700 -26505 -9449 -232
6977 -232 -4760 -12481 -5317 3501 -4009 2287 17278 17833 23316 49262 66497 62870 62420 59826 22917
6962 22917 -11932 381 9286 14423 32018 37407 30390 14037 -10060 -17625 -8657 2872 -16815
6949a6815j6756l914O318J6957J079j8715J0670L312K30m6J0298l0871m180n582
6935d8015Q058L0304j347l811K5996Q730j1672j6089O367r517O180J2843k251
6922E776j3866j8010J0454J755J9842p465j4086l2072J420M1631Q714j2807m98
6909i212K600l034J4605J9899M26j6978j8209k488J7068j4943j2033K065K1502
6896A268R831l494p28J962k7576l3765J6644O891j7156J4681L1890J8105j3541
6883E012n837K348j3360j3888j327k50J5129M197j823K0350k774j7200P05q36
6869i554P285j4931n50J1607q54q01J1990k244k4850K929K956L136N795j2193
6855b0279k5497J8660O638j2720Q807J104r611J1205p640n814R359K5231K174
$$ plain form
6949 -16815 -33571 -37485 -31167 -14210 -13131 -31846 -21176 -17864 -17634 -17680 -7382 -38253 -42433 -48015
6935 -48015 -39957 -9653 -11000 -14811 11185 19915 8243 -7846 -1479 -10996 -4816 8027 5776
6922 5776 -8090 -26100 -15646 -13891 5951 -1514 -15600 -47672 -46252 -4621 4093 -8714 -9212
6909 -9212 -6612 -9646 4959 24858 25284 8306 -9903 -12391 4677 -10266 -22299 -20234 1268
6896 1268 11099 7605 6877 8839 -18737 -52502 -35858 -28967 -46123 -31442 448 18553 5012
6883 5012 -825 1523 -11837 -25725 -27052 -27302 -12173 -7976 -9799 10551 7777 -9423 -8718 -9554
6869 -9554 -2269 -17200 -17750 -6143 -6997 -7798 4192 1948 -22902 -19973 -17017 -13881 -8086 -20279
6855 -20279 -45776 -27116 -20478 -33198 -24391 -23287 -32898 -21693 -29333 -35147 -25788 -557 1617
6842A617m16j9987l522L897l497m651P379k975j9577j3709J2217l406l33R308
6828c7655K5979K5920k207J0806J2909Q550l7155n5226J9405R445J5887J8768
6816A5426l0113o277j2864O314Q591j295m630j6032k973j333K0439K2765j6313
6803a8295R085J8148J115k5983m954K0763J1056M850m640K807k335n089o788J670
6789A410j2059m291P240J905N222p412n50n560o154K467N613K768J50j833j296
6774a2380L857k309J7250J3316p754j0941p558J4082J2940P90p518l49k829j0771
6760a74j476K1369Q486k0217k943K657p558n116j2895J35K2090Q671j1774p774
6746f519O850P713J3378Q602q98k1777j1115J302R602k456k431P38j4417k023
$$ plain form
6842 1617 1201 -18786 -22308 -18411 -21908 -26559 -19180 -22155 -41732 -55441 -43224 -46630 -46963 -37655
6828 -37655 -11676 14244 12037 22843 35752 44302 7147 -48079 -28674 -19229 -3342 15426
6816 15426 -14687 -20964 -33828 -27514 -18923 -20218 -24848 -40880 -43853 -45186 -24747 -1982 -18295
6803 -18295 -9210 8938 10053 -15930 -20884 -121 10935 15785 11145 13952 11617 6528 -260 1410
6789 1410 -10649 -14940 -7700 -5795 -573 -7985 -8535 -14095 -20249 -17782 -12169 -9401 -9251 -11084 -12380
6774 -12380 -8523 -10832 6418 19734 11980 1039 -6519 7563 20503 21293 13775 13426 10597 -174
6760 -174 -1650 19719 28205 7988 5045 7702 144 -4972 -17867 -17732 4358 13029 1255 -6519
6746 -6519 331 8044 21422 30024 29126 7349 -3766 -2464 7138 4682 2251 2989 -11428 -13451
6732a3451J997j0062k6462M292L4566K7237R370M024n642j8511R257m010l3916
6719b1311k3073J3024K2159R03o089P422r491o152j2403J3687q089J0700k676
6706b1389k3051P477K3962J2049K3823J0829l862j0200M861p872j4829R60J4273
6693A7031M151p392L613j8397p588j336J2496K87N69j1022o52J6288J9818j711
6679B6155O611o021j5095p098j4943q140n835K0147j1673K422L203j859j508k280
6665a5914Q50r046J8208O448j1788K8327J5077j877j229P074J3949K0738r054
6652F1763k8704j4298j6165J359M194J672j8318n536K262P955p957J851J3061
6639C139L0824J5556k0183J5607J8058J8610j2936l4679N226J6240R552N932k6967
$$ plain form
6732 -13451 -11454 -21516 -47978 -43686 -9120 18117 27487 31511 25869 7358 16615 12605 -21311
6719 -21311 -44384 -31360 -9201 -8298 -14387 -6965 -16456 -22608 -35011 -21324 -29413 -18713 -21389
6706 -21389 -44440 -36963 -13001 -952 22871 33700 29838 19638 24499 16627 1798 2758 17031
6693 17031 21182 13790 17403 -994 -8582 -9918 2578 2865 3434 -7588 -8240 8048 27866 26155
6679 26155 32766 26745 11650 4552 -10391 -18531 -24366 -4219 -15892 -13470 -10267 -12126 -13634 -15914
6665 -15914 -15064 -24110 -5902 546 -11242 17085 32162 30285 29056 36130 50079 70817 61763
6652 61763 33059 18761 2596 3955 8149 9821 -8497 -14033 -11771 -3816 -11773 -9922 3139
6639 3139 33963 49519 29336 44943 63001 81611 68675 33996 39222 55462 65014 70946 43979
6626D3979j0839K4186J9542K0979K5515n131J9741M6726Q0653J21156J95522J39997
6614G22026j09127j67207j04810k9507k1573j200L0388N2056N9253Q7720J48716
6603F66735J96218K68321L70933M81762P38531J366946K712125N298871P965901
6594B0066343L005798o239636o913335l965205j917740j004769o10853m35322
6586A985281l98686l45914k28116j32715j08875j06250q6242p3893m9848k3592
6576D31150K9040J08893J57871M7163j53337j57577j44527o1809l5840k7121l6949
6565A56957l8961l816J320j1046J693o906j9865n457m832k4150q327L083L984
6552D3677O311j3323j5341P374L0K0011J7366r458j897j5595m872l250M338N232
$$ plain form
6626 43979 33140 57326 76868 97847 123362 118231 137972 184698 265351 386507 582029 722026
6614 722026 612899 445692 340882 311375 289802 288602 318990 371046 430299 518019 666735
6603 666735 862953 1131274 1502207 1983969 2722500 4089446 6801571 12100442 20066343
6594 20066343 23072141 16832505 9919170 5953965 4036225 3031456 2420603 1985281
6586 1985281 1586595 1240681 1012565 879850 770975 664725 578483 504590 454742 431150
6576 431150 460190 569083 726954 774117 620780 463203 318676 256867 221027 193906 156957
6565 156957 117996 114180 115500 104454 106147 99241 79376 73919 69087 44937 36610 39693 43677
6552 43677 49988 36665 21324 28698 28728 48739 66105 56647 54750 39155 34283 31033 35371 40603
6538D0603k0522P625N896j4357p036L257k019N548L540Q370M92q322N752j0092
6524A8735k393J244J2923J545p281k911K234k0916j1912K0210p059j7152k586
6511a5319P732J7504J7823j7890j5824O952L950J578K0721K4403j2293k4076L657
6498A8918N00j7506r702L174p182n574J1256N761l264j093J2379K556J0099j1990
6484H332q050L601M805K4838j6433L184p515j8160n51P392J2891J9948r815k0844
6470C623p317L506j6474l1980k729M108J6682J9453j6822Q171K2111J0266j716
6457A0882j47k7862j4564K1179L0953J3503n730j7292J3773J1217j455j6053j8760
6444c56J565j768l068j0988M284N898j3930l947K320J1322m470m761o268J2442
$$ plain form
6538 40603 20081 27706 33602 19245 12209 15466 13447 18995 22535 30905 31397 23075 28827 18735
6524 18735 16342 17586 30509 32054 24773 21862 24096 3180 -8732 11478 4419 -12733 -15319
6511 -15319 -7587 9917 27740 9850 -5974 978 4928 6506 27227 51630 39337 15261 18918
6498 18918 19418 1912 -7790 -4616 -11798 -17372 -6116 -355 -3619 -4712 7667 10223 20322 8332
6484 8332 282 3883 8688 33526 17093 20277 12762 -5398 -5949 1443 14334 34282 24467 3623
6470 3623 -3694 -188 -16662 -48642 -51371 -47263 -30581 -11128 -27950 -19779 2332 12598 10882
6457 10882 10735 -17127 -31691 -10512 20441 33944 28214 10922 24695 35912 34457 18404 -356
6444 -356 1209 -559 -3627 -14615 -10331 -4433 -18363 -22310 -19990 -8668 -13138 -17899 -24167 -11725
6430a1725J2944o311J69J8935J1757n910j9123k9450k274J3863R965K1465J994
6417A6299k3168J7179J1086j4868l1360j387r71P621J0408J2586l193M961J2864
6404A8057l333k1690j3679P627Q242L358k0492o557j183N86l76L896J603K280
6390b1661J4969K7222Q733j2797p818Q342M488k1237l203L049R20J2338P996L524
6376B4865j5260p605k42k0707j2584j054K2861O683l166l051m331L583J5751Q17
6362F560j2528R475R184K1144n631r058k6551k276j4860j7283J2496K4038P888
6349B598n510j5702J0625P32n36J979J701J2836J1150j6897j8382J7560J5042
6336A7196M171N630o045q040j0311N746l154j0005k0208J898K323P073m04J0909
$$ plain form
6430 -11725 1219 -5092 -4923 14012 25769 19859 736 -28714 -30988 -17125 -7160 14305 16299
6417 16299 -6869 10310 21396 6528 -24832 -26219 -27190 -19569 -9161 3425 232 5193 18057
6404 18057 14724 -6966 -20645 -13018 -4776 -1418 -21910 -28467 -29650 -29064 -29440 -25544 -23941 -21661
6390 -21661 -6692 20530 29263 16466 8648 16990 21478 241 -2962 87 1007 13345 21341 24865
6376 24865 9605 2000 1758 -18949 -31533 -32587 -9726 -3043 -6209 -9260 -13591 -10008 5743 6560
6362 6560 -5968 3507 12691 33835 28204 19146 -7405 -9681 -24541 -41824 -29328 -5290 2598
6349 2598 -2912 -18614 -7989 -7257 -7793 -5814 -4113 8723 19873 2976 -15406 2154 17196
6336 17196 21367 26997 20952 12912 2601 8347 5193 -4812 -25020 -23122 -20799 -13726 -14130 -3221
6322c221J7527K473q093N034J4752k5334l6808n235K8705L571P946K601j1336
6309g418j2887L753K2272J1207K362j2125n516j4600L584L394k4802m318O608
6296b8486j064J8137J9912R274k3L357M255j7332j0654q39m557Q075K3511J4711
6282C8277k4991j9150J87K764J3445J7554N985j6170j6025j9137K0906j9035j7950
6269c3340K7202o385J1746K141j0147p871l695K05n444N184J6383J3069o291K1613
6255B4370j1122k4299n151M190K1248R34j750j9148l4547R177P680J4660k3727
6242c7485k999K4769J3253k634k0180J63J6782r548j9909j014L2529O389j0173
6229a0057r569J1892J8591R365j1762o869J4206J6359J5575Q768J2343O990n704
$$ plain form
6322 -3221 14306 16779 8686 13720 28472 3138 -33670 -38905 -10200 -6629 1317 3918 -7418
6309 -7418 -20305 -16552 5720 16927 19289 7164 1648 -12952 -9368 -5974 -30776 -35094 -28486
6296 -28486 -29550 -11413 8499 17773 17750 21107 25362 8030 -2624 -3463 -8020 55 23566 38277
6282 38277 13286 -5864 -5677 -2913 10532 28086 34071 17901 1876 -17261 3645 -15390 -33340
6269 -33340 -6138 -12523 -777 1364 -8783 -16654 -20349 -20144 -25588 -20404 -4021 9048 2757 24370
6255 24370 13248 -11051 -16202 -12012 9236 10170 8420 -10728 -45275 -36098 -28418 -13758 -37485
6242 -37485 -40484 -15715 -2462 -5096 -25276 -25113 -8331 -17879 -37788 -38802 -6273 116 -10057
6229 -10057 -19626 -7734 10857 20222 8460 1591 15797 32156 47731 56499 68842 75832 70128
6216G0128O273M31k3691j3621j5240j795J0541J2086j2875n809m239k7158p150
6203a2119J4753l027j7634J6382P139J2833J9479K2280j9854j9080j7033L120
6191G239J2694p344j4426P46q792M560N465o081k275r942N361M5248K372k2728
6177A2097j4667j2108J7367P121J721M656O107j7185j7513j229j4248L085J6747
6164h049J9829J6352J1361p507n388N365p056P925r676J663k009k4478j2078J977
6150a1769K162J5351k040L829J3305K561L038R463K0089J5121j6239k6561k3732
6137D578j1632k7462o427K637O827R311P348J1731j1359P744n356m035O035j1227
6123b1287N887M184J5238p416l298j831l135J6726o949j4638M663L474j0022L083
$$ plain form
6216 70128 76401 76832 53141 39520 24280 22485 33026 45112 32237 26428 22189 -4969 -12119
6203 -12119 2634 -393 -18027 -1645 5494 18327 37806 60086 40232 21152 4119 7239
6191 7239 19933 12589 -1837 -1091 -9883 -5323 142 -5939 -8214 -18156 -12795 32453 34825 12097
6177 12097 -2570 -14678 2689 9810 11531 16187 22294 5109 -12404 -13633 -27881 -24796 -8049
6164 -8049 11780 28132 39493 31986 26598 31963 24907 32832 23156 24819 22810 -1668 -13746 -11769
6150 -11769 -9607 5744 3704 7533 20838 23399 26437 35900 55989 71110 54871 28310 4578
6137 4578 -7054 -34516 -40943 -38306 -31479 -22168 -14820 -3089 -14448 -6704 -12060 -16095 -10060 -21287
6123 -21287 -15400 -11216 4022 -3394 -6692 -8523 -11658 5068 -1881 -16519 -11856 -8382 -18404 -15321
6109a5321P563j1418n107l825K0039N74k1658n665N203R010K6183L904j2894J1217
6095G805J8596j0470m838k4315l079L561J1869J4698j2848k0003J567K612l642
6082a8487o67m500J193n694N456J6103j0571j710j85J7655j054q997N297p574
6068a3735o248K0322Q161J2047l538n396L437p868j5138j0865K271J7030P958
6055H438l633o779l030R275J415j0492k6605n761p561Q931J1219j620L341m07
6041b3269L965K5133L94j6187o555J9914L1860m22j6311M664J893j4062p948j5541
6027a2472J3668R404p099N176L332j199K212j2305l417J7508j1226M540l672o387
6013a937j3696p080M966k4419j0269J4467K6588J9929N678j3906j3575q545N927
$$ plain form
6109 -15321 -7758 -19176 -24283 -28108 -8069 -7495 -29153 -34818 -29615 -20605 5578 9482 -3412 7805
6095 7805 26401 15931 11093 -13222 -16301 -12740 -871 13827 979 -19024 -17457 -14845 -18487
6082 -18487 -19154 -23654 -22461 -28155 -22699 -6596 -17167 -18877 -19062 -1407 -2461 -11458 -6161 -13735
6068 -13735 -19983 339 8500 20547 17009 11613 15050 7182 -7956 -18821 -16550 480 8438
6055 8438 4805 -1974 -5004 4271 5686 -4806 -31411 -37172 -44733 -35802 -24583 -26203 -22862 -23269
6041 -23269 -19304 5829 6223 -9964 -16519 3395 35255 34833 18522 23186 25079 11017 3069 -12472
6027 -12472 1196 10600 3501 8677 12009 10810 13022 717 -2700 14808 3582 8122 4450 -1937
6013 -1937 -15633 -22713 -17747 -42166 -52435 -37968 -11380 8549 14227 321 -13254 -21799 -15872
6000a5872L180J784J2829J14j2698J1247J2682j1904P077o264j3613N900r583
5987a5121R961R27r006J0128m9j9222l679Q394L0703J3011j6648l648p80J4809
5973A9780K1024L638l609l210o029k2726L569R900j6509k5776R548K347M079K4173
5959B0199j3689P285l678J061j4754j7029j5682M442K2838J4422k0062N140J9236
5946I729O419p808j1750j538o443L83j0373j3543r734Q201J6181R385r072n980
5932b5943J103J1602n271K796j5340K778q591j3364N157J9693K3833P138J548
5919G139J1527J8029j5772k7505r882l562J8566R085j4736m883L1572Q091m54
5906B7215O75j4760p128j9038K37j076J90j1260l0561K8496K8509J510m331q46
$$ plain form
6000 -15872 -12692 -10908 1921 2035 -10663 584 13266 1362 8439 2175 -11438 -5538 -15121
5987 -15121 -5160 -4233 -13239 -3111 -3160 -22382 -26061 -17667 13036 26047 9399 5751 4971 19780
5973 19780 40804 44442 40833 37623 31594 8868 12437 22337 5828 -19948 -10400 -8053 -3974 20199
5959 20199 6510 13795 10117 11178 -3576 -20605 -36287 -31845 -9007 5415 -14647 -9507 9729
5946 9729 16148 8340 -3410 -4948 -11391 -11008 -21381 -34924 -44658 -36457 -20276 -10891 -19963 -25943
5932 -25943 -24840 -13238 -18509 -15713 -31053 -28275 -36866 -50230 -45073 -25380 -1547 5591 7139
5919 7139 18666 36695 20923 -6582 -16464 -20026 -1460 7625 -7111 -11994 19578 27669 27215
5906 27215 27890 13130 6002 -13036 -12799 -13875 -13685 -24945 -55506 -27010 1499 3009 -1322 -2168
5892b168O519J6892M332j901j2900o664J3195J1564j6709j1551j203R593q734
5879B65J97J504J6945Q743P33j6110j9164P970K1314L697l6221r661J7375j1004
5865a3417J0005J8863O45j1744P397J077P473k500l568j2204r064j076o18l547
5851a2278k926q001j0064R271r298R427m016J3804K3124k01o78O010J7990r539
5837B2625l1046R833j0148m146K5852m811Q940O130k799j8523q176j3290J4602
5824d957R085l167P595J965j1752k436m868p950k380l996L416J8206R114j0971
5810c096l962j638o691k0486m628J5374n963j9880J0093K8908P006q800j3025
5797b6788k626l147J6516Q320l141j550k399R8M725Q329O436j5119J3311J8769
$$ plain form
5892 -2168 4351 21243 25575 23674 10774 4110 17305 28869 12160 609 -594 8999 265
5879 265 462 1966 18911 27654 28387 12277 -6887 1083 22397 26094 -10127 -19788 -2413 -13417
5865 -13417 -3412 15451 16096 4352 11749 12826 20299 17799 14231 2027 -7037 -8113 -8731 -12278
5851 -12278 -15204 -23205 -33269 -23998 -33296 -23869 -27885 -14081 9043 8842 8164 14174 32164 22625
5837 22625 -8421 1412 -8736 -12882 12970 8159 17099 23229 20430 1907 -6269 -19559 -4957
5824 -4957 4128 961 8556 10521 -1231 -3667 -8535 -16485 -18865 -22861 -19445 -1239 7875 -3096
5810 -3096 -7058 -8696 -15387 -35873 -40501 -25127 -31090 -50970 -40877 -11969 -4963 -13763 -26788
5797 -26788 -29414 -32561 -16045 -7725 -10866 -12416 -14815 -14717 -9992 -1663 4773 -10346 2965 21734
5783B1734r273j6132k2430J704k488p045J3607l925l696q06K0082j1592p082J6726
5769a0616k90j4952r557N758J5928J3263k0659l545O244k943J7817P662k277J0641
5755A2474J134j6607j9388J418P201j5958n879J9178m130J5271L713J1435J245
5742A1107k1677R556j873r927j5589K478K0051K2556m573q179j1629j1465j987
5729b1151K824L5J3722M152N351j5181M17J4823o156l864J86J769o284J0346j6097
5714a5108Q799m202J5315q670r410m63M948K1041n87k9727q518J0668J3034k538
5700e418L182p036k4188o153J5627L1499K7487r991j5781k7869k6850M977L0992
5687i522J0137K099j0941j0676J7459J1619R518j2159m410r767O411k54n411J690
$$ plain form
5783 21734 12461 -3671 -26101 -24397 -26885 -33930 -20323 -24248 -27944 -28750 -8668 -20260 -27342 -10616
5769 -10616 -10906 -25858 -35415 -29657 -13729 -466 -21125 -24670 -18426 -21369 -3552 4110 1833 12474
5755 12474 13608 -2999 -22387 -20969 -13768 -29726 -35605 -16427 -20557 -5286 -1573 9862 11107
5742 11107 -10570 -1014 -2887 -12814 -28403 -25925 -5874 16682 12109 3930 -7699 -19164 -21151
5729 -21151 -18327 -18292 -4570 -418 4933 -10248 -9831 4992 -1164 -5028 -4842 -3073 -9357 989 -15108
5714 -15108 -6309 -10511 4804 -3866 -13276 -13739 -8791 12250 11663 -18064 -26582 -15914 -2880 -5418
5700 -5418 -2236 -9272 -33460 -39613 -23986 7513 35000 25009 9228 -18641 -45491 -40514 -9522
5687 -9522 615 2714 -8227 -18903 -1444 10175 19693 7534 3124 -6643 -232 -486 -5897 -4207
5673d207K0346M309q228j1758J6036M12M489j4398j3578j0072p284K615Q393P50
5659a2175K6376J5082j352q560q569l169p909J6268j2399k9827o216O839J7531
5646h080q125l2598j9793Q632O105K2932L876j4474R803r388k91P925J8048J2689
5632b739m998M754Q172o033j5170o566Q399J3044r293o016R81J290N391o653p009
5617b2446k803n259K6092L0243n594j3161k239P075j669o788j204N079k189p294
5603b157M645n637K441K9131J0959j0799m4298j1779L403Q918M419R84l733j0570
5589b4073K5373K013J4645J1255n720q910j3094J1783n161j3104k5841M404J9650
5576f780O748p929k2655J2026J3212R705J961j5429m483J5802J953j784j394J4533
$$ plain form
5673 -4207 16139 20448 12220 462 16498 16910 21399 7001 -6577 -16649 -23933 -21318 -12925 -12175
5659 -12175 14201 29283 27931 19371 10802 7633 -276 15992 3593 -26234 -32450 -25611 -8080
5646 -8080 -16205 -48803 -68596 -59964 -53859 -30927 -27051 -41525 -31722 -41110 -41401 -33476 -15428 -2739
5632 -2739 -7737 -2983 5189 -844 -16014 -22580 -14181 -1137 -10430 -16446 -15465 -14175 -8784 -15437 -22446
5617 -22446 -25249 -30508 -4416 25827 20233 7072 4833 11908 10239 3451 2247 7326 5137 -2157
5603 -2157 2488 -3149 -708 28423 39382 28583 -15715 -27494 -24091 -15173 -10754 -9770 -13503 -24073
5589 -24073 1300 3313 17958 29213 23493 14583 1489 13272 8111 -4993 -30834 -26430 -6780
5576 -6780 -32 -7961 -30616 -18590 -5378 4327 6288 -9141 -13624 2178 4131 2347 953 15486
5562A5486L466j2626j2958o563K880m035R932L9635N489j3482k5778j7816J9217
5549B847O659K1525J333j3721j9541P430J8563J1191l6549k4192o886J0557K8820
5536H036k953j0171j683J1446N806J4384M259k3609j8677J113K2636l019j0210
5523b642N649M520j835j7867j3599K83K5442N464k2976j3717K2841K8029J4135
5510C3727p549p95j6291j4879M035j5018o299n785p174J5394n433l0139j1488
5497f7694J3486L2090K3893J1057o888k6996R684M0520N424r441j425k87j797
5484B1626j1924m613P702p079j6853q073j259J2053n206J043O854J2674j131k1368
5470a5554J1461K863j7169K976l009J7688N235j2132o401q342K1K913l918O165
$$ plain form
5562 15486 18952 6326 -6632 -13195 -10315 -14350 -4418 35217 40706 27224 1446 -16370 2847
5549 2847 9506 31031 32364 18643 -898 6532 25095 36286 -263 -24455 -31341 -20784 8036
5536 8036 5083 -5088 -6771 4675 10481 24865 29124 5515 -13162 -12049 10587 7568 -2642
5523 -2642 3007 7527 5692 -12175 -25774 -25491 -49 5415 -17561 -31278 -8437 19592 33727
5510 33727 26178 25383 9092 -5787 -1752 -16770 -23069 -28854 -36028 -20634 -26067 -56206 -67694
5497 -67694 -54208 -22118 1775 12832 5944 -21052 -11368 29152 34576 25135 23710 23423 21626
5484 21626 9702 5089 12791 5712 -11141 -19214 -20473 -8420 -13626 -12583 -5729 6945 5814 -15554
5470 -15554 -4093 -1230 -18399 -15423 -18432 -744 4491 -7641 -14042 -22384 -22363 -19450 -23368 -17203
5456a7203J3197J8957j6567k2707J2555K6823Q297n580j8023j1965j2023J3003
5444a1236K8733r061j4292k262L718j9949M123L5191P98q337J589J6236J0322
5431C5573K377n303j2059r628j2547K440p802K519J3912L376ok2879j3104J117
5417b2014J380L600J9046j4214k406m963J1804J7946M732j3946K258m682J9444
5404A7985O454l474r167N37k343j9140j1034j912J5176J6675L203q664q726J7095
5390A2665j1366j0084j884J6498K766j6391j5029n396j0027J0161L058J2260l850
5377a6619M526j1526k5926J6736M0736M224m124O00j48p673k5036J59l133j9308
5363d6512J9763J5075r306Q912K2203K2044p832n853o565j3596q103K0667J2904
$$ plain form
5456 -17203 -4006 14951 -1616 -24323 -11768 15055 23352 17772 -251 -12216 -24239 -11236
5444 -11236 17497 8436 -5856 -8118 -4400 -24349 -20226 14965 15763 7426 9015 25251 35573
5431 35573 37950 32647 20588 10960 -1587 853 -6949 -4430 9482 12858 12852 -10027 -23131 -22014
5417 -22014 -20634 -17034 2012 -12202 -14608 -19571 -7767 10179 14911 965 3223 -1459 17985
5404 17985 24439 20965 11798 12335 9992 -9148 -20182 -22094 -6918 9757 12960 4296 -4430 12665
5390 12665 1299 -8785 -10669 5829 8595 -7796 -22825 -28221 -38248 -28087 -25029 -12769 -16619
5377 -16619 -12093 -23619 -49545 -32809 7927 12151 8027 8627 8479 806 -24230 -24071 -27204 -46512
5363 -46512 -26749 -11674 -20980 -12068 10135 32179 24347 18494 11929 -1667 -9770 10897 23801
5350B3801N124Q136j3821j1453Q377M19l0921n14j6621j6625J0035J4624O016
5337a3423j2540j4324j5165R800K1057P112J508j6865k1734L847Q821J9099J0849
5324a1958J8565k148k3916q13n586K1153j7244P88R618K5338m834J344M940k238
5310A3009j760R094j481o379k2594J0711o586l666r209k735J0321m245K711L0666
5296A7857l924j9384j1806j6608j2925J0010L7289J9605j4543k677l01k529j263
5283a199j9558r396M349L980J1624J142j4458j5159J8886L059p148L6785L3545
5270D6452o52k0114j4058k0420k3400l809J1327L929l645j8040J4411Q798K2198
5257B977o736J0038M353J408J7980J2078j5633j7759n591l3081l008L2789n166
$$ plain form
5350 23801 28925 37061 23240 11787 20164 20583 -10338 -10852 -27473 -44098 -34063 -19439 -13423
5337 -13423 -25963 -40287 -55452 -45652 -24595 -17483 -15975 -32840 -54574 -50727 -41906 -22807 -11958
5324 -11958 6607 4459 -19457 -20270 -25856 -4703 -21947 -21159 -11541 13797 8963 10307 15247 13009
5310 13009 11249 20343 18862 12483 -10111 600 -5986 -9652 -18861 -21596 -11275 -15520 -12809 17857
5296 17857 13933 -5451 -17257 -33865 -46790 -36780 509 20114 5571 2894 2593 64 -1199
5283 -1199 -20757 -30153 -25804 -21824 -10200 -9058 -23516 -38675 -19789 -16730 -23878 12907 46452
5270 46452 45800 25686 11628 -8792 -32192 -36001 -24674 -20745 -24390 -42430 -28019 -19221 2977
5257 2977 -3759 6279 10632 12040 30020 42098 26465 8706 3115 -29966 -32974 -185 -5351
5244e351j0743M375J7424l71k1261J679j6493p978K3067J0347N186P818K142o206
5230C635o11K101p674K745R597j389K0179O808j2208l674j4148l639P625L090
5216A2437k1082j7760J6719J2723J931K133p083J1182Q510j3947M018K5113O663
5203D1557q260k28p062k279l2644k4273J013Q582n02K9585Q125k4250j4060l360
5189b8056q56N211N622j7058J0424o28r586J2242J0973J0111O836N513n656k1150
5175a6058j5903J3892p533m691p144j2079P188J005k808K8239J4866j25k624r174
5161a2949M861K095O834J1134o852k456K302J974j7625p204p370M754K1489L388
5147D375k5724o84J8182m704j3848l0778J2655J4119J1304J702k0399k760J7559
$$ plain form
5244 -5351 -16094 -11719 5705 5334 -15927 -14248 -30741 -38719 -15652 -5305 -119 7699 9841 3635
5230 3635 3024 5125 -2549 196 9793 8404 28583 35391 23183 19509 5361 1722 9347 12437
5216 12437 -8645 -26405 -9686 3037 4968 7101 18 11200 19710 5763 9781 34894 41557
5203 41557 33297 33069 26007 23728 -8916 -33189 -32176 -23594 -24096 5489 13614 -10636 -24696 -28056
5189 -28056 -28912 -23701 -18079 -35137 -24713 -25341 -34927 -22685 -11712 -1601 5235 10748 5092 -16058
5175 -16058 -31961 -18069 -25602 -30293 -37437 -49516 -42328 -41323 -44131 -15892 -1026 -1151 -3775 -12949
5161 -12949 -8088 -5993 841 11975 5123 2667 4969 6943 -10682 -17886 -25256 -20502 987 4375
5147 4375 -21349 -22033 -3851 -8555 -22403 -53181 -40526 -26407 -15103 -13401 -33800 -36560 -19001
5134a9001J3677q265M257O721q264R408j564j5492J6743O777j9706k8043j99J3153
5120b9798J122j716L893l527M810Q030q684l10N465M635M331J5396J6660j1467
5106H840j7838M488J0203M216p742n865l901J6295J0130J6147p534k3144j796
5093B499P702j0501jj229J357j247n009k896J9786O470L179m689j5727j4267l865
5078a8438j3158r283J593J0826J5316n325j3095J513M647J7159J1737m493j0294
5065a1295O049J495l65j4604Q266K6253J063j8259k7158N710J1415q568m56J4870
5051e584J1000R08l359q845J2556j3316n277n855J3264J1068n451j3288K455Q856
5037h68n796R954k2408o280K1785k0595J1779J0457K801k1192O337N407o129L763
$$ plain form
5134 -19001 -5324 -13589 -9332 -2611 -10875 -1467 -3031 -18523 -1780 4997 -14709 -42752 -42951 -29798
5120 -29798 -28676 -30392 -26499 -30026 -25216 -17186 -25870 -26180 -20715 -16080 -11749 3647 20307 8840
5106 8840 -8998 -4510 5693 9909 2167 -3698 -7599 8696 18826 34973 27439 4295 2499
5093 2499 10201 -300 -301 -1530 -173 -1420 -6429 -9325 10461 16931 20110 15421 -306 -14573 -18438
5078 -18438 -31596 -40879 -39286 -28460 -13144 -18469 -31564 -30051 -25404 -8245 3492 -1001 -11295
5065 -11295 -5246 -3751 -4116 -18720 -10454 15799 16862 -1397 -28555 -22845 -11430 -19998 -20454 -5584
5051 -5584 5416 6324 2965 -5880 6676 -6640 -11917 -17772 -4508 6560 1109 -12179 -9724 -868
5037 -868 -6664 3290 -19118 -25398 -3613 -24208 -12429 -1972 829 -20363 -14026 -8619 -14748 -10985
5023a0985P970N605K6349j6280j0555M716N28r001j0181o279n549J7230J2387
5010E955J0498j1283K422n813J0632l937o721l982k641J7697n647k0429O381k647
4996i515J3813J3348J5741r226J663k8003J197J1950j6096Q659P749p403j1059
4983g182j910O407j3269k6756J7460J6127n312J2152N464J716M252P533Q61Q729
4969B6272j9734l6172Q816K2391M455k5021k9497l495L5902N642q433J2808M032
4956b034J498j2680k1984N888P288o368n657L5941k147n817J1402J1078R451L262
4942B9121l534n278p196l0207p477J8505J8629J8902j0418j1969P893n741j1597
4929c67k2673p716J1598J3677k136j8149P243J8546p881n664j0992L248j2767
$$ plain form
5023 -10985 -3015 2590 28939 12659 2104 6820 7348 -1653 -11834 -18113 -23662 -6432 5955
5010 5955 16453 5170 7592 1779 12411 8474 1753 -2229 -4870 12827 7180 -13249 -6868 -9515
4996 -9515 4298 17646 33387 24161 25824 -2179 -982 10968 -5128 3531 11280 3877 -7182
4983 -7182 -9092 -2685 -15954 -42710 -25250 -9123 -14435 -2283 3181 4897 9149 16682 17543 26272
4969 26272 6538 -29634 -20818 1573 6028 -18993 -48490 -51985 -16083 -10441 -18874 -6066 -2034
4956 -2034 -536 -13216 -35200 -29312 -22024 -28392 -34049 1892 -255 -6072 5330 16408 25859 29121
4942 29121 25587 20309 13113 -17094 -24571 -6066 12563 31465 21047 9078 16971 11230 -367
4929 -367 -23040 -30756 -19158 -5481 -7617 -25766 -18523 23 -7858 -13522 -24514 -21266 -34033
4916c4033M683J9631J2685K7605M669l1088k0435j538K0771J683j3813K703m215
4903a0692Q801j1476j0242o310R577P536j1434j894O652j2516j405J8516M318
4890a0569p740K3825J5067n746j1754K395J7132K703L332j8854j2439K332L942
4877C626J10r707K265R965j383j3546N132Q337M638r535n510k1770L204N505R434
4862i235K8547m241J5296J5240l797k7729j1507M175m702j6479k1705J749N478
4849b8910M391K8914N182n301J0033Q165j4498k6425J2973J2755J5970J3392r543
4836B7098l410j3699o74M110m925K620J4854o451m1946k639J3970J0311p431k4450
4822c2662j2583K3859L4865j2969j7026j3658j842P336J1190K0976J4172j243
$$ plain form
4916 -34033 -29350 -9719 2966 30571 35240 4152 -16283 -17821 2950 4633 -9180 -6477 -10692
4903 -10692 -1891 -13367 -23609 -29919 -20342 -12806 -24240 -26134 -19482 -31998 -33403 -14887 -10569
4890 -10569 -18309 5516 20583 14837 3083 5478 22610 25313 28645 9791 -2648 -316 3626
4877 3626 3736 -5971 -3706 6259 4876 -8670 -3538 4799 9437 -98 -5608 -27378 -24174 -18669 -9235
4862 -9235 19312 15071 30367 45607 41810 14081 2574 6749 2047 -14432 -36137 -34388 -28910
4849 -28910 -24519 4395 9577 4276 14309 22474 7976 -18449 -5476 7279 23249 36641 27098
4836 27098 23688 9989 9315 13425 8500 11120 25974 19523 -22423 -25062 -11092 -781 -8212 -32662
4822 -32662 -45245 -21386 13479 510 -16516 -30174 -32016 -24680 -13490 7486 21658 20415
4810B0415k7803k3857J412J3014J6777J7029o096j4875K705K160J1000P721j9095
4797E07N91p081J846P650J0995O201j0465p464k3091j3304J9234N830J2302j3256
4783i505j1861K605L184R244q527M180j078p553J3961O816k519k7363l268p34
4769c2418K7193P960j6565j9369K7945L369r484J882J7468Q065l1104r629K557
4756b2130m17J7702j3402j8700j0519J8045L256K2388J1644M566M814j4983q17
4743A447L1849j8678k2809n020r93k992J5227J1891J9992M329p251j9597k3256
4730a5861O545J4940J710L450j4707j5903l023p129K148m256K3p911O990J200
4716c1784n491J0169J1548j2484K132K0468l147j1161K3217J9032R948q210j9329
$$ plain form
4810 20415 -7388 -31245 -29833 -16819 -42 16987 10891 -3984 -1279 881 11881 19602 507
4797 507 1098 -5983 -4137 3513 14508 20709 10244 2780 -20311 -33615 -14381 -8551 3751 -9505
4783 -9505 -21366 -18761 -15577 -6333 -14860 -10680 -11758 -19311 -5350 1466 -1053 -28416 -31684 -32418
4769 -32418 -5225 2735 -13830 -33199 -5254 -1885 -11369 -9487 7981 16046 -15058 -24687 -22130
4756 -22130 -22547 -4845 -18247 -36947 -47466 -29421 -26165 -3777 7867 12433 17247 2264 1447
4743 1447 33296 14618 -8191 -13211 -14204 -17196 -1969 9922 29914 34243 26992 7395 -15861
4730 -15861 -9316 5624 7334 10784 -3923 -19826 -22849 -29978 -27830 -32086 -32063 -39974 -32984 -31784
4716 -31784 -37275 -27106 -15558 -28042 -25910 -5442 -8589 -19750 3467 22499 32447 24237 4908
4703D908r066j0965j9362J0465J8426j5823p050J1441K2802K0783n848L507j1647
4690A2571j3664J064P869j2158j4679J0866p411k637n592o838N549J5565J4271
$$ plain form
4703 4908 -4158 -15123 -34485 -24020 -5594 -21417 -28467 -17026 5776 26559 20711 24218 12571
4690 12571 -1093 -29 7840 -4318 -18997 -8131 -15542 -18179 -23771 -30609 -25060 -9495 4776
$$ [...]
##END NTUPLES=NMR SPECTRUM
##END=
