##TITLE=XTC-1153_3
##JCAMPDX= 6.0         $$ Bruker NMR JCAMP-DX V2.0
##DATA TYPE= nD NMR SPECTRUM
##DATA CLASS= NTUPLES
##NUM DIM= 2
##ORIGIN= BRUKER
##OWNER= patiny
$$ 1.79 TOPSPIN		Version 3.0
$$ 2012-05-20 02:38:03.993 +0200  patiny@icmbsg005
$$ Compression mode = diff/dup
##.OBSERVE FREQUENCY= 400.131578658115
##.OBSERVE NUCLEUS= ^1H
##.ACQUISITION MODE= SIMULTANEOUS (DQD)
##.ACQUISITION SCHEME= NOT PHASE SENSITIVE
##.AVERAGES= 2
##.DIGITISER RES= 23
##SPECTROMETER/DATA SYSTEM= spect
##.PULSE SEQUENCE= cosygpppqf
##.SOLVENT NAME= D2O
##.SHIFT REFERENCE= INTERNAL, D2O, 1, 7.286523
##AUDIT TRAIL= $$ (NUMBER, WHEN, WHO, WHERE, PROCESS, VERSION, WHAT)
$$ ##TITLE= Audit trail, TOPSPIN		Version 3.0
$$ ##JCAMPDX= 5.01
$$ ##ORIGIN= Bruker BioSpin GmbH
$$ ##OWNER= patiny
$$ $$ /opt/data/patiny/nmr/XTC-1153_3/12/pdata/1/auditp.txt
$$ ##AUDIT TRAIL=  $$ (NUMBER, WHEN, WHO, WHERE, PROCESS, VERSION, WHAT)
(   1,<2012-05-20 02:38:02.859 +0200>,<patiny>,<icmbsg005>,<go>,<TOPSPIN 3.0>,
      <created by zg
	started at 2012-05-20 02:18:15.432 +0200,
	POWCHK enabled, PULCHK disabled,
       configuration hash MD5:
       77 C7 B7 C4 10 F4 BA 30 64 2E BB 52 82 F2 DA 41
       data hash MD5: 2K * 256
       EB D9 EA 88 B9 F3 93 7C 2B 42 B6 0C 88 76 8A F8>)
(   2,<2012-05-20 02:38:02.921 +0200>,<patiny>,<icmbsg005>,<audit>,<TOPSPIN 3.0>,
      <user comment:
       ICON-NMR User ID: patiny
       data hash MD5: 2K * 256
       EB D9 EA 88 B9 F3 93 7C 2B 42 B6 0C 88 76 8A F8>)
(   3,<2012-05-20 02:38:03.738 +0200>,<patiny>,<icmbsg005>,<proc2d>,<TOPSPIN 3.0>,
      <Start of raw data processing
       xfb same F2: SI = 1K WDW = 4 SSB = 0 FT_mod = 6 PKNL = 1 F1: SI = 1K ME_mod = 2 NCOEF = 32 WDW = 4 SSB = 0 FT_mod = 6 PH_mod = 2
       data hash MD5: 1K * 1K
       6A E2 A0 A5 6B E6 91 E4 3F 31 7D 25 3F F9 74 66>)
(   4,<2012-05-20 02:38:03.848 +0200>,<patiny>,<icmbsg005>,<proc2d>,<TOPSPIN 3.0>,
      <abs2 F2: ABSG = 5 ABSF1 = 7.286523 ABSF2 = 0.6042026
       data hash MD5: 1K * 1K
       F5 25 68 56 F7 86 24 0D D3 92 8C 5E 7E 66 EF 8C>)
(   5,<2012-05-20 02:38:03.943 +0200>,<patiny>,<icmbsg005>,<proc2d>,<TOPSPIN 3.0>,
      <abs1 F1: ABSG = 5 ABSF1 = 7.286523 ABSF2 = 0.6042026
       data hash MD5: 1K * 1K
       F9 58 1B 9C AA 75 F0 81 72 F3 10 96 3B 7A 39 8A>)
(   6,<2012-05-20 02:38:03.984 +0200>,<patiny>,<icmbsg005>,<proc2d>,<TOPSPIN 3.0>,
      <sym
       data hash MD5: 1K * 1K
       54 53 E8 64 4C F9 8B 1B 0D F2 C2 B9 F5 8B C9 A8>)
$$ ##END=
$$ 
$$ $$ hash MD5
$$ $$ 56 4C 41 C6 F9 4E 04 B2 3D 34 C1 A8 1C 24 46 E5
##$RELAX= 
##$RELAX= 
##$RELAX= 
##$RELAX= 
##$RELAX= 
##$RELAX= 
##$RELAX= 
##$RELAX= 
##$RELAX= 
$$ Bruker specific parameters
$$ --------------------------
##$DATPATH= </opt/data/patiny/nmr>
##$EXPNO= 12
##$NAME= <XTC-1153_3>
##$PROCNO= 1
##$ACQT0= 1000000
##$AMP= (0..31)
100 100 100 100 100 100 100 100 100 100 100 100 100 100 100 100 100 100
100 100 100 100 100 100 100 100 100 100 100 100 100 100
##$ANAVPT= -1
##$AQSEQ= 0
##$AQ_mod= 3
$$ [...]
##$PYNMP= <proc.py>
##$REVERSE= no
##$SF= 400.13
##$SI= 1024
##$SIGF1= 7.286523
##$SIGF2= 0.6042026
##$SINO= 0
##$SIOLD= 1024
##$SPECTYP= <>
##$SREGLST= <1H.MeOD>
##$SSB= 0
##$STSI= 1024
##$STSR= 0
##$SW_p= 2673.79679144385
##$SYMM= 1
##$S_DEV= 3088
##$TDeff= 2048
##$TDoff= 0
##$TI= <>
##$TILT= no
##$TM1= 0
##$TM2= 0
##$TOPLEV= 100
##$USERP1= <>
##$USERP2= <>
##$USERP3= <>
##$USERP4= <>
##$USERP5= <>
##$WDW= 4
##$XDIM= 1024
##$YMAX_p= 275095582
##$YMIN_p= 0
##$CURPLOT= <Cups-PDF>
##$CURPRIN= <$Cups-PDF>
##$DFORMAT= <normdp>
##$LAYOUT= <+/2D_hom.xwp>
##$LFORMAT= <normlp>
##$PFORMAT= <normpl>
$$ Bruker specific parameters for F1
$$ ---------------------------------
##$ACQT0= 0
##$BF1= 400.13
##$FnMODE= 1
##$NUC1= <1H>
##$O1= 1578.65811489316
##$SFO1= 400.131578658115
##$SW= 6.6822938604614
##$SW_h= 2673.79679144385
##$TD= 256
##$ABSF1= 7.286523
##$ABSF2= 0.6042026
##$ABSG= 5
##$ABSL= 0
##$ALPHA= 0
##$AQORDER= 0
##$ASSFAC= 0
##$ASSFACI= 0
##$ASSFACX= 0
##$ASSWID= 0
##$AUNMP= <>
##$AXLEFT= 0
##$AXNAME= <F1>
##$AXNUC= <1H>
##$AXRIGHT= 0
##$AXTYPE= 0
##$AXUNIT= <>
##$AZFE= 0.1
##$AZFW= 0.5
##$BCFW= 0
##$BC_mod= 0
##$BYTORDP= 0
##$COROFFS= 0
##$CY= 15
##$DATMOD= 1
##$DC= 0
##$DFILT= <>
##$DTYPP= 0
##$ERETIC= no
##$F1P= 0
##$F2P= 0
##$FCOR= 0.5
##$FTSIZE= 1024
##$FT_mod= 6
##$GAMMA= 0
##$GB= 0
##$INTBC= 1
##$INTSCL= 1
##$ISEN= 128
##$LB= 0
##$LEV0= 0
##$LPBIN= 512
##$MAXI= 10000
##$MC2= 0
##$MEAN= 0
##$ME_mod= 2
##$MI= 0
##$NCOEF= 32
##$NC_proc= -4
##$NLEV= 6
##$NOISF1= 0
##$NOISF2= 0
##$NSP= 0
##$NTH_PI= 0
##$NZP= 0
##$OFFSET= 7.286523
##$PC= 4
##$PHC0= 0
##$PHC1= 0
##$PH_mod= 2
##$PKNL= no
##$PPARMOD= 1
##$PPDIAG= 0
##$PPIPTYP= 0
##$PPMPNUM= 2147483647
##$PPRESOL= 1
##$PSCAL= 1
##$PSIGN= 0
##$PYNMP= <proc.py>
##$REVERSE= no
##$SF= 400.13
##$SI= 1024
##$SIGF1= 7.286523
##$SIGF2= 0.6042026
##$SINO= 0
##$SIOLD= 1024
##$SPECTYP= <>
##$SREGLST= <>
##$SSB= 0
##$STSI= 1024
##$STSR= 0
##$SW_p= 2673.79679144385
##$SYMM= 1
##$S_DEV= 3088
##$TDeff= 512
##$TDoff= 0
##$TI= <>
##$TILT= no
##$TM1= 0
##$TM2= 0
##$TOPLEV= 0
##$USERP1= <>
##$USERP2= <>
##$USERP3= <>
##$USERP4= <>
##$USERP5= <>
##$WDW= 4
##$XDIM= 128
##$YMAX_p= 275095582
##$YMIN_p= 0
$$ End of Bruker specific parameters
$$ ---------------------------------
##NTUPLES= nD NMR SPECTRUM
##VAR_NAME=  FREQUENCY1,    FREQUENCY2,      SPECTRUM
##SYMBOL=    F1,            F2,              Y
##.NUCLEUS=  1H,            1H
##VAR_TYPE=  INDEPENDENT,   INDEPENDENT,     DEPENDENT
##VAR_FORM=  AFFN,          AFFN,            ASDF
##VAR_DIM=   1024,          1024,            1024
##UNITS=     HZ,            HZ,              ARBITRARY UNITS
##FACTOR=    2.61112967914438, 2.61112967914438, 1
##FIRST=     2915.55639409065, 2671.18566176471, -5705
##LAST=      244.370732325947, 0,            -480
##MIN=       244.370732325947, 0,            0
##MAX=       2915.55639409065, 2671.18566176471, 275095582
##PAGE= F1=2915.556394091
##FIRST=     2915.55639409065, 2671.18566176471, -5705
##DATA TABLE= (F2++(Y..Y)), PROFILE
$$ [...]
##PAGE= F1=1077.321099973
##FIRST=     2915.55639409065, 2671.18566176471, -1914
##DATA TABLE= (F2++(Y..Y)), PROFILE
512 -3865 -3894 -3842 3336 4587 3362 -3166 -2344 -1591 -2646 -4898 -3231 430 -2750 -3720 -4858 -3105 -2205
495 -2205 -1259 -3871 -3951 -2126 -6258 -2443 1480 1530 2672 -3495 3409 490 -4033 -3471 -3784 -1880 495
477 1541 -3111 3188 2541 521 531 -2442 2937 1917 27 -2855 -5706 -5557 -4591 -2296 -1107 -2580 -3848
460 -3848 -1421 -4226 -4459 -6801 -4015 -5101 -5840 -2692 -1568 -598 -4862 977 -2045 2001 2366 -5685
443 2807 2580 -1772 -718 -3547 -478 -1031 -1396 -1130 -245 894 2187 3034 3513 3207 2779 2506 2617 2907 2905 2462
423 2462 1929 -1181 -4342 -3902 -3449 -649 -1427 1960 1363 521 -160 -409 -790 -3502 -808 -1613 -3966 -6295
405 -6295 -6715 -4217 -513 1108 -1050 -2672 239 -1690 -341 -4510 -302 -4958 -1803 -1616 -1514 -1851 -3246
388 -3246 -4002 -2038 -2207 -3335 -1518 -2280 -3488 -2317 -1642 -2989 -4245 -5719 -7056 -6469 -5606 -5481 -5762
371 -5762 -3944 -318 -3062 -1107 -271 -2698 -2123 -1827 -4215 -3700 1148 3387 6171 8895 7685 5375
355 5375 2861 1847 1900 1731 351 -1931 -5094 -6905 -5606 -5173 -5243 -4898 -4456 -4225 -3722 -3180 -981 -298 1778
335 1162 175 329 1273 1955 1831 1218 767 1164 1830 2131 2073 2010 1904 -6018 969 -425 -2302 -3239 -2007 -1065
315 -1065 1148 1040 99 370 3575 7624 10969 12828 12711 -3145 2866 2133 3314 2673 1255 -3341 -3537
298 -3537 -4080 -4987 -3667 -1496 659 -57 216 380 -1480 1364 1577 1693 948 -5235 -1776 -3958 -2141 -5034
280 -5034 -2390 -2315 -4423 -4223 -2710 -1764 -3519 -2830 -2581 -1964 -353 1392 -1188 -1587 2962 2653 2462 1253
262 1253 799 1219 -1394 1171 2937 -1874 -3171 -1392 1459 2030 3037 1274 -5436 -3797 -2575 -495
245 141 -5014 -6354 -2354 -3896 -3232 -2482 -2856 -3471 -1179 2310 1062 -2964 -1695 -2990 -2013 -2114 -2457
228 -2457 -3623 -2132 -4790 -3316 -2996 -1726 -244 2739 1674 -1927 -1714 -4143 -5611 -3455 -1339 -146
211 2 -703 -2454 -4377 -3900 -2406 -3952 -1442 -1683 -1622 -25 -863 -2608 -4680 -5568 -3190 -527 2565 -1710
192 2467 6273 818 818 2893 -1843 -4845 -4781 -1570 -4405 -3305 -201 560 -1662 -1953 -291 -78 -849 -1814 -2862
173 -2862 -4139 -5146 -3786 -2245 -3277 -5014 -1468 593 -1420 -363 -1064 -1418 -886 272 -3638 -2016 -3320
156 -3320 -2797 -3137 1016 1121 -2942 -2767 -4430 -339 1128 1236 1344 1178 546 -244 -1009 -2470 -3142 -2957
138 -2957 -1936 -977 -1512 -1123 -1906 -2697 -2960 -1358 777 -1011 50 209 1669 1511 587 -466 -2128 -3096 -4018
119 -4018 -4304 -4260 -4251 -4246 -5867 -3054 -2222 -2005 -2613 -3564 -4535 -4127 -3426 -3119 -2668 -1824 -897 -4200 -4335 -5234 -2327
97 -4142 -3677 -2504 -1309 -3418 -7343 -7349 -10688 -6774 114 1467 3144 3010 2729 2001 -87 1301 2195 3419
79 3419 1728 1251 6137 -3722 -127 -2077 -3852 -4807 -565 272 -2120 -4058 -3393 -2458 -5081 -5222 -5137 -4745
61 -4745 -1199 337 -3359 -4289 -3584 -2732 -409 -634 -3585 -1406 -1882 -2422 -2930 -3387 -3648 -3093 -1886 -583 521
41 1346 -909 -6008 -2699 -57 -1902 -4156 -4485 -3310 -485 -1523 881 1172 -755 -1162 -2582 -2706 -2603 -978
22 500 3429 4570 4516 3001 751 -643 -792 977 1853 25 -4962 -3110 -1218 1201 2727 2835 -446 -4041
4 -4041 -3180 -554 -2236 -3229
0 -3229
##PAGE= F1=1074.709970294
##FIRST=     2915.55639409065, 2671.18566176471, 2428
##DATA TABLE= (F2++(Y..Y)), PROFILE
1023 2428 1818 -326 -3607 -6203 -2208 -1848 -1861 -118 -3530 -2438 1801 1268 1293 1164 180 -1653 -3689 -4931
1005 -4931 -4250 -3670 -3889 -4796 -5974 -6042 -5441 -5462 -5412 -5010 -4334 -3879 -1778 24 1996 3194 -162 -4726 -4588
986 -4588 -5101 -3471 -896 -2173 250 2195 1752 -902 -1184 -1021 -4602 -4409 -937 6115 6138 2121 -883 2717
967 1819 -445 -1971 -4505 -5225 -3670 -3010 -3147 -4154 -5106 -4816 -3979 -3513 -3232 -3112 -2702 -4270 -5389 1202
948 -416 63 261 -7845 -4785 -6013 -1316 -2241 -3478 -4624 -2473 -472 184 67 2199 2043 914 -1597 -464
929 -1540 -2278 -2821 -2580 -5161 -6038 870 -1118 -1771 -1445 -1779 -1565 2637 -1520 3271 3594 -1905 -1658 -3865
911 -3865 1352 369 -860 -1980 -2916 -2389 -1366 -248 426 -18 -1189 -2832 -4929 -3756 -2021 -1600 -1707 -2828
893 -2828 -3616 -2690 -4108 -4160 307 939 1758 3188 3796 -3322 -2179 -5023 1543 2944 -289 -3704 -4450 318
874 1399 -2588 -3648 1222 69 -1374 1349 -1048 2987 7109 4234 810 -2255 -4014 -224 3948 1842
857 -2043 -1492 3557 1476 -4225 -1456 535 -4572 -1247 -3405 -3287 -4303 -3332 -4002 -5188 -5252 -4307 -2435
840 -2435 -219 1927 3751 2284 54 -1036 -3556 148 -973 -2502 -3909 -4972 -4775 -3971 -3608 -4290 -5473
823 -5473 -3639 -1585 122 -4611 613 -580 -2839 -1521 -1957 -4003 -4510 -9477 -3144 -2878 -5090 -4598 -1556
805 -4257 -1180 -1169 -1388 -427 -1484 -3708 -3745 920 -1646 -2460 -880 -2057 -3587 -4302 -3957 -3108 -2162 -2437 -186
785 691 1491 1823 1590 717 -699 -2710 -4642 -4125 -2868 -2029 -1659 -1605 -1793 -1806 -1892 -2514 -3331 -4417 -4166 -2614
765 -2614 -3977 -2673 -3021 183 1132 549 13 3224 4673 3172 597 -2226 -3288 -2567 -481 -615 -1221 3854
746 3962 759 595 486 -1925 -4162 -5331 -4693 -5192 -4857 -2090 -1018 -3719 -3458 1637 -3386 -4292 -203
728 3958 945 -1287 -1182 -4723 -3367 -3565 -3174 -1467 -1099 -5197 -4370 -1511 -2440 -3383 -4199 -4768 -3815 -2179
710 -2179 -654 580 1342 -3575 1851 364 1842 1207 422 -359 -1139 -1527 -1994 -1840 -2975 -1240 -1303 -2171 -3884
691 -3884 -5566 -3531 -1109 1012 1136 -1234 2316 -1398 -2673 -2821 507 344 -323 -783 -1270 -2349 -3758
674 -3758 -5006 -4161 -3306 -2910 -3570 -2186 1516 -224 2496 2377 -2649 1594 1136 2334 2548 1628 -2970
656 -3682 -3330 -2720 -4631 2184 1279 -3651 2209 2223 -1028 -2487 -2620 -2275 -2283 -2777 -2796 -1896 -696 515 -480
636 1852 -1592 -207 -2533 -5597 -6624 -1632 -1553 -13517 -43360 -31494 -10297 -391 -2364 -2563 -3081 2459
619 1352 -166 -2258 -1086 -908 -787 -834 -740 -4402 -541 -259 123 690 -4210 -1185 -251 3356 1184 -3615
600 -3160 -1259 -3602 -4942 -5694 -5085 -6040 -4903 -3362 -2286 -1677 -1537 -1408 -2154 8 -3177 2102 2466 2383
582 2383 -1838 -3121 -865 -2635 -2804 3829 1946 -260 -2402 -2416 -4100 -5062 -3341 -1617 -2846 -4485 -3107
565 -3107 -1527 -2369 -1208 -1470 -2909 -2482 -1457 -2556 -4335 -5491 -4107 -2885 -2451 -3039 -3994 -5358 -5615
548 -5615 -3596 -1458 -1966 208 2141 1933 -64 -1235 -1885 -1461 -3458 72 2280 -1913 -562 -1248 -1578 474
529 2162 3374 2875 466 -2557 -451 334 80 -802 -3698 -4075 -5086 -4706 -4737 -4771 -3694 -3810 -4286 -3379 -4579
510 -4579 361 650 1433 -1185 -2589 -2349 -3742 -3080 -1813 726 -1620 -6003 -6351 -4325 -3258 2403 3107
493 3107 524 -4714 -2596 435 2231 2035 5883 -949 3706 1116 -4824 -3636 -4307 -3221 583 951 -1580
475 -363 -705 -810 -1113 -3267 -2196 -3464 -4956 -5500 -3624 -6064 -3394 -2617 -1211 -2697 -3842 -2600 -4231
458 -4231 -6261 -4425 -2439 -4546 -5535 -1798 -2511 -2527 -3772 257 -117 2744 3203 -4448 1590 2164 -2647
440 -617 -2125 -4116 -4751 -2773 -1727 105 1523 3402 5157 6646 7201 7196 6634 5676 4346 2578 727 -412
421 -611 -3837 -3491 -4310 -1429 -1090 -1452 -2232 -2081 -501 1570 358 -3231 -869 -3834 -5973 -5127 -5509 -3751
403 -3751 -889 2993 580 -5147 -1062 -660 -87 -5007 -1083 -4249 -5853 -3573 -2356 -1826 -2150 -2373 -1989
386 -1989 -1406 -3893 -1943 -3005 -3440 -3577 -1649 -2343 1443 2932 2161 -5845 -2727 -2986 -6166 -2441 -430
368 -1506 -729 -1779 -1766 -3628 -2152 -2092 1494 3631 3745 4744 7622 7515 6991 5870 4723 3357 1870
351 1870 52 -1864 -4180 -4525 -3184 -2041 -1393 -1256 -1719 -2343 -2944 -3203 -2956 -2134 -1078 -261 -137 -627 -1906
332 -1906 -3341 -4003 -3740 -3567 -3663 -4219 -4778 -3754 -1765 977 -4634 3781 -2302 14801 14777 12307 -460 4166
313 1556 1438 4158 9148 14273 17688 18141 15104 -591 2811 -643 -273 646 278 -2931 -3900 -4729 -6214
296 -6214 249 2005 3074 542 -54 -702 -4276 2959 3159 3771 469 -4343 -1549 -3132 -2095 -4176 -3481
279 -3481 -2707 -2366 -2624 -3271 -4135 -4703 -4655 -3975 -3361 -2817 -2540 -3119 -1929 -607 1319 266 -428 -403 -294 -2411
259 -2411 544 -1242 -2980 -3230 -216 1384 1421 431 -1150 -4374 -4137 -4763 -4942 -4687 -3995 -6168 -3256 -2524
241 -2524 -2745 -3656 -4824 -4154 -2377 -876 -1438 -4076 -1060 -1426 -1915 -1916 -2226 -4093 -449 -2699 -2332 -2833 -3954
222 -3954 -718 2378 2642 -3430 1792 -1526 460 -1797 -3590 -4201 -3486 -3198 -3956 -3853 -2875 -3347 -3076 -1182
203 -1382 -2103 -2746 -4067 -1291 1812 3558 6585 6639 3272 -2227 558 6012 2786 -285 1511 -3169 -5549
186 -5549 -5556 -3945 -3391 -2585 851 439 -1614 -2085 722 19 892 1525 1547 858 -571 -3190 -3837 -4564 -4573 -2081 1232
164 -3133 3485 3599 -1258 722 3164 -3614 -2742 -3803 -2255 -2707 -505 749 -779 -974 -3028 -150 5055
146 4508 1721 2634 1647 870 159 -1018 -1892 -1938 -1653 -1738 -2611 -3279 -2568 -1225 -2351 -84 3178 240 1359
127 1359 3035 1750 3011 -415 -744 -2945 -122 -1564 -2840 -2280 -1012 -1329 -3979 -873 -311 -984 -2101
110 -2101 -3217 -4261 -4291 -3617 -3335 -3379 -3734 -4194 -4438 -4671 -4383 -970 -2345 505 -983 738 658 -5176 -5071 -5766
90 -5766 516 727 863 960 1182 1381 -700 -2910 1170 1388 1736 1630 -419 1818 -4704 -641 -3848 -3979 -4911
71 -4911 -920 -785 -1973 -687 1951 -3075 -5268 -4121 -5174 -4735 -932 -1415 -1536 -2737 -3254 -2066 -3216
54 -3216 -4454 -5421 -4375 -3448 -2562 -2053 -2115 -4004 -3681 -4304 -4903 -3910 -2027 -1223 -7013 -4513 -737 -509 -2877
35 -2877 -4287 -4012 -1302 -243 274 520 -2463 -993 -4073 -1857 -1757 -365 836 3259 4015 3636 1774 -1172
16 -4391 -3882 -1646 -557 29 -2901 -1630 -756 163 1331 4291 1128 -1086 -1061 650 -484 -1741
0 -1741
##PAGE= F1=1072.098840615
##FIRST=     2915.55639409065, 2671.18566176471, 1137
##DATA TABLE= (F2++(Y..Y)), PROFILE
1023 1137 1491 932 -3915 -2614 -4710 -5720 -5013 -3366 -5253 -982 2367 3386 2056 2272 3655 3405
1007 3405 2952 648 -1102 -3565 -3388 -3265 -3041 -2302 -2617 -2345 -3030 -4064 -4861 -3972 -2261 -401 1276 1397
989 1397 -141 -4078 -4269 -3609 -3490 -320 -2014 162 1827 1344 -1374 -4088 -2673 -4090 -3963 523 4727
972 4727 4423 2938 -689 3458 2784 -2018 -227 -2268 -4146 -5396 -5425 -4823 -4002 -2593 -2515 -3457 -799 -2398
954 -2398 933 62 -3801 -9138 -1797 -3506 -3272 -1823 -3530 -298 -799 -2156 -3448 -3490 -2624 -1792 -2030 -3087
936 -3087 -4958 -6835 -5221 -3123 -1773 -814 -989 -1945 -3661 -4498 -3242 -4971 595 -1045 -2833 -1002
919 -2837 -2730 137 -725 835 1454 -1352 -859 -4189 1571 3994 3828 822 -1693 -2952 1751 -1675 -1013
902 -1013 4974 4455 1125 -817 -3079 -5038 -5061 -4436 -3042 -987 1024 -2642 -2314 2281 1863 1500 1656 2004
884 2004 -574 -4089 -2796 537 2166 446 -3731 -4779 613 651 -1760 -3297 727 -272 -176 2101 -1540 2185
865 4248 2461 20 -2323 -4056 -1733 73 1313 -3946 -2177 931 422 -1701 -878 -866 -4426 -1164 -3392
848 -3392 -4176 -4477 -2466 -2226 -2664 -504 -1793 -3152 -4757 -5276 -4017 -2759 -1912 -1868 -2800 -2480 -3082 -3367
830 -3367 -3171 -2713 -2433 -2363 -2797 -4133 -5739 -4063 -2012 -435 -4057 712 -1467 -3895 -2154 -4142 -3297
813 -3297 -1093 866 2704 4783 -4322 -4560 -2781 -4926 -1455 -1715 -1118 -209 -2593 -4668 -4335 -835 -2820
796 -2820 -1459 -2924 -3218 -1793 -835 -877 -1736 -2870 -2702 -571 2221 4862 4652 4727 2513 559 612 -3458
777 402 686 -1182 -9 -2767 -2365 -3155 -3634 -4366 -5085 -5757 -4160 -3701 -3404 -2163 -2573 -1247 2490 -212 190
757 -810 -1206 -754 -8 1109 1673 -23 692 -155 -1207 2444 2612 10 777 1475 -2246 -4236 -4918 -3494 -3696 -5664
737 -5664 -3237 435 -3479 -2619 3438 -1375 -2870 -994 2485 2968 2289 1759 -3527 -4570 -4214 -3110 390
719 349 -3022 -3265 -3613 -3613 -3431 -2587 -1174 325 -1547 2035 2304 981 -2904 1831 1282 469 -157 -221 199
699 592 -810 776 646 -2737 -22 -535 -1569 -3152 -4675 -4467 -2804 -1302 -153 -1907 1390 -1589 -1711 -1729
681 -1729 -1735 -2893 -3120 -2808 -2339 -2058 -1576 -1105 -1140 -3516 -2141 -3351 -825 10 -203 81 -849 -2237 -3250 -2632
661 -2632 -806 1147 844 -4044 -1713 -864 -2124 -4043 -2184 -162 -4247 195 -1357 -2723 -1837 -54 1138
643 1317 128 -2120 -3690 -2837 -801 -1409 1140 -1352 -1069 -1256 -4392 -8175 -4507 -4227 -7210 -27953 -21639
626 -21639 -11413 -3147 -3894 -1618 -4148 -32 973 224 -430 185 -1668 -756 -2139 -3024 -3608 -3334 -2529 -1494
608 -1494 -1370 -4952 -1530 176 1279 321 -4593 -2407 -740 -1166 -1373 -3355 -372 196 932 1123 2431 644
589 3276 3418 -1117 2057 -3560 3094 2505 2108 -1337 -2296 -1766 -5015 -1995 1964 868 -2038 -1015 -835
572 -835 366 1727 2993 3650 -1687 -4634 -2860 -926 -1685 16 -1119 -2481 -3991 307 479 347 -2458 -1106
553 -1038 -861 -1287 -1727 -2565 -5261 -3767 -3284 -2346 -2062 -2331 -3218 -4416 -4142 -2944 -2133 -3011 -2216 -2896 -3760
534 -3760 -4542 -3390 -1648 -317 373 159 -769 -1893 -2914 -3782 -4287 -4456 -4187 -4451 -4660 -2253 -1457 -1311
516 -1311 -1602 -2125 -3076 -3723 -3546 -5068 -1724 -1097 -634 -472 -1872 -1856 -4605 -3330 -702 1491 -288 -7088
498 -7088 -8035 -6268 -4631 1313 2473 -130 -3931 1109 2708 2423 2453 2918 813 2480 1678 -3849 -3502
481 -3502 -3799 -3182 1579 1434 155 -866 -1050 -941 -1155 -4955 -2022 -2799 -3453 -4257 -4990 -5250 -4564 -3648 -3222
462 -3222 -3168 -3829 -4055 -5128 -5126 -3796 -2764 -5833 -4924 -1379 -1158 -691 -3018 1457 1335 2676 2601 -3275
443 -1408 3698 -2947 -464 -814 4920 2909 598 -5847 -2277 -3747 -3878 -1269 1740 3995 5429 5670
427 5670 4754 2790 -57 -2688 -2141 235 -2982 -3255 -4815 -2289 -1114 -2873 -4281 -3334 -1317 539 1104
410 1104 -2080 -279 -4458 -4062 -3719 -3891 -2821 -1678 1523 1335 -5675 -591 477 -595 -4885 -3995 -2970
393 -2970 -985 2178 2952 -2155 -947 -790 640 182 -4646 -1676 -3779 -2408 -4776 -3212 -2488 1090 8314
376 8314 2625 -6032 -2167 138 89 -1439 -1890 -374 -22 -2889 -763 -5061 -2766 -2909 -2902 -3563 -3585 -1687 1012
356 3720 6298 7987 8769 8031 5802 2185 -1942 -4366 -1326 1218 1690 2449 1164 423 -492 -1181 -1973
339 -1973 -3261 -2640 -1713 -518 202 430 -67 -871 -1588 -1991 -2151 -1750 -886 235 1428 2796 4754 -1292 3149
319 -3239 14777 28045 15641 5 6421 2229 7997 15692 15702 20955 24634 27725 27980 1985 2649 -4893
302 826 724 -990 -1780 -377 -1368 -4896 2671 1660 -2017 -4852 -1429 306 -2121 4515 5042 4077 461 -2333
283 -1686 -2205 -2078 -2917 -3712 -576 -2482 -4099 -4125 -3454 -3186 -3787 -4200 -4202 -3920 -3891 -4840 -4665 -4420 -3600 -3040 -2342
262 -2342 -1578 -1775 -2921 -588 -1982 -3974 -5786 -5535 -5118 -5428 -4709 -2811 -2954 -96 176 212 898 -1848 -5782
243 -5782 -4007 -875 -1046 -1768 -1259 -3272 -1472 667 -3332 -2760 586 -988 -1759 -974 231 -3273 647 100
224 -2974 -1638 -4731 -1354 1744 2584 -4649 2493 -565 1423 949 -151 479 130 53 63 -2107 -1355 -3404
206 -3404 -1324 96 -934 -2771 -4522 -3795 -1676 391 2194 3552 4728 3526 -1503 -555 5696 4657 -964
188 146 -3785 -4412 -6023 -3611 -6595 -3144 -431 532 -1410 -2226 -3033 -3460 -1233 792 1491 921 -728 -4108
170 -4108 -5001 -3683 -4434 -2962 802 -4706 5065 5216 -3031 437 3308 -2247 -3237 -3894 -1853 -1927 -2204 482
151 2053 1506 -1943 116 298 -545 -1527 -2363 -2896 -2856 -2455 -2409 -2458 -2734 -3382 -4457 -5591 -3734 -1659 -1222
132 -1222 -2106 448 352 282 278 -14 -1040 -1681 -2740 -2169 -3481 -453 1941 -2304 2168 1063 475 -1897 507
112 1881 1000 -1126 -3128 -2131 371 1397 213 1114 -103 -2675 -3986 -3294 -2202 -113 -5300 1743 -1536
94 1970 748 -362 -697 -109 1465 2490 2648 2282 1437 128 -3401 -3991 -4602 -3575 -2400 -1662 -2236 -2470 -4382
75 -4382 -4318 -5132 -4377 -4740 -709 2330 -2578 575 2214 -3597 -4548 -2587 -4259 -4754 -1936 -1787 -1367 -1411 -2625
56 -2625 -1554 -1566 -3419 -3281 -1711 -3589 -4962 -4419 -3596 -4840 -3111 -2102 -2056 -2808 -3637 -2818 -5282 -4929
38 -4929 -2390 -77 -1266 -2332 -4138 -1076 180 1138 1718 -4261 -1497 -4372 371 -904 -2299 -3593 -4243
21 -4243 -4084 -3472 -2885 -2026 -878 390 -746 1831 1604 -527 146 1339 -412 -1453 3330 611 -1925 -705 677
1 104 -1108
##PAGE= F1=1069.487710936
##FIRST=     2915.55639409065, 2671.18566176471, 488
##DATA TABLE= (F2++(Y..Y)), PROFILE
1023 488 1117 499 -4730 -1354 -1782 -1551 -1410 -4098 -3560 -87 704 1154 988 572 379 670 1227 -644 -2357
1004 -2357 -4479 -4189 -3373 -2049 -3101 -4413 276 -704 -2367 -4502 -6306 -4392 -2508 -846 -368 585 -2757
986 -3827 -1869 -2354 49 -2414 -521 -1311 -3640 -3875 -1612 -545 -2994 -2883 1497 4857 4417 4465 107 3744
968 3744 2196 -3026 -3367 -5492 -4058 -3357 -3752 -4642 -4583 -2764 -3394 -4550 -2547 -2800 2486 1623 -4100
950 -8323 -3476 -2527 1444 2751 -895 2724 1189 -826 -2229 -2563 -2729 -3287 -4880 -5937 -4141 -1928 -785
932 -1932 -1883 184 -1551 -3211 -3259 -1680 -883 -3257 668 -469 -4367 -1320 -2788 -3356 -4064 -4266 -3660 -2477
914 -2477 -1063 -121 -4023 -579 2473 4484 1442 -28 -4903 -667 -4141 -3293 2542 4328 1036 -1737 1624
896 -1057 -375 -1920 -2867 -2576 -1251 -1001 -394 129 -805 -2194 -3266 -3393 -1857 625 -255 2250 4990 539
877 -3680 -4665 -1951 -3938 -3211 -2654 -668 -1267 574 1012 -1803 953 -328 -2458 -4712 -3762 -3791 1005 2172
859 2172 2125 -4315 -1445 -1674 -3131 -3826 -3431 -2683 -4444 -1917 -3622 -4458 -2734 -1448 -3495 -855 1947
841 791 1128 -4584 3098 2406 1945 1144 500 -1876 -1723 -2789 -504 -855 -4163 1258 880 681 175 -525
822 -1059 -1486 -2059 -3749 -3227 -4007 -4572 -4856 -4510 -3895 -3356 -2467 -950 1022 -3916 -4715 -3563 -4361 -1959
803 -2357 -741 614 -3466 -4018 -3721 -1999 -1639 -1992 -2210 -1841 -1400 -1333 -1658 -2183 -2772 -2989 -2226 -584 1505
783 3277 3310 1860 -694 -351 -3392 -1328 927 -2747 -2736 -4388 -1776 -3497 -4772 -5564 -5529 -5048 -4094 -4480
765 -4480 -2529 -1776 -1746 -2754 1235 -192 -1 -546 -2513 -3746 -3478 -2328 -965 852 917 -602 -1814 654 111
745 -1342 836 2717 -2454 -3341 -3342 -2789 -3222 -3054 -2188 -699 -3457 -2362 3385 -290 -1612 -1867 -3675 -4285
727 -4285 -1726 465 -2192 -4253 -5338 -3368 -592 468 -886 -2063 -2341 -2011 -3647 -1284 75 1361 -2202
709 893 -849 -2125 -2893 -3307 -3083 -1967 -584 612 1442 1703 -913 742 -478 -2428 -3384 -2659 -1042 290 1334
690 1334 1367 -4765 252 -1432 -3246 -4761 -4391 -3605 -3330 -3732 -4092 -4395 -5089 -5289 -3607 -1733 -207 -1435
672 -1435 -4172 -1799 -3296 -3487 -3180 -2585 -2556 -3089 -3585 -2909 -1511 -110 1246 -1839 -4518 -66 1243 -1018
653 -1841 -4191 -5827 -4258 -3574 -3317 -2942 -2237 -1747 -1647 -1929 -2684 -3190 -4447 -1958 -740 -2165 870 -56
634 -1737 -1870 -4085 -7191 -7899 -636 -3215 -14287 -12056 -10054 -6002 -4819 -440 -2531 -2474 -978 -740 1477
616 1056 -2373 694 -6 -1309 -2285 -1463 123 -1248 -2802 -4502 -2179 -830 -798 -1108 -2128 -1072 -3022 -4462
598 -4462 -3305 -2041 -1939 -1166 123 -706 3066 2371 4095 3030 101 74 -2686 -2035 -2869 -3238 -2600 -1973
580 -1973 -2261 -4697 -1502 3751 1663 -4009 1813 3645 3861 3510 2616 1123 -555 -4316 -2521 -2888 -3142
563 -3142 -3176 -2732 -1826 -3494 -325 -594 -1751 -3739 -5662 -4921 -2577 -331 1334 1931 -4128 3541 1346
545 -1577 -5029 -4073 -1915 -1090 -1498 -2572 -3201 -3042 -1301 -157 -848 -775 -5 -2229 -441 -681 -623 -345 127 -2862
524 443 -105 -1044 -1971 -4266 -4863 -4633 -3656 -2078 -836 -364 -1065 -2329 -2944 -5175 127 2274 1000 329
505 -781 -1186 -4183 -4393 -4545 -665 1004 -5437 -7241 -8731 -6175 -291 -775 -2163 -3762 -5017 -5520 -4954
488 -4954 -4601 -4039 -2765 -501 1954 -2859 -3187 -2776 -2064 2666 4856 2252 -631 -1017 -1631 -1155 -7368 1333
469 3178 3020 88 -2925 -2733 329 -2842 -3192 -4696 -4835 -3802 -2842 -2165 -1676 -1887 -6502 -4960 -4622 -2515
451 -2515 -666 -3082 1594 2239 1439 863 -2485 -4257 -245 -2762 -236 -268 3458 3799 2973 -5412 -2169 -1531
433 -1531 -3357 -4285 -2041 355 2616 4309 5284 5392 4527 3258 -1929 1114 -2141 -3218 -4904 -2602
417 -2602 -1669 -1535 -696 2210 4954 1084 1556 -434 234 -1889 -2347 -2905 -2973 -2018 -1912 -184 1001 -3759
398 -1266 -3097 -4608 -3828 -3647 -2347 -501 1971 3134 -2349 -941 -1912 365 481 -5050 -1877 -3151 -4099
381 -4099 -4335 -4541 -2446 328 5182 2207 -5070 -1498 698 400 469 -3006 30 229 -3637 -1144 -4915 -3631
363 -3631 -2680 -1826 -1818 -2686 -4088 -4347 -2520 -356 1170 2162 2182 1384 -29 -1014 -1197 -156 724 214 312 -1099
342 -1477 -1353 -686 -1144 -1678 -3333 997 1480 1793 2086 2214 2601 3379 4306 4867 5033 4543 3451 2193 1387
323 1387 1486 1877 1827 -2007 12307 15641 16364 386 5766 3408 -1872 7461 11320 27645 31838 30079
307 30079 22967 13641 3585 -5772 883 1316 -2941 -3450 424 -1899 -3624 2968 2674 341 -1364 -691 2125
289 1923 5592 6945 4890 654 -1112 -2532 -3949 -2877 -2462 -4166 -2155 -3633 -5257 -4864 -4155 -3991
273 -3991 -4408 -4329 -4100 -3986 -4229 -4628 -4588 -4195 -4303 -5192 -3976 -2301 -2997 -2337 -1087 -1511 -3438 -2600 -1593
254 -1593 -2139 -1432 -212 -450 -1793 919 530 -715 -1580 -1495 -4558 -4192 -1851 -2537 -1460 -1427 -2785 -1605 -199
234 -4271 -1669 162 -243 -1015 -1097 -274 -2566 -634 -2320 -4036 -651 -2867 -2445 754 2939 -4761 2450 1059
215 409 -2215 -3304 -3023 -2852 -2808 -2814 -2253 -1536 -2825 -526 -175 -94 -1417 -1395 -2244 -2758 -3081 -3637 -4609 -3561
195 -3561 -666 -304 -879 5215 5792 -1117 -1476 -4229 -3257 -5022 -418 -1962 -3480 -3241 -2010 -1709 -2475 -3928
177 -3928 -3209 -1678 -613 -731 -1862 -3675 -4459 -2647 -3682 -4793 -4124 -1686 -4472 5514 4498 -4427
160 272 2940 -805 -3861 -4181 -1770 -1171 -3988 -926 -2394 -3894 -4693 -4882 -4865 -4197 -3284 -2313 -1761 -1637 -1726
141 -1726 -2132 -2122 -3017 -1266 -898 -927 -926 -770 -1297 -2419 -1238 -2430 -3895 -4309 -3560 -3572 -3502 -4447 -3153 -3995
121 -3995 -171 1988 -2174 1276 757 1985 85 1129 -481 -1821 -2521 -946 1629 301 629 471 475 -671 -2110
102 -2110 -4009 -2443 -482 -234 -3241 2676 -2781 496 -2900 -2957 1188 5006 8307 9827 3474 3093 4831
85 4831 2005 -4488 -3003 -1637 -468 -356 -1352 -3448 -4782 -2785 -1253 -3255 -4640 -4589 -1149 1018 -3269
67 1784 1972 -3806 -3781 -2063 -3626 -4478 -4151 -3682 -3446 -3108 -3216 -3416 -4082 -3985 -3173 -317 1878 -3818 1618
47 1264 -3488 -3204 465 -1197 -508 -306 -3909 -3465 -3828 -2123 -117 2296 3196 -3519 3626 2487 1946 814
28 -4755 -2125 -3172 -1209 -499 -320 -344 -134 -76 -22 -495 -2883 -3270 -4896 -3009 -542 1517 1467 1665 3464
9 3464 369 -4220 2345 -264 -3248 -23 -1626 -2583 -1196
##PAGE= F1=1066.876581256
##FIRST=     2915.55639409065, 2671.18566176471, 607
##DATA TABLE= (F2++(Y..Y)), PROFILE
1023 607 1194 -1234 -4544 -921 -621 1592 -163 -4466 -1845 -3719 -2962 -1190 -159 18 -600 -1631 -2418 -2721
1005 -2721 -2672 -3156 -4486 -4130 -2876 -1541 -4609 284 509 -2007 -412 -950 -1540 -2339 -3500 -3483 -1796 -1045
987 -1045 -3399 -146 -661 852 -2991 -1639 -1020 -168 -1275 -1467 753 -1587 -1581 2383 5809 6067 5105 1543
968 1529 -1515 -4357 -1666 301 -3630 73 -2730 -3851 -5084 -3388 -4250 -4797 -3372 -2051 2524 2033 -5246
950 -5560 -3877 -3607 -1099 -516 -451 -513 -788 -1347 -1779 -1646 -766 -1729 1917 1136 -3060 -2265 -2523 -3332 -2186
931 -2186 595 -700 377 1242 855 1440 -1538 1173 325 -5472 -1522 -2223 -2479 -1212 -2689 -3840 -3574 -2412
913 -2412 -1406 -3280 -2169 163 2909 1422 2121 -4744 -3631 -6364 -4926 -166 866 1579 -2125 1266
896 -1766 -764 -1947 -2592 -2612 -2421 -2665 -3462 -4239 -4201 -3415 -2023 -57 2525 5249 2102 1950 4449 154 -3586
876 -3650 -2105 -3683 -2821 -1686 -865 -2601 2464 3180 -1007 -95 -2288 -3217 -3170 -162 -3055 1716 1365 656
857 -3034 -362 878 2001 1014 -154 -227 -4406 -2337 -3964 -4725 -1464 -272 -2507 1316 3064 2926 3959
840 3959 -3339 2483 4020 1318 841 721 -986 -2103 -3440 -1226 -2734 -2898 2961 3015 1690 1912 1690
823 1690 2203 589 -1459 -3911 -2715 -3032 -2994 -1052 -1124 -1657 -2559 -3397 -3942 -4238 -4227 -3695 -1525 -2967 -2692
804 -2692 -3212 -479 2327 -2695 -3298 -3304 -2017 500 921 501 186 -237 1126 5080 6686 1002 -1961 3620
785 847 -1614 -3004 -2805 -2125 -2521 -2209 -3032 -3066 -3485 -4108 -5113 -3751 -3572 -4421 -5821 -6318 -4566 -3233
767 -3233 -2415 -4171 -1593 -1248 -606 -2632 1166 441 -511 362 2488 4734 -780 4898 2952 1204 383
749 -1613 -2537 -682 -2160 -3060 487 2622 -1163 -2870 -3914 -1965 -2205 -2719 -3259 -3659 -3826 -3039 -1577 -94
730 -669 -2462 -3484 -2455 1335 68 -1366 -3019 -4629 -5943 -6457 -5882 -5973 -5442 -3635 -4193 -3404 -1867 -291
711 -1012 -2407 -2413 -2222 -1285 -3012 983 1450 1483 -1257 674 17 -718 -1168 -1106 -1824 -2190 821 1255 1262 977 1010 1340
689 1340 -3124 -1888 -360 -3151 1949 449 -1567 -3994 -6104 -4716 -3469 -2754 -2430 -2733 -3333 -4113 -4609
672 -4609 -4908 -3479 -3218 -3638 -4187 -4237 -3733 -3393 -3560 -3926 -4504 -5046 -4971 -4812 -4711 -4369 -4370 -4459 -4923 -5406 -5866
651 -5866 -5999 -5959 -5519 -4550 -3259 -2103 -1069 -165 252 -1757 -4589 -102 -382 -2427 -584 -900 -1684 -2892
633 -2892 -4342 -5325 -10153 -4413 -1017 -2368 -3112 -7901 -8017 -5350 -1873 -638 -3745 -3459 -626 -1554 -3025
616 -3025 -3076 -2676 -3034 -3728 -3526 -1669 -95 -2783 -2314 -3392 -3101 -2057 2504 -2739 40 1129 568 -3142
597 -5361 -3830 -3404 -3523 -2575 -2468 1009 2103 2391 2073 1197 544 -841 -2059 -4037 -6249 -4084 -1982
579 -2920 -3349 -1383 2082 -589 -2404 4433 7012 6527 5410 3880 823 -95 -3033 -2613 -2806 -2267 -1153
562 -1153 -1119 -1853 -1646 2611 1683 57 -1374 -3126 -185 2598 3785 2513 2492 -2632 3833 1494 -1478 -5098
544 -5098 -3769 -773 1198 2096 2212 2014 -3544 1563 3394 -940 -1491 -664 -2510 -2072 -902 1810 3956
527 3956 1199 -4301 722 3527 -3563 -1904 -3599 -4953 -4842 -868 434 2981 6087 1079 -1103 -528
510 -4759 -348 845 -624 114 -4 -1267 -2411 -5185 -1663 -2119 -905 -3523 -4978 -6682 -6298 -1851 -2309 -3377
492 -3377 -2844 -1139 -145 -249 -1365 -3416 -6156 -4760 -1376 -1993 -2619 -1461 -1324 2958 7930 3426 -2341
474 12 -526 -2684 -5281 539 3793 2768 -2496 -4210 69 2143 -2804 -2427 -4732 -4632 -2675 -194 392 2382
456 2382 1578 -6599 -4624 -3752 -1392 -1796 -3825 3211 3971 148 -1754 -1955 -4288 -2939 -2801 -168 -3128
439 -3128 -4501 -2585 -1486 -5012 -7121 -2903 -4170 -4583 -3438 -2520 -1306 216 1859 3115 3356 2461
423 2461 -3146 473 -1277 -3104 -4871 -1844 -3443 -4618 -2707 -271 1830 860 1546 1397 770 -827 -1118
406 -1118 -2418 -2327 -882 -217 -2166 -5160 -4951 -2454 -1449 -1515 -2178 -3527 -4914 -4233 -900 2470 -2158 -1565
388 -1565 -3383 -937 326 -3956 -2189 -796 -1050 -3151 -4130 -2360 -4432 -4517 -2570 -3662 -1551 -966 456
370 -430 -2040 39 129 -3631 673 -3521 -4543 -2429 -502 -2252 -3287 -3014 -4271 -2032 -1898 -2326 -2880 -3732
352 -3732 -4506 -4822 -4402 -4497 -4434 -3978 -2837 -1512 -3927 -954 -2199 -4076 -4548 -2617 -3420 711 1795 2554
334 2554 3186 3197 2711 2183 2242 2926 3992 4646 4497 3636 2316 618 -781 -1479 -1065 -460 5 386 1524 3210
314 3210 4210 7889 15960 30623 40252 45074 42686 33406 -6146 1212 -5471 -3952 -1568 964 1065
299 1065 450 -1636 -2294 4088 3253 2090 573 1041 1255 1912 2764 3284 3285 701 -728 -3540 -2414 -4260 -5105
280 -5105 -4335 -3753 -4105 -5022 -4742 -3453 -2309 -1879 -1584 -1460 -1141 -690 -2383 -413 -1125 -2185 -3472 -3809
262 -3809 -3320 -2736 -2039 -1773 -4402 -3312 -2213 245 523 529 -49 -1301 -3239 -4943 -3050 -1196 144 757
244 757 -2643 -3478 -1765 -3718 -5561 -5018 -3005 -1624 -1056 -3103 -1198 -1711 -1927 -2234 -1985 -896 -1968
227 -1968 668 274 -4410 5 -1498 -3703 338 3727 -3384 2211 -2223 -3629 -929 -4769 -2181 5068 3605
210 3605 268 -899 1148 -1717 4 -1864 -2797 -2216 -1604 -1174 -805 -408 -201 -743 -2050 -2972 -1780 -543 1832
190 2257 -683 -3203 -4612 -2312 -3851 -1213 -1323 -2136 -3364 -3993 -3648 -2785 -1973 -1230 -977 -933 -1524 -2430
172 -2430 -3172 -3255 -2933 -4460 -5359 -4078 -3311 -2705 5291 4019 -5229 31 1091 -461 -4672 -4398 -4420 -5396 -4433
153 -4433 -2881 -1732 -1440 -1878 -1778 -1666 -397 1051 2060 -1905 -230 -2109 272 1223 -2637 -993 1130
135 2724 1398 -232 -1806 -3208 -3410 -3623 -2644 -983 812 647 480 -4924 -3210 -4530 669 2388 -2207
117 -291 250 2945 -743 -4200 -3128 -904 148 628 743 -1691 82 -276 -849 -227 -1345 -2523 -2362 394 -512
97 -810 1077 -4283 -1999 -3765 -4096 -1525 989 3498 4788 4224 1732 1936 80 -3800 -1463 777 2216
80 2216 2208 1201 -3293 -957 -1411 -1289 -1735 -4358 -4766 -3421 -3777 -3505 -2772 -1732 -3997 -3743 -1433 -1103 -2799
61 -2799 -1983 -1042 -1130 -1012 -1540 -2417 -4671 -2893 -3177 -1910 -282 -1681 3519 2087 -2447 -1473 1803 -2708
42 -2389 1578 -5808 -1603 -4393 -2549 -1015 2414 2827 -2806 3763 3358 2613 1441 -4007 -3075 -2012
26 -2012 -2987 283 -98 -895 -1864 -2863 -2075 -2440 -2503 -986 1011 -213 -1604 -1907 -1006 -240 -269 -893 -3584 -2058
6 -2058 -2107 -4890 -3459 -5151 -4559 -2732
0 -2732
##PAGE= F1=1064.265451577
##FIRST=     2915.55639409065, 2671.18566176471, -3625
##DATA TABLE= (F2++(Y..Y)), PROFILE
1023 -3625 -2680 -3195 -4118 -1624 -1294 3040 345 -3085 1467 127 2616 3216 409 -403 3520 2585 895 -354
1004 -638 -2239 -5187 -3735 -3399 -2416 -4782 -1867 -2261 -3055 -2701 -1491 -162 579 373 -2941 -2235 -3097 -3476
986 -3476 -3972 -4262 -3157 -2788 -3436 -1732 -2710 -2055 -1897 1611 -444 -518 2855 2762 2773 2882 2531 1647 244 -3952
965 -3305 -3745 -3234 -2989 -3178 -3486 -3897 -3799 -5010 -4087 -2987 -2559 -3237 -4460 -6677 -3373 -2266 -4334 -989
946 287 -1765 2089 2039 2061 -561 -1670 -974 -4555 1907 2899 -685 -2087 -3943 -4987 -3451 808 -813 -1342
928 -1342 314 452 3022 -409 -49 508 -4442 -1676 -1783 -2002 343 48 677 -1137 -3827 -4121 -2313 -3198 -1741
909 -1741 301 697 2640 -1472 -3246 -3762 -5807 -3728 -2783 -1204 -1194 447 -2327 -35 -596 -1155 -1643 -1814
891 -1814 -1435 -536 549 521 1018 180 -1038 -1607 -771 337 750 1030 -772 -3752 -2522 -4116 -2262 -1390 -927
872 -927 -1707 -3986 -688 -2095 -3572 -3728 -2837 -3729 -1802 -2095 -3037 -4155 -4990 -4587 -3422 -2057 -497 1007
853 846 -392 -739 -4079 -3213 -4185 -4771 -507 816 -305 3321 4064 4464 5284 -2231 1686 2913 767 295 -171
833 -432 -2651 -4105 -2904 -4817 -1020 3334 3285 2260 2206 3372 3299 1950 -1108 -4609 -3359 -3944 -2293
816 -2293 -986 3391 4387 3348 -1044 -852 -2966 -5266 -4977 -3028 -1760 -3740 -4509 -570 4250 -953 -2985
799 -2985 -3152 -1453 2431 2521 -478 -960 1477 979 6698 9527 1604 -2101 2925 4566 1625 -1232 -3583
782 -3583 -4057 -2823 -2561 -2489 -1613 -3074 -4500 -3762 -2213 -561 242 302 -299 -502 -77 -1695 -3679 -663 -322
762 722 -1368 1669 766 -3734 -760 3570 3945 -1223 4188 1216 -1068 -929 -2680 -2783 -555 -2083 -4508
745 -4508 -2631 -2624 -2243 -1589 -4242 -2477 -1857 -1156 -1351 -3291 -5830 -4591 -1383 -168 205 -2164 -4600 -4105
727 -4105 2148 1179 -1325 -4960 -5336 -3457 -3693 -3385 -4539 -3850 -1427 -3989 -1338 -1336 -409 -3593 -1828
710 -1828 -632 -722 -1852 -3669 259 926 280 -3070 4072 1784 2778 -1559 -1885 -4068 -2132 1115 -1941
692 -5196 -1634 1824 2302 -1239 -4151 -1873 -2412 2227 1564 -852 287 -1440 -2506 -3099 -3628 -3694 -3223 -2641
674 -2641 -1964 -3987 -5466 -5082 -6126 -4527 -3297 -2627 -2405 -2442 -2548 -2303 -1913 -1615 -5126 -3629 -2923 -2435
656 -2435 -3733 -5188 -6538 -5389 -4013 -2651 -2437 -2060 -2649 -1347 -3129 -5528 -5645 -3466 -2004 -3937
640 -3937 -1579 -2496 -3816 -5352 -6223 -4759 -3350 -4503 -4102 -6083 -7626 -2719 -2283 -1671 -5013 -7289
624 -7289 -5666 -571 -326 -2800 -4388 809 3364 343 -3332 -266 1816 4203 1732 1592 -181 -2182 -992
606 -2340 -3700 -3669 1365 -3227 1831 2859 602 -1939 -4154 -5114 -5161 -4736 -3547 -3011 165 1617 2125 365
587 38 -2330 -5071 -5860 -3286 -937 96 -1926 -4180 -3025 -1570 -153 -2373 91 -486 -823 -897 -1318 -1933 -2750
568 -2750 -3439 -3626 -3173 -2317 -1225 -198 -819 -2451 -237 389 -472 -1524 -2470 -4145 -1674 -1064 -1212 -1698
550 -1698 -2455 -2643 -1874 -946 -1234 -631 -1929 -3734 -3912 -1708 520 1880 -4366 987 2429 -1401 -2503
533 -2503 -494 -1603 -3019 -3534 -151 828 1233 -4779 432 3003 -4800 -1349 -3654 -5682 -5260 -3991 -3089
516 -3089 2220 3349 2140 -608 -419 -4355 -502 180 -1462 0 84 -1867 -1164 -5058 2099 5005 2641 -2443
497 -3260 -4284 -4323 -3319 -3868 -4840 817 2217 1987 -1046 -2236 -2427 -268 -1313 1639 -1489 -2088 -143 -1720
479 -1720 1951 5047 3800 -4284 -1883 -4734 -5136 -3259 -354 1639 2274 -4763 -5250 1074 199 -2979
462 -2585 -4457 -3928 -4914 -5209 -5090 -5112 -5491 -6568 -4958 -2738 -518 -2426 -5100 2298 5204 -993 -5201
445 -5201 -1634 -2825 -4836 -3737 -405 -500 -440 -1994 -1771 -6082 -819 1456 -540 -442 -1679 -2579 -2677 -2451 -1941
426 -1941 -1223 -710 -594 -4478 310 -661 -3092 -4999 -969 -3824 -2737 -542 -2036 -3465 -4552 -4554 -2533 -371
407 1668 -575 -2219 -1759 576 -1 -1666 -1369 -763 3697 3078 618 -437 -1662 -3430 -4921 -4447 -1370 -2294
389 -2294 -2980 -2257 -430 -1202 -3132 -5301 -3451 -1477 -2949 -3272 -2773 -2398 -2357 -3566 -4396 -4697 -3645 -1936
371 -1936 -2948 -398 -409 -429 -3300 1072 -2285 -5374 -3538 480 -1588 -3108 -4025 -4515 -5215 -5858 -5642 -4525
353 -4525 -3804 -3501 -3344 -2459 -1383 268 1975 -1994 5208 -2864 956 5207 3215 458 -2442 -4810 -4100
336 -4100 -2037 -360 1016 1720 1767 1156 4 -1555 -2909 -3875 -4231 -3649 -2082 48 2622 176 1148 4166 6421
317 6421 5766 3210 8789 4802 7471 3887 14112 32150 46493 50705 43671 27399 9242 -5383
302 88 -1024 -333 602 -462 -622 -1651 3185 2860 1905 662 -84 -998 -1699 -2145 -2628 -3183 -3704 -4512 -5400 -5680
282 -5680 -5196 -4611 -4271 -3974 -3379 -2501 -3024 -3548 -1298 -2611 -2175 -2760 -3502 -3930 -4011 -3937 -3720 -3248 -2977 -2715
262 -2715 -2629 -2595 -2662 -3008 -3451 -3442 -2541 -1017 605 1966 2261 2555 -713 -3604 -4015 2493 3124 3357 -616 -2902
242 -2902 -1830 -4857 -1737 -2996 -1967 -1581 -2054 -2059 -1543 -3625 -2237 -322 1116 2587 -885 3926 324
224 -4187 87 -958 -3377 1098 4290 -2328 -3152 -3201 1327 -3956 -1717 -1546 4376 4595 -1094 -1004 445 -1015
205 -3160 -5398 -3515 -2276 -1993 -2186 -2552 -2727 -2309 -1316 -21 1134 900 -227 -1749 -4577 -3906 -5097 -5027
187 -5027 -1844 -3740 -4862 -1989 -826 -2265 189 -339 -2353 1291 -1290 2019 1865 1778 2079 1600 -1827
169 -2275 -5139 -5856 -3753 -2426 -1584 -6 530 -4434 -487 726 247 -4277 -3799 -1428 -2179 -3405 -2657 -2508
151 -2508 -2768 -3187 -4033 -4865 -3506 -1723 -110 -2909 -2840 -2471 1384 2007 -1676 -2550 333 1294 -907 -3468
133 -3468 -5077 -4305 -5107 -578 1213 3213 4778 -28 392 -3729 -3283 -3669 1870 3177 -1565 -1940 -45 -3009
115 -3009 -464 2195 3367 2817 1340 662 1141 -2851 526 1055 -926 -1473 -988 -521 -2484 -56 -913 -2157
97 -2157 -2941 -3016 -2267 -1766 -1597 -1706 -2059 -1711 -1468 -1468 -1823 -2379 -3040 -4059 -2533 -1986 -1970 -2315 -2997 -4295 -5386
76 -5386 -3669 -1978 -483 -3348 -4769 -2496 -1893 -1555 3222 2789 -3739 -3766 -1580 316 -1665 -2856 -3908
59 -3908 -5332 -4681 -4499 -4708 -4576 -3607 -2594 -3593 -1629 -925 258 1978 -1573 -63 2525 -4084 -2464 -1827
41 -1827 -4129 639 502 -2018 -2598 -492 1756 -1643 3930 3967 3238 2007 -2374 -3241 -228 -2899 -129 -1390
23 -1390 1024 2264 198 -2097 -4463 -4291 -2655 -1050 446 1623 2527 2104 1726 2538 1215 -1412 -2700
6 -2700 -4288 -4449 -3972 -3765 -3664 -3321
0 -3321
##PAGE= F1=1061.654321898
##FIRST=     2915.55639409065, 2671.18566176471, -2140
##DATA TABLE= (F2++(Y..Y)), PROFILE
1023 -2140 -2559 -3635 -3183 -2726 -1817 -103 1196 -1172 3234 -331 3634 5603 862 -687 5926 5375 1166
1005 1526 2099 -1737 -5289 -2124 -879 -141 -4289 -1470 -2306 -4078 -1624 -916 -799 -1018 -841 -3746 1190
987 1760 -3517 -811 -3765 -4296 -1481 -5025 541 606 -2529 -2398 -2858 -2610 -717 2130 5049 7192 8491
970 8491 3140 2390 302 -4190 3089 -118 -2184 -4535 -4802 -3823 -3590 -3852 -4752 -4008 -3627 -3490 -4140 -5304
952 -5304 -5260 -3703 -2802 -4330 2063 4834 -3412 -2890 -233 5171 1188 2029 -2209 -5602 1869 4317 1120
934 -1099 -3545 -2353 -5456 -2001 -516 -646 -3082 -418 3630 35 -1811 -367 -4162 -1580 -1650 -1820 -938 -186
915 -55 1655 -515 -444 -1342 -3407 -2260 -2624 -324 4479 1473 -15 -1308 -4569 -3458 -460 -244 -331 -778 -1736
896 -1736 -2152 -2849 -3412 -3764 -3832 -3733 -3522 -3117 -2710 -2547 -2301 -2064 -1889 -1983 -2566 -3018 -2665 -2325 -4460 -1791
875 -5037 1264 -90 -1516 -2577 -3763 -1798 -1271 -545 192 -784 -2190 -1902 -4705 -5193 -2048 217 1223
858 1223 -1065 -1327 -3496 -4288 -3521 -3229 -3770 -4630 -4639 -4019 -3270 -2311 -1027 1113 3282 4353 4465 4533 -2441
838 405 985 278 -1128 -4580 -3195 -4168 -4846 -4356 -4478 177 2829 2279 2559 2405 4670 4766 3413 2076
820 2076 -4447 -657 -5287 -5231 -3604 -928 646 540 -13218 -10622 -5920 -6564 -1345 -610 -1446 -5300 -6418
803 -6418 -4001 -3428 -1862 -2980 -3071 -1229 3407 3857 3043 1650 277 -877 -1597 -1758 -1653 -2128 -1637 -1701 -1427
784 -1427 -971 -370 186 -730 177 -1344 -1712 -3382 -4108 -2199 -1200 566 2040 1617 215 -1098 -1902 -1833 -3613
765 -3613 64 847 1821 -360 1563 842 -2164 -1601 251 1101 -588 3788 3517 3057 -1868 -3526 -2663 -2591 -4951
746 -4951 -6219 -6295 -5541 -2497 -78 -4558 -2612 -3553 -3065 174 343 -4855 -4839 -1380 -486 1034 -982 -1918 -1918
727 -1918 1003 1099 -4190 -3274 -362 342 -2846 -153 -3230 -6386 -1975 -2347 41 -838 -642 -4100 -854 -295
708 949 -2037 -4583 -826 -361 -2052 -4292 3412 1619 -6 -2377 -3240 -3674 -2552 -5130 -3483 941 4083
691 4083 4143 2452 -162 -4689 -3255 -1380 1674 -281 -1738 -934 -529 -389 -819 -2115 -3791 -3921 -3395 -3209
673 -3209 -4339 -5610 -1938 -1303 -1342 -2297 -3282 -3384 -3029 -2673 -2264 -2114 -2296 -6213 -2454 -2601 -2854 -3947
655 -3947 -5360 -5358 -3170 -782 -575 -1250 -3222 -3133 -2772 -712 31 1 -2701 -4831 -4602 -3620 -3392 -4028 -3981 -1856
634 781 2533 -5706 -3664 -2383 -9536 -185 1032 2119 -1002 -5217 -5725 -3428 -1047 -962 -1529 2785 4114
617 4114 -654 -3957 -709 1654 2363 739 3391 -422 -2403 260 -1316 -3283 -3874 1237 -1783 3267 3735
600 3735 1762 715 376 786 1055 747 -257 -1956 -4133 -5373 -4508 -3625 -3098 -2801 -2186 -1219 -295 501 -85
580 -1211 -5117 -3689 -4316 -5447 -2828 -180 1628 2156 1860 1060 912 -2505 2536 -512 -1112 486 133 -1302
561 -2504 -3259 -3944 -4709 -5681 -6361 -5343 -4134 -3024 -2373 -2674 -3630 -5558 -5846 -2905 -134 -1661 2687 2241
543 2241 -1194 -3336 -2876 921 2667 -3977 354 1164 -1790 -3168 1269 16 -2289 -4996 -4126 -4238 -1582
525 -2136 232 1765 -2822 -760 -4200 -5501 -3152 -2026 -4315 -5143 -5720 -4005 -2629 -1987 -3849 -1664
508 -1926 -2050 -2088 -2214 -2248 -2014 -4323 2747 6314 2567 -2239 -2274 -1856 -1311 -3582 -4387 -3717 -542 1345 562
488 -1928 -2802 -2992 -1633 -1114 1272 -1096 -1423 1316 -2734 -4703 -5063 -2681 -5556 -3472 -323 -2076 -1648
471 -1648 -828 2031 -1077 -4840 -3711 -530 1584 -2994 -1984 -3332 -2659 -1172 447 516 174 1551 -5807
453 -4894 -2265 -1242 -2020 -5154 2142 6102 -1111 -5842 -689 -1517 -1974 -4070 240 590 1187 1681 2602
436 2602 -2892 3931 3135 1319 -1433 -4178 -5096 -4055 -4303 -5337 -5263 -3370 -1105 -5283 851 294 -2718
418 -4351 -97 -4462 -3670 -1082 4045 1814 -961 -2819 -927 1590 3297 -158 -1554 -558 -216 -1073 -813 -2289
400 -2289 492 2795 3559 412 524 245 -4566 -1544 -2157 -1515 -2458 -4217 1083 2662 -2189 -2515 -4666
383 -4666 -2583 -2017 -2857 -2534 -3117 -4152 -1243 -3163 -2604 -2406 -4051 -5616 -6102 -4815 -3695 -2579 -2695
366 -2695 -325 -496 -5570 -4274 -1573 -3347 -4759 -4494 -3895 -3909 -4074 -4091 -3245 -2412 -2024 -2399 -3104 -3857 -2949
347 -2949 -1366 -2842 1458 608 -1811 2997 2090 766 2198 -1748 -32 -1320 -2275 -1641 303 2874 5609
330 5609 8124 9941 11116 11475 11195 10736 6390 4328 4142 2608 1040 1556 2229 3408 4210 4802 6620
313 6620 3466 17159 46875 90708 125664 130196 101003 56131 18494 -1356 -2708 -807 -1612 -2968
299 -2968 -2807 -2370 -2316 -2620 -2546 -2131 -1328 -1128 -1506 -2486 -3820 -5180 -5373 -5043 -5266 -5149 -3656 -1841 -2600
280 -2600 -3277 -930 1777 2234 -513 -677 -143 -3233 -4641 -1716 871 -525 -1927 -984 541 317 959 -153
261 -3437 226 492 -2307 -3376 -5379 -4599 -2994 -1595 -456 212 495 -1044 -4378 -1370 387 -254 -1405
244 -1405 -2768 -3434 -3053 -4521 -2449 -3307 -4292 -4781 -3983 -2941 -2584 -2646 -2620 -2150 -1161 -65 862 1605 839 -3898
223 -70 -984 -2832 -5088 -3546 -1635 33 915 869 -1875 607 -337 -1817 -3335 -4896 -3971 -2751 -2114 -1817
205 -1817 -1508 -2221 -559 -478 -595 -885 -1010 -465 631 1823 2583 253 -6 -3105 -3676 -717 -5219 -4507 -1125 -2094
185 -2094 -4330 -869 -2459 -2394 -363 -697 -2240 183 -2415 1500 -150 296 3500 2890 -1531 -1544 -4358 -5812
167 -5812 -2796 -3958 -4312 -3314 -2080 -3873 -1209 -606 -449 -2781 -3190 -1031 -212 -3346 -2285 -2721 -3514
150 -3514 -4172 -3707 -2275 -265 1430 2158 -1813 -4968 -1282 2840 1177 -856 -2519 -258 4690 3254 1742
133 1742 446 -3872 -2006 -3501 833 1144 663 -948 -3473 -4083 -3902 -2235 2837 3806 -377 -2809 -409 1575
114 3202 4137 4520 5098 4739 3604 -101 -2851 173 -1996 -4020 -5725 -4192 -2591 -2156 -573 -706 -402 -1796
96 -1796 -3605 -3718 -2555 -1596 -1349 -2035 -2472 -2439 -1662 -1178 -746 -1272 -4613 -4506 -259 807 1307 62 -2079 -1561
76 -1561 352 426 425 -2434 -4849 -3088 -2061 -79 897 259 -3318 -3463 -2069 731 -1254 -3411 -1736 -4097
58 -4097 -4138 -2490 -1574 -3157 -975 -2002 -4353 -396 -1103 -1986 -2153 -1423 -64 1785 -3969 -960 -3995 -1276
39 1631 921 -219 -3190 638 1994 -1188 3204 3021 1867 -231 -2727 -4268 -2408 -1221 -3659 -2395 -1834
22 -1834 -2138 -2405 -2478 -2720 -3025 -3431 -3899 -3563 -2543 -1362 -243 214 972 990 111 -723 -2750 -3901 -2760
3 -2760 -3821 -238 -515
0e15
##PAGE= F1=1059.043192219
##FIRST=     2915.55639409065, 2671.18566176471, -3874
##DATA TABLE= (F2++(Y..Y)), PROFILE
1023 -3874 -4326 -3201 -2974 -3618 -723 2146 357 -1402 -2604 -2335 -911 1067 1320 -844 4981 4592 913 2688
1005 2688 3240 -2351 -4124 -4287 -2026 -1296 -3247 -1501 -1086 -4611 -892 -2227 -4008 -3199 -254 -4969 3120
987 2525 -4061 -2359 -5578 -5897 -4098 -4652 -3348 -3296 -4031 -3317 2034 1358 1164 5556 9465 11356 8296
970 8296 2452 658 -1173 -4750 863 -898 -1365 -31 -1504 -2017 -1673 -4013 -6555 -6493 -5723 -5775 -5926 -4515 -3905
951 -3905 -3197 -5054 -5530 -1864 2464 -2909 -9357 -9 7022 3038 1478 -1556 -2939 -1826 -675 -376 -1257
934 -1257 -3141 -5627 -5917 -3908 537 2587 -5187 -1506 2796 -71 -4223 -2450 -4922 -2243 -1980 -2172 -1850
917 -1850 -875 -1583 -2063 -1859 -453 -432 -2974 -1562 -3348 -435 3296 1906 61 -1485 -3244 -4012 -2217 2388
898 2273 1045 -59 -1136 3715 3006 612 -1570 -2736 -2448 -1275 -3139 676 1043 -466 1838 3013 2275
881 2275 -3725 -3196 -4164 -5444 -1414 -3516 2037 4052 -1973 -2830 -2842 623 3171 1874 -526 -2592 -3066
864 -3066 -2799 -2462 -1310 217 3201 4193 -406 870 -649 -3162 -4442 -4426 -3745 -2516 -3188 -3208 -1277 -1808 -4600
845 -4600 -6935 -3887 -764 1918 2240 -3378 -1110 -1346 40 -1302 -1466 -849 -4501 -3532 -2615 -2331 -48 1720
826 1184 2817 2283 3343 1243 111 375 -3050 1476 -5301 -2403 -3791 -5653 -4927 -3909 -26542 -30263
810 -30263 -14240 -6458 -4456 -3112 -2363 -4305 -4556 -1227 -342 49 -2417 -2425 -1258 3400 4609 5309 4740
793 4740 3100 1209 -181 -1309 -1823 -1827 -1789 -2141 -2845 -3949 -4910 -4991 -4166 -3497 -3068 -3084 -3875 -5042 -5997 -5600
773 -5600 -4697 -4162 -4541 -6020 -7686 -6709 -4880 -3660 -1729 319 2321 321 914 305 -3071 -3226 2076
755 -582 525 2314 6044 2978 -3033 -3792 -2509 1604 98 -2908 -4784 -5796 -3303 929 -4907 -2467 -3190
738 -3190 -4909 -1587 -1206 -4611 -3786 -491 -444 2092 722 193 -50 -1167 -4035 -5952 -4995 -3217 -1988 -1803
720 -1803 -2481 -3345 -2961 -1963 -1160 456 -830 -980 -1738 303 -2878 -1446 -1886 -4506 124 1690 -4351 -4393 -2640
701 -2640 -1542 -2626 -3605 -2685 -4065 -6683 -5969 -2448 1525 1213 3306 2040 -90 -3687 -4266 -926 -1156
684 -1156 -70 -3172 1337 3813 2493 155 -2139 -2648 -1759 -3165 -3870 -3640 -4460 -2175 -1612 -3895 -4755 -4668
666 -4668 -4732 -3612 -699 2218 2755 178 -4587 -1868 -2577 -1749 -5268 -5476 -3079 -874 -1337 177 -231 -3756
648 -3756 -2856 -4380 -2365 -3943 -5355 -5741 -4245 -2290 -1038 -459 -806 -2217 -4253 -6018 -5992 -6687 -4404
631 -4404 -3805 -9654 -3451 -3984 -4884 -6206 -7335 -5710 -1634 1565 546 1493 4262 3962 -1530 -4473 -963
613 1561 -109 -1459 723 -4061 -3732 1113 -646 -2479 -3482 1502 -275 3973 4848 6073 5303 2542 3036
596 3036 4105 2790 1590 -608 984 1741 1417 -2675 1976 1930 922 -455 -2354 -4353 -5569 -4613 -3953 -5088
578 -5088 -1797 -3016 -2351 2760 4251 4734 4630 2621 5367 -2182 3551 -248 -1033 -80 -336 -30 186 -1934
559 -1607 -3398 -3804 -3028 -2226 -2633 -1480 -959 -1869 -3107 -4740 -5888 -5215 -3485 -2436 202 1304 -751
541 639 639 -127 -738 -2858 -2254 -3437 -4723 -5990 -6981 -7156 -7444 -6689 -5356 -3822 -2062 -290 -221 219 -601
521 -983 -3773 -3404 -1082 990 -1157 -1954 -3300 -4075 -4194 -4431 -4767 -4610 -4180 -3320 -2526 -2176 -2053 -1967 -3795
502 -3795 976 3331 1262 -3479 -2653 182 1572 -2397 -4657 -6620 -3792 -1473 -1166 -2222 -3530 -5754
486 -5754 -5379 -2921 -430 -1330 -1252 2184 -3698 -62 1646 794 -4214 -4856 -1984 -4497 -896 -635 -1985 -3518
468 -3518 -4193 -2850 -990 303 -2938 -1209 -2452 -1899 -1959 141 583 -2013 2286 -4799 -4624 -1777 -613 -1500
450 -1500 -4062 1538 4395 -751 -2225 -971 -2295 -3510 -4340 -4658 -4612 -4167 -4126 -5210 -6307 -4778 -2048
432 675 2588 3747 3627 2597 789 -805 -604 1678 119 -5484 645 1383 -2270 -3467 191 -2990 -4155
415 -4155 -2232 3496 3215 -988 -2088 49 -589 110 -193 -802 -708 420 2624 4519 -2785 1540 4623 3087
397 3087 -259 616 909 -4823 -2900 -2922 -2272 -2878 -3100 2844 3747 -748 -2485 -5427 -3073 -2789 -3032 -2343
379 -2343 -2960 -4302 -3676 -5247 -3280 -633 -1219 -3953 -3218 1953 -696 -1604 -2338 3009 1603 -5118 -3888
362 -3888 344 -2097 -7185 -3808 -931 1449 1577 201 -1136 -1231 26 1170 1651 875 169 0 -3250 1357 1670
343 1670 -1414 -88 -1412 -2520 -3492 -4275 -4537 -3748 -2199 -1544 1443 3154 4820 6317 7493 8505 8974
326 8974 8723 7614 3682 2549 779 1145 99 1438 7997 -1872 7889 7471 3466 3123 -5564 58972 178594
309 178594 297990 343193 284469 163261 52466 -4388 -451 562 -3022 769 342 490 -3049 -842
294 -1816 -2759 -3681 -4166 -2874 -928 605 1161 1027 -3234 -4540 -809 -936 -517 -1736 -1909 -1117 1094 -1532
275 1421 192 -1879 -4370 -5237 -4274 -3034 -2381 -3284 -3811 -5716 -5730 -3403 -1198 -3930 1564 2007 -2611
257 -504 -1673 -1670 -976 -654 -1159 -2547 -4229 -5330 -5400 -5460 -5967 -6687 -7403 -7796 -7103 -5841 -4228 -2958 -2300
238 -2300 -2235 -3357 -5538 -8111 -5493 -2855 -1203 -897 -1603 -2998 -4832 -6412 -4584 -3390 -269 -1293
222 -1293 -622 3796 3180 -658 3597 3513 2249 548 -708 -1422 -642 967 -3372 -2566 -448 -1428 -3908 -5332
204 -5332 -5219 -5180 -5780 -5189 -2848 -16 1487 1418 3034 624 -3658 -6461 -1021 3835 -1239 -3599 -2930 -146
185 -1386 -4726 -1972 -4395 -1859 -2291 -4424 -6542 -6403 -4686 -2395 -2476 -97 7060 2265 -1470 472 -2891
167 -5824 -918 -1781 -2783 -3279 -3045 -3207 -1628 -1106 -1506 -1044 -2261 -1763 -2741 -4180 -3780 -3816 -4091 -4479 -2949
148 -2949 -2703 -774 1032 2812 -266 -3616 187 2261 291 0 -1230 -722 695 460 257 -23 -2409 -1055 -2331
129 -2331 -4116 -5863 -4755 -2437 40 245 -2811 -587 1269 -1736 -5425 -5161 -1212 2093 3955 3540 2980
112 2980 5600 3064 363 -1230 -1800 642 1704 2126 -4374 -2559 1016 -618 -2124 -806 1250 -3036 1260
94 1097 892 554 20 -790 -937 -951 -784 -2203 -1012 -1276 -2282 -2149 3741 3522 362 -316 -1869 -1055 -515
74 -596 -316 -1506 -4514 -3412 -1318 -1500 -2335 -3414 -3047 -1926 -1844 184 -1382 -2435 -3121 -1245 -2439 -710
55 -1746 -1851 421 -1242 -2383 1679 716 2295 2512 -1513 -3972 -5707 -3965 -2850 -2610 -2774 -2102 -424
37 -1794 -4683 -775 806 -1592 -2371 -3554 -4298 -4705 -4287 -3812 -3620 -3917 -3997 -2953 -1516 -333 -372 -1354 -3026
18 -3026 -3891 -2911 -1842 -1222 -1049 -776 -2014 -2318 569 354 -151 -598 -3425 -2493 1370 -2788 1980 -787
##PAGE= F1=1056.43206254
##FIRST=     2915.55639409065, 2671.18566176471, -4718
##DATA TABLE= (F2++(Y..Y)), PROFILE
1023 -4718 -4683 -2215 -2657 -4751 927 2573 421 -1077 -1895 -1885 -1150 400 1577 -293 4081 4113 938 3375
1005 3375 3605 -2730 -2273 -4535 -6675 -7848 -7787 -7087 -6337 -6024 -6421 -7041 -6723 -4790 -2521 -6054 -337 -873
987 -873 -4507 -4595 -7034 -8144 -6718 -5717 -4986 -3609 -5454 -4113 1609 1842 1616 6328 8971 8224 5931
970 5931 1048 -1146 -2472 -5438 -1913 -1613 -957 338 -1330 -1458 -2640 -3671 -3857 -2331 -2330 -1959 -6036
953 -6036 -2555 -3593 -5306 -6552 -4527 -1700 1582 -514 -4141 3347 9945 4859 5653 2392 -1020 -865
937 -865 -1756 -1836 -2157 -3198 -5075 -7341 -6333 -3733 -1748 -2658 -2256 -1322 -1843 -5805 -4705 -5805 -2829
919 -3427 -3954 -4445 -4688 -4279 -3056 -2826 677 511 -2300 -816 -1119 1442 5283 2938 186 -2336 -4108 -4399
901 -4399 -3938 1033 3663 2529 1809 -1983 2298 9861 8795 1758 -717 -964 -1665 -4666 -7065 -5658
885 -5658 -3614 -2173 -1134 32 -3364 -5187 -5154 -5578 -1371 -2871 374 -3024 -5599 -3242 -2438 -1248 935
867 462 -1528 -3635 -3372 -1182 -962 -1408 60 3125 5815 600 1018 1416 -1543 -4500 -5466 -4133 -2355 -1626
849 -1626 -2138 -510 -2494 -4516 -2958 331 2552 455 -789 -3925 -2720 -3582 -128 -2084 -2444 -382 -1945
832 -1945 -1400 -300 -478 884 -1507 -819 592 1011 612 209 123 184 -1858 452 -3861 -2873 -3733 -4414 -6652
813 -6652 -7541 -18066 -35635 -15665 -2604 -1839 -1876 -3089 -3116 -4133 -5271 -5868 -5701 -5376 -5416 -6030 -6554 -6290
795 -6290 -4924 -3303 -1502 114 1257 1803 1443 -677 -892 -433 -170 -45 -228 -997 -1988 -2207 -516 1934 797
775 -4069 -1644 -691 -4206 -3893 -329 -1712 -2900 -3655 -3543 -3492 -209 2526 3433 957 510 8 -3769 -4105 -1377
755 -427 1167 206 3040 1070 -3714 -3722 -2703 2021 -178 -3421 -4283 -3898 -3534 -2131 -5256 -2278 -1383 -4801
737 -4801 -3272 -2622 -3466 -1665 -1510 319 -973 -2744 -3918 -4711 -5586 -6328 -6880 -7347 -7575 -7693 -8086 -7911 -6061
718 -6061 -3694 -1730 -642 157 -1203 -1131 223 1519 -3435 -3624 -1281 -3134 -890 1031 -3399 -3231 600
700 -1441 -2699 -4470 -4012 -4454 -4876 -4514 -4140 749 -1558 1951 1149 -730 -3153 -4812 -1220 334 489 -4352
681 1435 1548 288 -1237 -4060 -2170 -1399 -1938 -2214 -2347 -2542 -2479 -1277 -83 -3314 3864 2470 -362 -2618
663 -2618 -1279 1979 830 -3405 -1854 -2790 -1092 -3532 -3221 -905 1695 -1831 1288 536 -3612 -1706
646 -5061 -3927 -4087 -3277 -2398 -3193 -1278 -215 -1551 -279 532 1013 -79 -1913 -4892 -7577 -9556 -8215 -6459
628 -6459 -6322 -7127 -8355 -8972 -8023 -6559 -4497 -2269 -389 542 572 -1907 -3492 -353 1733 -2327 -3820
611 -3820 447 -126 618 1977 -153 -1481 -3676 1409 851 4131 4193 2249 2565 609 2289 8543 9168 6267
593 6267 505 4705 7595 1529 -3610 1362 2726 4377 3054 232 -1527 -1240 1047 -2143 -6064 -1852
576 -3253 -1714 -2951 -5267 -5571 -4492 -3207 -1406 -1127 2967 -676 -895 -484 -248 -271 -4039 -8147 -7687
559 -7687 -3920 -911 -2046 719 -971 -2048 -1679 -529 -667 -1263 -2240 -3429 -4846 -5707 -6082 -5785 -5433 -5236
541 -5236 -4851 -4010 -3181 -3077 -4157 -6351 -9296 -8955 -5202 -2553 -1468 -2033 -4154 -6755 -7051 -4368 -1109
523 66 1149 -1882 -1554 -921 421 2989 1029 -1029 -2108 -3770 -4755 -5497 -6188 -6904 -7881 -7605 -6155 -4536
505 -4536 -3140 -2546 -3386 -3104 -2841 -1429 -5259 -3490 1971 2210 -649 -3144 -3961 -1853 1113 -2562 -2327
488 -2327 2082 -41 -5037 -2439 -1279 -2027 -1587 2232 -2614 857 10 -638 -3301 -5308 -1772 -3151 -2651
471 -2651 -2793 -2844 -2214 -1468 -942 -1260 -2667 -4652 -6663 -6182 -3826 -2399 -1337 -1784 -2577 3426 -3882 -4286
453 -4286 -2021 186 -1188 -3334 -1662 -4307 -7200 -9220 -7518 -4039 -316 20 3304 2981 6582 4519
437 4519 2612 3524 6797 9896 11488 10902 8828 5670 2797 1127 1484 3604 6320 -1016 -5089 -179
420 2496 -1552 -2752 -109 -1726 -3075 -2772 2842 2666 -2634 -3941 3413 4658 1493 -802 -381 -322 -5499
403 -5499 -10239 -5193 -2807 1751 3437 3208 -1319 -218 -2340 -4418 -5946 -6222 -5977 -5226 -4397 -2670 634
385 1698 -2861 -5758 -3134 -3535 -3471 -2785 -2043 -1977 -1546 -4355 -4857 -1990 -1547 -4070 -2960 1488 -756 -3008
367 -3008 -2290 4367 3589 -4057 -3190 -380 130 -2431 -5898 -4681 -2903 -2763 -4526 -5194 -2006 2501 5984
350 5984 7795 7283 5585 3042 -2453 -1783 -3479 -4690 -5080 -4817 -4042 -3335 -2895 -2571 -2484 -2809 -6237 -3485
332 -3485 -3939 -3777 -3434 -3221 -2967 -3939 -5867 -8071 -8398 -6121 -4508 -1085 370 4158 15692 7461 15960
315 15960 3887 17159 -5564 48276 274082 603140 839620 822267 564618 106804 48515
303 28144 20721 4366 2918 7417 5946 3726 -2545 4288 3264 1651 2237 2785 3977 3625 2761 7253
287 7253 5490 -720 -2622 -531 -1149 -2256 -5485 -6239 -4272 -2340 -2628 -1712 -2904 -4494 -6366 -7011 -6474
270 -6474 -5157 -3317 -5080 461 1263 847 -1513 -4191 -6471 -4815 -1581 -3404 2416 3728 3222 2716
254 2716 4061 5236 1836 -3100 -8108 -4549 -494 2097 3126 2472 137 -3595 -8223 -7794 -4009 -1305
237 -1367 603 -2355 -2686 -4413 -5273 -5456 -3489 -1834 -3923 -2529 -3977 -3164 -3001 -1090 -2214 -276 3477
219 1121 -6 4178 3979 3700 1572 1828 1563 -2100 -1108 -3000 -3073 -4047 -7023 -6371 -4064 -2472 -1781 -1801 -1784
200 -1784 -1601 -1491 -1861 -3401 -6349 -7700 -2728 412 5082 5494 -1917 -2708 -1359 767 -1292 -3810 -3867
183 -3867 -5228 -1827 -1587 -2505 -4133 -5374 -4485 -1919 -5473 1487 4852 1017 -1887 913 -1897 -5946
167 -5946 -826 -1073 -2575 -3054 -4356 -5080 -4705 -3933 -3297 -3112 -2976 -2443 -1194 -4915 586 -975 -1012 -3267 -4341
148 -4341 -2133 -587 747 2827 438 -2272 1058 1635 -779 -1010 -1503 -2078 -3431 -4623 -4300 -2952 -1957 -1897
130 -1897 -3018 -4607 -5493 -4707 -3342 -1663 99 -1273 425 702 -719 -2363 -4021 -4901 -3969 -1716 876 677
112 677 3349 808 -2215 -1484 -2756 -2374 -601 1654 -4003 -3853 2567 1012 -3865 -1276 282 -3889 1411
94 -318 8939 9621 8465 6461 4565 2128 -546 -2982 -4522 -4997 -4394 -3285 -2072 -1406 -1409 -2179 -3641 -4642
76 -4642 -4126 -3274 -3185 -3303 -4111 -3558 -450 2194 4669 2329 -2057 -6748 -6105 -3417 -2516 -2428 -3368 -322 -3732
57 -3732 -1041 -2210 1199 3477 -439 -344 2713 64 999 1723 -1501 -4033 -5022 -2493 298 2255 2984 174
38 -1426 -4137 -3588 -829 -2283 -3674 -4676 -5183 -5531 -5713 -5469 -5191 -4592 -3826 -3046 -2582 -2780 -3438 -4888 -6384
19 -6384 -7408 -7321 -6699 -5949 -4763 -3261 -1463 -4693 -4498 -1862 2303 1670 -483 -3510 -1837 997 -1484
1 3109 -927
##PAGE= F1=1053.820932861
##FIRST=     2915.55639409065, 2671.18566176471, -2567
##DATA TABLE= (F2++(Y..Y)), PROFILE
1023 -2567 -2689 -1117 -2044 -4631 -1593 -2197 -1235 371 1173 -1101 -1879 -5234 -7610 -5857 -3900 -3443 -4063
1006 -4063 -4595 -3300 -1895 -304 -1961 -986 -4218 -631 -4397 -7306 -6840 -5061 -3704 -2888 -2003 -1035 -6284
989 -6284 -162 -1037 -4598 -5063 -5818 -3143 294 -1083 -1462 -2203 -5413 -4565 -172 2332 2527 7704 9674 7346
971 7346 3368 -597 -2625 -3314 -6106 -4066 -4390 -3237 -444 -1021 -1086 -3442 -3632 -3188 -2100 -2914 -2521 -7505
953 -7505 -3463 -4315 -5322 -6784 -7825 -7401 -5434 -2876 43 2583 4041 4213 2921 140 -3280 -6423 -6079
936 -6079 -3398 -2432 528 1433 2382 462 1058 8269 -653 -2250 2506 141 -2250 -3859 -4079 -1820 -3105
919 -3105 -2397 -1259 -2386 -4533 -6361 -6543 -5710 -4812 -3642 -1159 1405 4747 6296 4887 3439 2536
903 2536 -337 -1665 -5009 -3967 -5619 -7931 -9694 -7052 -3684 -371 2465 3477 -1657 -1379 1330 -493
886 -491 -1351 -5205 1454 7064 -879 -1592 -2763 -3458 -4881 -1744 -3275 -1829 -2410 -2519 -1860 -2583 -2890 -2151
868 -2151 -3883 -6231 -9545 -9545 -6165 -3173 -2173 121 367 -79 -1349 -3203 -5072 -6489 -7097 -6985 -6612 -6280
850 -6280 -5960 -5557 -4518 -2261 -1104 3753 5504 744 -2529 -3463 -3353 -4238 -4018 -462 -2985 -2960 338 482
832 482 330 1232 678 476 -1195 -3273 -4643 -3472 1169 5739 7844 6622 -1506 2911 -2629 -3334 -4905
815 -4905 -3448 -2490 -1272 -9517 -25771 -13182 -2452 -3372 -3930 -4605 -3911 -3925 -4367 -4997 -5871 -7059 -7848
798 -7848 -5918 -1565 1944 4355 4980 3728 1609 5274 2911 -295 57 217 -776 4276 6406 2732 1995
781 1995 6237 8444 3739 3362 58 -3857 -1526 -2171 -6160 -7253 -6299 -6065 -6565 -6962 -5098 -3266 2713
763 5528 3688 1472 740 52 -4627 -4647 -6187 -6942 -7676 -7414 -5491 -2627 -4097 -3941 -3769 1275 -386 -1365
745 -1365 -1692 -2413 -501 -833 -4758 -2505 -1823 -2825 -3367 -2965 -2109 -320 -1293 1167 1432 1832 1092 218 -461
725 1030 4660 5207 1727 949 -1886 -3383 -1284 -3714 -1175 -1256 -784 -2049 -1195 1079 2020 -2104 -5247
708 -5247 -762 -1920 -1508 619 -938 -2054 -2065 -2109 -2501 -4076 -4435 -5145 -5226 -2729 -1971 589 -3414 -319 -444
689 -444 -2074 -3546 -5304 -2814 -4803 -7048 -8495 -7515 -6541 -6180 -6185 -5660 -3683 -1231 -1023 -869 -976 -946
671 -946 -3352 -5442 -5994 -4943 -3742 -3001 -2810 -3160 -3773 -4942 -6681 -7625 -5897 -2975 74 2382 3717
654 3717 864 -102 -5418 -9873 -6002 -3320 -764 -4787 -1017 -1328 251 -1285 -2760 -738 -4871 -9575 -7689
637 -7689 -4895 -4207 -5562 -8125 -10103 -8977 -7470 -7067 -6594 -5380 -2972 -368 -4278 -5298 90 -2376 -5658
620 -5658 -9163 -12189 -9894 -7760 -5545 -2704 670 -3721 -4841 -1862 -505 1448 1321 -1841 -4206 -4694
604 -4694 -3132 -948 827 1100 -274 -2117 -1602 1097 7977 9638 4660 948 5550 7919 2369 -4566 218
586 1300 -4037 -10374 -7927 -2420 -1961 1682 -1412 -6351 -2317 -3775 -2094 2729 3096 1780 575 -829
569 -2190 -3638 -5106 -6526 -7799 -8362 -7379 -5724 -4567 -4311 -5253 -6798 -7433 -6105 -4257 -2245 -2568 -3301
552 -3301 1159 3792 3031 723 -2876 -7053 -7221 -2868 1599 3309 -2156 -2589 -3907 -1073 -899 -2960
536 -2960 -1097 638 -618 -6436 -6859 -630 83 -3072 1963 2899 1275 -1585 -1752 699 -3279 577 1140 991
518 991 352 -3066 -4711 -3337 -1767 -243 -315 -1639 235 1191 2386 -4814 -11147 -4424 1460 -3256 4651
500 2855 -4203 -4556 -2941 3332 5171 576 -1592 -2984 1187 3679 -3614 -2774 6968 4697 -4109 -1389
483 -1760 -2851 -2418 1677 -719 -1799 -3276 -3621 -3617 -5052 -4123 -4058 -2426 248 1161 3849 4336 3929 2258
465 2258 -751 -3538 -2727 -1852 -727 -2062 -2400 -4010 -957 4674 -3347 -4228 -5610 -5995 -5531 -5460 -6101 -7325
447 -7325 -8780 -10006 -8772 -5329 -1563 1583 4037 2233 3224 6755 5875 5440 5765 6193 6052 4506 1996
429 -963 -2436 -1935 -646 415 1093 -2458 -4550 -1749 2681 -443 -4691 -8191 -7432 -4849 -3384 -3238 -3017
412 -3017 -4583 -5028 1880 2182 -593 -1867 -527 1622 5158 2934 298 -2452 -5049 -6674 -7918 -8351 -8556
395 -8556 -9020 -10147 -11044 -9567 -8138 -6845 -6119 -5002 -2536 1078 -2779 -6300 -2904 -3274 -3936 -3481 -879
377 489 1477 -3031 -6584 -11449 -6018 -2547 -3156 -28 -726 -4544 -1786 -336 -1986 -2605 -2583 -886 -411 -2482
359 -2482 -5074 -6951 -7108 -5681 -4449 -2443 710 4117 6540 8128 7482 5598 3943 -1016 1685 1693 160
341 -1813 -3458 -3618 -1738 -1079 2584 1059 -701 -5152 -6874 -3127 2383 10525 7315 10901 19267 -2571
324 9930 -3462 -80 2439 7684 3575 9148 15702 11320 30623 14112 46875 58972 274082 2816885
310 2816885 5904532 8139416 8019407 5621001 1453310 410652 163469 98626 34913
300 12781 12980 10748 6097 1394 -2235 -6629 -5272 -8558 886 2708 3704 512 11330 3969 2353 -519
283 -560 -1138 -3730 -5055 -3056 -2033 1704 -181 1877 3629 1441 -1105 -4308 -7041 -8053 -8181 -7275
267 -7275 -7017 -6141 -5829 -6421 -7778 -9232 -7320 -4863 -3315 -1219 -284 885 2052 2499 1982 -20 -3721 -8360
249 -8360 -5933 -562 4102 7292 7875 3150 876 -120 -2502 -2629 -2798 -3947 -3969 -2113 -2973 -4750 1518
231 544 -1922 -1292 -3393 6560 6567 2140 -2451 -2385 -5208 -5015 -4016 -4096 -5786 -8896 -6822 -1373 1571 915
213 915 1316 -1683 -4193 -1918 -1842 -2531 -4321 -5543 -6239 -6452 -6383 -6350 -6236 -6362 -7026 -8392 -10285 -6713 -3012
193 -2220 208 4375 5972 -1730 -2199 179 1714 -1470 -3717 -4022 -3447 -2139 -2177 -3712 -1714 -1564 -2212
176 -2212 -2783 -3071 4089 5074 1340 -3620 -8972 -7553 -5148 -4199 -4317 -4389 -4011 -4150 -4656 -3933 -1777 -3595
158 -3595 825 -261 -2224 -2980 -2700 46 -584 169 -1462 -4360 -1084 -1746 -3870 -4645 -3794 -2747 -2455 -3158
140 -3158 -3552 -3253 -3134 -4011 -5950 -6265 -3567 -508 -874 2717 2812 370 2573 2716 -2235 -1687 283 -1411
121 -2853 -3048 -1620 725 -1204 -4555 -851 1356 -75 -1347 826 104 -3424 -414 -155 623 2607 -1671 -4954
103 -4954 -5979 -5238 -3750 -4035 -1692 -632 -2889 157 -1720 3640 13957 13613 -5209 412 4311 -372 -2836
86 -2836 -1859 -4418 -4271 -2452 -608 224 -26 -2207 -3638 -6299 -8472 -10007 -9969 -6918 -3872 -3494 383 3299
68 3299 5483 2678 -2382 -7948 -12832 -9733 -8640 -9156 -9382 -7254 -4482 -1242 -2361 1038 400 163
51 921 2281 -784 -206 -40 -4397 -8652 -9528 -7204 -5185 -4149 -3863 -3573 -2761 -4058 -1216 1078 -1906 -4291
33 -4291 -984 4519 3174 -752 -3769 -5702 -6718 -7681 -8732 -9404 -8960 -7001 -4783 -2774 -1585 -862 -772
16 -772 1798 2314 228 -2935 -4258 -2876 -4726 1376 2248 -716 -2833 -1242 598 -372 3654 -1151
##PAGE= F1=1051.209803181
##FIRST=     2915.55639409065, 2671.18566176471, -296
##DATA TABLE= (F2++(Y..Y)), PROFILE
1023 -296 -701 21 -1010 -2971 -5384 -9723 -12264 -12658 -11740 -9795 -6682 -2066 537 2615 5748 3013 -4623
1005 -15876 -20741 -5651 1300 -1740 -2331 -5243 1525 -816 2239 -13170 -19150 -2090 -1325 -1114 -1715 -4938
989 -4938 2528 -422 -9247 -16219 -17107 -13115 -9644 -7923 -8887 -11763 -12930 -6499 162 2697 4209 10018
973 10018 11007 5962 941 -2299 -3596 -3960 -5493 -3074 -233 752 1245 -965 -1159 -3878 -2672 -2434 -2127
956 -2127 -3685 -18043 -14173 -4626 -4648 -3438 -5671 -8727 -7769 -3420 606 2336 1084 -1903 -3629 -2619
940 -2619 -1309 -2381 -7329 -14211 -16052 -9961 -3755 939 4523 2551 519 9035 334 -1690 2738 884
923 1612 -842 -5056 -7714 -5804 -1686 -121 873 2264 -1750 -2095 -2769 -12303 -13540 -4583 2903 6601
907 6601 6757 4400 2551 1465 -1990 -7535 -12322 -11606 -7366 -4550 -4677 -6887 -9179 -10004 -10348 -12340
891 -12340 -17310 -22920 -13532 -4065 -1892 -2137 -4305 3017 -3988 -13487 -21425 -18378 -14983 -14462 -15479
876 -15479 -15377 -13240 -10980 -9902 -10675 -12462 -13765 -13007 -10401 -7089 -4442 -2531 -1345 -773 -3459 -129
859 1102 6257 4179 731 2085 -1785 1213 4838 37 -7813 -16251 -20159 -12765 -4441 -1550 5034 4690
843 4690 -825 -3883 -4702 -5324 -6926 -10606 -13917 -9574 -2894 922 2015 1119 1701 1070 -284 -1878 991
825 1308 -2365 -11160 -1467 7516 6859 -2279 713 -8398 -2937 -5941 -885 8357 -1160 -12947 -21767 -13186
809 -13186 -6857 -5858 -4983 -5047 -730 2330 4121 -1701 1593 -4035 -11844 -8151 -1932 -642 -780 -5178 -10544
792 -10544 -15377 -18296 -18115 -15379 -10855 -4771 -734 2755 4705 2592 2884 7192 6833 4239 4642 -705
775 -2581 166 -435 -9193 -14903 -12563 -7686 -4986 -6358 -11546 -16830 -13260 -4175 3536 2031 1386 375
758 -4803 -4672 -577 -180 -1251 -3351 -4832 -3573 -12907 -12084 -5421 -202 -1778 -847 -480 -2340 -2019 -2477
741 -2477 -5490 -16517 -25417 -18178 -13015 -10466 -7116 -832 676 2656 5099 -4278 -12387 -4243 -1063
725 -266 4139 4629 1249 235 -1053 -9716 -2304 -2864 -884 -2546 -1420 -2642 -724 970 1649 -1120 -3843
708 -3843 -331 -828 -8196 -22295 -15376 -1831 3447 59 1154 -7747 -19764 -24389 -16447 -12345 -12526 -16527
692 -16527 -22469 -24523 -21211 -20840 -25430 -20296 -5334 1408 -1760 -2488 2192 4913 5715 2706 -2076 -1277
676 -1277 -868 -590 112 687 1908 -530 1755 -1355 -3097 -2853 -1592 -282 -2159 -2784 1653 833 -1505
658 -4047 -4259 -602 1295 3638 473 977 -2779 3259 114 -7699 -20778 -20818 -4878 -1787 158 -1949 -1903
641 -1903 -461 514 -3252 -433 1902 -8125 -15237 -14788 -10206 -5762 -1172 -7028 5310 15642 18422 14167
625 14167 -6167 -5041 551 -5763 -10589 -13934 -16607 -19445 -22773 -24368 -19768 -13614 -8613 -6497 -6934
610 -6934 -8495 -8735 -7225 -6301 -8575 -14213 -19630 -15766 -7021 115 4262 991 -3236 132 6916 7083 2357
592 1004 5950 8108 3842 -3049 -1289 -18694 -19781 -3481 4483 -1964 -2344 1891 -1680 -5911 -7317
577 -7317 -6454 -3486 545 2579 3813 -1485 944 7822 -1562 1618 -3348 -459 688 4026 -5664 -15279
561 -15279 -17470 -12066 -7418 -6868 -10301 -13828 -10505 -2775 -1499 1097 4823 9510 5237 -396 -3244
546 -3244 -4004 -5712 -9771 -11927 -11945 -8323 -2893 -517 -238 -3875 449 2349 -22 -5130 -21542 -7892 533
528 -2655 2797 2668 2075 -1548 2103 1265 -3567 2287 2664 1009 2540 456 -3405 -2534 -3582 -2691 -7865
511 -7865 -10806 -11567 -15069 -22721 -19383 -4310 1497 4533 -3178 4492 2970 -3258 -1636 -791 4293 5420
495 5420 1065 -7331 -24511 -15568 -1200 -3721 -2719 7009 5281 -2651 -2733 -2421 -2927 -3260 -5875 -12660
479 -12660 -14870 -11600 -7971 -6285 -4814 301 -77 676 2505 1101 4245 9687 12366 11002 5006 1448
462 -8477 -16910 -12520 -5726 -3078 -5045 -9917 -14691 -17115 -17707 -18100 -16993 -12327 -6346 -4629 -1933 -3774
446 -3774 -9389 -16763 -23779 -24182 -20699 -19940 -20850 -19172 -14377 -8989 -3205 3352 9919 14867 16134 12874
430 12874 4692 -5888 -14093 -13384 -8723 -6272 -6398 -7079 -6317 -4497 -3533 -4149 -6440 -10817 -17702 -26510
414 -26510 -13735 493 -4908 -4371 -189 -371 -2913 -3236 -1405 855 707 -11047 -24444 -17639 -8024 -3330
397 -4519 -10255 -18084 -18576 -10804 -3802 -1792 -1679 -3472 -8307 -10966 -7813 -1879 -2165 -5321 -2147 -2534
381 -2534 -7454 -10534 -12048 -11537 -8877 -5745 -5875 -5443 -1077 -787 -2910 -3523 -7034 -10265 -15943 -20970
365 -20970 -19369 -12646 -7393 -6522 -7099 -11572 -17444 -22232 -23412 -16916 -11531 -3578 1232 4489 11587
350 11587 19788 16513 25487 20598 283 -1587 7462 -5969 -18305 -21739 -7354 -5408 -12348 -17525 -4325
334 10587 -3844 15065 11700 20844 21965 2755 6366 6132 2156 4728 3116 4539 9344 4525 7624
319 7624 14273 20955 27645 40252 32150 90708 178594 603140 5904532 47348087 67811769
308 67811769 69399196 28037169 3774398 1283190 397588 187768 100084 24438 18685
299 18685 14889 14389 5866 9893 15416 8447 3457 7325 666 4083 -2220 10776 1932 5191 1350
283 -710 -883 2602 -921 1249 -2259 481 1226 831 3178 904 2837 6019 7186 626 -3809 -954 -4567
266 -4567 -13629 -17627 -20455 -22091 -18103 -15543 -11403 -11322 -16684 -20103 -14526 -4134 1932 4046 963 -3952
249 -12742 -13244 -3467 3327 5607 5710 2441 1984 3328 3229 3245 3070 -1081 -2081 -6087 -7867 -7481 -5253
232 -5253 -4751 -7121 -11884 -19618 -22429 -13503 -5587 -2017 -3590 -4181 -1257 -385 -2188 1701 4743 -2202
215 -7879 -3011 -327 1057 809 -1906 -1337 -54 1261 -2068 1202 816 -373 -10105 -18666 -21415 -18124 -15433
198 -15433 -13993 -12813 -10809 -7928 -5004 -2774 -1875 -2351 -3116 -3215 -1795 665 -2005 -4527 -2762 -2148 -2779
181 -2779 -2741 -4573 -7624 -7984 -3753 -4315 -1332 237 -4742 -9385 -8889 -3919 -998 -4329 4207 4487 -2371
163 2649 -1508 -3801 -8008 -17907 -22283 -15225 -11222 -11371 -14289 -14913 -8174 1107 1920 330 -2725 -479
146 475 1638 671 -284 -182 2506 324 -2122 300 714 -3715 1342 -2560 -7395 -12150 -15654 -17345 -17868
129 -17868 -16599 -12940 -8295 -5505 -6318 -11285 -17836 -12286 -693 2260 734 -354 -3390 -3800 -229 -890 -1346
112 -1346 -2782 3099 -762 -2312 -8642 -15955 -17132 -10457 -5677 -5739 -11533 -21988 -13991 -1511 -591 -2196
96 -2196 -2052 49 -1426 5694 1862 -2419 -12724 -5657 -2400 -2899 -926 -15236 -12161 2065 2691 401 -628
78 -3255 -5133 -1885 957 1380 -739 -1041 -4008 -3374 1181 4532 4989 3060 2125 2058 180 -4722 -12305 -20710
60 -20710 -21525 -17886 -17901 -19366 -15003 -7743 -771 689 1098 1779 -1575 -1399 -300 -1036 -2115 -3213 352 2564
42 2564 -627 -6466 -9007 -7309 -1426 717 3594 -1339 -4769 -2872 3051 1874 -10780 -18203 -12746 -6305
25 -1566 1285 304 -805 -5496 -11724 -17325 -19971 -19407 -18637 -17097 -13606 -9255 -5452 -3655 -5127 -10038
9 -10038 -15571 -12408 -3968 -2044 -1085 -56 453 3710 -1727
##PAGE= F1=1048.598673502
##FIRST=     2915.55639409065, 2671.18566176471, -31299
##DATA TABLE= (F2++(Y..Y)), PROFILE
1023 -31299 -22255 -15582 -10728 -6212 -1026 5461 -2299 -205 1942 809 1748 929 -504 3164 -6386 -21122
1007 -21122 -41348 -55193 -28253 1700 2146 -1704 -3232 -4724 2495 -1320 1610 -18215 -43666 -28965
993 -28965 -6096 -3588 -2350 -3202 1119 -1187 -11467 -21569 -30884 -38794 -44252 -43982 -37489 -27110 -14777
978 -14777 -4788 -836 2789 6334 12591 10709 4111 -1191 -3770 -3690 -4661 -3994 -435 1625 1098 908 -1457
960 -1726 -4325 -1475 -1753 -2514 -4511 -19967 -36735 -17755 -6972 -8432 -19236 -33797 -41473 -33800
946 -33800 -24180 -17990 -13287 -5386 6722 6006 2906 437 -4405 -32604 -51620 -25220 -6044 5043 5499
931 5499 3908 -619 7990 359 -940 3041 1854 -13706 -35865 -36630 -8685 -1408 788 846 408 2005 -1766
913 -2021 -13655 -40833 -23486 -610 3810 10799 7700 3898 2181 -5970 -21377 -35330 -23867 -998
898 7087 7471 4550 938 5436 4360 -5588 -20452 -41578 -45267 -17924 3222 -3481 -2477 -3166 4009
882 6716 -1374 -3222 -832 -1243 -7693 -20142 -35374 -49383 -51706 -47665 -46658 -40196 -26652 -10461
867 -2705 -125 -1371 2993 6588 3598 -4772 -1769 -414 9464 6251 -23 1430 -2479 610 5068 264 -14887
849 -34998 -32782 -10124 -588 -690 6310 5270 -4401 -38900 -31121 -2741 -3096 -1633 -1380 -4736 -13440
834 -13440 -21152 -19887 -17022 -15112 -9766 -1275 -1613 1369 -400 -3480 -17652 -48068 -41208 -26623 -26730
819 -26730 -33820 -23283 -1777 -6307 -1619 7149 7065 -13064 -36338 -51397 -51720 -54726 -46673 -24208
805 -24208 -1013 3248 5534 -3689 1143 -8699 -28065 -10145 -779 -2664 -414 -167 -12602 -34235 -48311
790 -48311 -38935 -20521 -656 1550 -1762 -415 2423 2433 3072 4661 -1384 3409 5450 -1271 -975 2647
773 3330 -960 -12248 -29858 -38885 -36650 -34170 -37815 -46417 -46380 -31503 -16231 -6133 -2389 -2109 -3973
758 -3973 -5141 -1010 -614 -2905 -1407 -3235 -12961 -41885 -40802 -16222 -1828 -2976 -755 -541 -2018
743 -2018 -5024 -4827 -12233 -38524 -56537 -33796 -16032 -4769 552 5198 3039 3484 5989 -19141 -53867
728 -53867 -30843 -1681 -1962 2770 2929 290 -515 3318 -9494 -16459 -2539 -1373 -3473 -1379 -2778 117
711 -53 102 -977 -2670 -260 -3778 -24887 -56226 -37757 -6978 2583 -569 1396 -10407 -32639 -48600
696 -48600 -49013 -46807 -51468 -63084 -53157 -38087 -27763 -26533 -37154 -52967 -25251 1154 -2567 -1655
682 -1655 2684 4842 6736 4216 -1039 -2420 -1979 -711 821 2275 4003 1236 3491 2756 2015 2276 1852
665 1852 949 -2892 -4811 -5734 -13919 -22725 -31061 -35592 -32449 -23626 -13121 -4015 -415 -2269 3971 -948
648 -7278 -19790 -31298 -30380 -12976 7 -2462 -1200 -628 -274 -3881 -690 3126 -14206 -33347 -30388 -15791
632 -15791 -4901 2145 -8699 4015 35189 39482 13359 -8470 -4725 400 -224 -11772 -21201 -29247 -36868
617 -36868 -44424 -50361 -49830 -44463 -40612 -41957 -46700 -46639 -36970 -25809 -19141 -19051 -22925 -24363 -19026 -9892
601 -9892 -2414 1164 -54 -3035 -307 5358 4053 -45 693 5651 7957 5526 -1153 -17164 -40054 -29048
585 -29048 -2143 2048 -2955 -2348 1757 -7182 -25069 -36197 -38918 -33223 -20673 -5587 1347 -3342
570 1108 6025 -2730 879 -4864 -95 1720 5999 3747 -15885 -40662 -65727 -52088 -39646 -37010 -38653
555 -38653 -31932 -15719 112 932 3732 9059 5692 -625 -5312 -2856 -1857 -2671 -7285 -2290 -3099 -1926
539 -1926 -341 157 -4503 2235 3531 -100 -6462 -48773 -20059 919 -2400 2776 1978 1486 -1216 1657
522 -442 -2223 3354 3553 891 1465 -401 -3826 -3806 -5123 775 6356 1881 -883 -864 104 -2630 -1677 2911
503 4767 -2997 2127 -1601 133 908 1131 4748 4885 928 -21856 -46474 -55859 -38131 -20406 -6858
487 1729 5667 -1390 -4476 -2407 -2302 -3632 -6911 -7452 -2670 4226 -4463 -3662 -4373 3425 -324 1680
470 1771 1227 4993 12482 13509 9776 4552 -9293 -44483 -52181 -25292 -9918 -9858 -23468 -46004 -63407
455 -63407 -44935 -32363 -25802 -19349 -8064 -2108 -4357 -4061 -3027 -23307 -48962 -58922 -39386 -26803
441 -26803 -23961 -29588 -38298 -42200 -34721 -19183 63 18867 32299 36224 28677 9194 -17782 -46031
427 -46031 -55910 -39577 -29789 -27299 -27586 -24328 -16094 -7910 -4853 -9498 -21630 -40412 -62858 -37751
413 -37751 -4284 -3489 -3580 -2271 -2322 -4665 -4448 -2774 -484 3000 2618 -22084 -33380 -22230 -9510 -6151
397 -6151 -13920 -29886 -42354 -35655 -20299 -9903 -7393 -12563 -26141 -40003 -37786 -22310 -9785 -3757
382 -2661 -7999 -14133 -16511 -16701 -11357 -14 -632 -5605 -5061 -1107 796 -1684 -9170 -27679 -44706 -57421
366 -57421 -36981 -18012 -3134 -1247 -8830 -19164 -32386 -40261 -42925 -56140 -58409 -47518 -23650
352 -10075 -909 15316 18915 14751 20931 17175 1333 -6076 6489 -14611 -39013 -58479 -19283 -2384
337 -20267 -17005 12645 8418 -444 16091 4807 8657 12720 -3511 9470 7650 8057 -538 8973 1060
321 14450 19590 10969 17688 24634 31838 45074 46493 125664 297990 839620 8139416 67811769
309 67811769 201865585 182103202 41873016 5905721 1907830 597626 254927 106143
300 35537 22817 17525 17084 9665 11101 14367 9323 1731 10010 -1359 3665 -4534 6572 151 7669
285 7669 3043 -505 -330 3228 -186 2149 -1841 -26376 -38032 -29021 -31688 -764 971 5621 8048 507
268 -2012 929 7090 947 -11219 -22636 -34205 -38460 -49381 -47378 -42854 -39942 -32192 -23287 -6017 1086
252 1482 -2656 -20985 -41461 -48167 -29273 -11441 1655 2771 1953 3024 5311 4683 4425 2466 -4031
236 -7153 -4782 -2009 -3804 -1418 -5711 -18084 -31693 -35553 -22461 -6858 1162 -1624 -4182 -11750
222 -11750 -12567 -5689 -21 2430 3041 -11492 -26817 -20664 -1350 863 2895 640 -1535 1437 3439 -947
205 -709 1328 -3946 -30912 -50777 -46089 -34101 -26173 -23624 -24488 -25891 -25931 -25114 -26274 -32995 -46126
190 -46126 -51415 -33043 -11145 1696 -2813 -5675 -1074 -1417 -3508 -3322 -12632 -25811 -26427 -16318 -7883
174 -7187 -16664 -35940 -58729 -38452 -13129 -1056 -3700 4042 4197 -1961 2248 -4280 -17291 -38024
160 -38024 -52298 -32131 -12904 -5969 -14229 -35378 -52781 -23674 3610 2904 1737 -576 -233 551
145 2364 -967 -1620 621 4531 2897 -2499 -397 479 -3985 1600 -4407 -4948 -8358 -10753 -11463 -10798 -9625
128 -9625 -9728 -12809 -21521 -36941 -51698 -33972 -6254 -330 1341 272 1380 -928 -5335 -553 728 386
112 386 -5091 -15026 -41899 -55607 -38830 -17282 2559 3519 -4964 -5897 -15455 -45214 -41050 -4848 517
96 -1892 -3233 2258 -2778 -6547 -2260 7180 297 -7539 -4263 -3092 -1795 -55263 -15361 682 1080 450
79 -1751 -1830 -3994 -3131 264 -482 -5576 -7034 -4426 -2985 2137 5691 6353 4229 3036 3880 2465 -15267
61 -37657 -48521 -39943 -36873 -45372 -59448 -37651 -13491 6933 746 462 863 -1985 -2498 -1013 -779
46 -779 -2175 -2226 277 1574 -3535 -18555 -28077 -28243 -18487 -1615 5789 359 -3057 -3573 1100 -13591 -30551
29 -30551 -22975 -3713 1450 1902 3060 -370 6635 376 3380 -4308 -10958 -13339 -13755 -14668 -16580 -18517
13 -18517 -18494 -16649 -16160 -20007 -28842 -40213 -46067 -41301 -36402 -36672 -40279 -40066 -32170
0 -32170
##PAGE= F1=1045.987543823
##FIRST=     2915.55639409065, 2671.18566176471, -47536
##DATA TABLE= (F2++(Y..Y)), PROFILE
1023 -47536 -38086 -29891 -22024 -13348 -3494 7176 -2935 -1561 956 1192 2813 720 -1538 2497 -8094
1007 -20965 -34592 -37072 -18718 2896 2525 -1580 -3667 -3114 3127 -1915 363 -10372 -34526 -41301
993 -41301 -25709 -9798 -2916 -1508 20 -2627 -10036 -19233 -29426 -38258 -41215 -36087 -27938 -19415 -11479
978 -11479 -4650 -1576 2667 8141 11395 9534 2623 -2740 -3925 -2963 -5249 -2676 1809 3461 1310
962 311 -2034 -2396 -4353 -461 -1127 -2901 -4754 -6700 -39970 -33769 -21976 -21413 -30264 -43424 -48090 -38695
946 -38695 -32125 -29436 -25123 -13243 3496 4839 3056 616 -1477 -29674 -49470 -23712 -5153 3571
931 5470 4751 -1804 5555 0 -70 3161 -3835 -19176 -39975 -37102 -7992 -87 2129 1405 -239 444 -2099
913 -2492 -22272 -49359 -18024 -220 3639 12139 8422 4320 -4623 -15428 -30361 -42172 -24864 -2160
898 8728 9123 4593 1163 5435 8965 7262 -2157 -23272 -41710 -23160 1836 -4302 -1974 -2643 3924
882 6352 3927 -1653 -1008 -708 -1197 -7525 -20372 -29281 -31407 -32522 -38841 -48245 -34369 -13730 -3179
866 26 -619 3021 5689 3731 -3926 -86 -1545 10045 8243 -758 419 -3418 -285 4362 486 -17485 -33413
849 -33413 -32188 -12657 -2712 929 7315 5073 -1098 -16293 -5461 -2690 -1844 -1150 -1352 -5032 -10676
834 -10676 -35797 -52028 -43334 -40116 -30303 -11016 -993 1404 -2116 -4993 -3208 -21654 -34038 -22944
820 -22944 -18783 -26910 -31497 -10154 -5200 -1678 4480 4247 -4955 -15914 -15582 -18689 -21541 -25988 -25745
805 -25745 -14841 120 6303 -1965 -2127 -26040 -41339 -14171 349 -2121 -2302 -1855 -10843 -30808 -37891
790 -37891 -23061 -2954 333 994 -2436 -2371 706 1900 2592 -1199 -5085 -1003 5810 -1212 702 5029
774 5029 5507 -518 -5664 -17610 -26796 -30915 -33003 -37637 -46460 -49385 -35799 -23455 -15289 -11694 -9590
759 -9590 -3998 -5262 -679 -169 -1819 1328 -670 -7921 -33342 -42324 -24875 -11852 -5365 -2658 -1564
744 -1564 -1401 -1794 -2932 -13747 -32783 -43213 -29186 -15378 -6434 6 6417 5015 3720 -2037 -21862
729 -21862 -34444 -14779 -1408 -3292 1064 832 -481 -806 4097 4818 -4521 -2606 -2073 -2071 -722 -2428 1378
711 -1138 -2242 -832 -1757 -333 -5056 -20790 -44103 -40659 -15701 1672 -381 384 -7613 -22742 -34507
696 -34507 -39749 -42728 -48707 -55885 -44097 -32288 -23949 -22266 -29831 -45517 -29721 562 -3075 -1197
681 2963 5866 8413 5271 -472 -2901 -1777 -725 1731 3582 5697 3403 3500 1589 1647 1335 801 1045
664 1045 -3147 -4240 -12882 -23935 -32937 -38214 -37460 -31858 -25247 -18889 -13152 -7469 -1950 2962 -2226
648 -574 -1885 -14508 -28761 -25607 -1496 -2796 -662 -1092 -1745 -4565 -801 3227 -20980 -42629 -33547
633 -33547 -16108 -3318 1427 -11853 3464 16421 19085 10384 -10384 -4115 1234 701 -4791 -9238
619 -9238 -13277 -17597 -22510 -27621 -30644 -30510 -29632 -32047 -39094 -49703 -51384 -40614 -31633 -26775 -24762
604 -24762 -22901 -19829 -16344 -14365 -14421 -15042 -13476 -7224 2714 1453 -1938 192 4718 7397 7000 -7654
587 -29562 -40700 -21763 1990 945 -2564 -1956 1602 -4608 -21086 -32171 -34590 -28240 -16666 -3975
572 -332 -3465 614 3562 -3551 375 -5692 316 2370 6570 4865 -6802 -26227 -46050 -52821 -44784 -43954
556 -43954 -48542 -42258 -25835 -9895 116 2356 8080 5954 -303 -3758 -1248 -2590 3683 3059 -1416
540 -2209 -1445 -1052 169 -4355 3914 4005 -668 -3884 -39767 -17828 1278 -2431 1925 948 714 -692 -356
523 -356 -2790 -541 3729 3810 897 1445 739 -2830 -3602 -5818 234 7692 2873 -1708 -2212 -1734 -1675 672 5922
504 5922 5815 -2547 -233 -4206 3099 2091 1756 4625 4006 -3560 -21733 -38009 -44873 -38778 -29244 -20977
488 -20977 -15537 -13059 -12363 -11024 -7971 -4675 -3592 -1904 237 4471 5688 -3274 -2703 -3448 1546 -1449
471 2468 116 1148 6302 14496 13471 8182 4043 -9217 -35947 -37236 -18818 -8352 -10993 -25321 -47163
456 -47163 -52895 -33610 -21214 -14330 -8508 -1812 -1299 -3336 -4046 -3823 -16420 -38919 -50859 -36782
442 -36782 -25065 -21329 -24981 -31125 -33162 -26251 -12351 4678 20728 31495 33739 26215 8691 -14893
427 -39835 -53563 -38592 -27828 -22849 -20558 -17244 -11514 -5996 -4438 -9339 -20792 -37723 -54589
414 -54589 -33061 -3390 -2025 -2626 -3700 -3285 -4059 -4975 -4234 -1852 1760 812 -11903 -19437 -10595 -325
397 1794 -5323 -18727 -27524 -22506 -11197 -3599 -2638 -9016 -23814 -40089 -38710 -21175 -6799 -1949
382 1795 613 -4370 -4167 -4306 -383 8022 1078 -5843 -3950 -1405 1860 -31 -3435 -13654 -29670 -36696
366 -36696 -22326 -4323 1274 -284 -737 -17962 -37852 -45735 -40487 -42828 -42769 -49164 -36078 -25544 -17146
351 -17146 307 18611 15169 18997 14929 2111 -2653 4365 254 -11980 -26284 -13139 -983 -7529 -2190
335 14707 9969 2677 21862 11112 1671 2490 -2130 11541 12262 12664 -89 12856 -2652 16998 17923
320 17923 12828 18141 27725 30079 42686 50705 130196 343193 822267 8019407 69399196 182103202
308 182103202 191257481 44691909 6474849 1990246 628971 253048 89874 42926 24207
299 24207 18043 17896 11857 11284 13072 9995 -1220 11930 -3021 2041 -3220 2400 -539 9717 4577
283 262 435 3440 612 -4145 -5057 -21777 -38874 -43150 -48397 -1964 -1043 5312 8720 565 -218 2374
266 6161 4782 -2590 -7616 -17689 -23230 -36807 -54225 -50505 -35480 -22707 -14369 -3577 -3292 -7276
252 -7276 -15563 -33187 -50772 -51400 -33098 -19848 -8905 620 1943 3945 7015 6079 1178 -7890 -14108
237 -14108 -15293 -9634 -2706 -3854 -3839 -4555 -8410 -19869 -26799 -21792 -10954 -2959 -4135 -13802 -25442
222 -25442 -28094 -18664 -7763 -1996 -5709 -21292 -39250 -26631 -1830 578 4049 2570 -2268 2388
207 4906 261 -2508 1898 249 -28784 -54110 -44563 -30734 -22747 -20337 -21545 -23752 -24392 -23160 -23100 -28269
191 -28269 -40841 -52637 -34512 -12287 273 -3460 -5660 913 -1054 -3874 -3364 -18270 -32352 -30888
177 -30888 -18574 -9474 -8425 -17139 -35207 -58108 -33965 -9628 -1079 -3131 3491 2442 -1567 -5093
163 -5093 -12569 -24867 -41668 -40300 -19665 -3448 509 -10509 -34493 -52388 -17679 4432 2929 2623
149 2623 1759 160 749 3262 -1552 -3083 1283 5691 3459 -2612 -1204 80 -3721 -909 -4713 1701 -323
131 -2256 1236 1858 3709 3788 -2801 -15202 -33586 -47023 -26116 -3834 -1043 977 764 3805 1480
115 -3171 948 3603 2392 -3346 -19182 -48208 -46496 -21400 -3840 4257 3184 -4328 -5129 -22336 -53350
100 -53350 -35419 -1372 2179 -1371 -1340 3727 41 -6745 1235 12358 9503 -1672 -5241 -3141 -2924 -51231
84 -51231 -20224 -1223 38 1119 -755 1051 -1998 -3471 -83 -5747 -12830 -11706 -4493 -1774 3659 6796
68 6796 6172 3331 3702 3995 3025 -10870 -30892 -36921 -29648 -27758 -36758 -52532 -40268 -15997 5475
52 848 79 1286 -1647 -2997 -948 -137 -2615 -1373 368 590 -8352 -21495 -30500 -33339 -28002 -14228 3025
34 1987 -1229 -2320 -2493 -23764 -32667 -16611 2664 493 528 1874 -1084 7358 2229 -103 -2529 105
17 -1042 -2486 -2842 -7294 -13215 -17246 -17255 -15659 -16314 -20845 -28055 -34375 -37460 -39435 -44106 -52667 -62603 -54451
0 -54451
##PAGE= F1=1043.376414144
##FIRST=     2915.55639409065, 2671.18566176471, -8885
##DATA TABLE= (F2++(Y..Y)), PROFILE
1023 -8885 -9843 -11805 -12918 -11445 -8089 -3026 -1617 -2643 -725 695 3604 800 -2815 3676 2355 -1755
1006 -7092 -13120 -13125 -6814 -872 -794 -3618 -2102 3456 -2240 -1516 -3755 -5954 -15299 -16099 -9434 -5222 -2860
989 -2860 -842 -3812 -4249 -2314 -44 -4003 -6552 -5583 -3480 -5847 -3160 -4740 -3054 -3510 -4016 -4704 -5099
972 -5099 -4669 -3693 -3031 -2537 -5700 -1948 2363 4470 1283 82 -2205 -2854 -3284 -268 -872 -2966 -4196 -5021
954 -5021 -6544 -5849 -8874 -9287 -8322 -6535 -5176 -5365 -7035 -10513 -12431 -7936 -1291 3213 4328 1123
937 -7150 -16763 -9122 -3988 2433 6135 4399 1981 -2337 2084 -393 555 -1643 -4387 -8569 -13586 -11683
921 -11683 -4005 661 2638 1124 -1057 -2173 -2263 -3035 -4744 -7474 -1419 624 2741 7780 4251 -804
904 -5742 -9108 -10305 -9703 -7406 -4146 -974 1640 3763 551 4143 5854 4050 1669 -2960 -8109 -7129
888 -7129 -547 -4435 -1009 -2602 2418 5059 2317 -2653 -1294 -630 1315 52 -927 -4995 -6141 -5281 -5871
871 -5871 -9124 -13921 -11519 -3205 242 550 3253 4647 3115 -2213 -1901 -2180 7345 9469 -1458 -892
855 -892 -4621 -5105 -7192 -7043 -5978 -4974 -4739 -5329 -5815 -5159 -3472 -2762 -4097 -5329 -1793 -2190 -1163
838 -1163 -1159 -1154 -5338 -2651 -833 -392 -2152 -787 -6841 -17925 -5190 623 -3762 -5758 -4918 -4355 2129 1813
820 1813 -1445 -3964 -2872 893 -3659 -1988 1621 1537 -651 -3686 1314 -4938 -3034 -3242 -4124 -3264 -9955
803 -9955 -7567 -2631 -37 -3204 -418 -496 -32 -888 -4044 -9697 -16201 -13831 -6359 995 3798 426 -23 -447
785 -447 543 14 303 1372 2827 562 -2310 -5977 -10138 -13710 -15857 -15699 -13949 -11410 -8725 -6513 -4590
768 -4590 -3512 -3477 -4170 -5183 -6185 -7176 -7544 -6121 -2257 -2274 -4873 92 977 43 3295 773 -4091 -7796
750 -7796 -9724 -8630 -7906 -9102 -12308 -16013 -17027 -15233 -14853 -16320 -17326 -14780 -12088 -10472 -9891 -9578
734 -9578 -8672 -7134 -5366 -3664 -1489 -5552 -1995 -437 -3766 -762 -930 -963 -1094 3245 4920 -2379 -2796
717 -2796 -2159 14 -328 -2237 2564 -1315 -4665 -274 -1439 -866 -1917 -6143 -12222 -15210 -8966 -3168 -132
699 -2124 -4338 -7770 -10987 -12119 -12863 -14894 -18266 -15961 -11545 -8131 -6527 -7137 -10387 -13296 -5098 -3582
683 -3582 -1329 2594 6984 9582 5284 -283 -3009 -878 -452 2469 200 2612 5158 2923 -667 46 377
666 377 75 983 -2497 -11350 -15041 -8433 -3889 -2111 -2436 -4174 -7637 -11828 -14098 -10770 -5639 -981 -3610
649 -3610 419 -2580 -2405 -10289 -14565 -4667 -3524 -631 -2088 -3750 -5045 -1148 -9278 -17305 -11160 -4278
632 -216 -1473 234 -14615 -4842 -9325 -12808 -14209 -13230 -11058 -8417 -5208 -1867 549 -3485 -1320 -778
616 -778 -2301 -1117 -2715 2027 348 -4430 -2050 2528 0 -5380 -11873 -16014 -15437 -13745 -13087 -13739 -14873
599 -14873 -14589 -12095 -8347 -4939 -2636 -3526 -2913 -6152 -11191 -17712 -15455 -7187 889 2978 2341 698
582 -1952 -1735 1185 -1604 -6171 -8469 -8123 -5579 -5108 -3714 -1536 -3505 -1647 -2190 -3440 -539 -3985
566 -3985 474 1088 -2041 -6607 -12056 -16744 -17606 -16369 -17130 -17318 -12255 -5488 -3717 1767 -1153 234 6399
549 6399 5662 344 -1370 201 -2267 3349 3669 -928 -2067 -1081 -2322 -745 -3356 4931 3412 -1859 -7171
532 -7171 -18757 -3470 887 -3207 288 -635 -632 -734 -3963 -3629 497 2998 3004 462 2321 3678 -1354 -3675
514 -3675 -4673 -1497 6751 2291 -3033 -4019 -3789 -3126 2579 8575 6944 -2161 -2393 -975 4537 1345 649
496 3582 2270 -5767 -9422 -7851 -5415 -4885 -6944 -10497 -14065 -16357 -16562 -14630 -11234 -7301 -4117 -1614
479 -1055 -1802 -2915 -3175 -2219 -2585 -2179 -2965 249 -2182 325 7208 14517 12013 6017 2751 -1439 -8613
462 -8613 -11968 -10842 -9672 -11045 -14589 -17020 -13204 -8179 -4742 -773 -944 -2744 -1036 -3292 -3961 -4577
446 -4577 -763 564 4216 3414 86 -4046 -4111 -6956 -6596 -3344 871 4330 5762 4653 850 -4631 -10885 -13098
428 -13098 -8644 -2436 3420 7600 -1852 3573 165 -675 3752 2406 527 124 -658 -736 -106 -1974 -994
411 -994 -1750 -3625 -3636 -2632 -4904 -4983 -2503 702 -1687 -459 -8670 -8192 -3668 -2151 -3703 -6106 -6549 -5230
393 -5230 -4610 -5925 -9324 -13281 -14686 -10198 -4539 -197 -1128 -694 -2530 -6523 -8284 -5658 -2082 1518
376 4139 2616 -5877 -3241 -2036 1845 1109 -1465 -1832 -3038 -7933 -4151 3351 1605 256 1133 -286
359 -8704 -14875 -13939 -11877 -10926 -13037 -15588 -16498 -17321 -11671 -3113 5058 16102 13012 2337 962 1060 1197
342 1197 -1429 -2135 -2691 359 -2394 3219 10996 11691 4131 4583 9085 9589 3348 3064 13791 9632 14732
325 14732 4010 13725 -4458 -3310 13430 12711 15104 27980 22967 33406 43671 101003 284469
312 284469 564618 5621001 28037169 41873016 44691909 34605286 5088921 1468358
303 199881 178580 60210 43836 22257 15987 16229 11587 10066 10654 10106 -5401 8308 -3656 -871 -689
288 -689 -326 -262 10958 5586 1180 997 1015 -9101 -10359 -5721 -5955 -4906 -7575 -2233 -2360 -2985 4863
270 8887 481 1154 3118 4433 2754 -3719 -5284 -2431 -1557 -3739 -8193 -10188 -6821 -2363 -2322 -275 -3881
253 -3881 -10506 -16868 -16083 -11725 -9616 -7977 -6401 -5786 -4593 -5498 -8918 -12159 -13515 -13029 -12844 -14127
237 -14127 -13726 -9111 -3142 -4289 -5298 -4486 -3004 -3811 -3332 -5342 -4418 -2074 -1599 -3501 -8078 -13464
221 -13464 -11851 -4842 1232 3719 744 -6756 -15795 -9611 -166 4059 3842 -3234 2501 5217 692 -3915
204 2072 17 -8998 -8406 -4448 -3299 -5279 -8548 -10889 -10952 -9321 -7480 -6398 -6694 -8897 -11407 -9652 -3496
186 -2283 -3447 -4876 2678 -1206 -3803 -2412 -5224 -10677 -13469 -11550 -9005 -7991 -9582 -13385 -16134
171 -16134 -12194 -6554 -2089 -2683 -399 -2184 -4570 -6228 -7142 -7620 -7316 -5668 -3218 -1528 -1743 -4266
155 -4266 -7236 -6339 -198 4051 1828 2510 3466 520 1037 3993 -764 -4396 1472 4583 81 -2865 -4536
138 -4536 -5940 -4118 -1089 -1872 1383 370 -2863 -1996 -757 2937 1603 -4412 -1941 -4691 -11319 -14087
122 -14087 -2472 -1055 763 1671 5946 3274 -1029 2927 6244 3645 -2282 -12017 -13212 -4266 -2864
107 -2864 -3539 3275 2034 -4138 -9288 -13355 -11532 -6120 -45 3382 -748 811 2768 -3055 -2674 4276 12076
90 12076 13764 1681 -4498 -3474 -4628 -14223 -16250 -7384 -2500 33 2026 3419 -663 -2599 -686 -4817
74 -4817 -6815 -8212 -8073 -6392 -3992 -1686 428 2058 3635 3428 715 -5060 -12548 -17508 -13677 -9817
58 -9817 -7995 -7641 -6385 -3092 2278 669 304 2425 -1251 -3216 -666 309 -3408 -1041 23 -524 2693
40 -408 -3575 -10219 -14118 -7286 2351 2260 -2 -1315 -2991 -12550 -14211 -2631 305 -651 -842 -397 -1886 7628
21 3889 -3312 32 -1328 416 -3426 -1882 -3332 -9641 -14252 -11975 -7280 -4172 -2800 -2375 -2364 -3334 -6020
4 -6020 -10356 -14409 -15062 -13264
0 -13264
##PAGE= F1=1040.765284465
##FIRST=     2915.55639409065, 2671.18566176471, -1318
##DATA TABLE= (F2++(Y..Y)), PROFILE
1023 -1318 -1738 -3058 -3700 -2821 -2060 -2082 -3200 -4987 -6604 -6489 -5397 -4420 -4224 -3751 -2746 -604 2360 4673
1005 4673 2990 3327 4104 900 -2799 -1409 1814 -1858 -3116 -3856 -1567 -1060 -3135 -1073 -3397 45 893
988 893 -1199 -3817 -3983 2244 1378 -2413 -4237 -3717 -5678 -4100 -5223 -6494 -7151 -7346 -7283 -7287 -8004 -8915
970 -8915 -5902 -2667 -5947 -1468 3513 4640 1316 834 -1900 -2485 -1480 -869 -2699 -2259 -3092 -4551
954 -4551 -6355 1383 313 -823 246 3404 1350 -4091 -6093 -5065 -3934 -3843 -4251 -5225 -7349 -8730 -5310
937 -5310 -1118 -2818 -4928 2745 3421 2839 4611 -1381 -1012 -62 1127 -1162 -4458 -7477 -10103 -8636
921 -8636 -5194 -1826 1495 451 -1769 -3924 -1023 -2062 -717 2782 2161 1754 1829 2995 3514 3837 4065
904 4065 2599 -2904 -995 591 6723 8639 8404 3817 -434 -946 -5371 -9178 -8671 -4999 -959 3061 6132
887 6132 -4712 340 -2196 22 2892 -631 -5190 -9363 -6483 -2792 -553 89 -888 -2989 -5069 -6537 -7073
870 -7073 -7671 -8878 -9461 -7311 -5150 -3791 -3579 -4308 -4776 -3007 -2031 3655 5667 -1798 -2059 -5490 -1981
852 -4500 -3688 -912 -2972 -4418 -3526 -2681 503 -1795 -4492 -7321 -9377 -9330 -8556 -7940 -6858 -4933 -5309 -2728
834 -2728 -1500 -1812 -3601 -1767 -2338 -5181 -6832 -6918 -7114 -8478 -7498 -2886 735 -180 500 -2547 -3637
817 -3637 1745 -1453 -2934 -1490 -292 2289 5412 9085 -1135 -3229 -3081 -4596 -3920 2566 5304 1434
800 549 -3499 3446 1781 890 -632 -2796 -5214 -7016 -7183 -5633 -3518 -1700 -547 -237 -180 -138 147 -2076
781 235 58 -2146 -4891 -5356 -1833 2557 6417 7214 -652 6025 4726 366 -3855 -5866 -4371 -1655 405
763 1522 2048 1454 -4008 -2410 -1797 -4161 1280 2343 1200 3987 1637 -2602 -1085 -1744 -1819 -2162 -3691
746 -3691 -2656 -5472 -5939 -7136 -8362 -9282 -9371 -9372 -10095 -10526 -8328 -4947 -908 3339 1642 1289 -2209 -5684
728 -5684 -745 -2443 -5276 -3859 -1893 -1354 -2005 -2513 -1065 -3237 -2149 -702 1884 -216 -2000 3815 291
710 -2117 -2600 -5792 -7954 -8176 -7157 -6401 -6505 -7510 -9288 -10397 -8003 -6778 -3126 -4842 -3562 -6640
694 -6640 -10207 -6130 -930 -205 -1796 -1832 -324 2999 342 -1805 -3700 -1518 1414 336 -597 -1739 -3560
677 -3560 -5913 -8534 -9264 -8029 -7715 -8177 -6859 -3388 -2821 -1803 -9 -161 -2806 -8471 -8339 -3026 605 469
659 469 -851 333 -361 -1915 -3011 -3874 -4141 -3922 -3431 -3777 -3382 -4197 -3897 -3755 -2957 -1608 -4525 -654 -2799
640 -2799 -3219 -3797 -1472 -866 -4441 -7148 -5098 -1495 553 -1101 -10224 -2564 -3806 -2358 10 -9237 -2028
622 -1190 -4386 -6580 -3736 -2994 -999 886 -3358 -3477 -3104 4056 2641 -4098 -3470 258 -2534 -2266 1465
604 13 -2930 -979 -2269 -4773 -6259 -4384 -379 1586 2390 -1905 -4551 -1947 1031 4114 5942 787 -196
586 5056 5178 2968 512 -1564 -1463 -99 -2873 -4553 -5199 -5351 -5071 -4715 -4013 -3265 -3942 -3409 -2242 -2810 -1615
567 -1615 -1455 926 1078 1734 2964 5054 5072 -9 -918 -5925 -11125 -7529 -4672 -4381 -1973 -1015 -1930 4464
548 5249 1992 1435 1732 -1021 -2127 -6328 -8826 -8201 -6453 -4463 -2280 -2030 1585 2356 -3028 -751 -2367
531 -2367 -1639 -3257 -4398 -4246 -3070 -2130 -2073 -4200 -744 975 1687 1619 -275 3479 1405 -2726 -4901 -5196
513 -5196 -5274 -6459 -7916 -6408 -5088 -3744 -3355 1989 142 -2761 -3223 -2982 1341 4616 -245 -771 -4354
496 -4354 -8445 -7449 -4176 -1096 -2541 -3892 4237 4651 4575 501 -1507 -3396 -5456 -7141 -8289 -7023
480 -7023 -5388 -4854 -5785 -7962 -10724 -9477 -8539 -8792 -7665 -4418 -1109 1816 3701 4778 3686 738
463 2007 -3071 -6267 -8917 -4836 -2060 -1668 -3444 -6034 -5163 -3815 858 -859 -4102 -1096 -3204 -3724
447 -3724 -4387 -3904 -2865 -1043 210 -1003 -4128 168 1832 4698 7505 9842 9207 7253 6673 8855 12342
430 12342 14270 14120 12574 11642 12504 11521 417 4839 2455 -3345 -739 -3644 -2966 -1499 -2596 -1310 -2377
413 -2377 -4829 -7675 -7043 -2424 -3521 -1308 -4604 -3810 -1304 401 -3813 -2415 1793 -553 -4040 -6932
397 -6932 -7953 -6844 -4567 -1661 -3896 -3142 -568 -692 -2893 1570 900 -1760 -1778 -101 4575 2247 -2031
379 -3161 1577 4464 3133 488 -4588 -7383 -5737 -2339 -290 -241 -2082 -4785 -6926 -5264 -2199 385
362 341 1137 933 -1149 -3152 -4839 -6124 -6323 -6204 -5947 -5525 -4529 -3422 -2264 -1834 -2214 -3273 -3639 -3273
344 -3273 -2667 -1493 -2752 -3338 -2387 2086 172 2323 2502 4409 3967 11113 9845 7578 7116 5176 5879
327 5879 6414 4539 -907 -457 -2897 533 7078 -3145 -591 1985 13641 -6146 27399 56131 163261
312 163261 106804 1453310 3774398 5905721 6474849 5088921 2699479 695367 170395
302 76208 30969 -3858 17703 11964 3080 -2081 1846 4906 -676 -2805 8346 -2747 -4396 1556 -5323
286 -6404 -5909 -3414 -3045 -3549 -2864 -3777 -5418 -5805 -5373 -4635 -3053 -1848 -2200 -4421 3759 6244 389 2151
268 2151 3289 2375 638 -3911 -5293 -2359 -5055 -3054 -434 803 -279 -2821 -6143 -8107 -6221 -5271 -6227
251 -6227 -8626 -4342 -2001 -1085 -1893 -3522 999 -1210 -3768 -5482 -6340 -4558 -45 -2059 -2400 2114 -2209
233 -4077 -2160 -2493 -3909 -5012 -5162 -6353 -6581 -6723 -7305 -6873 -6390 -6290 -6820 -6841 -5752 -4219 -3090 -3790
215 -3790 -2260 -1649 -1145 3341 4767 -3516 2013 4643 244 -4582 1748 4569 3446 2815 1482 4459
199 4459 1809 -3389 -3662 -2901 -854 -2220 -282 -22 -25 -2903 -2227 -3487 -5617 -2177 -4179 3873 -1757 -3167
181 -3167 -659 1712 1280 3490 -2532 -4678 -4647 2264 5923 1662 -3790 -317 -1842 -2034 451 -1743 -1590
164 -1590 1148 795 -3068 -437 -1434 -1070 -2048 2345 6579 3942 1201 -1804 -4848 -7258 -6790 -5298 -4279
147 -4279 -3171 -2143 -1328 -4302 -1933 -3184 -5077 -6778 -7452 -6628 -5126 -3603 -1970 -162 1053 -2656
130 -4935 -2521 1676 -313 -3934 -1451 -4020 -4935 -7714 -4796 -2599 -1317 -1274 -2740 -5413 -8957 -6063
114 -6063 -3413 -1646 -1474 -1944 -2869 -3865 -3923 -2838 -2861 -3469 -4757 -6514 -6924 -3979 -4783 1237 3819 30
95 2267 2573 1088 -3282 -8098 -5773 -1231 1905 -3276 -4059 -5217 -3271 -4632 -6855 -3602 245 3635
79 3635 4721 -143 -1234 -1443 -3945 -6387 -8117 -4224 -1490 -156 -119 -1036 -2562 -4469 -6514 -7560 -6050
62 -6050 -4213 -2750 -1640 -2812 -1380 288 -791 -3505 -6105 -4612 -1079 2042 -747 -2775 -167 649 -2591
44 -944 -551 -1052 2297 251 -142 -2416 -3207 -835 1307 1414 36 -3194 -7141 -6980 -3617 -546 -1315 -919 -621
25 -621 -2701 -1569 7675 4813 -774 -1793 -6299 -6603 -3878 -2120 -1593 -2130 -2631 -2123 -1259 -151 -3400 -1466
6 105 -647 237 -2703 -8550 -9558 -6091
0 -6091
##PAGE= F1=1038.154154786
##FIRST=     2915.55639409065, 2671.18566176471, -679
##DATA TABLE= (F2++(Y..Y)), PROFILE
1023 -679 -124 -849 -424 -1853 -4030 -6323 -8256 -6720 -4359 -2285 -1169 -1001 -4772 -3216 -3915 -3037 -1301
1005 -53 229 -587 -2024 -3532 -4352 -3837 -2491 -1675 -3993 -3475 -2083 -882 -1370 -692 -3037 -553 1674 735
986 -3324 -3697 -3365 -154 -4449 -2688 -3655 -5867 -5468 -4960 -1445 -4452 -5627 -5010 -4030 -3234 -4163 -2209 -3745
968 -3745 -6673 -1355 3136 3614 956 1469 -2340 -1895 76 -2572 -1299 -1532 -2204 -4625 -7286 631 927 1113
950 1113 2399 301 -3692 -6534 -6193 -4709 -3958 -3966 -4378 -5188 -5765 -4122 -1305 532 -4236 -3528 3129 2870
932 2870 840 4142 -171 -1511 643 1318 1253 44 -2632 -4625 -5927 -6371 -6342 -5659 -4945 -4604 -4647 -4920 -5238 -5292
912 -5292 -4700 -3977 -3217 -2735 -2266 -1489 380 3127 1765 -4516 -2210 589 4240 3057 1996 -1 -3329 -6419
894 -6419 -4178 -2154 -3217 -1633 3311 10252 8190 -5047 1488 -1547 -2826 847 1748 -866 -810 -1346 1149
876 1747 1763 -621 348 -302 -4528 -1602 -2130 -2474 -2531 -2257 -2357 -2659 -3092 -3602 -4327 -4942 -4603 -2506 315 -2193
855 -3321 -4041 -1432 -1563 1965 1509 -5075 -3884 -5021 -3737 -2588 -2249 -3197 -5115 -7033 -8093 -8237 -7464
838 -7464 -5831 -3934 -4723 -3011 -3029 -4892 -7237 -6481 -4604 -4702 -3028 -3188 -5119 -5609 -7851 -6016 -3621
821 -3621 -2097 -1723 -2161 -3981 -4302 -3860 -4497 -5503 -2200 71 1508 2815 1134 -3465 -2583 -4184 -4780
804 -4780 1526 3821 1483 1102 -2962 3256 744 -1267 -4830 -6953 -3883 -3018 -1528 -2574 419 -340
787 -1098 -1607 -1880 -1891 -2117 -4705 -3699 -4765 -5491 -5208 -4540 -3967 -2982 -1523 58 -347 1875 1704 271 -4329
767 -3650 -2344 -1418 2963 2627 2181 630 -5362 -3993 -1900 -3597 2378 3158 1024 -3373 -6196 -771 494
749 -1306 -2064 -2363 -3805 -2038 -3353 -60 2112 -91 -2023 1209 -2650 -745 -4138 -3497 -188 4917 5382 757
730 298 -2597 -4955 -235 1723 -1448 -846 -644 -1160 -2401 437 2902 -3429 -946 1225 2898 -603 -1799
713 -1799 -1913 -2396 38 1876 -1764 -2650 250 -1341 -3608 -5501 -6338 -5776 -4362 -2491 -4110 -1587 -5512
696 -5512 1361 -989 -4258 -4882 -636 -495 -228 488 1190 3929 604 -2973 -3743 -1717 1381 642 131 424
678 424 184 -3235 -2244 -4103 -5452 -5917 -5142 -2646 824 -2409 -2706 245 156 1668 1924 1216 1328 -80 -263
659 -263 -400 939 764 -201 1633 2388 3601 4892 4857 -2821 2613 -4003 2053 5076 363 -1210 -5925
642 -5925 -5074 -6235 -6249 -4948 -2791 -605 -731 -2452 -861 -3675 -6067 -4510 -5816 -1708 -2745 -5013 -7879
625 -7879 -7572 -2362 -1047 -1087 -2704 -5319 -6746 -4834 -2942 -4515 -3507 -1793 -1221 46 -3817 -5325 -2429
607 -4919 -1106 1818 -317 -3654 -800 27 2111 2867 1437 -238 594 -467 -2748 -5274 -3012 -348 2150
589 3229 -847 1729 1167 1211 1786 -26 -1629 -1306 601 1583 2786 48 221 -1879 -3578 -2820 -3697 -5045 -6314
570 -6314 -7372 -7306 -5687 -3660 -1403 65 -2045 510 5884 3291 -1862 -837 -796 -3068 -4495 -5008 -5192 -3970
552 -3970 -1199 -3295 2472 4733 4448 2263 -1136 -4835 -7085 -6542 -6119 -6576 -7249 -7516 -7694 -8185 -8749
535 -8749 -8964 -8103 -7284 -6542 -5787 -4969 -4341 -3951 -3791 -4227 -5691 -7814 -6295 -3013 -298 65 -1214 1829
516 1016 202 -3050 -1627 -5777 -2185 -3579 -4835 -3460 -2085 -2842 3258 3900 2962 -653 -2349 -5102
500 -5102 -7242 -7323 -6551 -4742 -2791 -1648 -939 -757 -2364 -4309 5209 4441 543 -3377 -3608 -6932 -6505
483 -6505 -4877 -4703 -3545 -3595 -3491 -2815 -1546 -2288 -1291 -2515 -984 -1165 -3168 -5762 -7836 -6278 -3217
466 -3217 -755 -1985 62 -3912 -2923 -2687 -1490 -1118 -2221 -4551 -7186 -5688 -2944 1149 -268 -5688 -1190
448 -1539 -1899 -2755 -3032 -4804 -1020 -1310 -2569 -3383 -3290 -1800 401 2096 2933 2746 2175 3053 5550 8441
430 8441 9841 9681 8441 7407 7068 6528 2455 1644 -2158 -5564 -6631 -5765 -5097 -5005 -3946 -1731 199
412 487 -358 -3672 -6558 -3373 -320 -4496 -2496 773 669 -5189 -3644 2679 2427 -901 1772 2682 357
394 -1794 -1652 -2910 -1680 -1280 -613 -2621 1351 917 -2211 -2758 -264 1421 1985 -817 -2772 841 3980
377 3980 5200 2903 -3197 -3674 -7299 -9145 -6672 -4487 -3603 -4170 -5747 -7249 -6581 -4989 -4166 -4530 -6224
360 -6224 -8258 -9814 -9868 -9817 -7743 -4958 -1655 1279 3688 5577 7073 3615 6606 4651 1533 -1959
343 -5702 -6563 -5477 -4234 -1919 -867 -846 -1247 -417 1977 3292 5122 3577 -1262 -7880 -3345 4911 4718
326 4718 11108 6967 4883 -2421 -1714 -50 2866 2811 2649 3585 1212 9242 18494 52466 48515 410652
310 410652 1283190 1907830 1990246 1468358 695367 124212 44622 1802 8691 -597 3445 6835
298 6835 1892 2988 5535 1628 6497 1812 3562 -1844 -4065 -4522 -7852 -7607 -4815 -3189 -2617 -1943
282 -1943 -1551 -1436 -1191 -977 -876 -649 -2176 -1075 -2202 -5074 3276 6744 394 2680 2860 105 -1170
264 -2213 -3056 -1928 610 136 579 4159 3362 -732 -4450 -4590 -571 1131 302 -739 1574 -3407 -1239 -1641
246 -1641 -2374 1338 308 2722 8864 8505 5488 -586 -3882 -1370 2035 -3178 -2674 705 -767 -4615 -6308
229 -6308 -2672 63 -1197 -2157 -3767 -5676 -8304 -7767 -4639 -1531 1171 -2668 -2812 -3810 -2969 -1000 -1965
212 -1965 2122 5070 -3074 1242 3670 -909 -4612 805 4258 3660 2068 489 4761 2628 2371 2907 -2097
194 -777 -2501 601 -960 -3114 -5012 -6598 -6705 -4369 -1063 -3641 4052 -2695 -2393 929 1075 245 -430
176 -2703 -3110 -2950 1477 4214 291 -2463 -1730 -3328 -2103 -330 -3782 -2236 -2347 -3837 -3886 -2823 -1733
159 -1733 -2710 -3775 -649 -1437 -2745 -4248 -5143 -5288 -5250 -4977 -4705 -4586 -4072 -3615 -3475 -3960 -4726 -4965 -4432
140 -4432 -3961 -3828 -1824 -1153 2782 2559 450 1131 -2014 -5691 -3529 352 -387 -850 -1232 -3404 800 1034
122 1034 934 -745 -326 2075 -464 -4251 -8350 -8031 -4826 -2429 -1602 -2170 -3190 -4783 -4614 -4720 -4795 -4745
104 -4745 -4600 -4107 -2624 -2647 -3921 231 2986 436 2614 131 6084 5559 557 -4176 -6537 -5397 -2819
87 -2819 -4826 -3011 -3195 -3076 -4362 -6489 -8014 -8236 -7209 -5596 -3702 -2511 -2372 -279 -3466 -3843 2175
69 28 -2865 -5873 -7930 -7390 -4969 -2436 -680 -1015 -383 -1610 -3503 -4985 -6300 -7014 -7269 -6448 -4732 -2903
51 -2903 -1450 -756 -2089 -417 -1153 -1139 -1496 -1668 -1293 3499 1396 -1453 -1094 -2508 -5799 -8950 -11755 -12498
33 -12498 -9958 -6396 -4718 -2964 0 -922 -640 285 -3384 -785 7094 4005 529 2753 7715 2638 -3356
15 -1635 -912 -2207 1345 -810 -3167 -994 -2287 -2725 -474 -1083 876 2992 -1433 -5808 -8728
0 -8728
##PAGE= F1=1035.543025107
##FIRST=     2915.55639409065, 2671.18566176471, -1173
##DATA TABLE= (F2++(Y..Y)), PROFILE
1023 -1173 -4032 -3670 -1937 -1035 -1040 -734 147 706 850 -2835 1995 1521 -2176 -1774 348 -330 -1143 -2118 -2754
1004 -2754 -2788 -2404 -2257 -2677 -3657 -5515 -5757 -3833 -3426 -1744 -139 73 -1050 -2019 -1714 -2701 -3861 -4364 -4154
985 -4154 -3078 -1187 -5257 70 -1787 -5736 -4975 -4496 -1159 -1201 1875 2730 -2564 282 -4031 -2320 -4631
968 -4631 -5880 -871 2701 2156 615 -2237 -3906 -3010 -2082 -4030 -1553 -506 -1105 -4650 -7840 -1773 -1806
951 -1806 -2940 -4918 -6243 -4869 -3312 -2174 -899 502 1549 1829 -333 -917 -1996 -491 646 -6116 47
933 4062 1451 -566 3460 1160 842 1862 1154 -334 -1552 -2700 -3248 -3569 -4041 -5123 -5650 -4614 -3653
916 -3653 -718 1605 1854 -2011 1403 3960 2728 785 145 -931 -1486 -1639 -1508 -4969 -2804 -534 1302
898 3219 4299 1825 -2357 -2309 -3120 -3713 -2005 206 1338 2058 2466 -2916 1224 -482 -2949 -2221 -5290
881 -5290 -4895 -710 -1727 4657 4709 2346 -1472 994 -1178 -3931 -6509 -4540 -2238 -1437 -1405 26 -251 -651
863 -651 -1250 -2131 -2940 -3503 -3335 -2293 -2268 -4151 -1757 -448 -2213 -240 -791 -4309 -2782 -2908 -1512 -114
844 520 -607 -3462 -4780 -4169 -3774 -3358 -3252 -3466 -3906 -4690 -4990 -4780 -4322 -4072 -3899 -4878 -3842 -3005 -3900
825 -3900 -4795 -5395 -4390 -3993 -2702 -3281 -3771 -4720 -5396 -5378 -4901 -4743 -5144 -5577 -5302 -4277 -2845 -2740 -1332
805 -2664 -3805 670 2365 639 1843 -2117 3037 -408 -1754 -772 -3053 -5909 -3952 -1628 -3563 515
788 673 -185 556 251 -193 -915 -2928 -1808 -1470 -1106 491 1945 1502 1974 2611 1952 352 632 2368 -358
768 -4271 -3186 -5684 -2552 765 982 1102 106 -3209 -5017 -2337 -3033 3538 3567 -107 1864 -811 -2322
751 -2322 -1835 -1100 -2559 -2231 -2837 -822 -1187 -316 825 -1166 -1668 2763 -5031 3390 3345 1499 -380 3557
732 2868 1583 815 -1567 -4599 -444 1984 236 594 500 -1456 -3416 -1754 -2817 -2792 -1702 -1663 -2671 -4695
714 -4695 -6424 -2665 1172 2395 2189 -1919 -3873 -24 2129 1027 -636 -4421 -151 1918 1685 -1222 -2221
697 -2221 -5018 922 -306 -1431 -2523 -3141 -2477 -1104 227 1221 1667 422 -3961 -3954 -1909 -869 -2656 -4564
679 -4564 -6563 -4502 -3181 -306 889 1280 -816 449 1284 713 -580 -1863 1138 1132 2479 4252 5430 89
660 -639 -748 -199 1166 1066 -150 4279 2649 4189 7194 4231 -1755 3987 -1418 3580 1490 -367 -851
643 -851 -3697 -1189 -1525 1591 -738 -2807 -168 -276 -3814 4277 1246 -2694 -4527 -2958 -1340 -8707
627 -8707 -3390 -4883 -4879 -1813 -286 225 -1818 -544 -2151 -3815 -5042 -5745 -5309 -4560 -3941 -4138 -4834 -4877 -3440
608 -3440 -4164 -402 606 -86 -4885 -1567 -2207 -2337 -2106 -1894 -2007 -1973 -1999 -3492 -5245 -3751 -880 332 125
588 -3373 -1186 -1333 -679 341 -179 -2068 -1536 -22 1481 2483 -1276 -1631 -3605 -2661 -1594 -1839 -2813 -2350
570 -2350 -2975 -3364 -3437 -2946 -1720 -1065 -5677 -2514 2149 1060 -3452 -2040 -1677 -561 -475 -1533 -4322 -6207
552 -6207 -2609 -3186 606 3490 2652 596 -1645 -3828 -5123 -5791 -6575 -6047 -4887 -3892 -3159 -2596 -1914 -1031
534 -1031 -3943 -3471 -4039 -1750 -2921 -4368 -4844 -4627 -4636 -4858 -3913 -1791 0 -810 -997 -1802 2181 517 -1316
514 -2153 -1648 -3826 -1083 -4522 -3680 -4361 -2556 -2650 2215 7482 8375 23 -2068 1591 -956 -3433 -3615 -1981
496 -1981 -648 -2347 -892 -2799 -3834 -4960 6 609 -4293 -5988 -5651 -2873 103 -3018 -2098 -2210 1389 7423
478 7423 7449 2620 -2031 -1302 -288 -1449 -2361 -2911 -3600 -3836 -3791 -3359 -2957 -4842 -2703 -4294 -1495 -678
459 522 310 -891 -3945 -4622 -6543 -6332 -4691 -3288 -5252 -1921 -2494 -3674 -4191 -3067 -7231 -4184 -1077
441 -3274 -694 2865 2371 2307 2158 2121 2209 2334 2624 2505 2012 881 194 414 1167 1418 299 -2320 -5758 -6590
421 -6590 -3839 -2700 -2617 -2921 -3177 -2377 -886 290 775 354 51 -259 -3214 310 -4380 -1740 1431 968 -5665
401 -4471 -471 -2746 -3680 -1264 2189 1740 -429 -1830 -1553 -465 -2814 -4892 -7850 -3807 791 -2127 -3839
384 -3839 -819 2197 754 127 -2663 -666 1462 4601 3439 -2277 -3751 -1701 -3765 -6400 -5954 -3458
368 -3458 -1747 -1054 -2170 -2495 -3674 -4456 -4706 -5244 -6089 -6910 -6831 -5994 -4861 -3765 -2198 -477 1321 2732
350 2732 3670 -2068 2732 1506 218 -891 -3604 -4971 -4538 -4580 290 771 715 -2159 151 323 946 907 -382
330 -2770 -5633 -4948 -259 295 6575 4869 1862 -3365 4946 -3974 2133 -643 -4893 -5772 -5471 -5383 -1356
312 -4388 28144 163469 397588 597626 628971 199881 170395 44622 29243 18755 733 -1441
299 2679 3321 2885 -125 3763 -3632 3994 2891 818 -1326 -1635 282 2172 1491 5760 4621 2730 1288
281 -778 -951 1230 -528 1448 16 -1698 -414 -2201 -4612 3419 6164 913 2910 805 -2022 -3995 -4501
264 -4501 -1391 -1287 951 934 2066 6495 2529 -3055 -4238 -3881 -1832 757 -379 2061 3686 -3199 -1357
246 -1603 -1768 1316 -387 1085 2350 4903 4045 -3157 -5149 -1056 1648 -4134 -648 3141 406 -4047
229 -4707 -3300 -747 -226 428 301 0 -3289 -4077 -1687 2985 1316 -5010 -4053 -3090 -3462 93 -1674 214 -1148
209 -2521 922 2739 -1755 -3928 -156 954 -261 -1273 -1740 -1746 -1399 -875 -660 -925 -1356 -2436 -1939 -1572 -963
190 -963 -2778 0 -101 -808 -2144 -3808 -5118 -5365 -4736 -4003 -4005 -4659 -5912 -7190 -7520 -6955 -7030 -7678 -8330 -7512
170 -7512 -6592 -5372 -4009 -2743 -4804 -2838 -1933 -2062 -1245 -1754 -1214 -3964 -4594 1984 2412 1026 -1414
152 -3168 -4731 -4847 -3726 -2558 -1850 -1107 -768 -1030 -2547 -3489 -4509 -5115 -4923 -3893 -1989 234 2151
135 2151 2994 87 1051 -1066 -3967 -3557 -1317 -1485 -1461 -1559 -2318 -1040 22 1347 -587 -984 1344 -1029 -4125
116 -4125 -7418 -7998 -6857 -6798 -6850 -4758 -1716 -5067 -4004 134 3115 655 177 -1352 -2232 -788 -3076 -912
97 1608 942 2867 -2257 7013 10509 8414 -9997 931 -326 -2510 -3191 -773 -2960 -5241 -7010 -6822 -6425
80 -6425 -6448 -6924 -7414 -6011 -3207 -1157 475 -2360 -3501 3181 6562 4357 1342 -1522 -2416 -694 1626
62 430 -2623 -464 -1306 -2867 -3484 -4796 -4885 -4399 -3558 -2493 -1355 -154 -577 -424 429 156 714 -1446 -1986
43 -1986 -582 2875 2594 -2097 -4411 -1896 -4266 -6175 -6636 -4859 -2522 -4210 -3022 -1421 492 720 566
26 566 1816 -1718 924 7473 2875 635 1833 6655 2288 -2842 -540 160 -1654 1981 394 -3798 -485
8 -81 -547 467 -405 1596 3137 -595 -194 -1944
0 -1944
##PAGE= F1=1032.931895427
##FIRST=     2915.55639409065, 2671.18566176471, 975
##DATA TABLE= (F2++(Y..Y)), PROFILE
1023 975 -593 -2317 -4100 -6063 -6161 -2633 1791 1849 3357 -3219 3428 3125 1328 430 2038 1176 -1617
1005 -1472 -1988 3026 1795 879 -392 -3526 -4915 -4822 -3916 -3929 -763 -319 -781 -2211 -969 -3367 483 -400
986 -1644 -3608 -3971 -4190 -4206 -2713 -1663 -5629 -3303 -3918 -1087 -1929 309 612 -3892 102 -3781 -2196
969 -2196 -3959 -4781 -1724 -2783 -3578 -4219 -3618 -4955 -266 2026 -2742 -1585 245 -404 -4902 -6543 -5387
952 -5387 -1684 -988 -2345 -2969 -2904 -2738 -3401 -4892 -6317 -3749 -1410 -1170 -231 -1273 -2397 -1483 -3488
935 -3488 2758 3999 -164 -1680 2276 1275 80 -1475 -3036 -4023 -3619 -2683 -1603 -772 -1487 -165 1410
917 2037 -4418 257 3202 3145 809 1025 314 -517 -1407 -2112 -2822 -3517 -4208 -4201 -4543 -3196 -620 646 1799 2881
897 2881 1111 -2872 -3236 -4198 -4546 -527 -2267 -3528 -3802 -3016 -1646 19 -11 -851 -552 -534 912 2242 -2104
877 3042 3247 1270 -1907 733 -3732 -4393 -736 -1543 -243 -1199 -2513 -329 -99 1533 -104 -1357 -2824 -3489
859 -3489 -2852 -1492 -2642 -4814 325 573 -1260 -1276 -2625 -3176 -3576 -4173 -3810 -2158 -160 -2529 -3884 -3475
841 -3475 -2387 -1386 -4031 -1618 -76 -3501 -3173 -1922 -551 -4212 -4287 -4393 -3211 -1168 -1560 -2283 -4370
824 -4370 -5120 -5063 -4333 -3453 -2784 -3651 -4373 -4038 -2907 -1536 -263 229 -3278 1647 2364 -2137 -1098 -610
806 -610 -1596 -2418 -273 462 -2259 -4732 -4174 -2725 -1670 -2326 -2938 -2843 -2119 -4413 -3072 -4274 -5286 -5806
788 -5806 -4918 -3665 -2341 -821 637 -162 1906 -44 -2800 -536 1829 2098 746 621 2456 -491 -2288 -204
769 -630 -4260 -3051 -1699 -3425 -1203 298 -447 -470 -1697 -4212 -3252 -2813 1116 560 -2104 -341 299 612
751 612 505 -1576 -2921 -2769 -4085 -5148 -5311 -5091 -5061 -4858 -3980 -2523 -2994 1109 2805 -8 371 3692 2248
732 2248 192 -2342 -4109 -4881 -1730 -183 1581 1539 -399 -1357 -2820 2104 1170 -2108 -927 -1354 -1453 -1983
714 -1983 -1296 -559 236 1237 1469 -1455 -4922 -489 2114 773 -1396 -5376 -256 3833 4293 581 -3882
696 -4119 810 1128 467 1231 -3345 -3022 -2279 -3962 -5137 -4762 -3736 -4656 -4514 -3090 -4443 -5228 -4102 -3416
678 -3416 -3669 -3850 -2319 24 -651 -2939 363 2690 -336 238 -1055 2240 2185 2962 5638 6141 -1644 911
659 -478 -457 572 869 -420 3251 554 3399 6723 2889 -1026 4239 830 -483 -375 -322 -559 -1328 -2154 -903
639 517 -95 -4120 -1643 88 -3608 293 -1651 -3794 -6375 -3217 -13843 -29098 -13547 -5707 -3285 -3603
623 -3603 -3887 -3824 -3862 -4207 -4928 -5285 -4548 -3916 -3759 -3904 -3455 -2451 -4800 -2126 -1704 -2866 -1411 -114 450
603 -4551 -780 167 -44 408 -354 -1381 -273 -102 -4020 -4469 -3579 -3275 -4547 -4704 -3974 -3221 -2913 -2922 -3226 -3716
583 -3716 -3930 -3893 -3698 -3630 -3582 -3551 -5138 -6761 -1450 -656 -1422 -1215 1563 1259 -1376 -1893 3922 2294 -1942
563 -2130 -5622 1674 347 -3200 -341 1099 721 3344 3592 -4600 188 -2582 -2974 -1382 -59 549 242 -381
544 -1551 -2774 -4018 -4999 -4596 -3804 -3210 -2656 -1797 -261 -1750 -2432 -4563 -5286 -1546 2649 -2062 -2613 -3234
526 -3234 -2734 -2804 -3714 -4758 -3771 -2234 -1271 -1338 -1730 -3431 -5749 -4032 -2313 -2694 -1025 -2292 -3584 -3985
508 -3985 -1601 -3003 386 5156 5599 345 -2484 525 -1885 -3217 -3058 -2542 -1974 -3723 -437 -3569 -2809
491 -2809 -4827 1130 772 -4864 -3374 -2086 1719 1332 -4311 460 733 2474 5492 4305 2144 -997
474 -3855 -3664 -1349 663 -716 -614 4216 4744 1685 -4395 -3098 18 -4152 -1861 -1721 -662 -1698 -2331 -4407
456 -4407 -3630 -3150 -2856 -2132 -1548 -3586 -1495 -2062 -2753 -3286 -3739 -5175 -5742 -4259 -4614 -491 2894 1090
437 935 1692 829 296 146 368 135 -641 -2346 -4071 -4740 -4531 -4540 -4192 -2791 -1125 1 -585 -1418 -2607 -3546
417 -3546 -1807 -976 200 1618 1191 -29 955 225 -2985 -1483 -3581 -4482 -4694 -4527 -5672 -5259 -3655 -1260
398 2203 3986 6772 2504 825 -1949 -874 580 -424 -367 -2426 -5062 -1214 -2311 -4067 -968 -708 -1294
381 -1294 735 -2689 -2785 -1195 1385 1826 -1861 -4408 -1581 -3303 -1913 -947 -2217 1999 -2302 -30 -1552
364 -1552 131 -1308 -1796 -2042 210 -1705 130 -370 -23 -1236 2086 3908 1310 3354 2088 -5540 -1235
346 -2249 -2853 -3007 -2454 -4370 -4005 -4565 -1135 -1705 -2115 -4394 -1770 -1559 -1625 -2382 -3287 -2899 -1078 -3634
328 -3634 -1163 -3046 1747 1396 -2373 -3531 2466 -1571 3314 -273 826 883 -3952 88 -2708 -451 20721
310 98626 187768 254927 253048 178580 76208 1802 18755 25574 11999 14140 1887 3305 -721 -1895
296 -1895 3935 -2878 -1283 -1799 -2208 -2360 -1317 914 1925 1633 6431 2917 2431 1187 -1995 -2564 -533
278 -1019 -106 -194 -1196 118 -1955 -3864 3100 2972 1810 1326 675 -3850 -184 867 242 -792 1292 1557
260 1557 -472 -3390 -4716 -1971 -2241 -3048 -2956 -275 -718 -1243 -1493 -2155 -1711 -1816 -1714 -1653 -1665 -1837 -2332 -2934
240 -2934 -3872 -4759 -4584 -3861 -3222 -4780 -2759 -3015 -3322 -3693 -3815 -3710 -3464 -2977 -2066 -1276 -384 -3571 -4601
221 -4601 -1471 1588 39 -2433 -2697 -2784 -3532 -3146 -3141 -3230 -3212 -3374 -3261 -2879 -2355 -2839 -1163 -854 -963 -1557 -2050
200 -2050 -2213 -2116 -1968 -2016 -2007 -1427 -2375 132 -1288 -602 -3043 682 990 1155 844 -244 -832 -2801 -850 2216
179 3460 3116 312 -2473 -1841 1997 896 -1056 -1509 -68 -2998 -6263 536 394 -4622 -3372 626 751 -659
160 -2665 -1105 -3427 -4533 2508 6609 1088 454 -2274 -4867 -4331 -3750 -4570 -4015 191 906 -1191 -2721
143 -2721 -1094 -696 -4696 -1607 -2523 -1951 -2883 -3016 -2163 -1760 -2078 -2809 -3575 -4258 -4148 -3837 -3506 -2948 -1405
123 877 3102 746 -518 -1845 1621 -1390 -4116 -2087 5 1571 -1468 3780 5274 1270 -5128 -3693 756
105 3411 2301 3585 2811 2190 650 -2791 -2479 -699 799 2764 -4117 6897 9767 9597 -4636 -6277 -3030
87 -3284 -1058 1171 -3234 -353 -150 763 580 669 1115 -3072 800 -2415 -1550 -2441 -1786 -3580 1195 2304
69 2304 2707 737 -585 -933 -2635 -3141 -2777 -5078 -3759 -5129 -3891 -2434 -1436 -719 -823 -935 -1573 -2822
51 -2822 -4427 -4074 -2229 -758 -618 -169 -1300 -2126 -573 -956 -1564 -2537 -2631 -3124 -4229 -4628 -4600 -3084 -3730
32 -3730 -4323 -2070 -159 117 1093 1068 2439 -945 2039 3835 -344 -3219 -559 4559 1270 -3038 -401 563
13 -1122 1766 785 -4439 317 1219 -1525 -4157 -4526 -2085 330 -1998 1172 2577
0 2577
##PAGE= F1=1030.320765748
##FIRST=     2915.55639409065, 2671.18566176471, -995
##DATA TABLE= (F2++(Y..Y)), PROFILE
1023 -995 -1409 -2214 -3622 -5688 -6556 -3373 781 2497 5054 -1899 630 2439 2527 -1198 -3092 -2481 -1759
1006 -1759 -3784 -3628 -5114 -5091 -4459 -4206 -4990 -2951 -3872 -4680 -2877 779 1254 981 -3159 -223 -3347 1140
987 1235 84 -3705 -3303 -1859 -3451 471 325 -5402 -1892 -3404 -991 -1568 1338 2371 -3407 -341 -3251
970 -3251 -992 -1932 -3957 -652 -2179 -3655 -4677 -4600 -3406 -1538 -160 -332 -921 510 -440 -4891 -4012 -3885
952 -3885 -3905 -3775 -244 2346 322 803 5506 1904 615 1744 249 -2319 -1930 -2890 -5015 -6526 -3788 -417
933 2196 -1786 -2342 865 1770 2882 2449 2271 698 -827 488 3989 1722 -1659 -345 3067 3384 -4117 199
914 -1191 -2353 -3017 -3200 -3406 -3294 -2669 -1396 -2694 163 535 -517 -3876 -3388 -3486 -2513 -2066 -2711 -3930 -3924
895 -3924 -3093 -3698 -5065 637 343 -90 -18 559 1176 1815 70 1042 151 -1090 931 2274 -1563 1504 1865
876 1865 699 -1419 35 1019 -3351 -4652 -2545 -445 -1156 -3362 -1279 -1130 1225 -162 -2027 -3805 -4996
859 -4996 -5102 -4410 -2954 -4198 804 1718 801 146 -1765 -3713 -5361 -5621 -4163 -2497 -779 -3864 -3063
842 -3063 -1401 -2949 -341 -3943 -1302 -336 -3024 -2969 -2666 -129 -3925 -2939 -3080 -1400 1434 -526 -2006
825 -2006 -3270 -5070 -4284 -3597 -3050 -3360 -3793 -4383 -4380 -3873 -3057 -2199 -1656 -12665 -7640 -2134 -6181 188
806 -381 -796 -758 -564 99 -3174 1924 19 921 -1102 -439 -3576 -1822 -2823 -2383 360 -3697 333 -619 -2110
787 -2110 -3641 -4020 -2366 44 2594 4911 564 -4520 -947 2450 2520 -174 -1661 -3042 -6012 -3486 -833
769 104 -3991 -2587 -1978 -4927 -697 -442 -1425 -1517 -2456 -2878 -3291 -2059 -2206 -3327 -4916 -5689 -4345 -3368
751 -3368 -3123 -3590 -4695 -4355 -2950 -1747 -606 -2837 -3117 -1227 -453 -2024 -2780 -1042 1592 -514 2101
733 3558 1946 -28 -2081 -3163 -4989 -2847 844 3239 2233 -1885 421 -927 -1761 -4675 -2982 -99 2273
715 1704 -1805 -620 5611 6694 2295 798 205 -3925 -494 3352 729 -2102 -5551 -38 3300 5792 1732
697 -5211 -3053 -1601 -1420 295 1903 -3460 -2621 985 -1408 -3542 -5262 -4716 -3974 -4053 -4009 -5028 -3833 -2353
679 -2353 -1548 -2366 -3132 -2730 -495 -1678 -2145 -1581 532 -1056 326 -438 170 -981 -665 1823 5428 -3107
660 3207 1072 -226 -293 462 -241 396 -356 2117 3870 1570 -183 -833 -1048 -85 710 913 446 -768 -2991
641 -2991 -2189 -2008 -1699 -5112 -2805 476 -1828 1646 4553 982 -6814 -4234 -32951 -51600 -24417 -11033
624 -2175 223 2051 -5155 -5271 -989 -3259 300 305 -1317 -917 -1523 -1886 -2211 -5664 -2359 -3009 -3663 -2917 -988
604 1008 -2527 -914 452 -349 -1067 -1645 -828 -1122 -1128 -3651 -3450 -3373 -3793 -3256 -2657 -1708 -1380 -1791 -2610 -3410
584 -3410 -3755 -3722 -3832 -3531 -2356 -2378 -5156 -6924 -5247 -2333 -3227 -1728 186 2676 3315 -468 -591 1313
565 196 -2263 -1497 -4198 -839 48 -2056 -434 -1172 -602 944 2709 -4849 111 -386 -1747 -1568 -269 -878 -676
546 -676 201 559 361 -485 -1725 -2665 -2418 -1432 -449 -881 1031 -2139 -390 -2269 -5532 -1030 -466 -2298
528 -2298 -3068 -2081 -727 102 249 -256 -2039 -2211 -3275 -4264 -4832 -4770 -3948 -3218 -2956 -2875 -3057 -2734 -1380 16
507 -217 -3471 -544 4437 4589 335 -3077 199 495 -303 -1251 -4142 -2739 -4601 -886 -2577 -3024 -3928 1923
488 -852 -1496 -1359 -702 1451 2456 -4476 670 -1577 -3779 -3921 -2724 -2245 -3081 -4487 -4115 -2158 -475 -1505
470 -1505 226 4104 6285 91 -5868 -638 512 -3845 -3646 -3188 1248 -747 -2224 -4973 -4531 -3555 -4340 -5042
452 -5042 -3957 -2519 -1365 -733 -602 -691 -2838 -3635 -3942 -6090 -4748 -1409 -316 -1124 -1371 770 -418 -1557
434 -1557 -1552 -236 754 1067 311 -697 -1325 -2221 -3696 2453 3996 4717 5306 1200 1682 1500 -2221 -379 -716
415 -716 496 1532 283 -974 774 183 -2628 -1698 -3588 -3790 -2458 -695 -5688 -5989 3992 4586 4966 4315
397 4315 3195 1998 827 -1943 -1607 -2069 -2256 -1853 -1254 -1228 -596 -3181 -2714 -400 -3421 -3675 -2133 -3762
379 -3762 -5385 -4801 -3627 -2370 -1852 -3678 -1727 -3980 -4255 -2302 -2342 -368 -3619 2390 -789 -473 -714
362 -714 -3362 -3034 -3770 -2560 -1005 -453 347 -3046 -1171 4329 -1085 4745 1451 -4911 760 -357 -911
345 -911 -1083 -1819 -4251 -3745 -4080 -2048 -2863 -3573 -4595 -2708 -2010 -1703 -2390 -4057 -4993 -2584 -5225 1044
326 -2321 -124 -1181 -1291 -1027 1404 328 2673 646 724 1316 -1568 -1024 -807 562 4366 34913 100084
309 100084 106143 89874 60210 30969 8691 733 11999 13120 11553 -235 4230 -2948 1084 821
295 821 110 -143 -536 -1402 -2633 -4232 -4158 -2781 -1945 -1812 -2790 -4273 -3698 -3285 -4765 -340 -1353 1703
276 193 -1096 414 -1735 -3467 -2081 -649 1323 2525 -336 -4736 1383 3025 284 -573 1425 2239 936
258 -983 -630 556 -552 -3008 -3935 -2114 -3295 -2393 -343 -1443 -2408 -1795 1678 1774 -521 -2410 -3571 -3435
240 -3435 -2338 -1235 -973 -2463 -611 -4373 -2865 -3322 -2390 -2175 -2042 -3635 -3786 577 1085 1203 -1222 -3979
222 -3979 -3640 -548 -404 -1464 -1891 -1903 -3020 -3131 -498 -1020 -2755 -2212 -3160 654 2579 -2222 -1311 -269 1366
202 965 -1027 -2356 -2762 -2663 -2429 -2292 -2180 -1795 -2549 -516 -2093 -2004 -3800 -697 -2710 -5028 -4368 -2570 -1576
183 -1576 -1899 -3199 -4753 -4965 -4219 -4638 -4337 -2238 338 -174 -187 -71 -142 -1733 -4060 1658 550 -4163 -3227
164 -3227 466 -1446 -4146 -4336 -1604 -2105 -4220 2995 2214 -872 -2017 -4309 -5419 -4022 -2399 -3098 -4087
147 -4087 983 503 -4645 -4026 398 -542 -1879 -119 -1773 -2347 -885 -2376 -3757 -4789 -5258 -5053 -4245 -3370
129 -3370 -2802 -3002 -3987 -5586 -3323 -680 1272 -43 -152 -2717 -2716 -3063 -1020 864 1812 2184 -3933 2257 2320
110 2320 -709 -4364 -3831 656 1219 2563 3447 3125 1372 -515 -2663 -3955 -3437 159 2470 -3410 5785
92 7489 6482 1441 -13784 -5967 -4790 1183 2800 -3746 675 1 678 484 -2444 -4667 -3728 -559 -1558
75 -1558 -2420 -1152 -1944 -3762 -3074 -370 2634 -481 -238 2749 2434 445 -2442 -3406 -1052 -1174 -1766 -474
56 2371 1129 -1530 -2046 307 9 -1623 -2054 -1300 -2711 -4448 -5694 -5221 -3420 -1369 409 1307 -2768 33
37 -2063 -4656 -7080 -5341 -4057 -4666 -5195 -2150 -1423 -213 375 967 2360 -970 2450 3347 909 -4245 -6670
19 -6670 -2651 306 -3598 -979 513 -742 1049 308 -4047 -634 -2776 -3787 -3530 -3325 -3503 -3417 -2402 -1049
0b02
##PAGE= F1=1027.709636069
##FIRST=     2915.55639409065, 2671.18566176471, 1000
##DATA TABLE= (F2++(Y..Y)), PROFILE
1023 1000 316 -805 -1927 -2343 -1649 267 2300 3485 3811 161 -2739 -3338 -7314 -9433 -6367 -4569 -3579
1006 -3579 -4077 -1576 517 2170 3203 3704 -2077 -1957 -3955 -5171 -309 983 287 -1010 -2831 -4167 -3335
989 -3335 -932 284 1355 -1113 -2078 -2207 -3071 -2290 -1771 -4598 -595 -2585 -341 -242 3114 3535 -2593 -656
970 -2227 474 -2067 -4170 -5498 -5952 -5404 -4625 -4219 -4329 -4868 -5679 -5340 -4181 -3409 -3481 -4356 -4804 -4808 -4024 -7869
950 -7869 -4092 -956 -121 1047 3118 1219 -299 -482 55 -3810 833 -2459 -1899 -2988 -1543 -202 1443
932 -3379 -2837 -659 1238 1557 1584 1852 1428 1853 3738 2937 1300 -1790 -398 3078 3940 -3215 -434 1242
913 73 -709 -1042 -1307 -1008 -2118 767 -2403 -1750 1206 -226 -3199 -3710 -2394 -2428 2503 5907 2636 -3965
894 -2569 -1785 -4036 569 -185 -1495 -2294 -1943 -893 537 -492 2019 543 -1903 481 1417 -468 970 1413 685
874 -843 -2275 1999 -790 -4014 -5912 -3487 -1788 -4454 -1859 -1744 400 -592 -65 1332 -3867 -402 -1827
857 -1827 -3187 -3852 -2282 69 2275 3795 2444 -630 3074 2769 1519 -639 -3129 -4050 -2429 -1602 -3457
840 -3457 -4380 -4761 -1721 415 -2717 -2757 -4019 -370 -3815 -1781 -1696 -254 4606 3636 1935 -1785 -3913 -3944
822 -3944 -3672 -1463 -82 -791 -2125 -3097 -3567 -3591 -3365 -3096 -8350 -21377 -4165 -3880 -4319 -3339 -2059 -1052
804 -1052 -869 -674 -4030 -2080 -2574 -2371 -1852 -1006 -904 -361 -2849 -456 604 -3196 -1319 -2659 -4080 -5312
786 -5312 -5301 -4396 -3537 -2617 -1579 -373 -2307 48 2916 2166 -589 -3721 254 -2201 -4303 -3401 -1858 -4146
768 -4146 -2307 -2509 -3370 -2743 -2319 -1967 -2261 -3064 -3440 -3143 -2715 -2291 -1830 -4828 -602 902 1255 895 -2835
748 -934 -1215 -299 123 -364 -4503 -2480 -2178 -3192 -3207 -1427 940 3090 -384 3435 3388 1819 153 -1723
729 -3307 -5171 -3992 201 4114 2041 -3048 2588 437 -2244 2167 -1315 3157 3791 1194 -1177 131
712 5528 6249 939 442 1783 -3056 -593 3623 352 -2611 -4926 -147 2004 3350 2019 -3888 -2695 -3860
695 -3860 -3093 -442 1744 -2185 -873 -136 -1093 -2168 -3111 -3191 -3151 -3136 -3019 -2392 -1155 -1555 -1714 -1846 -2300 -2301
675 -2301 -1743 -877 -541 -2863 -3299 -4140 -3514 -2868 -1885 255 2923 5677 5076 -4399 4634 2761 440 -1531
656 -3059 -664 2243 -63 581 388 -2108 -3912 -3884 -3893 -3475 -2015 -540 164 -365 -3289 -2109 -1769 -1197 -4604
637 -4604 -3646 301 -458 -854 2146 -1452 -5787 -8268 -36829 -43821 -22073 -11015 -1271 1219 1303 -5910
620 -3237 -2913 -4288 165 -979 -2526 -3932 -5284 -4236 -2888 -6116 -1648 -2353 -3048 -1964 147 1050 -454
602 -1193 537 -414 -2509 -2817 -2358 -4003 -4517 -2943 -2459 -1352 -1152 -2646 -4106 788 4805 4097 1734
584 -448 -1377 -1321 -5730 -4601 -3308 -4168 -2909 -2939 -1911 838 -317 -2916 -4721 -2726 -1872 -2319 -2564 -802
565 1534 -2542 2094 -2178 1259 117 -1524 -2172 -2845 -2200 -1175 -71 -3413 -706 -117 -1124 -1775 -380 5801
546 5480 2775 1924 2139 721 -1068 -2085 -2976 -3600 -4085 -4172 -3473 -2233 -1029 -337 -4969 -1092 -2460 -4171
528 -4171 -3346 -1475 336 1586 2137 1954 -2722 -1695 -818 -1753 -2166 -2776 -3283 -3403 -3304 -2824 -2461 -2331 -2442
509 -2442 -3385 -4058 -3382 -1615 226 1675 196 -2785 1070 -25 -1686 -2609 -4183 -2278 -3796 2855 2 -2412
490 -3153 -3563 -858 507 -46 244 740 1891 -2908 -2521 -4240 -3869 -2687 -2075 -2349 -3752 -4539 -2550 -839
471 16 -2835 -1437 -2760 -1639 -692 -3455 936 853 -3478 -4785 -4338 2453 1345 664 -5724 -4312 -2766
454 -2766 -1517 -754 -1325 -1894 -2713 -3699 -4432 -4586 -4306 -3827 -3383 -3889 -3919 -3128 -1822 -3195 -4246 654 69
434 -565 -648 245 1212 2006 2067 1907 1723 -4610 -8219 1933 4535 3771 4919 2402 -348 2277 -102 -891 -2805
415 -2805 -3549 -2846 -1920 -2104 -1873 -2842 -4334 -4653 -4210 -4385 -4048 -2095 -5323 -5945 2232 1430 -164 -2197
397 -2197 -1419 818 1351 -1501 -2507 -1573 -1498 57 -689 -1910 -1388 -4287 -568 -1340 -2926 -3278 -3574 -4238 -5245
378 -5245 -5047 -4897 -5259 -4734 -3494 -2490 -3168 -4921 -2997 -2120 -1884 -666 4045 176 -883 762 -4079 -2384
360 -2384 -1353 -3302 -3820 -3773 -2591 -3365 -2041 3700 -3623 4297 -196 -3814 3054 4157 1375 -734 -2198
343 -2198 -3877 -3576 -4098 -3311 -2295 -1556 -3184 -697 -384 97 410 702 1072 1426 -788 925 -1524 -873 -281
323 1212 1912 2344 1285 1255 278 -990 -2941 964 -333 -1612 -3022 2918 12781 24438 35537 42926 43836
306 43836 -3858 -597 -1441 14140 11553 10921 -128 4848 -2555 4607 3320 1848 3411 4399 1255 -1645
289 -1431 554 -817 144 -353 -2239 231 787 -3904 -3464 -1133 -1489 526 -75 -1264 630 -1675 -3445 -33 -1830
270 -1830 -2964 -2819 -2341 -3666 -2990 -1865 -355 13 500 -586 -1883 -1602 435 2371 573 -3312 -3828 -3256
252 -3256 464 1134 2789 -1126 -2916 -998 53 -2200 -2631 -3735 -498 329 -2072 311 -114 -3096 -33 -2777
234 -2777 2676 821 -1400 -3269 -3791 -4127 -4456 -1715 -682 -96 -1424 -3517 -2075 -3034 -4226 -4404 -4186 -4246
216 -4246 -3949 -3532 -3195 -3560 -4568 -4022 -3190 -911 188 -2650 782 405 -613 -1589 -3090 -4116 -4187 -3983 -3907
197 -3907 -3895 -3627 -3065 -2836 -2677 -2755 -1458 -2932 1815 1633 301 -1781 -3180 -1939 -888 -1346 -307 1434
178 1016 340 -421 -1473 -2279 -2878 -2652 -2078 -1793 -1814 -1696 -879 329 -3824 -2150 615 -629 -1722 -1908 -2251
159 -2251 -1441 -3783 3284 2692 -2904 -1621 -1552 -3071 -1570 2066 1921 -1533 186 -577 -2717 -4262 -446
141 -730 -59 769 -1446 -3162 -511 3231 504 -1293 -2100 -2869 -3115 -2729 -2049 -1947 -2581 -4007 -3901 -2131 -1250
122 -1250 -1130 -2218 -3563 -1213 876 1823 1773 1570 615 -3544 104 993 -3250 -3331 -4317 -454 238 1919 2563
103 2563 2015 59 -2603 -4162 -4518 -5113 -786 1666 -2658 3749 2219 -530 -2797 -8676 -8731 -4869 2998
85 3616 -4284 1074 -95 222 1221 -1233 -3661 -3322 -747 -337 -3107 -3253 -2089 -3866 -254 18 1535 -2401
66 -94 3697 3202 -380 -669 -1262 359 278 -1585 953 7484 2855 -2076 -3502 -5095 -3401 -2882 -3148 -3873 -3774
47 -3774 -3050 -2550 -2069 -1875 -69 2099 1984 -3339 1314 -542 -2340 -4816 -4007 -3901 -5053 -5435 -1280 -1809
29 -1809 -3226 -4729 -2669 -172 -1598 1959 2605 1493 -1100 -2730 -2330 -246 -4324 -1987 268 -612 38
11 -1002 -2408 -3373 -4594 -2998 -1620 -1230 -1211 -541 -1407 2409 2356
0 2356
##PAGE= F1=1025.09850639
##FIRST=     2915.55639409065, 2671.18566176471, 29
##DATA TABLE= (F2++(Y..Y)), PROFILE
1023 29 1005 -351 -890 -686 17 983 1474 1375 657 -362 -4909 -3742 -5697 -4737 -2088 -509 -1073 -2851 -1491
1004 -1491 1187 2177 3433 4198 514 -1113 -2746 -4854 1541 1431 1577 1620 -1152 708 -833 -3100 -5613
987 -5613 -5947 -3521 -1696 -2703 -3298 -1895 -2907 -3766 -1714 -1709 285 821 2128 2587 -2525 -957 -1185 747
968 804 -3846 -1804 -1249 -2617 -4147 -4125 191 -1560 -1029 -2105 -2848 -2696 -2076 -3924 -1264 -1445 -1950 -6962
950 -6962 -8109 -4222 -4452 -3672 -2627 -1608 -1155 -2178 -2027 -4748 -2009 -2676 -4800 -3133 3285 5966
934 5966 1959 -4848 -3429 -2189 -4049 -4397 -2098 106 2079 3924 1074 984 1171 -1435 -412 2770 3497
917 3497 -2654 -689 3510 1638 -534 -2609 -4555 -4183 -4044 -620 -786 -2376 634 883 -2059 -4408 -3720
900 -3720 -4242 2384 4823 3132 -2379 -1564 7 -2021 -810 -1855 -2926 -3146 -2362 -1158 414 -1357 2268
882 418 -2980 -1484 -3950 -5485 -3845 -2878 -2460 -2481 -5020 -1994 -2083 -2996 -4218 -2455 -2681 -4585 -1503
864 -1835 -1084 -1863 -4715 -2835 -5599 -2278 -3132 -2917 -4120 -3765 -1120 1170 2945 2268 -344 3554 2454
847 2454 5953 3814 -3295 -2804 -38 2703 -2347 -2531 -1386 -984 -415 -2228 -2328 -3355 -899 -3585 -991
829 -596 248 4181 4088 3618 223 -1487 -2513 -3900 -1423 -1592 -2055 -3265 -4281 -3405 -1887 -810 -461 -743
811 -743 -19796 -2315 -2061 -422 -2975 -1486 872 -1367 -924 -2985 -3083 -172 1597 1817 4423 2042 1056
794 1056 -1979 696 663 -2148 -1228 -2744 -3910 -2761 -4477 1004 2331 2920 2589 1417 -378 -1383 -680
776 280 304 -3507 -1218 -2278 -1359 451 804 -4404 -2037 -2861 -1422 2163 1814 -1864 -1980 -2515 -1915 -1918 -1539
757 -1539 -1571 -1989 -3879 -3256 -4000 -4211 -3126 -3515 -1406 -1996 -1564 -2195 -1982 -3715 -684 1868 4872 1401
738 1844 5246 2338 -103 55 -356 -506 -1011 -2303 -3830 -5000 -3665 -1674 -254 1152 -1349 4380 1080
720 -4204 338 -2442 2592 3521 836 -364 966 1323 1233 -615 65 415 -2749 -808 3160 -304 -2889 -4335 -601
700 628 2206 2011 -2515 -2966 -1696 -2180 -3145 -3827 -4173 -4064 -3696 -3294 -3715 -2997 -2967 -2734 -2326 -2817 -2127 -946
679 18 1121 -170 -3387 -4051 -3177 -1951 -3846 -3204 -1181 -1838 -1663 -185 -168 1660 2237 4295 3404 -3371
660 4860 3892 1255 -2655 -1869 723 3963 175 -707 -231 -3011 -3373 -2102 -1332 -1062 -2452 -1518 -2061 -3130
642 -3130 -4128 -4018 -3367 -2981 -3959 -3899 -1092 101 -3787 -1623 -4356 -4195 -13761 -9452 -6630 -3626 -5772
625 -5772 -1818 -278 248 -3979 -273 -1832 -3421 -708 -1425 -1935 -2162 -2129 -1737 -1560 -5442 -2031 -3000 -4033
607 -4033 -4404 -3969 -3275 -2838 -2847 -3115 -3686 -3932 -3879 -2963 -2402 -2638 -2125 -1568 -338 -1574 -3486 -4957 1785 4241
587 4241 2638 574 -53 1482 -169 -4550 -5388 -3402 -3025 -461 346 339 933 -1345 -987 1418 323 -1038 -2231
568 -2231 -2709 -1779 -43 -3373 2290 -832 910 -241 -2003 -398 -2737 -1164 -1248 -1002 -1704 -1151 418 -845 -2064
549 -2064 -2450 5596 5103 916 591 1309 40 -2620 -4829 -3724 -3528 -16 -4021 -1187 -800 2496 1115 -4796
530 -1620 -3266 -3083 -2165 -1172 -98 984 2049 1521 -3709 -3438 -1197 -448 -2335 -4673 -4674 -3085 -2368 -2396 -3490
511 -3490 -4563 -2315 115 -94 -3019 1314 2550 1001 -586 -1794 -258 -1033 -2859 -1674 -2421 -1094 -2487
494 -2487 -998 -2049 -2878 -3528 -4294 -4447 -4168 -4224 -4648 -5129 -5582 -5659 -4684 -2904 -1596 -906 -1840 -2146 -3408
475 -3408 -3430 1100 3366 -556 -4611 1125 2102 208 -1521 -1833 288 54 -3551 -4012 -3707 -3353 -3400 -2486 -7165
456 -7165 -3446 -2344 -946 -1927 -3028 -2278 113 2312 2723 3061 -3576 -1871 69 -2724 -2532 -2036 -176 -3526
438 -3526 -7224 3421 2262 771 -370 -128 817 1665 1385 197 -1774 -4886 -6348 -1347 58 1075 1888 2395
420 2395 -2517 134 1324 1065 -384 -1667 -2383 -1979 -3564 -119 -739 -1430 115 -1232 -2810 -2459 -3021 -4810
402 -4810 -6085 -4569 -3142 -1990 -2145 -2911 -3443 -3432 -3546 -4309 -4933 -4278 -2189 -1216 -2732 -2309 -5658 1386
383 1138 -262 -802 1 -1362 -1760 -3130 -4513 -5671 -4230 -3306 -2359 -2012 -3221 -2642 -1832 -1602 -128 693 660
364 660 -1214 991 -3966 -1686 -1063 -4091 -793 -297 391 -3714 -2249 3165 -4769 1660 -1907 -2450 2958
346 1705 -104 -1174 -2901 -2851 -3431 -2352 136 -86 -609 -1911 630 2368 2142 4291 3891 3173 2589 2036 1429
327 1429 -1169 -1291 -2563 -2744 -2610 -2660 -3132 -3341 -2931 -1780 -3450 1065 602 -2968 769 7417 12980 18685
309 18685 22817 24207 22257 17703 3445 2679 1887 -235 -128 924 2204 -159 4265 2492 2854 2035 2546
292 2546 505 -1269 -938 -996 -2173 -1430 -4469 -4102 -1206 617 -3275 -1581 -1489 -1588 -2313 -665 -1877 384 -2110
272 -3967 1049 2980 1259 -527 -3994 -2323 -66 1253 -753 1139 2055 1175 132 -818 -1131 -550 631 -3798
253 -3129 -3781 1218 4292 4236 -1312 -3094 -221 -526 -3285 -2815 -4881 865 545 -3650 370 -562 -2974 -384
234 -451 3443 2670 -2671 -1378 -1694 -4455 -2077 -2562 -303 -1173 -1085 -2761 -2203 -4235 -5174 -3252 -1521 -1767
216 -1767 -2816 -3264 -3687 -2718 -1621 -899 -2266 -1164 -1449 -3094 -2403 -3105 -3884 -4321 -3877 -3046 -2063 -1669
198 -1669 -1561 -1648 -1631 -2221 -2999 -3162 -3184 -1550 -1846 -1279 -382 128 -183 -1315 -2819 -3574 -2203 -973 1499
178 2365 2280 1488 114 -996 -2126 -3386 -4932 -4489 -2624 -936 -53 -33 -2891 -1124 -1358 -1234 -3073 -196 -2041
159 -2041 -1655 -3034 -4338 -3546 -4427 4753 3826 -2677 -718 4064 6053 742 -429 -64 1993 -1084 -1833 -977
141 -977 715 971 -1568 -4108 -2562 1845 -905 -1452 -575 759 -503 -1730 -2972 -4299 -5252 -4671 -3556 -2481
123 -2481 -3684 -2043 -2572 -3941 -2592 -1087 994 1823 1153 404 -2054 -4578 -4697 -4982 -2391 -4459 -1749
105 -1646 638 1846 1207 -195 -1759 -2744 -3746 -2871 -1528 -674 -2698 537 -342 969 855 -6447 -9116 -2984
86 -1196 -1350 -3804 -1150 -1381 -1978 -3094 -4407 -5663 -4760 -2793 -754 -1531 -4786 -2892 -3558 2415 2471 1478
68 1478 -4920 -380 2109 230 -1428 -662 343 2101 1708 -1322 1938 7338 4661 -2435 -301 899 -4210
50 -636 -662 -928 -1608 -2537 -2710 -2002 -1512 -803 -557 -600 -4282 -779 -764 -1522 -3479 -1951 -3645 -5002 -4200 -624
29 2837 844 -996 -51 1123 -2473 588 3932 1229 -1476 -1934 -637 -529 -5068 -3089 133 -425 -948 -2699
11 -2699 -1734 -3286 -5114 -6361 -5139 -3150 -989 161 -1880 1299 767
0G67
##PAGE= F1=1022.487376711
##FIRST=     2915.55639409065, 2671.18566176471, -1777
##DATA TABLE= (F2++(Y..Y)), PROFILE
1023 -1777 -1173 -1131 -1689 74 31 803 2209 2176 1670 708 -2583 1883 1201 -498 -2471 -2179 -1182 -1608 -1447 -84
1002 -199 -1068 -1096 -681 -509 -1656 -5051 123 -671 -2129 -3662 -2877 -883 342 -2275 -829 -2839 -4262 -1848
983 -3741 -3544 139 -674 -3079 -1318 -3965 -5456 -3274 -1426 123 -2948 -1098 -281 2533 1057 -4982
966 -2709 -2153 -1366 -3116 -2577 650 -2733 -1035 560 -369 -1767 -2930 -3951 -1790 -870 -560 -4407 -7407
949 -7407 -1144 -365 -106 -275 -522 -653 -2665 -4172 -3242 -3905 -1794 -3444 -1432 3612 3214 -36 -4687 -4134
931 -4134 -3452 -2897 -1471 -1983 262 348 294 -1575 -334 421 -941 -373 506 -141 -2863 -2535 -3322 -2779 -1222
911 781 -916 -35 -5081 1218 127 -2569 -911 -1616 -1260 -3252 -4399 -2222 -2327 -3297 -3827 -3853 -4111 -4927 -5853
892 -5853 -3999 -1894 -247 226 -2215 -40 -994 -1950 602 -213 -4085 -227 -76 356 -815 -639 524 -1034 -2016
873 -2016 -1523 -505 -1737 -3578 -5862 -3577 -2912 -493 -1635 -3228 -2708 -1416 -4023 -3748 -3363 -3985 -4147
856 -4147 -5546 -4217 -3159 -2541 -2188 -1986 -1820 -1813 -2044 -2442 -3124 -4819 -5057 -5710 -4137 -2097 -3443 -720
837 1462 348 -1710 -1804 -1534 -1497 -3356 -553 154 138 2611 3817 4649 2431 1448 -358 -3524 209 4472 3660
818 3660 1041 -882 -1922 -414 1464 2544 3065 -15510 3956 4219 4125 -4478 -2443 900 -2436 -1817 -3283
801 -3283 -3424 -1277 753 2240 3582 4203 2058 -705 1045 324 -682 -1952 -2785 -192 2650 -1889 2318
783 5321 4264 2679 994 -693 -2021 -3204 -4168 -3205 -1938 1212 1432 -15 2243 540 -4497 -1783 -2807
766 -2807 101 -36 -804 -1439 -2312 -3576 -2728 -3788 -3093 -1454 -466 -3112 -1578 -3552 -4771 -2371 -3679
749 -3679 260 -3046 -2692 -5014 -3177 -1629 871 2322 4757 887 1337 3777 341 -1735 -1946 -1939 -2790 -4508
731 -4508 -4371 -2833 -4664 -2885 -1098 3026 -151 1285 5425 1042 -3539 -1471 -4438 911 1824 420
714 458 1888 4448 4561 -1548 1379 2410 -2975 -1132 734 -1176 -2889 -3925 -1271 57 908 -133 -2018
697 -2018 -3229 -3929 -4348 -3846 -3674 -4254 -4518 -3120 -3829 -5217 -668 -1586 -1897 -1296 -2290 -798 -2700 -4094
679 -4094 -3705 -2194 -3599 -3583 -4019 669 67 -2660 505 -1712 -2322 -24 1737 -556 -1274 -344 818 -2362 1424
659 1676 1744 -3129 -2648 788 1589 -573 -2934 -4525 -3492 -2343 -1792 -1573 -1373 -4278 -1654 -2321 -3367 -3629
641 -3629 -2736 -1921 -1715 -3435 -3889 -5470 -4632 -6267 -5553 -6490 -2945 -10741 -3569 -4797 -5356 -3732 -2132
624 -2132 -1510 -1848 -2945 -3230 -3167 -2743 -1964 -1245 -989 447 -3081 -66 713 -4244 -1722 -1622 -4266 -3036 -2258
605 -2258 528 101 -1547 -2331 -2939 -3674 -4770 -1371 -1398 -3326 -2752 -3037 -2580 -1901 -4401 -4910 77 490 782
586 782 1655 3492 5147 870 -2057 -3955 -1994 24 2038 2591 1315 542 -2224 -1007 1841 2961 480
568 -2054 -3455 -3015 -2324 -4730 -2663 -3039 -2945 -2125 -3083 -1753 -1223 -2978 -1756 -2520 -2935 -3271 -3785 -3375
550 -3375 -2469 -4529 1044 1551 -1148 -865 174 1158 -1381 -1800 -3135 -4249 -3386 -4296 -660 -941 1258 851
532 851 -4661 -1934 -2955 -3023 -2736 -2356 -1735 -630 -747 -731 -4641 -5508 -2765 728 422 -1822 -1294 958 2532
513 2532 585 798 182 -1656 1073 73 -2795 2094 4979 2939 -197 -3068 -2881 -2159 -1582 1641 -109 411
494 -1283 827 552 -1198 -2808 -2907 -3159 -2832 -2291 -2243 -2830 -4211 -6208 -3756 -553 1630 2701 -1948 -3962
476 -3962 -730 -3490 -1993 -365 -1837 -6366 742 2166 4454 -2644 -1012 33 -1809 -4012 -2910 -2919 -4697
459 -4697 -4241 -2588 -8033 -2187 -1940 -497 -3059 -4684 -3336 -1562 -888 100 1102 -4151 -1468 330 -2509
441 -1603 -2081 1008 -2067 -5201 1303 4588 2774 2132 3742 5784 7034 4991 4978 2939 -3157 -3859
425 -3859 1208 1173 750 863 1435 -3951 -2148 1479 52 -1993 -4069 -5350 -3633 -4836 -936 -1600 -1308 1851
406 1296 -2499 -832 -4563 -3975 -4809 -3251 -4024 -2514 -1377 -1021 -1315 -2143 -3542 -5234 -5284 -4068 -2811
389 -2811 -2059 -3448 -3268 -5756 -1587 -1511 -1511 -839 -39 -444 525 -106 -1065 -5697 -226 -475 -410 -1379 -2116 -1895
369 -1895 -1538 -2263 -2996 -3594 -4215 -4925 -5166 -4129 -1454 128 -4758 -1062 4385 3555 -4326 -3481 2345 -2745
350 -933 -2997 -2267 -1345 -931 -1221 -1712 -3378 -1613 -3073 -2051 3780 2933 -1591 -1219 -1381 -463 1131 2119
332 2119 2294 1749 689 -805 -2335 -3885 -4575 -3643 -2844 -2900 -3491 -4227 -3537 -3900 -377 424 450 -462 -2807 342
311 5946 10748 14889 17525 18043 15987 11964 6835 3321 3305 4230 4848 2204 3905 2402 3746 1079
294 3767 1707 1876 2005 -858 -2315 -2129 -3250 -3396 -1059 -2554 -2512 307 -2200 657 -1096 -2805 -5201
277 -5201 -1545 -2762 -406 -2663 -3764 603 1621 3029 -1591 -4520 -1135 1071 1061 -117 917 826 735 519
259 519 -137 -1261 -2624 -3455 -4148 -2595 -3295 -56 937 2003 -1994 -3014 -176 1467 -381 -2148 -4499 -2010
240 -1382 -4593 -682 -2206 -2450 31 -869 -2859 -4322 -2949 -1352 -1949 -3578 -168 -3501 -1443 -2686 -3272
223 -3272 -3521 -2231 -350 -332 -2882 1191 -1982 -2391 -2736 -1287 376 1224 -350 -1366 -3408 -2351 -4035
206 -4035 -5641 -4742 -3908 -3529 -3750 -4122 -4394 -4380 -4032 -3653 -3328 -2978 -2811 -2558 -3504 2227 998 -1304 1566
186 1140 -574 -1975 -2376 -1627 -3191 -26 2832 3826 4141 3051 1960 1115 -1204 -4054 -4678 -2212 -622 -472
168 -472 -2136 -5168 -3992 -1045 1069 -1153 -4331 252 -1667 -2740 -2233 1925 1364 -3706 5905 3006
152 3006 -2061 -176 5074 6905 2197 -795 -2076 -4030 -3329 -3789 -1897 570 463 -2292 -4740 -4349 -211
134 -2093 -1411 -1880 -4314 -5755 -4505 -3929 -3731 -3317 -3142 -1639 -3152 -2053 2117 1920 -3372 -3917 -2794
117 -2794 85 1873 1466 2827 -688 422 -1559 -2876 -2856 -4028 -3690 -2990 -1412 -2354 -4263 -5125 -2737 -1965
99 -1965 -3006 -1484 -1938 -1905 -2785 -362 -4451 -5115 -3358 -6958 -6073 -1501 -1820 -3456 -3857 -2892 -2084 -1762
81 -1762 -1965 -2240 -2514 -2934 -3011 -1993 -310 -2588 -2783 -2991 1835 701 -737 -5113 -2765 -3372 -3378 -2560 -1699 -1498
61 -1498 -2171 -3713 -4874 -2891 -1034 7 -2486 -1962 -3961 -4903 -2114 -27 -1929 -944 -1289 74 -1838 -920 -623
42 -623 -1563 -3458 -5232 -3548 -2103 -2015 -2743 -1415 -3922 -4120 -2954 -369 1902 1046 -837 -562 401 -3193
23 -1586 5363 2391 -700 -1449 -55 -1039 -5775 -4137 176 156 -1436 -3408 2062 3092 1953 641 -532 -1333
5 -1333 -1567 -1562 -2788 -1683 -1845
0 -1845
##PAGE= F1=1019.876247032
##FIRST=     2915.55639409065, 2671.18566176471, -4128
##DATA TABLE= (F2++(Y..Y)), PROFILE
1023 -4128 -3003 -2238 -2331 -3034 -2763 -594 1726 3648 4482 -440 -956 2637 1757 780 -1807 -3408 -975 -82
1004 -537 -21 2287 1885 863 -731 -3196 -5395 -5599 -793 179 321 -358 -1889 -2291 -2924 -3007 -2335 -1050 413
984 -899 -5324 -3064 -1112 -2075 -2426 736 255 1050 1548 1569 -997 -2890 -810 578 2189 168 -6147 -3107
966 -3107 -2578 -145 -1893 -1429 -161 -3180 -2636 -2871 -2549 -2497 -3002 -4271 -4543 -5190 -5242 -4796 -5790 -3332 -1919
947 -1919 -697 -102 -96 -633 -2282 -4320 -1528 -4350 -555 -585 458 3300 2479 -1289 -3711 -4767 -3515 -2147
929 -2147 -3762 -5355 -5553 -4721 -3652 -2763 -1983 -1804 -2271 -3379 -3489 -2073 -3780 -127 2963 3330 2092
912 2092 6939 -294 -529 -3713 -32 -82 -3452 -4525 -2476 374 -1831 -3578 -659 -1269 -3028 -4061 -4140 -4062
894 -4062 -3713 -2521 -486 1831 612 -1962 719 4927 2777 -1504 -2367 -1230 -2764 -510 -721 2263 5353
877 5353 3736 2424 -2110 77 -3302 -1465 67 -89 -1628 -3099 -1580 510 -1388 -4538 -2190 -1427 -1039
860 -1039 -2389 -2491 -2549 -2803 -2783 -2469 -2567 -3292 -4488 -5513 -4864 -3857 -3485 -3731 -4264 -4141 -3755 -3917 -4506 -4516
840 -4516 -3464 -2238 -1508 -1592 -2437 -3654 -3482 -2317 -3386 -866 -894 -1131 -1376 -1348 -1311 -1904 -2744 -2300 -3154 -931
819 3206 3931 -9 608 4936 5700 5804 5153 1415 -19429 6263 6875 4434 -3525 -3656 -126 -4348 -3256 -3285
801 -3285 -991 -456 -69 751 1736 2303 2334 556 401 -1525 -3644 -4436 -3120 -1725 -1068 -1335 -2214 -3678 -5276
782 -5276 -5490 -4265 -3776 -3311 -2206 -736 855 -957 1716 1257 1113 1255 -76 -4594 -1768 -2589 782 1169 -327
762 -1021 -2164 -4372 -2211 -2771 -4053 -3138 -2099 -2255 -2406 -3590 -4685 -4886 -4350 -4208 -3747 -2406 -601
744 -3615 170 1890 1881 3876 532 861 270 -1817 -645 -138 -71 -504 -1176 -1953 -3138 -4535 -2848 -2448 -633
724 -1640 -980 -1084 -1089 -2134 -3154 -3424 -1140 951 -241 1067 2303 7414 7523 -1715 1306 1515 -3789 -1539
705 1713 -2366 -2780 -4003 -1960 -697 -2237 -3451 -4579 -4630 -3767 -2493 -5066 -1306 -714 -952 -2022 -2220
688 -2220 -4371 -855 -2481 -1081 -533 -1904 513 -916 -2192 -2181 -216 -1455 -1264 -2958 789 -963 -1884 421
669 -1553 -2066 39 -175 -2289 -3823 -5274 -5270 -2727 -290 1627 1469 -3022 -2260 -84 -1958 -4388 -6043 -4633
651 -4633 -3689 -3690 -3534 -1940 -1583 -1722 3307 3242 1609 -1187 -2304 -586 -471 -2681 -4139 -3004 -575 -4680
633 -4680 -4966 -6281 -440 -4503 -1929 -4847 -4682 -2136 227 -901 -510 -2874 -832 -2014 -3902 -6147 -3776
616 -3776 -1771 1059 -2457 409 2695 -2783 -3238 -3203 -4526 -3999 -3244 533 2624 -1258 -1472 -1741 -2868
599 -2868 -4643 1135 1277 -3994 290 1126 1685 -1986 -5081 -5106 -3962 -759 15 110 2886 4223 1711 343
580 -2388 -487 3497 4670 1762 -306 178 -1561 -505 2643 2294 939 -3547 969 1626 -93 -4927 -74 799
561 -943 -4139 -4785 -3911 -1982 -5299 -694 -1121 -1813 -2352 -2372 -1780 -2894 -6303 -1299 -2210 -3002 -1789 -790
542 893 -1717 3801 2028 -2372 -831 -3401 -1281 -2046 -475 137 -4395 727 983 -1428 848 673 577 511
524 511 -4339 -1760 -3868 -3555 -4449 -306 -581 -1500 -2050 -1938 -1807 -1818 -2363 -2863 -2278 -1481 -841 -2976 -859
504 -915 -749 -514 -768 -1891 -4009 -5415 -3857 -2358 -1445 -1223 -1031 -1037 -868 -1953 -2798 -1258 -2139 -3033 -3381
485 -3381 -2664 -1088 125 -3864 1767 3305 1720 -998 -5884 -2572 -2942 -1479 -2235 -2224 -5973 -56 -1002 2310
466 -3893 -843 -1813 -4396 -4701 -4347 -2985 -2694 1211 1643 -5980 -989 -1864 -494 -3987 -5489 -4699 -1162 -462
447 -1438 -2381 -4456 -3942 -4631 -4845 -3391 -2084 -435 -977 -3721 -852 540 46 806 2877 4860 6271 3863
429 3863 5915 3046 284 -280 1565 1177 -476 -2206 -3351 -3930 -2563 -734 -708 -1505 -2687 -4062 -5295
412 -5295 -4929 -3708 -2466 -1626 -733 -79 -1967 -2986 -5311 -2765 -2867 -963 -2484 -2762 -1626 31 -753 -2195
394 -2195 -1114 -3853 -1040 -982 -2118 -4715 -4895 -3998 -4549 -2301 -2374 -2677 -2673 -2960 -3376 -3876 -3995 -3955 -4349 -1679
373 -816 -846 -1763 -2008 -1523 -1364 -732 446 172 -975 -2533 -4477 -5052 -1609 -1037 -5036 -4638 132 606 -5022
353 -5210 1103 -1616 -4384 -4534 -3300 -2649 -2992 -4075 -5486 -3779 -1988 -2729 -2378 1150 1484 -2421 -1090
335 1450 772 -37 -987 -1525 -1383 -790 -216 349 566 240 -571 -1703 -2965 -3254 -2507 -4080 -4729 -1368 -1899
316 -1899 -1636 -622 -2370 490 3726 6097 14389 17084 17896 16229 3080 1892 2885 -721 -2948 -2555 -159
298 2402 3867 4025 -979 -22 -2582 -2857 -2017 -1599 -3574 -2710 -4378 -4388 2195 -774 -3487 -368 -1123 2739
279 141 1120 -142 89 -3328 -1711 -2708 -2111 483 572 2097 -3747 -2546 -2899 -4469 -4788 -4299 -3663 -2834 -1749
260 -1749 -792 -551 -1200 -2584 -4152 -5294 -5423 -5120 -4443 -3068 -1562 -3201 -2938 -1203 -533 -660 -238 -3177
242 -3177 -1863 -2977 -4938 -2119 -4229 -2191 -1301 -3263 -1494 1421 -2488 -1726 -2399 -2749 911 -2130
225 1048 -1058 -3002 -2978 408 2786 -1098 -2362 1340 -2194 -2434 -950 1400 2651 1520 -1829 -1258 -5768
208 -5768 -2737 -1793 -2367 -2679 -3369 -4494 -5670 -5195 -4675 -4397 -3857 -3145 -2721 -2857 -3727 -3928 -3909 1563 2056
189 2056 -2742 -1282 1112 2817 1420 372 -1129 -4420 -2299 -2163 -1948 -2044 -2418 -3220 -3817 -4280 -4072 -3482
171 -3482 -2985 -2783 -2963 -3513 -3649 -2818 -1929 -1322 -1492 -4174 -2556 -1923 -4437 -1662 -279 1353 -2279 478
152 -577 -1809 -16 1831 2939 2486 -1047 -1519 -4066 -4088 -4892 -3662 -23 -375 -3586 -4454 -2307 -629 -3092
134 -3092 -1529 -3913 -3334 -1335 -19 521 -279 -886 -3494 -847 -3948 -476 5579 2742 -2448 -3521 -3222
117 -3222 -1801 -1904 -685 90 -163 -1320 -3001 -3536 -2722 -3524 -4314 -3174 -3084 -617 155 975 -264 -1995 -2345
98 -2345 -1049 -2317 -4482 -1239 -246 -6601 -10636 -9822 -7770 -2872 -567 3235 1953 -91 -2691 -5355 -3589
81 -3589 -2092 -1221 -2027 -1750 -3208 -4731 -4472 -2749 -1257 -2090 1064 1464 1576 -1976 -3027 1532 1440 -2247
62 244 -844 -1574 -1530 -1186 -862 -1359 -2527 -4337 -3567 -1647 -3607 837 1648 -305 431 -107 -1557 -2209 248
42 -1701 -4004 -6031 -4818 -1428 -1992 -3649 -3994 -1527 -3320 -2078 -1388 288 -466 -2577 -3549 -1556 294
24 -2506 -3453 283 -1233 -1707 352 599 -1239 -5484 -4185 1121 1901 -285 -1662 4375 7921 3305 556
6 1252 10 -1869 -3523 -4623 -4711 -4065
0 -4065
##PAGE= F1=1017.265117353
##FIRST=     2915.55639409065, 2671.18566176471, -1422
##DATA TABLE= (F2++(Y..Y)), PROFILE
1023 -1422 1669 -136 -2549 1689 -2015 -6181 -4673 -1312 969 -1475 -156 897 -910 -3030 -5099 -5867
1007 -5867 -4477 -3020 -1696 -626 315 978 1298 1269 -843 -1179 -6093 -4573 -4425 -2947 -2637 -3392 169 -279
988 -451 1387 2923 4041 -895 -5400 -2042 -1523 -3056 -2048 628 885 908 1560 -72 -2214 -1890 52 1317
970 1317 -272 -1055 -5530 -3148 -2539 -4 -1058 -2205 -3490 -4953 -5658 -3664 -1773 -485 -2088 -4598 -3166
953 -3166 2839 3351 -4641 -5645 -4125 372 -516 -1024 -784 -61 -2150 -3382 -238 -4429 593 1424 1832 2819
935 2819 1389 -1309 -3082 -5085 -2392 -1499 -2750 -5311 -5374 -4648 -2535 -1242 -1795 -1603 -3569 -6618 -4058
918 -4058 -1208 -4580 -856 3352 2437 -199 1969 864 -1571 -2900 -2281 -1200 -4803 -3703 -2817 -1543 -1207
901 -1207 -2690 -1216 -1375 -2092 -3573 -5416 -4260 -1919 269 2016 3120 3223 3348 3433 2628 910 -261 -805
883 -805 -2312 -1326 -909 -1363 2138 5511 4792 3256 -2782 -676 -2640 -3001 -790 -856 -1536 -2474 -2112 -27 -1100
864 -1100 -2534 -573 -886 2100 -1810 -890 -2025 -3320 -3516 -3297 -3456 -4286 -5311 -4625 -3057 -1952 -3963
847 -3963 -2386 -3525 -4047 -3728 -3605 -3926 -4124 -3564 -2268 -835 -1527 -1818 -1202 299 -2092 -3368 -263 145
828 -1399 -978 1681 1370 289 -808 -592 -3107 -3106 4929 6889 -996 -193 6286 3854 5203 1464 -3589 -24330
810 -24330 -283 706 321 -1646 -4367 -1143 -4315 -3489 -4900 -2345 1886 313 -1635 -3374 -4864 -5768
794 -5768 -6405 -6265 -5633 -5014 -4497 -4133 -3825 -3561 -3522 -3565 -3742 -3500 -2572 -1330 -376 497 1273 1406 2004 -732
773 1479 264 -1154 -2314 -2646 -4752 -1950 -2403 612 752 9 -436 -1959 -5132 -3580 -3138 -1875 -461 457
754 -1118 662 24 -675 -1235 -2858 -1314 -2988 -493 246 -2981 1601 2542 1076 2387 -154 -1309 -3253
737 -3253 -3925 -1047 1195 1301 1937 1191 -4476 -2051 -4528 -3650 -3972 -1562 -2691 425 408 -326 -972 -4352
719 -4352 58 -401 -2012 -760 1437 2098 5593 4999 -1686 380 -531 -4753 -1470 690 -3698 -2564 -4571
702 -4571 -1994 -438 -1203 -1430 -4051 -3765 -5901 -4797 -5716 -2992 -1415 -1962 -3563 -2540 -4121 -1691 -3763
685 -3763 -1318 -2087 -2877 -3114 -2967 -1899 17 2188 1091 1008 -1262 365 -2367 -904 449 -1418 -3506 -5020
667 -5020 -4391 -3417 -3127 -3406 -2972 -1341 577 1844 503 -2447 -862 -1903 -4668 -3803 -2818 -1598 -1787 -2638
649 -2638 -3830 -5192 -5059 -3402 -1764 -583 -267 -764 -1463 -400 178 -1349 -4459 -3781 -1224 -2900 -1983
632 -1983 -4870 250 -1698 -3106 -2548 -408 -1713 -805 -933 54 -3410 2530 1004 -2682 -734 -1542 -2369 -3208
614 -3208 -3993 -4424 -4744 -4409 -3565 -4178 -4478 -4743 -3433 -611 -1035 -1776 -2535 -2904 -1946 -2987 -64 416 -3674
594 1970 3157 2903 -1556 -4576 -2464 736 823 -22 -1419 665 88 -227 -184 -989 324 -38 -1007 -2235 -2691 -1788
574 -1788 198 582 3629 4248 -90 -4234 1396 461 488 -2688 -1751 1231 -281 -3749 -3973 745 1744 -3584
555 -1231 421 -1067 -2214 -2152 -2964 -2922 -5535 -3866 -4252 -4075 -1732 -770 31 -1910 4404 2305 -54 -705 -2662
536 -2662 -818 -3679 -1310 -2268 -3680 -802 903 -1343 2484 2213 1297 -54 -5244 -562 -1765 -1110 -4603 -1797
517 -3648 -5669 -4974 -3861 -3287 -2874 -3023 -4040 -5036 -5868 -4625 -3352 -1788 605 3408 434 958 3953
500 3953 -2691 2692 426 753 2966 1626 5124 3874 2054 -97 -2030 843 -2463 -5497 -4078 -1658
483 205 619 -5766 285 -550 -2426 -4319 -6719 -4694 -3633 -3240 -4001 -5558 -5459 -3669 -4384 -1646 -4217
466 -4217 -2787 -3645 -4937 -4670 -1777 -861 -3749 72 -682 -2903 0 -1738 124 -4468 -4731 -5199 -93 3243 2473
447 2473 4837 -4068 -100 34 -3320 -4390 -4902 -3186 -1443 -2960 -546 -26 -956 -2335 -3408 -3338 -2008 -848
428 145 -1512 909 920 622 66 -498 -1066 -2100 -3890 -5408 -4702 -3096 -1754 -761 -302 -357 -3307 -2264 -3885
409 -3885 -4482 -3019 -1572 -1247 -4180 -4184 -941 45 1125 317 -1848 -3648 -593 -1611 -3396 -994 -1917 -2917
391 -2917 -1805 -224 -884 -2614 -3924 -4713 -5053 -4710 -4324 -3700 -3273 -2854 -2751 -2913 -3666 -4284 -3417 -1553 -1765
372 -1765 -2805 -2471 -1340 -932 -936 -1440 -2170 -3194 -3247 -2549 -5166 -1382 -1845 -4236 -4895 -4628 -3362 -3478 -5234
353 -5234 -4225 -1823 58 -2675 -725 -2380 -5132 -3562 -549 -2532 59 -2164 -2853 -1784 -3782 -2272 -445
335 3963 3616 -1289 -1308 -1318 3780 4717 3920 3359 2757 -291 1401 627 -602 -1998 -3589 -4987 -6214 -4896
317 -4896 -3624 -2294 -1651 -2316 -3049 -2545 1394 5866 9665 11857 11587 -2081 2988 -125 -1895 1084 4607
300 4607 4265 3746 4025 3078 -3123 395 1334 1360 -869 -3987 -4099 -2489 -4798 -2614 4629 607 -3753 -1019
281 -708 3632 2371 4126 3979 2123 -2418 -2809 -1999 -1169 -2242 -2520 -1893 -5400 -738 -1055 -1957 -3091 -4631
263 -4631 -5912 -5211 -4085 -2915 -1907 -1035 -341 -2758 -3963 -2496 -2730 -2094 -3458 -4448 -4427 -4375 -5058 -5655
245 -5655 -3494 -498 -1834 -409 -3094 -4538 -1526 -2530 -2072 -3242 -4640 -2643 -742 -2037 -2177 -2727 -2472
228 -2472 1127 -177 2515 1703 -2911 -3858 328 2284 -2459 -1906 1588 -2090 -2595 -494 435 716 740 -3765
209 -1720 -3387 -3062 -435 -870 -2098 -3038 -4675 -4894 -5266 -5161 -4500 -2989 -1093 560 -1784 -2094 26 -4058
190 -91 2255 -2658 -4753 2767 1226 -1633 -3227 -1516 -5448 1784 5767 6849 6879 3230 -544 3892
173 2621 1125 -521 -1702 -1868 -1374 -883 -282 781 1848 269 -1876 -3803 -1802 -874 -3941 -4309 -5825
156 -5825 -5785 -4580 -3891 -3672 -3337 -2151 -262 1193 1340 -1390 -937 -2474 -3108 -2557 -5193 -469 -677 -3954
138 -3954 -4147 -781 336 -4017 -1315 -2469 -4570 -4627 -3195 -2007 -1818 -2703 -3445 -2097 -4541 -98 2734 2204
120 2204 -1915 -2224 -2325 -2586 265 -456 601 2 -3076 -1313 1102 -1783 -3620 -2845 -2857 -4070 -1367 -2044
102 -2044 -2350 -2206 -2410 -2025 -1804 -3343 -3803 1114 1254 -5992 -9392 -7166 -6571 -929 -740 3227 2621 1819
84 1819 -379 -3257 -4001 -1729 625 -2026 -1035 190 813 -187 -418 -17 -1459 1220 2511 1732 436 -5390
65 -1416 -2600 -3607 -3537 -2625 -1857 -1699 -2214 -2653 -3022 -3032 -3330 -3678 -3874 -3903 -3762 -3336 -2893 -2619 -2994 -3800 -4856
44 -4856 -4969 -2845 -4329 -5537 -4183 -700 1297 -3440 -2488 -1500 -2780 -321 -494 419 -2201 -4714 -4095
27 -4095 -2464 -1701 -1896 -4972 -5262 -4011 -934 2109 -1261 -2101 -5685 -4203 1707 3197 884 -165 5115
9 5863 2262 -1963 568 614 324 326 -439 -291 -2240
0 -2240
##PAGE= F1=1014.653987673
##FIRST=     2915.55639409065, 2671.18566176471, -1051
##DATA TABLE= (F2++(Y..Y)), PROFILE
1023 -1051 1765 264 -3164 1567 -1397 -3235 -2685 -467 736 -955 108 -423 -1316 -1992 -2512 -3610 -3455 -4009
1005 -4009 -3655 -2697 -1720 -989 -521 -299 -2026 -2340 -5013 -2714 -409 -1157 -5936 -5062 -90 -1897 850 1566
987 1566 2527 2634 -66 -2512 -780 -1760 -3602 -2185 -227 558 222 1213 -1770 -1843 -280 -874 -2945 -3065 -2083
968 -2083 -4278 -3360 -2221 -2069 -2632 -1875 -2717 -1947 1146 -290 -2206 -2129 -3039 -4654 -6369 2979 4557 -5930
949 -6560 -3768 2420 2746 2847 2463 1335 -2737 -3105 -1023 -4798 -7 433 1005 1191 677 -976 -2934 -4835
931 -4835 -2299 -286 -2104 -3786 -359 -1602 -1830 -1048 -2740 -872 -1542 86 -1417 -3329 -4856 -3156 -1587
914 -1587 -874 -2400 -1634 -2111 -2875 -2689 -4135 -2624 -4359 -239 -704 -1385 -2635 -3727 -3421 -2103 -993 -458
895 -488 -983 -1636 -2126 -2159 -1796 -1295 -674 -121 112 -1196 160 -201 -3005 -1015 -1314 -2131 1160 1590 1451
876 1451 877 -1828 -1259 -1596 -4509 -1118 -1218 -1775 -2672 -3597 -3933 -2701 -1225 68 82 943 -1889 -58 -1049
857 -1049 -1996 -2196 -1842 -1718 -2295 -3473 -4028 -2485 -2284 -3801 -887 -1835 -4262 -3099 -1203 432 -1227 -2601
839 -2601 -2288 -2011 -3061 -1938 -898 320 -1623 -2837 349 810 -2272 -1373 1432 2065 5487 5376 3693
822 3693 -3191 -5364 1146 986 -569 -993 -560 -2012 -3056 -1873 274 -10863 -3189 3539 -1857 -259
805 -3540 1490 -1339 -1340 -3652 -2984 -3251 -1855 -1119 -1170 -2139 -3429 -4540 -4522 -4563 -3822 -3721 -3815 -3894 -3523 -2721
785 -2721 -1682 -1065 -1042 -1454 -1520 -766 735 -259 1182 4214 -1224 1805 1043 2165 -732 -2677 -4638 -2317
766 -2458 -290 97 1617 388 -2229 -5058 -3838 -767 1904 5153 6457 137 2245 3957 707 -446 -2202
749 -2202 -1725 -3080 -3299 -3288 -3407 -3602 -3342 -2474 -1778 -1750 -2372 -2779 -3120 -110 373 -1571 -2377 -2357 -1184 -733
729 -733 -4494 -4625 -2969 -1750 -2916 2916 2200 -860 -197 -4932 3194 3047 -3331 -930 1271 1039 777
712 777 -430 -2152 -2741 -4189 -5860 -4527 -1818 -4320 -2444 -4808 -1238 -1284 -1721 -2687 -4641 -2323 -2402
695 -2402 -3635 -4428 -4706 332 1328 -1751 794 -4616 -3004 -4596 37 -661 -1924 -1367 -1554 -1512 -1282 -1040 -616
676 -616 -238 -211 -462 -3994 -29 -573 -1008 -478 419 2412 3211 1693 2849 2725 378 -1595 -447 -1240 -1743
657 -1743 768 -4696 -2199 -2435 -3005 -963 562 -477 -1931 -3670 -5483 -5670 -3987 -2525 -2385 -1736 -1830 -1520
639 -1520 -240 -46 -4022 -4123 -2055 -1590 -186 -4061 -2449 -4147 -4304 -2805 -910 745 -427 -742 602 -4397
620 827 -1591 -654 1302 -2670 -1582 -3055 -3468 -2752 -2169 -1864 -1865 -4962 -3687 -4059 -3640 -367 1972 -442
601 -2839 -2610 -1941 -1372 -2062 -1237 -2717 1440 979 365 -1077 -3573 -1159 -109 444 -173 -2099 -1602 -2584
583 -2584 -2794 -2775 -3165 -4482 -5867 -3765 -1214 -769 1276 1970 1277 2650 2878 -2252 -2624 220 -1525 -710
564 -778 -3722 739 728 -1895 -3181 2080 1753 -1437 -1881 -453 -1809 -3566 -5903 -6274 -4726 -4448 -3941 -5038
546 -5038 -6496 -5950 -4006 -2359 -2392 -569 -661 -1506 -2905 -4400 -5446 -5991 -5599 -3775 -3035 -124 732 -1615
527 -380 -1327 -1900 -2067 -1868 1322 5 410 -2972 -700 -411 -1373 -4248 -4355 -2271 -250 -2493 -5051 -939 -1433
508 -1433 -2492 -4032 -655 1929 4005 534 846 3599 -2827 824 -2415 -2454 95 2386 4105 4334 3846 1620
489 -1763 521 -218 1640 -327 -2308 -4096 -5399 -6095 -5932 -5935 -5891 -5508 -6915 -4627 -4176 -3726 -3656 -3727 -3600 -3613
469 -3613 -7560 -3065 -3481 -573 -5120 -1666 -3445 -1912 -673 -4720 -1619 -1186 -529 -176 -1789 -16 -5243
452 -5243 -3959 -4026 -1827 -758 383 2025 -3716 648 1590 -4022 -2709 -5589 -3566 -2337 -3366 1068 2902
435 2902 788 2806 -1075 519 509 776 1200 -3859 1457 1658 1873 2025 2211 2406 -2908 -1424 22 -509 -379
416 -379 -1155 -1765 -2348 -2824 -2942 -3174 -3248 -3411 -3322 -2543 -1228 -4547 -2802 480 2028 1351 358 -2071 -3425
397 -3425 -2043 -3230 -4049 -1514 -1116 -4319 -2658 556 1932 -304 -2100 -1192 5684 295 -1392 2187 -56
379 941 -578 -2208 -3659 -3932 -3332 -2931 -3473 -4756 -3820 -1890 -1005 -2057 -3640 -4623 -3421 -1963 -1305 -3366
361 -3366 -2904 -3611 -3188 -1338 -4947 -4364 -553 -4498 2478 3062 1189 -1821 -838 -1184 -3060 -3504 -1917
344 -1917 -1485 561 -1897 -3764 -1842 -2663 -5635 -3502 -375 1876 -2202 -1526 -1837 692 3257 3447 3544 3332
326 3332 -1652 3005 1172 81 -4880 676 -3667 249 2671 2968 4088 3185 -2620 -842 4288 -2235 9893
308 11101 11284 10066 1846 5535 3763 3935 821 3320 2492 1079 -979 -3123 -5330 -4060 -2197 -661
291 61 -1206 -4172 -2112 -3781 -1261 2553 1208 -3993 -1805 -1245 3078 3926 3687 2393 234 -2340 -4645
274 -4645 -3685 -2194 -754 -57 1004 -4847 2063 1845 -4018 -1307 -2662 -2824 -2341 -1592 -668 -2349 594 163
255 -2623 -3980 -2735 -2817 -2452 -3029 -4056 -2950 -2104 -4068 -2344 -4210 -4617 -2234 -88 -1753 -3682 735
237 75 -2186 -2298 -3445 -3762 -2721 -2003 -2570 -2843 -2958 1160 1415 3676 1045 -3558 -4647 377 1348 -4154
218 -2825 -4582 -4966 -4241 -4083 -4478 -5231 -2945 -2431 -2299 -1143 -1029 1001 1384 -881 -2777 -4300 -1230 -3027
200 -3027 -3414 -724 -2205 -4202 -3389 -1097 -1883 509 -3680 -1227 -530 -1337 -4909 2694 1462 -3976 -2953
183 -2953 -1707 -5611 1666 4024 6874 5622 2051 -2287 2677 2260 2992 2546 3287 1226 81 115 1001
166 1001 2460 3269 -833 -3233 -4050 -3674 -264 -2138 -1047 -3564 207 59 1643 -357 -2700 -442 3614 2900
148 2900 1347 -1705 -2165 -3476 -3948 -3970 -4154 -4711 -4063 -3005 -3500 -2302 -3092 -4576 -2870 -1334 -36 637
129 477 -833 -2440 -2772 -3176 -3578 -4646 -2249 -4700 -1909 -1598 -982 -1202 -4025 -1351 -1179 -1905 -779 -4292
111 -4292 -1548 -5 -2190 -3918 -4073 -3869 -4100 -3938 -4255 -4131 -3414 -2749 -2642 -2833 -4375 -1654 2572 3365 -4440
91 -8206 -3686 -4801 -770 -1614 -1252 -2144 -3325 -3894 -3504 -534 264 1919 -1104 -1075 -308 3073 1640 -1130
72 -1648 -1455 -1059 -783 -113 1203 -5142 2385 1277 -2340 -1372 -7 1365 1275 -593 -3264 -5204 -2924 -729
53 744 1461 -3210 -102 -2050 -4561 -5990 -3714 -4597 -1755 1602 -1953 -4836 -4371 -3764 -2282 -251 -4174
36 -4174 -3521 -2906 -2093 -3667 -4906 -4557 -2753 -832 -2110 -636 -1482 -3700 -6515 -6832 -3713 -1261 759 -2986
17 -3030 -6091 -3897 2023 3779 1597 420 2299 903 -615 -4271 -2557 -2266 -1219 84 1140 2869 -36
##PAGE= F1=1012.042857994
##FIRST=     2915.55639409065, 2671.18566176471, -606
##DATA TABLE= (F2++(Y..Y)), PROFILE
1023 -606 1656 549 -3566 1291 -1617 -739 1248 1168 834 484 -252 -1274 -2328 -1798 -210 -2484 -1740 342
1004 741 2787 2278 1017 631 -1347 -3219 -1927 -3457 -1699 3535 -3783 -3806 -4975 75 -1992 -1344 -1653
987 -1653 -1428 -1092 -602 166 838 -1793 -3341 -2224 -1495 -1902 -2880 -3249 -3546 -3888 -3740 -2873 -1452 -1390 -2051
968 -2051 -2775 -3579 -1410 -2627 -3432 -2432 -4491 -963 436 -420 -2402 -5201 -3602 -4131 -6105 -1616 2930
$$ [...]
0d80
##END NTUPLES=nD NMR SPECTRUM
##END=
