##TITLE=Analysis number 324841
Compound Code cc 06004
Project Code adrs
Chemist Name melford
##JCAMPDX= 6.0         $$ Bruker NMR JCAMP-DX V2.0
##DATA TYPE= NMR SPECTRUM
##DATA CLASS= NTUPLES
##ORIGIN= Bruker BioSpin GmbH
##OWNER= nmr
$$ XWIN-NMR		Version 3.5
$$ Mon Dec  4 09:58:57 2006 GMT Standard Time (UT+0h)  MAYBRIDGE\nmr@NMR_250MHZ
##.OBSERVE FREQUENCY= 250.131544655141
##.OBSERVE NUCLEUS= ^1H
##.ACQUISITION MODE= SIMULTANEOUS (DQD)
##.ACQUISITION SCHEME= undefined
##.AVERAGES= 16
##.DIGITISER RES= 18
##SPECTROMETER/DATA SYSTEM= dpx250
##.PULSE SEQUENCE= zg30
##.SOLVENT NAME= CDCl3
##.SHIFT REFERENCE= (INTERNAL, CDCl3, 0, 16.522)
##AUDIT TRAIL= $$ (NUMBER, WHEN, WHO, WHERE, WHAT)
$$ ##TITLE= Audit trail, XWIN-NMR		Version 3.5
$$ ##JCAMPDX= 5.01
$$ ##ORIGIN= Bruker BioSpin GmbH
$$ ##OWNER= nmr
$$ C:\u/data/dgb/nmr/ADRS/90/pdata/1/auditp.txt
$$ ##AUDIT TRAIL=  $$ (NUMBER, WHEN, WHO, WHERE, WHAT)
(   1,<2006-12-04 09:58:35.89 +000>,<MAYBRIDGE\nmr>,<NMR_250MHZ>,
      <created by zg, POWCHK disabled, PULCHK disabled
       configuration hash MD5:
       49 4B E0 1D 92 C2 6B 37 9F E6 65 BC 52 41 86 1D
       data hash MD5: 64K
       1E EC 84 B6 BD C2 18 85 D0 EC 5D 0F E8 69 6A D2>)
(   2,<2006-12-04 09:58:48.63 +000>,<MAYBRIDGE\nmr>,<NMR_250MHZ>,
      <Start of raw data processing
       ef LB = 0.3 FT_mod = 6 PKNL = 1 SI = 32K 
       data hash MD5: 32K
       45 A2 5D 98 0C 5D 7B 97 4D DB 27 88 D9 64 3E A5>)
(   3,<2006-12-04 09:58:50.30 +000>,<MAYBRIDGE\nmr>,<NMR_250MHZ>,
      <apk 
       data hash MD5: 32K
       DB 71 A7 39 A4 A3 90 5C 05 7A 5E 18 B5 9B 41 AE>)
(   4,<2006-12-04 09:58:51.04 +000>,<MAYBRIDGE\nmr>,<NMR_250MHZ>,
      <abs ABSG = 5 
       data hash MD5: 32K
       AE 83 F1 A1 0C 12 E4 89 F6 60 09 15 80 FC 46 06>)
$$ ##END=
$$ 
$$ hash MD5
$$ DA EA E0 9F CF 63 66 F9 63 03 9F 50 F4 2D 26 49
##$RELAX= 
##$RELAX= 
##$RELAX= 
##$RELAX= 
##$RELAX= 
##$RELAX= 
##$RELAX= 
$$ Bruker specific parameters
$$ --------------------------
##$DU= <C:\u>
##$EXPNO= 90
##$NAME= <ADRS>
##$PROCNO= 1
##$TYPE= <nmr>
##$USER= <dgb>
##$AMP= (0..31)
100 100 100 100 100 100 100 100 100 100 100 100 100 100 100 100 100 100 
100 100 100 100 100 100 100 100 100 100 100 100 100 100 
##$AQSEQ= 0
##$AQ_mod= 3
##$AUNM= <au_zg>
##$AUTOPOS= <4 >
##$BF1= 250.13
##$BF2= 250.13
##$BF3= 250.13
##$BF4= 250.13
##$BF5= 500.13
##$BF6= 500.13
##$BF7= 500.13
##$BF8= 500.13
##$BYTORDA= 1
##$CFDGTYP= 0
##$CFRGTYP= 5
##$CHEMSTR= <none>
##$CNST= (0..31)
1 1 145 1 1 1 1 1 1 1 1 1 1 1 1 1 1 1 1 1 1 1 1 1 1 1 1 1 1 1 1 1 
##$CPDPRG= <>
##$CPDPRG1= <>
##$CPDPRG2= <>
##$CPDPRG3= <>
##$CPDPRG4= <mlev>
##$CPDPRG5= <mlev>
##$CPDPRG6= <mlev>
##$CPDPRG7= <mlev>
##$CPDPRG8= <mlev>
##$CPDPRGB= <>
##$CPDPRGT= <>
##$D= (0..31)
0 1 0 0 0 0 0 0 0 0.06 0 0 0 0 0 0 0.0002 0 0 0 0 0 0 0 0 0 0 0 0 0 0 
0 
##$DATE= 1165226314
##$DBL= (0..7)
120 120 120 120 120 120 120 120 
##$DBP= (0..7)
150 150 150 150 150 150 150 150 
##$DBP07= 0
##$DBPNAM0= <>
##$DBPNAM1= <>
##$DBPNAM2= <>
##$DBPNAM3= <>
$$ [...]
##$SUBNAM7= <"">
##$SUBNAM8= <"">
##$SUBNAM9= <"">
##$SW= 20.6930455092707
##$SWIBOX= (0..15)
0 0 3 0 0 0 0 0 0 0 0 0 0 0 0 0 
##$SW_h= 5175.983436853
##$TD= 65536
##$TD0= 1
##$TE= 294.16
##$TE2= 300
##$TE3= 300
##$TEG= 300
##$TL= (0..7)
0 120 120 120 120 120 120 120 
##$TP= (0..7)
150 150 150 150 150 150 150 150 
##$TP07= 0
##$TPNAME0= <>
##$TPNAME1= <>
##$TPNAME2= <>
##$TPNAME3= <>
##$TPNAME4= <>
##$TPNAME5= <>
##$TPNAME6= <>
##$TPNAME7= <>
##$TPOAL= (0..7)
0.5 0.5 0.5 0.5 0.5 0.5 0.5 0.5 
##$TPOFFS= (0..7)
0 0 0 0 0 0 0 0 
##$TUNHIN= 0
##$TUNHOUT= 0
##$TUNXOUT= 0
##$USERA1= <user>
##$USERA2= <user>
##$USERA3= <user>
##$USERA4= <user>
##$USERA5= <user>
##$V9= 5
##$VALIST= <valist>
##$VCLIST= <CCCCCCCCCCCCCCC>
##$VD= 0
##$VDLIST= <DDDDDDDDDDDDDDD>
##$VPLIST= <PPPPPPPPPPPPPPP>
##$VTLIST= <TTTTTTTTTTTTTTT>
##$WBST= 1024
##$WBSW= 4
##$XGAIN= (0..3)
0 0 0 0 
##$XL= 0
##$YL= 0
##$YMAX_a= 254358
##$YMIN_a= -365741
##$ZGOPTNS= <>
##$ZL1= 120
##$ZL2= 120
##$ZL3= 120
##$ZL4= 120
##$ABSF1= 16.522
##$ABSF2= -4.171173
##$ABSG= 5
##$ABSL= 3
##$ALPHA= 0
##$AQORDER= 0
##$ASSFAC= 0
##$ASSFACI= 0
##$ASSFACX= 0
##$ASSWID= 0
##$AUNMP= <proc_1d>
##$AZFE= 0.1
##$AZFW= 0.1
##$BCFW= 0
##$BC_mod= 0
##$BYTORDP= 0
##$COROFFS= 0
##$CY= 12.5
##$DATMOD= 1
##$DC= 0
##$DFILT= <>
##$DTYPP= 0
##$F1P= 14.0000005364418
##$F2P= -0.99999901652339
##$FCOR= 0.5
##$FTSIZE= 32768
##$FT_mod= 6
##$GAMMA= 0
##$GB= 0
##$INTBC= 1
##$INTSCL= 1
##$ISEN= 128
##$LB= 0.3
##$LEV0= 0
##$LPBIN= 0
##$MAXI= 10000
##$MC2= 0
##$MEAN= 0
##$ME_mod= 0
##$MI= 0
##$NCOEF= 0
##$NC_proc= -4
##$NLEV= 6
##$NOISF1= 0
##$NOISF2= 0
##$NSP= 0
##$NTH_PI= 0
##$NZP= 0
##$OFFSET= 16.522
##$PC= 1
##$PHC0= 227.9117
##$PHC1= 9.84372
##$PH_mod= 1
##$PKNL= yes
##$PPARMOD= 0
##$PSCAL= 4
##$PSIGN= 0
##$REVERSE= no
##$SF= 250.13
##$SI= 32768
##$SIGF1= 0
##$SIGF2= 0
##$SINO= 400
##$SIOLD= 32768
##$SREGLST= <1H.CDCl3>
##$SSB= 0
##$STSI= 32768
##$STSR= 0
##$SW_p= 5175.98343685301
##$SYMM= 0
##$S_DEV= 0
##$TDeff= 65536
##$TDoff= 0
##$TI= <Analysis number 999999
Compound Code 99
Book Reference 9
Project Code 9>
##$TILT= no
##$TM1= 0
##$TM2= 0
##$TOPLEV= 0
##$USERP1= <user>
##$USERP2= <user>
##$USERP3= <user>
##$USERP4= <user>
##$USERP5= <user>
##$WDW= 1
##$XDIM= 32768
##$YMAX_p= 538687389
##$YMIN_p= -320829
$$ End of Bruker specific parameters
$$ ---------------------------------
##NTUPLES= NMR SPECTRUM
##VAR_NAME=  FREQUENCY,     SPECTRUM/REAL,   SPECTRUM/IMAG
##SYMBOL=    X,             R,               I
##VAR_TYPE=  INDEPENDENT,   DEPENDENT,       DEPENDENT
##VAR_FORM=  AFFN,          ASDF,            ASDF
##VAR_DIM=   32768,         32768,           32768
##UNITS=     HZ,            ARBITRARY UNITS, ARBITRARY UNITS
##FACTOR=    0.157963299565203, 1,           1
##FIRST=     4132.6476996994, 0,             0
##LAST=      -1043.33573715361, 0,           0
##MIN=       -1043.33573715361, -320829,     0
##MAX=       4132.6476996994, 538687389,     0
$$ Real data points
##PAGE= N=1
##DATA TABLE= (X++(R..R)), XYDATA
$$ [...]
28394A23550r552j06292q0465N7830L8355J10367N7559q2689k2105n9187m5522
28383a8151L984J43285m4471M764k7348p7626k2950o0922P9767J4586l633J5316
28371F601j3701J6447O6416L1186K4565j7821j9162j6927p9993m56j078p0012
28359g3935K7743N5518N2264M2314j02298j31367n0897L2557L7227L271K5835
28348h1768M1789L4167o4036k1614M1693k446q833K1819j8385n0713L4266l4986
28336a09047K1958J17531M0648j05524R641K0777L2306p8280l4594p754q6863
28325a79201o210M6572N3119M2833o6579R5944J77771j8147r4612l5324L0622
28314D6788M9789m5891N460l8040q9997K3932n1389l4359Q8123L9612N405j06656
$$ y = [123550, 113998, 7706, -72759, -14929, 23426, 133793, 191352, 108663, 86558, 27371, -18151, -14167, 129118, 84647, 89411, 62063, -15563, -38513, -99435, -19668, -5082, -8715, 6601, -7100, 9347, 75763, 106949, 131514, 113693, 94531, 77604, -2389, -2845, -3923, -73935, -46192, 9326, 61590, 103904, 1606, -129761, -180658, -148101, -110874, -107603, -81768, -39979, -5812, -69848, -91462, -49769, -52215, -61048, -39229, -57614, -108327, -74061, -109047, -87089, 30442, 71090, -34434, -24793, -4016, 28290, -49990, -84584, -92338, -179201, -185411, -138839, -85720, -42887, -109466, -13522, 164249, 146102, 51490, 16166, 46788, 96577, 50686, 56146, 18106, -71891, -47959, -99348, -133707, -45584, -5972, -567, -107223]
28302a07223l5236Q097K3359J19054N0453m5461k9259r9262k5908R5952N8097
28291A2663q5907m5939M8296j7574Q3301M8508M6987k3564p8527k0434K3444J20124
28279A11378P3369r0169k5268r612k5046j0909m3790L0540L4341l9971j4517M918
28267d736l4455J1735M3928p232k3644m0676q38R6093M0450m1379o4640Q737J7148
28254D91j1492O4041j5166j8901R232N9416J06675J6549q0358q7803l5418M4125
28242E1391N7437m4875L2046j2708k6416k7256Q36J7605K0162m478j4678R812
28230E8878k8430p0037l1424J1860R6959K2907o2568j2548r2496k8807j8902M3599
28218a11009l3456J21948k3100J8337J20709Q2857o5126j23239r0764k4351K6439
$$ y = [-107223, -142459, -134362, -111003, 8051, 58504, 13043, -16216, -115478, -141386, -45434, 12663, -73244, -119183, -70887, -88461, -5160, 43348, 90335, 66771, -11756, -32190, -8746, 111378, 184747, 94578, 69310, 59698, 34652, 23743, -20047, 10493, 44834, 4863, -9654, -4736, -39191, -27456, 16472, 9240, -14404, -55080, -55918, 40175, 80625, 39246, -25394, -16657, 491, -11001, 53040, 37874, 18973, 28205, 87621, 194296, 210845, 130487, 42684, 7266, 51391, 108828, 63953, 95999, 83291, 56875, 29619, 30455, 48060, 68222, 63744, 49066, 58878, 30448, -39589, -71013, -59153, 37806, 60713, -1855, -14403, -106899, -135706, -154608, -111009, -144465, -22517, -45617, -27280, 93429, 176286, 111160, -12079, -102843, -127194, -100755]
28207a00755R3239j8309k4748P367l0963L7780O5563M2431m5487j081R335M6051
28195H0423K1594j0413l9535r2422l1169n1725l9281J05170J13404N3197k4918
28184H4325J4623l034o6729p3011p9584P2661M9674M331l992l5575K7208M9378
28172D0275k3482m7417j5680J06231Q0144n1994j50248p6428k4041M7840P1503
28161d3297L2766L3594O1674l1746k8313L4583K1309N338n7421k1933K9075k6749
28149H880j0389J51589l602o9383J757o1793o1550k3029M683P733O5549K7239
28137C7684n1440P9769L3930q4313j834Q7918Q3765K1399o2818q7685j53125r554
28125a06304O1360j473m6329j2353j4006j3278N6135L652k2571Q3634L8910n0310
$$ y = [-100755, -7516, -25825, -50573, -43206, -74169, -36389, 29174, 71605, 26118, 25037, 34372, 80423, 102017, 91604, 52069, -40353, -71522, -123247, -162528, -57358, 56046, 109243, 84325, 98948, 95914, 29185, -43826, -123410, -50749, -1075, 3256, -736, -36311, -9103, 40275, 16793, -30624, -46304, 59927, 140071, 88077, -62171, -138599, -162640, -114800, -43297, -10531, 23063, 84737, 52991, 24678, 59261, 80570, 85908, 28487, 6554, 35629, 8880, -1509, 150080, 146478, 77095, 78852, 17059, -44491, -67520, -62837, -55104, 10445, 37684, -13756, 66013, 99943, 15630, 13796, 101714, 185479, 206878, 144060, 56375, -96750, -106304, -44944, -46417, -92746, -105099, -119105, -132383, -76248, -72596, -95167, -11533, 27377, -22933]
28113b2933O7772N3808K5653r39j0043J7514j1591k2926P1327k9039n8267J72
28101H0508o1034n538K610N4473j0666q0252q0948P473M8142j9383o3237Q39M0157
28088h6856l0040l1935O8805l3908o7303N796R150N6572K3837m5182j7494K2380
28076a26178o4009K9765M8631K3329O4161P496o2583L2168K8252L3951k297N9080
28064G1766j7111r9336l8234J1657l4498P011J5061o372N6864O5448n1786m4643
28052f4173N6108J9229L6962L061O249p1489K5864R248j36297O310M2868J43L3486
28039c2431p8586O1139O4711r060L7441L3202L0209k2515M3867J0744l2093l3524
28027G3104m8962k6854k8363k2676j5753M9832M3248n120J617L6939R557L3480
$$ y = [-22933, 44839, 98647, 124300, 123361, 113318, 130832, 119241, 96315, 167642, 138603, 80336, 80508, 19474, 13936, 16546, 71019, 60353, -19899, -100847, -93374, -45232, -64615, -127852, -127013, -86856, -116896, -148831, -80026, -113934, -181237, -175441, -166291, -109719, -85882, -131064, -148558, -126178, -190187, -160422, -111791, -88462, -24301, -16805, -79388, -47220, -18968, 14983, 12686, 71766, 54655, -44681, -82915, -71258, -105756, -98745, -83684, -90056, -33192, 32256, -19530, -64173, -8065, 11164, 48126, 51187, 57436, -14053, 11811, 21059, -115238, -108928, -66060, -65917, -32431, -111017, -49878, 14833, 5773, 43214, 76416, 106625, 84110, 127977, 138721, 106628, 73104, 24142, -2712, -31075, -53751, -69504, -19672, 23576, 18456, 20073, 57012, 66569, 100049]
28015A00049n0680k2858P4330K6595n8980q7015J3959L9320p3761L9907j5302
28004a4436L0203M4971r8306Q5454N5325N0994j0475K3213L5131k5977j46524
27993B9573m5353K8281J7325R492j8449j2993N1814J9802M441n7590N8927M1581
27981A26851m7631m0424j3990L2760J7495N5429N3732j05054j6862L017R91L3534
27969I9848k9715n4747J1140j2602j4702q97M1258j9848l1129l4734M5352R729
27957H953q6359k607O1245L1081N9898k4087j30369m5734R356j7471J01449J03591
27945F8946q4019m5442Rn489l2312k0181M0046Q9642k2884L099L9324K1491j15914
27932f3684Q788j7683m0099p7487M6371O2953K3983O1560m438L2776j5976k2304
$$ y = [100049, 49369, 26511, 100841, 127436, 68456, -18559, -4600, 34720, -39041, 866, -14436, 15767, 60738, -37568, 47886, 103211, 154205, 143730, 166943, 202074, 176097, 29573, -15780, 12501, 29826, 39318, 20869, 7876, 59690, 79492, 83933, 26343, 85270, 126851, 79220, 38796, 24806, 57566, 75061, 130490, 184222, 79168, 62306, 65323, 66314, 99848, 70133, 15386, 26526, 13924, -778, -1675, 39583, 19735, -11394, -46128, -776, 8953, -77406, -80013, -18768, 12313, 72211, 48124, -82245, -127979, -118623, -136094, -34645, 68946, -15073, -60515, -60506, -65995, -98307, -118488, -78442, 11200, -11684, -8585, 30739, 52230, -63684, -54896, -72579, -112678, -190165, -143794, -80841, -56858, 4702, 264, 33040, 17064, -5240]
27920e240J0655M1403n7327k7524Q6668P7343m3235j06580j02546k4270Q4542
27909f6111J16648K1810o0480k7340Q9024M7374j08698n5627J00401M357j16126
27898e4768l3041O5274N6214l4599j1710N4353N5032j2418l6112k0519l3987K8418
27886B2137O655p3441J6857q933L3501N7178j4688j9722k6040l236P8412R555
27874G8235k2228j01652r4753Q5733Q3045K8050r0262l3042L0716M3761K6035
27863C3638p3492r1105M124M9586J5022M6401P9156m8942o3897J8434R1536R4960
27851A55421m4238j935J4899R956p3410l6801r937m4113L2080J7607K3472j6789
27839B6212K3877K5698m7552k0584J1568p5203l868j2340N2018J18657r3267o2874
$$ y = [-5240, 5415, 46818, -10509, -38033, 48635, 125978, 82743, -23837, -126383, -150653, -66111, 50537, 72347, 11867, -15473, 73551, 120925, 12227, -43400, 57001, 61358, -54768, -87809, -22535, 33679, -920, -12630, 41723, 96755, 84337, 48225, 27706, -6281, 22137, 28792, -44649, -27792, -36725, -3224, 53954, 39266, 19544, -6496, -9732, 68680, 78235, 56007, -45645, -140398, -54665, 28380, 56430, -33832, -66874, -36158, 7603, 33638, -39854, -130959, -126835, -77249, -62227, -15826, 63330, 14388, -49509, -31075, 60461, 155421, 111183, 109248, 124147, 134103, 60693, 23892, 13955, -30158, 1922, 19529, 43001, 26212, 50089, 75787, 28235, 7651, 19219, -55984, -59852, -72192, -20174, 98483, 5216, -57658]
27827e7658L9521M6097M3978K5425n5238q0388l2494j384R409n365K20M3947J3143
27814a0787M9026O3978j7852K6511m4299n1899K0175r354j2249l1190l7536m2903
27802i8379O9493L2779j2701l8372L4104O2614k5591j3270k0701o8038L9430O590
27790c2042l9614R1072L1142j709L2971L6238K2420j2873o5821n7692k5479N630
27778a5757m317J3177K3839j6984r4020M1218K2928n4476o1264k3116O6462J36649
27766C4339M0951l5624K5730m7279q9457L7097m1907m7969J562J79713M7428n5789
27754D8795o8139k0686q006L1428J6547L8696n7535p2757q5594K495K8321O7479
27742g8956N1821n0398L4659M2411M0345Q1556l504q687n7859j66988K4114m067
$$ y = [-57658, -18137, 27960, 71938, 97363, 42125, -38263, -70757, -72141, -62732, -68097, -67877, -23930, -10787, 38239, 102217, 84365, 110876, 66577, 14678, 34853, 25499, 13250, -17940, -55476, -98379, -28886, 3893, -8808, -47180, -13076, 49538, 23947, 10677, -10024, -78062, -38632, -32042, -71656, 19416, 50558, 48849, 81820, 118058, 140478, 127605, 61784, 4092, -21387, -15757, -20074, -6897, 16942, -42, -94062, -52844, -29916, -84392, -145656, -168772, -102310, 34339, 75290, 39666, 65396, 18117, -71340, -34243, -76150, -124119, -122557, 57156, 104584, 48795, -19344, -40030, -48036, -16608, -61, 38635, -18900, -91657, -177251, -174756, -146435, -78956, -27135, -77533, -42874, -463, 39882, 121438, 117934, 109247, 51388, -115600, -91486, -95553]
27730i5553N7062L4160m4896k6523l5416l9100M8678Q622N6074J14038n6315o7299
27718d6468k7509N1220P596O4598K3787o3607j0503k3263m2295K1312K7978n5604
27706g2758p9531P9257R0311k9455o3804j4620L2691L4714r4645o3339J43838
27695c7341J34858n1133r5939K1406J06358O2564l8820l6532l9748j3949J7340
27684B9064N4683J4702m0345r3631L688Q2244K1643o5609n4333M1867j3478j8939
27672c8444o7810N3332M1710q3130K2903O5284J4725j1244k5697N6111J5303o235
27660C6808k5094p456L4608L9216j1337K692j3567k4564m0962n012k252N024L6268
27647B4372l4002n18L0644L7697k4994o7140J01424L1109o6917L7877n1223l1133
$$ y = [-95553, -38491, -4331, -49227, -75750, -111166, -150266, -101588, -92966, -36892, 77146, 20831, -46468, -73977, -22757, -15161, 49437, 73224, 9617, -886, -24149, -66444, -45132, -17154, -72758, -152289, -73032, 17279, -12176, -75980, -90600, -57909, -23195, -117840, -181179, -37341, 97517, 46384, -49555, -28149, 78209, 140773, 101953, 65421, 25673, 11724, 29064, 83747, 98449, 58104, -35527, -31839, 50405, 72048, 6439, -47894, -6027, -19505, -38444, -106254, -52922, -11212, -94342, -71439, -6155, 8570, -2674, -28371, 27740, 43043, 36808, 11714, 4258, 38866, 78082, 66745, 69437, 55870, 31306, -9656, -14668, -16920, -11896, 24372, -9630, -10148, 20496, 58193, 33199, -33941, 67483, 98592, 31675, 69552, 18329, -12804]
27635a2804q5049p6614L5108O4751N5859j3411p4195n7800j9457J9719j5372O5508
27623a13757P2643M3841K3419n0603J5500J2206L9084J7450q0337N747p8903N7301
27611c6409n574J0173R0141N5934q5254l3715J8775N2743L4207n0245m0270n8939
27599d8433N1232L6500N9698J9815m7133n8266M936J7945j9780j3863J7275J8151
27587C8077o2306r269N5452M0104L648P179m0409m8478o2713R530j1693k7566
27575a08444l9832R199P2227J31030Q6332m8849j4139k3286p2852j6461K1572
27564c503k7467J0898K6270Q992l961K4771j198R132K0607q4845K1912P3997N4267
27551A29872q303r2348j9964L41J3909M7510p5487n3421q611L203N1455k7482
$$ y = [-12804, -97853, -174467, -139359, -74608, -18749, -32160, -106355, -164155, -183612, -163893, -179265, -113757, -41114, 2727, 26146, -24457, -8957, 3249, 42333, 59783, -20554, -14807, -93710, -36409, -41983, -31810, 58331, 114265, 29011, -4704, 14071, 66814, 101021, 50776, 10506, -48433, 2799, 39299, 98997, 118812, 71679, 13413, 18349, 36294, 16514, 2651, 19926, 38077, -24229, -33498, 21954, 62058, 65706, 72885, 32476, -16002, -78715, -69185, -80878, -108444, -148276, -139077, -66850, 64180, 150512, 101663, 87524, 64238, -8614, -25075, -3503, -30970, -20072, 6198, 15190, 11229, 36000, 34802, 43934, 64541, -20304, 1608, 75605, 129872, 121569, 29221, 9257, 9598, 23507, 71017, -4470, -57891, -66502, -63299, -11844, -39326]
27539c9326m6686J4588j9912Q3010N3779K1760J3830L0917j6639o4955q1938o0028
27527a11600j098J52102L0762o4947l1134N0334L4403k6935L4114K6793l2653
27516F0141k588j3920j7573r7995J8512N1717k5401N164Q0750J9902o6341l3559
27504b1191M9966K0107L4603q29q0113p8080p3036J9972O4011M1278N5205P2247
27492A04140K1105L3981m639j04879N438j5162K5498N5543o7104k6225n204L8178
27480F0670j1953P551N5844m9009o3777q021n9447o7558O5724L3110m5298N1886
27468c0278O0184j3645l472L802r5379Q672L9275N4655M280N076N4192P2589J1893
27455A71844k4906J0826K7694m2119n1427J7598L208m7959J7666L7788M8550L177
$$ y = [-39326, -86012, -71424, -91336, -8326, 45453, 67213, 81043, 111960, 95321, 30366, -51572, -111600, -112698, 39404, 70166, 5219, -25915, 24419, 58822, 31887, 66001, 92794, 60141, 57553, 43633, 26060, -71935, -53423, -1706, -27107, -21943, 58807, 78709, 12368, -21191, 28775, 48882, 83485, 82656, 2543, -75537, -148573, -128601, -64590, -23312, 31893, 104140, 125245, 159226, 154587, 49708, 55146, 39984, 65482, 121025, 53921, 27696, 22492, 60670, 48717, 56268, 112112, 63103, -674, -8695, -68142, -135700, -69976, -36866, -82164, -30278, 29906, 16261, 12789, 16591, -78788, -70116, -30841, 23814, 28094, 33170, 87362, 159951, 171844, 146938, 157764, 185458, 143339, 91912, 109510, 112718, 64759, 82425, 120213, 168763, 171940]
27443A71940j56324j0108L4172P3178K5115j6621k8974L6884j8439n4830M36O0083
27431A16512o1208l8194L502L2840Q416o5182L3347n5269r9207M1180J07731Q6630
27419A11098L0213Q264n9093m9281o586k6107J3834q3669M870J76171L3534j6872
27407A36376J4649n3392k9751L3450q2651j10035m1242K217J14815Q7386n0913
27396B0909r6553K5245j8435J0164M4550J3667k2431N982O0497M1207p1545N974
27384A9231M2732j0012q3416J6997R2145P951l8631M4957K0007J692N0185p5718
27372H8120k7048q899r5564j75O0019o0560l675m3416J4377J04164K8252j10958
27360e5363q8547Q801l978m508L3867M4998N5733N638M1067l4906o9492N7433
$$ y = [171940, 15616, 5508, 39680, 112858, 137973, 121352, 92378, 129262, 110823, 55993, 56429, 116512, 55304, 17110, 20612, 53452, 61868, -3314, 30033, -25236, -124443, -83263, 24468, 111098, 141311, 149575, 90482, 41201, 34615, 8508, 22342, -61327, -56457, 119714, 153248, 136376, 151025, 97633, 67882, 101332, 18681, -91354, -132596, -130379, -15564, 71822, 20909, -75644, -50399, -68834, -58670, -14120, -453, -22884, -16902, 43595, 84802, 13257, 19231, 61963, 51951, -31465, -14468, 77677, 85628, 46997, 91954, 111961, 113653, 163838, 88120, 61072, 52173, -43391, -43566, 16453, -44107, -47782, -91198, -76821, 27343, 55595, -55363, -143910, -135109, -139087, -143595, -109728, -64730, -8997, -3359, 37708, 2802, -66690, -9257]
27348i257M3453o2325Q5025J64908J8872j74610m8998J25129J13896j4624j08414
27337A33055n8219R217J9389n6537k9081k525J7368K664j0065K659M2152j2668
27325E7409n3709L1335o721q3698j9886k6259l4655K256L7426j459l3519j7686
27313a49166j755J9334O6581O5532J29267N8935r2963l7940m5327m7064k1730
27302e6296l4160K5924j0192k8916N4880J1674p4118P6019P9139n554J01474j1219
27290A28655n6249l0432p1755j02517M1135Q6834J02960J750q6264M0592M678
27279E9387J2931K9833m4028m6529o4285p275K6359K9108N4796K5531J3073n4186
27267C4715l7429l1174K2624j0092K776O775L9495K3767O668k0657l9219j4008
$$ y = [-9257, 34196, -28129, 56896, 221804, 240676, 66066, 17068, 142197, 256093, 241469, 133055, 74836, 84053, 103442, 46905, 17824, 15299, 32667, 35331, 25266, 27925, 70077, 57409, 3700, 35035, 28314, -55384, -75270, -101529, -136184, -133928, -96502, -97961, -131480, -149166, -150921, -131587, -65006, 526, 129793, 188728, 95765, 57825, 12498, -34566, -56296, -90456, -64532, -74724, -103640, -48760, -37086, -111204, -35185, 43954, 38400, 139874, 128655, 72406, 41974, -29781, -132298, -91163, -4329, 98631, 100381, 14117, 54709, 59387, 72318, 102151, 58123, 11594, -52691, -59966, -33607, -4499, 50297, 75828, 88901, 34715, -2714, -33888, -11264, -21356, -18580, -11805, 27690, 51457, 58125, 37468, -1751, -15759]
27255a5759K7343Q3114M6308l4288j6363n2210j7662K5297l1105j24444o2803
27244a72572J0913L0905Q5076L7397l7366m9438j4340J13578K7256j502J790O3988
27232I5685L2946r5073q5969P5679L7980l5786n9038l0849J9039L4481P3432m6078
27220A6449q4296M0481J8841m4426j5261r623J7212J9658J10910n0707r3417j3255
27208h7434L0141L9883O2909k6601j2397M6404l5734J6748O701q0186n9123j7573
27196a16262L0590K1155j6653N3826m4458m9334o1916O9891Q2159N9559L6019
27185F4576q2786k4704J8594M0108n414k3008k6303l6338J9221Q9648P2624O2342
27173A68560j36627K7984J0132o1106P855j7837l8080R966m2175J7291N8607j4522
$$ y = [-15759, 11584, 94698, 141006, 106718, 90355, 38145, 20483, 45780, 14675, -109769, -172572, -161659, -130754, -45678, -8281, -45647, -95085, -109425, 4153, 31409, 29907, 31697, 95685, 128631, 33558, -52411, 23268, 61248, 25462, -33576, -64425, -45386, -10905, 62527, 16449, -67847, -27366, -8525, -52951, -68212, -77835, -60623, -40965, 69945, 19238, -74179, -87434, -57293, -17410, 45499, 18898, 6501, 52905, 17171, 33919, 40620, -39566, -98689, -116262, -85672, -64517, -81170, -27344, -71802, -121136, -183052, -113161, -31002, 28557, 64576, -18210, -42914, -24320, 15788, 10374, -12634, -38937, -75275, -56054, 33594, 106218, 168560, 31933, 59917, 70049, 8943, 16798, -1039, -39119, -29153, -71328, -54037, 4570, -9952]
27161i952p1091r8729O8492M5364J4002O2174m8509O9386K44l2907M5755q347
27149C5882r7321j0470r6679r039J1857P4246L4479Q168j5450L6209k5489M9963
27137c644J2636k2627N597j7802j27289P3750Q4352r447M2909L444L5584j642
27125G5821m8308k2796J7727K9994L5564r928k8012j4516m6738m5832K0147l9541
27113g6418O1721O8900j0499l0684K5125R355K6083m7594o8895L1119o870m2238
27101f0895R6999N9706Q782n5325o6977j6413M1906l6836n610O9605j2578m4883
27089b2519J255p5380r894n0682j6596L3625j2051p324L9372J5500P8780O4643
27077C8729k6538l2249k7029r6231M1997n8479N0333R9112O194M4750R6109j33257
$$ y = [-9952, -81043, -179772, -111280, -65916, -51914, 10260, -38249, 31137, 31381, -1526, 44229, 35882, -61439, -71909, -168588, -177627, -165770, -91524, -57045, -48877, -64327, -28118, -53607, -3644, 8992, -13635, -8038, -25840, -153129, -79379, 4973, -4474, 38435, 41879, 77463, 75821, 27513, 4717, 22444, 52438, 88002, 78074, 50062, 35546, -11192, -57024, -36877, -76418, -14697, 54203, 43704, 13020, 38145, 47500, 73583, 25989, -42906, -11787, -18657, -60895, 36104, 95810, 104592, 49267, -17710, -34123, 7783, -29053, -34663, 34942, 22364, -22519, -21264, -96644, -106538, -157220, -173816, -140191, -152242, -159566, -120194, -104694, -25914, 38729, 12191, -20058, -47087, -143318, -101321, -159800, -109467, -10355, -4161, 40589, 136698, 3441]
27065C441n8694J106J1945J1019M7394K7535L1918P584q8936N2128j1233l1303
27053C904m7171J626L3085j0290J206J5062M4814k2943l2943j3971K3339P2694
27041F8412k2621k6538M1534l0586m6335N2029j5654q4930j01884n6534o9069
27030b92176R2646R6942N1829K7837J9526o5012L1128m3205p3496N9730J52621
27019E8370K0633p5869K442M7460j6964r9823o0981J9085J41652L4130l8828m0416
27007i109j9779O7361k2494l2645k6983j22333q412O2950k7113M6293O4240K9867
26995A843q7979K8246K6431M9559L0515p8521M384K384J7948Q7830J0342j28026
26983c5044j28437j25296Q137K7257Q1346N7967Q8965Q5169J1545p2978m2521
$$ y = [3441, -55253, -54147, -42202, -31183, 16211, 43746, 75664, 83248, -5688, 46440, 35207, 3904, -43267, -41641, -8556, -18846, -17640, -2578, 42236, 19293, -13650, -27621, -4282, 68412, 45791, 19253, 60787, 30201, -16134, 35895, 20241, -64689, -166573, -223107, -292176, -199530, -102588, -50759, -22922, -3396, -68408, -37280, -80485, -153981, -94251, 58370, 79003, 3134, 5576, 53036, 36072, -63751, -124732, -105647, 36005, 70135, 31307, -9109, -28888, 38473, 15979, -16666, -43649, -165982, -174394, -111444, -138557, -92264, -28024, 1843, -86136, -57890, -31459, 18100, 48615, -29906, -25522, -23138, -5190, 82640, 92982, -35044, -163481, -288777, -280640, -253383, -172037, -114070, -25105, 60064, 71609, -1369, -43890]
26972d3890p509J06595O7087o9020k4222l302l9180p6160K3346L9254K6042K6616
26960B5657o229q567K3406m5696P230r8878K3720R5896K7963k10p8175j2683J2368
26947c4198O3864N2792l0127o9900k5500N4166O0363m113m5400o2506m95j0731
26935e1785K7641M407p6762N4139Q4565P8171l2062M6559j4171j34013j21709
26924a35020p476J76561P3263o9388k0053N6337J2726p8415q0662L5791O4785
26913B8449n8098j0302K0343N4414M9919n1179j03118K7799L8633l196K1612l0193
26901a4917p4378r836Q9697o6050o3897L2625k4827J5750P8004N6134L8738K1953
26889G8996R537p1367O039m066m2958K3740l7138R9385k83l8947m4279P3935M9311
$$ y = [-43890, -51399, 55196, 122283, 53263, 29041, 25739, -13441, -89601, -66255, -27001, -959, 25657, 19428, 10861, 34267, -11429, -4199, -103077, -79357, 16539, 44502, 44292, -33883, -46566, -34198, 29666, 82458, 52331, -17569, -43069, 11097, 71460, 67347, 21947, -40559, -41054, -51785, -24144, -19737, -96499, -42360, 42205, 120376, 88314, 134873, 120702, -13311, -135020, -142496, 34065, 107328, 37940, 17887, 74224, 86950, 8535, -72127, -36336, 28449, -29649, -39951, -19608, 34806, 84725, 33546, -69572, -41773, -3140, -6336, 15276, -14917, -89295, -99131, -9434, -75484, -139381, -106756, -131583, -115833, -37829, 18305, 57043, 78996, 88533, 17166, 23205, 19139, -23819, -79, -37217, 62168, 61885, 22938, -21341, 52594, 101905]
26876A01905j1460j14297r78L2287p4594j01768k2453J4770k5300L4388L8454
26865a29046j0460L1898J8284K342L6552k8541J8314p6291l8263J0248O0888N3431
26853e0644n743M4055N0422K1216m6889l9934k7942J217p0049O2089L9726k6660
26841d9136n7800R420j7774K5014O7281P9905J7074N0126j5126m8887l8611k5718
26829d232R046j7000m2383L3545O1612K6970l7021m2393j331O819m0951J6184
26817c1135O9651P3479n8856j7740j1804l0205k4393M1501J1918j8906n5581l5735
26805h7806J554J918P8288Q0773J69116N7602m2638q7642j04122p5110q4881n1748
26793a44696p7598m1656O2703M9661M1775N4067j513k0478K6312q0838k2296L9272
$$ y = [101905, 90445, -23852, -24830, 7457, -67137, -168905, -191358, -176588, -201888, -167500, -129046, -139506, -107608, -89324, -86982, -50430, -78971, -60657, -136948, -175211, -164963, -104075, -50644, -56387, -12332, 38090, 59306, 12417, -27517, -55459, -54242, -124291, -62202, -22476, -49136, -106936, -97516, -115290, -90276, -22995, 56910, 73984, 124110, 108984, 60097, 21486, -4232, 4814, -12186, -54569, -21024, 40588, 67558, 30537, -11856, -13187, -6368, -47319, -31135, 38516, 111995, 53139, 35399, 23595, -6610, -31003, 10498, 22416, 3510, -52071, -87806, -86252, -84334, -6046, 74727, 243843, 301445, 258807, 171165, 67043, -8067, -92948, -144696, -222294, -263950, -201247, -151586, -109811, -55744, -57257, -77735, -51423, -132261, -154557, -115285]
26781a15285P2050R040K06R960M7438P3932N207K9319M2577j29155p7947J5760
26769a6898o6427j488Q123p4141l8543M6094R4374q315R843L3078O997J0443m3068
26756c9928k0208L7760m0554K0948M0399j3479J4588O6853l1715j9462r4002q0482
26744a59282K9280K2987P2551O606P7454j8501R22j1723k4725M8138J54494n0240
26732A47961r8812j8631p697j9329l910L5591O4253J7421n408l1453l0672j3467
26720C5847n9032q03R1646P0838q557o8132k7611O0004P3293p1945n0418q197
26708C6933M0352k7868j1605j6416L023J4967k5364j2978k4906j1640L1185O0523
26696E6206l5784l6224r340k5387o2107P9457N2683L1114N7541l5617n0539k7843
$$ y = [-115285, -43235, -34195, -33989, -24029, 23409, 97341, 102548, 131867, 174444, 45289, -32658, -16898, -83325, -84813, -76690, -150831, -189374, -143280, -48906, -57221, -47378, -14300, -7303, 3140, -39928, -60136, -22376, -62930, -41982, -1583, -15062, -474, 66379, 34664, 15202, -78800, -159282, -130002, -107015, -34464, -27858, 49596, 31095, 32017, 20294, -4431, 43707, 198201, 147961, 49149, 30518, 22821, 3492, -418, 35173, 99426, 116847, 111439, 79986, 49314, 35847, -23185, -23988, 67658, 138496, 129939, 61807, 34196, 94200, 167493, 95548, 45130, 36933, 77285, 49417, 37812, 21396, 24419, 39386, 14022, 1044, -23862, -35502, -4317, 56206, 20422, -15802, -25142, -50529, -112636, -33179, 19504, 50618, 108159, 72542, 22003, -5840]
26684e840l1568p1673m1915M7432L1248k803Q3214K4750L7877j2819p4154L7109
26672B0858P8740j0564n3741m0296o024K9278O2896q056m4503R723P0231K1986
26660A30528j24358j17701Q681L2104O6925Q731j23968p4138L2726M4131L9741
26649g6598l182J13601j7909o026k6703n3372Q718j8211N1807M004O1192L0r7417
26636f0066k3778K3790J175K2665j5838j6508M7099J34070l1969l6004k1098R0162
26624A13700Q2106q8893q3843j6722l8598Q918K8581Q595j0510J1382j4965q54
26612a103K4980j8583k0098O7165q918J7135m1372l4498K731M4496J0158K8415
26600G0508r2652o0341j9955l5719n965k6866N2969n728o148k3244n2328N4828
$$ y = [-5840, -37408, -109081, -150996, -103564, -72316, -75119, 8095, 32845, 70722, 57903, -16251, 20858, 99598, 89034, 35293, -5003, -11027, 18251, 81147, 73091, 28588, 38311, 108542, 130528, 6170, -111531, -102850, -70746, -3821, 4910, -119058, -193196, -160470, -116339, -76598, -79780, 33821, 15912, 9886, -16817, -70189, -61471, -79682, -27875, -23871, 37321, 37351, -60066, -83844, -60054, -58879, -36214, -52052, -68560, -21461, 112609, 80640, 44636, 23538, 113700, 195806, 106913, 23070, 6348, -32250, -23332, 5249, 13844, 3334, 14716, -249, -1103, 23877, 5294, -14804, 52361, 43443, 60578, 19206, -15292, -12561, 31935, 42093, 70508, -22144, -82485, -102440, -138159, -144124, -170990, -118021, -123749, -129897, -153141, -205469, -150641]
26588a50641J28634J11937n4526j37965l933R3399m0719k7270j991J0315L0285
26577d2475o5206p6172l494O639k6967k2092N6510O4440j10520o6884J12063N3591
26565a20567n860L441R1236l5032r1731P7288M5178K3059Q0498J8948l8868m8530
26553i40n2382M2302j8614m2357N8080J5222n3833k6204m800M6504O4992O3404
26541I1374k3483r2l5526j6759R603N9089q51j8338j8048o2419k7054L875m3764
26528h2393p3008K2141K8333m9259l1578J10540j1851o8358Q369J7703N0192o6168
26516a45337n661L7440J7427j2910N7660J1919K7066N9201k9584r2229J9868P7946
26504B2806l6670Q681R329j9717M2290L0469q3495j9019q826j1710O4942L697
$$ y = [-150641, -22007, 89930, 35404, -102561, -106494, -13095, -53814, -81084, -83075, -72760, -42475, -107681, -183853, -187347, -180708, -207675, -229767, -173257, -108817, -219337, -286221, -174158, -120567, -126427, -122986, -31750, -66782, -158513, -81225, -36047, -12988, 67510, 86458, 47590, -940, -53322, -11020, -29634, -71991, -13911, 1311, -52522, -78726, -83526, -37022, 27970, 91374, 67891, 67799, 32273, 15514, 25117, 84206, 83355, 65017, 46969, -15450, -42504, -38629, -82393, -155401, -133260, -104927, -154186, -185764, -75224, -87075, -155433, -147064, -129361, -79169, -145337, -150998, -113558, -96131, -109041, -51381, -39462, -12396, 46805, 17221, -75008, -55140, 22806, -13864, -5183, 4146, -15571, 26719, 57188, -26307, -45326, -54152, -65862, -920, 2777]
26492B777k3108J6640n9391Q029Q846J03138J855n2424N8700L5628o4783R323
26480D5230J02585r698q7079l6381r1922j0585J2332O205j4222K218O3236M3053
26468B4972n4673N795o289j7409k8000N3499Q702R088j3928N6456K7127r6115
26456c0775K558L3012n3803K3063Q6328j6067M9803K5029j39906l9213K9904L4426
26444D359j4771j4052M4269M1358J4654r1680o1491N9863O8237o5260m6728N3701
26432g541O689K2205R988l9475P1883Q8103j12199m2792M0526k4388j08089n1824
26420a46914J2336N0138o876Q4994Q38K8004j7805j6759k537J8227j3337K2713
26408A3022l0555J0018L2383M4668p7698l5728J2366l2648O2809J8763K6804j2660
$$ y = [2777, -20331, -3691, -63082, -55053, -46207, 56931, 58786, 6362, 65062, 100690, 35907, 45230, 147815, 138117, 51038, 14657, -77265, -87850, -75518, -69313, -83535, -81317, -18081, 24972, -29701, -23906, -30195, -47604, -75604, -22105, -13403, -4315, -18243, 38213, 65340, -30775, -28217, 4795, -49008, -25945, 60383, 44316, 94119, 119148, -20758, -59971, -30067, 4359, -10412, -24464, 19805, 61163, 75817, -15863, -77354, -17491, 50746, -14514, -61242, -7541, -852, 21353, 31341, -8134, 63749, 151852, 39653, -3139, 37387, 12999, -95090, -146914, -134578, -84440, -91316, -6322, -5484, 22520, 4715, -12044, -14581, 3646, -9691, 13022, -17533, -7515, 24868, 69536, -8162, -43890, -31524, -64172, -1363, 17400, 44204, 31544]
26396C1544n6326n1422L1486R370R15R2441O2789l2591o9312m4863k5752p277
26384e8998Q480J02596M604j18880q5606q4736N1884J23694O1041R2122M5504
26373A41705j30220l603N3767r1189r9012P3024L1842J7624J5238R0777J17036
26362B16989l7322m7748j40142p6074N5655N3564k8657k4788n5623L160q648P2725
26350a6909M815n966k3173p2683P0622L3810k1818j5640l804N4758n9320K7485
26338b7823P8838m894j2498o949o3760p1512Q7510O6313p5251k0946N5912J4127
26326A9067j846l2366o04r186M683p7890n5397L0919P3781M1412N8801P3114m9245
26313G5243n607N4124j3235k2788P8808K8713j9333o5122J3561M4068o6668o7596
$$ y = [31544, -24782, -76204, -44718, -35348, -34433, 58008, 120797, 88206, 18894, -25969, -51721, -58998, -50518, 52078, 56682, -62198, -147804, -232540, -180656, -56962, 4079, 96201, 141705, 11485, 7882, 61649, -29540, -128552, -55528, -23686, -6062, 9176, 99953, 216989, 179667, 131919, -8223, -84297, -28642, 24922, -3735, -28523, -84146, -80986, -89634, -16909, -12094, -18060, -41233, -113916, -43294, -9484, -31302, -46942, -50746, 4012, -55308, -27823, 51015, 46121, 33623, 26674, -37086, -108598, -21088, 45225, -30026, -50972, 4940, 19067, 17221, -15145, -15749, -24935, -20252, -98142, -153539, -122620, -48839, -7427, 51374, 124488, 75243, 69636, 123760, 110525, 87737, 166545, 195258, 175925, 110803, 124364, 168432, 101764, 34168]
26301C4168Q695k1578N0824n3998j22167n4951J07624Q1111L1633p2265k4161
26290c5065l5854O3546J00553K0931n7659J0741p2371n3018N0623J7308O1154
26279G0889n3968n1576p2275L5503n2489l143K2013q8347N8872m24L4229Q0660
26267b0056P475r5803o7910m5588K4577J5381Q2149K4874q2211L763J00061K0568
26255c2720Q5641P0753q3843k045L284j4959r0438O804K4844O7596J9531O910
26243F1358P209l0360k1861L7256n2137j11499j3692Q6913L4475N976j1803j1891
26231b0056L7289J10197k2702j05325k7664M2666m1784J29083O8174k3585r9452
26220D6841O449O652n512l5794N2048o3700p2836k1462L9098L1029j7149M474
$$ y = [34168, 42863, 21285, 72109, 18111, -104056, -159007, -51383, 29728, 61361, -10904, -35065, -70919, -7373, 93180, 114111, 56452, 67193, -5178, -58196, -7573, 9735, 70889, 16921, -34655, -106930, -71427, -123916, -127059, -105046, -193393, -134521, -134945, -100716, -20056, -12581, -108384, -176294, -221882, -197305, -181924, -99775, -74901, -157112, -153349, -53288, -32720, 52921, 123674, 39831, 37786, 41070, 26111, -64327, -57523, -32679, 34917, 54448, 61358, 68567, 38207, 16346, 53602, 1465, -110034, -123726, -36813, -2338, 3638, -8165, -20056, 17233, 127430, 104728, -597, -28261, 14405, -27379, 101704, 169878, 146293, 46841, 53290, 59942, 54430, 18636, 70684, 6984, -65852, -87314, -48216, -17187, -34336, -29862]
26208b9862m908j01711K3929M7478N3220K1131o7551j8259J11038l3901p2010
26197g1406J427l0667n2956J17206m9791m0361Q8753J9993m4294N301m9991k0158
26185a26944M6127k6155K9052N9161K5720L0938k1548k087k5734P3493m0466j07379
26173h5822M5949Q4877M2244n0179p527n497P809j4374K592k0233n45j3152n1543
26160f5401l0700L0108J7498J5718J8088J2609m1619P7292M1176o6946j09959
26149a02136J2935J9988O9707J4808M6540R915j0543K552K3766N9912K0461q0890
26137H7015m3373k5999o0507L3670K8277M4530k2626O243j6566k5204r26k0621
26125a6087K4316p978K6207J3405p862o0218p2996L040R0749R4699q0930o3128
$$ y = [-29862, -34770, -136481, -112552, -65074, -11854, 9277, -58274, -76533, 34505, 604, -71406, -69979, -100646, -153602, -36396, -86187, -126548, -37795, -17802, -62096, -56795, -106786, -126944, -80817, -106972, -77920, -18759, 6961, 37899, 16351, 14264, -11470, 62023, 21557, -85822, -39873, 45004, 87248, 37069, 29542, 24045, 31854, 17480, 20072, -161, -706, -13858, -65401, -96101, -65993, -48495, -32777, -14689, -2080, -43699, 33593, 74769, 7823, -102136, -89201, -69213, 494, 15302, 61842, 71757, 61214, 63766, 87532, 147444, 167905, 87015, 43642, 17643, -42864, -9194, 19083, 63613, 40987, 47230, 30664, 5460, 4534, -16087, 8229, 251, 26458, 39863, 32001, -28217, -101213, -98173, -7424, 87275, 6345, -56783]
26113e6783J7422Q356p529q485m6057K782L0588J9310O2152O5886p2556p8021
26101f2935O735N3180M8917k6375n4505O5234O6414k3248p1731o9816K8916J5107
26089b4107m017O3593M6252q8321P8697P8160m1412m377m9479o75k3963o0221
26077b9870J25713Q7195o8980p4476L2751k1998j4053j02l0844m201j7167P8169
26065F2137K1457n3265n7775k1184N9033k901n1817O661P4299j2806K475K2661
26053D8975p6522q0384N6636J20969j35691n6710L4329K8616K1509M8070O0280
26042G0077m0760O870k1673k2188m0719q0659J4002M7485M1169j7506m1826P5562
26030a0166P4493m0166l5888L0990k6723N7850p8619q1862o2129N843Q1289Q60
$$ y = [-56783, -39361, -31005, -38534, -47019, -93076, -90294, -59706, -40396, 21756, 87642, 15086, -62935, -56200, -3020, 45897, 19522, -34983, 30251, 96665, 73417, 1686, -68130, -39214, -24107, -28124, 35469, 81721, -6600, 72097, 150257, 108845, 104468, 54989, 54314, 30351, -29870, 95843, 183038, 114058, 39582, 72333, 50335, 36282, 36180, 5336, 1135, -16032, 62137, 83594, 30329, -27446, -48630, 10403, 7502, -44315, -37654, 36645, 23839, 26314, 48975, -27547, -107931, -51295, 69674, -66017, -122727, -88398, -59782, -38273, 9797, 70077, 29317, 36187, 14514, -7674, -48393, -129052, -115050, -67565, -26396, -43902, -85728, -10166, 64327, 24161, -11727, 19263, -7460, 50390, -28229, -110091, -172220, -166377, -85088, -84228]
26018h4228q9972R6558M5647k5942N385j2657k9497N8508P5515K9436L0917q193
26006I1477k8286M8456j7967p0870n0499l1846l1628n0602L0545P9306k456n6863
25994i1233p5179M8844l6456K1308M916K0996l1503K0502K5012P703Q1869J12074
25982A08853K2116m8849m3039n8256R7238M5114k3297M040p0465J0955m6429p0415
25970g2434n3678P1826O2865l9749J4337m7007j19419j5531O6945P7271J9083
25959c5491j0867n7715L2526L7443k4743j9847Q4821J06083r247l3134L1271J9981
25947A21081r6043J3602N3926q1294k6971j148l7685L7342Q6120j5857r7942j865
25935d6734L0966R870n9031j8659k4015K4231l0501j6631J3450J85728M7951o4483
$$ y = [-84228, -174200, -77642, -31995, -57937, -52552, -65209, -94706, -36198, 39317, 68753, 99670, 91477, 63191, 111647, 93680, 22810, -27689, -59535, -91163, -141765, -111220, -31914, -34370, -91233, -166412, -117568, -154024, -132716, -127800, -106804, -138307, -117805, -92793, -85090, -3221, 108853, 130969, 82120, 39081, -19175, 78063, 123177, 99880, 103920, 33455, 44410, -2019, -72434, -126112, -54286, 8579, -31170, -16833, -63840, -183259, -198790, -131845, -54574, -35491, -46358, -104073, -71547, -34104, -58847, -78694, 6127, 112210, 102963, 69829, 101100, 121081, 25038, 38640, 92566, 11272, -15699, -16847, -54532, -17190, 68930, 53073, -44869, -46734, -15768, -5898, -64929, -83588, -107603, -83372, -113873, -130504, -117054, 68674, 116625, 52142]
25923E2142o1127j5558p190M6627J5183k7212K7850N3116K573r798N5029p4312
25911E7323j21242k2040K3349K1557L3983N8263Q2585J24298r0742p0227j08171
25900a1064m3383M0427L0375n9200K2184O2207k5890m5850L4564l1434j4106Q1900
25888D0730P0422n8605j16502m1384J5946J5832p558N272O7084j199j7519L4923
25876G442J11034O6729l9044Q43j8419j9373j2777o4017j6516k4791N224j9534
25864b3199K8959K7573m9091n7667l3062Q7087P2606R2628j3301n4492p2359r0617
25852h4935L1254o086J487Q2797n1017j02687p274M3741J41801M9660m9400m3490
25840E851J1761M7465m9625k6350o7564J1419Q1260q1136q5403j2922K9111N9117
$$ y = [52142, -8985, -24543, -31733, 14894, 30077, 2865, 30715, 83831, 86404, 76606, 131635, 57323, -63919, -85959, -62610, -41053, -7070, 51193, 133778, 258076, 167334, 97107, -11064, -54447, -14020, 16355, -42845, -20661, 41546, 15656, -30194, 4370, -27064, -41170, 40730, 111152, 52547, -63955, -105339, -89393, -73561, -81119, -75847, -8763, -9962, -27481, 7442, 118476, 185205, 146161, 147004, 128585, 109212, 96435, 32418, 15902, -8889, -3665, -23199, 5760, 33333, -15758, -73425, -106487, -19400, 53206, 145834, 132533, 78041, 5682, -84935, -53681, -59767, -58280, 24517, -26500, -129187, -136461, -92720, 49081, 98741, 49341, 5851, 17612, 65077, 15452, -10898, -78462, -67043, 14217, -66919, -152322, -165244, -136133, -77016]
25828g7016m8136j27665k9574Q4191R8719Q0736K6681m6446k9038k4293N2660
25817c9181L9504M2447N6859j1419j61214m3849N2582Q4504R0536k8965n5098
25806B6706n2146K670q8560J0553K6509O8615k3040K552P7854L9467J9884J5649
25794A26713p1534J0601j9021k4229l1037L5878J1598K7320k5810J2408l8867
25783A4020l3669k8831k0605Q1502J7998k8814N8342O840j5325L769R9926O0154
25771B15307n3432l4563j3527P890L9131p1403o6300k8909j9214O2281m6182j14626
25759a23547J72R3624N9191l6299j5295J1334m5090q631m0970o1135L1185L5943
25747i9518J734J23895J2954P4505K5758j02184l0148M5234J6696q1880J3406
$$ y = [-77016, -125152, -252817, -282391, -198200, -99481, -18745, 7936, -38510, -67548, -91841, -39181, 323, 42770, 99629, 88210, -73004, -116853, -64271, 20233, 110769, 81804, 26706, -25440, -22770, -111330, -100777, -74268, -5653, -28693, -26141, 51713, 91180, 111064, 126713, 55179, 65780, 46759, 22530, -8507, 27371, 38969, 66289, 40479, 52887, 14020, -19649, -48480, -69085, 12417, 30415, 1601, 59943, 66783, 51458, 55227, 155153, 215307, 161875, 127312, 113785, 121675, 160806, 89403, 23103, -5806, -25020, 37261, -8921, -123547, -123375, -29751, 29440, -6859, -22154, -10820, -55910, -64541, -105511, -166646, -135461, -99518, -97784, 26111, 39065, 113570, 139328, 37144, 6996, 52230, 68926, -12954, 452]
25736D52R8419J5766o5924n4280L4180l9345n9636N1960L8142n1140m8213J8184
25724f1435L5489k472o2776p092J4531O8582O3328n389l0867l835L6403m0106
25712D361j8450K2162n1692j41194J1588J59701j706l5442O1970J2017j1358l3202
25700b1245j1502n5268Q3410l7053m3598j8124Q732M1180J32168O1560o5871n1411
25688B2978j0438M557l0863O0067k1079j5122L0357K3106n2204Q2099M5145o1572
25676G7031l4503j5286n1608R285q8576M7569P0192L354n430K5061J6666l3666
25664B0089n5066L9771k5608O8597M4160n0884m035O9791j0490j0745o1565j9020
25652D995m2293m1678L6314P402j0612k0462M1943M375m7494J9336j6564k6839
$$ y = [452, 98871, 114637, 48713, -5567, 28613, -10732, -70368, -18408, 19734, -31406, -79619, -61435, -25946, -28418, -91194, -98286, -83755, -15173, 48155, 42766, 11899, 8064, 44467, 4361, -14089, 8073, -43619, -184813, -173225, -13524, -15230, -50672, 11298, 23315, 11957, -21245, -32747, -88015, -4605, -41658, -85256, -103380, -94648, -53468, 78700, 140260, 74389, 22978, 12540, 17097, -13766, 46301, 25222, 10100, 40457, 63563, 11359, 93458, 138603, 77031, 42528, 27242, -24366, -15081, -103657, -56088, 14104, 17458, 12028, 37089, 53755, 20089, -34977, 4794, -20814, 47783, 91943, 41059, 37024, 106815, 96325, 85580, 24015, 4995, -37298, -78976, -42662, -35260, -45872, -66334, -24391, -20016, -67510, -48174, -64738, -91577]
25640i1577J0982L888n749Q6677M3643K2412k087m6372O2544K5570n7185J8593
25628G1339l0546K5383P6024o8723j13263l1550Q5534k5592j9982J5939p144O6335
25616D3754O8338l4534o582j881n3688j257j6958p1063o367l7324K8341o4028
25604a53249l5887P2704j5408O3487O3695Q4033J2611j27578p0332J10738k368
25593B446K4900N1561J6281K3200k4774m1169j12914N6392J37583L1768m0740
25582A24534n6727J5978m043o5227Q303M3142K9295j4515j2666l8214k5062j3962
25570i164r6769p5984m659m433o32P3201M6287K5217L466q9717m2161P4371J04888
25557C911K5486m8214q7678j513P1749J15984K9719q5719k3674L4642m4575J9849
$$ y = [-91577, -80595, -76707, -82456, 4221, 47864, 70276, 68189, 21817, 84361, 109931, 52746, 71339, 40793, 66176, 142200, 73477, -39786, -71336, 14198, -11394, -31376, -15437, -22581, 43754, 112092, 77558, 70976, 69095, 15407, 14150, -2808, -73871, -80238, -117562, -89221, -153249, -189136, -116432, -131840, -68353, -4658, 79375, 91986, -35592, -105924, 4814, 2446, 27346, 78907, 95188, 118388, 93614, 52445, -60469, -4077, 133506, 165274, 124534, 67807, 83785, 79742, 14515, 22818, 65960, 95255, 80740, 68074, 29860, 4798, -9164, -105933, -181917, -186576, -191009, -191641, -118440, -72153, -46936, -43470, -133187, -175348, -100977, 3911, 29397, -18817, -106495, -108008, -36259, 79725, 109444, 23725, 51, 34693, -9882, 9967]
25545I967M5780L222m4428j05530j12193J02479N373n5658R3868j0664r7014K2156
25533a42642M5350Q8334N5190l8338l6623K5967K8441M1867N0874p9859o8061
25522b9500K82q5418p4177K1250K17949Q4928J6909j46132q4295Q0905R8221j1753
25510H9169n9593k6503l2630O6674K4306j3351K4505K561P0047q3269j45078r010
25498i2172R4989J04369j1916M6081O6194p6344j18891l0894P2748M2996n2669
25487D4491O1228R839k8948k7330O658n622J1615k0358Q532K7855L6775m8210
25475G6525m8679q7791J855q717n4253J682O3363L9143j1807J7996o3988O5019
25463i652O9789j669k5015m2755l7371k4307N831M735Q8070N1585k5108N0722
$$ y = [9967, 55747, 58969, 14541, -90989, -203182, -100703, -95330, -150988, -57120, -67784, -164798, -142642, -97292, -8958, 46232, 7894, -28729, -2762, 25679, 67546, 118420, 38561, -29500, -29218, -114636, -188813, -167563, 50386, 135314, 152223, 6091, -78204, 2701, 100922, 89169, 29576, 3073, -29557, 37117, 61423, 48072, 72577, 75138, 145185, 61916, -83162, -92172, 2817, 107186, 95270, 141351, 207545, 131201, 12310, -18584, 54164, 97160, 44491, 105719, 115558, 86610, 59280, 65938, 60316, 71931, 51573, 60105, 87960, 124735, 76525, 27846, -59945, -58090, -66807, -121060, -119378, -56015, -16872, -28679, -10683, -74671, -9652, 60137, 58468, 33453, -9302, -46673, -70980, -65149, -60414, 27656, 79241, 54133, 104855]
25451A04855j7695m9502m552Q8295Q4058n5364n4098n449o3316M3405O9863n094
25439A35406j11848o213l6744J9494M8297J0821o1958M2511j732o3981n9466M9106
25427c6307k8924m6631M3297k8K7051N3461K2177J4763k196J4057j6962q805k3020
25414A1933J02462r691j3170J4251m4479q1584J6950R2612l6423m9725M7303K52
25402E0691l3310k072k3633K7579J05781j3337r5845p3838l3470j5069L2110l425
25390g7838l4659J9125j3712R3346Q9610k9120l5817J899n0160J761M1051P201
25378A2687j9047L5146j2753N0723l9098L2172o515n6575j28m6316o3724j3410
25366a26838l9233O8757O1909j341q7321n2037J6185O8853m3325o8719r80P976
$$ y = [104855, 87160, 37658, 33106, 121401, 205459, 150095, 95997, 90548, 27232, 70637, 140500, 135406, 23558, 17345, -19399, 95, 48392, 59213, -2745, 39766, 38034, -25947, -85413, -36307, -65231, -111862, -68565, -68593, -41542, 11919, 34096, 48859, 46663, 60720, 43758, 34953, 11933, 114395, 104704, 91534, 105785, 61306, -20278, -3328, 89284, 52861, 3136, 50439, 50691, 17381, 15309, -8324, 19255, 125036, 111699, 15854, -57984, -91454, -106523, -74413, -77838, -112497, -93372, -107084, -13738, 75872, 46752, 10935, 12834, -37326, -35565, 5486, 12687, -6360, 28786, 16033, 66756, 27658, 59830, 53315, -3260, -3388, -49704, -113428, -126838, -166071, -97314, -35405, -36746, -124067, -176104, -159919, -91066, -134391, -203110, -204090, -196114]
25354a96114j5732Q2337P5017N0591N9678j6056J6279O7739J6381L8235j9210
25343A59145n4801n6409n715k9707P685r3508K1906J9632j5705K0028P5133M7889
25331I5573p5325n3527M615j6927l7604N1991O928r304m201J17567J8527P2354
25319A70667R212J925M222K9652l8992o9582p9307n2700n4539l2352K0556n7664
25307a48902K4142M3386K8941R6N3234L2713j2407o6191L546L9044K1642j5310
25295C934l5746o3967j11499k4978O5414J00263J8857j3277K9791k0662O363N1725
25283F218m2309m2459J2158j8357m0409p616P2917J23583n813O528n112P4862
25271A34191K502l3004l5158o0683o4520r311q1544q0774R1314J07513K2958n8903
$$ y = [-196114, -211846, -129509, -54492, -3901, 55777, 39721, 56000, 123739, 140120, 178355, 159145, 104344, 47935, 42220, 12513, 20198, -73310, -51404, -31772, -47477, -27449, 47684, 95573, 20248, -33279, -28664, -45591, -83195, -31204, -24276, -33580, -37781, 79786, 98313, 170667, 179879, 181804, 186026, 215678, 176686, 107104, 27797, -24903, -79442, -111794, -91238, -148902, -124760, -81374, -52433, -52337, 897, 33610, 21203, -44988, -41442, -2398, 19244, 3934, -31812, -95779, -207278, -232256, -166842, -66579, -47722, -60999, -31208, -51870, -45507, 6218, -36091, -78550, -66392, -84749, -125158, -132774, -59857, 63726, 57913, 64441, 59329, 134191, 136693, 103689, 68531, 7848, -56672, -65983, -147527, -228301, -136987, -29474, -6516, -65419]
25259f5419O413k6943l7585M6385O9836M097K0771q3367j1269j4370R1957Q8452
25247H8958R129o7175p3115J1666L7771P458N543r4407N0723P5874N2734j0433
25235I4726r1957l4384J0884R0130R1107N1481p8110j10429R839L6507L0065q3664
25223A6195k7023j951K7482k303J4309P2414O203o0221j06568n2885P4236J24130
25211H4018O2760k2954k6798l5362j35763m3739Q5845P1467Q6910k2842n8941
25200D4601K7852n4002k8380L1081J23284j7991j41116l3778L5605l535L8622
25189B2243r869K0237k374K0443L0751M5599o143r3642K265k5199K2412l1574
25177d851l2893Q776J3775k9728J7487m176n3121J3630n4209J1455J31329L3001
$$ y = [-65419, -59006, -85949, -123534, -77149, -7313, -3216, 17555, -65812, -77081, -91451, 506, 88958, 98087, 30912, -42203, -30537, 7234, 14692, 20235, -74172, -23449, 52425, 105159, 94726, 2769, -31615, -20731, 69399, 160506, 211987, 133877, 23448, 33287, 69794, 99859, 16195, -10828, -12779, 14703, 12400, 26709, 99123, 105326, 45105, -61463, -114348, -40112, 84018, 146778, 123824, 97026, 61664, -74099, -117838, -31993, 39474, 126384, 103542, 44601, 72453, 18451, -9929, 21152, 144436, 126445, -14671, -48449, -12844, -16379, 22243, 12374, 32611, 30237, 50680, 81431, 127030, 120887, 27245, 29510, 4311, 26723, -4851, -37744, -28968, -15193, -44921, -27434, -31610, -84731, -71101, -125310, -113855, 17474, 50475]
25165E0475j22708k3544O6297J3134m4929j19885l2255J6779P8026K1830J8330
25154g8450M5456K380l5602o906M9641O5346M0367m4282m7443k4593j0796P325
25142c7557o2119R251k098l6731Q6114O180p824j5737N7498j8079Q015M8512P4133
25129A09558n8076M4787N2275m4582r0590l7598j8254K5274o7385k745O0952m3430
25117f9814m991P2167l9481K788K0637k1397K8914N6365n6973R503P7277N5505
25105A30500o1827m5195K3735K4866L6256N7668K8699k8871l4124k0487j19336
25094h116n8905J0095L8481K4254o1251r4240p2856J907N2708P9324N3335m350
25082c9614j4229L3472Q0540j4791q2959q246N5159K895l9367o672l8242n6837
$$ y = [50475, -72233, -95777, -29480, -16346, -61275, -181160, -213415, -196636, -118610, -96780, -78450, -32994, -30614, -66216, -73122, -23481, 41865, 82232, 37950, -9493, -34086, -44882, -37557, -99676, -90425, -92523, -129254, -43140, -36960, -44784, -60521, -3023, -21102, -13087, 35425, 109558, 51482, 96269, 148544, 103962, 13372, -24226, -42480, -17206, -84591, -87336, -26384, -69814, -74805, -2638, -42119, -39331, -18694, -40091, -11177, 45188, -11785, -2282, 74995, 130500, 68673, 23478, 47213, 72079, 108335, 166003, 194702, 165831, 131707, 111220, -8116, -67021, -56926, -18445, 5809, -55442, -149682, -222538, -220631, -167923, -88599, -35264, -39614, -53843, -20371, 60169, 45378, -37581, -45827, 9332, 12227, -27140, -33812, -72054, -128891]
25070a28891L089P4999P7412L4420K0874j2635l8048P8136j7158j53400Q3057
25059B1855j4640M779N9123k6123o7894O3636k0345m9547n346m9494j6751P9956
25047b0791J991k9178O2484N2584J8483K130J802q4429k1406K8393k0108k3069
25035c1114Q222o6747J4296N5380N1509N0958o2739j6246q62N4452P4152k5888
25023A05373j12167q241j4011m9286P670L0776M8632J3272j5203k1307M0014J20555
25011A46077m7656m3319J8079k6374j1720L1439L4871j4491o7576J9186J5408
25000E3924O5289j2507l8296Q2988P2769k3962j30738n5506j134K9723K6705K2337
24988I1592L2339j01761J100O7717o3515n527J5715m2895L6432n385p9879p9110
$$ y = [-128891, -125802, -50803, 26609, 61029, 81903, 69268, 31220, 109356, 92198, -61202, 21855, 7215, 11994, 71117, 44994, -22900, 40736, 20391, -29156, -34502, -83996, -100747, -20791, -18800, -47978, 14506, 67090, 85573, 87703, 89505, 5076, -16330, 12063, -8045, -31114, -22892, -89639, -75343, -19963, 31546, 82504, 19765, 3519, 2657, 57109, 131261, 105373, -6794, -15035, -29046, -78332, -70662, -39886, 8746, 22018, 6815, -14492, 25522, 146077, 98421, 55102, 73181, 46807, 35087, 66526, 101397, 86906, 19330, 38516, 53924, 119213, 106706, 68410, 151398, 224167, 200205, 69467, 13961, 12827, 42550, 69255, 91592, 123931, 22170, 23270, 90987, 27472, 21945, 37660, -5235, 31197, 25812, -54067, -133177]
24976a33177N4610j1291N6380J01086K4890l6772p2836O6383R3725j9904n3508
24965F9586O176P116M10J6259p7437M6331N4922q9394r5073O3735P8141l6451
24953D4321m2114j6549Q0886P4638J8953j0237R611M3688m6805j12310P6375n3737
24941F6720n2J7091K4872l8300j8798q8696n1368R940K8747L9656l8618k9196
24929g8002J0110o316L5370O9231j9452k9859K7957q5269l8981R7600J0461J1096
24917C946j0268k873L4706q0516l2083J2807K0740L4157M0968K7819o890m6921
24905d408J835K8991K6501q7847m7536q277k9145P7326J09197M2252J6278L5347
24893A60514l0829q8661n9216J6539L4375n2824j283l729n0485L2610N4520L3137
$$ y = [-133177, -78567, -89858, -33478, 67608, 92498, 55726, -17110, 49273, 142998, 123094, 69586, 75762, 82878, 83288, 99547, 22110, 68441, 123363, 33969, -61104, 2631, 80772, 44321, 2207, -14342, 66544, 141182, 160135, 149898, 159509, 203197, 156392, 44082, 120457, 66720, 66668, 83759, 108631, 70331, 51533, -37163, -88531, -78591, -49844, -10188, -48806, -78002, -67892, -74208, -38838, 30393, 10941, -18918, 9039, -76230, -115211, -17611, -7150, 3946, -6322, -9195, 25511, -55005, -87088, -74281, -53541, -19384, 21584, 49403, 42513, -4408, -2573, 26418, 52919, -34928, -82464, -90741, -119886, -42560, 66637, 108889, 125167, 160514, 129685, 41024, -18192, -1653, 32722, -20102, -21385, -25114, -75599, -42989, 11531, 44668]
24881D4668J9501l2037J5945l584l7611k0305q375j26283n4157L2487L1800k2842
24869a60793J2969L7832J21624Q7229j02062p4301L1384L5545l3726l3128K1052
24858e6375j2259J6816K1039K4660r4023L7058P8779K5617m7817K8672j3426m660
24846D081L5766J7286n2702M467J08819J4912n8592J627K0797L6208m6357K4451
24834A10763k7027k0086j7697m5803R702n5708k4909Q6880M5136k3131l5011K9653
24822C2762M0173n897k4638M0012m1025M0189j0947n8952J3909L8548j1273P585
24810F0446K6351p0034j9042m8531M5082n3056J8273r997m0234R0130L8614l8253
24798b51L0385j869N106l6237j42334n0269R8460N3796m1835k8495O2368P0875
$$ y = [44668, 64169, 32132, 48077, 44493, 6882, -13423, -21798, -148081, -202238, -169751, -137951, -160793, -147824, -109992, 11632, 98861, -3201, -77502, -46118, -10573, -44299, -77427, -56375, -68634, -51818, -30779, -6119, -100142, -63084, 15695, 41312, -6505, 22167, 8741, 4081, 39847, 57133, 4431, 8898, 117717, 132629, 74037, 75664, 96461, 132669, 86312, 110763, 83736, 63650, 45953, 150, 9852, -45856, -70765, 16115, 61251, 38120, 3109, 32762, 72935, 67038, 42400, 82412, 41387, 81576, 70629, 11677, 25586, 64134, 52861, 60446, 86797, 16763, -2279, -50810, -5728, -58784, -40511, -50508, -90742, -612, 38002, -251, 30134, 28265, 33371, -2866, -145200, -195469, -97009, -43213, -85048, -113543, -51175, 19700]
24786A9700J0649m7420n2125o8802L7205L5400o1861N5969J3182j18382j10303
24775b86788P2687J77668J25970R9173L8335m588m6243j35880N665J07759J2449
24764A66207l3607p8724o866o4450m0377N3402L1412k5516p839p045k7985k4441
24752f5829r475O9952L4908L5090O252j02311o1567O4421n2962M2670N8954j6264
24740C839P319m5158l5983L0931O2517J07644Q9289l131j1564r5003p0686k8332
24728A1682r7607j7474M8951R3137J1521N7438K0181m7005l3409N5153j7264n9297
24716B6007q144J5755l3799K5840o8755m9401Q3157J06100M569l461M3832k3596
24704A18104r1077m1017q637r206L5178k0589j3452m1854Q9067O4744K4819l5235
$$ y = [19700, 30349, -17071, -69196, -137998, -100793, -65393, -127254, -71285, -58103, -176485, -286788, -214101, -36433, 89537, 188710, 227045, 222457, 176214, 40334, 45999, 153758, 166207, 132600, 53876, 47010, -17440, -57817, -4415, 26997, 1481, -6358, -13403, -41388, -65829, -75304, -5352, 29556, 64646, 70898, -31413, -92980, -28559, -81521, -38851, 20103, 3839, 11158, -34000, -69983, -39052, 23465, 131109, 220398, 217267, 205703, 110700, 40014, 11682, -85925, -103399, -54448, 38689, 50210, 107648, 127829, 80824, 47415, 102568, 85304, 26007, 17863, 33618, -181, 25659, -43096, -92497, -9340, 96760, 101329, 97868, 141700, 118104, 27027, -13990, -22627, -31833, 3345, -17244, -30696, -72550, 16517, 81261, 106080, 70845]
24692G0845q2260j359p97L4238k3490p08m9475m3872L0625K8801o7853m909K8653
24679h1561M0791O557M1186K5140j0454n2668M0007L3227p2414q5054j7060M7677
24667h4626J18648n446p8515L0519O3706k8237l4983J2712m0034r4841p5144l5232
24655b51473O0236Q8414L8232k0236O7618o5089N7869P8622M5245r7898n2105
24644e0565P0247m903n6325J2138J8132Q0242R300j9819n767m0927M0370k656
24632D9467p2784K2449l2944k2808K2995k2152r386L1265J1928m5724L1120O0113
24620B3539o4685M9373K2513j9792j437J5031J4752j7113M272O7701K9632R1834
24608B15620l9681j39050l7339R1587J0491K5356j5074r0322p4873L3172Q0684
$$ y = [70845, -11415, -12774, -13571, 20667, -2823, -3531, -53006, -96878, -66253, -37452, -105305, -110214, -81561, -40770, -34213, 6973, 32113, 21659, -31009, 8998, 42225, -30189, -115243, -132303, -84626, 34022, 28576, -49939, -19420, 44286, 16049, -18934, -6222, -46256, -141097, -216241, -251473, -191237, -102823, -64591, -84827, -17209, -82298, -24429, 54193, 99438, 1540, -50565, 19682, 14779, -41546, -29408, -11276, 68966, 78266, 58447, 52680, 11753, 52123, 49467, -23317, -868, -33812, -56620, -33625, -55777, -65163, -33898, -21970, -67694, -36574, 23539, -41146, 8227, 30740, 10948, 9511, 24542, 39294, 22181, 26453, 94154, 123786, 215620, 175939, 36889, -450, 91137, 101628, 126984, 111910, 21588, -53285, -20113, 60571]
24597F0571P7086N5916j29704j35482m9833l7895L7982L6363P611J01756L3092
24586E7463q4430l8215L0514J0822j6723l8866j00268j1806J03988Q6980R1395
24575I0854j9105o4143R158o6196N0767N8979O012n1403j00445j0802P1012J4211
24563a1101p353P4910M2465l4864m8078l5566K2871l2052n5766l7979M3664Q476
24551g0373L8923P1363Q6489M0765o1434q983n3489J4808Q9111p3198p288P3536
24539A40230l8245R42k6145m3153J4893N7820j2944m8022L6093m0200j2254K007
24527C1022R243j1158l8757p0569K4720O9830N6009k1638j12406k4945M9995O5764
24515B7110k4584j614l2148l4019l5273K7898P3159P5902L8007m7314J097n9551
$$ y = [60571, 137657, 193573, 63869, -71613, -121446, -159341, -121359, -84996, -77385, 24371, 57463, -26967, -65182, -34668, -23846, -40569, -79435, -179703, -191509, -87521, -541, 90854, 71749, 7606, 16764, -49432, 1335, 60314, 66326, 14923, -85522, -96324, -25312, -11101, -18454, 56456, 98921, 64057, 15979, -19587, 3284, -28768, -84534, -122513, -78849, -70373, -31450, 39913, 126402, 167167, 105733, 96750, 43261, 58069, 147180, 73982, 66694, 140230, 101985, 102927, 76782, 33629, 48522, 106342, 93398, 45376, 81469, 41269, 29015, 31022, 40265, 29107, -9650, -80219, -55499, 14331, 70340, 48702, -63704, -88649, -38654, 27110, 2526, 912, -31236, -65255, -100528, -72630, 529, 76431, 114438, 67124, 68221, 8670]
24503H670k7134p6559p0100P1385O6559J628K3264j2204p8541J23864J05640j5770
24491A20702m657K2670j01172o4336o9362p0986N5968k4615K5238J5167K0371
24480g5012O5001J6768l9268K6650L3014k1691n5254m0447m556P3939J9121J1490
24468I755k6184k5480L7847M8578p45K0723Q2411m5443l8110j7291m73N8559q989
24455I5158l1765L6124p952n0983m8610L219N2782n1536m7894l7224j7887N8344
24443d8224O2153K5018O0129j2590q7483J5420M3801Q7506k1000q9950p3458j09302
24431a47980J6425L6744M1720M3442J3305L9567p3273j21139K2747M5234m6650
24420a29858l5713M740P3816Q1420R4804L1981l7127J4789o4055l4125n5737o6352
$$ y = [8670, -18464, -95023, -165123, -93738, -27179, -25551, -2287, -14491, -93032, 30832, 136472, 120702, 116045, 138715, 37543, -26793, -96155, -167141, -111173, -135788, -110550, -95383, -75012, -10011, 6757, -32511, -5861, 27153, 5462, -49792, -90239, -94795, -20856, -1735, 9755, -16429, -41909, -4062, 44516, 43771, 64494, 146905, 101462, 63352, 46061, 45588, 104147, 95158, 63393, 99517, 91565, 40582, -8028, -4809, 47973, -3563, -51457, -88681, -106568, -48224, 13929, 38947, 99076, 86486, -997, 14423, 58224, 145730, 124730, 34780, -38678, -147980, -131555, -94811, -53091, -9649, 3656, 43223, -30050, -151189, -128442, -83208, -129858, -165571, -160831, -87015, -5595, 89209, 121190, 84063, 98852, 34797, 672, -55065, -121417]
24408a21417J047K7855o482k4130k3000K6921L027R2951j6618l7398Q008M4180
24396b5056j1307q6971k0249N4747M6331N2744N8985k8509m9989m7649Q1871N6394
24384H1342k6115m5154o3248l2291K6208J692N3271J0063K50R908m1932J921L2187
24371H102M7806k7621J119N1319P374m9467Q8025K3023q0893m0077q4047L7203
24359a8134J46815P7389n9447o8466r3141l8307J03659J8740l9259j7975q9580
24348g7706r5063L0455L8077J02123R4280k5107N7334L5595q0058j48147M152
24337f4065J43890P4840j19681j65514L0091M5857Q000N5062l1733k5289O0309
24326A1767P2266K854j47112p1558R9317O2069L2779K6865l3467n3809n6820J2827
$$ y = [-121417, -120370, -92515, -98997, -123127, -146127, -119206, -116179, -23228, -39846, -77244, -69236, -25056, -36363, -123334, -143583, -88836, -42505, 10239, 69224, 40715, -9274, -56923, 24948, 81342, 55227, 10073, -53175, -85466, -59258, -57566, -4295, 5768, 6018, 15926, -26006, -24085, 8102, 55908, 28287, 29406, 80725, 88099, 38632, 126657, 149680, 68787, 28710, -55337, -18134, 128681, 206070, 146623, 78157, -14984, -53291, 50368, 69108, 29849, 11874, -77706, -172769, -142314, -104237, -2114, 92166, 67059, 124393, 159988, 79930, -68217, -64065, 79825, 154665, 34984, -130530, -100439, -54582, -46582, 8480, -23253, -48542, 11767, 84033, 86887, -60225, -131783, -32466, 29603, 62382, 89247, 55780, 1971, -54849, -42022]
24314d2022O7797L3929p8845l4759m4588l4856P594M1330M5876P9405K0601K6814
24302H8276o4492q3692K7534R3047K2586o3292l3842J31641K4945O175j8210n2567
24290G8109n3562L0272J75339l4800j15773n2540K5828m5166n7033L1233l2516
24279e0609K7652L5059M0590O0112k5043k6621N8302k973J3628k4762M9602l294
24267A51643K316m7649q056M6481J6751r3326j52073M5910J35217k9254l1132
24256C6828k0807K9121N6476m4165j83585q2545K5568L1464Q5593O6540l8403
24245c7915r184n6912k5489R9877O5078r3809k095j7297j26315N1017Q8151N0835
24233a4058M8620q1709m2045J6426L3137J5824J9257j01236M4715R4737j7707
$$ y = [-42022, 25775, 59704, -19141, -53900, -98488, -133344, -125750, -84420, -38544, 40861, 61462, 88276, 23784, -59908, -32374, 60673, 83259, 19967, -13875, 117766, 142711, 148886, 130676, 78109, 24547, 54819, 230158, 195358, 79585, 27045, 52873, 7707, -49326, -18093, -50609, -22957, 12102, 52692, 112804, 87761, 61140, 119442, 116469, 130097, 105335, 154937, 151643, 153959, 106310, 98254, 144735, 161486, 68160, -83913, -38003, 97214, 67960, 36828, 16021, 45142, 101618, 57453, -126132, -208677, -183109, -151645, -66052, 488, -37915, -47099, -104011, -129500, -29623, 35455, -58354, -60449, -77746, -204061, -153044, -64893, -14058, 34562, -47147, -89192, -72766, -39629, -23805, -4548, -105784, -61069, 33668, 15961]
24222A5961K8032K8264l9539j47601o6718J28710Q2938k2753K1999L6596o3038
24211B851r320k3540L8575o0597r404M4801j855J10586j661o5300K7285J6882
24199F9303o2377l2407k4052Q4449k6118N668L6088o8596l6485j9902L121L883
24187f7425J4240m055N9801p2939o2180l025R4382M6103N0083O1827K644M0285
24175A59741J7226k2849r5961M213J5526r1761K2202K9887j1836J3732j29050
24164h8930P369P7768J2474q661O3947K323m0295K2454l5666R516M5369k1512
24152D6156n3006P0260K7784o2400n0656q4824l1448k0370Q3115Q8692o3594m2138
24140i2429K09K5127N0988l5292o2360J0354O1390Q1753P3606p0401Q250K8687
$$ y = [15961, 43993, 72257, 32718, -114883, -181601, -52891, 30047, 7294, 29293, 65889, 2851, -6469, -30009, 8566, -52031, -61435, -16634, -18489, 92097, 90436, 25136, 52421, 69303, 6926, -25481, -49533, 34916, 8798, 14466, 50554, -18042, -54527, -74429, -71308, -67425, -53185, -57240, 2561, -70378, -132558, -135583, -41201, 4902, 54985, 116812, 119456, 159741, 176967, 154118, 58157, 62370, 77896, -13865, 8337, 38224, 26388, 40120, -88930, -81561, -3793, 8681, 20, 63967, 66290, 25995, 48449, 12783, 22299, 67668, 46156, -6850, 63410, 91194, 28794, -21862, -106686, -138134, -158504, -75389, 13303, -50291, -92429, -92220, -67093, -16105, -51397, -113757, -103403, -42013, 39740, 113346, 42945, 51195, 79882]
24128G9882O1780O7369k7120N2184P791q311p1701k5282K011n6531q1170j7144
24116a6242o577N5567K4994N1923o4457k9781K7113j981k8138L6708J16386J0902
24104A76417j04280l6620j044l9580M6361K7852m07K4707r163m1677j56355J7601
24092i6188L2254p93M1540K1329O9007M9646m0181j17778p545J07626M4680J0934
24080A14531o6377K6687R4730j6535j2685j61520j77850O6478O1527M2577j3885
24069d2322j030K7471L491j8382K3128O0395Q7188J5570j0818j52882p8656r6
24057h6943K3824J8312k8364R1755K2287L8278p1169j22253M1741K5359Q040m6028
24045h5161j0386L6355m287K0598M2495q2388p1363J0065R3476O9313K9967o7149
$$ y = [79882, 141662, 209031, 181911, 234095, 241886, 233575, 161874, 136592, 138603, 82072, 902, -16242, -22819, 32748, 57742, 109665, 45208, 15427, 42540, 40559, 12421, 49129, 165515, 176417, 72137, 35517, 34473, -5107, 41254, 69106, 68699, 93406, 84243, 42566, -113789, -96188, -63934, -64727, -23187, -1858, 67149, 116795, 76614, -41164, -48709, 58917, 103597, 114531, 48154, 74841, 169571, 153036, 140351, -21169, -199019, -132541, -71014, -28437, -42322, -43352, -15881, -12390, -30772, -7644, 52751, 139939, 155509, 144691, -8191, -86847, -86943, -63119, -44807, -73171, 18584, 40871, 79149, 7980, -114273, -72532, -47173, -39133, -85161, -95547, -59192, -63479, -42881, -386, -82774, -154137, -144072, -50596, 18717, 48684, -18465]
24033a8465p6226n1696O9807P2078j8524L2065L4840l4609J1928L6807k047L0619
24021H6577n1693r8908J4815j3162L4981L8178N125j0213q4489n8315K0253R1269
24009b5582J38963p361p1150m4294q1240K7668l5175p6205O020P2228M8945L832
23997d3351L8961J0856J1234K5059o1767p3974j60m034K5131J2691K6214n046
23985c8186K703m4108p8472M4539L1595L4707R252J06374M3312n3347J885k5484
23973C4770p238L1476L4669J33539J10240o6988n5293n7916j36821J6674j6249
23962B0863L1063R788M9446J0317M7547J5900p0630n2930J1254o1266l6229M4390
23950A9513M8728o883j8560N5853j7278o1285k7270M766N3736J1179k3781q1998
$$ y = [-18465, -94691, -146387, -76580, -4502, -23026, 9039, 43879, 9270, 21198, 58005, 55958, 86577, 34884, -64024, -49209, -62371, -27390, 10788, 15913, 5700, -78789, -137104, -116851, -25582, 113381, 106020, 34870, -9424, -90664, -62996, -98171, -174376, -168356, -96128, -47183, -43351, -4390, 6466, 17700, 42759, -19008, -92982, -93142, -97176, -72045, -59354, -33140, -38186, -35483, -79591, -158063, -113524, -81929, -47222, -37970, 68404, 111716, 58369, 60254, 34770, 27532, 59008, 93677, 227216, 337456, 270468, 215175, 157259, 20438, 37112, 20863, 51926, 61714, 111160, 121477, 169024, 184924, 114294, 61364, 72618, 11352, -24877, 19513, 68241, 61358, 42798, 98651, 81373, 20088, -7182, -2416, 51320, 62499, 38718, -43280]
23938d3280j16127o184J73229P6770n813k6195N7796j01477p0995J01675O8683
23927A08082q5799J8464M0572o4873J5754j0556J0599O3495O4484l2132l839m9348
23915G4903n9399m4169o4639J835J5706Q5619L8408K5748K3890o2182o5643J3936
23903a5987r14k1657m0498n7119R9066Q4877M4592l6487m6440J8142L5892l8101
23891B5366m6606P6886j7723l5224n2424O3131K5462m2947K8923K1337q0156m9126
23879h3101m4755L4003N8770j0266J07283n802j12430k6819q874K0437N1951r1275
23867a10878l2789Q064O6582K0584l560M1496L3642k8138K4092P2410q5075j66260
23855a59830M2725N0409j6290P7216J02412j7681q8282l5072K1838n35O381r785
$$ y = [-43280, -159407, -165591, 7638, 84408, 78595, 52400, 110196, 8719, -62276, 39399, 108082, 22283, 40747, 81319, 16446, 32200, 21644, 32243, 95738, 160222, 128090, 124251, 74903, 15504, -28665, -93304, -91469, -75763, 9856, 48264, 74012, 97902, 35720, -29923, -15987, -16901, -38558, -79056, -136175, -37109, 47768, 92360, 55873, 9433, 27575, 63467, 25366, -21240, 55646, 37923, 2699, -49725, 13406, 38868, -4079, 24844, 46181, -33975, -83101, -127856, -93853, -35083, -45349, 61934, 56132, -56298, -83117, -91991, -71554, -19603, -110878, -143667, -135603, -69021, -48437, -51997, -10501, 23141, -4997, 19095, 91505, 6430, -159830, -117105, -66696, -82986, -5770, 96642, 78961, -9321, -44393, -22555, -23090, -16709, -26494]
23843b6494l1057K1740Q92m8304N0921M0444M307j4711l7950r2325K8090L3166
23831g1281N6518J25147P751n206J0858R9501P794o1993j3441P5656n4124J5896
23819A93076N2097m9518j39583j02314P5336R2365J4775q553o078J9776k8669
23808A12710l9351k5757j1293p2076L047L6087N1280Q5284q1869n2695j4170l3543
23796d2346q1743p8900J4279J01781Q1314n3253J6041J47173L7890p4131p261
23785F0844J4454k3784K2781Q615p4727l430K6032j9941q302J00009J4291m8886
23773F7956l0614Q3909k5000p9286k9886L7722J21653P0759o5942Q248j40655
23762A8864n6184N5968k64M3369J1667J3252l5888o059k5514M4099Q8618M4273
$$ y = [-26494, -57551, -35811, -34919, -83223, -32302, 8142, 12449, -2262, -40212, -132537, -104447, -71281, -14763, 110384, 118135, 112929, 123787, 223288, 231082, 169089, 155648, 231304, 177180, 193076, 245173, 195655, 56072, -46242, 29094, 121459, 136234, 127681, 121603, 141379, 112710, 73359, 47602, 36309, -35767, -32720, 3367, 54647, 139931, 58062, 5367, -8803, -42346, -124089, -202989, -188710, -86929, -5615, -58868, -42827, 104346, 142236, 68105, 60844, 75298, 51514, 74295, 82910, 8183, 4753, 30785, 10844, 2542, 102551, 116842, 67956, 37342, 121251, 96251, 16965, -12921, 24801, 146454, 217213, 151271, 159519, 18864, -37320, 18648, 18384, 61753, 73420, 86672, 50784, 44725, 19211, 63310, 151928, 196201]
23750A96201l7294k9756j1615r9832l2209L4268L7303l1063k694r595n2933K8296
23738a0923R591l5420k0747N2138K2902m1854m6628k7754N9999L6078q5p189M243
23725e649J8354J6691m1584J5443R3852L0303q9032j08471o3113l6080O6302n0772
23713a53756n2232N7278M5684Q3553R0764L775k8122J3912Q0932K766l2648K9218
23701A41124m7618p9506l499Q177o1537j4910J53N2397q37M720m5476j03430P9227
23688g1015N1242K1790J8272O5426K8265j1680q697n7038m4577o5683J1805J2121
23676d9769q591M156N7134j4897m4458o1940R1656K8377M1137L1948m0335l7037
23664b619N6318k3182k2247r844o8254o5744Q2191Q5040L4895N727R398N1579
$$ y = [196201, 158907, 129151, 117536, 17704, -14505, 19763, 57066, 26003, 23309, 13714, -39219, -10923, -1332, -36752, -57499, -5361, 17541, -24313, -70941, -98695, -38696, -2618, -2703, -9892, -5649, 12705, 29396, -12188, 3255, 97107, 127410, 38378, -70093, -133206, -169286, -102984, -153756, -205988, -148710, -103026, -19473, 71291, 75066, 46944, 60856, 141788, 144554, 111906, 141124, 93506, 14000, 10501, 18678, -42859, -57769, -57616, -5219, -6056, -1336, -46812, -150242, -71015, -19773, 2017, 20289, 85715, 113980, 102300, 93603, 36565, -8012, -73695, -61890, -49769, -58360, -54204, 2930, -11967, -56425, -118365, -26709, 1668, 42805, 74753, 34418, -2619, 53699, 30517, 8270, -1574, -69828, -135572, -53381, 31659, 66554, 72281, 81679, 133258]
23652A33258L1045n9413n2697L9399L3164o1594l8191l3079m9423J357k0701o0430
23640a37305J50151K6220j03790n3310k9871P90O4757k6611O3553K9678l7184
23629e2922O1234P2813N5610Q683l0981j14011m0493O5454P3692K6653o1596o5889
23617a753j5169N8968m2234L6993j8734n5498o0523k2235O1139N6804L8382o6157
23605c0017J3690O0852l0569m3920M2140m3079j1428M6047J08790k3119r3500
23594d113N9033K0585r9722J1291k8357n7359m9821j4729O1322L5782j7811o2384
23582a46283Q987Q5448k2173J2396m8368n7957p400M4407P3778N7392N2463M0398
23570I3088L9752J0620p9797p2794k892N5397n9717j0511Q0240N7398p2198m059
$$ y = [133258, 164303, 104890, 52193, 91592, 124756, 63162, 24971, -8108, -57531, -56174, -76875, -137305, 12846, 39066, -64724, -118034, -147905, -147115, -82358, -108969, -45416, -15738, -52922, 8312, 81125, 136735, 145418, 114437, 426, -40067, 25387, 99079, 125732, 64136, -1753, -16922, 42046, -188, 36805, 18071, -37427, -97950, -120185, -59046, -2242, 36140, -30017, -16327, 44525, 13956, -29964, 12176, -30903, -42331, 3716, 112506, 89387, -4113, 54920, 75505, -24217, -12926, -41283, -98642, -148463, -163192, -101870, -66088, -83899, -146283, -137296, -51848, -74021, -61625, -109993, -167950, -175350, -130943, -57165, 227, 52690, 93088, 132840, 143460, 63663, -9131, -12023, 43374, -16343, -26854, 53386, 110784, 38586, 34527]
23558C4527l727L4133M0947o4182L865K5257l443M42j8733n142N3278k1622m5904
23545B9696j3058l0563j0904O7342M2891O4568L6244k6151l794j2756J5172L0975
23533A89662l4112k5003M6905k6575r1650o8359K3673l6950q517Q0772K3081p688
23521F5239J0646m4915o0499K2753K8855j9178o514N1817R0731l5055o5286j9718
23509A8876o3774l6192L4040j6003k4447L7294J9921n6241O0913J6628J1678J7587
23497B0280Q684L9803M7662k3062l2059N6844R920n3745l1955o518q1009K2176
23485b2979j8431N7826L630n8870K5786M0213N8155J0106J7122j7849j0321j8820
23473F5568J4256M904j9181N6408o1383m3748Q4148J1030j01082m1638K540R0015
$$ y = [34527, 30800, 64933, 105880, 41698, 45563, 70820, 67377, 67819, 49086, 43944, 97222, 75600, 29696, 16638, -13925, -24829, 42513, 85404, 149972, 186216, 160065, 156271, 143515, 158687, 189662, 155550, 130547, 177452, 150877, 59227, -9132, 14541, -22409, -30926, 49846, 72927, 65239, 75885, 30970, -29529, -6776, 22079, 2901, -3613, 48204, 138935, 103880, 38594, 18876, -44898, -81090, -47050, -63053, -87500, -50206, -30285, -86526, -25613, -8985, 2693, 20280, 28964, 68767, 116429, 93367, 61308, 118152, 128072, 74327, 42372, 35854, -45155, -22979, -41410, 16416, 20046, -38824, -13038, 27175, 85330, 95436, 112558, 94709, 84388, 65568, 79824, 84728, 65547, 121955, 60572, 16824, 100972, 112002, 10920, -30718, -28178, 61837]
23461F1837K8702L267r691M090J9015r7443k4584k4628J3963k8116k4451L8863
23449c9176N3364O9350m960M4638N074l5873m5570N829N6392K0865m3938l5886
23437E0109r847m3712o776k7471q5720J0007M9498j2698p732o0280J0391o956
23425a41187m9268J2119J1487P5891j6765K9606r507j2795M2930K3557O5988j8381
23413A3675o4025j9927K7193J2316O2943q887p1187m6299m3808M6610N1632m4892
23401h4656K6425M2657O0520O0457M2686o7162j32753O909J1002l1714O8453m8932
23389d6108p620L2276L0352K1352L9153m2888J1084P8730J0358j03514l5246N377
23377f694R2617K9465n5077L6677k3328j01283j3085K8323j0333R551M8907P1041
$$ y = [61837, 90539, 93806, 84115, 88205, 107220, 9777, -14807, -39435, -25472, -53588, -78039, -39176, 14188, 83538, 78578, 123216, 128290, 92417, 46847, 52676, 109068, 129933, 85995, 50109, 40262, -3450, -10226, -37697, -123417, -113410, -63912, -76610, -84342, -144622, -134231, -141187, -190455, -178336, -166849, -90958, -107723, -78117, -87624, -100419, -57489, -33932, 32056, 13675, -50350, -70277, -43084, -30768, 32175, 23288, -47899, -94198, -138006, -91396, -39764, -84656, -58231, -15574, 44946, 105403, 148089, 80927, -51826, -44917, -33915, -65629, 2824, -46108, -53728, -21452, 8900, 30252, 69405, 26517, 37601, 116331, 126689, 23175, -12071, -6694, 85923, 115388, 60311, 96988, 73660, -27623, -40708, -12385, -22718, -13167, 35740, 106781]
23365A06781n7694r0369R2321L1849o0818l2039Q6133L9483p9212L0479M7582
23354A14496J9406k8032L4433J18015q8922n1431m9311J5535J1985P6740n0537
23343A22377k0952r7442j2341N078j7109j5635K674Q1134P5515J15943M722k8954
23331B15010M5643M5502Q6346Q0799J71498K23127J96322K30217L73379O38464
23321B306307N40980l70973r24096p04011l30996j54506j30282m8610R155n4636
23311A38332k7405j3405o6358k4836O6867O1536o2915r9447m0353L9692L4663
23300F371J0112O3739M3593j25658r6988m188J1456K9421N1371K1517O6265l2013
23288D4998j8327N2331j3539p2117K8363J1466k2680P574o4037m9628J21476N7289
$$ y = [106781, 49087, -41282, 51039, 82888, 22070, -9969, 76164, 115647, 36435, 66914, 114496, 133902, 105870, 140303, 258318, 169396, 117965, 68654, 84189, 96174, 172914, 122377, 101425, 3983, -8358, -3280, -20389, -36024, -33350, 47784, 123299, 239242, 243964, 215010, 260653, 306155, 392501, 473300, 644798, 867925, 1064247, 1294464, 1667843, 2306307, 2847287, 2476314, 1552218, 848207, 517211, 362705, 232423, 183813, 192968, 138332, 110927, 97522, 31164, 6328, 73195, 134731, 71816, -27631, -67984, -28292, 6371, 16483, 80222, 123815, -1843, -98831, -103019, -91563, -62142, -10771, 10746, 77011, 44998, 26671, 79002, 65463, -6654, 21709, 33175, 10495, 18069, -45968, -95596, 25880, 83169]
23276H3169P151L1655M6558m2063j6714m2847k8118J2265M5497n6509m3889m6330
23264e0175M6840M5460Q9570k9253j18451o8412N8990J10003k40n9315q196L0664
23252D7485j8238j2873M6191N9504l0945m9630l0409m4169k1760p8001n593Q8532
23240d9906O5184J3607l8084R3912K2213j5102o859l6610j4773N0576N0273k50
23228A34181O101m5374r50k9438K3568m7625j01470p6552M7830Q5929K7399m9649
23216b6050M6249K9760p1095j6087N6510M2988k347p2648n3062P6316j0594k6244
23204b6304K3418O7519O2654o3529O681L9789k6553L8130J02903m391n8487j4560
23192A47270j2877M5653M94j12158O539J03095k9551n9140k7655n0793k0406j3608
$$ y = [83169, 90320, 121975, 168533, 126470, 109756, 66909, 38791, 51056, 96553, 40044, -3845, -50175, -3335, 42125, 131695, 102442, -16009, -84421, -25431, 84572, 84332, 25017, 16821, 47485, 29247, 16374, 62565, 122069, 91124, 41494, 11085, -33084, -54844, -132845, -138438, -49906, 15278, 28885, -9199, 84713, 106926, 91824, 84965, 48355, 33582, 84158, 134431, 134181, 140282, 94908, 93958, 64520, 88088, 40463, -61007, -137559, -89729, -3800, 23599, -26050, 20199, 49959, -21136, -37223, 19287, 62275, 59928, -12720, -65782, 10534, -60, -26304, -2886, 64633, 127287, 63758, 70439, 110228, 83675, 121805, 224708, 220317, 161830, 147270, 134393, 180046, 180540, 68382, 74921, 178016, 148465, 89325, 61670, 10877, -9529, -23137]
23180b3137L9556L7830K42n6439n6988J4619M7891L2014J7636K4397n5671M1674
23168F3624j0826K7792m5929O5106N9187m5321j8476L2157j15n805l7678j3846
23156F9870m6286l0309P7852n4739l0254Q12M0923N093O9755p905n3140l5793
23144E879l0711r248j6447N6440L8097J9862l7428j1254M3670L3392R6450M3037
23132B31739P188j01901J170M695J2657P458m5526q5979l8703L8071m1480O7399
23120E6788M7285L6126K3822k9103o060k7495J4038m1591J2338Q4966l1007j02095
23108C8012m0234L782q547J8920k7047P4598N9821j3163l1947m4284J6041L0406
23096G6358m8334K2516j4789p5216k4185P9726J28399N5349m3844p3445p1171
$$ y = [-23137, 16419, 54249, 54491, -1948, -58936, -44317, 3574, 35588, 53224, 77621, 21950, 63624, 52798, 80590, 34661, 99767, 158954, 113633, 95157, 127314, 127199, 121394, 83716, 69870, 23584, -6725, 71127, 16388, -13866, -13054, 27869, 32962, 102717, 94812, 41672, 5879, -24832, -34080, -50527, 5913, 44010, 63872, 26444, 15190, 58860, 92252, 188702, 231739, 238927, 137026, 138196, 142891, 155548, 163006, 117480, 31501, -7202, 30869, -10611, 56788, 104073, 140199, 164021, 134918, 128858, 101363, 115401, 73810, 86148, 171114, 140107, 38012, -2222, 1560, -6987, 11933, -15114, 59484, 119305, 106142, 74195, 29911, 45952, 76358, 28024, 50540, 35751, -39465, -63650, 16076, 144475, 199824, 155980, 82535, 11364]
23085A1364p4018q338k0603N7389L991n4080j544O0981O1381K6215R9084K3617
23073A85439j23836j10781q6277L9419R9660O362r209j0817J8472Q7674M0946
23062A37052n6713l0422O511m6670l3373m1857j0963O7694Q9199l3970R616j2010
23050D4094K6538j6956q2895K6644l9359O2269k8052K2568P6517J33472K210l3790
23038A93260L706j9733M8209p1379l9389K1483j5173l6999K8209n1642j2018k7616
23026B0918J6093k7908J4918J21578m0727j08708p1046O0030M1199O6485K9306
23015A22138N514o5958q682Q3138M6126q445m6773J6712N1019j0540n8488n7301
23003F8460J8034r524M2095k1950n805l4447n4697M3481P5329J9025J04688k2933
$$ y = [11364, -62654, -70992, -91595, -34206, -30215, -84295, -85839, -24858, 36523, 62738, 161822, 185439, 61603, -49178, -135455, -96036, 3624, 9986, 777, -10040, 8432, 96106, 137052, 80339, 49917, 56428, 9758, -23615, -65472, -76435, -8741, 80458, 46488, 56104, 44094, 70632, 53676, -29219, -2575, -41934, 20335, -7717, 14851, 91368, 224840, 227050, 193260, 196966, 177233, 225442, 154063, 114674, 136157, 120984, 83985, 112194, 60552, 48534, 20918, 37011, 9103, 24021, 145599, 104872, -3836, -74882, -14852, 26347, 92832, 122138, 127652, 61694, 53012, 136150, 182276, 173831, 127058, 143770, 194789, 184249, 125761, 68460, 86494, 76970, 119065, 97115, 91310, 56863, 2166, 45647, 120976, 140001, 244689, 221756]
22991B21756j4630K6631J0755k2901o209r905p5755J34407Q9636o4149j04660
22980A84976q2263q7355m2122J30551J09115Q5363j5706p7725j1480K9905q6639
22969A36620l1366L5765p6484M0622l272N5450n9718n1152M2425k5289l9488J6068
22957D0181k862j7457O7269P067P976M1065P6461M3324j0599m1445l2385J1580
22945A90175p4164m2452P981k2789Q7418L4688o163J3345m4852n2206r2334m6937
22933d8290P5131Q8092k7049o6321n4072O7893M1863q1941M793J01550J1586l6732
22921G6503N1503J5296j8379m8410l5850l518N0392K1189J38227Q1902o3270j04416
22909A61169J2220P1534M0895L5317o0461m21j06393q9582J6342N5860Q8245q625
$$ y = [221756, 207126, 233757, 244512, 221611, 215402, 205497, 129742, 264149, 353785, 289636, 184976, 102713, 15358, -26764, 103787, 212902, 298265, 282559, 204834, 193354, 223259, 136620, 105254, 141019, 64535, 105157, 101885, 157335, 97617, 46465, 88890, 63601, 24113, 40181, 37319, 19862, 87131, 94198, 102174, 143239, 219700, 263024, 252425, 210980, 178595, 190175, 116011, 73559, 81540, 58751, 146169, 180857, 174694, 188039, 143187, 90981, -1353, -48290, 26841, 114933, 87884, 21563, -32509, 35384, 77247, -4694, 99, 101649, 113235, 76503, 128006, 143302, 124923, 76513, 40663, 37145, 87537, 108726, 246953, 328855, 265585, 161169, 173389, 244923, 285818, 321135, 260674, 260253, 153860, 64278, 80620, 136480, 224725, 216100]
22897B16100n2998P7613J1850J5222M2452J6870n0327j30765l2311O2827M3034
22886B19567p771j187J2366J7565r768o9546o2577Q1387J84140J61450R291p574
22874E27343k9059j05764o0578J4426j1366r080m2551K8972Q4599M1322q238k3168
22862D06858K3377R630r528k2939o8344J19415M7178n9620k3833j5217N9400k7760
22850D38617r4227r1495N9477q533L3067P0529L0357r364L3275K3316N4155k4386
22838E14788K4148J27456K08673K32141K52816L42630L69961O39518M16461o27307
22828B501285r88958n17116k10738j38876r2263k0107K2660K7765N860J1358J9676
22817F20546j10514m8529m0757O1121R72J9878M1416o1607k5462k6852M3430P5279
$$ y = [216100, 163102, 240715, 252565, 267787, 310239, 327109, 276782, 146017, 113706, 176533, 219567, 211796, 210609, 222975, 240540, 230772, 161226, 98649, 180036, 364176, 525626, 534917, 527343, 498284, 392520, 331942, 346368, 335002, 325922, 283371, 312343, 396942, 438264, 430026, 406858, 430235, 439865, 430337, 407398, 339054, 458469, 505647, 446027, 422194, 406977, 466377, 438617, 344390, 252895, 312372, 303839, 336906, 407435, 437792, 428428, 461703, 485019, 539174, 514788, 538936, 666392, 875065, 1107206, 1360022, 1702652, 2072613, 2712131, 3128592, 2501285, 1512327, 995211, 784473, 645597, 553334, 533227, 555887, 583652, 589512, 600870, 620546, 510032, 461503, 420746, 481867, 482839, 502717, 544133, 482526, 457064, 430212, 473642, 548921]
22805E48921k0903N5771m719k1830N2205l2056K9287Q9061J19253n9300m9204
22794G06486l0663j0491K6619q461j5761K7265J6092L9725Q0794O2748K1387k04
22782I15536k2865r305P0346N9589J09792K151N9806J15692L1395l036J48359
22771A477460J16528R2589J5749J00732M2006l0684M9264P1767J10105K28342
22761B273858K64284P8494L1066J28654J62147K49708K57231L59905M76564N24083
22751D805994N57926N62615N69403P07114R41037J192224J426478J968517K720280
22742A5451588L621065M609392N817902O778930P299428P618414Q093602R358689
22734F8649010J2226775J8549097K9216009M2268934N1923098N7199334P7335461
$$ y = [548921, 528018, 583789, 579070, 557240, 609445, 577389, 606676, 695737, 814990, 755690, 706486, 675823, 665332, 691951, 683490, 667729, 694994, 711086, 750811, 831605, 894353, 915740, 915536, 892671, 883366, 953712, 1013301, 1123093, 1125244, 1185050, 1300742, 1332137, 1329101, 1477460, 1593988, 1686577, 1702326, 1803058, 1845064, 1814380, 1863644, 1935411, 2045516, 2273858, 2538142, 2616636, 2647702, 2776356, 2938503, 3188211, 3445442, 3805347, 4281911, 4805994, 5363920, 5926535, 6495938, 7203052, 8144089, 9336313, 10762791, 12731308, 15451588, 19072653, 23682045, 29499947, 36278877, 43578305, 51196719, 59290321, 68649010, 80875785, 99424882, 128640891, 170909825, 222832923, 280032257, 357367718]
22727C57367718J20378405O0941266j52990330j75902748r0264956m3931582k3263384
22720E2334389j3399560q614950o074136m471499l128801k512221k257752j677166
22712A0198304j213726j034272r18546p29942n64135o17874o79091n51350m19326
22703C470042j95401j88300k85035j69584l7174j46326k49754j23672j27990k37900
22693A708906j74860j15999l3196m2285j15662j35035j00953j08198O2204k5809
22683I19113r2989o7892L9158J04033q6342p8537o0216j283K7668k7410m8617
22672F26686j52166j24342J3623n2479o9014j2771L867Q3619p1728k8298M2218
22661B59215N387m5270j49835j01650J3930M5067Q1609L2840L2996m1825J2848
$$ y = [357367718, 477746123, 538687389, 385697059, 209794311, 119529355, 75597773, 52334389, 38934829, 30319879, 24245743, 19774244, 16645443, 14133222, 11875470, 10198304, 8984578, 7950306, 7031760, 6301818, 5737683, 5119809, 4440718, 3889368, 3470042, 3274641, 3086341, 2801306, 2631722, 2594548, 2448222, 2198468, 2074796, 1946806, 1708906, 1534046, 1418047, 1384851, 1342566, 1226904, 1091869, 990916, 882718, 944922, 919113, 826124, 758232, 797390, 901423, 815081, 736544, 676328, 675045, 702713, 675303, 626686, 474520, 350178, 363801, 311322, 242308, 229537, 233404, 317023, 245295, 216997, 259215, 264602, 219332, 69497, -32153, -18223, 26844, 108453, 141293, 174289, 132464, 145312]
22650A45312P3090m4379o2354m7106k9879j2324K0584L9881N0768M137Q3148J6466
22638B37344m5291p1561J7211P8401J06883N0382J8020O0175P3594N3241J0522
22627E88921J52215K08863K49264K49659M37468N73016N48479l17784j068718
22618A621383o34998l80660k46685m0118J3682l0546m5089N5784k3514l1397j164
22607B56678l8310o2996p9068j42161n8350l8697M6984N7483J3200J4627L205
22596b7405K5717p349N1819o6192p5542p1911P5255L9656m2612j44730r376R3359
22584a59311J1301j5801N943k7537j3497L5572K9758L9613r6896M064J62652N0701
22572B6562K116M0745p567J0653n7293J1746O869k178o9127p7415o6632M8732
$$ y = [145312, 218402, 174023, 111669, 64563, 34684, 22360, 42944, 82825, 133593, 137730, 220878, 237344, 192053, 120492, 137703, 216104, 322987, 373369, 391389, 451564, 525158, 578399, 588921, 741136, 949999, 1199263, 1448922, 1886390, 2459406, 3007885, 2690101, 1621383, 986385, 605725, 359040, 318922, 332604, 302058, 256969, 312753, 289239, 257842, 256678, 218368, 155372, 76304, -65857, -124207, -162904, -115920, -58437, -45237, -30610, -27405, -1688, -9037, 42782, -23410, -98952, -170863, -95608, -55952, -98564, -243294, -252670, -159311, -148010, -163811, -157868, -185405, -198902, -163330, -133572, -93959, -190855, -186791, -24139, 26562, 28678, 69423, 61856, 72509, 15216, 26962, 33831, 31653, -37474, -114889, -181521, -132789]
22560a32789J9415k304K1835M7128q430j02378K4316j3136l2881O1304J3785M6549
22548e7586L0467q737N650n9915l5924N065o6602m6280J09062J15837J0923j972
22536a2L266N0206L036n370L4901R363K6391r767M3712N6993j9614j6160o4044
22523A12901p4432j425M0186M4614k2630n7950l0967K4632n2643r4293n5930O683
22511a61254N114J24530J6487j6700L6210k764R147N678k4256L2456n613K1048
22499D0083K3968k9797N1795M5217q6176k20321n6505J03860J23134L8218q1442
22488d7966k8857R017M028P1079L9626m8300K3987O870n6407l779N3987N4569
22476G7854l3795l1925j7437J7099r599J9182l859l0041l8963J8245O9262J7559
$$ y = [-132789, -113374, -115678, -93843, -46715, -55145, -157523, -133207, -146343, -179224, -117920, -104135, -57586, -27119, -35856, -30206, -90121, -126045, -120980, -187582, -233862, -124800, -8963, 1960, -12, 3254, 53460, 56496, 51126, 86027, 95390, 121781, 112014, 155726, 212719, 193105, 176945, 112901, 38469, 37044, 77230, 121844, 99214, 41264, 10297, 34929, -17714, -112007, -167937, -161254, -156140, -31610, -15123, -31823, 4387, 1623, 10770, 16448, -7808, 24648, 19035, 40083, 64051, 34254, 86049, 131266, 45090, -175231, -231736, -127876, -4742, 33476, -47966, -76823, -67806, -63778, 7301, 46927, -1373, 22614, 29484, -26923, -30702, 23285, 77854, 44059, 12134, -5303, 11796, 2197, 21379, 17520, -12521, -51484, -33239, 36023, 53582]
22464E3582J4890q198k2221n9879r438j0396J2329J5217O6010J03753k6470n7297
22452G1882l9464N441k2749k1472j0892P1325O2760K2503r9552q7925j274L460
22440d5957l3153N0495Q267j16624L630L4392M3704k9100k923L0419M0003R1252
22428G4405j6399j2233k2482J2515J8340q7802j26999m4553J00583J5147n9518
22417a48996l9248M0196P3629q8248N1695Q468j212l966J1646K357J4555m9968
22405a29092m4805K6193Q7030L6266J9851j7666o0123m324J9732l9713J8772K4983
22393f2896K7064M0179P062m7423m2976k5595J6514k4269J981J9155L3357N4087
22381c760p2M2017m1664N29J2671n8124J0946K9311R787J3881k1754l5768L1240
$$ y = [53582, 68472, 60274, 38053, -21826, -31264, -41660, -29331, -14114, 51896, 155649, 129179, 71882, 32418, 37859, 15110, -6362, -17254, 54071, 116831, 139334, 39782, -48143, -49417, -45957, -79110, -28615, -20348, -136972, -133342, -98950, -55246, -84346, -87269, -56850, -16847, 74405, 58006, 45773, 23291, 35806, 54146, -33656, -160655, -205208, -104625, -89478, -148996, -188244, -148048, -74419, -162667, -110972, -102504, -103716, -107682, -96036, -93679, -79124, -129092, -173897, -147704, -60674, -24408, -4557, -22223, -82346, -86670, -66938, -106651, -87879, -62896, -35832, 4347, 11409, -36014, -78990, -104585, -88071, -112340, -110359, -91204, -57847, -3760, -3832, 38185, -3479, -2950, 9721, -48403, -37457, -8146, 1641, 15522, -6232, -42000, -10760]
22368a0760n727L1180r621n6997m4441n0940J12905M7295n6831p923N9360Q0793
22356H8293o1949p1051m482p8247q4031O7006J07691M42M0924m458o5487k9861
22344i5210j2334j7368j2176J0266R2407l4169j4188p172J1827J6297m7328q6768
22332a95916P9905L6008L7368L225J610n0101j3834l1421O419M2973J34557k2478
22320B8315n3178l7580j5908K8045j4551o6364j5734j6566M5532J9622L7294J3916
22308d7157J14193M930p5212l3358R1151O9333J7464n9272o5233m2291r082L3755
22296g79M6417M887q7445L425J5608n8337k7749J49628O9634Q944l9215n6308
22284B8710M446n7897o2722j0519p3920N7608j9446j2819j8640k9791O9350Q5999
$$ y = [-10760, -16487, 14693, 5072, -51925, -96366, -147306, -34401, 12894, -43937, -51860, 7500, 88293, 26344, -44707, -49189, -127436, -211467, -144461, -36770, -36328, 4596, 138, -65349, -95210, -107544, -124912, -137088, -126822, -34415, -68584, -82772, -89944, -78117, -61820, -109148, -195916, -116011, -80003, -42635, -39410, -37800, -87901, -101735, -133156, -126737, -83764, 50793, 28315, -24863, -62443, -78351, -50306, -64857, -131221, -146955, -163521, -117989, -98367, -61073, -47157, 67036, 71966, -3246, -36604, 54547, 123880, 141344, 82072, 16839, -25452, -34534, -779, 45638, 50525, -36920, -33495, -17887, -76224, -103973, 45655, 115289, 124233, 85018, 28710, 33156, -24741, -87463, -97982, -171902, -114294, -133740, -146559, -165199, -194990, -125640, -39641]
22272c9641J5858O8472n5624p2235l3913j2874j7543J0402l9799J3229L5754L2240
22260i5674K7993Q9050K7054r8036j9100M7222l7615n8360O6510K2985K5218K0494
22248A7741n1607j19019K4360P6484M0252R961M2813O9210M7822K1521j09844
22237F9694n072q87l6446j32752K244N9014R9026K8699M0165q147k2839l172j0115
22224G9412P7410k5051p4984j8546M4722n6201n7009K7874p364M8130J5135m0437
22212A3091q5930L2031J09758L0034J664j19602K1725K5976n6224J1994L9105
22201B3622L461J9832k3237J4983k6090j2490l4829m3250J0288N0260k0323J2751
22189b5022O9549m1384l4367J1380j6953J0273n22j6739n0201K0120Q5133O6049
$$ y = [-39641, -23783, 44689, -10935, -83170, -117083, -129957, -147500, -137098, -176897, -163668, -127914, -95674, -67681, 21369, 48423, -49613, -68713, -21491, -59106, -117466, -50956, -27971, -2753, 17741, -33866, -152885, -128525, -52041, -11789, -1828, 40985, 110195, 158017, 179538, 69694, 64622, 63735, 27289, -105463, -103219, -44205, 54821, 83520, 123685, 115538, 92699, 89527, 79412, 156822, 131771, 56787, 38241, 82963, 26762, -30247, -2373, -9737, 38393, 53528, 13091, -72839, -40808, 68950, 98984, 100648, -18954, 2771, 28747, -27477, -15483, 23622, 27083, 46915, 23678, 38661, 12571, 81, -34748, -77998, -67710, -17450, -37773, -25022, 44527, 3143, -31224, -19844, -36797, -26524, -27046, -43785, -93986, -73866, 11267, 77316]
22177G7316K6082q7814n2942N6485l0659k4193p6767J67N6918j145o083m0158
22165a02793P15K5583j8586k1247Q0603N9956j5015N6725m9031N00m8092n4215
22153h4897O581P2982N8085J5498J9241M380Q7835k0527m3824J3032L9493K6717
22141A94596n6076j2590J1059q9057J9835J37922Q8289k730M7558N341N1865M7993
22129D44005J09479K82963J80306K15487L54269M33085N64161O2028q30731q61479
22119I53573m13898j57268j19326j68196l8353o0513k6650K3935n2780m4251J14600
22108A0873n942n4120P4133J1429q8070k752R3596K4986q4212k6481k9797j22542
22096a98899j6926J7374n1808l9244O2891Q1203K0919O5025O5059O1408p9362
$$ y = [77316, 103398, 15584, -37358, 19127, -11532, -35725, -112492, -112325, -55407, -56552, -62635, -102793, -102078, -76495, -95081, -116328, -35725, 24231, 9216, 65941, 16910, 17410, -30682, -84897, -78316, -5334, 52751, 68249, 87490, 91870, 179705, 159178, 115354, 128386, 167879, 194596, 138520, 125930, 136989, 47932, 67767, 205689, 293978, 291248, 338806, 344147, 396012, 444005, 553484, 836447, 1016753, 1232240, 1586509, 2019594, 2583755, 2645783, 1815052, 953573, 539675, 382407, 263081, 94885, 56532, -3981, -30631, -6696, -59476, -103727, 10873, 4931, -49189, 24944, 36373, -51697, -54449, 39147, 64133, -20079, -46560, -76357, -198899, -215825, -198451, -250259, -289503, -226612, -145409, -124490, -59465, 5594, 67002, -12360]
22085a2360j7428K0174Q3741j8808m9977q4551M3082N4532k6393r8489L2827Q3957
22073A0307L6457N9370N8809l1886o8424O8616L182n7181j26489l2367N7759N1456
22061B9609Q354M859J3139J2159l3298j8578M7096k1552m1396J3981K7269p824
22049C3818l0410o213K0284k1337n6777K2843o4521J9389K7570M0382J3212m6917
22037d8677m1496n1076Q1470K4875J5648j0287k0372m1342O62r452j6752N0231
22025f6568N9005R789Q2625O3371o1404j08757j2656N1748n2448M3353J6508k8052
22013c486K339M850q0812N562n486n3541L0661k3139n5074k037P813Q8839K1864
22000f1647L077o438N543m2751k9653L5848M0282J8036K0357J246m9518K2760
$$ y = [-12360, -29788, -9614, 74127, 55319, 5342, -79209, -36127, 18405, -7988, -106477, -73650, 10307, 46764, 106134, 164943, 133057, 64633, 133249, 136431, 79250, -47239, -79606, -21847, 29609, 37963, 42822, 55961, 68120, 34822, 16244, 63340, 41788, 392, 14373, 41642, 33818, 3408, -2805, 17479, -3858, -60635, -37792, -102313, -82924, -55354, -14972, -1760, -48677, -90173, -141249, -59779, -34904, -19256, -29543, -49915, -91257, -90595, -100047, -116799, -66568, -7563, 2226, 84851, 148222, 86818, -21939, -34595, 17153, -35295, 8058, 24566, -3486, -1147, 3703, -77109, -71547, -77033, -130574, -99913, -123052, -178126, -180163, -172350, -83511, -61647, -58570, -65008, -59465, -102216, -131869, -96021, -55739, -37703, -17346, -16100, -65618, -42858]
21988d2858L3051k9862P169M9144K4848M9744l2233J8876K354J3928j9260n7657
21976A7244j91l3331l7000q511N3268J2563j4423L4045k516K8333O744j08318
21964e2093q0164K021L6101o366n2696l4592k862P7728J18851M9371M8670o2778
21952D1191n5731L958k7922m32k0600o5702o8563j5898Q7349P4669j777j8191
21940f7649J5834L0894j6655l9506P421P5987n79K3444K3392M1544l3705l9986
21928B0436j0155O485m9952l8812K1713K3339j5041M0654l7570R750l650O9606
21916C6803M0450N579Q788o8156j5375m166K1722Q5213k719q346n6171q3340m4065
21903h3783Q2150j6126j15635L565j1213K6260P9790J21670j1560L159j01091
$$ y = [-42858, -9807, -39669, -32500, 16644, 41492, 91236, 59003, 77879, 80233, 94161, 74901, 17244, 17053, -16278, -53278, -61789, -8521, 4042, -10381, 23664, 21148, 49481, 56225, -52093, -132257, -130236, -94135, -100501, -153197, -187789, -190651, -112923, 5928, 55299, 103969, 41191, -14540, -10582, -38504, -38936, -59536, -125238, -193801, -209699, -122350, -47681, -49458, -67649, -51815, -20921, -37576, -77082, -69661, 6326, 5747, 29191, 52583, 94127, 60422, 20436, 10281, 16766, -33186, -71998, -50285, -26946, -41987, -1333, -38903, -29153, -32803, 36803, 77253, 82832, 91620, 23464, 8089, 3923, 25645, 110858, 108139, 99793, 43622, -39718, -83783, -1633, -17759, -133394, -129829, -141042, -114782, -34992, 86678, 75118, 78277, -22814]
21892b2814o9642k4380J6947J07532J08146P8209K224o1093j06404j6730p4415
21881f2420j9315J1074Q0571L4369j01780j10877J4984N5041k1137P7883M9625
21870H018o196O6566l6095k990j3721o3407m6953R272K662m5262Q5409Q4911N818
21857D8032m5541l3766m0809n2397L5850N6081N5922K6487O8145l4122j20613
21846c6731m7932K4789m4387m7126J07588L7660q8859j8123j7858L583N3407N4469
21834a9520j049L1884K690q660K9313l3744j12374l5945J4436M6134J5216k5215
21822i6834R9189P1969O8206N559m0865n7004m601M7199o6664J6641m0170m56
21810B169l0108j7696M6260K0900Q5159q548j20212r8975K7396O6234J05926Q754
$$ y = [-22814, -92456, -116836, -99889, 7643, 115789, 193998, 196222, 135129, 28725, 11995, -62420, -81735, -70661, 9910, 44279, -57501, -168378, -153394, -98353, -119490, -41607, 8018, 1822, 68388, 32293, 29303, 15582, -47825, -94778, -85506, -82844, -128106, -42697, 42214, 48032, 2491, -31275, -72084, -124481, -88631, -32550, 23372, 49859, 118004, 83882, -36731, -84663, -59874, -104261, -151387, -43799, -6139, -94998, -113121, -130979, -127396, -73989, -19520, -20569, 11315, 14005, 5345, 34658, 914, -111460, -147405, -132969, -86835, -71619, -96834, 2355, 74324, 142530, 148089, 107224, 50220, 45619, 92818, 26154, 42795, 2625, 2169, -27939, -45635, 625, 21525, 106684, 98136, -22076, -121051, -93655, -27421, 78505, 87259]
21798H7259j9428m5486k7699l9588L6967j2047m4326j5420k1217l2600J3271O6475
21786e3839J2302k2982l3651M0065P9712j4677o6J3605l2808j8466M0653J215
21774A1063M3596p1324R11N4246m4201m4978j2537L4148Q1627L4311m167j16819
21762c4124J3087O4494n2493l4617L4052n1380j9464l4495J1531N0559J4424J506
21750c6920K7566J6477p696N6007K823p5798K8667j2462J8769N1167J0788n7429
21738B1959j42432j3641M9823P3427K6226R754N2852p6972m0661j317l965m900
21726d9847O7113r6351o8249j5211O7379J16124o6878k4262R9170m5610O0021
21715D3399l6932J5810L1461k3445K5065j14987l8953k8531O2798P8088L3917
$$ y = [87259, 67831, 22345, -5354, -44942, -7975, -20022, -64348, -79768, -100985, -133585, -120314, -53839, -41537, -64519, -98170, -58105, 21607, 6930, 6864, 20469, -12339, -30805, 9848, 11063, 54659, -16665, -15754, 38492, -5709, -50687, -63224, -29076, 52551, 86862, 82695, -34124, -21037, 43457, -9036, -43653, -9601, -60981, -80445, -114940, -103409, -52850, -38426, -36920, -9354, 7123, -573, 55434, 58257, -17541, 11126, -1336, 17433, 68600, 79388, 21959, -120473, -134114, -84291, -10864, 15362, 25116, 77968, 996, -39665, -40982, -44947, -49847, 17266, -79085, -147334, -162545, -95166, 20958, -45920, -70182, 28988, -16622, 43399, 6467, 22277, 53738, 30293, 55358, -59629, -98582, -127113, -64315, 13773, 47690]
21704D7690r692l4636r7423p591J48117N5007p3757j38016P8107N0475k5265L2128
21692B5144K9113n0495k8036m9992J0306P7029O6040O416j7547q208n2457m9849
21680d2536k5767j6197q701L5039K991J9204J2424q803j02411o6997J24715M6258
21668c0781J0573n2491L321j8682n0228q5177n3114j195J8007P4078M8641Q1860
21656e5188M9101M9137J6593q0293l9432K69k6343J0655j7501m4981L1954R172
21644i6857j4632k7176n562r881J3892K6996r102M8669M2389J2454n3363L688
21632f8485M6889m352j01263L8562L1388K9682K781J38972M5280m5876m5039j9934
21620D8605n7866q167n7094j8222l7709k7759j0439o8382L5537R8067j9204m7736
$$ y = [47690, 37998, 3362, -94061, -101652, 46465, 101472, 27715, -110301, -32194, 18281, -6984, 25144, 54257, 3762, -24274, -74266, -63960, 13069, 79109, 85525, 67978, 59770, 7313, -42536, -68303, -84500, -93201, -58162, -55171, -35967, -23543, -32346, -134757, -201754, -77039, -30781, -20208, -72699, -69378, -88060, -138288, -223465, -276579, -277774, -259767, -185689, -137048, -55188, -6087, 43050, 59643, -20650, -60082, -59813, -86156, -75501, -93002, -137983, -106029, -96857, -111489, -138665, -144227, -154108, -140216, -113220, -122322, -73653, -31264, -18810, -72173, -68485, -21596, -25948, -127211, -88649, -57261, -27579, -24798, 114174, 159454, 113578, 68539, 48605, -9261, -17428, -74522, -92744, -130453, -158212, -168651, -237033, -201496, -103429, -122633, -170369]
21608a70369O0877P5991K2172j0864O4449O11K8359L798n4553k6628l415m4359
21596e3931m6666O1323L894o9699p8j6947L7255M5654J6067P771J1192l392J6356
21583H799l6813K380J3945L5680l8152j1993J9718l239j37003j32598K4515K3765
21571b30996J29842P6203Q1654j9922m3440o3320n4746n6976J44898O4512K93
21560B8002p468r3143j8941N3861l2748P3502o5275p5522P632N6263O5102K8097
21548A9362N6146j5937k3492J5819K010J67q5062l6800O0743k7058l0694M4630
21536b0166M547j15809L2337O2966L0868r7467k1676P8246J23914N5667K0916
21525A54343m4667m9122k5656J0316p379K5990J8056O4792J8159K4986l3065o7407
$$ y = [-170369, -109492, -33501, -11329, -22193, 42256, 42867, 71226, 75024, 20471, -6157, -9572, -53931, -100597, -39274, -35380, -105079, -105157, -122104, -84849, -39195, -23128, -15357, -4165, -7557, 8799, -28014, -25634, -11689, 23991, -14161, -26154, -6436, -9675, -146678, -279276, -254761, -230996, -101154, -24951, 56703, 36781, -6659, -69979, -124725, -181701, -36803, 27709, 28002, 20534, -72609, -91550, -37689, -70437, 3065, -62210, -137732, -130100, -73837, -8735, 19362, 75508, 59571, 36079, 51898, 53908, 54075, -30987, -67787, -7044, -34102, -64796, -20166, -15619, -131428, -99091, -36125, -5257, -102724, -124400, -46154, 77760, 133427, 154343, 109676, 60554, 34898, 45214, 37835, 63825, 81881, 146673, 164832, 189818, 156753, 89346]
21513H9346p8494J0586Q2007k3840n7542p8920q7887L0063N1658K2410P1219m3424
21501a2818l4975Q4088n5397o6007J8210K3151J18266M7o4741n8700J5299J7438
21489a6139K2845K8476k9146R025M4700J06258r3325m8513M4086L872n4749N1116
21477F8506p358k4013k4641k8998J2168n332k1536J8054K748O320M360m1143n8320
21464i9185o6166O4793K3495K8680K0733L9873L1095R740P1947l3670j07171l0609
21452d6445R7055O6553N6954K88l5973k7650l971j2507q0292n6327r5l4444k6877
21439a03731J34886N0240N2417k6545l123K353K5142j03071r4850O6822l566j5981
21427a9007j2129j1006N4184m1628j5941O3797P3934r051m8872p2495K2141m0171
$$ y = [89346, 10852, 21438, 103445, 79605, 22063, -56857, -144744, -114681, -63023, -40613, 30606, -12818, -47793, 36295, -19102, -85109, -66899, -43748, 74518, 74565, 9824, -48876, -33577, -16139, 6706, 35182, 6036, 15061, 59761, 166019, 72694, 24181, 68267, 72139, 17390, 68506, 61148, 37135, 12494, -16504, -4336, -9668, -31204, -13150, -10402, -4082, 278, -40865, -99185, -165351, -100558, -77063, -48383, -27650, 12223, 43318, 53058, 125005, 91335, -15836, -46445, 50610, 117163, 174117, 174405, 138432, 110782, 106811, 94304, 14012, -42315, -42410, -76854, -103731, 31155, 81395, 133812, 107267, 104144, 106497, 131639, 28568, -66282, 540, -3026, -19007, -31136, -42142, 12042, -29586, -45527, 18270, 92204, 83153, 34281, -38214, -16073, -56244]
21415e6244j08207L4993J22489N7092j1582Q941k1383m8574L7559m4464k5974
21404e5354J0307k4529j0773J01543Q88j23500K6964N9376p7805k3999J148J5841
21392i9893K3746L2946m558j2537K5630J37251m4858j40754J2959N2054R554o590
21380a5050q480N3498Q9581M644p498n1080p7393k2305J34263J0167n3387p4681
21368a7721m24O5395j5179m0138l8367o2766O6610L4647P0530O4855r847o9457
21356D8138Q19n872n2545J794L782J7382N9339j6674r7682o0837r815m2526o8807
21343b23504N0782K2530J2676J1958O3137j7238L2018P7272N2566K2661o3128
21332D1730p7187j07898m4011P1086N5722Q0580L7263p5015j4058L5855j1280
$$ y = [-56244, -164451, -129458, -6969, 50123, 38541, 47482, 26099, -22475, 15084, -29380, -55354, -45047, -69576, -80349, 21194, 22082, -101418, -74454, -15078, -92883, -116882, -115734, -99893, -76147, -43201, -47759, -60296, -34666, 102585, 57727, -83027, -70068, -18014, -8460, -15050, -23530, 29968, 119549, 124193, 116695, 65615, -11778, -34083, 100180, 110347, 56960, -17721, -18145, 47250, 32071, -8067, -46434, -109200, -42590, -7943, 62587, 127442, 117595, 48138, 48957, 43085, -9460, -7666, -3884, 13498, 72837, 56163, -41519, -102356, -112171, -154697, -223504, -172722, -150192, -137516, -125558, -62421, -79659, -47641, 29631, 82197, 104858, 41730, -35457, -143355, -187366, -116280, -60558, 20022, 57285, -17730, -31788, 4067, -7213]
21321g213J6250N287J6958J02971J5369o2306J4883n4426r7983p296q008J36460
21309G0946K5418j1594k2318l2707k1997j0375n8350M8987K4736j6373J9271L5473
21297E1117q1912j5380M7205q933K2692M4018L9118j74066k4964M5012n4971m1366
21285a52430N4362O4134L6626O5623j8432j08068k4411q5941M9418Q7031M5623
21274A3535M2575l2077o3398o763L9503Q5760l2555q9432P1898M8300p0602q2107
21262g5363L4883M7616l6767N9633K6350p7940M0409J6738j765Q1594N8565l4086
21250A39867p3174j01560J2980L9198K079m8260Q0484N7866q9665n7426K0208
21239a7403K2116m2241k3175p3929n8814N7190Q4898J5158o6127M0628O8928K4228
$$ y = [-7213, 9037, 14324, 31282, 134253, 149622, 87316, 102199, 47773, -50210, -57506, -65514, 70946, 96364, 84770, 62452, 29745, 7748, -2627, -60977, -11990, 12746, -3627, 15644, 51117, -30795, -46175, 1030, -7903, 14789, 58807, 97925, -76141, -101105, -56093, -111064, -152430, -98068, -33934, 2692, 68315, 49883, -58185, -82596, -168537, -119119, -32088, 13535, 56110, 24033, -39365, -46128, -6625, 79135, 46580, -42852, 29046, 77346, 6744, -75363, -40480, 7136, -29631, 30002, 56352, -21588, 18821, 35559, 33794, 115388, 173953, 139867, 66693, -34867, -21887, 17311, 19390, -28870, 51614, 109480, 19815, -37611, -17403, 4713, -37528, -60703, -134632, -193446, -136256, -51358, -36200, -102327, -61699, 7229, 31457]
21227C1457k038j0748N2836j1903n4962o3672L4029n7535n5334J6406M7771J16387
21215D2694M8701m6303j12504m5422l7808M6861P5513K3888P573J6047K0412l5559
21203D093Q943P1779K2135q748J5116n6442j47145p5277J12191K4245R535L2916
21191A3341N6005O442l2272J5784j8616J9510l466p211j9438k7834N581k1960
21179a4134p8400n6121J0081J00218Q0953k0931l3437j10145M911P178j3219k9004
21167a52050R1504N4556N1580J7415K6552J9281o3922q1409m2738R870m1212M1824
21155f8749M418K0109m788n2016k1783N9489N3593M1077L6930j8728n8175m8852
21143e7475j2012Q0278j10377P549J30471P1545m9553n6285n3589k2143K0287
$$ y = [31457, 29419, 18671, 71507, 59604, 4642, -59030, -25001, -82536, -137870, -121464, -73693, 42694, 91395, 45092, -67412, -112834, -150642, -103781, -28268, -4380, 3193, 19240, 39652, 4093, 13036, 84815, 106950, 98202, 113318, 56876, -90269, -165546, -53355, -29110, -19575, 13341, 69346, 75788, 43516, 59300, 40684, 60194, 56728, 49517, 30079, 2245, 7826, -14134, -92534, -148655, -138574, -38356, 42597, 21666, -11771, -121916, -117005, -109827, -123046, -152050, -60546, -5990, 45590, 63005, 89557, 108838, 44916, -36493, -79231, -69361, -110573, -68749, -64331, -44222, -49010, -101026, -122809, -63320, -9727, 31350, 68280, 49552, -8623, -57475, -69487, 10791, -99586, -92037, 38434, 109979, 60426, 4141, -49448, -71591, -51304]
21132e1304J0549M9795L0876M5096n731j83739j525O9455P8191L7177m5395r286
21120B4159J01337K9947q4341K4014r0843j1974N9211O6253j05049q6780k9398
21109a03464J0055O9187K4130P3260M4039j16316m8513J2084L7815K0236l0094
21098g581l2642j3968Q912J0120L3855P5770M5282p1605K5817J7719q8172o4023
21086f0516N4044J1686n4914r7683n692K6367J04686P4098k4634M2531k398n9377
21074H198n2819l9042j0449N8195O3651k8568j8463l0604j1824P6224M5020J3254
21062G2773j5861J5081r0676o9514l3360k6673m4564m6152j0087O7555K6282J5493
21050a39703K1555J6350L0759m5844k015J9206N7119p7023l8033n639N9942J38523
$$ y = [-51304, -40755, 9040, 39916, 85012, 79281, -104458, -105983, -36528, 41663, 78840, 33445, 24159, 125496, 155443, 71102, 95116, 4273, -7701, 51510, 117763, 12714, -74066, -103464, -93409, -24222, -92, 73168, 117207, 891, -47622, -35538, 2277, 22513, -7581, -40223, -54191, -45279, -35159, -1304, 74466, 119748, 48143, 73960, 91679, 3507, -60516, -6472, 5214, -49700, -147383, -153075, -126708, -22022, 52076, 27442, 69973, 67575, 8198, -44621, -83663, -94112, -35917, 27734, -834, -19297, -49901, -61725, 14499, 59519, 72773, 56912, 71993, -18683, -88197, -121557, -148230, -192794, -238946, -249033, -181478, -155196, -139703, -118148, -101798, -71039, -116883, -118898, -99692, -42573, -119596, -157629, -163268, -103326, 35197]
21038C5197J731l5736K8762L9964J5148r5204k5839Q223K4832N1484q615n1509
21026a1562N8206n448q8761M6343N6327M1370r450n1923l3190q752J4847k7501
21014a9494n4561m5403O0753Q0784k0809O724j9122K2995l0488J23697J01601
21003B06677l0470l5017m4428K0967j04479n2143o485N76j00257o025K8123n278
20991a28239L8849k6603P1771Q3627O0940l8878p9977q3063L157M5973O2101J8427
20979B8085q7018l7780j4506N2087Q5564J0530k1805L0293j6823k6802j0645m5759
20967e4579L3049P4514M1959J859J14771N312n8800p3815m1233m5815n6380l6614
20955i5772L2965O6462P34l51k7728k7829m0948P9282O8644l7499M6992Q281k1332
$$ y = [35197, 36928, 1192, 29954, 69918, 85066, -10138, -35977, -27754, -2922, 48562, 39947, -11562, 46644, 41196, -47565, -1222, 55105, 96475, 87025, 35102, 1912, -6840, 8007, -19494, -74055, -119458, -58705, 22079, 1270, 7994, -11128, 11867, -18621, 105076, 206677, 176207, 141190, 96762, 117729, 13250, -38893, -45378, -44802, -145059, -151084, -122961, -128239, -89390, -115993, -44222, 39405, 100345, 61467, -18510, -101573, -98416, -52443, 9658, 28085, -58933, -96713, -111219, -59132, 26432, 36962, 15157, 45450, 28627, 1825, -8820, -54579, -21530, 52984, 94943, 96802, 211573, 216885, 158085, 84270, 43037, -2778, -59158, -95772, -62807, 3655, 4389, 4038, -23690, -51519, -92467, -13185, 55459, 17960, 64952, 73233, 51901]
20942E1901O430l2786R641L6197j6719o7964k6406j001l7251r2140M1910P3504
20930e4684O0541n0577k2194R0792l2498J1336J08843j9700j01835r7222R510
20919i7688L0076o8799N5689O4106O8028M2383k5923j35050l9837L9887N196Q252
20907e3680l9953m9025q589m145J40689L8560l9154L6234N1108j8338l3833m5241
20895b5367n9446J44475P5476j13772k6343K5731j0624q958j9143l0675M7377
20884a269M9888N2781k6612j3608o3269k1008j5518J29724M4998N4520o9313q4556
20872C6758R880J54055l9232n117J8340j0885n3220m6789r800l6622J890L836
20860B3094k3927M0281n1733K2519O449j2094n7759q8326p0262J15470J20375
$$ y = [51901, 58331, 25545, 35186, 71383, 54664, -13300, -39706, -40707, -77958, -170098, -128188, -54684, 5857, -44720, -66914, 23878, -8620, 2716, 111559, 91859, -9976, -107198, -97688, -67612, -136411, -80722, -16616, 51412, 93795, 67872, -67178, -107015, -67128, -61932, -53680, -93633, -142658, -151247, -155392, -14703, 23857, -15297, 20937, 72045, 53707, 19874, -25367, -84813, 59662, 135138, 21366, -4977, 20754, 10130, 1172, -17971, -48646, -1269, 48619, 101400, 74788, 61180, -2089, -23097, -38615, 91109, 136107, 190627, 121314, 36758, 46638, 200693, 161461, 156344, 174684, 163799, 110579, 63790, 53990, 17368, 19258, 23094, -833, 39448, -12285, 10234, 16683, 4589, -53170, -141496, -211758, -96288, 24087]
20849B4087p5073j03365j6343m2792K3517P3123R551Q700l6641k7349j5636N1916
20837a26305J20475Q0057J186k957p9578m3228n848L7189N7337O3983k7017o8741
20825F553p789R9302N4310N1122O45m9791n5101L783l3443l6109kR1717O7272
20812A92469o3744q5005j5401r257M1639N1325n9702n891m6973j4058M7734L3072
20800F6208J3301K0695l8694o3870j0516P6118K2868j3829l1244m7315M697j5592
20788a7173m9202n8009n069R8490L1117N3577K1362M2602j782N0763R4292n7824
20776B03144n7802r026j9357M978M2604k5342p9804o336j5047R153l8422n5068
20764d6325n4783k7920M9061K0662O2517Q0547Q0481n0643n2028n5308r5541j554
$$ y = [24087, -50986, -154351, -170694, -213486, -189969, -116846, -107295, -98595, -135236, -162585, -178221, -126305, -5830, 74227, 75413, 72456, -7122, -50350, -56198, -19009, 38328, 102311, 75294, 6553, -1236, 98066, 152376, 203498, 204143, 154352, 99251, 103034, 69591, 33482, 33480, 125197, 192469, 128725, 43720, 28319, 19062, 60701, 112026, 52324, 46433, -540, -14598, 33136, 66208, 79509, 100204, 61510, -2360, -12876, 63242, 86110, 72281, 41037, -6278, -1581, -17173, -66375, -124384, -129453, -30963, 154, 53731, 75093, 117695, 115913, 166676, 260968, 203144, 145342, 136316, 116959, 121937, 164541, 139199, 59395, 53059, 38012, 47165, 8743, -46325, -101108, -129028, -79967, -59305, 3212, 83759, 164240, 113597, 61569, 6261, -89280, -90834]
20752i0834K8509j04008P3118J55717o9586j7420k6541p3802L9123L6643Q4078
20741C4997P1601n9629k5049j2522r812p85K2027Q900Q3528o3786m6751k5624
20729b2905J2068j6021j1475k6352J0691J18644j1470o2379j527q948O0202j0318
20717C0210n080m363J5087N2855m5280o218k8543K3647O7087O908j26024j27442
20705a47156q535O9889R4900K6469p6925l2803J9597Q787J2002L6498K7476n800
20693B4399l4120n6143M9993J3630J9552L1872K6793j4461k1232Q2967L4232j611
20681A55871r6109N7665N8463k8665J9760J3120j8832q9987M1599M0510j9494
20670A33901K1091l512q3988l2270k7951J564J6948L7112J0193j2630n2656n9941
$$ y = [-90834, -62325, -166333, -93215, 62502, -7084, -24504, -51045, -124847, -85724, -49081, 34997, 106598, 46969, 21920, 9398, -414, -1199, 20828, 29728, 113256, 49470, 2719, -22905, -10837, -26858, -38333, -64685, -53994, 64650, 53180, -9199, -10726, -19674, 40528, 30210, 25130, 20767, 35854, 88709, 43429, 37211, 8668, 32315, 99402, 106310, -19714, -147156, -155691, -85802, 9098, 35567, -41358, -74161, -54564, -45777, -33775, 2723, 30199, 24399, -9721, -65864, -15871, -2241, 17311, 49183, 75976, 61515, 40283, 123250, 157482, 155871, 59762, 117427, 175890, 147225, 166985, 180105, 161273, 71286, 112885, 153395, 133901, 154992, 151480, 67492, 35222, 7271, 8835, 25783, 62895, 73088, 60458, 7802, -52139]
20658e2139N001J3640K4423J1774M7185K6846K67K592m8269J8723L1830l6124
20646D5749r3215N723J6199O8198n6284j51425K969J07396O3719n825j11307l2340
20634a40443Q1254Q535R196J82106j7230j02633l2647M5198o3732j3480N4128
20623A0252N3021J9521k9321k9867m6085L7458O2828K118m0611L053k2082K7400
20611D7685r6084r7700O1817Q4444j8081j0143N7970J8826N2718p6080J7872L742
20599D6986r7909o5880K4857k9699m4573l03J3887L8909N1392N7799P5911M2436
20587A13813P6770j45379j49044M6199o3031J1273J454N4536L9706O9764m7949
20576H112K1178k7399k0373n2101R1446O2061o9240K5837k8105J925j2673r4113
$$ y = [-52139, -47138, -33498, -9075, 2699, 49884, 76730, 76997, 79589, 31320, 50043, 81873, 45749, -47466, -41743, -25544, 42654, -13630, -165055, -162086, -54690, 9029, 3204, -108103, -140443, -59189, -50654, -41458, 140648, 123418, 20785, -11862, 33336, -30396, -43876, 10252, 63273, 82794, 53473, 23606, -22479, 14979, 77807, 79925, 39314, 42367, 20285, 47685, -48399, -146099, -84282, 162, -17919, -28062, 29908, 48734, 101452, 25372, 43244, 46986, -50923, -116803, -91946, -121645, -166218, -166521, -152634, -113725, -62333, -4534, 71377, 113813, 190583, 45204, -103840, -57641, -120672, -109399, -107945, -53409, -13703, 56061, 8112, 29290, 1891, -18482, -70583, 20863, 82924, 13684, 39521, 11416, 13341, 668, -93445]
20564i3445J071j8019m194L1257K664M7890J2098K9903m4834J3078P3022l275
20552D7216j1539n5883q6882m2882P514j6627P2367K2953M4514r1873o2643m151
20540a77916J02732Q1644l6465M0934N0347r0680J9640J01193m297l6735j13478
20529f3081k9114L5573k7712L9117M1049N5936L4305j5435n5007j00246m1164
20518a25779R461m2227P39N9590R3306N8195k1551M3379m0512j134K7263m4855
20506A5875j43398L4992J08718L4597n7636O7728K0340n1632q039J5464n0018
20495a3009r1161o161j4648M6047M1404P7784k8649j8403P3553L3027r1225Q3907
20483I2466R4014L5244k4469m4906n2046n7507k1820O6177K0081l0989k0454J4627
$$ y = [-93445, -92374, -110393, -114587, -83330, -80666, -32776, -20678, 9225, -35609, -22531, 50491, 47216, 35677, -20206, -107088, -149970, -142456, -159083, -86716, -63763, -19249, -111122, -173765, -177916, -75184, 6460, -30005, 10929, 61276, -29404, -9764, 91429, 87132, 50397, -63081, -92195, -56622, -84334, -45217, -4168, 51768, 86073, 70638, 15631, -84615, -125779, -116318, -158545, -157806, -98216, -4910, 53285, 31734, 75113, 34601, 33467, 60730, 15875, -127523, -92531, 16187, 50784, -6852, 60876, 81216, 29584, 21545, 37009, -13009, -104170, -110331, -124979, -78932, -37528, 40256, 11607, -6796, 66757, 99784, 8559, 92466, 186480, 221724, 197255, 152349, 100303, 42796, 20976, 87153, 107234, 76245, 55791, 70418]
20471G0418l9826k1007P451j0524o7403q868L7398O101k8791N2900j4995p2421
20459h9567P5767O1243j1900j9962P0955p807o6910q296j2253k2297k3927J2601
20447d2353O8785J3083l0296q2685k1958k909k491o130O907L7628L0128J2477
20435a9814K8245L5903l2523l429K9099m1932M366k352q7420j8629L2073O3967
20423a2446M4177j767j3151Q292j1205k6325l410P5895j4378o0710k7592J6168
20411b6452K5813M704o7879N739Q1237L548p9569m2476K7795k8153K135l6550
20399a30108j00207P8542M1109o0587j7375R1355J11770m1570k5723O3234M6448
20388E6888P2127J4546q0382q0609K0557j1480J9255o3869J3175Q406j8137m2998
$$ y = [70418, 30592, 9585, 17036, 6512, -60891, -69759, -32361, -26260, -55051, -2151, -17146, -89567, -13800, 47443, 35543, 15581, 86536, 78729, 11819, 3523, -8730, -31027, -54954, -42353, 26432, 39515, 9219, -73466, -95424, -98333, -100824, -106954, -100047, -62419, -32291, -19814, 8431, 44334, 11811, 8382, 37481, -4451, -85, -2437, -89857, -108486, -76413, -12446, 31731, 29964, 16813, 25105, 13900, -12425, -15835, 60060, 45682, -15028, -42620, -26452, -639, 4065, -63814, -58075, 23162, 26710, -52859, -95335, -67540, -95693, -93558, -130108, -230315, -151773, -110664, -171251, -188626, -97271, 14499, -27071, -52794, 10440, 56888, 129015, 143561, 63179, -17430, 3127, -8353, 10902, -52967, -39792, -31386, -49523, -92521]
20376i2521o415Q4918J5051q4523K2628l2514K6855O740p392K0183M8593J9966
20364B1569n5776j8976N8553j2640J0564K5862L169O1760R419P298N6285j7544
20352A49543k8495K5930l1434r6947o0610j4782M4071R8091M1582n8634o8631
20341c16n5626N3539o7N99Q9123m4890p6232p2993J5222R8379L6609l4171k6095
20328a6919n4701K8955K5315o7058J3995j0990R3891J19739N2565l902m2845k9437
20316A08608L2871k2404q5942j8767J02677m218r7920r8596K7034O1167l5184
20305c0674L0320n7070m4337N6597P548O2195n836m5827M0795K4971n4221L9279
20293B3740K3390J8861k09j7738M4540k4314p0941L734N7629K6444l7255o9415
$$ y = [-92521, -98936, -14018, 1033, -83490, -60862, -93376, -66521, -59781, -67173, -46990, 1603, 21569, -34207, -53183, 5370, -7270, 3294, 29156, 32325, 94085, 103504, 110802, 167087, 149543, 121048, 146978, 115544, 18597, -42013, -56795, -12724, 85367, 126949, 68315, -316, -55942, -2403, -2470, -1871, 87252, 42362, -33870, -106863, -91641, 6738, 43347, 9176, -16919, -71620, -42665, -17350, -84408, -70413, -81403, 12488, 132227, 184792, 180890, 138045, 108608, 141479, 119075, 33133, 14366, 117043, 112825, 14905, -83691, -56657, 4510, -30674, -354, -57424, -101761, -45164, -37616, 24579, 18743, -27084, 13711, 38682, -15539, 23740, 47130, 65991, 65782, 48044, 92584, 68270, -2671, 1063, 58692, 85136, 47881, -21534]
20281b1534q2383K1568j2739J8054Q3349N1477p1666j5399P4916J777M5254L5844
20269A28518k9273M2842O0508q4426m2483M6050k7562l6905l6797j5131N918P810
20257A9069J4031J2124j3392J5507M7034r952l2224P1117L2577l9064J673q966
20245A09534q976J620O2507m561j2851r7343j20107N5906P6805P2340J37005m9856
20233B22023M0991J0148L0517P5946R8074j6541L0503M5859K6207j15627j44551
20222C03549n9190l5948o5263L4334J4010M201K2586J1534R1527J39957j1541
20211D49756j01647j21954k6294j0674j0713J1925L6875n3737m4676m8835M1987
20200A22013L3527J05223m4639m2942K7825M6534n1879J0404L2714Q410m9761
$$ y = [-21534, -103917, -82349, -95088, -77034, 6315, 57792, -13874, -29273, 45643, 47420, 92674, 128518, 99245, 142087, 202595, 118169, 75686, 121736, 94174, 57269, 20472, 5341, 11259, 19069, 33100, 45224, 31832, 47339, 94373, 84421, 52197, 123314, 155891, 116827, 118500, 109534, 100558, 102178, 164685, 160124, 147273, 49930, -70177, -14271, 62534, 134874, 271879, 222023, 263014, 273162, 303679, 379625, 477699, 461158, 491661, 537520, 563727, 448100, 303549, 244359, 208411, 143148, 177482, 191492, 195693, 218279, 229813, 321340, 461297, 449756, 348109, 226155, 199861, 189187, 178474, 190399, 227274, 173537, 128861, 80026, 122013, 155540, 260763, 216124, 173182, 201007, 247541, 195662, 206066, 238780, 247190, 197429]
20189A97429m1625o7068J3208l443k7382J0430Q5360P8918L2175j306N4514J43750
20177D74960M8243r0866R4q1863k5889O4979K0115Q5400K8054p5283L2487L1368
20165E11799m6870l5120p4594q3928m4172n3600n8989o5833q2880j2166j4316
20154f0669k3373k8531J26709N7795m677m7925L2116j0638k8473K9716K001l4672
20142I379M304O2044m937k8590n4968k722l5308m7363L824K3799J11344K8494
20130F9300j6764J2926J308k157M01l9788O3337M0360k5776k9678N4090r8267
20118B9292r3468k3771J87777K8061j26846k3421K8289J4396k6979j2990P8846
20107E9186J09553p0431N1305q677j8365K6757q785J5240O089p8888p2380L1333
$$ y = [197429, 155804, 88736, 101944, 98501, 71119, 81549, 166909, 245827, 278002, 276696, 331210, 474960, 523203, 432337, 432431, 350568, 324679, 389658, 409773, 495173, 523227, 447944, 480431, 511799, 464929, 429809, 355215, 271287, 227115, 173515, 114526, 48693, -34187, -46353, -60669, -84042, -112573, 14136, 71931, 67254, 19329, 51445, 40807, 12334, 42050, 44051, 9379, 13683, 75727, 70790, 42200, -12768, -15490, -50798, -98161, -94337, -70538, 40806, 69300, 52536, 65462, 66770, 64613, 65014, 25226, 88563, 128923, 103147, 73469, 127559, 29292, -64176, -87947, 99830, 127891, 1045, -22376, 5913, 20309, -6670, -19660, 59186, 168739, 98308, 149613, 140936, 122571, 149328, 140543, 155783, 161872, 82984, 10604, 41937]
20095D1937M2228J00292j60q7235j01719o7964m73j4351j2593P4584O4086M4283
20083H2915j33622n0537R3822l1642j8925P9848P7108Q3034K8768l7796L4635
20072B07608M12j5838p4170n5018M3846r963J3438k3329J0721q9059K3141O6088
20060I7877J23766m6609j07571q8959j5371m9993N1198J06081j2092j9212J7717
20049E6832j4873k4219l2887q8671o6417P3958R4526J2363N1965j0086p5277m4235
20037f7021k784N2161m6780k1509K6978J20829L9756p370n6380p273L0906n753
20025E5760j225k3006p872n1435r81P2388K6625j1353L0554R8023K434J8286n8388
20012A49810m9402l3979K167j0309L6290o7333K4277M0431R6629J0392n3845p0526
$$ y = [41937, 84165, 184457, 184297, 97062, -4657, -72621, -73094, -87445, -100038, -25454, 38632, 82915, -50707, -101244, -7422, -39064, -57989, 21859, 98967, 182001, 210769, 172973, 207608, 208020, 192182, 118012, 62994, 106840, 96877, 110315, 86986, 97707, 8648, 31789, 97877, 221643, 175034, 67463, -21496, -36867, -86860, -35662, 70419, 58327, 39115, 56832, 41959, 17740, -15147, -103818, -170235, -96277, -1751, 10612, 62577, 52491, -22786, -67021, -69805, -17644, -64424, -85933, -58955, 61874, 101630, 94260, 37880, 30607, 61513, 55760, 54535, 31529, 23657, -27778, -28759, 43629, 70254, 58901, 89455, 187478, 189912, 208198, 149810, 100408, 66429, 68596, 58287, 94577, 27244, 51521, 91952, 188581, 198973, 145128, 74602]
20000G4602m9809O8873p8262j08163M1777j2853m047L0420M7987N4945O9643K6772
19988A61885j13789j20586k5552J00466J2605K8362j2401m0346m840k9178n478
19977d8852l5128O5632k2697J4785K6543l1034J8696o701r501M3244m6918n309
19965c7240j6159K7343p739N9573M9506O5600o7196j19625j709p491j5445L2672
19953c7910o259j0083K9889J01393n4620J00800q906L9005J2473l748n3570l6578
19941G1886J8654J11998j9356p3821M1190j3400q2196K7590O801P0585l759q7271
19929F8901k275N3457N5704K9082o6328K9688m0510l8382N2082J15688N3193l5785
19917B74515p552j9786O4516M2309N2260j14214K0961R9298R7772r1319j50093
$$ y = [74602, 24793, 93666, 15404, -92759, -50982, -63835, -67882, -37462, 10525, 65470, 135113, 161885, 48096, -72490, -98042, 2424, 15029, 43391, 30990, -9356, -14196, -43374, -48852, -83980, -18348, -41045, -26260, 283, -30751, -12055, -18756, -28257, 14987, -31931, -37240, -53399, -26056, -33795, 25778, 75284, 140884, 73688, -45937, -47646, -55137, -70582, -37910, -44169, -54252, -24363, 77030, 22410, 123210, 114304, 153309, 165782, 162034, 108464, 71886, 90540, 202538, 183182, 109361, 150551, 137151, 54955, 82545, 89346, 159931, 156172, 68901, 66626, 120083, 175787, 204869, 138541, 168229, 127719, 89337, 141419, 257107, 310300, 274515, 266963, 247177, 311693, 354002, 406262, 292048, 313009, 412307, 510079, 418760, 268667]
19906B68667l0582j27062o9964R1293K9349N1894j2179j0204P4320K9047p786
19895B86793k1240L0732n2666l8659J4461J04430m4170q7246K771m3560J1491
19884A63137J9737J28717J7648n3874m9335K1626M2090M7048j13472J8687N3309
19873B95318M233K6251Q2445J3644m377j40800k75J7657j4676O9039Q8453J19912
19861E56824N0516K196J6433L5812M0071n7294p5229J0709J7088L8297P7737p6632
19849F36528O2575l9642L8241J6792M308J7457q3827j16699p3108J6945L1043
19838E10613r540o5023j07657j33199M4168J25949J49877P81p5748K203P8092
19827E20516K1314P5442M4011j09909p9840J7420L2323p1935j0457O3578K2167
$$ y = [268667, 238085, 111023, 41059, 132352, 161701, 213595, 201416, 191212, 265532, 294579, 286793, 265553, 296285, 243619, 204960, 219421, 323851, 279681, 192435, 195206, 151646, 163137, 182874, 311591, 329239, 275365, 226030, 247656, 289746, 336794, 223322, 242009, 295318, 299551, 325802, 408247, 421891, 417514, 276714, 276439, 294096, 279420, 348459, 436912, 556824, 607340, 609536, 625969, 661781, 701852, 644558, 569329, 580038, 597126, 635423, 713160, 636528, 699103, 659461, 697702, 714494, 718802, 736259, 652432, 535733, 462625, 479570, 510613, 501073, 436050, 328393, 195194, 239362, 365311, 515188, 515969, 440221, 442424, 520516, 541830, 617272, 661283, 551374, 471534, 488954, 521277, 449342, 438885, 502463, 524630]
19816E24630L2362O4301R6234J00337O1605O8537L2511K8713j33326q6808j1337
19805G77759k8726J48632J39451K1001J538r8148o4893O253j7212q4286j43712
19794F57657m0984l8773J6187j9070j2786K6796K1566J8012l4871J0170k320M644
19782F06228M3174K8443L7466m1638l8617P527Q4962Q749J4226Q0940J72264K86985
19770A290709K8283k83552j19635m5930n6856q9314K6435q1893K1757M5613M6424
19759G82041J0466Q05J50999J00798L0213R7415K62039J89869O0592K15844L25092
19748B226173L75520M73704O36020O83965Q32405P62535m63930j341933q72488
19739C311971m21615j19115l4681R5653J26031K13191K68860K18904O4348J56019
$$ y = [524630, 556992, 621293, 717527, 817864, 879469, 948006, 980517, 1009230, 875904, 789096, 777759, 749033, 897665, 1037116, 1058117, 1059655, 961507, 896614, 902867, 885655, 801369, 657657, 616673, 577900, 594087, 575017, 562231, 589027, 610593, 628605, 593734, 603904, 601584, 606228, 649402, 677845, 715311, 673673, 635056, 642583, 727545, 736294, 750520, 831460, 1003724, 1290709, 1318992, 1035440, 915805, 869875, 813019, 723705, 750140, 668247, 690004, 735617, 782041, 792507, 793312, 944311, 1045109, 1075322, 1172737, 1434776, 1624645, 1685237, 1901081, 2226173, 2601693, 3075397, 3711417, 4395382, 5227787, 5990322, 5526392, 4184459, 3311971, 2890356, 2771241, 2736560, 2832213, 2958244, 3171435, 3440295, 3659199, 3723547, 3879566]
19729C879566K69148L94890N25579O46119Q48861J048831J232310J485064J647778
19720A1978146J941479K457413L309941M503829O090405P364105Q782713J1816711
19712E8244742J6069388J1580715m839997p417285J773650O046248o271114j7599042
19704E7587305j1746531m150249J011501M833559P862821J0342241J3716820J6963361
19696I6420828Q768241j1109436k5053273k4368278j5066438q300443m681586
19689A6609615k844589j803040j085315o45801l50801j60290L2476L13654M61626
19680A0527535M35423O45028O91617R02788R33870J401586K259831L545025N124345
19671B6467048O204929O999983R305511J2839435O980056j1513568j4730884o804028
$$ y = [3879566, 4148714, 4543604, 5069183, 5715302, 6564163, 7612994, 8845304, 10330368, 11978146, 13919625, 16377038, 19686979, 24190808, 30281213, 37645318, 46428031, 58244742, 74314130, 85894845, 81054848, 73637563, 75411213, 81457461, 75186347, 57587305, 45840774, 41690525, 42702026, 47535585, 55398406, 65740647, 79457467, 96420828, 105189069, 94079633, 69026360, 44658082, 29591644, 21291201, 16609615, 13765026, 11961986, 10876671, 10230870, 9880069, 9719779, 9752255, 10065909, 10527535, 10962958, 11607986, 12299603, 13202391, 14136261, 15537847, 17797678, 21342703, 26467048, 32671977, 39671960, 48977471, 61816906, 68796962, 57283394, 42552510, 35748482]
19663C5748482q25949L051327N709024P539850R505920J3743099J5887893J017574
19655I1377220j3319600o739611L266569J1688443J1937536m962859j3024851
19648H0222847l834770L705934n637715k1903761j9204169j0902141o152544l719217
19640A2574464k441401j662812j152428r53572o77232l59750k79384k64302j67130
19631D616453j45659q8816o6740m8686K3365R8635J45665J59409L53516N25094
19621E572236Q24435R07842j73503j665306j682399r96756o34648m42898k38117
19612A470886j75001o9991j43356q4671j24184j24047k8164m483o4513J3598N8119
19601G24193q84p3671p3926j768j9639J0664N6471o9013l6506N4270J30339Q1774
$$ y = [35748482, 34922533, 37973860, 43682884, 51222734, 60728654, 74471753, 90359646, 91377220, 78057620, 71318009, 74584578, 86273021, 98210557, 93247698, 80222847, 76388077, 80094011, 74456296, 52552535, 33348366, 22446225, 16293681, 12574464, 10133063, 8470251, 7317823, 6364251, 5687019, 5327269, 5047885, 4783583, 4616453, 4470794, 4381978, 4315238, 4266552, 4289917, 4388552, 4534217, 4693626, 5047142, 5572236, 6396671, 7304513, 7131010, 5465704, 3783305, 2786549, 2151901, 1709003, 1470886, 1295885, 1225894, 1082538, 997867, 873683, 749636, 721472, 716989, 652476, 666074, 724193, 723309, 649638, 575712, 573944, 554305, 564969, 621440, 552427, 515921, 570191, 700530, 782304]
19589G82304Q5535J6144k606J16891J20480J22563K19401r0193l55712k31293
19579G83514j14541r2367o559M3785j6014M094Q4778R8935J9816q2016q5013M5101
19567F83513L5495k3198j45568p1036N3935J7237J5039k7034J61771m0635j35217
19556E24302r4467l1045m562n7968m0603L4613O325k5523j7101K5028L971j4671
19544C08299m2256L4062O485Q8371K6599j05096p5582M3414r585J6k7765r5592
19532A51370P993J03330J2844R384J6471M7261N0435m8243q297R6645R9412J6124
19520E54729l1284o7022m1225P8640J41615Q086p3666o1144L284N0754q857l1036
19508E22874R7031j9444j27693j21450l6001q3585j26476p4220k675O2847O2533
$$ y = [782304, 867839, 883983, 881377, 998268, 1118748, 1241311, 1460712, 1370519, 1014807, 783514, 668973, 576606, 570047, 613832, 597818, 601912, 686690, 785625, 805441, 723425, 638412, 683513, 719008, 695810, 550242, 479206, 533141, 550378, 565417, 538383, 700154, 659519, 524302, 429835, 398790, 394228, 336260, 295657, 330270, 336595, 311072, 293971, 318999, 322970, 308299, 266043, 300105, 306590, 394961, 421560, 316464, 240882, 284296, 274711, 274727, 246962, 151370, 159363, 262693, 275537, 284921, 301392, 348653, 399088, 350845, 342548, 439193, 538605, 554729, 523445, 456423, 415198, 493838, 635453, 643539, 569873, 508729, 512013, 562767, 553910, 522874, 619905, 600461, 472768, 351318, 315317, 231732, 105256, 31036, 28361, 91208, 153741]
19497A53741M6975K6301J2305j3006k3609M0803K9909l3854j13329n972L3767
19486A54031J31133n195k9943k9169o7605N0534N3162j4623J6610K7335m3972
19475B42298l3172N6443k7181p2619O0691P0131P6861O0112j1113O8313L8818
19464E29582n8911o3669j4795P5518K480J1223k6732q9166o7392o4847J05136
19453C38427N4200K4504o150r1701n6318K1061N6988M6611L3537J941K1540q3314
19441C61326J4514l5139l4538j9300m5750j5241Q5554k4452N1663N4323r488l6345
19429C47127R7409R1871O613j7550j9813n8260j2396Q2697k7925L6109N0011k2416
19417E53477N0224l106J5604L3194l053N0141M4635L021J05253J05041O8964N2817
$$ y = [153741, 200716, 227017, 239322, 226316, 202707, 243510, 273419, 239565, 126236, 120264, 154031, 285164, 279969, 250026, 220857, 153252, 203786, 256948, 242325, 258935, 286270, 242298, 209126, 265569, 238388, 165769, 226460, 296591, 373452, 433564, 422451, 490764, 529582, 470671, 407002, 392207, 467725, 470205, 481428, 454696, 365530, 298138, 233291, 338427, 392627, 417131, 410981, 319280, 262962, 284023, 341011, 387622, 421159, 423100, 444640, 361326, 375840, 340701, 306163, 286863, 241113, 225872, 311426, 286974, 338637, 392960, 383472, 347127, 444536, 536407, 543020, 525470, 505657, 447397, 435001, 517698, 489773, 525882, 575893, 553477, 603701, 600595, 616199, 649393, 646340, 696481, 741116, 744137, 849390, 954431, 1023395, 1076212]
19405A076212J33108O9861r8549l35038j77399L5918j7185k989p2592J0642K539
19394F24528j11884l3623j0252P1773J21885K5003P979J29461N1144L7897N3631
19383I67542p1556L6235M123M1467J68506J39912J38330J35770P0069J40529J36775
19372A907702K95014M21509M59601M97833P49971Q26052Q90407J25297j070964
19363E102422r48894m01405L9150J49253J85885J10073J90900M14052M95556O53810
19353E990802P85445J007194J173122J402863J640757J769375K274173L049028
19345A9092759M231090N864017P321771Q529658J0960487J5457361J4164583j794264
19337H3827462r113062p30603O844314k63247j3342044r677369j716700M587648
$$ y = [1076212, 1209320, 1279181, 1180632, 845594, 668195, 704113, 686928, 683939, 611347, 621989, 624528, 512644, 479021, 468769, 540542, 662427, 687430, 695409, 824870, 876014, 913911, 967542, 895986, 932221, 936344, 977811, 1146317, 1286229, 1424559, 1560329, 1630398, 1770927, 1907702, 2202716, 2624225, 3083826, 3581659, 4331630, 5157682, 6048089, 6173386, 5102422, 4153528, 3752123, 3791273, 3940526, 4126411, 4236484, 4427384, 4841436, 5336992, 5990802, 6776247, 7783441, 8956563, 10359426, 12000183, 13769558, 16043731, 19092759, 23323849, 29187866, 36509637, 45039295, 55999782, 71457143, 85621726, 83827462, 74714400, 73983797, 80828111, 80564864, 67222820, 57545451, 55828751, 60416399]
19329F0416399R859518K234653j6527227j6626998q259245k899904N26470K893814
19321C1617480M304249N765615R002673Q752714o910200j7919346j2045730o076119
19313A6491336l166335j795195r56235l12177J06966L53789N64068P20015J051774
19304A3058006J256521J404314J692012J962733K305015K806505M174952O144528
19296C4804586Q883249J1424468J3756021J7030618K0356677J3027231o449482
19289A12833368k4546581k4828590j3546613n140241Q6848L570062N834686Q328804
19281F2591743J2735174J7141350P272121j2030567j0675698N26736K763974j3967889
19273F6356944k3257169j5539256q506300m957316l172107j973069j394202r59965
$$ y = [60416399, 70275917, 72510570, 55983343, 39356345, 31097100, 28197196, 28723666, 31617480, 35921729, 41687344, 50690017, 59442731, 52532531, 34613185, 22567455, 16491336, 13325001, 11529806, 10573571, 10261394, 10368360, 10722149, 11286217, 12006232, 13058006, 14314527, 15718841, 17410853, 19373586, 21678601, 24485106, 28660058, 34804586, 43687835, 55112303, 68868324, 85898942, 106255619, 119282850, 112833368, 88286787, 63458197, 49911584, 44771343, 44858191, 48428253, 54262939, 62591743, 75326917, 92468267, 99740388, 87709821, 77034123, 77560859, 80324833, 66356944, 43099775, 27560519, 19054219, 14096903, 10924796, 8951727, 7557525, 6597560]
19265F597560o72620n01585l54733l23106k32117j41629j59323j15327j85580
19256C911540j75595j12713M925j40632K8285J26794J89583L89289N42512P16511
19246E480499P17150R98402R75804n23955j892903j483401q89286n40114m21875
19237B420321m16814k56233l0260J23955n1140k48387k11903m2455l8241n7275
19227A191568j07177j29166o6833M21j5242K3716K3152Q0308J22705J72059J64304
19216A459815J4245M8146j00621j90623k52423j64124j29821r9825J8592J13372
19206G16733N0393n7833j5072J56980J90293J03393r8790j79162l3060K9990P6548
19195I40413P9288J39523O8822j69057r1873K1790J21032J29702K6160Q51K055
$$ y = [6597560, 5924940, 5423355, 5068622, 4745516, 4513399, 4371770, 4212447, 4097120, 3911540, 3735945, 3623232, 3628157, 3487525, 3515810, 3642604, 3832187, 4221476, 4763988, 5480499, 6197649, 7196051, 8171855, 7647900, 5754997, 4271596, 3382310, 2842196, 2420321, 2003507, 1747274, 1717014, 1840969, 1789829, 1541442, 1329539, 1287084, 1248843, 1191568, 1084391, 955225, 888392, 888813, 873571, 897287, 920439, 1000747, 1123452, 1295511, 1459815, 1474060, 1522206, 1421585, 1230962, 978539, 814415, 684594, 584769, 603361, 716733, 767126, 709293, 694221, 851201, 1041494, 1144887, 1046097, 866935, 833875, 863865, 940413, 1019701, 1159224, 1228046, 1058989, 967116, 988906, 1109938, 1239640, 1265800, 1266651, 1268706]
19184A268706l1549j02111j98289r6067l6248L6057J14678K00886J3413r5879
19174A073597j81538k39138j78905j00775m522j8645o9438M3490M5019q1282j06580
19163A81283L7218M7166j5662k0779K556L5473J30357P455r554M1673O63J9067
19151D56916M6253N7081O6580J56123N1693o9432J1297K8892Q4368J11655J78794
19140A180220J25600p3061k06417r5696l5792Q7476J17620K23334J18666k4842
19130A417108j53528j61037j16830J1533o1622r5516j37145o2535j09352p8776
19120D52300R265J6672m9134m4477q7177k0157l7303l0468k7136M566L107o1493
19108A28565q1194K8940J02956M1148q332l440J14347l5466j20558m1537K6017
$$ y = [1268706, 1237157, 1135046, 936757, 840690, 804442, 840499, 955177, 1156063, 1169476, 1073597, 892059, 652921, 474016, 373241, 368719, 350074, 280636, 324126, 369145, 287863, 181283, 218501, 265667, 250005, 229226, 231782, 267255, 397612, 405067, 395513, 437186, 437849, 456916, 503169, 560250, 626830, 782953, 834646, 765214, 776511, 805403, 889771, 1001426, 1180220, 1305820, 1232759, 1026342, 930646, 894854, 982330, 1099950, 1323284, 1441950, 1417108, 1263580, 1102543, 985713, 997246, 935624, 840108, 702963, 640428, 531076, 452300, 461565, 478237, 429103, 384626, 297449, 277292, 239989, 209521, 182385, 186951, 190058, 128565, 47371, 76311, 179267, 220415, 212083, 208643, 322990, 287524, 166966, 125429, 151446]
19097A51446K289p779J0047K5352M2461Q165J00069R0916N1907Q1234r4775n4177
19085D07155q3134m1200K9818K3704K5789O7029K3453n8057l2630q3645o5891
19074B12391J2996p9559p0710N6530Q9704L3011j5152o0652K7663O9274m7437
19063B28059j56430q6684q64L9237j468j6612L652M9264l152L1048K4327L9856
19051A50233Q912j5506j8759k6218N8174k4069J08032Q629m6410m0039l7580l6273
19039H9126l9033p1151m4888j9209j428P1002J11914L8413p3071j3330O6383l3852
19027H0876n1956O1839j2578p7388o785P9215J3010q8638L6303N4120J1168N9076
19015A58262k8442j5906m0109q9957n4949J0534J2305K6894o485R6548J03633
$$ y = [151446, 153735, 145956, 156003, 181355, 223816, 231981, 332050, 422966, 474873, 556107, 461332, 407155, 324021, 282821, 312639, 336343, 362132, 429161, 452614, 394557, 361927, 278282, 212391, 225387, 145828, 75118, 131648, 221352, 254363, 239211, 178559, 206222, 275496, 228059, 71629, -15055, -15919, 23318, 21850, 5238, 8890, 58154, 55002, 86050, 110377, 150233, 159145, 143639, 124880, 98662, 156836, 132767, 240799, 249428, 203018, 162979, 125399, 89126, 50093, -21058, -65946, -85155, -86583, -15581, 96333, 134746, 61675, 48345, 114728, 80876, 28920, 90759, 78181, 793, -5992, 73223, 86233, -2405, 33898, 88018, 99186, 158262, 129820, 113914, 73805, -16152, -71101, -60567, -48262, -21368, -27853, 68695, 172328]
19004A72328K6349j13007l6609p302P6057L5424m4001j8503M6288O2370n4595
18993A44799j2481L4668J6963n239R378l6207o8156o607K8122m927k6418N9207
18981A33102M4834Q4668o8639m5124n025L0435J5813O8878n4090m6770r887p7663
18969G0532j1356K0684l4841n3096n6781M3291J26370k8987p5983q4252N4457
18958b9962N1480O7302j1000l9370O0354Q1792j49803j0355J16569J16240K4475
18947B77722K509L8455l5489l0564O0528k7383l4026m6443l2246N055l9578J5737
18935A54277k087o951J30761P5639M189l7286o4175l4554P528q6063k5200N6350
18923A72428P5980J6636K7440J0465k0755R7501L0836q322k0794n9924m7928q5483
$$ y = [172328, 198677, 85670, 49061, 41759, 117816, 153240, 109239, 90736, 137024, 199394, 144799, 132318, 166986, 183949, 178710, 188088, 151881, 83725, 77118, 105240, 100313, 73895, 133102, 177936, 262604, 193965, 148841, 143816, 174251, 190064, 258942, 204852, 158082, 148195, 70532, 59176, 79860, 45019, -8077, -64858, -21567, 104803, 75816, -167, -84419, -29962, 21518, 88820, 77820, 38450, 98804, 180596, 30793, 20438, 137007, 253247, 277722, 280231, 318686, 283197, 252633, 313161, 285778, 251752, 205309, 173063, 178118, 138540, 154277, 152190, 145239, 276000, 351639, 355828, 318542, 254367, 219813, 227341, 141278, 116078, 172428, 248408, 265044, 292484, 302949, 282194, 379695, 410531, 402209, 381415, 321491, 273563, 188080]
18911A88080j23085K7818N8135R4552Q0486K5509N1346m1834j1883r2767n8895
18900A97462Q6498J6933n7607j15667j1305K0564r112N4850L6281L6720J7381
18889B72998n4614j5854J8317M5259M7857M1192n0838j05473L0775O4717j5372
18878B78964J7583m1191J2353k7084m1871L1683J31993Q986j529L3987l3960O1010
18866D30924q5889p9709q9364Q497O3895K9356J4056j7844J8375M534k1205K961
18854B78587l7037o992l0983O5170Q6497J6083M239k4719N0233n210q452j3509
18842C73907l0269n048K2829Q425j0105n1939n7096Q6135J01879o0146n7925n7855
18830B62792L9117J7038o5395m7384P230K5820K2949J17779N4746l445L9555K0341
$$ y = [188080, 64995, 92813, 150948, 245500, 325986, 351495, 402841, 361007, 349124, 256357, 197462, 283960, 300893, 243286, 127619, 116314, 136878, 127766, 182616, 218897, 255617, 272998, 218384, 202530, 220847, 266106, 313963, 355155, 304317, 198844, 229619, 294336, 278964, 296547, 255356, 267709, 240625, 198754, 230437, 362430, 371416, 369887, 403874, 369914, 430924, 345035, 265326, 175962, 184459, 248354, 277710, 291766, 273922, 292297, 296831, 275626, 278587, 241550, 234558, 203575, 268745, 355242, 371325, 375564, 350845, 401078, 395868, 387416, 373907, 343638, 338590, 361419, 369844, 359739, 307800, 250704, 336839, 438718, 378572, 320647, 262792, 301909, 318947, 253552, 206168, 213398, 239218, 262167, 379946, 434692, 431247, 470802, 491143]
18818D91143L4274K4544O2478N9851R3995K2473m1715L2129L4457j7094j12893
18807F83642m0308k071K6182O7811M0413N901J4814L8276m8155p8987O146L4740
18795G48404p4767l8918J12771J37294m539k5459J9064P2185O6910j9749m6720
18784I46476j4475R9809K0810K6037m5541Q3460O1826N3813J16113J49867J54033
18773A652228J31734J01279R9208R9121J57164J38569J46534K37376k2949k30221
18763B510043j16337j5931P2005K57425K60381K92591L99769N05775N84415O44878
18753E395014O75076Q08306J254723J964116K484480K900878L457645M456211
18745B3396449N832315J399991o461814o000020k352352J87631J829465K995237
$$ y = [491143, 525417, 549961, 612439, 672290, 766285, 788758, 747043, 779172, 813629, 796535, 683642, 643334, 641263, 667445, 735256, 775669, 781570, 796384, 834660, 786505, 707518, 713664, 748404, 673637, 634719, 747490, 884784, 880245, 854786, 873850, 946035, 1012945, 993196, 946476, 932001, 1031810, 1052620, 1078657, 1033116, 1116576, 1178402, 1232215, 1348328, 1498195, 1652228, 1783962, 1885241, 1984449, 2083570, 2240734, 2379303, 2525837, 2763213, 2740264, 2510043, 2393706, 2377775, 2449780, 2707205, 2967586, 3260177, 3659946, 4165721, 4750136, 5395014, 6070090, 6878396, 8133119, 10097235, 12581715, 15482593, 18940238, 23396449, 29228764, 30628755, 24166941, 18166921, 15814569, 16002200, 17831665, 20826902]
18737B0826902L783548M630306O870297O687546m396950j2740468q913253m718657
18729A2029271k533685j316210r01005p01657l72462k09784l29209l57773n7275
18720E250211J77128K91632L40006L28120N51305P93521J036500J210703J408917
18711A1388043J677551J978739K130018K340581L049334M406088O427805Q891445
18703D2289604J1138470J2941578J5886489K0883280J5069609j5060425k9239988
18696G3908617j8050022p373446n88376M048712P016974Q910360J2541236J6848623
18688I7262678N109488j9676534k0878267r598976k749988n476590q613140n184410
18680C0194261j917649k8087J001385J742520L146084N150474P388692R749907
$$ y = [20826902, 24610450, 29240756, 36111053, 42798599, 38401649, 25661181, 16747928, 12029271, 9495586, 8179376, 7278371, 6576714, 6204252, 5994468, 5665259, 5307486, 5250211, 5427339, 5718971, 6058977, 6387097, 6938402, 7731923, 8768423, 9979126, 11388043, 13065594, 15044333, 17174351, 19514932, 22564266, 26970354, 33398159, 42289604, 53428074, 66369652, 82256141, 103139421, 118209030, 103148605, 73908617, 55858595, 48485149, 47896773, 51945485, 58962459, 67872819, 80414055, 97262678, 102372166, 82695632, 61817365, 52218389, 49468401, 43991811, 35378671, 30194261, 28276612, 28248525, 29249910, 30992430, 34138514, 39288988, 46677680, 56427587]
18672E6427587J1722886J4535185J9814779J7643175q883796k7954356k0182468
18665F3122992r467645l236753N53332L470726O794618J1198052J6145307K0780435
18657A09361064K6792399L5126121L3559439N302773j5652048l3744778n0186683
18650A10558287l6534932j9364344r763105m566620j400031J192729L620096N935294
18642D9677374P695485R305994J2902273J7066978M963530k2273456k5182856
18635E4155322j4398339p179442l459794j468290m01986P73605K169581L700544
18627C3891201N238974P123831J0027270J2935849J0301817M558715Q271746Q482000
18619A00831403j1092112k3140303j5038049n600288O15874M875497P377560R517007
$$ y = [56427587, 68150473, 82685658, 102500437, 120143612, 111259816, 83305460, 63122992, 53655347, 50418594, 50971926, 54442652, 61237270, 72435322, 88580629, 109361064, 136153463, 171279584, 204839023, 210141796, 194489748, 160744970, 110558287, 74023355, 54659011, 44895906, 40329286, 38929255, 40121984, 43742080, 49677374, 57372859, 66678853, 79581126, 96648104, 101611634, 79338178, 54155322, 39756983, 32577541, 29117747, 27649457, 27247471, 28021076, 30190657, 33891201, 39130175, 46254006, 56281276, 69217125, 79518942, 84077657, 92349403, 100831403, 89739291, 66598988, 51560939, 45960651, 46576525, 51452022, 58829582, 68346589]
18611F8346589J4076224J4315516o687211k6958947k2029981j3282441p992662
18604A9787087m776007k818111j762589j159397r04888o12852m83633m91195n67680
18595F210735l61425k87390j75952L3814p6047P6121L00055L53970L69720M30452
18585F874053L63085M05234O80992J015096J476635K127746K932138L554825M091681
18576B3521485N545158O776481Q34484q996111q726510m400544j524167O6399
18568A3096675J217707J785492K675929L849450J430468n588403o924114m108354
18560G434850k137641j183041p26520m90126k22571j95599j79289j82696j97551
18551A919816r2550P63l0695n0979m2253j44396j83408j04302O8129J49739Q8416
$$ y = [68346589, 82422813, 96738329, 90051118, 63092171, 41062190, 27779749, 19787087, 15011080, 12192969, 10430380, 9270983, 8366095, 7753243, 7269610, 6778415, 6210735, 5849310, 5561920, 5385968, 5419782, 5343735, 5419856, 5719911, 6073881, 6443601, 6874053, 7237138, 7642372, 8323364, 9338460, 10815095, 12942841, 15874979, 19429804, 23521485, 29066643, 35843124, 36677608, 27681497, 18954987, 14554443, 13030276, 13096675, 14314382, 16099874, 18775803, 22625253, 24055721, 18467318, 11543204, 7434850, 5297209, 4114168, 3387648, 2897522, 2674951, 2479352, 2300063, 2117367, 1919816, 1827266, 1828029, 1797334, 1746355, 1704102, 1559706, 1376298, 1271996, 1340125, 1489864, 1578280]
18540A578280j6058q4586n6897j33271j85158j82784j01699J8878l3734N4489
18530H57460k9514r6908q2191N6933J9061m405R3951L1116q8446j18846r8006
18519E40205J5103P7722q235P9548J75265J13487M7154j55989j61476r1764j62516
18508D68504q6462k8075N3666n3167j04207Q2492J13475j7642p559L5855p8067
18497C78813o3241Q384Q619J2893j0711q2356j5600J36704l665q1257o0041m8722
18485A79820O3181P1110l3464l7929K6534R226Q3588O0944l0180j05573k561J01790
18473C86486O7246j3038j22214q1756P3469O7210J81081Q2866L7745P848j40711
18462E46232k15101r1843N420l508K1409l7509j7461P2567J6453l6912K4759K3962
$$ y = [1578280, 1562222, 1477636, 1420739, 1287468, 1102310, 919526, 817827, 836705, 802971, 857460, 827946, 731038, 648847, 705780, 724841, 720436, 814387, 845503, 757057, 638211, 540205, 555308, 633030, 624795, 704343, 879608, 993095, 1040249, 884260, 722784, 631020, 468504, 382042, 353967, 407633, 354466, 250259, 332751, 446226, 428584, 421025, 456880, 378813, 315572, 323956, 332575, 345468, 334757, 252401, 236801, 373505, 369840, 288583, 228542, 179820, 243001, 314111, 280647, 242718, 269252, 278478, 362066, 423010, 392830, 287257, 284696, 386486, 453732, 440694, 318480, 236724, 310193, 377403, 558484, 641350, 679095, 686943, 546232, 331131, 239288, 244708, 241200, 262609, 225100, 207639, 280206, 296659, 259747, 284506, 308468]
18450C08468N2666O4533R096p2315n1946j00000p559p8661l9717M423L7070O5451
18438A91509j0526K787Q031j9398l7759J29755R9221Q1721N1613o3198L1929L600
18426D69285P468q4963p884N7210o5594q3188J1236J10365O8058L6242m0156j19149
18414C58930p4024J7152n1801K5472P742R28J6673M3330L6382p92J0196M7583
18402D37771j6485j02019n1188L4098J5975r2352n3131Q0617J06398k1806p7378
18391B60500n6899r463j5294O3342J1036j0450o2746j8999l2204l8314j1758L9913
18379A18664L2474O3662Q8803M1752J4061L2602m3288k9277l8619J5251q788K4242
18367C11539J7669m1233K4449j8557p7839N3403k8193M2744K5881M0607M3299
$$ y = [308468, 361134, 425667, 434763, 362448, 310502, 210502, 202943, 124282, 84565, 88988, 126058, 191509, 180983, 183770, 191801, 172403, 134644, 264399, 363620, 445341, 496954, 433756, 465685, 469285, 476753, 391790, 383906, 441116, 375522, 292334, 303570, 413935, 481993, 518235, 478079, 358930, 284906, 302058, 250257, 275729, 283471, 284399, 301072, 344402, 380784, 379992, 390188, 437771, 421286, 319267, 268079, 302177, 318152, 225800, 172669, 253286, 359684, 337878, 260500, 203601, 194138, 178844, 242186, 253222, 242772, 180026, 161027, 128823, 90509, 78751, 118664, 151138, 214800, 303603, 345355, 359416, 392018, 348730, 319453, 280834, 296085, 287297, 311539, 329208, 287975, 312424, 293867, 216028, 269431, 241238, 283982, 309863, 350470, 393769]
18356C93769o1858m6964p0470n4427k591J0885K2683L875m0633r0931O3228L7384
18344A63950j3378m6555j3285j0412J72307O2434m4240k8393n373j6493k2650
18333A97912j456k0503k9430J8904M910k2383l8138M5795L1683l217N7490R194
18321B50761j19588l3517l4366l4433J02349N0250r570K5369K8695j1150j07846
18310A06954l2594j7243n4079O1246J65265M32j06225k4608O4712N8303j7398
18299B04765q123R677Q8980O5079m6497n8709o5111q7965r0322j1513P1586n061
18287F6786K5118P1639K0904M4404l530j59948r3765k0571p415P5649J47340K4487
18275A91098l4061k333j6595j20224l4827P2840J25356j4392n8638o5702k1678
$$ y = [393769, 331911, 284947, 214477, 160050, 157459, 168344, 191027, 194902, 154269, 63338, 126566, 163950, 150572, 104017, 90732, 80320, 252627, 315061, 270821, 242428, 237055, 220562, 197912, 196456, 175953, 146523, 165427, 170337, 147954, 109816, 155611, 187294, 184077, 241567, 250761, 131173, 97656, 63290, 28857, 131206, 181456, 171886, 197255, 225950, 214800, 106954, 74360, 57117, 3038, 64284, 229549, 229981, 123756, 99148, 163860, 222163, 204765, 196642, 206319, 295299, 360378, 313881, 255172, 190061, 102096, 11774, 261, 71847, 66786, 91904, 163543, 184447, 228851, 225321, 65373, -28392, -48963, -56378, 19271, 166611, 191098, 157037, 154704, 138109, 17885, -16942, 55898, 181254, 166862, 108224, 42522, 20844]
18264B0844O8068l2577k4401J9726M5248R3668m97j4744p2930P412q333k4905
18252G6579k7211R3391N6996o7398j9582O9683M0618p923R313m4391l8660j5256
18240A26159J0762k1363j3884K701n909j5926O5285Q5790k6799m5942k0505L1561
18228A71930n5411j9085L9169K4190Q7185N9873K4842P0737Q3475O081K018r8029
18216C96975m9348J04548l6199K1214M0255q3293p3678k1097m7917m0703P376
18205B18133l0684l7940k6244k5235n5021k3696M7244p844k0740N4749Q6904L5573
18193B15199j03970J0661N4874l6508M8660J21795J11916r0880j2800m1804j4846
18182B62297O0884k8724j9233J03200P4888K6041N0762J25470k3777m7806j1433
$$ y = [20844, 88912, 56335, 31934, 51660, 96908, 190576, 190079, 175335, 102405, 109817, 101484, 76579, 49368, 142759, 199755, 132357, 112775, 182458, 223076, 215153, 224466, 180075, 141415, 126159, 136921, 115558, 101674, 104375, 98466, 82540, 147825, 233615, 206816, 160874, 140369, 171930, 116519, 97434, 136603, 160793, 247978, 307851, 332693, 403430, 486905, 492986, 495004, 396975, 347627, 452175, 415976, 437190, 477445, 394152, 320474, 299377, 251460, 210757, 218133, 187449, 149509, 123265, 98030, 43009, 19313, 66557, 58713, 37973, 92722, 179626, 215199, 111229, 121890, 176764, 140256, 188916, 310711, 422627, 331747, 318947, 277143, 262297, 323181, 294457, 275224, 378424, 453312, 479353, 530115, 655585, 631808, 584002, 572569]
18171E72569P6256Q5718R8349K12123P2996n6874j56068l5024L8663O8929O4325
18160A041962O2865j31586j06684k2935R242K777l0413Q1183k2289j00077o6323
18149G17722k5110J1252O0245k956o1788Q095k4051q2000M0401O0858R2820J60722
18137I56210J30891J54265Q5599O1554J62516K68633K36047K43808K98962L30051
18127B928536M16332N53908P90034J121114J386130J838146K150280K298242K438166
18118A5920888K601386K884440L538429M798795P191749J1014451J5326290J7881480
18110H1157908K0402426L0723687M0951034m621264o3268776m7425465k2984469
18103C4935081j1529409o451682l969473k699509j927814j345392j076815r93476
$$ y = [572569, 648825, 734543, 832892, 1045015, 1118011, 1061137, 905069, 870045, 908708, 977637, 1041962, 1104827, 973241, 866557, 843622, 852864, 855641, 825228, 906411, 884122, 784045, 717722, 692612, 703864, 764109, 761153, 699365, 707460, 683409, 601409, 641810, 702668, 795488, 956210, 1087101, 1241366, 1326965, 1388519, 1551035, 1819668, 2055715, 2299523, 2598485, 2928536, 3344868, 3898776, 4688810, 5809924, 7196054, 9034200, 11184480, 13482722, 15920888, 18522274, 21406714, 24945143, 29743938, 36935687, 47950138, 63276428, 81157908, 101560334, 132284021, 173235055, 168613791, 105345015, 57919550, 34935081, 23405672, 16953990, 12984517, 10285008, 8357194, 7011802, 5934987, 4941511]
18095D941511p75728n61079l16608k43195k80842k57268k77526k47834k15926
18086A765505j40480j05201j08997j47329m3396j01845q0088n8558n1798j03178
18076H24635o804L5967m0841m8165j01174n3589l8229j523l1740N885N3383n700
18064E92105M1115j246N7768j2508j01436p3872M1241k7569J3624m9949r5582
18053C83691m0669o9735q808P8301M6714m9963j2311p9914o6044k0441m1000l3535
18041H6286R7981K4999j16581j92813L08Q4609L2846m8285J04472P8373n1689
18030A00506k8299N998L7294J3947R929L245l7957j8637K1164O4370j3854m7358
18018A10348L3902j9658j30582J88K8108J6840P9071O2707P4102j1062l3605m2695
$$ y = [4941511, 4165783, 3604704, 3288096, 3044901, 2764059, 2506791, 2229265, 1981431, 1765505, 1625025, 1519824, 1410827, 1263498, 1220102, 1118257, 1038169, 979611, 927813, 824635, 817831, 853798, 812957, 764792, 663618, 610029, 571800, 570277, 538537, 544422, 597805, 592105, 633220, 631974, 689742, 677234, 575798, 501926, 543167, 515598, 529222, 479273, 383691, 343022, 273287, 264479, 342780, 389494, 339531, 327220, 247306, 181262, 160821, 119821, 86286, 184267, 209266, 92685, -100128, -99820, -15211, 17635, -30650, 73822, 152195, 100506, 72207, 78205, 115499, 129446, 139375, 142620, 104663, 86026, 107190, 171560, 157706, 110348, 144250, 124592, -5990, -5802, 22306, 39146, 118217, 180924, 255026, 243964, 210359, 167664]
18006A67664L1339M1060l4015m4179L620l3976j1432k4708N8604N6328p4449J0667
17994A46523M30J6431J4650j2564j25891m3289P5899K019r7067m9698J52989K6245
17982A06677J3105K9697M745O4544P573o8555L7650m0017j5983k646K6712r3580
17970F9922j6043K5240l0793q0696k8753N6647j9564o613M22L8668k2886j5351
17958b9800j0486J6272L7084M0321K2504N122M6108J07347M0628q1988q9936p648
17946I5528O0178l2045P4404k8442j61271k4529J013r83r988P609K5833j3766
17934f459M1812O6939j8194p451O2858j5170l7064J6240J6317J8726M0294K1536
17922B00384q2551j6722N3560L8283p8604j0391K0140m8940o3264Q3848J07723
$$ y = [167664, 199003, 240063, 206048, 161869, 165489, 131513, 120081, 95373, 153977, 210305, 135856, 146523, 146953, 163384, 178034, 165470, 39579, -3710, 72189, 74208, -22859, -72557, 80432, 106677, 119782, 149479, 154224, 218768, 226341, 157786, 195436, 155419, 139436, 136790, 163502, 69922, 53879, 79119, 48326, -32370, -61123, -4476, -24040, -30653, -30231, 8437, -14449, -29800, -40286, -24014, 13070, 53391, 75895, 81017, 127125, 234472, 275100, 193112, 103176, 95528, 155706, 123661, 198065, 169623, 8352, -16177, -15164, -16147, -26135, -18526, 7307, -6459, 35353, 102292, 84098, 76647, 139505, 124335, 87271, 103511, 119828, 138554, 178848, 200384, 117833, 101111, 154671, 192954, 114350, 103959, 124099, 75159, 11895, 95743, 203466]
17911B03466n9330j18077j0048K7456k0435M346R29r5024k4877Q2099R5471l3352
17899E2624q4532o3670n2492J9377L5505N6804N297J28331J8864l8264k465p4621
17887G58N8730J74038l6695j54617n9382L1757J00602O6243J2670j06118J6303
17876A04289o7981l0758L0900M931J9568J4057K8830J8163J0305R752n686k0897
17864A15473j2770n2762p1646J9960k0977L5762M9335K2230J3634L9905j21412
17853A6732m3640l7362P4288R0346N4592m2086r0448q5122J2800l7361j5163p0257
17841a72681J8122Q2139j1189N0426J1736M2803k963p5989m9839M5981L696L4167
17829b3591O5909l6057j2800m1084L3012O4671O637n3402k7677N6185M8792L3657
$$ y = [203466, 144136, 26059, 16011, 43467, 23032, 27378, 28307, -66717, -91594, -9495, 85976, 52624, -31908, -95578, -148070, -128693, -93188, -36384, -31087, 97244, 116108, 77844, 75379, 758, 59488, 233526, 196831, 42214, -17168, 14589, 115191, 181434, 194104, 87986, 104289, 36308, 5550, 36450, 41381, 60949, 75006, 103836, 121999, 132304, 142056, 136370, 115473, 102703, 49941, -21705, -1745, -22722, 13040, 62375, 84605, 98239, 138144, 16732, -26908, -64270, 10018, 100364, 154956, 112870, 22422, -62700, -49900, -87261, -102424, -172681, -154559, -72420, -83609, -33183, -21447, 21356, 18393, -57596, -107435, -61454, -57758, -23591, 42318, 6261, -6539, -47623, -14611, 50060, 56697, 3295, -24382, 31803, 80595, 114252]
17817A14252J9268n8245r5736k3235m3535P6174Q3716L4727N6708k7055k0464
17806A16575n8527J8680n498k1476r2513p478K2643K0026Q64p5719J3290N0387
17794a8746p873P1879m513J9002J6274k6455m1480R0787M9955r1276p5583L1813
17782A3784K2687j8433j21576q0648J01319M7824o7544K6152P4478M0134L9343
17771G7520M341M1167n7133m7035M1980k0835o0633j1989P1851l0531n4003l3496
17759g8796Q3741J13709J614r201j3439O6212n807j25428m8135j34988k0271J5464
17747a55325M1368r235o5921J17200J09080N513J862J2405L1697n779j3023p0651
17735h09m5215J2438N7000N9593j2916l8580K1956l42J8245J0703j7130q3257
$$ y = [114252, 133520, 75275, -20461, -43696, -87231, -11057, 72659, 107386, 164094, 137039, 116575, 58048, 76728, 71230, 49754, -42759, -50237, -27594, -7568, -6704, -82423, -69133, -18746, -26619, 45260, 40747, 59749, 76023, 49568, 8088, 98875, 148830, 57554, -18029, 13784, 36471, 18038, -103538, -184186, -82867, -35043, -102587, -76435, -1957, 38177, 77520, 81861, 123028, 65895, 18860, 60840, 40005, -20628, -32617, 39234, 8703, -45300, -78796, 4945, 118654, 120268, 111067, 97628, 163840, 158033, 32605, -15530, -150518, -170789, -155325, -113957, -123192, -189113, -71913, 37167, 42680, 44542, 56947, 88644, 82865, 69842, -809, -46024, -33586, 23414, 83007, 70091, 31511, 53467, 53125, 71370, 82073, 64943, -18314]
17723a8314r5497L4901M3990r82j0899K8454P6096M5138p0110k9944p9187j09532
17711a85886l8722O2535R1396L6677L0469l7406j4680J7650k1685Q3899K9072
17700E3319j5006N4094M1596j614n7773m2993k5508L9230O2296n1253m0445L3581
17688D9524k3481L982m6362m401j6694l7671k7986R8264p4313q081r203K6125
17676g0297R2012N2126j19158p350J3091L1774M6271j5780p7251K6536R89N3680
17664B6643N3473J2617j298L1401k2625n0886n5913n9677k7030M7292L4798K5135
17652A3930q630r2916k7913O1451Q6505K4515q7484j1124K8321P4297l7166n9391
17640c5605K7248M2480J3932j0953m2495k9337q428k425K1311O240L1986O7730
$$ y = [-18314, -113811, -78910, -34920, -35902, -46801, -18347, 57749, 102887, 32777, 2833, -76354, -185886, -224608, -162073, -70677, -34000, -3531, -40937, -55617, -37967, -59652, 24247, 53319, 38313, 92407, 134003, 132389, 74616, 31623, 6115, 45345, 107641, 56388, 15943, 49524, 26043, 30025, -16337, -20738, -37432, -75103, -103089, -4825, -79138, -87219, -96422, -70297, 21715, 73841, -45317, -52667, -39576, -7802, 38469, 22689, -54562, -28026, -27037, 26643, 80116, 92733, 91435, 122836, 100211, 49325, -6588, -66265, -93295, -46003, -11205, 13930, 5300, -87616, -115529, -54078, 32427, 56942, -30542, -41666, -13345, 60952, 23786, -35605, -8357, 34123, 48055, 37102, -5393, -34730, -43158, -45583, -24272, -18032, 13954, 81684]
17628H1684o2302o7868p007m3367J7276Q8119n0022K5146o8080j2885K8573k9078
17616i9811q816R8694L1958l2045O1742J9236l7543K4551j4849n566m3431n1602
17604e7482P4127J3163r8836M6607N7297K1148L2345j8676k4582q5050k4064P7222
17592A3219L7963r009m8643O7215J3486n8749j12259M636R8006j5411L3722R7458
17580A21634K1370m2771m8895M4427j9355K7428p3168K546j5757r5964l4188M3116
17568f9577L2086M7372J0476L573m7875l9195n5368J840N684J15276N3737M9989
17556A08018k7723M8592l9754m3834J8278m5600L0175m9010l7821o5849P9398
17545b5130P1943Q4538J856k4452J7491m7389m3353N261m8641k4481N513N3834
$$ y = [81684, 19382, -48486, -55493, -98860, -81584, 6535, -43487, -18341, -86421, -99306, -70733, -99811, -108627, -9933, 22025, -10020, 51722, 70958, 33415, 57966, 43117, 37551, -5880, -57482, 16645, 29808, -69028, -22421, 34876, 56024, 88369, 69693, 45111, -39939, -64003, 13219, 51182, 42173, -6470, 60745, 74231, 15482, -96777, -92141, 5865, -9546, 24176, 121634, 143004, 100233, 51338, 95765, 76410, 103838, 30670, 33216, 17459, -78505, -112693, -69577, -37491, 9881, 20357, 23930, -23945, -63140, -118508, -116668, -110984, 4292, 58029, 108018, 80295, 128887, 89133, 45299, 63577, 17977, 48152, -858, -38679, -104528, -25130, 46813, 131351, 133207, 108755, 126246, 78857, 35504, 40765, -7876, -32357, -26844, 26990]
17533B6990M463L6859L5630j4479n5393j9002j17108P1887P9928O2283j4735q4513
17521A2810k7529j8531k962k5280L1907l386p0521n1195L5221N8257P2420l5959
17509b4748p9980L4236K8428j3083l3091r2932K1539K5002L6554N4112O1191r161
17497H067m327j12004J2169O9295M5237m95q212k7826M8903K1146M4001l2601
17485F3353p3744L1920L6252l1205p6327m4380j7500M4788K1931O8559K0997K1319
17473F5963o032p3407k5955O9862J7720R3792O3916l7960p9793r4934L3751L8205
17461F5128P0144l6128m4794J6533M5277k8101l9031N9524P0921j4342n1022k4591
17449H9518M9412J36982j3904J21007J61941N6271J04247K29315J32095l25026
$$ y = [26990, 31453, 68312, 103942, 89463, 34070, 15068, -102040, -30153, 49775, 112058, 97323, 12810, -14719, -33250, -36212, -61492, -29585, -32971, -103492, -154687, -119466, -61209, 11211, -24748, -104728, -70492, -42064, -55147, -88238, -181170, -159631, -134629, -98075, -43963, 17228, 8067, 3740, -108264, -96095, -26800, 18437, 17942, 9730, -18096, 30807, 51953, 95954, 63353, -10391, 21529, 57781, 26576, -49751, -94131, -111631, -66843, -44912, 23647, 44644, 65963, 59931, -13476, -39431, 30431, 48151, 141943, 205859, 167899, 88106, -6828, 26923, 65128, 135272, 99144, 54350, 70883, 116160, 88059, 49028, 108552, 179473, 165131, 114109, 89518, 138930, 275912, 262008, 383015, 544956, 601227, 705474, 934789, 1066884, 741858]
17439G41858l58746j61961o1146m1854p4997l6134l4508l8979p557L511O4008
17428f505K2114j6105j0574n4966M6242N3378m5613o4101O6740J1220k6500r236
17416c3906K7048P4679k68n1377N8025M8066k6238j23183N6373M844K9694P265
17404G1022L1453m4556j27281q9351J8293J2823K9677J4096K4598k6823o1218
17393a47267j20325N7688M0082L1177R6942J07858M1526n255Q262k7342q6827
17382c481l5459m0009k6491R1556N9556M8949P987k1554n4372q2877m0483J5980
17370h0698N6036l9480p2015J4486l6633N445n731N8527l596k4409M9368J5265
17358f3435M0704O0735j4565j5526p3358m7785L2404O073J5947o2187j15778L318
$$ y = [741858, 383112, 221151, 160005, 118151, 43154, 7020, -27488, -66467, -74024, -70513, -6505, 15609, -496, -11070, -66036, -19794, 33584, -12029, -76130, -9390, 1830, -24670, -33906, -6858, 67821, 67553, 16176, 74201, 122267, 96029, -27154, 29219, 34063, 63757, 71022, 102475, 57919, -69362, -158713, -140420, -127597, -97920, -83824, -59226, -86049, -147267, -267592, -209904, -169822, -138645, -41703, 66155, 107681, 102426, 110688, 83346, -3481, -38940, -78949, -105440, -13884, 45672, 94621, 102608, 81054, 26682, -56195, -96678, -80698, -24662, -64142, -136157, -121671, -158304, -152859, -158590, -100063, -103659, -128068, -78700, -63435, -22731, 38004, 23439, 7913, -65445, -113230, -80826, -74753, -58806, -120993, -236771, -233453]
17346b33453O3278O2818R2776l50M59Q7318L6864o1617o8436k9328n8945n3204
17334a61820O4320O7383P325P5802l2809j3629O1102j2628k1419r942r433m1321
$$ y = [-233453, -170175, -107357, -14581, -14931, -14472, 72846, 109710, 48093, -20343, -49671, -108616, -161820, -97500, -30117, -22792, 53010, 20201, 6572, 67674, 55046, 33627, 23685, 14252, -27069]
$$ [...]
##END NTUPLES=NMR SPECTRUM
##END=
