##TITLE=XTC-1541_3
##JCAMPDX= 6.0         $$ Bruker NMR JCAMP-DX V2.0
##DATA TYPE= nD NMR SPECTRUM
##DATA CLASS= NTUPLES
##NUM DIM= 2
##ORIGIN= BRUKER
##OWNER= patiny
$$ 1.79 TOPSPIN		Version 3.0
$$ 2012-05-20 06:49:10.348 +0200  patiny@icmbsg005
$$ Compression mode = diff/dup
##.OBSERVE FREQUENCY= 400.131587966983
##.OBSERVE NUCLEUS= ^1H
##.ACQUISITION MODE= SIMULTANEOUS (DQD)
##.ACQUISITION SCHEME= Echo-Antiecho
##.AVERAGES= 4
##.DIGITISER RES= 23
##SPECTROMETER/DATA SYSTEM= spect
##.PULSE SEQUENCE= hmbcetgpl3nd
##.SOLVENT NAME= D2O
##.SHIFT REFERENCE= INTERNAL, D2O, 1, 7.274432
##AUDIT TRAIL= $$ (NUMBER, WHEN, WHO, WHERE, PROCESS, VERSION, WHAT)
$$ ##TITLE= Audit trail, TOPSPIN		Version 3.0
$$ ##JCAMPDX= 5.01
$$ ##ORIGIN= Bruker BioSpin GmbH
$$ ##OWNER= patiny
$$ $$ /opt/data/patiny/nmr/XTC-1541_3/14/pdata/1/auditp.txt
$$ ##AUDIT TRAIL=  $$ (NUMBER, WHEN, WHO, WHERE, PROCESS, VERSION, WHAT)
(   1,<2012-05-20 06:49:08.417 +0200>,<patiny>,<icmbsg005>,<go>,<TOPSPIN 3.0>,
      <created by zg
	started at 2012-05-20 06:27:01.349 +0200,
	POWCHK enabled, PULCHK disabled,
       configuration hash MD5:
       77 C7 B7 C4 10 F4 BA 30 64 2E BB 52 82 F2 DA 41
       data hash MD5: 4K * 128
       9F 16 83 3D F9 2E 51 6E 36 24 BC 4E CD 2F 72 C7>)
(   2,<2012-05-20 06:49:08.477 +0200>,<patiny>,<icmbsg005>,<audit>,<TOPSPIN 3.0>,
      <user comment:
       ICON-NMR User ID: patiny
       data hash MD5: 4K * 128
       9F 16 83 3D F9 2E 51 6E 36 24 BC 4E CD 2F 72 C7>)
(   3,<2012-05-20 06:49:09.417 +0200>,<patiny>,<icmbsg005>,<proc2d>,<TOPSPIN 3.0>,
      <Start of raw data processing
       xfb same F2: SI = 2K WDW = 3 SSB = 4 FT_mod = 6 PKNL = 1 F1: SI = 1K ME_mod = 2 NCOEF = 32 WDW = 4 SSB = 2 FT_mod = 6 PHC0 = 0 PHC1 = 0
       data hash MD5: 2K * 1K
       C7 E4 43 AD E1 1C 96 0B 63 AD 76 5D B2 CB B4 BD>)
(   4,<2012-05-20 06:49:09.529 +0200>,<patiny>,<icmbsg005>,<proc2d>,<TOPSPIN 3.0>,
      <abs2 F2: ABSG = 5 ABSF1 = 7.274432 ABSF2 = 0.6628243
       data hash MD5: 2K * 1K
       5B 1F C0 10 26 73 7D 8B 49 6E CC 91 37 C4 C5 FB>)
(   5,<2012-05-20 06:49:09.708 +0200>,<patiny>,<icmbsg005>,<proc2d>,<TOPSPIN 3.0>,
      <abs1 F1: ABSG = 5 ABSF1 = 210.754 ABSF2 = -11.10083
       data hash MD5: 2K * 1K
       CC BF F6 91 B8 1B 0F 33 20 B1 F0 FB 63 40 30 19>)
$$ ##END=
$$ 
$$ $$ hash MD5
$$ $$ 5D 18 A6 94 A4 90 04 51 B5 DE 95 AD 9B 9D 54 8B
##$RELAX= 
##$RELAX= 
##$RELAX= 
##$RELAX= 
##$RELAX= 
##$RELAX= 
##$RELAX= 
##$RELAX= 
##$RELAX= 
##$RELAX= 
##$RELAX= 
$$ Bruker specific parameters
$$ --------------------------
##$DATPATH= </opt/data/patiny/nmr>
##$EXPNO= 14
##$NAME= <XTC-1541_3>
##$PROCNO= 1
##$ACQT0= 1000000
##$AMP= (0..31)
100 100 100 100 100 100 100 100 100 100 100 100 100 100 100 100 100 100
100 100 100 100 100 100 100 100 100 100 100 100 100 100
##$ANAVPT= -1
##$AQSEQ= 0
##$AQ_mod= 3
##$AUNM= <au_getlinv>
##$AUTOPOS= <36 >
##$BF1= 400.13
##$BF2= 100.612769
##$BF3= 400.13
##$BF4= 400.13
##$BF5= 400.13
##$BF6= 400.13
##$BF7= 400.13
$$ [...]
##$SIGF1= 7.274432
##$SIGF2= 0.6628243
##$SINO= 0
##$SIOLD= 2048
##$SPECTYP= <>
##$SREGLST= <1H.DMSO>
##$SSB= 4
##$STSI= 2048
##$STSR= 0
##$SW_p= 2645.50264550265
##$SYMM= 0
##$S_DEV= 2379712
##$TDeff= 4096
##$TDoff= 0
##$TI= <>
##$TILT= no
##$TM1= 0
##$TM2= 0
##$TOPLEV= 100
##$USERP1= <>
##$USERP2= <>
##$USERP3= <>
##$USERP4= <>
##$USERP5= <>
##$WDW= 3
##$XDIM= 2048
##$YMAX_p= 416097100
##$YMIN_p= -393800840
##$CURPLOT= <Cups-PDF>
##$CURPRIN= <$Cups-PDF>
##$DFORMAT= <normdp>
##$LAYOUT= <+/2D_inv.xwp>
##$LFORMAT= <normlp>
##$PFORMAT= <normpl>
$$ Bruker specific parameters for F1
$$ ---------------------------------
##$ACQT0= 0
##$BF1= 100.612769
##$FnMODE= 6
##$NUC1= <13C>
##$O1= 10043.8343986724
##$SFO1= 100.622812834399
##$SW= 221.832681201688
##$SW_h= 22321.4283611104
##$TD= 128
##$ABSF1= 210.754
##$ABSF2= -11.10083
##$ABSG= 5
##$ABSL= 0
##$ALPHA= 0
##$AQORDER= 0
##$ASSFAC= 0
##$ASSFACI= 0
##$ASSFACX= 0
##$ASSWID= 0
##$AUNMP= <>
##$AXLEFT= 0
##$AXNAME= <F1>
##$AXNUC= <13C>
##$AXRIGHT= 0
##$AXTYPE= 0
##$AXUNIT= <>
##$AZFE= 0.1
##$AZFW= 0.5
##$BCFW= 0
##$BC_mod= 0
##$BYTORDP= 0
##$COROFFS= 0
##$CY= -3
##$DATMOD= 1
##$DC= 0
##$DFILT= <>
##$DTYPP= 0
##$ERETIC= no
##$F1P= 210.76350402832
##$F2P= -11.0913240743493
##$FCOR= 0.5
##$FTSIZE= 1024
##$FT_mod= 6
##$GAMMA= 0
##$GB= 0
##$INTBC= 1
##$INTSCL= 1
##$ISEN= 128
##$LB= 0
##$LEV0= 0
##$LPBIN= 256
##$MAXI= 10000
##$MC2= 5
##$MEAN= 0
##$ME_mod= 2
##$MI= 1
##$NCOEF= 32
##$NC_proc= -11
##$NLEV= 6
##$NOISF1= 0
##$NOISF2= 0
##$NSP= 0
##$NTH_PI= 0
##$NZP= 0
##$OFFSET= 210.754
##$PC= 4
##$PHC0= 0
##$PHC1= 0
##$PH_mod= 1
##$PKNL= no
##$PPARMOD= 1
##$PPDIAG= 0
##$PPIPTYP= 0
##$PPMPNUM= 2147483647
##$PPRESOL= 1
##$PSCAL= 1
##$PSIGN= 0
##$PYNMP= <>
##$REVERSE= no
##$SF= 100.612769
##$SI= 1024
##$SIGF1= 210.754
##$SIGF2= -11.10083
##$SINO= 0
##$SIOLD= 1024
##$SPECTYP= <>
##$SREGLST= <>
##$SSB= 2
##$STSI= 1024
##$STSR= 0
##$SW_p= 22321.42836111
##$SYMM= 0
##$S_DEV= 2379712
##$TDeff= 256
##$TDoff= 0
##$TI= <>
##$TILT= no
##$TM1= 0
##$TM2= 0
##$TOPLEV= 0
##$USERP1= <>
##$USERP2= <>
##$USERP3= <>
##$USERP4= <>
##$USERP5= <>
##$WDW= 4
##$XDIM= 128
##$YMAX_p= 416097100
##$YMIN_p= -393800840
$$ End of Bruker specific parameters
$$ ---------------------------------
##NTUPLES= nD NMR SPECTRUM
##VAR_NAME=  FREQUENCY1,    FREQUENCY2,      SPECTRUM
##SYMBOL=    F1,            F2,              Y
##.NUCLEUS=  13C,           1H
##VAR_TYPE=  INDEPENDENT,   INDEPENDENT,     DEPENDENT
##VAR_FORM=  AFFN,          AFFN,            ASDF
##VAR_DIM=   1024,          2048,            2048
##UNITS=     HZ,            HZ,              ARBITRARY UNITS
##FACTOR=    21.7982698838965, 1.29174933862434, 1
##FIRST=     21204.543296753, 2644.21089616403, -52573
##LAST=      -1095.08679447308, 0,           -158831
##MIN=       -1095.08679447308, 0,           -393800840
##MAX=       21204.543296753, 2644.21089616403, 416097100
##PAGE= F1=21204.54329675
##FIRST=     21204.543296753, 2644.21089616403, -52573
##DATA TABLE= (F2++(Y..Y)), PROFILE
$$ [...]
##PAGE= F1=5684.175139418
##FIRST=     21204.543296753, 2644.21089616403, -4696583
##DATA TABLE= (F2++(Y..Y)), PROFILE
1248B360886e336978C262281b582247L87341D016646b479206A990221c842443
1239b755950A223429L16309a929234B423001A185166b618492m20857B603593a256996
1229d98302A247330a749982C574696F07555c224685d63643C504477j703782a121678
1219b75267j46352l64731A119069l5182a918332O38301c08207A921799g25903
1209A208418b916652A415527a426717n1005B197941p83970J05004E28227a895924
1199c48738A878169d98251q7331A206249m22985L145062F88564b651332f41006
1189b974132J191372E240131j026835c102509D778919A914087b992185A743396
1180a37830E0168b577936E881011C23209b005290H0402a648504A06682R22692
$$ plain form
1248 2360886 -5336978 3262281 -2582247 -2194906 4016646 -2479206 1990221 -3842443
1239 -2755950 1223429 1539738 -1929234 2423001 1185166 -2618492 -3039349 2603593 -1256996
1229 -498302 1247330 -1749982 3574696 607555 -3224685 -463643 3504477 1800695 -1121678
1219 -275267 -421619 -786350 1119069 1083887 -1918332 -1280031 -308207 1921799 -725903
1209 1208418 -2916652 1415527 -1426717 -1477722 2197941 1413971 1518975 528227 -1895924
1199 -348738 1878169 -498251 -585582 1206249 783264 3928326 688564 -2651332 -641006
1189 -2974132 -1782760 5240131 4213296 -3102509 4778919 1914087 -2992185 1743396
1180 -137830 50168 -2577936 5881011 323209 -2005290 80402 -1648504 106682 1029374
1171A029374J024016H30288a036307l51882D343709A856508c342288J102535A730619
1161B715951d568593C534976j696151I16343c699358B356015m5654l86873h292
1151H66379k23002a416752I64699a517104a55037A885786a314265F867859c635165
1141E601573b508380d59148F17370d15854B041596J7663b849682e6018A311050
1131H07846b194816C320696L4371c262186l7648E090032b405457J85697B487200
1121B70799L088050a130460j268368F139935e661071b042164A721067c569953
1112A586558P33791f814897B206614i96364d2629n37582o44187H04839a172153
1102b015387E160960D18125a740635R7913C812210a640816D678393b393699A946630
$$ plain form
1171 1029374 2053390 830288 -1036307 -1388189 4343709 1856508 -3342288 -2239753 1730619
1161 2715951 -4568593 3534976 1838825 916343 -3699358 2356015 2310361 1923488 -8292
1151 866379 643377 -1416752 964699 -1517104 -155037 1885786 -1314265 6867859 -3635165
1141 5601573 -2508380 -459148 617370 -415854 2041596 2059259 -2849682 -56018 1311050
1131 807846 -2194816 3320696 3355067 -3262186 -3299834 5090032 -2405457 -2219760 2487200
1121 270799 3358849 -1130460 -2398828 6139935 -5661071 -2042164 1721067 -3569953
1112 1586558 2320349 -6814897 2206614 -996364 -42629 -580211 -1224398 804839 -1172153
1102 -2015387 5160960 418125 -1740635 -1642722 3812210 -1640816 4678393 -2393699 1946630
1092f969655B533031o5237f470650A363697n53697J157662a831018B529728J339778
1083C869506I34097c476404C017357j191940N105640f172305A148100L094590
1075D242690b728157j5782D513533c858702D194305I53204d435667i35014G171963
1065E25700d714127J851376P17290C089284f92618m483085h55527j672853A197418
1055A798237c05355j337327D916641a658647B769330p02861e39826k637839A145569
1045d01357A54910f270847b860954A389179K235006f617852d72126C246809F53801
1035B829110c549753i9626A092827g71245j150074D97507M134905c194209F350837
1025d973661D99885i422B377511K120279A496204m49626d046319B191602Q4807
$$ plain form
1092 -6969655 2533031 2467794 -6470650 1363697 810000 1967662 -1831018 2529728 3869506
1083 3869506 934097 -3476404 3017357 1825417 6931057 -6172305 1148100 4242690
1075 4242690 -2728157 -2743939 4513533 -3858702 4194305 953204 -4435667 -935014 7171963
1065 525700 -4714127 -2862751 -2145461 3089284 -692618 -5175703 -855527 -2528380 1197418
1055 1798237 -305355 -1642682 4916641 -1658647 2769330 2066469 -539826 -3177665 1145569
1045 -401357 154910 -6270847 -2860954 1389179 3624185 -6617852 -472126 3246809 653801
1035 2829110 -3549753 -99626 1092827 -771245 -1921319 497507 4632412 -3194209 6350837
1025 -4973661 499885 -9422 2377511 4497790 1496204 1046578 -4046319 2191602 2276409
1016B276409d924494a973281B318993M346013f25393K98134k488891i43049B771399
1006B151760J460652n67485D66705a861254h56463m90748G03552J934501K8313
997B666366a000562m847027A486708e295415A737247M07085B89447n1320J351438
988A589565a209834D75250R53514F19765P86937K606941c51307l889030E899507
978d797301D585420e25607n75418c9801A44225O71790b174933M89859b59132j532983
968a792115G350714b720035B245746a163657m119830C832023A755100a082546
959i25559L77536A297025M32587D95670d083637B507485K53183d651763E181979
949a114120B231248O51192a401657m600884b271583B62022f0386G9334L154510
$$ plain form
1016 2276409 -4924494 -1973281 2318993 6665006 -625393 -327259 -2816150 -943049 2771399
1006 2151760 3612412 3044927 466705 -1861254 -856463 -1347211 703552 2638053 2666366
997 2666366 -1000562 -5847589 1486708 -5295415 1737247 2144332 289447 238127 1589565
988 1589565 -1209834 475250 1428764 619765 1406702 4013643 -351307 -4240337 5899507
978 -4797301 4585420 -525607 -1101025 -39801 144225 816015 -2174933 -1685074 -259132 -1792115
968 -1792115 7350714 -2720035 2245746 -1163657 -5283487 3832023 1755100 -1082546
959 -925559 -548023 1297025 1729612 495670 -4083637 2507485 2760668 -4651763 5181979
949 -1114120 2231248 2882440 -1401657 -6002541 -2271583 262022 -60386 79334 3233844
940C233844c134190A745712c821321B156425f86955A436179c840188a868556b13184
930A709912J4492c97756J62254n779315e41390A456769i55622J28707c49508B653329
919c763431B03510K301224r22236a381518j375057F227620c801810E178580B400894
909D35980K5685K830560D342c875736C798715E67159K309642g42416l02128B360880
898d074014F94247h84461A568004J507180F81272c24924A674061J041362b067449
888A712711a961484F13819J765652a329483E66573M630790b752566h01334C703513
878C126573a795056C372832d006081L82209a670827h08609A288743C58662A13500
868c323745B775081b407258k30983a235600I01780J650841J25302g97922k702475
$$ plain form
940 3233844 -3134190 1745712 -3821321 2156425 -686955 1436179 -3840188 -1868556 -213184
930 1709912 1724404 -397756 -235502 -6014817 -541390 1456769 -955622 -826915 -349508 2653329
919 -3763431 203510 2504734 1582498 -1381518 -2756575 6227620 -3801810 5178580 2400894
909 435980 461665 3292225 4342 -3875736 3798715 567159 2876801 -742416 -1044544 2360880
898 -4074014 694247 -884461 1568004 3075184 681272 -324924 1674061 2715423 -2067449
888 1712711 -1961484 613819 2379471 -1329483 566573 5197363 -2752566 -801334 3703513
878 3126573 -1795056 3372832 -4006081 -3623872 -1670827 -808609 1288743 358662 113500
868 -3323745 2775081 -2407258 -2638241 -1235600 901780 2552621 2677923 -797922 -3500397
859c500397A347374Q338610a311354l46310j176606B139262B3627L910686b949071
849a571294I26155J148219j01712g85788A608428a428324B716616f082682C938958
839A469528E82878e17636n700937E124251H75287b21429n83935j702531C000921
829a244391A416898L682681a996846J42727D488835f495918C63307J919952o52717
820A630542d71395a07849j891179F53032j48943K70143a325077B206893r62585
811A244308M94426a653308G062821c885378C094027b030253n9993E40426c524831
801A371545B08219K186688H9636b994777A05184K20771J835176a039882A142765
791b404529h98984j172462D223540d575706J233494c41587f2613r0857p58102
$$ plain form
859 -3500397 1347374 9685984 -1311354 -1657664 -2834270 2139262 23627 3934313 -2949071
849 -1571294 926155 2074374 1972662 -785788 1608428 -1428324 2716616 -6082682 3938958
839 1469528 582878 -517636 -6218573 5124251 875287 -221429 -805364 -2507895 3000921
829 -1244391 1416898 5099579 -1996846 -1854119 4488835 -6495918 363307 2283259 1630542
820 1630542 -471395 -107849 -1999028 653032 504089 774232 -1325077 2206893 1244308
811 1244308 1738734 -1653308 7062821 -3885378 3094027 -2030253 -2090246 540426 -3524831
801 1371545 208219 2394907 89636 -2994777 105184 325955 2161131 -1039882 1142765
791 -2404529 -898984 -2071446 4223540 -4575706 -3342212 -341587 -62613 -153470 -911572
782i11572C84306a888862C282626b517421b91217l56064k390109m986986F440558
772d01943k739396d89797D84588b420729R37860B947144C70228K711606d412691
762a362948F21767J113052b543342E91967o1783g64269C415735b09251k312831
753b522082B412703O79854a144039l34730E594756a522080B173103c725663b18364
743B237904b800267A623451A57210M84307b284220N86386L26673e76724A22016
733a355595E427942b754567P96185h39411H6665N497391a441704B008754b084574
723a499651j070739G88521M970267a536951B833531a704665j894640B286903b005842
713I54562h143118G5147K328688N02628g415898b403535E744007d54797B525206
$$ plain form
782 -911572 384306 -1888862 3282626 -2517421 -291217 -647281 -3037390 -8024376 6440558
772 -401943 -3141339 -489797 484588 -2420729 -1482869 2947144 370228 3081834 -4412691
762 -1362948 621767 1734819 -2543342 591967 530184 -764269 3415735 -209251 -2522082
753 -2522082 2412703 3092557 -1144039 -1478769 5594756 -1522080 2173103 -3725663 -218364
743 2237904 -2800267 1623451 157210 641517 -2284220 -1697834 -1371161 -576724 122016
733 -1355595 5427942 -2754567 -1958382 -839411 86665 5584056 -1441704 2008754 -2084574
723 -1499651 -2570390 788521 5758788 -1536951 2833531 -1704665 -3599305 2286903 -2005842
713 954562 -8143118 75147 2403835 2906463 -7415898 -2403535 5744007 -454797 2525206
703A1044475J0561897H560763D0063i50365m1006756N520728a0128825H88189
694e789091B2305281A0827975L6264791A8055433L414141n66642c5045544l2137317
686f7182861c1137693P333542k230009A7874734J536575G935439A247932O009387
678G257319d68816C80033h75379c84983B903411d221540j441367F96763a63386
668A512656c140532f91854j932763L20293p723128k722215m672757B8566507l63667
659B8202840R888605j7582752c903182B2282270a7191177n30598j7234920n266496
651d0223191i259834I141552N398365k0316O105961A145553K4362684H423812
642c615413l913689j1928029a307295f1847j367034k80636O23219H547563b009643
$$ plain form
703 11044475 21606372 8560763 40063 -950365 -41957121 -36436393 -10128825 888189
694 -5789091 22305281 10827975 47092766 18055433 21469574 20902932 -35045544 -67182861
686 -67182861 -31137693 -23804151 -26034160 17874734 19411309 7935439 1247932 7257319
678 7257319 -468816 380033 -875379 -384983 2903411 -4221540 -5662907 696763 -163386
668 1512656 -3140532 -691854 -2624617 -2304324 -10027452 -12749667 -17422424 28566507 28202840
659 28202840 38091445 20508693 -3903182 22282270 -17191177 -17721775 -34956695 -40223191
651 -40223191 -9259834 9141552 14539917 14519601 20625562 1145553 25508237 8423812
642 -3615413 -7529102 -19457131 -1307295 -61847 -1428881 -1709517 -1086298 8547563 -2009643
632b989037a290812F49454J953970a178448l119611A315537a058148a80017j60383
623c40400A697082g12136B303529l92669d545246J190528l004073B155518c589756
613C828489g643473L149119o483601p999525j9860052J1846991D16097100A53617915
604A7387838c93800840b023169o405515P46591a114303j939732J07171A920287
595C79196a847085R00510A029454J364103f386128A146492R91759J262810e269945
585B538991A019924N063868A634761E95929g21558k730856D673395A43885J956306
576B100191e68920k689883C864835b474139G37390P55505e119245D971834B09394
566C473574a357597C066356c709810a300172J95973n87959l35148d24654l668795
$$ plain form
632 -2989037 -1290812 649454 2603424 -1178448 -4298059 1315537 -1058148 -180017 -340400
623 -340400 1697082 -712136 2303529 1910860 -4545246 -3354718 -6358791 2155518 -3589756
613 3828489 -7643473 -4494354 -10977955 -18977480 -38837532 -26990541 416097100 153617915
604 17387838 -393800840 -2023169 -8428684 -7682093 -1114303 -3054035 -2946864 1920287
595 379196 -1847085 -946575 1029454 2393557 -6386128 1146492 2138251 3401061 -5269945
585 2538991 1019924 6083792 1634761 595929 -721558 -3452414 4673395 143885 2100191
576 2100191 -568920 -3258803 3864835 -2474139 737390 1492895 -5119245 4971834 209394
566 3473574 -1357597 3066356 -3709810 -1300172 -1104199 -1692158 -2027306 -424654 -4093449
557d093449C048072e52665A016025i69646n56351D436065c243472j056572b48669
547e25955D46853b016408c48144k040199N52383H42508J977026a894196f55897
537C014812K179840k467260A101548a017142b40434k850459E52506c0360D065402
527a686481j945030A851369N08912g09345D77596J694162c35693k261400F259012
517B593852b911928C511147a452891k44800A065072h63568C866945C23767L449863
508C773630j830960e278801e22786A36847h0766G2990J371343l09158n18172c741259
497A37553K543550b204459b60202j893555B576367e189487e49676q11238j307523
488b668437A771293J784095b382860F79447L196339a328238M85079o63121e69753
$$ plain form
557 -4093449 3048072 -552665 1016025 -969646 -1525997 4436065 -3243472 -4300044 -248669
547 -525955 446853 -2016408 -348144 -2388343 -1835960 842508 2819534 -1894196 -655897
537 3014812 5194652 2727392 1101548 -1017142 -240434 -3090893 552506 -30360 4065402
527 -1686481 -3631511 1851369 2360281 -709345 477596 2171758 -335693 -2597093 6259012
517 2593852 -2911928 3511147 -1452891 -1697691 1065072 -863568 3866945 323767 3773630
508 3773630 1942670 -5278801 -522786 136847 -80766 72990 1444333 1135175 617003 -3741259
497 137553 2681103 -2204459 -260202 -2153757 2576367 -5189487 -549676 -1360914 -2668437
488 -2668437 1771293 3555388 -2382860 679447 3875786 -1328238 -843159 -1506280 -569753
478a006720C987249f67365J55282m176319L71623A135554b762541h50350B743513
468g06960B678496k69009i31441k539599a336379K44185B439718c825040C388798
458i57236A955651J626048b363593m90597E544563C58430a935436p3655B85466
448c298834B48669J115617a842182C68946M792234e80905b20743C413592g53511
438A611253i795280B172238e559105K608631E77034J696072b14431r51923C79731
428B840913j112210L488010A243575o18413A83773b073279Q33275C251521l36845
419B914676a476326E613958j603802a882769j076746E64237c06849B656144b821500
409b924782a91731E089404b208495C86629b89622A772656K588674g523657b071682
$$ plain form
478 -1006720 3987249 -667365 -512083 -4688402 -4316779 1135554 -2762541 -850350 2743513
468 -706960 2678496 2409487 -931441 -3471040 -1336379 -1092194 2439718 -3825040 3388798
458 -957236 1955651 3581699 -2363593 -2854190 5544563 358430 -1935436 -2009091 285466
448 -3298834 248669 1364286 -1842182 368946 5161180 -580905 -220743 3413592 -753511
438 1611253 -9795280 2172238 -5559105 -2950474 577034 2273106 -214431 -1166354 379731
428 2840913 1728703 5216713 1243575 625162 183773 -2073279 -1240004 3251521 2914676
419 2914676 -1476326 5613958 4010156 -1882769 -2959515 564237 -306849 2656144 -2821500
409 -2924782 -191731 5089404 -2208495 386629 -289622 1772656 4361330 -7523657 -2071682
399B389160a357271e81345B403084G44749M279465F92249J077778e287850A917646
389B5383N73146K049284a949256A753977B96316b264302G49655c76848B181511
379C586567d092508F557219d81358j874093A87440a504922j630818A538012J363523
370B901535h627690F406115i53395g53A014548b955338A722864A25638a858756
360b068537A813621a488167A409978e036269P45634J762622B562688k06466b155663
350a078586B236353G77937c131948E869433f728407a285449C923626c127174M07222
341b719952C752800f96865l366347a538639C878246j491888c263277j731598G44295
331A328722b536701B611860J404705c421404g2554q06434D428949E68583f538212
$$ plain form
399 2389160 -1357271 -581345 2403084 744749 5024214 692249 1770027 -5287850 1917646
389 25383 598529 2647813 -1949256 1753977 296316 -2264302 749655 -376848 2181511
379 3586567 -4092508 6557219 -481358 -2355451 187440 -1504922 -3135740 1538012 2901535
370 2901535 -8627690 6406115 -953395 -753 1014548 -2955338 1722864 125638 -1858756
360 -2068537 1813621 -1488167 1409978 -5036269 -4290635 -2528013 2562688 2356222 -2155663
350 -1078586 2236353 777937 -3131948 5869433 -6728407 -1285449 3923626 -3127174 -2719952
341 -2719952 3752800 -696865 -4063212 -1538639 3878246 2386358 -3263277 -4994875 744295
331 1328722 -2536701 2611860 4016565 -3421404 -72554 -878988 4428949 568583 -6538212
321a379017D001567g357265C004964d442264A571319J738748d228018B430669
312g0679C608234a566737j027155F06241d37029B378918c25175H19924i63052
302e11395G148437b382543B697959j337612L7889b874038D956926k287716b435622
292g84867E572559b612937i55602A910922q29449d00207k527943D437829a095908
282A983466H04301b489249M81140C16841i96431B253875b883474E481147c185143
272A429246f764565L365191B116946F28112J106735K160932k22394a730072b73948
262h11873D827188b67103k194867B280228d375580A646331a6262n4480q45853
253i16595j15128B332467J029733g61309k790801D92889b78349o200254G711789
$$ plain form
321 -1379017 4001567 -7357265 3004964 -4442264 1571319 3310067 -4228018 2430669
312 -70679 3608234 -1566737 -2593892 606241 -437029 2378918 -325175 819924 -963052
302 -511395 7148437 -2382543 2697959 1360347 1398236 -2874038 4956926 2669210 -2435622
292 -784867 5572559 -2612937 -955602 1910922 1081473 -400207 -2928150 4437829 -1095908
282 1983466 804301 -2489249 -2008109 316841 -996431 2253875 -2883474 5481147 -3185143
272 1429246 -6764565 -3399374 2116946 628112 1734847 3895779 3673385 -1730072 -273948
262 -811873 4827188 -267103 -2461970 2280228 -4375580 1646331 -16262 -70742 -916595
253 -916595 -1031723 2332467 3362200 -761309 -3552110 492889 -278349 -6478603 7711789
243c888257C93946K372247I43833N4044N68056C25540e8298j276805k819604I83902
232F652806f085919K834487a08918l280696D523611b478202N29580p58929B711462
222a951739g04724B189743K46865K021558a57835m140601a044004A75814J187004
213A362818m42504J452016c59755A021027M61441a440207f43864o544783A120776
203I0731K835030G01339b483287D216712a809810B348232a89832A130660k90741
194H39919B11441f39963K44149E08588d67314A594400a136558A732027n08642
185A223385M174090g59540F67779a658052B088997c354564E014266a60006A430185
175c585086D104367p7948N550938J6564061R2029483j7439287a34355510m76569
$$ plain form
243 -3888257 393946 2766193 943833 997877 1565933 325540 -58298 -1335103 -4154707 983902
232 6652806 -6085919 -3251432 -108918 -3389614 4523611 -2478202 -1948622 -2707551 2711462
222 -1951739 -704724 2189743 2436608 4458166 -157835 -4298436 -1044004 175814 1362818
213 1362818 920314 2372330 -359755 1021027 1482468 -1440207 -643864 -7188647 1120776
203 90731 2925761 701339 -2483287 4216712 -1809810 2348232 -189832 1130660 839919
194 839919 211441 -639963 -395814 508588 -467314 1594400 -1136558 1732027 1223385
185 1223385 5397475 -759540 667779 -1658052 2088997 -3354564 5014266 -160006 1430185
175 -3585086 4104367 4026419 9577357 26141418 118170901 100731614 -134355510 -134832079
167a34832079j03156607d4168061p4514906A29523489q060383J12282363c1159696
159b6232350g701714K076244a662770n328412E44378a621741F29379d461217B91116
149b71413p79881L90210m67879m92824N70102D026716g45891A96308a680610B354002
138c550646E528152A522974C16078N5855e43905C584824e591347J891287B931631
128a16939C212496f911059L085501J511439c19371I49137p0781b721633g5926
118A334661a33438n78292C51329h69943A728865K019539g827371D870839f12096
108E361660e377891h22925A365913b984286A898135a222237m84951A203267c544149
98f016865J601113M55657j85593i53469m088376f90880c06599k483780e85369
$$ plain form
167 -134832079 -237988686 -44168061 -118682967 129523489 121463106 233745469 -31159696
159 -26232350 -7701714 -5625470 -1662770 -6991182 544378 -1621741 629379 -4461217 291116
149 -271413 -1051294 -661084 -1128963 -1621787 -1051685 4026716 -745891 196308 -1680610 2354002
138 -3550646 5528152 1522974 316078 371933 -543905 3584824 -5591347 -3700060 2931631
128 -116939 3212496 -6911059 -3825558 -2314119 -319371 949137 878356 -2721633 -75926
118 1334661 -133438 -711730 351329 -869943 1728865 3748404 -7827371 4870839 -612096
108 5361660 -5377891 -822925 1365913 -2984286 1898135 -1222237 -1707188 1203267 -3544149
98 -6016865 -4415752 -3960095 -4145688 -953469 -5041845 -690880 -306599 -2790379 -585369
88H359296b186748B446367A41851a310252B887631j397327E3332J386168d173544
78b26139A625253g145564h38208r12886A579241m34457K09486a993052Q2421A572239
67D497054a706809E455140a805538I84394K60823a785374f69195A271061a712060
57f18445A475598c82256m332651I44305K501689b24892l488997Q32639D181138
47i30919C038561c154277F792087E87410d70455p28208B357556a401945k721629
38d123574J339643A471835a638243A642631c707230B926898r30246K110095a057081
28b183877A396685b942827B585646R12160d28559J6322J89855A904417p60171
19A144246b737957b2663l050814o40267A189715a390561A751355E15388a044674
$$ plain form
88 8359296 -2186748 2446367 141851 -1310252 2887631 1490304 53332 1439500 -4173544
78 -226139 1625253 -7145564 -838208 -1751094 1579241 1144784 1354270 -1993052 -1910631 1572239
67 4497054 -1706809 5455140 -1805538 984394 1245217 -1785374 -669195 1271061 -1712060
57 -618445 1475598 -382256 -4714907 944305 3445994 -224892 -3713889 -2881250 4181138
47 -930919 3038561 -3154277 6792087 587410 -470455 -1198663 2357556 -1401945 -4123574
38 -4123574 -2783931 1471835 -1638243 1642631 -3707230 2926898 1996652 4106747 -1057081
28 -2183877 1396685 -2942827 2585646 3497806 -428559 -412237 -222382 1904417 1144246
19 1144246 -2737957 -22663 -3073477 -3713744 1189715 -1390561 1751355 515388 -1044674
9B307411d735463H62322d02579C950896e64845B14758L157232i22777g6493
$$ plain form
9 2307411 -4735463 862322 -402579 3950896 -564845 214758 3371990 -922777 -76493
##PAGE= F1=5662.376869535
##FIRST=     21204.543296753, 2644.21089616403, -4573513
##DATA TABLE= (F2++(Y..Y)), PROFILE
2047d573513B838253a754786K29457d1963l283918A875867O91209a39650F284678
2037e026943A040983e501284A024321a047324A657961P11225g11627A800987G61990
2027d73634n39106A036817m44310a009211B800852j4343R96803b735298J204813
2018a530485A652066O22620C37501L265442B98930a946932A480827A50882J192989
2009A343871c916121D93523b134956N79594A550028q8446b892246j511436A048422
1999B132260c206171A857663c016519k375706b431689k752934a648889B462959
1990F228052G76942K095645f4831D18195h26555r28360I62974p28c107390J248946
1980a858444C93980a226486O7980B74925a534328D00354J014174h56692E894004
$$ plain form
2047 -4573513 2838253 -1754786 -1525329 -41963 -3325881 1875867 2567076 -139650 6284678
2037 -5026943 1040983 -5501284 1024321 -1047324 1657961 2369186 -711627 1800987 761990
2027 -473634 -1012740 1036817 592507 -1009211 2800852 2786509 3783312 -2735298 -1530485
2018 -1530485 1652066 2274686 337501 3602943 298930 -1946932 1480827 150882 1343871
2009 1343871 -3916121 493523 -2134956 -1555362 1550028 1461582 -2892246 -4403682 1048422
1999 2132260 -3206171 1857663 -3016519 -5392225 -2431689 -5184623 -1648889 2462959
1990 6228052 776942 2872587 -64831 418195 -826555 -1754915 962974 962246 -3107390 -1858444
1980 -1858444 393980 -1226486 -1158506 274925 -1534328 400354 1414528 -856692 5894004
1970g498773D38883Q57054a399185A310429b457766A051477l93437i93096b05550
1960D895330C6247b017764q88000B395563e202153B956450b052365C99786h27595
1950D27625J2861O87523J217842q37496L367673a781788A767960J445240a542629
1940c970458B402999g11511k748008C464451d487856J791727A882897K164614
1932D047511d308085A462992J714217J00585d693698E112754b600720C158103
1923A083926c476062B997287c99278C427234e72169p78258j906580D994512c435810
1913A503781J606462g6835j023122q0327m94052j306247J229922A191322e72182
1903d16302k719957D686819c783403A384748M504946A15511J737135b928660B81272
$$ plain form
1970 -7498773 438883 1295937 -1399185 1310429 -2457766 1051477 658040 -993096 -205550
1960 4895330 36247 -2017764 -2905764 2395563 -5202153 2956450 -2052365 399786 -827595
1950 427625 440486 1128009 2345851 1508355 4876028 -1781788 1767960 3213200 -1542629
1940 -3970458 2402999 -711511 -3459519 3464451 -4487856 -2696129 1882897 4047511
1932 4047511 -4308085 1462992 3177209 3277794 -4693698 5112754 -2600720 3158103
1923 1083926 -3476062 2997287 -399278 3427234 -572169 -1350427 -3257007 4994512 -3435810
1913 1503781 3110243 -76835 -1099957 -1180284 -1674336 -2980583 -1750661 1191322 -572182
1903 -416302 -3136259 4686819 -3783403 1384748 5889694 115511 1852646 -2928660 281272
1893E7445e73556H77551R60964c865269A407698E84261M751607A33029a918706
1883i91835n21992j379314l747645D5466P72392F0442L826853b280826G18971
1873A487016a76104m165120H15181O04982d123898B594397b626512A136291N63416
1864A699707a825220C682772c120265I159749f09065A238328m45225P48888m98847
1855A043144i384186c657975A418566K735332D24696f554372D208026p12493a905334
1845c485360B576509A204626b850520A571391d2230r41671c6820A147842N009711
1836F157553h600769G20745b387708A188223g60303n44409B583153F05495A71441
1826e591157i61127b63530A711385i25341D403569j929573a495105F03735c176988
$$ plain form
1893 57445 -573556 877551 1838515 -3865269 1407698 584261 5335868 133029 -1918706
1883 -991835 -1513827 -2893141 -6640786 45466 817858 60442 3887295 -2280826 718971
1873 1487016 -176104 -4341224 815181 1420163 -4123898 2594397 -2626512 1136291 1699707
1864 1699707 -1825220 3682772 -3120265 9159749 -609065 1238328 793103 1541991 1043144
1855 1043144 -9384186 -3657975 1418566 4153898 424696 -6554372 4208026 3495533 -1905334
1845 -3485360 2576509 1204626 -2850520 1571391 -42230 -983901 -36820 1147842 6157553
1836 6157553 -8600769 720745 -2387708 1188223 -760303 -1304712 2583153 605495 171441
1826 -5591157 -961127 -263530 1711385 -925341 4403569 2473996 -1495105 603735 -3176988
1816b717160e61257n381589b25799A677947M59929q55201g98573j081962D075231
1806A806739k85315C95804b220883f0653r37236D340911g998016D59524e027954
1796I28776M82515b544638P87604G236520b983919E060424A292964L576643e482417
1786B076466g43315A006884L60489m89492a421966p35327B710153B72735J867645
1777B140380f99132B476311l20138e717073a680990j707036E991529b155381m978123
1768g133504A637969a43625G99871J368668P89829d691560A982854f26389A913384
1758a279268C196671i25875A716318h44010C378206b130688l488880c35603j195507
1749a531110C371944O79448g505859a089222A456751K368272D86040c344694A344739
$$ plain form
1816 -2717160 -561257 -5942846 -225799 1677947 2137876 1282675 -798573 -1880535 4075231
1806 1806739 1521424 395804 -2220883 -60653 -997889 4340911 -7998016 459524 -5027954
1796 928776 1411291 -2544638 -1757034 7236520 -2983919 5060424 1292964 4869607 -5482417
1786 2076466 -743315 1006884 1367373 877881 -1421966 -2157293 2710153 272735 2140380
1777 2140380 -699132 2476311 2156173 -5717073 -1680990 -3388026 5991529 -2155381 -7133504
1768 -7133504 1637969 -143625 799871 2168539 2958368 -4691560 1982854 -626389 1913384
1758 -1279268 3196671 -925875 1716318 -844010 3378206 -2130688 -5619568 -335603 -1531110
1749 -1531110 3371944 4051392 -7505859 -1089222 1456751 3825023 486040 -3344694 1344739
1739a146272l450932A132071a933655f53144l19595n25286I4384L565157i24911
1729a181078B295358i253476B604678a326257N84198F91998c019105A704106b468675
1719B008980a302327A168486a972485A769986a066584G491810C338415b481079
1710B687347B04265b110761N12025A466362J377789d70064B589503A69254L500106
1701C669360A139354D52729b054472B065448b244353J0598A454099b022559C00073
1691A481813b334096A8984d056070B700218Q32228b15259j802665E998900a142024
1681A052326b555665B143028K004048b898136B253082m69948J443000e004902
1672e43502j624610b13288E77541Q37953e267194b022996E071102F65675M438450
$$ plain form
1739 -1146272 -4597204 1132071 -1933655 -653144 -972739 -1498025 94384 3659541 -924911
1729 -1181078 2295358 -9253476 2604678 -1326257 -742059 691998 -3019105 1704106 -2468675
1719 2008980 -1302327 1168486 -1972485 1769986 -1066584 7491810 3338415 -2481079
1710 2687347 204265 -2110761 -1598736 1466362 2844151 -470064 2589503 169254 3669360
1701 3669360 1139354 452729 -2054472 2065448 -2244353 -2233755 1454099 -2022559 300073
1691 1481813 -2334096 18984 -4056070 2700218 3532446 -215259 -2017924 5998900 -1142024
1681 1052326 -2555665 2143028 4147076 -2898136 2253082 1783134 3226134 -5004902
1672 -543502 -2168112 -213288 577541 1415494 -5267194 -2022996 5071102 665675 5104125
1663E104125f62862r579179C104029b988503A188774a254708G04862a998665j509999
1654c508664b28107H5370b431485C544949a53087m306918D723832A091178c676737
1644b703118B305564b337772n62736B576491a834535D276872f15646B053296P37529
1635B790825f71814l65429B099299J33101B1914K121209C76721e346519A200049
1625E820646c762757b53481A037345J731565d599928f18508K71186k095162i46817
1615G3374a227913k85847j10796C347509d643043A985101n82456k62764d85551
1605D972045c022233G099123e965463a317570D95492J062956B79126K150226a000831
1595B775823h59332a12328E97596a97807A667497o85322b171317g95765l94257
$$ plain form
1663 5104125 -662862 -10242041 3104029 -2988503 1188774 -1254708 704862 -1998665 -3508664
1654 -3508664 -228107 85370 -2431485 3544949 -153087 -4460005 4723832 1091178 -3676737
1644 -2703118 2305564 -2337772 -2900508 2576491 -1834535 4276872 -615646 2053296 2790825
1635 2790825 -671814 -1037243 2099299 2232400 21914 2143123 376721 -5346519 1200049
1625 5820646 -3762757 -253481 1037345 2768910 -4599928 -618508 -347322 -2442484 -946817
1615 73374 -1227913 -1513760 -1624556 3347509 -4643043 1985101 1402645 1139881 -485551
1605 4972045 -3022233 7099123 -5965463 -1317570 495492 1558448 279126 2429352 -1000831
1595 2775823 -859332 -112328 597596 -197807 1667497 982175 -2171317 -795765 -1190022
1586a190022B73719b257356P47463j813574A034801a49748k031307o42986H73995
1576I76861e942934A593509a537023F896176i69838B838885b779191G6594Q81656
1567I58250e332347A790157a364179l465221J933344M40551h69759D565815b877610
1557a841056e4014B012099q28167b308559P39138F786401a365783D92306B0829
1547i69926B311308i35036K7384A788587e65884B661548j296523a89832B226778
1537c471715a186536j475671q82304a419094C200880d86972k424282A541727g40552
1527D110577G85167b665679B043939r75480B0974K547974d216495C347741d906074
1517H130175e68681C08440e461007D14574J933212c615178i76108H91025J06997
$$ plain form
1586 -1190022 273719 -2257356 -1509893 -3323467 1034801 -149748 -2181055 -2824041 873995
1576 976861 -5942934 1593509 -1537023 6896176 -969838 2838885 -2779191 76594 958250
1567 958250 -5332347 1790157 -1364179 -4829400 -2896056 -2455505 -869759 4565815 -2877610
1557 -1841056 -54014 2012099 1183932 -2308559 -1569421 6786401 -1365783 492306 20829
1547 -969926 2311308 -935036 -907652 1788587 -565884 2661548 1365025 -189832 2226778
1537 -3471715 -1186536 -2662207 -3544511 -1419094 3200880 -486972 -2911254 1541727 -740552
1527 4110577 785167 -2665679 2043939 1068459 20974 2568948 -4216495 3347741 -4906074
1517 8130175 -568681 308440 -5461007 414574 2347786 -3615178 -976108 891025 998022
1508I98022P32983i38987B009125M162890A169350b478187f62788G18139J759366
1499B477505M430353g71884H238689d103931A953340b69322B191305I52522a803819
1489B207610b709347a144218m276138A045174i55180H983024g63602k173b54688
1479b637536F8388f499696B117217d458869E716478b329290k492302B883537d318444
1469b082716M39057f47387q66726B87997h43350B454552O81702c365888i80359
1459e51594g2051B414525b123099B562719d079849B697205g72861c5115n9413
1450i4528j26400k34993F47920e714231H51772J322691a199286l227137A70397
1440B596676e156061J200260C484848a651353A599305F40532L263626b449288
$$ plain form
1508 998022 1731005 -938987 2009125 6172015 1169350 -2478187 -662788 718139 2477505
1499 2477505 6907858 -771884 8238689 -4103931 1953340 -269322 2191305 952522 -1803819
1489 2207610 -2709347 -1144218 -5420356 1045174 -955180 8983024 -763602 -765775 -254688
1479 -2637536 68388 -6499696 2117217 -4458869 5716478 -2329290 -4821592 2883537 -4318444
1469 -2082716 -1643659 -647387 -1514113 287997 -843350 2454552 3136254 -3365888 -980359
1459 -551594 -72051 2414525 -2123099 2562719 -4079849 2697205 -772861 -35115 -94528
1450 -94528 -220928 -455921 647920 -5714231 851772 2174463 -1199286 -4426423 170397
1440 2596676 -5156061 -3955801 3484848 -1651353 1599305 640532 3904158 -2449288
1431E757675b672308e80343q42075A608858A67101M021902b187372p84063C206458
1421c663306B706161c299857B78110J547350i53944F44138a83407C281330j431951
1412A849379J320490a206928L81771F20257a547187n78727C926002b493206J85022
1403b308184R31254C522545c997607F143252B060929H53887b863044F037433A935073
1393E5772b624014A545550c08619B349385A53711K78443c059683j185717E916128
1383a432658A587853C09327h73413k00768B156048m40996Q29317h92546J41301
1374g51245A031588b562727B957624a564967C128795J578435j388257d734663
1365G2136M420394K036168a969731O88454M69666m05805j902103F22348R51686
$$ plain form
1431 5757675 -2672308 -580343 -1422418 1608858 167101 4189003 -2187372 -2971435 3206458
1421 -3663306 2706161 -3299857 278110 1825460 -953944 644138 -183407 3281330 1849379
1412 1849379 3169869 -1206928 -825157 620257 -1547187 -2125914 3926002 -2493206 -2308184
1403 -2308184 -1376930 3522545 -3997607 6143252 2060929 853887 -2863044 6037433 1935073
1393 55772 -2624014 1545550 -308619 2349385 153711 432154 -3059683 -4245400 5916128
1383 -1432658 1587853 309327 -873413 -1074181 2156048 1715052 2544369 -892546 -751245
1374 -751245 1031588 -2562727 2957624 -1564967 3128795 4707230 3318973 -4734663
1365 72136 4492530 6528698 -1969731 -1281277 -811611 -1217416 -3119519 622348 1574034
1356A574034a740182B624936e100545e71105b60931B667070b065540E367061d051723
1346f4333k42077B408745a024129k830653E250412b961004O29106C667464a475399
1336c335456D701142c074707a274756n142935A072861K016823i27409C375071
1327B385050j63653b522144A508424b111409e02750A311265L209128c253316h14635
1317h24911E365228a528541j942066a674690D06424j95524a523294j621152B588630
1307b606251B020274i71514A208128K283757f586849C952487J713577A742949
1298d049371a952251B516888c991528A169538o1494b887213G69129b078033C369542
1288c747805B082368j54610d307401H01085K783059j127199b427190D796482c674037
$$ plain form
1356 1574034 -1740182 2624936 -5100545 -571105 -260931 2667070 -2065540 5367061 -4051723
1346 -64333 -306410 2408745 -1024129 -3854782 5250412 -2961004 -2331898 3667464 -1475399
1336 -3335456 4701142 -3074707 -1274756 -6417691 1072861 3089684 -927409 3375071
1327 2385050 2221397 -2522144 1508424 -2111409 -502750 1311265 4520393 -3253316 -814635
1317 -824911 5365228 -1528541 -3470607 -1674690 406424 210900 -1523294 -3144446 2588630
1307 -2606251 2020274 -971514 1208128 3491885 -6586849 3952487 5666064 1742949
1298 -4049371 -1952251 2516888 -3991528 1169538 1108044 -2887213 769129 -2078033 3369542
1288 -3747805 2082368 1927758 -4307401 801085 3584144 2456945 -2427190 4796482 -3674037
1278a470495k780256e36493D51332b672771B307801I5403c131295D192310h567214
1268D690100d883873d08255B553159f91360d6087j920132B11223I5192d151258
1258c077417F676700d47461D507236j310439A107733j72624g71233E456424A310017
1248A417224f698324D720519c111887J050545E338620a839710A288000c632658
1239c513042A815003N44798c028260B441560G06181a648700j811481B796220b102896
1229h94689H27089b021624D271041C97702c342397b22740E236235I63122a350698
1219a03477p0614j349617A685344k67195a893604K92888f59983B179100g35933
1209I63934b098658A141335a227262L88658B258094q92887K1351E35808b839614
$$ plain form
1278 -1470495 -4250751 -536493 451332 -2672771 2307801 95403 -3131295 4192310 -8567214
1268 4690100 -4883873 -408255 2553159 -691360 -46087 -1966219 211223 95192 -4151258
1258 -3077417 6676700 -447461 4507236 3196797 1107733 935109 -771233 5456424 1310017
1248 1417224 -6698324 4720519 -3111887 -2061342 5338620 -1839710 1288000 -3632658
1239 -3513042 1815003 2359801 -3028260 2441560 706181 -1648700 -3460181 2796220 -2102896
1229 -894689 827089 -2021624 4271041 397702 -3342397 -222740 5236235 963122 -1350698
1219 -103477 -174091 -1523708 1685344 1418149 -1893604 -1600716 -659983 2179100 -735933
1209 963934 -2098658 1141335 -1227262 -838604 2258094 1365207 1386558 535808 -2839614
1199g4129E26148d01157j00053A350952j30795K277509I5797b847555g54108k346263
1189c100371J86021D772508n09121c510891D306332A936758c005754H06766c90015
1179D83624b934069G438263B59470b170672E88208b046870G3900J172005O73199
1170A919104J2600b041695h82010C878469p77165c684704a200257A607843J958812
1161C566655d525475C072816A468179j28137c972248B193986l22328N37732G14354
1151A805514G40370a763478A020294a642898e73086A903925a542126F949593c429186
1141E815932c071001a76888C62846e15442A967733O1041b170453F85216N33527
1132A218743n47270b530264B817188Q65225c412168P10352E236300b451762P33800
$$ plain form
1199 -74129 526148 -401157 -501210 1350952 1220157 3497666 95797 -2847555 -754108 -3100371
1189 -3100371 -2914350 4772508 4263387 -3510891 4306332 1936758 -3005754 806766 -390015
1179 483624 -2934069 7438263 259470 -2170672 588208 -2046870 73900 1245905 1919104
1170 1919104 1931704 -2041695 -882010 3878469 3101304 -3684704 -1200257 1607843 3566655
1161 3566655 -4525475 3072816 1468179 1340042 -3972248 2193986 1871658 2409390 714354
1151 1805514 740370 -1763478 1020294 -1642898 -573086 1903925 -1542126 6949593 -3429186
1141 5815932 -3071001 -176888 362846 -515442 1967733 2028774 -2170453 685216 1218743
1132 1218743 671473 -2530264 2817188 3682413 -3412168 -2701816 5236300 -2451762 -1717962
1123a717962B628608g13043C234050a549732J92699E491034e701488a552155I80590
1113b489320G58753J125609g028517A582104a108860F75270i40818l58965A075000
1103g93093j737258E823979c5546j190426j57311C282693a618484D323018b375757
1093A054936g664964A687361J401993e344044A780623q75928J534604b518477
1084B786305N89957E16479c304324B810822o66226M048357e984928A30986M080561
1075D211547c407660O13080D535191c865065B805741A354204d721796c06654G063759
1065A463314d682615J419283J484509B276920a062112l891963f39366j532825
1057b172191A285938k86341e36369j261998E683404a007078B125903O46486g65522
$$ plain form
1123 -1717962 2628608 -713043 3234050 -1549732 -1357033 5491034 -5701488 -1552155 980590
1113 -2489320 758753 1884362 -7028517 1582104 -1108860 675270 -940818 -1299783 1075000
1103 -793093 -2530351 5823979 -35546 -1225972 -1383283 3282693 -1618484 4323018 -2375757
1093 1054936 -7664964 1687361 3089354 -5344044 1780623 904695 2439299 -2518477
1084 2786305 3376262 516479 -3304324 2810822 2144596 6192953 -5984928 130986 4211547
1075 4211547 -3407660 -2794580 4535191 -3865065 2805741 1354204 -4721796 -306654 7063759
1065 1463314 -4682615 -3263332 -1778823 2276920 -1062112 -4954075 -639366 -2172191
1057 -2172191 1285938 999597 -536369 -1798367 5683404 -1007078 2125903 2772389 -765522
1047b501405A709721f1229F82417e843273a845354G4181L770453f676290e70616
1037C633769F88181J443479c743631F40162N25384h52312j467935E38901L913137
1028D452038b954446E877921e488866B68534b43841B412648K236001I94586A30123
1018c247295B207962M69875e688575K810370A881306N920991d93089C45902b586110
1008h15054B678529m50895J913236j595912F82921b174351P90274n2444A226157
998B779240A262909a562873l382857E32293e654731A735070N3710A44728d29657
988H14646a059899F11418O89747B45872J503612J619954e6988l803267F004852
978d508587D625787g29770o91589B28640c05760D43388b035562K54741a14855
$$ plain form
1047 -2501405 1709721 -61229 682417 -5843273 -1845354 74181 3844634 -6676290 -570616
1037 3633769 688181 2131660 -3743631 640162 1165546 -852312 -2320247 538901 4452038
1028 4452038 -2954446 5877921 -5488866 268534 -243841 2412648 4648649 994586 130123
1018 -3247295 2207962 2677837 -5688575 -2878205 1881306 7802297 -493089 345902 -2586110
1008 -815054 2678529 2227634 4140870 2544958 682921 -2174351 -1384077 -1436521 1226157
998 2779240 1262909 -1562873 -4945730 532293 -5654731 1735070 1788780 144728 -429657
988 814646 -1059899 611418 1301165 245872 1749484 3369438 -56988 -3860255 6004852
978 -4508587 4625787 -729770 -1421359 228640 -305760 443388 -2035562 -1780821 -114855
968b221750G283555d075753B903846a708595m042028D101313A408994f09822o32569
959a242391l01714A258066O61527i0055l470539B614126J157205d277956D791947
949i58526B809729k06569b123786l793782a701743a26581r1452E60525K908957
940C469482d122377A221652c657415B178224a535531A760117c374069R34247R68311
931a471511B052506p26130d92456n96048m029714f58967I45978a149907L52862
922g97045c62523F96575c451144e7449B606037A222177a111360j922058F244976
912c973065D648075k280243F75190f25882C986367A099830d604310C710870i88004
902D461620a086908K2108A794911d383324A47687d10034A569659J876067H31356
$$ plain form
968 -2221750 7283555 -4075753 2903846 -1708595 -5750623 4101313 1408994 -609822 -1242391
959 -1242391 -1544105 1258066 1919593 -90055 -3560594 2614126 3771331 -4277956 4791947
949 -958526 2809729 2603160 -2123786 -5917568 -1701743 -126581 -218033 560525 3469482
940 3469482 -4122377 1221652 -3657415 2178224 -1535531 1760117 -3374069 -2439822 -1471511
931 -1471511 2052506 1326376 -492456 -1088504 -5118218 -658967 945978 -1149907 -797045
922 -797045 -362523 696575 -3451144 -57449 2606037 1222177 -1111360 -3033418 6244976
912 -3973065 4648075 2367832 675190 -625882 3986367 1099830 -4604310 3710870 -988004
902 4461620 -1086908 -1064800 1794911 -4383324 147687 -410034 1569659 3445726 831356
892i66134A464285J533071a911691A798082b210626H57299J480794a332440A126498
882E599784b991197a466398C264627p79072b011248B654575c716612K21892J634840
873a859880Q76507A483458f94703A2069c582396B609246b027228m35288a171303
863E13425J921953K62639f39515k786698I64518P935089b386340P61845j879309
854c503804A900974c26589D280758d163594a033891B19449J956697P53994a287468
844A735445i55041B611646g138835C342662j581309B69928a120965m717665D798786
834A227682c38031r17232n82499B825136g94312E10179M238492b677590o8124
825b745714E167623f717837I04004L42331J518052e54605B11164a804831d42939
$$ plain form
892 -966134 1464285 2997356 -1911691 1798082 -2210626 857299 2338093 -1332440 1126498
882 5599784 -2991197 -1466398 3264627 2485555 -2011248 2654575 -3716612 -3494720 -1859880
873 -1859880 -983373 1483458 -694703 12069 -3582396 2609246 -2027228 -2462516 -1171303
863 513425 2435378 2698017 -639515 -3426213 964518 8899607 -2386340 -1624495 -3503804
854 -3503804 1900974 -326589 4280758 -4163594 -1033891 219449 2176146 2930140 -1287468
844 1735445 -955041 2611646 -7138835 3342662 1761353 269928 -1120965 -5838630 4798786
834 1227682 -338031 -1255263 -1837762 2825136 -794312 510179 4748671 -2677590 -2745714
825 -2745714 5167623 -6717837 904004 1246335 2764387 -554605 211164 -1804831 -442939
815A151882m72727f02271B466094k42286o17995a110684F689206d538329C001710
805a732856K22370E9576c192464D05638K47107J885518f38625l204639D98970
795B60739J039414d95430B451999c173809a243983j087143D235077d756767J439570
786c317197c91609J90912n80806k97111D67822a262828B870415b833804H8395
776e19134l461553m620700E944707b90198l169790e30897F80255a765389n45523
767b310912C375403A83901L065178e546744h47828b55931A332732a522934D15702
757A13140h42500C480842a434614k340055C002031J067072g42474m40153D827994
747a938006A863329c866771b30371A873080b182448B104119b83528A36001b739586
$$ plain form
815 1151882 679155 -602271 2466094 2223808 1605813 -1110684 6689206 -4538329 3001710
805 -1732856 -1510486 59576 -3192464 405638 652745 2538263 -638625 -3843264 498970
795 260739 1300153 -495430 2451999 -3173809 -1243983 -2331126 4235077 -4756767 -3317197
786 -3317197 -391609 -200697 -781503 -1078614 467822 -1262828 2870415 -2833804 88395
776 -519134 -3980687 -8601387 5944707 -290198 -3459988 -530897 680255 -1765389 -2310912
767 -2310912 3375403 183901 3249079 -5546744 -847828 -255931 1332732 -1522934 415702
757 113140 -842500 3480842 -1434614 -3774669 3002031 4069103 -742474 -1182627 4827994
747 -1938006 1863329 -3866771 -230371 1873080 -2182448 2104119 -283528 136001 -2739586
737b056627M94081a81004b5118q29988E400246c152610m5401D67959B10713L810193
727D020906a448331A779139a363441j328691K17777I28739M034068a741001B775560
717b615816j315680C040164b081070A15158h182701D68313K142086N24260g502251
707b448845F658746h68469B251103Q935824R989732G898441E25166a945058m0055993
698d2001051N363111a1343339G82541e430843A9934229q560733L6745027A7860808
689A9487261J103306c6384897k8830453c1259146P643824J27762A7361197K696770
681B0057967G027008A016900N578659g77046D37215a093954e42989B983436d681113
671h651971D86834c52242A731903b777398a029918j781391P71096o523071n542126
$$ plain form
737 -2056627 -1562546 -181004 -25118 -855106 5400246 -3152610 -3198011 467959 210713 4020906
727 4020906 -1448331 1779139 -1363441 -2692132 -2474355 928739 4962807 -1741001 2775560
717 -2615816 -3931496 3040164 -2081070 115158 -8182701 468313 2610399 3134659 -7502251
707 -2448845 6658746 -868469 2251103 11186927 21176659 7898441 525166 -1945058 -42001051
698 -42001051 -36637940 -11343339 782541 -5430843 19934229 11373496 48118523 17860808
689 19487261 20590567 -36384897 -65215350 -31259146 -23615322 -23487560 17361197 20057967
681 20057967 7027008 1016900 6595559 -777046 437215 -1093954 -542989 2983436 -4681113
671 -8651971 486834 -352242 1731903 -2777398 -1029918 -2811309 -2040213 -8563284 -14105410
662a4105410k531156B7587396J977581O340171j6099084c620762B1727372a7588842
653a7673534j6697279p263834a1154250H745953M859695L02703P890874A434466
644B4305318I948966c929478l848350j3400147a209502A29851a692197M99171
636a193026j8585G916670b440286l68272i57121c71424C345417f87716l969207
627d656923A551855a345090e20828C11134J581906a506345B402452r43299c860886
617c710232k580820B044010c891018C433692f766695K688511q044875n670062
609a7793121k1829958J4449674D08682572A51510343A6746458c89400755d621421
601h572165Q77796a569999j473852q34269A574777D42857a663841g61690F85945
$$ plain form
662 -14105410 -16636566 27587396 29564977 35905148 19806064 -3620762 21727372 -17588842
653 -17673534 -34370813 -41634647 -11154250 8745953 13605648 13908351 21799225 1434466
644 24305318 9948966 -3929478 -7777828 -21177975 -1209502 129851 -1692197 -1193026
636 -1193026 -1211611 7916670 -2440286 -2808558 -957121 -371424 3345417 -687716 -4656923
627 -4656923 1551855 -1345090 -520828 311134 1893040 -1506345 2402452 1459153 -3860886
617 -3710232 -6291052 2044010 -3891018 3433692 -6766695 -4078184 -12123059 -17793121
609 -17793121 -39623079 -25173405 408682572 151510343 16746458 -389400755 -4621421
601 -8572165 -7694369 -1569999 -3043851 -3878120 1574777 442857 -1663841 -761690 685945
591A647685f198912D88758R97407K861056e419609B217701j017123L933362A464604
581F94341a628853j142372E539437B30781J388555f68120l040183B869577b323722
571A044039N35157e348021D890732A87771K953333a208286C737070c872129g12383
561A389752b853719K12607C74121e020463B708551C71005J306639a116233j631302
552b747535E250135c619854q68225e76219C87369J239933b919000E2230c137315
542i13340G21309K862843b292404i75788A268830M168604j874881A555151a351641
532c71628k351417H05907e51831C641439a316239j872999B367012n87096a354237
522E30628J268125e53631k425286F769125B663978b989429C743398g29413k597458
$$ plain form
591 1647685 -6198912 488758 1486165 4347221 -5419609 2217701 1200578 5133940 1464604
581 694341 -1628853 -2771225 5539437 230781 1619336 -668120 -3708303 2869577 -2323722
571 1044039 1579196 -5348021 4890732 187771 3141104 -1208286 3737070 -3872129 -712383
561 1389752 -2853719 -2641112 374121 -5020463 2708551 371005 1677644 -1116233 -2747535
552 -2747535 5250135 -3619854 -4488079 -576219 387369 1627302 -2919000 52230 -3137315
542 -913340 721309 3584152 -2292404 -975788 1268830 5437434 3562553 1555151 -1351641
532 -371628 -2723045 805907 -551831 3641439 -1316239 -3189238 2367012 1779916 -1354237
522 530628 1798753 -553631 -2978917 6769125 2663978 -2989429 3743398 -729413 -3326871
513c326871E71145A14687L775880E60505K755803n29015f128231c67819p51B59135
502A64413N53081Q13415n16770c890662B2484L074688c075269a12307k673217
493b785524B727870d557479d89330j078202o82770A909737J863209c577259I65203
483C521367a233418B94782b226728G7334a386649C716995I6660a139894l470484
474d610378J100258A523120b578105J163320B795395a136234B224520M41051a890963
464b923535J378445f44652B698011d306135C586789h97918A433610K307045b030589
454c625256E620638H5679b906237R36202A226596c092065G83095m3619a179171
444a63780E055108a09497A48395L055910g28569A293541h737985B069435d996093
$$ plain form
513 -3326871 571145 114687 3890567 560505 3316308 2787293 -6128231 -367819 -368570 259135
502 164413 717494 1530909 1014139 -3890662 22484 3097172 -3075269 -112307 -2785524
493 -2785524 2727870 -4557479 -489330 -1567532 -2250302 1909737 3772946 -3577259 965203
483 3521367 -1233418 294782 -2226728 77334 -1386649 3716995 96660 -1139894 -4610378
474 -4610378 -3510120 1523120 -2578105 -1414785 2795395 -1136234 2224520 2665571 -1890963
464 -2923535 -1545090 -644652 2698011 -4306135 3586789 -897918 1433610 3740655 -2030589
454 -3625256 5620638 85679 -2906237 -1970035 1226596 -3092065 783095 739476 -1179171
444 -163780 5055108 -109497 148395 3204305 -728569 1293541 -8737985 2069435 -4996093
434c106608b08514B120908C28825a425689B13603L294775j040232N04219A262302
424A17950E2173a301052e58871C422649j200428g49042D582600M01b458863k40546
414b699409c95591G51338J827809b516215l17734a095376E784945a931710B31772
404e20115A609819K644913g522107a468833B522515b042718J001824B790469F00759
394E238429H64911J684217e796050B381940a84536A121607N23276b092796A388015
384B56836a701234E41363g55851A864495J787046e041053F901091g79504k73831
375a053335g8579j504619j660293A506962J149887h036123F551263a020609C42242
365A539061b901010A337985l53027a827006l50906A321627a832307A602178e385342
$$ plain form
434 -3106608 -208514 2120908 328825 -1425689 213603 3508378 2468146 2972365 1262302
424 117950 52173 -1301052 -558871 3422649 2222221 -749042 4582600 4583001 -2458863 -2699409
414 -2699409 -395591 751338 2579147 -2516215 -2833949 -1095376 5784945 -1931710 231772
404 -520115 1609819 4254732 -7522107 -1468833 2522515 -2042718 -1040894 2790469 600759
394 5238429 864911 2549128 -5796050 2381940 -184536 1121607 1644883 -2092796 1388015
384 256836 -1701234 541363 -755851 1864495 3651541 -5041053 6901091 -779504 -1053335
375 -1053335 -78579 -1583198 -3243491 1506962 2656849 -8036123 6551263 -1020609 342242
365 1539061 -2901010 1337985 984958 -1827006 -2177912 1321627 -1832307 1602178 -5385342
355d305935a970877B706017L21966b568141R89796A540197m04669d370599F145640
345f866451b87230C893740c312014l30911C897613a116523k702079i36476C121095
335B603944c447506k254493B06230J420790c049149B813404J634861c883275a82613
325f15521D772666F42520f581225i27088C423336g357823B320281d149038A622682
315B707541d410523C009284a84570C472140a400939p69189F65484a217310C002215
305B85074R04172g60422J7026F714467a939408C039076C05397J583512d181070
295F501531B129760a717985j12F097199b413192a041211A881185D67895a125981
285b521830D804365a067483B277973a5005k965633a85890j32062q87451B226316
$$ plain form
355 -4305935 -1970877 2706017 3027983 -2568141 -1578345 1540197 1135528 -4370599 6145640
345 -6866451 -287230 3893740 -3312014 -3642925 3897613 -1116523 -3818602 -936476 3121095
335 2603944 -3447506 -5701999 206230 1627020 -3049149 2813404 4448265 -3883275 -182613
325 -615521 4772666 642520 -6581225 -927088 3423336 -7357823 2320281 -4149038 1622682
315 2707541 -4410523 3009284 -184570 3472140 -1400939 -2170128 665484 -1217310 3002215
305 285074 1189246 -760422 -743396 6714467 -1939408 3039076 305397 1888909 -4181070
295 6501531 2129760 -1717985 -1718097 6097199 -2413192 -1041211 1881185 467895 -1125981
285 -2521830 4804365 -1067483 2277973 -15005 -2980638 -185890 -317952 -1205403 2226316
275b975540D687969b419392B374861f858671b941949A862358D91189J098225K885207
266D474621j259902a601527B7737h98514D991377A0227b617511A859515d420762
256A049394N16785A05598g33917q10809B135094K68712f76388l423137c33102
246a16427m842009G082928c660433F5166K950176F95125D2736K019157a61219
236E97058a941517j63932E48237N300036e869158b388599g8886l037729D908087
226c212469J558085J29411A952022b265815g49647A753275J81861K795161g68386
216c634065e18458F30928R32235p76552J497616e4665A076592J09431a728515
206e29216p219961A687682C53358K712259A227268c193823D037024a459628B641923
$$ plain form
275 -2975540 4687969 -2419392 2374861 -6858671 -2941949 1862358 491189 1589414 4474621
266 4474621 3214719 -1601527 27737 -898514 4991377 10227 -2617511 1859515 -4420762
256 1049394 1566179 105598 -733917 -1544726 2135094 2403806 -676388 -4099525 -333102
246 -116427 -4958436 7082928 -3660433 65166 3015342 695125 42736 2061893 -161219
236 597058 -1941517 -2105449 548237 5848273 -5869158 -2388599 -78886 -3116615 4908087
226 -3212469 -1654384 -1524973 1952022 -2265815 -749647 1753275 1935136 4730297 -768386
216 -3634065 -518458 630928 1563163 786611 2284227 -54665 1076592 1186023 -1728515
206 -529216 -7749177 1687682 353358 3065617 1227268 -3193823 4037024 -1459628 2641923
196d0860A117853m27200k05376d61883a68189L8535k20046A849745h02579A780706
185A375025L949345a99292F52903a580148A290565c330771D936830G90900K48586
176A039486c175393D380658l52679M793937J8674944R2272062j8579390a37095501
167a34113069j03288464d3678637p2668702A28154991o155298J08117116c0426650
159b6333835g112919J628296a223023m588022A718300b077305D39943d254600
150F81629d69160j003946d01119j039773L56586C93103L895004a075178a3951
140a653976B126318b846861D069410A304946A28126Q55460d85582D069034e216438
130d553964C211311d69732B977680e606803J757769J340653b50006C72441J805083
$$ plain form
196 -40860 1117853 690653 485277 -461883 -168189 -129654 -349700 1849745 -802579 1780706
185 1375025 5324370 -199292 652903 -1580148 1290565 -3330771 4936830 790900 1039486
176 1039486 -3175393 4380658 4027979 8821916 27496860 119768922 101189532 -137095501
167 -134113069 -237401533 -43678637 -116347339 128154991 121999693 230116809 -30426650
159 -26333835 -7112919 -5484623 -1223023 -5811045 1718300 -2077305 439943 -4254600
150 681629 -469160 -1473106 -401119 -1440892 -1084306 393103 4288107 -1075178 -13951
140 -1653976 2126318 -2846861 4069410 1304946 128126 983586 -485582 4069034 -5216438
130 -4553964 3211311 -469732 2977680 -5606803 -3849034 -2508381 -250006 372441 2177524
121B177524b989947b56689A408438c39808n24629H74734f49898I15565K525759
112C441324g137349D100942e46157F377913f448445g79383A203718c470577B242489
102a808330L86828I16667c878948k700921K209327l9974P02017h48976m613740
93e462716d83496n95318j831514D33925Q560909a694544H78207C78022i86615
83B352711p21887B64872R86321d117450c46685B754288f895296d99321r53778
74a453099A511248n53370Q19943b288658P85833A929335K765432a545306D416837
64b227035I82252L54533h47934J54329A239468a320185J47035A488741G29473
54e151122E71100K901355B21685c262515L6127D889130g11076B379726d893886
$$ plain form
121 2177524 -2989947 -256689 1408438 -339808 -864437 874734 -649898 915565 3441324
112 3441324 -7137349 4100942 -546157 6377913 -6448445 -779383 1203718 -3470577 2242489
102 -1808330 -1421502 916667 -3878948 -6579869 -4370542 -4410516 -3708499 -848976 -5462716
93 -5462716 -483496 -1078814 -2910328 433925 8994834 -1694544 878207 378022 -986615
83 2352711 1630824 264872 1251193 -4117450 -346685 2754288 -6895296 -499321 -1453099
74 -1453099 1511248 957878 1777821 -2288658 -1502825 1929335 4694767 -1545306 4416837
64 -2227035 982252 1336785 -847934 -693605 1239468 -1320185 -1173150 1488741 729473
54 -5151122 571100 3472455 221685 -3262515 -3226388 4889130 -711076 2379726 -4893886
44G098949A131395A179b252757A912768a165914k724982a738699A623155a719424
34G17063b921206B685492j35622J408133b61593j807518A063839b577246A904146
24D279394a977257c99287j53770B022687H00085c205304C96813c567342o01065
15d168407A551603b284065B060984F46034a148965B662911d012832F61900e01218
5C774454a086737D98385K423720b14282J9607
0a94675
$$ plain form
44 7098949 1131395 1179 -2252757 1912768 -1165914 -3890896 -1738699 1623155 -1719424
34 717063 -2921206 2685492 2549870 3958003 -261593 -2069111 1063839 -2577246 1904146
24 4279394 -1977257 -399287 -553057 2022687 800085 -3205304 396813 -3567342 -4168407
15 -4168407 1551603 -2284065 2060984 646034 -1148965 2662911 -4012832 661900 -501218
5 3774454 -1086737 498385 2922105 -214282 -194675
0 -194675
##PAGE= F1=5640.578599651
##FIRST=     21204.543296753, 2644.21089616403, -4210433
##DATA TABLE= (F2++(Y..Y)), PROFILE
2047d210433B372595a601305k25658B95488b850044B137076N75718e58857F765707
2037e078985E70531e671220H89845h90465B072571N59769f79581A759320B33235
2027d89011o15330A359512q1477e15893B282998J031676O01857b569432a244962
2017A798118O48984E23869K278161b52613j326213A414685D74561J254228c635077
2007D86040a540859k2185B91286J703782b105178k073908G56502R35216c664286
1997C321747b892939k383979K550415k585898a721696C252285K986618A31237
1988C689879B96468K34525a579751j63232A416406F05869b910072J257642F82784
1978a056304Q7280d02462k055777I92549M65946e02637E174996g642016H74301
$$ plain form
2047 -4210433 2372595 -1601305 -1826963 295488 -2850044 2137076 2712794 -558857 6765707
2037 -5078985 570531 -5671220 889845 -890465 2072571 2632340 -679581 1759320 233235
2027 -489011 -1104341 1359512 1278035 -515893 2282998 3314674 3916531 -2569432 -1244962
2017 1798118 2447102 523869 2802030 -252613 -1578826 1414685 474561 1728789 -3635077
2007 486040 -1540859 -1563044 291286 1995068 -2105178 -4179086 756502 1691718 -3664286
1997 3321747 -2892939 -5276918 -2726503 -5312401 -1721696 3252285 6238903 131237
1988 3689879 296468 530993 -1579751 -1742983 1416406 605869 -2910072 -1652430 682784
1978 -1056304 -969024 -402462 -2458239 992549 1458495 -502637 5174996 -7642016 874301
1968A270508b280441A778668b136357E23877B44672g65360l42283E412852F90607
1958b376327k21827A947495e362539B020969a747540C91147a182431D37793j19379
1949C18414L19027J859224p24678K123376a180258B155214K538a159191k795895
1940c955086B643000a323048k126305C499171e057188a419976A288888K778496
1932D067384c667711H33149K409518O31687d489659D852321a923010C312215D49590
1922b974865B987742e15048C310453I170a132150k017937D359798b944502A353179
1912C579071G6709e09133o11120l79311q99945N36711B207073h07365q6332j890832
1902b784529D408525c592339A794404L731799B15815N76825c404078F93835f26761
$$ plain form
1968 1270508 -2280441 1778668 -2136357 523877 244672 -765360 -1107643 5412852 690607
1958 -2376327 -2598154 1947495 -5362539 2020969 -1747540 391147 -1182431 437793 318414
1949 318414 637441 2496665 1771987 3895363 -1180258 2155214 2157752 -1159191 -3955086
1940 -3955086 2643000 -1323048 -3449353 3499171 -5057188 -1419976 1288888 4067384
1932 4067384 -3667711 833149 3242667 3874354 -4489659 4852321 -1923010 3312215 449590
1922 -2974865 2987742 -515048 3310453 9170 -1132150 -3150087 4359798 -2944502 1353179
1912 3579071 76709 -509133 -1120253 -1499564 -2399509 -1862798 2207073 -807365 -893697 -2784529
1902 -2784529 4408525 -3592339 1794404 5526203 215815 792640 -3404078 693835 -626761
1892f57832A272653J88831c855992C35292b3148E132540C43747a060313d8848
1882b313272j185893l079604b08199A344031A24884K665695a637467E07458R32314
1873A439772h61280k708084F31385O12875d473190C050978b776799A118302N07142
1864A625444a189266C512263c617238H321443a111085A529437G33096J15533N54944
1855A403573h999115b911546H43611L233455A42606e968779C254467J60225b306962
1845c021451B412960k09310c051702B376611c48436j301710e3499A879443M934767
1836F814210h596081F50228b235577A272736a260774j58870B896452H96064A67805
1826d750640a102383b10960A330413a375023D700025A433226b726391A890215
$$ plain form
1892 -657832 1272653 1461484 -3855992 335292 -23148 5132540 343747 -1060313 -48848
1882 -2313272 -3499165 -6578769 -208199 1344031 124884 2790579 -1637467 507458 1439772
1873 1439772 -861280 -3569364 631385 1244260 -4473190 3050978 -2776799 1118302 1625444
1864 1625444 -1189266 3512263 -3617238 8321443 -1111085 1529437 733096 848629 1403573
1855 1403573 -8999115 -2911546 843611 4077066 142606 -5968779 3254467 3414692 -2306962
1845 -3021451 2412960 2203650 -3051702 2376611 -348436 -1650146 -53499 1879443 6814210
1836 6814210 -8596081 650228 -2235577 1272736 -1260774 -1419644 2896452 896064 167805
1826 -4750640 -1102383 -210960 1330413 -1375023 4700025 1433226 -2726391 1890215
1817b789007j269465g12124m850414f82153B150733j86613o45342a100411l59736
1808a460147D554486A904977j81532B664b333311e8975j059021D254218g911373
1798A054159d676702A751002l19488b300682J94421G078904b962329E552588H85718
1788D365233e875637B232058e81727a6567A913531h562j072925j079022B752170
1778h4818B334694a143889B502847p12714d739207b015883r45891F999123b006754
1768g542596A279567B04588L94954J668665M44178d941887A682741a092839A634334
1758a396585D360502a325393A656301f16093C648938a957636l094292d15322q06521
1749a221843B301387J417920f774207a974205A221506K087864b70879k311710
$$ plain form
1817 -2789007 -4058472 -712124 -5562538 -682153 2150733 1964120 1318778 -1100411 -1460147
1808 -1460147 4554486 1904977 1723445 2664 -2333311 -58975 -1117996 4254218 -7911373
1798 1054159 -4676702 1751002 1431514 -2300682 -2106261 7078904 -2962329 5552588 885718
1788 4365233 -5875637 2232058 -581727 -16567 1913531 -8562 -1081487 -2160509 2752170
1778 -84818 2334694 -1143889 2502847 1790133 -4739207 -2015883 -2961774 6999123 -2006754
1768 -7542596 1279567 204588 599542 2268207 2712385 -4941887 1682741 -1092839 1634334
1758 -1396585 4360502 -1325393 1656301 -616093 3648938 -1957636 -5051928 -415322 -1221843
1749 -1221843 2301387 3719307 -6774207 -1974205 1221506 3309370 -270879 -2582589
1741b582589A142477a05935n031235A257697b646845A49552a114222k09198M73004
1732h50416C174740i08984j01187A795451h999563C043796a343793M00587G01314
1722c102859A360731a775930A470950i06818b58868p83046A376669a078898G476187
1712C713194c422407A788345b29485j942362a30425F66892K120135B93170J673301
1703A966471C62306K888902F98504r225b878290B120711b074360m48332A087876
1693b181094C93059O51010a990922g89674m741900B469648J387805c04945j854985
1684b159930D765489a184130G07212b262167A563728K506444c958294B075719
1675B250810O97394e013618i29299n84777B62110K45282J501798e906391b105630
$$ plain form
1741 -2582589 1142477 -105935 -5137170 1257697 -2646845 149552 -1114222 -1323420 -850416
1732 -850416 3174740 -908984 -1010171 1795451 -8999563 3043796 -1343793 -943206 701314
1722 -3102859 1360731 -1775930 1470950 -906818 -258868 -1041914 1376669 -1078898 7476187
1712 3713194 -3422407 1788345 -229485 -2171847 -130425 666892 2787027 293170 1966471
1703 1966471 362306 3251208 698504 689279 -2878290 2120711 -2074360 -2522692 1087876
1693 -2181094 393059 1044069 -1990922 -789674 -5531574 2469648 3857453 -304945 -2159930
1684 -2159930 4765489 -1184130 707212 -2262167 1563728 4070172 -3958294 2075719
1675 2250810 2948204 -5013618 -929299 -1514076 262110 507392 2009190 -5906391 -2105630
1665D987318D96862M926624c64903q656516B537741b320038A733444i83147D65387
1655a819664k183129e22654F42596b756515C892927a261564k985787F541322H76700
1645c324385o6281B439354b365147j242802B763926b150441D026195b38308B476801
1635C031133a032671K53239B270031L59410a05851B196295I7343d813214F32815
1625G156914c697565b0999D52453K012215e465529i6687n3060k417289N23788
1616b043248E65748b028401R88709o4919A704959c744382B022462I82455N34934
1607A517389a13497D568057b508179G266318e864591a019778c31894A925896i1769
1597B698845a795330C204289a733497c08165G81015a116294G94461C37683a181239
$$ plain form
1665 4987318 496862 5423486 -364903 -9021419 2537741 -2320038 1733444 -983147 465387
1655 -1819664 -4002793 -522654 642596 -2756515 3892927 -1261564 -4247351 6541322 876700
1645 -3324385 -3390666 2439354 -2365147 -3607949 2763926 -2150441 4026195 -238308 2476801
1635 3031133 -1032671 -779432 2270031 2629441 -105851 2196295 97343 -4813214 632815
1625 7156914 -3697565 -20999 452453 2464668 -5465529 -96687 -149747 -2567036 -2043248
1616 -2043248 565748 -2028401 -1039692 -1104611 1704959 -3744382 2022462 982455 1517389
1607 1517389 -113497 4568057 -2508179 7266318 -5864591 -1019778 -331894 1925896 -91769
1597 2698845 -1795330 3204289 -1733497 -308165 781015 -1116294 794461 337683 -1181239
1587d09531m74986A315079b539117J148204k359135B095027e1776k314422O84207
1578a681991G90358e7342o547733A920490a483870G149566d11796B012420b830474
1568a413027A453895e330544B523822a958013k015231L77348J512695h77380C987615
1558b532753Q14371f68665C037319G30059b089723a001473F407777a126022G43897
1548F04227h44718B243496h24624L52502A300972a189200C506924A576035e34768
1538B676803b717640a059938p24848j610447a672178B980758g46433k682005A180268
1528b08847C943935A291536c179495A665785J628250g03728B587789d376731D539663
1518e090256H885103f88519A12384e076301G87532P61746d659699e65332D53037
$$ plain form
1587 -409531 -884517 1315079 -2539117 -1390913 -3750048 2095027 -51776 -2366198 -1681991
1578 -1681991 790358 -57342 -6605075 1920490 -1483870 7149566 -411796 2012420 -2830474
1568 -1413027 1453895 -5330544 2523822 -1958013 -3973244 -3595896 -2083201 -877380 3987615
1558 -2532753 -1718382 -668665 3037319 730059 -2089723 -1001473 6407777 -1126022 743897
1548 604227 -844718 2243496 -824624 -472122 1300972 -1189200 3506924 1576035 -534768
1538 2676803 -2717640 -1059938 -1784786 -3395233 -1672178 2980758 -746433 -3428438 1180268
1528 -208847 3943935 1291536 -3179495 1665785 3294035 -703728 2587789 -4376731 4539663
1518 -5090256 8885103 -688519 112384 -5076301 787532 1549278 -4659699 -565332 453037
1508A666617p64670B28723K426641L440255I79770b111039d94008A119372J627482
1499B746854L628509e37408A0158670d295820B021142b058892A551183K7860a959103
1489B237760b781250h88836m207026H67842b321654H995135G13269d84287k03339
1480f87626j327884c46507n084404A388302d451647D728248a925431l097527C072436
1470e778298a973591L57591a82881j390506G52721a151247B284589R59347d666183
1460a207864h4742l19326B555004a943036A414771d144490B055558h85897G52245
1450d53633B04393g90667B30979d828985E62728K272509A49699d108585B44974
1440B596121d646633j50877D372027a372875A151798l37990L252318b102030E512544
$$ plain form
1508 1666617 901947 228723 2655364 6095619 979770 -2111039 -494008 1119372 2746854
1499 2746854 6375363 -537408 10158670 -4295820 2021142 -2058892 1551183 1579043 -1959103
1489 2237760 -2781250 -888836 -5095862 867842 -2321654 8995135 713269 -484287 -687626
1480 -687626 -2015510 -346507 -5430911 1388302 -4451647 4728248 -1925431 -5022958 3072436
1470 -5778298 -1973591 -1616000 -182881 -1573387 752721 -1151247 2284589 3243936 -4666183
1460 -1207864 -84742 -404068 2555004 -1943036 1414771 -4144490 2055558 -885897 752245
1450 -453633 204393 -790667 230979 -4828985 562728 2835237 149699 -4108585 244974
1440 2596121 -4646633 -4797510 4372027 -1372875 1151798 813808 4066126 -2102030 5512544
1430b375078b13157q58682F74153l5595L203239b491859j159010C630494c649149
1420B980500c681935D63506J109980g60087E47274a28641C256502A544042K079826
1411C623868h80001L57889E06348a818685j393754C862699b706829l78081h79975
1401C390651d084906E733714B485942C87068c803565F163167B575063C42228a618840
1391A361961d31816A304353a96478I62648b405637j537147E975852b184825A597694
1381A183669a606041K1441A956895j79463O58219e39325d3675A599525b974325
1371B944873b294547C364889Q59475k28399c930368c74607D938524K17749b452857
1361g90296o54727J00782j510603A41759J841778a431778B507381d770060b40397
$$ plain form
1430 -2375078 -213157 -1071839 674153 638558 3841797 -2491859 -3650869 3630494 -3649149
1420 2980500 -3681935 463506 1573486 -760087 547274 -128641 3256502 1544042 3623868
1411 3623868 -880001 -522112 506348 -1818685 -3212439 3862699 -2706829 -3084910 -879975
1401 3390651 -4084906 5733714 2485942 387068 -3803565 6163167 2575063 342228 -1618840
1391 1361961 -431816 1304353 -196478 962648 -2405637 -3942784 5975852 -2184825 1597694
1381 1183669 -1606041 -1584600 1956895 1777432 2435651 -539325 -43675 1599525 -2974325
1371 2944873 -2294547 3364889 4224364 3995965 -3930368 -374607 4938524 5156273 -2452857
1361 -790296 -1445023 -1344241 -2854844 141759 1983537 -1431778 2507381 -4770060 -240397
1351c96185B562248b112185E871108d278184e17721a15648B354935e33869l966159
1342d500028E214678c496295a533903C220323d29370k805626E085950b921840
1333b209858m505953A097874L155812a017898C861779j665517K39606b456510
1324A266436b388250h06748A450355K968408c292753c88893j82843D920841a729113
1314b789976J110961E88581q3186a261478k168923C006674a894803A984162a596009
1304A555801K419841g183559C546465J519019A843667c188952J487206B092648
1295d164305B040829r32995c622064I95877a609395C507677c590117A419677F79111
1285d025232A156002K085496o90494b422448D249718c205770J426889j674486
$$ plain form
1351 -396185 2562248 -2112185 5871108 -4278184 -517721 -115648 2354935 -533869 -4500028
1342 -4500028 5214678 -3496295 -1533903 3220323 -429370 -3234996 5085950 -2921840
1333 -2209858 -6715811 1097874 4253686 -1017898 3861779 2196262 2435868 -2456510
1324 1266436 -2388250 -806748 1450355 4418763 -3292753 -388893 -571736 4920841 -1729113
1314 -2789976 -1679015 588581 505395 -1261478 -3430401 3006674 -1894803 1984162 -1596009
1304 1555801 3975642 -7183559 3546465 5065484 1843667 -3188952 -1701746 2092648
1295 -4164305 2040829 1107834 -3622064 995877 -1609395 3507677 -3590117 1419677 679111
1285 -4025232 1156002 3241498 2551004 -2422448 4249718 -3205770 -1778881 -3453367
1277c453367f06548E57546b763416C484661C68271c469483D759129h440464D876489
1267e045251g16172B570523b26656E76074b493541G84753g97328l024561Q12686
1258c009203F905213b02523D079911q27505G56676M37915e10708E361294A977210
1248D64250g543897E790567c498212J648947F392920a341186G20756c392101o96050
1239d088151B351245O92871c983488B520107B21342f85161l049879B872330c135159
1229g95961D08860a937770D609365B81770c255909H9112P096338A42159a336813
1219A12235k6498b274473B104887l20087a757368q679Q72617B423073f01462F91838
1208a298542G73250i68965b07738B485420j177234j8025E09171c614761D41805
$$ plain form
1277 -3453367 -606548 557546 -2763416 3484661 368271 -3469483 4759129 -8440464 4876489
1267 -5045251 -716172 2570523 -226656 576074 -2493541 784753 -797328 -3821889 -3009203
1258 -3009203 6905213 -202523 4079911 3252406 756676 1194591 -510708 5361294 1977210
1248 464250 -7543897 5790567 -3498212 -1849265 6392920 -1341186 720756 -3392101 -4088151
1239 -4088151 2351245 3044116 -3983488 2520107 221342 -685161 -3735040 2872330 -3135159
1229 -795961 408860 -1937770 4609365 281770 -3255909 89112 7185450 142159 -1336813
1219 112235 85737 -2274473 2104887 1784800 -1757368 -1766047 -893430 2423073 -601462 691838
1208 -1298542 773250 -968965 -207738 2485420 1308186 1290161 509171 -3614761 441805
1198g00644a51485k63762A456036L82962J225505e15120k460623g85566k137798
1189b923364r41918D138482K03199c832739C724784j798027b953969a06465m00663
1180e07128A098885c247504H870781C11613b214135A127325b244708A14957J312877
1171A427834K08270J240190b974417b09022C328778J005888c615795b35305A548610
1161D377994d280991B625297A133690O56486d020547B042638o42278J527240j428065
1152A499535J128218A100275a999543A125902a711283P98837B074934a652745
1143F976710c032250E794031c418476d7432C70108f93244A827344K69702a472328
1133A485113m46293m11389b738408B323402J650238c292828a570544E183652b277344
$$ plain form
1198 -700644 -151485 -415247 1456036 1838998 3064503 -515120 -2975743 -785566 -2923364
1189 -2923364 -3865282 4138482 4341681 -3832739 3724784 1926757 -2953969 -106465 -507128
1180 -507128 1098885 -3247504 8870781 311613 -2214135 1127325 -2244708 114957 1427834
1171 1427834 1636104 2876294 -2974417 -209022 3328778 4334666 -3615795 -235305 1548610
1161 4377994 -4280991 2625297 1133690 1790176 -4020547 2042638 1400360 2927600 1499535
1152 1499535 2627753 1100275 -1999543 1125902 -1711283 -912446 2074934 -1652745
1143 6976710 -3032250 5794031 -3418476 -47432 370108 -693244 1827344 2097046 -1472328
1133 1485113 1038820 627431 -2738408 2323402 3973640 -3292828 -1570544 5183652 -2277344
1123a052010B780300a713982C072510a743357b64720D712897e358035i63069C24787
1113a373162a40875A585351g022504I90454a136940A565634a110035k42197A453595
1103c42040k295764F257913d13951l39195k12055B746359a510941C985830b183922
1093A63313g798770H07396K760899c796948B178350r90182J601375c147589B970527
1083B891861A21812b971226B817468l55250K676610e272147h61925C846223c799615
1073b691650D642166c727506A546423K07702d747560C32732O123422B480497d445848
1063c556133a277738A509620a361586k962310c78251j234142A400669B97196f08228
1053a781119F156303c45430A519294K068521i24255q04219B204624C76899P06610
$$ plain form
1123 -1052010 2780300 -1713982 3072510 -1743357 -264720 4712897 -5358035 -963069 324787
1113 -1373162 -140875 1585351 -7022504 990454 -1136940 1565634 -1110035 -1352232 1453595
1103 -342040 -2637804 6257913 -413951 -753146 -965201 2746359 -1510941 3985830 -2183922
1093 163313 -7798770 807396 3568295 -3796948 2178350 1188168 2789543 -3147589 2970527
1083 2891861 121812 -2971226 2817468 2462218 5138828 -5272147 -861925 3846223 -3799615
1073 -2691650 4642166 -3727506 1546423 1754125 -4747560 332732 6456154 2480497 -4445848
1063 -3556133 -1277738 1509620 -1361586 -4323896 -378251 -1612393 1400669 297196 -608228
1053 -1781119 6156303 -345430 1519294 3587815 -924255 -1728474 2204624 376899 1083509
1044A083509d999131f13023q39943D166848f210850d71103D037992H55644M22660
1035A278304c752592A234915J81917i09811j672227G61820L499876b683585E119681
1025e673674A56370b73294B437012K225405D65696f25390j513636B290940O72131
1016B963071f122147K479079A460602P091864b43121A006834b277413f33610B661999
1006B192315K118489k118539j053979b431822P81658J93034A862209J037234C12615
996b233792j488844b48303n633037A696300j64526A18907a034030B30227h61249
986H56317L00037A8181K146711O16261A93511c331700F006617d060093D444028
976g70808p63458D76314e71897A96978a985495K93061A58904b377853F969910
$$ plain form
1044 1083509 -4999131 -613023 -1452966 4166848 -6210850 -471103 4037992 855644 1278304
1035 1278304 -3752592 1234915 1416832 -909811 -2582038 761820 4261696 -2683585 5119681
1025 -5673674 156370 -273294 2437012 4662417 465696 -625390 -2139026 2290940 2963071
1016 2963071 -6122147 -3643068 1460602 8552466 -243121 1006834 -2277413 -633610 2661999
1006 2192315 4310804 2192265 1138286 -2431822 -1650164 -1457130 1862209 2899443 312615
996 -2233792 -3722636 -248303 -5881340 1696300 1531774 118907 -1034030 230227 -861249
986 856317 1156354 18181 2164892 2781153 193511 -3331700 6006617 -4060093 4444028
976 -770808 -1534266 476314 -571897 196978 -1985495 -1692434 158904 -2377853 6969910
966e196252C530037b198669l783857D598356A073970h7195j430935r11520A223756
956B031398e81663k062406B740419J958533c494428D210995f61940C453911j065945
947B387966b553505l093949g61221K62466b30397A130222K658575d757443G08307
937c354652B235333b176286B178466b919550J29352K54450B526770I88546e22309
927a513723k364463g24543D24299a343305e40824b46296p85219j814782b60295
917B782003G25187g78813k036936F274838d094651D006678j745273A118786a510281
907D634766k161269e124445C514848b466276F002398a324764M03362A232723d468433
897e06481B10566J610183K032258A072894a464356A457366J679081a567380A903436
$$ plain form
966 -5196252 3530037 -2198669 -5982526 4598356 1073970 -87195 -1518130 -2429650 1223756
956 2031398 -581663 -2644069 2740419 4698952 -3494428 4210995 -661940 3453911 2387966
947 2387966 -2553505 -5647454 -761221 -498755 -230397 1130222 3788797 -4757443 708307
937 -3354652 2235333 -2176286 2178466 -2919550 -2790198 -2535748 2526770 988546 -522309
927 -1513723 -3878186 -724543 424299 -1343305 -540824 -246296 -1031515 -2846297 -260295
917 2782003 725187 -778813 -2815749 6274838 -4094651 4006678 2261405 1118786 -1510281
907 4634766 2473497 -5124445 3514848 -2466276 6002398 -1324764 -921402 1232723 -4468433
897 -506481 210566 1820749 3853007 1072894 -1464356 1457366 3136447 -1567380 1903436
887b321103A145381J120993a073711A489196M519261c021145J166354B741981
878A822236a984632B036953c071987j80294J245749R93751A651233a866740D5399
868c500594B346015a383547o22976i61822A16612K137200L49450a99451k941801
859c141252F61112O955083c398858a406702k476625A730860f94570D645640e176005
849b41627l17150B265905J731432a502758A801786b64598B577704g822117B759767
839B152899E0159a162424m047408D426352A645919d29726j129879P05150B426942
829c41690J56712D380206c354708k69879E841455f809326A523043B36539L632935
820C869474d28112F48351a572583K18700A900676G03439B74159K450881L79830
$$ plain form
887 -2321103 1145381 2266374 -1073711 1489196 6008457 -3021145 -1854791 2741981
878 1822236 -1984632 2036953 -3071987 -3252281 -2006532 -1012781 1651233 -1866740 45399
868 -3500594 2346015 -1383547 -2006523 -961822 116612 2253812 2603262 -199451 -3141252
859 -3141252 661112 7616195 -3398858 -1406702 -3883327 1730860 -694570 4645640 -5176005
849 -241627 -558777 2265905 3997337 -1502758 1801786 -264598 2577704 -7822117 2759767
839 2152899 50159 -1162424 -5209832 4426352 1645919 -429726 -1559605 -854455 2426942
829 -341690 -184978 4380206 -3354708 -3624587 5841455 -6809326 1523043 236539 3869474
820 3869474 -428112 648351 -1572583 -1353883 1900676 703439 274159 2725040 3104870
811C104870A540029c93516F247963d821183B681717a266361K44583c19780k299317
802b619097d02979A147791J597364a213817l207305I66589B27854J89416H6548
792C799012c707781a191343j410851D194497d709735J603381c71114a50036j147313
783a297349K43067C99558e15106B561426c095751E02748a87200m541100l840259
774h568559D988625f1738l520227c24712A033983a002087j739564C602907A08156
764C413264f243936c67915o45393A010271a74753B63640a84598p28519C535267
754b389569k344403C451857J721282F8403g01610D054790b339253A659096c947300
744b84209A536791a256766B471805d49239j3439k574905Q49350O32063C79792
$$ plain form
811 3104870 1540029 -393516 6247963 -4821183 2681717 -1266361 -1021778 -319780 -2619097
802 -2619097 -402979 1147791 2745155 -1213817 -4421122 966589 227854 417270 86548
792 3799012 -3707781 -1191343 -2602194 4194497 -4709735 -3106354 -371114 -150036 -1297349
783 -1297349 -1054282 399558 -515106 2561426 -3095751 502748 -187200 -4728300 -8568559
774 -8568559 4988625 -61738 -3581965 -324712 1033983 -1002087 -2741651 3602907 108156
764 3413264 -6243936 -367915 -1013308 1010271 -174753 263640 -184598 -913117 3535267
754 -2389569 -4733972 3451857 5173139 68403 -701610 4054790 -2339253 1659096 -3947300
744 -284209 1536791 -1256766 2471805 -449239 -462678 -3037583 -2188233 -1556170 379792
734a03599j80044E316330c360571q58380A624704D51548K002000a222396A593521
724c92465l048240J229060A023715K932661a895107B664678c341177p23099C788796
714b177969e73696p248650I05520J923779O45455f956763b323326G163495a072187
704A895454Q859124R169605G010024A143905b846122l6364310N533563a2090879
695H15330d683043A6511378n205100L4162050A7162665j020342L167929c4708086
686e8764768b8954512O869693K639805A5708135L537600E881641G83663N414710
678F198373a028316E07251a252821e54205C009488d870914o110868C35501e15014
668A861760b222523Q86348j596885J261105n014756q082803m92390B5015185M144731
$$ plain form
734 -103599 -283643 5316330 -3360571 -4218951 1624704 451548 2453548 -1222396 1593521
724 -392465 -3440705 -2211645 1023715 3956376 -1895107 2664678 -3341177 -4064276 3788796
714 -2177969 -573696 -7822346 905520 2829299 3474754 -6956763 -2323326 7163495 -1072187
704 1895454 10754578 19924183 7010024 1143905 -2846122 -39210432 -33676869 -12090879
695 815330 -4683043 16511378 11306278 45468328 17162665 16142323 19310252 -34708086
686 -58764768 -28954512 -22084819 -19445014 15708135 19245735 5881641 783663 6198373
678 6198373 -1028316 507251 -1252821 -554205 3009488 -4870914 -10981782 335501 -515014
668 1861760 -2222523 -1336175 -2933060 -1671955 -6686711 -14769514 -15261904 25015185 29159916
659B9159916K182459j3062121c240415A9029423a6452774k97158j4490534q480288
651c9720754a2323619H010194L667038R94265Q910965A843458J9287741A0429930
642c931561l729066j3881128i88488D58848a928008e77344o45468G166692b687030
632b532607f01568m80813D119740c92842m228160A756630a485955M68448A145554
622A891963a907510B363887H54552b815620j057962k172346A905551d049388C072201
612e595263K245551r027889l634943k0853118J5070891C70408871A37910484A5317033
603c54219110f929472j464125J068326a850005j183386j781040A303577E71357
594a162699N27350B83438O30762e661106b17415I63280M186472e310348A833476
$$ plain form
659 29159916 31342375 18280254 -3240415 19029423 -16452774 -16749932 -31240466 -39720754
651 -39720754 -12323619 8010194 11677232 12671497 21582462 1843458 21131199 10429930
642 -3931561 -7660627 -21541755 -988488 458848 -1928008 -577344 -1222812 7166692 -2687030
632 -2532607 -601568 -1082381 4119740 -392842 -4621002 1756630 -1485955 -1017507 1145554
622 1891963 -1907510 2363887 854552 -2815620 -3873582 -6045928 1905551 -4049388 3072201
612 -5595263 -3349712 -12377601 -16012544 -36865662 -21794771 370408871 137910484 15317033
603 -354219110 -6929472 -8393597 -7325271 -1850005 -3033391 -4814431 1303577 571357
594 -1162699 -635349 283438 914200 -5661106 -217415 963280 5149752 -5310348 1833476
584A368489K759251A299932m60906b522959N35753F497994A35881R11689g22395
574c905235A723017b164733A447565L14557e247277D407537B57580K516613i98845
564D089597c946066H1682L986726d100145R28958A226771e756808B309159q34931
555A474228P40395a251000k486238E768347c956984l98753h13627A274368J758909
546C033277c659417E51946c863412A25896M74870L416351b458910J157598d05021
536E534361j097158B079493a690351e60788j619189A236875a095992C173091h14118
526b713296C025558A079425a882464G59902O45679g42727k533187G021848B694755
516b910763C854391A17864d716021E2559J251823K554236G74526K021564J114147
$$ plain form
584 1368489 4127740 1299932 839026 -2522959 -1987206 6497994 135881 1047570 -722395
574 -3905235 1723017 -2164733 1447565 1762122 -5247277 4407537 257580 2774193 -998845
564 4089597 -3946066 81682 4068408 -4100145 -3171187 1226771 -5756808 2309159 1474228
555 1474228 2214623 -1251000 -3737238 5768347 -3956984 -4355737 -813627 1274368 3033277
546 3033277 -3659417 551946 -3863412 125896 600766 4017117 -2458910 -1301312 -405021
536 5534361 4437203 2079493 -1690351 -560788 -2179977 1236875 -1095992 3173091 -814118
526 -2713296 3025558 1079425 -1882464 759902 1405581 -742727 -3275914 7021848 2694755
516 -2910763 3854391 117864 -4716021 52559 1304382 3858618 774526 2796090 3910237
507C910237f544856b01221o47707E99230k40830I744J856252m88255c891318a12238
496C497093c770960a9447l230996B873107c735376c37956j430448j84569B178161
486C908955d621326A160549J845414a110678A353506b667036I13105a619753C152907
476I26744a550622k981970K103785A906115b431956O00444B672087a579367A680057
466B970981b786930N24153N78682a58816B814847d662133C823308h31536I35755
456C878436a697713k579832E341657a14564l575167J740810B009045b731911A267629
446A23515e73721l3095D524165B90856L28952K289625d98849H23823g422102A928229
435c977895Q45780a133130B000163H64254a728731H3445L983297r42972F32429
$$ plain form
507 3910237 -6544856 -201221 -848928 599230 358400 9744 1865996 1377741 -3891318 -112238
496 3497093 -3770960 -19447 -3250443 2873107 -3735376 -337956 -1768404 -1952973 2178161
486 3908955 -4621326 1160549 3005963 -1110678 1353506 -2667036 913105 -1619753 3152907
476 926744 -1550622 -4532592 -2428807 1906115 -2431956 -1831512 2672087 -1579367 1680057
466 2970981 -2786930 -2262777 -1684095 -158816 2814847 -4662133 3823308 -831536 935755
456 3878436 -1697713 -4277545 5341657 -114564 -3689731 -1948921 2009045 -2731911 1267629
446 123515 -573721 -606816 4524165 290856 619808 2909433 -498849 823823 -7422102 1928229
435 -3977895 -3132115 -1133130 2000163 864254 -1728731 83445 4066742 3123770 632429
425A290168c38726F895f01681D5335L477943A448119B23347L070637J829681b987218
414b467175J215813A697354P86738b048116n06264O23956F328824a642891B02032
404g00032A357449K676570g101734a002839B519112b840106a192712C039672D45057
394E074326I56809K591189f191693B869942d25064A603359D86078b190477A015563
384B80581a068969B19574i21446A621764J916116e987814F993244a118644C20805
374c37743j490508j487557A494623Q51004g396202F488869h73323D78359J593240
365B071599b720786H61403J024701a812041k93225G30431b169657A891653e377073
355d225442a335847B783320Q60695b972426J042947I28108N01289e407102F313486
$$ plain form
425 1290168 -338726 6895 -601681 45335 3523278 1448119 223347 3293984 5123665 -2987218
414 -2467175 -1251362 1697354 2484092 -2048116 -2554380 -1930424 6328824 -1642891 202032
404 -700032 1357449 4034019 -7101734 -1002839 2519112 -2840106 -1192712 3039672 445057
394 5074326 956809 3547998 -6191693 2869942 -425064 1603359 486078 -2190477 1015563
384 280581 -1068969 219574 -921446 1621764 3537880 -5987814 6993244 -1118644 320805
374 -337743 -1828251 -3315808 1494623 2345627 -7396202 6488869 -873323 478359 2071599
365 2071599 -2720786 861403 1886104 -1812041 -2105266 730431 -2169657 1891653 -5377073
355 -4225442 -1335847 2783320 3644015 -2972426 -1929479 928108 1429397 -5407102 6313486
345f758430G74318K940741c464618j132792C811110a518868j984002c20825B216368
335B745845c603475k512054b38512B089645c696967B930487J836798d254465a85903
325d26573D562578F54303f431617d57737B547150g018254A774633c771362A452014
315B089878d428136C599486c46635C250174a224170l71813F82507b017980C481935
305H71875N99559b41250q35660F145009a414053C283946h42284B267278e375504
295H001200A386732a035180j617057F188248b218285a075949A745029g7608j841206
286a918814j67811D910903a149547B590999g47049k551815A494019a025263k01316
277a226579B062287b953290C762558a410852B983680f638485b543976A658441
$$ plain form
345 -6758430 774318 3715059 -3464618 -4597410 3811110 -1518868 -3502870 -320825 2216368
335 2745845 -3603475 -6115529 -238512 2089645 -3696967 2930487 4767285 -4254465 -185903
325 -426573 4562578 654303 -6431617 -457737 2547150 -7018254 1774633 -3771362 1452014
315 2089878 -4428136 3599486 -346635 3250174 -1224170 -1595983 682507 -2017980 3481935
305 871875 1471434 -241250 -1076910 6145009 -1414053 3283946 -842284 2267278 -5375504
295 8001200 1386732 -1035180 -2652237 6188248 -2218285 -1075949 1745029 -77608 -1918814
286 -1918814 -2086625 4910903 -1149547 2590999 -747049 -3298864 1494019 -1025263 -1226579
277 -1226579 2062287 -2953290 3762558 -1410852 2983680 -6638485 -2543976 1658441
268B76620J209860L312512k253542a430493D88754a204172E176120G6314b721293
258A377495d253709C53995K789950A53271f55745j295606A758890j04328e97835
248d275615a152439a8788l047218F198801c444482a63874C158940B97751h54734
238B482057e95326A129898b559366A59700A8770M639043e493312a413189b52552
228b854092E078904c739218a424778b39930A180432b534892g86286A232589K55992
219A488581L227223a480531j198086d3484A153153N64208E96626J470599A28451
209I62011J8500b052565d69505p631776B235579E35651K632035A541042c750784
199C804452a144030B864012A71581Q42848D53338J77545b73076e8671p32046b12631
$$ plain form
268 276620 1486480 4798992 2545450 -1430493 488754 -1204172 5176120 76314 -2721293
258 1377495 -4253709 353995 3143945 153271 -655745 -1951351 1758890 1654562 -597835
248 -4275615 -1152439 -18788 -3066006 6198801 -3444482 -163874 3158940 297751 -854734
238 2482057 -595326 1129898 -2559366 159700 18770 4657813 -5493312 -1413189 -252552
228 -2854092 5078904 -3739218 -1424778 -239930 1180432 -2534892 -786286 1232589 1488581
219 1488581 4715804 -1480531 -2678617 -43484 1153153 1717361 596626 2067225 128451
209 962011 980511 -2052565 -469505 -8101281 2235579 535651 3167686 1541042 -3750784
199 3804452 -1144030 2864012 171581 1014429 453338 630883 -273076 -58671 -790717 -212631
188B016675d85790A741459l11575L431480D20963P571a481511E05505c382409
178D697820A755836D59857b725975D561616o62219L749391J9146863Q4758515
170A11554166j7413584a28930351N855710r5559115d0331255o4142610A16727377
162A12799472R5409783b7451830K786669f181884J109081g06346l886586B691134
153b460690A05989c988281A035866f41474j245382F883a742228e31836A684448
143D362270a301379c80895j049961B006982b229872B252630A017614a07228A550805
133d88663D384616d701485o28207C295809h45856B578780d268867M40808J299483
124b528576c06193B6794L371595c126770b95784A354471f33362m16865A423728
$$ plain form
188 2016675 -485790 1741459 1429884 4861364 420963 428534 -1481511 505505 -3382409
178 4697820 1755836 459857 -2725975 4561616 3899397 7648788 26795651 111554166
170 111554166 94140582 -128930351 -123074641 -218633756 -40331255 -104473865 116727377
162 112799472 208209255 -27451830 -24665161 -6181884 -5072803 -706346 -4592932 2691134
153 -2460690 105989 -3988281 1035866 -641474 -1886856 6883 -1742228 -531836 1684448
143 4362270 -1301379 -380895 -1430856 2006982 -2229872 2252630 1017614 -107228 1550805
133 -488663 4384616 -4701485 -5329692 3295809 -845856 2578780 -4268867 -3828059 -2528576
124 -2528576 -306193 26794 3398389 -3126770 -295784 1354471 -633362 -1050227 1423728
114d80789B2695L090366f213354B804496c55837G178595g343564g23381A075635
104c979569B385854b342158a091730E43876d165332k852787K792563j49517J278568
95c096505g01001n009314a98978j659805j017623A486115P430864i12706J06749
86h05957F71569f47047A792578k00547E32536N80319d013143c41463C498085f510406
75h6227j231980A513065p41638J302853b659565a014822B234064K485920a296628
65C319860b781420I79942K30398C04863e90084A228698i46358p58992A397696
55A993841e422161B5484L304330F54383b723866o13028E432559e78952A706159
45f312401F765074A632274B38426c135959A476087i42112k420567g18510A736554
$$ plain form
114 -480789 22695 3113061 -6213354 2804496 -355837 7178595 -7343564 -723381 1075635
104 -3979569 2385854 -2342158 -1091730 543876 -4165332 -7018119 -4225556 -4375073 -3096505
95 -3096505 -701001 -5710315 -198978 -1858783 -2876406 1486115 8916979 -912706 -805957
86 -805957 671569 -647047 1792578 1592031 532536 1112855 -4013143 -341463 3498085 -6510406
75 -86227 -1318207 1513065 771427 2074280 -2659565 -1014822 2234064 4719984 -1296628
65 3319860 -2781420 979942 1210340 304863 -590084 1228698 -946358 -1705350 1397696
55 1993841 -5422161 25484 3329814 654383 -2723866 -3336894 5432559 -578952 1706159
45 -6312401 6765074 1632274 238426 -3135959 1476087 -942112 -3362679 -718510 1736554
35a678319a44520j816638B406460O33811N01295D94199a893633F35476b161833
25I66113L762103c324830c30835n95400A929087D14618c507996F75382c994534
15d612513A888841c127105B405481G56899a217208B965035c260373C77581f49563
5C484365a599365I40348J449098E51451c07994
$$ plain form
35 -1678319 -144520 -1961158 2406460 3040271 3541566 494199 -1893633 635476 -2161833
25 966113 4728216 -3324830 -330835 -926235 1929087 414618 -3507996 675382 -3994534
15 -4612513 1888841 -3127105 2405481 756899 -1217208 2965035 -3260373 377581 -649563
5 3484365 -1599365 940348 2389446 551451 -307994
##PAGE= F1=5618.780329767
##FIRST=     21204.543296753, 2644.21089616403, -3674390
##DATA TABLE= (F2++(Y..Y)), PROFILE
2047c674390A746994a467015o57965E56804b180571B300562L36019i84557G034304
2037d913144e8827n421031G03706g99943B277185N06600f27368A583440d72508
2027d61279o94230A695555L8170d4388A616827K209921J43377b451740a116108
2017A928913N73532G00159J067129g17258n97978A271896m80949J246722c250478
2007D19756h68715p74146N78621B416620a334005k520183D81292Q04091c905073
1997D664505b693592k376463K222439k660258a658661C996608J932991d47925
1988D482913F41477m1314b242981N17406A807571B58318b700835a334294I19484
1978h46452L4725l76142k201349A758672l97568b23982D249440g649863A307734
$$ plain form
2047 -3674390 1746994 -1467015 -2124980 556804 -2180571 2300562 2636581 -984557 7034304
2037 -4913144 -58827 -5479858 703706 -799943 2277185 2783785 -627368 1583440 -472508
2027 -461279 -1155509 1695555 1733725 -44388 1616827 3826748 3970125 -2451740 -1116108
2017 1928913 2502445 700159 1767288 -717258 -1315236 1271896 790947 2037669 -3250478
2007 419756 -868715 -1642861 -1064240 2416620 -1334005 -3854188 481292 1285383 -3905073
1997 4664505 -2693592 -5070055 -2847616 -5507874 -1658661 3996608 5929599 -447925
1988 4482913 641477 600163 -2242981 -1725575 1807571 258318 -2700835 -1334294 919484
1978 -846452 -811727 -1187869 -3389218 1758672 1361104 -223982 4249440 -7649863 1307734
1968A159068b880287B108841a850671a09708k94650p1761j503210E567159A404864
1958b662123K75972A542495e458712I09835a393674D57583a464343C51789j12064
1949B39725q1875K339482n06223P01792g27173B486198A079977f62153l184165
1940c846318B782552b048946j330881C300706e367462a88284G24711L232644b976963
1930C80006K886485R89944d224966D561296a221810C382922c86996j985388B836960
1920e23578C069531G67527i96064j869787C673753b487354A198789K716327B64589
1910A40369h99180l78628l32353k53404C074439a007469k64721r90908D122038
1900c247875B227411L086782G2868d32156l236321A133457a336563e67830A387516
$$ plain form
1968 1159068 -2880287 2108841 -1850671 -109708 -404358 -476119 -1979329 5567159 1404864
1958 -2662123 -2386151 1542495 -5458712 909835 -1393674 457583 -1464343 351789 239725
1949 239725 157850 2497332 1991109 2692901 -727173 2486198 1079977 -662153 -3846318
1940 -3846318 2782552 -2048946 -3379827 3300706 -5367462 -188284 724711 3957355 -2976963
1930 380006 3266491 4256435 -4224966 4561296 -1221810 3382922 -386996 -2372384 2836960
1920 -523578 3069531 767527 -996064 -2865851 3673753 -2487354 1198789 3915116 264589
1910 140369 -899180 -1277808 -1610161 -1863565 3074439 -1007469 -1272190 -2263098 4122038
1900 -3247875 2227411 5314193 72868 -432156 -3668477 1133457 -1336563 -567830 1387516
1890A070094c649283g35987K70877D765516F01859d6238H38380c027398j012370
1881d039768k162997c61262A703039A22821J572934a022703C33685J010783a636933
1871b740646D82530N41008d819955C284496b764347A116148L54246g22908C398451
1861c981992G313924a723115A717307F63619A43273J589664h230069b084075B54897
1851D089095b45117m608979B333765R31220b611481J68648B199130R01994b958437
1841B952581g69100j457228a03573B603411M786169h348423E72084a956580A410150
1831a688457K69499C026208A147040B81695c645354a325847i357I74196a567603
1821D805726A10385c912724C162058b379182k844238h29006m137105a100833B510685
$$ plain form
1890 1070094 -3649283 -735987 -465110 4765516 601859 -46238 838380 -3027398 -4039768
1881 -4039768 -6202765 -361262 1703039 122821 1695755 -1022703 333685 1344468 -1636933
1871 -2740646 482530 1023538 -4819955 3284496 -2764347 1116148 1470394 -722908 3398451
1861 -3981992 7313924 -1723115 1717307 663619 143273 1732937 -8230069 -2084075 254897
1851 4089095 -245117 -4854096 2333765 3264985 -2611481 -2442833 2199130 3101124 -2958437
1841 2952581 -769100 -2226328 -103573 2603411 7389580 -8348423 572084 -1956580 1410150
1831 -1688457 -1418958 3026208 1147040 281695 -3645354 -1325847 -9357 974196 -1567603
1821 4805726 110385 -3912724 3162058 -2379182 -5223420 -829006 -4966111 -1100833 2510685
1811A663566l90167a307244L96068D909487A924383l3487b94164k072689A14783
1801a402703D144345g340930A618510c974421B370239r69910a948385m32551F647102
1791b735347E956760E16453L269072f008273B392332d67247p65021B447457g06637
1781g66850j191967B697662c67007B510767a669216B540376j111255c673891J303082
1772b370809Q764G954170a885132n788714H71723C96126J31994J821551l00348
1763B049323d855201A384561a488576A229083a511524E463088a606382A525214
1754c08180C650053a547515k589518e31169k90236A206683K084064e772672b820033
1744A073321J627082h20712q62486I64521j85359e367752A468089c321037H67288
$$ plain form
1811 1663566 1273399 -1307244 -911176 4909487 1924383 1890896 -294164 -2366853 114783
1801 -1402703 4144345 -7340930 1618510 -3974421 2370239 1400329 -1948385 -2380936 6647102
1791 -2735347 5956760 516453 3785525 -6008273 2392332 -467247 -1232268 2447457 -706637
1781 -766850 -1958817 2697662 -367007 2510767 -1669216 2540376 1429121 -3673891 -2370809
1772 -2370809 -2362045 7954170 -1885132 -7673846 871723 396126 528120 2349671 2049323
1763 2049323 -4855201 1384561 -1488576 1229083 -1511524 5463088 -1606382 1525214
1754 -308180 3650053 -1547515 -4137033 -531169 -821405 1206683 3290747 -5772672 -2820033
1744 1073321 2700403 -820712 -1683198 964521 779162 -5367752 1468089 -3321037 867288
1734a244037J07086l66424B521052h54416j0343A411068h252358C307941a267736
1724a163235G73530c022473I54397a119548A026451d22605j329315f4745A033123
1714a107399G068208k934958d362575G56479e16783j640477A211113b7250B652112
1704A014407L40723F07146K093399C62155O77619c470882B065775a820932j005268
1695b826200G13293b141712D73258J11799a489802n6370m720424B041729K093630
1686D135359b94868j951748C273886a124955C31731b016628I76041K997739e151176
1676A772039Q42605J8663e060683a310173N95101G72611l37308K028494f355379
1666b126531E117910B94813N064567I0818g522828A832810a518138B169806f00149
$$ plain form
1734 -1244037 -1136951 -1503375 2521052 -854416 -864759 1411068 -8252358 3307941 -1267736
1724 -1163235 773530 -3022473 954397 -1119548 1026451 -422605 -1751920 -64745 1033123
1714 -1107399 7068208 4133250 -4362575 756479 -516783 -2157260 1211113 -27250 2652112
1704 1014407 1355130 607146 2700545 362155 1039774 -3470882 2065775 -1820932 -2826200
1695 -2826200 713293 -2141712 473258 585057 -1489802 -1546172 -6266596 2041729 4135359
1686 4135359 -294868 -2246616 3273886 -1124955 331731 -2016628 976041 3973780 -5151176
1676 1772039 2614644 2633307 -5060683 -1310173 -715072 772611 435303 2463797 -6355379
1666 -2126531 5117910 294813 5359380 90818 -7522828 1832810 -1518138 2169806 -600149
1656C58472a591898k674724g40876I36920b789752D061569b340946j703084H170911
1646F82238b771188j257560B414503b244275j894370B837266b368439C644099
1637C06096K321885O01962a366201d06254B141378J030256a44711B260028b32990
1627d187200E2024Q144228c425270A86119b0948A700724f079513E12352D3278
1617b501432n03514H28442b261660g77287K23257I853b898588B135237F71016
1607A829793E50945L559852a989216G401495e816462f96731l40425B158228d62370
1597B937884b509993C542213b613704e17532A016359a945790a87398k24735a70347
1587E5669e46923B218970b693485a147658k750953B868550B39502b457195e34919
$$ plain form
1656 358472 -1591898 -4266622 -740876 936920 -2789752 4061569 -2340946 -4044030 8170911
1646 682238 -2771188 -4028748 2414503 -2244275 -4138645 2837266 -2368439 3644099
1637 306096 2627981 3229943 -1366201 -406254 2141378 3171634 -144711 2260028 -232990
1627 -4187200 52024 8196252 -3425270 186119 -20948 1700724 -6079513 512352 43278
1617 -2501432 -3004946 828442 -2261660 -777287 -554030 9853 -2898588 2135237 671016
1607 1829793 550945 4110797 -1989216 7401495 -5816462 -696731 -1037156 2158228 -462370
1597 2937884 -2509993 3542213 -2613704 -517532 1016359 -1945790 -187398 -412133 -170347
1587 55669 -546923 2218970 -2693485 -1147658 -3898611 2868550 239502 -2457195 -534919
1577G20596a046283n996731B306041a395384G176772B99797P59919b839489j20729
1568b960218A994609d877943C193244b333589m65983j285873a661554f03791C252413
1558b151500O28062L13831C770622D53767a851778d06337E974532h86990A103408
1548A165965f21927B086709f75977a4815F92370b120623D209910A882889h00096
1538B975738b038672h04381o1417k251518J211368B559764h81382k985988H56039
1528C82969L323279A555068c500647A191521L701715i70338B509147d509145E582163
1518d961254H762991g72671b589m537171A050102m5772e746368e5951C3720K214560
1508B248280c7390A395253J685170K545641H80100a657526b52522A427803J438406
$$ plain form
1577 720596 -1046283 -7043014 2306041 -1395384 7176772 299797 1059716 -2839489 -2960218
1568 -2960218 1994609 -4877943 3193244 -2333589 -2799572 -4085445 -1661554 -603791 3252413
1558 -2151500 -1523438 -1209607 3770622 453767 -1851778 -406337 5974532 -886990 1103408
1548 1165965 -621927 2086709 -675977 -14815 692370 -2120623 4209910 1882889 -800096
1538 2975738 -2038672 -804381 -865798 -3117316 -1905948 2559764 -881382 -3867370 856039
1528 382969 3706248 1555068 -3500647 1191521 4893236 -970338 2509147 -4509145 5582163
1518 -4961254 8762991 -772671 -2589 -4539760 1050102 1004330 -5746368 -55951 33720 2248280
1508 2248280 -37390 1395253 3080423 5626064 880100 -1657526 -252522 1427803 2866209
1499B866209K556884c58878A1310754d486083B013488c666733H64552J376075
1491B240627b064625B362685b839632f43306m029482G21640c490793H663970B341663
1481c02457q43582k45512e23312l882433H02704d316421C528494a434159l708495
1472e142654C243962g056568a927956M03202D18748a612327A227610a335016B049551
1462C116001e912041a168868B64193e79830B557221a620512e5952m071121A197377
1452i01620A430141g28914E05641a183661b08308l575253B78323L044704A520564
1442c638860B78191K153131c929993j592935E015003a077453I12567p9143L153155
1433C986579a552526E169384b268282B00831g01139b60566A154805K120381b688807
$$ plain form
1499 2866209 5423093 -358878 11310754 -4486083 2013488 -3666733 864552 2240627
1491 2240627 -2064625 2362685 -2839632 -643306 -4672788 721640 -3490793 8663970 2341663
1481 -302457 -1146039 -1391551 -523312 -4405745 802704 -4316421 3528494 -1434159 -5142654
1472 -5142654 3243962 -7056568 -1927956 -1524754 418748 -1612327 1227610 -1335016 2049551
1462 3116001 -5912041 -1168868 264193 -579830 2557221 -1620512 -55952 -4127073 1197377
1452 -901620 1430141 -728914 505641 -1183661 -208308 -3783561 278323 3323027 1520564
1442 -3638860 278191 2431322 -3929993 -5522928 5015003 -1077453 912567 833424 3986579
1433 3986579 -1552526 5169384 -2268282 200831 -701139 -260566 1154805 3275186 -2688807
1423d329758D133794c596468C236560c811701F65881O51967f07700D76510g8389
1413C050994A141861K702128e34887e3163C00177a873137k292980C624443b773768
1403c613713e51105C092745d231646E224596k461897B22687d533984E637086k547173
1394C089913G56929e38641A071173d63346A86578d54634A486065a723659j859256
1385c582915F030025b905372A610543N12040b398551L38001A751857j04285O11306
1376B258878a14288F85330J183620c260628B755789b983125C518998L173Q81181
1367D403352c032732h69095E188035j384487b907841c38241j734430O58792j046942
1358b460821e31164B274246a116111B393518d402368C7497e33464B468590b190556
$$ plain form
1423 -4329758 4133794 -3596468 3236560 -3811701 665881 1317848 -607700 476510 -78389
1413 3050994 1141861 3843989 -534887 -53163 300177 -1873137 -4166117 3624443 -2773768
1403 -3613713 -551105 3092745 -4231646 5224596 2762699 222687 -4533984 5637086 3089913
1394 3089913 756929 -538641 1071173 -463346 186578 -454634 1486065 -1723659 -3582915
1385 -3582915 6030025 -2905372 1610543 2122583 -2398551 -2060550 1751857 1647572 2258878
1376 2258878 -114288 685330 1868950 -3260628 2755789 -2983125 3518998 3522171 4403352
1367 4403352 -3032732 -869095 5188035 3803548 -2907841 -338241 -2072671 -1413879 -2460821
1358 -2460821 -531164 2274246 -1116111 2393518 -4402368 37497 -533464 2468590 -2190556
1348F220202d287286a213544F2552K209317a8154n024609D980962c878131g07075
1338B580494F36747c184152E286381b765539j87162l789995A099619L914753a254078
1328D263560A915204P31396b374586I73895b529173a064787A701115K262065c081324
1318C603c61227D149879a907086j34404L74097H37607j67620a049804k567551
1309c617355C396955a226404A833398b261882A871397K419940g598005C013819
1300D212384A830254b271659J133936A638520d154792B874412A027521d228216
1291A231144a091834C552105c367716E73150d93266l042666A440038J379082n2662
1282B766458b513855C555481b554145N91435o20062g75240F55711b788627D232639
$$ plain form
1348 6220202 -4287286 -1213544 62552 2271869 -18154 -5042763 4980962 -3878131 -707075
1338 2580494 636747 -3184152 5286381 -2765539 -2952701 -6742696 1099619 5014372 -1254078
1328 4263560 1915204 2646600 -2374586 973895 -2529173 -1064787 1701115 3963180 -3081324
1318 3603 -361227 4149879 -1907086 -2041490 -1667393 837607 669987 -1049804 -3617355
1309 -3617355 3396955 -1226404 1833398 -2261882 1871397 4291337 -7598005 3013819
1300 4212384 1830254 -2271659 -1137723 1638520 -4154792 2874412 1027521 -4228216
1291 1231144 -1091834 3552105 -3367716 573150 -493266 -3535932 1440038 2819120 2766458
1282 2766458 -2513855 3555481 -2554145 -1962710 -2582772 -775240 655711 -2788627 4232639
1272H16204c604187E124058h109244D995429d969120a037525B409051A24601J012862
1263A137463b777790A315026a546693j785130M19273F701013C2281L573844l26889
1254C279236B75121J179203b91208D959620B463514d67895p453588F372196c773482
1244a614369F974171a056293B56879c234085j215054B707065P31201d793538B599843
1234c38096A79382c932611B748542d310224c53677e1479j514914D458176A96682
1224c069553C51196Q750818f94333m63148B85642n0234c088278B277409k06599
1215B070810a624351k22894P68215B583522d56062C40265f76667B59327g86708
1205C07245K491917A146980O148C67183d290740A066038a809794A65028d04935
$$ plain form
1272 816204 -3604187 5124058 -8109244 4995429 -4969120 -1037525 2409051 124601 1137463
1263 1137463 -2777790 1315026 -1546693 -3331823 -2912550 6701013 32281 3606125 3279236
1254 3279236 275121 1454324 -291208 4959620 2463514 -467895 -7921483 6372196 -3773482
1244 -1614369 6974171 -1056293 256879 -3234085 -4449139 2707065 3438266 -4793538 2599843
1234 -338096 179382 -3932611 2748542 -4310224 -353677 -51479 -1566393 4458176 196682
1224 -3069553 351196 9102014 -694333 -1157481 285642 235408 -3088278 2277409 2070810
1215 2070810 -1624351 -1847245 -1079030 2583522 -456062 340265 -676667 259327 -786708
1205 307245 2799162 1146980 1153128 367183 -4290740 1066038 -1809794 165028 -404935
1195A467741J026425Q9540a181861j926244h35098j713940k083923C321940J046287
1186D368227d091818B971398j167612b929850a038561M62559A751653c679470
1177A0006939C56538b224649A585913b345032A25050J351066l43346K387964c852528
1167D69864K200123K656347c227321D91075R88826L438891c949761B133816G52903
1157B131338c952353A819630H20114K541865j159144R56061j575105b212929A179687
1147a795929N40204B333095a747372F885826b618487E402725c634186a65769E17024
1137a015152A519091O27984i20027B182693F28095l3592b915459A737853K362090
1128D099943c018889b28431D897114b000716c62749B820430b799921B806390a817435
$$ plain form
1195 1467741 2494166 2583706 -1181861 -3108105 -835098 -2549038 -4632961 3321940 4368227
1186 4368227 -4091818 2971398 1803786 -2929850 -1038561 -576002 1751653 -3679470
1177 10006939 356538 -2224649 1585913 -2345032 125050 1476116 1132770 3520734 -3852528
1167 469864 2669987 5326334 -3227321 491075 1479901 4918792 -3949761 2133816 752903
1157 2131338 -3952353 1819630 820114 3361979 2202835 3158896 1583791 -2212929 1179687
1147 -1795929 -1255725 2333095 -1747372 6885826 -2618487 5402725 -3634186 -165769 517024
1137 -1015152 1519091 2147075 -920027 2182693 628095 594503 -2915459 1737853 4099943
1128 4099943 -3018889 -228431 4897114 -2000716 -362749 2820430 -2799921 2806390 -1817435
1118F85144L082586d737841d70771J75711j04631p85682A314570f903087C68486
1108a162780B435844a186437l20387A821264D7249b437003F283123g90582K09549
1099e81033P2276B126284a443316C589166a924260g74246o711361a70917C774743
1089b104654B449250r31458J364324c783149B910691n35258c30263k281404B970667
1079B638982J146976d207655a866635C078509d017877J476494D720803c553307
1070D09133J602016d619797H37014M458573j923239d103063K17508g97935G39673
1060a665994j759097b14179p95175A411174c57664k71213j088602F167006A69767
1050H73252L471777a101074R7151B469079G66442M89322c970633F25272c218112
$$ plain form
1118 685144 3767730 -4737841 -470771 -295060 -399691 -1185373 1314570 -6903087 368486
1108 -1162780 2435844 -1186437 -1506824 1821264 47249 -2437003 6283123 -790582 -581033
1099 -581033 -508757 2126284 -1443316 3589166 -1924260 -774246 -7485607 -170917 3774743
1089 -2104654 2449250 1517792 2882116 -3783149 2910691 2375433 -330263 -2611667 2970667
1079 2638982 3785958 -4207655 -1866635 3078509 -4017877 -2541383 4720803 -3553307
1070 409133 2011149 -4619797 837014 5295587 3372348 -4103063 -3885555 -797935 739673
1060 -1665994 -3425091 -214179 -1009354 1411174 -357664 -628877 -1717479 6167006 169767
1050 873252 4345029 -1101074 -1003923 2469079 766442 1255764 -3970633 625272 -3218112
1040D462223e403666c18789D327205A047971B25946c689129A534489J67518a036552
1030b765774A042821K911450b506536C970090e664638F1121b47773B306698K158083
1021D464781a85891j071834L01713B304200O95539f273788J959152I76932P674180
1012H651112A2343J484541b011341e30357B594369o55511K096827A891447k16514
1003A674933b702368R39053K14901B445250M43745b60747k796711O14260i24683
993f058472A501583k31395I9943a629755b45290m98024A090833j94405b06139
983B522431l57693B69755b832722E759523c601543C982860g84011p58153F13046
973g42286d1426k060998N58919D35536b374549F359328f081057C949796b699682
$$ plain form
1040 4462223 -5403666 -318789 4327205 1047971 225946 -3689129 1534489 1702007 -1036552
1030 -2765774 1042821 3954271 -2506536 3970090 -5664638 61121 -247773 2306698 4464781
1021 4464781 -185891 -1257725 -956012 2304200 2999739 -6273788 -4314636 976932 8651112
1012 8651112 12343 1496884 -2011341 -530357 2594369 1938858 4035685 1891447 1674933
1003 1674933 -2702368 -1763315 -1548414 2445250 2888995 -260747 -3057458 -2443198 -924683
993 -6058472 1501583 1270188 99943 -1629755 -245290 -743314 1090833 896428 -206139
983 2522431 2164738 269755 -2832722 5759523 -3601543 3982860 -784011 -1542164 613046
973 -742286 -41426 -2102424 -1543505 435536 -2374549 6359328 -6081057 3949796 -2699682
963f095037E162342F79174C28160a841083j432278A054249R20898a061561m61876
954a523437B743283K582612b531327C402698c56612C980318j845760b807998k530448
945e338446C51450i34070b20080A658517K390869e118452A42037c062171B206327
935b678035B526469b589219m37322m05014B987020E91358e80670j012943r50607
926b544220h51679a56286j453721b00615Q6801k426544M21747e21014B895764
916I519d91302j684464F097379d248739C204730j243725l39041b251842E085552
906C880560e507164C105446c886539G271051a556503g51854E90221d398283a323530
896H23480J368873J957322A269194a883569A544093J437480a168430A899722b427023
$$ plain form
963 -6095037 5162342 679174 328160 -1841083 -3273361 1054249 1975147 -1061561 -1523437
954 -1523437 2743283 5325895 -2531327 3402698 -356612 3980318 2134558 -2807998 -5338446
945 -5338446 351450 -934070 -220080 1658517 4049386 -5118452 142037 -3062171 2206327
935 -2678035 2526469 -2589219 -3026541 -3431555 2987020 591358 -580670 -1593613 -2544220
926 -2544220 -851679 -156286 -1610007 -200615 -113814 -2540358 -2118611 -521014 2895764
916 9519 -491302 -2175766 6097379 -4248739 3204730 1961005 1621964 -2251842 5085552
906 3880560 -5507164 3105446 -3886539 7271051 -1556503 -751854 590221 -4398283 -1323530
896 823480 2192353 4149675 1269194 -1883569 1544093 2981573 -1168430 1899722 -2427023
886A357134O96543g03610A531048M778294b970282R16552B075323j029669a876482
876A445007b194093q16692P89514a012384A671201c207728A19623c216845A915403
866f12670p72044O58604c62762A905760L96917C93970b770011C16536N533264
857E849800d409059a125703k936408A519272a165761D892601e959622F77506a463883
847B237261K745445a534231A691562D88253K000372h201284B159751L55553b26351
837h51690l643085C919846j927377f02732j255154B82579J403508D5516g47832
827C882598d076853m68381F339791f884101B096323g67051D761033a95661A091290
817a379630p02921B606894G11774M53588J677722Q76749A450262C38447N338569
$$ plain form
886 1357134 2053677 -703610 1531048 6309342 -2970282 -2053730 2075323 1045654 -1876482
876 1445007 -2194093 -3010785 -2221271 -1012384 1671201 -3207728 119623 -3216845 1915403
866 -612670 -1384714 -726110 -362762 1905760 2302677 393970 -2770011 316536 5849800
857 5849800 -4409059 -1125703 -4062111 1519272 -1165761 4892601 -5959622 677506 -1463883
847 2237261 4982706 -1534231 1691562 488253 2488625 -8201284 2159751 2515304 -226351
837 -851690 -4494775 3919846 1992469 -602732 -1857886 282579 1686087 45516 -747832
827 3882598 -4076853 -4545234 6339791 -6884101 2096323 -767051 4761033 -195661 1091290
817 -1379630 -2082551 2606894 711774 1165362 2843084 3719833 1450262 338447 5677016
808E677016d810922A997255g44864l9495J09921j270569Q27447A552080J359935
799B912015a731499l036216A362876A48101e73030E77668M300311d089731h22470
789b963227C989316d506553J703424c86611a3362j776687Q41216A28829N8374
780A87203K101660c395579H20404B07838e334034k672438C571363A63173c585632
770A0959J431955b65944k566811C488723D9851L426856f621312e3874j658603
761a712477F94834O06440E7869d54865o09921C481784c071864k373374C637839
751F255329A141964b26039C237640b772937A504542d083610d79278A147801a60934
741B559744d41687p53904k052146J092226P01819A006909b08466B21884M892664
$$ plain form
808 5677016 -4810922 1997255 -744864 -784359 -674438 -1945007 -1117560 1552080 2912015
799 2912015 -1731499 -4767715 1362876 148101 -573030 577668 4877979 -4089731 -822470
789 -2963227 3989316 -4506553 -2803129 -386611 -13362 -1790049 -948833 128829 187203
780 187203 2288863 -3395579 820404 207838 -5334034 -8006472 3571363 163173 -3585632
770 10959 1442914 -265944 -2832755 3488723 49851 3476707 -6621312 -53874 -1712477
761 -1712477 694834 1301274 57869 -454865 -1064786 3481784 -3071864 -5445238 3637839
751 6255329 1141964 -226039 3237640 -2772937 1504542 -4083610 -479278 1147801 -160934
741 2559744 -441687 -1195591 -3247737 -2155511 -1453692 1006909 -208466 221884 5114548
732E114548c462643j528032B514971G09317K20588h98024A397488F48888c805492
722a900341I57209J762722b047556B419546c879400j95819D425652b403301a137481
712g149382A219218J764695Q20425e866900b144257G089450a120712A415874Q264201
703I680075Q205236E913877A763214c614709l0607045O151458a2346376H97243
694c693723A2536519j970164K8907397A5988046m054199N253209c0336696j8735281
686d9071977K4421127N186885M687226A3150639L782476D528633D66294N579101
678F045395a260854E14325a419103d73415B903963d802380p561523A84563g21339
668A861593a599591m6266j416769a262475l465158r859866J024213B1231153N526669
$$ plain form
732 5114548 -3462643 -4990675 2514971 709317 929905 -898024 1397488 648888 -3805492
722 -1900341 957209 2719931 -2047556 2419546 -3879400 -4075219 4425652 -2403301 -1137481
712 -7149382 1219218 2983913 3804338 -5866900 -2144257 7089450 -1120712 1415874 9680075
703 9680075 17885311 5913877 1763214 -3614709 -34221754 -28070296 -12346376 897243
694 -3693723 12536519 10566355 39473752 15988046 11933847 17187056 -30336696 -49071977
686 -49071977 -24650850 -19463965 -14776739 13150639 16933115 4528633 466294 6045395
678 6045395 -1260854 514325 -1419103 -473415 2903963 -4802380 -12363903 184563 -721339
668 1861593 -1599591 -1645857 -3062626 -1262475 -4727633 -14587499 -13563286 21231153 26757822
659B6757822j506737r184613b863815A4635789a4130151r58476j1110593q578342
651c4777562a2684021F933803J997739K016233Q968119B260695J4185857o696391
643I750161c626616l642972j3112675g37395H35362b201042F1677a181064F291904
633b804612N88780c25957j168248D799317c91236l872110A859411a571200j49847
624a721047B050196m29616a967328B122942G9838a551698k283639j875744A684158
614d108791B694038d339167J911627r313576k246571j7232290J3841641C08473390
605A15590227A3297105b94948292h694402P41241J259643a997837j079662k648960
597e726459A042318l43538d51971j76774a45925A59233d854423i80032E66091
$$ plain form
659 26757822 25251085 16066472 -2863815 14635789 -14130151 -15088627 -26199220 -34777562
651 -34777562 -12684021 6933803 8931542 10947775 19915894 2260695 16446552 9750161
643 9750161 -3626616 -7269588 -20382263 -737395 835362 -2201042 61677 -1181064 6291904
633 -2804612 -2215832 -325957 -1494205 4799317 -391236 -4263346 1859411 -1571200 -1721047
624 -1721047 2050196 1620580 -1967328 2122942 79838 -1551698 -3835337 -5711081 1684158
614 -4108791 2694038 -4339167 -2427540 -11741116 -13987687 -31219977 -17378336 308473390
605 115590227 13297105 -294948292 -8694402 -7953161 -6693518 -1997837 -3077499 -5726459
597 -5726459 1042318 698780 -451971 -628745 -145925 159233 -4854423 -980032 566091
587E703277d989958A346168J25415J606785A116954j54667c370154a265990G484541
577a71220C90055h24841l038716E10839b036282A860612J04411d842022C468549
567C90804J952021h16633D056629c974692I59679N563853e260144J641600A974289
557f277416A836289P42807p301a396107l065979E916885d292763M01111i74871
547B022590K476280d207017A053823d561461A198255D44021L588913b390526P31167
538a659359k71283E516742k70204B599413b035146h32524o96092A769126a669213
528B657922b23700k135275C788641B91022b290911A133473j43901i36232k599107
519c535339F984350B665460b687421C796730I84079e733836d95179B576771J183784
$$ plain form
587 5703277 -4989958 1346168 1471583 3078368 1116954 962287 -3370154 -1265990 7484541
577 -171220 390055 -824841 -3863557 510839 -2036282 1860612 1965023 -4842022 3468549
567 390804 2342825 -816633 4056629 -3974692 959679 6523532 -5260144 -3618544 1974289
557 -6277416 1836289 2579096 2571795 -1396107 -4462086 5916885 -4292763 -3891652 -974871
547 2022590 4498870 -4207017 1053823 -4561461 1198255 444021 4032934 -2390526 -1659359
538 -1659359 -1930642 5516742 5246538 2599413 -2035146 -832524 -1528616 1769126 -1669213
528 2657922 -223700 -2358975 3788641 291022 -2290911 1133473 989572 -936232 -3535339
519 -3535339 6984350 2665460 -2687421 3796730 984079 -5733836 -495179 2576771 3760555
510C760555I34252J290901K988819f501541e0020j240809H90483k77576f34468
500B110414m31415c763227b83004C854939d271210h629l522321B979757b796806
490a33685j817928J20277B569888J375741e475522A213576J144453i86337B176941
480b792351A873212a708020B293158n41999a744651k732111a176020B246124b350200
470b092923B396525b017429A070026K221984c557612a580441j47267C34721K435394
461B770115d891689D051855g69855D56312L500730a403407l362257D751223b14019
451d209418a951532B531471b227631A670513d61825i5974q57492C572970E66480
441A150247J392410i8787B25484e978519A756322b575866n08729R03310A906364
$$ plain form
510 3760555 934252 2225153 5213972 -6501541 -50020 -1290829 890483 612907 -634468
500 2110414 1678999 -3763227 -283004 3854939 -4271210 -8629 -3530950 2979757 -2796806
490 -133685 -1951613 -1831336 2569888 3945629 -5475522 1213576 2358029 -986337 2176941
480 -2792351 1873212 -1708020 2293158 1751159 -1744651 -4476762 -1176020 2246124 -2350200
470 -2092923 2396525 -2017429 1070026 3292010 -3557612 -1580441 -1727708 334721 2770115
461 2770115 -4891689 4051855 -769855 456312 3957042 -1403407 -4765664 4751223 -214019
451 -4209418 -1951532 2531471 -2227631 1670513 -461825 -95974 -953466 3572970 566480
441 1150247 2542657 -98787 225484 -5978519 1756322 -2575866 -3084595 -2181285 1906364
431A330579b032390A0030M473766q66767a427467A315455g22406D3902e9530E28805
420C565194F58249P12434M69421L753685c391211J111024L60531B460697r1637
411B369060a437327o62839n36945F639535a344716B70621h28021A012994K698723
402C711717f279866g00644B373100c683453a082369C191725B96410M208144I66638
392D727268f449476C386577f48499B032181f94272j542085F86854k85352d12688
382a83469o76438A483625J777978f862246F804183a446283A621356e54104j702321
373b256425j099984A508876M81430f771019F226674e02708D57517K087871b398725
363C66245K390016a819325o4878H3992b476433B245458e067442J088262f59013
$$ plain form
431 1330579 -2032390 10030 4483796 3617029 -1427467 1315455 -722406 43902 -59530 528805
420 3565194 658249 1370683 1840104 5593789 -3391211 -2280187 -1919656 2460697 2369060
411 2369060 -1437327 -2100166 -2637111 6639535 -1344716 270621 -828021 1012994 3711717
402 3711717 -6279866 -700644 2373100 -3683453 -1082369 3191725 296410 4504554 966638
392 4727268 -6449476 3386577 -648499 2032181 -694272 -2236357 686854 401502 -412688
382 -183469 -859907 1483625 3261603 -6862246 6804183 -1446283 1621356 -554104 -2256425
373 -2256425 -3356409 1508876 1990306 -6771019 6226674 -502708 457517 2545388 -2398725
363 366245 2756261 -1819325 -1884203 83992 -2476433 2245458 -5067442 -3979180 -659013
353B788782J374405c314913J219238D65506J199372f058245F367956f430153A849060
343C394158c562441j927479C538913a859937j244764B62953R74534J611677c708023
333f199414e44235B690853d448197B990078J979224d500991f1145k40968C930049
323F04256f051722I908J398141f337838A391071c270371A073698M67215d211794
313D167605e53500B977279a012004J85166F31859b729048C808078A379560L03432
304A682992E05698a464326E507270h00738C401714a936986B498749f327472I288531
294E55621d14756l030752E891024b049635R79489A538359e03135k198884J078076
285a623943D821723a337720B907177a289411k145203B912150a741524P08356A805801
$$ plain form
353 2788782 4163187 -3314913 -2095675 465506 1664878 -6058245 6367956 -6430153 1849060
343 3394158 -3562441 -5489920 3538913 -1859937 -3104701 262953 1237487 2849164 -3708023
333 -6199414 -544235 2690853 -4448197 2990078 4969302 -4500991 -61145 -302113 3930049
323 604256 -6051722 9908 1408049 -6337838 1391071 -3270371 1073698 1540913 -4211794
313 4167605 -553500 2977279 -1012004 -826838 631859 -2729048 3808078 1379560 1682992
304 1682992 505698 -1464326 5507270 -800738 3401714 -1936986 2498749 -6327472 9288531
294 555621 -414756 -3445508 5891024 -2049635 -1070146 1538359 -503135 -2702019 -1623943
285 -1623943 4821723 -1337720 2907177 -1289411 -3434614 2912150 -1741524 -1033168 1805801
275b802838B738970a92539C191926f103438b152466A533636A7575J451777L378578
266D847930A692011a217358A109459a654793E384970f0739k689581H95207c903338
256c62715D576043A08134f43224j590990A279033K0293e10849l515910a887234
246B529i24867E132176c216243b59021C207411a86615j446204B864896i48512
236A505171c147544B435213e39525C230599d956185c75215k47677j969337E086776
226d002129a252543A026824n01340b732736h13133F73866M43023L293317b230289
216a505151C40861J362649J24656C92091J339818B37715M62500J85034b380963
206d66267p666427B728900F54094K581866j574274d114979C545192h94562C007397
$$ plain form
275 -2802838 2738970 -192539 3191926 -6103438 -2152466 1533636 17575 1469352 4847930
266 4847930 1692011 -1217358 1109459 -1654793 5384970 -60739 -2750320 895207 -3903338
256 -362715 4576043 108134 -643224 -2234214 1279033 1299326 -510849 -4026759 -1887234
246 2529 -924867 5132176 -3216243 -259021 3207411 -186615 -1632819 2864896 -948512
236 1505171 -3147544 2435213 -539525 3230599 -4956185 -375215 -622892 -2592229 5086776
226 -4002129 -1252543 1026824 525484 -2732736 -813133 673866 1116889 4410206 -2230289
216 -1505151 340861 1703510 1828166 392091 1731909 237715 700215 885249 -2380963
206 -466267 -8132694 2728900 654094 3235960 1661686 -4114979 3545192 -894562 3007397
196D26655M50767A71307M65126f4817k113j298733f0423B119245a79534A655679
185A409080K627130A045774C3791a349138b14590l269348D312297j696951b62137
175b263146D636415r94238K620299J7844962P0892710j4143661a11120531P167178
167a03953353q1095145c4810554n0317746I7281063j563612P5958957b2585975
159b1483127e079854O19905f1854l435895C365814b743399c17535l344378A335249
149g93698j477945D82713a995015b873B726327J533889a412804N39443k02868
140a076229B045260a768192C33539L39062c70992B044167e57598D518744d084295
130e981106C226160a221869B041853c027106p52533J425947d85981h5998D448698
$$ plain form
196 426655 877422 171307 636433 -64817 -66930 -1365663 -60423 2119245 -179534 1655679
185 1409080 4036210 1045774 33791 -1349138 -214590 -3483938 4312297 2615346 -262137
175 -2263146 4636415 3642177 6262476 24107438 95000148 80856487 -111120531 -103953353
167 -103953353 -185048498 -34810554 -85128300 97281063 95717451 171676408 -22585975
159 -21483127 -5079854 -4459949 -61854 -3497749 3365814 -2743399 -317535 -3661913 1335249
149 -793698 -2271643 482713 -1995015 -2873 2726327 4260216 -1412804 -873361 -1076229
140 -1076229 2045260 -1768192 333539 672601 -370992 2044167 -557598 4518744 -4084295
130 -5981106 3226160 -1221869 2041853 -3027106 -3779639 -2353692 -485981 -85998 4448698
120c154447a57313A147932a022631k51696A943963c76676n09298B773157e120157
110A053605d9592G683033g954550f65099I74434d476416B314612b788263g96728
100A07936d421601k894792L302228J51099J434653e56026n232226E1313b614124
90b728356B498031N640755A8122b342799I41076b79313A237981J05026n21665
81H21342J84774c916065b48627C767143f062613C88379a423494A566384E51780
71B175476c116618e39832B445244K114468a033468B267177c474775I45653j17091
62H28562O66540d05594A207548f63437j547136A196411K110337e590335g35680
52C004904I92095b254240j021412E745116e94502A025073g283421E802850B052858
$$ plain form
120 -3154447 -157313 1147932 -1022631 -1274327 1943963 -376676 -885974 2773157 -5120157
110 1053605 -49592 7683033 -7954550 -665099 974434 -4476416 2314612 -2788263 -796728
100 107936 -4421601 -7316393 -4014165 -3863066 -2428413 -556026 -5788252 51313 -2614124
90 -2728356 2498031 8138786 18122 -2342799 941076 -279313 1237981 1343007 821342
81 821342 1006116 -3916065 -248627 3767143 -6062613 388379 -1423494 1566384 551780
71 2175476 -3116618 -539832 2445244 4559712 -1033468 2267177 -3474775 945653 828562
62 828562 1495102 -405594 1207548 -663437 -2210573 1196411 3306748 -5590335 -735680
52 3004904 992095 -2254240 -3275652 5745116 -594502 1025073 -7283421 5802850 2052858
42A59038c868965I96198g72894j921081A47052J594529a567892O31983L2350B012204
31C354338n15673A092150a736660D6618a769840a92284D813889d445645b90527
21a370383A538568d6862l654080G29538d419854o20719B136432c947689B682301
11G53513a315393C129947b629531d9049q48259C009843b165253A439359L22628
2A761987n47107e18087
$$ plain form
42 159038 -3868965 996198 -772894 -2693975 147052 1741581 -1567892 -935909 -903559 2012204
31 3354338 2838665 1092150 -1736660 46618 -1769840 -192284 4813889 -4445645 -290527
21 -1370383 1538568 -46862 -3700942 729538 -4419854 -5040573 2136432 -3947689 2682301
11 753513 -1315393 3129947 -2629531 -49049 -897308 3009843 -2165253 1439359 1761987
2 1761987 1214880 -518087
##PAGE= F1=5596.982059883
##FIRST=     21204.543296753, 2644.21089616403, -2966497
##DATA TABLE= (F2++(Y..Y)), PROFILE
2047b966497A066416a291386j064759G91993a305595B387176J501a341132G081525
2037d448209g80479m123020E37716g40335B313201N42824d92385A319530a266579
2027c56444p57914B086447j24026D21090M52967L482036l84254b341132a104687
2017B064015M00085H90034k86169i91176j57295A093257R237J180771b754360
2007C48804a17435j641207o29457B720651e82320k904822B56228P24535c872447
1997E824344b434386k298640J955401k907868a440486D643817P04874h43052E201052
1987I65200l23200b744698J019806B128749e1400k433252i00811A095231f02228
1977f70123j348730k215251B621982A145300b7407C194642g469513A726432p73669
$$ plain form
2047 -2966497 1066416 -1291386 -2356145 791993 -1305595 2387176 2388677 -1341132 7081525
2037 -4448209 -780479 -4903499 537716 -740335 2313201 2856025 -492385 1319530 -1266579
2027 -356444 -1114358 2086447 1962421 421090 874057 4356093 3971839 -2341132 -1104687
2017 2064015 2464100 890034 603865 -991176 -1148471 1093257 1102494 2283265 -2754360
2007 348804 -117435 -1758642 -2388099 2720651 -582320 -3487142 256228 980763 -3872447
1997 5824344 -2434386 -4733026 -2777625 -5685493 -1440486 4643817 5348691 -843052 5201052
1987 965200 642000 -2744698 -1724892 2128749 -51400 -2484652 -900811 1095231 -602228
1977 -670123 -2018853 -4234104 2621982 1145300 -27407 3194642 -7469513 1726432 952763
1968I52763c091712B312774a595754g82030m15525a76849k547695E368806B176227
1958b849859O15977A208585e496383b58176p64928F13687a664071A94464K0577
1949B15041b83924B349483j85554q04715d43153B749550C5886h0500l563210B816902
1938b861572l65186B889609e410466H79978B34377L491566b307289A62023L094352
1929C256375J181294c945634D301028e42366C373616a356726l49123B551060d22517
1919B734630j080317i38933j496557C000668b082874A047641L048229D72635L44582
1910H17217e25824m80343K97902j045359C765865a146627l92264p1439C846099
1900b750392B629730K624471c05976j420877j975857A571274b020253b97031A203777
$$ plain form
1968 952763 -3091712 2312774 -1595754 -782030 -1197555 -176849 -2724544 5368806 2176227
1958 -2849859 -2233882 1208585 -5496383 -258176 -1023104 613687 -1664071 194464 215041
1949 215041 -283924 2349483 2163929 1359214 -443153 2749550 35886 -80500 -3643710 2816902
1938 -2861572 -3226758 2889609 -5410466 879978 234377 3725943 -2307289 162023 3256375
1929 3256375 4437669 -3945634 4301028 -542366 3373616 -1356726 -1705849 2551060 -422517
1919 2734630 1654313 -938933 -2435490 3000668 -2082874 1047641 4095870 472635 817217
1910 817217 -525824 -1006167 -708265 -1753624 3765865 -1146627 -1538891 -1610330 3846099
1900 -2750392 2629730 5254201 -305976 -1726853 -3702710 1571274 -2020253 -297031 1203777
1890F27884c260482J544356g31050D244552H84173J41483N72284c608082q82654
1881d490736j065322d12188A873712E2710N68879e03775B14163R99168b471004
1871a906735C39555M25827e171474C280622b626378A119895J26454d80377C374891
1861d222840F269783b372093A807752E67976e09939A964226g164427a257505b63553
1851D175682f88125k723333A552055J500364b786436R93562A926437J903944b569805
1841C221075a249821j445719b32199C232947M593258g905886D70589a594258A576500
1831b039032P31614B992532A318825D81791b421912P76846C25687K95063a504242
1821D719546a348171l584503D346870b022791m077789i73270l203399a470807
$$ plain form
1890 627884 -3260482 -1716126 -731050 4244552 884173 1025656 1597940 -3608082 -4490736
1881 -4490736 -5556058 -412188 1873712 52710 621589 -503775 214163 1213331 -2471004
1871 -1906735 339555 765382 -5171474 3280622 -2626378 1119895 1246349 -480377 3374891
1861 -4222840 6269783 -2372093 1807752 567976 -509939 1964226 -7164427 -1257505 -263553
1851 4175682 -688125 -3411458 1552055 3052419 -2786436 -1792874 1926437 3830381 -2569805
1841 3221075 -1249821 -2695540 -232199 3232947 7826205 -7905886 470589 -1594258 1576500
1831 -2039032 -1307418 2992532 1318825 481791 -2421912 -1645066 325687 620750 -1504242
1821 4719546 -1348171 -4932674 4346870 -2022791 -6100580 -973270 -4176669 -1470807
1812B718817A236937r3162a413171b86984E060811A846041J74533e42599j806232
1803b348831D41892a828001C998355f376190B075543c011167B729840A288478
1794a583956r88206E968340b341977F229307B01095K942974e846371B510996d41837
1784b576941B908162a206075d93806j070686B523224e95878B642885b220904B549120
1774A090644b648280n8423J071872H754359a814985n734351D15516j2450K30191
1765F33257J764619A084633d532722A078010a805500G14134a642513F423068a779484
1755A288896D5083L268922i56011j990283f76228K94634A68191K610093d627655
1745c586454I91824J010686a140835L96656G93577O44221e266763A699831c924738
$$ plain form
1812 2718817 1236937 1143775 -1413171 -286984 5060811 1846041 2020574 -542599 -2348831
1803 -2348831 441892 -1828001 3998355 -6376190 2075543 -3011167 2729840 1288478
1794 -1583956 -2572162 5968340 -2341977 6229307 201095 3144069 -5846371 2510996 -441837
1784 -2576941 2908162 -1206075 -493806 -1564492 2523224 -595878 2642885 -2220904 2549120
1774 1090644 -2648280 -2706703 -1634831 8754359 -1814985 -7549336 415516 403066 633257
1765 633257 2397876 1084633 -4532722 1078010 -1805500 714134 -1642513 6423068 -1779484
1755 1288896 45083 3314005 -956011 -2946294 -676228 -381594 168191 2778284 -4627655
1745 -3586454 991824 2002510 -1140835 -744179 793577 1437798 -5266763 1699831 -3924738
1735A423562a366893L82028q42427A728913g88835M4706A157086g126685C383616
1725a145503k51849H71483b823685D74839e88757F58951A29004c206108H72582
1715G48463a145223F290478j750568e299176c17767l39252j438080B307741e89028
1705B463902q05968G49052J24579J150515A17864J339303c822054A895725a544825
1695c149354C25349a923247E24426A26089h82436j368653m003557A462202K871041
1686D333243b24253k054755A660996i76340e9848j766793C89816L452180f253680
1676A302854J548863n98889e162121a609072A57602J141933C35130K380930f588900
1666b112877E455017E1606M785090F55917e926608A033638f67952B463135a64355
$$ plain form
1735 1423562 -1366893 -984865 -1827292 1728913 -788835 -744129 1157086 -7126685 3383616
1725 -1145503 -1397352 871483 -2823685 474839 -588757 658951 129004 -3206108 872582
1715 748463 -1145223 6290478 4539910 -5299176 -317767 -657019 -2095099 2307741 -589028
1705 2463902 1657934 749052 873631 2024146 117864 1457167 -3822054 1895725 -1544825
1695 -3149354 325349 -1923247 524426 126089 -882436 -2251089 -6254646 1462202 4333243
1686 4333243 -224253 -2279008 1660996 -976340 -59848 -1826641 389816 3841996 -6253680
1676 1302854 2851717 2252828 -5162121 -1609072 157602 1299535 335130 2716060 -6588900
1666 -2112877 5455017 51606 4836696 655917 -5926608 1033638 -667952 2463135 -164355
1656C67417a328395k995120i02027A043193b529094D002277c300669n53302I423684
1646E21681b087564k515405B216506a987826k472117B787326b508686C154720
1637I55724J462186R27451a678026D394J687500K114848a13337B321652f29872
1627c527466e23545H867578b968352C48604c71077E37013f381505A113509A94334
1617b270794j498874G94884a911861g81310c1615j540132n94630B323557D08095
1607B055207o11156K147247a501629G492439e896537c67395j230694B247002h41082
1597C156749c087470C744167c450014g25854A282262b670044a199895m9849G86277
1587E36990b05790B901317b728092h05985k938686C281542G20094b459969E30387
$$ plain form
1656 367417 -1328395 -4323515 -902027 1043193 -2529094 4002277 -3300669 -3853971 9423684
1646 521681 -2087564 -4602969 2216506 -1987826 -4459943 2787326 -2508686 3154720
1637 955724 2417910 3345361 -1678026 4394 1691894 3806742 -113337 2321652 -629872
1627 -3527466 -523545 8867578 -2968352 348604 -371077 537013 -6381505 1113509 194334
1617 -2270794 -3769668 794884 -1911861 -781310 -31615 -1571747 -2166377 2323557 408095
1607 2055207 1444051 3591298 -1501629 7492439 -5896537 -367395 -1598089 2247002 -841082
1597 3156749 -3087470 3744167 -3450014 -725854 1282262 -2670044 -1199895 -1249744 786277
1587 536990 -205790 2901317 -2728092 -805985 -3744671 3281542 720094 -2459969 530387
1577F30285a925067n322302B702972a266910F939408A103984C9928b812496j614632
1568d427128B529378d030416C708561b431465R83093k947974a226459c4795B412240
1558a772735N22228l85968D120404C24480a624364A81695N291790f68463A553771
1548A659962c32137A833961e13344D47371A1317c299146D659453B230402a015267
1538C101286a467818d19235B096b748866O16105A960997i09270l262866E69493
1528I69595K450848A534553c636679F53496N088929h04001B349248d630291F362989
1518d558212G789568h14470d0830l865281A173618m70146f754083E39562c54712
1508B684596i78897B453463Q34968J521808H50368a189437C5762J589307J171623
$$ plain form
1577 630285 -1925067 -7247369 2702972 -1266910 6939408 1103984 39928 -2812496 -4427128
1568 -4427128 2529378 -4030416 3708561 -2431465 -1448372 -4396346 -1226459 -34795 2412240
1558 -1772735 -1250507 -1636475 4120404 324480 -1624364 181695 5473485 -668463 1553771
1548 1659962 -332137 1833961 -513344 447371 11317 -3299146 4659453 2230402 -1015267
1538 3101286 -1467818 -419235 2096 -2748866 -2132761 1960997 -909270 -4172136 569493
1528 969595 3420443 1534553 -3636679 653496 5742425 -804001 2349248 -4630291 6362989
1518 -4558212 7789568 -814470 -40830 -3906111 1173618 703472 -6754083 539562 -354712
1508 2684596 -978897 2453463 3288431 4810239 850368 -1189437 35762 1625069 2796692
1499B796692J298217b57802A1476935d674593A912455d887763A63413K722008
1491B885421b153652B571295b867388c89426l814698F14821d375700H074733C973010
1481b13927j381260P67482L67092l014980C48979d044317B229552i03983m260406
1472e164389C385781g992674a987500N96748A117331a635721A694974a413393
1463A733290J013890g001136h49093D69962f13940B430895a160828n77629k335867
1454d074324A63773h17369A947202h92579G04634a617846f53080k014129A1604
1444C580268p82943c122687B90266J794228c096665k956051E333081g92775H77028
1434F90708K957357h41530D813045b337937F18282b87710q53273A709821Q11476
$$ plain form
1499 2796692 4094909 -257802 11476935 -4674593 1912455 -4887763 163413 2885421
1491 2885421 -2153652 2571295 -2867388 -389426 -4204124 614821 -4375700 8074733 3973010
1481 -213927 -1595187 -827705 -460613 -3475593 348979 -4044317 2229552 -903983 -5164389
1472 -5164389 3385781 -7992674 -1987500 -1390752 1117331 -1635721 1694974 -1413393
1463 1733290 2747180 -7001136 -849093 469962 -613940 2430895 -1160828 -1738457 -4074324
1454 -4074324 163773 -817369 1947202 -892579 704634 -1617846 -653080 -2667209 11604
1444 3580268 2797325 -3122687 290266 2084494 -3096665 -6052716 5333081 -792775 877028
1434 690708 3648065 -841530 4813045 -2337937 618282 -287710 -1140983 1709821 2521297
1425B521297b754463k224791D703562c522004C462799c712677H80505K09814e02770
1415D42154c3967B663567F88870L099060a76246E77163C3703a700813l211837
1406d912650C244367b691369j111704c87163B641400d395178D659796j803076
1398B856720C43021d937554D471145r98460A268855E09115J90970c86086n05634
1389h91720K93538A957127a032030k147069F079858c528868A647653J426199c205190
1379b459869A556609k07944O83683C54196J045332M11246c381295B403082c546325
1369C596706r55328J861016b093043P09175E271550B578406c293062G4927b633972
1359a409636n25691N88809B448757h07103B330860d022131B43047f61387B401743
$$ plain form
1425 2521297 -2754463 -4979254 4703562 -3522004 3462799 -3712677 880505 1090319 -502770
1415 442154 -33967 2663567 688870 3787930 -176246 577163 33703 -1700813 -4912650
1406 -4912650 3244367 -2691369 -3803073 -387163 2641400 -4395178 4659796 2856720
1398 2856720 343021 -4937554 4471145 3472685 1268855 509115 700085 -386086 -891720
1389 -891720 -598182 1957127 -1032030 -3179099 6079858 -3528868 1647653 3073852 -3205190
1379 -2459869 1556609 1348665 2032348 354196 1399528 1810774 -3381295 2403082 -3546325
1369 3596706 2641378 4502394 -2093043 -1383868 5271550 2578406 -3293062 74927 -2633972
1359 -1409636 -1935327 -1346518 2448757 -807103 2330860 -4022131 243047 -661387 2401743
1349b312986F402905d067537J988133B32920J940393E13161e414007D592495d068559
1339F2062J744010j81816c189371E311584b601952p73274l113517A097478M248948
1330E346426a585216D546122A561069J257592b278559G21409b524936a247779
1321B054185J213605b647306C60222a41663C057101b025969P19783l24253A152700
1311G02021h81058k797314C722459f66278A603160b911974B140190K258181g813242
1301B401888Q23413j525770a376400c11864A197818c978940C635878H87550d662661
1291A492134e97263C548213c082967c91808j066264j404182A655363O86884P73517
1282C115764b662565B785056a774812k38287L41928O46225G54966b705216D429518
$$ plain form
1349 -2312986 6402905 -4067537 -2079404 232920 2173313 513161 -5414007 4592495 -4068559
1339 62062 1806072 1624256 -3189371 5311584 -2601952 -3375226 -6488743 1097478 5346426
1330 5346426 -1585216 4546122 1561069 2818661 -2278559 721409 -2524936 -1247779
1321 2054185 3267790 -2647306 360222 -141663 3057101 -2025969 -1306186 -1630439 1152700
1311 702021 -881058 -3678372 3722459 -666278 1603160 -2911974 2140190 4398371 -7813242
1301 2401888 3225301 1699531 -1376400 -311864 1197818 -3978940 3635878 887550 -4662661
1291 1492134 -597263 3548213 -3082967 -391808 -1458072 -2862254 1655363 2342247 3115764
1282 3115764 -2662565 2785056 -1774812 -2013099 -1671171 -1024946 754966 -2705216 4429518
1272A405449c504029E297369g635508E068999d651982a336610B103490C71284
1263A619284b785552A805829b138314n35020j21713F105886B70603K864155J55386
1254C290144b98416A670392a04782D285304j528814a273539o579189F517674c890583
1244a325800G026576i49991e8292l103858j328419B863538O40962e373027B713294
1234i42347I56504d042620B451637e466251C31656e02368m04461C829804A76849
1224b798915E43031J0278780a476398O61359D31698j68386c904449B226768L7918
1215B264686a507669l12249O28773B700674c28703c6258k30253o8434l70387G08901
1204C203677H97578J03551A37796d832641A760462b725768E60862d38268A437127
$$ plain form
1272 1405449 -3504029 5297369 -7635508 5068999 -4651982 -1336610 2103490 371284
1263 1619284 -2785552 1805829 -2138314 -2673334 -2795047 6105886 270603 3134758 3290144
1254 3290144 -298416 1670392 -104782 4285304 2756490 -1273539 -7852728 6517674 -3890583
1244 -1325800 7026576 -949991 -58292 -3162150 -4490569 2863538 3504500 -5373027 2713294
1234 -942347 956504 -4042620 2451637 -5466251 331656 -502368 -906829 3829804 176849
1224 -2798915 543031 10821811 -1476398 -815039 431698 263312 -3904449 2226768 2264686
1215 2264686 -1507669 -1819918 -1191145 2700674 -328703 -36258 -266511 -334945 -705332 708901
1204 3203677 897578 1001129 137796 -4832641 1760462 -2725768 560862 -438268 1437127
1194C137710j021230a831862j374519h96213j097355l130067B428419J940923
1186D369342d202273B103063m91404b914922R91283e81928B402924d264030A0802676
1176C82615b183654A969419b346655A14074J305692D70509L401725d579581A107759
1166A985355M004974b537829I59601M80293L653182c533114A662735C63656J993313
1157B356969c768152A564747A78960L532965r11492N77545j230988b376042A200925
1147a853843K88289B737606a810977F737192b243749D675568c699092d80478G83368
1137a415157A073498J097438e33008B745348i791F05977c039085A090709K980832
1128D071541b598756A079901L388066a626060C34738K424277c905080B499827
$$ plain form
1194 3137710 2116480 -1831862 -3206381 -896213 -1993568 -5123635 2428419 4369342
1186 4369342 -4202273 2103063 1611659 -2914922 -1923639 -581928 2402924 -4264030 10802676
1176 382615 -2183654 1969419 -2346655 114074 1419766 470509 3872234 -4579581 1107759
1166 1985355 5990329 -2537829 959601 1439894 5093076 -3533114 1662735 363656 2356969
1157 2356969 -3768152 1564747 178960 3711925 2800433 3377978 2146990 -2376042 1200925
1147 -1853843 -1565554 2737606 -1810977 6737192 -2243749 4675568 -3699092 -480478 783368
1137 -1415157 1073498 2170936 -533008 2745348 -9791 605977 -3039085 1090709 4071541
1128 4071541 -2598756 1079901 4467967 -1626060 334738 2759015 -3905080 2499827
1119a761373A445817J309568c849760a31383o82014C94526b297997A079142f653420
1109b26517r11072C215192a150827o03788B181442C74888a936807E884107a111003
1099h08296a5424A480151a407809C185454a575998j03265n079344a172465C730897
1089d19125B626171p51414Q55915d357065B596136o93717g82423j453092C313063
1079B679416l81623b864188Q3589B022423d053579J731107D773090c311607e12175
1069B125106d332341A214036K515123L60774c634407o28383c58407E0317a914775
1059b283197a45251k50327A327339h82217L09392j030313E726415E34589B49998
1049E007756a244224c34752B497776A101576J67841b869233A786215e060064D730211
$$ plain form
1119 -1761373 1445817 2755385 -3849760 -131383 -813397 394526 -2297997 1079142 -6653420
1109 -226517 -1137589 3215192 -1150827 -1754615 2181442 374888 -1936807 5884107 -1111003
1099 -808296 -15424 1480151 -1407809 3185454 -1575998 -1679263 -6758607 -1172465 3730897
1089 -419125 2626171 1874757 2730672 -4357065 2596136 1902419 -782423 -2235515 3313063
1079 2679416 2297793 -2864188 -2780599 2022423 -4053579 -2322472 4773090 -3311607 -512175
1069 2125106 -4332341 1214036 3729159 4089933 -3634407 -4262790 -358407 50317 -1914775
1059 -2283197 -145251 -395578 1327339 -882217 -572825 -1603138 5726415 534589 249998
1049 5007756 -1244224 -334752 2497776 1101576 1269417 -2869233 1786215 -5060064 4730211
1039d340727a28103D516539A290710i13715k621464A554404M50946a186718j612685
1030b799403A387085K180036b402334B516587e477795A4222a91588B032815K100832
1021D133647i07236p70655B05103K045477N62301f085608J287039D84911P570934
1012H055845B98990J515289a762071d87349B484832r69899J899491A671216N87735
1003B258951b905943J201130o694B950179j63815d55321l475953a229905k15726
994a445631m682570A181083j44448A11754b138607e69056j19696A332030E68630
984d30782B835658j264900B01533b398143E286796c135883C335564g66396o50100
975a416496F88497g78354b52415k064196R89578G24730b200788E555486f623262
$$ plain form
1039 -4340727 -128103 4516539 1290710 -913715 -3535179 1554404 2005350 -1186718 -2799403
1030 -2799403 1387085 3567121 -2402334 2516587 -5477795 14222 -191588 2032815 4133647
1021 4133647 -907236 -1677891 205103 2250580 2812881 -6085608 -4798569 484911 8055845
1012 8055845 298990 1814279 -1762071 -487349 2484832 1514933 3414424 1671216 2258951
1003 2258951 -2905943 -1704813 -1711507 2950179 2786364 -455321 -3931274 -1229905 -1445631
994 -1445631 -6128201 1181083 1036635 111754 -2138607 -569056 -688752 1332030 568630
984 -430782 2835658 1570758 201533 -2398143 5286796 -3135883 3335564 -766396 -1416496
975 -1416496 688497 -778354 -252415 -2316611 -1327033 724730 -2200788 5555486 -6623262
965D140474c126229k943592E740449C06070L20765b156576j857528G71931J047652
956A819583a477631b70580B625766K976128a507452B498439d2211D351790A881863
946b879489k117738A550973a369979a78420B157404K091874e175267c98004k389975
937b787979B113080b978498B783477b340193p86416r38721C422973A57610f17464
927a311859R1679K09944L03512j176611B08301E7215c738143a313596N07127B950610
916h44167b19489q83729E650447d375021B338225q39360O67533b787100E337490
906E201137e698934B531144e138466H207587a750935e60957f4677m047354J912106
897b199925A406507J267270J653171A421235b162283A740363Q07114g22357A800495
$$ plain form
965 4140474 -3126229 -6069821 5740449 306070 626835 -2156576 -4014104 771931 1819583
956 1819583 -1477631 -270580 2625766 5601894 -1507452 2498439 -42211 4351790 1881863
946 -2879489 -4997227 1550973 -1369979 -178420 2157404 4249278 -5175267 -398004 -2787979
937 -2787979 2113080 -2978498 2783477 -2340193 -3126609 -4065330 3422973 157610 -617464
927 -1311859 -1220180 -1010236 -706724 -1883335 208301 57215 -3738143 -1313596 -806469 2950610
916 -844167 -219489 -1103218 5650447 -4375021 2338225 1498865 2166398 -2787100 5337490
906 5201137 -5698934 2531144 -5138466 8207587 -1750935 -560957 -64677 -4112031 -2199925
897 -2199925 1406507 2673777 4326948 1421235 -2162283 1740363 2547477 -722357 1800495
887b527261A512000K21734b48943A286083N247940b839507Q03857A338841B03875
877a711827I33248a101324j658221K98333i69920A570168d614475B64483b746061
867A392102B67517e92939J40185m06150A438712M18419p37915b311769f3219C813579
856e341185g81429l243771A294181a691885E030958f380550A707489b396719B120264
846E816865a375749A432244j61249J083866h247798A642975J203765e72236K65336
837c06900l425534C329361j062032h26395j333877A507370F51942k37239a143470
827C282990d762946o63083F628177f923658B627068a661908E410788A54551J396778
818A551329a182592j341878C252235F89672J367309P52504J243370A372830l21209
$$ plain form
887 -2527261 1512000 1733734 -248943 1286083 6534023 -2839507 -2035650 1338841 203875
877 -1711827 933248 -1101324 -2759545 -2461212 -969920 1570168 -4614475 264483 -2746061
867 1392102 267517 -592939 -452754 -858904 1438712 1857131 1119216 -2311769 -63219 3813579
856 -5341185 -781429 -4025200 1294181 -1691885 5030958 -6380550 1707489 -2396719 2120264
846 5816865 -1375749 1432244 1270995 2354861 -8247798 1642975 2846740 -572236 -306900
837 -306900 -3732434 3329361 2267329 -826395 -2160272 1507370 651942 414703 -1143470
827 3282990 -4762946 -5426029 6628177 -6923658 2627068 -1661908 5410788 154551 1551329
818 1551329 -1182592 -2524470 3252235 689672 2056981 2809485 4052855 1372830 1051621
809A051621L989185d491792I83509a60545o44544j57364k30134m99758A861896
799C054655b168049k654910A665638F6496a623558I85051M541979d284469a37966
789c354905C637278d104961J714856d23692B15514b230369g63718b56174G98674
779B097487c701603A027945l83025e747613j187954A862121C81681c439176D61417
769A913415D23418b563461C036668B7302L434036f710574I7111b307338D24989
759B791260a60324n17879n88805C340748c401033k460478C573835L676630B411950
749A82328K249246c168727A457718d270650g92735G38277L28059J273451b72210
739a974051j368234J419673O63317A703749c28694F49530M201218c442169j954765
$$ plain form
809 1051621 5040806 -4491792 983509 -160545 -805089 -962453 -1192587 -1692345 1861896
799 3054655 -2168049 -4822959 1665638 66496 -1623558 985051 5527030 -4284469 -137966
789 -3354905 3637278 -4104961 -2390105 -423692 215514 -2230369 -763718 -256174 798674
779 2097487 -3701603 1027945 644920 -5747613 -6935567 1862121 381681 -3439176 461417
769 1913415 423418 -2563461 3036668 27302 3461338 -6710574 97111 -2307338 424989
759 2791260 -160324 -678203 -1267008 3340748 -3401033 -5861511 3573835 7250465 2411950
749 182328 2431574 -3168727 1457718 -4270650 -792735 738277 1066336 2339787 -272210
739 -1974051 -3342285 -1922612 -1259295 1703749 -328694 649530 4850748 -3442169 -5396934
730e396934C156683I87151d10796j07178A250904M16938c787199a554257G30528
720A368728b140186B069615d160820K16267D972587b745350J236844m655950A364884
710C100040J002134d287011a930202F451803i82779H82279P201046P208241D737398
700B356414d116306k3781953P193854Q673847A032280b532990H633456O35688
692I269144K1879066A4484744o947226O976684b3979270j3766926J8731350K961334
684a6053512N818690A0126402L304838C101243H9120O058861a420557D87757a560227
674b65562B690076d414071q158074G5882i41681A787370i42312r55602j276063
665c173977g86097k083531j0518921J670291A6857290N701430l855602n224419
$$ plain form
730 -5396934 3156683 987151 -410796 -517974 1250904 1667842 -3787199 -1554257 730528
720 1368728 -2140186 2069615 -4160820 -3944553 4972587 -2745350 -1508506 -6164456 1364884
710 3100040 4102174 -4287011 -1930202 6451803 -982779 882279 8083325 15291566 4737398
700 2356414 -4116306 -27898259 -20704405 -12030558 1032280 -2532990 8633456 9269144
692 9269144 31148210 14484744 7537518 14514202 -23979270 -37746196 -19014846 -16053512
684 -16053512 -10234822 10126402 13431240 3101243 89120 6147981 -1420557 487757 -1560227
674 -265562 2690076 -4414071 -12572145 75882 -941681 1787370 -942312 -1897914 -3173977
665 -3173977 -786097 -2869628 -13388549 -11718258 16857290 22558720 18703118 13478699
657A3478699b488780I338954a1060186j773411p234184p502324a2157678E638481
648E748027L248906Q073910B662284Q396165k983356b970503l667804j1037411
640a7675718d63408A247968b474290G34220a065600E377237b773474R45847a50501
630a557354E343080f58820k934153A882988a609599r57468B983899A109206a687891
620A710598g75148a46186l385086j770448A409829d045669B330207c118343a361674
610a0278125j651322j1844172J1297271B33968794H8717593A1008015b22270072
602i665382K415854J383910a996097j138077l363637G92758M5520D02716g15811
592d96784p0831l239529a727655C53282N648115d449506G96549P35950N41249
$$ plain form
657 13478699 -2488780 9338954 -11060186 -12833597 -20067781 -27570105 -12157678 5638481
648 5748027 8996933 17070843 2662284 11058449 8075093 -2970503 -6638307 -17675718
640 -17675718 -463408 1247968 -2474290 734220 -1065600 5377237 -2773474 -1827627 -150501
630 -1557354 5343080 -658820 -3592973 1882988 -1609599 -2567067 2983899 1109206 -1687891
620 1710598 -775148 -146186 -3531272 -5301720 1409829 -4045669 2330207 -3118343 -1361674
610 -10278125 -11929447 -23773619 -12476348 233968794 88717593 11008015 -222270072
602 -9665382 -7249528 -5865618 -1996097 -3134174 -6497811 792758 838278 402716 -715811
592 -496784 -567615 -3807144 -1727655 353282 6001397 -4449506 796549 1532499 2073748
583B073748I63490J06588d062200f80103H489952f31384b57265p33506k568019
574c558790e86322j317858B261780q4101d115793B150744F24315J266137f73615
564C674939c930694A841218O633057f084980K166612B552423f514939A346882
555C576400q00249a507734l339039E729678d585103J524807a014553B600100L325999
546E926099d482964A524919e151408B278779B77708L372054b034040K4039j187034
537c197035E483885M67213k850236b322643a145200L60841B375168b213723B151582
527D66180b218331D661948d83785k039767A663222F07236a113711k629173F713039
517B617302b298765C588813j762855f247679a018993C844786j98342A066098O09488
$$ plain form
583 2073748 963490 1070078 -4062200 -680103 8489952 -631384 -257265 -990771 -3558790
574 -3558790 -586322 -1904180 2261780 2177679 -4115793 2150744 624315 1890452 -673615
564 3674939 -3930694 1841218 8474275 -6084980 -3918368 2552423 -6514939 1346882
555 3576400 2776151 -1507734 -4846773 5729678 -4585103 -3060296 -1014553 2600100 5926099
546 5926099 -4482964 1524919 -5151408 2278779 277708 3649762 -2034040 -2010001 -3197035
537 -3197035 5483885 5951098 3100862 -2322643 -1145200 -784359 2375168 -2213723 2151582
527 466180 -2218331 4661948 -483785 -2523552 1663222 607236 -1113711 -3742884 6713039
517 2617302 -2298765 3588813 1825958 -6247679 -1018993 3844786 3646444 1066098 1675586
508A675586M902485e954563A15604a628696A141012k07323a121948B292138l51160
499A940978c482893d47381D195112d519887d5990l523788C065835a773561A32965
489b046422J83558C118058Q03340f073980A140695N27835h37159B682073b552844
479B918307a617239A225569J318118a691942k709344A78269K377339b297514J39410
470b158104B045694b378702D72244L166658d102353i21786o93212H52541J752157
461B604698d954093D266703f78084C3544L960211a134829l873405C963287a45386
451d370418a927741B771989a553972B009065i60451B41316a159474B290161G24762
441A731867M35375D64812d19319m071043A604075h82821k096172k98249A873316
$$ plain form
508 1675586 6578071 -5954563 115604 -1628696 1141012 933689 -1121948 2292138 1940978
499 1940978 -3482893 -447381 4195112 -4519887 -45990 -3569778 3065835 -1773561 132965
489 -2046422 -1862864 3118058 3921398 -6073980 1140695 1668530 -837159 2682073 -2552844
479 2918307 -1617239 1225569 2543687 -1691942 -4401286 178269 2555608 -2297514 -2158104
470 -2158104 2045694 -2378702 472244 3638902 -4102353 -921786 -1614998 852541 2604698
461 2604698 -4954093 4266703 -678084 33544 3993755 -1134829 -5008234 3963287 -145386
451 -4370418 -1927741 2771989 -1553972 2009065 -960451 241316 -1159474 2290161 724762
441 1731867 2167242 464812 -419319 -4490362 1604075 -882821 -2978993 -3277242 1873316
431A724233b250258E7552M732596q89461b845755A368358i78627A91534J04394
422B95928O06382K687079d2058B642648C68611N625909c558155J452174j82164
413b288145C030293p51756f78760p82218j671038F689544a007513D54565h66400
403F22653K721757e082603e24534B129985d461358g36360C330065B09080L382454
394C591534I37059N111739f510013C954934g60257B436855a746040m45605D84454
384F86778B62640e90733M6859A505530J382923g561052F364177a670307B740715
374f52382k160387n18664A592358N6101f167307E822326A09434K75357K550452
365B935243a892804c6629C562769a814080K96137e37321k155783B659024d507499
$$ plain form
431 1724233 -2250258 57552 4790148 3900687 -2845755 1368358 -978627 191534 295928
422 295928 902310 3589389 -42058 2642648 368611 5994520 -3558155 -2105981 -2288145
413 -2288145 3030293 2278537 -678760 -1460978 -3132016 6689544 -1007513 454565 -866400
403 622653 3344410 -5082603 -524534 2129985 -4461358 -736360 3330065 209080 3591534
394 3591534 937059 6048798 -6510013 3954934 -760257 2436855 -1746040 -2191645 484454
384 686778 262640 -590733 -543874 1505530 2888453 -7561052 6364177 -1670307 2740715
374 -652382 -2812769 -3331433 1592358 1648459 -6167307 5822326 109434 384791 2935243
365 2935243 -1892804 -36629 3562769 -1814080 -1517943 -537321 -2693104 2659024 -4507499
355c480184E6201K703916J827736c512735J494949B39584J647323f151766F345681
345e867256B917690O1506c550287k639132C179361b063823n16440H10227C05139
335B983030c705550k207122f40240C416224e216474C062919K028034d562606B32490
325a92462C076778E34404e377164D94339A27326e302050A201572b601622E63810
315A173058c668565D713570g58953B723943g08031A98606L22485c209751D020020
305A774375J09243m88186a814441D908503f4435C416031b809416B605218f900340
295A0265138b08068A61989c937459E325525a887202Q78269A340900g33121k630681
286c363802a089202D651179a572657C243380a533631j820099D024333b361402
$$ plain form
355 -3480184 56201 2760117 4587853 -3512735 -2017786 239584 1886907 -6151766 6345681
345 -5867256 2917690 2979196 -3550287 -6189419 3179361 -2063823 -2580263 810227 305139
335 2983030 -3705550 -5912672 -640240 3416224 -5216474 3062919 5090953 -4562606 232490
325 -192462 3076778 534404 -5377164 494339 127326 -5302050 1201572 -2601622 563810
315 1173058 -3668565 4713570 -758953 2723943 -708031 198606 521091 -3209751 4020020
305 1774375 1883618 1395432 -1814441 4908503 -64435 3416031 -2809416 2605218 -6900340
295 10265138 -208068 161989 -3937459 5325525 -1887202 -1008933 1340900 -733121 -3363802
286 -3363802 -1089202 4651179 -1572657 3243380 -1533631 -3353730 4024333 -2361402
277e86066A539445b473339A700033m85643J808445e243878a667126A548824b06263
267A606807L062612G37005i23650A908632b122366E659321c30990k312712E15542
257c386717i72013E781847D8535f05754j734471H18605O56035c57379k936404
248c293783Q61468f466A343274K663477b904773a49957C213696f46660j543925
239b190585C297477a160397A751042c612188D569194a017263A780846d221180
230G16449a115039j154027E042088c920903a083471B212438A41626b778302g77213
220A75941O94680L028131b905851a57294F60779J639678l51472B67594J078711
211A346305C78662j214N88913b626889d60982p233748C199295G83533K547031
$$ plain form
277 -586066 1539445 -2473339 1700033 1214390 3022835 -5243878 -1667126 1548824 -206263
267 1606807 4669419 737005 -923650 1908632 -2122366 5659321 -330990 -2643702 515542
257 -3386717 -972013 5781847 48535 -605754 -2340225 818605 1474640 -357379 -3293783
248 -3293783 -2432315 -6466 1343274 4006751 -2904773 -149957 3213696 -646660 -2190585
239 -2190585 3297477 -1160397 1751042 -3612188 4569194 -1017263 1780846 -4221180
230 716449 -1115039 -2269066 5042088 -3920903 -1083471 2212438 141626 -2778302 -777213
220 175941 870621 3898752 -2905851 -157294 660779 2300457 1948985 267594 1346305
211 1346305 378662 377448 966361 -2626889 -460982 -7694730 3199295 783533 3330564
202C330564j645326d200297C340717f78404C125833G55054O3756e1385E57223
192B28492a22511j562652A62874K081155A88326J447839k37273J577651j295944
183A680599d13290o96898L42026k766927C867714n38346a002529p46096D664706
173C331602J589396J4980662N3223742r393383h6642683O407472o2236488b8046214
164f1611365G3260495P63819N2779843a6469953p14531c888045K32355H21151
155b565348C753632b828616f93384k510480A645070h70027j653906A024475b089028
145E46667L001172N32648a334448l0297f05719B353685a422957N7831C62241e56800
134B523375f03470D556131c327263l057694C139291a486505A491357a909468j719251
$$ plain form
202 3330564 1685238 -4200297 3340717 -678404 3125833 755054 818810 -51385 557223
192 228492 -122511 -1685163 162874 2244029 188326 1636165 1398892 2976543 1680599
183 1680599 -413290 -1110188 -768162 -3535089 3867714 3329368 -1002529 -1748625 4664706
173 3331602 4920998 19901660 73125402 63732019 -86642683 -80235211 -142471699 -28046214
164 -61611365 73260495 74024314 126804157 -16469953 -17184484 -3888045 -3655690 821151
155 -2565348 3753632 -2828616 -693384 -3203864 1645070 -870027 -2523933 1024475 -2089028
145 546667 3547839 4080487 -1334448 -1364745 -605719 2353685 -1422957 -1365126 362241 -556800
134 2523375 -603470 4556131 -3327263 -6384957 3139291 -1486505 1491357 -1909468 -3628719
125c628719J736014f89758A04019N227171c011085B63515O01540a419851k5093
116a444944B477930b51034j404791B523740c841450i29783D50232P489684h107713
106e21421I91136d825772B130281c013160e02712K46240m307771k799138c673369
96b829009J103996c51456n256328B60559c212356Q09737C511899L354049A050480
86c415382A218406B39164N80024J67453K23290j80868c757790d18C639848e507135
75A022208a697620A770232C85855J763447c534604d8045B647588J691657g03770
65A467529d159700I80009C03788K381580f3994A278168d19528k132758A023987
55D659111e592711a599723B633726A300265a879401j101135E912927f60257D83904
$$ plain form
125 -3628719 -1892705 -689758 104019 5331190 -3011085 263515 865055 -1419851 -1444944
116 -1444944 2477930 -251034 -1655825 2523740 -3841450 -929783 450232 7939916 -8107713
106 -521421 991136 -4825772 2130281 -3013160 -502712 -256472 -4564243 -7363381 -3673369
96 -2829009 -1725013 -351456 -5607784 260559 -3212356 -2402619 3511899 6865948 1050480
86 -3415382 1218406 239164 819188 986641 1209931 1029063 -3757790 -418 3639848 -5507135
75 1022208 -1697620 1770232 385855 2149302 -3534604 -48045 2647588 4339245 -703770
65 1467529 -4159700 980009 303788 2685368 -63994 1278168 -419528 -2552286 1023987
55 4659111 -5592711 -1599723 2633726 1300265 -1879401 -2980536 5912927 -660257 483904
45g601343D446347j935896a35558m210130E72333e47593j360298H97904Q25305
36A723209a299618k05067C05328J279338J969840j542719m27098a520006e95407
26a312815l3007D699556e182059b04795j538147I67188d49350l232448F70193
16d743746n26799B399680d605264B964203G27743a334540C258748b079073d90489
6a105112B476636b661474B049512q34181N93226g33471
$$ plain form
45 -7601343 4446347 2510451 -135558 -4345688 572333 -547593 -1907891 897904 1723209
36 1723209 -1299618 -1504685 305328 1584666 3554506 2011787 1584689 -1520006 -595407
26 -1312815 -1345822 4699556 -5182059 -204795 -1742942 967188 -449350 -3681798 670193
16 -4743746 -5270545 2399680 -4605264 2964203 727743 -1334540 3258748 -2079073 -490489
6 -1105112 2476636 -2661474 2049512 1215331 1808557 -733471
##PAGE= F1=5575.183789999
##FIRST=     21204.543296753, 2644.21089616403, -1974083
##DATA TABLE= (F2++(Y..Y)), PROFILE
2047a974083E63199h91908j443806A179595a16402B552906l97042a433884G026965
2037c519406a397471k445889E81753e54684B352931O52646i2610A138552a932005
2027b9013p92029B687433n82576A009318B52185M795339r80302b077120J028791
$$ plain form
2047 -1974083 563199 -891908 -2335714 1179595 -116402 2552906 2155864 -1433884 7026965
2037 -3519406 -1397471 -3843360 581753 -554684 2352931 3005577 -92610 1138552 -1932005
2027 -29013 -821042 2687433 2104857 1009318 252185 5047524 4067222 -2077120 -1048329
$$ [...]
##END NTUPLES=nD NMR SPECTRUM
##END=
