##TITLE=Analysis number 325325
Compound Code cc 38013
Book Reference 423/128/2
Project Code adrs
Chemist Name bruced
##JCAMPDX= 6.0         $$ Bruker NMR JCAMP-DX V2.0
##DATA TYPE= NMR SPECTRUM
##DATA CLASS= NTUPLES
##ORIGIN= Bruker BioSpin GmbH
##OWNER= nmr
$$ XWIN-NMR		Version 3.5
$$ Tue Dec 19 11:08:43 2006 GMT Standard Time (UT+0h)  MAYBRIDGE\nmr@NMR_250MHZ
##.OBSERVE FREQUENCY= 250.131544655141
##.OBSERVE NUCLEUS= ^1H
##.ACQUISITION MODE= SIMULTANEOUS (DQD)
##.ACQUISITION SCHEME= undefined
##.AVERAGES= 16
##.DIGITISER RES= 18
##SPECTROMETER/DATA SYSTEM= dpx250
##.PULSE SEQUENCE= zg30
##.SOLVENT NAME= CDCl3
##.SHIFT REFERENCE= (INTERNAL, CDCl3, 0, 16.5256)
##AUDIT TRAIL= $$ (NUMBER, WHEN, WHO, WHERE, WHAT)
$$ ##TITLE= Audit trail, XWIN-NMR		Version 3.5
$$ ##JCAMPDX= 5.01
$$ ##ORIGIN= Bruker BioSpin GmbH
$$ ##OWNER= nmr
$$ C:\u/data/dgb/nmr/ADRS/1870/pdata/1/auditp.txt
$$ ##AUDIT TRAIL=  $$ (NUMBER, WHEN, WHO, WHERE, WHAT)
(   1,<2006-12-19 11:08:20.16 +000>,<MAYBRIDGE\nmr>,<NMR_250MHZ>,
      <created by zg, POWCHK disabled, PULCHK disabled
       configuration hash MD5:
       49 4B E0 1D 92 C2 6B 37 9F E6 65 BC 52 41 86 1D
       data hash MD5: 64K
       03 8F 35 CE E0 0B 90 81 23 79 70 EB 26 1A 2F B7>)
(   2,<2006-12-19 11:08:33.97 +000>,<MAYBRIDGE\nmr>,<NMR_250MHZ>,
      <Start of raw data processing
       ef LB = 0.3 FT_mod = 6 PKNL = 1 SI = 32K 
       data hash MD5: 32K
       AA 47 01 E3 21 A5 D5 BC 9B C2 70 B9 72 BC 5B A6>)
(   3,<2006-12-19 11:08:35.80 +000>,<MAYBRIDGE\nmr>,<NMR_250MHZ>,
      <apk 
       data hash MD5: 32K
       02 BC 5D EC 23 F2 34 33 1A 38 2E 7B 9B 2F B1 1C>)
(   4,<2006-12-19 11:08:36.49 +000>,<MAYBRIDGE\nmr>,<NMR_250MHZ>,
      <abs ABSG = 5 
       data hash MD5: 32K
       79 5F 6E B1 BF BB 6B D7 0F 71 33 1C 49 AC FF 72>)
$$ ##END=
$$ 
$$ hash MD5
$$ 54 98 F6 56 0D F1 B8 6E 05 57 76 32 95 03 12 04
##$RELAX= 
##$RELAX= 
##$RELAX= 
##$RELAX= 
##$RELAX= 
##$RELAX= 
##$RELAX= 
$$ Bruker specific parameters
$$ --------------------------
##$DU= <C:\u>
##$EXPNO= 1870
##$NAME= <ADRS>
##$PROCNO= 1
##$TYPE= <nmr>
##$USER= <dgb>
##$AMP= (0..31)
100 100 100 100 100 100 100 100 100 100 100 100 100 100 100 100 100 100 
100 100 100 100 100 100 100 100 100 100 100 100 100 100 
##$AQSEQ= 0
##$AQ_mod= 3
##$AUNM= <au_zg>
##$AUTOPOS= <18 >
##$BF1= 250.13
##$BF2= 250.13
##$BF3= 250.13
##$BF4= 250.13
##$BF5= 500.13
##$BF6= 500.13
##$BF7= 500.13
##$BF8= 500.13
##$BYTORDA= 1
##$CFDGTYP= 0
##$CFRGTYP= 5
##$CHEMSTR= <none>
##$CNST= (0..31)
1 1 145 1 1 1 1 1 1 1 1 1 1 1 1 1 1 1 1 1 1 1 1 1 1 1 1 1 1 1 1 1 
##$CPDPRG= <>
##$CPDPRG1= <>
##$CPDPRG2= <>
##$CPDPRG3= <>
##$CPDPRG4= <mlev>
##$CPDPRG5= <mlev>
##$CPDPRG6= <mlev>
##$CPDPRG7= <mlev>
##$CPDPRG8= <mlev>
##$CPDPRGB= <>
##$CPDPRGT= <>
##$D= (0..31)
0 1 0 0 0 0 0 0 0 0.06 0 0 0 0 0 0 0.0002 0 0 0 0 0 0 0 0 0 0 0 0 0 0 
0 
##$DATE= 1166526498
##$DBL= (0..7)
120 120 120 120 120 120 120 120 
##$DBP= (0..7)
150 150 150 150 150 150 150 150 
##$DBP07= 0
##$DBPNAM0= <>
##$DBPNAM1= <>
$$ [...]
##$SUBNAM7= <"">
##$SUBNAM8= <"">
##$SUBNAM9= <"">
##$SW= 20.6930455092707
##$SWIBOX= (0..15)
0 0 3 0 0 0 0 0 0 0 0 0 0 0 0 0 
##$SW_h= 5175.983436853
##$TD= 65536
##$TD0= 1
##$TE= 295.16
##$TE2= 300
##$TE3= 300
##$TEG= 300
##$TL= (0..7)
0 120 120 120 120 120 120 120 
##$TP= (0..7)
150 150 150 150 150 150 150 150 
##$TP07= 0
##$TPNAME0= <>
##$TPNAME1= <>
##$TPNAME2= <>
##$TPNAME3= <>
##$TPNAME4= <>
##$TPNAME5= <>
##$TPNAME6= <>
##$TPNAME7= <>
##$TPOAL= (0..7)
0.5 0.5 0.5 0.5 0.5 0.5 0.5 0.5 
##$TPOFFS= (0..7)
0 0 0 0 0 0 0 0 
##$TUNHIN= 0
##$TUNHOUT= 0
##$TUNXOUT= 0
##$USERA1= <user>
##$USERA2= <user>
##$USERA3= <user>
##$USERA4= <user>
##$USERA5= <user>
##$V9= 5
##$VALIST= <valist>
##$VCLIST= <CCCCCCCCCCCCCCC>
##$VD= 0
##$VDLIST= <DDDDDDDDDDDDDDD>
##$VPLIST= <PPPPPPPPPPPPPPP>
##$VTLIST= <TTTTTTTTTTTTTTT>
##$WBST= 1024
##$WBSW= 4
##$XGAIN= (0..3)
0 0 0 0 
##$XL= 0
##$YL= 0
##$YMAX_a= 356031
##$YMIN_a= -444032
##$ZGOPTNS= <>
##$ZL1= 120
##$ZL2= 120
##$ZL3= 120
##$ZL4= 120
##$ABSF1= 16.5256
##$ABSF2= -4.167572
##$ABSG= 5
##$ABSL= 3
##$ALPHA= 0
##$AQORDER= 0
##$ASSFAC= 0
##$ASSFACI= 0
##$ASSFACX= 0
##$ASSWID= 0
##$AUNMP= <proc_1d>
##$AZFE= 0.1
##$AZFW= 0.1
##$BCFW= 0
##$BC_mod= 0
##$BYTORDP= 0
##$COROFFS= 0
##$CY= 12.5
##$DATMOD= 1
##$DC= 0
##$DFILT= <>
##$DTYPP= 0
##$F1P= 14.0000005364418
##$F2P= -0.99999901652339
##$FCOR= 0.5
##$FTSIZE= 32768
##$FT_mod= 6
##$GAMMA= 0
##$GB= 0
##$INTBC= 1
##$INTSCL= 1
##$ISEN= 128
##$LB= 0.3
##$LEV0= 0
##$LPBIN= 0
##$MAXI= 10000
##$MC2= 0
##$MEAN= 0
##$ME_mod= 0
##$MI= 0
##$NCOEF= 0
##$NC_proc= -4
##$NLEV= 6
##$NOISF1= 0
##$NOISF2= 0
##$NSP= 0
##$NTH_PI= 0
##$NZP= 0
##$OFFSET= 16.5256
##$PC= 1
##$PHC0= 224.5123
##$PHC1= 6.371427
##$PH_mod= 1
##$PKNL= yes
##$PPARMOD= 0
##$PSCAL= 4
##$PSIGN= 0
##$REVERSE= no
##$SF= 250.129999097641
##$SI= 32768
##$SIGF1= 0
##$SIGF2= 0
##$SINO= 400
##$SIOLD= 32768
##$SREGLST= <1H.CDCl3>
##$SSB= 0
##$STSI= 32768
##$STSR= 0
##$SW_p= 5175.98343685301
##$SYMM= 0
##$S_DEV= 0
##$TDeff= 65536
##$TDoff= 0
##$TI= <Analysis number 999999
Compound Code 99
Book Reference 9
Project Code 9>
##$TILT= no
##$TM1= 0
##$TM2= 0
##$TOPLEV= 0
##$USERP1= <user>
##$USERP2= <user>
##$USERP3= <user>
##$USERP4= <user>
##$USERP5= <user>
##$WDW= 1
##$XDIM= 32768
##$YMAX_p= 331519951
##$YMIN_p= -108091
$$ End of Bruker specific parameters
$$ ---------------------------------
##NTUPLES= NMR SPECTRUM
##VAR_NAME=  FREQUENCY,     SPECTRUM/REAL,   SPECTRUM/IMAG
##SYMBOL=    X,             R,               I
##VAR_TYPE=  INDEPENDENT,   DEPENDENT,       DEPENDENT
##VAR_FORM=  AFFN,          ASDF,            ASDF
##VAR_DIM=   32768,         32768,           32768
##UNITS=     HZ,            ARBITRARY UNITS, ARBITRARY UNITS
##FACTOR=    0.157963299565203, 1,           1
##FIRST=     4133.54842148171, 0,            0
##LAST=      -1042.4350153713, 0,            0
##MIN=       -1042.4350153713, -108091,      0
##MAX=       4133.54842148171, 331519951,    0
$$ Real data points
##PAGE= N=1
##DATA TABLE= (X++(R..R)), XYDATA
$$ [...]
18346A497863J02970R9874N1486O1586O3772O9446J06053J63183K53923K61373
$$ 1497863 1600833 1700707 1752193 1813779 1877551 1946997 2053050 2216233 2470156 2731529
18336B731529K80662L03990L59464M58899N37178O22452P74597R88986J334247
$$ 2731529 3012191 3316181 3675645 4134544 4671722 5294174 6068771 7057757 8392004
18327H392004J812417K602660L777012N397581P223146R026575J0169764P434425
$$ 8392004 10204421 12807081 16584093 21981674 29204820 38231395 48401159 55835584
18319E5835584j223034j0788614j3123405r648097n445323k760450j484881j007257
$$ 55835584 54612550 43823936 30700531 21052434 15607111 12846661 11361780 10354523
18311A0354523r59320j039862q36111n12648r4096J19101K3648l95507p38346
$$ 10354523 9395203 8355341 7519230 7006582 6912486 7031587 7055235 6659728 5921382
18302E921382p79945n95282l38725j48389j4297N7799N2028P8632J76931K40602
$$ 5921382 5141437 4546155 4207430 4059041 4044744 4102543 4154571 4233203 4410134 4650736
18292D650736K63757L29146M08709M23629M22564M71727N98496P98107J068875
$$ 4650736 4914493 5243639 5652348 6075977 6498541 6970268 7568764 8366871 9435746
18283I435746J388502J803965K473236L513476N028412O974383R011595J1135321
$$ 9435746 10824248 12628213 15101449 18614925 23643337 30617720 39629315 50764636
18275E0764636J1731158P238423k881865r449612p768561j556135M210702P449649
$$ 50764636 62495794 69734217 66852352 57402740 49634179 48078044 52288746 59738395
18267E9738395N462730l257210j2655254j4560133j0615691o055220l268860j929936
$$ 59738395 65201125 61943915 49288661 34728528 24112837 18057617 14788757 12858821
18259A2858821j391711j427131j588114j446633j136866p41183m82578k78673
$$ 12858821 11467110 10039979 8451865 7005232 5868366 5127183 4644605 4365932
18251D365932j95514j83648j07172j696k3887k2716M6043J03567P3561k5234o2103
$$ 4365932 4170418 3986770 3879598 3877902 3854015 3831299 3877342 3980909 4054470 4029236 3967133
18240C967133m4738R8711J80283K67076L69797M21562M31737M62610O31403Q78573
$$ 3967133 3922395 4021106 4201389 4468465 4838262 5259824 5691561 6154171 6785574 7664147
18230G664147J179328J634865K273968L269915M823590O696823Q649101J0596743
$$ 7664147 8843475 10478340 12752308 16022223 20845813 27542636 36191737 46788480
18222D6788480J0722410N180300o550998j4511482j4287118r609941n554800l277482
$$ 46788480 57510890 62691190 56140192 41628710 27341592 17731651 12176851 8899369
18214H899369k098526j424610j011436p16558n31122m42536l39256k66583k07800
$$ 8899369 6800843 5376233 4364797 3648239 3117117 2674581 2335325 2068742 1860942
18205A860942j73883j23517r2927l1648k756p270K6145k1826q1034q3504l6984
$$ 1860942 1687059 1563542 1470615 1438967 1436211 1428941 1455086 1433260 1352226 1268722 1231738
18194A231738l1137p9393n3667J6222M0184k1613j17792j09353n8323o0543m1369
$$ 1231738 1200601 1121208 1067541 1083763 1123947 1102334 984542 875189 816866 756323 714954
18183G14954L7174M3926j083m3232o3458n5832k945O090K1989K9269m5982m8275
$$ 714954 752128 796054 794971 751739 688281 632449 629504 635594 657583 686852 640870 592595
18171E92595p0135r4439q4694l3869l950p690n980J1957j1115r064k8488j7012
$$ 592595 522460 428021 343327 309458 305508 297818 291838 303795 292680 283616 255128 238116
18159B38116q655J7134K1441k2668J3513K6210K9511m547R861k5962m262L9410
$$ 238116 229461 246595 268036 245368 258881 285091 314602 310055 319916 293954 289692 329102
18147C29102K9989n809k5609j372K3275J089K4193K5711J0066J8029K2650O8629
$$ 329102 359091 353282 327673 326301 349576 350665 374858 400569 410635 428664 451314 519943
18135E19943M3116N4477Q0227Q2856J15306J58817J67412J37377Q9046P1079J06999
$$ 519943 563059 617536 697763 780619 895925 1054742 1222154 1359531 1448577 1519656 1626655
18124A626655J22366J55802J94658K42759L02560L69707M49045N67068O88838
$$ 1626655 1749021 1904823 2099481 2342240 2644800 3014507 3463552 4030620 4719458
18115D719458R23528J342083K133107L487384N075128O147408P807652J2147631
$$ 4719458 5642986 6985069 9118176 12605560 17680688 23828096 31635748 43783379
18107D3783379L043068j6681267j3565085o810572l364467j808749j111603p59508
$$ 43783379 46826447 30145180 16580095 9769523 6405056 4596307 3484704 2725196
18099B725196n31749l77814k80587k13815j48444j46254j39738j03249q7834n7054
$$ 2725196 2193447 1815633 1535046 1321231 1172787 1026533 886795 783546 695712 638658
18089F38658o3000n5217l7591l4356m9416o0365n1246K0627J4024l4522m8276
$$ 638658 575658 520441 482850 448494 399078 338713 287467 308094 322118 287596 239320
18078B39320l9154l7591q483j7722p993R720j1887k765l1569j2246J3906J0911
$$ 239320 200166 162575 154092 136370 128377 138097 126210 123445 91876 79630 93536 104447
18066A04447k6302j2099K5358K3403K9714J4507l439p298J5024K3764n85l3879
$$ 104447 78145 66046 91404 114807 144521 159028 155589 148291 163315 187079 186494 152615
18054A52615l7436j0487M12k0150j7277M318J2270k1460O220K1695l563l0274
$$ 152615 115179 104692 105104 84954 67677 71995 84265 62805 69025 90720 87157 56883
18042E6883k1686J4450J0671K6499m735k4706o210L569J673l251K1902J7403n335
$$ 56883 35197 49647 60318 86817 82082 57376 51166 54735 56408 53157 75059 92462 87127
18029H7127k1472m1406K1908Q294O61r149q580K638J0408J073j4506J534J6834
$$ 87127 65655 24249 46157 54451 55112 45963 37383 40021 50429 51502 36996 38530 55364
18016E5364L458N168k2791o723n975k7439n549k478L3944K4144k4252j897L500
$$ 55364 58822 63990 41199 34476 28501 1062 -4487 -6965 26979 51123 26871 24974 28474
18003B8474R368J568m664N503j1427j7410J0157J731m333J5473J6287j5085J475
$$ 28474 37842 39410 34746 40249 28822 11412 21569 23300 18967 34440 50727 35642 37117
17990C7117J460J5533r947l4667j3263K1799J4167L0514J4209l2632j7522j3899
$$ 37117 38577 54110 44163 9496 -3767 18032 32199 62713 76922 44290 26768 12869
17978A2869J2609Q540J2798O710k2685r588k651j3979J75j1849K787Q898j3167
$$ 12869 25478 34018 46816 53526 30841 21253 18602 4623 4798 -7051 -4264 4634 -8533
17965h533L639l370M91P369N754J4816Q923k1663j2492r088p541n638K8175P348
$$ -8533 -4894 -8264 -7773 -404 5350 20166 29089 7426 -5066 -14154 -21695 -27333 842 8190
17951H190Q151j0937J0562K198r84K9207j1752q018R144j534m0962k9250K1017
$$ 8190 16341 5404 15966 18164 17180 46387 34635 26617 35761 34227 -6735 -35985 -14968
17938a4968L2971J795K0403J3693n827l327j1976j5679j9126J0248k8682j6695
$$ -14968 18003 19798 40201 53894 48067 44740 32764 17085 -2041 8207 -20475 -37170
17926c7170j9022J2965K2856N012K0749R613n872q421L4235J886m4274J6495K8767
$$ -37170 -56192 -43227 -20371 -15359 5390 15003 9131 710 34945 36831 -7443 9052 37819
17913C7819j3764k3923j1069q272k3845j1184n399K8712R869j1345J167K1689
$$ 37819 24055 132 -10937 -19209 -43054 -54238 -59637 -30925 -21056 -32401 -31234 -9545
17901i545K5193K323j9989J3172n555K863R170j5953o183M208k277K3023j256
$$ -9545 15648 17971 -2018 11154 5599 8462 17632 1679 -4504 -296 -2573 20450 19194
17888A9194q575j1211k047J2055j8249j6008j2899K5076J9088Q169j451J9907
$$ 19194 10619 -592 -2639 9416 -8833 -24841 -37740 -12664 6424 14593 13142 33049
17876C3049p770k1666l6108J5549N636p409J2010J5393j3668l339L2399M045K3046
$$ 33049 25279 3613 -32495 -16946 -11310 -18719 -6709 8684 -4984 -8323 24076 28121 51167
17863E1167j2811l0252o222J1973J3996n402j3393l07O22K3763k561k645j8411
$$ 51167 38356 8104 1882 13855 27851 22449 9056 8749 9371 33134 30573 27928 9517
17850I517K1049L3504K926j3288m0078j8540N118J2128j17k4967j1019J2457K2886
$$ 9517 30566 64070 66996 53708 13630 -4910 208 12336 12219 -12748 -23767 -11310 11576
17837A1576m621j0936J434K6612P702N79k1907l670L6226J4522J3449Q285k5701
$$ 11576 6955 -3981 -2547 24065 31767 32346 10439 6769 42995 57517 70966 79251 53550
17824E3550k7262J5051L3754K8428K1835L4466N7228M3838J538J674l7987o3211
$$ 53550 26288 41339 75093 103521 125356 159822 217050 260888 262426 264100 226113 162902
17812A62902l5872k5411j4315j8856N021L3370L225k4544k4115j5853l8547Q352
$$ 162902 127030 101619 87304 68448 73469 106839 110064 85520 61405 45552 7005 15357
17800A5357j64J0584j6182o68J6241j9916m5871J8399j209j1585N140J9207j0057
$$ 15357 15193 25777 9595 8927 25168 5252 -40619 -22220 -23429 -35014 -29874 -10667 -20724
17787b0724J8134L1286j6889j1494q647j6930J3026K7569n570Q57L8315J2145
$$ -20724 -2590 28696 11807 313 -8334 -25264 -12238 15331 9761 10618 48933 61078
17775F1078n823J2040L2354O8765O5972L1732L332j4824j4575j1167P070J8929
$$ 61078 55255 67295 99649 168414 234386 266118 269450 254626 240051 228884 235954 254883
17763B54883J4989J1040l2099p7073l7397l5834p683J575j6306p168M365l6568
$$ 254883 269872 280912 248813 171740 134343 98509 90826 92401 76095 68927 73292 36724
17751C6724l0399N111J7778j531j6831p145l600j0891J2758p762j6606j6996P050
$$ 36724 6325 11436 29214 27683 10852 3707 107 -10784 1974 -5788 -22394 -39390 -32340
17738c2340m106J8929J7927J104p320j1562M258M527K3674J5193k6784l708j2680
$$ -32340 -36446 -17517 410 1514 -5806 -17368 -13110 -8583 15091 30284 3500 -208 -12888
17725a2888J2049K3148M1207N4756J6470L7853O7862N2746L9562o597p5642q9397
$$ -12888 -839 22309 63516 118272 134742 172595 240457 293203 332765 326168 250526 161129
17713A61129n7798l5694m8561k0292K0016J2171p517o275j0367k3993j865J4718
$$ 161129 103331 67637 19076 -1216 18800 30971 23454 17179 6812 -17181 -19046 -4328
17701d328N90j0093L6087K8706n087q573J2183k0202N774k732n006j8056k9275
$$ -4328 -3738 -13831 22256 50962 45875 37302 49485 29283 35057 32325 27319 9263 -20012
17688b0012K1446J1197l543k2809N842L5180J3728k2070R595m198R188n365K2841
$$ -20012 1434 12631 9088 -13721 -7879 27301 41029 18959 28554 24356 33544 28179 51020
17675E1020j742J7195M9944J4514J5846K7374J3841j30K1318K5126Q0054O1816
$$ 51020 49278 66473 116417 130931 146777 174151 187992 187862 209180 234306 314360 376176
17663C76176R1756P7265J26954J77489J79260J37940J50660K24169J58693m2506
$$ 376176 467932 545197 672151 849640 1028900 1166840 1317500 1541669 1700362 1657856
17653A657856j02574l4899J0748j32278k52341k04250j49529j84425j71686r8057
$$ 1657856 1555282 1520383 1531131 1398853 1146512 942262 792733 608308 436622 338565
17643C38565p8817p2099k4229j9340k3819j4000r187j1394p324j9441k8959K9696
$$ 338565 259748 187649 163420 144080 120261 106261 97074 85680 78356 58915 29956 59652
17631E9652Q527P952J2008n056r524J6314l258j4290m69j4635m0562M84J2672
$$ 59652 68179 76131 88139 83083 73559 89873 86615 72325 71856 57221 16659 17143 29815
17618B9815r006k8963p038j1403K772J0558m29N912q189J3255L9250k7652k1925
$$ 29815 20809 -8154 -15192 -26595 -23823 -13265 -13694 -7782 -15971 -2716 36534 8882 -13043
17605a3043J653k9803J2434K8514J4184l9332J5305L2092O901J16J4227k8062
$$ -13043 -11390 -41193 -28759 -245 13939 -25393 -10088 22004 28905 29021 43248 15186
17593A5186q208j6827j6082M0431M0076o438j3229K49r203k4721J910j306R233
$$ 15186 6978 -9849 -25931 14500 54576 48138 34909 35158 25955 1234 3144 1838 11071
17580A1071P768K425j7437l0411M753J4636M926r414O953Q53l5501k773K3318
$$ 11071 18839 21264 3827 -26584 -21831 -7195 -2269 -11683 -4730 -3877 -39378 -42151 -18833
17567a8833J9270K7084k666k3723r507J9782N078j568j0301J8748K3193M576l7138
$$ -18833 437 27521 24855 1132 -8375 11407 16485 14917 4616 23364 46557 51133 13995
17554A3995k051J6295l1621k2269K6998J3549K3026j3593O004J7173L421j2942
$$ 13995 11944 28239 -3382 -25651 1347 14896 37922 24329 30333 47506 50927 37985
17542C7985r204j1945J322L8383O711r472k2649n33J5329k4807k7121K1262J1605
$$ 37985 28781 16836 18158 56541 63252 53780 31131 30598 45927 21120 -6001 15261 26866
17529B6866K4883Q066l7308k5596l886L5334J2787q65k8724m3221p406K510j64
$$ 26866 51749 59815 22507 -3089 -6975 28359 41146 40281 11557 -31664 -39070 -36560 -36724
17516c6724L1772P802J2368q37q599j2052J3277O401J0827K2129r468l2192k4897
$$ -36724 -4952 2850 15218 14381 5782 -6270 7007 13408 24235 46364 36896 4704 -20193
17503b0193M953j2401J1948K0264J2041l4202J9758N063k6535M2249M2979q830
$$ -20193 -15240 -27641 -15693 4571 16612 -17590 2168 7231 -19304 22945 65924 57094
17491E7094j5759m450j0055P316J0683Q527q322k9850J4274K1059k3685k5709
$$ 57094 41335 36885 26830 34146 44829 53356 45034 15184 29458 50517 26832 1123
17479A123n092K900J990Q839j0293k7071J9999J7155k6481L022o739o604L41K153
$$ 1123 -3969 -1069 921 9760 -533 -27604 -7605 9550 -16931 -13909 -20648 -27252 -26911 -24758
17465b4758L0029M0716k1000k3253R118K7102k8263K1174P511r789k732m110n98
$$ -24758 5271 45987 24987 1734 10852 37954 9691 30865 38376 28587 25855 21745 21147
17452B1147O7j5179J4314m152j8080J0542L2917M8157K1071K0390M7621Q6625
$$ 21147 21214 6035 20349 16197 -1883 8659 41576 89733 110804 131194 178815 265440
17440B65440l5901p6408n1850k9667o976r380k8551m462p534l0104J113Q354o426
$$ 265440 229539 153131 101281 71614 64638 55258 26707 22245 14711 -15393 -14280 -5926 -12352
17427a2352M00l851j3837j0065N960K5150r747R349J0577n429j3113Q658J6928
$$ -12352 -11952 -15803 -29640 -39705 -33745 -8595 -18342 -8993 1584 -3845 -16958 -8300 8628
17414H628j0587m908j4379p836J1247o021R201J1176j6927j3342J0043K3145J0046
$$ 8628 -1959 -6867 -21246 -29082 -17835 -23856 -14655 -3479 -20406 -33748 -23705 -560 9486
17401I486l5699n196p052O666P870J6775J9267J0675K611j8058K02N0357J5287
$$ 9486 -26213 -31409 -38461 -31795 -23925 -7150 12117 22792 25403 7345 7547 57904 73191
17388G3191k2661j5592J532o721k2606K4924j075j1037l6234J6925K1062J692
$$ 73191 50530 34938 36470 29749 7143 32067 30992 19955 -16279 646 21708 23400
17376B3400j3281k0574p544K4746K68q343m604Q560k0542J945j590N3R326K2409
$$ 23400 10119 -10455 -17999 6747 7015 -1328 -5932 2628 -17914 -15969 -17559 -17506 -8180 14229
17362A4229J9786p557p773Q390M310j1185k7983k1665J5141J7768N553j5392j5630
$$ 14229 34015 26458 18685 27075 31385 20200 -7783 -29448 -14307 3461 9014 -6378 -22008
17349b2008N380J6297J4256K4034j63J0599P474J0168j336J141m313k8235N015
$$ -22008 -16628 -331 13925 37959 37796 48395 55869 66037 64701 65842 61529 33294 38309
17336C8309j5566j7701L4730J1795R397N9556N9014m484J3260J7531M2703K8556
$$ 38309 22743 5042 39772 51567 60964 120520 179534 175050 188310 205841 248544 277100
17324B77100J9963M7012K8688N420J5971J525j2660j0416k8337k1535j6242m1696
$$ 277100 297063 344075 372763 378183 394154 395679 383019 372603 344266 322731 306489 264793
17312B64793o6798l8316l2131m0451j8915k2389M377j0067j6931Q867j373J2089
$$ 264793 197995 159679 127548 87097 68182 45793 50170 40103 23172 32039 30666 42755
17300D2755K5021j2821j9852j2897J862J9027K6423Q327l1906j9880L2810J9827
$$ 42755 67776 54955 35103 22206 24068 43095 69518 77845 45939 26059 58869 78696
17288G8696Q024l749J5969J0818J926j654Q783L4350N3577L8269M3665L1861J9967
$$ 78696 86720 82971 98940 109758 111684 110030 118813 153163 206740 245009 288674 320535 340502
17275C40502K1612O969j2205O129Q8l2537m3724m4014m0857m8177j3162q050j2598
$$ 340502 362114 369083 356878 363007 363095 330558 286834 242820 201963 153786 140624 132574 119976
17262A19976j3429k4126l9442l8016Q596l005j5840J198K8504R669n20J2212p44
$$ 119976 106547 82421 42979 4963 13559 10554 -5286 -4088 24416 34085 33565 45777 45033
17249D5033j535l3356P261R271l879j8910r107q158K149l492j4658K1200K3437
$$ 45033 43498 10142 17403 26674 22795 3885 -5222 -13380 -11231 -14723 -29381 -8181 15256
17236A5256L536M807o40k8666n919K1850J673N34p434P618j481m100j0482J6331
$$ 15256 18792 23599 22959 -5707 -11626 10224 11897 12431 4997 12615 11134 7034 -3448 12883
17222A2883L9476K5785m122j5811k0268j2091k631N359J851j1218K50q108L713
$$ 12883 52359 78144 74022 58211 37943 25852 23221 28580 30431 19213 19463 11355 15068
17209A5068n02j767J0903r13P812K420R67N168k949j6797M624M764l533r044R08
$$ 15068 14566 12799 23702 22789 30601 33021 33988 39156 36207 19410 24034 28798 25265 16221 17129
17194A7129K616J6958l107J3172p134J1720l1322O509k79J6028N375n256j2594
$$ 17129 19745 36703 33596 46768 39634 51354 20032 26541 26262 42290 47665 42409 29815
17181B9815k2261q871K3308J1322P285M300J0314M952J2119J9291k685J918j9537
$$ 29815 7554 -1317 21991 33313 40598 44898 55212 60164 72283 91574 88889 90807 71270
17168G1270o528J3133L5902O369j4377j4065j1221J9943q785k1079J2701K7526
$$ 71270 64742 77875 113777 120146 105769 91704 80483 100426 91641 70562 83263 110789
17156A10789j4770n682j249p310O957K973l537K09k6964P632J3149K4713P884
$$ 110789 96019 90337 89088 81778 88735 91708 88171 88380 61416 69048 82197 106910 114794
17143A14794N930J2824P350L0661J6934L5019P140l1611J6607J7193Q353K8771
$$ 114794 120724 133548 140898 171559 188493 223512 230652 199041 215648 232841 241194 269965
17131B69965K4730L6647M2165L5861K2990N6408O6086M4041J04830J96864J55157
$$ 269965 294695 331342 373507 409368 432358 488766 554852 598893 703723 900587 1055744
17120A055744K05082L04960L93938M30507M48170M57210M39131M67685L83781
$$ 1055744 1260826 1565786 1959724 2390231 2838401 3295611 3734742 4202427 4586208
17111D586208J63488J5279j13049j76858k81853m55464n60462n41487m60864m06090
$$ 4586208 4749696 4764975 4651926 4475068 4193215 3737751 3177289 2635802 2174938 1768848
17101A768848l62265l32380k28120j74299j14492q2871m8536k6039l9479l2591
$$ 1768848 1406583 1074203 846083 671784 557292 474421 425885 399846 360367 327776
17091C27776j87O282J8360L2819L7090P326J4015J6473L3242L3156N5654J1571
$$ 327776 327589 333871 352231 385050 422140 429466 443481 459954 493196 526352 582006 593577
17079E93577Q676N6571P9700J36851J84074K14732K50492L27440M34748M35828
$$ 593577 602253 658824 738524 875375 1059449 1274181 1524673 1852113 2286861 2722689
17069B722689M30214M30932M16749L41305J39954l0666j02949j62494k85320m65437
$$ 2722689 3152903 3583835 4000584 4341889 4481843 4451177 4348228 4185734 3900414 3434977
17059C434977n53452m99140m15241l59687l54705k91479k15594j66799r5872m7885
$$ 3434977 2881525 2382385 1967144 1607457 1252752 961273 745679 578880 483008 435123
17049D35123p1147o8392m1556p404j6021k6586j4240j620J840o162j4909j5246
$$ 435123 363976 295584 254028 246624 230603 204017 189777 188157 189997 183835 168926 153680
17037A53680k8594j6609j9214J827J3167J6957j0862j860K853q552Q335Q063M27
$$ 153680 125086 108477 89263 91090 104257 121214 110352 108492 111345 102793 111128 119191 119618
17024A19618N157J2584l186K247j5869K964Q004N9n735k0779m939m338p255l3875
$$ 119618 124775 137359 134173 136420 120551 123515 131519 131578 125843 105064 100125 95787 88532 54657
17010E4657l161K1573q067o535r821j6565P685R104J9085J9980k217k9921j8087
$$ 54657 51496 73069 65002 58467 48646 32081 39766 48870 67955 87935 85718 55797 37710
16997C7710j6183L0019M570J825k753j2762k8531j0721J4874L7053K3985j5950
$$ 37710 21527 51546 56116 57941 55188 42426 13895 3174 18048 55101 79086 63136
16985F3136j3395L0907m211j9341L436K3177K6280K3953j568k8207J1373N322
$$ 63136 49741 80648 76437 57096 60532 83709 109989 133942 132374 104167 115540 120862
16973A20862K6127N3024K8599J7505J1014M9040K6590J8742J8846L912L4104K8139
$$ 120862 146989 200013 228612 246117 257131 306171 332761 351503 370349 374261 408365 436504
16961D36504N1549J5370j6616k4396k3320m4290n5782k8895n4295m6746k4407
$$ 436504 488053 503423 486807 462411 439091 394801 339019 310124 255829 209083 184676
16950A84676j0218n73K1924J0273o108j3176o356j2021J1421J1879J4430O955
$$ 184676 174458 173885 195809 206082 199974 186798 180442 168421 179842 191721 206151 213106
16938B13106K3087l683k2799j5473l8473j6062K2442K2442L2638J3736Q677L431
$$ 213106 236193 232510 209711 194238 155765 139703 162145 184587 217225 230961 239638 243069
16926B43069m3299k3162J3187L3602j3947j3447K3466K3743m551M4307O2122M5397
$$ 243069 199770 176608 189795 223397 209450 196003 219469 243212 238661 282968 345090 390487
16914C90487K7559M3191N0069M2295J3541o75J5247J361k0154m6160l5738j5217
$$ 390487 418046 461237 511306 553601 567142 566467 581714 583075 562921 516761 481023 465806
16902D65806j6381m4089m6467l5743k5727j7821q828k2884L4566M6119J551Q446
$$ 465806 449425 405336 358869 323126 297399 279578 270750 247866 282432 328551 330102 338548
16890C38548q177k7853j1558K8644J2115K291J9975K0804j8123l8744j8127l518
$$ 338548 330371 302518 290960 319604 331719 334010 353985 374789 356666 317922 299795 296277
16878B96277J3170M291o368j0348l7537K7409O333m621O633J7650J1270J1145
$$ 296277 309447 313738 307370 297022 259485 286894 293227 288606 295239 312889 324159 335304
16866C35304j539K1875L6317K7644L4497M961Q149L3783K3799L3506M0717O5675
$$ 335304 333765 355640 391957 419601 454098 459059 467208 500991 524790 558296 599013 664688
16854F64688J6393j1493J1977L0825Q753R227K7263L083K1941N8813P7380J03784
$$ 664688 681081 669588 681565 712390 721143 730370 757633 760716 782657 841470 918850 1022634
16842A022634R2516J18895J11074J03108J79630K13828K58097K45575K90742L18960
$$ 1022634 1115150 1234045 1345119 1448227 1627857 1841685 2099782 2345357 2636099 2955059
16832B955059K81660L07721L56247M04365M29108M42209N39054O61550P83266
$$ 2955059 3236719 3544440 3900687 4305052 4734160 5176369 5715423 6376973 7160239
16823G160239R58312J205302J500009J967768K609978L418529M442064N628368
$$ 7160239 8118551 9323853 10823862 12791630 15401608 18820137 23262201 28890569
16815B8890569O622187O957665O911588O959234O526740M758161J923725m38264
$$ 28890569 35512756 42470421 49382009 56341243 62867983 67626144 69549869 69111605
16807F9111605j738777l158819n407795p694767q371799p632312o813438o210831
$$ 69111605 67372828 64214009 58806214 51111447 42739648 35107336 28293898 22083067
16799B2083067n284083l984038k693866j774123j197378q28817n79515l98684
$$ 22083067 16798984 12814946 10121080 8346957 7149579 6320762 5741247 5342563
16791E342563k52980j51595p7834j1864L6630Q1385J17712J70844J99351K50353
$$ 5342563 5089583 4937988 4860154 4848290 4884920 4966305 5084017 5254861 5454212 5704565
16781E704565L36574M47639N63632O83932Q83724J146058J485876J957953K643219
$$ 5704565 6041139 6488778 7052410 7736342 8620066 9766124 11252000 13209953 15853172
16772A5853172L533406M561489N623918O410039O570644O464677O442681N705758
$$ 15853172 19386578 23948067 29571985 35982024 42552668 49017345 55460026 61165784
16764F1165784L494643P76963j137416k234087l731350n982143p668534p750693
$$ 61165784 64660427 65437390 64299974 62065887 58334537 52352394 44683860 36933167
16756C6933167o868810o204536n621604m632904l375992k291748j524891j098661
$$ 36933167 30064357 23859821 18238217 13605313 10229321 7937573 6412682 5314021
16748E314021p93862o21713m78627l86065l25351k82765k51653k09585j51573
$$ 5314021 4520159 3898446 3419819 3033754 2708403 2425638 2173985 1964400 1812827
16739A812827j46465j53960j56056j50295j03240p4450o9753p3853q7338p0924
$$ 1812827 1666362 1512402 1356346 1206051 1102811 1028361 958608 884755 797417 726493
16729G26493n1658l6283k0883j6999k2918k3231k4876j9222J328K6463j1898K5651
$$ 726493 674835 638552 617669 600670 577752 554521 529645 510423 511751 538214 526316 551967
16717E51967M3028K2174K0181J6114M0547M7023K803r492p725j1857k0129m3523
$$ 551967 594995 617169 637350 653464 694011 741034 743837 734345 726620 714763 694634 651111
16705F51111p5652q3289o8465j3008j5182m8638k6733k880j3259J306q547k2425
$$ 651111 575459 492170 423705 410697 395515 346877 320144 317264 304005 305311 296764 274339
16693B74339k4524J1047K6236j0855M685j9357j1052j568j4826m286Q277k832
$$ 274339 249815 260862 287098 276243 280928 261571 250519 248951 234125 229839 238116 235284
16681B35284K5240L6950O729K725K8266K5804L0922L3634N179N48J9284M9327
$$ 235284 260524 297474 304203 306928 335194 360998 391920 425554 430733 431281 450565 499892
16669D99892M6516K3773m385p739k486K4113N365n0148l4555k8833m8024o3142
$$ 499892 546408 570181 565796 558057 555571 579684 585049 534901 500346 471513 423489 360347
16657C60347m3897m6147o851o922m1779r526j9600k3541J0488k7248j2799N342
$$ 360347 316450 270303 263452 256530 214751 205225 185625 162084 172572 145324 132525 137867
16645A37867m901k7207L971j9792O37O286k1208j5787P305j6400J2769J5370j2387
$$ 137867 132966 105759 109730 89938 90575 96861 75653 59866 67171 50771 63540 78910 66523
16632F6523n369K5545L2257J1173j8772M929M4266L7667J333L562M399n281K316
$$ 66523 61154 86699 118956 130129 111357 116286 160552 198219 199552 203114 207513 202232 204548
16619B04548N429O151O291l4745l2655j7612L436Q62L553J4536L041k2439o479
$$ 204548 209977 216128 222419 187674 155019 137407 140843 141705 145258 159794 162835 140396 133917
16606A33917m531j0232j6227r448L1186k345K028M046l139N681l0938L620J9164
$$ 133917 129386 119154 102927 93479 124665 122320 124348 128394 125255 130936 99998 103618 122782
16593A22782L584J0517j0178j0110j7031l37K9573O437k9513j8614J5102N1863
$$ 122782 126366 136883 126705 116595 99564 99227 128800 135237 105724 87110 102212 154075
16581A54075J5365n1126j8883L3798J6414j0998n896l093L1827R417J3917K6J8155
$$ 154075 169440 118314 99431 133229 149643 138645 132749 129656 161483 170900 184817 184843 202998
16568B02998p261l1914o804l4467l4771K0616J6199q484J5072M863j3331j326
$$ 202998 195737 163823 157019 122552 87781 108397 124596 116112 131184 136047 122716 121390
16556A21390J7690j305m314K3308N562j9230j854j2793K9319K5418Q275k1739
$$ 121390 139080 137775 133461 156769 162331 143101 141247 128454 157773 183191 191466 169727
16544A69727O627K0354m36J6438O275k683m892M298j6340K0020K4321j9773k7717
$$ 169727 176354 196708 196272 212710 218985 216302 211410 215708 199368 219388 243709 223936 196219
16531A96219l269J5944L5291J9528Q201K2273j870q446R361K100Q867J1263m6072
$$ 196219 192950 208894 244185 263713 271914 294187 292317 283871 293232 295332 304199 315462 269390
16518B69390k7879J4391L487M1892N963J0644J2393j865J4039N170m833o26J5340
$$ 269390 241511 255902 259389 301281 307244 317888 330281 328416 342455 347625 342792 342166 357506
16505C57506J5635N3263L0964j6914J0001J3036K8721J9030L6808K4783K7950
$$ 357506 373141 426404 457368 440454 450455 463491 492212 511242 548050 572833 600783
16494F00783P966M5523L6282P8564P2443Q1195O2372P6053Q2087O9916J43813
$$ 600783 608749 654272 690554 769118 841561 922756 985128 1061181 1143268 1213184 1356997
16483A356997J49853J58492J59358K03449K52935L00757L29157L70521M12296
$$ 1356997 1506850 1665342 1824700 2028149 2281084 2581841 2910998 3281519 3693815
16474C693815M69452N50184O23857P29000R23764J074130J239871J510456J768776
$$ 3693815 4163267 4713451 5337308 6066308 6990072 8064202 9304073 10814529 12583305
16465A2583305K097894K598536L204279L929116M914849O226362P354898P626907
$$ 12583305 14681199 17279735 20484014 24413130 29327979 35554341 42909239 50536146
16457E0536146P231037O771881N769309L381930N16789j606487l076521m835985
$$ 50536146 57767183 64539064 70308373 73690303 74207092 72600605 69524084 64688099
16449F4688099p156961q742683q713877p977197p324443o212832m674112l218865
$$ 64688099 57531138 48788455 40074578 32097381 24772938 18560106 13885994 10667129
16441A0667129k086314j367586r52846o62841m67418l10261k56063j94079j66644
$$ 10667129 8580815 7213229 6260383 5597542 5130124 4819863 4563800 4369721 4203077
16432D203077j57689j32046q7374p2004n5638k2205K1007R2280J42782K03214
$$ 4203077 4045388 3913342 3825968 3753964 3698326 3676121 3697128 3789408 3932190 4135404
16422D135404L04006L95613M23028N35539P03257Q14366R55532J161138J390459
$$ 4135404 4439410 4835023 5258051 5793590 6496847 7311213 8266745 9427883 10818342
16413A0818342J648328J948953K401326K996581L742859M682706N888229O944342
$$ 10818342 12466670 14415623 16816949 19813530 23556389 28239095 34127324 41071666
16405D1071666P225732O817084O332212N366402L038271K44534j748950l086056
$$ 41071666 48297398 55114482 61446694 66813096 69851367 70095901 68346951 65260895
16397F5260895m678402o834373q292671q286251p557679o868273n875305m407329
$$ 65260895 60582493 53748120 45455449 37169198 29611519 22743246 16867941 12460612
16389A2460612l003788j987288j312717r21110o76933m69392l53170k59818k02353
$$ 12460612 9456824 7469536 6156819 5235709 4558776 4089384 3736214 3476396 3274043
16380C274043k18109k08170k20831k05974k04731k24251k00831j61340j14030
$$ 3274043 3055934 2847764 2626933 2420959 2216228 1991977 1791146 1629806 1515776
16371A515776q2846p3685n5158k1855l0865l5290m0008k6205l899o3211p5245
$$ 1515776 1432930 1359245 1304087 1282232 1251367 1216077 1176069 1149864 1145965 1082754 1007509
16360A007509p7840o6921n8260o2681p2124q5573p0621m8040m6559l1206P86k962
$$ 1007509 929669 862748 804488 741807 669683 584110 513489 465449 418890 387684 388470 385508
16348C85508M067k0714m4735k4171o52K629j8402n545J3637j6381k1483O0k2538
$$ 385508 389575 368861 324126 299955 299303 301932 283530 277985 291622 275241 253758 253818 231280
16335B31280j7727r57j0017q076j0384J4463m790K983N581R011o275l4902Q631
$$ 231280 213553 212596 202579 194503 184119 198582 193792 196775 202356 211367 205092 170190 178821
16322A78821M7092L8110K2933L9216M2015K2514P741J8798M9514J9655J6097N640
$$ 178821 225913 264023 286956 326172 368187 390701 398442 417240 466754 486409 502506 508146
16310E08146K2987J4027k7238p6209n2023k9476k9059l4336j8195j9082n760j1627
$$ 508146 531133 545160 517922 441713 389690 360214 331155 296819 278624 259542 253782 242155
16298B42155K9196M4278M4523K8586P605L8039K3191o750j6332k0231l2068l4549
$$ 242155 271351 315629 360152 388738 396343 434382 457573 450823 434491 414260 382192 347643
16286C47643n0907n1987j4185k3311m0984n4891K098k1537l7538l816K3801j3484
$$ 347643 296736 244749 230564 207253 166269 111378 113476 91939 54401 50585 74386 60902
16274F0902K1158K2679p79j6107p679M881L6785r971l5269j2166M4140L459j7623
$$ 60902 82060 104739 103960 87853 80174 85055 121840 111869 76600 64434 108574 112033 94410
16261I4410j2846k428K3792O552K2174M919k3063Q50J5010N6448N1304N1316J9751
$$ 94410 81564 79136 102928 109480 131654 136573 113510 114360 129370 185818 237122 288438 308189
16248C08189K1611J9470n897Q604q861l2622j9470k436k4754o2083l0878k9944
$$ 308189 329800 349270 343373 351977 343116 310494 291024 288588 263834 201751 170873 140929
16236A40929p973k9295l0250l930j8606l423j4105j7009j9002Q288K3081J1792
$$ 140929 132956 103661 73411 69481 50875 47452 33347 16338 -2664 5624 28705 40497
16224D0497J968j2746L237j81r721p832j5257K2060l897Q431J929l304L191K6978
$$ 40497 42465 29719 32956 32775 23054 15222 -35 22025 18128 26559 28488 25184 28375 55353
16210E5353q864R80J1603p270k0055l884j219J8594j3811J3623j5899l5055K988
$$ 55353 46489 47469 59072 51802 31747 27863 26644 45238 31427 45050 29151 -5904 -2916
16197b916J1588L4271J173J8333q592k5106J439J7889p388k7169l7603Q237L8800
$$ -2916 8672 42943 44116 62449 53857 28751 30190 48079 40691 13522 -24081 -15844 22956
16184B2956J366j093j5500k5658O734K1785N410q814Q803P187m600K5015M130
$$ 22956 24322 23229 7729 -17929 -11195 10590 16000 7186 15989 23176 18576 43591 47721
16171D7721j1079n983j5094q097N053L9287M77j2801m3427k081K4422J1687j3464
$$ 47721 36642 30659 15565 7468 12521 51808 52285 39484 -3943 -6024 18398 30085 16621
16158A6621q036K1862m432Q61J1682j378q445q487q963L944P616j3263r695p067
$$ 16621 8585 30447 26015 26876 38558 37180 28735 20248 11285 15229 22845 9582 -113 -7180
16144g180k342L504K4084O338J0375j494j572L668J2371R049M506n37r481l801
$$ -7180 -9522 -6018 18066 24404 34779 33285 31713 35381 47752 56801 61307 60770 51289 47488
16130D7488N344k0720m0282j2960P997o255j5235J8920K75K734J1278j3435o720
$$ 47488 52832 32112 -8170 -21130 -13133 -19388 -34623 -15703 -15428 -12694 -1416 -14851 -21571
16117b1571l077k257K0423K619j1520j772j199k2308k4981j7786J992K6472M9310
$$ -21571 -24648 -26905 -6482 -3863 -15383 -17155 -18354 -40662 -65643 -83429 -81437 -54965 -5655
16104e655J6561j5288N332j3308P340M653j3305K1090P731j6838o396N015K1107
$$ -5655 10906 -4382 950 -12358 -5018 -365 -13670 7420 15151 -1687 -8083 -3068 18039
16091A8039j816l386j9011j6406k1473j5874P235j0419M431M6425O665m038K9602
$$ 18039 16223 12837 -6174 -22580 -44053 -59927 -52692 -63111 -58680 -12255 -5590 -9628 19974
16078A9974k9284k1903p741o522J5367n592P383J4881K5323J2728j5217j0414
$$ 19974 -9310 -31213 -38954 -45476 -30109 -35701 -28318 -13437 11886 24614 9397 -1017
16066a017o244k4142J2518M74j7399j3185j7798J0586M1723J6997j6511r930J0782
$$ -1017 -7261 -31403 -18885 -18411 -35810 -48995 -66793 -56207 -14484 2513 -13998 -23928 -13146
16053a3146P749K4468L911J5716J8689J9065m0340k8929K304K739j8649j7863
$$ -13146 -5397 19071 22982 38698 57387 76452 36112 7183 9487 12226 -6423 -24286
16041b4286j4629n709J6350K5370K2715l0958l8804m987M1685J9359j8158O890
$$ -24286 -38915 -44624 -28274 -2904 19811 -11147 -49951 -54938 -13253 6106 -12052 -5162
16029e162j094J203j2919J2262j4354q141L246J3868J7482P041r759j182k7619
$$ -5162 -6256 -5053 -17972 -5710 -20064 -28205 -24959 -11091 6391 13432 3673 2491 -25128
16016b5128K488J3459p608K621m933K8357J7791R397J3849j3425j7500J8947J3785
$$ -25128 -22640 -9181 -16789 -14168 -19101 9256 27047 36444 50293 36868 19368 38315 52100
16003E2100K675j9925m0986j2279J4521J2481k837o830j1068J8802O660J8451
$$ 52100 54775 34850 -6136 -18415 -3894 8587 5750 -1080 -12148 6654 13314 31765
15991C1765j927k5085Q129J1421q741J4861P967l1143k115M5290J0410M654l2793
$$ 31765 29838 4753 12882 24303 15562 30423 38390 7247 5132 50422 60832 65486 32693
15978C2693m1196l555O349r907l4728P292J9598K9276J3895q230k884K6977K2129
$$ 32693 -8503 -12058 -5709 -15616 -50344 -43052 -23454 5822 19717 11487 8603 35580 57709
15965E7709k4252m6311k176j7549m666K8989K6246K831k3239K0970J8757n164
$$ 57709 33457 -12854 -15030 -32579 -37245 -8256 17990 20821 -2418 18552 37309 32145
15953C2145j3129l9581m612L3877N3545M2322L2388J9895N0359L2240N580K7591
$$ 32145 19016 -20565 -25177 8700 62245 104567 136955 156850 207209 239449 245029 272620
15941B72620M7929J6560L5355J063k4943k4015k8945o7844n8505k5578j8126j4703
$$ 272620 320549 337109 372464 373527 348584 324569 295624 227780 169275 143697 125571 110868
15929A10868k2748k7140m5568k0231J1692m100j011o729j0750N542k5769j8160
$$ 110868 88120 60980 15412 -4819 6873 2773 1762 -4967 -15717 -10175 -35944 -54104
15917e4104n572J5787O801o635p539J0980J1600l402k715O647K6701J8269Q573
$$ -54104 -59676 -43889 -37088 -43723 -51262 -40282 -28682 -32084 -34799 -28152 -1451 16818 25391
15904B5391J4599K9267R332k8892J0614p465J6206M2518K1219K7828J0013K0762
$$ 25391 39990 69257 78589 49697 60311 52846 69052 111570 132789 160617 170630 191392
15892A91392K7005J0893K4368K5950L8411M3041J3704m602l3155k0708n5700m1903
$$ 191392 218397 229290 253658 279608 318019 361060 374764 370162 337007 316299 260599 218696
15880B18696j3203j8760m9711k4391j6437j4990j0426l5839m9334J632l33J2720
$$ 218696 205493 186733 137022 112631 96194 81204 70778 34939 -14395 -12763 -13096 -376
15868c76K3955j0904j2657j2901m631K1421N5j5747k2128m567q47M0829p479l3096
$$ -376 23579 12675 18 -12883 -17514 3907 3962 -11785 -33913 -38480 -39327 1502 -5977 -39073
15854c9073j906J1229J1826L6458j3585j1746o616n175j2069K00J10m044r45j650
$$ -39073 -40979 -29750 -17924 18534 4949 -6797 -13413 -18588 -30657 -30457 -30347 -34391 -35336 -36986
15840c6986l282J4137j199Q375L3077J0857M290l1699O321K957n229l0936j9309
$$ -36986 -40268 -26131 -27330 -18955 14122 24979 29269 -2430 3891 6848 1619 -29317 -48626
15827d8626k3167L33J6780J1489L8922J3540k2346l4669p998J7226K6446J1197
$$ -48626 -71793 -71460 -54680 -43191 -4269 9271 -13075 -47744 -55742 -38516 -12070 -873
15815h73j4259l6891m761L133J9205L2195R740j4995q856j8468J644N109j2819
$$ -873 -15132 -52023 -56784 -53651 -34446 -2251 7489 -7506 -16362 -34830 -33186 -28077 -40896
15802d0896J4596K3572L429j2034k7341n670O64M394R091L3005j0981j491j833
$$ -40896 -26300 -2728 701 -11333 -38674 -44344 -43680 -39286 -30195 2810 -8171 -9662 -11495
15789a1495r544J28M05j8491k2470K1893J5743q736P925J8344j0493j2402k092
$$ -11495 -21039 -20911 -20506 -38997 -61467 -39574 -23831 -32567 -24642 -6298 -16791 -29193 -31285
15776c1285L0999pq651l5755K835P061k224J6447m748N65m795l0264J4560M2799
$$ -31285 -286 -293 -8944 -44699 -41864 -34803 -37027 -20580 -25328 -24763 -29558 -59822 -45262 -2463
15762b463L9323j2478L778j4827j8777O722K8599Q492K185M584k7824p805O575
$$ -2463 36860 24382 28160 13333 -5444 1278 29877 38369 40554 45138 17314 9509 16084
15749A6084j141j3912L997K4443q660k877j5304l966j6358p107k2412r521k320
$$ 16084 14943 1031 5028 29471 20811 17934 2630 -1336 -17694 -24801 -47213 -56734 -59054
15736e9054j1102J1918O867q402l204J8991m245J2450l490J6533q266p82J1957
$$ -59054 -70156 -58238 -51371 -59773 -62977 -43986 -48231 -35781 -39271 -22738 -31004 -31786 -19829
15723a9829J5717j3549O884J0755j1561K18J2603k460k2718k841p27k2296K3932
$$ -19829 -4112 -17661 -10777 -22 -11583 -11365 1238 -1222 -23940 -26781 -27508 -49804 -25872
15710b5872K4156J8344J743n335j6100k4070k262K793m330K245m323L3083J1676
$$ -25872 -1716 16628 18371 13036 -3064 -27134 -29396 -26603 -30933 -28688 -33011 72 11748
15697A1748j8100j3755q909m420J5118l844P000J9331r012l8037J3213J7561j2950
$$ 11748 -6352 -20107 -29016 -33436 -18318 -22162 -15162 4169 -4843 -42880 -29667 -12106 -25056
15684b5056J0231R446j6615J895k068Q911J0462r651k8729n97j4511K4977K4590
$$ -25056 -14825 -5379 -21994 -20099 -22167 -13256 -2794 -12445 -41174 -41771 -56282 -31305 -6715
15671f715J991j0177o33J5522k518k0752j0879J6300O496J7681K3206J6300O954
$$ -6715 -4724 -14901 -15534 -12 -2530 -23282 -34161 -17861 -11365 6316 29522 45822 52776
15658E2776k2049j9932J175K2096r788k2070J365J491j6363k0285j993j2554r540
$$ 52776 30727 10795 11970 34066 24278 2208 3573 5064 -11299 -31584 -33577 -46131 -55671
15645e5671Q977M444q535J4195r843J1797M480k2671J3660j235m260j2471R282
$$ -55671 -46694 -42250 -50785 -36590 -46433 -34636 -30156 -52827 -39167 -40402 -44662 -57133 -47851
15632d7851K9789P368r724k7417Q492J3560K4834K2908k8948k2516k1437N444
$$ -47851 -18062 -10694 -20418 -47835 -39343 -25783 -949 21959 -6989 -29505 -50942 -45498
15620d5498J9107K6891K2321J318k8502j4045k224P316K6380L706l0456l3721
$$ -45498 -26391 500 22821 24139 -4363 -18408 -20632 -13316 13064 16770 -13686 -47407
15608d7407j312L4031K1270l27J1765q81j7560k0116n826K3822j1823J619L1579
$$ -47407 -48719 -14688 6582 6255 18020 17139 -421 -20537 -26363 -2541 -14364 -12745 18834
15595A8834j2624j8998J908j3481j6081k1709l918J5795J7558J5852L5428j2092
$$ 18834 6210 -12788 -10880 -24361 -40442 -62151 -66069 -50274 -32716 -16864 18564 6472
15583F472o766L829k5103M827N011p67J911j0836J1082r07n712j0885R337N618
$$ 6472 -294 3535 -21568 -16741 -11730 -12497 -10586 -21422 -10340 -11247 -16959 -27844 -18507 -12889
15569a2889j6243p058K0447l297P76P365j8316K926J042p0l80J1126q548J0793
$$ -12889 -29132 -36190 -15743 -19040 -18264 -10899 -29215 -26289 -25247 -25317 -25697 -14571 -23119 -12326
15555a2326N990j0624r147m900R372R686P583k6087j2983K5201J4132J7553K5727
$$ -12326 -6336 -16960 -26107 -31007 -21635 -11949 -4366 -30453 -43436 -18235 -4103 13450 39177
15542C9177j2412k7022p077r832J985P833k9222j0023J6166J8324K338m442p105
$$ 39177 26765 -257 -7334 -17166 -15181 -7348 -36570 -46593 -30427 -12103 -9765 -14207 -21312
15529b1312J4829K3222j1118j0867k2340o176j0082M890m005K2133J080J432J6703
$$ -21312 -6483 16739 5621 -5246 -27586 -33762 -43844 -38954 -42959 -20826 -19746 -18314 -1611
15516a611K7099N338r303j3365j5160n948r338N678j0166L3242J3960q864r466
$$ -1611 25488 30826 21523 8158 -7002 -12950 -22288 -16610 -26776 6466 20426 11562 2096
15503B096P576J4922j2524k579K251r263j1349K1980j0669r069p665L6766R981
$$ 2096 9672 24594 12070 9491 11742 2479 -8870 13110 2441 -6628 -14293 22473 32454
15490C2454q090l4864J6625N66p167q816J2649K838M697k1245j5304m606K5542
$$ 32454 24364 -10500 6125 6691 -476 -9292 3357 6195 10892 -10353 -25657 -30263 -4721
15477d721K2359j6317P772k5138j9591k300Q530K221k2799J809J8145J3331K6116
$$ -4721 17638 1321 9093 -16045 -35636 -37936 -29406 -27185 -49984 -48175 -30030 -16699 9417
15464I417J1983j2416l7526Q787J6139q092k6414j9437J3071K3673K2504O10j763
$$ 9417 21400 8984 -28542 -19755 -3616 -11708 -38122 -57559 -44488 -20815 1689 2299 536
15451E36M231J087k2468J4709q096k5917J6608K252k873j5378k67J323J5496N870
$$ 536 4767 5854 -16614 -1905 -10001 -35918 -19310 -17058 -19931 -35309 -35576 -34253 -18757 -12887
15437a2887K454Q39q10K909k5314k1278J4996K0288j4704k083Q621J2272k0930
$$ -12887 -10433 -9594 -10404 -7495 -32809 -54087 -39091 -18803 -33507 -35590 -26969 -14697 -35627
15424c5627n653m930L1737Q977J9388o270k7633N583K2324j5868j1614J163K9927
$$ -35627 -41280 -46210 -14473 -5496 13892 7622 -20011 -14428 7896 -7972 -19586 -18423 11504
15411A1504K0677k4169q356o30l4198j9494N341k6445j4496K1428J5525n276R422
$$ 11504 32181 8012 -344 -974 -35172 -54666 -49325 -75770 -90266 -68838 -53313 -58589 -49167
15398d9167J9720J3116m625l336j2894K8204M7063k493p519k2723m1364R863J8101
$$ -49167 -29447 -16331 -20956 -24292 -37186 -8982 38081 35588 28069 5346 -36018 -26155 -8054
15385h054K0558M246j4011j5213j8665J1091r406j8538j3503J1083L7128K2982
$$ -8054 12504 16750 2739 -12474 -31139 -20048 -29454 -47992 -61495 -50412 -13284 9698
15373I698k4609J4535O730k441o475j5197j9714J3538K9164l155l8907P585K7447
$$ 9698 -14911 -376 6354 3913 -2562 -17759 -37473 -23935 5229 2074 -36833 -29248 -1801
15360a801k530J6285j9530k4572M089K689L67J0355o265k2584j1934J3358l884
$$ -1801 -4331 11954 -7576 -32148 -28059 -25370 -25003 -14648 -20913 -43497 -55431 -42073 -45957
15347d5957K6461N235J9424L002j0920n745j81R257O408k6198r915l0655K3770
$$ -45957 -19496 -14261 5163 8165 -2755 -8500 -8681 576 6984 -19214 -29129 -59784 -36014
15334c6014k476j4501J2554j3159K900J8747L939O310O700l139j059J6660l411
$$ -36014 -38490 -52991 -40437 -53596 -50696 -31949 -28010 -21700 -15000 -18139 -19198 -2538 -5949
15321e949m1389k2030K8344J1677O30j3087r86L6970O731K4542k8534K192N970
$$ -5949 -47338 -69368 -41024 -29347 -28717 -41804 -42790 -5820 911 25453 -3081 -889 5081
15308E081j4265J6563r043r599N960p394o624L750J9375L0066J382k5544k6052
$$ 5081 -9184 7379 -1664 -11263 -5303 -12697 -19321 -15571 3804 33870 35252 9708 -16344
15295a6344L11j9346M223m173j2434r170R51L2932J9678R311j0015l568r709q969
$$ -16344 -16033 -35379 -31156 -35329 -47763 -56933 -55982 -23050 -3372 5939 -4076 -7644 -17353 -26322
15281b6322J446p041k4641K480J3481R466K1118J5452k4071N42Q167Q00O093k3309
$$ -26322 -24876 -31917 -56558 -54078 -40597 -31131 -10013 5439 -18632 -18090 -9923 -9123 -3030 -26339
15267b6339j9557j081J4776K0219p147k0712J1970K2296J4309N077K59j8293l85
$$ -26339 -45896 -46977 -32201 -11982 -19129 -39841 -27871 -5575 8734 13811 14070 -4223 -4608
15254d608j1446r334L417K831k383P472j9164j7971J2891J5210j3741J3237K574
$$ -4608 -16054 -25388 -21971 -19140 -21523 -14051 -33215 -51186 -38295 -23085 -36826 -23589 -21015
15241b1015L412J2331K114k9296q381K6389Q802J0496R095k4155N482L2281l685
$$ -21015 -17603 -5272 -3158 -32454 -40835 -14446 -5644 4852 13947 -10208 -4726 27555 23870
15228B3870l6959j7273M8443R602m1608k0020l772K407K0606j4741j5531m4L024
$$ 23870 -13089 -30362 18081 27683 -13925 -33945 -37717 -35310 -14704 -29445 -44976 -45020 -41996
15215d1996r339R854Q072K0989K1153k5140l81P35m263M070K6294P053r078k2401
$$ -41996 -51335 -41481 -33409 -12420 8733 -16407 -16788 -16053 -20316 -16246 10048 17101 8023 -14378
15201a4378j0168K1271k120Q81M198R54K1735K2725k058l799n6005m067J550J3891
$$ -14378 -24546 -3275 -5395 -4514 -316 638 22373 45098 43040 39241 -16764 -20831 -19281 -5390
15187e390n073j7666Q801K0482K4451k9178j5138j4474j9401L3142L056R615J1552
$$ -5390 -10463 -28129 -19328 1154 25605 -3573 -18711 -33185 -52586 -19444 -16388 -6773 4779
15174D779q091j615L2014o691j9423K032N281m8844o142K5228K8822Q028J0514
$$ 4779 -3312 -4927 27087 20396 973 3005 8286 -40558 -46700 -21472 7350 15378 25892
15161B5892R896r479n918J8066Q236k8855k5523j945K592n894P149J6760M31m034
$$ 25892 35788 26309 20391 38457 46693 17838 -7685 -9630 -7038 -12932 -5783 10977 11408 7374
15147G374l4187k9322J4118K7876n629L639J0906J5291N688j3804r498j7315j8188
$$ 7374 -26813 -56135 -42017 -14141 -19770 -16131 -5225 10066 15754 1950 -7548 -24863 -43051
15134d3051n502P64J959K3726R043r578j0980J4316L2770l0261j9400j3676k6284
$$ -43051 -48553 -47789 -45830 -22104 -13061 -22639 -33619 -19303 13467 -16794 -36194 -49870 -76154
15121g6154q435L8575Q046J4728J9110j8150j3828K2315K2510o516K5984J5350
$$ -76154 -84589 -46014 -37968 -23240 -4130 -22280 -36108 -13793 8717 2201 28185 43535
15109D3535r420m260J5182J3671j4086j4057j4028r092k543J3448M894o346J572
$$ 43535 34115 29855 45037 58708 44622 30565 16537 7445 4902 18350 23244 16898 18470
15096A8470j5778J2921N135L239L661o793J27N448k16j2430o325j0137m0417k8207
$$ 18470 2692 15613 20748 23987 27648 20855 20982 26430 26214 13784 7459 -2678 -43095 -71302
15082g1302J32R99K2223K4792Q625N348j5223J2666M557k3265M148P894P773j2128
$$ -71302 -71170 -70171 -47948 -23156 -14531 -9183 -24406 -11740 -7183 -30448 -26300 -18406 -10633 -22761
15068b2761n365J2646L5053l611m657k2503l247K9706K3205j3209m8954K9130
$$ -22761 -28126 -15480 19573 15962 11305 -11198 -14445 15261 38466 25257 -23697 5433
15056E433J3586L3145l3661J412L282m1306j7358R741J5289k8456j7200n636J2812
$$ 5433 19019 52164 18503 19915 23197 -18109 -35467 -25726 -10437 -38893 -56093 -61729 -48917
15043d8917J114J5320K1971L0442J0967l9398q393K1080l5707K0711Q448k9360
$$ -48917 -47803 -32483 -10512 19930 30897 -8501 -16894 4186 -31521 -10810 -2362 -31722
15031c1722p424M198L148j9587q606J4150J4609J4970J1281j2123j4148K2492
$$ -31722 -39146 -34948 -31800 -51387 -59993 -45843 -31234 -16264 -4983 -17106 -31254 -8762
15019h762M991J0305L1774P606q797j5054k5053n463M220j9806P860R640P126
$$ -8762 -3771 6534 38308 45914 37117 22063 -2990 -8453 -4233 -24039 -16179 -6539 587
15006E87J3766J6481j0004o064K5896j4124j5996J4305j8006k0333M030k6125
$$ 587 14353 30834 20830 14766 40662 26538 10542 24847 6841 -13492 -9462 -35587
14994c5587M942l634j2603K7589J5539l915R102Q107l5073j3290L2562n844j7463
$$ -35587 -30645 -34279 -46882 -19293 -3754 -7669 1433 9540 -25533 -38823 -6261 -12105 -29568
14981b9568k3139J2133O525L0302K5392O017J9774j2397l6801k3600k0008r6p602
$$ -29568 -52707 -40574 -34049 -3747 21645 27662 47436 35039 -1762 -25362 -45370 -45466 -53068
14968e3068P877R345O166r132J6314p869L542O009p894k2891j4276L3179O766
$$ -53068 -45191 -35846 -29680 -38812 -22498 -30367 -26825 -20816 -28710 -51601 -65877 -32698 -25932
14955b5932O335J0403k1433j1089R352K8179J080k3878j4757l835o777p018K3939
$$ -25932 -19597 -9194 -30627 -41716 -32364 -4185 -3105 -26983 -41740 -45575 -52352 -59370 -35431
14942c5431J0143K23m675P837k1761K8710J1404R011R761k529j419n243k6358
$$ -35431 -25288 -25065 -29740 -21903 -43664 -14954 -3550 5461 15222 12693 11274 6031 -20327
14929b0327l831J9916J2722q476k6304j0644j0987k4226P339K5583L0693L2789
$$ -20327 -24158 -4242 8480 4 -26300 -36944 -47931 -72157 -64818 -39235 -8542 24247
14917B4247Q908k454J1552l031J833J6386P520r295J9509k5522l9369K1318m087
$$ 24247 33155 30701 42253 39222 41055 57441 64961 55666 75175 49653 10284 31602 27515
14904B7515l6884n4417J2092j825L2433J2964J3853L1018J1599J1035K344j1520
$$ 27515 -9369 -63786 -51694 -53519 -21086 -8122 5731 36749 48348 59383 61727 50207
14892E0207j5667l2976j6037m619K5954J2030K645l4888j6024l663M616k4853
$$ 50207 34540 1564 -14473 -19092 6862 18892 21537 -13351 -29375 -33038 -28422 -53275
14880e3275r432K0965L8478J3521K1955k6400m1213q968l3438J9447M0938M919
$$ -53275 -62707 -41742 -3264 10257 32212 5812 -35401 -44369 -77807 -58360 -17422 -12503
14868a2503M63J5093l736j2178J5922K9563j3975m5972J5121O341j6945k6887
$$ -12503 -12040 3053 -683 -12861 3061 32624 18649 -27323 -12202 -5861 -22806 -49693
14856d9693j4684R288K1169N48m697j3060J5343K5388J8647J1295j2044j2684
$$ -49693 -64377 -55089 -33920 -33372 -38069 -51129 -35786 -10398 8249 19544 7500 -5184
14844e184j8721q808j1595k9127o515L8632M3970j6469P647P793r869L78k285
$$ -5184 -23905 -32713 -44308 -73435 -79950 -41318 2652 -13817 -6170 1623 -8246 -7868 -10153
14831a0153J5225J4898k3358j4903j2467k992J1197O192J432K0240J8008l345
$$ -10153 5072 19970 -3388 -18291 -30758 -33750 -22553 -16361 -14929 5311 23319 19974
14819A9974j14K7431j3382l5026j0670K985K6518j7873k0755M970K2100Q022j974
$$ 19974 19860 47291 33909 -1117 -11787 -8802 17716 -157 -20912 -15942 6158 14180 12206
14806A2206j0220q387R771r58J0216n745m172n482j2807K0063k879J2352L777
$$ 12206 1986 -6401 3370 2412 12628 6883 2711 -2771 -15578 4485 1606 13958 17735
14793A7735j791R695r400M812L7901k7648l5049l2140M002J4292j2489J7290K8193
$$ 17735 15944 25639 16239 21051 58952 31304 -3745 -35885 -31883 -17591 -30080 -12790 15403
14780A5403j4395k4090n276q306R654J4081M765K9409K695k8931q54J6898J2038
$$ 15403 1008 -23082 -28358 -36664 -27010 -12929 -8164 21245 23940 -4991 -5845 11053 23091
14767B3091j1983J0399J436j2886J1945j2589l3080n954J5725R482M175q851n279
$$ 23091 11108 21507 22943 10057 22002 9413 -23667 -29621 -13896 -4414 -239 -9090 -14369
14754a4369J305R429Q334P98J3145K340r990J6832j4279R404N50p066Q05J760
$$ -14369 -13064 -3635 4699 5497 18642 20982 10992 27824 13545 22949 23499 16433 17238 18998
14740A8998M587L7830q712k2685q813j4430j8319k8769J0831J0926l123l7276
$$ 18998 23585 61415 52703 30018 21205 6775 -11544 -40313 -29482 -18556 -21679 -58955
14728e8955P191K7811K6355R617j0325k5471J746Q884K0897K0210j6090k0933
$$ -58955 -51764 -23953 2402 12019 1694 -23777 -22031 -13147 7750 27960 11870 -9063
14716i063l688n413j7514M913n023J6203j8779j5510J5613N431J8853L990K683
$$ -9063 -12751 -18164 -35678 -30765 -35788 -19585 -38364 -53874 -38261 -32830 -13977 -9987 -7304
14703g304Q709l111M286n177j8300k4978M9377J2184k6183k4375O147R161J982
$$ -7304 1405 -1706 2580 -2597 -20897 -45875 3502 15686 -10497 -34872 -28725 -19564 -17582
14690a7582j4709J6033J8067q921Q943P068k4141k1859M0535J3289J137Q198O997
$$ -17582 -32291 -16258 1809 -7112 1831 8899 -15242 -37101 3434 16723 17860 26058 33055
14677C3055J7082j4464l4471l862K245J2182P547Q143j6429J0048Q922k4304k7504
$$ 33055 50137 35673 1202 -2660 -415 11767 19314 27457 11028 21076 29998 5694 -21810
14664b1810k6767j0080j0006K8573J5122J4834k3310m31K4156l988J6175Q416
$$ -21810 -48577 -58657 -68663 -40090 -24968 -10134 -33444 -33875 -9719 -13707 2468 10884
14652A0884q561J048J3465J7123O483j6164O248j9643M055N286j4736J2723N758
$$ 10884 2323 3371 16836 33959 40442 24278 30526 10883 14938 20224 5488 18211 23969
14639B3969j6883O915j4417j7178K6427K561j5867j7044K52L9861N0599o35l8639
$$ 23969 7086 14001 -416 -17594 8833 11394 -4473 -21517 -21265 18596 69195 68560 29921
14626B9921k9738j4286J3002J9714k006K576j621Q545j222j7948J8274r311k3641
$$ 29921 183 -14103 -1101 18613 16607 19183 17562 26107 24885 6937 25211 15900 -7741
14613g741J6505N377n419R398j105l254P928N693J798k1770j522O981j6789l3219
$$ -7741 8764 14141 8722 18120 17015 13761 21689 27382 29180 7410 5888 12869 -3920 -37139
14599c7139O355K9002L636q679J383P71L6423p097q307k165j6821n4782J384P191
$$ -37139 -30784 -1782 1854 -6825 -5442 -4671 31752 24655 16348 14183 -2638 -57420 -56036 -48845
14585d8845J0524J6530J835J4191j5996J2544K7844q62k6106M067J1528Q93J500
$$ -48845 -38321 -21791 -19956 -5765 -21761 -9217 18627 17765 -8341 -4274 7254 8147 9647
14572I647k7554n413R788O174K2613J047j8525k0183J1485j7646L927K3887R657
$$ 9647 -17907 -23320 -13532 -7358 15255 16302 -2223 -22406 -10921 -28567 -24640 -753 8904
14559H904R133o961J2566J9158o161l911K994l3644r928J9549J229J8154l054
$$ 8904 18037 11076 23642 42800 36639 32728 35722 2078 -7850 11699 12928 31082 28028
14546B8028k7974k6670j5396K6324R960j4465j1272j408K0149P537K2810K7356
$$ 28028 54 -26616 -42012 -15688 -5728 -20193 -31465 -32873 -12724 -5187 17623 44979
14534D4979j112l4448p093J4799L1407K5868j3648m6866j8712J7307j5204j3691
$$ 44979 43867 9419 2326 17125 48532 74400 60752 13886 -4826 12481 -2723 -16414
14522a6414Q107K5286k9293L1920N264n900j6406j0853K5843J6932j2634k094
$$ -16414 -8307 16979 -12314 19606 24870 18970 2564 -8289 17554 34486 21852 19758
14510A9758L2685l41k8691n2808j6786N895L3380K3386J7503j1625r090k696j8201
$$ 19758 52443 52102 23411 -29397 -46183 -40288 -6908 16478 33981 22356 13266 10570 -7631
14497g631l5158J0246N570L058K0054Q711q025j5655J195J9816j4206K0956M723
$$ -7631 -42789 -32543 -26973 -23915 -3861 4850 -3175 -18830 -17635 2181 -12025 8931 13654
14484A3654j6694J2326m115J4054p87J4985j7996j7386j0420J489o401m082K0299
$$ 13654 -3040 9286 5171 19225 18438 33423 15427 -1959 -12379 -10890 -17291 -21373 -1074
14471a074p640n207n358l74J1867p00J2812K1451j5198M23k970K891m315m913
$$ -1074 -8714 -13921 -19279 -19653 -7786 -8486 4326 25777 10579 11002 8032 10923 6608 1695
14457A695J1547j756J2094L1399k6596j2551k2320j5689n91J1859J7664J904p919
$$ 1695 13242 11486 23580 54979 28383 15832 -6488 -22177 -22768 -10909 6755 8659 740
14444G40j0819q665K3019M832r417r531N526M307k1802P938K9406K2049J2605
$$ 740 -10079 -18744 4275 9107 -310 -9841 -4315 -8 -21810 -13872 15534 37583 50188
14431E0188k7567j3715o815j4426M438n219L228j0670k4733R283L0945P752K2441
$$ 50188 22621 8906 2091 -12335 -7897 -13116 -9888 -20558 -45291 -36008 -5063 2689 25130
14418B5130j1509j1829k135M009J6619J4427J4856M488j3106m2110l7615J4009
$$ 25130 13621 1792 -343 3666 20285 34712 49568 54056 40950 -1160 -38775 -24766
14406b4766J7848o261r830j7151L834M5340L2362o706J1306n504r95p956j3396
$$ -24766 -6918 -13179 -23009 -40160 -36326 9014 41376 34670 45976 40472 39477 31521 18125
14393A8125m852R933q134p595J070K6120J117j7394J1410J9380N108N84M425M770
$$ 18125 13273 23206 15072 7477 8547 34667 35784 18390 29800 49180 54288 54872 59297 64067
14379F4067k1300n612l2297l1219J0574L084R043K3308J7701Q400k187m906j4167
$$ 64067 42767 37155 4858 -26361 -15787 -12703 -3660 19648 37349 45749 43562 38656 24489
14366B4489J9536k5249l7453j5402K3977J2441m370l0078j5096K3511K0655Q321
$$ 24489 44025 18776 -18677 -34079 -10102 2339 -2031 -32109 -47205 -23694 -3039 5282
14354E282J2828J2335j0015k1651l1456m891L3090K0559J350N579L505k03o128
$$ 5282 18110 30445 20430 -1221 -32677 -37568 -4478 16081 17431 23010 26515 26312 20184
14341B0184m572O551J4486j4611R040M439L47K3354j7327j7104j4859j0867k4366
$$ 20184 15612 22163 36649 22038 31078 35517 35864 59218 41891 24787 9928 -939 -25305
14328b5305o5K5945L7064J1995j1040k584J2650j5749j8092K631L0530p969j9887
$$ -25305 -25370 575 37639 49634 38594 36010 48660 32911 14819 17450 47980 40011 20124
14315B0124l5485J2484M209j4731k5346K2334J3009J134l384o85J2692N446J329
$$ 20124 -15361 -2877 1332 -13399 -38745 -16411 -3402 -2268 -5652 -6337 6355 11801 13130
14302A3130m3742j960M148K4658R75P837J1551J6401r364N052j2718j5948K927
$$ 13130 -30612 -32572 -28424 -3766 -2791 5046 16597 32998 23634 28686 15968 20 2947
14289B947j0315r62K4602K4177j3620p565l3304k4348j0596N045K9702L4064O067
$$ 2947 -7368 -8330 16272 40449 26829 19264 -14040 -38388 -48984 -43939 -14237 19827 25894
14276B5894l2838k6163O779q400R034J370M426R150M2834J2322k7449j1467J26
$$ 25894 -6944 -33107 -26328 -34728 -25694 -24324 -19898 -10748 32086 44408 16959 5492 5618
14263E618J8342p059o997o786j3741l3194n0L0175J3032j2064k0780m467P072
$$ 5618 23960 16901 9904 3118 -10623 -43817 -43867 -13692 -660 -12724 -33504 -37971 -30899
14250c0899L0400J8424k9969j5117n212Q855K8300K661k9838o713J9142J3416
$$ -30899 -499 17925 -12044 -27161 -32373 -23518 4782 7443 -22395 -29108 -9966 3450
14238C450K0720K906J142j6384J3164j5648j081J1232J0100J8449j9537k3447
$$ 3450 24170 27076 28218 11834 24998 9350 8269 19501 29601 48050 28513 5066
14226E066k0299K623O802K5346j5511j772J5105K3673m025k9285k363P486K0575
$$ 5066 -15233 -12610 -5808 19538 4027 2255 17360 41033 37008 7723 5360 12846 33421
14213C3421p608J174j4312l9348o648J3926J8392L076L2006l052K0712k473l8599
$$ 33421 25813 26987 12675 -26673 -33321 -19395 -1003 2073 34079 31027 51739 49266 10667
14200A0667p423n766j0614L3470p504k5836K0391L2421m890m1758m774J6849J5828
$$ 10667 3244 -2522 -13136 20334 12830 -13006 7385 39806 34916 -6842 -11616 5233 21061
14187B1061k1099l3821J3893K2090j3932L080P638L1313j814j6616k0743Q30K1344
$$ 21061 -38 -33859 -19966 2124 -11808 -8728 -1090 30223 28409 11793 -8950 -8120 13224
14174A3224j3864j2335J5378L8695k6468m3662n202k768P373m776K1621K4624
$$ 13224 -640 -12975 2403 41098 14630 -29032 -34234 -37002 -29629 -34405 -12784 11840
14162A1840j0541l2649o805n812J0350L0612L640N47m413r942j0026j8781N3764
$$ 11840 1299 -31350 -38155 -43967 -33617 -3005 635 1182 -3231 -13173 -23199 -41980 11784
14149A1784L5104O784j0212l0315k3493J8190Q606J8495J9382j0979q666k1468
$$ 11784 46888 53672 43460 13145 -10348 7842 16448 34943 54325 43346 34680 13212
14137A3212j3655k3134k6738q61L0593M4278J6786J7506J4609q072k2639L580
$$ 13212 -443 -23577 -50315 -51176 -20583 23695 40481 57987 72596 64524 41885 45465
14125D5465l2913j1392l814k3132K024J5562K0157l088k5113p831O387J9570K9404
$$ 45465 12552 1160 -2654 -25786 -23762 -8200 11957 8869 -16244 -24075 -17688 1882 31286
14112C1286J020j2086k2157k632P934k744K2557l98o690O249m1763k3026M1665
$$ 31286 32306 20220 -1937 -4569 3365 621 23178 22780 16090 22339 -19424 -42450 -785
14099g85K9915K1006J6223L096l1319j2952n70j7734p706K4499J7658j3054j4866
$$ -785 29130 50136 66359 69455 38136 25184 24614 6880 -826 23673 41331 28277 13411
14086A3411J1954j5651j6847q597J7862R865J0473p599J9649J9813R715Q546K585
$$ 13411 25365 9714 -7133 -15730 2132 11997 22470 14871 34520 54333 64048 72594 75179
14073G5179N388n65J3045q388k3381j3715k6569L5556M992k5592Q400J5262r182
$$ 75179 80567 80002 93047 84659 61278 47563 20994 56550 61542 35950 44350 59612 50430
14060E0430J6546j9847k5019k716K689k1215J2734K0978O741L0789n450K847K049
$$ 50430 66976 47129 22110 19394 22083 868 13602 34580 41321 72110 66660 69507 71556
14047G1556L0447k5458l7726O89J2602J7998Q337P864j2819M823K9790L1346N4574
$$ 71556 102003 76545 38819 39508 52110 70108 78445 86309 73490 78313 108103 139449 194023
14034A94023O0908K0864j6951M814j6790p699l3223l5968k7622q488k3068j7367
$$ 194023 254931 275795 258844 263658 246868 239169 205946 169978 142356 133868 110800 93433
14022I3433j1461K992j5472j2146l6842k1089N606j4819k0479J7175J2913r011
$$ 93433 81972 84964 69492 57346 20504 -585 5021 -9798 -30277 -13102 -189 -9200
14010i200J0840J7561k848q041L375j2505N515l188j6046L2233K2724O93o892
$$ -9200 1640 19201 16353 8312 11687 -818 4697 1509 -14537 17696 40420 41113 34221
13997C4221j4531L1845q145k4504j2392k7476J486Q673J306k3875j6063P30L3276
$$ 34221 19690 51535 43390 18886 6494 -20982 -19496 -10823 -9517 -33392 -49455 -48725 -15449
13984a5449j786j4891J5258K8074K3860k2583k7979m2741k380K2204K1372R890
$$ -15449 -17235 -32126 -16868 11206 35066 12483 -15496 -58237 -60617 -38413 -17041 -7151
13972g151k8544k5461N804j219L4714L1876K9683j2161m6715j2737J2045K7026
$$ -7151 -35695 -61156 -55352 -56571 -21857 10019 39702 27541 -19174 -31911 -19866 7160
13960G160p850j9506J1762J6192L6861j1928o374j1023l1744R491l25j397J361
$$ 7160 -690 -20196 -8434 7758 44619 32691 26317 15294 -16450 -6959 -7284 -8681 -7320
13947g320j3048j3477j1508o394J0796J9658K2860J5974j713Q474L694j3423K56
$$ -7320 -20368 -33845 -45353 -51747 -40951 -21293 1567 17541 15828 24302 27996 14573 14829
13934A4829J321q231l360L6766N919J1700P529j7026j5378l5371k6499k981J0286
$$ 14829 16150 7919 4559 41325 47244 58944 66473 49447 34069 -1302 -27801 -30782 -20496
13921b0496J2282J0393j95L915k236O531J3129k2219j2586P194K8950R897N121
$$ -20496 -8214 2179 1984 5899 3663 10194 23323 1104 -11482 -4288 24662 34559 39680
13908C9680P82k9977j644J2268J1853q630K143K7527J8912j0926k3203O015J908
$$ 39680 40462 10485 8841 21109 32962 24332 26475 54002 72914 61988 38785 44800 46708
13895D6708J0066k651o479K4656K348j6937j6756K728p386P41j5647q2J9658J3152
$$ 46708 56774 54123 47644 72300 74648 57711 40955 43683 36297 37038 21391 21309 40967 54119
13881E4119J3673L5257L1270K1874N0354K2792j5576r986J7981O932p604k8548
$$ 54119 67792 103049 134319 156193 206547 229339 213763 203777 221758 228690 221086 192538
13869A92538k5612o63k0978l2709k2368k0290l2194p27L6781J3139k6072n3130
$$ 192538 166926 166263 145285 112576 90208 69918 37724 36997 73778 86917 60845 7715
13857G715r17L3297K0828p256p982m0177k8576J5350n799J1165L022J173J5647
$$ 7715 6798 40095 60923 53667 45685 5508 -23068 -7718 -13517 -2352 670 1843 17490
13844A7490m053K1638O738k3299j5108O515o495K7536J3956j0775l0367J5860
$$ 17490 13437 35075 41813 18514 3406 9921 3426 30962 44918 34143 3776 19636
13832A9636J9481k6154l9013p699M6265J2989J205K0049M100j5318l193j3173
$$ 19636 39117 12963 -26050 -33749 12516 25505 26710 46759 50859 35541 32348 19175
13820A9175k859k6811J9403L0468j064j9964j3068J3103J9406j1562K6859K1615
$$ 19175 16316 -10495 8908 39376 38312 18348 5280 18383 37789 26227 53086 74701
13808G4701J993k4495l351j0128n295l74J1736M312j1878J1449K228K2807J5754
$$ 74701 76694 52199 48848 38720 33425 33051 44787 49099 37221 48670 50898 73705 89459
13795H9459J0437n356n6666k2436L9957J0375k3445o235K558r572J3912j6627
$$ 89459 99896 94540 37874 15438 55395 65770 42325 36090 38648 29076 42988 26361
13783B6361k5263O486N148m200j1375J3610K4827k423l225j0506N542L2846m780
$$ 26361 1098 7584 12732 8532 -2843 10767 35594 33171 29946 19440 24982 57828 53048
13770E3048k3060j6655J6455p118j0924J4456K2979j5795j0233m497j2364j0913
$$ 53048 29988 13333 29788 22670 11746 26202 49181 33386 23153 18656 6292 -4621
13758d621L407O76n116j3548K7915R774K646J639J6832L4805J8997j7541k5372
$$ -4621 -1214 -538 -5654 -19202 8713 18487 21133 22772 39604 74409 93406 75865 50493
13745E0493j7876k936k7028K4605K865k8751q958K0843K0751L0051P091j0195
$$ 50493 32617 29681 2653 27258 30123 1372 -7586 13257 34008 64059 71150 60955
13733F0955j4346l570J6650Q483N896M176J2497K6611p888J4669J7984q338j0413
$$ 60955 46609 43039 59689 68172 74068 78244 90741 117352 109464 124133 142117 133779 123366
13720A23366j7976l113J8500N466J3945J2003L2541J003k8604j4085K3201J9410
$$ 123366 105390 102277 120777 126243 140188 152191 184732 185735 157131 143046 166247 185657
13708A85657Mj0167L934k0604j129J4944k872k0761P255K2886K7277L2016N28
$$ 185657 185661 175494 179428 158824 157695 172639 169767 149006 156261 179147 206424 238440 238968
13695B38968l1046N4j114K2839L3336p172J5246M4695L1900J4390J1952J6413
$$ 238968 207922 207976 206862 229701 263037 255865 271111 315806 347706 362096 374048 390461
13683C90461K5095J3456M0536M2895N5503P3757R8273J09782J37786J31301J19158
$$ 390461 415556 429012 469548 512443 567946 641703 739976 849758 987544 1118845 1238003
13672A238003J74433K44347K51951L05972L64075L74743L82123M37538N39941
$$ 1238003 1412436 1656783 1908734 2214706 2578781 2953524 3335647 3773185 4313126
13663D313126N42106N63732N68842O41653O50567N73623N50922N47264N37393
$$ 4313126 4855232 5418964 5987806 6629459 7280026 7853649 8404571 8951835 9489228
13654I489228M25136L61025L10505K05455Q8912o525j11183j61590k20614m10425
$$ 9489228 9914364 10275389 10585894 10791349 10880261 10873736 10762553 10600963 10380349 9969924
13644I969924m88882n00063n22748o08766o59479o46605o24156o09906o10368
$$ 9969924 9481042 8980979 8458231 7849465 7189986 6543381 5919225 5309319 4698951
13635D698951n40062m94429n03139m61654l80633l04677k61670l11646k36702
$$ 4698951 4158889 3664460 3161321 2699667 2319034 2014357 1752687 1441041 1204339
13626A204339j49239j22370j23667j07858p1751j03457r1886q5234j8482n9485
$$ 1204339 1055100 932730 809063 701205 629454 525997 434111 348877 330395 270910
13616B70910l3188k0158q87m354l1209j7397j7704k0819p603j3279j7727J8098
$$ 270910 237722 217564 216677 212323 181114 163717 146013 125194 117591 104312 86585 104683
13604A04683L4094J1455j9288k1074P483J286l2269n465J7869K846Q628K0752
$$ 104683 138777 150232 130944 109870 117353 118639 86370 80905 98774 101620 110248 131000
13592A31000j2530k1917j9760k129K078n994l16L1753K1266k1756k8415j749M223
$$ 131000 118470 96553 76793 74664 76742 70748 70432 102185 123451 101695 73280 71531 75754
13579G5754J5377n012r550J478j3108r672l594K3365J2011R694K3465k1911j8723
$$ 75754 91131 86119 76569 78047 64939 55267 51673 75038 87049 96743 120208 98297 79574
13566G9574k0530k0465L1076K2036l6355n514l765j7089m640J6548K0860J0837
$$ 79574 59044 38579 69655 91691 55336 49822 46057 28968 24328 40876 61736 72573
13554G2573O690K280J190O97p880P054l838j4026k5964o32k76N382J4346L294
$$ 72573 79263 81543 82733 83430 75550 82604 78766 64740 38776 38144 37868 43250 57596 60890
13540F0890k6943k1494J8311K6878J0287j4727j1892r88J5437n802j8040r211
$$ 60890 33947 12453 30764 57642 67929 53202 41310 40322 55759 49957 31917 22706
13528B2706m763K204J5976N979j049n049J2965L200p320J8171J3637J0509k8997
$$ 22706 17943 20147 36123 42102 41053 36004 48969 52169 44849 63020 76657 87166 58169
13515E8169j7306P57L4279K2720q212r239N07o321r877N55k9346j5910l534j0805
$$ 58169 40863 41620 75899 98619 90407 81168 81675 75354 65477 66032 36686 20776 17242 6437
13501F437J7453Q025k313j5225j2221j2959o876K4982J7645K112O890r860K6285
$$ 6437 23890 31915 29602 14377 2156 -10803 -17679 7303 24948 27060 33950 24090 50375
13488E0375J4663k313p158k583m626O277J0389P148J8103L1138R994O813l2882
$$ 50375 65038 62725 55567 52984 48358 54635 65024 72172 90275 121413 131407 138220 105338
13475A05338j0742N452J7038n511l3981J1477l889L402J2468m028j9874o293k4259
$$ 105338 94596 100048 117086 111575 77594 89071 85182 88584 101052 97024 77150 70857 46598
13462D6598O435K7623j2828l6104j8805m414P815J0211O768j323l596K24o217
$$ 46598 53033 80656 67828 31724 12919 8505 16320 26531 33299 31976 28380 28604 22387
13449B2387j5739j8313q51P64k429K4111K2848Q169J9848j5305r481M596K3852
$$ 22387 6648 -11665 -12516 -11752 -14181 9930 32778 40947 60795 45490 36009 40605 64457
13436F4457J0478J845o323j8063J9885J2573K130r945J2810l41J805p782n97j8774
$$ 64457 74935 76780 70457 52394 72279 84852 86982 77037 89847 89506 91311 83529 82932 64158
13422F4158K017j6809l6722j3342L2362j1187R565L0862l516k4378K370K3256
$$ 64158 66175 49366 12644 -698 31664 20477 30042 60904 57388 33010 35380 58636
13410E8636j2112k1168k0004R998L3054j8949q56K1382k4065j963J8377q661j2334
$$ 58636 46524 25356 5352 15350 48404 29455 28599 49981 25916 23953 42330 33669 21335
13397B1335J7941Q832j5513j7080M639J0473j1287l393K0863q950K682N725J5029
$$ 21335 39276 48108 32595 15515 20154 30627 19340 15947 36810 27860 30542 36267 51296
13384E1296J8034r12j8267j4292j1707N575p310K77k083n966m745q486j3626O735
$$ 51296 69330 68418 50151 35859 24152 29727 22417 22694 20611 14645 9900 1414 -12212 -5477
13370e477R226k6819P749J3062L3216M3391L1061q385m6716m1305k003K3916k881
$$ -5477 3749 -23070 -15321 -2259 30957 74348 105409 97024 50308 9003 7000 30916 28035
13357B8035j9434k5968N836P803k346J7874N810K392R620M617l2774L270O156
$$ 28035 8601 -17367 -11531 -3728 -6074 11800 17610 20002 29622 34239 1465 4735 10891
13344A0891p5J2987K187k5887l727K6141j3402j2991K9715K9443K0039j620k5581
$$ 10891 10816 23803 25990 103 -3624 22517 9115 -3876 25839 55282 75321 73701 48120
13331D8120O087j8378j6529j0859J610J8091M07L227L962j4635k437K1715l989
$$ 48120 54207 35829 19300 8441 10051 28142 28549 31776 35738 21103 18666 40381 36392
13318C6392K797k617k9138j571n394K1277m816L4772J5888l3796j6994P317q237
$$ 36392 39189 36572 7434 5863 469 21746 16930 51702 67590 33794 16800 24117 15880
13305A5880K2046J6044n237j3005j4163K0120K1645j2897j1228j5100k2997J9260
$$ 15880 37926 53970 48733 35728 21565 41685 63330 50433 39205 24105 1108 20368
13293B0368K1993m73M249j0990j3246Q559M474j3837O288j0951J872j3550l0600
$$ 20368 42361 41888 46137 35147 21901 30460 34934 21097 27385 16434 18306 4756 -25844
13280b5844O177L0095j5264m552j7324p717K0510J8140K4483k32J3320P523J0751
$$ -25844 -19667 10428 -4836 -9388 -26712 -34429 -13919 4221 28704 28472 41792 49315 60066
13267F0066j6150k4385L943J6857R891O385l27K783l988l0069j0798R991J7320
$$ 60066 43916 19531 23474 40331 50222 56607 56280 59063 55075 25006 14208 24199 41519
13254D1519k4535J6690K8342OQ272J8084l7745l3964J3031L3190K6877J0529P36
$$ 41519 16984 33674 62016 62022 70294 88378 50633 16669 29700 62890 89767 100296 101032
13241A01032K712K770Q34k0948P068k924J7180K0740K0251l9406j6105J1324j2427
$$ 101032 103744 106514 107348 86400 93468 90544 107724 128464 148715 109309 93204 104528 92101
13228I2101k2312Q844Q826J746J8485K82j5590O844p008m1219j1182K7074J4076
$$ 92101 69789 78633 87459 89205 107690 107972 92382 99226 92218 50999 39817 66891 80967
13215H0967p645j958J4737P407k2988k8275r363o788j881K9356J4603o953l7724
$$ 80967 73322 71364 86101 93508 70520 42245 32882 26094 24213 53569 68172 61219 23495
13202B3495m217L552K262j8678j3644O946K0873L0007k8501k2479L1128J1286
$$ 23495 19278 22830 25092 6414 -7230 -284 20589 50596 22095 -384 30744 42030
13190D2030J6862L5811m628k5657j3565l0779J0935J5038o497j9731R53q530R078
$$ 42030 58892 94703 90075 64418 50853 20074 31009 46047 39550 19819 20772 12242 21320
13177B1320l347M829p297q340J5714R597J5885J8448k5714m1370J0570K9297J1218
$$ 21320 17973 22802 15505 7165 22879 32476 48361 66809 41095 -275 10295 39592 50810
13164E0810r407R804J1813L794J432J7869k0731N919l853j8109L268K784M117
$$ 50810 41403 51207 63020 66814 68246 86115 65384 71303 67450 49341 52609 55393 59510
13151E9510Q646k0589k2358j9157l2541P994K8052K254Q048K2172N444l7825J5338
$$ 59510 68156 47567 25209 6052 -26489 -18495 9557 11811 19859 42031 47475 9650 24988
13138B4988K1241r390j347l580K253q823r692N088J4054K8664J1595k9453j9978
$$ 24988 46229 36839 35492 31912 34165 25342 15650 20738 34792 63456 75051 45598 25620
13125B5620J495J5833J5381k2400k9468k763L2802K3163J550n6351j2150K5760
$$ 25620 27115 42948 58329 35929 6461 3698 36500 59663 61213 4862 -7288 18472
13113A8472J0365j8190J2100K4517m04j5310j3432R871J0280k805j0431J233q509
$$ 18472 28837 10647 22747 47264 46860 31550 18118 27989 38269 35464 25033 26266 17757
13100A7757J8306J4896r307J291j033O071J1672J4104J6352J0196j756j4080K046
$$ 17757 36063 50959 41652 42943 41910 47981 59653 73757 90109 100305 98549 84469 86515
13087H6515k7740k4787L7584N1993M454j8693j1223j0892j4282k4219K369K7685
$$ 86515 58775 33988 71572 123565 128019 109326 98103 87211 72929 48710 51079 78764
13075G8764j1691r481K2051J8518O308k3326j4810m547K7213J3900J0402k0392
$$ 78764 67073 57592 79643 98161 104469 81143 66333 61786 88999 102899 113301 92909
13063I2909l5406J3496R372R204K67J0561J156j2263J766j0908k1109j0622l6468
$$ 92909 57503 70999 80371 89575 89842 100403 101559 89296 91062 80154 59045 48423 11955
13050A1955K6652L2982j0185o649J9146J1286Q215j8421k1760J9178J5057j4690
$$ 11955 38607 71589 61404 54755 73901 85187 93402 74981 53221 72399 87456 72766
13038G2766l7369j6844m977J5773J6219J9835J8211J4096m969q88k2317r646R106
$$ 72766 35397 18553 13576 29349 45568 65403 83614 97710 92741 91853 69536 59890 68996
13025F8996L1632N171J5517L461J4868K1050R387K2813J7607K0678L9506N0868
$$ 68996 100628 105799 121316 124777 139645 160695 170082 192895 210502 231180 270686 321554
13013C21554P7396R9637J11912J52444J97663K48199K22735J75438J50059J03139
$$ 321554 398950 498587 610499 762943 960606 1208805 1431540 1606978 1757037 1860176
13003A860176n8144j95532k27142k38246k46566k47264j84425j32040p4046l1055
$$ 1860176 1802032 1606500 1379358 1141112 894546 647282 462857 330817 256771 225716
12993B25716k6298l0423j9973k2805j4208N312P787j9061q628j795k1314l8412
$$ 225716 199418 168995 149022 126217 112009 117321 125108 106047 97419 95624 74310 35898
12981C5898J7894J9802j9532O372L076K3017J3487K2843j6809j2255j9983j4346
$$ 35898 53792 73594 54062 60434 63510 86527 100014 122857 106048 93793 73810 59464
12969E9464j0870J0829j962j9776j6263J4210o30J645J4438K7456P292j5811j5010
$$ 59464 48594 59423 57461 37685 21422 35632 35002 36647 51085 78541 85833 70022 55012
12956E5012J592j9362l3515K1643R763R948Q365J5504j1010m2069p5L4952J0537
$$ 55012 56604 37242 3727 25370 35133 45081 53446 68950 57940 15871 15796 50748 61285
12943F1285p883K4603n427N342p700p890J4960O971L895k3275J316P536J2550
$$ 61285 53402 78005 72578 77920 70220 62330 77290 84261 88156 64881 66197 73733 86283
12930H6283j2189k5834J3639j0439k1639j668r294K714J289K3641K5912j4667
$$ 86283 74094 48260 61899 51460 29821 28153 18859 21573 22862 46503 72415 57748
12918E7748Q33n536k483r988J5902J8596j4864O514N808j6681K075P507L7730
$$ 57748 58581 53045 50562 40574 56476 75072 60208 66722 72530 55849 57924 65431 103161
12905A03161R399k6926p690j8749k5472j0539m739O317J5761k152l136N314R263
$$ 103161 112560 85634 77944 59195 33723 23184 18445 24762 40523 38371 35235 40549 49812
12892D9812j9126m8162j0479n702l819K0738L722J5217K3068K0646p944p720K2492
$$ 49812 30686 -17476 -27955 -33657 -37476 -16738 -13016 2201 25269 45915 37971 30251 52743
12879E2743K883J8939K0965J3774p07j5716j853J7026M200j1597Q99L1481L043
$$ 52743 55626 74565 95530 109304 108597 92881 91028 108054 112254 100657 101556 133037 136080
12866A36080j5084p058k7623R441K2314K947J343j8744k900o205N711J7851j4734
$$ 136080 120996 113938 86315 95756 118070 121017 122360 103616 100716 94511 100222 118073 103339
12853A03339k9110J9671R401J1311r226K2955L5521M534M98j8078j530J1627M307
$$ 103339 74229 93900 103301 114612 105386 128341 163862 168396 168894 150816 149286 160913 165220
12840A65220J0417K5163J8237J7090M666K8253K0671k5780R046k0803n570o426
$$ 165220 175637 200800 219037 236127 240793 269046 289717 263937 272983 252180 246610 240184
12828B40184m4198k4296k4136l6273l785r494j9283K6268j4991l4919k643J6828
$$ 240184 195986 171690 147554 111281 107496 98002 78719 104987 89996 55077 52434 69262
12816F9262o965J996J218J4286L0156M784j9568l00J5749r156k0449n584l923
$$ 69262 62297 64293 65511 79797 109953 114737 95169 94869 110618 101462 81013 75429 71506
12803G1506R217J6820J0004q859J1934j1424j6170L420K2485J0858j4227M304
$$ 71506 80723 97543 107547 98688 110622 99198 83028 86448 108933 119791 105564 109868
12791A09868J4568R268L9622J8579j9175r408J0005J2719m4724j7670L0334O375
$$ 109868 124436 133704 173326 191905 172730 163322 173327 186046 141322 123652 153986 160361
12779A60361O839O847j7710m118m297j7512p903j3882j5352j8682j0159Q293j0820
$$ 160361 167200 174047 156337 152219 147922 130410 122507 108625 93273 74591 64432 72725 61905
12766F1905O896r801O024L8378J2108q389J9844J6701J3048m144j423j3542P03
$$ 61905 68801 59000 65024 103402 115510 107121 126965 143666 156714 152570 151147 137605 138308
12753A38308K5948K7755J8651j8027m732j5565J0016O732L118j3602j19J3579
$$ 138308 164256 192011 210662 192635 187903 172338 182354 189086 192204 178602 178483 192062
12741A92062K3002j0153l3709M173L9935L2834J6468J1535K58j2970O679M189
$$ 192062 215064 204911 171202 175375 215310 248144 264612 276147 276405 263435 270114 274303
12729B74303Q556J8519k2653p309J626N691K3718K3298m612Q735j4577J723L828
$$ 274303 282859 301378 278725 271416 273042 278733 302451 325749 321137 329872 315295 317018 320846
12716C20846j3766j1743j58J1463P989K3566J0996J8825r702O645M823L0558N567
$$ 320846 307080 295337 295179 306642 314631 338197 349193 368018 358316 364961 369784 400342 405909
12703D05909n8229k0781J3431J095J2970k027n506J6040J6204K0480j8192j6895
$$ 405909 347680 326899 340330 341425 354395 352368 346862 362902 379106 399586 381394 364499
12691C64499M866j9506j0570o423J313m420o005L2195K7391K0886j4503k1065
$$ 364499 369365 349859 339289 332866 334179 329759 323754 355949 383340 404226 389723 368658
12679C68658o179L0980K7351J0359M665l300k2949l3949j2667M816L7187J3370
$$ 368658 362479 393459 420810 431169 435834 432534 409585 375636 362969 367785 404972 418342
12667D18342k346K6857J216K2476M3681L1168K2435K7508J5421j0070k094P976
$$ 418342 415996 442853 444069 466545 510226 541394 563829 591337 606758 596688 594594 602570
12655F02570O121r635P274Q822J3196K2301J1563K3732M1645K6358M2939O3620
$$ 602570 608691 599056 606330 615152 628348 650649 662212 685944 727589 753947 796886 860506
12643H60506L0502j1846J8659N6526M5473L3675N3111N1537M3383L0675K0864
$$ 860506 891008 879162 897821 954347 999820 1033495 1086606 1138143 1181526 1212201 1233065
12632A233065L9364Q2482P9238O4480K4739N0108N8391R0829R9451R1798J20493
$$ 1233065 1272429 1354911 1434149 1498629 1523368 1573476 1631867 1722696 1822147 1913945 2034438
12621B034438J46198R9829J08816J04247J59360J97021K06201K35384K80300L11786
$$ 2034438 2180636 2280465 2389281 2493528 2652888 2849909 3056110 3291494 3571794 3883580
12611C883580L08639L63675M44288N13846N80110O52849P41541Q96505J103610
$$ 3883580 4192219 4555894 5000182 5514028 6094138 6746987 7488528 8385033 9488643
12602I488643J312915J568529J861702K121413K465908K778472L054888L424216
$$ 9488643 10801558 12370087 14231789 16353202 18819110 21597582 24652470 28076686
12594B8076686L976089M556771N277469O426859Q289139J1105998J5276919K0930601
$$ 28076686 32052775 36609546 41887015 48313874 56603013 67709011 82985930 103916531
12586A03916531K8000719L7156470M5606755M3064706L1934314K4405393J7435063
$$ 103916531 131917250 169073720 214680475 257745181 289679495 314084888 331519951
12579C31519951n008102l2108939m2880962m1023362m3072015m5222177l6667057
$$ 331519951 326511849 294402910 251521948 210498586 167426571 122204394 85537337
12572H5537337k3906357j4771485r504599o502663m764691l631453k855349k341313
$$ 85537337 61630980 46859495 37354896 30852233 26087542 22456089 19600740 17259427
12564A7259427j983917j754917j549116j330267j182876j079851r37903p94032
$$ 17259427 15275510 13520593 11971477 10641210 9458334 8378483 7440580 6646548
12556F646548o39372n49105m88577m25556l67291l16248k48722k30861k32128
$$ 6646548 6007176 5458071 4969494 4543938 4176647 3860399 3611677 3380816 3148688
12547C148688k14197j49186j36321o8156o6375p2245j01884q3781r2276q5421
$$ 3148688 2934491 2785305 2648984 2580828 2514453 2442208 2340324 2256543 2164267 2078846
12537B078846p5170n1736l9626o0072n1964n4539l1835O844k599L9851M3587P9054
$$ 2078846 2003676 1951940 1912314 1852242 1800278 1745739 1713904 1720748 1718149 1758000 1801587 1880641
12525A880641J08348J46718J75216K38713K99171L03690K76927K70560J74666
$$ 1880641 1988989 2135707 2310923 2549636 2848807 3152497 3429424 3699984 3874650
12516C874650P3988J5958m4663j86816l17757l68420l49748l66784l69625k94578
$$ 3874650 3948638 3964596 3919933 3733117 3415360 3046940 2697192 2330408 1960783 1666205
12506A666205j95394j36651p4058m2172n2434m7247n0115m3757l7022n3998m6429
$$ 1666205 1470811 1334160 1260102 1217930 1165496 1118249 1068134 1024377 987355 933357 886928
12495H86928l9896q068K0927r774r118R552k0804k5806l6317k9426k0432n805
$$ 886928 847032 838964 859891 850117 840999 850551 829747 803941 767624 738198 717766 711961
12483G11961j5686J9235M0271L7513J5068L2598K4815m2810m5342m0936n3172
$$ 711961 696275 715510 755781 793294 808362 840960 865775 822965 777623 736687 683515
12472F83515n7723l9054l8207k2632Q72k589q182j2355k1929j7039j4928j9236
$$ 683515 625792 586738 548531 525899 526771 524182 516000 503645 481716 464677 449749 430513
12460D30513m2538l2806J2676o80J2302o833k2974N854Q401O813J9110j3619q923
$$ 430513 387975 355169 367845 367165 379467 372634 349660 355514 363915 370728 389838 376219 367296
12447C67296p787m684m705q110K531j7764l252j2708J8851M4186N3746M2195P5403
$$ 367296 359509 354825 350120 342010 344541 326777 323525 310817 329668 373854 427600 469795 545198
12434E45198M3595K7244K8994J4433j9841o4142p3325o5320o9462n2474P803J191
$$ 545198 588793 616037 645031 659464 639623 575481 502156 436836 367374 314900 322703 323894
12422C23894j0050l4116q772r322l1154k1692l460J0014J1440J6176p447k2540
$$ 323894 313844 279728 270956 261634 230480 208788 205328 215342 226782 242958 235511 212971
12410B12971J723p617k7721j9685R686K608K2408l013J8095J894R941j8170j0487
$$ 212971 214694 207077 179356 159671 169357 171965 194373 191360 209455 211349 221290 203120 192633
12397A92633J4016J4038k062o05J7547J4666m0373k2348R741p827m365L171l108
$$ 192633 206649 220687 218625 218020 235567 250233 209860 187512 197253 189426 185061 188232 185124
12384A85124j263l9192q364Q827J5017k83Q794r30j671K7595K4965J6289l3283
$$ 185124 183861 144669 136305 145132 160149 159866 168660 167730 166059 193654 218619 234908 201625
12371B01625o640J4882K4324j1926j6992m540O845J9788J4287r371J9781k201
$$ 201625 194985 209867 234191 222265 205273 200733 207578 227366 241653 232282 252063 249862
12359B49862j7190N219L6996J7276J3551Q487O642q443J0341j22l1270K7975j4534
$$ 249862 232672 237891 274887 292163 305714 314201 320843 312400 322741 322619 291349 319324 304790
12346C04790j051j1954m1202j9164J6237M5536K4564m002p996Q522K9540K8437
$$ 304790 303739 291785 250583 231419 247656 293192 317756 313754 305758 314280 343820 372257
12334C72257J2775r922L4291L2888J8319o529l0621m4793l6305j4258k0056O065
$$ 372257 385032 375110 409401 442289 460608 454079 423458 378665 342360 328102 308046 314111
12322C14111K0549K3051j5983l5227k0131O261q478K6303K8417K1104n31J7369
$$ 314111 334660 357711 341728 306501 286370 292631 284153 310456 338873 359977 359446 376815
12310C76815n003L785Q815m105k0080j8876j2892l478j2040k8350J4757K662j7254
$$ 376815 371812 375597 384412 380307 360227 341351 328459 324981 312941 284591 299348 302010 284756
12297B84756j1863n776Q095L4120K7548m385K312M463J4543J1303o014k260R21
$$ 284756 272893 267117 275212 309332 336880 332495 334807 339270 353813 365116 359102 356842 357763
12284C57763k9408k4235j5812J6960L0725K3226j8754K4994J6159J3024K1527
$$ 357763 328355 304120 288308 305268 335993 359219 340465 365459 381618 394642 416169
12273D16169J2638j9979m530O825m1350k3436J8297J5752K2563q942L396K5397
$$ 416169 428807 408828 404298 411123 369773 346337 364634 380386 402949 394007 397403 422800
12261D22800O505j3319k1146K2452K2372o540m1395j3397k2966k686o525K3124
$$ 422800 429305 415986 394840 417292 439664 433124 391729 378332 355366 352680 346155 369279
12249C69279J4852J3298M3968N6239J4092j2744l550l8106J0116J3275l3529k186
$$ 369279 384131 397429 441397 497636 511728 498984 495434 457328 467444 480719 447190 445004
12237D45004R533L9800M0318J235J1066N1140L0227J3378n435J3075J0940q798
$$ 445004 454537 494337 534655 535890 546956 598096 628323 641701 636266 649341 660281 651483
12225F51483K9261Q082P572L8235L5414J9025j1872J8269L1182o531M8604J8830
$$ 651483 680744 688826 696398 734633 770047 789072 777200 795469 826651 820120 868724 887554
12213H87554M2120k465k304o830K4641L5150K0376M0124K8934N3565M2962L7265
$$ 887554 929674 927209 924905 918075 942716 977866 998242 1038366 1067300 1120865 1163827 1201092
12201A201092K9250P3235R5033J31518J56633J20281J20431R8607Q3754O1652
$$ 1201092 1230342 1303577 1398610 1530128 1686761 1807042 1927473 2026080 2109834 2171486
12191B171486R050J3201K2439q490k6925l1795l4880k5305J012J388N219L8551
$$ 2171486 2180536 2193737 2216176 2207686 2180761 2148966 2114086 2088781 2089793 2091181 2096400 2134951
12179B134951P1785J13779J36893J26751Q0043L8338J0881m0667p1693m4994j9540
$$ 2134951 2206736 2320515 2457408 2584159 2664202 2702540 2713421 2672754 2601061 2556067 2536527
12168B536527m8633J7894P8922P1811Q5372Q4826J22575J83552J78760K45320
$$ 2536527 2487894 2505788 2584710 2656521 2741893 2826719 2949294 3132846 3311606 3556926
12158C556926K85583L80037M30015N23369O63995P07112O78513N79626M85067
$$ 3556926 3842509 4222546 4652561 5175930 5839925 6547037 7225550 7805176 8290243
12149H290243L95794K65950J88589K12773K91641L83837N45955O78645P73314
$$ 8290243 8686037 8951987 9140576 9353349 9644990 10028827 10574782 11253427 12026741
12140A2026741P99668P61641O93356O05602N27296N32152O23160P74390J034611
$$ 12026741 12826409 13588050 14281406 14887008 15414304 15946456 16569616 17344006 18378617
12131A8378617J383614J772829K350503L155235M211988N686339P501460R427372
$$ 18378617 19762231 21535060 23885563 27040798 31252786 36939125 44440585 53867957
12123E3867957J1025712J1621580J0496665O744752J65611o959047j1286490j1381318
$$ 53867957 64893669 76515249 87011914 93756666 93922277 86963230 75676740 64295422
12115F4295422q683047n349587k616781p94491K56758Q95303J429306J966738
$$ 64295422 55612375 50262788 47646007 46851516 47108274 48003577 49432883 51399621
12107E1399621K487042K872413K822257K178807J080785R3018j84849K92325J194711
$$ 51399621 53886663 56759076 59581333 61760140 62840925 62933943 62749094 63041419 64236130
12098F4236130K213622L150629M034846M509237M179767K963213J384159R5831
$$ 64236130 66449752 69600381 73635227 78144464 82324231 85287444 86671603 86767434
12090H6767434m92589m02980K89049J549784L322962N596871Q514121J2421070
$$ 86767434 86274845 85871865 86160914 87710698 91033660 96630531 105144652 117565722
12082A17565722J7428976K3079371K7947388K9562969K4113019Q932055j1996896
$$ 117565722 134994698 158074069 186021457 215584426 239697445 248629500 236632604
12075B36632604k8744606l4540897l0905382k3407207j6065783j0422038o537650
$$ 236632604 207887998 173347101 142441719 119034512 102968729 92546691 86009041
12068H6009041l777986j642779Q6076J351809J893086J598055M22235j402618
$$ 86009041 82231055 80588276 80674352 82026161 83919247 85517302 85939537 84536919
12060H4536919l180431m127717m019225l115355j972018q51299J53705Q96625
$$ 84536919 81356488 77228771 73209546 70094191 68122173 67270874 67424579 68321204
12052F8321204J195121R20392K90334k60857m82732o93182j186299j841606k077368
$$ 68321204 69516325 70436717 70727051 70466194 69983462 69290280 68103981 66262375 64185007
12043F4185007j534403k96220J515352L887534O525343Q919633J0138938Q552426
$$ 64185007 62650604 62354384 63869736 67757270 74282613 83202246 93341184 101893610
12035A01893610L001620m989943j1759160j4655084j4079313j1794672r040722
$$ 101893610 104895230 99905287 88146127 73491043 59411730 47617058 38576336
12028C8576336o484054m434950k970770j979264j315319q31315n34210l79115
$$ 38576336 32092282 27657332 24686562 22707298 21391979 20560664 20026454 19647339
12020A9647339l40016l34181l94362m89964o35371p53749q56308q66635q24732
$$ 19647339 19307323 18973142 18578780 18088816 17453445 16699696 15843388 14976753 14152021
12011A4152021o93119m85373k07668Q7162K92993K78966K5107m54358j018248
$$ 14152021 13458902 12973529 12765861 12853023 13146016 13424982 13450089 12995731 11977483
12002A1977483j454565j516751j364340j125569q40411o19926m41897l29481k61850
$$ 11977483 10522918 9006167 7641827 6516258 5675847 5055921 4614024 4284543 4022693
11993D022693j57941j18899r4531n8617l1938j8235k426J4321Q781L8208J0458
$$ 4022693 3864752 3745853 3651322 3592705 3560767 3542532 3540106 3554427 3563208 3601416 3611874
11982C611874k8835n8812q2434q5640j18534j44354j41034j23760o8365r570l9219
$$ 3611874 3583039 3524227 3441793 3356153 3237619 3093265 2952231 2828471 2760106 2750536 2711317
11971B711317k3308k1485o429M0454k158R92J635j6656k1951m7535j15891j29699
$$ 2711317 2688009 2666524 2660095 2700549 2698391 2699383 2701018 2684362 2662411 2614876 2498985 2369286
11959B369286j93369k10280k05199k03133j20662q0963p2907n4381o0689j8519
$$ 2369286 2175917 1965637 1760438 1557305 1436643 1355680 1282773 1228392 1167703 1149184
11949A149184J1187K5006j2651l3779k189k4582l2874n5141m6754l5496j1494
$$ 1149184 1160371 1185377 1172726 1138947 1136758 1112176 1079302 1024161 977407 941911 930417
11938I30417o668o3500k7388l1202m8954k994J8397o805m7907k6410j1879j9897
$$ 930417 923749 860249 832861 801659 752705 749711 768108 761303 713396 686986 675107 655210
11926F55210k2863k0736k772K2117k0903k0369k406n878l3623j4929m221k1920
$$ 655210 632347 611611 608839 630956 610053 589684 587278 581400 547777 532848 528627 506707
11914E06707j1084j8922k4196l3506m1652k9013j6745J3455l873j1039P966J8812
$$ 506707 495623 476701 452505 418999 377347 348334 331589 345044 341171 330132 338098 356910
11902C56910j8289Q134k1080j0036k2354l1402q049M127m292R178K2729K2590
$$ 356910 338621 346755 325675 315639 293285 261883 253834 257961 253669 262847 285576 308166
11890C08166J9232J5110k4511m5956k0462K7588N094k7990k4792n374j7822j6581
$$ 308166 327398 342508 317997 272041 251579 279167 284261 256271 231479 226105 208283 191702
11878A91702J056L53L0061J1912j9577j1405j6324N754J6909k3257K546J4323
$$ 191702 192758 193111 223172 235084 215507 204102 187778 193532 210441 187184 189730 204053
11866B04053J2087J0872j3777m467J591J2622n957j3609l2229J5271J4112N87
$$ 204053 216140 227012 213235 208768 210359 222981 217024 203415 171186 186457 200569 201156
11854B01156L0268L1180j5090k2690j7571q751J0436L654k000J1047k0298j7527
$$ 201156 231424 262604 247514 224824 207253 198502 208938 212592 210592 221639 201341 183814
11842A83814k2716K5838K3149%l9010k6716L6870K3438j7865k8027P565J3474
$$ 183814 161098 186936 210085 210085 171075 144359 181229 204667 186802 158775 166340 179814
11830A79814j3372k2356O165m402K486J8314o696J3177j4822j136j5805N974n266
$$ 179814 166442 144086 150251 145849 148335 166649 159953 173130 158308 157172 141367 147341 142075
11817A42075M967r97P669m482k9557m989J9670K4529j109j9418J2807j4481k694
$$ 142075 147042 146045 153714 149232 119675 114686 134356 158885 157776 138358 151165 136684 133990
11804A33990p756K4149k843r015j7119p5417j6661K2964J2462J256J231p281K6921
$$ 133990 126234 150383 147540 138525 121406 45989 29328 52292 64754 66010 67241 59960 86881
11791H6881K1357o553k3195k721k020J0641K0314K5740j5157m4189j0340O591
$$ 86881 108238 101685 78490 75769 73749 84390 104704 130444 115287 71098 60758 67349
11779F7349J1788k33J6440K2535k169j448K0705P623o481q936j1236p602j655
$$ 67349 79137 78904 95344 117879 115710 114262 134967 142590 136109 127173 115937 108335 106680
11766A06680j1937J3154K0273J5698j8619m3351k1113p857L4475N037j4310J3540
$$ 106680 94743 107897 128170 143868 125249 81898 60785 52928 87403 92440 78130 91670
11754I1670M361j4556k1349j4957P825J6306L5695O916l6006j7307L0680L4053
$$ 91670 96031 81475 60126 45169 52994 69300 104995 111911 75905 58598 89278 123331
11742A23331k0558j8752j6035l389K0375L755J9180J340n286k7335J1561K533
$$ 123331 102773 84021 67986 64597 84972 88727 107907 109247 103961 76626 88187 90720
11730I0720M301p426J0625j7117O395J6871j53j0746j8763L821o643r571m834
$$ 90720 95021 87595 98220 81103 87498 104369 104216 93470 74707 78528 71885 62314 57480
11717E7480L967l1972K6280K118j4698J3217M040Q157p667j2145L0943J3612j3848
$$ 57480 61447 29475 55755 57873 43175 56392 60432 68589 60922 48777 79720 93332 79484
11704G9484p706K2927n62J7453k424n290P74L2058p37k4179j5697m520P519m392
$$ 79484 71778 94705 94143 111596 109172 103882 104656 136714 135977 111798 96101 91581 99100 94708
11690I4708j1684M742J9727K9508K6790K1700o441k3503K7753J1542J45k4671
$$ 94708 83024 87766 107493 137001 163791 185491 179050 155547 183300 194842 194987 170316
11678A70316K7610L7772K9758N1895O7017O8776L6630J6638j2468k2896n6370
$$ 170316 197926 235698 265456 317351 384368 453144 489774 506412 493944 471048 414678
11667D14678l3251l2487k0891l725o348n727J1383p304J0055n978n073M81j758
$$ 414678 381427 348940 328049 324324 317976 312249 323632 316328 326383 320405 315332 315813 314055
11654C14055j328J858K9249L0603J1349R473J1545L4570L2695K8669r941r937
$$ 314055 312727 314585 343834 374437 385786 395259 406804 441374 474069 502738 492797 482860
11642D82860J074N341K6546J5789R148J3417K8518L4313M9596Q6325R4714J34312
$$ 482860 483934 489275 515821 531610 540758 554175 582693 617006 666602 752927 847641 981953
11630I81953J64738R9698N8104j5870j03213j46090j50720j33137j27132r2937
$$ 981953 1146691 1246389 1304493 1288623 1185410 1039320 888600 755463 628331 535394
11620E35394k6133k9727n3234l7482k7076l1616Q467R626k9193R2K6035L8532
$$ 535394 509261 479534 426300 388818 361742 330126 338593 348219 319026 319118 345153 383685
11608C83685k0732J488k422j0242K680J1506o714j7427J837j1134J7955L1661
$$ 383685 362953 364441 362019 351777 354457 365963 359249 341822 343659 332525 350480 382141
11596C82141m870k1817m740L9J4050J9916O181J8965K9524K8888K5473m813l2516
$$ 382141 377271 355454 350714 350753 364803 384719 390900 409865 439389 468277 493750 488937 456421
11583D56421n4089p0690n5634n7136m2487p2j587j3932l5047l9N880n406j6543
$$ 456421 402332 331642 276008 218872 176385 176313 174726 160794 125747 125708 131588 126182 109639
11570A09639k0079o909o71j709j2010m894j9168j4590j399L5865L853l6328l988
$$ 109639 89560 82651 81980 80271 68261 63367 44199 29609 28210 64075 67928 31600 27612
11557B7612R53j8709k7984k89J215k63k689J8311L4331M410j1646j0669N212O91
$$ 27612 28565 9856 -18128 -18417 -17202 -17465 -20154 -1843 32488 36898 25252 14583 19795 20486
11543B0486R577O398r807J4368J4337j4731j1581N860J0369j0862j2854N049K701
$$ 20486 30063 36461 26654 41022 55359 40628 29047 34907 45276 34414 21560 26609 29310
11530B9310l1015k384n372l3641j720L4189N527J7567k437r756J4828J3502M779
$$ 29310 -1705 -4089 -9461 -43102 -44822 -10633 -5106 12461 10024 268 15096 28598 33377
11517C3377l119m222J0639j8539K010l732j2575J183j0730K681L1447r330l4365
$$ 33377 30258 26036 36675 18136 20146 16414 3839 5022 -5708 -3027 28420 19090 -15275
11504a5275o206O677j5332M195M2227k678k263j1669j3372P53k1869R662J2558
$$ -15275 -21481 -14804 -30136 -25941 16286 13608 11345 -324 -13696 -12943 -34812 -25150 -12592
11491a2592J0014K0547q943j2077j9095Q33L0591j1671l958J1286R347j4999J4555
$$ -12592 -2578 17969 9026 -3051 -22146 -21313 9278 -2393 -6351 4935 14282 -717 13838
11478A3838j0013k3407L5327k7829j9889j877m795r193k643O203J6876M6110q381
$$ 13838 3825 -19582 15745 -12084 -31973 -33850 -38645 -47838 -50481 -44278 -27402 18708 10327
11465A0327q908J4124j7925j4916J9327k368O004j4426j1453J2274K2228p384
$$ 10327 1419 15543 -2382 -17298 2029 -339 5665 -8761 -20214 -7940 14288 6904
11453F904j9980m947L1377o605j1584j8019p504M1105J8162L649l4871l207M821
$$ 6904 -13076 -18023 13354 6749 -4835 -22854 -30358 10747 28909 32558 -2313 -5520 -699
11440f99M179J0981J0053j8845n1585K3810J9583k653k25Q322J5154J3859R39
$$ -699 3480 14461 24514 5669 -45916 -22106 -2523 -5176 -5401 2921 18075 31934 32873
11427C2873j0524K1210j6032k8486M748O593J0070j0708K9518L4446j2452m2954
$$ 32873 22349 43559 27527 -959 3789 10382 20452 9744 39262 73708 61256 18302
11415A8302k9210j035J3198o911j1414J1885j7583j3109L5246j0441L728K6252
$$ 18302 -10908 -11943 1255 -5656 -17070 -5185 -22768 -35877 -631 -11072 -7344 18908
11403A8908J0749J2346j226j3196j2629J131k607J9388m5363l9181m968J2907
$$ 18908 29657 42003 40777 27581 14952 16083 13476 32864 -12499 -51680 -56648 -43741
11391d3741K5093J4445q450j2325K450L4649M625m0986n985o227P51K5829j9483
$$ -43741 -18648 -4203 -12653 -24978 -22528 12121 16746 -24240 -30225 -36452 -35701 -9872 -29355
11378b9355k3460kL9550O355n90l570Q112n921l0347J6003K4056J3166j390k1731
$$ -29355 -52815 -52817 -13267 -6912 -7502 -11072 -2960 -8881 -39228 -23225 831 13997 12607 -9124
11364i124o270N664j484J5703K0523k0348k3784K6652J26j970K7722Q891J4765
$$ -9124 -15394 -9730 -11214 4489 25012 4664 -19120 7532 7658 5688 33410 42301 57066
11351E7066k2932l6192j6775K9814K850K9433L8164q002j5533j5552j1825k8724
$$ 57066 34134 -2058 -18833 10981 13831 43264 81428 73426 57893 42341 30516 1792
11339A792N139J0892j8932P024j1048k4997K469R860Q868J2153J3116k0283j8459
$$ 1792 6931 17823 -1109 5915 -5133 -30130 -27661 -17801 -8933 3220 16336 -3947 -22406
11326b2406J3879L6242k402j2987q871j2538k4769M386J4054P942J0144k770L761
$$ -22406 -8527 27715 25313 12326 3455 -9083 -33852 -29466 -15412 -7470 2674 -96 3665
11313C665P501r90R40k4361j280K1805j8047n2143N7J6880l397M5779J3146k231
$$ 3665 11166 10176 11116 -13245 -14525 7280 -10767 -62910 -62853 -45973 -49370 -3591 9555 7324
11299G324L670k342P91K5079k229j7706N371K923P26j1774k7190j3362J3127k786
$$ 7324 10994 8652 9443 34522 32293 14587 19958 22881 23607 11833 -15357 -28719 -15592 -18378
11285a8378J1905l497N516O280o53j1704q401j4308p269n178J9413J9743J4025
$$ -18378 -6473 -9970 -4454 1826 1173 -10531 -18932 -33240 -40509 -45687 -26274 -6531 7494
11272G494l590J5421J5788j8472J4035j8297o270q173K88j0243k3217k5352L642
$$ 7494 3904 19325 35113 16641 30676 12379 6109 -2064 -1776 -12019 -35236 -60588 -56946
11259e6946K3352P882O445N488L523J3823k286k3259r285L879J480J7880K811
$$ -56946 -33594 -25712 -19267 -13779 -10256 3567 1281 -21978 -31263 -27384 -25904 -8024 -5213
11246e213j720p631j3169J7971k48j2607R608J5145j1089l1546J3558J1314J7108
$$ -5213 -6933 -14564 -27733 -9762 -10010 -22617 -13009 2136 -8953 -40499 -26941 -15627 1481
11233A481J4286l217q7r608q915N908q056j8018J2182r386Q258J988o277k085
$$ 1481 15767 12550 12463 2855 -6060 -152 -8208 -26226 -14044 -23430 -15172 -13184 -19461 -21546
11219b1546J5318j916k9800P579L8416q847j9781p731P902k0478J401K3232J6015
$$ -21546 -6228 -8144 -37944 -30365 8051 -796 -20577 -28308 -20406 -40884 -39483 -16251 -236
11206b36q671j8296O948L0827j6262m757K4668R972J7629l199j3232j0312j1770
$$ -236 -8907 -27203 -20255 10572 -5690 -10447 14221 24193 41822 38623 25391 15079 3309
11193C309j5151o1J1231k6996J796N622P946M4591J4377p823k4255m441J2128
$$ 3309 -11842 -11903 -672 -27668 -25872 -20250 -12304 32287 46664 38841 14586 10145 22273
11180B2273K0865j2695k1377k3413j3312N302J0140m651J8620K3245K641j1435
$$ 22273 43138 30443 9066 -14347 -27659 -22357 -12217 -16868 1752 24997 27638 16203
11168A6203k462K7899O597K599R000J9868J0786j1793P188j9638l8023j1152M119
$$ 16203 13741 41640 48237 50836 59836 79704 90490 78697 85885 66247 28224 17072 21191
11155B1191j9628m587L0466Q729N112p656j1550K301K543J2546p379k4677j6684
$$ 21191 1563 -3024 27442 36171 41283 33627 22077 24378 26921 39467 32088 7411 -9273
11142i273J0105k8218N033M3100L3951j7949m0107M37L5429O205k1224J3658M5141
$$ -9273 832 -27386 -22353 20747 54698 36749 -3358 -2921 32508 38713 17489 31147 76288
11129G6288J9502K1023J3323M3101N4836M6725O7308N0386j3582o2937n4856n2397
$$ 76288 95790 116813 130136 173237 228073 274798 342106 392492 378910 315973 261117 208720
11117B08720m1071l7336k8164j8737j3819j3058J3775P104k384l9198k6278k8421
$$ 208720 167649 130313 102149 83412 69593 56535 70310 77414 75030 35832 9554 -18867
11105a8867m865K694J3566K3977K0126J0335J7995m761J8149M037n719J4266N497
$$ -18867 -23732 -21038 -7472 16505 36631 46966 64961 60200 78349 82386 76667 90933 96430
11092I6430r363j0174L2522L7644M0230N1371N9286L0847L4156N6961O9038j7621
$$ 96430 87067 76893 109415 147059 187289 238660 297946 328793 362949 419910 488948 471327
11080D71327j21853j16909o3243m1682k7019j9997p098k0472j1727J2842K392
$$ 471327 349474 232565 169322 127640 100621 80624 73526 53054 41327 54169 56561
11069E6561K3476j2243k3934M90K0572o733j9212l641J5122L591J3421J1019l79
$$ 56561 80037 67794 43860 44350 64922 58189 38977 35336 50458 54049 67470 78489 78110
11056G8110j0919J3035L1823j1103J3849K9729k564K229K2298L2625K1604R960
$$ 78110 67191 80226 112049 100946 114795 144524 141960 144189 166487 199112 220716 230676
11044B30676O1738M8052L645p8368o6058o8758l7186k5541o52m655j1649J794
$$ 230676 292414 340466 344111 265743 199685 130927 93741 68200 67548 62893 51244 53038
11032E3038J7614r865l6572q825o324m062O193K9831K3711n682k0771R436K2234
$$ 53038 70652 60787 24215 15390 9066 5004 11197 41028 64739 59057 38286 47722 69956
11019F9956J626q950j1518p582K497j8743j7690J3673K5493M143K2082J3872K2095
$$ 69956 71582 62632 51114 43532 46029 27286 9596 23269 48762 52905 74987 88859 110954
11006A10954J6558K1687N16m340l2520k0210J7108K2594j4840l7755k7510l0420
$$ 110954 127512 149199 149715 145375 112855 92645 109753 132347 117507 79752 52242 21822
10994B1822q619O389J0863k085K8620K1974j2818Q477J3538m561k6281j8132j9787
$$ 21822 13203 19592 30455 28370 56990 78964 66146 74623 88161 83600 57319 39187 19400
10981A9400j9426Q954l690J9542Q851j2808J547N08Q947q715k4093j1652q278
$$ 19400 -26 8928 5238 24780 33631 20823 22370 22878 31825 23110 -983 -12635 -20913
10968b0913J1492k153R252l0305L0125K0995M984N029j8812k7346p823J2022K535
$$ -20913 -9421 -11574 -2322 -32627 -2502 18493 23477 28506 9694 -17652 -25475 -13453 -10918
10955a0918j9899O36J191K4242K1664M502J3061K22j2828j8175L283k524R541
$$ -10918 -30817 -30181 -28990 -4748 16916 21418 34479 34701 21873 3698 6981 4457 13998
10942A3998K3629K926n106j1447j5383O346k4653L725P666N851J3059l140j1714
$$ 13998 37627 40553 35447 24000 8617 14963 -9690 -5965 1701 7552 20611 17471 5757
10929E757J599q65L2042m834k2875m011m233l104J2094j6287j6676Q488j847j709
$$ 5757 7356 6491 38533 33699 10824 6813 2580 -524 11570 -4717 -21393 -12905 -14752 -16461
10915a6461j454N947K6428J4437J6866K9897j0712k9913m615K2114n352l2395
$$ -16461 -17915 -11968 14460 28897 45763 75660 64948 35035 30420 52534 47182 14787
10903A4787j291j003K0752l625n196k877M11L8784R883m0719k3310j281j1320
$$ 14787 13496 12493 33245 29620 24424 21547 21958 60742 70625 29906 6596 5315 -6005
10890f005J5909J8810J8688J6116P646k1809M90j7482j0417j7270J2292M017q719
$$ -6005 9904 28714 47402 63518 71164 49355 49845 32363 21946 4676 16968 20985 12266
10877A2266n876k8751J7391j3204P024L372K9439Q728k076o774J0024n660j4910
$$ 12266 6390 -22361 -4970 -18174 -11150 -7778 21661 30389 28313 21539 31563 25903 10993
10864A0993o31o136j3250J9073r809L4396P942k8592o048J2340j1383k1634M238
$$ 10993 10362 4226 -9024 10049 240 34636 42578 13986 7938 20278 8895 -12739 -8501
10851h501J8693P407r428l6571J1174K0124J8867j2545k1505K1530J0620l974
$$ -8501 10192 17599 8171 -28400 -17226 2898 21765 9220 -12285 9245 19865 15891
10839A5891J0123k2336j8218M6346M313r257P19J3899K1550l3825L776q73j3648
$$ 15891 26014 3678 -14540 31806 36119 26862 27581 41480 63030 29205 32981 32108 18460
10826A8460p626Q107J8995l296j7632j2819j4690R856J9793R15N997j513m238
$$ 18460 10834 18941 37936 34640 17008 4189 -10501 -645 19148 20063 26060 24547 20309
10813B0309n574j152Q931K0778j0948j5217m854M299J3785k9948l5213j5959K0915
$$ 20309 14735 13583 22514 43292 32344 17127 12273 16572 30357 409 -34804 -50763 -29848
10800b9848O629k3171O623K5395N487j410k0095M930Q753L2577R702L2112L4656
$$ -29848 -23219 -46390 -39767 -14372 -8885 -10295 -30390 -25460 -16707 15870 25572 57684 92340
10787I2340j7762l5086j949Q050n3958r045K8442K8867K0788r762M312N719p101
$$ 92340 74578 39492 37543 45593 -8365 -17410 11032 39899 60687 50925 55237 60956 53855
10774E3855j9618j3111j560l20J6222L88q13n516p773o356k3355p60J4111n737
$$ 53855 34237 21126 19566 19246 35468 35856 35043 29527 21754 15398 -7957 -8717 5394 -343
10760c43j1395m273j3562j3210J7799K4643j7091j3799J1712K7892o69j1388Q14
$$ -343 -11738 -16011 -29573 -42783 -24984 -341 -17432 -31231 -19519 8373 7704 -3684 -2870
10747b870j1244j8284j517J2770L5623J4324O975j1553l4732q878k558J1959K0510
$$ -2870 -14114 -32398 -33915 -21145 14478 28802 35777 24224 -10508 -19386 -21944 -9985 10525
10734A0525L786p909k0800M490N783l486L696j3355q059K684N927K253K8012K3844
$$ 10525 14311 6402 -14398 -9908 -4125 -7611 -3915 -17270 -25329 -22645 -16718 -14465 13547 37391
10720C7391j4971j2771j2239M710J0602J9693l795J2173j486J5692j9829m0969
$$ 37391 22420 9649 -2590 2120 12722 32415 28620 40793 39307 54999 35170 -5799
10708e799P437K0934j7074n084k0245J1987R638K0945J429k569o168k3186O939
$$ -5799 1638 22572 5498 414 -19831 -7844 1794 22739 24168 21599 15431 -7755 -816
10695h16L1618K2887P707j2000j9406O329P18k0669j0861J8982j962k0305o069
$$ -816 30802 53689 61396 49396 29990 36319 37037 16368 5507 24489 22527 2222 -3847
10682c847J2346J1603O193q438j0596M469P53Q991O980J7925M763j5298j2011
$$ -3847 8499 20102 26295 17857 7261 11730 12483 21474 28454 46379 51142 35844 23833
10669B3833K5796J0044j5796l0891K012K0535J2335j0k687K0840R824m2185o152
$$ 23833 49629 59673 43877 12986 14998 35533 47868 47858 45171 66011 75835 33650 27498
10656B7498J8181r207m517J4297n765K35J3799K5633N099k5811k2172N671K6713
$$ 27498 45679 36472 31955 46252 40487 40722 54521 80154 85253 59442 37270 42941 69654
10643F9654J7439j4754k7671j6794J2038J1774o06l0803J0157K2856l004O421
$$ 69654 87093 72339 44668 27874 39912 51686 51080 20277 30434 53290 50286 56707
10631E6707K9413l044P696o129J5460J8400k68q104j7043j751m170q360J2749
$$ 56707 86120 83076 90772 84643 100103 118503 118235 110131 93088 91337 87167 78807 91556
10618I1556J2258K0312K6570J6764M581j6423j3041j7624j018j1164o833O421
$$ 91556 103814 124126 150696 167460 172041 155618 142577 124953 123935 112771 105938 112359
10606A12359j5412O403l1100K586J710J219J6945O938j423j9049j2221k6349P451
$$ 112359 96947 103350 72250 74836 76546 77765 94710 101648 100225 81176 68955 42606 50057
10593E0057K6765J7206q131n9480k3827K5354P818k182K1364J251j9128m357K5120
$$ 50057 76822 94028 85897 26417 2590 27944 35762 33580 54944 56195 37067 32710 57830
10580E7830K418J953j806M675l557L641L5228j494o861k396o098j4498J7489K7969
$$ 57830 60248 62201 60395 65070 61513 65154 100382 98888 92027 89631 83533 69035 86524 114493
10566A14493k2897j427L730q107m1475l6535K9537K5539L34J4731k4683j4453
$$ 114493 91596 90169 93899 85792 44317 7782 37319 62858 63192 77923 53240 38787
10554C8787J1012L2001M0887j8490l0289j7384J1297l237J3027l141j501j0189
$$ 38787 49799 81800 122687 104197 73908 56524 67821 64584 77611 74470 72969 62780
10542F2780j7930k404R191L0245J2396j9946k133J049J2773K816j5509l878P137
$$ 62780 44850 42446 51637 81882 94278 74332 72199 73248 86021 88837 73328 69450 76587
10529G6587j2265J9019K093j2048J448J1861J5809R659j4778J1015J4164J0827
$$ 76587 64322 83341 85434 73386 74834 86695 102504 112163 97385 108400 122564 133391
10517A33391j08j9968l515N1288K7600M7685O5848N2243R2749J32039J68881K12789
$$ 133391 133283 113315 109800 161088 188688 236373 302221 354464 447213 579252 748133 960922
10505I60922K08598J7875k58300l01245k04104j24586o4177l4951n8247n707Q000
$$ 960922 1169520 1187395 929095 627850 423746 299160 234983 200032 141785 136078 144078
10494A44078m7737j6588N270J4325r419m4434k6920m164J6066M4629k962L387
$$ 144078 96341 79753 85023 99348 89929 45495 18575 14411 30477 75106 72144 75531
10482G5531m098l2291k874Q63n096j2899k2145J9622J2789j277n046p666o008
$$ 75531 71433 39142 36268 37131 32035 19136 -3009 16613 29402 28125 23079 15413 9405
10469I405K5058J9314j6064p962k903Q099K8881K0577L2083J711j9130o22M648
$$ 9405 34463 53777 37713 29751 26848 34947 63828 84405 116488 118199 99069 98447 103095
10456A03095o06l5P507N645k4391m1174k3256J0112P822K0789K1818q080M765
$$ 103095 102489 102454 109961 115606 91215 50041 26785 36897 44719 65508 87326 79246 84011
10443H4011k5748j1483J5142j5186j4523J5986K3252K728n757J3465j7655j5298
$$ 84011 58263 46780 61922 46736 32213 48199 71451 74179 68422 81887 64232 48934
10431D8934J8968M2687j8709k0353N863p699l1413L691m329R024K5747l300l357
$$ 48934 67902 110589 91880 71527 77390 69691 38278 41969 37640 46664 72411 69111 65754
10418F5754O739J6452L127J1901k090j940L3949L2084M1560Q712M576K6112K3448
$$ 65754 72493 88945 92072 103973 101883 99943 133892 165976 207536 216248 220824 246936 270384
10405B70384M4819M1206K6752R0983P4914M5180N8409J26377K03078K73828L83435
$$ 270384 315203 356409 383161 474144 549058 594238 652647 779024 982102 1255930 1639365
10394A639365M63695M45596L62201K82839J70240k4592k57427m63847m81479m26715
$$ 1639365 2103060 2548656 2910857 3193696 3363936 3339344 3081917 2618070 2136591 1709876
10384A709876m33039l82558k51813j54165j08510n9038k3711o3915k4084k8370
$$ 1709876 1276837 894279 642466 488301 379791 320753 297042 233127 209043 180673
10374A80673l4714p220J5924J4981q311m757Q618j1869m2747k4831n861Q629j0375
$$ 180673 145959 138739 154663 169644 161333 156576 165194 153325 110578 85747 79886 88515 78140
10361G8140j716l675l122O19P101j0343k771O324M685j1861k049k441j3745K4080
$$ 78140 76424 72749 69627 70246 77347 67004 64233 70557 75242 63381 61332 58891 45146 69226
10347F9226O110p348J630n24K3984J9364j2844k5660l091Q711K5790M575k6204
$$ 69226 75336 67988 69618 69094 93078 112442 99598 73938 70847 79558 105348 109923 83719
10334H3719j4336r276K3765R336J6891J9755J932K5025K9685j4638J8450J282
$$ 83719 69383 60107 83872 93208 110099 129854 131786 156811 186496 171858 190308 191590
10322A91590j3603K0582p256k2014j1406j1168J8029M869J3015M881j2677j6142
$$ 191590 177987 198569 191313 169299 157893 146725 164754 169623 182638 187519 174842 158700
10310A58700j5315k3674j4361l3670J0385K6307J552j1192J49J2288K0994R682
$$ 158700 143385 119711 105350 71680 82065 108372 109924 98732 98881 111169 132163 141845
10298A41845q418J729m908Q761J4079q002j4333r960k4131Q300L0551j6093j1856
$$ 141845 133427 135156 130248 139009 153088 145086 130753 120793 96662 104962 135513 119420 107564
10285A07564j3875Q961Q362J4248J4781r743l3761J180Q464m633l286J767m018
$$ 107564 93689 102650 111012 125260 140041 130298 96537 97717 106181 101548 98262 100029 96011
10272I6011J9187L7962k962J4945j1527l332j0833r59j0050l8401N806K6631K2777
$$ 96011 115198 153160 150198 165143 153616 150284 139451 138492 128442 90041 95847 122478 145255
10259A45255O031j42K4930L6114J2845l69J0148M8304K4824L3770M1334Q380k3026
$$ 145255 151286 151144 176074 212188 225033 224664 234812 283116 307940 341710 383044 391424 368398
10246C68398m1395m3790k8762m8826R152K2753J4235K909j8995l6300q858o632
$$ 368398 327003 283213 254451 205625 214777 237530 251765 254674 235679 199379 190521 183889
10234A83889q206J7728K8979L6631k7197j1004K3238k399r96k603K6068R95L3243
$$ 183889 175683 193411 222390 259021 231824 220820 244058 241659 240663 238060 264128 265123 298366
10221B98366L4850M147J2436L9188L3136N0343M3600O7953N6042R8508Q1664J02782
$$ 298366 333216 337363 349799 388987 422123 472466 516066 584019 640061 738569 820233 923015
10209I23015J15677J57106J89949K24077K49131K74614L86176L90039J64775M4344
$$ 923015 1038692 1195798 1385747 1609824 1858955 2133569 2519745 2909784 3074559 3118903
10199C118903J36541J67308k50533n22000l80694k16711l22884m24720l38845
$$ 3118903 3255444 3422752 3172219 2650219 2269525 2052814 1729930 1305210 966365
10190I66365j89376j38086j01297o1682l1472r680m8166j350P465J7593Q499O68
$$ 966365 776989 638903 537606 475924 444452 434772 386606 385256 392721 410314 418813 419481
10178D19481l4339j0618O340n172l7964P803M1889L5934M3913O7973N6428P5301
$$ 419481 385142 374524 380864 375692 337728 345531 387420 423354 467267 535240 591668 666969
10166F66969J07264J22172R4799P1119O4759M7286O442k1979p9815j32733j62933
$$ 666969 774233 896405 991204 1062323 1127082 1174368 1180810 1158831 1079016 946283 783350
10155G83350j50103j15365r9109p6418o0191m0474m009k927J6436J4736l210j8308
$$ 783350 633247 517882 418773 342355 282164 241690 237681 234754 251190 265926 262716 244408
10143B44408Q083L9209j2510l565J5431L711j4396N18J0664J8626J3819Q388R726
$$ 244408 252491 291700 279190 275625 291056 294767 280371 280889 291553 310179 323998 332386 342112
10130C42112J0515J9019N866J417J7096K2550L3898Q9113J07861J09881J14532
$$ 342112 352627 371646 377512 378929 396025 418575 452473 541586 649447 759328 873860
10119H73860J26164O7677K5931l1027j07533j06105j07431j02699r3052n8240
$$ 873860 1000024 1067701 1093632 1062605 955072 848967 741536 638837 545785 487545
10109D87545m8337m9687m3887p064l0597j0948O639k8025n0957q613O215j1538
$$ 487545 439208 389521 345634 338570 307973 297025 303664 275639 224682 216069 222284 210746
10097B10746J8964Q298L2662m022j5529j5361P726R533n516m3162l679R040j198
$$ 210746 229710 238008 270670 266648 251119 235758 243484 253017 247501 204339 200660 209700 208502
10084B08502Q961p67J4009M1662K5943M1208M1609K3834L3274K6182J9899m6780
$$ 208502 217463 216696 230705 272367 298310 339518 381127 404961 438235 464417 484316 437536
10072D37536n1260m5864k9257Q637l3852k3587k8050k03k1320k4524J6306J9933
$$ 437536 386276 340412 311155 319792 285940 262353 234303 234100 212780 188256 204562 224495
10060B24495L1735l097k0807j8805k4725J2719q249j0753J2745L2578M1913j401
$$ 224495 256230 253133 232326 213521 188796 201515 193266 182513 195258 227836 269749 268348
10048B68348j2192l258n131K9832K5661M7635L8325N4711Q3423J03627J24532
$$ 268348 256156 252898 247767 277599 303260 350895 389220 443931 527354 630981 755513
10037G55513J63715K79826J94605l83630l56273k23086j13051j3563k4887k6527
$$ 755513 919228 1199054 1393659 1010029 653756 430670 317619 304056 279169 252642
10027B52642P720M96K2274J6021J4789K041k5070p565j5527k1555j5213J0274
$$ 252642 260362 260858 283132 299153 313942 315983 290913 283348 267821 246266 231053 241327
10015B41327J384O391j579Q907J3626J5158r552j1312n734L0606K8965L1924K7932
$$ 241327 242711 249102 247523 256430 270056 285214 275662 264350 258616 289222 318187 350111 378043
10002C78043P247k651L0591L6701N575m1149k4314m2260k0723K56J7245N322j4855
$$ 378043 385290 382639 413230 449931 455506 414357 390043 347783 327060 327316 344561 349883 335028
9989C35028k306K5678j4275P068j0870k3213j6960K3839J4301M6j4097M4828J7789
$$ 335028 332722 358400 344125 351193 340323 317110 300150 323989 338290 338336 324239 369067 386856
9976C86856K0420o384m101j0905J3419L4483J8363K1084M484O604K2951j727J4037
$$ 386856 407276 400892 396791 385886 399305 433788 452151 473235 477719 484323 507274 505547 519584
9963E19584J6291K6358K2844K5060J9892K2676P2660Q3090M2593L5109M3520N4679
$$ 519584 535875 562233 585077 610137 630029 652705 725365 808455 851048 886157 929677 984356
9951I84356P9726J15678J01771Q8152R7750J80435K37203K41587K77888L05792
$$ 984356 1064082 1179760 1281531 1369683 1467433 1647868 1885071 2126658 2404546 2710338
9941B710338L22341L72545M25928N68931Q40101J196454J612851K011874K364591
$$ 2710338 3032679 3405224 3831152 4400083 5240184 6436638 8049489 10061363 12425954
9932A2425954K650091J837309n22511j467594m18746J069888K356979L348495
$$ 12425954 15076045 16913354 16390843 14923249 14504503 15574391 17931370 21279865
9924B1279865M192910L155756k476773o018481m608073k286937o42224L68943
$$ 21279865 25472775 28628531 26151758 20133277 15525204 13238267 12596043 12964986
9916A2964986R66763P76167j235739l129023k946338k011211j240922p97995n41376
$$ 12964986 13931749 14707916 13472177 10343154 7396816 5385605 4144683 3346688 2805312
9907B805312l95808k56090k00055j57980j07120j14883j10605r4536j07837n4780
$$ 2805312 2409504 2153414 1953359 1795379 1688259 1573376 1462771 1368235 1260398 1205618
9897A205618m5279q2724j7612m130k2117j6327p537k1629j2626j2531k855m476
$$ 1205618 1160339 1077615 1060003 1055873 1033756 1017429 1009892 988263 975637 963106 960251 955775
9885I55775o552k2098J1862J7085P663k5433j4035j3250L5496M8655O8304Q1922
$$ 955775 949223 927125 938987 956072 963735 938302 924267 911017 946513 995168 1063472 1145394
9873A145394R2253N9305M6628O1865J13180J25302J09164J03357J29095J46917
$$ 1145394 1237647 1296952 1343580 1405445 1518625 1643927 1753091 1856448 1985543 2132460
9863B132460J42381J13226J05237O2024R6370Q2162J45069J50465J72058J86172
$$ 2132460 2274841 2388067 2493304 2555328 2651698 2733860 2878929 3029394 3201452 3387624
9853C387624J62317M2704o9878o9103l9822m5746o4639r6313o8773k4605m9124
$$ 3387624 3549941 3592645 3522767 3453664 3413842 3368096 3303457 3207144 3138371 3113766 3064642
9842C064642k4888j3115r122R9250J70777K09936L04088M62242O02064P39798
$$ 3064642 3039754 3026639 3017517 3116767 3287544 3497480 3801568 4263810 4865874 5605672
9832E605672Q71590R23902Q39769N11346P2989j38217j68137k39752k87948l77405
$$ 5605672 6477262 7401164 8240933 8752279 8825268 8687051 8518914 8279162 7991214 7613809
9822G613809m78134m94346l36793j99104j32680n5768Q293K6419P0772J30860
$$ 7613809 7135675 6641329 6304536 6105432 5972752 5916984 5925277 5951696 6022468 6153328
9812F153328K03160L22644M73158O53596Q18173R38882J028467J050649J023774
$$ 6153328 6356488 6679132 7152290 7805886 8624059 9562941 10591408 11642057 12665831
9803A2665831J077922J229767J439504J690399K054381K577241L372903M408095
$$ 12665831 13743753 14973520 16413024 18103423 20157804 22735045 26107948 30516043
9795C0516043N833922P709882R953494J2016478J3417053J3755221J1619241L089426
$$ 30516043 36349965 44059847 54013341 66029819 79446872 93202093 104821334 107910760
9787A07910760j0004685j6486278j5291931j1687708q009223m968535k618779
$$ 107910760 97906075 81419797 66127866 54440158 46430935 41462400 38843621
9780C8843621q06908O50301J975083L302932M668861O065930P502109Q305131
$$ 38843621 38036713 38687014 40662097 43965029 48633890 54699820 62201929 70507060
9772G0507060P590652O170454N225098L955590K183452J585027J955205J389272
$$ 70507060 78097712 84268166 89493264 93448854 95632306 97217333 99172538 100561810
9764A00561810m30406k313319l746277m803209n548447m792000k782325j026606
$$ 100561810 100131404 97818085 94071808 89268599 83720152 78928152 76145827 75119221
9756G5119221K78760K276483N469275R652598J4941314K1586098K8712219L3598574
$$ 75119221 75397981 77674464 83143739 92796337 107737651 129323749 158035968 191634542
9748A91634542L5289116L3615534J6473948k0404365m4977568m4077479l5229974
$$ 191634542 226923658 260539192 277013140 256608775 211631207 167553728 132323754
9741A32323754k5882986j7217906j0430186n587316k179954J89646J917058L159527
$$ 132323754 106440768 89222862 78792676 73205360 71025406 71215052 73132110 76291637
9733G6291637L691150M108651M391562M104625L699725L377128L092496J973167
$$ 76291637 79982787 84091438 88483000 92587625 96287350 99664478 102756974 104730141
9725A04730141N21160O00795J423933J49443l651886p059033q062917o813093
$$ 104730141 105251301 105852096 107276029 107425472 103773586 96714553 88651636 81838543
9717H1838543n727808m638573j572982K069659K161703l064958l261253J018090
$$ 81838543 76110735 71472162 69899180 71968839 74130542 71065584 67804331 68822421
9709F8822421M717958N586013O021811P944725Q832779O147784k796265j3544162
$$ 68822421 73540379 79126392 85148203 93092928 101925707 108073491 105277226 91733064
9701I1733064j7658150j5728279j2145591r019852o627896m844345l614970k853983
$$ 91733064 74074914 58346635 46201044 37181192 30553296 25708951 22093981 19239998
9693A9239998k259549j711101j291884j048148q49798o33314m34101k43853n5586
$$ 19239998 16980449 15269348 13977464 12929316 12079518 11446204 11012103 10768250 10712664
9684A0712664Q1291J67796K72425L17009K70959o7503o37394j037584j010128
$$ 10712664 10793955 10961751 11234176 11551185 11822144 11754641 11117247 10079663 9069535
9675I069535p91908n60428l16253n6792J07237K40486L33272L18601K32271N8398
$$ 9069535 8277627 7717199 7400946 7344154 7451391 7691877 8025149 8343750 8576021 8634419
9665H634419j14254k50933m09609o93942r18336r03659p45642n59373l92724k93649
$$ 8634419 8520165 8269232 7859623 7165681 6247345 5343686 4598044 4038671 3645947 3352298
9655C352298j97109j17779p1318j7450k205O5715R3284R3398J04660R4958N4920
$$ 3352298 3155189 3037410 2966092 2948642 2946437 3012152 3105436 3198834 3303494 3398452 3453372
9644C453372O5636P9850K7533J433k5914n5139j00084j83138j96276k10156j53713
$$ 3453372 3519008 3598858 3626391 3627824 3601910 3546771 3446687 3263549 3067273 2857117 2703404
9633B703404j43134j26625r5773j10091j36447j60878j39428j17940j30860j12477
$$ 2703404 2560270 2433645 2337872 2227781 2091334 1930456 1791028 1673088 1542228 1429751
9623A429751q2123n5405m6572n4535n7494l4971K0313r224j1193J7702m1482k9647
$$ 1429751 1347628 1292223 1245651 1191116 1133622 1098651 1118964 1109740 1098547 1116249 1074767 1045120
9611A045120n3780k7806j0384j526k3485k6720k2622k0626l7575n2015j4609j2204
$$ 1045120 991340 963534 953150 951624 928139 901419 878797 858171 820596 768581 753972 741768
9599G41768k7465J1013j1796n6390k7905l9151l0759K3108K7070J3831L235l272
$$ 741768 714303 725316 713520 657130 629225 590074 559315 582423 609493 623324 626559 623287
9587F23287J6175k2449j7494k8941j0745N052L209k6422l1553L252K4417J3162
$$ 623287 639462 617013 599519 570578 559833 564885 568094 541672 510119 513371 537788 550950
9575E50950K247k41j2138k9470k1377k5082j309l505j1770J3349n65K0419R840
$$ 550950 553197 552956 540818 511348 489971 464889 463580 460075 448305 461654 461089 481508 491348
9562D91348l2878O771K5490K6997Q542j3926j0931O715N055q205K518J5760m1426
$$ 491348 458470 465241 490731 517728 526270 512344 501413 508128 513183 504978 507496 523256 481830
9549D81830k9678K4012R604L318J0960K1150R029r487N962M0655J2224J0162K2851
$$ 481830 452152 476164 485768 489086 500046 521196 530225 520738 526700 567355 579579 589741 612592
9536F12592J4399J2528o642l322M6128M3235L2347R056r2n947R681M6369J7650
$$ 612592 626991 639519 632877 629555 675683 718918 751265 760321 760229 754282 763963 810332 827982
9523H27982k176K4445L5674M3212j0139m1792l3630k4323m0574l3273k7963m7690
$$ 827982 825806 850251 885925 929137 918998 877206 843576 819253 778679 745406 717443 669753
9511F69753k6435l9861l6976j3328J7177l031J1952r202j7786m5555p963K908
$$ 669753 643318 603457 566481 553153 570330 567299 579251 570049 552263 506708 498745 501653
9499E01653R358J1858j7528m855o451J8999K996j0390l698O627O964R698j2301
$$ 501653 511011 522869 505341 500486 494035 513034 516030 505640 501942 508569 515533 525231 512930
9486E12930K7112N097J3910p618J1200L5215l2444l3442m130J7403L6456J1863
$$ 512930 540042 545139 559049 551431 562631 597846 565402 531960 527830 545233 581689 593552
9474E93552P830k351N730j9409k7006j1625L7659J8250p20j347o649j5347J4401
$$ 593552 601382 599031 604761 585352 558346 546721 584380 602630 601910 600563 593914 578567 592968
9461E92968N241J3302L4245l2088k3999K125J5245J0108l1881M081k676L63M1023
$$ 592968 598209 611511 645756 613668 589669 591794 607039 617147 585266 589347 586671 587034 628057
9448F28057J9708J1318j2748o250J2754Q974q260K4112J0542K1624K9321K5668
$$ 628057 647765 659083 646335 640085 652839 661813 653553 677665 688207 709831 739152 764820
9436G64820J7205l887j4555j4921K6199J9877J5150q367J4313J3969J8797J5854
$$ 764820 782025 778138 763583 748662 774861 794738 809888 801521 815834 829803 848600 864454
9424H64454K2728K2145N9959L8394L3L541J4457J0921L3827O7738N7705M4600
$$ 864454 887182 909327 969286 1007680 1007713 1011254 1025711 1036632 1070459 1138197 1195902 1240502
9412A240502k845j5374k2145j0484K415K573R446k0116k0581k8266p670K299R984
$$ 1240502 1237657 1222283 1200138 1189654 1192069 1194642 1204088 1183972 1163391 1135125 1127455 1129754 1139738
9399A139738K9154L1343L5287j183J0661J5063K3639K221J693J1812L1307L3510
$$ 1139738 1168892 1200235 1235522 1234339 1245000 1260063 1283702 1285923 1287616 1299428 1330735 1364245
9387A364245K1534L7424K7329K1391J4660J6002L5017M0150K3768K0262L4979
$$ 1364245 1385779 1423203 1450532 1471923 1486583 1502585 1537602 1577752 1601520 1621782 1656761
9376A656761O4201Q4542R2624R6967J35555J70844J58970J23459K5458o0678n2141
$$ 1656761 1720962 1805504 1898128 1995095 2130650 2301494 2460464 2583923 2609381 2548703 2496562
9365B496562n9280q7118o4393l9869k0322j0308J7235M7767J5690n065K1176M1766
$$ 2496562 2437282 2350164 2285771 2245902 2225580 2215272 2232507 2280274 2295964 2290899 2312075 2353841
9353B353841N3857L3318L0612N5314Q8815P4026P8321Q1385Q6217Q6061J02221
$$ 2353841 2407698 2441016 2471628 2526942 2615757 2689783 2768104 2849489 2935706 3021767 3123988
9342C123988J02209Q1161R4360R1711R4245J15839J27184J22751J37619J61237
$$ 3123988 3226197 3307358 3401718 3493429 3587674 3703513 3830697 3953448 4091067 4252304
9332D252304J75131K08102K51553K82741K84637K90666K21816J39618Q1601O4592
$$ 4252304 4427435 4635537 4887090 5169831 5454468 5745134 5966950 6106568 6188169 6252761
9322F252761P2165Q3429R0626J19881J66189J46322J78757K52227K91701L15637
$$ 6252761 6324926 6408355 6498981 6618862 6785051 6931373 7110130 7362357 7654058 7969695
9312G969695L30028L55267M00595M12528M02539M41861M88672N29152N34611O15975
$$ 7969695 8299723 8654990 9055585 9468113 9870652 10312513 10801185 11330337 11864948 12480923
9302A2480923O70893P49258P90213Q25415Q79731R41583J051314J128133J273333
$$ 12480923 13151816 13901074 14691287 15516702 16396433 17338016 18389330 19517463 20790796
9293B0790796J354986J487678J614563J745263J989304K189421K335206K531489
$$ 20790796 22145782 23633460 25248023 26993286 28982590 31172011 33507217 36038706
9285C6038706K757018K991500L209870L473081L775803M099293M467852M847831
$$ 36038706 38795724 41787224 44997094 48470175 52245978 56345271 60813123 65660954
9277F5660954N181836N460492N819088O106565O263405O304928O080095N564963
$$ 65660954 70842790 76303282 82122370 88228935 94492340 100797268 106877363 112442326
9269A12442326M781755L659031K224899O31196j114369k763644m221871n405090
$$ 112442326 117224081 120883112 123108011 123739207 122624838 119861194 115639323 110234233
9261A10234233o223285o728413o927323o846481o631876o240202n804689n356172
$$ 110234233 104010948 97282535 90355212 83508731 76876855 70636653 64831964 59475792
9253E9475792m876711m462299m027120l644360l280038k988959k694856k413777
$$ 59475792 54599081 50136782 46109662 42465302 39185264 36196305 33501449 31087672
9245C1087672k195127j997671j804405j643716j524592j400630j265679j165462
$$ 31087672 28892545 26894874 25090469 23446753 21922161 20521531 19255852 18090390
9237A8090390j048212j006593r02552q12232p91718p10293o35425o10177n64721
$$ 18090390 17042178 16035585 15133033 14320801 13529083 12818790 12183365 11573188 11008467
9228A1008467n31073n27927m77141m23690l68773l28468l58382l45774l16024
$$ 11008467 10477394 9949467 9472326 9048636 8679863 8351395 7993013 7647239 7331215
9219G331215l41573k89701k21398j98080k03276k17706k25959j79558j65142j99343
$$ 7331215 6989642 6699941 6478543 6280463 6077187 5859481 5633522 5453964 5288822 5089479
9209E089479j75790j56351j37575j64894j36557j22571j27719r5690r3476j26172
$$ 5089479 4913689 4757338 4619763 4454869 4318312 4195741 4068022 3972332 3878856 3752684
9199C752684r8209j05392q6733r4463j07512r2297j13894n8410n6817j05481n8893
$$ 3752684 3654475 3549083 3462350 3367887 3260375 3168078 3054184 2995774 2938957 2833476 2774583
9188B774583o9908p7632o8464m6063k8064o3029o2251n6890m8054l8988n6448
$$ 2774583 2704675 2627043 2558579 2512516 2484452 2421423 2359172 2302282 2254228 2215240 2158792
9177B158792o8384n3412k6854l6528l4912j2192l6280n0729k9590l4521k7881
$$ 2158792 2090408 2036996 2010142 1973614 1938702 1926510 1890230 1839501 1809911 1775390 1747509
9166A747509m6941m4795m5141k9910k0181k9039k1459l6297l7337J0925j2023
$$ 1747509 1700568 1655773 1610632 1580722 1560541 1531502 1510043 1473746 1436409 1447334 1435311
9155A435311l2387j3639k4815k7395k0525k7430m362k0476o958m0158m0089j9611
$$ 1435311 1402924 1389285 1364470 1337075 1316550 1289120 1284758 1264282 1257324 1217166 1177077 1157466
9143A157466j7053l217k5784l0476l0280k4594K331J0399r786k6917o340l9863
$$ 1157466 1140413 1137196 1111412 1080936 1050656 1026062 1028393 1038792 1029006 1002089 995749 955886
9131I55886n2211j3249Q286O270j1192j6276o440O1j8741k5777l1r333o326J4474
$$ 955886 903675 890426 898712 904982 893790 877514 871074 871135 852394 826617 826586 817253 810927 825401
9117H25401j5080k9766m5637j4445L212j394m0184qJ4161l4096j1508j7084k1642
$$ 825401 810321 780555 734918 720473 723685 722291 682107 682099 696260 662164 650656 633572 611930
9104F11930n416L1332j369j9542j5077J8734j8413r425p340O248j107K300K0114
$$ 611930 606514 637846 636477 616935 601858 620592 602179 592754 585414 591662 590555 592855 612969
9091F12969j2463l5972l9552o139r746K1291k8849j7050K8435K455P586J4658
$$ 612969 600506 564534 524982 518843 509097 530388 501539 484489 512924 515379 522965 537623
9079E37623j6327q512q671j3082M902k918j9849P912J275r376M560K763k4961
$$ 537623 521296 512784 504113 491031 495933 493015 473166 481078 482353 472977 477537 480300 455339
9066D55339m858k9209n3237J2501K1450J8580l967j0772m405M267J0894j180l7583
$$ 455339 450481 421272 368035 380536 401986 420566 416599 405827 401422 405689 416583 415403 377820
9053C77820J7944q6n242J8633q936k4430k2538K3011K8343r580k027L1599k1756
$$ 377820 395764 395678 390436 409069 400133 375703 353165 376176 404519 394939 392912 424511 402755
9040D02755k5650J0886J7734k1602j4147L788J390J883J2312J0904j4426j1521
$$ 402755 377105 387991 405725 384123 369976 373764 375154 377037 389349 400253 385827 374306
9028C74306L0080o430j5020j3963k8169J3611K3781k71l449Q833K419J739k0100
$$ 374306 404386 397956 382936 368973 340804 354415 378196 377925 374476 383309 385728 387467 367367
9015C67367j719j6708j2753j8197j0623n628k720L264K3176k2692l3213j3010
$$ 367367 365648 348940 336187 317990 307367 301739 299019 302283 325459 302767 269554 256544
9003B56544l041j0073M437O516P48r828L4005K6261R081o907R742k5872m7067
$$ 256544 253503 243430 247867 254383 255131 245303 279308 305569 314650 307743 317485 291613 244546
8990B44546q322j2085Q597M645j4773K883j1525Q340j752L344l468j2614o466
$$ 244546 236224 224139 232736 237381 222608 225491 213966 222306 220554 223898 220430 207816 201350
8977B01350q483L2033J4557j6430r450M93L4106p854k2200M243r578J4413J2541
$$ 201350 192867 224900 239457 223027 213577 214070 248176 240322 218122 222365 212787 227200 239741
8964B39741M306k0664k1266J3198O976J782p967O623J286P717j8125J0478L5842
$$ 239741 244047 223383 202117 215315 222291 224073 216106 222729 224015 231732 213607 224085 259927
8951B59927J512j6457k0829J0833j6918j2945n626r828K9321J0653l1959R65j5000
$$ 259927 261439 244982 224153 234986 218068 205123 199497 189669 218990 229643 197684 198649 183649
8938A83649n315O091j7165L0697Q987M241k0812l1782Q40K4572M364k621J9269
$$ 183649 178334 184425 167260 197957 206944 211185 190373 158591 159431 184003 188367 185746 205015
8925B05015O897j7577J4803M2877K528q514k4507N826K2287J4194k539K6704J4632
$$ 205015 211912 194335 209138 252015 254543 246029 221522 227348 249635 263829 261290 287994 302626
8912C02626l0114n119n448k3443J085J0359K8646k124j4008k557K028K3114K7075
$$ 302626 272512 267393 261945 238502 239587 249946 278592 276468 262460 259903 261931 285045 312120
8899C12120J2524K3568M5362M0829K9549L144K1353K5102J2632M5554P5235R8897
$$ 312120 324644 348212 393574 434403 463952 467096 488449 513551 526183 571737 646972 745869
8887G45869J14145J48752J43082J13144J78277K20319K06367J90453K08392K62236
$$ 745869 860014 1008766 1151848 1264992 1443269 1663588 1869955 2060408 2268800 2531036
8877B531036L31660L71104L84741N52669Q11075J176757J728760K492257L216234
$$ 2531036 2862696 3233800 3618541 4171210 4982285 6159042 7887802 10380059 13596293
8868A3596293L870522M666507L828567k126640o819202n916751l672477k130837
$$ 13596293 17466815 22133322 25961889 23835249 17016047 11099296 7426819 5295982
8860E295982j329548q58791n35191l53926k59359j91735j41083j15445j34028
$$ 5295982 3966434 3107643 2572452 2218526 1959167 1767432 1626349 1510904 1376876
8851A376876j45996j64445j27154j14009n7571j12362p6061o6366o8036o9631
$$ 1376876 1230880 1066435 939281 825272 767701 655339 579278 512912 444876 375245
8841C75245j7287J4219L505m242n945j2004k4292J3712K3871j1103l0339k2692
$$ 375245 357958 372177 375682 371440 365495 353491 329199 342911 366782 355679 325340 302648
8829C02648O078k059j0006k1904j5310j3282K3188k8721k5352K6379L5784J7256
$$ 302648 308726 306667 296661 274757 259447 246165 269353 240632 215280 241659 277443 294699
8817B94699m7378m0184l2244j146J8567r182j5883k3894m2694k205J1157J3381
$$ 294699 247321 207137 174893 173747 192314 183132 167249 143355 100661 98456 109613 122994
8805A22994K4554R583l660k2756j5015Q753j3984K238J2702Q911l678j4050k1222
$$ 122994 147548 157131 153471 130715 115700 124453 110469 112707 125409 134320 130642 116592 95370
8792I5370J361K7603l931M839j222m70j5658l7168n37N6187M903l4444j0898P818
$$ 95370 96731 124334 120403 125242 124020 123550 107892 70724 70187 126374 131277 96833 85935 93753
8778I3753L079J043J7759J7028l121l0273o647P965j8586r617L1657K2279J1727
$$ 93753 96832 97875 115634 132662 129541 99268 92621 100586 82000 72383 104040 126319 138046
8765A38046J0870q484j5258n006J0037k7969k8551P19J7273j5592K2300j807j2421
$$ 138046 148916 140432 125174 120168 130205 102236 73685 74404 91677 76085 98385 96578 84157
8752H4157N808q524j8969Q17L2420j846j0667j4936j8949j7421l522j618J3622
$$ 84157 89965 81441 62472 63289 95709 93863 83196 68260 49311 31890 28368 26750 40372
8739D0372L0750J4792l932j4646J7736K026n911J7713L536J733j1269k2441K00
$$ 40372 71122 85914 81982 67336 85072 87098 81187 98900 102436 104169 92900 70459 70659
8726G0659L233M950O211K6754J4593J3323j9320j7487J1976P826N131j4580j5945
$$ 70659 73892 78842 85053 111807 126400 139723 120403 102916 114892 122718 127849 113269 97324
8713I7324j9600J8454J7097j6136j6164J9786O916k44j2670j0306k4558j3165
$$ 97324 77724 96178 113275 97139 80975 100761 107677 107433 94763 84457 59899 46734
8701D6734k959L5493L66J6083q029j2012k70n427J837j6113J7266L768R678j5928
$$ 46734 43775 79268 79634 95717 87688 75676 75406 69979 71816 55703 72969 76737 86415 70487
8687G0487M265J502k3270L692l0727m274N0022r05j0526q457J9766p91J9842N139
$$ 70487 74752 76254 52984 56676 25949 21675 71697 70792 60266 51809 71575 70784 90626 95765
8673I5765j481J2594k102j9642o077J289k3368P84J935k2931M471J7078Q217N368
$$ 95765 94284 106878 104776 85134 79057 80346 56978 57762 59697 36766 41237 58315 66532 71900
8659G1900L5932q61j9553P259J3342O293m475j4724j0359K6992K0084m639J2914
$$ 71900 107832 106971 87418 94677 108019 114312 109837 95113 84754 111746 131830 127191 140105
8646A40105j0514j45J1742P362j8415l4787l2232L6912J2685Q640L870P054M957
$$ 140105 129591 129446 141188 148550 130135 95348 63116 100028 112713 121353 125223 132277 137234
8633A37234O392J433j9108R427K1157J6388M660K230R767J0513J4326n37k6315
$$ 137234 143626 145059 125951 135378 156535 172923 177583 179813 189580 200093 214419 213882 187567
8620A87567j0571K0644Q399k9145q393k8526q287K7330L829J2863K5709m524j9367
$$ 187567 176996 197640 206039 176894 168501 139975 131688 159018 162847 175710 201419 196895 177528
8607A77528m804L0064J9578J2709N507J9021R599J6504J2755K1154M2536K8152
$$ 177528 172724 202788 222366 235075 240582 259603 269202 285706 298461 319615 362151 390303
8595C90303M3172L7882L4456O8217O2301M9140O3716P2440P6196O6059K9495m1993
$$ 390303 433475 471357 505813 574030 636331 685471 749187 821627 897823 963882 993377 951384
8583I51384p9294j07277j11684j11109j10086o7089k7347k147l8660l9110n0432
$$ 951384 872090 764813 653129 542020 431934 364845 337498 335351 296691 257581 207149
8572B07149k7439n290k0807k236O30n479k6983p84q981q202N963j0662j0863K006
$$ 207149 179710 174420 153613 151377 152007 146528 119545 118761 109780 101578 107541 96879 86016 88022
8558H8022q835K909J2404P197P916j0214Q21j7516j8048Q0J6898K7500J6413j0081
$$ 88022 79187 82096 94500 101697 109613 99399 100220 82704 64656 64736 81634 109134 125547 115466
8544A15466k5473l488J418K5156m540j3186n548k0903j4186K4577J7787j1564
$$ 115466 89993 86505 87923 113079 108539 95353 89805 68902 54716 79293 97080 85516
8532H5516k0169k3058J5257L1896K0240k3301l720K0962J6179N765n7504p247
$$ 85516 65347 42289 57546 89442 109682 86381 82661 103623 119802 125567 68063 60816
8520F0816J5084o028J411K5823K6790j8305n773k3261k0619N51J1884K1800L3437
$$ 60816 75900 69872 71283 97106 123896 105591 99818 76557 55938 56489 68373 90173 123610
8507A23610K5515j8147k3392k986J8164L1158L3036J143k611j331j8033j8754
$$ 123610 149125 130978 107586 104600 122764 153922 186958 188101 185490 184159 166126 147372
8495A47372j8703k0102m875l1050Q2R689k1972R46J2898L8994J227l857J5761
$$ 147372 128669 108567 103692 72642 72724 82413 60441 61387 74285 113279 114506 110649 126410
8482A26410K6128J8538Q883J4129l6398j991L8711N628j0938M2895J5797O2178
$$ 126410 152538 171076 179959 194088 157690 155699 194410 200038 189100 231995 247792 309970
8470C09970O0670Q3736J07629J09522Q2834j1888q4698j12984j12978r7277p9579
$$ 309970 370640 454376 562005 671527 754361 742473 657775 544791 431813 334536 254957
8459B54957m9552m6534k2333j1888J0631Q259r224k4770j8351l287j0915K0885
$$ 254957 205405 158871 136538 124650 135281 143540 134316 109546 91195 87908 76993 97878
8447I7878J616J955k0982j1993j5247Q583J4227O172j5188j1738p914J2563j6219
$$ 97878 99494 101449 80467 68474 53227 61810 76037 82209 67021 55283 47369 59932 43713
8434D3713j653O063J6966L238j0196P585L3323K9117q474J625j3265J2261j0431
$$ 43713 42060 48123 65089 68327 58131 65716 99039 128156 119682 121307 108042 120303 109872
8421A09872r573J020K4501j2748j8113m970o513J3361M728k8071M561R830R807
$$ 109872 100299 101319 125820 113072 94959 89989 83476 96837 101565 73494 78055 87885 97692
8408I7692j1079j4732K2355L0963Q666J1167p597k0686J1128K177M737J7509Q721
$$ 97692 86613 71881 94236 125199 133865 145032 137435 116749 127877 130054 134791 152300 161021
8395A61021K60L0119M5713N0169M6026L9244n480m8761o1476k7681J470L1532
$$ 161021 161281 191400 237113 287282 333308 372552 367072 318311 256835 229154 230624 262156
8383B62156J5199J7921L1829K6516K2792J9543L0085K0671K8589N9181R8743R2008
$$ 262156 277355 295276 327105 353621 376413 395956 426041 446712 475301 534482 633225 725233
8371G25233J01023J42699J97508K59042M06438N36225P27850Q67149R84883Q14942
$$ 725233 826256 968955 1166463 1425505 1831943 2368168 3096018 3963167 4948050 5762992
8361E762992l93325j424655j325596q29397m68929l00064j87983j29793r0329
$$ 5762992 5369667 3945012 2619416 1790019 1321090 1021026 833043 703250 612921
8352F12921q0146n5281p5578l2777J9507j6272l2927J8965K2065K0577J1445n323
$$ 612921 532775 477494 401916 369139 388646 372374 339447 358412 380477 401054 412499 407176
8340D07176k099M375J6195K9375L9405O6829O6160R3506R1647J18314J31065J75981
$$ 407176 405077 409452 425647 455022 494427 561256 627416 720922 812569 930883 1061948 1237929
8328A237929L20197M88254O40717P70511R06122R26195K05178j062527j374056
$$ 1237929 1558126 2046380 2687097 3457608 4363730 5289925 5495103 4432576 3058520
8319C058520r95165o38735m01869k25381j22321o7605q6528q6129o6413k2064
$$ 3058520 2063355 1424620 1022751 797370 675049 607444 520916 434787 368374 346310
8309C46310l8298l5443q130l7341n8117l5053J067K5690j9033n7676k5828J917
$$ 346310 308012 272569 264439 227098 168981 133928 134995 160685 141652 83976 58148 60065
8297F0065K4881M137l048j0380J2081q379k1176J9561p525K9664L14q969l4686
$$ 60065 84946 89083 86035 75655 87736 79357 58181 77742 70217 99881 100195 91226 56540
8284E6540o699J452L8163J9174l7201n3398K2001L6434M1178l168m3590k2176
$$ 56540 49841 51293 89456 108630 71429 18031 40032 76466 117644 114476 70886 48710
8272D8710J4201K8620N921r349l0447P807k6585k4596j5637L36J3873L4730M769
$$ 48710 62911 91531 97452 88103 57656 65463 38878 14282 -1355 -1019 12854 47584 52353
8259E2353K6534K2369n434M508j4889r688k1574j4944j0042p305J7089o44J5662
$$ 52353 78887 101256 95822 100330 85441 75753 54179 39235 29193 21888 38977 38333 53995
8246E3995L0707j8111k1084N376l402j3421K0195j4365k5752J3714P322k5930
$$ 53995 84702 66591 45507 50883 47481 34060 54255 39890 14138 27852 35174 9244
8234I244J591M219l433k59P225L8278k209k6063J0431q678J3394K2754J8741n124
$$ 9244 10835 15054 11621 11362 18587 56865 54656 28593 39024 30346 43740 66494 85235 80111
8220H0111K2329k3412m8239o579J8914L517J1290p486J8939J2721l4960r623J4562
$$ 80111 102440 79028 30789 24210 43124 46641 57931 50445 69384 82105 47145 37522 52084
8207E2084J7618j045J3613J2604l290M39j947J2626l773j9684m044m670N735m0576
$$ 52084 69702 68657 82270 94874 91584 92023 90076 102702 98929 79245 75201 70531 76266 35690
8193C5690K0906K7981j1478N577r58o629k4264k2939J7398M597j0873j9568j0373
$$ 35690 56596 84577 73099 78676 77718 71089 46825 23886 41284 45881 35008 15440 5067
8180E067j1787l034J3533J1089J0133l360j1799K6372J4687N19P044O205j1668
$$ 5067 -6720 -9754 3779 14868 25001 21641 9842 36214 50901 51420 58464 64669 53001
8167E3001p207R336j2693j4131n134J9781m208O832r938k218J6381K544J3296
$$ 53001 45794 55130 42437 28306 23172 42953 38745 45577 35639 33421 49802 52346 65642
8154F5642K374j7638N449j0963J8852L516r913r637p550J4278L1513j261j6600
$$ 65642 68016 50378 55827 44864 63716 67232 57319 47682 40132 54410 85923 84662 68062
8141F8062J5572L88K922O308Q070J7105L2k9504k404J9297J1618J7073j378k1320
$$ 68062 83634 84022 86944 93252 101322 118427 118459 88955 86551 105848 117466 134539 133161 111841
8127A11841l2791j5779q30K2067k2318j5478j8975O617K4727L03M187L939j4935
$$ 111841 79050 63271 62441 84508 62190 46712 27737 34354 59081 59384 63571 67510 52575
8114E2575K6980l893j6148k850L4680l592J9013l1485j5698m2783O666K1913M357
$$ 52575 79555 75662 59514 56664 91344 87752 106765 75280 59582 16799 23465 45378 49735
8101D9735J0516j517j3254j0383k8203J8588J1060N66J9151K5996J2689o172k1794
$$ 49735 60251 58734 45480 35097 6894 25482 36542 37108 56259 82255 94944 88772 66978
8088F6978O917r441l5556j7841o392J1171L1345L172j5072q54p006j412K1770
$$ 66978 73895 64454 28898 11057 4665 15836 47181 50353 35281 34427 27421 26009 47779
8075D7779L648P181N897j844L2242K8362K2657n016R524n137l5590l4632l0396
$$ 47779 51427 58608 64505 62661 94903 123265 145922 140906 150430 145293 109703 75071 44675
8062D4675J1167K4158o178o520j3780l5793n924J0757M967r736QJ7920J6584j3655
$$ 44675 55842 80000 73822 67302 53522 17729 11805 22562 27529 17793 17801 35721 52305 38650
8048C8650k373J1583N361j094j504k307M943K2303j1105j8797J8374J7900J448
$$ 38650 36277 47860 53221 52127 50623 48316 53259 75562 64457 45660 64034 81934 83382
8035H3382j0112j7900j0653K7386m815p713l2842j5345k498J001P966J4750R631
$$ 83382 73270 55370 44717 72103 67288 59575 26733 11388 8890 9891 17857 32607 42238
8022D2238l2864k766L0495L4077K766K956k0894k0894J9390P442N96J6865q23
$$ 42238 9374 6608 37103 71180 73946 76902 56008 35114 54504 61946 62542 79407 78584
8009G8584J0052J4306l6718o066M1588J0879k2245J1462k0276k7112l659L779
$$ 78584 88636 102942 66224 60158 101746 112625 90380 101842 81566 54454 50795 54574
7997E4574m321J8059K9436J5860n774N666j4748j9122j8759k7061k8736J932J7639
$$ 54574 50253 68312 97748 113608 107834 113500 98752 79630 60871 33810 5074 7006 24645
7984B4645J3655N846M447j3836J1176q77L144j2377P653k538K6875p417K2176
$$ 24645 38300 44146 48593 34757 45933 45056 48200 35823 43476 40938 67813 60396 82572
7971H2572M936j5257r425K3322j670j2889m592r776J274J5885O602O287j0541
$$ 82572 87508 72251 62826 86148 84478 71589 66997 57221 58495 74380 80982 87269 76728
7958G6728n887K477J5640j3904P710L125j4398M988n692J1658j1572J4221J4578
$$ 76728 70841 73318 88958 75054 82764 85889 71491 76479 70787 82445 70873 85094 99672
7945I9672q171p172q491k2205O626K064K043m923l7372L063J9475j111J292q11
$$ 99672 91501 84329 75838 53633 60259 62323 64366 59443 22071 25134 44609 43498 44790 43979
7931D3979q982P668R212J4022L1901J6290j8368l5196k8728J4724J160k147L62
$$ 43979 34997 42665 51877 65899 97800 114090 95722 60526 31798 46522 47682 45535 45897
7918D5897l228K4145K5987K768M730o284k9398l6153q01r797K2799K3117k1403
$$ 45897 42669 66814 92801 95569 100299 94015 64617 28464 27663 17866 40665 63782 42379
7905D2379j0668J2468P349l791j6571m143K5814J9831J9583j4407j2322J0744
$$ 42379 31711 44179 51528 47737 31166 27023 52837 72668 92251 77844 65522 76266
7893G6266j2356j1547k9326k8026J2538L3537P932L837P235j1938k561j943k4892
$$ 76266 63910 52363 23037 -4989 7549 41086 49018 52855 60090 48152 45591 43648 18756
7880A8756j6205n791l3514j0722J4059K6805j4625N57J1065r994K303M59k2628
$$ 18756 2551 -3240 -36754 -47476 -33417 -6612 -21237 -20680 -9615 -19609 -17306 -16847 -39475
7867c9475O042L6884j0158O215p130o314J990J6879J7688m756K0828j5281k9509
$$ -39475 -33433 3451 -6707 -492 -7622 -13936 -11946 4933 22621 17865 38693 23412 -6097
7854f097j0421Q053J6256k146K9606J0709J8759j4932j5664J837K1485J3222k6398
$$ -6097 -16518 -8465 7791 5645 35251 45960 64719 49787 34123 35960 57445 70667 44269
7841D4269m0729j2562J268J4504O070K1803J2922p707m595j0078j6916j2484J6382
$$ 44269 3540 -9022 -7754 6750 12820 34623 47545 39838 35243 25165 8249 -4235 12147
7828A2147k492l4000j4289J631L0958J6776L146p81l706l808j8625l4225l9474
$$ 12147 9655 -24345 -38634 -37003 -6045 10731 13877 13096 9390 5582 -13043 -47268 -86742
7815h6742K2096L2196J9445O514k285K746J0590K2870K241j9037l8944l6385j324
$$ -86742 -64646 -32450 -13005 -6491 -8776 -6030 4560 27430 29671 10634 -28310 -64695 -66019
7802f6019M4721N0096l446j6385M973P333j4707n723K2546o054k0087k972M192
$$ -66019 -21298 28798 25352 8967 13940 21273 6566 843 23389 17335 -2752 -5724 -1532
7789a532J2531J575q59P624j3366j5897K331O131j6592k041J5952K94j230k1852
$$ -1532 10999 12574 11715 19339 5973 -9924 -7593 -1462 -18054 -20095 -4143 -3849 -5079 -26931
7775b6931O421K5111J6480n977n276j0292l692k4691N91J1021M725K8169m499
$$ -26931 -20510 4601 21081 15104 9828 -464 -4156 -28847 -28256 -17235 -12510 15659 11160
7762A1160J4196j4662J1598K352q609m743j6571k7073o494M615O584J9929L7362
$$ 11160 25356 10694 22292 24644 16035 11292 -5279 -32352 -38846 -34231 -27647 -7718 29644
7749B9644j1800j2745l6801J9270K0629j250k874j3136l104q755l73j8024R076
$$ 29644 17844 5099 -31702 -12432 8197 6947 4073 -9063 -12167 -20922 -21295 -39319 -30243
7736c0243r813R259K3810l015N154j4477l347n815M843J7327J6380J8462j1263
$$ -30243 -40056 -30797 -6987 -10002 -4848 -19325 -22672 -28487 -23644 -6317 10063 28525 17262
7723A7262k5718j7197M5220L3656j1225j2308k9948N319J6051p612j0310R725
$$ 17262 -8456 -25653 19567 53223 41998 29690 -258 5061 21112 13500 3190 12915
7711A2915K2105J1092J3362k9799j2351M33k0146m703m021l3529o303r208k264
$$ 12915 35020 46112 59474 29675 17324 17757 -2389 -7092 -11113 -44642 -50945 -60153 -62417
7698f2417J2861J1796n386O300Q707R164J1136J0275P719j4324J59J1895J9315
$$ -62417 -49556 -37760 -43146 -36846 -28139 -18975 -7839 2436 10155 -4169 -4010 7885 27200
7685B7200J6400k0771l0962o675J2063M187K2318j0812k7749j4927j7965j2382
$$ 27200 43600 22829 -8133 -14808 -2745 1442 23760 12948 -14801 -29728 -47693 -60075
7673f0075K9722N848j535R321o607J3189J9885K080K5312o630j0491n008J0874
$$ -60075 -30353 -24505 -26040 -16719 -23326 -10137 9748 11828 37140 30510 20019 15011 25885
7660B5885k3213K245k0880j5205K7642J9618o593p920j7340o192m431M329q43
$$ 25885 2672 4917 -15963 -31168 -3526 16092 9499 1579 -15761 -21953 -26384 -22055 -22898
7647b2898J7491J1799j4960j9271n316J0994L0700L149k1360j615k0394n841L928
$$ -22898 -5407 6392 -8568 -27839 -33155 -22161 8539 11688 -9672 -11287 -31681 -37522 -33594
7634c3594J6977J6961r865j5591m608K4829K5583K0711K5614k3010l7326k6024
$$ -33594 -16617 344 -9521 -25112 -29720 -4891 20692 41403 67017 44007 6681 -19343
7622a9343R356j5962p783k332M4357L1514J3158r189j0060K9720K9626J4068k0616
$$ -19343 -9987 -25949 -33732 -36064 8293 39807 52965 43776 33716 63436 93062 107130 86514
7609H6514m5099n6651J576J5034L701N769O383N472J1827J3149J6276k180l0839
$$ 86514 41415 -15236 -13660 1374 5075 10844 17227 22699 34526 47675 63951 61771 30932
7596C0932l499j6850J1127j220j2243p589r354K3689j3660k2872O175l020J3240
$$ 30932 27433 10583 21710 20490 8247 658 -8696 14993 1333 -21539 -15364 -18384 -5144
7583e144K1513M667j6053j6997n767K5908K4163k3518n234J2081n007j6522l6652
$$ -5144 16369 21036 4983 -12014 -17781 8127 32290 8772 3538 15619 10612 -5910 -42562
7570d2562k1308K0716J5998l66j9762J6078K7194l769L352J0301L172l121p379
$$ -42562 -63870 -43154 -27156 -27522 -47284 -31206 -4012 -7781 -4429 5872 9044 5923 -1456
7557a456o326j2146R75j1292K3740J9950p020k756K030O067r070m065j833j1483
$$ -1456 -7782 -19928 -18953 -30245 -6505 13445 6425 3669 5699 11766 2696 -1369 -3202 -14685
7543a4685P447P253l92j801n589j7219J3491L112O604K858J41J2795k6156M96
$$ -14685 -7238 15 -377 -2178 -7767 -24986 -11495 -8383 -1779 1079 1220 14015 -12141 -11645
7529a1645K499j9916k821K1041J6407P586k8766j9263J8000J1872r239P786q292
$$ -11645 -9146 -29062 -31883 -10842 5565 13151 -15615 -34878 -16878 -5006 -14245 -6459 -14751
7516a4751K197n461m531K7473J4320J7828n67m771j0751l0390m827j5625J4194
$$ -14751 -12554 -18015 -22546 4927 19247 37075 36508 31737 20986 -9404 -14231 -29856 -15662
7503a5662J2753n256J1756K562j9891M78M657Q740r927Q20J4333K253l1781q943
$$ -15662 -2909 -8165 3591 6153 -13738 -13260 -8603 137 -9790 -8970 5363 7616 -24165 -33108
7489c3108L633l724j5634N693j5257m650L8653K2504M511J409jN470n263j765
$$ -33108 -29475 -33199 -48833 -43140 -58397 -63047 -24394 -1890 2621 4030 4029 9499 4236 2471
7475B471J257l4774K6428J0863r697J2097k960k4225k4212k7714J6135K3268L7467
$$ 2471 3728 -31046 -4618 6245 -3452 8645 5685 -18540 -42752 -70466 -54331 -31063 6404
7462F404O476l58M79k3971r917m553j1677K4723Q761j3752K567j8978j1126K5456
$$ 6404 12880 12522 13001 -10970 -20887 -25440 -37117 -12394 -3633 -17385 -14818 -33796 -44922 -19466
7448a9466L265K068M261n636k651L785l241j3746l308R219K1780M703N900R894
$$ -19466 -16201 -14133 -9872 -15508 -18159 -14374 -17615 -31361 -34669 -25450 -3670 1033 6933 16827
7434A6827k3641L384o674J3967j5866k5996M439R808j0503l3387p296K3685L3998
$$ 16827 -6814 -3430 -10104 3863 -12003 -37999 -33560 -23752 -34255 -67642 -74938 -51253 -17255
7421a7255J5218J831K0583n809n797N931j1044j7026J0987j1444k409Q203Q124
$$ -17255 -2037 -206 20377 14568 8771 14702 3658 -13368 -2381 -13825 -16234 -8031 93
7408I3l0024m265J726j164Q165L0515J0786j0166M082J6977J2648j4522l0636
$$ 93 -29931 -34196 -32470 -33634 -25469 5046 15832 5666 9748 26725 39373 24851 -5785
7395e785j1496J3046m095j1021J676k9202Q696K4115K3283k0968J255Q349K1747
$$ -5785 -17281 -4235 -8330 -19351 -17675 -46877 -38181 -14066 9217 -11751 -10496 -2147 19600
7382A9600J2984l788k2227J825K2794o352p47j23q288k3902M849J4368j93j2588
$$ 19600 32584 28796 6569 8394 31188 24836 24089 23966 15678 -8224 -3375 10993 10800 -1788
7368a788k4323j8q239j4148j2937K6215K0258J8177N545M612Q677k2501P994j732
$$ -1788 -26111 -26129 -34368 -48516 -61453 -35238 -14980 3197 8742 13354 22031 -470 7524 5792
7354E792k5681N161J5943k4814L230O963n970J5960J5501J6219j3717l364j6730
$$ 5792 -19889 -14728 1215 -23599 -20369 -13406 -19376 -3416 12085 28304 14587 11223 -5507
7341e507o193k2748j1729j4269l866l873j0103L4551N7245K7858j3879j9420l2817
$$ -5507 -11700 -34448 -46177 -60446 -64312 -68185 -78288 -43737 13508 41366 27487 8067 -24750
7328b4750k100l1490R270J0858K4987j0666j7924j9812m341J0448K5887J6614
$$ -24750 -26850 -58340 -49070 -38212 -13225 -23891 -41815 -61627 -65968 -55520 -29633 -13019
7316a3019J8877R45k0165j4108J5468K7651R985r603J1687j7540j0649J9272J4726
$$ -13019 5858 6803 -13362 -27470 -12002 15649 25634 16031 27718 10178 -471 18801 33527
7303C3527M442j7060J1306l699k2406J083K5224R228l6389j7851O959k2833L300
$$ 33527 37969 20909 32215 28516 6110 7193 32417 41645 5256 -12595 -5636 -28469 -25169
7290b5169J4904n956m020J2007M593m573j7925j4753O97M082K5254J1607M475
$$ -25169 -10265 -16221 -20241 -8234 -3641 -8214 -26139 -40892 -40195 -36113 -10859 748 5223
7277E223O148O902O216j4615j5674j7744J3592K1950J1413r699r405o658L895
$$ 5223 11371 18273 24489 9874 -5800 -23544 -9952 11998 23411 13712 4307 -2351 1544
7264A544L848O594k0273k325j1784K636m33K0293n652j8123K125Q300K0736p877
$$ 1544 5392 11986 -8287 -10612 -22396 -19760 -20193 100 -5552 -23675 -21550 -13250 7486 -391
7250c91j3934K4805J5913j6141k5366l1497P680J0769O123J3357M0577J5004m2046
$$ -391 -14325 10480 26393 10252 -15114 -46611 -38931 -28162 -22039 -8682 31895 46899 4853
7237D853j8105k134n954q003J2317K9207j1631j0998J5303O911k2860Q858J2371
$$ 4853 -13252 -15386 -21340 -29343 -17026 12181 550 -10448 4855 11766 -11094 -2236 10135
7224A0135L528P378J2792L498r520O773k106k8989m096k775R826j5074k8061N619
$$ 10135 13663 21041 33833 37331 27811 34584 32478 3489 -607 -3382 6444 -8630 -36691 -31072
7210c1072K6659J8593J655r453j5912P790l980k5177J1711K624J2087M374J4468
$$ -31072 -4413 14180 15835 6382 -9530 -1740 -5720 -30897 -19186 -16562 -4475 -101 14367
7197A4367K527o435Q468j8514j3502L141k8377m538Q874P60Q85J5785K5908K578
$$ 14367 16894 10459 18927 413 -13089 -9948 -38325 -42863 -33989 -33229 -32344 -16559 9349 11927
7183A1927j9313J1005J0007j8859q230J1889k901K6615J9112k2949l0426l3088
$$ 11927 -7386 3619 13626 -5233 -13463 -1574 -4475 22140 41252 18303 -12123 -45211
7171d5211L429R41K0638R471m921J6597K0437o818k5474l928J9080o473k7211
$$ -45211 -41782 -40841 -20203 -10732 -15653 944 21381 14563 -10911 -14839 4241 -2232 -29443
7158b9443L430j306l127O432M897O00k0826j232J9161J1653j2970k165M497K9534
$$ -29443 -26013 -27319 -30446 -24014 -19117 -18517 -39343 -40575 -21414 -9761 -22731 -24896 -20399 9135
7144I135n351J0042l3677r154K7429R437j1830j7264J9476Q461j3880r147j2825
$$ 9135 3784 13826 -19851 -29005 -1576 7861 -3969 -21233 -1757 6704 -7176 -16323 -29148
7131b9148o813K3114J8124k563J1017k4214j1916k157K993K7642J0263l3273O093
$$ -29148 -35961 -12847 5277 2714 13731 -10483 -22399 -24556 -21563 6079 16342 -16931 -10838
7118a0838N622J6698l6993j9221K0341Q617q566j1294k1315QL7950j564k8166
$$ -10838 -5216 11482 -25511 -44732 -24391 -15774 -24340 -35634 -56949 -56941 -18991 -20555 -48721
7105d8721J6407L4324o587k7971K307K0559K407J6749J0375k551j90o503n753
$$ -48721 -32314 2010 -4577 -32548 -30241 -9682 -7275 9474 19849 17298 17108 10605 4852
7092D852J753J051j5713j1501K5256R797J3398J87o190n923l8726j4978N023K7131
$$ 4852 6605 7656 -8057 -19558 5698 15495 28893 29080 22890 16967 -21759 -36737 -31714 -4583
7078d583K9502j236k1679l3855p885j8012j038J7433J7433J3470k8950j8903K2676
$$ -4583 24919 23683 2004 -31851 -39736 -57748 -58786 -41353 -23920 -10450 -39400 -58303 -35627
7065c5627L3565O173Q375q65N671j3424l6534J1994L4715n9m209k2328K737J1064
$$ -35627 -2062 4111 12486 11621 17292 3868 -32666 -20672 14043 13984 9775 -12553 -9816 1248
7051A248n410q026J9459j7994K203K7409K4664r805k1080k6833k2966J1697P336
$$ 1248 -4162 -12188 7271 -10723 -8520 18889 43553 33748 12668 -14165 -37131 -25434 -18098
7038a8098r994L857k342r257J4602N751p750k092l556q369J371l399K4618O242
$$ -18098 -28092 -24235 -26577 -35834 -21232 -15481 -23231 -25323 -28879 -37248 -35877 -39276 -14658 -8416
7024h416k9722k1196j5842J6124J4735L0522K6138k402q383m842k328k2084k764
$$ -8416 -38138 -59334 -75176 -59052 -44317 -13795 12343 9941 1558 -3284 -5612 -27696 -30460
7011c0460J4223j7962k2547L132M386J4067Q755J5807K3747k1492k253L1690M961
$$ -30460 -16237 -34199 -56746 -53614 -49228 -35161 -26406 -10599 13148 -8344 -10597 21093 26054
6998B6054J4461k270o444o609r291j6554j7661k8441J428J285M0534M345l967
$$ 26054 40515 38245 31801 25192 15901 -653 -18314 -46755 -45327 -44042 -3508 837 -3130
6985c130k3821J5501j1024L467Q949N877O653Q382j1174k0246K7280M3662L578
$$ -3130 -26951 -11450 -22474 -19007 -10058 -4181 2472 10854 -320 -20566 6714 50376 53954
6972E3954J6457j3711J003J1325r780j561j4891k3684k983Q252M584q704k3571
$$ 53954 70411 56700 57703 69028 59248 57687 42796 19112 16129 24381 28965 20261 -3310
6959c310n893J3740l92n95J3140p527Q828l623Q738J7599K2154j4047l0583j0616
$$ -3310 -9203 4537 4145 3550 16690 9163 17991 14368 23106 40705 62859 48812 18229 7613
6945G613j2856j5694J5478J8046J7463M066P355k9528k2244j1653K419K8658J3102
$$ 7613 -5243 -20937 -5459 12587 30050 34116 41471 11943 -10301 -21954 -19535 9123 22225
6932B2225o16L969k3860j8607R72L2353L9861k2077l1067j3428j7060J770J4811
$$ 22225 21609 25578 1718 -16889 -15917 16436 56297 34220 3153 -10275 -27335 -25565 -10754
6919a0754o188J0966L6939o195N91q602M012P820J7701m538l5075k3866l877R804
$$ -10754 -16942 -5976 30963 24768 25359 16757 20769 28589 46290 41752 6677 -17189 -21066 -11262
$$ [...]
##END NTUPLES=NMR SPECTRUM
##END=
