##TITLE=Analysis number 325092
Compound Code cc 38016
Book Reference 423/126/2/4
Project Code adrs
Chemist Name bruced
##JCAMPDX= 6.0         $$ Bruker NMR JCAMP-DX V2.0
##DATA TYPE= NMR SPECTRUM
##DATA CLASS= NTUPLES
##ORIGIN= Bruker BioSpin GmbH
##OWNER= nmr
$$ XWIN-NMR		Version 3.5
$$ Mon Dec 11 14:30:56 2006 GMT Standard Time (UT+0h)  MAYBRIDGE\nmr@NMR_250MHZ
##.OBSERVE FREQUENCY= 250.131544655141
##.OBSERVE NUCLEUS= ^1H
##.ACQUISITION MODE= SIMULTANEOUS (DQD)
##.ACQUISITION SCHEME= undefined
##.AVERAGES= 16
##.DIGITISER RES= 18
##SPECTROMETER/DATA SYSTEM= dpx250
##.PULSE SEQUENCE= zg30
##.SOLVENT NAME= CDCl3
##.SHIFT REFERENCE= (INTERNAL, CDCl3, 0, 16.5213)
##AUDIT TRAIL= $$ (NUMBER, WHEN, WHO, WHERE, WHAT)
$$ ##TITLE= Audit trail, XWIN-NMR		Version 3.5
$$ ##JCAMPDX= 5.01
$$ ##ORIGIN= Bruker BioSpin GmbH
$$ ##OWNER= nmr
$$ C:\u/data/dgb/nmr/ADRS/660/pdata/1/auditp.txt
$$ ##AUDIT TRAIL=  $$ (NUMBER, WHEN, WHO, WHERE, WHAT)
(   1,<2006-12-11 14:30:35.32 +000>,<MAYBRIDGE\nmr>,<NMR_250MHZ>,
      <created by zg, POWCHK disabled, PULCHK disabled
       configuration hash MD5:
       49 4B E0 1D 92 C2 6B 37 9F E6 65 BC 52 41 86 1D
       data hash MD5: 64K
       D0 DB 0C 89 E4 E3 47 73 80 72 B3 7D 04 E9 61 BA>)
(   2,<2006-12-11 14:30:47.99 +000>,<MAYBRIDGE\nmr>,<NMR_250MHZ>,
      <Start of raw data processing
       ef LB = 0.3 FT_mod = 6 PKNL = 1 SI = 32K 
       data hash MD5: 32K
       0E FB 77 E1 D8 7B 88 D6 4E 31 AC 18 82 58 13 11>)
(   3,<2006-12-11 14:30:49.50 +000>,<MAYBRIDGE\nmr>,<NMR_250MHZ>,
      <apk 
       data hash MD5: 32K
       0F A3 BF 9C 60 D2 09 F8 19 C2 F9 8E AD 9C EC A0>)
(   4,<2006-12-11 14:30:50.17 +000>,<MAYBRIDGE\nmr>,<NMR_250MHZ>,
      <abs ABSG = 5 
       data hash MD5: 32K
       94 C3 FF B7 8D CE F1 E2 17 CC D5 46 E6 8D 16 22>)
$$ ##END=
$$ 
$$ hash MD5
$$ AF C7 58 3D 25 47 4B 1A D7 05 F0 13 DD 62 B0 84
##$RELAX= 
##$RELAX= 
##$RELAX= 
##$RELAX= 
##$RELAX= 
##$RELAX= 
##$RELAX= 
$$ Bruker specific parameters
$$ --------------------------
##$DU= <C:\u>
##$EXPNO= 660
##$NAME= <ADRS>
##$PROCNO= 1
##$TYPE= <nmr>
##$USER= <dgb>
##$AMP= (0..31)
100 100 100 100 100 100 100 100 100 100 100 100 100 100 100 100 100 100 
100 100 100 100 100 100 100 100 100 100 100 100 100 100 
##$AQSEQ= 0
##$AQ_mod= 3
##$AUNM= <au_zg>
##$AUTOPOS= <38 >
##$BF1= 250.13
##$BF2= 250.13
##$BF3= 250.13
##$BF4= 250.13
##$BF5= 500.13
##$BF6= 500.13
##$BF7= 500.13
##$BF8= 500.13
##$BYTORDA= 1
##$CFDGTYP= 0
##$CFRGTYP= 5
##$CHEMSTR= <none>
##$CNST= (0..31)
1 1 145 1 1 1 1 1 1 1 1 1 1 1 1 1 1 1 1 1 1 1 1 1 1 1 1 1 1 1 1 1 
##$CPDPRG= <>
##$CPDPRG1= <>
##$CPDPRG2= <>
##$CPDPRG3= <>
##$CPDPRG4= <mlev>
##$CPDPRG5= <mlev>
##$CPDPRG6= <mlev>
##$CPDPRG7= <mlev>
##$CPDPRG8= <mlev>
##$CPDPRGB= <>
##$CPDPRGT= <>
##$D= (0..31)
0 1 0 0 0 0 0 0 0 0.06 0 0 0 0 0 0 0.0002 0 0 0 0 0 0 0 0 0 0 0 0 0 0 
0 
##$DATE= 1165847434
##$DBL= (0..7)
120 120 120 120 120 120 120 120 
##$DBP= (0..7)
150 150 150 150 150 150 150 150 
##$DBP07= 0
##$DBPNAM0= <>
##$DBPNAM1= <>
$$ [...]
##$SUBNAM7= <"">
##$SUBNAM8= <"">
##$SUBNAM9= <"">
##$SW= 20.6930455092707
##$SWIBOX= (0..15)
0 0 3 0 0 0 0 0 0 0 0 0 0 0 0 0 
##$SW_h= 5175.983436853
##$TD= 65536
##$TD0= 1
##$TE= 295.16
##$TE2= 300
##$TE3= 300
##$TEG= 300
##$TL= (0..7)
0 120 120 120 120 120 120 120 
##$TP= (0..7)
150 150 150 150 150 150 150 150 
##$TP07= 0
##$TPNAME0= <>
##$TPNAME1= <>
##$TPNAME2= <>
##$TPNAME3= <>
##$TPNAME4= <>
##$TPNAME5= <>
##$TPNAME6= <>
##$TPNAME7= <>
##$TPOAL= (0..7)
0.5 0.5 0.5 0.5 0.5 0.5 0.5 0.5 
##$TPOFFS= (0..7)
0 0 0 0 0 0 0 0 
##$TUNHIN= 0
##$TUNHOUT= 0
##$TUNXOUT= 0
##$USERA1= <user>
##$USERA2= <user>
##$USERA3= <user>
##$USERA4= <user>
##$USERA5= <user>
##$V9= 5
##$VALIST= <valist>
##$VCLIST= <CCCCCCCCCCCCCCC>
##$VD= 0
##$VDLIST= <DDDDDDDDDDDDDDD>
##$VPLIST= <PPPPPPPPPPPPPPP>
##$VTLIST= <TTTTTTTTTTTTTTT>
##$WBST= 1024
##$WBSW= 4
##$XGAIN= (0..3)
0 0 0 0 
##$XL= 0
##$YL= 0
##$YMAX_a= 283944
##$YMIN_a= -263149
##$ZGOPTNS= <>
##$ZL1= 120
##$ZL2= 120
##$ZL3= 120
##$ZL4= 120
##$ABSF1= 16.52129
##$ABSF2= -4.171883
##$ABSG= 5
##$ABSL= 3
##$ALPHA= 0
##$AQORDER= 0
##$ASSFAC= 0
##$ASSFACI= 0
##$ASSFACX= 0
##$ASSWID= 0
##$AUNMP= <proc_1d>
##$AZFE= 0.1
##$AZFW= 0.1
##$BCFW= 0
##$BC_mod= 0
##$BYTORDP= 0
##$COROFFS= 0
##$CY= 12.5
##$DATMOD= 1
##$DC= 0
##$DFILT= <>
##$DTYPP= 0
##$F1P= 14.0000005364418
##$F2P= -0.99999901652339
##$FCOR= 0.5
##$FTSIZE= 32768
##$FT_mod= 6
##$GAMMA= 0
##$GB= 0
##$INTBC= 1
##$INTSCL= 1
##$ISEN= 128
##$LB= 0.3
##$LEV0= 0
##$LPBIN= 0
##$MAXI= 10000
##$MC2= 0
##$MEAN= 0
##$ME_mod= 0
##$MI= 0
##$NCOEF= 0
##$NC_proc= -5
##$NLEV= 6
##$NOISF1= 0
##$NOISF2= 0
##$NSP= 0
##$NTH_PI= 0
##$NZP= 0
##$OFFSET= 16.52129
##$PC= 1
##$PHC0= 226.8371
##$PHC1= 2.56136
##$PH_mod= 1
##$PKNL= yes
##$PPARMOD= 0
##$PSCAL= 4
##$PSIGN= 0
##$REVERSE= no
##$SF= 250.130000175893
##$SI= 32768
##$SIGF1= 0
##$SIGF2= 0
##$SINO= 400
##$SIOLD= 32768
##$SREGLST= <1H.CDCl3>
##$SSB= 0
##$STSI= 32768
##$STSR= 0
##$SW_p= 5175.98343685301
##$SYMM= 0
##$S_DEV= 0
##$TDeff= 65536
##$TDoff= 0
##$TI= <Analysis number 999999
Compound Code 99
Book Reference 9
Project Code 9>
##$TILT= no
##$TM1= 0
##$TM2= 0
##$TOPLEV= 0
##$USERP1= <user>
##$USERP2= <user>
##$USERP3= <user>
##$USERP4= <user>
##$USERP5= <user>
##$WDW= 1
##$XDIM= 32768
##$YMAX_p= 508201669
##$YMIN_p= -582958
$$ End of Bruker specific parameters
$$ ---------------------------------
##NTUPLES= NMR SPECTRUM
##VAR_NAME=  FREQUENCY,     SPECTRUM/REAL,   SPECTRUM/IMAG
##SYMBOL=    X,             R,               I
##VAR_TYPE=  INDEPENDENT,   DEPENDENT,       DEPENDENT
##VAR_FORM=  AFFN,          ASDF,            ASDF
##VAR_DIM=   32768,         32768,           32768
##UNITS=     HZ,            ARBITRARY UNITS, ARBITRARY UNITS
##FACTOR=    0.157963299565203, 1,           1
##FIRST=     4132.47022694315, 0,            0
##LAST=      -1043.51320990986, 0,           0
##MIN=       -1043.51320990986, -582958,     0
##MAX=       4132.47022694315, 508201669,    0
$$ Real data points
##PAGE= N=1
##DATA TABLE= (X++(R..R)), XYDATA
$$ [...]
15047a36141m1301n949O8566J32572N3994j6476p2636J11753O1537k5244J4872
15036A45547l8401M7702J49204J48632r5189k20187j60343J44046R5044N1571
15026B67626J0857k0493l8632r3271N4567Q360J4456O0648n744j36491o0853m6816
15014A4214R8132L5393k6709k0283l6956k09024j13345P9451Q3178J32754k3600
15003A3205q7844m5066R5112L9285M6917r265n600J25143Q3637j13650o3372m538
14991G3964L3743M4354O6275m5993j00965j008n0435q0354K3498P5784m099k4029
14979A0735L4213j13766M7870q8445j41430k8494J29563J16105J30713P7967L021
14968A78052j06922l1682r1833O201o8992M3881J55841L4674M502Q153O6496K6976
$$ y = [-136141, -177442, -183391, -114825, 17747, 71741, 55265, -17371, 94382, 155919, 130675, 145547, 107146, 154848, 304052, 452684, 357495, 137308, -23035, 121011, 216055, 267626, 278483, 257990, 219358, 126087, 180654, 189014, 203470, 264118, 258374, 121883, 61030, 14214, 112346, 147739, 121030, 100747, 63791, -145233, -258578, -179127, -95949, 36805, 13205, -74639, -119705, -24593, 14692, 61609, 52344, 46744, 171887, 255524, 141874, 78502, 73964, 107707, 152061, 218336, 172343, 71378, 70370, 19935, -60419, -36921, 38863, 34764, 10735, 44948, -68818, -20948, -109393, -250823, -279317, -149754, -33649, 97064, 175031, 178052, 71130, 39448, -52385, -46184, -115176, -71295, 84546, 119220, 123722, 131875, 198371, 225347]
14956B25347q2172n6981q6199n8589M1585R4471M5376j76868m7369n3013l0117
14945a84529K4782J24059K083J42700J01574j44297j45045j2874L8416O0660m141
14934C388j54076M0199k3851q9292K020K62991M1411p4353j01148p9775J22430
14923e0056j04476J39046P094L206P185J3956J624K4449p0944L202P4328k3583
14911B5031q4657J8689n1027K7918R3192m7003l1482l643k9664o6010j35347J55283
14899a28720J43693Q7590M1781j24746r8434J4054l3674K5335R9224J14424m5831
14888I4696l1020j34146k3763J08337j116M6669J63613N9795n7705O1553P9505
14877C66418r2109m5475n1925j70271l1285K9801P262n4415l3347K330l2450J83181
$$ y = [225347, 143175, 86194, -5, -58594, -17009, 77462, 122838, -54030, -101399, -154412, -184529, -159747, -35688, -33605, 109095, 210669, 66372, -78673, -91547, -53131, 7529, 3388, -150688, -110489, -134340, -223632, -221612, 41379, 82790, 8437, -92711, -172486, -50056, -154532, -15486, -8392, -5186, 1999, 15955, 17579, 42028, -28916, -25714, 48614, 25031, -59626, -40937, -91964, -64046, 29146, -17857, -49339, -52982, -82646, -148656, -284003, -128720, 14973, 102563, 144344, 19598, -78836, -64782, -98456, -73121, 26103, 140527, 94696, 63676, -70470, -94233, 14104, 12988, 59657, 223270, 283065, 225360, 286913, 366418, 274309, 228834, 176909, 6638, -24647, 5154, 12416, -41999, -75346, -73016, -105466, 77715]
14865G7715L2745n2550j40281j96682N1122J65584J14725J24832m2061l0549o3734
14854D0866j32204k0568J9477J0906l9552J9924J05830P8469Q2416J90147o200
14843C49511k06544j12517R0452j09072j58692o72Q8306M202k6931O3297L2179
14832A3519m9500j8736J09964O5440r9179r8639j27644K907J14910L6603p4323
14821a24678K4904Q0705J18737K1240p649k9633m9144o6817l8435p055J90634
14810A12809J5272j36074o9418J50245J22796r8261n0256M7940k5579j64909j42948
14799b38383M680K47239K02088k5768j45805j86260n4672q4672M3650P4512J25196
14788c8195j19347k2006Q6759m4392R3525J24708q1180k6052J9199Q0915P7109
$$ y = [77715, 110460, 57910, -82371, -279053, -227931, -62347, 52378, 177210, 135149, 104600, 40866, -91338, -111906, -92429, -81523, -121075, -101151, 4679, 83148, 165564, 355711, 349511, 142967, 30450, 120902, 11830, -146862, -147534, -59228, -55026, -81957, -18660, 13519, -35981, -54717, 55247, 120687, 21508, -77131, -204775, -201868, -86958, -50355, -124678, -99774, -19069, 99668, 120908, 113259, 83626, 34482, -32335, -70770, -77825, 112809, 128081, -7993, -77411, 72834, 195630, 97369, 47113, 95053, 69474, -95435, -238383, -233703, 13536, 215624, 189856, 44051, -142209, -196881, -281553, -237903, -163391, -38195, -157542, -179548, -92789, -137181, -43656, 81052, -128, -26180, -6981, 73934, 151043]
14777A51043Q6211o4978n1278L1208N8603J36829M7916O1563k3630j49008j28299
14766A56180j15088k5522r4945M3231Q3768M1636q5246j19187J45088K07039O7973
14755C04927j9264j39354m0227J494l2483l1479p7202J45163l3064j4101J2336
14744G6746j05272n0666N4143L6335J0073j0637M0347N9458J22462p182l4005
14733A91802j31160j11362L5360Q2092K8726j52836j00610J07989M3155m9070
14723e5914j00343p966O9470O0317M6511N0314P4310j05308n2312N2592o9632
14712c7961N4500r3942k9900q6086J98621J70339P4256o1906j22674L2093Q4667
14701A82007m9780K6629j24975p947o098L1236J0029j02282N2190L7593j94473
$$ y = [151043, 237254, 172276, 120998, 152206, 210809, 347638, 395554, 457117, 433487, 284479, 156180, 41092, 15570, -79375, -36144, 47624, 89260, 4014, -115173, 29915, 236954, 304927, 285663, 146309, 106082, 107576, 75093, 43614, -33588, 111575, 78511, 64410, 76746, -28526, -79192, -25049, 11286, 21359, 10722, 51069, 110527, 232989, 225807, 191802, 60642, -50720, -15360, 66732, 95458, -57378, -157988, -49999, -6844, -55914, -156257, -164223, -94753, -34436, 12075, 62389, 136699, 31391, -20921, 31671, -37961, 16539, -77403, -107303, -193389, 5232, 175571, 249827, 187921, 65247, 97340, 182007, 132227, 158856, 33881, 25934, 19836, 51072, 61101, -41181, 11009, 48602, -145871]
14690a45871l0123Q1107Q0413L1927j23449j45125J31523P7377K8396L3305O0845
14679H0325M3992j1594m316r7800o7520R6807K9043j68941k2581J2447N8747J09402
14667E8011p232r9247J1298N1188k0559L9208Q6685J5651O0662n0339o5700j36268
14655e6642p0165Q9435J52994O4120j58878j27991l6165J8125J3796N898O4419
14644d1054K03214J45777j23533j0785n8563k8306q3508q1384R1435M9906K4500
14633H7699j26831j80125R8646J08238J13250q1672l7300k8008J04735K5366K2890
14622A06888N5497l4848o6705J5491j2504j28812L5651R1333r4121m7561l1643
14611a11334K966J9126m0354q471J06356r7513M6462J21538j4077p0236j98648
$$ y = [-145871, -175994, -94887, -14474, 17453, -105996, -251121, -119598, -42221, -13825, 19480, 80325, 124317, 112723, 108407, 10607, -56913, 39894, 68937, -100004, -122585, -110138, -51391, 58011, 50779, -48468, -37170, 14018, -6541, 32667, 119352, 135003, 195665, 145326, 79626, -56642, -126807, -37372, 115622, 179742, 20864, -107127, -143292, -125167, -111371, -105473, -41054, 162160, 307937, 184404, 173619, 115056, 86750, 3242, -78142, 13293, 63199, 87699, -39132, -219257, -120611, -12373, 100877, 19205, -18095, -46103, 58632, 83998, 106888, 162385, 127537, 60832, 76323, 63819, -64993, -29342, 61991, -32130, -79691, -111334, -108368, -89242, -129596, -138067, -31711, -129224, -82762, 38776, 24699, -45537, -244185]
14600b44185l1794M8656Q5119O8026m5603M9464K0669J67503q467j97181j10570
14589a98363Q1399p411J56053j0495k40409J29651J88872m891j34270o1081K2889
14578g8056J39477L3880O7183m074j14094L231J09562L3215q94n260l1945o1160
14566I1065q8697j06692n1045M2636J78248L2026r8851n4387K052j734O1136Q5079
14554I0836O2035J7766J3032r1957j49813O5413J88960p4104k0329p0092K5498
14543E7245J07400L1447j24322k26168l4502m0004M7692P5369J02139J5059k7857
14532a6502k134J8898m7272p7072r6343M9112j066q7123m850k392K08964K60825
14520B03045Q8028j36490j18505P2777R5763J12201p1763l3485j24558K6151j26549
$$ y = [-244185, -275979, -227323, -142204, -74178, -119781, -70317, -49648, 117855, 109388, -87793, -198363, -116964, -124375, 31678, 21183, -219226, -89575, 99297, 94406, -39864, -100945, -78056, 61421, 95301, 162484, 158410, 44316, 47547, 157109, 190324, 189430, 184170, 152225, 91065, 2368, -104324, -155369, -112733, 65515, 97541, -1310, -55697, -53645, -55379, 5757, 90836, 152871, 170637, 183669, 91712, -58101, 7312, 196272, 122168, 101839, 31747, 57245, 164645, 196092, 71770, -154398, -188900, -228904, -181212, -105843, -3704, 11355, -16502, -18636, 262, -47010, -124082, -220425, -171313, -172379, -259502, -264352, -266744, -57780, 203045, 291073, 154583, 36078, 108855, 204618, 316819, 245056, 211571, 87013, 113164, -13385]
14509a3385k44717P8342J55825K10732l8780j53437j27190q1889K8342N1337n610
14498a40430L007J9704K9709k7132L3980O1093m6038J23620l6100j33563O2120
14487e0030K9336n4054j6071N4421k864L4204J08762q994k529l8568o0169j3735
14475b0291N890J13140p3826j392m9968j3448L0386m2735J56507R5067l3979j40555
14463B4796n7629O0938j52122k6993J19751J63409j25405r4063j17237j047R003
14452a96599n4589o2806M5579K56590P1254r4118O595k5635o0179L8519n6374
14441a31763J5671l5838K1413Q2209J9773m7383j54463Q8254K7026j50449j25997
14430c91547J40027Q0227O31J24255Q4473k0246O9176R781J1544l1943J2621r573
$$ y = [-13385, -258102, -179760, -23935, 186797, 148017, -5420, -132610, -214499, -186157, -134820, -140430, -137423, -117719, -88010, -115142, -81162, -20069, -66107, 57513, 21413, -112150, -50030, -20694, -74748, -90819, -36398, -39262, -5058, 103704, 94710, 92181, 53613, -6556, -20291, -14401, 98739, 24913, 23521, -26447, -39895, -9509, -52244, 104263, 199330, 165351, 24796, -32833, 28105, -124017, -151010, -31259, 132150, 6745, -87318, -204555, -205602, -196599, -251188, -313994, -268415, -11825, 59429, -34689, -28094, -53729, -113908, -75389, -131763, -116092, -151930, -130517, -48308, -28535, -75918, -230381, -142127, -115101, -265550, -391547, -251520, -171293, -170662, -46407, 38066, 17820, 86996, 96777, 108321, 76378, 88999, 79426]
14418G9426R340J48479J09006m6821k36477N7335O0392l5979r8396o0809M9865
14407C5361j27776O407J38243N4546m8128r3809m7689j15586Q6613J32608J6539
14396C7329P5250L2820P9162K6142j10298j21842p1942L7967J30192M7705P553
14385A70038j03932j13671j9117m0082r1468j2989P0705J01830J3846j02644L3345
14374i4139K1915l5422j12239N3209O1543J02012N3841m1731q4119o132K470L9703
14362c9089K0674K9452J44616J6110j47700p8129p2150M1124L6008L8809K4432
14351A4157o4441m6073j5577M5552J11803K3667j64139o9220Q4463J51731J62853
14340B34776J46655n7171j04942m8433l6673Q5859j08388j36477O110L4637o728
$$ y = [79426, 88766, 237245, 346251, 299430, 62953, 120288, 180680, 144701, 46305, -14504, 35361, -92415, -86008, 52235, 106781, 58653, -35156, -82845, -198431, -111818, 20790, 37329, 112579, 145399, 224561, 250703, 140405, 18563, -53379, -15412, 114780, 162485, 170038, 66106, -47565, -66682, -106764, -198232, -211221, -140516, -38686, -24840, -127484, -94139, -72224, -107646, -219885, -166676, -105133, -3121, 50720, 8989, -75130, -81262, -78792, -39089, -18415, 11037, 155653, 171763, 24063, -54066, -126216, -85092, -49084, -10275, 14157, -50284, -96357, -111934, -66382, 45421, 69088, -95051, -164271, -79808, 71923, 234776, 381431, 324260, 219318, 170885, 134212, 220071, 111683, -24794, -18684, 15953, 9225]
14329I225P037K9155k8496n754j08240k1418M0858M961n3446L2409J12497J79664
14317A98452L4821q834M5213l9740j40019l435J5970r5208J5738n5374Q386N7860
14305C3830p6263m4501k5506o8180J3363N9200J59500R9335J14249k2631j56018
14294H6378j41779m9056M8191Q1729j0462K263n6016N2071l7792m6597r9742K9669
14282a41143P4497R2319n0035m1978N2154k0331m9814M9443l4383L0737k8810
14271f7344J2536j19711r2586M8078J01050J31927o6706j26853P8314J72059K3240
14260I4004m2581m2903k5924j69705J35756R2812k8103L3915L9675j03767q4694
14249a01515k8264N5335Q2802K9573p0150q354m3091Q6906J59645L809j6091p7041
$$ y = [9225, 16262, 45417, 16921, 11167, -97073, -118491, -77633, -72672, -126118, -93709, 18788, 198452, 233273, 224439, 269652, 229912, 89893, 86458, 102428, 7220, 22958, -32416, -24030, 33830, -42433, -86934, -112440, -180620, -167257, -108057, 51443, 150778, 265027, 242396, 86378, -55401, -104457, -56266, 25463, 15001, 17264, -38752, 13319, -24473, -71070, -170812, -141143, -66646, 25673, -24362, -66340, -14186, -34517, -84331, -34888, -69271, -38534, -67344, -54808, -174519, -267105, -219027, -117977, 13950, -52756, -179609, -101295, 70764, 94004, 51423, 8520, -17404, -187109, -51353, 41459, 13356, 47271, 86946, -16821, -101515, -129779, -74444, 8358, 37931, -32219, -40573, -83664, 3242, 162887, 166696, 150605, 73564]
14237G3564j63489j8594o0776N9184K3482l6608j13392m5185l5968l3890J18320
14226b33352N5459J73809J16052q914p0043K520J25745k9325l7081q7540L1543
14215C8873J13760o0539p5467P9037K4298q0668J2429Q718J1281k362K9326j22924
14203b4238n8864j04415j4997P7934M1510R7098n6367p8604N3174J51905l2710
14192E1426j90944q5172L2805N6069J06221O0286O6913j8373O6794N2406r1283
14181A07148p5165Q1757L3950l6590q8901j81823N8812J20635n6205j21565Q4113
14170g3834J53499L2325j5584O402m3135n8485j5547M2434K3319r297j02991K425
14158e8469l9606J5965P3657k8543J10196M2695j7049q1026J4157j01982m7348
$$ y = [73564, -89925, -108519, -169295, -110111, -86629, -123237, -236629, -281814, -317782, -351672, -233352, -177893, -4084, 111968, 103054, 33011, 35531, 161276, 131951, 94870, 7330, 38873, 152633, 92094, 16627, 95664, 119962, 39294, 51723, 60441, 71722, 69360, 98686, -24238, -83102, -187517, -202514, -124580, -83070, 14028, -42339, -120943, -67769, 84136, 51426, -139518, -224690, -191885, -135816, -29595, 30691, 97604, 79231, 146025, 198431, 107148, 31983, 113740, 147690, 111100, 22199, -159624, -100812, 19823, -36382, -157947, -73834, 79665, 111990, 96406, 102808, 59673, 1188, -14359, 28075, 51394, 42097, -60894, -58469, -98075, -82110, -8453, -36996, 73200, 115895, 98846, 17820, 31977, -70005, -117353]
14147a17353J57086J8487p4440p6447j3182j6808O3560M3002J95945K1399m1914
14136A59335O1963m0811O023q4655K4984J39996q2768j01759j6298L5385j09230
14125g835O2645l9703O0941P3954n0078m5395k2827R0758J9236j32714J6901J14326
14113A40209P4311j46060p7855q7565j7559O9729L2882K6728o3837n0002o1229
14102a60248J05383P0601p2337K2274J42853L6811j57409l729j672l9791r0805
14091a48069p4604J1643J68681J11445p5056k7723j931O8392m9690l4305J9138
14080c2079k7620J30423l6478K2437Q3336o9873k80574M4066K44661J4514j51931
14069e9118l0750J16619J88870n183l3262o4117k6201j9891J2262K8586n1933
$$ y = [-117353, 39733, 58220, -16220, -92667, -105849, -122657, -59097, -16095, 179850, 201249, 159335, 221298, 180487, 186510, 101855, 126839, 266835, 184067, 82308, 66010, 101395, -7835, 54810, 15107, 76048, 150002, 99924, 54529, 31702, 122460, 141696, 8982, 25883, 140209, 214520, 68460, -9395, -96960, -114519, -44790, -11908, 14820, -49017, -99019, -160248, -54865, 15736, -56601, -34327, 108526, 145337, -12072, -15801, -17473, -57264, -148069, -222673, -211030, -42349, 69096, -5960, -33683, -35614, 32778, -16912, -51217, -32079, -59699, 70724, 34246, 56683, 140019, 70146, -210428, -166362, 78299, 92813, -59118, -89868, 26751, 215621, 210438, 177176, 113059, 86858, 66967, 79229, 107815, 55882]
14058E5882j3522J79200K9368N2265p2788r5653l2927k9337j31285l2460q058
14047i9315O1914J61015L5499j73969j7754J31061M6298O6517p1716n2172L7406
14036A24784j21932J22022J46794p2345l7073j14566j24493l3547L0113n6076
14026a36319K417N6413J03729j16157l3397r6032r1607J96210J58544Q5453J560
14015A30814n4029j88654O9130O3443J3692n3304j20455O8418J75131R7819K5938
14004B27943p3690J9027p3353j28058j235P4320n5339o9684J2368Q6988K0755
13993D0042J9260K3829m7717L799m4795j6969n5298R9648Q4077l1327O588n1915
13981B9222q585p6024j23218k4500N9784L2463j0245J62534p174m1011P4567r47
$$ y = [55882, 42360, 221560, 250928, 303193, 230405, 134752, 101825, 72488, -58797, -91257, -99315, -37401, 123614, 159113, -14856, -32610, 98451, 144749, 211266, 139550, 87378, 124784, 2852, 124874, 271668, 199323, 162250, 47684, -76809, -110356, -80243, -136319, -133902, -77489, 26240, -89917, -123314, -219346, -310953, -114743, 43801, 129254, 130814, 76785, -111869, -42739, 20704, 34396, -18908, -139363, -70945, 104186, 202005, 227943, 154253, 173280, 99927, -28131, -29366, 44954, -10385, -80069, -67701, 19287, 40042, 59302, 83131, 35414, 39213, -5582, -22551, -77849, 21799, 105876, 74549, 81137, 29222, 20637, -55387, -178605, -203105, -143321, -110858, -121103, 41431, 34257, -6754, 67813, 66866]
13969F6866o7479q9250j08686m0774n378L1684J04488J99032J17546q6083P357
13958A29323q1291k0878p1828j25564n4209J32362K30499m594j096N4107p2451
13947A14380K2892O0245r0709o1805o4049Q7883K42942q4639l773j04202k4320
13936I4845Q9793L1168n9098j20855j49261n7613K0602m6741Q6200L1348m3428
13925a23040j5807p1069K0721R6882N135J7494l2817l0282M9604N0868o8995r6078
13913a97384O5193J40266P9060J1310r1313j40839O8649J08092q1759q4295P9049
13902d3971j9401N1593J66805o6517j26568n3120R4205p428j33801o0576L5906
13891a62873K12267J06123O543m6151p9336j01061l8235k8837R3983Q5300K7879
$$ y = [66866, -613, -89863, -198549, -239323, -244701, -213017, -108529, 90503, 208049, 121966, 129323, 48032, 27154, -44674, -170238, -224447, -92085, 138414, 133820, 132724, 186831, 114380, 137272, 197517, 106808, 45003, -19046, 68837, 311779, 227140, 223367, 119165, 94845, 184638, 215806, 156708, 35853, -113408, -171021, -150419, -197160, -110960, -79612, -123040, -138847, -209916, -189195, -92313, -87178, -69684, -102501, -132783, -83179, -32311, -101306, -197384, -132191, 8075, 87135, 98445, 7132, -133707, -65058, 43034, -38725, -123020, -43971, -63372, -11779, 155026, 88509, -38059, -91179, 3026, -4402, -138203, -198779, -162873, 49394, 155517, 162060, 115909, 36573, -64488, -102723, -131560, -37577, 47723, 75602]
13880G5602P4155l9585K7885o3250J51969R853j71195j03724l8919l250J8162
13869f2297L7015L0635N1886J70330P1452q1348j47871j02449k4221j02803K585
13858a57086j05956j35528J10151J63166L0891J02439Q2660K466l8270k3039O792
13847C8686Q92o6177Q3849l7136o8695j7278L1759j36221k2373m5453P4596N0560
13835a12991J26978J28474O0565o4123O9017q9750k64552p1096k96J38994J37804
13824E9024Q6784j65782r849j5412n1304N7677J88670J19930m9798j11327j83071
13813g4458J17621J69376q7817k5301K0804j16209q0973N1658L4002J09374M1228
13802A59305n9384m6046J8776j05230m4938K1099K1260R795j03380p6874O519
$$ y = [75602, 149757, 110172, 138057, 74807, 226776, 236629, 65434, -38290, -77209, -80459, -62297, -25282, 5353, 57239, 227569, 299021, 217673, 69802, -32647, -56868, -159671, -157086, -263042, -398570, -288419, -125253, -94362, 8077, 90737, 93203, 54933, 31894, 38686, 39578, -26599, 57250, 20114, -48581, -65859, -34100, -170321, -192694, -238147, -163551, -112991, 13987, 142461, 203026, 138903, 207920, 118170, -146382, -217478, -217774, -78780, 59024, 145808, -19974, -29823, -45235, -96539, -38862, 149808, 269738, 219940, 108613, -74458, 43163, 212539, 124722, 99421, 120225, 4016, -76957, -25299, 8703, 118077, 159305, 99921, 53875, 72651, -32579, -77517, -56418, -35158, -25363, -128743, -205617, -199098]
13791a99098J04316n5979R7235K8367J56634k6941j54493N7659J1357j06562j36483
13780b23988O870J54821J20573k5376m961L6268l1532k7954o4481M5778J25610
13769A11628k15573j66057Q9619J40200q4048r8692Q7634o0457o8633o4935J35219
13758a94095L2557j7552n192K0312N5903p6846M011P9587O1808R8753j9693J7822
13746E7375J2817q5891j45841R4796l6056O610R625N5901J13549j00506j07766
13735a25387N7188k42651j37282K6997J16108J20677J10925J02533k3177n8432
13725e2501L0587p603M1586J14170M7324M9792J4160n2507j05656j24192Q7656
13714D2816Q1184m8853p486k2339j60972R3532O1816L4673P9656P8478o8474j62020
$$ y = [-199098, -94782, -150761, -53526, -25159, 131475, 104534, -49959, 7700, 19057, -87505, -223988, -217118, -62297, 58276, 32900, 27939, 64207, 32675, 4721, -59760, -13982, 111628, -103945, -270002, -180383, -40183, -124231, -222923, -135289, -195746, -264379, -329314, -194095, -161538, -179090, -184282, -163970, -108067, -184913, -180902, -101315, -39507, 59246, 39553, 57375, 70192, -15699, -161540, -66744, -102800, -96190, -86565, -30664, 82885, -17621, -125387, -68199, -310850, -448132, -421135, -305027, -184350, -73425, 29108, 5931, -52501, -21914, -29517, 12069, 126239, 173563, 223355, 237515, 185008, 79352, -44840, 42816, 124000, 75147, 67661, 45322, -115650, -22118, 39698, 74371, 154027, 232505, 164031, 2011]
13702B011j59175M0819m2297l3238O1169L0933O5518q0218K10491o9677j38764
13691a12428J4684k2324m5510O469J00511P2281N377P358K6198j6279J5638O5868
13679A17843O8268m1560j09869J7147J36039J50319P0751j95514k53821n7243
13669i7640l0983Q6508l760P919K8723J27983n4544j4479R1453m4987j8019j65325
13657h7151m7382J15725r5099j3331O167r66P8441k5011l0824J43233J36818K7489
13645B08109k4733M0926m0536j05028p777j10757R672J14120O3560o9442k149
13634G5965Q2593N9988p1009m0855o1633j15077p7993Q1095P854N2216n6728k0020
13622h3604Q0125J80628q9976j16380n4644n6964Q2470L9342O1362P1835j73725
$$ y = [2011, -157164, -116345, -158642, -191880, -130711, -99778, -34260, -114478, 96013, 26336, -112428, -97744, -120068, -165578, -159109, -58598, 13683, 19060, 26418, 52616, 36337, 51975, 117843, 186111, 144551, 34682, 51829, 187868, 338187, 408938, 213424, -40397, -97640, -128623, -42115, -45875, -37956, -9233, 118750, 64206, 49727, 141180, 96193, 78174, -87151, -134533, -18808, -113907, -127238, -121071, -122037, -43596, -68607, -99431, 43802, 180620, 208109, 183376, 224302, 183766, 78738, 70961, -39796, -30124, 83996, 147556, 78114, 75965, 158558, 218546, 147537, 106682, 45049, -70028, -148021, -66926, -59072, -6856, -63584, -83604, -3479, 177149, 87173, -29207, -83851, -140815, -58345, -19003, 42359, 114194, -59531]
13611e9531M2695l9188j2026Q0541J3678M9858K0014n3749r584p1583P6139N488
13599D2752j45916r0199K22801J07960J02780L6273j23246q7959l5574p2141P4651
13588C2182O2065O5506L900j90088m3460r9635o2796J50798J0808J0888R5073
13577C5241q3197Q1567J22844j3729j2685j9747J08787q1258j39800J42930L44
13566A41297j50448m9690j3485K7298Q2517Q42k7670p4369K7173Q0035J1607P3875
13554A28982o923j35364j75814j6256L1603N4916J30264N0673P3981j25132K9282
13543D0212m807R2159K4646n8431J00789n7165n226j73215N6613Q9817l7068R224
13531G7548l7570j3028R7088L7969j41532j50730L2202K4731k0746r0608J12992
$$ y = [-59531, -16836, -56024, -68050, 12491, 26169, 76027, 96041, 42292, 32708, -38875, 37264, 42752, -103164, -193363, 29438, 137398, 240178, 276451, 153205, 65246, 29672, -42469, 32182, 94247, 159753, 163653, -26435, -69895, -169530, -232326, -81528, -70720, -59832, 35241, -47956, 33611, 156455, 142726, 130041, 110294, 219081, 137823, -1977, 140953, 141297, -9151, -58841, -72326, -45028, 37489, 38331, 10661, -63708, -36535, 43500, 55107, 128982, 122059, -13305, -189119, -205375, -173772, -118856, 11408, 62081, 136062, 10930, 40212, 35405, 127564, 152210, 93779, 194568, 137403, 132177, -41038, 15575, 105392, 68324, 77548, 39978, 26950, 124038, 162007, 20475, -130255, -98053, -73322, -94068, -184676, -71684]
13520g1684J78689k5513J10642L2692j65741L0196J51462J17592j62086k07028
13510a0779q0612n5322R4825J31972O1342N5525j77894l8507P1574J91033P3225
13499C16382p5900m8299j93753l5711K552J06280J5254o8388q1606J2047j9591
13488g0733K2719r6991k341N8698J26162N5901n4247O4401k691j0632k519M7597
13476A35324m266o5803J54673o6467k9057j31P529O36j20495j4203K0489M2334
13464F0563k895j64720k10600L6976K28474J5135M3448J12087q0816j22734P8955
13453f127l1729l1202J30497L2365L9944L5005k20494n1576K9047P3446J14301
13442A13477R8087L2166K6027m7735j33244o799J8744K2318L9223o8668n5258
$$ y = [-71684, 107005, 81492, 192134, 224826, 59085, 89281, 240743, 358335, 196249, -10779, -91391, -146713, -51888, 80084, 141426, 196951, 19057, -19450, 52124, 243157, 316382, 240482, 192183, -1570, -37281, -34729, 71551, 86805, 18417, -63189, -51142, -70733, -48014, -145005, -147346, -88648, 37514, 93415, 39168, 103569, 100878, 90246, 87727, 135324, 131058, 65255, 219928, 153461, 124404, 124273, 131802, 132438, 11943, -2260, 18229, 60563, 57668, -107052, -317652, -280676, -52202, -37067, 6381, 118468, 37652, -85082, -6127, -37856, -69058, 61439, 93804, 133748, 168753, -51741, -103317, -74270, -824, 113477, 211564, 243730, 269757, 222022, 88778, 81979, 100723, 123041, 162264, 93596, 38338]
13431C8338m5065Q4397K6410p266L3153L3556j50369o5625N4600Q4048L4638k1052
13419I9763j03150n2072M7413j8531P1120l0311j7113p7231J6640o4367R6394
13408c1445L6690M9104j8443m4464j20378j0860J23884J66973M3618q4437j58020
13397d7778j5831R0185l1497M2377J5774M2241J37544P714j42319j05848m6838
13386e4276k1848J28259J00848l8593J29785J6283q8994q8796n1942P99R0143
13375A21668q4737o9746J01945L8621j22767j13670l5836J13501J5735q8707n312
13364a29305J86403M9815m473k4136J06201M9464j55229o0565R9444l6528m1551
13353C9540Q690P2991p7839q7738r6906k9615l287J15781J64583K5194m8923R265
$$ y = [38338, -6727, 77670, 104080, 96814, 129967, 163523, 13154, -52471, 2129, 86177, 120815, 99763, -3387, -55459, -8046, -26577, 44543, 14232, -2881, -80112, -63472, -127839, -31445, 5245, 54349, 35906, -8558, -128936, -139796, -15912, 151061, 194679, 110242, -47778, -63609, 26576, -4921, 37456, 53230, 95471, 233015, 240729, 98410, -7438, -54276, -76124, 52135, 152983, 114390, 244175, 260458, 171464, 82668, 30726, 31525, 121668, 36931, -32815, 69130, 107751, -15016, -128686, -164522, -51021, -35286, -123993, -129305, 57098, 106913, 102440, 78304, 184505, 233969, 78740, 18175, 117619, 81091, 39540, 48230, 121221, 43382, -44356, -141262, -170877, -174164, -58383, 106200, 131394, 82471, 91736]
13341I1736r68k6661M1676k422k4659p1912Q5489J04781p8465j21010q3788m1269
13329a27472K5036R9201J14418J05283L3511j29331n5946n6673R262P0870Q5119
13318A73278m9731q5816r0105M0643J8l3421N6378n4617N6510P6789p8635L366
13306A4657L9785N8283Q4805L1512n3336k6517l275j238p8240l3471p3040q521
13294d8596J01616P6744L4752j3381r808k5013J11328L6881k5225j83413p9403
13283b3518j21930q9879J63106L0836R7603J19041J17230j54289j91541k26746
13273b80087J1323R9460N7360J7815J17329Q0599k8049j10062p5896l9115N2173
13262i7150l753J32617K6918j6079M7189Q957j8003p8390j5551P9282N7595o9475
$$ y = [91736, 90768, 64107, 105783, 103361, 78702, 6790, 92279, 197060, 118595, -2415, -86203, -127472, -102436, -3235, 111183, 216466, 249977, 120646, 64700, 8027, 17289, 88159, 173278, 123547, 37731, -52374, -11731, -11713, -45134, 11244, -43373, 13137, 89926, 11291, 14657, 54442, 112725, 197530, 229042, 175706, 149189, 145914, 144676, 66436, 32965, -40075, -48596, 53020, 129764, 164516, 151135, 141327, 116314, 227642, 264523, 239298, 55885, -23518, -145448, -235327, -72221, -41385, 56218, 175259, 292489, 138200, -53341, -280087, -268764, -169304, -111944, -94129, 23200, 103799, 75750, -34312, -110208, -149323, -97150, -100903, 31714, 58632, 42553, 89742, 98699, 80696, 2306, -13245, 66037, 123632, 54157]
13250E4157L8914r8020O7223j7463m748P3244k2798k6516P8381R6538P4374o2833
13238B50453j16020K4841L2195j06580j26918O6312J04463L5191j04540L0953
13228I0350J43712k1480j52888p3272P7287J63326J3202q3703O044N7999n7870
13217A62707J1708J09887n6412n244o2828r3186P5810k3596n496J382n2874j04102
13205d2244m3476L3362K6151n5439j34338Q8869L8747R4808n8p4444r8951M6602
13193a20411L3640N9181O6392R1485O6883n6739R8331J06680q989j05507j7730
13182B13216M3265K5642K1477R9553L5090p7269p3441o6144n6350K0709m4945
13171A40803L8732n0446J09632n6111R8145M8400n3631L1433r5670r0306O1011
$$ y = [54157, 93071, -4949, 62274, 44811, 40063, 113307, 90509, 63993, 142374, 238912, 313286, 250453, 134433, 159274, 191469, 84889, -42029, 24283, 128746, 163937, 59397, 90350, 234062, 212582, 59694, -13578, 63709, 227035, 240237, 156534, 162578, 220577, 162707, 174415, 284302, 227890, 222646, 159818, 66632, 142442, 118846, 113350, 114732, 61858, -42244, -85720, -52358, -26207, -81646, -215984, -127115, -88368, 6440, 6382, -68062, -167013, -120411, -86771, -27590, 38802, 130287, 197170, 140431, 238762, 345442, 336453, 230946, 213216, 256481, 282123, 303600, 403153, 438243, 360974, 287533, 221389, 165039, 185748, 140803, 179535, 129089, 238721, 182610, 280755, 329155, 275524, 306957, 211287, 120981, 181992]
13160A81992Q5936L0190q8150P4139l4733o2755J05070j19233o1376r9905q5494
13149g4319j32749J53687J2425M5264J9032L3772M8406J5774n0686m3337K1831
13138D9100m8521M5672J52601K7635R4909L4919j30698O9597J36024j03771j749
13127C25718k4635q8178Q3272N6527L194j35990q0859M4048J49065j62028j25605
13116D4529p833N1227J67493M5766R7291J9044j48403j24700M4336p6194r3480
13105A9076J22693K04613K6081K6499k4891l1587K7744p6732p5390J4584O4959
13094B97649J31177Q3533M6698R0098K0565j41097p1131j03822j10783j45504
13084I7383K204J16888K19120k4437j62168m4460R123j181J30648L4711M2605
$$ y = [181992, 267928, 298118, 209968, 284107, 249374, 186619, 291689, 172456, 111080, 11175, -74319, -207068, -53381, -40956, 4308, 23340, 57112, 105518, 121292, 70606, 27269, 49100, 579, 46251, 198852, 226487, 321396, 356315, 225617, 295214, 431238, 327467, 325718, 301083, 212905, 296177, 352704, 355898, 219908, 139049, 183097, 332162, 170134, 44529, 36696, 87923, 255416, 301182, 398473, 417517, 269114, 144414, 188750, 112556, 19076, 141769, 346382, 372463, 398962, 374071, 342484, 370228, 293496, 218106, 232690, 297649, 428826, 512359, 559057, 649155, 669720, 528623, 457492, 353670, 242887, 97383, 99587, 216475, 435595, 411158, 248990, 204530, 213653, 212472, 343120, 377831, 420436]
13073D20436K670n0734M4808K3687L51O318j54186j65107l8482J49771R5923k8208
13061C07247j22013j53467o6139J39316J57886j03980j943r3951Q492J3587o5196
13050A9839m4216m0009O2871P4964J56289M1537j5589p2446k16176l4682J83001
13039A15383j3629k3031l8746K5478P5999r2017k15302L1250J34988J76174m2398
13028A34149J6406Q8201J10858j20466j69740J2195l8565o0891k4516K17O1410
13017I258L0067M8616o353J7827r0614j03298J0741Q8516m1305L2914M9473J1636
13005E7478m8624l8145m7417J3043M2693R6564J6834J8602p3150O1246m2053Q3176
12993A40247J59414l3694k3808j5067p5932J17494L0805j69191j29757m732p5159
$$ y = [420436, 423106, 372372, 417180, 440867, 441218, 447536, 293350, 128243, 89761, 239532, 335455, 307247, 185234, 31767, -34372, 104944, 262830, 158850, 156907, 62956, 71448, 85035, 19839, -24377, -64386, -1515, 73449, 229738, 271275, 255686, 183240, -32936, -67618, 115383, 101754, 78723, 39977, 65455, 141454, 49437, -165865, -134615, 373, 176547, 134149, 150555, 238756, 349614, 229148, 59408, 71603, 33038, -27853, -52369, -52152, 9258, 39325, 87941, 81588, 99415, 8801, -94497, -83756, 4760, -36545, -3631, 45842, 57478, 8854, -29291, -76708, -63665, -20972, 75592, 92426, 111028, 37878, 99124, 57071, 140247, 299661, 265967, 242159, 227092, 151160, 268654, 299459, 130268, 511, -4221, -79380]
12982g9380P6543Q3046r4260N6514L1103J15718K6438N6114j312j33408o9962
12971F7154j05209j9222Q5690j27954j44887J7677K01579J31614J01813K2232
12961B30487n3329p2671J5233p927O2043j16101K7189k1167j835N0265j37060
12950b4873j74129L9857Q5486P987L0761Q9492p7914j07579K1993J20904J29475
12939A41460J37949K1651O133j62457q0437j0646k1889L8604j2849O1432J14229
12928B33180n9321k3317k4609J48342R6356j9356O9292l5404J37j08740n6601
12917B19959j30876j75147K4831N0530N7677Q2170n1662j4305L6094j298l1301
12906F6672m0056P7615M1467K58192l8477q6499N9158k5840j12938j0581P72j7784
$$ y = [-79380, -2837, 80209, -14051, 42463, 73566, 189284, 215722, 271836, 270524, 137116, 67154, -38055, -57277, 28413, -99541, -244428, -226751, -25172, 106442, 208255, 230487, 177158, 104487, 119720, 111793, 173836, 57735, 84924, 63757, 61922, 112187, -24873, -199002, -159145, -73659, -65672, -34911, 54581, -23333, -130912, -108919, 11985, 141460, 279409, 301060, 307193, 144736, 64299, 53653, 31764, 70368, 57519, 118951, 233180, 173859, 150542, 125933, 274275, 370631, 351275, 420567, 385163, 385300, 276560, 219959, 89083, -86064, -61233, -10703, 46974, 129144, 77482, 63177, 99271, 97973, 66672, 26616, 104231, 145698, 403890, 365413, 278914, 338072, 312232, 199294, 188713, 189485, 171701]
12894A71701r9463j4174Q4313L7312K0212k8014k0774k3092o7419J34199m6576
12883A48225q0237O1280K29752n8025p6533r429r1967J12985P4811p6936o6882
12872A67044o3968j9952j2226q0045L027R7073l3027j8429Q7789J26275k5880
12861B27681o9197R2387J54693j85230j31964J2140r1082k690L7416j7541J59861
12850A86474M4642k50460m1696M8716k5400Q612L3485R3318O6643n9064J36517
12839B41787J49862j31824j08848j23233n0431o0060M4932N4739L8093k1255K8376
12828F2138k3466O4422Q9027J5015O6148k5512m7302j66262N3215M7479O6994
12817B01896j6039J153L9801o8169O7746n664j05432l878R2717J0538J6568L8857
$$ y = [171701, 72238, 58064, 142377, 179689, 199901, 171887, 151113, 128021, 60602, 194801, 148225, 67988, 129268, 359020, 300995, 224462, 215033, 123066, 236051, 310862, 233926, 167044, 103076, 83124, 70898, -9147, -6120, 90953, 57926, 39497, 127286, 253561, 227681, 158484, 250871, 405564, 220334, 88370, 100510, 9428, 6738, 44154, 26613, 186474, 231116, -19344, -61040, -12324, -37724, -29112, 4373, 97691, 164334, 105270, 241787, 391649, 259825, 150977, 27744, -22687, -82747, -37815, 16924, 55017, 33762, 62138, 38672, 103094, 192121, 207136, 273284, 247772, 200470, 34208, 87423, 134902, 201896, 185857, 187010, 226811, 158642, 226388, 220724, 115292, 111414, 204131, 214669, 231237, 270094]
12805B70094M652N6848j16461q8494o3548l0424p3317l4007J24779J00632P9234
12794B29988O422o4601j02110K9226l9386j6512J67669l3895p8532n409J22133
12783B14993L9556K7639M7217m8083q6552j53050l2845N2252L8802N042m1106
12772F3865M4462j5477n6962J7456l1233j1701l0424j30796M4940K38818P5136
12761B08084J8304o4514m4184m5218O2091j1074n5148o6756R3424R2972N1049
12750B39030m379j64407j02482O7746O8844Q3031R7489o55k7351o7347r3176j37388
12738d1045K3069P086R3257R9466j01819k4250L1327J25877J88270p1626j63275
12727A66337p8756R618J58571N143o3871K1498J0953p2124o8597L2242q5754K1950
$$ y = [270094, 274746, 331594, 215133, 126639, 63091, 32667, -40650, -74657, 50122, 150754, 229988, 236410, 171809, 69699, 98925, 59539, 43027, 210696, 176801, 98269, 92860, 214993, 254549, 282188, 329405, 281322, 194770, 41720, 8875, 61127, 99929, 104971, 63865, 108327, 92850, 35888, 53344, 22111, 10410, -20014, -150810, -105870, 132948, 208084, 226388, 161874, 117690, 72472, 134563, 123489, 68341, 1585, 95009, 187981, 239030, 234651, 70244, -32238, 35508, 104352, 187383, 284872, 284217, 256866, 189519, 96343, -41045, -17976, -10890, 82367, 181833, 80014, 55764, 87091, 212968, 401238, 329612, 166337, 87581, 97199, 255770, 260913, 197042, 218540, 229493, 157369, 88772, 121014, 35260, 57210]
12715E7210K5585R4933l3416m3397j5221p028j8497J12828J27655q0827j7841
12704B01984l0946L4612q9317J43558J59121q8192R755j56341j92675N6007J9322
12693F6888J6332J06715J03897L2903j33337q1372j16969j0807J1599j05553P2838
12682c6866j3399J04962P2572J7313r3883r4377m999N6302O5883J56549K59614
12671D89671Q0528j51772j57593r8024N3411J73544J35780K7789k10751j8652
12661C23931k8483J2287o8339k8133M4970j06897j9735O0364j0900P1368L4018
12650B84451j4975L768j9097p087j11529k5450N7194m1703O6962J212q9143j06063
12638a460R5828K07281k2127j32974m3089J1801J22360k8780o8689m7941N8125
$$ y = [57210, 82795, 177728, 144312, 100915, 85694, 78666, 60169, 172997, 300652, 219825, 201984, 171038, 205650, 116333, 259891, 419012, 330820, 340575, 184234, -8441, 47566, 66888, 83220, 189935, 293832, 326735, 193398, 112026, -4943, -15750, -4151, -109704, -36866, -50265, 54697, 127269, 144582, 50699, -43678, -48677, 7625, 73508, 230057, 489671, 570199, 418427, 260834, 162810, 216221, 389765, 525545, 553334, 342583, 323931, 295448, 307735, 239396, 211263, 256233, 149336, 129601, 189965, 179065, 250433, 284451, 269476, 273244, 254147, 247060, 135531, 110081, 167275, 125572, 192534, 193746, 104603, -1460, 94368, 301649, 279522, 146548, 103459, 115260, 237620, 208840, 140151, 92210, 150335]
12627A50335j1448J04909J3941m628N1198J05051j4078m3284j02729O5260J30289
12616D44816L5321o0779r9504L9230L1560o3328o0594n6715L9262q0805j19785
12605D8679J31530P8489M1381m9027j0885J2368P0819P6632j04915k7727J21011
12594C88355M6858O238j01397k5330J12249l7998J2743j20852j32153r0723J0624
12583F8614J73660J5338p6043K1897K34175M7092j13047j11825O6622Q3727k7393
12572C82817J9374J06548p8254j94005j6179Q1546M7070R6744J11121J63931j0143
12561G10570R8054j5859J3433j7231N3093K5217N5550n9354k6745N2261M3008
12550I31997J8432j2932O7212Q6127m5076k37075k08117O522J44160o4219j63632
$$ y = [150335, 138887, 243796, 257737, 253109, 304307, 409358, 395280, 351996, 249267, 314527, 444816, 480137, 419358, 319854, 359084, 390644, 327316, 266722, 210007, 249269, 168464, 48679, 180209, 258698, 300079, 251052, 240167, 252535, 323354, 399986, 295071, 267344, 388355, 435213, 441451, 340054, 314724, 426973, 388975, 401718, 280866, 148713, 57990, 68614, 242274, 257612, 181569, 203466, 437641, 484733, 371686, 259861, 326483, 410210, 382817, 402191, 508739, 430485, 236480, 220301, 301847, 348917, 445661, 556782, 720713, 710570, 808624, 792765, 806198, 788967, 842060, 867277, 922827, 863473, 836728, 888989, 931997, 950429, 937497, 1004709, 1090836, 1045760, 808685, 600568, 607090, 751250, 687031, 523399]
12539E23399M2284J69305N8091J21088r810j60815M0604r5181l1446O5618K6932
12528G50069j76316j68569J48034J95340K9628l1730K05268L1320L9130N5093
12518A077267J67546R8808J05350Q6434J49316M8932J09483J22242J65368o1823
12508B068923j30078j15702o6759j56096r9886j28302j40542m6384J3790j23252
12498A075712n3517Q109p3422p097K4069n382k5031o0173N9033L8726M7352n7466
12486I70913n1022j06220j159M9518M4026l243n0449j8832M8451J53113n1318
12475I83778m1758K4620J97495Q0842k8997q7956j9322O6055N6190J5754j46594
12464A100107j35251K8882j12443j6986O3373l2315j1836p2910k8949r5715L2130
$$ y = [523399, 565683, 734988, 793079, 914167, 904357, 743542, 784146, 688965, 657519, 723137, 750069, 573753, 405184, 553218, 748558, 778186, 746456, 951724, 983044, 1022174, 1077267, 1244813, 1343621, 1448971, 1535405, 1684721, 1733653, 1843136, 1965378, 2130746, 2068923, 1938845, 1823143, 1756384, 1600288, 1500402, 1372100, 1231558, 1185174, 1198964, 1075712, 1022195, 1030304, 956882, 949785, 973854, 968472, 943441, 883268, 942301, 981027, 1028379, 970913, 919891, 813671, 812512, 862030, 906056, 902813, 852364, 833532, 881983, 1035096, 983778, 942020, 966640, 1164135, 1244977, 1215980, 1128024, 1108702, 1174757, 1230947, 1246701, 1100107, 964856, 993738, 881295, 864309, 927682, 895367, 883531, 810621, 781672, 685957, 718087]
12453G18087m9278o5563Q5485M183q2744K2570j04548n1770n0301J42260K17262
12442G85643M9146p4982k602J9725j39111M9335Q0593O5080q53K5711j07960m2691
12430G07034K4527K9597N8646j7223m7903J0498r3037n9490J45614o4526J4378
12419G08115l5995m985Q9207r7898q3056j41788O8175J04095R8070k8320K9693
12408G05313K5653k9934j0634L3050M8312o3670l4726J9623J10480K8305r9674
12397G32098l9853n7426l8050j32846P5328J45253J07709m0960L7616r502l3177
12386G46190j29721j04995q8101m4594O641O4721R4796L4325q2787O9588Q6439
12375F52502O3337q521j09986r384O0304O9129J17398k547r6063l0769J40606
$$ y = [718087, 668809, 603246, 688731, 692914, 610170, 632740, 528192, 476422, 426121, 568381, 785643, 834789, 759807, 757205, 776930, 637819, 687154, 767747, 832827, 831974, 857685, 749725, 707034, 731561, 761158, 819804, 802581, 754678, 765176, 672139, 612649, 758263, 693737, 708115, 672120, 667135, 756342, 658444, 575388, 433600, 501775, 605870, 703940, 675620, 705313, 730966, 701032, 690398, 723448, 771760, 708090, 673364, 692987, 803467, 831772, 732098, 692245, 634819, 596769, 463923, 539251, 684504, 792213, 751253, 788869, 779367, 746190, 616469, 511474, 423373, 378779, 385420, 450141, 544937, 579262, 496475, 566063, 652502, 715839, 707318, 597332, 587948, 648252, 717381, 834779, 832232, 736169, 705400, 846006]
12364H46006J25486j37555K638K63753J28837j04530j36719j45984k27021j5992
12354E98919J71857J97987r381l9355j00524j36989O3072M3717j4614j5477J9344
12343G78556l2836R2444N560k7393p4397q6063j6419J86269K5116K5301K5288
12332I01426r5634K2198N8448o9304P7267N8843p5797p2648j64783O1845J96412
12321H98273K66874N0786m581k3569q5686N5601p6468l0496L5252p9756m3807
12310I62423O7202M584Q7626k6494m5695l234M1199o9967p3204n6959N0159L5410
12298I73050O9290l5332l3801J1893J5471o6117M2585j0117j07437L9642J9241
12287I18368l6485N7200P09K2397N3461m0252q1432l5163J66493j1168k9319J2818
$$ y = [846006, 971492, 833937, 836575, 1100328, 1229165, 1124635, 987916, 841932, 614911, 598919, 770776, 968763, 959382, 920027, 819503, 682514, 745586, 789303, 774689, 759212, 778556, 745720, 838164, 843724, 816331, 741934, 655871, 639452, 825721, 850837, 876138, 901426, 805792, 827990, 886438, 817134, 894401, 953244, 877447, 804799, 640016, 701861, 898273, 1165147, 1215933, 1211352, 1187783, 1102097, 1157698, 1081230, 1050734, 1085986, 1006230, 962423, 1029625, 1034209, 1121835, 1095341, 1049646, 1046412, 1087611, 1017644, 944440, 887481, 937640, 973050, 1042340, 1007008, 973207, 985100, 1000571, 934454, 977039, 966922, 859485, 899127, 918368, 881883, 939083, 939792, 962189, 1015650, 975398, 893966, 858803, 1025296, 1014128, 984809, 997627]
12275I97627r3723O9291K01665O7117j76095p1144J37584J76570j04087K8114
12265A232919N0566P1487P8777K0073j88456Q738L8600n6618O9511l9645N6603
12254A342555O0647k6067M9730J44716P9679N7331K4009j23410r5399q0687n014
12243A428090n433r3459L7573Q0938J35741N6740k2343j02345N3991R3869m3409
12232A619953j60179m8166l0771M5990J66207J12373j34091r1258N8773R1938
12222A630769J37288L4309N114p0241P6047J07053k2058J32043Q246Q8896L7643
12211B165109M1375O3208M0214J07419L6447J44145j8152m9925O3782J24227P1202
12200B789051K062J0445l3976M1688J31726J52706M7599l6348J05032J97820O0478
$$ y = [997627, 903904, 973195, 1174860, 1241977, 1065882, 994738, 1132322, 1308892, 1204805, 1232919, 1283485, 1354972, 1433749, 1453822, 1265366, 1274104, 1312704, 1256086, 1325597, 1285952, 1342555, 1403202, 1377135, 1426865, 1571581, 1651260, 1708591, 1732600, 1609190, 1513791, 1433104, 1428090, 1422657, 1329198, 1366771, 1447709, 1583450, 1640190, 1617847, 1515502, 1569493, 1663362, 1619953, 1459774, 1411608, 1380837, 1426827, 1593034, 1705407, 1571316, 1480058, 1538831, 1630769, 1768057, 1802366, 1807480, 1737239, 1813286, 1920339, 1898281, 2030324, 2038570, 2127466, 2165109, 2206484, 2269692, 2309906, 2417325, 2453772, 2597917, 2579765, 2529840, 2593622, 2717849, 2789051, 2791113, 2801558, 2767582, 2809270, 2940996, 3093702, 3141301, 3104953, 3209985, 3407805, 3468283]
12189C468283J55634Q3758K5728J18563J52351J77973Q2508k8499J02814J53123
12179D492236J11501J04298J81971M2946K4543J86870l9718N1930M8837r5622
12169E109792J68105K59204K02517J49029J19561J29222J07922j9055o1398J9877
12159F184776K44111K84053K70292K65603K52877L14641K99030J03431j30070
12150H088744l4019P7444O8708M680K31676M37585M54585O26234O53879O50922
12140A1260438Q15902Q23467P03869P17505P39587O62032N46746Q14181Q78040
12131A7961767R43577R35138J138990J190108J079680J297085J363905J370458
12123B7280708J452317J648709J865613K084621K633976L494957M563352N938488
$$ y = [3468283, 3623917, 3707675, 3733403, 3851966, 4004317, 4182290, 4264798, 4236299, 4339113, 4492236, 4603737, 4708035, 4890006, 4932952, 4957495, 5144365, 5104647, 5156577, 5205414, 5109792, 5277897, 5537101, 5739618, 5888647, 6008208, 6137430, 6245352, 6226297, 6164899, 6184776, 6428887, 6712940, 6983232, 7248835, 7501712, 7816353, 8115383, 8218814, 8088744, 8054725, 8132169, 8200877, 8205557, 8437233, 8874818, 9329403, 9955637, 10609516, 11260438, 12076340, 12899807, 13603676, 14321181, 15060768, 15722800, 16269546, 17083727, 17961767, 18905344, 19840482, 20979472, 22169580, 23249260, 24546345, 25910250, 27280708, 28733025, 30381734, 32247347, 34331968, 36965944, 40460901, 45024253, 50962741]
12115E0962741P728044R552345J1391073J2931686J3397393J2222111R424739
12108A27610132M856855m14746n009076p976295r034148q335774o748895m916417
12100I0031636l004142j286002O6270J136713J949960K462591K872336K782398
12092I7011760K058785J088958O64805M97587Q75535J546613K307046L211357
12084A09262446L798094L854479L417633K869747K262912J882894K062067K391450
12076A31801722L694589N464311P721111J0761109J4618314J9111380K4181067
12069B17353603K8663480L0783930K8248477J9990082O962016p706803j9819665
12062C04475120k6929393k8557057k6550216k2615860j8220237j4151484j0549622
$$ y = [50962741, 58690785, 68243130, 79634203, 92565889, 105963282, 118185393, 127610132, 132466987, 132052241, 127043165, 119066870, 110032722, 101696948, 94948053, 90031636, 87027494, 85741492, 85807762, 86944475, 88894435, 91357026, 94229362, 97011760, 99070545, 100159503, 100824308, 101321895, 102197430, 103744043, 106051089, 109262446, 113060540, 116915019, 120332652, 123202399, 125465311, 127348205, 129410272, 131801722, 135496311, 140960622, 148681733, 159442842, 174061156, 193172536, 217353603, 246017083, 276801013, 305049490, 325039572, 332001588, 324294785, 304475120, 277545727, 248988670, 222438454, 199822594, 181602357, 167450873, 156901251]
12055A56901251p694195n598988m003220l043495k639518k854990l518364m219394
12047A23329087m670617m351277l982341l009838k081417j440569r72835j134691
12039A01685502j771987k395765k703461k908119k480742j712827p60005L07523
12031H7260119J348898K593221M482407O475438Q428982R761376R340881O931748
12023A36623070K409681l178365q339581j1903430j3624894j3444338j2099533
12016G6442610j0285373q424365o758689n510434m195512l341051k563231k056257
12008C3307698j777086j883205j735942j522561j443189j449498j514855j413758
12000B0567604j238338j209665j071290p14469p45654r01648p48122r20406o86949
$$ y = [156901251, 149207056, 143608068, 139604848, 136561353, 133921835, 131066845, 127548481, 123329087, 118658470, 114307193, 110324852, 107315014, 105233597, 103793028, 102820193, 101685502, 99913515, 97517750, 94814289, 91906170, 89425428, 87712601, 86952596, 87260119, 88609017, 91202238, 95684645, 102160083, 110589065, 120350441, 129691322, 136623070, 139032751, 135854386, 127514805, 115611375, 101986481, 88542143, 76442610, 66157237, 57732872, 50974183, 45463749, 41268237, 37927186, 35363955, 33307698, 31530612, 29647407, 27911465, 26388904, 24945715, 23496217, 21981362, 20567604, 19329266, 18119601, 17048311, 16333842, 15588188, 14686540, 13938418, 13018012, 12331063]
11991A2331063o64126o91987p66767q39206o46570n46367o18020m53672m86436
11982F617912k60015j80955k54493k03200r6529k45786r6519N9017L6846J22571
11972E498849j0668J4961r2192j06621k5858o789J6594j07803j74896j83815m315
11961D817447j18321k29432L2045r8970j25020j06713K058L1590K103J54600R988
11950D371375q8976k77881k12604j66238j58730k45611j60252j48651k36953k22414
11940B453065j5796J5482j88917m4718q8282j04834q6762n8766n9461Q8365j9893
11929A889483j51704j5659M1667j53028j70622j71528R995j1935q1414p4637K4062
11918A134680J60990P794N0892K998o9645J38837q923k3188m9471r3409j35708
$$ y = [12331063, 11666937, 10974950, 10208183, 9368977, 8722407, 8176040, 7558020, 7104348, 6617912, 6357897, 6176942, 5922449, 5719249, 5622720, 5376934, 5280415, 5339432, 5376278, 5498849, 5488181, 5503142, 5410950, 5304329, 5278471, 5271682, 5288276, 5180473, 5005577, 4821762, 4817447, 4699126, 4469694, 4501739, 4402769, 4277749, 4171036, 4173094, 4204684, 4206787, 4361387, 4371375, 4282399, 4004518, 3791914, 3625676, 3466946, 3221335, 3061083, 2912432, 2675479, 2453065, 2437269, 2452751, 2263834, 2219116, 2130834, 2026000, 1939238, 1880472, 1821011, 1909376, 1889483, 1737779, 1722120, 1763787, 1610759, 1440137, 1268609, 1278604, 1266669, 1185255, 1110618, 1134680, 1295670, 1303464, 1354356, 1357354, 1287709, 1426546, 1417623, 1394435, 1344964, 1251555, 1115847]
11907A115847q6977L4724r9273L8256J3378l6243l6317J4899K0361L8680o3979
11896I53356p2922n1691k7246m5501R3480p8831r087R949O5977m545K7969l4107
11884H26801p8541n1226j22430j4205N4938p7645n3022J91507K6326m5747j57126
11873D99630o7679R9863J22812m3517j77980P833K31411r752j05443n1221j3173
11862D92784j8908M2113l1320j43394L8274N7632L2015P1209K4709j12478O5188
11851E17824R4769j01610n5346j6883N4503q4962j32471j1123k0598k5305Q9370
11840C08168q002J0667P074j595M1003j02375k08649r1598J42090L8977m2965
11829I2795L2281o7948K24338R3011j7804r210m1047l8656J2049m6406k629n850
$$ y = [1115847, 1028870, 1063594, 964321, 1002577, 1015955, 979712, 943395, 958294, 978655, 1017335, 953356, 880434, 828743, 801497, 755996, 849476, 770645, 761558, 771507, 837484, 832939, 860908, 826801, 748260, 697034, 574604, 560399, 615337, 537692, 484670, 676177, 702503, 656756, 499630, 431951, 531814, 654626, 611109, 433129, 440962, 672373, 662621, 557178, 505957, 492784, 473876, 515989, 484669, 341275, 379549, 437181, 469196, 540405, 565114, 452636, 517824, 612593, 510983, 455637, 438754, 493257, 408295, 275824, 264701, 244103, 218798, 308168, 300166, 310833, 317907, 316312, 357315, 254940, 46291, -45307, 96783, 135760, 92795, 125076, 57128, 281466, 374477, 356673, 347463, 306416, 267760, 279809, 233403, 230774, 224924]
11817B24924O9460k5151j16922J1175l0356L1010J09453Q8418p5252l0433k26474
11806B9852p0915P2723k4440J0245j25355J24351J31008O1501n7310o1003M1540
11795A32197j1187Q9079p44J9977K09429J65619j55190k41336l3746k3717p583
11784A42798p8391q3116k9223J0516q801J24450J3523J9976l6521j03262l4086
11773f2137M2251Q0438N8916r0059j21406J1915P297M0469p670m7242k9792J16050
11761i70L9250m9394L7476P6710M2191q9542j00290N2178k3849M0742q9496L7458
11749b7536O6675o9314p7526Q0499J9704J67127L0153L3082J01133p2051j65310
11738H6636m9180m1541p3801O2913k1102n0573j0756J05565R5848j1798n3497
$$ y = [224924, 294384, 269233, 152311, 163486, 133130, 164140, 273593, 362011, 286759, 256326, 29852, -41063, 31660, 7220, 17465, -107890, 16461, 147469, 208970, 151660, 90657, 132197, 121010, 210089, 209345, 229322, 438751, 604370, 449180, 207844, 174098, 150381, 142798, 64407, -18709, -47932, -37416, -46217, 78233, 91756, 111732, 75211, -28051, -62137, -19886, 60552, 119468, 29409, -91997, -80082, -72785, -32316, -39986, -87228, -117020, -970, 38280, -11114, 26362, 103072, 145263, 55721, -44569, 7609, -16240, 24502, -64994, -27536, 39139, -30175, -107701, -27202, -7498, 159629, 189782, 222864, 323997, 251946, 86636, 37456, -4085, -77886, -14973, -36075, -86648, -97404, 8161, 104009, 92211, 38714]
11727C8714j18823O6653L7782l8322q660R4659r5457P3844L9378l5514J6751j3184
11715E7821J02535r0823j2411Q926m1054N7164J21204q0893m7886J81K0986R0343
11703A86093j6467j39220p1207r5286N5614m016K7015J20901K37168R1455j73139
11692B18911j63853q397L391K7522o418K4727J92519o6163j43589k3751k5325
11681B9574O0247K5558p2034K2284R4929j3J11051L9365j21045p8805J3570K59
11669A24940L1992j09872q688k5228J04616P1031J15755L2552j14847Q37J67455
11658C90543J79705M4761k266r1900j29621o7451M5908J31891L2529j27181O8738
11647D75656N4334p6028k3806L0907k8216p0819J21022J95184m8613k1109m6110
$$ y = [38714, -80109, -13456, 24326, -13996, -22656, 72003, -23454, 50390, 89768, 54254, 71005, 57821, 160356, 69533, 57122, 66048, 24994, 82158, 203362, 122469, 74583, 74764, 95750, 186093, 169626, 30406, -40801, -136087, -80473, -84489, -57474, 63427, 300595, 392050, 218911, 55058, 46661, 50052, 77574, 71156, 95883, 288402, 222239, 78650, 54899, 29574, 89821, 115379, 43345, 65629, 160558, 160545, 271596, 310961, 189916, 111111, 124681, 124940, 156932, 47060, 38372, 13144, 117760, 188791, 304546, 337098, 222251, 223088, 390543, 570248, 615009, 612743, 520843, 391222, 323771, 369679, 501570, 534099, 406918, 475656, 529990, 453962, 430156, 461063, 432847, 362028, 483050, 678234, 629621, 608512, 562402]
11636E62402J68729q2476r8291J0469j54025o0834J15708K36530N1354j64113
11626E85453Q124p8575J05012K57457K03785r0424m0819O9013J61641K23475J38172
11615A542314J17796Q7379P183p2630L3022j63764j64731m0763j95398j00263
11605A050145j8335k19555r9472k6204K1371K3466j37701k1201k200M2591L624
11594F16529j1903N3903j940j42954j45268m4334M385L6919M1893j8715p4356
11583C14159j14988r1553J41372J26486n6042J56167J38763P5839K0693J6327
11573G27223J33459o522j12054K8247O3931p6746j62992j51656j00768r164m6720
11562B86238n4056j21329k80176q5392M7258J62386L0960J8064Q8923j301P301
$$ y = [562402, 731131, 648655, 550364, 560833, 406808, 345974, 461682, 698212, 749566, 585453, 593577, 515002, 620014, 877471, 1081256, 990832, 950013, 1019026, 1180667, 1404142, 1542314, 1660110, 1747489, 1754672, 1682042, 1715064, 1551300, 1386569, 1345806, 1150408, 1050145, 1031810, 812255, 712783, 686579, 707950, 731416, 593715, 572514, 570314, 612905, 616529, 604626, 658529, 656589, 513635, 368367, 324033, 328418, 365337, 407230, 388515, 314159, 199171, 107618, 248990, 375476, 319434, 475601, 614364, 690203, 710896, 727223, 860682, 854160, 742106, 770353, 834284, 757538, 594546, 442890, 342122, 332958, 286238, 232182, 110853, -169323, -254715, -207457, -45071, -14111, 3953, 92876, 91575, 98876]
11551I8876p9010j2413m3565J1881R7752m7569m6500k5654J6117O3359J35265
11540A68539j21306l5721M173K6330L1316l2707K6085l2270k7283R15n6775o8402
11528a17106J06100R3665o4892j55712K5753M9440O5225P929n5658J3731J00957
11517F9432m8798j08653q0187J64671J9010j02454m437q1660Q6513R8035l344
11506H128j3707M5046l1465j51461M0317l0479L7751n2824l3822J07112J07725
11495C2321J7737j2566L0507k1140k7110j79662o2131J66149J67666L7001K7156
11484A75928p4979q9640o3752j18366P9292Q9102J04433j0806M5822j55268J0085
11473h149j1165j52690K3711J49170L3610j23036m1977j4063j48507P6483J32556
$$ y = [98876, 19866, 7453, -36112, -24231, 73521, 25952, -20548, -46202, -30085, 33274, 168539, 47233, 11512, 15685, 42015, 73331, 40624, 66709, 34439, 7156, 8071, -48704, -117106, -11006, 82659, 17767, -137945, -112192, -62752, 2473, 10402, -45256, -31525, 69432, 20634, -88019, -168206, -3535, 15475, -86979, -91416, -173076, -86563, 11472, 8128, -5579, 39467, 8002, -143459, -103142, -133621, -95870, -148694, -182516, -75404, 32321, 50058, 37492, 67999, 46859, 19749, -159913, -222044, -55895, 111771, 148772, 175928, 100949, 11309, -52443, -170809, -91517, -2415, 102018, 91212, 137034, -18234, -8149, -19314, -172004, -148293, 877, 34487, -88549, -130526, -144589, -293096, -216613, -84057]
11462h4057K617K8857j6888M3349M0082n8700P0357N2068Q305J17630o7072n9879
11450G6669J7882L8813J17489k2263j38782l4828j11134m1370j51442j550J03975
11439a46541M5663m7265J3199J14366L3344k1765n7358l0727Q9573Q2041k9590
11428D4940J369k5262k6815j28839l8312L1604q822J94001J67191O0118q6293
11417A84880j86023j47085p8896L6788R2916J06892L0602M0327O5767L620l6129
11406A13659r5041J38276O7168j05888q8092n8980P0324j8056o6383q7413j39244
11395b69670O5738O8486M4981K7566M8639l7291k4288R2037N930k695J6687q0069
11383d3949N4618j6676k1673n2182p6845j06040p7552R6146P4235Q8080M0462
$$ y = [-84057, -81440, -52583, -69471, -26122, 13960, -44740, 25617, 77685, 85990, 203620, 136548, 76669, 94551, 133364, 250853, 228590, 89808, 54980, -56154, -97524, -248966, -250516, -146541, -100878, -148143, -134944, -20578, 12766, -8999, -66357, -97084, -7511, 74530, 44940, 46309, 21047, -5768, -134607, -172919, -141315, -150137, 43864, 211055, 271173, 184880, -1143, -148228, -227124, -190336, -97420, 9472, 40074, 80401, 146168, 149788, 113659, 18618, 156894, 224062, 118174, 30082, -28898, 41426, 23370, -43013, -130426, -269670, -203932, -135446, -90465, -62899, -14260, -51551, -75839, 16198, 22128, 19433, 36120, -43949, 10669, -6007, -27680, -79862, -156707, -262747, -340299, -244153, -169918, -81838, -41376]
11372d1376q3403L1951J54267l1608l1367j25514k3617L7470N6314o8384L7540
11361h7727k4109k6801O755J30741L0342p5092O4431m434k0628P0380m8117j06367
11349i0626J37947R2076k0131J00649j14440L637K7762J9876j40797j23487J55809
11338D8275j4209q4924P0524R2102M958M392N4009M2832j64395j86189K8343N3519
11326e0763N0373p2824K6701l541N6162q442p3993J57707J6174j25639P344j5798
11314c6539n4013m8935l2407q7216K6105N8842N8164J4359k6114o8148J02093
11303i3809J79222j6588o009Q819M7416P3770J51565J80311J68532P6698J23365
11292H93292M9349k74530k94189j90298j64913k8511j5478J02469L4285r9045
$$ y = [-41376, -124779, -92828, 61439, 29831, -1536, -127050, -150667, -113197, -56883, -125267, -87727, -111836, -138637, -131882, -1141, 29201, -45891, 18540, 14106, -6522, 63858, 15741, -90626, 47321, 139397, 119266, 219915, 105475, 109112, 136874, 156750, 15953, -107534, 48275, 34066, -50858, 19666, 111768, 116726, 121118, 175127, 217959, 53564, -132625, -104282, -50763, -390, -73214, -46513, -50054, 6108, -2334, -76327, 81380, 97554, -28085, -20741, -36539, -90552, -139487, -171894, -259110, -233005, -174163, -115999, -101640, -127754, -195902, -93809, 85413, 68825, 62816, 71635, 119051, 192821, 344386, 524697, 693229, 769927, 893292, 942641, 668111, 373922, 183624, 18711, -9800, -25278, 77191, 111476, 12431]
11282A2431j16184j1936Q2552J02700Q5971m4749m5032j14025l0215k7701j9407
11271a25595L5693j55122o841K0003J92802J01897j46041j52699q1318M17L9726
11260b77078J7965J72260Q5680j0149J3420N5660j85706p6861m7590J4418J74908
11249f3073N240M9735K1264L6829P233q6792N1700O6738o3710k359l733j13393
11237i4321K4106J701q5206M0783J96965K0855O4640r3930n5433J5300j3144R6950
11225A19266k8991p0849P3379q7686j17974K5930J29994J17639j5052j76070j76459
11214b06873J365Q6896n5695l341P7811R6805j9784O2466J4827p2992j6320O9289
11202C4454J92001R2947m7692j26813j63822j10457L0633K14860k1704o1494k9103
$$ y = [12431, -103753, -115689, -33137, 69563, 155534, 110785, 65753, -48272, -78487, -106188, -125595, -89902, -245024, -251865, -231862, -39060, 62837, -83204, -235903, -317221, -316804, -277078, -259113, -86853, -1173, -11322, 2098, 57758, -127948, -204809, -252399, -237981, -63073, -57833, -8098, 13166, 49995, 57228, -29564, 22136, 88874, 25164, 22805, 19072, -94321, -70215, -68514, -153720, -112937, 84028, 104883, 169523, 75593, 20160, 35460, 22316, 119266, 90275, 19426, 92805, 5119, -112855, -86925, 43069, 160708, 145656, -30414, -206873, -205508, -118612, -174307, -177648, -99837, -3032, -22816, 39650, 54477, -18515, -34835, 34454, 226455, 319402, 271710, 144897, -18925, -129382, -98749, 116111, 94407, 32913, 3810]
11191C810o1049M004l563J22891L9543n8749j12122j11272J06930L5873K25841
11180A92137M16492K11392m3968j68021P4381O7774r3463j70584j86405q7514
11170B12221k2841q6222m1622j3590J7182L4273j43453K6008J29348l3994l8577
11159C8733r5854L5300l0257N2832P4620k0525r8126j03971m0646O4214R6367
11148b7313M3557J5086j11369j01566Q5107M5985j7029k7017Q539K1160P3668
11137H808j03044k6530q1784j05109O5924J53814J27817j5119J10601L2785n9602
11126A08561j04947k4270Q0759j35458o4807k550K1349l2778J0772R145L8203
11115i6021k8965m5279J29015N070j88338O1778J87812P6121j05174j56718n0115
$$ y = [3810, -57239, -53235, -56798, 66093, 105636, 46887, -65235, -176507, -69577, -33704, 192137, 608629, 820021, 776053, 608032, 682413, 750187, 656724, 486140, 299735, 212221, 189380, 103158, 61536, 47946, 65128, 99401, -44052, -18044, 111304, 77310, 38733, -57121, -21821, -52078, 754, 75374, 54849, -43277, -147248, -187894, -123680, -27313, 16244, 31330, -80039, -181605, -96498, -50513, -67542, -94559, -86020, -64860, 8808, -94236, -120766, -202550, -307659, -241735, -87921, 39896, 24777, 135378, 168163, 108561, 3614, -20656, 60103, -75355, -140162, -142712, -121363, -154141, -143369, -134224, -96021, -124986, -170265, -41250, -36180, -224518, -162740, 25072, 101193, -3981, -160699, -210814]
11104b10814K294L2332R0573J790J2275l7681j07082j207O1460Q2065K36396l7603
11092A24798j18476K1580m3623K6979o7988O9528R8386n4299j21829o562j21912
11081a93418j59704R541J17610J57522n2159o2564L6854J71959K5353K7887N0560
11070A29441j61844n749j0402j0107n5144j05988l4995q3416j73719p1035J09757
11059d73201J93870J53727M892l7049P4260O3718J2152Q1952J14380j50355l3988
11048D358R6351j0943j15837j09968K15326J00340r0697j68945Q3844O4586O033
11037G4448M2385j25418j6514j77212j06533J26854P3725P8153L0091M8275L1110
11026G9364o5901j08843J877R1035p6893J707N4036Q8528O0173k7654o1506Q5391
$$ y = [-210814, -208520, -176188, -85615, -83825, -71550, -109231, -216313, -217520, -156060, -73995, 162401, 124798, 6322, 27902, -15721, 11258, -56730, 12798, 111184, 56885, -64944, -71506, -193418, -353122, -343581, -225971, -68449, -120608, -183172, -146318, 25641, 50994, 78881, 129441, -32403, -38152, -48554, -58661, -113805, -219793, -254788, -338204, -511923, -582958, -473201, -279331, -125604, -120712, -157761, -83501, -19783, -7631, 74321, 188701, 38346, 4358, 100709, 89766, -26071, -136039, 79287, 179627, 88930, -80015, 3829, 68415, 74448, 116833, -8585, -25099, -202311, -308844, -181990, -108265, -30112, -21, 48254, 79364, 13463, -95380, -93503, -2468, -79361, -77654, -23618, 64910, 125083, 97429, 35923, 121314]
11014A21314O7803o4616o1309l6478k0808j12216j17102M5474K01900o9880R8071
11003E2153J28629j08758m7214l4809k8186k9759K4899M9700P1941J09728O4316
10992B52640J6656P4003r0466j94363k15314k9641J01306M9843n6586J60564J02044
10981A70686m5399m2136q8195J7955J25613p4441j68194l7766P5764l8114p015
10970a11242j8994o5618l0966n6556N0097P6168N2060l4240Q7326q2343n1014
10959a85322J36109J27813O3822M2433J4560l8617j32063r268J3646O2055p565
10948H7603O1984l2107j0482J29556O52Q6976N2746j10616r7230p5971m4363M2291
10936I1039l8764K1144j8785j10837j84941O275P5331L9833J07253j19563n9386
$$ y = [121314, 189117, 124501, 63192, 26714, 5906, -106310, -223412, -177938, 23962, -45918, 52153, 180782, 72024, 24810, -9999, -38185, -67944, -43045, 6655, 78596, 188324, 252640, 269296, 343299, 252833, 58470, -156844, -186485, -85179, -35336, -91922, 68642, 170686, 125287, 83151, -5044, 12911, 138524, 64083, -104111, -141877, -66113, -104227, -111242, -130236, -195854, -226820, -283376, -233279, -157111, -105051, -139291, -51965, -134308, -185322, -49213, 78600, 142422, 184855, 199415, 160798, 28735, 19467, 33113, 95168, 87603, 149587, 117480, 106998, 236554, 237206, 324182, 376928, 266312, 169082, 93111, 48748, 91039, 52275, 73419, 54634, -56203, -241144, -234869, -159538, -119705, -12452, -132015, -191401]
10925a91401J74387R9174O1919n5233Q7181M5737R516l2501q3548K0298q4488
10914E1041r0714n2344j3559o5239J9536J71639N1987Q2381j03910o7294Q4425
10903F7949M6014n1186M2256J1457j1398J074J10451l1802O8394j06679o5254
10892H1276R9247k8330j37534j19623k9781j2840O623l0556m9036J21410q2033
10881a81177Q000j6843n179M4388M1954L0025J19084J7387N6010l107l9615M2240
10869A13167L6197o55J53702P2510k24469j50878l1651K6549l8534m877J7065
10858c1874k2131m0226l0318J15634J36806r2041R566K5429N8024L3696M4897
10847B07462M9512K8685J6485n3914J27640p4046L849j34973j06930N2275P3031
$$ y = [-191401, -17014, 82160, 144079, 88846, 176027, 221764, 231280, 198779, 115231, 135529, 51041, -39673, -92017, -105576, -170815, -151279, 20360, 72347, 154728, 50818, -16476, 67949, 113963, 62777, 105033, 116490, 105092, 106166, 216617, 184815, 253209, 146530, 81276, 180523, 152193, 14659, -104964, -134745, -147585, -140962, -171518, -220554, -99144, -181177, -173177, -190020, -195199, -150811, -108857, -78832, 40252, 57639, 113649, 110542, 70927, 113167, 149364, 148709, 302411, 374921, 150452, -426, -32077, -5528, -44062, -48939, -31874, -54005, -94231, -124549, -8915, 127891, 35850, 45416, 70845, 128869, 162565, 207462, 256974, 285659, 302144, 248230, 375870, 301824, 305673, 170700, 63770, 116045, 189076]
10836A89076o1434j71051o0807K8019k7920n2384J5315p823K5776O2460L8227
10825b2546O9078L0748r1128n9646Q8929O0934O8527P0152p1569J4723N2798n8177
10813A52823j3382j2837j32817r6057J49391L8022j68450n4326p3860N3981M358
10802a53154m9277k162O7661O1264o0939j07803n8512J33901N7093L2974K08985
10791A30031O2648l1899L8361j51080j7903K50430j101j40793n7846L5381r9200
10780A7029K5212J86416J9588j82200O974O9093j05462j18293K4526J4948M2020
10769a49J7347j968j44673k938n7260k8865R7464J24106J19918p4926l5811Q6637
10757I8882N8254j3542J20329R4197j03316j15541l2364j56969k12869O2714P5629
$$ y = [189076, 127642, -43409, -104216, -76197, -104117, -156501, -141186, -149009, -123233, -60773, -22546, 46532, 77280, -13848, -73494, 15435, 76369, 144896, 215048, 143479, 158202, 211000, 152823, 139441, 126604, -6213, -102270, 47121, 85143, -83307, -137633, -211493, -157512, -153154, -202431, -204593, -136932, -75668, -136607, -244410, -302922, -169021, -111928, -78954, 130031, 192679, 160780, 199141, 48061, 30158, 280588, 279487, 138694, 80848, 116229, 17029, 42241, 228657, 248245, 66045, 73019, 142112, 36650, -81643, -57117, -42169, -149, 17198, 15230, -129443, -132381, -189641, -218506, -121042, 3064, 122982, 48056, 12245, 98882, 157136, 143594, 263923, 358120, 254804, 139263, 106899, -50070, -262939, -200225, -124596]
10746a24596L7515r541l2287J72433J4284Q9890j3739n7702j80601q9081L9194
10735a54231j542n6566L5642K10438L1425p5340j24512Q0382j7021P6222q2916
10724g8019l6247J30903O5783N05O3943j2504J8874P3175M2893j39693o0438P443
10712G6618N7530m9566m729P4778J1053k5174j52968j06898J21726R9757M8569
10701A50696l7700j0667Q2232J36880j06003j83723o3669n9072Q906Q2031Q7297
10690H7208q284q1671K9356J10798L8092K0001J13228j11574j04030m5189l1652
10679A6283J0439Q4933n8676J17914Q9881m5494r0140o2109k219R1281J0299j31342
10667C1050j00517J11493J13920J29279j80474j35616l472J48592l6927p6391
$$ y = [-124596, -87081, -96622, -128909, 43524, 57808, 147698, 133959, 76257, -104344, -193425, -154231, -155773, -212339, -176697, 33741, 65166, -10174, -134686, -54304, -71325, 4897, -78019, -114266, 16637, 82420, 82925, 146868, 134364, 153238, 226413, 269306, 129613, 69175, 76618, 134148, 84582, 79853, 154631, 165684, 140510, -12458, -119356, 2370, 102127, 150696, 112996, 102329, 184561, 321441, 215438, 31715, -31954, -91026, -82120, -89, 87208, 78924, -2747, 26609, 137407, 175499, 195500, 308728, 197154, 93124, 47935, 16283, 26722, 111655, 52979, 170893, 260774, 215280, 125140, 63031, 60812, 152093, 162392, 31050, -69467, 42026, 155946, 285225, 104751, -30865, -34337, 114255, 77328, 937]
10657I37l3744p825K5346Q1714N275K9140j34805j16157P8871J02286O4791K3234
10645A19063P5541j79630j49744K3340N969l2026J19141J6193j2435j10034j02053
10634b26675O9138O3039J03909Q3776j6173J06940J0681j06668j93411r3090P0104
10623a28430J11724r4015m8417K30468J24820r8421j79804m7061L8948L2307J10898
10612E3017R3891l3729J0173m5477j3094j7431m6844l7447k7140K0692j8781k6738
10600h8908n0211R900j9097O998P5253O3623L4935R345q5872n0427j7240j321
10588a13022P6586P167o9324M9007J02078Q5091P0944K0837P4485L8671j5962
10577C26558j00435l26116j42663P3584O4318N7465q3456m3668N121K1894J01330
$$ y = [937, -32807, -40632, -15286, 66428, 71703, 100843, -33962, -150119, -71248, 31038, 95829, 119063, 194604, 14974, -134770, -111430, -105461, -137487, -18346, -2153, -14588, -124622, -226675, -157537, -94498, 9411, 93187, 77014, 183954, 194635, 87967, -105444, -198534, -128430, -16706, -110721, -159138, 71330, 196150, 97729, -82075, -129136, -90188, -57881, 53017, 146908, 113179, 123352, 77875, 64781, 47350, 506, -36941, -64081, -43389, -62170, -88908, -139119, -129219, -148316, -141318, -66065, -2442, 32493, 41838, -44034, -94461, -111701, -113022, -36436, -29269, -98593, -49586, 52492, 137583, 208527, 229364, 303849, 342520, 326558, 226123, -99993, -242656, -169072, -104754, -47289, -130745, -174413, -169292, -147398, -46068]
10566d6068k2949M4634J45599q561j06237K9894m955o6340J1818M0934l183M2803
10554E7389j53640n930P4176R8698L3105p1385k520P6161K2598J6245j7002o3069
10542F4826R454p850n7528q3852m4490n248M3280J0821R5906j72021M398J84229
10530D1925j06135k323K52868J55958M592j01961L3493O2799j44126j74337M7914
10519G0667O6056j27982j53893M0241J40229K13433q1834j26302R5654J52511
10509B88780j3699j38962L1127j28127j06041N4824K29970J10056q557k9135j25369
10498A64867N2794Q7787L032j47108L7277k9797n9141k3009j7457M7915N8363
10487A75523l4099r3404n4770J22826J16140O5201p1608p2558j90091L6427J39371
$$ y = [-46068, -69017, -24383, 121216, 112655, 6418, 36312, 31357, -34983, -23165, 17769, 14586, 57389, -96251, -102181, -28005, 70693, 103798, 32413, 29893, 106054, 128652, 144897, 127895, 64826, 74280, 66430, 8902, -74950, -119440, -124688, -81408, -70587, 25319, -146702, -142304, 41925, -64210, -66533, 186335, 342293, 346885, 244924, 278417, 341216, 197090, 22753, 70667, 136723, 8741, -145152, -104911, 35318, 248751, 166917, 40615, 136269, 288780, 275081, 136119, 167246, 39119, -66922, -12098, 217872, 327928, 319371, 290236, 164867, 217661, 305448, 308480, 161372, 198649, 168852, 109711, 86702, 69245, 117160, 175523, 141424, 48020, -6750, 116076, 232216, 297417, 225809, 153251, -36840, -413, 138958]
10476A38958j6763j3883J23206n1336j05451P1426o302j5970m1619J55506q5703
10465A52069o2894j9640K7753M9380o8461O0926n9391q1155J5231L3900l4699
10454A3019m1418l4711r2534Q7437J80692n4567l1J41254J700j47719L8533Q3919
10442A75574j5603k7779m3822k9333J04336p019j2657k777n2907l3490N6849P4882
10430A86254K815K726Q2574N7840P2314j19578j78148j911K9255l7385l260j67681
10418g4185K8556r338L5170j0572m8286k4751K02959K5648J524l0869l1522J05581
10406A69915J00594j13927j5625j26792N0104P2877p5683J6800J37578J67617
10396C83458k2930l7885M9531j36131m3607j15610n2498K29829o725j06458k1371
$$ y = [138958, 122195, 108312, 231518, 180182, 74731, 146157, 139855, 123885, 82266, 237772, 152069, 89175, 69535, 97288, 146668, 78207, 139133, 79742, -1413, 13818, 47718, 13019, -28399, -63110, -155644, -68207, 112485, 57918, 57887, 199141, 200841, 53122, 91655, 175574, 159971, 132192, 88370, 59037, 163373, 156354, 143697, 140920, 88013, 54523, 111372, 186254, 189069, 191795, 274369, 332209, 404523, 284945, 106797, 104886, 134141, 96756, 93496, -74185, -45629, -54967, -19797, -30369, -78655, -103406, 99553, 125201, 126725, 95856, 64334, 169915, 270509, 156582, 140957, 14165, 64269, 137146, 61463, 78263, 215841, 383458, 360528, 322643, 372174, 236043, 192436, 76826, 24328, 254157, 247432, 140974, 119603]
10385A19603j3474M5602j724K6166L7637q1910k06730J2767J49892O0005m7419
10374A00415k0329n4704P7234l7916J1703J48751M9883j67072o6209J13740o4751
10363I0745q6292J14000J4843j9251l5310K8988M7466l0291p774k9691j9318L7863
10351A05978O4767J94059M9449j70453o0039L5878m0220j16757j9676J67399J03915
10340C14300o4670r094N7850p0119j559j0762P3811m3969j02137J9177Q1271Q910
10328B53009k7511j52507J44879J19536J5231l9895m3415j19674L4172J10461
10318B94286j5266j33222l1865J09843j12461J24455n786q61j1252q2697q078
10307A27096J48143Q6936J48167K4567j3212m390j2894J8536M6090Q8886N456
$$ y = [119603, 106129, 151731, 150007, 176173, 213810, 131900, -74830, -62063, 87829, 147834, 100415, 80086, 25382, 102616, 64700, 76403, 225154, 275037, 107965, 41756, 155496, 90745, 4453, 118453, 133296, 114045, 78735, 107723, 155189, 124898, 117124, 87433, 68115, 105978, 170745, 364804, 414253, 243800, 183761, 219639, 179419, 62662, 42986, 210385, 314300, 249630, 240536, 298386, 228267, 226708, 215946, 289757, 245788, 143651, 162828, 244099, 253009, 225498, 72991, 217870, 337406, 352637, 312742, 269327, 149653, 183825, 294286, 279020, 145798, 113933, 223776, 111315, 235770, 229984, 229123, 217871, 135174, 127096, 275239, 362175, 510342, 534909, 521697, 517307, 504413, 522949, 569039, 657925, 663381]
10296F63381j14721k54352j00738N7961M0258n7873J4176l5513q0687m8146J16923
10285B00669J66258n4545j2985k264O0374P3400j22331j52924q7200j3865K03519
10274B58106l416l8863P1066J32198N5365o7140l0549J75016J16946M1621J45382
10263H55732J24312J58409P3038P9770l139L9580N5116J12770j6173j79100j17080
10252A183235j47160j83817j55583j16129o9094q9170j39742k6530Q6140L1018
10242C73168r0881l2904J40645J01275j7584p164r9242J3521K2887o712L7600
10231D34609P3348M7137m1618j72259P2700M5244M2113J24672J15322O7706J42261
10220I51235J82813J57381J85125K37697J62150K28085K16668N0453j4320l29091
$$ y = [663381, 548660, 294308, 193570, 251531, 291789, 233916, 248092, 212579, 131892, 83746, 200669, 366927, 312382, 299397, 297133, 357507, 430907, 308576, 155652, 68452, 54587, 258106, 254690, 215827, 286893, 419091, 474456, 407316, 376767, 551783, 668729, 710350, 855732, 980044, 1138453, 1211491, 1291261, 1288122, 1327702, 1382818, 1495588, 1479415, 1300315, 1183235, 1036075, 852258, 696675, 580546, 511452, 422282, 282540, 256010, 342150, 373168, 282287, 249383, 390028, 491303, 473719, 466555, 367313, 380834, 403721, 397009, 434609, 507957, 555094, 513476, 341217, 413917, 459161, 501274, 625946, 741268, 808974, 951235, 1134048, 1291429, 1476554, 1714251, 1876401, 2104486, 2321154, 2371607, 2357287, 2028196]
10210B028196l93646k52302j90200j08551j25850k76458j02708j09084j5646R6857
10200E50608Q4536o4154j47340M8745M6500K4261j13227M9558J00644n7439o3275
10189D59417n9441p3696J5048Q5366J0197n0397Q7205P8018K7004k6594N0958
10178F03085L7510J39058L86314L68342K46125M6863R8358Q3265n6788j79140
10168A772992j68857k89080k78318j43600j24597j3720k3609N0845J08633j21764
10158G68925j46224q1834l8178J6502j50650M824K305p9785L2623j9402R4640
10147D03746j4428J3953Q728R7790r6169k7845O8953q8752j17631K4637p3969
10136A99013L6462R6785N7730J36987J71161R3255k698J80138R7134n9373j37246
$$ y = [2028196, 1634550, 1382248, 1192048, 1083497, 957647, 681189, 578481, 469397, 453751, 550608, 635144, 570990, 423650, 472395, 518895, 543156, 429929, 479487, 580131, 522692, 459417, 399976, 326280, 341328, 426694, 436891, 386494, 473699, 551717, 578721, 552127, 603085, 640595, 779653, 1165967, 1534309, 1780434, 1827297, 1925655, 2008920, 1952132, 1772992, 1604135, 1315055, 1036737, 893137, 768540, 754820, 731211, 782056, 890689, 768925, 622701, 540867, 502689, 519191, 368541, 373365, 375670, 295885, 328508, 309106, 403746, 389318, 403271, 411999, 509789, 413620, 385775, 454728, 365976, 248345, 272982, 199013, 235475, 332260, 389990, 526977, 698138, 791393, 788695, 968833, 1065967, 1006594, 869348]
10125H69348j03396J20069r6731j4037N3533q2893j15410l2745p2277O527j8806
10114E13182N6019N9185M2982j16751j75286k8149N9214O4299J26173j14913j11289
10103C74666J21585J32607R4617M9425M0874L106j08901k2944M1183q1090j9327
10092F25801q387R6743M865n4258k11440m2237J01521K6809O5727J24408n6487
10081F73065q0784p8944K0162J90188J4223j10378L755q5775m00O4108R2302p585
10069F93937J0274J1041m3213K3557n3683l6690O4948m2803j9714l2843l2775
10058E42036K1081m010J09368P3782P5614K38079K72387L37483o8856k83672l75198
10047I38094j14959K00415q2258k25069j00255O0733K6694j5505N1678Q0312O3507
$$ y = [869348, 765952, 886021, 789290, 775253, 828786, 745893, 630483, 597738, 525461, 531988, 513182, 569201, 628386, 671368, 554617, 379331, 351182, 410396, 474695, 600868, 485955, 374666, 496251, 628858, 723475, 772900, 813774, 816880, 707979, 685035, 726218, 645128, 625801, 617414, 714157, 719022, 664764, 453324, 411087, 512608, 539417, 605144, 729552, 673065, 592281, 513337, 533499, 723687, 737910, 627532, 631287, 545512, 545112, 609220, 701522, 693937, 704211, 715252, 672039, 695596, 641913, 605223, 670171, 627368, 607654, 574811, 542036, 563117, 559107, 668475, 742257, 817871, 1055950, 1328337, 1665820, 1596964, 1313292, 938094, 823135, 1023550, 941292, 716223, 615968, 676701, 703395, 687890, 739568, 819880, 883387]
10036H83387j60725j61519L5467J63785O6280l048j31440p2235J07332r4268Q0319
10025G13335O1125J0678R0155K0929p4388N4352l4978o1701r8506m8200k1218
10014F11583j15280J48336P4005L9912J2822l7533j14526r668j4814J25920j7118
10003G03639k274j6652l7110o1995j05853m8634j11070j1915K689k17266l2799
9992F0760J07226Q524J16844J72113R9350K3836n8900P930J57471K54844J56927
9981A106925J26390r8557j79233o124R9997l4382j03004M3090m3633L8873J07387
9970A057729R0778K80P4369P2576j66029o9516M8440q9755j24605n9358J11529
9959I46438J59954J54344M2323p9640k14540J2280L2599j08750q0379o0109J26726
$$ y = [883387, 722662, 561143, 596610, 760395, 826675, 823627, 692187, 619952, 727284, 633016, 713335, 774460, 785138, 875293, 896222, 821834, 876186, 841208, 779507, 681001, 632801, 611583, 496303, 644639, 718644, 758556, 771378, 733845, 619319, 609651, 594837, 720757, 703639, 701365, 684713, 647603, 585608, 479755, 431121, 320051, 308136, 310825, 93559, 60760, 167986, 176510, 293354, 465467, 564817, 588653, 529753, 537683, 695154, 949998, 1106925, 1233315, 1134758, 955525, 949401, 1049398, 1015016, 912012, 955102, 911469, 950342, 1057729, 1148507, 1148787, 1223156, 1295732, 1129703, 1060187, 1108627, 1018872, 894267, 834909, 946438, 1106392, 1260736, 1303059, 1223419, 1008879, 1021159, 1053758, 945008, 864629, 804520, 931246]
9948I31246J32562K5437R7276J28367J43444P8278j06532J26169J11408o6439
9938A601216P6235Q4731O4600O2851j46541j92655L2117J22297K62156K59463
9928B226470J56777l0750l7867M9448Q7623K4979J18551P970J32861J75850K71349
9917C183261K60617K02596L26883M65417M85869L76181K33033n1889j44067Q0670
9907E418571M16630M15703M46411L16920O5060j47581q6106p0798j64095l09725
9897F300990j87021j70418j33134q9277M9458K0336J45230J62672K94815M55784
9887F849435N66670R14623J322792J690560J819536J586377J071934O23973R0107
9878A6536007m06425p31183q26330p95634o13736m80344l98030l35628k55535
$$ y = [931246, 1063808, 1089245, 1186521, 1314888, 1458332, 1536610, 1430078, 1556247, 1667655, 1601216, 1677451, 1762182, 1826782, 1889633, 1743092, 1550437, 1582554, 1704851, 1967007, 2226470, 2383247, 2352497, 2314630, 2364078, 2451701, 2476680, 2595231, 2603201, 2736062, 2911912, 3183261, 3443878, 3646474, 3973357, 4438774, 4924643, 5300824, 5533857, 5481968, 5337901, 5418571, 5835201, 6250904, 6697315, 7014235, 7079295, 6931714, 6845608, 6774810, 6610715, 6300990, 6113969, 5943551, 5810417, 5721140, 5770598, 5790934, 5936164, 6098836, 6393651, 6849435, 7416105, 8330728, 9653520, 11344080, 13163616, 14749993, 15821927, 16445900, 16536007, 16129582, 15398399, 14572069, 13776435, 13162699, 12682355, 12284325, 11948697, 11693162]
9869A1693162j56602j39660j55898J68188L49572N52356L20118J21932J26909
9860A2880077L15038O35837J026581J137357J072759J153431J189842J612891
9852B1023813K103270K740349L765586N109212O892685R500440J3127884J8166307
9844H2429546K4994501L2437449L5306089K4408639j899908k5251900l1554401
9837A40870015k6879335k0075506j4485789j0090155o235002l064589n70529J944987
9829F1414097M544722P582269J1373991J4685124J5328718J3163316J0539512
9822A38631749Q165140M826265J914434J713424K303798J209810p13887k278409
9814A55772324m605116q438719j0983174j0014188p242800m902794k790079N06643
$$ y = [11693162, 11536560, 11396900, 11241002, 11409190, 11758762, 12311118, 12631236, 12753168, 12880077, 13195115, 13830952, 14857533, 15994890, 17067649, 18221080, 19410922, 21023813, 23127083, 25867432, 29633018, 34742230, 41634915, 51135355, 64263239, 82429546, 107424047, 139861496, 175167585, 199576224, 197676316, 172424416, 140870015, 113990680, 93915174, 79429385, 69339230, 63104228, 60039639, 59469110, 61414097, 65958819, 73541088, 84915079, 99600203, 114928921, 128092237, 138631749, 146796889, 151623154, 153537588, 155251012, 157554810, 158764620, 158050733, 155772324, 151167208, 142728489, 131745315, 121731127, 114488327, 109585533, 106795454, 107302097]
9806A07302097N165529J1686612K1011341L3854557M9850219O8626863Q7196353
9799C84693571Q6261858L7246240l8020520q1099525q3510022o8697596n0615952
9792A86258054l4902733k2710372j3725836p100101j849170K431785N039981O798242
9784A20239850Q115956Q466850P189236N695732M320168J998635j484072l820455
9776A50721900k823150j271243k378557o163717j1449943j6019516j7168119j4632388
9768G8815267j0688364p163124m579601k452844j77937K229952M959140Q355331
9760F9297820J2432293J7895349K4453674K9615547K5267773N418553j9353025
9753A65027984l1642499l0323326k4052529j7871801j2828832r143166o568165
$$ y = [107302097, 112467626, 124154238, 145165579, 179020136, 228870355, 297497218, 384693571, 470955429, 508201669, 470181149, 389081624, 305571602, 236874006, 186258054, 151355321, 128644949, 114919113, 107819012, 105969842, 108401627, 113441608, 120239850, 128355806, 136822656, 144011892, 149707624, 154027792, 156026427, 154542355, 150721900, 147898750, 146627507, 144248950, 138085233, 126635290, 110615774, 93447655, 78815267, 68126903, 60963779, 56384178, 53931334, 53753397, 55983349, 60942489, 69297820, 81730113, 99625462, 124079136, 153694683, 178962456, 184381009, 165027984, 133385485, 103062159, 79009630, 61137829, 48308997, 39165831, 32597666]
9746C2597666m817084l599313k808423k252395j724791j482134j491836j366106
9738A3055584j275303j056084j053731q25936p56690p11914m48242j44304q175
9729F775205Q6823L34025M28514L78784K50069J36864M28203P19577R56374J003211
9719A1497649P99427P70504L17308k56249p93307j320598j683060j616070j368994
9710F346610q25487p89721n73679l97169k61587j31991m4824m5530j17441j63856
9700B995325J51304K35640J40963J84801J63266J60809J09565J66200K16327r3838
9690D430362j44617l48187l09148k15966j91543m8542n9878k01939l88244m20410
9680B101888l05806k80606k30069l8595N4282r1491k21017k66958j32789j06270
$$ y = [32597666, 27780582, 24181269, 21372846, 19120451, 17395660, 15913526, 14421690, 13055584, 11780281, 10724197, 9670466, 8844530, 8087840, 7375926, 6927684, 6783380, 6775205, 6862028, 7196053, 7624567, 8003351, 8253420, 8390284, 8818487, 9538064, 10494438, 11497649, 12297076, 13067580, 13384888, 13128639, 12335332, 11014734, 9331674, 7715604, 6346610, 5521123, 4731402, 4157723, 3760554, 3498967, 3366976, 3322152, 3276622, 3159181, 2995325, 3146629, 3382269, 3523232, 3708033, 3871299, 4032108, 4141673, 4307873, 4524200, 4430362, 4285745, 3937558, 3628410, 3412444, 3220901, 3172359, 3112481, 2910542, 2522298, 2101888, 1796082, 1515476, 1285407, 1246812, 1301094, 1209603, 988586, 721628, 588839, 482569]
9670D82569q3749l4317L2697m2765k9248j07128Q6667M2497q242L3037R6157K2238
9658D90413j13948J5503M6806n0726m9474j32295k060N6666L4684N4200J23880
9647D73649m2295p3880p4117j5372L0888J1209r5250m8361R476m352l0247k8073
9635A13275M4858N2412J33952J1355p0979K2526j1078l7191j24763L6941R5186
9624B66494J16280o6196j12354J18246N0069p0107q2179P2196O4490j37089j27683
9613I2167j20490O428P3793Q2873R1426j04449j36197O0277J38055J08843J2315
9602C05041j04826l2583J16362J54781L7657P9441j87360k47010n6057K2312j15345
9591b7587K7046J09644M917M4633l2985j33624O2340J29826P9809k8627q0335
$$ y = [482569, 398820, 364503, 397200, 354435, 325187, 218059, 304726, 347223, 338981, 372018, 468175, 490413, 376465, 391968, 438774, 388048, 338574, 206279, 204219, 260885, 295569, 349769, 473649, 431354, 357474, 283357, 267985, 298873, 310082, 214832, 166471, 175947, 171595, 141348, 113275, 158133, 210545, 344497, 355852, 284873, 307399, 296321, 259130, 134367, 171308, 266494, 382774, 316578, 204224, 322470, 372539, 302432, 220253, 292449, 356939, 219850, 92167, -28323, -21895, 51898, 134771, 226197, 121748, -14449, 45828, 183883, 292726, 305041, 200215, 167632, 283994, 438775, 476432, 555873, 368513, 121503, 65446, 87758, -27587, -541, 109103, 114020, 158653, 125668, -7956, 54384, 184210, 264019, 235392, 155057]
9580A55057j62990j89138r2490j8922P0136k2946M6949M796k6700M6107O0233
9569a29908R5354j6844m0753q5071J61619l844o6714k0352O0123J07251o631n4522
9557b92J8267j39702m6051J4101o2253K8964m649R3953L7678K4179K0547o8834
9545h4092l6101M5440l5411m7229M5407m6370j9604l0465j9960P0172o5471j32315
9533c55999j0943K22946Q8352m7360j44202q432J9311L3079J17219n6853q6924
9522b29806k06205P6353J44932R1060o9835l9970l5219r9138q6165J51567J09685
9511a92741P1008j4477j20354r4639l7950J08489j5177l559O2423J11346r965
9500a35596N7188l4841j6656J6385p198k6783O0227m4617j40697L0096K9379L1490
$$ y = [155057, -7933, -197071, -289561, -308483, -238347, -261293, -214344, -209548, -236248, -190141, -129908, -34554, -51398, -92151, -177222, -15603, -19447, -86161, -106513, -46390, 60861, 54230, -292, 17975, -121727, -167778, -153677, -215930, -186966, -191615, -97662, -59984, -35805, -15258, -84092, -120193, -74753, -110164, -157393, -111986, -158356, -177960, -208425, -228385, -158213, -223684, -355999, -366942, -143996, -55644, -103004, -247206, -255638, -236327, -203248, -86029, -142882, -229806, -436011, -359658, -214726, -123666, -193501, -233471, -268690, -367828, -453993, -302426, -192741, -121733, -136210, -256564, -351203, -389153, -280664, -295841, -299400, -236977, -125631, -135596, -78408, -113249, -129905, -113520, -120718, -147501, -87274, -131891, -272588, -242492, -213113, -181623]
9488a81623n5085J0191N723K1392k5609M6208J43003N3220j23597N2729M7773
9477e675m388r7206J21192k7896q4839J05116P145q1474P9471O6647O9698k9509
9465A18282n9238J4570O7578R9465K5844J09276O3386j07443k3043j65748j85118
9454d2189p9449J02428P0886p044n3515p3286J2993o9440Q5019J29242n7962K3507
9442D1190m6040O7935J04495n8135k5407k0296Q59l5717P397p380J04242N813
9430A38956m4193j25451J410K17348K25662R4067J31813J43722J57277K60946
9420A201557K35628J04002l2725q0586k01097l65608k15240r6582j09600j91089
9410B48660l7604R1028j9347q7923p3197J6129l1383m0859l3938j18997M2101
$$ y = [-181623, -236708, -226517, -220794, -199402, -225011, -178803, -35800, 17420, -106177, -53448, -5675, -10063, -107269, 13923, -13973, -98812, 6304, 13449, -68025, 11446, 78093, 147791, 118282, 59044, 73614, 141192, 240657, 266501, 375777, 439163, 331720, 308677, 142929, -42189, -121638, -19210, 51676, 44632, -8883, -82169, -69176, -138616, -53597, 75645, 17683, 41190, -4850, 63085, 167580, 109445, 84038, 63742, 64601, 28884, 36281, 28901, 133143, 138956, 94763, -30688, -29278, 188070, 413732, 507799, 639612, 783334, 940611, 1201557, 1437185, 1541187, 1508462, 1427876, 1226779, 861171, 645931, 549349, 439749, 248660, 211056, 302084, 282737, 194814, 121617, 137746, 106363, 65504, 31566, -87431, -45330]
9399d5330P6311j09838L9086L9682J18163J70335Q4693J6941j45703k28224p347
9388H769P9750q2913j68287J82656J45215J68924K44041K60524K66346J69069
9378A274094J70277J99912J57290N4008j39166j94645k19521j73691j18575k32089
9368G77894j64963l4515r1103j01416r8442J7423O8010l6232n9200k1140l3231
9357B23085r0129o7237m7984k3753L1898m0150N6205N8589O8074J59326p0911
9346B57013j97529o4218J92421M0599M0338K8300j9785N5524J95440N9230J00314
9335F87647K73218J81915p0104p8932o0924k4519j05258n1362j88847j47468p2015
9324C43351l264n0385j22313p5660j7521J00512L5591o3887j06491m3685J9609
$$ y = [-45330, 30981, -78857, -39771, -89, 118074, 288409, 373102, 390043, 244340, 16116, 8769, 88519, 5606, -162681, 19975, 165190, 334114, 578155, 838679, 1105025, 1274094, 1444371, 1644283, 1801573, 1855581, 1716415, 1521770, 1302249, 1128558, 1009983, 777894, 612931, 578416, 487313, 385897, 287455, 304878, 372888, 336656, 277456, 256316, 223085, 132956, 65719, 17735, -6018, 25880, -14270, 41935, 100524, 168598, 327924, 257013, 59484, -4734, 187687, 228286, 268624, 296924, 277139, 332663, 528103, 587333, 687647, 960865, 1142780, 1072676, 993744, 932820, 908301, 803043, 751681, 562834, 415366, 343351, 340087, 289702, 167389, 91729, 74208, 174720, 210311, 146424, 39933, -3752, 15857]
9313A5857O7544j3933K9774R3795j3918l31476q638J5783j27293m0557Q7109J85213
9301d0740J0081J6047K37639Q8306j04532P2083j64658j05165L6341J9914r6893
9290c1577J7145J59432J7450J9130j61552N734N9155O246j36790R799m058K0783
9278a9103J10656M3282j3133q2158Q3366J10300j30480p288J2541k3993n8777
9267B5213R3771Q9995j79426q9356o8852O0960K9797J16548K1532j4151m7823
9256C8208m5731p0006n5053J23773J42179M2995j27642n5625J57416k1294j49301
9245b0081P3586M2719r4074J16331L3056j06776k4290J8553J19866j24145j99961
9234a65216J2961J8400j2286l1690l6603J00244R9917N359J0092N58P4186Q6635
$$ y = [15857, 83401, 69468, 99242, 193037, 179119, -152357, -160995, -145212, -272505, -313062, -225953, -40740, -30659, -14612, 223027, 311333, 206801, 278884, 114226, 9061, 45402, 65316, -31577, -14432, 145000, 162450, 181580, 20028, 25762, 84917, 91163, -45627, -35828, -39886, -19103, 91553, 134835, 121702, 39544, 122910, 233210, 102730, 95442, 107983, 83990, 25213, 118984, 208979, 29553, -59803, -128655, -67695, -37898, 78650, 100182, 86031, 38208, -7523, -77529, -132582, -8809, 133370, 176365, 48723, -6902, 150514, 129220, -20081, 53505, 96224, 2150, 118481, 151537, 44761, 20471, 39024, 158890, 34745, -165216, -152255, -133855, -146141, -177831, -214434, -114190, -14273, -8914, 1178, 1736, 75922, 162557]
9222A62557O7695q9111q0353j6154l7596j8282p8976m1557J10965J10782J53037
9211B43007L7997q8487l7877K7056l5748q7655k7353K5716p30M8730J16464L5263
9199B56383K4501J0524M4825O3081o3398Q157J4780k6088j2639L1946L4590J1357
9187C98019K6034J3602l9935M8429j24J5634O7227K2211J11822k9959k9648O4141
9175F67453P745n6052R9213O8186K38106J82089K04376j3642l7252J1453M1551
9164A413226R2044l1836P2547J02995N3781K12932L12122L03681K52551L14304
9154C098347M82813N53511N25641O65033J162084J529679J954243K682801L567473
9145A6221625N421545Q430155J3679088K2573576L4409533L8333006J3008332
$$ y = [162557, 230252, 141141, 60788, 44634, 7038, -11244, -90220, -131777, -20812, 89970, 243007, 281004, 192517, 154640, 181696, 145948, 58293, 30940, 56656, 55926, 104656, 221120, 256383, 280884, 291408, 336233, 399314, 335916, 344073, 358853, 332765, 320126, 352072, 386662, 398019, 424053, 437655, 397720, 446149, 446025, 461659, 528886, 551097, 662919, 632960, 603312, 667453, 675198, 619146, 718359, 786545, 1024651, 1206740, 1411116, 1397474, 1360222, 1371675, 1413226, 1505270, 1473434, 1545981, 1648976, 1702757, 1915689, 2227811, 2531492, 2784043, 3098347, 3581160, 4134671, 4660312, 5325345, 6487429, 8017108, 9971351, 12654152, 16221625, 21643170, 30073325, 43752413, 66325989, 100735522, 139068528, 152076860]
9138A52076860k5486985l7702675k9128663j8373537j1374910p336575m859682
9131A7813833l427713k665903k137266j486922j287593j069156q14056m97588
9123D427636n18180m79473l27602m24008k96591j97795j86276j88452j04037j49220
9113A556002j93804m4936o5095j87470j87202o2833N9609n056j0013p5768M4936
9102H28370O0263M4006K06921K7100K2129p794m028P8695j37420j6355M1856P6290
9090A220033j14675j28514j2619j6681k6367O3481n7837P374r3028j87938j51343
9079E01886n1699j20317j7527j24432o8886m2546j64554M338L8698l8223n1736
9068a34998M3154J42940J45840n7878j15162p3701j24031k2743l2859J26030L4730
$$ y = [152076860, 126589875, 88887200, 59758537, 41385000, 30010090, 22673515, 17813833, 14386120, 11720217, 9582951, 8096029, 6808436, 5739280, 4925224, 4427636, 3909456, 3429983, 3102381, 2678373, 2381782, 2183987, 1997711, 1809259, 1705222, 1556002, 1362198, 1317262, 1252167, 1064697, 877495, 814662, 874271, 869215, 859202, 783434, 828370, 888633, 932639, 1139560, 1166660, 1188789, 1180995, 1176967, 1255662, 1118242, 1101887, 1143743, 1220033, 1105358, 976844, 964225, 947544, 921177, 984658, 926821, 934195, 841167, 653229, 501886, 450187, 329870, 312343, 187911, 119025, 76479, -88075, -83737, -45039, -83262, -134998, -91844, 51096, 196936, 139058, 23896, -49805, -173836, -196579, -229438, -103408, -68678]
9057f8678j4780l7684O9922J04605J5484k8475l2087j32193j5026n553Q3548M5997
9045a4920o2821q3779N3574J00648r8839r5397J12377L0238m9366k6451l0398
9034a65134o0459R414m309J13110J71537j67439r6575p4870L6439J23269q2569
9023a97586j86001K3967K00111Q1797J70047J04910j3365j69490m6022n5012o2913
9012a49557L30L508o0369M1795m2138L0636p06J9339R3021J13640M2351r2185
9000c35R4428K8915j85330j50381l4529k934J45572J00740j0902O9308l8732m0728
8988b4908M7821Q324j01469K1300l5072r9597R4652N8253J4207M1074n6902j16373
8976a48690j89159K3786K08286K0286P431l5494r6655o2220N0176L1015O1592
$$ y = [-68678, -83458, -121142, -51220, 53385, 68869, 40394, 8307, -123886, -138912, -144465, -60917, -14920, -77741, -161520, -107946, -7298, -106137, -201534, -89157, -58919, -108285, -134736, -165134, -225593, -216179, -220488, -107378, 64159, -103280, -199855, -274725, -238286, -115017, -197586, -383587, -359620, -159509, -77712, 92335, 197245, 183880, 14390, -31632, -86644, -149557, -149227, -145719, -206088, -164293, -206431, -175795, -176501, -157162, -64141, 49499, 91850, -335, 94093, 123008, -62322, -212703, -247232, -250166, -104594, -3854, -14756, 54552, 15820, -24908, 22913, 31237, -70232, -48932, -84004, -183601, -88949, -30696, -16489, 24585, -32317, -148690, -337849, -314063, -105777, -85491, -78060, -113554, -210209, -272429, -222253, -191238, -129646]
8965a29646j02048Q8058R7094K4072l0071k8983m4136M9086P9435M0213M2336
8954H5410j6443j80748j08366m0362k2201j4948J41469N5725m8815O9544M2263
8943c7472p8985p0592j11814M8360K0010K3014N2988l5310k155o5138k843J62266
8931i7671J53569N4497N5514r0207n7421M8645k4924k2628L143j15270L6100N7519
8919H66r3740p4444j4553r7092J358R6641Q3600K09873J14717n0590j20802l2900
8907B2934n7766j04829L9534q741k5764k05826M4299J68854J18892q0852o7522
8896a56787R2478j7745j225n5283j09757J17867J51702j1713o5995j9420j2352
8885h8230p4658J56020M0824K2798p6419p2680j8206n8662k6387K930m7284J4810
$$ y = [-129646, -231694, -143636, -46542, -22470, -52541, -81524, -125660, -76574, 2861, 43074, 85410, 68967, -111781, -220147, -260509, -282710, -297658, -156189, -100464, -149279, -79735, -37472, -116457, -187049, -298863, -250503, -230493, -207479, -154491, -189801, -191956, -257094, -259937, -97671, 55898, 110395, 165909, 75702, 18281, 66926, 42002, 19374, 22517, -92753, -56653, 866, -92874, -167318, -181871, -278963, -277605, -180964, -97364, 112509, 227226, 176636, 55834, 22934, -34832, -139661, -100127, -108868, -134632, -340458, -296159, -127305, -8413, -89265, -156787, -64309, -82054, -83279, -138562, -248319, -130452, 21250, 9537, -56458, -75878, -88230, -162888, -6868, 33956, 56754, -19665, -92345, -110551, -169213, -195600, -192670, -239954, -225144]
8873b25144L4064k5304J44389k0258j93131M9521J45013O0215p5278j5467J34947
8862A3567O5700Q2725j53166j11396Q17p3433J7319l8139N804J41512K11513n8429
8850A04394j14861m1628K4828j70941K9479J38760J05228P1801L220j45971j21770
8839a17461k4967L5645M5890o1711j902R322L5867j62395M6499J02938J96636
8828A04361J39389l2834m7235k6747L495m8154M2929k1228j72914j31697P8789
8817a11846P055j06577n4993J5975J43822j4137l1196L5591J44514J2539K0231
8806F0978L2096r2802j49645Q5891K19172M0372j34800r8449O4659l0447J5925
8795A2950K2481M9990K7905k6200j07895j33511q8028M2449Q6185P3252r0211
$$ y = [-225144, -191080, -216384, -71995, -92253, -285384, -235863, -90850, -30635, -105913, -121380, 13567, 79267, 161992, 8826, -102570, -101753, -175186, -157867, -196006, -190202, -48690, 162823, 104394, -10467, -52095, -27267, -198208, -168729, -29969, 75259, 147060, 150280, 4309, -117461, -142428, -106783, -60893, -122604, -124506, -115184, -79317, -241712, -195213, -92275, 104361, 243750, 210916, 163681, 136934, 140429, 92275, 135204, 113976, -58938, -190635, -111846, -104791, -211368, -266361, -250386, -106564, -120701, -151897, -116306, 28208, 40747, 60978, 93074, 272, -149373, -63482, 155690, 196062, 61262, -37187, 27472, -2975, 12950, 35431, 85421, 113326, 87126, -20769, -154280, -242308, -199859, -113674, -40422, -130633]
8784a30633n0306J23713L076k9040j7545K6537j56433o2587P8010P9870l5998
8773a71336r36L6177q8571L9311R7248J13360J494o203r0239q7156m067L9450
8761a21468m841O9506M9638n1439Q761m90n792K9323r207R9998j28226j4665L9251
8748c9651k8123r3604j03888L2220O3126N9682k5113M7508J17325r1011k0234
8737h1763O507j6027o2465L6813j34406j09756P0235Q9287J02542J29997q911
8726B2053K3572l1982j12971l6541L5209P3860j1088L2394N8314Q8290L5467l3315
8714A43262k4526J8531J51888K6624m3551j64699o8567r8137q4010J73849J07318
8703A37982N2094j11673j20866J24557q3541j68419J3584n925l1605P6468j180
$$ y = [-130633, -180939, -57226, -54150, -83190, -100735, -74198, -230631, -293218, -215208, -135338, -171336, -172272, -136095, -224666, -185355, -88107, 25253, 26747, 20544, -69695, -156851, -160918, -121468, -126309, -56803, -7165, -58604, -49843, -50333, -56125, -26802, -36009, 63989, -64237, -78902, -39651, -67774, -161378, -265266, -233046, -169920, -110238, -135351, -87843, 29482, -61529, -81763, -75256, -91283, -153748, -116935, -251341, -361097, -290862, -201575, -99033, 30964, 22053, 45625, 13643, -99328, -135869, -100660, -26800, -37888, -5494, 52820, 141110, 176577, 143262, 118736, 137267, 289155, 315779, 272228, 107529, 38962, -59175, -143185, 30664, 137982, 190076, 78403, -42463, 82094, -1447, -169866, -156282, -162207, -193812, -117344, -118524]
8692a18524p4317l1504J03407O8952p475L9280p6339O8400J5407J4230M7340m647
8680D4210J4758Q1377j04758r1499J910m8845j04781J32146J15869l0036n0846
8669d0495J4477L7416m2019J19134N6445k18835q8136K0409p865J01699o422p7883
8657a32075J238K8082k1039L7938M0983M9697R0343K6380R291l9331K0486k1728
8645I0265j7461M0827r1755n6993J11451P6051l9393K914j63758l1022P6276n1232
8633e3830j20559l5359J02604J62839k628j30635o8431J3182J18576R8215K6011
8622A09985j9007j49302N1450M8194J44222L3329J35582J78104q197j74628j08673
8611B41059r488K6291K3928J53r5178p3913j2543j19974n6681O1605O5299N3584
$$ y = [-118524, -192841, -224345, -120938, -51986, -59461, -20181, -96520, -28120, -12713, 1517, 48857, 44210, 58968, 140345, 35587, -55912, -54002, -102847, -207628, -75482, 40387, 10351, -40495, -26018, 11398, -30621, 88513, 144958, -73877, -162013, -141604, -149469, -47770, -54192, -132075, -130837, -102755, -123794, -85856, -44873, 4824, 95167, 121547, 130838, 91507, 111993, 90265, 72804, 113631, 21876, -35117, 76334, 152385, 112992, 115906, -47852, -78874, -2598, -53830, -174389, -209748, -107144, 55695, 53067, -77568, -145999, -132817, -14241, 83974, 109985, 90978, -58324, -6874, 41320, 185542, 218871, 354453, 532557, 524360, 349732, 241059, 231571, 257862, 281790, 281943, 186765, 112852, 100309, -19665, -76346, -14741, 50558, 104142]
8599A04142m4484M9105P4439j17041j03R0176J10561L9403k3175k1370q7857j33376
8587D0420j36597o758m5780R2829q0905j66341k9715J72698k105P9873J35860
8576E3479N5701q6938j64844j6472J44707J25759j57717j76391O879P815o6506
8565b74528J68242J9601j05970L627K23801l8299j65358q1717o9057L5125R8783
8554a85750N9491l9580Q2360p8139m7240O610M6023L2547Q1151p135Q2692o6906
8542c3876K3380M6819n1778m9415K7349J11170n924P291j667j26501j24408J0141
8530a67419k6470J9251R8275J10296k1210j90459l8202n413J4078R0842m521p3054
8518a94006K0208N8256J46731J17393p4595j03970K7001K8998k7810j2237K3229
$$ y = [104142, 59658, 108763, 183202, 66161, 66058, 156234, 266795, 306198, 283023, 261653, 173796, 40420, -96177, -102935, -148715, -55886, -136791, -303132, -332847, -160149, -162254, -82381, 53479, 109180, 22242, -142602, -159074, -14367, 111392, -46325, -222716, -215837, -208022, -274528, -106286, -86685, -192655, -189028, 34773, -3526, -168884, -250601, -319658, -284533, -185750, -126259, -165839, -83479, -161618, -208858, -202248, -156225, -123678, -42527, -49662, 33030, -33876, -10496, 36323, -15455, -64870, -37521, 73649, 67725, 75016, 73349, -53152, -177560, -167419, -193889, -174638, -76363, 33933, 12723, -177736, -215938, -221351, -207273, -116431, -120952, -194006, -173798, -115542, 31189, 148582, 73987, -29983, -2982, 26016, -1794, -14031, 9198]
8507I198K7009q8906J5999K1664l9534J5526j0213j39801M689J37154J4717p6714
8495a09212o4682r1650L272J26644M4313M853l2137j9549l969J5183j2135j0290
8483a49359o6827O6879K37062Q5858k2780q9752n0615r9474j49143o777Q0878
8472a64050J79008J8216j7361r7503n3480l9879l4106J4769R5661J71509r8044
8461b5260P3564P3314m4642j65092m1730l6142P9730Q3520j16538m8390J50477
8450a7189J29612M5458j13050j33168K6434K3177k7722j73831n8613J75441J22248
8439a203q4609j2839N6098K9836l3970O7579L4107m7124j02533m7566j04605Q5834
8427a60995J55145l4588j04232j55361o6095O225K5922O1108K1123l2468N6084
$$ y = [9198, 36207, -52699, -36700, -15036, -54570, -39044, -49257, -189058, -184369, -47215, -32498, -109212, -173894, -265544, -262272, -135628, -91315, -86462, -118599, -138148, -142117, -126934, -139069, -149359, -216186, -149307, 87755, 173613, 150833, 61081, 10466, -89008, -238151, -244928, -164050, 14958, 33174, 15813, -81690, -135170, -175049, -209155, -194386, -98725, 72784, -25260, 48304, 121618, 76976, -88116, -129846, -165988, -86258, -2738, -119276, -167666, -17189, 112423, 157881, 44831, -88337, -61903, -38726, -66448, -240279, -298892, -123451, -1203, -85812, -98651, -42553, -12717, -46687, 20892, 54999, 7875, -94658, -142224, -246829, -160995, -5850, -40438, -144670, -300031, -366126, -359901, -333979, -272871, -251748, -284216, -228132]
8416b28132J33815p6886P7164Q2328p6061l2741k5556J19361j1115o457n919j723
8404e1922q999q4900J6709K00578N601j25420m9112n8280O823L9715J17193J57209
8392A65195J3642p7942r7431q4018l6592O1609O6414N5389m8755k8278P0917k605
8380E7545J19752M2690p7593r8643j1288J51181q007j35400j03305k1838J36805
8369E1899K436k20511n2443K3364q3729L5078J31183N1123R6102J1807J18142
8358A64451j14294o2957j0751j05374J01258N0978j25709p6302n5398Q7373N3349
8347i3376p8167n8519k9180k6709J23334J67385K9690j4982j7392n9268r425J07540
8335D0931j70769q4088K0798L6498P9394q846N5643R3964N8860j50036n1881J84819
$$ y = [-228132, -94317, -171203, -94039, -11711, -87772, -120513, -146069, -26708, -37823, -44280, -50199, -51922, -60921, -145821, -129112, 71466, 77067, -48353, -97465, -155745, -148922, -109207, 7986, 165195, 178837, 100895, 3464, -80554, -117146, -55537, 10877, 66266, 17511, -10767, 60150, 57545, 177297, 219987, 142394, 43751, 32463, 183644, 175637, 40237, -63068, -84906, 51899, 54335, -166176, -218619, -195255, -278984, -243906, -112723, -61600, 34502, 46309, 164451, 50157, -12800, -23551, -128925, -27667, 23311, -102398, -178700, -234098, -146725, -93376, -171543, -230062, -259242, -285951, -162617, 4768, 34458, 19476, 2084, -57184, -66609, 40931, -129838, -213926, -193128, -156630, -77236, -86082, -30439, 63525, 122385, -27651, -79532, 105287]
8323A05287O2857k02535j08826Q6109O1367O4346J84717l8825j47364q7518o3617
8312h4002j76990q7409J59874O8432R4092J17468J04122q8390K8329p8083n4465
8301B978O0188j9990m1543N186N1919J01383M8269o7734j0687r7586O9787m4566
8289E7604K3828N210o0322o0196j34460R0725J28185j63066q5841N825K6919M0253
8277a25336J15241M3054j9137j48318j31117M8069M657q258k6532j00927o1874
8266d10478R4126P5329Q8577j12314M9040J99677m8020j37980r2070n5560j02820
8255d52493J8367J04519J30150P3246k8043k1348P1976J04885j9591q194q37J2538
8243a4825O8700J37330J3986n3575k4686n9038r2479k3779N8537L7998N492m1578
$$ y = [105287, 168144, -34391, -143217, -57108, 4259, 68605, 253322, 214497, 67133, -20385, -84002, -260992, -348401, -188527, -120095, -26003, 91465, 195587, 107197, 135526, 57443, 2978, 63166, 43176, 1633, 6819, 58738, 160121, 208390, 140656, 129969, 32383, 102170, 57604, 81432, 86642, 26320, -33876, -168336, -77611, 50574, -112492, -198333, -192508, -165589, -125336, -10095, 32959, 13822, -134496, -265613, -217544, -212887, -221145, -247677, -348604, -410478, -316352, -241023, -152446, -264760, -215720, -16043, -64063, -202043, -294113, -349673, -452493, -434126, -329607, -199457, -126211, -154254, -175602, -103626, 1259, -18332, -26526, -27363, -14825, 53875, 191205, 205191, 151616, 126930, 67892, -24587, -48366, 10171, 48169, 53661, 12083]
8231A2083m2961l4945J04304q234l3522k5876J1217J25669n0743r8728o8780k5276
8219a35792J9782J76467R604j27595j73047K1783j1854p1076k1770q2404P0182
8208c25720J02873J04901L9252J34996J16888K18p0659q9569J7076l5586k4370
8197b9700j24149j76347J89648J58057L5437l448M5791l4734J4788L443j59895
8186h1109j09416k1472J35692O5612R0677o642j71384J46988M5060j29571m7342
8175h2907M4058J4680l1317M3010M0j44404J851L9811K5990Q6014K1783r773l1114
8162b2278o0281O3558N7267m871o0504j34514R329j0427N9221O2107r2867M5518
8150h8742J8033J08243l9063N544k3253p30r3790l7996k2631j2408K0904j0399
$$ y = [12083, -30878, -65823, 38481, 30247, -3275, -29151, -17934, 107735, 56992, -41736, -110516, -135792, -116010, 60457, 70061, -57534, -230581, -208798, -220652, -291728, -313498, -395902, -325720, -222847, -117946, -78694, 56302, 173190, 173408, 102749, 13180, 30256, -5330, -29700, -153849, -330196, -140548, 17509, 52946, 49498, 95289, 60555, 75343, 78786, -81109, -190525, -211997, -76305, -10693, 79984, 73342, -98042, 48946, 94006, -35565, -82907, -38849, -24169, -55486, -12476, -12436, -156840, -154989, -115178, -89188, -3174, 18609, 8836, -22278, -82559, -19001, 38266, 33395, -27109, -161623, -152294, -162721, -103500, -41393, -134260, -88742, -70709, 37534, -1529, 4015, -19238, -19968, -113758, -151754, -174385, -186793, -165889, -176288]
8138a76288N9630m276N9332J29932K2069n0462r962K5221m4557j66988O0922J22574
8126B7147K1335j2576k2290J35979R8469j30880l1249r4751j28304J48343J31569
8115A42792p0437r6491J7566O8195j8164J3427K8210N5802n1634M3899m3970n0244
8103C8951J7628j63408L7947k3913l0316M3995K4085O8419M1502J3052o1592j3962
8091g612J26102o3792j40535m6511L0413O512J8144o5837Q507P7758J72738J9467
8079A35354m7013k00901p5279K5134L5709J20119J18044j39682J17791J7360o8183
8068C8453j5499M2948M3952P083j9190O080p9851l4778J03169o045n041n8479
8056B2802M5359P1149L8586j5929P393O9779P735J6773n0210q7117L63J2952P1088
$$ y = [-176288, -116658, -120934, -61602, 68330, 90399, 39937, 29975, 55196, 10639, -156349, -95427, 27147, 48482, 35906, 13616, 149595, 248064, 117184, 85935, -8816, -137120, 11223, 142792, 72355, -24136, -6570, 61625, 43461, 56888, 85098, 140900, 89266, 133165, 89195, 38951, 56579, -106829, -68882, -92795, -123111, -79116, -55031, 13388, 54890, 67942, 6350, -7612, 118490, 54698, -85837, -132348, -101935, -95423, -77279, -143116, -134609, -56851, 115887, 135354, 88341, -112560, -187839, -162705, -126996, -6877, 111167, -28515, 89276, 106636, 38453, 22954, 65902, 109854, 116937, 97747, 103827, 23976, -10802, 92367, 86322, 81281, 22802, 68161, 139310, 177896, 161967, 169360, 239139, 246874, 263647, 213437, 126320, 126683, 139635, 210723]
8043B10723R6611J1703k2579j58306j51118J9648Q5131o30R7027n904m8666o1696
8031G1944M8918J78280M0440j16244m9032j1487L2416M7941n2606p1929m9320
8020F9321n660P4612J22984o8894k3739n9595n1703O5856j8716j6619Q8189J8681
8008A94717l69J63727R0551K3940J48514j72702j06451J0893P48o8094P9777J6342
7996C81593j87042j36241L9391J22525J76329Q94k12966k37381r6467J14014R4268
7985E8917K1320k8611J00269J21800j1844j49993j61648K9281P7324m8465r2451
7974h4101j1055J40694N5413m5597j62279k6863J04900M2417p0720m7476J38721
7963C4054K73084Q4272m1582k8520l4380p3102m1004M8213j8520j54599J57003
$$ y = [210723, 307334, 319037, 296458, 138152, -12966, 6682, 91813, 91183, 188210, 182306, 133640, 71944, 120862, 299142, 339582, 223338, 174306, 162819, 195235, 243176, 190570, 118641, 69321, 63661, 138273, 261257, 192363, 168624, 109029, 57326, 123182, 104466, 87847, 176036, 194717, 194348, 358075, 448626, 472566, 621080, 448378, 341927, 352820, 353568, 285474, 365251, 381593, 194551, 58310, 97701, 220226, 396555, 397449, 184483, -52898, -149365, -35351, 58917, 80237, 51626, 151895, 273695, 261851, 111858, -49790, -20509, 56815, 8350, -84101, -95156, 45538, 100951, 55354, -106925, -133788, -28888, 13529, -57191, -104667, 34054, 307138, 391410, 349828, 321308, 286928, 213826, 172822, 221035, 202515, 47916, 204919]
7952B04919J17019R6822k5538j73963k51455j21184R5366J05324o8660q8273j09760
7941b19383j0290p6970Q6807K16429J05882O4956q99m9893j66893j60676j32229
7930c43159J17542K8528J1045l0202J04604N9993K3921j10616r834k2679n950
7919a76807P8307O8694P1961p1052j13971m9496O0738O7344p102K2518P3249K5396
7907D9779o0624L943J3338k2352M6106j547l5570n052n2154k03694l2941J83818
7895a16950Q9919N7381k12649j71246n0501M7988K693J77577K71129K3998r8848
7884B0491n7542n1298o1783k7960r075j55678k8086K10970P3889l6340l2282Q1612
7872g3082J3594o1942j22636p3383J13390J25593J01830L4366J00469j20452j67739
$$ y = [204919, 321938, 418760, 393222, 219259, -32196, -153380, -58014, 47310, -21350, -109623, -219383, -229673, -306643, -219836, -3407, 102475, 167431, 166532, 116639, -50254, -210930, -343159, -225617, -197089, -186044, -216246, -111642, -51649, -27728, -138344, -148178, -170857, -176807, -98500, -29806, 42155, -28897, -142868, -192364, -131626, -64282, -71384, -48866, 24383, 49779, -10845, -6902, 6436, -15916, 30190, 28643, -6927, -11979, -64133, -267827, -300768, -116950, -27031, 30350, -182299, -353545, -404046, -356058, -353365, -175788, 95341, 119339, 20491, -37051, -88349, -150132, -178092, -187167, -342845, -370931, -159961, -86072, -122412, -154694, -73082, -59488, -121430, -244066, -317449, -204059, -78466, 23364, 57730, 158199, 37747, -129992]
7861a29992j20360r3814N4618J42915L7280J24252J3189o311j26250j97264p2024
7850c73761M3831o455J43299M8651n8578j241m8682J7888k7277q3477q1948R7662
7838c30088J70500J27246M9033m0090r4425m3249Q8619M790K5209N8301k0585
7827d739k6810L4487j05323j28931R565J85031J57861k9108j54543m2647J34094
7816B8937P9110Q2642q0240k81929J05576j51394j55045J18484K23861R7028P335
7805G4365Q7676J81481j82550j32760o9762n3872n0560j1397J9921Q6852m1093
7794i1699n687O947M9552j181m417k7024N9589m4961p070M710M3121J33893J5199
7781A30972p5741K922J0835M8142j62653q7731p8130j20347O5276J09598O8383
$$ y = [-129992, -250352, -344166, -289548, -146633, -109353, 14899, 28088, 21777, -104473, -301737, -373761, -329930, -336385, -193086, -144435, -203013, -204254, -252936, -235048, -262325, -345802, -427750, -330088, -159588, -32342, 16691, -23399, -117824, -161073, -72454, -67664, -42455, 15846, -4739, -31549, 2938, -102385, -231316, -221751, -36720, 121141, 92033, -62510, -105157, 28937, 108047, 190689, 110449, -171480, -65904, -217298, -372343, -253859, -29998, 67030, 74365, 162041, 343522, 160972, 28212, -41550, -95422, -145982, -157379, -137458, -50606, -91699, -97386, -90439, -40887, -42068, -46485, -73509, -13920, -58881, -65951, -61241, -18120, 115773, 130972, 55231, 58153, 68988, 117130, -45523, -133254, -211384, -331731, -266455, -156857, -88474]
7770h8474J9795o6333r3459Q4804J17293Q9895j74519l9455J66727J2700m4928
7759a5954r6457j08420k0094J1916m4995m6547K01J35915J22788o031N3036j5668
7747c0310K6547j5651j7751o9898P3979M2680r8643l6162M9083j45214J13082
7736a08258Q077m2564p3871Q0864K30979J1872r8311j60530n2145M8380J18330
7725c7177R7630j58385r7150M840k2646n4851k6678Q8438J18403J06890J5867
7714C5181R9325J3425q5280q379j9683k0974j38766j77565P5067J38767n0974
7703a39856L9257M9571m6939j9224Q9980J77186l8236j35780j68967o1542J373
7692b53177L37703N3679r8393j52385j60720J1530J30680J78169j32489q547O5576
$$ y = [-88474, -68679, -135012, -228471, -143667, -26374, 63521, -110998, -150453, 16274, 28974, -15954, -112411, -220831, -240925, -229009, -274004, -320551, -320350, -184435, -61647, -67678, -14642, -30310, -3763, -19414, -37165, -107063, -33084, 9596, -89047, -125209, -76126, -221340, -108258, -100181, -142745, -216616, -135752, 95227, 107099, 8788, -151742, -203887, -155507, -37177, 60453, -97932, -195082, -190242, -212888, -267739, -294417, -205979, -87576, 19314, 35181, 134506, 147931, 62651, 54272, 34589, 13615, -125151, -302716, -227649, -88882, -139856, -100599, -51028, -97967, -117191, -27211, 149975, 111739, -24041, -193008, -254550, -253177, 84526, 138205, 39812, -112573, -273293, -261763, -131083, 47086, -85403, -93950, -28374]
7681b8374k7211k6912J1943j4205m4035N3686O1409J01724M5474k9229j50799
7670d6529J27229R8718j00462K9989K2098r4451M5060k5466m7322L2710N1318
7659I2892j27401j82865J52061N5430K7931j7376Q947J30442J9672J7778p8856
7648I8655q8999K5813k2664N6316j2642K2632j68723p5490M6317L8411J08390
7637B8016j6265J6090n0915m4895L5733k4389L1131K2054n0811K6175q309p4451
7625a10836n637j5190j5420r5666j10751j7625J87202J25717R9512j50703l3622
7614a43019j11209l0988l7513J16214J86251Q1923j41482j32598o1118L9510j3161
7603b47190M0629K3203n1890O8788O5093k5752p7055J28425J74463m7160m8634
$$ y = [-28374, -55585, -82497, -70554, -84759, -128794, -75108, -13699, 88025, 133499, 104270, -46529, 80700, 179418, 78956, 108945, 131043, 36592, 81652, 56186, 8864, 41574, 92892, -34509, -217374, -65313, -9883, 18048, 672, 9619, 140061, 159733, 177511, 98655, 9656, 35469, 12805, 69121, 56479, 79111, -89612, -165102, -118785, -80374, 28016, 11751, 27841, -23074, -67969, -32236, -56625, -25494, -3440, -54251, -28076, -36385, -110836, -116473, -131663, -147083, -242749, -353500, -371125, -183923, -58206, 41306, -109397, -143019, -254228, -285216, -322729, -206515, -20264, 61659, -79823, -212421, -273539, -234029, -247190, -206561, -183358, -235248, -166460, -101367, -127119, -204174, -75749, 98714, 51554, 2920]
7592B920J84744P379j09593r866M11j18163n0728q7499r8216l0857p130J22386
7580a94212P1425k6729k2298K2900j30687R0822J13813O5928M7897K4816P3681
7569A37356l2482l338l0284P8045J368p2419K6088M6852L529J33972l2452j32919
7557A23316m7026j5680N8494O7964j73341j7087J46196Q0015M7744K9740j41510
7546A58825k4081q5984p7554j3430k5386n7708J3898j5745m9454M2055P9746M7545
7534g273M5654l773l2742M6998n259q4815L7698k1856n1343j16672N2779J11900
7522b8704j6264M6765j1138j48911q9267J93831M0553j39593r3781O9109R4838
7511h2562R6502P8302L8080j20934Q3765p8914J1468J5520q3171L3067j2198L9991
$$ y = [2920, 187664, 195043, 85450, 75584, 75995, -42168, -92896, -180395, -278611, -309468, -316598, -194212, -122787, -149516, -171814, -148914, -279601, -188779, -74966, -9038, 38859, 63675, 137356, 104874, 101536, 71252, 149297, 150665, 78246, 104334, 151186, 154715, 288687, 256235, 123316, 76290, 60610, 119104, 187068, 13727, -3360, 142836, 222851, 270595, 300335, 158825, 134744, 48760, -28794, -42224, -67610, -125318, -111420, -127165, -176619, -134564, -54818, -7273, 38381, 34608, 1866, 48864, 43605, -41210, -3512, -25368, -76711, -193383, -140604, -28704, -44968, 1797, -9341, -158252, -247519, -53688, -13135, -152728, -246509, -177400, -82562, 13940, 92242, 130322, 9388, 93153, 14239, 25707, 41227, -41944, -8877, -21075, 18916]
7499A8916J660J6561j4481p5321J0176J99900o438J3204j60710j40137J48924
7488A2254J29492o0470k3071k2312k19377n2432J9042J6564R8200n9253q0471
7477b41834m905J29353P6057m2459J8408r9398j46834M4803M0059o9680n5589
7466c52019O2071J81150j0360k6481Q6747j1928J23589J80127J7927j16056k13961
7455g9194j07399P0799J43328j21942o0903R020Q3035R5668J60314j17689j23759
7444d8722o908L4350j62805q1806P3824L9252J43287Q9956Q8068j02039l4508
7433C1949n5746K9723J09117l2156q1309p7383j65280j28148M4269j17143N7163
7422c84944l7662P2900J06367J06832O8928L1190M7105J3680j6071n6635j6846
$$ y = [18916, 20576, 37137, 22656, -52665, -42489, 157411, 150973, 164177, 3467, -136670, 12254, 141746, 81276, 58205, 35893, -183484, -235916, -216874, -200310, -102110, -161363, -241834, -246739, -117386, -41329, -83788, -65380, -164778, -311612, -266809, -226750, -296430, -352019, -289948, -108798, -119158, -145639, -58892, -70820, 52769, 232896, 250823, 134767, -79194, -186593, -115794, 27534, -94408, -155311, -146291, -63256, 32412, 192726, 75037, -48722, -55630, -21280, -184085, -265891, -192067, -152815, -9528, 80428, 168496, 66457, 31949, -23797, 5926, 115043, 82887, 1578, -75805, -241085, -369233, -324964, -442107, -384944, -422606, -349706, -243339, -136507, -67579, -36389, 10716, 24396, 8325, -48310, -65156]
7411f5156J06206n0960o1484Q3002K461Q5171J21558J26466k4416l8337j05455
7400A79056j13250q3793l2433J01957k5028o1698K5908o1883m4999N2015L4620
7389b9528n8975k8395O4634O2714R687j28415j21891Q0791J48160r7920j18561
7378b17699J75200J06687j25280J2190M7917O3316N9672n2018r555J8538L9710
7367A18678j636M212L0055L5184p4443k5478m7155J6315N1914J205n715q9993
7355A3143p2797Q8755n4254j72008R059Q6349R7663j07598j77098q907J09230
7344a88463R719o1880M7015J29208P4171J5847j76059o7339J5817l1743M027L515
7332b26165n2526k6110Q7698p464O6524M4127K9649m300K7887j53080n6662J32824
$$ y = [-65156, 41050, -9910, -71394, 11608, 14069, 99240, 220798, 347264, 322848, 284511, 179056, 65806, -17987, -50420, 51537, 26509, -35189, -9281, -71164, -116163, -64148, -29528, -88503, -116898, -52264, 10450, 20137, -108278, -230169, -149378, -1218, -99138, -217699, -42499, 64188, -61092, -48902, -985, 62331, 122003, 69985, 60430, 78968, 118678, 117042, 121254, 151309, 186493, 112050, 86572, 39417, 55732, 107646, 108851, 103136, 13143, -59654, 29101, -25153, -197161, -188102, -101753, -4090, -111688, -288786, -297693, -188463, -178744, -240624, -193609, -64401, 9770, 25617, -150442, -217781, -201964, -233707, -229680, -226165, -278691, -304801, -217103, -224567, -158043, -113916, -84267, -88567, -60680, -213760, -270422, -137598]
7320a37598Q1097k886M7918k3530o1881P2884O6406J63811j1296j38739p2199
7309a6013K5253J1298m0345K5480o1762j34274J23143J33299k5640k7218m3783
7298c0562n2189J19566K29143r7834k8437m503j02111J2076j19120J1581Q6673
7287B4283N2418j22321j04686j1250M699N1305J68194O0337n8881K14o3204l4650
7275c3542M9498R4873L6555p1658J1863K479j5851k3841l0310J2985j07980q3124
7263a58053k471J32P3675J10127O3425j1649j10526M02R2612J30367p1524j71609
7251e5092j42180R179Q0571J9024M1303l4544l0868p2805J31819j48305p6248
7240b78146R7817L25526l1354r1142J22429N9334M1619k8069p6812o8505l6392
$$ y = [-137598, -56501, -59387, -11469, -34999, -96880, -23996, 42410, 206221, 194925, 56186, -16013, 9240, 20538, -19807, 5673, -56089, -190363, -67220, 66079, 40439, 13221, -30562, -82751, 36815, 265958, 168124, 139687, 135184, 33073, 45149, -73971, -62390, 24283, 76701, -45620, -150306, -161556, -156857, -105552, 62642, 122979, 64098, 64312, 1108, -33542, 15956, 110829, 147384, 75726, 87589, 90068, 74217, 50376, 20066, 33051, -74929, -158053, -160524, -160392, -86717, 23410, 86835, 75186, -35340, -34938, 57674, 188041, 116517, -55092, -197272, -188093, -107522, -88498, -47195, -81739, -112607, -185412, -53593, -201898, -278146, -180329, 145197, 113843, 22701, 145130, 204464, 246083, 218014, 141202, 72697, 36305]
7229C6305O1115K2336J3151J01078J9630j63882m1894j07466M987j16621j11397
7218b82658J24785R9849j7829q1281N0540J41473P9183j5023p1950m8249M3338
7207B2178L3505O0962o0430o5564j8498J32933P2937l2333j47796J0076L2610
7196D0580N2658n779q1267N030N1782r2368J78082J33644p9160P5869j10982j52242
7184A5847m030P3928q1347l984O1920R0570p842k5292k3608q2925m5124M087N9382
7171C1582L8835r1609r702J1969O0419R172j5769O4689l1035j54958J21365R2956
7159A27914n624j11401j4079N5269M8469m3555j220k5161k6581j6014p5709m2241
7147a29933k8410j9717J68607J49210J10963m3336j11847j29608J1371M0829J06239
$$ y = [36305, 97420, 119756, 132907, 233985, 253615, 89733, 47839, -59627, -54640, -171261, -282658, -157873, -58024, -75853, -157134, -106594, 34879, 114062, 99039, 27089, -21160, 22178, 55683, 116645, 56215, -9349, -27847, 105086, 178023, 145690, -2106, 7970, 40580, 93238, 87459, 6192, 11222, 63004, -29364, 148718, 282362, 203202, 279071, 168089, 15847, 11817, 85745, 4398, 414, 62334, 152904, 145062, 119770, 96162, 13237, -31887, -27800, 31582, 70417, -21192, -30894, -18925, 41494, 50666, 34897, 99586, 68551, -86407, 34958, 127914, 122290, 10889, -3190, 52079, 100548, 56993, 55773, 30612, 4031, -11983, -87692, -129933, -158343, -178060, -9453, 139757, 250720, 207384, 95537, -34071, -22700, 18129, 124368]
7136A24368o1237j20850J8906J49080O9059J07952J02496k9634j50662j04727
7126A04751j40369j26108p3574J30204L0856K3481K65233J7659N4083K2405o7264
7115B41357k48858q6739j5206l8006J62413P2271p788m375N4049o125j7131j4172
7103I1690j16284l8630L0289j2996N3815n8797j9065J3656N5070P4614K714q1688
7091e612n2906n0348O4154l0507R5819N2111N4821O6452j60492j26465L7353L7457
7079a8163K1831J498J15866k2581o4096j7249J6253j6982j5701n085M0134l7259
7067a534j2292O6694R282O8083Q5196n8115j06058o4088O126j1323l4144p9648
7055a31821o583J25728P8499k6637O4806J8651l5946o6287r7143q7726M0948L8612
$$ y = [124368, 63131, -57719, -38813, 110267, 179326, 287278, 389774, 360140, 209478, 104751, -35618, -161726, -235300, -105096, -74240, -50759, 214474, 232133, 286216, 308621, 241357, -7501, -94240, -109446, -147452, 14961, 87232, 79444, 75069, 129118, 122993, 105862, 91690, -24594, -63224, -32935, -45931, 7884, -50913, -69978, -56322, -1252, 73362, 76076, -5612, -58518, -108866, -44712, -75219, 20600, 72711, 127532, 193984, 33492, -92973, -55620, -18163, 3668, 5166, 121032, 98451, 34355, 17106, 33359, 16377, 676, -4409, 35725, -1534, -13826, 52868, 62150, 130233, 215429, 157314, 51256, -12832, -6706, -18029, -52173, -131821, -138404, -12676, 65823, 39186, 103992, 122643, 86697, 20410, -76733, -164459, -123511, -84899]
7043h4899P1168P6662K1887q8226o9554o3723m1127L4841q155Q288K7222j02657
7031b18273p2758M2293P9173l8181N6217q4161p4376O02R9880J55058M137r877
7019f0266O0559o0042L2273O873K426Q4848Q648Q4168R685M2326o2709n3513j04526
7006i250j02141K5948J60719P3362k0708L6814j7007n0584j2239j3444m9733j19588
6994i7851J71541N3362k5114k1031P644p905K3277J95690J13697O2712m2368M9340
6982D82994J37292J76411J52672K02918O4087j38017k17700k10545k25986p6274
6972C47852j22844m6958o2324j12524Q869O0650J05431n3864j28357r2404l0724
6961a27197J31914J05133j3250j4213j58345k671R3661j0310l2099j56405L0781
$$ y = [-84899, -13731, 62931, 84818, -3408, -72962, -136685, -177812, -142971, -151126, -142838, -115616, -218273, -291031, -248738, -169565, -207746, -151529, -235690, -310066, -309464, -209584, -54526, -50389, -60266, 293, -59749, -27476, -20603, -18177, 66671, 75319, 159487, 169172, 211498, 148789, 95276, -9250, -111391, -85443, 75276, 148638, 127930, 164744, 147737, 97153, 84914, 71470, 21737, -97851, 73690, 127052, 101938, 80907, 88551, 80646, 103923, 299613, 413310, 476022, 433654, 482994, 620286, 796697, 949369, 1152287, 1216374, 1078357, 860657, 650112, 424126, 347852, 225008, 178050, 115726, 3202, 12071, 72721, 178152, 124288, -4069, -96473, -127197, 4717, 109850, 96600, 82387, -75958, -78629, 15032, 4722, -27377, -183782, -153001]
6950a53001P8416J40205j3988l8172J16880J8991j25726k8718R2950l5191p5465
6939b2819m6861M0882k8187o0613Q6706J02972p186Q708Q55J46997J30000p4523
6927B76931j3185j6760j12442n1711j50404p5528J13393L4554k4164p9576l9679
6916a38571J10481J90193J09783p2367l3315r5198J8626M0711m7262K2810q562
6905I7329p8343J3963m3250k8615Q2920P0786j24284j14664m629O9265N368p8349
6893a32503R3357K3711Q411K1630p3945J5046M5877K7363J15857J0026j29603
6882B5227q1527M9145O8630J6993K3083m4700m6540N9284J8923J856l4446J136
6870E7064N4520K44116M3819j31560k66637j21409P3726m7738n314L25713Q5284
$$ y = [-153001, -74585, 65620, 51632, 13460, 130340, 149331, 23605, -5113, 87837, 52646, -22819, -69680, -28798, -56985, -117598, -30892, 72080, 64894, 73602, 74457, 221454, 351454, 276931, 263746, 246986, 134544, 82833, -67571, -143099, -29706, 4848, -19316, -98892, -138571, -28090, 162103, 271886, 199519, 166204, 71006, 89632, 130343, 83081, 105891, 97329, 18986, 32949, -10301, -38916, 44004, 114790, -9494, -124158, -128787, -59522, -54154, -132503, -39146, -15435, -7024, 14606, -59339, -44293, 1584, 28947, 144804, 154830, 25227, -56300, -7155, 61475, 78468, 101551, 56851, 10311, 69595, 88518, 90374, 55928, 57064, 111584, 355700, 399519, 267959, 1322, -120087, -46361, -94099, -99413, 226300, 311584]
6859C11584m8383j52872j38788P396J46506O2339k2881l1964j22136r21l2475
6848b2595l5613N6607l4478Q405m8396l9993L3046O0498n3562q1500J33125k35
6836b4691L4607k2116J53185l7398j26689j06294M1779K3576J06898j4826j51943
6825a23912Q576K7059J76183m7j23095o3022L2252M0265L4824P0276O6351o2801
6813H2909L9609j51931j92504N2350J24750J64077m7610o2263j75882j8451j0642
6802a95588L0275o5158m8275J0313J52841J21178j3891n1393K290k1043N0675
6791b7776p8563K8587o4030j66832J07700Q2267J01965m3236q2692R5847O5505
6780A8742j37514j06406N0474J54357Q3733L9315o085k1791Q6361l106j6175n8087
$$ y = [311584, 263201, 110329, -28459, -21063, 125443, 187782, 164901, 132937, 10801, 9880, -22595, -58208, -1601, -36079, -27674, -76070, -116063, -83017, -22519, -76081, -157581, -24456, -24691, 9916, -12200, 140985, 103587, -23102, -129396, -87617, -64041, 42857, 28031, -123912, -115336, -88277, 87906, 87859, -35236, -98258, -66006, -25741, 9083, 79359, 145710, 82909, 122518, -29413, -221917, -169567, -44817, 119260, 71650, 9387, -166495, -184946, -195588, -165313, -230471, -278746, -268433, -115592, 5586, -8305, -59698, -57408, -78451, -27776, -106339, -77752, -141782, -308614, -200914, -118647, -16682, -59918, -142610, -46763, 18742, -118772, -225178, -174704, -20347, 63386, 102701, 96616, 74825, 161186, 158080, 141905, 83818]
6768H3818m9567N4813o9834j57158r499N602J86112j8687k05569p3085j5497J42972
6756a25579J75899P8741J43542J22337j0439r5349M1365k2920n8705r1102R3088
6745B50878M2171J491m2736r1498K0082M5897K7189j44845j16342R6241K14463
6734C02991K9265l6401m5920j54234k09237q9373P5829J33952M5235M6160k5494
6723G2773l4446R8672k5903R3449R6434q7476j05058j6713l3748J8555P3068p215
6711A42392q3376o4202p5416R4429K28786R6472n9013K0077j13529l4792Q9012
6700B40840J85063n78o8077r7526o9340j5203j43838K1797K17107J30492N7170
6689D57907j95467j46709Q6074J7766l3964m8322R9994M1930n5192j06905j23852
$$ y = [83818, 34251, 89064, 19230, -137928, -147427, -141825, 44287, 25600, -179969, -253054, -268551, -125579, 50320, 129061, 272603, 394940, 384501, 289152, 330517, 307597, 248892, 157790, 250878, 293049, 294540, 251804, 160306, 180388, 226285, 253474, 108629, -7713, 88528, 302991, 332256, 295855, 249935, 95701, -113536, -202909, -127080, 6872, 52107, 98267, 72773, 38327, 136999, 111096, 204545, 300979, 213503, 108445, 91732, 57984, 76539, 149607, 142392, 59016, -5186, -80602, 13827, 242613, 339085, 280072, 300149, 186620, 151828, 240840, 425903, 425325, 357248, 259722, 190382, 175179, 31341, 53138, 270245, 400737, 457907, 262440, 115731, 201805, 219571, 185607, 137285, 237279, 279209, 224017, 117112, -6740]
6678f740K3250O6373k7994Q8939K8299O3164M0524Q9357M6336q3212k1566J19786
6666D26516J61333j01697j36924r1228J1178J9336J06249k2314J41438J68402
6656F82289m8142J2834J72839O9434o8347J12594Q9528j47746q2341o3329P3905
6645H03518N7527j26581M4192J05172O3029P2740J06258K47752J06710K4105J92848
6634A697270J71408J89076L81205P37056J067258J734101K829970J640063j891799
6625H555608k276799j325687m16425K60671M33128M46440N53026R06296J237843
6616H374101K024954K944837M031305N097506O646674J0289919J9234959L9518036
6608I8162291P8574923J16974986L3869810r9554501r8327876n3575196k5572062
$$ y = [-6740, 16510, 82883, 54889, 143828, 172127, 235291, 275815, 365172, 411508, 328296, 306730, 426516, 587849, 486152, 349228, 258000, 269178, 288514, 394763, 372449, 513887, 682289, 634147, 646981, 819820, 889254, 820907, 933501, 1023029, 875283, 792942, 729613, 803518, 861045, 734464, 778656, 883828, 946857, 1019597, 1125855, 1373607, 1480317, 1504422, 1697270, 1868678, 2057754, 2438959, 3176015, 4243273, 5977374, 8807344, 10447407, 8555608, 6278809, 4953122, 4536697, 4797368, 5230496, 5676936, 6229962, 7136258, 8374101, 10399055, 13343892, 17375197, 22472703, 29119377, 39409296, 58644255, 98162291, 176737214, 293712200, 327582010, 228027509, 129699633, 76124437, 50552375]
6601E0552375j2983527p609920n643609m803191m101079l085904k184308j625390
6593H515447j329057j115130n02806l44648R4964M84146J429679K470621O16966
6584A0320182k629469k676622j563625p85090m63879m40877k23655j19662j10900
6575A306403k21980k00562j93927J4459J91858O1964j83951j81105n2889r9242
6565D41028n5406l9757p3134J16985L3999n2389J00204j3515j7653o1566j18716
6554B60080j48785j2021r8425n8101O9673R1591j0572N355k90814j1605M4794
6543a58830l2748M0984J83911J53823R2375j14538j70807o2657M1812L3963o4388
6532e7100j12617j54323J52633J99080J25278o6733K0245q6595j25741o9535k4236
$$ y = [50552375, 37568848, 29958928, 24315319, 19512128, 15411049, 12325145, 10140837, 8515447, 7186390, 6071260, 5568454, 5223806, 5318770, 5802916, 7232595, 9703216, 10320182, 7690713, 5014091, 3450466, 2665376, 2201497, 1760620, 1536965, 1417303, 1306403, 1084423, 883861, 689934, 704393, 896251, 958215, 774264, 593159, 540270, 441028, 385622, 345865, 272731, 389716, 423715, 371326, 471530, 458015, 440362, 378796, 260080, 111295, 99274, 849, -57252, 12421, 104012, 93440, 98795, -192019, -203624, -158830, -191578, -150594, 33317, 187140, 279515, 164977, -5830, -68487, -26675, 7288, -57100, -169717, -324040, -171407, 27673, 152951, 86218, 106463, 19868, -105873, -175408, -199644]
6521a99644K9481m1457L8626m5774Q006J25120K26594Q2442j52429j66775j28889
6510b24699N7045Q6436R2959p35p7791j06189R2203Q4765J16310j35671q6635
6499a02002n043N5855J09453j03016j45986r3148J15196M1764p369l7327L5767
6488a35856m6698p7974J02869M5132J48421N9249N1725O7111m9076j81281j46306
6477a62684O9720Q1381L5368J67793k9206l9305l9505r750M4222N8140j42347
6466C3827R4502o5953j2421J7091L3340p7571j37711O9353J33101J01900Q0695
6455B70153J82150P7466j47947j43095k38750j46468n8477J56758j6453L8555
6445b6108k2167j39520J9971R6210O1749k3720j1733n5429n4834M7402j6376M891
$$ y = [-199644, -170163, -211620, -172994, -218768, -210762, -85642, 140952, 223394, 70965, -95810, -224699, -167654, -81218, 11741, 11006, -66785, -172974, -80771, 3994, 120304, -15367, -102002, -107045, -51190, 58263, -44753, -190739, -283887, -168691, -126927, -134296, -171623, -135856, -182554, -260528, -157659, -112527, 35894, 95143, 146868, 213979, 164903, -16378, -162684, -92964, -11583, 23785, 191578, 162372, 123067, 83562, 73812, 118034, 176174, 33827, 128329, 62376, 49955, 67046, 100386, 22815, -114896, -45543, 87558, 189458, 270153, 452303, 529769, 381822, 238727, -23, -146491, -204968, -48210, -64663, -26108, -48275, -187795, -167824, -71614, -9865, -33585, -45318, -100747, -155581, -108179, -124555, -119664]
6433a19664K4765N5666n5527J63039K2199j28608j58612N6772N4505l0931L6087
6422h0309n078P3956O698l9685K0854k262l7646j4925J05223M4827M9501j31342
6410a0188j62197O7655R2804P1788N6093N3737O9085o4843k6421n5815j10989
6399a9291o5513n7682m0545j10421j3062J13528J18551O0160j8830K5684R1685
6388H4264J53451L4838r1737j6762M5344O0966r4562k02830J6324O4641r6105
6377d2168m8456Q0677J52940l8615n5779l761j2210M70n880N3618J00488P2243
6365B53567n1642l2973r9972p3262J58687m0924j48814j8836l8871p8516J23207
6354d8349J19351o495J8903j08397r0942O6494l8273p832O1153p505J4100N0936
$$ y = [-119664, -94899, -39233, -94760, 68279, 90478, -38130, -196742, -139970, -85465, -116396, -80309, -85387, -11431, -4733, -44418, -23564, -25826, -63472, -78397, 26826, 71653, 121154, -10188, -172385, -104730, -11926, 59862, 115955, 169692, 238777, 173934, 147513, 91698, -19291, -84804, -142486, -183031, -293452, -306514, -192986, -74435, -14275, -33105, -7421, 84264, 237715, 272553, 180816, 164054, 209398, 270364, 175802, -27028, -10704, 53937, -42168, -90624, -9947, 142993, 104378, 48599, 44838, 32628, 33098, 27218, 80836, 181324, 253567, 201925, 168952, 68980, -4282, 154405, 113481, -35333, -54169, -93040, -171556, -48349, 71002, 64507, 83410, -24987, -115929, -49435, -87708, -95540, -34387, -41892, -27792, 23144]
6342B3144m7563J4843M4784j45668j39316q0052J1761J30834N3303N4174l7248
6331a17004J12396j0593j6942p6956r9497K7713J4862o7712k0346k0524J07113
6320a67490l6923r6342J710J35037J67551K8030n6894j19520j31286r2524K716
6309c65935J01013J67164Q9822M9989o2707L6177j20003K522J24215P3102J5411
6298A10770q0630J4551R7205o3121j64605r6923N7990k4590K1155j2908j7655
6287a58761m8102P6922j6183r0998m1315M1708J66333J11l7505j1376O1777k3730
6275h1119J8569K18780M3271r9211m4883l4404L7277J33798R0642p4710j21058
6264H6952j45548J3216J17753K9238j6902m3826j32002O3722P6531q6373k9880
$$ y = [23144, -24419, -9576, 35208, -110460, -249776, -329828, -318067, -187233, -133930, -79756, -117004, -4608, -15201, -32143, -109099, -208596, -180883, -166021, -233733, -254079, -274603, -167490, -204413, -300755, -299045, -164008, 3543, 31573, -25321, -144841, -276127, -368651, -365935, -264922, -97758, -7936, 42053, -20654, 15523, -104480, -101958, 22257, 95359, 110770, 30140, 44691, 141896, 78775, -85830, -182753, -124763, -149353, -128198, -141106, -158761, -206863, -129941, -146124, -237122, -278437, -236729, -70396, -70285, -107790, -119166, -57389, -81119, -62550, 156230, 199501, 100290, 55407, 21003, 58280, 192078, 282720, 208010, 86952, -58596, -45380, 72373, 101611, 84709, 40883, -91119, -27397, 49134, -37239, -67119]
6253f7119L5486n0188q6321O7014L1069R4562L8011J20717k0554r4778j74233
6242a06334p049Q2127Q1362L0370J58300k8611q6073J23057Q9842R4010K25097
6231F56098L98256J03328j20038j12243k46404j57503l0803m9109q1270k10498
6221A49814k01174N6123J39087o8371p9932L1153K301k040N7865o3366k7583P768
6209A645p5647K0959J10654N204N6204o9133o0294o3724N8850J41867M1240o9261
6197I8564j1969J19053l0182Q326j42980j07851J48062k4107j2914R3640j09705
6186B7937Q3932J64398j55495k24756M3488j2212j2659n1527J8387k5882J23753
6175b0636J13462j15531n3676Q7972j1152m9330O0161R5314j9455n4431l7764
$$ y = [-67119, -31633, -81821, -168142, -101128, -70059, 24503, 62514, 183231, 162677, 67899, -106334, -113383, -31256, 50106, 80476, 238776, 210165, 124092, 247149, 336991, 431001, 656098, 1054354, 1157682, 1037644, 925401, 678997, 521494, 490691, 441582, 360312, 149814, -51360, 4763, 143850, 75479, -4453, 26700, 29001, 26961, 84826, 21460, -6123, 1645, -74002, -53043, 57611, 62815, 119019, 49886, -10408, -74132, -15282, 126585, 167825, 98564, 86595, 205648, 175466, 183792, 40812, -67039, 81023, 56916, 44002, 137642, 27937, 111869, 276267, 120772, -103984, -60496, -72708, -85367, -136894, -118507, -144389, -20636, 92826, -22705, -76381, 11591, 439, -48891, 11270, 106584, 87129, 32698, -5066]
6164e066P263j65709o0276J60204J2291k1625o7835j3854p2109P0956N739j1003
6152a61024q6538P9203J67327L3538q1193k4495M2818K00900n897q0561o5297
6141A8781M6675K0497j44422j29806j16053R6103J13860r4654j16539O499K3503
6130b75556J74304J10462J8662p51j1428n1037J14840Q0136j55506j9403K2202
6119F925P6658M559j05090l6761O0308K4523j43795M3977Kj6287p03M1695n8379
6106a02368o6788J32337k5832j21328N0241J8078q9747J5154J74996M7302m038
6095B8007L4558l3561n4403j33852k5044O4236j73595Q5438J76463J79732P6713
6084B24692q0978k796k6140o2224m412J39200O7184j04773j86490j04395J50809
$$ y = [-5066, 2197, -163512, -223788, -63584, -51293, -72918, -140753, -154607, -226716, -155760, -150021, -161024, -247562, -168359, -1032, 32506, -48687, -73182, -30364, 170536, 164639, 84078, 18781, 65456, 85953, -58469, -188275, -304328, -208225, -94365, -189019, -305558, -299059, -275556, -101252, 9210, 27872, 27121, 15693, -35344, 79496, 159632, 4126, -15277, 6925, 83583, 88142, -16948, -53709, 6599, 31122, -112673, -68696, -68694, -84981, -85684, -43989, -102368, -169156, -36819, -62651, -183979, -133738, -115660, -205407, -190253, -15257, 32045, 28007, 62565, 29004, -25399, -159251, -184295, -120059, -293654, -208216, -31753, 147979, 224692, 143714, 140918, 114778, 52554, 48142, 187342, 254526, 149753, -36737, -141132, 9677]
6073I677J25994j6477p4001k6458P7992Q5018l0567j29388m5660l2976j930M5763
6061a3013O0684p0526p7756J02157n1494j11200o3608n7320J3751J9513J36151
6050a12661K0766J43906J31532K7136j07058q7801m8924r316j8915n938O3477
6039c796R4850m8307p9508k0779J6319M5938J32127J7437r0240Q8890n3381j34443
6027c4893n0146N433K7577M2452o7600J11280K4691q5579k1743J1935J37904p7392
6015B3919r1976j14346M0725J15773l0978q2776O5224l1458n5713J28793Q0531
6004D7718Q495J8292j9450J2881j14936l8301J06154K4581q1728n0114M9382Q0871
5992D3845j37155l8478p285J76490N2008q9057r280l7550L600Q3581J70065j31891
$$ y = [9677, 135671, 119194, 45193, 18735, 96727, 181745, 151178, 21790, -23870, -56846, -58776, -13013, 47671, -22855, -100611, 1546, -49948, -161148, -224756, -282076, -268325, -248812, -112661, -91895, 52011, 183543, 210679, 103621, 15820, -33104, -42420, -61335, -67273, -3796, 91054, 42747, -36761, -57540, -41221, 4717, 136844, 154281, 64041, 152931, 99550, -34893, -85039, -79606, -52029, -9577, -77177, 34103, 58794, -26785, -48528, -36593, 101311, 23919, -68057, -182403, -141678, -25905, -56883, -139659, -74435, -105893, -161606, -32813, 47718, 56213, 74505, 55055, 67936, -47000, -85301, 20853, 45434, -36294, -86408, -37026, 43845, -93310, -131788, -139073, 37417, 89425, 368, -8912, -46462, -42862, 40719, 210784, 78893]
5980G8893r3445j16985m3034n8352K3241P6611N4781J6654l5501p1403m0568N037
5968b04071J35847K59424j18209k06650L6245J600J0059l5077M0862M7454m0016
5957g2532M7274j2844R0173N0169Q8126k8342K2560R2257r7866q0145q7019J9707
5945C1518J05088R9060L8420k19287j49712n1584J6343J44155j2444q7494P7845
5934h092m291P5704o3738j36090N4439L9148n332J3043J20060n6683O5447k1959
5922G1656N613q5941L7983J1668o9051J3202j191N6983j9895m6198l0160j27076
5910a82407p4292J34823K610O3677J0318P3255J67012L2933j14964j51457k9073
5899f7565L2260J7835N306j01109N0894N8610M920n7661j74992n1909P0674J47558
$$ y = [78893, -14552, -131537, -174571, -232923, -209682, -133071, -78290, -61636, -97137, -168540, -209108, -204071, -68224, 191200, 72991, -133659, -97414, -95814, -85755, -120832, -79970, -32516, -72532, -25258, -38102, 52071, 102240, 190366, 162024, 184584, 276841, 178975, 98830, 11811, 31518, 136606, 235666, 274086, 54799, -94913, -146497, -130154, 14001, 1557, -85937, -8092, -12383, 63321, -417, -136507, -82068, -42920, -48252, -35209, 84851, 28168, 93615, 71656, 77269, -8672, 29311, 40979, -28072, -14870, -16061, 40922, 21027, -25171, -55331, -182407, -256699, -121876, -119266, -55589, -45271, 27984, 194996, 227929, 112965, -38492, -67565, -35305, -17470, -12164, -113273, -62379, -3769, 1151, -56510, -231502, -283411, -212737, -65179]
5887f5179M1150R0108q5164j36507J3450o7898n8713O8631N6750J05965q260R7232
5875E1565K2595j37062r4919p6240O3149N0756j2022P2615J02222M9144k6484
5864F5319m4792N6111R8784p7686j21132j4987K1953R7931J74479k0272q8842
5853A46866j2442j17862m787J75578p4309j0702m5236r1917M0314n632k14700
5842b14829q4722J2123O5486P6495N1952O7442m8840r0883n9633J9344m9506k4392
5830b79963L9323N1502J06789L3634o2419N7391J66689J34283m6258j11486o1047
5819B8438j5606n7636M5831J62132J34530j02519o7810O5234p6906o9216l2329
5808A4143Q222J9676m6482m7434m51r0984q5827N5066O6442r944M1787K9443l2307
$$ y = [-65179, -24029, 66079, -19085, -155592, -142142, -210040, -268753, -200122, -143372, -37407, -45667, 51565, 74160, -62902, -157821, -234061, -170912, -120156, -132178, -59563, 42659, 91803, 65319, 20527, 76638, 175422, 97736, -23396, -38383, -16430, 81501, 255980, 235708, 146866, 134424, 16562, 11775, 187353, 113044, 102342, 57106, -34811, 5503, -129, -214829, -299551, -287428, -221942, -145447, -93495, -26053, -74893, -165776, -225409, -206065, -255571, -279963, -240640, -189138, -82349, -48715, -111134, -53743, 112946, 247229, 200971, 89485, 28438, 12832, -44804, 1027, 163159, 297689, 195170, 127360, 192594, 115688, 46472, 14143, 22365, 42041, -4441, -51875, -52326, -143310, -229137, -174071, -107629, -117573, -75786, -46343, -78650]
5795g8650K9295n6606J9229l0002n9931R5119P0500Q5696K2023q0408L4767O4515
5783A15547q0327M3371P1078j02161j13405Q6273J14420J7042l8066j56186N94
5772d1820j25708n6313L7939M0916Q5982K5485j06797q1624l6570K1565J07481
5761a29464P984M2770P2222J28038n1882p1239k4303J3830K2028J41366j18089
5750C3261k02191M751p0044l9730J05974J97231J28826j19371j09683l9725J3611
5739i7090J16820O822n0215M5209M3084j74842p3326J4084O848j9396K8109J16161
5727c7732L7363o3790L1869l0563l2085P2574k4116n8824j6228N3933O7570q3145
5715h3174j62276k9243J27605M0336M2653j1571O6902J02470k6304J8851r9891
$$ y = [-78650, -49355, -105961, -86732, -116734, -176665, -81546, -11046, 74650, 96673, 16265, 51032, 115547, 35220, 78591, 149669, 47508, -65897, 20376, 134796, 151838, 113772, -42414, -41820, -167528, -223841, -185902, -144986, -59004, -33519, -140316, -221940, -258510, -236945, -129464, -121480, -78710, -6488, 121550, 69668, -1571, -25874, -12044, 9984, 151350, 33261, -168930, -164179, -234223, -273953, -167979, 29252, 158078, 38707, -70976, -110701, -97090, 19730, 26552, -23663, 21546, 64630, -110212, -183538, -169454, -162606, -182002, -153893, -37732, -369, -64159, -32290, -62853, -94938, -22364, -46480, -105304, -121532, -67599, -29, -83174, -245450, -274693, -147088, -106752, -64099, -75670, -8768, 93702, 67398, 86249, -13642]
5704a3642j67390q1941J35735J05563k1304K0336p1560M5702n62p489m6r9981
5692a56579l0371q6293K3586N5238Q8476N7314p1585Q6047k4961q8800M5063M7077
5680e5788n4188J3010l00L0435J3122k0455j04702q7847O0016N9280o9213n5894
5668b72524R5441M9774R806O5129J44796p8114k16853j3200K3699J11994L2268
5657d7784M7741j7077m4360P0190M1297j13582n6960k13J21234L6750O5437n0785
5645E1888m6540O1986j93651M383k4725Q0945J5195Q5011m5053j15325j43796
5634b69682o0843M1128J38203J98386L8280o9697j18639J6747K9186k3107J21657
5623D1619N0607o8481r3593J442m6536m2050j5768K07621P2387P4087j1014j16383
$$ y = [-13642, -181032, -262973, -127238, -21675, -42979, -22643, -94203, -48501, -49063, -56552, -56598, -156579, -186950, -273243, -249657, -194419, -105943, -48629, -120214, -34167, -59128, -147928, -102865, -55788, -109976, -96966, -97266, -66831, -53709, -74164, -178866, -266713, -206697, -147417, -216630, -272524, -177083, -127309, -117503, -52374, 92422, 14308, -202545, -215745, -192046, -80052, -47784, -43, -17120, -61480, 8710, 50007, -63575, -120535, -120748, 486, 37236, 102673, 51888, 5348, 67334, -126317, -121934, -146659, -65714, -50519, 34492, -10561, -125886, -269682, -330525, -289397, -151194, 47192, 85472, 15775, -102864, -86117, -56931, -80038, 41619, 92226, 23745, -69848, -68406, -114942, -156992, -172760, 34861, 107248, 181335, 170321, 53938]
5611E3938q2458o6783O387M0394n4435Q1548j5188j7770J6824k21961Q9149Q5214
5599h5141J4180J7132m8377L6743K440r2035J28749L2923j28331j61064N8401
5588b24380q6530p2740N3272J05475J30719K1291P9346l4000q7599J1274R604
5577i4268l2769p645j5402R5080J11112p0666j22423l5340M1222j2485j13773
5566b57357j38418L9000J24789J25239L7534m3066N5378P3616o9149j72615Q3622
5555a41427L849r2045k2061J01076J32371J7846j9273j64371L9625N1669q63q9513
5543a83117K0588M5634L861n0611N4412j1068r321J02752P4794p7986J8175K9560
5531A7673J20164N442j4200N2011J9692p0393M3623o112L375j10172m1877o8807
$$ y = [53938, -28520, -95303, -88916, -48522, -102957, -21409, -36597, -54367, -37543, -259504, -170355, -85141, -70961, -53829, -102206, -65463, -63023, -155058, -26309, 6614, -121717, -282781, -224380, -310910, -383650, -330378, -224903, -94184, -72893, 6453, -27547, -115146, -103872, -94268, -127037, -134682, -150084, -55004, 56108, -14558, -136981, -172321, -131099, -143584, -257357, -395775, -356775, -231986, -106747, -69213, -112279, -56901, 16715, -52434, -225049, -141427, -137578, -229623, -251684, -150608, -18237, -391, -19664, -184035, -144410, -92741, -93604, -183117, -162529, -116895, -113034, -163645, -109233, -120301, -129622, -26870, 47924, -30062, -11887, 17673, 137837, 143279, 129079, 181090, 200782, 130389, 174012, 167900, 171275, 61103, 19226, -49581]
5519d9581O518P987l8282P2412l6283L3776n2495p8224J9428R1807q1038j27576
5507b31551O1047K03210L1749j63709k2532O2484O0525k4874P135R1506N0769
5496A25759M0521M2852p78j11002j47851M7344O9795o7170P081p025j5345O9606
5484E3787L9675J2277p9888n2103j69644n2807J23298K3371M501j22862Q5958
5473a34437k3055M0295J61557N9410n571j09130n2222p206P6774J76697N6908
5462B40020o3344j65630L1093P8015k4869j1448J14322r3574P9407m1662j26371
5451A5959p8038j8307p7067J36741K10411R5310j78685l7585j0901N9099l9475
5440G7462m5056O6127j63338k0822P0144q814k0163l9870Q2691l4272J7391M9100
$$ y = [-49581, -43063, -35076, -73358, -946, -37229, -3453, -55948, -134172, -114744, -22937, -103975, -231551, -170504, 32706, 64455, -99254, -121786, -59302, 1223, -23651, -16516, 74990, 125759, 166280, 209132, 208354, 97352, -50499, -3155, 66640, -530, 6551, -474, -15819, 53787, 93462, 105739, 25851, -26252, -195896, -248703, -125405, -102034, -97533, -220395, -134437, -157492, -117197, 44360, 103770, 98199, -10931, -63153, -70359, 6415, 183112, 240020, 176676, 11046, 42139, 120154, 95285, 83837, 198159, 104585, 183992, 142330, 15959, -62079, -80386, -157453, -20712, 189699, 285009, 106324, 68739, 57838, 116937, 77462, 32406, 98533, -64805, -85627, -15483, -24297, -44460, -84330, -1639, -35911, -18520, 30580]
5428C0580J20735J12103q2569l8575k3784q2248n3036O2333N830j0023J5155J3881
5416G0382J1326j0844P824M6908k2559K0811r6894N3638K01098j30207k80905
5405a29422p8459Q4751O5349K4141M3609J37395p0018j71003j03386K7935K8666
5394a40442Q608J98887M831k0990J09084l5843l6076l4767M7401O598l7959J6353
5382H5685n3704r0875j02090k6670l0537M9875Q8969n0939P7370j1277N3534j6017
5370b6676j686m6756m073J51536p7133j6817Q3786P3054j09081j35716l3090m4203
5358a86855J10633J0875N1647K0196j67594J1636K9817L3776L1296J03512m0496
5347H443j51430q0804J8209j112j8895O0925q8361p9979Q4414Q9186N0116n25
$$ y = [30580, 151315, 263418, 180849, 142274, 118490, 36242, -16794, 45539, 51369, 41346, 56501, 70382, 81708, 70864, 78688, 125596, 103037, 123848, 26954, 80592, 281690, 151483, -129422, -207881, -123130, -57781, -33640, 9969, 147364, 77346, -93657, -197043, -169108, -140442, -131834, 67053, 71884, 50894, 159978, 124135, 88059, 53292, 100693, 107291, 69332, 85685, 31981, -58894, -160984, -187654, -218191, -168316, -79347, -130286, -52916, -64193, -10659, -26676, -28362, -75118, -79191, 72345, -4788, -21605, 62181, 135235, 26154, -109562, -142652, -186855, -76222, -65347, -13700, 6496, -161098, -149462, -119645, -85869, -54573, 48939, 8443, -142987, -223791, -205582, -206694, -225589, -164664, -253025, -333004, -248590, -159404, -109288, -109813]
5335a09813J83864J52671q6577j57050j33189P885M8374R4606L270J7001O8913
5324H9955m3814j4577J46544k4735k7673j03100j34005n6986J22792Q6850P6030
5313A17281q2107j53407p9458L8490j6995l5855M6580p1387m069L3554Q5049J21190
5301a134K8709M6794K7631k5438l8114j838R8536p0684o2484n4433j35616R9678
5289h8393J83882j28836n5085N6261O1360P0720N2466m40P111p6907O6146m1167
5277A07118L793O0936L2362j19886j14044p4911N0145J4074Q7053m9004N450O590
5265I676r3272k03469o4671J17902J07474p9842K9399M4887J0576Q3692L4690
5254b958p2456o1857J62117j4647o9729Q6110o6923K6201L9933Q9431o2806J48837
$$ y = [-109813, 74051, 226722, 140145, -16905, -150094, -142209, -93835, 771, 4041, 21042, 89955, 46141, 31564, 178108, 153373, 125700, 22600, -111405, -168391, -45599, 41251, 117281, 35174, -118233, -197691, -159201, -176196, -212051, -165471, -236858, -240927, -207373, -122324, -1134, 27575, 74369, 102000, 76562, 38448, 36610, 135146, 64462, 1978, -52455, -188071, -88393, 95489, -33347, -88432, -32171, 29189, 99909, 152375, 151935, 159046, 82139, 148285, 107118, 110911, 171847, 204209, 84323, -29721, -104632, -54487, -40413, 46640, -2364, 3086, 9676, -83596, -287065, -351736, -233834, -126360, -206202, -176803, -131916, -121340, -37648, -2958, -75414, -137271, 24846, 10199, -59530, 26580, -40343, -14142, 25791, 115222, 52416, 201253]
5242B01253n7933q9767Q1946J6150k10496j41663N1899M0052L8964M4696R4065
5231F9166J30032k3415j3628j41335j22925M6749M5984L5694j82394o5038J22868
5220i8242O6570M2300K1909q0639j8271K4821L2761n1716r732O9422J73181n6949
5208A15415k038O7636L4608J35053k25675o1335J09076R6759k45356r9287K2167
5197e2977J4603L7294m2228k0031j8911P3289j220P4730K1544k20450j00066P5155
5185a59268M9041J2428Q1275l9158k6506J89497L4420q6396j5518L9485J9031
5174I8331R2108m0412K5089k5096R9372L5788o8013j32830j03177j79019n5036
5163b52895J02035P5332Q3284j1388K5768M219n4850Q9330P6616j21250m4489
$$ y = [201253, 143320, 53553, 135499, 151649, -58847, -200510, -148611, -108559, -69595, -24899, 69166, 199198, 175783, 162155, 20820, -102105, -55356, -9372, 26322, -156072, -221110, -98242, -31672, 10628, 32537, -48102, -66373, -41552, -8791, -60507, -70239, -817, 172364, 115415, 113377, 181013, 215621, 350674, 124999, 63664, 172740, 269499, 24143, -75144, -52977, -38374, -1080, -43308, -63339, -82250, -8961, -10181, 64549, 86093, -134357, -234423, -159268, -110227, -97799, -16524, -55682, -82188, 107309, 141729, 55333, 39815, 79300, 98331, 190439, 150027, 175116, 150020, 249392, 285180, 217167, 84337, -18840, -197859, -252895, -150860, -75528, 7756, -3632, 22136, 26355, -28495, 60835, 137451, 16201, -28288]
5152b8288L2715n0460o4630k9354k1415J57501K4010l5915J1873j72830O7345
5141a09448M0237j32282J06963L9422Q6135M0244q3321p1818K8353L5160K5674
5130E319r8638n3737L016K1791j19097J50996J39188L2491k8465M0701k1167q1316
5118h918n833o9770m9627m2544j3191n6910J47032J18242K0747N69o417k0555
5106A2825O481J04496o2061M7840P9104m5766M3543k6755k6351j41097j12677
5095a20418J50811Q3227N9663O4069K3133n1560j27544j35861N5236J0042j61872
5084a51074m4671J29616Q5162j33108p7484P9667L00004k232p6888K609Q3615
5073A95216j34409o7292K6456o655l0096J00508O0274M2731j71400q2926J23434
$$ y = [-28288, 4427, -46033, -110663, -140017, -161432, -3931, 20079, -15836, -3963, -176793, -109448, -69211, -201493, -94530, -55108, 31027, 71271, -12050, -83868, -55515, -20355, 5319, -93319, -147056, -144040, -122249, -241346, -90350, 48838, 81329, 52864, 93565, 72398, -8918, -14751, -84521, -134148, -176692, -189883, -246793, -99761, 18481, 39228, 39797, 33380, 12825, 19306, 123802, 61741, 109581, 188685, 142919, 186462, 159707, 133356, -7741, -120418, 30393, 113620, 173283, 237352, 260485, 208925, 81381, -54480, 756, 10798, -151074, -195745, -66129, 19033, -114075, -191559, -111892, 188112, 185880, 108992, 111601, 195216, 60807, -6485, 19971, 13316, -16780, 83728, 144002, 186733, 15333, -67593, 55841]
5062E5841J78836J7210j08720r2686P5300n9684j53479N1742J73769Q5877k6963
5051A97043M4825J5178m2941o7917o0351j8426j9341R2368M8866J3723j18822
5040H4205p4822m5746j87473n5128P8455K57144M9907j17680j14427p1747J45914
5029e1398J06127p7898J0594j341L8471O2829m2215N9757l7184p389M4843k49376
5017a44180o5910J03153J17316o1076R544Q0919r5407O4756J35290p4425q5061
5006a5081r4716j4612J59313R4757j01080J4174K7356n5253n9827J08180j9462
4995D3749j29351K1960n6651L8796j23138j57602J06940J29500j30331j8641M0772
4984b33997P7539m1352m3906O9866K02268l6945K5004J34783j88222p3937Q7076
$$ y = [55841, 234677, 251887, 143167, 50481, 125781, 66097, -87382, -35640, 138129, 224006, 197043, 241868, 257046, 214105, 146188, 85837, 67411, 48070, 140438, 189304, 203027, 84205, 9383, -36363, -223836, -278964, -200509, 56635, 106542, -11138, -125565, -197312, -51398, 54729, -23169, -12575, -13916, 24555, 87384, 45169, 104926, 67742, 60353, 105196, -144180, -210090, -106937, 10379, -50697, -41153, 39766, -55641, 9115, 144405, 69980, -15081, -109797, -124409, 34904, 129661, 28581, 42755, 70111, 14858, -44969, 63211, 43749, -85602, -63642, -120293, -81497, -204635, -362237, -255297, -125797, -256128, -274769, -233997, -156458, -197810, -241716, -171850, 30418, -6527, 18477, 153260, -34962, -108899, -21823]
4973b1823J7785m0253q232n0541L6826p6435l3872N0857K3104J02764l4774k4269
4961e8863J06155j7337m496j77382j72801J32971J16285k02618l0449J95793J66176
4950E3434n5821l1353k4082L03j07957M094J04757M6019M1263j59470j7664l3362
4938a79839r197n5435R8196R6660N7564Q3570J2441o1710j57851m3689Q9732R5603
4926B6045l4762j70717J869r7072J07776K4040l7882J10596k3328L336O3311j9171
4914d5959N1857J9648N1674j0610j7882L60j41027J7815P1128K9661n5585q0688
4902a09608k5999l4644m1171M4615K0196O075K2989l3514R2610J29331l8569l872
4890B8439j74817P794J58989N6282j16014j4275M6583k4939m3124K80L5795j3418
$$ y = [-21823, -4038, -44291, -52523, -103064, -66238, -142673, -176545, -125688, -102584, 180, -34594, -58863, 47292, 29955, 25459, -151923, -324724, -191753, -75468, -278086, -308535, -112742, 53434, -2387, -33740, -57822, -57519, -165476, -161382, -56625, -10606, 30657, -128813, -146477, -179839, -189036, -244471, -146275, -49615, 7949, 91519, 103960, 42250, -115601, -159290, -69558, 26045, -8717, -179434, -177565, -274637, -166861, -142821, -180703, -70107, -93435, -90099, -26788, -45959, 5898, 25546, 77220, 66610, 48728, 49088, -91939, -74124, -2996, 26665, -28920, -109608, -135607, -170251, -211422, -166807, -146611, -140536, -117547, -151061, -58451, 70880, 32311, 28439, -146378, -138584, 20405, 76687, -39327, -53602, -7019, -31958, -75082, -74802, -39007, -52425]
4878e2425j18464K7607O1974L1664j10464O0423N4821K4905P5303P8777j49251
4867a5130j40637R0298J59359J45678L3774j09017j40523m8022k3038p8583Q5968
4856c9873K8414r1670j01830K7080O2505R5803J484Q013j7228o5717L6341N5794
4844h84m5532L2387J75210R5041j2183j18901j18476K7784k8518l7382j04283
4833a35737O0753J8966k517J59825L3048r1839j74993l6515R5917L1362n9166
4822a00896m1797J5658l8570q5894k7729J04059O8514O4956M1356j13877k2947
4811a37167P6997o926p0725L7909N5374J26363J6771j6350R732k1323k4445L2457
4799G8667N1052j30098J2163Q5886l3114j70645p5043K7078J14002K6327j7743
$$ y = [-52425, -170889, -143282, -81308, -49644, -160108, -99685, -44864, -19959, 55344, 134121, -15130, -155767, -65469, 93890, 239568, 273342, 164325, 23802, -24220, -47258, -125841, -39873, -11459, -103129, -204959, -177879, -115374, -19571, -18087, -10074, -27302, -93019, -56678, -884, -46416, -14029, 161181, 256222, 244039, 125138, 6662, 34446, 5928, -31454, -135737, -74984, -56018, -58535, 101290, 134338, 42499, -132494, -169009, -73092, -41730, -100896, -142693, -127035, -165605, -251499, -279228, -175169, -106655, -41699, -343, -114220, -137167, -60170, -67096, -137821, -99912, -44538, 81825, 98596, 82246, 91978, 70655, 46210, 78667, 129719, -379, 11784, 97670, 64556, -106089, -181132, -154054, -40052, -13725, -31468]
4788c1468L0292M9118N7554J7152j31619j11450J6787N9921J4557p6251p9739
4777a85146J25166Q9107P970O0318R0381M662j5577m8844p0983m2305k7508Q1687
4765F8928N4546k7008o2142l8552p1514j65861K8198R9197N9156M5559m1978o5589
4753a17060R2330Q3157o7322L3415L6347R1900P1342J02843o5195q0291m7015
4742A34451p202k3581k0895l198j1971o5595j8642O4867k56n913L8400K00212
4730B80677o2157q1957j6944M6241m5376j01694k7506O320R3926j4744p8207Q2128
4718H0707P5284j0934r9939n4085j74154J7322J85984J1015m156L4389l7783j14350
4706i0700q6148k9785Q2111N4318K3372P8052p9316j68131k272J326l8694P8888
$$ y = [-31468, -1176, 47942, 105496, 122648, -8971, -120421, -103634, -43713, -29156, -105407, -185146, -59980, 29127, 37097, 97415, 187796, 192458, 176881, 128037, 57054, 14749, -12759, 68928, 123474, 96466, 34324, -4228, -75742, -241603, -213405, -114208, -55052, -9493, -51471, -117060, -24730, 58427, -8895, 24520, 60867, 152767, 224109, 326952, 261757, 181466, 134451, 127249, 103668, 82773, 79575, 67604, 2009, -16633, 48234, 47978, 42065, 80465, 280677, 218520, 136563, 119619, 165860, 120484, 18790, -8716, -2396, 91530, 76786, -1421, 80707, 155991, 145057, 45118, -8967, -183121, -165799, 20185, 31200, 27044, 61433, 23650, -90700, -176848, -206633, -124522, -70204, -46832, 31220, -48096, -216227, -218499, -217173, -255867, -176979]
4694a76979J22635m7865M1206M3975P3612J19381R6261j4437j9195Q7149J27692
4683D53435P5762r4982k81869l965K9769l7349j7252J164j07522l0288r5233J4590
4671i3740j9225p05J6974r4629Q4298Q5496J4516j5510J9780J10108J4326r7923
4659B3766P9458O711m7896M9662Q7200M114n2399j76163o9596K57765J43705j33222
4647A73105o6731r211P3108j691n5930l7992k7822j78922j524J09375N6601J5397
4635D7763k8196P5408K1656J4749j09433p2539n9463O206J36285J40689k0225
4624A52900m5849p0775j9975m9535o4529K8590L5647r0487r295L3545J02706n1596
4612d8653J74210O5118J01218K3004l8798k7666m7905R4008j7716j02275m4067
$$ y = [-176979, -54344, -102209, -61003, -17028, 56584, 175965, 272226, 257789, 238594, 325743, 453435, 529197, 434215, 152346, 148381, 178150, 140801, 123549, 124713, 17191, -13097, -108330, -93740, -112965, -113670, -96696, -191325, -107027, -21531, -7015, -22525, -2745, 107363, 121689, 23766, 103224, 109935, 62039, 111701, 198901, 203015, 150616, -25547, -95143, 162622, 306327, 173105, 106374, 97163, 170271, 168580, 112650, 74658, 46836, -132086, -133610, -24235, 32366, 47763, 19567, 94975, 116631, 131380, 21947, -50592, -110055, -103849, 32436, 173125, 152900, 107051, 36276, 16301, -33234, -97763, -69173, -33526, -124013, -133308, -99763, 2943, -48653, 125557, 190675, 291893, 314897, 276099, 248433, 200528, 294536, 276820, 174545, 130478]
4601A30478k4543J40392R5585k7474j38681p4209N4071L5406j58235j3335N2929
4590G2384q940O9348N1155r2142j30323M4383Q3296l9368K7144o2525k9535p143
4578b2266J0059R1804M0189M8550j11813j05437J08390Q1170o3239L1611M8272
4567A57290j81645o3321J54441J28027k5845q0109K2580Q380N9223n0804q4524
4556D3693k0162M1615l5414R3191R6751r623O5377p6809o5841j32636j46757J624
4544a44991J74801n5151m8132j1172J13962l5351o3640n0788L8134K06370Q339
4533A32381m3145r3990J4325K5564K2921N3947j5664J01359P8009m4327j18519
4522A12861k23216N8846J51771Q9751n6679n5660j05881l2415Q9311q45M9549
$$ y = [130478, 105935, 246327, 341912, 314438, 175757, 101548, 155619, 191025, 32790, 19455, 72384, 63444, 132792, 183947, 91805, -38518, 5865, 89161, 49793, 76937, 14412, -15123, -22266, -12207, 79597, 119786, 168336, 56523, -48914, 59476, 140646, 77407, 109018, 157290, -24355, -87676, 66765, 194792, 168947, 88838, 111418, 119798, 179021, 128217, 43693, 23531, 65146, 29732, 122923, 219674, 210051, 275428, 198619, 132778, 142, -146615, -144991, 29810, -25341, -73473, -84645, 29317, -6034, -69674, -120462, -82328, 124042, 132381, 89236, -4754, 9571, 35135, 58056, 112003, 96339, 197698, 275707, 231380, 112861, -110355, -51509, 100262, 190013, 133334, 77674, -28207, -60622, 28689, 27844, 77393]
4511G7393N3798j69290k8651l4729M4144K0391R4851N8372M4851J4867k5370j03117
4499D7510O8024j8771j17771p2115O7433P861k2454j10568J12397J00847N0291
4488A12684o6229l0682j90391m9068J35492L239J94863l218n4556L9954q428o3872
4476A9788k7590J13580k6530r4240J30351l057r051J11099k7404r4689o6142j21824
4464i5709j20368o3725J6680J39642J40806K6871P8132J03192Q7884j18552n054
4453A89799m1605l9449M4355M289n0655q0886L008j6596j78888k7781J00461R0686
4441c262M4321j16570l9652J18822J11717m5717k09540R0217P1038n0992L250
4430b6368o2382Q5625P8314J1580m5680L6125r83j01678n277N117k6441k2689
$$ y = [77393, 131191, -38099, -66750, -101479, -57335, -36944, 57907, 116279, 161130, 175997, 150627, 47510, 115534, 96763, -21008, -93123, -25690, -17829, -40283, -150851, -38454, 62393, 112684, 46455, 15773, -174618, -223686, -88194, -84955, 109908, 106690, 52134, 92088, 83660, 19788, -7802, 105778, 79248, -14992, 115359, 112302, 103251, 214350, 186946, 92257, 26115, -95709, -216077, -279802, -263122, -123480, 17326, 44197, 122329, 225521, 313405, 194853, 189799, 148194, 108745, 153100, 157389, 106734, 25848, 28856, 12260, -166628, -194409, -93948, -3262, 41059, -75511, -115163, 3659, 115376, 69659, -139881, -49664, 21374, -29618, -26368, -88750, -3125, 75189, 86769, 41089, 77214, 76231, -25447, -30724, -25607, -52048, -74737]
4418g4737p9312j3103l2600J0847O5163K01363K3437k7075n2291j19646O0478
4407c7476q2832N0089J45038Q5793m478j16701j43974j6379J69587R9431N9841
4396B07939m4441j46635j13903N9712R9275m1362n3266J24396N1515l4230N1254
4385A60254R7679K0606n4631P4345p0878j93918m7586P3513N4955r9565p2195
$$ y = [-74737, -154049, -167152, -199752, -188905, -123742, 77621, 101058, 73983, 21692, -97954, -37476, -120308, -70219, 74819, 160612, 156134, 39433, -104541, -120920, 48667, 148098, 207939, 163498, 16863, -97040, -37328, 61947, 20585, -32681, 91715, 143230, 109000, 160254, 257933, 278539, 223908, 298253, 227375, 33457, -14129, 59384, 114339, 14774, -57421]
$$ [...]
##END NTUPLES=NMR SPECTRUM
##END=
