##TITLE=Analysis number 318666
Compound Code cc 38046
Book Reference 437/76
Project Code adrs
Chemist Name wendyb
##JCAMPDX= 6.0         $$ Bruker NMR JCAMP-DX V2.0
##DATA TYPE= NMR SPECTRUM
##DATA CLASS= NTUPLES
##ORIGIN= Bruker BioSpin GmbH
##OWNER= nmr
$$ XWIN-NMR		Version 3.5
$$ Mon Apr 10 10:44:35 2006 GMT Daylight Time (UT+1h)  MAYBRIDGE\nmr@NMR_250MHZ
##.OBSERVE FREQUENCY= 250.131544655141
##.OBSERVE NUCLEUS= ^1H
##.ACQUISITION MODE= SIMULTANEOUS (DQD)
##.ACQUISITION SCHEME= undefined
##.AVERAGES= 16
##.DIGITISER RES= 18
##SPECTROMETER/DATA SYSTEM= dpx250
##.PULSE SEQUENCE= zg30
##.SOLVENT NAME= CDCl3
##.SHIFT REFERENCE= (INTERNAL, CDCl3, 0, 16.522)
##AUDIT TRAIL= $$ (NUMBER, WHEN, WHO, WHERE, WHAT)
$$ ##TITLE= Audit trail, XWIN-NMR		Version 3.5
$$ ##JCAMPDX= 5.01
$$ ##ORIGIN= Bruker BioSpin GmbH
$$ ##OWNER= nmr
$$ C:\u/data/dgb/nmr/ADRS/2400/pdata/1/auditp.txt
$$ ##AUDIT TRAIL=  $$ (NUMBER, WHEN, WHO, WHERE, WHAT)
(   1,<2006-04-10 10:43:54.67 +100>,<MAYBRIDGE\nmr>,<NMR_250MHZ>,
      <created by zg, POWCHK disabled, PULCHK disabled
       configuration hash MD5:
       84 BC 41 DB A1 6E 1D 46 DA 25 12 A5 C1 ED C5 3A
       data hash MD5: 64K
       5D 04 13 1B 93 F6 8C 32 74 5E 41 B0 51 5D D6 7F>)
(   2,<2006-04-10 10:44:14.81 +100>,<MAYBRIDGE\nmr>,<NMR_250MHZ>,
      <Start of raw data processing
       ef LB = 0.3 FT_mod = 6 PKNL = 1 SI = 32K 
       data hash MD5: 32K
       BE AB 74 90 AF A0 94 52 7E A2 5A EC 61 2B E5 EB>)
(   3,<2006-04-10 10:44:18.19 +100>,<MAYBRIDGE\nmr>,<NMR_250MHZ>,
      <apk 
       data hash MD5: 32K
       45 36 41 FE B0 01 1E F1 E6 82 5E 4B 10 60 3D F4>)
(   4,<2006-04-10 10:44:19.50 +100>,<MAYBRIDGE\nmr>,<NMR_250MHZ>,
      <abs ABSG = 5 
       data hash MD5: 32K
       53 05 08 FA E3 94 3F BD 58 94 C2 ED 35 CE 7E 49>)
$$ ##END=
$$ 
$$ hash MD5
$$ 6C 06 67 C3 E6 97 AF 4A 59 66 A5 8D 29 BD 76 32
##$RELAX= 
##$RELAX= 
##$RELAX= 
##$RELAX= 
##$RELAX= 
##$RELAX= 
##$RELAX= 
$$ Bruker specific parameters
$$ --------------------------
##$DU= <C:\u>
##$EXPNO= 2400
##$NAME= <ADRS>
##$PROCNO= 1
##$TYPE= <nmr>
##$USER= <dgb>
##$AMP= (0..31)
100 100 100 100 100 100 100 100 100 100 100 100 100 100 100 100 100 100 
100 100 100 100 100 100 100 100 100 100 100 100 100 100 
##$AQSEQ= 0
##$AQ_mod= 3
##$AUNM= <au_zg>
##$AUTOPOS= <31 >
##$BF1= 250.13
##$BF2= 250.13
##$BF3= 250.13
##$BF4= 250.13
##$BF5= 500.13
##$BF6= 500.13
##$BF7= 500.13
##$BF8= 500.13
##$BYTORDA= 1
##$CFDGTYP= 0
##$CFRGTYP= 5
##$CHEMSTR= <none>
##$CNST= (0..31)
1 1 145 1 1 1 1 1 1 1 1 1 1 1 1 1 1 1 1 1 1 1 1 1 1 1 1 1 1 1 1 1 
##$CPDPRG= <>
##$CPDPRG1= <>
##$CPDPRG2= <>
##$CPDPRG3= <>
##$CPDPRG4= <mlev>
##$CPDPRG5= <mlev>
##$CPDPRG6= <mlev>
##$CPDPRG7= <mlev>
##$CPDPRG8= <mlev>
##$CPDPRGB= <>
##$CPDPRGT= <>
##$D= (0..31)
0 1 0 0 0 0 0 0 0 0.06 0 0 0 0 0 0 0.0002 0 0 0 0 0 0 0 0 0 0 0 0 0 0 
0 
##$DATE= 1144662232
##$DBL= (0..7)
120 120 120 120 120 120 120 120 
##$DBP= (0..7)
150 150 150 150 150 150 150 150 
##$DBP07= 0
##$DBPNAM0= <>
##$DBPNAM1= <>
$$ [...]
##$SUBNAM7= <"">
##$SUBNAM8= <"">
##$SUBNAM9= <"">
##$SW= 20.6930455092707
##$SWIBOX= (0..15)
0 0 3 0 0 0 0 0 0 0 0 0 0 0 0 0 
##$SW_h= 5175.983436853
##$TD= 65536
##$TD0= 1
##$TE= 294.16
##$TE2= 300
##$TE3= 300
##$TEG= 300
##$TL= (0..7)
0 120 120 120 120 120 120 120 
##$TP= (0..7)
150 150 150 150 150 150 150 150 
##$TP07= 0
##$TPNAME0= <>
##$TPNAME1= <>
##$TPNAME2= <>
##$TPNAME3= <>
##$TPNAME4= <>
##$TPNAME5= <>
##$TPNAME6= <>
##$TPNAME7= <>
##$TPOAL= (0..7)
0.5 0.5 0.5 0.5 0.5 0.5 0.5 0.5 
##$TPOFFS= (0..7)
0 0 0 0 0 0 0 0 
##$TUNHIN= 0
##$TUNHOUT= 0
##$TUNXOUT= 0
##$USERA1= <user>
##$USERA2= <user>
##$USERA3= <user>
##$USERA4= <user>
##$USERA5= <user>
##$V9= 5
##$VALIST= <valist>
##$VCLIST= <CCCCCCCCCCCCCCC>
##$VD= 0
##$VDLIST= <DDDDDDDDDDDDDDD>
##$VPLIST= <PPPPPPPPPPPPPPP>
##$VTLIST= <TTTTTTTTTTTTTTT>
##$WBST= 1024
##$WBSW= 4
##$XGAIN= (0..3)
0 0 0 0 
##$XL= 0
##$YL= 0
##$YMAX_a= 587277
##$YMIN_a= -827168
##$ZGOPTNS= <>
##$ZL1= 120
##$ZL2= 120
##$ZL3= 120
##$ZL4= 120
##$ABSF1= 16.522
##$ABSF2= -4.171173
##$ABSG= 5
##$ABSL= 3
##$ALPHA= 0
##$AQORDER= 0
##$ASSFAC= 0
##$ASSFACI= 0
##$ASSFACX= 0
##$ASSWID= 0
##$AUNMP= <proc_1d>
##$AZFE= 0.1
##$AZFW= 0.1
##$BCFW= 0
##$BC_mod= 0
##$BYTORDP= 0
##$COROFFS= 0
##$CY= 12.5
##$DATMOD= 1
##$DC= 0
##$DFILT= <>
##$DTYPP= 0
##$F1P= 14.0000005364418
##$F2P= -0.99999901652339
##$FCOR= 0.5
##$FTSIZE= 32768
##$FT_mod= 6
##$GAMMA= 0
##$GB= 0
##$INTBC= 1
##$INTSCL= 1
##$ISEN= 128
##$LB= 0.3
##$LEV0= 0
##$LPBIN= 0
##$MAXI= 10000
##$MC2= 0
##$MEAN= 0
##$ME_mod= 0
##$MI= 0
##$NCOEF= 0
##$NC_proc= -3
##$NLEV= 6
##$NOISF1= 0
##$NOISF2= 0
##$NSP= 0
##$NTH_PI= 0
##$NZP= 0
##$OFFSET= 16.522
##$PC= 1
##$PHC0= 170.9634
##$PHC1= 6.837802
##$PH_mod= 1
##$PKNL= yes
##$PPARMOD= 0
##$PSCAL= 4
##$PSIGN= 0
##$REVERSE= no
##$SF= 250.13
##$SI= 32768
##$SIGF1= 0
##$SIGF2= 0
##$SINO= 400
##$SIOLD= 32768
##$SREGLST= <1H.CDCl3>
##$SSB= 0
##$STSI= 32768
##$STSR= 0
##$SW_p= 5175.98343685301
##$SYMM= 0
##$S_DEV= 0
##$TDeff= 65536
##$TDoff= 0
##$TI= <Analysis number 999999
Compound Code 99
Book Reference 9
Project Code 9>
##$TILT= no
##$TM1= 0
##$TM2= 0
##$TOPLEV= 0
##$USERP1= <user>
##$USERP2= <user>
##$USERP3= <user>
##$USERP4= <user>
##$USERP5= <user>
##$WDW= 1
##$XDIM= 32768
##$YMAX_p= 398813053
##$YMIN_p= -62264
$$ End of Bruker specific parameters
$$ ---------------------------------
##NTUPLES= NMR SPECTRUM
##VAR_NAME=  FREQUENCY,     SPECTRUM/REAL,   SPECTRUM/IMAG
##SYMBOL=    X,             R,               I
##VAR_TYPE=  INDEPENDENT,   DEPENDENT,       DEPENDENT
##VAR_FORM=  AFFN,          ASDF,            ASDF
##VAR_DIM=   32768,         32768,           32768
##UNITS=     HZ,            ARBITRARY UNITS, ARBITRARY UNITS
##FACTOR=    0.157963299565203, 1,           1
##FIRST=     4132.6476996994, 0,             0
##LAST=      -1043.33573715361, 0,           0
##MIN=       -1043.33573715361, -62264,      0
##MAX=       4132.6476996994, 398813053,     0
$$ Real data points
##PAGE= N=1
##DATA TABLE= (X++(R..R)), XYDATA
$$ [...]
16469A515132J40829J74283K30589L24508M56829O73018J031513J575576K352050
16460H474327L295010M258165M983350N349723N285947M666777L452267K043105
16452D1808671Q54279k45995j510434k946704m221862m809556m797177m438165
16444A9693057l774766k928604k097367j454270j012514p42323n50536m19283
16436F713394l40742k77816k35477j98043j82484j96295j83485j55967j70943
16427D772142j57011j34355j05398p6135p6410m3873l1495m8945m6146r603J9309
16416D062080L2938P1967J33935K34274L57752N68080Q81671J385904K112820
16407I841421L012574L927482M671557N039262M973087M419035L294941J868755
$$ y = [1515132, 1655961, 1830244, 2060833, 2385341, 2842170, 3515188, 4546701, 6122277, 8474327, 11769337, 16027502, 21010852, 26360575, 31646522, 36313299, 39765566, 41808671, 42662950, 42416955, 40906521, 37959817, 33737955, 28928399, 24131222, 19693057, 15918291, 12989687, 10892320, 9438050, 8425536, 7683213, 7132677, 6713394, 6372652, 6094836, 5859359, 5661316, 5478832, 5282537, 5099052, 4943085, 4772142, 4615131, 4480776, 4375378, 4299243, 4222833, 4178960, 4147465, 4098520, 4052374, 4042771, 4062080, 4095018, 4166985, 4300920, 4535194, 4892946, 5461026, 6342697, 7728601, 9841421, 12853995, 16781477, 21453034, 26492296, 31465383, 35884418, 39179359, 41048114]
16399D1048114O86728l29193j469375k744656l941362m557073m573366m248666
16391A9871151l647303k838403k045860j417388r95951p12922n56542m41795l45133
16382F869854k80104k48998k36711k17857k23674k12864k00080k19905k25488
16373D804173k15975j99054j76690j61142j38818j29721j26793j14136j17165
16364C424679j24284j10689p5328q1713r0313q4597o9309p4089p8016o6769n7456
16353B512116m6524n4647n8006l9428n1972n2928n7923m5173l1860m5856m8692
16342A979107k4052k7869k6982j4887j5487m362L504J1571O948L687P185j541
16330A896822M876j398l1810m1082m8800m5692m7698n6317m6167m1580n6072p8384
$$ y = [41048114, 41734842, 41405649, 39936274, 37191618, 33250256, 28693183, 24119817, 19871151, 16223848, 13385445, 11339585, 9922197, 8926246, 8213324, 7656782, 7214987, 6869854, 6589750, 6340752, 6104041, 5886184, 5662510, 5449646, 5249566, 5029661, 4804173, 4588198, 4389144, 4212454, 4051312, 3912494, 3782773, 3655980, 3541844, 3424679, 3300395, 3189706, 3114378, 3032665, 2942352, 2857755, 2788446, 2714357, 2636341, 2569572, 2512116, 2465592, 2410945, 2352939, 2313511, 2261539, 2208611, 2150688, 2105515, 2073655, 2027799, 1979107, 1955055, 1927186, 1900204, 1885317, 1869830, 1865468, 1868972, 1880543, 1887491, 1891178, 1898363, 1896822, 1901698, 1900300, 1868490, 1827408, 1778608, 1732916, 1685218, 1628901, 1582734, 1541154, 1485082, 1406698]
16318A406698n2770l9291m1789l8229l8605k3543j8721l3231k6309j3279j1208
16307A069723k1623k8879j2328j8734p034j4814k0478k2919j9522j5479n12j8701
16295H68700j1919L825J5518l232N869J1803J4997J0027K272m407j017M795k1195
16282H96036j8997k3617j7298j1613j8929J493J5340l938j3006o167K794j282
16270H00816j9727j2933k6369l6197l8811m0982k8851O96j2753j6897k8265r404
16258E30323k4462j5269l90L979o403r236j4864l0j4281j1105r297j0311n905
16245D12749n549q335j7151k3727o953O135L139k136j3435m623O416k894j6795
16232C26841k1139q182J581m143j1118q042L877O909Q250r577j9543n9O753L823
$$ y = [1406698, 1353928, 1314637, 1272848, 1234619, 1196014, 1172471, 1153750, 1120519, 1094210, 1080931, 1069723, 1048100, 1019221, 1006893, 988159, 981125, 966311, 945833, 922914, 903392, 887913, 887401, 868700, 856781, 860606, 876124, 872892, 878761, 890564, 905561, 915588, 917860, 913453, 912436, 917231, 896036, 877039, 853422, 836124, 824511, 805582, 807075, 822415, 818477, 805471, 799304, 802098, 800816, 781089, 768156, 741787, 705590, 666779, 625797, 596946, 597642, 584889, 567992, 539727, 530323, 505861, 490592, 490202, 494181, 487778, 478542, 463678, 463648, 449367, 438262, 428965, 418654, 412749, 407200, 398865, 381714, 357987, 351034, 357169, 360308, 358172, 344737, 340114, 346530, 343636, 326841, 305702, 297520, 299101, 294958, 283840, 275798, 279675, 286584, 294834, 285257, 265714, 265655, 272408, 276231]
16218B76231l789j0047j026r490j725J747N622n730j5604j7921m441p497m950
16205B01380j3577n539k531j51m317m511Q84K752N774l011J3523k1852j2032j000
16191A55792m407J0063R513j2425r115o27r946r297j341l603L03O666M555M41
16177A36572n304j3766p935m490p972P040m909Q268M973Q131K428r5Q698p547
16163A24092j5862n634n155M39K157K824j2528j6701J7043K2227l49j9455j2918
16150H0180J326o952o799p700j432J1074J2631j0088o43q110N042P263P610j5988
16136F7414j7013O429q405k0720N637J0245Q783J866j8319p197l864k969L921
16123B5808M616l856k023k114L653L085J540J2223J760l175j3340L433N358j1546
$$ y = [276231, 272442, 262395, 261369, 251879, 250154, 251901, 257523, 251793, 236189, 218268, 213827, 206330, 201380, 187803, 182264, 179733, 179582, 175265, 170754, 171638, 174390, 180164, 177153, 190676, 168824, 156792, 155792, 151385, 161448, 170961, 158536, 149421, 148794, 138848, 129551, 128210, 124607, 124910, 131576, 136131, 136572, 131268, 117502, 109567, 105077, 97105, 104145, 99236, 107504, 112477, 120608, 123036, 122941, 131639, 124092, 108230, 102596, 97441, 97880, 100037, 102861, 90333, 73632, 90675, 112902, 112553, 93098, 80180, 81506, 74554, 67755, 60055, 58623, 69697, 82328, 72240, 71597, 63487, 68529, 75792, 83402, 67414, 50401, 56830, 48425, 27705, 33342, 43587, 52370, 54236, 35917, 28720, 24856, 21887, 25808, 30424, 26568, 24545, 22431, 26084, 29169, 30709, 42932, 44692, 41517, 28177, 31610, 36968, 25422]
16109B5422j3938J785n753K114J7246J0678P696L388n620q522l412o650m197L612
16095B3849K401q951P230p874o432p094q95M75J730j4049K343K2087J7496O016
16081C8332j273Q783j20M42J87L939j0424j1522k630j0433m931J2050K267j0064
16067A4603j3054r204R929J5238J0681J540n647o899L556P627j0447j7133J597
16054B387L337l784Q900o384j6148o895p417k0218M291R000L325J5806J5650J5271
16040A7121R861p630o207k11L127L137o410p886j33j0208j60Q871L315j180r452
16025d045o611Q475J0388m505l896r146P962J86L40J566L98r197P020P063j272
16010D726j3236J2979P979k0131q094j139m374J2123J2956L507R05j2472J0446
$$ y = [25422, 11484, 13269, 7516, 9630, 26876, 37554, 45250, 48638, 43018, 34496, 31084, 24434, 20237, 23849, 26250, 17299, 24529, 16655, 10223, 3129, 2234, 2709, 4439, -9610, -7267, 14820, 32316, 38332, 37059, 45842, 45722, 46164, 46351, 50290, 39866, 28344, 25714, 15281, 10350, 22400, 24667, 14603, 1549, -7655, 2274, 17512, 28193, 29733, 24086, 17187, 20743, 28370, 17923, 790, 2387, 5724, 1940, 10840, 4456, -11692, -18587, -26004, -46222, -41931, -32931, -29606, -13800, 1850, 17121, 26982, 19352, 13145, 12934, 16061, 19198, 12788, 4902, 4769, -5439, -5599, 3272, 6587, 5407, -4045, -10656, -2181, 8207, 3702, -194, -9340, -1378, -1192, -852, 714, 1112, -8085, -1065, 5998, 4726, -8510, 4469, 12448, -7683, -15777, -16916, -21290, -9167, 3789, 7296, 8201, -4271, 6175]
15997F175l940k1379K880Q970P615l350J3695M872k377l335j1432k3006j668K1696
15983d584Q363p855j0762Q321P408p864l037J1563o400j3269Q612J1990n131m0
15969b685o909K053O591P17N595p802n438o17M022J871R460M128L669p454L397
15954A0598L266L943M27J2460q805j2801J5769J3737J9544K3276L2983K6983J6982
15941A58362J4619K7303J7476R811j731l240j6159j8551k8009k3918k8600k0278
15929H7085j2064k1879j3573r23j3177q301k069r875n871M336m664j0437K728
15916h684K2029O027M884o188o712J5202R44j0325l305J735M935j350M187j443
15902B1936J0983K19j3079K532M893Q305L447J926J1798J6190J4206L1554K5764
$$ y = [6175, 2235, -19144, -16264, -7294, 321, -3029, 10666, 15538, 13161, 9826, -1606, -24612, -26280, -4584, 3779, -4076, -14838, -6517, 891, -6973, -10010, 1553, -4847, -18116, -9504, 2486, -2645, -2685, -9594, -7541, -950, -233, 5362, -2440, -7878, -8495, -4473, -2602, 6858, 10986, 14655, 7201, 10598, 13864, 17807, 18234, 30694, 21889, 9088, 24857, 38594, 58138, 81414, 114397, 141380, 158362, 172981, 200284, 217760, 227571, 225840, 222600, 206441, 187890, 159881, 135963, 107363, 87085, 75021, 53142, 39569, 38646, 25469, 17168, 15099, 5224, -647, 3689, -975, -11412, -8684, 13345, 19372, 24256, 18068, 11356, 26558, 27502, 17177, 13872, 15607, 20542, 19192, 23379, 21936, 32919, 33138, 20059, 22591, 27484, 35789, 39236, 41162, 52960, 69150, 83356, 114910, 140674]
15889A40674K2167J6790L647N285J5735L620k0962p890n316k8227k6517k9080
15877H9926l9853j2053M312J2688q85o826k6251m911L537r496P103Q874n645r892
15863A0628o166j2666J6233J7864j28j64l465K952n664L428O641J2007o925j6843
15849A7732j0648l306J349m389o604J2073O686n588j0705j1161P104R470N557
15836G570P195m472k472l482m40R880J1115j1244k9631j036J5198j008m492j134
15822h453j038R163J5840J6465N399j2785j4768q812j6231o913N933R233L996
15809b971o053M532k604K509m242M653m79l533J1662k808O194O85m978N828K438
15794A0833l163J0945Q821r475r552p281O068j874j8549j5987l593J4549M181
$$ y = [140674, 162841, 179631, 183278, 188563, 204298, 207918, 186956, 179066, 173750, 145523, 119006, 89926, 50073, 38020, 42332, 55020, 54135, 47309, 21058, 16147, 19684, 10188, 17291, 26165, 20520, 10628, 4462, -8204, 8029, 25893, 25765, 25601, 22136, 25088, 19424, 22852, 29493, 41500, 34575, 17732, 7084, 3778, 5127, 738, -5866, 6207, 12893, 7305, -3400, -14561, -7457, 2013, 7570, 14765, 10293, 7821, 4339, 3899, 13779, 24894, 13650, -15981, -17017, -1819, -2827, -7319, -8453, -9491, -328, 15512, 31977, 37376, 24591, 9823, 1011, -15220, -22133, -16200, -6967, -2971, -9024, -4492, -7096, -4587, -8829, -4176, -4655, -8188, 3474, 666, 6860, 7545, 2567, 8395, 10833, 7670, 18615, 27436, 17961, 8409, 1128, 7196, 5322, -13227, -29214, -32807, -18258, -14077]
15781a4077J33q201r509p791p115J3362K9021O052n440J0015L552k436j0000j7828
15767b0262K257J4150N121k384J769K177N923J251o059J530L988o359p985K744
15753b139N304K026m367l772q910j6967q293J6312N161Q011k279j9236j764R097
15739b1816J0972J8942o97j6025n20L301o997R537M042o841r426L179R183K5105
15725B1939j842j9635j7101J358M506N459P958N470l529k91J4713L291q327m128
15711I841q557P929o725n518q52m445J0843j054m810J2j262J0608J3271K545O825
15696B8651J242p029o216K559L070P473j8875j572J7589l98j0742q95p65p531
15682F561o600M337k583O216M935J917m984n238j390j3257p580J0652J5001n276
$$ y = [-14077, -13944, -22145, -31654, -39445, -46560, -33198, -4177, 1875, -3565, 6450, 10002, 7566, -2434, -20262, -18005, -3855, 1266, -1118, 651, 2828, 8751, 10002, 3943, 5473, 9461, 3102, -4883, -2139, 3165, 5191, 824, -2948, -11858, -28825, -37118, -20806, -15645, -7634, -9913, -29149, -30913, -21816, -10844, 8098, 7401, -8624, -9144, -5843, -12840, -3303, 739, -6102, -15528, -12349, -3166, 21939, 20097, 462, -16639, -15281, -10775, -5316, 2642, 8112, 4583, 4292, 19005, 22296, 13969, 9841, 1284, 9213, 2488, -3030, -3882, -8327, 2516, 1462, -3348, -3336, -4598, 6010, 19281, 21826, 28651, 29893, 22864, 16648, 19207, 22277, 29750, 10875, 9303, 26892, 26494, 15752, 14857, 14092, 6561, -39, 4298, 1715, 7931, 12866, 14783, 9799, 4561, 3171, -10086, -17666, -7014, 7987, 2711]
15668B711n65o92j7529J6548n383p543K1361R571q050j3006K710K782l395M6l733
15653d167p645p137M791R653k25k871O215K360K443j0583j4529N588k497R635
15639h969P788j0827j622Q858J0031N528p753k061r225j3093K985j0122L182P635
15625a7665K86P454J2185K425N68J645j4814j9071J3747J5824Q109N127L964o678
15611A3106n176L368j4101M412J419r203q069M831J1613N190l426j0507l75J4242
15597G324R497l208q912l051p396K318j9p495L07O438N534p526q835N838J247
15582g939n379J1485q262n440o532j3937l478J5427R656L767L187J5602k425l243
15568B489j3393j6171J741L891J4308L581j5897K181m591j2174K294J4076J0603
$$ y = [2711, 2146, 1454, -16075, 473, -4910, -12453, 8908, 18479, 10429, -2577, 133, 2915, -480, -434, -4167, -11812, -18949, -14158, -4505, -4730, -7601, -1386, 974, 3417, -7166, -21695, -16107, -18604, -8969, -1181, -12008, -13630, -4772, 5259, 10787, 3034, 973, -8252, -21345, -18360, -28482, -25300, -17665, -17379, -9925, 2260, 4685, 5253, 6898, -7916, -26987, -13240, 2584, 10693, 15820, 19784, 13106, 7930, 11298, -2803, 1609, 3028, -6175, -14244, -9413, 2200, 7390, 3964, -6543, -6918, 7324, 16821, 13613, 4701, 1650, -5746, -3428, -3447, -10942, -10635, -4197, 1337, -6189, -15024, -9186, -7939, -13318, -1833, -10095, -15535, -22067, -36004, -39482, -24055, -14399, -10632, -7445, 8157, 5732, 2489, -10904, -27075, -25334, -21443, -7135, -3554, -19451, -17270, -21861, -34035, -31741, -17665, -7062]
15555g062M075P909o096j504J112n753l569r222p080j5899m595K0900Q844j970
15541a9910J04N436n414P264R777j3799l172O550m477P21j628N359k256j8068
15527c3513r139j096M898M591P836R311q78q009r338L485M752k137l673J0523
15513b2387Q607n072j5992j036L5718P037j6856k454L339j4812m979J7051R257
15500b579j3050p719j390J0112j537Q54J0391O716n80p671q489m923L282j7640
15486c4223q21K0738L708l373r761o26p127Q95P304o36k583o75O805k363J793
15471b0945J416M058L391O532k028q967j928O715j478o250k940J430K828J6064
15457b102K503M927k428q939j6116j0762N522J3828P316n590k199O17J918M869
$$ y = [-7062, -2987, 4922, -1174, -2678, -1566, -7319, -10888, -20110, -27190, -43089, -47684, -26784, -17940, -19910, -19806, -14370, -19784, -12520, -2743, -16542, -19714, -13164, -17641, -16920, -18548, -13189, -15445, -33513, -42652, -43748, -38850, -34259, -26423, -17112, -17990, -25999, -35337, -31852, -27100, -29237, -32910, -22387, -13780, -18852, -34844, -35880, -162, 6875, -9981, -12435, -9096, -23908, -28887, -11836, -2579, -15629, -23348, -24738, -14626, -16163, -15309, -4918, 1798, 1218, -6453, -14942, -19865, -16583, -34223, -35044, -14306, -10598, -13971, -23732, -24358, -31485, -30590, -23286, -23922, -26505, -27180, -20375, -22738, -20945, -19529, -15471, -12080, -5548, -7576, -16543, -18471, -11756, -13234, -19484, -22424, -20994, -18166, -2102, 401, 5328, 2900, -6039, -22155, -32917, -27395, -13567, -6251, -11841, -14040, -13423, -11505, -6636]
15443f636O72n103j0572j2023R03O96m071K327J2124j522M498O795J4757l798
15429i53l243K533K593j909j716m006L409K767M204p262j1661q460j3754J0335
15415b7123J6057P161J2092m379o902Q049K550j3505N055p758j1931j91J8038
15402b787J1394K80j1042q76R891k582n423M242O804M816p529K390p626n59j2751
15387a1358k509j385J594j7551j808R307R234m775N741R521K286p25N657O671
15373I900p431j7669o579M710J804N731J1113L251R4P379n830M960k949j3885
15359e401n299l414J521N94K629r096k761J0790K235K900M722j0471k4J640N275
15344d160P581m729k2312n818R715J5696J4215j5660j6182o336L427O400k083
$$ y = [-6636, -5964, -11067, -21639, -33662, -32759, -32063, -36134, -33807, -21683, -23205, -18707, -11912, 2845, -953, -4196, -1663, 930, -979, -2695, -6701, -3292, -525, 3679, -3583, -15244, -23704, -37458, -27123, -11066, -3905, 8187, 3808, -3094, 4955, 7505, -6000, -945, -8703, -20634, -20825, -2787, 8607, 8887, -2155, -3031, 6860, 4278, -1145, 3097, 9901, 14717, 7188, 9578, 1952, 1393, -11358, -13867, -15252, -13658, -31209, -33017, -23710, -14476, -19251, -13510, -3989, -1703, -2428, 3229, 9900, 2469, -15200, -21779, -17069, -15265, -9534, 1579, 4830, 4924, 12303, 6473, 11433, 8484, -5401, -10700, -14114, -12593, -11999, -9370, -18466, -21227, -10437, -8202, -5302, -580, -11051, -11075, -9435, -4160, 3421, -1308, -23620, -29438, -19723, -4027, 10188, -5472, -21654, -27990, -24563, -18163, -20246]
15331b0246q940N892N309l478J0009O068N464j3959j1812M623J3011R252l36m847
15317c990m634k610P666P54q005m289L54J23j1038r542L25j429O579J1082m809
15302b3463m865J5704M279K143j2863j3484J8797J9636N628r842j0375L878O091
15289A264p686q174K899l737m318j1921J567p892M177M182N330Q413L36K990J106
15274a1464k20o633J2063K500m77o671M459n904k260J9591Q55j1807j1881J287
15260a6562l223j0358P389m957Q802O675P577o82m591J115K914Q520P534j0106
15246D7r982k146l872l726j1889m088k801P127N384M03j5338n978J3315j730j462
15231c6736J0593J5350o753r133j2215j5063J6647J2315R515J5175k206p790J655
$$ y = [-20246, -29186, -23294, -17985, -21463, -11454, -5386, 78, -13881, -25693, -21070, -8059, 1193, 857, -3990, -8624, -11234, -3568, -2814, -10819, -15108, -14754, -14631, -25669, -35211, -34886, -36315, -29736, -18654, -23463, -28328, -12624, -8345, -6202, -19065, -32549, -13752, 5884, 11512, 1670, -8705, -4827, 1264, -6422, -14596, -11697, -15434, -19752, -31673, -30106, -37998, -33821, -29639, -24309, -15896, -15560, -12570, -11464, -11684, -18317, -6254, -3754, -4231, -10902, -6443, -12347, -14607, 4984, 5839, -5968, -17849, -16562, -19785, -30143, -22754, -27711, -18909, -12234, -4657, -5339, -9930, -8815, -5901, 2619, 10153, 47, -9935, -12081, -15953, -19679, -31568, -35656, -38457, -31330, -25946, -25543, -40881, -46859, -33544, -35274, -36736, -26143, -10793, -17546, -26679, -38894, -53957, -37310, -24995, -15480, -305, -2511, -10301, -8646]
15218h646L606k005J116J8303p600j8228j6666l421P137N893M790q571j3693m428
15204d2413j35J1398J7267k26J0429N251K540R736j4352j4505j2463j2145O85
15191c8933P189R050O550J1846J1183R41J756k188j7037l553L902q214j7191N386
15177b9313K876J0679p93J5536q832j1544M607L211n909n504j2739P926J2834
15164a6965J0006L878r586m357J531K593N067M233L100o072q852k451R675L981
15150d219R912Q070k6250j2972N48Q358j485j94k484L587K3770J1615j6232r935
15136g911j1612k226n533Q127K1765M202j2850k721K508k528j5746r219n334l313
15122d2391L966o335K14J609J158O812J2618O320r317K346O374P530j1027j721
$$ y = [-8646, -5040, -7045, -5929, 12374, 4774, -13454, -30120, -33541, -26404, -20511, -15721, -24292, -37985, -42413, -42548, -31150, -13883, -14109, -3680, 1571, 4111, 13847, -505, -15010, -27473, -39618, -38933, -31744, -22694, -16144, -4298, 6885, 7826, 9582, 7394, -9643, -13196, -9294, -17508, -34699, -29313, -26437, -15758, -16551, -1015, -9847, -21391, -16784, -13573, -19482, -24986, -37725, -29799, -16965, -6959, -3081, -12667, -17024, -15493, -12900, -7833, -3600, -500, -6572, -15424, -17875, -8200, -4219, 5693, 13763, -12487, -25459, -24911, -16553, -18038, -18232, -20716, -17129, 6641, 18256, 2024, -7911, -19523, -21749, -27282, -19155, 2610, 6812, -6038, -8759, -6251, -8779, -24525, -33744, -39078, -42391, -38425, -44760, -44546, -42937, -41779, -34967, -22349, -16029, -25346, -23000, -16626, -9096, -20123, -21844]
15108b1844Q582j2757j1732J4663L154J458O108k655p037M574J2534N411k249
15095a790j2815r797l73J4644N613Q621N563m627j2620k839j0485j1017k621L251
15081c1292j0022k225k371O857K825Q034J4042Q909k69o442N028q263o637o903
15067b8729j1039P191P181R595K779N320m562O587L893J776j0056l018j5840N074
15053b3848O567n731M105M233Q728P032K370q762R40r698n546K086l723O924J0271
15038d052N07J850L384M322J0896M54o048j3032k4006j3326L169M112p430q92
15024d0092P951N2p463o496k75O955Q588L265k671Q254J2673J1602n47j9285j6089
15009c3578p717J0861R473j4588r898J4105J1936j0492k2587J1303J4543k80J6957
$$ y = [-21844, -13262, -26019, -37751, -23088, -19934, -18476, -12368, -15023, -22060, -17486, -4952, 459, -1790, -14605, -24402, -24775, -10131, -4518, 4103, 9666, 5039, -7581, -10420, -20905, -31922, -34543, -31292, -41314, -43539, -45910, -39053, -36228, -28194, -14152, -5243, -5512, -11954, -6926, -15189, -21826, -28729, -39768, -32577, -25396, -15801, -13022, -7702, -12264, -5677, -1784, -8, -10064, -13082, -28922, -23848, -17281, -23012, -18907, -14674, -5946, 1086, 3456, -5306, -4366, -14064, -19610, -17524, -21247, -14323, -4052, -3545, -1695, 1689, 6011, 16907, 17361, 11313, -1719, -25725, -39051, -35882, -31770, -39200, -40092, -32141, -32089, -39552, -46048, -46323, -39368, -30780, -27515, -30186, -21932, -9259, 2343, 1796, -17489, -33578, -41295, -30434, -20961, -35549, -45447, -31342, -19406, -29898, -52485, -41182, -26639, -26919, -9962]
14996i962M463O024J0702l356n634l424J750j5509r017k549j877O178R946k468
14982a4733J2150N944n65j7725j0179Q782L382M78K3828J2298j3314j5610q960
14969a4224p494k042k498R942N007J0052m388J645M304j9523j8471j872J2738
14956b6824J3542M014n701r868p088J1726J6775p584j6582P998J3869N121r43
14943a545O170L51m275J0613L046r762j6355k618l188M692N080m944l121j7912
14929c3768k396J1145j1013J724R121o724M851J2126Q449K753P372P419L71j6710
14915e280k3294J411J2029L406J986k819r078j461J0214q586M153J2606P441n8
14901B670M00l66p551N780L258r482m670q084p293l712J475k4998N318K1680K1123
$$ y = [-9962, -5499, 525, 11227, 7871, 2237, -1187, 563, -14946, -23963, -26512, -28389, -22211, -12265, -14733, -2583, 3361, 2796, -14929, -25108, -16326, -12944, -12466, 11362, 23660, 10346, -5264, -14224, -21718, -23760, -26258, -16316, -11309, -1257, -5645, -4000, 304, -19219, -37690, -39562, -26824, -13282, -9268, -14969, -24837, -31925, -20199, -3424, -11008, -27590, -19592, -5723, -602, -1545, 4625, 4976, 701, 11314, 14360, 4598, -11757, -14375, -17563, -12871, -7791, -12735, -15856, -33768, -36164, -25019, -36032, -34308, -25187, -31911, -27060, -14934, -6485, -3732, 3640, 11059, 11430, -5280, -28574, -27163, -15134, -11728, -9742, -12561, -21639, -23100, -12886, -21472, -17319, -4713, 2728, 2670, 3070, 2704, -4847, 933, 4191, -5291, -9961, -18045, -25338, -29050, -27575, -52573, -47255, -25575, -4452]
14886d452J6978J5284j0698j8399K071M698M178l791j7219j0708O592l086p42
14873a9294j0378j928K2564L005o123P561K719K389j5129m211n04o310N326N768
14859a4545N782k127N587J927k561O4l118J58j4099M711M620j9240j0243N641
14845c7443P440J6374P780n853o067L066L30j4179k589M446P205L732K2668L893
14831A0803j8843j1399j3897n588O781P722M750m401j4372J2780J3153Q26m453
14818a6138o960L04N247l09l048j2501k345Q769J3997l768j1316n063L658K809
14804b6664R505l419n960N522J151j2400L791Q136Q182k839o408O01J2218L880
14790d704m933m981N738P820l663K705k798j0515k917j8524N54J3089N083L375
$$ y = [-4452, 12526, 27810, 17112, -1287, 784, 5482, 9660, 5869, -11350, -22058, -15466, -18552, -19294, -29672, -31600, -9036, -6031, -12154, -4593, -1874, 515, -14614, -18825, -19329, -25639, -20313, -14545, -8763, -10890, -5303, -3376, -5937, -5873, -8991, -8833, -22932, -18221, -13601, -32841, -43084, -37443, -30003, -13629, -5849, -11702, -17769, -14703, -14373, -28552, -31141, -26695, -19490, -15758, 6910, 10803, -8040, -19439, -33336, -38924, -32143, -24421, -19671, -24072, -38444, -25664, -12511, -11685, -16138, -23098, -22794, -17547, -17856, -20904, -33405, -35750, -26981, -12984, -16752, -28068, -33131, -29473, -26664, -17159, -20578, -26538, -21016, -19865, -32265, -28474, -20338, -12156, -14995, -21403, -20802, -8584, -4704, -9637, -14618, -8880, -1060, -4723, -2018, -4816, -15331, -18248, -36772, -36218, -23129, -18046, -14671]
14776a4671N948k79j8152k497J7272J1816n307k258q700M11J3314Q617M396O987
14762A6897J943r386n129r378j5826K444L250P489j2925l479R932Q866R676o051
14748a677j7690j298K063O695l601O859n213k865l715J320K202j697m248r587
14734c2452N489K07J2443Q648J815Q38L910Q674k338o698m018L349k983M254k1752
14719b0614r517Q803J3448J3968m280j0320j555Q651j1065M02L742j5095j8901
14706d2333J0463K0896J0835o982k797l676o15N737K606o956N974o671r915j8546
14692d1980j839j762P909J1151q963j4099l416K1822K2435n806m408J630P77N599
14678a0950o609K715N184O152R144p925j6805r986j707m380K771R279J3257R200
$$ y = [-14671, -8723, -9002, -27154, -29651, -12379, -563, -5870, -8128, -16828, -16417, -3103, 5514, 9910, 16897, 18840, 9454, 4325, -5053, -20879, -18435, -15185, -7696, -20621, -24100, -14168, -5302, 4374, -1677, -19367, -20665, -18602, -11907, -15508, -8649, -13862, -16727, -20442, -19122, -16920, -18617, -22865, -32452, -26963, -26756, -14313, -5665, -3850, -3012, 898, 9572, 7234, 536, -3482, -133, -3116, 1138, -20614, -30131, -21328, -7880, 6088, 1808, -8512, -10067, -1416, -12481, -12079, -8337, -23432, -42333, -31870, -10974, -139, -7121, -9918, -13594, -14209, -8472, -5866, -12822, -6848, -13519, -23434, -41980, -43819, -45581, -37672, -26521, -35484, -49583, -52999, -31177, -8742, -14548, -18956, -17326, -16549, -10950, -17559, -14844, -9660, -3508, 5636, -2289, -19094, -29080, -30787, -35167, -32396, -23117, -9860, -660]
14664f60P00j0368k885L699L373n383q188J6550q576k0226o841k951R341K3187
14650i228m390j0258r945j6931L68J1772K3803J8090N778P149k4560j3180Q66
14637b0666l587K969j451r834M613J6161L757j5546j1430q385J140J0792J160
14624c0307L673J045j449K685J1382m994j7014j5390k79J9504J3722n382k3808
14611d6612j699N220j441J5216k204m408J187J1007J3707m321j7566r260Q742
14598c2432J0561j0196n688K1661O754o564q550m679P449Q558r327j1671q105
14585d2229J297j503J5121J2555K637j285K64P875J711K57j6734k3975r212R482
14571d3739J3286J140k976Q749K744l059N391j633L353J1451P725J638j7378j0994
$$ y = [-660, 40, -10328, -13213, -9514, -6141, -11524, -19712, -3162, -11738, -31964, -38805, -41756, -32415, -9228, -13618, -23876, -33821, -50752, -50384, -38612, -14809, 3281, 9059, 16208, -8352, -21532, -20666, -24253, -21284, -22735, -32569, -27956, -11795, -8038, -23584, -35014, -43399, -42259, -31467, -30307, -26634, -25589, -27038, -24353, -12971, -17965, -34979, -50369, -50648, -31144, -17422, -22804, -46612, -48311, -43091, -44532, -29316, -31520, -35928, -34741, -23734, -10027, -14348, -31914, -41174, -32432, -21871, -32067, -37755, -16094, -9340, -15904, -24454, -29133, -21684, -13126, -22453, -34124, -42229, -40932, -42435, -27314, -14759, -12122, -13407, -13143, -5268, -3557, -3300, -20034, -44009, -53221, -43739, -30453, -29313, -32289, -23540, -20796, -23855, -18464, -20097, -16744, -5293, 2432, 4070, -13308, -24302]
14557b4302j1051J992L07J3409J747K935O52N530l330K600j225n721j822m593
14543b2872k61O741m143r249M041Q049L121o794J871q434J0876J5621j883K753
14529e63O893j697j4380j0932j4275P081P238J6599j426o090q81J7554P424j1478
14515A067q919L025K802p936o407p840l076M141n920o980k78K2066N086J3680
14501D511N015j2823J0163j4042n492J589j940M828q463j0347Q093K759R501l117
14487i765q2k688q032m548J4729J4866R629j2076q204J825m894j2598j776J880
14473b1734J7173P147k434m570m269m36o598J00j9763m685J304J2373L26m530
14459c0596N313m56m965L053Q92Q435Q681M271q091p686M41m068j09j3593J9141
$$ y = [-24302, -35353, -33361, -33054, -19645, -17898, -14963, -14311, -8781, -12111, -9511, -10736, -16457, -18279, -22872, -23133, -16392, -20535, -29784, -25743, -17694, -14573, -21367, -19496, -27930, -17054, -1433, -3316, -563, 6330, 4633, -9747, -20679, -34954, -27873, -20635, -4036, -5462, -11552, -12433, 5121, 12545, 1067, -7852, -4827, -2025, -9961, -16368, -24208, -27284, -23143, -29063, -36043, -36321, -14255, -9169, 4511, 9526, -3297, 6866, -7176, -12668, -11079, -13019, -8191, -16654, -27001, -18908, -16149, -6648, -9765, -9847, -12535, -20567, -25115, -10386, 4480, 14109, 2033, -6171, -4346, -9240, -21838, -23614, -21734, -4561, 2586, 152, -4418, -8687, -9123, -15721, -15621, -35384, -40069, -38765, -26392, -26066, -30596, -25283, -25739, -30704, -27651, -26759, -18324, -9643, -5372, -13463, -21149, -20708, -24776, -24885, -38478, -19337]
14444a9337J0203p675p762J355j857j422n688O097N354J3087J4183Q720j5131
14431A27j0369J2848R79m346r96j4854k2363r897P950M823J0296J1132J1469K86
14417b915j1940j4754p477N690J2308R971J0197j3689j8260J946P870P479J939
14404a1635M782o65K394n166N14q68R042J129l432j4438j3633J785K3263m251
14390a1179j5848n648R694q615k425J3857J3339Q353m989O905n157m01l916l126
14376i156j8801k196J9913K38r019j1951n84O443j845N296Q300J1552k277l575
14362g662P37O044M74o309N023R926O645m338m012J233J901p596j9898l789N347
14347a6274m180o200N448J151k061P063J600K435J2050L862L356j1203r79n207
$$ y = [-19337, -9134, -16809, -24571, -23216, -25073, -26495, -32183, -26086, -20732, -7645, 6538, 15258, 127, -10242, 2606, 3585, -761, -1757, -16611, -38974, -48871, -40921, -36098, -25802, -14670, -3201, -2915, -14855, -29609, -37086, -31396, -19088, -9117, 1080, -12609, -30869, -28923, -21053, -13574, -11635, -6853, -7518, -5124, -10290, -9776, -10644, -1602, -473, -3905, -18343, -31976, -30191, -6928, -11179, -27027, -32675, -22981, -31596, -34021, -20164, -6825, 1528, -3461, 3444, -1713, -2114, -6030, -9156, -27957, -30153, -10240, -10002, -19021, -30972, -31556, -25113, -26958, -21662, -13362, -1810, -4087, -7662, -6925, -881, -407, -6716, -1693, 8233, 14878, 10540, 6528, 7761, 9662, 2066, -17832, -21621, -16274, -20454, -26654, -21206, -20055, -22116, -15053, -13453, -11018, 1032, 4894, 8250, -2953, -3932, -9139]
14333i139o406N228L629P978N629Q97l444n467j3252l323j791o098o376j740J2418
14318b1257J4374j4757p058P742m133L707J212m822P65L13m857L358Q604J4215
14304b594j3634L623J4125o112n200j753J0220l267J268J0578j4574j6147k210
14291b5677J3255N026j1351M557J891p453J5762o385j0867J5456J6328j052j5244
14278e754o324J358j489j1576j582N546J0502K353K466p068p654q982Q373Q739
14264a1092J743J254o390n000j4513l908K6806o48J031P08o963p257j2557M612
14250c2174p704K567J5700L272n015p665k460Q324J932r019L325J8753K536p543
14236a5171J2354K0559L373q96j1406j2438k2003Q894K617j4260j379J2158J1046
$$ y = [-9139, -15545, -10317, -6688, 1290, 6919, 7816, 4372, -1095, -14347, -17670, -19461, -25559, -31935, -33675, -21257, -6883, -21640, -28698, -20956, -25089, -21382, -20170, -24992, -24227, -23914, -28771, -25413, -16809, -2594, -16228, -12605, 1520, -4592, -9792, -11545, -1325, -4592, -3324, 7254, -7320, -23467, -25677, -12422, -7396, -18747, -14190, -12299, -19752, -3990, -10375, -21242, -5786, 10542, 9490, -5754, -12078, -10720, -12209, -23785, -25367, -19821, -9319, -6966, -4500, -11568, -19222, -28204, -19831, -11092, -9349, -8095, -14485, -19485, -33998, -37906, -11100, -11748, -10717, -10009, -16972, -24229, -36786, -32174, -39878, -37311, -21611, -18339, -23354, -31019, -33479, -25155, -23223, -32242, -28917, -10164, -7628, -15171, -2817, 17742, 21115, 20219, 8813, -3625, -25628, -16734, -14117, -28377, -29756, -17598, -6552]
14223f552r54j258K29p222L872o461N309l56n120J0951M310L458n120p563j8963
14208c1440j5068N991N510M353L08q872N996k15j327J3463M367N198O105L951
14194a680r706j5164k535P27R49J7688J315k990K013p878p490m650K226P768R723
14179i684N559L177j0204j6565j7272m013l035J0633K9713p227l552K18l038j415
14165b6705j3347J0308O236J5295O246r625m78l345q459j720j366L527O891N384
14151a1158Q482Q045l741K547M288o397r244o539N079J0106J1611j6806j902q90
14137f519p201Q270q51j342L954j8004j5167q28J7047L464j0054L752R86Q37k121
14122b3777R077k520n035J27j795K192M886o047j2195j7342r835J6582J6016J0592
$$ y = [-6552, -7506, -8764, -8535, -15757, -11885, -18346, -13037, -13393, -18513, -7562, -3252, 206, -4914, -12477, -31440, -46508, -40517, -35007, -30654, -30346, -39218, -33222, -33437, -34764, -21301, -16934, -11736, -5631, -1680, -11386, -26550, -29085, -28358, -27409, -9721, -8406, -11396, -9383, -17261, -24751, -29401, -27175, -19407, -9684, -4125, -948, -11152, -27717, -44989, -49002, -52037, -41404, -11691, -18918, -22470, -22252, -25290, -26705, -40052, -29744, -23508, -8213, -1967, -11592, -12070, -15415, -23874, -25594, -26960, -23433, -16542, -11158, -2676, 5369, 1628, 4175, 8463, 2066, -7178, -13717, -8638, 1468, 13079, -3727, -5629, -6519, -13720, -5450, -6301, -7643, -3689, -21693, -36860, -37688, -20641, -17177, -27231, -23479, -22493, -21656, -23777, -14700, -17220, -22255, -22128, -23923, -21731, -16845, -22892, -35087, -52429, -62264, -45682, -29666, -19074]
14108a9074K944j0828j1000J0001J0504Q616K346K962M603o26O46K107q261j1210
14094a6270k711j803P100N952r445O763o975j3322q734R837J2837P72K741O760
14080f498j4320o007N272J4473J234q151l162J956J3767j498j8996j2424N551
14067b8803J4368O571M157j752n414J4160k946P37P032j2114j3883j1758o874
14054c6519L618K0068R97R264r82j3242q264K651Q655m563r470j3172R43J5382
14040b4634M034k089Q290o762k365P684o58K204m854L219J1269N06j678L139Q54
14025a841j4465j0483O328J6347l848k5506n690L412L559k442J2441K1499j1444
14012a2133l382o417j919J900M87p18J2456R145J253R923j7964l4018M52N196
$$ y = [-19074, -16130, -26958, -37958, -27957, -17453, -8837, -6491, -3529, 1074, 448, 1094, 3201, -5060, -16270, -18981, -20784, -13684, -7732, -17177, -10414, -17389, -30711, -39445, -29608, -16771, -15999, -13258, -6498, -20818, -26825, -21553, -7080, -5846, -13997, -17159, -15203, -1436, -2934, -21930, -34354, -28803, -14435, -7864, -3707, -5459, -10873, 3287, 341, 1078, 8110, -4004, -17887, -29645, -36519, -32901, -12833, -11836, -2572, -3554, -16796, -25060, -22409, -13754, -18317, -27787, -40959, -40016, -24634, -20600, -22689, -14399, -21161, -23526, -15842, -16500, -14296, -19150, -15931, -4662, -4156, -5834, -2695, -1841, -16306, -26789, -20461, -4114, -7962, -33468, -39158, -35746, -32187, -34629, -22188, -689, -12133, -15515, -21932, -23851, -21951, -21464, -22182, -9726, -581, 672, 10595, -7369, -41387, -40935, -35739]
13998c5739n749L196J6110J272M032L319j449m415k503M591l402o002N64J9888
13984f287M285j4352j4010J7276K2873J0945j7141r358m104j4870K091P026p41
13971a6367J057J0028n857J860j7762j9528L878o144R639J9983J2961q080j0244
13958b4576r445p468Q962J2737j50J904o991j8605l506L392J1242J3489q46R466
13944a0395J0641j0859j0289J810J2464M674q521o622q090J6883J973j0892j3738
13931c0961N908k751j5235m319K1886J6237n166n134Q468N919N933O966J231l954
13917E028l259q434L788m341j1632j1739k186N205r667J4361P279k792o15j961
13903b0965l92j082p521M584P347K188q196K763j484j3471r972L473m755J1326
$$ y = [-35739, -41488, -38292, -22182, -20910, -16878, -13559, -15008, -19423, -21926, -17335, -20737, -26739, -26175, -6287, -2002, -16354, -30364, -13088, 9785, 20730, 3589, -5769, -9873, -24743, -22652, -15626, -16367, -15310, -5282, -11139, -9279, -27041, -46569, -42691, -48835, -39196, -19213, -6252, -14332, -24576, -34021, -41489, -32527, -19790, -19940, -18036, -25027, -43632, -47138, -43746, -32504, -19015, -19861, -10395, 246, -10613, -20902, -19092, -6628, -1954, -10475, -17097, -25187, -8304, -6331, -17223, -30961, -25053, -27804, -43039, -47358, -25472, -9235, -14401, -19535, -11067, -5148, 785, 7751, 8982, 5028, 1769, -6665, -2877, -7218, -18850, -30589, -32775, -27570, -37237, -22876, -15597, -18389, -19004, -20965, -21357, -22439, -29960, -25376, -18029, -15841, -24037, -21274, -22758, -36229, -46201, -42728, -47483, -36157]
13889c6157K1303J168j0328J1359J0262J340k141o683j124m742J3194r53r776
13876a3278O454L714j383j0612J0916K768K382P865J662j2412j829J2648K39k970
13862F164m333j4935n034J4153R801O729j545o843j2579m407j8617O788l575j1934
13848d0167n07J5468R991o782P956p998K446J2393q826M641O506k989J8646m841
13834E937r278m155j3254P669O99o338j4959n854J0000k417m09J6077J597o545
13820b1230L829k128n560R785P639N401j4303l022m82J062J0557k461j7583n317
13806c3813J2103m368O512M84K89j1222k944l351J0580J5013J4602j0575r838
13793a6528q042j120r74M804p55M866P114M188m977M776k825R37J1542K1102j0580
$$ y = [-36157, -14854, -13686, -24014, -12655, -2393, -1053, -3194, -9877, -11001, -15743, -2549, -3502, -13278, -6824, -3110, -4493, -15105, -4189, -1421, 961, 8826, 10488, -1924, -3753, 8895, 9134, 6164, 1831, -13104, -18138, -3985, 5816, 12545, 11000, 4157, -8422, -12829, -31446, -24658, -28233, -40167, -40674, -25206, -15215, -21997, -14041, -22039, -19593, -7200, -16026, -11385, -4879, -7868, 10778, 5937, -3341, -7496, -20750, -13081, -12382, -18720, -33679, -39533, -29533, -31950, -32359, -16282, -14685, -21230, -17401, -19529, -25089, -15304, -7665, -2264, -16567, -19589, -20071, -19009, -8452, -10913, -28496, -33813, -21710, -26078, -19566, -19082, -18793, -30015, -32959, -36310, -25730, -10717, 3885, -6690, -16528, -24570, -25690, -26664, -21860, -22615, -17749, -10635, -6447, -11424, -6648, -9473, -8536, 3006, 24108, 13528]
13778A3528p797K570p19k0046n426J7651Q012P467J349Q813k54m62j1269k0693
13764g276o291O321J1941n350l350M004L57j1700j14J2703J8710j2815k2551n014
13750b0425L155J714P684j547R982q034j0640K603K040P154k027L390L952m628
13736e627r460p281p041L317P357Q427N495Q316r90k0297n522m858O516J1533
13722a0115p37J642m0o664J64J516Q019j4057n784K434m012k649R597O685m377
13707a8378K787P549l276Q616J617k787p944k0270n964N450Q289J3175O883O723
13693B470j0827o48k718R172J6858j2337j8563N922J0150p438j2938J4483P747
13680A333J2632q239n465L994m477o594j1596Q115n066K968J2845n453j9148j3649
$$ y = [13528, 5731, 8301, 7582, -12464, -17890, -239, 7773, 15240, 16589, 25402, 25148, 24686, 13417, -7276, -13567, -7246, 4695, -655, -4005, -1, 356, -11344, -11458, 1245, 19955, 7140, -15411, -20425, -17270, -15556, -7872, -9419, 563, -7471, -18111, -15508, -13468, -6314, -8341, -4951, -999, -5627, -15087, -22368, -29409, -26092, -18735, -10308, -4813, 3503, 2513, -17784, -23306, -28164, -21648, -10115, -10852, -9210, -9250, -15914, -15750, -14234, -6215, -20272, -26056, -23622, -27634, -30283, -20686, -14001, -18378, -15591, -8042, -11318, -2702, -1085, -3872, -11816, -32086, -38050, -32600, -24311, -11136, -4253, 2470, -8357, -9005, -11723, -2551, 14307, 1970, -16593, -10671, -521, -7959, -20897, -6414, 1333, 13965, 5726, 261, 4255, -222, -6816, -18412, -10297, -15363, -12395, 450, -5003, -24151, -37800]
13666c7800O247p36m189J7690J1850k2684j8998J1385J3061n421O65j788J5001
13653a5717K228R362q48K395j940m390K570q31j906q430j116Q384k58p47Q289
13638b955k896p870m554P382R086m956r612J2273n44j51N841j0901r247O667K080
13623a0357j135m399M934L1671K363j5766j3601j2415J4056O139r821q868j2278
13610b9477q784P83R648R574O653n1k295K144N930o535j0286j379J1493J647p302
13595a8237m482m989m082J0172J0523M968P619p535j7860r537j015L043K332j239
13581c0319j439M623O067M766l36O74J4907p261q927m754J442J0684L869O380
13567C76j2680K506K0602k005n714M503p225j9192r513J2677O054Q637q661K403
$$ y = [-37800, -31553, -32289, -36478, -18788, -6938, -29622, -48620, -37235, -24174, -29595, -28930, -30718, -15717, -13489, -4127, -4975, -2580, -4520, -8910, -6340, -7171, -9077, -17507, -18623, -10239, -10497, -11244, -2955, -5851, -13721, -18275, -10893, -1807, -6763, -16375, -4102, -4646, -4797, 1044, -9857, -19104, -12437, -10357, -11492, -15891, -10957, 20714, 23077, 7311, -6290, -18705, -4649, 1490, -8331, -17199, -29477, -38261, -37478, -27830, -18256, -11603, -11654, -13949, -11805, -5875, -12410, -22696, -24075, -12582, -10935, -18237, -22719, -27708, -31790, -21618, -11095, -6127, 1492, -6043, -23903, -33440, -34455, -31412, -29080, -30319, -31758, -27135, -21068, -16302, -16638, -15964, -1057, -8318, -17245, -21999, -20557, -9873, -6004, 376, -12304, -9798, 10804, 8799, 3085, 7588, 363, -18829, -28342, -15665, -9611, -974, -9635, -7232]
13553g232R512o448m565J267N033j0563l125O759K073r226q326j073J4506J7205
13539E797m012l418n310o64J3770r336j1212k832J0213o423l701K554j559L19
13525a5814k134M987l007q71M058r339R369R039K418J177m35p223R313j307k1162
13510b0931J579J348J388j99p383R117q113j165J2144N70Q92K307K110q197j0450
13495b4983P358J6889J1122r920j533q22N605P45j0176p305N795r81q282P735
13481h753R832m103q058o069O998M99j0367o048q046l572J0445n5J6862M178k2024
13466b8281R574J6657n328n68k723J0657r581j756R104K0197J3304j2876r514
13453H866R742J2589p447j6773Q6j0014j2431l531k290k949J6046J0801m643j4241
$$ y = [-7232, 2280, -4168, -8733, -7466, -2433, -12996, -16121, -9362, -7289, -16515, -24841, -25914, -11408, 5797, 1785, -1633, -6943, -7607, 6163, -3173, -14385, -17217, -7004, -13427, -17128, -14574, -16133, -15814, -17948, -12961, -15968, -16839, -12781, -22120, -12751, -3712, -1294, -117, -552, -7775, 1538, 231, -20931, -19352, -18004, -16616, -16815, -24198, -15081, -23194, -24359, -12215, -11645, -10753, -8446, -6336, -14533, -24983, -17625, -736, 10386, 466, -1067, -1889, 3716, 4461, -5715, -13020, -7225, -8206, -16488, -8753, 1079, -3024, -11082, -17151, -10153, -9654, -20021, -26069, -34115, -37687, -27242, -27297, -10435, -6257, -28281, -18707, -2050, -7378, -7946, -10669, -12, -9593, -11349, -2245, 17952, 31256, 18380, 8866, 18608, 31197, 23750, 6977, 7063, -2951, -15382, -18913, -21203, -24152, -8106, 2695, -1948, -16189]
13439a6189l177K110N39P916J6913p522k0662K965K2814J1558l298j6076j5127
13426a7236k099k026K537P505K0107m859q110j0769L371J1778L841m37o129j1241
13412a3767M985k654j1487P532J436M85L47j2539j584N692J7445q61p045o982
13398a8997J0463P720j287P985j4116o627o887m255M868k485N194l133R840k317
13384a4034j3916M089J646J217m017L943r440K472J8806R619q880j4311n264K417
13370b5653J8556N763k772R33j1809q511J788L395m949m271J0011K885q594M044
13356a9184q983p100J0348l597o356P479O502q849k297J4555P637O867n741j737
13342a0456K0N279q003j2070L863J873k106J509L848Q867P277N913O324Q15j7014
$$ y = [-16189, -19366, -17256, -16717, -8801, 8112, 590, -20072, -17107, 5707, 17265, 13967, -2109, -17236, -19335, -21361, -18824, -11319, 8788, 3929, -4181, -14950, -11579, 199, 4040, 3603, -2526, -13767, -8782, -11436, -22923, -15391, -13955, -13470, -13123, -25662, -27246, -21554, -4109, -4970, -12015, -18997, -8534, -814, -2101, 5884, -8232, -14859, -21746, -26001, -21133, -23618, -18424, -21557, -11717, -14034, -27950, -23861, -22215, -20998, -25015, -21072, -30512, -28040, -9234, 385, -8495, -22806, -28070, -25653, -7097, -1334, -4106, -3173, -14982, -23493, -21705, -18310, -23259, -27530, -17519, -14634, -23228, -19184, -28167, -35267, -24919, -28516, -34872, -27393, -20891, -29740, -32037, -17482, -9845, -2978, -8719, -10456, -10436, -5157, -13160, -25230, -21367, -19494, -21600, -20091, -16243, -7376, -99, 5814, 12138, 12953, -4061]
13327d061oJ4055Q3m460j9433J134J1111j411o810Q850M770L371q788J659M638
13312D702M603l331m240J069Q11k762R45N105j750K482l09q089Q044m085j7980
13297a4785n560R517J3056l125O894J7041j23r972M779l330p670o326o724q333
13283a4661L571r252N367o954j0828n584Q269P831J3518Q470K851J740q65l203
13269B70j433j576J0176L329o351j290N75Q745n675j4895o651q962N748m465N184
13254a7271k553P122R447k333l953p732O372R347N491J1129R32j9720n884M774
13240d832j836L207m209O01n427k819m187n494q181M935J1046p58k43Q67P601
13225i729J879j6828P021L295M11P732R167P104M839q46p335n205N466n237o425
$$ y = [-4061, -4067, 9988, 10071, 5611, -13822, -12688, -1577, -2988, -9798, -948, 3822, 7193, -1595, 64, 4702, 9305, 5974, 1734, 2803, 3614, 852, 1797, 6902, 5152, 7634, 7325, -764, 7280, 3195, -14785, -20345, -10828, 2228, -897, 5997, 23038, 22915, 12943, 17722, 14392, 6722, 396, -6328, -14661, -11090, -20342, -14975, -21929, -32757, -38341, -30072, -22241, -8723, -253, 2598, 4338, 3473, 270, -1163, -2739, 7437, 10766, 4415, 3125, 3700, 12445, 6770, -8125, -14776, -23738, -17990, -22455, -17271, -19824, -12702, -3255, -5588, -9541, -17273, -10901, -1554, 3937, 15066, 15998, -3722, -9606, -4832, -6668, -3461, -7670, -7069, -12496, -15315, -19502, -24996, -33177, -28242, -17196, -17954, -18197, -17330, -9729, -7850, -24678, -17657, -14362, -13951, -6219, 2948, 10052, 14891, 14045, 6710, 1505, 6971, 1734, -4691]
13210d691j8613k673L094L120o81l282Q938R005N821R481J1138j1076l161j308
13196E112K143o222q379k372J740J596K093j1295p197l700L149N980J0894P780
13182A322K497M582J1813N909O582j2091K688o540o288j9973j1404j29J6042M542
13168d48o513P631N478l78k1735k119J2814Q962J0404J2138j4740j2977O624K64
13154E405j495l62n850P250n794n227m264p456K880J2651M121l65o955r994K0828
13139E373M659p106l152j2856p595J1986M945L220P323J232q568j880J0351J251
13125I183l141l058l143N299O837j233j0899k2017p472K3756l672k155J0968q869
13111i616Q300J1469o964j1681j6198L520J9797Q389M322J748n184K637o87J700
$$ y = [-4691, -23304, -25977, -22883, -19763, -20444, -23726, -14788, -5783, 38, 9519, 20657, 9581, 6420, 5112, 7255, 1033, -7346, -9718, -7978, -6382, -4289, -15584, -22781, -26481, -23332, -17352, -6458, 1322, 3819, 8401, 20214, 26123, 32705, 20614, 23302, 16762, 10474, -9499, -20903, -21032, -4990, -448, -6961, 670, 6148, 5770, -15965, -18084, -5270, 3692, 14096, 26234, 11494, -1483, 5141, 5405, 3910, 3548, -2302, 4948, -846, -6073, -10337, -17793, -14913, -2262, 1859, 1494, -5461, -15455, 5373, 10032, 2926, -226, -13082, -20677, -8691, -3746, -526, 6797, 8029, -539, -2419, 7932, 9183, 6042, 2984, -159, 5140, 11977, 10744, -155, -22172, -29644, -5888, -9560, -11715, -747, -9616, -1316, 10153, 3189, -8492, -24690, -21170, -1373, 7016, 11338, 13086, 7902, 10539, 9852, 11552]
13097A1552J2708p27o211j0394L101n260k436N720P130l689j6585L601n125k933
13083i548N589P497l313J0064O728j6023k297L202N23j3378o134O046L669j3240
13069b0615q596R986Q113J2641o12R803M877n191q206L046L598J80l102m447N699
13054G174R617L487q58J349k931R831O407j3252j5889J051M94r524K890P657j527
13039E976l799l999O693K994Q42J2262j1870m141K778l877k396J6433K308r717
13025A0487o013q503J2600K1703J4410J717j1452q825j1869k399L923p478m047
13012D254L545l06j0987j0638M542j16J1173R054j376o674l734m946j2427Q739
12998i897P929J1823R874M816k673j2949k12n439j8491N797Q843r964L077p363
$$ y = [11552, 24260, 23533, 17322, 6928, 10029, 4769, 2333, 8053, 15183, 11494, -5091, -1490, -6615, -9548, -3959, 3538, 225, 10289, 17017, 994, -1303, 1899, 2422, -10956, -17090, -11044, -7375, -20615, -29211, -19225, -11112, 1529, 917, 10720, 15597, 10406, 2200, 5246, 8844, 9024, 5922, 1475, 7174, 16791, 20278, 19420, 20769, 17838, 27669, 34076, 20824, 4935, 5986, 6480, -3044, -154, 7503, 5976, 2177, -1822, 4871, 7865, 8707, 20969, 9099, 4958, 7736, 3859, 1463, 17896, 20204, 10487, 4474, -4029, 8571, 30274, 44684, 46401, 34949, 26124, 14255, 11856, 15779, 8301, 4254, 7799, 7493, -3494, -14132, -9590, -9706, 1467, 10521, 9145, 2471, -1263, -6209, -18636, -9897, -1968, 9855, 19729, 24545, 21872, 8923, 8711, 3272, -15219, -9422, -579, -10543, -7466, -14829]
12984a4829n45J104J7566J9126j2188n432J12p368k579J3829o60M211m095l883
12970D369P77J8745K800j804j9386n917L402J4205o427q677J1275Q915M000r57
12956B5320j2128O092R905o768j6240m370J4925l76l143K057p494J1660l03q014
12942A1123j845k579M741J5163J441j6313Q443j265p309J1470J842k675O311q093
12928B0455j3305r986P235N191r729K724J432n892K530N002L043N258O57n424
12914I191p242j300j421R309r898K863K029O404l366k991M111O830j1207O770
12900A0082j106j1480J46j1609n094O179J1620R067j266N722Q735P838K641j5052
12886A6423j3296R15M619o642R161J1375j676k655J4762l242r714J1214J259l052
$$ y = [-14829, -15374, -14270, 3296, 22422, 10234, 4802, 4914, -2454, -5033, 8796, 8136, 12347, 8252, 4369, 5146, 23891, 26691, 24887, 5501, -416, 2986, 17191, 10764, 2087, 13362, 22277, 26277, 25320, 13192, 19284, 29189, 22421, 6181, 1811, 16736, 16360, 13217, 15274, 7780, 19440, 19137, 11123, 9278, 6699, 11440, 26603, 28044, 11731, 20174, 18909, 11600, 23070, 24912, 22237, 28548, 20455, 7150, -2836, 4399, 9590, -139, 2585, 4017, -1875, 655, 5657, 8700, 13958, 14615, 9191, 1949, 649, -772, 8537, -1361, 1502, 3531, 9935, 6569, 3578, 7689, 14519, 3312, 10082, 8976, -2504, -2358, -13967, -19061, -12882, -1262, 7805, 6539, 12261, 20996, 28834, 31475, 16423, 3127, 4042, 8661, 2019, 11180, 22555, 20879, 18224, 32986, 29744, 20030, 31244, 32503, 29451]
12872B9451Q449O750P638Q945j0629r74q4J113R147J4248J6598O41K1622J5771
12858A28686K0107K2508L3420O7416Q9342R6123J20270J45192J09752Q3477M9448
12847I65741o493o0482r4395j26651j06222j01719j04822p0029l5053k7749k4513
12836B07613r887j0851k6847j6335J847k866j6092j0832K15O864p766j1526R132
12823A12669K677j2568k1266k989j53K91O730P194j3219j2811J2262o963j6214
12810E5640J5064P764K013m552R457k005j4165j3201q73l647j0397L302P331o621
12796D5110R674j961k894k6j4349j023J5807n190j1784J8687J3366o828j4796
12783D3793R169R517P567l145k164M241M627M365r022n163j3052J487o832m038
$$ y = [29451, 37900, 44650, 52288, 61233, 50604, 49630, 49546, 50659, 59806, 74054, 90652, 91293, 112915, 128686, 148793, 171301, 204721, 272137, 361479, 457602, 577872, 723064, 832816, 916293, 965741, 959248, 898766, 804371, 677720, 571498, 469779, 364957, 294928, 259875, 232126, 207613, 197726, 186875, 160028, 143693, 145540, 142674, 126582, 115750, 115965, 122829, 115063, 103537, 112669, 115346, 102778, 81512, 78523, 78370, 78661, 85391, 92585, 79366, 66555, 78817, 71854, 55640, 70704, 78468, 80481, 75929, 85386, 83381, 69216, 56015, 55142, 51495, 41098, 44400, 51731, 45110, 54784, 52823, 49929, 49903, 35554, 34531, 50338, 45148, 33364, 52051, 65417, 58589, 43793, 52962, 62479, 70046, 66901, 64737, 68978, 73605, 77970, 68948, 63785, 50733, 52220, 45388, 41350]
12769D1350k216n234L34J2509q885o952N647J7312j1742l781J0629J5174o38j1979
12755E1528m161n077l862R232J202L146J1479m887j4002r192o230l676N752Q100
12741C9352m750K848J0124n925Q326J9757J642j3291j479M657j768r259q580l871
12727C7783n961K100M024o021r392q737p189k6J5304K2870R641q95l260r706j875
12712C8660L360j2395o973Q924R204J3318O064j0920P677J1695k176J1964P150
12699H5552j2812j3339o390J444K1729J605j0570n792J2978R285K0654N598M272
12686A14214J2973K1943J2552K2949K0171J4813J0018m711l033j2318j3227j8968
12674A77376j4959k0468j4691j8297j5184l519J33l242q275K90L142J2315N009
$$ y = [41350, 39134, 33900, 34234, 46743, 37858, 30906, 36553, 53865, 42123, 38342, 48971, 64145, 63507, 51528, 47367, 42290, 38428, 47660, 48862, 52008, 63487, 58600, 44598, 35406, 29176, 25500, 31252, 39352, 34602, 37450, 47574, 41649, 49975, 69732, 71374, 58083, 56604, 61261, 59493, 50234, 41654, 37783, 31822, 33922, 37946, 31925, 22533, 13796, 6607, 6581, 21885, 44755, 54396, 53501, 50241, 40535, 38660, 42020, 29625, 22652, 31576, 40780, 54098, 60162, 49242, 56919, 68614, 66438, 78402, 85552, 72740, 59401, 53011, 54455, 76184, 77789, 67219, 61427, 74405, 83690, 104344, 109942, 114214, 127187, 149130, 161682, 184631, 204802, 219615, 229633, 224922, 221889, 209571, 196344, 177376, 162417, 141949, 127258, 108961, 93777, 90258, 90391, 87149, 78874, 79164, 82306, 94621, 99630]
12661I9630p770o529N107J3142L952l531k731J7244M313k164L084J8743n211j8085
12647A19194m542J5110J1190N601k538K747N582j146k582O666j6168r180j3966
12634A15968o670R285m240j1338N620k583o087j1087N371J9492K7545J392r301
12621A33367l198k2146k2877o774j955j0713j5920o037N750J1567R888P263P42
12608G8957q583p27P772M811m551j1387q57J3793r54k143o964j0221J3677M865
12594G7488K89L378P255M022P063r709J0875J6252j1462q56J551J4107J2579r921
12580A22911k421o270k988r3J1855K681j769J2651J3181K0787L0807K5773J4903
12567B42008K2821M278J7106K3800L0402L6907M5630P2395Q2383R9756J40155
$$ y = [99630, 91860, 85331, 90438, 103580, 107532, 104001, 101270, 118514, 122827, 120663, 123747, 142490, 137279, 119194, 114652, 129762, 140952, 146553, 144015, 146762, 152344, 151198, 148616, 155282, 139114, 129934, 115968, 109298, 118583, 114343, 103005, 108625, 106042, 99955, 88868, 94239, 113731, 141276, 142668, 133367, 130169, 108023, 85146, 78372, 76417, 65704, 49784, 43747, 49497, 61064, 70952, 78215, 78957, 70374, 69647, 77419, 82230, 77679, 66292, 65435, 79228, 78274, 76131, 69167, 58946, 72623, 77488, 77777, 81155, 88410, 92432, 99495, 89786, 100661, 116913, 105451, 104595, 106146, 120253, 132832, 122911, 120490, 114220, 111232, 111139, 122994, 125675, 123906, 136557, 149738, 170525, 201332, 227105, 242008, 264829, 269107, 286213, 310013, 340415, 377322, 422952, 495347, 577730, 677486, 817641]
12556H17641J37199R9141P4778M4686J976l5619p2258r5404q8374r0246p4644
12545G18876m5155j9980o339J5463J8821J5354P000M374j6052k3253j6452j0676
12533F41981k2462j1304J7446L525O940p79J0130J1414k116m999m839j5699P462
12520F36700M099J5089J1062n195j396m200k037m717j7053j5622k372N810J681
12507F21849J0664K9747K4440L1456L8185N2875O1383P6754J00938J13142P0752
12496A232185O9695L7162k3392n7905n8977o3711o3950n5764j4676q14K3365K8734
12484A051952L3824L5669J3639K1241L2657K8937J1314J8525R100j133Q483Q517
12472A272725Q591K1519J5436J4835L7069M9954N5364M6166N7727P0338P1879
$$ y = [817641, 954840, 1053981, 1128759, 1173445, 1175421, 1139802, 1067544, 972140, 883766, 793520, 718876, 673721, 653741, 647402, 662865, 681686, 697040, 704040, 708414, 692362, 669109, 652657, 641981, 619519, 608215, 625661, 629186, 636126, 635347, 645477, 656891, 654775, 649776, 644937, 629238, 636700, 640799, 655888, 666950, 661755, 660359, 656159, 654122, 649405, 632352, 616730, 614358, 620168, 621849, 632513, 662260, 686700, 718156, 756341, 809216, 870599, 947353, 1048291, 1161433, 1232185, 1301880, 1339042, 1315650, 1257745, 1198768, 1135057, 1071107, 1015343, 1000667, 999853, 1023218, 1051952, 1085776, 1121445, 1135084, 1156325, 1188982, 1217919, 1229233, 1247758, 1256858, 1255725, 1264208, 1272725, 1281316, 1302835, 1318271, 1333106, 1370175, 1420129, 1475493, 1521659, 1579386, 1649724, 1721603]
12461A721603Q1172R6449J15629J16184J39978J69690J94231K10091K30577K29441
12451C305045K42310K82025L36542M33834N73154P03228Q00779R34005J075766
12442H686688J232515J424885J709609K121935K816349L884804N617718Q453149
12434C5947652J2693213J8013968K3086730K6024594K5587016K2175047J5985585
12427A79513805O368651n240928j4916909k0434558k2901540k3170576k0549275
12420G8668670j5682981j0923497p491216n274830l854381k922798k323054j936639
12412B8259274j700522j535228j427123j356615j276131j167200j065260r65727
12404A7765468q63781p72803o93641o40787n89385n31718m82571m75810m43911
$$ y = [1721603, 1802775, 1899224, 2014853, 2131037, 2271015, 2440705, 2634936, 2845027, 3075604, 3305045, 3547355, 3829380, 4165922, 4599756, 5172910, 5876138, 6676917, 7610922, 8686688, 9919203, 11344088, 13053697, 15175632, 17991981, 21876785, 27494503, 35947652, 48640865, 66654833, 89741563, 115766157, 141353173, 163528220, 179513805, 185882456, 180641528, 165724619, 145290061, 122388521, 99217945, 78668670, 62985689, 52062192, 44570976, 39296146, 35441765, 32518967, 30195913, 28259274, 26558752, 25023524, 23596401, 22239786, 20963655, 19796455, 18731195, 17765468, 16901687, 16128884, 15435243, 14794456, 14205071, 13673353, 13190782, 12714972, 12271061]
12395A2271061m29549m13904l70592l68777l52892l31405l12158k78835k72488
12386I140461k59208k53380k43090k39020k29465k07839k05866k19466j92124
12377G091003j78419j61709j46060j61635j50853j29409j23034j32439j10392
12368E797053j15848j20366j04608r3242q9728q9235q9845r2776q7606p7192r0623
12357D745984r9699j03590q0264q0920r4323p7477p7028q0872r5004q3076p7793
12346C795938r4397o5673p4457p9702q2675q6936q7182n6304o8072o6095p3580
12335B960865o3528o2860m1890l2945n5550l4859l6125n9262m6998l4005l8669
12324B454174m5732l0167l4451k6911l4316k5757l5328l0273k2531m4323k9078
$$ y = [12271061, 11841512, 11427608, 11057016, 10688239, 10335347, 10003942, 9691784, 9412949, 9140461, 8881253, 8627873, 8384783, 8145763, 7916298, 7708459, 7502593, 7283127, 7091003, 6912584, 6750875, 6604815, 6443180, 6292327, 6162918, 6039884, 5907445, 5797053, 5681205, 5560839, 5456231, 5362989, 5273261, 5184026, 5094181, 5001405, 4913799, 4836607, 4745984, 4646285, 4542695, 4462431, 4381511, 4287188, 4209711, 4132683, 4051811, 3956807, 3873731, 3795938, 3701541, 3635868, 3561411, 3481709, 3399034, 3312098, 3224916, 3168612, 3100540, 3034445, 2960865, 2897337, 2834477, 2792587, 2759642, 2704092, 2669233, 2633108, 2573846, 2526848, 2492843, 2454174, 2408442, 2378275, 2343824, 2316913, 2282597, 2256840, 2221512, 2191239, 2168708, 2124385, 2095307]
12313B095307k702m372M13K0703L9502M8105O4426R4304Q7244P3350N5359L9785
12301B611424k73l9901p0405o9006j04321j10782j03888r5210p6223n5852o3044
12290A822519n0741m8414n0050l6543l4382j7464l2264l3100k962k1203k962j7100
12278A475334j9369j1923k4864k3068k8180l5869l0042k9413o242o821K908l891
12266A258560j3332j1166l970j7799l4344l8620l5297k0717j759j4067k7559n260
12254A034670k71n665j792l259k708o217o506k3118k6127k7095m030n843j0976
12241I11063o899n886j7701L01q345l2608k0695o183k0468r893l0J453J5211K3281
12227H22601K8088L1904K8124L3771K7142j1377k9473l8492l4318l1684k8346
$$ y = [2095307, 2092605, 2088233, 2088646, 2109349, 2148851, 2196956, 2261382, 2355686, 2442930, 2516280, 2571639, 2611424, 2611151, 2571250, 2500845, 2431839, 2327518, 2216736, 2112848, 2017638, 1941415, 1885563, 1822519, 1771778, 1723364, 1673314, 1636771, 1602389, 1584925, 1552661, 1519561, 1516599, 1495396, 1492434, 1475334, 1455965, 1444042, 1419178, 1396110, 1367930, 1332061, 1302019, 1272606, 1266364, 1259543, 1262451, 1258560, 1245228, 1234062, 1230092, 1212293, 1177949, 1139329, 1104032, 1083315, 1081556, 1067489, 1039930, 1034670, 1034399, 1028734, 1026942, 1023683, 1020975, 1014758, 1008252, 985134, 959007, 931912, 927882, 922039, 911063, 904164, 898278, 880577, 880878, 872533, 839925, 819230, 813047, 792579, 782686, 782656, 784109, 799320, 822601, 850689, 882593, 910717, 944488, 971630, 960253, 930780, 892288, 857970, 826286, 797940]
12216G97940j8752N877j320L667R066N718J5319K7559L066m453p666r96j4312
12203H20713o482J2062Q521L1140L3472L7579L2523L3661M5899L5020K6143J4389
12191A124640j68K108K429K3540L1155M4799O6846P8346R2695Q4961O8526M0553
12179A660430J3944l2804n0005k9957k2420O012M0086P1287O0132O1502O8570
12168A846777L8644K2567m860k0615k0416j6138l2050l2664k8638k0729J983J6519
12156A750380K9156M9721P1165N9241P0103M2688K3614k7162k6154l0185m0337
12145A972230m1533k6370P968J5792P828J8288K6520M2400M3523M7288M5038P0212
12133B229184J08909J33088J77859K20700K07755K15327J86705J61992J66627
$$ y = [797940, 779188, 785065, 783745, 787412, 796478, 802196, 817515, 845074, 848140, 843687, 836021, 835025, 820713, 814231, 826293, 834814, 865954, 899426, 937005, 969528, 1003189, 1049088, 1084108, 1110251, 1124640, 1124472, 1126580, 1129009, 1152549, 1183704, 1228503, 1295349, 1373695, 1466390, 1551351, 1619877, 1660430, 1674374, 1641570, 1591565, 1561608, 1539188, 1545200, 1585286, 1656573, 1716705, 1778207, 1846777, 1885421, 1907988, 1903128, 1882513, 1862097, 1845959, 1813909, 1781245, 1752607, 1731878, 1733861, 1750380, 1779536, 1829257, 1900422, 1959663, 2029766, 2072454, 2096068, 2068906, 2042752, 2012567, 1972230, 1930697, 1904327, 1912295, 1928087, 1935915, 1954203, 1980723, 2023123, 2066646, 2113934, 2158972, 2229184, 2338093, 2471181, 2649040, 2869740, 3077495, 3292822, 3479527, 3641519, 3808146]
12124C808146J59625J77654K13048K48351L16736L52232L85228L90389L72862
12115F424271L16017K40524J68363J27199J25391J60562K31928L58749N34914
12106H687918P45313J020111J479175K173990L169706M504940O039596P409029
12098C5229778P922132O862131L799050n38430m386091o191317n816374m262843
12090C2618036k594374j330209n27991l2321L29676O99577J102876J506567J696900
12081C3468737J514062R91916L26171j53029k10893J02925N98328J187509J756272
12072C9581998K170490K226101J754228Q43121j47262q02860r66521o62990m563
12063D3991742Q44997J803676K959303M664247P354066J1330117J6185764K0237732
$$ y = [3808146, 3967771, 4145425, 4358473, 4606824, 4923560, 5275792, 5661020, 6051409, 6424271, 6740288, 6980812, 7149175, 7276374, 7401765, 7562327, 7794255, 8153004, 8687918, 9433231, 10453342, 11932517, 14106507, 17276213, 21781153, 27820749, 35229778, 43151910, 50014041, 53813091, 53274661, 48888570, 42697253, 36880879, 32618036, 30023662, 28693453, 28165462, 28133141, 28462817, 29162394, 30265270, 31771837, 33468737, 34982799, 35974715, 36300886, 36147857, 35936964, 36039889, 36638217, 37825726, 39581998, 41752488, 43978589, 45732817, 46575938, 46428676, 45625816, 44659295, 43996305, 43991742, 44836739, 46640415, 49599718, 54263965, 61618031, 72948148, 89133912, 109371644]
12055A09371644K0650576J4984178L785728q589446j6713791j8520536j5921627
12048H9046726j1896234q262168n555212l660381k233093j005108L9336P69218
12040E7243084J046746P51522j05294j216662k146148k495632k271006j728424
12032D9078186j090562n10310q6351Q3871j45457o88021j306597j655971j597284
12023D2081504j280822q49433m44625j29963J65007O75208J592149L110370N036605
12014D9956000O755404P161377N242439J154535l566565o890125q018764p426562
12006D4367739o102534m612201l313691k350054j692491j245400r48654p73598
11998B3329116o75651n85601n32122n01998m91667n30243n52231n97718o44591
$$ y = [109371644, 130022220, 145006398, 148792126, 140202680, 123488889, 104968353, 89046726, 77150492, 68888324, 63333112, 59672731, 57439638, 56434530, 56473866, 57243084, 58289830, 59041352, 58936058, 57719396, 55573248, 53077616, 50806610, 49078186, 47987624, 47477314, 47390963, 47474834, 47329377, 46641356, 45334759, 43678788, 42081504, 40800682, 39951249, 39506624, 39376661, 39541668, 40216876, 41809025, 44919395, 49956000, 56711404, 63872781, 69115220, 70269755, 66703190, 59813065, 51794301, 44367739, 38265205, 33653004, 30339313, 27989259, 26296768, 25051368, 24102714, 23329116, 22653465, 22067864, 21535742, 21033744, 20542077, 20011834, 19459603, 18861885, 18217294]
11989A8217294o74955o57603o43785o02778n44923m89105m22245l99055m05082
11980A3377763m06068m26767m48577m42645m31747l84927l29204k77824k51598
11971I978406k38601k27434k44261k38878k25373j87609j74794j54385j18340
11962H168731r3034p4493p9858p0409o8077r5114j30615j41248j50818j74709
11952G090356j62653j40528j18479r2925p0535p4083n3256m9360n3405l8079n5739
11941F181314o6050p4468r2907j12360j28545j30536j36359j40510j31631q7745
11931E080203o6507l2812k0444m9726q0922j02222r9884j05369j17555j15279
11921D289483j02914p8927o9694r1232o7130p1674p4106p8153n8231n6364n8216
$$ y = [18217294, 17542339, 16884736, 16240951, 15638173, 15093250, 14604145, 14181900, 13782845, 13377763, 12971695, 12544928, 12096351, 11653706, 11221959, 10837032, 10507828, 10230004, 9978406, 9739805, 9512371, 9268110, 9029232, 8803859, 8616250, 8441456, 8287071, 8168731, 8075697, 8001204, 7921346, 7850937, 7782860, 7687746, 7557131, 7415883, 7265065, 7090356, 6927703, 6787175, 6668696, 6575771, 6505236, 6431153, 6377897, 6328537, 6275132, 6237053, 6181314, 6115264, 6040796, 5947889, 5835529, 5706984, 5576448, 5440089, 5299579, 5167948, 5080203, 5013696, 4980884, 4960440, 4910714, 4829792, 4727570, 4627686, 4522317, 4404762, 4289483, 4186569, 4107642, 4037948, 3946716, 3879586, 3807912, 3733806, 3655653, 3597422, 3541058, 3482842]
11910C482842p5437o4537n4697m7585l8630m2321o2799m5964m6366n3646o3229
11899B887631n3294m6637m0978l6561n1533m2814l2030l9537l0096j6370j376
11888B496405m256j3309j8249k9249o1859m1562o1706p2646o3359o1193m5385
11877B023632k8251k5210l6223k9706l4596l7040l3335l3400r693j5936k5417
11866A714825l2396k3488m6471m4784k5454j8323m0105m1840j2434k4738j7814
11855A386978k0036j9209n849j7051l1569k7509k2908o368j8015k7483l4325k9112
11843A127544l022j6422j6872m950k3216k4139j0897j1323j1962k4882k7665k4021
11831I28173j0965j918j0204j6629j1842j4147j0312o626j6647p474q357k9495
$$ y = [3482842, 3407405, 3342868, 3288171, 3240586, 3201956, 3159635, 3096836, 3050872, 3004506, 2950860, 2887631, 2834337, 2787700, 2746722, 2710161, 2658628, 2615814, 2583784, 2544247, 2514151, 2497781, 2496405, 2492149, 2478840, 2460591, 2431342, 2369483, 2327921, 2266215, 2193569, 2130210, 2069017, 2023632, 1995381, 1970171, 1933948, 1904242, 1869646, 1832606, 1799271, 1765871, 1756178, 1740242, 1714825, 1682429, 1658941, 1612470, 1567686, 1542232, 1523909, 1483804, 1441964, 1429530, 1404792, 1386978, 1366942, 1347733, 1341884, 1324833, 1293264, 1265755, 1242847, 1236479, 1218464, 1190981, 1156656, 1127544, 1124522, 1108100, 1091228, 1086278, 1063062, 1038923, 1028026, 1016703, 1004741, 979859, 952194, 928173, 917208, 915290, 905086, 888457, 876615, 862468, 852156, 845530, 828883, 821409, 813052, 783557]
11819G83557k7558k521j1962m623p570n626j2048j6441j6137j3005k916K078j7360
11806F47868k2615p048J605j1786j5551p351l095L378n307j1339q522q663K273
11793E53847o915j0636k2257k2353L358j3126j6319r602O12J6350m400n251j2002
11780D51306o084p307j4170K132l399j5822O638n575j6053j1729O811L950j9212
11767C71486r146R465K425j5262j5575q857J2901L380o646J1279j2785j2783j1277
11754C18605O992j1032j2975O24n531j6126m137n353r127o766n433R282m183j6336
11740B38504l0P373O710j301j0298M189n231o182q757l107N653Q274M052p037
11726B32812j8640j5437j262l970j1701K994K327K524n083o044n232k795O35O619
$$ y = [783557, 755999, 753478, 741516, 736893, 729323, 723697, 711649, 695208, 679071, 666066, 663150, 665228, 647868, 625253, 618205, 619810, 608024, 592473, 585122, 582027, 585405, 580098, 568759, 560237, 551574, 553847, 546932, 536296, 514039, 491686, 495044, 481918, 465599, 455997, 456609, 472959, 468559, 463308, 451306, 445222, 437915, 423745, 425877, 422478, 406656, 413294, 407719, 391666, 379937, 386748, 390698, 371486, 362340, 371805, 374230, 358968, 343393, 334536, 347437, 350817, 344171, 355450, 342665, 329882, 318605, 325597, 314565, 301590, 302214, 296683, 280557, 276420, 271067, 261940, 255174, 249741, 259023, 254840, 238504, 238474, 245847, 252557, 251256, 240958, 245147, 239916, 233734, 224977, 221870, 227523, 235797, 239849, 232812, 214172, 198735, 197473, 193503, 181802, 184796, 187123, 189647, 184564, 178520, 173288, 170493, 171128, 177747]
11712A77747N979P586Q331j0110o165q528n774P850J8357j9421j2067O771j340
11699A69216Q535o65J542k493l903k0350r390j3924O905P891K574J4549j173n933
11685A53381m898n764j7831k793l15n887R261L397P079o599j5421O91J2749L199
11671A30249J59L081p565K859J6506k914j1700Q562J2670l800n883p609J3261
11658A47876J5328N748R626L989l868N646P426J3227J5850L9466J9449J3966O920
11645C00649j804j7009l5652p966O334k252L9K762N009O72o044j1436j7409j072
11631B14821k826J1756J7982J163M044P062L446O228J7304P845R741J6580r15
11618C14231K358j161n936j5881j6604Q751K0103K5065L5901O3897P7674Q1767
$$ y = [177747, 183726, 191312, 199643, 189533, 183368, 174840, 169066, 176916, 195273, 175852, 163785, 170556, 169216, 177751, 177086, 178628, 176135, 172232, 151882, 142492, 128568, 135473, 143364, 145938, 160487, 159314, 153381, 148483, 142719, 124888, 122095, 121780, 115893, 125154, 128551, 135630, 129031, 113610, 114301, 127050, 130249, 130408, 133489, 125924, 128783, 145289, 142375, 130675, 139237, 151907, 148107, 142224, 134615, 147876, 163204, 168952, 178578, 182567, 178699, 184345, 191771, 204998, 220848, 260314, 279763, 293729, 300649, 298845, 281836, 246184, 238218, 244552, 242300, 242339, 245101, 250110, 250782, 244738, 233302, 215893, 214821, 211995, 223751, 241733, 242896, 246940, 254002, 257448, 263676, 280980, 288825, 298566, 315146, 314231, 316589, 315428, 309492, 293611, 277007, 285758, 305861, 330926, 366827, 430724, 508398, 590165]
11606E90165P7608Q6050M9405L790n3187q6116r5615p5919n7961l1635l6715l4658
11594C35212p107p886n857j8718o762J4843L714L50o319k838J01r093l880n869
11580B79891K99J970k470K383J6902J0315O547j1638j7456m942P172q986j0596
11567B69391J2612J8302J8706K7885J1668J5948P187k6412m6983l5389m1768j9977
11555B11170l606l423j653p014k3476j6312p101m984m154j2526n359R410n552
11542A25420m221p804r58j059q50N866L482k392r085q144M127K22o18q293j9593
11527G6100l853l53k273Q493J9333m061M109j2126k886K3238M386j667n733k2785
11513G9922j0694n282P843N86j7265l006K9353N321N444j851j0775n064J400o564
$$ y = [590165, 667773, 753823, 803228, 807018, 753831, 667715, 572100, 496181, 438220, 406585, 369870, 335212, 328105, 320219, 314362, 295644, 288882, 303725, 307439, 307789, 301470, 298632, 298733, 289640, 285760, 279891, 280190, 282160, 279690, 282073, 298975, 309290, 315837, 304199, 286743, 281801, 288973, 279987, 269391, 282003, 300305, 319011, 346896, 358564, 374512, 381699, 355287, 308304, 272915, 231147, 211170, 207564, 204141, 202488, 195474, 171998, 155686, 148585, 143601, 139447, 126921, 121562, 130972, 125420, 121199, 113395, 112437, 111378, 110528, 116394, 119876, 117484, 108399, 100255, 104382, 104604, 103986, 95693, 76100, 72247, 71894, 69621, 78114, 97447, 93386, 97495, 85369, 82483, 105721, 110107, 108440, 102707, 79922, 69228, 63946, 71789, 72375, 55110, 52104, 81457, 86778, 92222, 90371, 79596, 74532, 75932, 69368]
11499F9368o473j6935j400j093N12K2713J4789j2352j1711j0734R58m259j9574
11486B3809K247P196Q731R214J2305M972k38J026q940j8238k913m186l578K9k050
11471B9386M799P151P882J566q195m511J145l846J1217m951M604o648p701j712
11457C0186J1888N804M855N074l079k2621j902m082N87J6393J3904J3670j149
11444F9528k23j8789j3768l678R709L206r906p035m225r99O786J2246K4491J080
11430F8423j5209k239J337M11K879M504L091k0465j2074o186P882R24P63r272
11416B4769j0624l097Q174O703m119j0435p466J3266Q232Q644Q947q767q360L95
11402B6262J533K114j2964j970L132O256L245P78m697n271n837n205N303J3979
$$ y = [69368, 62895, 45960, 44560, 43467, 43979, 66692, 81481, 69129, 57418, 46684, 47642, 43383, 23809, 26056, 33252, 41983, 51197, 63502, 68474, 68236, 69262, 60322, 42084, 39171, 34985, 31407, 31436, 29386, 34185, 41336, 49218, 50784, 42589, 38078, 39223, 35377, 46594, 41643, 46247, 39599, 31898, 30186, 42074, 47878, 52733, 57807, 54728, 32107, 30205, 26123, 26710, 43103, 57007, 70677, 69528, 69305, 50516, 36748, 33070, 42779, 45985, 36079, 29044, 24819, 23820, 30606, 42852, 67343, 68423, 53214, 50975, 52312, 52723, 55602, 60106, 63197, 42732, 30658, 24472, 32354, 33278, 34041, 24769, 14145, 11048, 19222, 25925, 21806, 11371, 3905, 17171, 25403, 34047, 42994, 34227, 25867, 26262, 27795, 29909, 16945, 14975, 18107, 24363, 27608, 28386, 23689, 18418, 12581, 7376, 12679, 26658]
11388B6658J0011L057j209P0Q46L67L906J9586J9061J8034K5235m149k1098k0307
11374H0068k1011q57r982r185o072l658n002m010l999P359J7259J2603O383K72
11360F0168j0489j7645k894J974P454J2588J70l010K197M342K0206R720J9505
11347A04286K0474J5943R577o996k7418k2564l3962k0131n67l223j825n040p75
11334B7779M448K195P671j468J939K811M105k256P388R616j356r86j3003q211
11320D0672l337l491k030r079j3219K222N855R384p763O082P24n210j958J2061
11306C0913J2269R314j892p122j3993j0490l14l286P928J6779j584j9723J214
11293B0013n316k676j448l071J0266J0264j3698l973O535J2528Q240J206m528
$$ y = [26658, 36669, 39726, 38517, 38587, 39433, 39800, 43706, 63292, 82353, 100387, 125622, 121473, 100375, 80068, 59057, 58200, 48218, 39033, 32961, 29303, 24301, 20291, 16292, 23651, 40910, 53513, 59896, 60168, 49679, 32034, 29140, 31114, 38568, 51156, 51326, 48316, 50513, 54855, 75061, 84781, 104286, 124760, 140703, 150280, 143284, 115866, 93302, 59340, 39209, 38642, 35419, 33594, 28554, 27779, 32227, 34422, 42093, 40625, 42564, 45375, 49480, 47224, 54612, 64228, 62872, 61886, 48883, 40672, 37335, 33844, 31814, 22735, 9516, 11738, 17593, 26977, 19214, 25296, 26020, 20810, 18852, 30913, 43182, 52496, 50604, 43482, 29489, 18999, 18685, 15399, 23327, 40106, 38522, 18799, 20013, 14697, 12021, 10573, 7502, 17768, 28032, 14334, 10361, 16896, 29424, 37664, 38870, 34342]
11280C4342j839P072M696k1300k7696P819K8865K3963O020j1577m346o395j5469
11267B4155k6554M725J4729J2097q576q259r352J12J1325M398R921J9253L156
11254E1130j1411n852L831M184j2764J427R56j4419n783P029j232j137o44m40
11240A4875o581L685K3072j031r596k75p064J205J5152J2J6886l330k6449n002
11226A5559N272J725J9809M075J0193m476j0074q280j4904r601J1809O2M331j2089
11212A3411q331J0224R951j4920K000M351P185J2968Q861j0722o515o47l006P278
11198C2088K442j6612j3418K4159J1966j320q683p740R840k01n826J27m265n46
11184B2011J6869J6779J389q359p466j9364j9499L216o37j214n824Q692N551N528
$$ y = [34342, 32503, 39575, 44271, 22971, -4725, 3094, 31959, 55922, 61942, 50365, 46019, 39624, 24155, -2399, 2326, 17055, 29152, 20576, 12317, 2965, 3077, 14402, 18800, 28721, 47974, 51130, 39719, 33867, 37698, 41882, 29118, 30545, 31501, 17082, 11299, 18328, 17096, 15959, 15315, 14875, 8294, 11979, 35051, 34020, 24424, 24149, 17085, 18290, 33442, 33454, 50340, 47010, 20561, 15559, 20831, 22556, 42365, 46440, 56633, 52157, 42083, 33803, 18899, 9298, 21107, 21169, 25500, 13411, 5080, 15304, 25255, 10335, 12335, 16686, 23871, 36839, 45700, 34978, 28463, 27816, 24810, 32088, 34530, 17918, 4500, 28659, 40625, 39305, 30622, 22882, 32722, 32521, 26695, 26822, 22557, 22011, 38880, 55659, 57048, 48689, 41223, 21859, 2360, 5576, 4939, 3725, -2099, 6593, 12144, 17672]
11170A7672J3811j0544o188K872q270Q33J5112O90j429K2159r311j1761r081N554
11156B2119k546l956J033R383M233L992J1347J1733j9161n356n264j442J0758
11143C6873M113l633r95Q491L208J05r410L682O269O026j0435J4100P876j439
11129F4831j4739j3203O03k81R09m011J0423P314q526p089P328m389K015k994
11115C8191P800p822l300j665j2963J555J4017Q769N91q186o768r920M90N750
11101B6539J7076O509J385j8921j0260R248Q08N78J059m234j4061j2922O856N435
11087A5095K485l508P79j455O090J8J0850M825p615p633J3600o702j498o22K75
11072B4984o922J1705J066j0509k212Q781l650l246n711n023k83J3490P008Q510
$$ y = [17672, 31483, 20939, 14751, 17623, 9353, 10186, 25298, 25988, 24559, 46718, 37407, 25646, 16565, 22119, 19573, 15617, 16650, 26033, 30266, 34258, 45605, 57338, 38177, 32821, 27557, 26115, 36873, 40986, 37353, 36358, 44849, 48057, 48162, 38752, 42434, 48703, 54729, 44294, 58394, 66270, 64831, 50092, 36889, 37492, 37211, 38120, 34109, 44532, 51846, 43320, 36231, 43559, 39170, 41185, 38191, 45991, 38169, 34869, 33204, 20241, 21796, 35813, 44582, 45173, 36987, 30219, 20299, 20789, 26539, 43615, 50124, 51509, 32588, 22328, 31576, 32384, 32962, 34021, 29787, 15726, 2804, 9660, 15095, 17580, 14072, 14851, 13396, 19486, 19504, 30354, 35179, 27564, 19931, 33531, 26829, 25331, 24709, 24984, 18062, 29767, 30833, 20324, 18112, 26893, 23243, 19997, 14286, 9263, 8980, 22470, 29478, 37988]
11058C7988n827j7096N407m768p678Q229O526p982K78P024J7865P236L359j287
11044D9274l136k507L660j4215j5813p430k168O939O197K02J0540K2313M552m752
11030E3656o000j1356j4794M849J0878j183p598q139J4502J1456O230q417m540
11017C9544J1204J3901J2279Q710K3798M2108O0290N5236L4694J6302k0359m2342
11005B55365n5501n0656l2984j471p520k1854r270j827J0698n340j6357J0224
10993G3507K0831l491q784M095j65o723j902j0427m577J795L9742M2247L4809
10980A80957N7688N1755K6611R518l2681o0293n5399l8517l0687k2951j1087j4545
10968F0369k1447l132J3047Q663p245j993J0870K924O428P897L017M610l003k9
$$ y = [37988, 32161, 15065, 20472, 15704, 8026, 16255, 22781, 14799, 15077, 22101, 39966, 47202, 50561, 49274, 46138, 43631, 47291, 33076, 17263, 9833, 7665, 14604, 20801, 21003, 31543, 53856, 58408, 53656, 47656, 36300, 21506, 26355, 37233, 36050, 28452, 20313, 34815, 46271, 52501, 44084, 39544, 50748, 64649, 76928, 85638, 109436, 151544, 211834, 267070, 301764, 318066, 297707, 255365, 199864, 149208, 116224, 114753, 107233, 85379, 76109, 74282, 84980, 79640, 63283, 73507, 94338, 90847, 82063, 86158, 85993, 79270, 77368, 66941, 62364, 64159, 103901, 146148, 180957, 238645, 290400, 317011, 326529, 293848, 233555, 178156, 139639, 108952, 86001, 74914, 60369, 38922, 35790, 48837, 57500, 50255, 48262, 59132, 62056, 68484, 76381, 79398, 84008, 81005, 80976]
10954H0976j0382p95n791j6425m223N481J5949J7883M459M937q752O213J0071
10941I9601J5692J3511M083N557L2476L3777O361N221j2473j5030m463q764J506
10928A77055K0970K3221M0609O4658J18860J64776K65469L92102M55681L76238
10918B099639P8126l23398m68452l68190k38239j59435j17569o2123m7800m1572
10908C50987l0026l1362k2635j8732j8258k4159J38l39k7344k0019R554L506j0412
10895A60899N80k617l934o808K54P266K926j0633r511K094m326j8058o182J5268
10881A27218L850J0507J3555n207r449L382j084m764o300j9108j1046K411p330
10868I6635N961j2676o726L792q575K042L504j563m917k782O450J337O774O409
$$ y = [80976, 70594, 69799, 64008, 47583, 43360, 48841, 64790, 82673, 87132, 92069, 83317, 89530, 99601, 115293, 128804, 132887, 138444, 170920, 204697, 211058, 216279, 203806, 188776, 184313, 175549, 177055, 198025, 221246, 261855, 326513, 445373, 610149, 875618, 1267720, 1723401, 2099639, 2177765, 1854367, 1385915, 1017725, 779486, 620051, 502482, 440359, 392559, 350987, 320961, 289599, 266964, 248232, 229974, 205815, 205953, 205614, 178270, 158251, 167805, 171311, 160899, 161479, 158862, 154928, 148120, 148374, 155640, 158566, 147933, 138422, 140516, 136190, 118132, 111950, 127218, 131068, 141575, 155130, 149923, 140474, 143856, 142772, 138008, 131708, 112600, 101554, 103965, 96635, 102596, 89920, 83194, 86986, 78411, 80453, 83957, 82394, 77477, 74695, 81145, 82482, 89256, 95665]
10854I5665K99j504j3507Q638P913l221p625j2626j0250j0044K2186L370q685
10841G0609j0970l430M341j0422J868J3694m54j0717m847J5250J1631P686N37
10828H4776k09j4707k664m423o027j740J088Q181L843O286j545j2601r375j023
10814D9860O322J0333J4033k503j416J947L071j048K764J2056J431k0598l7494
10801C8758k7952j6974j593K0076J0890L755M411P408K1230R523l396M581Q855
10788G9572j6335j3472M847L477q395m568J3092L863Q146M773Q27J2142l400m285
10774H0284L500J1087N625j3288j6468L892L389J819K5730j998k2872p593M099
10761G7206K0489K0285K0967L9690M9144M3201M0816L0004O594k3845l4627l7630
$$ y = [95665, 95964, 94460, 80953, 89591, 97504, 94283, 86658, 74032, 63782, 53738, 75924, 79294, 70609, 59639, 56209, 60550, 50128, 51996, 65690, 65236, 54519, 49672, 64922, 76553, 84239, 84776, 84567, 69860, 67196, 62773, 56746, 55006, 56094, 64275, 68118, 74404, 72859, 60258, 50883, 49860, 56182, 66515, 80548, 78045, 76629, 78576, 81647, 80599, 83363, 95419, 96850, 76252, 38758, 10806, -6168, -7761, 12315, 23205, 26960, 31371, 38779, 60009, 69532, 66136, 70717, 79572, 63237, 49765, 54612, 58089, 49694, 45126, 58218, 62081, 70227, 75000, 75827, 87969, 84569, 80284, 83784, 94871, 100496, 87208, 70740, 74632, 78021, 79840, 105570, 103572, 80700, 73107, 77206, 97695, 117980, 138947, 178637, 227781, 270982, 311798, 341802, 348396, 324551, 289924, 252294]
10749B52294m1028m2457j7728N089L917j5571l3170o399p084q258n872L237R52
10736H7922m348n311k0165j5748J448J8850J9354J9121R095K2309J7159l578r104
10723A37004k41j2189j6618J378J6238J6568J9994Q29K160O701k453n130J499
10710A65740r458p048j3606j7057j2996j4890n109k441N829J2320J2713J6675
10698A30672L0668J3605J7139J6881o390j9153l8130m8297n1407l5260R079J2864
10686C2271M617J8059K3664m033N992m464j6633O200M130M528m370l750l620q45
10672F1746j844q538k818R703J0431q334n04P291J5221J3565j977l145L749J1098
10658A05644K5596L3875O348j7857l3314k0079l150J739K0082O753J2102M0061
$$ y = [252294, 211266, 168809, 151081, 156170, 160087, 144516, 111346, 104947, 97863, 89605, 83733, 86970, 87922, 83574, 78263, 58098, 42350, 43798, 62648, 82002, 101123, 110218, 132527, 149686, 146108, 137004, 136763, 124574, 107956, 109334, 125572, 142140, 162134, 162963, 165123, 171824, 169371, 164241, 165740, 156282, 149234, 135628, 118571, 105575, 90685, 85576, 83135, 88964, 101284, 113997, 130672, 161340, 174945, 192084, 208965, 202575, 183422, 145292, 96995, 45588, 10328, 19407, 32271, 36888, 54947, 78611, 74578, 80570, 76106, 59473, 65673, 69803, 74331, 69961, 66211, 62591, 61746, 59902, 51364, 48546, 58249, 68680, 60346, 59842, 67133, 82354, 95919, 93942, 90797, 94546, 105644, 131240, 165115, 171463, 153606, 120292, 100213, 97063, 98802, 118884, 125637, 137739, 177800]
10646A77800K6052J4199K1074K2229J9993J2084N257J4248J2718K0409M8181O0205
10634D54449O2297P5874J23045K06111L12753L06751K20263K22149J69451j33238
10624B019905l41201l35675k32578j42367r0392n1542l8658l5232k0004l1889
10614G00367l0104j5903j4119j3246k1888j4368K084L252R234J8143M346j823
10602F25975q74j3904k408J4934J0548L760j507P268J3427n779J3496L4535J5462
10589G14933M754j2505j9597l3976l0706l9862n811J4376L4056J3628P487J8384
10577F65161J425O439K7993L2651L4687K1963J7823J1356J6242J341J262J8691
10565H57034N781j671K4727L1475M4940L4810M4401M9813M9004M2437M0610L0956
$$ y = [177800, 203852, 218051, 239125, 261354, 281347, 293431, 298688, 312936, 325654, 346063, 394244, 454449, 516746, 592620, 715665, 921776, 1234529, 1541280, 1761543, 1983692, 2153143, 2019905, 1678704, 1343029, 1110451, 968084, 877692, 826150, 787492, 752260, 732256, 700367, 670263, 654360, 640241, 626995, 605107, 590739, 592823, 596075, 605309, 623452, 627798, 625975, 625101, 611197, 608789, 623723, 634271, 638031, 636524, 643792, 657219, 651440, 664936, 699471, 714933, 719687, 707182, 687585, 653609, 622903, 583041, 577230, 591606, 625662, 639290, 646777, 665161, 666586, 673025, 701018, 733669, 768356, 790319, 808142, 819498, 835740, 837081, 838343, 857034, 862815, 861144, 885871, 917346, 962286, 997096, 1041497, 1091310, 1140314, 1182751, 1223361, 1254317]
10553A254317L3286K6947J8472J8885K4775M1529M5355J5694J7756Q220K6368
10542A531604N3165Q2443R2717R8564J15756J14080Q8385N3326O0172J00333J36446
10531B526991J82520K33667K60224K54977K69718L26842L71879M10155M67689
10522E304662N69644P36428R19594J027848R59304P33146O52727R75689J530943
10513A3409985K174961K875927L672656M746561O401754Q996154J3331282K0856231
10505G6465511L3962281N4821022P9565546Q9785464O4213229m65353p2105301
10498C26242399q9574975o6615181m2251078k6696151j7682104j2436640r212932
10491F1773338o969871n210138l909778l076460k521524k088544j733925j473748
$$ y = [1254317, 1287603, 1314550, 1333022, 1351907, 1376682, 1418211, 1463566, 1479260, 1497016, 1505236, 1531604, 1584769, 1667212, 1759929, 1858493, 1974249, 2088329, 2176714, 2230040, 2290212, 2390545, 2526991, 2709511, 2943178, 3203402, 3458379, 3728097, 4054939, 4426818, 4836973, 5304662, 5874306, 6610734, 7530328, 8558176, 9517480, 10250626, 10903353, 11879042, 13409985, 15584946, 18460873, 22133529, 26880090, 33281844, 42277998, 55609280, 76465511, 110427792, 165248814, 244814360, 334599824, 398813053, 398347700, 326242399, 236667424, 170052243, 127801165, 101105014, 83422910, 70986270, 61773338, 54803467, 49593329, 45683551, 42607091, 40085567, 37997023, 36263098, 34789350]
10483C4789350j416900j582766j716900j616354j439779j324096j209276j097666
10475B3385613j009651r04455q23686p26752o34564n97011o11289o45173o52194
10466A6780838o20125n44561m71877m25795m14247m00123l66886l48021l85346
10457A2803857l87913l77033l45375l20726k90459k89264k76984k59961k34631
10448A0021511k23621k27410k32320k14727k00821j69032j51428j53486j69128
10439H279538j71745j52611j43764j41856j32167j35924j28290j20255j19740
10430G033186j29096j33695j29058j51485j55799j50580j44169j44239j23615
10421E771450j12191j05278r6924j01059j19293j49243j51409j28670j19880j04582
$$ y = [34789350, 33372450, 31789684, 30072784, 28456430, 27016651, 25692555, 24483279, 23385613, 22375962, 21471507, 20647821, 19921069, 19286505, 18689494, 18078205, 17433032, 16780838, 16160713, 15616152, 15144275, 14718480, 14304233, 13904110, 13537224, 13189203, 12803857, 12415944, 12038911, 11693536, 11372810, 11082351, 10793087, 10516103, 10256142, 10021511, 9797890, 9570480, 9338160, 9123433, 8922612, 8753580, 8602152, 8448666, 8279538, 8107793, 7955182, 7811418, 7669562, 7537395, 7401471, 7273181, 7152926, 7033186, 6904090, 6770395, 6641337, 6489852, 6334053, 6183473, 6039304, 5895065, 5771450, 5659259, 5553981, 5457057, 5355998, 5236705, 5087462, 4936053, 4807383, 4687503, 4582921]
10411D582921r5195j02253r0841p3504o3705q1487q8094n5909m3202n9062q0084
10400C749585o8703o2212m6259n2927m5430m6191n4148m1674n7807n9260o2889
10389C152085l0880l7096m6555n2064m0407o543Q978J6853O0050J05262J24139
10378C253822J82295K66276L48950K24667j30247l45946k52621j44955j99038
10369C203203j69438j28603j13646j15983p6133o4314n3536n9766n2026m8337
10359B321421k5559k0183l9962l2829m2537l1708l2985k4152k8660k6773m5156
10348A970917n3421o1381l6353l2410l9457j3518j4471j7820j3340r339k0877
10337A658530l6569l8943k5199q572l4052j2848j2709k1283k2513j8173k4815
$$ y = [4582921, 4487726, 4385473, 4294632, 4221128, 4157423, 4075936, 3987842, 3931933, 3888731, 3829669, 3749585, 3680882, 3618670, 3572411, 3519484, 3474054, 3427863, 3373715, 3332041, 3274234, 3214974, 3152085, 3121205, 3084109, 3037554, 2985490, 2945083, 2938540, 2947518, 2964371, 3024421, 3129683, 3253822, 3436117, 3702393, 4051343, 4276010, 4145763, 3799817, 3547196, 3402241, 3203203, 3033765, 2905162, 2791516, 2675533, 2599400, 2535086, 2481550, 2421784, 2369758, 2321421, 2295862, 2275679, 2235717, 2202888, 2160351, 2128643, 2095658, 2071506, 2042846, 2016073, 1970917, 1917496, 1856115, 1819762, 1787352, 1747895, 1734377, 1719906, 1702086, 1688746, 1679407, 1658530, 1621961, 1583018, 1557819, 1549247, 1515195, 1502347, 1489638, 1468355, 1445842, 1427669, 1402854]
10326A402854k8569k8276r424j0955j4809j2381l3855m2043k2132P11k437M140
10314A202824r373m77j7570n2130n3348m7664m7978l6841k4092m526O059J4053
10302I28937J4534k417o949m827k5864k5741k1056L660j9550k9136k5735l2748
10290G53108k1128j9193j7923l018p870J1906O512k0279q310K78j2389k0280j1145
10277F30269j9711R138J004q501o75J6569J6122K0577J9446J4031R405K8391P0602
10264H06667J14812J42632J40509O9852m5119j35965j54129j39130q1465m0945
10254F77719k8780k0700j1382j7081r180n798j8301l1321q723m779j503q259P37
10241E12649N152l041P010J8525L4310J0106K706J299K540L838l2156l6110l0359
$$ y = [1402854, 1374285, 1346009, 1336585, 1325630, 1310821, 1298440, 1264585, 1222542, 1200410, 1201121, 1198684, 1202824, 1193451, 1192974, 1175404, 1123274, 1069926, 1022262, 974284, 937443, 913351, 908825, 914884, 928937, 943471, 941054, 934105, 929278, 903414, 877673, 856617, 860277, 840727, 811591, 785856, 753108, 731980, 712787, 694864, 691846, 683976, 695882, 702394, 682115, 673805, 674083, 661694, 641414, 630269, 610558, 619696, 620700, 612199, 611524, 628093, 644215, 664792, 684238, 698269, 707674, 736065, 806667, 921479, 1064111, 1204620, 1274472, 1229353, 1093388, 939259, 800129, 718664, 677719, 648939, 628239, 616857, 599776, 590596, 584798, 566497, 535176, 526453, 521674, 520171, 511912, 512649, 517801, 514760, 521770, 540295, 574605, 584711, 587417, 588716, 591256, 595094, 562938, 526828, 496469]
10228D96469k8666r353k4931k5838J800M853j3415q265j4860l990m85j3534r998
10215C49787k813K834R55p512j4547J4461K6629j287q295K6933J3770m637N189
10202D01467n039j1132j8221l122k523Q586J3940J8694L3091N2185M6622M2344
10190E76892M2385K0881M27K581N946j4925n2702p8336n8608m6495k9383k7309
10178C41354j6774K438l386L21J9987J7122R505J6894J751N408l274l1892j8524
10165C40930j2900L749J331j5056M02j080q278j521K77K2361K2094K0383K3937
10152C96629M8131N8357N8911P6786N6563N3838O5023M6288J4221j6450l6981
10141H21316p0131r4867j11704q7647m2687j7412j8256j8570j6657O48M411j7035
$$ y = [496469, 467803, 458450, 433519, 407681, 409481, 414334, 400919, 392654, 377794, 373804, 373319, 359785, 349787, 346974, 349808, 350763, 343251, 328704, 343165, 369794, 368507, 360212, 387145, 400915, 396278, 401467, 396428, 385296, 367075, 363953, 361430, 370016, 383956, 402650, 435741, 487926, 534548, 576892, 619277, 640158, 640585, 643166, 649112, 634187, 581485, 503149, 444541, 398046, 368663, 341354, 324580, 327018, 323632, 323953, 343940, 361062, 370567, 387461, 389212, 394620, 391346, 359454, 340930, 328030, 331779, 333110, 318054, 318456, 317376, 309098, 307577, 307854, 330215, 352309, 372692, 396629, 444760, 503117, 562028, 638814, 695377, 749215, 814238, 860526, 874747, 858297, 821316, 751185, 656318, 544614, 456967, 414280, 396868, 378612, 360042, 343385, 344033, 348444, 331409]
10129C31409q982n311j1515j2395l253o256q831l584n765O515J784P943J2433
10116B94192J3241l335R284N113P238J0331N172K9253K9127L0280M2936O4104
10104E36936P1086P1825M7714P051k3437p5395p6450n9088l2783l2606k5779j9205
10092C89869j9274q44j207L321L241J4291K2070K3869L3273P4186J14484J76475
10080H33754K70421L98266M60013L36461K4449l48077m66781l71446k15050j42185
10070G79825r9534p2979m6596m7680l3105j5425M970M577o24O919K1880J0509
10058E12737p035k6444l1177l7295l2661k7137j7496j0925j1378r262L616n795
10046B99748k0567R963J7467K272j8223q874M750K5356J2081j228K1298L122R735
$$ y = [331409, 322427, 317116, 305601, 293206, 289953, 283697, 274866, 271282, 265517, 272032, 273816, 281759, 294192, 307433, 304098, 313382, 318495, 325733, 336064, 341236, 370489, 399616, 429896, 472832, 536936, 608022, 679847, 727561, 734612, 711175, 635780, 559330, 500242, 467459, 434853, 409074, 389869, 370595, 369751, 368544, 371865, 375106, 389397, 411467, 435336, 468609, 542795, 657279, 833754, 1104175, 1502441, 1962454, 2298915, 2323364, 1975287, 1508506, 1137060, 922010, 779825, 680291, 607312, 560716, 513036, 479931, 464506, 469476, 474053, 473429, 480348, 502228, 512737, 505702, 479258, 448081, 410786, 378125, 350988, 333492, 322567, 311189, 301927, 305543, 299748, 279181, 289144, 306611, 308883, 290660, 281786, 286536, 311892, 323973, 322745, 344043, 347165, 356900]
10033C56900q19J4819K1391o275j9720l8322k0686O52J940j442j0827q557J4978
10020C04032J0918j942j4516j3316n621k020j9157p482M187P570o16j9846L035
10007B45226J7647Q289n142R349P166L532m555r532P43L378R37N174P080p769
9993B81523K009P591J5408K2510K0920K1238J2697J1101Q284J3711p45j1611j5198
9980C89438j5914k0117j1410r597j6900j3643J0021m615K022O090J4974L362K940
9967C36651j7897r774N279p87j7819j7964J096k7L863L920J9091J4836o344r545
9953C04579k33M0l156p966j736J7660J8714O861l896M165J7755K745J1838N258
9939C72628j67L785L921Q993o766j1387p226k3194k1914j157k535R345J4104j2245
$$ y = [356900, 356081, 370900, 392291, 386016, 366296, 327974, 307288, 307940, 309880, 308438, 297611, 289054, 304032, 314950, 313008, 298492, 285176, 279555, 277535, 258378, 250896, 255083, 262653, 262037, 242191, 245226, 262873, 271162, 266020, 275369, 282535, 286067, 281512, 271980, 272723, 276101, 277038, 282212, 289292, 281523, 283532, 291123, 306531, 329041, 349961, 371199, 383896, 394997, 403281, 416992, 416247, 404636, 389438, 373524, 353407, 341997, 332400, 315500, 301857, 311878, 307263, 309285, 315375, 330349, 333711, 336651, 318754, 308980, 314259, 313472, 295653, 277689, 278785, 278758, 282621, 286541, 305632, 320468, 314124, 304579, 304346, 304386, 301230, 293264, 291528, 309188, 327902, 334763, 330867, 335032, 352787, 355532, 367370, 372628, 372461, 376246, 380167, 389160, 382394, 371007, 363781, 340587, 318673, 317516, 314981, 324326, 338430, 326185]
9925C26185k517k414n995j1244p142o648j5704P255J2380K229J1065K6650O983
9912C41083L218J4329o134N058J3248M14q003L513L3198M9338L9278L6702M2124
9899E67366L5010J8694m333k9195k9765k2887j7621k3713L797l932Q365L2992
9887E34778K0205J2548J016K3662J6998J5430K2378J0079J0995K2855K1042L2505
9875G44491K9790J5253L1887J1444R318m513O334J1109K353L079P085J5354K3891
9862I06875N2909Q6124J03132J03138R2721R6702P0671J6157m7900n3711k1269
9851A405549p082L2019O3470P8538R8466Q9905P0322P0433P1292Q6396J06074
9840B165382J17445J38046J32882R3866K6844j3867m4353m0410l7620m6628n8706
$$ y = [326185, 323668, 321254, 315259, 304015, 296873, 290225, 274521, 281776, 294156, 296385, 307450, 334100, 341083, 344301, 358630, 352496, 357554, 370802, 371216, 363213, 366726, 399924, 449262, 488540, 525242, 567366, 602376, 621070, 616737, 587542, 557777, 534890, 517269, 493556, 497353, 493421, 501786, 534778, 554983, 567531, 568547, 592209, 609207, 624637, 647015, 657094, 668089, 690944, 711986, 744491, 774281, 789534, 821421, 832865, 842183, 837670, 844004, 855113, 857466, 860545, 867630, 882984, 906875, 959784, 1045908, 1149040, 1252178, 1344899, 1441601, 1512272, 1528429, 1480529, 1426818, 1405549, 1398467, 1430486, 1493956, 1572494, 1670960, 1760865, 1831187, 1901620, 1972912, 2059308, 2165382, 2282827, 2420873, 2553755, 2647621, 2674465, 2660598, 2616245, 2575835, 2538215, 2491587, 2432881]
9829B432881o8073n9244n5125m2798l7749j2249L3343P1814J21949J65046K51311
9818B801106L52360M50029N56096N85104M94635K94953O9526o0528q0141j09167
9808E353973j64427k31001k86177k67406k17696j58708j07818r1530o1219o6457
9798C701534m1804n224J9210N2528Q5197J55945K28384K58085K79507L06315L28168
9787E367845L80937M62318N60969O84410Q31412J105479J524755K172142L076764
9778A6167031M323874N955223P890799R637052R821296O897402Q55109n712760
9770E5835026q645883q040839o317114m513802l028060j893663r64313j65472
9762B2265880O49245J531733K453870L434038M254933M607884M291520L635896
$$ y = [2432881, 2364808, 2305564, 2250439, 2207641, 2169892, 2157643, 2190986, 2262800, 2384749, 2549795, 2801106, 3153466, 3603495, 4159591, 4744695, 5239330, 5534283, 5603809, 5543281, 5463140, 5353973, 5189546, 4958545, 4672368, 4404962, 4187266, 4028558, 3920740, 3829210, 3767991, 3701534, 3659730, 3654506, 3673716, 3726244, 3811441, 3967386, 4195770, 4453855, 4733362, 5039677, 5367845, 5748782, 6211100, 6772069, 7456479, 8287891, 9393370, 10918125, 13090267, 16167031, 20490905, 26446128, 34336927, 43973979, 53795275, 60692677, 61547786, 55835026, 47189143, 39148304, 32831190, 28317388, 25289328, 23395665, 22431352, 22265880, 22915125, 24446858, 26900728, 30334766, 34589699, 39197583, 43489103, 47124999]
9754D7124999K921746K013011J241502R85403Q81190L45363m71329j154248j786603
9745E2101034k436175k756125k418883j698308j143603o49640K97507J984509
9737D3280316M445178P892693J2492606J8165188K3836594K6357069K1344153
9730A57813797O586702j2963726k3907573k3270618j8941528j4191507r766306
9723F1359241o287192l722274j748444j64758J012064J748995K112172K283555
9715E6593359K306858K109045J844270J431173P63793n7942n95943n68368o80490
9706F3145755j700385l273080m582192n233191m965656l921875k789279j939663
9698C4740434j289802o24994R6059R35129J989849L337893N062861O954708Q256301
$$ y = [47124999, 50046745, 52059756, 53301258, 54286661, 55167851, 55513214, 55041885, 53887637, 52101034, 49664859, 46908734, 44489851, 42791543, 41647940, 40998300, 41295807, 43280316, 47725494, 55618187, 68110793, 86275981, 110112575, 136469644, 157813797, 164400499, 151436773, 127529200, 104258582, 85317054, 71125547, 61359241, 55072049, 51349775, 49601331, 49436573, 50448637, 52197632, 54309804, 56593359, 58900217, 61009262, 62853532, 64284705, 65048498, 64990556, 64394613, 63826245, 63145755, 61445370, 58172290, 53590098, 48356907, 43391251, 39469376, 36680097, 34740434, 33450632, 32825638, 32921697, 33856826, 35846675, 39184568, 44247429, 51202137, 59458438]
9689E9458438P619251M038125j904504p260353r091364q131821o389687m828322
9681C3509763l578987k644430j987596j488285j142744q90645p35043o54572o14073
9672A9773388n75301n48950n07503m97320m56744m16176l77607k97815k56473
9663A5839499k06214j55669j03354p3527n6004j5910K0554O3025J49609K10085
9653A5672094K60544K49815K01909J50083P9048k58j66875l80877n00617m60174
9643A5104692l54424k43880j58578q2272j8299M0145R4811J22391J73140K03093
9633A4880819K30054K67660L05766L22082K97316L18349L40705L54608L42953
9624A7660312L38669L39759L09970K83678K67428K77247K85481L10432L02867
$$ y = [59458438, 67077689, 71115814, 69211310, 61950957, 52859593, 44727772, 38338085, 33509763, 29930776, 27286346, 25298750, 23810465, 22667721, 21777076, 21042033, 20387461, 19773388, 19198087, 18649137, 18141634, 17644314, 17187570, 16771394, 16393787, 16095972, 15839499, 15633285, 15477616, 15374262, 15300735, 15244731, 15228821, 15249375, 15312400, 15462009, 15672094, 15932638, 16182453, 16384362, 16534445, 16613493, 16613235, 16446360, 16065483, 15564866, 15104692, 14750268, 14506388, 14347810, 14265538, 14247239, 14287384, 14382195, 14504586, 14677726, 14880819, 15110873, 15378533, 15684299, 16006381, 16303697, 16622046, 16962751, 17317359, 17660312, 17998981, 18338740, 18648710, 18932388, 19199816, 19477063, 19762544, 20072976, 20375843]
9615B0375843K80780K86102K55205K23465K13344K08370J96819J87201J71471
9606B2398600J49040P3366l3585j52482k00820k21017k68122l14242l21842l24368
9596B0784528l40074l60370l71139l83748l98110m01279l97214m01608l89229
9587A7341757l90545l83333l76308l94701l88600l74075l93874l74702l52703
9578A3912916l57084l56267l58518l36884l15400k84791k65395k78141k63934
9569A1096502k43016k37027k26883k23535k13443j87886j95070j97799j95673
9560I176170k22411k06912k04064k11293k00459j87232j65549j66630j73801j56091
9550G281728j44512j57534j50885j29918j22655j14389j18967j22570j19262j10403
$$ y = [20375843, 20656623, 20942725, 21197930, 21421395, 21634739, 21843109, 22039928, 22227129, 22398600, 22547640, 22621006, 22587421, 22434939, 22234119, 22013102, 21744980, 21430738, 21108896, 20784528, 20444454, 20084084, 19712945, 19329197, 18931087, 18529808, 18132594, 17730986, 17341757, 16951212, 16567879, 16191571, 15796870, 15408270, 15034195, 14640321, 14265619, 13912916, 13555832, 13199565, 12841047, 12504163, 12188763, 11903972, 11638577, 11360436, 11096502, 10853486, 10616459, 10389576, 10166041, 9952598, 9764712, 9569642, 9371843, 9176170, 8953759, 8746847, 8542783, 8331490, 8131031, 7943799, 7778250, 7611620, 7437819, 7281728, 7137216, 6979682, 6828797, 6698879, 6576224, 6461835, 6342868, 6220298, 6101036, 5990633]
9540E990633j13455j13828j25742j18580j16408r7582r5499j02926q7272p1950
9530D947391o4497q5494r0624q5858p7479q1325p3488p0740o8466p3942o9793
9519D105685p2015q8161o2677o0800n8991o3095n5354m6981n8543o4792n9417
9508C414859n3403m9370m4399m4423n8670n3966m1236k3406m0385l7766m3288
9497B924547l9718n0568m6874l4423l5087m9238l7623k0536l5751m8182l2448
9486B494099k1501k6996l2702l7615l2264k2803k5346l8564k6922l2192k8494
9475B168700l1265k4977k2539k3197l8327n0619k8293j4957l5883m7976j6015
9464A834652j5337k3886j8036k9007k2057j0558k3271j2534k2110m062j5056l5036
$$ y = [5990633, 5877178, 5763350, 5637608, 5519028, 5402620, 5305038, 5209539, 5106613, 5019341, 4947391, 4882894, 4797400, 4706776, 4620918, 4543439, 4462114, 4388626, 4317886, 4249420, 4175478, 4105685, 4033670, 3945509, 3882832, 3822032, 3763041, 3699946, 3644592, 3597611, 3539068, 3474276, 3414859, 3361456, 3312086, 3267687, 3223264, 3164594, 3110628, 3069392, 3045986, 3005601, 2967835, 2924547, 2884829, 2834261, 2787387, 2752964, 2717877, 2668639, 2631016, 2610480, 2574729, 2526547, 2494099, 2472598, 2445602, 2412900, 2375285, 2343021, 2320218, 2294872, 2256308, 2229386, 2197194, 2168700, 2137435, 2112458, 2089919, 2066722, 2028395, 1977776, 1949483, 1934526, 1898643, 1850667, 1834652, 1819315, 1795429, 1777393, 1748386, 1726329, 1715771, 1692500, 1679966, 1657856, 1653794, 1638738, 1603702]
9452A603702l9967k4255j4734j6789j8338k0480k4802l7374k6930j4834q440p750
9440A349009p439k6144n959j2757l5840k0674r053M345k1733k2222j2358j2106
9428A167069p218j6268q473j4763j2310k8741j8591j3300p577j6972k4083j8058
9416I80715j5400l648L128J123K130j5241j2072j3685j0193j8677q763j428j1223
9403H76766M530R850L367o468J4518R136J8182J675j4187J3400j7055k8385m4770
9390H40559l0628j9301k6664j7359j1620j5748q859J1115j3298j7867R882P14
9378G00926j6706n187p340j0023j1044J2965L534q499r78k938j1948q721j7759
9365F16282j0179N57Q36l012K107J5408L9525M4307N2561P1650P4314O4071L4972
$$ y = [1603702, 1563735, 1539480, 1524746, 1507957, 1489619, 1469139, 1444337, 1406963, 1380033, 1365199, 1356759, 1349009, 1341570, 1315426, 1309467, 1296710, 1260870, 1240196, 1231143, 1235488, 1213755, 1191533, 1179175, 1167069, 1159851, 1143583, 1135110, 1120347, 1108037, 1079296, 1060705, 1047405, 1039828, 1022856, 998773, 980715, 965315, 961667, 964795, 965918, 968048, 952807, 940735, 927050, 916857, 898180, 889417, 887989, 876766, 881296, 891146, 894513, 888045, 902563, 911699, 929881, 931556, 917369, 930769, 913714, 885329, 840559, 809931, 790630, 763966, 746607, 734987, 719239, 710380, 721495, 708197, 690330, 700212, 700926, 684220, 679033, 671693, 661670, 650626, 663591, 667125, 658626, 657648, 654710, 642762, 634041, 616282, 606103, 606660, 607496, 604484, 606591, 621999, 661524, 705831, 758392, 830042, 904356, 968427, 1003399]
9352A003399r573l6128m5208n8433o8739o3560n2115l4386k5448j4307j2471j2412
9340E70619j6495k1191m690j1205L692j4547k1379j1178O988l341m978L665P828
9327D83788n644j1395M874N979N84o097r15P958J3892J6152K8514L4081N2643
9314F24414P7435Q8420R4008P4568L5537L039k8800m5219n3302o9136p1940p3321
9302F55703n3159l1688k8811k0441k3915r151j9966L091M296l2237j8367n47j3669
9289D11139k947k233k5210j7828K814O334L168m230j3539m170O777J2400P189
9276C79664Q660k998O929J2793L4514N5823M9094N8246M5567N684j0510j2740
9264F30726j9160k6224j8771l3137m3923l9150l9828l0343k7480j5442m717n739
$$ y = [1003399, 993826, 957698, 912490, 854057, 785318, 721758, 669643, 635257, 609809, 595502, 583031, 570619, 554124, 532933, 528243, 517038, 520730, 506183, 484804, 473626, 480614, 477273, 472295, 475960, 483788, 478144, 466749, 471623, 477602, 478186, 472089, 471174, 479132, 493024, 509176, 537690, 571771, 624414, 701849, 790269, 884277, 958845, 994382, 997421, 968621, 923402, 870100, 800964, 729024, 655703, 602544, 570856, 542045, 521604, 497689, 488538, 468572, 471663, 475959, 443722, 425355, 424808, 411139, 408192, 405959, 380749, 362921, 365735, 372069, 375237, 371007, 357468, 353298, 360075, 372475, 379664, 388324, 385326, 392255, 405048, 439562, 495385, 544479, 602725, 648292, 653976, 643466, 630726, 611566, 585342, 566571, 533434, 489511, 450361, 410533, 380190, 352710, 337268, 332551, 326812]
9252C26812k448n622k1431R61J0338m651j3928R691J0413j3429j4253L729R278
9239B95460M965j3455j9177j2458J0866J2564j360k730o325q100l908J4458L0002
9226C00802J6921M530p904j288j3276j1179m338m495j4604j5156J077q529j8109
9213B24452r926n223M381J3604O411j1581p796p17m659l746M743L961n745p353
9199B00806J179k692r912M23N560J1817J0105j0028J961J0011R165Q225J1494
9186B48114r627l451m471j4219M537m989j2085j7078j5321O434n328K527K3385
9173A98428j4155j2689j1416R959o270j9172Q101J0566R297L091j4457j2101l357
9160A45825o993j2945j2141M059J5031M559p914O977j105J752j860m158Q464K6213
$$ y = [326812, 324364, 318742, 297311, 298272, 308610, 303959, 290031, 299722, 310135, 296706, 282453, 286182, 295460, 300425, 286970, 267793, 255335, 266201, 278765, 277405, 274675, 268350, 260250, 256342, 270800, 300802, 317723, 322253, 314349, 313061, 299785, 288606, 284268, 279773, 265169, 250013, 251090, 242561, 224452, 214526, 209303, 213684, 227288, 233699, 222118, 214322, 213605, 208946, 205200, 209943, 213904, 208159, 200806, 201985, 199293, 189381, 189804, 195364, 207181, 217286, 207258, 209219, 219230, 228395, 236620, 248114, 238487, 235036, 230565, 216346, 220883, 215894, 203809, 186731, 171410, 177844, 172516, 175043, 198428, 184273, 171584, 160168, 170127, 163857, 144685, 152786, 163352, 172649, 175740, 161283, 149182, 145825, 138832, 125887, 113746, 117805, 132836, 137395, 129481, 136458, 135353, 137105, 135245, 131087, 139551, 165764]
9146A65764k807k081q201p875N597J5077k780j1365r726m621N371K0951K433k013
9132A63724R112n75r134J2274J0381j7895r953o910q548K13J3950J004q153Q876
9118A58366L001j7933j4107J1343J1390L192j5798k4365J425j929O155j121j1925
9105A07694Q27R588l529l666k280Q609Q959j19o150j8255r459O704P981J4467
9091A21371P463J7319J2405k079l058n661l752l064K990j567L059J1273m206j0596
9077A41897j5935L840O661j1408r234j3882n581O025L10j0283N005Q198M324n853
9063A04084q047j4772k616J6157L082p422R659m951j1761q008j2377j454J3429
9050G5003p220k035K335Q510L170m045J0098J4304M955r978k158n596k7J1513
$$ y = [165764, 162957, 160876, 152675, 144800, 150397, 165474, 162694, 151329, 141603, 136982, 142353, 163304, 165737, 163724, 172836, 172261, 163127, 175401, 185782, 167887, 157934, 151024, 142476, 142689, 156639, 157643, 149490, 158366, 161367, 143434, 129327, 140670, 152060, 155252, 139454, 115089, 116514, 114585, 120740, 119619, 107694, 108521, 118109, 114580, 110914, 108634, 117243, 126202, 126083, 119933, 101678, 92219, 98923, 106904, 121371, 128834, 146153, 158558, 156479, 153421, 147760, 144008, 140944, 143934, 142367, 145426, 156699, 152493, 141897, 125962, 129802, 136463, 125055, 115821, 101939, 96358, 102383, 102693, 92410, 97415, 105613, 109937, 104084, 96037, 81265, 78649, 94806, 97888, 90466, 100125, 95174, 83413, 75405, 63028, 61574, 75003, 67783, 65748, 68083, 76593, 79763, 75718, 85816, 100120, 105075, 95097, 92939, 87343, 87316, 98829]
9036I8829J919p055k620o991j39J2722l22j2449j2878k811k60J500k08J6181J4377
9021I9795o603m934j4970j5285K913M221R216O07l558j4779M325Q063M385K164
9007G5560J4657j0303m295k921K927l369l322P379j2448j584l470m456K31O870
8993F1456M344j056P323J8909r966o734q121J589K661J1599L834j6871j5106n51
8979E3310L065P868l470p717n569j083j565M855J8011J288q027k304O075j8676
8965D6061n045K818R79N416R01k223r488P85r08R604r59Q40k1806K290K0838O676
8949E6779J7007J2698j841j6567j7311j4450L211R696R211l921m621o939j9668
8936B3284n400N492O750N193Q96N764P530N304L466n142J6723O653M614j0023
$$ y = [98829, 100748, 93693, 91073, 84082, 83943, 96665, 96343, 83894, 71016, 68205, 67945, 69445, 69237, 85418, 99795, 93192, 88258, 73288, 58003, 60916, 65137, 74353, 74960, 71402, 56623, 60948, 69011, 73396, 75560, 90217, 79914, 75619, 72698, 75625, 72256, 68934, 76313, 63865, 62281, 58811, 54355, 54586, 61456, 65800, 64744, 72067, 90976, 81010, 74276, 66155, 67744, 70405, 82004, 85838, 68967, 53861, 53310, 56375, 64243, 60773, 53056, 47487, 46404, 44839, 49694, 67705, 68993, 60966, 58662, 64737, 46061, 41016, 43834, 44813, 50229, 51130, 48907, 39419, 40204, 39296, 48900, 47941, 48781, 26975, 29265, 50103, 56779, 73786, 86484, 84643, 68076, 50765, 36315, 39526, 49222, 58433, 54512, 49891, 42952, 23284, 17884, 23376, 30126, 35319, 36215, 41979, 49509, 54813, 58279, 53137, 69860, 76513, 81127, 71104]
8922G1104j0534m653l017L59p674n154l277o6m352Q421J1683Q464n669m834L11
8907E1112J73P011N459j0283l369R078R926m078j6033j5351l973N972J047k802
8893C3889M673J5630k158J0539J1557j4715j7774j4845P397R691L473K399k569
8880D7187R615p005j108j7022J469J0232J036M604Q458j14K498R00m123m971N49
8865E2205l269j1386m600J0322L925j5668M987K942m696j2523m265J9491R134
8852D6599J9756M078k1314j5505m430J9611L715o464R632l920p577L928l963q319
8838C5827O189M334J6927k629j5180q908j5175k928Q533N605P399j4909o799J1507
8824B9793J1557m908O780J6209k961j981J170j1878q26R34M500k251J116M548
$$ y = [71104, 60570, 55917, 52900, 53259, 45585, 40431, 37154, 37088, 32736, 41157, 52840, 61304, 55635, 50801, 51112, 51285, 58296, 63755, 53472, 50103, 59181, 69107, 65029, 48996, 33645, 29672, 35644, 36691, 33889, 38562, 54192, 52034, 62573, 74130, 59415, 41641, 26796, 34193, 43884, 47357, 49756, 47187, 56802, 49797, 48689, 31667, 33136, 43368, 44404, 49008, 57466, 57352, 59850, 60750, 56627, 51656, 52205, 48936, 37550, 32950, 43272, 47197, 31529, 36516, 39458, 34762, 22239, 17974, 37465, 46599, 66355, 70433, 49119, 33614, 29184, 48795, 52510, 46046, 55678, 51758, 44181, 48109, 44146, 35827, 42016, 46350, 63277, 60648, 45468, 36560, 21385, 18457, 26990, 32595, 39994, 25085, 18286, 29793, 41350, 36442, 43222, 59431, 56470, 54489, 55659, 43781, 42955, 43889, 48389, 46138, 47254, 51802]
8810E1802Q89N864q458o119k864J667m564m430p009N221l699P217O490j108m841
8795C6058J1124N858k724P36O986L831J0763p524j5184r0p038K047M542j521j4953
8780C2911j981J1409Q026j111p879K323K1868N011k758M250J0924J5782r566j7177
8766G2032j8409M406m574k555L658K333o780r148q5K608P090j346r387L039P329
8751E0211Q604O129M761j0693n58N893j2740j0640M441j523O842M801M449L182
8737F3159J7251n330n971Q323P389j984n940j535k926J4846R047N240j3373P40
8723H8936M692o59l830j6565n473Q527K49j3521K767J1414m506n185n584N15K587
8708F4364K425J3283K340o828n281m500n241q109K275L886J1030j3961n399Q393
$$ y = [51802, 52691, 58555, 50097, 43978, 41114, 42781, 38217, 33787, 26778, 31999, 28300, 35517, 42007, 40899, 36058, 47182, 53040, 50316, 51052, 58038, 61869, 72632, 65108, 49924, 49834, 42796, 44843, 49385, 47864, 32911, 30930, 42339, 50365, 49254, 41375, 43698, 65566, 70577, 67819, 72069, 82993, 98775, 89209, 72032, 53623, 58029, 53455, 50900, 54558, 56891, 50111, 40963, 40878, 43486, 50576, 49230, 39843, 42882, 50211, 58815, 64944, 69705, 59012, 58454, 64347, 51607, 40967, 45408, 43885, 50727, 55528, 59977, 63159, 80410, 75080, 69109, 77432, 84821, 82837, 76897, 75362, 72436, 87282, 96329, 101569, 88196, 88936, 93628, 92969, 89139, 72574, 67101, 75628, 75877, 62356, 65123, 76537, 72031, 66846, 61262, 61777, 64364, 66789, 80072, 82412, 75584, 70303, 65803, 60562, 52453, 54728, 58614, 69644, 55683, 50284, 58677]
8694E8677n760N69J0847M456q282j1291k734K541Q740K1828k374J867n60r640
8680F8884K683l461M531P283j674k77J1492m2k565k964O675q8j675l053m239J1462
8664I2972N956p429j0005j1428q947L625k708j5578k0546J6102J9455l993O195
8651F3671Q270j1454j220M221l510l618J1573M099l902m509l214j1449o090m967
8637C7901J7095J1563j5737k726K831P958q307k1R595m309M429k81j1874P646
8623E5763J1828N686m477M80M092n887j3915q837o21l268J7684O528K281l152
8609F4185j4038L980J4885J9745Q057k6287j7003o687L501l902k610j3499j3641
8596A6686P172K5499P840q108j3275p7j252l219K26J6205P500R945k24R120L163
$$ y = [58677, 52917, 53486, 64333, 68789, 60507, 49216, 46482, 49023, 57763, 79591, 77217, 79084, 78524, 68884, 71567, 68106, 72637, 79920, 78246, 77969, 89461, 89419, 86854, 83890, 90565, 90477, 88802, 85749, 81510, 92972, 98928, 91499, 81494, 70066, 61119, 64744, 62036, 46458, 25912, 42014, 61469, 57476, 63671, 71941, 60487, 59267, 63488, 59978, 56360, 67933, 72032, 68130, 63621, 60407, 48958, 42868, 37901, 54996, 66559, 50822, 48096, 50927, 58885, 50578, 50557, 60152, 55843, 60272, 59991, 48117, 55763, 67591, 73277, 68800, 69280, 73372, 67485, 53570, 44733, 44112, 40844, 58528, 65056, 67337, 64185, 50147, 54127, 69012, 88757, 96814, 70527, 53524, 46837, 50338, 46436, 43826, 30327, 16686, 23858, 49357, 57197, 49089, 35814, 35737, 34485, 31266, 31492, 47697, 55197, 65142, 64918, 74038, 77201]
8581G7201o002l53j999j3416j917K0208J7454J846r170k2217l309O006k944R323
8567G0711L8j8087j1008j348l869J046p566j5723P402J478q813r526K601L548
8553A0884J1430K0316k302j0268q65N324O255j7482l090p812j897P064P258J0188
8539C5003R19J544J0374o397k4471o663N409N775m942P241l949K438j444P845
8525B8682J1902N383j602r801m61J1652M447k0472N127l290k5540Q216K631N929
8511B2803O494p85m365l964L608Q902P442N906j5136j2718q774l809n376q87m085
8496d744q135J1052n614J5704J3483J276j3522q776K852J297P750K5541N899q8
8482D3975m942j790J0936j900j4996j5596L566J960L840l913M960j664K161O943
$$ y = [77201, 71199, 70846, 68847, 55431, 53514, 73722, 91176, 93022, 83852, 61635, 58326, 64332, 61388, 70711, 70749, 52662, 41654, 40306, 36437, 37483, 29917, 14194, 21596, 23074, 14261, 4735, 7336, 10884, 22314, 42630, 40328, 30060, 29195, 34519, 40774, 23292, 20202, 12390, 10493, 17557, 24815, 35003, 35922, 37466, 47840, 41443, 16972, 10309, 15718, 21493, 16551, 23792, 19843, 22281, 20837, 28682, 40584, 45967, 44365, 34564, 34103, 45755, 50202, 29730, 34857, 31567, 6027, 14243, 16874, 22803, 29297, 28512, 24147, 20183, 23791, 32693, 40135, 46041, 30905, 18187, 9413, 5604, 228, -659, -4744, -12879, -1827, -7441, 8263, 21746, 23022, 9500, 724, 3576, 4873, 12623, 38164, 44063, 43975, 39033, 37243, 48179, 46279, 31283, 15687, 19253, 21213, 25053, 21140, 26100, 24436, 26597, 33540]
8468C3540p211j3996M024R748k545j6220N128L461k931K409l361L271j484m356
8454I477m406J7975J1873j5829q158p155L497K930J1664J3764l653K739p494l659
8440B3565k89j930j9640M861K3159N600J532J417r391j0986n445K586O249N200
8426B6488o976j686N697L524o924J5255O655m922l339M216P872m224l604k664
8412C5368K507J5556q189J0103n883m304o205k807l047j3249m930M624J713O147
8398B7404L137q739J324n535j0867O441J4697p96l381j1231q419L013j3293J3202
8384F957J2711Q722n18j433q799L922q011j2807M130J6151P945J2602R918l949
8370D7541j326M548K633j957j1533n866k928J4169J3950L408N279q772r997j5381
$$ y = [33540, 26329, 12333, 16357, 26105, 23560, 7340, 12468, 15929, 12998, 15407, 12046, 15317, 13833, 9477, 5071, 23046, 34919, 19090, 10932, 3777, 7274, 10204, 21868, 35632, 31979, 34718, 27224, 23565, 23276, 21346, 1706, 6567, 29726, 35326, 36858, 38275, 28884, 17898, 12453, 15039, 21288, 26488, 19512, 17826, 23523, 27047, 20123, 35378, 42033, 37111, 33772, 37988, 45860, 41636, 38032, 35368, 37875, 53431, 45242, 55345, 49462, 45158, 38953, 36146, 33099, 19850, 14920, 19544, 21257, 27404, 30541, 21802, 23126, 17591, 6724, 13165, 27862, 27066, 23685, 12454, 4035, 7048, -6245, 6957, 19668, 28390, 27872, 26439, 17640, 21562, 13551, 744, 4874, 21025, 28970, 41572, 51490, 47541, 46215, 50763, 53396, 51439, 39906, 34040, 31112, 45281, 59231, 62639, 67918, 59146, 49149, 33768]
8356C3768j2927p275M942J6028K795O98m542n073Q882J0385q631j9155j774N186
8342B3307j439K517N175j1030k4793R463K717l873R346N439R148j0542j7240P410
8328E605K4473R50M387L645o020k80n497N330J123p225r927J5290N333l535j1839
8313B1813r634K703o162M021N610j6187j3627p739J1103n422J592J0159R737N122
8299A3089P369j10j448j1875j3239Q227M849l129J1534l197j3113N525J1899L640
8285B0021N16m153P033j568j694o976P813K28M959j387o483n558K842J2324J0234
8270C8151N479m991j5189q054q115R961J952O743J0870N937j4515q611J2879L510
8256C6007r346j2504M029O173j5577L71N949O311O586n690q380r008k661J0672
$$ y = [33768, 20841, 13566, 18508, 34536, 37331, 38029, 33487, 28414, 37296, 47681, 39050, 19895, 18121, 23307, 21868, 24385, 29560, 18530, -6263, 3200, 5917, 2044, 11390, 16829, 25977, 15435, -1805, 5605, 30078, 31028, 35415, 39060, 33040, 32760, 27263, 32593, 33716, 26491, 16564, 31854, 37187, 33652, 21813, 12179, 14882, 8720, 12741, 18351, 2164, -11463, -19202, -8099, -13521, -11929, -1770, 7967, 13089, 20458, 20348, 18900, 7025, -6214, 2013, 6862, 3733, 15267, 12070, -1043, 4482, 16381, 20021, 20537, 16384, 23417, 21849, 20155, 13179, 20992, 21220, 26179, 24792, 18309, 12751, 15593, 27917, 38151, 43630, 38639, 23450, 15396, 7281, 17242, 19194, 25937, 36807, 42744, 28229, 19618, 32497, 36007, 26661, 14157, 18186, 24359, 8782, 9153, 15102, 21413, 27999, 22309, 13929, 4921, 2260, 12932]
8242A2932n829j6116M092J3918J215r420K674k369J0666Q885l894j4209M460L170
8228A0175o961l882M216J1488J975l503J4645j061N197O28J490r425m262J2477
8214C3197j1223p430j0163n248p646J1655J3609n738q540p748n235K193K078n2
8200f291q57n657O971K871p020O481J4320P859j1340j1639k893o009K5575J1586
8186B3957R610O741o173K201P407L583p032q373P751O100j2984o344j6659J03
8172I888O136l472J843J0253j5232O347M498K212K469O217k708j4604j1251M750
8158G346N126M426r060Q135O417J3064M728j0483q062p136r354P005P267J076
8144B0495j187r821O501L004R87q600j766q62L50J8023q912M930J4867j258p918
$$ y = [12932, 7103, -9013, -4921, 8997, 10212, 792, 3466, 1097, 11763, 20648, 16754, 2545, 7005, 10175, 3214, -668, 3548, 15036, 17011, 13508, 28153, 27092, 32289, 32917, 34407, 24982, 20720, 33197, 21974, 14544, 4381, -867, -8513, 3142, 16751, 11013, 2473, -5275, -10510, -8317, -6239, -6291, -7148, -12805, -5834, -2963, -9983, -3502, 10818, 18677, 7337, -4302, -7195, -13204, 12371, 23957, 33567, 40308, 34135, 36336, 43743, 47326, 40294, 31921, 39672, 45772, 32788, 26444, 9785, 9888, 16024, 12552, 14395, 24648, 9416, 15763, 20261, 22473, 24942, 31159, 28451, 13847, 2596, 7346, 12472, 16898, 7838, 15973, 22390, 35454, 40182, 29699, 21637, 14501, 5147, 12152, 19419, 20495, 19308, 9487, 15988, 18992, 19979, 11379, 9613, 8751, 9101, 27124, 18212, 23142, 38009, 36751, 28833]
8129B8833j4869O911L133K07q763J1458J5092K072r521j1743m448r12J912Q6Q925
8114B8373N589j6551N910O616j6105j1935m42P094K0647j0496J347M779o130r630
8100I066j045N003Q189m166j8734Q424J6398K962j4611q196J1439Q051P387j0624
8086A9543J2661J0904O173K1560K8871K3418K0036L704K700j0828j0576j2989
8074A15177q761j4652k3873j2899j4968o413l273J2809m849j3030m672o153n276
8061I167P720K6701N168l0717j1970J9407J2737P38p171P970K072K002P411j4654
8047C6581j0825K553j4358Q612K7542J8198k829J384J4835N745K0916M8262N2176
8034B08792M8292L8728K1328k3517m6224m4384m6256k8606j1049r814j2478r569
$$ y = [28833, 13964, 20875, 24008, 24215, 15452, 26910, 42002, 44074, 34553, 22810, 18362, 17450, 19362, 19448, 28373, 33962, 17411, 23321, 29937, 13832, 1897, 1455, 8549, 29196, 18700, 20047, 24826, 18696, 9066, 8021, 13024, 21213, 17047, -1687, 6737, 23135, 26097, 11486, 3290, 14729, 22780, 30167, 19543, 32204, 43108, 49281, 70841, 99712, 123130, 143166, 146870, 149570, 138742, 128166, 115177, 106416, 91764, 67891, 54992, 40024, 33611, 30338, 43147, 38298, 25268, 20596, 14443, 9167, 16887, 43588, 48756, 18039, 6069, 25476, 38213, 38951, 31780, 39750, 41822, 43824, 51235, 36581, 25756, 28309, 13951, 22563, 50105, 68303, 65474, 66858, 81693, 87438, 108354, 156616, 208792, 257084, 295812, 317140, 293623, 247399, 203015, 156759, 128153, 117104, 107290, 94812, 85243]
8022H5243j2095n508n274p43J1105o825j7691j047J5228J1075J592M055j3909
8009F5206j7775k2423N225J5815k400r232J518j1563N323J6475Q933l563m481
7996D7058o916l888J5237Q890J2496O502K2612K0049L218J898O675O57p804k4365
7982A02319j1458n32j4053q088J250j8569j6459J2824J2889p462j1724j6740q998
7969A5199m390J2907J4374R095J3249k885J692O984j917k283j671r249j2796O715
7955D5024j4652L642M779O064p20m451k307J0797J46Q467n014k931k420m320m527
7940C7577o46m390l054j936P943r00j1596L238o374Q184P44p74L556j1273p490
7925A2809Q189Q343k008R458n29o736K069J382j0247j0834R480J0816o472q508
$$ y = [85243, 73148, 67640, 62366, 61623, 72728, 65903, 48212, 47165, 62393, 73468, 75060, 79115, 65206, 47431, 25008, 30233, 46048, 43648, 34416, 35934, 24371, 29694, 46169, 55102, 51539, 47058, 40142, 36254, 51491, 60381, 72877, 79379, 101991, 122040, 125258, 127156, 133831, 134488, 126684, 102319, 90861, 90329, 76276, 68188, 69438, 50869, 34410, 47234, 60123, 52661, 40937, 24197, 15199, 10809, 23716, 38090, 47185, 60434, 57549, 59241, 66225, 64308, 62025, 60354, 51105, 38309, 45024, 30372, 34014, 38793, 44857, 44137, 39686, 37379, 48176, 48322, 56789, 51775, 48844, 46424, 42104, 37577, 36931, 32541, 29487, 27551, 35494, 34594, 22998, 26236, 19862, 28046, 28790, 28016, 31572, 20299, 12809, 20998, 29341, 27333, 36791, 36262, 29526, 31595, 32977, 22730, 11896, 21376, 32192, 25720, 17212]
7911A7212N198p640O487M076P764m433l603L023M744k447q298J1313Q335R210
7897E0941J57j790J834j1260n455j752j4417q558J5012Q823m300n114J4800M716
7883D3637p747K008M901J2684M63k5074j3151o144L049R464O91r370O90J5631
7869C1732J0211j288p605K988q938o452n721q686r643R461J3122k417P40j079
7855A6425k282M352K54p375o210l233k531J4525J1696J3162M283j4682j2677j043
7841A4664l609o152N697n193L897j3566k780M363J4448J1909J1027K074m739j3290
7827A8750K109o632Q74j3262J835P929j4438o37P528j2195l022N000P862L724
7813E425l904l0K283m350j4314J715J1918m70r56j1211P720J6915M558q016p975
$$ y = [17212, 22410, 14770, 21257, 25333, 33097, 28664, 25061, 28084, 32828, 30381, 22083, 33396, 41731, 50941, 51098, 49308, 51142, 39882, 34427, 32675, 18258, 9700, 24712, 33535, 29235, 24121, 38921, 43637, 35890, 37898, 42799, 55483, 55946, 30872, 17721, 11577, 14626, 24090, 24781, 15411, 16101, 31732, 41943, 40655, 33050, 36038, 27100, 20648, 14927, 6241, -3402, 6059, 19181, 16764, 17504, 16425, 14143, 18495, 18749, 11374, 5164, 1931, -600, 13925, 25621, 38783, 43066, 28384, 15707, 14664, 11055, 4903, 10600, 5407, 9304, -4262, -7042, -2679, 11769, 23678, 34705, 36779, 32040, 18750, 20859, 14227, 15101, 1839, 3674, 11603, -2835, -3472, 4056, -8139, -11161, -6161, 1701, 5425, 1521, 1491, 3774, -576, -14890, -13175, -1257, -1727, -2683, -13894, -6174, 10741, 15299, 7283, -692]
7798f92M37k169j3859k668K850J9963J2545N394l976o832L379K30K264R8N586
7783B2550n063n727n01q63R24N083M467M550K090j4942J1790J053j1282O812o086
7768A4855j5929p582n260J4972R705P193L820o247o093N764j696p73l078j8171
7754h520j3087l066K795J3506J300L632r885l964j4967o552K4060J2434P257p020
7740b077j955k545j7896J0979O876K294M78n487N06K955J5500L991k979L728j824
7725A2544k214P406j0229j1447N500J2174r451j0572O802j0761j1105j533Q493
7712a4393J3375Q084k15j635k703K674R642N714l92N843L801j8040o175R756J510
7697A6846j5502k240M006m340J257L357Q486N244M779n653k994L04m522o822N226
$$ y = [-692, -255, -2424, -16283, -18951, -16101, 3862, 16407, 21801, 17825, 10993, 14372, 14602, 16866, 16964, 22550, 17487, 11760, 11259, 10396, 11320, 16403, 20870, 25420, 27510, 12568, 24358, 25411, 14129, 20941, 14855, -1074, -8656, -13916, 1056, 10761, 17954, 21774, 15527, 9434, 15198, 13502, 12729, 9651, -8520, -21607, -24673, -21878, -8372, -7072, -3440, -13325, -17289, -32256, -38808, -14748, -2314, 4943, -2077, -4032, -6577, -24473, -13494, -6618, -4324, -3846, -9333, -8827, -5872, 9628, 13619, 10640, 14368, 12544, 10330, 17736, 7507, -3940, 1560, 13734, 4283, -6289, 513, -10248, -21353, -22886, -14393, -1018, 7066, 6851, 5216, 2513, 5187, 14829, 20543, 20151, 25994, 29795, 11755, 5580, 15336, 16846, 1344, -896, 3110, -1230, 27, 3384, 11870, 17114, 21893, 16240, 13246, 13550, 9028, 2206, 7432]
7682G432j331n168M332j3705q455N151P606j0928j1849k149J1889j474Q890J5169
7668E410R803L54j1856n681l215j499J550M470L326M626J0929p263J0113p33P900
7653B8234n297Q063j2520j2421j0480M58P091J1984j625m194J2085l403j859k250
7639A3866r529J844k537M594L05l586O590J3120q724j0056k252K76O750O525J4159
7624C1345p62J650J229j2494O257l355j1356j0827K352p95J427O035k950j1975
7610d219n10j98J975J0646J1709j3590q664K144L051J570j1166l101J322p917
7596a6948K905J8376Q469m123j541L513j66j9015j2631o741q822L090k460J0646
7582b5448J2192J2735n462L853N034j0314k732L12J5637M316K21n907j847j5203
$$ y = [7432, 6101, 933, 5265, -8440, -16895, -11744, -4138, -15066, -26915, -29064, -17175, -18649, -9759, 5410, 15213, 15567, 3711, -1970, -5185, -6684, -5134, -664, 2662, 7288, 18217, 10954, 21067, 20334, 28234, 22937, 31000, 18480, 6059, -4421, -3963, 3128, 15112, 13487, 9293, 21378, 17975, 16116, 13866, 4337, 6181, 3644, 8238, 8543, 4957, 11547, 24667, 15943, 5887, 3635, 3911, 10661, 17186, 31345, 30583, 32233, 33462, 20968, 27225, 23870, 12514, 1687, 4039, 3244, 4671, 10706, 7756, -4219, -4729, -4927, -2952, 7694, 19403, 5813, -2851, -707, 2344, 3914, -7252, -10353, -9031, -16948, -14043, 4333, 12802, 8679, 7138, 10651, 10485, -8530, -21161, -27902, -36724, -33634, -36094, -25448, -13256, -521, -5983, -2130, 2904, -7410, -10142, -9830, 5807, 10123, 10344, 4437, 2590, -12613]
7568a2613j1958L515O146J6932L397j1177J3886O287n463q931J885l164Q63N037
7554D642J176j0809J695J0309q506k444K271J0614N821p899n07J8382r764l588
7540A1393L148p923k625q956r529k66J0124r665K759J1888J1965Q706j1833J822
7526A1008J771r456j5981o798k916N098J8339O657j2163O932K982j4211p502n258
7512b1498r071M267N700L769k933j101Q30j596J5656K7382m317j4838n794R404
7498E860J1109K523J0658k445m010J534j3615P095J1159l005j4001q422o617J021
7484a156j0191Q486N241l392Jj042L313K342N414J323j3179K3J2950q993j2283
7469a1143O084O339m921J1807l934j4910L9L984n44R653k320q739j0609o766j1342
$$ y = [-12613, -24571, -21056, -14910, 2022, 5419, -5758, 8128, 14415, 8952, 21, 1906, -1258, -395, 4642, 5818, -4991, -3296, 7013, -1493, -3937, -1666, 8948, 14769, 6870, 6363, 24745, 14981, 11393, 14541, 6618, 3993, -4963, -14492, -14758, -4634, -14299, -11540, 348, 12313, 21019, 9186, 11008, 12779, 3323, -12658, -19456, -22372, -17274, 1065, 7722, -4441, 2491, 5473, -8738, -16240, -21498, -30569, -26302, -20602, -16833, -19766, -20867, -20037, -21633, -5977, 21405, 17088, 2250, -3544, 5860, 16969, 19492, 30150, 27705, 23695, 25229, 11614, 18709, 29868, 26863, 12862, 4440, -2177, -1156, -11347, -2861, 2380, -1012, -1011, -2053, 1260, 3602, 9016, 10339, -2840, -2817, 10133, 1140, -11143, -5059, 1280, -3641, 8166, 4232, -10678, -10639, -6655, -7199, 2454, 134, -8605, -19214, -25980, -37322]
7454c7322Q009Q658K876J6131J3115M332M093o724j581j464l878j546l770j2141
7440a1212l576N781P67J7868M051j4930m921K12K015J5250K669l660p64N006p014
7425G542j5908R247l543k150P812L064L614P473P270o409n983p017J323K002J4007
7410B2344Q69r429k618j165k95j6026q16o673N78J8559K434r788J855L015j039
7395A805J602q143J1784Q06o389K013L671r813M93K013j264N401j0095p704n584
7380a9404p280N9J375j938J1454O615j956L027M730n161l740J3891R836m954j1860
7365e306o822j901m224L007P306J2564j888o364N646L489j934j0143p155R302
7351d423N19o929n7N073J0787K228r645k238L927M514m795R830M701k96M051j0198
$$ y = [-37322, -29313, -20655, -17779, -1648, 11467, 15799, 19892, 13168, 11587, 10123, 6245, 4699, 929, -11212, -14788, -9007, -8240, 9628, 13679, -1251, -6172, -5960, -3945, 11305, 13974, 10314, 9550, 14556, 7542, -8366, 881, -2662, -4812, 3000, 6064, 9678, 17151, 24421, 18012, 12029, 5012, 6335, 8337, 22344, 23213, 13784, 11166, 10001, 9706, -6320, -7136, -13809, -13231, 5328, 7762, -2026, -171, 2844, 1805, 3407, -4736, 7048, 7854, 1465, 3478, 7149, -2664, -2171, -158, -1422, 3979, -6116, -13820, -19404, -26684, -26625, -25250, -27188, -15734, -9119, -11075, -8048, -3318, -8479, -12219, 1672, 11508, 6554, -5306, -12128, -14029, -18253, -15246, -7940, 4624, 2736, -3628, 2018, 5507, 3573, -6570, -13725, -4423, -3904, -10833, -10890, -5817, 4970, 7198, -2447, -4685, -758, 3756, -1039, 8791, 13492, 13196, 17247, 7049]
7335G049o923J3131O33L891j2785M671J2706l021o168K320O571j1326j3986o27
7321c864q150L575J2934J6142q008L697N638j4372o134J6455P121j5512k1629
7308a2107j5306L594J4077P672l901N04K453J953r132j1290L82J1248M851N503
7294E01r876m657o997j3942N456P008L488N194n970r25k947j0628M524L412P999
7279a8360L751K0592L859r529O061j286K036O041j254k267n206r616j2916M982
7265a3112J4544k515K723J2110R681l214l382j938R167j0262k5531l939P433K946
7251e289Q454L804K476n70m127J832O706J2095l733j5667o542p06J3523o976j0182
7236d902p811J467j705K384N834m255o570J9134j0703J088J1785o544l719J0670
$$ y = [7049, 126, 13257, 13890, 17781, 4996, 9667, 22373, 19352, 13184, 15504, 22075, 10749, -3237, -3864, -12014, -8439, 4495, 20637, 12629, 16326, 21964, 7592, 1458, 17913, 25034, 9522, -12107, -27413, -23819, -9742, -2070, -5971, -5467, -3014, -1061, -10193, -21483, -21101, -9853, -5002, 501, -9375, -14032, -21029, -34971, -29515, -22507, -19019, -13825, -19795, -20720, -23667, -34295, -29771, -26359, -18360, -14609, 5983, 9842, 313, 6374, 5088, 7124, 13165, 11911, 9644, 4438, -5178, -18094, -13112, 1432, -1083, 1640, 13750, 23431, 20217, 16835, 14897, 24064, 13802, -11729, -15668, -8235, -5289, 3165, 6969, 9445, 8875, 4748, 6580, 13286, 25381, 21648, 5981, -561, -1267, 12256, 5280, -4902, -12713, -11246, -12951, -10567, -4733, -8988, -15558, 3576, -7127, -6039, 5746, -798, -4517, 6153]
7222F153J2121l414o109k0758k3504l487k359M472K2J9286N241k853M824J105
7208i260J0746J1846M373r331m242j5158l4401P19L513J2949J5464R670R661K434
7194H983j852L663R61j0508o561j619q364J0450J6859k937j0575q761J034J9275
7180A0048j3684o371O023j547p071q58P260J76P60j1958J969J3806p37j0085j905
7165a4174K759M094p26J6734N052R576j0833j2065l662q9n170P808J689r0j835
7150i32p566j9801M866J3610J3446k836Q452k028k208P085N20q411M64n395o853
7135g587j0538r612P447J0412j714J0082K2624k343K4k284j072r076J5695r000
7121A3058j076m036n808l395J924K310k4893k330J180O239R072J9646L321n913
$$ y = [6153, 18274, 14860, 8751, -12007, -35511, -38998, -41357, -36885, -36863, -17577, -12336, -15189, -10365, -9260, 1486, 13332, 17705, 8374, 4132, -11026, -45427, -44708, -41195, -28246, -12782, -3112, 6549, 8983, 7131, 10794, 11755, 1247, -5314, -6933, -15297, -4847, 12012, 9075, -1500, -10261, -9227, 10048, -3636, -10007, -3984, -5531, -12602, -13460, -6200, -6024, -5264, -17222, -15253, -1447, -2184, -12269, -14174, -11415, -7321, -8047, 8687, 13739, 23315, 12482, 417, -3245, -3334, -8504, -696, 993, 903, -932, -8498, -28299, -23433, -9823, 3623, 787, 9239, 7211, 5003, 12088, 12608, 4197, 4661, -734, -7587, -18125, -27737, -20290, -9878, -11592, -1510, 21114, 18771, 18795, 16511, 15439, 6363, 22058, 13058, 11982, 7946, 2138, -1257, 667, 2977, -21916, -24246, -23066, -16827, -7755, 11891, 15212, 9299]
7107I299p740P138o401j23l367M434O50m518j7045j0550Q782J7801P457n323n640
7092e146l94o497M47K782l591N14k729P448M398J118p588J0729J3688M677k177
7077A7679J09L99O205o440j4771p582m324j56J1523n366l592k43o185N482l22
7062g584J1571r107k0631q036J564J3941O279o361L588K1103K432j4022j9873
7049b5136L146J4645Q748o469j0366n938K948J9988q403l41P734k66j0499j9823
7035c0032O23K4833J0961J380N704N696n833j1679j1732k590n091j883K129J716
7021a5798k304K81R300L617J121K888M230O83j3635O611Q638l894m090j3695R548
7006f499M88n359K301O716J6757m05r722O221l04r225j3328O675K1O684j318j2690
$$ y = [9299, 1559, 8697, 2296, 2173, -1194, 3240, 3890, -628, -17673, -28223, -19441, -1640, 5817, 494, -5146, -5540, -12037, -11590, -8808, -12399, -11885, -14614, -7166, -2768, -1650, -9238, 1491, 15179, 19856, 17679, 17788, 18187, 24392, 17952, 3181, -4401, -8725, -8881, 2642, -2724, -6316, -6559, -12744, -7262, -7584, 3987, -5120, -25751, -33787, -32223, -18282, -12003, -18364, -14776, 6327, 8759, -5263, -25136, -21990, -7345, 1403, -5066, -15432, -21370, -18422, 1566, -6837, -7178, 556, 290, -10209, -30032, -29409, -4576, 6385, 7765, 13469, 19165, 13332, 1653, -10079, -12669, -17760, -19643, -17514, -15798, -18102, -17821, -8521, -4904, -3783, -895, 3335, 4018, -9617, -3006, 5632, 1738, -2352, -16047, -6499, -6011, -11370, -9069, -2353, 14404, 13999, 4277, 10498, 10194, 969, -12359, -5684, -5663, 1021, -297, -12987]
6990a2987J986R432q576l011O469j1755j360m691p075L651Q585J2246n396j021
6976a3503R62P358N714k962o787M529j1661q814M204J3529P212p865k930O428
6962d586L100L083n788m918Q733p866j0652q516O416J1037Q886j03j5029R711
6948f492J5473j5197p503j804N200J0525L540P530j0711j2957j2249m080M911
6935b3814M048P412Or574o82Q071n449N065J2526m902j7659Q992Q380Q215J356
6920A991p390K135r348q042O760P18J0314j359j2682O859M561J53N164M300j2788
6905h654q545J8124M805k733k782J0313M007j4847L847J789O806K702K421j6117
6891A136j2900l587M058l747j5088K899L251m818R210R284R385r935k818J99L268
$$ y = [-12987, -11001, -1569, -10145, -13156, -6687, -18442, -19802, -24493, -31568, -27917, -19332, -7086, -12482, -13503, -12541, -5183, 531, -2431, -9218, -4689, -16350, -25164, -20960, -7431, -219, -8084, -11014, -4586, -1486, 1597, -4191, -9109, -376, -8242, -18894, -27410, -20994, -9957, -1071, -1174, -16203, -6492, 8981, -6216, -13719, -15523, -10323, 202, 3742, 11272, 561, -12396, -24645, -28725, -23814, -19766, -12354, -12348, -21922, -22604, -14533, -19982, -14917, -2391, -7293, -24952, -15960, -7580, 635, 1991, -5399, -3264, -12612, -20654, -13894, -13176, -2862, -4221, -16903, -10044, -5483, -5330, -166, 4134, -8654, -17199, 925, 5730, 2997, 215, 10528, 14535, -312, 3535, 5324, 12130, 14832, 17253, 1136, -11764, -15351, -11293, -15040, -30128, -27229, -23978, -28796, -19586, -10302, -917, -10852, -13670, -13471, -10203]
6876a0203O276R601m26r387N716L918m676M224j191k0273j2542J8504J7595J0082
6862A7218n217j3274q845N792q27M595j310j5382O087j33R174m034r84m379N322
6847f197K07K885r866j0572M060J4090J1231K345K662n158M089p067o166J8172
6833A4715k124k5235J331J2567n92j1114n322k62J7961J57j4811K610R567J117
6819E65k0682m290L649m73K923R827j538P649N140M617q345j3362j184K5122J2706
6804B2324K4n634j597n146n589j0542J0028l437m89n046K349N086L930n316p006
6789f061J646Q045L281K3357K413k046k0138J895l97q752r201L295N268J854l932
6774E27J795m415L419O102n068j1919j4233J323J3298J6682J601p198l910Q186
$$ y = [-10203, -3927, 5674, 5248, -4139, 1577, 5495, 819, 5043, 3852, -16421, -28963, -10459, 7136, 17218, 12001, -1273, -10118, -4326, -5153, -558, -1868, -17250, -11163, -11296, -2122, -6156, -7140, -11519, -6197, -5990, -3105, -12971, -23543, -19483, -5393, 5838, 8183, 10845, 5687, 9776, 2709, -3457, 14715, 12591, -12644, -11313, 1254, 662, -10452, -15774, -16036, 1925, 2082, -12729, -10119, -552, 565, -20117, -24407, -20758, -21231, -18308, -8481, -10019, -2370, 2770, 7387, -958, -14320, -15504, 9618, 22324, 22348, 16714, 15117, 9971, 4382, -6160, 3868, 431, -58, -5104, -2755, 2331, 6261, 945, -6061, -4415, 3630, 6911, 30268, 32681, 30635, 10497, 12392, 11995, 3243, -5958, -2663, 2605, 4459, 527, 2322, -2093, 1326, 7428, 2360, -9559, -23792, -22469, -9171, 7511, 9112, 1914, -1996, 6190]
6760F190J58R214M935O916k7245R60N328l594n717j485m672Q533N202J899N300
6745A1922r289r652m243j966l07J0180l476r190j1393j4258M105J2472J2464J976
6731a0655L560n961j1108J331j167K557J3213J3432K179m801j3721j3350M405
6718b0086K6539j084q063n472M243k19J1833J0680N948p180r000j537m302J3718
6704A6018J3696j1296j2479P74p959K53O734P160M818K716n949K090O505j4667
6690H414l705k68q551J287L890k548L363p253q523J083j772l534Q478M744J7709
6675A2814J0819j4517j845J073L289O209j6647l794R326O2j3848q683O622n886
6661a5006J735k254l649J4497Q576L817K600n742m867j4085j2019q049L579J4111
$$ y = [6190, 6348, 15562, 20497, 27413, 168, 1128, 6456, 2862, -2855, -4340, -9012, -479, 4723, 6622, 11922, 2633, -7019, -11262, -13228, -13535, -3355, -6831, -16021, -27414, -41672, -37567, -25095, -12631, -10655, -7095, -13056, -24164, -22833, -24000, -21443, -8230, 5202, 7381, 2580, -11141, -24491, -20086, 6453, 5369, -2694, -8166, -3923, -4142, 7691, 18371, 24319, 17139, 8139, 6602, 2300, 16018, 29714, 18418, 5939, 6713, -1246, -993, 5741, 12901, 17719, 20435, 14486, 16576, 23081, 8414, 4709, 4441, -4110, -2823, 1067, -1481, 1882, -5371, -13894, -12811, -14583, -18117, -9639, -4895, 12814, 23633, 9116, 7271, 8344, 11633, 17842, 1195, -2599, 6727, 6789, -7059, -15742, -9120, -15006, -13271, -15525, -19174, -4677, 3899, 7716, 10316, 4574, -293, -14378, -26397, -34446, -30867, -16756]
6647a6756n815O328r047l710J4807Q74R056J1799J680J280J7035l770K735j9587
6633F909m133R968N182M477K477o239n927R647j4459j5344p767J3351Q526j1264
6619d596N266J1202N180k760j3558o260J276M741L503p427j5335j247K3372J3492
6605A6849l048p909j2799O745p564p625M387j4528K338J506N605J1323p2k389
6591g181o61N226n205q466l682p161q117P216R484J961Q273K396M014K514N949
6576F560p095N615N989J428R281L035r274j4569k883n826k1185M370M944n940
6562b5550m458p443k368K4391J6635n182j183N481J1753K527j0084l113j1683
6549a0277j018K651n009J689L081N669J1918o146j1961j614J138j250J5071P489
$$ y = [-16756, -22571, -16243, -25290, -29000, -14193, -13319, -4263, 7536, 9216, 10496, 27531, 23761, 26496, 6909, 2776, 12744, 17926, 22403, 24880, 18641, 12714, 22361, 7902, -7442, -15209, -1858, 6668, -4596, 670, 11872, 17052, 14292, 734, -5526, -4250, 491, 3994, -3433, -18768, -20015, 3357, 16849, 13801, 5892, -6907, -162, -7726, -15351, -10964, -25492, -23154, -21648, -16043, -4720, -4792, -7181, -7842, -2616, -7821, -16287, -19969, -27130, -35247, -28031, -18547, -16586, -8313, -5917, -1903, 611, 6560, -535, 5080, 11069, 12497, 21778, 24813, 15539, 970, -1913, -7739, -28924, -24554, -19610, -25550, -30008, -37451, -39819, -15428, 1207, -3975, -5158, 323, 12076, 14603, 4519, 1406, -10277, -11295, -8644, -13653, -11964, -8883, -3214, 8704, 2558, -9403, -11017, -9879, -11129, 3942, 11431]
6535A1431r567k39r633K23J1168N113P606J454J9301J279j0000j1939o797r613
6521b13j0773j0541m554J3459J1705n790P898J5823p669l832n984r241P543Q363
6507F194j46j88o049k2326r099j1860J2827K7514K1883j267q633r814J200M316
6493D552p947p23m80m014J0765J7205n218K572L226l100J6680q820j7577j5799
6479h678r134o452O737K3304L365o50O578j0742k133O14k554q577l681J3786L370
6464E153o624j0076j930J921J2363j4947r709L976M820Q734Q333o321O317k56
6450A754j0790k95J4579k473j4785J149N870o414j5314m391J3491M764j0597m542
6436b7994J2644J7698Q352r723J863n594J87J1133l146o269p032R318J4149j744
$$ y = [11431, 1864, 1625, -8008, -7785, 3383, 8496, 16102, 17556, 36857, 38136, 28136, 16197, 9400, -213, -10986, -21527, -26081, -12622, -917, -6707, 1191, 17014, 9345, 5513, -471, -9712, -2169, 6194, 6048, 5860, -189, -22515, -31614, -43474, -30647, -3133, 18750, 17483, 8850, -964, 236, 4552, -3395, -4118, -4598, -8612, 2153, 19358, 14140, 16712, 19938, 16838, 33518, 24698, 7121, -8678, -17812, -24264, -17527, 5777, 9142, 8492, 15070, 4328, 2195, 2809, 255, -8322, -12003, 1783, 5153, -1471, -11547, -13477, -11556, 807, -14140, -23849, -19873, -15053, -6319, 2014, -4307, 2010, 1754, -9036, -9331, 5248, 2775, -12010, -10861, -4991, -11405, -26719, -31110, -17619, -12855, -23452, -27994, -15350, 2348, 10700, 977, 2840, -2754, -2567, 8566, 5420, -849, -7881, 1437, 15586, 13842]
6422A3842n869q182q157k262J4419J1152n347m980Q270j1874j815j619L657J1452
6408A2687n679N595J732J455n268j3294j23L812J5903j0302r17O373o573Q108
6394A3509k098q814j446L831r76r645p405J2315m01o991l952Q494R370l255j1497
6379h961r830r6r024m278n733O614K0542M205P876N206O002N265r452o760K838
6364D414R414L41L776O63j6783r332K764L479K687l780M124q082L996m499m221
6349a1039j179m097J2796J0074m221j0396r876p537r643l437J4571Q077J1801
6336d106K686j8006j0109Q41l281O452J1670J1880j668n56J805j025N55P255l873
6321E20l985j4078o887J4673J1352L533k048m496k574J3675N1M315o202j1249
$$ y = [13842, 7973, -209, -8366, -10628, 3791, 14943, 9596, 4616, 12886, 1012, -803, -2422, 1235, 12687, 7008, 12603, 14335, 15790, 10522, -2772, -2895, 917, 16820, 6518, 5601, 11974, 5401, 13509, 11411, 2597, 1151, 4982, 4006, -5639, -13044, -729, -1130, -8121, -12073, -3579, 5791, 2536, -8961, -18791, -18887, -27911, -32189, -37922, -31308, -10766, -6561, 1315, 6521, 12523, 17788, 8336, 1576, 4414, 13828, 14169, 17945, 18608, 1825, -7507, -4743, -1264, 1423, -2357, 1767, -6315, -2319, -6818, -11039, -12218, -16315, -3519, 6555, 2334, -8062, -17938, -25475, -35118, -38555, -23984, -15907, -4106, -1420, -19426, -29535, -28694, -31975, -25523, -13853, -1973, -3641, -4197, -2392, -3417, -2862, 4393, 520, -3465, -17543, -24430, -9757, 1595, 5128, 3080, -1416, -3990, 9685, 9736, 14051, 7849, -3400]
6307c400K405n883m598M293K595Q349k223j346N958J0624j3521j1540p500P45
6293a5042M292J284O688J3108J8o392p424O465p379r964m406M637O901M188o803
6278i829J7381L506m341J1832J1306j0191j0919k513j1851M020P956o114q147
6265g904J039R244O14k472R114j340J0695j1434j3026k697k290o95J0463r495
6251a0184j7574p20J8365J2006q921j4685P030r52n769J1799k758l934M49J732
6237a4116n472J0714R861K467M19k490n054J789O851K015k697j092N435o092j2729
6222a0191N232J6707l665k649N123j2123r190Q847Q483N666J0471j478j1138j6290
6208f195q333k370P62q549r877M0K104K762O244K1054J1596R90n85j2433p147
$$ y = [-3400, -995, -6878, -11476, -7183, -4588, 3761, 1538, 192, 6150, 16774, 3253, -8287, -15787, -15042, -10750, -9466, -2778, 10330, 10348, 3956, -3468, 2997, -4382, -14346, -18752, -14115, -7214, -3026, -9829, 7552, 11058, 6717, 18549, 29855, 19664, 8745, 6232, -5619, -1599, 6357, 243, -7904, -6865, 2379, 2993, 521, 9635, 8295, 18990, 7556, -5470, -8167, -10457, -11152, -689, -10184, -27758, -28478, -10113, 1893, -7028, -21713, -14683, -15635, -21404, -9605, -12363, -16297, -15848, -14116, -19588, -8874, 987, 3454, 3873, 1383, -3671, -1882, 4969, 6984, 4287, 3195, 8630, 2538, -10191, -4959, 11748, 8083, 5434, 10557, -1566, -10756, -1909, 6574, 12240, 22711, 21233, 10095, -6195, -14528, -16898, -16136, -24685, -34562, -34522, -32418, -29656, -23412, -2358, 9238, 10228, 9643, -2790, -9937]
6193i937Q169k090k71J0532n017J047J195j2389J315J564N71r596K85o534j8468
6178c9624P229J734K0875L780J544J4229k417m892q134k665P788R29j485j313
6164b422K367J163k689k857l950p575o430k54P098J100J0641R182r16j4955p201
6149a7698L973M245N211N524k198q912K177l177O55J764o687J2023J371j6677
6135a8406J183M275R320l144j1938P349M633M355j1843m874M776J623j863N862
6121h692Q790P718R697N553N407l518K131r390k986m119p411j0056M71K173O02
6106c630m262n960J157m592q691O370m395j6905J0025Q702r19J1366k522m880
6092a9136R095L920j283m152k039k87q023l572m775Q565M446o135J75M120P17
$$ y = [-9937, -1768, -3858, -4129, 6403, 1386, 2433, 3628, -8761, -7446, -5882, -5311, -14907, -14622, -21156, -39624, -32395, -30661, -9786, -6006, -4462, 9767, 7350, 2458, -5676, -8341, -553, 376, -1109, -2422, -55, 1108, -1581, -4438, -8388, -15963, -22393, -22647, -15549, -14449, -3808, 5374, 4458, -10497, -17698, -13725, -9480, -4269, 1255, -943, -9855, -7678, -10855, -10200, -8436, -15123, -3100, -1729, -18406, -17223, -12948, -3628, -6772, -18710, -11361, -6728, -2373, -14216, -19090, -14314, -12691, -14554, -8692, 98, 7816, 17513, 23066, 28473, 24955, 27086, 17696, 14710, 10591, 3180, -6876, -6405, -4232, -3630, -7892, -13852, -12695, -17287, -25978, -19608, -24003, -40908, -30883, -22181, -23100, -11734, -14256, -19136, -10041, -6121, -7404, -11556, -13595, -13882, -21905, -25477, -30252, -21687, -17241, -23376, -23201, -19081, -18364]
6077a8364N4R578L590j193J550p111j2046J520M715k470J832m122n855J0955N777
6062a1590J884q509j2409j216O324J0542J1186k647L346P073O536Q556p817j2264
6048a005o978P581j1582j4381k762J772l897R350N630M610l525j6286N513Q641
6034a7319L049N406k373N217K823O88L523J6720n999k207j0167l857R23k665j2597
6019a8835r061j1253L260K1994K48m283L879K139K191k464n99L440J2645n892
6005b591j2346J0615K1722p449p847j3721l765J2242M665o162M104L259J1650
5992A4376n504r411k0274L078J4119J671p320L476n933M289m210N359L572O740
5978D028j78J431J805O94J854r349j6582j043J5125L216j9181j0519j098R362
$$ y = [-18364, -18310, -8732, -5142, -6335, -4785, -11896, -23942, -22422, -17707, -20177, -18345, -22467, -28322, -17367, -11590, -9706, -18215, -30624, -31840, -25516, -14974, -3788, -6435, -3089, 3984, 10520, 19076, 11259, -1005, -7983, -402, -11984, -26365, -29127, -27355, -31252, -21902, -16272, -11662, -15187, -31473, -25960, -17319, -14270, -8864, -11237, -6020, -3197, -2509, 1014, 17734, 11735, 9528, -639, -4496, -3573, -6238, -18835, -27896, -39149, -35889, -13895, -13647, -17930, -14051, -11912, -9721, -12185, -12784, -9344, 3301, -2591, -14937, -4322, 17400, 9951, 2104, -11617, -15382, -3140, 1525, -4637, -533, 2726, 14376, 8872, -539, -20813, -17735, -3616, -1945, -9265, -5789, -11722, -7433, -11643, -6284, -2712, 4028, 3850, 5281, 7086, 7780, 9634, 285, -16297, -17340, -2215, 1001, -18180, -28699, -29797, -20435]
5964b0435J0056n991o372O35P734q324p919Q750J0883n886k1456K363J9959J2755
5950c248J744P020l705j2692M091Q230r381L893m351J468j331N128J1577K455
5936A0898M797j308N694l841j6787j4255J4836J8739K765q693j91L20J93O32M54
5921A4253L450k86L91l307p571L970O597L873O430m79j5747j1153K847j2442l027
5906a2201J47L459l52P796K924L132K868j436n775K783j291j0215j376N312p903
5891a2128j995K593j745R808Q863L912l618q81K691p613q459m049R062O353k579
5876B15j5791K097K115j2295l297O576P319Q570j2804K2670L656q211k71M259
5862D808J0648r575j3657j466K461N762r136j2659R17o787j3172J4298J1898j926
$$ y = [-20435, -10379, -16370, -22742, -22107, -14373, -22697, -30616, -21866, -10983, -16869, -38325, -35962, -16003, -3248, -1504, 5516, 1811, -10881, -6790, 1440, -7941, -4048, -8399, -6931, -8262, -3134, 8443, 10898, 15695, 14387, 20081, 16240, -547, -14802, 34, 18773, 21538, 12845, 12654, 12974, 13167, 13799, 14253, 17703, 17417, 17808, 14501, 6930, 10900, 17497, 21370, 27800, 27321, 11574, 421, 3268, -9174, -12201, -12054, -8595, -8947, -1151, 1773, 4905, 7773, 6337, 562, 3345, 2054, -8161, -9537, -4225, -12128, -14123, -11530, -13275, -3467, 5396, 9308, 5690, 4809, 7500, -113, -8572, -12621, -3559, 2794, 215, -15576, -13479, -11364, -23659, -26956, -20380, -13061, -4491, -17295, 5375, 9031, 820, 549, 4808, 15456, 5881, -7776, -9242, -6781, -1019, -10155, -22814, -21897, -28684, -41856, -27558, -15660, -17586]
5848a7586O636L8J502J7531O233J335R408p774k0549j0026P131J1826J3400r585
5834I520j0484p026m36n018O261M045K836L597o682j1439j1931J0912J0041L53
5820e451L024k563l898P81k22k666l337R206l331J1072L940k464N785Q3m072p41
5804E146l521p82p445K926r174k4105J3440R319J447K293j2435L268J0338J1334
5790B049L269J5413J2256L971N79k1884k0730N129o057r332J169j0143j873J1973
5776a4211J3257o97k963p429M036m766K092j3428L538N385R248m570L506l966
5762a0968K670K525N422j2881j303j423L130O440j7667n083J2302q209o573K0641
5748a0977J0379J9844O282o222j1526j3905r234n194p64R199m887m455M996J162
$$ y = [-17586, -10950, -10912, -9410, 8121, 14354, 15689, 25097, 17323, -3226, -13252, -6121, 5705, 19105, 9520, -964, -7990, -8426, -13444, -7183, -3138, -302, 3295, -3387, -14826, -26757, -15845, -5804, -5451, -2427, -4990, -8888, -8107, -8329, -10995, -14332, -5126, -8457, 2615, 6555, 4091, 9876, 9959, 5887, 5146, 1625, 843, -6602, -3676, -12850, -36955, -23515, -14196, -12749, -10456, -22891, -19623, -9285, 2049, 5318, 20731, 32987, 36958, 37537, 15653, -5077, 52, -6005, -15337, -14168, -24311, -26184, -14211, -954, -1651, -4614, -12043, -8007, -12773, -10681, -24109, -20571, -15186, -5938, -10508, -7002, -10968, -8298, -5773, -351, -13232, -14535, -15958, -12828, -6388, -24055, -29138, -16836, -25045, -31618, -10977, -598, 19246, 25528, 19306, 7780, -6125, -15359, -20553, -21317, -12118, -17005, -21460, -16464, -15302]
5734a5302j6917p648J4744J820K598n391P034J4102m569j6329O417J9610Q130
5721H299K903j3078p386j142P934J0113k728P4K348j8017j3931m867p332J2666
5707b4144J7910L381J513k804J181M976j66R745J473L88j785m852j2999p925M02
5692a3706J9927r53q304j2606O26J7679Q96j2463q775M458m434q528O512N739
5678a3932o8L270n523J2052K1452L723j7854j3329Q61k39J494m748J884N870k136
5663g223m484o96O963n087k907K732o322R979J672j0743j0253J0517O239R20N074
5648c619J1720l432j1830N71j2553j4989m795R713K528M515O846j41M36J246P838
5633e946p23j5345m006N817M91n541R126k794Q63J3344L725N545k927o192j6293
$$ y = [-15302, -32219, -39867, -25123, -23303, -20705, -26096, -19062, -4960, -9529, -25858, -19441, 169, 8299, 11202, -1876, -9262, -10404, -2470, 7643, 4915, 4989, 7337, -10680, -24611, -29478, -36810, -24144, -6234, -2853, -1340, -4144, -2963, 2013, 1847, 11592, 13065, 13453, 11668, 6816, -6183, -14108, -13706, 6221, 5268, -3036, -15642, -15016, 2663, 3559, -8904, -17679, -13221, -17655, -26183, -19671, -13932, -14000, -10730, -16253, -4201, 17251, 20974, 3120, -10209, -9348, -9587, -8093, -12841, -10957, -5087, -7223, -11707, -12403, -5440, -10527, -13434, -10702, -17024, -7045, -5373, -16116, -26369, -15852, -9613, -8693, -3619, 8101, 4669, -7161, -6590, -19143, -34132, -38927, -29214, -26686, -22171, -15325, -15466, -15030, -13784, -5946, -6669, -22014, -26020, -20203, -19712, -25253, -16127, -18921, -18058, -4714, -989, 4556, 1629, -4563, -20856]
5618b0856K281O547O424L194L416r507j3621k125K4867M344j1333j6762o023O721
5604b2433M402k76k259k815J10Q707o280l101J0827J2839O061l49j083j2419J863
5589f206n603M565m307j3231Q953J7438J0736j2491p239m228Q898J8126r155J1686
5575A7942N374j5829j7392k009R005l483k530l63n614J2465N206n549K142k730
5561c365j615o345j435K372K583p897k614j4908K110J4283M673J0200j1293j5932
5547b9183P062J8744M32k18L474J7680J4236j5717j4830j2024j3918J4521J2146
5534B405K5168J1396m65j1804r588j5095j6292o93J6185J0451j5105O109K788
5521E460j2224k342R747J112p385k118O94Q068j0542j542n783J510R725K122M735
$$ y = [-20856, -18575, -12028, -5604, -2410, 1006, -8501, -22122, -24247, 620, 4964, -6369, -23131, -29154, -22433, -18031, -18307, -20566, -23381, -23271, -14564, -20844, -23945, -13118, -279, 5782, 5433, 4350, -8069, -6206, -11809, -7244, -11551, -24782, -15829, 1609, 12345, -146, -7385, -11613, -2715, 15411, 6256, 17942, 23316, 7487, -9905, -11914, -2909, -6392, -8922, -9285, -14899, -2434, 2772, -2777, -635, -3365, -4980, -11325, -12760, -10388, -7805, -15702, -18316, -33224, -31114, -16831, -12158, -1958, -13251, -29183, -22121, -3377, -2945, -3163, 311, 17991, 32227, 16510, 1680, -10344, -24262, -9741, 2405, 27573, 38969, 38504, 26700, 17112, 2017, -14275, -14968, 1217, 11668, -3437, 2672, 5460, -6764, -9106, 641, 1753, -5632, -7750, -7056, 1012, -9530, -11072, -16855, -15345, -5620, -3498, 1237]
5506A237m645K003o739o209j285m849N270J6061j618j1731m361l784j0690o828
5492c8168N704Q890L18J5033J1734L389m249r559Q217P762K192n859L038l019
5478E423m572K878k348q521n041N825J2259k803N442r262k4402m732O543J394
5464b1917J431J0129p713m71J0733j0336j7680J1126J5710J4798m400q56Q88o067
5450d625j3375P32N49r127n605J4313P283M944r968j775K644j371P36N272O075
5435c298O035j0114K100j043p035j2173J750O318K452J655J3064N221j1047j987
5421h102o073o193q221k686J7022L679O893J11J50q523K043J6653J2795r716n206
5406D626J4122M808j820j1046j4265n543k240P0J1761n353R556N471L058k097
$$ y = [1237, -3408, -1405, -8144, -14353, -15638, -20487, -15217, 844, -774, -12505, -16866, -20650, -31340, -38168, -32464, -23574, -23256, -8223, 3511, 6900, 2651, -6908, 1309, 9071, 11263, 5404, 8442, 5423, 851, 3729, 1381, -7140, -12181, -6356, 5903, 3100, 8542, -720, -25122, -29854, -23311, -21917, -20486, -10357, -18070, -18541, -7808, -18144, -35824, -24698, -8988, 5810, 1410, 554, 1442, -4625, -18000, -17268, -16719, -25846, -31451, -17138, -9855, -4911, -14879, -16654, -14010, -15381, -14645, -9373, -3298, 2737, -7377, -5277, -6320, -13355, -25528, -23778, -17460, -15008, -13353, -289, 4932, -6115, -8102, -14175, -20368, -28589, -31275, -14253, -10574, -3681, -3570, -3420, -11943, -9900, 6753, 19548, 9832, 4626, 18748, 23556, 21736, 10690, -3575, -9118, -11358, -11288, 473, -4880, 4676, 10147, 13205, 11108]
5392A1108j0614k1663j0545K893L194j68j940p266r599m167K4220K3434o184M679
5378b618M307j2307r204j457j300n967J1906K1860P451n24J870N521r547J7451
5364B7442N111j0806j2294m882m622o306j234J6080m846J920n699p726N687J2406
5350A0231j099j9981k612J6676J0224O061r222k811l130o718l214K5082J2238
5337C1725k2495j2282n901j7395k528L3875J5654j3349j5244o707k19p568l435
5324b5869J0894J1331r001k44J0939K607j1358j1747M780J4465J6873q30p558
5311E282M78J2017j991k996j0327k524r633P92L375q856K639L509J2226J0437
5297A4428o236P348q742q419J738K961q3n771l305J979O308k019Q350j405j4089
$$ y = [11108, 494, -21169, -31714, -28821, -25627, -25795, -27735, -35001, -44600, -48767, -24547, -1113, -7297, -2618, 1689, -10618, -19822, -21279, -22579, -28546, -16640, 5220, 12671, 12147, 14017, 19538, 9991, 27442, 32553, 21747, 9453, 4571, -51, -6357, -7591, 8489, 3643, 5563, -136, -7862, -2175, 10231, 9132, -10849, -13461, 3215, 13439, 19500, 10278, 7467, 4337, -2381, -5595, 19487, 31725, 9230, -3052, -8953, -26348, -28876, 4999, 20653, 7304, -7940, -14647, -14866, -22434, -25869, -14975, -3644, -12645, -12889, -1950, 657, -10701, -22448, -17668, -3203, 13670, 12840, 5282, 5760, 17777, 15786, 12790, 2463, -61, -9694, -8902, -5527, -14383, -11744, -8235, 3991, 14428, 8192, 15540, 6798, -1621, 117, 3078, 2995, -2776, -6081, -4102, 2206, 187, 8537, 7132, -6957]
5282f957j1543O512Q822J2116j167P115j0862j964j406p555L275M693m783L85
5268c319n859j829P835M258o259M537K160l910r424K136Q513j6830j3050J139
5254b9902K3119J0228J1996J02j0978j2576q081p82M593j2905M950M561J0230
5241e445J837Q32o980K110n397K408n723J1578J0083l090r395j4682j9731P150
5227c4445K9987J2492r678j296N456n214n967O951j0886k642J1922M635j1766
5214a0451m558J1506P960j056n556k972P831r652j663j460j5459M54J7213P350
5200e13q95L799k123q901o860j312O477Q831j2054q834M066m645O386P780M826
5185c972J2007k725K578j638m504N80k271p775M858Q723M776M620p132o6Q139
$$ y = [-6957, -18500, -11988, -3166, 8950, 7783, 14898, 4036, 2072, 666, -6889, -3614, 1079, -3704, -3319, -9178, -11007, -3172, 1086, -5173, -636, 1524, -2386, -11810, -9674, -1161, -17991, -31041, -29902, -6783, 3445, 15441, 15543, 4565, -8011, -16092, -16874, -12281, -25186, -20236, -15675, -5445, -3608, -2776, -9756, -7646, -13043, -10635, -16358, -4780, 5303, 2213, -7182, -21864, -41595, -34445, -4458, 8034, -1644, -2940, 2516, -2698, -8665, -1714, -12600, -15242, -3320, 1315, -10451, -15009, -3503, 4457, 3401, -2155, -5127, 2704, -6948, -8611, -10071, -25530, -25076, -7863, -513, -1408, 2391, 268, -8633, -15493, -16805, -10328, -1497, -13551, -22385, -18319, -22964, -16578, -8798, -3972, 8035, 5310, 7888, 6250, 1746, 2326, 55, -7720, -2862, 5861, 10637, 15257, 8125, 8059, 16198]
5170A6198M328o754j7187p169J4349J319K136q600k618P230K0466r033j3708j9963
5156a9006M664J9335J0161j831j7190p666M47n113K264J1508N356r766l354l917
5142a4108l225q429n746R445o08M149O025J975k519J1931j413M79P315L616o044
5127B843K822R32o011j247N508j1256l75n6o79j24O721q578P594j5243k885J2085
5111g949J2233K829q654L789J088j4569P612J6984j0056n642j2211j732P623R141
5097D86j1552L386O499Q235j4700m696M075M036m354K528J6454L255l55N818N657
5082B4772L296p333j4005K16r597m271j875j5616q406k464P908r09j90J7035K1190
5067I751o188r986r464r479J315J5297J2571o669l503n150n086n883J978j120
$$ y = [16198, 20526, 13772, -3415, -10584, 3765, 5084, 7220, -1380, -3998, 3232, 23698, 14665, 957, -19006, -14342, 4993, 15154, 13323, -3867, -11533, -11086, -16199, -13935, -2427, 2929, -6837, -10191, -14108, -17333, -25762, -31508, -22063, -22671, -18522, -12497, -10522, -13041, -1110, -2523, -2044, 5271, 8887, 2843, 5665, 6597, 586, -661, 4847, -6409, -6784, -6840, -7519, -7643, -922, -9500, -1906, -17149, -20034, -7949, 4284, 7113, -1541, 2248, 3336, -11233, -3621, 13363, 3307, -2335, -14546, -16278, -8655, 486, -11066, -7680, -1181, 7054, -7646, -12342, -8267, -4231, -8585, -6057, 10397, 13652, 13297, 19115, 24772, 28068, 20735, 6730, 6946, -2651, -6922, -8797, -24413, -32819, -35283, -27375, -28284, -28474, -11439, 9751, 3563, -6423, -15887, -25366, -24051, -8754, 3817, -2852, -6355, -11505, -16591, -22474, -20496, -21616]
5053b1616P527J4550J5673K53k1386k0321qQ752q547K806J5329J4507J0196j3917
5039C798k6359N560J6249R93k575L179R058K328M152j153j1265m442K797J792
5025D112l572J483j1428o697j817k0392m85J5872J5240R484J143r026j3840k114
5011b2037j277J5585J5543j0404k69Q139j736j0097j3580j97J0311J1727k212
4998e04k789n923j516K836J2889k874Q04K811q486j8610J4687J0922j0104k1409
4984b7266J4168K5117K79j2888j4973j0098N930N136j98r040M064K0403R99j8220
4970a6587O002M513J2074Q019l322J398m472n295m456J0428K563p335j1372m553
4956a2395N724m562k776l541P088K821R819J1459l65R01j744k361k373r653j1724
$$ y = [-21616, -14089, 461, 16134, 16387, -4999, -25320, -25328, -16576, -25123, -22317, -6988, 7519, 17715, 3798, -22561, -17001, -752, 241, -2334, 845, 9903, 12231, 16383, 15230, 3965, -477, 2320, 4112, 540, 2023, -9405, -16102, -17919, -38311, -38796, -22924, -7684, 1800, 2943, -6083, -19923, -22037, -23314, -7729, 7814, -2590, -2859, 5280, 3544, -6553, -20133, -20330, -10019, 1708, -504, -3293, -9216, -10732, -7896, 4993, 2119, 2923, 5734, -2752, -21362, -6675, 4247, -5857, -27266, -13098, 12019, 12298, -590, -15563, -25661, -19731, -14595, -14793, -23833, -19769, 634, 1633, -16587, -10585, -6072, 6002, 14021, 10699, 12097, 7625, 2330, -2126, 8302, 10865, 3530, -7842, -12395, -6671, -11233, -14009, -17550, -10462, -7641, 2178, 13637, 13272, 14173, 12429, 10068, 7695, -1958, -13682]
4941a3682J673N344j641r131J0025l51j7120R330P954J3610P391m38j2017j3451
4927a2504J660J3513L085j5912j167K787P853j5102N440j451J0271J1534M135
4914A4142p265n801j9096q104P479J5355j0899L417m080N32N478j111mL597O459
4899I9K38O66l852M76j900l749k3162q153J9544K848j693J1945O375Q479R005
4884A7166k988j8062n793Q104L921M10k67J7467j5203j0475L140J7694L29r559
4870E884j3948J3400Q701j794j0573n573o464N784n066O822L229L526J326M260
4856I514k218J4225j681r736m728J0482l61r768k33P188j727K6J5689j8004o495
4841B173m905Q664O469n29N93j918K645p087J1777r534j8414j5711m587N055O567
$$ y = [-13682, -12009, -6665, -8306, -17437, -7412, -7763, -24883, -15553, -7599, 6011, 13402, 12964, 947, -12504, -10844, 2669, 5754, -10158, -11325, -8538, -685, -15787, -10347, -11798, -1527, 10007, 14142, 6877, 1076, -18020, -26124, -18645, -3290, -14189, -10772, -14852, -14320, -8842, -9953, -9957, -6360, 99, 337, 1003, -2849, -2373, -4273, -8022, -31184, -39337, -19793, -16945, -18638, -6693, -318, 8161, 17166, 14178, -3884, -9677, -1573, 2348, 2758, 2491, 19958, 4755, -5720, -2580, 15114, 15443, 5884, -8064, 5336, 14037, 12243, 1670, -3903, -10367, -4583, -9649, -2827, 402, 3928, 5254, 9514, 7296, 21521, 19840, 10104, 5376, 15858, 15497, 5729, 5496, 12684, 10957, 10983, 26672, 8668, 2173, -2732, 5932, 12401, 11872, 12465, 10547, 13192, 6105, 17882, 8348, -10066, -25777, -30364, -25309, -18742]
4826a8742o297m2P818J1387J275m196M002q078p976r844p274K260J8213P726N417
4811d351M118k59j9991Q095J1670Q98M444o346P043j0283J1853J251l462j236
4797C444r330m459j173K188L289L605K6435J213k597k624p050j178L119Q905N900
4782B9687j4287o331j0209j0375M653R59M720K463m130n653n91K385J1371m251
4768D11K138J7456P377n401m866k566n395M042j859j0271J1784P585K310q171
4754A4574K560m61J292l96j0071j1719l495l05J316M221P379M114j1560q342p7
4739a0970Q55J4988o829k031j344j147k322j733Q960O51l217J2685N590l056m814
4724F266M450L918j6611l218O177L201j4792o12J5495J8799L359n474k3109j2041
$$ y = [-18742, -25039, -25081, -17263, -5876, -4601, -8797, -4795, -12873, -20849, -30693, -37967, -35707, -17494, -9768, -4351, -233, -492, -20483, -12388, -718, 180, 4624, -1722, 5321, -4962, 6891, 8142, 4680, 3444, -5886, -10345, -11518, -9330, -6041, -2436, 23999, 25212, 22615, 19991, 12941, 11763, 14882, 23787, 29687, 15400, 9069, -1140, -11515, -6862, -5903, -1183, 1280, -2850, -8503, -9094, -6709, 4662, 411, 2549, 20005, 27382, 21981, 17115, 14549, 9154, 13196, 11337, 1066, 12850, 20435, 22745, 14574, 17134, 16673, 17965, 17569, 7498, -4221, -7716, -8021, -6705, -2484, 4895, 9009, -2551, -10893, -10970, -10115, 4873, -1956, -3987, -5331, -6478, -8800, -10533, -1573, -922, -4139, 8546, 14136, 11080, 6266, 10716, 14634, -1977, -5195, 982, 4183, -10609, -11221, 4274, 23073, 26432, 20958, -2151, -14192]
4710a4192j5081l443O849j525j3202l393J2095J1676k342R791N296K119o236Q381
4696c207J2863p664k622o538j0012l281j0162J2025J33L583L468r162n484N668
4682b0392J9126J640q423P768P8q451N118Q856L042p158k1523j4511J7304J3325
4668d201O064r08L060O140j0658o222R564J0540m274O123j7163q065p694o829
4654b4523M287K849l842R681J02P168j362j1642K855j4598R86J5568Q688K776
4640a007P570K916r401p695n947J7080k540r371m389O614J8885M027n573j1173
4626dK186j878j062l006k129R985r648j713J405q587k465l724j097O140Q754J0115
4610C272J0380J943q090r561O959k901k648q752n536O084j486j054m448N696K652
$$ y = [-14192, -29273, -32716, -25867, -27392, -40594, -43987, -31892, -20216, -22558, -12767, -7471, -5352, -11588, -3207, 9656, 1992, -630, -7168, -17180, -20461, -30623, -18598, -18465, -14882, -11414, -20576, -26060, -20392, -1266, 374, -8049, -281, -203, -8654, -3536, 5320, 8362, 1204, -20319, -34830, -17526, -4201, 1863, 955, 4015, 10155, -503, -6725, 2839, 13379, 9105, 15228, -1935, -10000, -17694, -24523, -20236, -17387, -21229, -11548, -11446, -4278, -5640, -17282, -14427, -29025, -28039, -12471, -3783, -1007, 6563, 9479, 78, -7617, -13564, 3516, 976, -8395, -12784, -6170, 12715, 16742, 11169, -4, 2182, 304, -758, -3764, -5893, 4092, -5556, -7269, -5864, -14451, -16916, -20640, -21737, -15597, -6843, 3272, 13652, 15595, 7505, -2056, 4903, 2002, -646, -9398, -14934, -8850, -10336, -11390, -15838, -10142, -7490]
4595g490m11o512p95r434o73J6989M774j1040M484q973M634M266j3338m420K077
4580b5862J1271j2108J4317R349p300j911J0342l603o959J2493L30O827q786j5357
4566a6957R901J4031j4493k518l966j0562q69m039J1939J2804K956J1744k46j308
4552H417n519k643M826J7331q554j2360K208j1097l30Q422Q785q999J4432o227
4538H692o734K3128L356j6796k5033j3148m259n883J2225P183m644J8298r97m015
4524h627Q801L466j2015J943M304o675P557J5416k463j1365n681j1573k496k829
4510b2237o75N74J923R245M502K17J781K054N03j388q668M370j529l284q549n91
4494b1752O521J2721L627k941n513O105Q691r273J64P03R394J182j1760o163p17
$$ y = [-7490, -7901, -14413, -15208, -24642, -25315, -8326, -3552, -14592, -10108, -19081, -14447, -10181, -23519, -27939, -25862, -14591, -26699, -12382, -3033, -10333, -12244, -1902, -5505, -12464, 29, 359, 7186, -1600, -16957, -7056, 6975, -7518, -10036, -14002, -24564, -25433, -29472, -17533, -4729, -1773, 9971, 9725, 8417, 2898, 255, 5081, 22412, 13858, 1498, 3706, -7391, -7721, 701, 9486, 487, 14919, 8692, 1958, 25086, 28442, 11646, -13387, -26535, -30794, -36677, -24452, -17269, -21913, -3615, -4612, -8627, 174, 3640, -8375, -6432, -2128, -8803, -1246, 14170, 11707, 342, -5339, -16912, -19408, -22237, -22912, -22338, -20415, -11170, -6668, -6451, -4670, -2616, -2113, -3501, -12169, -7799, -9328, -12612, -21161, -21752, -15231, -2510, 1117, -1824, -7337, -1232, 7459, -1814, -1650, -947, 8447, 9629, -2131, -8294, -9011]
4479i011M186N046j8372j01J056K710K2212J4930J0650l025j3981j9525n401n036
4465a3662n040J0198O455j176k500o285l485k221k742O529j0121j6961J3758P778
4451a9475q016O782L599o345J2770J6913l792j976p811M96Q421M558j0675j1233
4437a5784J865J3798O740N418O35R40o518q217M781M429l486O165O013R088L099
4422B8966j1782j1710p356l183k151m242j117J0213m176n248m882K517K956j1430
4408b2625J039N588l403J3296n269K707J0280P91K042k969r362l174M193j047
4394g913R364m702k436J458j177Q998P030R311L988n202j8772o867m680O103L111
4379b386j5323j822k316q270l936R921J2630o030M577N017O375N895l719P521
$$ y = [-9011, -4825, 221, -18151, -18252, -17196, -14486, 7726, 22656, 33306, 30281, 16300, -3225, -8626, -13662, -18702, -8504, -2049, -3225, -5725, -12010, -15495, -17716, -20458, -13929, -24050, -41011, -27253, -19475, -27491, -20709, -17110, -23455, -10685, 6228, 2436, 460, -7351, -6855, 1566, 6124, -4551, -15784, -13919, -121, 6619, 12037, 12672, 13612, 7094, -1123, 3658, 8087, 4601, 10766, 16779, 25867, 28966, 17184, 5474, -1882, -5065, -7216, -11458, -12575, -2362, -6538, -11786, -16668, -14151, -11195, -22625, -21586, -15998, -19401, -6105, -11374, -8667, 1613, 2404, 4446, 1477, -7885, -11059, -6866, -7913, 1451, -3251, -5687, -4229, -5406, 3592, 10622, 19933, 23921, 18719, -53, -6920, -11600, -5497, -2386, -17709, -19531, -21847, -30117, -34053, -24132, -11502, -17532, -12955, -7938, -1563, 4332, 613, 8134]
4365H134K450j2711q603j3895R487O627L438j44j4970K29J1555J8379J2044p213
4351A4807L241M189J463n145m227M584q712k1094m390k945K13K3075J4822J499
4337B1380j6451n854J966K7164K023j7496j2705L464N363m365k21N90k224O293
4323H927O644j1259p188j3302p577R426J1781K330N331L912j3356k982n583o256
4309a9152J953J0929l609p095R675m656n783J3062J6210n196o035J762r808j7044
$$ y = [8134, 10584, -2127, -10730, -24625, -15138, -8511, -5073, -5217, -20187, -19958, -8403, 9976, 22020, 14807, 18048, 22237, 23700, 18555, 14328, 18912, 10200, -10894, -15284, -18229, -18016, 5059, 19881, 21380, 4929, -925, 1041, 28205, 30228, 12732, 27, 3491, 8854, 4489, 4268, 4858, 2634, 8927, 15571, 4312, -2876, -16178, -23755, -14329, -2548, -218, 5113, 9025, -4331, -7313, -12896, -19152, -17199, -6270, -9879, -16974, -7299, -11955, -17738, -4676, 11534, 6338, 303, 2065, -7743, -24787]
$$ [...]
##END NTUPLES=NMR SPECTRUM
##END=
