##TITLE=Analysis number 324877
Compound Code cc 39001
Project Code adrs
Chemist Name endeavour
##JCAMPDX= 6.0         $$ Bruker NMR JCAMP-DX V2.0
##DATA TYPE= NMR SPECTRUM
##DATA CLASS= NTUPLES
##ORIGIN= Bruker BioSpin GmbH
##OWNER= nmr
$$ XWIN-NMR		Version 3.5
$$ Mon Dec  4 12:46:42 2006 GMT Standard Time (UT+0h)  MAYBRIDGE\nmr@NMR_250MHZ
##.OBSERVE FREQUENCY= 250.131544655141
##.OBSERVE NUCLEUS= ^1H
##.ACQUISITION MODE= SIMULTANEOUS (DQD)
##.ACQUISITION SCHEME= undefined
##.AVERAGES= 16
##.DIGITISER RES= 18
##SPECTROMETER/DATA SYSTEM= dpx250
##.PULSE SEQUENCE= zg30
##.SOLVENT NAME= DMSO
##.SHIFT REFERENCE= (INTERNAL, DMSO, 0, 16.522)
##AUDIT TRAIL= $$ (NUMBER, WHEN, WHO, WHERE, WHAT)
$$ ##TITLE= Audit trail, XWIN-NMR		Version 3.5
$$ ##JCAMPDX= 5.01
$$ ##ORIGIN= Bruker BioSpin GmbH
$$ ##OWNER= nmr
$$ C:\u/data/dgb/nmr/ADRS/180/pdata/1/auditp.txt
$$ ##AUDIT TRAIL=  $$ (NUMBER, WHEN, WHO, WHERE, WHAT)
(   1,<2006-12-04 12:46:21.43 +000>,<MAYBRIDGE\nmr>,<NMR_250MHZ>,
      <created by zg, POWCHK disabled, PULCHK disabled
       configuration hash MD5:
       49 4B E0 1D 92 C2 6B 37 9F E6 65 BC 52 41 86 1D
       data hash MD5: 64K
       97 95 14 AE 3F 6C 32 9A D6 CD F6 80 E9 17 E6 A8>)
(   2,<2006-12-04 12:46:32.95 +000>,<MAYBRIDGE\nmr>,<NMR_250MHZ>,
      <Start of raw data processing
       ef LB = 0.3 FT_mod = 6 PKNL = 1 SI = 32K 
       data hash MD5: 32K
       55 33 48 45 B5 F2 25 01 9F 6C 47 D9 9B DF C5 35>)
(   3,<2006-12-04 12:46:34.56 +000>,<MAYBRIDGE\nmr>,<NMR_250MHZ>,
      <apk 
       data hash MD5: 32K
       E4 EB 22 98 85 A1 19 14 19 90 AC 04 F6 C7 65 AE>)
(   4,<2006-12-04 12:46:35.46 +000>,<MAYBRIDGE\nmr>,<NMR_250MHZ>,
      <abs ABSG = 5 
       data hash MD5: 32K
       B9 2F 07 75 DC 6B 18 FB B3 B2 71 CA D9 57 24 7B>)
$$ ##END=
$$ 
$$ hash MD5
$$ 6C 8F 8C 5A DF E0 F0 1F 4A F0 54 56 AA 3A E4 54
##$RELAX= 
##$RELAX= 
##$RELAX= 
##$RELAX= 
##$RELAX= 
##$RELAX= 
##$RELAX= 
$$ Bruker specific parameters
$$ --------------------------
##$DU= <C:\u>
##$EXPNO= 180
##$NAME= <ADRS>
##$PROCNO= 1
##$TYPE= <nmr>
##$USER= <dgb>
##$AMP= (0..31)
100 100 100 100 100 100 100 100 100 100 100 100 100 100 100 100 100 100 
100 100 100 100 100 100 100 100 100 100 100 100 100 100 
##$AQSEQ= 0
##$AQ_mod= 3
##$AUNM= <au_zg>
##$AUTOPOS= <26 >
##$BF1= 250.13
##$BF2= 250.13
##$BF3= 250.13
##$BF4= 250.13
##$BF5= 500.13
##$BF6= 500.13
##$BF7= 500.13
##$BF8= 500.13
##$BYTORDA= 1
##$CFDGTYP= 0
##$CFRGTYP= 5
##$CHEMSTR= <none>
##$CNST= (0..31)
1 1 145 1 1 1 1 1 1 1 1 1 1 1 1 1 1 1 1 1 1 1 1 1 1 1 1 1 1 1 1 1 
##$CPDPRG= <>
##$CPDPRG1= <>
##$CPDPRG2= <>
##$CPDPRG3= <>
##$CPDPRG4= <mlev>
##$CPDPRG5= <mlev>
##$CPDPRG6= <mlev>
##$CPDPRG7= <mlev>
##$CPDPRG8= <mlev>
##$CPDPRGB= <>
##$CPDPRGT= <>
##$D= (0..31)
0 1 0 0 0 0 0 0 0 0.06 0 0 0 0 0 0 0.0002 0 0 0 0 0 0 0 0 0 0 0 0 0 0 
0 
##$DATE= 1165236380
##$DBL= (0..7)
120 120 120 120 120 120 120 120 
##$DBP= (0..7)
150 150 150 150 150 150 150 150 
##$DBP07= 0
##$DBPNAM0= <>
##$DBPNAM1= <>
##$DBPNAM2= <>
$$ [...]
##$SUBNAM7= <"">
##$SUBNAM8= <"">
##$SUBNAM9= <"">
##$SW= 20.6930455092707
##$SWIBOX= (0..15)
0 0 3 0 0 0 0 0 0 0 0 0 0 0 0 0 
##$SW_h= 5175.983436853
##$TD= 65536
##$TD0= 1
##$TE= 294.16
##$TE2= 300
##$TE3= 300
##$TEG= 300
##$TL= (0..7)
0 120 120 120 120 120 120 120 
##$TP= (0..7)
150 150 150 150 150 150 150 150 
##$TP07= 0
##$TPNAME0= <>
##$TPNAME1= <>
##$TPNAME2= <>
##$TPNAME3= <>
##$TPNAME4= <>
##$TPNAME5= <>
##$TPNAME6= <>
##$TPNAME7= <>
##$TPOAL= (0..7)
0.5 0.5 0.5 0.5 0.5 0.5 0.5 0.5 
##$TPOFFS= (0..7)
0 0 0 0 0 0 0 0 
##$TUNHIN= 0
##$TUNHOUT= 0
##$TUNXOUT= 0
##$USERA1= <user>
##$USERA2= <user>
##$USERA3= <user>
##$USERA4= <user>
##$USERA5= <user>
##$V9= 5
##$VALIST= <valist>
##$VCLIST= <CCCCCCCCCCCCCCC>
##$VD= 0
##$VDLIST= <DDDDDDDDDDDDDDD>
##$VPLIST= <PPPPPPPPPPPPPPP>
##$VTLIST= <TTTTTTTTTTTTTTT>
##$WBST= 1024
##$WBSW= 4
##$XGAIN= (0..3)
0 0 0 0 
##$XL= 0
##$YL= 0
##$YMAX_a= 154415
##$YMIN_a= -159567
##$ZGOPTNS= <>
##$ZL1= 120
##$ZL2= 120
##$ZL3= 120
##$ZL4= 120
##$ABSF1= 16.522
##$ABSF2= -4.171173
##$ABSG= 5
##$ABSL= 3
##$ALPHA= 0
##$AQORDER= 0
##$ASSFAC= 0
##$ASSFACI= 0
##$ASSFACX= 0
##$ASSWID= 0
##$AUNMP= <proc_1d>
##$AZFE= 0.1
##$AZFW= 0.1
##$BCFW= 0
##$BC_mod= 0
##$BYTORDP= 0
##$COROFFS= 0
##$CY= 12.5
##$DATMOD= 1
##$DC= 0
##$DFILT= <>
##$DTYPP= 0
##$F1P= 14.0000005364418
##$F2P= -0.99999901652339
##$FCOR= 0.5
##$FTSIZE= 32768
##$FT_mod= 6
##$GAMMA= 0
##$GB= 0
##$INTBC= 1
##$INTSCL= 1
##$ISEN= 128
##$LB= 0.3
##$LEV0= 0
##$LPBIN= 0
##$MAXI= 10000
##$MC2= 0
##$MEAN= 0
##$ME_mod= 0
##$MI= 0
##$NCOEF= 0
##$NC_proc= -6
##$NLEV= 6
##$NOISF1= 0
##$NOISF2= 0
##$NSP= 0
##$NTH_PI= 0
##$NZP= 0
##$OFFSET= 16.522
##$PC= 1
##$PHC0= 220.5797
##$PHC1= 3.543471
##$PH_mod= 1
##$PKNL= yes
##$PPARMOD= 0
##$PSCAL= 4
##$PSIGN= 0
##$REVERSE= no
##$SF= 250.13
##$SI= 32768
##$SIGF1= 0
##$SIGF2= 0
##$SINO= 400
##$SIOLD= 32768
##$SREGLST= <1H.DMSO>
##$SSB= 0
##$STSI= 32768
##$STSR= 0
##$SW_p= 5175.98343685301
##$SYMM= 0
##$S_DEV= 0
##$TDeff= 65536
##$TDoff= 0
##$TI= <Analysis number 999999
Compound Code 99
Book Reference 9
Project Code 9>
##$TILT= no
##$TM1= 0
##$TM2= 0
##$TOPLEV= 0
##$USERP1= <user>
##$USERP2= <user>
##$USERP3= <user>
##$USERP4= <user>
##$USERP5= <user>
##$WDW= 1
##$XDIM= 32768
##$YMAX_p= 547170191
##$YMIN_p= -1408232
$$ End of Bruker specific parameters
$$ ---------------------------------
##NTUPLES= NMR SPECTRUM
##VAR_NAME=  FREQUENCY,     SPECTRUM/REAL,   SPECTRUM/IMAG
##SYMBOL=    X,             R,               I
##VAR_TYPE=  INDEPENDENT,   DEPENDENT,       DEPENDENT
##VAR_FORM=  AFFN,          ASDF,            ASDF
##VAR_DIM=   32768,         32768,           32768
##UNITS=     HZ,            ARBITRARY UNITS, ARBITRARY UNITS
##FACTOR=    0.157963299565203, 1,           1
##FIRST=     4132.6476996994, 0,             0
##LAST=      -1043.33573715361, 0,           0
##MIN=       -1043.33573715361, -1408232,    0
##MAX=       4132.6476996994, 547170191,     0
$$ Real data points
##PAGE= N=1
##DATA TABLE= (X++(R..R)), XYDATA
$$ [...]
15513b97667N0741j8788K77406L10626O6424p4918j43895j75827q191l02785j06539
$$ -297667 -246926 -265714 11692 322318 388742 313824 169929 -5898 -14089 -316874 -423413
15502d23413J7188K25720j86645J61722M03253K1197j12572k89964K0589P8671
$$ -423413 -406225 -180505 -367150 -205428 197825 219022 106450 -183514 -162925 -84254
15492h4254k47096l1103J83123R7103N8966j34169l9343l65408p7966K88056M27309
$$ -84254 -331350 -362453 -179330 -82227 -23261 -157430 -196773 -562181 -640147 -352091 75218
15481G5218J08053j39422l07305J51629L63809J56276k91287k8060J5355N4968
$$ 75218 183271 43849 -263456 -111827 251982 408258 116971 88911 104266 159234
15471A59234J15410j13596k21633p1829L3082K01193J05499j15761j17159o7466
$$ 159234 274644 161048 -60585 -132414 -99332 101861 207360 91599 -25560 -93026
15461i3026r472k10860j33567j98995K14364K05655M00925L5554o1578r0703l05138
$$ -93026 -102498 -313358 -446925 -645920 -431556 -225901 175024 210578 149000 58297 -246841
15450b46841q0567K68618Q6429o31475k20911N04568J13022J10033K7389K44407
$$ -246841 -327408 -58790 27639 -603836 -824747 -320179 -207157 -97124 -69735 174672
15440A74672K69540j9333l00274k6112m7496l08569m298J97851p2530k49810J4230
$$ 174672 444212 424879 124605 98493 50997 -257572 -261870 -64019 -136549 -386359 -372129
15429c72129k0128J19369N2339J12992j06755q7495L2565j11440k2920L18244
$$ -372129 -392257 -272888 -220549 -107557 -214312 -301807 -269242 -380682 -403602 -85358
15419h5358k7416j90458O8499j8135k63098q2738L64670J83022j28389J32599
$$ -85358 -112774 -303232 -234733 -252868 -515966 -598704 -234034 -51012 -179401 -46802
15409d6802j17098O987N1563L39783j7091M0018K7929j39763o5861K4454L6149
$$ -46802 -163900 -156913 -105350 234433 217342 257360 285289 145526 79665 104119 140268
15398A40268q4408j14559j62817j61125j29695j06545L37577M6121N0369P6334
$$ 140268 55860 -58699 -221516 -382641 -512336 -618881 -281304 -235183 -184814 -108480
15388a08480j52618j67723Q2907N4528r7620k58771J55758O9222K50400n9485
$$ -108480 -261098 -428821 -345914 -291386 -389006 -647777 -492019 -422797 -172397 -231882
15378b31882j33706j80271o2911K09130L0378M5427k75056J08120K54152j3479
$$ -231882 -365588 -545859 -608770 -399640 -369262 -323835 -598891 -490771 -236619 -250098
15368b50098J19374J43812j92770J93051k07172K90002M777k38904N0582L42409
$$ -250098 -130724 13088 -179682 13369 -193803 96199 100976 -137928 -87346 255063
15358B55063j01444N8521Q5626o5658k88521j31782l8795j11000K33891J64651
$$ 255063 153619 212140 297766 232108 -56413 -188195 -226990 -337990 -104099 60552
15348F0552j46491j11458k1720K29523p2459k63027k66213j76805K46685K73220
$$ 60552 -85939 -197397 -219117 10406 -62053 -325080 -591293 -768098 -521413 -248193
15338b48193R3940o9142k16780r2297J19661M78059J0677Q5109K20572K1787l34678
$$ -248193 -154253 -223395 -440175 -532472 -412811 65248 75925 161034 381606 403393 68715
15327F8715j16456o9386k17211J28913K73971J61753R0210r8042l78302l51017
$$ 68715 -47741 -117127 -334338 -205425 68546 230299 320509 222467 -155835 -506852
15317e06852j33476J71468O5186O1605M6163L32406j9629k7877j64982j74401
$$ -506852 -640328 -468860 -403674 -342069 -295906 36500 16871 -11006 -175988 -350389
15307c50389R231R5746J81404n0486j0434j29087J39267j9982r2086K85548N4591
$$ -350389 -341158 -245412 -64008 -114494 -124928 -254015 -114748 -134730 -226816 58732 113323
15296A13323m90738p4222L27060K67536L90401Q6934L29163j74402n59246l37167
$$ 113323 -377415 -451637 -124577 142959 533360 620294 949457 775055 215809 -121358
15286a21358j32594j6736K50109O8315j65421J09297j02553p4518k09145L6851
$$ -121358 -253952 -270688 -20579 47736 -117685 -8388 -110941 -185459 -394604 -357753
15276c57753Q2745O5641m93840m1805L41064J15976J9370N7694J46650Q0324M7279
$$ -357753 -275008 -209367 -703207 -745012 -403948 -287972 -268602 -210908 -64258 16066 63345
15265F3345q6518J27564j94438k16667j48206J3130k5047j97032j14634k9629
$$ 63345 -23173 104391 -90047 -306714 -454920 -441790 -466837 -663869 -778503 -808132
15255h08132J14524L18693K67196j00865j27045L1166P5720J94681j11831j36444
$$ -808132 -693608 -374915 -107719 -208584 -335629 -304463 -228743 -34062 -145893 -282337
15245b82337l28000N4685K78872L41058M70629L1697k08014k76874k55313j01586
$$ -282337 -610337 -555652 -276780 64278 534907 566604 358590 81716 -173597 -275183
15235b75183J89758M5177j69828O0004j44858k26386J1234K37718l8869q7211
$$ -275183 -85425 -40248 -210076 -150072 -294930 -521316 -510082 -272364 -311233 -398444
15225c98444N5776J08704j12287q4052r9858K75014L09050k51606R7879K18980
$$ -398444 -342668 -233964 -346251 -430303 -530161 -255147 53903 -197703 -99824 119156
15215A19156k74311K86806O7828J012q9709m1183j71416J50681J10934j39105
$$ 119156 -155155 131651 199479 200491 110782 69599 -101817 48864 159798 20693
15205B0693q6696j73949k07966p3688M09952J63362j11686j67846K5934K71223
$$ 20693 -66003 -239952 -447918 -521606 -111654 51708 -59978 -227824 -201890 69333
15195F9333K1305k84774J58015Q7036l25908J73077r8276j56809K39696m1601
$$ 69333 90638 -194136 -36121 50915 -274993 -101916 -200192 -357001 -117305 -158906
15185a58906m060r2708J22335J08002j06140P65k87772k68774Q1549L83641L87942
$$ -158906 -162966 -255674 -133339 -25337 -131477 -130712 -418484 -687258 -605709 -222068 165874
15174A65874j76740k52933j27577O1033J29857p2876Q385n314k0211j1481J7671
$$ 165874 -10866 -263799 -391376 -330343 -200486 -273362 -264977 -270291 -290502 -301983 -284312
15163b84312j58322k58312K56698K61772k68951K9841K23936m1293L95605j18987
$$ -284312 -442634 -700946 -444248 -182476 -451427 -421586 -197650 -238943 156662 37675
15153C7675m06871l02478K01095L86476L60112j83071O4246r702J31542k3169
$$ 37675 -369196 -671674 -470579 -84103 276009 92938 157184 147482 279024 255855
15143B55855l02911N6938K80694J2596J0928j48665k26559M6296j37141q3371
$$ 255855 -47056 9882 290576 303172 314100 165435 -61124 -14828 -151969 -235340
15133b35340L22485K9195n27339k32430l3103K81589L24913m4131k67874k52886
$$ -235340 87145 116340 -410999 -643429 -676532 -394943 -70030 -114161 -382035 -634921
15123f34921l4063M22870p3781q0618M3627K74165k00540M646K97663q077j87007
$$ -634921 -668984 -246114 -319895 -400513 -356886 -82721 -283261 -278615 19048 10971 -176036
15112a76036k5955M5900P2314J57939J02591j34970K26551J0816K5070j64415
$$ -176036 -201991 -156091 -83777 74162 176753 41783 268334 279150 304220 139805
15102A39805k27368k56620J9717o1021M4873L30600r6041L0029K222j27855j18605
$$ 139805 -87563 -344183 -324466 -385487 -340614 -10014 -106055 -76026 -73804 -201659 -320264
15091c20264r4964L55003O1926j65158K2612J53766K43003p4195j15343m0916
$$ -320264 -415228 -60225 1701 -163457 -140845 12921 255924 181729 66386 25470
15081B5470j85937n6794m45571m5893L84391J35170J1383K83157K5611l41490
$$ 25470 -160467 -217261 -662832 -708725 -324334 -189164 -177781 105376 130987 -210503
15071b10503j06960l00092j11191K61484M9959K58412j31414J69222J86463r0606
$$ -210503 -317463 -617555 -728746 -467262 -417303 -158891 -290305 -121083 65380 -25226
15061b5226J1933J39194o7317o0385J00501Q4318J04563j18776j64328j9410J12495
$$ -25226 -13293 125901 58584 -1801 98700 183018 287581 168805 4477 -14933 97562
15050I7562j22628j13896P2083M1114Q1016Q4398j68924j00586l9102K49484R7829
$$ 97562 -25066 -138962 -66879 -25765 55251 139649 -29275 -129861 -168963 80521 178350
15039A78350l8180P6609j73125J21189L58348k42839r4573m9697o4600l61248
$$ 178350 140170 216779 43654 164843 523191 280352 185779 136082 71482 -289766
15029b89766N61J72946J31949j21860M7477J31344J63128l03035k95851J37877
$$ -289766 -289205 -116259 15690 -106170 -58693 72651 235779 -67256 -363107 -225230
15019b25230J03889m7817o0694J92490j27887j12511l08888R0082O8145K56756
$$ -225230 -121341 -169158 -229852 -37362 -165249 -277760 -586648 -496566 -428421 -171665
15009a71665l876r8423O8752J17173k20525n30327k0129N28937N00244K71866
$$ -171665 -175541 -273964 -205212 -88039 -308564 -838891 -859020 -330083 170161 442027
14999D42027l9386q5318j67356j26403P243l94452m93178L15067M25271K28720
$$ 442027 402641 317323 149967 23564 30807 -363645 -856823 -541756 -116485 112235
14989A12235j83535J19301L72820j20833m18961k32379K43413M82399m0245l56779
$$ 112235 -71300 48001 420821 299988 -118973 -351352 -107939 374460 334215 -22564
14979b2564j84716j68506L5809K00155O54P4875l31849L6309N1187R564j51304
$$ -22564 -207280 -375786 -339977 -139822 -139168 -64293 -396142 -359833 -308646 -299082 -450386
14968d50386J36431N5442K28332K85973K49717l70937k85715j80497L6011N5076
$$ -450386 -313955 -258513 -30181 255792 505509 134572 -151143 -331640 -295629 -240553
14958b40553J21878p2494j11986o0299J36253j05842l81305j6372j829K41063
$$ -240553 -118675 -191169 -303155 -363454 -227201 -333043 -714348 -730720 -732549 -491486
14948d91486L22552J22133J42056l0150P9852k69945m72447K80227L21775j06736
$$ -491486 -168934 -46801 95255 65105 144957 -124988 -597435 -317208 4567 -102169
14938a02169l6600P6879J36141Q759J581k92447m89642m4603J71283J84868J18723
$$ -102169 -138769 -61890 74251 83010 84591 -207856 -697498 -742101 -570818 -385950 -267227
14927b67227j59315O3196R9343o3779J89754j33840l7254M5708K83322J47988
$$ -267227 -426542 -363346 -264003 -327782 -138028 -271868 -309122 -263414 19908 167896
14917A67896j19099J18860l1726J8601l09652m49060J8107J82108J51386O7989
$$ 167896 48797 167657 135931 154532 -155120 -604180 -586073 -403965 -252579 -184590
14907a84590J50872K25448k06755J82960L2422k10029k8876Q7714o234J6512j2446
$$ -184590 -33718 191730 -15025 167935 200357 -9672 -38548 49166 42932 59444 46998
14896D6998m3895L24222p5406k98818P5633q6562k36338O8372j93729J21028J68834
$$ 46998 3103 327325 251919 -46899 28734 -57828 -294166 -225794 -419523 -298495 -129661
14885a29661R451r8697j23391j10698J1545K29503K4354l26774N1359j77107K10662
$$ -129661 -120210 -218907 -342298 -452996 -441451 -211948 -187594 -514368 -463009 -640116 -429454
14874d29454J49957L18470K5644j98504l3239K2813o8999J49909Q4926l044K024
$$ -429454 -279497 38973 64617 -133887 -167126 -144313 -213312 -63403 21523 18479 20503
14863B0503j4484k49216k28673j09785L4546J97867J26439M5879k9904o620j7012
$$ 20503 6019 -243197 -471870 -581655 -547109 -349242 -222803 -176924 -206828 -213448 -230460
14852b30460n8395r53j7002L4445L1503L2806N6195l47676K99127J51536p0346
$$ -230460 -288855 -289808 -306810 -272365 -240862 -208056 -151861 -499537 -200410 -48874 -119220
14841a19220P5061L3712k74527k00194K67584L71690j34885k61343j53761K32632
$$ -119220 -44159 -10447 -284974 -485168 -217584 154106 19221 -242122 -395883 -163251
14831a63251O8811n3572k294R3839m029P1758M3350l17776m06931j95602l33168
$$ -163251 -94440 -148012 -150306 -56467 -60496 11262 54612 -263164 -670095 -865697 -1198865
14820a198865N30553L53198L25772M04159k2137l88766k26089o9806L27788M0013
$$ -1198865 -668312 -315114 10658 414817 392680 3914 -222175 -291981 35807 75820
14810G5820l20672k30153J44922K31546M12594O8373p9009q2229l14730l23317
$$ 75820 -244852 -475005 -330083 -98537 314057 382430 303421 221192 -93538 -416855
14800d16855r7906o3022j19097L53027M38535l13180p1030N135m29442J05207
$$ -416855 -514761 -577783 -696880 -343853 94682 -218498 -289528 -284393 -713835 -608628
14790f08628K51004J14849j16569j78020j572o2567L031K70031N7869j19109j7473
$$ -608628 -357624 -242775 -359344 -537364 -538936 -601503 -598472 -328441 -270572 -389681 -407154
14779d07154p0978K10246L41738j62693r0515k74641r4367J9658K92190J47681
$$ -407154 -478132 -267886 73852 -88841 -179356 -453997 -548364 -528706 -236516 -88835
14769h8835K88567L54259l05457k21005p8426P4638j71437l0605j49095k0147
$$ -88835 199732 553991 248534 27529 -50897 23741 -147696 -178301 -327396 -347543
14759c47543J47519P6156J54769J54213r8904m28417k22012J68086P7104R1954
$$ -347543 -200024 -123868 30901 185114 86210 -342207 -564219 -396133 -319029 -227075
14749b27075J16172L0337K35389K73881q561j55751l86815J26222r4296k74287
$$ -227075 -110903 -80566 154823 428704 420143 264392 -122423 3799 -90497 -364784
14739c64784j95041J14244R4509R6618K6951J12482j99469k45886r6881M57004
$$ -364784 -559825 -445581 -351072 -254454 -227503 -115021 -314490 -560376 -657257 -200253
14729b00253J45564m9025Q5309O9584n6894J4345j8854Q5801J21488j35521k3951
$$ -200253 -54689 -103714 -18405 51179 -5715 8630 -10224 75577 197065 61544 37593
14718C7593P8396j47867l35752j92598n0698J67315p1967j75573J35561K23424
$$ 37593 115989 -31878 -367630 -560228 -610926 -443611 -515578 -691151 -555590 -332166
14708c32166K79494r9732R6955o399j27795J69098m8252k57763J93803K25692
$$ -332166 -52672 -152404 -55449 -61848 -189643 -20545 -68797 -326560 -132757 92935
14698I2935j39063l46237j45340N9843Q3115M3643N9163J14487K85634j27413
$$ 92935 -46128 -392365 -537705 -477862 -394747 -351104 -291941 -177454 108180 -19233
14688a9233j67604j25308n8388J14756m3387P0106j74677k1218J32138K79990
$$ -19233 -186837 -312145 -370533 -255777 -299164 -229058 -403735 -424953 -292815 -12825
14678a2825J70582J38278R334p2844J340j53197k94993O515K45119m5648N4032
$$ -12825 157757 296035 305369 232525 233865 80668 -214325 -207810 37309 -8339 45693
14667D5693K2425M4305n0963J34601J12259K9693j69630k7908k33933j48349o2124
$$ 45693 68118 112423 61460 196061 308320 338013 168383 140475 -93458 -241807 -303931
14656c03931J26203K14058k18353n40122K63105M80808M57895j14996q1441j95236
$$ -303931 -177728 36330 -182023 -722145 -459040 21768 479663 364667 283226 87990
14646H7990l83118k81444J59005R6235p3457N5611J28080o8827O8480J02733J48098
$$ 87990 -295128 -576572 -417567 -321332 -394789 -339178 -211098 -279925 -211445 -108712 39386
14635C9386n5769P1662K84450J4232l06083J24811j08772M0347j85112m19131
$$ 39386 -16383 55279 339729 353961 47878 172689 63917 104264 -80848 -499979
14625d99979k490K38676K83622q3822n82445N6788O4090K20075M78865k47364
$$ -499979 -502469 -263793 19829 -63993 -646438 -589650 -525560 -305485 173380 -73984
14615g3984j63077o3945j76578J83274R7371k44883R257j02489M4001J52589m3813
$$ -73984 -237061 -301006 -477584 -294310 -196939 -441822 -432565 -535054 -491053 -338464 -382277
14604c82277J79691N45747m1452l1100l11500m05098j42172L1513R7071L50099
$$ -382277 -202586 343161 301709 270609 -40891 -445989 -588161 -556648 -459577 -109478
14594a09478J81516k24279j24624q5925J30046J08493K66333J17604j55167l5236
$$ -109478 72038 -152241 -276865 -362790 -232744 -124251 142082 259686 104519 69283
14584F9283Q4572j04428K5829j57239j79751J68550K05809k58187M10280R1452
$$ 69283 153855 49427 75256 -81983 -261734 -93184 112625 -145562 264718 356170
14574C56170j20430K16809j10870k61574l362K4551R3125j55439J50785m414j25076
$$ 356170 235740 452549 341679 80105 76743 101294 194419 38980 189765 185351 60275
14563F0275q6563l56793L38595J08619j72027J27212J31696R3332p9680l24904
$$ 60275 -26288 -383081 -44486 64133 -107894 19318 151014 244346 164666 -160238
14553a60238j44931L51682m0086m67893K51800Q3924Q2587J91008p741J58672
$$ -160238 -305169 46513 6427 -461466 -209666 -125742 -43155 147853 140112 298784
14543B98784p133j4989k00373j06950j23337N6067l4930j60214J96888j24860
$$ 298784 291651 276662 76289 -30661 -153998 -97931 -132861 -293075 -96187 -221047
14533b21047R3222K11231j72312R2101L52976m52481j74441k9562N4652J30022
$$ -221047 -127825 83406 -88906 3195 356171 -96310 -270751 -300313 -245661 -115639
14523a15639J86454J47497l12013j16441j00433l69549j00441K30611N04369N48584
$$ -115639 70815 218312 -93701 -210142 -310575 -680124 -780565 -549954 -45585 502999
14513E02999r4455o91732m2217k5429l21142o7602K96021J39822K34815J02158
$$ 502999 408544 -283188 -325405 -350834 -671976 -739578 -443557 -303735 -68920 33238
14503C3238K12818k99969k99743J61534K23538P6689k3111L33217R7787m02753
$$ 33238 246056 -53913 -353656 -192122 31416 108105 84994 418211 515998 113245
14493A13245n593K06355r4332l85161N67P9499J81480M0418j48687P8272j0925
$$ 113245 107652 314007 219675 -165486 -164919 -85420 96060 136478 -12209 66063 55138
14482E5138J68127o1366l41801k6989q1495J52465R9967j84854o1917K72810J80031
$$ 55138 223265 161899 -179902 -206891 -288386 -135921 -35954 -220808 -282725 -9915 170116
14471A70116J21143K9046L6333L3959k3185K00282R4572l42593m29479j67554
$$ 170116 291259 320305 356638 390597 367412 567694 662266 319673 -109806 -277360
14461b77360k1957L78583O12821N3047l28670l67444k20826p3748L3707m742K79800
$$ -277360 -299317 79266 692087 745134 416464 49020 -171806 -245554 -211847 -216589 63211
14450F3211L46748k83330j76061j5636r3444J40696J10738J45619q4272p1201
$$ 63211 409959 126629 -49432 -65068 -158512 -17816 92922 238541 154269 83068
14440H3068l36767l12244j0262L5325R6634O2862j68508k27106k16583K22794
$$ 83068 -253699 -565943 -576205 -540880 -444246 -381384 -549892 -776998 -993581 -770787
14430g70787N14935J69017J16031m579J54786k11398j04010L5206J63219k15883
$$ -770787 -255852 -86835 29196 24617 179403 -31995 -136005 -100799 62420 -153463
14420a53463k16326j49178J08166l8896r8883P7053M0471J51007Q3869l7881K4407
$$ -153463 -369789 -518967 -410801 -449697 -548580 -471527 -431056 -280049 -196180 -234061 -209654
14409b09654k30042j7474K97224J22827J14214j13637J83400J38195o4755K14765
$$ -209654 -439696 -457170 -159946 -37119 77095 -36542 146858 285053 220298 435063
14399D35063J30680l49335k27116j94330k21879k4477M85603N72274o3510j56846
$$ 435063 565743 216408 -10708 -205038 -426917 -451394 34209 606483 542973 386127
14389C86127J8864k23418k81680m6281j02378K8557N893l1927M01790M5641j54296
$$ 386127 404991 181573 -100107 -146388 -248766 -220209 -214316 -246243 155547 201188 46892
14378D6892J56303J17391m8966n12764n2242k7935j9814N13417j25231l82795
$$ 46892 203195 320586 271620 -241144 -293386 -321321 -341135 172282 47051 -335744
14368c35744j22974J18859K36061L73404J71609J05660k29330j84543N4522l1415
$$ -335744 -458718 -339859 -103798 269606 441215 546875 317545 133002 187524 156109
14358A56109l39454p0462J53029l6557p2158L17020m1920k51394j29445L08504
$$ 156109 -183345 -253807 -100778 -137335 -209493 107527 65607 -185787 -315232 -6728
14348f728k06427l8015M6707J37851Q8853k24371J29889q6521j13398J02522K32729
$$ -6728 -213155 -251170 -204463 -66612 22241 -202130 -72241 -158762 -272160 -169638 63091
14337F3091m38348j32910J72400J2780r9656j31616J33231K46846n9473O8570
$$ 63091 -375257 -508167 -335767 -322987 -422643 -554259 -421028 -174182 -233655 -165085
14327a65085M69719Q1058K1791o7442k52496j73465j86943m4018P469j10616P399
$$ -165085 304634 385692 407483 340041 87545 -85920 -272863 -316881 -309412 -420028 -412629
14316d12629L17955L3587j96647J34895M617j60565P1101P9567K59311q218K5002
$$ -412629 -94674 -61087 -257734 -122839 -118222 -278787 -207686 -128119 131192 122974 147976
14305A47976Q8994P1096K61423J52313k23960n21039j23168K99878p9919l50691
$$ 147976 236970 308066 569489 721802 497842 -23197 -146365 153513 73594 -277097
14295b77097J7443J0661j28471n1732M04257J52276N0641m3465l16945N8786J18001
$$ -277097 -259654 -248993 -377464 -429196 -24939 127337 177978 134513 -182432 -123646 -5645
14284e645R9213K45518M8038o5191l75318j46346L67403J69268p5265J95593m0242
$$ -5645 93568 339086 387124 321933 -53385 -199731 167672 336940 261675 457268 417026
14273D17026j2873J3910O3434m2732J60316J4914k61604j56453l3524j50511r7767
$$ 417026 404153 418063 481497 438765 599081 613995 352391 195938 162414 11903 -85864
14262h5864r1700P9627K3010L05598k89688o8850K12855l07900O54j65242q5725
$$ -85864 -177564 -97937 -74927 230671 -59017 -127867 84988 -222912 -222258 -387500 -473225
14251d73225K91367L35553O9032j61434l51996K6158K33022J50114R7731k47441
$$ -473225 -181858 153695 222727 61293 -290703 -264545 -31523 118591 216322 -31119
14241c1119K5484J73287j01604p6904J24407J00879l16436N1454j6863j7324J23079
$$ -31119 -5635 167652 66048 -10856 113551 214430 -102006 -50552 -67415 -84739 38340
14230C8340J7207M1650N3332j58269K30061K20611j46700j30711o2841N4666L58513
$$ 38340 55547 97197 150529 -7740 222321 442932 296232 165521 102680 157346 515859
14219E15859j57438Q231n7982j39618J52105P1766J14176K14308j74207k20556
$$ 515859 358421 366652 308670 169052 321157 392923 507099 721407 547200 326644
14209C26644q0601L3480j09395J9371p0316q0886J93473J79510m6334j72856P7988
$$ 326644 246043 279523 170128 189499 119183 38297 231770 411280 364946 192090 270078
14198B70078l2645l64392l1613L3116P9134J70178q486j63458J45650P2940M9480
$$ 270078 237433 -126959 -158572 -125456 -46322 123856 115370 -48088 97562 170502 219982
14187B19982K93759L69390R9091k33047r6190o5166j09277k63896p4504j65315
$$ 219982 513741 883131 982222 749175 652985 587819 478542 214646 140142 -25173
14177b5173j38379K0412L87491K8801k42219l14424K43754l4776k12445o8934
$$ -25173 -163552 -143140 244351 273152 30933 -283491 -39737 -74513 -286958 -355892
14167c55892O5325J5493K21425L04145j22152j43999J74931K64072q3984l70590
$$ -355892 -290567 -275074 -53649 250496 128344 -15655 159276 423348 339364 -31226
14157c1226o0817O7541O8810J01750J02496Q3509q5612j18188k05553J21462j3148
$$ -31226 -92043 -24502 44308 146058 248554 332063 246451 128263 -77290 44172 31024
14146C1024j65716j01320p1600j45384R6674J00637r4651j01916J64087P0073
$$ 31024 -134692 -236012 -307612 -452996 -356322 -255685 -350336 -452252 -288165 -218092
14136b18092j47397O6949L80221j45627Q7564J34234J27275M9660K47420K61413
$$ -218092 -365489 -298540 81681 -63946 23618 157852 285127 334787 582207 843620
14126H43620r6010j08914J26716K11215j39263O6231l21380j75433J72966J49021
$$ 843620 747610 638696 765412 976627 837364 903595 582215 406782 579748 728769
14116G28769j86937K40465j527l40232j53630p9581j14080j54701K92706P6753
$$ 728769 541832 782297 780770 440538 286908 207327 93247 -61454 231252 308005
14106C08005J07389l49581m61063K97529N6254J65427J70593L20214J61915l46311
$$ 308005 415394 65813 -395250 -97721 -41467 123960 294553 614767 776682 430371
14096D30371m32778j78123R0813R4353k66200K60895M67065k14902k29047J84743
$$ 430371 -2407 -180530 -89717 4636 -261564 -669 466396 251494 22447 207190
14086B07190L24178j98528M1262p3773j65464l8925O6468k42833J23977J88560
$$ 207190 531368 332840 374102 300329 134865 95940 162408 -80425 43552 232112
14076B32112j90011J11170J34032m3252n5050k214n8587l8021O7393k2817r7331
$$ 232112 42101 153271 287303 244051 189001 186787 128200 90179 157572 134755 37424
14065C7424k93660q5596R7523N93J52433J81286N18484O3764j80169j11727K66004
$$ 37424 -256236 -341832 -244309 -243716 -91283 90003 608487 672251 492082 380355 646359
14054F46359J90676k36890j27398P2520j3384j68072J87064l36792j37595K7134
$$ 646359 837035 600145 472747 545267 531883 363811 550875 214083 76488 103622
14044A03622l4583L3115p3685J47931k9825l71631j47399k30799N57980M6811
$$ 103622 69039 102154 28469 176400 146575 -225056 -372455 -603254 -45274 1537
14034A537j97336j4884P1870M51444M34005O5678l40929l13083o9188o0186M859
$$ 1537 -195799 -210683 -138813 312631 746636 812314 471385 158302 89114 28928 33787
14023C3787K77350M0824n3530l8781p6753J08426J54549K89552P8037j14244R1636
$$ 33787 311137 351961 298431 259650 182897 291323 445872 735424 813461 699217 790853
14012G90853k15967j92752J57239K5410k56316j27000K04621L27849Q7296k73136
$$ 790853 574886 382134 539373 564783 308467 181467 386088 713937 801233 528097
14002E28097r0183J44725J59382N4455o06301l54241K14879L3614j32014j84128
$$ 528097 437914 582639 742021 796476 190175 -164066 50813 84427 -47587 -231715
13992b31715j35446L3994L75741K75682o9200l7177j57777r9946K92311j20830
$$ -231715 -367161 -333167 42574 318256 249056 211879 54102 -45844 246467 125637
13982A25637j22782K41435L2268j2654K51055J61353j43395n4374Q0902J23135
$$ 125637 2855 244290 276558 263904 514959 676312 532917 478543 559445 682580
13972F82580M6193r2472m51003k61430J5772M05058q3202m65506R6995N03977
$$ 682580 728773 636301 185298 -76132 -60360 344698 261496 -204010 -107015 396962
13962C96962J09823j35045p3648n3231k0371N0537j14565m3857M75968K18814
$$ 396962 506785 371740 298092 244861 224490 275027 160462 116605 592573 811387
13952H11387J78081Q4248M7745P116N6209j60044j46536L42991J17972l00739
$$ 811387 989468 1073716 1121461 1128577 1184786 1024742 878206 1221197 1339169 1038430
13942A038430m95688k79850o8466K97625J64538o4316k55323k92617O1722P2991
$$ 1038430 542742 262892 194426 492051 656589 592273 336950 44333 106055 179046
13932A79046k61522J64853P2307L03379J49671k43848L561K9288j1525J0982M6832
$$ 179046 -82476 82377 154684 458063 607734 363886 367447 396735 385210 396192 443024
13921D43024L7202J47587j75454k04835J63604J02164j69914K35536L18839l37504
$$ 443024 480226 627813 452359 247524 411128 513292 343378 578914 897753 560249
13911E60249p9816o089p6716j10253p4624K36766N2156l06269l72694j7700M33221
$$ 560249 480433 474344 397628 287375 212751 449517 501673 195404 -177290 -194990 238231
13900B38231L20970P3593j46655k72567j73093J52754N398P6666J87722n69616
$$ 238231 559201 632794 486139 213572 40479 193233 198631 275297 463019 -106597
13890a06597m4931J36193k56488K47896M28648m8250k96935K87280L3919N7849
$$ -106597 -151528 -15335 -271823 -23927 404721 356471 59536 346816 380735 438584
13880D38584L31655J24884k14562p7595p8339n757n2088L14688J57736k27435
$$ 438584 770239 895123 680561 602966 524627 518870 466782 781470 939206 711771
13870G11771j61434N6353O7673j34324l38158l4449P7872j09963j10620k7158
$$ 711771 550337 606690 674363 540039 201881 167432 245304 135341 24721 -2437
13860b437r2349l6111k81589n0513M9753K1315O011K29583L70105M28190K7789
$$ -2437 -94786 -130897 -412486 -462999 -413246 -391931 -385920 -156337 213768 641958 669747
13849F69747L493K5893j01381j42896l99009P5972L11784j8918Q0183l83734O3553
$$ 669747 673240 699133 597752 454856 55847 131819 443603 424685 504868 121134 184687
13838A84687J50807K9580n0737j51202k63062J3634J81676J61184Q6115j23017
$$ 184687 335494 365074 314337 163135 -99927 -86293 95383 256567 342682 219665
13828B19665K46118J5682l78321k44111j80548J89070J93085k652M13715M6812
$$ 219665 465783 481465 103144 -140967 -321515 -132445 60640 57988 471703 518515
13818E18515j13217k60345n4776j33790m19928J46006j06623q3218L02459K73263
$$ 518515 405298 144953 90177 -43613 -463541 -317535 -424158 -507376 -204917 68346
13808F8346J99894J95022J887J65363K44791k92644L2329j76574j37521L7883
$$ 68346 268240 463262 465149 630512 875303 582659 614988 438414 300893 338776
13798C38776J18050J31224Q0466o7444K68588j85372l38641M46282k82519j66081
$$ 338776 456826 588050 668516 601072 869660 684288 345647 791929 509410 343329
13788C43329J3585l4525M61310l9740J80798o026n4769j74794j79082J44j09524
$$ 343329 356914 322389 783699 743959 924757 918731 863962 689168 510086 510230 400706
13777D00706k29749m1979j70737j82006k9481J17773O5495K43080L72790N6703
$$ 400706 170957 128978 -41759 -223765 -253246 -135473 -69978 173102 545892 602595
13767F02595R4289m37957l98161O1127p0945J52308j10808N0028L67881K61370
$$ 602595 696884 258927 -139234 -78107 -149052 3256 -107552 -57524 310357 571727
13757E71727r1554Q0872k20615J40169K07313q8541j26107J7403N222j59983l21466
$$ 571727 480173 561045 340430 480599 687912 599371 473264 490667 495889 335906 14440
13746A4440j92553K52434N93259K42796o1924L3912k24554k15833J81942q3803
$$ 14440 -178113 74321 667580 910376 848452 882364 657810 441977 623919 540116
13736E40116P6902j52862J47987K55644J7638k90364j68935o1139j15301j8051
$$ 540116 617018 464156 612143 867787 885425 595061 426126 364987 249686 231635
13726B31635L4420q9079j28353K74568Q6025k28798J94949K08828P3702j59269
$$ 231635 266055 176976 48623 323191 409216 180418 375367 584195 657897 498628
13716D98628k06542n8182L13016K00237L21632l1052m9950j36825j4790j70737
$$ 498628 292086 233904 546920 747157 1068789 1037737 987787 850962 836172 665435
13706F65435n1886L41973j69034l03833J50395K64797k20166l42563k10061n8274
$$ 665435 613549 955522 786488 482655 633050 897847 677681 335118 125057 66783
13696F6783J2369K02606J61298k67922j81397p2893J13806m9677K27799J08159
$$ 66783 79152 281758 443056 175134 -6263 -79156 34650 -15027 212772 320931
13686C20931l83069j00487K85041K26127J26367J66789j99761j55447J3371j21006
$$ 320931 -62138 -162625 122416 348543 474910 641699 441938 286491 299862 178856
13676A78856J19795K9631Q2065k3853m18287P1203O7194P4201K9533k08470k5735
$$ 178856 298651 328282 410347 386494 -31793 39410 106604 180805 210338 1868 -23867
13665b3867j6036J39294J94295k95396q4068L03294q5093L19121j40335l16599
$$ -23867 -39903 99391 293686 -1710 -85778 217516 132423 451544 311209 -5390
13655e390J5574k0197N8416J53956k9500O2574k63432o6814j5729J78875L6191
$$ -5390 10184 -10013 48403 202359 172859 235433 -27999 -94813 -110542 68333 104524
13644A04524J13071N3275N0008k0409K1910j08145J4031J45285J71120l21999
$$ 104524 217595 270870 320878 300469 322379 214234 228265 373550 544670 222671
13634B22671j46332K20529R4856K46004K65435j87602k74780j4017j17129J7542
$$ 222671 76339 296868 391724 637728 903163 715561 440781 426764 309635 327177
13624C27177k07442k89245J11934k8158R3985J70399J72646M00630O8268J02047
$$ 327177 119735 -169510 -57576 -85734 8251 178650 351296 751926 820194 922241
13614I22241l7581O5621m4029j9193m42769l30319J27317j54772K07300q319j31261
$$ 922241 884660 950281 906252 887059 444290 113971 241288 86516 293816 285497 154236
13603A54236r9505K25381K99763j22833K19052N6332k43803o2093k36107k17827
$$ 154236 54731 280112 579875 457042 676094 732426 488623 426530 190423 -27404
13593b7404K8061K40089L63928K16510p6776j32678j33806J31508p305k77119
$$ -27404 657 240746 604674 821184 744408 611730 477924 609432 602127 325008
13583C25008J37102r7713l22954N2932M20J84082q0447k14947j05066K73937j55577
$$ 325008 462110 364397 41443 94375 94795 278877 198430 -16517 -121583 152354 -3223
13572c223J30125j16064Q0567L40736q0585k48861M4787L92521r4462P279j51236
$$ -3223 126902 10838 91405 432141 351556 102695 147482 540003 445541 452820 301584
13561C01584k6306J85332J41726P1029q7691m72852o3401l7288J90016Q2233J31568
$$ 301584 275278 460610 602336 673365 585674 112822 49421 12133 202149 284382 415950
13550D15950J12119l06766j54027J20115K32249L04311j00303l30576K8163L28894
$$ 415950 528069 221303 67276 187391 419640 723951 623648 293072 321235 650129
13540F50129M1198j48094m09459K8812j86098R5279K72262P9218j00835r8795
$$ 650129 691327 543233 133774 162586 -23512 71767 344029 423247 322412 223617
13530B23617n9234Q8357L62090J74582j37518k85874o01448j01662M50997J92186
$$ 223617 164383 252740 614830 789412 651894 366020 -235428 -337090 113907 306093
13520C06093L8895J33955P6201M4194L4706K3999J43935o86737l19169K72640
$$ 306093 344988 478943 555144 599338 634044 658043 801978 115241 -203928 68712
13510F8712Q9717j42676j15959k65336K9439L96109J05310k52374N3369L93381
$$ 68712 158429 15753 -100206 -365542 -336103 60006 165316 -87058 -33689 359692
13500C59692m1735j603M2889R5961J1554J80737j90458m66163j68320j8888l116
$$ 359692 317957 316354 359243 455204 466758 647495 457037 -9126 -177446 -196334 -199450
13489a99450K28201J63439m576j01665j64748K6403K10794K5045O3524Q3686k83086
$$ -199450 28751 192190 187614 85949 -78799 -52396 158398 183443 246967 330653 47567
13478D7567j41952K21999J53261j1713k07506k71595K412J37685L0795K99211
$$ 47567 -94385 127614 280875 269162 61656 -209939 -207527 -69842 -39047 260164
13468B60164L98074K66636K34153n9163k28001k73939m2017K79860k63741k60768
$$ 260164 658238 924874 1159027 1099864 871863 597924 555907 835767 572026 311258
13458C11258k8286J78454M75201n9927l32582l64985n7955J88730k80133Q0985
$$ 311258 282972 461426 936627 876700 544118 179133 121178 309908 29775 110760
13448A10760J81092J80005k36838k36939O5512L91972j96022k1577K352L09580
$$ 110760 291852 471857 235019 -1920 63592 455564 259542 237965 240317 549897
13438E49897K89263m4043k41762k04195J11933j64499K02768L15500k8417j87370
$$ 549897 839160 795117 553355 349160 461093 296594 499362 814862 786445 599075
13428E99075l74891J07154M19027j75661j8308j45130L9925J06201l57242l86862
$$ 599075 224184 331338 750365 574704 556396 411266 451191 557392 200150 -186712
13418a86712J39174M08889K09797q9405j35821K6394Q6062l47433K33593J92148
$$ -186712 -47538 361351 571148 481743 345922 372316 458378 110945 344538 536686
13408E36686l57091j60577J17013J98444m7634L00800M46214k19849k71921m23161
$$ 536686 179595 19018 136031 334475 286841 587641 1033855 814006 542085 118924
13398A18924k13161R9975J69753J5093j18365j77660k87303J31206L48909j10576
$$ 118924 -94237 5738 175491 190584 72219 -105441 -392744 -261538 87371 -23205
13388b3205j44869K78901K44653Q7676j18718p582L09256L19803m5501j98153
$$ -23205 -168074 110827 355480 443156 324438 316856 626112 945915 900414 702261
13378G02261l60621n03040j93135J61020j09019o6146K06335r5864J26948M19908
$$ 702261 341640 -161400 -354535 -193515 -302534 -368680 -162345 -258209 -131261 288647
13368B88647q891J05137k87960N7685l5866k57656L5858R6354N5199K7984Q1238
$$ 288647 279756 384893 96933 154618 118752 -138904 -103046 -6692 48507 76491 157729
13357A57729J35011k698J43996P8217k87396M2214j12116r5495O8118N7805k538
$$ 157729 292740 290042 434038 512255 224859 267073 154957 59462 127580 185385 182847
13346A82847J56119J8933j47956J74913J27803J52331L44810r3744O451J30100
$$ 182847 338966 357899 209943 384856 512659 664990 1009800 916056 922507 1052607
13336A052607m55846m7640N60999m5589l94417l66890K64471J57839K0290O813
$$ 1052607 596761 549121 1110120 1064531 670114 303224 567695 725534 745824 752637
13326G52637j03351l31122n1826K50748J70927j70784j44634J81179P0915j01692
$$ 752637 649286 318164 266338 517086 688013 517229 372595 553774 624689 522997
13316E22997L3855P6585j42686m8297j14070q4161j19284J19468K24611K1743
$$ 522997 556852 633437 490751 442454 328384 244223 124939 244407 469018 490761
13306D90761k32494q5979J22871j20467P7126N3590j91534j83634L2567m87502
$$ 490761 258267 172288 295159 174692 251818 305408 113874 -69760 -37193 -524695
13296e24695K63834N30297M98843M32930k60769j33169l42354m2629K74352J95212
$$ -524695 -260861 269436 768279 1201209 940440 807271 464917 422288 696640 891852
13286H91852k4827m6927L03033k92623k58754J14013J88200j26811k54563r3093
$$ 891852 867025 820098 1123131 830508 571754 685767 873967 747156 492593 399500
13276C99500j13880J94878Q7039k31069J41042J24513J34059k7884J42391K3268
$$ 399500 285620 480498 567537 336468 477510 602023 736082 708198 850589 873857
13266H73857K10910p0152m15355l25596J66937l17152j15652o272J60910j23872
$$ 873857 1084767 1014615 599260 273664 440601 123449 7797 1525 162435 38563
13256C8563J76772n4851r9145r562j86350J00557K51617K88579M17225j17425
$$ 38563 215335 160484 61339 51777 -134573 -34016 217601 506180 923405 805980
13246H05980N5701k1549j37452L3186k75764l2092K91293j41748j2908K23986
$$ 805980 861681 840132 702680 735866 460102 428010 719303 577555 564647 788633
13236G88633K03358k943l41385j82212J01186J99401j58950j41902n23381j74753
$$ 788633 991991 989048 647663 465451 566637 766038 607088 465186 -58195 -232948
13226b32948L83469J84508K7922j00485R3672j57511J52044J09406K6778j0683
$$ -232948 150521 335029 362951 262466 356138 198627 350671 460077 486855 476172
13216D76172Q486o7600q417q9853J76650J09962j97957J13328K78765j31910n9638
$$ 476172 484658 417058 408641 318788 495438 605400 407443 520771 799536 667626 607988
13205F07988n7070o4296J47589Q7235j93328K95633J95055K9635N3035Q4002n34804
$$ 607988 550918 486622 634211 721446 528118 823751 1018806 1048441 1101476 1185478 650674
13194F50674n56766j433N2764L42567M238k82154q9904J72787J16002P9214J66190
$$ 650674 93908 92475 145239 487806 492044 209890 119986 292773 408775 487989 654179
13183F54179j70873J43566L4178J59042J3281N3999n7128l04630k24989j4149
$$ 654179 483306 626872 661050 820092 833373 887372 830244 525614 300625 286476
13173B86476L05162J19283k84536m28113R849L3074l03205M6384L26266M63756
$$ 286476 591638 710921 426385 -1728 8121 41195 -262010 -215626 110640 574396
13163E74396L71208J75205K28307l9404J7984n02136k09826k01980j53215J59458
$$ 574396 945604 1120809 1349116 1309712 1327696 825560 615734 413754 260539 419997
13153D19997K15362m19426M0068Q7172J36926J37791k86612n4395O5383o4655
$$ 419997 635359 215933 256001 343173 480099 617890 331278 276883 342266 277611
13143B77611J6918L66572j96350o6918n3939K11777j68638J46229J93267o9235
$$ 277611 294529 661101 464751 397833 343894 555671 387033 533262 726529 657294
13133F57294J71685L0396J21075q6037m8822J14419P407l8277j30812l07845k24550
$$ 657294 828979 859375 980450 894413 845591 960010 967417 929140 798328 490483 265933
13122B65933k22319K00902K12795j46839j18139o3927J36298q6654J49148L02509
$$ 265933 43614 244516 457311 310472 192333 128406 264704 178050 327198 629707
13112F29707K7347k8477j63681J40922J53273j23293l39726J34698J27099m1564
$$ 629707 657054 628577 464896 605818 759091 635798 296072 430770 557869 516305
13102E16305k67722J56554K39498Q7955m40433j91012K78662L70107o2853o6349
$$ 516305 248583 405137 644635 732590 292157 101145 379807 749914 687061 620712
13092F20712L2615o0763l0575o8480j56731j47931J27023J46600j19295l26247
$$ 620712 653327 592564 561989 493509 336778 188847 315870 462470 343175 16928
13082A6928j08850N29184K16287r7671j58138J07630M9718J91800Q2438k09111
$$ 16928 -91922 437262 653549 555878 397740 505370 555088 746888 829326 620215
13072F20215J1437j40504j42683j23779J98454L33967K0643n6122R6856J70182
$$ 620215 631652 491148 348465 224686 423140 757107 777750 721628 818484 988666
13062I88666l94486K36493m8497Q3816m4415J1140K9828p8000K37853j15139o1272
$$ 988666 594180 830673 782176 865992 821577 832717 862545 784545 1022398 907259 845987
13051H45987Q1087N7282k55868J80474J10803j66258j39423K14298K87093j51776
$$ 845987 927074 984356 728488 908962 1019765 853507 714084 928382 1215475 1063699
13041A063699K7624k08879J46360K49547o0588m2960j45468k69706j93166k86150
$$ 1063699 1091323 882444 1028804 1278351 1217763 1174803 1029335 759629 566463 280313
13031B80313J91863K69123l1779K3775K55567P095j8663l28690j60008K33563
$$ 280313 472176 741299 709520 733295 988862 995957 977294 648604 488596 722159
13021G22159M4609J18508p4853o8557p8824j09017j12400j81289l3407K6312J32318
$$ 722159 766768 885276 810423 741866 663042 554025 441625 260336 226929 253241 385559
13010C85559j01230j15361K71508M9609n1387P4039K29544M2022k61626J9374
$$ 385559 284329 168968 440476 490085 438698 512737 742281 784303 522677 542051
13000E42051K084J5249M3632K65852L92l13473j13547J88776J28425Q0558j16882
$$ 542051 544135 559384 603016 868868 869260 555787 442240 631016 759441 839999 723117
12989G23117o5398q6814K09499L03362l04640m54157j502O033Q640J71557k7014
$$ 723117 657719 570905 780404 1083766 779126 324969 323467 329500 338140 509697 482683
12978D82683p3571L3127N96858j40166n71787L3389R1355j85945n4509J67600
$$ 482683 409112 442239 1039097 898931 327144 360533 451888 265943 211434 379034
12968C79034K69404l9568n2106O3375l05229J78758M38756N7889l6722p2199j21475
$$ 379034 648438 608870 556764 620139 314910 493668 932424 990313 953591 881392 759917
12957G59917M3360J65976o4255J26264j30087k96961J96486j341j40327k7533
$$ 759917 803277 969253 904998 1031262 901175 604214 800700 799359 659032 631499
12947F31499m8753O8163k26785Q5129J92648L29740l52999m1609l194q6694K30497
$$ 631499 582746 650909 424124 509253 701901 1031641 678642 637033 633839 547145 777642
12936G77642K43355j01201j16932n1956P1480k45855j97426J83180J6325j09462
$$ 777642 1020997 919796 802864 750908 822388 576533 379107 562287 578612 469150
12926D69150J6671J14703M806j71875O1685J90527j86404j31865L75337J0343
$$ 469150 485821 600524 605330 433455 495140 685667 499263 367398 742735 753078
12916G53078Q2401K51191k16896k39284N7895R4223j68050m7344J75812j59176
$$ 753078 835479 1086670 869774 630490 688385 782608 614558 567214 743026 583850
12906E83850M1147K73328J49505l9289k04007q1507l0286Q7465p6457K52646l9485
$$ 583850 624997 898325 1047830 1008541 804534 723027 692741 780206 703749 956395 916910
12895I16910m42660l03049p2369J26941K53164K25434K74437k95474j30951J15839
$$ 916910 474250 171201 98832 225773 478937 704371 978808 683334 552383 668222
12885F68222j485l49436q3330J47191j47338J38111K40404r2859j47493m8354
$$ 668222 666737 317301 233971 381162 233824 371935 612339 519480 371987 323633
12875C23633R9328k2679L9915L49911k8681m4501M5133k30958k42946J75525J68069
$$ 323633 422961 400282 440197 790108 761427 716926 762059 531101 288155 463680 631749
12864F31749L48834k7953p8412M5569K65074J22780j2935r7728Q4570J82127r2953
$$ 631749 980583 952630 874218 919787 1184861 1307641 1294706 1196978 1281548 1463675 1370722
12853A370722k20791n5338Q5402k54529k23193J32782L23047n5149k32395p1978
$$ 1370722 1149931 1094593 1179995 925466 702273 835055 1158102 1102953 870558 798580
12843G98580K48573J88744J40774l79078j74957k6180j7406P2243j76632k19239
$$ 798580 1047153 1235897 1376671 997593 822636 796456 779050 851293 674661 455422
12833D55422J43703J79636K23060K05218j79354l35421r5618o1600Q2976J38334
$$ 455422 599125 778761 1001821 1207039 1027685 692264 596646 535046 618022 756356
12823G56356J20523J26581K56785Q596n02365K34277K88066R9221K2342l78181
$$ 756356 876879 1003460 1260245 1268841 766476 1000753 1288819 1388040 1410382 1032201
12813A032201l35058k31276J39810O0289j82764M57195M71861j47158l88086j49602
$$ 1032201 697143 465867 605677 665966 483202 940397 1412258 1265100 877014 727412
12803G27412K07888K81764n6697k78824k42246l24951P8249P5957N8246L63978
$$ 727412 935300 1217064 1160367 881543 639297 314346 392595 468552 526798 890776
12793H90776r6199k01152j65803j32325n6786L2616K29045N4053l19196N789N472
$$ 890776 794577 593425 427622 295297 238511 271127 500172 554225 235029 240818 246290
12782B46290P3636J03296l5043P4309L82836J79474o5897M50271M85573k26922
$$ 246290 319926 423222 388179 462488 845324 1024798 958901 1409172 1894745 1667823
12772A667823j91278l63915k70106l94905J38578l9610k16496J3869K81786K00881
$$ 1667823 1476545 1112630 842524 447619 586197 546587 330091 343960 625746 826627
12762H26627J01512p6126m53578J29828L1009O117L9374J84736J35510P6141j80131
$$ 826627 928139 852013 398435 528263 559272 565389 604763 789499 925009 1001150 821019
12751H21019L53189l535k47985L06680N25888K80919j41379l11950n6947r4917
$$ 821019 1174208 1170673 922688 1229368 1755256 2036175 1894796 1582846 1525899 1430982
12741A430982k84526k15030M3408l3038K45382l18532j59394L22991p8871J13603
$$ 1430982 1146456 931426 974834 941796 1187178 868646 709252 1032243 953372 1066975
12731A066975L62229M1119r5228k61801J07684l45061j00169n9385J06265M9800
$$ 1066975 1429204 1470323 1375095 1113294 1220978 875917 775748 716363 822628 872428
12721H72428k79340K67454K70904L7535m452k50350J32811P6758J07787J9316
$$ 872428 593088 860542 1131446 1168981 1164529 914179 1046990 1123748 1231535 1250851
12711A250851p1947k78018l4837J41917K34080K98436l71591k14044K47691J04723
$$ 1250851 1178904 900886 866049 1007966 1242046 1540482 1168891 954847 1202538 1307261
12701A307261R0277k01735j93641m7006k67051N1264k4453k17108K03829R1871
$$ 1307261 1397538 1195803 1002162 955156 688105 739369 714916 497808 701637 793508
12691G93508J32340K646j40091j1293J41701M8435L0649K01426J19500J5703J6479
$$ 793508 925848 928494 788403 777110 918811 967246 997895 1199321 1318821 1334524 1351003
12680A351003r2907m8397J8598J45549J15098m76665m02837j49734L26073P3535
$$ 1351003 1258096 1209699 1228297 1373846 1488944 1012279 609442 459708 785781 859316
12670H59316j0191l59232R8276J09600K56069m3356J02200J80929J01581r2079
$$ 859316 849125 489893 588169 697769 953838 910482 1012682 1193611 1295192 1203113
12660A203113O2741j72328j65130j55162J31944M02615J52080J16250j40308j76710
$$ 1203113 1265854 1093526 928396 773234 905178 1307793 1459873 1576123 1435815 1259105
12650A259105l96078m8179L17933L99809L31840l7515k25857r6040j90579J23266
$$ 1259105 863027 814848 1132781 1532590 1864430 1826915 1601058 1505018 1314439 1437705
12640A437705l3935p4076p5918p3326m7115Q0445j75122k16610P0801K24528L38253
$$ 1437705 1403770 1329694 1253776 1180450 1133335 1213780 1038658 822048 892849 1117377 1455630
12629A455630j57156J09836m9649l6277R9952M6106K00723K15887n9185j85310
$$ 1455630 1298474 1408310 1358661 1322384 1422336 1468442 1669165 1885052 1825867 1640557
12619A640557j16076P3086J21594K3402J97695k04206j05039q0173J22200J49548
$$ 1640557 1524481 1597567 1719161 1742563 1940258 1736052 1631013 1550840 1673040 1822588
12609A822588N5171j38785N563K8054J97657p3192l06094l97698j35693N2533
$$ 1822588 1877759 1738974 1744537 1772591 1970248 1897056 1590962 1193264 1057571 1110104
12599A110104R1163L21534K5299K16150K73367l89882l26175R6071J94701k3021
$$ 1110104 1201267 1522801 1548100 1764250 2037617 1647735 1321560 1417631 1612332 1589311
12589A589311k76389j38087K77641R2124o6372k53461R1827J52306K61082J93681
$$ 1589311 1312922 1174835 1452476 1544600 1478228 1224767 1316594 1468900 1729982 1923663
12579A923663J47117K54728j69955k86898J4831m1991m350l42709k12700m13258
$$ 1923663 2070780 2325508 2155553 1868655 1883486 1841495 1837145 1494436 1281736 868478
12569H68478O2335J58257j3775R1274L02478K27508K13330j78235k3044l49853
$$ 868478 930813 1089070 1075295 1166569 1469047 1696555 1909885 1731650 1708606 1358753
12559A358753r1674K32831M84064J53847k52637O1700L0581j9456Q866k41621
$$ 1358753 1267079 1499910 1983974 2137821 1885184 1946884 1977465 1958009 1966875 1725254
12549A725254K03414m4787J05596l9625j42313J79613J38472K01529J13653K5181
$$ 1725254 1928668 1883881 1989477 1949852 1807539 1987152 2125624 2327153 2440806 2465987
12539B465987k54206j31651o176O7201j40200j04816J01125J37109o3389O1471
$$ 2465987 2211781 2080130 2073954 2141155 2000955 1896139 1997264 2134373 2070984 2132455
12529B132455J86241J9263k59747N1291j95915O8980N5r1769q8214J88646O758
$$ 2132455 2318696 2337959 2078212 2129503 1933588 2002568 2002623 1910854 1822640 2011286 2018044
12518B018044j51121J10784O02182j56510j77547j09345R5587L10894K44550M8680
$$ 2018044 1866923 1977707 2579889 2423379 2245832 2136487 2232074 2542968 2787518 2836198
12508B836198k24074k2357K17j08411R2380j01397p0770O7430l8626J23576J11054
$$ 2836198 2612124 2589767 2589984 2481573 2573953 2472556 2401786 2469216 2430590 2554166 2665220
12497B665220M7441l0898n09591j22701J94585K11052j1830l37939n7434m7919
$$ 2665220 2712661 2681763 2172172 2049471 2244056 2455108 2443278 2105339 2047905 1999986
12487A999986L946J91483M17841N730l05426Q8658L56174k49997Q2009K29597
$$ 1999986 2003932 2195415 2613256 2618986 2313560 2402218 2758392 2508395 2590404 2820001
12477B820001j48447J18960J26730k23761r2793j2492J51880o7382k5906O5843
$$ 2820001 2671554 2790514 2917244 2693483 2600690 2588198 2740078 2672696 2646790 2712633
12467B712633o7006J56717K23501M4008k16752J77996J93238o0159q7l02748n21421
$$ 2712633 2645627 2802344 3025845 3069853 2853101 3031097 3224335 3164176 3164089 2861341 2339920
12456B339920j34238M45998P3551o392J27182K08722K72385P2792k09171l44459
$$ 2339920 2205682 2651680 2725231 2718839 2846021 3054743 3327128 3399920 3190749 2846290
12446B846290J02505J02230l03194n1488J30503j03941J30895J86371K92304j43912
$$ 2846290 2948795 3051025 2747831 2696343 2826846 2722905 2853800 3040171 3332475 3188563
12436C188563P533j56649Q8437M9996p9459k88816J99395R5201j71419j18378
$$ 3188563 3196096 3039447 3127884 3177880 3098421 2809605 3009000 3104201 2932782 2814404
12426B814404K58542m9781J73028J63360O6K13832n8867l5294k78837k61567M31969
$$ 2814404 3072946 3023165 3196193 3359553 3359619 3573451 3514584 3479290 3200453 2938886 3370855
12415C370855L78997L6395o3306m0239j67889j55894L5272M19760J49928j81114
$$ 3370855 3749852 3786247 3722941 3682702 3514813 3358919 3394191 3813951 3963879 3782765
12405C782765R1204j30553k73567j11576o2428K30180M3080j52037J29041K92087
$$ 3782765 3873969 3743416 3469849 3358273 3295845 3526025 3569105 3417068 3546109 3838196
12395C838196K61710r6377Q8295Q212l47840o07561o467K84119K24050j11667
$$ 3838196 4099906 4003529 4091824 4100036 3752196 3144635 3138168 3422287 3646337 3534670
12385C534670P3620L35620m0645N5818J63534j21356j67292M00441K11877j1446
$$ 3534670 3608290 3943910 3903265 3959083 4122617 4001261 3833969 4234410 4446287 4434841
12375D434841k04206R3993O7148j96709l32477k61323o4384J97155L15668R6928
$$ 4434841 4230635 4324628 4391776 4195067 3862590 3601267 3536883 3734038 4049706 4146634
12365D146634k75534J01927L33263K4151k9268K34795K57882k28427j48987L17417
$$ 4146634 3871100 3973027 4306290 4330441 4301173 4535968 4793850 4565423 4416436 4733853
12355D733853K29395r2786j03571k93475p9014J20151K64777J9582l04298j22899
$$ 4733853 4963248 4870462 4766891 4473416 4394402 4514553 4779330 4798912 4494614 4371715
12345D371715R5620l05940J66036K87644J98151K79677J02579k75760P6309j38101
$$ 4371715 4467335 4161395 4327431 4615075 4813226 5092903 5195482 4919722 4996031 4857930
12335D857930j16345L51639L75659R2124j93555J22884P8873n2512K3594K508
$$ 4857930 4741585 5093224 5468883 5561007 5367452 5490336 5569209 5516697 5540291 5542799
12325E542799J36065J96729J4113m5893k98642j41204K1020M67571j0753r3431
$$ 5542799 5678864 5875593 5889706 5843813 5545171 5403967 5424987 5892558 5881805 5788374
12315E788374j08535n9997p0120K1443L11854J7083j40126K96911K99220j41224
$$ 5788374 5679839 5619842 5549722 5571165 5883019 5900102 5759976 6056887 6356107 6214883
12305F214883N4946r0638p2846j96424j40297J37765M4831J27855k2138L9059
$$ 6214883 6269829 6179191 6106345 5909921 5769624 5907389 5952220 6080075 6057937 6096996
12295F096996N6588L8888n9435r8895L66073J64915N0159J63012M6988j88355
$$ 6096996 6153584 6192472 6133037 6034142 6400215 6565130 6615289 6778301 6825289 6636934
12285F636934J25350K00392K61172J27145m5227p15j24560m8762J68098k15382
$$ 6636934 6762284 6962676 7223848 7350993 7305766 7305051 7180491 7131729 7299827 7084445
12275G084445j40982O4261J78630J6085n8266j04329J5136M25174L17999J99581
$$ 7084445 6943463 7007724 7186354 7202439 7144173 7039844 7054980 7480154 7798153 7997734
12265G997734k06494j76393j93634j23410j03173J83809K78176K09217K34453
$$ 7997734 7791240 7614847 7421213 7297803 7194630 7378439 7656615 7865832 8100285
12256H100285N132j24855K73205K43449m9092l4400K99035q311l6772q8715L1523
$$ 8100285 8105417 7980562 8253767 8497216 8448124 8413724 8712759 8704448 8667676 8578961 8610484
12245H610484K59547J64644k03633o3801O0398j2996K93566L88006m6537K4555
$$ 8610484 8870031 9034675 8831042 8767241 8827639 8814643 9108209 9496215 9449678 9474233
12235I474233j117j5615r4331n4479l6962O22410L58623L08060J38124m65182
$$ 9474233 9473116 9457501 9363170 9308691 9271729 9894139 10252762 10560822 10698946 10233764
12225A0233764n2818K41563K12282J67173J00960r1920k13909J35321N55022J89871
$$ 10233764 10180946 10422509 10634791 10801964 10902924 10811004 10597095 10732416 11287438 11477309
12215A1477309O3560p7933K01380M26622j21065Q8379J00192l78128N4250L93925
$$ 11477309 11540869 11462936 11664316 12090938 11969873 12058252 12158444 11780316 11834566 12228491
12205A2228491r7459o6929J61727o3723J12298R2205K21361K99167M80420L12125
$$ 12228491 12131032 12064103 12225830 12162107 12274405 12366610 12587971 12887138 13367558 13679683
12195A3679683l2150l7250J29723j17307K09732M41033K0797l05389K46270L13366
$$ 13679683 13647533 13610283 13740006 13622699 13832431 14273464 14294261 13988872 14235142 14548508
12185A4548508P7074J2750L69794K67603K16014J06576M08490M52716k66580j14686
$$ 14548508 14625582 14638332 15008126 15275729 15491743 15598319 16006809 16459525 16192945 16078259
12175A6078259P7548q1977N48669L41623J43344l8665M4744K74658J62541L3202
$$ 16078259 16155807 16073830 16622499 16964122 17107466 17068801 17113545 17388203 17550744 17583946
12165A7583946k4317N17182N33826j62215l06727K11282K83129N3203k676K24297
$$ 17583946 17559629 18076811 18610637 18448422 18141695 18352977 18636106 18689309 18686633 18910930
12155A8910930M14288K73958K71887L72868N9189k07555l36647K08648N26744
$$ 18910930 19325218 19599176 19871063 20243931 20303120 20095565 19758918 19967566 20494310
12146B0494310M59085K55704L63769q1389O6525O07933K70804J14488J6155j10578
$$ 20494310 20953395 21209099 21572868 21491479 21558004 22165937 22436741 22551229 22567384 22456806
12136B2456806L10948L16313M81355K77506K93565K67397L07265P00591L48974
$$ 22456806 22767754 23084067 23565422 23842928 24136493 24403890 24711155 25411746 25760720
12127B5760720l21628O7206K24746K99439M86573L47062L08088J87456K31538
$$ 25760720 25439092 25506298 25731044 26030483 26517056 26864118 27172206 27359662 27591200
12118B7591200N66235J90601J73687k0827O0296O58732L76758J80967K59566M25859
$$ 27591200 28157435 28348036 28521723 28500896 28561192 29219924 29596682 29777649 30037215 30463074
12108C0463074P07707L74122M372K05871K79415K38603M03915J20573K48121N88420
$$ 30463074 31170781 31544903 31549275 31755146 32034561 32273164 32677079 32797652 33045773 33634193
12098C3634193P21764L80018J45591J73937K12796j97784K66498M96511M95999
$$ 33634193 34355957 34735975 34881566 35055503 35268299 35070515 35337013 35833524 36329523
12089C6329523N34339M60122L29921J9385L14801J50608N74460N67466L85041
$$ 36329523 36863862 37323984 37653905 37673290 37988091 38138699 38713159 39280625 39665666
12080C9665666M25080K22383K49254J45970N64683L01735P0920J01379J45995
$$ 39665666 40090746 40313129 40562383 40708353 41273036 41574771 41645691 41747070 41893065
12071D1893065M63608O56265O95836M19178M59765M99263K15555L9439M35840
$$ 41893065 42356673 43012938 43708774 44127952 44587717 45086980 45302535 45341974 45777814
12062D5777814O49150O92539M04957m1960Q4378J81781L64340J69816L10083M03495
$$ 45777814 46426964 47119503 47524460 47482500 47566878 47748659 48112999 48282815 48592898 48996393
12052D8996393L41652K0863J46347N61500J74818q6416O0395M89550M27155K28820
$$ 48996393 49338045 49358908 49505255 50066755 50241573 50155157 50215552 50705102 51132257 51361077
12042E1361077J68188N01546K24255j01417K66225L68828M45769M01430l73264
$$ 51361077 51529265 52030811 52255066 52153649 52419874 52788702 53234471 53635901 53262637
12033E3262637J41347J79335M29746J67920k28979P2377J42269N4887K96348L45277
$$ 53262637 53403984 53583319 54013065 54180985 53952006 54024383 54166652 54221539 54517887 54863164
12023E4863164O2490j35525j35778k65219l86339k08402M28972J12249O1266K5527
$$ 54863164 54925654 54790129 54654351 54389132 54002793 53794391 54223363 54335612 54396878 54422405
12013E4422405k41219K0472l83698j33884j10743j9536j00999l3111P0613p5936
$$ 54422405 54181186 54201658 53817960 53684076 53573333 53553797 53452798 53419687 53490300 53414364
12003E3414364k33011M5990j92239J87614m96237p41373l93028n2428j07645l17876
$$ 53414364 53181353 53227343 53035104 53222718 52726481 51985108 51592080 51539652 51432007 51114131
11993E1114131k93193Q0164k12486l50870p28391m33637j73079j60963m17088
$$ 51114131 50820938 50901102 50688616 50337746 49609355 49175718 49002639 48841676 48424588
11984D8424588r4887J02518j28357k05710l52491q28714n52443l41713j53911
$$ 48424588 48329701 48432219 48303862 48098152 47745661 46916947 46364504 46022791 45868880
11975D5868880K51831n50890o99844l53759m88507l37572p8195o84759j21275
$$ 45868880 46120711 45569821 44869977 44516218 44027711 43690139 43611944 42927185 42805910
11966D2805910m51063m89825l14867k83073o53011k68568j31585k50018k85852
$$ 42805910 42354847 41865022 41550155 41267082 40614071 40345503 40213918 39963900 39678048
11957C9678048k72867m43110l85756k50552J3377q4551n05645l19249m41279p91473
$$ 39678048 39405181 38962071 38576315 38325763 38339140 38254589 37748944 37429695 36988416 36196943
11947C6196943o87548l20675r7884m53393n24372l79307l28222l45969k1738k88304
$$ 36196943 35509395 35188720 35090836 34637443 34113071 33733764 33405542 33059573 33037835 32749531
11937C2749531n07834n49399k05472j61059N820j28847l21624n52732l16342J69441
$$ 32749531 32241697 31692298 31486826 31325767 31331587 31202740 30881116 30328384 30012042 30181483
11927C0181483K21847k85863o90467o5622k9522l30679m81438m69287o04129j51626
$$ 30181483 30403330 30117467 29427000 29361378 29331856 29001177 28519739 28050452 27446323 27294697
11917B7294697j83980l07420m51288k57681k09717m00096l52112k41104j86348
$$ 27294697 27110717 26803297 26352009 26094328 25884611 25484515 25132403 24891299 24704951
11908B4704951j20765O5609k11129l35430J98977r6591m94335l04266l15294m85456
$$ 24704951 24584186 24649795 24438666 24103236 24302213 24205622 23711287 23407021 23091727 22606271
11898B2606271k19438M5758l88161k96867O5226l02524l50405m26432j64525K99342
$$ 22606271 22386833 22432591 22044430 21747563 21812789 21510265 21159860 20733428 20568903 20868245
11888B0868245j7049k93332j99029l93306m46589k12438j97307k15370l21429
$$ 20868245 20851196 20557864 20358835 19965529 19518940 19306502 19109195 18893825 18572396
11879A8572396J299J58342n6922j69743M3531R3948j77762m04701k38991l21606
$$ 18572396 18573695 18732037 18675115 18505372 18548903 18642851 18465089 18060388 17821397 17499791
11869A7499791l49254l98790q5563m5504l05384j16992o9597k19425L00421j23901
$$ 17499791 17150537 16751747 16666184 16620680 16315296 16198304 16128707 15909282 16209703 16085802
11859A6085802j18288k10991J3399J94804m06080n29930m10497p6972j40431R5606
$$ 16085802 15967514 15756523 15769922 15964726 15558646 15028716 14618219 14541247 14400816 14496422
11849A4496422J94549j01670k53106k65130Q8370K9722k21858q6299l09734j38413
$$ 14496422 14690971 14589301 14336195 14071065 14159435 14189157 13967299 13881000 13571266 13432853
11839A3432853L68985K17081l76014p07697k34209l81748m8180j31108l53014
$$ 13432853 13801838 14018919 13642905 12935208 12700999 12319251 12271071 12139963 11786949
11830A1786949O2807J06477L6942k07083n3289J68102Q0850n601j11024k19338
$$ 11786949 11849756 11956233 11993175 11786092 11732803 11900905 11981755 11976154 11865130 11645792
11820A1645792j82917l28665j47383k06364L4770J51796Q2221j39667n741k9172
$$ 11645792 11462875 11134210 10986827 10780463 10815233 10967029 11049250 10909583 10903842 10874670
11810A0874670j3175k329j16204k22659m62991k1169J97409L7609J15968K9182
$$ 10874670 10861495 10859166 10742962 10520303 10057312 10036143 10233552 10271161 10387129 10416311
11800A0416311m20180k90843j77264q4510J34834q8358k67057k53441L47433L45372
$$ 10416311 9996131 9705288 9528024 9443514 9578348 9489990 9222933 8969492 9316925 9662297
11790I662297m95859k55879L20449K27497J12959j81170m01427j18618k30153
$$ 9662297 9166438 8910559 9231008 9458505 9571464 9390294 8988867 8870249 8640096
11781H640096J768K50900L2225L345O0321n71890n46814J99112K84989J36858
$$ 8640096 8641864 8892764 8924989 8928334 8988655 8416765 7869951 8069063 8354052 8490910
11771H490910k78114l44224j77699M8570n3919K48647k2717K6521J18147Q2726
$$ 8490910 8212796 7868572 7690873 7739443 7685524 7934171 7911454 7937975 8056122 8138848
11761H138848j37856m04027M1816J61900j68471o23016p9552K38501j03617J35502
$$ 8138848 8000992 7596965 7638781 7800681 7632210 7009194 6929642 7168143 7064526 7200028
11751G200028j31066m23648o0342L93322L02924j88846n501r1583o7105j58893
$$ 7200028 7068962 6645314 6584972 6978294 7281218 7092372 7086871 6995288 6928183 6769290
11741F769290L2661j46593O4007p3524m939j1409n3218l04698M3632N702l04853
$$ 6769290 6801951 6655358 6719365 6645841 6640902 6629493 6576275 6271577 6315209 6320911 6016058
11730F016058j97010j97395l78546J18719J53066k6291j29388K42154J50013k91662
$$ 6016058 5819048 5621653 5243107 5361826 5514892 5488601 5359213 5601367 5751380 5459718
11720E459718K5144J63603m11266k69172Q7117L22053K0925P4990k02109K30457
$$ 5459718 5484862 5648465 5237199 4968027 5055144 5377197 5398122 5473112 5271003 5501460
11710E501460J01401K90402k92899k86856K05183o026l73889k19798j52151J34018
$$ 5501460 5602861 5893263 5600364 5313508 5518691 5512665 5138776 4918978 4766827 4900845
11700D900845K8356L31935O9443j01391N8451j66853L8141K25999k03208l12527
$$ 4900845 4929201 5261136 5330579 5229188 5287639 5120786 5158927 5384926 5181718 4869191
11690D869191n2598j45922j7164K58558q670r2705l76262n8092J48866J46701
$$ 4869191 4816593 4670671 4653507 4912065 4903395 4810690 4434428 4376336 4525202 4671903
11680D671903j11695K32676n6022p1424k07959l0665R1369j03310K19105J8538
$$ 4671903 4560208 4792884 4736862 4665438 4457479 4426814 4518183 4414873 4633978 4652516
11670D652516m5604j23893r7092L7502L12355j31399k82576J27734j47707l34134
$$ 4652516 4606912 4483019 4385927 4423429 4735784 4604385 4321809 4449543 4301836 3967702
11660C967702m8912R7497j12393N4064K51318q4517J60954k59193k68283J49837
$$ 3967702 3918790 4016287 3903894 3957958 4209276 4124759 4285713 4026520 3758237 3908074
11650C908074J03077q1595m8780K88834O3465M32664K46070l16507n97899j45687
$$ 3908074 4011151 3929556 3880776 4169610 4233075 4665739 4911809 4595302 3997403 3851716
11640C851716l4850k38000M007j64715J98131J56917k52167j76125l7234J55620
$$ 3851716 3816866 3578866 3582873 3418158 3616289 3773206 3521039 3344914 3307680 3463300
11630C463300M11741k62505l49936j38363p7979J84198K91240K52576R171J50205
$$ 3463300 3875041 3612536 3262600 3124237 3046258 3230456 3521696 3774272 3783443 3933648
11620C933648k72612j10825p1688j37684J24060L34243q3117l09282l4749p6626
$$ 3933648 3661036 3550211 3478523 3340839 3464899 3799142 3716025 3406743 3371994 3295368
11610C295368m1660n9144R0743k40057J50551L12116l16105k46177J57030R3255
$$ 3295368 3253708 3194564 3285307 3045250 3195801 3507917 3191812 2945635 3102665 3195920
11600C195920o4189r2288m66103J42466R5477M5581j19769j14146n7313j63707
$$ 3195920 3131731 3039443 2573340 2715806 2811283 2856864 2737095 2622949 2565636 2401929
11590B401929J85246L41992Q9389j10999K16505p9762J8243j83916J52455R4234
$$ 2401929 2587175 2929167 3018556 2907557 3124062 3044300 3062543 2878627 3031082 3125316
11580C125316k23127r1984k20658j84137k0211O5090n862k6918K34084O7999r9428
$$ 3125316 2902189 2810205 2589547 2405410 2385199 2450289 2444427 2417509 2651593 2719592 2620164
11569B620164J71218K10095K15801K63855n4603j15546J26564j22685l26636m44921
$$ 2620164 2791382 3001477 3217278 3481133 3426530 3310984 3437548 3314863 2988227 2543306
11559B543306J87760K74850j42925j59796J32512l28003j41788p7981L22200J84085
$$ 2543306 2731066 3005916 2862991 2703195 2835707 2507704 2365916 2287935 2610135 2794220
11549B794220J85707m6872j38587P2727p2071j61127o6442o2536k44746q6243
$$ 2794220 2979927 2933055 2794468 2867195 2795124 2633997 2567555 2505019 2260273 2174030
11539B174030K27176J72467L51432l03188m8914L1142K7907J04811J10129J48792
$$ 2174030 2401206 2573673 2925105 2621917 2573003 2604145 2632052 2736863 2846992 2995784
11529B995784L9538l80618O205J45599j66668j83010j28994k22483r5509r864
$$ 2995784 3035322 2654704 2660909 2806508 2639840 2456830 2327836 2105353 2009844 1999980
11519A999980l3296j49379p0096r9194O8318k4190K54119L22558o7072j41800
$$ 1999980 1966684 1817305 1747209 1648015 1716333 1692143 1946262 2268820 2201748 2059948
11509B059948j32682K50921m4297j54793J63928q228O6370R9287j40541k12981
$$ 2059948 1927266 2178187 2133890 1979097 2143025 2134797 2201167 2300454 2159913 1946932
11499A946932L8295L6067r9668P6376k31454L4148N0090n6048R0580J66069K31945
$$ 1946932 1985227 2021294 1921626 1998002 1766548 1800696 1850786 1794738 1885318 2051387 2283332
11488B283332Q7751J93234l18482p1496l80987q0892K58956K62664j85906J10088
$$ 2283332 2371083 2564317 2245835 2174339 1793352 1712460 1971416 2234080 2048174 2158262
11478B158262K31664M2864o9366j44205k54014K0804J51115p4998J56369o4667
$$ 2158262 2389926 2432790 2363424 2219219 1965205 1986009 2137124 2062126 2218495 2153828
11468B153828k19996n0175K46419K63924K00633K7008l24610j02995l57617j81607
$$ 2153828 1933832 1883657 2130076 2394000 2594633 2621641 2297031 2194036 1836419 1654812
11458A654812J82503l33335N6755L30150O0812p135r9539l1868O1485q2625K27973
$$ 1654812 1837315 1503980 1560735 1890885 1951697 1944562 1845023 1813155 1874640 1792015 2019988
11447B019988L07689J60241j67190m3618j39916l72910O1018K66516j06029L6672
$$ 2019988 2327677 2487918 2320728 2277110 2137194 1764284 1825302 2091818 1985789 2022461
11437B022461P0277m49320m61557m9314O6046P5070M12473k21407k09681N3782
$$ 2022461 2092738 1643418 1181861 1132547 1198593 1273663 1686136 1464729 1255048 1308830
11427A308830K41942M701j4682k28106m13313K63153J81724j98676K00673K03715
$$ 1308830 1550772 1555473 1540791 1312685 899372 1162525 1344249 1145573 1346246 1549961
11417A549961k69717j17528M32309M17343P4059k42993o2207J07715N37284J49437
$$ 1549961 1280244 1162716 1595025 2012368 2086427 1843434 1781227 1888942 2426226 2575663
11407B575663l57251l68225j84452p0752k54956K11844L0104k60427Q818K51501
$$ 2575663 2218412 1850187 1665735 1594983 1340027 1551871 1581975 1321548 1330366 1581867
11397A581867l936j03324p1731l6487Q7163J11011Q6860k68309O6537K73345j92265
$$ 1581867 1577931 1474607 1402876 1366389 1453552 1564563 1651423 1383114 1449651 1722996 1530731
11386A530731k40282j3404J05890K13054K01227l07687l09992l6759L62845L11630
$$ 1530731 1290449 1277045 1382935 1595989 1797216 1489529 1179537 1142778 1505623 1817253
11376A817253p8741l01375K53128J41190J40829j19708l44220k38398J22480J43086
$$ 1817253 1738512 1437137 1690265 1831455 1972284 1852576 1508356 1269958 1392438 1535524
11366A535524L43474j29785M3811n6810j21196K27552P6195j29796k23599M1773
$$ 1535524 1878998 1749213 1793024 1736214 1615018 1842570 1918765 1788969 1565370 1607143
11356A607143N2282j53346K89090L52721k3369l48392j2224j05065K56194J52307
$$ 1607143 1659425 1506079 1795169 2147890 2124521 1776129 1763905 1658840 1915034 2067341
11346B067341j0408m65489O3999J27697K05245J26557j19302l38355j61730j9919
$$ 2067341 2056933 1591444 1655443 1783140 1988385 2114942 1995640 1657285 1495555 1475636
11336A475636K10313m8458j77146q9982k89173j09018n7895K28696J66506J82059
$$ 1475636 1685949 1637491 1460345 1370363 1081190 972172 914277 1142973 1309479 1491538
11326A491538L04895N1186j85075n44362k98527P9870J89220o6483j02557o068
$$ 1491538 1796433 1847619 1662544 1118182 819655 899525 1088745 1022262 919705 913637
11316I13637J05795j20656k47416K76597k6872L7595K40697r9209j39736O7504
$$ 913637 1019432 898776 651360 927957 901085 938680 1179377 1080168 940432 1007936
11306A007936K35114n3952l09416j82647M9322J68812J19048m7523k39515K13579
$$ 1007936 1243050 1189098 879682 697035 746357 915169 1034217 986694 747179 960758
11296I60758K03264Q783j11311j33375K88883J9719K07082J95960q7189j01577
$$ 960758 1164022 1172805 1061494 928119 1217002 1236721 1443803 1639763 1552574 1450997
11286A450997j06359k40872j15490r1424k329Q3782J32286M7079K59687L12783
$$ 1450997 1344638 1103766 988276 896852 894523 978305 1110591 1157670 1417357 1730140
11276A730140j70455k07842k31218k47557L7726J06996J06283J37800k14641j10536
$$ 1730140 1559685 1351843 1120625 873068 910794 1017790 1124073 1261873 1047232 936696
11266I36696j18871Q1485K35113N6987p8701J70646J59663l02112k30299l05389
$$ 936696 817825 899310 1134423 1191410 1112709 1283355 1443018 1140906 910607 605218
11256F05218k83738N9522Q4525j62904j10930L78914r1692p5801M04770K9024
$$ 605218 321480 381002 465527 302623 191693 570607 478915 403114 807884 836908
11246H36908j9417L01385p4272n9024K23173m59512j8560J09187n63241k84606
$$ 836908 817491 1118876 1044604 985580 1208753 749241 730681 839868 276627 -7979
11236g979J96106J73381L4750J85999J16280k66552P9361r9700k3164r8219r216
$$ -7979 188127 361508 396258 582257 698537 431985 511346 411646 388482 290263 281047
11225B81047J46416L17402N9283L35347o5016m16540q3261L06288J69304n7295
$$ 281047 427463 744865 804148 1139495 1074479 657939 574678 880966 1050270 992975
11215I92975Q7569j43911r9110o5448M2363N05351R7745j70630k11815K5478P6337
$$ 992975 1080544 936633 837523 772075 814438 1319789 1417534 1246904 1035089 1060567 1136904
11204A136904J79289L24851n1838j21705k19776k18335j60045J30972j54350j0196
$$ 1136904 1316193 1641044 1589206 1467501 1247725 1029390 869345 1000317 845967 835771
11194H35771J82865l369K4627J27600l15838m85520k68133P011R8211L60009k2013
$$ 835771 1018636 1015267 1039894 1167494 851656 366136 98003 105014 203225 563234 541221
11183E41221k49286m9859o8828j01407J39594M89175O2679K1685m99839n1191
$$ 541221 291935 242076 173248 71841 211435 700610 763289 784974 285135 233944
11173B33944L68856K20951j45708J91886K4621l86906l80011J42501l13372j66305
$$ 233944 602800 823751 678043 869929 894550 507644 127633 270134 -43238 -209543
11163b09543K45670K74563J02516J40896L8474m65205Q681J67303K44702R9380
$$ -209543 36127 310690 413206 554102 592576 127371 136052 303355 548057 647437
11153F47437k4009l8544j84871J9361m7751K07428m6346j61752j83835l05273
$$ 647437 623428 584884 400013 419374 371623 579051 532705 370953 187118 -118155
11143a18155Q3048Q9765j69433J26302L20746J19146p0605J3948K12356j40168
$$ -118155 -35107 54658 -114775 11527 332273 451419 380814 394762 607118 466950
11133D66950m23623k36329K85429j5564J05008K21881O1798j99878J11962K02716
$$ 466950 43327 -193002 92427 76863 181871 403752 465550 265672 377634 580350
11123E80350R9661k02212k72284j3883q0696j21535J62186K17320J08941M82141
$$ 580350 680011 477799 205515 191632 110936 -10599 151587 368907 477848 959989
11113I59989K14225j21497l99760j76298k50225l22347J81556J01503P1365K26539
$$ 959989 1174214 1052717 652957 476659 226434 -95913 85643 187146 258511 485050
11103D85050J71880k33409k07094j4456j05665j31796O2750J70695K73654L1057
$$ 485050 656930 423521 216427 201971 96306 -35490 27260 197955 471609 502666
11093E02666k39762J58810l5099K30622K68574J9232L25547j71091l88756J14889
$$ 502666 262904 421714 386615 617237 885811 905043 1230590 1059499 670743 785632
11083G85632K06947L19706J30138n28424k15958k6591l78445k21481K38624J45112
$$ 785632 992579 1312285 1442423 913999 698041 671450 293005 71524 310148 455260
11073D55260J42470R7233k97095k14849N9162P3570J49325J84601K39366j43240
$$ 455260 597730 694963 397868 183019 242181 315751 465076 649677 889043 745803
11063G45803k69327P4676J03712K00892p0097J03397J85660l4466K88611p8349
$$ 745803 476476 551152 654864 855756 785659 889056 1074716 1040250 1328861 1250512
11053A250512j77065m71906J06952K3212k25588J55831N12328L53262L93866j45292
$$ 1250512 1073447 601541 708493 731705 506117 661948 1174276 1527538 1921404 1776112
11043A776112l69009j80820l5353J6255j31336K81447M67803K88787L8941K37268
$$ 1776112 1407103 1226283 1190930 1207185 1075849 1357296 1825099 2113886 2152827 2390095
11033B390095M0080l31293m39717P5524N5174o476K05047P26476M53255k4206
$$ 2390095 2430175 2098882 1659165 1734689 1789863 1783387 1988434 2714910 3168165 3143959
11023C143959J07489K0760k17216m74157n2300O4976n55486k5505P9792n6972
$$ 3143959 3251448 3272208 3054992 2580835 2528535 2593511 2038025 2012520 2092312 2035340
11013B035340L16537j51200j05433K93714J5954l26574o68561n05192k96808p3236
$$ 2035340 2351877 2200677 2095244 2388958 2404912 2078338 1409777 904585 607777 534541
11003E34541M52080j1977J51586N71559j91882l80347m54782k70110j95850K27120
$$ 534541 986621 974644 1126230 1697789 1505907 1125560 670778 400668 204818 431938
10993D31938p3077k70588J92758L55221r1989N6427j92728p892J28213k09046
$$ 431938 358861 88273 281031 636252 544263 600690 407962 400070 528283 319237
10983C19237K009j4043J1020J07650K30366k1870l5056O3925j03510K09381J27786
$$ 319237 321246 307203 318223 425873 656239 634369 599313 663238 559728 769109 896895
10972H96895l61614q7995p4002j04121r1315L369Q9695j29751m53351l87889m9407
$$ 896895 535281 447286 373284 269163 177848 181217 270912 141161 -312190 -700079 -749486
10961g49486N00411N64459N6065o386l90346k08393K49607l39087K1290N26361
$$ -749486 -249075 315384 371449 365063 -25283 -233676 15931 -323156 -301866 224495
10951B24495K10333q6131k10181j1412k26822L71540K48636O8525k53231k11794
$$ 224495 434828 348697 138516 127104 -99718 271822 520458 588983 335752 123958
10941A23958n0189K79985P7283l328m25287l64004K73723J06601r1085m8784j87510
$$ 123958 73769 353754 431037 427709 2422 -361582 -87859 18742 -72343 -121127 -308637
10930c08637o2732L30323q4979l51490j57776r0579L96757K97288M5413r0228
$$ -308637 -371369 -41046 -126025 -477515 -635291 -725870 -329113 -31825 13588 -76640
10920g6640N4839k47383L29537R1740j11712n428J50476j51398J9237K12304q3286
$$ -76640 -21801 -269184 60353 152093 40381 34953 185429 34031 53268 265572 182286
10909A82286k18340k03898j22254k4221K29205L76861L64893J19609j77651k71396
$$ 182286 -36054 -239952 -362206 -386427 -157222 219639 584532 704141 526490 255094
10899B55094k46435j34747m18811k36060L51022J75435J66803K03439K92780k18867
$$ 255094 8659 -126088 -544899 -780959 -429937 -254502 -87699 115740 408520 189653
10889A89653R4188j82223p0637J90506L1060N17308K02189m83624l04558J41582
$$ 189653 283841 101618 30981 221487 252547 769855 972044 488420 183862 325444
10879C25444J9172R6926Q4002k23642l36271J04858L60996L85396n9416n37716
$$ 325444 344616 441542 525544 301902 -34369 70489 431485 816881 757465 219749
10869B19749j2593K18429K42595o6119j19552J70063K85380k21233l14469l3371
$$ 219749 207156 425585 668180 602061 482509 652572 937952 716719 402250 368879
10859C68879P4594l378l21869l58508J58770J32101n5511M9515J07674J25958
$$ 368879 443473 440095 118226 -240282 -81512 50589 -4922 44593 152267 278225
10849B78225L77568L21990k46845Q4534K7406J28505k32306k0355n69015n64559
$$ 278225 655793 977783 730938 815472 842878 971383 739077 718722 149707 -414852
10839d14852k81358L09523K61066p0191k1426j62403l6336J91466J72144L09930
$$ -414852 -696210 -386687 -125621 -195812 -217238 -379641 -415977 -224511 -52367 257563
10829B57563k0995p1805m64097J2681K02189J29082J57518n5345j44777M604k20827
$$ 257563 236568 164763 -299334 -286653 -84464 44618 202136 146791 2014 6618 -214209
10818b14209K12131K9047Q9512p194k56619j58631j57326K9697J44829J58436
$$ -214209 -2078 26969 116481 109287 -147332 -305963 -463289 -433592 -288763 -130327
10808a30327L04043p5080Q4450L90454N5095j43285j37511n4658j55845j13411
$$ -130327 173716 98636 183086 573540 628635 485350 347839 293181 137336 23925
10798B3925k7683K26735k14223K11693J45640o07401n41184J56714L70998J42873
$$ 23925 -3758 222977 8754 220447 366087 -241314 -782498 -625784 -254786 -111913
10788a11913o0909J31805J43602p0398J23581j57543l9003k08282k93719k606
$$ -111913 -172822 -41017 102585 32187 155768 -1775 -40778 -249060 -542779 -545385
10778e45385L20913n4364J49537L0001P5972j31694k57033J96007J64081J03527
$$ -545385 -224472 -278836 -129299 -99298 -23326 -155020 -412053 -216046 -51965 51562
10768E1562j67896J56976J92424j8682q7403k0312K32006k96176l9333J34345
$$ 51562 -116334 40642 233066 214384 126981 106669 338675 42499 3166 137511
10758A37511j02969k42916J52434Q1622N5811K77581J66592R0369j9215j26172
$$ 137511 34542 -208374 -55940 25682 81493 359074 525666 616035 596820 470648
10748D70648k09356j35193j18176j01955k73214j95729L37418J64518J76628M38366
$$ 470648 261292 126099 7923 -94032 -367246 -562975 -225557 -61039 115589 553955
10738E53955L30289K46273M0303m39001m63256j9483K36381q9127R6570K39380
$$ 553955 884244 1130517 1170820 731819 268563 249080 485461 396334 492904 732284
10728G32284r3153o6168k269j18656l7551L0777J51357R5645L02343K82078j65430
$$ 732284 639131 572963 570694 452038 414487 445264 596621 692266 994609 1276687 1111257
10717A111257K2229j34956k32207j42834l49514j73245k9347l325K6924J34828
$$ 1111257 1133486 998530 766323 623489 273975 100730 71383 68058 94982 229810
10707B29810k22126l2021K69579J02801j45903m06377l62676J78655J09948k76815
$$ 229810 7684 -24337 245242 348043 202140 -204237 -566913 -388258 -278310 -555125
10697e55125l62478Q6950J68397l04838j14620K13973O5668j81848P752K13770
$$ -555125 -917603 -830653 -662256 -967094 -1081714 -867741 -802073 -983921 -976169 -762399
10687g62399k22375L7576l5320k75879r7254n2581L19327L0164m3004m3502K85776
$$ -762399 -984774 -947198 -982518 -1258397 -1355651 -1408232 -1088905 -1058741 -1101745 -1145247 -859471
10676h59471K48931k44291j69692L09529l7699O8228L25122O7846j91475J9897
$$ -859471 -610540 -854831 -1024523 -714994 -752693 -684465 -359343 -291497 -482972 -463075
10666d63075k8524J2114K4895Q1215J6975j5263J32433R8419o5337J21457K61885
$$ -463075 -491599 -479485 -454590 -373375 -356400 -371663 -239230 -140811 -206148 -84691 177194
10655A77194j14093l28304o024j23969L47821J55384M15405J96851O333m2661
$$ 177194 63101 -265203 -271227 -395196 -47375 108009 523414 720265 726598 683937
10645F83937M3006J9737L92452N61958N02285L50468q7877l9220M80262P63425
$$ 683937 726943 746680 1139132 1701090 2203375 2553843 2465966 2426746 2907008 3670433
10635C670433Q48777J077101O43186N30669Q47785R77985J114212J320696J963126
$$ 3670433 4519210 5596311 6239497 6770166 7617951 8595936 9710148 11030844 12993970
10626A2993970K767239L526552M669498O131461Q772952J2491776J6332466K1530760
$$ 12993970 15761209 19287761 23957259 30088720 38861672 51353448 67685914 89216674
10618H9216674K5745842K6246473K1538570J0069529k033433q207458p588531
$$ 89216674 114962516 141208989 162747559 172817088 170783655 162576197 154987666
10611A54987666k300331N049493J4877636K7211232L9958372N0633550N2763637
$$ 154987666 152687335 157736828 172614464 199825696 239784068 290417618 343181255
10604C43181255L8119762P433034k2139760l4931861l0565467j7840744k178663
$$ 343181255 381301017 388734051 366594291 331662430 301096963 283256219 281077556
10597B81077556J5491663L4232803N2075535O4798452O3148220L6345962j0418743
$$ 281077556 296569219 330802022 382877557 447676009 510824229 547170191 536751448
10590E36751448n1782367o6736850n8481122m0660965k2218482n136957J1166425
$$ 536751448 484969081 418232231 359751109 319090144 296871662 291734705 302901130
10583C02901130K5338978L3913846L0544879R738931k2303121m7321581n3742132
$$ 302901130 328240108 362153954 392698833 402437764 380134643 332813062 279070930
10576B79070930m5207929l2152005j9378286r396374j071367N269690P729651
$$ 279070930 233863001 201710996 182332710 172936336 171864969 177134659 184864310
10569A84864310N196112l998449j5988921k4999153k6927348k3354846j8469625
$$ 184864310 190060422 186061973 170073052 145073899 118146551 94791705 76322080
10562G6322080j3943905j0521512p935247o403830n089059l629683k908224k267727
$$ 76322080 62378175 51856663 43921416 37517586 32428527 28798844 25890620 23622893
10554B3622893k107008j681990j632111j668416j126423j088363q01324j084481
$$ 23622893 21515885 19833895 18201784 16533368 15406945 14318582 13517258 12432777
10546A2432777p55234n80391p10816j057235m59711k01940m37673m37941l88707
$$ 12432777 11677543 11097152 10386336 9329101 8869390 8667450 8229777 7791836 7403129
10537G403129m17707k26536n4491J6246M3116k49057k86167l38537k47839l40398
$$ 7403129 6985422 6758886 6704395 6720641 6763757 6514700 6228533 5889996 5642157 5301759
10527E301759p6900K25159O3459k56656o4573m12780q7852L27224J71452l00872
$$ 5301759 5224859 5450018 5513477 5256821 5192248 4779468 4691616 5018840 5190292 4889420
10517D889420j80328k42253J12679l0821k91668l9748r8615r8247J07589k7158
$$ 4889420 4709092 4466839 4579518 4548697 4257029 4217281 4118666 4020419 4128008 4100850
10507D100850k79271J51853m801l07763k60500j74073M2036K39669J22407p0465
$$ 4100850 3821579 3973432 3968631 3660868 3400368 3226295 3268331 3508000 3630407 3559942
10497C559942R0370j55168L5448J70930J63638j83084j38672j6635j25837l35859
$$ 3559942 3650312 3495144 3530592 3701522 3865160 3682076 3543404 3526769 3400932 3065073
10487C065073L2125j68609j40943j84812l3395K94879J44247j64804m08014k24778
$$ 3065073 3097198 2928589 2787646 2602834 2569439 2864318 3008565 2843761 2435747 2210969
10477B210969K77421K07483k74100K10912K42697p0797k69210p80059j1644M32093
$$ 2210969 2488390 2695873 2421773 2632685 2875382 2804585 2535375 1755316 1743672 2175765
10467B175765o359o37675j12215J51553j27824j39856L36703J97989L4196N7931
$$ 2175765 2169406 1531731 1419516 1571069 1443245 1303389 1640092 1838081 1872277 1930208
10457A930208l69072m41853K0792L75458J25632j60878j47636l04536j14174J39431
$$ 1930208 1561136 1119283 1140075 1515533 1641165 1480287 1332651 1028115 913941 1053372
10447A053372M4893j70477L42659J2673m9962j14123j90803K20595l5020j89113
$$ 1053372 1098265 927788 1270447 1283120 1233158 1119035 928232 1148827 1113807 924694
10437I24694p7127O7881R8187L14384J11891K5596j83787j18818l8598o5809R8146
$$ 924694 847567 915448 1013635 1328019 1439910 1465506 1281719 1162901 1124303 1058494 1156640
10426A156640j20564k72701P8967N2956j32619J66385L14815o27q8273k17582
$$ 1156640 1036076 763375 842342 895298 762679 929064 1243879 1243252 1154979 937397
10416I37397K9717P9764J04621j70806l28478J1702J0434r059O6136J2870r7179
$$ 937397 967114 1046878 1151499 980693 652215 663917 674351 665292 731428 744298 647119
10405F47119n0369M50799j221l27832l4117j23727K67202K86663J36380O307J66433
$$ 647119 596750 1047549 1046328 718496 684379 560652 827854 1114517 1250897 1257204 1423637
10394A423637j98694j31943J341o1796n0660K4561O6835r5828O8613J34844J0634
$$ 1423637 1224943 1093000 1094341 1032545 981885 1006446 1073281 977453 1046066 1180910 1191544
10383A191544q2236M5827K26887m1266j74324m82883k71288j8827L6182j63903
$$ 1191544 1109308 1155135 1382022 1340756 1166432 683549 412261 393434 429616 265713
10373B65713J70411K78667m6992p4652p5489k39233N34372O85164j12680k47752
$$ 265713 436124 714791 667799 593147 517658 278425 812797 1497961 1385281 1137529
10363A137529l6697k9985J38930l64240l06772R7997p0376j15869Q182L36542
$$ 1137529 1100832 1070847 1209777 845537 538765 636762 566386 450517 458699 795241
10353G95241K54228O1522o2674m4012L0821j59386J37292k40362j42428o1185
$$ 795241 1049469 1110991 1048317 1004305 1035126 875740 1013032 772670 630242 569057
10343E69057j56246N3655j708p161j93186n684M41337M68144k31932m58106J52599
$$ 569057 412811 466466 464758 457597 264411 258727 700064 1168208 936276 478170 630769
10332F30769L89484K65335j94897j93625k40496j88685j21861k31543j36831K49338
$$ 630769 1020253 1285588 1090691 897066 656570 467885 346024 114481 -22350 226988
10322B26988K12362J35242k31817j79978j65595J97140K81492j6340m69785j13190
$$ 226988 439350 574592 342775 162797 -2798 194342 475834 459494 -10291 -123481
10312a23481K10975L31589N7237m15300o9037L06336M17964K19704J69568N9361
$$ -123481 87494 419083 476320 61020 -8017 298319 716283 935987 1105555 1164916
10302A164916j18233L6418j49518j23424q2681k98258l21387Q6267L59086J03980
$$ 1164916 1046683 1083101 933583 810159 727478 429220 107833 194100 553186 657166
10292F57166J45842P0518M32608m8267j82093j48381j70652m07550J44370O8721
$$ 657166 803008 873526 1306134 1257867 1075774 927393 756741 349191 493561 562282
10282E62282k36491j00127J53309m6722j34175j05940J19731L17278L29325K0423
$$ 562282 325791 225664 378973 332251 198076 92136 211867 529145 858470 878893
10272H78893n2451M45380k39734m46268J09668J78239Q6412R7195l95770m38609
$$ 878893 826442 1271822 1032088 585820 695488 873727 960139 1057334 661564 222955
10262B22955Q9345p5138N5753J49075m8083m02509j45153j19733r980N96187J01513
$$ 222955 312300 237162 292915 441990 393907 -8602 -153755 -273488 -283468 312719 414232
10251D14232j8443K32245p3744p7965M33645j80611l86867k40501J84894j59468
$$ 414232 395789 628034 554290 476325 909970 729359 342492 101991 286885 127417
10241A27417l29902K73152J50970J12323J76545K70684j57887q7094J14402k74161
$$ 127417 -202485 70667 221637 333960 510505 781189 623302 536208 650610 376449
10231C76449n3048L9526L46356J58690j83463j21439L602l0798k7138M6136R2881
$$ 376449 323401 362927 709283 867973 684510 563071 566673 535875 508737 554873 647754
10220F47754j22721j2191J41155m2269J92949k84162j35782J03413M0825j17977
$$ 647754 525033 512842 653997 611728 804677 520515 384733 488146 528971 410994
10210D10994m547j20491k0512L2400j5837m60340q6323l4704k3841j70563P9040
$$ 410994 406447 285956 265444 297844 282007 -178333 -264656 -299360 -323201 -493764 -414724
10199d14724K6164N19448Q7245K20062J03600Q196k45988r4292J72736P9363r5243
$$ -414724 -388560 130888 218133 438195 541795 549991 304003 209711 382447 461810 366567
10188C66567J31531j47285L87539K02711J37965J75157L77914P8535K68086K73412
$$ 366567 498098 350813 738352 941063 1079028 1254185 1632099 1710634 1978720 2252132
10178B252132k24452l66165q6752n08379l32357j33069M8208L76525P00412J30186
$$ 2252132 2027680 1661515 1574763 1066384 734027 600958 649166 1025691 1726103 1856289
10168A856289N19612N25080q8976o97124m91885j84400L19802N93814o9233Q7569
$$ 1856289 2375901 2900981 2812005 2114881 1622996 1438596 1758398 2352212 2282979 2370548
10158B370548M67644j4511J6387Q1235q2606l22468m00672p6339p0277j34449
$$ 2370548 2838192 2823681 2840068 2921303 2838697 2516229 2115557 2039218 1968941 1834492
10148A834492l94459K25895N94016L25688K23334m5120j48961k75600p8191l16536
$$ 1834492 1440033 1665928 2259944 2585632 2808966 2763846 2614885 2339285 2261094 1944558
10138A944558p4147j62180j09910k49730j4885J85480m7055n2603K4987m56641
$$ 1944558 1870411 1708231 1598321 1348591 1333706 1519186 1472131 1419528 1444515 987874
10128I87874l61492N8378M8053R4521L0359k52217o3087J34546l65303r9907j51752
$$ 987874 626382 684760 732813 827334 857693 605476 542389 676935 311632 211725 59973
10117E9973k06556r6107J24190J68017N1879Q9250J85623J98890Q1880q1724k31435
$$ 59973 -146583 -242690 -118500 49517 101396 190646 376269 575159 657039 575315 343880
10106C43880l89645o2489K30180J55127L08923r8725m43056N6737O9540k36015
$$ 343880 -45765 -108254 121926 277053 585976 487251 44195 100932 170472 -65543
10096f5543J46174K0468P3074J32879l26177O1736q5228m1747k9130q8704j84164
$$ -65543 80631 101099 174173 307052 -19125 42611 -42617 -84364 -113494 -202198 -386362
10085c86362k34858N5530L93396J61216L438J0233L7865K03260K00049J37137
$$ -386362 -621220 -565690 -172294 -11078 -7640 2593 40458 243718 443767 580904
10075E80904p1177r8432n19453K21401q7515j65661K0426K06579L6824k1755R2818
$$ 580904 509727 411295 -108158 113243 25728 -139933 -119507 87072 123896 102141 194959
10064A94959O4228K08954K94817q9481n22412j19741L59180R7637k71622l9527
$$ 194959 259187 468141 762958 673477 151065 31324 390504 488141 216519 176992
10054A76992l16502K00724K71063n519n7046R5617j68256o9279L14016j05302
$$ 176992 -139510 61214 332277 326758 269712 365329 197073 127794 441810 336508
10044C36508j39947j08809j8996J19983j67016k71951j96987L51608L5350n7560
$$ 336508 196561 87752 68756 188739 21723 -250228 -447215 -95607 -60257 -117817
10034a17817K39956K18525O5488j26446j53403L90094K43481k34924j16040J19877
$$ -117817 122139 340664 406152 279706 126303 516397 759878 524954 408914 528791
10024E28791j2352j51881o2477j09035j23304j18703l90898J00557M71417M94540
$$ 528791 516439 364558 302081 193046 69742 -48961 -439859 -339302 132115 626655
10014F26655J83400o0329k97278o1902P382J22906k39121k67256R4131K04079
$$ 626655 810055 749726 452448 390546 397928 520834 281713 14457 108588 312667
10004C12667J2662o3377K29982K59506k56614m04700j39218J62826R6693q6232
$$ 312667 325329 261952 491934 751440 494826 90126 -49092 113734 210427 124195
9994A24195k29815J56722P4241J60137j34798j44965k22945J79191j86563q8823
$$ 124195 -105620 51102 125343 285480 150682 5717 -217228 -38037 -224600 -313423
9984c13423o227J88834J46967K17449r9910R4194q9581j77331L18073J55236k03847
$$ -313423 -319650 -130816 16151 233600 133690 227884 138303 -39028 279045 434281 230434
9973B30434L1831J69649o4437o1917j6143n4967M34955j10355q4455m08627l13316
$$ 230434 262265 431914 367477 305560 289417 234450 669405 559050 474595 65968 -247348
9962b47348J98470K63294N5354j21235j65553j33364k37273J72135K12592l0413
$$ -247348 -48878 214416 269770 148535 -17018 -150382 -387655 -215520 -2928 -33341
9952c3341R382J86276J38703P2573j23723q8856l0390L44587O5602o6794j37072
$$ -33341 -23959 162317 301020 373593 249870 161014 130624 475211 540813 474019 336947
9941C36947k00913r0172Q3489j35145m4477L50936K18855J5638m34140J8557M15852
$$ 336947 136034 45862 129351 -5794 -50271 300665 519520 535158 101018 119575 535427
9930E35427k20122m31617l23456j11240M750L9877K82368M43298p1259n7082j29188
$$ 535427 315305 -116312 -439768 -551008 -546258 -506381 -224013 219285 148026 90944 -38244
9919c8244k47019K54727j09829l3386r8452K58427M82127Q5960K17677l01876
$$ -38244 -285263 -30536 -140365 -173751 -272203 -13776 468351 554311 771988 470112
9909D70112m13368j02558L77l26202J99546K95728j79846O1291K30294o4097j58687
$$ 470112 56744 -45814 -45437 -371639 -172093 123635 -56211 5080 235374 171277 12590
9898A2590j25503j52475O5837L37907k3241l2351n2897j96907J09128m1901Q0681
$$ 12590 -112913 -265388 -199551 138356 115115 82764 29867 -167040 -57912 -99813 -19132
9887a9132K87624j04952j99077j71623q5583L87252L52003j84970k73565k23468
$$ -19132 268492 163540 -35537 -207160 -292743 94509 446512 261542 -12023 -235491
9877b35491q2581l089L43406J82364L4916j12256j99894j39628j14337L23813
$$ -235491 -318072 -321161 22245 204609 239525 127269 -72625 -212253 -326590 -2777
9867b777K28222q2320K6616P9071R8250J23713j07153j64577K27874K62029j71314
$$ -2777 225445 143125 169741 248812 347062 470775 363622 199045 426919 688948 517634
9856E17634m67086o2521k76631r8991J98428N8841J78412J1900J8078j07394P9593
$$ 517634 50548 -11973 -288604 -387595 -189167 -130326 48086 59986 78064 -29330 50263
9845E0263n2608P5502K72333K2882j40600J66091J42079J78988m3235r035p7444
$$ 50263 -2345 73157 345490 368372 227772 393863 535942 714930 671695 662660 585216
9834E85216j81055j15800k46397K65252J7357J33624o3648r0792l0260j7870o6040
$$ 585216 404161 288361 41964 307216 324573 458197 394549 303757 273497 255627 189587
9823A89587k40148j50225K21622K65003J80916o6950j64788l91682l9496J19562
$$ 189587 -50561 -200786 20836 285839 466755 399805 235017 -156665 -196161 -76599
9813g6599J75370o9943L87924K49001R872j71784j23463j31163P6031k41347J75866
$$ -76599 98771 28828 416752 665753 675625 503841 380378 249215 325246 83899 259765
9802B59765L10832j69915j76643k16892J48458k13915m73464k3075m9567j12598
$$ 259765 570597 400682 224039 7147 155605 -58310 -531774 -554849 -604416 -717014
9792g17014L82794N21050L03229N0365K86039j15714l84387l44114j46510j92134
$$ -717014 -334220 186830 490059 540424 826463 710749 326362 -17752 -164262 -356396
9782c56396M1382N08228q5847j59909O3382P9329K19635J43922n8342J6760m36040
$$ -356396 -315014 193214 107367 -52542 10840 90169 309804 453726 395384 412144 -23896
9771b3896k82817l6373L09841J79704j77505j73825K54471L02834n9316j77713
$$ -23896 -306713 -343086 -33245 146459 -31046 -204871 49600 352434 293118 115405
9761A15405M1622J42008n2915j25244k71072r5061M56333K42807N2743L6811l39467
$$ 115405 157027 299035 246120 120876 -150196 -245257 211076 453883 506626 543437 203970
9750B03970p0796K88027m456L8556k56241k9183k5339L44205K41868j80698n8660
$$ 203970 133174 421201 416745 455301 199060 169877 144538 488743 730611 549913 491253
9739D91253j34624l896k4485J75985j86809k18526J54844k2727L69220j18578
$$ 491253 356629 352733 328248 504233 317424 98898 253742 231015 600235 481657
9729D81657K3212J15523l38829k48703j84530O979M4234L3913N2989J00926K27552
$$ 481657 504869 620392 281563 32860 -151670 -144691 -100457 -66544 -13555 87371 314923
9718C14923J21321M852L5939K59798O1484m0927m12471j51756J42754p2774k21320
$$ 314923 436244 441096 477035 736833 798317 757390 344919 193163 335917 263143 41823
9707D1823j55752j26193K6307L02267j8196r1531K3400K07524j19558m19759J29091
$$ 41823 -113929 -240122 -213815 88452 70256 -21275 2125 209649 90091 -329668 -200577
9696b00577K48552J71392k03886J17870M2808j63560j59648p2613J45697K52305
$$ -200577 47975 219367 15481 133351 176159 12599 -147049 -219662 -73965 178340
9686A78340J26797k64172k05000l6621L24326L95851L5810l69412K52523K71885
$$ 178340 305137 40965 -164035 -200656 123670 519521 555331 185919 438442 710327
9676G10327l43216m48987o3676L07428J05295q8347j40214n7524K03979j13718
$$ 710327 367111 -81876 -145552 161876 267171 178824 38610 -18914 185065 71347
9666G1347j1273J10727p1280j84291l3097O2391k53066L45666M10227K25841J62058
$$ 71347 60074 170801 99521 -84770 -117867 -55476 -308542 37124 447351 673192 835250
9655H35250N79907R14710P65789l8954r94642j185645l20889p9027l52206l63499
$$ 835250 1415157 2329867 3095656 3056702 2062060 876415 555526 476499 124293 -239206
9645b39206J17052L96578j2363q2607J50945J45321k18840L35282j36287l48768
$$ -239206 -122154 274424 262061 179454 330399 475720 256880 592162 455875 107107
9635A07107J99155J14485k01125n5180j34968k37463L7125o0125K77549K59362
$$ 107107 306262 420747 219622 164442 29474 -207989 -170864 -230989 46560 305922
9625C05922k372J66053K44368l05003m26746j32414J91704M74735L2380j47250
$$ 305922 303550 469603 713971 408968 -17778 -150192 41512 516247 548627 401377
9615D01377k91185k49155P2907K77617j5455l53517J0181j31432r5985l31538
$$ 401377 110192 -138963 -66056 211561 196106 -157411 -147230 -278662 -374647 -706185
9605g06185N43657M002j45131j01310k5366K85537K47859j40813l08077k35550
$$ -706185 -162528 -158526 -303657 -404967 -430333 -144796 103063 -37750 -345827 -581377
9595e81377M14613q8941m9318Q4210L60381K19809K01098p7101j04081J11574
$$ -581377 -166764 -255705 -305023 -220813 139568 359377 560475 483374 379293 490867
9585D90867q2461k29953n691j31506J7624L05751L140j03398l65600k96930q8727
$$ 490867 408406 178453 172762 41256 58880 364631 367771 264373 -101227 -398157 -486884
9574d86884J75983J39332J73363j57306O7492r7436k68754J60363L15102O3907
$$ -486884 -310901 -171569 1794 -155512 -88020 -185456 -454210 -293847 21255 85162
9564H5162K07166K70030k4071o0546P4179k67426j87659L4111l04978l27923L16595
$$ 85162 292328 562358 538287 477741 551920 284494 96835 130946 -174032 -501955 -185360
9553a85360O05570J1891k63931k48367j36825K8492l0075k74848k2481K28705
$$ -185360 420210 432101 168170 -80197 -217022 -188530 -218605 -493453 -515934 -287229
9543b87229K02029r8589P0808K76442j30610l19638j37282K80612K29049j73705
$$ -287229 -85200 -183789 -112981 163461 32851 -286787 -424069 -143457 85592 -88113
9533h8113j95646K11193K61347L7646N875J56816J44852p1657l561l49635J37742
$$ -88113 -283759 -72566 188781 226427 232302 389118 533970 462313 458752 109117 246859
9522B46859m9550j38273K4117n5677k33254M19640L31144J88388j19711j55411
$$ 246859 197309 59036 83153 27476 -205778 213862 545006 733394 613683 458272
9512D58272j49415j7697J93519K57324J5384j23326N9424k53604l74302n03922
$$ 458272 308857 291160 484679 742003 757387 634061 693485 439881 65579 -438343
9502d38343J48186K06257J88465o3354O1486R9474j68550R5331o7740k09212J822
$$ -438343 -290157 -83900 104565 41211 102697 202171 33621 128952 61212 -148000 -146178
9491a46178J81606r3524o8074K6209p1653j79255M24479J36505M9700K32956q7672
$$ -146178 35428 -58096 -126170 -99961 -171614 -350869 73610 210115 259815 492771 405099
9480D05099l65293r516K67666m4186j92372l96624K0821K61977N0787j63855J07300
$$ 405099 39806 30290 297956 253770 61398 -335226 -314405 -52428 -1641 -165496 -58196
9469e8196N6785L07360L07491k08841m14541j44320k6610k32099J69306J18534
$$ -58196 -1411 305949 613440 404599 -9942 -154262 -180872 -412971 -243665 -125131
9459a25131k41351R9122J10976k46549j07791n753P7425J34707M4448J55685j03594
$$ -125131 -366482 -267360 -156384 -402933 -510724 -516477 -439052 -304345 -259897 -104212 -207806
9448b07806j31880R5868J97548l29062J07611P6869l48034K49148K74349n1060
$$ -207806 -339686 -243818 -46270 -375332 -267721 -190852 -538886 -289738 -15389 -66449
9438f6449j25407q6175L89405K52533j43489l08420l32726j87006K67006j3525
$$ -66449 -191856 -278031 111374 363907 220418 -88002 -420728 -607734 -340728 -354253
9428c54253J21968K52139K71713M7272Q9785j00354q7958L8319q8860l82736k50763
$$ -354253 -232285 19854 291567 338839 428624 328270 240312 278631 189771 -192965 -443728
9417d43728K09380K97799l69232J29235R4393Q7603J58105o0386K31609m9546
$$ -443728 -234348 63451 -305781 -176546 -82153 5450 163555 103169 334778 285232
9407B85232J2531L0720r237q8969q7470K35786o8941j13892J02304R5728J65383
$$ 285232 297763 328483 319246 230277 142807 378593 309652 195760 298064 393792 559175
9396E59175K0591k69599n7451j85861J35648j42224k27978r6418J16002j32808
$$ 559175 579766 310167 252716 66855 202503 60279 -167699 -264117 -148115 -280923
9386b80923j31779O5184L65449J41615N3471q6668K35216J92515N04281k15647
$$ -280923 -412702 -347518 17931 159546 213017 126349 361565 554080 1058361 842714
9376H42714m71497j65785L156K10282J01840k58108K0570O1365j87602K47117
$$ 842714 371217 205432 208588 418870 520710 262602 283172 344537 156935 404052
9366D04052R772J15644n39414k07060q5938K87799L96996J00869o0563k76102
$$ 404052 413824 529468 -9946 -217006 -302944 -15145 381851 482720 422157 146055
9356A46055q594J70887m81045j42402J57252l5294k03804l46501O45574M11297
$$ 146055 137461 308348 -172697 -315099 -157847 -193141 -396945 -743446 -97872 313425
9346C13425m395J24278j96371l04382l72766j79667J76184J18575K63884R658
$$ 313425 309030 433308 236937 -67445 -440211 -619878 -443694 -325119 -61235 -51577
9336e1577k90998J73751M18108R7600j46369n6775R7254J96428j30019k15788
$$ -51577 -342575 -168824 249284 346884 200515 143740 240994 437422 307403 91615
9326I1615q5058J2192K98309K69342J39628j75055k1711j48769k80964k12730
$$ 91615 6557 18749 317058 586400 726028 550973 529262 380493 99529 -113201
9316a13201Q6588R3883o3346L18632L30770k4926n7487j57935J08036J09309J0556
$$ -113201 -26613 67270 3924 322556 653326 628400 570913 412978 521014 630323 640879
9305F40879N5578m812j59772j47423o155O3420k42187k1032J98337O9882r6818
$$ 640879 696457 691645 531873 384450 378295 441715 199528 178496 376833 446715 349897
9294C49897l66247J56511K13672j7112l04403j46181P8346L954m1278J22589K39169
$$ 349897 -16350 140161 353833 336721 32318 -113863 -35517 -31563 -72841 49748 288917
9283B88917m7927N970M3991j3297O7929L28658k05225l16744k67726P899j52269
$$ 288917 240990 246960 290951 277654 345583 674241 469016 152272 -115454 -107555 -259824
9272b59824j86121J26562J05259M2714R3384j36071k29996N2835K36664K0566
$$ -259824 -445945 -319383 -214124 -171410 -78026 -214097 -444093 -391258 -154594 -134028
9262a34028K44336L9854J03758M735j04949p9415J71893k41080k81369R2129o034
$$ -134028 110308 150162 253920 258655 153706 74291 246184 5104 -276265 -184136 -190170
9251a90170N0430p1309k73423l06564J9290O0812r5314R0812j22643J6029K59229
$$ -190170 -139740 -211049 -484472 -791036 -771746 -710934 -806248 -715436 -838079 -822050 -562821
9240e62821K0535L10618J82313J60699k59540K2290M1251j8746J78289K73268
$$ -562821 -542286 -231668 -49355 111344 -148196 -125906 -84655 -103401 74888 348156
9230C48156k22941k72727q8034K26292N4244N0850K5807J11233k59632j75717
$$ 348156 125215 -147512 -235546 -9254 44990 95840 121647 232880 -26752 -202469
9220b02469L78953k0338k69306k07844J39633Q3591j30021j71105M56101K16654
$$ -202469 176484 156146 -113160 -321004 -181371 -97780 -227801 -398906 57195 273849
9210B73849n7812k21569l2799r9648J39248J16371m9114P7754j5343j56261n5486
$$ 273849 216037 -5532 -38331 -137979 1269 117640 68526 146280 130937 -25324 -80810
9199h0810j98388N5900J54480J14561o5964J06851O0058k36902L63645l09681
$$ -80810 -279198 -223298 -68818 45743 -20221 86630 146688 -90214 273431 -36250
9189c6250k28098p1268Q6830j8281J07534R7680j14269k59890r3194O3379M63825
$$ -36250 -264348 -335616 -248786 -267067 -159533 -61853 -176122 -436012 -529206 -465827 -2002
9178b002K81529J3759k1657j05705n2878R0332l02165k82194j36530R0898l2974
$$ -2002 279527 293286 271629 165924 113046 203378 -98787 -380981 -517511 -426613 -459587
9167d59587J19669J25505O0892J32850J57905J97784k18820q4616O9874l146j26876
$$ -459587 -339918 -214413 -153521 -20671 137234 335018 116198 31582 101456 98310 -28566
9156b8566n6571m83092j4016J95967N179J40083R1744k99832J35280k15053k62301
$$ -28566 -85137 -568229 -582245 -386278 -381099 -241016 -149272 -449104 -313824 -528877 -791178
9145g91178o6684K13778O1485M76966M64531M330o5355j31071K7323J36566j55169
$$ -791178 -857862 -644084 -582599 -105633 358898 363228 297873 166802 194125 330691 175522
9134A75522j3075J11873j04444j78453J59009j61732j12047P590p3199p9272J39315
$$ 175522 162447 274320 169876 -8577 150432 -11300 -123347 -115757 -188956 -268228 -128913
9123a28913j17961J83166K13795n8792j42349q4993k39821j39482r7200N6704
$$ -128913 -246874 -63708 150087 91295 -51054 -136047 -375868 -515350 -612550 -555846
9113e55846M60487J04800j49392J67342n3557q148m58565K7596L02819K60762
$$ -555846 -95359 9441 -139951 27391 -26166 -34314 -492879 -465283 -162464 98298
9103I8298L61112J09004j16422k79125k10860M3447K7479J45388P0969j80011
$$ 98298 459410 568414 451992 172867 -37993 5454 32933 178321 249290 69279
9093F9279l79900K41562M60189N9690j45268M2198J546J14777l13267j0600J62388
$$ 69279 -310621 -69059 391130 450820 305552 347750 349296 464073 150806 140206 302594
9082C02594k80912k42391K21503Q1614J75828J58308k32709j41245J11644Q3460
$$ 302594 21682 -220709 794 82408 258236 416544 183835 42590 154234 237694
9072B37694k53267N9200m654K61204o7474j43801o2558K06780J82916l099k23678
$$ 237694 -15573 43627 38973 300177 232703 88902 26344 233124 416040 412941 189263
9061A89263k15782k1564l4928l8728m2310p2854L19804j8174J39158l4004j15496
$$ 189263 -26519 -48083 -83011 -121739 -164049 -236903 82901 64727 203885 169881 54385
9050E4385O5262J57734L936j89912n7420J25604J91923j38528j74813j55997K11014
$$ 54385 119647 277381 281317 91405 33985 159589 351512 212984 38171 -117826 93188
9039I3188K59323M7759k97390Q9400N1964j66983J18658L19494k53636m73294
$$ 93188 352511 400270 102880 192280 244244 77261 195919 515413 261777 -211517
9029b11517k93941J74175L33281l54818j52664k37P9888K24254L20962J02625
$$ -211517 -505458 -331283 1998 -352820 -505484 -505721 -425833 -201579 119383 222008
9019B22008p9041k24274J4021P2417M1037J94727J68344j34343l60673K22248
$$ 222008 142967 -81307 -67286 5131 46168 240895 409239 274896 -85777 136471
9009A36471J38005p7529j01087j37276L35964j75614k56289M9361j20655K36219
$$ 136471 274476 196947 95860 -41416 294548 118934 -137355 -87994 -208649 27570
8999B7570J7945L1367K21877k77933m5537l8810j69365K41391P9114L27536k46164
$$ 27570 45515 76882 298759 20826 -24711 -63521 -232886 8505 87619 415155 168991
8988A68991l26715k16931j35126n6427K00929L43040N4362J5012N350K8976K17636
$$ 168991 -157724 -374655 -509781 -566208 -365279 -22239 32123 47135 52485 81461 299097
8977B99097O5599k1918k75988r0784n0460M6428l1803k7443L8397L4125R3874
$$ 299097 364696 342778 66790 -23994 -74454 -28026 -59829 -87272 -48875 -14750 79124
8966G9124j6539j52470k36967j86591M07085K87338k29379k21024j64335K08814
$$ 79124 62585 -89885 -326852 -513443 -106358 180980 -48399 -269423 -433758 -224944
8956b24944J29749k9029j69357K71036J31496n08621l5091q1887k07135k84409
$$ -224944 -95195 -124224 -293581 -22545 108951 -399670 -434761 -516648 -723783 -1008192
8946a008192K37473L10877j58689k2949J00169J48591k330k7098L00159J6204
$$ -1008192 -770719 -459842 -618531 -641480 -541311 -392720 -395050 -422148 -121989 -105785
8936a05785q3721K50976R6234k57595m3666L0070L50840j69068k16122j31812
$$ -105785 -189506 61470 157704 -99891 -143557 -113487 237353 68285 -147837 -279649
8926b79649j42845j05678r556K88523M14560l20528k3823j64555J01070K93984
$$ -279649 -422494 -528172 -537728 -249205 165355 -155173 -178996 -343551 -242481 51503
8916E1503J27095k80908j87309k12219J96059M91632j88264R1852J87496j65725
$$ 51503 178598 -102310 -289619 -501838 -305779 185853 -2411 89441 276937 111212
8906A11212K4587l2051K1996N7745k09456m497P6173q4665j34066J5454j04402
$$ 111212 135799 103748 125744 183489 -25967 -30464 45709 -38956 -173022 -157568 -261970
8895b61970j5793M3722K21124r6069K42430K46793j37715l89443k38311K66613
$$ -261970 -277763 -234041 -12917 -108986 133444 380237 242522 -146921 -385232 -118619
8885a18619J22140m2338J04357M22019r1509Q5463K70587l96338n80428Q3252
$$ -118619 3521 -38817 65540 487559 396050 481513 752100 355762 -224666 -141414
8875a41414J64383L8911K02365j16558n4814j36832l08670j30428l0082O8256
$$ -141414 22969 61880 264245 147687 92873 -43959 -352629 -483057 -513139 -444883
8865d44883M4534J98454K77771l076k18931n01601M04781L86706l50268j18304
$$ -444883 -400349 -201895 75876 72800 -146131 -647732 -242951 143755 -206513 -324817
8855c24817K32939K44783j68950j63133P3969K70896J81303j47674j85842L4682
$$ -324817 -91878 152905 -16045 -179178 -105209 165687 346990 199316 13474 48156
8845D8156M7390j43488j84357J88965J01074J74677j22322k07994K23977L23960
$$ 48156 95546 -47942 -232299 -43334 57740 232417 110095 -97899 126078 450038
8835D50038R1167k65324q538o5428k60860q1473j02121j70141O7067K77523J91686
$$ 450038 541205 275881 267343 201915 -58945 -140418 -242539 -412680 -345613 -68090 123596
8824A23596o8007l9889L57215K48201j90271k87284j6593j14013l00207k12286
$$ 123596 55589 15700 372915 621116 430845 143561 126968 12955 -287252 -499538
8814d99538l74305K22077L77297K30603J83294k89010k98634J00013M64022J23511
$$ -499538 -873843 -651766 -274469 -43866 139428 -149582 -448216 -348203 115819 239330
8804B39330J13846k21k30240j15862K44117p6446j8226Q5699k17361p0621N3303
$$ 239330 353176 352955 122715 6853 250970 174524 156298 241997 24636 -45985 7318
8793G318M7057j25240R8768J33488m3907k73791P7050K04035j39111j05142K12281
$$ 7318 54375 -70865 27903 161391 117484 -156307 -79257 124778 -14333 -119475 92806
8782I2806P2385k58218j87249J52501R0939j35661l51111K53006L86801K7262
$$ 92806 165191 -93027 -280276 -127775 -36836 -172497 -523608 -270602 116199 143461
8772A43461k9863j0108M315n01m0886J93117p3475Q8111J803j7272J2157M35239
$$ 143461 113598 103490 107805 107304 66418 259535 186060 274171 275974 258702 270859 706098
8760G06098J0653l69641r5545J70119k43945j7834m3156l00094L4267J36095j03169
$$ 706098 716751 347110 251565 421684 177739 159905 116749 -183345 -149078 -12983 -116152
8749a16152p2210K91129l898k00813m6423l93650J7848M82960J47861k80524J04581
$$ -116152 -188362 102767 98869 -101944 -148367 -542017 -524169 -41209 106652 -173872 -69291
8738f9291K8123k38368q2241P8940q2860n6792K50432L40281P1633n8196k96104
$$ -69291 -41168 -279536 -361777 -282837 -365697 -422489 -172057 168224 239857 181661 -114443
8727a14443K8984K508J4475M5773j04245p7693N5659O7478m7085L27978J55312
$$ -114443 -85459 -82951 -68476 -22703 -126948 -204641 -148982 -81504 -128589 199389 354701
8716C54701q1570k18764m82334j51961K17530j30749l13029k45131L52821N67689
$$ 354701 273131 54367 -427967 -579928 -362398 -493147 -806176 -1051307 -698486 -130797
8706a30797J04087k5020O7418Q8926Q5388l5864j31199K72521J44220k37795k62475
$$ -130797 -26710 -51730 15688 104614 190002 154138 22939 295460 439680 201885 -60590
8695f0590m7422N9717j7800J60953O4621L07738k11350L9795k66149j33941N3121
$$ -60590 -108012 -48295 -66095 94858 159479 467217 255867 295662 29513 -104428 -51307
8684e1307k41514j1579J2420m9877L98469O6249m9208N1348j03762K27133K74726
$$ -51307 -292821 -304400 -291980 -341857 56612 122861 73653 125001 21239 248372 523098
8673E23098j43775k00612j12311N717J60569K48801K45485p4787j40703q3694
$$ 523098 379323 178711 66400 72117 232686 481487 726972 652185 511482 427788
8663D27788n19455P1075L847k94848k02884M35797M4543j71177J35152R932k04006
$$ 427788 -91667 -20592 -16745 -311593 -514477 -78680 -34137 -205314 -70162 -60230 -264236
8652b64236K29462J67591N7475M8405j80j18263K6375j77129J40645K02610n86663
$$ -264236 -34774 132817 190292 238697 238517 120254 146629 -30500 110145 312755 -273908
8641b73908r9088J89516J54311k4563m10710L58555K11371k72054j386M1771M59504
$$ -273908 -372996 -183480 -29169 -53732 -464442 -105887 105484 -166570 -167956 -126185 333319
8630C33319K09040l35744k3593J75436j88282l18442J83672K05414J96093k61015
$$ 333319 542359 206615 183022 358458 170176 -148266 35406 240820 436913 175898
8620A75898q5706K46740o883l64302k23691K15753j81345J94387K75748K7769
$$ 175898 90192 336932 330049 -34253 -257944 -42191 -223536 -29149 246599 274368
8610B74368k45917L3146K20901K26753J76976J17620k52301J12796r5366J45209
$$ 274368 28451 61597 282498 509251 686227 803847 551546 664342 568976 714185
8600G14185Q286m76250j66289J82417O6974k81602k03097p0853r4899j05191p3986
$$ 714185 722471 246221 79932 262349 329323 47721 -155376 -226229 -321128 -426319 -500305
8589e00305j1522L30534J29796J6632J07264K67121K13805k59297n7419m8644
$$ -500305 -511827 -181293 -51497 -34865 72399 339520 553325 294028 236609 187965
8579A87965L249q7328l49382K1645J91791J37874L05221J43592l45912k45809
$$ 187965 191214 103886 -245496 -223851 -32060 105814 411035 554627 208715 -37094
8569c7094j74016K8216K3706J50170K56222K08201l48417j72533K61405J2049
$$ -37094 -211110 -182894 -159188 -9018 247204 455405 106988 -65545 195860 207909
8559B07909j83948J35954J31467K28716M0530j31510q9248l44729N9648N06912
$$ 207909 23961 159915 291382 520098 560628 429118 339870 -4859 54789 561701
8549E61701j11680k18673J4378K3212j26819j93613J50108J86058j61683l32332
$$ 561701 450021 231348 245726 268938 142119 -51494 98614 284672 122989 -209343
8539b09343J25687K72504J13470J84496L4495J81746j50603n7992k4968l76332
$$ -209343 -83656 188848 302318 486814 521309 703055 552452 494460 469492 93160
8529I3160k3665m33435k57804l6907P5729M34810J54336l26604k02984K2329J49593
$$ 93160 69495 -363940 -621744 -658651 -582922 -148112 6224 -320380 -523364 -501035 -351442
8518c51442N2106J96881J94528m2978j02976j62648N9577J43280J39926P3103
$$ -351442 -299336 -102455 92073 49095 -53881 -216529 -156952 -13672 126254 199357
8508A99357k39326J58159p6433m9634q6051M7060J78510P5522k26688m07074n8317
$$ 199357 -39969 118190 41757 -7877 -93928 -46868 131642 207164 -19524 -426598 -484915
8497d84915L38793j75635l66926J14501J49154L3442Q9953K54762J78835r6065
$$ -484915 -146122 -321757 -688683 -574182 -425028 -391586 -301633 -46871 131964 35899
8487C5899m5729p6537j3913j41713N0383L4365j42363K14824p6103l6641k21803
$$ 35899 -9830 -86367 -100280 -241993 -191610 -157245 -299608 -84784 -160887 -197528 -419331
8476d19331K14412J24285j86313k03145j51206K23096K09865N2972j68867n4117
$$ -419331 -204919 -80634 -266947 -470092 -621298 -398202 -188337 -135365 -304232 -358349
8466c58349K64011K8594j79941k138n9755J25740L1970j61309K52338J16836q8747
$$ -358349 -94338 -65744 -245685 -247823 -307578 -181838 -149868 -311177 -58839 57997 -30750
8455c0750K02451p7048p6093O8604m0709l0205Q3459J81940l8210k87011J37441
$$ -30750 171701 94653 18560 87164 46455 16250 99709 281649 243439 -43572 93869
8444I3869J01968N4736L27861k8513j83922L9993J37575J65002o4393k13218l34323
$$ 93869 195837 250573 578434 549921 365999 405992 543567 708569 644176 430958 96635
8433I6635J59958j29867k6044L09944J49845j96198p1245l9936k71957j99237
$$ 96635 256593 126726 100682 410626 560471 364273 293028 253092 -18865 -218102
8423b18102m4714L11039m0875O3182P2252K71137K19942J3888m5955l43762j56528
$$ -218102 -262816 48223 7348 70530 142782 413919 633861 647749 601794 258032 101504
8412A01504K33608O1375J86395L03375j84888m22005j19756K28278J74884j25711
$$ 101504 335112 396487 582882 886257 701369 279364 159608 387886 562770 437059
8402D37059j51936J1758M184l5136k00567J21493L33793l01191l61391j1383L6947
$$ 437059 285123 296881 301065 265929 65362 186855 520648 219457 -141934 -153317 -116370
8391a16370J2731P4421j30854k13931o2177J21201R2611J43376J10634K12137
$$ -116370 -103639 -29218 -160072 -374003 -436180 -314979 -222368 -78992 31642 243779
8381B43779p0941l6465J18709n5243j52309K15110O0984k11361k76159r1363L7963
$$ 243779 172838 136373 255082 199839 47530 262640 323624 112263 -163896 -255259 -217296
8370b17296J32233j71486r1644j96240K64517L62108Q9422j58879K9250J44929
$$ -217296 -85063 -256549 -348193 -544433 -279916 82192 171614 12735 41985 186914
8360A86914J24106M80923n1037k38624n7866k55918J0950K54224J22788l55220
$$ 186914 311020 791943 740906 502282 444416 188498 199448 453672 576460 221240
8350B21240k71370k82975j27708R3823L18795K42537L03688j08591m56414k71955
$$ 221240 -50130 -333105 -460813 -366990 -48195 194342 498030 389439 -66975 -338930
8340c38930j93336K25636L60042O9202N7980k14636n776K34549J88638l63814
$$ -338930 -532266 -306630 53412 122614 180594 -34042 -39818 194731 383369 19555
8330A9555j93831L7874L7269N753o6915r4615J07243M316p2616J10003Q1131J2287
$$ 19555 -174276 -136402 -99133 -93380 -160295 -254910 -147667 -143351 -215967 -105964 -24833 -12546
8318a2546j05399r7436j53715l19214Q4491J50772n1006n6197j11908L26245M84678
$$ -12546 -117945 -215381 -369096 -688310 -603819 -453047 -504053 -560250 -672158 -345913 138765
8307A38765r1830m70688L2653j88823K67973n0758J87473K38064j70485l4625
$$ 138765 46935 -423753 -391100 -579923 -311950 -362708 -175235 62829 -107656 -142281
8297a42281J23635J47252J02521k70425L9167K49620k4088j69491k15029j00545
$$ -142281 -18646 128606 231127 -39298 -131 249489 225401 55910 -159119 -259664
8287b59664Q9293j68122P6305j38612o2565O4157J70198J62699l4548j93272k703
$$ -259664 -170371 -338493 -262188 -400800 -463365 -399208 -229010 -66311 -100859 -294131 -296834
8276b96834R1622q4710j08531J6972J56441N0319K15139j07351j70622j56003
$$ -296834 -205212 -289922 -398453 -381481 -225040 -174721 40418 -66933 -237555 -393558
8266c93558O9551k13004j82402K72357N9675K76816O37995M9241p0729k42564
$$ -393558 -324007 -537011 -719413 -447056 -387381 -110565 527430 576671 505942 263378
8256B63378j27173j77106p2419J93254j4640J10889K39742j37018k69629j12133
$$ 263378 136205 -40901 -113320 79934 65294 176183 415925 278907 9278 -102855
8246a02855k20324K27529K68429j95488k73732k7042p7613J00733k01430j05955
$$ -102855 -323179 -95650 172779 -22709 -296441 -323483 -401096 -300363 -501793 -607748
8236f07748N0497m2932K34754L40812J80570p3659l64116P309j56914j39680n2382
$$ -607748 -557251 -600183 -365429 -24617 155953 82294 -281822 -274513 -431427 -571107 -623489
8225f23489m0250K1095O1784J79412K21854j32214k15656O4009K66502N2467N7338
$$ -623489 -663739 -642644 -580860 -401448 -179594 -311808 -527464 -463455 -196953 -144486 -87148
8214h7148k04688P0278P2606K12471L24326k58721k71844P1458L30781J45849
$$ -87148 -291836 -221558 -148952 63519 387845 129124 -142720 -71262 259519 405368
8204D05368l63631n42813n455K76273L60571j63066M3302k72602r9283j6973L38244
$$ 405368 41737 -501076 -506531 -230258 130313 -32753 10549 -262053 -361336 -378309 -40065
8193d0065m4431l36613p1305J06754L29393K61592k38309p4967L19418L26116
$$ -40065 -84496 -421109 -492414 -385660 -56267 205325 -32984 -107951 211467 537583
8183E37583Q5776N323q0208j20793k31159Q0577j42183l00566J69697K36128J94798
$$ 537583 623359 628682 548474 427681 196522 277099 134916 -165650 4047 240175 434973
8172D34973M2572k10747j25373j09384o2044j018k36566l00864j39561K30201
$$ 434973 477545 266798 141425 32041 -30003 -31021 -267587 -568451 -708012 -477811
8162d77811L55799J94902r476q5030j00737J28515l19463k06884K3308K15768
$$ -477811 -122012 72890 63414 -21616 -122353 6162 -313301 -520185 -496877 -281109
8152b81109j56187M51552M49694L0431N7747l47656j09602K05709j73488k95980
$$ -281109 -437296 14256 463950 494381 552128 204472 94870 300579 127091 -168889
8142a68889P7352j49938p0496k88490J72543J30725K29944R6485M6027k84636
$$ -168889 -91537 -241475 -311971 -600461 -427918 -297193 -67249 29236 75263 -209373
8132b09373k88303p1565K33584K76170r7667o0313R1082R6046N7554j54008J49558
$$ -209373 -497676 -569241 -335657 -59487 -157154 -217467 -126385 -30339 27215 -126793 22765
8121B2765N34703m7522k42270m76767l72538j54354K15545M79044j26036J6859
$$ 22765 557468 509946 267676 -209091 -581629 -735983 -520438 -41394 -167430 -150571
8111a50571J0323R4992q1444K81056k5311J53791j50858m25281J60177k4218k8414
$$ -150571 -140248 -45256 -126700 154356 129045 282836 131978 -293303 -133126 -157344 -185758
8100a85758K18402k03081l81499k77152O5743Q9457P3372J26691O4582L96689
$$ -185758 32644 -170437 -551936 -829088 -763345 -673888 -600516 -473825 -409243 -12554
8090a2554K10337k10399J72388j11568m44724p0297J18257K67108J53278k9957
$$ -12554 197783 -12616 159772 48204 -396520 -466817 -348560 -81452 71826 41869
8080D1869k00364N2946l9528O2273K92052R9367Q3495N9847j76186k3255j41107
$$ 41869 -158495 -105549 -145077 -82804 209248 308615 392110 451957 275771 252516 111409
8069A11409k03141m3585l1641j36712M0176k42563M3302J22598J1626k03343Q6366
$$ 111409 -91732 -135317 -166958 -303670 -263494 -506057 -462755 -340157 -328531 -531874 -445508
8058d45508N6363Q0367J87253j23534n9335P9746K40106k02574l83074m9226K95572
$$ -445508 -389145 -308778 -121525 -245059 -304394 -224648 15458 -187116 -570190 -619416 -323844
8047c23844L25812P1308k47869L28815M31511j62272m48274j13977K11612N98951
$$ -323844 1968 73276 -174593 154222 585733 423461 -24813 -138790 72822 671773
8037F71773K27529n2653k7351m72447l2903k46858l47999j56716P0424J58104
$$ 671773 899302 846649 819298 346851 313948 67090 -280909 -437625 -367201 -209097
8027b09097n9853l45662J6632L84086K08104k6637n299J01250m9678o6916R480
$$ -209097 -268950 -614612 -597980 -213894 -5790 -32427 -37726 63524 13846 -53070 -43590
8016d3590L64491J43647j67482p7725m0872k42558j45658p6283j96716M4056L39087
$$ -43590 320901 464548 297066 219341 178469 -64089 -209747 -286030 -482746 -438690 -99603
8005i9603K47642K19200j17502J07777p394k37675j43260K4208j81916K35861
$$ -99603 148039 367239 249737 357514 350120 112445 -30815 -6607 -188523 47338
7995D7338k4480j87284k14868J23178J84933j32161O7111M380l74211k35708J35472
$$ 47338 22858 -164426 -379294 -256116 -71183 -203344 -136233 -131853 -506064 -741772 -606300
7984f06300M89907o3272J25884K91467L0074j77531q500K1533j03820K083J24795
$$ -606300 -116393 -179665 -53781 237686 267760 90229 81729 103262 -558 1525 126320
7973A26320J00352k7820L046j48959k87091K13222j47205L09471K56582k05071
$$ 126320 226672 198852 201898 52939 -234152 -20930 -168135 141336 397918 192847
7963A92847k35809k23755M27266j33781j15471j09931M260L0581K00163J38674
$$ 192847 -42962 -266717 160549 26768 -88703 -198634 -194374 -163793 36370 175044
7953A75044r5959k79769k4485M56610K39224p4123L7974J09754J11105J0116l94537
$$ 175044 79085 -200684 -225169 231441 470665 396542 434516 544270 655375 665491 270954
7942B70954n3932L47703K46511j01417k75739p1323k2399l1012k41381j73249
$$ 270954 217022 564725 811236 709819 434080 362757 340358 309346 67965 -105284
7932a05284o1994r7365n542J42421Q1074P5361p4407J50769M23644k2758l01609
$$ -105284 -167278 -264643 -270185 -127764 -46690 28671 -45736 105033 528677 505919 204310
7921B04310l22940k03014j47680J80542O9815M8461J0842J34796j30188p5412
$$ 204310 -118630 -321644 -469324 -288782 -218967 -170506 -159664 -24868 -155056 -230468
7911b30468K2377j24458l16608P3194R4050J93818j38174J83772L14033J27280
$$ -230468 -208091 -332549 -649157 -575963 -481913 -288095 -426269 -242497 71536 198816
7901A98816j5024k81107j13209k43050n7195K64554K80649J23505j15129J6359
$$ 198816 183792 -97315 -210524 -453574 -510769 -246215 34434 157939 42810 59169
7891E9169J11822k45831Q2587K32956k46082k35052L7035Q4237J23468J1319k42456
$$ 59169 170991 -74840 7747 240703 -5379 -240431 -203396 -119159 4309 15628 -226828
7880b26828j59027J57148K15820J65958j68386j16547p6955J10933K47941j33448
$$ -226828 -385855 -228707 -12887 153071 -15315 -131862 -208817 -97884 150057 16609
7870A6609k77716J15051q140k45706O9743L63854R4884J65788M5248j31032M4249
$$ 16609 -261107 -146056 -154196 -399902 -330159 33695 128579 294367 339615 208583 252832
7859B52832J18156n72279k72097N0120M11297l5644K47112J33473m21060j19476
$$ 252832 370988 -201291 -473388 -423268 -11971 -47615 199497 332970 -88090 -207566
7849b07566k34789K83911P7287J43781J51984l0877k32085j46551n2768k21743
$$ -207566 -442355 -158444 -81157 62624 214608 183731 -48354 -194905 -247673 -469416
7839d69416k19550j26156K16967K98100j20490M4344L38389R5814k54473J76322
$$ -469416 -688966 -815122 -598155 -300055 -420545 -376201 -37812 58002 -196471 -20149
7829b0149K37969J75144L62603n1092m89865k90215q0016k03716L67424K20564
$$ -20149 217820 392964 755567 704475 214610 -75605 -155621 -359337 8087 228651
7819B28651J46689m9989l49760l83729j66465j97258J1053M29054R1279j53978
$$ 228651 375340 325351 -24409 -408138 -574603 -771861 -760808 -331754 -240475 -394453
7809c94453m7019L476K41203m8806J25073J59939j1718j49547J46596M08829m6045
$$ -394453 -441472 -437996 -196793 -245599 -120526 39413 27695 -121852 24744 433573 387528
7798C87528q7559l50041J38891O0200J23702n7129J72681J24291J66543k80233
$$ 387528 299969 -50072 88819 149019 272721 215592 388273 512564 679107 398874
7788C98874n25003k33363J22965J86438m1673m72144P2717M91884M7547J2362
$$ 398874 -126129 -359492 -236527 -50089 -91762 -563906 -491189 695 48242 60604
7778F0604L16911j73824k57354J73696k0080q1854k86610j73840K65074J32781
$$ 60604 377515 203691 -53663 120033 99953 18099 -268511 -442351 -177277 -44496
7768d4496M11570j48608L8609j08029l85711l76495r7873j05448J70813K758J96889
$$ -44496 367074 218466 257075 149046 -236665 -613160 -711033 -816481 -645668 -642910 -446021
7757d46021J93051P2901O5825J70594J60980j78704k03530j59907Q680L46157
$$ -446021 -252970 -180069 -114244 56350 217330 38626 -164904 -324811 -316131 30026
7747C0026k60227j44807L53657k4840m72286N3243o5296r4200J43646J93106K25870
$$ 30026 -230201 -375008 -21351 -46191 -518477 -465234 -530530 -624730 -481084 -287978 -62108
7736f2108J2508N7725M593k44759J52528J68713K85823J21245j45075l82146k80084
$$ -62108 -49600 8125 12718 -232041 -79513 89200 375023 496268 351193 -30953 -311037
7725c11037J08781M6662O0481n086j0440k30485k95390J34542k4221l7073k940
$$ -311037 -202256 -155594 -95113 -100199 -110639 -341124 -636514 -501972 -526193 -563266 -566206
7714e66206P6503M75016J24141L1932j14880j35957k68536j10573M67489p9402
$$ -566206 -489703 -14687 109454 141386 26506 -109451 -377987 -488560 -21071 -100473
7704a00473m6395K13066j01208J86036J23657k59325j70709J42347J04163j79079
$$ -100473 -146868 66198 -35010 151026 274683 15358 -155351 -13004 91159 -87920
7694h7920n659J33907n2271M4319j77865k35697j81334k7330L78162M97988M5381
$$ -87920 -93579 40328 -11943 32376 -145489 -381186 -562520 -589850 -211688 286300 331681
7683C31681m38274L2331K75265p9846k73569Q3359m436o4643j68399L50420M33719
$$ 331681 -106593 -74262 201003 121157 -152412 -69053 -73489 -138132 -306531 43889 477608
7672D77608r1909k86347j62932j15840K15565k98090N115L61188m60980j36533
$$ 477608 385699 99352 -63580 -179420 36145 -261945 -256830 104358 -356622 -493155
7662d93155k0205K11016L75559L04390O1846m64258l32707j83746l3100q3687
$$ -493155 -513360 -302344 73215 377605 439451 -24807 -357514 -541260 -574360 -658047
7652f58047J90208J47662R1122L8621k38793O3062L10097m3275j12192Q7338O8299
$$ -658047 -467839 -320177 -229055 -190434 -429227 -366165 -56068 -99343 -211535 -124197 -55898
7641e5898k55966o702N00398J83681o5854k13714n3k15438j46522J58087L84189
$$ -55898 -311864 -318566 181832 365513 299659 85945 85892 -129546 -276068 -117981 266208
7630B66208q3225l5882J22612J55583k98859j75236J65502J34678j17328k79177
$$ 266208 182983 147101 269713 425296 126437 -48799 116703 251381 134053 -145124
7620a45124n9572j95776N3164j43659j11820j94949L17903J16207j94497j3699
$$ -145124 -204696 -400472 -347308 -490967 -602787 -797736 -479833 -363626 -558123 -571822
7610e71822L23539M22510L95989J02563j54176l61582r5822K03152J28531M9262
$$ -571822 -248283 174227 570216 672779 518603 157021 61199 264351 392882 442144
7600D42144K59637j9678j08363m46229k12512L8023Q6878J53233O9740n407l8964
$$ 442144 701781 682103 573740 127511 -85001 -46978 39900 193133 262873 257466 218502
7589B18502j58102l20479j43150N5036J74414L44291m7082k9225J36033N6629
$$ 218502 60400 -260079 -403229 -348193 -173779 170512 123430 94205 230238 286867
7579B86867k09985j7939L4772J60311l69016j65655K2574k4075J56925j92115
$$ 286867 76882 58943 93715 254026 -114990 -280645 -258071 -282146 -125221 -317336
7569c17336l60432M87035j24606k15466L901L68124L01776K11339j369M51k42616
$$ -317336 -677768 -190733 -315339 -530805 -526904 -158780 142996 354335 352966 353417 110801
7558A10801j44998m9704r930L00491j4662l48546L599K53640k13094m078O29R0186
$$ 110801 -34197 -83901 -93831 206660 191998 -156548 -152949 100691 -112403 -116481 -115852 -25666
7546b5666P434J96353K84397j49938p1504R6149l44017j88927j78458M8627R9658
$$ -25666 -18232 178121 462518 312580 241076 337225 -6792 -195719 -374177 -325550 -225892
7535b25892l6941q832j17840J87037l5862O5677M843J12393J02179n35596k34618
$$ -225892 -262833 -271665 -389505 -202468 -238330 -172653 -167810 -55417 46762 -488834 -723452
7524g23452J82619K78578K51800J20409Q9757q2750J790p2499j00381j70593k18719
$$ -723452 -540833 -262255 -10455 109954 199711 116961 118751 46252 -54129 -224722 -443441
7513d43441j07790P2178n8520R8694K38798n1137j47256K41299K97482J36717
$$ -443441 -551231 -479053 -537573 -438879 -200081 -251218 -398474 -157175 140307 277024
7503B77024j3833N689J01595o1253J73134j57595j96586K9742r6465j48132R0504
$$ 277024 263191 268880 370475 309222 482356 324761 128175 157917 61452 -86680 3824
7492C824m7057k03996p2751O46309J70141J5225J6356Q4086k56093l50739n6L5813
$$ 3824 -43233 -247229 -319980 326329 496470 511695 528051 612137 356044 5305 5249 41062
7480D1062j04578j59365J14926L03103r4695n9319l85998L19538J87275j62538
$$ 41062 -63516 -222881 -107955 195148 100453 41134 -344864 -25326 161949 -589
7470e89m3498k11296p2370l0833o0984L45866R1612O0667n5587L3284m00001m04003
$$ -589 -44087 -255383 -327753 -358586 -419570 -73704 17908 78575 22988 56272 -343729 -747732
7458g47732K59457L03297K35384k08442O1572K4450k21631q08r2483R615J52076
$$ -747732 -488275 -184978 50406 -158036 -96464 -72014 -293645 -294453 -386936 -377321 -225245
7447b25245K51688j6305j29356j26891j01179n8088j92505L29621J31938q4280
$$ -225245 26443 10138 -119218 -246109 -347288 -405376 -597881 -268260 -136322 -220602
7437b20602p7961L3495j43713l58348m4131l969J11883J87461L25986J68225J57480
$$ -220602 -298563 -265068 -408781 -767129 -811260 -815229 -703346 -515885 -189899 -21674 135806
7426A35806K70836L25626q3900m50807k40434j12675j88011l2834O54849J09728
$$ 135806 406642 732268 648368 197561 -42873 -155548 -343559 -376393 278456 388184
7416C88184k61007j05273j38309l24141K07404j52762l61494L58355K92859m6528
$$ 388184 127177 21904 -116405 -440546 -233142 -385904 -747398 -389043 -96184 -142712
7406a42712j98812j2583J79790L90769J54839m62994j72814n3420j49679N8772
$$ -142712 -341524 -354107 -174317 216452 371291 -91703 -264517 -317937 -467616 -408844
7396d08844N01956J73306m56201n3660Q4094k79809m01236J13455K40880J97775
$$ -408844 93112 266418 -189783 -243443 -159349 -439158 -840394 -726939 -486059 -288284
7386b88284L29990N35100K18939l01685k47206k49047j16230Q8782R3654K1850
$$ -288284 41706 576806 795745 494060 246854 -2193 -118423 -29641 64013 85863
7376H5863J53170K766r0869r9679l27272k04538k8181L4544k8533K96809P3656
$$ 85863 239033 241799 150930 51251 -276021 -480559 -508740 -474196 -502729 -205920 -132264
7365a32264J9405k29488j5356J07663J24799o3910j28165R9085k1890L35696n201
$$ -132264 -112859 -342347 -357703 -250040 -125241 -189151 -317316 -218231 -240121 95575 90374
7354I0374j38917j10384k93761n8458K46766M8715l14680K45064K09794K18922
$$ 90374 -48543 -158927 -452688 -511146 -264380 -215665 -530345 -285281 -75487 143435
7344A43435j48972k98676L48610J69966l291j95775j49885L12817J34623j50893
$$ 143435 -5537 -304213 44397 214363 211072 15297 -134588 178229 312852 161959
7334A61959j36421p7461K83633p2677l40007K85349J87754j01071j71050l4934
$$ 161959 25538 -51923 231710 159033 -180974 104375 292129 191058 20008 -14926
7324a4926k95356r7607N40656J62551j76142m29070k44902M81596K23945l04478
$$ -14926 -310282 -407889 132767 295318 119176 -309894 -554796 -73200 150745 -153733
7314a53733K76013P5573L9851k0584L882n279q2966J7156j12498J89713P2712
$$ -153733 122280 197853 237704 217120 221002 215723 132757 149913 37415 227128 299840
7303B99840j07824j70525j53895k32533n4201L35648J81219n9147J54049n1182
$$ 299840 192016 21491 -132404 -364937 -419138 -83490 97729 38582 192631 141449
7293A41449j73563N8660k8180k49662k09778Q5461J12615J41188M46395J4035
$$ 141449 -32114 26546 -1634 -251296 -461074 -375613 -262998 -121810 324585 338620
7283C38620j06724J24686L72327L8572l90282m47765k65448j82161K7452q0816
$$ 338620 231896 356582 728909 767481 377199 -70566 -336014 -518175 -490723 -571539
7273e71539p8180K2158J69251J51590J00725j11394p906K4053J80767k8834m8619
$$ -571539 -649719 -627561 -458310 -306720 -205995 -317389 -325295 -301242 -120475 -149309 -197928
7262a97928l98108Q138J65270N2864J90626K52471j67738k41812J17090J4129
$$ -197928 -596036 -587898 -422628 -369764 -179138 73333 -94405 -336217 -219127 -204998
7252b04998J35208K06820j7432j06014K8839M8018k9008j49759r5341J8640M10326
$$ -204998 -69790 137030 119598 13584 42423 90441 61433 -88326 -183667 -165027 245299
7241B45299J65977J6675l92260j56072k62930K72408K92151j8286k80675k94204
$$ 245299 411276 427951 35691 -120381 -383311 -110903 181248 162962 -117713 -411917
7231d11917J39809p4567J35718n5306K13238j96368K016N11271N9361l62554k62143
$$ -411917 -272108 -346675 -210957 -266263 -53025 -249393 -247377 263894 323255 -39299 -301442
7220c01442j75980l8906J91026J84397O7776j85313o3023l31366J11413M14512
$$ -301442 -477422 -516328 -325302 -140905 -73129 -258442 -321465 -652831 -541418 -126906
7210a26906K21574l97339j97362J12723K43050R9053J22551k51714j0669O4988
$$ -126906 94668 -302671 -500033 -387310 -144260 -45207 77344 -174370 -185039 -120051
7200a20051m13M34094Q0084l88154k708j09044J31233K5732j03745K6479Q829
$$ -120051 -120464 313630 393714 5560 2852 -106192 25041 50773 -52972 -26493 -17664
7189a7664K11531m6237j44154J13110j64862N8933J83991j28692J05431j98439
$$ -17664 193867 147630 3476 116586 -48276 10657 194648 65956 171387 -27052
7179b7052J11313k3228k90197N8237K23980O1282K60795k78117k55680K14096
$$ -27052 84261 61033 -229164 -170927 53053 114335 375130 97013 -158667 55429
7169E5429k45991l1244J72282J96942p0663L919j20076l12883j65498j01579K81298
$$ 55429 -190562 -221806 -49524 147418 76755 80674 -39402 -352285 -517783 -619362 -338064
7158c38064N75367L83708j09412m20468j77318L0761K3904j4111j04009K68134
$$ -338064 237303 621011 511599 91131 -86187 -55426 -31522 -45633 -149642 118492
7148A18492J42160J70256j56682k31725l17756J1587j52280j31150J79564O2703
$$ 118492 260652 430908 274226 42501 -275255 -263668 -415948 -547098 -367534 -304831
7138c04831j32555N2387l8121M7924K15590J67681l22688o5010N36542K00016
$$ -304831 -437386 -384999 -423120 -375196 -159606 8075 -314613 -379623 156919 356935
7128C56935O1376k44928o4010L65954Q339l11331l91351j75140J12048N4037K12010
$$ 356935 418311 173383 109373 475327 483666 172335 -219016 -394156 -282108 -228071 -16061
7117a6061M10554K8229q4471J73852j12685k63297k65185n6391m0121o1455j1029
$$ -16061 394493 422722 338251 512103 399418 136121 -129064 -185455 -225576 -287031 -298060
7106b98060J24391J45198m34418n8754R5494l54625L4581N6278k7108K87581J51897
$$ -298060 -173669 -28471 -462889 -521643 -426149 -780774 -746193 -689915 -717023 -429442 -277545
7095b77545m0240k29119K74543J14181J73049J44844Q1798M3725j17042k35938
$$ -277545 -317785 -546904 -272361 -158180 14869 159713 241511 285236 168194 -67744
7085f7744J71430j25002n28225j00524J65618K90357K96704l22281k21314K30066
$$ -67744 103686 -21316 -549541 -650065 -484447 -194090 102614 -219667 -440981 -210915
7075b10915J60471L8771j7196K05446l1722k64482j57341M08322K12646j70462
$$ -210915 -50444 -11673 -28869 176577 144855 -119627 -276968 131354 344000 173538
7065A73538k51941k62891J11277J44242n0581Q5488k0904j17345k10171K30362
$$ 173538 -78403 -341294 -230017 -85775 -136356 -50868 -71772 -189117 -399288 -168926
7055a68926K63393L66245J03828N681k58075l25267k68108L24674L10838j75885
$$ -168926 94467 460712 564540 570221 312146 -13121 -281229 43445 354283 178398
7045A78398k41379j28018J05473O1263J75838K43582J40658m46791k77132J27127
$$ 178398 -62981 -190999 -85526 -24263 151575 395157 535815 89024 -188108 -60981
7035f0981R8412l37899l78463R90J1597K98456J68186J34730L04315P7881k45082
$$ -60981 37431 -300468 -678931 -677941 -666344 -367888 -199702 -64972 239343 317224 72142
7024G2142k27409j97186J3932K34742R2814k5494R598J58250q9815l16242K9062
$$ 72142 -155267 -352453 -338521 -103779 -10965 -36459 -26861 131389 41574 -274668 -245606
7013b45606k45885J05253j13101K905J83025K54093M03183k97176J28433j94268
$$ -245606 -491491 -386238 -499339 -496434 -313409 -59316 343867 46691 175124 -19144
7003a9144j00627L01489j39707q413J13344j60007k72197J52747J80320m287K80286
$$ -19144 -119771 181718 42011 33598 146942 -13065 -285262 -132515 47805 43518 323804
6992C23804o8757k63603r6564J94019K99209k05445l71875K12541K57694K20082
$$ 323804 255047 -8556 -105120 88899 388108 182663 -189212 23329 281023 501105
6982E01105J1203j79984l58463k74462n35101J84046N01515J84615l6771n8056
$$ 501105 512308 332324 -26139 -300601 -835702 -651656 -150141 34474 -2297 -60353
6972f0353J79613n5726j97683K028K40697k30734j03011J29971J27497j28513
$$ -60353 119260 63534 -134149 -132121 108576 -122158 -225169 -95198 32299 -96214
6962i6214j61081n39537j01869J98163K76769J90035j68883n1620J59453n4490
$$ -96214 -257295 -796832 -898701 -700538 -423769 -233734 -402617 -454237 -294784 -349274
6952c49274k35365j13174J08121Q6534J6849L26714J51802j72365J83192j050
$$ -349274 -584639 -697813 -589692 -503158 -486309 -159595 -7793 -180158 3034 1984
6942A984K09863k39799j50273L1469l54073l25682M85002L93293o7268l50127
$$ 1984 211847 -27952 -178225 -146756 -500829 -826511 -341509 51784 -15484 -365611
6932c65611M0046J32815L9192o774k86125o5725J57771Q7565K34123K22974j82124
$$ -365611 -325565 -192750 -153558 -160332 -446457 -512182 -354411 -266846 -32723 190251 8127
6921H127k52798l46744q6795k395M09536L33455m904k70738L6200P643R6772K85474
$$ 8127 -244671 -591415 -678210 -680605 -271069 62386 57482 -213256 -177056 -169413 -72641 212833
6909B12833k94758j0030k8443n5617j1379l65144J62853J06092L04760J18736
$$ 212833 -81925 -91955 -120398 -176015 -187394 -552538 -389685 -283593 21167 139903
6899A39903j11629J5621K2560J47471m6706k85652M7621J10612j7924k06157k62888
$$ 139903 28274 43895 66455 213926 167220 -118432 -70811 39801 21877 -184280 -447168
6888d47168J23012P8446O0863O3352k84436K7056j02314j3547m9261k3893R0251
$$ -447168 -324156 -245710 -184847 -121495 -405931 -378875 -481189 -494736 -543997 -567890 -477639
6877d77639J21526p8542j42658l4249N3533J81920k4486K48663q2790q4184M94036
$$ -477639 -356113 -434655 -577313 -611562 -558029 -376109 -400595 -151932 -234722 -318906 175130
6866A75130k8880n07833j20521J23081J44084L7571j15904n7096N6486L16825
$$ 175130 146250 -361583 -482104 -359023 -214939 -177368 -293272 -350368 -293882 22943
6856B2943J02070k94166j33569j37664L52610Q6564J30134l16327L7642K22894
$$ 22943 125013 -169153 -302722 -440386 -87776 -1212 128922 -187405 -149763 73131
6846G3131M9493J11252k04337j34352J91063m9334k06504o631L83393K11914r4351
$$ 73131 122624 233876 29539 -104813 86250 36916 -169588 -176219 207174 419088 324737
6835C24737j38295l9665J56256J38814L8604k25200j71733M6998k21752K5012
$$ 324737 186442 146777 303033 441847 480451 255251 83518 130516 -91236 -66224
6825f6224K03173j5187p0709j22239k09691J0417k81028J08107L00889n6837k59160
$$ -66224 136949 121762 51053 -71186 -280877 -270460 -551488 -443381 -142492 -199329 -458489
6814d58489J94863J81362M29070r3714p1378r9640J63559K51421k29397m48068
$$ -458489 -263626 -82264 346806 253092 181714 82074 245633 497054 267657 -180411
6804a80411j80700J33035j43196q5222R1064q7560J25424P0382K05628K44920
$$ -180411 -361111 -228076 -371272 -456494 -365430 -452990 -327566 -257184 -51556 193364
6794A93364k52707L3758M41038k9782J10061k91685l69682q2990J45599m4711
$$ 193364 -59343 -25585 415453 385671 495732 204047 -165635 -248625 -103026 -147737
6784a47737p2241J4736j70741K78526r5687m16138l8330K93587L6715j42939P2754
$$ -147737 -219978 -205242 -375983 -97457 -193144 -609282 -647612 -354025 -317310 -460249 -387495
6773c87495L59951R7069j51739j0968j6199J77647N7354J4355q1779j66861j76403
$$ -387495 -27544 69525 -82214 -93182 -109381 68266 125620 139975 58196 -108665 -285068
6762b85068j84194K22600n4349L85431O16153k2694Q7588k26400m15570n54186
$$ -285068 -469262 -246662 -301011 84420 700573 677879 765467 539067 123497 -430689
6752d30689K04044J38218J93038k3956L4980Q2316J15465k9402k50200k78122
$$ -430689 -226645 -88427 104611 80655 115635 197951 313416 284014 33814 -244308
6742b44308R309K9728l7512O0235L16092J78721k14592r3951K13587P5943J08984
$$ -244308 -234999 -205271 -242783 -182548 133544 312265 97673 3722 217309 293252 402236
6731D02236q375j92142l19968J52496L82095m6133k89264l11377j9157K36718
$$ 402236 393861 201719 -118249 34247 416342 370209 80945 -230432 -249589 -12871
6721a2871k86450J22624l2504K8158L48253J47554m51684l93111j72774J66777
$$ -12871 -299321 -176697 -209201 -181043 167210 314764 -136920 -530031 -702805 -536028
6711e36028J91574J658o6022l8083J31945K57663K16946p2366K04980j37347k85909
$$ -536028 -344454 -342796 -408818 -446901 -314956 -57293 159653 87287 292267 154920 -130989
6700a30989J4657K88119J20055m62429r2046J29642P3182K66600K69067J66226
$$ -130989 -116332 171787 291842 -170587 -262633 -132991 -59809 206791 475858 642084
6690F42084j13282m15486p3405J24771j76289m95694N7582J36648Q4284K09415
$$ 642084 528802 113316 39911 164682 -11607 -507301 -449719 -313071 -228787 -19372
6680a9372K24800k14017k43128J97176p7439R7124N8532R6121L3056l26250O1398
$$ -19372 205428 -8589 -251717 -54541 -131980 -34856 23676 119797 152853 -173397 -111999
6669a11999K56021k70732j13340q4718O5443R1417k21692N6254J30289l16613
$$ -111999 144022 -126710 -240050 -324768 -259325 -167908 -389600 -333346 -203057 -519670
6659e19670J55360N5330k77561P3526j711n6042K74332M52152o5607o2102k14045
$$ -519670 -364310 -308980 -586541 -513015 -514726 -570768 -296436 155716 90109 28007 -186038
6648a86038J56980J85052J9543j92282l20150l68369j49015M39656K17607J93972
$$ -186038 -29058 155994 175537 -16745 -336895 -705264 -854279 -414623 -197016 -3044
6638c044o6053o4821K04032J14540J54151J19779j49785j04412j13609K58079
$$ -3044 -69097 -133918 70114 184654 338805 458584 308799 204387 90778 348857
6628C48857k77688o1983K29850j16033K03206J69092k75959j04205J41900O6136
$$ 348857 71169 9186 239036 123003 326209 495301 219342 115137 257037 323173
6618C23173k86457r483J87984k13695l86124j27011k6271K05256L04648J77810
$$ 323173 36716 27233 215217 1522 -384602 -511613 -537884 -332628 -27980 149830
6608A49830j67349k82699K06099K98639K42028K3825l83543j91048M310O0144
$$ 149830 -17519 -300218 -94119 204520 446548 470373 86830 -104218 -99908 -39764
6598c9764l8651k80192j63383N0944j10392J33568r5988J07168Q3400J81651J8223
$$ -39764 -78415 -358607 -521990 -471046 -581438 -447870 -543858 -436690 -353290 -171639 -153416
6587a53416o6083J4175K32971j02771m07278o31774J49254L22648J16016J04381
$$ -153416 -219499 -205324 27647 -75124 -482402 -1114176 -964922 -642274 -526258 -421877
6577d21877J90013k8551Q4896J97345R0659R6428k80082j77529J40722m5376K46
$$ -421877 -231864 -260415 -175519 21826 112485 208913 -71169 -248698 -107976 -153352 -153106
6566a53106K38306K89450m9375J89261j69086m20252J42090k2503L8179j37899
$$ -153106 85200 374650 325275 514536 345450 -74802 67288 44785 82964 -54935
6556e4935j72579J83896j54778j55825N9923p8392K96568R4336P7774J44313j84253
$$ -54935 -227514 -43618 -198396 -354221 -294298 -372690 -76122 18214 95988 240301 56048
6545E6048k39475N9802k04770m15849J16117L91220M19751L50525l95844k72865
$$ 56048 -183427 -123625 -328395 -744244 -628127 -236907 182844 533369 137525 -135340
6535a35340J87739k29764j35511K70584k8014R2362J80527K5676k72494j60625
$$ -135340 52399 -177365 -312876 -42292 -70306 22056 202583 228259 -44235 -204860
6525b04860M3270K3508N6525j03716j196P2Q2411J06796R6292m9555q9655j5074
$$ -204860 -161590 -138082 -81557 -185273 -186469 -186397 -103986 2810 99102 49547 -40108 -55182
6513e5182J38619J55939j49580l18619l15142J56891J48514J19586K34397m6556
$$ -55182 83437 239376 89796 -228823 -543965 -387074 -238560 -118974 115423 68867
6503F8867j45443j33M7044J82306L0521k1133r7629j56536P0633R2779P8135p8421
$$ 68867 -76576 -76709 -29665 152641 183162 162029 64400 -92136 -21503 71276 149411 70990
6491G0990l79513k25884K1097J95314k20570k4821J76165J53809L41923L9947
$$ 70990 -308523 -534407 -513310 -317996 -538566 -563387 -387222 -233413 108510 148457
6481A48457l40761m38545O6128J75364p0622K72447K18854k26651l78877K10658
$$ 148457 -192304 -630849 -564721 -389357 -459979 -187532 31322 -195329 -574206 -363548
6471c63548L75743k35231q3310L63375Q5706q8990k42212r8k00149l9459j37626
$$ -363548 12195 -223036 -306346 57029 142735 53745 -188467 -188565 -388714 -428173 -565799
6460e65799K9007K60641L62009l5779j06582q0513j1522q1802Q6685J95960j17344
$$ -565799 -536792 -276151 85858 50079 -56503 -137016 -148538 -230340 -143655 52305 -65039
6449f5039N7716m6554K43785J13523N9892j75500k60618J61855O6205j23332j66379
$$ -65039 -7323 -53877 189908 303431 363323 187823 -72795 89060 155265 31933 -134446
6438a34446j11567j05262J77314n6545j64879k0743N3817M795j67299k58750k04260
$$ -134446 -246013 -351275 -173961 -230506 -395385 -416128 -362311 -357516 -524815 -783565 -987825
6427i87825j55769J1350M55145N69142n5869j79299J87434J07224l70788m62627
$$ -987825 -1143594 -1132244 -677099 -107957 -163826 -343125 -155691 -48467 -419255 -881882
6417h81882R5254K45210M24119k307K34689Q564k23770j39362J36807q2437J43968
$$ -881882 -786628 -541418 -117299 -119606 115083 123647 -100123 -239485 -102678 -185115 -41147
6406d1147K80436j37205j17602N45k52120R1291L51534R0918m00314k24542j93176
$$ -41147 239289 102084 -15518 -14973 -267093 -175802 175732 266650 -133664 -358206 -551382
6395e51382P4213J32403J01621J44699J02397J21001N4268q7899j28884k76843
$$ -551382 -477169 -344766 -243145 -98446 3951 124952 179220 91321 -37563 -314406
6385c14406q9502K37954K84900j27962j96121j28193n6295k16525M48212o2482
$$ -314406 -403908 -165954 118946 -9016 -205137 -333330 -389625 -606150 -157938 -220420
6375b20420j78280L5J65194L2929J7713K54653p3712Q655L35271K1638k35421
$$ -220420 -398700 -398665 -233471 -200542 -182829 71824 -1888 6767 342038 363676 128255
6364A28255j87573K36294l3619O7954K2913k73865j75590J1334K82714j31481
$$ 128255 -59318 176976 143357 211311 234224 -39641 -215231 -203897 78817 -52664
6354e2664n7504O8470Q5752K95721P7894R8436p8524j58046k92798l4051J38330
$$ -52664 -110168 -41698 44054 339775 417669 516105 437581 279535 -13263 -47314 91016
6343I1016j16925Q9221K92997j46304L2383J8579l77341j60975K65659J13427
$$ 91016 -25909 63312 356309 210005 242388 260967 -116374 -277349 -11690 101737
6333A01737J20230K9710j958L79881j77188l30946k95398J28152J46062j45594
$$ 101737 221967 251677 249719 629600 452412 121466 -173932 -45780 100282 -45312
6323d5312j21762q4958K07721j14558J40401M39666k52726l2211J34098j48887
$$ -45312 -167074 -252032 -44311 -158869 -18468 421198 168472 136261 270359 121472
6313A21472n36742j46486O6125J00724J81244J19623m9872j23679k55910M8548
$$ 121472 -415270 -561756 -495631 -394907 -213663 -94040 -143912 -267591 -523501 -474953
6303d74953j60735K30669J23114J29565J34820K74677L6403q1914M4773j05004
$$ -474953 -635688 -405019 -281905 -152340 -17520 257157 293560 211646 256419 151415
6293A51415l35917J07914N3871J00774j95305l92157K8837L75901P9548l68738
$$ 151415 -184502 -76588 -22717 78057 -117248 -509405 -480568 -104667 -25119 -393857
6283c93857J9541P2139L44373N5364o7236J2647k11500j03388k07262K05419K52011
$$ -393857 -374316 -302177 42196 97560 30324 42971 -168529 -271917 -479179 -273760 -21749
6272b1749L59525M0544m87527l09679K20759K64690j38463j31708P6330O6009
$$ -21749 337776 378320 -109207 -418886 -198127 66563 -71900 -203608 -127278 -61269
6262f1269k08221j88358O348j5228o7332m3862M38823Q855J40954Q8969k74741
$$ -61269 -269490 -457848 -451500 -466728 -534060 -577922 -139099 -130244 10710 99679 -175062
6251a75062R315k48714J47448J09259q9750l2037j75535l59361M6037M76368J30880
$$ -175062 -165747 -414461 -267013 -157754 -247504 -279541 -455076 -814437 -768400 -292032 -161152
6240a61152k61528J1055L44375k57177j95325J10387M61960L79546k98356l71393
$$ -161152 -422680 -411625 -67250 -324427 -519752 -409365 52595 432141 133785 -237608
6230b37608L16033N1668l98372Q6294J33737j12545J1427J41764K69913J67867
$$ -237608 78425 130093 -268279 -181985 -48248 -160793 -149366 -7602 262311 430178
6220D30178J58648m5096k39589j05143j60975m3063K07839N9021k96150l88998
$$ 430178 588826 543730 304141 198998 38023 -5040 202799 261820 -34330 -423328
6210d23328J62832Q6391J12253j07367J06126K99697R8766l13992j2467K2819
$$ -423328 -260496 -174105 -61852 -169219 -63093 236604 335370 21378 8911 31730
6200C1730J28959k13082n4134J54951K95855K47131O6226k34451l39268l48607
$$ 31730 160689 -52393 -106527 48424 344279 591410 657636 423185 83917 -264690
6190b64690J8046r6683j7452K00438J93124K70519J26839m63859P2569m695r6559
$$ -264690 -246644 -343327 -360779 -160341 32783 303302 430141 -33718 38851 34156 -62403
6179f2403J21278l72911k39675K00314k3992Q2686p407J31253L23025R1591k30465
$$ -62403 58875 -314036 -553711 -353397 -377389 -294703 -302110 -170857 152168 243759 13294
6168A3294p3627J50213k28765k72995K30348p3558k20875J65408q3104j28785
$$ 13294 -60333 89880 -138885 -411880 -181532 -255090 -475965 -310557 -393661 -522446
6158e22446R1692L24999j28581l21434m04398j22629J42098R3066q2278K35769
$$ -522446 -430754 -105755 -234336 -555770 -960168 -1082797 -940699 -847633 -929911 -694142
6148f94142M8611n4096m4173M43048L88585K3001N0156J17229J54094K22516K6551
$$ -694142 -645531 -699627 -743800 -300752 87833 110834 160990 278219 432313 654829 681380
6137F81380k55422k50478m8637J95572n77171j22198K92555L08517L21516k32843
$$ 681380 425958 175480 126843 322415 -254756 -376954 -84399 224118 545634 312791
6127C12791l25119L0124j34667J50029P5700J59977r9742j41746j33446k11604
$$ 312791 -12328 17796 -116871 33158 108858 268835 169093 27347 -106099 -317703
6117c17703O2542k60433J31464L39432K74635k16944l0780M7898j98467J89056
$$ -317703 -255161 -515594 -384130 -44698 229937 12993 -17787 30111 -168356 20700
6107B0700K8868R2149M8701k06415k60319j39361J30053j75821J32569K21148
$$ 20700 49568 141717 190418 -15997 -276316 -415677 -285624 -461445 -328876 -107728
6097a07728J91127K85713K6464k29843o27795j02693r4228J95869J13683K3345
$$ -107728 83399 369112 395576 165733 -462062 -564755 -658983 -463114 -349431 -326086
6087c26086j97792J22218L0391p3591L31152K66312j00559j8384O8921q0770P8334
$$ -326086 -523878 -401660 -371269 -444860 -113708 152604 52045 33661 102582 21812 100146
6076A00146K48347j0251l27670l20283q9209K30842j7250l69603O6962K11295
$$ 100146 348493 338242 10572 -309711 -398920 -168078 -185328 -554931 -487969 -276674
6066b76674r9941Q5221J56128K83415l368n51952K504R8821L99134k42273l38131
$$ -276674 -376615 -291394 -135266 148149 144781 -407171 -404667 -305846 93288 -148985 -487116
6055d87116L1525J39897k37082k16357Q6557K87511J86596k95669j15104L92537
$$ -487116 -455591 -315694 -552776 -769133 -682576 -395065 -208469 -504138 -619242 -226705
6045b26705K87672k56326k59538k14182L61603P9031k28741O9396K06622J56784
$$ -226705 60967 -195359 -454897 -669079 -307476 -228445 -457186 -387790 -181168 -24384
6035b4384R8p024K91176k66638m25308k49047J31775L071L4354K97861j91749
$$ -24384 -24286 -31310 259866 -6772 -432080 -681127 -549352 -546281 -511927 -214066 -405815
6024d05815j92331K20472N22044K02253j342J66229M8024o4912J66033l02721
$$ -405815 -598146 -377674 144370 346623 345281 511510 559534 494622 660655 357934
6014C57934J8693R9264K8444j02025n09168j22625M79933R8999k39985k81720
$$ 357934 376627 475891 504335 402310 -106858 -229483 250450 349449 109464 -172256
6004a72256k80934J30439J89602o9304k9722K2836J77407k03887j66481K6474
$$ -172256 -453190 -322751 -133149 -202453 -232175 -209339 -31932 -235819 -402300 -375826
5994c75826L5900n24757j44603L99672M45094J15133k7166j70514j77670J18735
$$ -375826 -339926 -864683 -1009286 -609614 -164520 -49387 -76553 -247067 -424737 -306002
5984c06002j10082J85997M04935K57891N2797j98524k42981L59667j61509j09947
$$ -306002 -416084 -230087 174848 432739 485536 287012 44031 403698 242189 132242
5974A32242k33582j95357L1087l9252k70982M1589K45626J71912K15138J01999
$$ 132242 -101340 -296697 -265610 -304862 -575844 -534255 -288629 -116717 98421 200420
5964B00420j74676l39673P1435M69451J26396j38278m25879j4114j1500R5201
$$ 200420 25744 -313929 -242494 226957 353353 215075 -210804 -224918 -236418 -141217
5954a41217L23158j00795J2827j35966k68810Q0905k56060L0879Q3233k7824K15207
$$ -141217 181941 81146 93973 -41993 -310803 -229898 -485958 -455079 -371846 -399670 -184463
5943a84463J41523j48411Q8740J34641j07558J78573K05468l1973l47564n53376
$$ -184463 -42940 -191351 -102611 32030 -75528 103045 308513 276540 -71024 -624400
5933f24400J49912K33068J89451L02350l15931k14526q1952o3773K51297Q0232
$$ -624400 -474488 -241420 -51969 250381 -65550 -280076 -362028 -425801 -174504 -94272
5923i4272k81657r8265K39352j46292l37366p1272K54508j57204m2415J9163K99381
$$ -94272 -375929 -474194 -234842 -381134 -718500 -789772 -535264 -692468 -734883 -715720 -416339
5912d16339Q5319J80628J28345k68801k12K85147K89047j82886k01273j49426
$$ -416339 -331020 -150392 -22047 -290848 -291060 -5913 283134 100248 -101025 -250451
5902b50451M9050K92199l27139m02207m3385n7951q6111j15674m4697K23776L60591
$$ -250451 -201401 90798 -236341 -638548 -681933 -739884 -825995 -941669 -986366 -762590 -401999
5891d01999L74572j45470l79358J81219K58422j58901K96012K48159j63677P6932
$$ -401999 -27427 -172897 -552255 -371036 -112614 -271515 24497 272656 108979 185911
5881A85911k93366L9568L75390j10019L1422p2772l09803k95446J83635K56945
$$ 185911 -107455 -67887 307503 197484 228906 156134 -153669 -449115 -265480 -8535
5871h535J64069k43255J3137J6276J0469j81383J90762l0509l17366j26503K60669
$$ -8535 155534 -87721 -74584 -58308 -47839 -229222 -38460 -68969 -386335 -512838 -252169
5860b52169J18242Q4168j86578o8615J98002N8565l522o4402m12189J61195J11593
$$ -252169 -133927 -49759 -236337 -304952 -106950 -48385 -51907 -116309 -528498 -367303 -255710
5849b55710J59791J55830J09410j65793l0478j69907k07253P404K07205J98562
$$ -255710 -95919 59911 169321 3528 -26950 -196857 -404110 -396706 -189501 9061
5839I061J43755n539J46609J3150j50620j94169j82179j44714K42105k5615j85694
$$ 9061 152816 147277 293886 307036 156416 -37753 -219932 -364646 -122541 -148156 -333850
5828c33850J10918J44645k85418j10285O4382j36468J66107J89327k03102K04737
$$ -333850 -222932 -78287 -363705 -473990 -409608 -546076 -379969 -190642 -393744 -189007
5818a89007J62044k88987K43024J06641p2444K31611K83413O7031k95077j00955
$$ -189007 -26963 -315950 -72926 33715 -38729 192882 476295 543326 248249 147294
5808A47294j6266o4191k5298j53405j03952l98967l6329L89514P0420M9236o8453
$$ 147294 131028 66837 41539 -111866 -215818 -614785 -651114 -261600 -191180 -141944 -210397
5797b10397n6164Q8531J4361k43765j19372R6316K7641J29228J00012J85827Q8536
$$ -210397 -266561 -178030 -163669 -407434 -526806 -430490 -402849 -273621 -173609 12218 100754
5786A00754j26824j91458j84166P5782L87097r8363Q6494j50290k34012K61036
$$ 100754 -26070 -217528 -401694 -325912 61185 -37178 49316 -100974 -334986 -73950
5776g3950K75702j0301r1026k84926j357m54720j71384K13832J68652J20515n065
$$ -73950 201752 191451 100425 -184501 -185858 -640578 -811962 -598130 -429478 -308963 -314028
5765c14028M6820M2023J11999M03314k05372j23912j88897l01405L7582L06625
$$ -314028 -267208 -225185 -113186 290128 84756 -39156 -228053 -529458 -491876 -185251
5755a85251K56815K2941j47444J60402J27049J5724J11847J5569q2187J03218
$$ -185251 71564 94505 -52939 107463 234512 250236 362083 377652 295465 398683
5745C98683j30805l51423k58164o645J38915N7137k3035n7219O90063q0528n01410
$$ 398683 267878 -83545 -341709 -348354 -209439 -152302 -175337 -232556 457507 376979 -124431
5734a24431L5192J94729L5082M35601O5473j85739n04893k46807J40830j08583
$$ -124431 -89239 105490 140572 576173 641646 455907 -48986 -295793 -154963 -263546
5724b63546R5387R9304j57376O9541J45073o6169o4600l83042J50655J94755j22581
$$ -263546 -168159 -68855 -226231 -156690 -11617 -77786 -142386 -525428 -374773 -180018 -302599
5713c02599k75413q4699L88910L10555R0576J32040j06042R3970J54850j92182
$$ -302599 -578012 -662711 -273801 36754 127330 259370 153328 247298 402148 209966
5703B09966j44251j22358l56439m5099K07228L12979J46743m0679j47575Q2234
$$ 209966 65715 -56643 -413082 -458181 -250953 62026 208769 168090 20515 102749
5693A02749k29840q0264L86099J90094J56596q8037n4428L43060j28018J51199
$$ 102749 -127091 -207355 178744 368838 525434 437397 382969 726029 598011 749210
5683G49210l68225m64560J12530q817j50072l8522l4204M5147j02536L19300M27269
$$ 749210 380985 -83575 28955 20138 -129934 -168456 -202660 -157513 -260049 59251 486520
5672D86520k77598n7628j70196K73725J31268k24123m6720p0397J65324j67075
$$ 486520 208922 151294 -18902 254823 386091 161968 115248 44851 210175 43100
5662D3100p5742P9417k02345Q5001o463J8252j98185M1744k47033j99759L38338
$$ 43100 -32642 46775 -155570 -70569 -77032 -58780 -256965 -215221 -462254 -662013 -323675
5651c23675L95786Q4468J0128q2766R2635L09880j54492l56657l19691M703J58401
$$ -323675 72111 156579 166707 83941 176576 486456 331964 -24693 -344384 -339681 -181280
5640a81280j8899j45283k10761J39346M52347M2240l01663Q6484k42578m2972
$$ -181280 -200179 -345462 -556223 -416877 35470 77710 -223953 -137469 -380047 -423019
5630d23019P4680L5742K58111K45542L5654P1028p0233k00137J16412K14745p0653
$$ -423019 -348339 -312597 -54486 191056 226710 297738 227505 27368 143780 358525 287872
5619B87872k64932k20651j47423J39822K93526K72512j06934j63326M8352k85253
$$ 287872 22940 -197711 -345134 -205312 88214 360726 253792 90466 138818 -146435
5609a46435k42941K34352L31569j64924j45619L3119P2365J02010k67265j06037
$$ -146435 -389376 -155024 176545 11621 -133998 -100879 -28514 73496 -193769 -299806
5599b99806K21652L97764j85542m23019j13290K90731N5715n805k2730j46265
$$ -299806 -78154 319610 134068 -288951 -402241 -111510 -55795 -61600 -84330 -230595
5589b30595k58379L18300L65839K29922M8515j02550k94274k24682j94663k75545
$$ -230595 -488974 -170674 195165 425087 473602 371052 76778 -147904 -342567 -618112
5579f18112J78177K36516k31564Q5370M9269R4345J66608j39841m29649N6248
$$ -618112 -439935 -203419 -434983 -349613 -300344 -205999 -39391 -179232 -608881 -552633
5569e52633l4480n6995K67763J33030L52361J61585R8023j71812l96977o2988
$$ -552633 -587113 -644108 -376345 -243315 109046 270631 368654 196842 -200135 -263123
5559b63123Q5646K18427L24999N184j84389j05785q9954K72j90258k13831N20113
$$ -263123 -177477 40950 365949 371133 186744 80959 -8995 -8723 -198981 -412812 107301
5548A07301J76758j13062k28143l40594K11493L49614q1167j64033J97015K09938
$$ 107301 284059 170997 -57146 -397740 -186247 163367 82200 -81833 115182 325120
$$ [...]
##END NTUPLES=NMR SPECTRUM
##END=
