##TITLE=Analysis number 325340
Compound Code cc 40009
Book Reference 407/143/2
Project Code adrs
Chemist Name andyw
##JCAMPDX= 6.0         $$ Bruker NMR JCAMP-DX V2.0
##DATA TYPE= NMR SPECTRUM
##DATA CLASS= NTUPLES
##ORIGIN= Bruker BioSpin GmbH
##OWNER= nmr
$$ XWIN-NMR		Version 3.5
$$ Wed Dec 20 10:45:06 2006 GMT Standard Time (UT+0h)  MAYBRIDGE\nmr@NMR_250MHZ
##.OBSERVE FREQUENCY= 250.131544655141
##.OBSERVE NUCLEUS= ^1H
##.ACQUISITION MODE= SIMULTANEOUS (DQD)
##.ACQUISITION SCHEME= undefined
##.AVERAGES= 16
##.DIGITISER RES= 18
##SPECTROMETER/DATA SYSTEM= dpx250
##.PULSE SEQUENCE= zg30
##.SOLVENT NAME= CDCl3
##.SHIFT REFERENCE= (INTERNAL, CDCl3, 0, 16.5204)
##AUDIT TRAIL= $$ (NUMBER, WHEN, WHO, WHERE, WHAT)
$$ ##TITLE= Audit trail, XWIN-NMR		Version 3.5
$$ ##JCAMPDX= 5.01
$$ ##ORIGIN= Bruker BioSpin GmbH
$$ ##OWNER= nmr
$$ C:\u/data/dgb/nmr/ADRS/1890/pdata/1/auditp.txt
$$ ##AUDIT TRAIL=  $$ (NUMBER, WHEN, WHO, WHERE, WHAT)
(   1,<2006-12-20 10:44:32.48 +000>,<MAYBRIDGE\nmr>,<NMR_250MHZ>,
      <created by zg, POWCHK disabled, PULCHK disabled
       configuration hash MD5:
       49 4B E0 1D 92 C2 6B 37 9F E6 65 BC 52 41 86 1D
       data hash MD5: 64K
       1C 25 42 00 57 45 48 D2 87 23 64 1A 96 2A BD EC>)
(   2,<2006-12-20 10:44:49.64 +000>,<MAYBRIDGE\nmr>,<NMR_250MHZ>,
      <Start of raw data processing
       ef LB = 0.3 FT_mod = 6 PKNL = 1 SI = 32K 
       data hash MD5: 32K
       FE C8 1F B0 CF A2 F0 82 B9 02 27 33 B9 8C BC 34>)
(   3,<2006-12-20 10:44:53.75 +000>,<MAYBRIDGE\nmr>,<NMR_250MHZ>,
      <apk 
       data hash MD5: 32K
       57 C7 BC 30 56 69 BA 65 BD 63 2F 75 01 DB 59 F3>)
(   4,<2006-12-20 10:44:55.14 +000>,<MAYBRIDGE\nmr>,<NMR_250MHZ>,
      <abs ABSG = 5 
       data hash MD5: 32K
       4B E4 51 27 4B FC F1 51 2D E4 73 38 81 D1 BF B4>)
$$ ##END=
$$ 
$$ hash MD5
$$ A4 D2 17 DB D9 D0 15 5F F7 6B 20 0B B9 C0 14 D6
##$RELAX= 
##$RELAX= 
##$RELAX= 
##$RELAX= 
##$RELAX= 
##$RELAX= 
##$RELAX= 
$$ Bruker specific parameters
$$ --------------------------
##$DU= <C:\u>
##$EXPNO= 1890
##$NAME= <ADRS>
##$PROCNO= 1
##$TYPE= <nmr>
##$USER= <dgb>
##$AMP= (0..31)
100 100 100 100 100 100 100 100 100 100 100 100 100 100 100 100 100 100 
100 100 100 100 100 100 100 100 100 100 100 100 100 100 
##$AQSEQ= 0
##$AQ_mod= 3
##$AUNM= <au_zg>
##$AUTOPOS= <9 >
##$BF1= 250.13
##$BF2= 250.13
##$BF3= 250.13
##$BF4= 250.13
##$BF5= 500.13
##$BF6= 500.13
##$BF7= 500.13
##$BF8= 500.13
##$BYTORDA= 1
##$CFDGTYP= 0
##$CFRGTYP= 5
##$CHEMSTR= <none>
##$CNST= (0..31)
1 1 145 1 1 1 1 1 1 1 1 1 1 1 1 1 1 1 1 1 1 1 1 1 1 1 1 1 1 1 1 1 
##$CPDPRG= <>
##$CPDPRG1= <>
##$CPDPRG2= <>
##$CPDPRG3= <>
##$CPDPRG4= <mlev>
##$CPDPRG5= <mlev>
##$CPDPRG6= <mlev>
##$CPDPRG7= <mlev>
##$CPDPRG8= <mlev>
##$CPDPRGB= <>
##$CPDPRGT= <>
##$D= (0..31)
0 1 0 0 0 0 0 0 0 0.06 0 0 0 0 0 0 0.0002 0 0 0 0 0 0 0 0 0 0 0 0 0 0 
0 
##$DATE= 1166611471
##$DBL= (0..7)
120 120 120 120 120 120 120 120 
##$DBP= (0..7)
150 150 150 150 150 150 150 150 
##$DBP07= 0
##$DBPNAM0= <>
##$DBPNAM1= <>
$$ [...]
##$SUBNAM7= <"">
##$SUBNAM8= <"">
##$SUBNAM9= <"">
##$SW= 20.6930455092707
##$SWIBOX= (0..15)
0 0 3 0 0 0 0 0 0 0 0 0 0 0 0 0 
##$SW_h= 5175.983436853
##$TD= 65536
##$TD0= 1
##$TE= 295.16
##$TE2= 300
##$TE3= 300
##$TEG= 300
##$TL= (0..7)
0 120 120 120 120 120 120 120 
##$TP= (0..7)
150 150 150 150 150 150 150 150 
##$TP07= 0
##$TPNAME0= <>
##$TPNAME1= <>
##$TPNAME2= <>
##$TPNAME3= <>
##$TPNAME4= <>
##$TPNAME5= <>
##$TPNAME6= <>
##$TPNAME7= <>
##$TPOAL= (0..7)
0.5 0.5 0.5 0.5 0.5 0.5 0.5 0.5 
##$TPOFFS= (0..7)
0 0 0 0 0 0 0 0 
##$TUNHIN= 0
##$TUNHOUT= 0
##$TUNXOUT= 0
##$USERA1= <user>
##$USERA2= <user>
##$USERA3= <user>
##$USERA4= <user>
##$USERA5= <user>
##$V9= 5
##$VALIST= <valist>
##$VCLIST= <CCCCCCCCCCCCCCC>
##$VD= 0
##$VDLIST= <DDDDDDDDDDDDDDD>
##$VPLIST= <PPPPPPPPPPPPPPP>
##$VTLIST= <TTTTTTTTTTTTTTT>
##$WBST= 1024
##$WBSW= 4
##$XGAIN= (0..3)
0 0 0 0 
##$XL= 0
##$YL= 0
##$YMAX_a= 189335
##$YMIN_a= -301373
##$ZGOPTNS= <>
##$ZL1= 120
##$ZL2= 120
##$ZL3= 120
##$ZL4= 120
##$ABSF1= 16.52042
##$ABSF2= -4.172752
##$ABSG= 5
##$ABSL= 3
##$ALPHA= 0
##$AQORDER= 0
##$ASSFAC= 0
##$ASSFACI= 0
##$ASSFACX= 0
##$ASSWID= 0
##$AUNMP= <proc_1d>
##$AZFE= 0.1
##$AZFW= 0.1
##$BCFW= 0
##$BC_mod= 0
##$BYTORDP= 0
##$COROFFS= 0
##$CY= 12.5
##$DATMOD= 1
##$DC= 0
##$DFILT= <>
##$DTYPP= 0
##$F1P= 14.0000005364418
##$F2P= -0.99999901652339
##$FCOR= 0.5
##$FTSIZE= 32768
##$FT_mod= 6
##$GAMMA= 0
##$GB= 0
##$INTBC= 1
##$INTSCL= 1
##$ISEN= 128
##$LB= 0.3
##$LEV0= 0
##$LPBIN= 0
##$MAXI= 10000
##$MC2= 0
##$MEAN= 0
##$ME_mod= 0
##$MI= 0
##$NCOEF= 0
##$NC_proc= -5
##$NLEV= 6
##$NOISF1= 0
##$NOISF2= 0
##$NSP= 0
##$NTH_PI= 0
##$NZP= 0
##$OFFSET= 16.52042
##$PC= 1
##$PHC0= 233.3966
##$PHC1= 5.751908
##$PH_mod= 1
##$PKNL= yes
##$PPARMOD= 0
##$PSCAL= 4
##$PSIGN= 0
##$REVERSE= no
##$SF= 250.130000393086
##$SI= 32768
##$SIGF1= 0
##$SIGF2= 0
##$SINO= 400
##$SIOLD= 32768
##$SREGLST= <1H.CDCl3>
##$SSB= 0
##$STSI= 32768
##$STSR= 0
##$SW_p= 5175.98343685301
##$SYMM= 0
##$S_DEV= 0
##$TDeff= 65536
##$TDoff= 0
##$TI= <Analysis number 999999
Compound Code 99
Book Reference 9
Project Code 9>
##$TILT= no
##$TM1= 0
##$TM2= 0
##$TOPLEV= 0
##$USERP1= <user>
##$USERP2= <user>
##$USERP3= <user>
##$USERP4= <user>
##$USERP5= <user>
##$WDW= 1
##$XDIM= 32768
##$YMAX_p= 383833003
##$YMIN_p= -629340
$$ End of Bruker specific parameters
$$ ---------------------------------
##NTUPLES= NMR SPECTRUM
##VAR_NAME=  FREQUENCY,     SPECTRUM/REAL,   SPECTRUM/IMAG
##SYMBOL=    X,             R,               I
##VAR_TYPE=  INDEPENDENT,   DEPENDENT,       DEPENDENT
##VAR_FORM=  AFFN,          ASDF,            ASDF
##VAR_DIM=   32768,         32768,           32768
##UNITS=     HZ,            ARBITRARY UNITS, ARBITRARY UNITS
##FACTOR=    0.157963299565203, 1,           1
##FIRST=     4132.25267971935, 0,            0
##LAST=      -1043.73075713366, 0,           0
##MIN=       -1043.73075713366, -629340,     0
##MAX=       4132.25267971935, 383833003,    0
$$ Real data points
##PAGE= N=1
##DATA TABLE= (X++(R..R)), XYDATA
$$ [...]
23738e40274K54184J43098J62758J07096j73099j59097P5491J36860N9380P849
23728G4246k9776l5727k9674l2631N7135R7306K9703p9927k41768N7674K3715
23717a09724q0178R6184J53924M4076K19397q1745r2901K5488J42339j29816l8978
23706A48066L2508j16311m6648n3375q931P9069M285K8819K6745J31413k5523
23695B00117k20203j65044K2347J06112n7942M9888J51956n7507n8934J16613
23685H7403j25954j1104J77617P6380q0570N9419o6792k5844N4440j81913o1500
23674i8418m2778p1455J70822j31328p4674K22747R5287L0247l3606l8728r9374
23663g1258q6959P1267N1086j05027K3878m5397K2574P3258j17009J28360K19196
$$ y = [-540274, -286090, -142992, 19766, 126862, -46237, -205334, -129843, 7017, 66397, 74246, 44470, 8743, -20931, -53562, 3573, 100879, 130582, 50655, -191113, -133439, -109724, -189902, -93718, 60206, 104282, 323679, 241934, 149033, 174521, 316860, 187044, 148066, 180574, 64263, 17615, -35760, -44691, 34378, 38663, 67482, 94227, 225640, 200117, -20086, -185130, -162783, -56671, -114613, -64725, 87231, 29724, -29210, 87403, -38551, -49655, 127962, 204342, 123772, 183191, 116399, 90555, 144995, -36918, -98418, -141196, -212651, -41829, -173157, -247831, -25084, 70203, 100450, 66844, 28116, -71258, -158217, -86950, -35864, -140891, -117013, -162410, -139836, -66578, -183587, -55227, 163969]
23652A63969l1885l0318L9044J03020j0297j37102k3679j0162K1673l245N9589
23641A40607K6035L4870j09850j77072j82391j01379J31882J09928K51854L1971
23631A56455j07614N3433L5912p9302j05651r9481P7371o6019K60010N1852l85728
23620b08762j30675R2084L0248K04475P1776j09712N2075K5920p2323j71576K5927
23609a90543M533j6923J28K17795M8650m1272o2944q7941J20166K11085J12173
23598C14907J36332j14917j63008q5585R3289l0651j51208o5241K6142Q6847R1579
23587A38486K625q540r5474L4421R0988l5522J28052J15255n3903l5880p0074
23576B10434Q4337K30326m3315o4321j42384k18317o6210j1312q6694j277J00339
$$ y = [163969, 132084, 101766, 140810, 243830, 233533, 96431, 72752, 62590, 84263, 81018, 140607, 166642, 201512, 91662, -85410, -267801, -369180, -237298, -127370, 124484, 156455, 48841, 102274, 138186, 58884, -46767, -146248, -68877, -134896, 125114, 176966, -208762, -339437, -247353, -217105, -12630, 59146, -50566, 1509, 27429, -44894, -216470, -190543, -186010, -202933, -202805, 14990, 63640, 22368, -40576, -128517, -8351, 202734, 314907, 451239, 336322, 173314, 87729, 181018, 150367, -841, -66082, -39940, 46907, 138486, 141111, 132571, 37097, 71518, 162506, 126984, 255036, 370291, 316388, 280508, 210434, 294771, 525097, 481782, 417461, 275077, 56760, -9450, -20762, -107456, -108733, -8394]
23565h394m7302K0341o8314n4870l4518M7218M6648O6744j29493O9638M9543J13900
23553G1141n4075n4758R6706J22312j10466K746J4454j23466Q9219K7798o4479
23542A7132p811j57167j58572J05144J16158J7505L4641J40220j92657o0987J09422
23531c6972Q2297k2171o0530q8476m0755j30109k24489P6827K30281J75063J09123
23520G0089j30806K5193J35213J32749o3014m0260o2447q613m2295k2498j6504
23509b3193j34483J3535L8822P8940L3214J03432J22033m1783O0738m8615q6971
23498A15669j87405j35473l4610P9508J24326r7918O3474o5835j51216k2580J28270
23487a83790P7855J11854k1780k8125J22274N6255n1413m2149j13001m4745R6943
$$ y = [-8394, -55696, -35355, -103669, -158539, -193057, -145839, -99191, -32447, -161940, -92302, -42759, 71141, 17066, -37692, 59014, 181326, 70860, 73606, 88060, -35406, 53813, 81611, 17132, 9321, -147846, -306418, -201274, -85116, -67611, -32970, 107250, -85407, -146394, -36972, 45325, 23154, -37376, -125852, -166607, -296716, -521205, -444378, -214097, -39034, 70089, -60717, -35524, 99689, 232438, 169424, 129164, 66717, 58104, 15809, -6689, -23193, -157676, -144141, -105319, -26379, 6835, 110267, 232300, 190517, 251255, 202640, 115669, -71736, -207209, -241819, -162311, -37985, -135903, -72429, -138264, -289480, -312060, -183790, -105935, 5919, -15861, -43986, 78288, 134543, 83130, 40981, -72020, -116765, -19822]
23476a9822M2161o8452j75884j8778O1608N6241m84M78Q1376l8650m1527N6977
23464f4756m813N8424j5270Q751o8966j74851P0561J14448r6600J03687K859r5436
23452a61962Q2065n141p1783k534o919o0464J43535R7291J7641p2376k1129J35843
23440G4067l6640j08145k0695J27728J06364k7955m310p0990k1127j33342k2493
23429a37538J07874K58633m5339n0778k89113k67700J89590P5378L8187j6755
23419a37561P1525Q3777O8506J50800n115j32135q2658j30952J63619L58393l8847
23408C69352k66040p1137J48841q2254m1890N9032j36666q6724j16214L3863J66669
23397b3168Q429N2202J43576j49701j03512O0525M6686M3335j53279k9723q5625
$$ y = [-19822, 22339, -46113, -221997, -240775, -179167, -122926, -123410, -122932, -41556, -80206, -121733, -64756, -69569, -11145, -26415, -17664, -86630, -261481, -190920, -76472, -173072, -69385, -66526, -161962, -79897, -85038, -156821, -159355, -166274, -226738, -83203, 14088, 31729, -40647, -61776, 74067, 37427, -70718, -91413, 36315, 142679, 114724, 110414, 39424, 18297, -115045, -137538, -29664, 228969, 183630, 132852, -156261, -423961, -234371, -158993, -120806, -137561, -66036, 17741, 86247, 237047, 231932, 99797, 17139, -113813, 49806, 408199, 369352, 103312, 32175, 181016, 98762, 56872, 115904, -20762, -107486, -223700, -189837, -23168, -14739, 37463, 181039, 31338, -72174, -11649, 35037, 78372, -74907, -104630, -190255]
23386a90255j49492o3449M7833N6203J08537J19827N9319q3045J01893P6139n9179
23375B4331j31132j41966R2145Q1276J32172j29125L2361J35465K194p3661j51501
23364a27441m9139l8462n4153O2818K39977m7798o0138j36573Q0689J09329R9780
23353G8889j5292k2247q4987q1291J1700J4357M6722J11854K2527P2713l6423
23342A18522M2231k49408k729M1359L6452k06924j389P2128P4675N731R0880l9898
23330a8370J5506R1874j72369j88883K59485J63677J29576j99328j26825J6273
23320b9384L9375j25109J45193r0908l13679j17063J04853P1776J58645K83126
23310A26825K05649O1576j21775j78660J42167k6127j8669O40r9596n8942J12679
$$ y = [-190255, -339747, -403196, -355363, -299160, -190623, -70796, -11477, -94522, 7371, 83510, 24331, -106801, -248767, -156622, -75346, 56826, -72299, -39938, 95527, 97721, 24060, -127441, -176580, -215042, -269195, -206377, 33600, -14198, -74336, -210909, -130220, -20891, 78889, 63597, 41350, -43637, -124928, -113228, -98871, -52149, 59705, 82232, 154945, 118522, 160753, -88655, -91384, -50025, -13573, -220497, -221886, -149758, -75083, -69352, 21528, -18370, -2864, 89010, -83359, -272242, -12757, 150920, 280496, 81168, -45657, -29384, 9991, -115118, 30075, -60833, -374512, -491575, -386722, -314946, -156301, 126825, 332474, 394050, 272275, 93615, 235782, 209655, 190986, 191626, 92030, 33088, 145767]
23299A45767J9936j43917J09394J49501n1106q6891r4903r554o6438R2830K2311
23288H6930q0868J4324K25769J08277j28779j47489j2581Q836q2280p7921N3508
23277c2274l5303j72713J55091J77226k4673Q1685r8376k04969j7125O7066R6785
23266g580l0929j29082O2171O080J83028R3713k5734P6185l5717r8592j39202
23255d5659P2764J17848M4314j81065k8699m8553j4476n278j847L6639m1251q3300
23243a78563J2842J3928p9295j07366n9827L2222O8715J0804K13897J25498J1337
23232F4192J07818m0162j08872j74099m5236N2831R0498J23689P131J95787l335
23221B70242L0271m8644j36899j53979o2833M1422Q4656J10510P5394k39664J2580
$$ y = [145767, 165703, 21786, 131180, 280681, 229575, 142684, 47781, 38227, -28211, 64619, 86930, 6062, 20386, 246155, 354432, 225653, 78164, 65583, 74419, -7861, -85782, -32274, -67577, -240290, -85199, 92027, 67354, 149039, 50663, -154306, -171431, -104365, -7580, -38509, -167591, -105420, -99340, 83688, 177401, 151667, 227852, 192135, 93543, -45659, 27105, 144953, 189267, 8202, -20497, -69050, -83526, -88804, -90651, -54012, -95263, -178563, -165721, -151793, -231088, -338454, -398281, -366059, -297344, -286540, -72643, 52855, 64192, 172010, 131848, 22976, -151123, -196359, -143528, -53030, 70659, 77790, 273577, 270242, 300513, 251869, 114970, -39009, -101842, -60420, 24236, 134746, 210140, -29524, -16944]
23210a6944k6816j95594p3514J25563J07506P5461P4004j3753k14800M250O8785
23199h5852j0204N6514J53922k2062J48322j51711o4994m7065l1868Q8594R328
23188D2924p8037O485O4674K5053Q3726P9003j24840j25261j0290L8401j9133
23177a7295j59206o2846Q5420N2489L2279o3072j44853m9286J66728k3725K07788
23166B4421M7334L382k31674o7076O2252N5374j09086J58812R3115j61463l7868
23155a62477j4341J4631J5032J7202M0345K12493J66782q5658j14796N8498k742
23144A44969p6367J5894J31941o3057j90643k01506n3195K17290j07760K6019
23134a56415o5891p4045J37926K12075K48714j2760n5757l28924k38561N5665
$$ y = [-16944, -43760, -239354, -312868, -187305, -79799, -4338, 69666, 55913, -158887, -154637, -85852, -96056, -39542, 114380, 92318, 240640, 88929, 23935, -23130, -54998, 33596, 42924, -35113, -28628, 36046, 61099, 144825, 223828, 98988, -26273, -36563, 1838, -17295, -176501, -239347, -153927, -101438, -69159, -132231, -277084, -326370, -159642, -183367, 24421, 71755, 75137, -156537, -223613, -161361, -105987, -215073, -56261, 36854, -124609, -162477, -176818, -162187, -147155, -129953, -89608, 122885, 289667, 204009, 89213, 147711, 144969, 68602, 84496, 216437, 153380, -37263, -238769, -291964, -74674, -182434, -156415, -222306, -296351, -158425, 53650, 302364, 289604, 233847, -95077, -333638, -277973]
23124b77973J83709J78496P7205j60895J6095J40028M6576M6343o5943j70418
23114A3223q5251l6851j8226J38844J51009p5309m1548J22071P1010J5465l2785
23103B21652j0148j11357j18607j21891J10980Q7602j44781j8546J54687M4161
23093I3752o4737j94854J28079J21384l0123n3344j6699l4900r0091r0176P1483
23082a60226n273O4883J20590N9241M5131j20997k10034j58710K28457J84581
23072D7643J65176J1087j4705L2230j18828j22353n7832k2004n9961q4550R5708
23061a28389J06161J03705J52279J32592j65258k89259j22164M4226N5881n0098
23051a60324l7640L5574M1976M355r9126r0096l9263J18271J99660J75372J6893
$$ y = [-277973, -94264, 84232, 161437, 542, 16637, 156665, 203241, 249584, 183641, 13223, -72028, -108879, -127105, 11739, 162748, 87439, 45891, 167962, 238972, 254437, 221652, 211504, 100147, -18460, -140351, -29371, 58231, -86550, -105096, 49591, 93752, 29015, -165839, -37760, 83624, 53501, 157, -16542, -51442, -141533, -231709, -160226, -165499, -100616, 19974, 79215, 124346, 3349, -206685, -365395, -136938, 47643, 212819, 223906, 209201, 241431, 122603, 250, -57582, -79586, -139547, -224097, -128389, -22228, 81477, 233756, 366348, 201090, -88169, -210333, -166107, -110226, -160324, -197964, -162390, -120414, -116059, -215185, -305281, -344544, -226273, -26613, 148759, 165652]
23040A65652j83146j81170K27014L344j70389m5717J50561J96613j2720l00935
23030a50893l4527J58250R4251j9092o1050k03512j18641k9809J95071J13428
23020e6524J25649K2370j44841j13982o6914l4370M2534j7148J511n1759J3804
23009b79670N4113J0154m2098K7304N1192J91539P0286J42684R0436j55171j51705
22998I064P7765p3873j66530J10359o6767J0037L4821M7459J26098m833j93475
22987h9875J12575O5264j69522o2708K2851K0049M9101K0218n5976J08711K07946
22976B28634p3678p7483K4883Q3671q8810l8849j10988j4302M0126r0990J7870
22965i9916J8941J91256J71446j43434K2040k02772o1337o787O1641k5285R4570
$$ y = [165652, -17494, -198664, 28350, 31694, -138695, -184412, -33851, 162762, 150042, -150893, -185420, -27170, 67081, 47989, -13061, -216573, -335214, -365023, -169952, -56524, 69125, 91495, -53346, -167328, -234242, -268612, -226078, -243226, -241715, -293474, -279670, -225557, -215403, -257501, -230197, -179005, 12534, 82820, 225504, 315940, 160769, 9064, 86829, 12956, -153574, -43215, -109982, -99945, -65124, -17665, 108433, 103600, -89875, 22700, 87964, -81558, -144266, -121415, -101366, -52265, -32047, -88023, 20688, 228634, 154956, 77473, 102356, 186027, 97217, 58368, -52620, -66922, -26796, -117786, -99916, -80975, 110281, 281727, 138293, 160333, -42439, -103776, -110563, -48922, -74207, 20363]
22954B0363J32216L2269q9848q5385n0583j3079j0806k04923p8114J10532J24326
22943a13032Q0776o0014k24129P2986L2385K00691J9777r8326m34J19546q2597
22932e2371j17487j68389L4216M6544j23494K4654O7010O2945J08227L98224n9679
22921B20400j22783P5622p5176j75842P5810L5793Q4935R8272J45741N1916j37065
22910B77623j25410j70449j14843k5733q2097o2577N5157O0390k2990J71299N5703
22899A6073j61518J38753L05615R4746n3042j30114j73287o3128L5026r5156l0251
22888a16283N392J9395J11875m1104Q5934r4266r7213N2853r4216m0211o9946
22877b77790p5518r4232J44091M3014J25811O9123J53607O1882q0188j18792q0513
$$ y = [20363, 152579, 184848, 95000, 9615, -40968, -54047, -64853, -269776, -347890, -237358, -113032, -32256, -92270, -316399, -243413, -211028, -10337, 9440, -88886, -89320, 30226, -52371, -169858, -338247, -304031, -257487, -380981, -356327, -289317, -226372, -118145, 280079, 220400, 97617, 173239, 98063, -77779, -1969, 33824, 118759, 217031, 362772, 414688, 277623, 152213, -18236, -133079, -158812, -240909, -303486, -248329, -187939, -210929, -39630, 16073, -145445, -6692, 298923, 393669, 340627, 210513, 37226, -25902, 9124, -86032, -116283, -110891, -91496, 20379, -20725, 65209, -29057, -126270, -73417, -167633, -207844, -277790, -353308, -447540, -303449, -260435, -134624, -65501, 88106, 149988, 69800, -48992, -129505]
22866a29505P5927J11863j33737p3002K4040P5425j83050k3977L71132m7100j46058
22855g8042k1014J32586N8231m1722o643l1464j04384j64105m0931J41708P8603
22844g7177k1644k3624N438L5319J02565J1533k30163j61520P6965M2824n8916
22833b98400m0454J5143J50800P8454n7654L6071J697m9850R8793J1774J9617
22822c4009J06353k309n5113k32057k34950J86047J14877J00871j5071n3899J34536
22811A5276M3402R2285Q3039j0980q3612l5846R0758J48922K2578j80858k06367
22800b1403k00155L2835o4643j41136R7001J94453j07009J6408m5517K33985J58765
22789A53584j21708j19869N2116Q1381j50598R5281K89r4302j86136J56224L32245
$$ y = [-129505, -53578, 58285, -75452, -148454, -124414, -48989, -232039, -256016, 115116, 68016, -78042, -99056, 33530, 91761, 50039, 43396, 11932, -92452, -256557, -297488, -155780, -77177, -98821, -122445, -117007, -81688, 20877, 32410, -197753, -359273, -282308, -239484, -298400, -338854, -323711, -172911, -94457, -152111, -116040, -114343, -164193, -65400, -53626, -34009, 72344, 70035, 14922, -217135, -452085, -266038, -151161, -50290, -65361, -119260, 15276, 58678, 150963, 234002, 223022, 139410, 103564, 194322, 343244, 365822, 184964, -21403, -221558, -188723, -253366, -394502, -297501, -103048, -210057, -193649, -239166, -5181, 153584, 31876, -87993, -35877, 45504, -105094, -9813, -9524, -103826, -289962, -133738, 198507]
22778A98507l0267n3855K6204j09296p6420K2445q5874o4545P5993j385q5001
22767a83494l513l4910o2358K0172R9113j3181J27099J03447n1626k0542R8561
22756G8768j9817j6860J03755M762m201J71065j00948k20865n7770K6960M9397
22745A4246m6634J15326M7904K02315L6423j02471O63j38155n4154j68o5882L8345
22733D7758q3970M9160J24050k7878r2289J4922n0838Q4442j96040k14183J39792
22722b05074L3756p0625n217N4934J31268O0181J10019l7520k1796r2494R0205
22711D7637J63146r7973j38815j28604Q1063j21489J54838O1980k46601P5623
22701a49195K06975n1462J6396j14249O5982Q3332n0925M4692J27134m8016r6239
$$ y = [198507, 168240, 114385, 140589, 31293, -45127, -22682, -108556, -173101, -97108, -98493, -183494, -187007, -221917, -284275, -264103, -164990, -178171, -51072, 52375, 749, -19793, 78768, 58951, 42091, 145846, 150608, 146407, 317472, 216524, -4341, -62111, -35151, 14246, -32388, 82938, 130842, 333157, 369580, 267109, 267772, 129617, 75463, 75295, 9413, 47758, -36212, 12948, 136998, 109120, 16831, 31753, -19085, 65357, -130683, -344866, -205074, -171318, -241943, -247160, -192226, -60958, -777, 109242, 71722, 49926, -42568, 47637, 210783, 112810, -26005, -154609, -73546, -195035, -40197, 21783, -224818, -149195, 57780, 6318, 22714, -91535, -25553, 57779, 6854, 51546, 178680, 130664, 34425]
22690C4425k3224o8010r8215j9192L6107N8228N2937N8253Q6933l8688j80059
22679a00505k33290N7503Q2864J34597K19036j4047K4466O5209p1206o4347p3024
22668B7256J43447M3788M3635j04903j10363p7940K10366Q4293j14591J37034
22658B82022O4116j97488k44874j20846J17594P8265m7852J1437J61221P7707
22648A81302J16560N550k64325j36714J90463J14086j11154j39331q0908J27707
22638C236J5894J318m539J48698k3743l4104j71790q690Q1536l5051P4202M7716
22626I4683j18590Q3844l0158n1993j2342r0016J27849O7780J06863J93436o3659
22615C07697k42464k53525J6079M1845l8665R0511J42420Q0555n0988P070L044
$$ y = [34425, 11201, -56809, -155024, -174216, -138109, -79881, -26944, 31309, 118242, 79554, -100505, -333795, -276292, -193428, -58831, 160205, 146158, 170624, 235833, 164627, 100280, 27256, 170703, 214491, 258126, 153223, 42860, -35080, 175286, 259579, 144988, 282022, 346138, 148650, -96224, -217070, -99476, -21211, -69063, -57626, 103595, 181302, 297862, 303412, 39087, -97627, 92836, 206922, 95768, -43563, -124471, 3236, 19130, 20448, 15909, 164607, 140864, 106760, -65030, -73720, 7816, -27235, 46967, 94683, -23907, 59937, 29779, -22214, -34556, -124572, 3277, 71057, 177920, 371356, 307697, 65233, -188292, -172213, -130368, -169033, -78522, 63898, 144453, 93465, 100535, 103579]
22604A03579N9790M9989p605K6925k3435o6249j3122N9250Q1007o382j46699n8639
22592E8409J15390k5708n1422O1054m0235j42111k4447o6538j55098O3491J45816
22581f1399J79540J22993l6146n8761j8306N6347m5536k26339n3862J30907j8848
22570b9410K5147J83460p0812L5051q3604p4355m0607J3160J73005k3859p3768
22559C3408J35989R7219m3408Q2600L6359K6121p285j61463o2610J27850R7235
22548C62015n9975k59174m3796K3677j0901k2853N1814r1835J17127o7544r6155
22537i7600r2962r7187M6607P3765J1546P0337J07519N729m2635j45446m9349
22526b09676l7582N6321N5911j9655j03356R8625L4875Q9758L1810P4750J01936
$$ y = [103579, 163369, 213358, 205753, 232678, 209243, 142994, 129872, 189122, 270129, 263747, 117048, 58409, 173799, 148091, 96669, 157723, 117488, -24623, -49070, -115608, -270706, -207215, -61399, 118141, 241134, 204988, 146227, 127921, 184268, 138732, -87607, -141469, -10562, -29410, -4263, 179197, 108385, 143436, 59832, -14523, -55130, -41970, 131035, 107176, 33408, 169397, 266616, 223208, 305808, 342167, 368288, 361003, 199540, 136930, 264780, 362015, 302040, 42866, -930, 22747, 11846, -11007, 40807, -51028, 66099, -1445, -97600, -190562, -287749, -241142, -167377, -155831, -85494, 22025, 27754, -14881, -160327, -209676, -247258, -190937, -135026, -154681, -258037, -159412, -124537, -34779, -2969, 71781, 173717]
22515A73717Q7445n6940k34869j27815J44722k6896j35757K47902K18822j37840
22505A52491j56463M5467J83986q844n1470q2217J08718m7720j23226j65913N9333
22494h5858Q3649J1426M0618j52445j89172R5262R4744N2047J14417l6752j19995
22483i2059K6662O8372m2015k32613j19050R8299O1186Q3175M5626J9075J14242
22472C0900J28502O886p2649j27866J07911K8462j8153L4775m8377j29059j71832
22461b30500Q2334n6706j41490j0868M6415R4380j03232J5732P0566J78519O9499
22450A4649L5234o0882R5986P665n6495J8291j37888j14431M1704m9569K2759
22439a82977o9869M8891L3984j33343m830n380J74185J16994o4101q7531J43373
$$ y = [173717, 261162, 204222, -30647, -158462, -13740, -40636, -176393, 71509, 290331, 152491, -3972, 41495, 225481, 216637, 165167, 82950, 191668, 143948, 20722, -145191, -85858, -2209, 9217, 49835, -102610, -291782, -196520, -101776, -49729, 64688, 27936, -92059, -65397, 2975, -39040, -271653, -390703, -292404, -231218, -148043, -102417, -83342, 30900, 159402, 166288, 93639, -34227, 73684, 102146, 83993, 118768, 70391, -58668, -230500, -148166, -204872, -346362, -357230, -310815, -216435, -319667, -303935, -233369, -54850, 14649, 49883, -10999, 84987, 92652, 36157, 54448, -83440, -197871, -156167, -205736, -182977, -252846, -203955, -169971, -303314, -308144, -313524, -139339, -22345, -86446, -173977, -30604]
22428c0604R0854l3811j25806o8650n0507L5783k5137J62256M8555J09781r821
22417A02893j14025k10340O576J98527K54721M1925k50450j74681j25381K3958
22407b46277J59720L2948p8176K6409N4266P6561J56578O000J03842j07527k11384
22396b7040j04044R7058L7762R771j02954J34246k9568k6994o1301l3617n6509
22385a63190j48131O0070J93457j2458O6524J05082r6217j01453L2463Q0928J62053
22374A79128L2593p6572J9890P1480m3183q8100q0553k2578J3972J20700O0657
22363A87434q0583r3697R531k5565N9729K799q3420o1575K1437J5489L046n7046
22351a02421k7224n3179J01389n9298o5321J17626K21309m6675k16230p1556m2418
$$ y = [-30604, 60250, 26439, -99367, -168017, -218524, -182741, -207878, -45622, 2933, 112714, 102893, -11132, -221472, -214896, -16369, 238352, 280277, 29827, -144854, -270235, -246277, -86557, -53609, -131785, -105376, -51110, 25451, 182029, 188029, 291871, 184344, -27040, -131084, -34026, 3736, 13507, -89447, 44799, 15231, -11763, -73064, -106681, -163190, -311321, -251251, -57794, -70252, -3728, 101354, 5137, -96316, -63853, 17075, 179128, 211721, 135149, 155039, 226519, 183336, 95236, 14683, -7895, 6077, 126777, 187434, 106851, 13154, 22685, -2880, 56849, 59648, -23772, -85347, -63910, -48421, -45375, -102421, -129645, -182824, -81435, -140733, -206054, -88428, 132881, 86206, -130024, -201580, -243998]
22340b43998j180j08013L1982J9289K13968J70570O9204r8871j80613k0094R5034
22329e2722p8093k6658j4474K61729P0854l8909j55241j35854j90110P035N0196
22318c02247N4914J3891M8257N9601j10880N8971J48501o4720j56400J34628p6825
22307a92309j26812K3941J46685k0512p5295l572N2437Q6036P2996m8263j6134
22296a00802j52420l3364k4811K1815J17373k7737l366M1870P5664M7222M3427
22285D871l1813k3764k8928j47501N8794J14708Q7748j10105p1124k350k1858
22274a71322J69860j5501J1223N0916O1027M5438J8701j36191j19774P9684o352
22263a2291r7016N7896Q3857R3518j07958Q9594n6941L185J1667k58268l6088
$$ y = [-243998, -245178, -353191, -321209, -301920, -87952, 82618, 151822, 52951, -127662, -147756, -52722, -130815, -157473, -171947, 89782, 160636, 121727, -33514, -169368, -359478, -352443, -302247, -247333, -233442, -185185, -125584, -236464, -177493, -28992, -93712, -250112, -115484, -192309, -319121, -295180, -148495, -169007, -244302, -247874, -195437, -109401, -36405, -84668, -100802, -253222, -286586, -311397, -289582, -172209, -199946, -203312, -161442, -85778, -38556, 4871, -26942, -50706, -79634, -227135, -168341, -53633, 34115, -75990, -147114, -149464, -171322, -1462, -16963, -5740, 45176, 106203, 151641, 170342, 34151, -85623, -5939, -12291, -109307, -51411, 32446, 125964, 18006, 107600, 50659, 53844, 65511, -192757, -228845]
22252b28845J1404O7928n46J41067j3702j11469P5474J2636O1823m3834N3065
22241B5001Q8646k19712k8832J55871l0939j60623J32834K09398m3050K8834o4602
22230I2826N1800k7088O5542j0280k54181K9514N3256P2570k62j10822J3683j14587
22218a38029m7030J48919n4516J43050K4554r2565q0205n087J33987J17052k1857
22207A28273p0348q4339Q8762j88789j22519J82272J17084J35492o3537p3211
22197D9140o6965l7938L464P8387o2029r6976o695M8229L9361P3514K4402o0009
22185a4115M5950K9251j22053n8592J0202M9639p414j1420K5497j6180J21003
22174E1768J995p8176J32659m4825q8502j2575Q85N835j16567Q0922L7278o1294
$$ y = [-228845, -217441, -149513, -150059, -8992, -22694, -134163, -58689, -46053, 15770, -28064, 25001, 113647, -106065, -134897, 20974, -9965, -170588, -37754, 171644, 128594, 157428, 92826, 144626, 117538, 183080, 172800, -81381, -51867, 1389, 73959, 73697, -37125, -23442, -138029, -185059, -36140, -90656, 52394, 76948, -15617, -95822, -100909, 33078, 150130, 128273, 57925, -26414, 62348, -126441, -248960, -66688, 50396, 185888, 122351, 49140, -17825, -55763, -52299, 26088, -35941, -132917, -139612, -91383, -52022, 21492, 45894, -14115, 31835, 61086, -60967, -119559, -109357, -59718, -67132, -78552, -53055, -69235, 51768, 53763, -24413, 108246, 63421, -25081, -37656, -36771, -30936, -147503, -66581, -29303, -90597]
22162i0597p0868m2103J70262K20301L7282k19816j32026M9231J29518j2112j24787
22151h5715J80523K9382P738r8030q5343J6855k02524p0851k7144Q1501R3708
22140a59900j2354K00785K19932J03547j33831j71380k2781M588j20984m0246
22130a32624q7060M3738O9697N5923J32609l4029j35703Q9258R3233J5859p3896
22119C7005M6759r1694p2996L1942m1637l9889j00517Q3300m0726q2065K22850
22108d7668R0323k34172M38N0329O3917J65700R437l8380m1380j89584L3934K10929
22096G3823n8199j5692j45536p9456J09119J33768K9825r4133M8272j2003O4188
22085E3976J18303J4319q7588k7141o6783j35837q0957O6071K39970K08121M5497
$$ y = [-90597, -161465, -203568, -33306, 186995, 224277, 4461, -127565, -78334, 51184, 39072, -85715, 94808, 124190, 131928, 33898, -51445, -34590, -237114, -307965, -335109, -253608, -159900, -172254, 28531, 248463, 352010, 218179, 46799, 24018, 28606, -92378, -132624, -219684, -175946, -106249, -50326, 82283, 48254, -87449, 1809, 95042, 110901, 37005, 83764, -7930, -80926, -48984, -90621, -130510, -231027, -147727, -188453, -270518, -47668, 42655, -191517, -191079, -140750, -76833, 88867, 98304, 59924, 18544, -171040, -137106, 73823, 15624, -68, -145604, -225060, -115941, 17827, 47652, -46481, 1791, -10212, 53976, 172279, 186598, 99010, 71869, 5086, -130751, -211708, -145637, 94333, 302454, 347951]
22074C47951k37884k50598o8235n1293j24687j68246J7014K70027J78781K1347
22064f5823J20798K5791k15070l3684R5825J38083k547k522J7632j37791R687
22053d9621k6188L9969J1486q8306M9502N2055n1575O8934N4578k8190P7626O7523
22041A77793k1141J2428j03210o2836m571J30371J6437l8548j8878K1248r2625
22030A6468p1407j40237r7826l1305L4509R3613R7420j18215j27124J63038J05370
22019g5696P085p1117n7148p1903j30836K3218N8445J60833R3008r3720m2938
22008b00769N953N4071m7515J48756K06393o8356j62787O6164j05635N139K30958
21997A32372J63840j60423j80188P1698j20377r5710P8245R5882M6736j58214
$$ y = [347951, 110067, -140531, -208766, -260059, -384746, -552992, -535978, -265951, -87170, -65823, 54975, 80766, -134304, -167988, -72163, 65920, 63373, 60851, 78483, -59308, -49621, -75809, -35840, -24354, -112660, -63158, -11103, -62678, 6256, 60834, 32644, 110270, 177793, 156652, 169080, 65870, 3034, -1537, 128834, 145271, 106723, 87845, 109093, 16468, -54939, -195176, -293002, -324307, -289798, -196185, -98765, -216980, -344104, -181066, -75696, -68611, -139728, -196876, -268779, -399615, -376397, -317952, -157119, -64111, -157831, -200769, -194816, -140745, -188260, -39504, 166889, 98533, -64254, 1910, -103725, -98586, 132372, 296212, 135789, -44399, 27299, -93078, -188788, -110543, -14661, 32075, -126139]
21987a26139k19075L3878J43752J74551j21705O0670J13203J59850j35905k24613
21977a41533k5684J88127M4831L6101k69974P075J50866J87083p0535m8720o5694
21966h057p942j02208J9038J31554j57395k12207N9351J80886j72650k4838L3222
21955b61246P1641O6315J62785K28385J09741J4005j17985j76196o614N2096r740
21944A33187J75M2696L723m291Q2015p1852k25087j33671j44856O5877J0425R2262
21932a49397J56102O0735n9592j6338r3356K3495J57123J78994j50479P6473j0359
21921A73401r9243L2214j51193o7855j3082J14326k6992N5731n7441O5707l3460
21910g887q3765M3717J28968J24465r6414j05104m8202J718j10027Q4622J02051
$$ y = [-126139, -345214, -311336, -167584, 6967, -114738, -54068, 59135, 218985, 83080, -141533, -167217, 20910, 65741, 101842, -168132, -161057, -10191, 176892, 106357, 57637, -8057, -15999, -118207, -99169, 32385, -125010, -337217, -277866, -96980, -269630, -294468, -261246, -189605, -123290, 39495, 267880, 377621, 391626, 273641, 97445, 90831, 142927, 133187, 133362, 176058, 179781, 175490, 257505, 185653, -39434, -173105, -317961, -252084, -241659, -149397, 6705, 67440, 7848, -8490, -101846, -78351, 78772, 257766, 107287, 183760, 173401, 74158, 106372, -44821, -112676, -125758, -11432, -38424, 17307, -40134, 25573, -7887, -91652, -47935, 81033, 205498, 109084, 3980, -44222, -42504, -152531, -67909, 34142]
21899C4142n0059k05601q0004J09555K6959P9938R5823k3353J14552J35167l6281
21888B00838j09366k6873J70701M8026k43884j05984J92635k7671j16214J1095
21878f697j6743J969k88N2919k9212O3104k35085j32226L081j32159J00904J49950
21866a80483K24143q3546j19201m9279J14392l4472M2653J60838M215K7750q7887
21855A9123M0112j762k5387n9386O272O4754k0452R1309L6979k680O8854j3193
21843B04543k41777j07502J10556L9835O2534J2269K9001l6350r4203J08709q5223
21832B392j31719q1510k38687L4042K09618J30587O7066K1393J96688j30158k35467
21821a55755p471J70329J09469N3741m1021j30811R2729R1390N6079J40738j63484
$$ y = [34142, -15917, -221518, -301522, -191967, -165008, -85070, 10753, -12600, 101952, 237119, 200838, 91472, 64599, 235300, 283326, 39442, -66542, 126093, 98422, -17792, -6697, -23440, -21471, -21759, 31160, 1948, 65052, -170033, -302259, -299178, -431337, -330433, -180483, 43660, -39886, -159087, -208366, -93974, -128446, -85793, 75045, 79260, 107010, 19123, 59235, 57473, 32086, -27300, -21028, 43726, 23274, 114583, 151562, 148882, 217736, 204543, -37234, -144736, -34180, 5655, 68189, 80458, 109459, 73109, -21094, 87615, 2392, -129327, -210837, -449524, -415482, -205864, -75277, -8211, 13182, 209870, 79712, -155755, -163226, 7103, 116572, 170313, 129292, -1519, 91210, 182600, 238679, 379417, 215933]
21810B15933l8420o6262l1541j51092k6520R1417j35212m310o2709J71385K01840
21799A64509r9967j79331q6742J10646Q344l7944l1570Q1949Q8003J51117j0049
21788A58965N9314Q3443j19460j68082j23203R130Q3046L2903j60705q2322R7422
21777a29549M4449j5934p942j9976J56838M0075M2378L4021K43071l7574k36533
21766A13324l5976J75841J21222k05991l00144q1890n0875o3077K16441J08177
21756b948q8494r682Q2875M5100r9048j27845p4179K2244K43142J31922J61960
21745B85047l9841Q73j55713j09021j45875o2553J10217J17241k11298M4609K06774
21734D0460J51210p2236l5918J52749P136k39123l7625K6706k1818Q6092m1843
$$ y = [215933, 177513, 111251, 79710, -71382, -97902, -6485, -141697, -146007, -208716, -37331, 164509, 64542, -114789, -201531, -90885, -82541, -120485, -152055, -70106, 17897, 169014, 158965, 218279, 301722, 182262, 14180, -109023, -99893, -16847, 16056, -144649, -226971, -129549, -85100, -101034, -108976, -128952, 27886, 67961, 110339, 144360, 387431, 349857, 113324, 77348, 253189, 374411, 168420, -131724, -213614, -264489, -327566, -111125, -2948, -91442, -101124, -18249, 26851, -72197, -200042, -274221, -251977, -8835, 123087, 285047, 245206, 246079, 90366, -18655, -164530, -227083, -116866, 375, -210923, -166314, 40460, 191670, 119434, 83516, 236265, 243401, 4278, -33347, -6641, -28459, 57633, 15790]
21723A5790O6808O6979p3976q5421K2770J84344j06052o4121m1266J27938M9485
21712A63278j57888l0896J07797l7677k08851R5860J12040j77792l9559n9930
21702b33618J0799l0418q8949n7779J06825J38471L6584j00307l29799p5225K04208
21691d19208K05095L22684K01375J83958l32513l06638q9163q2378P1169J78684
21681f6935J70401P8906p9137n9046j18838j36766q5734J69462k7996j16151L2161
21670b39673n6077N9493J43452k3621k4838R7109J27412r389n0526k0067J9508
21659B2783J1632R6468j20268r081p0287k7650L000j0129J42598J26788j75620
21648i766j6595l499K0150J82324j47471j37117K4583j56244r6002K15138R8417
$$ y = [15790, 82598, 149577, 75601, -9820, 12950, 197294, 91242, 27121, -14145, 113793, 163278, 5390, -25506, 82291, 44614, -164237, -68377, 43663, -134129, -173688, -233618, -222819, -253237, -342186, -399965, -293140, -154669, -118085, -218392, -548191, -623416, -419208, -214113, 108571, 309946, 493904, 161391, -145247, -234410, -316788, -245619, -66935, 103466, 182372, 103235, 44189, -74649, -211415, -297149, -127687, -155683, -271834, -239673, -295750, -236257, -92805, -116426, -141264, -44155, 83257, 73868, 23342, 3275, 22783, 34415, 130883, 10615, 1534, -68753, -96403, -93403, -103532, 39066, 165854, -9766, -26361, -29860, -9710, 172614, 25143, -111974, -87391, -243635, -339637, -124499, -26082]
21637b6082L6571k9323Q7113O7085j9266j09500J1954P6395j4015k42824j18920
21626b80812M5827K3645P6273j16390J49122J46625j05718l3309J18249O857j6999
21615A3370j06754j14254P3313j00540k3164j4107j19900p2689Q2598J30109J83618
21604f8400J43716K0527j73601k9244N8346P3612J07278j40130k06694j60782
21594c75372P4674J53715J02075J45163j50409m3578K9247K0010j50609r4032
21584b89116o391J38139J4465J1039n5561O651J1277r5820J83026O6619l3905
21573d9577N6400j33031J0506j13596r9251k2658o3106J47954K01674o7962j01065
21562b33712L8726q2384O999J11885N8118j0872M584J86029K04678l5452j42017
$$ y = [-26082, 10489, -18834, 68279, 135364, 116098, 6598, 18552, 94947, 80932, -161892, -280812, -234985, -211340, -135067, -251457, -102335, 44290, -61428, -94737, 23512, 30369, 13370, -93384, -207638, -134325, -234865, -258029, -272136, -392036, -464725, -382127, -252018, -68400, 75316, 95843, -77758, -107002, -48656, 24956, 132234, -7896, -214590, -375372, -300698, -146983, -44908, 100255, -50154, -93732, -64485, -44475, -195084, -289116, -295507, -157368, -142903, -131864, -187425, -180774, -169497, -265317, -82291, -15672, -49577, 6823, -126208, -115702, -229298, -328549, -351207, -414313, -266359, -64685, -132647, -233712, -194986, -277370, -270371, -158486, -100368, -111240, -106656, 79373, 284051, 248599, 106582]
21551A06582j8938J09597K2581n8704R5966k9610k69810q2875j4795P9927J402
21540e8677j05616k37258r1827J45217K75342J37122p5138j28007m6697n8279
21530b43818J13508O5647j73858N798r629m358n2579N2158J66773J09836J01885
21519A31363l6769j55467L0713J02662l1816r2097j13976j35277J34549O6717
21509i9398J5652o2333k06152m3982k9860J9636J73307P3227J8577P704J21166
21498a2456j28805k61394L1452J62220J46511K5082J02401K09980K6162k59983
21488D1170Q1401J14331j86135q3575J71390J27547j7964k5794n9317j16768N1110
21477I7396J10610M0271q1134j62955J54527N4711j22929j95030J07269J02994
$$ y = [106582, 87644, 197241, 219822, 161118, 257084, 227474, -42336, -125211, -140006, -60079, -58677, -164293, -401551, -493378, -348161, -72819, 64303, -10835, -138842, -185539, -243818, -130310, -64663, -238521, -232723, -242352, -246710, -299289, -247131, -80358, 29478, 131363, 94594, -60873, -30160, 72502, 40686, -51411, -165387, -300664, -166115, -99398, -83746, -146079, -352231, -396213, -426073, -406437, -233130, -159903, -141326, -133622, -12456, -141261, -402655, -371203, -208983, -62472, -37390, 65011, 274991, 301153, 41170, 122571, 236902, 50767, -32808, 138582, 266129, 248165, 222371, 163054, 46286, 97396, 208006, 248277, 167143, 4188, 158715, 213426, 90497, -104533, 2736, 105730]
21467A05730j41947p0613M12o147j1765m350J60849J1693j33764O303O1300j35991
21455a58290k04322Q0108Q1300l1373Q1566J08233Q2474q35j4524M09L0271j05810
21443e0793N147Q833J43793R4346n9299J46584K8343o0377j7258p0022j47688
21432B1609k45148N2002J29601P6263J1861n5855k12432j05453J70716K1072Q1816
21421e3948R3252J9683j24136M9456l1519j9026q8677R2896L894N7440J8617j63405
21409a45473j4787J8463N0874K43049J17149j29379j63381j25052K7968P1897
21399d8672N8463j6549j63433j77027J52677Q0841R9560R8091K4375J0768K15156
21388C34250l9468j40784j66078j0741J05071m4381o1674k9921M2458J13479j17521
$$ y = [105730, -36217, -106830, -106418, -112565, -124330, -128680, 32169, 43862, -89902, -83599, -22299, -158290, -362612, -282504, -201204, -232577, -151011, -42778, 39696, 38861, 24337, 24746, 55017, -50793, -45646, -36813, 106980, 201326, 142027, 288611, 316954, 256577, 239319, 169297, 21609, -223539, -171537, -41936, 34327, 46188, -9667, -222099, -327552, -156836, -135764, -53948, 39304, 58987, -65149, -15693, -47212, -66238, -154915, -62019, -58125, -685, 17932, -145473, -160260, -141797, -90923, 152126, 269275, 139896, -23485, -148537, -120569, -48672, 9791, -6758, -170191, -347218, -194541, -113700, -14140, 83951, 108326, 119094, 334250, 294782, 153998, -12080, -22821, 82250, 37869, -23805, -53726, -11268, 102211, -15310]
21377a5310r141l3154R8808j58344J56219Q1144j1179o1530Q6165j27394q5168
21366g8884N8910j05852j12045K9142J72868P0409J64758N6066p4604j12466j5928
21355E2374j6243J40147l2K6128j47057K0654J18822m2767k03209r2715N1357
21344i2541R6234j66935j2215K02038N6701j26686p1830j16422J7802N1311K5693
21333a36850J4111r3044j22390J68007J09614j01427J16164R7590J5290P2508
21323A39573p9595j37153k2264J5037k4290P1503L3329r1447n2643k7881R1954
21312h3877o2066k6193J42641O5550R5340q9084j96840p5718j2791Q7551n4685
21301b10172J59331Q1475j06520n1741J3909j14268j96875j41257O1652J49005
$$ y = [-15310, -24451, -57605, 41203, -117141, 39078, 120222, 109043, 47513, 133678, 6284, -78884, -19974, -125826, -237871, -208729, -35861, 34548, 199306, 255372, 180768, 68302, 52374, 36131, 176278, 176246, 202374, 55317, 75971, 194793, 152026, -51183, -143898, -92541, 3693, -163242, -175457, 26581, 83282, -43404, -115234, -231656, -213854, -162543, -136850, -122739, -215783, -338173, -170166, -60552, -161979, -45815, 51775, 67065, 139573, 59978, -77175, -99439, -84402, -108692, -37189, -3860, -95307, -147950, -175831, -83877, -145943, -172136, -29495, 36055, 131395, 42311, -154529, -230247, -243038, -155487, -210172, -50841, 30634, -75886, -127627, -113718, -227986, -424861, -566118, -504466, -355461]
21291c55461J15522M8993K3059j34232p5553K4192N91J75633J12333Q3589j44305
21280a25639R705N7411J27740J8403j24912J6722j15360j27957M3736J13527p6779
21269a83403r1895r542N1455J00456L7317k10391j28017Q8645J00297P2298J43718
21258b9062k3394q8621P5816K81496l2883r0273N8128O0366o4699j16321l3600
21247c047J22416N7439j04345l7885L6916M4578l201j59764j21541r0341l912
21236b62687J21148K0151j03837J95604K89419p338n9732J6025q1430J4427Q5584
21225B27334j58984l7564n8162q7897k08654P1832J78017J79853n1214l7133J2606
21214C0034J04322j38090m2515M7031j7018M4179n803O5541R5427o4334J76095
$$ y = [-355461, -239939, -190946, -167887, -302119, -377672, -353480, -352889, -177256, -64923, 18666, -125639, -115934, -58523, 69217, 87620, -37292, -20570, -135930, -263887, -220151, -106624, -183403, -275298, -284840, -233385, -132929, -95612, -306003, -434020, -345375, -245078, -172780, -29062, -52456, -141077, -65261, 216235, 183352, 93079, 151207, 211573, 146874, 30553, -3047, 119369, 176808, 72463, 34578, 71494, 116072, 112871, -46893, -168434, -258775, -262687, -141539, -121388, -225225, -29621, 259798, 252460, 192728, 208753, 127323, 141750, 227334, 68350, 30786, -27376, -115273, -323927, -252095, -74078, 105775, 54561, 17428, 30034, 134356, -3734, -46249, 782, -16236, 27943, 22140, 87681, 183108, 118774, 294869]
21203B94869M9392o5026O0646r5282m5794j87596j18387N6631J15497O6368j62134
21192c0816p8838K1402Q176J0290J35199J7579O6659p2947j23265j8411j32256
21181a97228K6870J35971M4867j69200j70344p2125N0276J04357J95317K68402
21171B17163O7657N307o2872j4924q7806J8895J06572L8369l0599j01552j70036
21160a3826q5589j27311m5615Q377N4186J31414j05928L5973o4668J25236M7690
21149d0061O2789k174j8869k8863P052Q6069j35491j66304m6402r8031k8563J45994
21137b62854R6434J6641J41092J35837J28007q587J6258R6552r0177o8829o5502
21126A34872j39248j32787k0821n2611O4200J92600L3743j08588j52266J04243
$$ y = [294869, 344261, 279235, 339881, 244599, 198805, 11209, -107178, -50547, 64950, 131318, -30816, -109654, -88252, -80076, -69786, 65413, 82992, 149651, 76704, -46561, -64972, -197228, -170358, -34387, 10480, -158720, -329064, -401189, -350913, -246556, -51239, 217163, 284820, 290127, 227255, 212331, 124525, 143420, 249992, 288361, 257762, 156210, -13826, -99415, -226726, -272341, -263964, -209778, -78364, -184292, -148319, -212987, -87751, -40061, 22728, 20554, 1685, -27178, -20126, 65943, -69548, -235852, -282254, -380285, -408848, -262854, -166420, -149779, -8687, 127150, 255157, 246570, 262828, 359380, 269203, 200374, 134872, -4376, -137163, -157984, -210595, -146395, 46205, 79948, -28640, -180906, -76663]
21116g6663J03430k50688j50295K2281J18891J26859K02889o0954p1525j36153
21106a71928j48576L4659J06132L9467n853P0390J69697L8940o9276k9602k64742
21095b30692l34482K1492J75161O0363J46612m070j08450J31179P9690j5677L5566
21084d3308k2015L7076J50879q8133j32430j22763P2891O3360J11730m6312m8643
21073f7668j23289N6779M1530n3433k6237k4238M6949k7843J43050K7663L5541
21062B8804j16490n5334q6313J64503J9587O6962j7258r0132M8545j5832N4615
21051A657j0377n4323n0702K1769N8049j25394j21026J23488K25504L10374Q0552
21040D59571q4651P1711M2433N6534O6722N6009j1782r2788n7245j07172j95951
$$ y = [-76663, 26767, -223921, -374216, -351935, -233044, -106185, 96704, 35750, -35775, -171928, -320504, -285845, -179713, -140246, -146099, -75709, 93988, 132928, 63652, 34050, -230692, -565174, -543682, -368521, -308158, -161546, -165616, -274066, -142887, -63197, -78874, -43308, -65323, -28247, 122632, 34499, -97931, -220694, -147803, -84443, 27287, -19025, -67668, -190957, -134178, -92648, -146081, -172318, -196556, -149607, -177450, -34400, -6737, 28804, -87686, -143020, -229333, -64830, -45243, 21719, 4461, -85671, -37126, -52958, 1657, -8720, -63043, -113745, -91976, -33927, -159321, -280347, -156859, 68645, 379019, 459571, 374920, 446631, 489064, 545598, 612320, 668329, 656547, 563759, 506514, 399342, 203391]
21029B03391j09353M1720O8412J92007O045j24483N2897J02091j14936J9479K24454
21018E61724j5241k96198k05738j9195j36434p2713P9706L1785n8127J45155J71065
21007A85789L6209j55126k4122j2214J38281l6276m0914k1967n6943p3698r7830
20996a58811J16729J2158R3420k414k3554r1480j11807k7486O0866j31654j59919
20985d23952Q6360K10803k2075j31864J395J34098J46427J77109N8409R485j84492
20974F1703q0311J22672J50208j46388j22581l1218L3883J77181J19812k9275
20964B55686j51118k22498p4188J22610m2017J09409P0829q0687m3923O2675J21043
20953A27821M6370j83982p003j71051R1296J29064k01866q5033Q4807q2801M6025
$$ y = [203391, 94038, 135758, 204170, 396177, 402222, 277739, 330636, 432727, 317791, 337270, 561724, 546483, 250285, 44547, 25352, -111082, -183795, -104089, -72304, -130431, 14724, 185789, 221998, 66872, 42750, 30536, 168817, 132541, 91627, 69660, 12717, -60981, -158811, -42082, -29924, 63496, 61082, 37528, -53952, -165759, -193245, -132379, -264033, -423952, -337592, -126789, -148864, -280728, -279333, -145235, 1192, 178301, 236710, 246195, 61703, -18608, 104064, 254272, 107884, -14697, -45915, -12032, 165149, 284961, 255686, 104568, -117930, -192118, -69508, -111525, -2116, 68713, -11974, -55897, 6778, 127821, 174191, -9791, -16794, -187845, -96549, 32515, -169351, -254384, -169577, -252378, -206353]
20942b06353o1000j06522j26073J90221K48638J32969q5850o5434M9165M2020
20932A1781L9276q2593l7703j8401q8007j03850n3108Q0662J23436q1520M0214
20921a69813K3753j08626K7960J48414J59077M7620o1875j8805O5748L3168n4260
20910I2361q1161n1988J9501m6279l5509P1705j21793k6427K25646K27004j80501
20899I2559j16310Q7385j31343j48973k5333P1539J06444P4668m7191q0740Q298
20888a08997N2994K1340q1152Q4009n1519R8777M4244j34526j86753J1471N0816
20877a99296L0343J18942M604j51032J5137N8727J61810p9816j9154N8878o4046
20866f4903k32168J13911J75868J9514k14981p4853K04819J87998n2617M5822
$$ y = [-206353, -267353, -373875, -499948, -309727, -61089, 71880, -13970, -79404, -30239, 11781, 51057, -31536, -69239, -87640, -175647, -279497, -332605, -251943, -128507, -210027, -169813, -146060, -254686, -226726, -78312, 80765, 128385, 66510, 47705, 113453, 146621, 92361, 11200, -40788, -21287, -67566, -103075, -31370, -153163, -179590, 46056, 273060, 92559, -23751, 63634, -67709, -216682, -242015, -170476, -64032, 10636, -36555, -117295, -108997, -56003, -34663, -115815, -31806, -83325, 15452, 59696, -74830, -261583, -250112, -199296, -168953, -50011, -45407, -196439, -181302, -122575, 39235, -40581, -59735, -857, -64903, -297071, -183160, -7292, 12222, -202759, -277612, -72793, 115205, 62588, 108410]
20856A08410j45127n7627m67j68829p970R9749j08375L1700K58103J41090K0537
20845A71194Q4687O6463j47222j09226K5392j68653k20491p005M9919N1603N6273
20834a47066P3142m4071j07293j03098J00308O3571k2197O0699K65977R9619j33201
20823A06390N1569L2428n503j5295j17115l4926N1276l1523j82742r8948J0080
20812b34309L3944J80113L3424K29700R0376k83450j57753j90940j45532R1957
20802c52470J88393K23093J05341k58154o8790M3763j431j3139J12289j386k6020
20791d8511M3835o4435k60658o030J64335K93448J5556j9245J26547J12594m551
20780C52885J6449Q7996L4697N0881K402l9148k07419r8435J2709O8804j48006
$$ y = [108410, -36717, -94344, -94811, -263640, -271610, -171861, -280236, -248536, 9567, 150657, 171194, 255881, 322344, 175122, 65896, 91288, -77365, -297856, -304861, -254942, -203339, -147066, -73924, -117995, -225288, -328386, -228078, -164507, -186704, -126005, 139972, 239591, 106390, 157959, 190387, 184884, 169589, 52474, 17548, 68824, 37301, -145441, -244389, -234309, -200365, -20252, 13172, 242872, 333248, 49798, -107955, -298895, -444427, -352470, -164077, 59016, 164357, -93797, -162587, -118824, -120255, -133394, -21105, -22491, -48511, -4676, -69111, -329769, -335799, -171464, 121984, 137540, 118295, 244842, 357436, 352885, 369334, 457330, 492027, 542908, 545310, 506162, 298743, 200308, 213017, 281821, 133815]
20769A33815m0578O6744P3222N4393J71801J4785k32302k28900r171O7976J5980
20758H7765j28245N4096M1304k15763N7521N6139r5273Q5911J57817L05358J4781
20747D21411m1990j32085K9881q9724j98076k376K73789n5622J07867J53306N4964
20736E21345q1985j19368L7695j82J54150j69054k07936p0285N4627k5222Q3578
20725A77363j27782j69195k53866j04589K60979L25024L8531J4521J07047q5528
20715A82505J4309O2971o5863j88048j14870K28593J95915j85872k51208n774
20705a27342R8507O7930j72148l5143J0260N3327O8381N6797l4733P5550L3100
20694I4486O0565m4789j3583o3631k01723j6756J14347J30572l6784M6281o3618
$$ y = [133815, 93237, 159981, 233203, 287596, 459397, 474182, 241880, 12980, 3809, 71785, 87765, -40480, 13616, 54920, -160843, -103322, -47183, -142456, -56545, 101272, 406630, 421411, 379421, 247336, 277217, 187493, -10583, -12959, 260830, 205208, 313075, 466381, 521345, 439360, 319992, 357687, 357505, 511655, 342601, 134665, 64380, 119007, 93785, 177363, 49581, -119614, -373480, -478069, -217090, 107934, 146465, 160986, 268033, 182505, 196814, 259785, 193922, 5874, -108996, 119597, 315512, 129640, -121568, -127342, -28835, 39095, -133053, -168196, -157936, -104609, -36228, 20569, -14164, 61386, 94486, 155051, 110262, 96679, 33048, -168675, -185431, -71084, 59488, 22704, 68985, 5367]
20683E367k6790m2390L9713J9607K5674M5946m6178p1147l9806k6191j35904q9374
20671c41473K68538L3000o7264j23872r7437J01060Q0711L3032l5491p4230M4017
20660a79409M0686Q8155J74156Q7783l2354r2917m7611j57060m9152R5125N7674
20649a4924R1652Q3673l1628q9158l0577J393J99430K8746j24723n0985J8299
20638H1198k29449j00270J69512O5710r9203P2811O9149j70805r1344J66589j32895
20627a98997j52345Q5010L5797J82800L4875J71765J4987j95418L666R3724N4480
20616A30344K45433L3956j60775R5412p5336j2017j09698l7240J14569r7751q8175
20605C8722Q7463Q9000j4786j19126j09151p9991l7461P3503n4752J04660K05288
$$ y = [5367, -21423, -63813, -24100, -4493, 21181, 67127, 20949, -50198, -90004, -116195, -252099, -341473, -72935, -39935, -107199, -231071, -328508, -227448, -146737, -113705, -149196, -223426, -179409, -138723, -50568, 123588, 211371, 179017, 86100, 38489, -118571, -167723, -72598, -14924, 76728, 160401, 128773, 39615, 9038, 10431, 209861, 238607, 113884, 62899, 81198, -148251, -248521, -79009, -13299, -112502, -39691, 29458, -141347, -232691, -66102, -198997, -351342, -266332, -230535, -47735, -12860, 158905, 173892, -21526, -17860, 75864, 130344, 375777, 409733, 248958, 344370, 269034, 257017, 147319, 110079, 224648, 126897, 38722, 126185, 215185, 200399, 81273, -27878, -107869, -145330, -71827, -126579, -21919, 183369]
20594A83369K9335j2389k58217l9358r7050o2457K16542J2965K31844L656n0420
20583A57820r8610J9627L5949m9588n2684j28755j32238m4508j4729m5889N8930
20572b94675N3818l6489Q1724J0269J8920n7098j0320M7097K32952K00302r9725
20561A46775j53528N5575q4893J5623J00736N5504J18841n5427j98388k2484J18864
20550I7198J66370J30155J4913O063j20882k61779j04793J60906Q9406N9845j31369
20539A06033j43588O5935K13902k4852j57980J23442K38845J00088o4048P3931
20529E31708n4131J14502m3606j34916r1221J53104L4704l8290L8357O0062K38640
20518H08913J29814J56881K60469K98862n8881j73234m8495K83813M7108p7329
$$ y = [183369, 212704, 200315, -57902, -97260, -194310, -256767, -40225, -27260, 204584, 208240, 157820, 59210, 78837, 114786, 65198, 12514, -116241, -248479, -292987, -307716, -353605, -294675, -240857, -277346, -195622, -185353, -166433, -223531, -233851, -186754, 46198, 246500, 146775, -6753, 48822, -36071, -20448, 80288, 135792, 254633, 199206, 818, -21666, 97198, 263568, 393723, 408636, 414699, 293817, 32038, -72755, 88151, 177557, 237402, 106033, -37555, 28380, 242282, 217430, 59450, 182892, 421737, 521825, 457777, 531708, 477577, 592079, 548473, 413557, 322336, 475440, 510144, 471854, 510211, 570273, 808913, 938727, 1095608, 1356077, 1654939, 1596058, 1422824, 1374329, 1658142, 1705250, 1627921]
20508A627921K4829J25901J6358K22104L47279K41771M32591L92025K78150J96976
20498C905905L11556L54483K90184L35829L63394N56751P70579R91347J202879
20489I082907J725012K278345L199746M842690P482777J1685583J7842412K2691895
20481H0831367J9172272N644419n844844n384038M110418J0533602M512863j0321552
20473A03254507j9732808j7264557r858370k321541N256800J3443363J9954566
20466I2731960J8272111N074498q149803q901777P57119Q180715L314916j1266263
20458A00013476k2019252k1763031j5621530j0107538o680519m512406l111803
20451A6197397k527528j900066j473729j305767p63698n26399p17941n26611m17036
$$ y = [1627921, 1652750, 1778651, 1795009, 2017113, 2364392, 2606163, 3038754, 3430779, 3708929, 3905905, 4217461, 4571944, 4862128, 5197957, 5561351, 6118102, 6888681, 7880028, 9082907, 10807919, 13086264, 16286010, 21128700, 28611477, 40297060, 58139472, 80831367, 100003639, 105648058, 99803214, 94419176, 98529594, 109063196, 113576059, 103254507, 83521699, 66257142, 56398772, 54077231, 59334031, 72777394, 92731960, 111004071, 116078569, 107928766, 99026989, 99784108, 107964823, 111279739, 100013476, 77994224, 56231193, 40609663, 30502125, 23821606, 19309200, 16197397, 13669869, 11769803, 10296074, 8990307, 8226609, 7700210, 6982269, 6455658, 6038622]
20442F038622l14064q0597k76448l17040l31067l52824l19151m03655k31020j28111
20432C284645r1102k26732k74214l2140k45827j53498Q8051o625l20509m8464
20422A973585k51802j16510j54785j62693j41981j45889j77441p5643l4416K2180
20412G34605K24287K6964k76703k28188R6176r2244N7584J73693j01118K3168
20402F38224m4236r1759j78355j9273J59526n4144K9728o6817N9919R0664k5277
20391D98200q7954n2489o3181J7588m278P185p2864j28966L774L8045L5995O9564
20379B60619N5199L5113J52012M769o6985j65471K1071o2946j22851j08598K1797
20368B3729n9957l3246o919P7036L06317J17995j03822j40395q9524r6036J30348
$$ y = [6038622, 5724558, 5643961, 5367513, 5050473, 4719406, 4366582, 4047431, 3643776, 3412756, 3284645, 3193543, 2966811, 2692597, 2660457, 2414630, 2261132, 2349183, 2342558, 2022049, 1973585, 1721783, 1605273, 1450488, 1287795, 1145814, 999925, 822484, 746841, 712425, 734605, 958892, 985856, 709153, 480965, 577141, 484897, 542481, 716174, 615056, 638224, 593988, 502229, 323874, 304601, 464127, 409983, 439711, 372894, 432813, 523477, 498200, 410246, 357757, 294576, 312164, 307886, 315071, 242207, 113241, 117015, 155060, 191055, 260619, 315818, 350931, 502943, 507712, 440727, 275256, 296327, 233381, 110530, 1932, 23729, -36228, -69474, -76393, 643, 306960, 424955, 321133, 180738, 91214, -4822, 125526]
20357A25526J76104J60063l6523j69651O7050J0909j74285l6025L38174K56344
20347G17686j11053K8903J18605q7447n1202q5299k00693R4537L0209O6683r568
20336E11361p8222N5869N7149Q9673j58447k77509j30281p6317l1095Q9910n2940
20325h49j73659K22213K19233k3742O703m3122P342j0922k05127J40190J06292
20314B44552K9487r9549m8703j8444j04406j77479N0686K04026O2330j12431K97
20303C0366J43065J02578j70382l1143l0924o1408j95418m5697J10440K12557
20293F4034J28263K9215p2317j51244J47017l028P0643L1601r412R6116o858O0852
20281C84882k2489j04130J92084L1353j25810j41901L8110k5781l9119j27330
$$ y = [125526, 301630, 461693, 425170, 255519, 322569, 333478, 159193, 123168, 461342, 717686, 606633, 635536, 754141, 666694, 615492, 530193, 329500, 424037, 454246, 520929, 511361, 433139, 489008, 546157, 635830, 477383, 199874, 69593, -6724, -37819, 52091, -849, -174508, 47705, 266938, 243196, 249899, 206777, 214119, 203197, -1930, 138260, 244552, 274039, 174490, 125787, 107343, 2937, -174542, -123856, 80170, 142500, 30069, 30366, 173431, 276009, 105627, 74484, 43560, -17848, -213266, -258963, -148523, 64034, 192297, 221512, 149195, -2049, 144968, 141940, 212583, 244184, 234772, 330888, 324030, 384882, 362393, 258263, 450347, 481700, 355890, 213989, 252099, 226318, 187199, 59869]
20271E9869Q4101K36868n9103Q6814P1165j32491j01183r9155K0399K35291J36766
20260E39341j74421K3810N4073j72788Q0157J80747N2048K02622J18818L04689
20250A209096K68497j96680k08844n0139J59208N585j66061P6053K91810L12860
20240A701385L14532J69086n8868L9269J18215J7225O2717N2785P1100K13129
20230B700575M01949M72166J23553K49934N66254O22073J013253J196186J711457
20221I057400K415866L354322N155504P987899J2497729J8103663K0013726J1125088
20213H9711197n387720j6091398j5476421r507775l753466J416350O841308J3468804
20205F1220879J8433755J4465870r69872j6428706k0449092j5949554j0114409
$$ y = [59869, 143970, 380838, 321735, 408549, 479714, 347223, 246040, 146885, 167284, 402575, 539341, 364920, 388730, 442803, 270015, 350172, 530919, 582967, 785589, 904407, 1209096, 1477593, 1280913, 1072069, 1021930, 1181138, 1186723, 1020662, 1096715, 1388525, 1701385, 2015917, 2185003, 2126135, 2165404, 2283619, 2300844, 2363561, 2416346, 2487446, 2700575, 3102524, 3574690, 3698243, 3948177, 4514431, 5136504, 6149757, 7345943, 9057400, 11473266, 14827588, 19983092, 27970991, 40468720, 58572383, 78586109, 89711197, 84323477, 68232079, 52755658, 43247883, 39494417, 40910767, 47752075, 61220879, 79654634, 94120504, 93150632, 76721926, 56272834, 40323280, 30208871]
20198C0208871o438831m163756k610688j515514q69867k86453L00569J279712
20190A5904043K132604L650257N769755R646230J5632055K0805214J8388791M266568
20182I6195517j2413011j8636625j4488533p750428j951984L310622R598289J6084710
20174F9948557J8275082Q774530q819192k0102258j9610266j3912890q984002
20167B5569561n852982m056449k740578k058942j621565j097343r65305r22674
20159F253723o17899n81854l91197j33220l12106k87944m9243j43768m25461k64751
20149C046280Q4075N6177k74335l31125r5350j0494l3833j52666j66830j41005
20139A980894J2717q0424k68074j57470r1663n8878k24035k13582O185K14596
$$ y = [30208871, 23770040, 19606284, 16995596, 15480082, 14610215, 14323762, 14624331, 15904043, 18036647, 21686904, 27456659, 37102889, 52734944, 73540158, 91928949, 96195517, 83782506, 65145881, 50657348, 42906920, 40954936, 44265558, 53863847, 69948557, 88223639, 96998169, 88178977, 68076719, 48466453, 34553563, 25569561, 19716579, 15660130, 12919552, 10860610, 9239045, 8141702, 7176397, 6253723, 5635824, 5053970, 4662773, 4529553, 4217447, 3929503, 3880260, 3736492, 3311031, 3046280, 3130355, 3186532, 2912197, 2581072, 2485722, 2475228, 2441395, 2288729, 2121899, 1980894, 1993611, 1913187, 1645113, 1487643, 1395980, 1337102, 1113067, 899485, 905670, 1120266]
20129A120266k918l958j53663k55131P8028q322L627l646j68747k04018k22853
20118A78665l4412K62548K27924J4861L7496j23983q1361J76493O230J48562j50932
20107F62091r1921j82846l8106R9608N9733k3294M678M1627k6403m9269j87715
20096B68183J8097P9831J0915j29463K6154K04077m0360j6216j6446J8058j6441
20085D06389q1972k04127M8662M2516j7453L3365J37826J26625j21606j31435
20075B38790l4324L6275J5408k4499o284L9012J7379j09800P0746k6924L9048
20064B54827j27912P134L8921n4856K8682m7619R8682J4824j26185k9480J3246
20053G0264M6492P303l7923m6165J7410J28769j3135J88108P2236k22713j33928
$$ y = [1120266, 1117348, 1113390, 959727, 704596, 782624, 774302, 777929, 774283, 605536, 401518, 178665, 144253, 406801, 634725, 649586, 687082, 563099, 481738, 658231, 664461, 813023, 662091, 570170, 387324, 349218, 448826, 508559, 485265, 489943, 531570, 505167, 455898, 268183, 286280, 366111, 377026, 247563, 273717, 477794, 437434, 421218, 404772, 422830, 406389, 324417, 120290, 168952, 211468, 194015, 227380, 365206, 491831, 370225, 238790, 204466, 240741, 256149, 231650, 225366, 264378, 281757, 171957, 242703, 215779, 254827, 126915, 134049, 172970, 118114, 146796, 99177, 197859, 212683, 86498, 57018, 70264, 116756, 124059, 86136, 39971, 57381, 186150, 173015, 361123, 433359, 210646, 76718]
20042G6718M6005J34285m3103p1516m6236K68408K9321j48219j02002Q3859n2108
20031A75412J4778K4826k5770k27365j91390M224m5447J60367o937K1809n7343
20020a52836m2927J15009L234J64658J39492q5744j38892M6919J29482O0568r2196
20009A46767q0975N4618K1079p1426k025J810j77704j38L8910P2128J79978J37424
19997C20446o2373q1790J45640K3602j98028j58983n5402O416Q5385R9079Q7534
19986B11526P1455l8608r5988N554j23804j54624j7256K0846m9192N0700N0646
19975f8745j3366j5875q8067P5869L1338r3862N7285K29507O5906k67638j66212
19964b53860J36366P4395J19659K7871j18167k57218K3294K91332J19784k7772
$$ y = [76718, 122723, 257008, 213905, 142389, 96153, 364561, 393882, 245663, 143661, 227520, 175412, 190190, 215016, 189246, -38119, -229509, -225285, -270732, -110365, -117302, -95493, -152836, -195763, -80754, -77520, 87138, 226630, 140886, 1994, 48913, 178395, 238963, 146767, 65792, 120410, 141489, 70063, 68038, 69848, -107856, -107994, -69084, 3044, 183022, 320446, 258073, 176283, 321923, 345525, 147497, -11486, -66888, -60472, 24913, 123992, 211526, 282981, 244373, 148385, 153939, 30135, -124489, -141745, -120899, -170091, -119391, -68745, -82111, -97986, -186053, -110184, -78846, -172708, -115423, 114084, 179990, -87648, -253860, -117494, -43099, 76560, 104431, -13736, -270954, -247660, 43672, 163456, 135684]
19954A35684p0133N3426L1302j55057P71m1686O8305J13708j08464L6829n7826
19943F859R5121R7339j14991p2004l4884l3443K83584q0219l9083m329k2378q9798
19931h226j50204J2013O1974P7586J967j4364J40225N2205J37774k3747j63150
19920A24053P8949P3106j0773j97478R3512K53825K0401M1926O2951m9881K12176
19909G02767k423k15403j21317M9270n1824j30105P3398Q1137K25565O3875K9969
19898G04909J92787k00606N5843j1113p6264j07417k82265k15333n7753M175R0609
19887I7572n4791k3891K53423J8877n3978J4729j23908j23211j04598M4202q4513
19876a40087K9496j17869j35413P4292m1922J98619J50335j31189N5909J15325
$$ y = [135684, 65551, 118977, 150279, -4778, -4007, -45693, 22612, 136320, 27856, 64685, 6859, 101980, 199319, 84328, 12324, -22560, -56003, 227581, 147362, 108279, 103950, 81572, -8226, -158430, -146417, -84443, -6857, -4890, -19254, 120971, 173176, 310950, 287203, 124053, 203002, 276108, 265335, 67857, 161369, 415194, 435595, 477521, 540472, 490591, 702767, 700344, 484941, 363624, 412894, 361070, 230965, 304363, 385500, 611065, 674940, 704909, 897696, 697090, 752933, 741820, 665556, 558139, 275874, 60541, 2788, 6963, 97572, 42781, 18890, 272313, 291190, 237212, 251941, 128033, 4822, -99776, -55574, -140087, -110591, -228460, -363873, -289581, -331503, -132884, 17451, -113738, -57829, 57496]
19866E7496P0645Q9525J12395j77816k24563k503P241M1594J17529l0828l8210
19855B2505m5589l5928j6364L8089m1480p8728q2460q8925L6753J39434J32025
19844b0668j38299j73319J69978J42137J12674J1331p4780M148R3834J94653J7555
19833C39244j34616r6708N1238r222l36344Q1060J04603j15007j15157m6667N1298
19822b26278J88387p9943M4142m6192j6539j08570O9637P4321J56175j05495r7019
19811a47374j70875Q8345M8353N0993P4668j69500n8457N2559J10744R6603J54187
19800A30246J6140m5287n2455O002j22740j95702j93636j12297P0419J71992Q3378
19789b43940Q9453J12456J7952k6853r8365j04893M7116J01578K0938K7186J73309
$$ y = [57496, 128141, 217666, 330061, 152245, -72318, -74821, -67580, -25986, 91543, 60715, 22505, -23084, -59012, -75376, -37287, -78767, -157495, -239955, -328880, -292127, -152693, -20668, -158967, -332286, -162308, -20171, 92503, 103834, 29054, 33202, 127036, 321689, 339244, 204628, 107920, 159158, 149936, -186408, -105348, -745, -115752, -230909, -277576, -226278, -37891, -117834, -73692, -119884, -136423, -244993, -175356, -101035, 55140, -50355, -147374, -318249, -229904, -181551, -130558, -55890, -225390, -283847, -231288, -120544, -23941, 130246, 146386, 101099, 48644, 54646, -68094, -263796, -457432, -569729, -499310, -327318, -243940, -154487, -42031, -24079, -50932, -149297, -254190, -207074, -105496, -84558, -57372, 115937]
19778A15937N4054k06697j59885J08451l235k0534M0373q0262J4268J57529k4805
19767d806j32023p9932O5564J24916K43493j16129j83134J12763Q121l3432O7187
19756G2588O903j49934k22766M1202J40870J09648J23689r1122m4677L2313O2257
19745H0971J41291J4383M0983k3031j51279J1016j5296L8238P324k2247n8776
19734F3577k1781Q552M3576n500n0939J6659o6308J7151m1807n9173J5891L183
19722g6919R4679M9607o869J1080o2672p0079J24467J36112k4974J18091P2170
19711C64693j25614k7306J1034k2668P405q8678j34274o4421k02851L1655J22792
19700a28233K94564P6017j35719m3694L2024k9277r197Q3957q7024j07372j43323
$$ y = [115937, 169991, -36706, -196591, -88140, -91375, -111909, -71536, -151798, -137530, 19999, -4806, -136829, -216761, -151197, -26281, 217212, 101083, -82051, 30712, 38833, 5401, 72588, 79491, -70443, -293209, -252007, -111137, -1489, 122200, 31078, -13599, 18714, 80971, 222262, 236645, 277628, 254597, 103318, 114334, 99038, 137276, 144600, 122353, 63577, 41796, 50348, 93924, 88424, 37485, 54144, -12164, 4987, -36820, -95993, -80102, -76919, 17760, 67367, 60498, 71578, 8906, -61173, 63294, 199406, 174432, 292523, 364693, 239079, 211773, 222807, 200139, 207544, 118866, -15408, -79829, -282680, -251025, -128233, 166331, 242348, 106629, 62935, 94959, 65682, 56485, 140442, 53418, -53954, -197277]
19689a97277K8770K15514J8531r6057j23582j24551l9878J11424Q229n8326L3528
19678b23675M5108J29811N2139j10025J92695N5361j4441l8314k7852j65365m4254
19667a48812j9667K9941J50483P3247M2104j91348n893J22083n1786J75842K07476
19656C83670K04723r1929j28500k1045j10742r2575L5356j03681N1207j21826
19646D658J36027K11973J08539j17020k77N0952M109j6120k4345j32178K9322
19635B55640R4150O4457J01685J0721j12585j09215j19388q0686P1599n474j06428
19624F4476j12591o5269R1602J14708n0408r0582L31126N0905M7252K72390p2438
19613E81171l100P1161j35218l2395k9188l1609o921p6573R9863J08607R8669
$$ y = [-197277, -168507, 47007, 65538, -30519, -154101, -278652, -318530, -207106, -198877, -257203, -223675, -178567, -48756, 3383, -106642, 86053, 141414, 126973, 88659, 60807, -104558, -148812, -168479, -138538, 11945, 85192, 127296, -64052, -69945, 52138, 352, 176194, 383670, 588393, 496464, 367964, 346919, 236177, 143602, 178958, 75277, 126484, 4658, 140685, 352658, 461197, 344177, 343900, 394852, 398961, 382841, 358496, 226318, 255640, 349790, 414247, 515932, 526653, 414068, 304853, 185465, 104779, 176378, 170904, 64476, -48115, -113384, -21782, 92926, 42518, -48064, 283062, 333967, 381219, 653609, 581171, 578071, 649232, 514014, 481619, 452431, 420822, 413901, 337328, 437191, 545798, 644467]
19602F44467P1315r8493N4985m6492k08544k83406k6346O9693j04557o8765O0775
19591F4632J71451q4916k27089m1321J94412M5805j79494k41804Q9605J86652
19581b2067k3299j2689J60275r6240m7140O3537l1155m4252l2228j30158J26824
19570h8592J70012m4699J29689L04833o8311l9760k6858n4815j37545m5429j45078
19559d6553R0154J4566L4492J76902k5058N9922q5975J9024J59906J02252J0228
19548E09860k03549m4256j07894p3334r934J13182J07714j7727J45224k2307j03267
19537B93712j28844l0313N5794L1263j8538j19745j85578o0613J13161K05845
19527A56144O8239P397j6112j32615k3398n7908o3387K5612N3224j14896k35427
$$ y = [644467, 715782, 617289, 672274, 625782, 417238, 133832, 107486, 177179, 72622, 3857, 64632, 236083, 151167, -75922, -117243, 77169, 122974, -56520, -298324, -208719, -22067, -45366, -58055, 102220, 5980, -41160, 22377, -8778, -53030, -85258, -215416, -88592, 81420, 36721, 166410, 471243, 402932, 363172, 336314, 281499, 143954, 98525, -46553, 43601, 58167, 92659, 269561, 244503, 304425, 218450, 237474, 397380, 499632, 509860, 306311, 262055, 154161, 80827, 70893, 184075, 291789, 274062, 419286, 396979, 293712, 164868, 134555, 190349, 221612, 203074, 83329, -102249, -162862, -49701, 156144, 224383, 231780, 215668, 83053, 59655, 1747, -61640, -36028, 17196, -97700, -333127]
19516c33127J10526m9190Q1147K12373L8325P3819N3665j07798q927j09808n4137
19505i3132M6479J72241J5768m0063K5258j73785p5118R9798o1056r7924P1103
19494a10431m2656J09946M997j87849O5481J32951L3566N3506m2620j9218J53550
19483A51223L0622p321P8144M2348j20215k26691M6843k6593j55125n2312N6926
19472a82151L0206n9406o1559m5852N4816O9427L3815P0309j2541M2903L5827
19461b4206j07879j50889n6303K8617L0532J17810J66369L3178K1619l4329K813
19450B7332M5554r9646J14781K1430n2003Q1775l9504j24033j81359N1701R1475
19439f2497J56512q2232p2227n4785n6000n6348j06677O3661K55613J59593k28293
$$ y = [-333127, -222601, -271791, -190644, 21729, 60054, 133873, 187538, 79740, 70813, -38995, -93132, -46653, 125588, 141356, 101293, 126551, -47234, -122352, -22554, -83610, -181534, -110431, -153087, -43141, -38144, -225993, -160512, -27561, 6005, 59511, 16891, -2327, 151223, 181845, 174524, 252668, 295016, 174801, -51890, -5047, -31640, -186765, -239077, -182151, -151945, -211351, -272910, -318762, -263946, -194519, -160704, -90395, -102936, -60033, -24206, -132085, -282974, -339277, -310660, -280128, -162318, 4051, 37229, 58848, 24519, 27332, 72886, -26760, 88021, 109451, 57448, 139223, 99719, -24314, -205673, -153972, -62497, 94015, 11783, -60444, -115229, -171229, -227577, -334254, -270593, -14980, 144613, -83680]
19428h3680l6324P4906o8635j8114k4152L41O6941Q6853k469O4353N3753Q8779
19416B02552j90683o1981J39105j2342j15912j42563n4740l0637m3824J59583
19406a51442p0195r8523L711p5414P8446J46604J81662K0679j8990l8980n2875
19395g5317k3982J04271j4886j65155p607M0319j18015l2604o4287Q2663J33395
19384a41205P1261N943P2678r0411J21868Q3634m1940r6465r4115P7039R6323
19373F4610j25410j26639J238K9439K3296N6249Q2117Q6614O9720k2393p007p647
19361A24187J475p0994J49501N7165r9210j61230p6403q8521j17523J57490j3471
19350a37534M9485j9288j09054p1780p1528M9427O7935J17296R3144j31234m7699
$$ y = [-83680, -120004, -45098, -113733, -131847, -155999, -155658, -88717, -1864, -4333, 60020, 113773, 202552, 11869, -50112, 88993, 76651, -39261, -181824, -236564, -267201, -311025, -151442, -221637, -320160, -316449, -391863, -313417, -166813, 14849, 35528, 16538, -22442, -75317, -99299, 4972, -9914, -175069, -182676, -142357, -260372, -292976, -357263, -274600, -141205, -69944, -64001, 8677, -81734, 40134, 123768, 81828, -14637, -108752, -31713, 64610, -60800, -187439, -186201, -156762, -133466, -77217, 4900, 91514, 161234, 138841, 131834, 124187, 125662, 54668, 204169, 261334, 162124, 894, -75509, -164030, -281553, -124063, -137534, -88049, -107337, -216391, -288171, -359699, -310272, -242337, -125041, -31897, -163131, -210830]
19339b10830J46424P0544m4574j51019n717n0724j03272J20129J15719K0712O0473
19328c2135j2691J53913p009m8169m2199n351n9019k0686J34521J17252R0570
19317B68997q0563m98M3309p2541M5922Q2548J2995p6594J0546k10377r872l9451
19305b5579L9720k5491M0276j41718J7522J75338N8781p3039j89239j4267k2363
19294a60059M5491J44364j6205k10846m1129Q9776k7672N1906J2714J7037O3384
19283c1239o7561j65233l5546J97063Q7664m7132p4666J08639M7952O9347N0294
19272A39582j20262L2551m7917o0637J38457l4304m066j34578J03612J00832L4119
19261A47389j35656P9826j18895n5465n2475P0044n4400k81211j87972J32831
$$ y = [-210830, -64406, 6138, -38436, -189455, -195172, -245896, -349168, -229039, -113320, -92608, -32135, -44826, 109087, 102078, 53909, 11710, 6359, -52660, -73346, 61175, 178427, 268997, 188434, 187936, 231245, 158704, 204626, 287174, 300169, 223575, 234121, 23744, 13872, -25579, 14141, -11350, 28926, -112792, -95270, 80068, 138849, 65810, -123429, -137696, -160059, -114568, 29796, 13591, -197255, -238384, -148608, -176280, -124374, -111660, -94623, -31239, -98800, -264033, -299579, -102516, -14852, -61984, -136650, -28011, 19941, 89288, 139582, 19320, 51871, 3954, -56683, 81774, 47470, 43404, -91174, 12438, 113270, 147389, 11733, 91559, -27336, -82801, -135276, -65232, -119632, -400843, -588815, -455984]
19251d55984P3588J62514K37501K4046j74616m0885J18858Q0600J04056j16564
19241A3114n3749j3241p670j13780j3377L0979M5212K9089K57801K2318k60327
19230f3631j27909P6344J96498J00160r5489j07174R693J70494j3656j85324R481
19219c0513J7877n9069k3510J22327K4198R025r8094P6445j76063J77261J68876
19208B08760k4316N1224Q249K0637n1705r7834L8174r1726j32831Q5344N2951
19197F6927K59370J67417j18339k05003N0460K19998n5439r0875j22522o0512
19187A11482n0960M4001N6483l6778j10147p3457o7104J37858K7764m3456Q7330
19176H3016J47524J6795J5861O8701j22526j36853P3616o4928o7549M3883O7785
$$ y = [-455984, -382396, -219882, 17619, 41665, -132951, -173836, -54978, 25622, 129678, 13114, -40635, -53876, -61546, -175326, -188703, -157724, -112512, -83423, 174378, 196696, -63631, -191540, -115196, 81302, 181462, 85973, -21201, -11508, 158986, 145330, -39994, -30513, -12636, -71705, -95215, 27112, 51310, 60335, -37759, 38686, -137377, 39884, 208760, 184444, 235668, 243917, 264554, 212849, 115015, 153189, 61463, -71368, 13976, 66927, 326297, 493714, 375375, 170372, 220832, 440830, 385391, 294516, 171994, 111482, 60522, 104523, 161006, 124228, 14081, -59376, -126480, 11378, 39142, -4314, 83016, 230540, 247335, 263196, 331897, 209371, 72518, 146134, 81206, 13657, 57540, 125325]
19165A25325n5081n4367n3588p8897K8659J66311M2515l5703o0597K17514m4067
19154A98024j73202p4840l3647j05851R7622K8187J28824J35728M6284j67653
19144G9476l6951N2010J33811J26004J2530k0449K15825J17443n0093M7735J35576
19133H12917O7967L4755L2048J28666J24282R7583J60685Q2804J9839K99975M08335
19122B269856L06523L83157M39293K19025N63486Q40544J204328J872622K986883
19113A1085717N806290J0683003J5801674J3210809k798432j4205339j1832304
19106B7751418o308977k537020K16976L117700P460045J3338540J6554704P019388
19098F6612774p516921n924746M593127P783342m403504j5708349j3433085p734900
$$ y = [125325, 70244, 15877, -37711, -116608, -87949, 78362, 120877, 85174, 24577, 242091, 198024, 24822, -50018, -83665, -189516, -91894, -63707, 65117, 200845, 247129, 79476, 42525, 94535, 228346, 354350, 366880, 346431, 562256, 679699, 629606, 677341, 812917, 880884, 915639, 947687, 1076353, 1200635, 1298218, 1458903, 1541707, 1561546, 1861521, 2269856, 2576379, 2959536, 3398829, 3617854, 4181340, 5021884, 6226212, 8098834, 11085717, 16892007, 27575010, 43376684, 56587493, 53789061, 39583722, 27751418, 21442441, 18905421, 19122397, 22240097, 29700142, 43038682, 59593386, 66612774, 59095853, 53171107, 57764234, 65547576, 61144072, 45435723, 32002638, 24267738]
19090B4267738l870427r27859J812159N671130J1018816J4115224N363332j1231995
19082D6218118j5275453j0101340n715014l473811k057012j374733j136275q47737
19074F236743l93025K14221L69069J40988J31329L48124M91527Q70708R91819
19065I401503J460108L153471O216684J1001044J6997700J6373222m42641j5928682
19057D8232409j4485323p791974l517753l83062K905562P335166J3673029J8058932
19049F4026986J0103767o485763p214324M338526J0139370k374541j7939606j6964203
19041C7630212r855130m696487j412730J627238N686828J1253153J5708192Q259265
19033F4200541j0704463j7755060j2474831p218560m330686k695801j722082r39634
$$ y = [24267738, 20397311, 19469452, 21281611, 26952741, 37971557, 52086781, 57450113, 46218118, 30942665, 20841325, 15126311, 11652500, 9595488, 8220755, 7084480, 6236743, 5843718, 6057939, 6427008, 6567996, 6699325, 7047449, 7538976, 8409684, 9401503, 10861611, 14015082, 20231766, 31232810, 48230510, 64603732, 64161091, 48232409, 33747086, 25955112, 22437359, 22054297, 24959859, 32295025, 45968054, 64026986, 74130753, 67644990, 60430666, 64769192, 74908562, 72534021, 54594415, 37630212, 27775082, 23078595, 21665865, 23293103, 28979931, 40233084, 55941276, 64200541, 53496078, 35741018, 23266187, 16047627, 11716941, 9021140, 7299058, 6359424]
19025F359424p73688p07663n36128m01166l95784l67008k46882j78655j07034
19016B645416r2689j92762j86465k97995l67028k70995j67501J49717J4015J3418
19006A247131j9624j09030J44841r4064l5138p8879N3997j29261j46092j10543
18996G23338J46789J94904L07j05064l4088O631J17788K0137J08823k6255p2514
18985A080796j42475R6028j21625k45076m1758n4333r6720O3991K9958K23532
18975G92318J14983j42406j81862o224L2211P0678o5694J6775j56446j37750Q1181
18964D17764L9093j99234j4386k2008J2715P3852n845K316J30623R679N421J48437
18952E98427l3922j9092n2491k2435P1250R5684K39129K1063J2604j5469M6957
$$ y = [6359424, 5585736, 4878073, 4341945, 3940779, 3544995, 3177987, 2931105, 2752450, 2645416, 2552727, 2359965, 2173500, 1875505, 1508477, 1237482, 1069981, 1219698, 1233713, 1247131, 1227507, 1118477, 1263318, 1169254, 1134116, 1055237, 1109234, 979973, 833881, 723338, 870127, 1065031, 1065338, 960274, 926186, 932817, 1050605, 1070742, 1179565, 1153310, 1080796, 938321, 1034349, 912724, 667648, 625890, 571557, 474837, 538828, 568786, 792318, 907301, 764895, 583033, 576809, 609020, 679698, 614004, 630779, 474333, 336583, 417764, 456857, 257623, 243237, 221229, 233944, 307796, 301951, 304267, 434890, 444569, 449990, 598427, 564505, 545413, 492922, 470487, 541737, 637421, 876550, 897613, 910217, 894748, 941705]
18941I41705o8300m1346N070k72187n1127N8100k8085P0748o2996M7710J97363
18930G96655j0109j9162J57269n3493j84663j64242M200n0288j15760j18252P1459
18919C13614o1994j91648R2395N9091J9549m7534k4572J98702Q741k05703J13701
18908B74342j33114j28684J36654o2088m0037k6827L9711N6598j73697o0516J67464
18897D9806n976J718M6338o8151J01922j27787l1914j3013J71240O0305p507L0799
18885B07780M352n7165j08676j64543R613J48155m6518j06192k7225J41688J8960
18874B0229R6036J52813J60411m6279k2327K5967j52947j46773l5765P6420P0915
18863A98700R208q8671L7028J08592O9644j53136l9914l3970j17481j8997K1524
$$ y = [941705, 873405, 832059, 837129, 564942, 513815, 571915, 543830, 614578, 551582, 599292, 796655, 786546, 767384, 924653, 871160, 686497, 522255, 526455, 476167, 360407, 242155, 313614, 251620, 59972, 152367, 211458, 231007, 183473, 158901, 357603, 366344, 160641, 274342, 141228, 12544, 149198, 87110, 47073, 20246, 59957, 116555, -57142, -117658, 49806, 43830, 45548, 91886, 23735, 125657, -2130, -34044, -47057, 124183, 184488, 176981, 207780, 212132, 154967, 46291, -118252, -108639, 39516, -7002, -113194, -140419, 1269, 20229, 116265, 269078, 429489, 383210, 360883, 386850, 233903, 87130, 51365, 127785, 198700, 207908, 119237, 156265, 264857, 334501, 181365, 141451, 107481, -10000, -28997, -7473]
18852g473J45079N4287j7693q0295M5034O7870Q7564k1318j18148j05219J22418
18841A72106K02888O6416Q5312m4652j29133j10626K1707N2061J87094J26930
18831F30103n8472m8161q3044k41680q7947J76317N0427J50501N5579o1941L9798
18820E21480l3479J42788j09172j07821J10267j18530j97836j11075J1223L9431
18810A47276q8610L8027P9637J45076m1123j1568k3535m6643J6491m0197J10658
18799B85489J98765P0251l211p3958o2957L0004M7421J05132q9697j08996p0692
18788C27551n8884Q4749j8688j59151r5027J24148J32201m0449L1122Q6951O4961
18777D79484L1695L4045J6889J0336k712N0525K733K33665l1027L78867Q79560
$$ y = [-7473, 137606, 191893, 174200, 93905, 138939, 206809, 294373, 273055, 154907, 49688, 172106, 374994, 441410, 526722, 482070, 352937, 242311, 264018, 316079, 503173, 630103, 571631, 523470, 440426, 198746, 110799, 287116, 337543, 488044, 543623, 481682, 521480, 488001, 630789, 521617, 413796, 524063, 405533, 207697, 96622, 107845, 147276, 58666, 96693, 176330, 321406, 280283, 268715, 245180, 198537, 215028, 174831, 285489, 484254, 554505, 551294, 477336, 414379, 444383, 491804, 596936, 507239, 398243, 327551, 268667, 353416, 334728, 175577, 80550, 204698, 336899, 296450, 327572, 414523, 479484, 511179, 545224, 562113, 572449, 569737, 620262, 622995, 856660, 825633, 1204500, 2084060]
18766B084060L24805o74173p04455m58379m30134j39529m602n0663L2342M2761
18756B2033J13261k1252R4524J31317L0805j20200k547K7555M4354R6729p0432
18745C46147j69796R2742J9953M2565K7976k401J04043k12475M3873r075L5927
18734C19479j2301m5728k1676o250j8122k164l4444j1629N2175l1406o1488j66047
18722c9601Q8835O6996N5118k2581r4286n0288K2995o922P6603j12065j56705
18711a71901m2767P4981L0305k6890K8193J64270M7242K8934J2344L6842j01300
18700H0253Q0765O4034R3569Q3025R6123J06473j21336j6935o4981n2356R0826
18689D39460N9426L063P8201P6184n4856Q1206J34063M6239n6454r9097J32940
$$ y = [2084060, 2408865, 1734692, 1030237, 571858, 141724, 2195, -2407, -53070, -20728, 22033, 135294, 114042, 208566, 339883, 370688, 250488, 247941, 275496, 319850, 416579, 346147, 176351, 269093, 289046, 331611, 359587, 357186, 461229, 248754, 292627, 283552, 319479, 307178, 261450, 239774, 233524, 215402, 213238, 178794, 167165, 219340, 187934, 126446, -39601, 49234, 116230, 171348, 148767, 54481, 4193, 27188, 20266, 96869, -15196, -171901, -214668, -139687, -109382, -136272, -108079, 56191, 103433, 132367, 144711, 181553, 80253, 161018, 225052, 318621, 401646, 497769, 604242, 482906, 465971, 400990, 348634, 439460, 498886, 501949, 580150, 656334, 601478, 682684, 816747, 862986, 806532, 707435, 840375]
18678H40375K71343J34215o2501O9511j35168r0299J46819L73001M31669O36833
18668B615798J001233J179025J123700P37007J12234l39679o79503o28041q31743
18659D290031q73883m64237j01656J27827K41395K22753J23551K0809j35462r3182
18649C357946j98553j68251R7152K19576K56363P5733m9599J27993M96577O79996
18639D894933O38838R33554J622049K513621L114484L312881K645417Q95729o85419
18630A9886087o88255M92186K966662O154478J0916514J8414427K5874964K7801905
18622A11818968K0181594M017390q844103j0988608q521121q931437j3119405
18615H5613278j4562528j1579819n844846j19972L654506M497234J864898l972652
$$ y = [840375, 1111718, 1245933, 1183432, 1252943, 1117775, 1027476, 1174295, 1547296, 1978965, 2615798, 3617031, 4796056, 5919756, 6656763, 6768997, 6429318, 5749815, 5121774, 4290031, 3416148, 2951911, 2850255, 2978082, 3219477, 3442230, 3565781, 3586590, 3451128, 3357946, 3159393, 2991142, 3088294, 3307870, 3564233, 3639966, 3590367, 3718360, 4214937, 4894933, 5533771, 6467325, 8089374, 10602995, 13717479, 17030360, 19675777, 20571506, 19886087, 19197832, 19690018, 22656680, 28811158, 39727672, 58142099, 84017063, 111818968, 132000562, 136017952, 127173849, 116185241, 107664120, 98732683, 85613278, 71050750, 59470931, 53626085, 53506113, 57160619, 61657853, 63522751, 59550099]
18607E9550099r379540j0826915r344297o794219m322616k607685j634896j234428
18599A3405503j113322p26781n95793m1976K79723J42791J83337N03467O61142
18590A2698091J130946J591544K319893L698670O288188J0083604J4095948J4974473
18582F6881357J0406024J083530p191493r900237p371958k357933L445028J1031282
18574F6025600K1429010L4722488M7392536N5167359N2286592L6944672J2158787
18567C26127044k0147996m7783544n9529070n3808673l9428790k4107739j1700087
18560F9621145k941592J500808O63831n076678j0605340j1737976r645754o912630
18552B4865814m606815l085943k186951j316802j080036j077865r98157p13973
$$ y = [59550099, 50170559, 39343644, 29999347, 23205128, 18882512, 16274827, 14639931, 13405503, 12292181, 11565400, 10969607, 10927631, 11207354, 11350145, 11533482, 12036949, 12698091, 13829037, 15420581, 17740474, 21439144, 27727332, 37810936, 51906884, 66881357, 77287381, 78370911, 71179418, 61279181, 53907223, 51549290, 54994318, 66025600, 87454610, 122177098, 169569634, 224736993, 277023585, 313968257, 326127044, 305979048, 258195504, 198666434, 144857761, 105428971, 81321232, 69621145, 66679553, 68180361, 68844192, 63767514, 53162174, 41424198, 31778444, 24865814, 20258999, 17173056, 14986105, 13669303, 12589267, 11511402, 10513245, 9799272]
18544I799272q48948p58661n96975n32015l55928l99570l65731l65744n12537
18535E063163m84135j54171j02675j86568j28233k35400j57659j58955j59489
18526C295878p6997k17663L6611J74993N2741J97218K63144q849J59829J25839
18516D002744N3955K17577N30224M04437L89580K37984N02938O39482L40010L65169
18506G684100N02444Q04827J187941J505118K474093L799087N119737N747031
18498B8824378M792586N152259P616330P442571M188252N844221J3585185K1620314
18490I9066096K5266714K4986700K6708647L3075985L2954021J3922785n802679
18483B50178269j0150430j2465657k7379084l5537969k9863463k2654081j9020749
$$ y = [9799272, 8950324, 8191663, 7594688, 7062673, 6706745, 6307175, 5941444, 5575700, 5063163, 4579028, 4424857, 4322182, 4135614, 4007381, 3771981, 3614322, 3455367, 3295878, 3218881, 3001218, 3037829, 3212822, 3265563, 3462781, 3725925, 3717076, 3876905, 4002744, 4056699, 4274276, 4804500, 5208937, 5598517, 5836501, 6339439, 6978921, 7318931, 7684100, 8186544, 8991371, 10179312, 11684430, 14158523, 17957610, 23077347, 28824378, 33616964, 38769223, 46385553, 53828124, 58016376, 63860597, 77445782, 99066096, 124332810, 149319510, 176028157, 209104142, 242058163, 255980948, 250178269, 240027839, 227562182, 200183098, 164645129, 134781666, 112127585, 93106836]
18476I3106836j3569734p186864m096170j485976J776713R71431n132699q289925
18468E6093612o456128n935264p360025p412271n599532l760245k415200j653635
18460A5501312j303832p03282l97863m01199m56135j15074L35345N98197J038155
18451A4095624J946410L525839M843872M685924L751663M448868O322911M754220
18443D8375331R7656j25915L473296N544729M200751M660061J0689437J6665297
18435I3580643J2618841K141034J724952R040864N576713j2014747j9842412j3303293
18427G9522595r204650j2321127j3231043r743956o076251l403251j448871j241322
18419B2852124k225443k522338j837419j642262k044349k335831j726515j048050
$$ y = [93106836, 79537102, 72350238, 68254068, 66768092, 68544805, 69516236, 64383537, 56093612, 49637484, 43702220, 36342195, 28929924, 23330392, 19570147, 17154947, 15501312, 14197480, 13494198, 13096335, 12695136, 12239001, 12123927, 12459272, 13057469, 14095624, 16042034, 19567873, 24411745, 29097669, 32849332, 37298200, 43621111, 48375331, 48472987, 48347072, 51820368, 57365097, 61565848, 66225909, 76915346, 93580643, 106199484, 108340518, 110065470, 119106334, 124683047, 112668300, 92825888, 79522595, 70317945, 57996818, 44765775, 35021819, 28945568, 25542317, 24093446, 22852124, 20626681, 18104343, 16266924, 14624662, 12580313, 10244482, 8517967, 7469917]
18411G469917o22184n77872m95094m37233m65583l54451k82976l86388l83955
18402C464181n5781q8601M4244l0992O319p355J07275k0053R0051K09346Q6842
18391C805476O1488R2360k624l0012O8018K00944L52167N48530O10966K63231
18381E970544P8767J32625O9809l96822p21116o42530n95917o64548p50825m47548
18371B032439q9161n1079R1492L4674L8213j02283q2400j85987j02047k5044K0063
18360A578880l3868k6994q1005m0417J492K692L5922Q1891N891j43738q6325J9907
18348A314328K8131j03661k6923r866J14399N9523m1324o6150k04018j6615K30476
18337A278300J65182Q6013J59680M5148L7730K16177J57442j04110q0308K98443
$$ y = [7469917, 6847733, 6269861, 5774767, 5337534, 4871951, 4517500, 4234524, 3848136, 3464181, 3408400, 3319799, 3364043, 3333051, 3339370, 3332015, 3439290, 3419237, 3509288, 3718634, 3805476, 3866964, 3959324, 3956700, 3926688, 3994706, 4195650, 4547817, 5096347, 5707313, 5970544, 6049311, 6181936, 6251745, 5854923, 5133807, 4491277, 3895360, 3230812, 2479987, 2032439, 1943278, 1892199, 1983691, 2018365, 2056578, 1954295, 1871895, 1685908, 1583861, 1558817, 1578880, 1545012, 1518018, 1437013, 1396596, 1398088, 1400780, 1436702, 1518593, 1524484, 1380746, 1294421, 1314328, 1342459, 1238798, 1211875, 1202009, 1316408, 1375931, 1334607, 1268457, 1064439, 1047824, 1278300, 1443482, 1529495, 1689175, 1734323, 1772053, 1988230, 2145672, 2041562, 1961254, 2259697]
18327B259697N00105O69658O46668R37798J187264J775366K557521M255418P430505
18318B2220000J2967408J8766360J4819818l521918j2035078m502578O626082
18311E5340094J2675377K423338j5700564j8286382j1790091o548742l787613
18304A4325417k688413j893147j080431r28977q11928m34949k27683j09642J07328
18295F257575M16129M36124P55985J187603K008807L206699M887790Q695511J4821223
18286D2673446J8197100P820392r115845r885043R1748R545862R863920n445504
18278F3746076j8020704j4873586q467288m613664k560527j098283p5121R92973
18270A5029876K645092N422297R855964J5478609J4240765j072905j1274885n556459
$$ y = [2259697, 2759802, 3429460, 4076128, 5013926, 6201190, 7976556, 10534077, 14789495, 22220000, 35187408, 53953768, 68773586, 65251668, 53216590, 48714012, 55340094, 68015471, 70438809, 54738245, 36451863, 24661772, 18113030, 14325417, 11637004, 9743857, 8663426, 7734449, 6922521, 6487572, 6259889, 6150247, 6257575, 6673704, 7109828, 7865813, 9053416, 11062223, 14268922, 19156712, 27852223, 42673446, 60870546, 68690938, 59575093, 49690050, 49781798, 59327660, 69191580, 63746076, 45725372, 30851786, 22384498, 17770834, 15210307, 14112024, 14036903, 15029876, 17674968, 23097265, 32953229, 48431838, 62672603, 61599698, 50324813, 44768354]
18262D4768354M310023J0849228M159149j2456526j6932900j1176496o397756
18255A7123076m013196k485567j595630j264206p55247m76291m61915l39795j05980
18246E625249Q2002L72771M10388M66381Q33442J608898K350385L871394P174914
18237B2795824J2539071J6723753R137188p142542j0144698j417886P623241R998952
18229F0112903k605362j6029492j4652200q684831n053044l112572j837897j442135
18221F695370j054935q40733n91263n51577l31017j04183k22121j94682j16503
18212B688356k85054k39334l5557K5379j19339k06869k87696j22938j1620q1292
18202A324036q7576J8550j31741j25388N6788m2293j1064k1070M6121P448r9810
$$ y = [44768354, 49078377, 59927605, 64086754, 51630228, 34697328, 23520832, 17123076, 13109880, 10624313, 9028683, 7764477, 7009230, 6532939, 6071024, 5731229, 5625249, 5707251, 6080022, 6490410, 6956791, 7790233, 9399131, 11749516, 15620910, 22795824, 35334895, 52058648, 61195836, 54053294, 43908596, 42490710, 50113951, 60112903, 57507541, 41478049, 26825849, 18141018, 13087974, 9975402, 8137505, 6695370, 5640435, 4799702, 4208439, 3656862, 3325845, 3221662, 2999541, 2804859, 2688356, 2403302, 2163968, 2128411, 2153790, 2034451, 1827582, 1539886, 1416948, 1405328, 1324036, 1236460, 1255010, 1123269, 997881, 1054669, 1012376, 1001312, 980242, 1026363, 1033811, 934001]
18191I34001j05441k10222r7766J36656J68837j7725J7299R0461n154p1720j41262
18180F97964J21888R4962Q210J53024j47556k17078p2120l6001R893J05367j79481
18169E39072N6413J98799o9042j8063K6891l1625j8748m1641K18136J12613q6433
18158H86372p211l9441r5202j17674M8444J32445J23876o8195j34804q3714M096
18147F48992j3588k8458M323J06137N7031j15523p737Q2157O6809P5563J36138
18136A011844K86575J11616j8813K7961P4606J57387J19797K72672k4184K9797
18126B049258P7133L92802N58306N31305N61540P02131J005292J234695J606075
18117H718537J929141K600677M045567O426597J0686852J9508521L9754523Q1340260
$$ y = [934001, 828560, 618338, 520572, 657228, 826065, 808340, 825639, 916100, 910946, 839226, 697964, 819852, 914814, 923024, 1076048, 928492, 711414, 639294, 603293, 613186, 718553, 539072, 595485, 794284, 725242, 707179, 734070, 702445, 683697, 642056, 860192, 972805, 886372, 879161, 839720, 744518, 626844, 675288, 807733, 931609, 863414, 728610, 644896, 648992, 635404, 606946, 611269, 717406, 774437, 658914, 651177, 733334, 800143, 875706, 1011844, 1298419, 1410035, 1391222, 1419183, 1493789, 1651176, 1770973, 2043645, 2019461, 2049258, 2126391, 2519193, 3077499, 3608804, 4170344, 4872475, 5877767, 7112462, 8718537, 10647678, 13248355, 17293922, 23720519, 34407371, 53915892, 93670415, 175010675]
18109A75010675J30664936P8157392r6672219j28163180o7910280l2860039j7744317
18102D0482968j0702650p022294m845416l420069k299330j714155j380315r47096
18094H151643q91566p39401o72612n99300o68514n17987m94563m28540j26961
18085C012199j93641l09394j88300r5969j7471l08563j51943j1372k07198k1590
18075A506758J6795O3462k338R188k78301M467J00686M9038j56400j22885O7484
18064A257954J22615o759P5348n1090R413K0466M6694k25297r4057j25494o1718
18053I68075r0216J92817J19225J9287j65247l37579j27028L9092j13371m0589
18043D64466q5132J83292N7697o5371k2149M0550K5904p4418q0352k50221o2460
$$ y = [175010675, 305675611, 383833003, 287160784, 158997604, 91087324, 58227285, 40482968, 29780318, 22758024, 17912608, 14492539, 12193209, 10479054, 9098739, 8151643, 7260077, 6520676, 5848064, 5248764, 4580250, 4062263, 3567700, 3139160, 3012199, 2818558, 2509164, 2320864, 2224895, 2207424, 1898861, 1746918, 1735546, 1528348, 1506758, 1523553, 1587015, 1584677, 1593865, 1315564, 1320031, 1420717, 1469755, 1313355, 1190470, 1257954, 1380569, 1373810, 1449158, 1398068, 1407481, 1427947, 1474641, 1249344, 1155287, 1029793, 968075, 877859, 1070676, 1189901, 1209188, 1043941, 706362, 579334, 618426, 505055, 464466, 379334, 562626, 620323, 554952, 532803, 573353, 599257, 524839, 444487, 194266, 131806]
18032A31806R8110N1812J41232l4937L8074Q811K2842K8875M4292J18344o8622
18021E80639j26646q6601M0429J24347O5478n2660k30255k08699q1175K50841
18011B75698R1354J03928n2336P2470l9228J37009K6259j68806o2199J35618q9209
18000D30558n591k44714j29032J85729J26737J44357J69988O8167P9997J04633
17990I30829K8401P2407R918j17324p9378J29415J97115J62347K70266k29649
17980A374347l26527m3523j93075r4021p6540q1204L0744n4980N8881o2223j26395
17969D05484q3682L3473K2608k0587r2646Q1126j16743j86112J40772K2199o5911
17958A39981J29127M0972k2997q7035N2573Q8727m2332N7324L85j60255J4536
$$ y = [131806, 229916, 281728, 422960, 388023, 426097, 434908, 457750, 486625, 530917, 649261, 580639, 453993, 367392, 407821, 532168, 597646, 544986, 314731, 106032, 24857, 275698, 367052, 470980, 418644, 491114, 451886, 588895, 615154, 446348, 384149, 519767, 430558, 424967, 180253, 51221, 236950, 363687, 508044, 678032, 746199, 826196, 930829, 959230, 1031637, 1041555, 924231, 844853, 974268, 1171383, 1333730, 1603996, 1374347, 1047820, 1004297, 811222, 717201, 640661, 559457, 590201, 535221, 594102, 531879, 405484, 321802, 355275, 377883, 357296, 264650, 345776, 229033, 42921, 183693, 205892, 139981, 269108, 310080, 287083, 200048, 252621, 341348, 299016, 356340, 356725, 196470, 211006]
17947B11006J98014p7717k8806J23403O0341K26224J23993K10658j43763j58448
17937G44905N1557j48714q7809L858r1094n5759J17922J76244J16570K01050L9970
17926A068700j51396M8920J5715q6117o63k00133q2003J28636O8511m7601N3971
17915H16540j02176k34339k0067K6805M6457k28504k77462m7813M034l0418O3276
17904A6333J78538n02r2428J27117J26584j54457n2595J15397o5315j30868n5704
17893A2100r1273k1919K703J7945m3904r2043J31496M1614O9022J91658R979j02154
17881A25224L4360P4977j27883j39426O0250q3759j1534K45509J12552j26421
17871A63849k2513R3745O3911j13871m9848j3286j79470l1026m9800O9614N2715
$$ y = [211006, 409020, 331303, 302497, 425900, 486241, 712465, 836458, 1047116, 903353, 744905, 796462, 647748, 559939, 563797, 472703, 416944, 534866, 711110, 827680, 1028730, 1068700, 917304, 966224, 981939, 895822, 895159, 695026, 613023, 741659, 810170, 762569, 816540, 714364, 480025, 459958, 486763, 533220, 304716, 27254, -20559, -16525, -46943, 16333, 194871, 194369, 101941, 229058, 355642, 201185, 148590, 263987, 198672, 67804, 12100, -79173, -101092, -98389, -80444, -124348, -216391, -84895, -43281, 25741, 217399, 227378, 125224, 159584, 234561, 106678, -32748, 27502, -56257, -67791, 177718, 290270, 163849, 141336, 235081, 298992, 185121, 135273, 121987, -57483, -88509, -138309, -68695, -15980]
17860a5980M6253M6361j01554J2222P0084O9266K31153J2798n7634J49322p6514
17849C85777j78526J9357K3641j03962j04066K9442P3729M6048n6290K2036J50880
17838C08066p7653j14099m0928J75247o9146j78562k2602J03309J26299m6299
17828A63632J47540M36j62105k56570j24467J34224N4019j3811p5791N5169K40414
17817A62690n3656j50359q1574J00005J78901L9124r5427L5172J13693j58485
17807I0084J086M3540j7167R0227J59334J22099l0999R9728R4260j40027k0829
17796D91336m2732K7061o3208o3716R017P4589J69020Q6524k48795l02074j24537
17785A2485M0657Q7153p0540j2920l3866J07758O6682r3059l6315k6904M4994
$$ y = [-15980, 30273, 76634, -24920, -12698, 57386, 126652, 357805, 370603, 312969, 462291, 385777, 207251, 226608, 250249, 146287, 42221, 71663, 145392, 191440, 135150, 157186, 308066, 230413, 116314, 75386, 250633, 181487, 2925, -19677, 83632, 209931, 163632, 311172, 311608, 149503, -107067, -231534, -97310, -43291, -57102, -132893, -77724, 162690, 109034, -41325, -122899, -22894, 156007, 195131, 99704, 134876, 248569, 90084, 91170, 134710, 117543, 207770, 367104, 489203, 458204, 557932, 652192, 512165, 491336, 448604, 475665, 412457, 348741, 357758, 432347, 601367, 687891, 439096, 137022, 12485, 53142, 140295, 69755, 56835, 22969, 130727, 197409, 104350, 68035, 41131, 86125]
17774H6125j85044k69236J29906R5076j0333L9668P9347J16867K41450N7535j84691
17763A96670J10045K04118K26313J40020M898J6276l07032k34816J26738j0580
17753D72650q2621j89663r3122J54407J69048n2227k5801K08209r290j54786q8452
17742C08352P6141R3161p729k44j56870j56478j7408O0704n327j45780k929j1514
17730C4079k3287m8033O4494m6255l5261L6675J18873K19448l2842j0274l4561
17719B43056j99603L9744J26130J40502Q5868j6520k06126J0488K9891R6420K5327
17708C75177j01636o0570M9410p8603k0909J24829L0055p0167K1097J3971m2398
17697B40256K5487q1016l7151J85504o0088m6407O020L5922N4117L1619o1308
$$ y = [86125, -98919, -368155, -238249, -143173, -153506, -113838, -34491, 82376, 323826, 381361, 196670, 306715, 510833, 737146, 877166, 882064, 898340, 591308, 356492, 483230, 472650, 390029, 200366, 107244, 261651, 430699, 378472, 352671, 560880, 551590, 396804, 308352, 384493, 477654, 469925, 469681, 312811, 156333, 138925, 199629, 194302, 48522, 45593, 34079, 10792, -37241, 27253, -19002, -54263, -17588, 101285, 320733, 287891, 277617, 243056, 43453, 83197, 209327, 349829, 435697, 419177, 213051, 223539, 253430, 349850, 375177, 273541, 212971, 262381, 183778, 162869, 287698, 317753, 247586, 268683, 282654, 240256, 265743, 184727, 147576, 333080, 272992, 226585, 232605, 268527, 322644, 354263, 292955]
17686B92955j49472p7468P158N9625l0597M488Q6556J12073J8088j18151k3676
17675A81579o149q2333l5864Q5207j62314o9403K4576n3419j36827J46964N0632
17664e7351k34928J9508R5518Q1752r3692J00351J38861N8811j13312L8129r7157
17653f3510R1611J10235o256m7106m2925l7466J00245m0150k23090j89356q8145
17642d35913J94602O3448M6348J44162J72272p9935P9404L944l5845K9634j9587
17631A62534m1476J970q4548j30458q9485r9388J3287j8788j1050J77115J82479
17620F2192k8213O6681M0385J4037K07346p5059k59331r2736J11794N1042K718
17609A00856r8351j01604L1524K06733J33506j33993j47083J4914m9095O6662
$$ y = [292955, 143483, 66015, 73173, 132798, 102201, 106689, 193245, 305318, 323406, 205255, 181579, 175430, 93097, 57233, 142440, -19874, -89277, -64701, -118120, -254947, -107983, -57351, -292279, -272771, -177253, -95501, -189193, -88842, 50019, 108830, -4482, 33647, -63510, 28101, 138336, 132080, 84974, 42049, 4583, 104828, 64678, -158412, -347768, -435913, -241311, -177863, -131515, 12647, 184919, 104984, 184388, 188332, 152487, 182121, 162534, 121058, 123028, 38480, -91978, -181463, -280851, -267564, -286352, -297402, -120287, 62192, 33979, 100660, 141045, 155082, 362428, 287369, 28038, -64698, 47096, 98138, 100856, 2505, -99099, -67575, 139158, 272664, 138671, -8412, 6502, -42593, 24069]
17599B4069J53457j12287k2035n3098j56010k00691j4738L2199j2998J20523J34299
17588a07310Q2031P3558j51188j07706J06966k3475j56867M0861m7151j0796J75086
17577a25991J68716j46500k0829P9386k1745R20j9137j6887k4772j5755N7848
17566h4746P9434P7180J17028j464j02193K2962m7253P1274N83J01794k7044j51743
17554E5812R563l6443n0534o5573j34492p9957n3633P1832P0953J31646P8458
17543b368k465K451P5401j10912r0220q7463J0848J9619k7582N9191o292J864
17531a57928O6569j10116L3817P56j15688m1146J40770J51340J86216K7693p6446
17520A05837q9217N0551q4458l8587p7427j3948k2067L2066M7989L1465O0088
$$ y = [24069, 177526, 65239, 43204, -9894, -165904, -366595, -381333, -349134, -362132, -241609, -107310, -25279, 48279, -102909, -210615, -103649, -127124, -283991, -243130, -290281, -301077, -125991, 42725, -103775, -124604, -45218, -66963, -66043, -85180, -102067, -126839, -142594, -84746, -5312, 71868, 188896, 187432, 85239, 108201, 60948, 132222, 132805, 234599, 207555, 55812, 65375, 28932, -21602, -87175, -221667, -301624, -355257, -283425, -212472, -80826, -2368, -4833, -2382, 73019, -37893, -128113, -215576, -204728, -185109, -212691, -153500, -159792, -157928, -91359, -201475, -167658, -166902, -282590, -323736, -182966, -31626, 154590, 182283, 105837, 16620, 67171, -17287, -55874, -133301, -147249, -169316, -137250, -89261, -57796, 2292]
17509B292Q0485q2535j52505J13185M0566N6467J0066j49396k3930j08451L0619
17498a83137L025N2979O2570j28753l1185J33503O6095N2123m7968k13931J7085
17487b17594J41753q6667K9263O2719J1356j03423O7652J84947J84293J6108q386
17476B82021P5219p9402p0668k3358j60032j16610K8887J17787n0090j28172J5953
17465a08465J02137Q9938m5031J9916P0555j00168j25245J56544K0474j13315
17455c2660q7157p053J29469M0378J87296L7539J1204n2321p2242J50766J61046
17444D66265K68774O24404P29539j94908p14831n12739k75495j55165j98373m3167
17434e696L725p1454r4331R8050J42644J34564n1227r9191M5554L9308q2411m3746
$$ y = [2292, 82777, 242, -152263, -39078, 1488, 57955, 68021, -81375, -105305, -213756, -183137, -180112, -127133, -64563, -193316, -224501, -90998, -24903, 27220, -20748, -234679, -217594, -75841, -162508, -133245, -70526, -59170, -162593, -94941, 90006, 274299, 290407, 282021, 357240, 277838, 207170, 183812, 23780, -92830, -63943, 53844, 3754, -124418, -108465, -6328, 83610, 38579, 58495, 129050, 28882, -96363, 60181, 80655, -32660, -119817, -126870, 2599, 42977, 230273, 267812, 279016, 226695, 154453, 305219, 466265, 735039, 1359443, 2088982, 1894074, 1179243, 666504, 391009, 235844, 37471, -5696, -1971, -73425, -167756, -69706, 72938, 207502, 156275, 57084, 102638, 141946, 59535, 15789]
17422A5789J01178K6355M8165j9410n1798j05402K0078O6171n0869o5258K32432
17411B17431J53882m831m68j60369k81826j81030J02042n7551q1563O3429n0407
17400b81261R135k9859J2988K2109J1471J00965L7966k6195K76545Q6169k32800
17389a2767k10872p4221K163R7897P3728P6607J62369n9218p4529O6940J68051
17378B16148P8662k00903l231J15413n3350N191J3739p3706j31367p2248o019
17367a11671j8112q3439O2965M1617J36040J5235l5164J56021q5014p8739l1261
17356c1522j10666M084J24354n8833n4897J46797m2240j403J9875m1969j22433
17345a68853N4611J09228o1483l7546J51724K30362j27422j81662m1225O1186
$$ y = [15789, 116967, 143322, 191487, 172077, 120279, 14877, 34955, 101126, 50257, -15001, 217431, 371313, 366482, 366014, 205645, -76181, -257211, -155169, -212720, -294283, -230854, -281261, -272126, -301985, -288997, -266888, -255417, -154452, -116486, -142681, 133864, 220033, -12767, -223639, -297860, -295697, -197800, -124072, -47465, 114904, 55686, -18843, 48097, 216148, 294810, 93907, 90676, 206089, 152739, 157930, 171669, 97963, -33404, -105652, -111671, -129783, -213222, -150257, -108640, 27400, 42635, 7471, 163492, 78478, -261, -31522, -142188, -138104, -13750, -72583, -127480, 19317, -22923, -24326, -4451, -46420, -168853, -114242, -5014, -66497, -104043, 47681, 278043, 150621, -31041, -72266, -11080]
17335a1080L3623j93778r5474j4070k4790k068j9730n673p9926N0276J46575N0521
17323a65594K6581n9264N2505O6736J6055j44005j91801J10362L62278J83013
17313B56866n7837j40923n0875n3484J0410p5845l1866J60738m5799K4740k901
17302f776q803j19063m4270j23460J02635K23846j7884R581n2403M1854j3433
17291h176l2569r378k4432n3595m671o1798L8331K1864J26829J18062Q6002j55928
17279D0541k0956N7297J02571N6327k03010o7006p800Q8140J29006j14020j48212
17268h7122N3286J85605J25181j14499q9795k42986O6489J59984o5476Q6163M6054
17257A22884r5640n0741J3007N8812J15971k5204j45952n4389j33828j76901M8090
$$ y = [-11080, 22543, -171235, -266709, -280779, -305569, -307637, -327367, -333040, -412966, -362690, -216115, -165594, -139013, -198277, -145772, -79036, -62981, -206986, -398787, -288425, 73853, 256866, 199029, 58106, 7231, -46253, -35843, -111688, -143554, 17184, -28615, -3875, -6776, -15579, -134642, -178912, -302372, -199737, 24109, 6225, 15806, -36597, 5257, -8176, -40745, -50123, -74555, -128150, -132821, -194619, -156288, -134424, -7595, 110467, 196469, 40541, 19585, 76882, 179453, 235780, 32770, -34236, -42036, 46104, 175110, 61090, -87122, -33836, 151769, 276950, 162451, 72656, -170330, -103841, 56143, -9333, 76830, 122884, 27244, -23497, -10490, 48322, 164293, 139089, -6863, -61252, -195080, -371981, -323891]
17246c23891P4265J45591P8516N9245j17609j12806J65883J05056n0894K0717
17236D4073j23517L0319j00439P8849K31762l2890m954Q5324M6215n2807q1912
17225A20023J3191K1650p7255k6113P74j34867j7611J5115J0620o2473M7431L6365
17213e3150k7164j8853l8645M1941N8209Q1239j61597n6247L6556M6360m9259
17202a40610m1281j16084Q1296L6129K02070j20710k63176J05180J24165l1430
17192a64451J61774J09741q8108j75234q3360J28355K00159J10967j78340r1343
17182f9840O3238K195j08697K8276M4088p6277j03854L5086J0369R8409Q9883
17171A2876j25401O8707L12063P9364m1629o2634k05215k6414m9330J02698L2465
$$ y = [-323891, -249626, -104035, -25519, 33726, -83883, -196689, -30806, 74250, 23356, 44073, -79444, -49125, -149564, -70715, 161047, 128157, 123203, 208527, 254742, 201935, 120023, 133214, 154864, 77609, 51496, 52270, -82597, -100208, -85093, -74473, -136946, -89515, -53150, -80314, -99167, -137812, -95871, -37662, 43577, -118020, -174267, -137711, -91351, -140610, -181891, -297975, -216679, -180550, 21520, -99190, -362366, -257186, -133021, -164451, -2677, 107064, 18956, -156278, -239638, -111283, 88876, 199843, 21503, -69840, -6602, -4407, -113104, -84828, -40740, -117017, -220871, -185785, -175416, -77007, 12876, -112525, -43818, 268245, 347609, 305980, 243346, 38131, 11717, -37613, 65085, 97550]
17160I7550M7697M9899l1671j08639J54046J59321J04667q8652J2584j75387o8650
17149A52765j33839r1067J17852L5101l9123j68615J23395M5454N0822j3761P8727
17138A57711q1588O5775j60745j61861m5869J00498K18214j6085j06055k5666
17128e5671l3986K1904J86401R8917j27728m316K7175K0289O32N7470R1668M3286
17116C26041j29117K3247L0997j89306k17618J23080Q4511n7117o761j07204p3128
17105a92375P3040O334p8248Q8485q5959O4738R1280J19204Q3993p3523J31431
17094B28400R4847l6381j37468j26967J68264J32726L354k33167j56306j53284
17084b15982l1976K66754L9000j25016N5279K54341q0461J9592P5923j10097j0644
$$ y = [97550, 145247, 195146, 163475, 54836, 208882, 368203, 472870, 384218, 396802, 221415, 152765, 18926, -72141, 45711, 80812, 41689, -126926, -3531, 41923, 92745, 78984, 157711, 76123, 141898, -18847, -180708, -226577, -126079, 92135, 76050, -30005, -55671, -89657, -67753, 118648, 217565, 89837, 85521, 112696, 132985, 133617, 191087, 282755, 326041, 196924, 220171, 251168, 61862, -155756, -32676, 51835, -5282, -12043, -119247, -192375, -119335, -113001, -191249, -102764, -188723, -123985, -32705, 86499, 170492, 96969, 228400, 323247, 286866, 149398, 22431, 190695, 323421, 326775, 93608, -62698, -215982, -247958, 18796, 57796, -67220, -11941, 242400, 161939, 181531, 257454, 147357, 136713]
17073A36713l5075j64372k6291J23142Q5641j82470j34608M3927J37554k082L6232
17062A8311L6251K6900J6512L2573k59177p1812O6919r046o9545N0730R6014J02555
17050C7185O2856p1287K7439O8122j27860j29242q855J14238O4160k02061K6623
17039a38682M4585j26855o0889M063j15441J85274R0711J21258l2835j2916Q6407
17028D4680Q405p9414j2686k8818n1222m040m4502P5346q2985q7690K1826N8444
17016a82656J64325J7136K057j53518O6278m4054P7481o1187J4454n4320L952
17005a50052J01954K14776K16272N4451j44536p2090K0257j08390o2137q7063
16995a6558M8365J43907k11394l5389J38240J9633N6838j70406n4337J31284j56069
$$ y = [136713, 101638, -62734, -89025, 34117, 119758, -62712, -197320, -153393, -15839, -17921, 18311, 54562, 81462, 97974, 130547, -128630, -200442, -133523, -142569, -212114, -161384, -65370, 37185, 100041, 28754, 56193, 124315, -3545, -132787, -141642, -27404, 36756, -165305, -138682, -94097, -220952, -281841, -277778, -393219, -207945, -117234, 4024, -28811, -41727, 44680, 53085, -26329, -39015, -67833, -119055, -123095, -167597, -92251, -175236, -262926, -241100, -182656, -18331, -1195, 862, -152656, -86378, -130432, -52951, -114138, -99684, -154004, -150052, -48098, 166678, 382950, 437401, 292865, 220775, 241032, 132642, 70505, -16558, 31807, 175714, -35680, -71069, 67171, 86804, 143642, -26764, -81101, 50183, -105886]
16984a05886J9559j653m3972N7852r3498j66716j19615J51119J57193N5813j38859
16973b28663P9279j565l9514N3331J5314m499R1546q1428J40724l4190k6427m9253
16961h5345l1542p643L0985J84554R4721j83787o238J13524n6306l7599N3129
16950F8453O6029J146j15859K7203o2556L5856K8443j12319n7181K27843J12485
16939B19543j77006K0977L4573l1340j03247l0028K2791P5824M9689j16150K43156
16928B08782Q8107j61571j36829n3200J0488k8140k1033R9023r0149K6437J22314
16917F4229M9072M4783K5563j06309m8232J02727N663j7217j09150J47851K00474
16906C59454p5129j8112N3194j28591j25902j3530J24667O3224j90159j80095
$$ y = [-105886, -86327, -87980, -131952, -74100, -167598, -334314, -453929, -302810, -145617, -89804, -228663, -149384, -150949, -190463, -137132, -121818, -126317, -34771, -116199, 24525, -9665, -36092, -85345, -116887, -124530, -93545, 91009, 185730, 1943, -4295, 109229, 52923, 15324, 68453, 134482, 135628, 19769, 46972, -15584, 20272, 48715, -63604, -120785, 107058, 219543, 42537, 63514, 98087, 66747, -36500, -66528, -43737, 32087, 81776, -34374, 208782, 296889, 135318, -1511, -54711, -44223, -72363, -93396, 5627, -84522, -58085, 64229, 113301, 158084, 183647, 77338, 29106, 131833, 137496, 120279, 11129, 158980, 359454, 284325, 266213, 319407, 190816, 64914, 51384, 176051, 239275, 49116, -130979]
16896a30979m9374O2942J04746l7985K08416J05066k1530k52978j42604j0826
16886a65106Q7421N6630k17209n0319K48171Q6943J33851q4105q5559j6285Q2313
16875G6746J39285j34732j8048N0081P3910J59935n6130j55447J8054M504o8754
16864H9404r205o620P6792n0384L0943L4427n0279O829J99k24715m5417j41307
16852b89333J19920m7461p1446j1616O9014Q2005J43022J32276P9622Q6752m876
16841B87879j69916K0292r2884j23183l7942N5442n5965K0141J06972J24402k9478
16830A05760J00565p7946j47578j07422j54864p3068R1517R6390L21310J28528
16820B83192o3651m6650l3285j21307o8781K0602j06519o4250J13529R6974r0410
$$ y = [-130979, -180353, -117411, -12665, -50650, 157766, 262832, 241302, -11676, -154280, -165106, -77685, -21055, -238264, -288583, -40412, 46531, 180382, 96277, 10718, -5567, 76746, 216031, 81299, 63251, 113332, 187242, 347177, 291047, 135600, 153654, 158158, 89404, 80199, 73579, 150371, 99987, 130930, 165357, 115078, 121907, 122106, -102609, -148026, -289333, -169413, -216874, -288320, -299936, -230922, -148917, -5895, 126381, 206003, 292755, 287879, 117963, 138255, 45371, -77812, -115754, -60312, -116277, -96136, 10836, 135238, 105760, 206325, 128379, -19199, -126621, -281485, -354553, -263036, -166646, 154664, 283192, 219541, 172891, 139606, 18299, -50482, -29880, -136399, -200649, -87120, 9854, -80556]
16809h0556j67096N0243J55277J72522k43248k00075J19261R4568j06935j7139
16799b23178J49014L4767P9861J8452P5819j550o1864m7855n027k1035N2370R3654
16787A43428o9525n7116J00418O2905L7798k07852r5631N5313J61285k16642M7896
16776c7723Q5165n0614p5572O9452O753P191j19232P8756J58241j8815m3359j8785
16764D1458J34154j3282K063K4558L7722o6848l582j2383k36677r6411J25245
16753f3983O9820J85502j4591M6384K9545j74204o4764p0818O1573J12338n0734
16742F6068j45501N11k4381j09761M6703J15326n4419O9061J32466j2485O3663
16731A47251O0351n8294j26208p6596J39166J21052p2604q5046j00876P9179n201
$$ y = [-80556, -247652, -197409, -42132, 130390, -112858, -312933, -193672, -99104, -206039, -223178, -74164, -39397, 40464, 58916, 134735, 133185, 71321, 23466, 18439, -2596, 49774, 143428, 73903, 16787, 117205, 180110, 217908, 10056, -85575, -30262, 131023, -85619, -37723, 47442, -3172, -78744, -9292, -2539, 4652, -114580, -35824, 122417, 103602, 60243, 41458, 175612, 162330, 164393, 188951, 226673, 159825, 156243, 143860, -92817, -189228, -63983, 5837, 191339, 176748, 223132, 252677, 78473, 13709, -57109, 4464, 116802, 66068, -79433, -78922, -103303, -213064, -166361, -51035, -105454, -36393, 96073, 83588, 147251, 207602, 149308, 23100, -53496, 85670, 206722, 134118, 49072, -51804, 27375, 22174]
16720B2174j24502p8445j67278Q8879J27270o8032J22959j7276K8229L4289N5047
16709B3314J18123k08064o9329Q801J09501O703j39307J28526J15394K4377L1909
16698A49948j37312p5898K4066r779N4878Q0914l9968j37519K801O4569Q7185
16687F3885r230m2923P7849O8046J31756k062N9136o9374j63573n0398r9492K7161
16675i219q0727M9141J36382J57023o4337j56273m6188p612o7818K249K1206l5351
16663a01524j30247J12838k1929j62389q93O0875J20657J16440k5960M8426j03259
16652h6965L8983O4484J79254Q8371l2933j22653m9974j0539k1827J19832n2541
16641A13492k9659M3965P1467j79691k19408K5677J11410Q4021j3021l9425o0267
$$ y = [22174, -102328, -180773, -348051, -259172, -131902, -199934, -76975, -94251, -66022, -31733, 23314, 141437, -66627, -135956, -127155, -17654, -10951, -150258, -21732, 93662, 118039, 149948, 12636, -63262, -39196, -48975, 5903, 86817, 46849, -90670, -87869, -23300, 63885, 54655, 11732, 89581, 157627, 289383, 287321, 346457, 277083, 113510, 63112, -36380, -9219, -89946, -40805, 95577, 252600, 188263, 31990, -14198, -21810, -89628, -87379, -66173, -101524, -231771, -118933, -140862, -303251, -304144, -243269, -122612, -6172, -32132, 16294, -86965, -47982, 16502, 195756, 284127, 251194, 128541, 78567, 68028, 46201, 166033, 113492, 83833, 127798, 199265, 19574, -199834, -174157, -62747, 21274, 8253, -31172, -91439]
16630i1439Q9718M5056k7345j5858p8845k5727k4614L0366j6207k5105j01282
16619b41282k57699k9599M9874J67741K76296J49229j7770j16825O3663J14280
16609A57908N9605o9663r3683J00766Q2457j57323j26000n9346j0328J67446K33419
16598B85258q1896j21103l0617j5102o1953j03912j36244J58841J70989O6011
16588A30272K95021N3738j91450j60037j11604J2544k8680m7270M4342M9406j36107
16577h9825j69229K3911j08159r7676K07600j6277q8979J35585K53477M6780q5019
16566A2189o2607K0052N2469q2047j37332M4046J04919j8125j27278p7027J07801
16555a62940J27002O5798j60793o9496M4020j53437j51907J10330J77741Q2636
$$ y = [-91439, -1721, 43335, 15990, 132, -78713, -104440, -129054, -98688, -114895, -140000, -241282, -498981, -528580, -478706, -310965, -34669, 114560, 96790, -20035, 43628, 157908, 217513, 147850, 54167, 154933, 237390, 80067, -45933, -105279, -115607, 51839, 285258, 203362, 82259, 51642, 36540, -25413, -129325, -265569, -106728, 64261, 130272, 425293, 479031, 287581, 127544, 15940, 28484, -196, -47466, -3124, 46282, -89825, -259054, -235143, -343302, -440978, -233378, -249655, -338634, -203049, 50428, 97208, 12189, -50418, -30366, 22103, -59944, -197276, -153230, -48311, -66436, -193714, -270741, -162940, -35938, 29860, -130933, -200429, -156409, -309846, -461753, -351423, -173682, -91046]
16545i1046k9555j04817L3519J3988J69740L24N2490l556j44781j60252k1662
16534b85608O2610K26368J73964r2618j88694l6121J4965Q6973j2403j12943k3389
16523a86896N6238L7250J57465l9626Q238J20739n2548r3256j08119j00380J5635
16512a85260R9868L4632o7681j63423o3580J84467N4082j4335J57119J46379J00744
16501B83012j91977j67768N2201L5244j94468O4331P8705J30793n2804j39861
16491a02592p4130q8023J01072J38813O4844L3636r8343l5832j50151j64564J43314
16480b31956Q4382o0428n1602N3114P7171O8068J76872J30147N3004r0140j44739
16469F3893j00058K4705R5387J44992P7749O6530j90068j55864Q3933J05887J16982
$$ y = [-91046, -120601, -225418, -191899, -177911, -8171, -7847, 44643, 41087, -103694, -263946, -285608, -222998, 3370, 177334, 84716, -103978, -140099, -125134, -38161, -50564, -163507, -186896, -130658, -93408, 64057, 24431, 32669, 153408, 100860, 7604, -100515, -200895, -185260, -85392, -50760, -118441, -281864, -345444, -160977, -106895, -121230, 35889, 182268, 283012, 91035, -76733, -24532, 10712, -183756, -119425, -40720, 90073, 37269, -102592, -176722, -264745, -163673, -24860, 39984, 73620, -24723, -60555, -210706, -375270, -231956, -147574, -208002, -259604, -206490, -129319, -61251, 115621, 245768, 298772, 208632, 63893, -36165, -11460, 83927, 228919, 306668, 373198, 183130, 27266, 111199, 217086, 334068]
16458C34068k12681k57576j504J503J64664O9300L0427m1917N7162j77551n7518
16447i1623P0647j38366q9772J47993N8112j8367P1837m3973k07684K1390J93951
16436b5855R5067m6981j20131n5936P8648N7586p0745o3343O7230J0462J09895
16425C5897M4809M076j59448r8958O0143J85265r5646j6009J08579j24998j86310
16414b42600p7881Q5829J77723K32513L7853k3578n4039o1063j24788M1156Q0447
16403G1572L7197q8417k6514J810m0636j06059J19379N0129j95181n7271L4764
16392a99227J21989R6824N8300J28297p8913j00003j6842J0477M6706m481j2674
16381E0453l3919q9852r5056j223L8485O369j5881o0476j3033J03758j27695R9352
$$ y = [334068, 121387, -136189, -137693, -136190, 28474, 97774, 128201, 86284, 143446, -34105, -91623, -20976, -159342, -249114, -101121, -43009, -61376, 10461, -33512, -241196, -219806, -25855, 69212, 22231, -97900, -153836, -75188, -17602, -88347, -151690, -84460, -73998, 35897, 80706, 84782, -74666, -173624, -113481, 71784, -23862, -39871, 68708, -56290, -242600, -320481, -234652, -56929, 175584, 213437, 189859, 135820, 74757, -50031, -8875, 71572, 108769, 20352, -6162, -4352, -44988, -151047, -31668, 18461, -176720, -233991, -199227, -77238, 19586, 77886, 206183, 127270, 27267, 10425, 20902, 67608, 63127, 50453, 16534, -73318, -168374, -169597, -131112, -124743, -140624, -201100, -214133, -110375, -238070, -138718]
16369a38718J70268J68107r4782L3514Q99j29948J51436j4126K0984J396J2034
16358A81064j08135J9704q855m5909m9001q5829n9504K07755J25599j31684m5283
16347g8p6562m2116J03077l1805R0016L9468O5315K8460Q2100j63759P5472Q9000
16335B58588j21986q7547J03018n0890j89401P7649R0792k0787K1861L4017j8525
16324I6789Q200j64086k6239J75514o1551l0403O258o8544j8666K9405R0977J37469
16312A75123J17581p6169j67160j72546m7559K29L4304R1142r6556p5324J9334
16301a97601J35590J92388r4141j19194J37541l4318l1956N0451m6854r080L0095
16290A2921j36377J31623J95495k8592K6183l2190R280J1011j79746j60606J52151
$$ y = [-138718, 31550, 199657, 104875, 138389, 139288, 9340, 160776, 146650, 167634, 169030, 181064, 72929, 92633, 83778, 37869, -11132, -96961, -156465, 51290, 176889, 45205, -78, -76640, -118756, -15679, -47484, 42532, 82000, 147315, 175775, 257875, 94116, 169588, 258588, 136602, 49055, 152073, 101183, -88218, -10569, 80223, 59436, 81297, 115314, 96789, 104989, -59097, -85336, 90178, 28627, -1776, 4482, -64062, -82728, -53323, 37654, 175123, 292704, 216535, 49375, -123171, -170730, -170501, -136197, -45055, -141611, -216935, -197601, -62011, 130377, 36236, -82958, 54583, 20265, -11691, 38760, -8094, -17174, 12921, -123456, 8167, 203662, 175070, 201253, 169063, 178343, 189354, 9608, -150998, 1153]
16279A153L54q0614l4319J45228j2979M8810k03631k342J26515J59772J22596
16268B70543k6214j4415M753r6062j69329N7683N3210k8609j4737o3235Q3341
16257E6929K7006n6588j55088K7832O0770M6124O0348K6458j59205o1738n9701
16246a86853J6230o5028Q3796K0654n6249K4944J14689R7277Q829j4704Q9684
16235A33269N4379j32735j64761J4448P9532j1944m2549J53067j4339j54693n8473
16224a44799J16816J5433j68017K57541J66710Q1515k04814l41377j90072J16979
16214b94085J57132K05168K1037k73930J6686J05775P2859J55675l4090j7818
16204A14409P3019j24703j32699Q8902J40114n7508j73252l2042P1876k2334j11516
$$ y = [1153, 1507, -79107, -113426, 31802, 18823, 67633, -135998, -138340, -11825, 147947, 270543, 244329, 229914, 234667, 138605, -30724, 26959, 80169, 51560, 36823, -26412, 56929, 83935, 27347, -127741, -99909, -39139, 6985, 67333, 93791, -65414, -127152, -186853, -170623, -235651, -151855, -131201, -187450, -162506, -47817, 49460, 58289, 43585, 133269, 187648, 54913, -109848, -95400, -15868, -27812, -70361, 82706, 68367, -86326, -144799, -27983, -12550, -180567, 76974, 243684, 325199, 120385, -220992, -411064, -294085, -136953, 68215, 89252, -184678, -167992, -62217, 10642, 166317, 132227, 114409, 187428, 62725, -69974, 18928, 159042, 101534, -71718, -103760, -31884, -54218, -165734]
16193a65734R6570K25246L1278j09189n7519q8341j7456p0435J08071J0245j98303
16182b35567N3807K3847l6194j08826O012K41505N1254j14923J08446Q2293N6389
16171A28043l2468j82572j60614p2945J32019K44617K56707q629n1091q1266o1716
16160A10085Q6689r6403j80116M8155O887q7538o7557k7037P3856j9689l6379
16149a89047O2315Q7365M5821j39867m1203L2235j10224J94737K23384O7122j38755
16138I3883j27291J42884L1195J68037R6441j44587j38742j46912m6612K48508
16128A76804Q9139n0145o5016k1966p3334M4690L2961q2437Q4294l8540k09945
16117a13495j60355J24450J05834J60277j25621o9684q7397P7933L22559K46315
$$ y = [-165734, -69164, 156082, 187360, 78171, 20652, -67689, -85145, -155580, -47509, -37264, -235567, -181760, -157913, -194107, -302933, -296921, -55416, -4162, -119085, -10639, 71654, 128043, 95575, -86997, -247611, -320556, -188537, 56080, 312787, 304158, 253067, 171801, 110085, 196774, 100371, -79745, -31590, -24703, -112241, -179798, -206835, -132979, -152668, -189047, -126732, -39367, 6454, -133413, -174616, -142381, -252605, -57868, 165516, 232638, 93883, -33408, 109476, 140671, 308708, 405149, 260562, 121820, -25092, -71704, 176804, 265943, 215798, 150782, 128816, 55482, 100172, 133133, 50696, 134990, 96450, -113495, -273850, -149400, -43566, 116711, -8910, -78594, -165991, -88058, 234501, 480816]
16107D80816k8225k65477j25068n7041J64287q9896k63520J07419N564L4103Q7395
16096E0357M0410N6119O8536p6630j41074j16223n8294R980J23686N9394K6536
16085D2797n3906j31181O2677Q9976N4421Q2388N8142j6935p6629O4876m6058
16074A30568j54923J62438J95131n4962q4858k8709n2809J04120K0171L165k02158
16063C7174k22134Q0495M9048O6484P2555q5601R2183q0097n0774J56045j8403
16052I6975m7734j12275J17618Q4052J48270j7688R7955J04514k29179j20375
16042A22133j02668j52733M1466L2536J40300k5195m0416o3876J8362Q5970l6475
16031A9404J34736p4733q2904m7563J14934M4337p720q0610r6697p2477K776j19335
$$ y = [480816, 452591, 187114, 62046, 5005, 169292, 79396, -184124, -76705, -71141, -37038, 50357, 90767, 146886, 215422, 138792, -2282, -118505, -176799, -166819, -43133, 16261, 42797, -11109, -142290, -79613, 10363, 64784, 147172, 205314, 188379, 111750, 176626, 130568, -24355, 138083, 333214, 278252, 193394, 164685, 111876, 215996, 236167, 239332, 37174, -184960, -104465, -55417, 11067, 83622, -1979, 90204, 10107, -40667, 115378, 96975, 49241, -63034, 54584, 138636, 286906, 269218, 367173, 471687, 242508, 122133, 19465, -133268, -91802, -59266, 81034, 55839, 15423, -48453, -30091, 55879, 19404, 154140, 79407, -3497, -51060, 63874, 108211, 100491, 19881, -76816, -149293, -146517, -265852]
16019b65852q231L2193R1663L3897J69624Q4768m6560O0539j69767o2279n6801
16008a36806J15769m0546p1269n6495j0737J6432J99214N7061R1967p280l5987
15997A21323j63604l2339J02738J1439n4423J32648r8274M1623Q1469N3714n8781
15986A37533q2208r2996j26036K04635J27224n3936j31552m7826o4373J664N0688
15975g7183l5032m2185Q4497J15756q7070o8229m8150N9930N9117r5351J66523
15964C2623r419j69626j23271J39566l6535L37823O9535j24705q5549O1454J57569
15953B49465Q7512j8415P70J0825o2095j3891q4943k14676j42314J7518J56734
15942a3510k5718j98949k5999K30015l625K122M1740r3762J42523P3630J5029
$$ y = [-265852, -274083, -241890, -150227, -116330, 53294, 138062, 91502, 152041, -17726, -80005, -136806, -21037, -61583, -132852, -189347, -200084, -183652, 15562, 72623, 164590, 157310, 121323, -42281, -74620, 28118, 39557, -14866, 117782, 19508, 61131, 142600, 196314, 137533, 55325, -37671, -163707, 40928, 168152, 114216, -17336, -65162, -129535, -127871, -77183, -112215, -154400, -69903, 45853, -41217, -109446, -157596, -97666, -38549, -133900, 32623, 23204, -146422, -269693, -130127, -166662, 171161, 240696, 115991, 30442, 91896, 249465, 336977, 318562, 319332, 330157, 268062, 254171, 169228, -45448, -187762, -170244, -13510, -39228, -238177, -264176, -34161, -37786, -35664, 6076, -87686, 54837, 128467, 143496]
15931A43496k9265l7388R4578n3221K6898m4968O4204o4525M2948j6240o7350
15920E9167L2877L4758o512J9623J07584l5223j98180j71824J9919R1754J69540
15909A23483r07j49363j15334p4872Q2701J13157J59713k552q2018m8400o1151
15898e5543j4879r4948J62375L2996o5849J27991O4468k7713n3833j06016r2175
15887a23126l16J96881l0542r5649j47702l5788J81493O5817m2951K5865M5286
15876C9268m4394P594J9010O5697J75414M1953j43750n4391j05616l0830K20243
15865A90198J12690j18862o3383P9841L0172k39529K3732J16034j38746K6102
15855A8249o1740j56176O3105J81716J41723J21860k2594r1275l1292P9316M8657
$$ y = [143496, 114231, 76843, 171421, 118200, 145098, 100130, 164334, 99809, 142757, 126517, 59167, 92044, 126802, 120290, 139913, 247497, 212274, 14094, -157730, -137811, -46057, 123483, 122576, -26787, -142121, -216993, -134292, -21135, 138578, 136026, 54008, 5608, -55543, -70422, -165370, -2995, 30001, -35848, 92143, 156611, 128898, 75065, -30951, -123126, -123442, 73439, 42897, -52752, -200454, -236242, -54749, 11068, -31883, -6018, 39268, -5126, 2468, 21478, 87175, 262589, 304542, 160792, 106401, 785, -30045, 190198, 302888, 184026, 120643, 200484, 230656, -8873, 14859, 130893, -7853, 18249, -43491, -199667, -136562, 45154, 186877, 308737, 286143, 194868, 163576, 242892, 291549]
15844B91549j70663j46816J920j23306j5964J90700K5846m449O588L3731N4113
15833A43249L4133j54809K5080l1209o0579k00373J10554K03899j36887P6323
15823I381m2375Q904M1402j22035J5869J00009q575k09117k1669Q6146o429o0815
15811b09304J3370J48035R3217r9725j99538J2259J47669Q5419j5866j32804l2235
15800a89503p5070K4725K45307L3868o9011j52989P0334J89670L6798L5302n702
15789A43729k24496j97085L3269J93993N2130J27676M5932K3881M2724O1089r2581
15778B10261j74285Q1875N491J2297p687L4219l0788k19669j08516q9627J45859
15767a40570Q9750J20415K11678N7080k36808k29150R925L5703k3009J91043m268
$$ y = [291549, 120886, -25930, -24010, -147316, -163280, 27420, 53266, 48817, 55405, 89136, 143249, 177382, 22573, 47653, 16444, -44135, -244508, -133954, 69945, -66942, 9381, -32994, -24090, 17312, -104723, -88854, 11155, 2580, -206537, -228206, -142060, -148489, -209304, -195934, -47899, 45318, -54407, -253945, -241686, -94017, -8598, -24464, -157268, -189503, -264573, -239848, 5459, 39327, -29684, -182673, -112339, 77331, 114129, 149431, 143729, -80767, -277852, -244583, -50590, 1540, 129216, 175148, 199029, 241753, 302842, 210261, 35976, 117851, 123342, 135639, 127952, 162171, 131383, -88286, -196802, -286429, -140570, -50820, 69595, 281273, 338353, 101545, -127605, -117680, -81977, -104986, 86057, 81789]
15756H1789p9942j53994p6546o7561p0178P7173K62742Q8076N9702K36144R6770
15745D54175j51207j38903R3859l9412n8362o7351o5554j6462n5152j50681l1027
15734b26077K8468O0300J0151o4944K47253J41060Q97o8754q2003j19353O2001
15723a1001J77519J52890o8401j14416R2686L9758j83680K3430J0384k17158m0976
15712a38965o0696n7899J30759K8134J78658Q7598J39797K26027m7399j75236
15702C10778j54938j5202m5553j79252L1890n4258k4061O5352r2977m7267M3724
15691a61764J0160J7280J03142j2161k6692l8820N6620j1177J65217K3738J8900
15680A44443j45200r5554P6966K47351J63423j11024j18546N546l9970j12964
$$ y = [81789, 1847, -152147, -228693, -296254, -366432, -289259, -26517, 61559, 121261, 357405, 454175, 302968, 164065, 257924, 218512, 160150, 92799, 27245, 10783, -44369, -195050, -226077, -197609, -137309, -127158, -192102, 55151, 196211, 197108, 128354, 46351, -73002, -11001, 166518, 319408, 251007, 136591, 229277, 269035, 85355, 108785, 119169, -97989, -138965, -199661, -257560, -126801, -98667, 79991, 167589, 307386, 533413, 486014, 310778, 155840, 140638, 95085, -84167, -52277, -106535, -130596, -65244, -158221, -205488, -161764, -151604, -134324, -31182, -43343, -70035, -108855, -52235, -63412, 101805, 125543, 144443, -757, -96311, -19345, 228006, 391429, 280405, 161859, 167405, 127435, 14471]
15670A4471R3732J05579l6026j21950M1936O259J4398J31964p6457k10022l4236
15659g0352M8070m7202j72349L8243L969J22473Q9228L4370O7379l0441k9106
15648E4282m7514j39985N4114K52373R859j12826l6394J83447j32829o0082p2658
15637d8213j2356O3374j74969j82675J41742K01477j1337p8985k2970J50450k5498
15626D0j54403R6495O0817M4423o4094p5787J13043J75915R3073J5460j27827
15615A77155k5257m3147j09107j73820R7677K42006M83j50011m7563o6949Q5756
15604a2777N1816J39362n8317j00779m7987P0973K4649N7346L6282P3416k3973
15593B10011r3578q8118r7973j44709m9265J50678L8854J72845J6031j3874o573
$$ y = [14471, 108203, 213782, 177756, 55806, 97742, 104001, 118399, 250363, 173906, -36116, -70352, -22282, -69484, -241833, -203590, -199621, -77148, 12080, 46450, 113829, 83388, 54282, 6768, -133217, -79103, 173270, 183129, 70303, 33909, 217356, 84527, 24445, -48213, -60569, 2805, -172164, -354839, -213097, -11620, -22957, -101942, -124912, 25538, 40, -154363, -57868, 2949, 47372, -16722, -92509, 20534, 196449, 289522, 304982, 177155, 151898, 108751, -356, -174176, -76499, 165507, 165990, 15979, -31584, -98533, -12777, 39039, 178401, 120084, 19305, -28682, 42291, 66940, 124286, 160568, 233984, 210011, 116433, 28315, -69658, -214367, -263632, -112954, -74100, 98745, 114776, 100902, 94329]
15582I4329K0515J02436r7727l4235J9144J89962K4644j29199l8686O1559r7059
15571A15683j68297j8113K562q6439K322n1885O7929J29090j49834P0765Q3992
15560b225L250J02556J8743j02381j46542J68198Q1633p7966j19242j83066j7653
15549b74695J63663J75889k0135j37142O0950M5749k364L1058k6073K8224q5913
15538d0789j18769j31990J75813J37853m1545r7633n0035K43474K50182q4244
15528B42317k35359m3796K0819p2571J11632O5520k6627J54532P1035J06859j5408
15517C78953j79909J0410L9869j43806p2554M1202j92257k92049O364L9688J63653
15506b00436J00102J76636J29952n6724N4757j59324r0469j50256q2457R2975
$$ y = [94329, 114844, 217280, 119553, 85318, 104462, 294424, 319068, 189869, 151183, 212742, 115683, -52614, -70727, -68165, -154604, -152282, -204167, -136238, -7148, -156982, -86217, -2225, 1025, 103581, 122324, 19943, -126599, 41599, 123232, 45266, -73976, -257042, -274695, -111032, 64857, 44722, -92420, -31470, 14279, 11915, 42973, 16900, 45124, -40789, -159558, -291548, -115735, 22118, -19427, -117060, -167095, 76379, 326561, 242317, 6958, -36838, -16019, -88590, 23042, 88562, 61935, 216467, 287502, 394361, 378953, 199044, 209454, 249323, 105517, 32963, 74165, -118092, -410141, -403777, -364089, -200436, -100334, 76302, 206254, 149530, 204287, 44963, -45506, -195762, -278219, -185244]
15496a85244M4376K19084k2943o0681L4524p6093O0690k6687k77436M0527J03051
15485a46832j31550r2222J03116J32865J13103j17942K4348j39167r4647J38564
15475b10364o9699l9290J69873J15631J3485J1002J12995K443n1271M1758P0293
15464A66856k7007k3338j79545j68443K961j61360J5356L19009J09635j2055J6885
15453E8954R2647j5146K3196L4119j18463p7608O2993R1221M5675j3067j06399
15442G8122j17291r1988K0302J48406j19226K5326J00087J29065K6832m4555l6865
15431A18215n6196j76549n3522M9171Q2503M050J81210J84236j41238j07530k0939
15420F3411j0055j20135J02022J99586N5270L0811j15659j99115j07963o4585
$$ y = [-185244, -140868, 78216, 55273, -5408, 29116, -46977, 13713, -12974, -290410, -249883, -146832, -278382, -370604, -267488, -134623, -21520, -139462, -115114, -254281, -348928, -210364, -280063, -319353, -149480, -33849, -20364, -9362, 103633, 106076, 54805, 96563, 166856, 139849, 116511, -63034, -231477, -228516, -389876, -374520, -55511, 54124, 42069, 58954, 151601, 136455, 159651, 193770, 75307, -2301, 60692, 151913, 197588, 184521, 78122, -39169, -131157, -110855, 37551, -81675, -56349, 43738, 172803, 199635, 155080, 118215, 62019, -114530, -168052, -118881, -36378, -32328, 148882, 333118, 191880, 84350, 63411, 53356, -66779, 35243, 234829, 290099, 320910, 205251, 6136, -101827, -166412]
15410a66412O4088J65483K84498o5691j28978j02079L0413l142k03420o337O5279
15399f6298J30891j65884m2310N9343J35521N4827O8629l1398J10634n6758j9878
15388A77319r8364j03985M602r0303R0105J04256K975R2781l234j19362K1657
15377G8447O2707K1913k38674j01712q169o2369M1690p6795K4306J50454R9551
15366h651j05811j31608L7891Q0345P6437M7231J8317R6139j10686L5316M8343
15355H3263j06272m9531K3999j38285j83889J21238R7807M1757J67540R4440J43490
15344B95557M742r0761p6599N3283q088r6368j59394j28498j4434J3318j9854
15333b27096M5817R0581J78402M8157j65915j0321K7299J4415j51936r0351N2086
$$ y = [-166412, -102324, 63159, 347657, 281966, 152988, 50909, 81322, 78180, -125240, -131577, -66298, 64593, -101291, -143601, -84258, 51263, 106090, 174719, 143321, 253955, 197197, 177319, 78955, -25030, -20428, -110731, -20626, 83630, 86605, 179386, 176152, 56790, 78447, 141154, 163067, -75607, -177319, -185488, -247857, -206167, -282962, -258656, -108202, -8651, -114462, -246070, -208179, -127834, -51397, -4166, 14151, 110290, -396, 34920, 83263, -23009, -72540, -48541, -186826, -370715, -249477, -151670, -109913, 57627, 152067, 295557, 300299, 209538, 132939, 186222, 178134, 81766, -77628, -206126, -220560, -207242, -227096, -181279, -90698, 87704, 135861, -30054, -40375, -13076, 1339, -150597, -240948, -188862]
15322a88862L3270M0937J04164N2320j16987M0406q3495j0200l5780k6980n57
15311a91764J49609L7262o427o0028k8030l9776K5754j56650J49207J28277L2625
15300D0059j1418O3559p9565j32436J4584O3716p1278M4281N1972m7017j37011
15289b00554j42081n247K28907J36083P32M9605r4562r6405K08547N642L5586
15278A26253r123j74263j29636J37391O0582p2643J10157R1040q1826q7714j58461
15267a88243R713J55431l2257J1608K0431o2921R9337o3914J19713j11350n3490
15256i5942l851j03769j28823J4151J34954R389J05549R3774k6682L0001N3453
15245H2204o6751p8020r260J41361j12897J33851Q6844j46661r0979J7034k8483
$$ y = [-188862, -155592, -114655, -10491, 41829, -75158, -34752, -118247, -128447, -164227, -191207, -191764, -42155, -4893, -11320, -71348, -99378, -139154, -113400, -270050, -120843, 7434, 40059, 28641, 92200, 12635, -119801, -105217, -41501, -112779, -68498, -16526, -63543, -200554, -342635, -347882, -118975, 17108, 17840, 67445, -27117, -123522, 85025, 90667, 126253, 117130, -57133, -186769, -49378, 11204, -61439, 48718, 139758, 57932, -29782, -188243, -178530, -23099, -55356, -43748, -23317, -86238, 13099, -50815, 68898, -42452, -95942, -99793, -203562, -332385, -318234, -183280, -173891, -68342, 25432, -1250, 28751, 82204, 15453, -62567, -71827, 69534, -43363, 90488, 177332, 30671, -60308, -43274, -71757]
15234g1757R2557N1340P7679J7059o7263j36650o2211n6547j26968k5947M3583
15223b65125P2446K1214K23286J0149J22M9302J24880k7129q9913j930m0259P2758
15211A49801M8859K6243L090p7713k16436j64889j44283N7348J42564O4745N2126
15200e8545J41308j01956J7497J744j48181q5284j561N4595L1705P5233j4617
15189h8062K5252K08350J52975j17720j71385Q4571m7245m9151L1678J7175m4603
15178A835L3697J61487o041j75888m2860j7143O8368J7701o5952j16767j8140
15167a59703K1426j18374N5958N6492r2557J2261P2115O613Q0096N7776M9504
15156D1607J87546o7971Q1762r3079j19902N5288Q6831J77828k43081k7436J56047
$$ y = [-71757, 20800, 72140, 149819, 166878, 99615, -37035, -99246, -155793, -282761, -308708, -265125, -192679, -171465, 51821, 61970, 62092, 111394, 236274, 209145, 119232, 117302, 77043, 149801, 198660, 224903, 227993, 150280, -66156, -231045, -375328, -317980, -175416, -110671, -58545, 82763, -19193, -1696, 48, -148133, -233417, -234978, -180383, -148678, -73445, -88062, -62810, 145540, 298515, 180795, 9410, 93981, 46736, -2415, 29263, 46438, 1835, 35532, 197019, 190978, 15090, -27770, -44913, 23455, 41156, -24796, -141563, -159703, -138277, -256651, -200693, -144201, -236758, -224497, -152382, -145769, -65673, -7897, 41607, 229153, 161182, 242944, 149865, 29963, 85251, 172082, 349910, 106829, 79393, 235440]
15145B35440j25125O447O873j8549R9255j54850q1767k530R3279J7911n4248j5388
15133F748p4748J18333m7831j03091Q1858n248l8947p2887R1131k2609q783J06113
15121C0039m9924O6634k0870j51258L3758K7005J5623j15952j32824p1193J60244
15110b08718J9970L3049M9897n1929J43182O195L0873j10889m3574J15342o686
15099b3288j51171M5413O9892k1148P0484O0245O9669L5578J1482o3754k8685
15088G4717J69772L8599J6738j34098o7073J8109j59695l9315K7847M1755P4743
15077F2099l683q4533M6987k0177j21537O1073q6010r5830j6699K3538J31973
15066a02799J8385m1906K08086k9946p2585P0137J09878R7895j03667k4239n4932
$$ y = [235440, 110315, 116762, 123635, 105086, 204341, 49491, -32276, -34806, 58473, 76384, 22136, 6748, -68000, 50333, 2502, -100589, -18731, -23979, -62926, -135813, -44682, -67291, -76074, 30039, -19885, 46749, 25879, -125379, -91621, -64616, -48993, -164945, -297769, -368962, -208718, -188748, -155699, -105802, -157731, -14549, -8354, 22519, -88370, -131944, -16602, -23288, -174459, -129046, -59154, -80302, -9818, 50427, 120096, 155674, 167156, 103402, 74717, 244489, 283088, 299826, 165728, 98655, 116764, -42931, -82246, -54399, -12644, 62099, 58416, -26117, 20870, 693, -120844, -59771, -145781, -241611, -258310, -234772, -102799, -84414, -126320, 81766, 51820, -20765, 49372, 159250, 257145, 153478, 129239, 74307]
15055G4307K792j03351j69280L8923L40763J68563L511j81334j22393k2033j29991
15044i9523L6216O1484J67441L5602j57384P059J35236l8787r9433q6290J6216
15033b2163Q6994P3100q42Q1108j1491j509k20536L2112M0517J075n840L1056
15021H3581l3875P0499r1737J289m2844J64253L9503j50019q6463M3628J50529
15010A48344q588r0310J54711J94419k42203k12553o4477J615Q5231J33517M7988
14999A47694j19214j22437L8153O0122j09984P1713J60675P7827j34503Q1577
14989A51623O427j31873K6387P8519J9055J4704L0460j27823k8996K7106N5324
14978A20913J39003j80595k62087J31849J65501N4583n2349P0124m6166p7963
$$ y = [74307, 77099, -26252, -195532, -156609, 184154, 352717, 356228, 174894, 52501, 30468, -99523, -63307, -1823, 165618, 201220, 43836, 50895, 186131, 147344, 47911, -38379, -22163, 64831, 137931, 137089, 218197, 206706, 205197, -15339, 16773, 57290, 58365, 52525, 83581, 49706, 120205, 28468, 29757, -13087, 151166, 190669, 40650, -45813, -2185, 148344, 139756, 49446, 204157, 398576, 156373, -56180, -120657, -119042, -33811, 99706, 147694, 28480, -93957, -55804, 4318, -105666, -33953, 126722, 204549, 70046, 151623, 158050, 26177, 52564, 131083, 150138, 164842, 195302, 67479, 38483, 65589, 120913, 259916, 79321, -182766, -50917, 114584, 169167, 116818, 186942, 140776, 62813]
14968F2813l9507J47657M8812o0117j25793k19442k9806M7881P1474J7001l6207
14957a15234n9403j18622J55961J25464J94419N9896k53090k31561K8193J67127
14947d6850L48207l7142j08493l3687j30531m3115q2087l2516J67001M3409j38147
14936i3951M757L1383j33700p8668M0287R4896L5939l1486J11946J51373J36916
14925B69692k18662j04454j26801j17493M39M2207J89225K12930q0893o1666O099
14914A0623j5818K6908N0999J20421l8121j83211q7015j1874J63564Q0791k1993
14903I5274r2508n0530n8310l8842L8009K02944Q4259J6047q1635o4819j06317
14892e6428L2215R1870J00495K7960j23360L1754q4877K5907l6547K1265J2067
$$ y = [62813, 23306, 170963, 219775, 159658, 33865, -185577, -215383, -167502, -96028, -79027, -115234, -174637, -293259, -137298, -11834, 182585, 242481, -10609, -242170, -213977, -46850, 301357, 264215, 155722, 122035, -8496, -51611, -133698, -166214, 787, 44196, -93951, -89194, -57811, -191511, -270179, -229892, -134996, -99057, -130543, -18597, 132776, 269692, 51030, -53424, -180225, -297718, -297279, -255072, -65847, 147083, 66190, 4524, 10623, -5195, 21713, 72712, 193133, 155012, -28199, -115214, -127088, 36476, 117267, 95274, 2766, -47764, -106074, -144916, -106907, 96037, 180296, 196343, 114708, 49889, -56428, -24213, 67657, 168152, 196112, 72752, 104506, 19629, 45536, 8989, 30254, 42321]
14881D2321l3001q2969l1041J4845o2994j23258L5085J31786N2411M4228J1786
14870h01Q9490j6901n4999n4676j2119J1571R178L0250k4479P7998n4112j76116
14858a75716M0929j33499n09L54951J69773r3507L7202m2659k11611l1326n5606
14847a41578N4844P0347J22806R1935P4167m5841o6569n5450n6067m9221O9042
14836F8415o688l5568K5203p7761q7135p096K28267J32549r2208j20388q8525
14825f0935r7363j19025K0676L0400K06137j758m5619J07579j0363o106J55381
14814A79004L8786P0894K1400l9105r0745k5080J2236r7557j38508Q6562L6806
14803E4693p992m2963j19964l5545Q175J1783P7453N0034m6106q1975J76417J11805
$$ y = [42321, 9320, -73649, -104690, -89845, -152839, -276097, -241012, -109226, -56815, -12587, -801, 88689, 71788, 16789, -37887, -50006, -38435, -29257, 993, -23486, 54512, 400, -175716, -134787, -268286, -268795, 86156, 255929, 162422, 199624, 156965, -54646, -85972, -141578, -86734, -16387, 106419, 198354, 272521, 226680, 160111, 104661, 48594, -627, 68415, 61727, 26159, 51362, -26399, -113534, -120630, 107637, 240186, 147978, 27590, -60935, -158298, -277323, -256647, -226247, -20110, -21868, -67487, 40092, 29729, 23623, 179004, 217790, 288684, 310084, 270979, 180234, 155154, 167390, 69833, -68675, 17887, 54693, 46701, 3738, -116226, -151771, -143596, -131813, -54360, -4326, -50432, -132407, 44010, 155815]
14791A55815J08385j53532j80665J684P0388P3659O9838O737o9704j03479N7145
14780C6271j73825q8137K36795J02214j34653k36398m7668K84036J10094R0j57336
14769f8517R4100J00106m3812j88089R0765J11956J07835N3548j65436j32791
14759d0335Q5364M0240N9909L066j41182Q2201O2385j42648n4406k05118r28J03438
14747a48014P7616J12144M8639j02501n0898l8679k2587R7028J4082K9713k11198
14736a94655P960j99316j5189J2296J69428J56188L4103l3655P7998Q8066O4187
14725A67411n097o2204o1343p8473R3001L8429q9446r8131L6170J19999J5454
14714G5770j43637q6042L6810J05368J01262m7138m2164j74537O7968J03808K41276
$$ y = [155815, 264200, 110668, -69997, -68313, 2075, 75734, 145572, 152309, 82605, -20874, 36271, -137554, -225691, 11104, 113318, -21335, -257733, -305401, -21365, 88729, 88819, -68517, 25583, 125689, 81877, -106212, -15447, 96509, 204344, 257892, 92456, -40335, 45029, 85269, 145178, 148244, 7062, 89263, 151648, 9000, -45406, -250524, -251452, -148014, -70398, 41746, 90385, -12116, -63014, -101693, -124280, -27252, -13170, 16543, -194655, -186695, -386011, -401200, -388904, -219476, -63288, -29185, -62840, 15158, 103224, 167411, 162314, 100110, 38767, -39706, 53295, 91724, 2278, -95853, -59683, 60316, 75770, -67867, -153909, -117099, -11731, 89531, 42393, 229, -174308, -106340, -2532, 238744]
14703B38744K41899k46026k41658O9921k0394q6033O3838J43731k03418n6672
14693i6068J72056j10399j34880o8116J24360J49794m2909m9994L3845j32636
14683a54947j11372J24445J60431J3239j34724o6857k1611J2388J37497N2434
14673A0923M3827P3242o2648k8800J13222K4009m3189o0956K37689J90267j99395
14662B98191j07606o4082j35545j50940P6871p3193j39652K377J33374J17901
14652d2304R947j08376J10337K02557k8200O5747O2342j35561j10959O1727J72585
14641B59842Q5456n1798L660o046J23419o5621P7155J67561J38578J21392K8288
14630H81886r6276r1658L2055K37426P843r2838k59730j49791q658M420q9951
$$ y = [238744, 480643, 234617, -7041, 62880, 42486, -43547, 20291, 164022, -39396, -96068, 75988, -34411, -169291, -237407, -113047, 36747, -6162, -56156, -22311, -154947, -266319, -141874, 18557, 31796, -102928, -169785, -191396, -179008, -41511, 10923, 54750, 127992, 65344, 36544, 149766, 173775, 130586, 69630, 307319, 497586, 298191, 190585, 126503, -9042, -159982, -83111, -156304, -295956, -293579, -160205, -42304, -32357, -140733, -30396, 172161, 143961, 209708, 272050, 136489, 25530, 87257, 259842, 345298, 293500, 297160, 291114, 414533, 348912, 426067, 593628, 732206, 853598, 881886, 785610, 693952, 726007, 963433, 971276, 878438, 618708, 468917, 460259, 464679, 374728]
14619C74728J55943M8798j50403J4642J36974J70142J07029q5807j02369j83045
14609D86632O1349K7348p1320l8002n8995p8422O3204L25332O6543M0385n8222
14598G65832M6325J27573J47021Q2737q7703k39535j67872l3152n202q2243N8508
14587F12289j30452m9829m5245J21082p2627L936k6902l0156k38031N8841J41689
14576C44595o0057j64952j35154M5960P0581j1115j51071K6617L80468K7322j46840
14565B26354n4414L1945L0421n3230j52947O3683J12823K02881k1146l1692k8338
14554C26340r3171O2102J44945k21883k15361j89775Q9997K3007j3799m4868J53569
14543B1103Q7751l3033L7201O4692o4833j35094K9092J3013k3024R7425Q5221
$$ y = [374728, 530671, 579469, 429066, 443708, 580682, 750824, 857853, 772046, 669677, 486632, 547981, 575329, 504009, 466007, 407012, 328590, 391794, 717126, 783669, 824054, 765832, 812157, 939730, 1086751, 1169488, 1081785, 842250, 674378, 641226, 636024, 553781, 612289, 481837, 432008, 386763, 507845, 435218, 439154, 412252, 382096, 144065, 202906, 344595, 284538, 119586, -15568, 30392, 100973, 89858, -61213, -34596, 345872, 373194, 226354, 171940, 203885, 234306, 181076, 28129, 91812, 204635, 407516, 386370, 354678, 326340, 233169, 295271, 440216, 218333, 2972, -186803, -96806, -73799, -87598, -132466, 21103, 108854, 75821, 113022, 177714, 112881, -22213, 6879, 19892, -3132, 94293, 179514]
14532A79514J68412K18318j47951K3029n2279j03618l3114q2624j40940k4431
14522D316r8992J00401J33120o6881j79612n8948Q276K06316o8859j83083j47229
14511c51175q382L9952K30769P5558N8861N831o141L06380j5919j45846k600m9461
14499A37827j30767j72114j8421j1400N2606K00852n0583j25878R8369K48782
14489B29273J07052o6936j77639j28658P5977r0525j26468p6402q15J75227K84708
14478B04794L3383k9454k4352P7369L4011j40852q9785K7921k62302n097J5399
14467a58965q0517J00626J80077N2088N3957q9854j8089J71248J38416j82347
14457A66640j05499j53630l7552J62549K15618j39243L992k6323k2919p2060o8710
$$ y = [179514, 347926, 566244, 418293, 441322, 389043, 285425, 252311, 169687, 28747, 4316, -94676, 5725, 138845, 71964, -107648, -166596, -158320, 47996, -20863, -203946, -351175, -359557, -319605, -88836, -13278, 45583, 51414, 45273, 351653, 335734, 189888, 187288, 137827, 7060, -165054, -183475, -194875, -142269, 58583, 8000, -117878, -19509, 229273, 336325, 269389, 91750, -36908, 39069, -51456, -177924, -254326, -255141, -79914, 204794, 238177, 208723, 184371, 261740, 295751, 154899, 65114, 93035, -169267, -174364, -158965, -239482, -138856, 41221, 93309, 147266, 57412, 39323, 210571, 348987, 166640, 61141, -92489, -130041, 32508, 248126, 108883, 112875, 86552, 63633, -8427, -77137]
14446g7137J3724R9433P5862k4283n6869J61654p593j09009L2431j0368N7459
14435A55304R5682O9767j32965N65K40834L3711n899l6160k01292l7780j287P9928
14423B60408J5847j16877l6465l0861o0499j49342J36843j4627o9273M1762J50401
14412A27317J85497N4817k3098j51329p9979K36J59151J08278M1476j53656o0589
14401B08121J85209R4405o7989J6855J44882p955k73592k10409O5677J17346J01224
14390C73774k14295k84504J10926K41425P865j52816o3890j638P0243p0641M0564
14379E7013K5663p8640k24923N3479m7819l7592O2462J77653l0521P3916J33838
14368A64529P035O8065j6427k62924j476n028j10631J10051O1981P2760L7726
$$ y = [-77137, -63413, 36020, 111882, 87599, 30730, 192384, 184791, 75782, 108213, 97845, 155304, 250986, 320753, 187788, 188353, 429187, 462898, 456999, 420839, 219547, 181767, 180480, 260408, 276255, 159378, 122913, 92052, 31553, -117789, 19054, 4427, -64846, -23084, 127317, 312814, 367631, 344533, 193204, 113225, 113461, 272612, 380890, 422366, 268710, 208121, 393330, 487735, 419746, 436601, 581483, 573528, 299936, 89527, 155204, 272550, 373774, 159479, -125025, -14099, 227326, 235191, 82375, 18485, 16847, 87090, 16449, 57013, 82676, 4036, -220887, -167408, -215227, -252819, -190357, -12704, -43225, 30691, 164529, 171564, 239629, 223202, -39722, -41198, -46226, -156857, -46806, 15175, 87935, 125661]
14357A25661M009J88117J712j08002k31858o4051J93435J81716j74207j18106
14347a574k5875J92931J31163m4619Q2596N6831p3505r202j08306m1539q8202
14336G0699L9065J48201J9532o3207p0542j58809N2455N6263j30422n1648J10509
14325B2096k46382m1439j1934J26069J32668J97306L351j68365j34349J54065
14315C3086J57523J6214J0923k219Q1714k4567J31142l2104j48330n475j20994
14304I6913J7267R2119J66748j8623k6472m4138n2088J2383J42661J27143j28671
14293C85242j14232k5907k0290J0297j03829P9996O8970r5466o6965j68228p0287
14282a20699J1243Q2637K22115r1284n3580J47861O152N7l907p3544N7357J77012
$$ y = [125661, 129670, 317787, 319499, 211497, -20361, -84412, 109023, 290739, 116532, -1574, -27449, 165482, 296645, 252026, 334622, 391453, 317948, 308746, 200440, 158901, 70699, 109764, 257965, 277497, 214290, 143748, -15061, 37394, 93657, -36765, -88413, 22096, -224286, -265725, -277659, -151590, -18922, 178384, 181735, 13370, -120979, 33086, 190609, 206823, 217746, 215527, 297241, 272674, 403816, 371712, 223382, 217907, 96913, 114180, 206299, 373047, 354424, 327952, 283814, 231726, 244109, 386770, 513913, 385242, 271010, 245103, 224813, 235110, 131281, 211277, 280247, 184781, 117816, -50412, -120699, -109456, -26819, 195296, 104012, 50432, 198293, 204445, 204502, 200595, 127051, 184408, 361420]
14270C61420r6073j66840M1793o9691j834R231J62383O8291O4999J80043Q4710
14259F38432m2708k6961n0978n7125M7753Q735M1682J7346Q4674m9581k7589j19314
14247D64366j7628l0820n0523J11421P2261J11429J55831J71448k273j19509j28896
14236G37107J23567R8093k15637j53861J07322K60238M8380o9131J09863O8527
14226A114468O6020J42087p2894K48207J74116o125J70037J53597J26232J49757
14216B265502L20413M3807J48829R6648J52532L30843M26855L60419M25268N80722
14206E151838P56444O14675O89183O22977Q33249J372111J503358J748442J974011
14197A5266288K455546K890088L311021M105305N100252O334486P723891R101454
$$ y = [361420, 265347, 98507, 140300, 70609, 68775, 78006, 240389, 308680, 373679, 553722, 638432, 595724, 568763, 517785, 460660, 508413, 517148, 558830, 576176, 660850, 611269, 583680, 464366, 446738, 415918, 365395, 476816, 549077, 660506, 816337, 987785, 985512, 866003, 737107, 860674, 958767, 743130, 589269, 696591, 956829, 1005209, 936078, 1045941, 1114468, 1180488, 1322575, 1249681, 1497888, 1672004, 1665879, 1835916, 1989513, 2115745, 2265502, 2585915, 2629722, 2778551, 2875199, 3027731, 3358574, 3785429, 4145848, 4571116, 5151838, 5908282, 6522957, 7212140, 7835117, 8668366, 10040477, 11543835, 13292277, 15266288, 17721834, 20611922, 23922943, 28028248, 33128500, 39462986, 47186877, 56288331]
14189E6288331J0656834J1984421J2948557J3003892J2307567J1084197Q762142
14182A37035941N692795K407774q93704l997822o606367q430152r411260r604993
14174A06192212r005471q253975p115140o096472m810340l864996l061121k319904
14166F1664793j436805p56046j71242L84288J156300J610217K166165K991435
14158F7609105L814216M570887N242667O205525P294641Q427673R384576R687800
14150A22237090R259678Q432468O651357M036116J024927k431330n726203q709971
14142A34774132j1168409j2569970j3231975j2771244j1955201j0568960r114234
14135E3394139p558783o209168n193900m233412l383089k758059k170717j695731
$$ y = [56288331, 66945165, 78929586, 91878143, 104882035, 117189602, 128273799, 137035941, 142728736, 145136510, 144242806, 140244984, 133638617, 125208465, 115797205, 106192212, 97186741, 88932766, 81817626, 75721154, 70910814, 67045818, 63984697, 61664793, 60227988, 59471942, 59300700, 59684988, 60841288, 62451505, 64617670, 67609105, 71423321, 75994208, 81236875, 87442400, 94737041, 103164714, 112549290, 122237090, 131496768, 139929236, 146580593, 150616709, 151641636, 149210306, 143484103, 134774132, 123605723, 111035753, 97803778, 85032534, 73077333, 62508373, 53394139, 45835356, 39626188, 34432288, 30198876, 26815787, 24057728, 21887011, 20191280]
14127B0191280j670222j345641r44097n29241n48945p25898p53352p60863o36455
14118A2276566m83679p56276j093850r61356q76578p36867p26988p51028p16074
14109E173870p30221m13127m8038k73990k77163j66611k29520m7830o9693k47243
14099B670434p8444k95228j38754P1321j40299l16248j48438K7039o4093o3880
14089A523410p5173j15213N2088m3302K16O3187k8749j3863j73559j46872O6690
14078A108860p3170R2022p8674j16139l0927K05509j26395l2533j11151o9461
14068G67941P2761j6077M4044q1460M8949j30831p3267J03631O8437L9441q2797
14057G60772r331K514j85175j05084j70496J00375K45848R7580l5548M6202L4542
$$ y = [20191280, 18521058, 17175417, 16231320, 15702079, 15153134, 14427236, 13673884, 12913021, 12276566, 11792887, 11036611, 9942761, 8981405, 8104827, 7367960, 6640972, 5889944, 5173870, 4443649, 4030522, 3982484, 3708494, 3431331, 3264720, 3035200, 2987370, 2917677, 2670434, 2591990, 2296762, 2158008, 2229329, 2089030, 1772782, 1624344, 1651383, 1587290, 1523410, 1448237, 1333024, 1385112, 1341810, 1342026, 1405213, 1376464, 1362601, 1189042, 1042170, 1108860, 1035690, 1127712, 1049038, 932899, 901972, 1107481, 981086, 948553, 837402, 767941, 840702, 824625, 868669, 787209, 836158, 705327, 632060, 735691, 804128, 843569, 760772, 751441, 753955, 568780, 463696, 293200, 393575, 639423, 737003, 701455, 747657, 782199]
14046G82199j96549L4855R7303k24825M96R439j958J65273Q218j66369k7782M0604
14034E20904Q3170N1964r0248l5494q8722j14422N7570N8129j8682m3012m0682
14023C40475k4009k1067J34633O7472Q9522Q2875j58711j57169j5281j04284o1073
14012A73383M5688J29580J89953j08941j24491P570J73746R0560j25150o1516
14002C90382K2670p4264j93579J62167L2919j44394m575m6510n6325M7894L8699
13991A75084J41801r494k40478o2354q75J9204j6022r891j9810P2902M2106J31588
13979B23761k1997M9523J57738p3676N9297J30260K7924j12040N1959q4492k84052
13968A24205j02310k8733J15976j10864p7190J67581J28096J77397N1450j8571
$$ y = [782199, 585650, 620505, 717808, 492983, 493479, 502918, 500960, 666233, 674451, 508082, 480300, 520904, 604074, 656038, 565790, 530296, 441574, 327152, 384722, 442851, 424169, 381157, 340475, 316466, 295399, 430032, 497504, 587026, 669901, 511190, 354021, 338740, 234456, 173383, 219071, 348651, 538604, 429663, 305172, 312742, 486488, 577048, 451898, 390382, 413052, 338788, 145209, 307376, 340295, 195901, 191326, 144816, 88491, 136385, 175084, 316885, 307391, 66913, 4559, 3684, 22888, 6866, -3025, -22835, 50067, 92173, 223761, 201764, 251287, 409025, 335349, 394646, 524906, 552830, 440790, 492749, 408257, 124205, 21895, -6838, 109138, -1726, -78916, 88665, 216761, 394158, 445608, 427037]
13958D27037l6879J2798j03256j26941P1730m2366l774L1331N6895j31170N2638
13947B08043M9338J8409j4830m2780k17018r8620R7992k3569q852J50346M8027
13936A66486J34509r2254p0919J55078o0840r1579q338J90747O1254r0700P6047
13925C69491j04867k51361J2807R8676J29883J1707O8218o4548k22978j23805
13915g6777K9455J56692J12239J10334j48585j37719N5699j59028q3105L6667
13905a04128P6274l6140K78937K43189r5882n3112N4665K1014l9728q4928L3970
13894B94131p2334j42961j36474j008O7922M5464j41727L9211J74695J83079J17424
13883D27422o8339j5033j80919p0584R3149Q0691l9827J36476J09075j59001k68488
$$ y = [427037, 390158, 402956, 299700, 172759, 244489, 202123, 198349, 229680, 286575, 155405, 208043, 257381, 275790, 260960, 218180, 1162, -97458, 534, -23035, -31887, 118459, 166486, 300995, 208741, 137822, 292900, 232060, 140481, 132143, 322890, 384144, 293444, 369491, 264624, 13263, 26070, 124746, 254629, 266336, 334554, 270006, 47028, -76777, -47322, 109370, 221609, 331943, 183358, 45639, 101338, -57690, -140795, -104128, -27854, -63994, 214943, 458132, 362250, 309138, 363803, 384817, 345089, 260161, 294131, 221797, 78836, -57638, -58646, 9276, 54740, -86987, -47776, 126919, 309998, 427422, 359083, 344050, 163131, 92547, 185696, 266387, 226560, 363036, 472111, 313110, 44622]
13872D4622p5776K71904K18502j22457l31n8843j43539N1269L4791k7398n1470
13861A41274p6020j82164p6663l4571k09559R0232P184J73771K14387j9297j0563
13850A8011K01847J63023m3605k0732K2649J7687j59884j45167K0684l8258o1815
13839b5560K2167J2603j2441q2593N8124J34437k8427q3313P1140R0548q894n9711
13827H8080j17912J32702K05103K6532j32942j77094Q0174L1235l1679q7878j73057
13816a56736r6868J59850J96455l0397l3310Q6712o8482N4807j49891J8459K7559
13805H158J9114m364n2734r817l4771Q9579L516j16611m1358k3326N020o3156
13793b20750M7242R5377j11555j05966j4090R0072J55769J04215P4245l6717j14154
$$ y = [44622, -31154, 240750, 459252, 336795, 336464, 277621, 134082, 185351, 220142, 192744, 141274, 65254, -116910, -193573, -228144, -437703, -347471, -340287, -166516, 47871, 28574, 18011, 219858, 382881, 339276, 318544, 341193, 358880, 198996, 53829, 74513, 36255, -25560, -3393, 9210, -3231, -85824, -27700, 106737, 78310, -5003, 66137, 156685, 147791, 88080, -29832, 102870, 307973, 334505, 201563, 24469, 104643, 135878, 104199, 16321, -156736, -253604, -93754, 102701, 72304, 38994, 125706, 57224, 112031, -37860, -19401, 8158, 27272, 22908, -29826, -39643, -74414, 15165, 18681, -97930, -139288, -162614, -157594, -220750, -173508, -78131, -189686, -295652, -309742, -219670, -63901, 40314, 114559, 77842, -36312]
13782c6312L3040N8951o6911q889J34416j50275j57191P5942J2743n7984k0812
13771a83282P6887P1860L4866J1980l3228n5952l0083K5202M0389N5835R9134
13760A13608K36510Q8457j13191j03312j11695O7718j8994l9881j61494K4846
13750a7428Q1237O7663j5967M7501o8824K5939M6866L1670p6742J8103M0819N9343
13738B40180l8672n217Q9569J47589J84954o156P7842J72107N0429K6827Q7494
13727A026946Q6574p6752j46172o2011N05J89436j18158j74065q8797L8922K5268
13716G01696p9424o6202J39970R1596N8567j62081j08826J3866m0950o1125J34074
13705F21161L5897J55022J3933k00249o7095M2312p892j88040L7547P2388J80939
$$ y = [-36312, -3272, 55679, -11232, -20121, 114295, -35980, -193171, -117229, -104486, -162470, -183282, -106395, -34535, 331, 12311, -20917, -76869, -106952, -81750, -41361, 14474, 113608, 350118, 438575, 325384, 222072, 110377, 178095, 159101, 119220, -42274, -17428, 63809, 131472, 115505, 163006, 94182, 120121, 166987, 198657, 121915, 140018, 180837, 240180, 201508, 196291, 285860, 433449, 618403, 612247, 690089, 862196, 912625, 939452, 1026946, 1113520, 1036768, 890596, 828585, 829090, 1018526, 900368, 726303, 637506, 676428, 701696, 622272, 556070, 696040, 787636, 846203, 684122, 575296, 589162, 548212, 487087, 621161, 657058, 812080, 826013, 625764, 558669, 600981, 593089, 405049, 442596, 514984, 695923]
13694F95923k3506K5640J28727K1606l3187P6653j0383j66150M416p7388p4440
13683E67911j36540j95300n0001J14293J23906n4111q6777q3884J3388l2081o3618
13672A17186J33713k7794q724J40648P530J33420j42352j84897j4912J14082q6984
13661A80916j2110J46349J51761J1774J37344p4447k10755l1177P0119o4387q0084
13650B25303j08471j2426l5062r6421m1944J34822N6058j78562j2436L5085N2910
13639A8856n1525j81414k6153J20039J32430j15628j01805j000N8458R1306p717
13628f4153J68781L577p2836r6261P3403J11751J00472j81567k60237K5564N4514
13617a36992N749J38225o5536K0q3539o1785R5146K46514J52983j27307j00056
$$ y = [695923, 672417, 698057, 826784, 848390, 815203, 891856, 881473, 715323, 719739, 642351, 567911, 431371, 236071, 186070, 300363, 424269, 370158, 283381, 199497, 212885, 180804, 117186, 250899, 223105, 214381, 355029, 362559, 495979, 353627, 168730, 153818, 267900, 180916, 168806, 315155, 466916, 478690, 616034, 541587, 330832, 299655, 369774, 305387, 225303, 116832, 104406, 69344, -27077, -69021, 65801, 121859, -56703, -69139, -34054, 18856, -32669, -214083, -240236, -120197, 12233, -103395, -205200, -206200, -147742, -56436, -64153, 104628, 108205, 35369, -60892, 12511, 124262, 224734, 43167, -217070, -191506, -136992, -131243, 6982, -58554, -58534, -142073, -203858, -108712, 137802, 290785, 163478, 63422]
13606F3422O9171j1382m495m3265k0184O4207M76j7539o1241O9160O8454O1944
13594B38728J5254N4764q1413p0692Q4071m148L6642L2542K668m0621l9902n1605
13582A76288k21139L5845p3189M371L9148l5372K1291J45687O4946n0783r0906
13571A6187L7705J1196j0795k7309j80997M3530J39772o8379L4584m7576j46055
13560a98137q5148J25338Q2245J8454M4552N5289O9902l191J11170J01183q590
13549C13067j72485j83452l0434M081J03277k1123Q9591l811l0285j37333k4927
13538i3834J12845j13806l3998J99998J20550P5565J49007j00182j54113j11042
13528E0990O2225J52346K7286k16322j7373Q0061Q3517J7656n2378n3773o8656
$$ y = [63422, 132593, 121211, 116716, 73451, 53267, 117474, 117950, 100411, 39170, 108330, 176784, 238728, 253982, 308746, 227333, 156641, 240712, 236564, 273206, 305748, 308416, 267795, 227893, 176288, -44851, -9006, -82195, -77824, -38676, -74048, -52757, 92930, 157876, 107093, 16187, 53892, 65088, 54293, 26984, -154013, -110483, 29289, -39090, -4506, -52082, -198137, -283285, -157947, -75702, -57248, -12696, 42593, 112495, 109304, 220474, 321657, 313067, 140582, -42870, -73304, -69223, 34054, 12931, 102522, 98711, 68426, -68907, -93834, 19011, -94795, -128793, 71205, 191755, 267320, 416327, 316145, 162032, 50990, 113215, 265561, 292847, 76525, 59152, 139213, 222730, 240386, 188008, 134235, 65579]
13517F5579M8101k2216N5417o6672M2713J49096j46482j24550L7494l9253J07978
13506A07205J35145q1407j22829L483K6024L7498l5084o7670j1015n4852j13448
13495a76950J04974Q4281M2031M9805Q9881J25808l796j04930O251j06763m5343
13484F5249k4215M569J1280q8229P1461P063R672r141p8185r763m6759m0738l2686
13471a60422N9000K7273j67243l2768J03360J26455L0011l1648j67326N413K05829
13460b066J46125M8757Q1873M181j16408J21180Q3736M0815n5896k31639j98964
13449g8306j00858J7354J0106P1898r8818p7256J06384K38825Q4940j65100L1291
13438D0460O2605J02235K34417J49592j00020k81949j66475L5994M7060P8008
$$ y = [65579, 113680, 91464, 146881, 80209, 122922, 272018, 125536, 986, 38480, -773, 107205, 242350, 160943, 38114, 41597, 67621, 105119, 70035, 2365, -8650, -63502, -176950, -71976, 12305, 54336, 104141, 194022, 319830, 316034, 211104, 217355, 110592, 65249, 41034, 45603, 56883, -31346, 40115, 47178, 56850, 47709, -30476, -40239, -86998, -127736, -160422, -101422, -74149, -241392, -274160, -170800, -44345, -14334, -45982, -213308, -207895, -2066, 144059, 192816, 274689, 278870, 162462, 283642, 367378, 408193, 352297, 120658, -78306, -179164, -161810, -151704, -79806, -178624, -255880, -149496, 89329, 174269, 9169, 40460, 103065, 205300, 439717, 589309, 489289, 207340, 40865, 76859, 123919, 201927]
13428B01927N3078j01666J8758m097N6080q1623l8948p0434n733o6842n6604J06948
13416A0844J28538k9341K2957J08560k6517j74350J34147N0781k43366q3486k4584
13405a25817N6949Q7903N311j41711R6918J03772k385J88293M0680k54376j75602
$$ y = [201927, 255005, 153339, 172097, 168000, 224080, 142457, 103509, 33075, 27342, -39500, -96104, 10844, 139382, 110041, 132998, 241558, 215041, 40691, 174838, 225619, -17747, -101233, -125817, -68868, 19035, 24346, -117365, -20447, 83325, 80940, 269233, 309913, 55537, -120065]
$$ [...]
##END NTUPLES=NMR SPECTRUM
##END=
