##TITLE=Analysis number 325302
Compound Code cc 49713
Book Reference 423/118/13
Project Code adrs
Chemist Name bruced
##JCAMPDX= 6.0         $$ Bruker NMR JCAMP-DX V2.0
##DATA TYPE= NMR SPECTRUM
##DATA CLASS= NTUPLES
##ORIGIN= Bruker BioSpin GmbH
##OWNER= nmr
$$ XWIN-NMR		Version 3.5
$$ Mon Dec 18 11:10:45 2006 GMT Standard Time (UT+0h)  MAYBRIDGE\nmr@NMR_250MHZ
##.OBSERVE FREQUENCY= 250.131544655141
##.OBSERVE NUCLEUS= ^1H
##.ACQUISITION MODE= SIMULTANEOUS (DQD)
##.ACQUISITION SCHEME= undefined
##.AVERAGES= 16
##.DIGITISER RES= 18
##SPECTROMETER/DATA SYSTEM= dpx250
##.PULSE SEQUENCE= zg30
##.SOLVENT NAME= CDCl3
##.SHIFT REFERENCE= (INTERNAL, CDCl3, 0, 16.5138)
##AUDIT TRAIL= $$ (NUMBER, WHEN, WHO, WHERE, WHAT)
$$ ##TITLE= Audit trail, XWIN-NMR		Version 3.5
$$ ##JCAMPDX= 5.01
$$ ##ORIGIN= Bruker BioSpin GmbH
$$ ##OWNER= nmr
$$ C:\u/data/dgb/nmr/ADRS/1810/pdata/1/auditp.txt
$$ ##AUDIT TRAIL=  $$ (NUMBER, WHEN, WHO, WHERE, WHAT)
(   1,<2006-12-18 11:10:26.17 +000>,<MAYBRIDGE\nmr>,<NMR_250MHZ>,
      <created by zg, POWCHK disabled, PULCHK disabled
       configuration hash MD5:
       49 4B E0 1D 92 C2 6B 37 9F E6 65 BC 52 41 86 1D
       data hash MD5: 64K
       72 17 C2 1A 43 69 4E 20 AA 8B 25 8D 4E 91 55 06>)
(   2,<2006-12-18 11:10:37.91 +000>,<MAYBRIDGE\nmr>,<NMR_250MHZ>,
      <Start of raw data processing
       ef LB = 0.3 FT_mod = 6 PKNL = 1 SI = 32K 
       data hash MD5: 32K
       72 2E 3D 7F CE 00 E6 89 4E CB 6D 37 66 77 F7 6B>)
(   3,<2006-12-18 11:10:39.58 +000>,<MAYBRIDGE\nmr>,<NMR_250MHZ>,
      <apk 
       data hash MD5: 32K
       4B 7F 37 EB 66 1C D6 05 A7 BA CD 32 5B 6E 62 D0>)
(   4,<2006-12-18 11:10:40.25 +000>,<MAYBRIDGE\nmr>,<NMR_250MHZ>,
      <abs ABSG = 5 
       data hash MD5: 32K
       F3 81 AD F4 DD 0A 2F B4 81 90 81 7A C8 76 EB D5>)
$$ ##END=
$$ 
$$ hash MD5
$$ 99 8E 29 F6 DD 7D E2 68 57 3B C5 A0 15 56 A6 31
##$RELAX= 
##$RELAX= 
##$RELAX= 
##$RELAX= 
##$RELAX= 
##$RELAX= 
##$RELAX= 
$$ Bruker specific parameters
$$ --------------------------
##$DU= <C:\u>
##$EXPNO= 1810
##$NAME= <ADRS>
##$PROCNO= 1
##$TYPE= <nmr>
##$USER= <dgb>
##$AMP= (0..31)
100 100 100 100 100 100 100 100 100 100 100 100 100 100 100 100 100 100 
100 100 100 100 100 100 100 100 100 100 100 100 100 100 
##$AQSEQ= 0
##$AQ_mod= 3
##$AUNM= <au_zg>
##$AUTOPOS= <9 >
##$BF1= 250.13
##$BF2= 250.13
##$BF3= 250.13
##$BF4= 250.13
##$BF5= 500.13
##$BF6= 500.13
##$BF7= 500.13
##$BF8= 500.13
##$BYTORDA= 1
##$CFDGTYP= 0
##$CFRGTYP= 5
##$CHEMSTR= <none>
##$CNST= (0..31)
1 1 145 1 1 1 1 1 1 1 1 1 1 1 1 1 1 1 1 1 1 1 1 1 1 1 1 1 1 1 1 1 
##$CPDPRG= <>
##$CPDPRG1= <>
##$CPDPRG2= <>
##$CPDPRG3= <>
##$CPDPRG4= <mlev>
##$CPDPRG5= <mlev>
##$CPDPRG6= <mlev>
##$CPDPRG7= <mlev>
##$CPDPRG8= <mlev>
##$CPDPRGB= <>
##$CPDPRGT= <>
##$D= (0..31)
0 1 0 0 0 0 0 0 0 0.06 0 0 0 0 0 0 0.0002 0 0 0 0 0 0 0 0 0 0 0 0 0 0 
0 
##$DATE= 1166440225
##$DBL= (0..7)
120 120 120 120 120 120 120 120 
##$DBP= (0..7)
150 150 150 150 150 150 150 150 
##$DBP07= 0
##$DBPNAM0= <>
##$DBPNAM1= <>
$$ [...]
##$SUBNAM7= <"">
##$SUBNAM8= <"">
##$SUBNAM9= <"">
##$SW= 20.6930455092707
##$SWIBOX= (0..15)
0 0 3 0 0 0 0 0 0 0 0 0 0 0 0 0 
##$SW_h= 5175.983436853
##$TD= 65536
##$TD0= 1
##$TE= 295.16
##$TE2= 300
##$TE3= 300
##$TEG= 300
##$TL= (0..7)
0 120 120 120 120 120 120 120 
##$TP= (0..7)
150 150 150 150 150 150 150 150 
##$TP07= 0
##$TPNAME0= <>
##$TPNAME1= <>
##$TPNAME2= <>
##$TPNAME3= <>
##$TPNAME4= <>
##$TPNAME5= <>
##$TPNAME6= <>
##$TPNAME7= <>
##$TPOAL= (0..7)
0.5 0.5 0.5 0.5 0.5 0.5 0.5 0.5 
##$TPOFFS= (0..7)
0 0 0 0 0 0 0 0 
##$TUNHIN= 0
##$TUNHOUT= 0
##$TUNXOUT= 0
##$USERA1= <user>
##$USERA2= <user>
##$USERA3= <user>
##$USERA4= <user>
##$USERA5= <user>
##$V9= 5
##$VALIST= <valist>
##$VCLIST= <CCCCCCCCCCCCCCC>
##$VD= 0
##$VDLIST= <DDDDDDDDDDDDDDD>
##$VPLIST= <PPPPPPPPPPPPPPP>
##$VTLIST= <TTTTTTTTTTTTTTT>
##$WBST= 1024
##$WBSW= 4
##$XGAIN= (0..3)
0 0 0 0 
##$XL= 0
##$YL= 0
##$YMAX_a= 278350
##$YMIN_a= -351069
##$ZGOPTNS= <>
##$ZL1= 120
##$ZL2= 120
##$ZL3= 120
##$ZL4= 120
##$ABSF1= 16.51381
##$ABSF2= -4.179363
##$ABSG= 5
##$ABSL= 3
##$ALPHA= 0
##$AQORDER= 0
##$ASSFAC= 0
##$ASSFACI= 0
##$ASSFACX= 0
##$ASSWID= 0
##$AUNMP= <proc_1d>
##$AZFE= 0.1
##$AZFW= 0.1
##$BCFW= 0
##$BC_mod= 0
##$BYTORDP= 0
##$COROFFS= 0
##$CY= 12.5
##$DATMOD= 1
##$DC= 0
##$DFILT= <>
##$DTYPP= 0
##$F1P= 14.0000005364418
##$F2P= -0.99999901652339
##$FCOR= 0.5
##$FTSIZE= 32768
##$FT_mod= 6
##$GAMMA= 0
##$GB= 0
##$INTBC= 1
##$INTSCL= 1
##$ISEN= 128
##$LB= 0.3
##$LEV0= 0
##$LPBIN= 0
##$MAXI= 10000
##$MC2= 0
##$MEAN= 0
##$ME_mod= 0
##$MI= 0
##$NCOEF= 0
##$NC_proc= -4
##$NLEV= 6
##$NOISF1= 0
##$NOISF2= 0
##$NSP= 0
##$NTH_PI= 0
##$NZP= 0
##$OFFSET= 16.51381
##$PC= 1
##$PHC0= 225.9162
##$PHC1= 6.842463
##$PH_mod= 1
##$PKNL= yes
##$PPARMOD= 0
##$PSCAL= 4
##$PSIGN= 0
##$REVERSE= no
##$SF= 250.130002047639
##$SI= 32768
##$SIGF1= 0
##$SIGF2= 0
##$SINO= 400
##$SIOLD= 32768
##$SREGLST= <1H.CDCl3>
##$SSB= 0
##$STSI= 32768
##$STSR= 0
##$SW_p= 5175.98343685301
##$SYMM= 0
##$S_DEV= 0
##$TDeff= 65536
##$TDoff= 0
##$TI= <Analysis number 999999
Compound Code 99
Book Reference 9
Project Code 9>
##$TILT= no
##$TM1= 0
##$TM2= 0
##$TOPLEV= 0
##$USERP1= <user>
##$USERP2= <user>
##$USERP3= <user>
##$USERP4= <user>
##$USERP5= <user>
##$WDW= 1
##$XDIM= 32768
##$YMAX_p= 449143271
##$YMIN_p= -450577
$$ End of Bruker specific parameters
$$ ---------------------------------
##NTUPLES= NMR SPECTRUM
##VAR_NAME=  FREQUENCY,     SPECTRUM/REAL,   SPECTRUM/IMAG
##SYMBOL=    X,             R,               I
##VAR_TYPE=  INDEPENDENT,   DEPENDENT,       DEPENDENT
##VAR_FORM=  AFFN,          ASDF,            ASDF
##VAR_DIM=   32768,         32768,           32768
##UNITS=     HZ,            ARBITRARY UNITS, ARBITRARY UNITS
##FACTOR=    0.157963299565203, 1,           1
##FIRST=     4130.59913003624, 0,            0
##LAST=      -1045.38430681677, 0,           0
##MIN=       -1045.38430681677, -450577,     0
##MAX=       4130.59913003624, 449143271,    0
$$ Real data points
##PAGE= N=1
##DATA TABLE= (X++(R..R)), XYDATA
$$ [...]
16291B1935698n031703l677157k574381j816664j295604r91975p79446o02516
$$ 21935698 16903995 13226838 10652457 8835793 7540189 6548214 5768768 5166252
16283E166252m59951l80894l59510l22513l00759k39601j85281k00950j75167
$$ 5166252 4706301 4325407 3965897 3643384 3342625 3103024 2917743 2716793 2541626
16274B541626j72916j50939j35099j21391j16152j29309j24009j34832r3611q0884
$$ 2541626 2368710 2217771 2082672 1961281 1845129 1715820 1591811 1456979 1363368 1282484
16264A282484q9058r3035q6454j07154o7044n0916n0054n4670m6116n8941l5769
$$ 1282484 1193426 1100391 1013937 906783 839739 788823 738769 684099 637983 579042 543273
16253E43273m1050j8009k7126k6825k9304J4619j3631l1586m150k262m588J9089
$$ 543273 502223 484214 457088 430263 400959 415578 401947 370361 366211 363949 359361 378450
16241C78450K0909P682M250J9411k386J254L3028J9461M637M9329K9308J4913
$$ 378450 399359 407041 411291 430702 428316 429570 462598 482059 486696 536025 565333 580246
16229E80246J9388J2991o441N336j9771m3265l8810L1268q872k0979k8943k7110
$$ 580246 599634 612625 606184 611520 591749 548484 509674 540942 532070 511091 482148 455038
16217D55038l0164j5632j3533l7436l6196j1502J903K0931L634j4383j6808J3115
$$ 455038 424874 409242 395709 358273 322077 310575 312478 333409 337043 322660 305852 318967
16205C18967j3686l6420j8806J7088O37j2964j3808j8575k9070m161L7312J1387
$$ 318967 305281 268861 250055 267143 267780 254816 241008 222433 193363 189202 226514 237901
16193B37901n617n888O943K9822J5524K4556n861j0001J7195J6978J3033j827
$$ 237901 232284 226396 233339 263161 278685 303241 297380 287379 304574 321552 334585 332758
16181C32758k7554l8310k3444l850k1218j5182k6255l3851k390k5985l4086j6205
$$ 332758 305204 266894 243450 239600 218382 203200 176945 143094 140704 114719 80633 64428
16169F4428N786k1518k0001O643m805N120Q058J4341k1727M278j5773q702J5684
$$ 64428 70214 48696 28695 35338 30533 35653 43711 58052 36325 40603 24830 16128 31812
16156C1812L2041p935j3967J307j914j2907l266L4m966j819L591j1701j2927N03
$$ 31812 63853 55918 41951 43258 41344 28437 25171 25205 20239 18420 22011 10310 -2617 -2114
16142b114K2371J3777L671J9137J7383j075j6678j5021R873j8728l5352k329L1865
$$ -2114 20257 34034 37705 56842 74225 73150 56472 41451 51324 32596 -2756 -5085 26780
16129B6780N339j0986K0111j0165l3802j8573K2405N147k05j574J1051P689l1651
$$ 26780 32119 21133 41244 31079 -2723 -21296 1109 6256 6051 4477 15528 23217 -8434
16116h434j355K1201j8676j6212K2360K6870K3912O325j9573l0491M019M501k231
$$ -8434 -9789 11412 -7264 -23476 -1116 25754 49666 55991 36418 5927 9946 14447 12216
16103A2216J4894L826j2661j0758j0324L789K5134K8080p744j7056J125K388L995
$$ 12216 27110 30936 18275 7517 -2807 982 26116 54196 46452 29396 30521 32909 36904
16090C6904k3026k0104l179J7280o26N158J5932J0064j8173j3413P745P656P917
$$ 36904 13878 -6226 -9405 7875 7249 12407 28339 38403 20230 6817 14562 22218 30135
16077C0135J6213J805j6085p647p215l466r736P242O585K8438j9269R906M689
$$ 30135 46348 48153 32068 24421 17206 13740 4004 11246 17831 46269 27000 36906 41595
16064D1595m5067Q483K6182K5112p028k9741j4699K122n059J8656k762K769o410
$$ 41595 -3472 5011 31193 56305 49277 19536 4837 6959 1900 20556 17794 20563 14153
16051A4153K383J4044o607j936K2089j0568m9590j6665K6216L5219n176k199j2176
$$ 14153 16536 30580 23973 22037 44126 33558 -16032 -32697 -6481 28738 23562 21363 9187
16038I187k9646J1620O244q656N008J0873l795L413q315L321J147M329J5934K702
$$ 9187 -20459 -8839 -2595 -11251 -6243 4630 835 4248 -4067 -746 401 4730 20664 23366
16024B3366R038J4716j1513K0715J1768q951k632O78q135k6593k4260P053N539
$$ 23366 32404 47120 35607 56322 68090 59139 56507 57185 49050 22457 -1803 5250 10789
16011A0789j940m184K024j9342p604J2764J1365N752m838p266k662J372J8057
$$ 10789 8849 4665 6689 -12653 -20257 -7493 3872 9624 4786 -2480 -5142 -3770 14287
15998A4287K4601M043n092l935k7650q149N005J5474J8938K0013n562R7j3598
$$ 14287 38888 42931 37839 33904 6254 -1895 3110 18584 37522 57535 51973 52070 38472
15985C8472J3408l870j2765L076o825r867L0419J2919j1746n0842l4579J3225
$$ 38472 51880 48010 35245 38321 31496 21629 52048 64967 53221 2379 -32200 -18975
15973a8975J602J5478K5238J2700j2018l0317R626k8005J0881J0336m314M002
$$ -18975 -17373 -1895 23343 36043 24025 -6292 3334 -24671 -13790 -3454 -7768 -3766
15961c766k5502j3431K272L7397N4246o098j2587j0433j2714j2902P658j2983
$$ -3766 -29268 -42699 -40427 -3030 51216 45118 32531 22098 9384 -3518 4140 -8843
15949h843r497K7762q698j3562O454R616J131J5612J8266r145j3642l1158L95
$$ -8843 -18340 9422 724 -12838 -6384 3232 4363 19975 38241 29096 15454 -15704 -15309
15936a5309r526k019J9823N507o753k1266K6967M6934O842j2856N856n847L283
$$ -15309 -24835 -26854 -7031 -1524 -8277 -29543 -2576 44358 51200 38344 44200 38353 41636
15923D1636r043k2067p253J7104k379j5574r291R107L207L859J225l677k777k2750
$$ 41636 32593 10526 3273 20377 17998 2424 -6867 2240 5447 9306 10531 6854 4077 -18673
15909a8673J1571N834L0609J5248n0401k5210J7563L229j5371j3847J1564j2255
$$ -18673 -7102 -1268 29341 44589 -5812 -31022 -13459 -10230 -25601 -39448 -27884 -40139
15897d0139k293o633p394P880K0549K9613M824J4373J0489J0841j2726k2323J2267
$$ -40139 -42432 -49065 -56459 -48579 -28030 1583 6407 20780 31269 42110 29384 7061 19328
15884A9328N561k1577j5478O903K5628M862j773k2165k6963j3126J306l13J6945
$$ 19328 24889 3312 -12166 -5263 20365 25227 23454 1289 -25674 -38800 -37494 -37807 -20862
15871b0862N503J6090Q323o433l5516j5470R265L2306K3817l61n951o479l465
$$ -20862 -15359 731 9054 2621 -32895 -48365 -39100 -6794 17023 16662 10711 4232 767
15858G67L155J5050N948j0773n233j2112K0787R954P997j1884j0488J7452k7547
$$ 767 3922 18972 24920 14147 8914 -3198 17589 27543 35540 23656 13168 30620 3073
15845C073q973P145J6107K6375k1201j0567N708j9126k003o471o57j2307k2970
$$ 3073 -5900 1245 17352 43727 22526 11959 17667 -1459 -3462 -9933 -10590 -22897 -45867
15832d5867J4139R339M377k6096o502Q472k9383J3878K4413J101J4478n689J9309
$$ -45867 -31728 -22389 -18012 -44108 -50610 -42138 -71521 -57643 -33230 -32129 -17651 -23340 -4031
15819d031J3204j0798J9895J2031l5014j4833J5790j2707j2039Q363j4857J9919
$$ -4031 9173 -1625 18270 30301 -4713 -19546 -3756 -16463 -28502 -20139 -34996 -15077
15807a5077J5807N530k294Q773R290k0095r599j5152k917J8284K04r716N679n751
$$ -15077 730 6260 3966 12739 22029 1934 -7665 -22817 -25734 -7450 -7246 -16962 -11283 -17034
15793a7034Q890L0801J9730J7809j3868j3550n355q14k4007J1718J2896O901Q002
$$ -17034 -8144 22657 42387 60196 46328 32778 27423 26609 2602 14320 27216 34117 42119
15780D2119n818O095J5125J1273J7831N390Q237K7380L7268J4569O6025N1797
$$ 42119 36301 42396 57521 68794 86625 92015 100252 127632 164900 179469 245494 297291
15768B97291J5017N4082N3385N5489M2779L9910P859j5758k3707L500J6374l1405
$$ 297291 312308 366390 419775 475264 518043 557953 565812 550054 526347 529847 546221 514816
15756E14816m7999o6075o9100o6329m7080p768j2410l2744m4065m4707l7309k409
$$ 514816 466817 400742 331642 265313 218233 210465 198055 165311 121246 76539 39230 36821
15744C6821J9714m658l7679p646Q483R184k4363k0464l751M820j3310q368o901
$$ 36821 56535 51877 14198 6552 15035 24219 -144 -20608 -24359 -19539 -32849 -41217 -48118
15731d8118J2714J2346J6015J7615j7311J5379j3444j54j8986K7495J7234K3644
$$ -48118 -35404 -23058 -7043 10572 -6739 8640 -4804 -4958 -23944 3551 20785 44429
15719D4429K893j2788p027o977R717J1527l3966k4021K2072k661r550L919o111
$$ 44429 47322 34534 27507 20530 30247 41774 7808 -16213 5859 3198 -6352 -2433 -8544
15706h544J6183J903J2104J2983r698o049Q075Q111k2347l5963k3194N65M5964
$$ -8544 7639 9542 21646 34629 24931 18882 26957 35068 12721 -23242 -46436 -45871 93
15693I3j6604k2949K673J5091K1853K0325k73K7113J131K036k4702l3676j3210
$$ 93 -16511 -39460 -36787 -21696 157 20482 20209 47322 48453 50489 25787 -7889 -21099
15680b1099K040j3207j3341K162K0785K3425R03J937l670j8910R814k597j7921
$$ -21099 -19059 -32266 -45607 -43445 -22660 765 1668 3605 -65 -18975 -9161 -11758 -29679
15667b9679O331J5468m316j9952K4934J7903j5837j565K075q694o241J9195N635
$$ -29679 -23348 -7880 -12196 -32148 -7214 10689 -5148 -6713 -4638 -13332 -19573 -378 5257
15654E257j7446k0313L368L0685K9731j7603k5722K205j2171l0113p929J8274
$$ 5257 -12189 -32502 -29134 1551 31282 13679 -12043 -9838 -22009 -52122 -60051 -41777
15642d1777n581o79J6768M1864N508M768k0285j663J2170M278j1170p782M22O141
$$ -41777 -47358 -48037 -31269 10595 16103 20871 586 -1077 11093 15371 4201 -3581 -3159 2982
15628B982j4267J5543j0774o937K5417p724l8227K1394J1782k2571j0296J4516
$$ 2982 -11285 4258 -6516 -13453 11964 4240 -33987 -12593 -811 -23382 -33678 -19162
15616a9162P187m210N789p329l5014J5893J1564n620J5451k619K5630J7452m119
$$ -19162 -11975 -16185 -10396 -17725 -52739 -36846 -25282 -30902 -15451 -18070 7560 25012 20893
15603B0893p92l71L13R171j0486l1227l4123l3538J4096K9017J6438J9293K2157
$$ 20893 20101 19730 20043 29214 18728 -12499 -46622 -80160 -66064 -37047 -20609 -1316 20841
15590B0841j2059l8944j1016j0740L645P948j2324J1317K4983L2748J9597P038
$$ 20841 8782 -30162 -41178 -51918 -48273 -40325 -52649 -41332 -16349 16399 35996 43034
15578D3034k6570l98j1602j5619J7167j006j5573N544J2835n965j6711l179l754
$$ 43034 16464 16066 4464 -11155 6012 5006 -10567 -5023 7812 1847 -14864 -18043 -21797
15565b1797j486J3533k5485P935J5940K2410j4202j0426j8160k6639J2645M1219
$$ -21797 -23283 -9750 -35235 -27300 -11360 11050 -3152 -13578 -31738 -58377 -45732 -4513
15553d513L5346K8148L095p358k7327l0926k59L8091q89j6352j4035l0966J4314
$$ -4513 30833 58981 62076 54718 27391 -3535 -3794 34297 33408 17056 3021 -27945 -13631
15540a3631J9531k839j5022K6694K1564p424k9873j3410J3003K596P512k3318
$$ -13631 5900 3061 -11961 14733 36297 28873 -1000 -14410 -1407 1189 8701 -14617
15528a4617p721j9022K500Q713j2621J4773j6463K6963L0386j2447j1061r774
$$ -14617 -22338 -41360 -38860 -30147 -42768 -27995 -44458 -17495 12891 444 -10617 -20391
15516b0391m222k6247m612J8633k3437J9382j8820j617J3013K7383P961r344j448
$$ -20391 -24613 -50860 -55472 -36839 -60276 -40894 -59714 -61331 -48318 -20935 -12974 -22318 -23766
15503b3766K8778J158j4520J6496J2386L915J1370K6163j2619n8364o769J847
$$ -23766 5012 6170 -8350 8146 20532 24447 35817 61980 49361 -9003 -15772 -13925
15491a3925J5899j8174K5183Q457K731P021J8372m627j2086m131o096j2886o821
$$ -13925 1974 -16200 8983 17440 20171 27192 45564 40937 28851 24720 18624 5738 -1083
15478a083p912Q536o45j6996J4435K342k93P771r500l3494q320N263J8463l766
$$ -1083 -8995 -459 -1104 -18100 -3665 -1323 -1616 6155 -3345 -36839 -45159 -39896 -21433 -25199
15464b5199J5767K0500j3441J0157j6535J4558N937j0958l3845j8438J1270M354
$$ -25199 -9432 11068 -2373 7784 -8751 5807 11744 786 -33059 -51497 -40227 -35873
15452c5873J1759J2915j9184j2622J476K2112J7397k2747k7752k0914K0280L2024
$$ -35873 -24114 -11199 -30383 -43005 -41529 -19417 -2020 -24767 -52519 -73433 -53153 -21129
15440b1129j1722r318K4471L411J4797J708m452M69Q657j7640o410K3903j3781
$$ -21129 -32851 -42169 -17698 -14287 510 2218 -2234 -1765 6892 -10748 -17158 6745 -7036
15427g036m798K6658j9731M205l1030O007K564Q785R520o879J924J4085J0108
$$ -7036 -11834 14824 -4907 -702 -31732 -25725 -23161 -14376 -4856 -11735 -9811 4274 14382
15414A4382O420O905j5648J6866M051k6624j2552r493Q931k4964j6260p18M3579
$$ 14382 20802 27707 12059 28925 32976 6352 -6200 -15693 -6762 -31726 -47986 -48704 -5125
15401e125J0688O092k956k485j0332J1053P543R581j061l5755J6527j0475j7481
$$ -5125 5563 11655 8699 6214 -4118 6935 14478 24059 22998 -12757 3770 -6705 -24186
15388b4186l0018O178J1898J0661J0053k0009J1355L6053O635L353J5666L220
$$ -24186 -54204 -48026 -36128 -25467 -15414 -35423 -24068 11985 18620 21973 37639 40859
15376D0859k1033j8069j6756j0071J3703o052k3413j0239J6126M2901p794j6877
$$ 40859 19826 1757 -14999 -25070 -11367 -17419 -40832 -51071 -34945 7956 162 -16715
15364a6715K1171j34k7474P028n961m869J1426K4778j826j2105r855r028O526
$$ -16715 4456 4322 -23152 -16124 -22085 -26954 -15528 9250 7424 -4681 -14536 -23564 -17038
15351a7038J9669n516Q304J4295j174l3030k976K6312j4402J59K3273n06k5174
$$ -17038 2631 -2885 5419 19714 18540 -14490 -17466 8846 -5556 -5397 17876 17370 -7804
15338g804p72K9659J0583k5072j9167m8238r513K6294K2952j810o925P367r325
$$ -7804 -8576 21083 31666 6594 -12573 -60811 -70324 -44030 -21078 -22888 -29813 -22446 -31771
15325c1771P878J8936o179J7440K4159k300k2147j7253J678J140j428P105K0038
$$ -31771 -23893 -4957 -11136 6304 30463 28163 6016 -11237 -9559 -8419 -9847 -2742 17296
15312A7296J6091q26o2126l3522M5862O491o535j0913p289J0740n381n389L0461
$$ 17296 33387 32561 -29565 -63087 -17225 -10734 -17269 -28182 -35471 -24731 -30112 -35501 -5040
15299e040j4130j2050n956L5224K1737k3565l4359n690L3036J200p033j510m4412
$$ -5040 -19170 -31220 -37176 -1952 19785 -3780 -38139 -43829 -10793 -9593 -16626 -18136 -62548
15286f2548q519K4116l828k565K1493J5214O778o462j3265r977L1987K3678j0267
$$ -62548 -71067 -46951 -50779 -53344 -31851 -16637 -9859 -16321 -29586 -39563 -7576 16102 5835
15273E835j1131j6782l3864J4640K5682J5924J1221j6893k0185M180K9686K307
$$ 5835 -5296 -22078 -55942 -41302 -15620 304 11525 -5368 -25553 -21373 8313 10620
15261A0620k0034j1732K7457M589m749J1984k272l0765p013J9811k845K8459M509
$$ 10620 -9414 -21146 6311 10900 6151 18135 15863 -14902 -21915 -2104 -4949 23510 28019
15248B8019m532j5882K775l63q882j3889Q177O643n947m5988l0411J9142K6253
$$ 28019 23487 7605 10380 10017 1135 -12754 -4577 2066 -3881 -49869 -80280 -61138 -34885
15235c4885J7958O756j0276k684J297j2419j1627L4450K2362j5688P108l608o143
$$ -34885 -16927 -10171 -20447 -23131 -21834 -34253 -45880 -11430 10932 -4756 2352 -1256 -7399
15222g399p156n053l1068K546L5001J4101J1358o219O018J1711J2679O0k0166
$$ -7399 -14555 -19608 -50676 -48130 -13129 972 12330 6111 12129 23840 36519 36579 16413
15209A6413M512J5722L650J0763L955M93j9127m808j3218j0997L4039P77j1646
$$ 16413 20925 36647 40297 51060 55015 55508 36381 31573 18355 7358 41397 42174 30528
15196C0528j2760J5706k101p516k078L1511j4785l2912j6453K9573K1493j2266
$$ 30528 17768 33474 31373 23857 21779 53290 38505 5593 -10860 18713 40206 27940
15184B7940j1149j5043r634j1834r474J7915L2932o927j6912p156j3961j126j834
$$ 27940 16791 1748 -7886 -19720 -29194 -11279 21653 14726 -2186 -9342 -23303 -24429 -26263
15171b6263J111K1157n159r533j3353J4589J2143M747J7576Q468k4559q620n481
$$ -26263 -25152 -3995 -9154 -18687 -32040 -17451 -5308 -561 17015 25483 924 -7696 -13177
15158a3177J8517o002L168L950N58J4473q982j8949Q008R231j5610q091N921p798
$$ -13177 5340 -662 2506 6456 7014 21487 12505 -6444 1564 10795 -4815 -12906 -6985 -14783
15144a4783m144O961J7671q649j5766o785k995J99l0046n055L5567K1087L0101
$$ -14783 -18927 -11966 5705 -2944 -18710 -25495 -28490 -28291 -58337 -63392 -27825 -6738 23363
15131B3363J1556n384o994O656n182n1758j0115P06K8118J4754l3581l842j2989
$$ 23363 34919 29535 22541 29197 24015 -27743 -37858 -37152 -9034 5720 -27861 -31703 -44692
15118d4692k728J4408j2139l440K7046L4022k4397k4512k457K0022K7902J9429
$$ -44692 -47420 -33012 -45151 -48591 -21545 12477 -11920 -36432 -38889 -18867 9035 28464
15106B8464k5097k089j9094k0812j0097j5213J7811K1897K7631J9191l0984J475
$$ 28464 3367 1278 -17816 -38628 -48725 -63938 -46127 -24230 3401 22592 -8392 -6917
15094f917L5356O545q791l6022M505J7725j8634k4181j866K4684J3447K008j1722
$$ -6917 28439 34984 26193 -9829 -5324 12401 -6233 -30414 -32280 -7596 5851 7859 -3863
15081c863q426J6207m795j1652j8252j5888L2033O197k2705m215J0244K129J042
$$ -3863 -12289 3918 -877 -12529 -30781 -46669 -14636 -8439 -31144 -35359 -25115 -22986 -21944
15068b1944k985j5105K2303L0379M285l5157k4326q778j529K2876J8147J3087
$$ -21944 -24929 -40034 -17731 12648 16933 -18224 -42550 -51328 -52857 -29981 -11834 1253
15056A253j7748j2368q76p621O761L0781J4041j2897o16N654J738q38Q316O541
$$ 1253 -16495 -28863 -29739 -37360 -30599 182 14223 1326 710 6364 8102 7264 15580 22121
15042B2121p188j5027N944J5944J6494K917k0340j641n063m145Q411m187j3972
$$ 22121 14933 -94 5850 21794 38288 41205 20865 19224 14161 10016 18427 14240 268
15029B68k6705R054k500r59j4048K1626K278o350k201j9023P156M7056L8920J3701
$$ 268 -26437 -17383 -19883 -20842 -34890 -13264 -10986 -17336 -19537 -38560 -31404 15652 54572 68273
15015F8273j5184r180M684q274l428J4183K971M474K2171K8337J6193K1272M0363
$$ 68273 53089 43909 48593 40319 36891 51074 54045 58519 80690 109027 125220 146492 186855
15002A86855N2680M3949N8751R3299K14177L51046O25493J166980K020460K465663
$$ 186855 239535 283484 342235 435534 649711 1000757 1626250 2793230 4813690 7279353
14992G279353R46099j479897k283439j890908r76522m98638l06732j93589j24529
$$ 7279353 8225452 6745555 4462116 2571208 1594686 1096048 789316 595727 471198
14983D71198j05715n4771m7275m3987o3170k3590q304l5179q908O059r404j2382
$$ 471198 365483 310712 263437 219450 156280 132690 124386 89207 80299 86358 76954 64572
14971F4572K1764J2388p533j8935R429J6540j5548k9658n572J412m2296q772m291
$$ 64572 86336 98724 91191 72256 81685 98225 82677 53019 47447 48859 6563 -2209 -6500
14958f500N516K4619L6706K378k3085k2897N354K3497j596j5279j4337j1471n426
$$ -6500 -984 23635 60341 62719 39634 16737 22091 45588 43992 28713 14376 2905 -2521
14945b521J1099n721L3858j2885j6130J9809Q495j0875l6321j7256J2798K856
$$ -2521 8578 2857 36715 23830 7700 27509 36004 25129 -11192 -28448 -15650 -12794
14933a2794P316O313J545k9713l1416k999R966J3080J7332J9776K1513L688R956
$$ -12794 -5478 835 2380 -27333 -58749 -61748 -51782 -38702 -21370 -1594 19919 23607 33563
14920C3563k0881k3114q03J8425j769M165j6943j3298k090L433J89j1852J8242
$$ 33563 12682 -10432 -11235 7190 5421 9586 -7357 -20655 -22745 -19312 -19123 -30975 -12733
14907a2733K2203o009k540J2522j6560j502K1465K1060n309m6451j3697p895J5621
$$ -12733 9470 3461 921 13443 -3117 -4619 16846 37906 32597 -13854 -27551 -35446 -19825
14894a9825J3702j1512j1883K4632K111J7701m075j9567j6132K3166J1774M405
$$ -19825 -6123 -17635 -29518 -4886 -2775 14926 10851 -8716 -24848 -1682 10092 14497
14882A4497j3826k1326k138L2705J0084k2073l365j271J3206K55R524R204k0943
$$ 14497 671 -20655 -22793 9912 19996 -2077 -5442 -6713 6493 6748 16272 25476 4533
14869D533J3911j818k3684M062K855j9292n030R426m45J6889q545m0569j7J8891
$$ 4533 18444 16626 -7058 -2996 -141 -19433 -24463 -15037 -15482 1407 -7138 -47707 -47724 -28833
14855b8833k0544q004J4584K2632p44J3921M376R912J0111j5759k8531J5554L015
$$ -28833 -49377 -57381 -42797 -20165 -20909 -6988 -2612 7300 17411 1652 -26879 -11325 -8310
14842h310k743j2777J3029K9471M415k8219O845K9931o869q054m229k0971j5877
$$ -8310 -11053 -23830 -10801 18670 23085 -5134 1711 31642 24773 16719 12490 -8481 -24358
14829b4358N403J739J3529J0190k5520K7806M3777j1825m0048l6051Q840J0461
$$ -24358 -18955 -17216 -3687 6503 -19017 8789 52566 40741 693 -35358 -26518 -16057
14817a6057r92L050N058L470J4997M570m154j8623L966J4649m329l1942J731K5897
$$ -16057 -17049 -13999 -8941 -5471 9526 14096 9942 -8681 -4715 9934 5605 -26337 -24606 1291
14803A291k286j731j0320Q160j5034j5980J6300O366L240L399q535P091o912k705
$$ 1291 -995 -2726 -13046 -4886 -19920 -35900 -19600 -13234 -9994 -6595 -15130 -8039 -14951 -17656
14789a7656K4226j4857M507J217j3055R243J377J5466J3840q507m287N945l220
$$ -17656 6570 -8287 -3780 -2563 -15618 -6375 -4998 10468 24308 15801 11514 17459 14239
14776A4239k4842q315Q942P099j9465J2651J3043j5926j2767J539J2326N930j9412
$$ 14239 -10603 -18918 -9976 -2877 -22342 -9691 3352 -12574 -25341 -23802 -11476 -5546 -24958
14763b4958j962K3498N816Q146M311j8726p995J4715r256j0387K7098K544k2238
$$ -24958 -26920 -3422 2394 10540 14851 -3875 -11870 2845 -6411 -16798 10300 12844 -9394
14750i394j0810n297k2899M496J8782o130J0574M473M178K5736O780j855k4359
$$ -9394 -20204 -25501 -48400 -43904 -25122 -31252 -20678 -16205 -12027 13709 20489 18634 -5725
14737e725m1730K2542R668m407N844q16l569q055R915J4165N956K2723R372l775
$$ -5725 -47455 -24913 -15245 -19652 -13808 -14624 -18193 -26248 -16333 -2168 3788 26511 35883 32108
14723C2108L494j6091J4172Q554l4955p2J647l6386j534r1o356K1030j1556j4857
$$ 32108 35602 19511 33683 42237 7282 7210 8857 -27529 -29063 -29154 -35510 -14480 -26036 -40893
14709d0893K4646K6414K6134R217k7325m1793k642K1886j124l006j6996O557o068
$$ -40893 -16247 10167 36301 45518 18193 -23600 -26242 -4356 -5480 -8486 -25482 -18925 -24993
14696b4993P078j0409k880J2381O227J2696Q019K846J4680j7149Q119l4937k1563
$$ -24993 -17915 -28324 -31204 -18823 -12596 100 8119 10965 25645 8496 16615 -18322 -39885
14683c9885m210L42j047J7042q134j0545J3284M4531J7424j4778k3965p662J4528
$$ -39885 -44095 -43753 -44800 -27758 -35892 -46437 -33153 11378 28802 14024 -9941 -17603 -3075
14670c075K3J7186J5542j6478k9075n795k659J4312J3928j5018j4081K8682j938
$$ -3075 -3052 14134 29676 13198 -15877 -21672 -24331 -10019 3909 -11109 -25190 3492 1554
14657A554p68J0121P204j1379n210n060k995J6035J0766j299j9654j7714J1912
$$ 1554 786 10907 18111 6732 1522 -3538 -6533 9502 20268 18969 -685 -18399 -6487
14644f487L802j4074o33L0909l948j1349R502J978l252k9645j830J7215j782l322
$$ -6487 -2685 -16759 -17392 13517 9569 -1780 7722 9700 6448 -23197 -25027 -7812 -9594 -12916
14630a2916j377k4030J5760N397j471n956l4340j1080K9819J6385K7539K0765
$$ -12916 -14293 -38323 -22563 -17166 -18637 -24593 -58933 -70013 -40194 -23809 3730 24495
14618B4495K620K0985l417n537q570p015N20k8144l0692l398J2569j5976J3895
$$ 24495 27115 48100 44683 39146 30576 23561 24081 -4063 -34755 -38153 -25584 -41560 -27665
14605b7665K6823o04k874j8839k3039P580L5317l42l4329J3539P479j730J7345
$$ -27665 -842 -1446 -4320 -23159 -46198 -38618 -3301 -3643 -37972 -24433 -16954 -18684 -1339
14592a339L206K115L628o004P509j9641j0175J877r165N993M302j1888J287J354
$$ -1339 1867 3982 7610 1606 9115 -10526 -20701 -18824 -27989 -21996 -17694 -29582 -28295 -26941
14578b6941m940j5491j3142K1047J3767k4682k1831J9328M2523M2P247j8879J563
$$ -26941 -31881 -47372 -60514 -39467 -25700 -50382 -72213 -52885 -10362 -10320 -3073 -21952 -20389
14565b0389o400j6093K8189R167J5188N575k3007j5987J2547K0745j0622j9549
$$ -20389 -26789 -42882 -14693 -5526 9662 15237 -7770 -23757 -11210 9535 -1087 -20636
14553b0636j9545p804L4606J6585n325J2254l293j6573L6502K925k1940K31R415
$$ -20636 -40181 -47985 -13379 3206 -2119 10135 6842 -9731 26771 29696 7756 7987 17402
14540A7402k0404j1426k8262k2422M3156J4562q569k5980j5327K9133n985j5057
$$ 17402 -3002 -14428 -42690 -65112 -21956 -7394 -15963 -41943 -57270 -28137 -34122 -49179
14528d9179J2689L3780L0282O891K5631n756k4755j5154K649m714N284j5224p512
$$ -49179 -36490 -2710 27572 34463 60094 54338 29583 14429 17078 12364 17648 2424 -5088
14515e088j210k0009J4459J5329J4759Q483K0122j464k5694j0511K2071O726j6476
$$ -5088 -6298 -26307 -11848 3481 18240 26723 46845 45381 19687 9176 31247 37973 21497
14502B1497J1223j716J8262K020K400l1472k4202J1498l8489m0399M4463L2135
$$ 21497 32720 31004 49266 51286 53686 22214 -1988 9510 -28979 -69378 -24915 7220
14490G220J9967J2228J8288j5950l6818K0297J3373j2554j2796j8490j2686J7694
$$ 7220 27187 39415 57703 41753 4935 25232 38605 26051 13255 -5235 -17921 -227
14478b27J4220J8874m067l4042j6361o71L0145q289k0563J451j0995Q298J1933
$$ -227 13993 32867 28800 -5242 -21603 -22274 7871 -418 -20981 -19530 -30525 -22227 -10294
14465a0294j4314r671m422M283q737l462K0501L3435L410j1017j4608L344J2695
$$ -10294 -24608 -34279 -38701 -34418 -43155 -46617 -26116 7319 10729 -288 -14896 -11552 1143
14452A143M436J9623L0726l6367L654K3901m064j6586k3489k8481J488j3189o384
$$ 1143 5579 25202 55928 19561 23215 47116 43052 26466 2977 -25504 -24016 -37205 -43589
14439d3589J7656j2170j8566J3197J7675N578M314p547K5366K1883Q256J1580
$$ -43589 -25933 -38103 -56669 -43472 -25797 -20219 -15905 -23452 1914 23797 32053 43633
14427D3633k795R617J5129J4082m560j9044r479l4974k9154o277L1471L0461k355
$$ 43633 40838 50455 65584 79666 75106 56062 46583 11609 -17545 -23822 7649 38110 35755
14414C5755N542j541j7232j8897L74j4283K02J8822R878p966j3557J765K2902
$$ 35755 41297 39756 22524 3627 4001 -10282 -10080 8742 18620 10654 -2903 -1138 21764
14401B1764o691k6307J8783M979l2782j1562J3664J8039k063j2117j0261k4322
$$ 21764 15073 -11234 7549 12528 -20254 -31816 -18152 -113 -2176 -14293 -24554 -48876
14389d8876L642M3278j913J8444J3986K2787L7m4558j2621k6509j3486J3893K5763
$$ -48876 -45234 -1956 -3869 14575 28561 51348 51385 6827 -5794 -32303 -45789 -31896 -6133
14376f133J2772k066n981k3728q743P717J0301j9828j6748J3703L5393k4747r657
$$ -6133 6639 4573 -1408 -25136 -33879 -26162 -15861 -35689 -52437 -38734 -3341 -28088 -37745
14363c7745J2948N47k1466j5852j476J6126m443J6156J8810J0975J4536J6186
$$ -37745 -24797 -24250 -45716 -61568 -63044 -46918 -51361 -35205 -16395 -5420 9116 25302
14351B5302r389j4594k0k587j6015j9016j385J378P02K7602J1074k902j7868j3418
$$ 25302 15913 1319 1299 -1288 -17303 -36319 -37704 -36326 -35624 -8022 3052 150 -17718 -31136
14337c1136N422K3413J0753j6819o542o528l972K976l361p046k3623M275k01L977
$$ -31136 -25714 -2301 8452 -8367 -14909 -21437 -25409 -22433 -25794 -32840 -56463 -52188 -52389 -48412
14323d8412P811Q650L8754J4197j2713j057j6729k9016l0994j0488J9615K7771
$$ -48412 -40601 -31951 6803 21000 8287 7230 -9499 -38515 -69509 -79997 -60382 -32611
14311c2611J6218J7724j2937q504J1255Q046P461k1868j8012j7855Q090L915L3095
$$ -32611 -16393 1331 -11606 -20110 -8855 -809 6652 -15216 -33228 -51083 -42993 -39078 -5983
14298e983m225J269K6015j0001k2086q760m593J5537O885R087J4512L263k0793
$$ -5983 -10208 -8939 17076 7075 -15011 -23771 -28364 -12827 -5942 3145 17657 20920 127
14285A27P747P696J2830r039L038j6166j5499q715j1296J2908J3155l470k4707
$$ 127 7874 15570 28400 19361 22399 6233 -9266 -17981 -29277 -16369 -3214 -6684 -31391
14272c1391k2462M546J0055j8432K037K090O599L1264J4989J0515j6477n108j7371
$$ -31391 -53853 -49307 -39252 -57684 -55647 -53557 -46958 -15694 -705 9810 -6667 -11775 -29146
14259b9146Q319k4197J1156L521m0332k5424J7909M1467M1909K0K4468K3412L2648
$$ -29146 -20827 -45024 -33868 -30347 -70679 -96103 -78194 -36727 5182 5202 29670 53082 85730
14246H5730J1888j8145r555j5459k0679k7638k0425o865m208L896K6767K3045
$$ 85730 97618 79473 69918 54459 33780 6142 -14283 -21148 -25356 -21460 5307 28352
14234B8352L7974J8948l2088l1682q513M5607J6179m0099l1837j8217J3115m878
$$ 28352 66326 85274 53186 21504 12991 58598 74777 34678 2841 -15376 -2261 -7139
14222g139j0275j6615k1154Q305R969M5599K0332o307o814K8690J1547J2875P813
$$ -7139 -17414 -34029 -55183 -46878 -36909 8690 29022 22715 15901 44591 56138 69013 76826
14209G6826m105J0720M505j8717k5139k2631K5505K2132P424l073k2387k5214
$$ 76826 72721 83441 87946 69229 44090 21459 46964 69096 76520 73447 51060 25846
14197B5846l112L931Q861m522Q685j8729j9180L8147o849k1944J020n550l5921
$$ 25846 22734 26665 35526 31004 39689 20960 1780 39927 33078 11134 12154 6604 -29317
14184b9317k8154J7334L7078l829j3678J069Q664K1959p518n253j851n70j7876
$$ -29317 -57471 -40137 -3059 -6888 -20566 -19497 -10833 11126 3608 -1645 -3496 -4066 -21942
14171b1942K436J9019J6296L638j291M635k2014m5035m260k876J471J4267Q527
$$ -21942 -19506 -487 15809 19447 18156 22791 777 -44258 -48518 -51394 -49923 -35656 -27129
14158b7129K002K2584J5382J7995j9974r790J7900J3728O374r731k711q066J6709
$$ -27129 -25127 -2543 12839 30834 10860 1070 18970 32698 39072 29341 26630 18564 35273
14145C5273q26K977l061n574q991l0081p656O113l355J3495j6994J3198j092k7243
$$ 35273 34447 37424 34363 28789 19798 -10283 -17939 -11826 -15181 -1686 -18680 -5482 -6574 -33817
14131c3817Q168K0041o181J800N580p067N759J8537M184N21O925O635p547j3151
$$ -33817 -25649 -5608 -11789 -9989 -4409 -11476 -5717 12820 17004 17525 24450 31085 23538 10387
14117A0387j6419j2235K9267o970m4740p889J3222q001k4033K9391L1645j1182
$$ 10387 -6032 -18267 11000 4030 -40710 -48599 -35377 -43378 -67411 -38020 -6375 -17557
14105a7557j0118K689M753J8162M3052J6084j1056J480k5028j3743J0849O164
$$ -17557 -27675 -24986 -20233 -2071 40981 57065 46009 47489 22461 8718 19567 25731
14093B5731k5540L021K0489k233k0386n669k1592J1563J2504j2582k4006r012
$$ 25731 191 3212 23701 21468 1082 -4587 -26179 -14616 -2112 -14694 -38700 -47712
14081d7712Q063L254R952O881R496J509k1622J5983K0482j2636j1133L621j2708
$$ -47712 -39649 -36395 -26443 -19562 -10066 -8557 -30179 -14196 6286 -6350 -17483 -13862 -26570
14068b6570n604N954N175K191O096k93J6097K3312j4026k5069l5057l434P838
$$ -26570 -32174 -26220 -21045 -18854 -12758 -13051 3046 26358 12332 -12737 -47794 -51228 -43390
14055d3390m217j0335L01J3261L9795K6285m688j6584k0341R198N708J2698k4701
$$ -43390 -47607 -57942 -57641 -44380 -4585 21700 17012 428 -19913 -10715 -5007 7691 -17010
14042a7010J4214J7774j129o0k1468k0449j1563K217R667j7817k0573o339m773
$$ -17010 -2796 14978 13849 13789 -7679 -28128 -39691 -37474 -27807 -45624 -66197 -72536 -77309
14029g7309m095j601K135L1731L5683o998k6433J9859J4871J1459j6187J1986
$$ -77309 -81404 -83005 -80870 -49139 -13456 -20454 -46887 -27028 -12157 -698 -16885 -4899
14017d899M324j0978m372j797K3j2730M981N02k021J2513L42j5416J6036J5091
$$ -4899 -575 -11553 -15925 -17722 -17699 -30429 -25448 -24946 -26967 -14454 -14112 -29528 -13492 1599
14003A599K0962M266r554j571K4358j798p307J8762N075K3405M3087N1959P9881
$$ 1599 22561 26827 17273 15702 40060 38262 30955 49717 54792 78197 121284 173243 253124
13990B53124P6369O2812J9016l1005l7526q4184j26373n2024l31j3937P35p596
$$ 253124 329493 392305 411321 380316 342790 258606 132233 80209 79878 65941 66676 59080
13978E9080k4525j9723j91Q104J6192J2334O258N59l5693m1414K0201K5476K3208
$$ 59080 34555 14832 14641 22745 38937 51271 57529 58088 22395 -19019 1182 26658 49866
13965D9866m296m4503m875J4236J0197N863r193n094p049j322p194J3558k6143
$$ 49866 45570 1067 -3808 10428 20625 26488 17295 12201 5152 3830 -3364 10194 -15949
13952a5949p050q3K6502K0329K2012j2968n7453j5868M4611K3217l3251k304o146
$$ -15949 -22999 -23082 3420 23749 45761 32793 -24660 -40528 4083 27300 -5951 -8255 -14401
13939a4401L1723o070K270K7293J5211j2113L39j0278q900k1655j8719j4233J7070
$$ -14401 17322 11252 13522 40815 56026 43913 44252 33974 25074 3419 -15300 -29533 -12463
13926a2463R811J1048j3733O614J2117j7278l0705J9230J4644j6561j4730q243
$$ -12463 -2652 8396 -5337 1277 13394 -3884 -34589 -15359 -715 -17276 -32006 -40249
13914d0249Q863K5146O196r274p654K847n690J741j8011J2877L6840O363j5979
$$ -40249 -31386 -6240 -44 -9318 -16972 -14125 -19815 -18074 -36085 -23208 13632 19995 4016
13901D016L922j1736L908K3355j9067j2465Q155O650r623Q140m556M027o976N996
$$ 4016 7938 -3798 110 23465 4398 -8067 88 6738 -2885 5255 699 4726 -2250 3746
13887C746K3404l346l0590k8558K2780L514p685q173J4752K0946j1293k3987M88
$$ 3746 27150 23804 -6786 -35344 -12564 -9050 -16735 -24908 -10156 10790 -503 -24490 -24002
13874b4002K8865J5936m900j8540j6873P15K938J2212O328J0696R325j5818o204
$$ -24002 4863 20799 15899 -2641 -19514 -18799 -15861 -3649 2679 13375 22700 6882 678
13861F78o08j0453M652O583N936k6040R03m877M728N935j8361K4143O307j9635
$$ 678 70 -10383 -5731 852 6788 -19252 -18349 -23226 -18498 -12563 -30924 -6781 -474 -20109
13847b0109L147N616r539L514L404O7Q414o312K0432K92p748m31l8128k8673M075
$$ -20109 -16962 -11346 -20885 -17371 -13967 -13900 -5486 -11798 8634 8926 1178 747 -37381 -66054 -61979
13832f1979J5446l824K7155K3844L4937J5351k8480r856l944p271J1370k3895
$$ -61979 -46533 -50357 -23202 642 35579 50930 22450 12594 8650 1379 12749 -11146
13820a1146k351K8677O917O358j0216k0481r861O953l3433l3998J7077o99K2151
$$ -11146 -13497 15180 22097 28455 18239 -2242 -12103 -5150 -38583 -72581 -55504 -56203 -34052
13807c4052N417r648j6602m022K8561J139k0K840J6577q001k3914J8834k9413
$$ -34052 -28635 -38283 -54885 -58907 -30346 -29207 -29227 -26387 -9810 -17811 -41725 -22891 -52304
13794e2304J578L2204J8995L1929l771l3412m928p097k0542K9742O108k858j5339
$$ -52304 -50726 -18522 473 32402 28631 -4781 -9709 -16806 -37348 -7606 -1498 -4356 -19695
13781a9695k8100J1172Q296J8546l708J87O432j7901L590R297K2810j0586l7908
$$ -19695 -47795 -36623 -28327 -9781 -13489 -13302 -6870 -24771 -21181 -11884 10926 340 -37568
13768c7568j607j8455O653K3323Q133k1980L1968k874P682J9308K556m432j3890
$$ -37568 -39175 -57630 -50977 -27654 -19521 -41501 -9533 -12407 -4725 14583 17139 12707 -1183
13755a183j1197K8764k003j178q191o353j9085l6689k9222n351L0791K2736J3844
$$ -1183 -12380 16384 14381 13203 5012 -1341 -20426 -57115 -86337 -91688 -60897 -38161 -24317
13742b4317L2565L349J4809j8346o086O737J5628m085k4165k0781J0978K226j5394
$$ -24317 8248 11597 26406 8060 1974 8711 24339 20254 -3911 -24692 -13714 -11488 -26882
13729b6882N451J9129L0102K8403m4653k0108L2635J1061l1188j460R040q474
$$ -26882 -21431 -2302 27800 56203 11550 -8558 24077 35138 3950 2490 11530 3056
13717C056j146j4449r98R223l656K8661K9574j6792k7430n505p031L5782l655
$$ 3056 1910 -12539 -13537 -4314 -7970 20691 50265 33473 6043 538 -6493 29289 25634
13704B5634J2639Q767J8154k2946k5725O492q136O289p840j0028k448r292m746
$$ 25634 38273 47040 65194 42248 16523 23015 14879 21168 13328 3300 852 -8440 -13186
13691a3186j8005K4011J0876J44j1360j6190k943K7112K7213L772q230p065J3414
$$ -13186 -31191 -7180 3696 3840 -7520 -23710 -26653 459 27672 31444 23214 16149 29563
13678B9563j9002l3245j3049l452K7087K1388O800j0927J9330k146k0529l0169
$$ 29563 10561 -22684 -35733 -39185 -12098 9290 16090 5163 24493 22347 1818 -28351
13666b8351R651L2627j5890L09k1722j9356J4667R774J1892K2606K7810p482l9884
$$ -28351 -18700 13927 -1963 -1654 -23376 -42732 -28065 -18291 -6399 16207 44017 36535 -3349
13653c349k912j0066m321o511j0654J7236K0161N034j0216p820J280p218p837
$$ -3349 -6261 -16327 -20648 -27159 -37813 -20577 -416 4618 -5598 -13418 -12138 -19356 -27193
13640b7193J3767J9397p515J1077L583j2108R196k837l519J1658K6548j5526k5667
$$ -27193 -13426 5971 -1544 9533 13116 1008 10204 7367 3848 15506 42054 26528 861
13627H61O399l508n685j1341J6257m59K590j091k1322L531Q462K6855l36o768
$$ 861 7260 3752 -1933 -13274 2983 2524 5114 4023 -17299 -13768 -5306 21549 21213 14445
13613A4445m787O571k2467l4115K3627L2289l0330J609J1580j5942K118J843J8926
$$ 14445 9658 16229 -6238 -40353 -16726 15563 -14767 -13158 -1578 -17520 -15402 -13559 5367
13600E367K4531j5863j0425J9893P707j5970r938J90P894J3892j5256p344l1224
$$ 5367 29898 14035 3610 23503 31210 15240 5302 5492 13386 27278 12022 4678 -26546
13587b6546j7568J1795O03K143J9731m258Q570N547K1452J4268o404K710o307
$$ -26546 -44114 -32319 -31716 -29573 -9842 -14100 -5530 17 21469 35737 29333 32043 25736
13574B5736n222J8166J547j4752J5540J1539J9298O358N049Q690J1336O692n492
$$ 25736 20514 38680 40227 25475 41015 52554 71852 78210 83259 91949 103285 109977 104485
13561A04485n927j0615r837j5729L108M608q591J9247j204j037Q217k542O217
$$ 104485 98558 87943 78106 62377 65485 70093 61502 80749 79545 78508 86725 84183 90400
13548I0400k2350l0445j2169j1161L217J592N325j4540k0753o346J6072J1325
$$ 90400 68050 37605 25436 14275 17492 19084 24409 9869 -10884 -17230 -1158 10167
13536A0167O061n559j3939q691o529J6465L4844J9718r9k4808j6343J3441p125
$$ 10167 16228 10669 -3270 -11961 -18490 -2025 32819 52537 52438 27630 11287 24728 17603
13523A7603k2399p348M842o646m905K6595K65p297K1430j299p116j948j913N284
$$ 17603 -4796 -12144 -7302 -13948 -18853 7742 8007 710 22140 20841 13725 11777 9864 15148
13509A5148j6939j7225O066n73K4003N127n788J4940J4280M779p845k9525J5238
$$ 15148 -1791 -19016 -12950 -13523 10480 15607 9819 24759 39039 43818 35973 6448 21686
13496B1686J7561J899m8819l9229J8340J8396o40j4436J906l4911q484L0388l829
$$ 21686 39247 41146 -7673 -46902 -28562 -10166 -10806 -25242 -23336 -58247 -66731 -36343 -40172
13483d0172J0874K423R339K1061n766j95L4645J8210j8346K46J9275R50j067R46
$$ -40172 -29298 -26875 -17536 3525 -2241 -2436 32209 50419 32073 32319 51594 52544 51477 52423
13469E2423k3807k5925j8626r722K8535L0326j9039k7518K2754j4526J8812M47
$$ 52423 28616 2691 -15935 -25657 2878 33204 14165 -13353 9401 -5125 13687 14134
13457A4134k3441j1795r163J0466k8205J6188K3227K2575J5526k0997K0186j2143
$$ 14134 -9307 -21102 -30265 -19799 -48004 -31816 -8589 13986 29512 8515 28701 16558
13445A6558O184j4202j1378p598K7286m348k2553L730K3285J627Q884N84p731
$$ 16558 22742 8540 -2838 -10436 16850 12502 -10051 -6321 16964 18591 27475 28059 20328
13432B0328k0694Q198K5218o231j4612K25r935o521O636J1987j1905l234J934
$$ 20328 -366 7832 33050 26819 12207 12432 2497 -4024 2612 14599 2694 -540 1394
13419A394K017j3282R521K1223J0478l325l587R232L861l8634k4724J0845p7J2809
$$ 1394 3411 -9871 -350 20873 31351 28026 24439 33671 37532 -1102 -25826 -14981 -15058 -2249
13405b249J4481J7658J2431j4210K0530P538j3414j6270k9687L068p178K569O061
$$ -2249 12232 29890 42321 28111 48641 56179 42765 26495 -3192 -124 -7302 -4733 1328
13392A328J158p796K2863k456l8089p858l141N597k2134k5043R081O769J0169
$$ 1328 2486 -5310 17553 15097 -22992 -30850 -33991 -28394 -50528 -75571 -66490 -59721 -49552
13379d9552J5291J7019L1611j0496k6740n600K2518l0575k2386L9026J9203j3443
$$ -49552 -34261 -17242 14369 3873 -22867 -28467 -5949 -36524 -58910 -19884 -681 -14124
13367a4124n956Q57l13K77J4882J8547q213l5409j5359j0612K0221M2755J5822
$$ -14124 -20080 -19223 -19536 -19259 -4377 14170 5957 -29452 -44811 -55423 -35202 7553 23375
13354B3375r862j0163J6827m745j0559j0034j5012L563J4158J8873j9300j9525
$$ 23375 13513 3350 20177 15432 4873 -5161 -20173 -16610 -2452 16421 -2879 -22404
13342b2404q39O463K549j3981r496J2764L1298M304k5424J8181L263j4093P43
$$ -22404 -23243 -16780 -14231 -28212 -37708 -24944 6354 10658 -14766 3415 6678 -7415 -6672
13329f672J5490l278L066j081k5900P730K1882J1250R01J025j8655n828j7495
$$ -6672 8818 5540 8606 7525 -18375 -10645 11237 22487 23388 24413 5758 -70 -17565
13316a7565m319n224p036l175K6861K405j6577j0112K445J7998J7157p096J112
$$ -17565 -21884 -27108 -34144 -37319 -10458 -8053 -24630 -34742 -32297 -14299 2858 -4238 -3126
13303c126O977K991J274K8022J6380k2305k0339J0819J9442K90o001j2809p162
$$ -3126 3851 6842 8116 36138 52518 30213 9874 20693 40135 40425 34424 21615 14453
13290A4453n687k1563j9218R360J1646K5848k510k282J460m812J5310J1j7488
$$ 14453 8766 -12797 -32015 -22655 -11009 14839 12329 10047 11507 6695 22005 22016 4528
13277D528O129j4756n256j570q557j782R570J6380J9275N95J705j737k8836m029
$$ 4528 10657 -4099 -9355 -10925 -19482 -21264 -11694 4686 23961 24556 26261 24524 -4312 -8341
13263h341M0722j0774l1861j7127K0940J2221n736J4902l856k77J3862q931p564
$$ -8341 32381 21607 -10254 -27381 -6441 5780 44 14946 11090 10813 24675 15744 8180
13250H180O248j3726J3921J4992j8193Q700j1575N948J9483j2681j0964k6159
$$ 8180 14428 702 14623 29615 11422 20122 8547 14495 33978 21297 10333 -15826
13238a5826k8233J9310J1238Q938j919k906o240K5338L8115J6344J8645j715m268
$$ -15826 -44059 -24749 -13511 -4573 -6492 -9398 -15638 9700 47815 64159 82804 81089 76821
13225G6821k7974k3081J7127J5205j0104q340P970j2967j9146K4204L0682m091
$$ 76821 48847 25766 42893 58098 47994 39654 47624 34657 15511 39715 70397 66306
13213F6306k5415J5312K3464J3944J1571K9101R372j9581o922J5600K5615L0608
$$ 66306 40891 56203 79667 93611 105182 134283 143655 124074 117152 132752 158367 188975
13201A88975L5223M2866N0567R0476J64960K43665K65092L16626L31044K20011
$$ 188975 224198 267064 317631 408107 573067 816732 1081824 1398450 1729494 1949505
13191A949505O0087q3332k20280k96288l41542k87969j82231j49061q7189n2198
$$ 1949505 2009592 1926260 1705980 1409692 1068150 780181 597950 448889 361700 309502
13181C09502n8375l5411k1425l010J0367j3329o649p761k7893k4303j2028j5596
$$ 309502 251127 215716 194291 191281 201648 188319 181670 173909 146016 121713 109685 94089
13169I4089j2730o6858k2604M3690L1166j8718L957j2347J6029r245M325M537
$$ 94089 81359 14501 -8103 35587 66753 48035 51992 39645 55674 46429 50754 55291
13157E5291J9947o807j2192j5636K1979L7216J8717j2789l2919J7768j0219j2554
$$ 55291 75238 68431 56239 40603 62582 99798 118515 105726 72807 90575 80356 67802
13145F7802q575j7139J1436K905j25K3265n202l00K566l920J052J1048q672l7185
$$ 67802 59227 42088 53524 56429 56304 79569 74367 74067 76633 72713 73765 84813 76141 38956
13131C8956n327J0244q804K005L2766K8740k8674j5474n167j5757l4544K9166
$$ 38956 33629 43873 35069 37074 69840 98580 69906 54432 49265 33508 -1036 28130
13119B8130K4287M890N206k192J3885k3756l277l769J0038m358k4793o456J37
$$ 28130 52417 57307 62513 60321 74206 50450 47173 43404 53442 49084 24291 17835 17972
13106A7972R808j8627O388J1286K968K646j662j8151M640j4947K4229O142j0005
$$ 17972 27780 9153 15541 26827 29795 32441 30779 12628 17268 2321 26550 32692 22687
13093B2687q017j5814o823K4071M3270J7483J3223k0672j3442l573J5909o559
$$ 22687 14670 -1144 -7967 16104 59374 76857 90080 69408 55966 52393 68302 61743
13081F1743p537J5551k0555J1187K7096l62J9080k232j6997j7542j4793k0730
$$ 61743 54206 69757 49202 60389 87485 87123 106203 103971 86974 69432 54639 33909
13069C3909L346J8969K2320l4609k9863J183l5853l3709K7599J3654K4526J3973
$$ 33909 37255 56224 78544 43935 14072 15255 -20598 -54307 -26708 -13054 11472 25445
13057B5445j329J4829k4281k6318L0518L8694j5413r329l068j3829q60J5264N909
$$ 25445 24116 38945 14664 -11654 18864 57558 42145 32816 29748 15919 15059 30323 36232
13044C6232j882j6503L582K4555j0728m4630q78L157j4318J0601K7594J1454K5311
$$ 36232 34350 17847 21429 45984 35256 -9374 -10252 -7095 -21413 -10812 16782 28236 53547
13031E3547L0392N753o519K181j3918o374J6726J9738M7466N0723O6102N7796
$$ 53547 83939 89692 83173 85354 71436 65062 81788 101526 148992 199715 265817 323613
13019C23613M4594K6492l6802n3515o5821m6216m7052k6276k1269r977k9046j0843
$$ 323613 368207 394699 357897 304382 238561 192345 145293 119017 97748 87771 58725 47882
13007D7882q464Q084j1274J0995O5140K0935l2158j7219l1014j9508O825L9187
$$ 47882 39418 47502 36228 47223 112363 133298 101140 83921 52907 33399 40224 79411
12995G9411L3654K86j6303l8966j0532K1974r271j1126L472j1043m629J3113j8293
$$ 79411 113065 113351 97048 58082 47550 69524 60253 49127 52599 41556 36927 50040 31747
12982C1747j3708L8231J9896l5970k481N051k0736n229R544j4732Q659L1301R185
$$ 31747 18039 56270 76166 40196 37715 42766 22030 16801 26345 11613 20272 51573 60758
12969F0758k6129j9762K5890j439k5662R073L954p238K6135J7652K7842N301K00
$$ 60758 34629 14867 40757 39318 13656 22729 26683 19445 45580 63232 91074 96375 96575
12956I6575J0336o076K8208M7781J9182P386j4274l1933K0647j8737l1980k4454
$$ 96575 106911 100835 129043 176824 196006 203392 189118 157185 177832 159095 127115 102661
12944A02661M943p803L1573K4045m664N645J0592K836j1533J0068j7429k2821
$$ 102661 107604 99801 131374 155419 150755 156400 166992 169828 158295 168363 150934 128113
12932A28113l808j2600m1077j3223R907L0126N5632k8690j7811R466K0236M093
$$ 128113 124305 111705 70628 57405 67312 97438 153070 124380 106569 116035 136271 140364
12920A40364J5708P157K5300L184J8660M999k0793j6737P260k648J2183N576L2765
$$ 140364 156072 163229 188529 191713 210373 215372 194579 177842 185102 182454 194637 200213 232978
12907B32978Q884J0853J3446K1470L3589K5224J1080K0384K707Q833L8923j0208
$$ 232978 241862 252715 266161 287631 321220 346444 357524 377908 380615 389448 428371 418163
12895D18163n0731p4810j10439j61528j23274n1879m1321p219L2656L3641J6202
$$ 418163 367432 292622 182183 20655 -102619 -154498 -195819 -203038 -170382 -136741 -120539
12884a20539K9572K1865K2250J1422N1928L0458P251o474J1275m546l151J2749
$$ -120539 -90967 -69102 -46852 -35430 16498 46956 54207 47733 59008 54462 51311 64060
12872F4060J5658k632j3280O384J0589O945j977K2207r225K2456L2247j4249j8971
$$ 64060 79718 77086 63806 70190 80779 87724 85747 107954 98729 121185 153432 139183 120212
12859A20212k8519Q356J2238K1695N80Q059L3815M0443K2476j151j833q231j153
$$ 120212 91693 100049 112287 133982 134562 142621 176436 216879 239355 238204 236371 228140 226987
12846B26987K9727K5358K7124K1081J4145K014K6095m399L8086P1970O7909M3285
$$ 226987 256714 282072 309196 330277 344422 346436 372531 368132 406218 478188 546097 589382
12834E89382J6947P73m269J9403J0106p13K7481J4704J0794J8301M3183P8558
$$ 589382 606329 607102 602833 622236 632342 631629 659110 673814 684608 702909 746092 824650
12822H24650Q8697O0213N9765O1144R626P985K2058J3903J0386J6992K3754n6
$$ 824650 913347 973560 1033325 1094469 1104095 1112080 1134138 1148041 1158427 1175419 1199173 1199117
12810A199117j227N3336P2368P0881J11068J31942J34542J12715J35182J57641
$$ 1199117 1197890 1251226 1323594 1394475 1505543 1637485 1772027 1884742 2019924 2177565
12800B177565J51947J50041J93223K36830K42749K62800K82869K77692L10730
$$ 2177565 2329512 2479553 2672776 2909606 3152355 3415155 3698024 3975716 4286446
12791D286446L54603M54109N29681O33995Q08124R89348J254055J606649J924141
$$ 4286446 4641049 5095158 5624839 6258834 7066958 8056306 9310361 10917010 12841151
12782A2841151K240764K411664K437463K469452K613996L132258M254350O150643
$$ 12841151 15081915 17493579 19931042 22400494 25014490 28146748 32401098 38551741
12774C8551741R131045J3717778K0791501L1268417M4950324N8646623O5510132
$$ 38551741 47682786 61400564 82192065 113460482 158410806 217057429 282567561
12767B82567561N8543424L6567072M938795k7932253n2901694o3550824n9848580
$$ 282567561 341110985 377678057 382616852 354684599 301782905 238232081 178383501
12760A78383501m7730552l4156530k3238938j5649055j0711186p424333n221927
$$ 178383501 130652949 96496419 73257481 57608426 46897240 39472907 34250980
12753C4250980l791265k933666k476674k340346k330546k309212k188419k003157
$$ 34250980 30459715 27526049 25049375 22709029 20378483 18069271 15880852 13877695
12745A3877695j753954j468659j235764r80897q00232o72728n96507n00693m57613
$$ 13877695 12123741 10655082 9419318 8438421 7638189 6965461 6368954 5868261 5410648
12736E410648l96562l40846k73844k68295k65893k06747j52526j98048j68705
$$ 5410648 5014086 4673240 4399396 4131101 3865208 3658461 3505935 3307887 3139182
12727C139182j34770j16750j08614j20097j04610j38400j22812j10331j07972
$$ 3139182 3004412 2887662 2779048 2658951 2554341 2415941 2293129 2182798 2074826
12718B074826j34445j09464q0883r1299q3991o8431r4637m2903K381J1893J2915
$$ 2074826 1940381 1830917 1750034 1658735 1574744 1506313 1411676 1368773 1371154 1383047 1395962
12707A395962K4114K2688K5338L7635O2367M7923M6119N3941N4212J5906r352
$$ 1395962 1420076 1442764 1468102 1505737 1568104 1616027 1662146 1716087 1770299 1786205 1776853
12696A776853l6613p9506r9501j15781j26426p0159p3527o4952o8501o1906n0576
$$ 1776853 1740240 1660734 1561233 1445452 1319026 1248867 1175340 1110388 1041887 979981 929405
12685I29405l9711k8385l6197O914o980l0937j4152j8068k6875j3483j8756k6425
$$ 929405 889694 861309 825112 832026 825046 794109 779957 761889 735014 721531 702775 676350
12673F76350J7036J219k7602K3202o295k9065l9024m0171j9599K976Q551J4254
$$ 676350 693386 694605 667003 690205 683910 654845 615821 575650 556051 559027 567578 581832
12661E81832o398k3914k7900j0428j5857j217J7436M7031J6206l5288j355K9309
$$ 581832 575434 551520 523620 513192 497335 496118 513554 560585 576791 541503 540148 569457
12649E69457M2817K2625K7371M1353M8011N6432Q6370M8204R162l5533n9088j26601
$$ 569457 612274 634899 662270 703623 751634 808066 894436 942640 951802 916269 857181 730580
12637G30580j37941j21515r9424j00758l3794k0940j1054J6801K0414J4188k3002
$$ 730580 592639 471124 371700 270942 237148 216208 205154 221955 242369 256557 233555
12626B33555j8390n320p989k132o965O067K0377l2288M903j4986J8269n046j4109
$$ 233555 215165 209845 201856 199724 192759 198826 219203 186915 191818 176832 195101 190055 175946
12613A75946o134J040j7896j7077k387M7636K3375J8332P804j0824K4695L1756
$$ 175946 169812 170852 152956 135879 133492 181128 204503 222835 230639 219815 244510 276266
12601B76266p477p523j9405k4183o212r729m860O147L5119K0316L9988P7904O6060
$$ 276266 268789 261266 241861 217678 211466 201737 196877 203024 238143 258459 298447 376351 442411
12588D42411M0970L8073N756L4j3490n1647o5355p4943l6521q660k6387m947K026
$$ 442411 483381 521454 527210 527244 513754 462107 396752 321809 285288 276628 250241 245294 247320
12575B47320j7978m199O498j306J2273J7449k2545l5849j4867K406Q373n262P678
$$ 247320 229342 225143 231641 230335 242608 260057 237512 201663 186796 189202 197575 192313 199991
12562A99991N420j5520l3881o461o406l3233k0488J474M405J2742j5303K29J7060
$$ 199991 205411 189891 156010 149549 143143 109910 89422 90896 95301 108043 92740 92969 110029
12549A10029K4087k71m4812J5525K5086k2021k8009R52o749p57J1046J1226J0376
$$ 110029 134116 133845 89033 104558 129644 107623 79614 80566 73817 73060 84106 95332 105708
12536A05708P366j806l6222P621J7169N78o12j3097k9195p968J9169K3584r549
$$ 105708 113074 111268 75046 82667 99836 100414 99802 86705 57510 49542 68711 92295 82746
12523H2746K0241J3122p873j6071J485J7880k234O337j0612q20j7748R84M531
$$ 82746 102987 116109 108236 92165 93650 111530 109296 115633 105021 104201 86453 87437 91968
12510I1968j3763p43r550j9999P580M099k885J2332k9043k0407J2366J7563P316
$$ 91968 78205 77462 67912 47913 55493 59592 56707 69039 39996 19589 31955 49518 56834
12497E6834k1427p324l022k7269o178L5895L2471j4609Q29J2528P58K0323J9686
$$ 56834 35407 28083 25061 -2208 -8386 27509 59980 45371 46200 58728 59486 79809 99495
12484I9495j9879l445k1914r842K138o066J2115M046M111q730q353J5846J3437
$$ 99495 79616 76171 54257 44415 46553 40487 52602 56648 60759 52029 43676 59522 72959
12471G2959k4069n254L458j3480k5734J2478O944J093l1278J462J6484l0548l4904
$$ 72959 48890 43636 47094 33614 7880 20358 27302 28395 -2883 -1421 15063 -15485 -50389
12458e0389K1960J9851K2853j0672j3405k4013j8968J6670K7780J9125K8570L704
$$ -50389 -28429 -8578 14275 3603 -9802 -33815 -52783 -36113 -8333 10792 39362 43066
12446D3066m437K8921J2729k3498k5180j0526J4579J2812J4579O253O463M7968
$$ 43066 38629 67550 80279 56781 31601 21075 35654 48466 63045 69298 75761 123729
12434A23729r767m3835J129J8302k7472o874J3905m463N903L31l646l0652j1333
$$ 123729 113962 70127 71256 89558 62086 55212 69117 64654 70557 70888 67242 36590 25257
12421B5257J2110M963J0240l320o653L84n649P073J004j6641p120k1403j0612
$$ 25257 37367 42330 52570 49250 42597 42981 37332 44405 45409 28768 21648 245 -10367
12408a0367J9103K0353K0124k2673K1891m902q127K0075M0042O357l0118q070
$$ -10367 8736 29089 49213 26540 48431 43529 35402 55477 95519 101876 71758 63688
12396F3688r059q051N730J8374J6446j3990l6219j0711l657m793P46K4638k218
$$ 63688 54629 46578 52308 70682 87128 73138 36919 26208 22551 17758 18504 43142 40924
12383D0924j1118n759J2541k3293l7305K0939J2346n211j2104j1923L1424J4795
$$ 40924 29806 24047 36588 13295 -24010 -3071 9275 4064 -8040 -19963 11461 26256
12371B6256J30l880k1837k1456j548J1794O269J5356o583j732J3033J4866k933
$$ 26256 26386 22506 669 -20787 -22335 -10541 -4272 11084 4501 2769 15802 30668 27735
12358B7735K9101N317R397J035K883J7953P225j5076J671K4729J7154L1152J4982
$$ 27735 56836 62153 71550 72585 75468 93421 100646 85570 87241 111970 129124 160276 175258
12345A75258O916K9020L0267L8024R1890J31466J20936K23306K89754L22598L33351
$$ 175258 182174 211194 241461 279485 371375 502841 623777 847083 1136837 1459435 1792786
12334A792786K29397M5228j16791k40503l39779l09358k46218j95603j57202j05693
$$ 1792786 2022183 2067411 1950620 1710117 1370338 1060980 814762 619159 461957 356264
12324C56264n2120l4477k9257k7363l3407L441j2277m60k6458l4680k0553k6503
$$ 356264 304144 269667 240410 213047 179640 183081 170804 170344 143886 109206 88653 62150
12312F2150j24p564p608k007K0561M323j5039k7669j9112n952Q24J2751R496k080
$$ 62150 62026 54462 46854 44847 65408 69731 54692 27023 7911 1959 2783 15534 25030 22950
12298B2950J521N953J366P757J2965Q704j0426l4404J0015Q416K3340L3559l6339
$$ 22950 24471 30424 31790 39547 52512 61216 50790 16386 26401 34817 58157 91716 55377
12285E5377j4961Q536j3207j3850j8607k0101j9299j11K161J9605K0294k1900
$$ 55377 40416 48952 35745 21895 3288 -16813 -36112 -36223 -34062 -14457 5837 -16063
12273a6063j7914K6212K1562K3311k111k3630j1381o544K0239K8798j5953j5016
$$ -16063 -33977 -7765 13797 37108 34997 11367 -14 -6558 13681 42479 26526 11510
12261A1510J5117N385j2063j7498J2241J7645j1011j2154J9151o230j3154M835
$$ 11510 26627 32012 19949 2451 14692 32337 21326 9172 28323 22093 8939 13774
12249A3774o119p185p92K2227J8192M682J2169k2053j5841j0400k9544k034M0929
$$ 13774 7655 470 -322 21905 40097 44779 56948 34895 19054 8654 -20890 -22924 18005
12236A8005R485l0114J6681K5765N709j9885k4246m851n606L3216K7479p280L61
$$ 18005 27490 -2624 14057 39822 45531 25646 1400 -3451 -9057 24159 51638 44358 44719
12223D4719j7922J766j0687j8366o440j548O134k145q210J568K3107K8647J3007
$$ 44719 26797 28563 17876 -490 -6930 -8478 -2344 -4489 -12699 -11131 11976 40623 53630
12210E3630l3595k8605j9729k6622J2762O4585L3015j3743j0577k991K1513N989
$$ 53630 20035 -8570 -28299 -54921 -42159 22426 55441 41698 31121 28130 49643 55632
12198E5632k5982j1741o13J6148K7165p254j8528r732J4463j9473k1834Q315J2692
$$ 55632 29650 17909 17296 33444 60609 53355 34827 25095 39558 20085 -1749 6566 19258
12185A9258k5253j5517k0249O202J0743K633M425j2240k7984j2932k2124K1030
$$ 19258 -5995 -21512 -41761 -35559 -24816 -22183 -17758 -29998 -57982 -70914 -93038 -72008
12173g2008N8636J3063k1616K7013K4864r232O124J5445R406o415k1486k0049
$$ -72008 -13372 -309 -21925 5088 29952 20720 26844 42289 51695 45280 23794 3745
12161C745k90K3527O078k0002k0724m886j8090J3028N4939J7066j2826k332L2601
$$ 3745 3455 26982 33060 13058 -7666 -12552 -30642 -17614 37325 54391 41565 39233 71834
12148G1834J3117m4963n295k691j1279P18K8379J5137q608j8542k897J2495r082
$$ 71834 84951 39988 34693 32002 20723 21441 49820 64957 56349 37807 34910 47405 38323
12135C8323k375j6553j7557j7530j3352P618J038N761K01k5134J6952K0543N779
$$ 38323 35948 19395 1838 -15692 -29044 -21426 -20388 -14627 -14426 -39560 -22608 -2065 3714
12122C714o195m349k5476J2129L9965J7045J2968J6994P35J1924l6356m2431j4644
$$ 3714 -2481 -6830 -32306 -20177 19788 36833 49801 66795 67530 79454 43098 667 -13977
12109a3977q704R370L9332M2112q394j1433n045l7291k1812Q52J5574l311J0593
$$ -13977 -22681 -13311 26021 68133 59739 48306 43261 5970 -15842 -14990 584 -2727 7866
12096G866l5265m960L89N678N624J646L85N580l933K4069j8824K457n658k3212
$$ 7866 -27399 -32359 -31970 -26292 -20668 -19022 -18637 -13057 -16990 7079 -11745 -9288 -14946 -38158
12082c8158K7713L2365L874J9201Q195k9784K688M538j8290l4486k7873p303l088
$$ -38158 -10445 21920 25794 44995 53190 23406 26094 30632 12342 -22144 -50017 -57320 -60408
12069f0408L0714K1087J9304Q615J579J0192J5996j7170j1514l26p964j9725j7414
$$ -60408 -29694 -8607 10697 19312 20891 31083 47079 29909 18395 18069 10105 -9620 -27034
12056b7034p931K9754R023K018k8427j7526j535J1739J0615L1003L100j5959k3332
$$ -27034 -34965 -5211 3812 5830 -22597 -40123 -41658 -29919 -19304 11699 14799 -1160 -24492
12043b4492Q342l995L0720k2567j6676P55N054R474K022j3424o31L1450L1798
$$ -24492 -16150 -20145 10575 -11992 -28668 -27913 -22859 -13385 -11363 -24787 -25418 6032 37830
12030C7830j9310l0672N811K5660k9275Q484n489j3582q162R662Q393q614M972
$$ 37830 18520 -12152 -6341 19319 -9956 -1472 -6961 -20543 -28705 -19043 -10650 -19264 -14292
12017a4292Q367J0193l192n750l619p795n127J6393q563L984J4783J0213P481
$$ -14292 -5925 4268 1076 -4674 -8293 -16088 -21215 -4822 -13385 -9401 5382 15595 23076
12004B3076k0100O063J2887O976k3868m71l1007k0000J1247L2139J8948N040n105
$$ 23076 2976 9039 21926 28902 5034 4563 -26444 -46444 -35197 -3058 15890 20930 15825
11991A5825o354j089j9987k6268K3203m726n076J3839K4132n508l445j0617k417
$$ 15825 9471 8382 -11605 -37873 -14670 -19396 -24472 -10633 13499 7991 4546 -6071 -8488
11978h488J804O808J7475p581Q854J5945j7452n4228k5201N262j2480L1389K4043
$$ -8488 -6684 124 17599 10018 18872 34817 17365 -36863 -62064 -56802 -69282 -37893 -13850
11965a3850J4041Q091P85j46R847r495k0895l0762K0118J015J3855K8445m133
$$ -13850 191 8282 9067 8921 18768 9273 -11622 -42384 -22266 -21251 -7396 21049 16916
11952A6916j7529j067J9981q95j2084m6141L801J5791M677K5495J253m7290j3713
$$ 16916 -613 -1680 18301 17406 5322 -40819 -37018 -21227 -16550 8945 10198 -37092 -50805
11939e0805p931K7974K1207q081M054p556R628J0060J1302M897j5299o120O129
$$ -50805 -58736 -30762 -9555 -17636 -13582 -21138 -11510 -1450 9852 14749 -550 -6670 -541
11926e41m646j6653J8504o47j1935p899P106n746m913L681J5166J6403j4816l8702
$$ -541 -5187 -21840 -3336 -3983 -15918 -23817 -16711 -22457 -27370 -23689 -8523 7880 -6936 -45638
11912d5638k1405O532r346J4993J0238M680r040j6162K8888J357j9388R691r611
$$ -45638 -67043 -60511 -69857 -54864 -44626 -39946 -48986 -65148 -36260 -34903 -54291 -44600 -54211
11899e4211j961K279Q824R249K969J3657k6993N844K3356j3685O923l796n265
$$ -54211 -56172 -53893 -45069 -35820 -32851 -19194 -46187 -40343 -16987 -30672 -23749 -27545 -32810
11886c2810J2636L6517n997p528M498q21K0607k3051j2026k1755J4367J0345L452
$$ -32810 -20174 16343 10346 2818 7316 6495 27102 4051 -7975 -29730 -15363 -5018 -1566
11873a566J2522K9438l2883m5701O336N428J91N494Q801L945O887J0493j4745
$$ -1566 10956 40394 7511 -38190 -31854 -26426 -26235 -20741 -11940 -7995 -1108 9385 -5360
11860e360m0525m225k024J9528K0401q17k7171P80m469N208J8797J4039L386k0012
$$ -5360 -45885 -50110 -52134 -32606 -12205 -13022 -40193 -39413 -43882 -38674 -19877 -5838 -2452 -22464
11846b2464k5858O77L2650J1415J789r488n606K332L630J2971J4383q09m135k7796
$$ -22464 -48322 -47645 -14995 -3580 -1791 -11279 -16885 -14553 -10923 2048 16431 15622 11487 -16309
11832a6309p067j0128j1573k2951n379L6398R428L857J2323L5346r660R390j5944
$$ -16309 -23376 -33504 -45077 -68028 -73407 -37009 -27581 -23724 -11401 23945 14285 23675 7731
11819G731m425r266M139J3246o002p001k1004Q490Q196j7975j7459k1011J6820
$$ 7731 3306 -5960 -1821 11425 5423 -1578 -22582 -14092 -5896 -23871 -41330 -62341 -45521
11806d5521J9049J8173k3378k6182J8553O397k9830L0596J7775J1376J5771J629
$$ -45521 -26472 -8299 -31677 -57859 -39306 -32909 -62739 -32143 -14368 -2992 12779 14408
11794A4408q850J7057j559R194l4966j9908K0933J6898p56j8113j758l164j8133
$$ 14408 5558 22615 21056 30250 -4716 -24624 -3691 13207 12451 -5662 -7420 -10584 -28717
11781b8717j23O455M3116o994j3291P600J7313L727k265j7763J9319P085m7339
$$ -28717 -28840 -22385 20731 13737 446 8046 25359 29086 26821 9058 28377 35462 -11877
11768a1877k2611R00L1614K2761q741k0837J9648J375Q376j0266k2549J8829j5459
$$ -11877 -34488 -33588 -1974 20787 12046 -8791 10857 12232 20608 10342 -12207 6622 -8837
11755h837j3636K5961J1940j2671l824K1455J4093r353l9199m2583K8766K9968
$$ -8837 -22473 3488 15428 2757 -1067 20388 34481 25128 -14071 -56654 -27888 2080
11743B080K07J1679R044j409j2068q704L94J4094J617k5251l213K7529q419j8234
$$ 2080 2287 13966 23010 21601 9533 829 1223 15317 16934 -8317 -11530 15999 7580 -10654
11729a0654k1882O385K1237K2620j04j5130j0285O964K85J915K186j3416j7605
$$ -10654 -32536 -26151 -4914 17706 17602 2472 -7813 -849 -564 1351 3537 -9879 -27484
11716b7484K7189Q264l2036k3123J9983L3428J9522n79k6349j7775k601M699M203
$$ -27484 -295 7969 -24067 -47190 -27207 6221 25743 25164 -1185 -18960 -21561 -16862 -12659
11703a2659p45r88O409N07L230r843j5944J2252j1246l424J9801J6107K6632q526
$$ -12659 -13404 -14392 -7983 -7476 -4246 -14089 -30033 -17781 -29027 -32451 -12650 3457 30089 21563
11689B1563j9763O180p426N319K5056J1197k5667l0377P780k0252k148P718r436
$$ 21563 1800 7980 554 5873 30929 42126 16459 -13918 -6138 -26390 -28538 -20820 -30256
11676c0256K664q61K753J3361J6882K2461j7374j2933L2231j0854m872J3079K0299
$$ -30256 -27592 -28453 -25700 -12339 4543 27004 9630 -3303 28928 18074 13202 26281 46580
11663D6580J3232k4670l0070j010k7133k6916Q028J7464K8604M72o748J125p550
$$ 46580 59812 35142 5072 4062 -23071 -49987 -41959 -24495 4109 4581 -2167 -1042 -8592
11650h592j4594n617K5691P669r795n393M258J4265q125k1892j2301l101J3416
$$ -8592 -23186 -28803 -3112 4557 -5238 -10631 -6373 7892 -233 -22125 -34426 -37527 -24111
11637b4111J4050j9389k6551j4994J3996L144J1753J3553J4967j8000k998J1677
$$ -24111 -10061 -29450 -56001 -70995 -56999 -53855 -42102 -28549 -13582 -31582 -34580 -22903
11625b2903P432L0040J0859j9077j2986j3267m0968K2225M840R471l430q252r141
$$ -22903 -15471 14569 25428 6351 -6635 -19902 -60870 -38645 -33805 -24334 -27764 -36016 -45157
11612d5157j511k2479l993N044M8414J7785J0388N306j9377k7943q220j4530O695
$$ -45157 -46668 -69147 -73140 -68096 -19682 -1897 8491 13797 -5580 -33523 -41743 -56273 -49578
11599d9578K312K2751q694j3408Q945L0106K946j0230j1141o03o804L0811K2559
$$ -49578 -47266 -24515 -33209 -46617 -37672 -7566 -4620 -14850 -25991 -26594 -33398 -2587 19972
11586A9972Q482k8005l0650j2221M578l2551J0471Q050J3749M86K2360K8295p094
$$ 19972 28454 449 -30201 -42422 -37844 -70395 -59924 -51874 -38125 -37639 -15279 13016 5922
11573E922l137J7670J4515k1673j6245o764J780o68k1569o235j0072l390N182
$$ 5922 2785 20455 34970 13297 -2948 -9712 -7932 -8600 -30169 -36404 -46476 -49866 -44684
11560d4684K0231P750O629q687J713L2306O895l251k2402j4969K3051o782J1060
$$ -44684 -24453 -16703 -10074 -18761 -17048 15258 22153 18902 -3500 -18469 4582 -2200 8860
11547H860L618j7030k5203J5383J0140l518q539M345J0643k2282j7311L2941J5109
$$ 8860 12478 -4552 -29755 -14372 -4232 -7750 -16289 -11944 -1301 -23583 -40894 -7953 7156
11534G156n898n60j2379K855j916q488J1724J4934N692J0855N87k4759J1739n58
$$ 7156 1258 698 -11681 -8826 -10742 -19230 -7506 7428 13120 23975 24562 -197 11542 10984
11520A0984k224M857L607j3740P70r944k2451j4197l693R525R765J3056j6663
$$ 10984 8760 13617 17224 3484 4254 -5690 -28141 -42338 -46031 -36506 -26741 -13685 -30348
11507c0348k1467J3942J9012J3539K343q219K9822K5676j5691j2395k3151M128
$$ -30348 -51815 -37873 -18861 -5322 -2979 -11198 18624 44300 28609 16214 -6937 -2809
11495b809N089R350L2901m629k7149l944q753k6125m632J6263j737O895j7144
$$ -2809 2280 11630 44531 39902 12753 8809 56 -26069 -30701 -14438 -16175 -9280 -26424
11482b6424P138K4272J7444J4787k994j0448o086j3067K201j512j2973Q662K3991
$$ -26424 -19286 4986 22430 37217 34223 23775 17689 4622 6823 5311 -7662 1000 24991
11469B4991j1842P933J4318k5436k0259Q271M755JK0695L596m18N754k4143K556
$$ 24991 13149 21082 35400 9964 -10295 -2024 2731 2732 23427 27023 26605 32359 8216 10772
11455A0772k2469l2044O48K2517K1239p444n576Q108j4113M632J3081K7343n856
$$ 10772 -11697 -43741 -43093 -20576 663 -6781 -12357 -4249 -18362 -13730 -649 26694 20838
11442B0838l6621m9327j1455L0621M1465J3825j6024j8274j7132j0883L3065J2548
$$ 20838 -15783 -65110 -76565 -45944 -4479 9346 -6678 -24952 -42084 -52967 -19902 -7354
11430g354K597o449j1701L4574J5133l5145j7848r993n173P585J0597K2933N684
$$ -7354 -4757 -11206 -22907 11667 26800 -8345 -26193 -36186 -41359 -33774 -23177 -244 5440
11417E440J1641J0249j1176p014O055M117j4629o790n238O381k7036j2749J1874
$$ 5440 17081 27330 16154 9140 15195 19312 4683 -2107 -7345 -964 -28000 -40749 -28875
11404b8875K719K3433J1213k5014q946k0656O127m945j8958l2225L671O5135K4281
$$ -28875 -26156 -2723 8490 -16524 -25470 -46126 -39999 -44944 -63902 -96127 -92456 -27321 -3040
11391c040J219n54l2558n67j040K991J0121j1640j4841J3437J3497l114P024J3870
$$ -3040 -1821 -2375 -34933 -35500 -36540 -33549 -23428 -35068 -49909 -36472 -22975 -26089 -19065 -5195
11377e195p229J2516P013p629O294j5325o971K966J5664L1793n376M924N339j6670
$$ -5195 -12424 92 7105 -524 5770 -9555 -16526 -13560 2104 33897 28521 33445 38784 22114
11363B2114j7382M366K918k7095O483K1674p774k2313j2009J611K5481j2924r42
$$ 22114 4732 9098 12016 -15079 -8596 13078 5304 -17009 -29018 -27407 -1926 -14850 -15792
11350a5792P005J8392o830K4973j6153l944M478k8925j0023L0725k593J5295Q401
$$ -15792 -8787 9605 2775 27748 11595 7651 12129 -16796 -26819 3906 1313 16608 25009
11337B5009j6554j4147L3357N827j1488K4117j2322k9335j2900j9507j057K9721
$$ 25009 8455 -5692 27665 33492 22004 46121 33799 4464 -8436 -27943 -29000 721
11325G21M4063m0075k80j2017j7970P43L0381R725j3808j3271O182p660j9595
$$ 721 44784 4709 4429 -7588 -25558 -24815 5566 15291 1483 -11788 -5606 -13266 -32861
11312c2861k5717M867J2952K8910M5163J9180m932l6550j0189K6280J7198Q191
$$ -32861 -58578 -53711 -40759 -11849 33314 52494 47562 11012 823 27103 44301 52492
11300E2492J0145p796J0019j572l0671k2110o205p203J586P969j8490p434J9288
$$ 52492 62637 54841 64860 63288 32617 10507 4302 -2901 -1315 6654 -11836 -19270 18
11287A8l569p462m813N952K5468K7281J9957j7639l7019l3890J107K6942K904
$$ 18 -3551 -11013 -15826 -9874 15594 42875 62832 45193 8174 -25716 -24609 2333 5237
11274E237l746j5306L2807k6310J0244K6216J0243j0618O262O829k5343l5848
$$ 5237 1491 -13815 18992 -7318 2926 29142 39385 28767 35029 41858 16515 -19333
11262a9333j0787L4611q500r735j2464N350J9001j536l535O949r459M385K1093
$$ -19333 -30120 4491 -4009 -13744 -26208 -20858 -1857 -3393 -6928 21 -9438 -5053 16040
11249A6040K5543k780k5200l0006j0296J0017j4417Q296Q835j1087K9286K1305
$$ 16040 41583 38803 13603 -16403 -26699 -16682 -31099 -22803 -13968 -25055 4231 25536
11237B5536j6832j7020M934r330n72j2713j099P43k0529k5330R622L9491K7952
$$ 25536 8704 -8316 -3382 -12712 -13284 -25997 -27096 -26353 -46882 -72212 -62590 -23099 4853
11224D853N964k074o148k4889j5036o606j3752L5391K7125k9832P029J8735K102
$$ 4853 10817 8743 2595 -22294 -37330 -43936 -57688 -22297 4828 -25004 -17975 760 2862
11211B862n652k893j2048J595k0292M577J8332J2482r590K286J1558j947n232
$$ 2862 -2790 -5683 -17731 -16136 -36428 -31851 -13519 -1037 -10627 -8341 3217 1270 -3962
11198c962k0527J3010K143j9817k4859r489K1077J6381m327J47J2389K3621J2918
$$ -3962 -24489 -11479 -9336 -29153 -54012 -63501 -42424 -26043 -30370 -30223 -17834 5787 18705
11185A8705k2141l219m549K603O380l626p459j9521p175M122J3360K1082j0052
$$ 18705 -3436 -6655 -11204 -8601 -2221 -5847 -13306 -32827 -40002 -35880 -22520 -1438 -11490
11172a1490J2765J1753M126n856N042J1304n207k85O506n857j8611j0426j1262
$$ -11490 1275 13028 17154 11298 16340 27644 22437 22152 28658 22801 4190 -6236 -17498
11159a7498M817M900P227K9343p240J4172j2560l256j0734k6263k4675J0585L7059
$$ -17498 -12681 -7781 -554 28789 21549 35721 23161 19905 9171 -17092 -41767 -31182 5877
11146E877Q173j6868j2574j7742o014P381J2800J5442m116j6021r116N891J747
$$ 5877 14050 -2818 -15392 -33134 -39148 -31767 -18967 -3525 -7641 -23662 -32778 -26887 -25140
11133b5140m1251J0965L1565j498K870q568J155J6736J3828j043j1529J2019L5199
$$ -25140 -66391 -55426 -23861 -25359 -22489 -31057 -29902 -13166 662 -381 -11910 109 35308
11120C5308l5473L789p522k3703K722k7525j1634K0176k1637l242M2502J8837
$$ 35308 -165 3624 -3898 -27601 -24879 -52404 -64038 -43862 -65499 -68741 -26239 -7402
11108g402J56J7860K2013N415n838M23R162k5930k8049Q517K0123k1750j4496
$$ -7402 -7246 10614 32627 38042 32204 32627 41789 15859 -12190 -3673 16450 -5300 -19796
11095a9796L814J2797J2056j1951k5207q789m193J9906R194Q517M946l0966K0231
$$ -19796 -15982 -3185 8871 -3080 -28287 -37076 -41269 -21363 -12169 -3652 1294 -29672 -9441
11082i441M325K2500m674j7263L881l067J8098l194j3463j5921n54J1523J6165
$$ -9441 -5116 17384 12710 -4553 -672 -3739 14359 11165 -2298 -18219 -18773 -7250 8915
11069H915J0811j1582l3185j1315m505J5542L2585J6819K4323J526m406q648o313
$$ 8915 19726 8144 -25041 -36356 -40861 -25319 7266 24085 48408 49934 45528 36880 30567
11056C0567j6082r50j7904l1101L7514R449l670Q32n632M612k7423J254N743l462
$$ 30567 14485 13535 -4369 -35470 2044 11493 7823 8655 3023 7635 -19788 -18534 -12791 -16253
11042a6253M509J1699Q833r317j7020k117R144Q021j0612q038j7977J4312P975
$$ -16253 -11744 -45 8788 -529 -17549 -19666 -10522 -2501 -13113 -21151 -39128 -24816 -16841
11029a6841j2644J3687L0819L527k148m2208L839M539J204J4759K2774K0168n899
$$ -16841 -29485 -15798 15021 18548 16400 -25808 -21969 -17430 -16226 -1467 21307 41475 35576
11016C5576j7777j7911P502l301l027K0430j3132j6632J6950O168j3395J6548
$$ 35576 17799 -112 7390 4089 1062 21492 8360 -8272 8678 14846 1451 17999
11004A7999K1245J0248K2881P017j485J7345r201Q570J6046q202r638K0774l719
$$ 17999 39244 49492 72373 79390 77905 95250 86049 94619 110665 102463 92825 113599 109880
10991A09880m7489j6049j80K1011N410m0009k0448o823L217J3552J2972o271l2505
$$ 109880 62391 46342 46162 67173 72583 32574 12126 5303 8520 22072 35044 28773 -3732
10978c732j3299K5509L3866j1435o786M128K0532L759j7650k4329n4973J6841
$$ -3732 -17031 8478 42344 30909 24123 28251 48783 52542 34892 10563 -44410 -27569
10966b7569L5714j252K2536K9811N881n0387j3803l364K9764K9125K2352L807
$$ -27569 8145 6893 29429 59240 65121 14734 931 -2433 27331 56456 78808 82615
10954H2615J2852L1621M6710k153q343k1496O897j3044j5823k8212q554l7818
$$ 82615 95467 127088 173798 171645 163302 141806 148703 135659 119836 91624 83070 45252
10942D5252m5440n916J2427Q93N012M366L8586R119l0119m1318O088m288j0039
$$ 45252 -188 -6104 6323 7216 12228 16594 55180 64299 34180 -7138 -1050 -5338 -15377
10929a5377J635N262K8733Q870n707m74j5830N498J3306J3709k312q664J6285
$$ -15377 -13742 -8480 20253 29123 23416 22942 7112 12610 25916 39625 37313 28649 44934
10916D4934k295k3377M209R83j541K60J748J8699L572R132K4093J3607R8k518
$$ 44934 42639 19262 23471 24454 22913 23173 24921 43620 47192 56324 80417 94024 94122 91604
10902I1604k0514l8341l7063k9831J8077K4638Q379j5716K608K5358K3871r712
$$ 91604 71090 32749 -4314 -34145 -16068 8570 16949 1233 3841 29199 53070 43358
10890D3358l5107J8955J3355q724N689j8834r082K9923J8349j613m683j1473k3679
$$ 43358 8251 27206 40561 31837 37526 18692 9610 39533 57882 56269 51586 40113 16434
10877A6434j595K3300L6161J8903J1290R580m095k8467l126K4923r939j5527k7104
$$ 16434 14839 38139 74300 93203 104493 114073 109978 81511 78385 103308 93369 77842 50738
10864E0738l7547k8015J2451J341J2555L2137J6434K2701k1111l6748m1127P70
$$ 50738 13191 -14824 -2373 -1032 11523 43660 60094 82795 61684 24936 -16191 -15421
10852a5421K4250j9670j8363o952J4454L0575p239J8723J8872j6919Q849J2990
$$ -15421 8829 -10841 -29204 -36156 -21702 8873 1634 20357 39229 22310 31159 44149
10840D4149k1722k9111p132L3565J1920P717J4267K5697N140K702J5901J5682
$$ 44149 22427 -6684 -13816 19749 31669 39386 53653 79350 84490 87192 103093 118775
10828A18775J5962k2491m8969K4613K8205R45k5357j9682L5283j6733q131K111
$$ 118775 134737 112246 63277 87890 116095 117040 91683 72001 107284 90551 82420 84531
10816H4531P141J4741K834j2260J7210k1444m811k2980k5020j6814K6582p002
$$ 84531 91672 106413 109247 96987 114197 92753 87942 64962 39942 23128 49710 42708
10804D2708j5183m412p888J0741L272k2626k0789L955L852K6336J4019j6385j3071
$$ 42708 27525 23113 15225 25966 29238 6612 -14177 -10222 -6370 19966 33985 17600 4529
10791D529J2473r382j8509Q093J9202j0116j9794L3432K7417J2446K1159P391
$$ 4529 17002 7620 -10889 -2796 16406 6290 -13504 19928 47345 59791 80950 88341
10779H8341j0318J1329j3697J4660m0m304q690J9979m732m080j8757l9258L428
$$ 88341 78023 89352 75655 90315 90275 85971 77281 97260 92528 88448 69691 30433 33861
10766C3861Q953O224N640j002o455l7145k7387n688J9108Q397J0275R218J0739
$$ 33861 42814 49038 54678 53676 47221 10076 -17311 -22999 -3891 4506 14781 23999 34738
10753C4738Q853J7229J2004J3403k511j5340n55o849j9515K9134L5077J6065K6237
$$ 34738 43591 60820 72824 86227 83716 68376 67821 60972 41457 70591 105668 121733 147970
10740A47970j6425J1601K6508L5153N0718J03590J41010K32570L25693M60272
$$ 147970 131545 143146 169654 204807 255525 359115 500125 732695 1058388 1518660
10730A518660N18784M04438R6558k14087k39840l0827J81923K06237j9882l14596
$$ 1518660 2037444 2441882 2538440 2324353 2084513 2053686 2235609 2441846 2421964 2107368
10720B107368m82117m74401l56854k08063j23387r2884n0451k6536l0627n1892
$$ 2107368 1625251 1150850 793996 585933 462546 369662 319211 292675 262048 210156
10710B10156k6577k7384k4075N679J7029L162j6045n5353k6543j5513j2469J4065
$$ 210156 183579 156195 132120 137799 154828 157990 141945 86592 60049 44536 32067 46132
10698D6132k146j79J4687q570j8464j8847J7163K3229K1403R607j4502j1223o5391
$$ 46132 43986 43807 58494 49924 31460 12613 29776 53005 74408 84015 69513 58290 -7101
10685g101q856L6382J0916j5795n081L555J6320j6337L325J1891j127j6229j4535
$$ -7101 -15957 20425 31341 15546 10465 14020 30340 14003 17328 29219 28092 11863 -2672
10672b672j803O998M6681Q389j8706O815o137l5945J7263J6858j122J0265P762
$$ -2672 -4475 2523 49204 57593 38887 45702 39565 3620 20883 37741 36619 46884 54646
10659E4646J011l296m358r481N798r233l1269k4474J3017L9184K3579j667N086
$$ 54646 55657 52361 48003 38522 44320 35087 3818 -20656 -7639 31545 55124 53457 58543
10646E8543j6251k6431o936K5480L1133l1593Q704K6626M2295M2837L7539k5938
$$ 58543 42292 15861 8925 34405 65538 33945 42649 69275 111570 154407 191946 166008
10634A66008l8216J3619P35l320R631l0048l8863m3926j0331Q235k094j4589j1420
$$ 166008 127792 141411 142146 138826 148457 118409 79546 35620 25289 33524 31430 16841 5421
10621E421O659J1643j2254j5141r679J7352L0344Q834k0340j2813J5274l818k4787
$$ 5421 12080 23723 11469 -3672 -13351 4001 34345 43179 22839 10026 25300 21482 -3305
10608c305m398P267q950J6248j5955O617m762m599j3467L2266q214m316j2152
$$ -3305 -7703 -436 -9386 6862 -9093 -2476 -7238 -11837 -25304 6962 -1252 -5568 -17720
10595a7720j2275K7178J7780j2895N941j326L00K7394L2032O178P674L9729K7185
$$ -17720 -29995 -2817 14963 2068 8009 6683 6983 34377 66409 72587 80261 119990 147175
10582A47175P4547O2329P7637M3294k4348m7401j5934j2220N1694O0867j722o3035
$$ 147175 221722 284051 361688 404982 380634 333233 317299 305079 356773 417640 415918 352883
10570C52883j09491p8514n1089j7302P83P438q392r745O033K2195p47k2142j5360
$$ 352883 243392 164878 113789 96487 97270 104708 96316 86571 92604 114799 114052 91910 76550
10557G6550M202k445j6533J0224j5581k5569n272K485k1974l0725M244J3848K6291
$$ 76550 80752 78307 61774 71998 56417 30848 25576 28061 6087 -24638 -20394 -6546 19745
10544A9745p435j5565N051J8182L864o187m8160j8007J3621M6419j4229l1244
$$ 19745 12310 -3255 1796 19978 23842 17655 -30505 -48512 -34891 11528 -2701 -33945
10532c3945P75Q236j2365O303N304j8513r3r484J052J6023K3164M8419J1951p8
$$ -33945 -33170 -24934 -37299 -30996 -25692 -44205 -44298 -53782 -52730 -36707 -13543 34876 46827 46749
10518D6749o92L9463J673k1346p477K8852K3577K5145J5504J97J0230L0781J3963
$$ 46749 46057 85520 87193 65847 58370 87222 110799 135944 151448 151645 161875 192656 206619
10505B06619m490l862k6948l6440p4r046J6279K6651K8666J761q135k7627k567
$$ 206619 202129 198267 171319 134879 134805 125759 142038 168689 197355 199116 190981 163354 160787
10492A60787l8478l8705K431K6813j4140j5764K6932k3928l7465j0841J9129J3136
$$ 160787 122309 83604 86035 112848 98708 82944 109876 85948 48483 37642 56771 69907
10480F9907K8460J4448L42K3142K6447M928K0877M10r593Q711L1660J7274P343
$$ 69907 98367 112815 113157 136299 162746 167674 188551 188961 179368 188079 219739 237013 244356
10467B44356K5489P984L6239R542J8487R951J3984N8239N9710J0429N8556L3643
$$ 244356 269845 277829 314068 323610 342097 352048 366032 424271 483981 494410 552966 586609
10455E86609J4251l8799j11593j77260j53839p7227K0339K2288j01864j91503
$$ 586609 600860 562061 450468 273208 119369 42142 62481 84769 -17095 -208598
10445b08598j53713q3516m750M3062N7016N4921L9423N9449L6018J7917J9159
$$ -208598 -362311 -445827 -450577 -407515 -350499 -295578 -256155 -196706 -160688 -142771 -123612
10434a23612J4117R119N727N139L3112K2054N656K9648J4869j3444j1357o581
$$ -123612 -109495 -100376 -94649 -89510 -56398 -34344 -28688 960 15829 2385 -8972 -15553
10422a5553J210J6575p970J66M7613L4660o928J1822L6474J4537l837j1085J4360
$$ -15553 -14343 2232 -5738 -5572 42041 76701 69773 81595 118069 132606 128769 117684 132044
10409A32044K8652k1113q607L0406K0609o102o284J8476N6967M8524L1678J4995
$$ 132044 160696 139583 130976 161382 181991 175889 169605 188081 245048 293572 325250 340245
10397C40245J3206j0909M7410O3112J1429J4410K3903M1377M5980K6738L1581
$$ 340245 353451 342542 389952 453064 464493 478903 502806 544183 590163 616901 648482
10386F48482K8641L2608N7796M0854J0977K4933O6207N9450N7590K5691K5857
$$ 648482 677123 709731 767527 808381 819358 844291 910498 969948 1027538 1053229 1079086
10375A079086J6514K9847K7273K0515M585j4783J8688J9226L1412O4425O4539
$$ 1079086 1095600 1125447 1152720 1173235 1177820 1163037 1181725 1200951 1232363 1296788 1361327
10364A361327J07711J12858R8596R8892J56439J78797J77195K02985J76793K34641
$$ 1361327 1469038 1581896 1680492 1779384 1935823 2114620 2291815 2494800 2671593 2906234
10354B906234K88734L63995M17415N19676P00536Q63432Q85626P41696M51861
$$ 2906234 3194968 3558963 3976378 4496054 5196590 6060022 6945648 7687344 8139205
10345H139205L45996N45428R70397J351722J484066J462801J564047K078014K811043
$$ 8139205 8485201 9030629 10001026 11352748 12836814 14299615 15863662 17941676 20752719
10336B0752719L565395M558773O128208Q850978J3543906K1441983L4753535N5988782
$$ 20752719 24318114 28876887 35005095 43856073 57399979 78841962 113595497 169584279
10328A69584279Q2579860R8409722P7469565J8743773l4361825m3265485r006144
$$ 169584279 252164139 350573861 428043426 446787199 412425374 369159889 360153745
10321C60153745L5378006M7048850O562670n5454870r2101492q9934705o5953857
$$ 360153745 395531751 442580601 449143271 393688401 301586909 211652204 145698347
10314A45698347m2019866k6356959j7117691j1472904p936429n704909m412515
$$ 145698347 103678481 77321522 60203831 48730927 40794498 35089589 30677074
10307C0677074l689895l112760k481922j794708j291173j150493j260519j247960
$$ 30677074 26987179 23874419 21392497 19597789 18306616 17156123 15895604 14647644
10299A4647644j036862p81735n89865o00521q07253r87204r99028q71032p94839
$$ 14647644 13610782 12829047 12239182 11638661 10831408 9844204 8845176 7974144 7179305
10290G179305p29998o04043m92663l95422l25146k54979k35487k37690k21517
$$ 7179305 6449307 5845264 5352601 4957179 4632033 4377054 4141567 3903877 3682360
10281C682360j88717j70566j86132j97689j58156j59097j47033j68205j57489
$$ 3682360 3493643 3323077 3136945 2939256 2781100 2622003 2474970 2306765 2149276
10272B149276j26287r5298r9978q6610q7425q1041m3784l2824k9095l4525l4402
$$ 2149276 2022989 1927691 1827713 1741103 1653678 1572637 1528853 1496029 1466934 1432409 1398007
10261A398007k1957m7032m7407n1874m4843o2162k942K9630R497k7002p711Q070
$$ 1398007 1376050 1329018 1281611 1229737 1184894 1122732 1119790 1149420 1158917 1131915 1124204 1132274
10249A132274k4978l0438m5112k8554k2251J2808J1602n966k5524l5504k8715
$$ 1132274 1107296 1076858 1031746 1003192 980941 993749 1005351 999385 973861 938357 909642
10238I09642l894j8346j9754k1912k4769l664L937j3932l681L454j5959j2941
$$ 909642 905748 887402 867648 845736 820967 817303 821240 807308 803627 807081 791122 778181
10226G78181j2273k817o606L0456J6401l5740j2212K0564n007k0839j4933J8987
$$ 778181 765908 763091 756485 786941 803342 767602 755390 775954 770947 750108 735175 754162
10214G54162r047l588m541R352j0848J8870j414L8444M3011N5652Q3879J10423
$$ 754162 745115 741527 736986 746338 735490 754360 752946 791390 834401 890053 973932 1084355
10202A084355R3029R1675M9131n4221j26763j21347n8629o53Q856o8917j65189
$$ 1084355 1177384 1269059 1318190 1263969 1137206 1015859 957230 956577 965433 896516 731327
10191G31327k02379j56028q3402m1740j9836m1033j1321q237q032K2220J3202
$$ 731327 528948 372920 289518 247778 227942 186909 175588 167351 159319 181539 194741
10180A94741J9187P042k0248k9295K111L1627J1973L7556J0170k4k4021j4324
$$ 194741 213928 220970 200722 171427 173538 205165 217138 254694 264864 264840 240819 226495
10168B26495L586l1680L3857L0558K2588J4174K9443M2837L358n1712o2012k4220
$$ 226495 230081 198401 232258 262816 285404 299578 329021 371858 375216 323504 261492 237272
10156B37272r590J2753j280l3180j7534o130j9728k9493l646j399K8918K4607
$$ 237272 227682 240435 239155 205975 188441 182311 162583 133090 129444 128045 156963 181570
10144A81570J0064k4671j9276j8635m1731j2929M7140K5045O794j3046n4759P65
$$ 181570 191634 166963 147687 129052 87321 74392 121532 146577 153371 140325 85566 86331
10132H6331K9769L4799K5311M343L1163q15j9770J9200K5879J4810k6277l6422
$$ 86331 116100 150899 176210 180553 211716 210901 191131 210331 236210 251020 224743 188321
10120A88321p249K6141Q217M613m659j0019n834O295j3517k1065m143q850l574
$$ 188321 181072 207213 215430 220043 215384 205365 199531 205826 192309 171244 167101 158251 154677
10107A54677j5953J3561k2513l0983l704K3957j6589L5026M0468K525l303k829
$$ 154677 138724 152285 129772 98789 95085 119042 102453 137479 177947 180472 177169 174340
10095A74340j2404j5744N190r97k2794j0455J122j0625O158K5293j0636J3806
$$ 174340 161936 146192 151382 150385 127591 117136 118258 107633 113791 139084 128448 142254
10083A42254k2811Q608p576N459J25J6839O602N008J741p056R431j5681k3333
$$ 142254 119443 128051 120475 125934 126059 142898 149500 154508 156249 149193 158624 142943 119610
10070A19610J5539M3322k2448m3580j1689K7118j826j2932q876l633O116j0041
$$ 119610 135149 178471 156023 112443 100754 127872 126046 113114 104238 100605 106721 96680
10058I6680O022j6485k3517J093L3008L2970J0812O862J082o083K3252M2961J6279
$$ 96680 102702 86217 62700 63793 96801 129771 140583 147445 148527 142444 165696 208657 224936
10045B24936l4589k4021l2009l9773m1048j1622P337M223j2115K0229K5064J6081
$$ 224936 190347 166326 134317 94544 53496 41874 49211 53434 41319 61548 86612 102693
10033A02693L1151J0323m159p044j2000J3050j2715k7750j7541m818J3204J6177
$$ 102693 133844 144167 140008 132964 120964 134014 121299 93549 76008 71190 84394 100571
10021A00571k3087k6940P671J0839j0877j5241l4950k9085n159j0360n44J0898
$$ 100571 77484 50544 58215 69054 58177 42936 7986 -21099 -26258 -36618 -37162 -26264
10009b6264L204N768J0316J1190l248K3101K0576R253K2367j1891p633J3064j0838
$$ -26264 -23060 -17292 -6976 4214 966 24067 44643 53896 76263 64372 56739 69803 58965
9996E8965j4304J5950J6101J8967J7890j7467n7011j8173K2288K8213J8206J4209
$$ 58965 44661 60611 76712 95679 113569 96102 39091 20918 43206 71419 89625 103834
9984A03834k1590P698M631j5570k1601k0463N881r767j4308O251P666O0J6399
$$ 103834 82244 89942 94573 79003 57402 36939 42820 33053 18745 24996 32662 32722 49121
9971D9121J6138m835j989J8680K4181K2800j5069j8949j8467p153p599l740q897
$$ 49121 65259 60424 58435 77115 101296 124096 109027 90078 71611 64458 56859 53119 44222
9958D4222k726p06k0388j3523n118J9084K3745K8864N100k2513n666Q419k4944
$$ 44222 41496 40790 20402 6879 1761 20845 44590 73454 78554 56041 50375 58794 33850
9945C3850O046Q077K5209Q545R33k1127j3205P265J2888J7142n519m308O228j271
$$ 33850 39896 47973 73182 81727 82660 61533 48328 55593 68481 85623 80104 75796 82024 80753
9931H0753L0488P557J0970L6039M1916J1232J3010N8631J09898J40301K12912
$$ 80753 111241 118798 129768 165807 207723 218955 231965 290596 400494 540795 753707
9920G53707L15851M65203N37513M16874R8373k24011j93280M0979K62796K21451
$$ 753707 1069558 1534761 2072274 2489148 2587521 2363510 2170230 2211209 2474005 2695456
9910B695456n4602l67199m92211m60641l50401k26565j54889p1424m9254o8761
$$ 2695456 2640854 2273655 1781444 1320803 970402 743837 588948 517524 468270 399509
9900C99509m1669j9948k8998l5117l8152m2996j6804K277k367l0486l201K73M736
$$ 399509 357840 337892 308894 273777 235625 192629 175825 178102 175735 145249 142048 142321 147057
9887A47057j0234k9059l2433K584L031q012l8281q213K6065K4274k2507J047q31
$$ 147057 136823 107764 75331 77915 80946 72934 34653 26440 52505 76779 54272 55319 54488
9874E4488j6041R036L214J5098K03j7240j5755j837l238l5581o013k091L429R948
$$ 54488 38447 47483 50697 65795 65998 48758 33003 31166 27928 -7653 -13666 -15757 -12328 -2380
9860b380M760P636K3156j3279k4113O801L2067R540J2138j0606k0811j7641J6959
$$ -2380 2380 10016 33172 19893 -4220 2581 34648 44188 56326 45720 24909 7268 24227
9847B4227J4900j7564j9661k2326J4420J8062k6739l05K7702J8527J4513j0241
$$ 24227 39127 21563 1902 -20424 -6004 12058 -14681 -14986 12716 31243 45756 35515
9835C5515N555K8712J58k6417j1099j2869j1055P24j6015j9205P609P050r31J2899
$$ 35515 41070 69782 69940 43523 32424 19555 8500 9224 -6791 -25996 -18387 -11337 -12268 631
9821F31K1773P000J6265j4955j2601k3719L6902M7056l1498m0773J7027q23j2687
$$ 631 22404 29404 45669 30714 18113 -5606 31296 78352 46854 6081 23108 22285 9598
9808I598j910Q080O86k125j977R60J803J3634R425P338j1917M347o195j1196m443
$$ 9598 7688 15768 16454 14329 12352 13312 15115 28749 38174 45512 33595 37942 31747 20551 16108
9793A6108l226O258J1034Q280l236r099l033J9913K3885k0710j7315J4637j168
$$ 16108 12882 19140 30174 38454 35218 26119 23086 42999 66884 46174 28859 43496 42328
9780D2328J6426n42o132k5578K5879L874j401l2001j1791k3830j1573J7771J5334
$$ 42328 58754 58212 52080 26502 52381 56255 54854 22853 11062 -12768 -24341 -6570 8764
9767H764K201N988l2012Q29m94N364J1162J8878J6157J708Q235N028j9743j5556
$$ 8764 10965 16953 -15059 -14230 -14724 -9360 1802 20680 36837 38545 46780 51808 32065 16509
9753A6509K1859R302Q159j5857k7387K1740P405r461R14J9560K070l1750j5065
$$ 16509 38368 47670 55829 39972 12585 34325 41730 32269 33183 52743 54813 23063 7998
9740G998r867J2590J2151N317j0426n262j2790r423K3462J3344l786k0643O220
$$ 7998 -1869 10721 22872 28189 17763 12501 -289 -9712 13750 27094 23308 2665 8885
9727H885L1429k569O030q271j4330l4446p968j5587J5781K0370P680k040J0545
$$ 8885 40314 37745 43775 35504 21174 -13272 -21240 -36827 -21046 -676 7004 4964 15509
9714A5509K2517O446J854J7475o244k2561j4005j6445m110J8992m773R268Q734
$$ 15509 38026 44472 46326 63801 57557 34996 20991 4546 436 19428 14655 23923 32657
9701C2657j1063k0049j5387M717M3869r722n1953m300K4106Q960K4123R4j8253
$$ 32657 21594 1545 -13842 -9125 34744 25022 -26931 -31231 -7125 1835 25958 26052 7799
9688G799k9429p665L5311K3700l230R273o941l9214o430J3469Q960L134K611J3901
$$ 7799 -21630 -29295 6016 29716 26486 35759 28818 -10396 -16826 -3357 5603 8737 11348 25249
9674B5249J3223J8540j1032j8423R813N926Q127L709k7607j7274k3267N189K0080
$$ 25249 38472 57012 45980 27557 37370 43296 51423 55132 27525 10251 -13016 -7827 12253
9661A2253J4627N114L8638K7409l2852k2758J0074k6864R475Q029J3861J0623
$$ 12253 26880 31994 70632 98041 65189 42431 52505 25641 35116 43145 57006 67629
9649F7629j0498j6637j4888n947o450M341K5400L7040J130N884J9682K1392p182
$$ 67629 57131 40494 25606 19659 13209 17550 42950 79990 81120 87004 106686 128078 120896
9636A20896N30J1523M6994N5426J7928J2815n667j0504k1931K154m076j8192l0155
$$ 120896 121426 132949 179943 235369 253297 266112 260445 249941 228010 230164 226088 207896 177741
9623A77741l1082j2678q736m1597k7010o816o00J6333K4489j0975j8748K9451
$$ 177741 146659 133981 125245 83648 56638 49822 49222 65555 90044 79069 60321 89772
9611H9772j1471m7561k9014n219j79J750j366N0186J1093N481P754L665l0008
$$ 89772 78301 30740 1726 -3493 -3672 -1922 -3288 46898 57991 63472 71226 74891 44883
9598D4883o489L9268j5545k2953n908J6901J3125P623k1790O994M0037q001l5579
$$ 44883 38394 77662 62117 39164 33256 50157 63282 70905 49115 56109 96146 88145 52566
9585E2566J4157p682q389K68j6544Q196O984Q118K789k1301n929O973j7026J2701
$$ 52566 66723 59041 50652 50920 34376 42572 49556 57674 60463 39162 33233 40206 23180 35881
9571C5881n071p674N612P954J5985P050m292J5861k1840O524J6645n822k016J857
$$ 35881 30810 23136 28748 36702 52687 59737 55445 71306 49466 55990 72635 66813 64797 66654
9557F6654j894r954J7033l1848j6859J5726K7299J7854o807O965K628k0423l5175
$$ 66654 64760 54806 71839 39991 23132 38858 66157 84011 77204 84169 86797 66374 31199
9544C1199j906j879R566r461J0284n392Q055o016L072J1660O976N532k1142N707
$$ 31199 29293 27414 36980 27519 37803 32411 40466 34450 37522 49182 56158 61690 40548 46255
9530D6255J9569J455k7733k043J3614J6014j686p612l797K474Q230N217O504j2414
$$ 46255 65824 67279 39546 37503 51117 67131 65445 57833 54036 56510 64740 69957 76461 64047
9516F4047n4406l624J5503j0113l852L5912J3666r53k4050Q522J0323p689r454
$$ 64047 9641 6017 21520 11407 7555 43467 57133 56180 32130 40652 50975 43286 33832
9503C3832m721J0428m286r219J6102r268j071J368M737J7816J1026J5934O800
$$ 33832 29111 39539 35253 26034 42136 32868 31797 33165 37902 55718 66744 82678 89478
9490H9478m85k241p988K4888q158k6804k4787M51J3906j4121r85l832M1364K0087
$$ 89478 88993 86752 78764 103652 95494 68690 43903 44354 58260 44139 43154 39322 80686 100773
9476A00773Q269l336k0203p955j3157O322k506k5053j6184j6500k3459L8851N5551
$$ 100773 109042 105706 85503 77548 64391 70713 68207 43154 26970 10470 -12989 25862 81413
9463H1413j5636k2811j2459J1126l558m428J0283j03j2211J033q374P868l764
$$ 81413 65777 42966 30507 41633 38075 33647 43930 43827 31616 32649 24275 32143 28379
9450B8379J0905K160K3495J3368N311J2245j8959j0776k951J4303K331J1061J6209
$$ 28379 39284 41444 64939 78307 83618 95863 76904 66128 63177 77480 79811 90872 107081
9437A07081M6967K2057l1888l2194j147K571j988p107j7964q782L344J717J2862
$$ 107081 154048 176105 144217 112023 110876 113447 111459 104352 86388 77606 80950 82667 95529
9424I5529k4058k5915l4293K711K930k1010J9628Q817J1954r102k5592J5412P871
$$ 95529 71471 45556 11263 13974 16904 -4106 15522 24339 36293 27191 1599 17011 24882
9411B4882P682K0420J8923J661l2692j8515L4638J179k7508J886k699M670j662
$$ 24882 32564 52984 71907 73568 40876 22361 56999 58178 30670 32556 29857 34527 32865
9398C2865K3301M3797P554j3801o270j5757J1976J8955J3539j3156j8788r701
$$ 32865 56166 99963 107517 93716 87446 71689 83665 102620 116159 103003 84215 74514
9386G4514j7729K1266j3678l6297J2950K297l167J9847J0626M20k2380K5l461
$$ 74514 56785 78051 64373 28076 41026 43323 40156 60003 70629 71049 48669 48694 45233
9373D5233Q240J515j3162K734L344q407j4454J7896q434L5495J1522r944j9834
$$ 45233 53473 54988 41826 44560 47904 39497 25043 42939 34505 70000 81522 71578 51744
9360E1744K664j4504k3894Q711O919j0350M113J79l0375R929J277j5265J2867
$$ 51744 54408 39904 16010 24721 31640 21290 25403 25582 -4793 5136 6413 -8852 4015
9347D015N4551K8600m457n083J7057k0370o354j7305j8402K002L128K5904q515
$$ 4015 58566 87166 82709 77626 94683 74313 67959 50654 32252 34254 37382 63286 54771
9334E4771m7901L293L0961M0441j2503k2545j4515K541m848K760N956j299m3046
$$ 54771 6870 10163 41124 81565 69062 46517 32002 34543 29695 32455 38411 37112 -5934
9321e934j0692Q96K5532J0218l399K696N085R395n618j0272o637K4097J6056m587
$$ -5934 -16626 -15730 9802 20020 16621 19317 24402 33797 28179 17907 11270 35367 51423 46836
9307D6836K4567r601O684j04j7550j7970q424L1394Q258L816J1827K1442n2232
$$ 46836 71403 61802 68486 68382 50832 32862 24438 55832 64090 67906 79733 101175 48943
9294D8943n1272J801p96L0167J5329m262J0613Q478J8482j3244j0165m606r31
$$ 48943 -2329 -528 -1324 28843 44172 39910 50523 59001 77483 64239 54074 49468 48537
9281D8537j9528o614K7273L12J7190q517O446j4212K3103K25j4606j7317L030
$$ 48537 29009 22395 49668 49980 67170 58653 65099 50887 73990 74215 59609 42292 45322
9268D5322J5328Q676r012j4111Q721k602j6160m0342N6307L6699j3117Q07K94
$$ 45322 60650 69326 60314 46203 54924 52322 36162 -4180 52127 88826 75709 76516 76810
9255G6810q440L839K81K4032l315l126O492R766k3900j8655P76L270J1653M296
$$ 76810 68370 72209 72490 96522 93207 90081 96573 106339 82439 63784 64560 67830 79483 83779
9241H3779j9209p209k8922j4844j9382K0244O715L072M3746J9770j1683k1692
$$ 83779 64570 57361 28439 13595 -5787 14457 21172 24244 67990 87760 76077 54385
9229E4385n814K6350K374k2823p127m955P041j2836J175K1161J4284j2843m222
$$ 54385 48571 74921 77295 54472 47345 42390 49431 36595 37770 58931 73215 60372 56150
9216E6150K8705M448j1182l5325o918o22K2509O515O860L4274p526l7651l0140
$$ 56150 84855 89303 78121 42796 35878 35256 57765 64280 71140 105414 97888 60237 30097
9203C0097o46J0600J5465K2377k355L095j9001J339J697j0727J5825K284J3948
$$ 30097 29451 40051 55516 77893 75538 78633 59632 60971 62668 51941 67766 70050 83998
9190H3998n458j8647o614J364L797J5730r93K2388O374q520j6714J8938J8465
$$ 83998 78540 59893 53279 54643 58440 74170 73177 95565 101939 93419 76705 95643 114108
9177A14108M02j3766m649K6964J6580L5353K4496m4229p53J1785k0465q879j4598
$$ 114108 114510 100744 96095 123059 139639 174992 199488 155259 154506 166291 145826 136947 122349
9164A22349j2849j9892K186J8132j9522M099Q038M531l958j9796j937q4L361m492
$$ 122349 109500 89608 91794 109926 90404 94503 102541 107072 103114 83318 81381 81297 84658 80166
9150H0166j427m979Q330j077k6371K7817J7669j7008j847o459j0240J7483P674
$$ 80166 78739 73760 82090 81013 54642 82459 100128 83120 81273 74814 64574 82057 89731
9137H9731o706n77J4912P035j0255j3357m167O432K7688M8828K8036o669l2626
$$ 89731 83025 82448 97360 104395 94140 80783 76616 83048 110736 159564 187600 180931 148305
9124A48305j1469L7939J6162m713L1022K6638k0825j0342K6685Q601L0352N9940
$$ 148305 136836 174775 190937 186224 217246 243884 223059 212717 239402 248003 278355 338295
9112C38295K696j6046j3316J0300k6139j4846j7704k4357j8519o857q522l2842
$$ 338295 340991 324945 311629 321929 295790 280944 263240 238883 220364 213507 204985 172143
9100A72143j9882o37l204o198L309Q600J9602j2481j8419p669r935J3627L3706
$$ 172143 152261 151624 148420 142222 145531 154131 173733 161252 142833 135164 125229 138856 172562
9087A72562K2859j6797j5520k2954j2471J9092J5682j6671j0378l749o20l148
$$ 172562 195421 178624 163104 140150 127679 146771 162453 145782 135404 131655 131035 127887
9075A27887n985K4836K653j7839n831J4494K0097L687j4034r18m030k3159Q727
$$ 127887 121902 146738 149391 131552 125721 140215 160312 163999 149965 149047 145017 121858 130585
9062A30585K1692J6266J4094j337l5969l134K5145k9159p246j3008j0314M3553
$$ 130585 152277 168543 182637 181300 145331 142197 167342 138183 130937 117929 107615 151168
9050A51168K7598K4961L9329J0179n916J8964J9616L816m66l324J8950j1960m7591
$$ 151168 178766 203727 243056 253235 247319 266283 285899 289715 289249 285925 304875 292915 245324
9037B45324l8247M4406K4980J37n565J545K8360K1949j2757k0402q27K8261k7463
$$ 245324 207077 251483 276463 276600 271035 272580 300940 322889 310132 289730 288903 317164 289701
9024B89701p124k0710n015J2550j3097Q225J0584M8943K3394N278k174j2643j0453
$$ 289701 282577 261867 256852 269402 256305 264530 275114 324057 347451 352729 350555 337912 327459
9011C27459K9181M9955j618j7926Q816K1323K251j0166N464K0013N1639M802O101
$$ 327459 356640 406595 404977 387051 395867 417190 419441 409275 414739 434752 486391 491193 497294
8998D97294P484M585K2306N4045K0452p897j1233M180J1252l6076o2508j07303
$$ 497294 504778 509363 531669 585714 606166 598269 587036 591216 602468 566392 503884 396581
8986C96581n8639m4951m4096m9618j3072M416L8260K7102L785K3353N3400J563
$$ 396581 337942 292991 248895 199277 186205 190621 228881 255983 259768 283121 336521 338084
8974C38084l597L6918K467Q253o153l607K2080J3680L0610p743K3371J1553L1720
$$ 338084 334487 371405 373872 382125 375972 372365 394445 408125 438735 430992 454363 465916 497636
8961D97636M2559j885J2081O1945J8265K5711L6943J9970j8575m096K6025L4838
$$ 497636 540195 538310 550391 612336 630601 656312 693255 713225 694650 690554 716579 751417
8949G51417K1131N852J8426J4093N5383L4980K0273L8414J4089j078L6687M1335
$$ 751417 772548 778400 796826 810919 866302 901282 921555 959969 974058 972980 1009667 1051002
8937A051002K7918L0974K5763M3139K3192M9200N5597O8129P5510L8877K6303
$$ 1051002 1078920 1109894 1135657 1178796 1201988 1251188 1306785 1374914 1450424 1489301 1515604
8926A515604L8636O9918N9485O4529N8891N0509Q2110R9663P5196Q7931P4195
$$ 1515604 1554240 1624158 1683643 1748172 1807063 1857572 1939682 2039345 2114541 2202472 2276667
8915B276667Q2834J03095R7679J02631Q9405Q1304Q1201P0670J22445J46051J34072
$$ 2276667 2359501 2462596 2560275 2662906 2752311 2833615 2914816 2985486 3107931 3253982 3388054
8904C388054J31588J31967J83788J90435J83067K39416K59693K67532K96967L20380
$$ 3388054 3519642 3651609 3835397 4025832 4208899 4448315 4708008 4975540 5272507 5592887
8894E592887L41239L64285M15213M41373M93898N35983N63254O28050P08078P72189
$$ 5592887 5934126 6298411 6713624 7154997 7648895 8184878 8748132 9376182 10084260 10856449
8884A0856449Q54758R59778J106975J218633J403315J628563J869159K149327
$$ 10856449 11711207 12670985 13777960 14996593 16399908 18028471 19897630 22046957
8876B2046957K557728L020267L561174M215127N043998O107943P452284R108869
$$ 22046957 24604685 27624952 31186126 35401253 40445251 46553194 54005478 63114347
8868F3114347J1245998J3950632J7236523K1062268K5055912K8362646K9448009
$$ 63114347 74360345 88310977 105547500 126609768 151665680 180028326 209476335
8861B09476335K6432116J8052689N181767q952617k0482702k6982567k8491017
$$ 209476335 235908451 253961140 259142907 250190290 229707588 202725021 174234004
8854A74234004k6627510k3168104j9377331j5934444j2984109j0590468q671429
$$ 174234004 147606494 124438390 105061059 89126615 76142506 65552038 56880609
8847E6880609p160657n964172m972104m205745l581365l062531k630901k290066
$$ 56880609 49719952 43755780 38783676 34577931 30996566 27934035 25303134 23013068
8839B3013068k017819j794219j581459j379674j236132j115527j000297r04785
$$ 23013068 20995249 19201030 17619571 16239897 15003765 13888238 12887941 11983156
8831A1983156q09203p66953o51103n69409n12670m74759m61102l98634l73882
$$ 11983156 11173953 10407000 9755897 9186488 8673818 8199059 7737957 7339323 6965441
8822F965441l40272l10774l04650k59646k70148k72975k49167k02714k09285k23383
$$ 6965441 6625169 6314395 6009745 5750099 5479951 5206976 4957809 4755095 4545810 4322427
8812D322427k26809k31953j46932j16377j44514j56445j42480j10732j10293q9256
$$ 4322427 4095618 3863665 3716733 3600356 3455842 3299397 3156917 3046185 2935892 2846636
8802B846636r0413q4347p9954p7186r2634o5034o2494o1386o1000l2444m4339
$$ 2846636 2756223 2671876 2591922 2514736 2422102 2357068 2294574 2233188 2172188 2139744 2095405
8791B095405p7776m4950n4009o6808k1141l0689l3898l5027l8994m4271k9161
$$ 2095405 2017629 1972679 1918670 1851862 1830721 1800032 1766134 1731107 1692113 1647842 1618681
8780A618681k8333Q42k4449m1233n3855m8251j2931j1106l5998k0674l9062n4630
$$ 1618681 1590348 1591190 1566741 1525508 1471653 1423402 1410471 1399365 1363367 1342693 1303631 1249001
8768A249001k0218p78o348J0066k3616k8263p351j1385k2604k4112l8150j4857
$$ 1249001 1228783 1228005 1221657 1231723 1208107 1179844 1172493 1161108 1138504 1114392 1076242 1061385
8756A061385m012j4465l4378J7372K749k964j9438q268Q732k760L992k6933Q45
$$ 1061385 1057373 1042908 1008530 1025902 1028651 1025687 1006249 997981 1006713 1003953 1007945 981012 981857
8743I81857J6146N047J7165M4039J7829m04j3223J1524J8833k5916o5403p3038
$$ 981857 998003 1003050 1020215 1064254 1082083 1081679 1068456 1079980 1098813 1072897 1007494 934456
8731I34456p1377n9959m3102o1343n7540k4732l1275m5178K627J2180j4170l7629
$$ 934456 863079 803120 760018 698675 641135 616403 585128 539950 542577 554757 540587 502958
8719E02958k8509l1161L26n940j4760Q220m065J1533j1481o518j8374j7201r739
$$ 502958 474449 443288 443614 437674 422914 431134 427069 438602 427121 420603 402229 385028 375289
8706C75289j822M7177J9763j7350J2105K5374Q986l8049m4000Q120L563k3922
$$ 375289 373467 420644 440407 423057 435162 460536 469522 431473 387473 395593 399156 375234
8694C75234j802O939J5184O635k0859k2862k2822j5526J518k552j6208n164m696
$$ 375234 373432 380371 395555 402190 381331 358469 335647 320121 321639 319087 302879 297715 293019
8681B93019K0837K4005J8954n324l71J9865J5732l33q203l8295l3344m3884J53
$$ 293019 313856 337861 356815 351491 351120 370985 386717 386384 378181 339886 306542 262658 262811
8668B62811J1366J8687P064J3095l719j772J2669J4219l1131J036l863J06j6975
$$ 262811 274177 292864 299928 313023 309304 307532 320201 334420 303289 304325 300462 300568 283593
8655B83593r056K0955p310q860R395J8993J8555j6088k5655R306K3374J8071J3456
$$ 283593 274537 295492 288182 279322 288717 307710 326265 310177 284522 293828 317202 335273 348729
8642C48729m248o339j6502m3844k506P225M188j1521m2740Q710j8110k923R762
$$ 348729 344481 338142 321640 277796 275290 282515 286703 275182 232442 241152 223042 220119 229881
8629B29881j6639k0332J181j6722j1005j179j6865L810M685M131Q815P822K8431
$$ 229881 213242 192910 194091 177369 166364 165185 148320 152130 156815 160946 169761 177583 206014
8616B06014K0519R04R782l858k2923j417k2275J5598M8802n66k4241p663K0676
$$ 206014 226533 227437 237219 233361 210438 209021 186746 202344 251146 250580 226339 218676 239352
8603B39352J5621K476k8037K3256k5810k8193O203J4489j8406j3045k5987r843
$$ 239352 254973 257449 229412 252668 226858 198665 204868 219357 200951 187906 161919 152076
8591A52076O458k239o833p378n787J2635K3838J8796m150j782O287j4230P390
$$ 152076 158534 156295 149462 142084 136297 148932 172770 191566 187416 185634 191921 177691 185081
8578A85081J6378j7807k8389j5897J4929J6248O68N06j3726q755P479j1088j0531
$$ 185081 201459 183652 155263 139366 154295 170543 171211 171717 157991 149236 156715 145627 135096
8565A35096n354k1677R012M821K2654M869l7034j8357J6539J0674j6685j6806
$$ 135096 129742 108065 117077 121898 144552 149421 112387 94030 110569 121243 104558 87752
8553H7752J0781l2576M216Q867L938q04m011l0933j902O918J1339r333J5428Q302
$$ 87752 98533 65957 70173 79040 82978 82174 78163 47230 45328 52246 63585 54252 69680 77982
8539G7982Q520Q003m321n066N214J0723j4175j2895O117m916K500N4507J0521
$$ 77982 86502 94505 90184 85118 90332 101055 86880 73985 80102 75186 77686 132193 142714
8526A42714n350j161k0729k1055k1855J5051K7943J707j5493K849P154K3596J8024
$$ 142714 137364 136203 115474 94419 72564 87615 115558 117265 101772 104621 111775 135371 153395
8513A53395j3850k6915k2541m252p41j2260n923m751j8357j5901J3362K9763q021
$$ 153395 139545 112630 90089 85837 85096 72836 66913 62162 43805 27904 41266 71029 63008
8500F3008P187J9717o714j212j2879j0868j0103j56K9372K8475k2603m14j3064
$$ 63008 70195 89912 83198 81986 69107 58239 48136 47980 77352 105827 83224 82810 69746
8487F9746k6064k0370J1332L0056n156R247k2507J5683p338n818K1831K1562K766
$$ 69746 43682 23312 34644 64700 59544 68791 46284 61967 54629 48811 70642 92204 94970
8474I4970k6237K5277K5672j6498m0986Q15J4607j0175J3119k1415J0556J2210
$$ 94970 68733 94010 119682 103184 62198 63013 77620 67445 80564 59149 69705 81915
8462H1915k0047o377n753j8604r873K3631J6378l424M557n071J5808k2145m683
$$ 81915 61868 55491 49738 31134 21261 44892 61270 57846 62403 57332 73140 50995 46312
8449D6312j1791J770L604N398j9314j6334Q724m97n064L0710L4299j0533Q769
$$ 46312 34521 36291 39895 45293 25979 9645 18369 17872 12808 43518 77817 67284 76053
8436G6053k3662M564K8287J6631r158k1084l4864N448K425j2864k0885L3352K2300
$$ 76053 52391 56955 85242 101873 92715 71631 36767 42215 44640 31776 10891 44243 66543
8423F6543o92o36k4487J941p547l99Q74l530p694K1020L7613J821J3542J1791
$$ 66543 65851 65215 40728 42669 35122 34723 35597 32067 24373 45393 83006 84827 98369 110160
8409A10160j0726l3540J918J0711j5079p48j0420k889J2852J3773k5630l2071
$$ 110160 99434 65894 67812 78523 63444 62696 52276 49387 62239 76012 50382 18311
8397A8311k4399N81Q568K8314J7311q823J0726L0875j1787j8563o125q803J4694
$$ 18311 -6088 -5507 3061 31375 48686 39863 50589 81464 69677 51114 44989 36186 50880
8384E0880J729Q479j3356k0818J6068K4835J571l9361j6698l122j251J6739K1767
$$ 50880 52609 61088 47732 26914 42982 67817 69388 30027 13329 10207 8956 25695 47462
8371D7462k380P607M403o296m2702k314L033j1033K8623K5328j8756Q840J3391
$$ 47462 45082 52689 57092 50796 8094 5780 8813 -2220 26403 51731 32975 41815 55206
8358E5206j0129j5066j899p821j1430O03k107R964K2646m291o618M4810R69l6126
$$ 55206 45077 30011 28112 20291 8861 9464 7357 17321 39967 35676 29058 73868 74837 38711
8344C8711n420L0283j423k080O812K0688p590j2932j0360j7647p867J8783J7745
$$ 38711 33291 63574 62151 60071 66883 87571 79981 67049 56689 39042 31175 49958 67703
8331F7703j0800j9628N60l110j2181j3885L374J9891J6594K2118k476k0440k4964
$$ 67703 56903 37275 37835 34725 22544 8659 12033 31924 48518 70636 68160 47720 22756
8318B2756k3809M5975J7340j2996k1927k938j1574l105O364m646J110j2385K7305
$$ 22756 -1053 44922 62262 49266 27339 24401 12827 9722 16086 11440 12550 165 27470
8305B7470L8613L53J3335k9040k6250p88k2435Q729k0270k2312J5254K5232M860
$$ 27470 66083 66436 79771 50731 24481 23693 1258 9987 -10283 -32595 -17341 7891 12751
8292A2751l705K3764K5867j6468j2914m434j5227K060J1757P784J5992P527l63
$$ 12751 9046 32810 58677 42209 29295 24861 9634 11694 23451 31235 47227 54754 54391
8279E4391L708r054j3672r563J448J5216L3647q926O23j5600l6725o06J8262o128
$$ 54391 58099 49045 35373 25810 27258 42474 76121 67195 67818 52218 15493 14887 33149 27021
8265B7021L631J8362J8311j6731M692O460l6580J711Q985n723N955k475k3801
$$ 27021 30652 49014 67325 50594 55286 61746 25166 26877 35862 30139 36094 33619 9818
8252I818j5167j1941P50k4858K3751L7666j7583M911K4997J2930k2020q384K2694
$$ 9818 -5349 -17290 -16540 -41398 -17647 20019 2436 7347 32344 45274 23254 14870 37564
8239C7564o766j6929P78m636p26J5729K017k8757p496J1622J650k4334q91M955
$$ 37564 30798 13869 14647 10011 9285 25014 27031 -1726 -9222 2400 4050 -20284 -21175 -16220
8225a6220q544J5689O350R353L8959K1813j8459j0276l1872k8254J2262j2748
$$ -16220 -24764 -9075 -2725 6628 45587 67400 48941 38665 6793 -21461 -9199 -21947
8213b1947O799Q102K477K3272J2794m112k7416j5739J5348K7738J6034l1943j1548
$$ -21947 -15148 -7046 -4569 18703 31497 27385 -31 -15770 -422 27316 43350 11407 -141
8200a41j742O688O989J429j1590O519N649j0824j7973J2434N65O736N785P788
$$ -141 -1883 4805 11794 13223 1633 8152 13801 2977 -14996 -2562 -1997 4739 10524 18312
8186A8312j3301J5303l2060J675Q369K783O250j0560o023j5071q523L1792L0667
$$ 18312 5011 20314 -11746 -10071 -1702 1081 7331 -3229 -9252 -24323 -32846 -1054 29613
8173B9613j6258N226n72j5141J4752J4898J2119P767M183j7312q378l0707j9860
$$ 29613 13355 18581 18009 2868 17620 32518 44637 52404 56587 39275 30897 190 -19670
8160a9670J2869J0715k0756k429k355m476O922O672J7725J2122K2848o099l3591
$$ -19670 -6801 3914 -16842 -19271 -21626 -26102 -19180 -12508 5217 17339 40187 34088 497
8147D97P618J3708J6584Q286j3340j5091M478l392K1997r248o854j1504j2430
$$ 497 8115 21823 38407 46693 33353 18262 22740 19348 41345 32097 25243 13739 1309
8134A309J6586j0667j7527k2148j1056O016K3430M1116o798J0935J086k9006J033
$$ 1309 17895 7228 -10299 -32447 -43503 -37487 -14057 27059 20261 31196 32282 3276 4309
8121D309o510L491L7341k5755q581K3788Q580k0866J7344j024m195J727j0232
$$ 4309 -2201 1290 38631 12876 4295 28083 36663 15797 33141 32117 27922 29649 19417
8108A9417k7813k3024K9918M876J7960N706j3817m420j4109m069J9546K8070J1624
$$ 19417 -8396 -31420 -1502 3374 21334 27040 13223 8803 -5306 -9375 10171 38241 49865
8095D9865j7122k6483K2580O428k086J7645K1398j4932k2999l000k536J3576J2651
$$ 49865 32743 6260 28840 35268 33182 50827 72225 57293 34294 31294 28758 42334 54985
8082E4985j6298j2650j2099L969J0203M469Q26K495k667k2401p50K2575p039j6250
$$ 54985 38687 26037 13938 17907 28110 32579 33405 35900 33233 10832 10082 32657 25618 9368
8068I368M341J467K5562M6639O804k3489n2258k2352J7345J2756j1292J6772P732
$$ 9368 13709 15176 40738 87377 94181 70692 18434 -3918 13427 26183 14891 31663 39395
8055C9395j3858j087J2380l478j1034J682j0416J1272j359n299P923J2210q570
$$ 39395 25537 24450 36830 33352 22318 24000 13584 24856 23497 18198 26121 38331 29761
8042B9761k059J2703J0741j8151j6662k938K463k4009J1472L910p189J9908M579
$$ 29761 27702 40405 51146 32995 16333 13395 15858 -8151 3321 7231 42 19950 24529
8029B4529k7317P250L1440O219J1203K182N594j5251k0190n573j570k5611k7261
$$ 24529 -2788 4462 35902 42121 53324 55506 61100 45849 25659 20086 18516 -7095 -34356
8016c4356J1351L0864K5928J6588O557l951l7663m53O211o802J7755L3087r101
$$ -34356 -23005 7859 33787 50375 56932 52981 15318 14865 21076 14274 32029 65116 56015
8003E6015j9347K1369J9072n750k4564j8030n639q191Q14J2382j0661n100J1613
$$ 56015 36668 58037 77109 71359 46795 28765 23126 14935 15749 28131 17470 12370 23983
7990B3983p210J871k219J2402L270J3395k2766k7902l3622K0127K9577K8627J8039
$$ 23983 16773 18644 16425 28827 32097 45492 22726 -5176 -38798 -18671 10906 39533 57572
7977E7572j584l56k4670j9170j4695L104N179r140K6343Q615o224o899J1047N45
$$ 57572 55988 55632 30962 11792 -2903 201 5380 -3760 22583 31198 24974 18075 29122 29667
7963B9667o531l3660k0115J2967J2576n627j4035J5940L4455L1503J3502j6162
$$ 29667 23136 -10524 -30639 -17672 -5096 -10723 -24758 -8818 25637 57140 70642 54480
7951E4480k7771j5159m202P861J19J8640L2110j2463o1494k1859R958Q006j626
$$ 54480 26709 11550 7348 15209 15328 33968 66078 53615 -7879 -29738 -19780 -11774 -13400
7938a3400J8245J5663p195j1015J028J064P267K1061Q868L308J9054k5051j1923
$$ -13400 4845 20508 13313 2298 3326 4390 11657 32718 41586 44894 63948 38897 26974
7925B6974J2901K1048q881j4250J1973j0560k0520k8854k0048L0554k102j7841
$$ 26974 39875 60923 52042 37792 49765 39205 18685 -10169 -30217 337 -1765 -19606
7913a9606K0377J843k8010k6240J7828M9007l81j7574J932J2659r1J7657J9045
$$ -19606 771 2614 -25396 -51636 -33808 15199 14818 -2756 -824 11835 11744 29401 48446
7900D8446O516l6786k0841J3558k3825m6317j574J3046n874o020J9041K2943L0601
$$ 48446 54962 18176 -2665 10893 -12932 -59249 -60823 -47777 -53651 -59671 -40630 -17687 12914
7887A2914O478q759N030l417J5772Q811L2888L0535k128P04k2608m1618k9057
$$ 12914 19392 10633 15663 12246 28018 36829 69717 100252 98124 98828 76220 34602 5545
7874E545l062j7345J015J3785k177Q902M53j4763j5787l1037J5870K6730J4720
$$ 5545 2483 -14862 -13847 -62 -2239 6663 7116 -7647 -23434 -54471 -38601 -11871 2849
7861B849L3318M178r157J8J941l0055j2758K2097J0106o534J7206J698q032j0809
$$ 2849 36167 40345 31188 31206 33147 3092 -9666 12431 22537 16003 33209 34907 26875 16066
7847A6066O297J8523j9204l0044m987L1506k5334j0123j286J6300J8988k5140
$$ 16066 22363 40886 21682 -8362 -13349 18157 -7177 -17300 -18586 -2286 16702 -8438
7835h438l1030k677K3523J105K2161M065k5347M789o144L0119n726O050J6875
$$ -8438 -39468 -42145 -18622 -17517 4644 8709 -16638 -11849 -17993 12126 6400 12450 29325
7822B9325m362j8545M513J5469o694L96N642J5207L318k1606p037L611k6561l1148
$$ 29325 24963 6418 10931 26400 19706 20102 25744 40951 44269 22663 15626 19237 -7324 -38472
7808c8472J6824L359J5576J002k011M658n418l7239J3628M8340J4738m1088k9643
$$ -38472 -21648 -18289 -2713 -1711 -3722 936 -4482 -41721 -28093 20247 34985 -6103 -35746
7795c5746J4754J9520K3415N852l001l5239j3966J1315k30J5187J7717j9036j5358
$$ -35746 -20992 -1472 21943 27795 24794 -10445 -24411 -13096 -13326 1861 19578 542 -14816
7782a4816r316j3669L601J7778M590J9102K4682P535k6250P749K533Q534j4138
$$ -14816 -24132 -37801 -34200 -16422 -11832 7270 31952 39487 13237 20986 23519 32053 17915
7769A7915O550L9727M758l4972j3699N070K652r125k753p119P815J2781q202j9769
$$ 17915 24465 64192 68950 33978 20279 25349 28001 18876 16123 9004 16819 29600 21398 1629
7755A629J0932r062P027m38J978O077L105J3019j2212j6899j2684j1512j3946
$$ 1629 12561 3499 10526 10088 12066 18143 21248 34267 22055 5156 -7528 -19040 -32986
7742c2986J6263K3911O033J89L232k732J1K358j2990j4781j0170J1000M7677J8419
$$ -32986 -16723 7188 13221 13410 16642 13910 13921 16279 3289 -11492 -21662 -10662 37015 55434
7728E5434k6403k0398J245R792Q381M510q566n107J773J4761j6657K769Q296R760
$$ 55434 29031 8633 9878 19670 28051 32561 23995 18888 20661 35422 18765 21534 29830 39590
7714C9590j4097J3781L159l8453k704K933J8949j0277j6367j3855Q980J7915k504
$$ 39590 25493 39274 42433 3980 1276 4209 23158 12881 -3486 -17341 -8361 9554 7050
7701G050k1546l312J8560K8835q226J2737j1774j0954p513k5317m731J4096k642
$$ 7050 -14496 -17808 752 29587 21361 34098 22324 11370 3857 -21460 -26191 -12095 -14737
7688a4737K2402j625J2651o037k5154R166J0917P410j3724k0006j6041K781N813
$$ -14737 7665 6040 18691 12654 -12500 -3334 7583 14993 1269 -18737 -34778 -31997 -26184
7675b6184p552N09o110M0845j1667k4675j126p584K080J8982K01o160j057J7455
$$ -26184 -33736 -33227 -39337 1508 -10159 -34834 -35960 -43544 -41464 -22482 -22281 -28441 -29498 -12043
7661a2043L886k8279J9292K156j8920k435P467K8912J3809q066j3880j6962k6101
$$ -12043 -8157 -36436 -17144 -14988 -33908 -36343 -28876 36 13845 5779 -8101 -25063 -51164
7648e1164j7184J3626J1764M735N441J0263J549J5701J666j551K1638J836j9277
$$ -51164 -68348 -54722 -42958 -38223 -32782 -22519 -20970 -5269 -3603 -5154 16484 18320 -957
7635i57J5889M188k9485q077J0461n092J0291P540k6596j5985J7885J5615P034
$$ -957 14932 19120 -10365 -18442 -7981 -13073 -2782 4758 -21838 -37823 -19938 -4323 2711
7622B711l065r501J7848K1212j2910l0879k0345p681j1929k891J4093J0439J6126
$$ 2711 -354 -9855 7993 29205 16295 -14584 -34929 -42610 -54539 -57430 -43337 -32898 -16772
7609a6772R396j5542p139j407J8369K3707k0817N651l140j0493l664j641J6014
$$ -16772 -7376 -22918 -30057 -31464 -13095 10612 -10205 -4554 -7694 -18187 -21851 -23492 -7478
7596g478J5255j0521L575j363k4162r489J0908q034L066J3547K4486Q871P731
$$ -7478 7777 -2744 831 -532 -24694 -34183 -23275 -31309 -28243 -14696 9790 18661 26392
7583B6392Q422l187j974j3059R318P400j5013L443m038N696p796j4525O622L523
$$ 26392 34814 31627 29653 16594 25912 33312 18299 21742 17704 23400 15604 1079 7701 11224
7569A1224j1710k7907j8703o068J2394J0908o450J3276j284j8734J444J3191L9992
$$ 11224 -486 -28393 -47096 -53164 -40770 -29862 -36312 -23036 -24320 -43054 -41610 -28419 11573
7556A1573L4794Q44J8898m548l2820k408j0832j4440j9545P566L4288L5064j0829
$$ 11573 46367 47211 66109 61561 28741 26333 15501 1061 -18484 -10918 23370 58434 47605
7543D7605k8361k3523k8996J331K8024o757R49K2459L2623p993j9033k1502M658
$$ 47605 19244 -4279 -33275 -31944 -3920 -10677 -9728 12731 45354 37361 18328 -3174 1484
7530A484J5537K1042J2991k2618N369J245n444j8695P491k31k6302L0561J6831
$$ 1484 17021 38063 51054 28436 33805 35050 29606 10911 18402 18171 -8131 22430 39261
7517C9261j1499L743j1752l7190J753J1335k3198J3551O978r689P659K7711j2028
$$ 39261 27762 31505 19753 -17437 -15684 -4349 -27547 -13996 -7018 -16707 -9048 18663 6635
7504F635K186k565J1981k884k9341k0502J9956j6338j5820j5443L71K7860j0150
$$ 6635 8821 6256 18237 15353 -13988 -34490 -14534 -30872 -46692 -62135 -61764 -33904 -44054
7491d4054J0966R111K2550l243O936K7208N804k2047p993J942L1511N639k5746
$$ -44054 -33088 -23977 -1427 -4670 2266 29474 35278 13231 5238 7180 38691 44330 18584
7478A8584k1320k5436J179M366J339l393J0621J2232J2521k1264O994L5963l705
$$ 18584 -2736 -28172 -26993 -22627 -21288 -24681 -14060 -1828 10693 -10571 -3577 32386 28681
7465B8681k2239l9323k1407m696m583Q881K9123J9301j2071m646j2148k655J0123
$$ 28681 6442 -32881 -54288 -58984 -63567 -54686 -25563 -6262 -18333 -22979 -35127 -37782 -27659
7452b7659r714P341K5120L2260P810O035K02k898k1135l599k838O624N147p0j4666
$$ -27659 -37373 -30032 -4912 27348 35158 41193 41395 38497 17362 13763 10925 17549 22696 22626 7960
7437G960J4558L0110k5807j5980n12j891P870j1635j5812j8700L962j969N762
$$ 7960 22518 52628 26821 10841 10329 8438 16308 4673 -11139 -29839 -25877 -27846 -22084
7424b2084M8967l394l1893o818J4749j3787r659j6542J8899K4398K5254m782M512
$$ -22084 26883 23489 -8404 -15222 -473 -14260 -23919 -40461 -21562 2836 28090 23308 27820
7411B7820j9835j8257j9236Q631M2970J3514j3998k6414p94J1451J260L582L6325
$$ 27820 7985 -10272 -29508 -20877 22093 35607 21609 -4805 -5599 5852 7112 10694 47019
7398D7019L829j5293j9241j8486l144k318O267N541P229k325j5113K692R717k2303
$$ 47019 50848 35555 16314 -2172 -5316 -7634 -1367 4174 11403 9078 -6035 -3343 6374 -15929
7384a5929k5600j092J2600J7757j17N602r191j0407r583j0113J8104L0579J6362
$$ -15929 -41529 -42621 -30021 -12264 -12381 -6779 -15970 -26377 -35960 -46073 -27969 2610 18972
7371A8972J0624K0133P641j5651l3938j6091J7763j3298K3577J3182j1328k0207
$$ 18972 29596 49729 57370 41719 7781 -8310 9453 -3845 19732 32914 21586 1379
7359A379m067k159J4283j588L345n061j3089K4468J1766n4966k7303N088R939
$$ 1379 -2688 -4847 9436 7848 11193 6132 -6957 17511 29277 -25689 -52992 -47904 -37965
7346c7965k0452K1243P565j3402J0730N1871J3593k2393q576J6462K6706j3203
$$ -37965 -58417 -37174 -29609 -43011 -32281 19590 33183 10790 2214 18676 45382 32179
7334C2179k7366M981K4683k078j8747j3617J4996O676j2864L6032K2171M446r075
$$ 32179 4813 9794 34477 32399 13652 35 15031 21707 8843 44875 67046 71492 62417
7321F2417k4049n0732k1871j9769J128M3559J2669j8123n456J2163O224o408N192
$$ 62417 38368 -12364 -34235 -54004 -52876 -9317 3352 -14771 -20227 -8064 -1840 -8248 -3056
7308c056l5664k4898J5403K0901J5122K0739J0737n2226l5497K2082M1744n417
$$ -3056 -38720 -63618 -48215 -27314 -12192 8547 19284 -32942 -68439 -46357 -4613 -10030
7296a0030J384j7735K1468K818k2657L113m798j1248o968L8179K9560j3465Q579
$$ -10030 -8646 -26381 -4913 -2095 -24752 -21639 -26437 -37685 -44653 -6474 23086 9621 18200
7283A8200Q92k0780j2479J1076J2773k115K0777k4687j2726O634j6029J5610K6490
$$ 18200 19092 -1688 -14167 -3091 9682 7567 28344 3657 -9069 -2435 -18464 -2854 23636
7270B3636j7254p542K0771N023p569k7845j5336m90J254K0776R090o349j3261
$$ 23636 6382 -1160 19611 24634 17065 -10780 -26116 -26606 -25352 -4576 4514 -1835 -15096
7257a5096r803J3340Q418r844J0911k021Q688K9175j1261j7094R364K1757q393
$$ -15096 -24899 -11559 -3141 -12985 -2074 -4095 4593 33768 22507 5413 14777 36534 28141
7244B8141k5468J1989j0111J2459M450k5288o0687K5037K5317r713m933j8070
$$ 28141 2673 14662 4551 17010 21460 -3828 -64515 -39478 -14161 -23874 -28807 -46877
7232d6877p333J5557K7898K0101J5616k7291j0972O529o47N576q1K299j905q480
$$ -46877 -54210 -38653 -10755 9346 24962 -2329 -13301 -6772 -7419 -1843 -1924 375 -1530 -10010
7218a0010P464J5214O586J6874l7297k4351j408M2191r759o820M377O395j9923
$$ -10010 -2546 12668 19254 36128 -1169 -25520 -26928 15263 5504 -1316 3061 9456 -10467
7205a0467j9272K1565J6327N57r169l263m5094J7058J3306k7742M02J9630K6049
$$ -10467 -29739 -8174 8153 8710 -459 -3722 -48816 -31758 -18452 -46194 -45792 -26162 -113
7192a13J3764k5452n785M452K194J0118L2989m0805m0419J932J2185K6244k187
$$ -113 13651 -11801 -17586 -13134 -10940 -822 32167 -8638 -49057 -47125 -34940 -8696 -10883
7179a0883L46j7390n027K8417K3382J5870r833k5033j1053L2885L1078j1202l7402
$$ -10883 -10537 -27927 -32954 -4537 18845 34715 24882 -151 -11204 21681 52759 41557 4155
7166D155p799l7799m037M8335J9001p903N170q378J3210p376o638O651j3237k1926
$$ 4155 -3644 -41443 -45480 2855 21856 13953 19123 10745 23955 16579 9941 16592 3355 -18571
7152a8571j3478k2467L423P515n163J228N093L1608J9806K219j2447MO396j8449
$$ -18571 -32049 -54516 -51093 -43578 -48741 -47513 -42420 -10812 8994 11213 -1234 -1230 5166 -13283
7138a3283m842J913L3618K0547j1826q812l687j2816j9497j5097J2644M4220j3716
$$ -13283 -18125 -16212 17406 37953 26127 17315 13628 812 -18685 -33782 -21138 23082 9366
7125I366P425J0174j7567j633L272n627j7655Q160o58N670k8249r166m195m498
$$ 9366 16791 26965 9398 7765 11037 5410 -12245 -4085 -4743 927 -27322 -36488 -40683 -45181
7111d5181J2518R809L1536J0032j2473j2948L833J5097J430k950k0073k0898j4386
$$ -45181 -32663 -22854 8682 18714 6241 -6707 -2874 12223 13653 10703 -9370 -30268 -44654
7098d4654L7378K282J2049j3817l3827j3415N706J3990o189q931J1304K7311K055
$$ -44654 -7276 -4994 7055 -6762 -40589 -54004 -48298 -34308 -40497 -49428 -38124 -10813 -8758
7085h758q545k423K2581J1758k0841l1363k8027J6522M673J5431j5892J403K5449
$$ -8758 -17303 -19726 2855 14613 -6228 -37591 -65618 -49096 -44423 -28992 -44884 -43481 -18032
7072a8032O999m943Q033J1946J9341J7013j97l6509j2466n439l87j1877O787K380
$$ -18032 -11033 -15976 -7943 4003 23344 40357 40160 3651 -8815 -14254 -14641 -26518 -19731 -17351
7058a7351J8618k2587j6311O725K0300J0583L228N892o360k2952j6676L528n967
$$ -17351 1267 -21320 -37631 -30906 -10606 -23 3205 9097 2737 -20215 -36891 -33363 -39330
7045c9330J4190j2064p938K43Q008K5381J1342j6911Q930l056j5021j764k100
$$ -39330 -25140 -37204 -45142 -44899 -36891 -11510 -168 -17079 -8149 -11205 -26226 -27990 -30090
7032c0090J9579K6888J7737Q524J704r085j0690r769l2164k5996k240K2481L2911
$$ -30090 -10511 16377 34114 42638 44342 35257 24567 14798 -17366 -43362 -45602 -23121 9790
7019I790K2392O205j8512J0764l758k6117j5831K9744O073p417o958j6010j5753
$$ 9790 32182 38387 19875 30639 26881 764 -15067 14677 20750 13333 6375 -9635 -25388
7006b5388k3290K015J134k8159q168J4092J8836L944J7460K0368K8759L6154K5335
$$ -25388 -48678 -46663 -45529 -73688 -81856 -67764 -48928 -44984 -27524 -7156 21603 57757 83092
6993H3092l455k4408M917J3661P969K811k5945j6091J1378N544K008P498j8161
$$ 83092 79637 55229 60146 73807 81776 84587 58642 42551 53929 59473 61481 68979 50818
6980E0818k840k5028j1609k4198j6750K4350J5369l563J6163Q339M505j7479j4304
$$ 50818 47978 22950 11341 -12857 -29607 -5257 10112 6549 22712 31051 35556 18077 3773
6967C773j6746k07O900J5085j5822k5352R19K6832J9340j2272j5151j1673R484
$$ 3773 -12973 -13180 -6280 8805 -7017 -32369 -31450 -4618 14722 2450 -12701 -24374 -14890
6954a4890j3885k0840J3332K3330J2181k0460j4773j2958K2142n015j0964j069
$$ -14890 -28775 -49615 -36283 -12953 -772 -21232 -36005 -48963 -26821 -31836 -42800 -43869
6942d3869o054K1325L3667L012J0736r702J2172L1169J929L751k4700p663l8683
$$ -43869 -49923 -28598 5069 8081 18817 9115 21287 52456 54385 58136 33436 25773 -12910
6929a2910q154L6649L8860j5729j5264j9139J234l41l914r880J5707k328K1528
$$ -12910 -21064 15585 54445 38716 23452 4313 5547 5206 1292 -8588 7119 4791 26319
6916B6319P782j4870j3811Q618j3551k1264J3696m616k2426m673L4137J7674L36
$$ 26319 34101 19231 5420 14038 487 -20777 -7081 -11697 -34123 -38796 -4659 13015 13351
6903A3351q517J2474K263q995n189k7k2718k4713J7076L1983N616l7424l0532
$$ 13351 4834 17308 19571 10576 5387 5360 -17358 -42071 -24995 6988 12604 -24820 -55352
6890e5352j5081J5290M0589J9613Q589k1284J6587r880J0258M0268j385m4702
$$ -55352 -70433 -55143 -14554 5059 13648 -7636 8951 -929 9329 49597 48212 3510
6878C510m6921R517p97J1627L1294r743p259j9557L662n447M4970K9108J4826
$$ 3510 -43411 -33894 -34691 -23064 8230 -1513 -8772 -28329 -24667 -30114 14856 43964 58790
6865E8790j8010m939k2595o96k3862k1449L931l924J9813O004j0759m868N419
$$ 58790 40780 35841 13246 12550 -11312 -32761 -28830 -32754 -12941 -6937 -17696 -22564 -17145
6852a7145K2794l32J7210p750l9301l3527J501L3145J1282q274j2639r122J8614
$$ -17145 5649 5317 22527 14777 -24524 -58051 -56550 -23405 -12123 -20397 -33036 -42158 -23544
6839b3544L9939J601l719k0458j4642l1476O35Q223j903l072J4569L5951P869
$$ -23544 16395 17996 14277 -6181 -20823 -52299 -51664 -43441 -45344 -48416 -33847 2104 9973
6826I973K776j0512l82J0523R422j3348R70j3020j774J9702J1302J1322n547j3011
$$ 9973 12749 2237 1855 12378 21800 8452 9422 -3598 -5372 14330 25632 36954 31407 18396
6812A8396k0993j0027j6948J4723J8440K825j4375k3696O965P268J3484m912J3692
$$ 18396 -2597 -12624 -29572 -14849 3591 6416 -7959 -31655 -24690 -17422 -3938 -8850 4842
6799D842j2825n3974P421K0003J943J028j2010l3124J3438N994K6657J4476J4343
$$ 4842 -7983 -61957 -54536 -34533 -32590 -31562 -43572 -76696 -63258 -57264 -30607 -16131 -1788
6786a788o172K636J3299L489m397R849L674j1670k8724k3213P713P403n882J069
$$ -1788 -7960 -5324 7975 11464 7067 16916 20590 8920 -19804 -43017 -35304 -27901 -33783 -32714
6772c2714P521r638R727J8680J0208j1655J7279K1693J4241j4000J295n514j4467
$$ -32714 -25193 -34831 -25104 -6424 3784 -7871 9408 31101 45342 31342 32637 27123 12656
6759A2656N526Q308r365o053p568J3877n848J6485j9670k4258j1263L2799O061
$$ 12656 18182 26490 17125 11072 3504 17381 11533 28018 8348 -15910 -27173 5626 11687
6746A1687p326l4756k4792K3772J5272P1L044J2217J2243K5272J6150j9090l3153
$$ 11687 4361 -30395 -55187 -31415 -16143 -16072 -13028 -811 11432 36704 52854 33764 611
6733F11q34K2998j569k7541r190l439J0503L059l7966j3257K7201J13m895J2355
$$ 611 -223 22775 21206 -6335 -15525 -18964 -8461 -5402 -43368 -56625 -29424 -29311 -34206 -21851
6719b1851k079J5194r056j8507n384P576K3564J3500n415p331J2973O256J6322
$$ -21851 -23930 -8736 -17792 -36299 -41683 -34107 -10543 2957 -2458 -9789 3184 9440 25762
6706B5762Q169J7018P930k2411m0199k229k3142m833J012L8477M0633n613k5991
$$ 25762 33931 50949 58879 36468 -3731 -5960 -29102 -33935 -32923 5554 46187 40574 14583
6693A4583j1353K6080N236j8221J9583N039k9227p059m581J4377P073L2995o071
$$ 14583 3230 29310 34546 16325 35908 40947 11720 4661 80 14457 21530 54525 48454
6680D8454L57P249j0104k1897q631r029k693j8783j6051Q0J7845j909J2389r198
$$ 48454 48811 56060 45956 24059 15428 6399 3706 -15077 -31128 -31048 -13203 -15112 -2723 -11921
6666a1921l921K7390K9882j5247o316L986r164K8791m550j2774N136M0078K7032
$$ -11921 -15842 11548 41430 26183 19867 23853 14689 43480 38930 26156 31292 71370 98402
6653I8402k3147j4714j0399k3513K2331J8872K3028J6210R628J571K2221J06993
$$ 98402 75255 60541 50142 26629 48960 67832 90860 107070 116698 118269 140490 247483
6641B47483J63539J87200J29897n6039j32320j33193n9028m845R070L5622O6631
$$ 247483 411022 598222 728119 672080 539760 406567 347539 342694 351764 387386 454017
6630D54017R9377J06794J75645K72634L44084M21342N65670R39682J793796L523353
$$ 454017 553394 660188 835833 1108467 1452551 1873893 2439563 3379245 5173041 8696394
6620H696394O118162P552573L087991m532988o940424n848946l071561j506086
$$ 8696394 14814556 22367129 25455120 20922132 13981708 8132762 5061201 3555115
6612C555115q33650n42522l97978l77017k94498j97008j34026p9845q2795r3426
$$ 3555115 2721465 2178943 1780965 1403948 1109450 912442 778416 698571 615776 522350
6602E22350m1493J7146P8162J12592J08944N7411j30310k14771j44870j00647
$$ 522350 480857 498003 576165 688757 797701 855112 724802 510031 365161 264514
6592B64514p7997l7267l4650j2296j0707K011j1483p91O486M373K609K1060R513
$$ 264514 186517 149250 114600 102304 91597 93608 82125 81334 87820 92193 94802 115862 125375
6579A25375k8387J1097J993jl0096j077J0151J0601Q914j9698k0949P524J6582
$$ 125375 96988 108085 110078 110077 79981 78904 89055 99656 108570 88872 67923 75447 92029
6566I2029R069j5768k8098k7159m281J5884r970r687J4261k48k3745j2599k5885
$$ 92029 101098 85330 57232 30073 25792 41676 31706 22019 36280 36032 12287 -312 -26197
6553b6197K9674J6690j0760m712N171L850l0940J4288J1288j8923K897R454j5034
$$ -26197 3477 20167 9407 4695 9866 13716 -17224 -2936 8352 -10571 -7674 1780 -13254
6540a3254r261J7399N7265j043J87J1602l756j2737j714N067l838R259k1629r194
$$ -13254 -22515 -5116 52149 51106 51293 62895 59139 46402 44688 49755 45917 55176 33547 24353
6526B4353l429m235K9344j6931l3920R875q941p150M0086J477o009k362R561K8503
$$ 24353 20924 16689 46033 29102 -4818 5057 -3884 -11034 29052 30529 24520 22158 31719 60222
6512F0222l92k0023N545J0994r05j0663j1179Q738j8588j5883Q993q85J0356J8479
$$ 60222 59830 39807 45352 56346 55441 44778 33599 42337 23749 7866 16859 15974 26330 44809
6498D4809l707j0838k169k111j9220J3876L039k6328J0761J8145k4168k3111K343
$$ 44809 41102 30264 28095 25984 6764 20640 23679 -2649 8112 26257 2089 -21022 -18679
6485a8679k4787k0739M3193O516J6031L5549K742r849l6216j6403j8482L295K5220
$$ -18679 -43466 -64205 -21012 -14496 1535 37084 39826 29977 -6239 -22642 -41124 -37829 -12609
6472a2609L746j588L2545J790j3566r138J172o698j997J6722p252j902M524Q370
$$ -12609 -8863 -10451 22094 23884 10318 1180 2352 -4346 -6343 10379 3127 1225 5749 14119
6458A4119O733K7083P534j54j3292k5024J1316L014j6671j0157j7453l698K0905
$$ 14119 20852 47935 55469 55315 42023 16999 28315 31329 14658 4501 -12952 -16650 4255
6445D255K0192M281l6776j9714K0329K5518J9452J264j0345k029J396k3624l1324
$$ 4255 24447 28728 -8048 -27762 -7433 18085 37537 38801 28456 26427 27823 4199 -27125
6432b7125k2610j3215r155R915J6342J0996L340K1897K4286J7450M733J7973J2617
$$ -27125 -49735 -62950 -72105 -62190 -45848 -34852 -31512 -9615 14671 32121 36854 54827 67444
6419F7444m614L766J1293p684j6059O029k2316m8108j7706K8482p208k2267k5940
$$ 67444 62830 66596 77889 70205 54146 60175 37859 -10249 -27955 527 -6681 -28948 -54888
6406e4888O009j1194k68J9495J814J4389k6421R856M0597K412l450j2363j9892
$$ -54888 -48879 -60073 -60341 -40846 -39032 -24643 -51064 -41208 -611 1801 -1649 -14012 -33904
6393c3904j0065L939R179J0547J3200Q02j6111n272K074P159m301L625L4019j692
$$ -33904 -43969 -40030 -30851 -20304 -7104 -6302 -22413 -27685 -25611 -18452 -22753 -19128 14891 13199
6379A3199o379l4114l0509l193J4396Q105j271K0016m124k9190J4834J9779Q581
$$ 13199 6820 -27294 -57803 -60996 -46600 -38495 -39766 -19750 -23874 -53064 -38230 -18451 -9870
6366i870K4948m102j08j4326k0530q641j6948K1001P478K321j6082J8892L6192
$$ -9870 15078 10976 10868 -3458 -23988 -32629 -49577 -28576 -21098 -18777 -34859 -15967 20225
6353B0225m717k9080r040J5002j1837Q13K1658K4111j9746j8611m606Q868j363
$$ 20225 15508 -13572 -22612 -7610 -19447 -18634 3024 27135 7389 -11222 -15828 -6960 -8323
6340h323q083l4859K8307J2526n945j1168J1325O102k432j0046N817j0704K57
$$ -8323 -16406 -51265 -22958 -10432 -16377 -27545 -16220 -10118 -12550 -22596 -16779 -27483 -27226
6327b7226K0520P909r627l704Q826j1240k2877o046K6373M876n930r494r176J067
$$ -27226 -6706 1203 -8424 -12128 -3302 -14542 -37419 -43465 -17092 -12216 -18146 -27640 -36816 -35749
6313c5749Q125J2218J157L455r865p624K2157M304j2642J5788K3693k794n7836
$$ -35749 -27624 -15406 -14249 -10794 -20659 -28283 -6126 -1822 -14464 1324 25017 22223 -35613
6300c5613N761K8540K7684o855j4129K1583K3746j9603j7912J9426k0311k2396
$$ -35613 -29852 -1312 26372 19517 5388 26971 50717 31114 13202 32628 12317 -10079
6288a0079O484K3986N075l015k3271l8941M404p182k5916N2380L8427j9070k4980
$$ -10079 -3595 20391 25466 22451 -820 -39761 -35357 -42539 -68455 -16075 22352 3282 -21698
6275b1698r396J593R382j8750J7702P630q215p778L050J7090R950o257K780M7976
$$ -21698 -31094 -29501 -20119 -38869 -21167 -13537 -21752 -29530 -26480 -9390 560 -5697 -2917 45059
6261D5059J2911j7742k991M915j3140O090Q486q264k3678n167Q657j2455j9345
$$ 45059 57970 40228 37237 42152 29012 35102 43588 35324 11646 6479 15136 2681 -16664
6248a6664j7713k576M1009J8599K5590K2310N216q756o411m388j1397n139m140
$$ -16664 -34377 -36953 4056 22655 48245 70555 75771 67015 60604 56216 44819 39680 35540
6235C5540J085k5844k3133j202j0353j4464L4217J5411M380p72k3552j9655K500
$$ 35540 36625 10781 -12352 -13554 -23907 -38371 -4154 11257 15637 14865 -8687 -28342 -25842
6222b5842M751L776J1590P194l0979k4280O897L4844k124j3450k0421K1962L0228
$$ -25842 -21091 -17315 -5725 1469 -29510 -53790 -46893 -12049 -14173 -27623 -48044 -26082 4146
6209D146J5665Q191j7968k1136j4042K5501L0859o223p614m597P619k69j519j2985
$$ 4146 19811 28002 10034 -11102 -25144 357 31216 24993 17379 12782 20401 20132 18613 5628
6195E628q671j3877q905L1501j1391j5189K4157L2170R291J638J8137J400l0164
$$ 5628 -3043 -16920 -25825 5676 -5715 -20904 3253 35423 44714 46352 64489 65889 35725
6182C5725k1075j586k7645n560J2997M121P601Q619K0592M48l0235l5715O528
$$ 35725 14650 13064 -14581 -20141 -7144 -3023 4578 13197 33789 34237 4002 -31713 -25185
6169b5185K1548J6774k5284J0093L3074L607l0166l4922p065L8618P883N064j8639
$$ -25185 -3637 13137 -12147 -2054 31020 34627 4461 -30461 -37526 1092 8975 14039 -4600
6156d600j4681k5n254j8775K382J5557J0006L404L019j5518q39L1267J8174J2777
$$ -4600 -19281 -19306 -24560 -43335 -40953 -25396 -15390 -11986 -8967 -24485 -25324 5943 24117 36894
6142C6894m0442J071m135n0487L76M1424K0138J4895j9103R8L1183O473j5873
$$ 36894 -3548 -2477 -6612 -57099 -56723 -15299 4839 19734 631 729 31912 38385 22512
6129B2512j3843P459M912m564o032k4042l148m173K1200p923m926N210n209l547
$$ 22512 8669 16128 21040 16476 10444 -13598 -16746 -20919 281 -7642 -12568 -7358 -12567 -16114
6115a6114l2311m50K4750P188Q379L1380k578J0034r915k2675J275j2787l2828
$$ -16114 -48425 -48875 -24125 -16937 -8558 22822 20244 30278 20363 -2312 -1037 -13824 -46652
6102d6652j4203R585K0616K4307j6201k4322M688K8562k584m112l1112m076K0124
$$ -46652 -60855 -51270 -30654 -6347 -22548 -46870 -42182 -13620 -16204 -20316 -51428 -55504 -35380
6089c5380J1682j212k075n269j4374L558j0390J9777k97J6111k2686k2637K4025
$$ -35380 -23698 -24910 -26985 -32254 -46628 -43070 -53460 -33683 -33980 -17869 -40555 -63192 -39167
6076c9167j5038j2606K4237K9168J3110j496j0026J8173O997O78j3155r000P525
$$ -39167 -54205 -66811 -42574 -13406 -296 -1792 -11818 6355 13352 14030 875 -8125 -600
6063f00N825Q149k859J210M365M821J1472j9699j2245o750k4368J1449J2466l416
$$ -600 5225 13374 10515 11725 16090 20911 32383 12684 439 -6311 -30679 -19230 -6764 -10180
6049a0180J4213J3767K141j8257k538O499k876o099k5755j8958L2483k36K1479
$$ -10180 4033 17800 19941 1684 -854 5645 2769 -3330 -29085 -48043 -15560 -15796 5683
6036E683N244k0731K2151J2951j5088j4090k0025j8121L109r458P832P282K6914
$$ 5683 10927 -9804 12347 25298 10210 -3880 -23905 -42026 -38917 -48375 -40543 -33261 -6347
6023f347J3511L292J3216L1986m368p567j1382j4169J5585p764l8189j9308L666
$$ -6347 7164 10456 23672 55658 51290 43723 32341 18172 33757 25993 -12196 -31504 -27838
6010b7838M187K7489r045j0949J7913J3849O433j4853J8921K5990N12j5455k1457
$$ -27838 -23651 3838 -5207 -16156 1757 15606 22039 7186 26107 52097 52609 37154 15697
5997A5697j3276j0320K0961P34j6123l5599o918k6237K4086L1667P000L0566J0125
$$ 15697 2421 -7899 13062 13796 -2327 -37926 -44844 -71081 -46995 -15328 -8328 22238 32363
5984C2363k2264m9247j9777K7507K8040j0637k0407J7478n690L092O945k0767
$$ 32363 10099 -39148 -58925 -31418 -3378 -14015 -34422 -16944 -22634 -19542 -12597 -33364
5972c3364j3989k404J7053L0607p190j4925R048R255K0932J8617k0732R250J1374
$$ -33364 -47353 -49757 -32704 -2097 -9287 -24212 -15164 -5909 15023 33640 12908 22158 33532
5959C3532J0522o757k3725l0647J4322J8361p514m0155K266J4934j5060n845q038
$$ 33532 44054 37297 13572 -17075 -2753 15608 8094 -32061 -29795 -14861 -29921 -35766 -43804
5946d3804m360O686j1042N237J8603O049n45k5k710K8130K1791p19j6789l1387
$$ -43804 -48164 -41478 -52520 -47283 -28680 -22631 -23176 -23201 -25911 2219 24010 23291 6502 -24885
5932b4885J0472J691K2531J0387k2919k1201m651J4197j0206P821J6066J8833
$$ -24885 -14413 -12722 9809 20196 -2723 -23924 -28575 -14378 -24584 -16763 -697 18136
5920A8136l2020k4996j991K2022K967j9435q764J3540K2034Q182j0112k18M546
$$ 18136 -13884 -38880 -40871 -18849 -15882 -35317 -44081 -30541 -8507 -325 -10437 -10655 -6109
5907f109l0297l290K2113K1333L0200p149j2263j321l530k3289N384R037j370
$$ -6109 -36406 -39696 -17583 3750 33950 26801 14538 13217 9687 -13602 -8218 819 -551
5894e51N812m656M962k1319l088P710J6784l414j8736j0448j6362q878R831J4719
$$ -551 5261 605 5567 -15752 -18840 -11130 5654 2240 -16496 -26944 -43306 -52184 -42353 -27634
5880b7634O512J1817J0339p861p059J4617J0747j9460j1484N873O580j634o666
$$ -27634 -21122 -9305 1034 -6827 -13886 731 11478 -7982 -19466 -13593 -7013 -8647 -15313
5867a5313o691K4930J639k894j6228j5811J8808J4265R157K0487k8214j3240k6683
$$ -15313 -22004 2926 4565 1671 -14557 -30368 -11560 2705 11862 32349 4135 -9105 -35788
5854c5788j0957K1579J1599J3604P329J9152k9972J223j0927p800M789o949j6397
$$ -35788 -46745 -25166 -13567 37 7366 26518 -3454 -2231 -13158 -20958 -16169 -23118 -39515
5841c9515J8387L2325N4478j7173j3176l246j1923j9828k6958L267M2745M414
$$ -39515 -21128 11197 65675 48502 35326 32080 20157 329 -26629 -23362 19383 23797
5829B3797o768K9639r531k2791j6238J7679J1037j8366j7056j3880J9449J8116
$$ 23797 17029 46668 37137 14346 -1892 15787 26824 8458 -8598 -22478 -3029 15087
5817A5087j9130j8288o877J5536K5803K7614j627L2779k2380q945J6357J0945
$$ 15087 -4043 -22331 -29208 -13672 12131 39745 38118 70897 48517 39572 55929 66874
5805F6874k411k2825j1309l8965k3799J0995J5056p746P836l246J8008L3420Q888
$$ 66874 64463 41638 30329 -8636 -32435 -21440 -6384 -14130 -6294 -9540 8468 41888 50776
5792E0776m7705p943J1544o4j4141m0590r933L9100O141j9744K739K0265L064
$$ 50776 3071 -4872 6672 6608 -7533 -48123 -58056 -18956 -12815 -32559 -29820 -9555 -6491
5779f491J0802K2000n730L053K6383j4956o8151k1845R549K3017P132j6179p463
$$ -6491 4311 26311 20581 23634 50017 35061 -33090 -54935 -45386 -22369 -15237 -31416 -38879
5766c8879j9052M02L0024K4612K501l302J0107J8247k8474m1051j6252L2555Q392
$$ -38879 -57931 -57529 -27505 -2893 -392 -3694 6413 24660 -3814 -44865 -61117 -28562 -20170
5753b0170j5339J7525k655K2692J6312j4432j7050k0284j126j6886o557p635p117
$$ -20170 -35509 -17984 -20639 2053 18365 3933 -13117 -33401 -34527 -51413 -57970 -65605 -72722
5740g2722k492N8789J2975p061o669j5143O577J0688J4134m649j8804K1083J5684
$$ -72722 -75214 -16425 -3450 -10511 -17180 -32323 -25746 -15058 -924 -5573 -24377 -3294 12390
5727A2390k37j6069k1406K236J2438o589r151j5369J0077P263J6115j6565O274
$$ 12390 12153 -3916 -25322 -23086 -10648 -17237 -26388 -41757 -31680 -24417 -8302 -24867 -18593
5714a8593m4329j7918K5477N0672j0819l0104r411L4760R030K5000J1979k3278
$$ -18593 -62922 -80840 -55363 -4691 -15510 -45614 -55025 -20265 -11235 13765 25744 2466
5702B466q676p352p756R18K71P413j6795J978p194R050N416l043j962K0254Q212
$$ 2466 -6210 -13562 -21318 -20400 -20129 -12716 -29511 -27533 -34727 -25677 -20261 -23304 -25266 -5012 3200
5687C200K1185n98m256j5402j293P79N454n926q741K2829Q655k2683k7517O955
$$ 3200 24385 23787 19531 4129 2836 3615 9069 3143 -5598 17231 25886 3203 -24314 -17359
5673a7359J1650j48j548J2071L2660j8293k4794j4214j0868K0968J8632r803k0508
$$ -17359 -5709 -5857 -7405 4666 37326 19033 -5761 -19975 -30843 -9875 8757 -1046 -21554
5660b1554K1154L1609P844k6190l5403K8914K5864R757J891k7458k8593k4122
$$ -21554 -400 31209 39053 12863 -22540 6374 32238 41995 43886 16428 -12165 -36287
5648c6287L0025L0581j7381l225J2383L1806J4383J0471j9028j7199j531n1832
$$ -36287 -6262 24319 6938 3713 16096 47902 62285 72756 53728 36529 34998 -16834
5636a6834j2623R485J6630j5242r648J2135O300k5548j6976j1190J5328K7027
$$ -16834 -29457 -19972 -3342 -18584 -28232 -16097 -9797 -35345 -52321 -63511 -48183 -21156
5624b1156J0832j3455m598K7849j5901j8766k344o384N54J5181K442j8408J0117
$$ -21156 -10324 -23779 -28377 -528 -16429 -35195 -37539 -43923 -43369 -28188 -25746 -44154 -34037
5611c4037K4073K1365k8459k5292L6931J4363K072k5154k3879J278J6212J3224
$$ -34037 -9964 11401 -17058 -42350 -5419 8944 11016 -14138 -38017 -36739 -20527 -7303
5599g303o495j9701j3763K9320J0791M144j922k7408j889K2925R964k019K7617
$$ -7303 -13798 -33499 -47262 -17942 -7151 -3007 -4929 -32337 -34226 -11301 -1337 -3356 24261
5586B4261K733N560k0964o44r698O742j2954j8967J0618J3198l4157L316K0773
$$ 24261 26994 32554 11590 10946 1248 7990 -4964 -23931 -13313 -115 -34272 -30956 -10183
5573a0183L1101J3641l1445r440J517l4101q147J1133J7141j825j6451J9857M651
$$ -10183 20918 34559 3114 -6326 -4809 -38910 -47057 -35924 -18783 -20608 -37059 -17202 -12551
5560a2551p048n613J3446K812N045m605p397j1628Q659L663q274O316M0226N120
$$ -12551 -19599 -25212 -11766 -8954 -3909 -8514 -15911 -27539 -18880 -15217 -23491 -17175 23051 28171
5546B8171k0256k4533j3943J5357K3277J4576r215k8260r133k513J7965J9616
$$ 28171 7915 -16618 -30561 -15204 8073 22649 13434 -14826 -23959 -26472 -8507 11109
5534A1109J2580K4321j2743R426l122l6657k072K0591Q278j7533k7272Q410o252
$$ 11109 23689 48010 35267 44693 41571 4914 2842 23433 31711 14178 -13094 -4684 -10936
5521a0936k316J9647J1860M234J7766J9372j5906k3606j1832K911l844j8156K9835
$$ -10936 -13252 6395 18255 22489 40255 59627 43721 20115 8283 11194 7350 -10806 19029
5508A9029L6775L983k5438l4118j2664j2283o880J6338R391k2691K956j1914J0343
$$ 19029 55804 59787 34349 231 -12433 -24716 -31596 -15258 -5867 -28558 -25602 -37516 -27173
5495b7173J9093k6805j7655j1455L388M7439q310n178J9230K0908p458j4166k2116
$$ -27173 -8080 -34885 -52540 -63995 -60607 -13168 -21478 -26656 -7426 13482 6024 -8142 -30258
5482c0258j4765K8612M414K3159j9622L506m555k0102L4263N906k3145K079M31
$$ -30258 -45023 -16411 -11997 11162 -8460 -4954 -9509 -29611 4652 10558 -12587 -10508 -10077
5469a0077L5326o391l6229j0348K0702O330k815O568O148k1001L487O681j0557
$$ -10077 25249 18858 -17371 -27719 -7017 -687 -3502 3066 9214 -11787 -8300 -1619 -12176
5456a2176j485P142Q113P39J0882n580j5740K5162L336k4938k4299j7039l505
$$ -12176 -13661 -6519 1594 2333 13215 7635 -8105 17057 20393 -4545 -28844 -45883 -49388
5443d9388P981k254J5206m895J2280r062P838O516J5586J3006R42r728O341L77
$$ -49388 -41407 -43661 -28455 -33350 -21070 -30132 -22294 -15778 -192 12814 13756 4028 10369 10746
5429A0746Q934o004l606n328o268J2939o574j0265J703K4560p151l7419j1276
$$ 10746 19680 13676 10070 4742 -1526 11413 4839 -5426 -3723 20837 13686 -23733 -35009
5416c5009M352J7706N625M881r04l8227p632L2530q955k316K7261J8424j2620
$$ -35009 -30657 -12951 -7326 -2445 -3349 -41576 -49208 -16678 -25633 -27949 -688 17736 5116
5403E116j0320L527k0032j0097J7986L828r047k5277K041p108J2569J8146M729
$$ 5116 -5204 -1677 -21709 -31806 -13820 -9992 -19039 -44316 -42275 -49383 -36814 -18668 -13939
5390a3939k3796j5011j6798J943K4099Q697K712N402J9674K3976m910k6642m811
$$ -13939 -37735 -52746 -69544 -67601 -43502 -34805 -32093 -26691 -7017 16959 12049 -14593 -19404
5377a9404O28M562J1529j2389j6942L4091L2575j6468k798K5956J7822j3317k3837
$$ -19404 -18776 -14214 -2685 -15074 -32016 2075 34650 18182 15384 41340 59162 45845 22008
5364B2008l7927Q695K0172P853N351Q237p498k6659l3398N260K8333K1704k1793
$$ 22008 -15919 -7224 12948 20801 26152 34389 26891 232 -33166 -27906 427 22131 338
5351C38K511J454j4002m881n013M109j9675Q718J4029K8406M317n642J542k374
$$ 338 2849 4303 -9699 -14580 -19593 -15484 -35159 -26441 -12412 15994 20311 14669 16211 13837
5337A3837k8756k3217j1360N881J7794J5467L428J3292n238L163j053J1976j6946
$$ 13837 -14919 -38136 -49496 -43615 -25821 -10354 -6926 6366 1128 4291 3238 15214 -1732
5324a732j6180k2735j629K4271Q574P523L546p469j7844p772n615J2159K8385
$$ -1732 -17912 -40647 -42276 -18005 -9431 -1908 1638 -5831 -23675 -31447 -37062 -24903 3482
5311C482m075j296K54J4843j4639M316k2981j6090K8761J6781r28k481q030J0504
$$ 3482 -593 -1889 -1635 13208 -1431 2885 -20096 -36186 -7425 9356 8428 5947 -2083 8421
5297H421K4723k470l5063Q10L056J8659K6073J1967o886k3411j9380l5748j3372
$$ 8421 33144 30674 -4389 -3579 -523 18136 44209 56176 49290 25879 6499 -29249 -42621
5284d2621K3054J9086l430k996L4582Q282k520r791m107r469q054Q176j0608j2386
$$ -42621 -19567 -481 -3911 -6907 27675 35957 33437 23646 19539 10070 2016 10192 -416 -12802
5270a2802p697R873L3237K1603m672m2264k548j1728l3077K1778K0892q781q401
$$ -12802 -20499 -10626 22611 44214 39542 -2722 -5270 -16998 -50075 -28297 -7405 -16186 -24587
5257b4587J1233J0219P649L9762m955k9246J141q897j8344k2099Q124L9137K0671
$$ -24587 -13354 -3135 4514 44276 39321 10075 11216 2319 -16025 -38124 -30000 9137 29808
5244B9808k0278L357J404j854K1741l7940j2628m876j9108J52J9388L719j552
$$ 29808 9530 12887 14291 12437 34178 -3762 -16390 -21266 -40374 -40222 -20834 -17115 -18667
5231a8667J6525q805j6986r232O417N752m582L1014J7227L050k625j7545j5353
$$ -18667 -2142 -10947 -27933 -37165 -30748 -24996 -29578 1436 18663 21713 19088 1543 -13810
5218a3810J8111O224l286j794j6755k5445J8097M9445J9552n481m417K1804k2979
$$ -13810 4301 10525 7239 5445 -11310 -36755 -18658 30787 50339 44858 40441 62245 39266
5205C9266j3814K149j7844J2264M426r461j5145n349K052k7506K376q057P816
$$ 39266 25452 27601 9757 22021 26447 16986 1841 -3508 -1456 -28962 -26586 -34643 -26827
5192b6827K2068R899K498j958M683N903m7322k1459k0843q633J7786J6098K5534
$$ -26827 -4759 5140 7638 5680 10363 16266 -31056 -52515 -73358 -81991 -64205 -48107 -22573
5179b2573J3946m777K1989M450j6030j3069L721Q288k3158l188K0157P174O362
$$ -22573 -8627 -13404 8585 13035 -2995 -16064 -12343 -4055 -27213 -30401 -10244 -3070 3292
5166C292M5141L245l3214j7074o949L5462l721l1284K4482J9141l2580j7339J6679
$$ 3292 48433 51678 18464 1390 -5559 29903 26182 -5102 19380 38521 5941 -11398 5281
5153E281l083J8344M001j920J6287J881j8230l0890k7440J058r295j983K2272
$$ 5281 2198 20542 24543 22623 38910 40791 22561 -8329 -35769 -34711 -44006 -45989 -23717
5140b3717j6783p320l766k63K3437J5236j3047l207K7575J0456k6048l1203j1688
$$ -23717 -40500 -47820 -51586 -51849 -28412 -13176 -26223 -29430 -1855 8601 -17447 -48650 -60338
5127f0338J6477L1226M6014j429r182q294k6539O229R663j2959q880l668P867
$$ -60338 -43861 -12635 33379 31950 22768 14474 -12065 -5836 3827 -9132 -18012 -21680 -13813
5114a3813J9842m849m252n358m252K3065j9875j3096K1713P565r16n586L286J939
$$ -13813 6029 1180 -3072 -8430 -12682 10383 -9492 -22588 -875 6690 5774 188 3474 5413
5100E413j623j137l183J2328n364P790j1407p46j2509P23J7300L338J1252J9193
$$ 5413 3790 2653 -530 11798 6434 14224 2817 2071 -10438 -9715 7585 10923 22175 41368
5086D1368k2200j4484o168J5046K2438p841n982r304o72J4500j6539n5408N794
$$ 41368 19168 4684 -1484 13562 36000 28159 22177 12873 12201 26701 10162 -45246 -39452
5073c9452L9268J4584k5653J628j5224J0585P683j0365l531q38K5811j800j5836
$$ -39452 -184 14400 -11253 -9625 -24849 -14264 -6581 -16946 -20477 -21315 4496 2696 -13140
5060a3140j0548j9956l3478l374M2892M518k808p567N131K3852k648j3190J5904
$$ -13140 -23688 -43644 -77122 -80496 -37604 -33086 -35894 -43461 -38330 -14478 -17126 -30316 -14412
5047a4412N153k4569r104L8776J1355j576j2574k648P215J6732n712J3753j1434
$$ -14412 -9259 -33828 -42932 -4156 7199 5623 -6951 -9599 -2384 14348 8636 22389 10955
5034A0955K9862j8421j1270J0491j4736o772J798J5443J6801q812m1937L191l660
$$ 10955 40817 22396 11126 21617 6881 109 1907 17350 34151 25339 -16598 -13407 -17067
5021a7067L1117K9490l4340p750k1517k3877J4564J8243M545q771j1103K3988
$$ -17067 14050 43540 9200 1450 -20067 -43944 -29380 -11137 -6592 -15363 -26466 -2478
5009b478k978n310J7082J568j9574L400L5241r075j2981M446O881K0726J7706
$$ -2478 -5456 -10766 6316 7884 -11690 -8290 26951 17876 4895 9341 16222 36948 54654
4996E4654j8516k9744j0592Q78m709j60J3257K1925l3090j6391O414R272J2041
$$ 54654 36138 6394 -4198 -3320 -8029 -8189 5068 26993 -6097 -22488 -16074 -6802 5239
4983E239o723k1934l4142r115Q591O6576J3279J5959J154r900l3112m084r932
$$ 5239 -1484 -23418 -57560 -66675 -58084 8492 21771 37730 38884 28984 -4128 -8212 -18144
4970a8144J0452o810J738m599r228R753j1050r727n75j9176j4932J2810P513q249
$$ -18144 -7692 -14502 -12764 -17363 -26591 -16838 -27888 -37615 -38190 -57366 -72298 -59488 -51975 -60224
4956f0224j541L4135Pk3230L0937K6803N52J40R259M417k2131l716j3014j090
$$ -60224 -61765 -27630 -27623 -50853 -19916 6887 7439 7579 16838 21255 -876 -4592 -17606 -18696
4942a8696P381J6293J806K122J9390j5742m1588m1713K632J2654L0250J9773J2476
$$ -18696 -11315 4978 6784 8906 28296 12554 -29034 -70747 -68115 -55461 -25211 -5438 7038
4929G038O261k1274m6237O332N7475j1128l5839J8518R293J0143M964j116J2919
$$ 7038 13299 -7975 -54212 -47880 9595 -1533 -37372 -18854 -9561 582 5546 4430 17349
4916A7349J6996m025k0307l820l707j3211j625m842k440j9886k0213O692P430
$$ 17349 34345 30320 10013 6193 2486 -10725 -12350 -17192 -19632 -39518 -59731 -53039 -45609
4903d5609J7143L4506J2621j8489K3996j5138j2013k8096P09R125J6960J7711
$$ -45609 -28466 6040 18661 172 24168 9030 -2983 -31079 -30370 -21245 -4285 13426
4891A3426r963k776q077m358L715k9250j5674J3655j1336o57Q677M0980K9952
$$ 13426 3463 687 -7390 -11748 -8033 -37283 -52957 -39302 -50638 -51295 -42618 -1638 28314
4878B8314P013k1762m13L209L879N223o291K829J5120k7142k9715n526K7748J7299
$$ 28314 35327 13565 13152 16361 20240 25463 19172 22001 37121 9979 -19736 -25262 2486 19785
4864A9785N063J4681j8632j0702r39k46k869K991l081J5133k4992j5894Q323j4890
$$ 19785 24848 39529 20897 10195 9256 9010 6141 9132 6051 21184 -3808 -19702 -11379 -26269
4850b6269R364R61k457O936Q12Q624m620K777K5252k9947o583j337M991r352J5325
$$ -26269 -16905 -15944 -18401 -11465 -10653 -2029 -6649 -3872 21380 -8567 -15150 -16487 -11496 -20848 -5523
4835e523P7881J667k9305l3527j2328K2978Q677j9964k1345p634K5008K2995j6546
$$ -5523 72358 74025 44720 11193 -1135 21843 30520 10556 -10789 -18423 6585 29580 13034
4822A3034k430n89K4960J2121k5850m8427j6512J4626P784j1502k4348K8712K4041
$$ 13034 10604 10015 34975 47096 21246 -27181 -43693 -29067 -21283 -32785 -57133 -28421 -4380
4809d380p957J3420J5548k874o707q034j3679l1890K0489l087J662P897J615J3876
$$ -4380 -12337 1083 16631 13757 7050 -984 -14663 -46553 -26064 -29151 -27489 -19592 -17977 -4101
4795d101Q411L827l684o57r145j1181K8499L267j4467n522j6627o716q883l930
$$ -4101 4310 8137 4453 3796 -5349 -16530 11969 15236 769 -4753 -21380 -28096 -36979 -40909
4781d0909L307R640K7128J7683j4320k1276J642K9379Q252j3003M899o708k3099
$$ -40909 -37602 -27962 -834 16849 2529 -18747 -17105 12274 20526 7523 12422 5714 -17385
4768a7385J3707L7467J4574J11j8100k8555l651j8256n265J0556j0164J5445K1690
$$ -17385 -3678 33789 48363 48474 30374 1819 -1832 -20088 -25353 -14797 -24961 -9516 12174
4755A2174L2534O74l7927l5100l9057j6116K8955K573K604K5693K2587k8896M613
$$ 12174 44708 45382 7455 -27645 -66702 -82818 -53863 -51290 -48686 -22993 -406 -29302 -24689
4742b4689L2580K570q658K41q613k803n083K2944K6815k5256j2346L4262L500
$$ -24689 7891 10461 1803 2044 -6569 -9372 -14455 8489 35304 10048 -2298 31964 35464
4729C5464l2517j1766J7794p668j8030j0018J3733J8493k314k827o971j0444j1299
$$ 35464 2947 -8819 8975 1307 -16723 -26741 -13008 5485 3171 344 -6627 -17071 -28370
4716b8370J4497O530j2432k7467j3136L6582L0128k0165j9618k6159R151K0622
$$ -28370 -13873 -7343 -19775 -47242 -60378 -23796 6332 -13833 -33451 -59610 -50459 -29837
4704b9837O750N606l4602j6575J372J5910M1106l306l8928J9314j5910m762j1856
$$ -29837 -23087 -17481 -52083 -68658 -67286 -51376 -10270 -13576 -52504 -33190 -49100 -53862 -65718
4691f5718M075K0537J818k347J0994J2093j2075N718K8710P847j7995L249Q227
$$ -65718 -61643 -41106 -39288 -41635 -30641 -18548 -30623 -24905 3805 11652 -6343 -3094 5133
4678E133k3683J875J0565N003J2841j2396j9028K3106M382J458q862k9751j5548
$$ 5133 -18550 -16675 -6110 -1107 11734 -662 -19690 3416 7798 9256 394 -29357 -44905
4665d4905N207J1823J5075k0233J2937q347J5815J4413P458m0888J6957K6337
$$ -44905 -39698 -27875 -12800 -33033 -20096 -28443 -12628 1785 9243 -31645 -14688 11649
4653A1649K860K225L79j0290k3796J7217l0259k0906J5323J9324q410q02r854
$$ 11649 14509 16734 17113 6823 -16973 244 -30015 -50921 -35598 -16274 -24684 -25486 -35340
4640c5340J3417Q161J0247J0484k8048k897K7629K8809j5416j4955k0927k504
$$ -35340 -21923 -13762 -3515 6969 -21079 -23976 3653 32462 17046 2091 -18836 -21340
4628b1340j333j2682J5092Q682P143j0411k5793j4590P492K0890j665N187N864
$$ -21340 -22673 -35355 -20263 -11581 -4438 -14849 -40642 -55232 -47740 -26850 -28515 -23328 -17464
4615a7464j6406l0655Q170J5726L4180L147j8961K2164K9243j1896L03q581l304
$$ -17464 -33870 -64525 -56355 -40629 -6449 -3302 -22263 -99 29144 17248 17551 8970 5666
4602E666K1026K0355r179k6886R117J8883J5309J444o073n1963l9577J6974O920
$$ 5666 26692 47047 37868 10982 20099 38982 54291 55735 49662 -2301 -41878 -24904 -17984
4589a7984L672j6807K0441M4141r926J1681l430l4770K010R652o188J591L1917
$$ -17984 -14312 -31119 -10678 33463 23537 35218 31788 -2982 -972 8680 2492 4083 36000
4576C6000K5253m6482j2941J5019N495n5820k7236J0280J0443J8789j1848J7882
$$ 36000 61253 14771 1830 16849 22344 -33476 -60712 -50432 -39989 -21200 -33048 -15166
4564a5166K8133O032O791L933j2676k1526j8159K159N0269K3910k1615j880j4401
$$ -15166 12967 18999 25790 29723 17047 -4479 -22638 -20479 29790 53700 32085 30205 15804
4551A5804l3313j7899Q17r644K7016K6502K1119K142j5970j5871k3305j6891o010
$$ 15804 -17509 -35408 -34591 -44235 -17219 9283 30402 32544 16574 703 -22602 -39493 -45503
4538d5503R453R079q737J2757k1824K061K9512M0100K678k5982j9477J6010M079
$$ -45503 -36050 -26971 -35708 -22951 -44775 -42714 -13202 26898 29576 3594 -15883 127 4206
4525D206j0946j852J1221j718J8583l910k5190j7268K0462q028O441L1444j7207
$$ 4206 -6740 -8592 2629 911 19494 15584 -9606 -26874 -6412 -14440 -7999 23445 6238
4512F238o882r756J9766J9272p232l891l9499m189K6472L1346K0387L3819l1970
$$ 6238 -644 -10400 9366 28638 21406 17515 -21984 -26173 299 31645 52032 85851 53881
4499E3881j7216q990R248k774l9808q500M135L3842j4503q896N532p319p761J3031
$$ 53881 36665 27675 36923 34149 -5659 -14159 -10024 23818 9315 419 5951 -1368 -9129 3902
4485C902J9643n935L596j2709j0631N409J8691J3291J1033j1653R275J3023l4648
$$ 3902 23545 17610 21206 8497 -2134 3275 21966 35257 46290 34637 43912 56935 22287
4472B2287M176j2204o849j8072j2218J0849K3855J0262Q38m9982j8260J9114M7049
$$ 22287 26463 14259 7410 -10662 -22880 -12031 11824 22086 22924 -27058 -45318 -26204 20845
4459B0845j3281k8405J1380L525o228P182l195j2195K0701M753k713N695J7362
$$ 20845 7564 -20841 -9461 -5936 -12164 -4982 -8177 -20372 329 5082 2369 8064 25426
4446B5426j9991J5786K5204j8577j8727k0284K9417J3225l2180k8394J231K1012
$$ 25426 5435 21221 46425 27848 9121 -11163 18254 31479 -701 -29095 -27864 -6852
4434f852L3727J3666K3583j2767k5369J0709j670j6615k7571m4421o012n840J0679
$$ -6852 26875 40541 64124 51357 25988 36697 35027 18412 -9159 -53580 -59592 -65432 -54753
4421e4753J8717M5183K5269K2410l2217r18J9382J3438j0501k9952j2534r959
$$ -54753 -36036 9147 34416 56826 24609 23691 43073 56511 46010 16058 3524 -6435
4409f435p547k3400k4724K6840K8235j4997o495l220K5576j073K7649J2016l573
$$ -6435 -13982 -37382 -62106 -35266 -7031 -22028 -28523 -31743 -6167 -7240 20409 32425 28852
4396B8852j5591j9598n357j3007m807k633K0663j5414l0335J6866M4403K5555
$$ 28852 13261 -6337 -11694 -24701 -29508 -32141 -11478 -26892 -57227 -40361 4042 29597
4384B9597l3615m8053J2984J1479K3236j5009k8437p524J4864K7262o994j9102
$$ 29597 -4018 -52071 -39087 -27608 -4372 -19381 -47818 -55342 -40478 -13216 -20210 -39312
4372c9312K8081Q245m804O386K6774J6613M104m3355k8784l1021j0016O349K5421
$$ -39312 -11231 -2986 -7790 -1404 25370 41983 46087 2732 -26052 -57073 -67089 -60740 -35319
4359c5319R855J8643J3939j3669N280M986r161K1832N37r334M071j6951j0359
$$ -35319 -25464 -6821 7118 -6551 -1271 3715 -5446 16386 16923 7589 11660 -5291 -15650
4346a5650K253J9772k407p911N623K782O803j1096k913J4770M082p697Q66O31
$$ -15650 -13397 6375 3968 -3943 1680 4462 11265 169 -2744 12026 16108 8411 9277 9908
4332I908O140r687L7747L6061m2467m1910P982J0653j733J764P916N135k3645
$$ 9908 16048 6361 44108 80169 37702 -4208 3774 14427 12694 14458 22374 27509 3864
4319C864l8161j7891L2951K8590O832J0737L622j0110j0321j6737J781L824o93
$$ 3864 -34297 -52188 -19237 9353 16185 26922 30544 20434 10113 -6624 -4843 -1019 -1712
4306a712o257j6404J0902K6420J3149O743j821l8995l2418N765K5454K7953J0781
$$ -1712 -7969 -24373 -13471 12949 26098 32841 31020 -7975 -40393 -34628 -9174 18779 29560
4293B9560l523n933j3588l5940k0138j3654K1385K9973j3058j6501J2016K3972
$$ 29560 26037 20104 6516 -29424 -49562 -63216 -41831 -11858 -24916 -41417 -29401 -5429
4281e429K9480K432k6089j8274j2384J9063K2200j6996j794N211p202l2265r431
$$ -5429 24051 26483 394 -17880 -30264 -11201 10999 -5997 -7791 -2580 -9782 -42047 -51478
4268e1478M315L5563o430l6843J0410J0839J6054m14l090J0492l841J7291j7968
$$ -51478 -47163 -11600 -18030 -54873 -44463 -33624 -17570 -17984 -21074 -10582 -14423 2868 -15100
4255a5100J4761o059p511j5031k221j5823K3060J332k6929J2785J0318n81K1031
$$ -15100 -339 -6398 -13909 -28940 -31161 -46984 -23924 -22592 -49521 -36736 -26418 -26999 -5968
4242e968J713J8141L753k3373q625O322O302J3830n837k6009n038L409j5714K932
$$ -5968 -4255 13886 17639 -5734 -14359 -8037 -1735 12095 6258 -19751 -24789 -21380 -37094 -34162
$$ [...]
##END NTUPLES=NMR SPECTRUM
##END=
