##TITLE=Analysis number 325218
Compound Code cc 50522
Book Reference 521/3
Project Code adrs
Chemist Name evam
##JCAMPDX= 6.0         $$ Bruker NMR JCAMP-DX V2.0
##DATA TYPE= NMR SPECTRUM
##DATA CLASS= NTUPLES
##ORIGIN= Bruker BioSpin GmbH
##OWNER= nmr
$$ XWIN-NMR		Version 3.5
$$ Thu Dec 14 14:27:42 2006 GMT Standard Time (UT+0h)  MAYBRIDGE\nmr@NMR_250MHZ
##.OBSERVE FREQUENCY= 250.131544655141
##.OBSERVE NUCLEUS= ^1H
##.ACQUISITION MODE= SIMULTANEOUS (DQD)
##.ACQUISITION SCHEME= undefined
##.AVERAGES= 16
##.DIGITISER RES= 18
##SPECTROMETER/DATA SYSTEM= dpx250
##.PULSE SEQUENCE= zg30
##.SOLVENT NAME= CDCl3
##.SHIFT REFERENCE= (INTERNAL, CDCl3, 0, 16.5232)
##AUDIT TRAIL= $$ (NUMBER, WHEN, WHO, WHERE, WHAT)
$$ ##TITLE= Audit trail, XWIN-NMR		Version 3.5
$$ ##JCAMPDX= 5.01
$$ ##ORIGIN= Bruker BioSpin GmbH
$$ ##OWNER= nmr
$$ C:\u/data/dgb/nmr/ADRS/1100/pdata/1/auditp.txt
$$ ##AUDIT TRAIL=  $$ (NUMBER, WHEN, WHO, WHERE, WHAT)
(   1,<2006-12-14 14:27:21.09 +000>,<MAYBRIDGE\nmr>,<NMR_250MHZ>,
      <created by zg, POWCHK disabled, PULCHK disabled
       configuration hash MD5:
       49 4B E0 1D 92 C2 6B 37 9F E6 65 BC 52 41 86 1D
       data hash MD5: 64K
       DE 92 5A BF 18 CC 60 C2 4E E8 B9 1F AF 69 74 B0>)
(   2,<2006-12-14 14:27:33.59 +000>,<MAYBRIDGE\nmr>,<NMR_250MHZ>,
      <Start of raw data processing
       ef LB = 0.3 FT_mod = 6 PKNL = 1 SI = 32K 
       data hash MD5: 32K
       B1 60 4E 44 24 56 53 C5 AD 0B 49 22 66 D8 C3 9E>)
(   3,<2006-12-14 14:27:35.18 +000>,<MAYBRIDGE\nmr>,<NMR_250MHZ>,
      <apk 
       data hash MD5: 32K
       3B 85 0B CA 30 F0 51 77 E2 E1 D1 46 94 23 E1 41>)
(   4,<2006-12-14 14:27:35.96 +000>,<MAYBRIDGE\nmr>,<NMR_250MHZ>,
      <abs ABSG = 5 
       data hash MD5: 32K
       B6 23 62 EA 7C 0C BF DD 96 DA A2 76 A7 04 06 20>)
$$ ##END=
$$ 
$$ hash MD5
$$ 4A 2F 22 0C C1 17 39 9E A2 F1 2D E3 D9 0A 5C 4B
##$RELAX= 
##$RELAX= 
##$RELAX= 
##$RELAX= 
##$RELAX= 
##$RELAX= 
##$RELAX= 
$$ Bruker specific parameters
$$ --------------------------
##$DU= <C:\u>
##$EXPNO= 1100
##$NAME= <ADRS>
##$PROCNO= 1
##$TYPE= <nmr>
##$USER= <dgb>
##$AMP= (0..31)
100 100 100 100 100 100 100 100 100 100 100 100 100 100 100 100 100 100 
100 100 100 100 100 100 100 100 100 100 100 100 100 100 
##$AQSEQ= 0
##$AQ_mod= 3
##$AUNM= <au_zg>
##$AUTOPOS= <20 >
##$BF1= 250.13
##$BF2= 250.13
##$BF3= 250.13
##$BF4= 250.13
##$BF5= 500.13
##$BF6= 500.13
##$BF7= 500.13
##$BF8= 500.13
##$BYTORDA= 1
##$CFDGTYP= 0
##$CFRGTYP= 5
##$CHEMSTR= <none>
##$CNST= (0..31)
1 1 145 1 1 1 1 1 1 1 1 1 1 1 1 1 1 1 1 1 1 1 1 1 1 1 1 1 1 1 1 1 
##$CPDPRG= <>
##$CPDPRG1= <>
##$CPDPRG2= <>
##$CPDPRG3= <>
##$CPDPRG4= <mlev>
##$CPDPRG5= <mlev>
##$CPDPRG6= <mlev>
##$CPDPRG7= <mlev>
##$CPDPRG8= <mlev>
##$CPDPRGB= <>
##$CPDPRGT= <>
##$D= (0..31)
0 1 0 0 0 0 0 0 0 0.06 0 0 0 0 0 0 0.0002 0 0 0 0 0 0 0 0 0 0 0 0 0 0 
0 
##$DATE= 1166106440
##$DBL= (0..7)
120 120 120 120 120 120 120 120 
##$DBP= (0..7)
150 150 150 150 150 150 150 150 
##$DBP07= 0
##$DBPNAM0= <>
##$DBPNAM1= <>
$$ [...]
##$SUBNAM7= <"">
##$SUBNAM8= <"">
##$SUBNAM9= <"">
##$SW= 20.6930455092707
##$SWIBOX= (0..15)
0 0 3 0 0 0 0 0 0 0 0 0 0 0 0 0 
##$SW_h= 5175.983436853
##$TD= 65536
##$TD0= 1
##$TE= 295.16
##$TE2= 300
##$TE3= 300
##$TEG= 300
##$TL= (0..7)
0 120 120 120 120 120 120 120 
##$TP= (0..7)
150 150 150 150 150 150 150 150 
##$TP07= 0
##$TPNAME0= <>
##$TPNAME1= <>
##$TPNAME2= <>
##$TPNAME3= <>
##$TPNAME4= <>
##$TPNAME5= <>
##$TPNAME6= <>
##$TPNAME7= <>
##$TPOAL= (0..7)
0.5 0.5 0.5 0.5 0.5 0.5 0.5 0.5 
##$TPOFFS= (0..7)
0 0 0 0 0 0 0 0 
##$TUNHIN= 0
##$TUNHOUT= 0
##$TUNXOUT= 0
##$USERA1= <user>
##$USERA2= <user>
##$USERA3= <user>
##$USERA4= <user>
##$USERA5= <user>
##$V9= 5
##$VALIST= <valist>
##$VCLIST= <CCCCCCCCCCCCCCC>
##$VD= 0
##$VDLIST= <DDDDDDDDDDDDDDD>
##$VPLIST= <PPPPPPPPPPPPPPP>
##$VTLIST= <TTTTTTTTTTTTTTT>
##$WBST= 1024
##$WBSW= 4
##$XGAIN= (0..3)
0 0 0 0 
##$XL= 0
##$YL= 0
##$YMAX_a= 293934
##$YMIN_a= -304289
##$ZGOPTNS= <>
##$ZL1= 120
##$ZL2= 120
##$ZL3= 120
##$ZL4= 120
##$ABSF1= 16.5232
##$ABSF2= -4.169973
##$ABSG= 5
##$ABSL= 3
##$ALPHA= 0
##$AQORDER= 0
##$ASSFAC= 0
##$ASSFACI= 0
##$ASSFACX= 0
##$ASSWID= 0
##$AUNMP= <proc_1d>
##$AZFE= 0.1
##$AZFW= 0.1
##$BCFW= 0
##$BC_mod= 0
##$BYTORDP= 0
##$COROFFS= 0
##$CY= 12.5
##$DATMOD= 1
##$DC= 0
##$DFILT= <>
##$DTYPP= 0
##$F1P= 14.0000005364418
##$F2P= -0.99999901652339
##$FCOR= 0.5
##$FTSIZE= 32768
##$FT_mod= 6
##$GAMMA= 0
##$GB= 0
##$INTBC= 1
##$INTSCL= 1
##$ISEN= 128
##$LB= 0.3
##$LEV0= 0
##$LPBIN= 0
##$MAXI= 10000
##$MC2= 0
##$MEAN= 0
##$ME_mod= 0
##$MI= 0
##$NCOEF= 0
##$NC_proc= -3
##$NLEV= 6
##$NOISF1= 0
##$NOISF2= 0
##$NSP= 0
##$NTH_PI= 0
##$NZP= 0
##$OFFSET= 16.5232
##$PC= 1
##$PHC0= 224.6441
##$PHC1= 6.153176
##$PH_mod= 1
##$PKNL= yes
##$PPARMOD= 0
##$PSCAL= 4
##$PSIGN= 0
##$REVERSE= no
##$SF= 250.129999698007
##$SI= 32768
##$SIGF1= 0
##$SIGF2= 0
##$SINO= 400
##$SIOLD= 32768
##$SREGLST= <1H.CDCl3>
##$SSB= 0
##$STSI= 32768
##$STSR= 0
##$SW_p= 5175.98343685301
##$SYMM= 0
##$S_DEV= 0
##$TDeff= 65536
##$TDoff= 0
##$TI= <Analysis number 999999
Compound Code 99
Book Reference 9
Project Code 9>
##$TILT= no
##$TM1= 0
##$TM2= 0
##$TOPLEV= 0
##$USERP1= <user>
##$USERP2= <user>
##$USERP3= <user>
##$USERP4= <user>
##$USERP5= <user>
##$WDW= 1
##$XDIM= 32768
##$YMAX_p= 368506152
##$YMIN_p= -169088
$$ End of Bruker specific parameters
$$ ---------------------------------
##NTUPLES= NMR SPECTRUM
##VAR_NAME=  FREQUENCY,     SPECTRUM/REAL,   SPECTRUM/IMAG
##SYMBOL=    X,             R,               I
##VAR_TYPE=  INDEPENDENT,   DEPENDENT,       DEPENDENT
##VAR_FORM=  AFFN,          ASDF,            ASDF
##VAR_DIM=   32768,         32768,           32768
##UNITS=     HZ,            ARBITRARY UNITS, ARBITRARY UNITS
##FACTOR=    0.157963299565203, 1,           1
##FIRST=     4132.94778124592, 0,            0
##LAST=      -1043.03565560709, 0,           0
##MIN=       -1043.03565560709, -169088,     0
##MAX=       4132.94778124592, 368506152,    0
$$ Real data points
##PAGE= N=1
##DATA TABLE= (X++(R..R)), XYDATA
$$ [...]
$$ plain form
18733 20927 -7894 -19610 -6749 1846 5647 14491 10140 -7725 -5270 13023 -2378 -15158 8884
18720 8884 8508 -2710 -9844 -29457 -5945 3218 -21587 -25388 -15385 6730 -8460 9295 14263
18707 14263 40662 27950 17205 11645 -5351 -21200 -21161 -14927 -26369 -20027 20551 26011 24726
18694 24726 -6544 -24396 -26778 -30996 12354 16118 -5288 -1546 7419 -10043 -38022 -44763 -60683
18681 -60683 -49939 -11865 25188 26885 12648 -6303 -41503 -44589 -36304 -50738 -51975 -51439 -24401
18668 -24401 -12220 -2442 -5877 26369 41644 27139 2318 18438 50292 15029 -10871 -15323
18656 -15323 -20236 -61034 -76571 -41101 19553 21000 19821 17142 10058 16113 9415 2149 -11952
18643 -11952 -19528 -6158 2254 4859 6272 15996 20437 28837 30354 -2535 -44175 -32033 6648
$$ packed form
18733B0927k8821j1716J2861Q595L801Q844m351j7865K455J8293j5401j2780K4042
18720H884l76j1218p134j9613K3512R163k4805l801J0003K2115j5190J7755M968
18707A4263K6399j2712j0745n560j6996j5849L9O234j1442O342M0578N460j285
18694B4726l1270j7852k382m218M3350L764k1406L742Q965j7462k7979o741j5920
18681f0683J0744L8074L7053J697j4237j8951l5200l086Q285j4434j237N36K7038
18668b4401J2181R778l435L2246J5275j4505k4821J6120L1854l5263k5900m452
18656a5323m913m0798j5537L5470O0654J447j179k679p084O055o698p266j4101
18643a1952p576J3370Q412K605J413R724M441Q400J517l2889m1640J2142L8681
$$ plain form
18630 6648 40927 26133 12196 -9484 -28270 -19405 -1315 27164 9314 -19671 -26089 -36277
18618 -36277 -68043 -87450 -52682 -28118 -38628 -15753 -1285 9735 -1903 -1601 5490 -4083
18606 -4083 8557 16017 957 8536 15147 -193 33633 35787 12873 -55813 -63352 -47200 -22747
18593 -22747 -30294 -31839 -24539 -20143 -14527 1470 -7486 2582 13345 44207 60308 44508 12476
18580 12476 -3744 11458 33837 33380 103 -9323 6768 10461 25747 50225 76101 51999
18568 51999 28448 50564 18802 -9485 -35765 -33466 -7276 6527 4745 -12652 -27385 -34174
18556 -34174 -47432 -17920 -10079 -13638 -2639 -4054 -2680 1470 -257 -18154 451 21999 36932
18543 36932 28718 15403 12769 13699 34926 32295 13494 6907 -11811 -14865 -1370 -7531 4452
$$ packed form
18630F648L4279j4794j3937k1680j8786Q865J8090K8479j7850k8985o418j0188
18618c6277l1766j9407L4768K4564j0510K2875J4468J1020j1638L02P091r573
18606d083J2640P460j5060P579O611j5340L3826K154k2914o8686p539J6152K4453
18593b2747p547j545P300M396N616J5997q956J0068J0763L0862J6101j5800l2032
18580A2476j6220J5202K2379m57l3277r426J6091L693J5286K4478K5876k4102
18568E1999k3551K2116l1762k8287k6280K299K6190J3803j782j7397j4733o789
18556c4174j3258K9512P841l559J0999j415J374M150j727j7897J8605K1548J4933
18543C6932q214j3315k634R30K1227k631j8801o587j8718l054J3495o161J1983
$$ plain form
18530 4452 9920 19514 29815 62380 71354 79810 99138 137388 154093 141079 127207 133751 172479
18517 172479 221731 261658 275056 266075 224954 192183 151036 141344 137118 131084 90898 77869
18505 77869 71927 45748 27231 9836 6682 -5277 13590 -621 6486 23633 40411 57198
18493 57198 38173 40387 6565 -23449 -29461 -5628 1418 -11510 -5387 2497 7221 28977 48288
18480 48288 68755 27283 -10898 -14862 -23624 -21060 -25645 -28249 -30793 -37262 -37318 -19476 3907 2981
18466 2981 638 -17343 -17573 -7739 -20404 -23189 -22622 -23675 2368 -10884 -30010 -21081 -14956 -21394
18452 -21394 -13551 -27278 24426 33009 11886 3725 -8712 -46659 -24651 -22858 -25755 -31008 -17859
18439 -17859 9084 -1308 -24793 -31149 -22693 -7506 17423 32383 31208 40532 23539 6093
$$ packed form
18530D452N468R594J0301L2565Q974Q456J9328L8250J6705j3014j3872O544L8728
18517A72479M9252L9927J3398q981m1121l2771m1147r692m226o034m0186j3029
18505G7869n942k6179j8517j7395l154j1959J8867j4211P107J7147J6778J6787
18493E7198j9025K214l3822l0014o012K3833P046j2928O123P884M724K1756J9311
18480D8288K0467m1472l8181l964q762K564m585k604k544o469n6J7842K3383r26
18466B981k343j7981k30R834j2665k785N67j053K6043j3252j9126Q929O125o438
18452b1394P843j3727N1704Q583k1123q161j2437l7947K2008J793k897n253J3149
18439a7859K6943j0392k3485o356Q456J5187K4929J4960j175R324j6993j7446
$$ plain form
18427 6093 1170 -15715 -16650 -4088 10867 8296 -8319 -37838 -32968 -52759 -41242 -21474 -17702
18414 -17702 -4810 -6520 -16083 1438 6971 2312 18432 27325 12258 -2375 14937 37267 19583
18401 19583 220 -23039 -6636 44774 71170 64067 120073 159528 168587 177783 137036 99598
18389 99598 108770 145482 146847 174166 172931 127964 90811 44771 24147 20123 7754 10909 22851
18376 22851 16287 24547 56403 53442 10799 29138 19041 -6156 -3707 12101 10879 26748 57640
18363 57640 96349 148881 169778 135483 112625 82047 75058 85586 115714 149187 157248 154783
18351 154783 126647 106829 75298 60018 38185 13069 -2202 668 6128 -4770 -22978 -37233
18339 -37233 -46626 -58169 -46504 -32997 -29393 9755 63035 41353 54994 73931 58340 41828
$$ packed form
18427F093m923j6885r35J2562J4955k571j6615k9519M870j9791J1517J9768L772
18414a7702J2892j710r563J7521N533m659J6120Q893j5067j4633J7312K2330j7684
18401A9583j9363k3259J6403N1410K6396p103N6006L9455R059R196m0747l7438
18389I9598R172L6712J365K7319j235m4967l7153m6040k0624m024j2369L155J1942
18376B2851o564Q260L1856k961m2643J8339j0097k5197K449J5808j222J5869L0892
18363E7640L8709N2532K0897l4295k2858l0578o989J0528L0128L3473Q061k465
18351A54783k8136j9818l1531j5280k1833k5116j5271K870N460j0898j8208j4255
18339c7233r393j1543J1665J3507L604L9148N3280k1682J3641J8937j5591j6512
$$ plain form
18327 41828 34368 59192 27635 11500 -4387 -22366 13984 29228 18325 7430 51978 61356
18315 61356 15033 6163 28100 31481 48171 62255 77674 84019 66546 57176 81164 115218
18303 115218 94656 30682 -12422 -7366 -2195 -10388 6167 19603 6972 10563 39307 45452
18291 45452 27660 10628 2195 13300 54608 58568 33203 -707 -14477 -10946 -33048 -38995
18279 -38995 -4442 7357 1674 -5012 19557 17562 26689 12938 -9493 6360 10466 -17572 -19306
18266 -19306 -14736 -8150 8561 26283 70988 82769 42560 37273 44358 51223 64213 60533 80209
18253 80209 38265 12968 -8139 7773 45564 59962 79508 80734 59787 61242 32193 28710
18241 28710 31594 33603 68751 84675 86172 105972 105794 70789 34580 12110 -13179 -21368 -24510
$$ packed form
18327D1828p460K4824l1557j6135j5887j7979L6350J5244j0903j0895M4548R378
18315F1356m6323q870K1937L381J6690J4084J5419O345j7473r370K3988L4054
18303A15218k0562o3974m3104N056N171q193J6555J3436j2631L591K8744O145
18291D5452j7792j7032q433J1105M1308L960k5365l3910j3770L531k2102n947
18279c8995L4553J1799n683o686K4569j995R127j3751k2431J5853M106k8038j734
18266a9306M570O586J6711J7722M4705J1781m0209n287P085O865J2990l680J9676
18253H0209m1944k5297k1107J5912L7791J4398J9546J226k0947J455k9049l483
18241B8710K884K009L5148J5924J497J9800j78l5005l6209k2470k5289q189l142
$$ plain form
18228 -24510 -15192 -62 -1916 -15701 -6114 13898 14793 2754 -40035 -65509 -17233 -22748 -40111
18215 -40111 -15508 -1805 -17732 -15711 28795 40171 42910 46162 28965 14721 17415 46516
18203 46516 71510 63567 47233 33350 7473 49276 63135 45516 34193 13444 15014 29467
18191 29467 40376 35748 7599 3959 14340 29397 16145 12026 -6515 -8171 658 22299 48498
18178 48498 58766 43398 16168 -22842 -9666 17337 -497 -9254 11996 27401 37615 51047
18166 51047 47555 19597 5996 25778 46550 47430 68530 92460 83620 63493 39343 16321
18154 16321 43503 88195 107763 103911 111981 128039 123468 110512 83617 74380 100454 100081 110349
18141 110349 144242 132658 92440 111366 188738 258373 282098 285253 327757 344923 340445 389469
$$ packed form
18228b4510R318J5130j854j3785R587K0012Q95j2039m2789k5474M8276n515j7363
18215d0111K4603J3703j5927K021M4506J1376K739L252j7197j4244K694K9101
18203D6516K4994p943j6334j3883k5877M1803J3859j7619j1323k0749J570J4453
18191B9467J0909m628k8149l640J0381J5057j3252m119j8541j656Q829K1641K6199
18178D8498J0268j5368k7230l9010J3176K7003j7834q757K1250J5405J0214J3432
18166E1047l492k7958j3601J9782K0772Q80K1100K3930q840k0127k4150k3022
18154A6321K7182M4692J9568l852Q070J6058m571j2956k6895r237K6074l73J0268
18141A10349L3893j1584m0218J8926P7372O9635K3725L155M2504J7166m478M9024
$$ plain form
18129 389469 407384 404902 415383 445866 480541 525076 604484 682863 780072 905962 1098227
18118 1098227 1352189 1693447 2143057 2866734 4016245 5876414 9360692 16447915 30884248
18109 30884248 54250168 64605055 47398712 26935873 15478524 10003870 7104106
18102 7104106 5412697 4314549 3456821 2811684 2297280 1956043 1689693 1435453 1241352
18093 1241352 1097032 985177 869839 766313 686093 633335 570748 513680 478009 449794
18083 449794 390591 340074 312883 306111 321141 326296 302492 301336 297579 296418 273875 236336
18071 236336 223482 245723 237070 219890 199289 187734 153620 162639 180590 193237 188885 175449
18059 175449 165980 176081 181893 183125 162883 152101 162022 170159 197173 209983 205731 194695 212989
$$ packed form
18129C89469J7915k482J0481L0483L4675M4535P9408P8379R7209J25890J92265
18118A098227K53962L41258M49610P23677J149511J860169L484278P087223J4436333
18109C0884248K3365920J0354887j7206343k0462839j1457349n474654k899764
18102G104106j691409j098148q57728o45137n14404l41237k66350k54240j94101
18093A241352j44320j11855j15338j03526q0220n2758o2587n7068l5671k8215
18083D49794n9203n0517k7191o772J5030N155k3804j156l757j161k2543l7539
18071B36336j2854K2241q653j7180k0601j1555l4114R019J7951J2647m352j3436
18059A75449r469J0101N812J232k0242j0782R921Q137K7014J2810m252j1036J8294
$$ plain form
18046 212989 243569 234460 220117 212082 219044 214936 253381 284660 281079 304290 357260 340253
18034 340253 359365 383501 394941 422260 474242 522798 564888 612246 700598 819239 976858
18023 976858 1151159 1259066 1332247 1506407 1719422 1975943 2296398 2704318 3209444 3858000
18013 3858000 4827273 6448992 9245735 13853806 20463426 27373694 30989696 30281748
18005 30281748 28882239 30718433 36507671 43512221 48127990 49505557 47260864 41277979
17997 41277979 35050788 32499142 33975056 35862898 33470234 26647675 19174728 13568062
17989 13568062 9949338 7734248 6290014 5272235 4516239 3886517 3310188 2798107 2427074
17980 2427074 2152030 1959662 1783569 1582500 1373937 1193253 1053608 934040 842833 755171
$$ packed form
18046B12989L0580r109j4343q035O962m108L8445L1279l581K3211N2970j7007
18034C40253J9112K4136J1440K7319N1982M8556M2090M7358Q8352J18641J57619
18023I76858J74301J07907P3181J74160K13015K56521L20455M07920N05126O48556
18013C858000R69273J621719K796743M608071O609620O910268L616002p07948
18005C0281748j399509J836194N789238P004550M615769J377567k244693n982885
17997D1277979o227191k551646J475914J887842k392664o822559p472947n606666
17989A3568062l618724k215090j444234j017779p55996o29722n76329n12081l71033
17980B427074k75044j92368j76093k01069k08563j80684j39645j19568r1207q7662
$$ plain form
17970 755171 695966 681477 651517 598391 569924 549708 507416 496750 468551 437220 423712
17959 423712 374304 353854 327265 307402 309105 317066 266794 227106 234030 231446 188670 202898
17947 202898 203265 213864 219510 203831 194914 165459 163205 175080 167271 140082 152276 171924 163128
17934 163128 148263 123977 111988 108535 115810 113403 98181 98210 131781 171419 166682 140545 149174
17921 149174 136606 123799 100177 107920 122636 179495 177742 156079 146368 137161 130303 119308
17909 119308 114438 145479 160228 172825 172302 171531 165494 188954 210601 191503 170261 132758 140723
17896 140723 162362 189838 194319 162117 184991 212037 223599 230647 235116 244088 267540 293365
17884 293365 314121 326992 327607 342377 396604 494570 580889 689794 746891 769789 855439 976577
$$ packed form
17970G55171n9205j4489k9960n3126k8467k0216m2292j0666k8199l1331j3508
17959D23712m9408k0450k6589j9863J703P961n0272l9688O924k584m2776J4228
17947B02898L67J0599N646j5679q917k9455k254J1875p809k7189J2194J9648q796
17934A63128j4865k4286j1989l453P275k407j5222K9L3571L9638m737k6137Q629
17921A49174j2568j2807k3622P743J4716N6859j753k1663r711r207o858j0995
17909A19308m870L1041J4749J2597n23p71o037K3460K1647j9098k1242l7503P965
17896A40723K1639K7476M481l2202K2874K7046J1562P048M469Q972K3452K5825
17884B93365K0756J2871O15J4770N4227R7966Q6319J08905N7097K2898Q5650J21138
$$ plain form
17872 976577 1149971 1327436 1540439 1820910 2172524 2706571 3600945 5030216 7543284
17863 7543284 12069773 19662903 28785832 32447271 27643806 20433242 15708922 14261202
17855 14261202 15889993 20682852 27372103 30272209 25426136 17579237 11597324 8135317
17847 8135317 6151700 4924237 4128327 3581049 3173978 2912551 2812759 2810687 2817254 2822668
17837 2822668 2890594 3057619 3354297 3892485 4922474 6845291 10291492 16370690 24978256
17828 24978256 31131148 29004069 22124609 16505084 14050995 14576754 18211744 24485630
17820 24485630 29444141 27188712 19670168 12800017 8572057 6160532 4714003 3797943
17812 3797943 3132798 2624930 2248922 2003211 1817384 1634280 1452173 1268072 1138517
$$ packed form
17872I76577J73394J77465K13003K80471L51614N34047Q94374J429271K513068
17863G543284M526489P593130R122929L661439m803465p210564m724320j447720
17855A4261202J628791M792859O689251K900106m846073p846899n981913l462007
17847H135317j983617j227463p95910n47278m07071k61427r9792k072O567N414
17837B822668O7926J67025K96678N38188J029989J922817L446201O079198Q607566
17828B4978256O152892k127079o879460n619525k454089N25759L634990O273886
17820B4485630M958511k255429p518544o870151m227960k411525j446529r16060
17812C797943o65145n07868l76008k45711j85827j83104j82107j84101j29555
$$ plain form
17803 1138517 1037497 889469 764033 659475 537715 488393 460248 451681 407174 358003
17793 358003 329366 312036 324527 309401 306083 278655 261562 215440 183973 148352 152900 185754
17781 185754 200775 205230 192497 177681 180544 169105 173253 191404 172203 141330 97360 96595
17769 96595 117327 113427 87620 60403 67557 66548 86147 87153 81656 58690 76426 111758 127440
17756 127440 109745 68836 24541 33382 50893 82675 95467 82093 77920 89576 108007 65010
17744 65010 52785 57359 59150 80098 92957 82132 112071 131925 119433 69522 36144 43901
17732 43901 52999 31680 37082 43359 41071 48334 47526 49049 66348 69805 95710 77277 79914 83015
17718 83015 80186 69855 73008 60321 48483 31368 32952 40374 69749 85074 77349 48175 49735
$$ packed form
17803A138517j01020j48028j25436j04558j21760m9322k8145q567m4507m9171
17793C58003k8637j7330J2491j5126l318k7428j7093m6122l1467l5621M548L2854
17781A85754J5021M455j2733j4816K863j1439M148J8151j9201l0873m3970p65
17769I6595K0732l900k5807k7217P154j009J9599J006n497k2966J7736L5332J5682
17756A27440j7695m0909m4295Q841J7511L1782J2792j3374m173J1656J8431m2997
17744F5010j2225M574J791K0948J2859j0825K9939J9854j2492m9911l3378P757
17732D3901R098k1319N402O277k288P263q08J523J7299L457K5905j8433K637L101
17718H3015k829j0331L153j2687j1838j7115J584P422K9375J5325p725k9174J560
$$ plain form
17705 49735 47099 61570 55157 40991 5935 8522 -4729 -29197 6453 -7665 -8898 -2443 -38443
17692 -38443 -39518 -11319 -29118 -21504 -1512 10337 -30394 -12017 21446 6450 -15377 -7148
17680 -7148 7540 4655 -5735 -3181 -34671 -40957 -35021 -19508 2686 25696 33369 20874 12245
17667 12245 35568 64370 86023 69689 31038 2390 -11565 -4646 31083 53132 58561 50641
17655 50641 26070 8917 4123 19501 12895 16687 18879 7632 3941 20570 22706 30086 50804
17642 50804 35355 35397 28080 21524 46754 23872 22339 15139 14401 9633 9019 14838 -28828 -67205
17628 -67205 -60424 -14748 13090 35 27884 48069 12420 -24721 -33598 -26679 -27718 -28393 -25771
17615 -25771 -13729 -17332 -3486 26238 44555 27971 84 -7281 10920 -4462 -23499 -40360
$$ packed form
17705D9735k636J4471o413j4166l5056K587j3251k4468L5650j4118j233O455l6000
17692c8443j075K8199j7799P614J9992J1849m0731J8377L3463j4996k1827Q229
17680g148J4688k885j0390K554l1490o286N936J5513K2194K3010P673j2495q629
17667A2245K3323K8802K1653j6334l8651k8648j3955O919L5729K2049N429p920
17655E0641k4571j7153m794J5378o606L792K192j1247l691J6629K136P380K0718
17642E0804j5449M2p317o556K5230k2882j533p200p38m768o14N819m3666l8377
17628f7205O781M5676K7838j3055K7849K0185l5649l7141q877O919j039o75K622
17615b5771J2042l603J3846K9724J8317j6584k7887p365J8201j5382j9037j6861
$$ plain form
17603 -40360 -28294 -35834 -42106 -19459 -10645 -24741 -34835 -54084 -61160 -35944 -17704 -13902 -30760
17590 -30760 -42091 -45413 -55218 -84378 -57254 -48675 -51704 -53519 -63849 -39656 -6149 19417 24430
17577 24430 1945 -12180 -30966 -19491 -15317 -9932 19900 17295 3825 -13529 -35720 -67502
17565 -67502 -56011 -5035 28797 35655 59295 86095 82337 65344 55271 65427 36883 4076
17553 4076 12945 -1607 -7955 -20062 -44760 -42413 -23750 82 -9201 -12994 -3563 -18755 -9795
17540 -9795 -3793 -804 18545 31618 14274 -2228 -8951 -4143 -1198 653 -11780 1501 19412
17527 19412 12006 -8447 -33073 -27420 -29169 -55941 -64973 -55547 -37838 -15811 -2281 -5841 9678
17514 9678 1758 13603 6058 9735 7246 -1987 18486 52913 60609 38954 38626 20232 14605 2391
$$ packed form
17603d0360J2066p540o272K2647Q814j4096j0094j9249p076K5216J8240L802j6858
17590c0760j1331l322r805k9160K7124Q579l029j815j0330K4193L3507K5566N013
17577B4430k2485j4125j8786J1475M174N385K9832k605j3470j7354k2191l1782
17565f7502J1491N0976L3832O858K3640K6800l758j6993j0073J0156k8544l2807
17553D076Q869j4552o348j2107k4698K347J8663K3832r283l793R431j5192Q960
17540i795O002K989J9349J3073j7344j6502o723M808K945J851j2433J3281J7911
17527A9412p406k0453k4626N653j749k6772r032R426J7709K2027J3530l560J5519
17514I678p920J1845p545L677k489r233K0473L4427P696k1655l28j8394n627j2214
$$ plain form
17500 2391 -2586 6563 56914 73838 63166 71034 48491 39755 50763 51779 75682 93337 146275
17487 146275 181543 205936 211454 227208 228128 251999 297940 297913 291490 257940 196185 174128 183831
17474 183831 188768 189698 193240 133035 94026 66817 10285 -14616 -42336 -50349 -16502 -9114 8925
17461 8925 10492 23045 27003 34369 43627 21918 11652 22413 9925 45946 57553 47322 60195
17448 60195 48902 53500 53392 93505 148887 242950 339416 274750 177343 98168 50241 26117
17436 26117 5485 -15167 4104 17081 -250 -12997 -10117 -7696 11923 22472 38496 32229
17424 32229 -4731 -30924 -30094 -25965 -31447 -8479 1073 -1913 -21956 -6509 7151 -20154 -45654
17411 -45654 -48548 -38174 -15689 1259 -4661 -19833 -4951 -13135 -27605 -14540 -32323 -32877 -29545
$$ packed form
17500B391m977R149N0351J6924j0672P868k2543q736J1008J016K3903J7655N2938
17487A46275L5268K4393N518J5754R20K3871M5941k7o423l3550o1755k2057R703
17474A83831M937R30L542o0205l9009k7209n6532k4901k7720q013L3847P388J8039
17461H925J567J2553L958P366R258k1709j0266J0761j2488L6021J1607j0231J2873
17448F0195j1293M598j08M0113N5382R4063R6466o4666r7407p9175m7927k4124
17436B6117k0632k0652J9271J2977j7331j2747K880K421J9619J0549J6024o267
17424C2229l6960k6193Q30M129n482K2968R552k986k0043J5447J3660k7305k5500
17411d5654k894J0374K2485J6948n920j5172J4882q184j4470J3065j7783n54L332
$$ plain form
17398 -29545 -11686 6806 -13678 -12059 -28043 -55554 -63553 -45900 -27471 -34029 -41103 -70365
17386 -70365 -58808 -43889 -47788 -4887 14235 30069 40238 3648 -16623 9556 19322 15480
17374 15480 10010 -2328 -24819 -36372 -39082 -43317 -48012 -34231 -25321 -42283 -27686 2423 -18385
17361 -18385 -16695 -6399 -163 -4088 -24318 -39616 -68805 -13538 17354 23064 15575 902 24709
17348 24709 34070 42726 23904 25223 15851 3110 -1877 -30815 -20635 13379 44443 65063 59042
17335 59042 70056 67094 38038 30509 32183 48921 46825 66547 76573 67481 60280 57478 87317
17322 87317 125680 139575 159450 136376 77928 45460 73906 114552 139873 125050 121096 96712
17310 96712 80002 84954 64450 48794 39109 23409 15203 12643 23013 -3145 -38877 -36124 -27113
$$ packed form
17398b9545J7859J8492k0484J619j5984k7511p999J7653J8429o558p074k9262
17386g0365J1557J4919l899M2901J9122J5834J0169l6590k0271K6179R766l842
17374A5480n470j2338k2491j1553k710m235m695J3781Q910j6962J4597L0109k0808
17361a8385J690J0296O236l925k0230j5298k9189N5267L0892N710p489j4673K3807
17348B4709R361Q656j8822J319r372j2741m987k8938J0180L4014L1064K0620o021
17335E9042J1014k962k9056p529J674J6738k096J9722J0026r092p201k802K9839
17322H7317L8363J3895J9875k3074n8448l2468K8446M0646K5321j4823l954k4384
17310I6712j6710M952k0504j5656r685j5700q206k560J0370k6158l5732K753R011
$$ plain form
17297 -27113 -30822 -45012 11770 36566 33184 46303 80557 113775 136783 125628 133246 101217
17285 101217 66693 92865 101717 118558 148017 142369 126112 86391 60699 46158 11110 -30247
17273 -30247 -53166 -39159 -30967 6902 22762 20574 25762 16188 -25450 -39381 -23158 6758
17261 6758 16818 1716 -18724 -17792 -10765 -30069 -6311 22350 5204 -9431 -32153 -14988
17249 -14988 5274 21477 29415 29037 49171 54761 55366 35461 13600 -10125 -11517 7276 -9352
17236 -9352 8779 -8466 6682 6208 371 -8712 -11055 4400 1161 -8140 -17787 -21557 -24274 -31775
17222 -31775 1025 13905 -20204 -10916 -40582 -25566 -9825 -2167 27885 24396 -18695 -48931
17210 -48931 -17978 -10285 -8505 -5601 -1482 23720 34995 16802 7650 -1248 -281 1548 19724
$$ packed form
17297b7113l709j4190N6782K4796l382J3119L4254L3218K3008j1155P618l2029
17285A01217l4524K6172Q852J6841K9459n648j6257l9721k5692j4541l5048m1357
17273c0247k2919J4007Q192L7869J5860k188N188r574m1638j3931J6223K9916
17261F758J0060j5102k0440R32P027j9304K3758K8661j7146j4635k2722J7165
17249a4988K0262J6203P938l78K0134N590O05j9905k1861k3725j392J8793j6628
17236i352J8131j7245J5148m74n837r083k343J5455l239r301r647l770k717p501
17222c1775L2800J2880l4109R288k9666J5016J5741P658L0052l489m3091l0236
17210d8931L0953P693J780K904M119K5202J1275j8193r152q898R67J829J8176
$$ plain form
17197 19724 8368 26254 -5174 -6215 -240 6858 22666 14154 -12072 -24580 -7697 14363
17185 14363 38140 17966 -39441 -62603 -27767 -28759 -21251 -27739 -4352 39473 33775 27696 29043
17172 29043 45444 61146 32769 32199 34647 15352 5851 11921 25389 35206 20824 27492 12042
17159 12042 20468 27512 16773 -13428 -34686 -41749 -53122 -41282 -14331 -17040 -19222 -22712 -14019
17146 -14019 -4686 -9508 -25341 -35700 -37716 -49205 -69626 -58376 -61895 -51396 -37975 -31919 -38130
17133 -38130 -28439 -50646 -46942 -16587 9500 18587 6105 -404 7223 -11697 -38737 -39892 -28543
17120 -28543 -23286 2379 21700 11728 -1825 -12627 -30957 -6591 32704 16370 -13772 -10250
17108 -10250 -29065 -7414 -12949 -28328 -6854 -7555 -8131 40360 58480 53176 41642 17001 4205
$$ packed form
17197A9724j1356J7886l1428j041N975P098J5808q512k6226j2508J6883K2060
17185A4363K3777k0174n7407k3162L4836r92P508o488K3387M3825n698o079J347
17172B9043J6401J5702k8377n70K448j9295r501O070J3468R817j4382O668j5450
17159A2042Q426P044j0739l0201k1258p063j1373J1840K6951k709k182l490Q693
17146a4019R333m822j5833j0359k016j1489k0421J1250l519J0499J3421O056o211
17133c8130R691k2207L704L0355K6087R087j2482o509P627j8920k7040j155J1349
17120b8543N257K5665J9321r972j3553j0802j8330K4366L9295j6334l0142L522
17108a0250j8815K1651n535j5379K1474p01n76M8491J8120n304j1534k4641j2796
$$ plain form
17095 4205 9281 -6393 -16516 -27615 -16855 -32804 -21706 10018 31449 36059 1396 1219 11554
17082 11554 -19948 -52524 -52660 -39919 -7815 -8478 12461 17399 15615 25366 14038 -1121 -17322
17069 -17322 3611 13699 21874 25634 29037 15902 -13446 -9429 44145 13570 -2628 6869 2872
17056 2872 -8895 -24172 -36901 -34999 -20094 -3665 5216 -5124 -10107 -28745 -12753 2431
17044 2431 38200 50370 62597 46163 7639 -4197 3543 -1857 -13573 -19136 -11573 591 19330
17031 19330 25107 23583 10381 -15065 -18324 -28426 -48172 -51332 -41638 -20285 -23257 -10857 -11849
17018 -11849 -13577 6256 -3206 -26185 -31907 -1999 8169 -14819 -24469 -40712 -60701 -40071
17006 -40071 -37856 -32210 -31809 -34940 -68204 -35223 -15090 -26564 -28280 -29990 -31632 -20799 -32669
$$ packed form
17095D205N076j5674j0123j1099J0760j5949J1098L1724K1431M610l4663j77J0335
17082A1554l1502l2576j36J2741L2104o63K0939M938j784R751j1328j5159j6201
17069a7322K0933J0088Q175L760L403j3135k9348M017N3574l0575j6198R497l997
17056B872j1767j5277j2729J902J4905J6429Q881j0340m983j8638J5992J5184
17044B431L5769J2170J2227j6434l8524j1836P740n400j1716n563P563J2164J8739
17031A9330N777j524j3202k5446l259j0102j9746l160R694K1353k972J2400r92
17018a1849j728J9833r462k2979n722K9908J0168k2988r650j6243j9989K0630
17006d0071K215N646M01l131l3264L2981K0133j1474j716j710j642J0833j1870
$$ plain form
16993 -32669 -43392 -28409 -19376 -24800 -28314 -3431 -13135 -32946 -20095 -10850 -3457 -3017 11457
16980 11457 -4038 3265 26980 29056 9571 -18304 -14157 -4883 8976 -1070 -8 -17657 -34479
16967 -34479 -33409 -365 -625 -12486 -21929 -4613 -7558 -8154 -17592 -22509 -17099 -17290 8370 -1313
16953 -1313 -2828 29180 21700 -16208 -18185 -5012 -19955 -12945 -13819 -27798 -34661 -28741 -21966 -22382
16939 -22382 -24457 -20434 18635 16230 -5220 -50601 -53410 -41147 -9852 -3876 -11680 -33515 -36492
16926 -36492 -51825 -95401 -63313 -31461 -29849 -23099 -18700 -3201 13584 14429 -26474 -48490 -34056
16913 -34056 -31832 -9350 -985 15981 32157 25166 2138 26856 46065 22540 -9307 9026
16901 9026 25988 20236 79 -6430 -19200 -5072 20643 54056 51801 62371 25719 13106
$$ packed form
16993c2669j0723J4983R033n424l514K4883r704j9811J2851R245P393M40J4474
16980A1457j5495P303K3715K076j9485k7875M147R274J3859j0046J062j7649j6822
16967c4479J070L3044k60j1861r443J7316k945n96r438m917N410j91K5660r683
16953a313j515L2008p480l7908j977J3173j4943P010q74j3979o863N920O775m16
16939b2382k075M023L9069k405k1450m5381k809J2263L1295N976p804k1835k977
16926c6492j5333m3576L2088L1852J612O750M399J5499J6785Q45m0903k2016J4434
16913c4056K224K2482Q365J6966J6176o991k3028K4718J9209k3525l1847J8333
16901I026J6962n752k0157o509j2770J4128K5715L3413k255J0570l6652j2613
$$ plain form
16889 13106 17127 -5617 -23822 -25606 -16015 -14727 -43852 -33501 979 5073 9087 14251 25528
16876 25528 38161 55897 12746 -16019 -4781 -3359 -6054 -21643 -72143 -75979 -73746 -48848
16864 -48848 735 27633 -3503 -23127 -22405 -14872 -27205 -31595 -34454 -3745 38094 35472 30158
16851 30158 37125 20702 22198 38735 25468 291 -18960 -17573 -18929 -22535 8556 24578 26368
16838 26368 38772 49497 19248 18659 17485 -4484 1417 13986 1375 -14018 -38793 -22886
16826 -22886 -6470 -19697 -32475 -14433 -7998 5325 -13339 11564 55235 65086 54941 30049
16814 30049 25051 36762 52176 73500 89418 60820 31340 27773 30885 -5103 7574 43461
16802 43461 38021 41253 14716 -23425 -33610 -14177 -24966 -18770 -6980 -30536 -30559 -18314 -21948
$$ packed form
16889A3106M021k2744j8205j784R591J288k9125J0351L4480M094M014N164J1277
16876B5528J2633J7736m3151k8765J1238J422k695j5589n0500l836K233K4898
16864d8848M9583K6898l1136j9624P22P533j2333m390k859L0709M1839k622n314
16851C0158O967j6423J496J6537j3267k5177j9251J387j356l606L1091J6022J790
16838B6368J2404J0725l0249n89j174k1969N901J2569j2611j5393k4775J5907
16826b2886J6416j3227j2778J8042O435J3323j8664K4903M3671R851j0145k4892
16814C0049m998J1711J5414K1324J5918k8598k9480l567L112l5988J2677L5887
16802D3461n440L232k6537l8141j0185J9433j0789O196J1790k3556k3J2245l634
$$ plain form
16789 -21948 -18858 -876 -7870 -5450 -6238 -16264 -39780 -39489 -22604 12083 13835 23252 36179
16776 36179 13473 24979 24732 51642 46914 17812 -6756 -4727 -13587 -32093 -31784 -10067 -6628
16763 -6628 -24522 -27840 -47726 -42416 -29669 4780 26975 30840 10030 14361 1000 -14025 -26066
16750 -26066 -3477 -20596 -37551 -32466 -43837 -40017 -29845 -44735 -35672 -33446 -40520 -7550 3426
16737 3426 -6437 8510 -2332 -14082 -6857 11804 10121 12510 37167 54828 68833 46099 11583
16724 11583 -4164 -15064 2666 20360 41196 56072 36796 -4003 -18982 -4597 3403 -3498
16712 -3498 -8098 -16565 -32789 -31696 -15385 2205 -13229 -16201 -11644 -27185 -36458 -21922 -19888
16699 -19888 -4271 -8427 -13945 -45704 -79134 -87914 -66471 -38005 -38565 -31684 -2204 2277 24470
$$ packed form
16789b1948L090J7982o994K420p88j0026k3516K91J6885L4687J752R417J2927
16776C6179k2706J1506k47K6910m728k9102k4568K029q860j8506L09K1717L439
16763f628j7894l318j9886N310J2747L4449K2195L865k0810M331j3361j5025j2041
16750b6066K2589j7119j6955N085j1371L820J0172j4890R063K226p074L2970J0976
16737C426r863J4947j0842j1750P225J8661j683K389K4657J7661J4005k2734l4516
16724A1583j5747j0900J7730J7694K0836J4876j9276m0799j4979J4385Q000o901
16712c498m600q467j6224J093J6311J7590j5434k972M557j5541r273J4536K034
16699a9888J5617m156n518l1759l3430q780K1443K8466n60O881K9480M481K2193
$$ plain form
16686 24470 30460 15746 -21404 1140 14516 3237 22036 37939 22686 30969 24475 -3114
16674 -3114 -29268 -21420 3364 3153 -4400 9775 12340 15011 23039 5913 -3025 -8285 -4055 16076
16660 16076 50033 54024 13215 7273 -20250 -39503 -13244 4138 -70 -9578 -18411 -28390 -11958
16647 -11958 -1315 8273 -9639 -36989 -64666 -52057 -64845 -53163 -55704 -41229 -28660 -18737
16635 -18737 -16760 -15110 -25987 6028 17496 41488 38211 12686 15176 21573 13324 -6459 -42649
16622 -42649 -59137 -51110 -27866 -25111 -30406 -31671 -47410 -44383 -59972 -104130 -110507 -101982 -63155
16609 -63155 -56175 -43624 -19613 15776 11054 -23635 -42884 -26226 -30668 -43408 -41526 -34061 -19806
16596 -19806 -7429 15652 20104 29256 44247 51001 22930 3028 18791 11224 -22317 -16582 -4025
$$ packed form
16686B4470N990j4714l7150K2544J3376j1279J8799J5903j5253Q283o494k7589
16674c114k6154P848K4784k11p553J4175K565K671Q028j7126q938n260M230K0131
16660A6076L3957L991m0809n942k7523j9253K6259J7382m208r508q833r979J6432
16647a1958J0643R588j7912k7350k7677J2609j2788J1682k541J4475J2569R923
16635a8737J977J650j0877L2015J1468K3992l277k5525K490O397q249j9783l6190
16622d2649j6488Q027K3244K755n295j265j5739L027j5589m4158o377Q525L8827
16609f3155O980J2551K4011L5389m722l4689j9249J6658m442j2740J882P465J4255
16596a9806J2377K3081M452R152J4991O754k8071j9902J5763p567l3541N735J2557
$$ plain form
16583 -4025 9214 -5024 -38850 -5847 3480 11850 4688 -17616 -53040 -50511 -63017 -60656 -13152
16570 -13152 -10987 -1477 21075 14487 -4995 5172 4132 -9711 -14836 -22865 -16255 -12416 -342
16557 -342 -9196 -10571 -13522 -30889 -20892 -24854 -16694 -28273 -30910 -24053 -18936 -21852 -64036 -40762
16543 -40762 -17061 -18665 -8762 4092 -13434 -31961 -47145 -34966 -38478 -35413 -33220 -9884 -7549
16530 -7549 -1038 1440 3239 -897 -5141 -16005 -27004 -18015 -4685 9072 37883 48357 42245
16517 42245 11540 -33474 -54788 -36913 -2603 8847 8986 15408 13136 -43839 -59177 -50743 -56310
16504 -56310 -44376 -8977 5591 -12801 -15526 -31526 -62012 -52841 -16186 -18436 -18041 -13453 -22837
16491 -22837 -23193 -41689 -23181 1827 15390 14272 299 30901 17954 15211 7758 -18262 -28066
$$ packed form
16583d025J3239j4238l3826L3003R327Q370p162k2304l5424K529j2506K361M7504
16570a3152K165R510K2552o588j9482J0167j040j3843n125q029O610L839J2074
16557c42q854j375k951j7367R997l962Q160j1579k637O857N117k916m2184K3274
16543d0762K3701j604R903J2854j7526j8527j5184J2179l512L065K193K3336K335
16530g549O511K478J799m136m244j0864j0999Q989J3330J3757K8811J0474o112
16517D2245l0705m5014k1314J7875L4310J1450J39O422k272n6975j5338Q434n567
16504e6310J1934L5399J4568j8392k725j6000l0486R171L6655k250L95M588r384
16491b2837l56j8496J8508K5008J3563j118j3973L0602j2947k743p453k6020r804
$$ plain form
16478 -28066 -31957 -43400 -41780 -33302 -50362 -32888 -9591 22548 28401 26075 37959 51681 32237
16465 32237 15064 34640 47054 18129 16376 -3509 -33524 -17779 -30794 -10351 23151 54953
16453 54953 39902 9260 -1543 494 -11866 4351 25977 10171 -24316 -29427 -19410 7938
16441 7938 -8239 -58813 -58269 -19370 10618 -24129 -25683 7368 34023 29501 13716 3456 -1404
16428 -1404 -7914 -12055 -11954 -14213 17875 24545 23897 35349 43678 8667 9951 33349 32945 29430
16414 29430 46549 43275 40561 24852 9802 -8856 -11158 21703 45916 36839 5713 -17672
16402 -17672 -18519 -18395 -1772 17901 19010 6529 25120 36093 34513 18381 -4175 -14320 -3928
16389 -3928 -15823 -20122 25775 35822 20659 32758 48456 54667 48045 26817 14585 41385
$$ packed form
16478b8066l891j1443J620Q478j7060J7474K3297L2139N853k326J1884J3722j9444
16465C2237j7173J9576J2414k8925j753j9885l0015J5745j3015K0443L3502L1802
16453E4953j5051l0642j0803K037j2360J6217K1626j5806l4487n111J0017K7348
16441G938j6177n0574N44L8899K9988l4747j554L3051K6655m522j5785j0260m860
16428a404o510m141J01k259L2088O670o48J1452Q329l5011J284K3398m04l515
16414B9430J7119l274k714j5709j5050j8658k302L2861K4213r077l1126k3385
16402a7672q47J24J6623J9673J109j2481J8591J0973j580j6132k2556j0145J0392
16389c928j1895m299M5897J0047j5163J2099J5698O211o622k1228j2232K6800
$$ plain form
16377 41385 21136 40 -21519 -31837 -34502 -21555 -2729 -13799 -31402 -20710 -12820 13287
16365 13287 25670 21993 25624 10467 1289 16044 7788 20829 43891 6835 -7684 11609
16353 11609 38199 35443 6629 -6910 -2546 -31552 -30272 392 4064 36807 65054 55646 50116
16340 50116 16828 -19507 -9012 22355 19243 -12370 -25627 -6071 2859 -1504 -30840 -66610
16328 -66610 -35460 -7007 -3956 -16338 -4977 3075 24683 -2883 -25920 -23676 -17685 -51524
16316 -51524 -52852 -5531 12076 20873 -10804 -28119 -17861 -18222 -42181 -41887 -28080 -14133 -24792
16303 -24792 -16350 -9280 -26783 -1248 9086 14637 98 -11157 16895 -9402 -27858 -30446
16291 -30446 -32936 -18273 -30032 -7513 16477 29495 40421 -5626 -20780 -4822 3147 -1794
$$ packed form
16377D1385k0249k1096k1559j0318k665J2947J8826j1070j7603J0692P890K6107
16365A3287J2383l677L631j5157r178J4755q256J3041K3062l7056j4519J9293
16353A1609K6590k756k8814j3539M364k9006J280L0664L672L2743K8247r408n530
16340E0116l3288l6335J0495L1367l112l1613j3257J9556Q930m363k9336l5770
16328f6610L1150K8453L051j2382J1361Q052K1608k7566k3037K244N991l3839
16316e1524j328M7321J7607Q797l1677j7315J0258l61k3959K94J3807J3947j0659
16303b4792Q442P070j7503K5535J0334N551j4539j1255K8052k6297j8456k588
16291c0446k490J4663j1759K2519K3990J3018J0926m6047j5154J5958P969m941
$$ plain form
16279 -1794 -560 -1756 -28498 -48429 -34746 -59189 -37841 -22422 -16512 -2576 -15101 -46596
16267 -46596 -33904 -57449 -34351 1451 8867 -12224 -36507 -24697 -20058 495 3834 -4925
16255 -4925 -6552 -10261 -29656 -51938 -6752 2941 3611 -12902 1589 -5245 3660 -4098 -11626 -43018
16241 -43018 -53760 -15787 -27982 -36347 -23998 -15296 -39681 -22652 -6325 -4746 -238 -17144
16229 -17144 -22459 -34157 -33395 -15462 -40520 -19023 21839 27806 8659 9323 17581 34423 63485
16216 63485 28662 5031 -22833 -33238 -31907 -15766 -18371 -1315 -7091 -27740 -2756 -30678
16204 -30678 -32887 -50300 -35857 3561 -2014 -15953 -15067 -18641 -6603 -3559 6818 32812 47051
16191 47051 33060 35135 17855 7671 13604 22590 13292 22642 2797 -11391 -25683 -26952 -26751
$$ packed form
16279a794J234j196k6742j9931J3683k4443K1348J5419N910J3936j2525l1495
16267d6596J2692k3545K3098L5802P416k1091k4283J1810M639K0553L339q759
16255d925j627l709j9395k2282M5186R693O70j6513J4491o834Q905p758p528l1392
16241d3018j0742L7973j2195q365J2349Q702k4385J7029J6327J579M508j6906
16229a7144n315j1698P62J7933k5058K1497M0862N967j9147O64Q258J6842K9062
16216F3485l4823k3631k7864j0405J331J6141k605J7056n776k0649K4984k7922
16204c0678k209j7413J4443L9418n575j3939Q86l574J2038L044J0377K5994J4239
16191D7051j3991K075j7280j0184N933Q986r298R350j9845j4188j4292j269K01
$$ plain form
16178 -26751 -20122 -14584 3042 28542 50165 42883 1564 -2839 -22953 1779 15672 -5056
16166 -5056 9435 33179 23096 24179 36608 55026 19496 -6075 -28504 -15475 7309 4549
16154 4549 -14072 -21387 -54732 -63204 -54872 -42655 -39095 -48023 -46662 -43077 -10314 -32941 -49098
16141 -49098 -45775 -49516 -36810 -2753 15766 8090 13610 21712 -3789 9158 27680 7155 6047
16128 6047 -17580 -22356 -17077 -45843 -34058 -18260 -39332 -9738 23782 44667 46592 30362
16116 30362 51420 31051 -18375 -64589 -53347 -43487 -37960 -27754 790 9170 2703 -6994 -11338
16103 -11338 -26455 -46966 -39542 -22561 -26342 -15599 10111 5403 6417 -4812 -13033 2566 -9333
16090 -9333 -54205 -50015 -25174 25968 38752 24076 -1614 4227 7283 -9217 25303 66574
$$ packed form
16178b6751O629N538J7626K5500K1623p282m1319m403k0114K4732J3893k0728
16166e056J4491K3744j0083J083J2429J8418l5530k5571k2429J3029K2784k760
16154D549j8621p315l3345q472Q332J2217L560q928J361L585L2763k2627j6157
16141d9098L323l741J2706L4057J8519p676N520Q102k5501J2947J8522k0525j108
16128F047k3627m776N279k8766J1785J5798k1072K9594L3520K0885J925j6230
16116C0362K1058k0369m9426m6214J1242R860N527J0206K8544Q380o467r697m344
16103a1338j5117k0511P424J6981l781J0743K5710m708J014j1229q221J5599j1899
16090i333m4872M190K4841N1142J2784j4676k5690N841L056j6500L4520M1271
$$ plain form
16078 66574 89385 88820 64491 25998 27608 39442 325 -2316 19314 1724 -48666 -62997
16066 -62997 -45962 -23077 -13458 -22108 -36298 -36015 -60377 -25406 1822 -5440 3428 1615 -10367
16053 -10367 -11773 -1033 25636 8115 -17265 -16418 9070 8969 -7206 -22610 -18731 -13660 -21521
16040 -21521 14797 12682 9768 2354 -5463 4446 4126 6802 8103 -14482 -14782 -6729 -1438 -14227
16026 -14227 -38280 -32880 -21599 -18398 -9105 2021 -478 -14539 -6123 7015 -17409 -29944 2851
16013 2851 -3682 21092 5729 -27189 -25069 -9234 -19545 -36426 -2552 13693 15633 1684
16001 1684 -6313 5941 4450 -6666 6678 -2435 4016 17972 9809 12879 15744 -1242 -22793
15988 -22793 -12701 36652 49111 4743 -13140 -23910 -15288 -20111 -35880 -36224 -35575 -57180 -50899
$$ packed form
16078F6574K2811n65k4329l8493J610J1834l9117k641K1630j7590n0390j4331
16066f2997J7035K2885R619q650j4190K83k4362L4971K7228p262Q868j813j1982
16053a0367j406J0740K6669j7521k5380Q47K5488j01j6175j5404L879N071p861
16040b1521L6318k115k914p414p817R909l20K676J301k2585l00Q053N291j2789
16026a4227k4053N400J1281L201R293J1126k499j4061Q416J3138k4424j2535L2795
16013B851o533K4774j5363l2918K120J5835j0311j6881L3874J6245J940j3949
16001A684p997J2254j491j1116J3344r113O451J3956q163L070K865j6986k1551
15988b2793J0092M9353J2459m4368j7883j0770Q622m823j5769l44O49k1605O281
$$ plain form
15975 -50899 -42898 -44442 -22134 11483 4746 -59879 -60178 -10017 23212 50274 12720 7331 31768
15962 31768 32142 26642 31597 19587 6859 -8235 -21506 -18158 30794 29697 26372 29225 13682
15949 13682 13726 12344 24354 32506 28318 -237 6751 19158 2311 -22710 -18971 -9161 8528
15936 8528 10250 25692 37625 20435 10783 13017 17295 26157 24779 54 -4732 9022 24543
15923 24543 -15143 -31995 -30451 -36913 -31556 -56125 -47779 -4127 19821 12204 35366 9325 -23989
15910 -23989 -47233 -33743 -8016 23358 48979 19490 -30333 -44517 -39974 -3032 -26379 -55313
15898 -55313 -48864 -36102 -19010 -26513 2902 33943 7777 -9849 6096 6833 23432 16907 -7775
15885 -7775 -18649 -5008 27427 22048 -10356 -29269 -51710 -54567 -43800 -9857 12133 11077
$$ packed form
15975e0899Q001j544K2308L3617o737o4625k99N0161L3229K7062l7554n389K4437
15962C1768L74n500M955j2010j2728j5094j3271L348M8952j097l325K853j5543
15949A3682M4j382J2010Q152m188k8555O988J2407j6847k5021L739R810J7689
15936H528J722J5442J1933j7190r652K234M278Q862j378k4725m786J3754J5521
15923B4543l9686j6852J544o462N357k4569Q346M3652K3948p617K3162k6041l3314
15910b3989k3244J3490K5727L1374K5621k9489m9823j4184M543L6942k3347k8934
15898e5313O449J2762J7092p503K9415L1041k6166j7626J5945P37J6599o525k4682
15885g775j0874J3641L2435n379l2404j8913k2441k857J0767L3943K1990j056
$$ plain form
15873 11077 38821 30861 25757 22953 7548 -18718 -10792 -5734 16826 12558 5138 6115 1204 -10604
15859 -10604 -19980 -26760 -8532 4262 12937 20589 23176 36274 51305 57946 36706 65454 59672
15846 59672 37822 17430 9703 4266 14315 -9033 -11332 -5666 2220 6254 -13703 -5057 3994
15833 3994 -17052 -22800 -23925 -24364 -25908 -36573 -40875 -37169 -40141 -37755 -7936 19500 -7761 -45239
15819 -45239 -50812 -45719 -35877 -19534 -5654 20177 42770 38192 41752 35353 470 -19187 5888
15806 5888 -466 -9771 -5046 -14931 -21658 -24069 -22385 -36424 -9481 -11585 -20194 -33327 -28219 -1995
15792 -1995 23395 1312 1856 -10654 -15779 5865 32181 42725 -4244 -16628 -17748 -23371 -26905
15779 -26905 -30437 -43014 -29207 -2295 -4856 11449 28699 -12710 -28281 -22689 -17309 -9466 21983
$$ packed form
15873A1077K7744p960n104k804j5405k6266P926N058K2560m268p420R77m911j1808
15859a0604r376o780J8228J2794Q675P652K587J3098J5031O641k1240K8748n782
15846E9672k1850k0392p727n437J0049k3348k299N666P886M034j9957Q646R051
15833C994k1046n748j125m39j544j0665m302L706k972K386K9819K7436k7261l7478
15819d5239n573N093R842J6343J3880K5831K2593m578L560o399l4883j9657K5075
15806E888o354r305M725r885o727k411J684j4039K6943k104q609j3133N108K6224
15792a995K5390k2083N44j2510n125K1644K6316J0544m6969j2384j120n623l534
15779b6905l532j2577J3807K6912k561J6305J7250m1409j5571N592N380P843L1449
$$ plain form
15766 21983 59571 64794 52225 25976 -3377 -13909 -13324 7323 18634 57099 47453 6047
15754 6047 -12402 10985 4550 20899 5465 8264 -7414 -15195 8372 -24394 -45461 -32702
15742 -32702 -26015 -35720 -43289 -54549 -60287 -51378 -21337 -20590 -57587 -55480 -48906 -30454 -35381 -25397
15728 -25397 -25092 -23254 -16085 -12868 -39314 -63908 -47921 -45281 -35383 -10176 -12692 -44530 -70876
15715 -70876 -69396 -13459 3935 -15428 -20825 892 25017 13201 -8036 -12499 -20547 -23816 -37943
15702 -37943 -48266 -28005 -26505 -15455 -23214 3497 25925 19266 -7012 22118 44601 26773
15690 26773 30827 37970 12120 29103 35500 502 -1295 -8140 -33413 -50864 -27359 -27328 -18075
15677 -18075 50939 77840 39830 7800 23736 28341 24157 10477 8910 -13523 -33665 -19465
$$ packed form
15766B1983L7588N223j2569k6249k9353j0532N85K0647J1311L8465r646m1406
15754F047j8449K3387o435J6349j5434K799j5678p781K3567l2766k1067J2759
15742c2702O687r705p569j1260n738Q909L0041P47l6997K107O574J8452m927R984
15728b5397L05J838P169L217k6446k4594J5987K640R898K5207k516l1838k6346
15715g0876J480N5937J7394j9363n397K1717K4125j1816k1237m463q048l269j4127
15702c7943j0323K0261J500J1050p759K6711K2428o659k6278K9130K2483j7828
15690B6773M054P143k5850J6983O397l4998j797o845k5273j7451K3505L1R253
15677a8075O9014K6901l8010l2030J5936M605m184j3680j567k2433k0142J4200
$$ plain form
15665 -19465 -17345 -43481 -45932 -59719 -46835 -39460 -17791 -5545 -3122 22367 28956 15133 21824
15652 21824 -13593 -36469 -17141 3219 -18871 -10245 6920 16817 25007 -6743 -34337 -24560
15640 -24560 -20060 -48705 -36188 -4406 22364 -9153 -26609 -39438 -51232 -30099 -5199 -28014
15628 -28014 -30032 -1024 11084 32115 47137 57058 47663 3221 8439 -1038 -11548 -9771 -4342
15615 -4342 -15247 -451 909 -21840 -46719 -56596 -39408 -36589 -22224 -42725 -47325 -3708 16445
15602 16445 34678 39921 52152 56913 47926 47739 81906 67007 29480 7722 1060 -6248 -16615
15589 -16615 -34769 11088 26370 2606 -34220 1035 10154 -1378 -11133 -23998 -31863 -4437
15577 -4437 25138 19822 29991 6929 -11422 23685 39980 31067 12344 -4826 -195 -2909 21341
$$ packed form
15665a9465K120k6136k451j3787J2884P375K1669J2246K423K5489O589j3823O691
15652B1824l5417k2876J9328K0360k2090Q626J7165R897Q190l1750k7594R777
15640b4560M500k8645J2517L1782K6770l1517j7456j2829j1794K1133K4900k2815
15628b8014k018K9008J2108K1031J5022R921r395m4442N218r477j0510J777N429
15615d342j0905J4796J360k2749k4879r877J7188K819J4365k0501m600M3617K0153
15602A6445J8233N243J2231M761q987j87L4167j4899l7527k1758o662p308j0367
15589a6615j8154M5857J5282k3764l6826L5255R119j1532r755j2865p865K7426
15577d437K9575n316J0169k3062j8351L5107J6295q913j8723j7170M631k714K4250
$$ plain form
15564 21341 40353 28793 -12934 -2540 11668 31630 48735 48430 66483 79760 43481 18940
15552 18940 10218 -12070 3300 6497 -242 -12621 -28361 -6103 -778 -4850 6142 7354 -12076
15539 -12076 -33011 -3515 20569 -22195 -30899 -27946 -5211 -2531 -28571 -27960 -23360 -30701 -38041
15526 -38041 -57705 -25394 -30044 -32299 -7290 4239 -10638 -14069 2432 21870 23556 3900
15514 3900 -7462 -28497 -33989 -22364 8733 25725 24591 21039 10445 4709 -5657 9497 20225
15501 20225 -1921 -2905 -1984 8642 -7339 -35187 -11974 44140 61570 37831 19059 -668
15489 -668 -15126 -5911 4623 13132 34838 41049 28299 2324 -36251 -79343 -65730 -16292 -15076
15476 -15076 -22170 -24446 -34727 -33689 -25277 -15568 -13598 4654 27739 31056 20405 15374 9608
$$ packed form
15564B1341J9012j1560m1727J0394J4208J9962J7105l05J8053J3277l6279k4541
15552A8940q722k2288J5370L197o739j2379j5740K2258N325m072J0992J212j9430
15539a2076k0935K9496K4084m2764q704K953K2735K680k6040O11M600p341p340
15526c8041j9664L2311m650k255K5009J1529j4877l431J6501J9438J686j9656
15514C900j1362k1035n492J1625L1097J6992j134l552j0594n736j0366J5154J0728
15501B0225k2146r84R21J0626j5981k7848K3213N6114J7430k3739j8772j9727
15489f68j4458R215J0534Q509K1706O211j2750k5975l8575m3092J3613M9438J216
15476a5076p094k276j0281J038Q412R709J970J8252K3085L317j0651n031n766
$$ plain form
15463 9608 28584 10164 -8237 -45053 -55429 -19137 33079 3237 -13241 -38693 -27318 -3849
15451 -3849 8745 -8787 -16070 -12697 -12264 -25866 -29306 -28480 -40053 -10899 4625 -3835 -30534
15438 -30534 -33251 -24777 -19947 -21354 -5471 14237 1505 -21499 -7253 -12752 4073 8726 13064
15425 13064 5761 -2479 3839 2448 19729 -7663 -23922 -25738 -8914 -13677 -10943 -1184 21662
15412 21662 19485 3074 -24226 -10528 7881 -14299 -18775 -14129 -6074 643 -11177 -16377 4263
15399 4263 247 -24199 -32006 -42 4773 -22075 -28140 -14850 7347 18196 -3334 -41911 -34628
15386 -34628 -12651 17089 48422 70044 59418 51998 28409 9930 -3240 -11544 -5963 22365
15374 22365 -14905 347 48517 64457 46882 35305 20089 21164 28527 -1714 -40243 -20556
$$ packed form
15463I608J8976j8420j8401l6816j0376L6292N2216k9842j6478k5452J1375K3469
15451c849J2594j7532p283L373M33j3602l440Q26j1573K9154J5524q460k6699
15438c0534k717Q474M830j407J5883J9708j2732k3004J4246n499J6825M653M338
15425A3064p303q240O318j391J7281k7392j6259j816J6824m763K734R759K2846
15412B1662k177j6411k7300J3698J8409k2180m476M646Q055O717j1820n200K0640
15399D263m016k4446p807L1964M815k6848o065J3290K2197J0849k1530l8577P283
15386c4628K1977K9740L1333K1622j0626p420k3589j8479j3170q304N581K8328
15374B2365l7270J5252M8170J5940j7575j1577j5216J075P363l0241l8529J9687
$$ plain form
15362 -20556 25175 60193 62049 28916 -22898 -22302 -22041 6561 18119 14810 13856 -7025 8280
15349 8280 7770 -10048 -3387 15559 5847 -2868 -15938 -9543 23331 42274 42665 62119 49874
15336 49874 28019 7522 -5351 -12815 2355 11254 6255 -17349 -24105 -19701 -15153 -24504 -1460
15323 -1460 13722 35996 52963 39961 60414 44222 29270 44332 40789 26396 18692 -14167
15311 -14167 -32221 -22961 1016 5589 17132 15200 -3800 7058 10311 -25200 -36671 -10055
15299 -10055 8288 16943 11005 -133 -12622 -29049 -2179 9178 -30563 -53587 -4513 8782
15287 8782 5696 10863 23362 28480 6110 -22861 -10043 -25031 -22805 -15275 -23976 -7744 16901
15274 16901 -13500 -30847 -22937 2550 -6509 -26721 -22344 -24440 -19323 -9891 8583 1546 -39783
$$ packed form
15362b0556M5731L5018J856l3133n1814N96K61K8602J1558l309r54k0881J5305
15349H280n10j7818O661J8946r712q715j3070O395L2874J8943L91J9454j2245
15336D9874k1855k0497j2873p464J5170Q899m999k3604o756M404M548r351K3044
15323a460J5182K2274J6967j3002K0453j6192j4952J5062l543j4393p704l2859
15311a4167j8054R260K3977M573J1543j932j9000J0858L253l5511j1471K6616
15299a0055J8343Q655n938j1138j2489j6427K6870J1357l9741k3024M9074J3295
15287H782l086N167J2499N118k2370k8971J2818j4988K226P530q701J6232K4645
15274A6901l0401j7347P910K5487r059k0212M377k096N117R432J8474p037m1329
$$ plain form
15261 -39783 -45879 -49872 -67211 -53012 -45269 -35885 -17568 15411 17539 40728 56334 18830 -18485
15248 -18485 -22000 -14445 -3083 -12895 -29357 -23772 -19711 -11051 -9995 -11896 6395 10141 3480 22091
15234 22091 36427 7860 -8522 -11665 -18464 -16330 -12072 -19459 -8884 -4039 -10858 -18705 -21200
15221 -21200 12090 39703 53245 40931 5478 -10503 5776 33132 26691 17095 32806 45037
15209 45037 11070 7638 -9282 -21228 7405 24714 26773 -10436 -44967 -29602 -5056 -8566
15197 -8566 -30317 -51128 -38319 -38109 -7073 42540 55333 32087 32788 19009 1069 -23522 -18283
15184 -18283 905 12719 -18912 -16512 2637 8225 -15200 -11689 5696 20879 34748 19046
15172 19046 5118 16700 -1500 1594 33888 45621 46259 68564 52573 42675 37128 63068 56772
$$ packed form
15261c9783o096l993j7339J4199P743R384J8317L2979K128K3189J5606l7504l7315
15248a8485l515P555J1362r812j6462N585M061Q660J056j901J8291L746o661J8611
15234B2091J4336k8567j6382l143o799K134M258p387J0575M845o819p847k495
15221b1200L3290K7613J3542j2314l5453j5981J6279K7356o441r596J5711J2231
15209D5037l3967l432j6920j1946K8633J7309K059l7209l4531J5365K4546l510
15197h566k1751k0811J2809K10L1036M9613J2793k3246P01j3779j7940k4591N239
15184a8283J9188J1814l1631K400J9149N588k3425L511J7385J5183J3869j5702
15172A9046j3928J1582j8200L094L2294J1733O38K2305j5991r898n547K5940o296
$$ plain form
15159 56772 25711 33962 51807 48482 27871 -1574 18075 12749 18977 9966 -21991 736 29128
15146 29128 45758 38553 16992 20420 26326 15101 56787 73900 58676 43872 30843 28472
15134 28472 2346 -941 -22145 -14004 -2678 2817 9191 19122 22369 28621 17590 -2688 18420
15121 18420 16997 6250 15547 -17998 -14455 -8200 -10998 21247 10092 -27782 -54276 -44682 -16901
15108 -16901 -34874 -61544 -37539 4638 24098 19311 17300 1813 -24550 -26072 -54594 -30474
15096 -30474 5518 17069 20652 19178 11385 16454 15244 -3672 -4745 19474 26269 20505 -12498
15083 -12498 -29721 -5231 -18649 -47230 -12806 -4730 -1033 17278 22799 19473 -15536 -16719 231
15070 231 12879 19053 23371 42322 51206 22630 -9808 10781 103 8983 -6302 -31965 -12275
$$ packed form
15159E6772l1061Q251J7845l325k0611k9445J9649n326O228r011l1957K2727K8392
15146B9128J6630p205k1561L428N906j1225M1686J7113j5224j4804j3029k371
15134B8472k6126l287k1204Q141J1326N495O374R931L247O252j1031k0278K1108
15121A8420j423j0747R297l3545L543O255k798L2245j1155l7874k6494R594K7781
15108a6901j7973k6670K4005M2177J9460m787k011j5487k6363j522k8522K4120
15096c0474L5992J1551L583j474p793N069j210j8916j073K4219O795n764l3003
15083a2498j7223K4490j3418k8581L4424Q076L697J8311N521l326l5009j183J6950
15070B31J2648O174M318J8951Q884k8576l2438K0589j0678Q880j5285k5663J9690
$$ plain form
15057 -12275 14983 49453 28483 -11861 -20674 -6784 -6009 -1990 -22187 -28582 -11595 6877 19352
15044 19352 2480 712 -439 -29307 -57785 -33750 16781 31275 12834 2680 -26274 -14845
15032 -14845 -16510 -982 -2104 -2392 -17141 17319 22250 -6462 21749 16276 9689 27554 48481
15019 48481 38375 37277 42769 57157 65218 67909 72630 53022 14404 12797 -12974 -10590 21185
15006 21185 18751 1207 14305 23017 26671 23528 12916 13408 1761 3575 22597 28031 53639
14993 53639 56580 33730 52786 45975 15718 -506 4586 40090 56426 61059 66896 66809 41153
14980 41153 14714 -27943 -10949 16571 13981 -11544 -13946 26213 50268 34321 13507 11455
14968 11455 5188 -30808 -36591 -35435 -25502 -4314 27911 23817 27891 20612 -664 -4598 7664
$$ packed form
15057a2275K7258L4470k0970m0344q813J3890P75M019k0197o395J6987J8472J2475
15044A9352j6872j768j151k8868k8478K4035N0531J4494j8441j0154k8954J1429
15032a4845j665J5528j122k88j4749L4460M931k8712K8211n473o587J7865K0927
15019D8481j0106j098N492J4388Q061K691M721j9608l8618j607k5771K384L1775
15006B1185k434j7544J3098Q712L654l143j0612M92j1647J814J9022N434K5608
14993E3639K941k2850J9056o811l0257j6224N092L5504J6336M633N837q7k5656
14980D1153k6439m2657J6994K7520k590k5525k402M0159K4055j5947k0814k052
14968A1455o267l5996n783J156R933K1188L2225m094M074p279k1276l934J2262
$$ plain form
14955 7664 23754 -426 -17228 4106 12353 -1120 -6077 -16856 -20100 9059 12153 16737 24239
14942 24239 46451 31540 4927 4523 -9232 -35260 -41629 -29008 -13703 -31490 -37261 -34931 -15052
14929 -15052 -6083 -3835 14058 7046 9942 31969 20691 21673 32237 80402 97329 55920 36378
14916 36378 34523 47540 50854 27155 -485 -34403 -60021 -30184 -12355 11599 12373 8736 -17221
14903 -17221 -39204 -14192 32 8650 22063 54583 35442 39123 16617 19215 33371 -2012
14891 -2012 -71635 -73794 -46874 -6519 -8326 -7941 7970 42120 54862 9052 -16520 -42843 -51612
14878 -51612 -42221 -5012 14350 16901 19158 35882 51917 38224 726 -265 14832 17472 19307
14865 19307 20793 3866 -13563 9443 7158 8578 18419 29716 8878 -6279 -10092 -29571 -31771
$$ packed form
14955G664J6090k4180j6802K1334Q247j3473m957j0779l244K9159L094M584P502
14942B4239K2212j4911k6613m04j3755k6028o369J2621J5305j7787n771K330J9879
14929a5052Q969K248J7893p012K896K2027j1278R82J0564M8165J6927m1409j9542
14916C6378j855J3017L314k3699k7640l3918k5618K9837J7829K3954P74l637k5957
14903a7221k1983K5012J4224Q618J3413L2520j9141L681k2506K598J4156l5383
14891b012o9623k159K6920M0355j807L85J5911L4150J2742m5810k5572k6323q769
14878e1612R391L7209J9362K551K257J6724J6035j3693l7498r91J5097K640J835
14865A9307J486j6927j7429K3006k285J420R841J1297k0838j5157l813j9479k200
$$ plain form
14852 -31771 -35629 -3044 12236 -11030 -56547 -51518 -51025 -75613 -78905 -42861 248 30198 19997
14839 19997 8971 12078 13692 16846 17064 56522 76041 63216 39655 18653 -28884 -59097 -43715
14826 -43715 17702 43797 42672 16699 181 9544 -81 -27117 -26186 -6225 21372 48262 42805
14813 42805 10768 -13057 -17036 -26822 -4478 17606 16889 11468 18835 32951 49587 59794 68122
14800 68122 33802 -9776 -11355 3146 2288 -14477 -30376 -24089 -12710 -4171 -1093 18020 24366
14787 24366 7402 17964 13232 12916 -2278 -13213 -29778 -27530 -31031 -4822 17550 -15712 -33015
14774 -33015 -31472 -29056 -32085 -33861 -10808 42388 62998 37817 18340 -1539 -4538 -11884 -7567
14761 -7567 -243 4496 -20736 -25924 -50717 -68573 -63186 -71323 -55675 -44987 -37278 -46792 -52554
$$ packed form
14852c1771l858L2585J5280k3266m5517N029M93k4588l292L6044M3109K9950j0201
14839A9997j1026L107J614L154K18L9458J9519j2825k3561k1002m7537l0213J5382
14826d3715O1417K6095j125k5973j6518R363r625k7036R31J9961K7597K6890n457
14813D2805l2037k3825l979r786K2344K2084p17n421P367J4116J6636J0207Q328
14800F8122l4320m3578j579J4501q58j6765j5899O287J1379Q539L078J9113O346
14787B4366j6964J0562m732l16j5194j0935j6565K248l501K6209K2372l3262j7303
14774c3015J543K416l029j776K3053N3196K0610k5181j9477j9879k999p346M317
14761g567P324M739k5232n188k4793j7856N387q137J5648J0688P709r514n762
$$ plain form
14748 -52554 -44613 -20603 8335 7365 -2336 16955 22665 16802 22988 11620 -44808 -44098 -24897
14735 -24897 -15721 8341 -17943 -37160 -50505 -51604 -56250 -53210 -50690 -42772 -31406 -25832 -11033
14722 -11033 -2869 -326 24262 42823 45444 40719 39109 4387 -1564 18195 46463 22649 41337
14709 41337 43748 46976 37923 -5502 -17108 -12555 -11085 -1699 -5630 -19365 -38164 -38411 -13266
14696 -13266 -18755 -26300 -19149 -28608 -50243 -43510 -18161 -7868 -3587 31658 19426 -18610 -36123
14683 -36123 -50503 -31661 -19347 -26234 -32939 -26131 -21464 -8761 20263 28990 25804 18555 1510
14670 1510 -38908 -21959 4613 6563 -15482 -18896 -34356 -25377 2437 5869 -6917 -2385 25109
14657 25109 65651 91078 53477 57365 64800 47554 44509 37366 14992 47749 37247 6816
$$ packed form
14748e2554P941K4010K8938r70r701J9291N710n863O186j1368n6428P10J9201
14735b4897R176K4062k6284j9217j3345j099m646L040K520P918J1366N574J4799
14722a1033Q164K543K4588J8561K621m725j610l4722n951J9759K8268k3814J8688
14709D1337K411L228r053m3425j1606M553J470R386l931j3735j8799k47K5145
14696a3266n489p545P151r459k1635O733K5349J0293M281L5245j2232l8036j7513
14683c6123j4380J8842J2314o887o705O808M667J2703K9024Q727l186p249j7045
14670A510m0418J6949K6572J950k2045l414j5460Q979K7814L432j2786M532K7494
14657B5109M0542K5427l7601L888P435j7246l045p143k2374L2757j0502l0431
$$ plain form
14645 6816 -6828 -50321 -43965 -40125 -47345 -20099 -15827 -3210 -36525 -59853 -30534 -22802 -43923
14632 -43923 -53569 -56987 -20518 -27128 -13209 -27175 -12664 -12687 -10290 -12599 -9397 -14059 10721 -6
14618 -6 10699 22385 2833 8275 14886 -16641 -13009 -4472 -12213 -19767 -23368 -8951 1081 16290
14604 16290 38233 29330 30833 33550 10424 -2025 21021 31255 6644 -22658 -6684 32350
14592 32350 46936 29284 -18698 -58980 -41741 -35970 -24539 -34020 -51023 -26475 14560 -2894
14580 -2894 -58274 -55354 -41813 -34256 -4739 -3758 -30640 -17902 20598 42499 35404 8458 12576
14567 12576 14062 2512 19966 5842 -2014 -4937 5920 5269 -1141 1452 4516 -17984 -56585
14554 -56585 -34956 -27865 -4732 -1874 19132 5413 30919 30591 -12102 -2451 6474 13008 19786
$$ packed form
14645F816j3644m3493O356L840p220K7246M272J2617l3315k3328K9319P732k1121
14632d3923r646l418L6469o610J3919j3966J4511k3K397k309L202m662K4780j0727
14618fJ0705J1686j9552N442O611l1527L632Q537p741p554l601J4417J0032J5209
14604A6290K1943q903J503K717k3126j2449K3046J0234k4611k9302J5974L9034
14592C2350J4586j7652m7982m0282J7239N771J1431r481j7003K4548M1035j7454
14580b894n5380K920J3541P557K9517R81k6882J2738L8500K1901p095k6946M118
14567A2576J486j1550J7454j4124p856k923J0857o51o410K593L064k2500l8601
14554e6585K1629P091K3133K858K1006j3719K5506l28m2693R651Q925O534O778
$$ plain form
14541 19786 6098 -22032 -21104 -29347 -44827 -44251 -32443 -18441 -2462 702 -8642 -13784 -6710
14528 -6710 -23114 -25550 -1995 448 -9124 -6187 9427 13808 23425 -1388 -29170 -26083 -7682
14515 -7682 21354 16927 18335 12127 -6879 -42389 -52821 -36966 -27993 -40287 -63365 -36070 -24773
14502 -24773 -9505 -1775 -8319 10625 41334 53835 47493 9795 6555 -2741 -7182 8269 36247
14489 36247 34228 21705 7931 44162 54800 62698 51116 47358 13454 -20302 -13881 29035
14477 29035 27151 42888 50162 30968 12807 -10413 1076 37688 30457 9209 7301 47949
14465 47949 59225 61553 42918 19024 6062 -10294 -35459 -5672 -30844 -34694 -57392 -44403
14453 -44403 -38967 -47736 -50986 -51368 -42632 -24657 -21807 -16711 -10486 -26564 -37771 -1423 35526
$$ packed form
14541A9786j3688k8130R28q243j5480N76J1808J4002J5979L164r344n142P074
14528f710j6404k436K3555K443r572K937J5614M381R617k4813k7782L087J8401
14515g682K9036m427J408o208j9006l5510j0432J5855Q973j2294k3078K7295J1297
14502b4773J5268P730o544J8944L0709J2501o342l7698l240r296m441J5451K7978
14489C6247k019j2523j3774L6231J0638P898j1582l758l3904l3756O421M2916
14477B9035j884J5737P274j9194j8161k3220J1489L6612p231k1248j908M0648
14465D7949J1276K328j8635k3894j2962j6356k5165K9787k5172l850k2698J2989
14453d4403N436q769l250l82Q736J7975K850N096O225j6078j1207L6348L6949
$$ plain form
14440 35526 33295 22776 12864 16438 -3722 -6968 3618 -9487 -11149 -773 7232 -992 -28760
14427 -28760 -37996 -46742 -71980 -48630 9669 36777 30117 5409 -3084 29918 32784 1397 -3206
14414 -3206 15969 2647 -14721 2477 14045 32940 34149 33155 8057 23294 65126 74867 54720
14401 54720 25914 5462 -12795 -23772 -10151 -22015 -30009 -15737 13192 15957 -5923 -20166
14389 -20166 -17113 2101 26554 55946 57144 28022 -9970 -21931 -33292 -44776 -46525 -19337
14377 -19337 7033 306 11788 4371 11428 13911 -29301 -15735 13555 22644 36843 52749 65711
14364 65711 60039 40904 22627 -19231 -18647 -26647 -6707 12031 59330 96863 94701 62797 53318
14351 53318 33382 21777 42326 27792 -4838 -11592 17471 17177 8687 -3216 -14916 7631
$$ packed form
14440C5526k231j0519r912L574k0160l246J0586j3105j662J0376Q005q224k7768
14427b8760r236q746k5238K3350N8299K7108o660k4708q493L3002K866l1387m603
14414c206J9175j3322j7368J7198J1568J8895J209r94k5098J5237M1832R741k0147
14401E4720k8806k0452j8257j0977J3621j1864p994J4272K8929K765k1880j4243
14389b0166L053J9214K4453K9392J198k9122l7992j1961j1361j1484j749K7188
14377a9337K6370o727J1482p417P057K483m3212J3566K9290R089J4199J5906J2962
14364F5711n672j9135j8277m1858N84q000J9940J8738M7299L7533k162l1904r479
14351E3318j9936j1605K0549j4534l2630o754K9063k94q490j1903j1700K2547
$$ plain form
14339 7631 33409 27911 36334 36592 15106 -28257 -39863 -26201 -44641 -32544 -7790 -3971 -37973
14326 -37973 -39413 -15614 -27447 -17478 -15873 -10958 -9691 7352 13039 17101 -11097 -26300 1597
14313 1597 36588 47201 51882 65672 59043 59054 67736 32983 -5604 -46363 -44089 -45094 -24714
14300 -24714 -23515 -225 7279 27432 55087 13095 -14177 -2891 10680 9833 -9185 -19631
14288 -19631 6915 20698 27682 5598 4914 -12538 520 5436 -87 15917 28228 2959 26799
14275 26799 38045 24040 7740 5833 5381 7635 -22219 -55391 -18132 -9837 -15914 -9509 5150
14262 5150 -10460 -30363 -25960 -36351 -13508 -10001 -41836 -44389 -21880 -7125 32362 49123
14250 49123 20215 27572 31599 25509 18113 -3668 -1988 -13010 -34517 -35631 -30556 -17169 -28003
$$ packed form
14339G631K5778n498Q423K58k1486m3363j1606J3662j8440J2097K4754L819l4002
14326c7973j440K3799j1833R969J605M915J267J7043N687M062k8198j5203K7897
14313A597L4991J0613M681J3790o629J1Q682l4753l8587m0759K274j005K0380
14300b4714J199K3290P504K0153K7655m1992k7272J1286J3571q47j9018j0446
14288a9631K6546J3783O984k2084o84j7452J3058M916n523J6004J2311k5269K3840
14275B6799J1246j4005j6300j907m52K254k9854l3172L7259Q295o077O405J4659
14262E150j5610j9903M403j0391K2843L507l1835k553K2509J4755L9487J6761
14250D9123k8908P357M027o090p396k1781J680j1022k1507j114N075J3387j0834
$$ plain form
14237 -28003 -19332 13933 11088 2162 -2423 -1682 -6021 -20931 -33146 -41447 -47639 -20704 -12785 -21277
14223 -21277 5570 31910 37239 25687 22243 14361 1142 -22007 -37429 -29738 4414 17353
14211 17353 38431 50871 56546 50869 71457 62979 49248 60376 74299 35412 7008 -15765
14199 -15765 -5494 4762 11788 14270 19428 33794 47672 25782 2256 11640 -6356 -5280 12316
14186 12316 31968 27643 11764 13232 21755 7475 -3731 -2808 2962 15717 6960 23956 39022
14173 39022 28635 20516 33556 15089 -28524 -37148 -31312 -59709 -77140 -81066 -39780 18746
14161 18746 35332 32669 3968 196 7376 26059 34518 24865 24784 22574 13654 -308 12120 19886
14147 19886 28502 41447 21289 -9854 9036 30384 27691 28071 33875 17954 23585 14565 34040
$$ packed form
14237b8003Q671L3265k845q926m585P41m339j4910j2215q301o192K6935P919q492
14223b1277K6847K6340N329j1552l444p882j3219k3149j5422P691L4152J2939
14211A7353K1078J2440N675n677K0588q478j3731J1128J3923l8887k8404k2773
14199a5765J0271J0256P026K482N158J4366J3878k1890k3526R384j7996J076J7596
14186A2316J9652m325j5879J468Q523j4280j1206R23N770J2755q757J6996J5066
14173C9022j0387q119J3040j8467m3613q624N836k8397j7431l926M1286N8526
14161A8746J6586k663k8701l772P180J8683Q459r653q1k210q920j3962J2428P766
14147A9886Q616J2945k0158l1143J8890K1348k693L80N804j5921N631r020J9475
$$ plain form
14134 34040 90515 94941 57277 42298 65040 60526 55115 24895 -7979 -34421 -38960 -26014
14122 -26014 -9122 -19780 2130 19894 16599 -28776 -49149 -53244 -41215 -6073 -10247 -540
14110 -540 12378 2076 -5436 8173 22253 5898 23081 35558 36138 21727 27922 21026 -25448
14097 -25448 -40471 -32331 -9641 9584 12586 23610 9264 19069 22335 21447 25573 3697 -8049
14084 -8049 2139 5319 -12140 -30992 -369 -29289 -54334 -48435 -22696 7136 21018 39403
14072 39403 51021 56053 73134 68806 27743 18050 -18685 -3714 15288 5525 -8895 -22183
14060 -22183 4983 8347 1230 61089 67297 55829 55356 37684 -16049 -13288 17454 36078 15601
14047 15601 18487 3606 5035 -4182 6350 14544 34499 25363 25970 13492 -4411 8649 -2268
$$ packed form
14134C4040N6475M426l7664j4979K2742m514n411l0220l2874k6442m539J2946
14122b6014J6892j0658K1910J7764l295m5375k0373m095J2029L5142m174R707
14110e40J2918j0302p512J3609J4080j6355J7183J2477N80j4411O195o896m6474
14097b5448j5023Q140K2690J9225L002J1024j4346R805L266q88M126k1876j1746
14084h049J0188L180j7459j8852L0623k8920k5045N899K5739K9832J3882J8385
14072C9403J1618N032J7081m328m1063r693l6735J4971J9002r763j4420j3288
14060b2183K7166L364p117N9859O208j1468m73j7672n3733K761L0742J8624k0477
14047A5601K886j4881J429r217J0532Q194J9955r136O07j2478j7903J3060j0917
$$ plain form
14034 -2268 -15235 -7422 4578 -8097 -17403 -23975 -15735 -25747 -4530 973 24816 9265 3507
14021 3507 -241 -727 -12869 -4915 8244 26338 17118 5235 -6158 -14475 8093 15142 14360 34108
14007 34108 14277 18149 5802 -10978 2387 -11705 -4625 13109 13130 27721 46608 24755 19000
13994 19000 -2269 -20698 -17354 9196 14959 5093 -23369 -2012 -22211 -28153 -5515 -3879 4855
13981 4855 65336 87247 54050 53120 31059 13147 -7020 -13558 48751 61004 37571 52533
13969 52533 35064 -7791 -8905 -5893 -39833 -26099 -18492 -5946 -18460 -19212 550 -355 -13440
13956 -13440 -25268 3166 19683 -15850 -24683 -17429 -9060 17362 9587 13337 34503 41724 28405
13943 28405 15734 21251 29336 21081 -6278 -15854 3121 -3389 -16884 -36583 -59793 -29286 6311
$$ packed form
14034b268j2967P813J2000j2675r306o572Q240j0012K1217N503K3843j5551n758
14021C507l748m86j2142P954J3159J8094r220j1883j1393q317K2568P049p82J9748
14007C4108j9831L872j2347j6780J3365j4092P080J7734K1J4591J8887k1853n755
13994A9000k1269j8429L344K6550N763r866k8462K1357k0199n942K2638J636Q734
13981D855O0481K1911l3197r30k2061j7912k0167o538O2309J2253k3433J4962
13969E2533j7469m2855j114L012l3940J3734P607J2546j2514p52J9762r05j3085
13956a3440j1828K8434J6517l5533q833P254Q369K6422p775L750K1166P221j3319
13943B8405j2671N517Q085q255k7359r576J8975o510j3495j9699k3210L0507L5597
$$ plain form
13930 6311 12754 34736 49272 52614 54384 50128 41750 6989 11641 27321 25759 39818 40542 37660
13916 37660 20350 29851 20798 15328 34212 49013 63406 9845 1859 -1295 -15005 17588 23069
13903 23069 1626 7038 8316 5195 2634 -13491 2420 39995 1834 -22845 -6103 6869
13891 6869 7396 -2901 9146 43168 44266 18940 14620 -11141 11097 17163 18229 15137 -4716
13878 -4716 -40370 -33512 -21477 -16984 -29847 -44638 -31523 -3660 16659 15820 6427 -1103 -21540
13865 -21540 -34604 -8323 13017 -6648 -23409 -12029 -34130 -56466 -25357 -14832 7319 10681
13853 10681 -2402 18212 42291 46297 24996 35642 42232 5721 9854 -749 -23466 -27779
13841 -27779 -1533 38460 12598 9093 33196 31133 45388 38899 40501 57628 55098 47188 29091
$$ packed form
13930F311O443K1982J4536L342J770m256q378l4761M652J5680j562J4059P24k882
13916C7660j7310R501r053n470J8884J4801J4393n3561p986l154j3710L2593N481
13903B3069k1443N412J278l121k561j6125J5911L7575l8161k4679J6742J2972
13891F869N27j0297J2047L4022J098k5326m320k5761K2238O066J066l092j9853
13878d716l5654O858J2035M493j2863j4791J3115K7863K0319q39r393p530k0437
13865b1540j3064K6281K1340j9665j6761J1380k2101k2336L1109J0525K2151L362
13853A0681j3083K0614K4079M006k1301J0646O590l6511M133j0603k2717m313
13841b7779K6246L9993k5862l505K4103k063J4255o489J602J7127k530p910j8097
$$ plain form
13828 29091 15053 -920 -17963 -37258 -44016 11951 12594 10280 16798 30726 23456 -14496 160
13815 160 2815 -7336 -5415 20462 31631 38783 8528 -3696 -19947 -27235 2506 11679 21018
13802 21018 35762 44704 32825 13252 -15233 6288 36283 26168 -5007 -19519 -24606 -38772
13790 -38772 -39894 -20383 -10282 699 -8473 -4722 -8756 -13958 -11647 8109 13837 -8368 -39497
13777 -39497 -28996 -6763 31003 14126 -17547 -23894 -13501 2403 4682 6445 11994 30031
13765 30031 23963 -5290 -19243 -19353 -17673 23206 16382 -6039 20778 3487 8032 10945 2342
13752 2342 -7719 4557 333 -16933 236 4439 -20529 -46665 -36106 211 -3052 -12993 -32602
13739 -32602 -47430 -7046 31122 24892 8941 -1705 -3706 9482 -15403 -8624 -2555 11656
$$ packed form
13828B9091j4038j5973j7043j9295o758N5967O43k314O518J3928p270l7952J4656
13815A60K655j0151J921K5877J1169P152l0255j2224j6251p288K9741R173R339
13802B1018J4744Q942j1879j9573k8485K1521K9995j0115l1175j4512n087j4166
13790c8772j122J9511J0101J0981r172L751m034n202K311J9756N728k2205l1129
13777c9497J0501K2233L7766j6877l1673o347J0393J5904K279J763N549J8037
13765C0031o068k9253j3953j10J680M0879o824k2421K6817j7291M545K913q603
13752B342j0061J2276m224j7266J7169M203k4968k6136J0559L6317l263r941j9609
13739c2602j4828M0384L8168o230j5951j0646k001J3188k4885O779O069J4211
$$ plain form
13727 11656 28035 17911 -1926 3099 24907 30970 -1364 -15732 -24408 -22426 -11132 14028
13715 14028 52245 43607 23785 -5989 -17205 -4540 19277 31600 24115 3444 18528 25757
13703 25757 25178 10956 26731 23766 7956 -5257 -14517 -13626 -26602 -12980 276 -39127 -26308
13690 -26308 -34550 -27048 9326 28185 17965 2186 -1947 -13073 12015 15210 22865 -6326 4441
13677 4441 32241 61747 50633 39985 36884 20801 22031 -1497 8944 26 -3039 -31678 -26696
13664 -26696 -8325 -18494 -13217 5470 16618 34147 53403 30118 31586 13933 -4013 3264
13652 3264 -4003 -14133 -13267 -22841 -14793 -49753 -58809 -41247 -14123 11925 39129 26491 -2055
13639 -2055 26606 58059 41605 25900 34294 42523 41237 61645 71849 34820 7929 -10571
$$ packed form
13727A1656J6379j0124j9837N025K1808O063l2334j4368q676J982J1294K5160
13715A4028L8217q638j9822k9774j1216J2665K3817J2323p485k0671J5084P229
13703B5757n79j4222J5775k965j5810j3213r260Q91j2976J3622J3256l9403J2819
13690b6308q242P502L6374J8859j0220j5779m133j1126K5088L195P655k9191J0767
13677D441K7800K9506j1114j0648l101j6083J230k3528J0441q918l065k8639M982
13664b6696J8371j0169N277J8687J1148J7529J9256k3285J468j7653j7946P277
13652C264p267j0130Q66r574Q048l4960r056J7562K7124K6048K7204j2638k8546
13639b055K8661L1453j6454j5705Q394Q229j286K0408J0204l7029k6891j8500
$$ plain form
13627 -10571 -25248 -11408 45979 36460 34940 26123 1229 20140 17740 21999 27210 42288 32526
13614 32526 28294 44722 44081 37052 41990 42018 23847 28697 40204 24729 28049 31910 -12044 -24899
13600 -24899 -19312 -4730 7873 14228 25525 59829 40232 -3470 -1071 24300 18457 24053 -4674
13587 -4674 -5402 15729 7725 -9610 -7284 25514 36854 11138 -2192 14236 25123 -6489 -25416
13574 -25416 -12894 -6788 25207 73598 60102 14343 -15136 -25171 -25887 9701 32000 14955
13562 14955 -12199 -20281 -4945 10065 9406 1518 -4095 -13751 2383 5463 18101 41627 57480
13549 57480 48669 20401 24092 16815 -6920 -22092 -25016 -13624 -4914 24882 41842 14244 3218
13536 3218 -13276 18637 46624 59408 54262 8615 24035 60745 51867 35844 19289 -3794
$$ packed form
13627a0571j4677J3840N7387r519j520q817k4894J8911k400M259N211J5078r762
13614C2526m232J6428o41p029M938K8j8171M850J1507j5475L320L861m3954j2855
13600b4899N587J4582J2603O355J1297L4304j9597m3702K399K5371n843N596k8727
13587d674p28K1131q004j7335K326L2798J1340k5716j3330J6428J0887l1612j8927
13574b5416J2522O106L1995M8391j3496m5759k9479j0035p16L5588K2299j7045
13562A4955k7154q082J5336J5010o59p888n613r656J6134L080J2638K3526J5853
13549E7480q811k8268L691p277k3735j5172k924J1392Q710K9796J6960k7598j1026
13536C218j6494L1913K7987J2784n146m5647J5420L6710q878j6023j6555k3083
$$ plain form
13524 -3794 15077 36170 26936 -3725 -7860 7290 16672 6409 4274 -515 15742 -1662 13164
13511 13164 10416 22521 21049 -1379 -55908 -41282 -15213 1584 35014 33847 -3418 -10601
13499 -10601 -19238 -9396 7797 13703 6111 15970 7844 -421 -20978 -38001 -3058 25164 21149
13486 21149 17525 24602 18986 33536 51535 36122 7765 11953 29254 42141 23569 34679
13474 34679 71942 96282 93107 61129 28835 26367 33360 41550 25190 34849 52278 45923 38496
13461 38496 32465 21808 16708 30322 24631 39373 38747 29309 12674 17732 9869 8501 8538 12932
13447 12932 20125 25267 29577 40425 50627 68545 49830 34881 36605 13105 10842 42596 47169
13434 47169 51776 72332 59924 72622 123631 167705 203439 233356 276553 329347 327308 300042
$$ packed form
13524c794J8871K1093r234l0661m135J5150R382j0263k135m789J6257j7404J4826
13511A3164k748J2105j472k2428n4529J4626K6069J6797L3430j167l7265p183
13499a0601q637R842J7193N906p592R859q126q265k0557j7023L4943K8222m015
13486B1149l624P077n616J4550J7999j5413k8357M188J7301J2887j8572J1110
13474C4679L7263K4340l175l1978l2294k468O993Q190j6360R659J7429o355p427
13461C8496o031j0657n100J3614n691J4742o26r438j6635N058p863j368L7M394
13447A2932P193N142M310J0848J0202J7918j8715j4949J724k3500k263L1754M573
13434D7169M607K0556j2408J2698N1009M4074L5734K9917M3197N2794k039k7266
$$ plain form
13422 300042 241324 235575 232970 219332 170708 141504 157724 165493 147672 140859 164463 205332
13410 205332 219149 209586 186827 172032 164143 161433 184344 180336 164823 169278 172770 167804 175929
13397 175929 217286 255882 289514 341951 347362 318749 295018 275159 262953 261449 230118 181519
13385 181519 180443 181978 162252 173633 184318 244422 257219 217063 232799 237372 205979 200663
13373 200663 190816 181833 202289 199718 175586 169035 164410 160364 176722 232281 285653 310063 316047
13360 316047 345638 344126 333427 285531 243046 213329 200853 157344 148952 161129 145727 107254
13348 107254 81446 80411 92377 106265 116546 96182 75655 79062 56958 47851 63314 88456
13336 88456 96942 82812 63240 57733 55452 59489 54966 54155 40329 27417 42038 50342 27079
$$ packed form
13422C00042n8718n749k605j3638m8624k9204J6220P769j7821o813K3604M0869
13410B05332J3817r563k2759j4795p889k710K2911m008j5513M455L492m966Q125
13397A75929M1357L8596L3632N2437N411k8613k3731j9859j2206j504l1331m8599
13385A81519j076J535j9726J1381J0685O0104J2797m0156J5736M573l1393n316
13373B00663r847q983K0456k571k4132o551m625m046J6358N5559N3372K4410N984
13360C16047K9591j512j0699m7896m2485k9717j2476m3509q392J2177j5402l8473
13348A07254k5808j035J1966J3888J0281k0364k0527L407k2104r107J5463K5142
13336H8456Q486j4130j9572n507k281M037m523q11j3826j2912J4621Q304k3263
$$ plain form
13323 27079 12535 15365 25305 -14719 -23695 -37398 -50561 -4575 13539 37644 65323 62314
13311 62314 39831 33590 60584 71348 52472 36796 40156 32340 56542 35412 53770 84345
13299 84345 80060 101143 107652 106546 128363 132921 118732 131822 164431 229742 298839 382667
13287 382667 532490 793475 1276846 1821644 1880614 1427864 936333 606371 417073 318313
13277 318313 262966 228358 163792 125126 127394 134571 135672 113420 122279 90234 37883 50787
13265 50787 71983 78575 112613 113395 95149 74053 66570 60549 69802 85322 80490 64656 83548
13252 83548 98288 107037 90944 104626 113890 102226 95346 85354 72639 61292 71656 89562
13240 89562 59532 47389 47663 60126 65676 71103 78751 90345 82838 49049 47637 63758 72766
$$ packed form
13323B7079j4544K830R940m0024q976j3703j3163M5986J8114K4105K7679l009
13311F2314k2483o241K6994J0764j8876j5676L360p816K4202k1130J8358L0575
13299H4345m285K1083O509j106K1817M558j4189J3090L2609O5311O9097Q3828
13287C82667J49823K60985M83371N44798N8970m52750m91531l29962j89298r8760
13277C18313n5347l4608o4566l8666K268P177J101k2252Q859l2045n2351J2904
13265E0787K1196O592L4038P82j8246k1096p483o021R253J5520m832j5834J8892
13252H3548J4740Q749j6093J3682R264j1664o880r992j2715j1347J0364J7906
13240H9562l0030j2143K74J2463N550N427P648J1594p507l3789j412J6121R008
$$ plain form
13227 72766 56835 59799 78971 109386 123384 90982 64323 57311 59991 50576 57965 46813 48704
13214 48704 87580 116905 87216 76778 84097 64074 80173 89613 94528 131896 128578 113051
13202 113051 98341 71532 74373 97961 108642 110124 77839 59992 44760 55237 57544 61850
13190 61850 68718 57671 39584 31376 46276 103864 138919 137809 112951 86848 56459 81069
13178 81069 87652 66339 70302 88554 86944 31012 16466 25748 56255 77607 98061 79692
13166 79692 61298 86049 122198 117762 98349 83046 93794 81082 72310 59733 55830 68436
13154 68436 51690 36721 45420 61681 82516 75566 78781 94370 100660 92859 80291 70324 101569
13141 101569 120326 108367 110243 146025 191399 219434 254456 288019 324208 334451 311319 315412
$$ packed form
13227G2766j5931K964J9172L0415J3998l2402k6659p012K680r415P389j1152J891
13214D8704L8876K9325k9689j0438P319k0023J6099R440M915L7368l318j5527
13202A13051j4710k6809K841K3588J0681J482l2285j7847j5232J0477K307M306
13190F1850O868j1047j8087q208J4900N7588L5055j110k4858k6103l0389K4610
13178H1069O583k1313L963J8252j610n5932j4546R282L0507K1352K0454j8369
13166G9692j8394K4751L6149m436j9413j5303J0748j2712q772j2577l903J2606
13154F8436j6746j4969Q699J6261K0835o950L215J5589O290p801j2568r967L1245
13141A01569J8757j1959J876L5782M5374K8035L5022L3563L6189J0243k3132M093
$$ plain form
13129 315412 319393 326552 321650 325220 365123 379170 373116 328537 258632 240144 286512 277990 287147
13116 287147 302546 280068 256347 234101 208913 174671 166459 155823 158316 188094 210729 211339
13104 211339 213537 215229 216612 230420 221787 215571 195677 203412 225294 208054 202328 187537 192651
13091 192651 210804 194310 198495 232405 267178 272848 264419 244044 239389 237261 205845 216751
13079 216751 220907 249525 321944 345386 378269 446980 449269 405359 372072 341565 306005 279767
13067 279767 250409 227099 235038 245432 233301 228893 203993 221213 232149 282471 300833 288132
13055 288132 285830 287034 328833 387846 380943 349759 328551 336495 308843 289391 301008 305881
13043 305881 289643 280753 291134 317991 284257 253131 259610 282509 288761 336904 385590 390772
$$ packed form
13129C15412L981P159m902L570L9903J4047o054m4579o9905j8488M6368q522R157
13116B87147J5399k2478k3721k2246k5188l4242q212j0636K493K9778K2635O10
13104B11339K198J692J383J3808q633o216j9894P735K1882j7240n726j4791N114
13091A92651J8153j6494M185L3910L4773N670q429k0375m655k128l1416J0906
13079B16751M156K8618P2419K3442L2883O8711K289m3910l3287l0507l5560k6238
13067B79767k9358k3310P939J0394j2131m408k4900J7220J0936N0322J8362j2701
13055B88132k302J204M1799N9013o903l1184k1208P944k7652j9452J1617M873
13043C05881j6238q890J0381K6857l3734l1126O479K2899O252M8143M8686N182
$$ plain form
13031 390772 409780 427533 451300 491603 521470 546677 566340 580986 610876 672065 711511
13020 711511 769074 863911 933789 972966 1009309 1075025 1154618 1247720 1346132 1449299 1552835
13009 1552835 1670166 1831036 2054370 2385613 2751094 3129643 3594802 4203408 4962053
13000 4962053 5923340 7100325 8532453 10337244 12727227 16061532 20865493 27683913
12992 27683913 36885799 47866095 58283140 64644118 64959815 60143223 52518770 44213461
12984 44213461 36728226 30776208 26431908 23584292 22080216 21875766 22857512 24784507
12976 24784507 27211308 29529972 31592799 33461638 34906051 35456312 34833480 33343319
12968 33343319 31583621 29986868 28766690 28258369 28823150 30743621 34151573 38984522
$$ packed form
13031C90772J9008J7753K3767M0303K9867K5207J9663J4646K9890O1189L9446
13020G11511N7563R4837O9878L9177L6343O5716P9593R3102R8412J03167J03536
13009A552835J17331J60870K23334L31243L65481L78549M65159O08606P58645
13000D962053R61287J176985J432128J804791K389983L334305M803961O818420
12992B7683913R201886J0980296J0417045O360978L15697m816592p624453q305309
12984D4213461p485235n952018m344300k847616j504076k04450R81746J926995
12976B4784507K426801K318664K062827J868839J444413N50261o22832j490161
12968C3343319j759698j596753j220178n08321N64781J920471L407952M832949
$$ plain form
12960 38984522 44860361 51007973 56461546 60097062 60947314 58857690 54420117 48736649
12952 48736649 42866778 37576709 33376367 30455417 28791288 28150204 28368262 29507892
12944 29507892 31305986 33362396 35285690 36409890 36271778 35106937 33418321 31459238
12936 31459238 29218542 26760260 24623791 23399182 23447236 24920959 27914509 32679277
12928 32679277 39316781 47576462 56528463 64581368 69573035 69086388 62455961 51996611
12920 51996611 41123778 31988888 25056947 19984928 16359437 13705387 11660971 10012894
12912 10012894 8570825 7360867 6372229 5541545 4833823 4264898 3810471 3415811 3087140
12903 3087140 2808511 2568125 2385222 2221266 2051502 1889334 1794353 1691903 1593953 1512380
$$ packed form
12960C8984522N875839O147612N453573L635516Q50252k089624m437573n683468
12952D8736649n869871n290069m200342k920950j664129o41084K18058J139630
12944B9507892J798094K056410J923294J124200j38112j164841j688616j959083
12936C1459238k240696k458282k136469j224609M8054J473723K993550M764768
12928C2679277O637504Q259681Q952001Q052905M991667m86647o630427j0459350
12920E1996611j0872833r134890o931941n072019l625491k654050k044416j648077
12912A0012894j442069j209958r88638q30684p07722n68925m54427l94660l28671
12903C087140k78629k40386j82903j63956j69764j62168r4981j02450r7950q1573
$$ plain form
12893 1512380 1437799 1385056 1357497 1326576 1241680 1175391 1138398 1099667 1103451 1098154 1077559 1034332
12881 1034332 982143 957169 964434 972569 961483 970988 957334 948641 938972 945557 953646 936863 885521
12868 885521 859127 857948 879991 929269 951290 932524 923398 887323 879242 898087 913744 940247
12856 940247 1015645 1068432 1161180 1268421 1353526 1425329 1566196 1721502 1799899 1847553 1921394
12845 1921394 2072686 2278516 2488543 2711190 2907183 3111482 3447036 3833080 4322714
12836 4322714 4971472 5821965 7025127 8719130 10396105 11707298 13322411 15914142
12828 15914142 19974983 26414373 36590845 53284869 83020507 138653646 235910188
12821 235910188 353002643 368506152 269476264 166245987 104196863 70662856 51512229
$$ packed form
12893A512380p4581n2743k7559l0921q4896o6289l6993l8731L784n297k0595m3227
12881A034332n2189k4974P265Q135j1086R505j3654q693r669O585Q089j6783n1342
12868H85521k6394j179K2043M9278K2021j8766r126l6075q081J8845J5657K6503
12856I40247P5398N2787R2748J07241Q5105P1803J40867J55306P8397M7654P3841
12845A921394J51292K05830K10027K22647J95993K04299L35554L86044M89634
12836D322714O48758Q50493J203162J694003J676975J311193J615113K591731
12828A5914142M060841O439390J0176472J6694024K9735638N5633139R7256542
12821B35910188J17092455J5503509r9029888j03230277o2049124l3534007j9150627
$$ plain form
12814 51512229 39667028 31554976 25595580 21271427 18205720 16179716 14535802 12536582
12806 12536582 10461237 8829347 7650495 6684686 5907956 5283144 4725035 4182077 3752808
12797 3752808 3400581 3102179 2865101 2610880 2375250 2183907 2109829 2056069 1994502 1937545
12787 1937545 1897717 1844009 1790985 1728650 1650974 1569886 1467094 1381264 1282791 1190827 1092383
12776 1092383 1029893 1008471 993313 943626 885660 806676 753513 736364 678086 647878 628248
12765 628248 607755 584197 599352 589296 553285 551587 569297 539592 506241 500802 486842 500263
12753 500263 502188 459805 453686 437438 417918 406578 408553 388857 392153 392660 407552 412649 409762
12740 409762 389380 375169 369133 374175 377742 354243 317657 293699 294388 278925 267768 239085
$$ packed form
12814E1512229j1845201q112052n959396m324153l065707k026004j643914j999220
12806A2536582k075345j631890j178852r65809p76730o24812n58109n42958m29269
12797C752808l52227k98402k37078k54221k35630j91343p4078n3760o1567n6957
12787A937545l9828n3708n3024o2335p7676q1088j02792q5830r8473r1964r8444
12776A092383o2490k1422j5158m9687n7966p8984n3163j7149n8278l0208j9630
12765F28248k0493k3558J5155j0056l6011j698J7710k9705l3351n439j3960J3421
12753E00263J925m2383o119j6248j9520j1340J975j9696L296N07J4892N097k887
12740D09762k0382j4211o036N042L567k3499l6586k3958O89j5463j1157k8683
$$ plain form
12728 239085 240026 254284 247703 246299 255965 246084 255220 270809 314132 336384 339409 352255 369648
12715 369648 367072 328478 280376 272311 293517 282066 246921 248895 252345 226632 256782 287724
12703 287724 301694 305792 316851 321251 309434 328451 331841 307919 238398 17391 -156124 -155146
12691 -155146 -139671 -121353 -120304 -67196 18086 61919 51143 57317 30623 15545 31474 37316
12679 37316 65013 75887 94305 94681 85598 71589 77207 85288 109841 95726 59196 14841 -13212
12666 -13212 -3697 -10794 6387 71445 84288 97429 104489 113448 138772 121197 118874 113100 115794
12653 115794 57392 20959 28817 59525 80001 54683 30334 27527 16731 33888 22783 15793
12641 15793 19449 29078 27146 37855 21503 170 22197 95371 130399 178521 199582 170043
$$ packed form
12728B39085R41J4258o581j404R666r881R136J5589M3323K2252L025J2846J7393
12715C69648k576l8594m8102q065K1206j1451l5145J974L450k5713L0150L0942
12703B87724J3970M098J1059M400j1817J9017L390k3922o9521k21007j73515R78
12691a55146J5475J8318J049N3108Q5282M3833j0776O174k6694j5078J5929N842
12679C7316K7697J0874J8418L76r083j4009N618Q081K4553j4115l6530m4355k8053
12666a3212R515p097J7181O5058J2843J3141P060Q959K5324j7575k323n774K694
12653A15794n8402l6433P858L0708K0476k5318k4349k807j0796J7157j1105o990
12641A5793L656R629j932J0709j6352k1333K2027P3174L5028M8122K1061k9539
$$ plain form
12629 170043 129945 121295 118429 61379 22799 35938 28064 9076 28953 54758 65851 66383
12617 66383 55538 69199 64342 30095 44553 56504 53638 24633 21826 18855 22198 49412 82710
12604 82710 67523 37226 61325 62033 39765 80654 74538 47396 26466 18610 24453 53853 62429
12591 62429 43072 24791 26669 33057 29192 15126 27510 73283 116570 84382 57822 53411
12579 53411 65694 67213 53028 61030 37236 19044 26308 38972 52998 50179 33900 51990
12567 51990 31058 25762 33225 53447 62100 58997 40273 77172 76209 51744 60798 73427 104132
12554 104132 98980 81741 108349 136590 160979 237889 309030 335431 361126 320695 248462 214805
12542 214805 222736 208839 195549 174651 152972 146987 131254 127403 140784 148168 165902 181593
$$ packed form
12629A70043m0098q650k866n7050l8580J3139p874j8988J9877K5805J1093N32
12617F6383j0845J3661m857l4247J4458J1951k866k9005k807k971L343K7214L3298
12604H2710j5187l0297K4099P08k2268M0889o116k7142k0930p856N843K9400Q576
12591F2429j9357j8281J878O388l865j4066J2384M5773M3287l2188k6560m411
12579E3411J2283J519j4185Q002k3794j8192P264J2664J4026k819j6279J8090
12567E1990k0932n296P463K0222Q653l103j8724L6899r63k4465R054J2629L0705
12554A04132n152j7239K6608K8241K4389P6910P1141K6401K5695m0431p2233l3657
12542B14805P931j3897j3290k0898k1679n985j5733l851J3381P384J7734J5691
$$ plain form
12530 181593 225951 239168 258114 252466 238825 251495 251911 236503 219848 216577 227277 236598
12518 236598 219897 197766 217970 235414 294391 321997 317416 271115 263227 228509 207888 177122
12506 177122 158720 154161 158763 185041 217596 221191 213545 230265 234622 230337 207502 224325 216387
12493 216387 179327 160567 195262 200856 191928 153963 194987 240319 270146 286118 305747 333139
12481 333139 337752 318828 307039 303333 226532 159240 125670 106568 105471 143636 141685 113382
12469 113382 80116 59281 37497 25911 38134 41870 43766 40233 17582 3810 4037 57592
12457 57592 69507 35421 -4976 -3529 9856 -9463 18694 52733 63208 44647 32692 40103
12445 40103 69744 47108 7876 -12891 -26212 -19390 4785 16594 -28298 -53960 -25402 -3834
$$ packed form
12530A81593M4358J3217J8946n648j3641J2670M16j5408j6655l271J0700R321
12518B36598j6701k2131K0204J7444N8977K7606m581m6301p888l4718k0621l0766
12506A77122j8402m559M602K6278L2555L595p646J6720M357m285k2835J6823p938
12493B16387l7060j8760L4695N594q928l7965M1024M5332K9827J5972J9629K7392
12481C33139M613j8924j1789l706p6801o7292l3570j9102j097L8165j951k8303
12469A13382l3266k0835k1784j1586J2223L736J896l533k2651j3772K27N3555
12457E7592J1915l4086m0397J447J3385j9319K8157L4039J0475j8561j1955P411
12445D0103K9641k2636l9232k0767j3321O822K4175J1809m4892k5662K8558K1568
$$ plain form
12433 -3834 17566 8831 4913 -8655 -6535 10382 30206 26121 19818 41839 43526 41220 52310
12420 52310 63335 21629 4807 27640 30781 29795 36894 47257 27965 34529 27574 27084 25159
12407 25159 2516 3041 43111 41854 27491 33454 19998 -15807 -34952 -29948 -30751 -12703 -3021
12394 -3021 14842 29279 18699 -16718 -29729 -36270 -3406 11618 26171 32505 -447 -14842
12382 -14842 33382 53723 42719 37595 35901 47722 61178 67226 66475 75680 59582 42049 26773
12369 26773 32697 49138 52934 72075 47753 61498 78386 64344 65942 74305 126218 159101
12357 159101 167461 194700 252192 313251 454671 717183 1205880 1769376 1817213 1369108 886688
12346 886688 540143 360816 268334 239330 187031 137850 103290 100600 114460 147538 143688
$$ packed form
12433c834K1400q735l918j3568K120J6917J9824m085o303K2021J687k306J1090
12420E2310J1025m1706j6822K2833L141r86P099J0363j9292O564o955m90j925
12407B5159k2643N25M0070j257j4363N963j3456l5805j9145N004q03J8048R682
12394c021J7863J4437j0580l5417j3011o541L2864J5024J4553O334l2952j4395
12382a4842M8224K0341j1004n124j694J1821J3456O048p51R205j6098j7533j5276
12369B6773N924J6441L796J9141k4322J3745J6888j4042J598Q363N1913L2883
12357A59101Q360K7239N7492O1059J41420K62512M88697N63496M7837m48105m82420
12346H86688l46545j79327r2482k9004n2299m9181l4560k690J3860L3078l850
$$ plain form
12335 143688 91293 49044 56633 39667 58007 68953 54806 43702 44744 18025 -9499 -13523
12323 -13523 -489 172 -4326 5908 33204 36265 35255 44623 30843 24901 25004 8039 -11401
12310 -11401 18181 16093 3805 8042 25625 34669 7415 -4593 -20068 -27299 -20923 -19697 -3864
12297 -3864 -9991 -15305 -4017 20514 18767 -5614 -15205 -22302 2805 26064 27243 11093 9067
12284 9067 -3557 3419 -9969 -13571 -8768 -16175 -39780 -35372 -3045 -9778 -1693 3207 28 -2079
12270 -2079 451 37233 28958 520 -15588 -10305 -3633 -20032 -10800 -31788 -42402 -40941 -51373
12257 -51373 -29659 20761 25226 19594 6422 16128 19174 45859 54067 44985 34009 33987 5735
12244 5735 -13370 -901 26389 7415 -2310 591 -25512 -20260 8135 26722 -4068 -25785
$$ packed form
12335A43688n2395m2249P589j6966J8340J0946j4147j1104J042k6719k7524m024
12323a3523J3034O61m498J0234K7296L061j010R368j3780n942J03j6965j9440
12310a1401K9582k088j2288M237J7583R044k7254j2008j5475p231O376J226J5833
12297c864o127n314J1288K4531j747k4381r591p097K5107K3259J179j6150k026
12284I067j2624O976j3388l602M803p407k3605M408L2327o733Q085M900l179k107
12270b079K530L6782q275k8438j6108N283O672j6399R232k0988j0614J461j0432
12257e1373K1714N0420M465n632j3172R706L046K6685Q208r082j0976k2k8252
12244E735j9105J2469K7290j8974r725K901k6103N252K8395J8587l0790k1717
$$ plain form
12232 -25785 -14961 -11640 -3954 -8309 -10149 1976 18178 6989 -24264 -24319 -28058 -16469 24334
12219 24334 47753 50378 20721 -7329 -29170 -14482 2746 19025 10377 1983 15758 23107
12207 23107 14953 28677 43152 53627 30832 21355 -11289 -26599 -26170 -9494 -15378 -21464 -8037
12194 -8037 -3954 -7710 -26812 -24641 1738 -742 -40532 -18488 17315 24713 16433 6124 -4172
12181 -4172 -17078 -16897 793 6295 15434 -21905 -44916 -50473 -63827 -53745 -20796 4487 13416
12168 13416 17867 13139 -3482 -13945 -7673 6625 15046 19057 25171 6979 -43881 -72748 -50452
12155 -50452 -25377 -9573 -8533 -11779 7633 860 17383 7067 -17755 -500 45642 23657
12143 23657 29762 54173 75402 89171 84755 61782 15695 6260 20965 45651 54126 55621 34077
$$ packed form
12232b5785J0824L321P686m355j840J2125J6202j1189l1253n5l739J1589M0803
12219B4334K3419K625k9657k8050k1841J4688J7228J6279q648q394J3775P349
12207B3107q154J3724J4475J0475k2795r477l2644j5310M29J6676n884o086J3427
12194h037M083l756j9102K171K6379k480l9790K2044L5803P398q280j0309j0296
12181d172j2906J81J7690N502R139l7339k3011n557j3354J0082L2949K5283Q929
12168A3416M451m728j6621j0463O272J4298Q421M011O114j8192n0860k8867K2296
12155e0452K5075J5804J040l246J9412o773J6523j0316k4822J7255M6142k1985
12143B3657O105K4411K1229J3769m416k2973m6087r435J4705K4686Q475J495k1544
$$ plain form
12130 34077 28600 52086 49122 25755 18791 37306 40802 19311 18618 6367 28622 23050 1554
12117 1554 -8120 7096 -4887 -16144 4228 -4559 17492 14837 -30506 -26543 -23142 -22901 -34344
12104 -34344 -50121 -50299 -27360 -38363 -42754 -31463 -21897 -8106 7556 6513 -1624 37728 55262
12091 55262 11632 5414 -1231 -131 3807 -24741 -17206 -14013 -10075 -2052 5058 14535 4298 12184
12077 12184 -7614 -9810 -18696 -30048 -37224 -37237 -6172 11936 21109 7993 9436 11051 -3285
12064 -3285 4028 27270 27645 4050 -3285 399 -17567 -27947 -11354 5216 3801 26377 35037
12051 35037 -6804 -27420 -22099 -25478 -13869 28882 46023 39759 39271 48644 52633 24780 25675
12038 25675 63713 62632 32210 22229 32470 29478 28197 34017 12492 4297 -24275 -43098 -35307
$$ packed form
12130C4077n477K3486k964k3367o964J8515L496k1491o93j2251K2255n572k1496
12117A554r674J5216j1983j1257K0372q787K2051k655m5343L963L401K41j1443
12104c4344j5777j78K2939j1003m391J1291R566J3791J5662j043q137L9352J7534
12091E5262m3630o218o645J100L938k8548P535L193L938Q023P110R477j0237P886
12077A2184j9798k196q886j1352p176j3L1065J8108R173j3116J443J615j4336
12064c285P313K3242L75k3595p335L684j7966j0380J6593J6570j415K2576Q660
12051C5037m1841k0616N321l379J1609M2751J7141o264m88R373L989k7853Q95
12038B5675L8038j081l0422r981J0241k992j281N820k1525q195k8572j8823P791
$$ plain form
12025 -35307 3226 8628 -6858 4727 32926 60280 50659 24949 15198 15330 12841 22760 26917
12012 26917 23043 1900 -9002 -16414 -16050 20721 27503 8755 -3009 11950 20732 37761 10410
11999 10410 -31807 -60368 -62678 -57995 -76769 -41036 11852 16713 29450 23549 -9983 -27084
11987 -27084 -50495 -52231 -22414 -41794 -36877 -24573 21018 39731 61533 81818 81321 51515
11975 51515 16946 -5024 1909 22741 -18564 -16038 -1222 11700 -3640 -18233 -47508 -34174
11963 -34174 -868 12200 -8027 -23631 -44423 -77668 -30400 12077 16554 8326 -15648 236
11951 236 -1514 -5027 -4697 9797 13233 -4435 -24162 -18192 6497 -11998 -20149 -6590 -20899
11938 -20899 -14645 -4282 15016 32695 7088 11484 2735 -18014 -6223 -6487 -14359 4934 9638
$$ packed form
12025c5307L8533N402j5486J1585K8199K7354r621k5710r751J32k489R919M157
12012B6917l874k1143j0902p412L64L6771O782j8748j1764J4959Q782J7029k7351
11999A0410m2217k8561k310M683j8774L5733N2888M861J2737n901l3532j7101
11987b7084k3411j736K9817j9380M917J2304M5591J8713K1802K0285m97k9806
11975E1515l4569k1970O933K0832m1305K526J4816J2922j5340j4593k9275J3334
11963c4174L3306J3068k0227j5604k0792l3245M7268M2477M477q228k3974J5884
11951B36j750l513L30J4494L436j7668j9727N970K4689j8495q151J3559j4309
11938b0899O254J0363J9298J7679k5607M396q749k0749J1791k64p872J9293M704
$$ plain form
11925 9638 21652 41798 40203 41744 30034 -11736 -22114 -33843 -38795 -15536 472 26050
11913 26050 34040 20027 -4897 -32044 -41444 -37832 -11760 27456 35054 22152 20688 1665 19781
11900 19781 9550 -657 3265 2491 -22980 -8659 -6703 -26319 -21205 2585 32564 22439 5707
11887 5707 -929 -28757 -11862 3012 -1128 -15662 -18035 16732 42978 36269 76 -533 17863
11874 17863 -2950 -33125 -39236 -6775 30454 12123 -22017 -4445 20205 24134 -6113 -29245
11862 -29245 -29694 -30963 -33119 -13643 -10067 2198 -2856 9155 -19758 -50786 -55929 -54276 -22504
11849 -22504 -1138 -136 -3666 15718 12655 -10330 -5562 8608 6165 4194 19685 65471 47265
11836 47265 45438 62663 61459 39476 35951 37543 27331 21292 17588 -7429 -8987 -10836 -34224
$$ packed form
11925I638J2014K0146j595J541j1710m1770j0378j1729m952K3259J6008K5578
11913B6050P990j4013k4924k7147r400L612K6072L9216P598j2902j464j9023J8116
11900A9781j0231j0207L922p74k5471J4321J956j9616N114K3790K9979j0125j6732
11887E707o636k7828J6895J4874m140j4534k373L4767K6246o709l6193o09J8396
11874A7863k0813l0175o111L2461L7229j8331l4140J7572K4650L929l0247k3132
11862b9245m49j269k156J9476L576J2265n054J2011k8913l1028n143J653L1772
11849b2504K1366J002l530J9384l063k2985M768J4170k443j971J5491M5786j8206
11836D7265j827J7225j204k1983l525J592j0212o039l704k5017j558j849k3388
$$ plain form
11823 -34224 -25346 -36191 -31621 -4918 -7331 -55076 -55026 -26743 -39317 -4549 27311 33867 17968
11810 17968 19364 26734 33048 17354 -31180 -34797 -11164 -17998 -48597 -66467 -46253 -44318 -32637
11797 -32637 -24336 -18591 -23915 -29483 -13754 6486 -22806 -11225 -23477 -50029 -66829 -58177 -33988
11784 -33988 -28456 -35853 -41841 -53599 -70635 -64327 -60299 -68146 -61245 -49416 -21697 -14803 -11344
11771 -11344 -14840 13238 17080 13667 11059 -4977 2315 754 12669 20899 16531 11737 1037
11758 1037 -21106 -11655 8661 21841 28230 16634 28133 45503 43436 34499 27955 -4847 -65628
11745 -65628 -65443 -33669 13187 43286 18289 -13353 -14539 -28770 -27756 -4845 22525 63973
11733 63973 45716 6422 10840 16121 -12737 -29725 -11183 -13635 -34659 -40590 -37084 -22167 674
$$ packed form
11823c4224Q878j0845M570K6703k413m7745N0K8283j2574L4768L1860O556j5899
11810A7968J396P370O314j5694m8534l617K3633o834l0599j7870K0214J935J1681
11797c2637Q301N745n324n568J5729K0240k9292J1581j2252k6552j6800Q652K4189
11784c3988N532p397n988j1758j7036O308M028p847O901J1829K7719O894L459
11771a1344l496K8078L842l413k608j6036P292j561J1915Q230m368m794j0700
11758A037k2143R451K0316J3180O389j1596J1499J7370k067q937o544l2802o0781
11745f5628J85L1774M6856L0099k4997l1642j186j4231J014K2911K7370M1448
11733F3973j8257l9294M418N281k8858j6988J8542k452k1024n931L506J4917K2841
$$ plain form
11720 674 14553 1104 749 -8804 -2878 -13319 -27137 -38915 -23550 -10344 -29797 -47783 -33624
11707 -33624 12389 20303 -4204 29485 20034 -23701 -6825 -11565 -18429 -23529 -42697 -13609 10222
11694 10222 5435 -43739 -64712 -55775 -38539 -7457 -538 -37331 -43079 -32375 -32287 -42363 -53413
11681 -53413 -36245 10238 32292 18151 13818 28887 25301 -3860 -16132 14473 41839 28687
11669 28687 48468 69388 44517 10645 26233 11488 2592 14050 18842 -4734 7323 18245
11657 18245 -136 -13779 -26664 -26589 -42979 -48381 -48545 -50900 -51966 -18087 -18473 -23724 -24666 -25479 -20120
11642 -20120 -2693 -2108 17661 10760 -16519 -31540 -28564 -28287 -8115 2370 2463 12700 33625
11629 33625 24341 -4898 20834 39308 44168 23536 19644 8195 -32141 7359 15377 -114
$$ packed form
11720F74J3879j3449l55r553N926j0441j3818j1778J5365J3206j9453j7986J4159
11707c3624M6013P914k4507L3689r451m3735J6876m740o864n100j9168K9088K3831
11694A0222m787m9174k0973Q937J7236L1082O919l6793n748J0704Q8j0076j1050
11681e3413J7168M6483K2054j4141m333J5069l586k9161j2272L0605K7366j3152
11669B8687J9781K0920k4871l3872J5588j4745q896J1458M792k3576J2057J0922
11657A8245j8381j3643j2885P5j6390n402j64k355j066L3879l86n251r42q13N359
11642b0120J7427N85J9769o901k7279j5021K976K77K0172J0485R3J0237K0925
11629C3625r284k9239K5732J8474M860k0632l892j1449m0336L9500Q018j5491
$$ plain form
11617 -114 24036 -836 -30733 -41529 4931 -1191 6620 12089 5269 24219 20814 12779 1572
11604 1572 1399 5103 10050 8219 -10342 53 34260 19525 11937 17259 8732 -5921 -9661 -9814
11590 -9814 19254 50688 24376 -10626 -17527 -21113 -2583 -4444 -15640 -19991 -9765 13448 6481
11577 6481 -13499 -24347 -28871 -11189 -16223 -41146 -81568 -86026 -44035 -27115 -1121 -19362
11565 -19362 -22855 -24423 -36585 -51029 -67477 -92665 -63227 -32483 -31945 -43905 -42009 -51131 -60601
11552 -60601 -22188 -18053 -47795 -70261 -29073 -669 -3925 -10966 6407 29489 32896 1791
11540 1791 -26483 -54338 -35342 -46395 -27319 8185 35705 35711 21311 14868 -11248 -1017 22037
11527 22037 34401 2786 -3980 -1754 10316 7782 22791 57119 59607 35427 28113 26332 -7997
$$ packed form
11617a14K4150k4872k9897j0796M6460o122P811N469o820J8950l405q035j1207
11604A572j73L704M947j831j8561J0395L4207j4735p588N322q527j4653l740j53
11590i814K9068L1434k6312l5002o901l586J8530j861j1196m351J0226K3213o967
11577F481j9980j0848m524J7682n034k4923m0422m458M1991J6920K5994j8241
11565a9362l493j568j2162j4444j6448k5188K9438L0744N38j1960J896r122r470
11552f0601L8413M135k9742k2466M1188K8404l256p041J7373K3082L407l1105
11540A791k8274k7855J8996j1053J9076L5504K7520Oj4400o443k6116J0231K3054
11527B2037J2364l1615o766K226J2070k534J5009L4328K488k4180p314j781l4329
$$ plain form
11514 -7997 -34653 -20732 -21870 -20559 -17366 -15031 6409 43535 73419 58799 16461 -22712 -41483
11501 -41483 -60838 -48106 -10985 5232 -9006 -29592 -30166 -30638 -30934 -13132 -10825 -7174 -12079
11488 -12079 -26237 -29749 -9815 -28644 -42804 -16041 3578 -5151 -45366 -57911 -27237 -10199
11476 -10199 -13323 6713 32784 30998 10701 15254 31741 18108 2451 -1008 -17662 -13115 -15369
11463 -15369 -24517 -15159 -27832 -27006 -6826 8293 -3642 -19317 -15404 -19841 -7805 -2614 7299
11450 7299 2047 9795 -23342 -45391 -71012 -69237 -25950 6889 16697 22766 -2760 -14853 10323
11437 10323 8359 1882 -9572 -54103 -49133 -22729 -38230 -82792 -85480 -74173 -56789 -18133
11425 -18133 1801 1702 11182 15401 -10555 -13287 33126 63719 52936 48869 30661 11372 8261
$$ packed form
11514g997k6656J3921j138J311L193K335K1440L7126K9884j4620m2338l9173j8771
11501d1483j9355J2732L7121J6217j4238k0586n74m72k96J7802K307L651m905
11488a2079j4158l512J9934j8829j4160K6763J9619q729m0215j2545L0674J7038
11476a0199l124K0036K6071j786k0297M553J6487j3633j5657l459j6654M547k254
11463a5369r148R358j2673Q26K0180J5119j1935j5675L913m437J2036N191R913
11450G299n252P748l3137k2049k5621J775M3287L2839R808O069k5526j2093K5176
11437A0323j964o477j1454m4531M970K6404j5501m4562k688J1307J7384L8656
11425a8133J9934r9R480M219k5956k732M6413L0593j0783m067j8208j9289l111
$$ plain form
11412 8261 7871 -5026 9576 2297 4233 7093 34790 57866 38194 18794 25834 34083 35990
11399 35990 19335 -26712 -36553 -28214 -11111 -29224 -31536 -18973 -26383 -42413 -25183 3325
11387 3325 -25176 -24521 -7680 -3488 16486 719 1834 953 5342 28181 32292 24967 -25029 -30879
11373 -30879 -57887 -40194 -21762 -38148 -25145 -29437 -24505 5577 43045 64512 61216 21708
11361 21708 15152 26982 20457 -23266 -32842 -37384 -42924 -9989 40510 49384 43631 37894 1555
11348 1555 769 26822 45232 42841 46685 61023 39032 14324 -22817 -27268 -5983 37425 44067
11335 44067 29387 31333 20764 13596 4109 -2289 5671 24032 22887 -14753 1321 11506 23583
11322 23583 54251 43865 53406 109796 140875 153039 173371 185908 198088 229853 259792 317501
$$ packed form
11412H261l90j2897J4602p279J936K860K7697K3076j9672j9400P040Q249J907
11399C5990j6655m6047r841Q339J7103j8113k312J2563p410j6030J7230K8508
11387C325k8501O55J6841M192J9974j5767J115q81M389K2839M111p325m9996n850
11373c0879k7008J7693J8432j6386J3003m292M932L0082L7468K1467l296l9508
11361B1708o556J1830o525m3723r576m542n540L2935N0499Q874n753n737l6339
11348A555p86K6053J8410k391L844J4338k1991k4708l7141m451K1285M3408O642
11335D4067j4680J946j0569p168r487o398P960J8361j145l7640J6074J0185J2077
11322B3583L0668j0386R541N6390L1079J2164K0332J2537J2180L1765K9939N7709
$$ plain form
11310 317501 373007 367416 331664 269581 214711 178881 160962 140989 113219 105766 120000 136902
11298 136902 130798 145992 169446 211699 218185 222809 211656 183593 167747 186486 182605 144456
11286 144456 167203 167583 183828 223408 221318 263896 314581 334342 319819 345081 352034 292635
11274 292635 243022 222107 227268 206975 200456 188171 178853 152913 136179 166306 209160 242080
11262 242080 234320 231428 200959 161492 156921 143553 135933 133930 121730 120867 134090 155390 179488
11249 179488 245812 289388 307877 363051 350357 300237 258880 235589 210620 185652 170080
11238 170080 124768 78067 83331 85948 66075 54804 63927 78375 91368 79409 67763 67166
11226 67166 77323 74093 52222 6148 6295 22144 66423 82755 78809 81191 81400 59310 41336
$$ packed form
11310C17501N5506n591l5752o2083n4870l5830j7919j9973k7770p453J4234J6902
11298A36902o104J5194K3454M2253O486M624j1153k8063j5846J8739l881l8149
11286A44456K2747L80J6245L9580k090M2578N0685J9761j4523K5262O953n9399
11274B92635m9613k0915N161k0293o519j2285r318k5940j6734L0127M2854L2920
11262B42080p760k892l0469l9467m571j3368p620k003j2200q63J3223K1300K4098
11249A79488O6324M3576J8489N5174j2694n0120m1357k3291k4969k4968j5572
11238A70080m5312m6701N264K617j9873j1271R123J4448J2993j1959j1646n97
11226F7166J0157l230k1871m6074J47J5849M4279J6332l946K382K09k2090j7974
$$ plain form
11213 41336 7790 -2878 -16375 4771 4959 35413 83578 65990 63866 66058 70790 70128 41765
11200 41765 4955 -23466 -45338 -56244 -31786 -24031 -21728 -21717 807 -3501 -23283 10985 8577
11187 8577 -6984 -5135 -33682 -57855 -67087 -62117 -24697 -22033 -3515 36507 56417 50836 62044
11174 62044 36538 41360 46215 73173 86527 82071 52187 29871 22077 25616 9106 -2636 18173
11161 18173 31244 42447 20061 40380 40461 23195 3706 18629 41674 29491 10064 13766
11149 13766 30527 52008 27804 29442 40227 59592 31061 -3023 -10045 -34409 -34456 -24631 -6434
11136 -6434 1676 37989 75226 88483 80808 64575 39979 22610 22827 55192 51468 58252 45321
11123 45321 53495 38785 37437 26250 20093 40307 35499 41032 46933 64176 74230 81454 87766
$$ packed form
11213D1336l3546j0668j3497K1146J88L0454M8165j7588k124K192M732o62k8363
11200D1765l6810k8421k1872j0906K4458P755K303J1K2524m308j9782L4268k408
11187H577j5561J849k8547k4173r232M970L7420K664J8518M0022J9910n581J1208
11174F2044k5506M822M855K6958J3354m456k9884k2316p794L539j6510j1742K0809
11161A8173J3071J1203k2386K0319Q1j7266j9489J4923K3045j2183j9427L702
11149A3766J6761K1481k4204J638J0785J9365k8531l4084p022k4364m7R825J8197
11136f434Q110L6313L7237J3257p675j6233k4596j7369K17L2365l724O784j2931
11123D5321Q174j4710j348j1187o157K0214m808N533N901J7243J0054P224O312
$$ plain form
11110 87766 74018 74554 75788 48695 12365 -5540 -19638 4433 32422 25309 15536 25048 25026
11097 25026 43462 60027 63920 51014 61690 59568 34273 30974 50800 66976 64749 70032 37578
11084 37578 34430 57207 55941 70497 75938 47881 60671 86356 88202 88417 83179 63436 48899
11071 48899 39262 29666 33003 36370 15588 7637 40250 57354 50270 20753 18636 9480 6073
11058 6073 9625 12964 48572 60098 56711 36541 46095 49162 40819 8087 17754 33970 32563
11045 32563 25858 39133 56306 80944 104581 94997 84623 39752 21328 49922 77407 62632
11033 62632 68551 42284 50858 64183 85263 115084 126034 132917 128223 130559 144593 170312 178603
11020 178603 219176 245575 287689 339957 377681 410944 419440 385560 381033 333873 284978 256766
$$ packed form
11110H7766j3748N36J234k7093l6330j7905j4098K4071K7989p113r773R512k2
11097B5026J8436J6565L893j2906J0676k122k5295l299J9826J6176k227N283l2454
11084C7578l148K2777j266J4556N441k8057J2790K5685J846K15n238j9743j4537
11071D8899r637r596L337L367k0782p951L2613J7104p084k9517k117r156l407
11058F073L552L339L5608J1526l387k0170R554L067q343l2732R667J6216j407
11045C2563o705J3275J7173K4638K3637r584j0374m4871j8424K8594K7485j4775
11033F2632N919k6267Q574J3325K1080K9821J0950O883m694K336J4034K5719Q291
11020A78603M0573K6399M2114N2268L7724L3263Q496l3880m527m7160m8895k8212
$$ plain form
11008 256766 253258 228130 206961 193471 189904 237863 264979 237295 208346 235598 246021 218242
10996 218242 165308 139182 146961 139821 108703 93173 101302 120188 115678 123129 118748 137309 162681
10983 162681 171083 189964 190117 195258 151346 110253 123775 143747 140072 158045 141922 141729 147868
10970 147868 167157 205535 227082 238384 256030 267616 269144 233351 182816 142199 109341 95890
10958 95890 121300 160457 203263 206933 181553 165615 161205 144356 138035 152535 134214 147127
10946 147127 171176 187100 213786 205008 210724 204133 211541 210869 252778 294026 308577 286920 270326
10933 270326 251300 257953 259209 263226 258109 289684 296224 289009 256058 224115 231020 257882 262657
10920 262657 258655 290477 298725 298400 317644 341094 352896 358018 388830 450697 483502 482550 483113
$$ packed form
11008B56766l508k5128k1169j3490l567M7959K7116k7684k8949K7252J0423k7779
10996B18242n2934k6126P779p140l1118j5530Q129J8886m510P451m381J8561K5372
10983A62681Q402J8881J53N141m3912m1093J3522J9972l675J7973j6123j93O139
10970A47868J9289L8378K1547J1302J7646J1586J528l5793n0535m0617l2858j3451
10958I5890K5410L9157M2806L670k5380j5938m410j6849o321J4500j8321J2913
10946A47127K4049J5924K6686q778N716o591P408o72M1909M1248J4551k1657j6594
10933B70326j9026O653J256M017n117L1575O540p215l2951l1943O905K6862M775
10920B62657m002L1822Q248l25J9244K3450J1802N122L0812O1867L2805r52N63
$$ plain form
10907 483113 524130 574505 645960 712463 756053 812143 868857 936960 1033840 1118877 1209874
10896 1209874 1315904 1450141 1571408 1718789 1904039 2171758 2467332 2831107 3219593
10887 3219593 3693920 4310580 5098771 6082403 7377788 9084674 11382175 14690877 19492625
10878 19492625 26216699 35251130 46629489 59005909 68666664 71495617 67189310 58979043
10870 58979043 49914121 41527412 34459915 28946933 24930764 22376963 21292164 21656818
10862 21656818 23552989 26896622 31167818 35463794 38823955 40620431 40761075 39262830
10854 39262830 36212658 32308022 28503728 25545337 23824868 23593413 24851405 27626117
10846 27626117 31921105 37688142 44765704 52636367 59929850 64680234 65425966 61903904
$$ packed form
10907D83113M1017N0375P1455O6503M3590N6090N6714O8103R6880Q5037R0997
10896A209874J06030J34237J21267J47381J85250K67719K95574L63775L88486
10887C219593M74327O16660P88191R83632J295385J706886K297501L308702M801748
10878A9492625O724074R034431J1378359J2376420R660755K828953m306307q210267
10870E8979043r064922q386709p067497n512982m016169k553801j084799L64654
10862B1656818J896171L343633M271196M295976L360161J796476J40644j498245
10854C9262830l050172l904636l804294k958391j720469k31455J257992K774712
10846B7626117M294988N767037P077562P870663P293483M750384P45732l522062
$$ plain form
10838 61903904 55320964 47599625 40413228 34516997 30087954 27203414 25921272 26251861
10830 26251861 28097308 31138516 34733284 37945061 39921508 40366655 39271564 36550483
10822 36550483 32546342 28073758 24062360 21199401 19759921 19664084 20849516 23314779
10814 23314779 27179213 32582340 39708834 48367930 57572089 65369314 68600413 64885543
10806 64885543 55520328 44362270 34379673 26499652 20658107 16433232 13326299 11053531
10798 11053531 9343931 7976008 6885813 5980283 5212085 4581913 4048197 3596525 3201786
10789 3201786 2855683 2604877 2371749 2151497 1962950 1803346 1676142 1557106 1436904
10780 1436904 1349177 1265607 1174819 1086512 1043727 1024379 992880 958336 905442 849613 813972
$$ packed form
10838F1903904o582940p721339p186397n896231m429043k884540j282142L30589
10830B6251861J845447L041208L594768L211777J976447M45147j095091k721081
10822C6550483m004141m472584m011398k862959j439480r5837J185432K465263
10814B3314779L864434N403127P126494Q659096R204159P797225L231099l714870
10806F4885543r365215j1158058r982597p880021n841545m224875l106933k272768
10798A1053531j709600j367923j090195r05530p68198o30172n33716m51672l94739
10789C201786l46103k50806k33128k20252j88547j59604j27204j19036j20202
10780A436904q7727q3570r0788q8307m2785j9348l1499l4544n2894n5829l5641
$$ plain form
10769 813972 813608 806655 738337 701549 692658 658340 638143 616020 579234 558611 570784 521853
10757 521853 475052 503829 527243 546686 513691 515721 507493 481423 451427 417029 382572 353219
10745 353219 329744 292687 247913 260099 284132 295539 342186 355127 283718 251671 253905 270912
10733 270912 282144 255053 245419 233126 234201 248435 257200 247526 218435 202975 218709 228963
10721 228963 229987 230256 227598 229553 201096 204912 208045 188620 163594 139390 141530 123701 132192
10708 132192 155018 154234 148459 184697 202119 203921 184624 158562 146352 122837 114061 133497
10696 133497 148958 128603 88216 78077 84768 107873 127893 123322 126435 146098 149371 143924
10684 143924 117784 80802 75494 70314 83616 79234 61548 82445 81154 58332 79913 109610
$$ packed form
10769H13972l64o953o8318l6788q891l4318k0197k2123l6786k0623J2173m8931
10757E21853m6801K8777K3414J9443l2995K030q228k6070k9996l4398l4457k9353
10745C53219k3475l7057m4774J2186K4033J1407M6647J2941p1409l2047K234J7007
10733B70912J1232k7091r634j2293J075J4234Q765r674k9091j5460J5734J0254
10721B28963J024K69k658J955k8457L816L133j9425k5026k4204K140j7829Q491
10708A32192K2826p84n775L6238J7422J802j9297k6062j2210k3515q776J9436
10696A33497J5461k0355m0387j0139O691K3105K0020m571L113J9663L273n447
10684A43924k6140l6982n308n180J3302m382j7686K0897j291k2822K1581K9697
$$ plain form
10672 109610 150023 172979 184379 196071 216896 249118 262397 232483 205784 163139 130556
10661 130556 97513 91024 103079 124957 120562 130207 131442 93037 68117 65716 75055 53724 41625
10648 41625 52342 42823 21392 24105 28595 48018 68309 67333 39813 41938 60025 47655 19407
10635 19407 -3879 -14313 -4493 -5579 35184 43352 29579 11874 15040 45252 65655 62857 55846
10622 55846 48108 78276 77521 32898 17866 50357 57496 25950 35146 34935 29356 35041 23069
10609 23069 22919 21402 9909 9489 17127 36518 39302 49991 55900 56526 76470 52280 50927 21454
10595 21454 28420 53711 54877 74566 73116 65564 70968 75310 48324 22083 9937 23639 63532
10582 63532 81148 92836 77047 33589 37897 49963 59008 48758 43178 57569 46375 61784
$$ packed form
10672A09610M0413K2956J1400J1692K0825L2222J3279k9914k6699m2645l2583
10661A30556l3043o489J2055K1878m395R645J235l8405k4920k401R339k1331j2099
10648D1625J0717r519k1431K713M490J9423K0291r76k7520K125J8087j2370k8248
10635A9407k3286j0434R820j086M0763Q168j3773j7705L166L0212K0403k798p011
10622E5846p738L0168p55m4623j5032L2491P139l1546R196k11n579N685j1972
10609B3069j50j517j1493m20P638J9391K784J0689N909O26J9944k4190j353k9473
10595B1454O966K5291J166J9689j450p552N404M342k6986k6241j2146J3702L9893
10582F3532J7616J1688j5789m3458M308J2066R045j0250n580J4391j1194J5409
$$ plain form
10570 61784 70170 64985 50223 44647 62098 67528 35979 -727 5073 -17091 -23041 -11990 -8789
10557 -8789 25886 58715 60757 66458 50558 23834 22319 26076 17023 -11670 -22087 -13987 4624
10544 4624 29248 44360 35937 22760 30088 38234 29899 12753 15155 5912 -16402 9459 39214
10531 39214 47017 71399 66405 24939 3897 7434 -13100 -15749 -17609 -41119 -47844 -53560 -42878
10518 -42878 -31571 5452 19902 11734 -402 18549 5135 -6828 -10482 4487 58867 65089
10506 65089 16461 -10568 -12823 -706 8311 32388 60534 63167 58273 72399 71274 76026 88355
10493 88355 73565 63619 56636 44440 36251 -4073 -5492 26434 30975 22761 6635 -5406 5349
10480 5349 -16785 -25047 -1309 -7374 -22010 -28974 -11579 22418 14343 9019 -25022 -36839 4258
$$ packed form
10570F1784Q386n185j4762n576J7451N430l1549l6706N800k2164n950J1051L201
10557h789L4675L2829K042N701j5900k6724j515L757r053k8693j0417Q100J8611
10544D624K4624J5112q423j3177P328Q146q335j7146K402r243k2314K5861K9755
10531C9214P803K4382m994m1466k1042L537k0534k649j860k3510o725n716J0682
10518d2878J1307L7023J4450q168j2136J8951j3414j1963l654J4969N4380O222
10506F5089m8628k7029k255J2117R017K4077K8146K633m894J4126j125M752J2329
10493H8355j4790r946o983j2196q189m0324j419L1926M541q214j6126j2041J0755
10480E349k2134q262K3738o065j4636o964J7395L3997q075n324l4041j1817M1097
$$ plain form
10467 4258 23312 34483 43641 62400 67879 42609 39714 15421 7384 7749 9736 16848 15983 16728
10453 16728 36622 59155 63724 102958 162377 204021 169489 158003 168068 150397 115072 84349
10441 84349 89700 93591 91596 111905 103434 130982 171589 198054 256585 313427 371118 361771 356429
10428 356429 328111 302353 273992 249339 217151 166855 178361 153931 135064 121020 113607 140436
10416 140436 165616 180084 231242 234858 217048 201346 181516 174033 186510 187865 206491 229831
10404 229831 252092 236007 275997 328392 341355 338203 351100 352528 316955 271058 242540 222325
10392 222325 179248 163136 153256 159118 145663 138563 119690 125802 158631 174018 191371 215221
10380 215221 227657 234269 206850 177576 146957 121947 113728 115760 113554 115501 131405 172354
$$ packed form
10467D258J9054J1171R158J8759N479k5270k895k4293q037L65J987P112q65P45
10453A6728J9894K2533M569L9234N9419M1644l4532j1486J0065j7671l5325l0723
10441H4349N351L891j995K0309q471K7548M0607K6465N8531N6842N7691r347n342
10428C56429k8318k5758k8361k4653l2188n0296J1506k4430j8867j4044p413K6829
10416A40436K5180J4468N1158L616j7810j5702j9830p483J2477J355J8626K3340
10404B29831K2261j6085L9990N2395J2963l152J2897J428l5573m5897k8518k0215
10392B22325m3077j6112r880N862j3455p100j8873O112L2829J5387J7353K3850
10380B15221J2436O612k7419k9274l0619k5010q219K032k206J947J5904M0949
$$ plain form
10368 172354 190405 253837 307940 321573 343847 348153 296097 229549 210540 202343 166974 132308
10356 132308 111759 80385 73719 78837 53611 38453 33070 11247 29612 35605 15684 1567
10344 1567 25815 71339 57765 37296 21981 11816 38335 44172 28331 50306 38513 22982
10332 22982 6650 2927 34169 26258 -3269 -2148 6133 13160 25418 19866 -22498 -31294 -822
10319 -822 11333 -8190 -33291 -11567 4472 12086 41197 23532 -24948 -29619 -13958 -29289
10307 -29289 -18725 -6456 7736 33916 38272 45930 64283 63617 42109 33418 24547 44968 64304
10294 64304 52871 47526 37006 21909 2206 -6440 -41899 -49485 -48900 -79491 -71270 -31351 -21425
10281 -21425 -20749 -18288 3476 31964 39353 15325 26072 -12091 -62258 -53651 -39613 23356 35741
$$ packed form
10368A72354J8051O3432N4103J3633K2274M306n2056o6548j9009q197l5369l4666
10356A32308k0549l1374o666N118k5226j5158n383k1823J8365N993j9921j4117
10344A567K4248M5524j3574k0469j5315j0165K6519N837j5841K1975j1793j5531
10332B2982j6332l723L1242p911k9527J121Q281P027J2258n552m2364q796L0472
10319h22J2155j9523k5101K1724J6039P614K9111j7665m8480m671J5661j5331
10307b9289J0564J2269J4192K6180M356P658J8353o66k1508q691q871K0421J9336
10294F4304j1433n345j0520j5097j9703q646l5459p586N85l0591Q221L9919R926
10281b1425O76K461K1764K8488P389k4028J0747l8163n0167Q607J4038O2969J2385
$$ plain form
10268 35741 11010 -28476 -29338 -11599 4008 22557 8545 -28664 -57508 -34960 -9224 -28403
10256 -28403 -32336 -3969 -19112 -43594 -30847 -18880 -7183 14046 25147 37851 43920 66224
10244 66224 62772 34748 32005 22652 25845 21845 -535 -24087 -30468 -11208 -1654 -12851 431
10231 431 -2416 -1061 16246 -4664 3366 5323 25112 9973 -7435 -11927 -5769 13783 38025
10218 38025 48607 10237 -4449 9020 -7100 -19564 -10219 15100 22141 23291 13016 -14421
10206 -14421 -18255 -1474 -19300 -29224 -16663 -12710 9831 20406 33204 39424 734 -12928
10194 -12928 -12963 -33822 -69262 -73335 -71033 -82299 -87700 -79811 -23471 31318 24680 19752 26069 40378
10180 40378 72633 58747 65867 58951 91490 148505 165488 143960 58282 30650 28213 -830
$$ packed form
10268C5741k4731l9486q62J7739J5607J8549j4012l7209k8844K2548K5736j9179
10256b8403l933K8367j5143k4482J2747J1967J1697K1229J1101J2704O069K2304
10244F6224l452k8024k743r353L193m000k2380k3552o381J9260R554j1197J3282
10231D31k847J355J7307k0910Q030J957J9789j5139j7408m492O158J9552K4242
10218C8025J0582l8370j4686J3469j6120j2464R345K5319P041J150j0275k7437
10206a4421l834J6781j7826r924J2561L953K2541J0575J2798O220l8690j3662
10194a2928l5k0859l5440m073K302j1266n401P889N6340N4789o638m928O317J4309
10180D0378L2255j3886P120o916L2539N7015J6983k1528q5678k7632k437k9043
$$ plain form
10168 -830 -22241 -7591 -5333 -47792 -57185 -69895 -43514 -29232 -19154 -24741 -41445 -46694 -26916
10155 -26916 -25140 -35188 -30550 -11730 -8633 -30078 -42609 -61614 -77522 -43606 -28439 -23240
10143 -23240 -22924 -11442 3927 -16438 -18122 12127 44799 34127 -12804 -3826 10018 10219 15471
10130 15471 -4118 -7673 -16615 -24161 -23710 -17185 -47328 -47138 8363 15196 32562 37522 -10223 15245
10116 15245 36221 21078 -11567 -29382 -24306 -7893 14794 8805 6810 66901 69792 63402 53356
10103 53356 34351 25413 71248 97454 75696 58326 68537 46948 34002 35516 52521 74356
10091 74356 43563 14845 24652 21979 36642 35509 23448 48331 32058 29455 44936 83348
10079 83348 110583 113668 113129 117796 106102 105568 106994 131120 170188 189190 201869 242839 314997
$$ packed form
10168h30k1411J4650K258m2459r393j2710K6381J4282J0078n587j6704n249J9778
10155b6916J776j0048M638J8820L097k1445j2531j9005j5908L3916J5167N199
10143b3240L16J1482J5369k0365j684L0249L2672j0672m6931Q978J3844K01N252
10130A5471j9589l555q942p546M51O525l0143J90N5501O833J7366M960m7745K5468
10116A5245K0976j5143l2645j7815N076J6413K2687n989j995O0091K891o390j0046
10103E3356j9005q938M5835K6206k1758j7370J0211k1589j2946J514J7005K1835
10091G4356l0793k8718R807k673J4663j133j2061K4883j6273k603J5481L8412
10079H3348K7235L085n39M667j1694n34J426K4126L9068J9002J2679M0970P2158
$$ plain form
10066 314997 410154 562114 667080 650930 602932 600738 649965 751582 905190 1075563 1309287
10055 1309287 1626549 2120204 2887237 4049277 5996300 9700373 17325419 32732582
10047 32732582 55059442 57301414 37950533 20955034 12499701 8359644 6112178 4787346
10039 4787346 3863361 3111999 2525734 2090721 1774321 1479282 1255313 1107176 967237
10030 967237 869472 836628 891815 898339 745605 606080 519986 432613 353168 324257 283235
10019 283235 235483 213220 206129 206894 204995 221435 217109 182598 169044 174343 161342 166025 155735
10006 155735 152215 139529 122983 118714 87441 95302 101396 101634 77853 91482 86942 59540 50208
9993 50208 33419 29070 49476 34293 38467 39260 36057 54041 68185 59146 62361 53245 61079 74347
$$ packed form
10066C14997R5157J51960J04966j6150m7998k194M9227J01617J53608J70373K33724
10055A309287L17262M93655P67033J162040J947023L704073P625046J5407163
10047C2732582K2326860K241972j9350881j6995499q455333m140057k247466j324832
10039D787346r23985p51362n86265m35013l16400k95039k23969j48137j39939
10030I67237r7765l2844N5187O524j52734j39525q6094q7373p9445k8911m1022
10019B83235m7752k2263p091P65j899J6440m326l4511j3554N299j3001M683j0290
10006A55735l520j2686j6546m269l1273P861O094K38k3781J3629m540k7402r332
9993E0208j6789m349K0406j5183M174P93l203J7984J4144r039L215r116P834J3268
$$ plain form
9979 74347 73421 63018 59090 46962 40113 19604 17499 -286 4092 18247 23601 30897 50389
9966 50389 22441 12145 -5569 -10747 -9533 -18068 -2129 -11664 -15414 15113 35133 60537 73581
9953 73581 50282 20742 20582 17592 -1046 23275 81524 76478 33497 9307 34174 54137 52053
9940 52053 71487 70881 48971 -9809 -6264 25273 35901 29318 2877 10143 29403 22320 12810
9927 12810 49009 71568 81980 39423 9973 10516 27473 5421 -17511 -10261 4360 16331
9915 16331 -12865 -31343 -27403 -5815 27690 24179 -30014 -25461 -31088 -55457 -38855 -13725 -11564
9902 -11564 -18731 -20402 -12785 -27718 1876 34753 33416 8202 -22791 -24041 -3306 -10784 -18596
9889 -18596 -20240 -22355 -22937 -15880 -11753 -3324 1840 22769 3397 -18216 -2914 4454 9516 18403
$$ packed form
9979G4347r26j0403l928j2128o849k0509k105j7785M378J4155N354P296J9492
9966E0389k7948j0296j7714n178J214q535J5939r535l750L0527K0020K5404J3044
9953G3581k3299k9540j60k990j8638K4321N8249n046m2981k4190K4867J9963k084
9940E2053J9434o06k1910n8780L545L1537J0628o583k6441P266J9260p083r510
9927A2810L6199K2559J0412m2557k9450N43J6957k2052k2932P250J4621J1971
9915A6331k9196j8478L940K1588L3505l511n4193M553n627k4369J6602K5130K161
9902a1564p167j671P617j4933K9594L2877j337k5214l0993j250K0735p478p812
9889a8596j644k115n82P057M127Q429N164K0929j9372k1613J5302P368N062Q887
$$ plain form
9875 18403 11714 21017 51758 18931 -13161 -11405 -14120 -11272 2538 -20672 -20655 537 -4722 6146
9861 6146 22965 42225 43945 40030 21111 -841 -9065 -11981 -13085 -7948 -25140 -48217 -38773
9848 -38773 -22542 -27671 -16281 -23835 -54593 -44344 -29568 -21976 -21316 -31817 -35934 -26441 -7883
9835 -7883 14934 38183 39935 27234 44592 15128 12144 49215 66340 69256 41293 22822 28597
9822 28597 27239 10275 8664 33398 61619 59027 52383 23293 11409 9082 -6795 -17955 -21334
9809 -21334 8899 11892 5118 34510 32807 35203 12920 -21110 -23517 224 15767 41472 40537
9796 40537 28326 -16627 -14026 -2734 537 3828 45254 53633 21836 10701 26002 25525 19004
9783 19004 -19076 -36399 -35889 8252 64636 56303 34456 40775 43000 27059 -27185 -26989 5045
$$ packed form
9875A8403o689R303L0741l2827l2092J756k715K848J3810k3210J7K1192n259J0868
9861F146J6819J9260J720l915j8919k1952q224k916j104N137j7192k3077R444
9848c8773J6231n129J1390p554l0758J0249J4776P592O60j0501m117R493J8558
9835g883K2817K3249J752j2701J7358k9464k984L7071J7125K916k7963j8471N775
9822B8597j358j6964j611K4734K8221k592o644k9090j1884k327j5877j1160l379
9809b1334L0233K993o774K9392j703K396k2283l4030k407K3741J5543K5705r35
9796D0537j2211m4953K601J1292L271L291M1426Q379l1797j1135J5301m77o521
9783A9004l8080j7323N10M4141N6384q333k1847O319K225j5941n4244J96L2034
$$ plain form
9770 5045 10991 7526 20612 36591 31447 33259 25371 1639 -32601 -52629 -51583 -58769 -35173
9757 -35173 -39160 -23439 -23650 -26696 -30128 29335 603 -19452 -18991 -3187 -8903 -33254 -16296
9744 -16296 -3959 -21843 -36737 -17931 -4370 -15321 -26546 -24588 -17107 -7684 -18582 1374
9732 1374 26972 50617 40469 26307 -6457 -9755 9170 6049 19039 13436 5756 17997 -3531
9719 -3531 11070 -2552 -10581 13128 27089 32331 18064 22652 21893 3794 -46620 -32385 -16122
9706 -16122 -41775 -36355 -13918 -14347 24545 13429 -21625 -28737 -30203 -30198 -28361 -20177 -48139 -72545
9692 -72545 -35059 -5396 3975 -8472 2791 103 -22156 -4916 28086 -3066 -44463 -30601
9680 -30601 2257 17136 46883 45861 36742 43856 42552 40436 22630 -26258 -31076 -623 25124
$$ packed form
9770E045N946l465J3086J5979n144J812p888k3732l4240k0028J046p186K3596
9757c5173l987J5721k11l046l432N9463k8732k0055M61J5804n716k4351J6958
9744a6296J2337j7884j4894J8806J3561j0951j1225J958P481R423j0898J9956
9732A374K5598K3645j0148j4162l2764l298J8925l121J2990n603p680J2241k1528
9719c531J4601j3622q029K3709J3961N242j4267M588p59j8099n0414J4235J6263
9706a6122k5653N420K2437m29L8892j1116l5054p112j466NJ837Q184k7962k4406
9692g2545L7486K9663R371j2447J1263k688k2259J7240L3002l1152m1397J3862
9680c0601L2858J4879K9747j022r119P114j304k116j7806m8888m818L0453K5747
$$ plain form
9667 25124 24354 -2535 10315 30109 12418 -9710 -9993 5283 10402 -1172 -2641 -9445 120
9654 120 16341 5277 1850 26008 43719 69350 64330 88158 115749 117158 149360 145671 113622
9641 113622 111783 128817 116355 98322 79751 64000 11812 -14355 -19699 -18992 -12575 -31040 -23643
9628 -23643 -5103 13980 16029 26427 40934 25032 -14834 -10424 -2837 -3761 -14844 -20789 -7264
9615 -7264 4115 -25581 -33942 -18228 -22231 -14975 10167 25746 66956 68623 68829 32772 13374
9602 13374 43271 41295 19531 -9323 -15015 -2577 -10835 -30765 -40401 -44337 -32004 -20702 -432
9589 -432 2223 -17751 -29451 -51430 -30876 -28136 964 5281 -9235 -61236 -45938 3262 12547
9576 12547 1428 -13962 -31255 -15773 -5680 1391 23293 32989 45927 26748 14745 17195
$$ packed form
9667B5124p70k6889J2850J9794j7691k2128k83J5276N119j1574j469o804R565
9654A20J6221j1064l427K4158J7711K5631n020K3828K7591J409L2202l689l2049
9641A13622j839J7034j2462j8033j8571j5751n2188k6167n344P07O417j8465P397
9628b3643J8540J9083K049J0398J4507j5902l9866M410P587r24j1083n945J3525
9615g264J1379k9696q361J5714m003P256K5142J5579M1210J667K06l6057j9398
9602A3374K9897j976k1764k8854n692J2438q258j9930r636l936J2333J1302K0270
9589d32K655j9974j1700k1979K0554K740K9100M317j4516n2001J5298M9200R285
9576A2547j1119j5390j7293J5482J0093P071K1902R696J2938j9179j2003K450
$$ plain form
9564 17195 22982 4464 -1361 1251 24838 30270 29179 41136 21344 -18344 -6656 -15048 -42567
9551 -42567 -50066 -46443 -33545 -9087 -5114 -7509 10833 21775 10545 20434 13424 11579 23987
9538 23987 12414 801 -16796 24505 53113 34573 29284 10951 5791 19225 16503 3618
9526 3618 -13087 -24041 1477 24181 12944 -9873 -20559 -7346 -14922 -16915 -40658 -50489 -19331
9513 -19331 11089 27381 -1353 -18402 8698 17788 14473 13221 -7715 534 29570 28567 5395
9500 5395 -4569 -9140 46 37243 58412 38653 46133 28106 30782 9977 -15832 -3621 12070
9487 12070 46416 23783 -8073 -16797 -32128 -31247 -21012 -28160 -3574 15621 36588 20891 -13258
9474 -13258 -9135 -18745 -53564 -55308 -38322 -9443 15667 -10913 -36988 -50042 -29769 -4378
$$ packed form
9564A7195N787j8518n825K612K3587N432j091J1957j9792l9688J1688q392k7519
9551d2567p499L623J2898K4458L973k395J8342J0942j1230R889p010j845J2408
9538B3987j1573j1613j7597M1301K8608j8540n289j8333n160J3434k722j2885
9526C618j6705j0954K5518K2704j1237k2817j0686J3213p576j993k3743r831L1158
9513a9331L0420J6292k8734j7049K7100R090l315j252k0936Q249K9036j003k3172
9500E395r964m571R186L7197K1169j9759P480j8027K676k0805k5809J2211J5691
9487A2070L4346k2633l1856q724j5331Q81J0235p148K4586J9195K0967j5697l4149
9474a3258M123r610l4819j744J6986K8879K5110k6580k6075j3054K0273K5391
$$ plain form
9462 -4378 29280 33192 33050 30157 32993 -4446 -16911 -5538 -26399 -17663 19036 26307 11066
9449 11066 -5153 -7605 -1691 27612 53236 36227 24923 27880 21031 13581 26077 42834 31047
9436 31047 -669 90 -2378 -14314 -29720 -51188 -57259 -19015 -17184 -24134 -30453 -12522 -12540 -11676
9422 -11676 -18009 3665 21641 31604 43345 50619 59915 72087 80197 70281 44631 28946 8101
9409 8101 3090 8003 -16629 -9029 18139 42076 36134 27079 3148 -4998 -35554 -24052 -36630
9396 -36630 -37314 -27192 -4978 4593 9142 39114 18257 2757 -5646 -11097 27607 31163 9044
9383 9044 45446 60069 45811 20804 -248 6546 6829 -1700 -7373 -249 -7624 15215 16987 -15307
9369 -15307 -22716 -11296 -5624 -22308 -25466 -22003 -10055 -14344 -953 21816 36055 43337 14534
$$ packed form
9462d378L3658L912j42k893K836l7439j2465J1373k0861Q736L6699P271j5241
9449A1066j6219k452N914K9303K5624j7009j1304K957o849p450J2496J6757j1787
9436C1047l1716P59k468j1936j5406k1468o071L8244J831o950o319J7931j8Q64
9422a1676o333K1674J7976R963J1741P274R296J2172Q110r916k5650j5685k0845
9409H101n011M913k4632P600K7168K3937n942r055k3931q146l0556J1502j2578
9396c6630o84J0122K2214R571M549K9972k0857j5500q403n451L8704L556k2119
9383I044L6402J4623j4258k5007k1052O794K83q529n673P124p375K2839J772l2294
9369a5307p409J1420N672j6684l158L463J1948m289J3391K2769J4239P282k8803
$$ plain form
9356 14534 -34687 -31365 -13654 -31461 -31230 -16056 -10759 -13626 -33788 -22568 -20388 -26408 -21891
9343 -21891 1791 6444 -9614 -23312 -26127 -17610 -7321 -20826 -7444 1004 21684 26736 16200
9330 16200 15264 4093 -19036 -28140 -28463 -9202 19056 38779 -29901 -59263 -27853 11564 -3390
9317 -3390 -4934 6357 13264 -14314 -4499 -1064 -17549 -3868 18261 -14986 -13867 6975 26157
9304 26157 47975 47151 28148 45761 34752 35119 60500 53747 18965 27506 58982 60719 45162
9291 45162 11249 5485 -620 -3230 26761 50090 54132 50722 36038 11348 12222 7557 5576 -1723
9277 -1723 -6749 -16471 -6678 18246 -4092 -10260 -8242 -15631 -2935 11440 -3054 3488 14549
9264 14549 16095 23188 24422 37956 47152 50363 30834 -4153 5989 26973 37662 8154 -10004
$$ packed form
9356A4534m9221L322J7711j7807K31J5174N297k867k0162J1220K180o020M517
9343b1891K3682M653j6058j3698k815Q517J0289j3505J3382Q448K0680N052j0536
9330A6200r36j1171k3129r104l23J9261K8258J9723o8680k9362L1410L9417j4954
9317c390j544J1291O907k7578R815L435j6485J3681K2129l3247J119K0842J9182
9304B6157K1818q24j9003J7613j1009L67K5381o753l4782Q541L1476J737j5557
9291D5162l3913n764o105k610K9991K3329M042l410j4684k4690Q74m665j981p299
9277a723n026r722R793K4924k2338o168K018p389J2696J4375j4494O542J1061
9264A4549J546P093J234J3534R196L211j9529l4987J0142K0984J0689k9508j8158
$$ plain form
9251 -10004 11035 24727 20836 -1707 -5011 1013 1456 4134 1985 1560 -17869 -4881 1665 22466
9237 22466 39673 30546 -11912 3222 37712 20799 45926 34169 17493 -10495 -1411 18413
9225 18413 9083 9359 -1630 1927 24310 52569 42780 4702 5293 1035 10076 14327 12622 22755
9211 22755 21119 23456 9447 8906 2105 26935 64436 86227 68091 70240 39889 30460 50812
9198 50812 71197 79115 59930 49880 44876 31570 55061 59497 88101 89878 98122 100423 91312
9185 91312 69020 90834 92909 96857 88975 99808 132544 161448 161736 144581 129280 141440 158756
9172 158756 151470 149785 182858 194326 160793 175021 192246 197053 211380 203006 191288 199550 230591
9159 230591 246993 302484 320676 328180 369378 397010 457258 522390 553057 576254 622291 723188
$$ packed form
9251a0004K1039J3692l891k2543l304O024M43K678k149m25j9429J2988O546K0801
9237B2466J7207r127m2458J5134L4490j6913K5127j1757j6676k7988R084J9824
9225A8413r330K76j0989L557K2383K8259r789l8078N91m258R041M251j705J0133
9211B2755j636K337j4009n41o801K4830L7501K1791j8136K149l0351r429K0352
9198E0812K0385P918j9185j0050n004j3306K3491M436K8604J777Q244K301r111
9185I1312k2292K1814K075L948p882J0833L2736K8904K88j7155j5301J2160J7316
9172A58756p286j685L3073J1468l3533J4228J7225M807J4327q374j1718Q262L1041
9159B30591J6402N5491J8192P504M1198K7632O0248O5132L0667K3197M6037J00897
$$ plain form
9147 723188 828003 940525 1077198 1241452 1433528 1693823 2017172 2446364 3028819 3830714
9137 3830714 4918082 6365026 8261003 10548801 12848189 14303164 14199721 12636586
9129 12636586 10430393 8324316 6600848 5275966 4266200 3511885 2924132 2456288 2092371
9120 2092371 1806038 1563608 1369120 1209042 1048303 944176 860189 767456 678087 616864
9110 616864 572251 531954 502314 491782 426991 372722 338789 330954 331850 321268 308502 303202
9098 303202 302538 274298 268952 244497 210805 181449 159124 136404 115843 103491 106989 125801
9086 125801 156359 157244 136654 102975 87934 102999 83368 71369 48404 39750 22530 33537
9074 33537 65671 86998 84039 85397 91495 122301 112250 97617 82872 61955 59077 77635 66892
$$ packed form
9147G23188J04815J12522J36673J64254J92076K60295L23349M29192N82455Q01895
9137C830714J087368J446944J895977K287798K299388J454975j03443j563135
9129A2636586k206193k106077j723468j324882j009766p54315n87753m67844l63917
9120B092371k86333k42430j94488j60078j60739j04127q3987r2733q9369o1223
9110F16864m4613m0297k9640j0532o4791n4269l3933p835Q96j0582j2766n300
9098C03202o64k8240n346k4455l3692k9356k2325k2720k0561j2352L498J8812
9086A25801L0558Q85k0590l3679j5041J5065j9631j1999k2965q654j7220J1007
9074C3537L2134K1327k959J358O098L0806j0051j4633j4745k0917k878J8558j0743
$$ plain form
9061 66892 24927 1559 29927 35775 51756 75884 85166 96100 102069 107205 104368 82574 75595
9048 75595 68904 67215 87930 92010 52234 27543 3360 -4070 8136 30764 32195 41417 33801
9035 33801 -3994 13994 32599 52800 65528 78099 36300 31012 41896 40567 32666 20003
9023 20003 5688 -3136 3741 23220 5331 -21426 -10810 -6866 11815 18950 -5494 -8636 -21742
9010 -21742 -35189 -7281 592 -32137 -16213 1171 5265 17669 14762 -2242 -28552 -37374 -25950
8997 -25950 -34746 -10556 -692 16453 8775 -1939 15510 -6135 -18629 470 -7786 1045 11818
8984 11818 31351 31874 23489 2075 -9820 4940 43368 37915 19824 3830 -4081 -13165 25932
8971 25932 26860 4239 12174 28501 12948 9285 26465 29772 16095 -25950 -37477 -11029 -9517
$$ packed form
9061F6892m1965k3368K8368N848J5981K4128R282J0934N969N136k837k1794o979
9048G5595o691j689K0715M080l9776k4691k4183p430J2206K2628J431R222p616
9035C3801l7795J7988J8605K0201J2728J2571m1799n288J0884j329p901j2663
9023B0003j4315q824O877J9479j7889k6757J0616L944J8681P135k4444l142j3106
9010b1742j3447K7908P873l2729J5924J7384M094J2404k907j7004k6310q822J1424
8997b5950q796K4190R864J7145p678j0714J7449k1645j2494J9099q256Q831J0773
8984A1818J9533N23q385k1414j1895J4760L8428n453j8091j5994p911r084L9097
8971B5932R28k2621P935J6327j5553l663J7180L307j3677m2045j1527K6448J512
$$ plain form
8958 -9517 -14757 -22054 -24015 -3965 -11478 -10749 12963 -3176 -10980 -1430 12925 3766 26217 36881
8944 36881 38991 28535 5215 -8898 -9449 -26625 7022 39463 22961 13022 10212 17428 26174
8931 26174 -997 -3266 -7935 -14311 -27610 -11383 12435 -10559 -26346 -28052 -22647 -25534 -12116
8918 -12116 -25874 -30859 -38844 -19752 -12736 -15820 7574 35067 23223 18492 38618 3429 -18536
8905 -18536 -22557 -31374 6861 718 -35675 -42872 -9413 24920 24497 41729 45729 24465 45868
8892 45868 50660 -6343 -21987 -32874 -17334 -22411 -28646 -17440 -5212 -16736 11572 39039
8880 39039 14982 6341 10612 -1897 6827 14325 -9109 -16739 -14790 -15785 -7910 27327 47326 37165
8866 37165 26096 9781 21794 67233 104477 94522 77355 44153 33224 36995 33510 23288
$$ packed form
8958i517n240p297j961K0050p513P29K3712j6139p804R550J4355r159K2451J0664
8944C6881K110j0456k3320j4113n51j7176L3647L2441j6502r939k810P216Q746
8931B6174k7171k269m669o376j3299J6227K3818k2994j5787j706N405k887J3418
8918a2116j3758m985p985J9092P016l084K3394K7493j1844m731K0126l5189k1965
8905a8536m021q817L8235o143l6393p197L3459L4333m23J7232M000k1264K1403
8892D5868M792n7003j5644j0887J5540n077o235J1206J2228j1524K8308K7467
8880C9039k4057q641M271j2509Q724P498k3434p630J949r95P875L5237J9999j0161
8866C7165j1069j6315J2013M5439L7244r955j7167l3202j0929L771l485j0222
$$ plain form
8854 23288 18536 24689 20871 12255 1272 4102 4385 -1557 11726 31837 25512 18210 30516 58350
8840 58350 42574 31469 7590 20459 35009 52222 77541 78037 57338 45983 46295 33484 40450
8827 40450 37538 27217 42142 59057 46890 3053 -14035 -15711 -29534 -34811 -18860 -22928 -37067
8814 -37067 -36650 -3864 23388 19913 12262 5442 4676 10399 -11061 -25446 -37689 -33805 -52977 -48456
8800 -48456 -14129 7974 -12265 -9116 9639 14750 8050 -11077 9834 22391 22125 15102 25254
8787 25254 16007 6805 27125 29696 -12247 -16279 -12402 -2360 21754 40162 19775 -5780 -21419
8774 -21419 -19293 -13482 -2267 21647 40606 43704 46883 54202 25495 -10957 1327 1644 4248
8761 4248 -29822 -54123 -62644 -48242 -63481 -61091 -49222 -38452 -69953 -42586 814 25894
$$ packed form
8854B3288m752O153l818q616j0983K830K83n942J3283K0111o325p302J2306K7834
8840E8350j5776j1105k3879J2869J4550J7213K5319M96k0699j1355L12j2811O966
8827D0450k912j0321J4925J6915j2167m3837j7088j676j3823n277J5951m068j4139
8814c7067M17L2786K7252l475p651o820p66N723k1460j4385j2243L884j9172M521
8800d8456L4327K2103k0239L149J8755N111o700j9127K0911J2557k66p023J0152
8787B5254r247r202K0320K571m1943m032L877J0042K4114J8408k0387k5555j5639
8774b1419K126N811J1215K3914J8959L098L179P319k8707l6452J2284L17K604
8761D248l4070k4301q521J4402j5239K390J1869J0770l1501K7367M3400K5080
$$ plain form
8749 25894 50716 36908 23717 25002 32281 -4020 8340 27965 20971 -12680 -19266 1157 18709
8736 18709 33192 8728 -14480 -17959 -19025 -430 20896 17094 9623 4186 29783 41838 10390
8723 10390 -4000 -6022 -2398 -11414 -20837 9687 16308 -11752 -27078 -15063 16739 23912 16472
8710 16472 485 -30963 -20193 12612 17584 34655 21279 9668 10298 1550 -16885 2994 18487
8697 18487 2906 -38259 -56997 -51904 -41995 -37578 -57690 -64134 -59755 -45547 -18731 12508 11839
8684 11839 8997 17749 13511 21295 32538 11789 -42551 -58130 -25011 23281 53290 67730 43971
8671 43971 15910 5063 267 20069 57501 47858 40950 44641 57534 39594 -12391 -39724 -15687
8658 -15687 22863 11938 5719 13224 27093 12056 -8176 -36111 -23375 -28679 -12064 3252
$$ packed form
8749B5894K4822j3808j3191J285P279l6301J2360J9625o994l3651o586K0423J7552
8736A8709J4483k4464k3208l479j066J8595K1326l802p471n437K5597J2055l1448
8723A0390j4390k022L624r016r423L0524O621k8060j5326J2015L1802P173p440
8710A6472j5987l1448J0770L2805M972J7071j3376j1611O30q748j8435J9879J5493
8697A8487j5581m1165j8738N093R909M417k0112o444M379J4208K6816L1239o69
8684A1839k842Q752m238P784J1243k0749n4340j5579L3119M8292L0009J4440k3759
8671D3971k8061j0847m796J9802L7432r643o908L691J2893j7940n1985k7333K4037
8658a5687L8550j0925o219P505J3869j5037k0232k7935J2736n304J6615J5316
$$ plain form
8646 3252 18593 24639 35586 41550 27599 44207 53344 42825 53549 77305 92822 110410 100024
8633 100024 77650 67338 66054 41855 27589 17504 10577 24104 31958 35366 30470 -2710 3179
8620 3179 43145 87321 108515 112122 98386 103028 90190 95875 121192 140154 108320 76563 75962
8607 75962 64929 75717 103027 127203 119029 115910 97599 80944 78315 83224 75618 51658 56551
8594 56551 27909 32200 21544 43743 55241 33900 58355 80300 87449 61403 6677 -12041
8582 -12041 4078 7649 -3759 -24099 -18401 -3661 19511 8233 -1092 18334 34643 40197 27933
8569 27933 -3658 -14382 -28635 -9330 21494 9700 11509 18999 806 17050 13578 35174
8557 35174 25836 5260 -24397 -22067 -27540 -17087 -3922 15249 26322 12665 -16731 -19981 -26444
$$ packed form
8646C252J5341O046J0947N964j3951J6608R137j0519J0724K3756J5517J7588j0386
8633A00024k2374j0312j284k4199j4266j0085o927J3527P854L408m896l3180N889
8620C179L9966M4176K1194L607j3736M642j2838N685K5317J8962l1834l1757o01
8607G5962j1033J0788K7310K4176q174l119j8311j6655k629M909p606k3960M893
8594E6551k8642M291j0656K2199J1498k1341K4455K1945P149k6046n4726j8718
8582a2041J6119L571j1408k0340N698J4740K3172j1278r325J9426J6309N554j2264
8569B7933l1591j0724j4253J9305L0824j1794J809P490j8193J6244l472K1596
8557C5174r338k0576k9657K330n473J0453J3165J9171J1073j3657k9396l250o463
$$ plain form
8544 -26444 -27315 -53415 -43434 -52845 -32440 -28221 -23763 -15818 19142 30247 43308 29170 43000
8531 43000 74433 8171 -34347 -28197 -5175 11873 2858 -11177 -14686 -21725 -21723 -4459 -1556 -28741
8517 -28741 -42141 -25304 -10245 -14993 -22878 -26812 -13378 -13424 -31175 -22485 -19073 -9803 -37840 -53193
8503 -53193 -22425 -13534 -6001 -2035 -3000 -6589 18513 19609 6684 12908 35039 2735 -30620
8490 -30620 -31259 5532 47539 37966 10288 -5680 9485 34160 15252 15770 37354 59939 40301
8477 40301 16928 41770 2757 -10247 14779 25953 3361 -37595 -29285 7232 6394 -15280
8465 -15280 -6762 7462 -1716 -15526 -13309 -8139 -26156 -40226 -48895 -29795 -34250 -42984 -48004
8452 -48004 -17693 3773 -16070 -11700 -10675 -15757 -40066 -51791 -40990 -39322 -26288 -6459 -5500
$$ packed form
8544b6444q71k6100R981r411K0405M219M458P945L4960J1105J3061j4138J3830
8531D3000L1433o6262m2518O150K3022J7048r015j4035l509p039KJ7264K903k7185
8517b8741j3400J6837J5059m748p885l934J3434m6j7751Q690L412R270k8037j5353
8503e3193L0768Q891P533L966r65l589K5102J096j2925O224K2131l2304l3355
8490c0620o39L6791M2007r573k7678j5968J5165K4675j8908N18K1584K2585j9638
8477D0301k3373K4842l9013j3004K5026J1174k2592m0956Q310L6517q38k1674
8465a5280Q518J4224r178j3810K217N170j8017j4070q669J9100m455q734n020
8452d8004L0311K1466j9843M370J025n082k4309j1725J0801J668J3034J9829R59
$$ plain form
8439 -5500 -15383 -10229 -19073 -27141 -23292 -31722 -25184 -5209 8813 14046 8249 -2510 4308 42629
8425 42629 36077 19044 -2809 -3747 17365 8935 -31086 -21213 -15954 1828 32138 48378 27622
8412 27622 16491 33796 34328 5002 -13527 -45365 -26010 3583 29801 7596 -24890 -43083
8400 -43083 -25915 -10145 13651 -6441 -43859 -71178 -81971 -63581 -45182 -38941 -18712 20530
8388 20530 52923 48154 33230 36312 34468 -1874 1490 13158 -2813 -16763 -32237 -378 48951
8375 48951 60893 47905 11330 -41949 -44338 -43140 -32890 -51381 -50978 -37323 -33635 -29570 -18873
8362 -18873 -23650 -6482 21763 41934 32554 32999 29980 1120 -17437 -9741 -25320 -34258 -811
8349 -811 7567 38138 21583 6187 -19336 -49923 -46118 -44540 -39112 -6714 31855 839 -6112
$$ packed form
8439e500r883N154q844q068L849q430O538J9975J4022N233n797j0759O818L8321
8425D2629o552j7033k1853r38K1112q430m0021R873N259J7782L0310J6240k0756
8412B7622j1131J7305N32k9326j8529l1838J9355K9593K6218k2205l2486j8193
8400d3083J7168J5770K3796k0092l7418k7319j0793J8390J8399O241K0229L9242
8388B0530L2393m769j4924L082j844l6342L364J1668j5971j3950j5474L1859M9329
8375D8951J1942j2988l6575n3279k389J198J0250j8491M03J3655L688M065J0697
8362a8873m777J7168K8245K0171r380M45l019k8860j8557P696j5579q938L3447
8349h11Q378L0571j6555j5396k5523l0587L805J578N428L2398L8569l1016o951
$$ plain form
8336 -6112 11642 17503 -23 -2914 -18300 -32286 -27513 -23706 -24619 -15647 -3303 11515 9891 31435
8322 31435 37129 52776 51620 26729 36183 17300 12655 37724 32700 37167 18646 11042 18585
8309 18585 1392 -8184 11835 5506 2264 4735 -28885 -42739 11651 35552 6220 -17633 -19526
8296 -19526 -7076 2238 -1539 5802 26534 32607 28485 12508 -10033 -13402 -3575 884 -17487
8283 -17487 -32695 -46673 -54586 -23138 19655 15130 27795 21429 -32778 -33867 -11175 2145 1515
8270 1515 -8344 -8996 -14932 533 12602 38658 37362 34507 45789 11935 -17320 -22456 -2764
8257 -2764 17138 33541 13789 2105 14252 17222 22192 4633 -17927 -2251 1036 -21447 -62175
8244 -62175 -81710 -47636 -35047 -26647 -24526 -5953 1383 1969 5612 12416 -30852 -36316 -15422
$$ packed form
8336f112J7754N861j7526k891j5386j3986M773L807r13Q972J2344J4818j624K1544
8322C1435N694J5647j156k4891R454j8883m645K5069n024M467j8521p604P543
8309A8585j7193r576K0019o329l242K471l3620j3854N4390K3901k9332k3853j893
8296a9526J2450R314l777P341K0732O073m122j5977k2541l369R827M459j8371
8283a7487j5208j3978p913L1448M2793m525J2665o366n4207j089K2692J3320o30
8270A515r859o52n936J5465J2069K6056j296k855J1282l3854k9255n136J9692
8257b764J9902J6403j9752j1684J2147K970M970j7559k2560J5676L287k2483m0728
8244f2175j9535L4074J2589Q400K121J8573P336N86L643O804m3268n464K0894
$$ plain form
8231 -15422 -26753 -7187 27996 31386 41666 40926 38875 60107 51617 3218 -22415 -9433 -9721
8218 -9721 -11417 -12373 15206 41338 34198 -3112 -21502 -22813 -12367 -4049 -12918 16439 36387
8205 36387 33398 27381 23614 4505 -4573 -6923 6674 -2905 -10118 3725 7156 16680 38149 36824
8191 36824 30606 44014 22222 27827 47300 42105 32088 22217 1683 2550 38089 16208 -5283
8178 -5283 -19418 -30438 -20140 -31550 -22254 -7368 -13865 -10041 -11846 -35702 -42825 -55624 -33491
8165 -33491 -1885 7555 -14971 -5651 -1024 4414 7100 -27464 9203 51297 42439 44148 66106
8152 66106 43047 10382 10674 25696 13742 32345 26617 12047 -1201 4649 11697 -15708 -32281
8139 -32281 -7059 -6308 2913 21579 17630 25457 25298 7940 -926 2460 3936 -15016 -15524 2508
$$ packed form
8231a5422j1331J9566L5183L390J0280p40k051K1232q490m8399k5633J2982k88
8218i721j696r56K7579K6132p140l7310j8390j311J0446Q318q869K9357J9948
8205C6387k989o017l767j9109r078k350J3597r579p213J3843L431R524K1469j325
8191C6824o218J3408k1792N605J9473n195j0017r871k0534Q67L5539k1881k1491
8178e283j4135j1020J0298j1410R296J4886o497L824j805k3856p123j2799K2133
8165c3491L1606R440k2526R320M627N438K686l4564L6667M2094q858J709K1958
8152F6106k3059l2665K92J5022j1954J8603n728j4570j3248N850P048k7405j6573
8139c2281K5222P51R221J8666l949P827j59j7358q866L386J476j8952n08J8032
$$ plain form
8125 2508 22244 -36096 -33019 -36655 -33462 -3449 -7852 -7851 -36246 -18624 -7599 -29794 -11140 6061
8111 6061 16153 8097 -3123 -16941 -40364 -44146 3916 17542 34942 33417 -1766 -34097 -21235
8098 -21235 -7081 -4219 -23539 -31639 -29579 -22078 -2649 -15545 -58513 -58062 -40152 -42233 -35550
8085 -35550 -34962 -34041 -51918 -34818 11781 42718 48327 44654 48027 28353 8456 20826 43115
8072 43115 24387 15591 -6918 -39263 -32947 -26198 -24114 -48896 -48381 -21617 4959 -3333 8717
8059 8717 20298 20767 -8100 -17192 -23741 -29621 -18536 6952 40164 58944 47001 17904 25913
8046 25913 22694 28780 53740 32533 3752 -3730 -130 5882 15045 26508 35469 57980 77126
8033 77126 58070 38622 30475 27471 39959 45876 51174 58605 59638 37007 7566 28892 71867
$$ packed form
8125B508J9736n8340L077l636L193L0013m403Jk8395J7622J1025k2195J8654J7201
8111F061J0092q056j1220j3818k3423l782M8062J3626J7400j525l5183l2331J2862
8098b1235J4154K862j9320q100K060P501J9429j2896m2968M51J7910k081O683
8085c5550N88R21j7877J7100M6599L0937N609l673L373j9674j9897J2370K2289
8072D3115j8728q796k2509l2345O316O749K084k4782N15K6764K6576q292J2050
8059H717J1581M69k8867r092o549n880J1085K5488L3212J8780j1943k9097Q009
8046B5913l219O086K4960k1207k8781p482L600O012R163J1463Q961K2511J9146
8033G7126j9056j9448q147l004J2488N917N298P431J033k2631k9441K1326M2975
$$ plain form
8020 71867 81281 60740 65350 62823 34910 14335 14442 23629 40444 58411 57378 46715 53602
8007 53602 57096 24791 50066 106285 121733 129596 119802 109827 104770 122621 117636 73015 64160
7994 64160 86646 103255 134028 131409 148250 139058 111183 92288 60025 33820 35714 42532 48862
7981 48862 37188 25536 16811 19749 10119 11124 11640 41844 24824 16981 41635 34795 49898
7968 49898 36618 28760 44638 60914 53444 54960 57263 68885 111395 127994 124096 136429 119899
7955 119899 115588 115441 75668 59006 34869 62384 71589 54148 26227 -3376 -7755 -17149 9448
7942 9448 13825 12311 15471 -2807 -31926 -26136 -29334 -33278 -26474 6848 36703 24851 16451 -8082
7928 -8082 -396 7850 -1530 -30771 -34019 -16161 28126 28755 12028 9492 41547 68905 54136
$$ packed form
8020G1867R414k0541M610k527k7913k0575J07R187J6815J7967j033j0663O887
8007E3602L494l2305K5275N6219J5448P863r794r975n057J7851m985m4621q855
7994F4160K2486J6609L0773k619J6841r192k7875j8895l2263k6205J894O818O330
7981D8862j1674j1652q725K938r630J005N16L0204j7020p843K4654o840J5103
7968D9898j3280p858J5878J6276p470J516K303J1622M2510J6599l898J2333j6530
7955A19899m311j47l9773j6662k4137K7515R205j7441k7921k9603m379r394K6597
7942I448M377j514L160j8278k9119N790l198l944O804L3322K9855j1852q400k4533
7928h082P686Q246r380k9241l248J7858M4287O29j6727k536L2055K7358j4769
$$ plain form
7915 54136 49057 32033 26140 52131 59875 58814 21365 19943 22486 32142 23408 27045 16000 -12464
7901 -12464 -17202 -331 18507 2183 -26581 -33645 -4777 7064 -18662 -6198 28500 47569
7889 47569 7629 -22865 -39045 -37968 -25316 -14560 -6964 31699 27010 -4401 -11242 -1923 632
7876 632 -14785 -17960 -10003 21499 55355 50423 46934 48617 37287 4675 -20742 -51963 -54206
7863 -54206 -33442 -22936 -37110 11851 16620 -12402 -36515 -27877 -22290 -19849 -9297 -2283 -1154
7850 -1154 -21226 -45307 -23014 -9086 -27117 -22933 -58247 -92719 -82040 -69233 -60691 -43432
7838 -43432 -46774 -44543 -42628 -36482 -15830 -22366 -12821 1048 -6647 -24352 -28716 -20122 -7686 -7610
7824 -7610 -26461 -2169 28446 40474 47155 51083 17322 -10387 13872 25050 16910 18719 1626
$$ packed form
7915E4136n079j7024n893K5991P744j061l7449j422K543R656q734L637j1045k8464
7901a2464m738J6871J8838j6324k8764p064K8868J1841k5726J2464L4698J9069
7889D7569l9940l0494j6180J077J2652J0756P596L8663m689l1411o841R319K555
7876F32j5417l175P957L1502L3856m932l489J683j1330l2612k5417l1221k243
7863e4206K0764J0506j4174M8961M769k9022k4113Q638N587K441J0552P014J129
7850a154k0072k4081K2293J3928j8031M184l5314l4472J0679J2807Q542J7259
7838d3432l342K231J915O146K0652o536R545J3869p695j7705m364Q594J2436P6
7824g610j8851K4292L0615J2028O681L928l3761k7709K4259J1178q140J809j7093
$$ plain form
7811 1626 -19817 -18294 -30663 -28333 -25966 -15462 -1103 14491 33919 13571 7875 -12170 978
7798 978 -17388 -52144 -47490 -34210 -18806 -17050 -6169 -23198 -20258 -351 12507 -8051 -30981
7785 -30981 -12645 -8803 -1239 -11890 -10397 -1543 -12715 -5822 19302 25207 17078 21582 -3430
7772 -3430 -5613 15393 34146 19909 1266 471 -27349 -33090 -53338 -66737 -25082 10650 12571
7759 12571 983 -1168 -33561 -45185 -26783 -1334 -187 -16448 -24692 -20600 -22383 -21662 23728
7746 23728 26543 14275 2035 -24819 -25606 -31350 -43835 -39801 -52768 -86424 -77280 -26913 -6374
7733 -6374 182 14895 10772 20707 33120 33961 5226 -27835 -27328 -12602 1311 29230 38930 53911
7719 53911 21075 2480 4151 -30442 -41295 -28018 -6961 -631 13499 -493 -15237 -19141
$$ packed form
7811A626k1443J523j2369K330K367J0504J4359J5594J9428k0348n696k0045J3148
7798I78j8366l4756M654J3280J5404J756J0881j7029K940J9907J2858k0558k2930
7785c0981J8336L842P564j0651J493Q854j1172O893K5124N905q129M504k5012
7772c430k183K1006J8753j4237j8643p95k7820n741k0248j3399M1655L5732J921
7759A2571j1588k151l2393j1624J8402K5449J147j6261q244M092j783P21M5390
7746B3728K815j2268j2240k6854p87n744j2485M034j2967l3656R144N0367K0539
7733f374O556J4713m123R935J2413Q41k8735l3061N07J4726J3913K7919R700J4981
7719E3911l2836j8595J671l4593j0853J3277K1057O330J4130j3992j4744l904
$$ plain form
7707 -19141 -39460 -69363 -77814 -61537 -22124 -18774 -20852 -30425 -24912 -29555 -46604 -64492 -49175
7694 -49175 -47132 -14212 3338 -10846 -32016 -31441 -28073 -43330 -42766 -47248 -62290 -78234 -84360
7681 -84360 -60408 -47572 -53048 -54951 -41685 -39436 -59594 -82428 -90391 -64081 -44687 -32796 -30530
7668 -30530 -25172 -31333 -38326 -29106 -42388 -72120 -93144 -76976 -58409 -25094 7164 3705 -3856
7655 -3856 -16238 -37592 -83344 -75198 -67887 -33343 -18756 -26598 -25733 -21299 -18575 -52011 -36789
7642 -36789 1587 505 -26414 -40062 -23565 -12413 13398 -3714 -27358 -28839 -13859 -32543
7630 -32543 -20454 6453 -5226 -543 -14163 -5037 13546 -4798 -50945 -28196 2233 2791 3223
7617 3223 -12504 -48615 -49534 -17345 -20674 -45322 -43820 -28319 -34945 -24405 -145 18498 13070
$$ packed form
7707a9141k0319k9903q451J6277L9413L350k078r573N513m643j7049j7888J5317
7694d9175K043L2920J7550j4184k1170N75L368j5257N64m482j5042j5944o126
7681h4360K3952J2836n476j903J3266K249k0158k2834p963K6310J9394J1891K266
7668c0530N358o161o993R220j3282k9732k1024J6168J8567L3315L2258l459p561
7655c856j2382k1354m5752Q146P311L4544J4587p842Q65M434K724l3436J5222
7642c6789L8376j082k6919j3648J6497J1152K5811j7112k3644j481J4980j8684
7630c2543J2089K6907j1679M683j3620R126J8583j8344m6147K2749L0429N58M32
7617C223j5727l6111r19L2189l329k4648J502J5501o626J0540K4260J8643n428
$$ plain form
7604 13070 8732 -8571 -27061 -37661 -53996 -34232 -30946 -52112 -54984 -37719 14600 23920 13673
7591 13673 4557 3981 13066 273 9084 18774 10131 5128 -6373 -2190 194 -17494 -31724 -19549
7577 -19549 1816 -5109 -20329 4028 -12428 -19845 -27302 -8685 -2172 660 12114 31223 17813
7564 17813 1456 41921 41217 26190 13240 -16370 -31696 -39510 -42990 -20821 -13801 -3001 -16868
7551 -16868 -38131 -28141 3615 20600 49540 42683 22091 -9159 -19413 -18978 -11265 -5545 -14698
7538 -14698 6609 37646 44670 38984 19699 23725 35439 18191 -16894 -15831 -33299 -13134 -26495
7525 -26495 -37742 -34944 -28909 6798 24991 35816 47888 35895 17918 -5636 -12769 -5789 12641
7512 12641 153 -10463 12116 -1413 -6850 -30191 -44594 -29933 -14583 -7172 -20355 -21904
$$ packed form
7604A3070m338j7303j8490j0600j6335J9764L286k1166k872J7265N2319R320j0247
7591A3673r116n76R085j2793Q811R690q643n003j1501M183K384j7688j4230J2175
7577a9549K1365o925j5220K4357j6456p417p457J8617O513K832J1454J9109j3410
7564A7813j6357M0465p04j5027j2950k9610j5326p814l480K2169P020J0800j3867
7551a6868k1263R990L1756J6985K8940o857k0592l1250j0254M35P713N720r153
7538a4698K1307L1037P024n686j9285M026J1714j7248l5085J063j7468K0165j3361
7525b6495j1247K798O035L5707J8193J0825J2072j1993j7977k3554p133O980J8430
7512A2641j2488j0616K2579j3529n437k3341j4403J4661J5350P411j3183j549
$$ plain form
7500 -21904 -28335 -20909 -33645 -66806 -56005 -31056 -37982 -44497 -34001 -29716 -33198 -39347 -56089
7487 -56089 -71308 -83475 -87134 -69250 -68129 -41547 -14015 -3826 4789 -1847 -11591 -35458 -28472
7474 -28472 -22606 -46390 -41214 -33974 -26619 -680 33116 43276 24875 -41482 -65283 -52646 -31119
7461 -31119 -33677 -41739 -53814 -30472 3797 2228 7443 3488 7498 -6822 -43949 -34631 21640
7448 21640 12755 -14517 -30671 -26647 -11748 -11579 -2382 -2152 7211 29336 10395 -9637 -26471
7435 -26471 -12163 8845 -12757 -4959 -10452 -7506 25781 54124 52946 42908 13790 8505 25192
7422 25192 5313 20110 54222 43683 2628 1788 16123 -3828 -26468 -16738 -23113 -40170 -33093
7409 -33093 2884 -9953 -37706 -26921 -15910 14835 44113 23708 -19578 -58832 -25186 -9083
$$ packed form
7500b1904o431P426j2736l3161J0801K4949o926o515J0496M285l482o149j6742
7487e6089j5219j2167l659J7884J121K6582K7532J0189Q615o636r744k3867O986
7474b8472N866k3784N176P240P355K5939L3796J0160j8401o6357k3801J2637K1527
7461c1119k558q062j2075K3342L4269j569N215l955M010j4320l7127R318N6271
7448B1640q885k7272j6154M024J4899J69R197K30R363K2125j8941k0032j6834
7435b6471J4308K1008k1602P798n493K946L3287K8343j178j0038k9118n285J6687
7422B5192j9879J4797L4112j0539m1055q40J4335j9951k2640R730o375j7057P077
7409c3093L5977j2837k7753J0785J1011L0745K9278k0405m3286l9254L3646J6103
$$ plain form
7397 -9083 -18282 -22607 -1161 -8648 -18328 -5250 16231 26795 34982 11776 20563 -269 -6738
7384 -6738 20506 14004 -13223 -44335 -26946 -9579 -17647 -24360 -20217 -20930 -16447 5665 37398
7371 37398 34555 24056 32800 51105 31141 2657 363 -9908 -28747 -29205 -26239 -9603 -19838
7358 -19838 -24780 -28989 -24486 -27144 -8623 -2851 9076 15893 6186 4368 -11521 2313 16277
7345 16277 5391 -16158 -10563 -8297 17950 21524 -10338 -49733 -33422 6561 -16583 -27564
7333 -27564 -39847 -48703 -37527 -27746 -43457 -5565 44618 44495 19614 7814 21223 -7367 -30805
7320 -30805 -24016 -6970 -14825 -24485 -20738 5590 26751 6139 -6743 -14951 1919 6216 -15145
7307 -15145 -38699 -57691 -54637 -37988 -19196 -314 1595 11931 8299 -7489 -52380 -51962 -46059
$$ packed form
7397i083r199m325K1446p487r680J3078K1481J0564Q187k3206Q787k0832o469
7384f738K7244o502k7227l1112J7389J7367q068o713M143p13M483K2112L1733
7371C7398k843j0499Q744J8305j9964k8484k294j0271j8839m58K966J6636j0235
7358a9838m942m209M503k658J8521N772J1927O817r707j818j5889J3834J3964
7345A6277j0886k1549N595K266K6247L574l1862l9395J6311L9983k3144j0981
7333b7564j2283q856J1176R781j5711L7892N0183j23k4881j1800J3409k8590k3438
7320c0805O789J7046p855r660L747K6328K1161k0612j2882q208J6870M297k1361
7307a5145k3554j8992L054J6649J8792J8882J909J0336l632j5788m4891M18N903
$$ plain form
7294 -46059 -32967 -2279 -21311 -27731 -418 8246 25713 46519 51736 21385 301 6356 9158
7281 9158 -38729 -66617 -54683 -29810 -16773 -25970 -42300 -28401 -30788 -24315 9159 8397 2075
7268 2075 17651 25458 28193 17716 13264 3210 -7190 -11999 -22503 -4844 -17453 -38732 -3311
7255 -3311 -18333 -61291 -80653 -37527 -13750 3673 25147 22788 -3069 -20595 -18226 -22023 15090
7242 15090 37566 12131 12984 52390 74125 41262 59453 49240 19311 1220 -30206 -40240
7230 -40240 -35370 -12711 -10312 5882 23806 -6219 -26035 -5834 4948 13069 12466 25945 33520
7217 33520 31297 32400 57814 37736 17044 5370 -10804 -13894 -10661 -21061 -19391 12375 -6508
7204 -6508 -1006 4981 -9854 -20384 -47841 -55049 -39356 -30929 -37411 -31777 -24465 -37042 -35886 -53758
$$ packed form
7294d6059J3092L0688j9032o420K7313Q664J7467K0806N217l0351k1084O055K802
7281I158m7887k7888J1934K4873J3037r197j6330J3899k387O473L3474p62o322
7268B075J5576P807K735j0477m452j0054j0400m809j0504J7659j2609k1279L5421
7255c311j5022m2958j9362M3126K3777J7423K1474k359k5857j7526K369l797L7113
7242A5090K2476k5435Q53L9406K1735l2863J8191j0213k9929j8091l1426j0034
7230d0240M870K2659K399J6194J7924l0025j9816K0201J0782Q121o03J3479P575
7217C3520k223J103K5414k0078k0692j1674j6174l090L233j0400J670L1766j8883
7204f508N502N987j4835j0530k7457p208J5693Q427o482N634P312j2577J156j7872
$$ plain form
7190 -53758 -45676 -31552 -34744 -39764 -20801 3652 -19694 -18155 5127 8842 -24382 -37874 -6965
7177 -6965 21753 41445 36699 21207 7973 -4064 13709 761 -8715 -37966 -53177 -21167
7165 -21167 -4901 -6421 1588 3476 7996 19388 13243 -5284 -20086 -8302 -13102 -18588 -7061
7152 -7061 1622 250 -5622 -17472 -32159 -42732 -32751 -19209 -4499 7222 15993 49128 20267
7139 20267 -2890 -30391 -20518 -5488 8416 14055 -16811 -12343 -9050 -31777 -37789 -6930 10042
7126 10042 -3300 -9210 191 7855 16645 6148 -15697 -9662 -9130 -3359 18811 16250 -1565 -2827
7112 -2827 9149 23452 -5127 -31880 -30172 6733 15397 8727 -5189 14200 16734 -16595 -33029
7099 -33029 -34057 -38111 -25874 3574 12186 -8044 5991 31295 64108 60940 46725 33825 51359
$$ packed form
7190e3758Q082J4124l192n020J8963K4453k3346J539K3282L715l3224j3492L0909
7177f965K8718J9692m746j5492j3234j2037J7773j2948r476k9251j5211L2010
7165b1167J6266j520Q009J888M520J1392o145j8527j4802J1784m800n486J1527
7152g061Q683j372n872j1850j4687j0573R981J3542J4710J1721Q771L3135k8861
7139B0267k3157k7501R873J5030J3904N639l0866M468L293k2727o012L0859J6972
7126A0042j3342n910R401P664Q790j0497k1845O035N32N771K2170k561j7815j262
7112b827J1976J4303k8579k6753J708L6905Q664o670j3916J9389K534l3329j6434
7099c3029j028m054J2237K9448Q612k0230J4035K5304L2813l168j4215j2900J7534
$$ plain form
7086 51359 28450 3943 3899 -12009 -29354 -57417 -32962 -30911 -33353 -54343 -43368 -26610 -23726
7073 -23726 -46024 -54191 -44569 -45800 -17505 17751 13470 23072 28437 15037 4948 -2880 -19697
7060 -19697 660 -2463 -26150 -51410 -49126 -51987 -57667 -43557 -44033 -44024 -18703 3068 -10815 -17308
7046 -17308 1294 -38437 -23226 16990 36694 32114 34179 24143 6152 -12453 -23818 -24718 -15627
7033 -15627 3448 3348 1343 4626 -7527 11532 24203 30176 11432 17368 54332 62849 34967
7020 34967 13546 855 1857 -19404 -56302 -20098 -23769 -70077 -80156 -44347 -20490 -15416
7008 -15416 6394 18261 30761 29131 26521 24043 18363 -33139 -19732 15561 22902 21639 28125
6995 28125 22610 13099 -39137 -36587 -6300 -27 1279 -12689 12244 22627 10019 -7015 -21160
$$ packed form
7086E1359k2909k4507m4j5908j7345k8063K4455K051k442k0990J0975J6758K884
7073b3726k2298q167R622j231K8295L5256m281R602N365j3400j0089p828j6817
7060a9697K0357l123k3687k5260K284k861n680J4110m76RK5321K1771j3883o493
7046a7308J8602l9731J5211M0216J9704m580K065j0036j7991j8605j1365r00R091
7033a5627J9075j00k005L283j2153J9059J2671N973j8744N936L6964Q517k7882
7020C4967k1421j2691J002k1261l6898L6204l671m6308j0079L5809K3857N074
7008a5416K1810J1867J2500j630k610k478n680n1502J3407L5293P341j263O486
6995B8125n515r511n2236K550L0287O273J306j3968K4933J0383j2608j7034j4145
$$ plain form
6982 -21160 -20571 -16477 -2345 6486 38517 85007 120415 117050 120246 108762 78297 42424 -10915
6969 -10915 -41557 -26827 -11416 -3996 -34196 -42448 -68121 -36638 -2968 -5309 9984 36717
6957 36717 29418 -13626 -36184 -34877 -16017 -12492 -16162 201 9479 -9647 -32344 -10789 -8394
6944 -8394 -19877 -47072 -30701 -20655 -6295 -20262 -28977 -31869 -41926 -14499 16681 8342 5688
6931 5688 -19330 -51452 -51987 -44647 -14136 2968 18155 27564 -3941 -6071 10361 -32024 -40091
6918 -40091 -29442 -16421 -13899 15206 28711 15794 15879 9095 17944 -1452 -6340 -5690 -9159 -20755
6904 -20755 -7434 6957 -1825 -16285 -12222 -40290 -56128 -31205 -17733 -18090 -17481 -15198 3089
6891 3089 16313 293 -15776 -44769 -5806 25090 14129 -5107 4267 23604 -2286 -4920
$$ packed form
6982b1160N89M094J4132Q831L2031M6490L5408l365L196j1484l0465l5873n3339
6969a0915l0642J4730J5411P420l0200q252k5673L1483L3670k341J5293K6733
6957C6717p299m3044k2558J307J8860L525l670J6363R278j9126k2697K1555K395
6944h394j1483k7195J6371J0046J4360j3967q715k892j0057K7427L1180q339k654
6931E688k5018l2122n35P340L0511J7104J5187R409l1505k130J6432m2385q067
6918d0091J0649J3021K522K9105J3505j2917Q5o784Q849j9396m888O50l469j1596
6904b0755J3321J4391q782j4460M063k8068j5838K4923J3472l57O09K283J8287
6891C089J3224j6020j6069k8993L8963L0896j0961j9236R374J9337k5890k634
$$ plain form
6879 -4920 16348 27295 16768 6319 11247 -6004 1656 -9105 -10343 -17928 -12881 12501 40106
6866 40106 49865 32012 16732 2066 4566 24132 34012 49005 21547 33590 41125 32047 29019
6853 29019 30226 27994 7745 -6483 -5508 -20605 -16919 -17600 -5960 -1660 -22761 -13727 -14072 -8638
6839 -8638 12801 32177 31138 3591 -17709 -14972 -18381 13202 29116 12762 -12530 -1168 11175
6826 11175 3937 -10215 -18587 -30171 -35000 -32615 -47526 -36249 -41782 -22849 -35462 -41978 -4248
6813 -4248 24326 34624 8051 -20053 -7594 -21346 -38100 -17370 -25592 -16829 -18096 21023 36449
6800 36449 -4380 -27681 -47443 -20696 -3520 12672 24831 12572 6020 2481 -5949 -8373 18048
$$ packed form
6879d920K1268J0947j0527j0449M928j7251P660j0761j238p585N047K5382K7605
6866D0106R759j7853j5280j4666K500J9566R880J4993k7458J2043P535r078l028
6853B9019J207k232k0249j4228R75j5097L686o81J1640M300k1101R034l45N434
6839h638K1439J9376j039k7547k1300K737l409L1583J5914j6354k5292J1362J2343
6826A1175p238j4152q372j1584m829K385j4911J1277n533J8933j2613o516L7730
6813d248K8574J0298k6573k8104J2459j3752j6754K0730q222Q763j267L9119J5426
6800C6449m0829k3301j9762K6747J7176J6192J2159j2259o552l539q430k424K6421
$$ [...]
##END NTUPLES=NMR SPECTRUM
##END=
