##TITLE=Analysis number 324869
Compound Code cc 52202
Book Reference 467/106
Project Code adrs
Chemist Name benw
##JCAMPDX= 6.0         $$ Bruker NMR JCAMP-DX V2.0
##DATA TYPE= NMR SPECTRUM
##DATA CLASS= NTUPLES
##ORIGIN= Bruker BioSpin GmbH
##OWNER= nmr
$$ XWIN-NMR		Version 3.5
$$ Mon Dec  4 12:32:02 2006 GMT Standard Time (UT+0h)  MAYBRIDGE\nmr@NMR_250MHZ
##.OBSERVE FREQUENCY= 250.131544655141
##.OBSERVE NUCLEUS= ^1H
##.ACQUISITION MODE= SIMULTANEOUS (DQD)
##.ACQUISITION SCHEME= undefined
##.AVERAGES= 16
##.DIGITISER RES= 18
##SPECTROMETER/DATA SYSTEM= dpx250
##.PULSE SEQUENCE= zg30
##.SOLVENT NAME= CDCl3
##.SHIFT REFERENCE= (INTERNAL, CDCl3, 0, 16.522)
##AUDIT TRAIL= $$ (NUMBER, WHEN, WHO, WHERE, WHAT)
$$ ##TITLE= Audit trail, XWIN-NMR		Version 3.5
$$ ##JCAMPDX= 5.01
$$ ##ORIGIN= Bruker BioSpin GmbH
$$ ##OWNER= nmr
$$ C:\u/data/dgb/nmr/ADRS/160/pdata/1/auditp.txt
$$ ##AUDIT TRAIL=  $$ (NUMBER, WHEN, WHO, WHERE, WHAT)
(   1,<2006-12-04 12:31:42.89 +000>,<MAYBRIDGE\nmr>,<NMR_250MHZ>,
      <created by zg, POWCHK disabled, PULCHK disabled
       configuration hash MD5:
       49 4B E0 1D 92 C2 6B 37 9F E6 65 BC 52 41 86 1D
       data hash MD5: 64K
       EC C9 D9 09 23 9D 35 83 48 3F 7A 93 76 A1 4E 86>)
(   2,<2006-12-04 12:31:54.07 +000>,<MAYBRIDGE\nmr>,<NMR_250MHZ>,
      <Start of raw data processing
       ef LB = 0.3 FT_mod = 6 PKNL = 1 SI = 32K 
       data hash MD5: 32K
       54 83 9B AE BD D1 AF 7A 5F B8 2D B4 64 2B 5E 78>)
(   3,<2006-12-04 12:31:55.68 +000>,<MAYBRIDGE\nmr>,<NMR_250MHZ>,
      <apk 
       data hash MD5: 32K
       1C BA 59 3D C6 95 8B A1 25 75 0F E0 3E F7 9D E2>)
(   4,<2006-12-04 12:31:56.39 +000>,<MAYBRIDGE\nmr>,<NMR_250MHZ>,
      <abs ABSG = 5 
       data hash MD5: 32K
       39 50 9D 4B 5B 47 3D 1D 83 9A F8 AE 91 81 9F 98>)
$$ ##END=
$$ 
$$ hash MD5
$$ 18 C7 A1 71 40 75 5A 7F 34 86 3F 13 1F 94 90 AF
##$RELAX= 
##$RELAX= 
##$RELAX= 
##$RELAX= 
##$RELAX= 
##$RELAX= 
##$RELAX= 
$$ Bruker specific parameters
$$ --------------------------
##$DU= <C:\u>
##$EXPNO= 160
##$NAME= <ADRS>
##$PROCNO= 1
##$TYPE= <nmr>
##$USER= <dgb>
##$AMP= (0..31)
100 100 100 100 100 100 100 100 100 100 100 100 100 100 100 100 100 100 
100 100 100 100 100 100 100 100 100 100 100 100 100 100 
##$AQSEQ= 0
##$AQ_mod= 3
##$AUNM= <au_zg>
##$AUTOPOS= <24 >
##$BF1= 250.13
##$BF2= 250.13
##$BF3= 250.13
##$BF4= 250.13
##$BF5= 500.13
##$BF6= 500.13
##$BF7= 500.13
##$BF8= 500.13
##$BYTORDA= 1
##$CFDGTYP= 0
##$CFRGTYP= 5
##$CHEMSTR= <none>
##$CNST= (0..31)
1 1 145 1 1 1 1 1 1 1 1 1 1 1 1 1 1 1 1 1 1 1 1 1 1 1 1 1 1 1 1 1 
##$CPDPRG= <>
##$CPDPRG1= <>
##$CPDPRG2= <>
##$CPDPRG3= <>
##$CPDPRG4= <mlev>
##$CPDPRG5= <mlev>
##$CPDPRG6= <mlev>
##$CPDPRG7= <mlev>
##$CPDPRG8= <mlev>
##$CPDPRGB= <>
##$CPDPRGT= <>
##$D= (0..31)
0 1 0 0 0 0 0 0 0 0.06 0 0 0 0 0 0 0.0002 0 0 0 0 0 0 0 0 0 0 0 0 0 0 
0 
##$DATE= 1165235501
##$DBL= (0..7)
120 120 120 120 120 120 120 120 
##$DBP= (0..7)
150 150 150 150 150 150 150 150 
##$DBP07= 0
##$DBPNAM0= <>
##$DBPNAM1= <>
$$ [...]
##$SUBNAM7= <"">
##$SUBNAM8= <"">
##$SUBNAM9= <"">
##$SW= 20.6930455092707
##$SWIBOX= (0..15)
0 0 3 0 0 0 0 0 0 0 0 0 0 0 0 0 
##$SW_h= 5175.983436853
##$TD= 65536
##$TD0= 1
##$TE= 294.16
##$TE2= 300
##$TE3= 300
##$TEG= 300
##$TL= (0..7)
0 120 120 120 120 120 120 120 
##$TP= (0..7)
150 150 150 150 150 150 150 150 
##$TP07= 0
##$TPNAME0= <>
##$TPNAME1= <>
##$TPNAME2= <>
##$TPNAME3= <>
##$TPNAME4= <>
##$TPNAME5= <>
##$TPNAME6= <>
##$TPNAME7= <>
##$TPOAL= (0..7)
0.5 0.5 0.5 0.5 0.5 0.5 0.5 0.5 
##$TPOFFS= (0..7)
0 0 0 0 0 0 0 0 
##$TUNHIN= 0
##$TUNHOUT= 0
##$TUNXOUT= 0
##$USERA1= <user>
##$USERA2= <user>
##$USERA3= <user>
##$USERA4= <user>
##$USERA5= <user>
##$V9= 5
##$VALIST= <valist>
##$VCLIST= <CCCCCCCCCCCCCCC>
##$VD= 0
##$VDLIST= <DDDDDDDDDDDDDDD>
##$VPLIST= <PPPPPPPPPPPPPPP>
##$VTLIST= <TTTTTTTTTTTTTTT>
##$WBST= 1024
##$WBSW= 4
##$XGAIN= (0..3)
0 0 0 0 
##$XL= 0
##$YL= 0
##$YMAX_a= 238646
##$YMIN_a= -382258
##$ZGOPTNS= <>
##$ZL1= 120
##$ZL2= 120
##$ZL3= 120
##$ZL4= 120
##$ABSF1= 16.522
##$ABSF2= -4.171173
##$ABSG= 5
##$ABSL= 3
##$ALPHA= 0
##$AQORDER= 0
##$ASSFAC= 0
##$ASSFACI= 0
##$ASSFACX= 0
##$ASSWID= 0
##$AUNMP= <proc_1d>
##$AZFE= 0.1
##$AZFW= 0.1
##$BCFW= 0
##$BC_mod= 0
##$BYTORDP= 0
##$COROFFS= 0
##$CY= 12.5
##$DATMOD= 1
##$DC= 0
##$DFILT= <>
##$DTYPP= 0
##$F1P= 14.0000005364418
##$F2P= -0.99999901652339
##$FCOR= 0.5
##$FTSIZE= 32768
##$FT_mod= 6
##$GAMMA= 0
##$GB= 0
##$INTBC= 1
##$INTSCL= 1
##$ISEN= 128
##$LB= 0.3
##$LEV0= 0
##$LPBIN= 0
##$MAXI= 10000
##$MC2= 0
##$MEAN= 0
##$ME_mod= 0
##$MI= 0
##$NCOEF= 0
##$NC_proc= -6
##$NLEV= 6
##$NOISF1= 0
##$NOISF2= 0
##$NSP= 0
##$NTH_PI= 0
##$NZP= 0
##$OFFSET= 16.522
##$PC= 1
##$PHC0= 224.528
##$PHC1= 6.695668
##$PH_mod= 1
##$PKNL= yes
##$PPARMOD= 0
##$PSCAL= 4
##$PSIGN= 0
##$REVERSE= no
##$SF= 250.13
##$SI= 32768
##$SIGF1= 0
##$SIGF2= 0
##$SINO= 400
##$SIOLD= 32768
##$SREGLST= <1H.CDCl3>
##$SSB= 0
##$STSI= 32768
##$STSR= 0
##$SW_p= 5175.98343685301
##$SYMM= 0
##$S_DEV= 0
##$TDeff= 65536
##$TDoff= 0
##$TI= <Analysis number 999999
Compound Code 99
Book Reference 9
Project Code 9>
##$TILT= no
##$TM1= 0
##$TM2= 0
##$TOPLEV= 0
##$USERP1= <user>
##$USERP2= <user>
##$USERP3= <user>
##$USERP4= <user>
##$USERP5= <user>
##$WDW= 1
##$XDIM= 32768
##$YMAX_p= 541851243
##$YMIN_p= -901150
$$ End of Bruker specific parameters
$$ ---------------------------------
##NTUPLES= NMR SPECTRUM
##VAR_NAME=  FREQUENCY,     SPECTRUM/REAL,   SPECTRUM/IMAG
##SYMBOL=    X,             R,               I
##VAR_TYPE=  INDEPENDENT,   DEPENDENT,       DEPENDENT
##VAR_FORM=  AFFN,          ASDF,            ASDF
##VAR_DIM=   32768,         32768,           32768
##UNITS=     HZ,            ARBITRARY UNITS, ARBITRARY UNITS
##FACTOR=    0.157963299565203, 1,           1
##FIRST=     4132.6476996994, 0,             0
##LAST=      -1043.33573715361, 0,           0
##MIN=       -1043.33573715361, -901150,     0
##MAX=       4132.6476996994, 541851243,     0
$$ Real data points
##PAGE= N=1
##DATA TABLE= (X++(R..R)), XYDATA
$$ [...]
27198 -102197 -3236 -85354 18687 353958 369583 215140 96437 100422 429397 346105 24481
27187 24481 55177 336073 497975 437724 199908 331312 148901 39707 110710 216357
27177 216357 134144 226612 314424 83479 -135397 -79681 38319 -76883 -69848 -45371 -78514
27166 -78514 17593 5502 -117697 173934 194991 286448 304068 235848 194210 165943 38100
27155 38100 55907 -69207 -152324 -127554 -8355 -181106 -205980 -71442 92363 121534 -62248
27144 -62248 32862 124534 157139 82619 -94311 -141991 -292946 -334943 -295027 -9720 -10264
27133 -10264 -138811 -126597 -2853 110392 27315 -319906 -312270 -162842 -18843 -263663
27123 -263663 -266705 -239672 -168687 48394 107143 342751 405167 294300 113804 17992 143859
27112 143859 400578 145573 -165454 -199675 -289709 -132924 -160693 -221423 -224825 -318665 -224950
27101 -224950 2200 87767 32664 -179351 -131977 -208627 -244703 -276144 -203617 -207925 -238767
27090 -238767 -294230 -166776 36874 138755 135152 25485 -100096 -150140 -162260 -47140
27080 -47140 38874 23037 -57014 -203933 -154775 -52492 -112213 -185212 -109467 -74960 131756
27069 131756 150175 -63693 -29792 19090 89506 67015 4264 115534 104691 168590 164921
27058 164921 288468 137351 40835 271034 195973 -11483 -81714 -36439 -26417 60134 45359
27047 45359 176217 268149 411575 506209 410408 211500 23734 -155231 -155276 90715 175639
27036 175639 205246 104636 -4809 -119543 -167596 -237029 -402641 -399170 -225027 -161044 -62114
27025 -62114 -10120 794 -224213 -209286 -140189 59843 350376 253518 71261 149930 179267
27014 179267 -15432 -96343 -203955 -92100 -5787 -16101 17930 38028 -23238 73352 112915
27003 112915 -125753 -171899 -182662 67560 124885 225832 221323 220508 225725 93420 -21015
26992 -21015 -44242 -171715 40165 108089 50791 -124846 -181549 -100073 188010 316777 474878
26981 474878 540289 443836 237363 47188 48177 25872 -110206 -239108 -142230 -71791 3990
26970 3990 105771 372683 166127 42341 185974 92252 112848 130226 51539 118339 55642
26959 55642 26539 197113 202773 81619 117694 -198797 -312679 -212108 -120933 -42197 -139278
26948 -139278 -252294 -332010 -179100 -57132 -12729 -85990 -204314 -306753 -257887 86087
26938 86087 187818 124754 215474 103386 38561 268053 295889 199646 151593 58973 1303
26927 1303 209266 116206 122136 46817 -188389 -354140 -301822 -239471 -149374 26417 -103721
26916 -103721 -200257 34427 -1479 -89458 71461 87038 72607 122390 129391 99213 79631
26905 79631 18627 -54649 -92192 -38548 -193109 -322325 -427719 -249676 -212123 -77784 -15089
26894 -15089 46470 105600 152430 140960 57441 -5000 -17755 -20147 -219691 -175585 -97861 -135495
26882 -135495 -101365 -206830 -131329 -135357 -94876 51816 148421 202898 326923 276422 292661
26871 292661 354616 130642 -74856 -291437 -124004 -117180 -81444 186309 338044 261927
26861 261927 298682 202638 111316 -4882 -108996 -261840 -232772 -68069 19593 19989 -125816
26850 -125816 -77514 30009 120695 73208 98210 280460 194464 174321 73471 84192 64346
26839 64346 97439 224363 79757 60456 71867 185287 330748 398558 320623 404126 439452
26828 439452 235256 67892 101526 119225 111394 101496 -104398 -88926 -20313 -155792 -244121
26817 -244121 -87025 -149595 -193790 -276143 -454847 -437175 -338500 -151251 -208715 -97869 -109799
26806 -109799 -143885 -127890 -53043 85128 293898 380101 318632 67298 -131563 -201752 -105042
26795 -105042 -194584 -288256 -212958 -105599 -147200 -137464 37982 112656 164804 112818 249504
26784 249504 94824 104532 192277 115146 238174 133349 -83052 -117548 23580 206387
26774 206387 326441 502801 398553 401299 450489 339189 87097 -151287 -187240 -182475 -195027
26763 -195027 -124335 84293 111245 -39184 -44988 934 -39204 -19123 -63841 -1791 65654
26752 65654 -130220 5741 -83619 -274410 -271021 -263923 -270490 61667 160855 -94284 -212111
26741 -212111 -267017 -276343 -163826 -4097 83174 108558 180560 90108 -233622 -333602 -384219
26730 -384219 -512748 -283842 -103957 65474 -159879 -127389 9037 91352 106837 245694
26720 245694 77378 61092 299707 479950 468214 313848 251554 206485 132475 197735 145381
26709 145381 -23608 -86563 48794 1648 -192696 -80668 66092 144162 225963 220327 77607
26698 77607 103577 205415 211149 30057 -90979 -258856 -207454 13021 143346 127705 136354
26687 136354 36666 107611 223013 314202 200617 70853 304207 526675 510408 286811
26677 286811 161402 24953 -102352 -123886 -39537 75435 154124 99329 -215162 -278675
26667 -278675 73909 87266 55146 -218123 -209617 -189171 -17476 124716 257546 57834
26657 57834 -121933 -241291 -162328 101010 182842 205462 222155 202213 160342 28933 105740
26646 105740 76561 57487 -38571 -4200 191299 106529 13509 95933 152240 37252 66718
26635 66718 -39952 -32142 -134929 -251014 -150637 -26135 -128847 -78080 -87319 -269302 -240409
26624 -240409 -76318 -142877 -331878 -180379 104515 85539 97651 74021 75786 125129 50409
26613 50409 -31873 -182436 -237677 -212071 -217015 -145505 -3667 -192973 -71437 320177 441345
26602 441345 429434 448507 194375 90994 -93920 -137493 -90811 87971 -69533 -122417
26592 -122417 -100327 -118832 -245778 -220662 -107569 48461 -50315 -144917 -188692 -129136 -195153
26581 -195153 -366409 -235530 -151603 -316334 -48852 311868 354616 288535 75855 -244591
26571 -244591 -457970 -304006 -68438 61148 287828 436233 300987 289626 373182 4821
26561 4821 -122829 -170296 -144698 -10709 5915 -121297 -162785 -254935 -479990 -683144 -490008
26550 -490008 -290116 -309924 -247465 -198076 -339648 -320603 -104694 -41538 64858 93688 140350
26539 140350 -91477 -189503 -91020 -16440 205449 283578 219787 238964 226063 46131 -266421
26528 -266421 -353867 -343116 -295485 -212301 -175338 -307191 -294110 -104192 74063 90210 -2627
26517 -2627 35939 -110482 -131627 -25616 24547 4474 -165896 19128 253773 298297 234747
26506 234747 75626 -179686 -229796 -235219 14860 263920 141872 -79615 -89974 -25133
26496 -25133 -13414 -126341 105210 80589 235988 380375 436559 392916 273618 230069 169848
26485 169848 142198 93210 165936 36844 77693 397927 322178 235239 125318 63947 -65802
26474 -65802 -340362 -422735 -225921 -1639 65657 44340 -45481 -266922 -398914 -145547
26464 -145547 125766 229704 41654 -112404 -40110 -73840 -212892 -305406 -263432 -326320
26454 -326320 -349873 -268654 -414420 -381982 -293686 -101719 -136435 -132373 -33998 -172474 -152722
26443 -152722 110991 262274 245737 -63935 -207346 -137375 -223551 -253277 -88672 122078
26433 122078 336621 147732 -156863 -217302 -214428 -263534 -284059 -163099 -199764 100182 252691
26422 252691 247428 98681 -36511 -140299 -39443 -41025 7313 -109466 -148767 -122311 87230
26411 87230 -22240 -315974 -329166 44049 72206 120372 350252 222797 20000 34411
26401 34411 -42157 65626 340210 511801 405277 342302 362158 358411 448994 520947 169343
26390 169343 149192 190012 292819 444477 240497 206094 331702 296937 203698 127367 365141
26379 365141 282867 8073 -94630 -109818 -256103 -479586 -492344 -513301 -377840 -163546
26369 -163546 -107311 176559 288883 76384 -75725 2939 94423 123575 26988 -67836 32936
26358 32936 35835 -37612 8116 2969 -151573 -207092 4951 160548 237598 -24124 -114441
26347 -114441 -93985 -143040 -59207 -112276 -288314 -200560 156542 269574 280699 384091 295757
26336 295757 202093 21562 32722 74370 -21685 197492 409380 262271 194533 -36532
26326 -36532 75607 165747 90058 -290800 -462552 -369743 -421158 -255630 -195827 -241368 -12059
26315 -12059 265473 262960 12970 -87072 128684 441884 261534 123156 19268 5276
26305 5276 57270 -75541 52881 173954 -121644 5150 66625 68954 -30996 64888 114055
26294 114055 103961 69529 197957 148962 200937 395815 377431 386453 331053 130116 181590
26283 181590 273509 340193 135727 104369 213051 255672 167060 178819 21337 21268 246778
26272 246778 152344 49035 203767 223328 405321 245121 126185 86177 78000 98410 -92879
26261 -92879 -139131 -254954 -353600 -285189 -98427 -27128 -159889 -107530 -57524 -170164 -336113
26250 -336113 -224420 190643 431505 467982 520090 329466 78561 -181814 -241412 -295699
26240 -295699 -343494 -13881 243859 75939 92732 202311 343022 243119 50675 111871
26230 111871 -18213 -217715 -144584 -188256 -240023 -46368 197541 172038 -234615 -202006
26220 -202006 108888 74788 -162817 -192685 -25579 75845 -95978 -152003 -208857 -72756
26210 -72756 62107 52466 -110403 -12924 -178401 -402519 -260111 -157061 -220243 -153521 -157212
26199 -157212 -48391 26858 -182723 -295470 -189479 98201 266616 239610 241552 98083
26189 98083 -138462 28493 173565 233421 114014 68450 294648 321883 261943 301877 112638
26178 112638 -127053 -325238 -47492 152618 135326 146463 39275 -11430 12958 -100246
26168 -100246 -225437 -99261 36532 192097 201834 19156 -4085 -27720 100425 65671
26158 65671 105841 -64780 -120414 26642 53354 79882 26543 -116134 -129617 -267433 -396412
26147 -396412 -357754 -305032 -248940 11824 205336 153104 176371 70994 -73458 -8860 -8925
26136 -8925 136037 235682 103759 -35170 -201229 -144718 53258 256872 523034 444070
26126 444070 142714 46258 -6038 -131073 -267336 -59795 178751 117275 -59289 -136084
26116 -136084 -148784 -121589 59283 129824 -171945 -232357 -154064 -124437 -60404 -80070 -80422
26105 -80422 -101628 -123570 -219147 -109049 37973 -98075 -222754 -142282 -89681 30885 77709
26094 77709 85101 115370 58621 23598 268003 250949 93328 -62759 129031 210194 207711
26083 207711 50886 88359 174047 51913 -27084 -13231 -30564 195406 168004 135885 140777
26072 140777 -6865 -213057 -2549 79303 -4012 58495 -4428 227606 267721 -21755
26062 -21755 -41498 62626 251496 327321 137573 119120 -2662 -117788 -22467 83352
26052 83352 148227 33291 -102795 -46265 292961 309557 70497 111124 218492 79427
26042 79427 -101618 -232389 -219044 -140726 -41034 -222751 -367261 -362382 -337105 -224775 -272198
26031 -272198 -241285 -19213 -161180 -194756 -345114 -251439 9909 28329 -92975 -31359
26021 -31359 69290 8402 96407 191290 261697 275455 417853 429701 224976 296334 62397
26010 62397 -122621 143523 112585 137985 91880 -39704 -116247 10029 204480 184558 187313
25999 187313 13574 -210397 -260218 -145989 74359 148875 370764 438516 283767 235692
25989 235692 116601 -130264 -135855 -71504 -72023 -95356 -50944 -108135 -158786 -202955 -135551 20869
25977 20869 110630 163893 210265 227884 211879 77596 -160029 -170417 201767 221205 -38066
25966 -38066 -196532 -337613 -454310 -381421 -268270 -195305 -205528 -149118 -115326 -92846 38656
25955 38656 -9248 -191437 -202378 -218333 -129181 -10921 59541 225607 40767 1340 72566
25944 72566 66131 240090 374941 417360 205878 197364 335566 119984 -134098 -117241 -165532
25933 -165532 -198016 -137723 28221 64107 221939 532254 379479 104763 107561 -160959
25923 -160959 -48742 322150 148885 110790 377636 386704 262424 411445 487743 287127
25913 287127 167325 19674 -103136 -276925 -137190 112262 158534 93093 20389 -187646
25903 -187646 -154557 -236966 -264675 -233156 49148 261933 70865 -133536 -142929 -9602 -70343
25892 -70343 -127511 -165767 87037 259479 158873 -47819 -120235 -19291 68841 146103 260108
25881 260108 295211 72502 -212566 -38503 155320 233989 137332 -23302 -50217 32185
25871 32185 -86347 -129313 -136645 -209916 -123357 -91038 68258 68155 -111798 -43535 50627 116525
25859 116525 -4205 -50751 -99532 -218094 -232428 -176517 -136822 -96336 10680 268766 20561
25848 20561 -125084 -48662 -40608 16719 9005 197708 243560 325923 309197 375380 240236
25837 240236 116502 196535 348139 163314 36102 129009 219769 310191 197582 61884
25827 61884 20273 153645 -84197 -198579 -184073 25763 18684 180110 452897 514011 407878
25816 407878 451239 214968 -47213 59890 79692 104964 23870 170321 347043 280722
25806 280722 100766 42362 88545 126362 7466 -225475 -345512 -143709 -119467 -49932
25796 -49932 -99128 -90654 2326 108866 86254 93585 174575 298852 213243 159214 111456 164874
25784 164874 207019 233830 88955 -57943 -120703 -151268 -113506 -164046 -43463 38641 54442
25773 54442 239869 253729 127540 105469 -24457 -55706 -41607 -161115 -84253 -110570 -163920
25762 -163920 -106981 -46010 108522 55479 245264 130815 15353 206180 218512 300607
25752 300607 418007 44924 -103343 44937 38543 -79212 139169 226505 -54300 51641
25742 51641 135751 -67724 62276 292650 328929 -5835 243340 573520 320601 63936
25732 63936 81290 118134 200317 271091 273675 257948 38321 -91096 -16934 -30345 -46420
25721 -46420 -276246 -478858 -230058 73202 283027 483699 472616 397639 260663 87861
25711 87861 34187 -1908 -88308 -155248 -65495 -7630 -160411 -33402 181066 74748 79058
25700 79058 111197 33058 128573 292672 196504 234803 98363 -142486 -316092 -163398 -100853
25689 -100853 -59429 -70359 -44147 -27388 119995 100248 179797 120106 158228 87612 -91959
25678 -91959 -255190 -273301 -199062 -48980 110247 93402 20887 57449 -41362 -239088 -305858
25667 -305858 -320903 -116459 -225 62784 -7881 -97582 173417 303611 185659 -68
25657 -68 -40293 -103885 -111292 -20662 -37778 -229673 -76041 2060 44537 158454 194237 236711
25645 236711 320256 336087 223659 77991 138476 154789 76107 -10829 -143044 -182141 -168123
25634 -168123 -140027 73176 317383 370209 480599 431618 408617 13641 -71417 -12277 54796
25623 54796 119801 110081 -40668 -99268 -13732 -34551 -142173 -104092 -46078 -123912 30370
25612 30370 60882 -32177 -111602 -186706 -104344 95548 58155 -644 -136133 -214404 -95064
25601 -95064 -173198 -286123 -155921 117649 357209 299820 50282 -15691 150085 325085
25591 325085 298011 115609 63033 119478 -91768 -160145 -207063 -332787 47619 -78008
25581 -78008 -172760 -9960 172106 51881 -64027 114845 147846 184827 13462 93677
25571 93677 135828 151903 -164721 -272936 -92253 30980 -43841 -127203 -170663 -165948 -84726
25560 -84726 -175855 -64791 6126 131758 211542 170819 -29121 -24114 14399 23820 101640
25549 101640 45715 -59937 -111086 -418120 -414357 -263119 -381737 -511572 -516145 -263829 -90691
25538 -90691 -140058 -127648 32734 246452 49822 -112420 190383 228059 -4624 10839
25528 10839 -63626 -273735 -225986 -232310 -268619 -346646 -342493 -175433 -198532 -255461 -272869 -234467
25516 -234467 -156409 -239931 -405709 -161265 173983 40758 -20738 162113 302994 199299
25506 199299 162485 -43071 41707 235775 361085 369990 332142 246060 -141205 -346380 -373583
25495 -373583 1786 124189 167668 244436 227044 139294 111009 34980 -55949 36361 20153
25484 20153 9357 6815 120649 162250 -132142 -312967 -390970 -61914 202093 108976 -32223
25473 -32223 -157455 -272961 -418940 -246275 -179662 -185734 -168690 -86932 -145833 105316 295203
25462 295203 328098 243467 123543 163174 -29452 175333 355661 154758 -23871 79992
25452 79992 -107652 -146723 -97434 -92670 -133253 -49026 -46611 166810 257814 167841 100
25441 100 18235 -54612 -181443 -74432 33148 167568 232564 15644 -54976 -125094 -56826
25430 -56826 175843 71984 -22483 101519 183998 187678 131965 67925 109531 37868 -163747
25419 -163747 -332405 -148624 -142609 -123453 -290796 -294378 -21771 98747 177657 433076 617438
25408 617438 395707 159053 -65711 -83478 42412 51105 148873 31687 -38226 50068 -39173
25397 -39173 -138192 -221315 -339292 -286196 -26381 71568 -35627 -13462 -28251 -39799 -14066
25386 -14066 -19864 181942 191248 59269 46658 140820 108808 -116459 -136131 -92082 34114
25375 34114 214350 153969 -133916 -97805 -9097 24887 -27729 -132961 -108363 57743 2736
25364 2736 -69263 -248462 -388858 -335378 -138166 53487 43047 252069 237612 99933 -47928
25353 -47928 124008 399285 200555 -55420 -169968 -187306 -137613 -133170 61093 263965
25343 263965 257722 204320 52947 18525 231712 -30688 -421564 -462734 -325618 -222690
25333 -222690 -262196 -19461 46901 74052 101698 -95057 -223765 -128206 42692 210326
25323 210326 125049 -156684 -56865 -78719 -218501 -135079 -45577 109169 159175 37075 85500
25312 85500 166846 178941 354143 324503 222494 99669 128508 265977 134440 115248 133120
25301 133120 146383 317537 240565 424293 299238 -4018 41554 157029 233768 426290
25291 426290 382809 207986 -22005 -34879 195868 191400 84230 -219116 -388409 -340703
25281 -340703 -34323 65015 133394 342043 196732 106789 126381 -175235 -72533 149497
25271 149497 142178 168677 92182 26596 -131 98460 107658 95351 8761 83606 109991 41830
25259 41830 -2273 190018 275263 -28457 18377 72129 186144 157350 162717 -16197 -171423
25248 -171423 -262813 -251470 -141814 -149175 -303878 -340155 -266138 -79280 37527 103479 80497
25237 80497 70322 13351 326822 157309 -86053 -183700 -115237 -114805 -139314 -18282 129499
25226 129499 -55605 -140352 -83802 1526 -40416 -48004 -32310 156146 79237 -94123 21910
25215 21910 136482 80089 -78055 -255353 -142923 137301 266736 245405 146945 38161
25205 38161 -25614 173006 367526 341390 228611 -91283 -36691 23307 -41428 63422 129610
25194 129610 153968 -53459 80048 230937 217600 281903 330738 127532 -46022 -145362
25184 -145362 -180803 -230109 -75826 34609 -22823 92421 170837 75316 -121968 -175725 -38049
25173 -38049 31243 167804 525616 476757 471663 635859 469860 267707 131821 223540 187945
25162 187945 220081 23999 -233517 -321673 -226249 -130500 -122326 -37365 -85986 -43593 -65969
25151 -65969 7367 -54620 -132513 -53535 209194 253462 39707 -115134 -282211 -228813 -69878
25140 -69878 152445 270682 120722 -88681 -249052 -371691 -107988 122933 337915 267425
25130 267425 150185 -64811 -29887 10219 -78699 -73026 197324 193246 -71641 152018 338413
25119 338413 254795 37584 -277126 -449251 -352498 -133291 83375 122982 274720 262683
25109 262683 159182 -11064 -85658 -99676 -168817 -47682 -24142 53624 119674 102501 -245923
25098 -245923 -175296 66166 142048 124165 52411 44312 133894 95463 139551 303556 64500
25087 64500 -108981 -78158 -164709 -130273 -268039 -258670 -102934 158684 165175 -1938 -34543
25076 -34543 -106010 -127807 20578 258769 251271 207836 205019 97303 -85783 -184953 200618
25065 200618 198570 -24682 -144718 83588 -1328 -71797 -287322 -242610 -97914 -14450 -187335
25054 -187335 -139946 3940 37198 -4568 48401 -86264 -123928 -64847 -14967 15415 -268923
25043 -268923 -292942 -205483 117041 -71273 -488656 -445897 -316416 -223246 -274685 -5418
25033 -5418 94145 39612 -29628 132420 163049 87911 136000 262128 97814 10462 99077
25022 99077 -100830 -364933 -607990 -462708 -336753 -508948 -409785 -251674 -24635 267934
25012 267934 394637 543161 509630 504037 522908 374565 305413 296882 374122 337589 297864
25001 297864 375365 313357 160130 70121 41297 124492 179516 177149 107480 141757 185298
24990 185298 377236 352616 -26750 -71998 -90456 -25820 -65092 -23259 51181 -41759 -318527
24979 -318527 -182951 5382 39084 157150 36544 163256 148517 195694 274783 254919
24969 254919 242296 184943 269155 489371 506820 384509 123686 84835 7460 -169949 -209046
24958 -209046 -112953 -290437 -262819 18419 135334 -40670 -93034 -247678 -440377 -363280
24948 -363280 -341696 -530868 -381470 6769 127362 196696 62488 -24624 -69007 -26121
24938 -26121 187441 4266 -1216 95614 -73518 -125606 66368 145682 206341 299293 250911
24927 250911 -64726 -205041 -212762 -359294 -312025 -124306 143165 270207 262845 232162 58090
24916 58090 -220738 -227251 -181522 -311646 -374745 -302481 -351535 -397582 -201219 -317437 -221946
24905 -221946 -91802 124355 198293 128573 42477 131420 101885 27110 18012 54402 -145033
24894 -145033 -100453 -82319 -83102 -178269 -302631 -348944 -375691 -343285 -177610 33602 88113
24883 88113 -97740 134438 198802 -106190 -185816 5729 -9477 33697 181180 191918 357902
24872 357902 195643 182767 167085 -13323 27435 -27832 -57326 118730 373441 227978
24862 227978 -197659 -201115 -56816 47630 -91603 13105 -26712 -54674 -35904 -200599
24852 -200599 -99134 3707 25475 -55612 185874 346109 433909 346816 188343 162983
24842 162983 39688 -130489 -159438 -213556 -207811 -297826 -281952 -177631 -4190 237313 346834
24831 346834 196437 -80560 -39489 -38742 -195888 -187364 -143976 -343221 -319224 -105682 -87365
24820 -87365 -73327 224928 112467 214378 273481 287286 237771 243575 283830 65193 -45975
24809 -45975 -32437 -47574 44096 196339 321419 463744 331753 -103201 -290527 -231307
24799 -231307 -160784 77466 75494 17312 -11057 -93271 1481 -66502 -121913 -112453 10500
24788 10500 12791 85513 53072 255133 263984 106210 -21021 -13447 23001 -43843 -68257 -116536
24776 -116536 13943 196827 184778 128016 52567 -4945 -100437 -104197 68979 100041 87181
24765 87181 19947 118630 -58379 -150388 -346450 -349332 -126333 111486 -105509 -284191 -239304
24754 -239304 -130174 -124841 -274554 -172461 49723 162602 49375 82946 -29041 -66926
24744 -66926 82307 314809 142104 -112708 -163503 -289199 -303044 165486 302697 341613
24734 341613 71667 624 -26838 206784 212465 170623 8874 -106764 -166473 -151099 35025
24723 35025 219334 249972 54440 -81633 -163927 -111130 -26951 20908 74572 -82253 -377239
24712 -377239 -321740 -45011 111180 -153928 -235416 -285836 -447425 -374910 -234377 -256067
24702 -256067 -295791 -264839 -226214 -188702 -3799 39315 307057 322924 129958 -38048 -54299
24691 -54299 4718 12078 218200 95960 43964 125038 -19992 -149687 -241158 -156958 11468
24680 11468 92224 92753 111172 -58697 -270545 -264935 -361966 -292457 -210595 -89366 145927
24669 145927 179195 195953 233465 172017 195479 314729 363985 516604 602714 525498 209282
24658 209282 99669 142462 121149 44501 130724 39748 -204149 -285332 -34278 100605 -80619
24647 -80619 122663 82756 -52584 36284 262288 316901 117369 -26212 -135808 55980
24637 55980 95691 199406 208731 94791 -16461 28589 -81568 140189 143162 154557 231681
24626 231681 233158 228460 290191 11176 -169229 -95316 -73039 -46495 2118 80121 11621
24615 11621 -37151 -344077 -603158 -544771 -403927 -270908 -54085 -11231 -122814 -186723
24605 -186723 -133501 -50920 -175664 -290915 -388319 -387610 -318570 -32144 17509 23149 193222
24594 193222 125610 17801 -36297 -33401 33461 -38044 82837 239963 214695 333352 318464
24583 318464 306409 292127 183329 -85287 83851 87502 129465 136016 7157 -81672 -129769
24572 -129769 60586 -90795 -411991 -141266 -31133 28152 -19161 -46470 27411 151391
24562 151391 154166 -137906 -319317 -333286 -491123 -359516 -284034 -125060 -86808 -150704 -16024
24551 -16024 21021 -196399 -337114 -301002 -106718 -21643 64972 287070 121330 48815 114569
24540 114569 63348 105312 87911 -74301 144478 55796 -102865 -184968 142305 300114
24530 300114 91833 -57789 -30485 -1425 82587 50696 -236994 -211645 -310954 -256529 -333206
24519 -333206 -64290 260841 251958 162120 -2660 -64981 -55771 114806 124711 104499 52238
24508 52238 -95053 -202507 -243400 -337143 -283911 -307660 -358736 -211246 -271968 -396189 -239217
24497 -239217 -168210 15078 338654 420090 378594 202338 91198 -27989 -192073 -118722
24487 -118722 81237 48283 22357 82011 173856 404738 507405 177090 62731 -90166
24477 -90166 -189570 -32250 305838 203107 55545 -232153 -289187 -269484 -295912 -272841 -196764
24466 -196764 -25382 -35073 -67743 -118554 -29618 -201991 -319482 -184623 -123071 -82348 -21079
24455 -21079 -162074 -278180 -326040 -323703 -264580 -112778 -113839 -163138 -151994 -161059 121734
24444 121734 273028 263653 226403 156895 95269 -26028 -163459 -270819 -159814 -105706 -176581
24433 -176581 -210234 -82135 -60786 -17143 30434 45588 35458 -130846 -256546 -57257 112591
24422 112591 40880 -117270 -210413 -213516 -219878 -263688 -295346 -138547 -145440 -135094 125518
24411 125518 220209 415191 276098 231939 275942 375460 233230 -64687 -298674 -171080
24401 -171080 146832 274641 261145 262097 311640 216180 38575 10169 77984 127960 -4396
24390 -4396 21309 82633 70865 230806 100650 -131308 -214543 57896 306445 356982 216276
24379 216276 106821 -105727 -173198 -50670 46917 81017 -116354 -122493 -113445 -54781 5892
24368 5892 -50696 -264099 44810 197107 59431 -91262 -307595 -268467 -127118 107366
24358 107366 51056 -71667 -160625 -98937 63569 -48284 -73690 4076 191872 324893
24348 324893 140961 -214722 -332060 -378938 -291508 -272723 -110345 -17002 -91448 85702
24338 85702 157566 377078 257985 175021 368323 321146 38413 -110840 -138180 36626
24328 36626 57309 -76235 69013 47865 87620 214849 204312 125782 -111658 -161901 -16264
24317 -16264 -117333 -59605 198586 231357 280377 180250 69399 -84909 -103117 -20555 -56736
24306 -56736 -116523 -60812 121509 162645 -30959 -542 -118592 -273031 -235251 -4130 76345
24295 76345 32581 34133 57173 15645 -2865 75087 288273 53196 64971 219996 406465
24284 406465 339748 176882 48464 -295451 -254632 -307455 -305305 -174724 -209771 -75098 -88266
24273 -88266 -162977 -433958 -402730 -354003 -209183 -121143 -170680 -365076 -402112 -343902 -61860
24262 -61860 139733 70656 -103620 -209126 -184486 -30376 103540 204083 133813 -115318
24252 -115318 2991 192962 238925 331975 292529 433702 76024 -64354 218759 219105 101370
24241 101370 169599 186390 193739 279823 432964 261265 123476 45885 165833 154302 82593
24230 82593 46849 -8176 44278 -10329 -62456 -180513 -293489 -143367 -63297 -20047 -179721
24219 -179721 -138705 -194369 -93855 -137820 -201474 -85420 49035 -109169 -129831 -233818
24209 -233818 -305108 -295878 -225185 -247520 -253467 -313898 -217022 -7064 78995 -37259 -100423
24198 -100423 -167442 -212207 -214687 -149133 -174150 83068 32434 -27782 182459 311552 -57394
24187 -57394 -206057 -192741 121648 287426 391761 381252 264145 136649 94819 54634
24177 54634 33602 48942 -176071 -251954 -214761 -204657 -166481 -60982 311991 512559 514331
24166 514331 477842 395287 274739 268340 704501 873610 691197 371831 61483 164914
24156 164914 40893 -16430 135741 173654 176659 166989 167420 137053 -45260 -140494 60481
24145 60481 65063 77089 136900 -54451 -75618 -218502 -184372 105028 146104 76792 -19666
24134 -19666 -99199 -47923 -17308 -147463 -53369 3116 -128978 -14055 148006 228765 130550
24123 130550 -36223 -161144 -93711 -196891 -306122 -63308 -83445 -106505 -62948 -144866
24113 -144866 -13674 -22624 66858 208848 188445 9835 92898 257541 254120 108411 -126589
24102 -126589 -43364 3834 70191 250407 491148 465126 487837 387921 397225 255904 39022
24091 39022 -72772 61031 212787 268149 218206 77910 13296 -16149 -45459 -47818 -137061
24080 -137061 -119569 -101589 -103525 -75305 -188632 -80587 -2651 169105 132999 -49611 -215746
24069 -215746 -169503 -135145 -113794 47352 35040 -125661 -112607 -217572 -165329 -140103 -78815
24058 -78815 -27044 61527 99099 207972 16838 -36608 102551 234664 406563 623326
24048 623326 648427 324670 61279 -99412 -161157 167012 474930 280013 167091 122521
24038 122521 205291 103920 -195062 -146650 -263138 -512293 -473431 -406509 -331552 -101882
24028 -101882 -254123 -311956 -55199 269408 288969 242517 162101 56537 2624 211815
24018 211815 465673 240199 70257 -71200 94608 378405 390302 203615 250684 282513
24008 282513 84905 197122 413873 378961 313300 336590 361888 194141 -25996 -115640
23998 -115640 3491 109993 225133 90230 68036 78740 138641 161879 121017 196798 156130
23987 156130 183601 370485 195586 78275 -49523 -98560 -76277 44241 53418 -39206 -130682
23976 -130682 -102695 -19361 191045 334340 269745 195716 -18120 -73202 -19116 86696 19677
23965 19677 -153568 -181182 -65370 -124872 -25256 148061 135119 31704 -27949 14022 -42437
23954 -42437 137376 276907 224195 -22548 46810 174280 169636 182080 172085 250724 191138
23943 191138 -143900 -378236 -549601 -274757 135499 219003 208925 -6000 -94310 -167284
23933 -167284 -158748 -203417 -208072 -101486 12867 67528 -47965 -198258 -31703 221982 85227
23922 85227 99809 198899 233262 190026 -196811 -280111 -288151 -66795 159882 -53775 -250865
23911 -250865 -283423 -181670 113463 367276 350624 201908 207982 168129 109595 34170 9764
23900 9764 109078 42881 -69630 -105362 39755 -68084 2759 26636 -18949 186935 302895
23889 302895 395563 292926 104068 -183973 43095 88159 83294 51233 60233 336918 408219
23878 408219 255812 23496 -66227 -292834 -524561 -481320 -441878 -447961 -432811 -294256 8452
23867 8452 350583 383492 104081 -37466 94579 -4857 -180650 -50633 15988 -139878
23857 -139878 -159285 -150491 -173163 -9209 130543 122825 31765 189616 289144 312969 154974
23846 154974 131923 286000 272397 289746 294436 184994 121615 -24342 -102219 -165590 -192283
23835 -192283 -107174 77509 -25519 -125384 18907 -141673 -247279 -341961 -314959 -405261
23825 -405261 -503697 -371196 -44229 -72984 -397 29895 -162711 -239363 -211573 -14819 40257
23814 40257 -40823 35335 143969 55023 -209584 -225911 -148438 185350 252870 91651 -53082
23803 -53082 -77486 68763 -19030 73461 -43016 -73298 182954 67768 23171 79513 376178
23792 376178 314664 207986 14008 -11188 -130769 -285992 -253164 -73028 150467 77516
23782 77516 209990 142891 55807 -51078 -77740 -20236 -3148 149534 42096 37149 136932
23771 136932 71732 55724 -166602 -119467 33848 28262 19971 -47872 1393 8245 119580
23760 119580 45609 -80841 -131817 -104240 -77333 -78197 -294173 -264558 -209686 -235900 -122885
23749 -122885 23634 77993 53207 20010 -41057 11893 93258 68323 -89003 -163540 -76450
23738 -76450 111508 -62103 -234199 19562 236429 185553 186451 189635 250012 156468 2134
23727 2134 -253711 -283426 -275392 -16359 318639 337093 351075 138589 109984 101687 -83488
23716 -83488 -31763 -127775 -252529 -226502 -185933 -21918 112772 202428 320359 358342 272877
23705 272877 58147 217070 361572 420583 335071 419392 370217 210559 98019 142356
23695 142356 285494 220442 111613 -152177 -179331 -201911 -312066 -97943 350140 189127
23685 189127 39015 37335 105929 195134 252456 88030 83133 240283 193220 87589 -95892
23674 -95892 -174990 -185016 -230879 -187744 -240067 -242899 -176652 -123438 27417 -70553 -120949 91082
23662 91082 110153 36864 -77222 -264466 -194939 19812 335217 532083 275585 154950
23652 154950 80440 -49669 -267836 -284827 22629 -19840 -247446 -224509 -327920 -70654
23642 -70654 -91662 -107443 75957 146973 135220 173508 223554 106086 -89634 -123205 -68293
23631 -68293 24376 223846 75775 14982 -107893 -145199 -89453 108741 223485 184460 116568
23620 116568 -127203 -130624 121636 314617 397658 91632 -128440 25154 14272 -137544
23610 -137544 -167117 -167812 11776 32646 -108252 -6821 28408 224387 145856 -77284 -266858
23599 -266858 -39361 20637 -7930 -116294 -146722 -225041 -318057 -425581 -281846 -131136
23589 -131136 -31795 37518 268354 219620 104085 -58874 -189137 -45773 83953 94295
23579 94295 157025 208121 181051 49129 -183103 -335593 -359643 -301767 -194437 37840 -19120
23568 -19120 -15702 116224 -31556 97436 250703 417908 498835 506642 538467 562987 333320
23557 333320 33735 -7367 -152733 -261848 -549389 -557750 -529702 -452317 -63941 114796
23547 114796 -301449 -551110 -358966 -130945 55559 269917 196937 83186 95161 65186
23537 65186 -132589 -153870 -95949 -131788 -118695 -85386 -59466 160364 196726 201992 212901
23526 212901 262740 311357 7617 -59375 -24325 -100751 -238095 -179658 111457 161573 98334
23515 98334 -99991 -95112 -79635 -202819 -297788 -364575 -450634 -464037 -487965 -283437 -21849
23504 -21849 185129 207508 184040 186717 375321 396026 226184 148289 75617 36575 -86083
23493 -86083 551 12978 1865 -116931 -19857 -123512 -142043 -168824 -109549 -182656 32775
23482 32775 -83304 -100166 -160700 -250081 -267485 -346501 -258272 -205975 -185259 43993 61903
23471 61903 160706 136778 -19613 -131960 -43961 -111377 -205821 -139320 -83288 -102058 -38188
23460 -38188 -112304 -50572 -11444 18504 152572 158220 229630 173414 282155 370531 144778
23449 144778 -25356 8133 -108702 -207030 -226475 76367 49248 90745 150951 169689 195401
23438 195401 -38375 -104066 -60402 147931 -17859 -47464 -167833 -14766 -36645 22866
23428 22866 93851 -58736 -86493 -146863 -221015 -65711 -27449 -106220 23718 9488 94502
23417 94502 130557 163614 29765 -21757 48488 193142 132957 185063 654 -204336 -180903
23406 -180903 11289 26085 -130244 -183145 168709 391555 245885 103225 92289 105561
23396 105561 165353 96011 140631 195073 -53120 -127354 -81296 -34546 78489 232425 163426
23385 163426 25761 -48311 -99963 -75598 93710 358302 307687 151805 27973 -163120
23375 -163120 -174328 55327 39361 156628 103348 34368 -88493 -156383 -22031 -1159 230538
23364 230538 354449 226662 40548 -145389 -203582 -75014 -135639 -314359 -448305 -420762
23354 -420762 -270551 -229508 -17641 -27715 21576 -58843 -115327 -130217 -148908 -42968 45239
23343 45239 22778 61534 -107852 -126195 -114917 -274101 -285522 -131928 62278 187918 187309
23332 187309 211472 201088 45153 217052 224595 167748 -53709 -389156 -378201 -154144 -167014
23321 -167014 -130491 -116984 -109247 -143566 -239204 -42285 -60703 -158945 -133204 35741 64880
23310 64880 104229 151549 -16849 -66884 -124117 11047 168926 281153 387617 501776
23300 501776 358899 236325 80034 203583 19895 -37306 71489 27538 -143220 -338849
23290 -338849 -339423 -80282 -120797 -192140 -177707 -50614 70447 176821 107320 -13993 -11838
23279 -11838 234017 201612 99491 28182 29504 320848 28642 -171142 -173319 -189116 -210216
23268 -210216 -161780 -57732 -59976 90434 158163 39276 6615 -7972 14762 70367 -54306
23257 -54306 -126676 -181480 -341708 -347312 -392625 -393575 -355619 -385734 -205628 -110440 -168638 -184676
23245 -184676 -184682 -8489 263006 58304 -43943 48288 -30764 -236313 -94836 79899 66820
23234 66820 214875 72652 -106612 -3620 -69317 135241 229679 92376 -88827 -99412
23224 -99412 -339487 -577274 -424260 -105419 -17012 -98982 -172923 -70209 -160537 -168491 -154242
23213 -154242 -61807 3310 -73527 -49709 85194 -155468 -364517 -376504 -332787 -114122 42981
23202 42981 265508 234708 11006 89097 185426 132877 70515 -29507 -114583 -23847 24249
23191 24249 -74293 -69562 22047 48980 16103 -73773 2787 168002 60662 148689 412423
23180 412423 277664 335866 315354 331070 318973 237185 -23480 -137727 5718 132576
23170 132576 47027 115213 86225 -160732 -138870 -299284 -533512 -362180 -205038 -254794
23160 -254794 -276076 -274462 -5284 -20205 -113773 -102846 -28497 93373 20191 -140313 -2701
23149 -2701 -208609 -565176 -596810 -523349 -529648 -271775 -16142 43006 316673 143214 -101918
23138 -101918 -109913 -42241 25293 -82940 -296219 -429251 -522511 -573703 -394001 -355222 -219294
23127 -219294 -105828 21835 220324 -6922 -166673 -129809 -8934 150235 -112472 -198118
23117 -198118 -354726 -367550 -60615 85904 -164128 -48260 192567 -126120 -268639 -207586
23107 -207586 -62936 -186298 -228094 -219738 -229017 -175976 -356687 -229109 -182349 -327321 -428780
23096 -428780 -126212 48319 95539 80066 111432 97941 74833 127356 276880 163253 -36573
23085 -36573 -223728 -398277 -469310 -469430 -350863 -162120 -172368 -140921 -64847 -81070 -181165
23074 -181165 -235240 -158208 157906 545017 440862 237357 138851 238852 246550 72937
23064 72937 48543 -22898 -5873 -207881 -207896 -58134 92201 151036 312991 282762 5825
23053 5825 -95482 209122 212748 146923 26968 -33913 -265872 -332556 -170695 -4257 -100724
23042 -100724 -149838 -170450 -279098 -350729 -273844 -162578 106753 192578 190894 272091 82215
23031 82215 -19198 -34249 -100603 48344 384478 367028 309580 240388 5554 32656 193803
23020 193803 360789 315014 426299 273128 117185 186056 390880 403499 150079 206594
23010 206594 72805 4635 -154091 -173560 156462 230540 205815 154132 194310 188692 37959
22999 37959 -136735 40474 60501 27175 48597 10929 -204678 -485357 -431417 -122953 -24924
22988 -24924 84426 -110147 -349579 -394469 -436238 -189089 -160049 -119491 -124935 -203563 -136697
22977 -136697 75456 146426 97477 88025 4772 -116418 -70452 -99906 34512 236818 323113
22966 323113 386198 185488 114878 77997 5811 -188730 -361466 -502728 -643085 -526209
22956 -526209 -569387 -792913 -523762 -302193 -260800 -344732 -397433 -288076 -300345 -337185 -268182
22945 -268182 -146581 8097 -22751 -88640 -152918 -14692 -43608 -128071 -38419 150825 280614
22934 280614 -8034 114116 200368 67230 -41731 70441 251966 141564 -110937 -136413
22924 -136413 -199756 -227770 -29039 208101 196846 187025 203608 150688 62058 -56059 -23815
22913 -23815 -67353 -120525 -278032 -151847 -110977 137383 343814 225890 170243 13745
22903 13745 -112661 3296 322632 406141 455105 458627 458533 325451 56410 -98693 -6440
22892 -6440 -159325 -430903 -696342 -566843 -224891 -56548 -39953 23511 136845 -14213
22882 -14213 -248448 3344 158105 14526 48944 119526 216133 268007 152275 45884
22872 45884 110206 45713 -372818 -594816 -521464 -522903 -258264 75822 65686 -2777 -35985
22861 -35985 -102028 -123226 -65677 60251 128699 -80349 -187891 -14622 -22492 -121692 -260503
22850 -260503 -316739 -277391 36797 97616 40982 296501 386223 140900 -250027 -250190 -57177
22839 -57177 -69778 150670 275380 230175 13385 -72758 29207 121436 -35318 -196913
22829 -196913 -35883 68422 52790 44260 128359 170430 220986 246888 77140 -26845 -11753
22818 -11753 143296 135955 8603 -188415 -423675 -239674 103050 127567 -148624 -163361
22808 -163361 105282 71837 -74774 106588 342207 220281 100303 -10182 148104 227756
22798 227756 163997 145845 16046 -214319 -231954 -205499 -492694 -561527 -305887 -158272
22788 -158272 78494 199252 104606 -5635 -196909 -120564 78972 256794 484110 269683
22778 269683 -54683 -240633 -127500 89910 171808 109798 114096 220374 122760 -14315
22768 -14315 71441 123330 133871 23053 -10736 -81311 32690 30722 -54050 -145350 -58837
22757 -58837 118507 64556 165210 78736 53697 85481 -53951 -77076 -30949 -123568 -162038
22746 -162038 -206027 -197368 -165035 -321371 -239783 -66770 237145 322262 -63165 25058 264719
22735 264719 272846 98410 24238 168497 244615 306537 241711 -60699 -13838 -87455 -77466
22724 -77466 -4894 -63527 -11066 63408 24198 38016 91418 -24901 -149842 -394137 -458454
22713 -458454 -274109 -213351 -248743 -198362 18039 203317 209745 194660 23043 115691 232069
22702 232069 15582 -98767 -183946 -49158 -17848 -22744 60289 98932 -141185 -297205 -145353
22691 -145353 -130753 -336929 -246302 -49384 1440 -74499 -6231 -62078 -12945 93858 176563
22680 176563 302728 315952 301521 269798 263641 228864 335524 375681 271415 121766 83112
22669 83112 -99846 -292669 -198880 -59712 -14062 14747 15750 8382 -83798 -14521 76578
22658 76578 101397 65563 84246 76535 -55720 -22828 19596 -131185 -164088 -257628 -279062
22647 -279062 -175105 14875 -17319 -41049 -55511 -122883 8952 -121814 -422966 -416368 -235739
22636 -235739 -324890 -254148 -408876 -630912 -592939 -480341 -343762 -437597 -387123 -162471
22626 -162471 -150166 -242542 -212193 -261092 -416542 -274907 -335528 -134935 -9038 48443 202160
22615 202160 246125 143143 43028 145533 300896 132826 -26475 9436 -39633 -3994
22605 -3994 163189 152581 268884 315942 382755 377034 119691 174632 140335 155170 124816
22594 124816 4653 -197025 15403 -25194 -100009 -24099 97011 354484 458121 322035
22584 322035 77361 68973 52752 248441 225281 73816 80452 148330 172926 347075 564201
22573 564201 549399 457077 365728 280325 257171 188697 30373 99706 32666 66682 69208
22562 69208 -90891 -113205 39115 308912 400403 72431 -94320 -36533 -5077 -89321 -147239
22551 -147239 -33367 54922 -63991 27605 192958 65308 -211499 -93901 11029 -182709
22541 -182709 -321247 -279263 -173790 -242658 -100998 260836 246040 -180537 -269727 -249819
22531 -249819 -1441 11240 -28572 193396 414654 173475 11247 -49268 108130 324711
22521 324711 133219 -16463 -87668 102748 -10043 -1868 43321 165232 215415 151517 339433
22510 339433 352600 256793 -1562 -266268 -214461 -285913 -340177 -266284 22321 30549 -40430
22499 -40430 -100543 -154856 -150562 -235217 -260699 -127941 -263027 -415259 -321924 -267131 -190154
22488 -190154 -31123 26804 -69321 -246742 -188639 -209549 -380159 -226259 21604 -78245
22478 -78245 -441185 -259057 -107965 -14985 187604 25403 30915 39750 164242 369270 133987
22467 133987 -57541 -6637 123994 -24104 -154926 -206606 -196973 -107229 100297 67989 -106084
22456 -106084 154578 238958 271709 262472 220680 32134 -112277 -122975 -84058 -159939 1417
22445 1417 54598 -108823 -361767 -287231 -225477 -193863 -205923 -242243 -222746 -181009 -315179
22434 -315179 -220952 -230809 -153927 -248751 -205897 81229 234016 192736 137326 -89186 -399192
22423 -399192 -350016 -318180 -268558 89820 276963 222256 220168 365423 248417 255088 299052
22412 299052 44395 -95088 94350 45975 -51790 -165359 -284046 -259880 136443 143880
22402 143880 80229 -72342 -61353 36388 -157559 -258530 -49711 75538 -157982 -272469
22392 -272469 -197647 -76201 31294 -57826 -179339 -111853 32979 137221 105809 -53976
22382 -53976 -96306 13523 -204009 -210198 -109046 94323 242777 477996 522271 361598
22372 361598 265702 387267 475990 261394 79087 -59197 579 -183847 -397122 -379437
22362 -379437 -59155 2007 96645 101094 11003 -286424 -544232 -481454 -331023 -101027 7823
22351 7823 123203 130865 122622 163640 110330 36773 24779 -142073 -248054 -289108 -227309 -182162
22339 -182162 -283990 -336131 -326597 -149827 93131 132142 153767 266097 148869 -127723
22329 -127723 -258427 -253956 -335757 -306924 -103505 -16214 122931 159122 13929 121782 168193
22318 168193 80858 170891 186507 -23420 -260404 -43214 -6319 -97781 -47722 -156946 -319445
22307 -319445 -221087 89537 261310 196717 77077 -156006 -204810 150924 375606 288785
22297 288785 57727 110866 229933 298016 356023 426316 211866 -28989 -185960 -181991 -44133
22286 -44133 -70359 -759 78538 212913 292263 276542 135703 94331 54785 -26282 153629
22275 153629 235691 158740 -26052 -169017 -233664 -74887 -53971 -32303 -165351 -134713 85044
22264 85044 310808 242070 332632 496447 248085 78031 -207596 -209553 -75416 -30469 -42471
22253 -42471 -176890 -251923 -184056 -143201 -121572 -98423 1501 149609 335391 292343 91977
22242 91977 -68781 -45315 204895 124945 86533 -104476 -56390 -2422 68119 -68930 -51993
22231 -51993 57041 84047 162907 111306 -66365 -248713 -342847 -125044 -101031 -171952 58420
22220 58420 41237 -33364 -52157 -11267 170484 232575 37660 -162272 -183865 -205678 -240042
22209 -240042 -242626 -268031 -348127 -184459 -85169 47681 17997 -31749 56088 80686 289391
22198 289391 330962 6120 -667 71353 106529 31179 117068 339852 141887 -177747 -253805
22187 -253805 -337898 -174016 135533 271294 258823 102369 68111 -228973 -429146 -312074
22177 -312074 -247973 -325803 -182036 188886 313923 218327 262467 291933 25469 -43990 -47688
22166 -47688 151029 246088 202639 79579 -55548 -145416 27762 226239 159896 423831
22156 423831 430344 281762 431479 307157 117473 132275 -32609 -63253 -87371 95453
22146 95453 97405 31554 -103516 9990 -13466 184895 100584 74849 308371 411785 461645
22135 461645 463650 351672 179227 45813 -19447 -308644 -338231 -94403 139980 302706
22125 302706 145780 52619 42875 -95549 -163176 -103233 71861 168022 233448 351218 330703
22114 330703 6407 -207249 -188985 -65523 -208786 -238562 -107337 54574 -84796 -283324
22104 -283324 -235158 -27441 70529 60910 79156 -328530 -457360 -217445 129916 509506
22094 509506 318345 37576 89620 -50574 -200370 -283339 -106469 91055 -75482 16065
22084 16065 136887 150099 68228 -41810 -148327 22458 36149 109656 -78272 -321511
22074 -321511 -173311 128663 104849 149407 211156 236335 179446 449644 360611 91351 127340
22063 127340 181281 227626 128910 -29702 -80342 13613 97323 30181 -67340 -295538 -444526
22052 -444526 -472055 -346728 -313315 -211145 -120025 -25584 -85009 -117659 -38608 213032 292703
22041 292703 75496 152883 108990 65835 174207 152550 -178811 -429966 -208308 -258097
22031 -258097 -390712 -430682 -453279 -156727 -7519 26913 111204 9880 -24277 -115836 -266064
22020 -266064 -183599 -84314 -15638 31977 -15226 50688 108019 94403 64757 -19789 -9664
22009 -9664 -37469 -49842 -67299 65436 44757 -30379 145671 184849 195189 155288 8816
21998 8816 -145197 -146715 -157698 -282993 -327958 -279472 -245956 -203542 -72371 -29899 60574
21987 60574 -251672 -420502 -99833 249349 178788 58715 173441 240932 153663 72021
21977 72021 -76031 65806 178533 57718 80344 235324 150075 198375 268507 179674 106764
21966 106764 51282 6850 43361 2753 35655 87717 53042 3245 -219960 -300229 -64227
21955 -64227 -112000 -86168 30755 -7748 -126134 -132654 -159327 30382 63778 201112 289078
21944 289078 133434 59708 107094 114440 -18919 -136485 -328012 -487750 -395708 -220495
21934 -220495 -175611 -259007 -143289 -142839 -136716 -11348 -7387 -183813 -256726 -113227 -45956
21923 -45956 106170 109252 13465 -179777 -239165 13337 160446 -137314 270506 489270
21913 489270 281418 -78097 -148694 20671 159357 268740 391258 240101 -18219 -90796
21903 -90796 -209415 -104954 -31850 73094 103801 42159 -158846 -199779 -234020 -449522 -326060
21892 -326060 -56379 -108226 -122823 -174291 -197387 -171450 -207387 -177113 -54525 150917 183596
21881 183596 236515 283341 272755 219405 182688 71447 -79243 -270812 -163249 -360187
21871 -360187 -402791 -66142 -128838 -149449 -166891 -112164 -25214 58951 87937 -117295 -110262
21860 -110262 -117873 5071 151183 34643 -14446 219123 146348 19180 -181577 -359384
21850 -359384 -243427 -65740 8801 103556 -494 -93894 -305635 -252315 14216 306908
21840 306908 319335 141726 6785 -101723 -98241 -164907 28455 94497 32510 -63547 -89499
21829 -89499 -286121 -266371 -24536 -44639 -119081 -129229 -209042 -189190 -245699 -278531 -111748
21818 -111748 -188848 -183453 -84873 143146 6998 -14242 151894 125197 -137748 -185531 -168668
21807 -168668 -333388 -206899 -148157 -268068 -252782 -164676 -129917 -205224 -396557 -304386 -91192
21796 -91192 52916 252551 282972 144908 -60311 -169389 -324038 -289502 -160271 -298827
21786 -298827 -413920 -309434 -317841 -197557 -20843 -137627 -126880 -150111 -110274 51436
21776 51436 226641 68765 8491 94390 245603 333602 251504 -12436 -116145 -228444
21766 -228444 -101345 -133130 -232263 -157163 -94420 -158152 -87193 -65484 -126919 -59437 71647
21755 71647 -22305 40882 -77785 -156402 -9761 174644 138810 172223 210775 42507 2833
21744 2833 953 157062 36020 -111151 -141423 -173357 -315655 -218908 -145309 -1685 133625
21733 133625 302944 232605 270631 339223 199843 14119 -28340 -70470 -325246 -456659
21723 -456659 -246024 -166724 -124510 -102722 -133930 -107844 -299650 -414874 -527266 -449772 -209171
21712 -209171 -60826 -46751 -195355 -296995 -199735 -186705 -203911 -117040 -63565 -56949 -32097
21701 -32097 -33821 170414 33983 -2123 -27859 11103 44468 46835 136985 1905 -53579
21690 -53579 -212953 -407052 -438487 -361362 -113122 112359 169436 236662 128448 44539 -30781
21679 -30781 156780 392869 406662 315623 90273 139572 87306 93215 154754 -31004 -215425
21668 -215425 -272737 -256003 -408533 -616429 -554071 -330333 -135722 -147080 -140327 188951 170719
21657 170719 113486 54959 148502 -10077 -44752 277698 231644 124898 134896 -46247 97737
21646 97737 220754 259310 199025 104685 -133403 -205375 -274635 -298039 -303176 -529319 -559237
21635 -559237 -436305 -180474 -64754 -147966 -54200 34594 -32109 240262 134690 -53748
21625 -53748 -66687 38596 -113875 -139810 -140761 -236008 -87646 21403 -163513 -340969 -290706
21614 -290706 -225029 -23300 -83592 125363 168591 -72149 -9489 130086 25939 -245882
21604 -245882 -229882 21999 1079 4788 16426 -43341 -191885 -127704 -97704 -179641 -355531
21593 -355531 -606535 -538395 -295359 -141648 -44815 -96474 -65628 -61916 -618 20796 62216
21582 62216 -50167 39191 171334 248591 142067 -71402 -254741 -374590 -219675 -185546
21572 -185546 -83078 -96602 -64076 -219005 -68544 -316914 -244738 -135895 1371 -104849
21562 -104849 -302743 -198134 -110375 -364598 -282969 61609 -428 -1651 -131059 -429903
21552 -429903 -469688 -255532 -288724 -292055 -139453 -62148 64601 220465 34504 24384 19036
21541 19036 -71405 -75815 -334079 -155273 13366 -23477 -156969 -64658 417983 510753 265350
21530 265350 238618 191790 64282 -19487 -40103 -24687 23780 -47342 -129267 -53736 181913
21519 181913 137824 -86576 -107932 -102088 -40123 98583 252506 -21504 -250995 -348223 -238852
21508 -238852 -284192 -305627 -276301 -244760 -166465 -53985 -92358 -297386 -273184 36586 161419
21497 161419 248187 56539 -86086 -178667 -258738 -174745 -136627 -300461 -301577 -92249 140932
21486 140932 116993 -41060 -73023 107980 116865 109373 -34703 37197 -71464 -114558 -228554
21475 -228554 -345568 -236989 -188350 -338535 -322455 -359018 -330012 -178421 -48975 3779
21465 3779 -90857 -351385 -442247 -462432 -400249 -271156 -122002 -112468 -38201 -89733 33291
21454 33291 -48067 -264319 -250529 -241486 -156085 -138622 -184838 -360408 -384163 -137537 -44453
21443 -44453 -155041 -189033 -203305 -239118 -246028 -325823 -475827 -283318 -116616 -71459 51847
21432 51847 28820 -6535 -64907 -217276 -221384 -139609 -211881 -351411 -202136 -306841 -346268
21421 -346268 -253355 -131390 -143137 -204525 -339202 -284797 -298798 -104745 236209 181806 391404
21410 391404 562303 476819 400607 287580 114817 115404 400937 484606 256729 179460 176016
21399 176016 217213 190263 225077 141995 100366 271878 191833 145621 48606 -97314 -41098
21388 -41098 -76500 -56390 -807 145336 -39788 -211638 -144222 -272571 -261358 -375648 -179712
21377 -179712 -88696 -205929 -169351 -159771 -95651 165370 235446 175460 92273 -105268 -193928
21366 -193928 -426391 -423726 -354590 -257515 -308749 -517264 -488732 -457622 -386315 42061 -21261
21355 -21261 -65612 -144747 -253901 -133873 -34115 26441 151957 159260 58307 101905 295234
21344 295234 485104 358513 53776 -103798 -91033 -56993 -1584 276954 220908 121014
21334 121014 188528 208539 -5821 -204010 -228108 -449146 -537520 -665199 -559674 -349503
21324 -349503 -90341 -165672 -148948 12710 -153200 -114559 2198 55654 26595 -125398
21314 -125398 -129689 -66296 -101318 -89451 -64334 -172511 -110284 -465 -255554 -269803 -249669
21303 -249669 -135513 -60028 -3529 17548 -70674 -58055 96602 136425 31264 -12602 -142171
21292 -142171 -235904 -71450 -66976 -249890 -254069 -199637 -312133 -210761 -11654 -56379 -46962
21281 -46962 111039 316614 243334 -90652 -135012 136965 170443 -209327 -166286 139123
21271 139123 212743 29017 -199540 -276637 -351813 -248263 -68836 -165440 38878 317532
21261 317532 554799 382609 247776 290781 306038 170022 85351 113794 89046 209775
21251 209775 188099 125606 140220 99479 -114240 -119432 -65817 -122664 -109677 -16684 -18452 172084
21239 172084 219107 204079 183548 213786 32788 29151 20398 53030 6537 -398139 -510236
21228 -510236 -207538 -37641 35115 84419 7337 -154650 -3113 230024 150782 283117
21218 283117 495745 576185 560039 358691 230792 339911 469257 351695 87647 -13320
21208 -13320 -3767 -252835 -383308 -446129 -267452 -120682 -2719 -32032 -25138 -64402 63348
21197 63348 7073 -51446 -179462 -222496 -476841 -344687 -131078 52376 -81958 -312713
21187 -312713 -176860 69027 -224563 -215773 -185875 -25583 -195841 -309444 -429814 -324718
21177 -324718 -304203 -135276 99416 150710 165751 -253 -314887 -551633 -254529 -282207
21167 -282207 -352751 -43111 166195 36456 36690 4900 -256301 -378294 -362080 -319068 -274370
21156 -274370 -247076 -29058 -37213 30771 100664 199515 240396 298610 297667 90079 -292068
21145 -292068 -279151 -1824 -11279 3780 -12096 -73129 -88008 -158059 -282799 -371760 -307801
21134 -307801 -406700 -450601 -338090 -291827 -324878 -245615 -112707 36286 105272 137644 -16660
21123 -16660 -61961 -173875 -37970 6505 17870 26539 -77360 -35101 -113507 -5949 131806
21112 131806 256344 92467 -208997 -235353 -363175 -174064 -106380 -70415 -50640 63429
21102 63429 -410 37529 113998 -133370 -175936 -139992 81982 99554 62479 151071 -72739
21091 -72739 -14972 92400 21638 -72499 119830 84833 -90633 14649 118675 -95192
21081 -95192 41800 225385 235692 217354 49234 -65946 32260 69854 -97834 -177848 -199702
21070 -199702 -136632 -264189 -144117 -66212 -112460 -76091 -52220 -53248 63409 68110 -13951
21059 -13951 -72128 -6202 88471 182295 192453 -6158 -224584 -244671 -107546 13655 71216
21048 71216 69284 201033 322440 226806 106642 189690 177953 -137596 -140599 -95031 -56670
21037 -56670 8526 -119872 -54223 120808 107491 -32613 57793 123802 91207 275021 246230
21026 246230 322700 303854 209252 148536 339148 450449 275085 152945 -39258 -101562
21016 -101562 -102718 -4683 106346 74393 -61716 -240712 -191931 -77863 -36331 -36038 168909
21005 168909 214676 269167 176977 347842 289445 1994 -293078 -130224 -102197 -42577 -104134
20994 -104134 -70442 6321 208435 334840 202625 -163432 -333003 -312104 -38298 193135
20984 193135 -15491 -77315 48981 -125550 -302611 -391871 -607411 -555310 -455496 -307792
20974 -307792 -138906 59642 307264 327516 217816 163422 1740 -279058 -507264 -443962
20964 -443962 -330832 -229413 -76400 -120374 -54465 -135006 -335047 -353320 -425167 -613803
20954 -613803 -569201 -478325 -304986 -233003 -191109 -126962 179139 163007 105530 62280 30877
20943 30877 -26352 66576 108815 12828 -44655 -98619 -158742 3159 20488 -58817 -178184
20932 -178184 -223360 -328278 -438587 -193961 -222493 -169581 -227517 -428767 -253083 26828
20922 26828 11545 -142340 -245578 -263540 -138470 -73834 -64799 10041 -56423 -119901 -215895
20911 -215895 -182311 -156643 -196234 -230319 -191431 34711 164799 -26512 -110069 -52723 -12102
20900 -12102 15766 -141429 -291341 -270913 -287968 -174286 -58944 91772 -132528 -278903
20890 -278903 -336019 -294070 -144874 -264863 -418588 -595412 -431190 -510549 -682683 -483585
20880 -483585 -154114 -115093 -171046 89262 182114 39542 42273 56416 -109715 -80512 -149352
20869 -149352 -191203 -194505 -268839 -412363 -339008 -320932 -55864 -119693 -154912 -204770 -164502
20858 -164502 5618 202 -175358 -313250 9848 186663 15013 -25984 -83880 -270110
20848 -270110 -155778 -279741 -283358 -30101 -93684 -181969 -343214 -367336 -317462 -330080 -299697
20837 -299697 -311943 -590489 -491240 -267456 -117042 -91820 -67651 -187080 -155819 -59943 99613
20826 99613 -61677 -208497 -198334 -256969 -329499 -157235 -62156 -157242 -165603 -208547 -151398
20815 -151398 51303 160350 27487 -90032 -246118 -428631 -301774 -260181 -509020 -421848
20805 -421848 -174831 -18535 -26679 -65964 -324750 -417609 -316124 -194889 -339108 -269965
20795 -269965 -239619 -32244 -43806 106737 151240 -63193 -2694 -114742 -143370 109449
20785 109449 276948 142252 -21405 -35027 -23963 -190626 -62062 102487 30158 -31997
20775 -31997 -139557 -189128 -18974 107888 81644 -43404 57688 184223 177440 72481
20765 72481 166420 207979 89005 53929 -79630 -102375 -163777 -128294 -69457 -114617 -114330 111761
20753 111761 48290 129365 200351 266867 228288 146922 -60421 -306613 -226016 -184115 -414464
20742 -414464 -203838 34744 74346 46569 25923 -29037 -79776 -29960 -262146 -238332 -244536
20731 -244536 -70674 -117667 -293485 -304514 -340140 -488973 -447626 -409636 -236028 26051
20721 26051 124540 70061 -104603 -190733 -226090 -171404 -108650 -31524 152859 126825 148965
20710 148965 33105 -215151 -233216 -68292 -56162 -182986 -195879 -59117 43517 -37233
20700 -37233 57072 -11376 -133308 -47259 -193320 -254658 -309100 -189503 -103456 -134699 -183450
20689 -183450 -284570 -281076 60563 210414 50818 -51932 -180401 -103959 214030 220739
20679 220739 58162 56147 11556 -15972 -54074 -401261 -520787 -295846 -261111 -309315 -379344
20668 -379344 -439254 -390762 -160865 -8392 -57564 -209286 -416553 -293444 -216585 -355000
20658 -355000 -193900 -73359 -10248 -141473 -243484 -241062 -241301 -93148 45698 73833 -51182
20647 -51182 -130519 -1766 140902 21752 90030 176206 199007 119617 12181 104883 -1563
20636 -1563 -77337 -270010 -117008 -69118 31662 31302 95871 -127135 -213787 53760 175322
20625 175322 306206 121917 39009 36457 17945 -5628 -66507 -162100 -263946 -157440 11309
20614 11309 118327 -4052 -66888 295490 339004 67829 -358741 -357841 -581884 -749233 -650947
20603 -650947 -258908 -35517 194491 26527 -96751 74201 -37896 -20617 -96865 -199195
20593 -199195 -72338 -122214 -80932 -86372 -10866 163370 136100 -133286 -188477 -110095 -29016
20582 -29016 88697 -57211 76551 115513 -50518 -59135 138848 230650 19764 129259
20572 129259 245765 118278 60901 -136258 -349310 -253816 -53363 -57299 23476 255051
20562 255051 274243 152422 -23805 -258194 -19573 160190 136328 -34324 22219 284661
20552 284661 197158 32295 33936 -52805 -12339 -47653 11246 -116570 -195678 -194289 -64838
20541 -64838 -123155 -28759 132349 88840 -44366 -25826 -2053 106155 287095 133220 -163694
20530 -163694 -219234 -127064 -241572 -13325 55518 -140652 58517 49151 -10532 -8581 -2407
20519 -2407 -251414 -267936 -562290 -477458 -110576 4583 12741 -146889 -122275 -165134 197196
20508 197196 241143 177804 53975 -255731 -48794 54535 -119626 -327973 -297150 -263379
20498 -263379 -168580 -73174 -31344 -164501 -256719 -513763 -564843 -297387 -163760 -256275 -115301
20487 -115301 -80007 -116146 -226722 -155109 -510828 -900933 -669247 -421099 -319777 -440338
20477 -440338 -501360 -411594 -124929 -38520 -171648 -331649 -388316 -287178 -200483 -128745 -166122
20466 -166122 -193516 -359773 -286859 -372348 -431063 -408964 -490640 -440757 -259221 -198017 -34963
20455 -34963 -45560 -184577 -47317 -49647 -46201 -246888 -264975 -228060 -237079 -186519 -170385 -8178
20443 -8178 53795 121914 237567 207418 142749 215566 -1877 -346988 -400088 -266721 -39020
20432 -39020 -61043 -2004 94486 -22902 -3876 -13728 -221268 -351056 -400892 -378722 -50309
20421 -50309 -46214 -272114 -324849 -164540 -148955 135727 321706 -73799 -374339 -532396
20411 -532396 -395757 -34802 174023 64676 -99741 -155667 -195624 -192803 -58363 225923
20401 225923 232379 158267 345835 381155 -188568 -518391 -444226 -272685 -116677 -278058
20391 -278058 -515441 -545742 -491843 -423882 -467737 -436482 -274623 -248916 -68364 -131135 -355044
20380 -355044 -230785 -51761 -138194 -357586 -422469 -282635 -37114 5039 40794 43534 84488
20369 84488 -66274 -115313 -180590 -85992 -196709 -199950 -232076 -256342 -190377 -113865 -79384
20358 -79384 -72470 -205491 -265908 -28585 -174171 -322095 -77758 -44882 -181119 -275485 -333814
20347 -333814 -393705 -282317 -101040 -275736 -211382 -45347 126312 76076 31800 62327
20337 62327 -155712 -204864 -342459 -408599 -384288 -35856 120440 73306 -40448 113666
20327 113666 -34950 -350701 -338252 -375184 -430424 -305126 -49044 114405 25453 41369
20317 41369 -93684 -69819 79902 -10256 -239046 -165410 134437 115295 49261 92365 242827
20306 242827 237866 268417 55915 -82771 -4631 97421 -50684 -137878 -36882 47476 -78203
20295 -78203 -176308 -269906 -190082 149981 136313 -174509 -243538 -162175 -172976 -324691 -170349
20284 -170349 176587 342577 275950 226145 194064 111733 30289 27636 -134593 -269501 -250536
20273 -250536 -185383 -114359 -77144 -211700 -332703 -283422 -188517 -270158 -260786 -55679 -32944
20262 -32944 -52513 -55399 -21225 -42070 -45954 96767 91718 2548 10249 160745 116040 84773
20250 84773 123991 454528 329234 126599 145219 -48545 -199026 -257384 -181997 -96632 311724
20239 311724 195462 -63295 -126123 -6336 68370 -152759 -319648 -344204 -257273 -165428
20229 -165428 -52951 133490 121864 197391 92359 -1366 -70056 -153266 -174955 -96890 -227892
20218 -227892 -314912 -470054 -530420 -676638 -477096 -175160 94650 80988 -98041 -219324
20208 -219324 -143403 -115115 -114772 -191171 -206491 -76013 -49891 -184727 -233806 -254682 11651
20197 11651 -43839 27208 62512 -92648 -70955 138861 147300 5454 -41778 -76469 -32706
20186 -32706 -65896 -115278 -185902 -169785 -299952 -280929 -232588 -211545 -129528 39545 255341
20175 255341 126695 61028 177780 155396 76399 136465 168256 209583 261942 290430 149878
20164 149878 -79864 -218015 15725 221860 71120 -244118 -79188 -151017 -354674 -238827
20154 -238827 -406675 -560972 -420341 -247193 40882 247982 -38741 -405028 -398590 -141626
20144 -141626 -8437 -40556 -75513 77324 69442 -18159 -130545 -249031 -78417 -68966 -94931
20133 -94931 -50264 -69507 -93420 -129135 -162676 -215829 -309109 -67844 -142096 -410689 -345632
20122 -345632 -130287 57241 170178 -25494 17555 -30460 -14741 -62179 -22104 -113947 -104193
20111 -104193 5654 48555 38516 -68372 -80960 27893 168687 23604 -72134 -117630
20101 -117630 -233385 63619 146387 134102 112901 88767 -121203 -143153 -80543 -194255 -419496
20090 -419496 -243088 -433376 -315192 -98133 -109680 -15461 11175 -68432 -83285 -89746 -132715
20079 -132715 -115921 -88483 -198484 -22660 -103098 -241261 8767 46802 175776 297708
20069 297708 240242 132597 10445 240384 320761 190884 -102173 -261220 -586115 -621065
20059 -621065 -417596 -243586 -218881 -296785 -197809 -193494 -85005 -17823 51006 68025 148320
20048 148320 -23746 -163033 -155658 50616 59300 167763 103018 -114837 -191677 -92049 -216909
20037 -216909 -236078 -141391 -70690 141950 315269 222911 220835 314168 81918 -216480 -218017
20026 -218017 -63729 65092 -109230 -170168 -131166 -198038 -413843 -582593 -350779 -34387
20016 -34387 6214 46685 311574 482141 464515 214613 43092 82128 12900 -64829 -186538
20005 -186538 -20893 37079 -66661 -95596 -154123 -166867 -14397 48729 -30177 -43512 174012
19994 174012 111231 33766 -123282 -143969 -92240 10349 -2569 -59708 -11504 132197 143002
19983 143002 -39234 154114 136590 -87926 -252916 -131521 61666 -104106 -226332 -27044
19973 -27044 72620 -4591 148132 191373 175541 124662 102682 75035 187572 301559 161084
19962 161084 159771 261291 230192 191844 176064 128972 153062 224572 63120 -129182 -200293
19951 -200293 -66057 -196644 -353797 -336734 -383829 -317281 -179652 -81999 -339650 -213484
19941 -213484 -100328 -80258 -41511 94869 39824 -14779 -97084 -76307 170590 148284 97497
19930 97497 6812 279576 664424 1085493 1227854 1226070 1179355 1083625 780002 587885 490732
19919 490732 337358 274194 542717 1065680 1489808 1617637 1597329 1506913 1336280 829820
19909 829820 578165 490554 561431 782615 555048 330983 265036 301263 187641 76994
19899 76994 196065 80836 -15995 195492 137002 70464 195381 238110 93740 37653 80041
19888 80041 127561 131646 55774 -13759 184134 368507 272227 291618 447725 869867 1043885
19877 1043885 1215545 1372046 1348369 1429216 1466459 1346202 1013166 811914 547050 502310
19867 502310 794300 990713 1178489 1266349 1102126 1022741 975935 853029 502512 230322
19857 230322 376757 369750 292978 190839 387761 355450 98562 5876 -72619 -155118 -122072
19846 -122072 -189961 -188855 101529 170066 249253 234571 24570 81510 167093 39354 54312
19835 54312 121903 153558 46519 111203 159675 267978 296133 -16835 -106530 -14624 -219618
19824 -219618 -237070 -96682 54187 48098 -127660 -142030 -167489 -3694 -86020 -210746 -96418
19813 -96418 78433 50217 -9616 -96690 -171744 -166712 -98756 58734 -96851 -201262 -37884
19802 -37884 85777 5041 -40490 262397 388108 237360 265598 372505 406089 344894 350550
19791 350550 437542 482733 322067 243436 269066 220114 299052 125934 146686 -55263 -353788
19780 -353788 -263376 -101293 -243028 -209205 -110499 -88498 -255418 -230317 26718 151132
19770 151132 109410 305476 338135 301222 453604 182058 25049 -156435 -306246 -335869
19760 -335869 -212924 -177275 -292571 -255640 -303419 -185712 42213 278903 51521 6627
19750 6627 136281 166569 456923 315483 196874 155124 14009 -189185 -89832 247593
19740 247593 355912 339159 211117 187954 -34961 -52493 -181420 -96669 59228 101892
19730 101892 55311 122050 240180 174190 -103906 -369372 -404738 -317354 -113536 192478
19720 192478 299803 179547 120379 12340 -45692 -7718 -389699 -401135 -313164 -158069
19710 -158069 -195171 -209384 -241353 -206893 -241304 -399925 -120590 -89214 -181368 -117298 -150248
19699 -150248 -216002 -160188 -206839 -270134 -362247 -438805 -532203 -154862 46631 89377 141350
19688 141350 161678 137129 7987 -92245 -130254 -138190 -203575 -218178 -293443 -151204 7112
19677 7112 23535 -33136 -106650 11618 225232 348678 245566 75653 609 71493 -77932
19666 -77932 32136 -32566 113919 469268 472853 128434 215346 510985 681126 756715 722124
19655 722124 519610 405406 408931 857065 1404964 1828961 1848592 1752526 1418768 1047790
19645 1047790 850095 885522 855385 770709 968788 1360214 1918972 2303642 2185642 1937366
19635 1937366 1403513 867520 750777 748928 572122 521020 799484 755132 352161 371037
19625 371037 665451 688011 673648 843345 724438 560887 484111 427670 185227 213650
19615 213650 315225 424027 329043 116539 77594 182102 97083 64363 335510 610935
19605 610935 622090 641100 989049 1417719 1988829 2451316 2543867 2166115 1693381 1473433
19595 1473433 1261255 963209 915085 1054170 1255428 1858151 2378090 2718788 2698839 2129054
19585 2129054 1472419 949320 644922 452009 401046 302917 114369 137516 78563 -1081
19575 -1081 155444 237485 396888 570208 545399 545646 612445 597432 561535 784934 799501
19564 799501 506857 317085 178538 294818 196717 54119 102049 358481 442862 378709
19554 378709 360736 434327 292816 233886 458921 406104 342478 282281 275784 306016 387756
19543 387756 491312 362381 266739 248005 105175 43676 125738 309510 338347 310883 548666
19532 548666 723765 694767 576704 463920 287974 341583 474619 426397 137465 124155
19522 124155 299771 223375 427581 413645 361660 56743 110212 465024 653698 614757
19512 614757 616275 478203 178861 -127424 59019 243733 448471 762618 874685 658045
19502 658045 672396 571045 356672 265016 241821 209907 143056 360808 350655 379162 582479
19491 582479 577757 782493 826722 778509 836780 991042 1028696 1023208 996263 699508 676658
19480 676658 655175 530871 641350 808311 912809 710431 591041 788315 793206 667465
19470 667465 670515 735569 761225 681262 745550 1050647 1135924 1325162 1518152 1278952 957782
19459 957782 913035 806716 1153779 1377107 1521033 1620293 1589408 1696149 1698302 1759156 1948495
19448 1948495 2186030 2172374 2044538 1969364 1969010 2595865 3238077 3850102 4472316 4862689
19438 4862689 5334523 5582791 6006239 6156838 5979732 5916105 6035848 6238613 6711134 7418655
19428 7418655 7711640 8389482 9409618 10419369 11426673 12650373 14012524 15622957
19420 15622957 17943791 21038708 25754400 33460220 46360161 67875227 103527800 157662589
19412 157662589 217576056 249159130 250006260 223355368 169593910 124356845 100873475
19405 100873475 94086115 101353573 126010117 172277397 232181843 268460716 264974686
19398 264974686 235180505 174801311 117121337 81141350 59931994 46562660 37941693
19391 37941693 32350766 28557994 25861390 23835983 22472117 20998469 19831862 19210260
19383 19210260 18603216 18044211 17427622 16959911 16580274 16715040 17188437 17673482 18191802
19374 18191802 18545417 19044619 19924029 21233752 23002978 25469390 29231529 35348477
19366 35348477 45873807 63743704 94104590 142965400 207922979 258702068 271329056
19359 271329056 258274563 209730141 152084048 116274969 101142701 101851135 118526910
19352 118526910 155070261 212425025 268064504 283855137 267155663 218467323 151472579
19345 151472579 101888023 72274821 54023191 42093130 33929298 28385921 24411995
19338 24411995 21474729 19085189 17225351 15754726 14491989 13442578 12289684 11144424
19330 11144424 10254316 9544885 9246920 9028426 8657208 8558769 8345988 7646664 6758646
19321 6758646 5905243 5323375 5030221 4545936 3956062 3690885 3469457 3153922 2761448
19312 2761448 2526925 2328143 2096941 1848691 1688176 1401464 1475311 1461861 1585651 1659413
19302 1659413 1581998 1472821 1409842 1415475 1350854 1261247 1448539 1427397 1162362 981589 991655
19291 991655 871411 651882 666857 736779 904419 1135503 724644 483511 485442 521204
19281 521204 632545 385151 167522 282859 540466 682775 613873 422070 416339 313818
19271 313818 310047 317042 300561 430416 407338 375781 452682 384395 323753 260790 261173 320698
19259 320698 257892 331414 405167 379472 303839 218273 230119 253222 186875 102686 10103
19248 10103 196233 250727 -10693 158472 307488 215889 231065 250877 151327 -51913 -369397
19237 -369397 -309703 -55496 -183218 -256967 -184277 -12117 70915 155359 196379 384877 267368
19226 267368 158715 65689 98323 67621 -47703 -131619 -66236 105076 111482 16235 3661
19215 3661 44249 113153 103400 36707 -11468 -74994 89066 134160 22721 55607 140126 349208
19203 349208 379281 191062 214585 195402 198772 209331 140354 227237 358846 377960 619232
19192 619232 533249 200310 9069 65284 208868 -225079 -95049 109162 -157789 -91061
19182 -91061 178697 -96485 -140259 76408 295188 331930 354217 207505 26609 -89707
19172 -89707 35796 182862 223864 199747 63524 67600 130047 175741 253123 122680 18155
19161 18155 -88669 -273126 -125016 -38875 70398 225800 334113 307388 183626 223738
19151 223738 209591 165827 128549 141893 97917 -98594 -145087 -278301 -106144 -6122 -101955
19140 -101955 -68481 -19310 -75142 -14460 24191 -79157 -179044 -43792 272301 398712 481107
19129 481107 518208 98176 45240 72359 216084 232492 296022 296375 345633 543365 577724
19118 577724 776438 901920 687622 665907 585702 370152 290920 464483 409704 528608
19108 528608 715722 932763 1032908 933176 731127 658017 232170 -99184 18691 162169
19098 162169 190359 246114 384751 334772 250001 92996 52614 158949 266269 351898 57583
19087 57583 -84132 -110799 -298047 -316871 -283905 -169431 -53979 -34082 172780 409694
19077 409694 275003 111129 29713 76295 207642 320863 426021 451269 298218 450842
19067 450842 676227 895395 1115434 1260399 1192248 993422 994324 1182297 1107889 863034
19057 863034 726991 670801 807683 882627 660685 652859 598210 273155 290952 443240 368590
19046 368590 390577 618498 434460 73823 -169680 -65819 -65958 -2758 66629 175772 99972
19035 99972 13767 190385 494615 402282 160661 -141101 -197997 -55949 147677 84495
19025 84495 12784 -9540 -64311 -3842 138290 321533 497392 655758 616769 603120 489793
19014 489793 394427 303974 387880 319288 323297 231163 476382 801310 823406 618256 371832
19003 371832 427477 343424 306991 232950 99817 -28352 -164099 -125576 75102 243122
18993 243122 315424 24222 -11783 250798 306722 62969 58935 67624 -27552 -36961 -127454
18982 -127454 -129468 -122540 -115943 -157383 -111408 -93132 -27387 116699 79922 168264 375309 598650
18970 598650 523930 350527 248968 151411 -149426 -107171 -81480 -14628 43275 30854 -118049
18959 -118049 -199664 -56677 160521 118795 51697 -123121 -216542 -198816 -281601 -275165 -183618
18948 -183618 -244549 -245426 -171451 -19446 59271 166943 209656 224704 209113 72889 -121202
18937 -121202 -267834 -327090 -192953 -94313 -40862 13107 -153113 -30417 56042 257579
18927 257579 183245 -158024 -308156 -223383 -183069 -261202 -235817 -131971 21152 88410 175703
18916 175703 -56336 -51660 -18071 70905 94570 100889 253290 291524 159526 248895 374007
18905 374007 150315 87875 299420 446280 699441 540383 358640 196639 227306 414915
18895 414915 570118 709157 755945 899562 1322235 1440695 1147954 944734 907680 862361
18885 862361 650782 578222 915110 1258155 1413254 1465085 1519004 1407278 1028491 722042
18875 722042 376042 85398 57807 377454 405740 404102 272541 214031 91487 13866 103114
18864 103114 374115 467806 400384 456662 742556 714815 772653 549810 354982 361319 420791
18853 420791 326030 87721 22842 231329 327018 283730 263625 328449 426991 581131 993399
18842 993399 1434707 1424257 1417745 1309614 1009959 890245 693183 625481 677005 834395
18832 834395 1241955 1541188 1630904 1492992 1315597 1034276 846557 682882 534517 651822
18822 651822 546581 411679 455423 349640 156836 35312 -7363 74796 25928 -155927
18812 -155927 -354286 -151811 120711 197999 107362 122772 -20294 -9648 3058 154236
18802 154236 273095 283762 226744 239928 284141 241733 44152 -189094 -123412 -115856 -72112
18791 -72112 91593 219880 372522 305179 8176 -10179 18602 31716 92297 144387 299805
18780 299805 414618 422225 297336 248796 259494 305633 255531 247054 442731 624698 1120527
18769 1120527 1956985 2659196 3159225 2631225 1625246 1223350 1118732 913197 471460
18760 471460 270106 196478 358231 512339 482908 319582 205482 251944 260048 144046
18750 144046 176952 161319 157585 -19770 -95540 -49912 4688 -169560 74129 415549 453030
18739 453030 219725 -22578 -141443 78229 37212 55571 119238 210160 237767 275203 289089
18728 289089 130623 94326 149926 388588 627748 576354 458173 626279 736798 589294
18718 589294 497556 473913 296470 332090 429147 383340 389707 363846 164352 233075 74573
18707 74573 202680 458962 454480 367302 424331 411574 489081 663393 532681 534193 507591
18696 507591 445599 643758 1030299 1145330 861040 652813 802086 908633 932730 768946
18686 768946 655232 651938 473929 608689 855968 1063642 1034346 804729 766962 790396
18676 790396 766516 592527 464028 483015 747081 829712 744098 594162 401560 439746
18666 439746 495145 753873 902612 810774 827097 911217 1117611 1171888 1151648 1169941 929918
18655 929918 1027230 1139235 777174 763390 859875 969422 1026816 1049699 1326528 1767977
18645 1767977 2006106 2284291 2732226 3063210 3082630 3047952 3120418 2938226 2624808 2787148
18635 2787148 2946601 3065852 3403162 3755173 4271491 4679084 5251661 5776474 6026811
18626 6026811 6215254 6517941 7215113 8044630 8844300 10096303 12164454 15197206 19511172
18617 19511172 26186429 36683254 53406912 79328052 112979047 136660229 124030746
18610 124030746 91343723 66248579 52515634 46320643 45189808 49251162 59929021
18603 59929021 79975222 109342657 135729072 130458603 96756628 66389095 47905475
18596 47905475 36875417 29767704 24767899 21031517 18345018 16379571 14856626 14063943
18588 14063943 13836585 13759468 13652438 13559262 13482415 13421377 13797838 13930575 14018403 14242844
18578 14242844 14845456 15802018 17196767 18998629 21052600 23649255 27608147 33921722
18570 33921722 43287894 57812730 81282276 116208707 156855586 175406497 154013662
18563 154013662 126641401 117952085 129653814 158724123 193592673 204381350 187456331
18556 187456331 179291842 192189698 203726978 183255626 147065749 125891152 125919575
18549 125919575 144172124 170011857 174047269 139613225 98566030 71008236 54487828
18542 54487828 43937884 36591757 31331634 27393136 24045927 21604353 19689648 18230520
18534 18230520 16984454 16185460 16147141 16057898 15857642 16022953 16058645 15818800 15496533 15133707
18524 15133707 15238005 15749609 16801007 18620526 21163368 24923903 30500838 38384935
18516 38384935 50479989 70124987 101375635 143169079 175058372 162509067 120701427
18509 120701427 87012409 68293018 59657901 57868722 62378178 74556979 98026242
18502 98026242 132852963 165988407 163416021 122922743 83316596 58104288 42814383
18495 42814383 33056597 26446319 21414953 17758321 15016729 12937798 11421097 10024326
18487 10024326 9006598 8481252 8267640 7923421 7359364 6865001 6169744 5563481 5104519
18478 5104519 4761917 4551998 4407041 4042071 4020826 4031225 3786232 3621592 3250459 2968788
18468 2968788 2631843 2294696 2124754 1728590 1568852 1511805 1484724 1492836 1529723 1395219
18458 1395219 1319488 1567611 1562562 1214110 950219 982039 1027559 1033788 866852 745606 662179
18447 662179 643406 434120 507395 498782 417458 472929 598308 705150 452055 278371 205022
18436 205022 110847 173324 249113 123677 -13405 211772 289954 339726 132886 166392 414405
18425 414405 479552 456483 379326 347196 529172 550903 464173 393918 250623 261518 533970
18414 533970 548696 350641 242370 84646 132608 393955 484862 682241 731954 781144
18404 781144 732218 512812 297002 247411 584977 500394 453243 813547 893987 864361 655161
18393 655161 593831 572562 574107 528961 556250 570974 697801 546026 578028 613654 679797
18382 679797 519593 187537 192648 168159 259518 431149 531708 425308 452113 614944
18372 614944 588536 487178 637276 786477 789602 630204 601007 442144 306930 432718
18362 432718 464537 417872 388187 321480 518744 639692 604463 760483 921978 949518 834475
18351 834475 730226 528176 510659 703174 709392 627648 573178 595741 512227 450737 431694
18340 431694 539051 623337 737214 677059 571689 781741 851723 1062011 1318715 1574411
18330 1574411 1232562 832847 638833 1010098 1328163 1227201 1155627 992038 1003373 1018489
18320 1018489 841959 711033 527172 350211 240910 260980 79359 71465 133440 150682
18310 150682 51834 185063 306735 459679 556366 452468 33933 23793 31128 -33756 67948
18299 67948 414799 569378 540070 502095 410113 426487 593003 738901 822569 866062 734621
18288 734621 743093 899869 1172530 1410085 1477658 1521073 1672089 1668133 1507668 1385998 1403554
18277 1403554 1591605 1380862 1249516 1393133 1401171 1115357 807539 569310 399471 536117
18267 536117 416981 452376 197672 3732 -28928 8895 153909 261914 245710 59434
18257 59434 76343 332623 508454 615328 583249 375109 293444 245509 152023 172345 288947
18246 288947 206365 295280 720059 1055929 831438 812691 949554 943279 1017551 950250 1092415
18235 1092415 1236877 1336586 1452619 1323629 1136747 1054091 1112235 1218372 995020 935443
18225 935443 1096499 1114545 1043875 1066095 978268 959455 844085 597098 419893 454479 551968
18214 551968 654921 585999 847430 1295369 1632170 1834616 1707107 1743763 1725201 1635209
18204 1635209 1762836 2070317 2117751 1936662 1694821 1539709 1475456 1174691 884854 693177
18194 693177 533853 598167 652903 745886 670444 649918 705623 911780 875207 770158 909590
18183 909590 1117813 1062817 840984 824342 859079 749052 703840 749050 864605 754560
18173 754560 575137 580393 721827 621167 713820 927117 826256 650314 840546 1078593
18163 1078593 1290757 1502928 1336843 1412471 1439692 1738888 1981275 2149947 2237931 2250403
18153 2250403 2307249 2388671 2455135 2536568 2593750 2542341 2418865 2088187 2086787 2082151 1923902
18142 1923902 1807082 1945741 1922362 1836984 1962739 2139458 2542657 2781498 2973799 3347490
18132 3347490 3588300 3760572 3847300 3796364 4017649 4430353 5160325 5892186 6743014 8076083
18122 8076083 9599228 11214280 12716917 14639377 17677165 21589757 27773072 37209861
18114 37209861 52040638 78411954 128164188 219725788 372540403 541851243 497338996
18107 497338996 296914096 170556012 109374865 76994230 57714823 44985757 35877703
18100 35877703 29218923 24178138 20337273 17099331 14849756 13465965 12293475 11308679
18092 11308679 10486863 9628714 8742276 7921942 7017598 5867252 5270583 4992166 4792276
18083 4792276 4579053 4235137 4012853 3721258 3270508 2830596 2700162 2461411 2244909
18074 2244909 2227019 2106678 1812167 1556793 1528855 1595845 1497754 1586700 1644023 1666094 1670594
18063 1670594 1673344 1674412 1821411 1756716 1695446 1854657 1954179 2164223 2137193 1871086 1624094
18052 1624094 1425747 1551665 1969871 2037475 2156070 2262385 2290269 2244960 2166139 2111470
18042 2111470 1928869 1594170 1348502 1478175 1627171 1561891 1325654 1004692 706132 584255
18032 584255 652845 645122 736970 734010 819167 891823 764388 671540 697240 637426 665324 701083
18020 701083 528709 332362 377702 452107 286397 349611 466776 473319 522364 540923 428387
18009 428387 452395 261189 240064 591402 1028022 1204468 1391598 1384066 1352261 1157959
17999 1157959 849005 791132 1185400 1286931 1254485 1362556 1695825 2521461 2861625 3194866
17989 3194866 3100795 2661167 2252846 2134978 2284779 2632158 2579983 1941183 1408268 1109992
17979 1109992 1144088 1203500 1058988 989445 986692 853371 977951 992164 1000466 859864 701335
17968 701335 731906 672982 713135 944122 1039224 774300 720494 486898 238051 412866
17958 412866 426722 588448 505721 446072 573979 583883 639766 708564 871250 1133950 1382810
17947 1382810 1496624 1554918 1812510 2211483 2619959 2779095 2927620 3228671 3178267 3113757
17937 3113757 2931691 2850768 2756316 2430848 2259256 2040506 1910442 1552597 1229623 1032508
17927 1032508 870092 860293 829370 604769 539358 645521 818527 939219 784434 742083
17917 742083 854906 1015887 941517 920375 864487 936561 939041 924391 862136 1034665 1171242
17906 1171242 907426 866854 902421 872344 678221 832996 1146248 1265075 1202922 1052165
17896 1052165 1210309 1382910 1667016 1909536 1893606 1944186 2232138 2408259 2419123 2515105
17886 2515105 2230978 1859200 1591976 1725414 1956532 1808352 1779213 1662872 1683171 1762502
17876 1762502 1496371 1213324 1085707 1098694 959786 1038007 1003068 959398 1098490 1118823
17866 1118823 1098650 1321173 1310716 996530 912502 1051757 987129 1173562 1235033 1232122 1411500
17855 1411500 1486050 1390322 1247528 1346221 1385731 1487232 1787478 2031282 2169567 2422840
17845 2422840 2637804 2945310 3496675 3896714 4463846 5450981 6400102 6660509 6759996 6807457
17835 6807457 6948581 7392945 7893419 8067922 8069056 8027208 7819510 7716454 7836152 8285423
17825 8285423 8893692 9628663 10925775 12602097 15057892 18790196 24187602 32298031
17817 32298031 44975539 65918440 99154462 142684130 172918324 160474604 133024575
17810 133024575 121890865 132308716 161440404 194263724 190538105 142755205 96367727
17803 96367727 67663080 50619043 39892981 32458319 27469629 24206558 21467615 19068094
17795 19068094 17123092 15747677 15233779 15083920 14920658 14978236 15572013 16243253 16666016
17786 16666016 16509344 16283447 16455639 16814052 17375805 17995779 18384661 18325292 18309804 19014284
17776 19014284 20286428 22553241 25922196 30755520 37833587 48481051 64969492 91764961
17768 91764961 132580049 182153573 211663350 211409281 222010299 252675825 273063145
17761 273063145 278414518 283544783 268043458 246609258 247360938 245136314 200509934 141407980
17753 141407980 100129479 75047847 59186005 48379062 40426260 34782532 30293230
17746 30293230 26918659 24500586 22656251 21661650 20971142 20138838 19100507 18187757 17913132
17737 17913132 18040992 18172636 18232619 17931960 17491728 17225550 17347348 17578805 18064768
17728 18064768 18707665 19678021 21282844 23178193 25737086 29311796 34056116 40864556
17720 40864556 51249463 68450549 96003468 134647224 168148013 165768608 144289625
17713 144289625 137808846 153389818 190535012 242815508 281312651 285354225 281899447
17706 281899447 288407150 301986258 308512567 307138247 308349463 306814095 292154650 276277678
17698 276277678 261692691 237901393 206712775 175242549 141845727 109323946 84368656
17691 84368656 67398809 55797701 47140547 40586906 35787191 32258258 29669821 27467775
17683 27467775 25550634 23864142 22420935 21145652 20114273 19247684 18524693 17799748
17675 17799748 17396156 17107209 16959904 16936361 17213085 16893983 16765007 16837247 17157245 17839078
17665 17839078 18853000 20039520 21885945 24323656 27587526 32283897 39540573 50445205
17657 50445205 67226360 92252027 125222525 159915134 190252598 218475737 239921310
17650 239921310 249208997 254243642 258895736 252153921 239312698 229984163 216775603 193864286
17642 193864286 166645697 136948028 104740301 77984280 59447413 46994867 38290058
17635 38290058 32200395 27309295 23822092 20973159 18780348 16870909 15444232 14356373
17627 14356373 13364033 12334589 11265278 10572140 9834965 9053328 8453371 7758397 7113111
17618 7113111 6447887 5973209 5787744 5644449 5296509 5069276 4913166 4556670 3950839
17609 3950839 3556207 3487170 3261683 3318560 3145108 2834896 2675765 2705045 2624295 2548836
17599 2548836 2457125 2224275 1906542 1992836 1939700 1718398 1590872 1737916 1587356 1369856
17589 1369856 1216906 1246648 1191744 1056380 988984 936729 878538 742475 726764 729380 551852
17578 551852 287398 290244 631811 909994 850886 585292 495024 634988 661180 760622 1054505
17567 1054505 1397354 1193000 999051 879571 727623 760001 692090 715193 692982 523092
17557 523092 493789 539393 616972 653381 700707 946317 948571 797077 594257 564287 643925
17546 643925 796945 775158 549909 345688 550533 665890 425327 268610 442195 365125
17536 365125 184074 8243 -78416 -9117 286193 328265 371464 331358 10623 -142550
17526 -142550 -195569 -69676 131198 242326 486831 506770 228630 100520 171831 -14616
17516 -14616 148587 131183 122283 119671 429461 546071 608423 449580 395676 451377 495993
17505 495993 579980 651307 580659 519827 406151 275425 285407 288363 381866 493224 301418
17494 301418 116803 175613 312714 385816 383238 267588 291717 293215 304068 495634 309396
17483 309396 251842 255912 249726 15591 8428 103362 86455 -34119 -255762 -49023 102273
17472 102273 164616 317459 277124 306068 383201 442580 244595 321781 417748 193295 161953
17461 161953 98313 261257 181641 82997 189667 374253 190540 90178 247669 273462
17451 273462 270426 317229 284984 282079 636192 929085 1276829 1924783 2945023 3320017
17441 3320017 2369376 1558148 1039298 773668 560452 603850 676800 656965 610458 438516
17431 438516 334855 261557 180165 75877 34316 -281842 -569349 -413642 -202172 -267026
17421 -267026 -104509 308817 563026 455742 312866 345795 250663 298257 290728 272292 463481
17410 463481 469933 446646 195520 -5128 82499 112753 292575 186440 272162 388601 422210
17399 422210 217475 37310 145817 171017 -73451 -154126 -107500 -101983 -200333 -244429 15959
17388 15959 106131 -30474 -86392 -180431 -187352 -71618 61377 151550 82833 -151969 -77457
17377 -77457 9765 -44463 79061 -9273 -26110 6257 14210 17467 -110828 -125721 -142572 -102630
17365 -102630 13639 -141267 -49668 42852 -54857 -58814 -85970 17437 253916 347617 335499
17354 335499 227785 300222 248828 190674 199986 44675 -23676 -167209 -50361 82756 57980
17343 57980 88646 263730 383708 384527 296632 119482 -183418 -237426 -165783 -167977 -191083
17332 -191083 -84036 -157713 -297110 -147283 -27903 -39333 -18454 194676 323477 368308
17322 368308 85583 -69009 -145119 -365382 -164364 -24230 89573 52282 77171 -174792
17312 -174792 -183608 -255706 -476373 -428214 -437853 -388486 -343513 -276691 -156147 -274782 -292864
17301 -292864 -113271 22456 52592 34934 12694 20957 53865 -15824 -240672 -99982 130739
17290 130739 163039 411042 712843 1083473 1098438 753016 709177 603054 562408 635539
17280 635539 536169 375244 93462 -157473 -105363 -6745 -73532 61592 235274 95587
17270 95587 -7060 12799 -315308 -306412 -216960 -236907 -374620 -346362 -260553 -174933 -159946
17259 -159946 -303564 -238708 -45674 -60919 -29762 -276930 -122404 -4570 109621 15769
17249 15769 11264 -52899 -69001 189185 540662 730735 727946 775137 781847 698093 821084
17238 821084 957958 1184541 1280024 1250938 1202238 1261500 1105340 1028045 1017345 737876 642808
17227 642808 591148 649462 392179 156875 37708 58147 14912 -217447 -290477 -188024
17217 -188024 -247332 -104891 -159346 -219421 -48822 -13201 13052 69903 158913 173626 216742
17206 216742 68710 17349 -50941 -73857 228432 280745 465356 753102 834013 918186 1195683
17195 1195683 1443894 1618907 1684846 1933923 2185657 2322584 2066466 2012272 1864525 1632269
17185 1632269 1726874 1492267 1088662 720046 499283 385515 504843 518450 389851 335638
17175 335638 183178 -49840 -86215 -167610 -169988 -112106 -84278 -24403 34494 100054 9603
17164 9603 -228635 -292564 -385892 -403306 -100033 201014 227612 140406 19989 -595 -64282
17153 -64282 53810 121986 229687 242479 260418 289575 367164 331841 281209 617232 903603
17142 903603 1130565 1124257 1302153 1281250 1334356 1288787 1014053 1026486 986137 1039986 953098
17131 953098 751790 500876 228101 134784 30611 -127909 -126321 -184763 -90560 -79067 -182464
17120 -182464 -149325 12050 141158 271237 299296 96175 -23892 229969 213997 139800
17110 139800 -24931 80883 100111 -31776 170416 339326 217540 89681 174430 122415
17100 122415 39869 132902 23339 -144805 -69110 -29771 -44697 -75743 -62208 -13288 -188196
17089 -188196 -103202 219531 247023 69174 -35593 -128626 -423459 -409694 -201591 -320981
17079 -320981 -463745 -276397 -187675 -93915 96169 167006 41508 6667 54416 111487 -59158
17068 -59158 -88245 -25113 -46690 -130656 -50697 -70175 -313010 -140048 29760 162858 63034
17057 63034 130851 49780 -103357 47796 117019 -4023 -55019 97805 206179 259615 295483
17046 295483 117576 -125048 -53707 73466 147417 105715 8826 -1404 -61599 8676 10901
17035 10901 62048 279053 247127 25382 -13088 4973 88100 91829 102548 15566 -207979
17024 -207979 -355337 -182514 -38515 58927 43268 91721 130885 43723 146176 155258 42622
17013 42622 -1399 -109871 -150314 -184220 28736 286406 212774 155020 -27514 121732 198687
17002 198687 168830 15001 -12340 -140189 -241048 -165267 23057 -214734 -464560 -400839
16992 -400839 -370712 -345164 -95531 6666 -98699 -216446 -153740 -230163 -264264 45915
16982 45915 120706 -173980 -415967 -354180 -404913 -342444 -199509 55201 287002 247230 -178436
16971 -178436 -371572 -453192 -513788 -419156 -355476 -154036 -193499 -50407 165683 36888
16961 36888 -306156 -293445 -193612 -26235 -112988 -274491 -192282 -136003 76065 99097 27993
16950 27993 26087 -64730 -199792 -243584 -280380 -226597 -19088 -47625 48907 197167 107095
16939 107095 21689 93082 165129 -45018 -205890 -155853 -82501 -85633 -83037 -228473 -139785
16928 -139785 62752 -195575 -490164 -519378 -426675 -261827 -181763 -79050 13301 -137812
16918 -137812 -40834 -9710 51554 223052 -14958 -361601 -129935 139796 68757 141263
16908 141263 134481 18969 1491 -12124 -61934 52276 203119 -21741 -214935 -234241 -85147
16897 -85147 -161108 -112838 -114204 -259535 -371482 -343200 -312430 -255489 -185353 -308481 -493138
16886 -493138 -284202 -161809 -223813 -74700 34479 -38109 -131392 -275714 -385612 -599332
16876 -599332 -615637 -348338 -255356 -50725 104386 310198 390928 153921 72051 196503
16866 196503 318559 296527 9670 -243094 -170948 -67769 9284 32125 -97076 -184855
16856 -184855 -354868 -382900 -294879 -200383 -150096 -181958 -312798 -71476 52635 -150744
16846 -150744 -228994 -234356 -266631 -147365 -173686 -484522 -540332 -466422 -489885 -519594 -343004
16835 -343004 -203899 -118929 -120995 -74747 -152022 -395983 -475351 -306805 -192579 -100409 50086
16824 50086 2157 -205458 -304141 -117351 70957 67297 -194038 -49901 -60564 -49252 -50216
16813 -50216 -156098 -140771 -235103 -465367 -685514 -559031 -377083 -422167 -208966 122016
16803 122016 319661 122320 -132536 -302336 -240679 -120234 105171 119253 -123696 -295996
16793 -295996 -284402 -123212 -310191 -191929 -47194 -9288 61807 -117174 -217762 -57653
16783 -57653 125574 226658 284843 -52064 -332157 -266478 -153967 -212109 -393285 -211098
16773 -211098 34347 279254 -21216 -366172 -491934 -268314 -178063 -226293 -145432 81801
16763 81801 154046 170906 -71191 -80815 53714 170295 133333 93816 56920 -113235 -281354
16752 -281354 -225526 24033 -30788 -29738 -32824 -218988 -153209 102909 130710 42648 74570
16741 74570 195472 18026 115456 68349 1745 43495 50902 77488 -57126 -171244 -144071
16730 -144071 -18019 181664 77624 -75170 -170783 -50494 -45013 126013 150161 41794
16720 41794 -151510 -411950 -416725 -405395 -158368 -223926 -337870 -103477 53757 -53218
16710 -53218 -151170 -233068 -197376 -71967 125677 56181 -127962 -442469 -371905 -138622 -105277
16699 -105277 -265490 -382383 -196038 -8385 -125002 -98656 -187361 -225725 -245564 -263170
16689 -263170 -261274 -265685 -179449 -201113 -317062 -432746 -356552 -306984 -276145 -181248 -50375
16678 -50375 -120691 -307177 -395834 -341179 -431834 -484230 -477712 -381754 -218781 -206656 -259922
16667 -259922 -193330 -215314 -119210 -159532 -229434 -198971 -202296 -222010 -24058 -217482 -342661
16656 -342661 -229511 -155406 -240890 -19123 -51130 -254878 -32032 -5238 30919 -4476 -39611
16645 -39611 -236064 -283459 -352568 -425802 -115675 -61241 -96615 -142786 -36180 -33892 -148796
16634 -148796 -232693 -283263 -219984 -126755 -184280 -239835 -139315 -260616 -490900 -610779 -661349
16623 -661349 -574439 -266772 -64821 55196 64905 143123 -12752 -70609 -68282 98559 503
16612 503 -110229 -297849 -340394 -322175 -42656 119323 122224 368230 226289 -145624 -265449
16601 -265449 -335170 -281192 -134664 -57230 10540 -111243 -228308 -305839 -379269 -419557 -291038
16590 -291038 -190042 -172974 -286506 -451865 -464399 -330636 -243382 -371838 -524424 -308115
16580 -308115 -123039 -111286 -67718 -245074 -415551 -352915 -439011 -231391 69717 -57911
16570 -57911 -217003 -138066 -40622 -96534 22359 12835 148660 176817 -4877 -58879 407381
16559 407381 456072 138002 -218242 -79483 162920 193042 164461 214218 11494 -302091
16549 -302091 -362235 -125155 192448 122380 -21635 -9006 215903 33136 -185298 -259448
16539 -259448 -119321 122192 227905 226550 187146 180912 45327 -229870 -175182 -26355 -89792
16528 -89792 -233119 -60603 -40675 -111488 -184346 -94872 -216349 -383659 -325747 -167742 -197362
16517 -197362 -343654 -272295 138081 35783 9483 102693 -18202 -364574 -425429 -210866
16507 -210866 73968 79560 40016 2116 -158963 -208904 -346816 -650587 -344216 -47253
16497 -47253 -105410 -192163 -56930 25967 -33890 132908 240796 15677 -293093 -371501 -263846
16486 -263846 -72994 -132845 -214996 -269072 -214054 -120461 -84831 -46433 -60789 -16618 -38009
16475 -38009 -184202 -184164 -146524 -161884 -251071 -184333 -32384 -183887 -106950 25401 280445
16464 280445 125012 43369 -48800 -138643 -177279 -51634 -165235 -235518 -453904 -400274 -119086
16453 -119086 -3288 -69160 -102061 -54979 99722 -7679 -131477 127277 193586 208403
16443 208403 55925 76896 -114998 -169554 77765 215304 428923 387431 164688 114364
16433 114364 152779 108195 -28098 -36757 141792 6773 -169210 -229891 -83310 -9859 -43236
16422 -43236 -226706 -168585 -212470 -369861 -556479 -464555 -520347 -400216 -174048 90561
16412 90561 296787 317470 179815 175596 51304 115306 46592 278401 422017 437167 178551
16401 178551 -70582 -79231 -95000 -60915 -7862 -76179 96345 47045 19717 -130343 23721
16390 23721 45164 -114075 1839 169178 -13876 8517 165322 29635 -243521 -321199
16380 -321199 -533818 -480515 -441466 -469958 -298304 -219430 -351677 -236789 -272107 -526708
16370 -526708 -627748 -423984 -261919 -306011 -324041 -224683 12137 29895 40870 -178054
16360 -178054 -187538 -156317 -234310 -209001 -187429 -424927 -480950 -562769 -587259 -386795 -283058
16349 -283058 -48311 26079 -187517 -207746 -81966 115496 262960 132349 3061 161890
16339 161890 174575 88048 121955 90345 172612 141199 -131692 2092 145493 116719 -137255
16328 -137255 -406012 -274324 -55536 60773 -93955 -170708 -24526 -179865 -111551 -277546
16318 -277546 -152508 -96434 125859 79819 -99797 -211647 -169123 -253346 -397111 -363468
16308 -363468 -235593 -35876 -7788 -92669 -198665 -52910 -92876 -111173 -134309 -421582
16298 -421582 -253558 -259027 -304630 -333537 -374315 -242885 22795 -23846 -76337 -84684 -136423
16287 -136423 -159288 -374714 -423019 -361365 -184174 -22368 -122774 -86360 -25241 25457 -101122
16276 -101122 -33537 111444 268097 223984 367650 349960 233469 295771 343884 196952
16266 196952 65760 129831 83886 -18234 10414 87072 33371 84907 127213 148531 122353
16255 122353 87433 45046 106922 -129018 -97259 12472 61700 92517 51599 -233631 -457538
16244 -457538 -436052 -293284 -245727 -166006 -127315 -376035 -528618 -323315 -200066 -119146
16234 -119146 -77358 -167829 -48198 1945 -60738 -290583 -287328 -206773 -203794 -136207 -116930
16223 -116930 -216296 -252360 -101996 -44749 -47908 -159687 -203167 -507672 -393458 -117392 -54897
16212 -54897 -149868 -238096 -193019 -118191 53034 46367 -130269 -257486 -345214 -101832 -70576
16201 -70576 -236805 -479275 -389600 -51433 -147748 -267983 -141661 31310 -86273 -330170
16191 -330170 -536186 -254932 -186791 -55155 -163681 -42068 -170604 -241083 -160401 -284488
16181 -284488 -301629 -232663 -151071 -63201 199167 245373 242775 168418 206672 257795 47600
16170 47600 -152169 -132177 -360156 -448256 -284946 -7873 162809 41454 -80273 -138463
16160 -138463 -135823 -97084 87127 56907 -72389 -99549 -54011 -78935 -36981 -75683 -58458
16149 -58458 -277275 -367651 -252205 -284074 -135637 18584 44054 -126431 -320389 -361862
16139 -361862 -248625 -66737 55109 -29432 -231781 -326043 -208740 -42688 6137 -205634
16129 -205634 -305014 -277924 -265897 -206276 82954 123926 35610 -32954 -169883 -229164 -160542
16118 -160542 -314322 -332405 -142882 -235711 -141235 152527 309642 549864 687442 487625
16108 487625 292207 123127 67656 125109 145109 -48615 -128436 -198087 -186681 -86443 33846
16097 33846 -59989 70806 29671 -18248 -94431 -92014 80101 75623 227221 167391 119459
16086 119459 57346 -60467 21904 101117 94783 -68516 -301729 -322023 -246895 -192762 -84801
16075 -84801 -10830 -80593 -65109 57820 -145982 -212094 -25734 32995 -9708 -89326 -33078
16064 -33078 123619 115210 -64326 51789 81594 -50148 -81646 -66767 -69986 -98389 -193768
16053 -193768 -203370 92324 141508 186795 293801 355938 482736 188471 104404 253092 224937
16042 224937 144009 121472 329609 227565 -15705 -120389 -401581 -266256 -194773 -131297
16032 -131297 -128664 -229523 -102690 -106311 -81719 -37430 -56756 -6363 196747 41049 -315477
16021 -315477 -486554 -525043 -626018 -419893 -353527 -445172 -258979 -138091 -149253 -137414
16011 -137414 209563 188985 17456 179421 203944 92746 75066 201126 245112 141763
16001 141763 -88478 -65496 -217011 -165493 -57380 -343694 -433471 -331149 -356066 -283484
15991 -283484 -239928 -149122 -100629 -11679 -47316 -191597 -134204 -4665 47081 -14965 -116515
15980 -116515 -51067 -124483 -96968 -239014 -158657 -38594 63342 52605 -223295 -351762
15970 -351762 -262215 -223798 -81876 -212509 -166221 -24191 64364 140358 -811 -126351
15960 -126351 20186 123235 -38107 -230345 -334616 -272306 -153212 -10828 56765 -240496
15950 -240496 -202362 -1053 -24183 -84501 -85430 -325807 -134134 41112 84246 -16791 -285399
15939 -285399 -316950 -218762 1627 37826 211168 167411 260274 177137 79420 140335 -23201
15928 -23201 -65133 -6994 -10207 -189350 -294158 -84123 -112919 -278152 -208402 -42406 28205
15917 28205 -89123 6942 152852 134954 311509 194393 -45962 -135678 43423 100772
15907 100772 59414 61565 -58726 -19731 84073 427479 572746 472361 447304 275874
15897 275874 70199 -124733 -84676 46558 89267 -99835 -246685 -59562 140360 -60172
15887 -60172 -150157 939 59439 164241 125999 156402 254243 128304 166200 106782 17130
15876 17130 -121738 -260285 -387886 -463019 -310258 -59348 -5597 178369 236325 60256
15866 60256 47949 28784 96561 24453 -54776 -77036 -164553 -284615 -381563 -383495 -127799
15855 -127799 -60044 -175408 157156 103730 -24619 12131 -24671 -280470 -259701 -88326
15845 -88326 -210098 -148549 -183349 -256236 -230543 -71056 -74104 -280612 -371952 -103599 15853
15834 15853 8893 -31418 -190295 -85547 25220 141130 99843 -48270 129843 45252 119791
15823 119791 145236 212210 147877 -141538 -406561 -389868 -415918 -377964 -301841 -144503 77485
15812 77485 107800 111203 -35324 -368985 -371022 -240812 -510800 -515495 -402144 -231050 21949
15801 21949 9809 67796 9368 -8731 -44419 -201706 -355034 -361403 -183125 -178571 -173792 -195920
15789 -195920 -288707 -270867 -183439 -154862 -81266 -172027 -196373 -75391 -110091 19859 -30213
15778 -30213 -407192 -552996 -197882 95341 183735 120557 156870 363914 419341 42941
15768 42941 -109215 -273229 -317257 -311504 -210049 -275774 -128107 45425 -8114 -190556 -212542
15757 -212542 -134674 -47928 5997 40043 66811 12656 24721 -55777 -367038 -429492 -429815 -226770
15745 -226770 -136676 23278 -93847 -138132 -19145 -44396 -297667 -381583 -451397 -324472
15735 -324472 -428898 -474589 -331053 -56390 -99765 -386291 -407878 -295311 -198661 11134
15725 11134 -7651 -29033 -120433 -55838 -25466 -49813 -74325 -192861 -259059 -306924 -345900
15714 -345900 -442530 -372036 -323842 -360375 -75890 97984 -34808 -111614 116688 173156 257071
15703 257071 184883 24991 -100284 -196846 -52050 108729 203300 94422 -79909 -271049
15693 -271049 -281276 -43266 -8669 -249894 -379537 -208174 55317 44689 86142 2925
15683 2925 -344555 -383047 -171687 71786 139135 -29260 -84425 -98126 -65791 -134356 -351507
15672 -351507 -247129 -77750 -320300 -380225 -176073 -171306 -33617 30458 -44189 -60626 -193186
15661 -193186 -215443 -74696 -93175 56120 -59748 -32845 -3347 94506 257896 331623 312779
15650 312779 267859 168919 52276 -156556 -251226 -86461 188071 155206 175423 129268 162424
15639 162424 48468 -146693 -108387 -242458 -315894 -315408 -278135 -391045 -259131 -204781 -90351
15628 -90351 -112407 -122359 -297949 -259075 -86464 23582 188891 142070 180390 138168 -144835
15617 -144835 -199316 -263452 -227567 -108054 -146191 -237106 -307482 -331903 -346171 -358775 -325080
15606 -325080 -270509 -98701 -45593 -50489 -119062 -112736 -99176 -100239 -2237 55140 6675 57713
15594 57713 58439 116644 164346 112155 -19741 141052 163325 -33783 -241953 -225149 -1410
15583 -1410 -56609 -9942 -159361 -223195 -392491 -336300 -252436 -10788 -107577 -156603 -128176
15572 -128176 42648 54321 136034 41403 -45275 184338 184266 -18479 -105570 -56621 -119984
15561 -119984 -173305 -8597 -118298 -464568 -402291 -98497 -249059 -209051 -106820 -125818
15551 -125818 -24674 442 -63441 19033 -4054 108920 168803 -100246 -224967 -180604 -150137
15540 -150137 -315621 -226684 -146628 -156602 -116547 -170528 -39045 11593 14527 42447 -13204
15529 -13204 26250 161222 125222 153946 129341 188348 185458 56286 1053 30686 62988
15518 62988 95759 -138274 -273230 -234192 -389512 -382700 -139661 -26314 36950 23716 -174188
15507 -174188 -246437 -112514 2555 -50980 88707 292492 260405 381533 504394 193945
15497 193945 72124 166391 1313 -123183 33484 61563 33698 297435 285208 190699
15487 190699 -12767 127642 177993 -87446 -371206 -414659 -395181 -360535 -270891 -135635
15477 -135635 -130701 -150824 -124397 41022 305139 225871 40910 104858 -37140 11561 -12698
15466 -12698 -41075 -45648 -69216 -393364 -650215 -290042 -49428 -150486 -111261 -253033 -79939
15455 -79939 -145000 -135054 23634 23540 -51175 -151744 -75604 6779 -135714 -109058 81546 188757
15443 188757 37957 -46450 -186120 -247256 -261074 -139258 -1346 -70591 -355300 -333080
15433 -333080 -274467 -413391 -281625 -330 88930 54153 129272 43050 -82835 -21130 -18357
15422 -18357 -10873 43230 28022 -164957 -305897 -127062 -26338 -78222 -137133 -268484 -252503
15411 -252503 -177704 -71632 162941 194054 75946 54529 -60884 -216633 -354792 -403121
15401 -403121 -382362 -372632 -264144 -192977 -37601 -196639 -330405 -410241 -429072 -286548 -230837
15390 -230837 -140403 -252583 -498457 -461767 -268086 -210705 -159661 -48952 28452 -45515 -137199
15379 -137199 -370176 -497415 -641863 -674114 -393301 -320948 -123428 -85074 -126761 -71202
15369 -71202 -140512 -259390 -177971 -158825 -162446 -336603 -408391 -52367 -47897 55528 322239
15358 322239 336422 247474 129655 98705 106592 223307 206527 167537 -1411 -132083 -183574
15347 -183574 -157489 137873 224456 282569 179742 278812 156453 131992 32983 -48705 -154181
15336 -154181 -72064 79597 6595 -136692 -23236 -238403 -450031 -398476 -182797 118543
15326 118543 182430 90434 49888 -12956 -204715 -374628 -445068 -87555 58512 -202673
15316 -202673 -142005 -199061 -129271 -92773 4687 -242257 -306744 -180580 -155370 -175625 -65092
15305 -65092 -77981 -315948 -480874 -150144 180061 83038 34744 4499 -244154 -302274 -23857
15294 -23857 -76828 -207176 -308867 -275535 -44888 -95420 -172406 -281537 -305901 -155845 -136660
15283 -136660 -78164 -104230 -78392 70815 165222 35921 109617 81637 212194 213261 232923
15272 232923 100023 84521 2416 -31838 87009 27892 45892 -35115 -70855 -114056 -84720
15261 -84720 73960 -36660 -164097 -233301 -241800 -124309 70793 103751 156979 49915 -200217
15250 -200217 -449168 -503822 -216603 -52237 -155537 80587 20978 -90522 73483 175033
15240 175033 355755 391739 265431 88828 -191698 -402707 -507672 -358618 -440348 -462574
15230 -462574 -440438 -436277 -261490 -84190 -1577 -58676 -103834 -57624 -959 -7823 -126109
15219 -126109 -265116 -42268 198624 232615 293523 422598 369688 225350 -47047 -173289
15209 -173289 -176210 -181800 -186626 -415605 -423061 -303093 -132789 -185379 -234213 -280989 -207080 -170766
15197 -170766 -299590 -262078 -237690 -201874 -209562 4948 194020 159316 241742 123469 42578
15186 42578 130949 202565 197275 165256 124443 26595 67966 210467 146476 -156349 -319948
15175 -319948 -354089 -153531 19969 -157714 -315571 -222016 -211577 -195969 -7400 137425
15165 137425 55321 88629 101916 -7571 -195033 -225429 -335863 -198168 33667 117794
15155 117794 10137 -78724 -72615 -266211 -467998 -485348 -233603 -119126 -7921 169314
15145 169314 122710 245121 180695 71703 1445 70560 43393 67660 84560 60025 97529
15134 97529 14086 145482 14511 43681 234637 239952 83888 -147392 -1729 -2229 -120795
15123 -120795 -109720 -237339 -228365 -278407 -246965 -82938 -148152 -158186 -212338 -200638 -277214
15112 -277214 -312175 -327094 -418072 -530566 -486624 -253103 -41430 81771 23849 -153523
15102 -153523 -317765 -247099 -230612 -128133 -272709 -411302 -276660 -352201 -396899 -94192
15092 -94192 -29102 -55807 -64696 -21713 42023 -80403 -253556 -321742 -458819 -417568 -433607
15081 -433607 -281948 -236716 -413606 -378640 -175415 91733 64088 -4453 118539 184214
15071 184214 34423 -149464 -382758 -270747 40053 198189 175160 14655 -127498 -507250
15061 -507250 -294168 -153457 -137297 -122522 -213538 -103657 2808 -11090 39116 27411 -100835
15050 -100835 -97806 -4780 -97310 48525 67325 82364 190121 254644 196825 98432 -30040
15039 -30040 6379 463 27059 125182 101793 106212 51966 25560 -878 -122891 -216298 -88955
15027 -88955 177496 334007 158390 -1160 -24785 -171693 -141835 -6493 134696 59389
15017 59389 171382 215878 -133547 -291896 -86455 -35810 -214312 -306670 -106949 -14372
15007 -14372 83428 94303 -156412 -333796 -179761 36899 135347 26406 -112158 -142325
14997 -142325 -340748 -307503 -96385 -115628 -101659 -187760 -228531 -39828 -56392 -192746 -361828
14986 -361828 -289492 -314590 -73087 69346 178 1974 120932 9001 164012 362738
14976 362738 417988 229021 122552 80595 -88584 -240062 -215566 -276965 -176407 -318946
14966 -318946 -277878 -187672 -124179 53144 96951 -61825 -91571 -15211 11753 9811 272285
14955 272285 299097 -15377 -145554 42176 218414 370984 233112 168996 110244 263205
14945 263205 363329 150276 -74889 -198689 -455266 -406603 -238322 -267790 -118690 -136047
14935 -136047 -124134 -116388 -58642 -78140 -64114 -24985 -12565 -4280 58178 233809 195115 -125996
14923 -125996 -222330 -47673 -81415 -171463 -195816 -164254 -113034 39268 183094 110776 -76775
14912 -76775 -103628 -151051 -140694 -70124 27718 -161463 -127963 133867 158346 -144368 -247662
14901 -247662 -177008 101323 271883 385114 70199 -233579 -165828 -103715 -49947 -32494
14891 -32494 -237870 -122057 -58183 -50127 -196320 -317009 -116236 25575 -173285 -355760
14881 -355760 -301251 -183783 -134631 -277467 -393827 -128196 -2781 44983 -204833 -333740
14871 -333740 -586337 -635913 -468113 -210065 -46990 -126655 -73437 -35243 12807 -5077 116395
14860 116395 44590 -271468 -525171 -560520 -360013 -189059 -70594 -83139 48790 275402
14850 275402 217611 -54479 -247992 -191685 -125740 4139 1183 -85417 -117593 -138358 -277837
14839 -277837 -303782 -361719 -345440 -331478 -258316 -63841 23261 133648 264671 225270 557
14828 557 -89351 20664 252811 158772 17380 -59132 -114062 -91742 71623 173716 145887
14817 145887 -51011 -151813 -279844 -124184 86737 45955 -181385 -189039 -45295 112303
14807 112303 65132 -59892 128005 219558 99387 99904 6779 49856 160534 245699 148509
14796 148509 53891 194422 57800 -54605 -262107 -357575 -144811 117177 79724 -5108
14786 -5108 5788 -92712 -50507 -25656 210143 177917 153968 84757 -33103 -175567 -39003
14775 -39003 103017 198527 370050 228776 5435 -42011 -60068 11047 -181983 -268514 -227889
14764 -227889 -290510 -283580 -111222 11184 314340 485800 281576 -38087 -169807 -37307
14754 -37307 50123 253901 63412 -101209 -178789 -346531 -374343 -325069 -285194 -126038 -115957
14743 -115957 145578 356795 312059 127003 119459 -39366 -67063 -137756 -252820 -104013
14733 -104013 13875 39413 -110538 -259841 -303749 -238296 -224193 -159115 -41197 -92813 79663
14722 79663 39370 -8550 -246235 -190059 221905 179155 -170910 -395240 -511353 -460213 -412654
14711 -412654 -244728 -102362 -173856 -139038 -197290 -314125 -361113 -346428 -153704 -6933
14701 -6933 -9594 -148109 -219787 18977 164864 -112328 -181563 -123723 -225916 -92741 9846
14690 9846 -143762 -252363 -153838 105991 295461 241013 33426 33287 126640 373339 359504
14679 359504 197551 71255 146640 144169 216112 294202 140091 202670 295163 105151 99740
14668 99740 333486 251927 102006 86526 -27282 -322839 -417161 -330663 -272242 -213569 -114267
14657 -114267 -99626 -60017 60930 249566 241714 369290 505658 517481 590783 493949 179140
14646 179140 332705 449005 395792 305789 288258 149009 252366 270230 65702 88416
14636 88416 143042 126913 154067 37951 -60227 26468 -44843 203559 346009 298766 342037
14625 342037 402026 562981 551696 258274 193220 144656 -3408 -75542 -8791 -541 141959
14614 141959 254936 347517 440634 170467 -384471 -372072 -158507 127184 262477 135493
14604 135493 98854 120719 179494 145550 29371 111746 86838 126526 39616 159050 124196
14593 124196 -52779 -149318 -102740 42585 -66097 -1473 83640 107723 -17583 -75614 34515
14582 34515 168180 110845 174478 175460 53561 79048 187718 223425 256150 393815 247857
14571 247857 74513 -4510 -144814 -108005 -5797 -66472 -41545 315948 568855 529667
14561 529667 274755 169029 224789 163470 236350 199091 28510 96233 291128 533748
14551 533748 363313 169174 3043 -31665 -20627 116261 240061 502196 535942 572798
14541 572798 689578 676103 685282 564142 411797 353238 297001 198731 247121 376366 369495
14530 369495 459754 400502 324786 337866 441618 485257 699490 580280 516660 605712 711731
14519 711731 745625 768293 699150 725476 851888 630937 532933 542949 402099 309487 356803
14508 356803 350167 448413 560237 722168 862989 835374 744633 716537 762078 810536 670395
14497 670395 582188 744160 926451 860985 556242 384874 280119 377558 597014 639243
14487 639243 523666 597711 721978 779798 793773 720530 714260 826381 993070 1001150 844460
14476 844460 596745 381840 328430 444595 505044 588210 458311 285912 148344 89062
14466 89062 402725 558020 705642 485110 401002 397531 288222 204310 74915 -50725
14456 -50725 69953 184449 345984 398865 336026 149934 -25826 -169820 -90299 12368
14446 12368 126011 -1350 -49191 180438 411327 363307 403311 476933 425632 364923 303485
14435 303485 140795 275606 176304 -92650 -257345 -178060 -106876 33604 9854 -105959
14425 -105959 -261322 -114194 -7771 -63014 -1145 105436 190029 277446 299629 446949
14415 446949 403812 385897 258465 293320 306297 306339 237173 20230 -101438 -41648 -12346
14404 -12346 206500 130349 -7522 -138142 -198504 -89254 92028 144111 177970 129949 68443
14393 68443 296816 330623 102651 -96721 -135396 -73850 143840 407770 540058 556112
14383 556112 575227 540156 184926 -193680 -165412 54795 31710 90235 44915 -94075 -162847
14372 -162847 -179292 -237153 11136 124242 244193 290342 44202 -74479 -39177 -80115
14362 -80115 -20774 -108862 -127048 11727 45097 -7127 -101017 -69691 83900 184260 -74460
14351 -74460 -433891 -233252 -176678 -141820 -6911 12790 56885 68591 186678 293644 419194
14340 419194 459476 460196 257731 131963 179243 154257 -6928 12656 139736 227604 342937
14329 342937 491775 177060 122154 70653 98378 -1440 -170830 13013 294945 502376
14319 502376 492270 514668 349215 169160 52877 51024 253355 218861 193059 272423 481054
14308 481054 536163 506820 429756 559486 545548 636445 665208 456223 204333 193136 194381
14297 194381 191293 430716 338693 385942 454021 439488 407120 538699 519877 700006 767422
14286 767422 570678 556523 435157 461687 530715 609533 685614 854592 796934 900629 1106520
14275 1106520 1059814 832892 501220 436215 532296 698643 799046 553798 622924 784685
14265 784685 851758 880167 739084 532872 698065 683292 652404 709680 644466 697696 874079
14254 874079 929874 1109874 1049422 901986 722067 1054659 1182973 1111724 1063732 855900
14244 855900 635364 446004 159970 294728 461868 433472 495493 454467 511435 648461
14234 648461 880566 980057 973143 1062404 931910 787623 800903 1084130 1167098 1026042 1216124
14223 1216124 1284896 1190679 1205536 1306070 1275781 1140040 1097882 1032100 1068794 1102476 874880
14212 874880 785961 873357 594858 507111 609561 564854 561956 523385 523733 559787 687087
14201 687087 959137 1082431 1140381 1087494 1142288 1287685 1317307 1380876 1273480 1280909 1379030
14190 1379030 1280916 1334401 1205696 1049938 904831 846224 744819 642696 442294 272455
14180 272455 286096 257665 211275 364902 553370 718007 925831 918145 1071953 1290132
14170 1290132 1178459 1177991 1179212 1237017 1394388 1283652 1252556 1245025 1096337 1061430 1012637
14159 1012637 909954 862138 1193717 1306526 1128441 801068 682545 810526 994255 1128019
14149 1128019 1353686 1452974 1290652 1371557 1571119 1658242 1681746 1659765 1604786 1671371 1627183
14138 1627183 1552772 1722770 1806352 1858995 1768555 1720275 1957863 2131627 2336584 2477543
14128 2477543 2469262 2371823 2416425 2560970 2706274 2972719 3464132 4002566 4545676 5137586
14118 5137586 5861025 6899065 8374443 9845303 11807463 14478410 17685090 21025460
14110 21025460 24699738 28261281 31337511 34001540 35599449 36027743 35234614 33548521
14102 33548521 31553697 29293550 26850058 24612360 22899047 21770722 21071498 21451191
14094 21451191 22713485 24417003 27257189 31347554 36389209 42505351 49299000 56294800
14086 56294800 62713767 68016749 71949628 73696427 73252665 70866262 66727706 61784891
14078 61784891 56514615 51975953 48439638 46440153 45909904 47510371 51039889 56521143
14070 56521143 63234200 71078942 80014044 88937928 96386974 102309405 105940817 106981135
14062 106981135 105343303 101240780 95267218 88175977 80795695 73824350 67616803 62741591
14054 62741591 59693858 58746242 60086571 63768843 69874652 78696926 89970690 102785516
14046 102785516 116064182 128443088 138620187 145027262 147208407 144915144 138373441
14039 138373441 128196435 116027475 103050965 90795476 80006411 71366431 65140019
14032 65140019 61473176 60450973 61550814 64741586 69554074 76066913 83668615 91430980
14024 91430980 98502060 104356942 108317574 109747495 108609019 104813787 98842091 91207408
14016 91207408 82649491 74146322 66117881 58977991 53638043 50271543 48731576 49297064
14008 49297064 52207824 56459224 61498657 66991320 72210067 76631335 79354890 79764589
14000 79764589 77908967 73846570 68345505 61486977 54241283 47043441 40332153 34996908
13992 34996908 30820647 27524354 25515650 24316379 23914483 24119595 25012545 26752827
13984 26752827 29185620 31915314 34400195 36568055 38362965 38970128 38370393 36825236
13976 36825236 34154906 30918139 27583895 23978374 20471342 17192968 14621574 12221437
13968 12221437 10182414 8950370 7773058 6856551 6181136 5633955 5075044 4547398 4196654
13959 4196654 3689801 3224284 3055089 3025759 2672563 2454235 2362653 2209488 2173162 1909847
13949 1909847 1826667 1752192 1687984 1722242 1619068 1744755 1878962 1731796 1527017 1587037
13939 1587037 1529869 1474326 1236052 1195969 1123222 1008811 903102 695538 605714 776653
13929 776653 1105706 1174984 1257659 1010884 764429 445684 301997 636820 871658 851110
13919 851110 723184 844676 880228 783783 804731 911127 961721 941548 932513 926609 803450
13908 803450 628552 571451 609833 598917 639217 797809 930432 837548 668095 674915 785019
13897 785019 584079 363021 343075 525748 641381 599665 708322 652800 727520 910743
13887 910743 806984 729438 761659 888640 587484 338394 362609 491297 434060 458351
13877 458351 372690 357873 410975 689175 555109 332433 173959 246896 372365 338481
13867 338481 535134 346806 179844 139765 117682 45318 -46098 36447 19206 143658 212346
13856 212346 98522 234839 321318 268858 404873 569798 355240 232086 245075 4871
13846 4871 -192459 -8524 249502 346871 347921 577355 721837 641733 640751 585630 359642
13835 359642 303608 377974 345132 146326 149297 282662 372192 303818 531840 433222 238705
13824 238705 245300 280346 62839 108571 -13415 -91530 172869 249687 240025 408360 384435
13813 384435 229924 199264 263051 336862 396501 417813 457903 406568 431741 350223 109145
13802 109145 137439 28266 11561 122925 239842 278304 257881 65772 63743 331376 340752
13791 340752 531775 558249 345556 161474 142854 169589 146252 33496 145984 331592
13781 331592 477307 314204 281123 234595 375382 105739 -270216 -474247 -447670 -210274
13771 -210274 -79918 -48450 141781 -43416 -170376 -196975 -169125 -157305 -208296 -22939
13761 -22939 29779 28726 -22567 82072 184033 48303 169044 382185 266275 243365 207721
13750 207721 -151989 -416267 -557415 -373381 -282444 -200818 -291171 -140829 693 -117383
13740 -117383 -210526 -115524 101956 313829 399555 446317 242440 124170 393574 399460 208232
13729 208232 251054 196023 102220 -109687 -209331 -217862 245328 275320 210468 187630 252599
13718 252599 282954 303585 149493 41937 195084 287324 239357 180288 255195 469893 399235
13707 399235 79258 28885 -153558 576 146947 74915 143056 133751 50600 153548 125395
13696 125395 -132110 -214617 -42869 268076 254679 108676 28742 252573 365614 250345
13686 250345 336264 597176 378075 124525 -36404 -81488 -37068 107900 123220 -37812
13676 -37812 40550 296750 471952 363385 222095 289002 280335 168265 296666 559742
13666 559742 577168 660299 622596 509589 235488 281339 144058 -117791 -147327 -230395 -34576
13655 -34576 73779 -90413 -258884 -122908 122858 145524 247379 295887 478033 281313
13645 281313 265819 397755 363773 430501 358496 258514 242001 457151 492310 352498 484109
13634 484109 680585 487442 185110 -1795 -113076 -16400 38616 413744 603264 334053
13624 334053 311405 488417 359963 172896 3138 111785 230433 206944 194697 455705
13614 455705 517015 639404 857247 1004620 825904 499871 358899 180037 107562 231730
13604 231730 291415 104619 155875 347843 709683 900822 577222 338130 305929 332404
13594 332404 433940 443240 427081 389308 326811 420585 378787 450739 592029 511711 237861
13583 237861 296689 536802 415019 521368 779671 821759 718954 697681 680234 631978
13573 631978 650299 718743 701107 630091 542735 399596 604452 682386 569541 707843 653558
13562 653558 688921 619620 586391 600494 693562 713929 635469 522959 675837 569319 695026
13551 695026 798369 566237 332504 176500 207789 184028 188699 209868 323918 312906 138633
13540 138633 138962 440151 619644 673163 569192 329903 276490 286712 231803 327444 258776
13529 258776 235663 130726 -64423 143665 263026 325479 239818 55904 108825 -42796
13519 -42796 103056 314116 27768 -133676 -104053 32438 151139 301553 503435 398326
13509 398326 67959 -34934 22288 -128985 49251 114020 68753 14573 148362 202143
13499 202143 206342 12254 144880 224839 141077 29343 191244 391779 145614 80668
13489 80668 36644 -36405 220245 298227 21928 -81991 163209 148124 262665 267668 77354
13478 77354 -45982 180941 425926 518502 380749 283377 330689 166654 477629 424473
13468 424473 300769 266614 268425 462699 556811 594637 413481 298525 482445 475747 463262
13457 463262 378788 425938 634095 470926 390368 364815 302419 131055 103294 156319 299526
13446 299526 567264 798302 831457 938471 972176 995972 1032635 820127 651936 699190
13436 699190 517785 487145 256508 49359 211980 403218 628089 535413 371744 278302
13426 278302 155379 294304 468520 392923 423931 513770 514303 545207 390483 634256 899901
13415 899901 944465 655640 598389 567044 592239 682325 709439 460063 268819 523615 422105
13404 422105 382659 549089 617158 622967 837343 936475 1021664 1093473 1369795 1624033 1742079
13393 1742079 1864462 1892934 1781819 1397335 1075261 953632 643960 666961 867509 617160
13383 617160 382747 383314 411216 447724 315117 403740 536411 781465 920030 932508 931253
13372 931253 1050246 1081624 1275151 1563664 1387486 975425 928383 831037 882732 891332 806546
13361 806546 866694 796119 643931 366311 302727 348746 325843 425037 506001 423806 327231
13350 327231 221015 391257 456385 393810 607099 698732 477708 391159 711846 867696
13340 867696 1018891 991426 901661 840410 860455 655805 328472 239223 222001 230902 375094
13329 375094 458711 290059 311890 433474 417244 510735 557786 580028 571745 854720 965272
13318 965272 790379 807015 575697 240260 239043 439305 597395 651040 547138 525934
13308 525934 588026 488179 410011 488586 518115 378863 504674 412049 325679 240345 253675
13297 253675 321560 278932 150038 217979 183297 216052 168504 38441 -57346 157919 404045
13286 404045 498558 421232 181458 -11248 -154725 -88899 217966 292666 389412 390391 365555
13275 365555 424905 404420 247749 170142 236336 190759 85603 136925 423167 336151 89660
13264 89660 -76413 -201602 -220278 -103265 69174 226249 453456 619482 581601 472121
13254 472121 429764 304623 244109 267373 444147 605476 386429 381302 445233 318695 126904
13243 126904 -63797 -174192 -92714 -56950 27701 97958 250771 338134 393372 404159 317949
13232 317949 362311 322267 243022 290059 172404 53937 72326 204825 142787 236240 306951
13221 306951 108456 96994 217261 154554 143146 223172 18347 -24197 -18529 -63900 -49950
13210 -49950 -128156 -101520 103623 275591 411640 301743 140715 150206 415935 484069 247444
13199 247444 16913 183301 660944 678677 568758 780599 942774 879066 872367 712725
13189 712725 386768 196869 311091 511331 456908 602732 620723 360859 350088 461183
13179 461183 472127 348043 275530 520382 670295 766496 660244 338273 209513 160812
13169 160812 179988 145492 184269 445459 328580 218579 247677 246715 247616 449642 479905
13158 479905 198904 324361 524877 539705 649618 491324 292122 362762 653646 806297
13148 806297 715613 610559 530252 569730 501373 463563 208945 215804 114255 236787 568215
13137 568215 767113 828484 486363 333836 491412 592780 677718 457067 318837 488989
13127 488989 520997 467321 486989 438311 377192 515388 809667 697595 514974 490301 504043
13116 504043 457011 454625 597367 511615 384160 292119 207932 294991 369037 513198 635288
13105 635288 907224 1042787 1171396 1107937 983351 1151536 1180682 967962 1030340 1188001
13095 1188001 1075482 793394 727397 688741 818905 620295 601704 618346 577449 559248
13085 559248 390806 559691 751062 837293 800505 589658 508183 723626 794570 869890
13075 869890 957343 1080701 1129962 1139718 1322280 1405129 1443167 1366177 1420654 1539201 1683558
13064 1683558 1628474 1475601 1401447 1679585 1789978 1516463 1467883 1724963 1680504 1580622
13054 1580622 1835999 2279788 2323425 2467561 2677470 2833439 2731729 2529679 2679151 2851444
13044 2851444 2978919 3160869 3363216 3749894 4201740 4634567 4793658 5015897 5257178
13035 5257178 5570202 5708235 6074022 6839966 7249606 7519586 8314217 9110837 9748873
13026 9748873 10530756 12101992 13904169 16221782 19054327 22513259 26877863 32055441
13018 32055441 39059897 48431664 60681610 75304123 91366692 107256719 120581197
13011 120581197 129976293 134165679 132042805 124153144 112546251 99159089 85287894
13004 85287894 72433362 61951836 54281119 49235940 46583312 46327415 47950391 51543491
12996 51543491 57757455 66459497 77763966 91585479 106971415 122007940 134360515
12989 134360515 142681075 145709938 142063810 132354914 119115233 104108632 88615994
12982 88615994 74359604 62676970 53579456 46874319 41791693 38614768 36819160 35818053
12974 35818053 35713371 36281891 38238527 41147753 45632806 51865754 59902930 70313706
12966 70313706 82956360 97156069 111918211 125461771 136081393 142613574 144338527
12959 144338527 141004909 132970638 121805401 109254095 96767317 85460484 76438207
12952 76438207 70339998 66906178 66316192 69258055 75550464 85127254 98865346 117202042
12944 117202042 139672867 166031250 195400806 225677288 253647486 275514075 288196713
12937 288196713 290531132 282507763 264436818 239255962 211121633 182882903 156739250
12930 156739250 133879296 114876465 99815393 88833647 81599677 77927179 77899097 82198438
12922 82198438 90658821 102922905 117828749 134060123 150339091 165554756 177314196
12915 177314196 183182963 181907731 174372333 162355754 146355050 128368760 110440402
12908 110440402 94224377 80817775 70160337 61877846 55715550 51057120 48026320
12901 48026320 46399199 45990039 46726246 48861158 52757966 58828986 67575672 79206141
12893 79206141 94308521 112366270 131976680 151375985 168541159 180727435 185255588
12886 185255588 181746425 171255498 155972837 137911724 119451038 103043894 89479670
12879 89479670 78627383 70882400 65770033 63367582 63403551 66198250 72469027 82431352
12871 82431352 96144157 112937927 131351433 149696660 165769309 177097831 181042186
12864 181042186 176520645 164868152 148065258 128273156 107872277 89210027 73628926
12857 73628926 61009562 50684375 42640422 36366162 31288218 27119635 23788388 21262612
12849 21262612 19282084 17694074 16321889 14982993 13880944 12778662 11717384 10696787
12841 10696787 9776816 8732177 8058700 7585703 7281812 6932058 6585984 6319172 6116087
12832 6116087 5657473 5346735 5015103 4415949 4153320 4205308 4151916 4378941 4410560 4289585
12822 4289585 4175699 4068471 3796228 3895848 4096004 3908172 3599534 3377041 3236766 3139456
12812 3139456 3024115 2892484 2735829 2422357 2301792 2335073 2106842 2041300 2277624 2427145
12802 2427145 2356830 2061928 1785661 1819979 1830007 1953775 2046796 1775152 1412390 1434532
12792 1434532 1484120 1743328 1930355 1968503 2066441 2083770 2086610 2045577 1920618 1882833 1777175
12781 1777175 1803293 1680574 1622986 1673905 1604658 1608810 1447113 1453726 1746409 1785094 1764396
12770 1764396 1633481 1475975 1628421 1624075 1286551 1149608 1248853 1171576 1256012 1387714
12760 1387714 1158875 1109705 1008966 1175230 1093225 956898 716425 669249 634165 843828
12750 843828 1039898 1114500 1173134 1206323 1041993 926997 1043605 1289053 1301651 1176658
12740 1176658 1010524 1112963 1111181 1152148 1139178 816819 787481 858423 779387 797963 744271
12729 744271 535221 433482 403410 484169 558526 718969 724760 545151 554120 604358 640108
12718 640108 649257 724341 693140 417514 477388 670630 940509 968379 886220 669373 506174
12707 506174 443335 542288 550687 437756 393862 408965 418719 520261 753028 795161 545868
12696 545868 361747 435537 504141 397157 436591 654754 547692 619782 760682 866232
12686 866232 842314 542647 151289 109060 181904 85 94985 290302 294109 176009 367606
12675 367606 599718 566218 583317 479395 338707 367457 447991 670059 902196 778255
12665 778255 418559 289248 307941 384141 274617 537427 709570 581732 409423 507565
12655 507565 546576 572308 706622 834258 758688 727811 664388 716168 572343 444666 551357
12644 551357 737056 713189 571593 629929 601261 556718 668370 737583 774859 653673 654854
12633 654854 480516 486667 523974 548798 563753 576209 597615 479002 404201 689957 771010
12622 771010 805311 792626 727649 845152 1045502 1004932 872837 679300 473422 755091
12612 755091 877142 918408 786132 649600 603485 564977 398931 331708 354810 538428
12602 538428 671689 638730 479362 316870 369336 271587 326965 300539 439283 582512
12592 582512 720004 854764 876238 788051 751450 796109 863794 960478 840582 623527 563017
12581 563017 557420 513794 674519 897563 615001 517357 785042 890047 825877 914662 857801
12570 857801 672080 611101 597608 677091 902347 979904 961727 959385 958787 928444 819763
12559 819763 806324 788608 654617 558920 823568 956217 997969 962456 1128653 1163120 1107291
12548 1107291 1057190 1262314 1278517 1184081 1194171 1222010 1182022 1266026 1066993 971460 864872
12537 864872 1001540 996206 910829 1065841 1279270 1253909 1056664 1246212 1502635 1482944
12527 1482944 1435770 1380649 1419205 1393112 1348690 1575330 1647383 1714570 1556130 1336284 1156238
12516 1156238 1270460 1272944 1299710 1145855 1133165 1333616 1417610 1452540 1488769 1449649 1520668
12505 1520668 1496217 1591400 1780825 2033049 2089636 2088380 2228100 2479535 2670779 2664971 2483070
12494 2483070 2390062 2156668 2014220 1849815 2113730 2394068 2211373 2100967 2250930 2388334
12484 2388334 2589041 2826228 3017933 3333668 3588105 3598844 3705328 3969538 4121552 4194248
12474 4194248 4316333 4310273 4226807 4371240 4503183 4557440 4659604 4733081 4654991 4710282 5030673
12463 5030673 5320479 5705410 6138026 6621381 7159711 7767368 8614252 9504894 10549751
12454 10549751 11537532 12402180 13884584 15573143 17166662 19229875 22102438 26081471
12446 26081471 31202074 37404330 45440006 55705784 68504817 84438257 103413698
12439 103413698 124861928 146054266 163348597 173579294 174101922 165107575 149065402
12432 149065402 129601981 110252508 93530807 80047412 70280811 62933749 57780977
12425 57780977 54463991 52598593 52391779 54434405 58738851 65186072 73884273 85349674
12417 85349674 99718059 116869272 136158101 156186460 174703708 188722503 195817309
12410 195817309 194643291 185317082 170086565 152744948 136824627 124786113 117938884
12403 117938884 116517964 120231222 128427706 140612111 155639376 170904700 184268109
12396 184268109 192858482 194107809 187635853 174365727 156429489 136710684 117356680
12389 117356680 100439894 86723907 76885160 70052273 65496793 63059062 62441190 63758457
12381 63758457 67411105 73576340 82338378 93903297 108492125 125755035 144185737
12374 144185737 162416197 179202340 193072460 202535745 206911673 206420217 202429266 196817047
12366 196817047 192368191 189412020 186592622 182419833 175483264 165402859 152677639 138517954
12358 138517954 123697715 108918100 94975843 82782310 72792606 64885464 59166971
12351 59166971 55301799 52877567 52086755 52947066 55381781 59787279 66381305 75976877
12343 75976877 88223187 102575183 117957315 132177841 142704510 147822845 147139033
12336 147139033 140960007 131194035 119554847 107961450 98047699 91194395 88003002 89007101
12328 89007101 94480338 104456100 118330401 133868809 147956145 157852998 161435441 157631315
12320 157631315 147459003 133048824 116997094 101151618 86833435 74699809 64504999
12313 64504999 56557793 50623393 46518567 43873384 42755094 43451279 45554788 49121831
12305 49121831 54357652 61967370 72679348 86529902 103017084 120116370 135285037
12298 135285037 144319726 145102959 137776903 124382470 107783603 91042326 75778768
12291 75778768 62718425 51865199 43193553 36562797 31099639 26786875 23252228 20442847
12283 20442847 18180007 16261746 14844195 13527216 12244430 11324925 10451091 9579400
12275 9579400 8873947 8400744 8161158 7762445 7162015 6818093 6457826 6249402 6031283
12266 6031283 5846199 5513926 5145278 4864659 4471513 4175274 4076986 3783979 3564710 3705724
12256 3705724 3368695 3223612 2986757 3035483 2939422 3167447 3211119 3366486 3428036 3385595
12246 3385595 3280705 2588424 2084216 2076637 2103489 2139845 2214588 1965222 1833312 1566136
12236 1566136 1457265 1470839 1313437 1234519 1499867 1760765 1781908 1777729 1700270 1691228 1683943
12225 1683943 1665348 1698238 1676916 1636352 1571012 1298378 1075595 1023903 1188394 1193979 975633
12214 975633 802207 691115 649309 719193 1013539 1419875 1423770 1255618 1199247 1094021
12204 1094021 940570 1089182 1379686 1524080 1552845 1356817 1262586 1132359 1136366 1208217
12194 1208217 1039773 1024884 1182847 1180160 954255 721250 707209 629770 456395 255983
12184 255983 407168 603870 585900 812890 958138 760974 796538 616810 503979 599013
12174 599013 710920 699317 652101 656817 705669 443574 418916 502898 490755 371759 428755
12163 428755 426338 491984 482943 565600 618524 974898 928134 948663 743777 789828 549387
12152 549387 422205 400058 473502 414595 234395 332613 508620 615899 614857 469510 280237
12141 280237 331268 353208 201262 127066 297903 222740 3922 248201 570028 664267
12131 664267 580219 513551 548190 433856 426177 499429 573749 706728 527347 527299 585646 744130
12119 744130 743793 622356 458952 403683 279714 355986 591905 475988 397596 312101 312213
12108 312213 399922 456475 287842 178613 475546 541455 634196 756067 681591 553913
12098 553913 270668 212502 250741 238105 188381 178014 109903 127214 181229 139859 109194
12087 109194 47373 55164 239056 333119 268234 -14698 5558 17280 -59801 39868 212494
12076 212494 194405 266906 294288 54801 23638 2823 -77661 -57953 136962 434710 521542
12065 521542 493367 403256 390989 441785 73935 -101251 160989 45843 -122870 -199145
12055 -199145 -52079 52678 -56661 -99575 10886 79168 140389 210020 352650 511230
12045 511230 559904 377476 180653 52150 -67486 76395 229849 115746 3452 68227
12035 68227 176667 -97759 -349129 -100784 -28819 -13813 -24266 24252 73412 324076 433408
12024 433408 335115 161638 181196 465019 433710 347831 234674 154309 177307 165692 160167
12013 160167 280281 115755 22134 20618 -5930 26770 -10024 14851 244524 377330 253175
12002 253175 -2589 207144 525418 507121 355970 313292 429970 721569 780720 590122
11992 590122 595275 744396 678123 633271 899438 989273 598522 406455 351664 629070 948101
11981 948101 1090785 966719 987488 985847 681747 376284 477195 169224 -5872 52465
11971 52465 235503 190731 175811 359466 431232 283411 77377 -37497 152954 442220
11961 442220 626279 636519 609450 901549 1239485 1261037 1225760 978335 893288 753208
11951 753208 634693 506451 473078 501509 496693 578500 734362 740762 763013 1090895 1232264
11940 1232264 1041293 758312 710610 615375 688522 630069 568906 552944 491161 472957 706302
11929 706302 489002 406089 573524 617918 590032 509400 662855 527459 535805 671171 906001
11918 906001 1027815 1101676 1117874 879575 769321 839042 815811 905327 884703 876656 904213
11907 904213 928785 979414 989447 900711 936114 864714 484488 122974 50065 18722 114268
11896 114268 265889 305423 100734 -25578 -11439 99408 314276 105040 -28102 269616
11886 269616 567223 743328 983469 1102621 1190018 1279472 935544 849893 828511 805498
11876 805498 891785 703920 715786 630896 575959 536519 485216 625040 770815 717272 517460
11865 517460 604805 719978 789546 660313 441776 173100 140446 172167 447592 554358
11855 554358 456412 370576 385819 346695 192054 213743 398283 470453 463699 500623 670769
11844 670769 809287 867434 840123 726276 698803 655695 547440 325884 314061 179323
11834 179323 46480 -33466 104968 78940 -90025 -92982 86768 83364 291531 199142 152218
11823 152218 339366 330869 255259 13566 -20526 82413 7576 -221393 -107839 39453
11813 39453 30196 36950 34383 213668 396701 431922 241699 84375 -40357 -218 -6966
11802 -6966 -66428 108068 290355 442794 252016 166819 148064 35076 -5088 63975 111153
11791 111153 74388 104788 168625 178387 294388 446274 193392 4405 90943 -74869 -236592
11780 -236592 -164823 -201562 -192683 -70933 145952 211473 342519 292626 268302 207054 385899
11769 385899 389198 343570 79828 -4799 -25237 44523 -64636 22303 341967 272660 67858
11758 67858 169862 183832 44168 71782 -128798 -150082 -141861 -59798 87365 -33483 14742
11747 14742 194372 280643 -29913 -209563 -130693 -151394 -45763 -85347 -65096 -149815 -2934
11736 -2934 154350 403594 466055 412056 296653 205299 -49145 76542 393152 668222
11726 668222 835167 853000 659817 710971 497568 315314 455602 310621 200070 100896
11716 100896 68090 149127 -11271 -354682 -368651 -243842 -113621 -83575 -286507 -367262
11706 -367262 -371520 -269001 -163584 -137269 -111920 -141333 -181092 -54499 -84730 -119486 -245299
11695 -245299 -13487 111811 40101 -213831 -196522 4358 77963 -115476 -269597 -333327
11685 -333327 -170084 -248157 -313552 -367907 -348246 -453350 -364649 -255895 -197372 -99580 -30115
11674 -30115 -107549 -190452 -243352 -57918 -147885 -61554 159229 161312 36964 105893 88465
11663 88465 80333 1491 -102086 -7330 61819 -19802 -149371 -98257 54498 -20618 -78423
11652 -78423 177815 330353 311178 267110 383067 261439 25824 -69988 -8250 85115 -108181
11641 -108181 -128993 38601 -1684 -87142 -70594 -103024 34733 73242 71510 73891 -109032
11630 -109032 -152577 -70227 9716 119061 212280 432179 632974 461313 260571 342377
11620 342377 442655 651128 584132 558755 567500 886316 1348479 2047680 3051467 3752751
11610 3752751 4412511 4510845 3659410 2709888 2005837 1642644 1344987 1178114 839815 440647
11600 440647 302948 281674 245030 59587 -117017 -138735 199255 85643 40095 222034
11590 222034 211182 267440 492062 515812 430901 176000 -12350 80079 96502 117401 76859
11579 76859 68109 33766 -60844 -153336 -304054 -184801 51151 36218 144930 165781 146962
11568 146962 -2808 144271 254597 170713 85315 161248 271638 78996 26426 -97725
11558 -97725 -119425 109566 131191 68274 341276 421207 214765 191344 8501 -68115 -117154
11547 -117154 -68398 57960 104366 -47429 -49427 -211099 -174588 30938 34431 -100314 -118296
11536 -118296 -22593 87542 148505 42698 -99105 -75857 23313 58481 123326 93419 153017
11525 153017 -28368 -145027 -162404 -181453 -23902 -222765 -282844 -184970 -231739 -438476
11515 -438476 -406417 -32500 34504 -40662 -139757 -58961 -25940 -110396 -76230 -18358 59976
11504 59976 64193 -22608 -57727 -164367 -63976 295979 174596 50420 119348 103377 150138
11493 150138 220922 206551 -18337 -77518 10465 5847 -222583 -339878 -493191 -316769 -192751
11482 -192751 45298 38682 11406 95073 41832 22955 90119 85221 149917 240580 244172 239736
11470 239736 416482 751937 821224 978372 1696962 2472693 3341578 3830248 3877116 3661655
11460 3661655 3049872 2457505 1900772 1322015 974489 838788 611133 556155 454020 338602
11450 338602 443187 389944 214409 191387 257992 251949 215426 334254 429294 257647 76861
11439 76861 12536 3883 -130644 -165560 -188544 -132324 52781 126646 239193 82976 -126593
11428 -126593 -392628 -333666 -258878 -313972 -307880 -307626 -120447 -194521 -118847 10536 -86628
11417 -86628 -163699 -188145 -144419 -101596 -58193 65500 -70825 -40605 -213965 -321371 -45278
11406 -45278 88849 217316 271813 241418 112475 43550 153445 175316 46665 -54054
11396 -54054 -194211 -20361 34501 136155 57936 -186890 -194017 -154764 -152922 -225520 -261279
11385 -261279 -176978 81556 171656 164883 220210 163402 -32178 -49322 -189144 -243666 -38251
11374 -38251 47866 -96859 -156237 -134114 -70843 -55026 96233 275119 350345 281454 118983
11363 118983 88100 -29379 -76266 164951 62488 189030 183067 85886 -182221 -298078
11353 -298078 -383272 -390710 -404129 -404161 -199748 3823 -136701 -161160 87436 309031 99443
11342 99443 57834 251806 424300 347346 482496 416314 276758 257917 152474 136594 202164
11331 202164 360419 279172 129506 -67637 -369605 -500995 -284696 -301384 -236176 -161637
11321 -161637 -315134 -263658 -389318 -294872 -47452 -167866 -219695 19748 113432 -52491
11311 -52491 -161767 -254286 -170661 51075 139519 -31338 125697 243738 -11608 -138360
11301 -138360 -15137 -116389 -252542 -192572 -39348 -53501 -161541 -22579 31483 14031
11291 14031 101754 -162479 -394416 -339801 -183203 122078 38719 170861 372870 395092
11281 395092 490883 347745 38547 -189274 37532 67555 -100079 -28049 -112111 -61675
11271 -61675 25980 132127 55354 64329 52211 11060 -124394 -114494 82761 50784 -102058
11260 -102058 -77076 -42043 47552 66209 113735 -64701 -149975 -144927 -211182 -239678 -299081
11249 -299081 -192533 -129235 -355787 -462699 -413409 -375345 -366389 -282372 -326491 -342564 -295319
11238 -295319 -447070 -430903 -270616 -83396 35239 -3798 -3434 16332 -28107 40782 337104
11227 337104 354449 212404 158828 19772 105357 90485 117304 222952 178632 120371 187336
11216 187336 205623 -82234 -238491 -187742 -113480 -66543 -214677 -208107 -151680 -94008 97677
11205 97677 32474 -32072 79340 120010 80553 -58760 -191978 42007 205772 241407 364800
11194 364800 264831 263394 244064 -90567 -271396 -174421 -95518 -52683 65783 180679 136634
11183 136634 234734 255349 323878 367132 161251 -20596 -43305 3675 -95863 -77619 32187
11172 32187 -183294 -420130 -440722 -283015 -249712 -357135 -90062 -170786 -365132 -400309
11162 -400309 -475938 -304680 -156299 -113845 -95693 55731 112480 135039 37916 -125487 -196337
11151 -196337 -230268 -292597 -180507 -120067 -190601 -247720 -139049 -15481 20369 110257 148567
11140 148567 176588 330973 497716 260773 3851 -218867 -210318 -224315 -289619 -92162
11130 -92162 -106900 -337702 -544928 -550036 -542141 -527108 -472649 -358543 -273482 -4285 224558
11119 224558 193094 -103351 -311948 -185185 -43978 -15176 9801 -60403 -112382 -135244 -255581
11108 -255581 -273500 -323009 -282572 -348832 -361409 -277335 -406776 -251893 -44527 -66068 -145266
11097 -145266 -128770 -262119 -305143 -159561 -110084 35185 75220 -106006 -127470 -195869 -94909
11086 -94909 -308892 -187882 27668 150188 299195 109535 -92776 -181485 -259396 -48167
11076 -48167 26543 139087 269433 233507 136695 7144 228642 224569 23573 47593 -238985
11065 -238985 -490976 -606228 -523164 -673597 -737474 -503283 -443620 -173619 -87519 -1298
11055 -1298 -117448 -104713 -70348 19578 132057 95186 37667 189753 272664 -35244 -50884
11044 -50884 -21564 14707 -79296 -255107 -373381 -444274 -634926 -733876 -497374 -464089 -439101
11033 -439101 -321462 -216722 -169910 -5195 -159510 -323877 -370803 -111670 174967 218185
11023 218185 158118 -40133 -54400 -46461 156524 126350 -58196 -317352 -555068 -495416 -198895
11012 -198895 -233916 -177621 -34151 -55121 31035 -13438 -234564 -258462 -174654 -19810 245214
11001 245214 316290 416089 362684 337657 206522 11437 209664 247775 117278 75515 -151014
10990 -151014 -251130 -219167 -46901 134421 289560 231604 219772 87613 -85407 -175678
10980 -175678 -221963 12514 182158 88635 197383 186221 -79823 -430010 -296981 9021
10970 9021 59069 -3896 -203126 -55578 116119 -60943 50216 340408 419951 377657 370726
10959 370726 297774 288635 209979 248395 191463 244429 123879 -27538 -104425 60747 -182584
10948 -182584 -208718 -44153 4074 83641 26441 134682 -17522 -155310 -215308 45565
10938 45565 82408 44599 -48270 -194877 -192552 -143849 -147040 -14353 103269 19967 -20575
10927 -20575 -61376 -135331 -292754 -319899 -282403 -276175 -31277 -190975 -176016 102722 -10753
10916 -10753 -91336 -172261 -157911 -138030 17645 40916 -3034 -87788 -233116 -332008 -433250
10905 -433250 -517269 -511696 -455905 -437729 -237468 34626 116018 45414 -1725 -324707 -342996
10894 -342996 -278430 -118780 -148018 -35238 -87426 -122680 -42434 -5941 -60298 -40257 -161421
10883 -161421 -200393 -412699 -350436 -54248 95933 -84820 -247192 -255863 -161747 144240
10873 144240 351209 187834 80101 -29486 6700 -23891 101579 113139 -100241 -271770
10863 -271770 -273578 -232191 -83388 67057 216231 122522 38648 149558 -36974 80133
10853 80133 71609 -102472 -38882 -27624 -109907 -222406 -327650 -376594 -346602 -216503 -139033
10842 -139033 -2637 296712 328693 278324 185310 204682 354180 178559 -33750 -9849
10832 -9849 -260092 -466870 -370770 -20951 54824 71776 135748 163741 172059 160878 -38514
10821 -38514 -149470 4733 -176328 -378732 -349760 -371460 -222802 -7964 -209963 -245472
10811 -245472 -96797 58215 185056 133331 -21376 97485 -97983 -174911 -179895 -22394
10801 -22394 -103993 -173324 -138284 -42043 62897 -228884 -318403 -149077 809 39196 -34126
10790 -34126 -164272 84745 122276 -196578 -148102 102598 236857 206812 82086 193594
10780 193594 57704 108496 62832 58241 27609 21362 -19456 96710 69653 -196877 -322326
10769 -322326 -381928 -352336 -160478 -15269 111932 172629 241547 95700 -58336 -193144
10759 -193144 -187125 -296494 -295662 -50382 -20199 167946 113817 -201615 -419881 -484278 -399610
10748 -399610 -270433 -260355 -310448 -389358 -57946 -151541 -224930 -188969 -178918 -216951 114151
10737 114151 436903 496193 352670 273082 219105 213078 216513 14982 8241 97087 397387
10726 397387 443216 308031 184569 137591 155253 19273 106939 300815 280925 260128 234096
10715 234096 160085 166141 49638 3240 -202769 -168210 60415 194374 211523 -1290 -145697
10704 -145697 -118359 -53907 -268183 -315918 -306219 -204716 -175397 -161383 -118462 -121479 -121807 15882
10692 15882 -251470 -223426 155407 285977 9712 -76891 -77527 -345204 -176825 103989 134780
10681 134780 127618 278931 206467 162669 116855 26556 -51514 -26018 104035 207724 19276
10670 19276 -18035 190906 106766 11854 61788 113018 63130 -192163 -148720 19817 -192922
10659 -192922 -284058 -224602 -195478 -120528 -95557 -84996 -301307 -301723 77249 294908 187916
10648 187916 224771 191591 16739 -27727 -138429 -319372 -386596 -431357 -605550 -542260 -381364
10637 -381364 -493506 -667789 -567117 -437374 -334619 -54869 -15881 -293466 -348259 -371914
10627 -371914 -276010 -163437 -240491 -64892 101867 -31437 -426456 -424050 -402232 -180803
10617 -180803 -154590 -241734 -208748 33737 189722 233180 19448 -48312 -179636 -359852
10607 -359852 -351477 -48999 -98214 -188399 -231233 90934 420962 192787 -25432 -123961 -248417
10596 -248417 -297491 -22510 74747 132122 201798 146798 175268 148704 -107017 -364461 -339361
10585 -339361 -279136 -171101 12081 100052 165975 -2360 -24917 87282 220418 443964
10575 443964 515999 440925 233206 -30633 -213603 -234857 -196910 -193954 -148094 -134441 -130604
10564 -130604 -168085 26577 16255 39590 19787 -153073 -304655 -121702 173751 333665
10554 333665 201909 184565 174922 248128 153238 -24705 -49225 110402 130721 -31533 -34763
10543 -34763 -120948 -118070 -67383 -279889 -147974 177801 240648 -38614 -72959 56568 288277
10532 288277 277904 53021 -175968 -139666 58524 458228 522889 419897 172539 -49794
10522 -49794 -47173 24545 62498 107711 77873 -77169 -171973 -183535 -195813 -51485 -20624
10511 -20624 -92437 -125419 -112211 39677 -10858 -352995 -277045 -32641 -83109 -62956 18472
10500 18472 164787 220807 33098 -333373 -441007 -375884 -171803 28747 162696 416490
10490 416490 463462 494589 247165 38087 47710 284889 215231 281022 281314 175951 11401
10479 11401 -96570 9326 -140195 -25826 290981 281142 83297 101145 71996 9209 93535
10468 93535 55800 157240 114871 92421 155883 273431 277157 354521 298958 208726 230272
10457 230272 53500 39785 263474 126293 -21697 -20721 159502 290125 390716 315690
10447 315690 463207 496816 373213 214632 163460 138647 27914 -33988 43631 96131 104184
10436 104184 -11615 41264 263128 360230 329449 129321 63272 41540 -2517 -99903 -58423
10425 -58423 -21300 165395 387668 501999 501359 544158 482341 200746 94521 131743 116531
10414 116531 -214481 -449728 -113740 81325 -249019 -431202 -209127 -176736 -207648 -30727
10404 -30727 128243 -123642 -333625 -313121 -227054 -44472 45182 144713 232066 98472 -230215
10393 -230215 -162381 96719 -92445 -191644 -12937 119861 87692 250152 199011 31418
10383 31418 -35725 -61557 281688 273222 98408 76639 41449 -144054 -338571 -149375 -29991
10372 -29991 28268 -12324 -199393 -268125 -109077 102717 369387 441052 463716 313556 113928
10361 113928 152814 248232 372519 247464 154867 -13472 -11664 -249877 -375573 -258007
10351 -258007 184504 285658 313649 359204 171167 437891 533941 810293 1053041 1079190
10341 1079190 1398659 1630500 1586983 1488104 1417291 1297464 1133011 1215520 1205303 1094988
10331 1094988 829935 743938 648454 690035 567173 378333 360169 306604 176068 209403
10321 209403 450936 471518 594032 566550 463166 348004 390356 443832 311853 133428
10311 133428 125700 448069 515694 544551 608107 696433 695350 732064 760158 692988 766048 942116
10299 942116 864426 1013751 837561 721637 698380 617656 972837 1033222 837949 605078
10289 605078 471365 421783 468449 475302 718956 784612 858845 904842 1103423 1095132 899322
10278 899322 893380 850515 866617 830191 665793 655528 498125 387225 386118 331515 419827
10267 419827 590570 671983 898611 701085 573036 544435 368606 141598 -10870 -158900
10257 -158900 -94009 -134006 109561 213095 280196 357279 632220 834658 823491 709197
10247 709197 666865 606777 213904 210327 298270 400999 587357 611496 606265 476972 469931
10236 469931 571625 518417 571242 574336 495563 530954 575746 732375 923302 943384 689960
10225 689960 358159 296831 360041 580135 472672 299432 420032 575651 625470 748243
10215 748243 1040316 991084 807714 834692 842077 948385 1014955 979929 1082064 1265874 1165514
10204 1165514 767822 643750 493413 326982 403184 466113 525666 598173 643892 531159
10194 531159 456354 435325 600720 815020 1168298 1332914 1281723 1169966 1067697 1115807
10184 1115807 1148974 1057778 1061848 1012415 1008819 1167515 1234893 1018619 733501 376616 340455
10173 340455 615473 752472 618374 411905 604863 562697 649496 724050 790551 738719
10163 738719 726574 909359 1118166 1113014 1060093 918368 876061 960123 1072045 1115515 962777
10152 962777 957840 1088183 884269 949535 917512 942314 891488 783852 568695 559562 599952
10141 599952 545449 454011 673874 722965 778512 728514 710671 994557 1168744 1264478 1262448
10130 1262448 1187479 1236735 1328059 1268149 1193267 1214958 1123816 1005170 1015669 966361 841310
10119 841310 1011244 1156439 1201585 1176101 1126950 1151420 1572250 1654788 1489690 1257910
10109 1257910 1156929 1127978 1224343 1046498 989877 1038185 992361 826014 743970 768091 1017447
10098 1017447 1161629 1123431 1336639 1367061 1401566 1261224 1087896 812222 864827 1128290
10088 1128290 1189236 1219726 1532145 1408641 1444166 1483610 1273403 1405095 1600229 1491019
10078 1491019 1367821 1328481 1445872 1237924 1310401 1389990 1556085 1719237 1724490 1197492
10068 1197492 1097561 1363443 1436844 1560528 1704985 1516992 1339312 1217990 1446444 1715349
10058 1715349 1748737 1826786 1863365 2039729 2408499 2924285 3813933 5073121 5366989 4156422
10048 4156422 3294085 2659504 2355314 2318272 2241380 2086218 1855696 2022582 2049086 1884478
10038 1884478 1974895 2033881 2099420 2335847 2369345 2456388 2590286 2646752 2627998 2690636 2517823
10027 2517823 2538787 2644808 2614342 2886224 2864615 2717768 2497049 2631516 2495666 2415972
10017 2415972 2659036 2514983 2270703 2395619 2619000 2784473 3009276 3140979 3142711 3219922
10007 3219922 3126803 2734030 2585764 2856253 3141092 3207917 3105464 2952040 2872363 2816092
9997 2816092 2716884 2666035 2681002 2632571 2435453 2248929 2299294 1996940 2148436 2526472
9987 2526472 2389506 2290599 2209877 2375735 2414338 2224393 2088087 2085331 2123133 2227069 2132030
9976 2132030 1971937 1861059 1957789 2030390 2342785 2765545 2777248 2535218 2324632 2138328
9966 2138328 1961347 1896303 1930614 1925313 2025922 2202992 2406776 2604349 2738780 2744316 2696112
9955 2696112 2319203 2249759 2403696 2616283 2744150 2805866 3068847 3107138 3128356 3076200
9945 3076200 3161088 3143719 3224279 3510383 3577146 3538414 3929223 4399295 4540386 4911817
9935 4911817 5103148 5554638 6357454 7112667 8201392 9106823 10338503 12219282 14470797
9926 14470797 17351465 20746609 25005689 29818934 34811484 39490728 43000952 45596739
9918 45596739 47488906 48736445 49353116 49244701 47295069 43607901 39012252 34530343
9910 34530343 30854892 28507320 27531731 27411481 28161845 30137073 33322257 37639998 43392582
9901 43392582 50216813 58462280 66954044 74916154 81185068 85730035 88936750 91501756
9893 91501756 92762681 92037527 88785920 83835144 77065136 69298428 60920982 53021401
9885 53021401 46532597 41765173 38872231 37528612 37504014 38756516 41553699 45513862
9877 45513862 50620601 56873988 63883069 70858470 76951060 82013371 85791444 88117276
9869 88117276 89696381 91187510 91489345 89043988 83513906 75244469 65973959 57488091
9861 57488091 50184649 44537102 40660509 38497438 37986888 38428720 40202067 43448948
9853 43448948 47859923 53856098 61143391 68652279 75390554 80751079 85122367 89288163
9845 89288163 93628573 98031599 102286524 105846255 107767154 108479783 108695121 109199304 110572440
9836 110572440 112709172 114727139 115562617 115071694 113571787 112011199 111193096 111637689 112893182
9827 112893182 113816123 112947385 109906485 105712974 101579398 98407904 97469578 99103096
9819 99103096 102742197 107795071 113906941 121135065 129778874 139713494 150529025 160715616
9811 160715616 168795754 173962831 175715351 174793473 172008266 168031417 163257823 157182524
9803 157182524 148014805 135563462 121434625 107505701 95020646 85216314 78327846
9796 78327846 74274037 72838907 74128912 78397425 85832497 96423275 110193684 126522377
9788 126522377 143109287 157439003 167445071 172475383 173572462 172451894 170368695 166710588
9780 166710588 160456253 151345517 139652088 126400155 112446034 99539191 88700586
9773 88700586 80546836 74872872 71837981 71242516 73270326 78167388 86324494 97724433
9765 97724433 111454785 126222762 140194952 152070874 161212002 167797669 171107800 171353627
9757 171353627 169143521 164768973 157774646 147085521 132791148 116796614 101439922
9750 101439922 88420328 77718276 69267926 63053292 58911181 56608224 55922438 57372574
9742 57372574 61077091 66593661 73348880 80731763 86800490 90483096 91596056 91154666
9734 91154666 89971716 87806931 84114956 78495662 70880888 62127951 53219477 45370467
9726 45370467 38735847 33478475 29082606 25130126 22039182 19625014 17618315 15794637
9718 15794637 14367149 13132812 12250021 11313521 10453440 9999017 9719218 9246917 8858231
9709 8858231 8517614 8170560 7798976 7590802 7562983 7326628 7005046 6910280 6681587 6883011
9699 6883011 7221958 7468606 7532344 7444524 7441917 7396372 7254781 7104777 7014775 7089946 7041838
9688 7041838 7047089 7160584 7360739 7454938 7726812 7888132 8204239 8646914 9172066 9902160
9678 9902160 10887715 12164032 13625688 14932271 16649647 19001131 22087835 25531925
9670 25531925 29944290 35222087 41681167 50164125 60137578 70826882 80768976 88254844
9662 88254844 91917833 92644429 92159653 91506302 89984642 86284025 79909260 71664167 63298412
9653 63298412 56311929 51071595 47812481 46608205 47320476 49520921 53276760 58875287
9645 58875287 66558705 75442553 84214344 91771146 97388898 100896858 102452757 102703981
9637 102703981 103039246 104350109 105270753 104305746 100562875 95311848 91234451 90521313 93666266
9628 93666266 100468065 110255380 122835577 136545403 150205624 161949979 171135101 177541872
9620 177541872 181255931 182431150 180597372 174837793 164495952 149939721 133473590 118152174
9612 118152174 105543134 96321921 91191219 90034521 92502713 98106402 106925640 118103692
9604 118103692 130729941 143136530 153757481 161736016 167946203 173001942 177073660 179360757
9596 179360757 178663811 174984728 167551926 156412590 142446228 127433682 114277085 104626347
9588 104626347 99400811 98023407 99769015 103605888 108451781 112940518 117230428 122233898
9580 122233898 128904426 136522216 142649773 144349246 140033787 130889056 119583394 109088484
9572 109088484 100718376 94052599 88699280 84278437 81160724 79769528 80591485 83425174
9564 83425174 87688586 92204420 96253075 99615673 102832734 107055297 113481641 122066577
9556 122066577 129946603 133788824 131665675 123937973 113436769 102801209 93759919 86182788
9548 86182788 79280214 72785365 67201682 63045945 61053597 61613522 64713646 70200773
9540 70200773 77792593 85992773 93086789 98119064 100717615 101029941 99563378 96882543
9532 96882543 93653245 89979208 85807948 80893195 74522792 67279280 60316892 54268583
9524 54268583 49976508 47277529 46181509 47354412 50798680 56263695 63821398 72802424
9516 72802424 81599662 88752845 93031589 94464151 94025817 92086387 89052078 84987431
9508 84987431 79711975 73461130 66449166 59724490 53940703 49741577 47186624 46452958
9500 46452958 47906954 50950018 53963294 55462133 55195078 54273224 53698054 53697098 53751563
9491 53751563 52439965 50197621 47155975 43056093 38538487 34185442 30582383 27854241
9483 27854241 25858348 24834712 24760109 25495994 27499757 30617429 34640960 39056704 42927112
9474 42927112 45455599 46138445 46085211 46291559 46379590 45579744 43195270 38526552 32964638
9465 32964638 27987886 23622390 20245388 17767133 15580501 13771332 12096141 10654610
9457 10654610 9758359 9045604 8336660 7426578 6878702 6366462 6086212 5815616 5540100
9448 5540100 5443345 5387451 5103413 4897790 4629650 4202157 3931881 3771159 3685290 3808407
9438 3808407 3786562 3880537 4081496 4182371 3978412 3835650 3785135 3668922 3624220 3586963
9428 3586963 3639537 3824214 3707508 3719252 3730863 3576856 3577449 3773361 3664938 3522337 3320381
9417 3320381 3225072 3125611 3062364 3059025 2944549 2945184 3127832 3265428 3466053 3398424 3330073
9406 3330073 3061326 2662265 2691991 2857286 3139522 3569936 3912926 3880059 3636999 3428471
$$ [...]
##END NTUPLES=NMR SPECTRUM
##END=
