##TITLE=Analysis number 325209
Compound Code cc 52204
Book Reference 467/116/3
Project Code adrs
Chemist Name benw
##JCAMPDX= 6.0         $$ Bruker NMR JCAMP-DX V2.0
##DATA TYPE= NMR SPECTRUM
##DATA CLASS= NTUPLES
##ORIGIN= Bruker BioSpin GmbH
##OWNER= nmr
$$ XWIN-NMR		Version 3.5
$$ Thu Dec 14 14:03:14 2006 GMT Standard Time (UT+0h)  MAYBRIDGE\nmr@NMR_250MHZ
##.OBSERVE FREQUENCY= 250.131544655141
##.OBSERVE NUCLEUS= ^1H
##.ACQUISITION MODE= SIMULTANEOUS (DQD)
##.ACQUISITION SCHEME= undefined
##.AVERAGES= 16
##.DIGITISER RES= 18
##SPECTROMETER/DATA SYSTEM= dpx250
##.PULSE SEQUENCE= zg30
##.SOLVENT NAME= CDCl3
##.SHIFT REFERENCE= (INTERNAL, CDCl3, 0, 16.5278)
##AUDIT TRAIL= $$ (NUMBER, WHEN, WHO, WHERE, WHAT)
$$ ##TITLE= Audit trail, XWIN-NMR		Version 3.5
$$ ##JCAMPDX= 5.01
$$ ##ORIGIN= Bruker BioSpin GmbH
$$ ##OWNER= nmr
$$ C:\u/data/dgb/nmr/ADRS/1070/pdata/1/auditp.txt
$$ ##AUDIT TRAIL=  $$ (NUMBER, WHEN, WHO, WHERE, WHAT)
(   1,<2006-12-14 14:02:53.51 +000>,<MAYBRIDGE\nmr>,<NMR_250MHZ>,
      <created by zg, POWCHK disabled, PULCHK disabled
       configuration hash MD5:
       49 4B E0 1D 92 C2 6B 37 9F E6 65 BC 52 41 86 1D
       data hash MD5: 64K
       FC 1C 70 AA 29 CC CF AA A3 8E 96 7C DF B8 79 4B>)
(   2,<2006-12-14 14:03:05.78 +000>,<MAYBRIDGE\nmr>,<NMR_250MHZ>,
      <Start of raw data processing
       ef LB = 0.3 FT_mod = 6 PKNL = 1 SI = 32K 
       data hash MD5: 32K
       11 B9 A5 D9 A5 ED 74 DD 29 DA 17 40 CA A8 EA F6>)
(   3,<2006-12-14 14:03:07.34 +000>,<MAYBRIDGE\nmr>,<NMR_250MHZ>,
      <apk 
       data hash MD5: 32K
       33 1B C9 4C 08 91 6D 3E B1 78 2D 7E F5 D7 ED 9D>)
(   4,<2006-12-14 14:03:08.01 +000>,<MAYBRIDGE\nmr>,<NMR_250MHZ>,
      <abs ABSG = 5 
       data hash MD5: 32K
       31 76 93 54 5C BD 77 76 FF 53 54 2C 11 A6 FB DD>)
$$ ##END=
$$ 
$$ hash MD5
$$ 2A E7 2B DC 52 38 92 A5 49 FD 2D 04 09 D0 AE 7F
##$RELAX= 
##$RELAX= 
##$RELAX= 
##$RELAX= 
##$RELAX= 
##$RELAX= 
##$RELAX= 
$$ Bruker specific parameters
$$ --------------------------
##$DU= <C:\u>
##$EXPNO= 1070
##$NAME= <ADRS>
##$PROCNO= 1
##$TYPE= <nmr>
##$USER= <dgb>
##$AMP= (0..31)
100 100 100 100 100 100 100 100 100 100 100 100 100 100 100 100 100 100 
100 100 100 100 100 100 100 100 100 100 100 100 100 100 
##$AQSEQ= 0
##$AQ_mod= 3
##$AUNM= <au_zg>
##$AUTOPOS= <17 >
##$BF1= 250.13
##$BF2= 250.13
##$BF3= 250.13
##$BF4= 250.13
##$BF5= 500.13
##$BF6= 500.13
##$BF7= 500.13
##$BF8= 500.13
##$BYTORDA= 1
##$CFDGTYP= 0
##$CFRGTYP= 5
##$CHEMSTR= <none>
##$CNST= (0..31)
1 1 145 1 1 1 1 1 1 1 1 1 1 1 1 1 1 1 1 1 1 1 1 1 1 1 1 1 1 1 1 1 
##$CPDPRG= <>
##$CPDPRG1= <>
##$CPDPRG2= <>
##$CPDPRG3= <>
##$CPDPRG4= <mlev>
##$CPDPRG5= <mlev>
##$CPDPRG6= <mlev>
##$CPDPRG7= <mlev>
##$CPDPRG8= <mlev>
##$CPDPRGB= <>
##$CPDPRGT= <>
##$D= (0..31)
0 1 0 0 0 0 0 0 0 0.06 0 0 0 0 0 0 0.0002 0 0 0 0 0 0 0 0 0 0 0 0 0 0 
0 
##$DATE= 1166104972
##$DBL= (0..7)
120 120 120 120 120 120 120 120 
##$DBP= (0..7)
150 150 150 150 150 150 150 150 
##$DBP07= 0
##$DBPNAM0= <>
##$DBPNAM1= <>
$$ [...]
##$SUBNAM7= <"">
##$SUBNAM8= <"">
##$SUBNAM9= <"">
##$SW= 20.6930455092707
##$SWIBOX= (0..15)
0 0 3 0 0 0 0 0 0 0 0 0 0 0 0 0 
##$SW_h= 5175.983436853
##$TD= 65536
##$TD0= 1
##$TE= 295.16
##$TE2= 300
##$TE3= 300
##$TEG= 300
##$TL= (0..7)
0 120 120 120 120 120 120 120 
##$TP= (0..7)
150 150 150 150 150 150 150 150 
##$TP07= 0
##$TPNAME0= <>
##$TPNAME1= <>
##$TPNAME2= <>
##$TPNAME3= <>
##$TPNAME4= <>
##$TPNAME5= <>
##$TPNAME6= <>
##$TPNAME7= <>
##$TPOAL= (0..7)
0.5 0.5 0.5 0.5 0.5 0.5 0.5 0.5 
##$TPOFFS= (0..7)
0 0 0 0 0 0 0 0 
##$TUNHIN= 0
##$TUNHOUT= 0
##$TUNXOUT= 0
##$USERA1= <user>
##$USERA2= <user>
##$USERA3= <user>
##$USERA4= <user>
##$USERA5= <user>
##$V9= 5
##$VALIST= <valist>
##$VCLIST= <CCCCCCCCCCCCCCC>
##$VD= 0
##$VDLIST= <DDDDDDDDDDDDDDD>
##$VPLIST= <PPPPPPPPPPPPPPP>
##$VTLIST= <TTTTTTTTTTTTTTT>
##$WBST= 1024
##$WBSW= 4
##$XGAIN= (0..3)
0 0 0 0 
##$XL= 0
##$YL= 0
##$YMAX_a= 258857
##$YMIN_a= -363961
##$ZGOPTNS= <>
##$ZL1= 120
##$ZL2= 120
##$ZL3= 120
##$ZL4= 120
##$ABSF1= 16.52784
##$ABSF2= -4.165335
##$ABSG= 5
##$ABSL= 3
##$ALPHA= 0
##$AQORDER= 0
##$ASSFAC= 0
##$ASSFACI= 0
##$ASSFACX= 0
##$ASSWID= 0
##$AUNMP= <proc_1d>
##$AZFE= 0.1
##$AZFW= 0.1
##$BCFW= 0
##$BC_mod= 0
##$BYTORDP= 0
##$COROFFS= 0
##$CY= 12.5
##$DATMOD= 1
##$DC= 0
##$DFILT= <>
##$DTYPP= 0
##$F1P= 14.0000005364418
##$F2P= -0.99999901652339
##$FCOR= 0.5
##$FTSIZE= 32768
##$FT_mod= 6
##$GAMMA= 0
##$GB= 0
##$INTBC= 1
##$INTSCL= 1
##$ISEN= 128
##$LB= 0.3
##$LEV0= 0
##$LPBIN= 0
##$MAXI= 10000
##$MC2= 0
##$MEAN= 0
##$ME_mod= 0
##$MI= 0
##$NCOEF= 0
##$NC_proc= -5
##$NLEV= 6
##$NOISF1= 0
##$NOISF2= 0
##$NSP= 0
##$NTH_PI= 0
##$NZP= 0
##$OFFSET= 16.52784
##$PC= 1
##$PHC0= 223.5445
##$PHC1= 5.458081
##$PH_mod= 1
##$PKNL= yes
##$PPARMOD= 0
##$PSCAL= 4
##$PSIGN= 0
##$REVERSE= no
##$SF= 250.129998539233
##$SI= 32768
##$SIGF1= 0
##$SIGF2= 0
##$SINO= 400
##$SIOLD= 32768
##$SREGLST= <1H.CDCl3>
##$SSB= 0
##$STSI= 32768
##$STSR= 0
##$SW_p= 5175.98343685301
##$SYMM= 0
##$S_DEV= 0
##$TDeff= 65536
##$TDoff= 0
##$TI= <Analysis number 999999
Compound Code 99
Book Reference 9
Project Code 9>
##$TILT= no
##$TM1= 0
##$TM2= 0
##$TOPLEV= 0
##$USERP1= <user>
##$USERP2= <user>
##$USERP3= <user>
##$USERP4= <user>
##$USERP5= <user>
##$WDW= 1
##$XDIM= 32768
##$YMAX_p= 339572548
##$YMIN_p= -216839
$$ End of Bruker specific parameters
$$ ---------------------------------
##NTUPLES= NMR SPECTRUM
##VAR_NAME=  FREQUENCY,     SPECTRUM/REAL,   SPECTRUM/IMAG
##SYMBOL=    X,             R,               I
##VAR_TYPE=  INDEPENDENT,   DEPENDENT,       DEPENDENT
##VAR_FORM=  AFFN,          ASDF,            ASDF
##VAR_DIM=   32768,         32768,           32768
##UNITS=     HZ,            ARBITRARY UNITS, ARBITRARY UNITS
##FACTOR=    0.157963299565203, 1,           1
##FIRST=     4134.10851017369, 0,            0
##LAST=      -1041.87492667932, 0,           0
##MIN=       -1041.87492667932, -216839,     0
##MAX=       4134.10851017369, 339572548,    0
$$ Real data points
##PAGE= N=1
##DATA TABLE= (X++(R..R)), XYDATA
$$ [...]
$$ plain form
29147 11262 -26521 -29273 -35800 -21244 -55300 -109587 -72607 -44817 -25541 -20879 -75941 -41272
29135 -41272 -15400 -45120 5438 18357 22930 35064 -23210 -18992 -25159 -30976 -32480 35575 53125
29122 53125 10022 -47642 -91684 -84815 -37240 -31489 -31521 -17713 -10720 -22020 1322 23597 -18291
29109 -18291 -22362 -18176 29381 -21243 -32868 -1816 58215 65907 71832 79828 122940 99089 51725
29096 51725 25764 54742 45840 24173 27484 66478 72599 79035 103738 117986 145066 116768
29084 116768 83088 60091 86415 82066 30868 -13346 -61618 -62024 -8759 31241 -34689 -117755
29072 -117755 -121726 -83670 -23981 -3039 11659 26627 39538 13927 29039 71218 80796 71323
29060 71323 94731 114579 42849 692 2531 -6160 -41178 -35292 12412 13694 22550 -5395 -7912
$$ packed form
29147A1262l7783k752o527J4556l4056n4287L6980K7790J9276M662n5062L4669
29135d1272K5872k9720N0558J2919M573J2134n8274M218o167n817j504O8055J7550
29122E3125m3103n7664m4042O869M7575N751l2J3808O993j1300K3342K2275m1888
29109a8291m071M186M7557n0624j1625L1052O0031P692N925P996M3112k3851m7364
29096E1725k5961K8978q902k1667L311L8994O121O436K4703J4248K7080k8298
29084A16768l3680k2997K6324m349n1198m4214m8272m06N3265M0000o5930q3066
29072a17755l971L8056N9689K0942J4698J4968J2911k5611J5112M2179R578r473
29060G1323K3408J9848p1730m2157J839q691l5018N886M7704J282Q856k7945k517
$$ plain form
29047 -7912 35090 26705 26089 45251 123287 112506 62290 46455 31121 31030 23715 -10318 21055
29034 21055 39916 44938 32748 55210 27403 -22341 9353 12114 -16215 29433 66851 9658
29022 9658 10973 88658 49293 45460 22056 40972 59684 23867 33484 24196 29321 56480 37587
29009 37587 20763 13684 44054 24981 18587 -9511 336 -1560 -1192 -23417 -8459 5692 65997
28996 65997 88334 43956 -11503 -56763 -49748 -14062 48298 37534 18995 27657 16878 20044
28984 20044 27342 43198 39544 45544 66080 50665 55899 89416 95052 53932 18288 35314 64968
28971 64968 20041 -18824 -52177 -36434 -35661 128 40049 67851 26972 -68757 -143390 -94774
28959 -94774 -73756 -104150 -63830 -41388 -11609 18053 39686 22100 6392 -20390 1289 36003
$$ packed form
29047g912M3002q385o16J9162P8036j0781n0216j5835j5334r1p315l4033L1373
29034B1055J8861N022j2190K2462k7807m9744L1694K761k8329M5648L7418n7193
29022I658J315P7685l9365l833k3404J8916J8712l5817R617r288N125K7159j8893
29009C7587j6824p079L0370j9073o394k8098R847j896L68k2225J4958J4151O0305
28996F5997K2337m4378n5459m5260P015L5686O2360j0764j8539Q662j0779L166
28984B0044P298J5856l654O000K0536j5415N234L3517N636m1120l5644J7026K9654
28971F4968m4927l8865l3353J5743P73L5789L9921K7802m0879r5729p4633M8616
28959i4774K1018l0394M0320K2442K9779K9662K1633j7586j5708k6782K1679L4714
$$ plain form
28947 36003 133097 127786 49624 9614 43643 57152 39628 3117 -42146 -40226 -27067 -52313
28935 -52313 -26888 10244 -53804 -82499 -52535 41394 92164 5002 -87611 -118001 -142919 -105537
28923 -105537 -65815 -8612 44961 36903 32814 -21826 1792 65209 60469 61133 18905 -9501
28911 -9501 -53217 -63510 28567 71161 44767 7290 -7881 14279 21120 -9668 -27785 -21492
28899 -21492 20765 38382 4466 -10568 16787 -16460 -13622 37239 50138 47659 101911 90831
28887 90831 76038 72741 90188 105155 29964 -921 -34189 -23633 3301 -40451 23958 32613
28875 32613 7458 10278 -23588 -44800 -48101 -38535 -6410 -13706 -6334 -16876 -6558 12879 39595
28862 39595 71684 83755 16648 36498 27546 -13182 -47957 -65588 -46142 -22019 -10036 -34486
$$ packed form
28947C6003R7094n311p8162m0010L4029J3509j7524l6511m5263J920J3159k5246
28935e2313K5425L7132o4048k8695K9964R3929N0770q7162r2613l0390k4918L7382
28923a05537L9722N7203N3573q058m089n4640K3618O3417m740O64m2228k8406
28911i501m3716j0293R2077M2594k6394l7477j5171K2160O841l0788j8117O293
28899b1492M2257J7617l3916j5034K7355l3247K838N0861J2899k479N4252j1080
28887I0831j4793l297J7447J4967p5191l0885l3268J0556K6934m3752O4409Q655
28875C2613k5155K820l3866k1212l301R566L2125p296P372j0542J0318J9437K6716
28862C9595L2089J2071o7107J9850q952m0728l4775j7631J9446K4123J1983k4450
$$ plain form
28850 -34486 -93964 -59897 -10080 56518 67350 67545 87153 62987 59265 86070 116340 28867
28838 28867 -36604 -51976 -86793 -56061 -53017 -35362 -12938 29439 -10637 -62540 -92536 -51602
28826 -51602 -12360 69085 118793 81851 47299 23335 3395 -29026 -1976 -23903 -26139 -13129
28814 -13129 26795 23694 -11396 -12335 -30824 -10436 -12534 8467 32659 -29433 -91683 -66794
28802 -66794 -39053 -36003 -70849 -34999 35389 62971 52534 85087 84984 80640 21973 8727
28790 8727 -376 2052 6008 5676 17615 63479 8758 28581 31870 62344 39644 19365 75705
28777 75705 83080 25141 14676 26180 44709 36426 9639 484 34898 24346 -5831 -49515
28765 -49515 -64832 -36034 -16849 -57970 -22718 4272 -21703 -12869 -30575 -67982 -75058 -57553
$$ packed form
28850c4486n9478L4067M9817O6598J0832J95J9608k4166l722K6805L0270q7473
28838B8867o5471j5372l4817L0732L044J7655K2424M2377m0076n1903k9996M0934
28826e1602L9242Q1445M9708l6942l4552k3964j9940l2421K7050k1927k236J3010
28814a3129L9924l101l5090r39j8489K0388k098K1001K4192o2092o2250K4889
28802f6794K7741L050l4846L5850P0388K7582j0437L2553j03m344n8667j3246
28790H727r103K428L956l32J1939M5864n4721J9823L289L0474k2700k0279N6340
28777G5705P375n7939j0465J1504J8529q283k6787r155L4414j0552l0177m3684
28765d9515j5317K8798J9185m1121L5252K6990k5975Q834j7706l7407p076J7505
$$ plain form
28753 -57553 -88587 -59903 -5499 2659 288 47520 43432 58006 38883 32722 16889 6454
28741 6454 1145 25176 12276 -14234 -29452 -29884 25177 6747 -19038 -4574 -15670 -27111
28729 -27111 -38289 -32937 10 45893 48310 85630 71605 51596 44962 2245 -76672 -124936
28717 -124936 -123355 -123063 -83212 -85222 -94752 -50852 -23226 -7869 -24877 -24460 12087 51161 5109
28704 5109 -63454 -82993 -42577 21804 52515 26482 17897 42866 16757 64091 93401 58591
28692 58591 31710 24287 21172 35738 29852 35837 3005 17590 6448 -35435 -65241 -73690 -40116
28679 -40116 2556 31052 -32483 15966 38363 29137 34949 16682 2621 -12209 -22564 -5432
28667 -5432 -19341 -61634 -56105 -4628 52313 29258 -3148 -51265 -75601 -88445 -37475 28323
$$ packed form
28753e7553l1034K8684N4404Q158k371M7232m088J4574j9123o161j5833j0435
28741F454n309K4031j2900k6510j5218m32N5061j8430k5785J4464j1096j1441
28729b7111j1178N352L2947M5883K417L7320j4025k0009o634m2717p8917m8264
28717a24936J581K92L9851k010r530M3900K7626J5357j7008M17L6547L9074m6052
28704E109o8563j9539M0416O4381L0711k6033q585K4969k6109M7334K9310l4810
28692E8591k6881p423l115J4566n886N985l2832J4585j1142m1883k9806q449L3574
28679d0116M2672K8496o3535M8449K2397r226N812j8267j4061j4830j0355J7132
28667e432j3909m2293N529N1477N6941k3055l2406m8117k4336j2844N0970O5798
$$ plain form
28655 28323 22812 12902 35399 -20478 -13571 -48585 -85306 -35670 16638 10325 22961 -40042
28643 -40042 15637 47592 77983 37685 -14139 13225 6908 -34707 -11550 48882 86458 50162
28631 50162 -3516 7426 11007 -11623 28110 41354 27833 4027 1466 33706 17270 33032
28619 33032 -7941 -27862 -24122 -10911 7440 16949 41653 45049 3396 -62803 -76354 -20547
28607 -20547 -13218 -25415 11553 19585 -23114 -34900 -43379 -56579 -56357 38500 59779 22968 19565
28594 19565 -9442 27266 -13815 5026 -22046 20875 18549 -351 4617 16374 49652 5801
28582 5801 21281 49791 70499 17142 -26941 -63136 -37768 19377 45203 10044 502 -13245
28570 -13245 12493 102730 119210 73897 16307 3490 -44234 -62777 -35601 -26916 -31665 -19828
$$ packed form
28655B8323n511r910K2497n5877O907l5014l6721M9636N2308o313J2636o3003
28643d0042N5679L1955L0391m0298n1824K7364o317m1615K3157O0432L7576l6296
28631E0162n3678J0942L581k2630L9733J3244j3521k3806k561L2240j6436J5762
28619C3032m0973j9921L740J3211J8351R509K4704L396m1653o6199j3551N5807
28607b0547P329j2197L6968Q032m2699j1786q479j3200K22R4857K1279l6811l403
28594A9565k9007L6708m1081J8841k7072M2921k326j8900M968J1757L3278m3851
28582E801J5480K8510K0708n3357m4083l6195K5368N7145K5826l5159r542j3747
28570a3245K5738R0237J6480m5313n7590j2817m7724j8543K7176Q685m749J1837
$$ plain form
28558 -19828 13024 28569 -7857 -44813 -30827 -14111 -7729 23820 7322 -14885 5305 22138
28546 22138 31078 24666 19119 -30871 -16077 32036 70395 108068 106907 12862 -63542 -89831
28534 -89831 -12931 56154 36575 61720 113635 27911 11603 26418 80931 85540 17015 -21351
28522 -21351 -54778 -46979 -22855 493 -14537 17670 38295 7468 -47031 -46067 -68950 -86668
28510 -86668 -77760 -41534 -25283 -31006 -83833 -91552 -50676 -47236 -22210 -59380 -70376 -25293
28498 -25293 2235 34429 61983 103399 166746 214962 116632 7160 -43 31046 39570 -2421
28486 -2421 -10459 -52714 -108773 -91168 -31172 8826 29684 9622 35983 -20376 -28783 -23613
28474 -23613 -14838 22161 19597 12171 -16631 -76388 -75915 -78985 -12838 8513 41415 24145 -21000
$$ packed form
28558a9828L2852J5545l6426l6956J3986J6716O382L1549j6498k2207K0190J6833
28546B2138Q940o412n547m9990J4794M8113L8359L7673j161r4045p6404k6289
28534h9831P6900O9085j9579K5145N1915q5724j6308J4815N4513M609o8525l8366
28522b1351l3427P799K4124K3348j5030L2207K0625l0827n4499R64k2883j7718
28510h6668Q908L6226J6251n723n2827p719M0876L440K5026l7170j0996M5083
28498b5293K7528L2194K7554M1416O3347M8216r8330j09472p203L1089Q524m1991
28486b421q038m2255n6059J7605N9996L9998K0858k0062K6361n6359q407N170
28474b3613Q775L6999k564p426k8802n9757M73l070O6147K1351L2902j7270m5145
$$ plain form
28461 -21000 -12629 6022 -23917 -31219 -60753 -86538 -55234 -46444 -33317 -4609 72969 51173
28449 51173 41107 63298 76420 67202 7354 -42671 -112168 -106373 -40470 -40049 -59589 2454
28437 2454 85131 106584 56167 17669 -15436 -54777 -68219 -4545 4401 29218 46887 -588
28425 -588 13872 123563 135894 118863 98554 54652 70351 42565 253 -37517 -27392 -48142
28413 -48142 -75096 -86834 -109425 -57499 -23839 -2657 -44886 -142 35675 25156 -13445 -58737
28401 -58737 -53340 -45342 -17502 -16956 33388 76125 57055 24657 31453 108969 148126 135801 98247
28388 98247 10100 -51562 -22770 -27849 -18951 22559 27104 11731 4333 -28358 -36500 -21251 -14568
28375 -14568 38363 63976 102509 41551 -16649 10907 39822 39001 3740 -18177 15360 14376
$$ packed form
28461b1000Q371J8651k9939p302k9534k5785L1304Q790J3127K8708P7578k1796
28449E1173j0066K2191J3122r218n9848n0025o9497N795O5903M21j9540O2043
28437B454Q2677K1453n0417l8498l3105l9341j3442O3674Q946K4817J7669m7475
28425e88J4460J09691J2331j7031k0309m3902J5699k7786m2312l7770J0125k0750
28413d8142k6954j1738k2591N1926L3660K1182m2229M4744L5817j0519l8601m5292
28401e8737N397P998K7840N46N0344M2737j9070l2398O796P7516L9157j2325l7554
28388I8247q8147o1662K8792n079Q898M1510M545j5373p398l2691q142J5249O683
28375a4568N2931K5613L8533o0958n8200K7556K8915q21l5261k1917L3537r84
$$ plain form
28363 14376 -8630 -37163 -111808 -129705 -66639 20616 71502 83340 46630 10912 5782 5678
28351 5678 -42995 -71893 -77547 -68120 -37296 -21695 -32947 -35581 -31784 -24239 -20637 -8228 10198
28338 10198 14612 37325 62099 51621 4330 475 31740 -563 -98267 -111910 -109658 2568
28326 2568 78258 140311 87577 67619 12887 -20993 -17927 1494 -15264 -17202 -6656 14487
28314 14487 11868 22222 63224 93011 78813 69344 15893 -15992 -1428 -4607 -50622 -74831
28302 -74831 -21394 11435 65184 102203 44441 47788 25636 -46302 -34230 47141 47776 21353
28290 21353 -3306 -67708 -85750 -52682 -36752 -14136 -80320 -108478 -82732 -82766 -49034 -101578
28278 -101578 -132647 -137677 -75889 11100 61607 55685 7162 30464 41328 69887 30286 30833
$$ packed form
28363A4376k3006k8533p4645j7897O3066Q7255N0886J1838l6710l5718n130j04
28351E678m8673k8898n654R427L0824J5601j1252k634L797P545L602J2409J8426
28338A0198M414K2713K4774j0478m7291l855L1265l2303r7704j3643K252J12226
28326B568P5690O2053n2734j9958n4732l3880L066J9421j6758j938J0546K1143
28314A4487k619J0354M1002K9787j4198r469n3451l1885J4564l179m6015k4209
28302g4831N3437L2829N3749L7019n7762L347k2152p1938J2072Q1371O35k6423
28290B1353k4659o4402j8042L3068J5930K2616o6184k8158K5746l4L3732n2544
28278a01578l1069n030O1788Q6989N0507n922m8523K3302J0864K8559l9601N47
$$ plain form
28266 30833 87500 97674 63579 -7665 11537 -20547 -61733 -82295 -42639 -17288 -35796 -68913
28254 -68913 -70218 -33145 -17996 25351 16176 41770 40518 -8986 6974 11019 -20124 -32443
28242 -32443 -68681 -34968 34786 71413 96037 120256 84851 90013 86153 118379 94746 82371
28230 82371 78779 32727 35049 18555 25422 40546 20156 -20867 -29375 -5916 -21840 -13060 8233
28217 8233 60272 29904 9118 -29813 -32241 -65304 -59854 -4500 35377 89619 64188 28180
28205 28180 -24179 -49006 -67898 -79143 -104051 -79531 -70528 -61297 -31794 -32814 -39269 -1808
28193 -1808 48719 90250 99665 106250 90932 28745 -25054 6005 39057 48035 29047 -963
28181 -963 -28865 -35087 -29062 -60417 -21948 21595 8304 -19744 -14225 -76345 -93222 -56085 7140
$$ packed form
28266C0833N6667J0174l4095p1244J9202l2084m1186k0562L9656K5351j8508l3117
28254f8913j305L7073J5149M3347r175K5594j252m9504J5960M045l1143j2319
28242c2443l6238L3713O9754L6627K4624K4219l5405N162l860L2226k3633j2375
28230H2371l592m6052K322j6494O867J5124k0390m1023q508K3459j5924Q780K1293
28217H233N2039l0368k0786l8931k428l3063N450N5354L9877N4242k5431l6008
28205B8180n2359k4827j8892j1245k4908K4520R003R231K9503j020o455L7461
28193a808N0527M1531R415O585j5318o2187n3799L1059L3052Q978j8988l0010
28181i63k7902o222O025l1355L8469M3543j3291k8048N519o2120j6877L7137O3225
$$ plain form
28168 7140 110012 142263 90345 51400 42474 80581 129805 94434 64319 -19674 -106881 -43842
28156 -43842 -33601 -11955 37850 29674 20096 -33434 -71489 -32361 6313 -20988 -67618 -68061
28144 -68061 -47353 -12277 -4593 -21338 -80680 -42911 -346 47687 58670 28033 36200 -16211
28132 -16211 -48311 -8849 14376 54755 10035 31443 -44589 -87426 -40217 -23747 -36615 -27696
28120 -27696 -5927 4781 21105 50847 41569 43504 7317 -12450 -53326 -44129 -9065 19201
28108 19201 -12851 -80146 -61832 4602 -22581 -9957 37916 -20929 -46053 -31004 -41425 -34681
28096 -34681 24413 37865 -5532 -18723 20403 5994 -15165 49598 102812 110646 84220 4322
28084 4322 -39140 69957 153195 148620 95468 -12866 -19796 29754 68732 94065 39864 10272
$$ packed form
28168G140J02872L2251n1918l8945q926L8107M9224l5371l0115q3993q7207O3039
28156d3842J0241K1646M9805q176r578n3530l8055L9128L8674k7301m6630m43
28144f8061K0708L5076P684j6745n9342L7769M2565M8033J0983l0637Q167n2411
28132a6211l2100L9462K3225M0379m4720K1408p6032m2837M7209J6470j2868Q919
28120b7696K1769J0708J6324K9742r278J935l6187j9767m0876R197L5064K8266
28108A9201l2052o7295J8314O6434k7183J2624M7873n8845k5124J5049j0421O744
28096c4681N9094J3452m3397j3191L9126j4409k1159O4763N3214P834k6426p9898
28084D322m3462J09097Q3238m575n3152j08334o930M9550L8978K5333n4201k9592
$$ plain form
28072 10272 -4978 74236 63058 31615 45259 24559 64650 33041 5706 6158 -32298 -41373
28060 -41373 -25785 -12794 -27685 -25834 -10600 -57015 -25961 -232 10673 20249 14326 8931
28048 8931 13761 -23222 64822 129776 177988 184858 121043 78438 104067 76041 61869 24694
28036 24694 8317 22929 80227 40643 17697 41877 37659 26068 -43047 -38156 44732 74602
28024 74602 88618 72498 57129 64692 74355 59773 80576 94692 54178 -24465 -38106 -21997
28012 -21997 44526 43420 -60456 -81593 -48869 -12980 -43134 -90641 -35623 29231 23783 9169
28000 9169 34481 52127 8837 1506 43830 35055 22275 7697 39045 27910 52630 57416
27988 57416 26292 10031 51786 61063 15834 -56808 -37879 -9899 -58241 -65296 -103989 -95864
$$ packed form
28072A0272j5250P9214j1178l1443J3644k0700M0091l1609k7335M52l8456r075
28060d1373J5588J2991j4891J851J5234m6415L1054K5729J0905R576n923n395
28048H931M830l6983Q8044O4954M8212O870o3815m2605K5629k8026j4172l7175
28036B4694j6377J4612N7298l9584k2946K4180m218j1591o9115M891Q2888K9870
28024G4602J4016j6120j5369P563R663j4582K0803J4116m0514p8643j3641J6109
28012b1997O6523j106j03876k1137L2724L5889l0154m7507N5018O4854n448j4614
28000I169K5312J7646m3290p331M2324q775j2780j4578L1348j1135K4720M786
27988E7416l1124j6261M1755R277m5229p2642J8929K7980m8342p055l8693Q125
$$ plain form
27976 -95864 -72809 -67958 -50435 -70337 -43721 -37437 -2906 26316 60810 63439 33724 -15611
27964 -15611 -96303 -100208 -15923 47386 -9936 -15393 31804 -21015 -88410 -70226 -49826 -71893
27952 -71893 -56103 7554 31653 11038 61778 69576 28995 52238 20308 7057 4687 9843
27940 9843 27878 -20978 -37303 -2837 -27004 -35420 -34000 -30828 -33477 -41222 -68986 -48755 -63939
27927 -63939 -73677 -82613 -75907 -65475 -31063 -22172 -3770 38378 67821 58595 6678 -40153 18879
27914 18879 88596 112375 90887 35671 24913 35144 55241 74752 93996 92270 52559 47444
27902 47444 38044 -41904 -114808 -62382 25845 -29876 -16021 -4425 -6812 -24765 -42924 -33948
27890 -33948 -30628 -59130 -11648 7682 -35512 -68855 -49030 -24689 -27245 -4284 -31759 -56331
$$ packed form
27976i5864K3055M851J7523j9902K6616O284L4531K9222L4494K629k9715m9335
27964a5611q0692l905Q4285O3309n7322n457M7197n2819o7395J8184K0400k2067
27952g1893J5790O3657K4099k0615N0740P798m0581K3243l1930j3251k370N156
27940I843J8035m8856j6325L4466k4167q416J420L172k649p745k7764K0231j5184
27927f3939r738q936O706J0432L4412Q891J8402M2148K9443r226n1917m6831N9032
27914A8879O9717K3779k1488n5216j0758J0231K0097J9511J9244j726l9711n115
27902D7444r400p9948p2904N2426Q8227n5721J3855J1596k387j7953j8159Q976
27890c3948L320k8502M7482J9330m3194l3343J9825K4341k556K2961k7475k4572
$$ plain form
27878 -56331 -50212 -41407 -9693 49464 61762 36331 52750 80059 94541 65255 35269 1536
27866 1536 -27989 13163 94706 57464 35810 37561 21247 10654 31140 -15185 -20927 -36747
27854 -36747 23419 10831 7247 12303 16165 28707 57225 54678 14480 -22155 -9608 5859
27842 5859 3577 -44406 -24641 14971 85561 112881 85046 47154 35861 46238 -18068 -16458
27830 -16458 -28731 -22988 35371 40786 44112 57350 77723 46908 29877 57358 118878 83790
27818 83790 84207 132797 95555 22259 5354 -4804 -12079 -11049 -23988 16820 14964 -22842 -21724
27805 -21724 3316 -8673 430 24039 12784 -28709 -40874 -40869 -9629 10719 47890 79849 62938
27792 62938 40449 15162 -16142 -32102 -33252 7210 24897 29486 -40709 -54915 -37243 -26330
$$ packed form
27878e6331O119Q805L1714N9157J2298k5431J6419K7309J4482k9286k9986l3733
27866A536k9525M1152Q1543l7242k1654J751j6314j0593K0486m6325n742j5820
27854c6747O0166j2588l584N056L862J2542K8518k547m0198l6635J2547J5467
27842E859k282m7983J9765L9612P0590K7320k7835l7892j1293J0377o4306J610
27830a6458j2273N743N8359N415L326J3238K0373l0815j7031K7481O1520l5088
27818H3790M17M8590l7242p3296j6905j0158p275J030j2939M0808j856l7806J118
27805b1724K5040j1989R103K3609j1255m1493j2165NL1240K0348L7171L1959j6911
27792F2938k2489k5287l1304j5960j150M0462J7687M589p0195j4206J7672J0913
$$ plain form
27780 -26330 9904 -13737 -54655 -49641 -12005 9211 19371 -8677 -31110 -27215 6397 22873
27768 22873 18498 -1266 -28474 11683 52194 -9956 -72901 -46774 31664 83115 79014 86077
27756 86077 53634 87415 36531 -24127 -61275 -36440 -31279 -52817 -34381 -34025 -30017 -19950
27744 -19950 11383 192 -16247 -17707 -27969 -22115 -40613 -7188 -45981 -73148 -36013 -34692
27732 -34692 -41071 -70099 -47109 -6755 3969 15733 13582 25357 -499 -53076 -25174 10645
27720 10645 -12148 -47317 -86127 -76590 -92346 -119633 -90401 -82688 -33423 -39895 -27174 50315
27708 50315 42641 -10899 -25447 -28018 12685 8615 17637 18387 -31391 -84790 -77648 -7616 74785
27695 74785 72760 9498 -34800 28581 52103 37442 8553 -47290 -34746 8549 22111 40210
$$ packed form
27780b6330L6234k3641m0918N014L7636K1216J0160k8048k2433L895L3612J6476
27768B2873m375j9764k7208M0157M0511o2150o2945K6127P8438N1451m101P063
27756H6077l2443L3781n0884o0658l7148K4835N161k1538J8436L56M008J0067
27744a9950L1333j1191j6439j460j0262N854j8498L3425l8793k7167L7135J321
27732c4692o379k9028K2990M0354J0724J1764k151J1775k5856n2577K7902L5819
27720A0645k2793l5169l8810R537j5756k7287K9232P713M9265o472J2721P7489
27708E0315p674n3540j4548k571M0703m070R022P50m9778n3399P142P0032Q2401
27695G4785k025o3262m4298O3381K3522j4661k8889n5843J2544M3295J3562J8099
$$ plain form
27683 40210 92873 86716 77034 44079 57907 63644 22979 35898 16387 -2134 -18701 -11562
27671 -11562 -9541 -38135 -64584 -43380 -97472 -144399 -109284 -72579 -64437 -61906 -45451 7995
27659 7995 10379 12064 3148 -21321 -45790 -4032 9925 -15318 -14557 24822 13225 -55207 -71369
27646 -71369 -68987 -35759 -42981 -61633 -49516 -9510 21481 69201 40439 -44928 -28728 17880
27634 17880 25114 4860 -2680 18330 -22702 -47417 -30699 -52920 -2832 64368 110917 79797
27622 79797 30676 5529 21065 -2025 -15795 -1585 20176 -29358 -1589 8449 -38086 -85328
27610 -85328 -45980 -12787 -44957 -67719 -85724 -128066 -85514 -4458 43450 72269 25910 -20953
27598 -20953 -69111 -78026 -34901 7864 15248 -8357 -2008 4437 23357 32341 79457 44875 31782
$$ packed form
27683D0210N2663o157r682l2955J3828N737m0665J2919j9511j8521j6567P139
27671a1562K021k8594k6449K1204n4092m6927L5115L6705Q142K531J6455N3446
27659G995K384J685q916k4469k4469M1758J3957k5243P61L9379j1597o8432j6162
27646g1369K382L3228p222j8652J2117M0006L0991M7720k8762q5367J6200M6608
27634A7880P234k0254p540K1010m1032k4715J6718k2221N0088O7200M6549l1120
27622G9797m9121k5147J5536k3090j3770J4210K1761m9534K7769J0038m6535m7242
27610h5328L9348L3193l2170k2762j8005m2342M2552Q1056M7908K8819m6359m6863
27598b0953m8158q915M3125M2765P384k3605O349O445J8920Q984M7116l4582j3093
$$ plain form
27585 31782 -1394 8599 13428 22698 65208 85096 57597 20701 32332 27193 24290 -23377 -50002
27572 -50002 -79679 -99245 -104448 -62578 -21622 -2119 -1406 -2703 -10709 -3489 -1513 2666 -751
27559 -751 -7268 -34214 -45146 -64578 -21760 -17839 3920 12663 -17188 -71319 -45578 -19882 4701
27546 4701 13422 64082 74104 15901 21592 -24710 -63142 -68644 -26518 79165 104719 90746
27534 90746 67665 70405 38820 31845 15552 -2471 -24176 -40742 -48954 -58875 -6559 -12404 -27137
27521 -27137 -44044 -56195 25285 53992 55097 40960 -17779 -69612 -33493 -3946 -12101 24716
27509 24716 68583 86776 65258 52337 69379 32435 11725 -17372 -61182 -54960 -45587 -34325
27497 -34325 -29655 -29276 -32217 -95043 -131763 -97442 -78498 -59335 -62644 -61397 -42057 -16502 23422
$$ packed form
27585C1782l3176R993M829R270M2510J9888k7499l6896J1631n139k903m7667k6625
27572e0002k9677j9566n203M1870M0956J9503P13j297q006P220J976M179l417
27559g51o517k6946j0932j9432M2818L921K1759Q743k9851n4131K5741K5696K4583
27546D701Q721N0660J0022n8203N691m6302l8432n502M2126J05683K5554j3973
27534I0746k3081K740l1585o975j6293j8023k1705j6566q212r921N2316n845j4733
27521b7137j6907j2151Q1480K8707J105j4137n8739n1833L6119K9547q155L6817
27509B4716M3867J8193k1518j2921J7042l6944k0710k9097m3810O222R373J1262
27497c4325M670L79k941o2826l6720L4321J8944J9163l309J247J9340K5555L9924
$$ plain form
27484 23422 54710 98136 81062 40101 55730 103134 68002 54598 64109 49058 33899 -8034
27472 -8034 -53430 -11048 18091 -20610 -7533 -34157 -19144 2015 15830 -21153 14591 116135
27460 116135 103968 66842 35689 23978 9044 27522 -5361 -4200 1033 -1447 8603 40373
27448 40373 86338 113926 113808 99619 -26536 -47858 -17994 5021 53692 58588 24072 32563
27436 32563 105604 105539 65108 59848 29712 -45980 -64194 -60852 -21186 20701 26844 29666 53620
27423 53620 87547 64733 38693 14412 15148 -42687 -48389 -4189 34470 68161 40475 8522
27411 8522 5484 -18561 -65238 -105564 -73071 -32933 -13014 -10672 717 -13485 13082 -1263
27399 -1263 -6073 39045 56040 46756 46737 39294 66157 60225 11041 14086 22079 15995 3191 -40950
$$ packed form
27484B3422L1288M3426j7074m0961J5629M7404l5132j3404R511j5051j5159m1933
27472h034m5396M2382K9139l8701J3077k6624J5013K1159J3815l6983L5744J01544
27460A16135j2167l7126l1153j1711j4934J8478l2883J161N233k480J0050L1770
27448D0373M5965K7588j18j4189j26155k1322K9864K3015M8671M896l4516Q491
27436C2563P3041o5m0431n260l0136p5692j8214L342L9666M1887O143K822K3954
27423E3620L3927k2814k6040k4281P36n7835n702M4200L8659L3691k7686l1953
27411H522l038k4045m6677m0326L2493M0138J9919K342J1389j4202K6567j4345
27399a263m810M5118J6995r284j9p443K6863n932m9184L045P993o084j2804m4141
$$ plain form
27385 -40950 -128147 -175062 -131145 -79250 -30973 20860 27074 69392 92427 115854 100419 48857
27373 48857 72218 103850 70636 27595 14965 -324 -24075 6510 54381 48775 33396 64360
27361 64360 17175 -20801 -29540 -8485 14083 11849 -15093 -89430 -85541 -67817 -65542 -83301
27349 -83301 -94750 -38330 -50749 -19307 20746 -5328 7323 7820 41197 111752 97972 119785
27337 119785 88906 77677 112449 68337 22599 3324 -15578 9145 19858 -28682 -46095
27326 -46095 -17216 -27110 -45228 -48669 -60437 -32491 28184 76392 85942 58988 14282 -29371
27314 -29371 -99283 -92218 -81675 -49444 -59066 -30197 15232 10221 -6702 3795 45427 14255
27302 14255 4355 -9198 -65148 18970 47834 66578 50395 25641 34611 575 21354 32069
$$ packed form
27385d0950q7197m6915M3917N1895M8277N1833O214M2318K3035K3427j5435n1562
27373D8857K3361L1632l3214m3041j2630j5289k3751L0585M7871n606j5379L0964
27361F4360m7185l7976q739K1055K2568k234k6942p4337L889J7724K275j7759
27349h3301j1449N6420j2419L1442M0053k6074J2651M97L3377P0555j3780K1813
27337A19785l0879j1229L4772m4112m5738j9275j8902K4723J0713m8540j7413
27326d6095K8879r894j8118l441j1768K7946O0675M8208R550k6954m4706m3653
27314b9371o9912P065J0543L2231r622K8869M5429n011j6923J0497M1632l1172
27302A4255r900j3553n5950Q4118K8864J8744j6183k4754Q970l4036K0779J0715
$$ plain form
27290 32069 18238 35783 11180 42038 60325 22895 -10797 -49236 -66391 -13517 -30601 -77460
27278 -77460 -97121 -75574 -58644 -59005 -37745 -48576 -16220 -16688 -58342 -46682 -57970 -16619
27266 -16619 -5063 1860 31947 49138 27239 26651 -36244 -60507 -40391 -1265 -8108 19987
27254 19987 16337 24786 -5860 42852 34010 2156 19878 10495 13179 12566 35338 27001 30039
27241 30039 17309 74692 80587 58129 56254 102998 87816 59241 -19525 -58311 -56127 -29736
27229 -29736 23682 18816 -19375 7283 62555 32506 54865 86359 29101 3067 5060 -13418
27217 -13418 -40318 -46745 -6471 36145 35534 37683 -10520 -54891 -59183 -37700 -4195 -20824 -48151
27204 -48151 15410 34965 -3886 -24766 24076 54693 50779 39779 50735 44269 9071 25735
$$ packed form
27290C2069j3831J7545k4603L0858J8287l7430l3692l8439j7155N2874j7084m6859
27278g7460j9661K1547J6930l61K1260j0831L2356m68m1654J1660j1288M1351
27266a6619J1556O923L0087J7191k1899n88o2895k4263K0116L9126o843K8095
27254A9987l650Q449l0646M8712q842l1854J7722r383K684o13K2772q337L038
27241C0039j2730N7383N895k2458j875M6744j5182k8575p8766l8786K184K6391
27229b9736N3418m866l8191K6658N5272l0049K2359L1494n7258k6034J993j8478
27217a3418k6900o427M0274M2616o11K149m8203m4371m292K1483L3505j6629k7327
27204d8151O3561J9555l8851k0880M8842L0617l914j1000J0956o466l5198J6664
$$ plain form
27192 25735 21006 -33242 -24425 34053 65028 -1986 -66380 -33049 48381 35558 -24191 -5037
27180 -5037 -3702 -60985 -60107 -54186 -26683 -3138 4179 5177 5803 -143 -49459 -82251 -118129 -95950
27166 -95950 -67610 -18099 -15319 -6247 -28987 -10349 30196 -3941 -12546 -34517 -13120 38962
27154 38962 19271 -26638 3925 18051 69610 81781 102080 78399 2970 -19612 -39580 -29155
27142 -29155 -43498 -10341 24076 11728 -15022 5248 7097 29045 14325 -35364 -48134 -9511
27130 -9511 27866 -17058 -56161 -20120 -1753 26826 47682 73089 55553 48455 19054 34398
27118 34398 84666 81833 57893 3976 -15238 32592 38330 13509 41160 88130 42926 6885
27106 6885 41971 67091 62294 39745 41598 30135 -12218 -15098 14804 30651 9315 -9523
$$ packed form
27192B5735m729n4248Q817N8478L0975o7014o4394L3331Q1430j2823n9749J9154
27180e037J335n7283Q78N921K7503K3545P317R98O26n946m9316l2792l5878K2179
27166i5950K8340M9511K780R072k2740J8638M0545l4137q605k1971K1397N2082
27154C8962j9691m5909L0563J4126N1559J2171K0299k3681p5429k2582j9968J0425
27142b9155j4343L3157L4417j2348k6750K0270J849K1948j4720m9689j2770L8623
27130i511L7377m4924l9103L6041J8367K8579K0856K5407j7536p098k9401J5344
27118C4398N0268k833k3940n3917j9214M7830N738k4821K7651M6970m5204l6041
27106F885L5086K5120m797k2549J853j1463m2353k880K9902J5847k1336j8838
$$ plain form
27094 -9523 12442 20002 7970 23426 40495 2006 -1461 -21142 -35425 -51581 -49891 -21010
27082 -21010 -2253 34566 -987 35965 7476 -47573 -74345 -20112 -65863 -54874 -60237 -25793
27070 -25793 -8710 -22659 -69014 -90342 -76126 -98364 -75336 -47825 -73700 -106575 -81198 27635
27058 27635 63898 19344 -25374 -47165 -9896 3725 -28383 -76338 -50306 -32246 -7098 6311
27046 6311 -30663 -31673 -2235 5922 45328 64182 31109 6116 -12699 47317 55902 45780
27034 45780 30074 592 -19706 -9833 14016 28501 36241 20387 18219 -23274 -78793 -71830
27022 -71830 -58462 -68278 -88215 -19568 23595 47110 90027 137526 180997 136674 62217 35244
27010 35244 -31934 -9134 22428 -15046 -40098 23634 47072 60005 30453 25258 -15315 6192
$$ packed form
27094i523K1965P560j2032J5456J7069l8489l467j9681j4283j6156J690K8881
27082b1010J8757L6819l5553L6952k8489n5049k6772N4233m5751J0989n363L4444
27070b5793J7083j3949m6355k1328J4216k2238K3028K7511k5875l2875K5377J08833
27058B7635L6263m4554m4718k1791L7269J3621l2108m7955K6032J8060K5148J3409
27046F311l6974j010K9438Q157L9406J8854l3073k4993j8815O0016Q585j0122
27034D5780j5706k9482k0298R873K3849J4485P740j5854k168m1493n5519O963
27022g1830J3368r816j9937O8647M3163K3515M2917M7499M3471m4323p4457k6973
27010C5244o7178K2800L1562l7474k5052O3732K3438J2933k9552n195m0573K1507
$$ plain form
26998 6192 14765 2975 -19433 -47606 -34300 -6426 -34027 -24781 24355 43355 56648 103762
26986 103762 73802 34546 23995 4824 -13656 19050 58867 52433 15284 -23731 -35096 21075
26974 21075 309 -12299 -3799 7142 8160 66801 112749 71605 77363 69828 40760 32551 7202
26961 7202 46360 82386 47379 41187 90238 90768 55379 64033 70363 126709 131190 79126 75903
26948 75903 86782 57663 9305 3159 -37007 -59810 -70665 -2363 44129 34019 32409 34919
26936 34919 13201 -3654 14779 33819 33672 14431 -9877 -38733 -77401 -80988 -77088 -100705
26924 -100705 -133596 -135049 -59599 -47554 -56256 -37799 -45163 -38551 -14401 9048 -25796 -11446
26912 -11446 43149 21801 -23185 -3283 41504 16787 33287 82419 63726 14904 -22558 -60573
$$ packed form
26998F192Q573j1790k2408k8173J3306K7874k7601R246M9136J9000J3293M7114
26986A03762k9960l9256j0551j9171j8480L2706L9817o434l7149l9015j1365N6171
26974B1075k0766j2608Q500J0941J018N8641M5948m1144N758p535k9068q209k5349
26961G202L9158L6026l5007o192M9051N30l5389Q654O330N6346M481n2064l223
26948G5903J0879k9119m8358o146m0166k2803j0855O8302M6492j0110j610K510
26936C4919k1718j6855J8433J9040j47j9241k4308k8856l8668l587L900k3617
26924a00705l2891j453P5450J2045q702J8457p364O612K4150K3449l4844J4350
26912a1446N4595k1348m4986J9902M4787k4717J6500M9132j8693m8822l7462l8015
$$ plain form
26900 -60573 -106212 -77538 -23789 3869 -5791 20151 41787 33581 19665 19392 -41517 11205
26888 11205 -2200 -14738 -38979 -42924 -32581 -5928 -13970 18805 50485 47929 18610 -5935
26876 -5935 -20521 5905 24908 -33958 -54207 -92022 -32360 11595 8050 9149 40114 68344
26864 68344 62819 36890 35816 8823 -18864 -20057 -3833 25895 17490 -25128 -38342 1890
26852 1890 47138 34372 -35753 -50588 -65382 -69104 -49021 -63344 -69264 -5064 49848 29254
26840 29254 15352 11736 20018 34912 65544 4249 -15759 3936 -31409 -59529 -47808 -39137
26828 -39137 -6124 38725 -1218 -30207 -47622 -21602 -16558 -38223 -30641 -64190 -52512 -46119
26816 -46119 -42920 19520 19706 53111 68734 20710 16621 35382 32407 -11099 13108 58418 68831
$$ packed form
26900f0573m5639K8674N3749K7658r660K5942K1636q206j3916k73o0909N2722
26888A1205j3405j2538k4241l945J0343K6653q042L2775L1680k556k9319k4545
26876e935j4586K6426J9003n8866k0249l7815N9662M3955l545J099L0965K8230
26864F8344n525k5929j074k6993k7687j193J6224K9728q405m2618j3214M0232
26852A890M5248j2766p0125j4835j4794l722K0083j4323n920O4200N4912k0594
26840B9254j3902l616Q282J4894L0632o1295k0008J9695l5345k8120J1721Q671
26828c9137L3013M4849l9943k8989j7415K6020N044k1665P582l3549J1678O393
26816d6119L199O2440J86L3405J5623m8024m089J8761k975m3506K4207M5310J0413
$$ plain form
26803 68831 87442 38909 -9316 -30819 6628 67220 57702 -6958 -38159 -3238 44132 60139
26791 60139 50519 28441 -23814 5032 19026 71549 72197 -14283 -21226 -40477 21184 29095 45893
26778 45893 28191 12024 -1924 60314 83442 30362 589 -32067 -87649 -86705 -59132 -14537
26766 -14537 -2318 3769 32802 -9037 -60042 -23647 29338 82264 130830 72370 -2458 4740
26754 4740 64 -3333 -16514 -12192 -68335 -92726 -81306 -41342 1315 -14554 -68535 -71550 -27413
26741 -27413 -975 60103 42707 5592 -8233 -13613 -29638 -37980 -9063 -23865 -113976 -52339
26729 -52339 8681 31340 54900 16450 -10924 -974 47230 49609 41158 33648 -15214 -11372 6823
26716 6823 11394 50546 38256 -31892 -90209 -19098 20090 26951 60919 28247 -4932 4890
$$ packed form
26803F8831J8611m8533m8225k1503L7447O0592r518o4660l1201L4921M7370J6007
26791F0139r620k2078n2255K8846J3994N2523O48q6480o943j9251O1661P911J6798
26778D5893j7702j6167j3948O2238K3128n3080k9773l2656n5582R44K7573M4595
26766a4537J2219O087K9033m1839n1005L6395N2985N2926M8566n8460p4828P198
26754D740m676l397j3181M322n6143k4391J1420L9964M2657j5869n3981l015M4137
26741b7413K6438O1078j7396l7115j3825n380j6025q342K8917j4802r0111O1637
26729e2339O1020K2659K3560l8450k7374R950M8204K379q451p510m8862L842J8195
26716F823M571L9152j2290p0148n8317P1111L9188O861L3968l2672l3179R822
$$ plain form
26704 4890 29857 38909 25649 4342 -18724 -17110 -26923 -10587 -21680 -31934 -28841 -2919 -13566
26691 -13566 -59022 -82295 -30724 15711 -23655 -76365 -83343 -61571 -48976 -33860 -19693 -10545
26679 -10545 -42531 -73815 -30623 -17600 -44116 -62077 -94697 -85883 -50315 5845 -18071 -8377
26667 -8377 46645 51164 25355 66147 72250 26821 37490 25176 30345 68153 92435 39860
26655 39860 31557 79346 84442 16180 -60957 -63068 -38813 -77230 -61487 -42504 -17500 -25249
26643 -25249 -30061 -2923 27541 33593 16773 -38587 -66990 -46963 -38568 -18911 -5945 4187
26631 4187 45539 33455 14612 -3724 -95331 -82728 -20410 35323 58129 37892 73876 63643
26619 63643 -14481 -4119 69829 53954 -3904 1037 45211 81051 74079 48112 -11466 -52502
$$ packed form
26704D890K4967R052j3260k1307k3066J614r813J6336j1093j0254L093K5922j0647
26691a3566m5456k3273N1571M6435l9366n2710o978K1772J2595J5116J4167R148
26679a0545l1986l1284M3192J3023k6516j7961l2620Q814L5568N6160k3916R694
26667h377N5022M519k5809M0792O103m5429J0669j2314N169L7808K4282n2575
26655C9860q303M7789N096o8262p7137k111K4255l8417J5743J8983K5004p749
26643b5249m812K7138L0464O052j6820n5360k8403K0027Q395J9657J2966J0132
26631D187M1352j2084j8843j8336r1607J2603O2318N5733K2806k0237L5984j0233
26619F3643p8124J0362P3948j5875n7858M941M4174L5840o972k5967n9578m1036
$$ plain form
26607 -52502 -18214 8402 -44194 -27630 5022 4310 -32163 -38404 -69030 -81041 -40677 -2407
26595 -2407 7770 61003 66179 48598 22351 44715 25509 -20333 -16803 -18259 -49508 -33706
26583 -33706 -40314 -54845 -83163 -21632 -19626 -49376 -55974 -30526 -32549 -76793 -70270 -32705 -55965
26570 -55965 -80641 -22870 -6217 20786 283 8017 15780 54088 58049 34250 32602 -8831
26558 -8831 -49851 -4577 51865 35791 10065 39569 7912 -39564 -10315 -44740 -72283 -47429
26546 -47429 -45446 -43196 -62276 -152570 -106133 -39915 -32872 -60513 -29505 -2763 7593 20818
26534 20818 26218 16217 6088 28716 57902 76810 64435 -10106 -53991 -87755 -83995 -78386
26522 -78386 -85611 -64050 -92184 -94093 -79682 -59274 -13709 -17464 25490 10491 25244 7668
$$ packed form
26607e2502L4288K6616n2596J6564L2652p12l6473o241l0626j2011M0364L8270
26595b407J0177N3233N176j7581k6247K2364j9206m5842L530j456l1249J5802
26583c3706o608j4531k8318O1531K006k9750o598K5448k023m4244O523L7565k3260
26570e5965k4676N7771J6653K7003k0503P734P763L8308L961k3799j648m1433
26558h831m1020M5274N6442j6074k5726K9504l1657m7476K9249l4425k7543K4854
26546d7429J983K250j9080r0294M6437O6218P043k7641L1008K6742J0356J3225
26534B0818N400j0001j0129K2628K9186J8908j2375p4541m3885l3764L760N609
26522g8386p225K1561k8134j909J4411K0408M5565l755M2954j4999J4753j7576
$$ plain form
26510 7668 39527 12045 -55433 -68303 -58932 -38021 -45093 -101100 -86241 -37138 32689 -34608
26498 -34608 -94954 -137156 -102971 -41242 -24877 -50008 -27719 -28694 9468 7227 105286 118005
26486 118005 84381 40072 79624 55369 52105 89163 119831 89374 80247 31735 28761 49950
26474 49950 65799 52314 16354 -21907 -25352 34592 3530 39655 65801 21349 -31153 -14794
26462 -14794 -25976 -56729 -37579 -48682 -13251 27188 9042 9125 16546 7010 -19553 -29194 -39030
26449 -39030 -41489 -33601 -30824 -44172 -25458 6045 20057 -9489 -42292 -49119 14142 -9726
26437 -9726 47412 21287 -8203 -18249 15557 7290 -73560 -122780 -81688 -67912 -52886 -76215
26425 -76215 -87500 -77881 -76022 -50381 -20628 -34002 -52440 -38395 -29928 -79996 -46879 18886
$$ packed form
26510G668L1859k7482o7478j2870R371K0911p072n6007J4859M9103O9827o7297
26498c4608o0346m2202L4185O1729J6365k5131K2289r75L8162k241R8059J2719
26486A18005l3624m4309L9552k4255l264L7058L0668l0457r127m8512k974K1189
26474D9950J5849j3485l5960l8261l445N9944l1062L6125K6146m4452n2502J6359
26462a4794j1182l0753J9150j1103L5431M0439j8146Q3P421r536k6563r641r836
26449c9030k459P888K777j3348J8714L1503J4012k9546l2803o827O3261k3868
26437i726N7138k6125k9490j0046L3806q267q0850m9220M1092J3776J5026k3329
26425g6215j1285R619J859K5641K9753j3374j8438J4045Q467n0068L3117O5765
$$ plain form
26413 18886 18010 20834 35464 109505 94376 58964 90811 74917 50488 70956 108106 30999
26401 30999 -41969 -70566 -74913 -71994 -54892 -11377 12929 5898 -31691 -56907 -16841 -44456
26389 -44456 -14384 54965 63783 45866 12971 49478 77800 47467 32221 23776 11986 50377
26377 50377 78256 38138 -329 10696 41196 16404 38085 71400 31741 63424 74220 91594
26365 91594 121040 28686 -18567 -21007 -17864 -16535 -31032 -9874 -1988 -42105 -42348 -46845 -7576
26352 -7576 -10262 -53192 -83571 -35185 -40491 -54301 -48818 -17450 -21450 -40384 -49236 -78365 -123490
26339 -123490 -89871 -68082 -14298 945 36119 29009 3374 -3315 -1902 -42828 -55122 -73612
26327 -73612 -55101 -20196 8850 -12422 57836 49025 5424 9949 21864 58889 27854 15840
$$ packed form
26413A8886q76K824J4630P4041j5129l5412L1847j5894k4429K0468L7150p7107
26401C0999p2968k8597m347K919J7102M3515K4306p031l7589k5216M0066k7615
26389d4456L0072O9349Q818j7917l2895L6507K8322l0333j5246q445j1790L8391
26377E0377K7879m0118l8467J1025L0500k4792K1681L3315l9659L1683J0796J7374
26365I1594K9446r2354m7253k440L143J329j4497K1158P886m0117k43m497L9269
26352g576k686m2930l0379M8386n306j3810N483L1368m000j8934q852k9129m5125
26339a23490L3619K1789N3784J5243L5174p110k5635o689J413m0926j2294j8490
26327g3612J8511L4905K9046k1272P0258q811m3601M525J1915L7025l1035j2014
$$ plain form
26315 15840 39089 34326 24693 73218 62544 13862 22415 104578 119285 78885 78874 71480 -4460
26302 -4460 -17535 -28465 -26490 -36481 -62419 -19369 33623 14073 -29180 -42623 -51159 -36088
26290 -36088 56779 86448 55143 42380 28880 21897 42495 65289 67943 52579 -7793 46082
26278 46082 67116 77517 49585 30283 44341 93463 71727 29432 41070 68721 59067 77730
26266 77730 86466 77708 101540 76484 72205 62004 63731 15349 -8356 -51258 -50910 -88634 -88731
26253 -88731 -72996 -74345 -6721 -55268 -92895 -108747 -72362 -55738 33766 70871 61478 57963
26241 57963 49044 70432 41516 -18545 -106506 -83970 -55995 -56874 -90619 -83516 -51402 -26029
26229 -26029 35440 43504 16970 -9634 -23733 28474 66915 53012 84596 82020 69819 68376
$$ packed form
26315A5840K3249m763r633M8525j0674m8682Q553Q2163J4707m0400j1p394p5940
26302d460j3075j0930J975r991k5938M3050N2992j9550m3253j3443q536J5071
26290c6088R2867K9669l1305j2763j3500o983K0598K2794K654j5364o0372N3875
26278D6082K1034J0401k7932j9302J4058M9122k1736m2295J1638K7651r654J8663
26266G7730Q736q758K3832k5056m279j0201J727m8382k3705m2902L48l7724r7
26253h8731J5735j349O7624m8547l7627j5852L6385J6624Q9504L7105r393l515
26241E7963q919K1388k8916o0061q7961K2536K7975q79l3745P103L2114K5373
26229b6029O1469Q064k6534k6604j4099N2207L8441j3903L1584k576j2201j443
$$ plain form
26217 68376 56200 13847 6737 35641 -1576 -2549 -20153 -48653 -48709 55474 114632 84327 45576
26204 45576 -12151 -50809 -38810 36334 70905 37328 -45450 -55129 -63990 -66164 -58432 -55072 -8205
26191 -8205 -19284 -37762 -119546 -93186 -36780 15429 -755 -29829 -50538 -41774 -30037 -22106
26179 -22106 -44773 -96415 -109112 -92027 -9373 -1847 -50445 -42511 14403 44027 29819 2932
26167 2932 -45464 -35057 -1880 -28473 -31804 13439 90404 84118 69966 114945 84434 -7949
26155 -7949 -29137 5781 31536 36580 46556 46973 21547 -11351 -1068 36382 101541 88879 34044
26142 34044 16696 44122 83070 110808 102927 35404 -3505 -31344 -6738 46950 53792 6482
26130 6482 18529 41219 57100 57514 57101 32880 27315 11028 -29523 10926 -16270 -62653 -87420
$$ packed form
26217F8376j2176m2353p110K8904l7217r73j7604k8500n6J04183N9158l0305l8751
26204D5576n7727l8658J1999P5144L4571l3577q2778r679q861k174P732L360M6867
26191h205j1079j8478q1784K6360N6406N2209j6184k9074k0709Q764J1737P931
26179b2106k2667n1642j2697J7085Q2654P526m8598P934N6914K9624j4208k6887
26167B932m8396J0407L3177k6593l331M5243P6965o286j4152M4979l0511r2383
26155g949k1188L4918K5755N044R976M17k5426l2898J0283L7450O5159j2662n4835
26142C4044j7348K7426L8948K7738p881o7523l8909k7839K4606N3688O842m7310
26130F482J2047K2690J5881M14m13k4221n565j6287m0551M0449k7196m6383k4767
$$ plain form
26117 -87420 -48679 8415 6792 -8867 9195 34867 51955 72553 14942 -1454 8235 64646
26105 64646 99636 80699 26583 54107 69722 8988 -5253 34069 79337 49174 26810 30390
26093 30390 3131 25017 53165 113508 118068 117695 106245 79490 65322 62787 59448 33618 5901
26080 5901 -26628 -51167 -37318 -15232 6063 12871 23075 12439 48472 21232 40356 -4841
26068 -4841 -16080 -10184 -16060 66170 65898 57279 78583 51595 22167 1647 -25796 18028 74047
26055 74047 44120 56689 80221 50893 28696 31685 13444 49951 57265 34992 24565 6815
26043 6815 -14346 -43700 -51214 -43318 -34661 16964 84863 120048 161915 116758 63691 8018
26031 8018 -33177 -88469 -71564 -31821 12081 26567 22842 19372 26930 -45824 -85456 -93668 -19983
$$ packed form
26117h7420L8741N7094j623j5659J8062K5672J7088K0598n7611j6396R689N6411
26105F4646L4990j8937n4116K7524J5615o0734j4241L9322M5268l0163k2364L580
26093C0390k7259K1886K8148O0343M560l73j1450k6755j4168k535l339k5830k7717
26080E901l2529k4539J3849K2086K1295O808J0204j0636L6033k7240J9124m5197
26068d841j1239N896n876Q2230k72q619K1304k6988k9428k0520k7443M3824N6019
26055G4047k9927J2569K3532k9328k2197K989j8241L6507P314k2273j0427j7750
26043F815k1161k9354p514P896Q657N1625O7899L5185M1867m5157n3067n5673
26031H018m1195n5292J6905L9743M3902J4486l725l470P558p2754l9632q212P3685
$$ plain form
26018 -19983 13290 19451 52883 65539 31277 924 -15083 -30261 -43134 -11819 2466 15508
26006 15508 114106 126077 55658 -20823 55112 53136 3424 -12863 692 -28330 -76018 -71548
25994 -71548 -99230 -122774 -169566 -180629 -158511 -149771 -140977 -135347 -77291 -58855 16077 77215
25982 77215 123176 129085 58516 68223 12773 -21478 21394 22398 -12448 -6387 3509 13323 -960
25969 -960 10216 12032 -6762 -30502 -53021 -81241 -48258 -19066 -19927 -15106 -3949 -35230 -50798
25956 -50798 -105739 -82068 -31773 -40504 -46331 3356 -5416 -17691 -17225 -29671 23802 -29928 -84678
25943 -84678 -4740 42586 19795 31976 50281 35491 36238 9021 -36065 -45794 -5078 28888
25931 28888 49025 1204 -28558 -24922 -32621 -44612 -76532 -77937 -27754 -12724 2691 -6281
$$ packed form
26018a9983L3273O161L3432J2656l4262l0353j6007j5178j2873L1315J4285J3042
26006A5508R8598J1971p0419p6481P5935j976m9712j6287J3555k9022m7688M470
25994g1548k7682k3544m6792j1063K2118Q740Q794N630N8056J8436P4932O1138
25982G7215M5961N909p0569R707n5450l4251M2872J004l4846O061R896R814j4283
25969i60J1176J816j8794k3740k2519k8220L2983K9192q61M821J1157l1281j5568
25956e0798n4941K3671N0295q731n827M9687q772j2275M66j2446N3473n3730n4750
25943h4678P9938M7326k2791J2181J8305j4790P47k7217m5086r729M0716L3966
25931B8888K0137m7821k9762L636p699j1991l1920j405N0183J5030J5415q972
$$ plain form
25919 -6281 -23206 -64005 -117167 -103094 -123619 -108865 -106474 -56821 21044 117442 147851 106495
25907 106495 23781 13333 19287 -42121 -34956 -23510 25776 23103 1562 31909 17211 -4095
25895 -4095 7431 24468 32247 2924 3659 -2188 51221 79353 84550 109898 148255 53470 37678
25882 37678 34108 8756 16174 17914 -45141 -94675 -61504 -8535 -11095 -29395 -70028 -70842 -24460
25869 -24460 36949 69641 64172 71014 37534 -9940 -48976 -91847 -82872 -12012 78043 80824
25857 80824 98695 26287 -21499 -2518 31492 62443 56017 9362 -6949 55966 86692 17575
25845 17575 18932 8639 -11365 13767 43095 80087 101950 81223 43535 22651 7686 66764
25833 66764 124440 56430 -28566 -40079 -25497 -105361 -131690 -93148 -22717 957 -21264 -60421
$$ packed form
25919f281j6925m0799n3162J4073k0525J4754K391M9653P7865R6398L0409m1356
25907A06495q2714j0448N954o1408P165J1446M9286k673k1541L0347j4698k1306
25895d095J1526J7037P779k9323P35n847N3409K8132N197K5348L8357r4785j5792
25882C7678l570k5352P418J740o3055m9534L3171N2969k560j8300m0633q14M6382
25869b4460O1409L2692n469O842l3480m7474l9036m2871Q975P0860R0055K781
25857H0824J7871p2408m7786J8981L4010L0951o426m6655j6311O2915L0726o9117
25845A7575J357j0293k0004K5132K9328L6992K1863k0727l7688k0884j4965N9078
25833F6764N7676o8010q4996j1513J4582p9864k6329L8542P0431K3674k2221l9157
$$ plain form
25821 -60421 -22886 9793 -7504 -13852 -37525 -528 31108 3588 -72237 -78256 -73488 -49437
25809 -49437 -26464 -50392 -25794 -7804 -34872 -26855 -48954 -78794 -100403 -47167 38632 33453
25797 33453 39763 49572 35336 44119 33796 34571 48077 3812 -35967 -4491 -47855 -47856 -973
25784 -973 23954 2450 -84204 -56245 -16753 -153 47490 125046 105358 81675 12384 -34805
25772 -34805 -1915 -7074 42434 27703 20552 31474 -4780 -58600 -46087 -54321 -24061 -10625
25760 -10625 21115 5052 -20263 -31707 36880 23702 -13859 -32240 -5030 829 -14117 211
25748 211 -6657 -282 4021 -11958 -46561 -76927 -87193 -48106 25533 61852 43615 44710 47204
25735 47204 -4312 -38456 -76785 -83157 -19849 -3509 -600 32792 14461 30432 56450 19667
$$ packed form
25821f0421L7535L2679j7297o348k3673L6997L1636k7520p5825o019M768K4051
25809d9437K2973k3928K4598J7990k7068Q017k2099k9840k1609N3236Q5799n179
25797C3453O310R809j4236Q783j0323P75J3506m4265l9779L1476m3364jM6883
25784i73K4927k1504q6654K7959L9492J6600M7643P7556j9688k3683o9291m7189
25772c4805L2890n159M9508j4731p151J0922l6254n3820J2513q234L0260J3436
25760a0625L1740j6063k5315j1444O8587j3178l7561j8381K7210N859j4946J4328
25748B11o868O375M303j5979l4603l0366j0266L9087P3639L6319j8237J095K494
25735D7204n1516l4144l8329o372O3308J6340K909L3392j8331J5971K6018l6783
$$ plain form
25723 19667 -6613 37440 28042 40001 15944 -19520 -3764 23980 29485 -8870 -28383 -18119
25711 -18119 14624 -19629 -10214 4617 38628 52681 51267 7955 -23027 -32108 -12095 798
25699 798 -12110 29499 52647 20641 -71340 -31979 33216 35455 -11253 -56272 -102465 -63371
25687 -63371 11752 27491 5852 -70081 -110585 -87410 -31998 -43670 -89449 -108657 -98303 -49193
25675 -49193 -89730 -105325 -34999 -2793 18199 59810 59408 -18781 -24172 -8189 -23284 -23113 -40936
25662 -40936 -56811 -74923 -59598 -112266 -127700 -76639 -53719 -45001 -2005 -2958 36863 29489
25650 29489 46746 273 -28982 -88884 -88665 -98385 -79982 -65347 -13114 31253 70985 21928
25638 21928 43713 27375 42988 103940 67634 11003 -11117 -34651 8150 33383 14701 9642
$$ packed form
25723A9667k6280M4053r398J1959k4057l5464J5756K7744N505l8355j9513J0264
25711a8119L2743l4253R415J4831L4011J4053j414m3312l0982r081K0013J2893
25699G98j2908M1609K3148l2006r1981L9361O5195K239m6708m5019m6193L9094
25687f3371P5123J5739k1639p5933m0504K3175N5412j1672m5779j9208J0354M9110
25675d9193m0537j5595P0326L2206K0992M1611m02p8189n391J5983j5095J71j7823
25662d0936j5875j8112J5325n2668j5434N1061K2920Q718M2996r53L9821p374
25650B9489J7257m6473k9255n9902K19r720J8403J4635N2233M4367L9732m9057
25638B1928K1785j6338J5613O0952l6306n6631k2120k3534M2801K5233j8682n059
$$ plain form
25626 9642 32937 52247 -3565 -19774 21703 103938 135052 100732 57612 32338 21947 951
25614 951 -13664 427 -54273 400 33835 4725 41892 48709 1512 3552 68589 98273
25602 98273 36919 -25306 -49101 -25665 -2239 398 7838 57742 73134 70820 40089 -2616
25590 -2616 -18916 29003 13977 -32926 16353 63253 23899 -8 19073 52662 53901 17593
25578 17593 14913 58217 -557 40966 53656 14788 41944 -10962 -35362 -37743 -13974 -2942
25566 -2942 18025 -6997 -30905 -19720 -7603 -39787 -43649 -27957 -23832 -11859 60313 29286
25554 29286 -36152 -58031 -67350 -90444 -91948 -68696 -35523 -37535 -57466 -23325 -44544 -70312
25542 -70312 -56050 -43717 17520 52402 50887 40562 15418 388 64934 74267 63928 47360
$$ packed form
25626I642K3295J9310n5812j6209M1477Q2235L1114l4320m3120k5274j0391k0996
25614I51j4615J4091n4700N4673L3435k9110L7167O817m7197K040O5037K9684
25602I8273o1354o2225k3795K3436K3426K637P440M9904J5392k314l0731m2705
25590b616j6300M7919j5026m6903M9279M6900l9354k3907J9081L3589J239l6308
25578A7593k680M3304n8774M1523J2690l8868K7156n2906k4400k381K3769J1032
25566b942K0967k5022k3908J1185J2117l2184l862J5692M125J1973P2172l1027
25554B9286o5438k1879r319k3094j504K3252L3173k012j9931L4141k1219k5768
25542g0312J4262J2333O1237L4882j515j0325k5144j5030O4546R333j0339j6568
$$ plain form
25530 47360 19198 -1937 -22681 -36399 10846 54354 56597 53104 104810 146616 114454 90537
25518 90537 80830 48952 -3110 -37809 -28530 -45630 -1396 -29886 -23547 -29094 -33044 -16350 26542
25505 26542 38960 -7368 -21167 -44549 -42442 -52170 -78194 -63553 -38993 -29625 6274 2555
25493 2555 -21126 -60707 -49785 -38026 -90307 -128222 -93738 -30371 27909 -6976 -52 3298
25481 3298 6774 2001 19761 81458 98858 39176 -12202 -14995 -15101 -2048 -24723 -82271 -58738
25468 -58738 -28417 -38390 -84632 -68051 10499 59308 23293 -43017 -51860 43465 55250 21038
25456 21038 22823 -19557 -37591 -11959 -8102 -54815 -41822 14796 18429 8232 18957 -32159
25444 -32159 -91623 -82413 -96818 -151450 -90906 -38905 -56146 -42170 -56676 -32719 -43815 -63398
$$ packed form
25530D7360k8162k1135k0744j3718M7245M3508K243l493N1706M1806l2162k3917
25518I0537r707l1878n2062l4699R279j7100M4234k8490O339n547l950J6694M2892
25505B6542J2418m6328j3799k3382K107r728k6024J4641K4560R368L5899l719
25493B555k3681l9581J0922J1759n2281l7915L4484O3367N8280l4885O924L350
25481C298L476m773J7760O1697J7400n9682n1378k793j06J3053k2675n7548K3533
25468e8738L0321r973m6242J6581P8550M8809l6015o6310q843R5325J1785l4212
25456B1038J785m2380j8034K5632L857m6713J2993N6618L633j0197J0725n1116
25444c2159n9464R210j4405n4632O0544N2001j7241J3976j4506K3957j1096j9583
$$ plain form
25432 -63398 -111662 -123307 -46496 -10812 5697 3385 -10350 -53867 -21618 23599 51179 13310
25420 13310 -62432 -78160 -118343 -77397 5486 15052 -13482 -5515 31687 -13409 -34770 -11894
25408 -11894 -61973 -72623 -78146 -53174 -35290 -45710 -77407 -82555 -76688 -80146 -125193 -93882
25396 -93882 -43411 -11952 20563 60067 -9405 -31950 -257 -29219 -31488 -19916 27932 37854
25384 37854 51566 82348 72933 62146 38638 46337 22672 12810 22921 -7954 -24825 9757
25372 9757 -7953 -60571 -123432 -85312 -75957 -99735 -74912 -39850 -21099 15027 30023 8113
25360 8113 7798 33415 45086 13110 58395 100308 60115 -5988 -7531 12630 11092 -49726 -89650
25347 -89650 -99443 -137438 -86621 -50675 -29943 -15715 3597 -5079 -23725 -23071 13535 33787
$$ packed form
25432f3398m8264j1645P6811L5684J6509k312j3735m3517L2249M5217K7580l7869
25420A3310p5742j5728m0183M0946Q2883R566k8534P967L7202m5096k1361K2876
25408a1894n0079j0650n523K4972J7884j0420l1697n148N867l458m5047L1311
25396i3882N0471L1459L2515L9504o9472k2545L1693k8962k269J1572M7848R922
25384C7854J3712L0782r415j0787k3508P699k3665r862J0111l0875j6871L4582
25372I757j7710n2618o2861L8120R355k3778K4823L5062J8751L6126J4996k1910
25360H113l15K5617J1671l1976M5285M1913m0193o6103j543K0161j538o0818l9924
25347h9650r793l7995N0817L5946K0732J4228J9312q676j8646O54L6606K0252
$$ plain form
25335 33787 16770 50304 42071 31577 22212 22355 64022 59044 43343 85223 141531 76290 -22157
25322 -22157 -33689 -7464 -4771 58994 67528 18298 49480 26522 -24764 -37519 -19075 -12315
25310 -12315 -29236 -69846 -59492 -15210 5659 36814 83316 69673 36167 36793 48746 38791
25298 38791 -3009 -53156 -74622 -54093 -32830 8199 41840 50816 3667 90597 162760 167773
25286 167773 121523 51292 27083 -29233 -81802 -40701 6525 46734 100967 70672 12997
25275 12997 -1434 -23284 -27162 5555 -8450 31927 42197 19402 -19611 -24574 -18359 -23123
25263 -23123 -14362 -10058 25849 98784 97496 52227 58104 21174 70311 85104 25412 -36239
25251 -36239 -73505 -33000 -13119 -9223 17976 43641 31687 66003 61179 89622 114224 103572
$$ packed form
25335C3787j7017L3534q233j0494r365J43M1667m978j5701M1880N6308o5241r8447
25322b2157j1532K6225K693O3765Q534m9230L1182k2958n1286j2755J8444O760
25310a2315j6921m0610J0354M4282K0869L1155M6502j3643l3506O26J1953r955
25298C8791m1800n0147k1466K0529K1263M1029L3641Q976m7149Q6930P2163N013
25286A67773m6250p0231k4209n6316n2569M1101M7226M0209N4233l0295n7675
25275A2997j4431k1850l878L2717j4005M0377J0270k2795l9013m963O215m764
25263b3123Q761M304L5907P2935j288m5269N877l6930M9137J4793n9692o1651
25251c6239l7266M0505J9881L896K7199K5665j1954L4316m824K8443K4602j0652
$$ plain form
25239 103572 67012 27376 27660 23913 14453 12765 15143 -13183 4136 9847 11376 30758 -922
25226 -922 -11240 -3671 1128 -58954 -25328 3277 34149 17339 -44531 -38803 -1951 48785 37087
25213 37087 44751 37852 -16838 -55623 -52069 -44786 -35819 -60003 -100658 -59180 -11044 31725 25511
25200 25511 -4637 9693 -26188 -3019 13910 65740 50051 3263 -21207 -8386 23894 12419
25188 12419 -33092 -102670 -87660 -70401 -19417 -3345 -4091 994 14508 7142 -35271 -50185
25176 -50185 -64729 -38594 40169 39494 13822 -35745 -46653 -55716 -84604 -50893 -42047 -57030
25164 -57030 64892 140529 78453 56456 27382 40722 61708 90822 65533 71671 81429 104300
25152 104300 111444 82487 94713 56905 56490 46989 23840 17786 -729 -28211 -38306 -74629
$$ packed form
25239A03572l6560l9636K84l747r460j688K378k8326J7319N711J529J9382l1680
25226i22j0318P569M799o0082L3626K8605L0872j6810o1870N728L6852N0736j1698
25213C7087P664o899n4690l8785L554P283Q967k4184m0655M1478M8136M2769o214
25200B5511l0148J4330l5881K3169J6929N1830j5689m6788k4470J2821L2280j1475
25188A2419m5511o9578J5010J7259N0984J6072p46N085J3514p366m2413j4914
25176e0185j4544K6135P8763o75k5672m9567j0908r063k8888L3711Q846j4983
25164e7030J21922P5637o2076k1997k9074J3340K0986K9114k5289O138R758K2871
25152A04300P144k8957J2226l7808m15r501k3149o054j8515k7482j0095l6323
$$ plain form
25140 -74629 -72588 -71616 -71129 -58167 -50526 -53850 -16950 15842 5970 4206 57660 52704 15567 36634
25126 36634 57184 38271 55994 128731 125426 112197 100201 133138 77545 -29195 -67141 -68738
25114 -68738 -64693 -96333 -58716 -34616 -43215 3143 17257 -44254 -21604 16495 25763 6992
25102 6992 -10465 -42561 -19223 -24573 -14214 14576 27889 21344 31477 57135 58892 47878
25090 47878 22958 2731 -9166 14164 -6922 -43636 9439 70618 80438 42468 -17942 17213
25078 17213 38717 -24638 -36088 -18804 -49271 -3283 22368 33576 54761 76964 42898 84870
25066 84870 116613 124911 92932 34149 41434 61081 88036 75657 72814 107109 116025 52281
25054 52281 -60756 -117122 -72158 -10302 52801 98871 103238 90868 17640 -239 -16590 -29442
$$ packed form
25140g4629K041R72M87J2962P641l324L6900L2792r872j764N3454m956l7137K1067
25126C6634K0550j8913J7723P2737l305j3229j1996L2937n5593j06740l7946j597
25114f8738M045l1640L7617K4100q599M6358J4114o1511K2650L8099R268j8771
25102F992j7457l2096K3338n350J0359K8790J3313o545J0133K5658J757j1014
25090D7878k4920k0227j1897K3330k1086l6714N3075O1179R820l7970o0410L5155
25078A7213K1504o3355j1450J7284l0467M5988K5651J1208K1185K2203l4066M1972
25066H4870L1743Q298l1979n8783P285J9647K6955j2379k843L4295Q916o3744
25054E2281j13037n6366M4964O1856O3103M6070M367j2370p3228j7879j6351j2852
$$ plain form
25042 -29442 7680 -38269 -67185 -58377 -72164 -69410 403 32645 -2008 -35536 -25273 -17616
25030 -17616 -31469 -21268 49301 9370 -2445 17568 17778 36176 -40979 -36573 -10845 -47299
25018 -47299 -33331 -36675 -9385 3227 -14046 -38555 -8300 -5733 12332 34870 41714 46964
25006 46964 37873 -2977 34874 60119 32939 -59093 -94285 -81925 -27223 7613 30893 53762
24994 53762 40389 19706 -1809 -43916 -74000 -40532 -44135 -48308 -31004 -58102 -59832 -65587
24982 -65587 -27475 8273 6432 -58578 -76972 -95358 -60939 -7132 15429 13032 -9579 -81502
24970 -81502 -91832 -75069 -54374 -27659 40653 73970 34909 7629 -52678 -90714 -92890 -108595
24958 -108595 -94595 -83407 -29858 -70576 -99185 -114220 -90337 10263 -3190 -10606 -12656 -823
$$ packed form
25042b9442L7122m5949k8916Q808j3787K754O9813L2242l4653l3528J0263P657
25030a7616j3853J0201P0569l9931j1815K0013K10J8398p7155M406K5728l6454
25018d7299J3968l344K7290J2612j7273k4509L0255K567J8065K2538O844N250
25006D6964r091m0850L7851K5245k7180r2032l5192J2360N4702L4836K3280K2869
24994E3762j3373k0683k1515m2107l0084L3468l603m173J7304k7098j730n755
24982f5587L8112L5748j841o5010j8394j8386L4419N3807K2561k397k2611p1923
24970h1502j0330J6763K0695K6715O8312L3317l9061k7280o0307l8036k176j5705
24958a08595J4000J1188N3549m0718k8609j5035K3883J00600j3453p416k050J1833
$$ plain form
24946 -823 -7073 -1445 22664 54597 39390 60328 41941 12830 20326 37446 -11942 -26279 -25277
24933 -25277 -34096 -52295 -72768 -103721 -90397 -63984 -58221 -58212 -34363 -2824 13673 55107 57650
24920 57650 58429 60222 24466 -15660 -61018 -25921 4533 36073 31768 -7330 -40678 -47041 1778
24907 1778 49603 35024 14687 16240 21362 -26893 -23126 10092 -490 75618 52236 643
24895 643 18132 7445 31974 15517 26351 -10686 -38180 -50696 -38321 -14311 12665 43081
24883 43081 54543 29938 11842 -55630 -17653 6769 -9117 -28544 -45361 -42805 -68711 -102042
24871 -102042 -86555 -31731 -38779 -53920 -81448 -19223 48870 40401 32178 -29939 -37902 -45858
24859 -45858 38875 17843 18427 31719 40636 45454 53594 38985 78938 70935 76981 28644 1415
$$ packed form
24946h23o250N628K4109L1933j5207K0938j8387k9111P496J7120m9388j4337J002
24933b5277q819j8199k0473l0953J3324K6413N763RK3849L1539J6497M1434K543
24920E7650P79J793l5756m0126m5358L5097L0454L1540m305l9098l3348o363M8819
24907A778M7825j4579k0337J553N122m8255L767L3218j0582P6108k3382n1593
24895F43J7489j0687K4529j6457J0834l7037k7494j2516J2375K4010K6976L0416
24883D3081J1462k4605j8096o7472L7977K4422j5886j9427j6817K556k5906l3331
24871a02042J5487N4824p048j5141k7528O2225O8093q469q223o2117p963p956
24859d5858Q4733k1032N84J3292Q917M818Q140j4609L9953q003O046m8337k7229
$$ plain form
24846 1415 -1704 33053 109390 133024 116646 122174 68258 9087 -5388 23313 47105 29557
24834 29557 -976 21281 64375 90264 81678 50657 10069 -14743 -50187 -50198 185 13495
24822 13495 -55416 -66114 -23613 -18718 -23574 -639 1389 -39061 -58593 -94420 -71353 -1113
24810 -1113 -24965 -37604 -90410 -69916 -33989 -39227 3259 6525 -10920 -57265 -112053 -109013
24798 -109013 -27591 22362 10797 -15457 -30830 -34975 12434 26576 -4420 -7587 -8458 9623
24786 9623 -14131 -43177 -88360 -98813 -39968 45464 91635 116801 122796 93369 71732 35474
24774 35474 29681 30689 32676 -8365 -15306 34407 -8259 -33376 1150 14791 52798 -5123
24762 -5123 -42910 6729 75258 61870 4934 -2253 16244 -278 -54473 -65696 -67752 -84746
$$ packed form
24846A415l119L4757P6337K3634j6378N528n3916n9171j4475K8701K3792j7548
24834B9557l0533K2257M3094K5889q586l1021m0588k4812l5444j1N0383J3310
24822A3495o8911j0698M2501M895m856K2935K028m0450j9532l5827K3067P0240
24810a113k3852j2639n2806K0494L5927n238M2486L266j7445m6345n4788L040
24798a09013Q1422M9953j1565k6254j5373m145M7409J4142l0996l167q71J8081
24786I623k3754k9046m5183j0453N8845Q5432M6171K5166N995k9427k1637l6258
24774C5474n793J008J987m1041o941M9713m2666k5117L4526J3641L8007n7921
24762e123l7787M9639O8529j3388n6936p187J8497j6522n4195j1223k056j6994
$$ plain form
24750 -84746 -43747 -14752 -9605 -35014 -70095 -85431 -90100 -63093 -25046 -8811 -10706 -7440
24738 -7440 23230 58231 64693 107693 130926 64542 46498 -8239 -18811 3860 -12768 -1250
24726 -1250 29002 2492 -4280 21301 26343 1588 2247 11371 -13481 -41277 -71483 -87015 -58575
24713 -58575 -37376 -68686 -90012 -70323 -60346 -43811 -55379 -62214 -55950 -28972 24852 53556
24701 53556 58227 35198 5603 5038 -18488 -18652 -31732 -14099 -20985 1365 42455 87839 63896
24688 63896 66682 73930 90524 99297 76059 88558 36659 17291 17721 54011 42291 64056 23658
24675 23658 -16369 -16669 3494 -40907 -53308 -17536 -11748 8785 -26187 2568 28180 36221
24663 36221 15987 39623 28009 3887 -3782 -2950 13800 -44255 -25924 -8538 33281 48356
$$ packed form
24750h4746M0999K8995N147k5409l5081j5336m669K7007L8047J6235j895L266
24738g440L0670L5001O462M3000K3233o6384j8044n4737j0572K2671j6628J1518
24726a250L0252k6510o772K5581N042k4755O59R124k4852k7796l0206j5532K8440
24713e8575K1199l1310k1326J9689R977J6535j1568o835O264K6978N3824K8704
24701E3556M671k3029k9595n65k3526j64j3080J7633o886K2350M1090M5384k3943
24688F3896K786P248J6594Q773k3238J2499n1899j9368M30L6290j1720K1765m0398
24675B3658m0027l00K0163m4401j2401L5772N788K0533l4972K8755K5612Q041
24663C6221k0234K3636j1614k4122p669Q32J6750n8055J8331J7386M1819J5075
$$ plain form
24651 48356 90470 91444 80036 85275 54294 73423 77949 85189 93171 73703 72808 38821 26013
24638 26013 8155 33943 21504 50176 46892 42041 -19578 -44997 -48333 -25712 -24632 -71908
24626 -71908 -45927 18825 24386 -32403 -22201 58347 83310 37521 -31449 -11834 -12923 -11776
24614 -11776 -45001 -24352 -8871 -20858 -54378 -23736 9420 51023 45441 57976 50857 12159
24602 12159 1554 -40790 -74392 -71623 -16647 -24816 -38496 -50427 -100004 -81992 -5330 33221
24590 33221 35124 76793 130384 88886 63887 65467 60276 40258 23267 -16968 -26746 -21832 -41308
24577 -41308 -44347 -57789 -88546 -11069 -6261 -43504 -55016 -51081 -49785 15714 18499 28924 32791
24564 32791 67562 90024 69637 -15313 -34581 -32639 -40467 -68495 -68717 -56761 -1268 25804
$$ packed form
24651D8356M2114R74j1408N239l0981J9129M526P240P982j9468q95l3987j2808
24638B6013j7858K5788j2439K8672l284m851o1619k5419l336K2621J080m7276
24626g1908K5981O4752N561n6789J0202Q0548K4963m5789o8970J9615j089J147
24614a1776l3225K0649J5481j1987l3520L0642L3156M1603n582J2535p119l8698
24602A2159j0605m2344l3602K769N4976q169j3680j1931m9577J8012P6662L8551
24590C3221J903M1669N3591m1498k4999J580n191k0018j6991m0235r778M914j9476
24577d1308l039j3442l0757P7477M808l7243j1512L935J296O5499K785J0425L867
24564C2791L4771K2462k0387q4950j9268J942p828k8028k22J1956N5493K7072
$$ plain form
24552 25804 36911 49094 4068 -15235 -16858 -34899 -17510 23990 -32936 -44291 -35868 -3372
24540 -3372 18895 32612 22901 43517 45677 46675 33237 23432 48142 29731 36110 43885 42073
24527 42073 -8801 -62888 -24250 -5239 8350 23682 34804 27764 32818 25612 47579 15809
24515 15809 14182 85833 110421 107365 106527 96544 77086 58494 70327 42095 34210 2355 13444
24502 13444 -1035 32409 55618 66339 43030 81063 92127 14466 -2020 -22692 -38982 -58466
24490 -58466 -42694 -32233 11565 2408 11712 47423 77856 71983 55328 49230 44351 -2416 -7469
24477 -7469 -48764 -72418 -90334 -23573 7258 -29353 -46809 -4147 -3027 29234 77383 76924
24465 76924 55940 24113 62271 89631 59446 127125 104834 36398 23905 83958 102163 75652
$$ packed form
24552B5804J1107J2183m5026j9303j623j8041J7389M1500n6926j1355Q423L2496
24540c372K2267J3717r711K0616K160R98j3438r805K4710j8411O379P775j812
24527D2073n0874n4087L8638J9011J3589J5332J1122p040N054p206K1967l1770
24515A5809j627P1651K4588l056q38r983j9458j8592J1833k8232p885l1855J1089
24502A3444j4479L3444K3209J0721k3309L8033J1064p7661j6486k0672j6290j9484
24490e8466J5772J0461M3798r157R304L5711L0433n873j6655o098m879m6767n053
24477g469m1295k3654j7916O6761L0831l6611j7456M2662J120L2261M8149m59
24465G6924k0984l1827L8158K7360l0185O7679k2291o8436j2493O0053J8205k6511
$$ plain form
24453 75652 48246 12620 7926 -22152 -9013 -47535 -47258 -58555 -63494 -27183 -35561 -53259 -31129
24440 -31129 -22834 -15062 -4536 -17487 -18954 21274 42113 6695 62089 99177 82790 27158
24428 27158 54796 69104 52416 7081 -23135 -49708 -63647 -13956 36964 27022 -1681 -66408
24416 -66408 -88683 -109364 -87091 -25839 20002 30059 -14121 -16977 -17102 -14047 28264 40335
24404 40335 41555 68268 40703 23994 311 45171 78396 56209 55971 51358 36087 19894
24392 19894 10658 -29426 -49369 -24363 13541 71307 50640 19791 26666 18236 61850 86405
24380 86405 16666 -27132 -13516 -23225 10556 46529 90827 106210 46914 38404 28516 -2190
24368 -2190 -22220 -20848 -43751 -78152 -55365 -42174 -57340 -55867 -25846 31863 -17838 -62106
$$ packed form
24453G5652k7406l5626m694l0078J3139l8522K77j1297m939L6311q378j7698K2130
24440c1129Q295P772J0526j2951j467M0228K0839l5418N5394L7088j6387n5632
24428B7158K7638J4308j6688m5335l0216k6573j3939M9691N0920r942k8703o4727
24416f6408k2275k0681K2273O1252M5841J0057m4180k856j25L055M2311J2071
24404D0335J220K6713k7565j6709k3683M4860L3225k2187k38m613j5271j6193
24392A9894r236m0084j9943K5006L7904N7766k0667l0849O875q430M3614K4555
24380H6405o9739m3798J3616r709L3781L5973M4298J5383n9296q510r888l0706
24368b190k0030J372k2903l4401K2787J3191j5166J473L0021N7709m9701m4268
$$ plain form
24356 -62106 -52131 -23456 9798 -5839 -42925 -73814 -37201 661 -5364 -20188 -4056 18831
24344 18831 72322 72669 24874 27962 -35328 -75982 -80365 -61754 -81603 -111116 -71915 -18788
24332 -18788 -61995 -119656 -134262 -129968 -97317 -50860 -48295 -6157 21272 4428 854 -27386
24320 -27386 -4005 -1221 -3950 58724 30388 202 4473 8609 3994 -10074 -7357 12278 28055
24307 28055 16586 -13359 -7248 17595 27855 31088 2909 -26194 -29359 -78144 -61965 -15516
24295 -15516 48541 77969 48832 -20047 -47621 -29967 -16282 12681 28946 28883 52367 42334
24283 42334 35837 43281 19097 39010 11991 3782 34313 55417 82577 59788 60458 41314 58220
24270 58220 70379 102163 85262 43526 -8817 -27855 -62214 -63929 -40310 -16590 -32291 3955
$$ packed form
24356f2106R975K8675L3254j5637l7086l0889L6613L7862o025j4824J6132K2887
24344A8831N3491L47m7795L088o3290m0654m383J8611j9849k9513L9201N3127
24332a8788m3207n7661j4606M294L2651M6457K565M2138K7429j6844l574k8240
24320b7386K3381K784k729O2674k8336l0186M271M136m615j4068K717J9635J5777
24307B8055j1469k9945O111K4843J0260L233k8179k9103l165m8785J6179M6449
24295a5516O4057K9428k9137o8879k7574J7654J3685K8963J6265o3K3484j0033
24283D2334o497P444k4184J9913k7019q209L0531K1104K7160k2789O70j9144J6906
24270E8220J2159L1784j6901m1736n2343j9038l4359j715K3619K3720j5701L6246
$$ plain form
24258 3955 -38095 -81244 -93102 -35674 -59276 -64793 -25681 -3969 -55006 -74160 -67512 -18983
24246 -18983 -40659 -56409 -13187 -29118 -26688 16180 1328 -8092 -22741 -36597 -16989 40484
24234 40484 30102 -33236 -35355 20505 39015 76805 78859 14480 38712 51570 17968 -10851
24222 -10851 72326 129417 111584 80171 -12245 -84251 -97000 -107335 -85550 -64741 -86956 -41377
24210 -41377 -23337 -21158 -48113 -25469 -23172 13784 56978 25595 3144 -15956 -28491 13423
24198 13423 5722 11353 39529 29744 -51345 -55692 6737 6375 -33729 -91474 -84608 -51281 -66669
24185 -66669 -89165 -107249 -51913 -24767 -23306 -9712 -21293 -33946 -30785 -11777 -25771 10428
24173 10428 -16037 -23908 6516 15476 -45657 -70448 -63107 -40299 -40786 -48110 -3950 -7336 -23136
$$ packed form
24258C955m2050m3149j1858N7428k3602n517L9112K1712n1037j9154O648M8529
24246a8983k1676j5750M3222j5931K430M2868j4852r420j4649j3856J9608N7473
24234D0484j0382o3338k119N5860J8510L7790K054o4379K4232J2858l3602k8819
24222a0851Q3177N7091j7833l1413r2416p2006j2749j0335K1785K0809k2215M5579
24210d1377J8040K179k6955K2644K297L6956M3194l1383k2451j9100j2535M1914
24198A3423p701N631K8176r785q1089m347O2429l62m0104n7745O866L3327j5388
24185f6669k2496j8084N5336K7146J461J3594j1581j2653L161J9008j3994L6199
24173A0428k6465p871L0424Q960o1133k4791P341K2808m87p324M4160l386j5800
$$ plain form
24160 -23136 59925 83935 87607 104637 92984 52102 35952 52515 -19941 -26149 16897 30147
24148 30147 72679 65091 83239 98355 59009 36565 7129 -11614 -7992 17051 84965 110560
24136 110560 51871 -41517 -15325 -20277 -60974 -82700 -119228 -87703 -14950 -8251 -26517 -26226
24124 -26226 -54272 -66988 -24514 4409 -26139 -16094 12886 -1733 -25853 25653 23686 -7094
24112 -7094 -43626 -55812 -43108 -20558 50693 62240 54281 58324 40347 -8298 -10711 9901
24100 9901 -5402 -46966 -96574 -82992 -35053 9964 6234 19971 49004 -6241 -47117 -75325
24088 -75325 -37931 5443 34387 28376 8270 -32536 -28481 -24094 36720 70407 25330 -44345
24076 -44345 -58437 -83988 -141874 -117331 -79492 -88022 -61294 -8003 35690 73752 66668 3364
$$ packed form
24160b3136Q3061K4010L672J7030j1653m0882j6150J6563p2456o208M3046J3250
24148C0147M2532p588J8148J5116l9346k2444k9436j8743L622K5043O7914K5595
24136A10560n8689r3388K6192m952m0697k1726l6528L1525P2753O699j8266K91
24124b6226k8046j2716M2474K8923l0548J0045K8980j4619k4120N1506j967l0780
24112g094l6532j2186J2704K2550P1251J1547p959M043j7977m8645k413K0612
24100I901j5303m1564m9608J3582M7939M5017l730J3737K9033n5245m0876k8208
24088g5325L7394M3374K8944o011k0106m0806M055M387O0814L3687m5077o9675
24076d4345j4092k5551n7886K4543L7839q530K6728N3291M3693L8062p084o3304
$$ plain form
24064 3364 -25531 20962 25715 49390 20762 31307 23395 33511 35185 23552 -6022 -10846 -32736
24051 -32736 -63816 -14431 50914 58434 95720 63688 26038 -17144 -63093 -101553 -102042 -40970
24039 -40970 -2039 17671 31466 -35280 -25297 -70560 -43317 -14512 9167 -508 -35018 -7638
24027 -7638 11076 53184 60756 44504 41283 63477 87200 56245 74094 101383 55836 -8450
24015 -8450 -17521 33019 32220 50519 55701 21402 19811 12612 17482 19476 -15277 -17301 -39055 -11150
24001 -11150 13356 13401 38901 76043 52743 4385 -34547 40913 13078 -24884 24311 8456
23989 8456 -58581 -73670 -9791 -12431 -75317 -92387 -104325 -88661 -82764 10378 -4035 1047
23977 1047 63914 94071 103340 38069 30055 14747 -11774 24213 29342 36277 79960 58839 -64960
$$ packed form
24064C364k8895M6493M753K3675k8628J0545p912J0116J674j1633k9574m824k1890
24051c2736l1080M9385O5345P520L7286l2032l7650m3182m5949l8460m89O1072
24039d0970L8931J9710J3795o6746R983m5263K7243K8805K3679r675l4510K7380
24027g638J8714M2108P572j6252l221K2194K3723l0955J7849K7289m5547o4286
24015h450r071N0540p99J8299N182l4299j591p199M870J994l4753k024k1754K7905
24001a1150K4506M5K5500L7142k3300m8358l8932P5460k7835l7962M9195j5855
23989H456o7037j5089O3879k640o2886j7070j1938J5664N897R3142j4413N082
23977A047O2867L0157R269o5271q014j5308k6521L5987N129O935M3683k1121j23799
$$ plain form
23964 -64960 -126856 -68461 -33296 -12620 -39170 -95447 -46423 6398 33625 -6903 -49582 -41644
23952 -41644 -25263 -108829 -80501 -33646 15290 11709 5311 16382 48991 64853 23130 75843
23940 75843 88733 54759 30531 34315 -35713 -41033 -23582 -55116 -45810 -75908 -56452 -30073
23928 -30073 -67695 -59366 -63354 -69304 -55027 -50402 -53737 -15829 45021 71686 37538 72461 53450
23915 53450 61784 74640 56522 45370 25419 33330 54557 7105 6215 9724 -45209 -65612 -16584
23902 -16584 57715 69181 15937 -1282 -32304 -91202 -127287 -69782 -17745 -5395 13790 44013
23890 44013 87638 143822 188512 168198 83743 99438 98127 142438 157071 131471 180539 261700
23878 261700 290541 211071 207216 314477 411972 510747 633889 869018 1259411 1642980 1841256
$$ packed form
23964f4960o1896N8395L5165K0676k6550n6277M9024N2821K7227m0528m2679P938
23952d1644J6381q3566K8328M6855M8936l581o398J1071L2609J5862m1723N2713
23940G5843J2890l3974k4228L784p0028n320J7451l1534R306l0098J9456K6379
23928c0073l7622Q329l988n950J4277M625l335L7908O0850K6665l4148L4923j9011
23915E3450Q334J2856j8118j1152j9951P911K1227m7452q90L509n4933k0403M9028
23902a6584P4299J1466n3244j7219l1022n8898l6085N7505N2037J2350J9185L0223
23890D4013M3625N6184M4690k0314q4455J5695j311M4311J4633k5600M9068Q1161
23878B61700K8841p9470l855J07261R7495R8775J23142K35129L90393L83569J98276
$$ plain form
23867 1841256 1791734 1714109 1700862 1824978 1830647 1507839 1034693 713310 522748 384794
23857 384794 305533 218174 180770 148114 106267 105931 119949 122357 84197 57772 74554 45880
23845 45880 71596 57694 71104 47543 71133 58684 44421 57526 105632 107211 93912 82251
23833 82251 79515 99677 115232 79065 28936 47850 71396 41294 20135 -13429 -27586 -2744
23821 -2744 -34202 -77109 -94619 -76824 -47817 -24386 -26097 12499 79448 129624 101028 69984
23809 69984 77220 69380 55319 48256 52033 37918 -25258 -43971 -3994 27306 32112 47901 84164
23796 84164 37741 6388 -38391 -76338 -15019 21504 20252 39060 56093 113708 124738 123076
23784 123076 147356 108842 8584 -27702 10657 14493 -5385 55382 63395 4935 -31663 -14089
$$ packed form
23867A841256m9522p7625j3247J24116N669l22808m73146l21383j90562j37954
23857C84794p9261q7359l7404l2656m1847l36J4018K408l8160k6425J6782k8674
23845D5880K5716j3902J3410k3561K3590j2449j4263J3105M8106J579j3299j1661
23833H2251k736K0162J5555l6167n0129J8914K3546l0102k1159l3564j4157K4842
23821b744l1458m2907j7510J7795K9007K3431j711L8596O6949N0176k8596l1044
23809F9984P236p840j4061p063L777j4115o3176j8713L9977L1300M806J5789L6263
23796H4164m6423l1353m4779l7947O1319L6523j252J8808J7033N7615J1030j662
23784A23076K4280l8514j00258l6286L8359L836j9878O0767Q013n8460l6598J7574
$$ plain form
23772 -14089 47831 52829 120646 127405 22654 -14671 38194 9093 19743 -17730 -52640 -91926
23760 -91926 -73283 -56223 -45526 -30525 13050 25955 37419 31001 11438 -68252 -57034 -10228
23748 -10228 -15742 -67477 -83046 -33662 -5659 -37615 -57400 -21400 -15734 -47899 -96227 -126216
23736 -126216 -92287 -19912 53196 12618 -9228 -44665 -26293 -29208 -12050 14030 12614 -7068
23724 -7068 -48666 -80962 -68160 -55577 -13429 11286 43161 110423 81974 45137 1678 -94608
23712 -94608 -116546 -76790 -87131 -74730 -21492 1603 36048 43431 43224 10274 77058 131523
23700 131523 139935 124163 97468 67444 60951 9482 -18765 34149 65288 75476 71447 88438
23688 88438 75643 53486 41966 8472 -53564 -40876 22249 40841 42277 59209 84511 130549
$$ packed form
23772a4089O1920M998O7817O759j04751l7325N2865k9101J0650l7473l4910l9286
23760i1926J8643J7060J0697J5001M3575J2905J1464o418j9563p9690J1218M6806
23748a0228n514n1735j5569M9384K8003l1956j9785L6000N666l2165m8328k9989
23736a26216L3929P2375P3108m0578k1846l5437J8372k915J7158K6080j416j9682
23724g068m1598l2296J2802J2583M2148K4715L1875O7262k8449l6837m3459r6286
23712i4608k1938L9756j0341J2401N3238K3095L4445P383k07l2950O6784N4465
23700A31523Q412j5772k6695l0024o493n1469k8247N2914L1139J0188m029J6991
23688H8438j2795k2157j1520l3494o2036J2688O3125J8592J436J6932K5302M6038
$$ plain form
23676 130549 164676 138288 109568 89149 73278 31772 -49377 -52631 -59017 -76270 -39560 7504
23664 7504 -11711 -23159 9267 1793 -13123 -38130 -23594 5410 47880 57077 120401 91729
23652 91729 57685 67924 80906 91460 82180 63433 49077 74267 31044 12474 14368 -8630
23640 -8630 -76217 -74611 7335 -5897 -23821 11890 57764 65200 94396 186710 174457 100434
23628 100434 31056 29633 32598 21901 38251 34107 11672 21515 31800 11580 -46358 -29103
23616 -29103 -26186 -9545 13304 26816 50252 99175 67794 -5151 -9332 -17802 -43200 -62089
23604 -62089 -106027 -143127 -104236 -101552 -45824 51388 25630 22654 50410 37646 10868 35519
23592 35519 29962 5468 18863 39842 94539 86874 76016 79362 23926 -34464 -58755 -75796
$$ packed form
23676A30549L4127k6388k8720k0419j5871m1506q1149l254o386j7253L6710M7064
23664G504j9215j1448L2426p474j4916k5007J4536K9004M2470R197O3324k8672
23652I1729l4044J0239J2982J0554r280j8747j4356K5190m3223j8570J894k2998
23640h630o7587J606Q1946j3232j7924L5711M5874P436K9196R2314j2253p4023
23628A00434o9378j423K965j0697J6350m144k2435R843J0285k0220n7938J7255
23616b9103K917J6641K2849J3512K3436M8923l1381p2945m181q470k5398j8889
23604f2089m3938l7100L8891K684N5728R7212k5758k976K7756j2764k6778K4651
23592C5519n557k4494J3395K0979N4697p665j0858L346n5436n8390k4291j7041
$$ plain form
23580 -75796 -37109 5725 -14238 -73840 -100295 -65676 -54360 -23501 -19004 11622 -12190 -16088
23568 -16088 -14709 -38648 -23505 -776 21828 48612 39117 65725 111724 117837 110111 143985
23556 143985 217777 288181 259225 246108 271533 314431 318758 253165 136178 79133 49832
23545 49832 48908 44216 49123 16554 -16402 -940 29681 7101 3047 47542 1408 -52219 -46378
23532 -46378 11880 9104 -15645 7318 17535 20863 33798 17374 -12208 12639 42353 47580
23520 47580 51143 36265 -1249 -23880 -24344 -7744 23033 125705 166352 176856 152303 96732
23508 96732 79134 55596 33553 8829 16926 95678 83620 79651 63484 74250 87715 50931
23496 50931 12973 -2079 -24723 -59105 -27279 -1739 17224 26568 29412 33461 85934 123160
$$ packed form
23580g5796L8687M2834j9963n9602k6455L4619J1316L0859M497L0626k3812l898
23568a6088J379k3939J5143K2729K2604K6784r495K6608M5999O113p726L3874
23556A43985P3792P0404k8956j3117K5425M2898M327o5593j16987n7045k9301
23545D9832r24m692M907l2569l2956J5462L0621k2580m054M4495m6134n3627N841
23532d6378N8258k776k4749K2963J0217L328J2935j6424k9582K4847K9714N227
23520D7580L563j4878l7514k2631m64J6600L0777J02672M0647J0504k4553n5571
23508I6732j7598k3538k2043k4724Q097P8752j2058l969j6167J0766J3465l6784
23496E0931l7958j5052k2644l4382L1826K5540J8963R344K844M049N2473L7226
$$ plain form
23484 123160 90481 62816 66809 167490 126752 88920 67908 88419 63581 46613 33607
23473 33607 41222 41221 50242 17509 41881 86442 38371 27017 73053 96044 105873 119317 132607
23460 132607 158996 215716 265948 232156 190676 144991 136285 159590 77220 32871 79630 61750
23448 61750 47280 36085 38994 49083 77755 130652 190834 219389 214329 229726 195048 202230
23436 202230 168810 113079 105340 151193 227396 323680 314180 267511 250798 264082 234877 224367
23424 224367 192121 121602 55186 19933 34856 59252 89252 142787 145006 155326 175206 137464
23412 137464 85738 108766 137562 187011 178857 157916 155032 142058 106436 135069 144882 140724
23400 140724 236174 281600 235440 217750 205823 197102 212942 206920 197346 239391 265904 237484
$$ packed form
23484A23160l2679k7665L993J00681m0738l7832k1012K0511k4838j6968j3006
23473C3607P615jR021l2733K4372M4561m8071j1354M6036K2991R829J3444J3290
23460A32607K6389N6720N0232l3792m1480m5685q706K3305q2370m4349M6759j7880
23448F1750j4470j1195K909J0089K8672N2897O0182K8555n060J5397l4678P182
23436B02230l3420n5731p739M5853P6203R6284r500m6669j6713J3284k9205j0510
23424B24367l2246p0519o6416l5253J4923K4396L0000N3535K219J0320J9880l7742
23412A37464n1726K3028K8796M9449q154k0941k884j2974l5622K8633R813m158
23400A40724R5450M5426m6160j7690j1927q721J5840o022r574M2045K6513k8420
$$ plain form
23388 237484 267451 315456 311197 270511 264412 270516 321608 352970 410278 472296 457673 504511
23376 504511 628452 838856 1201138 1686237 2102337 2161950 2010269 1861873 1956311 2233270
23366 2233270 2266454 1879089 1406444 1063425 864694 777114 717810 659391 631968 654951
23356 654951 635734 640049 712698 751664 788273 784979 802853 839829 900744 924923 895974 841464
23344 841464 821073 832295 891727 892591 952794 1010201 1075079 1212806 1310265 1305265 1336867 1505320
23332 1505320 1677683 1764415 1821133 1936607 2099963 2292790 2514272 2767481 3018156 3273197
23322 3273197 3600998 3942581 4417825 5033809 5654586 6268879 7064912 8252286 9788264
23313 9788264 11655784 14121198 17230561 21178426 26478387 34507991 47530997 69440132
$$ packed form
23388B37484K9967M8005m259m0686o099O104N1092L1362N7308O2018j4623M6838
23376E04511J23941K10404L62282M85099M16100N9613j51681j48396R4438K76959
23366B233270L3184l87365m72645l43019j98731q7580n9304n8419k7423K2983
23356F54951j9217M315P2649L8966L6609l294J7874L6976O0915K4179k8949n4510
23344H41464k0391J1222N9432Q64O0203N7407O4878J37727R7459n000L1602J68453
23332A505320J72363Q6732N6718J15474J63356J92827K21482K53209K50675K55041
23322C273197L27801L41583M75244O15984O20777O14293P96033J187374J535978
23313I788264J867520K465414L109363L947865N299961Q029604J3023006K1909135
$$ plain form
23305 69440132 106979041 170263911 259947585 328299959 328074460 289193565 271713770
23298 271713770 303869519 339572548 315345132 237167171 155280944 101596630 71834008
23291 71834008 54066834 42730988 35167032 29794028 25487706 21737405 18495672 16087064
23283 16087064 14326824 12908673 11618353 10427453 9401827 8613598 7972717 7331019
23275 7331019 6734689 6256082 5877835 5448041 5023205 4684436 4393885 4089827 3899687
23266 3899687 3727283 3547086 3372338 3157919 2955149 2789725 2724970 2679597 2564239 2436482
23256 2436482 2356661 2346344 2247897 2129646 2076420 1988302 1888084 1764284 1697348 1728031 1681780
23245 1681780 1616030 1525491 1436230 1364509 1298298 1285831 1277101 1223815 1166940 1177662 1288395
$$ packed form
23305F9440132L7538909O3284870Q9683674O8352374k25499l8880895j7479795
23298B71713770L2155749L5703029k4227416p8177961q1886227n3684314k9762622
23291G1834008j7767174j1335846p563956n373004m306322l750301l241733k408608
23283A6087064j760240j418151j290320j190900j025626p88229o40881o41698
23275G331019n96330m78607l78247m29794m24836l38769k90551l04058j90140
23266C899687j72404j80197j74748k14419k02770j65424o4755m5373j15358j27757
23256B436482p9821j0317r8447j18251n3226q8118j00218j23800o6936L0683m6251
23245A681780o5750r0539q9261p1721o6211j2467q730n3286n6875J0722J10733
$$ plain form
23234 1288395 1486077 1814023 2285224 2629709 2601983 2448930 2381752 2490807 2521216 2295923
23224 2295923 1900870 1470861 1220339 1115206 965896 896038 868448 807051 747909 670544
23214 670544 648299 652203 667490 605727 543843 523565 538617 536463 538615 531630 515937 541770
23202 541770 566611 594672 623741 578889 507457 481381 485472 438751 418895 398556 382125 357647
23190 357647 354549 388808 377661 395326 345932 322211 369602 369994 319621 283691 329395 354516
23178 354516 386047 467123 468210 358758 263387 246825 277292 303089 230112 152639 148997 171212
23166 171212 150879 143875 149646 147941 111839 88004 130245 180507 175090 164174 81119 11740
23154 11740 26182 16590 48045 61530 84417 121135 153273 80056 28645 114787 133423 47211
$$ packed form
23234A288395J97682L27946M71201L44485k7726j53053o7178J09055L0409k25293
23224B295923l95053m30009k50522j05133j49310o9858k7590o1397n9142p7365
23214F70544k2245L904J5287o1763o1884k0278J5052k154K152o985j5693K5833
23202E41770K4841K8061K9069m4852p1432k6076M091m6721j9856k0339j6431k4478
23190C57647l098L4259j1147J7665m9394k3721M7391L92n0373l5930M5704K5121
23178C54516L1531Q1076J087j09452r5371j6562L0467K5797p2977p7473l642K2215
23166A71212k0333p004N771j705l6102k3835M2241N0262n417j0916q3055o9379
23154A1740J4442r592L1455J3485K2887L6718L2138p3217n1411Q6142J8636q6212
$$ plain form
23142 47211 18583 46984 103124 47490 8181 -61229 -93634 -28324 -16598 -17017 31808 69700
23130 69700 121611 162809 126430 125418 93385 91463 44484 -4485 -20895 -45173 -21765 26117
23118 26117 16576 24269 21762 -55086 -58504 8100 12017 67171 107585 102092 75837 54570 27983
23105 27983 42904 100319 86560 71675 109998 106086 52442 46046 120988 101041 63549 47282
23093 47282 91899 91673 50406 39794 65694 119330 150631 121626 87288 97319 130695 138937
23081 138937 150385 126414 118881 112055 52961 62284 55101 50824 96707 66644 56735 42596 23215
23068 23215 -6387 -6586 -10988 9431 36348 52204 85294 66203 74275 113146 160231 123025
23056 123025 69551 46415 49075 35998 25984 59955 -428 -34255 12660 -8343 30024 31942
$$ packed form
23142D7211k8628K8401N6140n5634l9309o9410l2405O5310J1726m19M8825L7892
23130F9700N1911M1198l6379j012l2033j922m6979m8969j6410k4278K3408M7882
23118B6117r541P693k507p6848l418O6604L917N5154M0414n493k6255k1267k6587
23105B7983J4921N7415j3759j4885L8323l912n3644o396P4942j9947l7492j6267
23093D7282M4617k26m1267j0612K5900N3636L1301k9005l4338J0031L3376Q242
23081A38937J1448k3971p533o826n9094R323p183m277M5883l0063r909j4139j9381
23068B3215k9602j99m402K0419K6917J5856L3090j9091Q072L8871M7085l7206
23056A23025n3474k3136K660j3077j0014L3971o0383l3827M6915k1003L8367J918
$$ plain form
23044 31942 -21607 47018 147952 141746 138870 124647 158931 117858 61293 84952 22944 14677
23032 14677 65474 50109 30579 36095 65411 56782 30381 29238 71493 125906 134041 134344 61530
23019 61530 63204 63944 17105 8847 58471 111998 98703 93779 82735 66515 -11875 -50444 -15328
23006 -15328 6318 33043 79705 125915 129844 100117 68945 83437 53243 32853 -6795 -38215
22994 -38215 32569 45590 87740 116805 124236 88759 43766 22147 64121 48664 78166 119969
22982 119969 68149 31602 15244 38018 78477 51970 25183 -9996 -48375 -50557 -49149 -55181
22970 -55181 -47369 -40816 -2987 -7328 337 28879 71164 25307 -31183 -42442 -106093 -87974
22958 -87974 -107673 -122364 -52930 2959 -53543 -52291 -35280 -37149 -13955 16761 41596 20218
$$ packed form
23044C1942n3549O8625J00934o206k876j4223L4284m1073n6565K3659o2008q267
23032A4677N0797j5365j9530N516K9316q629k6401j143M2255N4413Q135L03p2814
23019F1530J674P40m6839q258M9624N3527j3295m924j1044j6220p8390l8569L5116
23006a5328K1646K6725M6662M6210L929k9727l1172J4492l0194k0390l9648l1420
22994c8215P0784J3021M2150K9065P431l5477m4993k1619M1974j5457K9502M1803
22982A19969n1820l6547j6358K2774M0459k6507k6787l5179l8379k182J408o032
22970e5181P812O553L7829m341P665K8542M2285m5857n6490j1259o3651J8119
22958h7974j9699j4691O9434N5889n6502J252J7011j869K3194L0716K4835k1378
$$ plain form
22946 20218 17587 29652 40927 45977 52706 20523 -21263 -29937 -3626 -3354 -13621 -26088 18032
22933 18032 6509 15788 20470 35597 11739 20225 -3235 -2892 -26199 -77021 -57768 -30821 27907
22920 27907 10555 36825 22478 -66155 -105153 -91908 -56770 -38156 -30234 -56024 -47695 -64030
22908 -64030 -83376 -60419 -60637 -47970 -49579 -24045 5880 -7208 31428 72734 25853 -40637
22896 -40637 -87905 -41977 -11230 24016 -11731 -19662 -23745 -42629 -38939 13775 39171 -981
22884 -981 -14764 4166 49733 606 13703 70781 4151 9442 29931 14527 49004 36642
22872 36642 29153 -11638 6467 46869 -1309 1476 31086 6041 -25343 -48331 -14116 14216
22860 14216 19094 35785 -4384 24023 43698 19644 24723 5152 -33227 -51769 -72470 -60839
$$ packed form
22946B0218k631J2065J1275N050O729l2183m1786q674K6311K72j0267j2467M4120
22933A8032j1523R279M682J5127k3858Q486k3460L43k3307n0822J9253K6947N8728
22920B7907j7352K6270j4347q8633l8998J3245L5138J8614P922k5790Q329j6335
22908f4030j9346K2957k18J2667j609K5534K9925j3088L8636M1306m6881o6490
22896d0637m7268M5928L0747L5246l5747p931m083j8884L690N2714K5396m0152
22884i81j3783J8930M5567m9127J3097N7078o6630N291K0489j5404L4477j2362
22872C6642p489m0791J8105M0402m8178K785K9610k5045l1384k2988L4215K8332
22860A4216M878J6691m0169K8407J9675k4054N079j9571l8379j8542k0701J1631
$$ plain form
22848 -60839 -79649 -79521 -33548 -32524 -30168 24046 22739 -11930 -4669 -8868 -900 6499 13835 -25814
22834 -25814 -18642 -63980 -55847 -13376 63896 73469 46986 28516 36336 23091 4934 -10586
22822 -10586 -16187 -16915 -59590 -47169 -4794 387 3608 -4380 -38601 -16706 42736 50939 -64423
22809 -64423 -79118 -59468 15216 -9074 -47002 -21240 40337 2934 -17835 -42761 -46434 -33309
22797 -33309 -12343 -31303 -74796 -86142 -27126 -37632 -88627 -46979 -5991 42620 19030 -26547
22785 -26547 -47001 -57400 -35120 68362 119358 143500 92685 48624 64759 93481 86145 43054
22773 43054 61934 132444 150182 62919 47543 59928 91813 132402 147557 135084 118513 61212
22761 61212 1710 -24954 -35605 -18824 -34621 -37970 -20182 -17848 -11532 -12262 -43646 -61831 -50455
$$ packed form
22848f0839j8810J28M5973J024K356N4214j307l4669P261m199P968P399P336l9649
22834b5814P172m5338Q133M2471P7272R573k6483j8470P820j3245j8157j5520
22822a0586n601p28m2675J2421M2375N181L221p988l4221K1895N9442Q203j15362
22809f4423j4695J9650P4684k4290l7928K5762O1577l7403k0769k4926l673J3125
22797c3309K0966j8960m3493j1346N9016j0506n0995M1648M0988M8611k3590m5577
22785b6547k0454j0399K2280J03482N0996K4142n0815m4061J6135K8722p336m3091
22773D3054J8880P0510J7738q7263j5376J2385L1885M0589J5155j2473j6571n7301
22761F1212n9502k6664j0651J6781j5797l349J7788K334O316p30l1384j8185J1376
$$ plain form
22748 -50455 -23122 23710 99112 92401 20125 -14589 30292 61934 44070 33437 35479 95945
22736 95945 88395 97858 103072 138661 251116 320067 368401 589715 888858 1268936 1651830
22725 1651830 1738928 1582799 1487585 1575012 1738435 1619819 1279649 898859 620553 463898
22715 463898 321342 211485 212723 180254 107358 61683 47125 19815 12986 -10267 -1776 18923
22703 18923 -11427 -7707 10167 40123 107024 66739 10197 7107 491 27602 16691 8310
22691 8310 -49372 -60808 -23596 -12248 7606 -38435 -44291 -46613 -74325 -112736 -44627 21583
22679 21583 -7785 -52930 -59063 -54170 -14313 44738 47001 81276 27397 13690 46507 79070
22667 79070 67923 10723 -9929 -32929 -75307 -17991 22063 -14739 15068 -3300 -20389 7800
$$ packed form
22748e0455K7333M6832P5402o711p2276l4714M4881L1642j7864j0633K042O0466
22736I5945p550R463N214L5589J12455O8951M8334K21314K99143L80078L82894
22725A651830Q7098j56129r5214Q7427J63423j18616l40170l80790k78306j56655
22715D63898j42556j09857J238l2469p2896m5675j4558k7310o829k3253Q491K0699
22703A8923l0350L720J7874K9956O6901m0285n6542l090o616K7111j0911q381
22691H310n7682j1436L7212J1348J9854m6041n856k322k7712l8411O8109O6210
22679B1583k9368m5145o133M893L9857N9051K263L4275n3879j3707L2817L2563
22667G9070j1147n7200k0652k3000m2378N7316M0054l6802K9807j8368j7089K8189
$$ plain form
22655 7800 -20456 -31294 -10720 6643 29717 -17828 -23729 -16982 -13224 60862 122850 116646 74600
22642 74600 15411 -26084 -32475 -37429 -39339 -62288 -44783 -28245 -1046 44587 10242 -36287
22630 -36287 -57322 -35871 4966 91088 85297 61138 56604 34072 -6291 -29909 6635 41388
22618 41388 33533 818 -11912 -17602 5004 23870 -7478 -69813 -100722 -70522 766 -14631
22606 -14631 -76059 -79649 -52103 34623 29459 -25260 -68740 -56070 -27787 -6008 -12713 38226
22594 38226 7830 -20571 -68060 -88076 -91683 -72773 -34154 572 -31030 -86418 -70279 -36777
22582 -36777 -32794 -51922 -68748 -38220 -1785 20622 6823 5288 -15720 -72545 -115373 -92039
22570 -92039 -3756 32627 6265 -42235 -64637 -45737 -110051 -134522 -116720 -59002 -41746 -55144
$$ packed form
22655G800k8256j0838K0574J7363K3074m7545n901O747L758P4086O1988o204m2046
22642G4600n9189m1495o391m954j910k2949J7505J6538K7199M5633l4345m6529
22630c6287k1035K1451M0837Q6122n791k4159m534k2532m0363k3618L6544L4753
22618D1388p855l2715j2730n690K2606J8866l1348o2335l0909L0200P1288j5397
22606a4631o1428l590K7546Q6726n164n4719m3480J2670K8283K1779o705N0939
22594C8226l0396k8401m7489k0016l607J8910L8619L4726l1602n5388J6139L3502
22582c6777L983j9128j6826L0528L6435K2407j3799j535k1008n6825m2828K3334
22570i2039Q8283L6383k6362m8500k2402J8900o4314k4471J7802N7718J7256j3398
$$ plain form
22558 -55144 -33405 2620 47508 49720 31874 -54507 -91710 -59963 14790 13395 -36078 -55596
22546 -55596 -44194 14818 34664 -1176 -76253 -103827 -70778 -13051 47201 1140 -3826 -21653
22534 -21653 2433 23932 -8065 -35683 -26662 4815 -11664 -25901 -48825 -54542 -58907 -50002
22522 -50002 -37543 -37777 -26300 -59315 -36983 10020 -39658 -74432 -54109 -38374 -3615 1907
22510 1907 -2772 -52134 -61176 -40239 -3081 13019 -6773 -11767 -2476 -10851 55165 87133 134544
22497 134544 90388 43787 -30376 -45636 -33725 -45906 -41704 -15801 -3811 -10405 -19299 -44824
22485 -44824 -10962 42992 40781 33371 -11125 -69930 -97408 -86116 -69950 -68353 -113480 -143803
22473 -143803 -54815 -34524 -44921 -99083 -97817 -18075 -21962 -3471 -24117 -42776 -66410 -65890
$$ packed form
22558e5144K1739L6025M4888K212j7846q6381l7203L1747P4753j395m9473j9518
22546e5596J1402N9012J9846l5840p5077k7574L3049N7727O0252m6061m966j7827
22534b1653K4086K1499l1997k7618R021L1477j6479j4237k2924n717m365Q905
22522e0002J2459k34J1477l3015K2332M7003m9678l4774K0323J5735L4759N522
22510A907m679m9362r042K0937L7158J6100j9792m994R291q375O6016L1968M7411
22497A34544m4156m6601p4163j5260J1911j2181M202K5903J1990o594q894k5525
22485d4824L3862N3954k211p410m4496n8805k7478J1292J6166J597m5127l0323
22473a43803Q8988K0291j0397n4162J266P9742l887J8491k0646j8659k3634N20
$$ plain form
22461 -65890 -72699 -99982 -100306 -116119 -82162 5645 15371 -16461 -69566 -67032 -42712 -54939 -99649
22448 -99649 -103932 -23984 12586 20050 3289 15768 13267 -2074 35071 59805 14793 24182
22436 24182 42808 2636 15833 3358 20106 43141 43080 6320 56384 64259 19916 -17277
22424 -17277 934 -13105 -39959 -53005 -28123 23773 8835 1018 9363 15012 31500 54146
22412 54146 26655 -19437 -18273 -46314 -32770 -17724 44985 2585 -56962 -73036 -70873 -22504
22400 -22504 -6746 -573 -16143 -15829 -45971 -64806 -44906 -76068 -56840 -56321 -13632 -5970 -7535
22387 -7535 -45215 3112 46744 72083 65911 86564 34413 -11258 -27114 -56361 -18159 -28586
22375 -28586 -114001 -95003 -47987 -11338 -11654 -2432 -61040 -30609 24009 17851 49802 112525
$$ packed form
22461f5890o809k7283l24j5813L3957Q7807R726l1832n3105K534K4320j2227m4710
22448i9649m283P9948L6570P464j6761J2479k501j5341L7145K4734m5012R389
22436B4182J8626m0172J3197j2475J6748K3035o1l6760N0064P875m4343l7193
22424a7277J8211j4039k6854j3046K4882N1896j4938p817Q345N649J6488K2646
22412E4146k7491m6092J164k8041J3544J5046O2709m2400n9547j6074K163M8369
22400b2504J5758O173j5570L14l0142j8835J9900l1162J9228N19M2689P662j565
22387g535l7680M8327M3632K5339o172K0653n2151m5671j5856k9247L8202j0427
22375b8586q5415J8998M7016L6649l16R222n8608L0431N4618o158L1951O2723
$$ plain form
22363 112525 101728 83100 9120 10946 59631 104276 60199 3752 -23742 -56294 -3329 -6581
22351 -6581 -49962 -43125 -33447 -90502 -78833 -32771 17282 48353 -27866 -43053 -22056 11767
22339 11767 -40373 -101203 -102434 -72480 -33807 -8799 -29588 -64351 -21677 8760 15856 -15391
22327 -15391 -48004 -38497 -13144 -21265 33924 108296 118847 59052 -8565 -10139 8098 19370
22315 19370 -1123 -43668 -52046 -15996 -2216 34585 80133 85128 68026 61387 40571 40654 47696
22302 47696 3213 29446 67172 -15717 -68503 -65683 -39563 -51062 -25873 -2646 -58703 -96219
22290 -96219 -61523 -26402 -11636 9825 -12510 -39817 -21235 25672 76464 104700 103093 117548
22278 117548 159794 200180 101481 24806 -51707 -58199 34753 45801 43789 2550 -46969 -30801
$$ packed form
22363A12525j0797j8628p3980J826M8685M4645m4077n6447k7494l2552N2965l252
22351f581m3381O837R678n7055J1669M6062N0053L1071p6219j5187K0997L3823
22339A1767n2140o0830j231K9954L8673K5008k0789l4763M2674L0437P096l1247
22327a5391l2613R507K5353q121N5189P4372J0551n9795o7617j574J8237J1272
22315A9370k0493m2545q378L6050J3780L6801M5548M995j7102o639k0816Q3P042
22302D7696m4483K6233L7726q2889n2786K820K6120j1499K5189K3227n6057l7516
22290i6219L4696L5121J4766K1461k2335k7307J8582M6907N0792K8236j607J4455
22278A17548M2246M0386r8699p6675p6513o492R2952J1048k012m1239m9519J6168
$$ plain form
22266 -30801 -19525 -23136 -12502 17622 15087 32951 65574 28611 41034 37409 41164 46113 24757
22253 24757 -4480 -42360 -60509 -42722 8142 81960 96894 138932 189636 216942 199900 154017
22241 154017 146534 124639 75256 23603 -17887 -62763 -66964 -15380 3532 8911 42442 22644
22229 22644 25049 105934 89285 46721 20194 -31342 -74716 -48613 -62540 -25327 -6148 13586
22217 13586 -22498 -39593 -96534 -132416 -80080 -28284 -19666 -62801 -51175 34813 -2273 -1984
22205 -1984 -21317 -66347 -114604 -116020 -56057 7050 68473 72100 91405 74999 21018 39170
22193 39170 93484 59820 35186 47905 64421 49433 -8478 -36953 -33720 -43282 -49015 -18270
22181 -18270 35038 37995 9898 12313 -43785 -28990 26014 68864 14091 36668 27373 -41977
$$ packed form
22266c0801J1276l611J0634L0124k535J7864L2623l6963J2423l625L755M949k1356
22253B4757k9237l7880j8149J7787N0864P3818J4934M2038N0704K7306j7042m5883
22241A54017p483k1895m9383n1653m1490m4876m201N1584J8912N379L3531j9798
22229B2644K405Q0885j6649m2564k6527n1536m3374K6103j3927L7213J9179J9734
22217A3586l6084j7095n6941l5882N2336N1796Q618m3135J1626Q5988l7086K89
22205a984j9333m5030m8257j416N9963O3107O1423L627J9305j6406n3981J8152
22193C9170N4314l3664k4634J2719J6516j4988n7911k8475L233r562n733L0745
22181a8270N3308K957k8097K415n6098J4795N5004M2850n4773K2577r295o9350
$$ plain form
22169 -41977 -72588 -100728 -69150 -24868 -39580 -90829 -66660 -42646 -77938 -103820 -115132 -64105
22157 -64105 -25816 2870 -4011 -9929 42312 28733 -169 7849 14011 317 -24438 -87849
22145 -87849 -55769 -70690 -65280 -35481 -52765 -91958 -93691 -106180 -89130 -63984 -10670 -9342
22133 -9342 -111930 -93979 -60169 -14913 -46147 -51541 -13528 5389 -46326 -11513 15495 30629
22121 30629 17358 12440 -20800 -53573 -100651 -74219 -1386 -31789 -75237 -59376 -71669 -21784
22109 -21784 -56918 -65204 -82677 -67687 -66590 -65190 -36144 13535 22948 -17032 -84627 -89739 -46174
22096 -46174 -11176 -75719 -50125 51963 45580 3792 -18300 -11201 -27242 -59042 -71113 -150565
22084 -150565 -153277 -99639 -103177 -65848 -16903 -15691 -13610 18524 22485 1200 -4488 -44408 -60959
$$ packed form
22169d1977l0611k8140L1578M4282j4712n1249K4169K4014l5292k5882j1312N1027
22157f4105L8289K8686o881n918N2241j3579k8902Q018O162j3694k4755o3411
22145h7849L2080j4921N410K9799j7284l9193j733j2489J7050K5146N3314J328
22133i342j02588J7951L3810M5256l1234n394L8013J8917n1715L4813K7008J5134
22121C0629j3271m918l3240l2773m7078K6432P2833l0403m3448J5861j2293M9885
22109b1784l5134q286j7473J4990J097J400K9046M9679R413l9980o7595n112M3565
22096d6174L4998o4543K5594J02088o383m1788k2092P099j6041l1800j2071p9452
22084a50565k712N3638l538L7329M8945J212K081L2134L961k1285n688l9920j6551
$$ plain form
22071 -60959 -28788 -57117 -58095 -41904 -660 34993 72535 89709 74546 52031 25800 20183
22059 20183 19121 22769 19185 77498 14607 -20968 -18246 -74618 -133436 -114705 -104342 -68472
22047 -68472 -91767 -126090 -62589 -15242 -10884 -34026 -77222 -82736 -54129 -63722 -89060 -71513
22035 -71513 -99277 -40555 29343 9022 2519 -70947 -57239 50247 46137 25613 68261 78430
22023 78430 68411 52147 35690 -1809 -49339 -59788 -81237 -73303 -35123 4932 -8328 -16894
22011 -16894 -32945 -35939 -33166 -58923 -43295 -26933 -4766 -65560 -112634 -77377 -16445 20549
21999 20549 137 -36701 -58794 -68365 -58161 -42533 -43256 -35335 -32191 21422 -3280 -31857 -30825
21986 -30825 1724 35868 -3207 -43764 -26978 11149 27226 -1219 -22511 -24364 -50437 -58849
$$ packed form
22071f0959L2171k8329r78J6191M1244L5653L7542J7174j5163k2515k6231n617
22059B0183j062L648l584N8313o2891l5575K722n6372n8818J8731J0363L5870
22047f8472k3295l4323O3501M7347M358k3142m3196n514K8607r593k5338J7547
22035g1513k7764N8722O9898k0321o503p3466J3708J07486m110k0524M2648J0169
22023G8430j0019j6264j6457l7499m7530j0449k1449P934L8180M0055j3260q566
22011a6894j6051k994K773k5757J5628J6362K2167o0794m7074L5257O0932L6994
21999B0549k0412l6838k2093r571J0204J5628p23P921L144N3613k4702k8577J032
21986c0825L2549L4144l9075m0557J6786L8127J6077k8445k1292j853k6073q412
$$ plain form
21974 -58849 -73050 -41862 10004 76354 40018 -19949 -46003 -43197 27054 78246 80984 78793
21962 78793 58112 50670 40768 38319 47736 -17246 -49893 -42378 -40190 -40091 -23637 14226 7883 2946
21948 2946 38953 96182 89453 70119 32582 -13321 -33942 -45930 -88374 -77286 -34020 -60514
21936 -60514 -68995 -84207 -65908 -60242 -76268 -85099 -82972 -48661 -11687 9841 4676 7634 8095
21923 8095 -48548 -34526 -17032 -14266 -24928 4732 12002 23366 -53769 -84446 -76264 -69388 -69852
21910 -69852 -72656 -69977 -34199 17947 -24673 -12801 48792 83030 66161 44981 11988 3841
21898 3841 36790 33107 -7492 49860 81417 11585 -38462 -13962 20325 75800 66747 49954
21886 49954 52321 42901 73152 118898 106868 49072 -15427 -63920 -74671 -130474 -121866 -79999
$$ packed form
21974e8849j4201L1188N1866O6350l6336n9967k6054K806P0251N1192K738k191
21962G8793k0681p442r902k449R417o4982l2647P515K188R9J6454L7863o343m937
21948B946L6007N7229o729j9334l7537m5903k0621j1988m2444J1088M3266k6494
21936f0514q481j5212J8299N666j6026q831K127L4311L6974K1528n165K958M61
21923H095n6643J4022J7494K766j0662K9660P270J1364p7135l0677Q182O876m64
21910f9852k804K679L5778N2146m2620J1872O1593L4238j6869k1180l2993q147
21898C841L2949l683m0599N7352L1557o9832n0047K4500L4287N5475r053j6793
21886D9954K367r420L0251M5746j2030n7796o4499m8493j0751n5803Q608M1867
$$ plain form
21874 -79999 -50047 -48606 -61569 -55122 -30184 22668 26074 38197 10477 -14607 -61821 -73765
21862 -73765 -54807 1837 27991 26427 7761 12845 4097 534 -2772 -40926 -103587 -67607 8500
21849 8500 18575 25257 -1366 23411 -34379 -51264 -27414 469 6841 -6796 -29257 -69249
21837 -69249 -109927 -66243 -55191 -33122 -39791 -42562 -52426 -65617 -59825 -27698 -47622 -30836
21825 -30836 -5321 -60222 -117262 -129793 -126137 -73013 -19228 -28531 -40554 -62525 -72523 -52136
21813 -52136 -23547 8034 -8922 -54928 -35816 -27566 -91769 -128278 -76023 -54997 -62154 -42746
21801 -42746 -47657 -77418 -47016 -42033 -29319 14167 -10665 -35812 -36426 -26395 -36764 -30686 -70935
21788 -70935 -40640 -6524 43958 91386 61833 27958 -1935 402 -50285 -66953 -46884 12277
$$ packed form
21874g9999K9952J441j2963O447K4938N2852L406J2123k7720k5084m7214j1944
21862g3765J8958N6644K6154j564j8666N084q748l563l306l8154o2661L5980P6107
21849H500J0075O682k6623K4777n7790j6885K3850K7883O372j3637k2461l9992
21837f9249m0678M3684J1052K2069o669k771r864j3191N792L2127j9924J6786
21825c0836K5515n4901n7040j2531L656N3124N3785r303j2023k1971r998K0387
21813e2136K8589L1581j6956m6006J9112Q250o4203l6509N2255K1026p157J9408
21801d2746m911k9761L0402M983J2714M3486k4832k5147o14J0031j0369O078m0249
21788g0935L0295L4116N0482M7428k9553l3875k9893K337n0687j6668K0069N9161
$$ plain form
21776 12277 -4570 -28935 -36092 -34467 -51096 -47486 -46360 -21506 2135 -5928 -24281 18074 -706
21763 -706 -5567 23897 20571 -4357 -25942 -28178 -8660 -57700 -77853 -60560 -20743 -8387 13200
21750 13200 64453 50827 -3525 -4623 30367 33277 -19953 -31638 -36216 -48348 -64849 -6910
21738 -6910 -12257 -8846 -15020 -25025 5738 23290 42808 27373 -32486 -36855 -11737 -21538 6809
21725 6809 -50315 -63334 -59932 -92116 -98159 -88860 -49208 -41881 -29321 -13140 -39111 -16862 -32754
21712 -32754 -63167 -76837 -104872 -169351 -170517 -186593 -150741 -98390 -104031 -98329 -102055 -71731
21700 -71731 -31504 -44636 -8998 -23839 -41766 -47704 -97955 -72438 -26180 -20538 -65517 -91041
21688 -91041 -77387 -28458 -13480 -14697 35850 53644 50298 57263 58935 26675 26078 -31102 -42980
$$ packed form
21776A2277j6847k4365p157J625j6629L610J126K4854K3641q063j8353M2355j8780
21763g06m861K9464l326k4928k1585k236J9518m9040k0153J7293L9817J2356K1587
21750A3200N1253j3626n4352j098L4990K910n3230j1685m578j2132j6501N7939
21738f910n347L411o174j0005L0763J7552J9518j5435n9859m369K5118r801K8347
21725F809n7124j3019L402l2184o043R299L9652P327J2560J6181k5971K2249j5892
21712c2754l0413j3670k8035o4479j166j6076L5852N2351n641N702l726L0324
21700g1731M0227j3132L5638j4841j7927n938n0251K5517M6258N642m4979k5524
21688i1041J3654M8929J4978j217N0547J7794l346O965J672l2260n97n7180j1878
$$ plain form
21675 -42980 5312 8867 -51828 -125346 -103848 -60733 -114639 -133299 -113165 -151380 -129743 -64315
21663 -64315 -59606 -45381 6296 -22592 -29859 -6257 2802 -12802 -25973 -10143 -19724 -25600 -45799
21650 -45799 -6537 46748 76630 80716 16886 8912 -32063 -59208 -23119 -19569 25439 -14904
21638 -14904 -74024 -50816 -22227 -74459 -73645 -42806 -29789 19817 25503 43782 4962 -15303
21626 -15303 -41725 2245 8112 4140 13237 20572 22423 45700 29609 -10283 -75486 -93509 -59200
21613 -59200 -26892 9056 -11700 -42788 -27370 -20961 -14600 -26829 -74 13077 28819 50827
21601 50827 4938 -27112 -60614 -48190 -44699 -80575 -38533 -561 -56525 -112016 -118857 -94118
21589 -94118 -53825 27146 17760 1208 4322 37371 54559 33022 34212 15056 -24897 -6210
$$ packed form
21675d2980M8292L555o0695p3518K1498M3115n3906j8660K0134l8215K1637O5428
21663f4315M709J4225N1677k8888p267K3602R059j5604j3171J5830r581n876k0199
21650d5799L9262N3285K9882M086o3830p974m0975k7145L6089L550M5008m0343
21638a4904n9120K3208K8589n2232Q14L0839J3017M9606N686J8279l8820k0265
21626a5303k6422M3970N867l972R097P335J851K3277j6091l9892o5203j8023L4309
21613e9200L2308L5948k0756l1088J5418O409O361j2229K6755J3151J5742K2008
21601E0827m5889l2050l3502J2424L491l5876M2042L7972n5964n5491o841K4739
21589i4118M0293Q0971r386j6552L114L3049J7188k1537J190j9156l9953J8687
$$ plain form
21577 -6210 6226 -4874 -10322 20224 29087 17700 -1191 13207 -13280 -21475 -8803 22603
21565 22603 52592 65833 88318 74437 64868 34664 48139 72300 75116 88302 146323 108306
21553 108306 55792 15942 20764 -237 -31922 -78869 -98210 -111682 -133215 -68983 -34301 1026
21541 1026 -36978 -71724 -55404 -22316 21520 12413 20078 18958 37763 30459 21956 32783 5456
21528 5456 -23817 -19841 -44588 -53190 -17574 -13935 -39698 -24877 36099 5477 6486 -37183 19393
21515 19393 30625 -6664 -16491 27903 17926 29304 18114 8543 3355 21386 24788 -22621 -21402
21502 -21402 -46138 -39171 -58962 -35740 13901 31622 64115 -14661 -53031 -51129 -16260 -52230
21490 -52230 -69841 -93480 -49398 -53263 -31577 17476 47902 43269 -5586 -22235 -84625 -95859
$$ packed form
21577f210J2436j1100n448L0546Q863j1387j8891J4398k6487q195J2672L1406
21565B2603K9989J3241K2485j3881r569l0204J3475K4161K816J3186N8021l8017
21553A08306n2514l9850M822k1001l1685m6947j9341j3472k1533O4232L4682L5327
21541A026l8004l4746J6320L3088M3836r107P665j120J8805p304q503J0827k7327
21528E456k9273L976k4747q602L5616L639k5763J4821O0976l0622J009m3669N6576
21515A9393J1232l7289r827M4394r977J1378j1190r571n188J8031L402m7409J219
21502b1402k4736O967j9791K3222M9641J7721L2493p8776l8370J902L4869l5970
21490e2230j7611k3639M4082l865K1686M9053L0426m633m8855j6649o2390j1234
$$ plain form
21478 -95859 -67412 -100224 -101591 -89939 -10669 38003 86486 76784 34932 18643 10099 -7041
21466 -7041 -17737 -23865 -17297 -47280 -80579 -53473 -35098 -61169 -74910 -40938 -8923 18287
21454 18287 17277 -28720 -22946 39113 19574 14101 18724 -29288 -67352 -95294 -68330 -32841
21442 -32841 -59107 -75279 -65031 -118033 -112468 -48128 -10364 -13929 -25151 15605 14481 -16282
21430 -16282 15990 9093 -12054 20794 38543 29444 -7955 -33426 -62306 -87642 -84728 -3469
21418 -3469 1667 22048 47210 -10330 -64483 -81150 -96890 -84559 -77686 -49609 -4604 35623
21406 35623 -826 6723 50508 46317 39839 10650 -6793 -25523 10895 9145 -16901 -30841
21394 -30841 -22428 11521 40924 62063 60688 36772 34156 46463 35306 -16596 5686 27913
$$ packed form
21478i5859K8447l2812j367J1652P9270M8672M8483r702m1852j6289q544j7140
21466g041j0696o128O568k9983l3299K7106J8375k6071j3741L3972L2015K7210
21454A8287j010m5997N774O2059j9539n473M623m8012l8064k7942K6964L5489
21442c2841k6266j6172J0248n3002N565O4340L7764l565j1222M0756j124l0763
21430a6282L2272o897k1147L2848J7749r099l7399k5471k8880k5336K914Q1259
21418c469N136K0381K5162n7540n4153j6667j5740J2331O873K8077M5005M0227
21406C5623l6449P549M3785m191o478k9189j7443j8730L6418j750k6046j3940
21394c0841Q413L3949K9403K1139j375k3916k616J2307j1157n1902K2282K2227
$$ plain form
21382 27913 22869 -613 29259 12872 1797 15711 16052 45937 -33169 -52970 -35808 9538
21370 9538 13983 -9737 -2821 11992 -15147 -59053 -91342 -108659 -54714 -56983 -50380 -26185 469
21357 469 12292 340 -33617 -31475 -14375 -9479 -30971 -12382 -5025 12331 -18139 -12034 10777
21344 10777 31650 27390 15178 -4356 -33566 -10682 -37394 -60815 -5219 11246 7295 -34289
21332 -34289 -43616 -17579 15310 3837 5092 -7147 -7814 -13901 -32001 -80649 -95047 -101113 -68440
21319 -68440 -71584 -108057 -65298 312 -21014 -88557 -105604 -88710 -49522 -59357 -21839 -39774
21307 -39774 -80287 -78858 -41000 -67812 -58770 -29646 13974 35988 -21444 -37408 -23291 -39528
21295 -39528 -76892 -58109 8965 44283 75099 50669 -7455 -33239 29586 87727 51180 18179
$$ packed form
21382B7913n044k3482K9872j6387j1075J3914L41K9885p9106j9801J7162M5346
21370I538M445k3720O916J4813k7139m3906l2289j7317N3945k269O603K4195K6654
21357D69J1823j1952l3957K142J7100M896k1492J8589P357J7356l0470O105K2811
21344A0777K0873m260j2212j9534k9210K2884k6712k3421N5596J6465l951m1584
21332c4289r327K6037L2889j1473J255j2239o67o087j8100m8648j4398o066L2673
21319f8440l144l6473M2759O5610k1326o7543j7047J6894L9188r835L7518j7935
21307c9774m0513J429L7858k6812R042K9124M3620K2014n7432j5964J4117j6237
21295c9528l7364J8783O7074L5318L0816k4430n8124k5784O2825N8141l6547l3001
$$ plain form
21283 18179 12839 25312 15549 13545 -13812 5316 -36121 -66012 -69758 -25267 30467 52120
21271 52120 32879 50471 56637 39518 -20144 -23602 -5247 -4006 -40306 -58982 -62997 -130987
21259 -130987 -145330 -108124 -74386 -83660 -42676 11928 15955 -23501 -4195 36128 28954 56058
21247 56058 32406 76215 54279 3121 -84323 -95160 -25082 13389 -30467 -43792 -44173 -73606
21235 -73606 -79924 -63712 -62864 -51293 -19460 -8257 -45726 -18702 741 64001 69097 33891
21223 33891 -30994 -24425 36384 49672 3689 -25653 -67443 -56370 -65258 -85136 -77836 -101484
21211 -101484 -75858 -48172 1526 20005 -3920 -45776 -65067 -51266 -18475 77880 107985
21200 107985 71859 51322 55867 27731 8120 -44133 -128122 -114865 -96152 -72222 -16253 -18319
$$ packed form
21283A8179n340J2473r763k004k7357J9128m1437k9891l746M4491N5734K1653
21271E2120j9241J7592O166j7119n9662l458J8355J241l6300j8676m015o7990
21259a30987j4343L7206L3738r274M0984N4604M027l9456J9306M0323p174K7104
21247E6058k3652M3809k1936n1158q7444j0837P0078L8471m3856j3325l81k9433
21235g3606o318J6212Q48J1571L1833J1203l7469K7024J9443O3260N096l5206
21223C3891o4885O569O0809J3288m5983k9342m1790J1073q888j9878P300k3648
21211a01484K5626K7686M9698J8479k3925m1856j9291J3801L2791R6355L0105
21200A07985l6126k0537M545k8136j9611n2253q3989J3257J8713K3930N5969k066
$$ plain form
21188 -18319 18518 -26086 -40811 -91751 -143846 -102947 -52082 -30556 66635 100399 129781 143452
21176 143452 111204 65397 52022 34735 74574 48402 45350 72426 14364 18819 57042 53250
21164 53250 25602 -36044 -12715 29115 4738 -32871 -9301 28836 22146 14850 -31463 34877
21152 34877 36625 16575 51570 79954 74322 67489 30295 -64412 -87100 -47040 -44867 8261
21140 8261 10810 -54948 -26599 13936 22715 14275 -12002 -56834 -74821 -104482 -90034 -12036
21128 -12036 6537 25702 38430 -3064 -6768 16479 9856 -1108 -23329 2295 -1663 -39909
21116 -39909 -41797 -4440 -4165 -24290 -69672 -97656 -72495 -77136 -79970 -19160 -31200 -21971 -1055
21103 -1055 -3323 -38489 -43340 -35668 -37456 -7683 -43103 -70354 -47686 -46614 -21329 -44449 -34575
$$ packed form
21188a8319L6837m4604j4725n0940n2095M0899N0865K1526R7191L3764K9382J3671
21176A43452l2248m5807j3375j7287L9839k6172l052K7076n8062M455L8223l792
21164E3250k7648o1646K3329M1830k4377l7609K3570L8137o690p296m6313O6340
21152C4877J748k0050L4995K8384n632o833l7194r4707k2688M0060K173N3128
21140H261K549o5758K8349M0535Q779q440k6277m4832j7987k9661J4448P7998
21128a2036J8573J9165J2728m1494l704K3247o623j0964k2221K5624l958l8246
21116c9909j888L7357K75k0125m5382k7984K5161m641k834O0810j2040R229K0916
21103a055k268l5166m851P672j788K9773l5420k7251K2668J072K5285k3120R874
$$ plain form
21090 -34575 -32088 19431 39363 50012 29320 2193 17542 27940 -5313 -44076 -25573 -31244
21078 -31244 -50476 -61179 -49654 -52118 -15444 6025 -22824 -60359 -56886 -52736 -37207 -64941
21066 -64941 -82756 -59131 -45775 -59121 -41903 2431 64175 52259 37727 16236 3660 23933
21054 23933 -13248 -93886 -75480 -76331 -58423 -73721 -60170 -40021 5752 -11936 -2318 -5953
21042 -5953 42722 94985 79589 6921 -32123 -50196 -43918 -15637 3888 -30786 -145948 -147259
21030 -147259 -79437 -35496 -13085 -52435 -132729 -123182 -100091 -71316 -51378 -54249 -60846 -47001
21018 -47001 -664 34750 43147 4013 301 2533 8030 18594 -17321 -16174 60177 55208 5345
21005 5345 -49935 -18160 16199 30515 50849 88681 66568 61210 12990 -1125 40119 -6021
$$ packed form
21090c4575K487N1519J9932J0649k0692k7127J5349J0398l3253l8763J8503n671
21078c1244j9232j0703J1525k464L6674K1469k8849l7535L473M150J5529k7734
21066f4941j7815K3625J3356j3346J7218M4334O1744j1916j4532k1491j2576K0273
21054B3933l7181q0638J8406q51J7908j5298J3551K0149M5773j7688R618l635
21042e953M8675N2263j5396p2668l9044j8073O278K8281J9525l4674j15162j311
21030a47259O7822M3941K2411l9350q0294R547K3091K8775J9938k871o597J3845
21018d7001M6337L5414Q397l9134l712K232N497J0564l5915J147P6351m969m9863
21005E345n5280L1775L4359J4316K0334L7832k2113n358m8220j4115M1244m6140
$$ plain form
20993 -6021 -48037 -76763 -25873 65448 133276 79594 8738 -53924 -57429 8789 -4886 -28541
20981 -28541 -10890 -17252 4916 41262 62079 47 -53469 -15315 42955 -25199 -95054 -25581
20969 -25581 14503 -4705 48639 74663 81873 8794 -10288 -26774 -21296 -8771 3191 63839
20957 63839 43947 10961 41914 58171 50544 77500 47361 29223 47917 15180 -6108 -57959
20945 -57959 -118676 -90691 -101656 -91212 -111427 -14975 37798 7580 -6758 -30692 -18067 -40370
20933 -40370 -39723 -22245 -30166 -51569 -41362 -32083 -37575 -62248 -59875 6577 15848 18040 26788
20920 26788 15010 -65455 -104737 -73266 -11139 -36568 -45742 -34845 -19993 19374 -6909 -75894
20908 -75894 -102484 -111176 -77905 -30825 29735 60768 58605 36353 48327 75503 82130 78947
$$ packed form
20993f021m2016k8726N0890R1321O7828n3682p0856o2662l505O6218j3675k3655
20981b8541J7651o362K2168L6346K0817o2032n3516L8154N8270o8154o9855O9473
20969b5581M0084j9208N3344K6024P210p3079j9082j6486N478J2525J1962O0648
20957F3839j9892l2986L0953J6257p627K6956l0139j8138J8694l2737k1288n1851
20945e7959o0717K7985j0965J0444k0215R6452N2773l0218j4338k3934J2625k2303
20933d0370O47J7478p921k1403J0207R279n492k4673K373O6452R271K192Q748
20920B6788j1778q0465l9282L1471O2127k5429r174J0897J4852L9367k6283o8985
20908g5894k6590q692L3271M7080O0560L1033k163k2252J1974K7176O627l183
$$ plain form
20896 78947 49777 4510 -33845 -17169 -15832 40643 69729 41099 -6547 -68466 -7418 61196
20884 61196 77079 81883 77399 12013 -9777 53650 92245 83340 80065 67522 -20806 -41520
20872 -41520 -27793 33297 23575 -10455 -48800 -38684 -8709 -28122 -12697 4229 1495 -19331
20860 -19331 -14447 31141 -23925 -53483 -33076 27759 30334 -9206 -33985 -622 8815 13052
20848 13052 5106 16282 -13659 -6514 -23837 -31155 -36780 -31022 -31255 -49417 -76343 -72324 -64693
20835 -64693 -45375 29502 68157 64130 40059 -10998 -22292 -6141 87196 44113 -7260 -48764
20823 -48764 -72419 -90757 -81569 -64827 -32416 4908 19397 -1205 -6600 11741 -2248 -70563
20811 -70563 -64250 1697 -4140 12515 17012 -12730 -10777 74274 60681 22860 -26952 -75084
$$ packed form
20896G8947k9170m5267l8355J6676J337N6475K9086k8630m7646o1919O1048O8614
20884F1196J5883M804m484o5386k1790O3427L8595q905l275j2543q8328k0714
20872d1520J3727O1090r722l4030l8345J0116K9975j9413J5425J6926k734k0826
20860a9331M884M5588n5066k9558K0407O0835K575l9540k4779L3363R437M237
20848A3052p946J1176k9941P145j7323p318n625N758k33j8162k6926M019P631
20835f4693J9318P4877L8655m027k4071n1057j1294J6151R3337m3083n1373m1504
20823d8764k3655j8338R188J6742L2411L7324J4489k0602n395J8341j3989o8315
20811g0563O313O5947n837J6655M497k9742J953Q5051j3593l7821m9812m8132
$$ plain form
20799 -75084 -114327 -136039 -95384 -56019 -42619 25771 58291 28419 32118 18247 -31727 -71992
20787 -71992 -67695 -33482 -21049 -15072 -7351 -47402 -32203 16405 52924 39386 -7117 -29919
20775 -29919 -2396 34908 31251 29674 55660 56477 35460 10242 -21773 -74414 -80992 -42382 7239
20762 7239 24617 47473 67793 35295 12299 -36970 -82887 -97905 -111188 -134450 -104960 -66300
20750 -66300 -97316 -126249 -143640 -140307 -102692 -49911 -32449 -29642 -37294 -46178 -24585 -23807 -35981
20737 -35981 -44357 -56154 -43277 -35793 13180 25652 -23834 -53615 -74677 -63968 -60787 -87884
20725 -87884 -24653 -4743 -15591 3815 -26910 -89287 -99000 -91451 -101264 -105988 -106743 -57624 16603
20712 16603 93144 34144 -68056 -92131 -76024 -77454 5298 51597 36789 91516 14643 -58979
$$ packed form
20799g5084l9243k1712M0655L9365J3400O8390L2520k9872L699j3871m9974m0265
20787g1992M297L4213J2433N977P721m0051J5199M8608L6519j3538m6503k2802
20775b9919K7523L7304l657j577K5986Q17k1017k5218l2015n2641o578L8610M9621
20762G239J7378K2856K0320l2498k2996m9269m5917j5018j3283k3262K9490L8660
20750f6300l1016k8933j7391L333L7615N2781J7462K807p652q884K1593P78j2174
20737c5981q376j1797J2877P484M8973J2472m9486k9781k1062J0709L181k7097
20725h7884O3231J9910j0848J9406l0725o2377r713P549r813m724p55M9119P4227
20712A6603P6541n9000j02200k4075J6107j430Q2752M6299j4808N4727p6873p3622
$$ plain form
20700 -58979 -79625 -64146 -104141 -103090 -95825 -73383 -72207 -41100 10425 59108 46546 -1694
20688 -1694 -33748 -79447 -151538 -145910 -115975 -82516 -66767 -50939 -34715 674 3808 -24098
20676 -24098 -57934 -52751 -50932 -25902 -24722 -19041 -17878 21455 18978 -17010 -46837 -81030 -67100
20663 -67100 -61281 -96618 -79960 -11477 46352 45320 34378 23605 20420 7315 19222 22443
20651 22443 40948 25124 -31966 6146 26462 -5010 -8948 -53306 -41923 -24293 3190 64266
20639 64266 111884 85998 59502 31902 85234 79593 54253 -6142 -34393 33696 82919 88080
20627 88080 38921 26095 8101 71629 -41279 -69821 -111909 -116981 -71713 -30027 14862 25504
20615 25504 -13067 -17379 -66697 -104659 -68206 -53604 -30917 -22239 -81122 -113544 -83781 -15002
$$ packed form
20700e8979k0646J5479l9995J051P265K2442J176L1107N1525M8683j2562m8240
20688a694l2054m5699p2091N628K9935L3459J5749J5828J6224L5389L134k7906
20676b4098l3836N183J819K5030J180N681J163L9333k477l5988k9827l4193J3930
20663f7100N819l5337J6658O8483N7829j032j0942j0773l185j3105J1907L221
20651B2443J8505j5824n7090L8112K0316l1472l938m4358J1383J7630K7483O1076
20639F4266M7618k5886k6496k7600N3332n641k5340o0395k8251O8089M9223N161
20627H8080m9159j2826j7994O3528j12908k8542m2088n072M5268M1686M4889J0642
20615B5504l8571m312m9318l7962L6453J4602K2687Q678n8883l2422K9763O8779
$$ plain form
20603 -15002 -52619 -45034 -82756 -54851 -3442 -6122 -75144 -88549 -97760 -73619 -34507 -34348 -13951
20590 -13951 12431 7140 -36124 -10043 29097 -3806 -77912 -42727 -1480 -32304 -4285 84880
20578 84880 53822 11021 -36280 -32296 -62935 -35822 -14476 12834 41912 24247 43703 21593
20566 21593 -5719 -24144 -11765 -14255 -29608 11719 -38014 -83728 -110883 -76221 -24216 -19998
20554 -19998 -4094 -38154 -86007 -92452 -44420 -51809 -65165 -27573 48940 107825 102070 57019
20542 57019 14484 -52293 -50499 -6727 -18082 -67270 -71940 -108027 -110546 -45355 -24471 -54987
20530 -54987 -30460 -12933 -27925 -24976 -60159 -9731 56595 43573 -56455 -70897 -39253 -1790
20518 -1790 20353 -7530 -60583 -87955 -172553 -216839 -183755 -134956 -28287 -8284 -31784 -38200
$$ packed form
20603a5002l7617P585l7722K7905N1409k680o9022j3405r211K4141L9112J59K0397
20590a3951K6382n291m3264K6081L9140l2903p4106L5185M1247l0824K8019Q9165
20578H4880l1058m2801m7301L984l0639K7113K1346K7310K9078j7665J9456k2110
20566B1593k7312j8425J2379k490j5353M1327m9733m5714k7155L4662N2005M218
20554a9998J5904l4060m7853o445M8032p389j3356L7592P6513N8885n755m5051
20542E7019m2535o6777J794M3772j1355m9188m670l6087k519O5191K0884l0516
20530e4987K4527J7527j4992K949l5183N0428O6326j3022j00028j4442L1644L7463
20518a790K2143k7883n3053k7372q4598m4286L3084M8799J06669K0003k3500o416
$$ plain form
20506 -38200 -30317 -22404 36769 71761 26201 13133 -31650 -79504 -19509 9693 -8029 63363
20494 63363 67962 68517 73639 107786 131909 142333 161514 24883 -53836 -59264 -34354 -93732
20482 -93732 -114749 -45657 23079 23172 -3126 -8681 34694 16554 -7186 -88267 -106884 -35666
20470 -35666 29401 -15897 -14151 -4653 -28796 -108155 -100101 -56369 -20851 -13419 -7728 -3040 -34844
20457 -34844 -12254 -41882 -76559 -102733 -89205 -78708 -128875 -104065 -39304 -41263 -31176 -44166
20445 -44166 -64799 -71396 -34850 -15065 -33190 -66993 -34530 -56822 -58818 -42932 -105183 -83960
20433 -83960 10975 6952 1881 34804 27075 18128 20224 37854 19217 7492 -27412 -37147 -16778
20420 -16778 -17463 -65645 -68770 -88752 -82609 -84902 -38988 1153 -32093 -27123 -81963 -106808 -61007
$$ packed form
20506c8200P883P913N9173L4992m5560j3068m4783m7854N9995K9202j7722P1392
20494F3363M599N55N122L4147K4123J0424J9181j36631p8719n428K4910n9378
20482i3732k1017O9092O8736R3k6298n555M3375j8140k3740q1081j8617P1218
20470c5666O5067m5298J746R498k4143p9359Q054M3732L5518P432N691M688l1804
20457c4844K2590k9628l4677k6174J3528J0497n0167K4810O4761j959J0087j2990
20445d4166k0633o597L6546J9785j8125l3803L2463k2292j996J5886o2251K1223
20433h3960R4935m023n071L2923p729q947K096J7630j8637j1725l4904r735K0369
20420a6778o85m8182l125j9982O143k293M5914M0141l3246M970n4840k4845M5801
$$ plain form
20407 -61007 -54601 -51600 -27428 -57598 -39986 -50525 690 40085 62492 45539 35298 47490
20395 47490 33769 18324 17532 11465 -46117 -10211 8303 10688 36014 4626 -22200 -34571
20383 -34571 -32779 -25095 -6146 39763 -5103 -71564 -94012 -76741 -103244 -134447 -110459 -74118
20371 -74118 -86135 -75498 -44461 -22642 -35297 -19 -5111 -14999 -8509 -38368 -59972 -14498
20359 -14498 76044 64775 42411 48783 -4139 -53108 -3461 -10290 16112 52761 35952 -28334
20347 -28334 -60609 -48379 -40309 -81099 -109605 -59047 -2969 -368 -275 -36311 -63011 3180 20158
20334 20158 51607 44709 13188 15790 66874 91474 64162 37358 18164 1013 -10986 -178
20322 -178 -47841 -65722 -99099 -108213 -57017 -25773 -15707 31331 20239 18716 -14820 -34864
$$ packed form
20407f1007O406L001K4172l0170J7612j0539N1215L9395K2407j6953j0241J2192
20395D7490j3721j5445p92o067n7582L5906J8514K385K5326l1388k6826j2371
20383c4571J792P684J8949M5909m4866o6461k2448J7271k6503l1203K3988L6341
20371g4118j2017J0637L1037K1819j2655L5278n092r888O490k9859k1604M5474
20359a4498R0542j1269k2364O372n2922m8969M9647o829K6402L6649j6809o4286
20347b8334l2275J2230Q070m0790k8506N0558N6078K601R3l6036k6700O6191J6978
20334B0158L1449o898l1521K602N1084K4600k7312k6804j9194j7151j1999J0808
20322a78m7663j7881l3377r114N1196L1244J0066M7038j1092j523l3536k0044
$$ plain form
20310 -34864 -1465 -6803 -14698 -25530 -41529 -60800 8567 43238 38385 69752 54027 18033
20298 18033 72829 81288 37554 17074 973 -55664 -88378 -63978 -48916 -12809 24593 29705
20286 29705 -11690 -49808 -58085 -32582 41724 91333 80327 44205 35547 88280 88655 38093
20274 38093 27098 17432 36815 -18304 -54054 -40957 -33519 -33752 -29482 -15476 49771 27018 10488
20261 10488 -14238 -3989 2827 43764 -23137 -17009 22813 67366 35160 10944 -4173 -8376
20249 -8376 16220 13244 44607 38342 854 110 23917 -2368 -32073 -23200 -48780 -47597 -15479
20236 -15479 17724 80499 71579 91146 101364 85166 36983 56695 61889 13229 -2206 -50076
20224 -50076 -68376 -32774 -1339 -12390 8985 1297 23535 30603 8973 16608 35274 78124
$$ packed form
20310c4864L3399n338p895j0832j5999j9271O9367L4671m853L1367j5725l5994
20298A8033N4796Q459m3734k0480j6101n6637l2714K4400J5062L6107L7402N112
20286B9705m1395l8118q277K5503P4306M9609j1006l6122q658N2733L75n0562
20274C8093j0995r666J9383n5119l5750J3097P438k33M270J4006O5247k2753j6530
20261A0488k4726J0249O816M0937o6901O128L9822M4553l2206k4216j5117m203
20249h376K4596k976L1363o265l7488p44K3807k6285k9705Q873k5580J183L2118
20236a5479L3203O2775q920J9567J0218j6198m8183J9712N194m8660j5435m7870
20224e0076j8300L5602L1435j1051K1375p688K2238P068k1630P635J8666M2850
$$ plain form
20212 78124 36164 -12801 -34757 -666 39872 2950 -28870 6242 -16604 -30572 -9053 27512
20200 27512 26297 -22131 -22508 -11875 -28319 -1208 -4476 12487 -53457 -121921 -102880 -33322
20188 -33322 1646 -25903 623 30217 18589 -37907 -81437 -73110 -119948 -119351 -106623 -97197
20176 -97197 -44095 43460 42416 22404 11 -33670 -10886 -31073 -65992 -41315 3529 11446
20164 11446 -61549 -99116 -69694 -38314 -74647 -66955 -85386 -90404 -71913 -68397 -46772 12560
20152 12560 42224 81728 17115 -50196 -89118 -68070 -39159 -20676 -44985 -38120 -5960 47732
20140 47732 -7404 -43423 604 -11086 -78791 -66571 -11859 36495 48575 -1171 -58464 -81361
20128 -81361 -89265 -108205 -92632 -85287 -64131 -24099 28520 63044 75407 108886 63426 -3470
$$ packed form
20212G8124m1960m8965k1956L4091M0538l6922l1820L5112k2846j3968K1519L6565
20200B7512j215m8428l77J0633j6444K7111l268J6963o5944o8464J9041O9558
20188c3322L4968k7549K6526K9594j1628n6496m3530Q327m6838N97J2728R426
20176i7197N3102Q7555j044k0012k2393l3681K2784k0187l4919K4677M4844P917
20164A1446p2995l7567K9422L1380l6333P692j8431n018J8491L516K1625N9332
20152A2560K9664L9504o4613o7311l8922K1048K8911J8483k4309O865L2160N3692
20140D7732n5136l6019M4027j1690o7705J2220N4712M8354J2080m9746n7293k2897
20128h1361p904j8940J5573P345K1156M0032N2619L4524J2363L3479m5460o6896
$$ plain form
20116 -3470 -51373 -78113 -64606 -52699 -95217 -49275 -36186 -66370 -67572 -79153 -101477 -133300
20104 -133300 -119647 -137082 -105751 -39954 286 -34564 -23631 -4603 20077 28613 82072 103473
20092 103473 55675 18701 56707 45166 19807 41361 71198 48821 -22193 -47941 -40623 27326
20080 27326 15622 12604 -65295 -99883 -30504 10965 -16462 4848 -3037 39856 34555 27211
20068 27211 15231 -26721 -42510 -80015 -64878 -39351 -34407 -28674 55172 76940 66649 60620
20056 60620 26455 -20583 -44487 -26873 25437 29645 8786 -13 22047 33668 40721 -14058
20044 -14058 -12886 -29284 -22457 17880 -3305 -8913 -22686 -18128 -12232 -44261 -60660 -52441 -49993
20031 -49993 -31285 -57429 -19455 5860 -9947 -47362 -28036 10083 71033 108764 75678 7897
$$ packed form
20116c470m7903k6740J3507J1907m2518M5942J3089l0184j202j1581k2324l1823
20104a33300J3653j7435L1331O5797M0240l4850J0933J9028K4680Q536N3459K1401
20092A03473m7798l6974L8006j1541k5359K1554K9837k2377p1014k5748P318O7949
20080B7326j1704l018p7899l4588O9379M1469k7427K1310p885M2893n301p344
20068B7211j1980m1952j5789l7505J5137K5527M944N733Q3846K1768j0291o029
20056F0620l4165m7038k3904J7614N2310M208k0859q799K2060J1621P053n4779
20044a4058J172j6398O827M0337k1185n608j3773M558N896l2029j6399Q219K448
20031d9993J8708k6144L7974K5315j5807l7415J9326L8119O0950L7731l3086o7781
$$ plain form
20019 7897 -15434 23594 4250 -37548 -50497 -46215 11820 14485 -67 -13200 -34120 -44294
20007 -44294 -82268 -122175 -101543 -48851 7932 -26705 -57011 -65545 -85775 -122138 -102575 -80196
19995 -80196 -108409 -99921 -58385 -8287 9970 -30218 -56234 -31094 5246 31454 2764 14325
19983 14325 37838 32859 34665 -26309 -48270 45188 38788 8290 -2255 -8750 5596 38377
19971 38377 59350 60504 6377 -19084 30776 45502 28857 38886 36758 45978 58259 -22698
19959 -22698 -19968 8067 16228 9822 -40369 -57188 -23710 -5277 17812 -37108 -53520 -29161
19947 -29161 -15970 -50986 -27331 46059 38500 -608 -18523 -17560 5181 -7510 -53422 -119858
19935 -119858 -152893 -70119 -2662 -3085 -2934 8783 47873 35655 12876 -43917 -51770 -23480
$$ packed form
20019G897k3331L9028j9344m1798j2949M282N8035K665j4552j3133k0920j0174
20007d4294l7974l9907K0632N2692N6783l4637l0306q534k0230l6363J9563K2379
19995h0196k8213Q488M1536N0098J8257m0188k6016K5140L6340K6208k8690J1561
19983A4325K3513m979J806o0974k1961R3458o400l0498j0545o495J4346L2781
19971C8377K0973J154n4127k5461M9860J4726j6645J0029k128R220J2281q0957
19959b2698K730K8035Q161o406n0191j6819L3478J8433K3089n4920j6412K4359
19947b9161J3191l5016K3655P3390p559l9108j7915R63K2741j2691m5912o6436
19935a19858l3035Q2774O7457m23J51J1717L9090j2218k2779n6793p853K8290
$$ plain form
19923 -23480 -39368 -14412 -15312 -24841 42277 91076 97183 110533 81978 71451 73818 68923 15534
19910 15534 -44904 -70078 -80609 -35891 -29585 -31969 30672 58089 -1659 -17803 51209 63081
19898 63081 61796 57114 63369 6966 -84899 -79734 -49277 -35599 -73926 -120781 -145176 -93091
19886 -93091 -11079 21335 26393 56015 60092 94616 45371 -34604 -82469 -77419 -27080 -25633
19874 -25633 -81497 -105370 -56363 -25348 35791 35011 7326 8352 80097 100463 65726 11723
19862 11723 -38522 -16127 -6792 -54345 -16828 11692 -51745 -75308 -84655 -41883 -13917 18980
19850 18980 44280 46074 53217 25372 1734 49937 23727 -46030 -40406 38962 24240 -12410
19838 -12410 -6582 -47480 -106994 -47147 -27123 -54266 -43218 -116561 -113684 -88644 -56106 3125
$$ packed form
19923b3480j5888K4956r00r529O7118M8799O107J3350k8555j0527K367m895n3389
19910A5534o0438k5174j0531M4718O306k384O2641K7417n9748j6144O9012J1872
19898F3081j285m682O255n6403r1865N165L0457J3678l8327m6855k4395N2085
19886i3091Q2012L2414N058K9622M077L4524m9245p9975m7865N050N0339J447
19874b5633n5864k3873M9007L1015O1139p80k7685J026P1745K0366l4737n4003
19862A1723n0245K2395R335m7553L7517K8520o3437k3563r347M2772K7966L2897
19850A8980K5300J794P143k7845k3638M8203k6210o9757N624P9368j4722l6650
19838a2410N828m0898n9514N9847K0024k7143J1048p3343K877K5040L2538N9231
$$ plain form
19826 3125 55549 90503 93854 26589 35627 55870 21653 -23439 -38541 -31364 7546 -1140 -43989
19813 -43989 31601 99835 76761 40998 -25447 4189 43194 47434 48177 42775 14430 -19917
19801 -19917 -44113 -28931 -43924 -45943 7793 -18292 -59818 -54707 -63570 -75498 -105929 -83366
19789 -83366 -109604 -91165 -10029 -59106 -37907 -11288 8301 27409 49630 25620 9256 809
19777 809 8313 -42192 -70740 -47947 -23080 36094 76918 18472 -48362 -55975 -11063 3986
19765 3986 934 -26903 -2268 105126 117610 66552 46291 31774 22366 -5969 -16330 17625
19753 17625 76822 71389 61527 34175 73845 51371 -35186 -99658 -107661 -49209 -13201 -68129
19741 -68129 -102233 -82840 -62261 -39751 -11866 -7 -19410 -27948 18500 -12756 -16542 -44
$$ packed form
19826C125N2424L4954L351o7265R038K0243l4217m5092j5102P177L8910q686m2849
19813d3989P5590O8234k3074l5763o6445K9636L9005M240P43n402k8345l4347
19801a9917k4196J5182j4993k019N3736k6085m1526N111q863j1928l0431K2563
19789h3366k6238J8439Q1136m9077K1199K6619J9589J9108K2221k4010j6364q447
19777H09P504n0505k8548K2793K4867N9174M0824n8446o6834p613M4912J5049
19765C986l052k7837K4635J07394J2484n1058k0261j4517r408k8335j0361L3955
19753A7625N9197n433r862k7352L9670k2474q6557o4472q003N8452L6008n4928
19741f8129l4104J9393K0579K2510K7885J1859j9403q538M6448l1256l786J6498
$$ plain form
19729 -44 28928 60816 48415 61103 72088 29788 -2731 -61272 -105270 -42868 4262 29099
19717 29099 29610 -23812 -36791 -9816 -37535 -117869 -129876 -120439 -51583 -62126 -74975 -72306
19705 -72306 -31330 480 -43536 -7501 -9901 18839 63019 42241 25826 -4883 8840 67960
19693 67960 113557 88744 39102 -38032 -53929 -69642 -52803 18320 36669 50274 19088 32640
19681 32640 38324 62970 57150 88736 56215 19203 40656 10237 9388 21466 1473 -31657
19669 -31657 -453 21321 16148 -34829 -59528 -62454 -18009 13518 -14687 -38521 5641 -896
19657 -896 5881 22815 11603 54923 58445 98058 115028 129559 150440 99466 78910 52957
19645 52957 48769 9475 3846 35066 32197 67984 86349 113286 146732 160952 122795 136258
$$ packed form
19729d4K8972L1888j2401J2688J0985m2300l2519n8541m3998O2402M7130K4837
19717B9099N11n3422j2979K6975k7719q0334j2007R437O8856j0543j2849K669
19705g2306M0976L1810m4016L6035k400K8740M4180k0778j6415l0709J3723N9120
19693F7960M5597k4813m9642p7134j5897j5713J6839P1123J8349J3605l1186J3552
19681C2640N684K4646n820L1586l2521l7012K1453l0419q49J2078j9993l3130
19669c1657L1204K1774n173n0977k4699k926M4445L1527k8205k3834M4162o537
19657h96O777J6934j1212M3320L522L9613J6970J4531K0881n0974k0556k5953
19645E2957m188l9294n629L1220k869L5787J8365K6937L3446J4220l8157J3463
$$ plain form
19633 136258 112892 65402 93064 88990 89379 94164 115707 57147 44922 82009 87644 152891
19621 152891 175703 142591 117555 91558 56798 15820 12508 73525 129296 131570 126112 62302
19609 62302 23345 19337 7431 37057 16023 31888 69997 79162 46129 65085 143836 173957
19597 173957 131465 121435 116806 121326 141190 130986 149619 134809 77657 79954 102801 86644
19585 86644 93366 108943 112200 140912 156469 173194 175871 203656 271741 421533 539648 565076
19573 565076 551537 542677 531216 439131 321643 298679 293104 366746 445178 544222 608852 643880
19561 643880 612655 603137 581755 441041 338906 200155 125912 122855 191242 213264 159087
19550 159087 90581 66719 51246 27676 42062 3011 19345 108989 140817 168274 81903
$$ packed form
19633A36258k3366m7490K7662m074L89M785K1543n8560j2225L7087N635O5247
19621A52891K2812l3112k5036k5997l4760m0978l312O1017N5771K274n458o3810
19609F2302l8957m008j1906K9626k1034J5865L8109R165l3033J8956P8751L0121
19597A73957m2492j0030m629M520J9864j0204J8633j4810n7152K297K2847j6157
19585H6644O722J5577L257K8712J5557J6725K677K7785O8085J49792J18115K5428
19573E65076j3539q860j1461r2085j17488k2964n575P3642P8432R9044O4630L5028
19561F43880l1225r518k1382j40714j02135j38751p4243l057O8387K2022n4177
19550A59087o8506k3862j5473k3570J4386l9051J6334Q9644L1828K7457q6371
$$ plain form
19539 81903 80340 47146 33263 37678 103219 168125 167017 174423 185912 270009 340969 406944
19527 406944 451585 509848 554243 559580 536146 467321 401873 394127 321623 268200 284575 390352
19515 390352 513355 581750 596733 584517 496989 384053 277120 227522 181577 174138 139185
19504 139185 126728 100607 41157 24928 67623 58438 64462 100441 109767 48359 59522 75021
19492 75021 51401 101891 136621 119249 98703 81726 70787 60640 59173 46335 43956 52079
19480 52079 24429 41970 118549 135434 130983 114312 80477 94392 99312 84335 23813 -20152
19468 -20152 -11038 1854 -28263 -4116 24755 25564 58592 44125 9119 -26877 -3863 52135
19456 52135 33256 -30414 -29522 -39342 -18515 -32125 -8327 39267 13842 48734 118247 138323
$$ packed form
19539H1903j563l3194j3883M415O5541O4906j108P406J1489Q4097P0960O5975
19527D06944M4641N8263M4395N337k3434o8825o5448p746p2504n3423J6375J05777
19515C90352J23003O8395J4983j2216q7528j12936j06933m9598m5945p439l4953
19504A39185j2457k6121n9450j6229M2695r185O024L5979R326o1408J1163J5499
19492G5021k3620N0490L4730j7372k0546j6977j0939j0147j467j2838k379Q123
19480E2079k7650J7541P6579J6885m451j6671l3835J3915M920j4977o0522m3965
19468b0152R114J2892l0117K4147K8871Q09L3028j4467l5006l5996K3014N5998
19456E2135j8879o3670Q92r820K0827j3610K3798M7594k5425L4892O9513K0076
$$ plain form
19444 138323 77312 -39137 -31752 21503 28679 34096 61065 52915 27437 24589 82004 92368
19432 92368 39264 18179 39347 11197 14709 69214 90342 41417 52502 96836 115504 121395
19420 121395 32456 394 -414 -14324 -37553 9191 41056 12002 -52829 -53395 -12736 -12698 12379
19407 12379 6695 29260 17323 23202 23641 15746 19137 10182 -23532 -16280 -24824 -15231 -19471 12145
19393 12145 87178 51232 18668 7683 57006 109712 95020 78420 93638 122716 109033 81514
19381 81514 96850 79674 53185 78829 57029 37997 34604 47370 79010 26494 17060 18898
19369 18898 -19091 29415 77377 67212 70511 78680 113053 57396 -15651 17707 61008 72773
19357 72773 64515 47183 -381 -54436 -29771 36480 45041 29027 24882 58380 73105 78217
$$ packed form
19444A38323o1011j16449P385N3255P176N417K6969q150k5478k848N7415J0364
19432I2368n3104k1085K1168k8150L512N4505K1128m8925J1085M4334J8668N891
19420A21395q8939l2062q08j3910k3229M6744L1865k9054o4831n66M0659L8K5077
19407A2379n684K2565j1937N879M39p895L391q955l3714P252q544R593m240L1616
19393A2145P5033l5946l2564j0985M9323N2706j4692j6600J5218K9078j3683k7519
19381H1514J5336j7176k6489K5644k1800j9032l393J2766L1640n2516r434J838
19369A8898l7989M8506M7962j0165L299Q169L4373n5657p3047L3358M3301J1765
19357G2773q258j7332m7564n4055K4665O6251Q561j6014m145L3498J4725N112
$$ plain form
19345 78217 51083 44031 19184 33553 88147 72629 81468 55373 31306 44585 38330 35519
19333 35519 40661 49227 -6136 -1555 62631 36345 -33910 -1837 35951 82508 98576 80813
19321 80813 69421 64019 43437 114137 142009 129507 139967 130012 102156 49888 31052 75794
19309 75794 92395 84852 95060 124844 95280 79156 81273 72542 58899 66288 85067 48800
19297 48800 9437 28455 12106 37045 58923 111931 88939 31254 33638 31784 18667 7956
19285 7956 32201 -15950 22473 70955 136931 157067 83231 -7438 11931 55883 119177 165212
19273 165212 189513 135499 93680 63443 27628 38094 140648 152426 123336 143728 146344
19262 146344 133768 125362 119098 110905 116150 90279 57874 90656 137549 192256 164326 115333
$$ packed form
19345G8217k7134p052k4847J4369N4594j5518Q839k6095k4067J3279o255k811
19333C5519N142Q566n5363M581O4186k6286p0255L2073L7788M6557J6068j7763
19321H0813j1392n402k0582P0700K7872j2502J0460r955k7856n2268j8836M4742
19309G5794J6601p543J0208K9784k9564j6124K117q731j3643P389J8779l6267
19297D8800l9363J9018j6349K4939K1878N3008k2992n7685K384j854j3117j0711
19285G956K4245m8151L8423M8482O5976K0136p3836r0669J9369M3952O3294M6035
19273A65212K4301n4014m1819l0237l5815J0466J02554J1778k9090K0392K616
19262A46344j2576q406o264q193N245k5871l2405L2782M6893N4707k7930m8993
$$ plain form
19250 115333 74270 41652 784 -4725 38116 75915 95124 91750 72099 99220 86231 56493
19238 56493 63247 27516 12745 72338 95752 74267 117388 51990 -11714 -24780 18521 60406
19226 60406 80137 72741 98050 163645 122377 56774 68915 72364 83055 88308 125273 166966
19214 166966 143058 108671 89514 124774 173265 224579 222184 179434 132895 75253 64507 66851
19202 66851 49533 104808 175561 224256 193756 156388 121614 119871 140177 188823 245659 303852
19190 303852 287741 255925 232467 231432 221252 230048 236865 221548 259858 277608 270238 220146
19178 220146 239208 166611 144568 181818 171747 192129 175259 184736 217698 166663 137703 157099
19166 157099 210692 200422 222761 233799 257572 233545 198213 235502 277611 224978 163531
$$ packed form
19250A15333m1063l2618m0868n509M2841L7799J9209l374j9651K7121j2989k9738
19238E6493O754l5731j4771N9593K3414k1485M3121o5398o3704j3066M3301M1885
19226F0406J9731p396K5309O5595m1268o5603J2141L449J0691N253L6965M1693
19214A66966k3908l4387j9157L5260M8491N1314k395m2750m6539n7642j0746K344
19202F6851j7318N5275P0753M8695l0500l7368l4774j743K0306M8646N6836N8193
19190C03852j6111l1816k3458j035j0180Q796O817j5317L8310J7750p370n0092
19178B20146J9062p2597k2043L7250j0071K0382j6870R477L2962n1035k8960J9396
19166A57099N3593j0270K2339J1038K3773k4027l5332L7289M2109n2633o1447
$$ plain form
19155 163531 210427 259718 228565 227429 175963 160560 190439 254928 276459 288987 316703 279565
19143 279565 285146 307814 301496 282670 268151 217545 182050 212035 247006 273645 296708 307713
19131 307713 299214 293654 281662 362162 407263 416398 353239 305458 320146 315954 320642 340898
19119 340898 383535 364686 363136 414070 429899 453200 486393 468528 489763 546302 607679 621462
19107 621462 593822 580881 585328 629637 677454 698983 706722 812743 892845 938702 1023362 1120380
19095 1120380 1145813 1224113 1377526 1641015 1889424 2073077 2130800 2153849 2178987 2265816
19085 2265816 2470742 2812638 3201914 3687206 4237556 4804124 5167835 5375478 5536803
19076 5536803 5644012 5820381 6165905 6831131 7858520 9443679 11934241 15890075 22148460
$$ packed form
19155A63531M6896M9291l1153j136n1466j5403K9879O4489K1531J2528K7716l7138
19143B79565N581K2668o318j8826j4519n0606l5495K9985L4971K6639K3063J1005
19131C07713q499n560j1992Q0500M5101R135o3159m7781J4688m192M688K0256
19119C40898M2637j8849j550N0934J5829K3301L3193j7865K1235N6539O1377J3783
19107F21462k7640j2941M447M4309M7817K1529P739J06021Q0102M5857Q4660R7018
19095A120380K5433P8300J53413K63489K48409J83653N7723K3049K5138Q6829
19085B265816K04926L41896L89276M85292N50350N66568L63711K07643J61325
19076E536803J07209J76369L45524O65226J027389J585159K490562L955834O258385
$$ plain form
19067 22148460 32373577 48489864 69638407 87537558 96020500 98722787 96723116
19060 96723116 85416813 67777528 52111947 44047381 43544566 50412130 65821332 87752090
19052 87752090 105810635 113082094 111576947 100210508 79498636 56636614 39106627
19045 39106627 28345739 21995180 18049352 15434237 13599974 12333205 11416634 10741485
19037 10741485 10243730 9884740 9562166 9221245 9013433 8944906 8983276 9055647 9087875 9101446
19027 9101446 9199860 9505537 10077165 10949424 12290927 14378660 17641434 22948996 31669528
19018 31669528 45956454 66627078 87664686 100919940 106380204 107522613 99984112
19011 99984112 82499292 62930575 49662174 44678619 46789652 56496943 74947551
$$ packed form
19067B2148460J0225117J6116287K1148543J7899151Q482942K702287j999671
19060I6723116j1306303j7639285j5665581q064566n02815O867564J5409202K1930758
19052H7752090J8058545P271459j505147j1366439k0711872k2862022j7529987
19045C9106627j0760888o350559l945828k615115j834263j266769r16571o75149
19037A0741485m97755l58990l22574l40921k07812o8527L8370P2371L2228J3571
19027I101446R8414L05677N71628Q72259J341503K087733L262774N307562Q720532
19018C1669528J4286926K0670624K1037608J3255254N460264J142409p538501
19011I9984112j7484820j9568717j3268401m983555K111033R707291J8450608
$$ plain form
19004 74947551 98276813 115414392 121496878 118248326 103986489 80761208 56819830
18997 56819830 39283772 28526807 21937519 17658605 14749461 12686227 11281149 10245587
18989 10245587 9364906 8622714 7905865 7213949 6589151 6072388 5600570 5216030 4807627
18980 4807627 4496315 4310462 4190566 4170459 4098133 3985979 3891240 3663301 3429583 3194561
18970 3194561 2914818 2704297 2402522 2115498 1938920 1857991 1718227 1620137 1579442 1489110
18960 1489110 1366207 1287006 1219763 1175905 1143217 1102949 1017271 973471 917484 964542 970552
18949 970552 963269 915541 869138 878940 881946 855614 797338 674900 644200 636105 620597 645863
18937 645863 623818 598322 573244 514522 462477 409810 393954 440154 511626 496190 438962
$$ packed form
19004G4947551K3329262J7137579O082486l248552j4261837k3225281k3941378
18997E6819830j7536058j0756965o589288m278914k909144k063234j405078j035562
18989A0245587q80681p42192p16849o91916o24798n16763m71818l84540m08403
18980D807627l11312j85853j19896k0107p2326j12154r4739k27939k33718k35022
18970C194561k79743k10521l01775k87024j76578q0929j39764r8090m0695r0332
18960A489110j22903p9201o7243m3858l2688m0268q5678m3800n5987M7058O010
18949I70552p283m7728m6403R802L006k6332n8276j22438l0700q095j5508K5266
18937F45863k2045k5496k5078n8722n2045n2667j5856M6200P1472j5436n7228
$$ plain form
18926 438962 466518 413224 357467 317841 350283 354253 417882 451500 412604 390753 420622 394383
18914 394383 329290 305023 321639 322562 312999 351573 378995 344998 297887 300510 277444 246073
18902 246073 265885 225034 262502 205258 214658 241278 249501 291026 315947 319501 349359 329514
18890 329514 282101 269780 233420 226977 273177 221776 137286 134157 136176 182155 166551 190216
18878 190216 212483 235113 260108 275941 184588 153021 182837 184549 199152 150814 135594 123232
18866 123232 117236 142424 117409 158252 182633 161213 157400 115799 140828 141068 152198 171377
18854 171377 160766 132563 91756 111310 159228 122767 91078 69423 117492 157338 148235 96187
18842 96187 122717 119497 65931 95695 100327 123186 128097 97197 128721 121450 135676 221374
$$ packed form
18926D38962K7556n3294n5757l9626L2442L970O3629L3618l8896k1851K9869k6239
18914C94383o5093k4267J6616R23r563L8574K7422l3997m7111K623k3066l1371
18902B46073J9812m0851L7468n7244R400K6620Q223M1525K4921L554K9858j9845
18890C29514m7413j2321l6360o443M6200n1401q4490l129K019M5979j5604K3665
18878A90216K2267K2630K4995J5833r1353l1567K9816J712J4603m8338j5220j2362
18866A23232n996K5188k5015M0843K4381k1420l813m1601K5029K40J1130J9179
18854A71377j0611k8203m0807J9554M7918l6461l1689k1655M8069L9846r103n2048
18842I6187K6530l220n3566K9764M632K2859M911l0900L1524p271J4226Q5698
$$ plain form
18830 221374 255320 199410 146923 116768 98300 84715 104538 119798 106412 133171 207199
18819 207199 159289 110595 85007 113253 109167 147850 184714 163265 136533 134065 134593 115720
18807 115720 95777 77747 107360 148539 136699 137498 140634 108331 135258 143564 116306 122558
18795 122558 101817 121703 128080 132688 129132 92987 106598 112879 76604 55414 147146 245110
18783 245110 257154 265362 320938 296139 252979 224142 195196 183363 172339 190139 287076 245531
18771 245531 239584 298563 346869 402855 507485 592680 507027 351545 259377 227416 237062
18760 237062 222205 178936 194004 195376 143125 94630 85622 105888 149624 168931 158194 135071
18748 135071 142470 131988 137881 106258 121608 143860 162529 178876 149278 120740 99519 122726
$$ packed form
18830B21374L3946n5910n2487l0155j8468j3585J9823J5260j3386K6759P4028
18819B07199m7910m8694k5588K8246m086L8683L6864k1449k6732k468N28j8873
18807A15720j9943j8030K9613M1179j1840P99L136l2303K6927Q306k7258O252
18795A22558k0741J9886O377M608l556l6145J3611O281l6275k1190R1732R7964
18783B45110J2044Q208N5576k4799m3160k8837k8946j1833j1024J7800R6937m1545
18771B45531n947N8979M8306N5986J04630Q5195q5653j55482r2168l1961R646
18760B37062j4857m3269J5068J372n2251m8495r008K0266M3736J9307j0737k3123
18748A35071P399j0482N893l1623J5350K2252J8669J6347k9598k8538k1221K3207
$$ plain form
18736 122726 158028 142490 135456 134614 115343 102976 91753 105462 152364 197478 187113 201294
18724 201294 241185 190332 129128 130571 121408 124727 131437 172466 172425 135152 149249 168260 158320
18711 158320 101264 134262 176541 215495 190030 166669 131118 100738 85091 88844 116156 84608
18699 84608 92175 110194 134599 205258 220579 172637 147347 118954 116329 112410 123126 164496
18687 164496 137545 116518 90662 140351 136672 135246 133505 107345 113681 152610 151444 127987
18675 127987 92955 72275 114351 203838 241178 253011 244899 233278 220509 218998 272370 264337
18663 264337 272393 252339 231395 253929 267000 276295 260402 274411 272794 259580 265158 233841
18651 233841 201454 231468 247082 255938 288174 255986 294802 355087 385106 349413 302796 290300
$$ packed form
18736A22726L5302j5538p034q42j9271j2367j1223J3709M6902M5114j0365J4181
18724B01294L9891n0853o1204J443r163L319O710M1029m1l7273J4097J9011r940
18711A58320n7056L2998M2279L8954k5465k3361l5551l0380j5647L753K7312l1548
18699H4608P567J8019K4405P0659J5321m7942k5290k8393k625l919J0716M1370
18687A64496k6951k1027k5856M9689l679j426j741k6160O336L8929j166k3457
18675A27987l5032k0680M2076Q9487L7340J1833q112j1621j2769j511N3372q033
18663B64337Q056k0054k0944K2534J3071R295j5893J4009j617j3214N578l1317
18651B33841l2387L0014J5614Q856L2236l2188L8816O0285L0019l5693m6617j2496
$$ plain form
18639 290300 281932 332352 329183 342827 360253 387811 364490 398348 447353 485786 617964 755286
18627 755286 948907 1188206 1410794 1450822 1491309 1512716 1481318 1308067 1124201 1051541
18617 1051541 1104439 1340806 1696762 2048594 2207953 2268707 2323135 2299435 2061994 1779853
18607 1779853 1672283 1526195 1362409 1292357 1253519 1310472 1364900 1451944 1635651 1843464
18597 1843464 1978373 2125336 2285569 2298532 2311000 2457318 2709325 3036423 3522096 4249831
18587 4249831 5210947 6586835 8674435 11809236 16729286 24841619 37770037 54189230
18579 54189230 63599961 58107577 44144897 31499763 24226159 20730117 19594091 20322948
18571 20322948 23409365 30217736 42039500 56932548 63888047 56493122 41735702 28985639
$$ packed form
18639B90300q368N0420l169J3644J7426K7558k3321L3858M9005L8433J32178J37322
18627G55286J93621K39299K22588M0028M0487K1407l1398j73251j83866p2660
18617A051541N2898K36367L55956L51832J59359O0754N4428k3700k37441k82141
18607A779853j07570j46088j63786p0052l8838N6953N4428Q7044J83707K07813
18597A843464J34909J46963J60233J2963J2468J46318K52007L27098M85673P27735
18587D249831R61116J375888K087600L134801M920050Q112333J2928418J6419193
18579E4189230R410731n492384j3962680j2645134p273604l496042j136026P28857
18571B0322948L086417O808371J1821764J4893048O955499p394925j4757420j2750063
$$ plain form
18563 28985639 21317916 16652240 13382779 11023913 9328908 8171840 7334941 6772996
18555 6772996 6431822 6215607 6139513 6145253 6337151 6621943 6857038 6911838 6875094 7111685
18545 7111685 7701569 8360504 8889404 9445628 10214630 11543447 13744925 17109784 22001220
18536 22001220 29917558 42887886 61511059 77935507 78789272 67468021 55610931
18529 55610931 52548498 59482672 74517529 88540420 89026144 79864046 73138439 77119709
18521 77119709 86908339 88277477 77991313 65293523 60448093 66183949 77510358 80461801
18513 80461801 68737090 50407019 35512012 26448233 20865515 17197926 14646173 12762250
18505 12762250 11409238 10466021 9934327 9645726 9416393 9263272 9240810 9361166 9540703
$$ packed form
18563B8985639p667723m665676l269461k358866j695005j157068q36899n61945
18555F772996l41174k16215p6094N740J91898K84792K35095N4800l6744K36591
18545G111685N89884O58935N28900N56224P69002J328817K201478L364859M891436
18536B2001220P916338J2970328J8623173J6424448Q53765j1321251j1857090
18529E5610931l062433O934174J5034857J4022891M85724r162098o725607L981270
18521G7119709R788630J369138j0286164j2697790m845430N735856J1326409K951443
18513H0461801j1724711j8330071j4895007r063779n582718l667589k551753j883923
18505A2762250j353012r43217n31694k88601k29333j53121k2462J20356J79537
$$ plain form
18496 9540703 9598490 9369903 8894694 8412115 8232427 8379048 8753766 9226402 9909721 11104525
18486 11104525 13121805 16319107 20800226 27771684 39423177 57400096 76811044 81763305
18478 81763305 69184264 50069948 35811616 28141313 24673337 24167034 26238451 31682426
18470 31682426 42177431 58624683 75237286 77057935 62888883 43637903 29429555
18463 29429555 21073468 15980145 12684079 10344304 8653556 7441787 6470671 5717014
18455 5717014 5150249 4827978 4655818 4507484 4399583 4295999 4241910 4151218 3830876 3366592
18445 3366592 2964191 2666645 2543511 2509558 2507811 2507245 2612522 2722500 2795923 2624229 2285927
18434 2285927 1950637 1677850 1417850 1288567 1266753 1212012 1189249 1098856 1022922 1010616
$$ packed form
18496I540703N7787k28587m75209m82579j79688J46621L74718M72636O83319J194804
18486A1104525K017280L197302M481119O971458J1651493J7976919J9410948M952261
18478H1763305j2579041j9114316j4258332p670303l467976n06303K071417N443975
18470C1682426J0495005J6447252J6612603J820649j4169052j9250980j4208348
18463B9429555q356087n093323l296066k339775j690748j211769r71116p53657
18455E717014n66765l22271j72160j48334j07901j03584n4089r0692l20342m64284
18445C366592m02401k97546j23134l3953j747n66J05277J09978P3423j71694l38302
18434B285927l35290k72787k60000j29283k1814n4741k2763r0393p5934j2306
$$ plain form
18424 1010616 1005579 968963 947754 966357 915743 845559 782512 763983 799744 780906 707388
18413 707388 682344 683500 720318 742040 731369 750034 704503 676288 643728 585403 583371 566649
18401 566649 451127 405552 398943 508986 529819 520584 581976 511584 392604 366237 384213
18390 384213 350068 325117 315845 303652 279514 317314 392658 434220 379026 368034 350563 343937
18378 343937 315968 351481 362406 292572 281341 308426 327115 340306 338272 374053 469216 476758
18366 476758 413930 361616 389980 415702 461529 465867 412130 362856 405635 385709 316559 322416
18354 322416 323260 317897 307445 247951 187660 168836 160120 183207 245041 254246 233364 201906
18342 201906 229735 210643 160792 130628 109896 121781 176575 188292 167275 156930 133759
$$ packed form
18424A010616n037l6616k1209J8603n0614p0184o3047j8529L5761j8838p3518
18413G07388k5044J156L6818K1722j0671J8665m5531k8215l2560n8325k032j6722
18401E66649j15522m5575o609J10043K0833r235O1392p0392j18980k6367J7976
18390C84213l4145k4951r272j2193k4138L7800P5344M1562n5194j0992j7471o626
18378C43937k7969L5513J0925o9834j1231K7085J8689J3191k034L5781R5163P542
18366D76758o2828n2314K8364K5722M5827M338n3737m9274M2779j9926o9150N857
18354C22416Q44n363j0452n9494o0291j8824q716K3087O1834R205k0882l1458
18342B01906K7829j9092m9851l0164k0732J1885N4794J1717k1017j0345k3171
$$ plain form
18331 133759 162815 113033 142402 112034 97446 138401 194774 203918 217793 203873 171518 177808
18319 177808 193176 218813 225715 179337 152450 198332 232051 215843 198198 221272 236610 243678
18307 243678 250336 202981 157862 185998 247900 239590 250513 274972 278116 312437 424736 545687
18295 545687 557070 510607 524457 603871 659295 679253 654619 603261 581773 552799 511826
18284 511826 496143 399711 392205 338821 330371 275088 290652 275320 240084 199249 230635 235391
18272 235391 207053 229568 280753 242602 239091 276574 304231 288962 269840 254251 267621 326023
18260 326023 398258 442825 412261 348144 388534 432861 448879 445894 458954 502030 639559
18249 639559 726080 754860 811468 842697 842111 916816 1001054 959621 894970 856059 851713 806358
$$ packed form
18331A33759K9056m9782K9369l0368j4588M0955N6373R144J3875j3920l2355O290
18319A77808J5368K5637O902m6378k6887M5882L3719j6208j7645K3074J5338P068
18307B43678O658m7355m5119K8136O1902q310J0923K4459L144L4321J12299J20951
18295E45687J1383m6463J3850P9414N5424J9958k4634n1358k1488k8974m0973
18284E11826j5683r6432p506n3384q450n5283J5564j5332l5236m0835L1386M756
18272B35391k8338K2515N1185l8151l511L7483K7657j5269j9122j5589J3370N8402
18260C26023P2235M4567l0564o4117M0390M4327J6018k985J3060M3076J37529
18249F39559Q6521K8780N6608L1229n86P4705Q4238m1433o4651l8911m346m5355
$$ plain form
18237 806358 784272 770530 692269 560060 452770 378415 354960 342505 327262 339850 288242
18226 288242 273654 255662 268285 300704 304249 357298 438421 508578 581329 655782 747190 880255
18214 880255 924630 945704 981727 1008557 1010477 957232 875295 774135 757276 695445 628948
18203 628948 659223 643770 571696 517628 522204 577673 554630 549291 558765 574287 541677 482552
18191 482552 388330 402499 394888 360409 304541 284211 219409 155894 182176 162857 173472 185536
18179 185536 182662 211772 243959 340604 313347 279365 266541 305488 317772 257055 228349 299373
18167 299373 356133 414552 523405 612720 695493 760733 864440 889867 866568 867457 881648
18156 881648 898518 865130 779072 692256 660770 664998 619691 504690 392009 353841 345272
$$ packed form
18237H06358k2086j3742p8261j32209j07290p4355k3455j2455j5243J2588n1608
18226B88242j4588j7992J2623L2419L545N3049Q1123P0157P2751P4453R1408J33065
18214H80255M4375K1074L6023K6830J920n3245q1937j01160j6859o1831o6497
18203F28948L0275j5453p2074n4068M576N5469k3043n339R474J5522l2610n9125
18191D82552r4222J4169p611l4479n5868k0330o4802o3515K6282j9319J0615J2064
18179A85536k874K9110L2187R6645k7257l3982j2824L8947J2284o0717k8706P1024
18167B99373N6760N8419J08853Q9315Q2773O5240J03707K5427k3299Q89J4191
18156H81648J6870l3388q6058q6816l1486M228m5307j15001j12681l8168q569
$$ plain form
18145 345272 353210 330896 350485 395167 425262 392056 427882 440355 431529 484011 531534 518520
18133 518520 531391 601632 624676 644676 730729 841772 1002041 1124416 1146140 1217354 1331633
18122 1331633 1428853 1619729 1940326 2290591 2775749 3504114 4499658 5805603 7729622
18113 7729622 10791016 16246953 26192686 44161630 73147470 97732382 89831526 62999380
18105 62999380 36850193 22782744 15586534 11495168 8955687 7212682 5979072 5069798
18097 5069798 4352176 3791400 3311054 2890775 2576714 2302369 2049838 1879311 1731009
18088 1731009 1584252 1507069 1458502 1390484 1304535 1225225 1084031 962116 949033 914924 883050
18077 883050 856740 850364 824139 819147 823445 866273 827064 711728 669367 677271 695575 702628
$$ packed form
18145C45272P938k2314J9589M4682L0095l3206L5826J2473q826N2482M7523j3014
18133E18520J2871P0241K3044K0000Q6053J11043J60269J22375K1724P1214J14279
18122A331633R7220J90876L20597L50265M85158P28365R95544J305945J924019
18113G729622L061394N455937R945733J7968944K8985840K4584912p900856k6832146
18105F2999380k6149187j4067449p196210m091366k539481j743005j233610r09274
18097E069798p17622n60776m80346m20279l14061k74345k52531j70527j48302
18088A731009j46757p7183m8567o8018q5949p9310j41194j21915j3083l4109l1874
18077H83050k6310o376k6225m992M298M2828l9209j15336m2361P904J8304P053
$$ plain form
18065 702628 627636 629300 630097 649184 697075 693010 666721 617476 570804 510391 488135 517943
18053 517943 488556 448608 472273 475686 397907 329292 308453 274592 258421 306511 343686 309991
18041 309991 289399 321238 327241 333309 362841 407196 406493 365957 324463 326836 364950 388652
18029 388652 421988 453971 553376 612008 666971 688441 699753 661263 675983 686076 702513
18018 702513 684263 681199 619871 569584 536006 572276 651757 651608 646178 612853 559262 513167
18006 513167 471719 407436 317056 248637 256900 284900 271478 262415 264358 237728 271688 338120
17994 338120 363541 313070 264643 283195 311717 286437 254747 219494 281277 379468 448522
17983 448522 438876 390881 349485 325740 339420 393690 419078 411930 507007 601655 682966 677765
$$ packed form
18065G02628p4992J664P97J9087M7891m065k6289m9245m6672o0413k2256K9808
18053E17943k9387l9948K3665L413p7779o8615k0839l3861j6171M8090L7175l3695
18041C09991k0592L1839O003O068K9532M4355p03m0536m1494K373L8114K3702
18029C88652L3336L1983R9405N8632N4963K1470J1312l8490J4720J0093J6437
18018G02513j8250l064o1328n0287l3578L6270P9481j49n430l3325n3591m6095
18006E13167m1448o4283r0380o8419Q263K8000j3422r063J943k6630L3960O6432
17994C38120K5421n0471m8427J8552K8522k5280l1690l5253O1783R8191O9054
17983D48522r646m7995m1396k3745J3680N4270K5388p148R5077R4648Q1311n201
$$ plain form
17971 677765 613777 521167 407870 419068 457025 448950 425348 475521 512299 558359 645395
17960 645395 702230 637877 541011 403037 349834 344005 274331 233112 282298 285580 274560 225031
17948 225031 161641 233040 261990 246340 215013 185837 179208 186320 150978 131176 172848 192424
17936 192424 209072 211488 238670 253225 214817 189330 191049 229921 214529 192771 176901 143953
17924 143953 141101 147910 153343 222140 268669 296913 282298 281825 267484 318041 315407 319161 276027
17911 276027 285681 351045 388456 403319 373389 415426 385165 329424 283733 204682 198489 244920
17899 244920 249521 259197 255968 248725 277939 276124 241072 261402 344730 348402 312568 290527 252091
17886 252091 245998 215322 205929 161521 171113 254035 245971 272971 265678 281458 321487 352445
$$ packed form
17971F77765o3988r2610j13297J1198L7957q075k3602N0173L6778M6060Q7036
17960F45395N6835o4353r6866j37974n3203n829o9674m1219M9186L282j1020m9529
17948B25031o3390P1399K8950j5650l1327k9176o629P112l5342j9802M1672J9576
17936A92424J6648K416K7182J4555l8408k5487J719L8872j5392k1758j5870l2948
17924A43953k852O809N433O8797M6529K8244j4615m73j4341N0557k634L754m3134
17911B76027R654O5364L7411J4863k9930M2037l0261n5741m5691p9051o193M6431
17899B44920M601R676l229p243K9214j815l5052K0330Q3328L672l5834k2041l8436
17886B52091o093l0676r393m4408R592Q2922q064K7000p293J5780M0029L0958
$$ plain form
17874 352445 343095 336628 346545 369293 381139 358208 392886 437147 420565 374818 396199 431867
17862 431867 404041 399625 389355 413568 391604 345611 344043 354844 318124 289199 283586 245286
17850 245286 260721 345980 409760 421700 414508 458497 498826 516851 502451 528349 532252 512137
17838 512137 453561 475640 519609 527126 514936 485048 519173 496322 469084 554583 580852 551512
17826 551512 559849 558414 586598 627344 674368 724597 779577 813637 853211 874705 841275 864421
17814 864421 946446 1010689 1087290 1180233 1245513 1316300 1448497 1601146 1698467 1759332 1875986
17803 1875986 2052860 2227859 2424724 2512834 2495517 2480299 2609382 2786089 3075652 3354644
17793 3354644 3631823 4041639 4647549 5532042 6751053 8483271 11033551 14995791 21359236
$$ packed form
17874C52445r350o467R917K2748J1846k2931L4678M4261j6582m5747K1381L5668
17862D31867k7826m416j0270K4213k1964m5993j568J0801l6720k8925n613l8300
17850B45286J5435Q5259O3780J1940p192M3989M0329J8025j4400K5898L903k0115
17838E12137n8576K2079M3969P517j2190k9888L4125k2851k7238Q5499K6269k9340
17826E51512Q337j435K8184M0746M7024N0229N4980L4060L9574K1494l3430K3146
17814H64421Q2025O4243P6601R2943O5280P0787J32197J52649R7321O0865J16654
17803A875986J76874J74999J96865Q8110j7317j5218J29083J76707K89563K78992
17793C354644K77179M09816O05910Q84493J219011J732218K550280L962240O363445
$$ plain form
17784 21359236 30914108 41345797 46622168 47160401 48728174 57193351 72112235 83862772
17776 83862772 82019840 69974706 58704317 55377641 57765395 56568790 47548759 35224409
17768 35224409 25245172 19025065 15169062 12605936 10869315 9748806 8995009 8373981
17760 8373981 7895084 7579356 7388056 7307609 7366329 7511705 7729366 7921723 7967197 7963064
17750 7963064 8096811 8470291 8920726 9370179 9706444 10154496 11034117 12591203 14865186
17741 14865186 17851509 22042899 28609989 38897655 52835253 65695989 74672723 81055314
17733 81055314 88575676 102116186 120202161 134141796 139473121 135362749 125266738
17726 125266738 117451938 115074884 114240613 109037139 96127378 81678534 73016552 74372826
$$ packed form
17784B1359236R554872J0431689N276371N38233J567773Q465177J4918884J1750537
17776H3862772j842932j2045134j1270389l326676K387754j196605r020031j2324350
17768C5224409r979237o220107l856003k563126j736621j120509p53797o21028
17760H373981m78897l15728j91300q0447N8720J45376K17661J92357M5474m133
17750G963064J33747L73480M50435M49453L36265M48052Q79621J557086K273983
17741A4865186K986323M191390O567090J0287666J3937598J2860736Q976734O382591
17733H1055314P520362J3540510J8085975J3939635N331325m110372j0096011
17726A25266738p814800k377054q34271n203474j2909761j4448844q661982J356274
$$ plain form
17718 74372826 84921740 99437773 113228501 129147367 147490263 158954243 161615335
17711 161615335 159992868 153732205 142962711 131346292 117867008 101686233 85890027
17704 85890027 72308704 59366702 47410193 38192242 32060845 27734737 24505789 22212903
$$ packed form
17718G4372826J0548914J4516033J3790728J5918866J8342896J1463980K661092
17711A61615335j622467o260663j0769494j1616419j3479284j6180775j5796206
17704H5890027j3581323j2942002j1956509r217951o131397m326108l228948k292886
$$ [...]
##END NTUPLES=NMR SPECTRUM
##END=
