##TITLE=XTC-1153_1
##JCAMPDX= 6.0         $$ Bruker NMR JCAMP-DX V2.0
##DATA TYPE= NMR SPECTRUM
##DATA CLASS= NTUPLES
##ORIGIN= BRUKER
##OWNER= patiny
$$ 1.79 TOPSPIN		Version 3.0
$$ 2012-05-20 01:03:11.501 +0200  patiny@icmbsg005
$$ Compression mode = diff/dup
##.OBSERVE FREQUENCY= 400.13188181139
##.OBSERVE NUCLEUS= ^1H
##.ACQUISITION MODE= SIMULTANEOUS (DQD)
##.ACQUISITION SCHEME= undefined
##.AVERAGES= 16
##.DIGITISER RES= 23
##SPECTROMETER/DATA SYSTEM= spect
##.PULSE SEQUENCE= zg30
##.SOLVENT NAME= D2O
##.SHIFT REFERENCE= INTERNAL, D2O, 1, 11.697
##AUDIT TRAIL= $$ (NUMBER, WHEN, WHO, WHERE, PROCESS, VERSION, WHAT)
$$ ##TITLE= Audit trail, TOPSPIN		Version 3.0
$$ ##JCAMPDX= 5.01
$$ ##ORIGIN= Bruker BioSpin GmbH
$$ ##OWNER= patiny
$$ $$ /opt/data/patiny/nmr/XTC-1153_1/10/pdata/1/auditp.txt
$$ ##AUDIT TRAIL=  $$ (NUMBER, WHEN, WHO, WHERE, PROCESS, VERSION, WHAT)
(   1,<2012-05-20 01:03:09.523 +0200>,<patiny>,<icmbsg005>,<go>,<TOPSPIN 3.0>,
      <created by zg
	started at 2012-05-20 01:01:04.681 +0200,
	POWCHK enabled, PULCHK disabled,
       configuration hash MD5:
       77 C7 B7 C4 10 F4 BA 30 64 2E BB 52 82 F2 DA 41
       data hash MD5: 64K
       9E 9F 66 D9 9E 1B 35 DA 55 D9 6A 2B 45 5C 37 2E>)
(   2,<2012-05-20 01:03:10.145 +0200>,<patiny>,<icmbsg005>,<audit>,<TOPSPIN 3.0>,
      <user comment:
       ICON-NMR User ID: patiny
       data hash MD5: 64K
       9E 9F 66 D9 9E 1B 35 DA 55 D9 6A 2B 45 5C 37 2E>)
(   3,<2012-05-20 01:03:10.757 +0200>,<patiny>,<icmbsg005>,<proc1d>,<TOPSPIN 3.0>,
      <Start of raw data processing
       ef LB = 0.3 FT_mod = 6 PKNL = 1 SI = 64K 
       data hash MD5: 64K
       61 74 46 F8 7B 1E 0C 5E 02 19 8A 5B 72 92 BA AC>)
(   4,<2012-05-20 01:03:11.123 +0200>,<patiny>,<icmbsg005>,<proc1d>,<TOPSPIN 3.0>,
      <apk 
       data hash MD5: 64K
       ED 5E 74 44 CA F4 58 E8 1E 50 9C B8 FF F5 20 A5>)
(   5,<2012-05-20 01:03:11.153 +0200>,<patiny>,<icmbsg005>,<proc1d>,<TOPSPIN 3.0>,
      <abs ABSG = 5 
       data hash MD5: 64K
       77 09 B2 80 43 05 C2 56 04 33 53 DD 6A E2 B4 D8>)
$$ ##END=
$$ 
$$ $$ hash MD5
$$ $$ 08 D1 94 47 6C F9 5E 6D 5F B4 43 FF 96 B1 75 08
##$RELAX= 
##$RELAX= 
##$RELAX= 
##$RELAX= 
##$RELAX= 
##$RELAX= 
##$RELAX= 
##$RELAX= 
##$RELAX= 
##$RELAX= 
##$RELAX= 
##$RELAX= 
##$RELAX= 
$$ Bruker specific parameters
$$ --------------------------
##$DATPATH= </opt/data/patiny/nmr>
##$EXPNO= 10
##$NAME= <XTC-1153_1>
##$PROCNO= 1
##$ACQT0= -3.02521000389291
##$AMP= (0..31)
100 100 100 100 100 100 100 100 100 100 100 100 100 100 100 100 100 100
100 100 100 100 100 100 100 100 100 100 100 100 100 100
##$ANAVPT= -1
##$AQSEQ= 0
##$AQ_mod= 3
##$AUNM= <au_zg>
##$AUTOPOS= <31 >
##$BF1= 400.13
##$BF2= 400.13
##$BF3= 400.13
##$BF4= 400.13
##$BF5= 400.13
##$BF6= 400.13
##$BF7= 400.13
##$BF8= 400.13
##$BYTORDA= 0
##$CAGPARS= (0..11)
0 0 0 0 0 0 0 0 0 0 0 0
##$CFDGTYP= 0
##$CFRGTYP= 9
##$CHEMSTR= <none>
##$CNST= (0..63)
1 1 145 1 1 1 1 1 1 1 1 1 1 1 1 1 1 1 1 1 1 1 1 1 1 1 1 1 1 1 1 1 1 1 1
$$ [...]
##$TE1= 298.3794
##$TE2= 0
##$TE3= 0
##$TE4= 0
##$TEG= 300
##$TE_PIDX= 1
##$TE_STAB= (0..8)
2 2 0 0 0 0 0 0 0
##$TL= (0..7)
0 120 120 120 120 120 120 120
##$TP= (0..7)
150 150 150 150 150 150 150 150
##$TPNAME0= <>
##$TPNAME1= <>
##$TPNAME2= <>
##$TPNAME3= <>
##$TPNAME4= <>
##$TPNAME5= <>
##$TPNAME6= <>
##$TPNAME7= <>
##$TPOAL= (0..7)
0.5 0.5 0.5 0.5 0.5 0.5 0.5 0.5
##$TPOFFS= (0..7)
0 0 0 0 0 0 0 0
##$TUNHIN= 0
##$TUNHOUT= 0
##$TUNXOUT= 0
##$USERA1= <>
##$USERA2= <>
##$USERA3= <>
##$USERA4= <>
##$USERA5= <>
##$V9= 5
##$VALIST= <>
##$VCLIST= <>
##$VD= 0
##$VDLIST= <>
##$VPLIST= <>
##$VTLIST= <>
##$WBST= 1024
##$WBSW= 4
##$XGAIN= (0..3)
0 0 0 0
##$XL= 0
##$YL= 0
##$YMAX_a= 8312131
##$YMIN_a= -3152663
##$ZGOPTNS= <>
##$ZL1= 120
##$ZL2= 120
##$ZL3= 120
##$ZL4= 120
##$ABSF1= 11.697
##$ABSF2= -2.290992
##$ABSG= 5
##$ABSL= 3
##$ALPHA= 0
##$AQORDER= 0
##$ASSFAC= 0
##$ASSFACI= 0
##$ASSFACX= 0
##$ASSWID= 0
##$AUNMP= <save_auto_nonLDAP.pm>
##$AXLEFT= 0
##$AXNAME= <>
##$AXNUC= <1H>
##$AXRIGHT= 0
##$AXTYPE= 0
##$AXUNIT= <>
##$AZFE= 0.1
##$AZFW= 0.1
##$BCFW= 0
##$BC_mod= 0
##$BYTORDP= 0
##$COROFFS= 0
##$CY= 15
##$DATMOD= 1
##$DC= 0
##$DFILT= <>
##$DTYPP= 0
##$ERETIC= no
##$F1P= 0
##$F2P= 0
##$FCOR= 0.5
##$FTSIZE= 65536
##$FT_mod= 6
##$GAMMA= 0
##$GB= 0
##$INTBC= 1
##$INTSCL= 1
##$ISEN= 128
##$LB= 0.3
##$LEV0= 0
##$LPBIN= 0
##$MAXI= 10000
##$MC2= 0
##$MEAN= 0
##$ME_mod= 0
##$MI= 0
##$NCOEF= 0
##$NC_proc= -3
##$NLEV= 6
##$NOISF1= 0
##$NOISF2= 0
##$NSP= 0
##$NTH_PI= 0
##$NZP= 0
##$OFFSET= 11.697
##$PC= 1
##$PHC0= 122.1341
##$PHC1= -10.8113
##$PH_mod= 1
##$PKNL= yes
##$PPARMOD= 0
##$PPDIAG= 0
##$PPIPTYP= 0
##$PPMPNUM= 2147483647
##$PPRESOL= 1
##$PSCAL= 4
##$PSIGN= 0
##$PYNMP= <proc.py>
##$REVERSE= no
##$SF= 400.13
##$SI= 65536
##$SIGF1= 0
##$SIGF2= 0
##$SINO= 0
##$SIOLD= 65536
##$SPECTYP= <>
##$SREGLST= <1H.D2O>
##$SSB= 0
##$STSI= 65536
##$STSR= 0
##$SW_p= 5597.01492537316
##$SYMM= 0
##$S_DEV= 0
##$TDeff= 65536
##$TDoff= 0
##$TI= <>
##$TILT= no
##$TM1= 0
##$TM2= 0
##$TOPLEV= 0
##$USERP1= <>
##$USERP2= <>
##$USERP3= <>
##$USERP4= <>
##$USERP5= <>
##$WDW= 1
##$XDIM= 65536
##$YMAX_p= 303527722
##$YMIN_p= -36534
##$CURPLOT= <Cups-PDF>
##$CURPRIN= <$Cups-PDF>
##$DFORMAT= <normdp>
##$LAYOUT= <+/1D_H.xwp>
##$LFORMAT= <normlp>
##$PFORMAT= <normpl>
$$ End of Bruker specific parameters
$$ ---------------------------------
##NTUPLES= NMR SPECTRUM
##VAR_NAME=  FREQUENCY,     SPECTRUM/REAL,   SPECTRUM/IMAG
##SYMBOL=    X,             R,               I
##VAR_TYPE=  INDEPENDENT,   DEPENDENT,       DEPENDENT
##VAR_FORM=  AFFN,          ASDF,            ASDF
##VAR_DIM=   65536,         65536,           65536
##UNITS=     HZ,            ARBITRARY UNITS, ARBITRARY UNITS
##FACTOR=    0.0854036701259332, 1,          1
##FIRST=     5596.92952170303, 5413,         -17501
##LAST=      0,             8054,            -30764
##MIN=       0,             -36534,          0
##MAX=       5596.92952170303, 303527722,    0
$$ Real data points
##PAGE= N=1
##DATA TABLE= (X++(R..R)), XYDATA
$$ [...]
39857b7060O146M509K822K228J468J472J010k340p66K147K200J520a639B038K335
$$ -27060 -20914 -16405 -13583 -11355 -9887 -8415 -7405 -9745 -10511 -8364 -6164 -4644 -1639 2038 4373
39842D373K129O65j650j836R27R46j745g74o802m426l605j720L830O290K162L87
$$ 4373 6502 7167 5517 3681 4608 5554 3809 -774 -7576 -12002 -15607 -17327 -13497 -7207 -5045 -4658
39826d658b049D10J167C39a405a88A543K289q07a54k119j481l244k532p86k349
$$ -4658 -2049 410 1577 339 -1405 -188 1543 3832 3025 -154 -2273 -3754 -6998 -9530 -10316 -12665
39810a2665j909J566K079L95k00L890i64B938K582L391M570L894o96m039k368
$$ -12665 -14574 -13008 -10929 -10534 -10734 -6844 -964 2938 5520 8911 13481 17375 16679 12640 10272
39795A0272j818l056A585i36a41A386K516M375R66m347B255n82p97J433P15K175
$$ 10272 8454 5398 1585 -936 -141 1386 3902 8277 9243 4896 2255 1673 876 2309 3024 5199
39779E199K711q48k072j765r36n26o70r6O38p82d29Ad57q93d76j506k570n35J712
$$ 5199 7910 7062 4990 3225 2289 1763 1093 997 1635 853 -429 1 -457 -1350 -476 -1982 -4552 -5087 -3375
39760c375J128j407l031k451k600k588j772J303J705j040R27K801K124L70J172
$$ -3375 -2247 -3654 -6685 -9136 -11736 -14324 -16096 -14793 -13088 -14128 -13201 -10400 -8276 -7906 -6734
39745f734n76j257J106L356R56l392n259k181M039M458j035n903l716q19M22L101
$$ -6734 -7310 -8567 -7461 -4105 -3149 -6541 -11800 -13981 -9942 -5484 -6519 -12422 -16138 -16957 -16535 -13434
39729a3434L776J776m07L262g6D279L298J224j73p07K033J305l215B616a997j744
$$ -13434 -9658 -7882 -8289 -5027 -76 4279 7577 8801 8628 7921 9954 11259 8044 2616 -1997 -3741
39713c741l9J142L56p48n80n05f82D750N77n84q41l59J786j292b648o663p46K626
$$ -3741 -3780 -2638 -2282 -3030 -3610 -4115 -682 4750 5327 4743 3902 3543 5329 4037 -2648 -9311 -10057 -7431
39695g431J295o83j723j539j061j325l109j832M377N253K706Q25m27J231a684
$$ -7431 -6136 -6819 -8542 -10081 -11142 -12467 -15576 -17408 -13031 -7778 -5072 -4247 -4674 -3443 -1684
39679a085m69k59h38j152k097R19A415M383J000r74j701I90c265m581m312k537
$$ -1085 -1554 -1813 -838 -1990 -4087 -3168 1415 5798 6798 5824 4123 990 -3265 -7846 -12158 -14695
39663a4695K032L830K412k27P38J789N15L30R89j463m096k109k088j055J034K807
$$ -14695 -12663 -8833 -6421 -6648 -5910 -4121 -3606 -3276 -2287 -3750 -7846 -9955 -12043 -13098 -12064 -9257
39647i257J523l253n210k304K457M332J279r47j560r78O24K118R88L626c97E460
$$ -9257 -7734 -10987 -16197 -18501 -16044 -11712 -10433 -11380 -12940 -13918 -13294 -11176 -10188 -6562 -397 5460
39630I922L165N37m924C729I92h94k24R4D4K442O74Q70O94j58J366j958A942a93
$$ 9922 13087 13624 8700 3729 992 -894 -1118 -1024 44 2486 3160 4030 4724 4566 5932 3974 1942 -193
39611d400l004p24J923J683J317a091r19l019j66J718J102a057H33a192m579j062
$$ -4400 -7404 -8128 -6205 -4522 -3205 -1091 -2010 -5029 -5195 -3477 -2375 -1057 833 -1192 -5771 -6833
39595f833J148j679k845j710l661l293Q14M624J017j838k134N10K467K625J562
$$ -6833 -5685 -7364 -10209 -11919 -15580 -18873 -18059 -13435 -12418 -14256 -16390 -15880 -13413 -10788 -9226
39580i226k789l225J514d045F138J860K68K687K215K238N05n73r25j460k565l610
$$ -9226 -12015 -15240 -13726 -4045 6138 7998 8266 10953 13168 15406 15911 15338 14413 12953 10388 6778
39564F778B104a648L8g02k802l503j809P79L142c75B343J130j343b754k093a897
$$ 6778 2104 -1648 -1610 -702 -3504 -7007 -8816 -8037 -4895 -375 2343 3473 2130 -2754 -4847 -1897
39547CJ34K34A56N13J752q68d03N9D52K488L230K800k762a469n312j463L07K257
$$ 3 137 371 156 669 2421 1553 -403 -344 452 2940 6170 8970 6208 -1469 -6781 -8244 -7937 -5680
39529e680K697k49k560l174k988Q81M860J695p67j932j454R4K464J971j39k811
$$ -5680 -2983 -3232 -5792 -8966 -11954 -11073 -6213 -4518 -5285 -7217 -8671 -8577 -6113 -4142 -4281 -7092
39513g092m810m713j357L122L741K90k630J225L160J695J750P1j677L83j181l751
$$ -7092 -11902 -16615 -17972 -14850 -11109 -10819 -13449 -12224 -9064 -7369 -5619 -5548 -7225 -6842 -8023 -11774
39497a1774m75L116L194b070F96Q02Hc272k6N26k910k375J026J048J718b018J27
$$ -11774 -12249 -9133 -5939 -2070 696 1498 8 -3272 -3298 -2772 -5682 -8057 -7031 -5983 -4265 -2018 -1891
39480a891m32l99M58H36L560R67J968K313o35r67l169A976R42q39a950n942k262
$$ -1891 -2323 -2722 -2264 836 4396 5363 7331 9644 9009 8042 4873 1976 2918 2079 -1950 -7892 -10154
39463a0154K515R10J943i03D330L657M497N228q2m108n112D140j259r72C92a654
$$ -10154 -7639 -6729 -4786 -903 4330 7987 12484 17712 17630 13522 8410 4140 2881 1909 392 -1654
39446c683j80k7R04P90k99a084d48b2F42B68O23K444L024J730p5k468A975m88
$$ -3683 -3863 -3890 -2986 -2196 -2495 -1084 -448 -22 642 268 891 3335 6359 8089 8014 5546 1975 1487
39428A487J180C86a806k72n15o44j942r14j93l1J925B15M849K352j765A944b409
$$ 1487 2667 386 -1806 -2078 -2593 -3237 -5179 -6093 -6286 -6317 -4392 215 5064 7416 5651 1944 -2409
39410d706J102a396D518N142L69l373B539E57a156j883J458C65q4J273L802M775
$$ -4706 -3604 -1396 4518 9660 10029 6656 2539 557 -1156 -3039 -1581 365 281 1554 5356 10131
39394A0131L616K14j544L27L438N314K653J558L733N184M272L807L041N435J0051
$$ 10131 13747 13961 12417 12744 16182 21496 24149 25707 29440 34624 38896 42703 45744 51179 61230
39379F1230R414J0469J2273J0592O026P101J0825R591O528O148L602j6l119o566
$$ 61230 70644 81113 93386 103978 110004 117105 127930 137521 144049 150197 153799 153783 150664 144098
39365A44098r731j2143j2627j1391j0137r787j0195j0371r515n419m507n521l878
$$ 144098 134367 122224 109597 98206 88069 78282 68087 57716 48201 42782 38275 32754 28876
39352B8876k225m113o966o795m198p10K4n89L698O106M113P62l184k604l63n51
$$ 28876 26651 22538 15572 8777 4579 3869 3893 3304 7002 13108 17221 17983 14799 12195 11832 11281
39336A1281j118M88L287K70m024m605b62p547n954N37N676b510A832K631k116
$$ 11281 10163 10651 13938 14208 10184 5579 -262 -7809 -13763 -13226 -7550 -2510 1832 4463 2347
39321B347c889m173J914c055J364j420l217n39L088i25b57j629k74l80r34L76
$$ 2347 -3889 -8062 -6148 -3055 -1691 -3111 -6328 -6867 -3779 -925 -257 -1886 -2160 -2540 -3474 -3098
39305c098o66r04M01J169O97P94e90l19D91L502K492M52r09k542r53J790K829
$$ -3098 -3764 -4668 -4267 -3098 -2401 -1607 -590 -909 491 3993 6485 6937 6028 3486 2533 4323 7152
39288G152L329R95k765m267A235a334k244j084R67J635A009K833Q08n68J68O26
$$ 7152 10481 11476 8711 4444 1235 -1334 -3578 -4662 -3695 -2060 1009 3842 4650 4082 4250 4876
39272D876B261d52a45C118K750o08r54j169j477a015m205m234m063l571k132L12
$$ 4876 2261 -452 -145 3118 5868 5260 4306 3137 1660 -1015 -5220 -9454 -13517 -17088 -19220 -18908
39256a8908J650M719N161c095E2J1J3J077N2a02k648k965N00b528G07K189i46
$$ -18908 -17258 -12539 -7378 -3095 52 63 76 1153 1205 -102 -2750 -5715 -5215 -2528 707 2896 -946
39238f674l429j124L969c585N23K52l40Q7e54B479J619k16J645M851L279j46j11
$$ -6674 -10103 -11227 -7258 -3585 -3062 -2810 -3150 -3063 -554 2479 4098 3882 5527 10378 13657 13511 13400
39221A3400N18k319l966C287B14g45A35L153J858o86O53L375J147k762B866H12
$$ 13400 13918 11599 7633 3287 214 -745 135 3288 5146 4460 5113 8488 9635 6873 2866 812
39204A698P20k69i39l912j941j285K42j592m249N89M925d026a485B32J029i64
$$ 1698 2418 2149 -939 -4851 -6792 -8077 -7835 -9427 -13676 -13087 -8162 -4026 -1485 232 1261 -964
39187c647j437m164l342J946L622b056K14k800L57K028O45J83a90A101j50e4n05
$$ -3647 -5084 -9248 -12590 -10644 -7022 -2056 -1842 -4642 -4285 -2257 -1612 -1429 -190 1101 951 -54 -559
39170e59J32k207l278P32K160g01B227K047K043m82o29L0o66j686a067m367j271
$$ -559 -427 -2634 -5912 -5180 -3020 -701 2227 4274 6317 5835 5206 5236 4570 2884 -1067 -5434 -6705
39153f705k90n90p12j422j760M37P59M14P04K319b782a242p60Q28A453K240J169
$$ -6705 -6995 -7585 -8297 -9719 -11479 -11042 -10283 -9869 -9165 -6846 -2782 -1242 -2002 -1174 1453 3693 4862
39136D862j189F71b187o99k01a258c55l473n365l451J538J364j198K086a503B880
$$ 4862 3673 671 -2187 -2886 -3087 -1258 -355 -3828 -9193 -12644 -11106 -9742 -10940 -8854 -1503 2880
39119A115m51J971K855P54j484j662r74q6P12j10P50J208q22j009F35a145DM013
$$ 1115 664 2635 5490 6244 4760 3098 2124 2038 2750 2640 3390 4598 3776 2767 635 -1145 4 4017
39101D017L818k216E57i48J78c7C370M923L30l517A726q20R13G69a933A6M744
$$ 4017 7835 5619 557 -948 -770 -37 3370 8293 8623 5106 1726 906 1819 769 -1933 16 4760
39084D760M95q34k9k187a464d62A653L839K456l779a85l445k464j153J42J940
$$ 4760 5255 4421 4392 2205 -1464 -462 1653 5492 7948 4169 -185 -3630 -6094 -7247 -7105 -5165
39068e165i28C692J034A356b580k826K67R40L26J022l87o1M86m35j747P9M24l152
$$ -5165 -928 3692 4726 1356 -2580 -5406 -5139 -4199 -3873 -2851 -3238 -3299 -2813 -3248 -4995 -4916 -4492 -7644
39050g644j654J500J157J922K180D96L136L164J064K60K507M079J803j948l655
$$ -7644 -9298 -7798 -6641 -4719 -2539 496 3632 6796 7860 8120 10627 14706 16509 14561 10906
39035A0906l096k260p25j468j125p85a098m264l686n91L957a423B550K348N25
$$ 10906 7810 5550 4825 3357 2232 1447 -1098 -5362 -9048 -9639 -5682 -1423 2550 4898 5423
39020E423Q49o37k120m92L178N052L190P83m91l712E208b0j952i67q75k488K40
$$ 5423 6272 5635 3515 3023 6201 11253 14443 15226 14735 11023 5208 -20 -1972 -967 -1842 -4330 -4090
39003d090a596I35K215A067c443l243J182c18C527o49A279D37j93a962l695l068
$$ -4090 -1596 935 3150 1067 -3443 -6686 -5504 -318 3527 2878 1279 437 244 -1962 -5657 -8725
38987h725j279k150N44M549K994M34o93b003b81l476j742a903B021K462k34A577
$$ -8725 -10004 -12154 -11610 -7061 -4067 -3633 -4326 -2003 -281 -3757 -5499 -1903 2021 4483 4249 1577
38970h53r00l64M17f44C113K164B604f79j499j502k264j592J071J455k712m459
$$ -853 -1753 -2117 -1700 -644 3113 5277 2604 -679 -2178 -3680 -5944 -7536 -6465 -5010 -7722 -12181
38954a2181l491k323K017N940L675l06k46j09K37j404o14J572K581K278J000M53
$$ -12181 -15672 -17995 -15978 -10038 -6363 -6669 -6915 -7024 -6787 -8191 -8805 -7233 -4652 -2374 -1374 -921
38938i21d45j364k330j914j965O9L439a16A16b910j876k330m092m163l180J33
$$ -921 -445 -1809 -4139 -6053 -8018 -7949 -4510 -116 116 -2910 -4786 -7116 -11208 -15371 -18551 -18418
38922a8418K424J055J84K174L027L611b420e39m83k939j516p10j573L114b21A804
$$ -18418 -15994 -14939 -14755 -12581 -9554 -5943 -2420 -539 -1022 -3961 -5477 -6187 -7760 -4646 -221 1804
38905B574A179c053m466j432l61N31K644K231a577H44J044F23a780q67G32O115
$$ 2574 1179 -3053 -7519 -8951 -9312 -8781 -6137 -3906 -1577 844 1888 623 -1780 -2647 732 6847
38889F847J794k183j467m94K51m11l25L27j778O75L710J642P19L26j156j907j520
$$ 6847 8641 6458 4991 4497 4748 4337 4012 4339 2561 3236 6946 8588 9307 9633 8477 6570 5050
38872E050j522A248a553k76A089J938O31J059J970Q62j852A405a417p04j846l977
$$ 5050 3528 1248 -1553 -1829 1089 3027 3658 4717 6687 7549 5697 1405 -1417 -2121 -3967 -7944
38856g944k918n2L75L5L879a452A260L158K015j219n01J969L459O89j688j988
$$ -7944 -10862 -10914 -10539 -10504 -6625 -1452 1260 4418 6433 5214 4713 6682 10141 10830 9142 7154
38840G154J325J818n0L00j418j111j235K736L611k31J901K349m721A449i007m193
$$ 7154 8479 10297 10247 10547 9129 8018 6783 9519 13130 12899 14800 17149 12428 1449 -9007 -13200
38824a3200P19N156a911g54B5K808J585j206f30l291J162d04B193M079R63k072
$$ -13200 -12481 -7325 -1911 -754 25 2833 4418 3212 -630 -3921 -2759 -404 2193 6272 7235 5163
38808E163j59J459J129J348R06o22C681a266b50C937K889N15j692B480K276P019
$$ 5163 5004 6463 7592 8940 9846 9224 3681 -1266 -250 3937 6826 7341 5649 2480 4756 11775
38792A1775Q721L328k906l992l391r28N27k564k995p56B887a978o65O05k043l785
$$ 11775 20496 23824 20918 16926 13535 12607 13134 10570 7575 6819 2887 -1978 -2643 -2038 -4081 -7866
38776g866j345O68n6J029c666f77A28c90j115K44d44A007J922p68A060J55k25
$$ -7866 -9211 -8543 -8599 -7570 -3666 -677 128 -390 -1505 -1261 -444 1007 2929 2161 1060 1215 990
38759I90J947K376l49B073b57k089j414a272D967R055P459K021j795l703m019
$$ 990 2937 5313 4964 2073 -257 -2346 -3760 -1272 4967 14022 21481 23502 21707 18004 13985
38744A3985l646j609n52k669j952J289K768K016k85l541A779j04K004K545L091
$$ 13985 10339 8730 8178 5509 3557 4846 7614 9630 9345 5804 1779 1675 3679 6224 9315
38729I315j090C493A26g03A004M679M651M192R01l928k755j815j683j232A998
$$ 9315 8225 3493 126 -703 1004 5683 10334 14526 15427 11499 8744 6929 5246 4014 1998
38713B121J655J077L19k066r28K357J252p70j02J856J426N19P01K438O37j841
$$ 2121 3776 4853 5172 3106 2178 4535 5787 5017 4915 6771 8197 8716 9417 11855 12492 10651
38697A0651l331k511J717L321J966p26j806j555l458g3j602k005k148l382m241
$$ 10651 7320 4809 6526 9847 11813 11087 9281 7726 4268 -73 -1675 -3680 -5828 -9210 -13451
38682a3451j864K226N222c846a405G7i80k774k166k556j836j077L456a867C540
$$ -13451 -15315 -13089 -7867 -3846 -1405 77 -980 -3754 -5920 -8476 -10312 -11389 -7933 -1867 3540
38666H003k25j788J835K277L103L142j50k461o303B567k37J67J688L483l51j139
$$ 8003 7778 5990 7825 10102 13205 16347 16197 13736 7433 2567 2330 2497 4185 7668 7317 6178
38650F178M35Q51K966L581R89p75j049j783k349j440l63k086j714A665n46J246
$$ 6178 6613 7464 10430 14011 15000 14225 13176 11393 9044 7604 7241 5155 3441 1665 1119 2365
38634B365j37n76J633J638L885N110J718j499k345k530j406J951K606O74o42J168
$$ 2365 2228 1652 3285 4923 8808 13918 15636 14137 11792 9262 7856 9807 12413 13087 12445 13613
38618A3613K161N40m3j168l345l609P95M307N623K326k329l849j684M25j764m338
$$ 13613 15774 16314 16271 15103 11758 8149 8944 13251 18874 21200 18871 15022 13338 13763 11999 7661
38602G661k003J355L475J824M23K5j287j841j388K763M154J807J935J583Q7o24
$$ 7661 5658 7013 10488 12312 12735 12760 11473 9632 8244 11007 15161 16968 18903 20486 20573 19949
38586A9949q90k02M405L905J2k458m896l319j24J057j4K183J495n28Q42L058l14
$$ 19949 19059 18857 23262 27167 27179 24721 19825 16506 16382 17439 17425 19608 21103 20575 21417 24475 24161
38569B4161k150L15J898J771k002m434k836O24M70O50K17j739j35M75K800O379
$$ 24161 22011 22326 24224 25995 23993 19559 16723 17347 17817 18467 18684 16945 16810 17285 20085 26464
38553B6464O789L044j316l956j675K356L969L670J460j143l347l101l223k209
$$ 26464 33253 36297 34981 31025 29350 31706 35675 39345 40805 39662 36315 33214 29991 27782
38539B7782j145k324k542j458O29J538O55j855j669M961P916M101o3j837L62K379
$$ 27782 26637 24313 21771 20313 20942 22480 23135 21280 19611 24572 32488 36589 36526 34689 35051 37430
38523C7430K020Q27k374l118O14K694L512J400j07k215n194m776J660K841M18
$$ 37430 39450 40277 37903 34785 35399 38093 41605 43005 42898 40683 35489 30713 32373 35214 35632
38508C5632L94J941M534N211K920R81k26j124J528J045j478n29J713J931J177
$$ 35632 36026 37967 42501 47712 50632 51613 51387 50263 51791 52836 51358 50829 52542 54473 55650
38493E5650p20l194n215l657k559j147J941M298O169M510R43J274M712O029M683
$$ 55650 54930 51736 46521 42864 40305 39158 41099 45397 51566 56076 57019 58293 63005 69034 73717
38478G3717R41l816k963L98J873J840J951K701K551N039L709K053J961j58m16
$$ 73717 74658 70842 67879 68277 70150 71990 73941 76642 79193 84232 87941 89994 91955 91797 91381
38463I1381J07Q19L736L029J083l47j939K287P036N669L376N466L512o54M95M679
$$ 91381 91488 92307 96043 99072 100155 99808 97869 100156 107192 112861 116237 121703 125215 124561 125056 129735
38447A29735M079j769k119L323N379O302O070N261N063N431L997O073O730K624
$$ 129735 133814 132045 129926 133249 138628 144930 151000 156261 161324 166755 170752 176825 183555 186179
38433A86179K624L793M811P801R384J1122J1108Q711R442J1729J2111R642Q263
$$ 186179 188803 192596 197407 205208 214592 225714 236822 245533 254975 266704 278815 288457 296720
38420B96720R414J1194J6544J8478J6134J6175J4656J1878J1096J5270J9615K1243
$$ 296720 306134 317328 333872 352350 368484 384659 399315 411193 422289 437559 457174 478417
38408D78417J9156J9768K4590K8782K8968K6328K5078K7671L0677L4252M1615
$$ 478417 497573 517341 541931 570713 599681 626009 651087 678758 709435 743687 785302
38397G85302M5998M3997M3203M9946N6245O0345O2199O4372P1691Q1083Q7630
$$ 785302 831300 875297 918500 968446 1024691 1085036 1147235 1211607 1283298 1364381 1452011
38386A452011R4774J04674J11400J19022J33928J52017J74047J96418K19924K49321
$$ 1452011 1546785 1651459 1762859 1881881 2015809 2167826 2341873 2538291 2758215 3007536
38376C007536K82878L20182L60637M12277M74336N47173O34235P40891Q81762
$$ 3007536 3290414 3610596 3971233 4383510 4857846 5405019 6039254 6780145 7661907
38367G661907J073135J308128J557783J795434K016973K230494K438003K615432
$$ 7661907 8735042 10043170 11600953 13396387 15413360 17643854 20081857 22697289
38359B2697289K722157K695911K431956J870168J093975K05712p95494j883574
$$ 22697289 25419446 28115357 30547313 32417481 33511456 33717168 32921674 31038100
38351C1038100k814670l293689l308507l043072k656955k246288j865129j537457
$$ 31038100 28223430 24929741 21621234 18578162 15921207 13674919 11809790 10272333
38343A0272333j268655j044463q65656p41401o57682n91560n27214m59678l94887
$$ 10272333 9003678 7959215 7093559 6352158 5694476 5102916 4575702 4116024 3721137
38334C721137l40231k96047k61315k31790k06097j83220j64489j49478j36446
$$ 3721137 3380906 3084859 2823544 2591754 2385657 2202437 2037948 1888470 1752024
38325A752024j24233j10040r7532q9129q1298p4321o8745o4270n8599n4733n3328
$$ 1752024 1627791 1517751 1420219 1331090 1249792 1175471 1106726 1042456 983857 929124 875796
38314H75796m9164m5469m3132m0707l7903l2667k7865k7335k7994k8999k6600
$$ 875796 826632 781163 738031 697324 659421 626754 598889 571554 543560 514561 487961
38303D87961k1986j7520j8910k1691j9198j3870j0344j2560j6433j4726q782p143
$$ 487961 465975 448455 429545 407854 388656 374786 364442 351882 335449 320723 311941 304798
38291C04798p968r486j0842j0336q628p254p966r451p542n576q293r608o923m153
$$ 304798 296830 287344 276502 266166 257538 250284 242318 232867 225325 219749 211456 201848 194925 190772
38277A90772j750N74J511m87m144o223p322o795o238m409j425l675m137k356l767
$$ 190772 189022 189596 191107 190620 186476 180253 172931 166136 159898 155489 154064 150389 146252 143896 140129
38262A40129l908n475p667m121j836k92r22l072o274o338K16M099r7k432j376
$$ 140129 136221 130746 123079 118958 117122 116830 115908 112836 106562 100224 100440 104539 104442 102010 100634
38247A00634j004j036m64n51k877m799l371j206j969m043o078k905N11k93j371
$$ 100634 99630 98594 98130 97579 94702 89903 86532 85326 83357 79314 73236 70331 70842 70549 69178
38232F9178j290l92R07j072n419n461k611L1n87k83N46k60P4J278J780M93j392
$$ 69178 67888 67496 68403 67331 61912 56451 53840 53871 53284 53001 53547 53287 53361 54639 56419 56912 55520
38215E5520k432l180l970k758j239K73r5o01J16L61J179N46J366P30j841l156
$$ 55520 53088 49908 45938 43180 41941 42214 42119 41518 41634 41995 43174 43720 45086 45816 43975 40819
38199D0819l555k725j762j809L93M562N360L776L674L386J845r16l348l982k958
$$ 40819 37264 34539 32777 30968 31361 35923 41283 45059 48733 52119 53964 53048 49700 45718 42760
38184D2760r14j727l992k913J414N281L684n04k443l59j2k382m708n389j951J098
$$ 42760 41846 40119 36127 33214 34628 39909 43593 43089 40646 40287 40275 37893 33185 27796 25845 26943
38168B6943K874L687j262n488n204m059k663J62J434P6M58K57k1J873J409J259
$$ 26943 29817 33504 32242 26754 21550 17491 14828 14990 16424 16500 16958 17215 17194 19067 20476 21735
38152B1735K059R26j100l194l23M276N420J862l863o786n705k028k95l14j180
$$ 21735 23794 24720 23620 20426 20103 24379 29799 31661 27798 21012 15307 13279 12984 12670 11490
38137A1490r67j259l58J395J421p95r63J398M55o80j84K494J970j517k512p78
$$ 11490 10523 9264 8906 10301 11722 10927 9964 11362 11817 11137 10953 13447 15417 13900 11388 10610
38121A0610J353J534j557k438K36J255L004K320j726l152L54K483j07j619j949
$$ 10610 11963 13497 11940 9502 9738 10993 13997 16317 14591 11439 11793 14276 14169 12550 10601
38106A0601j439L493O182K865l223o640k914p61j17L23j161k921p51J019L364
$$ 10601 9162 12655 18837 21702 18479 11839 8925 8164 8047 8370 7209 4288 3537 4556 7920
38091G920K253J9J148Q14j225K69K566Q38k290n032A382d932n565l016R51L346
$$ 7920 10173 10192 11340 12154 10929 11198 13764 14602 12312 7280 1382 -4932 -10497 -13513 -12562 -9216
38075i216L829J303J9a622A957L153J840J30l278a35j04B6J634K419J721K480
$$ -9216 -5387 -4084 -4065 -1622 1957 5110 6950 7080 3802 -135 -239 26 1660 4079 5800 8280
38059H280O53r81k156A959e03I74K517O74j006H21e73k436m890P79c366g35n9
$$ 8280 8933 7952 5796 1959 -503 974 3491 4165 3159 821 -573 -3009 -7899 -7120 -3366 -735 -794
38042g94j024p0n76j778R99E44K032o64a348k632l365k715J66K802J185l439k886
$$ -794 -1818 -1888 -2464 -4242 -3243 544 2576 1912 -1348 -3980 -7345 -10060 -9894 -7092 -5907 -9346 -12232
38025a2232q94l49j073j881P39Q57j302K20K682J580l13j126M559i27C197J828
$$ -12232 -13126 -13475 -14548 -16429 -15690 -14833 -16135 -15915 -13233 -11653 -11966 -13092 -8533 -927 3197 5025
38009E025L160L339O7k350m329F85e38B071L317J465j667k095n63K201K850j986
$$ 5025 8185 11524 11591 9241 4912 685 -538 2071 5388 6853 5186 3091 2528 4729 7579 5593
37993E593H56g10A136J647O81K191J614l36j209k259A034Q9L970N014K481O51
$$ 5593 856 -710 1136 2783 3464 5655 7269 6933 5724 3465 1034 1123 5093 10107 12588 13239
37977A3239P6J845L923J705J16l446q699I45a073D58N66D89b51j568l179j568
$$ 13239 13315 15160 19083 20788 20904 17458 8759 945 -1073 458 1024 489 -251 -1819 -4998 -6566
37961f566p28j275p63p26k508m33L102L531K983J246k07p83j122k76m39J157J291
$$ -6566 -7294 -8569 -9332 -10058 -12566 -12999 -9897 -6366 -3383 -2137 -2344 -3127 -4249 -4525 -4964 -3807 -2516
37944b516j069j020l00r87M11l06J248b36D47a262j598j74k60J338A268L195n74
$$ -2516 -3585 -4605 -4905 -5892 -5481 -5787 -4539 -236 447 -1262 -2860 -3034 -3294 -1956 1268 4463 3889
37927C889A341h39k615m80j52p89J633g79A82M20P07J34J193R04A280b870N69
$$ 3889 1341 -839 -3454 -3934 -4086 -4875 -3242 -779 182 602 1309 1443 2636 3540 1280 -2870 -2301
37910b301A888K304j71M50r16j13K412K947L54k510B137c124j627j807k790q46
$$ -2301 1888 4192 4021 4471 3555 3442 5854 8801 9155 6645 2137 -3124 -4751 -6558 -9348 -10194
37894a0194M851A625R76a165l913j423k677k234J400L435K725a721D65J045C82
$$ -10194 -5343 1625 2601 -1165 -5078 -6501 -9178 -11412 -10012 -6577 -3852 -1721 465 1510 382
37878a857j856m10p14j577j888q08J138J394P47k57k122k120k03J24J237K120
$$ -1857 -3713 -4123 -4837 -6414 -8302 -9110 -7972 -6578 -5831 -6088 -8210 -10330 -10533 -10409 -9172 -7052
37862g052K299J625j899m401R60a366E477K191k699e01n744k511J780J886m41
$$ -7052 -4753 -3128 -5027 -9428 -8468 -1366 5477 7668 4969 -501 -6245 -8756 -6976 -5090 -5531
37847e531m20R32r22k674l200m809l041P58M255O928K356o76K49K428a507N64
$$ -5531 -5951 -5019 -5941 -8615 -11815 -16624 -19665 -18907 -14652 -7724 -5368 -6044 -5795 -3367 -1507 -943
37831i43j185j369j89K96k76j698L91K271m06m258j602K389J495Q54J748M45p83
$$ -943 -2128 -3497 -3686 -3390 -3666 -5364 -4973 -2702 -3108 -7366 -8968 -6579 -5084 -4230 -2482 -2037 -2820
37814b820j218L77A07L206L19A549P9K510P49k339b13k768j726a972C477N357
$$ -2820 -4038 -3661 107 3313 3632 1549 1628 4138 4887 2548 -213 -2981 -4707 -1972 3477 8834
37798H834O07k060k036G69b645j421P73M28k005m00J615O98L30J82j382k372L14
$$ 8834 9441 7381 5345 769 -2645 -4066 -3293 -2865 -4870 -5270 -3655 -2957 -2627 -2445 -3827 -6199 -5885
37781e885J213P86m12m33N92J103J54p06J12O49J061j280k819l603k457J014L153
$$ -5885 -4672 -3886 -4298 -4731 -4139 -3036 -2882 -3588 -3476 -2827 -1766 -3046 -5865 -9468 -11925 -10911 -7758
37764g758b992A876J562j634a26m00B37J326K101N12A069a025k17J48A61h77n026
$$ -7758 -2992 1876 3438 1804 -126 -526 237 1563 3664 4176 1069 -1025 -1242 -1094 161 -877 -5903
37747e903k659L18J462L002a042d51k273k275p37k044k039k2j056m206j971L173
$$ -5903 -8562 -8244 -6782 -3780 -1042 -451 -2724 -4999 -5736 -7780 -9819 -9841 -10897 -15103 -17074 -13901
37731a3901L180K942K930J125j026m70a086C078p55r10l85J859K534p64A793n22
$$ -13901 -10721 -7779 -4849 -3724 -4750 -5220 -1086 3078 2323 1413 1028 2887 5421 4657 1793 1271
37715A271L55b074m043q12K252N14j735q31J810e18B698M64A378o35J087J320
$$ 1271 1626 -2074 -6117 -6929 -4677 -4163 -5898 -6729 -4919 -518 2698 3162 1378 743 1830 3150
37699C150l54j291k29d11l661k113J059K237J45n86j01M3p3o37L72j98l152r55
$$ 3150 2796 1505 1276 -411 -4072 -6185 -5126 -2889 -2744 -3330 -3431 -3388 -3461 -4098 -3726 -3924 -7076 -8031
37681h031J234K159f01B338k00d73l469k551k745l478m05N29j527r45K011L294
$$ -8031 -6797 -4638 -601 2338 2138 -473 -3942 -6493 -9238 -12716 -13121 -12592 -14119 -15064 -13053 -9759
37665i759o61n565m975p53j805l238j341J529L479N531N147J954j48k2K293K674
$$ -9759 -10420 -15985 -20960 -21713 -23518 -26756 -28097 -26568 -23089 -17558 -12411 -10457 -10605 -10627 -8334 -5660
37649e660J189j835l871k296l13J68J167K609L867B59J744e13k967l50H51L258
$$ -5660 -4471 -6306 -10177 -12473 -12786 -12618 -11451 -8842 -4975 259 2003 -513 -3480 -3830 851 4109
37633D109A298d427p381n962k625l013o7K345L09O22j124j880J261L387O568d562
$$ 4109 1298 -4427 -11808 -17770 -20395 -23408 -23475 -21130 -20821 -20199 -21323 -23203 -21942 -18555 -11987 -4562
37616B16K275r3d26k107j447p26R2l10k00n64q08J67K652a58G69j06K58A19h89
$$ 216 2491 2398 -426 -2533 -3980 -4706 -4614 -4924 -5124 -5688 -6496 -6329 -3677 -158 769 663 921 119 -889
37596a155n7n4d69j37l346l769j470o36k458k260k030r75M64j93o83j297N94M373
$$ -1155 -1212 -1266 -469 -606 -3952 -7721 -9191 -9827 -12285 -14545 -16575 -17550 -17086 -17279 -17962 -19259 -18665 -14292
37578a4292K847L63j952r71K496K066j407l624k347M10J827J968J306M62L188
$$ -14292 -11445 -11082 -13034 -14005 -11509 -9443 -10850 -14474 -16821 -16411 -14584 -12616 -11310 -10848 -7660
37563g660c249a00D597M339K394K208k844A488f423k102J305b971A116L29a794
$$ -7660 -3249 -100 4597 8936 11330 13538 10694 1488 -6423 -8525 -7220 -2971 1116 1445 -1794
37547d771n99K31K255B15K466P61R03J249j940I59R6k05b063q64a11B691K003
$$ -4771 -5370 -5139 -2884 215 2681 3442 4345 5594 3654 959 1055 850 -2063 -2927 -111 2691 4694
37530D694K651L138N26l561C571Q96M276K872k005m625k415j250o0L001R42k127
$$ 4694 7345 10483 11009 7448 3571 4467 8743 11615 9610 4985 2570 1320 1260 4261 5203 3076
37514C076o22r12d48J44E52P75Q02J575j5d28m200j462k28K39J69r53p85P71c087
$$ 3076 2454 1542 -448 -304 552 1327 2129 3704 3689 -428 -4628 -6090 -6318 -6079 -5910 -6863 -7648 -6877 -3087
37494D619O534k1j920Pj522j311J068K08k934A191b506l413k819M33K386J735
$$ 4619 11153 11132 9212 9219 7697 6386 7454 7662 4728 1191 -2506 -5919 -8738 -8305 -5919 -4184
37478d184j196k836N95c522F82k04d916n886j085O21J602J518n93K25L388c4C907
$$ -4184 -5380 -8216 -7621 -3522 682 478 -4916 -10802 -11887 -11266 -9664 -8146 -8739 -8514 -5126 -34 3907
37460D109j035O5r81j35p24c041n623m045r24K832M418g66B199n47B04b239j054
$$ 4109 3074 3139 2158 2023 1299 -3041 -8664 -12709 -13633 -10801 -6383 -766 2199 1652 204 -2239 -3293
37443c293j018k26K62j994l637o62L630b737j055k842j090q07J32J131j14N71
$$ -3293 -4311 -4537 -4275 -6269 -9906 -10568 -6938 -2737 -3792 -6634 -7724 -8531 -8399 -7268 -7382 -6811
37427f811K535J022k382k272j810k522j115o94K123L939O52j473L256a394c48
$$ -6811 -4276 -3254 -5636 -7908 -9718 -12240 -13355 -14049 -11926 -7987 -7335 -8808 -5552 -1394 -348
37411c710m621k945N05L138J572N68K346a421K69G86K398N48p95d52n090k175
$$ -3710 -8331 -11276 -10771 -7633 -6061 -5493 -3147 -1421 -1152 786 3184 3732 2937 -452 -5542 -7717
37395g717K978I91M106j236a034m483l683j924P8K393L089K307R27a157l05m053
$$ -7717 -4739 991 5097 3861 -1034 -5517 -9200 -11124 -11046 -8653 -5564 -3257 -2330 -1157 -1462 -5515
37379e515l480n62K187K567l18l340K50c482J707k20i92Gd61j748k364l67Q54
$$ -5515 -8995 -9557 -7370 -4803 -5121 -8461 -8211 -3482 -1775 -1995 -992 7 -461 -2209 -4573 -4940 -4086
37362d086J596a27B05a535H01K381I64c72F73L92b453l104j48a128B750J616J689
$$ -4086 -2490 -127 205 -1535 801 3182 964 -372 673 1065 -2453 -5557 -5705 -1128 2750 4366 6055
37345F055j080G12c033k453k34a589F345P127K249J226J147J414n20j81J960M574
$$ 6055 4975 712 -3033 -5486 -5720 -1589 6345 13472 15721 16947 18094 19508 18988 18807 20767 25341
37329B5341P794P726M576J568J860K920M637O768J1641J5696J5502J4940J7247
$$ 25341 33135 40861 45437 47005 48865 51785 56422 63190 74831 90527 106029 120969 138216
37316A38216J5423Q577K65n435o848o855n300q093j2308j3965j5387j6617j2197
$$ 138216 153639 162216 162481 157046 150198 143343 138043 129950 117642 103677 88290 71673 59476
37303E9476p031p185r046r581j0176p742j738O84l404c24p92A687K865J760o05
$$ 59476 52445 45260 36214 26633 16457 8715 6977 7661 4257 -324 -1116 1687 4552 6312 5707
37288E707r0J166p46o87k276dA99J768M48K72q86a399l618p34J877m28j135J316
$$ 5707 5617 6783 6037 5350 3074 -4 199 1967 2415 2687 1801 -1399 -5017 -5751 -3874 -4302 -5437 -4121
37270d121a776J85l866n261l147P88K812J506J184L316J860K09d80B240P48E99
$$ -4121 -1776 -1591 -5457 -10718 -13865 -13077 -10265 -8759 -7575 -4259 -2399 -2190 -480 2240 2988 599
37253A40J184P14j17j82j68n06m35a126j513O45K41L13L62q14k358p01K121l79
$$ 140 1324 2038 1921 1739 1571 1065 630 -1126 -2639 -1994 -1753 -1440 -1078 -1892 -4250 -4951 -2830 -3209
37235c209j480n46a984B443o57a527j989m9i55A281K38K401L396L642K133n27
$$ -3209 -4689 -5235 -1984 2443 1786 -1527 -3516 -3565 -955 1281 1519 3920 7316 10958 13091 12564
37219A2564N20q98n190B901m33O39N69P23K44O05n72K52M37j602A738a263m093
$$ 12564 13084 12186 6996 2901 2468 3107 3676 4399 4643 5248 4676 4928 5365 3763 1738 -1263 -5356
37202e356o90h82E119J579k995c74j011o38k524j018J445M98o94j1l62o79j835
$$ -5356 -6046 -882 5119 6698 3703 -374 -1385 -2023 -4547 -5565 -4120 -3622 -4316 -4327 -4689 -5368 -7203
37185g203j892l098k001O63l90k860j146K14J939K626K579K231K123K6P76a488
$$ -7203 -9095 -12193 -14194 -13531 -13921 -16781 -17927 -17713 -15774 -13148 -10569 -8338 -6215 -6189 -5413 -1488
37168B059J009j274f06l203l161m06K713g22A353E33a429l631m411j952n57J641
$$ 2059 3068 1794 -606 -3809 -6970 -7376 -4663 -722 1353 533 -1429 -5060 -9471 -11423 -11980 -10339
37152a0339N150a646j403k618j237Q60j52l069l055j599J727K432L025K520O64
$$ -10339 -5189 -1646 -3049 -5667 -6904 -6044 -6196 -9265 -12320 -13919 -12192 -9760 -6735 -4215 -3551
37137c551k224K01b234I04K639j47p58e26n449k577J18r11K102a611A923K178
$$ -3551 -5775 -5574 -2234 904 3543 3396 2638 -526 -5975 -8552 -8434 -9345 -7243 -1611 1923 4101
37121D101L603L177K452m57l378k782o23k299C54b669O42n0p85L35j331O1a695
$$ 4101 7704 10881 13333 12876 9498 6716 6093 3794 354 -2669 -2027 -2077 -2862 -2527 -3858 -3797 -1695
37103A460L136J039k481d33k998p04J011J254c37A235M66p47i80l899l632K516
$$ 1460 4596 5635 3154 -433 -3431 -4135 -3124 -1870 -337 1235 1701 954 -980 -4879 -8511 -5995
37087e995a185A956Q39A167b918m955l801l393k322J598M826L209p65k56J038
$$ -5995 -1185 1956 2795 1167 -2918 -7873 -11674 -15067 -17389 -15791 -10965 -7756 -8521 -8777 -7739
37072g739l08L31Q31Q08K974G51K591J955J587L075J554k739k742L88j049A281
$$ -7739 -8047 -7716 -6885 -6077 -3103 751 3342 5297 6884 9959 11513 8774 6032 6420 5371 1281
37055a771f61C497O56Q7J332l88k028D90a912O64I22J874N67m47p83j32j96C2
$$ -1771 -661 3497 4153 4240 5572 5184 3156 490 -1912 -1248 922 2796 3363 2916 2133 2001 1805 32
37036b249k274p27k056m758l712j241N5j68K291N288d269d20E71e27J71j198m501
$$ -2249 -4523 -5250 -7306 -12064 -15776 -17017 -16962 -17130 -14839 -9551 -4269 -420 571 -527 -356 -1554 -6055
37019f055k375K026L137M03k017m861m321K00J959J333k504m969l188L180O377
$$ -6055 -8430 -6404 -3267 -2864 -4881 -9742 -14063 -13863 -11904 -10571 -13075 -18044 -21232 -18052 -11675
37004a1675K605O82J575K286J38m49j617k450l259k153O45K319L682c186a117
$$ -11675 -9070 -8388 -6813 -4527 -4389 -4838 -6455 -8905 -12164 -14317 -13672 -11353 -7671 -3186 -1117
36988d140n478j273M914a052A261J752J861K096nj766A739c19A276L13iB27J661
$$ -4140 -9618 -10891 -5977 -1052 1261 3013 4874 6970 6965 5199 1739 -319 1276 1589 -9 227 1888
36971A888J556P98k12j620G92K4K424L061K270J077mm39o27j8m53M02P04O35J302
$$ 1888 3444 4242 4030 2410 792 816 3240 6301 8571 9648 9644 9205 8578 8560 8107 8509 9213 9848 11150
36952A1150L82j974k801B990c29O6A579N65P96K36k9j034e4l762l765K11L069
$$ 11150 11532 9558 6757 2990 -329 -263 1579 2144 2940 3176 3147 2113 -54 -3816 -7581 -7370 -4301
36935d301P69j760r06P31a551B598n88a102p40A402K498O19M20K519J441j106
$$ -4301 -3532 -5292 -6198 -5467 -1551 2598 2010 -1102 -1842 1402 3900 4519 4939 7458 8899 7793
36919G793j118J806M49l597I54f49F92B76a316O05B599N111L158k225D295c98
$$ 7793 6675 8481 8930 5333 954 -649 692 276 -1316 -711 2599 7710 10868 8643 4295 -398
36902e557k228p56J078Q99l202l866k808o13J921K630N593e22B396R03K110J662
$$ -5557 -7785 -8541 -7463 -6564 -9766 -13632 -16440 -17053 -15132 -12502 -6909 -522 2396 3299 5409 7071
36886G071R89j086l361e06l668j567J6n34M2L87j015j892j012L73k88m72J796
$$ 7071 8060 6974 3613 -506 -4174 -5741 -5725 -6259 -6217 -5830 -6845 -8737 -9749 -9376 -9664 -10136 -8340
36869h340K421M35j86K518a138O5m77j628m19J282j413m026j663K485c237K72
$$ -8340 -5919 -5484 -5670 -3152 -1138 -1073 -1550 -3178 -3597 -2315 -3728 -7754 -9417 -6932 -3237 -2965
36853b965j823R69h27l2k131k91R67o28L25k35J141A038J103K0o34F62B78f83
$$ -2965 -4788 -3819 -827 -859 -2990 -3281 -2314 -2942 -2617 -2852 -1711 1038 2141 2161 1527 662 278 -683
36834b104l07a32D286K899j503B024h11j929k437r71J718Q05L51J473C74L343
$$ -2104 -2411 -132 4286 7185 5682 2024 -811 -2740 -5177 -6148 -4430 -3625 -3274 -1801 374 3717
36818C717M30A713l41B35f636m391J624K192j352m512l411o94R32J116O2K29J312
$$ 3717 4147 1713 1372 235 -6636 -11027 -9403 -7211 -8563 -13075 -16486 -17180 -16248 -15132 -15070 -14841 -13529
36801a3529K728J968k89Q74K62k173k198p19N51K665K576O66k025l384j268J856
$$ -13529 -10801 -8833 -9122 -8248 -7986 -10159 -12357 -13076 -12525 -9860 -7284 -6618 -8643 -12027 -13295 -11439
36785a1439M015b611A391J382a4l193r54a725A260J241J261J237P05N26N7j261
$$ -11439 -7424 -2611 1391 2773 -14 -3207 -4161 -1725 1260 2501 3762 4999 5704 6230 6287 5026
36769E026H4e574r10b253C061O98a244p814l212L411b678D361M724N59l645I05
$$ 5026 84 -5574 -6484 -2253 3061 3759 -1244 -9058 -12270 -8859 -2678 4361 9085 9644 5999 905
36752c937l726o13J119J433q64Q0J364J814a98A955Q94j142r1J840K295J148j01
$$ -3937 -7663 -8276 -7157 -5724 -6588 -6508 -5144 -3330 -198 1955 2849 1707 1616 3456 5751 6899 6798
36735F798K016N66j242j733B472b131l278j997k183j003K824c551a655n83j304
$$ 6798 8814 9380 8138 6405 2472 -2131 -5409 -7406 -9589 -10592 -7768 -3551 -1655 -2238 -3542
36720c542N71J039k714n750k674J818J759m36m45L84K935K788Q68j75j206j451
$$ -3542 -2971 -1932 -4646 -10396 -13070 -11252 -9493 -9929 -10374 -9990 -7055 -4267 -3399 -3574 -4780 -6231
36704f231q80l432m057m395l625K55K817N719N921J274o69K88j543l05M354A426
$$ -6231 -7111 -10543 -14600 -18995 -22620 -22365 -19548 -13829 -7908 -6634 -7303 -7015 -8558 -8863 -4509 1426
36687E339K947L18k442j898j845c30a29j201l003j468J388J745c09F66a433j272
$$ 5339 8286 8604 6162 4264 2419 -330 -129 -1330 -4333 -5801 -4413 -2668 -309 666 -1433 -2705
36671b705k26J83a358B52a312l567j487b946b94K5C10J123M77d69k384k083k312
$$ -2705 -2931 -2748 -1358 252 -1312 -4879 -6366 -2946 -294 -269 310 1433 1910 -469 -2853 -4936 -7248
36654g248q46N30J711J507j121M76K486q15k557k079K443A518L114p96J78K90
$$ -7248 -8094 -7564 -5853 -4346 -5467 -4991 -2505 -3320 -5877 -7956 -5513 1518 4632 3836 4014 4304
36638D304j241e73m781l417K22K218K735a182J85p94r04J040G5h09l208o78K249
$$ 4304 3063 -573 -5354 -8771 -8549 -6331 -3596 -1182 -997 -1791 -2695 -1655 75 -809 -4017 -4695 -2446
36621b446b31a4k952l623m227j581N026e19C952J370p68A182c406k572j590j644
$$ -2446 -231 -14 -2966 -6589 -10816 -12397 -7371 -519 3952 5322 4554 1182 -3406 -5978 -7568 -9212
36605i212j959J581K554k21k473l080J058K393N8m571l927j308j569q80k90L193
$$ -9212 -11171 -9590 -7036 -7257 -9730 -12810 -11752 -9359 -9301 -13872 -17799 -19107 -20676 -21556 -21846 -18653
36589a8653O914L286j258k667k043P31J154L99J42J640M742a705c64I00d07l022
$$ -18653 -11739 -8453 -9711 -12378 -14421 -13690 -12536 -12137 -11995 -10355 -5613 -1705 -364 900 -407 -3429
36573c429j624k177k141K823h10A914H56a04E84J15M55K587J921l1j397k22O4
$$ -3429 -5053 -7230 -9371 -6548 -810 1914 856 -104 584 699 1154 3741 5662 5631 4234 4012 4076
36556D076A738a076l2A084J605R76R78l15p02J447Q03j277K84J488j357B296j86
$$ 4076 1738 -1076 -1108 1084 2689 3665 4643 4328 3626 5073 5876 4599 4883 6371 5014 2296 2110
36539B110F8e170m335l88J127J476M78j725j148l23K003b947A542O52A047h30
$$ 2110 68 -5170 -9505 -9893 -8766 -7290 -6812 -8537 -9685 -10008 -8005 -2947 1542 2194 1047 -830
36522e041k378c575A586M800K051j873j958K740J561j577j445j179j672A219D70
$$ -5041 -7419 -3575 1586 6386 8437 6564 4606 7346 8907 7330 5885 4706 3034 1219 470
36506a693l280j115L019A536K638K64P42J809R08j008k200k150A100l90f6C03
$$ -1693 -4973 -6088 -3069 1536 4174 4438 5180 6989 7897 6889 4689 2539 1100 710 -66 303
36489A586L70i68m180k884k262k430k064n6L216K250J074J900J433J612o59k75
$$ 1586 1956 -968 -5148 -8032 -10294 -12724 -14788 -14844 -11628 -9378 -8304 -6404 -4971 -3359 -4018 -4293
36473d293J641B89K355L78p91J393K473M01j244L87n13M01N61A413c985m248l595
$$ -4293 -2652 289 2644 3022 2231 3624 6097 6498 5254 5641 5128 5529 6090 1413 -3985 -8233 -11828
36456a1828j067J696l26k524k750p90J344L463K452j477l766J689N645c950a603
$$ -11828 -12895 -11199 -11525 -14049 -16799 -17589 -16245 -12782 -10330 -11807 -15573 -13884 -8239 -3950 -1603
36440a862k055j024k44Q62K14P71B133L434m98A418d058l662q65l16j599l352
$$ -1862 -3917 -4941 -5185 -4323 -4109 -3338 2133 5567 5069 1418 -4058 -7720 -8585 -8901 -10500 -13852
36424a3852lJ763M577a553E17a234j572N5Q18O43A09K683K977J623K90k382A477
$$ -13852 -13855 -12092 -7515 -1553 517 -1234 -2806 -2751 -1933 -1290 109 2792 5769 7392 7682 5300 1477
36406h10j869j748k698n44K572K353P86j723l106m55L282G4O27b574n570o083
$$ -810 -2679 -4427 -7125 -7669 -5097 -2744 -1958 -3681 -6787 -7242 -3960 74 701 -2574 -8144 -14227
36390a4227k654K165L418L707K414J505p55k906o86P91J383a837A495L21g23l860
$$ -14227 -16881 -14716 -11298 -7591 -5177 -3672 -4427 -7333 -8019 -7228 -5845 -1837 1495 1816 -723 -4583
36374d583k008K912A426J772h96l724q05j206o46j535j445L184c074M28k124p15
$$ -4583 -6591 -3679 1426 3198 -896 -4620 -5425 -6631 -7277 -8812 -10257 -7073 -3074 -2646 -4770 -5485
36358e485R58k92j778k588k650j219J853P39k788j569J12q62L77K095O15p10L700
$$ -5485 -4527 -4819 -6597 -9185 -11835 -13054 -11201 -10462 -13250 -14819 -14707 -15569 -15192 -13097 -12482 -13192 -9492
36341i492d283J785n54l180l313k003k182k206j415p65J99L058L493K147L83L86
$$ -9492 -4283 -2498 -3052 -6232 -9545 -11548 -13730 -15936 -17351 -18116 -17917 -14859 -11366 -9219 -8836 -8450
36325h450J094L140a755j021j168p86j456j270L08Q83J551a497B050R89J417K090
$$ -8450 -7356 -4216 -1755 -2776 -3944 -4730 -6186 -7456 -7148 -6265 -4714 -1497 2050 3039 4456 6546
36309F546M30P23k36j79K57j200k15J096j49B877a971m625j229r9j323J419b994
$$ 6546 6976 7699 7463 7284 7541 6341 6126 7222 7073 2877 -1971 -6596 -7825 -7924 -9247 -7828 -2994
36291A148J320J333P20J92N8n52j522i43l901K192B706M186k2k153N64L899J365
$$ 1148 2468 3801 4521 4713 4771 4219 2697 -943 -4844 -2652 2706 6892 6870 4717 5281 9180 10545
36274A0545l438A260c638j937j539q32P45K647b53A833q41a428k583p12n25j47
$$ 10545 7107 1260 -3638 -5575 -7114 -7946 -7201 -4554 -253 1833 992 -1428 -4011 -4723 -5248 -5395
36258e395q93k394J044c705a041c25l563n789k356O35j163n66K428J550J029J517
$$ -5395 -6288 -8682 -7638 -3705 -1041 -325 -3888 -9677 -12033 -11398 -12561 -13127 -10699 -9149 -8120 -6603
36242f603J671a251A130b024l366r48K105a818n03l520m213Q10K748j454k998
$$ -6603 -4932 -1251 1130 -2024 -5390 -6338 -4233 -1818 -2321 -5841 -10054 -9244 -6496 -7950 -10948
36227a0948O3J033J913L129J318k073l928k404m3J694K017O03j571k920n25L280
$$ -10948 -10885 -9852 -7939 -4810 -3492 -5565 -9493 -11897 -11940 -10246 -8229 -7626 -9197 -12117 -12642 -9362
36211i362c463A471k63b570o00d98j070l893m336j549J786K623K021b278A835
$$ -9362 -3463 1471 1208 -2570 -3170 -498 -1568 -5461 -9797 -11346 -9560 -6937 -4916 -2278 1835
36195F091J223k629e98p62e2j181K5A109L288N66m14j611b700l630j21j460j529
$$ 6091 7314 4685 -598 -1360 -52 -1233 -1208 1109 4397 4963 4549 2938 -2700 -6330 -6451 -7911 -9440
36178i440K000K708Q00O26q36j594j88K338Q21k168k326j183N86L81j575j913
$$ -9440 -7440 -4732 -3932 -3306 -4142 -5736 -5924 -3586 -2765 -4933 -7259 -8442 -7856 -7475 -9050 -10963
36162a0963j520o93K317J091k906M26J852J235J287j675p44J932J922J314b192
$$ -10963 -12483 -13176 -10859 -9768 -12674 -12248 -10396 -9161 -7874 -9549 -10293 -8361 -6439 -5125 -2192
36146F75O90l8c14B72M779N670K721j293D960d319n532q13K693c497G09P64a053
$$ 675 1365 1327 -314 272 5051 10721 13442 12149 4960 -4319 -9851 -10664 -7971 -3497 709 1473 -1053
36128d494k397j345j020M17K716b450H43K441L34j07N15o37j420B82O59J37c002
$$ -4494 -6891 -8236 -9256 -8839 -6123 -2450 843 3284 3618 3511 4026 3389 1969 282 941 1078 -3002
36110f953n63L618c92l84j59F38L44P72K964K587n16N37K500J065l074l024Q65
$$ -6953 -7516 -3898 -392 -776 -935 638 982 1754 4718 7305 6789 7326 9826 10891 7817 4793 5658
36093E658O86K2J180p36K07K170J347j182k066k609n20K084L436J04l065q83M94
$$ 5658 6344 6366 7546 6810 7017 9187 10534 9352 7286 4677 4157 6241 9677 9781 6716 5833 6327
36076F327K34j318k301I25L00K190J338m45Q37L488M12l268k556A323a341l778
$$ 6327 6561 5243 2942 925 1225 3415 4753 4308 5145 8633 9045 5777 3221 1323 -1341 -5119
36060e119m407k100o00O62j53m37q52k275r70J626J754j641k002n30r26j097J780
$$ -5119 -9526 -11626 -12226 -11564 -11717 -12154 -13006 -15281 -16251 -14625 -12871 -14512 -16514 -17044 -17970 -19067 -17287
36043a7287J777n38nO70J831K185Q38m28j365J6J443L96K079R95n26k526m394
$$ -17287 -15510 -16048 -16053 -15383 -13552 -11367 -10529 -10957 -12322 -12306 -10863 -10467 -8388 -7393 -7919 -10445 -14839
36026a4839n94K307K313K743J901j434J79K754m9k370P1J725a398A833k37B81
$$ -14839 -15433 -13126 -10813 -8070 -6169 -7603 -7424 -4670 -4719 -7089 -7018 -5293 -1398 1833 1596 281
36009b648o751o062m715m705m50j18j959j824l186k112J015L785K421r4R90M938
$$ -2648 -9399 -15461 -20176 -24881 -25331 -25449 -27408 -29232 -32418 -34530 -33515 -29730 -27309 -27403 -26413 -21475
35993b1475O050K178L01J895L773L397P46J21J351f33j527j588J40n76p00Q96
$$ -21475 -15425 -13247 -12946 -11051 -7278 -3881 -3135 -3014 -1663 -633 -2160 -3748 -3608 -4184 -4884 -3988
35977c988K01j419p49K635A757K741K76K75j614A000a974k041o47O32k63k562
$$ -3988 -3787 -5206 -5955 -3320 1757 4498 4774 5049 3435 1000 -1974 -4015 -4662 -4030 -4293 -6855
35961f855j218K402b579A977J985j968O67L718L128J092j204k039j077K392M456
$$ -6855 -8073 -5671 -2579 1977 3962 1994 2661 6379 9507 10599 9395 7356 6279 8671 13127
35946A3127J775m771B974a725j589Q48J184n60n74J24J86J77n73j194A90O849
$$ 13127 14902 10131 2974 -1725 -3314 -2466 -1282 -1842 -2416 -2292 -2106 -1929 -2502 -3696 190 7039
35930G039K890p89l30K184M190J570J29j977k996k473J820N503L805K106J35k791
$$ 7039 9929 9140 8810 10994 15184 16754 16883 14906 11910 9437 11257 16760 20565 22671 22806 20015
35914B0015n697n964l424j223j667a83j559n82J23k521l324j418O49M206a610
$$ 20015 14318 8354 4930 3707 2040 -183 -1742 -2324 -2201 -4722 -8046 -9464 -8815 -4609 -1610
35898f85N6k800l495l728j103J469K233b983A893L229J296N14k08J86O33j926
$$ -685 -629 -3429 -6924 -10652 -11755 -10286 -8053 -2983 1893 5122 6418 6932 6724 6910 7543 5617
35882E617A447c116j347J082J333P84n68l427l648o51K95J881L482J126R58C487
$$ 5617 1447 -3116 -4463 -3381 -2048 -1264 -1832 -5259 -8907 -9558 -9263 -7382 -3900 -2774 -1816 3487
35865A1912M627j929k847n66J011K105k72n331D207k034H2J14K291M953M732M63
$$ 11912 16539 14610 11763 11197 12208 14313 14041 8710 4207 2173 82 196 2487 7440 12172 12635
35849A2635P16K395J048j470m875l848m17R82rl413A464O19q1o10K208L636L638
$$ 12635 13351 15746 16794 15324 10449 6601 6184 7166 7157 3744 1464 2083 2002 1392 3600 7236 10874
35832A0874j53k540j480l264A423L0p16e81n43d17B038K752j48P13J829J017n57
$$ 10874 10721 8181 6701 3437 1423 1453 737 -581 -1124 -417 2038 4790 4642 5355 7184 8201 7644
35815G644j627O12K293p13J082J961k668l645j276j88m7q33A073O81L235J873
$$ 7644 6017 6629 8922 8209 9291 11252 8584 4939 3663 3475 3428 2595 1073 1754 4989 6862
35799F862K63K464K564J347k838D605a808j559i28A129j25a350l119k850o42J879
$$ 6862 7125 9589 12153 13500 10662 4605 -1808 -3367 -928 1129 1004 -1350 -4469 -7319 -7961 -6082
35783f082O16j782k936j516Q6k91J437L522c103A505M333J376j042k094B44d391
$$ -6082 -5466 -7248 -10184 -11700 -11614 -11905 -10468 -6946 -3103 1505 5838 7214 6172 4078 244 -4391
35766h025j420P06J406N06K82K330J382J032h98j638l336l024K259g19E850L853
$$ -8025 -9445 -8739 -7333 -6827 -6545 -4215 -2833 -1801 -898 -2536 -5872 -8896 -6637 -719 5850 9703
35750I703N90l00j337k537B403a306k351Q41q32k323j23K5l50J369K520A340L570
$$ 9703 10293 9993 8656 6119 2403 -1306 -3657 -2816 -3648 -5971 -6094 -6069 -6419 -5050 -2530 1340 4910
35733D910J295J148j521k147o25p56m44H28j92K965K444k459d17N3D141L515J289
$$ 4910 6205 7353 5832 3685 3060 2304 1860 828 636 3601 6045 3586 -417 -364 4141 7656 8945
35716H945m37j763o60m94j939K098L529q71k979k704b376l934K26b999b57j480
$$ 8945 8508 6745 6085 5591 3652 5750 9279 8408 5429 2725 -2376 -6310 -6084 -2999 -257 -1737
35700a737e10C589m27j149k40K374M718K759k626l583j435J337M377O01l061j220
$$ -1737 -510 3589 3162 2013 1773 4147 8865 11624 8998 5415 3980 5317 9694 10295 7234 6014
35684F014l14B010b068p16a386k11r5o55l896j800k540l654J395M554d049A341
$$ 6014 5700 2010 -2068 -2784 -1386 -1597 -1692 -2347 -6243 -8043 -10583 -14237 -12842 -8288 -4049 1341
35667E192q47A777Q68K704J087j710j267J322K45D96d848m724K4L664i59D082
$$ 5192 4345 1777 2645 5349 6436 4726 3459 4781 5026 496 -4848 -9572 -9548 -5884 -959 4082
35650B040b309k43g47L62r22f45A262J420J089J246A445d857m339j240J879J954
$$ 2040 -2309 -2552 -747 -385 -1307 -645 1262 2682 3771 5017 1445 -4857 -9196 -10436 -8557 -6603
35634f603L010D198P493J777r19j580k338o55J225m39m247A333D36O93l06c240
$$ -6603 -3593 4198 11691 13468 12549 10969 8631 7976 9201 8762 4515 1333 436 1129 823 -3240
35617g196k164q39L26J796K970a579A409L354M257J044l171l100r39I32a745k66
$$ -7196 -9360 -10199 -9873 -8077 -5107 -1579 1409 4763 9020 10064 6893 3793 2854 932 -1745 -2011
35601b011C70L520J45A168a088k361k712p36p11k551k116p05J49J65M903G59N045
$$ -2011 370 3890 4035 1168 -1088 -3449 -6161 -6897 -7608 -10159 -12275 -12980 -12831 -12666 -7763 759 5804
35584E804j076j591A417a227k694k502O60K379l41m409n467m078j432K695h085
$$ 5804 4728 3137 1417 -1227 -3921 -6423 -5763 -3384 -3725 -8134 -13601 -17679 -19111 -16416 -8085
35568H15N308K055N69q32l64J354k017A738c234j406a554A627D06a05C20J035
$$ 815 6123 8178 8747 7915 7551 8905 6888 1738 -3234 -4640 -1554 1627 406 -105 320 1355
35552A355J542K553K817j660C122H8a980k55B87J584i88m695j38b720h35j549
$$ 1355 2897 5450 8267 6607 3122 88 -1980 -2235 287 1871 -988 -5683 -5821 -2720 -835 -2384
35536b384l801m177j666L210J358k687q13K800K845Q58K16J143a252N81j56p11
$$ -2384 -6185 -10362 -12028 -8818 -7460 -10147 -10960 -8160 -5315 -4457 -4241 -3098 -1252 -671 -827 -1538
35520a538r91j014J27h54A447Q99o01o62J005K149N11q28p44G57I1L213L061j239
$$ -1538 -2529 -3543 -3416 -854 1447 2346 1745 1083 2088 4237 4748 3920 3176 757 91 3304 6365 5126
35502E126c62m097j346k738j655m66J792d118G40L227M96o86j785a733k197M67
$$ 5126 -362 -4459 -5805 -8543 -10198 -10664 -8872 -4118 740 3967 4463 3777 1992 -1733 -3930 -3463
35486c463p3j174O91A57N001K703j565k791K152L715J694O69J528J123j869l162
$$ -3463 -3536 -4710 -4019 157 5158 7861 6296 3505 5657 9372 11066 11735 13263 14386 12517 9355
35470I355k351B760a184j3J93j160e18F16a708l289p05b694B656L886j892A891
$$ 9355 7004 2760 -1184 -1197 -1004 -2164 -518 616 -1708 -4997 -5702 -2694 2656 6542 4650 1891
35453B353J653O19j619e89n017m442j008q60j964J452M048J794M55R62j16l88
$$ 2353 4006 4625 3006 -589 -5606 -10048 -11056 -11916 -13880 -12428 -8380 -6586 -6131 -5169 -5285 -5673
35437e673J685a338G78C8d77A970R86I50b873m454r25K36k262j018o62k806k008
$$ -5673 -3988 -1338 778 38 -477 1970 2956 950 -2873 -7327 -8252 -8016 -10278 -11296 -11958 -14764 -16772
35420a6772J597M340K212j887k101M268a95C845l47G42b006a05B664O23j348h25
$$ -16772 -15175 -10835 -8623 -10510 -12611 -8343 -195 3845 3498 742 -2006 -105 2664 3287 1939 -825
35403e319k406L074a321r84l542k311n62N84j142r10O64J702L360B07K213B62
$$ -5319 -7725 -4651 -1321 -2305 -5847 -8158 -8720 -8136 -9278 -10188 -9524 -7822 -4462 207 2420 262
35386a948M65F02J113K171M206l44C198a303j446h99B943M089J600L81j777l145
$$ -1948 -1483 602 1715 3886 8092 7748 3198 -1303 -2749 -899 2943 7032 8632 9013 7236 4091
35370D091k030F68l20R66P06L23J63A066c262m370J660b10B843J650M192M053
$$ 4091 2061 668 348 1314 2020 2343 2506 1066 -3262 -7632 -5972 -210 2843 4493 8685 12738
35354A2738k76m296G9e116K163E40L042Q13j287j076D39K51P9J39J033G03f44
$$ 12738 12462 8166 79 -5116 -2953 540 3582 4395 3108 2032 439 690 769 908 1941 703 -644
35336A308K923N04n63N73r93c20l077K62j280m127j546K097J070J811b310H0K784
$$ 1308 4231 4735 4172 4745 3752 -320 -3397 -3135 -4415 -8542 -10088 -7991 -6921 -5110 -2310 80 2864
35319B864J841j425a758k912j181j184j463n26J111L247i14D609P529L046l208
$$ 2864 4705 3280 -1758 -4670 -5851 -7035 -8498 -9024 -7913 -4666 -914 4609 12138 15184 11976
35304A1976D713a703m550l665k74n09k533j980J485K178n02m59M004b560A215
$$ 11976 4713 -1703 -6253 -9918 -10192 -10701 -13234 -15214 -13729 -11551 -12053 -12512 -8508 -2560 1215
35288B022p46k87k83b309k450k119l149k10L226b377I41P14D01b29J14k1I28K372
$$ 2022 1276 989 706 -2309 -4759 -6878 -10027 -10237 -7011 -2377 941 1655 401 -229 -115 -136 928 3300
35270C300M344K832r12k677j608k23j031K94A980c288m148k026j744k033j043
$$ 3300 7644 10476 9564 6887 5279 5056 4025 4319 1980 -3288 -7436 -9462 -11206 -13239 -14282
35255a4282K432d075B476N70F32Q23M75D37b069i28C796K665R70j551k448q77
$$ -14282 -11850 -4075 2476 3046 632 1455 1930 437 -2069 -928 3796 6461 7431 5880 3432 2555
35239B555m89a39j373F05J767C49c668j483K284B650L092j945q85J709J962n56
$$ 2555 2066 -139 -1512 605 2372 349 -3668 -5151 -2867 2650 5742 3797 2912 4621 6583 6027
35223F027k429j776J544J490q8A995b906m663l538j608lK731L014j350R83L457
$$ 6027 3598 1822 3366 4856 4768 1995 -2906 -7569 -11107 -12715 -12718 -9987 -6973 -8323 -7340 -3883
35207c883a343D59b470k671J88j111l018m96K295a862E349N764J116k277l688
$$ -3883 -1343 459 -2470 -5141 -4953 -6064 -9082 -9578 -7283 -1862 5349 11113 12229 9952 6264
35192F264k498A241b517j700a726B031J733Q69L3C03b549O43L05A34M663N187
$$ 6264 3766 1241 -2517 -4217 -1726 2031 3764 4633 4666 303 -2549 -1906 -1601 134 4797 9984
35176I984n29j330L001K099k13l210l063k521j009J606K243l05B80e670k010l022
$$ 9984 9455 8125 11126 13225 13012 9802 6739 4218 3209 4815 7058 6753 280 -5670 -7680 -10702
35160a0702j737K798P47k703o65K328M007K739c77D17a833l092k059K789I26L606
$$ -10702 -12439 -9641 -8894 -11597 -12262 -9934 -5927 -3188 -377 417 -1833 -4925 -6984 -4195 926 4532
35144D532J177j739I86b570l657j969l82n2J400R56J025a543B695L208K843K001
$$ 4532 5709 3970 986 -2570 -6227 -8196 -8578 -8630 -7230 -6274 -5249 -1543 2695 5903 8746 10747
35128A0747j276D094b415j932a870G03P13R27K190J855L10p23r49j028j125j20
$$ 10747 9471 4094 -2415 -4347 -1870 703 1416 2343 4533 6388 6698 5975 5026 3998 2873 2753
35112B753J748j252h23p85B062L371k57B246J76M834L590J569J036o9k155l441
$$ 2753 4501 3249 -823 -1608 2062 5433 5176 2246 2422 7256 10846 12415 13451 13382 11227 7786
35096G786k578j064B013q02Q30J545N98n04I41b310m60b82E037L698L30P86M8
$$ 7786 5208 4144 2013 1211 2041 3586 4184 3680 941 -2310 -2770 -282 5037 8735 9065 9851 9899
35079I899k837C218A227P67R31J545J992K472J285n41R90K262L507L162p34k768
$$ 9899 7062 3218 1227 1994 2925 4470 6462 8934 10219 9678 10668 12930 16437 19599 18865 16097
35063A6097j657l185m063B481b796j427c92F178M213J241k197m415k228d50l178
$$ 16097 14440 11255 7192 2481 -2796 -4223 -392 6178 10391 11632 9435 5020 2792 -450 -3628
35048c628J533A163K189K413L416L138K237P39n99r41k784k611M15J462n01k604
$$ -3628 -2095 1163 3352 5765 9181 12319 14556 15295 14696 13755 10971 8360 8775 10237 9736 7132
35032G132j600k000D96k32J785L041J862J73o4j734k022j147Q56R35M6k37J627
$$ 7132 5532 3532 496 264 2049 5090 6952 7125 7061 5327 3305 2158 3014 3949 3995 3758 5385
35015E385K804J413j936l690A971r6p00J69J717K218K596K920K186k07k447D911
$$ 5385 8189 9602 7666 3976 1971 1875 1175 1344 3061 5279 7875 10795 12981 12774 10327 4911
34998I63a951k241K90J169J025I45N660M056J648k837m469R96M768L668P65M15
$$ 963 -1951 -4192 -3902 -2733 -1708 945 6605 10661 12309 9472 5003 5999 10767 14435 15200 15615
34982A5615N62k91l91q74j450o55J505K840L163M64j384L45R78L77P30r73k620
$$ 15615 16177 15886 15495 14621 13171 12516 14021 16861 20024 20488 19104 19449 20427 20804 21534 20561 17941
34965A7941m586m875K288O303L483k792n040k440L13J587L085L512K88k199j093
$$ 17941 13355 8480 10768 17071 20554 17762 12722 10282 10595 12182 15267 18779 19067 16868 15775
34950A5775j287k767l037k735H37g41A768M473L724L111J835j318J8L620K201
$$ 15775 14488 11721 8684 5949 837 -741 1768 6241 9965 13076 14911 13593 13611 17231 19432
34935A9432q27k543L1J849M114M893K976N126N930K886J650N34J461J244K77K059
$$ 19432 18605 16062 16093 17942 22056 26949 29925 35051 40981 43867 45517 46051 47512 48756 49033 51092
34919E1092K222K813P79n10K024J770m03J130L376M708N190P029N371M968O075
$$ 51092 53314 56127 56906 56396 58420 60190 59787 60917 64293 69001 74191 81220 86591 91559 97634
34904I7634P707Q664R416R133P423N045N903O317M197N131P423R619J0589J1167
$$ 97634 105341 114005 123421 132554 139977 145022 150925 157242 161439 166570 173993 183612 194201 205368
34890B05368J3311J6825J8732J8277K3291L1627L6412L8025M1763N0062O3073
$$ 205368 218679 235504 254236 272513 295804 327431 363843 401868 443631 493693 556766
34879E56766P3948Q1066Q8467R8539J12214J27985J40729J47094J49485J44319
$$ 556766 630714 711780 800247 898786 1011000 1138985 1279714 1426808 1576293 1720612
34869A720612J35166J23678J10000R3053P1689M2526R979j9263m8217p8265j03926
$$ 1720612 1855778 1979456 2089456 2182509 2254198 2296724 2306703 2287440 2239223 2160958 2057032
34858B057032j22208j32452j38093j40501j37333j30377j21850j09835r4017p9564
$$ 2057032 1934824 1802372 1664279 1523778 1386445 1256068 1134218 1024383 930366 850802
34848H50802o7374n4400m3732l5798k5507j6558j0229k260Q180J4765K0437K8738
$$ 850802 783428 729028 685296 649498 623991 607433 597204 594944 603124 617889 638326 667064
34836F67064L8414N2000O8486Q0238R0342J02183J09956J19440J28595J34161
$$ 667064 705478 757478 825964 906202 996544 1098727 1208683 1328123 1456718 1590879
34826A590879J36820J34915J28229J17554R9012P1679M2447J3242j9398n3557
$$ 1590879 1727699 1862614 1990843 2108397 2207409 2279088 2321535 2334777 2315379 2261822
34816B261822p8773j00721j20953j37739j46390j48149j46483j43687j37539j26704
$$ 2261822 2183049 2082328 1961375 1823636 1677246 1529097 1382614 1238927 1101388 974684
34806I74684j14156j01467q8261p6711o6643n5743m6653m0421l5451k8519k4755
$$ 974684 860528 759061 670800 594089 527446 471703 425050 384629 349178 320659 295904
34795B95904k3412k0953j8635j4534j2235j0733p537o893j1384j3130q704n136
$$ 295904 272492 251539 232904 218370 206135 195402 187865 180972 169588 156458 147754 142618
34783A42618l619k331m729j0930j0125m696j217Q12k788n702o079o699n017n620
$$ 142618 138999 136668 131939 121009 110884 106188 104971 105783 102995 97293 91214 84515 79498 73878
34769G3878o079n912n116n119p379o841j888M358N365L26l846m318m519o363n469
$$ 73878 67799 61887 56771 51652 44273 37432 35544 39902 45267 45593 41747 37429 32910 26547 21078
34754B1078M04L647L082M559M370M99k004n81j152j512j481k16K341P64m002m228
$$ 21078 21482 25129 28211 32770 37140 37639 35635 35054 33902 32390 30909 30693 33034 33798 29796 25568
34738B5568n1M334M178m8k312j568j568K99J205j988j007J63M8M28n11j096j019
$$ 25568 25517 29851 34029 33981 31669 30101 28533 28832 30037 28049 27042 27205 27253 27681 27170 26074 25055
34721B5055k080m967k296O22M35J941j322n024m443k511o94P75J315J919N293
$$ 25055 22975 18008 15712 16334 16769 18710 17388 12364 7921 5410 4716 5491 6806 8725 14018
34706A4018L080j301k20K145J467j660l754L56K519M36k883k395K014M202M509
$$ 14018 17098 15797 15577 17722 19189 17529 13775 14131 16650 17086 14203 11808 13822 18024 22533
34691B2533M337J436K79J738K65j135q00p55p79K76o50o932q546E360A178a197
$$ 22533 26870 28306 28585 30323 30588 29453 28653 27898 27119 27395 26745 19813 11267 5360 1178 -1197
34674a387l36j087O91O47p32Oc03B001K608R75M1j846I09A44J850R31J050J437
$$ -1387 -1723 -2810 -2119 -1472 -2204 -2198 -303 2001 4609 5584 5625 3779 909 144 1994 2925 3975 5412
34656E412K155L694K779m73k008J29K334J053k201l201O23K368K112p11n288C541
$$ 5412 7567 11261 14040 13567 11559 11688 14022 15075 12874 9673 10296 12664 14776 14065 8777 3541
34639A907J622J732K646J417Q46J732J875P77L75j239l358k653j976l41N66R06
$$ 1907 3529 5261 7907 9324 10170 11902 13777 14554 14929 13690 10332 7679 5703 5362 5928 6834
34623F834k79k857n08L248M178K665p40F246A399N7J618M13r17l61o3n43F21a981
$$ 6834 6555 3698 3190 6438 10616 13281 12541 6246 1399 1456 3074 3487 2570 2209 2146 1603 621 -1981
34604b991c74B311I99b150j388M53P69c78C098L191K13k038A206a217j324L28
$$ -2991 -374 2311 999 -2150 -3538 -3085 -2316 -378 3098 6289 6502 4464 1206 -1217 -2541 -2213
34588b213A30J295o15i85k149a112D952O845O248R65o036D779A638J054J587J308
$$ -2213 130 1425 810 -985 -3134 -1112 4952 11797 18045 19010 12974 4779 1638 2692 4279 5587
34572E587j130j578j090L43K50K24J983K836K603J19q17j266j446p8j933A698
$$ 5587 4457 2879 1789 2132 2382 2606 4589 7425 10028 10147 9330 8064 6618 6540 4607 1698
34555h65l194m562k849Q12n62l04J984K374L21j948l080o18O58K520M309a714
$$ -865 -4059 -8621 -11470 -10658 -11220 -11524 -9540 -7166 -6845 -8793 -11873 -12491 -11833 -9313 -5004 -1714
34538g07R2p18j488O36d56D74M004O471J755l037m378A305c99a9C66J419M823
$$ -707 -615 -1333 -2821 -2185 -456 474 4478 10949 12704 9667 5289 1305 -399 -19 366 1785 6608
34521F608N136m16m128B561b975k723J174J380O01k32Q33B779J803j461J995K431
$$ 6608 11744 11328 7200 2561 -2975 -5698 -4524 -3144 -2543 -2775 -1942 2779 4582 3121 5116 7547
34505G547j642j973m39k88j07K31p01j206D11a9A564L407N43A207a170G2J379
$$ 7547 5905 3932 3493 3205 3098 3329 2628 1422 411 -19 1564 4971 5514 1207 -1170 72 1451
34488A451K905n11g24j937J315B899O943N573J055k049j129q0q42j162j015j190
$$ 1451 4356 3845 -724 -2661 -1346 2899 9842 15415 16470 14421 13292 13212 12370 11208 10193 9003
34472I003k109k631A346B01K34f86m40A65L435L612K461j8j953C766a913j756
$$ 9003 6894 4263 1346 201 435 -686 -1126 165 3600 7212 9673 9655 7702 3766 -1913 -3669
34456c669f79F008Q240P69F633b141k194f95C385L423J946k078l305A101d98k096
$$ -3669 -679 6008 14248 15017 6633 -2141 -4335 -695 3385 6808 8754 6676 3371 1101 -498 -2594
34440b594l502k114K657a294A270B27a932p68O85@A630a517m092j244m21j54j774
$$ -2594 -6096 -8210 -5553 -1294 1270 227 -1932 -2700 -2015 0 1630 -1517 -5609 -6853 -7274 -7428 -9202
34423i202o79L817a172B135k18a428j698L97R63a23j210j256L74j063j391r85
$$ -9202 -9881 -6064 -1172 2135 1917 -1428 -3126 -2729 -1766 -123 -1333 -2589 -2215 -3278 -4669 -5654
34407e654l155l386J329K678O27J53P96n29J734a72E024N170L477O53m215m969
$$ -5654 -8809 -12195 -10866 -8188 -7561 -7408 -6612 -7141 -5407 -172 5024 10194 13671 14324 10109 5140
34391E140m62J120j035B142G36K231M996K247j499j665m81j104j602O82J761j53
$$ 5140 4678 5798 4763 2142 736 2967 7963 10210 8711 7046 6565 5461 3859 4541 6302 6149
34375F149j342j287n8p07d74l572M43J469p22p70J685k66j355l1o57J246c4D683
$$ 6149 4807 3520 3462 2755 -474 -4046 -3603 -2134 -2856 -3626 -1941 -2207 -3562 -3593 -4250 -3004 -34 4683
34356I966J741l059k500J665J880j722j292L08o10k277A613b584l925K143B916
$$ 9966 11707 8648 6148 7813 9693 7971 6679 6987 6377 4100 1613 -2584 -6509 -4366 2916
34340H441K577Q59l180l404q00K94l5A789c474l396j689J38J045J637K674C90
$$ 8441 11018 11877 8697 5293 4493 4787 4752 1789 -3474 -6870 -8559 -8421 -7376 -5739 -3065 390
34323B953J040M65J237J080j579j410N17J834J785K132J210n14m25J682J421j780
$$ 2953 3993 4458 5695 6775 5196 3786 4303 6137 7922 10054 11264 10750 10325 12007 13428 11648
34307A1648l995C805c52n599l270J009J225N56J415n0k070k014r73l68R24K326
$$ 11648 7653 3805 -352 -5951 -9221 -8212 -6987 -6431 -5016 -5066 -7136 -9150 -10123 -10491 -9567 -7241
34291g241K234R88L13J91J99Q15O17f58r09j722j983l191j643L150g34C740K905
$$ -7241 -5007 -4019 -3706 -3515 -3316 -2501 -1884 -658 -1567 -3289 -5272 -8463 -10106 -6956 -734 3740 6645
34274F645mk663I06a546k766k272M47J778L09a170E053N321n40k453K017M637
$$ 6645 6641 3978 906 -1546 -4312 -6584 -6137 -4359 -4050 -1170 5053 10374 9834 7381 9398 14035
34258A4035K299k281l963k970j022j761A431A54K761N645N186M392J594k076k137
$$ 14035 16334 14053 10090 7120 6098 4337 1431 154 2915 8560 13746 18138 19732 17656 15519
34243A5519j584j319j942m364A908q29J079K27L18J412J235N59p36A610F02K496
$$ 15519 13935 12616 10674 6310 1908 1079 2158 2385 2703 4115 5350 5909 5173 1610 602 3098
34227C098K426J669k035e2k227n0j56R20B0K235K385K407R62k935A674b64k014
$$ 3098 5524 7193 5158 -52 -2279 -2329 -2485 -1565 20 2255 4640 7047 8009 5074 1674 -264 -2278
34210b278l071k108m29J55Q66c251B577L683K526L070K823J403j652k042k787
$$ -2278 -5349 -7457 -7886 -7731 -6865 -3251 2577 6260 8786 11856 14679 16082 14430 12388 9601
34195I601k688J867N353L031l209m985l835N06M879L924K566J012p58n718C709
$$ 9601 6913 8780 14133 17164 13955 8970 5135 5641 10520 14444 17010 18022 17264 11546 3709
34179a689k058N27J023A655M191P98k095j291J849K055k293A188J19L127J112
$$ -1689 -3747 -3220 -2197 1655 5846 6644 4549 3258 5107 7162 4869 1188 1307 4434 5546
34164E546B590a049k692j667k036J64a676D707K110l90J334K092J966K287K125
$$ 5546 2590 -1049 -3741 -5408 -7444 -7280 -1676 4707 6817 6427 7761 9853 11819 14106 16231
34149A6231M22k548m130l501j974p44K49J72J549K920R70j166k901B561j53K322
$$ 16231 16653 14105 9975 6474 4500 3756 4005 4177 5726 8646 9616 8450 5549 2561 2408 4730
34133D730J018k523I61P06K476J958J753J790k32k092k418q64N14R14L070K031
$$ 4730 5748 3225 961 1667 4143 6101 7854 9644 9412 7320 4902 4038 4552 5466 8536 10567
34117A0567j770m159I89a512P0A355M192L938J135j486J181M80k452k134k589
$$ 10567 8797 4638 989 -1512 -1442 1355 5547 9485 10620 9134 10315 10795 8343 6209 3620
34102C620j176O66L214M424J07l091C733B75J179M027L686N19q44q65Q40J65o21
$$ 3620 2444 3110 6324 10748 10855 7764 3733 275 1454 5481 9167 9686 8842 7977 8817 8982 8361
34085H361n27j023j304m53k022C9O65K029N636N877J081o33j254r26n70l239m025
$$ 8361 7834 6811 5507 5054 3032 39 704 2733 8369 14246 15327 14694 13440 12514 11944 8705 4680
34068D680r40J241l8o82O75J094K880K937L107J199j037j322j775k749k319j942
$$ 4680 3740 4981 4943 4261 4936 6030 8910 11847 14954 16153 15116 13794 12019 9270 6951 5009
34052E009m86K029K185J21M76K412J932j047j496Q66N48k066l138k915l69J541
$$ 5009 4523 6552 8737 8858 9334 11746 13678 12631 11135 12001 12549 10483 7345 4430 4061 5602
34036E602K238J991j135l092r26R17j145A05b498K79p06j254L96J428P85g03C60
$$ 5602 7840 9831 8696 5604 4678 5595 4450 105 -2498 -2219 -2925 -4179 -3783 -2355 -1570 -703 360
34018B141L424L034m03R11J31m097i64m630j059Q02J812a344F22P61J143J195
$$ 2141 5565 8599 8196 9107 9238 5141 -964 -5594 -6653 -5851 -4039 -1344 622 1383 2526 3721
34002C721J126J992M024L390R40j16j497k924m113j500R68K177K749R02k618D045
$$ 3721 4847 6839 10863 14253 15193 15077 13580 10656 6543 5043 6011 8188 10937 11839 9221 4045
33985a434j103H65K617r12a36k025N6g75B27f3q16j153K1m89l274j563J835a840
$$ -1434 -2537 865 3482 2570 -136 -2161 -2105 -775 227 -63 -879 -2032 -2011 -2500 -5774 -7337 -5502 -1840
33966C120O849N923j37k536K62L24L59K592L283L693k16n557m894K61k74n634
$$ 3120 9969 15892 15755 13219 13481 13805 14164 16756 20039 23732 23516 17959 13065 13326 13052 7418
33950G418A19d188Q43B039N203L102N93p05n21p9n64j114j204j027J332M085L134
$$ 7418 119 -4188 -3345 2039 7242 10344 10937 10232 9711 9632 9068 7954 6750 5723 7055 11140 14274
33933A4274p20j336K46p80j123k130j500j197J66J177L59j235M78J233l10M59
$$ 14274 13554 12218 12464 11684 10561 8431 6931 5734 5900 7077 7436 6201 6679 7912 7602 8061
33917H061L319L743j065j997K82o59j863n80j346k741A895P8J932L000M741L647
$$ 8061 11380 15123 14058 12061 12343 11684 9821 9241 7895 5154 1895 1973 3905 6905 11646 15293
33901A5293K105L657J805k481l814l371k142o48m83O20L325L692L94j112o4N97
$$ 15293 17398 21055 22860 20379 16565 13194 11052 10404 9921 10541 13866 17558 17952 16840 16776 17373
33885A7373k86m13j960k674o18J658J25O63K980K012O00O10K02k221k720J990
$$ 17373 17087 16674 14714 12040 11422 13080 13205 13868 16848 18860 19460 20070 20272 18051 15331 17321
33869A7321M559K178j525l528m873l17M160K601J200j716n199l490o71J329K171
$$ 17321 21880 24058 22533 19005 14132 13815 17975 20576 21776 20060 14861 11371 10700 12029 14200
33854A4200J337l75j044M19J960J176K59j63J310K237n16l010k224M77J501J982
$$ 14200 15537 15162 14118 14537 16497 17673 17932 17769 19079 21316 20800 17790 15566 16043 17544 19526
33838A9526M154K628j164l541n315l711j182J047O15j055L93R12j36l051D829
$$ 19526 23680 26308 25144 21603 16288 12577 11395 12442 13057 12002 12395 13307 13171 10120 4829
33822B38b543p01d91E224N522L449J077j006k738l390k052j630A971j61K880L422
$$ 238 -2543 -3244 -491 5224 10746 14195 15272 14266 11528 8138 6086 4456 1971 1810 4690 8112
33806H112K459Q30m15j218m186H14a280J16iB40K541J372A674A36J509N094P341
$$ 8112 10571 11401 10986 9768 5582 814 -1280 -1164 -9 240 2781 4153 1674 136 1645 6739 14080
33789A4080J902m291l436k7O94j001m53q7o82j015k65J543L163O05l042l775A521
$$ 14080 15982 11691 8255 8228 8922 7921 7468 7381 6699 5684 5419 6962 10125 10730 7688 3913 1521
33771B189K668r7p84p09O20L276N144K187l532l557J47Q15j679C157a708j254
$$ 2189 4857 4760 3976 3267 3887 7163 12307 14494 10962 7405 7552 8367 6688 3157 -1708 -2962
33755b962Q37k930l672m43J931b500B003J913K183K398P87l63l94o20p32L37J846
$$ -2962 -2125 -5055 -8727 -9170 -7239 -2500 2003 3916 6099 8497 9284 8921 8527 7907 7175 7512 9358
33738I358L459K639J322j08k485j578nj686E320a783b56I995P916K939O12k693
$$ 9358 12817 15456 16778 16670 14185 12607 12602 10916 5320 -1783 -256 9995 17911 20850 21462 18769
33722A8769j873j303j685r9m03j949j783J449R29l262l092K325K798K16k75J664
$$ 18769 16896 15593 13908 13809 13406 11457 9674 11123 12052 8790 5698 8023 10821 11037 10762 12426
33706A2426L769L362J764k097l054r95j345J32q32j516j880k538J195N297M040
$$ 12426 16195 19557 21321 19224 16170 15175 13830 13962 13130 11614 9734 7196 8391 13688 17728
33691A7728j800o842C250d36k389j219O75O0J155A299L639J437L086M697K491
$$ 17728 15928 9086 3250 -436 -2825 -4044 -3369 -3309 -2154 1299 4938 6375 9461 14158 16649
33676A6649n17m45J388J162j093j180J086J841K233K166j32Q69M96k22k133n784
$$ 16649 16132 15687 17075 18237 17144 15964 17050 18891 21124 23290 23158 24027 24523 24301 22168 16384
33660A6384l888j279O77N8Q02O84K27k92m056k580J326J819j6j500j21K019j29
$$ 16384 12496 11217 11894 11952 12754 13438 13665 13373 9317 6737 8063 9882 9866 8366 8245 10264 10135
33643A0135j473K009M931L286J81j816l242m039m132j430K138N99J471M034K822
$$ 10135 8662 10671 15602 18888 19069 17253 14011 9972 5840 4410 6548 7147 8618 12652 15474
33628A5474J318J120j019J786J206J474K193m06m092n173l148j110J944J591j415
$$ 15474 16792 17912 16893 18679 19885 21359 23552 23146 19054 13881 10733 9623 11567 13158 11743
33613A1743l667j501K132L460K271J999J567J46k855l252l32Q56J21M84n41k242
$$ 11743 8076 6575 8707 12167 14438 16437 18004 18150 15295 12043 11711 12567 12688 13172 12631 10389
33597A0389P19L867K998K191K412L114j79l625k107J68J480K309j142m178l873
$$ 10389 11108 14975 17973 20164 22576 25690 25511 21886 19779 19947 21427 23736 22594 18416 14543
33582A4543j721L24k25j462j603m55k153k058n60K54J815K895M383L900J311j72
$$ 14543 12822 13146 12921 11459 9856 9401 7248 5190 4630 4884 6699 9594 13977 17877 19188 19016
33566A9016p59L1Q00J34l230m616k088M71K152K974J139J13j962l922l842B884
$$ 19016 18257 18288 19088 19222 15992 11376 9288 9759 11911 14885 16024 16137 14175 10253 6411 2884
33549B026n05m57K74C81M76K916J471Q44K225L792K000J84j039l852l006j66j5
$$ 2026 1521 1064 1338 381 857 3773 5244 6088 8313 12105 14105 14289 13250 9398 6392 6226 6211
33532F211o25j90J350K629O446M599n88j136P91l174o620l877J345M324M417J926
$$ 6211 5586 5396 6746 9375 15821 20420 19832 18696 19487 16313 9693 5816 7161 11485 15902 17828
33516A7828o96M03N19k574n531m260K28J953K264J424J190Q99P03J563N43K98
$$ 17828 17132 17535 18054 15480 9949 5689 5917 7870 10134 11558 12748 13647 14350 15913 16456 16754
33500A6754k89p72K645L055p2J29M951N484L588K234M64j083l823p748o595N48
$$ 16754 16465 15693 18338 21393 21321 21450 26401 31885 35473 37707 38171 37088 33265 25517 18922 19470
33484A9470K555K122R80J429R93m02j245k10j71N9J031K438L818J390j683m400
$$ 19470 22025 24147 25127 26556 27549 27147 25902 25692 25521 25580 26611 29049 32867 34257 32574 28174
33468B8174l464P83K745L237J572k96J006J228j824n073n055l824l199k550k632
$$ 28174 24710 25493 28238 31475 33047 32751 33757 34985 33161 28088 23033 19209 16010 13460 10828
33453A0828r14P47P38J972m46k814j994O81K379M200N664N030J530k388l654n555
$$ 10828 9914 10661 11399 13371 12925 10111 8117 8798 11177 15377 21041 26071 27601 25213 21559 16004
33437A6004n602n161nQ280R780M370O6J506J924j092k610k198M49Q60q74J456
$$ 16004 10402 5241 5236 13516 23296 27666 27732 29238 31162 30070 27460 25262 25711 26571 25697 27153
33421B7153K014K156M95l96l96j04k172j610J366P55r97k189j928R29K464J231
$$ 27153 29167 31323 31818 31422 31026 30922 28750 27140 28506 29261 28264 26075 24147 25076 27540 28771
33405B8771j538j320J952M235L623L184Q97j284k246q84J704K070J888M71q45
$$ 28771 27233 25913 27865 32100 35723 38907 39804 38520 36274 35390 37094 39164 41052 41523 40678
33390D0678k840m570m839k964K00J142N26K552M772N223N239M941J289m415o455
$$ 40678 37838 33268 28429 25465 25665 26807 27333 29885 34657 39880 45119 50060 51349 46934 40479
33375D0479m634k807q75J636K206L280m58l451k078j752j765j051l03K60R26P01
$$ 40479 35845 33038 32163 33799 36005 39285 38827 35376 33298 31546 29781 28730 28427 28687 29613 30314
33359C0314Q07K68M36j210m832l177J551L532L757R11J82P14n52N02J337J382
$$ 30314 31121 31389 31825 30615 25783 22606 24157 27689 31446 32357 32539 33253 32701 33203 34540 35922
33343C5922K8k779k163o71l68M60P57r94r43J808M021J817j378M19J963J192O
$$ 35922 35950 33171 31008 30337 29969 30429 31186 30192 29249 31057 35078 36895 35517 35936 37899 39091 39097
33326C9097j110J69n3O25N32p04n48q39L76L45J036L079o90m040m37J062K648
$$ 39097 37987 38156 38103 38728 39260 38556 38008 37169 37545 37890 38926 42005 41315 37275 36838 37900 40548
33309D0548J985J951M62m010j945L699L537l86j583K468L276k584m937l218k743
$$ 40548 42533 44484 44946 40936 38991 42690 46227 45841 44258 46726 50002 47418 42481 39263 36520
33294C6520j895P56R69m8J111J533K244K940L558M697N219K827m85l721m095p05
$$ 36520 34625 35381 36350 36302 37413 38946 41190 44130 47688 52385 57604 60431 59946 56225 52130 51425
33278E1425J811K146m1j538k466m169k039J857L064K146j027l966J622M636k7
$$ 51425 53236 55382 55341 53803 51337 47168 45129 46986 50050 52196 51169 47203 48825 53461 53434
33263E3434l195j386L619M658N75j592m39p78P10J813K4k792k460k448l999k388
$$ 53434 50239 48853 52472 57130 57705 56113 55674 54896 55606 57419 57443 54651 52191 49743 45744 43356
33247D3356N26L278N336K217j657p89K700N671K710m073o133l659k140M72M073
$$ 43356 43882 47160 52496 54713 53056 52267 54967 60638 63348 59275 53142 49483 47343 47815 51888
33232E1888O308J421m121k527m00J260J734M148L143j68j365r48j36J931J211
$$ 51888 58196 59617 55496 52969 52569 53829 55563 59711 62854 62686 61321 60373 60237 62168 63379
33217F3379M66J729K032L668L617L612P666P632K594k797n038j078K791j45o61
$$ 63379 63845 65574 67606 71274 74891 78503 86169 93801 96395 93598 88560 87482 90273 90128 89467
33202H9467K494J989n96j481l096o857m667j370k658j407K510M893L965J031N7
$$ 89467 91961 93950 93354 91873 88777 81920 77253 75883 73225 71818 74328 79221 83186 84217 84274
33187H4274j127j354K961P461O394J349j425j807k444m681n121q16M771L565L21
$$ 84274 83147 81793 84754 92215 98609 99958 98533 96726 94282 89601 84480 83664 88435 92000 92321
33172I2321k241j716j140k607k037k81J622J931K233R76L64o46j999J35J118P72
$$ 92321 90080 88364 87224 84617 82580 82299 83921 85852 88085 89061 89425 88779 86780 86915 88033 88805
33156H8805K664K223O59Q88Q71J056K83l885l484K4r16j889J662L679K262J17
$$ 88805 91469 93692 94351 95239 96110 97166 97449 93564 90080 90104 89188 87299 88961 92640 94902 95019
33140I5019k716l891l183j252n96P01J325Q06N74N71k29l80K404N549M781O14
$$ 95019 92303 88412 85229 83977 83381 84082 85407 86213 86787 87358 87129 86749 89153 94702 99483 100097
33124A00097J28J739J840K355L651L870M201K672K644L883L419J755r61R49J461
$$ 100097 100225 101964 103804 106159 109810 113680 117881 120553 123197 127080 130499 132254 131293 132242 133703
33109A33703j384k330j267j762k862k740n51L01p4J520J850J754J485J396J542
$$ 133703 132319 129989 128722 126960 124098 121358 120807 121108 121034 122554 124404 126158 127643 129039 130581
33094A30581J08l491m270R01O011N474M00j201j028j036J62N58K360J680m91q40
$$ 130581 130689 127198 122928 123829 129840 135314 135714 134513 133485 132449 132611 133169 135529 137209 136718 135878
33078A35878K29P58K50L026M700L426L343L291K599r50j316L265K751J044J77
$$ 135878 136107 136865 137115 140141 144841 148267 151610 154901 157500 156550 155234 158499 161250 162294 162471
33063A62471k918j897J942K027J369R47r6K32J388L31p9L210L321K14O90J460
$$ 162471 159553 157656 159598 161625 162994 163941 163845 164077 165465 165796 165717 168927 172248 172462 173152 174612
33047A74612J312J424J103K124L331L398M226L902M713M906J95l215k913n86R73
$$ 174612 175924 177348 178451 180575 183906 187304 191530 195432 200145 205051 205246 202031 199118 198532 199505
33032A99505j88M74L363K823m7M22K816L837M365K631Q14J489J800L876N166L104
$$ 199505 199317 199791 203154 205977 205930 206352 209168 213005 217370 220001 220815 222304 224104 227980 233146 236250
33016B36250J146J299J898j53J888N107K867M053P324N100j01m01K278L304K317
$$ 236250 237396 238695 240593 240440 242328 247435 250302 254355 261679 266779 266678 266277 268555 271859 274176
33001B74176Q62m38j008J85R19J170L86J273N406O928N972L562m13p96J705M190
$$ 274176 275038 274600 273592 273777 274696 275866 276252 277525 282931 289859 295831 299393 298980 298184 299889 304079
32985C04079K695K882L977J036j264J027L034J238j70k94j2K908O296P253O509
$$ 304079 306774 309656 313633 314669 313405 314432 317466 318704 318534 318240 318228 321136 327432 334685 341194
32970C41194L257K992O978R428R321O860M339K558q73OK475M046N783L108K674
$$ 341194 344451 347443 354421 363849 373170 380030 384369 386927 386054 386060 388535 392581 398364 401472 404146
32955D04146M426N019M788N347L221N93R38J871L106K935J529K350O071N819L819
$$ 404146 408572 413591 418379 423726 426947 427540 428478 430349 433455 436390 437919 440269 446340 452159 455978
32940D55978M427L926K376K234K904K035J993M016P728P866N809N934P073N100
$$ 455978 460405 464331 466707 468941 471845 473880 475873 479889 487617 495483 501292 507226 514299 519399
32926E19399L272M969R880J2935J1320P974P689J1134J3365J2731R415O960R267
$$ 519399 522671 527640 537520 550455 561775 569749 577438 588572 601937 614668 624083 631043 640310
32913F40310J5146J7508J5288R723P293Q427J1326R359Q625J2800J3547J2225
$$ 640310 655456 672964 688252 697975 705268 713695 725021 734380 743005 755805 769352 781577
32901G81577R122O764P109R075J0313R856R827R814R707R152J2300J5183J5413
$$ 781577 790699 797463 804572 813647 823960 833816 843643 853457 863164 872316 884616 899799 915212
32888I15212J5053J4788J6965K2179K4226K3017K1648K2869K3067J9369J8639
$$ 915212 930265 945053 962018 984197 1008423 1031440 1053088 1075957 1099024 1118393 1137032
32877A137032K3321K8036K9610K8471L0427L2503L0398K9864L2543L4886L4940
$$ 1137032 1160353 1188389 1217999 1246470 1276897 1309400 1339798 1369662 1402205 1437091 1472031
32866A472031L3945L5881L6331L3972L6108M2469M6286M6282M5796M3216L7987
$$ 1472031 1505976 1541857 1578188 1612160 1648268 1690737 1737023 1783305 1829101 1872317 1910304
32855A910304L7344M2777M7991N0377M8990M8063N0803N4874N5666N5681N7498
$$ 1910304 1947648 1990425 2038416 2088793 2137783 2185846 2236649 2291523 2347189 2402870 2460368
32844B460368O2285O6998O6929O8490P5959Q4047R0323R2551R5703J02293J03772
$$ 2460368 2522653 2589651 2656580 2725070 2801029 2885076 2975399 3067950 3163653 3265946 3369718
32833C369718J06285J16603J28104J31737J35667J44443J50971J56151J63408
$$ 3369718 3476003 3592606 3720710 3852447 3988114 4132557 4283528 4439679 4603087
32824D603087J72319J84150J95768K01806K11768K28892K42871K52003K58771
$$ 4603087 4775406 4959556 5155324 5357130 5568898 5797790 6040661 6292664 6551435
32815F551435K68514K79989K93680L07747L22043L41733L61897L79637L97898
$$ 6551435 6819949 7099938 7393618 7701365 8023408 8365141 8727038 9106675 9504573
32806I504573M21947M46774M71679N03412N41213N81394O22407O66431P12377
$$ 9504573 9926520 10373294 10844973 11348385 11889598 12470992 13093399 13759830 14472207
32797A4472207P61473Q13547Q67804R26554R96836J073852J154953J242759J340380
$$ 14472207 15233680 16047227 16915031 17841585 18838421 19912273 21067226 22309985 23650365
32788B3650365J452305J579509J719495J874443K054271K262149K500579K774425
$$ 23650365 25102670 26682179 28401674 30276117 32330388 34592537 37093116 39867541
32780C9867541L089930L457790L891822M406752N020623N757187O636884P692901
$$ 39867541 42957471 46415261 50307083 54713835 59734458 65491645 72128529 79821430
32772G9821430Q955147J0431285J2101748J3898475J5704224J7382089J8803996
$$ 79821430 88776577 99207862 111309610 125208085 140912309 158294398 177098394
32765A77098394J9848393K0406002K0350330J9492656J7584911J4403025R921956
$$ 177098394 196946787 217352789 237703119 257195775 274780686 289183711 299105667
32758B99105667M422055j634893p789044j3556322j8312530k1488413k2882206
$$ 299105667 303527722 301892829 294103785 280547463 262234933 240746520 217864314
32751B17864314k2727727k1493823j9651823j7564377j5460650j3458101j1621616
$$ 217864314 195136587 173642764 153990941 136426564 120965914 107507813 95886197
32744I5886197r992861q578710p375332o373045n541861m848950m273289l790938
$$ 95886197 85893336 77314626 69939294 63566249 58024388 53175438 48902149 45111211
32736D5111211l380673l029748k727626k470955k247541k046383j864145j703550
$$ 45111211 41730538 38700790 35973164 33502209 31254668 29208285 27344140 25640590
32728B5640590j557196j428161j317511j220442j132148j046744r73656r10734
$$ 25640590 24083394 22655233 21337722 20117280 18985132 17938388 16964732 16053998
32720A6053998q45883p81769p22410o70176o24897n85649n47863n14155m83519
$$ 16053998 15208115 14426346 13703936 13033760 12408863 11823214 11275351 10761196 10277677
32711A0277677m54664m31056m08866l84350l59437l38464l16486k96126k79351
$$ 10277677 9823013 9391957 8983091 8598741 8239304 7900840 7584354 7288228 7008877
32702G008877k61467k46238k33734k20705k08434j96604j84545j72453j58806
$$ 7008877 6747410 6501172 6267438 6046733 5838299 5641695 5457150 5284697 5125891
32693E125891j48184j42814j36906j29815j22651j17594j15488j12830j07078
$$ 5125891 4977707 4834893 4697987 4568172 4445521 4327927 4212439 4099609 3992531
32684C992531j03457j02018r8478r6403r3400q7155q4063q1739p9429p9067p7822
$$ 3992531 3889074 3787056 3688578 3592175 3498775 3411620 3327557 3245818 3166389 3087322 3009500
32673C009500p3076o6965o6468o7149o6639o4875o4058o4132o0256n5879n3198
$$ 3009500 2936424 2869459 2802991 2735842 2669203 2604328 2540270 2476138 2415882 2360003 2306805
32662B306805m9918m4731m2652m6458m7620m0304l2973l1043l0809l0879l0263
$$ 2306805 2256887 2212156 2169504 2123046 2075426 2035122 2002149 1971106 1940297 1909418 1879155
32651A879155l1822l3816l4961l6301l5477l0680k5845k4027k3188k2228k3962
$$ 1879155 1847333 1813517 1778556 1742255 1706778 1676098 1650253 1626226 1603038 1580810 1556848
32640A556848k4924k4925k6166k4734k4091k4593k2229j9143j6462j4531j6866
$$ 1556848 1531924 1506999 1480833 1456099 1432008 1407415 1385186 1366043 1349581 1335050 1318184
32629A318184j8756j9058j8400j9804k1856k5329k7683k5378k1104j8844j8135
$$ 1318184 1299428 1280370 1261970 1242166 1220310 1194981 1167298 1141920 1120816 1101972 1083837
32618A083837j5869j6384j5563j4601j7106j9794j7884j5335j4146j2720j2670
$$ 1083837 1067968 1051584 1036021 1021420 1004314 984520 966636 951301 937155 924435 911765
32607I11765j0767j0444j0199r647r232p201p046r737j0250r859j0084j1732j1142
$$ 911765 900998 890554 880355 870708 861476 854275 847229 837492 827242 817383 807299 795567 784425
32594G84425p930q221j0601q463n586k707k709o433q396j0374j3921j2156r593
$$ 784425 776495 768274 757673 749210 743624 740917 738208 731775 723379 713005 699084 686928 677335
32581F77335j0981j2016r906q069p881j0020j1781j2254j1709r416l776k954o382
$$ 677335 666354 654338 644432 636363 628482 618462 606681 594427 582718 573302 569526 566572 560190
32568E60190p856n663l055m166p827j1431r176q148q625r686j0800r526q221n913
$$ 560190 552334 546671 543616 539450 531623 520192 511016 502868 494243 484557 473757 464231 456010 450097
32554D50097j897j838n086o556n813o862p650n189l692l848l396o609o726l012
$$ 450097 448200 446362 441276 434720 428907 422045 414395 409206 405514 401666 398270 391661 384935 381923
32540C81923j870k080R0Q21k060l258k018k199m131n499o041n262m453l022n416
$$ 381923 380053 377973 378063 378884 376824 373566 371548 369349 365218 359719 353678 348416 343963 340941 335525
32525C35525n653N0j312l114k83k04l303m865n935p474p669o703n628n944m637
$$ 335525 329872 329922 328610 325496 325213 325009 321706 316841 310906 303432 295763 289060 283432 277488 272851
32510B72851m174n091m347l256k136L80J92k934k123J851K724k9j006J405J860
$$ 272851 268677 263586 259239 255983 253847 254227 254419 251485 249362 251213 253937 253908 252902 254307 256167
32495B56167N29k195m604k059p0j062m015m089l44M97l79l628n822o724q700n302
$$ 256167 256696 254501 249897 247838 247768 246706 242691 238602 238258 238755 238376 234748 228926 222202 213502 208200
32479B08200j311j092P01K432j70l529m793m236l079r09J644K814K477N56n39
$$ 208200 206889 205797 206498 208930 208760 205231 200438 196202 193123 192214 193858 196672 199149 199705 199166
32464A99166K93k828n366n246m001r18J097p02l959l408j605n69O80J28o80J098
$$ 199166 199459 196631 191265 186019 182018 181100 182197 181495 177536 174128 172523 171954 172634 172762 172082 173180
32448A73180J705p49k554m193j588m4q79j283k975m446k977k87P08K362L442L577
$$ 173180 174885 174136 171582 167389 165801 165757 164878 163595 160620 156174 153197 152910 153618 155980 159422 162999
32432A62999k15m470n856j503J749j766m887m268k620J013K027J446L886J180
$$ 162999 162784 158314 152458 150955 152704 150938 146051 141783 139163 140176 142203 143649 147535 148715
32418A48715k229K0L351M120P98m118p161o219l629k834j36R49q56l054n526o197
$$ 148715 146486 146506 149857 153977 154775 150657 143496 137277 133648 130814 130678 131627 130771 127717 122191 115994
32402A15994l936j402p80k604j625P61j115N00M451M839M186r26k353N17o3j181
$$ 115994 112058 110656 109876 107272 105647 106408 105293 105793 110244 115083 119269 118343 115990 116507 116444 115263
32386A15263J386L754K407l78K95K516K053l56k091l661m919n141k950j864j977
$$ 115263 116649 120403 122810 122432 122727 125243 127296 126940 124849 121188 116269 111128 108178 106314 104337
32371A04337k377k071j571j26J260j338j589P06J513J733J044q77m65J176N51
$$ 104337 101960 99889 98318 98192 99452 98114 96525 97231 98744 100477 101521 100644 100179 101355 101906
32356A01906J024R74n66k938l920j433K368K58o56R50q95k011m39O43K83p98R15
$$ 101906 102930 103904 103338 100400 96480 95047 97415 97673 97017 97967 97072 95061 94622 95265 95548 94750 95665
32339I5665K864J524J334K976L152K171K138J092n86l063K73M439M874M549M684
$$ 95665 98529 100053 101387 104363 107515 109686 111824 112916 112330 109267 109540 113979 118853 123402 128086
32324A28086M050J629k247l013K776M849O077O693M768K781M587J0869J3177J1234
$$ 128086 132136 133765 131518 128505 131281 136130 142207 148900 153668 156449 161036 171905 185082 196316
32310A96316R461O183N244M632L313P396J0012R353J2515J7063J8344J6645J2103
$$ 196316 205777 211960 217204 221836 225149 232545 242557 251910 264425 281488 299832 316477 328580
32297C28580J5082K2078K5663K5823K5654K9011L4405M2436N0883N8493O6760
$$ 328580 343662 365740 391403 417226 442880 471891 506296 548732 599615 658108 724868
32286G24868P7976R0167J09047J31628J56772J86389K17704K49163K74697K91776
$$ 724868 802844 893011 1002058 1133686 1290458 1476847 1694551 1943714 2218411 2510187
32276B510187L06728L19407L18560K94664K46905J79373R3618l838j12255k17697
$$ 2510187 2816915 3136322 3454882 3749546 3996451 4175824 4269442 4265604 4153349 3935652
32266C935652k98778l46616l61241l47378l16987k82773k47709k11580j79843
$$ 3935652 3636874 3290258 2929017 2581639 2264652 1981879 1734170 1522590 1342747
32257A342747j52743j27318j07996r1826p8488o7927n7311m9054m5309m0147l2064
$$ 1342747 1190004 1062686 954690 862864 784376 716449 659138 610084 564775 524628 492564
32246D92564k8367k7133k6697k2909j7987j6445j5548j4863j4497j2123p146m834
$$ 492564 464197 437064 410367 387458 369471 353026 337478 322615 308118 295995 288849 284015
32234B84015o232n664m399n022l458k085k878j167j224l950k466kM51K794N726
$$ 284015 277783 272119 267720 262698 259240 257155 254277 253110 251886 247936 245470 245468 245919 248713 254439
32219B54439P214M959N013O829N372O034O501M194M183P097J4069J8665J5372
$$ 254439 261653 266612 271625 278454 283826 289860 296361 300555 304738 311835 325904 344569 359941
32206C59941R930J2772J9142K2009J9428J8571K3344K7932K9902L5228M2294M8763
$$ 359941 369871 382643 401785 423794 443222 461793 485137 513069 542971 578199 620493 669256
32194F69256N9599P0749Q4913J02560J23512J49222J78007K11867K44700K73012
$$ 669256 728855 799604 884517 987077 1110589 1259811 1437818 1649685 1894385 2167397
32184B167397K97319L15327L24096L24795L12627K78416K17090J31904L3759p3276
$$ 2167397 2464716 2780043 3104139 3428934 3741561 4019977 4237067 4368971 4402730 4329454
32174D329454j83700k79670l42714l70882l70663l48452l13155k72512k36261
$$ 4329454 4145754 3866084 3523370 3152488 2781825 2433373 2120218 1847706 1611445
32165A611445k02190j69072j43581j18439r7604q5762p7500o5074n2732m6818
$$ 1611445 1409255 1240183 1096602 978163 880559 794797 717297 652223 599491 552673
32155E52673m4396l9486l4354l1244k7058k4077k3141k2254k0747j6813j4434
$$ 552673 508277 468791 434437 403193 376135 352058 328917 306663 285916 269103 254669
32144B54669j5507j2795j1015r184n742m390q324r194p899p655o335n580m418
$$ 254669 239162 226367 215352 206168 200426 196036 187712 178518 170619 162964 156629 151049 146631
32131A46631l445k504r61j368m120o417p105p184m947k730L59J53j608j685j170
$$ 146631 143186 140682 139721 138353 134233 127816 120711 113527 108580 105850 106209 106362 104754 103069 101899
32116A01899l071l338k477j729p08q52k671k890m3k224m991l872l013j840j351
$$ 101899 98828 95490 93013 91284 90576 89724 87053 84163 84120 81896 76905 73033 70020 68180 66829
32101F6829j807j214m010n952n138o37L870M398j40k289r40M6l23j122l055o630
$$ 66829 65022 63808 59798 53846 48708 48071 51941 56339 56199 53910 52970 53016 52693 51571 48516 41886
32085D1886n030J43J098K647K426J087O30K291K257l841o480n635m180J95J881
$$ 41886 36856 36999 38097 40744 43170 44257 44887 47178 49435 45594 39114 33479 29299 29494 31375
32070C1375J356J584N67J083L98j047j576J116K125j088k448l438m474j453N36
$$ 31375 32731 34315 34882 35965 36363 35316 33740 34856 36981 35893 33445 30007 25533 24080 24616
32055B4616r56q49P91J830J755J236L299L917K815n86k424o78j002k176j583p80
$$ 24616 23660 22811 23602 25432 27187 28423 31722 35639 38454 37868 35444 34766 33764 31588 30005 29225
32039B9225j415k218j630J10j450l578k975k662K45N4j573j493k342l091L28L937
$$ 29225 27810 25592 23962 24072 22622 19044 16069 13407 13652 13706 12133 10640 8298 5207 5535 9472
32023I472M931K310j463l123j755J133M749N319N182K973J00J21j565l377l521
$$ 9472 14403 16713 15250 12127 10372 11505 16254 21573 26755 29728 29828 29949 28384 25007 21486
32008B1486n28M150M526k4p48j79r69J027J710L026J695j646m018m604j488J13
$$ 21486 20958 25108 29634 29610 28862 28683 27714 28741 30451 33477 35172 33526 29508 24904 23416 23529
31992B3529m87j795n877o603k625M65N96l5K006K912K486j4o27q73p36m85k041
$$ 23529 23042 21247 15370 8767 6142 6607 7203 7168 9174 12086 14572 14558 13931 13058 12322 11837 9796
31975I796j567j183k494M47N389M966J113k291k549P81M242K220j981k633M03
$$ 9796 8229 7046 4552 4999 10388 15354 16467 14176 11627 12408 16650 18870 16889 14256 14659
31960A4659J491J87L386M396j56k289q16J83m05j888l82J99o25K59p93j29K796
$$ 14659 16150 16337 19723 24119 23963 21674 20858 21041 20636 18748 18366 18565 17940 18199 17406 17277 20073
31943B0073L76k488k203k415l157m08J824p09j765J154J583K28j679j182k300
$$ 20073 20449 17961 15758 13343 10186 9778 11602 10893 9128 10282 11865 12093 10414 9232 6932
31928F932k692r6j025j070R13p3a726l486p99R75g31B472K429J648j358B253A014
$$ 6932 4240 4144 3119 2049 2962 2889 -1726 -5212 -6011 -5036 -731 2472 4901 6549 5191 2253 1014
31910B832K689M42J097N599Q236N377K031q41j436j114l18j431k473j329l417
$$ 2832 5521 5963 7060 12659 20895 26272 28303 27462 26026 24912 24594 23163 20690 19361 15944
31895A5944m544j659L46J289J588J257L091J733l796o556D253o72K055J775j523
$$ 15944 11400 9741 10087 11376 12964 14221 17312 19045 15249 8693 4253 3581 5636 7411 5888
31880E888n77J181J113j281B974n48L221J477J060J718k78n81j032l171B165D09
$$ 5888 5311 6492 7605 6324 2974 2426 5647 7124 8184 9902 9624 9043 8011 4840 2165 409
31863H03K679K99A474b023k842j285j897M83c366a231d41C865M086q23l210l49
$$ 803 3482 3781 1474 -2023 -4865 -6150 -8047 -7564 -3366 -1231 -441 3865 7951 7128 3918 3569
31847C569J513J263K250K775K08k350k926k428A518a589k380o01a162A902d15
$$ 3569 5082 6345 8595 11370 11578 9228 6302 3874 1518 -1589 -3969 -4570 -1162 1902 -415
31831e299k161j800J724b129B842K937L33C013h73m421k872J534K272J296e64
$$ -5299 -7460 -9260 -7536 -2129 2842 5779 6112 3013 -873 -5294 -8166 -6632 -4360 -3064 -564
31815C342K286p36j16P38J745K616k504B267b92B52N14J181L37c74j083A260J404
$$ 3342 5628 4892 4776 5514 7259 9875 7371 2267 -292 252 766 1947 2284 -374 -1457 1260 2664
31798B664L89J822J225L62l24j415B342p50L95r40Q78K923M26j748q63L54r96
$$ 2664 3053 4875 6100 6462 6138 4723 2342 1592 1987 1047 1925 4848 5274 3526 2663 3017 2021
31781B021mL217K527r20j553m7Om68A163c627J132B977M939L622K042n3j50M38
$$ 2021 2017 5234 7761 6841 5288 5241 5247 4779 1163 -3627 -2495 2977 7916 11538 13580 13527 13377 13815
31763A3815Q12J177J609R83j087j495r99K388K945k134n564l316r95k45K356K055
$$ 13815 14627 15804 17413 18396 17309 15814 14815 17203 20148 18014 12450 9134 8139 7894 10250 12305
31747A2305l38l074l106J053M003O118L853j326l636m232m244j979L489N819L281
$$ 12305 11967 8893 5787 6840 10843 16961 20814 19488 15852 11620 7376 5397 8886 14705 17986
31732A7986K24j670n038D892D70FK033K517L135M707K914J986m22l168l336j412
$$ 17986 18210 16540 11502 4892 470 6 2039 4556 7691 12398 15312 17298 16876 13708 10372 8960
31716H960k00P82o3k671l048j399Q99M323Q052N704K548l37k228m7n84j805l940
$$ 8960 8760 9542 9479 6808 3760 2361 3260 7583 15635 21339 23887 23550 21322 21275 20691 18886 14946
31699A4946m658k947j44P97PJ183J308j522l219N11K113j320k357j485k16K265
$$ 14946 10288 7341 7197 7994 8001 9184 10492 8970 5751 6262 8375 7055 4698 3213 2997 5262
31683E262K132l04C496a165m994l200J09L813I5M330R45A219b227J077C279K469
$$ 5262 7394 7090 3496 -1165 -6159 -9359 -9250 -5437 95 4425 5370 1219 -2227 -1150 3279 5748
31667E748l33J436L046K167o32l057l659B075p51M80R52K2m70G61a838n81n07
$$ 5748 5415 6851 9897 12064 11432 8375 4716 2075 1324 1804 2756 2778 2308 761 -1838 -2419 -2926
31650b926l582j465L242Q36k457q75J995M53j151p15j40J713h15B312k19i69k279
$$ -2926 -6508 -7973 -4731 -3895 -6352 -7227 -5232 -4779 -5930 -6645 -6785 -5072 -815 2312 2093 -969 -3248
31633c248N17a192E17Q47A7b671k178L92K078A111J111A005N0K113R58A233c893
$$ -3248 -2731 -1192 517 1364 17 -2671 -4849 -4457 -2379 1111 2222 1005 1055 3168 4126 1233 -3893
31615h313k956j209J807N086b668J71M21C23L905J158r26B224a8G5O88J500J677
$$ -8313 -11269 -12478 -10671 -5585 -2668 -2497 -2076 323 4228 5386 4460 2224 -18 75 763 2263 3940
31598C940j098F74a050j057c74B11b085L26A094L788K651q72k095A434A49J851
$$ 3940 2842 674 -1050 -2107 -374 211 -2085 -1759 1094 4882 7533 6661 4566 1434 149 2000
31582B000L342J312J256K074N417N548N92m564n008l653j216O28j712j068q85
$$ 2000 5342 6654 7910 9984 15401 20949 21541 16977 11969 8316 7100 7728 6016 4948 4063
31567D063j249o99O47o61j040K700K263k375b01j468F29K036R64K123L457K361
$$ 4063 2814 2115 2762 2101 1061 3761 6024 3649 -201 -1669 629 2665 3629 5752 9209 11570
31551A1570K391J685L34l066n854k151J042J363J441M065M922Q16j726l461l699
$$ 11570 13961 15646 15980 12914 7060 4909 5951 7314 8755 12820 17742 18558 16832 13371 9672
31536I672k467k360K77M947L016Q96j692n528k348J675K783J281j977j428P65
$$ 9672 7205 4845 5122 10069 13085 13981 12289 6761 4413 6088 8871 10152 8175 6747 7512
31521G512J108O98r30l513B408l83O50J697m63A338E49J371N36j071d06j712l85
$$ 7512 8620 9318 8388 4875 2408 2025 2675 4372 3909 1338 549 1920 2456 1385 -406 -2118 -2503
31504b503J03N04Q14J11k372k071J815C91K712K068L693K202j773R04M228L144
$$ -2503 -2400 -1896 -1082 -971 -3343 -5414 -3599 391 3103 5171 8864 11066 9293 10197 14425 17569
31488A7569J937k406o671n003O7J220j406k181o29K911N927L833J435O23j595
$$ 17569 19506 17100 10429 5426 5493 6713 5307 3126 2497 5408 11335 15168 16603 17226 15631
31473A5631Q38M052K095j169p61N89j495j841j119k718l113l245k905j091L269
$$ 15631 16469 20521 22616 21447 20686 21275 19780 17939 16820 14102 10989 7744 4839 3748 7017
31458G017L088n9m67J248O68J018J535j858j779Q00j535l156k079A705M031P052
$$ 7017 10105 10046 9579 10827 11495 12513 14048 12190 10411 11211 9676 6520 4441 1705 5736 12788
31442A2788L826K607K058P29k479o208l260J810L006K125N91l35p38P61p88j959
$$ 12788 16614 19221 21279 22008 19529 13321 10061 11871 14877 17002 17593 17258 16520 17281 16493 14534
31426A4534o00K64J165K130K735J372K469J163j246l031k743J448K066P01j12
$$ 14534 13934 14198 15363 17493 20228 21600 24069 25232 23986 20955 18212 19660 21726 22427 22315
31411B2315k15L41p45j056J354M93l042j634J35R63J467J877J074P07L81j728
$$ 22315 22100 22441 21696 20640 21994 22487 19445 17811 17946 18909 20376 22253 23327 24034 24415 22687
31395B2687k159j999J14j619L59L754K148J178l41M33K545J524r45j049K3J513
$$ 22687 20528 18529 18643 17024 17383 21137 23285 24463 24122 24555 27100 28624 27679 26630 26653 28166
31379B8166J502j132q29J465K668J200r45p44J791L962N635O201L251p40j838
$$ 28166 29668 28536 27707 29172 31840 33040 32095 31351 33142 37104 42739 48940 52191 51451 49613
31364D9613k854k288J458J320j016j972k986k150k61K438N019M412J433m52k063
$$ 49613 46759 44471 45929 47249 46233 44261 41275 39125 38864 41302 46321 50733 52166 51714 49651
31349D9651m37M846N571M301M374K515k96p31J529K621L985P024P601M194J975
$$ 49651 49214 54060 59631 63932 68306 70821 70525 69794 71323 73944 77929 84953 92554 96748 98723
31334I8723K129L948M407K632M52J483J172O43L730P157J0761J1486R405Q375
$$ 98723 100852 104800 109207 111839 112291 113774 114946 115589 119319 126476 137237 148723 158128 166503
31320A66503Q457J1435J3837J2968R822P688Q111J0524J1531J2600J4657J4577
$$ 166503 174960 186395 200232 213200 223022 230710 238821 249345 260876 273476 288133 302710
31308C02710J4911J5015J5258J6472K1897K7300K8385K7126K5483K7369L2696
$$ 302710 317621 332636 347894 364366 386263 413563 441948 469074 494557 521926 554622
31297E54622L8602M3388M6390N0068N6628O7140Q3227R5069J02629J13384J33354
$$ 554622 593224 636612 683002 733070 789698 856838 940065 1035134 1137763 1251147 1384501
31286A384501J55478J75651J98561K22350K46831K68440K83517K97846L07846
$$ 1384501 1539979 1715630 1914191 2136541 2383372 2651812 2935329 3233175 3541021
31277C541021L09052K98911K77644K47403K10697J68079J16176N8428Q44n7270
$$ 3541021 3850073 4148984 4426628 4674031 4884728 5052807 5168983 5227411 5228255 5170985
31267E170985j17678j78635k39149k88590l20647l37249l42217l35842l17093
$$ 5170985 5053307 4874672 4635523 4346933 4026286 3689037 3346820 3010978 2693885
31258B693885k87191k53731k23675j95428j66534j43568j24985j10068r6112q3820
$$ 2693885 2406694 2152963 1929288 1733860 1567326 1423758 1298773 1188705 1092593 1008773
31248A008773p1806o1060n4575m9001m3159l6975l3829l5214l2451k6978k0672
$$ 1008773 936967 875907 821332 772331 729172 692197 658368 623154 590703 563725 543053
31237E43053j5603j4895j4557j3155j3068j1432j0024p344m544l587m535l432
$$ 543053 527450 512555 497998 484843 471775 460343 450319 442975 438431 434844 430309 426877
31225D26877lM066M500M380M491L370L362M098M136N868J0717J6298K2167K3160
$$ 426877 426874 430940 435440 439820 444311 447681 451043 455141 459277 465145 475862 492160 514327 537487
31211E37487K0131K3411K9288K9075L2519M0774M3375M4850N1503O0089O8043
$$ 537487 557618 581029 610317 639392 671911 712685 756060 800910 852413 912502 980545
31200I80545P6013Q6050J00286J15996J34509J55689J76164J96714K22100K50054
$$ 980545 1056558 1142608 1242894 1358890 1493399 1649088 1825252 2021966 2244066 2494120
31190B494120K72530K88844L05107L21803L24327L09063K85819K56211K19760
$$ 2494120 2766650 3055494 3360601 3682404 4006731 4315794 4601613 4857824 5077584
31181E077584J74392J24257O8017J0152m7340j13718j79773k42004k96609l36146
$$ 5077584 5251976 5376233 5444250 5454402 5407062 5293344 5113571 4871567 4574958 4238812
31171D238812l56773l60508l54527l38890l12067k79199k44558k09805j79182
$$ 4238812 3882039 3521531 3167004 2828114 2516047 2236848 1992290 1782485 1603303
31162A603303j54888j34289j19913j08336r4547q1232o8233n7792n1731m8676
$$ 1603303 1448415 1314126 1194213 1085877 991330 910098 841865 784073 732342 683666
31152F83666m6145m1029l4449k9903k8299k7699k8777k8530k6308k4577k0972
$$ 683666 637521 596492 562043 532140 503841 476142 447365 418835 392527 367950 346978
31141C46978j6372j6515j7665j6920j4086j1948j2215j2223j2486r711o488r294
$$ 346978 330606 314091 296426 279506 265420 253472 241257 229034 216548 206837 200349 191055
31129A91055j2102o547l213p908p422n858m110j747l311o439o142l870k402k380
$$ 191055 178953 172406 169193 161285 153863 148005 143895 142148 138837 132398 126256 122386 119984 117604
31115A17604l988n349m644r80J761m43j919j687m620q454o824k795k72J00j865
$$ 117604 113616 108267 103623 102643 104404 103961 102042 100355 95735 87281 80457 77662 77390 77490 75625
31100G5625l988n949k047L289K438o48j905j861k15j53j191j358j504j110q73
$$ 75625 71637 65688 63641 66930 69368 68720 66815 64954 64739 64586 63395 62037 60533 59423 58550
31085E8550l648k516r6J145k24m391n534j942L153J437j769j951J252L809J542
$$ 58550 54902 52386 52290 53435 53211 48820 43286 41344 44497 45934 44165 42214 43466 47275 48817
31070D8817k598k695l124m575k394k89K377J522J931L091M13j688j078j051q31
$$ 48817 46219 43524 40400 35825 33431 33142 35519 37041 38972 42063 42476 40788 39710 38659 37828
31055C7828j328m245k772J796J921M33M97k138m437l728k130j191k178n331j305
$$ 37828 36500 32255 29483 31279 33200 33633 34130 31992 27555 23827 21697 20506 18328 12997 11692
31040A1692N994N289O87k276j623L285N004M159N59k851l531l562k750j191k79
$$ 11692 17686 22975 23662 21386 19763 23048 28052 32211 32770 29919 26388 22826 20076 18885 18606
31025A8606l66J497J884J38j453M47q6k836m412m351k016j007k133j234A256b853
$$ 18606 18240 19737 21621 21759 20306 20753 20667 17831 13419 9068 7052 6045 3912 2678 1256 -2853
31008c830G58N242M738M919J421l751n474j960K091J118p33k83K61J75m08J9o26
$$ -3830 758 6000 10738 15657 17078 13327 7853 5893 7984 9102 8369 8086 8347 8522 8114 8133 7507
30991G507k450k349o26K12J470K953K959J024O24L380K851J189J668k380n128
$$ 7507 5057 2708 2082 2294 3764 6717 9676 10700 11324 14704 17555 18744 20412 18032 12904
30976A2904m307j737J49J096J372K006J749p80k164R69J634J430K257K38j693
$$ 12904 8597 6860 7009 8105 9477 11483 13232 12452 10288 11257 12891 14321 16578 16816 15123
30961A5123l330l300B952d518k261K404J520D02N358K930l90l023B239p8J942
$$ 15123 11793 8493 2952 -4518 -6779 -4375 -2855 402 5760 8690 8300 5277 2239 2161 4103
30946D103R07l26A680b053i38B263J907K341L809K382j545l805l164O74L66k378
$$ 4103 5010 4684 1680 -2053 -938 2263 4170 6511 10320 12702 11157 7352 4188 4862 5228 2850
30930B850E64B40K488K100j537j069o88i09J74C287M841J953q96Q70L178K05l412
$$ 2850 564 240 2728 4828 3291 2222 1534 -909 -735 3287 8128 10081 9185 10055 13233 13438 10026
30913A0026j605p41j467j819A440b344l719j113K135f34C356P55n3L438J870j593
$$ 10026 8421 7680 6213 4394 1440 -2344 -6063 -7176 -5041 -634 3356 4111 4058 7496 9366 7773
30897G773j166J250J575l75l768e47j190G37J515p26L11L92O55L930L858J832
$$ 7773 6607 7857 9432 9057 5289 -547 -1737 737 2252 1526 1837 2229 2884 6814 10672 12504
30881A2504j861l531k573k00K032M65k39J071O29j851k266m35L27j325a15k050
$$ 12504 10643 7112 4539 4339 6371 6836 6597 7668 8297 6446 4180 3745 4072 2747 -115 -2165
30865b165m11k15Q0h45A252O47p76a12q05B69L166J683j60N24K603o14C581j540
$$ -2165 -2576 -2791 -2711 -845 1252 1899 1123 -112 -917 269 3435 5118 4958 5482 8085 7471 3581 2041
30847B041e71m516j459J134b017C884L663k25k119A400a424j053K5J1j773j307
$$ 2041 -571 -5087 -6546 -5412 -2017 3884 7547 7322 5203 1400 -1424 -2477 -2452 -2441 -4214 -5521
30831e521k99J263a936A252Q31n82n9K406K005j188A24d953l413j219Q55K037
$$ -5521 -5820 -4557 -1936 1252 2083 1501 1442 3848 5853 4665 124 -4953 -8366 -9585 -8730 -6693
30815f693K123R46a716A676p91b949j471J491h39c77A213M601L127N09q41l900
$$ -6693 -4570 -3624 -1716 1676 885 -2949 -4420 -2929 -839 -377 1213 5814 8941 9450 8609 4709
30799D709F47G3h46j297R84B074J841A093b035n47l92k1Q58b9j591l436J8M62
$$ 4709 647 73 -846 -2143 -1159 2074 3915 1093 -2035 -2582 -2974 -2995 -2137 -29 -1620 -5056 -5038 -4576
30781d576l663k728J436K275K379J678J258A086L612J824k238A699Q34A010b158
$$ -4576 -8239 -10967 -9531 -7256 -4877 -3199 -1941 1086 4698 6522 4284 1699 2533 1010 -2158
30765b832a238k63j659j469j276n15K299I99M234J219k170A946E85c375k950k324
$$ -2832 -1238 -1501 -3160 -4629 -5905 -6420 -4121 999 5233 6452 4282 1946 585 -3375 -6325 -8649
30749h649l313j734R6M490b474A892J586p45E77a116k039a476B287Q19A214a430
$$ -8649 -11962 -13696 -13600 -9110 -2474 1892 3478 2733 577 -1116 -3155 -1476 2287 3106 1214 -1430
30732c411K29a271A461j42a793k479R13N63k98j640J79g4E120L309j719A152d480
$$ -3411 -3182 -1271 1461 1319 -1793 -4272 -3359 -2796 -3094 -4734 -4555 -74 5120 8429 6710 1152 -4480
30714f443J44l78o08J484a021C011J812q96i77m894r54K420a426C72h29l053k811
$$ -6443 -6299 -6677 -7285 -5801 -1021 3011 4823 3927 -977 -5871 -6825 -4405 -1426 372 -829 -3882 -6693
30697f693n52R89J037k149l224j437R33M451i04F61O1L464L540j157j779R6J828
$$ -6693 -7245 -6256 -5219 -7368 -10592 -12029 -11096 -6645 -904 661 722 4186 7726 6569 4790 4886 6714
30680F714L299K755k501C932a88k179l908m542k51L719c287l38k511k635j946
$$ 6714 10013 12768 10267 3932 -188 -2367 -6275 -10817 -11068 -7349 -3287 -3625 -6136 -8771 -10717
30665a0717L96K620L804N32m86r40M33K123G91M058L018K143L018J839j418n229
$$ -10717 -10321 -7701 -3897 -3365 -3851 -4791 -4358 -2235 791 4849 7867 10010 13028 14867 13449 8220
30649H220B285b455j901n83q64R79K134d75A499J501r27g50m992l630J871c423
$$ 8220 2285 -2455 -4356 -4939 -5803 -4824 -2690 -475 1499 3000 2073 -750 -5742 -9372 -7501 -3423
30632A649K511H76d611k678O6L051E47L305R51j407m96k46j88m7J89Q23j538B06
$$ 1649 4160 876 -4611 -7289 -7223 -4172 547 3852 4803 3396 2900 2654 2466 2419 2608 3431 1893 206
30613B261L587l52A887b79H87J734A220b346o33J152j847k526n90K049K203J245
$$ 2261 5848 5496 1887 -279 887 2621 1220 -2346 -2979 -1827 -3674 -6200 -6790 -4741 -2538 -1293
30597a293k12M72B50A05b858k833J370e1B607J164O65m70P01J392k41j883G96
$$ -1293 -1505 -1033 250 105 -2858 -5691 -4321 -51 2607 3771 4436 3966 4667 6059 5818 3935 796
30579c424j214N04j664k504J80Q05l02J282a228D128L757J702p46j667n21j644
$$ -3424 -4638 -4134 -5798 -8302 -8122 -7317 -7619 -6337 -1228 4128 7885 9587 8841 7174 6653 5009
30563E009k345P88L259J306l93j284j673J417K380Q32k611B030a19A352K385P68
$$ 5009 2664 3452 6711 8017 7624 6340 4667 6084 8464 9296 6685 2030 -119 1352 3737 4505
30547D505j337f59m191k947j497Q74K335n63k832m82J693K709K156j072q76J954
$$ 4505 3168 -659 -4850 -7797 -9294 -8420 -6085 -6648 -9480 -9962 -8269 -5560 -3404 -4476 -5352 -3398
30531c398M16j538R2j46j076Q71N86j284k35J330b063A571K480j20A736b4D66
$$ -3398 -2982 -4520 -4428 -4574 -5650 -4779 -4193 -5477 -5712 -4382 -2063 1571 4051 3931 1736 -24 466
30513G13c581n709m340j672M399M833J853P0n12R58R36j654K06J486J011A096
$$ 713 -3581 -9290 -13630 -15302 -10903 -6070 -4217 -4147 -4659 -3701 -2765 -4419 -4213 -2727 -1716 1096
30496D649L90j771L85K809K354k92j034j750B854P06K436r24j724M16j024o06
$$ 4649 5039 3268 3653 6462 8816 8524 7490 5740 2854 3560 5996 5072 3348 3764 2740 2134
30480B134J886L10M72K155l03l028b905q432m859j000m19M017f798L204j582k727
$$ 2134 4020 4330 4802 6957 6654 3626 -2905 -11337 -16196 -17196 -17615 -13598 -6798 -3594 -5176 -7903
30464g903K009a007E14a127p28O31K15o10l951o350l354R78K983K189J971J733
$$ -7903 -5894 -1007 514 -1127 -1855 -1224 -1009 -1619 -5570 -11920 -15274 -14296 -11313 -9124 -7153 -5420
30448e420K620hD39e62j17j097N72H00L365J695j00J834K383R54j802l887k467
$$ -5420 -2800 -8 439 -562 -679 -1776 -1204 800 4165 5860 5760 7594 9977 10931 9129 5242 2775
30431B775j006D02R86J898A284d281n438k929m91L04J187J412J261K86J121K897
$$ 2775 1769 402 1388 3286 1284 -4281 -9719 -12648 -13139 -12835 -11648 -10236 -8975 -8689 -7568 -4671
30415d671a439L17j185K1k1k083l022j42L501a5B051k61b961l782K355A772M876
$$ -4671 -1439 -1122 -2307 -2286 -2307 -4390 -7412 -7554 -4053 -15 2051 1790 -2961 -6743 -4388 1772 6648
30398F648K027l854a844m390OQ3R2J119K374c74B06g26j424j120r61k382j271
$$ 6648 8675 4821 -1844 -6234 -6228 -6145 -6053 -4934 -2560 -374 206 -726 -2150 -3270 -4231 -6613 -7884
30381g884j314k051r93K1k734j163j08l17J079J30p4l8M360c033A609J095E16
$$ -7884 -9198 -11249 -12242 -12221 -14955 -16118 -16226 -16543 -15464 -15334 -15408 -15446 -11086 -3033 1609 2704 516
30363d327l495j037K941B078Q501J677l451C519A179D85h42p93k50n21q25b48
$$ -4327 -7822 -8859 -5918 2078 10579 12256 8805 3519 1179 485 -842 -1635 -1885 -2406 -3231 -248
30346D362j280b001l247P18C4M988J719l159A339D99a225o98j261j476P63f50
$$ 4362 3082 -2001 -5248 -4530 34 5022 6741 3582 1339 499 -1225 -1923 -3184 -4660 -3897 -650
30329A596P61P69L89A501a167J90A998L528L524K685J163J124N70n27k55K454
$$ 1596 2357 3126 3515 1501 -1167 -977 1998 5526 9050 11735 12898 14022 14592 14065 13810 16264
30313A6264J852k391n531m265r30J908K304L594K032J523K566K622N36j379m69
$$ 16264 18116 15725 10194 5929 4999 6907 9211 12805 14837 16360 18926 21548 22084 20705 20236
30298B0236n52l399o752B930c73Q0r47M83H8K43G7g32L24B29g67K79A992L42L40
$$ 20236 19684 16285 9533 2930 -373 -293 -1240 -757 88 331 77 -732 -408 229 -767 -488 1992 2334 2674
30279B674j268c26B861L309n39j258J342K790L66k129k126j952o89J40m92a94
$$ 2674 1406 -326 2861 6170 5631 4373 5715 8505 8871 6742 4616 2664 1975 2115 1623 -194
30262b951n38J394K57j859k03h58C91a042j294c33F35b023k818L24R08M45g75
$$ -2951 -3489 -2095 -1838 -3697 -3900 -858 391 -1042 -2336 -333 635 -2023 -4841 -4517 -3609 -3164 -775
30244C670M291M189J850j603k383P58J739P23J314p42l809l087l107h73j762f44
$$ 3670 7961 12150 14000 12397 10014 10772 12511 13234 14548 13806 9997 6910 3803 -873 -2635 -644
30227D824P117P171J793j010K596L379P40J46O54MN66O5m167n031j598o18k677
$$ 4824 11941 19112 20905 19895 22491 25870 26610 26756 27410 27414 27980 28045 23878 18847 17249 16631 13954
30210A3954k245j56M07J469m03j749k321l095B225A59O3K358L351k91k075n21
$$ 13954 11709 11553 11960 13429 13026 11277 8956 5861 2225 159 222 2580 5931 5640 3565 3044
30194C044P51R26q80o29k48q05J356K206J504J813K947o14l854k535A667a899
$$ 3044 3795 4721 3841 3212 2964 2159 3515 5721 7225 9038 11985 11371 7517 4982 1667 -1899
30177b289I27M357K313j511k908F09a501j308q15k803l071j689m79J37n61l09
$$ -2289 927 5284 7597 6086 3178 609 -1501 -2809 -3624 -6427 -9498 -11187 -11666 -11529 -12090 -12399
30161a2399k23p86j78K627L22m892k719j387O31L174M641e112f08j312q654p832
$$ -12399 -12622 -13408 -13586 -10959 -10637 -15529 -18248 -19635 -19004 -15830 -11189 -5112 -608 -1920 -10574 -18406
30145a8406m50M292L118P94K137c335A066R1a294E79N290K000l047a001n262l221
$$ -18406 -18856 -14564 -11446 -10652 -8515 -3335 1066 1157 -1294 579 5869 7869 4822 -1001 -6263 -9484
30129i484j064l67P06J824K373a238E885N813M016M7l167N79J342j311k135k270
$$ -9484 -10548 -10915 -10209 -8385 -6012 -1238 5885 11698 15714 15761 12594 13173 14515 13204 11069 8799
30113H799q61j150l310A311J179L01K99J669J190m65qL104K132l275A268d077
$$ 8799 7938 6788 3478 1311 2490 2791 3090 4759 5949 5484 5476 8580 10712 7437 1268 -4077
30096e938j693J648a500n29n178j331K882J41m87p8j355k243j454R8K932b796
$$ -5938 -7631 -5983 -1500 -2029 -7207 -8538 -5656 -5515 -6002 -6080 -7435 -9678 -11132 -11034 -8102 -2796
30079A16b395k302l66r56K46K009B66K101C39b159p60P2q0e61A488R4M76K890
$$ 116 -2395 -4697 -5063 -6019 -5773 -3764 266 2367 339 -2159 -2919 -2847 -2927 -561 1488 1582 2058 4948
30061D948L282N62l379k641JJ174K361P52k199H35a052e13k51b63A707K204J265
$$ 4948 8230 8792 5413 2772 2773 3947 6308 7060 4861 835 -1052 -513 -764 -263 1707 3911 5176
30044E176O30Qj606D69c425l85a230A456R22J904L138q32j655O80o2A832b879
$$ 5176 5806 5814 4208 469 -3425 -3810 -1230 1456 2378 4282 7420 6588 4933 5613 5551 1832 -2879
30026d853r19m2K383J455d01A817O24p79J034j30a599m033k642j791Q99R61j010
$$ -4853 -5772 -5814 -3431 -1976 -401 1817 2441 1662 2696 2566 -1599 -5632 -8274 -10065 -9166 -8205 -9215
30009i215K20J418J226m93J44b251B547K062J817J911J427J516j453l548B617
$$ -9215 -8995 -7577 -6351 -6844 -6700 -2251 2547 4609 6426 8337 9764 11280 9827 6279 2617
29993c5l5H59e26j9n09l505m34a980i80k399k415j780q64l820n526j849M640O278
$$ -35 -70 859 -526 -545 -1054 -4559 -4993 -1980 -980 -3379 -5794 -7574 -8438 -12258 -17784 -19633 -14993 -8715
29975h715K675R3J126b34D143J929q64q59O24j581b583l168N09M2Q06L07j569
$$ -8715 -6040 -5947 -4821 -234 4143 6072 5208 4349 4973 3392 -2583 -5751 -5242 -5200 -4394 -4087 -5656
29958e656J507a701O86o88A146L813p65A572M74P87J81k23J214P33D46c924o46
$$ -5656 -4149 -1701 -1015 -1703 1146 4959 4194 1572 2046 2833 3014 2791 4005 4738 446 -3924 -4570
29941d570J007l93l479m584r91K533L240c153A823J478j551j53K997L429K339
$$ -4570 -3563 -3956 -7435 -12019 -13010 -10477 -7237 -3153 1823 3301 1750 1597 4594 8023 10362
29926A0362J339k14k589m207A654J124K660K52B812a123k535J027f35K23A510
$$ 10362 11701 11487 8898 4691 1654 2778 5438 5690 2812 -1123 -3658 -2631 -635 -412 1510
29910C765n15a20m154q40J061j849l558o37K921b124g36j729j334J242c67r03
$$ 3765 3250 -120 -4274 -5114 -4053 -5902 -9460 -10097 -7176 -2124 -736 -2465 -3799 -2557 -367 -1270
29894a270j501K6L1J69g76K21l063k606K837E40a68j766j364L62g42I10M09n39
$$ -1270 -2771 -2745 -2714 -2545 -776 -555 -3618 -6224 -3387 540 -168 -1934 -3298 -2936 -742 910 1319 780
29876G80a91o69K36j056j676j656k522l087k077j685j92M025N078b391R14m01
$$ 780 -191 -860 -624 -1680 -3356 -5012 -7534 -10621 -12698 -14383 -14575 -10550 -5472 -2391 -1477 -1878
29860a878k526l745k803m20P52j864l022jJ795M267M421J741l517o932l864Q77
$$ -1878 -4404 -8149 -10952 -11372 -10620 -12484 -15506 -15507 -13712 -9445 -5024 -3283 -6800 -13732 -17596 -16719
29844a6719M599e637f21E244O059L429j498l833m154A722e23m326k592K348K512
$$ -16719 -12120 -5637 -621 5244 11303 14732 13234 9401 5247 1722 -523 -4849 -7441 -5093 -2581
29829b581c38C229K366m41j223l81r11n15K299L627M635L381n99j964k123k098
$$ -2581 -338 3229 5595 5154 3931 3550 2639 2124 4423 8050 12685 16066 15467 13503 11380 9282
29813I282p89k247k710A736F76J35k1K216J960j921A087N28K045K174J743l5j040
$$ 9282 8493 6246 3536 1736 676 811 790 3006 4966 3045 1087 1615 3660 5834 7577 7542 6502
29796F502j525k117o27J084K031J054k46k966a664k909J290I19K523r23o14J364
$$ 6502 4977 2860 2233 3317 5348 6402 6156 3190 -1664 -4573 -3283 919 3442 2519 1905 3269
29780C269A485a748k016k127j244p01J361L220i89E75K35j08R92M78K92M69m9
$$ 3269 1485 -1748 -3764 -5891 -7135 -7836 -6475 -3255 -989 575 810 702 1694 2172 2464 2933 2884
29763B884L41H77b994l858k941j884N8n73k190P20M660L588J193J178J154r90
$$ 2884 3225 877 -2994 -6852 -9793 -11677 -11619 -12192 -14382 -13662 -9002 -5414 -4221 -3043 -1889 -2879
29747b879j228r99k320m679l477m64K379K288p23m721m025M27M756M346l75k085
$$ -2879 -4107 -5106 -7426 -12105 -15582 -16046 -13667 -11379 -12102 -16823 -20848 -20421 -15665 -11319 -11694 -13779
29731a3779j930L23J766K216N122g47B861J053o47K177L667K212O40n38j612k231
$$ -13779 -15709 -15386 -13620 -11404 -6282 -747 2861 3914 3267 5444 9111 11323 11963 11425 9813 7582
29715G582p41K498J430k606k955B235e55j248e71D970L642Q98J551K50o56O23
$$ 7582 6841 9339 10769 8163 5208 2235 -555 -1803 -571 4970 8612 9510 11061 11311 10655 11278
29699A1278l20l440l526A622g4q51A583J400A385P6R28A054P22N665M977J035
$$ 11278 10958 7518 3992 1622 -74 -925 1583 2983 1385 1461 2389 1054 1776 7441 12418 13453
29683A3453P49J142m80k541k440Oj481k961k190m47N26J699M487M435K625K213
$$ 13453 14202 15344 14864 12323 9883 9889 8408 5447 3257 2810 3336 5035 9522 13957 16582 18795
29667A8795k63j461k70j238l193k330N82K046J953L253L238L853K692K18j823
$$ 18795 18532 17071 16801 15563 12370 10040 10622 12668 14621 17874 21112 24965 27657 27875 26052
29652B6052j990o33J054R60j500j820P07J04j780q09L02q52j154M55K295L791
$$ 26052 24062 23429 24483 25443 23943 22123 22830 22934 21154 20345 20647 19795 18641 19096 21391 25182
29636B5182K530l09j015Q22K609M92k526k626k678l144l650k294O02J796J961
$$ 25182 27712 27403 26388 27210 29819 30311 27785 25159 22481 19337 15687 13393 13995 15791 17752
29621A7752K064L924L952M02r75J14k14j719l287m625l861r90J603K866K287J230
$$ 17752 19816 23740 27692 28094 27119 27233 27019 25300 22013 17388 13527 12537 14140 17006 19293 20523
29605B0523K188j01k363l352l957k113J732L469M525K380l246m976j569J426K138
$$ 20523 22711 22610 20247 16895 12938 10825 12557 16026 20551 22931 19685 14709 13140 14566 16704
29590A6704J997K886J962n91k997k71l18l668l345k422k342j569j59J24J234M52
$$ 16704 18701 21587 23549 22958 19961 19690 19372 15704 12359 9937 7595 6026 5867 5991 7225 7677
29574G677p69l370a723l233J568J359j285K45D70N692J561j587j655j324I28d056
$$ 7677 6908 3538 -1723 -4956 -3388 -2029 -3314 -3069 470 6162 7723 6136 4481 3157 928 -4056
29557h169j952J275J742K947a393d89G14h7l984k995P3L384B233L916k509b55
$$ -8169 -10121 -8846 -7104 -4157 -1393 -489 714 -87 -4071 -7066 -6993 -3609 2233 6149 3640 -255
29540a561M63b68j881k862J045h0C699M967K559k761l353q00J333K096q99j088
$$ -1561 -1098 -268 -2149 -5011 -3966 -80 3699 8666 11225 8464 5111 4311 5644 7740 6841 5753
29524E753J877L046R21N92K467L632M221K651K828L422K804m94n169o286p579
$$ 5753 7630 10676 11597 12189 14656 18288 22509 25160 27988 31410 34214 33720 28551 22265 14686
29509A4686o146j041o44k275A523p12J93J167P32L98p24j221J543L840L085K882
$$ 14686 8540 7499 6855 4580 1523 811 1004 2171 2903 3301 2577 1356 2899 6739 9824 12706
29493A2706J705k01j877PR75O66k907l900j030J271J587J006j59O45L272J229
$$ 12706 14411 14210 12333 12340 13315 13981 11074 7174 6144 7415 9002 10008 9849 10494 13766 14995
29477A4995l703n387B461K127N337L233L65r17k083l356k997j021L375M162o81
$$ 14995 11292 5905 2461 4588 9925 13158 13523 12606 10523 7167 4170 3149 6524 10686 10005
29462A0005D385B37j12J860J741m58N6J82K46j770e73k690j966J344A533M686
$$ 10005 4385 237 125 1985 3726 3268 3324 3506 3752 1982 -573 -3263 -5229 -3885 1533 6219
29446F219J991p84C420b613l871J295Q14j299J104a755F82K300P6R3L573L520
$$ 6219 8210 7426 3420 -2613 -6484 -5189 -4375 -5674 -4570 -1755 682 2982 3058 3151 6724 10244
29430A0244O09j895k412k684j758p66m50l19J033P87q53p45h35p14m51M54n62
$$ 10244 10853 8958 6546 3862 2104 1338 888 569 1602 2389 1536 791 -835 -1549 -2000 -1546 -2108
29413b108j433j028p76J643F78J640C93b684k231J263J147j137j779j810L5n0
$$ -2108 -3541 -4569 -5345 -3702 678 2318 393 -2684 -4915 -3652 -2505 -3642 -5421 -7231 -7196 -7246
29397g246J219K360J822i1A420K132R46j442A071l88L53J308R37J331J574M19
$$ -7246 -6027 -3667 -1845 -91 1420 3552 4498 3056 1071 683 1036 2344 3281 4612 6186 6605
29381F605j257k600j089J733L157L408K156j405n97P56j071n79o25j391j041k33
$$ 6605 5348 2748 1659 3392 6549 9957 12113 10708 10111 10867 9796 9217 8592 7201 6160 5927
29365E927J0k495n58K533K605J274J622L718J427j766m01K110K833q12l344O73
$$ 5927 5937 3442 2884 5417 8022 9296 10918 14636 16063 14297 13896 16006 18839 18027 14683 15356
29349A5356L129j365m811F059A046P39M806K336j065l033B112G23a158k364J29
$$ 15356 18485 17120 12309 6059 1046 1785 6591 8927 7862 4829 2112 723 -1158 -3522 -3393
29334c393a46D670K744J40O43J307l01j313k919B015k59J989M020L292O86J123
$$ -3393 -146 4670 7414 7554 8197 9504 9203 7890 4971 2015 1756 3745 7765 11057 11743 12866
29318A2866K563J140k203m365l999B690j235J050J204K053L502K551j125p60K947
$$ 12866 15429 16569 14366 10001 6002 2690 1455 2505 3709 5762 9264 11815 10690 9930 12877
29303A2877L618Q46j579o34J17m34L8q47j276N15O84j122k252O29Q8k151l073
$$ 12877 16495 17341 15762 15128 15245 14811 14849 14002 12726 13241 13925 12803 10551 11180 11268 9117 6044
29286F044B281i85k157J13h74B031J498J441J147j915B022J149J742J49o28O36
$$ 6044 2281 -985 -3142 -3029 -874 2031 3529 4970 6117 4202 2022 3171 4913 5062 4434 5070
29270E070M68j888P06K052J256J573o64q68N07K65Q26J589N98j837l241l083a096
$$ 5070 5538 3650 4356 6408 7664 9237 8573 7705 8212 8477 9303 10892 11490 9653 6412 3329 -1096
29252c918i18B461O41j240J233K519j057H45b801j669m82R4K41K288B495L229
$$ -3918 -918 2461 3102 1862 3095 5614 4557 845 -2801 -4470 -4952 -4858 -4617 -2329 2495 5724
29236E724J101J223j585B518n20J505J573l50A481b141j942Q89A578K380C0c964
$$ 5724 6825 8048 6463 2518 1998 3503 5076 4726 1481 -2141 -4083 -3194 1578 3958 30 -3964
29219f337k04b038B998L887J734j580k454j537J311N17j827A176J17F06d477l507
$$ -6337 -6541 -2038 2998 6885 8619 7039 4585 3048 4359 4876 3049 1176 1293 606 -4477 -7984
29203g984J501J943a558B712N936L873l06l938j862j146j178J590K724J442L107
$$ -7984 -6483 -4540 -1558 2712 8648 12521 12215 8277 6415 5269 4091 5681 8405 9847 12954
29188A2954N543L895L450N008L33m376k524L54J336J2o89j804m262l411j238Q46
$$ 12954 18497 22392 25842 30850 31183 26807 24283 24637 25973 25985 25296 23492 19230 15819 14581 15427
29172A5427p95n183m263j381q81o86p05F84i15j293j487l479n28K418J274N35
$$ 15427 14632 9449 5186 3805 2924 2238 1533 684 -915 -2208 -3695 -7174 -7702 -5284 -4010 -3475
29156c475a085B392K816J639Q64k396B062B73M87N423O171K113K75J163J416P78
$$ -3475 -1085 2392 5208 6847 7711 5315 2062 273 760 6183 12354 14467 14742 15905 17321 18099
29140A8099j076j689j38K732K641L92q55j168J061M29j196j127J88j157j592l53
$$ 18099 17023 15334 15196 17928 20569 20961 20106 18938 19999 20428 19232 18105 18293 17136 15544 15191
29124A5191L51J08Q09K488J957m70J466M758L508j020l045m98n57l173J0K909
$$ 15191 15542 15650 16459 18947 20904 20434 21900 26658 30166 29146 26101 25603 25046 21873 21883 24792
29108B4792K649K776L608K422J561m83l706j829J404J382J142K356J315j116n09
$$ 24792 27441 30217 33825 36247 37808 37325 33619 31790 33194 34576 35718 38074 39389 38273 37764
29093C7764K460M03k694l213j432J668K121J103j828k984k053k421n73M077N321
$$ 37764 40224 40627 37933 34720 33288 34956 37077 38180 36352 33368 31315 28894 28321 32398 37719
29078C7719J622J721K877J915J264J462J686Q22J689L043j795m235j986Q53R54
$$ 37719 39341 41062 43939 45854 47118 48580 50266 51088 52777 55820 54025 49790 47804 48657 49611
29063D9611J386R63o92J219M867O676L510k075j992K13N2K540K104J784K460J278
$$ 49611 50997 51960 51268 52487 57354 64030 67540 65465 63473 63686 63738 66278 68382 70166 72626 73904
29047G3904j554m19J247M85R4K310M655M215K454j481j03K626K136K626N187M454
$$ 73904 72350 71931 73178 73663 73757 76067 80722 84937 87391 85910 85807 88433 90569 93195 98382 102836
29031A02836L721L160M668P280M952K296J721L106M877N045P987P237O212N981
$$ 102836 106557 109717 114385 121665 126617 128913 130634 133740 138617 143662 151649 158886 165098 171079
29017A71079P869J0417J2588J3537J3724J5200J5887J6098J8262K0061J9751J7933
$$ 171079 178948 189365 201953 215490 229214 244414 260301 276399 294661 314722 334473 352406
29005C52406K0679K3393K6262L2108L7179M2745M6759N1335N7031O8218Q1553
$$ 352406 373085 396478 422740 454848 492027 534772 581531 632866 689897 758115 839668
28994H39668Q7095R1969R4887R6730J02295J04672J01423R6403Q5952P2484N3444
$$ 839668 926763 1018732 1113619 1210349 1312644 1417316 1518739 1615142 1701094 1773578 1827022
28983A827022L4769J9647l26k1802l7168m8978n7439n7224n5589n1297m3685l4065
$$ 1827022 1861791 1881438 1881112 1859310 1822142 1773164 1715725 1658501 1602912 1551615 1507930 1473865
28971A473865k0166m423J1772K8082M1938N3908O5261P2182P4496P5807P1853
$$ 1473865 1453699 1449276 1461048 1489130 1531068 1584976 1650237 1722419 1796915 1872722 1944575
28960A944575O2220N0488L5614J3420j1353l4864n8635p7587r0072r4704r5220
$$ 1944575 2006795 2057283 2092897 2106317 2094964 2060100 2001465 1923878 1833806 1739102 1643882
28949A643882r2760q6953p9975p3879o5402n4455m4736l6626k9945k2790j2495
$$ 1643882 1551122 1464169 1384194 1310315 1244913 1190458 1145722 1109096 1079151 1056361 1043866
28938A043866n948o449q946p386q487j3687k0304k2374k2584k4662k7143l2922
$$ 1043866 1037918 1031469 1022523 1015137 1006650 992963 972659 950285 927701 903039 875896 842974
28926H42974l4801l7086l9445l3271k4714k1772j8116j4418j1157o109r82L603
$$ 842974 808173 771087 731642 698371 673657 651885 633769 619351 608194 602085 601103 604706
28914F04706Q571J1586J4616J7915J7259J4146J1830J0192Q868O723K351j883
$$ 604706 613277 624863 639479 657394 674653 688799 700629 710821 719689 726412 728763 726880
28902G26880n059r220j2553j3779j7234k2185k0813j6995j8365k0829j9531j7868
$$ 726880 721821 712601 700048 686269 669035 646850 626037 609042 590677 569848 550317 532449
28890E32449j3878q209o042k646j494N97M465K905M562J0181J3403J5024J6479
$$ 532449 518571 510362 504320 501674 500180 500777 505242 508147 512709 522890 536293 551317 567796
28877E67796J6888K0979K6515K7331K3876K7042L3374L3864L2137L2126L0124
$$ 567796 584684 605663 632178 659509 683385 710427 743801 777665 809802 841928 872052
28866H72052K6832K2284J8836J9735K3296K6145K6359K6586K8648L4957M2463
$$ 872052 898884 921168 940004 959739 983035 1009180 1035539 1062125 1090773 1125730 1168193
28855A168193N0580N9479P0821Q3857R4009J05403J19037J34177J45023J51366
$$ 1168193 1218773 1278252 1349073 1432930 1526939 1632342 1751379 1885556 2030579 2181945
28845B181945J55656J54495J45340J33181J18552R7194O6467L3891P605j7294
$$ 2181945 2337601 2492096 2637436 2770617 2889169 2986363 3052830 3086721 3094326 3077032
28835C077032m0085n8863p0787p3189o9000n6879l9637k2968n535J8410M0558
$$ 3077032 3036947 2978084 2907297 2834108 2765108 2708229 2668592 2645624 2640089 2658499 2699057
28824B699057N8615P4363R0578J06103J13109J10050R8091Q2590O6066M4983J9190
$$ 2699057 2757672 2832035 2922613 3028716 3141825 3251875 3349966 3432556 3498622 3543605 3562795
28813C562795q394l4699n6647p2064p9387q2084p6286n8830l8078j1396K2138
$$ 3562795 3554401 3519702 3463055 3390991 3311604 3229520 3153234 3094404 3056326 3044930 3067068
28802C067068N7555Q7857J20122J51631J81034K12375K39009K54507K60227K56293
$$ 3067068 3124623 3212480 3332602 3484233 3665267 3877642 4116651 4371158 4631385 4887678
28792D887678K41001K21063J94753J63198J24366Q2062M1707L084l3201p1800
$$ 4887678 5128679 5349742 5544495 5707693 5832059 5914121 5955828 5958912 5925711 5853911
28782E853911j15228j53749j85769k12485k33491k50112k62320k65573k58188
$$ 5853911 5738683 5584934 5399165 5186680 4953189 4703077 4440757 4175184 3916996
28773C916996k44274k26073k02462j73589j41257j07679p2420m0082q503K4805
$$ 3916996 3672722 3446649 3244187 3070598 2929341 2821662 2749242 2709160 2700657 2725462
28763B725462N6937Q4900J13006J38636J63381J87463K09465K25626K33789K32920
$$ 2725462 2782399 2867299 2980305 3118941 3282322 3469785 3679250 3904876 4138665 4371585
28753D371585K24912K06913J80759J53726J21010Q3947M5728O791l0302o5707
$$ 4371585 4596497 4803410 4984169 5137895 5258905 5342852 5388580 5395371 5365069 5299362
28743E299362r6379j27842j62917j94207k23638k51325k68459k77396k85480k88210
$$ 5299362 5202983 5075141 4912224 4718017 4494379 4243054 3974595 3697199 3411719 3123509
28733C123509k82467k66655k45073k20851j98971j74932j52430j33450j18913
$$ 3123509 2841042 2574387 2329314 2108463 1909492 1734560 1582130 1448680 1329767
28724A329767j04749r1736p9696o9965o2738n7673n4684m7256l9021l4500l2408
$$ 1329767 1225018 1133282 1053586 983621 920883 863210 808526 761270 722249 687749 655341
28713F55341l2294k8592k4969k2041j9942j8410j5907j5350j3606j0526j1275
$$ 655341 623047 594455 569486 547445 527503 509093 493186 477836 464230 453704 442429
28702D42429j1696r918p666m444J342J793J100L559K483M810P176R602J5375J6254
$$ 442429 430733 420815 413149 408705 410047 411840 412940 416499 418982 423792 430968 440570 455945 472199
28688D72199J3393J1064J2172J0153M173o3p012j3893j5094j3794j6943j8663
$$ 472199 485592 496656 508828 518981 523154 523091 516079 502186 487092 473298 456355 437692
28676D37692j8773j9752j8051j4072j0849o822l493m016j973J532M879Q262J1486
$$ 437692 418919 399167 381116 367044 356195 349373 345880 341864 339891 341423 346302 354564 366050
28663C66050J4247J4941J4430J8182K1101J7183J1600O153M788L265n127j5801
$$ 366050 380297 395238 409668 427850 448951 466134 477734 483887 488675 491940 486813 471012
28651D71012k2073k2808k2053k4020k5450k4450k5264k2780j7112j3760j2292
$$ 471012 448939 426131 404078 380058 354608 330158 304894 282114 265002 251242 238950
28640B38950j2595j0683p315q324j0139r572q793n792k378j516j691j292j267
$$ 238950 226355 215672 208357 200033 189894 180322 171529 165737 163359 161843 160152 158860 157593
28627A57593k333n109n871k496J122J085j586l790l979j198J410Q58M73j112m317
$$ 157593 155260 150151 144280 141784 142906 143991 142405 138615 134636 133438 134848 135706 136179 135067 130750
28612A30750l336l56n83k065k911j008L786M646K547M34J329J341K311J897l54
$$ 130750 127414 127058 126475 124410 121499 120491 124277 128923 131470 131904 133233 134574 136885 138782 138428
28597A38428j150j17K942L845L158N043N171N435N026N241O320O806M755L686
$$ 138428 137278 137161 140103 143948 147106 152149 157320 162755 167781 173022 179342 186148 190903 194589
28583A94589M694N133M068O775R296Q342Q886Q718R490J1012J0225Q444J0741
$$ 194589 199283 204416 208484 215259 224555 232897 241783 250501 259991 271003 281228 289672 300413
28570C00413J5670J9693K2358K1207K0300K0532K0655K2770K5267K7897L1430
$$ 300413 316083 335776 358134 379341 399641 420173 440828 463598 488865 516762 548192
28559E48192L6805M4410N0848N5880O2997P0419P8489Q5679R3277J00833J02135
$$ 548192 584997 629407 680255 736135 799132 869551 948040 1033719 1126996 1227829 1329964
28548A329964J03615J09110J10129J04239R7273Q6863O9491N0075L0070N949j8686
$$ 1329964 1433579 1542689 1652818 1757057 1854330 1941193 2010684 2060759 2090829 2096778 2078092
28537B078092m0214n8547p1874p8282p9125p6619p0741o4053n7483m6033l0746
$$ 2078092 2037878 1979331 1907457 1829175 1750050 1673431 1602690 1538637 1481154 1435121 1404375
28526A404375j9689o895P120J9932L1776M1019N0966O0906O4403O2913O0166O0246
$$ 1404375 1384686 1377791 1384911 1404843 1436619 1477638 1528604 1589510 1653913 1716826 1776992 1837238
28514A837238N8670M8886L4739K2134J2721K463p967j7383k2703j8410j6029j1351
$$ 1837238 1895908 1944794 1979533 2001667 2014388 2016851 2008884 1991501 1968798 1950388 1934359 1923008
28502A923008m626L71J1849K3356L2497M1629M5314M4135L9741L4041K3836N679
$$ 1923008 1918382 1918753 1930602 1953958 1986455 2028084 2073398 2117533 2157274 2191315 2215151 2220830
28490B220830j3805k6302l8917n7398p5695q8459r4298j01957j05580j03347r8384
$$ 2220830 2207025 2180723 2141806 2084408 2008713 1920254 1825956 1723999 1618419 1515072 1416688
28479A416688r3180q5929p5479o5142n5941n0903m9241m3094l3830k5694k2112
$$ 1416688 1323508 1237579 1162100 1096958 1041017 990114 940873 897779 863949 838255 816143
28468H16143j9696j4969q496r86M029J0834J7299K2653L1517L8277M4450N2961
$$ 816143 796447 781478 772982 771996 776025 786859 804158 826811 858328 896605 941055 994016
28456I94016O3417P3922Q6373J00367J09339J14597J17273J17889J15834J10303
$$ 994016 1057433 1131355 1217728 1318095 1427434 1542031 1659304 1777193 1893027 2003330
28446B003330R9732Q3282O3891M3035K1279j627k5341m6656o7054q5260j00469
$$ 2003330 2103062 2186344 2250235 2293270 2314549 2312922 2287581 2240925 2173871 2088611 1988142
28435A988142j10139j15400j17873j20734j19160j10646r9698r1035q3798q0029
$$ 1988142 1878003 1762603 1644730 1523996 1404836 1294190 1194492 1103457 1019659 939630
28425I39630p6062p0101n9395m8797m8148m4972l6278k8958k5629k4824k3561
$$ 939630 863568 793467 734072 685275 637127 592155 555877 526919 501290 476466 452905
28414D52905k0947k0063j8090j5376j3255j4861j4621j1259j0020r918j0785j0113
$$ 452905 431958 411895 393805 378429 365174 350313 335692 324433 314413 304495 293710 283597
28402B83597m238l19j712m454p312p839n021l244j018J243R16k316j355K436K543
$$ 283597 279359 279040 277328 272874 265562 257723 252702 249458 248440 249683 250599 248283 246928 249364 251907
28387B51907K126n04k499m101l121J57L264M018O066J1206J1405R162P206M851
$$ 251907 254033 253529 251030 246929 243808 243965 247229 251247 257313 268519 279924 289086 296292 301143
28373C01143N557Q511Q565R330J2387J2886J1950R308J0327J4119K0981K9155
$$ 301143 306700 315211 323776 333106 345493 358379 370329 379637 389964 404083 425064 454219
28361D54219L2542L5407L9470M3566N0842O0871P0730P9425Q7624R6612J04570
$$ 454219 486761 522168 561638 605204 656046 716917 787647 867072 954696 1051308 1155878
28350A155878J07810J11543J16939J19684J15958J04563Q9535P4372N3750L5477
$$ 1155878 1263688 1375231 1492170 1611854 1727812 1832375 1921910 1996282 2050032 2085509
28340B085509K1410P673L8l571r811j7343k3973k8153l2312l9163m6767n3511
$$ 2085509 2106919 2114592 2114630 2111059 2101248 2083905 2059932 2031779 1999467 1960304 1913537 1860026
28328A860026o0135o9215p9071q9816r8064r9267r1082p8607o8564o1119n1344
$$ 1860026 1799891 1730676 1651605 1561789 1463725 1364458 1273376 1194769 1126205 1065086 1013742
28317A013742m0461l1257j6001l255J934N107J1589K0115K7029L6030M2002M6479
$$ 1013742 973281 942024 926023 922768 924702 929809 941398 961513 988542 1024572 1066574 1113053
28305A113053N2673N6768N8455O2875O9481O9721O7891O9974P4522P3632P4533
$$ 1113053 1165726 1222494 1280949 1343824 1413305 1483026 1550917 1620891 1695413 1769045 1843578
28294A843578Q0405Q2919Q1959Q2742Q4327Q3657Q0790P5149O5987M9685K4194
$$ 1843578 1923983 2006902 2088861 2171603 2255930 2339587 2420377 2495526 2561513 2611198 2635392
28283B635392m014l5722o3906q9480j10954j27302j37323j38933j32667j26594
$$ 2635392 2631378 2595656 2531750 2442270 2331316 2204014 2066691 1927758 1795091 1668497
28273A668497j21033j12097j00209q7870p8676o9978n7524m9701m4127l4102k7034
$$ 1668497 1547464 1435367 1335158 1247288 1168612 1098634 1041110 991409 947282 913180 886146
28262H86146k5344k1719j5604j1652q948o482k013K553O088P779Q262J1740J7733
$$ 886146 860802 839083 823479 811827 802879 796397 794384 796937 803025 810804 819066 830806 848539
28249H48539K7082L3629L6729M3198M9933N5959O3680P6083R1654J08822J27180
$$ 848539 875621 909250 945979 989177 1039110 1095069 1158749 1234832 1326486 1435308 1562488
28238A562488J45231J63141J84498K02109K12870K20010K21555K15443J97802
$$ 1562488 1707719 1870860 2055358 2257467 2470337 2690347 2911902 3127345 3325147
28229C325147J72207J38902R3394L9789j5224o7834j16503j57626j88495k05857
$$ 3325147 3497354 3636256 3729650 3769439 3754215 3686381 3569878 3412252 3223757 3017900
28219C017900k09986k04161j89607j68202j44027j18529r8923q2054o6337n2847
$$ 3017900 2807914 2603753 2414146 2245944 2101917 1983388 1884465 1802411 1736074 1683227
28209A683227m3354l9019l4758l0939l2110l7276l9642l9838m1259l8622l2431
$$ 1683227 1639873 1600854 1566096 1535157 1503047 1465771 1426129 1386291 1345032 1306410 1273979
28198A273979k6135j5881n601N041J6023K5928L6453M6539N0365M6431L7511K7195
$$ 1273979 1247844 1231963 1226362 1231403 1247426 1273354 1309807 1356346 1406711 1453142 1490653 1517848
28186A517848J7534K950j1415k0223k4036k5278k3501j8713q530M550J7467K7197
$$ 1517848 1535382 1538332 1526917 1506694 1482658 1457380 1433879 1415166 1406636 1411186 1428653 1455850
28174A455850L9130N0945N8667O5013O6061O1833N4089M4988L3369K0365Q168
$$ 1455850 1494980 1545925 1604592 1669605 1735666 1797499 1851588 1896576 1929945 1950310 1958478
28163A958478m136j2121j2163n642Q882K3119L7764N7173P7810R6154J13193J27985
$$ 1958478 1954342 1942221 1930058 1924416 1933298 1956417 1994181 2051354 2129164 2225318 2338511 2466496
28151B466496J34147J32531J27053J13640R3449O8820L9865R460k5669o1265r2072
$$ 2466496 2600643 2733174 2860227 2973867 3067316 3136136 3176001 3185461 3159792 3098527 3006455
28140C006455j16306j32667j45434j51926j54903j58745j56307j44837j32377
$$ 3006455 2890149 2757482 2612048 2460122 2305219 2146474 1990167 1845330 1712953
28131A712953j20458j10915j02293r1661p9623o8596n8089n0374m2937l6860l3631
$$ 1712953 1592495 1481580 1379287 1287626 1208003 1139407 1081318 1030944 988007 951147 917516
28120I17516k8108k2368j9522j4689q970n829l616k652j277K342N908Q276J0875
$$ 917516 889408 867040 847518 832829 823859 818030 814414 811762 810485 812827 818735 827011 837886
28107H37886J4695J8004K0035K5438L1288L5646M0017M5657M9859N5940O5033
$$ 837886 852581 870585 890620 916058 947346 982992 1023009 1068666 1118525 1174465 1239498
28096A239498P5674Q6098R6158J08311J19965J26447J30880J38937J46999J49923
$$ 1239498 1315172 1401270 1497428 1605739 1725704 1852151 1983031 2121968 2268967 2418890
28086B418890J51401J47824J37480J23284J07270R2855Q1493O8293N5564M4410
$$ 2418890 2570291 2718115 2855595 2978879 3086149 3179004 3260497 3328790 3384354 3428764
28076C428764L5475K3817R035n007j7564l0000l6461l7690l2737k0579m560J8162
$$ 3428764 3464239 3488056 3497091 3492084 3474520 3444520 3408059 3370369 3337632 3317053 3312493 3330655
28064C330655M6729P6152J00937J23219J45898J63838J72921J73434J63777J49476
$$ 3330655 3377384 3453536 3554473 3677692 3823590 3987428 4160349 4333783 4497560 4647036
28054D647036J27187R2923N3741J0948l3112p0191r4684j06004j07960r9749q2579
$$ 4647036 4774223 4867146 4920887 4931835 4898723 4828532 4733848 4627844 4519884 4420135 4337556
28043D337556o0241l7554j2018J1500K6363L5495L9468L7777K8230J3827o360
$$ 4337556 4277315 4239761 4227743 4239243 4265606 4301101 4340569 4378346 4406576 4420403 4414043
28032D414043k8243m6387o4485q5268j07073j31229j55509j74007j86489j90151
$$ 4414043 4385800 4339413 4274928 4189660 4082587 3951358 3795849 3621842 3435353 3245202
28022C245202j86871j79446j67925j47404j26863j09951r2370p4467n6988m2719
$$ 3245202 3058331 2878885 2710960 2563556 2436693 2326742 2234372 2159905 2102917 2060198
28012B060198k8220j3514J231J7364L4492N1953O9236R0528J12086J32431J54909
$$ 2060198 2031978 2018464 2019695 2037059 2071551 2123504 2192740 2283268 2395354 2527785 2682694
28001B682694J73501J87009K02773K18105K27952K32334K26375K11388J90421
$$ 2682694 2856195 3043204 3245977 3464082 3692034 3924368 4150743 4362131 4552552
27992D552552J66023J36840J04325P0644L7656M729l2244q0413j28973j72557
$$ 4552552 4718575 4855415 4959740 5030384 5068040 5072769 5040525 4960112 4831139 4658582
27982D658582k13656k48455k75231k91442k91788k81159k65720k47447k25263
$$ 4658582 4444926 4196471 3921240 3629798 3338010 3056851 2791131 2543684 2318421
27973B318421k02810j80357j56542j37027j23630j12978r7983q4764p4968o7166
$$ 2318421 2115611 1935254 1778712 1641685 1518055 1405077 1307094 1222330 1147362 1080196
27963A080196o0323n3428n0013m5847m4472m1336l7041l3369k6648k1384k1305
$$ 1080196 1019873 966445 916432 870585 826113 784777 747736 714367 687719 666335 645030
27952F45030k0322j7851j7067j7886j6488j4955j4019j2285j2295j0892p640o166
$$ 645030 624708 606857 589790 571904 555416 540461 526442 514157 501862 490970 483330 477164
27940D77164o219n617k665n73P14k268l111j210P43L153L273J628K802P418Q334
$$ 477164 470945 465328 462663 462090 462804 460536 457425 456215 456958 460111 463384 465012 467814 475232 483566
27925D83566Q195Q292J0403J1053J0874J1800J0665R659J3630J6708K0006K2030
$$ 483566 491761 500053 510456 521509 532383 544183 554848 564507 578137 594845 614851 636881
27913F36881K2428K5215K9697L2118L4729L9335M4399N1095N4531N8488O4121
$$ 636881 659309 684524 714221 746339 781068 820403 864802 915897 970428 1028916 1093037
27902A093037P0548P8872Q9436J03342J13866J25494J39922J50419J57464J65171
$$ 1093037 1163585 1242457 1331893 1435235 1549101 1674595 1814517 1964936 2122400 2287571
27892B287571J75550J83148J85984J84113J81879J78812J68841J59858J52934
$$ 2287571 2463121 2646269 2832253 3016366 3198245 3377057 3545898 3705756 3858690
27883C858690J41354J30228J19914J06730Q5277N5410L0457J0241m222j3925k3846
$$ 3858690 4000044 4130272 4250186 4356916 4442193 4497603 4528060 4538301 4534079 4520154 4496308
27872D496308l0962l6400l7987l4154k8327k7347l0111l2565l3144l3846l7648
$$ 4496308 4465346 4428946 4390959 4356805 4328478 4301131 4271020 4238455 4205311 4171465 4133817
27861D133817m4507n0428n2072n0937m9487m7869m7468m9988n5698o4193p7843
$$ 4133817 4089310 4038882 3986810 3935873 3886386 3838517 3791049 3741061 3685363 3621170 3543327
27850C543327r4352j10609j24139j36917j44433j42430j38208j26173j10443r4427
$$ 3543327 3448975 3338366 3214227 3077310 2932877 2790447 2652239 2526066 2415623 2321196
27840B321196p9701o6844n3673m2398m0631m1282m0703m3228m4356m4054m3741
$$ 2321196 2241495 2174651 2120978 2078580 2037949 1996667 1955964 1912736 1868380 1824326 1780585
27829A780585m3017m4476m6094m3266m0404m2650n0365n4849n7578o1116o3059
$$ 1780585 1737568 1693092 1646998 1603732 1563328 1520678 1470313 1415464 1357886 1296770 1233711
27818A233711o1806n4711m5627l6029k9068k6867k0500j3189o087O97N359J1706
$$ 1233711 1171905 1117194 1071567 1035538 1006470 979603 959103 945914 939827 940524 945883 957589
27806I57589J7750K2674L0603M0501M5599M5779M5900M7652M9006M8228M6997
$$ 957589 975339 998013 1028616 1069117 1114716 1160495 1206395 1254047 1303053 1351281 1398278
27795A398278M9479N2556N4240N2509N1410N1306M7683M1384L6554L1334K0418
$$ 1398278 1447757 1500313 1554553 1607062 1658472 1709778 1757461 1798845 1835399 1866733 1887151
27784A887151O227p570j6815k4796l0783l1881l4076l8388l9504l9223m0680m8367
$$ 1887151 1893378 1885808 1868993 1844197 1813414 1781533 1747457 1709069 1669565 1630342 1589662 1541295
27772A541295n4929n7544n6665n3608n2960n4699n2740m5784l8832l1915k3354
$$ 1541295 1486366 1428822 1372157 1318549 1265589 1210890 1158150 1112366 1073534 1041619 1018265
27761A018265j5811r570l396K829N357O361R690J1894J3447J4882J8252J8867
$$ 1018265 1002454 992884 989488 992317 997674 1004035 1013725 1025619 1039066 1053948 1072200 1091067
27749A091067J6453J5215J8314J6842J3857J3089J1978P109M86l589q826j4977
$$ 1091067 1107520 1122735 1141049 1157891 1171748 1184837 1196815 1203924 1204410 1200821 1191995 1177018
27737A177018j4686j7234k2832k6333l2234l3007l5059l7050l8013l8077l8928
$$ 1177018 1162332 1145098 1122266 1095933 1063699 1030692 995633 958583 920570 882493 843565
27726H43565m4975m8541m7120m5170m3075m0763l6431l2605l1967k9906k8104
$$ 843565 798590 750049 702929 657759 614684 573921 537490 504885 472918 443012 414908
27715D14908k3308j8682j6907j3694j1300q260o185q180r359q727o920n945n944
$$ 414908 391600 372918 356011 342317 331017 322757 316572 308392 299033 290306 283386 277441 271497
27702B71497m964l690k745k361p56M77j787k33K484M891N596J971J367L767O458
$$ 271497 266533 262843 260098 257737 256981 257458 255671 255438 257922 262813 268409 270380 271747 275514 281972
27687B81972R870J3140J5336J6351J8070J9568K0093K2034K4774K8167K8740K6940
$$ 281972 291842 304982 320318 336669 354739 374307 394400 416434 441208 469375 498115 525055
27675E25055K3473J8322J6108J8627J8252J1785N116p16l661o878r541j3542j5830
$$ 525055 548528 566850 582958 601585 619837 631622 636738 636022 632361 625483 615942 602400 586570
27662E86570j6067j8179j9951j8016j4345j0919p361o891n209j633J445L269L991
$$ 586570 570503 552324 532373 514357 500012 489093 481732 474841 469632 467999 469444 472713 476704
27649D76704P535J2403J6633K2502L0684L6927M4476N3413O0239O7606P7875Q7585
$$ 476704 484239 496642 513275 535777 566461 603388 647864 701277 761516 829122 906997 994582
27637I94582R3896R8999J01968J01650R9278R4602Q3564O7417N0568L5708K5279
$$ 994582 1088478 1187477 1289445 1391095 1490373 1584975 1668539 1735956 1786524 1822232 1847511
27626A847511K1337K4355L2863M6540O0836P2517Q2935Q4938P7062O4047M4346
$$ 1847511 1868848 1893203 1926066 1972606 2033442 2105959 2188894 2273832 2350894 2414941 2459287
27615B459287J9569j2439m4339p0290q4632q4122p3072m9709k3653k178K0287
$$ 2459287 2478856 2466417 2422078 2351788 2267156 2183034 2109962 2060253 2036600 2034422 2054709
27604B054709M2928O5078Q6931J02360J13727J17880J11594J00627Q9889P5429
$$ 2054709 2097637 2162715 2249646 2352006 2465733 2583613 2695207 2795834 2885723 2961152
27594B961152N8748L9582J6896l910k0418k8010l0817l3152k2592M47K5299N0729
$$ 2961152 3019900 3059482 3076378 3072468 3052050 3024040 2993223 2960071 2937479 2937926 2963225 3013954
27582C013954P6330J00168J13563J16524J09317R2816O4894K5973j8242o0475
$$ 3013954 3090284 3190452 3304015 3420539 3529856 3622672 3687566 3713539 3695297 3634822
27572C634822r7736j25003j42651j49720j50103j48492j44247j40146j35450j28584
$$ 3634822 3537086 3412083 3269432 3119712 2969609 2821117 2676870 2536724 2401274 2272690
27562B272690j17916j06799r9008r4617r1831q9399q3351p5893p1978o6987n8377
$$ 2272690 2154774 2047975 1948967 1854350 1762519 1673120 1589769 1513876 1441898 1374911 1316534
27551A316534n5245n3773n1196m7101l9980l3771k7988j6600q641k166k74R44
$$ 1316534 1261289 1207516 1156320 1109219 1069239 1035468 1007480 990880 982239 980073 979799 980743
27539I80743N929R581J2609J8554K5789L4893M2439N0583O1703P0309Q2408R7300
$$ 980743 986672 996253 1008862 1027416 1053205 1088098 1130537 1181120 1242823 1313132 1395540 1492840
27527A492840J14562J34052J54324J75455J93459K06558K22362K39607K53038
$$ 1492840 1607402 1741454 1895778 2071233 2264692 2471250 2693612 2933219 3186257
27518C186257K55218K43306K20198J90855J57418J17005P2282L5987J2645K430
$$ 3186257 3441475 3684781 3904979 4095834 4253252 4370257 4442539 4478526 4491171 4493601
27508D493601Q574L4482P0875J08768J46732J79574K05022K20421K19653K05034
$$ 4493601 4502175 4536657 4607532 4716300 4863032 5042606 5247628 5468049 5687702 5892736
27498E892736J86672J68075J51816J39854J34457J38469J51328J61832J66201
$$ 5892736 6079408 6247483 6399299 6539153 6673610 6812079 6963407 7125239 7291440
27489G291440J58983J40492J08361O0771L922o0768j21112j70119k04948k22179
$$ 7291440 7450423 7590915 7699276 7760047 7763969 7703201 7582089 7411970 7207022 6984843
27479F984843k25250k17896k01981j84450j74365j69139j62275j52174j36151
$$ 6984843 6759593 6541697 6339716 6155266 5980901 5811762 5649487 5497313 5361162
27470E361162j12833q3139m6765n772L6819P4809R9615J11154J07806Q2648L7686
$$ 5361162 5248329 5165190 5118425 5112653 5149472 5224281 5323896 5435050 5542856 5625504 5663190
27459E663190k3368r5440j74079k46653l00233l35306l52541l54968l40102l10971
$$ 5663190 5639822 5544382 5370303 5123650 4823417 4488111 4135570 3780602 3440500 3129529
27449C129529k83593k57374k23299j90656j62056j38835j19408j02601q8018p4495
$$ 3129529 2845936 2588562 2365263 2174607 2012551 1873716 1754308 1651707 1563689 1489194
27439A489194o2956n3561m5171l9100l3306k4872j6948r065j355P908J6935K5391
$$ 1489194 1426238 1372677 1327506 1288406 1255100 1230228 1213280 1204215 1202860 1210768 1227703 1253094
27427A253094L7542M6580N2526O3854P9820R4802J06867J17849J29670J40176
$$ 1253094 1290636 1337216 1389742 1453596 1533416 1628218 1735085 1852934 1982604 2122780
27417B122780J48141J58044J61595J56035J45631J34814J18420R6601P5346N5842
$$ 2122780 2270921 2428965 2590560 2746595 2892226 3027040 3145460 3242061 3317407 3373249
27407C373249L3711P096j7054l9807o6728r5542j22819j51717j77043j89006j90057
$$ 3373249 3406960 3414056 3397002 3357195 3290467 3194925 3072106 2920389 2743346 2554340 2364283
27396B364283j84908j74739j55351j34411j15943r7207p9077n8433m1465k9595
$$ 2364283 2179375 2004636 1849285 1714874 1598931 1501724 1422647 1364214 1322749 1293154
27386A293154j3612J370J0267J6153K1893K9230L3075K9122K1007J2424O519p057
$$ 1293154 1279542 1280912 1291179 1307332 1329225 1358455 1391530 1420652 1441659 1454083 1460602 1453545
27374A453545k3720l5026m3429n5026o6067p0811p1727p0917o7546o1928n4036
$$ 1453545 1429825 1394799 1351370 1296344 1230277 1159466 1087739 1016822 949276 887348 833312
27363H33312m6815m0238l3894k8072k3205k1066j6314r083k011J855K890K863
$$ 833312 786497 746259 712365 684293 661088 640022 623708 614625 612614 614469 617359 620222
27351F20222L485N192R726J5387J9948K0422K4136K7860K9820K9907L0580L3716
$$ 620222 623707 628899 638625 654012 673960 694382 718518 746378 776198 806105 836685 870401
27339H70401L5025L8906M3077M5016M5125M6149M8116M6220M0732L5712L1327
$$ 870401 905426 944332 987409 1032425 1077550 1123699 1171815 1218035 1258767 1294479 1325806
27328A325806K5061K2076K4763K9158L0049L2914M1027M9360N4308N7154N8260
$$ 1325806 1350867 1372943 1397706 1426864 1456913 1489827 1530854 1580214 1634522 1691676 1749936
27317A749936N8148N8296N7435N6137N4287M7864L5342K0512P338m164j2059k1160
$$ 1749936 1808084 1866380 1923815 1979952 2034239 2082103 2117445 2137957 2145295 2141131 2129072 2107912
27305B107912l0170l9305m9963n9409o5246o8720o9342p1071p3246p0392o6233
$$ 2107912 2077742 2038437 1988474 1929065 1863819 1795099 1725757 1654686 1581440 1511048 1444815
27294A444815o2990n9325n2169m3638l6979l4715k9441j9941j0548l484K679J1256
$$ 1444815 1381825 1322500 1270331 1226693 1189714 1154999 1125558 1105617 1095069 1091585 1094264 1105520
27282A105520J6406K0289K5640L0087L1071L1098L2388L0885K5924K2192J4701
$$ 1105520 1121926 1142215 1167855 1197942 1229013 1260111 1292499 1323384 1349308 1371500 1386201
27271A386201L650p148j5662j7770j6471j6992k1520k9312l0498k5563k0167j7468
$$ 1386201 1389851 1382703 1367041 1349271 1332800 1315808 1294288 1264976 1234478 1208915 1188748 1171280
27259A171280j2110p941n025L426J6120K4590K6278K7243L0421L0909L3798M2043
$$ 1171280 1159170 1151229 1146204 1149630 1165750 1190340 1216618 1243861 1274282 1305191 1338989 1381032
27247A381032M6406M2591L6878L4267L4302L8251M4004N0897N5104N8085O5807
$$ 1381032 1427438 1470029 1506907 1541174 1575476 1613727 1657731 1708628 1763732 1821817 1887624
27236A887624P5134Q2569Q4808P9605P2833O1208L7837O505k6031o4484j04140
$$ 1887624 1962758 2045327 2130135 2209740 2282573 2343781 2381618 2388123 2362092 2297608 2193468
27225B193468j27048j32984j27284j11983r4524p9803o8837o2553n3571m2001
$$ 2193468 2066420 1933436 1806152 1694169 1599645 1519842 1451005 1388452 1334881 1292880
27215A292880l4516l0772k6597k4935k1655j9177k3697k5371j8999j1777p301
$$ 1292880 1258364 1227592 1200995 1176060 1154405 1135228 1111531 1086160 1067161 1055384 1048083
27204A048083n593k106N579J3230J8419K8244M2203N2403O2604P4161Q5807R5886
$$ 1048083 1042490 1040384 1045963 1059193 1077612 1105856 1148059 1200462 1263066 1337227 1423034 1518920
27192A518920J04594J11901J15175J11335J04965Q9136N9845K3604j3538n3358
$$ 1518920 1623514 1735415 1850590 1961925 2066890 2156026 2215871 2239475 2225937 2172579
27182B172579r4104j26986j44166j48221j41523j28940j12544r5988q1530o6544
$$ 2172579 2078475 1951489 1807323 1659102 1517579 1388639 1276095 1180107 1098577 1032033
27172A032033n3979m3148l2937k2614j4801j1503q026l106K673L935K504M400
$$ 1032033 978054 934906 901969 879355 864554 853051 845025 841919 844592 848527 851031 855431
27160H55431L455r05l285l033j364k379n090p927j2770j4952j4934j3493j3170
$$ 855431 858886 857981 854696 851663 850299 847920 842830 834903 822133 807181 792247 778754 765584
27147G65584j2533j0036q420l678K869P788J0554J1557J3481J5966J7551J9166
$$ 765584 753051 743015 734595 730917 733786 741574 752128 763685 777166 793132 810683 829849
27135H29849J8741J8786K1002K3543K3072K5249L3298M5297N7123P1081Q6478
$$ 829849 848590 867376 888378 911921 934993 960242 993540 1038837 1095960 1167041 1253519
27124A253519J01301J15937J31908J49892J67141J80496J87020J81790J67540
$$ 1253519 1354820 1470757 1602665 1752557 1919698 2100194 2287214 2469004 2636544
27115B636544J46147J10132O2289P619n2378j05153j40842j60130j72209j78425
$$ 2636544 2782691 2892823 2955112 2962731 2910353 2805200 2664358 2504228 2332019 2153594
27105B153594j75921j67730j56209j41247j23363j04762q3932o7086n3550l9403
$$ 2153594 1977673 1809943 1653734 1512487 1389124 1284362 1200430 1133344 1079794 1040391
27095A040391k5413j2275j568Q938K2774L5559M8447O4116Q3281J04844J26581
$$ 1040391 1014978 1002703 1001135 1010073 1032847 1068406 1116853 1180969 1264250 1369094 1495675
27084A495675J45577J63130J82092K03532K18216K22482K19335K07434J86282
$$ 1495675 1641252 1804382 1986474 2190006 2408222 2630704 2850039 3057473 3243755
27075C243755J55688J18883P2835K0595l6710r5668j48248j92638k27297k49163
$$ 3243755 3399443 3518326 3591161 3611756 3575046 3479378 3331130 3138492 2911195 2662032
27065B662032k57307k49408k31703k07037j80212j57229j32735j10833r4153p6947
$$ 2662032 2404725 2155317 1923614 1716577 1536365 1379136 1246401 1135568 1041415 964468
27055I64468o1446n1810m4389l6241l0811k8002k3653k0940j6431j3710r951m536
$$ 964468 903022 851212 806823 770582 739771 711769 688116 667176 650745 637035 627084 622548
27043F22548k158q72r91n2M398J1620J5879K1893K8515L3705L9837N0002N9305
$$ 622548 620390 619518 618527 618475 622873 634493 650372 672265 700780 734485 774322 824324 883629
27030H83629O8418P7624Q5031R5667J02157R7165R3148Q5384P2711N6675L4895
$$ 883629 952047 1029671 1114702 1210369 1312526 1409691 1502839 1588223 1660934 1717609 1752504
27019A752504Q479j8657m2619o1140p6298q4713q4942p9775o7660n6072m3020
$$ 1752504 1760983 1742326 1699707 1638567 1562269 1477556 1392614 1312839 1245179 1189107 1146087
27008A146087k2687l282Q384K0603L5882N2522O7833Q0954R3021J04221J12591
$$ 1146087 1123400 1120118 1128502 1149105 1184987 1237509 1305342 1386296 1479317 1583538 1696129
26997A696129J15298J16501J15728J14214J11184J07932J04559R8067Q8429Q1357
$$ 1696129 1811427 1927928 2043656 2157870 2269054 2376986 2481545 2579612 2668041 2749398
26987B749398P0985N3554L0827K883l0068o3132r5690j24787j45533j58976j63467
$$ 2749398 2820383 2873937 2904764 2907647 2877579 2814447 2718757 2593970 2448437 2289461 2125994
26976B125994j57982j47209j30121j03753q0820o4072m2755j4863Q955K6461L7878
$$ 2125994 1968012 1820803 1690682 1586929 1506109 1442037 1399282 1384419 1393374 1419835 1457713
26965A457713M8998O2280P1534P1007O5016N4918L9731J8293n928l4312o3209
$$ 1457713 1506711 1568991 1640525 1711532 1776548 1831466 1871197 1889490 1883562 1849250 1786041
26954A786041q5689j02530j14135j20799j22185j18732j11354r5891p8764o5899
$$ 1786041 1700352 1597822 1483687 1362888 1240703 1121971 1010617 914726 835962 770063
26944G70063n7601n1223m3593l6806l0443k4074k0509j6279j4088j4508j3097
$$ 770063 712462 661239 617646 580840 550397 526323 505814 489535 475447 460939 447842
26933D47842j0588l350q38m093n994k894K954O706J0076J0531J2345J6575K1963
$$ 447842 437254 433904 433066 428973 422979 420085 423039 429745 439821 450352 462697 479272 501235
26920E01235K6490K8411L3067M0276M5936N1481N7618O5085P3899Q0209Q1179
$$ 501235 527725 556136 589203 629479 675415 726896 784514 849599 923498 1003707 1084886
26909A084886Q2208Q2982P2592N7859M5207K7890O980j5157l7529n6024o8313
$$ 1084886 1167094 1250076 1322668 1380527 1425734 1453624 1460604 1445447 1407918 1351894 1283581
26898A283581p6887q3484q6361q3687p3919o1859n1793m4230l9066l2707k4125
$$ 1283581 1206694 1123210 1036849 953162 879243 817384 765591 721361 682295 649588 625463
26887F25463j3188n992p90N279J2941K2575L0177L5403M4072N5897O5156P4630
$$ 625463 612275 606283 605493 610772 623713 646288 676465 711868 755940 811837 876993 951623
26875I51623Q6294R2867R5767R6191R3738Q5909P3634N5837L2153O389k0971m6107
$$ 951623 1037917 1130784 1226551 1322742 1416480 1502389 1576023 1631860 1664013 1670402 1649431 1603324
26863A603324o8070q7078j01658j06582j06673j02502r2469p8563o3296n1692
$$ 1603324 1535254 1448176 1346518 1239936 1133263 1030761 938292 859729 796433 744741
26853G44741m4657l4154k1368j4305j0180o207j18P979J4621J9354K7492L8682
$$ 744741 700084 665930 644562 630257 620077 613870 613752 621731 636352 655706 683198 721880
26841G21880M6329N2822O4176P2005P6346Q5513R5601J01802J01398R3293Q2172
$$ 721880 768209 821031 885207 957212 1033558 1119071 1214672 1316474 1417872 1511165 1593337
26830A593337P2268N6791L6902J6043m696k5444m5688o5297p8304q1161p8704
$$ 1593337 1665605 1722396 1759298 1775341 1770645 1745201 1699513 1634216 1555912 1474751 1396047
26819A396047p4525o7588o1017n7484n5553n5726n5419n3313n1096n1895n3671
$$ 1396047 1321522 1253934 1192917 1135433 1079880 1024154 968735 915422 864326 812431 758760
26808G58760n1112m2407l6379l6726l6992l3489k9375k3817j8986j9216k0930
$$ 758760 707648 665241 628862 592136 555144 521655 492280 468463 449477 430261 409331
26797D09331j6572r728n749o083o716n010k100P6K308L831L676K536J856L649
$$ 409331 392759 383031 377282 371199 364483 359473 357373 357449 359757 363588 367264 369800 371656 375305
26783C75305O153Q524P803R562J2365J6653J8959J8551J8380J9566K5975L4580
$$ 375305 381458 389982 397785 407347 419712 436365 455324 473875 492255 511821 537796 572376
26771E72376L9844M0550M3961N0312N9311O9172P5337Q5166J01649J19568J32665
$$ 572376 612220 652770 696731 747043 806354 875526 950863 1036029 1137678 1257246 1389911
26760A389911J43517J57638J68396J73619J75911J77295J72837J62045J42316
$$ 1389911 1533428 1691066 1859462 2033081 2208992 2386287 2559124 2721169 2863485
$$ [...]
##END NTUPLES=NMR SPECTRUM
##END=
