##TITLE=XTC-1541_1
##JCAMPDX= 6.0         $$ Bruker NMR JCAMP-DX V2.0
##DATA TYPE= nD NMR SPECTRUM
##DATA CLASS= NTUPLES
##NUM DIM= 2
##ORIGIN= BRUKER
##OWNER= patiny
$$ 1.79 TOPSPIN		Version 3.0
$$ 2012-05-20 04:30:15.310 +0200  patiny@icmbsg005
$$ Compression mode = diff/dup
##.OBSERVE FREQUENCY= 400.131578956813
##.OBSERVE NUCLEUS= ^1H
##.ACQUISITION MODE= SIMULTANEOUS (DQD)
##.ACQUISITION SCHEME= Echo-Antiecho
##.AVERAGES= 4
##.DIGITISER RES= 23
##SPECTROMETER/DATA SYSTEM= spect
##.PULSE SEQUENCE= hmbcetgpl3nd
##.SOLVENT NAME= D2O
##.SHIFT REFERENCE= INTERNAL, D2O, 1, 7.28727
##AUDIT TRAIL= $$ (NUMBER, WHEN, WHO, WHERE, PROCESS, VERSION, WHAT)
$$ ##TITLE= Audit trail, TOPSPIN		Version 3.0
$$ ##JCAMPDX= 5.01
$$ ##ORIGIN= Bruker BioSpin GmbH
$$ ##OWNER= patiny
$$ $$ /opt/data/patiny/nmr/XTC-1541_1/14/pdata/1/auditp.txt
$$ ##AUDIT TRAIL=  $$ (NUMBER, WHEN, WHO, WHERE, PROCESS, VERSION, WHAT)
(   1,<2012-05-20 04:30:12.723 +0200>,<patiny>,<icmbsg005>,<go>,<TOPSPIN 3.0>,
      <created by zg
	started at 2012-05-20 04:08:05.636 +0200,
	POWCHK enabled, PULCHK disabled,
       configuration hash MD5:
       77 C7 B7 C4 10 F4 BA 30 64 2E BB 52 82 F2 DA 41
       data hash MD5: 4K * 128
       24 D6 9D 8C 4D E4 E0 B8 58 F3 A6 02 84 9B 1F 9B>)
(   2,<2012-05-20 04:30:12.789 +0200>,<patiny>,<icmbsg005>,<audit>,<TOPSPIN 3.0>,
      <user comment:
       ICON-NMR User ID: patiny
       data hash MD5: 4K * 128
       24 D6 9D 8C 4D E4 E0 B8 58 F3 A6 02 84 9B 1F 9B>)
(   3,<2012-05-20 04:30:13.701 +0200>,<patiny>,<icmbsg005>,<proc2d>,<TOPSPIN 3.0>,
      <Start of raw data processing
       xfb same F2: SI = 2K WDW = 3 SSB = 4 FT_mod = 6 PKNL = 1 F1: SI = 1K ME_mod = 2 NCOEF = 32 WDW = 4 SSB = 2 FT_mod = 6 PHC0 = 0 PHC1 = 0
       data hash MD5: 2K * 1K
       4F A0 D4 5A 8A 35 8E 54 DA FD C6 71 D3 F8 B9 C1>)
(   4,<2012-05-20 04:30:13.811 +0200>,<patiny>,<icmbsg005>,<proc2d>,<TOPSPIN 3.0>,
      <abs2 F2: ABSG = 5 ABSF1 = 7.28727 ABSF2 = 0.60495
       data hash MD5: 2K * 1K
       95 1E 4A 8A 5C 2C E1 55 7D 79 99 4B 3F 27 1B 93>)
(   5,<2012-05-20 04:30:13.989 +0200>,<patiny>,<icmbsg005>,<proc2d>,<TOPSPIN 3.0>,
      <abs1 F1: ABSG = 5 ABSF1 = 210.754 ABSF2 = -11.10083
       data hash MD5: 2K * 1K
       75 67 98 D1 6C A0 55 37 8D D1 E5 E2 DE 6E EE F3>)
$$ ##END=
$$ 
$$ $$ hash MD5
$$ $$ 1A BF 3C 5C 6C C2 E8 79 30 65 79 A0 58 3E DC 15
##$RELAX= 
##$RELAX= 
##$RELAX= 
##$RELAX= 
##$RELAX= 
##$RELAX= 
##$RELAX= 
##$RELAX= 
##$RELAX= 
##$RELAX= 
##$RELAX= 
$$ Bruker specific parameters
$$ --------------------------
##$DATPATH= </opt/data/patiny/nmr>
##$EXPNO= 14
##$NAME= <XTC-1541_1>
##$PROCNO= 1
##$ACQT0= 1000000
##$AMP= (0..31)
100 100 100 100 100 100 100 100 100 100 100 100 100 100 100 100 100 100
100 100 100 100 100 100 100 100 100 100 100 100 100 100
##$ANAVPT= -1
##$AQSEQ= 0
##$AQ_mod= 3
##$AUNM= <au_getlinv>
##$AUTOPOS= <34 >
##$BF1= 400.13
##$BF2= 100.612769
##$BF3= 400.13
##$BF4= 400.13
##$BF5= 400.13
##$BF6= 400.13
##$BF7= 400.13
##$BF8= 400.13
$$ [...]
##$SIGF1= 7.28727
##$SIGF2= 0.60495
##$SINO= 0
##$SIOLD= 2048
##$SPECTYP= <>
##$SREGLST= <1H.DMSO>
##$SSB= 4
##$STSI= 2048
##$STSR= 0
##$SW_p= 2673.79679144385
##$SYMM= 0
##$S_DEV= 2339207
##$TDeff= 4096
##$TDoff= 0
##$TI= <>
##$TILT= no
##$TM1= 0
##$TM2= 0
##$TOPLEV= 100
##$USERP1= <>
##$USERP2= <>
##$USERP3= <>
##$USERP4= <>
##$USERP5= <>
##$WDW= 3
##$XDIM= 2048
##$YMAX_p= 286083591
##$YMIN_p= -401879454
##$CURPLOT= <Cups-PDF>
##$CURPRIN= <$Cups-PDF>
##$DFORMAT= <normdp>
##$LAYOUT= <+/2D_inv.xwp>
##$LFORMAT= <normlp>
##$PFORMAT= <normpl>
$$ Bruker specific parameters for F1
$$ ---------------------------------
##$ACQT0= 0
##$BF1= 100.612769
##$FnMODE= 6
##$NUC1= <13C>
##$O1= 10043.8343986724
##$SFO1= 100.622812834399
##$SW= 221.832681201688
##$SW_h= 22321.4283611104
##$TD= 128
##$ABSF1= 210.754
##$ABSF2= -11.10083
##$ABSG= 5
##$ABSL= 0
##$ALPHA= 0
##$AQORDER= 0
##$ASSFAC= 0
##$ASSFACI= 0
##$ASSFACX= 0
##$ASSWID= 0
##$AUNMP= <>
##$AXLEFT= 0
##$AXNAME= <F1>
##$AXNUC= <13C>
##$AXRIGHT= 0
##$AXTYPE= 0
##$AXUNIT= <>
##$AZFE= 0.1
##$AZFW= 0.5
##$BCFW= 0
##$BC_mod= 0
##$BYTORDP= 0
##$COROFFS= 0
##$CY= -3
##$DATMOD= 1
##$DC= 0
##$DFILT= <>
##$DTYPP= 0
##$ERETIC= no
##$F1P= 210.76350402832
##$F2P= -11.0913240743493
##$FCOR= 0.5
##$FTSIZE= 1024
##$FT_mod= 6
##$GAMMA= 0
##$GB= 0
##$INTBC= 1
##$INTSCL= 1
##$ISEN= 128
##$LB= 0
##$LEV0= 0
##$LPBIN= 256
##$MAXI= 10000
##$MC2= 5
##$MEAN= 0
##$ME_mod= 2
##$MI= 1
##$NCOEF= 32
##$NC_proc= -11
##$NLEV= 6
##$NOISF1= 0
##$NOISF2= 0
##$NSP= 0
##$NTH_PI= 0
##$NZP= 0
##$OFFSET= 210.754
##$PC= 4
##$PHC0= 0
##$PHC1= 0
##$PH_mod= 1
##$PKNL= no
##$PPARMOD= 1
##$PPDIAG= 0
##$PPIPTYP= 0
##$PPMPNUM= 2147483647
##$PPRESOL= 1
##$PSCAL= 1
##$PSIGN= 0
##$PYNMP= <>
##$REVERSE= no
##$SF= 100.612769
##$SI= 1024
##$SIGF1= 210.754
##$SIGF2= -11.10083
##$SINO= 0
##$SIOLD= 1024
##$SPECTYP= <>
##$SREGLST= <>
##$SSB= 2
##$STSI= 1024
##$STSR= 0
##$SW_p= 22321.42836111
##$SYMM= 0
##$S_DEV= 2339207
##$TDeff= 256
##$TDoff= 0
##$TI= <>
##$TILT= no
##$TM1= 0
##$TM2= 0
##$TOPLEV= 0
##$USERP1= <>
##$USERP2= <>
##$USERP3= <>
##$USERP4= <>
##$USERP5= <>
##$WDW= 4
##$XDIM= 128
##$YMAX_p= 286083591
##$YMIN_p= -401879454
$$ End of Bruker specific parameters
$$ ---------------------------------
##NTUPLES= nD NMR SPECTRUM
##VAR_NAME=  FREQUENCY1,    FREQUENCY2,      SPECTRUM
##SYMBOL=    F1,            F2,              Y
##.NUCLEUS=  13C,           1H
##VAR_TYPE=  INDEPENDENT,   INDEPENDENT,     DEPENDENT
##VAR_FORM=  AFFN,          AFFN,            ASDF
##VAR_DIM=   1024,          2048,            2048
##UNITS=     HZ,            HZ,              ARBITRARY UNITS
##FACTOR=    21.7982698838965, 1.30556483957219, 1
##FIRST=     21204.543296753, 2672.49122660428, -67589
##LAST=      -1095.08679447308, 0,           184627
##MIN=       -1095.08679447308, 0,           -401879454
##MAX=       21204.543296753, 2672.49122660428, 286083591
##PAGE= F1=21204.54329675
##FIRST=     21204.543296753, 2672.49122660428, -67589
##DATA TABLE= (F2++(Y..Y)), PROFILE
$$ [...]
##PAGE= F1=5727.771679186
##FIRST=     21204.543296753, 2672.49122660428, -1728238
##DATA TABLE= (F2++(Y..Y)), PROFILE
817a890826D294746h303571C082708i41900D82726J266642a507958A543742L21590
808A865332D93486J104570R21709b806198g71082c45053r53636I24333D51919
798f30106F141376h780582A996951I18611j8918P3339R59165K343227k085328
789B190096b341091C090684b287596a019456B941702a153398k935679a97537C881670
779e218176B445892K326363d907485I38226c755373j628987B07652L314974H24159
769a72917A023155Q87303b077576a107A216012e127477a252618A256596g05718
759A849638q98222a776721o76003m9786A926013I48305Q05146c185090A017992
749A440414b734053a127328K89417B502912A130772b833965J180722A22082P88789
$$ y = [-1890826, 4294746, -8303571, 3082708, -941900, 482726, 1749368, -1507958, 1543742, 1865332, 493486, 1598056, 2519765, -2806198, -771082, -345053, -1298689, 924333, 451919, -630106, 6141376, -8780582, 1996951, 918611, 899693, 973032, 1932197, 4275424, 2190096, -2341091, 3090684, -2287596, -1019456, 2941702, -1153398, -4089077, -197537, 3881670, -5218176, 2445892, 4772255, -4907485, 938226, -3755373, -5384360, 207652, 3522626, 824159, -172917, 1023155, 1910458, -2077576, -1107, 1216012, -5127477, -1252618, 1256596, -705718, 1849638, 951416, -1776721, -2452724, -2502510, 1926013, 948305, 1753451, -3185090, 1017992, 1440414, -2734053, -1127328, -837911, 2502912, 1130772, -2833965, -1653243, 122082, 910871]
740I10871i06915r47151C464082b458377B552596a276209A523536C04485a351036
730A354265a113994j048500B904185f16469B336959a206903K6829F66180J266722
721A932902l20693D31223J179560b299648D537392I25974K643898h884516p323773
712a6208289P171781o724773f455874A5705511J2640619H007117L830628j714117
704A0123628c121145m824416k6069123J5735837j2863256j872885A3020894J8943570
696C1964464n989909m665313J147717a7601527b955847l988132f24891H52693
687a357244p82979B673278b760137k231536A116934K896648K4110I40694b700400
677a474426B746227b49384J3998D419665J6544183I988956i737162q141124j6735570
$$ y = [910871, -906915, -1854066, 3464082, -2458377, 2552596, -1276209, 1523536, 304485, -1351036, 1354265, -1113994, -2162494, 2904185, -616469, 2336959, -1206903, -1180074, 666180, 1932902, 1612209, 431223, 1610783, -2299648, 4537392, 925974, 3569872, -8884516, -16208289, -9036508, -15761281, -6455874, 15705511, 28346130, 8007117, 11837745, 10123628, -3121145, -7945561, -34014684, -18278847, -31142103, -33014988, 13020894, 31964464, 25974555, 21309242, 22456959, -17601527, -2955847, -6943979, -624891, 852693, -1357244, -2140223, 2673278, -2760137, -4991673, 1116934, 4013582, 4037692, 940694, -2700400, -1474426, 2746227, -249384, -235386, 4419665, 20963848, 9988956, -9737162, -17878286, -34613856]
668c4613856i482250r722858j303624C222070L438481K7303613p853947G753156
659d032156J97096p306800B242399a1453662p800451P806287H49961J2749737
651A3599698E997455d71819C198300A384608a625959A650203K540075g25268C65366
641E636552d90909E98521a507103m70713c68044D761683j17772g516892b55924
631A148597B29806b574936a088797A326956O53922g59917A555174o57934K052624
622B949864J0972366J7548127L2501560M9171853c19769340J47670410P0932199
615a01166731B26433436B6058819o547192C591502K715126l38295k384537j92135
607C391661A411042J122511P89098h38557F47066M977920b6321A751258a664640
$$ y = [-34613856, -9482250, -19205108, -20508732, 3222070, 6660551, 33964164, 26110217, 7753156, -4032156, -3835060, -11141860, 2242399, -11453662, -19254113, -11447826, 849961, 13599698, 5997455, -471819, 3198300, 1384608, -1625959, 1650203, 4190278, -725268, 365366, 5636552, -490909, 598521, -1507103, -1977816, -368044, 4761683, 4643911, -7516892, -255924, 1148597, 229806, -2574936, -1088797, 1326956, 1980878, -759917, 1555174, 897240, 2949864, 13922230, 31470357, 63971917, 113143770, -319769340, -172098930, -101166731, 226433436, 26058819, 19511627, 3591502, 6306628, 5968333, 3583796, 3391661, 1411042, 2533553, 3322651, -838557, 647066, 5624986, -26321, 1751258, -1664640]
597b778925j66841C435847j658332E80756d810015C612645b909091b641j532698
588a535339B896723d715558E087450C77295A52470J142800J024679a179309C46879
578B192737K241388a554487B747514a31114I144298c09388l369479E080390d754510
568A645794h7146j853443C057651b221523A055470D11158J563240d598485B847914
558B790347I93517N01988K97985a042775K97340A301160g644343C700796c072163
548F28946J138140a821518c84765j05287m212790O20032B720385g99855B594124
538d1016E27876a148152E596996a644830O73182k838191C262645d472634C202799
528F90208b391714E554350c357848A858457c14990o43818B021214O817085b483577
$$ y = [-2778925, -2945766, 3435847, 1777515, 580756, -4810015, 3612645, -2909091, -2641, -1535339, 2896723, -4715558, 5087450, 377295, 152470, 1295270, 2319949, -1179309, 346879, 2192737, 4434125, -1554487, 2747514, -131114, 9144298, -309388, -3678867, 5080390, -4754510, 1645794, -87146, -1940589, 3057651, -2221523, 1055470, 411158, 1974398, -4598485, 2847914, 2790347, 993517, 1495505, 1793490, -1042775, -745435, 1301160, -7644343, 3700796, -3072163, 628946, 1767086, -1821518, -384765, -490052, -4702842, -4082810, 2720385, -799855, 2594124, -41016, 527876, -1148152, 5596996, -1644830, -971648, -3809839, 3262645, -4472634, 3202799, 690208, -2391714, 5554350, -3357848, 1858457, -314990, -958808, 2021214, 8838299, -2483577]
518a104518B900614d77422B185794b070260i50004n5695D044360c989879H394794
508d874368B644271b069732A898634c25465D959248B300137d263993C429700b573481
498E651830e618610A494019K960662J793831e103186A984873r66950N958044b671797
488b055243m338440C412295p26777a015861k194008B920444l82667a620596L18005
479a302591A746000b008006c88883B13593a005390D778002c831452A125020D04393
469b047243C489529F18646a036301b62188o227489C008670b017937B88368a967620
459D302474c550087D330702G42540e844515c25395D105243j626055O53709b165930
449b523239f00936j032435A915250h78039l16126l85121A024347L607558e240726
$$ y = [-1104518, 2900614, -477422, 2185794, -2070260, -950004, -1005699, 4044360, -3989879, 8394794, -4874368, 2644271, -2069732, 1898634, -325465, 4959248, 2300137, -4263993, 3429700, -2573481, 5651830, -5618610, 1494019, 4454681, 6248512, -5103186, 1984873, 1017923, 6975967, -2671797, -2055243, -6393683, 3412295, 2685518, -1015861, -3209869, 2920444, 2537777, -1620596, -1302591, 1746000, -2008006, -388883, 213593, -1005390, 4778002, -3831452, 1125020, 404393, -2047243, 3489529, 618646, -1036301, -262188, -6489677, 3008670, -2017937, 288368, -1967620, 4302474, -3550087, 4330702, 742540, -5844515, -325395, 4105243, 2479188, 3132897, -2165930, -2523239, -600936, -1633371, 1915250, -878039, -1194165, -1579286, 1024347, 4631905, -5240726]
439a352332l151801b84744j695958D104502c237830C306146c019294i74449G06339
429b357892C150089a019311I35247a376620j184179B904172c745684B230563a285192
419i03238D80545c601593G80212d585763F002920B426412c297596J427408A770937
409C048088c569033j349590J617552D681152A560067k19801b908568G65971e731521
399C480048f7587o335559J624968A829218P87705b234024G56191h85246n250236
390f135482C126750A219391i41011k957707I8435J766187a679566A166142c787020
380E259926a833028l072508G273383D37417b786161B282307b524536f72775l370606
371d043381C5798J626292d27070C56057j24268b06321q43157p1018C592415c827741
$$ y = [-1352332, -4504133, -284744, -1980702, 4104502, -3237830, 3306146, -3019294, -974449, 706339, -2357892, 3150089, -1019311, 935247, -1376620, -2560799, 2904172, -3745684, 2230563, -1285192, -903238, 480545, -3601593, 780212, -4585763, 6002920, 2426412, -3297596, -1870188, 1770937, 3048088, -3569033, -4918623, -3301071, 4681152, 1560067, 1340266, -2908568, 765971, -5731521, 3480048, -67587, -6403146, -4778178, 1829218, 2616923, -2234024, 756191, -885246, -6135482, 3126750, 1219391, -941011, -3898718, 98435, 1864622, -1679566, 1166142, -3787020, 5259926, -1833028, -4905536, 7273383, 437417, -2786161, 2282307, -2524536, -672775, -4043381, 35798, 1662090, -427070, 356057, 231789, -206321, -1049478, -1120496, 3592415, -3827741]
360D866855E21695b969596a62936H83183L513490b479077C46646d53207n76312
351a029519d56983q97819j802485b52608A838436d121241C623627b440455i07220
341c659823D721192a330749f44546B638415e455690P41602J530569A627386H08054
331I11251c322068D46864L972526b747165h8547A110792J187910N90914e149432
321H95251a37915A94507R45449b045827C767156a231137E111990b633386P26122
312a907264B971061e439093A421713a872147c65584l113945E684816b886212L33919
303b552293B856208c085463C767889j070673b375194F8265K196006G41199g00356
293H45557A09357J472451p43270O13598L93594a84354j83609m339075C842502
$$ y = [4866855, 521695, -2969596, -162936, 883183, 4396673, -2479077, 346646, -453207, -1029519, -456983, -1354802, -3157287, -252608, 1838436, -4121241, 3623627, -2440455, -907220, -3659823, 4721192, -1330749, -644546, 2638415, -5455690, -4714088, -3183519, 1627386, 808054, 911251, -3322068, 446864, 4419390, -2747165, -88547, 1110792, 2298702, 2889616, -5149432, 895251, -137915, 194507, 1139956, -2045827, 3767156, -1231137, 5111990, -2633386, -1907264, 2971061, -5439093, 1421713, -1872147, -365584, -3479529, 5684816, -2886212, -2552293, 2856208, -3085463, 3767889, 2697216, -2375194, 68265, 2264271, 741199, -700356, 845557, 109357, 1581808, 838538, 1452136, 1845730, -184354, -367963, -4707038, 3842502]
283E99086A80135L66621M10093J533924d631092B673581j279280a067196A857747
273b615018a028667J25131I33820O27380a51544p09956C921562a989927o18537
264b608464n86519C441448a785075A289822c449033a223731L78684l882130A093202
254A515626b672820B81877a278884I09646P07278h52918G85823c034701q39128
245c873829B5463c498019k038198b064444B857526h9353j320241f77842A118290
235d03423G16979a502557E7243a980233j673657F42410a68366B52305J659307
226A911612J85323L60447a943074F76237j42339n6283c6673k055495D502782c188805
215G70891a033750E764148A407519l43178B39489e72549H76806b39932A607702
$$ y = [599086, 180135, 546756, 956849, 2490773, -4631092, 2673581, 1394301, -1067196, 1857747, -2615018, -1028667, -903536, 933820, 1561200, -151544, -861500, 3921562, -1989927, -2608464, -3194983, 3441448, -1785075, 1289822, -3449033, -1223731, -845047, -4727177, 1093202, 1515626, -2672820, 281877, -1278884, 909646, 1616924, -852918, 785823, -3034701, -3873829, 25463, -3498019, -5536217, -2064444, 2857526, -89353, -1409594, -677842, 1118290, -403423, 716979, -1502557, 57243, -1980233, -3653890, 642410, -168366, 252305, 1911612, 2096935, 2457382, -1943074, 676237, 533898, 477615, -36673, -2092168, 4502782, -3188805, 770891, -1033750, 5764148, 1407519, 1064341, 239489, -572549, 876806, -239932, 1607702]
205i66705k806899b00447m084958B891426g62617G557381A554780a287870A672755
195A323482b578345J208539C741724E14406c494940A355352L6046c601876m9723873
186e3325749j20288215A8919993M542947J38466284F9531080J15703807i212750
178a8983831j43310375d2289507E448960A102237b194460C231972f591717C652133
169e115243b242670C412376O10639A044778Q06266k61668b655176a127449A413573
159B54786J518675i96052l25479l21955k18060C963937i49247L36607o92691l651829
149d957160A529364L228215g56185C231455B73525A7826N84503g465259G82764
139B272354j99647b276202a3841A23101d227094a677314A250548m11473b310120
$$ y = [-966705, -3773604, -200447, -4285405, 2891426, -762617, 7557381, 1554780, -1287870, 1672755, 1323482, -2578345, -1369806, 3741724, 514406, -3494940, 1355352, 1391398, -3601876, -53325749, -173613964, 18919993, 23462940, 161929224, 69531080, 185234887, -9212750, -18983831, -162294206, -42289507, 5448960, 1102237, -2194460, 3231972, -6591717, 3652133, -5115243, -2242670, 3412376, 4023015, 1044778, 1851044, 1589376, -2655176, -1127449, 1413573, 254786, 1773461, -996052, -1321531, -1643486, -1861546, 3963937, -949247, -612640, -1305331, -4957160, 1529364, 4757579, -756185, 3231455, 273525, 17826, 602329, -7465259, 782764, 2272354, 2072707, -2276202, -13841, 123101, -4227094, -1677314, 1250548, 839075, -2310120]
129C2247b174573A304803i31683k024399a212034k319228B585204b164666C257772
119g73014A00918e701215l398724B403241K512923F68608R52223K057211g37874
109g174n40003B70699c315091A715657N26215c370490A409817b638462f53394
99E201875d343238a271855A01366J724577H34093L77191a1311460a994084N94131
90a399953j955007D692290j010723e64514C114474c93788j58965i066j297160
81a306226l42748B928718j459613m13607j43280R80151K78170Q84369b109866
71A581393b109736B363150c619098A859262a863770q61664C658861A212144A57669
61c843820A57382R52830b942681J99352C993859b214555G313460l235725A546714
$$ y = [32247, -2174573, 1304803, -931683, -2956082, -1212034, -3531262, 2585204, -2164666, 3257772, -773014, 100918, -5701215, -9099939, 2403241, 4916164, 668608, 1620831, 3678042, -737874, -7174, -547177, 270699, -3315091, 1715657, 2241872, -3370490, 1409817, -2638462, -653394, 5201875, -4343238, -1271855, 101366, 1825943, 834093, 1211284, -11311460, -1994084, -1399953, -3354960, 4692290, 3681567, -564514, 3114474, -393788, -552753, -9066, -1306226, -1648974, 2928718, 1469105, 1055498, 912218, 1892369, 2170539, 3054908, -2109866, 1581393, -2109736, 2363150, -3619098, 1859262, -1863770, -2725434, 3658861, 1212144, 157669, -3843820, 157382, 1110212, -2942681, -2743329, 3993859, -2214555, 7313460, 4077735, 1546714]
51B554058g363939B276831a546538j203418A259579b072367C102172c73285C311797
41a956194B441319i17199C449966q0355f579390b468362a078572k98629A683949
31b823021G649461f914640a118614B070537E27006b186999D8016h90993C791247
21c083453B810225c95502F29413d099229A533844a761769I75057a465592c55943
11b84363j305272B535845g03302E91118k86999e2239m05924I39719j58559g82948
0a886089
$$ y = [2554058, -7363939, 2276831, -1546538, -2749956, 1259579, -2072367, 3102172, -373285, 3311797, -1956194, 2441319, -917199, 3449966, 3369611, -6579390, -2468362, -1078572, -1377201, 1683949, -2823021, 7649461, -6914640, -1118614, 2070537, 527006, -2186999, 48016, -890993, 3791247, -3083453, 2810225, -395502, 629413, -4099229, 1533844, -1761769, 975057, -1465592, -355943, -284363, -1589635, 2535845, -703302, 591118, 304119, -52239, -458163, 939719, 781160, -782948, -1886089]
##PAGE= F1=5705.973409302
##FIRST=     21204.543296753, 2672.49122660428, -1947348
##DATA TABLE= (F2++(Y..Y)), PROFILE
2047a947348B726802e55990B058399a198763a35454A493516a529776F22177J479060
2038B101237d079975B419121b277225c52293j199943b36647G690421f600132b78483
2028A851124d018690Q34948D958646a187585C723024f03550k170618k28554D562598
2018D4488c671200D476125e074875C004319a967514O62547L33761C916814b373584
2008A779789a533509P26684l334255G0560J828092q28092J488342A247122C21633
1998B641727q23867a039205A999930d10013A288845k26530g40068j684521D162849
1988a350553A803648a347596L51706n002109F110730d207655J203503E572866
1979a192656k37981A805749K286409a333677j660974a370964j803974B00072M075500
$$ y = [-1947348, 2726802, -555990, 2058399, -1198763, -135454, 1493516, -1529776, 622177, 2101237, -4079975, 2419121, -2277225, -352293, -1552236, -236647, 7690421, -6600132, -278483, 1851124, -4018690, -3183742, 4958646, -1187585, 3723024, -603550, -2774168, -3002722, 4562598, 44488, -3671200, 4476125, -5074875, 3004319, -1967514, -1304967, -971206, 3916814, -2373584, 1779789, -1533509, -806825, -4141080, 70560, 1898652, 1070560, 2558902, 1247122, 321633, 2641727, 1817860, -1039205, 1999930, -410013, 1288845, 1062315, -740068, -2424589, 4162849, -1350553, 1803648, -1347596, -995890, -5997999, 6110730, -4207655, -3004152, 5572866, -1192656, -1430637, 1805749, 4092158, -1333677, -2994651, -1370964, -3174938, 200072, 4275572]
1970D275572b302381d37884A670529d43609l025012B447861b462807E30461O78962
1961A209423J918926l82986b036878c81482l78365m37748A799977M641893c488394
1951d390985A169689a072966B608131d304751A149452a400242k731618C12132
1942B586460a805455G771658I35190d95584C595496d629398D495887b328451A119485
1932a233440A868382d123162D167250q81004B93658c437900D812505A069955Q92884
1923A962839a939246C159538d91189j579464d12768k297372B114767J345316i60462
1913D271545b382705A953039a500405A49405b706067e65892D673965a18618m43369
1904e61987j950106A803309f71365K78666A376946O14728d502430G139771c689
$$ y = [4275572, -2302381, -437884, 1670529, -443609, -3468621, 2447861, -2462807, 530461, 1209423, 3128349, 2745363, -2036878, -381482, -759847, -1197595, 1799977, 6441870, -3488394, -4390985, 1169689, -1072966, 2608131, -4304751, 1149452, -1400242, -4131860, 312132, 2586460, -1805455, 7771658, 935190, -495584, 3595496, -4629398, 4495887, -2328451, 1119485, -1233440, 1868382, -4123162, 4167250, 3286246, 293658, -3437900, 4812505, 1069955, 1962839, -1939246, 3159538, -491189, -2070653, -412768, -2710140, 2114767, 3460083, -960462, 4271545, -2382705, 1953039, -1500405, 149405, -2706067, -565892, 4673965, -118618, -561987, -2512093, 1803309, -671365, -392699, 1376946, 1991674, -4502430, 7139771, -3689]
1894A128225N2998K057560a792445A743023J383227b347901c46164A011319E00671
1884e81377A191360J121423G66292O32373l54463a840241B105867b779953L37254
1875b442699A999381a635393m15905c48686A226984l83603K738482j235171d321954
1865C999686A338667J246744e417018C496651d091056J934085B534874b108441
1856A681906J50338I5656L710171G59032N46206a118243B631314c583721J113074
1847b470647l85603D06235N02715I1855g1687C562949f90285L41063k977286B850558
1836f36633E31700O71532m71451c561676E74934A25881K611932a039989N07590
1827e32399G110154I42609c53187j814153B209320a682736r39906B155712G27825
$$ y = [1128225, 1181223, 3238783, -1792445, 1743023, 3126250, -2347901, -346164, 1011319, 500671, -581377, 1191360, 2312783, 766292, 1398665, 1044202, -1840241, 2105867, -2779953, -2442699, 1999381, -1635393, -2051298, -348686, 1226984, 843381, 3581863, 2346692, -4321954, 3999686, 1338667, 2585411, -5417018, 3496651, -4091056, -2156971, 2534874, -2108441, 1681906, 1832244, 95656, 3805827, 759032, 1305238, -1118243, 2631314, -3583721, -2470647, -2856250, 406235, 908950, 91855, -71687, 3562949, -690285, -349222, -3326508, 2850558, -636633, 531700, 1203232, 731781, -3561676, 574934, 125881, 2737813, -1039989, -532399, 7110154, 942609, -353187, -2167340, 2209320, -1682736, -2622642, 2155712, 727825]
1817A416096d428388D217792d995376c20738l551964L53230i51987B916486J182984
1808D099470b700654C76511J694576F63533e280425F512493a170226n999224B349865
1798h2627q94799D21779J686167a733947A615950a064921j72790D819424B083513
1788I46617i25753D241007k09006c394019A693837E88512b720525F456312b314103
1778c93815m916701C16055h48623j622860C997063F77676k90472a812545Q737
1769a803808A507750c257859B990387j432088b412459i67417j345235d28438E94232
1759g36288C64589b823911A411026c519188j650212C753540c230241J596136I75446
1749A877882a241028A154389f582788C3578J957581b776989A652022M21052c753892
$$ y = [1416096, -4428388, 4217792, -4995376, -320738, -3872702, -3519472, -951987, 2916486, 4099470, -2700654, 376511, 2071087, 663533, -5280425, 6512493, -1170226, -7169450, 2349865, -82627, -977426, 421779, 2107946, -1733947, 1615950, -1064921, -1237711, 4819424, 2083513, 946617, -925753, 4241007, 4032001, -3394019, 1693837, 588512, -2720525, 6456312, -2314103, -393815, -5310516, 316055, -848623, -2471483, 3997063, 677676, 387204, -1812545, -1803808, 1507750, -3257859, 2990387, 1558299, -2412459, -967417, -2312652, -428438, 594232, -736288, 364589, -2823911, 1411026, -3519188, -5169400, 3753540, -3230241, -1634105, 975446, 1877882, -1241028, 1154389, -6582788, 33578, 1991159, -2776989, 1652022, 2073074, -3753892]
1739D759718f24218j736941A287791b123491G04559f779163C309235c390674B378199
1729c26193I88757a993138C401639j574725o16923b315330N39823B421580a142033
1719b207911A233396b31520k97283E89619d960098B093991b54769F66908O56199
1710A323107K02622a662355E25384c017521H41949J511084d899620a119647d067
1700b151541A557415b73738C599696a012512G39277K668512a544559b28619A026353
1690A681785c894770A202644E60362N133555e231043A07718K494620r94919d455152
1680F700442b676848A87903M408580C37056d827204B380167f30826A405319e229722
1670B604131B92395b198801l90486A545916a058185E077069j702404c547235B653161
$$ y = [4759718, -624218, -2361159, 1287791, -2123491, 704559, -6779163, 3309235, -3390674, 2378199, -326193, 988757, -1993138, 3401639, 1826914, 1209991, -2315330, -1775507, 2421580, -1142033, -2207911, 1233396, -231520, -528803, 589619, -4960098, 2093991, -254769, 666908, 1323107, 1525729, -1662355, 525384, -3017521, 841949, 2353033, -4899620, -1119647, -4067, -2151541, 1557415, -273738, 3599696, -1012512, 739277, 3407789, -1544559, -228619, 1026353, 1681785, -3894770, 1202644, 560362, 5693917, -5231043, 107718, 2602338, 1607419, -4455152, 6700442, -2676848, 187903, 4596483, 337056, -4827204, 2380167, -630826, 1405319, -5229722, 2604131, 292395, -2198801, -2589287, 1545916, -1058185, 5077069, 3374665, -3547235, 2653161]
1660H84096j48948b568040B832806b740082A64973o2376a466442J59120A732736
1650B721679G84448A13599K922870a218518c36330C040848L91535f1383D368739
1640C04090b819403J353582A32574C6715f126699C513334a682505L68776C674875
1630A70043L106781c992282A90811J282628g62016A386603c62288I53195c129053
1620A486940b86691j276232P46468D63333a740181B805883g48180k202893P69345
1611b181728H885566a051705A47232b593320B367347G92027B75072R13050e3764
1601b309295c4042A144569a891524I88350a991924D358690F76959a816921O50442
1592a166479H43980c577218K07006A230002K45819a108238I31819P20736K12795
$$ y = [884096, 735148, -2568040, 2832806, -2740082, 164973, 102597, -1466442, -1307322, 1732736, 2721679, 784448, 113599, 3036469, -1218518, -336330, 3040848, 3432383, -61383, 4368739, 304090, -2819403, -1465821, 132574, 36715, -6126699, 3513334, -1682505, -1313729, 3674875, 170043, 3276824, -3992282, 190811, 1473439, -762016, 1386603, -362288, 953195, -3129053, 1486940, -286691, -1562923, -816455, 463333, -1740181, 2805883, -748180, -2951073, -2181728, 8885566, -1051705, 147232, -2593320, 2367347, 792027, 275072, 1188122, -53764, -2309295, -34042, 1144569, -1891524, 988350, -1991924, 4358690, 676959, -1816921, -1166479, 843980, -3577218, -3370212, 1230002, 1475821, -1108238, 931819, 1652555, 1865350]
1583A865350E87760b72028E70076f84982G18018c621261E8826a748283A684101
1573A980249I45325N86905a719862C039248A199248J900060a424353m906978B594156
1563A98169M02350c36839C39970J19375R95342a048618A982054k49419p59748
1554I72887J220744K67917d751905e28028A119135L31160b734489d54054B487925
1544G64875b006836A419964b601521B118694h40071F244084a409784C172855G93240
1534g69676H28864a624586K65574E40703K648835H5884c311584b87912A192421
1524F73846N098472c204428E499372b529495a112375A134699L997934A008114
1515C750852b429282B733491a818643A04069d085511C111879a219863d53244C441595
$$ y = [1865350, 587760, -272028, 570076, -684982, 718018, -3621261, 58826, -1748283, 1684101, 1980249, 945325, 1532230, -1719862, 3039248, 1199248, 3099308, -1424353, -6331331, 2594156, 198169, 600519, -336839, 339970, 459345, 1454687, -1048618, 1982054, 1732635, 972887, 2193631, 2461548, -4751905, -528028, 1119135, 1450295, -2734489, -454054, 2487925, 764875, -2006836, 1419964, -2601521, 2118694, -840071, 6244084, -1409784, 3172855, 793240, -769676, 828864, -1624586, -1359012, 540703, 3189538, 85884, -3311584, -287912, 1192421, 673846, 5772318, -3204428, 5499372, -2529495, -1112375, 1134699, 5132633, 1008114, 3750852, -2429282, 2733491, -1818643, 104069, -4085511, 3111879, -1219863, -453244, 3441595]
1505a501093A757815c72256j206100k686348C757795C42138a489085E176315D16454
1495d856402A985343b939354A213358e47541A002873a134424c58398k237496A885981
1485a314721B655336J094191A379420F13460J282869m18145e770907A829561d44820
1475a333092q03141j577855D50599Q82822k00752a562034J1422O95406j039731
1466a894937R40498q51787G069582d817060C55465c815841A272962a22129m78539
1457f00668n273777D115808j072406e666661A752660e051018H28802J048491b064751
1447F14400O03953g09942j021693E29712a244514E785460c351946E065739a033032
1437a673395E2685J669497c366564a249553f23566B326698f9349n439941A597726
$$ y = [-1501093, 1757815, -372256, -1578356, -4264704, 3757795, 342138, -1489085, 5176315, 416454, -4856402, 1985343, -2939354, 1213358, -547541, 1002873, -1134424, -358398, -2595894, 1885981, -1314721, 2655336, 3749527, 1379420, 613460, 1896329, 1478184, -5770907, 1829561, -444820, -1333092, -2136233, -3714088, 450599, 1333421, 1132669, -1562034, -1550612, -855206, -1894937, -954439, -1806226, 7069582, -4817060, 355465, -3815841, 1272962, -122129, -600668, -5874445, 4115808, 3043402, -5666661, 1752660, -5051018, 828802, 1877293, -2064751, 614400, 1218353, -709942, -1731635, 529712, -1244514, 5785460, -3351946, 5065739, -1033032, -1673395, 52685, 1722182, -3366564, -1249553, -623566, 2326698, -69349, -5509290, 1597726]
1427a012561M0386j645019C13166J868268b909365C766407A334651M13100j97796
1418A549955m96206c667264A737360c113920H380106A186081a749504A07302b820661
1408C310203C36612c5995E2656J569763f02966B893692a907759A0045762E9892
1398g9046p566143D107303j963806o59798d246426A328155N96229n1548d013507
1388F492987A166573b15561F22758e290806K236720J196247B754432a928464e31400
1378b58205A520533N38000b52327H9595c034489A425127K767408B74148a737596
1368i77706n69662F14333d544822B189018b36339C461552j716171b534920R30938
1359a603982F41280h03443b1136C159702f65041a82396l264146d81539j757793
$$ y = [-1012561, -972175, -2617194, 313166, 2181434, -2909365, 3766407, 1334651, 1747751, 1549955, 1053749, -3667264, 1737360, -3113920, 8380106, 1186081, -1749504, 107302, -2820661, 3310203, 336612, -35995, 52656, 1622419, -602966, 2893692, -1907759, 10045762, 59892, -79046, -7645189, 4107303, 2143497, 1483699, -4246426, 1328155, 1924384, 1872836, -4013507, 6492987, 1166573, -215561, 622758, -5290806, -3054086, -1857839, 2754432, -1928464, -531400, -258205, 1520533, 2058533, -252327, 89595, -3034489, 1425127, 4192535, 274148, -1737596, -977706, -1547368, 614333, -4544822, 2189018, -236339, 3461552, 1745381, -2534920, -1603982, 641280, -803443, -21136, 3159702, -665041, -182396, -3446542, -481539, -2239332]
1350b239332c47857a7106E291334j257282a744913Q07491c05569E49318K33932
1341G83250K250338l96181A191704d160567a783172B121862J27285a756580j438337
1332c194917a131383j132143D436529a625351l224736h31771f7878A553568N362245
1323F915813a2250995a19232r50437A939662h99761b5807B359159E4570J178094
1314A232664g75343j473243b31444B057783c078959a166847i3600I13793J669867
1305B583660d112416A736593i69407l926032C719763D84414M797257A349179J552282
1296B901461A144954c680236A007952A53493d05983l0067G93006A84575b539412
1286b171101a36687p19577H20143L036844e527183a148695C145769h81701k649713
$$ y = [-2239332, -347857, -17106, 5291334, 4034052, -1744913, -937422, -305569, 549318, 783250, 3033588, 2637407, 1191704, -4160567, -1783172, 2121862, 2249147, -1756580, -3194917, -1131383, -2263526, 4436529, -1625351, -4850087, -831771, -67878, 1553568, 6915813, -12250995, -119232, -1069669, 1939662, -899761, -25807, 2359159, 54570, 1232664, -775343, -2248586, -231444, 2057783, -3078959, -1166847, -93600, 913793, 2583660, -4112416, 1736593, -969407, -4895439, 3719763, 484414, 5281671, 1349179, 2901461, 1144954, -3680236, 1007952, 153493, -405983, -436050, 793006, 184575, -2539412, -2171101, -136687, -856264, 820143, 3856987, -5527183, -1148695, 3145769, -881701, -3531414]
1277c531414A779053b207483q04243J045290R82359B669126e01515p6110A652320
1267e695559a227155A270458N86457A8531O427233a768810P6204k562527C185732
1257B9186a748358A787767a173421C075173A160885a769941B317086N16391j191330
1248A642147d0272H86513K92163D85817A34039c274079E352053a153373j320420
1239b473793P71707e8160l151221i8580A168479b346751m031714I16835D38370
1229B84401R93434i68794C529478b334516b45915i4855l19618B584508r6521f931858
1218B764072a514930A891015G57532N73262K249938g58002m286750C73925K439715
1209B813640j101870c962735A541860l44631b580421j189443B315901c857788
$$ y = [-3531414, 1779053, -2207483, -3011726, -1966436, -984077, 2669126, -501515, -577625, 1652320, -5695559, -1227155, 1270458, 1856915, 18531, 6445764, -1768810, -1692606, -4255133, 3185732, 29186, -1748358, 1787767, -1173421, 3075173, 1160885, -1769941, 2317086, 2833477, 1642147, -40272, 886513, 1178676, 485817, 134039, -3274079, 5352053, -1153373, -2473793, -1702086, -58160, -3209381, -98580, 1168479, -2346751, -6378465, 916835, 438370, 284401, 1277835, -968794, 3529478, -2334516, -245915, -94855, -414473, 2584508, 2487987, -6931858, 2764072, -1514930, 1891015, 757532, 1330794, 3580732, -758002, -5044752, 373925, 2813640, 1711770, -3962735, 1541860, 1197229, -2580421, -3769864, 2315901, -3857788]
1200c681280H84517H7261K009078b551690a258997C671563J389795c694131a241740
1190I1942e063700G241059a884140G38173H5892d95840m39109I18374b275005
1180E793327B146299c112780A079807k85612K546520b737475Q81356D352077c752463
1170a388764a28724G77808j91641b147058H22855M031205d223682d88559o69215
1161a157774A102114d50565A364623i93684A60155J766500J199782i81560A091858
1151A202500J510800a604230c40276j352458h46325L44920j333825g64020F65944
1141A016577J580820f97563b98227j618648E99174a693733B529590J356613b484171
1131b266927C56226a200692J40867d54842A438177f75264j095181E017365e97979
$$ y = [-3681280, 884517, 87261, 2096339, -2551690, -1258997, 3671563, 5061358, -3694131, -1241740, 91942, -5063700, 7241059, -1884140, 738173, 85892, -495840, -934949, 918374, -2275005, 5793327, 2146299, -3112780, 1079807, 794195, 3340715, -2737475, -1856119, 4352077, -3752463, -1388764, -128724, 777808, 586167, -2147058, 822855, 4854060, -4223682, -488559, -1157774, 1102114, -450565, 1364623, -993684, 160155, 1926655, 3126437, -981560, 1091858, 1202500, 2713300, -1604230, -340276, -1692734, -846325, -501405, -1835230, -764020, 665944, 1016577, 2597397, -697563, -298227, -1916875, 599174, -1693733, 2529590, 3886203, -2484171, -2266927, 356226, -1200692, -1059825, -454842, 1438177, -675264, -1770445, 5017365, -597979]
1121B225800c21413G98053f217580g46943j354866k973291a402729M82037F37466
1111i73207D394947b204498D23991J258683c298822A266608L7165J464371a992577
1101F81591a762605A294816Q11473i32957j191261G65938P031707f755820A09631
1091a168591E571845d336302A464327K26091b231523B265164c215876B2080a373686
1081A902999J887694g80082m91272B192366i01561A62730d403428e24459B467315
1071a405543e24707I64059h51899k810684f49123E60268J947906c37256j154954
1062a492210A478216a124588B105172d618853a716067B7962J536950F96718d093411
1052B012625a339085H76762f618762b672324R75916C118671b770614E083312B106440
$$ y = [2225800, -321413, 798053, -6217580, -746943, -2101809, -5075100, -1402729, -920692, 637466, -973207, 4394947, -2204498, 423991, 1682674, -3298822, 1266608, 1303773, 2768144, -1992577, 681591, -1762605, 1294816, 2106289, -932957, -2124218, 765938, 7797645, -6755820, 109631, -1168591, 5571845, -4336302, 1464327, 1690418, -2231523, 2265164, -3215876, 22080, -1373686, 1902999, 3790693, -780082, -1271354, 2192366, -901561, 162730, -4403428, -524459, 2467315, -1405543, -524707, 964059, -851899, -3662583, -649123, 560268, 2508174, -337256, -1492210, 1478216, -1124588, 2105172, -4618853, -1716067, 27962, 1564912, 696718, -4093411, 2012625, -1339085, 876762, -6618762, -2672324, -1696408, 3118671, -2770614, 5083312, 2106440]
1042E036164f54083k133450B251187j12449e117963A152648b10521D164177c184336
1032c86983j540701A345009b725964a290485C07700A29624c71443J81895k248026
1023b437574H00197O5307N53244L64807L733486B44467g724812L478511A243288
1013c163034B014448b325623c48135p29588B02580c726083C230551A049914a735208
1003A069894k22444C52946L010116c256326C354758d339148E122096B40702M71575
994G12277f97116k875166C566650A434853h69254C014056c463478A610204K275458
985C885662a839996e08637n475839D900040a921207B876222A194692b31597A593685
975H23968a674892A585441d235824B59174c89715B338817b649006E125487b875350
$$ y = [5036164, -654083, -2787533, 2251187, 2138738, -5117963, 1152648, -210521, 4164177, -3184336, -386983, -1927684, 1345009, -2725964, -1290485, 307700, 129624, -371443, -189548, -2437574, 800197, 865504, 1418748, 1783555, 5517041, 244467, -7724812, -4246301, 1243288, -3163034, 2014448, -2325623, -348135, -1077723, 202580, -3726083, 3230551, 1049914, -1735208, 1069894, 847450, 352946, 3363062, -3256326, 3354758, -4339148, 5122096, 240702, 712277, -697116, -3572282, 3566650, 1434853, -869254, 3014056, -3463478, 1610204, 3885662, -1839996, -508637, -5984476, 4900040, -1921207, 2876222, 1194692, -231597, 1593685, 823968, -1674892, 1585441, -4235824, 259174, -389715, 2338817, -2649006, 5125487, -2875350]
965a018240l841854D549263b222334N13901H85019j45035i16369k749790B50604
955C422540J206148h791701c349804b80251B379156q75473e171007A568555b224625
945e56923j778891B151113a834868p10592c45313n68975C260062n58981g86118
935C77273i02170a09841m33450B11024c810641f26030C274449a663618F871600
925B42869J902038d4069k83575j534474B930468M85694a796324N0271B492985
915E62407c036469i00377l352896h85305I17383n8207e54782a4106A861154c515715
904b802272J288486A178075K216162e768785f28626l825788d40101A699735C24598
894E85112K692260B59615f310022a443947D748351e113224G98925a900833D647244
$$ y = [-1018240, -4860094, 4549263, -2222334, -1708433, 885019, 739984, -916369, -3666159, 250604, 3422540, 4628688, -8791701, -3349804, -280251, 2379156, 1503683, -5171007, 1568555, -2224625, -556923, -2335814, 2151113, -1834868, -2545460, -345313, -914288, 3260062, 2701081, -786118, 377273, -902170, -109841, -543291, 211024, -3810641, -626030, 3274449, -1663618, 6871600, 242869, 2144907, -44069, -327644, -1862118, 2930468, 3416162, -1796324, -1746053, 2492985, 562407, -3036469, -900377, -4253273, -885305, 917383, 859176, -554782, -14106, 1861154, -3515715, -2802272, -1513786, 1178075, 3394237, -5768785, -628626, -4454414, -440101, 1699735, 324598, 585112, 3277372, 259615, -6310022, -1443947, 4748351, -5113224, 798925, -1900833, 4647244]
884e39291B764520l30049e4207m033868r3786a050818B892581i91172M53328A816486
873D269374b889445H19112e373807A072807C01900J533659d843340D83207K081729
864B564936a449312N4229A785061b978254A305179K978032F14927M68367K529122
855C612416c130859B881616A23619J455512a144638L25165c92802j147485C572050
845e23554B986688g00422C39068L06080d027301a912490C167423e426226B278260
835G39635g33756B034108a684105H01597J919059b135284l950068a953014o33370
826b586384K46280j044800F394208c632469I27278a227381E574390b528061O48527
817a879534E023967g729637C138742a025007C10931J877321a528900A954114h25146
$$ y = [-539291, 2764520, 2434471, -54207, -4088075, -4181861, -1050818, 2892581, -991172, -537844, 1816486, 4269374, -2889445, 819112, -5373807, 1072807, 301900, 1835559, -4843340, 483207, 2564936, -1449312, -1395083, 1785061, -2978254, 1305179, 4283211, 614927, 1083294, 3612416, -3130859, 2881616, 123619, 1579131, -1144638, -819473, -392802, -1540287, 3572050, -523554, 2986688, -700422, 339068, 645148, -4027301, -1912490, 3167423, -5426226, 2278260, 739635, -733756, 2034108, -1684105, 801597, 2720656, -2135284, -6085352, -1953014, -2586384, -2340104, -3384904, 6394208, -3632469, 927278, -1227381, 5574390, -2528061, -1879534, 5023967, -7729637, 3138742, -1025007, 310931, 2188252, -1528900, 1954114, -825146]
807D57987J401484L40342b787323a106038b48635j430314A204278m46917a075792
797F170980h697028B290808H20938J121239n49519j95244L061099j486825a541746
787C687512b152378f51354B408615a839333j907682B39258L722629f637708B337639
777E058967d972535A061387c170091k701716A155576K819138I83800c71155G00294
767A907325b074968B52119J52141d303330a930169A650268G4041Q62610k93335
758F43316b052798k52831l69921B388701A052685O47284b628390A264415m63012
749H01403b819632J233230C46459J761294H60174c375447R52606A68873J804577
740A973450d85647j910319D606539b789171B378183h00995A160269d65079p03001
$$ y = [457987, 1859471, 2199813, -2787323, -1106038, -248635, -1678949, 1204278, 757361, -1075792, 6170980, -8697028, 2290808, 820938, 1942177, 1392658, 1197414, 4258513, 2771688, -1541746, 3687512, -2152378, -651354, 2408615, -1839333, -3747015, 239258, 3961887, -6637708, 2337639, 5058967, -4972535, 1061387, -3170091, -5871807, 1155576, 3974714, 983800, -371155, 700294, 1907325, -2074968, 252119, 404260, -4303330, -1930169, 1650268, 74041, 936651, 643316, -2052798, -2305629, -2675550, 2388701, 1052685, 1699969, -2628390, 1264415, 801403, -2819632, -1586402, 346459, 2107753, 860174, -3375447, -2422841, 168873, 1973450, -485647, -2395966, 4606539, -2789171, 2378183, -800995, 1160269, -465079, -1168080]
731a168080A173061h15000j320451B668221a33798B368924a466079f95836E45855
721A569330P95643C52032J252494b260518D590035A110238L094914i506208j0707061
712b0213269i949947p871291f415025A8182611J5450067I819145M247271l015642
704A1050774b554833n889165k9811364J5934149j2560284m445717A5516072K2192710
696C7708782q968383l270179l4145a7856905c903254l485688g85968A921744a341945
686a355062C086828b598270k880652B26059L197633O10452F81629b873512R81061
677a892451C245978a063017m8627E704835K0195732A0278306i549228j3595431
669b3144659j5513649h786279j5552055J377493D306610K773690L5197197j3931413
$$ y = [-1168080, 1173061, -815000, -2135451, 2668221, -133798, 2368924, -1466079, -695836, 545855, 1569330, 2364973, 352032, 1604526, -2260518, 4590035, 1110238, 4205152, -9506208, -20213269, -9949947, -17821238, -6415025, 18182611, 33632678, 9819145, 14066416, 11050774, -2554833, -8443998, -38255362, -22321213, -34881497, -39327214, 15516072, 37708782, 28740399, 25470220, 25436075, -17856905, -3903254, -7388942, -785968, 1921744, -1341945, -1355062, 3086828, -2598270, -5478922, 226059, 3423692, 4034144, 681629, -2873512, -1892451, 3245978, -1063017, -1111644, 5704835, 25900567, 10278306, -9549228, -23144659, -38658308, -8786279, -24338334, -22960841, 4306610, 7080300, 42277497, 28346084]
661B8346084H965289e019755J059164j0261035B349967a4466364q555193J0293357
653a2728200A006630J5706183G154878g40717C815266A287649c153083B683381
644D791612f32437A89245O401500a475283B92313i04391j356511c2194D269842
634F165951f982666f46005A071632l35817b388393h44136F57483K773582a295334
624A330153J74488K319609J2639865J9651572M1500386N2815624c74451151J72646953
616b01804198Q0673594B65622232B9911592p812641D492247M003834l153920j028703
608D313458j009901q66314l15976J347264G652O31256N256025c11739A674975
598a363778j715594m93366C460823j337411F94327d739076C285094c253757b06247
$$ y = [28346084, 8965289, -5019755, -3960591, -14221626, 2349967, -14466364, -23021557, -12728200, 1006630, 16712813, 7154878, -740717, 3815266, 1287649, -3153083, 2683381, 4791612, -632437, 189245, 6590745, -1475283, 292313, -904391, -2260902, -32194, 4269842, 6165951, -6982666, -646005, 1071632, 735815, -2388393, -844136, 657483, 3431065, -1295334, 1330153, 1504641, 3824250, 16464115, 36115687, 77616073, 130431697, -374451151, -201804198, -121130604, 265622232, 29911592, 22098951, 4492247, 8496081, 5342161, 4313458, 3303557, 2437243, 2121267, 3468531, 7652, 638908, 5894933, -311739, 1674975, -1363778, -3079372, -3572738, 3460823, 2123412, 694327, -4739076, 3285094, -3253757, -206247]
588a697192B656178e036578E832560c1120A98983J166913J295538a846075F06276
578B094159K747307a798386B420783C17214Q612021e15810k917835F088609e335452
568A202004D67115a631973B716445c042429A209599l51276O92042d495369B546994
558C233459E95575j75397J800207i06644b40011A424364f188874C412950b511749
548C05674J744843g59792K81053i7533m248223L69391C278922a066068A769459
538f03607G40035b001500F850970a722191d76779l371917C004365c858452C337622
528I52730b802115E693698c723525B554463b71789q58092B459067O927627b397615
518a980526B769979e27783B478443b531685a071432n8693D476947d577207G074061
$$ y = [-1697192, 2656178, -5036578, 5832560, -31120, 198983, 1365896, 2661434, -1846075, 606276, 2094159, 4841466, -1798386, 2420783, 317214, 8929235, -515810, -3433645, 6088609, -5335452, 1202004, 467115, -1631973, 2716445, -3042429, 1209599, 858323, 1550365, -4495369, 2546994, 3233459, 595575, 420178, 2220385, -906644, -240011, 1424364, -6188874, 3412950, -2511749, 305674, 2050517, -759792, -478739, -97533, -4345756, -3976365, 3278922, -1066068, 1769459, -603607, 740035, -2001500, 6850970, -1722191, -476779, -3848696, 3004365, -3858452, 3337622, 952730, -2802115, 5693698, -3723525, 2554463, -271789, -1129881, 2459067, 9386694, -2397615, -1980526, 2769979, -527783, 2478443, -2531685, -1071432, -1130125, 4476947, -4577207, 7074061]
508d305862B193712a688543A889197e18973E548625B126044c847795C303546b683599
498E225025d785479A812572L418158Q67267f403939B708527A318835N895724b384339
488a910770m544814D307383A752725g24951k983762B295254J89744b611522J275758
479a335764A718647b047908e42918F39587a746458E163325d393221A120050j33872
470I86178b295961B868500I7039i03458l36227m954445B636412b473295B72941
460e05536C965590b950960D780527A275763e505310C63135L622782j409793O43166
451C219290c161700J474118P69957n79087B392196f65510m45266p03093A039276
441E480534e271493a495947l068827a08598q68210C894248b584385C023522c000867
$$ y = [-4305862, 2193712, -1688543, 1889197, -518973, 5548625, 2126044, -3847795, 3303546, -2683599, 5225025, -4785479, 1812572, 5230730, 6097997, -6403939, 2708527, 1318835, 7214559, -2384339, -1910770, -6455584, 4307383, 1752725, -724951, -3708713, 2295254, 2484998, -2611522, -1335764, 1718647, -2047908, -542918, 639587, -1746458, 5163325, -4393221, 1120050, 986178, -2295961, 2868500, 97039, -903458, -1239685, -6194130, 2636412, -2473295, 272941, -505536, 3965590, -2950960, 4780527, 1275763, -5505310, 363135, 3985917, 2576124, 3219290, -3161700, -1687582, -917625, -1496712, 2392196, -665510, -1110776, -1813869, 1039276, 5480534, -5271493, -1495947, -4564774, -108598, -976808, 3894248, -2584385, 3023522, -3000867]
431a200653C42751b093548C816740a164303G32300g31398j298859B913965c992404
421A767981a395499J84904h0022l584381A788422d717029F549074A397709b341025
411a459414A845676N94339c435085n90275K5518D706838A758301k74282b696434
401A946030e772649C361632B80712f030066K84202A929249J053817a810758F38990
391a265014m674159C779233F31232g35665j880937D0838J783045a933130I49672
381d368874E427539b144979j653105G636893A48280b252207A807455a066877m0883
372a107760j872511A78638J823341i57620a13713D93630e81987q82206O19698
363h44495C911329d039268E212121b21649k308837E13181Q99683K336021b219694
$$ y = [-1200653, 342751, -2093548, 3816740, -1164303, 732300, -731398, -2030257, 2913965, -3992404, 1767981, -1395499, -1210595, -80022, -3664403, 1788422, -4717029, 6549074, 1397709, -2341025, -1459414, 1845676, 2440015, -3435085, -4025360, -3999842, 4706838, 1758301, 1484019, -2696434, 1946030, -5772649, 3361632, 280712, -6030066, -5745864, 1929249, 2983066, -1810758, 638990, -1265014, -5939173, 3779233, 631232, -735665, -2616602, 40838, 1823883, -1933130, 949672, -4368874, 5427539, -2144979, -3798084, 7636893, 148280, -2252207, 1807455, -1066877, -1107760, -2980271, 178638, 2001979, -957620, -113713, 493630, -581987, -1464193, -844495, 3911329, -4039268, 5212121, -221649, -2530486, 513181, 1412864, 3748885, -2219694]
353E85381f33300P5497l80381o40152j638084c01762B441548c403718C515286
343b448049C90075d449372D868665a680891g79985B543284d922478o62145b475393
333A261635j37307j05785c377965I07239M695797b429020b36697A430046J503102
324B933148n00860e627966C13862a4935H64294M15146b247236C740588h76971
314D691265b091490o2971C140155e439885A613318a422135O91039k786569E750515
304b707172M25153C221791c223258C370900j90214b515936e75488B270708I54056
294E67368L81655L8886O85694p62660R27539q14747c68307m15019k932624C919733
283E95044A76838q8153J051294J486070e183850B608375j096215d96487B293172
$$ y = [585381, -633300, -557803, -938184, -1578336, -3216420, -301762, 2441548, -3403718, 3515286, -2448049, 390075, -4449372, 4868665, -1680891, -779985, 2543284, -4922478, -5584623, -2475393, 1261635, 1124328, 1018543, -3377965, 907239, 5603036, -2429020, -236697, 1430046, 2933148, 2432288, -5627966, 313862, -14935, 864294, 1279440, -2247236, 3740588, -876971, 4691265, -2091490, -2154461, 3140155, -5439885, 1613318, -1422135, -731096, -3517665, 5750515, -2707172, -2282019, 3221791, -3223258, 3370900, 3180686, -2515936, -575488, 2270708, 954056, 567368, 949023, 987909, 1673603, 910943, 1838482, 1023735, -368307, -783326, -3715950, 3919733, 595044, 176838, 88685, 1139979, 2626049, -5183850, 2608375, 1512160, -496487, 2293172]
273b988031e75080j051359A256500k48726f92769a88596C802703b340029q58696
264c198725P16807B992711a336439A855628c327137a096358k75082l673362G87928
254A819477c141305D63216g21305H20029J218475c76287A277299b772479j053385
245c825864d02536m081021P66407J319803B855375a15590j118192a13275A449023
235a104961D41180a589258f1438j910670j714494A054500f67252A124075J156722
226B280797n97019O71344b603966A411873C8658O56600a20940j222671D773524
216b342638E0635a181385F627210A740092k38961a34392p15809A576025A16403
206A418365g11955k412113c98165l602993B753516a256397H214752A823431a256362
$$ y = [-2988031, -575080, -1626439, 1256500, 1007774, -692769, -188596, 3802703, -2340029, -3198725, -2481918, 2992711, -1336439, 1855628, -3327137, -1096358, -1371440, -5044802, 787928, 1819477, -3141305, 463216, -721305, 820029, 2038504, -376287, 1277299, -2772479, -3825864, -402536, -4483557, -3717150, -2397347, 2855375, -115590, -1233782, -113275, 1449023, -1104961, 441180, -1589258, -61438, -1972108, -3686602, 1054500, -667252, 1124075, 2280797, 1683778, 2355122, -2603966, 1411873, 38658, 695258, -120940, -1343611, 4773524, -2342638, 50635, -1181385, 6627210, 1740092, 1501131, -134392, -850201, 1576025, 116403, 1418365, -711955, -3124068, -398165, -4001158, 2753516, -1256397, 8214752, 1823431, -1256362]
196A771528m69875c217536J509454C379366H29631d131205A527387j7855c444138
186f2509976j44763936B2725959N380175J65846182H1565159J33126384h978879
178b2401304j68340403e0075610F014062G08989a836048B988895f487736C977806
169d817605a790708B610321J678346G25069J705605j199812b560368P10230A397674
159D93612J102258a103529J67129j001268j35942D081998g14333p82981f93463
149g020094B202889J421715h51739C173223b11997E30304N5676f790916D98467
139C291444A042059f23917r95327I59517d297027b067775G74925L95885c087713
129D02447a317559A156228c98152k777160b36749k953197B776616a596118C006973
$$ y = [1771528, 1301653, -3217536, -1708082, 3379366, 829631, -4131205, 1527387, 1509532, -3444138, -62509976, -207273912, 22725959, 28106134, 193952316, 81565159, 214691543, -8978879, -22401304, -190741707, -50075610, 6014062, 708989, -1836048, 2988895, -6487736, 3977806, -4817605, -1790708, 2610321, 4288667, 725069, 2430674, 1230862, -2560368, -1850138, 1397674, 493612, 1595870, -1103529, -936400, -1937668, -2073610, 4081998, -714333, -1497314, -693463, -7020094, 2202889, 3624604, -851739, 3173223, -211997, 530304, 585980, -6790916, 498467, 3291444, 1042059, -623917, -1619244, 959517, -4297027, -2067775, 774925, 1170810, -3087713, 402447, -1317559, 1156228, -398152, -3175312, -236749, -3189946, 2776616, -1596118, 3006973]
119a434454A240378e664450k987461A560329L869200C45719R41855K609987h72624
109D30339h56591A55951b892344A081498J099107b427739A003311b773368i7231
99D581249c627611J252248C26517J653439B21144Q02006a0342073a808130j12219
90a920349m28208D513076j107990B74454J954351c03724m73577E00722b052286
80e58585C391000A247332l38184j26794N90178J226947J060253a858218A653852
70b374473B416325c533960A626076a341483k489205C265285A058986l62699d041763
60e8204A121536b325876l59248C223584a770589F994935l308141H48799K253380
51C102179f509627A441558f23222k327982A007062c312135B969346b61744C894822
$$ y = [-1434454, 1240378, -5664450, -8651911, 1560329, 5429529, 345719, 1287574, 3897561, -872624, 430339, -856591, 155951, -2892344, 1081498, 2180605, -2427739, 1003311, -2773368, -97231, 4581249, -3627611, -2375363, 326517, 1979956, 221144, 1023150, -10342073, -1808130, -1920349, -2348557, 4513076, 3405086, 274454, 2228805, -303724, -777301, 500722, -2052286, -558585, 3391000, 1247332, 909148, 782354, 1372532, 2599479, 3659732, -1858218, 1653852, -2374473, 2416325, -3533960, 1626076, -1341483, -3830688, 3265285, 1058986, 696287, -4041763, -58204, 1121536, -2325876, -2685124, 3223584, -1770589, 6994935, 3686794, 848799, 3102179, -6509627, 1441558, -623222, -2951204, 1007062, -3312135, 2969346, -261744, 3894822]
41b330176A848064a532030C596907q19945f901101a565212K50347n51950B085173
31c116658G327668f326556a315580A591656d83345j640261A96916a127455D373981
21c218954B852264c79013B062167d216429A318154a817732A828785b060221b07587
11e56368j491499B463464g22846G54049C27321C6653a85422E94950M52748a096444
0a531471
$$ y = [-2330176, 1848064, -1532030, 3596907, 2776962, -6901101, -1565212, -1314865, -1866815, 2085173, -3116658, 7327668, -6326556, -1315580, 1591656, -483345, -2123606, 196916, -1127455, 4373981, -3218954, 2852264, -379013, 2062167, -4216429, 1318154, -1817732, 1828785, -2060221, -207587, -556368, -2047867, 2463464, -722846, 754049, 327321, 36653, -185422, 594950, 1047698, -1096444, -1531471]
##PAGE= F1=5684.175139418
##FIRST=     21204.543296753, 2672.49122660428, -1940573
##DATA TABLE= (F2++(Y..Y)), PROFILE
2047a940573I67651e22895A800768g51283K16349B055155a778211F47271J547086
2038B194357d037982A959570a644885h05759o21179A43798P094320e883921a05060
2028A526507c959817O66596E008218a649028C277593A6065b501982M47949D522983
2018A41181d837623D667977e403125B428428b096832N40758F3079L620728b674910
2008B057738b069590d04777l635467H55780R37856F24662J882333A177937b93479
1998B772942o90693d81862B512379d77023F59826J591850f57114j779843C989374
1988a768161B103298c28301j233868l520296E774186d370056J131260F255266
1979a988503P55452B123947K452952i92689l211810a469151q58980C46101L304982
$$ y = [-1940573, 967651, -522895, 1800768, -751283, -534934, 2055155, -1778211, 647271, 2194357, -4037982, 1959570, -1644885, -805759, -1426938, 143798, 7238118, -5883921, -105060, 1526507, -3959817, -3293221, 5008218, -1649028, 3277593, 16065, -2501982, -2054033, 4522983, 141181, -4837623, 4667977, -5403125, 2428428, -2096832, -1556074, 63079, 3683807, -2674910, 2057738, -2069590, -404777, -4040244, 855780, 1793636, 624662, 2506995, 1177937, -293479, 2772942, 2082249, -481862, 2512379, -477023, 659826, 2251676, -657114, -2436957, 3989374, -1768161, 2103298, -328301, -1562169, -5082465, 5774186, -4370056, -3238796, 6255266, -1988503, -1233051, 2123947, 4576899, -992689, -4204499, -1469151, -2328131, 346101, 3651083]
1970C651083c015744i74831A821281h13848k306194C292727a911873A68181K075743
1961B243924k37542P76902a997915E51926f61682j459321A437020N334422c267252
1951c571870B135613a669649B792545c960766A336591a897725k255452a46009
1942C563739b494426G746522G89806a268094D207302e189392D814154b508105
1933A699580a203313B487840c642885D304939n25365E60148c172820E887019A056585
1923A390009b120362C240811I0078b345961a31462k111859B232358J334498g55745
1913C526390a845067B416021b026782D25864b867313d25075D334078d66310L700
1904d62610k535352B589229i59435C51874O52102J546768d296259E992125B84962
$$ y = [3651083, -3015744, -974831, 1821281, -813848, -3120042, 3292727, -1911873, 168181, 2243924, 2006382, 2783284, -1997915, 551926, -661682, -2121003, 1437020, 6771442, -3267252, -3571870, 2135613, -1669649, 2792545, -3960766, 1336591, -1897725, -4153177, -146009, 3563739, -2494426, 7746522, 789806, -1268094, 4207302, -5189392, 4814154, -2508105, 1699580, -1203313, 2487840, -3642885, 4304939, 3779574, 560148, -3172820, 5887019, 1056585, 1390009, -2120362, 3240811, 90078, -2345961, -131462, -2243321, 2232358, 3566856, -755745, 3526390, -1845067, 2416021, -2026782, 425864, -2867313, -425075, 4334078, -466310, -462610, -2997962, 2589229, -959435, 351874, 1003976, 2550744, -4296259, 5992125, 284962]
1894A631116o86168L215483a502865D61624K935054b267867d54480A553817G64126
1884B2089Q19424R87613D51973J512223o2753b223095A937219b244292n50840
1875b795132B100163b652094J115570f15142A047039N78227J894066q11145e614337
1865D876050C36825K208626e950160C713529c759164J555410B356792a511293
1856A354326J205631A0422L986206C94459J538267a930784C475657c643817J405792
1847b238025j694272H66808M35378A32898f74898D630669a027458j22775k625829
1838c776062B835792b25122G29518K40193k24738c291754A067898C28171K613123
1829B941294f36473b20403G205095E42622A16385c311015C256327a282075j266779
$$ y = [1631116, 944948, 4160431, -1502865, 461624, 3396678, -2267867, -454480, 1553817, 764126, 22089, 841513, 1829126, 451973, 1964196, 1901443, -2223095, 1937219, -2244292, -2795132, 2100163, -2652094, -1536524, -615142, 1047039, 1625266, 3519332, 2708187, -5614337, 4876050, 336825, 2545451, -5950160, 3713529, -3759164, -2203754, 2356792, -1511293, 1354326, 2559957, 10422, 3996628, 394459, 1932726, -1930784, 3475657, -3643817, -2238025, -3932297, 866808, 1302186, 132898, -674898, 4630669, -1027458, -1150233, -3776062, 2835792, -225122, 729518, 969711, 744973, -3291754, 1067898, 328171, 2941294, -636473, -220403, 7205095, 542622, 116385, -3311015, 3256327, -1282075, -2548854]
1820b548854A444074A62435J103753c675471C096739d130492E45344e020682J469950
1811c550732i27054B746458J108137c294199E06064J240309G74146d972165F965272
1801a825238m191874A594415a062582e18712I3574K662174a829878A099029f72845
1791g83297D639783B179263D78179A2141L372848O03707c599411A685743E27245
1781b918763F149929a978850h58869n072704G98513a211376j234495C781594A278277
1771d2180k121067J24873G79882c558458C229625A564831b708930J023717l66180
1762b051393a90683D7754d07504C2904b850290A476579c113057k490807C809801
1752c556646a372883E79135J428609g87062A195739f063230F27237M09163b702848
$$ y = [-2548854, 1444074, 162435, 1266188, -3675471, 3096739, -4130492, 545344, -5020682, -3550732, -927054, 2746458, 3854595, -3294199, 506064, 1746373, 774146, -4972165, 6965272, -1825238, -6017112, 1594415, -1062582, -518712, 93574, 2755748, -1829878, 1099029, -672845, -783297, 4639783, 2179263, 478179, 12141, 3384989, 3988696, -3599411, 1685743, 527245, -2918763, 6149929, -1978850, -858869, -5931573, 798513, -1211376, -2445871, 3781594, 1278277, -42180, -2163247, -2038374, 779882, -3558458, 3229625, 1564831, -2708930, -1685213, -2051393, -190683, 47754, -407504, 32904, -2850290, 1476579, -3113057, -5603864, 3809801, -3556646, -1372883, 579135, 2007744, -787062, 1195739, -6063230, 627237, 1036400, -2702848]
1742B340793p95374c838221D573973f96060j328600G39368b114131G89118f915246
1732B774936c138005B970641e43734A795842b236153C177294j328300n76227b767769
1722a778144B348833i00335j007992A123952c88318j43437B71485d284660A697703
1712f57861F99448O07268m29541a582120b85022k693637b31154B492821c700991
1702a487447C67338a740162A755812c01293C487189i13472i0749C157651i15175
1692F45257o227J210898c890860A013252j65691M865497d621592b86698B613196
1682A433559d663723F125240a783133i090E372904a20027n001449B235846d23636
1672G57621d962561B840733D45487a989416l60468H38635a613234D370266j722163
$$ y = [2340793, 1545419, -3838221, 4573973, -696060, -2024660, 739368, -2114131, 789118, -6915246, 2774936, -3138005, 2970641, -543734, 1795842, -2236153, 3177294, 1848994, 1272767, -2767769, -1778144, 2348833, -900335, -1908327, 1123952, -388318, -531755, 271485, -4284660, 1697703, -657861, 699448, 1306716, 877175, -1582120, -285022, -2978659, -231154, 2492821, -3700991, -1487447, 367338, -1740162, 1755812, -301293, 3487189, -913472, -90749, 3157651, -915175, 645257, 639030, 1849928, -3890860, 1013252, 847561, 5713058, -4621592, -286698, 2613196, 1433559, -4663723, 6125240, -1783133, -9090, 5372904, -120027, -5121476, 2235846, -423636, 757621, -4962561, 2840733, 445487, -1989416, -2349884, 838635, -1613234, 4370266, 2648103]
1663B648103c618507B165275C23868P85873a873924A688707b909008c53782A61327
1653a312833M24274A066201J816124D94873b9360B613550a128073M42957D021122
1643C309117b15883C870429I53822c515929a001031A76123O2755f212339C080333
1633a181772j081869C252450b62739B954054d012384A77834J143139A18286R73371
1624A091657a026886F85870c228938A537862E5456a151798j9695d26934l46774
1615g73708B935811a192044k556466J653668H034371h2252A64396a578355B274489
1605D83514k05908L13684a18937k132457D04731A8128a678195A637714b182663
1595D680231a3929j840802f23522H87738c748819M75447A93236J153128i57023
$$ y = [2648103, -3618507, 2165275, 323868, 1109741, -1873924, 1688707, -2909008, -353782, 161327, -1312833, -888559, 1066201, 2882325, 494873, -29360, 2613550, -1128073, -685116, 4021122, 3309117, -215883, 3870429, 953822, -3515929, -1001031, 176123, 238878, -6212339, 3080333, -1181772, -2263641, 3252450, -262739, 2954054, -4012384, 177834, 1320973, 118286, 1091657, -1026886, 685870, -3228938, 1537862, 55456, -1151798, -1171493, -426934, -773708, 2935811, -1192044, -3748510, -2094842, 8034371, -82252, 164396, -1578355, 2274489, 483514, 277606, 591290, -118937, -2251394, 404731, 18128, -1678195, 1637714, -2182663, 4680231, -13929, -1854731, -623522, 887738, -3748819, -3273372, 193236, 1346364, -957023]
1585H24092P95175J66382D45043f8909F31698i69207G45144c188251c60200k157114
1575b517314B235594k90280k58600K8148b261564B515429A212592J268372h62935
1565e974912B060597e4505A241068a17350A789631c62705B066850a336212B519909
1555B001121D97208K421714j224857d356065f22009H7297J176622b753221d58962
1545B762127G07942a906612A407189c076668A840135h00852F674406a552408B474476
1535E29397d62177A387486a778253M84600H83886J734710a3748l575743b69952
1525A027911b85496E865804c683671E034299a772012N68142H20008M077012A028227
1515D115370c145058B433384b358420I04974d276493B978300f52736L18823C748261
$$ y = [824092, 1619267, 1785649, 445043, -68909, 631698, -969207, 745144, -3188251, -360200, -2517314, 2235594, 1945314, 1686714, 1714862, -2261564, 2515429, 1212592, 2480964, -862935, -5974912, 2060597, -54505, 1241068, -117350, 1789631, -362705, 2066850, -1336212, 2519909, 2001121, 497208, 2918922, 1694065, -4356065, -622009, 87297, 1263919, -2753221, -458962, 2762127, 707942, -1906612, 1407189, -3076668, 1840135, -800852, 6674406, -1552408, 2474476, 529397, -462177, 1387486, -1778253, -1293653, 883886, 2618596, -13748, -3589491, -269952, 1027911, -285496, 5865804, -3683671, 5034299, -1772012, -1203870, 820008, 4897020, 1028227, 4115370, -3145058, 2433384, -2358420, 904974, -4276493, 2978300, -652736, -333913, 3748261]
1505b458411A708657a71656r01387l365997C252107D43927i96220C738173C38814
1495d308093B668966b383077D9418f06729F96358a391877N78901j053653A544941
1485b007469B656869R81475A534530C13556R80967j00267e370542A807039d37970
1475a775401l309j962512D28837R90038K41965b811156a073855K80483j216710
1466b010082O77404j399525G237234e424795D3596c924894I02436b27543l09985
1457e37528n046357D350728j357767d708483B209479e687330H31355P72966a850379
1447i0157B611278a756560j13940a32229n43655E155567d505025D900133a286442
1437a020209C19042J307881c844116f29820n95531A590610n39572f382823A694330
$$ y = [-2458411, 1708657, -171656, -1073043, -4439040, 3252107, 443927, -996220, 3738173, 338814, -4308093, 2668966, -2383077, 49418, -606729, 696358, -1391877, -812976, -1866629, 1544941, -2007469, 2656869, 3638344, 1534530, 313556, 1294523, 1194256, -5370542, 1807039, -437970, -1775401, -1778710, -3741222, 428837, 1418875, 1660840, -2811156, -1073855, -793372, -2010082, -1332678, -2732203, 7237234, -5424795, 43596, -3924894, 902436, -227543, -537528, -5583885, 4350728, 2992961, -4708483, 2209479, -5687330, 831355, 1604321, -1850379, -90157, 2611278, -1756560, -1870500, -132229, -675884, 5155567, -4505025, 4900133, -1286442, -1020209, 319042, 1626923, -3844116, -629820, -1225351, 1590610, 1051038, -6382823, 1694330]
1427a421481N0606j595832C62756K004873c170371C553576A461693m32902J440853
1418B469644j93475d479897A317164c405732H452091A351727b258530c9654k741056
1409b780710C223335A158760a01560o8986A807338g66102C027553a849737A0157662
1399a24459j15970o858665D261945j741012B56953e176519A874078q2281o12649
1390A179148d804831E671914B105190g08509A479678e987135b200587O02965A687322
1380b328562e15612j26978B313712m51699C12754b36539l377209A516417K259471
1371C775888F69260g86678m80921e59943H28471d413915B926544b92264B668827
1361B633769b299355P76510F34767g62479a29351C545782a532015F20988c289826
$$ y = [-1421481, -1370875, -2966707, 362756, 2367629, -3170371, 3553576, 1461693, 1028791, 2469644, 2276169, -4479897, 1317164, -3405732, 8452091, 1351727, -2258530, -39654, -2780710, 3223335, 1158760, -101560, -170546, 1807338, -766102, 3027553, -1849737, 10157662, -124459, -240429, -7099094, 4261945, 2520933, 256953, -5176519, 1874078, 1791797, 1179148, -4804831, 5671914, 2105190, -708509, 1479678, -5987135, -2200587, -1597622, 1687322, -2328562, -515612, -642590, 2313712, 1862013, 312754, -236539, -3613748, 1516417, 3775888, 669260, -786678, -1267599, -559943, 828471, -4413915, 2926544, -292264, 2668827, 2633769, -2299355, -1522845, 634767, -762479, -129351, 3545782, -1532015, 620988, -3289826]
1351f42714k006301f36217b98298E192579m95208b264313J028803C75896j41288
1342B34608K88578K986513o069C69476d520702a444756A634694J578491a578230
1332b880726a098891j455147C987163a739990l738027a040945o5140B307106L551034
1323E858140a2397397E44846c57666B199454i15830a91921C031053A66577R60860
1314A127437a160762j434086e6702A550496c466542g91027K54141F16997K478322
1305C095319e044301F67507c08216n330434C573531c98801E504157A180338J977850
1296C158188j483315d329832A355524F18692f22757a68056A502468B69008b179240
1286a854414a56217j031088A068843L331724e653375i50731B713181h72367j906286
$$ y = [-642714, -2649015, -636217, -298298, 5192579, 4697371, -2264313, -1235510, 375896, 234608, 523186, 3509699, 3503630, 369476, -4520702, -1444756, 1634694, 3213185, -1578230, -2880726, -1098891, -2554038, 3987163, -1739990, -5478017, -1040945, -1106085, 2307106, 5858140, -12397397, 544846, -357666, 2199454, -915830, -191921, 3031053, 166577, 1127437, -1160762, -2594848, -56702, 1550496, -3466542, -791027, -536886, 616997, 3095319, -5044301, 667507, -308216, -5638650, 3573531, -398801, 5504157, 1180338, 3158188, 1674873, -4329832, 1355524, 618692, -622757, -168056, 1502468, 269008, -2179240, -1854414, -156217, -1187305, 1068843, 4400567, -5653375, -950731, 2713181, -872367, -2778653]
1277b778653I84968a756148j298532J352196h22309B943875A683f79339B476362
1267e271880a733306A135802j57101h21245F648613a263829J16888k367600B905723
1257a73642r08522I27484a225681D045452A078796b028293A634121L85200n04311
1248A515010A83322M62329J100117d56749E1258d016459E064456h72237j511962
1239b384199J142897C15690c145239i50437I26918a697045m192130B83942R2168
1230C76110n3009Q07072f12292D328418c362434g55222C69581A73359J479948
1221A653307Q15664g612467B493860d17363A792586H07603K98206K719154c05026
1211d679039I08633J479292l60850d182758A662403N9228c605361M84337B634266
$$ y = [-2778653, 984968, -1756148, -3054680, -1702484, -822309, 2943875, 1683, -679339, 2476362, -5271880, -1733306, 1135802, 978701, -821245, 6648613, -1263829, -1146941, -3514541, 2905723, -173642, -1082164, 927484, -1225681, 4045452, 1078796, -2028293, 1634121, 2019321, 1515010, 183322, 645651, 1745768, -456749, 51258, -4016459, 5064456, -872237, -2384199, -1241302, 315690, -3145239, -950437, 926918, -1697045, -5889175, 283942, 376110, 323101, 1130173, -612292, 4328418, -3362434, -755222, 369581, 173359, 1653307, 2468971, -7612467, 2493860, -417363, 1792586, 807603, 1105809, 3824963, -305026, -4679039, 908633, 2387925, 2027075, -4182758, 1662403, 1721631, -3605361, -3121024, 2634266]
1201c918079k0425A615412C84102N09472c117688a386309C316454k18600b888576
1191a939288f0047m963039F954019g45942F40217a98865m07514k74595A325704
1181b141356D984820B111358b665960G28145J33521P39771b319597O6299E076537
1171c639011h52054a23545B87440L79800a849207I57087L461808d520041D96229
1161a834688A112964h59903A220292e41946m05497B938934N0294b93512I12976
1151A157310J495088g07079b04448j122067L70840b81639j598873M90587G15156
1141B425245p46270b97312j67388j488579B8441a386694C257924J72703c441625
1131b689181A035577f92132K73422j83641B713308a951326P02672E295634f62521
$$ y = [-3918079, -3938504, 1615412, 384102, 893574, -3117688, -1386309, 3316454, 3097854, -2888576, -1939288, -60047, -5023086, 6954019, -745942, 640217, -198865, -606379, -880974, 1325704, -2141356, 4984820, 2111358, -2665960, 728145, 861666, 1601437, -2319597, -2253298, 5076537, -3639011, -852054, -123545, 287440, 667240, -1849207, 957087, 4418895, -4520041, 496229, -1834688, 1112964, -859903, 1220292, -541946, -947443, 2938934, 2989228, -293512, 912976, 1157310, 2652398, -707079, -204448, -1326515, -955675, -281639, -1880512, -1389925, 715156, 2425245, 1678975, -297312, -464700, -1953279, 28441, -1386694, 3257924, 3430627, -3441625, -2689181, 1035577, -692132, -418710, -602351, 2713308, -1951326, -1248654, 5295634, -662521]
1121B176654I21316j93451e821360f62408j307504k521862i40905o5256F30789
1111a030169D551587a827651H41440k56957c674557A208974L36144K183803b014240
1101b15372j016979H85427J047534h85126r03985A224718O856460f834360A20413
1091e63919E434747d930607A060524Q65920b308098A814612c093339i8001o75312
1082g73313B823054J73351B75801a364188B095787i42266G12140c750957e33222
1072B122893i10671c90502A044373e88006k366439a279787C95438J192182g3414
1062a790698A869201a755580A988593d414065a899989b74393C561993B02826c572883
1052B027136a011690D67430f248224b214684N2920C783697b330880D853666I03181
$$ y = [2176654, 921316, 727865, -5821360, -662408, -1969912, -4491774, -940905, -1006161, 630789, -1030169, 4551587, -1827651, 841440, 584483, -3674557, 1208974, 1545118, 3728921, -2014240, -215372, -1232351, 885427, 1932961, -885126, -1789111, 1224718, 8081178, -6834360, 120413, -563919, 5434747, -4930607, 1060524, 1926444, -2308098, 1814612, -3093339, -98001, -773313, 2823054, 2996405, 275801, -1364188, 2095787, -942266, 712140, -3750957, -533222, 2122893, -910671, -390502, 1044373, -588006, -2954445, -1279787, 395438, 1587620, -73414, -1790698, 1869201, -1755580, 1988593, -4414065, -1899989, -274393, 3561993, 202826, -3572883, 2027136, -1011690, 467430, -6248224, -2214684, -2161764, 3783697, -2330880, 4853666, 903181]
1042E623237d57242k117595C033961j415717e550031H37416a126095D029501b980425
1032c13819j489652I81850b988818i54429C63908Q99207c62904D84725b580907
1022C28791J755889E91402J710210K668040C48652e881754K055540A028276c068546
1012B175861b705546E79148a340587b82908l224244C452533A576838a725841G03136
1002A568426c29760C938242d051496C712959d082449F028943C82553J63696a252070
992c657143C063432q59459h64068B666942d002218A603203L118182a573383e99730
982g027885F120006a581623B642645p11241f70775A915310r40292b007796B029066
972c981193H29018c93298B609501b658652E135747b581030h95969l595055D024979
$$ y = [5623237, -457242, -2574837, 3033961, 1618244, -5550031, 837416, -1126095, 4029501, -2980425, -313819, -1803471, 981850, -2988818, -954429, 363908, 1263115, -362904, 484725, -2580907, 328791, 2084680, 591402, 2301612, 4969652, 348652, -5881754, -3826214, 1028276, -3068546, 2175861, -2705546, 579148, -1340587, -282908, -3507152, 3452533, 1576838, -1725841, 703136, 1568426, -329760, 3938242, -4051496, 3712959, -4082449, 6028943, 382553, 546249, -1252070, -3657143, 3063432, 2203973, -864068, 2666942, -4002218, 1603203, 4721385, -1573383, -599730, -7027885, 6120006, -1581623, 2642645, 1931404, -670775, 1915310, 975018, -2007796, 2029066, -3981193, 829018, -393298, 2609501, -2658652, 5135747, -2581030, -895969, -4491024, 4024979]
962b106869n1237A753872c53331r98356j970682E17674K427245K038818i735303
952b842354d48215C316038I55839d254239C394130b103276h17573j197360B141691
942a685939j101198D48638a012911B151881J703933f03366D76141a115237E36044
932c69541C36453d132915d78432C351311a854160G475211e48268B757738f89873
922h42200R7362A954168L085458a207633m05789B109863b57483k399727a215182
912c463594g63840F56994J13838b19364o55600B053200c533973P60949a128680
902H89660K783950e223043B5750c782600a582164I82851J57702k46791K076801
893B970563C97714e385712i29731D545653d808605H25116a806557D814530g36528
$$ y = [-2106869, -2158106, 1753872, -353331, -1351687, -3322369, 517674, 2944919, 4983737, -9735303, -2842354, -448215, 3316038, 955839, -4254239, 3394130, -2103276, -817573, -2014933, 2141691, -1685939, -2787137, 448638, -1012911, 2151881, 3855814, -603366, 476141, -1115237, 536044, -369541, 336453, -4132915, -478432, 3351311, -1854160, 7475211, -548268, 2757738, -689873, -842200, -744838, 1954168, 5039626, -1207633, -1613422, 2109863, -257483, -2657210, -1215182, -3463594, -763840, 656994, 770832, -219364, -874964, 2053200, -3533973, -2773024, -1128680, 889660, 3673610, -5223043, 25750, -3782600, -1582164, 982851, 1140553, 893762, 2970563, 397714, -5385712, -929731, 4545653, -4808605, 825116, -1806557, 4814530, -736528]
883B865132l86556D86853c877666L50940J204154D154611a490063g31017A020987
873D293636c650794A267918e412561B050186I76591j02599d428360A026642K774100
864C800742b186471J009496A417087b500529B018329J727776A170531l78313L043493
855C835711a810071B925690B68989K177683i21593b94565J00680j197247C721933
845c48074B794298b15915n6126I56520c921579a792941B826672e065493B491983
835F80389f01805B405977b286008B220283l55496b234810k882447a495517j274614
826b770131J314177k397412F493541b954072A360441a610042E161769b406065
817a758109E595878f621588B863991i55918B82422K419723a439220B325238c377885
$$ y = [2865132, 2478576, 486853, -3877666, -3526726, -2322572, 4154611, -1490063, -731017, 1020987, 4293636, -3650794, 1267918, -5412561, 2050186, 976591, 873992, -4428360, 1026642, 3800742, -2186471, -1176975, 1417087, -2500529, 2018329, 3746105, 1170531, 792218, 3835711, -1810071, 2925690, 268989, 2446672, -921593, -294565, -193885, -1391132, 3721933, -348074, 2794298, -215915, -272041, 956520, -3921579, -1792941, 2826672, -5065493, 2491983, 680389, -601805, 2405977, -2286008, 2220283, 1864787, -2234810, -5117257, -1495517, -2770131, -1455954, -3853366, 6493541, -2954072, 1360441, -1610042, 5161769, -2406065, -1758109, 5595878, -6621588, 2863991, -955918, 282422, 2702145, -1439220, 2325238, -3377885]
807E54416J404955j35107b564420a267439d5901j819778A445530k83218a362034
797F139567h012611B487764H41211K102349j158543D71932L568501o70351f84537
787D205580a685838b22381B053397b366884p95876F78875L458349g756019B294491
777E319001d801034A268791b270411l771072B150134K191613A221000d13284D43360
767A902946a843500E27458b37860k862918O68089B100704H21455C57020J5701
758C72721b188208J94882p59623B829458A348880J89243a711261A476574C29776
748b800164P89575A503862L84733F12432c715894P15024A97724K693510A44311
738b745759E800253b886985B065043g2093H51611a144813R3475A063576d45087
$$ y = [554416, 1959371, 1824264, -2564420, -1267439, -45901, -1865679, 1445530, 1162312, -1362034, 6139567, -8012611, 2487764, 841211, 2943560, 1785017, 471932, 4040433, 3370082, -684537, 4205580, -1685838, -222381, 2053397, -2366884, -3162760, 678875, 4137224, -7756019, 2294491, 5319001, -4801034, 1268791, -2270411, -6041483, 2150134, 4341747, 1221000, -413284, 443360, 1902946, -1843500, 527458, -237860, -3100778, -2432689, 2100704, 821455, 357020, 372721, -2188208, -1993326, -2752949, 2829458, 1348880, 1538123, -1711261, 1476574, 329776, -2800164, -2010589, 1503862, 1888595, 612432, -3715894, -3000870, 197724, 2891234, 144311, -2745759, 5800253, -2886985, 2065043, -72093, 851611, -1144813, -1051338, 1063576, -445087]
728b088193B527493D43162K021888a517823a40270E42520Q12276J794735A15596
718A741388b113160D474723A231857L478548i717353j3619683a0206373q381903
710a8588276f121066B0165452J6039831A1253828M386742m409861a770795o470673
702h241468l1313965J4967776j1748232o325988A7830419K3184461j1784951o49102
694B8580827j963600a7003980d832975k593215h98150C118029a267624e32654
685C281468b260883l210293e65114B818567R88943D36637b883522O97104C734706
675a765930J30703F703161K2457822A0356055h686904j8125135j3693439g360948
666b7603723L805688E232459K095581M0078626j8316133I894522e734269J779694
$$ y = [-2088193, 2527493, 443162, 2465050, -1517823, -140270, 542520, 1354796, 3149531, 115596, 1741388, -2113160, 4474723, 1231857, 4710405, -9717353, -23337036, -10206373, -18588276, -6121066, 20165452, 36205283, 11253828, 15640570, 11230709, -1770795, -8241468, -39555433, -24587657, -36335889, -42661877, 17830419, 41014880, 29229929, 28580827, 26617227, -17003980, -4832975, -7426190, -898150, 3118029, -1267624, -532654, 3281468, -2260883, -5471176, -565114, 2818567, 3807510, 436637, -2883522, -2186418, 3734706, -1765930, -1635227, 6703161, 29160983, 10356055, -8686904, -26812039, -40505478, -7360948, -27603723, -23798035, 5232459, 7328040, 47406666, 29090533, 9894522, -5734269, -3954575]
658c954575j2883089B457065a6359767r399397J2689107A093595J7672786H196033
649h22502D108285A179498d289783C763594J570225d86011E2182P337425b216527
639E4141b92321k172576C71380L316080L488819f199813a038979H76758J36974
630A013732b110821e47382A38991M869927a910075A249332Q41570K524520J3010281
621A7625703K0738497M7528182N2438375d01879454J85039003Q4595089B86083591
613C1266015q610421E161101M962928D533706N66239j983552M7447j261408J590468
604C492900I40716k49208M975654e27448A762439a034228k242762n27106C251113
594B476654H72768d414469B852308c379532b52546j485503B450418e313064F400364
$$ y = [-3954575, -16837664, 2457065, -16359767, -25759164, -13070057, 1093595, 18766381, 8196033, -822502, 4108285, 1179498, -4289783, 3763594, 5333819, -486011, 52182, 7389607, -2216527, 54141, -292321, -2464897, 371380, 3687460, 7176279, -6199813, -1038979, 876758, 1013732, -2110821, -547382, 138991, 5008918, -1910075, 1249332, 2090902, 4615422, 17625703, 38364200, 85892382, 138330757, -401879454, -216840451, -132245362, 286083591, 31266015, 22655594, 5161101, 10124029, 4533706, 5099945, 3116393, 3163840, 1902432, 3492900, 940716, 691508, 5667162, -527448, 1762439, -1034228, -3276990, -3804096, 3251113, 2476654, 872768, -4414469, 2852308, -3379532, -252546, -1738049, 2450418, -5313064, 6400364]
584d43318B96097J117533J577349b215215H73144J063988L138555b027171B188649
574G29876P683715g58161k176942F888091e465517G68873K81888a301358B132499
564c685345A223071m0590j43602d233470B298902J240004B79793c86562B484804
554f84633C29004J185335d595450C045112a936142a04119B300368D68805e81042
544B43620c866838Q4517C819466a191527G43359a054374A012965b757610G769565
534a784985a6462l805846B538899c129697C454501A293841c143181E760200d136436
524C141842b54855j046422B826565O725452b120182o52522B522723f82713B820597
514c121868g71917m28752D609184d767770E383414c567341A684837a165649A654824
$$ y = [-443318, 296097, 1413630, 2990979, -2215215, 873144, 1937132, 5075687, -2027171, 2188649, 729876, 8413591, -758161, -2935103, 6888091, -5465517, 768873, 1050761, -1301358, 2132499, -3685345, 1223071, 1182481, 1038879, -4233470, 2298902, 3538906, 279793, -386562, 2484804, -684633, 329004, 1514339, -4595450, 3045112, -1936142, -104119, 2300368, 468805, -581042, 243620, -3866838, -3782321, 3819466, -1191527, 743359, -1054374, 1012965, -2757610, 7769565, -1784985, -16462, -3822308, 2538899, -3129697, 3454501, 1293841, -3143181, 5760200, -4136436, 3141842, -254855, -1301277, 2826565, 9552017, -2120182, -2772704, 2522723, -682713, 2820597, -3121868, -771917, -1200669, 4609184, -4767770, 5383414, -3567341, 1684837, -1165649, 1654824]
504h17775F008422A848792c351208B883757b623001D627093c703898B004641L695020
495E699661R3519g210312C141881A238324N928182b025859L22926m578659E007874
485G06128c25951l925307A595350N97207c801462a318358A696305b035887h28842
475I90729b431299E238357d819348A063968M71448b548102B157347b39167n29300
466g68467j226961l939529B281834b873005C05022M77279K424219b314351D951392
456A719838e015551A044149K631570j209551P96187c980588g49323m35990p6753
447a262066B822717d22269o17879j074542I97209N333135e156462a721855k732797
438d454652g668j9610C413951b039049B760643b996660a339862e6264j790966
$$ y = [-817775, 6008422, 1848792, -3351208, 2883757, -2623001, 4627093, -3703898, 2004641, 5699661, 5793180, -7210312, 3141881, 1238324, 7166506, -2025859, -1702933, -6281592, 5007874, 706128, -325951, -4251258, 1595350, 2192557, -3801462, -1318358, 1696305, -2035887, -828842, 990729, -2431299, 5238357, -4819348, 1063968, 1535416, -2548102, 2157347, -239167, -768467, -1995428, -5934957, 2281834, -2873005, 305022, 782301, 3206520, -2314351, 4951392, 1719838, -5015551, 1044149, 3675719, 2466168, 3262355, -3980588, -749323, -1185313, -1262066, 2822717, -422269, -1040148, -2114690, 997209, 6330344, -5156462, -1721855, -4454652, -7668, -27278, 3413951, -2039049, 2760643, -2996660, -1339862, -56264, -1847230]
429a847230D263022a398263C60584a99827j287179B803533d174580A234855a615034
419a300509N52807k925769B851674d688478F986860C07584a344212L53354A859815
409A691760c129108J43420j526369D554617A821887l10228b345903C048170e653755
399B992463E05185e683659o06966A958327J299141a403496C16571a576466m119999
390e696465D219860d2686n23307p75750b06150A795082b174188F59735d864898
380E367403b551427j72519G791253a58045j551126A180802D16682a621440j96894
371a818334B37313K061455a416790e99823F12658a104880q52597e68294D097646
361d295427E398358a125903r22976A078266O88441J453105a958555H23717h81619
$$ y = [-1847230, 4263022, -1398263, 360584, -199827, -1487006, 2803533, -4174580, 1234855, -1615034, -1300509, -747702, -3673471, 2851674, -4688478, 6986860, 307584, -1344212, -990858, 1859815, 1691760, -3129108, -2985688, -4512057, 4554617, 1821887, 1511659, -2345903, 3048170, -5653755, 2992463, 505185, -5683659, -6290625, 1958327, 3257468, -1403496, 316571, -1576466, -5696465, 4219860, -42686, -565993, -1341743, -206150, 1795082, -2174188, 659735, -4864898, 5367403, -2551427, -2723946, 7791253, -158045, -1709171, 1180802, 416682, -1621440, -1818334, 237313, 2298768, -1416790, -599823, 612658, -1104880, -1957477, -568294, 4097646, -4295427, 5398358, -1125903, -2048879, 1078266, 1766707, 3219812, -1958555, 823717, -881619]
351b89893j135053m42555j173830c23153B751172b532854C100305b597962A735630
341e152700E004300b210140i72158B279393d291177j933859a796796I18256L56854
332A275110j95873c383191A305876M989614b171166c24161A601505J551671j210178
323A942998e999065d89359G6852J521160k50238b447194C466035f51864C710493
313a627173q72839C224724e318797A567049h57221k51432k364643E562924b514380
303a950048C414153c224609B725735N98302b696064i61000A968143q90388O60934
294A738689q54626J033527p07747l57166J247350A56159f74415n36775j520744
285b731934C904476D56624A52173c87599A342454J202766e462812B434534j033236
$$ y = [-289893, -1424946, -1867501, -3041331, -323153, 2751172, -2532854, 3100305, -2597962, 1735630, -5152700, 5004300, -2210140, -972158, 2279393, -4291177, -6225036, -1796796, 918256, 1275110, 1079237, -3383191, 1305876, 6295490, -2171166, -324161, 1601505, 3153176, 1942998, -5999065, -489359, 76852, 1598012, 1347774, -2447194, 3466035, -651864, 3710493, -1627173, -2500012, 3224724, -5318797, 1567049, -857221, -1108653, -3473296, 5562924, -2514380, -1950048, 3414153, -3224609, 2725735, 3324037, -2696064, -961000, 1968143, 1077755, 1738689, 884063, 1917590, 1209843, 852677, 2100027, 156159, -674415, -1211190, -2731934, 3904476, 456624, 152173, -387599, 1342454, 2545220, -5462812, 2434534, 1401298]
276A401298A61150K310661c372170e9850k414839A447870C38506a260903C32686
266C482867b638509j053825a733145B398842a046212B178231c037239a138677
257a831062l502585D76265J458362c583105E54205b18212E42472J743238E2317
247A657597b408042j367007a040571m310464a645414j039600B761868c4457j039472
238a073929C28273J340003a901137A89054b101893b41187j823449j565471A292857
228a326137A791463Q24236A153098R84829c082668A978394c80991H47844a75209
218f59905E161690a666568f92504q42772G057311B138773k68249f12530m90808
209a103338B169146C65558R07100c91504j977639f69341l181410B555138a757013
$$ y = [1401298, 161150, 2471811, -3372170, -59850, -2474689, 1447870, 338506, -1260903, 332686, 3482867, -2638509, -3692334, -1733145, 2398842, -1046212, 2178231, -3037239, -1138677, -1831062, -5333647, 476265, 1934627, -3583105, 554205, -218212, 542472, 2285710, 52317, 1657597, -2408042, -3775049, -1040571, -5351035, -1645414, -2685014, 2761868, -34457, -1073929, 328273, 1668276, -1901137, 189054, -2101893, -241187, -2064636, -3630107, 1292857, -1326137, 1791463, 2615699, 1153098, 2137927, -3082668, 1978394, -380991, 847844, -175209, -659905, 5161690, -1666568, -692504, -1535276, 7057311, 2138773, 1870524, -612530, -1103338, 2169146, 365558, 1272658, -391504, -2369143, -669341, -3850751, 2555138, -1757013]
199H400171B038511a175406A742226l74289c643258J666355C121009I45284d783300
189A621181k22673c131468o3536047j60384506B4485729O436361J82068923H7900438
180B27977176h446644j6452734j80274925e4362911F275867B29764a437698B721987
171e942396D059465d460419a282339A646640K651308D14735K380912I05716b393381
161b505298A213869n53356P08864a241892d98135j709650j2806D093974f51878
151b102860a3012q876841B523443k09558i84565B954624g68895I75098l43827
142F31271f174914H8068L986410f6542A084470c179104A853185d230122J879276
133b350846B25686J359632c977695G55881e26609A007051B54872c168923G13467
$$ y = [8400171, 2038511, -1175406, 1742226, 1367937, -3643258, -1976903, 3121009, 945284, -4783300, 1621181, 1398508, -3131468, -66667515, -227052021, 24485729, 30922090, 212991013, 87900438, 227977176, -8446644, -24899378, -205174303, -54362911, 6275867, 229764, -1437698, 2721987, -5942396, 4059465, -4460419, -1282339, 1646640, 4297948, 414735, 2795647, 905716, -2393381, -2505298, 1213869, 660513, 1369377, -1241892, -498135, -2207785, -2220591, 4093974, -651878, -2102860, -13012, -8889853, 2523443, 2313885, -984565, 2954624, -768895, 975098, 631271, -6174914, 88068, 4074478, -66542, 1084470, -3179104, 1853185, -4230122, -2350846, 225686, 1585318, -3977695, 755881, -526609, 1007051, 254872, -3168923, 713467]
123b801297B821347h78404B576631b148891B392312e538578k339100E85224N261373
114E846597A94736O47281L218336a009883I33736a053750b0730k385359E36012
104B053966a543594E98902b874259E90877L470621b786551n92078E23192J666251
95B189443c73231H56612h831763a652548p45075J061035C961318p16691A221615
85A159487a20442p45694A010978b716023G23039L107038H98994j34501k29246
76E35247K75954K260854J068348a600867A707268b504419B560204c371444A441958
66f69013l879715B761138A004919N8435c914421a17627A096841a586250q89868
57b476118B352277a141032F601568C174091C83906K938789e252244E89589k10877
$$ y = [-2801297, 2821347, -878404, 2576631, -2148891, 2392312, -5538578, -7877678, 585224, 5846597, 194736, 842017, 4060353, -1009883, 933736, -1053750, -20730, -2406089, 536012, 2053966, -1543594, 598902, -2874259, 590877, 4061498, -2786551, -3378629, 523192, 2189443, -373231, 856612, -8831763, -1652548, -2397623, -1336588, 3961318, 3244627, 1221615, 1159487, -120442, -866136, 1010978, -2716023, 723039, 3830077, 898994, 764493, 535247, 811201, 3072055, 4140403, -1600867, 1707268, -2504419, 2560204, -3371444, 1441958, -669013, -4548728, 2761138, 1004919, 1063354, -3914421, -117627, 1096841, -1586250, -2476118, 2352277, -1141032, 6601568, 3174091, 383906, 3322695, -5252244, 589589, 378712]
48C78712c034118G95088d176407B812064H9525M305017b420495A213892a839394
38C600272j404893f766085e04553q33763r99432B557973c146155G033740e370079
28a536075A219839a292746o42927E15261a105503D914862c133571C093742b04407
18C538166d076942A315372a801813C111053b265719e536n60753j675966B589301
8f43252I64344D61061J3927B02439J39527J139110a180066K64956
0i15110
$$ y = [378712, -3034118, 795088, -4176407, 2812064, 89525, 4394542, -2420495, 1213892, -1839394, 3600272, 2195379, -6766085, -504553, -1338316, -2337748, 2557973, -3146155, 7033740, -5370079, -1536075, 1219839, -1292746, -1935673, 515261, -1105503, 4914862, -3133571, 3093742, -204407, 3538166, -4076942, 1315372, -1801813, 3111053, -2265719, -5536, -566289, -2242255, 2589301, -643252, 964344, 461061, 474988, 202439, 341966, 1481076, -1180066, -915110]
##PAGE= F1=5662.376869535
##FIRST=     21204.543296753, 2672.49122660428, -1754579
##DATA TABLE= (F2++(Y..Y)), PROFILE
2047a754579g52251c53634A512599c30327n64392B463039b104781G16451J515527
2038B231978c838560A402169h78148j49004k98312E27347N908043e018231D7253
2028A104621c754353M57161D656675a833379B701437G07875b333934a037976D187264
2018C29865e909301D462970e270134A747239b244043M36738A097695K226292b978170
2008B446537b677239I0211c790753A350936K99231B26775K238133I80452h24575
1998B846839n33746d4534C128489f88042E0056L183334f94378j593066C567848
1988b151671B478730E76319b220505j627624E406155d397925J110559F413825
1979b759740a007481B378675K340339g16554m605029a544125J75576E02384K683025
$$ y = [-1754579, -752251, -353634, 1512599, -330327, -894719, 2463039, -2104781, 716451, 2231978, -3838560, 1402169, -878148, -1027152, -1325464, 527347, 6435390, -5018231, 47253, 1104621, -3754353, -3297192, 4656675, -1833379, 2701437, 707875, -2333934, -1037976, 4187264, 329865, -5909301, 4462970, -5270134, 1747239, -2244043, -1807305, 1097695, 3323987, -2978170, 2446537, -2677239, 90211, -3790753, 1350936, 1650167, 226775, 2464908, 980452, -824575, 2846839, 2313093, -44534, 3128489, -688042, 50056, 3233390, -694378, -2287444, 3567848, -2151671, 2478730, 576319, -2220505, -3848129, 5406155, -4397925, -3287366, 6413825, -2759740, -1007481, 2378675, 4719014, -716554, -5321583, -1544125, -1368549, 502384, 3185409]
1970C185409c660835a665578A940549a169966j594176C952392a360270a99742
1961C326937I40092J761325a749067A484969f51504k179057H03161O130330c113766
1951b597998B939926b143686B873972c536190A300985a938023k174546e64143
1942D477608c244762G245629F71544a980248D783841e552131D827975b635336
1933B188919a079862C084638b982141D220895M9443G50016b886013F760575A032809
1923I45327b222274B994937G36956b559913B77775a713854B273390J260753d40191
1913B537611a304585B794776b503717G37294b991143c43008C978359g84604c62963
1903c286759C063695a269140A095644l63799K465507d041269D787290F77696J528519
$$ y = [3185409, -3660835, -1665578, 1940549, -1169966, -2764142, 3952392, -1360270, -199742, 3326937, 940092, 2701417, -1749067, 1484969, -651504, -2830561, 803161, 6933491, -3113766, -2597998, 2939926, -2143686, 2873972, -3536190, 1300985, -1938023, -4112569, -564143, 4477608, -3244762, 7245629, 671544, -1980248, 4783841, -5552131, 4827975, -2635336, 2188919, -1079862, 3084638, -2982141, 4220895, 4270338, 750016, -2886013, 6760575, 1032809, 945327, -2222274, 2994937, 736956, -2559913, 277775, -1713854, 2273390, 3534143, -440191, 2537611, -1304585, 2794776, -2503717, 737294, -2991143, -343008, 3978359, -784604, -362963, -3286759, 3063695, -1269140, 1095644, 731845, 3197352, -4041269, 4787290, 677696, 2206215]
1894B206215E76065M536069a263039N19117C662415b163570g11357B119067I75899
1884E96429j60836J046799C4141K373884M41460b527707A587199a659571j302996
1875b962567B152432c574978i80413L0088H09023J582688Q24984k65578f522589
1865E364108f28802B577743f281054C740008c240549R89506B114286h88903F55159
1855C141345b26912D109918g0694B482705b574836D154925c735891J832442k799406
1846d702855B048136m73561B33251a103137E521467a465436l94006k269584B827379
1836A54556P68600l2123k26225b929429A580098D71167K309226A85685M0450O568022
1826F794157A81665L70005d521459D015974g88777j607138F40278d37031A178376
$$ y = [2206215, 576065, 5112134, -1263039, -743922, 3662415, -2163570, -711357, 2119067, 975899, 596429, 435593, 1482392, 34141, 2408025, 2849485, -2527707, 1587199, -1659571, -2962567, 2152432, -3574978, -980413, -950325, 809023, 2391711, 3216695, 2951117, -6522589, 5364108, -628802, 2577743, -6281054, 3740008, -3240549, -2251043, 2114286, -888903, 655159, 3141345, -226912, 4109918, -70694, 2482705, -2574836, 4154925, -3735891, -1903449, -4702855, 2048136, 1574575, 233251, -1103137, 5521467, -1465436, -1859442, -4129026, 2827379, 154556, 923156, 891033, 664808, -2929429, 1580098, 471167, 2780393, 185685, 226135, 6794157, 181665, 551670, -4521459, 4015974, -788777, -2395915, 640278, -437031, 1178376]
1816b789125A752770b978238A359632f046947K772646i49860B523409R61472c578230
1806E69168N62499k45086d460020G019088b491689k168802I89901b068148E7280
1796b64909C242649a899040C99605b67595L5113D157290j945054a0654I06484
1786B413188R40279c462756A543937F39353b943906E315732a497046K60056m966855
1777f203845A196530a446369r39041C520957j663217e00910j838080J01304b81
1767c540353C372024A513928b969330P91588L68297H7155d16372f5766m16682
1758d82448k260909A447037b496306l332317C855604c750737a009187B64112J841364
1749B105476c20890A216489e256655A097039A81840b547905B888324A029656c692036
$$ y = [-2789125, 1752770, -2978238, 1359632, -6046947, -3274301, -949860, 2523409, 3484881, -3578230, 569168, 1131667, 886581, -4460020, 7019088, -2491689, -4660491, 989901, -2068148, 57280, -264909, 3242649, -1899040, 399605, -267595, -232482, 4157290, 2212236, -10654, 906484, 2413188, 3353467, -3462756, 1543937, 639353, -2943906, 5315732, -1497046, -1236990, -6203845, 1196530, -1446369, -2385410, 3520957, 1857740, -500910, -2338990, -2237686, -281, -3540353, 3372024, 1513928, -2969330, -2177742, -1809445, 87155, -416372, -65766, -482448, -2743357, 1447037, -2496306, -5828623, 3855604, -3750737, -1009187, 264112, 2105476, -320890, 1216489, -5256655, 1097039, 181840, -2547905, 2888324, 1029656, -3692036]
1739D174605g26741q04182C30819a886369I11555f981962B308408b979952C436891
1729g95339B681420b490987B649876o36852r84075c225570J445439B090901f94117
1719a545803A018484d72489m1840c7961l363261A295198i84920G93324N47183
1710A340507B16347a403157L89989j893068a232647B500000b510654P76624G22311
1700a248044B013297c01295C211630f94420j49228B888131a44070A396142C74308
1690A986049c732783H78707N8603M691370c894069g81743B514870A144596d685409
1680E422044f93470a94881E988662e28680m827194B058291a87371B43161d661449
1670B931281E43404a663508l25376A00970a993500C415044j595318c489689A553110
$$ y = [4174605, -726741, -1530923, 330819, -1886369, 911555, -6981962, 2308408, -2979952, 3436891, -795339, 2681420, -2490987, 2649876, 2013024, 1028949, -3225570, -1780131, 2090901, -694117, -1545803, 1018484, -472489, -514329, -37961, -3401222, 1295198, -984920, 793324, 1340507, 216347, -1403157, -1013168, -2906236, -1232647, 2500000, -2510654, -1734030, 722311, -1248044, 2013297, -301295, 3211630, -694420, -843648, 2888131, -144070, 1396142, 374308, 1986049, -3732783, 878707, 937310, 5628680, -3894069, -781743, 2514870, 1144596, -4685409, 5422044, -693470, -194881, 5988662, -528680, -5355874, 2058291, -187371, 243161, -4661449, 2931281, 543404, -1663508, -1988884, 100970, -1993500, 3415044, 1819726, -3489689, 1553110]
1660a13046A382340a104232D64378b876875h23946B84978a177147d06224E62943
1650B945294B58980c50723B134839a017913J35438D811060j423482d18500C239666
1640A584468d009349e16461C9594L10852e954220B596083h53904k216914B723916
1630e88475B214431c904470a5851A173976l11989j07958a610089D69580c258255
1620A593250C76743g65148p18756K27852A01621K916266a460486k921064a957754
1610F901631H98216A60463e22208B093914B24354Q2066C3482c06589j794275H76976
1599i75528m55853B245625b228273D863706h67341j073326D2023Q51358c676142
1589c126812g53293A270173g86136E71903J015773o487B95185j08186K61792a193548
$$ y = [-113046, 1382340, -1104232, 464378, -2876875, -823946, 284978, -1177147, -406224, 562943, 2945294, 258980, -350723, 2134839, -1017913, -882475, 4811060, 3387578, -418500, 3239666, 1584468, -4009349, -516461, 39594, 350446, -5954220, 2596083, -853904, -3070818, 2723916, -588475, 2214431, -3904470, -15851, 1173976, 861987, 754029, -1610089, 469580, -3258255, 1593250, 376743, -765148, -1483904, -1256052, 101621, 3017887, -1460486, -4381550, -1957754, 6901631, 898216, 160463, -522208, 2093914, 224354, 306420, 33482, -306589, -2100864, 876976, -975528, -1431381, 2245625, -2228273, 4863706, -867341, -1940667, 42023, 893381, -3676142, -3126812, -753293, 1270173, -786136, 571903, 1587676, 1581189, 295185, 186999, 448791, -1193548]
1578I27803b719399g24160k583660B771983r16616N61671p37120b700081A886268
1568A288181O03596a87331n137734A553264c01163A924370a620C050850i70406
1558B414582a635720C140920q99894a25748C628541F97565c941654f17126k57798
1549h74924A087362b541129e31649B900668G84008a846506A479204c444353A456842
1539f81348F697475a778033A753672D02374b02952A962692a822417N57789H90617
1529B326246b62018l476135e40401H91214a059417E953456d020620D241410i89090
1519a217329D34009L992311A104113L257201c557881B006000b866056A759353
1510d175257B633802A6006a59228C699648c206925A416223A7093e51680l946297
$$ y = [927803, -2719399, -724160, -3307820, 2771983, 1855367, 2417038, 1679918, -2700081, 1886268, 1288181, 1891777, -187331, -5325065, 1553264, -301163, 1924370, -1620, 3050850, -970406, 2414582, -1635720, 3140920, 2241026, -125748, 3628541, 697565, -3941654, -617126, -874924, 1087362, -2541129, -531649, 2900668, 784008, -1846506, 1479204, -3444353, 1456842, -681348, 6697475, -1778033, 1753672, 402374, -202952, 1962692, -1822417, -1264628, 890617, 2326246, -262018, -3738153, -540401, 891214, -1059417, 5953456, -4020620, 4241410, -989090, -1217329, 434009, 4426320, 1104113, 4361314, -3557881, 2006000, -2866056, 1759353, -4175257, 2633802, 16006, -159228, 3699648, -3206925, 1416223, 17093, -551680, -4497977]
1501d497977B769741E62639e31925B328917B11451c445062C290581a628688M26995
1492a201693N47308B94150a574300M73942N754A100865b709916B623538P19905
1483C343443j663325cG38766K47552d725630A781210a32197j941623P68737k314103
1473c619186C83595J082473P08158c955827g16277J2935j295932M74699j884726
1464c409301F748354e451618a90115l819879C19828a58639l77356m545797D480404
1454B788532c786665B613951e901680G71597M55688a694271Q15500D059156b618274
1444b047083g63869a20005D358271e456140D604364a566946b67143F98739O89772
1435A388511d115420a88883j655496G58477J241446g040896A637366a525671j87993
$$ y = [-4497977, 2769741, 562639, -531925, 2328917, 211451, -3445062, 3290581, -1628688, -1201693, -654385, 294150, -1574300, -1100358, -1094604, 1100865, -2709916, 2623538, 3343443, 1680118, -3, 738766, 986318, -4725630, 1781210, -132197, -2073820, -1305083, -3619186, 383595, 1466068, 2174226, -3955827, -716277, -703342, -1999274, -1524575, -3409301, 6748354, -5451618, -190115, -4009994, 319828, -158639, -535995, -5081792, 4480404, 2788532, -3786665, 2613951, -5901680, 771597, 1227285, -1694271, -878771, 4059156, -2618274, -2047083, -763869, -120005, 4358271, -5456140, 4604364, -1566946, -267143, 698739, 1388511, -4115420, -188883, -1844379, 758477, 1999923, -7040896, 1637366, -1525671, -1713664]
1426a713664j464535D54209K017238c260454C231326A491201E39885K680991K50829
1417C471705e156563F62991c596593H243141A608462b627535b08799k562596C002190
1407A917330i4695k69516A915457a014640C116836a748915I938887b18078k30945
1398d49023n827747D179833j261922h72905n095588B191140o83598E36870e397376
1388D567587j449390a182213B413603f469144a250222j53292H38592b749613f14901
1378h53614C003204j383451G79883e01046l431399A551613J682110A018459A22548
1368a507068F69136M53247d173265C424312c35143A832377J586652b447427J097675
1359a349752E96273h16286b54414C880309b341267A411862c118410h21081k241394
$$ y = [-1713664, -3178199, 454209, 2471447, -3260454, 3231326, 1491201, 539885, 3220876, 3471705, -5156563, 662991, -3596593, 8243141, 1608462, -2627535, -208799, -2771395, 3002190, 1917330, -94695, -364211, 1915457, -1014640, 3116836, -1748915, 9938887, -218078, -449023, -6276770, 4179833, 2917911, -872905, -5968493, 2191140, 1507542, 536870, -5397376, 4567587, 3118197, -1182213, 2413603, -6469144, -1250222, -1403514, 838592, -2749613, -614901, -853614, 3003204, 1619753, 779883, -501046, -3932445, 1551613, 3233723, 1018459, 122548, -1507068, 669136, 1122383, -4173265, 3424312, -335143, 1832377, 3419029, -2447427, -1349752, 596273, -816286, -254414, 3880309, -2341267, 1411862, -3118410, -821081, -3062475]
1350c062475i26872L30036D903911J43877b681322J239961A087951i5368C14535
1340C827283L88261d31722m378604a075939A084326K915329a192893j326538a070986
1330b795556C326096a809418l993947a306862p07548B884603J675372a1745945
1321A247208A64641K163006h06080c09581C591564A97131R43143a579367j285223
1312b864590A14469R23821c839811e47788k87362B70858L124905e754719b79960
1302D43378f139200C417905a317087E357428I17776K316167r73321d730858A509893
1292A322780g59093a07792B229301B57518a800744K66341c20732j076233A283127
1282D661567e661103g42987B098189h23880j104320B34866a321468j650594a451560
$$ y = [-3062475, -926872, -596836, 4903911, 5047788, -2681322, -1441361, 1087951, -95368, 314535, 3827283, 4215544, -431722, -4810326, -1075939, 1084326, 3999655, -1192893, -2519431, -1070986, -2795556, 3326096, -1809418, -5803365, -1306862, -2014410, 2884603, 4559975, -11745945, 1247208, 164641, 2327647, -806080, -309581, 3591564, 197131, 1140274, -1579367, -2864590, 114469, 1038290, -3839811, -547788, -835150, 270858, 3395763, -5754719, -279960, 443378, -6139200, 3417905, -1317087, 5357428, 917776, 3233943, 2260622, -4730858, 1509893, 1322780, -759093, -107792, 2229301, 257518, -1800744, -1534403, -320732, -1396965, 1283127, 4661567, -5661103, -742987, 2098189, -823880, -1928200, 234866, -1321468, -2972062, -1451560]
1272g45663C175442E11181g89686C138797d587985K256896H59418C38690a652225
1262F407172h42631K74682k116565B714515e30807J49944e419j338309E016585
1252H29880b218723H81862K88622Q8043C79691o7890J726071a233048c3846m224933
1242d258779D574889e54370j661881g38987F93871b911023J114031E63837h99674
1232e368811e29327B28335K4317N20199b68479D787484c905498a202983H39780
1222E90847J38900J660686g998290B179332F83447P98031n86959o4289L022900
1213C853130B19913d209177A389304M12110L26123d463619A798247M86620d563117
1203b499468B824252c816654m14322B198523E99856b30053l140067a566460B773598
$$ y = [-745663, 3175442, 511181, -789686, 3138797, -4587985, -2331089, 859418, 338690, -1652225, 6407172, -842631, -567949, -2684514, 2714515, -530807, -380863, -5419, -1343728, 5016585, 829880, -2218723, 881862, 1170484, 1258527, 379691, 311801, 2037872, -1233048, -33846, -4258779, 4574889, -554370, -2216251, -738987, 693871, -2911023, -1796992, 563837, -899674, -5368811, -529327, 228335, 252652, 772851, -268479, 4787484, -3905498, -1202983, 839780, 590847, 729747, 2390433, -7998290, 2179332, 683447, 1481478, 894519, 830230, 3853130, 219913, -4209177, 1389304, 1801414, 2127537, -4463619, 1798247, 2284867, -4563117, -2499468, 2824252, -3816654, -4230976, 2198523, 599856, -230053, -3370120, -1566460, 2773598]
1193A018205a908526o73141a91640m599779F391936D34565O3859d31047l81335
1184h12382J97103A609396b145989C938530j707297b254631I4214O99829b00806
1174a865808o25867E656622c530061b53552P2290j66253G02044a541542A066004
1164C729268d729718A498642b506636A099055a236960A007090b43315k011963
1156b255278C644519r85254C16576L67611L17651J453863E939a28494q07563l02923
1146a238980g0396j792138p0706G35871K769859F85427i584o77332j291313f23205
1135a116224C773791r19841d397002J325266A667348a46285B10376i36289C766958
1125c229407f51820E397573g45755B077890j46548E97604e380552f09154j265195
$$ y = [1018205, -1908526, -2581667, -191640, -4791419, 6391936, 434565, 498424, -431047, -812382, -615279, 1609396, -2145989, 3938530, 2231233, -2254631, 94214, 794043, -200806, -1865808, -2491675, 5656622, -3530061, -253552, -181262, -347515, 702044, -1541542, 1066004, 3729268, -4729718, 1498642, -2506636, 1099055, -1236960, 1007090, -243315, -2255278, 3644519, 2659265, 316576, 684187, 1001838, 2455701, 5939, -128494, -936057, -1238980, -70396, -1862534, -1933240, 735871, 3505730, 685427, -9584, -686916, -1978229, -623205, -1116224, 3773791, 2853950, -4397002, -3071736, 1667348, -146285, 210376, -936289, 3766958, -3229407, -651820, 5397573, -745755, 2077890, 1931342, 597604, -5380552, -609154, -1874349]
1116a874349j812293d65853p31972C04049a068246D580028a570554A238496h01009
1106c859807A113957M57106K850630b088951Q06779N84762C80001J358443a067603
1096a593729A683530O247551f413855G0769O0909N076227e584259F11723J397372
1087B009095b353726A320897c032220c16800J30348C500278j462029o31887a498652
1077A752518a050062A195469c055245d54535A540719g30620b51403A115003d60405
1067b178761J51141A7625N63999A11045b067852B445131b504861A646792d241724
1057b121380g43723E729580b84176k700125A934947f44368b60538n328193a820124
1047b560025D212300b102084D388555c97666F104751b97213k110683C735142A009494
$$ y = [-1874349, -3686642, -465853, -1197825, 304049, -1068246, 4580028, -1570554, 1238496, -801009, -3859807, 1113957, 1571063, 4421693, -2088951, -1282172, -697410, 380001, 1738444, -1067603, -1593729, 1683530, 7931081, -6413855, 70769, 131678, 5207905, -5584259, 611723, 2009095, -2353726, 1320897, -3032220, -316800, -186452, 3500278, 2038249, 1406362, -1498652, 1752518, -1050062, 1195469, -3055245, -454535, 1540719, -730620, -251403, 1115003, -460405, -2178761, -2027620, 17625, 581624, 111045, -2067852, 2445131, -2504861, 1646792, -4241724, -2121380, -743723, 5729580, -284176, -2984301, 1934947, -644368, -260538, -5588731, -1820124, -2560025, 4212300, -2102084, 4388555, -397666, 6104751, -297213, -2407896, 3735142, 1009494]
1037e844828C03251b039746C680329b931413b89006j138385F26033c411303f49367
1027C36356J813548c62495I77699b812809a58469C039497b93866B784217J380646
1018D164863C09221c686414M14848F28511c006012B200130c017745A498979a616484
1008g19005k778789C611544j767412a666743A58187J739487i80839D282182d831527
998C936387c834305F690782C29454K9062a891436j611789B413909K67262i83153
988B221516d502354A463164L638509a298675O36240p076175G140555a157046B306375
978B525294a067421B130018j018344b419962B341898c689827A209441e59552B808844
968b789552E289946b362439h61744l114279C262525a959482o99404B448107a479285
$$ y = [-5844828, 303251, -2039746, 3680329, -2931413, -289006, -1427391, 626033, -3411303, -649367, 336356, 2149904, -362495, 977699, -2812809, -158469, 3039497, -293866, 2784217, 4164863, 309221, -3686414, -3271566, 628511, -3006012, 2200130, -3017745, 1498979, -1616484, -719005, -3497794, 3611544, 1844132, -1666743, 158187, 1897674, -980839, 4282182, -4831527, 3936387, -3834305, 6690782, 329454, 358516, -1891436, -3503225, 2413909, 2681171, -983153, 2221516, -4502354, 1463164, 5101673, -1298675, -662435, -7738610, 7140555, -1157046, 2306375, 2525294, -1067421, 2130018, 1111674, -2419962, 2341898, -3689827, 1209441, -559552, 2808844, -2789552, 5289946, -2362439, -861744, -3976023, 3262525, -1959482, -2658886, 2448107, -1479285]
958a702751j086808D01417J850320K821078a0258095b404391g10928C671720D85503
948c158244E051232b066132J023336o85175A998914a638790j218562A205835a083278
938A065614L818765d51860F82783a526824I74458b20386A83415d296471c24070
928C328568b065257G724835a674411C133724a507927K07584B71322N25525N447209
919F244056c47912j307042A580363a016919j470290P32088q54652f19214D42416
909E58208I0156a682035B141541c585703Q81933i12432D80148L291369d614345
899F00050c294575N50220A36569J753262p19761J219616D70868d475859b99894
889D092394d367888F91309a573149D734665i97831B839347l59083H95277c685548
$$ y = [-1702751, -2789559, 401417, 2251737, 5072815, -10258095, -2404391, -710928, 3671720, 485503, -3158244, 5051232, -2066132, -1042796, -1727971, 1998914, -1638790, -2857352, 1205835, -1083278, 1065614, 4884379, -451860, 682783, -1526824, 974458, -220386, 183415, -4296471, -324070, 3328568, -2065257, 7724835, -1674411, 3133724, -1507927, -1300343, 271322, 796847, 6244056, -347912, -1654954, 1580363, -1016919, -2487209, -1755121, -2609773, -619214, 442416, 558208, 90156, -1682035, 2141541, -3585703, -2703770, -912432, 480148, 3771517, -4614345, 600050, -3294575, -2744355, 136569, 1889831, 1170070, 2389686, 470868, -4475859, -299894, 4092394, -4367888, 691309, -1573149, 4734665, -997831, 2839347, 2480264, 895277, -3685548]
879b907838p04002E422239b049613i60025B72247L646186d344909A462914e407118
869B815411j062297b99094l666875A442608L311520b799243a186728H78467b107165
859B752744L23353A494915D38515L470678f11224B758397A03385L001995g56531
849A82102b3904j318387C684789a45033B143265A72573h25650A082848d039910
839a517634B349524d650170B505424F13152f99494B650148b990161C378623G07615
829b340868j856983i60250k012008e77789l629188F362168b267804A670717b109266
819D483690b365389O47453E809518e237963B117350i30277B17075K841512a471477
809B480378e603985F02080J146926n04426b348613R32210G9556a994407A415765
$$ y = [-2907838, -3611840, 5422239, -2049613, -960025, 272247, 3918433, -4344909, 1462914, -5407118, 2815411, 1753114, -299094, -3965969, 1442608, 4754128, -2799243, -1186728, 878467, -2107165, 2752744, 3076097, 1494915, 438515, 3909193, -611224, 2758397, 103385, 3105380, -756531, 182102, -23904, -1342291, 3684789, -145033, 2143265, 172573, -825650, 1082848, -4039910, -1517634, 2349524, -4650170, 2505424, 613152, -699494, 2650148, -2990161, 3378623, 707615, -2340868, -4197851, -960250, -2972258, -577789, -4206977, 6362168, -2267804, 1670717, -2109266, 4483690, -2365389, -1717936, 5809518, -5237963, 2117350, -930277, 217075, 3058587, -1471477, 2480378, -5603985, 602080, 1749006, 1244580, -2348613, -1416403, 79556, -1994407, 1415765]
799A482409a662728E911628f988080B438851H02843K836840j661106c70860C483339
789C769296A9433M434294a126847H2259J659553b888688M02865I01402L327378
780D228780h599788B149316L263854d588418A416631a309153m749702B982751
771D436838A370846d63390A10683J647965a510200F57649h09001r49834j126425
762b885260B418123j059696A6071b0422k319519O44915j196014C036585j386566
753A650019n25948f31709A462947i0964k744182L45686B401093o49068B80147
743c982058M94016D1310L403821H13130c041944F786962b891968A494487G37002
733D52103a825728O79026H91071a76640j987923B301280I47224J537020a506043
$$ y = [1482409, -1662728, 5911628, -6988080, 2438851, 802843, 3639683, 1978577, -370860, 3483339, 3769296, 19433, 4453727, -1126847, 82259, 1741812, -2888688, -2485823, 901402, 4228780, -8599788, 2149316, 5413170, -4588418, 1416631, -1309153, -6058855, 2982751, 4436838, 1370846, -463390, 110683, 1758648, -1510200, 657649, -809001, -1758835, -2885260, 2418123, 1358427, 16071, -20422, -2339941, -1695026, -2891040, 3036585, 1650019, 1124071, -631709, 1462947, -90964, -2835146, -2489460, 2401093, 1752025, 280147, -3982058, -3488042, 41310, 3445131, 813130, -3041944, 6786962, -2891968, 1494487, 737002, 452103, -1825728, -1146702, 891071, -176640, -2164563, 2301280, 947224, 2484244, -1506043]
723C07443J96583P11601K548164d13210A903859a998363D070442A142436L734278
714D876714i600917j5564068i887411q285804e740451B1188820J4306837A2095513
705A6127943n486947i47683o577498l0363183J3046166j0587510p072530A9424585
696D1299719j3919694K657589m427463a5231284e791585j364222a067307D196903
687a239438A58982K946546a896524l165840a303827B094286J208200G6522b851413
677b458728D069993b438433N52310G191254K2948665A0146088g381091k0951468
669b8332559j1698928e511338k3228015N726265E821840J463375M1031102k0224805
661B8091512A0315434f239165K329059j4819330B466860a6852861j0217639a2484592
$$ y = [307443, 504026, 1215627, 3763791, -413210, 1903859, -1998363, 4070442, 1142436, 4876714, -9600917, -25164985, -9887411, -18173215, -5740451, 21188820, 35495657, 12095513, 16127943, 10640996, -947683, -7525181, -37888364, -24842198, -35429708, -42502238, 19424585, 41299719, 27380025, 30037614, 25610151, -15231284, -5791585, -7155807, -1067307, 4196903, -1239438, 158982, 3105528, -1896524, -5062364, -1303827, 2094286, 3302486, 76522, -2851413, -2458728, 4069993, -2438433, -1886123, 7191254, 30139919, 10146088, -7381091, -28332559, -40031487, -5511338, -28739353, -23013088, 5821840, 7285215, 48316317, 28091512, 10315434, -6239165, -3910106, -18729436, 2466860, -16852861, -27070500, -12484592]
652A028502J8278241H857563g99820C980870I63331e082990D718824R77017d10964
642a19183G895994b808695b03141A96142b661268G25884K234753M522461e361358
632a503223D99363M46081a853516b94464O07F453885b606420A215966J341820
623B557786K526770J2108480K0597401M9412711M8173256c97076318J82568664
616b14507654Q2029814B83846749B9949359q956393E411629N656956C547872K245505
608E793377B769919O74976j465565J333511j519772G34042M125903g40598A920491
598g42647k684686k83835B721929L5398A031120c931212B268443c364213b12249
588a711317B215773e630754F713147i02290C72309R75207J895034b298105A086764
$$ y = [1028502, 19306743, 8857563, -799820, 3980870, 963331, -5082990, 4718824, 5695841, -410964, -119183, 7895994, -2808695, -203141, 196142, -2661268, 725884, 2960637, 7483098, -5361358, -1503223, 499363, 945444, -1853516, -294464, -293857, 6453885, -2606420, 1215966, 2557786, 5084556, 17193036, 37790437, 87203148, 135376404, -397076318, -214507654, -132477840, 283846749, 29949359, 20992966, 5411629, 11068585, 3547872, 5793377, 2769919, 3444895, 1979330, 3312841, 1793069, 734042, 4859945, -740598, 1920491, -742647, -3427333, -3711168, 2721929, 2757327, 1031120, -3931212, 2268443, -3364213, -212249, -1711317, 2215773, -5630754, 6713147, -902290, 372309, 1347516, 3242550, -2298105, 1086764]
578A664583L401093b283505B003847r76168O533004a079147j210489G363627e142286
568B86367J324141a021739A312096d080923A036381K93993D45675c883082B053568
558C723211C1042i48751B532973d49083H99132O40090c056455B580718a405605
548f19833B487592p86714f87918D93394c336453k25923D272497a183516d27896
538a401393A326268c361295H231044a863691C51377c758556A843886b332294C531011
528A669570c409153E733651d611353C567335b77828j170567C083341O204464a696602
518c429698B162854i45172C179760c808282h6996j129337D415151d585950C515894
508b717151A117148e28854A210321a189736F306972A487254b802697B183384b364576
$$ y = [1664583, 5065676, -2283505, 2003847, 1027679, 7560683, -1079147, -2289636, 7363627, -5142286, 286367, 1610508, -1021739, 1312096, -4080923, 1036381, 1330374, 445675, -3883082, 2053568, 3723211, 31042, -948751, 2532973, -449083, 899132, 1539222, -3056455, 2580718, -1405605, -619833, 2487592, 1700878, -687918, 493394, -3336453, -3562376, 4272497, -1183516, -427896, -1401393, 1326268, -3361295, 8231044, -1863691, 351377, -3758556, 1843886, -2332294, 3531011, 1669570, -3409153, 5733651, -4611353, 3567335, -277828, -1448395, 3083341, 9287805, -1696602, -3429698, 2162854, -945172, 3179760, -3808282, -86996, -1216333, 4415151, -4585950, 3515894, -2717151, 1117148, -528854, 1210321, -1189736, 6306972, 1487254, -2802697, 2183384, -2364576]
498C884571b487663B060401L724848m56501g442082C293648G76113O073393a607072
488a409447m471410E432229c73386A84894d777662H89429P94227e021805a239054
478A731612a952423P40587A261056c007201E055505e080228I97671J026351b771529
468A450675c62437k30706j838169l230185A996037c156263D12392J428059K76746
459B117197a634549D868424B086284d355684A716983J474111r75746J081463d531418
449B52648a332118M18896C205598a47285p85901j457629I40205O210546d861781
439a997091k099538D8829P81191J901063a574301B586333b953027a336562d27484
429a572460D525157a640659a05410B28707i10480B638902d203524F74580a873697
$$ y = [3884571, -2487663, 2060401, 5785249, 5328748, -7442082, 3293648, 776113, 6849506, -1607072, -1409447, -5880857, 5432229, -373386, 184894, -4777662, 889429, 1683656, -5021805, -1239054, 1731612, -1952423, -1211836, 1261056, -3007201, 5055505, -5080228, 997671, 2024022, -2771529, 1450675, -362437, -593143, -2431312, -5661497, 1996037, -3156263, 412392, 1840451, 2117197, -1634549, 4868424, 2086284, -4355684, 1716983, 3191094, 2215348, 3296811, -4531418, 252648, -1332118, -913222, 3205598, -147285, -933186, -2390815, 940205, 7150751, -4861781, -1997091, -4096629, 48829, 830020, 2731083, -1574301, 2586333, -2953027, -1336562, -427484, -1572460, 4525157, -1640659, -105410, 228707, -910480, 2638902, -4203524, 674580, -1873697]
419a118176k93038k159426C965252d456616G361161f80159K94091j5708A881133
409I27891b628621Q36648k950333D380514A876168l94682a812393D030332e340206
399B465871F80984e336416r74475A930508J575151i67547i1106j637427l624858
390e353391D469301f94890L28149a04062m57054A887089b338018C88331e148465
380E147653b953386J299988G800510c69798p41369D68457J371746b101878e64325
370C04666K295587a687991O96618F66938a664973p37181b20139D213288d482968
360E519184b076968N51006A597309M35342Q93969a620173A145775a081526a86328
350a780507l27688m23990b63453B855401a437678B512931b782501C056747e596088
$$ y = [-1118176, -1411214, -3570640, 3965252, -4456616, 7361161, -680159, -386068, -401776, 1881133, 927891, -2628621, -1791973, -4742306, 4380514, 1876168, 1481486, -1812393, 4030332, -5340206, 2465871, 680984, -5336416, -6310891, 1930508, 3505659, -967547, -91106, -1728533, -5353391, 4469301, -694890, -366741, -104062, -561116, 1887089, -2338018, 388331, -5148465, 5147653, -2953386, -1653398, 7800510, -369798, -1111167, 468457, 1840203, -2101878, -564325, 304666, 2600253, -1687991, -991373, 666938, -1664973, -2402154, -220139, 4213288, -4482968, 5519184, -2076968, -1525962, 1597309, 2032651, 2926620, -1620173, 1145775, -1081526, -186328, -1780507, -2108195, -2532185, -263453, 2855401, -1437678, 2512931, -2782501, 3056747, -5596088]
340E225436b806992a096940A964999c476579l010457a108556G54212N98086j89588
331A162710c253141A713518M833275a872439b46590A728736J315566A513809f076333
321a345675B52790K209086j033709b523223C096878d55122B384245a154852j638828
312b793680C317669e021044A405417a14343j257457j821242E166927b230719P63124
303a467595C521502b965740A977041J282472b818040i49005A482018k77293J613743
294B818468G65417K185333B94099M73659J556423e60982l90000n56996k10644
285a718622C913904B88776j16750g36607A668221O90919e345543B291397A117162
275I48025J594953c607996E89195c257653A611255b97454j413150G95129K293108
$$ y = [5225436, -2806992, -1096940, 1964999, -3476579, -6487036, -1108556, 754212, 1352298, 1162710, -3253141, 1713518, 6546793, -1872439, -246590, 1728736, 3044302, 1513809, -6076333, -1345675, 252790, 2461876, 1428167, -2523223, 3096878, -455122, 2384245, -1154852, -2793680, 3317669, -5021044, 1405417, -114343, -1371800, -3193042, 5166927, -2230719, -1467595, 3521502, -2965740, 1977041, 3259513, -2818040, -949005, 1482018, 1204725, 2818468, 765417, 2950750, 294099, 767758, 2324181, -560982, -950982, -1507978, -1718622, 3913904, 288776, 172026, -736607, 1668221, 2359140, -5345543, 2291397, 1117162, 948025, 2542978, -3607996, 589195, -3257653, 1611255, -297454, -1710604, 795129, 3088237]
266C088237b744984j204775h75575A786215g94155B382673b482948J236369q65858
257b112437l317994B66604J697278c872424F81632C07578A52200K314035E11432
247A995666a873945j738044a743944m162735E74572b776389B767635A91907h33019
237G22061J160596b637813A04213b833464c64234j753300j242598A457896a995494
227B326378O52182F47599J295037c284913B445156f42652A034385a08956C4775
217E733835a089492k31250o70870G139902B677063m54786a083426j46580B715239
207E05162P73198I0447a481373N96928k892854B423076b106481H088602B300026
197i57563A699637q8567c752501J655578C050614I36000e317177A723124n80971
$$ y = [3088237, -2744984, -3949759, -875575, 1786215, -794155, 2382673, -2482948, -1246579, -2112437, -5430431, 266604, 1963882, -3872424, 681632, 307578, 152200, 2466235, 511432, 1995666, -1873945, -3611989, -1743944, -5906679, 574572, -2776389, 2767635, 191907, -833019, 722061, 1882657, -2637813, 104213, -2833464, -364234, -2117534, -3360132, 1457896, -1995494, 2326378, 2978560, 647599, 1942636, -3284913, 2445156, -642652, 1034385, -108956, 34775, 5733835, -1089492, -1320742, -1991612, 7139902, 2677063, 2222277, -1083426, -1230006, 2715239, 505162, 1278360, 90447, -1481373, -884445, -3777299, 2423076, -2106481, 8088602, 2300026, -957563, 1699637, 1611070, -3752501, -2096923, 3050614, 936000, -5317177, 1723124, 1142153]
188A142153b570810o2532664j63833408B3949863P718362J83609676H7436469
180B22597624g620202j8292146j76819414e4342508F307438b23732p11094B478046
171d908919C937158d010286f83791F62296L460893A97195K834170G10526b100028
161b996265I24557j30280L77058a349451B47b380402J19588D088874f85654j670530
151b356184G36687a0291574B513998I70370a089588B620587a334468A359993o16434
142G43559e608509c88606D660046a137088B699607d523468B731743d011226J575991
133b435235c46273B069515d905641A095881G6523Q05165J47450b922789A545075
123b381273B692767A576J952233b821619C474982e339490j512070d56321F159539
$$ y = [1142153, -2570810, -65103474, -228936882, 23949863, 31668225, 215277901, 87436469, 222597624, -7620202, -25912348, -202731762, -54342508, 6307438, -223732, -934826, 2478046, -4908919, 3937158, -4010286, -683791, 662296, 4123189, 197195, 3031365, 710526, -2100028, -2996265, 924557, 794277, 1171335, -1349451, 247, -2380402, -2260814, 4088874, -685654, -2356184, 736687, -10291574, 2513998, 970370, -1089588, 2620587, -1334468, 1359993, 743559, -5608509, -388606, 4660046, -1137088, 2699607, -4523468, 2731743, -4011226, -2435235, -346273, 2069515, -4905641, 1095881, 76523, 881688, 1029138, -2922789, 1545075, -2381273, 2692767, 1576, 1953809, -2821619, 3474982, -5339490, -6851560, -456321, 6159539]
113B49582M8687L832116a165285A458263a132568b56951j657377H5363J755272
104A840635g95386A88499b962097A326192K301286a927308k270228F09705J795834
95B405539i41655F61705f913542a608650j249904d56341C106120R319r71191b3416
84G6921i05538A443266c314490B011518K139664D15599J54577I6277N6709L302690
74C455676R10611a445149A618835b592064B708770c206282A207396A1847d971562
64B086747I45224K17521c649764a21858I03955i09414j352165A316400d71789
54E996186B438595B6586L011457c848358c70258A216240c194614D78052d730321
44B476924D84334M100199b388505C88947a976138C327919A492431f381390D08243
$$ y = [249582, 298269, 4130385, -1165285, 1458263, -1132568, -256951, -1914328, 85363, 1840635, -795386, 188499, -2962097, 1326192, 3627478, -1927308, -4197536, 609705, 2405539, -941655, 661705, -6913542, -1608650, -2858554, -456341, 3106120, 3115439, 2144248, -23416, 76921, -905538, 1443266, -3314490, 2011518, 4151182, 415599, 570176, 96277, 152986, 3455676, 4366287, -1445149, 1618835, -2592064, 2708770, -3206282, 1207396, 11847, -4971562, 2086747, 945224, 1162745, -3649764, -121858, 903955, -909414, -2261579, 1316400, -471789, 5996186, 2438595, 26586, 3038043, -3848358, -370258, 1216240, -3194614, 478052, -4730321, 2476924, 484334, 4584533, -2388505, 388947, -1976138, 3327919, 1492431, -6381390, 408243]
34a344488j627783B874131c111761F543306d339157a883848G76960b046810J61202
25a885608G74575a052711E161137c066765C264018a22622D726882c955472A255544
15a978347D410648b284946a5849n46703j882493B596200g54477I39003D02791
5I43784C85443i2312A748440a336937c74324
$$ y = [-1344488, -2972271, 2874131, -3111761, 6543306, -4339157, -1883848, 776960, -2046810, -1885608, 774575, -1052711, 5161137, -3066765, 3264018, -122622, 4726882, -3955472, 1255544, -1978347, 4410648, -2284946, -15849, -562552, -2445045, 2596200, -754477, 939003, 402791, 943784, 385443, -92312, 1748440, -1336937, -374324]
##PAGE= F1=5640.578599651
##FIRST=     21204.543296753, 2672.49122660428, -1623426
##DATA TABLE= (F2++(Y..Y)), PROFILE
2047a623426p70324b35550A020462a27595j265374B520664b641163F15341J419302
2038B034643c690427F05451b30529r73734k07275G33936M469169d250828e76D63950
2027c539242J61156C817338a904792A922659o64412b420184a77603C462118D44736
2017f936938C775554d828746H50075b580559M05901A944936P79802c418002B777281
2007c462669D99199c551937A432367r0259b43373B327948E46436a369107B721989
1997B287729A45620L496902a159559N20157C821057i74963j129725B790165b629714
1987B784282A142386c030235N53054D886921d427557J166354E791069c567708
1978h92423B427518K038847f63209n684447a709352d67579E44448K253846d277432
$$ y = [-1623426, -2393750, -235550, 1020462, -127595, -1392969, 2520664, -2641163, 615341, 2034643, -3690427, 605451, -230529, -1204263, -1411538, 733936, 5203105, -4250828, -576, 463950, -3539242, -3378086, 3817338, -1904792, 1922659, 1258247, -2420184, -177603, 3462118, 444736, -6936938, 3775554, -4828746, 850075, -2580559, -2174658, 1944936, 2724738, -3418002, 2777281, -3462669, 499199, -3551937, 1432367, 1342108, -243373, 2327948, 546436, -1369107, 2721989, 2287729, 145620, 3642522, -1159559, -639402, 3821057, -974963, -2104688, 2790165, -2629714, 2784282, 1142386, -3030235, -2477181, 4886921, -4427557, -3261203, 5791069, -3567708, -892423, 2427518, 4466365, -663209, -6347656, -1709352, -467579, 544448, 2798294, -4277432]
1968b581664A877862a661922q09842D262680i48495L09536D327327g0302B404905
1958a404413B199587h16009k545089a40913F813543c126974J478068C428737b551291
1948B766219c152983I81744a536274k564902i84554E157705d040310F209145E09365
1938b671798E206850e782925D450513b794140B468308i48627C537756b235393
1929C835517Q43598H06228b686688G226430I38489l65641b292919B411315j107080
1920A304235b761452G37288a218902B145372J145850g0275A248862h46074B998335
1910b957662I96942c114306c90795C602102a108554c27405l079964C117088a638693
1900A734531E31365L311783c856477C571976A092482J683737D3434N884918a120140
$$ y = [-2581664, 1877862, -1661922, -2471764, 4262680, -948495, -638959, 4327327, -70302, 2404905, -1404413, 2199587, -816009, -3361098, -140913, 6813543, -3126974, -1648906, 3428737, -2551291, 2766219, -3152983, 981744, -1536274, -4101176, -984554, 5157705, -4040310, 6209145, 509365, -2671798, 5206850, -5782925, 4450513, -2794140, 2468308, -948627, 3537756, -2235393, 3835517, 4679115, 806228, -2686688, 7226430, 938489, 572848, -2292919, 2411315, 1304235, -2761452, 737288, -1218902, 2145372, 3291222, -70275, 1248862, -846074, 2998335, -2957662, 996942, -3114306, -390795, 3602102, -1108554, -327405, -3407369, 3117088, -1638693, 1734531, 531365, 3843148, -3856477, 3571976, 1092482, 2776219, 43434, 5928352, -1120140]
1890a829541C856993b087235R38449B644234A075860m0532d8755A238925e13252
1880B692809J087330b780782A008993a109532j834962B116421d384616d64190
1871a377486D85495K576147m17166L72671f976087E460735a553579B603402f427770
1861C505249b596137K80952A785444b82056q3968C483698f41444D103662f01238
1851B881305c059125D630495c917326a508717l613532C854714A563492C30249
1842a336957F105296b006806m03610j950953B800068D31890O63460j53242m28520
1833E13588b532371B030150E42019J711777r18459n66844N096567a40921I18698
1823e732285D378349b51676j955716b37459q08313A145074a864616B65635a610325
$$ y = [-1829541, 3856993, -2087235, -1148786, 2644234, 1075860, 1035328, -48755, 1238925, -513252, 2692809, 3780139, -2780782, 1008993, -1109532, -2944494, 2116421, -4384616, -464190, -1377486, 485495, 3061642, 2644476, 3017147, -6976087, 5460735, -1553579, 2603402, -6427770, 3505249, -2596137, -2315185, 1785444, -282056, -366024, 3483698, -641444, 4103662, -601238, 2881305, -3059125, 4630495, -3917326, -1508717, -5122249, 3854714, 1563492, 330249, -1336957, 6105296, -2006806, -2410416, -4361369, 2800068, 431890, 1095350, 942108, 513588, -2532371, 2030150, 542019, 2253796, 1335337, 768493, 5865060, -140921, 918698, -5732285, 4378349, -251676, -2207392, -237459, -1045772, 1145074, -1864616, 265635, -1610325]
1813B105460f930047b740973i89513B249937P51919c545429E31029B51226P01814
1804I53040c800351F660557c150697j13562E69824c021079F95956f32027C546358
1794a945645d56078A12586K68843L023585j241451d76475A708468l60751Q43450
1785B191167c045373A301554l99351b800172D052863i58492n41349m629280A492915
1775a537605p25791C239617q54166i38695j411413n0912g44826k467683C421611
1765A415409c168011P82265P94041D03628g55155B64518a151408j331598A312322
1755a674636m109571C879559c791530e57306E8885K113345A49616J081954d239152
1745A455278e36895j774174C288474E50619c351558C638293g13584j85242A48703
$$ y = [2105460, -6930047, -2740973, -989513, 2249937, 3001856, -3545429, 531029, 251226, 953040, -3800351, 6660557, -3150697, -3264259, 569824, -3021079, 695956, -632027, 3546358, -1945645, -456078, 112586, 381429, 3405014, 2163563, -476475, 1708468, 1347717, 2191167, -3045373, 1301554, 902203, -2800172, 4052863, -958492, -1499841, -6129121, 1492915, -1537605, -2263396, 3239617, 2385451, -938695, -2350108, -2401020, -744826, -3212509, 3421611, 1415409, -3168011, -2385746, -1591705, 403628, -755155, 264518, -1151408, -2483006, 1312322, -1674636, -5784207, 3879559, -3791530, -557306, 58885, 2172230, 149616, 1231570, -4239152, 1455278, -536895, -2311069, 3288474, 550619, -3351558, 3638293, -713584, -898826, 148703]
1735a436671A069678f938815A985817b857441C771546a046011C599987b717024
1726A822407N27193E39325c663378a741233A618666e31109o01499I50402e06474
1716d58548J54289k072926I38913a191108I45889M77991c90680p38538m48067
1707a577285j218600P31597B396203a459675l64277A078449f72893B342034b73078
1697B843259c31547j111955B641696G47976J242503B92473J823383c385004H22333
1687H72232M606433c089120a315356B411035G97212d482799D633314E41278c23282
1677F393372h21907m648589A868822A01004i2185m264817B915401F18533a218727
1667a481193f04732j506863B330988I90438c146205H91896c59252A555006b39295
$$ y = [-1436671, 1069678, -6938815, 1985817, -2857441, 3771546, -1046011, 3599987, -2717024, 1822407, 2349600, 539325, -3663378, -1741233, 1618666, -531109, -1132608, 950402, -506474, -458548, -304259, -2377185, 938913, -1191108, 945889, 1423880, -390680, -1129218, -1577285, -2795885, -2064288, 2396203, -1459675, -1823952, 1078449, -672893, 2342034, -273078, 2843259, -331547, -1443502, 2641696, 747976, 1990479, 292473, 2115856, -3385004, 822333, 872232, 5478665, -3089120, -1315356, 2411035, 797212, -4482799, 4633314, 541278, -323282, 6393372, -821907, -5470496, 1868822, 101004, -92185, -4357002, 2915401, 618533, -1218727, -1481193, -604732, -2111595, 2330988, 990438, -3146205, 891896, -359252, 1555006, -239295]
1657g07307j907368a158870D96886a026014A46785P5584K734185A18740g90222
1647A669240h63391k4860E339703j685530f21382B544284l79250d233836A2461
1637b16501C98517e351207B137155f68475k976309B166674g33042A157511c626591
1627c22278A075616L53763D79124b032456C69716c158034A689642G07329c85108
1617a690297k36421H67545K213601a530959l201278a722662E608695A875507A21571
1607E30666J366113G2354L37909d19169j66181j223442A363527a714326O15803
1598a098523B844539b108420D893822a720646l00606H38508N5536c317223M21856
1589b895367J377985A284523e66376B58778J349705k79991A85642L67795C1827
$$ y = [-707307, -2614675, -1158870, 496886, -1026014, 146785, 222369, 2956554, 118740, -790222, 1669240, -863391, -888251, 5339703, 3654173, -621382, 2544284, 2165034, -4233836, 12461, -216501, 398517, -5351207, 2137155, -668475, -3644784, 2166674, -733042, 1157511, -3626591, -322278, 1075616, 1429379, 479124, -2032456, 369716, -3158034, 1689642, 707329, -385108, -1690297, -1926718, 867545, 3081146, -1530959, -4732237, -1722662, 5608695, 1875507, 121571, 530666, 1896779, 72354, 410263, -419169, -585350, -1808792, 1363527, -1714326, -1098523, 2844539, -2108420, 4893822, -1720646, -2021252, 838508, 894044, -3317223, -2895367, -1517382, 1284523, -566376, 258778, 1608483, 1328492, 185642, 553437, 31827]
1579a255531A320370b190062i39736l093249C302275j518057J334705A484430
1570b940956A257822K18630p9058F10767d484064A166185d23398B685613E0308
1560D011563a291813B521544a899094C894792j412081h10371D348001d18831l032505
1551c451336d30613j278085I91894b067949f15143B922439A023643a784093A638041
1541c603593A088239d21430F431993a994432A110701D52711E7921K487415a662420
1531a217112F71606J714051e74554l052592a013791H49898a587570F084997d128131
1521C248624a45394r64428H9674L723023A290355L249241c563183A546738c257930
1511B667844c732147B180975H02662A28739L261317c660066I63781B59575A7059
$$ y = [-1255531, 1320370, -2190062, -939736, -4032985, 3302275, 1784218, 3118923, 1484430, -2940956, 1257822, 1476452, 1397394, 610767, -4484064, 1166185, -423398, 2685613, 50308, 4011563, -1291813, 2521544, -1899094, 3894792, 2482711, -810371, 4348001, -418831, -3451336, -430613, -1708698, 991894, -2067949, -615143, 2922439, 1023643, -1784093, 1638041, -3603593, 1088239, -421430, 6431993, -1994432, 1110701, 452711, 57921, 2545336, -1662420, -1217112, 671606, 2385657, -574554, -3627146, -1013791, 849898, -1587570, 6084997, -4128131, 3248624, -145394, -1109822, 89674, 3812697, 1290355, 4539596, -3563183, 1546738, -3257930, 2667844, -3732147, 2180975, 802662, 128739, 3390056, -3660066, 963781, 259575, 17059]
1501d341980B408106G49612f7191A114508A65400b285837C861741f62577j728827
1492b391404f15020g9482j511852M65129b46957F34641c308201B658119L12830
1483B970949j097194b47522C51375N82664c814731A817478E97256b127306f69595
1473c273473C89196J128667J202045d821582d46619o0848j291812L85944k302531
1464c715866E848931d815813b10872l735538c79792A25874e41521l816166D576324
1454B540012b869916C013648e614985G24647J10269a507745j16959E557739c148563
1444b168393R12172D82613L123162f084355D263470a761905F07500O45843j60875
1435A092468d110124I1927b377977c4694B811502g347240A534256a238299o70886
$$ y = [-4341980, 2408106, 749612, -67191, 1114508, 165400, -2285837, 3861741, -662577, -2391404, -615020, -79482, -1591334, -1126205, -246957, 634641, -3308201, 2658119, 2970949, 1873755, -247522, 351375, 934039, -3814731, 1817478, 597256, -2127306, -669595, -3273473, 389196, 1517863, 2719908, -4821582, -446619, -507467, -1799279, -1413335, -3715866, 5848931, -4815813, -210872, -3946410, -379792, 125874, -541521, -4357687, 4576324, 2540012, -2869916, 3013648, -5614985, 724647, 834916, -1507745, -1624704, 5557739, -3148563, -2168393, -1256221, 482613, 3605775, -6084355, 4263470, -1761905, 607500, 1253343, 1092468, -4110124, 91927, -2377977, -34694, 2811502, -7347240, 1534256, -1238299, -1909185]
1426a909185j253438F48385J925681c068448B947599j431030D04233L427644P96688
1417D628565e541785f3925l536199G887202A955715b746713c10455k366392B766444
1407B656403F0380d64283B023937a253091C225354a532850I531766a25721m85448
1398f11169m493351C926191n21915a765742m626871B352453A169827F3301e625564
1388C383442Q57311a513395C441932f565514a96351r95923D03251c112881g04665
1378g96283C631125A432436j76229f03956l265804A627161J060592j290539m14091
1369I83123a604934B144679n84845c792103C770008b65281A095539L007608b789009
1359i73469F19554h66066c06045D235267b958948B238278b836570i22646k418086
$$ y = [-1909185, -3162623, 648385, 2574066, -3068448, 2947599, 1516569, 404233, 3831877, 4628565, -5541785, -63925, -3600124, 7887202, 1955715, -2746713, -310455, -2676847, 2766444, 2656403, 60380, -464283, 2023937, -1253091, 3225354, -1532850, 9531766, -125721, -611169, -5104520, 3926191, 3404276, -1765742, -6392613, 2352453, 1169827, 63301, -5625564, 3383442, 4240753, -1513395, 3441932, -6565514, -196351, -1192274, 403251, -3112881, -704665, -796283, 3631125, 1432436, 1256207, -603956, -3869760, 1627161, 2687753, 1397214, 983123, -1604934, 2144679, 1559834, -3792103, 3770008, -265281, 1095539, 4103147, -2789009, -973469, 619554, -866066, -306045, 4235267, -2958948, 2238278, -2836570, -922646, -3340732]
1350c340732a116122K96717D555914O25340b878957J435022A848175c23262B72338
1340D051624P50259a100037l803890f02693F14361M023994e73236j423258i88143
1330b858926B585202a721114m007152a483030j136814C367313j46066a0286014
1321A982481E77911J835366d56870J55162D079444B36770J124330a908531j037281
1312b945812C84939K82963d077599c23472n48359c1092C623055f099233i41987
1302A336015f220649C360203b096095D949331F80376K577935k61083d780630A558370
1292B309422g06470a45220C035803B75480a337894K30450N50301p79698A567814
1282D662555e422993d71386A501470f34627l10382c02458n02942j842984a127560
$$ y = [-3340732, -1116122, -819405, 4555914, 5181254, -2878957, -1443935, 1848175, -323262, 272338, 4051624, 4801883, -1100037, -4903927, -602693, 614361, 4638355, -573236, -1996494, -988143, -2858926, 2585202, -1721114, -5728266, -1483030, -2619844, 3367313, 3221247, -10286014, 1982481, 577911, 2413277, -456870, -301708, 4079444, 236770, 1361100, -1908531, -2945812, 384939, 667902, -4077599, -323472, -871831, -31092, 3623055, -6099233, -941987, 1336015, -6220649, 3360203, -2096095, 4949331, 680376, 3258311, 2997228, -4780630, 1558370, 2309422, -706470, -145220, 3035803, 275480, -1337894, -1107444, -557143, -1336841, 1567814, 4662555, -5422993, -471386, 1501470, -634627, -945009, -302458, -805400, -2648384, -1127560]
1272f59866C450109A079306g78564C690096c585061P08420E74137A64613b329280
1262E802398d31945A10335a760245B738345h99832C96133h47871n60119E996452
1252E02843b232333B96832J37944N81080l98358b6838B132998a653987C532c871707
1241D031278a43655j709464a33485A194042b412287o3586A88112m5654d761262
1231a353276A10490Q6419J41397A36458M841865c821662a434654A385545m41209
1222I44336h039B376085g947380A947652j33191p47834O3489n11273L168350I12652
1211c528287A886234o63242Q94485d674638B034015R47003e220570a843808B992582
1201c462472r11708B688019H41792a032729k176004J494604B255756h65294J22825
$$ y = [-659866, 3450109, 1079306, -778564, 3690096, -3585061, -2876641, 574137, 164613, -2329280, 5802398, -431945, 110335, -1760245, 2738345, -899832, 396133, -847871, -1407990, 5996452, 502843, -2232333, 296832, 434776, 1015856, 617498, -26838, 2132998, -1653987, 3532, -3871707, 4031278, -143655, -1853119, -133485, 1194042, -2412287, -2475873, 188112, 142458, -4761262, -1353276, 110490, 196909, 338306, 136458, 4978323, -3821662, -1434654, 1385545, 944336, -8039, 2376085, -7947380, 1947652, 1814461, 1066627, 1130116, 618843, 3787193, 912652, -3528287, 1886234, 1222992, 2117477, -4674638, 2034015, 2981018, -5220570, -1843808, 2992582, -3462472, -4374180, 2688019, 841792, -1032729, -3208733, -1714129, 2255756, -865294, -742469]
1192g42469k210486a88014m067749E722623A692098D26953d62483n25443h8528
1182A901765b175571B859604k21002a781225f78208G18870a741051M34430j095013
1173b401634F161678c312398D71755a92515p70384H12460a119441A262134J691043
1164B953177d705274B533542b963503A179044a462961H27316B9901c513516D128116
1154B278062I33480l95773L49541J363457F40173A3055d21689j177358B72581
1144a742801m92953H52823L350906a64068B21969h35215j008503O51091M11932
1135g80695D161395j861055e085414J808678B336730E24148L64603a288069D641021
1125d273544H4390N334030g23928B068587O68542E46322d809890d76588j198435
$$ y = [-742469, -2952955, -188014, -4255763, 5722623, 1692098, 426953, -462483, -987926, -88528, 1901765, -2175571, 2859604, 2638602, -1781225, -678208, 718870, -1741051, -1306621, -2401634, 6161678, -3312398, 471755, -192515, -962899, 812460, -1119441, 1262134, 2953177, -4705274, 2533542, -2963503, 1179044, -1462961, 827316, 29901, -3513516, 4128116, 2278062, 933480, 537707, 887248, 2250705, 640173, 13055, -421689, -1599047, 272581, -1742801, -2235754, 852823, 4203729, -164068, 221969, -835215, -1843718, -1192627, -780695, 4161395, 2300340, -5085414, -3276736, 2336730, 524148, 888751, -1288069, 4641021, -4273544, 84390, 5418420, -723928, 2068587, 2737129, 546322, -4809890, -476588, -1675023]
1116a675023r51914A10238a385480a67408p99146D614587a337942A709776b196310
1106c690864A064400M55169L384139b070002k59732h0494L083A656450a371081
1096a391893B240399N186115e356156A04446Q73814M067167f121039B65760J800101
1087B065861b250607I38395b887002d22605D62471L521395A119586J531404a545369
1077A322535a101542A734764b274032a73386H91845g50845B8092J281103c60496
1067a261278j467329c94129Q1387C62134b245650C372562c192665A233884c978658
1057b240577J017484G909921e71065j702812A870078a33771r91936l450048a389995
1047b747903D507388a998829C862884a560111F563643g5036k102078D443636E00121
$$ y = [-1675023, -2626937, 110238, -1385480, -167408, -966554, 4614587, -1337942, 1709776, -2196310, -3690864, 1064400, 1519569, 4903708, -2070002, -2329734, -80494, -77411, 1656450, -1371081, -1391893, 2240399, 7426514, -5356156, 104446, 978260, 5045427, -6121039, 265760, 2065861, -2250607, 938395, -2887002, -422605, 462471, 3983866, 1119586, 2650990, -1545369, 1322535, -1101542, 1734764, -2274032, -173386, 891845, -750845, 28092, 1309195, -360496, -1261278, -2728607, -394129, -312742, 362134, -2245650, 3372562, -3192665, 1233884, -3978658, -2240577, -1223093, 7909921, -571065, -2273877, 1870078, -133771, -1125707, -4575755, -1389995, -2747903, 4507388, -1998829, 3862884, -1560111, 6563643, -75036, -2177114, 4443636, 500121]
1037e862010b51576k478233C272783b932788a96322m76336D17669c797943b66782
1027C64670K480875b31388A382993c004040e08968C869770a032573C321888m1675
1018C280213B63085a297861j187727A96943b847898B206528c109334B454044a774961
1008i51946k622934C852954j888167a427389d14830A949631a426386D512904e399827
998D125439c449897G165004B35932M0866b444363n55730A809350J154210a112138
988A821470d757870A348330L861453i40464L82584p326552G994927e59353B026477
978C078236a264220B338231r94363b760507B645864c242102A514411g29231C046876
968b914490E663485b111784g85139k434995B465563a641805j387631C055947b390058
$$ y = [-5862010, -251576, -2729809, 3272783, -2932788, -196322, -672658, 417669, -3797943, -266782, 364670, 2845545, -231388, 1382993, -3004040, -508968, 3869770, -1032573, 3321888, 3280213, 263085, -1297861, -2485588, 196943, -2847898, 2206528, -3109334, 2454044, -1774961, -951946, -3574880, 3852954, 1964787, -1427389, -414830, 1949631, -1426386, 4512904, -5399827, 4125439, -3449897, 7165004, 235932, 276798, -2444363, -3000093, 1809350, 2963560, -1112138, 1821470, -4757870, 1348330, 5209783, -940464, -557880, -7884432, 7994927, -559353, 2026477, 3078236, -1264220, 2338231, 1343868, -2760507, 2645864, -3242102, 1514411, -729231, 3046876, -2914490, 5663485, -2111784, -785139, -3220134, 2465563, -1641805, -3029436, 3055947, -2390058]
958a823050j76198C8913J572311L388377a0179824a930974R62303C589610B46874
948a810429F470166a991031R12191k83583A860773a567996j083759A998076a016321
938A69316N657431a85375A109948a963108A310856C2124a19418m055276c0902
928C302684b158189G781744b869167C412738b257833P19594A256443c40232G071586
918H43669a748714A079095a533136q70811L1239P46928c37018D16484k7122J01358
908D90720b279650B250668c556736J084050g65924A05384L712068c835692A112371
898b862283q78564f50777B628028j117779K44004E91119c538456E45428K970362
889C515790c702229E55718a066709D548315a195515B818856k44256j286764c403935
$$ y = [-1823050, -1999248, 38913, 1611224, 4999601, -10179824, -1930974, -968671, 3589610, 246874, -1810429, 6470166, -1991031, -1078840, -1362423, 1860773, -1567996, -2651755, 1998076, -1016321, 169316, 5826747, -185375, 1109948, -1963108, 1310856, 32124, -119418, -4174694, -30902, 3302684, -2158189, 7781744, -2869167, 3412738, -2257833, -1538239, 1256443, -340232, 7071586, 843669, -1748714, 1079095, -1533136, -2403947, -2372708, -1625780, -337018, 416484, 389362, 490720, -2279650, 2250668, -3556736, -2472686, -765924, 105384, 3817452, -3835692, 1112371, -2862283, -3740847, -650777, 2628028, 1510249, 1754253, 591119, -3538456, 545428, 3515790, -3702229, 555718, -1066709, 4548315, -1195515, 2818856, 2574600, 1287836, -3403935]
879b224174k442727F728740b509324a092812b52966C304269d820213A510870e242650
869C455317p64774a457300j870761A817984L640738c051013a264996C47615a739038
859C537844j079093p96842A57308L794716D72306K032186b25582C633085e49145
849F81682B28563a233298C626000A36489J107552E61213a149609A141889d314959
839i63862A885052d067452B437290F67230h88436B892834c621602D323051e52646
829b304439r58282b69441k759323C49844d296482F099745a462675A972149b524346
819C716251b295210O44207E788059c571777A105683h54231B26109L096120a545756
809B544633g081116G09647O83822F20102b062264O30303B32608a920162A199594
$$ y = [-2224174, -4666901, 6728740, -2509324, -1092812, -252966, 3304269, -4820213, 1510870, -5242650, 3455317, 2690543, -1457300, -3328061, 1817984, 5458722, -3051013, -1264996, 347615, -1739038, 3537844, 2458751, 1661909, 157308, 3952024, 472306, 2504492, -225582, 3633085, -549145, 681682, 228563, -1233298, 3626000, 136489, 1244041, 561213, -1149609, 1141889, -4314959, -963862, 1885052, -4067452, 2437290, 667230, -888436, 2892834, -3621602, 4323051, -552646, -2304439, -3262721, -269441, -3028764, 349844, -4296482, 6099745, -1462675, 1972149, -2524346, 3716251, -2295210, -1651003, 5788059, -3571777, 1105683, -854231, 226109, 3322229, -1545756, 2544633, -7081116, 709647, 1393469, 620102, -2062264, -1431961, 232608, -1920162, 1199594]
799A820913a866977E646149e642790B301912H14788L267081j983491a171536B762530
789D046767F55562L875124d52282C66554J241397c286105a597574I84583L350728
780D335311h950210B012740L471468d250855A639374b73885n558721C731770O34459
771D366229A541232d17254a68081A613998i53510G54434a144774b65460k881449
762c146909B684207q82185D3506d23656j981835J083778j653086C086337j061091
753B025246E98783N0290O55567c29222k492495j3392C096609j255463A4326d049796
742c741286a93624C710172A599737c174084G574707b705535H21239Q70907G4147
732b357097J030010G71419G2985b248350B063470o04634J071829a340224G22100
$$ y = [1820913, -1866977, 5646149, -5642790, 2301912, 814788, 4081869, 2098378, -1171536, 2762530, 4046767, 655562, 4530686, -452282, 366554, 1607951, -3286105, -1597574, 984583, 4335311, -8950210, 2012740, 5484208, -4250855, 1639374, -273885, -5832606, 3731770, 4366229, 1541232, -417254, -168081, 1613998, -953510, 754434, -1144774, -265460, -3146909, 2684207, 1802022, 43506, -423656, -2405491, -1321713, -2974799, 3086337, 2025246, 598783, 649073, 1304640, -329222, -2821717, -2835109, 3096609, 1841146, 14326, -4049796, -3741286, -193624, 3710172, 1599737, -3174084, 7574707, -2705535, 821239, 1692146, 74147, -2357097, -1327087, 771419, 72985, -2248350, 2063470, 1458836, 2530665, -1340224, 722100]
722E22008P94522K936689a101436B198994a814986C517568I51970L807415i031591
712b5259230h920701p725349e205558B1087576J0702238A2416210L064745n901638
704I579317c7899o296668k7173822J0533611r297308o487138B0010892J8729830
696C8740722j4985712N908766p031474a2650299O052928J10648a174533E116022
687a140635G88098J869822a439602k741422a838903A373529J328720c03694k381071
678b684765Q2538D326042b952002J178200G209520K1634427I787432e712598k1641761
669b7354359r919621c394122k4243618O952600F129051R19126L7906675j9411225
661B5543627A0237974f423729K689895j5788946B484675a5690346j0911387a0939213
$$ y = [522008, 1316530, 4253219, -1101436, 2198994, -1814986, 3517568, 951970, 4759385, -9031591, -25259230, -8920701, -16646050, -5205558, 21087576, 31789814, 12416210, 15480955, 9579317, -37899, -6334567, -33508389, -22974778, -32272086, -38759224, 20010892, 38740722, 23755010, 29663776, 22632302, -12650299, -6597371, -6486723, -1174533, 5116022, -1140635, 788098, 2657920, -1439602, -4181024, -1838903, 1373529, 2702249, -303694, -2684765, -2602227, 4326042, -2952002, -1773802, 7209520, 28843947, 9787432, -5712598, -27354359, -37273980, -3394122, -27637740, -20685140, 6129051, 7048177, 44954852, 25543627, 10237974, -6423729, -3733834, -19522780, 2484675, -15690346, -26601733, -10939213]
652I29820J7394072I089789e82690C575504G37282e453347E567198L80823c46444
642b15785H189743c193326c89055F19097b742312A093100J118968M950677d482568
632a923810E9452N57867a553423a0436n43162G664057c223882A292256J676466
623B968722K228995J0160864J9258128M6772611M0915415c61019722J65764818
616a95254904P3545250B59364875B6417990q938124E264862O158549B546364L837841
608F384205B363739R64820p82845M60781m53466H36227K772989h76524B183254
598d12874l039006J93111A953723J072338A217590c263918A627245c162687c7263
588a548906B011971e937686F833923a323440D80347P25806K268084b021656A305652
$$ y = [929820, 18323892, 9089789, -582690, 3575504, 737282, -5453347, 5567198, 5948021, -346444, -215785, 8189743, -3193326, -389055, 619097, -2742312, 1093100, 2212068, 7162745, -4482568, -1923810, 59452, 617319, -1553423, -10436, -553598, 7664057, -3223882, 1292256, 2968722, 5197717, 15358581, 34616709, 81389320, 122304735, -361019722, -195254904, -121709654, 259364875, 26417990, 17479866, 5264862, 11423411, 2546364, 6384205, 2363739, 3328559, 2545714, 3006495, 2553029, 836227, 3609216, -876524, 2183254, -412874, -3451880, -3258769, 1953723, 3026061, 1217590, -3263918, 1627245, -3162687, -37263, -1548906, 2011971, -5937686, 6833923, -1323440, 480347, 1206153, 3474237, -2021656, 1305652]
578A350092L535308b492334A932567o78381N233712a396813j09271G528888d311760
568a92829B199023g51398C83859d079949G13624O47010a13996l308166A857881
558C898490g5985j156524B425071a78779A502248N8889a642541B097801h81785
548a164356B670496J92583g10689G00583b740416n57747D649985i73414o22413
539a595827J0765A725553c705119H238935a913970F50984c618087A003400a452904
529C611343j513463c534698E655605e083197C849328b89934j202301C257931N384645
520H642576a125450k739799A762366a254801C571433d487119I42012a130863C954285
510d050577A717598a779513E37908B21574M04610a555945F459829A104369b196365
$$ y = [1350092, 4885400, -2492334, 1932567, 1254186, 6487898, -1396813, -1506084, 7528888, -4311760, -192829, 2199023, -751398, 383859, -4079949, 713624, 1360634, -113996, -3422162, 1857881, 3898490, -75985, -1232509, 2425071, -178779, 1502248, 1561137, -1642541, 2097801, -881785, -1164356, 2670496, 2863079, -710689, 700583, -2740416, -3298163, 4649985, -973414, -1595827, -1585062, 1725553, -3705119, 8238935, -1913970, 650984, -3618087, 1003400, -1452904, 3611343, 2097880, -3534698, 5655605, -5083197, 3849328, -289934, -1492235, 3257931, 8642576, -1125450, -3865249, 1762366, -1254801, 3571433, -4487119, 942012, -1130863, 3954285, -4050577, 1717598, -1779513, 537908, 221574, 626184, -1555945, 6459829, 1104369, -2196365]
500A277082a864119C070701a226247B011599L460962p30343g067796C227886B109
490F326823a113317J21399m269815E554217a379771H19556e211297B65416P49015
481A014431f059904a077190A873194a769645J36389A458769c427115D705500e147916
471I61511J463733b929433H42016b74588o5754k131691k850188A814374c272669
461F10718K035322H24461i20011D567407k183685c535231B370975J74132o61652
452A883455J455050d762891A261663a315428d64403C519808A42664g68713j788879
443b557592H88843O995736d404222K096525j157697F8901J470970L64501a180452
433B521231b848935a184432M39446n15263D611251a849078f22009E35212c32328
$$ y = [1277082, -1864119, 3070701, -1226247, 2011599, 5472561, 4742218, -7067796, 3227886, 2109, 6326823, -1113317, -991918, -5261733, 5554217, -1379771, 819556, -5211297, 265416, 1014431, -6059904, -1077190, 1873194, -1769645, -1633256, 1458769, -3427115, 4705500, -5147916, 961511, 2425244, -2929433, 842016, -274588, -340342, -2472033, -5322221, 1814374, -3272669, 610718, 2646040, 824461, -920011, 4567407, 2383722, -3535231, 2370975, 2545107, 1883455, 3338505, -4762891, 1261663, -1315428, -464403, 3519808, 142664, -768713, -2557592, 888843, 7884579, -4404222, -2307697, -3465394, 68901, 1539871, 1904372, -1180452, 2521231, -2848935, -1184432, -744986, -1260249, 4611251, -1849078, -622009, 535212, -332328]
423B444702d049013I3637b143053f86750j320690j346686E061302d042803G666463
413a473369D26479j28778J622271B20267a982162e12290m172801D257180A989709
403A394402a129982D808826d874018A821834H32796e028276q15324A786723J939644
394C726367e22669j609j190843l218984D481848a291255a49167A008041a006635
384B116919b444089A42829e192350D772058c329113f28901G651157d68733l0153
375d98886J60589C044925b528002F88613l03576K473487a758938M81466F49069
365b241709n26865A76064M053866d586044E574562c041137a052184B038472J65157
356B203629O53313a234638A526468a220268b86385j700661l11970N74159a83959
$$ y = [2444702, -4049013, 93637, -2143053, -686750, -2007440, -3354126, 5061302, -4042803, 7666463, -1473369, 426479, 297701, 1919972, 220267, -1982162, -512290, -4685091, 4257180, 1989709, 1394402, -1129982, 4808826, -4874018, 1821834, 832796, -5028276, -5843600, 1786723, 3726367, -522669, -524278, -1715121, -4934105, 4481848, -1291255, -149167, 1008041, -1006635, 2116919, -2444089, 142829, -5192350, 4772058, -3329113, -628901, 7651157, -468733, -498886, -338297, 3044925, -2528002, 688613, 385037, 2858524, -1758938, -1277472, 649069, -2241709, -2768574, 176064, 4229930, -4586044, 5574562, -3041137, -1052184, 2038472, 2203629, 2856942, -1234638, 1526468, -1220268, -286385, -1987046, -2299016, -1724857, -183959]
346B753850a70087A795805b996394D186657e738679E507366c447939a144172A606328
336b515328l858257d87362H02894N34714j10867c025039B081498M259304a550307
326c2158A798794Q16445A116610e814119b199640E00272K875731A480166b487640
316B676855c02546H40783g18076k288235C384589d618961A134705m03632a529620
306b674498D492247a912628h84333C508710b472414A144127J859745b913864e78388
296H23762M77188K387102E79944L412188a017727F27966J840353a080041r9085
287a179126m89767g72044C926299F6855R7991i64196B068103j4537d891472B177715
276E84053J175698P73841c664080A291961c920566A715732h89567j146284A161795
$$ y = [2753850, -170087, 1795805, -2996394, 4186657, -5738679, 5507366, -3447939, -1144172, 1606328, -2515328, -6373585, -487362, 802894, 1337608, 1226741, -3025039, 2081498, 6340802, -1550307, -32158, 1798794, 2615239, 1116610, -5814119, -2199640, 500272, 3376003, 1480166, -2487640, 2676855, -302546, 840783, -718076, -3006311, 3384589, -4618961, 1134705, 731073, -1529620, -2674498, 4492247, -1912628, -884333, 3508710, -2472414, 1144127, 3003872, -2913864, -578388, 823762, 1300950, 3688052, 579944, 3992132, -1017727, 627966, 2468319, -1080041, -1179126, -1668893, -772044, 3926299, 66855, 164846, -964196, 2068103, 2053566, -4891472, 2177715, 584053, 1759751, 2533592, -3664080, 1291961, -3920566, 1715732, -889567, -2035851, 1161795]
266B615657b674683j308602B0355J127881e85953B460598a724208K80692q19900
257b263416l056001A27689J756176d029722H31886l7968c92394B559827I43371
247B226939a247896k118957Q78101l626122B685467b665499B900760D50299e51479
237A010142J050213c294036A86902c675914d51211j669950p73411A522536b643403
227B687107O08294A78118J597099c270666B765020h07266A225276C0592O62287
218F92879N704785f53832j177095p24396F890132C272034p83472a559411K98155
209a261256C157918D60750R44188F96570e65084m67047k790576B360649b267455
199G201436B586404f37878A642716L43916c582131J475294C114474G76883e708041
$$ y = [2615657, -2674683, -3983285, 20355, 1148236, -585953, 2460598, -1724208, -1443516, -2263416, -5319417, 127689, 1883865, -4029722, 831886, 793918, -392394, 2559827, 943371, 2226939, -1247896, -3366853, -2488752, -6114874, 2685467, -2665499, 2900760, 450299, -551479, 1010142, 2060355, -3294036, 186902, -3675914, -451211, -2121161, -2894572, 1522536, -2643403, 2687107, 3295401, 178118, 1775217, -3270666, 2765020, -807266, 1225276, 30592, 692879, 6397664, -653832, -1830927, -2555323, 6890132, 3272034, 2488562, -1559411, -1261256, 3157918, 460750, 1404938, 696570, -565084, -1032131, -3822707, 2360649, -2267455, 7201436, 2586404, -637878, 1642716, 1986632, -3582131, -2106837, 3114474, 776883, -5708041]
189A810587G30415a789309n6522927j54016117B1216252R125096J69693158H0241937
180A99500952f626446j8530671j58712750e0091209F107029f31455K69815B207300
171c487552C581083c520448e8102k25466C765846F9827L072982F45666a711059
161c321219E28379L33412J41162a438818D93169b462230K37485D078398g93492
151b290839A495444a1060479B176323c17340q38218B169716a893176A643019p67597
142H75422e101745i16189E048744b092945D030269e545422C496373c673981J400519
133b273462i22651B571835e819006A401915C91190L85798J114359b464832B160594
123a953782B361509A038674R8471c373164D405411e087545n91160a467332F367270
$$ y = [1810587, 730415, -1789309, -58312236, -212328353, 21216252, 30341348, 200034506, 80241937, 199500952, -6626446, -25157117, -183869867, -50091209, 6107029, -631455, -361640, 2207300, -3487552, 3581083, -3520448, -58102, -283568, 3765846, 69827, 3142809, 645666, -1711059, -3321219, 528379, 861791, 1002953, -1438818, 493169, -2462230, -2224745, 4078398, -793492, -2290839, 1495444, -11060479, 2176323, -317340, -1155558, 2169716, -1893176, 1643019, 875422, -5101745, -916189, 5048744, -2092945, 4030269, -5545422, 3496373, -3673981, -2273462, -922651, 2571835, -5819006, 1401915, 391190, 776988, 1891347, -2464832, 2160594, -1953782, 2361509, 1038674, 1137145, -3373164, 4405411, -5087545, -5678705, -1467332, 6367270]
113E11391c08406D082954a342893A967069a077783e25636r24600b52497A552993
103b18983R932k797907B052045J239377a115244l621707E60548K059104a429574
93D45816d730178a680060j588696B41787J863588Q91644k4281a152865B79546
83h98908A798565c788411C203492J152265a14581C74292d87501o0244C723747
73D335465a376499A398941b622104B893489b993813I52050k63433e087889A328918
63I10920J65262c322858c0634E71210c15592j714904B23286L4655M963507A568118
52a81788B308883b389861J058541A857003c429149A13923d875827B030665I23875
42D474415b190259e36022j343718B873333G81549e739796A118790a287056k401603
$$ y = [511391, -308406, 4082954, -1342893, 1967069, -1077783, -525636, -1450236, -252497, 1552993, -218983, -209051, -3006958, 2052045, 3291422, -1115244, -4736951, 560548, 2619652, -1429574, 445816, -4730178, -1680060, -3268756, 241787, 2105375, 2997019, 2972738, -1152865, 279546, -898908, 1798565, -3788411, 3203492, 4355757, -114581, 374292, -487501, -547745, 3723747, 4335465, -1376499, 1398941, -2622104, 2893489, -2993813, 952050, 688617, -5087889, 1328918, 910920, 1076182, -3322858, -30634, 571210, -315592, -2030496, 223286, 257941, 5221448, 1568118, -181788, 2308883, -2389861, -1331320, 1857003, -3429149, 113923, -4875827, 2030665, 923875, 4474415, -2190259, -536022, -1879740, 2873333, 781549, -5739796, 1118790, -1287056, -3688659]
33c688659C068483b965300E896593c260826J083807C60273b626058O87131A036925
23i17714E176320b955019C395459g4588E637764c811086A191272b271721E636098
13b021850a51844l05291k128888B527724i74416G83938B24696J262630D31569
3e87634A912211a478593A57057
$$ y = [-3688659, 3068483, -2965300, 5896593, -3260826, -2177019, 360273, -2626058, -1938927, 1036925, -917714, 5176320, -2955019, 3395459, -74588, 5637764, -3811086, 1191272, -2271721, 5636098, -2021850, -151844, -457135, -2586023, 2527724, -974416, 783938, 224696, 1487326, 431569, -587634, 1912211, -1478593, 157057]
##PAGE= F1=5618.780329767
##FIRST=     21204.543296753, 2672.49122660428, -1432955
##DATA TABLE= (F2++(Y..Y)), PROFILE
2047a432955k212435b4768D95701A3694a869536B387538c177571D57919J298798
2038A756717c475975b39831C66460a222896l02783I00164K894401c508573a12888
2028b07782k957984k47191B743140a761884A147990O00989b599272E98662J972255
2019B570917E97521g705706B842207d009684h8608k903040N01519B697420o49051
2010B048369c854097C133213d252623I02360c227934A265820k60764f58582B227047
2000B7903a787481B509740m59998B12279L883311a753012M90078D092771a377494
1990a794350A809907c103222C084154A400761c817125i72480D318929d382687
1981c076010D451672d261258h10548B341089J656715g69371o322215a873918C98884
$$ y = [-1432955, -3645390, -24768, 495701, 13694, -1869536, 2387538, -3177571, 457919, 1756717, -3475975, -239831, 366460, -1222896, -1525679, 900164, 3794565, -3508573, -112888, -207782, -3165766, -3412957, 2743140, -1761884, 1147990, 1748979, -2599272, 598662, 2570917, 597521, -7705706, 2842207, -4009684, -88608, -2991648, -2490129, 2697420, 2048369, -3854097, 3133213, -4252623, 902360, -3227934, 1265820, 1005056, -658582, 2227047, 27903, -1787481, 2509740, 2049742, 212279, 4095590, -1753012, -1262934, 4092771, -1377494, -1794350, 1809907, -3103222, 3084154, 1400761, -3817125, -972480, 4318929, -4382687, -3076010, 4451672, -4261258, -810548, 2341089, 3997804, -769371, -7091586, -1873918, 398884]
1971E54456K019993d718961J137807A690594b242363J13385D267222f28729m02382
1962a031111E281126h83656A992784i22973B663608a062345k534174a243662F472386
1952c225571g34975C636667b798302B548729b770459D89442f31170l424893a300279
1942E593732d700744D796085C73818c240772E491409e810341C764831b924113
1933B564819g67588C867926a381037C217403J826847H01534b546486G253642H36946
1923C15872b265161A615552J55791b889228A277244g46968A877988J014468C97817
1913b48974j93923C050210c317618A221850c176508e32230C284051a377391c22926
1903c313746B792464b011842B259747D50897M023971c769417B461739r41669J821899
$$ y = [554456, 2574449, -4718961, -3581154, 1690594, -2242363, -2128978, 4267222, -628729, -1031111, 5281126, -883656, 1992784, -922973, 2663608, -1062345, -3596519, -1243662, 6472386, -3225571, -734975, 3636667, -2798302, 2548729, -2770459, 489442, -631170, -4056063, -1300279, 5593732, -4700744, 4796085, 373818, -3240772, 5491409, -5810341, 3764831, -2924113, 2564819, -767588, 3867926, -1381037, 3217403, 5044250, 801534, -2546486, 7253642, 836946, 315872, -2265161, 1615552, 1771343, -2889228, 1277244, -746968, 1877988, 2892456, 397817, -248974, -442897, 3050210, -3317618, 1221850, -3176508, -532230, 3284051, -1377391, -322926, -3313746, 2792464, -2011842, 2259747, 450897, 4474868, -3769417, 2461739, 1520070, 3341969]
1894C341969e92666F534889a039050j646347C988723b013610L01011C136997A082448
1884A315388e57553A115844a140426B862836J785340b956816B36564f17215k087157
1875b704372B014277e015883a0952j848762A09767L500556j764104J059910f923044
1865E238881b397970B593522f384062C000552a859065n12408A390942C00167a591746
1855C543598a209382C967973a124726C093541c380351D913388d198088a074762
1846e176331F077508A135592C77281a344796F284816b621072j22906j693058B742102
1836E60216O89085j52693C24984b147974B357595E41049Q66504J282099j332111
1827A357541L121831d29210A197118f865421D278479B78095b034495Q70348m75506
$$ y = [3341969, -592666, 6534889, -1039050, -2685397, 3988723, -2013610, -1712599, 3136997, 1082448, 1315388, -557553, 1115844, -1140426, 2862836, 4648176, -2956816, 236564, -617215, -2704372, 2014277, -5015883, -10952, -1859714, 109767, 3610323, 1846219, 2906129, -6923044, 5238881, -2397970, 2593522, -6384062, 3000552, -1859065, -2371473, 1390942, 300167, -1591746, 3543598, -1209382, 3967973, -1124726, 3093541, -3380351, 4913388, -4198088, -1074762, -5176331, 6077508, 1135592, 377281, -1344796, 6284816, -2621072, -2743978, -4437036, 2742102, 560216, 1249301, 1096608, 324984, -2147974, 2357595, 541049, 1407553, 2689652, 1357541, 4479372, -429210, 1197118, -6865421, 4278479, 278095, -2034495, -1164147, -1639653]
1818a639653A140037i98075k73887a27635B764209g652416b034260J009461A919665
1808B413490c241040C58514h47995I14646c074001E897633c795914J781095C24235
1798c864189A312177a007094C638787a998568N43155D07924N80712J419837m15605
1789A992868i11195B346596A81835M14810b469800I59619K82925b542545B473067
1779e08663j157469m116571A638889a531039n59666B919304j31419a352110r25503
1770b277613l01661J163276j246290C336920A233916c331672R90413Q90868F98487
1760i91359E07571a980648j35745A012589g27775m771981C806828c731917i6752
1750g9330B144693E54855O35477c162102A655044a163246q97085C488554E1466
$$ y = [-1639653, 1140037, -998075, -1271962, -127635, 2764209, -7652416, -2034260, -1024799, 1919665, 2413490, -3241040, 358514, -847995, 914646, -3074001, 5897633, -3795914, -2014819, 324235, -3864189, 1312177, -1007094, 3638787, -1998568, -1455413, 407924, 988636, 2408473, 1992868, -911195, 2346596, 181835, 596645, -2469800, 959619, 1242544, -2542545, 2473067, -508663, -1666132, -5782703, 1638889, -1531039, -2090705, 2919304, 2787885, -1352110, -2277613, -2579274, -1415998, -2662288, 3336920, 1233916, -3331672, -2341259, -1450391, 698487, -991359, 507571, -1980648, -2116393, 1012589, -727775, -5499756, 3806828, -3731917, -96752, -79330, 2144693, 554855, 1190332, -3162102, 1655044, -1163246, -2060331, 3488554, 51466]
1740b938497B982863g25017b30326A62234h44040A182676f817129A788415b772506
1730C903687a332583D412353b951296F61291K132185a82394l953798a704586H52825
1720d93725k74565H64232e90393J60158j50662q05483E90252a330175A062514
1710A464164i73168J12585j149590p16615r687B119699g41437j085499A356166
1700a18978B652037c09611B343142I0617a934656B357397p30964O86334C36350
1690B164107b929584G60074j55109M597144b360140M36373B297977C46836d139650
1680C680021A751729d59343F451370a057240m464296A579294C51240c28665l863070
1671d191735B734825E93210g78009j59398l92847o92334A133763A47684b707497
$$ y = [-2938497, 2982863, -725017, -230326, 162234, -844040, 1182676, -6817129, 1788415, -2772506, 3903687, -1332583, 4412353, -2951296, 661291, 2793476, -182394, -4136192, -1704586, 852825, -493725, -768290, 864232, -590393, -430235, -580897, -1386380, 590252, -1330175, 1062514, 1464164, -973168, -860583, -2010173, -2726788, -2736475, 2119699, -741437, -1826936, 1356166, -118978, 2652037, -309611, 2343142, 90617, -1934656, 2357397, 1626433, 2312767, 336350, 2164107, -2929584, 760074, 604965, 5202109, -2360140, -1923767, 2297977, 346836, -4139650, 3680021, 1751729, -459343, 6451370, -1057240, -5521536, 1579294, 351240, -328665, -4191735, 2734825, 593210, -778009, -937407, -1330254, -2022588, 1133763, 147684, -2707497]
1661A45752d86949A530177F05005a815953m16550Q28620F90408i51723F61394
1651a00120B839699a3329j383450A159098g61823m2743E441768j487105i03000
1641A738783P96244d276315D81392f49056B86942d565748A649159f97143l349724
1632d046867A527865g69593a98892l084130g90219I29661P43322B31756b368937
1622C03730c017499A723638p88605a29844j744490o20123A390143J622978a533593
1612d843756a491906D146482j457014h3005A394430K09014f7607D86401h56806
1602a053457m28456A701986b247480g79461C314375a958628D624170b559112L72347
1593b186765A617065G71969b802992J01338N30473A266366d22820a82634A574832
$$ y = [145752, -486949, 1530177, 605005, -1815953, -2232503, -1403883, 690408, -951723, 661394, -100120, 2839699, -13329, -1396779, 1159098, -761823, -804566, 5441768, 3954663, -903000, 1738783, 2535027, -4276315, 481392, -649056, 286942, -4565748, 1649159, -697143, -4046867, 1527865, -769593, -198892, -3283022, -790219, 929661, 1672983, 231756, -2368937, 303730, -3017499, 1723638, 935033, -129844, -1874334, -2494457, 1390143, 3013121, -1533593, -4843756, -1491906, 4146482, 2689468, -83005, 1394430, 1603444, -67607, 486401, -856806, -1053457, -1481913, 1701986, -2247480, -779461, 3314375, -1958628, 4624170, -2559112, -2186765, 1617065, 771969, -2802992, -2701654, -2171181, 1266366, -422820, -182634, 1574832]
$$ [...]
##END NTUPLES=nD NMR SPECTRUM
##END=
