##TITLE=Analysis number 324915
Compound Code cc 55809
Book Reference 505/42
Project Code adrs
Chemist Name robb
##JCAMPDX= 6.0         $$ Bruker NMR JCAMP-DX V2.0
##DATA TYPE= NMR SPECTRUM
##DATA CLASS= NTUPLES
##ORIGIN= Bruker BioSpin GmbH
##OWNER= nmr
$$ XWIN-NMR		Version 3.5
$$ Tue Dec  5 10:15:36 2006 GMT Standard Time (UT+0h)  MAYBRIDGE\nmr@NMR_250MHZ
##.OBSERVE FREQUENCY= 250.131544655141
##.OBSERVE NUCLEUS= ^1H
##.ACQUISITION MODE= SIMULTANEOUS (DQD)
##.ACQUISITION SCHEME= undefined
##.AVERAGES= 16
##.DIGITISER RES= 18
##SPECTROMETER/DATA SYSTEM= dpx250
##.PULSE SEQUENCE= zg30
##.SOLVENT NAME= CDCl3
##.SHIFT REFERENCE= (INTERNAL, CDCl3, 0, 16.522)
##AUDIT TRAIL= $$ (NUMBER, WHEN, WHO, WHERE, WHAT)
$$ ##TITLE= Audit trail, XWIN-NMR		Version 3.5
$$ ##JCAMPDX= 5.01
$$ ##ORIGIN= Bruker BioSpin GmbH
$$ ##OWNER= nmr
$$ C:\u/data/dgb/nmr/ADRS/300/pdata/1/auditp.txt
$$ ##AUDIT TRAIL=  $$ (NUMBER, WHEN, WHO, WHERE, WHAT)
(   1,<2006-12-05 10:15:15.44 +000>,<MAYBRIDGE\nmr>,<NMR_250MHZ>,
      <created by zg, POWCHK disabled, PULCHK disabled
       configuration hash MD5:
       49 4B E0 1D 92 C2 6B 37 9F E6 65 BC 52 41 86 1D
       data hash MD5: 64K
       CA B4 F0 50 95 70 A6 08 96 EC CF 96 B2 7A 33 7D>)
(   2,<2006-12-05 10:15:27.39 +000>,<MAYBRIDGE\nmr>,<NMR_250MHZ>,
      <Start of raw data processing
       ef LB = 0.3 FT_mod = 6 PKNL = 1 SI = 32K 
       data hash MD5: 32K
       88 BA FF DC B4 58 5F AB 5A 1A 11 76 FD C2 E0 C7>)
(   3,<2006-12-05 10:15:29.16 +000>,<MAYBRIDGE\nmr>,<NMR_250MHZ>,
      <apk 
       data hash MD5: 32K
       AB 75 81 F9 E8 0A 47 44 74 89 69 17 30 7A EA E9>)
(   4,<2006-12-05 10:15:29.94 +000>,<MAYBRIDGE\nmr>,<NMR_250MHZ>,
      <abs ABSG = 5 
       data hash MD5: 32K
       A1 EB 75 37 64 23 96 35 0F 72 A3 A8 2F 25 FD 90>)
$$ ##END=
$$ 
$$ hash MD5
$$ 79 6A 57 90 2E D0 13 F1 2F 32 3C AA 4C B1 6A E6
##$RELAX= 
##$RELAX= 
##$RELAX= 
##$RELAX= 
##$RELAX= 
##$RELAX= 
##$RELAX= 
$$ Bruker specific parameters
$$ --------------------------
##$DU= <C:\u>
##$EXPNO= 300
##$NAME= <ADRS>
##$PROCNO= 1
##$TYPE= <nmr>
##$USER= <dgb>
##$AMP= (0..31)
100 100 100 100 100 100 100 100 100 100 100 100 100 100 100 100 100 100 
100 100 100 100 100 100 100 100 100 100 100 100 100 100 
##$AQSEQ= 0
##$AQ_mod= 3
##$AUNM= <au_zg>
##$AUTOPOS= <33 >
##$BF1= 250.13
##$BF2= 250.13
##$BF3= 250.13
##$BF4= 250.13
##$BF5= 500.13
##$BF6= 500.13
##$BF7= 500.13
##$BF8= 500.13
##$BYTORDA= 1
##$CFDGTYP= 0
##$CFRGTYP= 5
##$CHEMSTR= <none>
##$CNST= (0..31)
1 1 145 1 1 1 1 1 1 1 1 1 1 1 1 1 1 1 1 1 1 1 1 1 1 1 1 1 1 1 1 1 
##$CPDPRG= <>
##$CPDPRG1= <>
##$CPDPRG2= <>
##$CPDPRG3= <>
##$CPDPRG4= <mlev>
##$CPDPRG5= <mlev>
##$CPDPRG6= <mlev>
##$CPDPRG7= <mlev>
##$CPDPRG8= <mlev>
##$CPDPRGB= <>
##$CPDPRGT= <>
##$D= (0..31)
0 1 0 0 0 0 0 0 0 0.06 0 0 0 0 0 0 0.0002 0 0 0 0 0 0 0 0 0 0 0 0 0 0 
0 
##$DATE= 1165313714
##$DBL= (0..7)
120 120 120 120 120 120 120 120 
##$DBP= (0..7)
150 150 150 150 150 150 150 150 
##$DBP07= 0
##$DBPNAM0= <>
##$DBPNAM1= <>
$$ [...]
##$SUBNAM6= <"">
##$SUBNAM7= <"">
##$SUBNAM8= <"">
##$SUBNAM9= <"">
##$SW= 20.6930455092707
##$SWIBOX= (0..15)
0 0 3 0 0 0 0 0 0 0 0 0 0 0 0 0 
##$SW_h= 5175.983436853
##$TD= 65536
##$TD0= 1
##$TE= 294.16
##$TE2= 300
##$TE3= 300
##$TEG= 300
##$TL= (0..7)
0 120 120 120 120 120 120 120 
##$TP= (0..7)
150 150 150 150 150 150 150 150 
##$TP07= 0
##$TPNAME0= <>
##$TPNAME1= <>
##$TPNAME2= <>
##$TPNAME3= <>
##$TPNAME4= <>
##$TPNAME5= <>
##$TPNAME6= <>
##$TPNAME7= <>
##$TPOAL= (0..7)
0.5 0.5 0.5 0.5 0.5 0.5 0.5 0.5 
##$TPOFFS= (0..7)
0 0 0 0 0 0 0 0 
##$TUNHIN= 0
##$TUNHOUT= 0
##$TUNXOUT= 0
##$USERA1= <user>
##$USERA2= <user>
##$USERA3= <user>
##$USERA4= <user>
##$USERA5= <user>
##$V9= 5
##$VALIST= <valist>
##$VCLIST= <CCCCCCCCCCCCCCC>
##$VD= 0
##$VDLIST= <DDDDDDDDDDDDDDD>
##$VPLIST= <PPPPPPPPPPPPPPP>
##$VTLIST= <TTTTTTTTTTTTTTT>
##$WBST= 1024
##$WBSW= 4
##$XGAIN= (0..3)
0 0 0 0 
##$XL= 0
##$YL= 0
##$YMAX_a= 481426
##$YMIN_a= -502243
##$ZGOPTNS= <>
##$ZL1= 120
##$ZL2= 120
##$ZL3= 120
##$ZL4= 120
##$ABSF1= 16.522
##$ABSF2= -4.171173
##$ABSG= 5
##$ABSL= 3
##$ALPHA= 0
##$AQORDER= 0
##$ASSFAC= 0
##$ASSFACI= 0
##$ASSFACX= 0
##$ASSWID= 0
##$AUNMP= <proc_1d>
##$AZFE= 0.1
##$AZFW= 0.1
##$BCFW= 0
##$BC_mod= 0
##$BYTORDP= 0
##$COROFFS= 0
##$CY= 12.5
##$DATMOD= 1
##$DC= 0
##$DFILT= <>
##$DTYPP= 0
##$F1P= 14.0000005364418
##$F2P= -0.99999901652339
##$FCOR= 0.5
##$FTSIZE= 32768
##$FT_mod= 6
##$GAMMA= 0
##$GB= 0
##$INTBC= 1
##$INTSCL= 1
##$ISEN= 128
##$LB= 0.3
##$LEV0= 0
##$LPBIN= 0
##$MAXI= 10000
##$MC2= 0
##$MEAN= 0
##$ME_mod= 0
##$MI= 0
##$NCOEF= 0
##$NC_proc= -3
##$NLEV= 6
##$NOISF1= 0
##$NOISF2= 0
##$NSP= 0
##$NTH_PI= 0
##$NZP= 0
##$OFFSET= 16.522
##$PC= 1
##$PHC0= 224.9308
##$PHC1= 5.88458
##$PH_mod= 1
##$PKNL= yes
##$PPARMOD= 0
##$PSCAL= 4
##$PSIGN= 0
##$REVERSE= no
##$SF= 250.13
##$SI= 32768
##$SIGF1= 0
##$SIGF2= 0
##$SINO= 400
##$SIOLD= 32768
##$SREGLST= <1H.CDCl3>
##$SSB= 0
##$STSI= 32768
##$STSR= 0
##$SW_p= 5175.98343685301
##$SYMM= 0
##$S_DEV= 0
##$TDeff= 65536
##$TDoff= 0
##$TI= <Analysis number 999999
Compound Code 99
Book Reference 9
Project Code 9>
##$TILT= no
##$TM1= 0
##$TM2= 0
##$TOPLEV= 0
##$USERP1= <user>
##$USERP2= <user>
##$USERP3= <user>
##$USERP4= <user>
##$USERP5= <user>
##$WDW= 1
##$XDIM= 32768
##$YMAX_p= 485872745
##$YMIN_p= -51323
$$ End of Bruker specific parameters
$$ ---------------------------------
##NTUPLES= NMR SPECTRUM
##VAR_NAME=  FREQUENCY,     SPECTRUM/REAL,   SPECTRUM/IMAG
##SYMBOL=    X,             R,               I
##VAR_TYPE=  INDEPENDENT,   DEPENDENT,       DEPENDENT
##VAR_FORM=  AFFN,          ASDF,            ASDF
##VAR_DIM=   32768,         32768,           32768
##UNITS=     HZ,            ARBITRARY UNITS, ARBITRARY UNITS
##FACTOR=    0.157963299565203, 1,           1
##FIRST=     4132.6476996994, 0,             0
##LAST=      -1043.33573715361, 0,           0
##MIN=       -1043.33573715361, -51323,      0
##MAX=       4132.6476996994, 485872745,     0
$$ Real data points
##PAGE= N=1
##DATA TABLE= (X++(R..R)), XYDATA
$$ [...]
24653B248J724M342r496l138K805J451O44l154O642K51M87O098k632k116M321
24638A0477Q13m014q580M879j15O429J6463j587l750m610L419o5l051k137K833
24623A7404j1882J0981j135p854j1252p294k64O372r57L873R53o531j313O039
24609b860K4417q882j9433l50n1j060J8542J0274O38P65l810r249l820n251O423
24594F293J487N100j802n227N424P038p233m183M071k600j6946O120m664j1833
24580a8955j608L998M876J3337J3809k130q052J189l48j9112o296J2329N315o749
24566h397M468N575k489M01r25J854K6772L962k0193q051j0447K950J0545M473
24552A0498K19L316l498N252j232r815k6794k6821l31J831K1255K2567J4450K843
$$ y = [2248, 3972, 8314, -1182, -4320, -1515, -64, 580, -2574, 4068, 4319, 4806, 10904, 8272, 6156, 10477, 11290, 7276, -1304, 3575, 3460, 9889, 26352, 24765, 21015, 16405, 19824, 19759, 16708, 14571, 17404, 5522, 16503, 15368, 7514, -3738, -11032, -11296, -4924, -5881, -2008, -1055, -7586, -8899, -2860, 21557, 12675, -6758, -7108, -7159, -8219, 10323, 20597, 21235, 22000, 18190, 8941, 5121, -130, 6293, 7780, 12880, 11078, 5851, 11275, 18313, 11080, 6897, 10968, 8368, -8578, -2458, -7122, -18955, -20563, -16565, -11689, 1648, 15457, 13327, 5275, 6464, 6116, -12996, -19292, -6963, -1648, -8397, -3929, 1646, -843, -442, -1367, 487, 27259, 31221, 11028, 2977, -7470, -4520, 6025, 10498, 10717, 14033, 10535, 15787, 14555, 4740, -22054, -48875, -49206, -47375, -26120, -3553, 10897, 13740]
24538A3740K366N053j416j1249j3819j1598O879k593J6431P005P378l474m691
24525A0012r036n44r785N69K909j94L842Q915K275J6453J151m012o383o33j2985
24510B554j348j1011N668N239l000k789P579O904l107k087O586J1978L805K362
24496B9333j2017p734j5736m96J4992J1749J4135j085j3569j6286r597J096Q094
24483B879n746p22K697o103J0020N341k6934j6829P003O878J5104k399R97Q241
24469D27O110l106m766l869L492k505n889J975Q514O89K037j836r984j6781P166
24454a8326J4443J619j2208o943o97J2511J4296M206n884N631n473j2585k574
24441a1984N858J0872j1277r015J2625o803j5993P73r187m463P205J1968r3J1006
$$ y = [13740, 16106, 21159, 19743, 8494, -5325, -16923, -10044, -12637, 3794, 10799, 18177, 14703, 10012, 976, 432, -9353, -8784, -5875, -6069, -2227, 6688, 8963, 25416, 26567, 22555, 16172, 15539, 2554, 1206, -9805, -4137, 1102, -1898, -4687, 2892, 9796, 6689, 4602, 11188, 23166, 26971, 29333, 17316, 9582, -6154, -6650, 8342, 20091, 34226, 33141, 19572, 3286, -6311, -5215, 2879, -2867, -3589, -892, -6995, 3025, 8366, -18568, -35397, -28394, -21516, -6412, -8811, -7814, 427, 6537, 3431, -1335, -5204, -1712, -4217, -10106, -8131, 383, 1072, 3109, 1273, -8711, -25492, -18326, -3883, -2264, -14472, -21415, -22112, -9601, 4695, 8901, 3017, 8648, 3175, -9410, -11984, -6126, 4746, -6531, -15546, -2921, -9724, -25717, -24944, -34131, -38594, -31389, -19421, -19514, -8508]
24427h508J7551n260M202M796j1498O679r761j216K1591n990j1721j786P252K768
24413I099j3758L582L665m887k823o473j3895K359J453M174J3792P507P680K678
24399A4153k022K352l060r492L138M793L771j689n002M955j038j5663J559L419
24385A74J4935M957L793J024l085j2577r761m219O932L924R308k432j6780n252
24371i059J2698L776j583Q15l206p175J488K1778q01j2749k575j1000o675L247
24357a1021J469m052M310p548J859J5945J3194K792Q61n987m626J1233J3435n636
24343B6228j5934l688K3859j968M696p144k772p930o813j0040j39l606J2679P031
24329A4459l613p795j0419r466j2713J3837P426n152L780M008q129J0148J2583
$$ y = [-8508, 9043, 3783, 7985, 12781, 1283, 7962, -1799, -3015, 18576, 12586, 865, -921, 6331, 9099, -4659, -1077, 2588, -2299, -5122, -11595, -25490, -23131, -21678, -17504, -3712, 3795, 11475, 14153, 12131, 14483, 11423, 1931, 5069, 9862, 13633, 11944, 6942, 11897, 10859, -4804, -3245, 174, 15109, 20066, 23859, 24883, 21798, 9221, -540, -4759, 2173, 6097, 15405, 12973, -3807, -9059, 3639, 7415, 5832, 6647, 3441, -3734, -2246, 19532, 18731, 5982, 3407, -7593, -14268, -11021, -9552, -13604, -9294, -16842, -14983, 962, 14156, 16948, 17809, 11822, 7196, 18429, 31864, 26228, 10294, 6606, 30465, 28497, 33193, 26049, 23277, 15347, 8534, -1506, -1645, -5251, 7428, 14459, 10846, 3051, -7368, -16834, -29547, -15710, -8284, -13436, -9656, -5648, -13777, -3629, 8954]
24316H954K789o515q295L081j1458O732O940q547l201o915j1497J0402K2656o860
24302a734P529K433q67N504q945j3637M878J633O376l954o733K587K029M791o227
24287d337J708m460Q803Q993R545j2270o628K215J1472p714j2587r131N085J1873
24273B567o909j3436J446K800k839P167J758J9801L931r246j472Q142M598p909
24259A0399J033r221o460k4N638j2360j340K206q308j2232j578J2903r24R531
24245a0737l556M194k840K46k475p43N693k772j2234N695R375J0801K169N555
24231H371O86N869L466p996O298O783j5663j4075n755j197o452k63Q605J2453
24217A130p605M848J5406n552k286L839l84l629j4425j355k600M791k683m082
$$ y = [8954, 11743, 5228, -3067, 14, -11444, -4712, 2228, -6319, -9520, -16435, -27932, -17530, 5126, -1734, 5795, 8228, 7361, 12865, 3920, -9717, -4839, -3206, 3170, -784, -7517, -4930, -2901, 1890, -4337, -2629, -7089, 1714, 10707, 20252, 7982, 1354, 3569, 15041, 7327, -5260, -14391, -9306, 2567, -4342, -17778, -16332, -13532, -16371, -9204, -7446, 12355, 16286, 7040, 5568, 13710, 18308, 10399, 11432, 2211, -4249, -4273, 1365, -10995, -12335, -10129, -18437, -30669, -32247, -19344, -20268, -10737, -14293, -10099, -12939, -12693, -15168, -15911, -10218, -12990, -25224, -19529, -10154, 647, 2816, 8371, 9057, 14926, 18392, 10396, 16694, 23477, 7814, -6261, -12016, -13213, -19665, -19928, -11323, 1130, -6475, -1627, 13779, 8227, 5941, 9780, 9396, 5767, -8658, -10013, -12613, -7822, -10505, -14587]
24203a4587j762L353J2563M359L502K911j7515l98q891l391K974J1392J805o02
24189d287P356L23o917j2146K224M888M493O750J2236j0356j3907o052K609N542
24175g244J7229J1246l168j2095M698r07L984P236j1896q785K608Q962J1197R485
24161C2550K89n160r402N092P223M684K449j274p854p007J068l037m236p711j126
24146F548q22r087J6911R663j2271J321o458k0085j6552J2596J5457K912n748
24133e615p950J7185R816j4588j1174N43M345N777L306M142q968j1013n554J2679
24119g069Q728R82P46J3410O584l194j0404L471p474j1668p647K065J049L258
24105g163L823j0848l052Q556J1045Q585P915L419O539J2067j1461k2213n45r22
$$ y = [-14587, -16349, -12996, -433, 3926, 7428, 10339, -7176, -7574, -16465, -19856, -16882, -5490, -3685, -4287, 3069, 3392, -3525, -15671, -13447, -8559, -4066, 2684, 14920, 4564, -9343, -15395, -12786, -7244, 9985, 21231, 18063, 5968, 10666, 9759, 13743, 20979, 9083, 298, 2906, 11868, 23065, 32550, 32839, 27679, 18277, 23369, 30592, 35276, 37725, 36451, 28597, 21590, 22658, 19621, 15385, 7674, 6548, 5726, -3361, 13550, 23213, 10942, 12263, 5805, -14280, -30832, -18236, -2779, 133, -5615, -13565, 3620, 13436, -1152, -12326, -11783, -7438, -1661, 1645, 5787, -3181, -14194, -19748, -7069, 1659, 2641, 3387, 16797, 23381, 20187, 9783, 13254, 5780, -5888, -13535, -11470, -10421, -7163, -3340, -14188, -17240, -8684, 2361, 10946, 18861, 22280, 28819, 40886, 29425, 7212, 6667, 5745]
24091E745o199P79q59P38J8025K82j7419m511O763J0114J889K004n91j0132j9955
24076a3327j6800J7936J8175J218j6739r337j530J1066N180r719m500J6980M180
24063B783m592o854O088K2607N89q048r828k238j069P539N970p66m096j0606k639
24048e160m659O596K365J1665N897k150q4j062N722j3685j6301o310O570K939
24034g657J8776P765Q745J4560m407j557j1785j1022o881j0121q021K244p10L258
24020f813N464J0706M7M820l677j2149L225K120O9l519M566n701O17O982j613
24005E144l091p710r358k725N773N004o680j1332Q852J2616k736P537O864j6854
23991h696j8804O963O501J740N38J3732J7103j2111j2054J2549R385j1623r253
$$ y = [5745, -454, 325, -534, 204, 18229, 18511, 1092, -3419, 3344, 13458, 15347, 17351, 16760, 6628, -13327, -30127, -12191, 5984, 7202, -9537, -18874, -20404, -9338, -4158, -13877, -18377, -1397, 2783, -1809, -8663, -2575, 20032, 20621, 12573, 2745, 507, -562, 6977, 12947, 12181, 8085, -2521, -5160, -9819, -3223, -858, 10807, 16704, 14554, 14470, 13408, 19130, 5445, -10856, -17166, -10596, -7657, 11119, 18884, 27629, 42189, 37782, 36225, 24440, 13418, 6537, -3584, -11605, -9361, -10071, -6813, -1349, 9357, 9404, 14224, 10547, -1602, 1623, 3743, 3812, 293, 4859, -842, -225, 6757, 5144, 2053, -5657, -15015, -17740, -11967, -6963, -13643, -24975, -16123, -3507, -6243, 1294, 8158, -8696, -27500, -20537, -14036, -12296, -11758, 1974, 19077, 6966, -5088, 7461, 16846, 5223, -4030]
23978d030j193n838j0402o078R36J5473J9333R043n467k0134q392K8721Q176m420
23964A5728j42j1834m423l768n980n869n71k295R24N236N773J472J3855L411q133
23949C384m007J2605M985n105l811M03k9345q927O456N065K328n549q120L17J161
23934b8160O127K702Q826P789j4117p780K725O161J3849J3214M459k043j3389
23921C63k649j1760l952P291k388o801n822n699l848j0765M067O678j0942K0736
23907b5491N062L521M783P775k439k55j3892J5916J973k997L4747M428l1867j3295
23893a2031l411J773J1403r458l496o544N749J3766K702N255J5401r144j7791
23880e826j0394p88J0290M034P262j0540J4551R413j182p929j6590r485N513J2595
$$ y = [-4030, -5223, -11061, -21463, -27541, -26605, -11132, 8201, 17244, 11777, -8357, -16749, 11972, 20148, 15728, 15586, 3752, -671, -4439, -10419, -16288, -16859, -19154, -18230, -12994, -7221, -5749, 8106, 11517, 3384, -623, 11982, 16967, 11862, 8051, 8454, -20891, -29818, -23362, -18297, -15969, -21518, -29638, -29321, -28160, -22033, -19331, -10505, -2716, -16833, -24613, -21888, -15727, -1878, 11336, 15795, 13752, 363, -2286, -14046, -17998, -10707, -13095, -19896, -25718, -31417, -35265, -46030, -41963, -35285, -46227, -25491, -20429, -16908, -12125, -4350, -6789, -7044, -20936, -5020, -3047, -6044, 28703, 33131, 1264, -12031, -15442, -13669, -2266, -11724, -15220, -21764, -16015, -2249, 453, 5708, 21109, 11965, -5826, -16220, -17008, -6718, -2684, 4578, -5962, 8589, 18002, 16820, 8891, -7699, -17184, -11671, 924]
23866I24q713o268O092J2988M274r203j2461j0138j2939J6429J7969J2325m544
23853F735p985N200o844j1141r628K833J0419m873M876Q773o15K304j1551L830
23839g667n678M551P741L696j099Q177M749L607j4378k0725K216K562k567n940
23825b0755J5955J899L557n415Q623L964q040l22P102p71j846p105j091Q054N184
23810H993Q677J603K186p441j8123q546J4771o015j2866K406Q830q012j332l42
23796a5211j18j121Q162k668p154p489J2595J7700J2859j134j0172o799k23N360
23782D587m90q647M125R35j410P911J368L167N454p79n187n36O4j4531R515J1709
23766A7255m344N65j811j5096j3415Q404L389J2749Q879k981j1071k3R446K080
$$ y = [924, -7789, -14057, -7965, 5023, 9297, 94, -12367, -22505, -35444, -19015, -1046, 11279, 6735, -1250, 3950, -2894, -14035, -23663, -20830, -10411, -15284, -10408, -1635, -2250, 54, -11497, -7667, -13345, -8794, -1053, 2643, 1544, 9721, 14470, 18077, 3699, -17026, -14810, -12248, -14815, -20755, -4800, -2901, 656, -4759, 3864, 7828, -212, -534, 6568, 5797, 3951, -3154, -4245, 3809, 8993, 17670, 19273, 21459, 14018, -4105, -12651, 2120, -3895, -16761, -14355, -5525, -13537, -14869, -15211, -15329, -16450, -8288, -10956, -18110, -25599, -13004, 4696, 17555, 16421, 6249, -550, -773, 4587, 4097, -4550, -425, 510, -900, 7011, 8379, 11546, 17000, 16221, 11034, 10498, 10562, -3969, 5546, 17255, 12911, 13476, 11665, -3431, -16846, -8442, -5053, 7696, 16575, 13594, 2523, 2500, 11946, 14026]
23752A4026j2366j399Q695l914j2034k495J2750Q880J634r171p076J532l530K850
23738a618o362j0640L945P405p07O158M108Q387m377J412M52r012l173o811k061
23723a2894N382j4962k688N408J4685K3829j032o750n355k574l250M014o462n596
23709h245m100J1156K524L124j427j2632K390Q548L002P323J5708Q09j4726m04
23695A3050R976N573k0569j9021m222k645L122L856O808M521J749J341j574m795
23681b830L506K644o593R305N535L565j8662p960J4640L626l760J575j504r217
23667f130P67q127j465J0019j370n803P216M882n255l848L00N479N080l406k91
23652a952J4159N579j0856q237n146j0061K590J6330O285j1177n697j834l343
$$ y = [14026, 1660, 261, 8956, 5042, -6992, -9487, 3263, 12143, 13777, 4606, -2470, -938, -4468, -1618, -7980, -18620, -14675, -7270, -7977, -1819, 2289, 10676, 6299, 7711, 8163, -849, -4022, -10833, -12894, -7512, -22474, -25162, -19754, -5069, 18760, 17728, 10978, 5623, 3049, -201, 3813, -2649, -8245, -12345, -1189, 1335, 4459, 3032, -9600, -7210, 1338, 4340, 11663, 27371, 28180, 13454, 13050, 23026, 28599, 8030, -10991, -15213, -17858, -14736, -10880, -4072, 449, 2198, 3539, 1965, -2830, 676, 3320, -3273, 6032, 11567, 15132, -3530, -11490, 3150, 6776, 3016, 4591, 3087, -6130, -5363, -13490, -14955, -4936, -6306, -12109, -4893, -11, -5266, -9114, -8814, -3335, 1745, -1661, -1952, 12207, 17786, 6930, -1307, -6453, -16514, -13924, 2406, 8691, -2486, -8183, -10017, -13360]
23639a3360j946R987Q175K417q554j7698p23K973O344R852q242o029O709K233
23625g862J919K887p858j84M613r210M78J3372M491Q602k686j2498j8265l31J1895
23610a0637K496j2849J1577J7884O514N701K911p033m8k333k558j0157p132p435
23596a3099J5K945J2511p406m769p371Q347Q80l181j123N376n16k878J4841O908
23581A1480r039n808L648N217M479q87R109J0780n159j7809M352J8429l044j4712
23567A1036j7868j0531O780j070j1192Q891J7362R304J840l46m109r381M190J959
23553F865j791l827N794q599M171J0587j0770o496q984l79M425O835m782j4516
23539b1467r275M892P062R246L14n037r167K055J2683J0859J3305n712o099m350
$$ y = [-13360, -15306, -5319, 2856, 5273, -3281, -20979, -21702, -18729, -12385, -2533, -10775, -16804, -10095, -7862, -5943, -3056, -10914, -11098, -6485, -15695, -15217, -1845, 2646, 11248, 8562, -3936, -22201, -22532, -10637, -8141, -20990, -9413, 8471, 14985, 20686, 23597, 16564, 16516, 14183, 11625, 1468, -5664, -13099, -13084, -10139, 2372, -5034, -9803, -17174, -8827, -7947, -11128, -12251, -6875, -7391, -10269, 4572, 11480, 2441, -3367, 281, 5498, 9977, 9090, 18199, 28979, 23820, 6011, 10363, 28792, 25748, 11036, -6832, -17363, -10583, -11653, -22845, -13954, 3408, 12712, 14552, 14206, 10097, 716, 4906, 6865, 5074, 1247, 7041, -1558, 2613, 13200, 2430, -4066, -13050, -13429, -9004, -2169, -6951, -21467, -30742, -25850, -18788, -9542, -9228, -14265, -23432, -21377, -8694, 2165, 15470, 9758, 3659, -691]
23525f91J9491J3119Q92j3683j4770j4564Q414J4193o385J100M573j2862k7113
23512b8286j937K2366K0899m994o57j4749j5255j297L772l338Q475L277N359k99
23498f664j239l631m848O233J0738O161N389n745j2781R293J6836o669j753r122
23484B198j0929j1132j1970N334O008J7064l789n221M337K337j917O756O36j0973
23470a1261J495J554J7506j1988p100O291J8241O249O317j3963k3706n779J1697
23457d447l40M991J708K118m57K400O88J793R02n171k203O859l185p591L983l26
23441A722o586Q38P805k0j0712J4405L324j5265q711L490n155M758J0546p101
23427f662j5660Q161P156j1004q111l01R681J0963l012M562M547j600r480L592
$$ y = [-691, 18800, 31919, 32811, 19128, 4358, -10206, -1792, 12401, 6016, 7116, 11689, -1173, -28286, -30223, -7857, 13042, 8048, 7391, -7358, -22613, -23910, -20138, -23476, -15001, -11724, -6365, -6664, -7903, -11534, -16382, -10149, 589, 6750, 12139, 6394, -6387, 2906, 19742, 13073, 11320, 2198, -8731, -19863, -31833, -26499, -20491, -3427, -7216, -12437, -8100, -5763, -7680, -924, -288, -11261, -9766, -8212, 9294, -2694, -9794, -3503, 14738, 20987, 27304, 13341, -10365, -16144, -4447, -4787, 204, 1912, 4030, 3573, 5973, 6661, 8454, 9356, 4185, 1982, 8841, 5656, -1935, 2048, 1722, -4864, -4026, 3779, 3759, -6953, 7452, 10776, -4489, -13200, -9710, -14865, -10107, 439, -6662, -22322, -14161, -7005, -18009, -26120, -26421, -16740, -5777, -8789, -4227, 320, -1280, -10760, -7168]
23413g168L475j2968P91Q701L076J14N207j3369O752J9677k44r988q67l30o170
23398c311k035m639O423j1496m593J2056N072k212r86l186L525k663o771n569
23384b0385l00N261j4003m905Q676R686J2581L022q857K231Q374j016L59J0434
23370A1158J172l147r862j3187k563L156k710K5309Q028l379j4744k471O236L773
23356F769K928k724J3472J879j3341l579k056o172J449k584N546P837r943O249
23342E730P576J0513j240j2880K287J0520L261l343j0528M364k770pj690J6867
23328B8660l301j5577K760Q203j3624o331m346r132J8930k10p889q458J1526l675
23314b464M914J3672J129q348j3203O758J0960o219q669J2669J60L860N057j3221
$$ y = [-7168, -3693, -16661, -15870, -7169, -4093, -3979, 1228, -12141, -5389, 14288, 14044, 4056, 3189, 2859, -3311, -5346, -9985, -3562, -15058, -19651, -7595, -2523, -4735, -5721, -8907, -5382, -8045, -14816, -20385, -20685, -15424, -29427, -34332, -25656, -15970, -3389, -367, -9224, -6993, 1381, 365, 724, 11158, 12330, 9183, -679, -13866, -16429, -13273, -15983, 9326, 17354, 13975, -769, -3240, 2996, 6769, 9697, 6973, 20445, 22324, 8983, 5404, 3348, -2824, -1375, -3959, 1587, 9424, -519, 5730, 13306, 23819, 22579, 9699, 11986, 22506, 25767, 22424, 11896, 16260, 13490, 13483, 11793, 28660, 25359, 9782, 12542, 20745, 7121, 790, -3556, -12688, 6242, 6032, -1857, -10315, 1211, -2464, 2450, 16122, 17251, 8903, -4300, 2458, 13418, 7199, -1470, 11199, 11359, 15219, 20276, 7055]
23300G055N540N483p123j0116j2885l510K13N879r145j2526J2220J3809q606o061
23286a9773M811J1427N517Q47j9032p039q244j8781J2139K2820K780M923K564
23273e041p091O644N942J222O665J0839r32l166l05j0834R85k974j0554M557L230
23258h13l698J1996L233o567j0918J496K88j2377r9J3548K2512O581J360J0394
23244C6936k115o455k186m994j5543N111o390n589O464j2249l849Q247J0754R241
23230A7383J2313n484m960J695K541q108j4020J71q815M409M068m897K051J775
23216A22j4018o77L590p825n907k573M223Q320j7605K244K2500K176L229O852
23202D651J0091K539j926r580k642k380K333p617N841l346N634N931j0565j396
$$ y = [7055, 12595, 18078, 10955, 839, -12046, -15556, -15343, -9464, -18609, -31135, -18915, -5106, -13712, -19773, -14962, -3535, 1982, 2829, -16203, -23242, -31486, -50267, -38128, -15308, -12528, -7605, -5041, -12132, -5488, 454, 1676, 8341, 19180, 18248, 15082, 14777, 3943, 4928, 1954, -8600, -4043, -813, -4511, 7485, 10718, 4151, -6767, -5271, -4983, -17360, -17459, -3911, 18601, 25182, 26542, 36936, 34821, 28366, 26180, 21186, 5643, 10754, 4364, -1225, 5239, -7010, -10859, -2612, 8142, 17383, 29696, 24212, 19252, 20947, 23488, 15380, 1360, 1531, -7284, -2875, 1193, -3704, -1653, 122, -13896, -14573, -10983, -18808, -24715, -27288, -23065, -14745, -32350, -30106, -7606, -5430, -2201, 4651, 14742, 17281, 15355, 5775, 3133, 753, 3086, -4531, 1310, -2036, 3598, 9529, -1036, -2432]
23188b432o96M7K828N493j5020Q542L65m515P35N921o134O239N40r637L828K0103
23172A6207P580m092l231K790O54j0372n984o741j2058k0103j0024J6149j546
23159c0771r516N634J5697N176j880P996J5405l734P910q629r747j4612K755Q942
23145i374J2704P300n567k4897n793P5M472J0198r199l015O284M673M636L270
23131d233O29m31L813M068q477m35K712M521k81P383N95o342J772q601j1547n908
23115b0762J2401Q281J5846j3665l079n011O404J3071K122k2146q050J4413m815
23102d990Q081J0454N396j5007q205m08L010m605r45R586O328j1115j6527K791
23088a6156j1818J1043J6278L909o551j2575L840J199o847K913P463J7896J579
$$ y = [-2432, -3128, -3081, -253, 5240, -9780, -1238, -873, -5388, -4653, 1268, -4866, 1373, 1913, -7724, -3896, 16207, 23787, 19695, 16464, 19254, 19908, 9536, 3552, -3189, -15247, -35350, -45374, -29225, -30771, -40287, -34653, -18956, -13780, -15660, -7664, 7741, 4007, 11917, 3288, -6459, -21071, -18316, -9374, 3330, 10630, 5063, -19834, -25627, -25552, -21080, -10882, -20081, -23096, -16812, -12139, -7503, -4233, -3604, -4035, -222, 3846, -4631, -5066, -2354, 2167, 1886, 9269, 9864, 3522, 5294, -3307, -14854, -20762, -8361, -80, 15766, 2101, -978, -5989, 415, 13486, 15608, -6538, -14588, -175, -4990, 3091, 13545, 18941, 3934, -4271, -4679, -1669, -6274, -7219, 2367, 8695, -2420, -18947, -16156, -27974, -16931, -653, 3256, -3295, -15870, -12030, -10831, -17678, -14765, -7302, 10594, 12173]
23075A2173m901m781K706j82r794K938r526N078j055p568K891M83m311L1111J2113
23060B7375j1604r612N949n358o190o130n641l230k738K229J32M376K684J2466
23046D708P46j9866j8562Q910J3794K0341M200j0928j055j694M609L681M555K325
23032A5764j627j894l630m205j1526o272K134J60N811J16P05P897n393n708L948
23017c720p361r847M266m048J5046J4967J100q246l263O114k717r352L172m386
23003h275r8k942j654m831K49L117M620j897O091M997J0509o12p803n379r825
22988a3733n778J926J1065M829Q631k216j749m046J583O705j085J14K804l396
22974E654R02J2676O426J1936j7563j8709R67M214N074j0183j4319j1578M639
$$ y = [12173, 7272, 2491, 5197, 5015, -4779, -1841, -11367, -6289, -7344, -14912, -12021, -11538, -15849, 15262, 27375, 15771, 6159, 12108, 6750, 560, -5570, -11211, -14441, -17179, -14950, -14818, -10442, -7758, 4708, 5454, -14412, -32974, -24064, -10270, 10071, 14271, 3343, 2288, 594, 5203, 8884, 13439, 15764, 14137, 12243, 8613, 4408, -7118, -13390, -11256, -11096, -5285, -5169, -4464, 3433, -1960, -7668, -3720, -11081, -20928, -16662, -20710, -5664, 9303, 10403, 2157, -1106, 5008, 2291, -7061, -3889, -8275, -8373, -11315, -12969, -17800, -17551, -14434, -9814, -11711, -5620, -623, 9886, 9274, 1471, -3908, -13733, -19511, -17585, -6520, -1691, 6940, 4724, 2975, -1071, 512, 7217, 6132, 6246, 9050, 5654, 6556, 19232, 25658, 37594, 20031, 1322, 2289, 6503, 11577, 1394, -12925, -24503, -19864]
22961a9864Q072O160J7317N588j682M61j30o397K059Q608p77m810K3k994j0464
22946A170j6357P584M162k60j2279q164P909N094o364m258l061M64L844P683J1474
22931a359Q136O898L254j2789P515j219o049P036N275j8770j2633r120K973j261
22917b2113J124M988p12K318n35j665K548J2236N901j879j840O588k495R84k510
22902B938q502j3950N758o103n897M112j142J1076R167J3088p954l108J6191K502
22888A8176j4840q562J0488l676m871l472m816J042P313J664k961j0035P854O293
22874d03J1453J7585q793p59j6351m990N865M129K176K184j4120n646L164j315
22860e821k966j0639K55R218R166J2188n829j464n715q977Q290N211j6650p429
$$ y = [-19864, -11792, -5632, 11685, 17273, 15591, 16052, 15922, 9525, 11584, 20192, 19415, 14605, 14628, 11634, 1170, -15187, -7603, -3441, -3701, -15980, -24144, -16235, -11141, -17505, -21763, -24824, -24360, -20516, -12833, -1359, 6777, 13675, 16929, 4140, 11655, 10436, 4387, 11423, 16698, -2072, -14705, -23825, -20852, -22113, -20989, -16001, -16713, -14395, -14930, -16595, -14047, -1811, 4090, 2211, 371, 6959, 4464, 5448, 2938, -5564, -19514, -13756, -19859, -25756, -21644, -22786, -11710, -2543, 10545, 2591, -517, 15674, 18176, 3336, -5226, 5262, 1586, -3285, -6757, -11573, -10531, -3218, -1554, -4515, -14550, -6696, -403, 11050, 28635, 19842, 19083, 2732, -2258, 3607, 7736, 9912, 12096, -2024, -7670, -4506, -5821, -8787, -19426, -19171, -9953, -787, 11401, 5572, 4108, -1607, -10584, -2294, 2917, -13733, -21162]
22846b1162o302O769J2238J3012J1871M154p10j6631o395p47N228j648K730l881
22832a474q873j2615m915J2402q094k282K0946J135J060M814Q049O809K813q497
22818A1278j5968q569J5136J4204P853k3054k2679M633L0681O077j0590N10J815
22805A1327M389L726r938j3340p886P842L635K713P727l730j714l031L853J278
22791F851q586K70J3026K025j730j3773R755M604N82l108j4626j233n88J859J3695
22776I023L722j0264m474J245K582L4n581j202r833J0377J1299K7018k536k0783
22762A0627j0292J3600J322j7001j2627p329k272o349K1555N270n404o064J735
22749a3229q443J0826J2803o510j1222L266L106k020P295N874M119J313J5187
$$ y = [-21162, -27464, -20695, -8457, 4555, 16426, 20580, 19870, 3239, -3156, -3903, 1325, -323, 2407, -1474, -10347, -22962, -27877, -15475, -23569, -25851, -4905, -3770, -2710, 2104, 10153, 16962, 19775, 11278, -4690, -13259, 1877, 16081, 23934, 880, -21799, -17166, 13515, 19592, 9002, 9512, 11327, 15716, 19442, 9504, -3836, -11722, -3880, -245, 2468, 10195, 6465, 4751, 1720, 5573, 6851, -1735, -1465, 11561, 13586, 11856, -1917, 7838, 12442, 13024, 9916, -4710, -5943, -6531, -4672, 9023, 12745, 2481, -1993, -748, 1834, 1868, -3713, -4915, -14748, -4371, 6928, 33946, 31410, 10627, 335, 13935, 15257, -1744, -14371, -21700, -23972, -30321, -8766, -3496, -8900, -14964, -13229, -21672, -10846, 1957, -4553, -15775, -12509, -9403, -11423, -4128, 1746, 5865, 7178, 22365]
22736B2365Q507p410k3270j2753Q023K021j01k441q502k257O538M373P730J8028
22722B0851p479m942m393j6595r671n123J912K338Q441Q308O576l879j1497O278
22708h875O762K2928M060j1252j2823j6757M826L863O908P322m913L726k770p938
22694d933k145Q511q49L40m095L193o350n263K660J2476j2014j4411K527J9603
22680g50J2621L589J534o805o633K418R38k712L600J142J60J1423J932n590n912
22665A0955R643R74q291n797j4548l748P483m949p297J3742N604O035j4048j1295
22651a5537m96k008q713r14J6945m772o492O004R803N94R94L905J665j0444J855
22636g611k76J2678J224q076M806J0173j268o202n875L109R481Q228K535J630
$$ y = [22365, 30872, 23462, 192, -12561, -4538, -2517, -2618, -5059, -13561, -15818, -9280, -4907, 2823, 20851, 13372, 8430, 4037, -12558, -22229, -27352, -25440, -23102, -14661, -6353, 223, -3656, -15153, -8875, -2113, 20815, 24875, 13623, 800, -15957, -11131, -7268, -360, 6962, 2049, 5775, 3005, -4933, -7078, 1433, 584, 924, -3171, 22, -6328, -11591, -8931, 3545, -8469, -22880, -20353, -750, 11871, 15460, 16994, 10189, 3556, 5974, 6912, 4200, 7800, 8942, 9102, 20525, 22457, 16867, 10955, 20598, 21572, 13281, 7484, -7064, -10812, -3329, -8278, -15575, -1833, 3771, 9806, -4242, -15537, -16033, -18041, -26754, -27668, -10723, -15495, -21987, -15983, -6180, -5586, -4592, -687, 978, -9466, -7611, -7887, 4791, 6015, -2061, 2745, 12918, 11650, 5448, -427, 2682, 12163, 20391, 22926, 24556]
22622B4556n109n694r952j2415P679P945R097o561j7212Q650K5804R46J5689J341
22608D4764j8187j069M679j6407k4581j0162J681J855J1765J4115o050j6802q459
22595b2858J7427J964j2557K488R49O769L82j5445K723K082r278J3684J4909J1962
22581A5201R93j0689j647L132j0125J098j0203n621p831Q472J5808N351j9861
22568a5922k409J4531R079K358l365j1231r669J3358J774J5J208n558l381M414
22554d798m285m931Q796J9712J4057l242j770J3589p373l662q32j4345j1N927
22540A6832p991j3100j4631o708n251Q539P171L493R880J1321P399m084k3795
22527a0925p318l142k790J3132M282q628j0176O589P868O021R365o524p668k701
$$ y = [24556, 19447, 13753, 3801, -8614, -935, 7010, 16107, 9546, -7666, 984, 26788, 27734, 43423, 44764, 26577, 25508, 30187, 13780, -10801, -20963, -19282, -17427, -5662, 8453, 2403, -14399, -22858, -5431, -3467, -16024, -13536, -12587, -5818, -5436, -20881, -18158, -16076, -25354, -11670, 3239, 15201, 16194, 5505, 3858, 6990, -3135, -2037, -12240, -17861, -25692, -17220, -1412, 3939, -15922, -18331, -3800, 5279, 7637, 4272, -6959, -16628, -3270, -1496, -1481, -273, -5831, -9212, -4798, -9083, -14014, -5218, 14494, 28551, 25309, 23539, 37128, 29755, 26093, 25261, 10916, 10905, 16832, 8841, -4259, -18890, -25598, -30849, -22310, -15139, -11646, -1766, 9555, 16954, 12870, -10925, -18243, -21385, -24175, -11043, -6761, -15389, -25565, -18976, -11108, -5087, 4278, -2246, -9914, -12615]
22513a2615M322k794P202n633N133J166k1298p469L413L351J5079P586j77k420
22499e154q49j7899K896M225j124R959l670n183Q302j963j8517J1233m224k110
22485b4078j95J392J3680P915n130j3132O173M261N948p293j2425j0714N581J0604
22471a7413J4667P553R648k697K563n276j7360j0875q325R024K8232N520p716
22458G545m446K350p64q322m571L228K449p6p893o44k702k751M21q006J3181L664
22442g337K057K770J450P610J1017J2817j5202j5165O562K0717Q195p740j9378
22429H373l678J5619l146r315n734N205j6618j6174k087Q390J0430J9764P422
22416A8451j2210K4J117J3985p166o116M352J1238n108q661o80L393n041m466
$$ y = [-12615, -8293, -11087, -3885, -9518, -4385, -3219, -24517, -31986, -28573, -25222, -10143, -2557, -2734, -5154, -6003, -23902, -21006, -16781, -17905, -7946, -11616, -16799, -8497, -10460, -28977, -17744, -21968, -24078, -24273, -22881, -9201, -1286, -6416, -19548, -13375, -9114, -3166, -10459, -22884, -33598, -28017, -17413, -2746, 4807, 14455, 11758, 14321, 9045, -8315, -19190, -27515, -18491, 9741, 15261, 7545, 3099, 5449, 4685, -3637, -8208, -4980, -2531, -2607, -10500, -11144, -13846, -16597, -16176, -24182, -11001, -7337, -5280, -2510, -1060, 6550, 17567, 30384, 15182, 17, 6579, 27296, 35491, 27751, 8373, 4695, 20314, 17168, 7853, 2119, 7324, -9294, -25468, -27555, -19165, -8735, 11029, 18451, 6241, 6265, 7382, 21367, 14201, 8085, 12437, 23675, 18567, 9906, 9226, 12619, 7578, 3112]
22402C112k0670M779L362K031j0011k91K1012J664M141m749n315j1561O769K204
22388c523j3118N324J6449J3092j2618j7373j867N93N297K225o478j1398o703
22375c0098L979L269J2098R180P900K565o530n975M551P458Q02p732p66J77Q4
22360I62J298K713k876o348q458J2748L36j3634k299K344O312J4355J4382l447
22346A8388k1650Q945P054m810r124o342j0228M178Q266k781M229q942m935N214
22332a2538k783l196M288J5531k399j4450k433q812n733M524J084J0921K237Q153
22318e606J517r398L400J7795M351O002p127o221k4328l141j695m043O202J3631
22304h661K460L748O085j935k260r934j2288N481J7859K31L266Q630L474p850
$$ y = [3112, -17558, -12779, -9417, -7386, -17397, -17688, 3324, 4988, 9129, 4380, -935, -12496, -5727, -3523, -16641, -11317, 5132, 18224, 5606, -11767, -13634, -13041, -7744, -5519, -11997, -23395, -30098, -26119, -22850, -10752, -1572, 6328, 8893, 2363, -3612, 939, 8397, 9199, 1467, 701, 878, 962, 2260, 4973, 2097, -4251, -12709, 39, 375, -13259, -15558, -13214, -6902, 7453, 21835, 18388, -3262, 5683, 12737, 7927, -1197, -7539, -17767, -13589, -5323, -8104, -3875, -12817, -17752, -12538, -15321, -18517, -14229, 1302, -1097, -15547, -17980, -26792, -32525, -28001, -26917, -15996, -13759, -5606, -4089, -13487, -10087, 7708, 12059, 18061, 10934, 4713, -19615, -22756, -24451, -28494, -22292, -8661, -6201, -2453, 3632, 1697, -563, -10497, -22785, -17304, 555, 786, 4052, 12682, 16156, 8306]
22290H306m99N864n685o472n984q256j3245j1219K805N529M967J719j826j1232
22276c5228N612M151J034N9Q264J6518q771l665N535Q739Q669k0646j4752n666
22262c0147L762K0230r217k873J2489J2992n066j6463O095Q729K296N606l846
22249D587o600j81m025P903J9172j4555k2857j343L380Q763Q713j0827j7589L23
22235b5136r336j458Q828L776N143O497J2303J1980j0946q703n659m563L520J0281
22221c473J1415q534o024q583q527J445K951R981K109k18l715N640N342p648N836
22206b003L857K3104K389j6869p683Q364j0500r342k514J650K232Q312Q287J0024
22192A9308j229r926p816j5400k584J2048o97j585j603l11k199K612N068J6144
$$ y = [8306, 7807, 13671, 7986, 1514, -4470, -12726, -25971, -37190, -34385, -28856, -23889, -22170, -23996, -35228, -29616, -25465, -24431, -24372, -16108, 410, -8361, -12026, -6491, 2248, 10917, -9729, -24481, -30147, -26385, -6155, -15372, -18245, -5756, 7236, 2170, -14293, -8198, 531, 2827, 8433, 4587, -2013, -2194, -6219, 1684, 20856, 6301, -16556, -17899, -14519, -5756, 2957, -7870, -25459, -25136, -34472, -35930, -27102, -23326, -18183, -11686, 617, 12597, 1651, -7052, -12711, -17274, -13754, -3473, 7942, -592, -6616, -15199, -23726, -22281, -19330, -9349, -7240, -7458, -11173, -5533, -191, -7839, -2003, 1854, 24958, 27347, 10478, 2795, 11159, 659, -8683, -11197, -9547, -7315, 997, 9284, 19308, 18079, 8153, 337, -15063, -17647, -5599, -6296, -7881, -9484, -9795, -11994, -9382, -4314, 11830]
22178A1830p384n763J075N752r459j7324N128J7268j793J0972O604j1543J047
22165F410K315j2107n486l656p539j0648n435L707J0306O494J484J1123R62M760
22151B690J68n239K908J1326N685n858p164l473p007j5829m315P93P12J637p083
22136c0049j386J2172j82J3087M832l504l222J834N900j171n951n533k552J4091
22122a634n4K049J5594L504p601k2392r034P750m000K604J1356J8483m26m466
22108A1733j28P97K394O921j2519j609p215r003O509l514L244Q726q68j0253l494
22093h279M165J1731Q035K422K767n679p280r208o790p545p571K895J3859n547
22079a2025j540j4797j2432L968J4454O295j729k717p139l11O245O313L41L509
$$ y = [11830, 4446, -1317, -242, 5510, -3949, -21273, -16145, 1123, -670, 10302, 16906, 5363, 6410, 8725, -3382, -8868, -12524, -20063, -30711, -36146, -32439, -22133, -15639, -14155, -3032, -2070, 2690, 2858, -2381, 527, 11853, 17538, 11680, 4516, 1043, -5964, -21793, -26108, -25315, -24603, -22966, -30049, -31435, -19263, -19445, -6358, -1526, -5030, -8252, -6418, -518, -1689, -7640, -13173, -15725, -1634, -1688, 361, 15955, 19459, 11858, -10534, -19568, -11818, -15818, -13214, -1858, 16625, 16199, 11733, 11605, 12402, 14796, 21717, 9198, 7589, 374, -8629, -2120, -5634, -2390, 6336, 5468, -4785, -8279, -4114, 7617, 15652, 18074, 20841, 15162, 7882, -1326, -8116, -15661, -23232, -20337, -6478, -12025, -13565, -28362, -40794, -36826, -22372, -16077, -17806, -20523, -27662, -27973, -21728, -15415, -15074, -11565]
22065a1565O550k281r674L536J1293j431J2128O271j8534j2897r821O562N979
22052a3884o768J2854K737O978N669r625j400O41O473J530n323n495Q878o488
22038c223j5698P377o601j7489R960Q423O987R996O719q375m260L403M000n727
22024d508p139K017P632L054N482o506k7553m117J2026O733J3975J1707q055k394
22010B354N557m680p233k141L553O571o087j0860j2407K005R99P005Q928L600
21996b836j615P165k028l251K743Q351j0247K684K913l870j6991J493N1O929n216
21981a3725M716J577k1587m990J075J3206J2650R71k694p239N708m16L052j7078
21967b4774n837K6786J3281p688j0615j166Q226n407O368Q728M303q815n860r804
$$ y = [-11565, -5015, -7296, -16970, -13434, -2141, -3572, 8556, 14827, -3707, -16604, -26425, -19863, -13884, -20652, -7798, -5061, 1917, 7586, -2039, -3439, -2798, 3675, 5205, -118, -5613, 3265, -3223, -18921, -11544, -18145, -35634, -25674, -17251, -10264, -268, 6451, -1924, -6184, -2781, 1219, -4508, -11647, -9630, -1998, 1056, 6538, 32, -27521, -31638, -19612, -12879, 1096, 12803, 4748, 2354, 7911, 3231, -4002, -6143, -2590, 3981, -2106, -12966, -25373, -23368, -22369, -15364, -6436, -2836, -4451, 2714, 686, -2565, 178, 8529, -1718, 966, 3879, 9, -16982, -15489, -15438, -8509, -13725, -9009, -7432, -29019, -34009, -32934, -19728, -7078, -6107, -8801, -16040, -10332, -10748, -7696, -24774, -30611, -3825, 9456, 1768, -8847, -10013, -1787, -7194, -826, 7902, 12205, 3390, -2470, -12274]
21953a2274K96J4742m579p308m654l069J8731Q843j591j124n311M14R594o15q079
21938D016r40m751j1462J0908J0630L60p257O973K766J492J1037L37j514n203
21924A7392r966J75p529L804J1942K038j0706q923j3293p878J1162J4014M671
21911F903n168K542o247j6373p954L412J849l454k089J3824J1071o44K517l378
21897c189M736M915j1127o400l497J985L754p590j3906j0468O550Q181P015q968
21883b8009K818K811J0436J266M315Q217j145r440o559P52O068J420o605J3379
21869b76M844o051o49l849q760q94J664q110L109Q129O05J1259m076o107l19r967
21853a9448N381M557N192n263K062M635n102m418M582K956q726O045J5389j0604
$$ y = [-12274, -11978, 2764, -1815, -9123, -13777, -16846, 1885, 10728, 9137, 8013, 2702, 3116, 12710, 12095, 4016, 3076, -1675, -13137, -2229, 8401, 8761, 1504, 8477, 11243, 12735, 23772, 24109, 22595, 17392, 7426, 7601, 72, 3876, 15818, 17856, 7150, -1773, -15066, -22944, -11782, 2232, 6903, 1735, 4277, -1970, -18343, -26297, -22885, -21036, -24490, -26579, -12755, -1684, -2328, 189, -3189, 1547, 6462, -4665, -11065, -14562, -12577, -8823, -16413, -30319, -40787, -34237, -26056, -19041, -28009, -25191, -22380, -11944, -10678, -6363, 1854, 709, -8731, -15290, -14538, -8470, -7050, -13655, -276, 4568, -1483, -2132, -5981, -14741, -15635, -13971, -22081, -18972, -10843, -10238, 1021, -3055, -9162, -9481, -19448, -14067, -9510, -4318, -9581, -7519, -2884, -7986, -12404, -7822, -4866, -13592, -7547, 7842, -2762]
21839b762K214K867J57o287j2354k340J700m135J271m828r041o588K826O729O470
21824b4101K5587O294j1731j3243R582K887O891k787J263m833j8877n943R716
21811a9295L902K004j479L169m250p303P840K711P913j815j2633j3006J0486J1066
21797a0690j633o808n576O189j2155n076J4499R831R045O33n361J387Q952M720
21783G957m633m158n930m795J8027P174K569j2434j8352K641K770l260p136m179
21769b3739J707O861K1253J5091l151p920j5286n203o041J4549J1343k802o439
21756B23r046l999R41L434o582J0372R33j9795O54J0099K895j0700n220J2014
21742a3777Q170n501q222J4227l558j1646k822p00j034J668J0710J6679l829q70
$$ y = [-2762, -548, 2319, 2476, -3811, -16165, -18505, -16805, -20940, -19669, -24497, -33538, -40126, -37300, -30571, -24101, 1486, 7780, -3951, -17194, -7612, -4725, 2166, -621, 642, -4191, -23068, -29011, -19295, -15393, -13389, -14868, -11699, -15949, -23252, -15412, -12701, -4788, -6603, -19236, -32242, -21756, -10690, -12323, -19131, -24707, -18518, -30673, -35749, -21250, -11419, -2374, -1741, -7102, -5715, 3237, 7957, 3324, -834, -6764, -11559, 6468, 13642, 16211, 3777, -14575, -11934, -9164, -12424, -19560, -23739, -22032, -15171, 6082, 21173, 18022, 10102, -5184, -10387, -16428, -1879, 9464, 6662, 223, -8823, -12822, -11881, -8447, -15029, -4657, -3724, -23519, -22865, -12766, -9871, -20571, -25791, -13777, -5607, -11108, -19330, -5103, -8661, -20307, -23129, -23829, -24863, -23195, -12485, 4194, 365, -505]
21728e05q175o919J4987O542n254k274l786k173J232r751j2534k904N792q285
21714c4007R657J4462j870k294J919J1073r63L872O935o384j1924l015M233R92
21700g314j0211r368P588K1621J8407J274J222j7905j4323K93O188q747m598J772
21686a4101L507L590N902l418q79k953K270Q729N225O507m259K441q704L718K10
21671G785k3337j9016J4454J3255L101P393Q273o559k2536j4129Q311J2210N497
21658e298O68o875k49R206j1176M098N162n458J458P821r12J4079J730j530K910
21643A5634q37q038j231o356q098k0842j2749J0341R021k657K849j0333J1511
21630b1785J4717p373n075P165R368P322l058J708p156n678j1177R276J0318M014
$$ y = [-505, -8680, -15599, -612, 5930, 676, -1598, -5384, -7557, -6325, -16076, -28610, -31514, -25722, -34007, -24350, -9888, -11758, -14052, -12133, -1060, -2023, 1849, 8784, 2400, -9524, -12539, -8306, -7314, -17525, -26893, -19305, 2316, 20723, 21997, 23219, 5314, -9009, -8716, -2528, -11275, -15873, -14101, -10594, -7004, -1102, -4520, -5399, -8352, -6082, 2647, 7872, 14379, 10120, 12561, 3857, 7575, 7785, -15552, -34568, -20114, -6859, -3758, 3635, 11908, 5349, -17187, -31316, -23005, -10795, -5298, -4630, -11505, -11754, -2548, -13724, -9626, -4464, -9922, -8464, -643, -1555, 12524, 14254, 12724, 15634, 14797, 6759, 5528, -828, -8926, -29768, -42517, -32176, -23155, -25812, -22963, -33296, -21785, -7068, -14441, -19516, -12351, -2983, 4339, 1281, 2989, -4167, -9845, -21022, -11746, -1428, 2586]
21616B586J6185k72j5984j5399j42j5219j1423r76R766K4765K0082l79q400k220
21602B970N979o739j3003L029P486J0059j2432j3054Q501J2194j833K330j2059
21589f572L158M280K584l074j135o638O186R536L390j1477j4071K232O954r769
21575a4416l160J363j963L277R82k498L204R460R232Q444k0155j0972j282J3987
21561d497k833j0306J786J1244R375J1409R004o564j136M945k577l432Q03j1675
21547E546j5633j8047q959J1861J783L564K0821Q073Q39o68j3137Q136J6266N100
21533B5545o886p309j2671n762J00O69m752k162N821j526Q856l776K441O285Q95
21518E768R320q67p579j9213j600j628J3800K8666J1579k894j0619j7674p179
$$ y = [2586, 18771, 18499, 2515, -12884, -13026, -28245, -39668, -40644, -30878, -6113, 13969, 13590, 5190, 2970, 8949, 2210, -10793, -7764, -278, 9781, -2651, -15705, -7204, 4990, 3157, 5487, -6572, -3414, 866, 3450, 376, -759, -7397, -1211, 8325, 11715, 238, -13833, -11601, -4647, -14416, -17576, -16213, -18176, -14899, -13917, -16415, -13211, -3751, 5481, 13925, -6230, -17202, -18484, -4497, -7330, -17636, -15850, -4606, 4769, 16178, 25182, 18618, 17482, 22427, 19850, 16418, 17221, 5546, -10087, -28134, -37093, -25232, -23449, -19885, 936, 9009, 9848, 9180, -3957, 4179, 20445, 25545, 18659, 11350, -1321, -7083, -6983, -6314, -11066, -13228, -7407, -8933, -77, -3853, -1412, 4873, 5768, 15088, 14221, 6642, -12571, -14171, -15799, -1999, 26667, 38246, 35352, 24733, 7059, -120]
21505a20L927J0587j3593j6705k089P67l828O584R358P506J0425j142j12p155
21491D410j396q470K601l691q471J4871q28o197p090k720p573J537R704J2156
21477a157q555n523O325L502n317j200O808r759L986L13M382l634p516k074P802
21462a1617M598J3702k89k328L941j6263O786j495j3888J422P466O953J363j6016
21448a5665K402J3097Q380p032k3353K751Q317J5013N795q426J517j844j93q112
21434g353j0175R913L473M612m943k25R296Q809J6203K386r684q906q151K041
21420G296l462p965l732o90k239p140J3714O750Q345o290j8536m758J6479k2965
21406b5193k003J1919J0580N682l260k124R212R59O935P101q995j1627n252j2483
$$ y = [-120, 3807, 14394, 801, -15904, -17993, -17226, -21054, -14470, -5112, 2394, 12819, 11677, 11565, 4410, 3014, -5456, -2855, -6546, -15017, -146, -974, -7171, -14261, -16981, -24554, -23017, -13313, -1157, -9712, -15235, -8910, -5408, -10725, -11925, -5117, -14876, -10890, -10577, -6195, -9829, -17345, -19419, -11617, -7019, 6683, 6394, 4066, 8007, -8256, -1470, -2965, -16853, -15431, -7965, -1012, 351, -15665, -13263, -166, 8214, 1182, -22171, -19420, -11103, 3910, 9705, 1279, 2796, 952, 759, -7353, -17528, -7615, -4142, 470, -4473, -4698, 4598, 13407, 29610, 31996, 22312, 13406, 5255, 7296, 3834, -4131, -7863, -8553, -10792, -17932, -4218, 2532, 10877, 4587, -13949, -18707, -2228, -25193, -27196, -15277, -4697, 985, -2275, -4399, 4813, 5772, 12707, 19808, 10813, -814, -6066, -18549]
21392a8549O039N254J8187J4471j1389j6538m672K250K0065P647J766j7722j5878
21379i069n065q525j549n669M811R120J957O04P003l167P900J1831M460o453J312
21364I501L719o213o721j74j1143q413o509J6166J3517j6032j0523M124M747n64
21350a4518j2613N168K436O240N155n198l887m096n657N037J5709M158L133p75
21336B92J590m669j879q92P858R401j097n686q898j2657J0504J0892j696j062
21322B001J45Q564p50p827J944J4884o442k2053o576k888O091M863o253M123J0447
21307B73j897j996j0525l265N19Q514J158r82J0734p491j6396P967M888Q743J4359
21292A4603j073p16o640j3440r655j1325p157m754Q322P003J800j107Q837L539
$$ y = [-18549, -12510, -7256, 10931, 25402, 14013, -2525, -7197, -4947, 15118, 22765, 24531, 6809, -9069, -14134, -22659, -24208, -29877, -25066, -15946, -13989, -13385, -6382, -9549, -1649, 10182, 14642, 8189, 9501, 13220, 7007, 286, 112, -11031, -19444, -25953, -9787, 3730, -12302, -22825, -18701, -13954, -14518, -27131, -21963, -19527, -13287, -8132, -13330, -17217, -21313, -26970, -21933, -6224, -2066, 1067, 292, 1882, -2787, -4666, -5558, 2300, 11701, 10604, 4918, -3980, -16637, -6133, 4759, 3063, 2001, 2146, 10710, 9960, 2133, 4077, 18961, 12519, -9534, -16110, -18998, -12907, -8044, -14297, -10174, 273, -1624, -3620, -14145, -17410, -16891, -8377, -7219, -8201, 2533, -4958, -21354, -13387, -8499, 244, 14603, 13530, 12814, 6174, -7266, -16921, -28246, -35403, -40157, -31835, -24832, -23032, -24139, -15302, -11763]
21278a1763Q42k705k444N529L789k7687k949J6576N545O324K795R007K852p125
21264a414L945q950k632P846O028R765q82j0275L522j5104o066J888j097j2533
21250b5959J6461L883j704j022j1417K82j93M826K499o924M810M645K97P187M770
21235B441o648L284J1025r363j0950J207j357O767J4058j2328o141K2217J3420
21222B7632N152j2702o082l583n337o701N66J1138j4145k927R069M822l249j3177
21208i524J2699J4893j5166q687m894n087n202Q549J7583M621r038j7797k741
21195a9791Q869Q251n241j0586L515Q788K3835R057l001p533N62p268K714n012
21181G159j6330m561N074o804l416M225L843K651J0724J2566P721j9404q423p278
$$ y = [-11763, -10921, -13626, -16070, -10541, -6752, -34439, -37388, -20812, -15267, -8943, -6148, 2859, 5711, -1414, 2531, -6419, -9051, -1205, 4823, 14588, 13706, 3431, 6953, -8151, -14217, -12329, -13426, -25959, -9498, -5615, -7319, -8341, -19758, -19476, -19669, -14843, -12344, -19268, -14458, -9813, -9516, -2329, 2441, -4207, -923, 10102, 739, -10211, -9004, -10361, -3594, 10464, -1864, -8005, 14212, 27632, 32784, 20082, 14000, 10417, 5080, -1621, -1055, 10083, -4062, -6989, 2080, 6902, 3653, -9524, 3175, 18068, 2902, -5785, -10679, -15766, -20968, -12419, 5164, 9785, 747, -17050, -19791, -10922, -2671, -7912, -18498, -14983, -6195, 17640, 26697, 23696, 16163, 16725, 9457, 12171, 7159, -9171, -13732, -8658, -15462, -18878, -14653, -10810, -8159, 2565, 15131, 22852, 3448, -4975, -12253]
21167a2253j202l406L720J2163K292k090j2315J2685J4886o827J2795L670k5294
21154a176j1907n337J708O532J1073R689j168M097l080n675n233n541r975K074
21140a3919m380J2495M338m261j472J1125L199j5697m579L528q057K251J927O485
21126g017k407J769n631m225L045J5998J5761m12j1567q297j065P235k578Q939
21112I548L028p595q71l33M095j5781m118J187m48L49J5477J456l800o072l50
21097d228n316o388J2353j538r650q059J2415Q156o821j819n500l078L306J3688
21083b479j1747m043j1706n980J0631K2402k273p352o851K753J6712r370R64N924
21069b415J2489j0414o886n811k083J1303p780j1887Q59O27J1707J2857p754j847
$$ y = [-12253, -13455, -16861, -13141, -978, 1314, -776, -13091, -406, 14480, 7653, 20448, 24118, -1176, -13083, -18420, -16712, -10180, 893, 10582, 9414, 13511, 10431, 4756, -477, -6018, -15993, -13919, -18299, -5804, -1466, -5727, -7199, 3926, 7125, -8572, -13151, -9623, -17680, -15429, -13502, -7017, -9424, -7655, -13286, -17511, -14466, 1532, 17293, 16881, 5314, -2983, -4048, 3187, 609, 9548, 12576, 4981, 4110, 3777, 7872, -7909, -12027, -10840, -11288, -10939, 4538, 5994, 2194, -3878, -4228, -9544, -15932, -3579, -5117, -14767, -22826, -10411, -2255, -9076, -10895, -16395, -19473, -16167, -2479, -14226, -18269, -29975, -35955, -25324, -2922, -5195, -12547, -19398, -16645, 67, -9303, -8339, -2415, 10074, -340, -7226, -13037, -15120, -3817, -11597, -23484, -22625, -21998, -10291, 2566, -5188, -7035]
21055g035O88N219M176p108l23l866Q611K1656m741j0448P280p82P615j08j7526
21040C308k676l145l178P963P605l704o113l739M842l591p030K596K310l203L521
21025d234l655j6657K759O753J340k962Q451J3262Q676L065J2305K605j1919k137
21011A7652K461j0839j2248K195J7633o493L005J8781r463j1785j0597r566n732
20998a4996L901o27J5171L833j606j85N369L870J3318l667k0089n204l179j653
20984e744J3098K880J5476l224j0180j8072m741Q983k9p599j782k094k662m134
20970a9824N59J9719p8M632J069K94j701q765K522k409N969R309M524K726P077
20955B5623n161p565j0626q336L30Q158J7421j4334j2427j203l623J007K516J6753
$$ y = [-7035, -6347, -1128, 3048, -4060, -4383, -8249, 362, 22018, 17277, 6829, 14109, 13327, 20942, 20834, 3308, 632, -2513, -5691, 2272, 9877, 6173, 60, -3679, 1163, -2428, -9458, -6862, -4552, -7755, -4234, -7889, -24546, -21787, -15034, -13694, -16656, -8205, 5057, 13733, 16798, 29103, 31708, 19789, 17652, 20113, 9274, -2974, -779, 16854, 10361, 13366, 32147, 22684, 10899, 302, -9264, -14996, -11095, -11722, 3449, 7282, 5676, 5491, 10860, 14730, 28048, 24381, 4292, -912, -4091, -5744, 7354, 10234, 25710, 22486, 12306, -5766, -10507, -1524, -1553, -9152, -10934, -13028, -15690, -19824, -19265, 454, 376, 5008, 6077, 6371, 4670, -4095, -1573, -3982, 1987, 11296, 15820, 18546, 25623, 20462, 12897, 2271, -6065, -5735, 2423, 19844, 5510, -6917, -8120, -11743, -10736, -8220, 8533]
20941H533L267k713k484l292l168N30R240R486J593o914j2467j0865m302K82J1621
20926a653K931O232j671k2456k818j457M331P682J550K192J0903J8676m216l522
20912A6704j6493q387J525K659l942p888R79j1517J934R071J0054J3103N93j5001
20898f606j004k213O50K2n044P727O75j3075o350N479K3978L032R570l04n745
20883A0792N463r794M311n922n933N837K670l065Q84P914q707k6056k642O185
20869a8063J7498K853j598q589o69J3034J801j9897j133K0447m942j0425O76J1548
20855B541l196m826n890o5J7950J3259m023o963N49j6846M309o063R729L973r179
20840d741j512J5169M388p914l228O122k584j386j0893p037K605N62N483L847
$$ y = [8533, 11800, 9087, 6603, 3311, 143, 673, 9913, 19399, 20992, 14078, 1611, -9254, -13556, -13274, -1653, 1278, 7510, 5839, -16617, -19435, -20892, -16561, -8879, -7329, -5137, 5766, 24442, 20226, 16704, 211, -8176, -6651, -3992, -7934, -15822, -14843, -26360, -24426, -15355, -5301, 7802, 8395, -6606, -7610, -9823, -9173, -9151, -14195, -6468, -5793, -18868, -25218, -19739, 4239, 7271, 16841, 16537, 10792, 16255, 6461, 10772, 4850, -1083, 4754, 7424, 4359, 5243, 13157, 4450, -21606, -24248, -18063, -565, 2288, 690, -7899, -8568, 4466, 6267, -13630, -14763, 5684, 742, -9683, -9007, 2541, -655, -5481, -11371, -11436, 6514, 19773, 15750, 8787, 9336, -7510, -3201, -9264, 465, 4438, -4741, -6253, 8916, 13304, 5390, 2162, 8284, 5700, 4314, -6579, -13616, -11011, -10449, -4966, -1119]
20826a119j2014L016J1137m142r336p798L826l085j0402J0551J100L425N386K955
20812f500k010J0135P313M590n450j1263m002m582N382J694o036r016J574j625
20798a9796Q198l637o33M606M695J89J1487n125k2231j1610P794n368P775K507
20784b1149M123M323J8728P071k634j908n322m67o236j3040j891R08O314L094
20770h086Q193m576J8295Q052n958j9304R264J0525q725k169k312K052J676q97
20756F030o768N092k218Q138j565l599n050L125m022r726k417J7588n70m111N79
20741E06J65m013k63O053R496j5472r828q539o21P026R661J407N91j886p267l06
20725a3290k391L389J5795J0603J520j032j5455j1201j0089N518K854j557N630
$$ y = [-1119, -13133, -10117, 1020, -3122, -12458, -20256, -16430, -19515, -29917, -19366, -18266, -14841, -9455, -6500, -8510, 1625, 8938, 13528, 8078, -3185, -7187, -11769, -6387, -4693, -10729, -19745, -18171, -19796, -11598, -15235, -15868, -11262, -6567, -6378, 5109, -16, -22247, -33857, -26063, -31431, -23656, -21149, -17026, -12703, 6025, 13096, 10462, 8554, 3232, 2765, -3471, -16511, -18402, -17494, -11180, -8086, 107, -4469, 13826, 21878, 15920, -3384, 5880, 16405, 7680, 5511, 3199, 5251, 6927, 6030, -738, 4354, 2136, 10274, 8709, 5110, 60, 3185, -837, -10563, -12980, 4608, 4038, -73, 506, 671, -3342, -3605, 2448, 11944, -3528, -13356, -21895, -22516, -15490, -5829, -4422, -3831, -5717, -12984, -13290, -15681, -12292, 3503, 14106, 15626, 14594, -861, -12062, -22151, -16633, -13779, -15336, -9706]
20712i706K1801J0285r46o030p919M724n467j0409l381j6309q157N607N982K986
20698a6939M725L588R444j2827q539L966j105K998j1166m410Q951J7141N453j2096
20684a0816M023L873n652r133J327M388K945j011l244L07O327J4109J439N699
20670A4581M172l862m22j0074j0908N646J390j889J329j396J192n202N138j6687
20656a6992m754O819J532L139R900R60n921J461m593j1018m377L742J361K257
20642a6484R284Q972m631q191M922M646L935L720J446j134m601m824j022L501
20628d61J5j7063k23q563O309P316J3077J0680p811J3800P303j7310j6093n036
20614a4060n416O068q366K128L714L485P26K852j1295K3689J3733k0596j9258
$$ y = [-9706, 12095, 22380, 21434, 15404, 7485, 12209, 6742, -3667, -7048, -23357, -31514, -25907, -19925, -16939, -12214, -8626, 818, -12009, -20548, -16582, -17687, -14689, -25855, -30265, -21314, -4173, 1280, -10816, -6793, -2920, -8572, -17705, -16378, -11990, -9045, -10056, -13300, -12993, -6666, 7443, 8882, 14581, 18753, 14891, 14469, 4395, -6513, -867, 523, -1366, -37, -1433, -241, -5443, -305, -16992, -21746, -14927, -13395, -10256, -356, 604, -5317, -3856, -8449, -19467, -23844, -20102, -18741, -16484, -7200, 1772, -2859, -11050, -6128, -1482, 2453, 6173, 7619, 6485, 1884, -2940, -3962, -461, -446, -17509, -17732, -26295, -19986, -12670, 407, 11087, 3276, 17076, 24379, 7069, -9024, -14060, -19476, -13408, -21774, -19646, -15932, -12447, -11721, -8869, -20164, 3525, 17258, -3338, -22596]
20601b2596M219M655l678m204Q217n619r663L412P085P689o541o811Q279M742
20587a0814j873m723k968K138J3027Q549N229O456P793j5063j051K886r195j4577
20573a4186J079k624J494q482n351O16L408r023J729O544J269j5027M459J1503
20559b2592O42k883J976J8286j654p084L16J1091P315j5863j499J4440J0948j1372
20545B067j5545j2064O541k534L297J0806P575J4358q735l005n64o536L584K254
20531A499M004m071J877Q697P68L353k089q776k3820q079J8519R729P998m318
20517E291j1188Q19M589N443R178l571k972J511n700k680j661R602p190k888p319
20502h736o880O259J2346R61k275j830o985n249J639j193m22j277O523J6612Q467
$$ y = [-22596, -18377, -13722, -17400, -21604, -13387, -19006, -28669, -25257, -18172, -10483, -17024, -23835, -15556, -10814, -12687, -17410, -20378, -18240, -5213, 3336, 8565, 15021, 22814, 7751, 6700, 9586, 391, -14186, -13107, -15731, -14237, -22719, -28070, -27454, -24046, -33069, -31340, -24796, -23527, -38554, -34095, -22592, -21950, -24833, -22857, -4571, -6225, -13309, -12993, -1902, 5413, -10450, -11949, 2491, 13439, 2067, -13478, -25542, -19001, -21535, -18238, -7432, 143, 14501, 5766, 2761, 2197, -4339, -755, 1499, 5503, 1432, 3309, 12006, 12774, 16127, 14038, 5262, -18558, -26637, -8118, 1611, 9609, 5291, -5897, -5078, -489, 4954, 14132, 10561, 7589, 9100, 3400, 720, -941, 8661, 1471, -1417, -8736, -15616, -9357, 2989, 3950, 1675, -155, -7140, -12389, -10750, -11943, -12365, -13642, -7119, 9493, 17960]
20487A7960J1552m506l799P094J035n159j2208l583J151l804J000K185j874m730
20473B314j0949j1308O280L783J898j4169Q306J6411j6108j3217K5615J2887j3231
20460a488j1378O279N285J381j0387J483o217R219R330j476j3642q451Q183J6890
20446E011R516r870r386j554j310p650M474L836j5074O850J7849Q563k494j808
20432F953j875Q71K772j2313k342J615o03n52N788R005J4088k552j4421n023l416
20417b005m59M101j4061j4503l198p488J7479K0805N025o454N825K246j342m930
20403A041O642j541p040n630J0947o21j3798m109K437J3555R735N489j0474j984
20389D649J350p248P423R234J065j6382k395o39J5386L316q3M116J0913m519j3210
$$ y = [17960, 29512, 25006, 21207, 28301, 29336, 24177, 11969, 8386, 9537, 5733, 6733, 8918, 7044, 2314, -8635, -19943, -13663, -9880, -7982, -22151, -13845, 2566, -13542, -26759, -1144, 11743, -1488, -12866, -6587, -1302, 79, -10308, -8825, -15042, -5823, 3507, 2031, -11611, -20062, -11879, 5011, 14527, 4657, -4729, -6283, -7593, -15243, -10769, -6933, -22007, -15157, 2692, 11255, 8761, 6953, 5078, 5949, 8721, -3592, -5934, -4319, -4922, -5474, 314, 9319, 23407, 20855, 6434, 1411, -2005, -2464, 1637, -12424, -26927, -30125, -37613, -20134, 671, 5696, -758, 5067, 7313, 5971, 1041, 7683, 6142, -898, -6528, 4419, 3798, -10000, -14109, -11672, 1883, 11618, 17107, 6633, 4649, 5999, -1249, 6174, 15408, 16473, 91, -2304, -2943, 12443, 15759, 15676, 19792, 30705, 26186, 12976]
20374A2976l171l797P977J646j1247j3595q401J3933M144M247l470r82M199o559
20360b100O764N345j1926k399l549Q952O812k479m810q241k503k080J176K005
20346i033L033q15j1097m841J439J9586M771J327M852J207J3272M736j2418l675
20332A2344M417K130j449j076j5882j5705o900N021J1030K02m897L70M156N79
20318e660j3861J2496j175O364n23l516O749N608k494l756n8l945K582q809P599
20303b399l008n288J6806p365n104o117o927n150N880J1355M383R9n18p52m94
20288d599J695J5321q96q538j0680K181k106N429J1712N516l961M893q13m21q594
20273F139o866M006r439o274k310j593J43M929Q754n313m478J733j1640j075N835
$$ y = [12976, 9805, 6008, 13985, 15631, 4384, -9211, -17612, -3679, 465, 4712, 1242, 260, 4459, -2100, 4664, 10009, -1917, -4316, -7865, 1087, 7899, 5420, 610, -7631, -10134, -12214, -11038, -9033, -6000, -6815, -17912, -22753, -21314, -1728, 3043, 4370, 9222, 10429, 23701, 28437, 16019, 12344, 16761, 18891, 17442, 16366, 484, -15221, -22121, -17100, -6070, -5868, -10765, -10395, -6239, -5660, -19521, -7025, -8200, -1836, -2359, -5875, 874, 6482, 3988, 232, 174, -3771, -1189, -9998, -2399, -5407, -10695, 6111, -1254, -6358, -12475, -19402, -24552, -18672, -7317, -2934, -2835, -3353, -4105, -4599, -2904, 12417, 11521, 2983, -7697, -5516, -7622, -2193, 9519, 15035, 11074, 15967, 15154, 14733, 6139, -727, 3279, -6160, -12434, -14744, -16337, -16194, -11265, -2511, -7824, -12302, -10569, -22209, -23284, -17449]
20258a7449J3090J4512N245o127j1425P122J0489J1161o16l717j2750p445L055
20245E145m035J245o445m196j3759l737J8477p50o837N413Q623O008r255q889
20231a2992R263Q322R384l094m730j392m700m599M26p68j1204j060J2115K735
20217b294k167J2623J2608R73k531j1251k873o122j690L156j4033k646Q519M806
20203b922j4264P115O835n664Q152J4554o294M843j0291j4711N284R289j9287
20190a7361m435J1316j982j0449K760K021j1045K811N444j072R721R192p583n541
20176a6203j767l963k324k543J2527l41J408r353J590N774p699q06M360K083M368
20161a2889R400O166j393j2779o148M500j0705M222J307q853k239J3238Q511r462
$$ y = [-17449, -4359, 10153, 15398, 9271, -2154, 4968, 15457, 26618, 26002, 22285, 9535, 2090, 5145, 1110, 2355, -4090, -8286, -22045, -25782, -7305, -8055, -14892, -9479, -856, 5152, -4103, -12992, -3729, 4593, 13977, 10883, 6153, 4761, 61, -4538, -4112, -4880, -16084, -17144, -5029, -2294, -4461, 8162, 20770, 21743, 19212, 7961, 5088, -1034, -2724, 432, -13601, -16247, -7728, -2922, -17186, -10071, -3236, -8900, -748, 13806, 7512, 12355, 2064, -12647, -7363, 1926, -17361, -21796, -10480, -12462, -22911, -20151, -18130, -29175, -26364, -20920, -21992, -12271, -3079, -10662, -16203, -17970, -21933, -24257, -26800, -14273, -14614, -13206, -22559, -20969, -15195, -22894, -23700, -19340, -17257, -12889, -3489, 2677, 1284, -11495, -17643, -13143, -23848, -19626, -18319, -27172, -29411, -16173, -7662, -17124]
20147a7124K612p86J875K151J1553k744L955L183Q332P95l983M170j9043k623
20133g677J0840P592K66j9642m240O378n22m532r81M111J36j161L139k200p316
20118a5809n712N871K812J109j0371k373J144Q422J04o119M594J1087k650o393
20104a4284n966K759K52Q489K134j228l002k690l182O048K081K219P267O901J868
20089I666p431j397J849l478j2352o300r401J5177m312n690J0788N913K93k579
20075i254Q46j09J6182r628L49J7537o027j0145J0330r097o841j2578p048J783
20061b3700m21O514K0141m259j3665M989M422j95O96m612l470J5031M16m577K243
20046d47o870j5037q123O574L196J2227n99j806m778j2380j856L596J8739J4764
$$ y = [-17124, -14512, -15298, -13423, -11272, 281, -2463, 1492, 4675, 13007, 13802, 9819, 13989, -5054, -7677, 3163, 10755, 11021, -8621, -12861, -6483, -7005, -11537, -12518, -8407, -8271, -9432, -6293, -8493, -15809, -21521, -15650, -12838, -11729, -22100, -24473, -23329, -14907, -14803, -20922, -16328, -5241, -7891, -14284, -20250, -17491, -17239, -8750, -6616, -7844, -10846, -13536, -16718, -10670, -8589, -6370, 897, 7798, 9666, 2235, 838, 2687, -791, -13143, -19443, -28844, -13667, -17979, -23669, -12881, -6968, -6675, -9254, -8408, -8517, 7665, -1963, -1614, 15923, 9896, -249, 10081, 984, -5857, -18435, -25483, -23700, -24121, -17607, 2534, -1725, -15390, -10401, -5979, -6174, -5478, -10090, -13560, 1471, 1887, -2690, -447, -7317, -22354, -30477, -23903, -20707, -8480, -9079, -10885, -15663, -28043, -29899, -26303, -7564, 7200]
20032G200j583n861j808j0373l374L133j1103o377K082R699J0852j509L94j1120
20018a9748j0688Q339R820O422r3n155K65m086J782n30K387Q549J3835K230n122
20003H207j7153m44M045L16P45m716m713j517n114Q738l370n677n522N294K6403
19988E522J0829P752o581K239n834j3768m675J2256k248m814l366n354N514J1011
19974H483Q983j0206j1654k73J485j764N126N923r076j1805p694J5759J3483L974
19960A0744j345p38R454n271j4452p869L954m92J0877j340r835L218P710p295
19946b680j0477J960P170J170p955p152k785N033J2920P796o76k03L964K355m476
19931E964N200J4844K887p435P82j2940r100P098J898o910o958j1215K047J0262
$$ y = [7200, 5617, -244, -2052, -12425, -15799, -12666, -23769, -30146, -28064, -18365, -7513, -9022, -8628, -19748, -30436, -22097, -12277, -5855, -5948, -11103, -10838, -14924, -13142, -13672, -11285, -2736, 11099, 13329, 8207, -8946, -9390, -5345, -5029, -4284, -9000, -13713, -15230, -20344, -11606, -14976, -20653, -26175, -20881, 5522, 16351, 24103, 17522, 19761, 13927, 159, -4516, 7740, 5492, 678, -2688, -8042, -2528, 8483, 17466, 7260, -4394, -4667, -3182, -4946, 180, 6103, -2973, -14778, -22472, -6713, 6770, 10744, 9399, 8661, 18115, 12844, -1608, -9477, -5523, -6015, 4862, 3522, -6313, -3095, 4615, -2680, -13157, -11197, -4027, -2857, -10812, -17964, -20749, -15716, -2796, 5000, 4324, 4121, 8085, 10440, 5964, 11164, 26008, 28895, 21460, 22242, 9302, 202, 7300, 9198, 2288, -4670, -15885, -13838, -3576]
19917c576O296j3561j4088N360O115O839O564j2763o114J3835L12j3822k763L441
19903a7925K651L517R358l532J4083P215j5048r023R658N858k514oJ6221j852
19889A8661K024n24o507j0743q567J0925O166o55n315n569M470m588K712J310
19875C800j1928k748J6q02m589p383J806J3512N736K936J4294r54o723P238o940
19860G271J949L73o993o642o536r721J4143J4448q59p522o913K319J553J526o836
19845h440r652R837j400l282q232N356P410l29R209K430n339J7979Q593J78q036
19830A6282Q940j5622j0782Q546m666N331p91k018k502J145M567k335J1694m987
19816A2802q431j2374L318J2372J954L656j0466r519J2236o452k4213j8182P469
$$ y = [-3576, 2720, -10841, -24929, -19569, -13454, -6615, -51, -12814, -18928, -5093, -4781, -18603, -21366, -17925, -15274, -11757, -2399, -5931, 8152, 15367, 319, -8704, 954, 6812, 4298, 4292, 20513, 18661, 20685, 20161, 13654, 2911, -5656, 5269, 11435, 10780, 5465, -104, 4366, -222, 2490, 3800, -8128, -10876, -10860, -11662, -16251, -23634, -21828, -8316, -2580, 356, 14650, 13696, 6973, 14211, 7271, 9220, 9593, 2600, -4042, -10578, -20299, -6156, 8292, 7433, -89, -7002, -4683, -3130, -1604, -8440, -18092, -8255, -9655, -12937, -21169, -15813, -8403, -8732, 477, 2907, -2432, 15547, 24140, 24318, 16282, 25222, 9600, -1182, 7364, 2698, 8029, 7238, 5220, 2718, 3863, 8430, 6095, 17789, 12802, 4371, -8003, -4685, 7687, 9641, 13297, 2831, -6688, 5548, -904, -25117, -43299, -35830]
19803c5830L000L019R00R189J0014J8898J4236q321q381n8n308M395l265m850
19789b362j0007J6517Q872o804m096n062O274J3953R70q057j3641j4569R625Q255
19775a32J506m178p490L943Q53l878R475o397l521L807k919J99Q80l886O067P462
19759A791Q59P521k638k044l241J126L614r765L849J0610N716j1388q732j2012
19745a4734O286J9031N817n214K859N834j119M053L758J2803j95j5348j1945O64
19731A2550j526M599l482n386Q80L303N54Q213r001k622P796K201j240m646O270
19716A8463R638K080L149j3745p484r592J647O277N644J870l106o912j8393o333
19702a6797Q858R706Q368n771j1567K900j4998m230J2351O903n900j2672m461
$$ y = [-35830, -32830, -29811, -28911, -19722, -9708, 9190, 23426, 15105, 6724, 6666, 1358, 5753, 2488, -2362, -12369, 4148, 13020, 6216, 2120, -2942, 3332, 17285, 18255, 10198, -3443, -18012, -8387, -132, 1374, -2804, -10294, -6351, -5498, -9376, 99, -6298, -9819, -6012, -8931, -8732, -7852, -11738, -5671, 1791, 2650, 10171, 7533, 5489, 2248, 3374, 6988, -2777, 1072, 11682, 17398, 6010, -2722, -14734, -8448, 10583, 16400, 11186, 14045, 19879, 18760, 22813, 26571, 39374, 39179, 23831, 11886, 12550, 11024, 15623, 12141, 6755, 7635, 10938, 11492, 19705, 10704, 8082, 15878, 18079, 16839, 12193, 18463, 28101, 30181, 33330, 19585, 12101, 2509, 4156, 10433, 16077, 17947, 14841, 7929, -10464, -16797, -7939, 1767, 10135, 4364, -7203, -4303, -19301, -23531, -11180, -4277, -10177, -22849, -27310]
19689b7310R829J0036R33o670o668L76J1834m53j6815J205P790O522Q590N341
19675D540O40q760k3212n114R650J4007J7048j2014P689o065k55P10R2K018j3919
19660a2945n044P914J465R813P679n824L123j3917J68J0187l673q153n591P650
19646g148L607p811l913O702Q235q793p254n806K85J3022L247M415J1421j9803
19632i594j2239O835O37L771J9341J2491j1052j4075P612J4942o362j0281n658
19619c632N153L696l960j3032l553J291N119M510J422o713p780P943J2073k206
19605C31l838J872J948Q293j316N103l93R68M211O830j577m658j980J313j3090
19590D017l274N394K859k50q07m072r452J970J4595k927L032n31K42n033j1064
$$ y = [-27310, -17481, -7445, -6512, -13182, -19850, -19474, -7640, -8093, -24908, -23703, -15913, -9391, -801, 4540, 5180, -3580, -26792, -31906, -22256, -8249, 8799, -3215, 4474, -1591, -1846, -1136, -1044, 974, -12945, -17989, -10075, -8610, 1203, 8882, 3058, 6181, -7736, -7568, 2619, -1054, -9207, -14798, -7148, -3541, -11352, -15265, -8563, -328, -9121, -16375, -22181, -21896, -8874, -5627, -1212, 10209, -9594, -21833, -14998, -14361, -10590, 8751, 21242, 10190, -3885, 3727, 18669, 12307, 2026, -3632, 1521, 5217, 1257, -11775, -15328, -14037, -8918, -4408, -2986, -9699, -17479, -9536, 2537, 331, -3507, -1635, 313, 8606, 7290, 12393, 12000, 12968, 17179, 24009, 22432, 17774, 15794, 17107, 4017, 743, 6137, 8996, 8746, 7939, 3867, -5585, -3615, 10980, 8053, 11085, 10554, 10796, 5763, -5301]
19575e301l068k204j030l904J885M510j0336M202R085P763p772o10N605P97m497
19560d875j6303n39J6047k963L542M583p361r575l458l50o365q055Q942J8428
19546h302J8490P901p078r076j646l97P022j289j0532M468q685N961J3367n089
19532E115j6537k198J3036M171j3231L675R831P41l361o886j1979J577J073O673
19518h300J9275m77j487j0332j504O965J4204m76k1849q363J0371J6270k208j1974
19504A15m765J2568L977j2690j3423N156m954K408j206O939J183l39O237M28j730
19489i6M355P720o492k486P693M610j2519j8741J3L542N043n125j816o719O427
19474a4591R955l283L121N587N850n643j276j5955O896P038J4042R984K360j0297
$$ y = [-5301, -8369, -10573, -11603, -15507, -13622, -9112, -19448, -15246, -6161, 1602, -6170, -6780, -1175, -378, -4875, -21178, -21717, -5670, -8633, -5091, -508, -7869, -17444, -20902, -21252, -27617, -35672, -26730, -8302, 10188, 18089, 11011, 1935, 289, -108, 6914, 5625, -4907, -439, -9124, -3163, 10204, 5115, -11422, -13620, -584, 3587, -9644, -5969, 3862, 4603, 1242, -5644, -17623, -16046, -14973, -8300, 10975, 10498, 9011, -1321, -2825, 4140, 18344, 17868, -3981, -12344, -1973, 14297, 12089, 115, -4650, 7918, 11895, -795, -14218, -9062, -14016, -11608, -12814, -5875, -4692, -5031, 1206, 1634, -96, 4259, 11979, 5487, 3001, 10694, 15304, 2785, -15956, -15943, -12401, -7358, -12483, -14299, -21018, -14591, -4636, -7919, -4798, 789, 6639, 996, -280, -16235, -9339, -2301, 11741, 21725, 24085, 13788]
19460A3788j2328k3J1542J0067m277L723r520o826j9060J2373N409N174O140M435
19446B0617q815k626O76N927R982q411j1351J420n387J9079R318m254j6186m847
19432E142N275O05m26n555K143M777k589j3630l415Q227O924P116l252m897o318
19417A27j9977P500J2953J1449J408Q02o168j469j1219L52K474L792N969L985
19403A1978j7563p585J8899p517j3267o373L407R529q173k031J1312O517L146
19390B279L228l946J817n846K477P761R54k301o129J07R862N874r831j7832n53
19375a2079J0032k576P58j0826n908J5970J3179J270P205N42r929m323n371j0611
19361a2667J9991N842l20q121n01n244k982p910l872J5510K7479n844k447n186
$$ y = [13788, 1460, 1437, 12979, 23046, 18769, 22492, 12972, 6146, -12914, -541, 4868, 10042, 16182, 20617, 11802, 9176, 9852, 15779, 25761, 17350, 5999, 7419, 2032, 21111, 30429, 26175, 9989, 5142, 10417, 11022, 10596, 5041, 7184, 11961, 9372, -4258, -7673, 554, 7478, 14594, 11342, 6445, 127, -19850, -12350, 603, 12052, 13460, 14262, 8094, 6625, -4594, -4242, -1768, 2024, 7993, 11978, -5585, -13170, 5729, -1788, -15055, -21428, -18021, -8492, -16665, -18696, -7384, -867, 2279, 5507, 1561, 3378, -2468, 9, 7770, 8724, 6423, 294, 401, 10263, 16137, 6306, -11526, -12079, -2047, -4623, -3865, -14691, -20599, -4629, 8550, 9820, 17025, 17567, 7638, 3315, -2056, -12667, 7324, 13166, 12846, 4725, 4224, -1020, -4002, -11912, -15784, -274, 27205, 21361, 18914, 13728]
19347A3728q822r374K806j88n868J387M842J3920J9K872L947p694j274N166M642
19332B0109p769j0024j1016o311j423N947m97m738J173J1388M66j1863j1592Q435
19318a7715k345L594Q500J2170q388l501j867P094J2538J823o015l45q269p15
19304c441L491O06k519M508o123l568J0021O575J948J7830L924j4252j1776l365
19290C859j9329q169j704J1442J6468r32j0823j0678L141J728J1231N462q410
19277f714j511p021R147K817k147q670q75J0265N342P691j5009M166j054p66O005
19262A666K554N167j4222j5236Q088l660m063P455K318L596M066p964q853J2840
19248f248J1004R804L335l463J472l628r556P90m346j2926K024Q87L855L123L95
$$ y = [13728, 4906, -4468, -1662, -1850, -7718, -6331, -1489, 12431, 12450, 15322, 19269, 11575, 10301, 15467, 20109, 12340, 2316, -8700, -15011, -16434, -10487, -10984, -15722, -14549, -3161, -2695, -14558, -26150, -17715, -20060, -16466, -7966, 4204, -4184, -7685, -9552, -2458, 10080, 11903, 5888, 5543, -2726, -3441, 50, 656, -1863, 2645, -3478, -7046, 2975, 9550, 11498, 29328, 33252, 19000, 7224, 3859, -15470, -23639, -25343, -13901, 2567, 1635, -9188, -19866, -16725, -14997, -3766, 1696, -6714, -8225, -15246, -6099, -3282, -5429, -14099, -14974, -4709, 633, 8324, -6685, -2519, -3573, -4339, 1666, 4220, 9387, -4835, -20071, -11983, -15643, -19706, -12251, -9933, -6337, -2271, -10235, -19088, -6248, 4756, 14560, 17895, 14432, 15904, 12276, 2720, 3510, -836, -13762, -11738, -10851, -6996, -3873, -3478]
19233c478p527L563O555J3101O136j5344j5231N299o466J0795q56k556J2762m52
19219F301J801j8542j0917J0209R272k557p397J2000O924L742N855o991k653j2045
19205d998l591r248j807J1696P801o337r460l820R082J1352M385P962j295J37
19191A1859n862n99N759p994N099O347k854j3234j2290k154m877P159o668N062
19177a5247k988M35J3053J831j3023o440P515K259j547J1284K79m704J2267L416
19163H390n131K049K516p337p71J5245O1k536l037O44K726r162n125M274j2337
19148i531j014l691Q119J0698p64n69P81k890O46N988Q65L759n722M295J248j3983
19132a765K408J1234q367q196r974r38L27j3536O195M658J1585O986k648o087
$$ y = [-3478, -11005, -7442, -887, 12214, 18350, 3006, -12225, -6926, -13392, -2597, -3453, -6009, 6753, 6301, 8102, -10440, -21357, -11148, -1876, -4433, -11830, 170, 7094, 10836, 16691, 9700, 7047, -4998, -8589, -17837, -19644, -7948, -147, -6484, -15944, -19764, -10682, 670, 5055, 13017, 11722, 11859, 5997, 5398, 11157, 3163, 8262, 14609, 11755, -1479, -13769, -15923, -20800, -13641, -20309, -15247, -18235, -17800, -4747, -2916, -15939, -22379, -14864, -12605, -14152, -2868, -2589, -7293, 4974, 8390, 3259, 5308, 7824, 487, -284, 14961, 15022, 12486, 9449, 10093, 12819, 3657, -1468, 2806, -9531, -10545, -14236, -6117, 4581, 3817, 3248, 4029, 1139, 1785, 7773, 8638, 12397, 6675, 10970, 12218, -1765, 643, 11877, 3510, -4686, -14660, -15598, -15271, -28807, -22612, -17954, -6369, 617, -2031, -8118]
19118h118J6193J1100j442n862q956M194L273k429o346k582P882J0301n738j035
19104A0435o421J438P218K372p503J1857p393j5055J21r42m089J3375J336k932
19090C817m570k844o723K603N681J1935N515K703R144K391r490p220r557J1965
19076A5350K0759j0136j9118n287o801O375J639J0449q43r067o645K123r111r651
19062a9964J6475O147J981P90M554R927j227n029J109j3016o926Q199r872k345
19048i197J2173k509J0487j1125M529J6177O491k21r973n201M827q924l838M949
19034H645J0639J1928n186n605k690k0677p773j1994l946O336j068j069L096Q861
19020a0503k248l266L942J2657J5578m89k798j3971L716j0107o580M048Q222R087
$$ y = [-8118, 8075, 19175, 17733, 11871, 2915, 7109, 10382, 7953, 1607, -975, 6907, 17208, 11470, 10435, 4014, 5452, 12670, 15042, 7539, 19396, 12003, -3052, -2931, -3873, -7962, 5413, 6749, 3817, -753, -3597, -10320, -7717, -2036, 9899, 15414, 18117, 27261, 29652, 20162, 12942, 3385, 15350, 36109, 25973, 6855, 1568, -5233, 1142, 2781, 13230, 12387, 3320, -3325, -1202, -10313, -19964, -3489, 2658, 4639, 5429, 9983, 19910, 18683, 13654, 14763, 1747, -5179, 3020, -6852, -9197, 2976, 467, 10954, -171, 4358, 20535, 27026, 26805, 16832, 11631, 16458, 7534, 3696, 8645, 19284, 31212, 26026, 20421, 17731, -2946, -10719, -22713, -26659, -20323, -21391, -22460, -19364, -10503, -12751, -16017, -12075, 582, 16160, 15671, 12873, -1098, 2618, -7489, -14069, -10021, -1799, 7288]
19006G288j1775m677L130J0208k000P217j125k835m960l313j161Q926J2690L410
18992B1023J2082o076r071p999L626J0836P174m543j6289K192n864j0835M31K801
18978e12R039J4499O15M007j1990p806J628K613j408q70O406L292M867N231P157
18963C6768k089p999K163R529J794j7457k024J949n673L610k023o456R03K236
18949A5231K275N09L927j1977r41M349k11O11n900p129j3105m033Q40l165k242
18934b0961o5P110M831j922R119q76P421m577j6414m80M175J1665J5224J2569
18920B6819N537j0981j7974j3743K3R583Q475J435j0466O172k244m222K139L284
18906C837N92J1237K019k228j0656L643J404q787K775K544K802o768j304L236
$$ y = [7288, -4487, -9164, -6034, 4174, 2174, 9391, 8266, 5431, 471, -2842, -4003, 4923, 17613, 21023, 33105, 27029, 17958, 9959, 13585, 24421, 31595, 27052, 10763, 12955, 7091, -3744, -3313, -512, 8527, 23026, 23641, 27648, 15658, 7852, 9480, 12093, 10685, 9815, 16221, 19513, 24380, 29611, 36768, 34679, 26680, 28843, 38372, 40166, 22709, 20685, 22634, 16961, 20571, 18548, 12092, 12995, 15231, 17506, 18015, 21942, 9965, 9024, 13373, 13162, 13773, 7873, 744, -12361, -16394, -15554, -18719, -20961, -21026, -13916, -9085, -11007, -1888, -2764, 4657, 80, -16334, -16814, -12639, -974, 14250, 26819, 32356, 21375, 3401, -10342, -10319, -736, 7739, 9174, -1292, 4880, 2636, -1586, 553, 3837, 4429, 15666, 17685, 15457, 4801, 8444, 9848, 1061, 3836, 6380, 9182, 2414, 1110, 4346]
18892D346N94m918J865O324l939l751K414J1129J7627k296n038l526M789N123
18878C0743j6970o95J3032J0001j0727M206q211m698n087l982L180J1746o435
18865A6103j196n396P267q367k4395r959J1744J3363M308j1618J1676R357j2889
18852bJ3832Q637j109n877j7350j9163R538R124k352J1522j1813l101J0078J0101
18838A2065L466q610q779O967J53O480K1211J483r560O023o303j1750l558Q4n119
18823D253p748M363P520P095O304m027p784N121M046O74m995Q02P392p643j3409
18808A964N092L659j5965n925K3314O937j2316j0862O685P236k546j010R01o92
18794F472n966K050P814O82j247j7757q559M073J7485K4755m886r544P261M639
$$ y = [4346, 4940, 22, 1887, 8211, 4272, 521, 2935, 14064, 31691, 29395, 24357, 20831, 25620, 30743, 13773, 13078, 26110, 36111, 25384, 29590, 21379, 16681, 11594, 7612, 10792, 22538, 16103, 14907, 9511, 16778, 8411, -15984, -25943, -14199, -836, 3472, -8146, 3530, 12887, -2, 13830, 22467, 21358, 15481, -1869, -21032, -11494, -2370, -4722, 6800, -5013, -8114, 1964, 12065, 15531, 6921, -1858, 5109, 5262, 11742, 32953, 34436, 24876, 30899, 24596, 12846, 9288, 9372, 4253, -3495, 868, 8388, 15483, 21787, 17760, 9976, 15097, 19143, 19817, 14822, 15624, 23016, 15373, 1964, 7056, 10715, -5250, -11175, 12139, 19076, 6760, -4102, 2583, 9819, 7273, 6263, 7164, 6472, 506, 2556, 10370, 11052, 9805, -7952, -16511, -12438, 5047, 29802, 24916, 15372, 22633, 27272]
18780B7272j410J2410k529J039r181N755P276M821O438P911K5516M7192O1669
18767A94179J7612n9267n3329k9643r490j4250j4925K354p331m650r338r999O662
18754H585J8366J1935J552j9548k0557N035M986K7012R357p877j8608q760m245
18741G233L725L63N318k98R067n263q69q754K159N364Q702M031M116J3451k145
18726D6200q146N605j5412p283P825j160k882J3398K491n920K79O182P410q539
18712D0048q751L681Q160R084N313J3336N783J2022j4734l703O438Q317O805J4827
18698A06626K3541J2493J7727J6501J9056K1380J8450J5190K0460J8819J9810
18687C10053J8291K5654J8092R384M920m021j9041j8860j1803l806j8155o968
$$ y = [27272, 25862, 38272, 35743, 36782, 27601, 33356, 40632, 45453, 51891, 59802, 85318, 132510, 194179, 211791, 152524, 99195, 69552, 60062, 45812, 30887, 33241, 25910, 21260, 11922, 1923, 8585, 26951, 38886, 40438, 20890, 333, 5368, 10354, 37366, 46723, 38846, 20238, 11478, 7233, 10958, 11321, 16639, 16341, 25408, 20145, 19276, 10522, 12681, 18045, 26747, 30778, 34894, 48345, 46200, 38054, 43659, 28247, 20964, 28789, 27629, 24747, 38145, 40636, 34716, 34995, 41177, 48587, 40048, 31297, 34978, 43138, 52222, 57535, 70871, 76654, 88676, 73942, 70239, 76677, 84994, 91799, 106626, 130167, 142660, 160387, 176888, 195944, 217324, 235774, 250964, 271424, 290243, 310053, 328344, 353998, 372090, 381474, 386394, 382373, 363332, 344472, 332669, 328863, 310708, 303740]
18675C03740l794n947k3492j0231K643j4808j5229k2385r676k1336k7092j0097
18663A42296p695N152P37j0172J1082O854J0103n462j2996Q086k698K883m060
18650A44110K79J0410J1263O551K2244K4214J2906J5313K2725J9515K2407M270
18638C16207K136M1740M7196L5863J4434J4878L744l840M290J508j0010k8295
18626D39851l0570l2647l1272k2795l1319n3120m1167p578l525l285r643k4092
18614A48838k5950j3910o70j8761J322K623n559L339o24J687J0073K004p082l113
18600I4217r00k2276j3104j1513j8374o77Q890j907k442r128j2712J2373L216
18587B5663j0l293p246N264J649j662O527K71n702O139J473N203l583M59N157
$$ y = [303740, 299946, 293999, 270507, 260276, 262919, 248111, 232882, 210497, 200821, 179485, 152393, 142296, 134601, 139753, 140490, 130318, 141400, 148254, 158357, 152895, 139899, 147985, 145287, 148170, 144110, 144389, 154799, 166062, 172613, 194857, 219071, 231977, 247290, 270015, 289530, 311937, 316207, 318343, 360083, 407279, 443142, 457576, 472454, 476198, 472358, 476648, 478156, 468146, 439851, 409281, 376634, 345362, 322567, 291248, 238128, 196961, 189383, 185858, 182573, 172930, 148838, 122888, 108978, 108308, 89547, 90869, 93492, 87933, 91272, 90648, 92335, 102408, 104412, 97330, 94217, 93317, 71041, 57937, 46424, 28050, 27373, 36263, 34356, 31914, 22786, 10074, 22447, 25663, 25653, 22360, 15114, 20378, 22027, 20365, 26892, 27163, 21461, 27600, 29073, 34276, 30693, 31152, 36309]
18572C6309o336j711M914l410k1404p442K951N5j529k273J0705M328M898o807
18558A3248L71J6709J3102K028q168j0399P069k387J2829j64o392p128n535J055
18544B6238L794R389q834k482j359J336k349Q237M735m73j109J764o780n659J2852
18529C9300R090j1538L09Q971L426j3392n345J5J0662J9643J3020J467l26r05
18515G4397j6489j0735J183M403P136J836O558Q140J103l299J5487j8014j2760
18502E8946j150K809m94o115k159j0494n362R605j334j0453p625K3132J2813L620
18488F5739j6852k3251J520K1154J3107Q20L571N197K018M872j807J2386L443
18475I1917L336j2202j0588k0051j2533j9159N82J2054K3086J2738K1785K7441
$$ y = [36309, 29973, 28262, 33176, 29766, 8362, 920, 3871, 3926, 2397, 124, 10829, 15157, 20055, 13248, 13619, 30328, 43430, 45458, 37290, 26891, 33960, 31573, 44402, 44238, 37846, 30718, 25183, 26238, 30032, 39421, 30587, 28105, 26746, 28082, 25733, 33970, 38705, 38232, 37123, 38887, 32107, 26448, 39300, 48390, 36852, 37161, 46132, 49558, 36166, 30821, 30836, 41498, 61141, 74161, 75628, 75302, 74397, 57908, 47173, 48356, 52759, 59895, 61731, 68289, 76429, 77532, 74233, 89720, 71706, 58946, 57796, 60605, 60111, 53996, 51837, 41343, 35981, 45586, 44252, 33799, 26174, 49306, 62119, 65739, 48887, 25636, 27156, 48310, 61417, 62237, 65808, 71005, 73023, 77895, 76088, 88474, 91917, 95253, 83051, 72463, 52412, 39879, 20720, 21302, 33356, 56442, 69180, 90965, 118406]
18463A18406J3146j1404j3316j0018j5597m597m843j6722j406j0036m53K452q989
18450C6623J969N635k198K681j583j037p511l825M474m660l792Q904N464l121
18436C8023m964j4049m673J8795J9806J2384O973K1135J3803J5356P505Q779Q7
18423A38960K3991K8369L9425J1922j5048j8595k3665L999O773R140K842M297
18411B12410j30l822n422j0852j3927j3919M265j2917j1428j4082j3366J02O468
18398A23380L227j6152n496Q963j84j327j0373k4084j9140p087k723J589k58M275
18384E4610J818J1462N463J953J863o228L265j663j1179q476o118o501J2139J4319
18370F6727J733j0059J96Q052J3977J5737J9714p19m176J1835J5507j172J1057
$$ y = [118406, 131552, 120148, 106832, 96814, 81217, 76620, 71777, 55055, 53649, 43613, 43160, 45612, 36623, 38592, 44227, 42029, 44710, 43127, 42090, 34579, 30754, 35228, 30568, 26776, 35680, 41144, 38023, 33059, 19010, 14337, 33132, 52938, 65322, 72295, 93430, 107233, 122589, 130094, 138873, 138960, 162951, 191320, 230745, 242667, 227619, 209024, 185359, 189358, 196131, 205271, 208113, 212410, 212280, 208458, 203036, 192184, 178257, 164338, 168603, 155686, 144258, 130176, 116810, 116912, 123380, 126607, 110455, 104959, 113922, 113738, 112411, 102038, 77954, 58814, 51727, 49004, 50593, 50335, 54610, 56428, 67890, 73353, 75306, 77169, 70941, 74206, 72543, 61364, 52888, 46770, 40269, 52408, 66727, 68460, 58401, 58597, 66649, 80626, 96363, 116077, 115358, 111182, 123017, 138524, 137352, 148409]
18357A48409J3629J0281j391j7519j1929l437l983O907K4657K3046K1530Q085
18345B18285k0039k0157n767N288N426O485J5806n266K527K1970m44r026q663
18332B06425j8014j4282j3408p633j6356k7564k0681j7278J28N015J2508J1256
18320A00116J9265M5437K8573L065j7729M05J5818O016j7854j5035n583M486q254
18307A58726M622K7965O473l553J8053J6954N243q81m509k1894j5589O466J7473
18294B15549R27j9001l4521k9656P118M5249N5699P8345N6304K3771n277k6968
18282C67539j4070Q476O258q969j8577M239O45J1708K3340J9177J6974J6516J5883
18269D49139J4550L4926K7479J5132R28k3385j6572k5377p021K862j0091k856
$$ y = [148409, 162038, 172319, 170928, 153409, 141480, 138043, 134060, 140967, 165624, 188670, 210200, 218285, 198246, 178089, 172322, 177610, 183036, 189521, 205327, 200061, 202588, 224558, 224114, 215088, 206425, 188411, 174129, 160721, 153088, 136732, 109168, 88487, 71209, 71337, 76352, 88860, 100116, 119381, 164818, 193391, 196456, 178727, 179132, 194950, 200966, 183112, 168077, 162494, 166980, 158726, 163348, 191313, 197786, 194233, 212286, 229240, 234483, 233602, 229093, 207199, 191610, 198076, 215549, 216476, 197475, 162954, 133298, 140416, 185665, 241364, 319709, 376013, 399784, 394507, 367539, 353469, 361945, 368203, 359234, 340657, 344896, 345541, 357249, 380589, 399766, 416740, 433256, 449139, 463689, 498615, 526094, 541226, 542154, 518769, 502197, 476820, 469799, 472661, 462570, 459714]
18257D59714Q319K750J3887J1094j6415n614L184K449J4688K6246R868l956J3680
18244E39894K8000L5501L5487L3994K0231K7409O5142R1021J17296J47694J42782
18233A284451J32882J23689R8099O8515N8501O5977R2605J74471L26506M99130
18223B924826M65277J18548k19883k64793j10799L1725J06682N5744q3976j86485
18213B836866j79545j09744m1426K4702P2121M6958O812j2043J4243N5251P9913
18202B794108M5963K6586K8577L6268N5495J13947J40370J38442J40699J48432
18192C668887J38646J26044J22633J45968K46093L61529M58457N49483O35955
18183F453695P42508Q02536Q14747Q59495R98641J163726J378655J702416K157278
$$ y = [459714, 468033, 470783, 484670, 495764, 479349, 473735, 476919, 479368, 494056, 520302, 530170, 526214, 539894, 567894, 603395, 638882, 672876, 693107, 720516, 785658, 876679, 993975, 1141669, 1284451, 1417333, 1541022, 1639121, 1707636, 1766137, 1832114, 1924719, 2099190, 2425696, 2924826, 3390103, 3508651, 3288768, 3023975, 2913176, 2944901, 3051583, 3107327, 3023351, 2836866, 2657321, 2547577, 2506151, 2530853, 2602974, 2649932, 2656744, 2644701, 2658944, 2714195, 2794108, 2840071, 2866657, 2895234, 2931502, 2986997, 3100944, 3241314, 3379756, 3520455, 3668887, 3807533, 3933577, 4056210, 4202178, 4448271, 4809800, 5268257, 5817740, 6453695, 7196203, 7998739, 8813486, 9672981, 10671622, 11835348, 13214003, 14916419, 17073697]
18174A7073697K671122L240089L948620M882127O187219Q300927J2257513J9830735
18166G8392049L3531425N6289098Q8442016J16038730J00189584J2989843q5266097
18159D00606648j17197368r3217988n9000827l5023701k1318629j3924644j0014569
18152E0908922p709174n946207m535491l654547l322778l146052k795760k349006
18144A7449907j945016j634092j406730j187156r33593p62142o74774o18445n64066
18135G723893n12847m85215m49850l58105l04881k51823k66691k88577k73343
18126D532561k45438k21355j75956j46117j16340p7594j2756P1199J53176K48808
18116D010188M12157O53633J075810J975168L810881P099385J1186581O596408
$$ y = [17073697, 19744819, 22984908, 26933528, 31815655, 38002874, 46303801, 58561314, 78392049, 111923474, 168212572, 256654588, 372693318, 472882902, 485872745, 400606648, 283409280, 190191292, 131190465, 96166764, 74848135, 60923491, 50908922, 43199748, 37253541, 32718050, 29063503, 25740725, 22594673, 19798913, 17449907, 15504891, 13870799, 12464069, 11276913, 10343320, 9581178, 8906404, 8287959, 7723893, 7211046, 6725831, 6275981, 5917876, 5612995, 5361172, 5094481, 4805904, 4532561, 4287123, 4065768, 3889812, 3743695, 3627355, 3549761, 3537005, 3608204, 3761380, 4010188, 4422345, 5075978, 6151788, 8126956, 11937837, 19037222, 30223803, 36820211]
18108C6820211q212178j1179565o405131l262665j894750j180147p83384n45542
18100C356849m09859k98580k26184j95377j62287j28668p9964l9346J5492M1441
18090A873517l5153j59173k24328j75603j25528r7428q7117n5226n3909m9478
18080H10574k4950k4483k7655j6262k6588k4001j2391J748r131j5371k2168k6075
18068E83247j6566Q146K7479L3922N2037M2030L514o005k2172n1115m4067n0096
18056E60354k9067l7748k1776j8397K41J4113K2399K8897L1504J4268p011j7710
18044E40067l5004k9697l6978m0147l7835k9020j2349l03L1418M8998L5876J4877
18032D49903j680j8306k9075m4117m1789k1175q672j4965k6176p637J184K6535
$$ y = [36820211, 28608033, 17428468, 11023337, 7760672, 5865922, 4685775, 3902391, 3356849, 2946990, 2648410, 2422226, 2226849, 2064562, 1935894, 1855930, 1816584, 1832076, 1873517, 1838364, 1679191, 1454863, 1279260, 1153732, 1056304, 969187, 913961, 860052, 810574, 785624, 761141, 733486, 717224, 690636, 666635, 654244, 655992, 646861, 631490, 609322, 583247, 566681, 574827, 602306, 636228, 688265, 730295, 733809, 727804, 705632, 654517, 610450, 560354, 531287, 493539, 471763, 453366, 453607, 467720, 490119, 519016, 550520, 564788, 557777, 540067, 505063, 475366, 438388, 398241, 360406, 331386, 319037, 318734, 350152, 399150, 435026, 449903, 448223, 429917, 400842, 356725, 314936, 293761, 285089, 270124, 243948, 236311, 237495, 264030]
18020B64030L7180K1026j7800l2348l5198m0937k3564j9548j0033o600j895m210
18008A30103j4755p633Q851J5307J7766J6622k009J9021K7530J8531J8786J967
17996B50087j1306k8599k0154m924P956k374k9688j8650O1o31n122j0728m118
17983A21810k1193j3767J6150R242M487k3226k4353r90J7627K6585J9702K073
17971A34147j8012j2465J3666K2409L4714K4135K6534K5446K5403L2219L0376
17960C38572J5026L1256K6445J1773R526j7991l1895j0452j6310j585k035j9559
17948C32771k1055j954M535o424k4610j3150k236k0570k9379N803J8057k673l0001
17935B09114k5974m920j0819j3961j869j0426j3220j5678j1664m445R800R40J4847
$$ y = [264030, 301210, 322236, 304436, 272088, 236890, 195953, 172389, 152841, 142808, 136208, 134313, 130103, 115348, 107715, 116566, 131873, 149639, 166261, 164252, 183273, 210803, 229334, 248120, 250087, 238781, 210182, 190028, 185104, 193060, 190686, 160998, 142348, 142409, 141778, 136656, 125928, 121810, 100617, 86850, 103000, 112242, 116729, 93503, 69150, 68160, 85787, 112372, 132074, 134147, 116135, 103670, 117336, 139745, 174459, 198594, 225128, 250574, 275977, 308196, 338572, 353598, 384854, 411299, 423072, 432598, 414607, 382712, 372260, 355950, 354365, 352330, 332771, 311716, 309762, 314297, 307873, 283263, 270113, 267877, 247307, 217928, 223731, 241788, 239115, 209114, 183140, 178220, 167401, 153440, 151571, 141145, 127925, 112247, 100583, 96138, 105938, 106878, 121725]
17922A21725R340j905p627j1432j1810n147O919N784R871J8464L683K0387L7035
17909A95287K1517J3939J0155J4056J0288j0697o459j1345j3651k9277l0073q746
17897A54994j6646m60n33Q708J3518J3415J8695R557j3583k5089k5275r663k825
17884A24813N645Q906P746r610j3499R18O371j1866k556L806j8515p344j4267
17871H0548j9929K159j2011j6426K838O134r186j3J6491M659j1393r948P807J0503
17857E2233j536N338K279R905R508j7566k2145k168k118l437j5713J105n003j5889
17843e207k183q250k50K1385N306K2573K3358L001k0858k770M799r42P490P480
17829E4932q758r675n316K289j5471o675l429j656J0018J7725J184m839r300r378
$$ y = [121725, 131065, 129160, 121533, 110101, 98291, 93144, 100063, 105847, 115718, 134182, 137865, 158252, 195287, 216804, 230743, 240898, 254954, 265242, 254545, 248086, 236741, 223090, 193813, 163740, 154994, 138348, 137888, 137355, 146063, 159581, 172996, 191691, 201248, 187665, 162576, 137301, 127638, 124813, 130458, 139364, 147110, 137500, 124001, 124919, 131290, 119424, 116868, 120674, 102159, 94815, 80548, 60619, 62778, 50767, 34341, 37179, 43313, 34127, 34114, 50605, 55264, 43871, 33923, 41730, 52233, 50697, 56035, 58314, 68219, 77727, 60161, 38016, 35848, 33730, 30293, 14580, 15685, 10682, -5207, -7390, -15640, -15890, 5495, 10801, 33374, 56732, 59733, 38875, 36105, 40904, 39962, 47452, 54932, 46174, 36499, 31183, 33472, 18001, 11326, 7897, 6241, 16259, 33984, 35168, 30329, 21029, 11651]
17815A1651L443o548l528J2587N307K446m791n312p386J443N445M104l875L867
17801A8853O698M790K484p410j4778P882J0919m214l599J441j109j0230r258M66
17787B935j052J629M640Q704P145l078J771o3N83j1477j6491J2643J3705k501
17773A9093K101K2073p444j6811m870n771j734N230Q530K733l217J018o955J3342
17759B7318J5572n826n977p698O770j2327J2483P956J590N523n492k772m741p115
17745B5264M498M246o866L377J1041L150j6495j5516o345j1828k792l031j415
17732a2712L331J3643K174M609k319l904j3218L205J3375J4353J76j983q139j3602
17718a011l503r352N064P257J3514j180m82J0677L914k836O843J6104J6124O518
$$ y = [11651, 15094, 8546, 5018, 17605, 22912, 25358, 20567, 15255, 7869, 9312, 14757, 18861, 14986, 18853, 25551, 30341, 32825, 25415, 10637, 18519, 29438, 25224, 21625, 23066, 21957, 11727, 2469, 2935, 1883, 3512, 8152, 16856, 24001, 20923, 22694, 22631, 23214, 11737, -4754, 7889, 21594, 19093, 21194, 43267, 35823, 19012, 14142, 8371, 6637, 11867, 20397, 23130, 19913, 20931, 13976, 27318, 42890, 37064, 31087, 23389, 30159, 17832, 30315, 38271, 39861, 45384, 39892, 37120, 32379, 25264, 29762, 34008, 27142, 30519, 41560, 44710, 28215, 12699, 6354, -5474, -8266, -11297, -12712, -9381, 4262, 6436, 11045, 8726, 4822, -8396, -5191, 8184, 22537, 22713, 20730, 12591, -1011, -4514, -13866, -8802, -1545, 11969, 10789, 10307, 20984, 24898, 22062, 28905, 45009, 61133, 67651]
17704F7651K0580p18J3189J2140J0052K4318L7659L0732J9710K7871J7749L0599
17692C11532M4391L8960K4582L3475L4695K5914k137N424J949j3762l2030l7767
17680D35226l9374l1972l3112l5520k8131k0734j3915k271k8472k2359k4759n856
17668A48751N948M159j9269j5461n224K313L216O869J0724K1848L3372K3631K2597
17655B43474K9990J4280L247J3397J9654m238k1642k0937k3383j0029P654M294
17643B55761J8895L120M795J3979K3019K3621P826K959N487J0850O96j5001j5858
17630C40149j4787o989n969j0105r088j8196k7282l5792l2234l6457j9700l4239
17618H9311l2468p108q80j2151j1424J1959j3024j3128R241k239p229r077j4458
$$ y = [67651, 88231, 87513, 100702, 112842, 122894, 147212, 184871, 215603, 235313, 263184, 280933, 311532, 355923, 394883, 419465, 452940, 487635, 513549, 511412, 516836, 518785, 505023, 472993, 435226, 395852, 363880, 330768, 295248, 267117, 246383, 232468, 230197, 201725, 179366, 154607, 148751, 154699, 158858, 139589, 124128, 118904, 121217, 124433, 131302, 142026, 163874, 197246, 220877, 243474, 273464, 287744, 290991, 304388, 324042, 319804, 298162, 277225, 253842, 243813, 251467, 255761, 274656, 277776, 282571, 296550, 319569, 343190, 351016, 353975, 359462, 370312, 371008, 356007, 340149, 325362, 318373, 312404, 302299, 293211, 275015, 247733, 211941, 179707, 143250, 123550, 89311, 56843, 49735, 48855, 36704, 25280, 37239, 24215, 11087, 20328, 18089, 10860, 1783, -12675]
17605a2675j969M164N107J1034m998q46p643M879N219N685N40r646j0049O237
17591d961J2422n834k778R411P17n148J214J4619m843k2831j1248j503R827p6
17577a1012q165p62K131K862k609m587J413K511K946N361J993r228J3564O414
17563B832n838j7986k416P49p700J2738J42j7350p874n673R393M856J4025K0278
17549A76K102p712q178M810J717p599l867K940n584Q515P351m865M365J1151n332
17534a0N234n711m037N794o252j440L334p75p92J1580K596j4815j3392P267O138
17519e281o271j4514R535R762M240M466J3113j2132j2643l21l620m815k929n212
17505b6622o092N541l730J2902J2395p334k3327m787J4632J8479l433o474p705
$$ y = [-12675, -14644, -10480, -5373, 5661, 663, -183, -7826, -2947, 2272, 7957, 8497, -1149, -11198, -4961, 7461, 1627, -1151, 8260, 8977, 3829, 5043, 19662, 14819, -8012, -19260, -20763, -10936, -11012, -19177, -19939, -17808, -14946, -17555, -22142, -20729, -18218, -15272, -9911, -7918, -17146, -3582, 2832, -3006, -20992, -23408, -22659, -30359, -17621, -17479, -34829, -42703, -48376, -38983, -34127, -20102, 176, 2278, -5434, -13612, -8802, -7085, -14684, -18551, -15611, -21195, -12680, -5329, -10194, -5829, 5322, -10, 5224, -487, -4524, 1270, -4982, -6422, -3088, -3863, -4655, 6925, 9521, -5294, -18686, -11419, -5281, -11552, -26066, -16531, -6769, -2529, 1937, 15050, 2918, -9725, -10046, -13666, -18481, -21410, -26622, -32714, -27173, -30903, -18001, -5606, -12940, -36267, -41054, -26422, -7943, -11376, -17850, -25555]
17492b5555l530j3264j252J2788O033q077L566J2937R830m153q800Q925p019P934
17478i637k763j3121P791K384n609K247N129P089l74O826O054o849j6637j2343
17464b9813K58J019J3105J66k0068L088K2433M680j3535O926m785K560Q230K705
17450c031j748J508L094k507K4960L1041M7557M6765J1995m4644l2770j1265l0413
17437D0542k8696j8708K200j0761N412J5085k691q739Q21m94n99l510q171n727
17423b4036L992J5225N759p639m291N750J0859n952J941m582j0049l148N597J9206
17409H632L802q936j308j625j1060p031M783J0962o601l216O512o289n728m77
17395a7580%j227J798O739l353p383q81j0206K28q687J888O625L887O617p183
$$ y = [-25555, -29085, -42349, -43601, -30813, -24780, -32857, -29291, -16354, -6524, -10677, -19477, -10552, -17571, -9637, -12400, -25521, -17730, -15346, -20955, -18708, -13579, -6490, -6864, -38, 6016, -833, -17470, -29813, -29555, -28536, -15431, -15265, -35333, -32245, -9812, -5132, -18667, -11741, -16526, -13966, -5736, -3031, -4779, -3271, -177, -2684, 22276, 53317, 100874, 147639, 159634, 114990, 82220, 70955, 40542, 11846, -6862, -4662, -15423, -10011, 5074, 2383, -6356, -5535, -6029, -6628, -10138, -18309, -24036, -20044, -4819, 940, -6699, -10990, -5240, 5619, -333, 1608, -2974, -13023, -16171, -10574, 8632, 12434, 3498, 2190, 565, -10495, -17526, -12743, -1781, -8382, -11598, -5086, -11375, -17103, -17580, -17580, -18807, -17009, -10270, -13623, -21006, -21887, -32093, -31865, -40552, -38664, -32039, -28152, -21535, -28718]
17380b8718J884L632K136J877J3708J47j3249l717Q038R21R193Q325o93j1299
17366g815m610N654J644j1746m797l831l70L351O208P253O457J274j1630M108
17352h850k701j773J3124O695K197l40k366P90L037M893l921L58q121j0425j1202
17337a8605o063J1643Q900J3720L105j8802j0650L604J0643j03M117J2192r574
17324D127j3740m574K390P213n487K205N965O90N611n900q988p625o004J999j380
17309b3498o664l471J761Q102J1458o184O110L451j2512k243K1135O021l719J410
17295A157P438q210m819L023o656J1106J4419N770M653J641p353j1597R850O582
17281B7004l479r966J6215M237j2444J1319p653o104m400q367K708J1754R957
$$ y = [-28718, -26834, -23202, -21066, -19189, -5481, -5334, -18583, -22300, -14262, -13341, -4148, 4177, 3484, -7815, -12425, -6771, -5127, -16873, -21670, -25501, -25871, -22520, -16312, -9059, -2602, -1328, -12958, -8850, -11551, -13324, -200, 6495, 8692, 8352, 5986, 6776, 9813, 14706, 10785, 11143, 3022, -7403, -18605, -24668, -13025, -4125, 9595, 12700, -6102, -16752, -13148, -2505, -2608, 1509, 13701, 4127, -9613, -14187, -11797, -4584, -10071, -7866, -1901, -1211, 4400, -1500, -10488, -18113, -24117, -22118, -23498, -30162, -33633, -31872, -23770, -12312, -18496, -12386, -8935, -21447, -23690, -2555, 3466, -253, 1157, 8595, 385, -4434, -1411, -8067, 3039, 17458, 23228, 27881, 29522, 22169, 10572, 20422, 27004, 23525, 13559, 29774, 34011, 21567, 32886, 25233, 19129, 14729, 6362, 9070, 20824, 30781]
17268C0781P808n338p456J356N776r359n566O36n448j909Q426l963o767q415j5316
17253a4754m409M212J3726o685P38L293L18m980r211K009M434J5814J410k750
17239C165j468p172j567L65j78O721P389J0315K641J08J2062l051j5630M69Q598
17224B2767O109J7618L1704J8153k3145l0106q170K967j480j950J4753o994k539
17211C9687O614M503l68r060j217J3416m28j7424j1207j0026k339M352k389Q566
17197B2680j61k589j586Q610p855j2111J0630m367n906L398J672O199j7322p567
17183f275L832J4347J2256O705q547j584J904J2504J1728l758j1489o295j465
17170B3863q750J3647J7594j542l960p358j6721p511k920J0703J4927J336R287
$$ y = [30781, 38589, 33251, 25795, 27151, 32927, 23568, 18002, 18638, 13190, 11281, 19707, 15744, 8977, 562, -14754, -19163, -14951, -1225, -7910, -7172, -3879, -3561, -8541, -17752, -15743, -11309, 4505, 5915, 3165, 1697, -5475, -7042, -6677, -6855, -134, 7255, 17570, 20211, 20319, 32381, 29330, 13700, 14169, 22767, 28876, 46494, 78198, 96351, 73206, 43100, 34930, 37897, 36417, 34467, 49220, 42226, 39687, 46301, 50804, 50436, 41376, 40159, 53575, 53147, 35723, 24516, 14490, 12151, 16503, 14114, 22680, 22519, 19930, 18344, 26954, 19099, 6988, 17618, 13251, 7345, 10743, 12415, 18614, 1292, -6275, -2443, 11904, 24160, 30865, 22318, 20734, 22638, 35142, 46870, 43112, 31623, 25328, 23863, 15113, 28760, 46354, 44812, 40852, 33494, 16773, 9262, 6342, 17045, 31972, 33308, 42595]
17157D2595J957p067l184O006k032j5238j5351P319J989j4928l274R471l286n201
17143b24J205m095R75N601M343L30K099r751l395p532k553J525J1742J3583o714
17128G139N756P822l735J460j0263J54L309J0629J7510J6428J6329R326J0381
17115I2245r642j1110M030J7836K0030K9162j96k2870l3709j3328M737j2850m795
17102E9540p771k6221j7879o424K0930J5883p347l784j2902k939j912q782R408
17089I800K01o923k2752k018J4311J5255k732n510K69R86n37L841l612R538K3565
17074C3682J0886P270n3m256L377j0503l826J2648j425P306J6379J4707K4786
17061A10978K132j2632j0526p020r868p390j303l759j9018j2937j0323N36J249
$$ y = [42595, 44552, 37485, 34301, 40307, 38275, 23037, 7686, 15005, 16994, 2066, -1208, 8263, 4977, -224, 981, -3114, -2139, 3462, 7805, 8135, 10234, 483, -2912, -10444, -12997, -11472, 270, 13853, 7139, 12895, 20717, 16982, 18442, 8179, 8333, 11642, 22271, 39781, 56209, 72538, 81864, 92245, 82603, 71493, 75523, 93359, 113389, 142551, 142355, 119485, 85776, 72448, 77185, 64335, 59540, 51769, 25548, 7669, 1245, 22175, 38058, 30711, 26927, 14025, 11086, 9174, 392, 9800, 10001, 3078, -19674, -21692, -7381, 7874, 5142, -368, -99, 887, 350, 4191, 579, 10117, 33682, 44568, 51838, 51785, 47529, 50906, 40403, 36577, 49225, 47800, 55106, 71485, 86192, 110978, 113110, 100478, 89952, 82932, 73064, 65674, 64371, 60612, 41594, 28657, 18334, 18870, 20119]
17048B0119j0738l773O23n980o009m45J0704Q507j02J891j526Q726l06q739p018
17033E934j161L452k551q384n356M395J2791k38k0678k327m357J914Q535K1320
17019A3289M643j1139n69J7791k431n627p222j5946R128R395j1033j5182p844
17006b2747R059O827M280l153m050L824K232n15O495n320q56j4231N095j294l854
16991a8208O925n495O132q590k777O01j139J2165J5611n469k904R607M284l63
16977A0380j541k82M351L227m050j417o05j1406q538l96r01K722M647N308J26
16962A625L020q346j7687m037J7025J1018N455L952j4074j6063J543J7079K47
16949G57j8134j026O11l446Q274M401R104M575o729o002J6213J6313k252j934
$$ y = [20119, 9381, 5608, 6231, 251, -5758, -6203, 4501, 13008, 12906, 14797, 13271, 21997, 21691, 12952, 5934, 4773, 8225, 5674, -2710, -8066, -3671, 9120, 8882, -11796, -14123, -18480, -16566, -8031, 13289, 17932, 6793, 6224, 24015, 21584, 15957, 8735, -7211, 1917, 11312, 279, -14903, -22747, -13688, -6861, -2581, -5734, -9784, -5960, -3728, -4243, 2252, -3068, -3924, -18155, -13060, -14354, -18208, -11283, -16778, -10646, -19236, -22013, -21412, -22551, -10386, 5225, -244, -3148, 6459, 10743, 10380, 8839, 8557, 12908, 16135, 12085, 10668, 10063, -1343, -9881, -10277, -11178, -8456, -3809, 1499, 1625, 4645, -3701, -21388, -25425, -8400, 2618, 8073, 12025, -2049, -18112, -16569, 510, 757, -17377, -18403, -17792, -21238, -12964, -8563, 541, 5116, -1613, -7615, 8598, 24911, 22659, 20725]
16935B0725M185j4554r690J546L290j223M467O698M515m422L475O679Q451J2788
16921D6930j3108p63N370j853m71o075q755J7435J1109K993j5774m082R255K528
16907D4739j187j8114l749j9024L201m283p696l101n277m589j994J851q407J2378
16893a5252J2862P163j501k420J5496o209k858j5792j2210j0244j419l103M867
16880c0620K395Q417J4246L275K533Q428j5382L061P037N426j888j0626n073j293
16866a0064J333R13M03r50j125L176M526J1830K757j9838j5278M096M722R397
16852d102L798l438J5721n378k3242m35P672J7713K276j6061j619N566Q28L4n61
16837a228l267J8519j828j1297q234J588k550j3128J6536J6642j0547l130R595
$$ y = [20725, 24910, 10356, 666, 2212, 5502, 4279, 8746, 15444, 19959, 15537, 19012, 25691, 34142, 46930, 33822, 33059, 38429, 36576, 36105, 30030, 21275, 38710, 49819, 52812, 37038, 32956, 42211, 44739, 43552, 25438, 21689, 2665, 5866, 1583, -6113, -9214, -14491, -19080, -21074, -19223, -27630, -15252, -2390, 4773, 3272, 852, 16348, 10139, 7281, -8511, -20721, -30965, -32384, -35487, -30620, -28225, -19808, -5562, -2287, 246, 8674, -6708, -3647, 3390, 8816, 6928, -3698, -8771, -10064, -8731, -7818, -7415, -8365, -9490, -6314, -1788, 10042, 12799, -7039, -22317, -18221, -13499, -4102, -304, -3742, 11979, 6601, -16641, -17076, -9404, 8309, 10585, -5476, -7095, -1529, -701, -667, -1228, -4495, 14024, 12196, 899, -7335, -5747, -8297, -21425, -4889, 11753, 1206, -1924, 7671]
16824G671K5635P688N065n597N356o052L857K2604J7045j336o241O688l084j5667
16810F3632p349n995J041j526l651l801j0727j8458n528n119Q03J433N26l476
16796A805L73m492m973P484J7677J8458O727j671j3469j8688j8719m380O876k539
16782i531L849Q461l873L178J622j3994J1389l102j3076N687N283j399k025k247
16768i778Q9Q387J1728K752r942j7114j3918o019k645P923N83p832R598J8282
16754g906l052K465N822k1164M128J1126J794O398q938m587J0728n686j3779q292
16740c0943r911R691q267k82J6157P983K172Q963l512j137O896L585j1530r194
16726a9329j0901J391J17O864N122J524M862L10n001J2229m171m927o498j6115
$$ y = [7671, 33306, 40994, 46059, 40462, 45818, 39766, 43623, 66227, 83272, 81936, 75695, 82383, 79299, 63632, 56283, 50288, 51329, 49803, 46152, 42351, 31624, 13166, 7638, 2519, 3322, 4755, 5281, 1805, 2178, -2314, -7287, 197, 17874, 36332, 43059, 41388, 27919, 9231, -9488, -13868, -6992, -9531, -5682, 2779, -1094, 2084, 3706, -10288, 1101, -2001, -15077, -9390, -4107, -5506, -7531, -9778, -9689, -1302, 10426, 13178, 3236, -13878, -27796, -33815, -36460, -28537, -27954, -35786, -26188, -7906, -10958, -8493, -2671, -23835, -19707, -8581, -6787, -389, -9327, -13914, -3186, -8872, -22651, -30943, -40854, -31163, -39430, -39712, -23555, -15572, -13400, -4437, -7949, -9086, -2190, 1395, -10135, -19329, -30230, -28839, -28722, -21858, -16736, -15212, -10350, -10040, -15041, -2812, -6983, -11910, -18408, -34523]
16712c4523n960K709O388j038P233M046j5208J1121Q75L441m973m149o485P229
16698b9294J0922K017j892j1918r852r247P035J2234N380n617j833N257R214N542
16684a2052L916j0079L846m780Q397O226j853J0449N065j0757j3885j437l178
16671b0122L346N786J0663l301j3996p911N692K0568P28j1392j2850J6572J2097
16658E880J0294o642p502j4074J360J0751m953j1100k647K636K224j0657N914
16645a8516J376Q066K960j4058j5845j231J4494M918o678j252M319j662j1168
16632c4277K0508J1683m33j5691r899R285N189K762M605l086j4572p128n861J0868
16618b6047J5204m824J379j234j717Q864J4196l389m208j414P545k626q916N920
$$ y = [-34523, -40483, -37774, -31386, -32424, -25191, -21145, -36353, -25232, -24357, -20916, -25889, -30038, -36523, -29294, -18372, -16355, -18247, -30165, -40017, -49264, -42229, -29995, -24615, -30232, -32065, -26808, -17594, -12052, -8136, -18215, -14369, -19149, -10752, -4526, -6379, 4070, 9135, -1622, -15507, -16944, -20122, -16776, -10990, -327, -3628, -17624, -25535, -19843, 725, 1453, -9939, -22789, -6217, 5880, 16174, 9532, 2030, -12044, -10684, 67, -4886, -15986, -18633, -15997, -13773, -24430, -18516, -17140, -9074, -6114, -20172, -36017, -37248, -22754, -17836, -24514, -25766, -21447, -23109, -34277, -13769, -2086, -2519, -18210, -28109, -18824, -13635, -10873, -6268, -9354, -23926, -31054, -36915, -26047, -10843, -15667, -14288, -15522, -17239, -8375, 5821, 2432, -1776, -3190, 4355, 1729, -7187, -1267]
16604a267O533m027O95k088p554R697J0432q02O163K7540m50o762m530o166j4194
16589A3220O226j2036j0574q025n41j0495r270M2M801k739J8091J9649N692L178
16575A7219Q676J15p542j4973N089j4549m08O28L577K492q742o557J3400J1087
16561I512K432p341N798j925q43N578J1311J6270J4021K4166R370j0986j6435
16548F0928k1635r274j5291j4646o207k55m221P906J496j956j365p585j4885m747
16534c1737J0496P756J0083n087O781k22k151P683J0062M208r855r23j7096j746
16520a1748M95J2905J738O026p31r088j0292K461J4749J2559k531m459O118Q174
16506B6376n894j8186L35Q569P250J805j5742R484J053J880N049m027k1621o432
$$ y = [-1267, 5266, 1239, 1934, -154, -7708, 1989, 12421, 11619, 17782, 45322, 44872, 38110, 33580, 27414, 13220, 19446, 7410, -3164, -11189, -11730, -22225, -31495, -31453, -26652, -29391, -11300, 8349, 14041, 17219, 25895, 26010, 18468, 3495, 8584, -5965, -6373, -5745, -2168, 324, -8418, -14975, -1575, 9512, 11944, 4603, 10401, 8476, 7633, 13211, 24522, 40792, 54813, 78979, 88349, 77363, 60928, 39293, 30019, 14728, 82, -6125, -6380, -10601, -2695, -1199, -3155, -4520, -12105, -26990, -31737, -21241, -13485, -3402, -8489, -1708, -1930, -4081, 3602, 13664, 17872, 8017, 7094, -10002, -11748, -11253, 1652, 3390, 9416, 8685, -403, -10695, -8234, 6515, 19074, 16543, 12084, 18202, 26376, 20482, 2296, 2631, 11200, 18450, 20255, 4513, 13997, 15050, 16930, 21979, 17952, -3669, -10101]
16492a0101O403L384Q43r002Q248J0822N754j468j1205j7669j7203J5804Q323
16479g067M290q862j2360L94P630O413J0226l070n659j579n739Q050j6026j1531
16465c4890P299J2032K825l296J7156J582K017J2626J2056j0486o759j108R16
16452A1970J3746J0401M549R723j7028k853m794p250j1605n692L221O06r10m545
16438d61j6464l107J0470J1618n739j27O483m560j5887L567l990L40p412J0907
16424a4362M253J878K459L707q783L293k438R64l064O33p76R799J8053J0115L509
16409B9240q797K622n008k1263n79J6930q958j1606k360L814k101m006R45J0704
16395d23J747q523j0280j793K156O492m805o920l763M690R974j9741j5614l793
$$ y = [-10101, -3698, -314, 529, -8473, -225, 10597, 16351, 14883, 3678, -13991, -31194, -15390, -7067, -2777, -11639, -23999, -23605, -15975, -9562, 664, -2406, -8065, -9644, -15383, -7333, -23359, -34890, -27591, -15559, -12734, -16030, 1126, 2708, 4725, 17351, 29407, 18921, 12162, 11054, 11970, 25716, 36117, 40666, 50389, 33361, 30508, 25714, 18464, 6859, 1167, 4388, 4994, 4084, -461, -16925, -20032, -9562, 2056, -3683, -3810, 2673, -1887, -17774, -14207, -18197, -17857, -25269, -14362, -10109, -8231, -5772, -2065, -10848, -7555, -9993, -9029, -12093, -11460, -12236, -2437, 15616, 25731, 29240, 20443, 23065, 18057, -3206, -3785, 13145, 4187, -7419, -9779, -5965, -8066, -12072, -11127, -423, 1324, -7199, -17479, -19272, -17116, -10624, -15429, -22349, -26112, -21422, -11448, -31189, -46803, -50596]
16381e0596J3304J7316K985j611N088p830j595J2204Q622L695N091p868j1319
16368a2514n070l441m76L465J2247j135J1638o046j4149Q477l149M073J0266J0002
16354A4188Q614r022K578p50j1352M621K687j868p995k0302j917J0763Q716l673
16340d712L578m42r57J0329M064j0125n202j5923l67R21r44J0528K60j563L735
16325f820O768r894j3212J3956L439R82N019p803O315k600J446M75M054m488j5827
16310a8190j1200Q373J1788J0559o323J1815J1689M56m095k9413j802R641N405
16297a297N023j349M85P317k267k771p984r992l79P018o284o9R851q543k601P002
16281f840l075k47j1369J36K8329j750k3751K786l395O704J0467J9909q351k6916
$$ y = [-50596, -37292, -19976, -16991, -18602, -13514, -21344, -22939, -10735, -2113, 1582, 6673, -1195, -12514, -17584, -21025, -21501, -18036, -5789, -6924, 4714, -1332, -15481, -7004, -10153, -6080, 4186, 14188, 22802, 13780, 16358, 15608, 4256, 8877, 11564, 9696, 1701, -18601, -20518, -9755, -1039, -4712, -1134, -1576, -2533, 7796, 11860, 1735, -3467, -19390, -19757, -18836, -19780, -9252, -8992, -10555, -6820, -52, -9946, -23158, -9202, -5763, -4781, 238, -7565, -1250, -3850, -2404, -1929, 2125, -2363, -18190, -29390, -21017, -9229, 1330, -4993, 6822, 18511, 18967, 14872, -14541, -16343, -6702, -1297, 3726, 2377, 2862, 10179, 7912, 5141, -2843, -12835, -13214, -6196, -12480, -12549, -2698, -11241, -13842, -6840, -9915, -10162, -21531, -21395, 6934, 5184, -18567, -15781, -19176, -12472, -2005, 17904, 9553, -17363]
16267a7363j9989O769J0123N565n59O575J157j2560O56n022M999M802m292j921
16253b1060O281j875m169lL186P481J2369K27l950R551r957J993j3774l912J2309
16238e303Q806m408j9693n125O33K843O407P425m375N860J9230J1122q913j0877
16224C632j1440K901n696J85N411P286m019r146n014K298o651m502j738j819l06
16209b8618L36N073L751J5996l507o971P01p770k86P766J1526J50j0013L61j035
16194a2540j1495m388L749n846k401J1398L910P045j3051L397N438K6Q054n342
16180a2046O991J7109j674j411j7298k0951P270K488J2503K60j0100j6493L842
16167b9510N659n687k506R249j4269o001M569J183N622N729J3915Q257n481M18
$$ y = [-17363, -37352, -30583, -20460, -14895, -15454, -8879, -7722, -20282, -19626, -24648, -19649, -14847, -19139, -21060, -14779, -16654, -20823, -20826, -17640, -10159, 2210, 2437, -1513, 8038, -1919, 74, -13700, -17612, -5303, 3503, -905, -20598, -25723, -25090, -22247, -15840, -8415, -12790, -6930, 12300, 23422, 14509, 3632, -7808, -4907, -10603, -10418, -5007, 2279, -1740, -10886, -15900, -13602, -20253, -24755, -26493, -28312, -28618, -28282, -23209, -19458, -3462, -6969, -13940, -13239, -21009, -21295, -13529, -2003, -1853, -11866, -11505, -12540, -24035, -28423, -24674, -30520, -32921, -21523, -17613, -10568, -23619, -20222, -14784, -14758, -6704, -12046, -5055, 12054, 10380, 8969, -8329, -29280, -22010, -19522, -7019, -6759, -16859, -33352, -29510, -23851, -29538, -32044, -22795, -37064, -43065, -38496, -37313, -31691, -25962, -12047, -3790, -9271, -8853]
16153h853O716o99P5L685M66L423p258j7841J370k205j7427j1685Q36P030N972
16138c6395L073N081k957Q639K2405J2435M811j1595j1506P34J0237K552j3842
16125f328k6l461j1796K23L641Q199L478Q533P692P609j2702j1585K0122L975
16111A7574J0745k739m670p267p735p458l829j963L211p167p221J1709L768P222
16097D180o139n381J1392n993n494M042o613p328n481P240J3274p976j2317O977
16083a5617L048N461m355N57j3634k054n224r232R300J2122k879o656o400Q417
16069b7146Q779k863o211J962j9276N999l621K4066L663Q749k790P979J580k43
16055F27K396j172m122r756j3218o560M293l161k82J0546O790O610P911J1965
$$ y = [-8853, -2137, -2836, -2761, 924, 1390, 4813, -2445, -20286, -18916, -21121, -38548, -50233, -49397, -42367, -36395, -33322, -28241, -31198, -22559, -154, 12281, 17092, 5497, -6009, -5275, 4962, 7514, -6328, -6354, -9815, -21611, -21388, -17747, -9548, -6070, 2463, 10155, 17764, 5062, -6523, 13599, 17574, 28319, 25580, 20910, 13643, 5908, -1550, -5379, -7342, -4131, -11298, -18519, -6810, -3042, 4180, -1959, -7340, 4052, -1941, -7435, -3393, -10006, -17334, -22815, -15575, -2301, -10277, -22594, -15617, -12569, -7108, -11463, -10906, -24540, -26594, -31818, -41050, -31750, -19628, -22507, -29163, -35563, -27146, -18367, -21230, -27441, -25479, -44755, -38756, -42377, -18311, -14648, -5899, -8689, -710, 870, 627, 3023, 1851, -2271, -12027, -25245, -31805, -27512, -30673, -30955, -20409, -13619, -7009, 902, 12867]
16041A2867j19m489j4091q500L410l736J2720o154j947N620J4740P253j5087r136
16027f649K818K647n077J192m290K828o312M836J4294j6186o393j3702l727M416
16013b9305J9816J5542m547R069o490m192K810Q364q365j698j0146k125J4199
16000B932N100p543j210j3273M89j382K772n862j0571R563J2376J4389j0411j3935
15986a6566O371K134N18R739N108j9428j0027j739N77J1451J955L448n178o277
15972a7914K122R545J525l974J2830n604k784l668p441K180O780n496k285K746
15958a1438J5308J6758p417j8758j923m974J2809j814L435j736j2045j2786j099
15945b5680M782k844j601J2530n146j1816N071K3141q709j1092P369J748L936
$$ y = [12867, 12748, 8259, -5832, -14332, -10922, -14658, -1938, -8092, -10039, -4419, 10321, 17574, 2487, -6649, -3831, -1184, -6261, -5069, -9359, -6531, -12843, -8007, 6287, -9899, -16292, -29994, -33721, -29305, -9489, 6053, 1506, 10575, 4085, -107, 2703, 11067, 2702, 1004, -9142, -11267, 2932, 8032, 489, -721, -13994, -13505, -14887, -12115, -17977, -28548, -18985, -6609, 7780, -2631, -16566, -10195, -8061, -7543, 2196, 7304, -12124, -22151, -23890, -23313, -11862, -9907, -6459, -11637, -17914, -15792, -6247, -4722, -8696, 4134, -1470, -4254, -7922, -15363, -13183, -6403, -11899, -14184, -11438, 3870, 20628, 13211, -5547, -7470, -12444, 365, -1449, 1986, 250, -11795, -24581, -25680, -20898, -23742, -25343, -12813, -17959, -29775, -24704, -1563, -10272, -21364, -13995, -12247, -8311]
15932h311n118m217o095J293o52o913R637J0628r735q209J6214J0604K524j0189
15918h539q528J5061Q964j1150J1406R138p892j2200p421M565N186p099k0413
15905b8922q724N68N63J1798M569N708P147O27r791Q477K262j673o313o588J4162
15890f130L710K310r939j977p688p400J2841P936k121o796j1859j0566J4333J4002
15876i344n069L507j227m112N99j735K272J049j0498k596J0440J3675j0105Q768
15862d376R790Q41p213k750k447O061L525k870r825n06M263Q389q072p349M828
15847g711K448O833R865k587j1638j8842J056J9407k880O2q417l203P928k29J429
15832f479m918j1901J133L570J2366j968j650J2386l50j1331r676j684P871Q242
$$ y = [-8311, -13429, -17646, -23741, -22448, -23100, -30013, -20376, -9748, -19483, -27692, -11478, -874, 1650, -8539, -17067, -2006, 6958, -4192, 7214, 16352, 8460, -3740, -11161, -6596, -1410, -8509, -28922, -37646, -37078, -36515, -24717, -20148, -14440, -7293, -6666, -16457, -7980, -5718, -7391, -13704, -20292, -6130, -2420, -110, -10049, -12026, -19714, -27114, -14273, -6337, -8458, -15254, -27113, -37679, -23346, -9344, -14413, -10906, -12133, -16245, -15646, -17381, -15109, -14060, -24558, -27154, -16714, -3039, -13144, -4376, 5414, 6255, -958, -3708, -6155, -94, 3431, 561, -9264, -9770, -5507, 2882, -5190, -12539, -7711, -5263, 1570, 11435, 8848, -2790, -21632, -20576, -1169, -4049, -3987, -12404, -15607, -7679, -7908, -6479, -11397, -23298, -22165, -18595, -6229, -8197, -9847, 2539, 2189, -9142, -18818, -20502, -12631, -4389]
15818d389R160j7007Q743J4262l544q892J360l989k157j502K437R491n791k3509
15804b5327O11J5473J0659n688O599R168j7240L634r209l681q633o892J7212O469
15790f845R786l776j4197N390O149N625L579j617j712p301P099Q486j7269q693
15776a5296N935J3795r715k4940P799O574m22M502J7618J1015j429j4154r191
15763g909j098o858p065o13o27Q842J338k987l225J6003m14J736K12M61N978j1390
15747g616j3179J980N753J6450K267J1516K068j4668n557%P806K624j493r808
15733a857M139O360l095j1580J688L365o517j611M853K562n17J638J0704k272
15719G860o184k526m403N319L996R943m655M217j0730l595N243l41J951o707j2240
$$ y = [-4389, 4771, -12236, -3493, 10769, 7225, -1667, -307, -4296, -6453, -7955, -5518, 3973, -1818, -25327, -24716, -9243, 1416, -4272, 2327, 11495, -5745, -2111, -11320, -15001, -23634, -30526, -13314, -6845, 2941, -835, -15032, -9642, -3493, 2132, 5711, 4094, 2382, -4919, 2180, 10666, -6603, -15296, -9361, 4434, -5281, -30221, -22422, -15848, -16270, -11768, 5850, 16865, 15436, 1282, -7909, -9007, -15865, -22930, -23543, -24170, -15328, -13990, -16977, -20202, -4199, -4613, -2877, -2665, -2204, 3774, -7616, -20795, -18815, -13062, 3388, 5655, 17171, 19239, 4571, -986, -986, 6820, 9444, 7951, -1857, 2282, 8642, 5547, -6033, -4345, -980, -7497, -9108, -4255, -1693, -2210, -572, 10132, 7860, 1676, -850, -5253, 66, 4062, 14005, 9350, 13567, 2837, -758, 4485, 4144, 6095, -612, -12852]
15704a2852L142J0082j3631j4671L490J3455O21J524J491J4460k225m137j3231
15691a2482n949P813Q690L695R369j755J298Q381p279l663k809j0954R443J1682
15677A5480m566k6347r147L226M082j2362n931L209M811Q268q888K629K056L701
15663a9779K016L96o354R918J8748J324J265P464J1817j0369j1282j5594m158
15650a4588K1659J2706j0641n461N373o639n148o128J1607P112p126j2146P756
15637a664N496L05o480j0828K768J5690O232r945j465O130L712J356l788o232
15623A287j5178P203M061N443J5717p002n755n0k936j1415J48m714R161r892n924
15608a9846R053P027o381Q333j2702j2240n551l330J3448N11J609L05q137k345
$$ y = [-12852, -9710, 372, -13259, -27930, -24440, -10985, -10364, -8840, -7349, 7111, 4886, 749, -12482, -18431, -10618, -1928, 1767, 11136, 9381, 10679, 19060, 11781, 8118, 5309, -5645, 3798, 15480, 10914, -15433, -24580, -21354, -17272, -29634, -35565, -32356, -27545, -19277, -28165, -25536, -23480, -19779, -17763, -17367, -23721, -13803, 4945, 6269, 7534, 14998, 26815, 16446, 5164, -10430, -14588, 7071, 19777, 9136, 3675, 9048, 2409, -2739, -8867, 2740, 9852, 2726, -9420, -1664, 3832, 4137, -2343, -13171, -10403, 5287, 11519, 1574, 109, 6239, 9951, 11307, 7519, 1287, -13891, -6688, -2627, 2816, 18533, 11531, 5776, 5726, 2790, -8625, -8477, -13191, -4030, -13922, -19846, -10793, -3766, -10147, -1814, -14516, -26756, -32307, -35637, -22189, -21678, -20069, -19764, -27901, -30246]
15594c0246J146J626P775j5027p68J3801O480M866J1453M394R455N974l303j1441
15580F185q407o708j78M28N698n425j8608j442J3738m061R731k364j2478P923
15566a5968P286o009Q013m45M330O733q822p878j2033r588k631J0700J2281K342
15552a1689o084q66O525J3669K021O634M288j310j0221j9029p749K148p655P045
15538b2273K0967J7465M550J328j1413j1651J274n903J8044q02j680j0258l632
15525c984O212k623p100J4393n731q713k112J2120M241k495N165p186j3181K657
15511h337M518J1074r863j117l168R57K653K482j580p664j4137j255Q340M303
15497a2794J3064K447L902k547r873k71r125N763O661j0249j2589J6706J1496
$$ y = [-30246, -29100, -27474, -19699, -34726, -35494, -21693, -15213, -10347, 1106, 5500, 14955, 20929, 17626, 6185, -2222, -8930, -9108, -8680, -2982, -8407, -27015, -28457, -14719, -18780, -9049, -11413, -23891, -15968, -8682, -14691, -6678, -7123, -2793, 3940, -4882, -12760, -24793, -34381, -37012, -26312, -14031, -11689, -17773, -18639, -12114, 1555, 3576, 10210, 14498, 13188, 2967, -16062, -23811, -21663, -29318, -22273, -1306, 16159, 20709, 22037, 10624, -1027, 247, -5656, 12388, 11586, 9906, -352, -3984, 2228, -395, -7495, 6898, 1167, -7546, -9658, 2462, 6703, 4208, 9373, 2187, -10994, -8337, -3819, 7255, -2608, -3725, -6893, -5936, -3283, -801, -2381, -10045, -24182, -25437, -17097, -12794, 270, 2717, 6619, 4072, -5801, -6072, -15197, -9434, -2773, -13022, -25611, -8905, 2591]
15484B591l833M688n410r589P374o67L253P027R489l422r325j2105j1003m568
15470b5500J988K463l272J6324J3418M716K588N999N365J0317q425j6502p286
15457B193M195j1958r998l133r197k030K2808J3135r066O105R751j349n344P006
15443A3118o555j2130l474m135q217k983Q107R004J1818J719n356j5861M963Q040
15429a942o870q497J177J956l104L925K2733M735r037L543j5058n655J0671J5257
15415A3834Q080p089n812m31N457Q069p578j5803l803J1585K242j2780m035l675
15401a1739j121O470P548L101K208l522k76j044N896l953k674P473m539P6M034
15386G938n524j1294J446J9854J3191o223k624O421j7550j0675j2843M41Q962
$$ y = [2591, -1242, 3446, -1964, -11553, -4179, -4846, -1593, 5434, 14923, 11501, 2176, -9929, -20932, -25500, -23512, -21049, -24321, -7997, 5421, 10137, 12725, 18724, 24089, 34406, 25981, 9479, 2193, 6388, -5570, -15568, -18701, -27898, -29928, -7120, 6015, -3051, 3054, 12805, 11456, 6112, 13118, 6563, -5567, -9041, -13176, -21393, -24376, -16269, -7265, 4553, 6272, 916, -14945, -9982, -1942, -8812, -17309, -16132, -14176, -17280, -13355, 9378, 14113, 5076, 8619, -6439, -12094, -1423, 13834, 21914, 14825, 9013, 8582, 14039, 22108, 14530, -1273, -5076, 6509, 8751, -4029, -8064, -11739, -12860, -6390, 1158, 4259, 6467, 2945, 2669, 1625, 7521, 3568, 894, 8367, 3828, 3904, 7938, 2414, -8880, -7434, 12420, 25611, 19388, 16764, 23185, 5635, -5040, -17883, -17442, -8480]
15373h480J9706j2567j0248R940o26N401O319Q070j2569j8485n030L954P022l075
15359a0668J4875Q759P065j5757j4333R935K946m999J176J5107l520r598q847
15346g859K584J413r166k0832J745J7389J6450J1746l645N751p920j2647p604
15333a2595j214Q606J179O241R119J460k1200o268Q598J0271P61j08m154N200
15319E896K902k431m733q6q015J5099N213l2m292l90L062K905j0570j0808p794
15304a4074M923L188M117P946N118l894j1295J131j333p243J1665J3627r422k6208
15290b1754l898J73N220J8241M212P92j3026J0704J2882N075M70l681k661q857
15276C892j6535j9251J650K2015R888J889m56O790j611k017o222j691J4681p92
$$ y = [-8480, 11226, -1341, -11589, -1649, -2275, 3126, 9445, 17515, 4946, -13539, -18569, -14615, -7593, -10668, 4207, 12966, 20031, 4274, -10059, -124, 2822, -2177, -1001, 14106, 10586, 988, -7859, -5275, -3862, -13028, -33860, -32115, -14726, 1724, 13470, 9825, 15576, 7656, -4991, -12595, -13809, -5203, -4024, 2217, 11336, 12796, -8404, -14672, -6074, 4197, 4958, 4850, 696, 5896, 8798, 6367, 1634, 1548, -6467, 8632, 13845, 13813, 9521, 9131, 12193, 15098, 4528, -6280, -14074, -9151, -5963, -1846, 6100, 11218, 7324, -3971, -2840, -4173, -11416, 249, 13876, 4454, -21754, -25652, -25479, -20259, -2018, 2194, 2986, -10040, 664, 13546, 18621, 19091, 15410, 12749, 3892, -12643, -31894, -30244, -8229, 1659, 3548, 3092, 9882, 8271, 6254, 32, -1659, 13022, 12230]
15262A2230j3987r039j493n232j0641N901L905M778l274j591P525J8343K121j263
15248H283j521j080q820l453P50j6899O253J4524K629p257o310o185O823J2633
15234C70J1340n662o607m949J233j727o510q405p003M086J2071p765J895Q115
15220i518L950L437k524R067R56q345J319j0250p824q653J1976J105l141p60J3984
15205e221J0975m831m37l803K219R676R687p95j084J216R143m492j2530k288m749
15190B686J508j0205p666j3375n186J0669O650J5393P750O217N76K048p027L967
15176A4005M294J3680j5594q939k869k896J2790k191j1828j0134k25m06J207Q305
15162h01N799J786Q491J4409J892j6990k1194q616J802j098j310M65N599L909
$$ y = [12230, -1757, -10796, -12289, -17521, -28162, -22261, -18356, -13578, -16852, -18443, -10918, 7425, 9546, 8283, 6762, 5682, -3138, -6591, -5841, -22740, -16487, -1963, 666, -6591, -12901, -19086, -12263, 370, 11710, 6048, -559, -5508, -4275, -6002, -12512, -20917, -27920, -23834, -11763, -19528, -17633, -9518, -5568, -2131, -4655, 4412, 5368, -2977, -1658, -11908, -19732, -28385, -16409, -15304, -18445, -19205, -5221, 5754, 923, 486, -3317, -1098, 8578, 18265, 17470, 16386, 17602, 26745, 22253, 9723, 7435, 2686, 4194, -6011, -13677, -27052, -32238, -21569, -14919, 474, 8224, 14441, 15017, 17065, 10038, 14005, 18299, 31979, 16385, 7446, 4577, 1681, 14471, 12280, 452, -9682, -9907, -10313, -9106, -801, 4998, 6784, 15275, 29684, 31576, 14586, -6608, -15224, -13422, -14520, -15830, -15365, -9766, -5857]
15148e857M034n439l72j2838l184j797M475P557k423M80m144K2646R991M862L841
15133B1832p300o662j6J1977J185k671O793P063K498j7744j7975r362O621J1396
15119G635N23n679j7685j836O265O005P493r000p83J80j8289l018K2719R266r373
15104e577j5293M305R951J2323L96J37j380j5301n660J1368n58m786m416O134
15090h357N467Q992p278o036J197L417m195M628K867M599o006j71K746P228o464
15075B634j4304r173l491J626J2525O703K414L672q513L804K321L05M203m114
15061F12J831p371J874K220L433k729m736P909J1430j1402r196N163J3395j241
15047A1192o496j2531N25M671r181j0664O291O960J3969N178P86O966m605o717
$$ y = [-5857, -1823, -7262, -7634, -20472, -23656, -25453, -20978, -13421, -15844, -15364, -19508, 3138, 13129, 17991, 21832, 14532, 7870, 7854, 19831, 21016, 18345, 25138, 32201, 34699, 16955, -1020, -10382, -3761, 7635, 8158, 2479, -15206, -17042, -10777, -4772, 2721, -6279, -7062, -6882, -25171, -28189, -5470, 3796, -5577, -20870, -16565, -6614, 5709, 6105, 6242, 4862, -10439, -16099, -4731, -5289, -10075, -14491, -8357, -2890, 6102, -1176, -7212, -6015, -2598, -6793, -2165, 702, 5301, -705, -876, 1870, 9098, 2634, -11670, -20843, -24334, -22708, -10183, -3480, -1066, 2606, -5907, -2103, 218, 523, 4726, 612, 2443, -4928, -3054, -834, 2599, -130, -4866, 3043, 14473, 3071, -6125, -962, 12433, 11192, 4696, -7835, -7310, -2639, -11820, -22484, -16193, -9233, 4736, 9914, 10700, 17666, 13061, 6344]
15033F344q25k031J1708K233j3185k860j1890o610n414J0801J3704Q27l089j0132
15019a0419K707R021P314N5j3557P698K799k496O373K339j2645j6889M217L275
15005a0208L793L65J512N33j1985P272O511j31o938J3924N133J4840N160j2645
14991A7136r276j3270j9725n929J6900J2580J589J023J058K56K976j236Q322n839
14977F565n338m382j988l442J1618P107q573r562j2169J668K2397J3114J614k11
14963A8418k15j0996j8569j8527Q861J0119L095j2508k502J6136K957K708L159
14950B136K275M675M396K995L68N613j0846j6506n787J0519k690k954r32J2872
14936F134P340O503j955p540K705J200q235J0164n951m625k170k937P02J0603
$$ y = [6344, 5519, 3488, 15196, 17429, 4244, 1384, -10506, -17116, -22530, -11729, 1975, 2802, -287, -10419, -7712, 1309, 8623, 8678, -4879, 2819, 5618, 3122, 9495, 11834, -811, -17700, -13483, -10208, -6415, -6050, -4538, -4005, -15990, -8718, -2207, -2338, -9276, 4648, 9781, 24621, 29781, 17136, 7860, -5410, -25135, -31064, -14164, -1584, 5, 1028, 2086, 2342, 5318, 4082, 12404, 6565, 1227, -3155, -5143, -8585, 3033, 10140, 1567, -7995, -20164, -18496, 3901, 17015, 18629, 18418, 18203, 7207, -11362, -29889, -21028, -10909, -7814, -20322, -22824, -6688, -3731, -1023, 2136, 4411, 9086, 13482, 16477, 16845, 22458, 11612, -4894, -10681, -162, -2852, -5806, -6738, 6134, 13474, 19977, 18022, 10482, 13187, 14387, 6152, 16316, 10365, 5740, 3570, 633, 1335, 11938]
14922A1938j2668q222K743L791n714j3952p720K8454J5911p146m288j0336J1906
14909D697l292j2939L487J5209R949j5508j7528J199l666j491M096N523J8616
14896H352J0563j2530J691k200p101n84L694P915k66q482k915m993j40L8P107
14881A49k236P010M170P928m058j6121m881P026K968q98L779L021K186J4358p896
14866A6505l287N034m096j8264m500R823k321j362J4021q839q243J362M974O682
14852G489j712m646j186M209N151n708m313m908n612k420j312Q256Q547r89r962
14837i116M582J2008L747p400J2110l663j5314l496l335n446k388j019M531J2899
14823a300r948M518N977l89j738j0140N112Q04J2102N532J947q233J431J2354
$$ y = [11938, -730, -8952, -6209, -2418, -8132, -22084, -29804, -1350, 14561, 7415, 3127, -7209, 4697, 1405, -11534, -8047, 7162, 17111, 1603, -15925, -14726, -18392, -19883, -15787, -10264, 8352, 18915, 6385, 8076, 5876, -1225, -1809, 1885, 9800, 9534, 1052, -1863, -6856, -6996, -6958, 149, -2087, 4923, 9093, 17021, 12963, -3158, -8039, -1013, 1955, 1057, 4836, 7857, 10043, 24401, 16505, 13218, 18252, 14156, -4108, -8608, 1215, -1106, -2468, 11553, 2714, -5529, -4167, 807, 7489, 5777, 1131, -55, 4154, 9305, 3597, -716, -5624, -11236, -13656, -14968, -6712, 1835, 846, -9116, -4534, 7474, 11221, 3821, 15931, 12268, -3046, -6542, -9877, -15323, -17711, -18730, -14199, -1300, -11248, -6730, -753, -1142, -2880, -13020, -7908, -7104, 4998, 10530, 12477, 4244, 5675, 18029]
14809A8029j6378j5600R004N961l851N683n910j449j623k465P853J0986m669m762
14795H09k941J359l801L136L660p65P05n758J1409J609j0480l969K222O8M35k023
14779d325P607l337j012q066j0378J679O457p705l521n607J3282J1330P915K062
14765F381k851O60k452O871j1172j8160R74J3618p379L639J753k123n655J792
14751a4104J0423J0025m684q528m51r349n230K270J1674J710q36J0926K795N278
14737A1919M198r089j0703j1462K099J564J4082q362j785J467r575K485N364L511
14723d287P869J5820j024J449j333j4748k0o960r927K55R488O860L456o221n881
14708e204p004m26L678K306L51O661K3192M565m319j4631M320K930r985o825Q47
$$ y = [18029, 1651, -13949, -4945, 1016, -2835, 2848, -3062, -4511, -6134, -8599, -746, 10240, 5571, 809, -2132, -773, -4574, -1438, 2222, 1457, 2162, -3596, 7813, 9422, -1058, -5027, -2805, -2737, -2302, -4325, 3282, -55, -1067, -9133, -19511, -17832, -11375, -19080, -22601, -28208, -14926, -3596, 4319, 6381, 3530, 4190, 1738, 8609, -2563, -20723, -19749, -6131, -13510, -9871, -8118, -10241, -15896, -14104, -3681, 6344, 1660, -6868, -7319, -16668, -21898, -19628, -7954, -6244, -7080, 3846, 6641, 11919, 16117, 7028, -3675, -15137, -13038, -11474, 2608, -5754, -7539, -6072, -15647, -13162, -7798, -4287, 3582, 19402, 18378, 19827, 18494, 3746, 3726, -3234, -13161, -12906, -3418, 3442, 6898, 677, -5204, -12208, -12634, -8956, -6650, -6299, 362, 23554, 28119, 23800, 9169, 13489, 16419, 6434, -391, 456]
14693D56j8314r953N385J1718J2237K40J808P57J4050k576j4762m715m044n65
14679h278N837n478K728J2510j1152n860R510j0338k845L708K353N028J5301p458
14665E566J5604O249l683m66k507j2720j3872k906O175K051Q591N433j511m632
14651G372j4075j2345J2518O292K004J6815J0535q369m794n441j186Q177K463
14638A9966m62j0056j484J124k4566k483l221r644r72J4758J4182J800R291Q515
14624A6748M661m272j3061Q952R532p00L006n886j6808j753J331o700n99m256
14610i805Q254K4412P182N352j425j7760p624O961o452j176K939L02k956K154
14596A0358o534p591o103o28M490j602K738J393J1109J4223L29j0793l684J180
$$ y = [456, -17858, -27811, -22426, -10708, 1529, 1769, 3577, 4334, 18384, 15808, 1046, -3669, -7713, -8278, -2441, -7919, -5191, 7319, -3833, -9693, -183, -10521, -13366, -9658, -7305, -2277, 13024, 5566, 21170, 27419, 23736, 23270, 20763, 8043, -5829, -8735, -2560, -509, 8082, 13515, 12004, 7372, -6703, -19048, -6530, -238, 1766, 18581, 29116, 20747, 15953, 10512, 9326, 17503, 19966, 19504, 9448, 7964, 9088, -15478, -17961, -21182, -30826, -31798, -17040, -2858, -1058, 8233, 16748, 21409, 17137, 4076, 13028, 22560, 21860, 24866, 18980, 2172, 419, 1750, -4950, -5549, -9805, -1551, 22861, 30043, 35395, 33970, 16210, 8586, 15547, 9095, 7919, 10858, 11160, 8204, 10358, 3824, -3767, -9870, -10498, -6008, -7610, -4872, -3479, 7630, 21853, 22182, 11389, 7705, 8885]
14582H885J3920K533r265j3174p158J4355m828n522K170P883N10l637l392L261
14568F541J1316P352k368J155Q262M675Q145J0417J5587M574K8644J4803J963
14555A21066j3051j8214k5784p017R875l725j598o782l934l565j4535q403j5599
14542H734o356R28n31K046R519N910L072N248N831J3249q631l764j46q744J4852
14527D1217O328l828l443n099Q016P142j4694j2074j1103k1342K232J9252J2941
14514B5545J267j6380j3691R837J6079j201l575N466r405q081k176o555n930r049
14500a7849O973J5116K1406L487j7987l908L744m506M143J1000J811r903p55L239
14486A6011N166r458j500O141Q175L148N562M545N218j5742n047M221m050l787
$$ y = [8885, 22805, 25338, 16073, 2899, -4259, 10096, 5268, -254, 1916, 9799, 10309, 6672, 3280, 6541, 17857, 25209, 22841, 23996, 32258, 36933, 45078, 55495, 71082, 75656, 104300, 119103, 121066, 108015, 89801, 64017, 57000, 66875, 63150, 61552, 54770, 50836, 47271, 32736, 24333, 8734, 2378, 3306, 2775, 4821, 14340, 20250, 23322, 28570, 34401, 47650, 39019, 35255, 35109, 26365, 41217, 47545, 43717, 40274, 35175, 43191, 50333, 35639, 23565, 12462, -8880, -6648, 12604, 25545, 26812, 10432, -3259, 6578, 22657, 21456, 17881, 23347, 13942, 5861, 3685, -2870, -8800, -17849, -10876, 4240, 25646, 29133, 11146, 7238, 10982, 6476, 10619, 21619, 23430, 13527, 12772, 16011, 21177, 11719, 10219, 16360, 24535, 27683, 33245, 37790, 43008, 27266, 22219, 26440, 22390, 18603]
14472A8603l041o350o393J3084J8014j2318J0588L149p814j1492k231J0835L119
14459B7753J896j745j0154q378J2801Q485J0267o022o80N682P463K650o799k207
14445D1012j136n447J379R872L211j8503n630j25J4196O952p633j2442j3542O
14431A2170M949O617J1991J680Q921J0912O896k738k149Q829lP634N798k028R550
14416H9029M167k029K1523J8980J0272K0260J8092K1573L7206L4469K5326L3783
14404C32651K9220N9052M4158K4922L658j9302r888j1985k4887m0340l9369l6118
14392C11772k6179m8817k1696j7162k1091k4426k5363j7259p741j9244k514m542
14380G5738O689o372j3373r813J422m88L441K172n458J638N8p814m120j831J0323
$$ y = [18603, 15562, 9212, 2819, 15903, 33917, 21599, 32187, 35336, 27522, 16030, 13799, 24634, 27753, 29649, 27904, 17750, 9372, 22173, 30658, 40925, 34903, 34223, 39905, 47368, 50018, 43219, 41012, 39876, 34429, 35808, 45680, 48891, 30388, 24758, 24633, 38829, 45781, 38148, 25706, 12164, 12170, 17119, 23736, 35727, 37407, 46328, 57240, 64136, 61398, 59249, 68078, 68075, 75709, 81507, 79479, 89029, 93196, 91167, 112690, 131670, 141942, 162202, 180294, 201867, 239073, 273542, 298868, 332651, 361871, 420923, 465081, 490003, 493661, 474359, 464471, 452486, 427599, 387259, 347890, 311772, 285593, 236776, 215080, 197918, 176827, 152401, 127038, 109779, 102038, 82794, 80280, 75738, 82427, 76055, 62682, 52869, 54291, 53803, 57244, 59416, 53958, 55596, 55654, 47840, 43720, 41889, 52212]
14365E2212j1926j1732Q3P188j0083q493k771m566m292N646J4550k072L658j600
14351B5802O576j513j8031O139N89j752k068j391j2162r962J456Q538Q106J688
14337A2015l20R99l90q735J5681Q364J750j1239j6766L658J4203Q564j0696j4165
14323B923n993J2471M783P822N654q603Q745j4411j6482M857N247J9584O090q852
14309B3835N268l6q718Q695o098l180J1673K0630k288j1770j3902k243j0976j5148
14295d258O77o174J3974L460N771L2875M336r734q836r194L142k888n427j173
14281A6551M306k179j7249K168p90J0258J2258J3839j572q882J1617J7907k377
14268E5855j212P895k689k6724j0345Q393K173p544K786O808J0915l503r687j5936
$$ y = [52212, 40286, 28554, 28637, 35825, 25742, 17249, 14478, 9912, 5620, 11266, 25816, 23744, 27402, 25802, 32378, 30865, 12834, 18973, 19562, 17810, 15742, 14351, 2189, -7773, -6317, 2221, 10327, 12015, 11695, 12694, 12304, 3569, 19250, 27614, 29364, 18125, 1359, 5017, 19220, 27784, 17088, 2923, -3070, 9401, 14184, 22006, 27660, 19057, 27802, 13391, -3091, 1766, 7013, 26597, 32687, 23835, 29103, 29067, 20349, 29044, 22946, 19766, 31439, 52069, 49781, 38011, 24109, 21866, 10890, -4258, -3581, -9755, 4219, 7679, 13450, 46325, 50661, 40927, 32091, 22897, 26039, 23151, 17724, 16551, 20857, 18678, 1429, 3597, 2807, 13065, 25323, 39162, 37590, 28708, 40325, 58232, 55855, 54643, 62538, 59849, 33125, 22780, 31173, 33346, 25802, 28588, 35396, 46311, 42808, 33121, 17185]
14254A7185j0108N849J4707J0315o984Q537j0600k907J1988Q256p528p370K564
14241C3904n297j3880O296N534r326L563J2814L65J23p124k902P183o88Q868L165
14226D2598l905J2980L780j1173j5732J2118K2391N183L846k186j813k530J969
14213F7526O940J0174R224M144J155m386j1552O306Q410k801O65Q874m713j9300
14199H0666l642n24m068k967P640K102j0448m411J4564Q171L13l462j0859j6589
14185E6486j2033J704O768l933p749J0664R32j7071j0551l204M794J2860J8621
14172E8288j757j4492k100r648r356L180P887P205J3494J3600R639K712j4509
14159F4143j2166j09o68K199k611j373J5810R865j576L425m516n187R260P371
$$ y = [17185, 7077, 12926, 27633, 37948, 30964, 39501, 28901, 25994, 37982, 46238, 38710, 31340, 33904, 28607, 14727, 21023, 26557, 17231, 20794, 33608, 33973, 34096, 26972, 24070, 31253, 30565, 39433, 42598, 38693, 51673, 55453, 44280, 28548, 40666, 63057, 68240, 72086, 69900, 68087, 65557, 67526, 74466, 84640, 93864, 98008, 99163, 94777, 83225, 89531, 97941, 95140, 95805, 104679, 99966, 80666, 77024, 76500, 72432, 69465, 77105, 79207, 68759, 64348, 78912, 87083, 87396, 83934, 73075, 56486, 44453, 46157, 52925, 48992, 41243, 51907, 52839, 35768, 25217, 22013, 26807, 39667, 58288, 56531, 42039, 39939, 30291, 20935, 24115, 32002, 39207, 52701, 66301, 75940, 78652, 64143, 51977, 51868, 51200, 53399, 50788, 49415, 65225, 75090, 73514, 76939, 72423, 67236, 76496, 83867]
14145H3867J0510k742n404j3962N099J5161J6737M330o567j1511K209k822K959
14132I7864Q899Q616o722j5983J2697K758l92N351L945Q298j2584p578j9057q77
14118H5235p08j277K75Q809N069J2414J8277L861j3483j1959J2409J1458N104
14105A35484r409j0453n183l956q515j414J2322J6617J6275k878o285m606J566
14092A29565M73J1495J6641O048R90o614n276J5484J4932R297m469p095J834P476
14078A90781J7924J0996m90J189M293K151j253J0651n803Q400p4J384N320p160
14064B38309J605j977l151J6648J6075O964m77M242j264J6604K5838K2942Q583
14051C50941j34O954J9275J1980M740k026K026O647l757J0240K0732J826N76K4614
$$ y = [83867, 94377, 91635, 86231, 72269, 77368, 92529, 109266, 113596, 107029, 95518, 97727, 94905, 97864, 106763, 115379, 108657, 92674, 105371, 108129, 107737, 113088, 117033, 125331, 112747, 105169, 86112, 85235, 84527, 83250, 83525, 92334, 97403, 109817, 128094, 131955, 118472, 106513, 118922, 130380, 135484, 126075, 115622, 110439, 106483, 97968, 96554, 108876, 125493, 141768, 138890, 132605, 127999, 129565, 130038, 141533, 158174, 164222, 165212, 158598, 153322, 168806, 183738, 193035, 188566, 181471, 183305, 190781, 208705, 219701, 219211, 220400, 224693, 226844, 225591, 236242, 230439, 238839, 238765, 240149, 245469, 238309, 239914, 237937, 234786, 251434, 267509, 274473, 273996, 278238, 276974, 293578, 319416, 342358, 350941, 350807, 357761, 377036, 389016, 393756, 391730, 393756, 400403, 396646, 406886, 427618, 429444, 430020, 454634]
14037D54634L3090J6177J5396K7768K1019P38J2074J1528J6162K2205K6625K4622
14025F82038L8821L2920J2130K4983L3715K2128L0928N2303L5478J9521L2044
14014A017009P8883P3796M7284O2154O4656P7632P6693N8874P2225J05218R7001
14003A831425J07952J19781J16116J17961J54358J47970J58287J72336J73012
13994C099198J74578J60402J57106J82624K05928K14860K29147K65735L08256
13985D997834L30880L67078L97157M08202M26239M33022M63403N10954O04511
13976H939280O97726Q02067R26495J084795J244762J435588J667579J913451K222202
13967B0933945K580796L012824L547470M185275M956156N789745O667681P453527
$$ y = [454634, 487724, 503901, 519297, 547065, 568084, 568822, 580896, 592424, 608586, 630791, 657416, 682038, 720859, 753779, 765909, 790892, 824607, 846735, 877663, 929966, 965444, 984965, 1017009, 1095892, 1169688, 1216972, 1279126, 1343782, 1421414, 1498107, 1556981, 1629206, 1734424, 1831425, 1939377, 2059158, 2175274, 2293235, 2447593, 2595563, 2753850, 2926186, 3099198, 3273776, 3434178, 3591284, 3773908, 3979836, 4194696, 4423843, 4689578, 4997834, 5328714, 5695792, 6092949, 6501151, 6927390, 7360412, 7823815, 8334769, 8939280, 9637006, 10439073, 11365568, 12450363, 13695125, 15130713, 16798292, 18711743, 20933945, 23514741, 26527565, 30075035, 34260310, 39216466, 45006211, 51673892, 59127419]
13959E9127419Q022395Q089845P471551O056718L842939J077601j792143m354694
13951H7541631o256963p367909p734807p542325o972466o209742n420974m661822
13943C5374623m013176l426968k949698k569052k238429j946152j700614j493186
13935A5037348j311271j182563j040800r17073q26026p31982o62605o03593n50642
13926G210793n04802m57122m20515l88576l53720l22619k93284k65927k54623
13917C949605k15430k13034j96124j78667j47850j39867j38776j29981j04202
13908B485674j11923r9275q9463q7922p8928p8061r5170q7336p2477o1667n8240
13897A565212p7693o9980n4428n8714p1484o3741n8854m6663m2377m7606n1241
$$ y = [59127419, 67149814, 75239659, 82711210, 88767928, 92610867, 93688468, 91896325, 87541631, 81284668, 73916759, 66181952, 58639627, 51667161, 45457419, 40036445, 35374623, 31361447, 27934479, 24984781, 22415729, 20177300, 18231148, 16530534, 15037348, 13726077, 12543514, 11502714, 10585641, 9759615, 9027633, 8365028, 7761435, 7210793, 6705991, 6248869, 5828354, 5439778, 5086058, 4763439, 4470155, 4204228, 3949605, 3734175, 3521141, 3325017, 3146350, 2998500, 2858633, 2719857, 2589876, 2485674, 2373751, 2274476, 2185013, 2097091, 2018163, 1940102, 1844932, 1757596, 1685119, 1623452, 1565212, 1487519, 1417539, 1363111, 1304397, 1232913, 1169172, 1110318, 1063655, 1021278, 973672, 922431]
13886I22431m8757l6184l1818k0690j3277m0288m0980l2632j8654k0954l5627
13875E82570k4974k6120k2048j3260o47q178k0104k3496j2493k4231j2329j7985
13863C76705j1553j3604q580j757j263j1660p260j2388K901J89j8932j5438k2703
13850B54657k201J519j2518j3712Q650R397r618p697n121p964k062O800m345n732
13836B10053j1609l0076n039O540j246o506J1309J3651Q892R295J960k509o251
13823A98464r009j33J766q215p06j0023j5247o394k757j25j4882j510N440j1294
13809A25375K321r567q272j0458Q261p03N386n639q259q00o925o243K6601J2747
13795A23825o872j388k787n609P065l179j4351q0J226j7826l850J124L925j1535
$$ y = [922431, 873674, 837490, 805672, 784982, 771705, 731417, 690437, 657805, 639151, 618197, 582570, 557596, 531476, 509428, 496168, 495521, 487343, 467239, 443743, 431250, 407019, 394690, 376705, 365152, 351548, 342968, 341211, 339948, 328288, 321028, 308640, 311541, 311730, 292798, 277360, 254657, 252456, 253975, 241457, 227745, 236395, 245792, 236174, 228477, 223356, 215392, 213330, 220130, 215785, 210053, 198444, 168368, 163329, 169869, 168623, 162117, 173426, 187077, 195969, 205264, 207224, 204715, 198464, 189455, 189322, 191088, 182873, 182167, 172144, 156897, 150503, 147746, 147621, 132739, 131229, 136669, 125375, 127696, 118129, 109857, 99399, 107660, 106957, 112343, 106704, 98445, 97645, 90720, 84477, 111078, 123825, 116953, 115565, 112778, 107169, 114234, 111055, 96704, 96624, 97850, 80024, 76174, 77298, 81223, 69688]
13781F9688j216j4080j5893o500M123N112J8279K730o360J818k790P311N809K550
13767G0581l886J356l78p460j6175j0840o792L634L977J310M08J1663P780Q336
13753F3514J589j4578p622J0688L293k775k337j12O932k795q552k95l85J587j1349
13738C6803l319M675j1446l906l109k214r586N659K5016l538k313J4073L69M36
13724D7600J256r058P25P595q184m10r441j0362q253M801L160r160o713J6169
13710A9725J8180J1408p006j1997l638Q536r555J748P11J5757j241J0880J104
13697E4612M874k695j5904o265o433Q51J0351J304m411p456k1458l539J4897Q890
13683B7618o369O209O007Q608N613o13n373O411q518O979R456q366n421N508M766
$$ y = [69688, 68472, 54392, 38499, 31999, 36122, 41234, 59513, 62243, 55883, 57701, 54911, 62222, 68031, 70581, 66695, 68051, 67673, 60213, 44038, 33198, 26406, 30040, 34017, 35327, 35735, 47398, 55178, 63514, 65103, 50525, 42903, 53591, 56884, 54109, 51772, 51660, 58592, 55797, 47245, 46950, 46565, 48152, 36803, 33484, 38159, 26713, 22807, 19698, 17484, 7898, 13557, 38573, 35035, 32722, 46795, 47164, 47600, 48856, 39798, 40523, 48118, 39934, 39524, 30083, 19721, 11468, 16269, 19429, 10269, 3556, 19725, 37905, 49313, 42307, 30310, 26672, 35208, 25653, 27401, 28112, 43869, 42628, 53508, 54612, 59486, 56791, 40887, 34622, 28189, 29040, 39391, 40695, 36284, 28828, 7370, 3831, 18728, 27618, 21249, 27458, 33465, 42073, 47686, 47073, 41700, 48111, 39593, 46572, 56028, 47662, 42241, 47749, 52515]
13668E2515j5137n348Q358J0196q487L208N512P940J1778J3674J4119P985L862
13655A10175J141O494K2110L0726P1796J11816J40041J56194J54906J41721J06859
13644A053979L9526m5632j05969j45553j50137j64106j29179q3740o0751m5030
13634A63408k0937k0451j1670j1458L221p136j7577j0244j1742J2686J0381J0304
13622H8785j2253k0949j3517P628J3950q81o547Q076Q579L842j2377j9936m084
13609D0316J393r836m6R277k213j572o845n795j309m429K946M367q767n697L316
13594A5106O102j8354j1380L884J6652N523p922q368J8154L044l979j823n915
13581A0724q251l669M563J438M626n748j3990L110P247K503N045J1598J0176Q589
$$ y = [52515, 37378, 32030, 40388, 50584, 42097, 45305, 50817, 58757, 70535, 84209, 98328, 106313, 110175, 111316, 117810, 139920, 170646, 242442, 354258, 494299, 650493, 805399, 947120, 1053979, 1093505, 1047873, 941904, 796351, 646214, 482108, 352929, 269189, 208438, 163408, 142471, 122020, 110350, 98892, 102113, 94977, 77400, 67156, 55414, 68100, 78481, 88785, 76532, 55583, 42066, 49694, 63644, 62763, 56216, 64292, 72871, 76713, 64336, 44400, 40316, 41709, 31873, 31827, 41104, 38891, 37319, 30474, 24679, 23370, 18941, 21887, 26254, 17487, 11790, 15106, 21208, 2854, -8526, -4642, 12010, 17533, 9611, 1243, 19397, 22441, 18462, 16639, 10724, 2473, -1196, 3367, 4805, 9431, 3683, -10307, -7197, 50, 2553, 7598, 19196, 29372, 37961]
13567C7961o01r546j1472Q166j511n181r925J1767Q355o116N962m62j539k533
13553B3325j1560N782L770n234m836J4110K1988J512q938J610p607j0097J137
13540B4962l321O719O914M382n506k323M860k888q443R236O979P876K305j001
13526E0751j0624M009M237L524P441o36J0517J3041m11R665J9541J2298K267L3193
13512A58813L2715J4537K4794L3902L2930L9473M6171L8110L8655K4822P494k171
13500D90245k2568l3901l1437m0411m0334l9475k1792j5855m1827l1420j1578
13489A59647j0115j4274o689j2743m836j6363n883K451J061j687O974j6344n850
13476G5349r581k707o432n962J243K9575J9451J8647J8502N604J438K0104R446
$$ y = [37961, 37360, 27814, 16342, 24508, 22997, 17816, 7891, 19658, 28013, 21897, 27859, 27397, 25858, 23325, 11765, 17547, 21317, 16083, 11247, 25357, 47345, 48857, 39919, 41529, 33922, 23825, 24962, 21641, 28360, 35274, 39656, 34150, 31827, 36687, 33799, 25356, 34592, 41571, 49447, 51752, 50751, 40127, 44136, 48373, 51897, 59338, 58702, 69219, 82260, 81849, 91514, 111055, 123353, 125620, 158813, 191528, 206065, 230859, 264761, 297691, 337164, 383335, 421445, 460100, 484922, 492416, 490245, 467677, 433776, 402339, 361928, 321594, 282119, 260327, 244472, 202645, 171225, 159647, 149532, 135258, 128569, 115826, 110990, 94627, 88744, 91195, 92256, 90569, 97543, 81199, 75349, 65768, 63061, 56629, 50667, 51910, 81485, 100936, 119583, 138085, 143689, 145127, 165231, 174677]
13463A74677J735J121j6419j7591j7697j7710l5412j5462q604P378j5929o011
13451C4076j1390m196O484P00N005J5532N538m301r459n800o78k246r43J3414
13437D1736J6982O912K51J3644R989J9110K5828L5423J3242Q410K649l1300k5246
13424A37630j0420l0795j5192j4247j5689q61q489j1379j0548O246J463n505j2463
13411I751q479j5823K1902J3138J0904l474j1738j063k68j1804k449K140O903
13398I640J818n131m064K206o51m879K713j6N857J177K276l394K950M782O310
13383B1594m271J901p21m798M784o104j3459O864J7481p942m238L559K967n097
13369A2520j7033m755J423N242p494K0356r93k841r780j497o580R37P864O576
$$ y = [174677, 176412, 177533, 161114, 143523, 125826, 108116, 72704, 57242, 48638, 56016, 40087, 34076, 22686, 18490, 24974, 25674, 30679, 46211, 51749, 47448, 37989, 32189, 31511, 29265, 28322, 41736, 58718, 65630, 65881, 79525, 89514, 108624, 134452, 169875, 183117, 191527, 194176, 162876, 137630, 127210, 96415, 81223, 66976, 51287, 50426, 41937, 30558, 20010, 26256, 27719, 22214, 9751, 1272, -14551, 7351, 20489, 31393, 27919, 16181, 15118, 14850, 3046, 597, 2737, 9640, 11458, 6327, 2263, 4469, 3818, -1061, 1652, 1636, 7493, 8670, 10946, 7552, 10502, 15284, 21594, 17323, 19224, 18503, 13705, 18489, 12385, -1074, 5790, 23271, 15329, 11091, 14650, 17617, 12520, -4513, -9268, -7845, -2603, -10097, 10259, 9266, 6425, -3355, -4852, -11432, -10495, -2631, 3945]
13355C945J1579O305l363J67l26p495r920q257K7040J0323k610k282m523j891
13341A8692o039j3237p058o799J1486O736q382n382q741K714J1109O973o490o177
13327a0595J1486J1147n143n835M052K559o446R295m170p038M577P290j617j6671
13313g109L520N387K977J5441j40m097q632j361P640L128k086N21q83O861j809
13298A9358j8906m413J551r393N986L245J4258K822r742j878l219q7L285o902
13284d035m086p101k670r42j344L606K1073J4184n682l405N721P698q975j0406
13270C636j1579l660L123J5804K376R362j303M606L089j3743j1646m345R377O181
13256A1278J2424k044l348K356o120L530r186J171l674j0510p71R010l842j91
$$ y = [3945, 15524, 21829, 18466, 18633, 18307, 10812, 892, -7365, 19675, 29998, 27388, 25106, 20583, 18692, 12653, -584, -7642, -14441, -2955, 3781, -4601, -9983, -18724, -16010, -4901, 2072, -4418, -10595, 891, 12038, 6895, 1060, 5112, 7671, 1225, 10520, 6350, -688, 3889, 11179, 9562, -7109, -3589, 1798, 4775, 20216, 20076, 15979, 7347, 5986, 13626, 16754, 14668, 15189, 14306, 21167, 19358, 452, -3961, -2410, -11803, -5817, -2572, 11686, 14508, 4766, 2888, -331, -418, 2867, -4035, -8121, -15222, -17892, -18834, -20178, -16572, 4501, 18685, 13003, 9598, 15319, 23017, 14042, 3636, -7943, -11603, -8480, 7324, 9700, 19062, 17759, 22365, 25454, 11711, 65, -4280, 5097, 11278, 23702, 21658, 18310, 20666, 14546, 18076, 8890, 10061, 6387, -4123, -4894, 4116, 274, 83]
13242H3O068q62j217k401K815n386J112O885o090N547J0380J256j3843j5178n842
13227a6673M583L940J6938J6981J918j1749r695j3367J5640Q267o381o379r623
13214e600k046Q768j1540k279j209J948K177J1803k959o994N533N865l929m06
13200h68q930K769N474o0k465J2088L061k747J0918p253j7461M61j545P84j334
13185g108j296M104J2085p965q977P211J4178m625n173j952k708j608n001l123
13171a1958L667J1280R186j611j1800M926J3108M714l642j355p644k642o587m076
13157d434P320l163l597r347R782O45p743m316N656n225O58J1608K599K377Q343
13142A1163N148M008L186K458j6972q781N342j1263J1463R526p089O017q092L87
$$ y = [83, 6151, 5289, 4072, 1671, 4486, -900, 212, 7097, 1007, 6554, 16934, 18190, 4347, -10831, -16673, -12090, -8150, 8788, 25769, 27687, 15938, 6243, -7124, 8516, 16783, 10402, 4023, -5600, -7646, 1122, -10418, -12697, -13906, -11958, -9781, 2022, -937, -7931, -2398, 3467, -462, -868, -9798, -7029, -1555, -1615, -4080, 8008, 11069, 8322, 19240, 11987, -5474, -5013, -6558, -5774, -7108, -8404, -4300, 7785, -180, -9157, -1946, 12232, 7607, 2434, 482, -2226, -3834, -8835, -11958, -8291, 2989, 12175, 10564, -1236, 3690, 16798, 21512, 17870, 16515, 8871, 6229, -358, -4434, 2886, -277, -3874, -13221, -3439, -2794, -10537, -14853, -9197, -14422, -13764, -2156, 443, 2820, 11163, 16311, 20319, 23505, 25963, 8991, 210, 5552, -5711, 5752, 15278, 8189, 14206, 6114, 6501]
13128F501m454R817L288l170J6243r824k0336P065J3615K12j0629r284r32O744
13114D856K205L006Q199o910k823O132L418r615M618q76J1362n253K50O468r531
13099A5506m139J3999J1888o518l86O541p090p083n52k115l310j0840n879M304
13085D326K801O619J7586K676o118J887M048N568M831o608l770j5882p860K0335
13071C0439J0519o266j149l235j952j769Q536p39j3179j716n743M14J1276J1030
13057C6466n512p602k869k24m909J0519M884o786n997L942n629P96n30p385N371
13042A4535k566J0266N609N911K4185m894q605m890p530J1748J2770p429n328
13029D3782j0050R163M217J617l206j1724j210J1580j0844n600j0674j674O00
$$ y = [6501, 2047, 11864, 15152, 11982, 28225, 18401, -1935, 5130, 18745, 18957, 8328, -956, -1888, 4856, 7061, 10067, 18266, 11356, 8533, 14665, 18083, 8468, 13086, 12210, 23572, 18319, 18569, 25037, 15506, 11367, 25366, 37254, 30736, 30350, 36891, 29801, 22718, 22166, 20051, 16741, 5901, 22, 4326, 7127, 13746, 31332, 34008, 27890, 29777, 33825, 39393, 44224, 37616, 33846, 17964, 10104, 30439, 40958, 34692, 33543, 30308, 28356, 26587, 35123, 34384, 21205, 19489, 13746, 14160, 25436, 36466, 30954, 23352, 20483, 20259, 15350, 25869, 30753, 23967, 17970, 21912, 16283, 17079, 16549, 9164, 14535, 11969, 22235, 27844, 33755, 57940, 53046, 44441, 39551, 32021, 43769, 56539, 49110, 43782, 33732, 42895, 47112, 48729, 45523, 33799, 32589, 44169, 33325, 27725, 17051, 15377, 15977]
13016A5977N975J0131j0012j2672J6500J0866r434j4738r092J1215J6168J276
13004C2160K746Q551p873j2837k925R866J0935k697J305j6875J1241J4089K19
12991D7905j291R34K637P35j0391m665j175n447J09l25k251n682M429J768O207
12976C3497J259K469K659p627j4353j0868j1329J0086j389l612m065l730O837
12963a66O582J964P571N321o920j750j938j762P038k413k659l665o76k006J033
12948E554P599r906r354L21Q677O608P409R782k043pj2891K929j414j068N730
12933A7926j3598K508J0530P190Q005m063M459j0626o740J4799r534m25p496P48
12919A3683j1001L519J7438p529r271n040j1211P053J3796N160J6958j555j6633
$$ y = [15977, 21952, 32083, 22071, 9399, 25899, 36765, 27331, 12593, 3501, 14716, 30884, 32160, 34906, 43457, 35584, 22747, 19822, 29688, 40623, 37926, 39231, 22356, 33597, 47686, 47905, 46614, 47548, 50185, 50920, 40529, 35864, 34689, 29242, 29351, 29026, 26775, 21093, 25522, 27290, 33497, 34756, 37225, 39884, 32257, 17904, 7036, -4293, 5793, 4404, 792, -3273, -7003, -166, 6416, 8380, 15951, 21272, 14352, 12602, 10664, 8902, 15940, 13527, 10868, 7203, 6527, 4521, 5554, 13153, 3247, -6107, -5786, 2891, 9499, 16908, 26690, 24647, 24640, 11749, 14678, 13264, 12196, 17926, 4328, 6836, 17366, 24556, 32561, 28498, 32957, 22331, 15591, 30390, 20856, 20431, 12935, 13683, 2682, 6201, 23639, 16110, 6839, 1799, -9412, -2359, 11437, 16597, 33555, 32000, 15367]
12906A5367P329q649O818Q595q66j7166j4100n294O463J0248R439J0704j4024
12893A4864j0617m716K707J2183R612n962K283R26j0416Q498p057l474K630N376
12879A6837q140p203K2145J9884j2115j3827L635p587n580m079O848R504K47j9169
12865A400r071Q454R129q953J0085O898O49L834k057r168M222M989j4402M132
12851A0141M882L273J0250P2r88n877m694L377M685K953O170J5211q23m339L69
12836D4662j9803o785j4606J9059K4458j454o946m116p852n312Q51r59O864Q156
12822C6217j4387j5222o204J358J0340M474n106l887Q633m57o940J0547j709J3353
12808C1010m808m015J3035J1070q911q657m297P773M47n00J1683L53O471O165
$$ y = [15367, 22696, 14047, 20865, 29460, 28594, 11428, -2672, -7966, -1503, 8745, 18184, 28888, 14864, 4247, -469, 2238, 14421, 24033, 18071, 20354, 21280, 10864, 19362, 12305, 8831, 11461, 16837, 8697, 1494, 23639, 43523, 31408, 17581, 21216, 13629, 8049, 3970, 10818, 20322, 20569, 1400, -7671, 783, 9912, 959, 11044, 17942, 18591, 22425, 20368, 11200, 15422, 20411, 6009, 10141, 15023, 18296, 28546, 28618, 27630, 21753, 17059, 20436, 25121, 28074, 34244, 49455, 48632, 44293, 44662, 24859, 18074, 3468, 22527, 46985, 45531, 38585, 34469, 26617, 21305, 22156, 21197, 28061, 36217, 21830, 6608, 404, 1762, 12102, 16576, 11470, 7583, 16216, 15759, 8819, 19366, 17657, 31010, 26202, 22187, 35222, 46292, 37381, 28724, 24427, 32200, 32647, 32147, 43830, 44183, 50654, 56819]
12794E6819q167j1809j657P52j0441l884o154L064M947p914j5272N99K1922J4438
12780C7243K588j2877M67J1741J166o366P681J084q320m529j1726O775J0171P33
12766C5831j1943j0560q530q150l597J3289o181Q143M566K32L370O373P251N910
12752C6004L701k602n543j134m538J3172Q035r727J6388J693N751q749J18K513
12738E5082j4969P32K843j732J1447J6519j096j2156M426R398K08m886J3374K2414
12724A01604l250m799m496Q738K4710K0989L8951J9448M2285N5275P6518R4515
12712D70488R9594R3554O6424M5919R217m2668o9461r1484j00031j07118n6457
12701C17977m8902m7777l8312r800j7368k7563j1332P801k341j1158l605j0520
$$ y = [56819, 48652, 36843, 35186, 35938, 25497, 21613, 15459, 18523, 23470, 15556, 284, 883, 22805, 37243, 39831, 26954, 27421, 39162, 40328, 33962, 41643, 42727, 34407, 29878, 18152, 24927, 35098, 35831, 23888, 13328, 4798, -3352, -6949, 6340, 159, 8302, 12868, 13100, 16470, 22843, 30094, 36004, 39705, 37103, 31560, 30426, 25888, 39060, 47095, 37368, 53756, 55449, 61200, 52451, 52569, 55082, 40113, 40845, 43688, 41956, 53403, 69922, 68826, 56670, 61096, 70494, 70702, 65816, 79190, 101604, 98354, 93555, 89059, 97797, 122507, 143496, 182447, 201895, 244180, 299455, 375973, 470488, 570082, 663636, 730060, 775979, 785196, 742528, 673067, 581583, 481552, 374434, 317977, 269075, 221298, 182986, 173186, 155818, 128255, 116923, 124724, 122383, 111225, 107620, 97100]
12689I7100j3116J0583L216p789l306K155j2911m427k4885L741J2708r88r532
12676E2549j489J7819j0699j5684R464J3285o01o942l305K455J2833K704M015
12663G6404J1022q598m952l566p456K533r503n735J0294K0108J6037O460n059
12650I7989m220J582j996j068k502q451L126K84o976r691J0198j3470j0770J4690
12636F8725o04j3058L388J1632q09o318O19l504q465Q521k840M586L0488L3392
12622A25753j995m638n045j7991o867J995J054K2720J5617N694O932p636p909
12609A27684l034L317J0545J3975O365j5676q35R194R058J5634O909P043J5205
12596B05384J3340J7484K2694J9857J5597K0263j420k631L48p035n075M312J2497
$$ y = [97100, 83984, 94567, 97783, 89994, 86688, 88843, 75932, 71505, 46620, 50361, 63069, 62081, 52549, 51060, 68879, 58180, 42496, 51960, 65245, 64644, 57702, 54397, 56852, 69685, 72389, 76404, 87426, 78828, 73876, 70310, 62854, 65387, 55884, 50149, 60443, 80551, 96588, 103048, 97989, 93769, 95351, 93355, 92287, 89785, 81334, 84460, 84744, 77768, 68077, 78275, 64805, 54035, 68725, 68121, 55063, 58451, 70083, 69274, 62956, 63575, 60071, 51606, 60127, 57287, 61873, 92361, 125753, 123758, 119120, 114075, 96084, 89217, 91212, 92266, 114986, 130603, 136297, 143229, 135593, 127684, 124650, 127967, 138512, 152487, 158852, 143176, 142341, 151535, 160593, 176227, 183136, 190179, 205384, 218724, 236208, 258902, 278759, 294356, 314619, 313199, 310568, 310916, 303881, 298806, 303118, 315615]
12583C15615l055l58n502j3297o647p528o875j7084k2566j5994j6189k2348k1257
12570A56915M68l104j0575k2123p033R676M004M628o292J6113J0929O498K013
12557A62117n983J135o513l15k038Q670p854J641O303j0500P591L35k89O574M952
12542A65826k334n040J1254j664l886J2577L088j5736q559K649k901o88n90p364
12528A46632j5322j1158q643o816N440L245o54j2219m262r734K270M222M749o914
12514I0836r68j720n258L938N394p859q621M837j974j245L745L96O284Q369M231
12499A00385K453L749n222Q56p893O052R125N844M158P106k884Q245M775M125
12485A40874l753l922J497L188J2361J634Q424P218R341q529j3110j5953K780
$$ y = [315615, 312560, 312202, 306700, 293403, 286756, 279228, 272353, 255269, 232703, 216709, 200520, 178172, 156915, 157383, 154279, 143704, 121581, 114548, 124224, 128228, 132856, 126564, 142677, 153606, 160104, 162117, 156134, 157269, 150756, 150441, 148403, 157073, 149219, 150860, 157163, 146663, 154254, 154589, 154300, 160874, 165826, 163492, 158452, 169706, 168042, 164156, 176733, 179821, 164085, 155526, 158175, 155274, 154586, 153996, 146632, 131310, 120152, 111509, 104693, 110133, 113378, 112724, 100505, 96243, 86509, 88779, 93001, 97750, 90836, 89868, 88148, 82890, 86828, 92222, 84363, 75742, 80579, 78605, 77360, 81105, 81501, 87785, 96154, 100385, 102838, 106587, 101365, 102221, 94328, 100380, 109505, 115349, 119507, 126613, 123729, 131974, 136749, 140874, 137121, 133199, 134696, 137884, 150245, 151879, 160303, 167521, 176862, 168333, 155223, 139270, 142050]
12472A42050R897j6303l89J1418q42L884o14M944q587m549k5959j0883R805J3791
12458A27663n241n148j9324R936J5763P089m47j154J8250N302Q514o004L34j0
12444A55523o132k86R241J2077k190J938K130K089R631R718p338j7097j7369k473
12430A49462J158N536R855M507R16r959N571J0577N447K8188J4718J9736J5974
12417B61686J5619J8497m29J387Q385J3624q276k735N023j1682K305m888j330
12404B97186j3913n106k222J0373J0382L064q00K039r173O511O921J238L497J6687
12390C26684L055K783M475R916o15J4909M216Q226K8742K0055J3840J0650J4046
12377D60982K3608N691o698L186J2287N885O758O618j2792o283Q066J1625j2526
$$ y = [142050, 151947, 135644, 135255, 146673, 145831, 149715, 149101, 154045, 145458, 140909, 114950, 104067, 113872, 127663, 122422, 117274, 97950, 107886, 123649, 130738, 130291, 129137, 147387, 152689, 161203, 155199, 155533, 155523, 149391, 149105, 158346, 170423, 168233, 170171, 172301, 174390, 184021, 193739, 186401, 169304, 151935, 149462, 150620, 156156, 166011, 170518, 171434, 161475, 167046, 177623, 183070, 211258, 225976, 245712, 261686, 277305, 295802, 295373, 296760, 305145, 318769, 310493, 307758, 312781, 301099, 303404, 298516, 297186, 283273, 278167, 275945, 286318, 296700, 299764, 298964, 301003, 291830, 298341, 305262, 306500, 309997, 326684, 329739, 332522, 336997, 346913, 346298, 361207, 365423, 373649, 402391, 422446, 436286, 446936, 460982, 484590, 490281, 483583, 486769, 499056, 504941, 511699, 518317, 505525, 499242, 507308, 518933, 506407]
12364E06407l130J6424J5950L169J3173J2021K463J685J4485K2076K8715K9153
12352F62591L5676K3994K5893L7249L8731M2781J9004O000J0719K1858L7975L0237
12340I92708K5285L3597M8629M9013N4537O4600O3114N1451M3555M2799M5287
12329A514575N9500O3908P1602Q2917R5802R5622J12734J16712J35075J71111
12319B519558K18576K46698L22363L83038M31847N54336O93551Q20264R56256
12310G146487J087067J198672J288093J354789J439716J628728K044926K816264
12302B0004742M080418O014232Q840722J2742676J7479989K2122698K5073710
12295A16359187K4288317J7980928O367321p380507j8692455k4560927k4728881
$$ y = [506407, 503277, 519701, 535651, 538820, 551993, 564014, 566477, 568162, 582647, 604723, 633438, 662591, 698267, 722261, 748154, 785403, 824134, 866915, 885919, 891919, 902638, 924496, 962471, 992708, 1017993, 1051590, 1100219, 1149232, 1203769, 1268369, 1331483, 1382934, 1426489, 1469288, 1514575, 1574075, 1637983, 1709585, 1792502, 1888304, 1983926, 2096660, 2213372, 2348447, 2519558, 2738134, 2984832, 3307195, 3690233, 4122080, 4676416, 5369967, 6190231, 7146487, 8233554, 9432226, 10720319, 12075108, 13514824, 15143552, 17188478, 20004742, 24085160, 30099392, 38940114, 51682790, 69162779, 91285477, 116359187, 140647504, 158628432, 164995753, 157615246, 138922791, 114361864, 89632983]
12288H9632983k1057766j6078410j1529341q081962n660206l995477k867223k135386
12280A8227212j687216j486951j430830j423102j391019j328760j177062j012594
12272G289678q47368o91599n45327m50920l81690l42552k93398k44893k38852
12263C253079k34496j97008j61657j67443j62298j39964j13827j10017j05693
12254A860676r0564p0071o4251o1094o4399n5028n4278m2790m5900m4224n1904
12243A216173l9790m0271l7867l4943m6018m4848o5544o9997m6033m8589m6031
12232F96242l4120l3002j8272k2461k3271k1441j4418k5147j7572K048j0570j2639
12220D65377k5042k4968j6100m161q928j7318j5891k625j1189K896q84j5803k210
$$ y = [89632983, 68575217, 52496807, 40967466, 32885504, 27225298, 23229821, 20362598, 18227212, 16539996, 15053045, 13622215, 12199113, 10808094, 9479334, 8302272, 7289678, 6442310, 5750711, 5205384, 4754464, 4372774, 4030222, 3736824, 3491931, 3253079, 3018583, 2821575, 2659918, 2492475, 2330177, 2190213, 2076386, 1966369, 1860676, 1770112, 1700041, 1635790, 1574696, 1510297, 1455269, 1400991, 1358201, 1312301, 1268077, 1216173, 1176383, 1136112, 1098245, 1063302, 1017284, 972436, 906892, 836895, 790862, 742273, 696242, 662122, 629120, 610848, 588387, 565116, 543675, 529257, 504110, 486538, 488586, 478016, 465377, 440335, 415367, 399267, 395106, 386178, 368860, 352969, 350344, 339155, 342051, 341167, 325364, 323154]
12207C23154J0144J2195o39r691N269L184J031M237m263k566o490M616l587j1888
12193C24706j4409k1332j0824p717j0755j9934J332k630j0801q667J89l14M401
12180B23245m077l02J875l850m44j1896m27l922J8347O455j0882J9138R505J5819
12166B58584J002N753J0458K0536l44k5465k0484j2677j1359o563j1987q613j405
12153A97436J815j2240P008N22K398r500k656l508L455q744k0201j0306R764P752
12139A62995l03K8473K0225k419R359O291m549k844J012o570o031q610j7034j8054
12125A61941j2222q888k158j089r748L119j3297M419n451K457m968M047j157O108
12111A23113M742m08P757K565n006p981Q447J5112l81L681m878j2330J0604J2166
$$ y = [323154, 333298, 345493, 344854, 335163, 340432, 343616, 344647, 348884, 344621, 342055, 335565, 340181, 336594, 324706, 310297, 288965, 278141, 270424, 259669, 239735, 241067, 238437, 227636, 218969, 219158, 218844, 223245, 219168, 218866, 220741, 216891, 216447, 204551, 204124, 200202, 218549, 225004, 214122, 233260, 242765, 258584, 259586, 265339, 275797, 296333, 295989, 270524, 250040, 237363, 226004, 219441, 207454, 198841, 197436, 199251, 187011, 194019, 194541, 196939, 187439, 184783, 181275, 184730, 175986, 155785, 145479, 155243, 162995, 162692, 191165, 211390, 208971, 218330, 224621, 220072, 217228, 218240, 211670, 205639, 197029, 179995, 161941, 149719, 140831, 138673, 137584, 127836, 130955, 117658, 122077, 116626, 119083, 114115, 118162, 117005, 123113, 127855, 127447, 135204, 137769, 132763, 124782, 133229, 148341, 147960, 151641, 146763, 134433, 145037, 157203]
12097A57203N194n461P25J5317k620K788J1037j0990N453J9054k430J0453L043
12084B08766p469n146n583O368k646j4871j0923l08N90L983Q763M04J434L261
12070A86623N740N557J2359Q496o484j9405j2847j3028L919Q284R060O088M546
12057A98908j2318n994o730l143j460K213O482l359J813o10k993p380r36K2236
12043A86729J0802j53m049J6503J5149K531j377N334N983o603N4O246J1360j0776
12029B37733r64O409q861j239N405J4356J1238l106Q474P874J3999m955m726O947
12015B88584P401j995j2443m545m369L281l368k205J8782J3096p662J0005J3030
12002C17592J6133N509j0093j3180K296m557Q771M349K961Q16J52Q372J8458Q423
$$ y = [157203, 162397, 156936, 157661, 172978, 170358, 173146, 184183, 173193, 178646, 197700, 195270, 205723, 208766, 201297, 196151, 190568, 196936, 194290, 179419, 168496, 168188, 168778, 172761, 181524, 181928, 183362, 186623, 192363, 197920, 210279, 218775, 212291, 192886, 180039, 167011, 170930, 179214, 188274, 194362, 198908, 186590, 180596, 173866, 170723, 169263, 171476, 177958, 174599, 176412, 175802, 172809, 165429, 164493, 186729, 197531, 197378, 193329, 209832, 224981, 227512, 226135, 231469, 237452, 230849, 230903, 237149, 248509, 237733, 236769, 243178, 234317, 233078, 238483, 252839, 264077, 260971, 269445, 277319, 291318, 286363, 281637, 288584, 295985, 293990, 281547, 277002, 272633, 275914, 272546, 270341, 289123, 302219, 294557, 304562, 317592, 333725, 339234, 329141, 315961, 318257, 313700, 322471, 326820, 329781, 330597, 330749, 339121, 357579, 366002]
11988C66002O876J3358N50N29P892O092l83K333M703J2111J5928j0878K348J1431
11974D38892K124J5552N898P349J3906K696N370J8414J6918J8890L823J5454O335
11961E71621J6784K5867M035J828N179r24J6737J4869J1032L2807L7796L4164
11949G71795N0872N3386P1904J27577J99086L43573O02818R01487O79319l34896
11939C466921r04333o89916l64102j66647r4994m4357m0975l4665o287O054J0398
$$ y = [366002, 372878, 386236, 386786, 387315, 395207, 401299, 400916, 403249, 407952, 420063, 435991, 425113, 427461, 438892, 441016, 456568, 462466, 469815, 483721, 486417, 491787, 510201, 527119, 546009, 549832, 565286, 571621, 588405, 614272, 618307, 620135, 625314, 624390, 641127, 655996, 667028, 699835, 737631, 771795, 822667, 876053, 947957, 1075534, 1274620, 1618193, 2221011, 3122498, 3801817, 3466921, 2562588, 1872672, 1508570, 1341923, 1246929, 1202572, 1161597, 1126932, 1120645, 1126699, 1137097]
$$ [...]
##END NTUPLES=NMR SPECTRUM
##END=
