##TITLE=Analysis number 325082
Compound Code cc 56204
Book Reference 513/20/22
Project Code adrs
Chemist Name ronp
##JCAMPDX= 6.0         $$ Bruker NMR JCAMP-DX V2.0
##DATA TYPE= NMR SPECTRUM
##DATA CLASS= NTUPLES
##ORIGIN= Bruker BioSpin GmbH
##OWNER= nmr
$$ XWIN-NMR		Version 3.5
$$ Mon Dec 11 09:08:30 2006 GMT Standard Time (UT+0h)  MAYBRIDGE\nmr@NMR_250MHZ
##.OBSERVE FREQUENCY= 250.131544655141
##.OBSERVE NUCLEUS= ^1H
##.ACQUISITION MODE= SIMULTANEOUS (DQD)
##.ACQUISITION SCHEME= undefined
##.AVERAGES= 16
##.DIGITISER RES= 18
##SPECTROMETER/DATA SYSTEM= dpx250
##.PULSE SEQUENCE= zg30
##.SOLVENT NAME= CDCl3
##.SHIFT REFERENCE= (INTERNAL, CDCl3, 0, 16.522)
##AUDIT TRAIL= $$ (NUMBER, WHEN, WHO, WHERE, WHAT)
$$ ##TITLE= Audit trail, XWIN-NMR		Version 3.5
$$ ##JCAMPDX= 5.01
$$ ##ORIGIN= Bruker BioSpin GmbH
$$ ##OWNER= nmr
$$ C:\u/data/dgb/nmr/ADRS/580/pdata/1/auditp.txt
$$ ##AUDIT TRAIL=  $$ (NUMBER, WHEN, WHO, WHERE, WHAT)
(   1,<2006-12-11 09:08:08.23 +000>,<MAYBRIDGE\nmr>,<NMR_250MHZ>,
      <created by zg, POWCHK disabled, PULCHK disabled
       configuration hash MD5:
       49 4B E0 1D 92 C2 6B 37 9F E6 65 BC 52 41 86 1D
       data hash MD5: 64K
       18 72 F5 4D 61 DF B4 3A 48 C2 92 76 C0 95 CD 79>)
(   2,<2006-12-11 09:08:19.95 +000>,<MAYBRIDGE\nmr>,<NMR_250MHZ>,
      <Start of raw data processing
       ef LB = 0.3 FT_mod = 6 PKNL = 1 SI = 32K 
       data hash MD5: 32K
       02 37 71 33 AC 7A BA 31 8B FE E0 81 93 25 3B 00>)
(   3,<2006-12-11 09:08:21.85 +000>,<MAYBRIDGE\nmr>,<NMR_250MHZ>,
      <apk 
       data hash MD5: 32K
       B8 FF 1E 53 3A EF 23 69 9D A6 23 06 5B 31 F0 F8>)
(   4,<2006-12-11 09:08:22.70 +000>,<MAYBRIDGE\nmr>,<NMR_250MHZ>,
      <abs ABSG = 5 
       data hash MD5: 32K
       45 0E 7A 7E 1E D9 77 05 BD F9 0F 8D 5A 00 D8 69>)
$$ ##END=
$$ 
$$ hash MD5
$$ FF 57 75 00 98 EC A3 D3 5D 0B 5E 27 4C 8E 32 BC
##$RELAX= 
##$RELAX= 
##$RELAX= 
##$RELAX= 
##$RELAX= 
##$RELAX= 
##$RELAX= 
$$ Bruker specific parameters
$$ --------------------------
##$DU= <C:\u>
##$EXPNO= 580
##$NAME= <ADRS>
##$PROCNO= 1
##$TYPE= <nmr>
##$USER= <dgb>
##$AMP= (0..31)
100 100 100 100 100 100 100 100 100 100 100 100 100 100 100 100 100 100 
100 100 100 100 100 100 100 100 100 100 100 100 100 100 
##$AQSEQ= 0
##$AQ_mod= 3
##$AUNM= <au_zg>
##$AUTOPOS= <33 >
##$BF1= 250.13
##$BF2= 250.13
##$BF3= 250.13
##$BF4= 250.13
##$BF5= 500.13
##$BF6= 500.13
##$BF7= 500.13
##$BF8= 500.13
##$BYTORDA= 1
##$CFDGTYP= 0
##$CFRGTYP= 5
##$CHEMSTR= <none>
##$CNST= (0..31)
1 1 145 1 1 1 1 1 1 1 1 1 1 1 1 1 1 1 1 1 1 1 1 1 1 1 1 1 1 1 1 1 
##$CPDPRG= <>
##$CPDPRG1= <>
##$CPDPRG2= <>
##$CPDPRG3= <>
##$CPDPRG4= <mlev>
##$CPDPRG5= <mlev>
##$CPDPRG6= <mlev>
##$CPDPRG7= <mlev>
##$CPDPRG8= <mlev>
##$CPDPRGB= <>
##$CPDPRGT= <>
##$D= (0..31)
0 1 0 0 0 0 0 0 0 0.06 0 0 0 0 0 0 0.0002 0 0 0 0 0 0 0 0 0 0 0 0 0 0 
0 
##$DATE= 1165828086
##$DBL= (0..7)
120 120 120 120 120 120 120 120 
##$DBP= (0..7)
150 150 150 150 150 150 150 150 
##$DBP07= 0
##$DBPNAM0= <>
##$DBPNAM1= <>
$$ [...]
##$SUBNAM7= <"">
##$SUBNAM8= <"">
##$SUBNAM9= <"">
##$SW= 20.6930455092707
##$SWIBOX= (0..15)
0 0 3 0 0 0 0 0 0 0 0 0 0 0 0 0 
##$SW_h= 5175.983436853
##$TD= 65536
##$TD0= 1
##$TE= 295.16
##$TE2= 300
##$TE3= 300
##$TEG= 300
##$TL= (0..7)
0 120 120 120 120 120 120 120 
##$TP= (0..7)
150 150 150 150 150 150 150 150 
##$TP07= 0
##$TPNAME0= <>
##$TPNAME1= <>
##$TPNAME2= <>
##$TPNAME3= <>
##$TPNAME4= <>
##$TPNAME5= <>
##$TPNAME6= <>
##$TPNAME7= <>
##$TPOAL= (0..7)
0.5 0.5 0.5 0.5 0.5 0.5 0.5 0.5 
##$TPOFFS= (0..7)
0 0 0 0 0 0 0 0 
##$TUNHIN= 0
##$TUNHOUT= 0
##$TUNXOUT= 0
##$USERA1= <user>
##$USERA2= <user>
##$USERA3= <user>
##$USERA4= <user>
##$USERA5= <user>
##$V9= 5
##$VALIST= <valist>
##$VCLIST= <CCCCCCCCCCCCCCC>
##$VD= 0
##$VDLIST= <DDDDDDDDDDDDDDD>
##$VPLIST= <PPPPPPPPPPPPPPP>
##$VTLIST= <TTTTTTTTTTTTTTT>
##$WBST= 1024
##$WBSW= 4
##$XGAIN= (0..3)
0 0 0 0 
##$XL= 0
##$YL= 0
##$YMAX_a= 304274
##$YMIN_a= -396148
##$ZGOPTNS= <>
##$ZL1= 120
##$ZL2= 120
##$ZL3= 120
##$ZL4= 120
##$ABSF1= 16.522
##$ABSF2= -4.171173
##$ABSG= 5
##$ABSL= 3
##$ALPHA= 0
##$AQORDER= 0
##$ASSFAC= 0
##$ASSFACI= 0
##$ASSFACX= 0
##$ASSWID= 0
##$AUNMP= <proc_1d>
##$AZFE= 0.1
##$AZFW= 0.1
##$BCFW= 0
##$BC_mod= 0
##$BYTORDP= 0
##$COROFFS= 0
##$CY= 12.5
##$DATMOD= 1
##$DC= 0
##$DFILT= <>
##$DTYPP= 0
##$F1P= 14.0000005364418
##$F2P= -0.99999901652339
##$FCOR= 0.5
##$FTSIZE= 32768
##$FT_mod= 6
##$GAMMA= 0
##$GB= 0
##$INTBC= 1
##$INTSCL= 1
##$ISEN= 128
##$LB= 0.3
##$LEV0= 0
##$LPBIN= 0
##$MAXI= 10000
##$MC2= 0
##$MEAN= 0
##$ME_mod= 0
##$MI= 0
##$NCOEF= 0
##$NC_proc= -4
##$NLEV= 6
##$NOISF1= 0
##$NOISF2= 0
##$NSP= 0
##$NTH_PI= 0
##$NZP= 0
##$OFFSET= 16.522
##$PC= 1
##$PHC0= 222.1461
##$PHC1= 9.215303
##$PH_mod= 1
##$PKNL= yes
##$PPARMOD= 0
##$PSCAL= 4
##$PSIGN= 0
##$REVERSE= no
##$SF= 250.13
##$SI= 32768
##$SIGF1= 0
##$SIGF2= 0
##$SINO= 400
##$SIOLD= 32768
##$SREGLST= <1H.CDCl3>
##$SSB= 0
##$STSI= 32768
##$STSR= 0
##$SW_p= 5175.98343685301
##$SYMM= 0
##$S_DEV= 0
##$TDeff= 65536
##$TDoff= 0
##$TI= <Analysis number 999999
Compound Code 99
Book Reference 9
Project Code 9>
##$TILT= no
##$TM1= 0
##$TM2= 0
##$TOPLEV= 0
##$USERP1= <user>
##$USERP2= <user>
##$USERP3= <user>
##$USERP4= <user>
##$USERP5= <user>
##$WDW= 1
##$XDIM= 32768
##$YMAX_p= 346981857
##$YMIN_p= -345967
$$ End of Bruker specific parameters
$$ ---------------------------------
##NTUPLES= NMR SPECTRUM
##VAR_NAME=  FREQUENCY,     SPECTRUM/REAL,   SPECTRUM/IMAG
##SYMBOL=    X,             R,               I
##VAR_TYPE=  INDEPENDENT,   DEPENDENT,       DEPENDENT
##VAR_FORM=  AFFN,          ASDF,            ASDF
##VAR_DIM=   32768,         32768,           32768
##UNITS=     HZ,            ARBITRARY UNITS, ARBITRARY UNITS
##FACTOR=    0.157963299565203, 1,           1
##FIRST=     4132.6476996994, 0,             0
##LAST=      -1043.33573715361, 0,           0
##MIN=       -1043.33573715361, -345967,     0
##MAX=       4132.6476996994, 346981857,     0
$$ Real data points
##PAGE= N=1
##DATA TABLE= (X++(R..R)), XYDATA
$$ [...]
24867G7856m4574P69n5607k6402J2755j634J4721l8814j7907n266P9669K1387
24855A6953L306p404o5322K1405J3780J4100j288J6044k2401o3131R834M2621
24843b1503M7366m5003m5434K9542p635k3126K1330K4884M149J2588L105k5291
24831b5028o48k0988K9618J4946l6013l302K7389L4337L0867j6353p2264m6957
24819h4396K2389J4479N7790k3983N263m1904k7195r590j5267K899p828J2378
24807i4965l1882O1182M9057N597m0224K0777M740j6686j9362J8213m569n379
24795e3501K2139j1764l3984J9436J3945J0657k4633P6576K2835N296J611Q132
24783E6745k7455l8494l3050K8702K0735l8756M033k3834Q937K8877M7616j0429
$$ y = [77856, 33282, 34051, -21556, -47958, -35203, -36837, -22116, -60930, -78837, -84103, -4434, 16953, 20259, 12855, -52467, -31062, -17282, -3182, -4470, 11574, -10827, -73958, -64124, -21503, 25863, -19140, -64574, -35032, -42667, -65793, -44463, -19579, -15430, -2842, 263, -25028, -25676, -46664, -17046, -2100, -38113, -41415, -14026, 20311, 51178, 34825, -37439, -84396, -62007, -47528, 10262, -13721, -8458, -50362, -77557, -87147, -102414, -99515, -107343, -94965, -126847, -65665, -16608, -11011, -51235, -30458, -25718, -42404, -61766, -43553, -48122, -53501, -31362, -43126, -77110, -57674, -43729, -33072, -57705, 18871, 41706, 47002, 48613, 56745, 29290, -9204, -42254, -13552, 7183, -31573, -27540, -51374, -42437, -13560, 34056, 23627]
24771B3627j1977n515l0648k9917O0143L1768m6527N9048j9344j2715M9622J2183
24759G9748k9681k5419n4674J2822N9757M0437p8780k9286N274M6382M6505j6644
24747E6441k5204j6611m2487K1767M9014R255k6768n104J1991K194Q456O040J9634
24734F8618q7008k9462m95O4560J1251k928N5879K896m8751m5506n579J9670j2268
24721i123n2914j0754K9659L1984L0381r063k834K1995L0656p1534n4915N4439
24709a2023L9599l74m8597K722q533J3545p97j2086O168l928l6224j9146j1564
24696i1238P482L5560N0897k8882r987J2745m6230m206L7239J4173l0177K9655
24684b2969K6650l8719K2692k118m6526O358J6015O111J0037j7206m4843O9867
$$ y = [23627, 11650, 6135, -24513, -54430, 5713, 37481, -9046, 50002, 30658, 17943, 67565, 79748, 50067, 24648, -30026, -17204, 42553, 82990, 4210, -25076, -19802, 26580, 73085, 56441, 31237, 14626, -27861, -6094, 42920, 52175, 25407, 20303, 32294, 34488, 42944, 48984, 68618, -18390, -47852, -48347, 16213, 27464, 24536, 80415, 83311, 34560, -10946, -16525, 3145, -9123, -62037, -72791, -43132, -11148, 19233, 10170, 7336, 29331, 59987, -11547, -66462, -12023, 27576, 27202, -21395, -18673, -27206, -13661, -14458, -26544, -20376, -24304, -60528, -79674, -91238, -83756, -48196, 2701, -26181, -36168, -23423, -69653, -73859, -36620, -22447, -52624, -22969, 3681, -35038, -12346, -14464, -60990, -54632, -38617, -32506, -22469, -39675, -84518, -14651]
24672a4651R8373J6830p0945O154J7205o1138l8448j9065M0397k4541O9613R8589
24660A18373Q75m4350k9033k941L045L5444l2895k3616J5577p3966p849P0094
24648B8758l3626n8809M484k4529K4622N8954P253k6115K057L374J6264J8290
24636B0977n550J7473J0835l1906r6353l932l5679K752Q4555P1000k851K42r292
24623B2271K6265P464l6492j00990q252O1373K9010j5831k6698k499l952M1254
24611g077k748o0929j9325J4805Q2941N1670j0363q900l2174l0340K0923l259
24599d776k8126j3418q466N889j1832M9090J4740j2301L610Q072k4138l3770R9649
24586D4223J0982j7277l1854n8100l4350J703K944M41k7891L0865J9332L7626
$$ y = [-14651, 83722, 100552, 29607, 35761, 52966, -8172, -46620, -65685, -25288, -49829, 19784, 118373, 119248, 74898, 45865, 42924, 45969, 81413, 48518, 24902, 40479, -33487, -41336, 28758, -4868, -63677, -59193, -83722, -59100, -146, 7107, -19008, -16951, -13577, 2687, 20977, 15427, 32900, 43735, 11829, -84524, -88456, -124135, -121383, -36828, 34172, 31321, 31563, 22271, 48536, 56000, 19508, -81482, -89734, -28361, 649, -15182, -41880, -44379, -48331, -7077, -9825, -70754, -90079, -75274, 7667, 59337, 48974, 40074, 7900, -22440, -1517, -4776, -32902, -46320, -54786, -48897, -60729, -11639, 3101, -9200, -5590, 2482, -21656, -55426, 44223, 55205, 37928, 6074, -52026, -86376, -84673, -81729, -81288, -109179, -78314, -58982, -21356]
24574b1356k5026m9453K4834M1615M2562J3056l7986o2746o989p307K2627Q2010
24562A5841k1318k2942M4945j3709r8979N9439K7964J1243k1734j3489M7172J4263
24550B8696q5849m3425N5362n470k139L403J044N038J7803Q181n0775K1974R4694
24537D8537o974J8994K2732q0543k8676n9863p7199P3767Q9231J7664n362K1848
24525C4156K5761l013k7252k1406P54R802n1992J0679M6151j8670p980Q3m1601
24512d4528J5550J6343j7575j4247O560l859j1737q3866L3595M4479O7519M758
24500A2992o4100J1030N4772J2048j0485n624K1599k8803l9319j2678l1800j9642
24488a00010k4155M478L8700M8309K1300j4410m8312J5098J1709k6806K4449L2651
$$ y = [-21356, -46382, -95835, -71001, -29386, 13176, 26232, -11754, -74500, -81489, -88796, -66169, 15841, -5477, -28419, 16526, 2817, -96162, -36723, -8759, 2484, -19250, -32739, 14433, 28696, -57153, -100578, -45216, -50686, -52825, -49422, -48378, -43340, -25537, -17356, -68131, -46157, 48537, 41563, 60557, 83289, 2746, -25930, -85793, -162992, -89225, 6, 17670, 12308, 34156, 59917, 56904, 29652, 8246, 9000, 18802, -33190, -22511, 23640, 4970, -3010, -2927, -44528, -28978, -12635, -30210, -44457, -37897, -41756, -53493, -137359, -103764, -59285, 8234, 12992, -51108, -40078, 14694, 26742, 16257, 10633, 32232, 3429, -35890, -48568, -80368, -100010, -124165, -119687, -80987, -32678, -11378, -25788, -74100, -59002, -47293, -74099, -49650, -16999]
24476a6999k0249r008M8411q2489l9503J3617K7493N8315J8460k069K6056m213
24464A7822n3169k6424L8828L5636l2582J0466M6798J5863m5413m882M824k8084
24452b0317l4338m562l5640K1786K7774N6318O9712k5221j7381k4176l1798r880
24440b7723m0130k9538K6080N0271J1162L5650Q391j8565K337j3577n2739Q3320
24428C4939P6344M4855j5726l1391n1763k9118P414J1625J2935k0990n7218n6577
24416g4671l896M6348M0877L6969n262N588L3365m9116n6156N661m362k0691L1866
24403a3480N0768M5117p860m9546k0407J4542L0889K2963o4251k19j8331p1417
24391h1232n6797K2340N8157p206L8753N9667k2636l7147n5996k7529J1981P0235
$$ y = [-16999, -37248, -46256, 2155, -80334, -119837, -106220, -78727, -20412, -1952, -4021, 22035, 17822, -35347, -61771, -22943, 12693, -19889, -9423, 37375, 53238, 7825, 2943, 7767, -20317, -54655, -59217, -94857, -73071, -45297, 11021, 80733, 55512, 38131, 13955, -17843, -27723, -67853, -97391, -71311, -21040, -9878, 25772, 34163, 15598, 17935, 4358, -48381, 34939, 111283, 156138, 140412, 109021, 57258, 28140, 35554, 47179, 60114, 39124, -18094, -74671, -78567, -32219, 8658, 45627, 40365, 45953, 79318, 30202, -25954, -20293, -24655, -45346, -13480, 37288, 82405, 74545, 24999, 4592, 19134, 50023, 72986, 8735, 8516, -9815, -81232, -138029, -115689, -57532, -64738, -25985, 33682, 11046, -26101, -82097, -109626, -97645, -27410]
24379b7410J8554L3405J5368n7520n0678R01J6019O6776J8107j0248o6505J4213
24367b9018K8327N0705l0906o0752l0474J3510j0685K1471N1115k4130O126K9759
24355A5048k5503n8688K9231M7911M3777k6713q8519q568m2942Q972K8183O7401
24343a0410k967J7276M3740k4383K1679j9324k8248M0372n8942j6479M644J519
24331c1523q284K6557m6129j5684r809M8383O3031K265l5100o8701k4795j478
24319a01267O9869P0613L4167l900k7974N935K7725n3791j5507J715n5965n5636
24307a04016j6407J4281K4585K4041J5425K9110J6636m2521l2808L4054O5043
24296B7423P1941O992l1000k0031O7187K1744l6050m7324J2188j5795N309J8455
$$ y = [-27410, -8856, 24549, 39917, -17603, -68281, -67380, -51361, 15415, 33522, 23274, -43231, -29018, -691, 50014, 19108, -41644, -72118, -58608, -69293, -47822, 3293, -20837, -14711, 15048, -10455, -69143, -39912, 7999, 51776, 25063, -63456, -72024, -114966, -105994, -77811, -10410, -13377, 3899, 47639, 23256, 44935, 25611, -2637, 37735, -21207, -37686, -33042, -31523, -39807, -13250, -59379, -75063, -84872, -36489, 26542, 28807, -6293, -74994, -99789, -101267, -31398, 39215, 73382, 69482, 41508, 47443, 75168, 21377, 5870, 7585, -48380, -104016, -120423, -106142, -81557, -57516, -42091, -12981, 3655, -38866, -71674, -37620, 27423, 99364, 106356, 75356, 55325, 122512, 144256, 108206, 60882, 73070, 57275, 62584, 81039]
24284H1039P6122J2940p1107o4059k7813J668J01959Q5838j8550o9097n3781k5827
24272B9332l3923k6621N8753p608j601J2423M7749L0217o7828n2061K6255L4839
24260D9926L0032l4421n1669M873J641o556j3059R393L6268M1587n450k3728n435
24247C3402N1389k3170m3099r0446Q236m0134J3926J8903j1407l2685k5006R7297
24235d2794L7830k2957p5703o7K1083K4122K4803R3746L9104J24J5075J5750L6986
24222A67102l1619n8847N4129J2911m4145j0904l7859O949M9135n910l7086k8505
24210C5351m8025m1783l762L2359P8615K6956j0693r0398l3324l2344q5978L0344
24198a42682K4152L3302n9673J6141N5491O9363L1190j0472J5080K806k0360m1214
$$ y = [81039, 157161, 170101, 98994, 34935, 7122, 8790, 110749, 196587, 178037, 108940, 55159, 29332, -4591, -31212, 27541, 19933, 18332, 30755, 78504, 108721, 40893, -11168, 15087, 49926, 79958, 45537, -6132, -1259, 382, -6174, -19233, -9840, 26428, 68015, 62565, 38837, 33402, 84791, 61621, 18522, -71924, -63688, -103822, -89896, -70993, -82400, -115085, -140091, -42794, -4964, -27921, -103624, -103691, -82608, -58486, -33683, 60063, 99167, 99291, 114366, 130116, 167102, 135483, 76636, 130765, 143676, 99531, 88627, 50768, 57717, 106852, 100942, 63856, 35351, -12674, -54457, -58219, -25860, 52755, 79711, 69018, -21380, -54704, -87048, -173026, -142682, -118530, -85228, -144901, -128760, -73269, -3906, 27284, 16812, 31892, 34698, 14338, -26876]
24186b6876p741O72p63M9006k9176N604n3010l7611N4786M7076K8132L1010L0705
24173I1814n8366q7662m13J2016l3898K403k5394l3243J9586N6485J3916j082
24161d3838n180j6318L0072M2778N4489j6414J4566j9775J2538N5039j5949k1057
24149G0951k9507K4703k1999j8512j2683m3007m7748j6887M1863L4429j4624j5931
24137d8952j0653k8454p5747O1898J04931o56K4901O984J1683k7654L2743o1491
24125a0467n9055l1838M6069P778P333K0403L2949j2888j1789N5463J085r7771
24113e2728n2415N2044k7768P682L8609K3646k9261j0125J3188J7499L1005P787
24101A9163M878k9428j1679K9660j128m7274k1140J2501l878R319m81L9908N0039
$$ y = [-26876, -34617, -33945, -34708, 14298, -14878, -9274, -62284, -99895, -45109, 1967, 30099, 61109, 91814, 33448, -54214, -54627, -42611, -76509, -74106, -99500, -132743, -113157, -56672, -42756, -43838, -49018, -65336, -35264, 7514, 62003, 45589, 60155, 40380, 52918, 107957, 92008, 70951, 41444, 66147, 44148, 25636, 12953, -30054, -77802, -94689, -52826, -18397, -33021, -48952, -59605, -88059, -163806, -101908, 3023, 2367, 27268, 34252, 45935, 18281, 51024, -10467, -69522, -101360, -55291, -47513, -40180, -19777, 13172, 284, -11505, 43958, 45043, -52728, -105143, -53099, -80867, -73185, -34576, -10930, -40191, -50316, -37128, -19629, 11376, 19163, 24041, -5387, -17066, 12594, 11466, -35808, -56948, -44447, -48325, -39006, -39487, 421, 50460]
24088E0460k8387M405j3603j9476j9582J0757l0740j1503N7685O2139K7132M7029
24076A36316l3186q8431K476L1077j7423n1010k3220P7010j1523j5905j4587n1284
24064e9690l1151N6571L8518j0000j7941q133P623M0J00841J2739m378l5891k9810
24051A9338j3524J9241M7828J3752M2441J2357m4378j3598o0176o7208j2023K3469
24039c2481N0391j4582k5888K392M1889J365L2111R30J1510O324n3609l9930j649
24026b1227P1521k0140k1817o3027l9373M3712k8952J7202J5072M8868J6028O1869
24014G9736m1883k5984l1591k8057M5873L5339J0640M3021j6791P4638l8732r8849
24002G360M617Q450j2946j1185l4471l2179K692K4328m2632j3507O3978P1905
$$ y = [50460, 22073, 26478, 12875, -6601, -26183, -15426, -46166, -57669, 16, 62155, 89287, 136316, 103130, 14699, 17175, 48252, 30829, -20181, -43401, 33609, 22086, 6181, -8406, -59690, -90841, -34270, 4248, -5752, -23693, -31826, -24203, -24163, 76678, 89417, 85039, 49148, 19338, 5814, 25055, 72883, 86635, 129076, 141433, 97055, 83457, 23281, -43927, -55950, -32481, 17910, 3328, -22560, -20168, 21721, 23086, 55197, 56127, 67637, 73961, 20352, -19578, -21227, 50294, 30154, 8337, -54690, -94063, -50351, -79303, -62101, -47029, 1839, 17867, 79736, 37853, 11869, -19722, -47779, -1906, 33433, 44073, 87094, 70303, 144941, 106209, 7360, 11977, 20427, 7481, -3704, -38175, -70354, -67662, -43334, -85966, -99473, -35495, 36410]
23990C6410K9067j2108l5966o373L0839M0237j5760r845m8187l0709L360j3689
23978c2724O080M4373k9390l6284k5229J6008L995k9466k3022l321l7781P0284
23966g6477J12907j2688l3061m5M4820m1749j4104L2714J6000j0062k2362J3169
23954I062N301O045p375l4879O607L3343R238K5654L319p9073n1155L9573O6586
23941C2246J6950j236j4799K9907n8738j9828L3830R750K1518K144m558j3154
23929C4032p1712N71m3696k5164K9138L758N1209J8856p668L6582n4671m5526
23917g4291r89M6890L6714L0164l2354k0140N3973L6213k4767r3390j1833M9479
23905d331K5011k4660J6016M4215L4530n5289m8554K482M6116L0820K0206o206
$$ y = [36410, 65477, 53369, 17403, 11030, 41869, 82106, 66346, 56501, 8314, -22395, -19035, -32724, -26644, 17729, -11661, -47945, -73174, -57166, -53171, -82637, -105659, -108980, -146761, -76477, 36430, 23742, -9319, -9364, 35456, -6293, -20397, 12317, 28317, 18255, -4107, 9062, 14363, 20408, 13033, -21846, -15239, 18104, 27342, 52996, 56315, -22758, -73913, -34340, 32246, 49196, 47960, 33161, 63068, 4330, -15498, 18332, 28082, 49600, 51744, 47186, 34032, -37680, -37109, -80805, -105969, -76831, -73073, -21864, -3008, -10676, 25906, -28765, -74291, -75280, -28390, 8324, 38488, 6134, -14006, 39967, 76180, 51413, -41977, -53810, -4331, 20680, -3980, 12036, 56251, 90781, 35492, -13062, -10580, 35536, 66356, 86562, 80356]
23893H0356m2629m2355L7706j4777l728q081o9127l5661K7919N4305L7800q931
23881A2797k6392K4496J9494L1363j9626l0410l604L00K7948r439j5054J5190
23869B7063J6554o2945r3211L8881R6801L4727O682o340q315K196o931l4276j5907
23856e021j7177M764M1003K7102N3654j9163m3337j19R867K4263N0758L776m9580
23843H0790m4375k6017N784k6053k1574K7696J8027K4213J3227o9307n854M4792
23831B1349J6883k7059L296J4660L120o0067M6541M6697m9671l9040L5686L7800
23819E0195q026o6476L9141r780n7498J1903O4203k6786M6720k2370l072j1799
23807F355l4439l3592K75P582K4932k8165k3401N4633j7944j8569J2335k269p03
$$ y = [80356, 37727, -4628, 33078, 18301, 14573, 6492, -62635, -98296, -70377, -16072, 21728, 12797, -13595, 10901, 30395, 61758, 42132, 11722, 8118, 8418, 36366, 26927, 11873, 27063, 43617, -19328, -112539, -73658, 23143, 57870, 64552, 58212, 49897, 52093, 45162, 10886, -5021, -22198, -17434, 23569, 50671, 104325, 85162, 41825, 41706, 51573, 75836, 126594, 130370, 80790, 36415, 10398, 16182, -9871, -31445, -3749, 14278, 38491, 51718, -17589, -23443, 21349, 38232, 11173, 14469, 29129, 32249, -27818, 18723, 65420, 15749, -23291, 12395, 50195, 42169, -24307, 14834, 5054, -52444, -40541, 23662, -3124, 43596, 21226, 18154, 6355, -28084, -61676, -61401, -53819, -28887, -57052, -80453, -25820, -43764, -62333, -49998, -52267, -52970]
23794e2970L0602k8509j3237m17M8152K7991L836r812L8399L5033q8029k7452
23782c6413J9299J3958K6122j370M1713K2936j8546N053l7968j5249k7714l0573
23770c8752l8635O865k80P5698R123n5547J0742Q3507n1228p3631O1797Q7720
23758G7379m0607l2351j0177l3683M3807m5234L448N6793O3097k9544k3190J8963
23746D8701m0455m2656k1809K1887J8237M298j0658J8785J3005j8938j5446p657
23734c2706p354l1000N3515L2968P1122J0353q7987k100j2675k5105K9288N6411
23722E4730J6477n2373k0737L1309M310k5311l2137k0434J8399J0306J51N7931
23710D2621J8925O8832l0k6276o3526r2566r220R6707L7889M3422J7012m8247
$$ y = [-52970, -22368, -50877, -64114, -64531, -16379, 11612, 15448, 5636, 44035, 79068, -8961, -36413, -17114, -3156, 22966, 21596, 63309, 86245, 67699, 72752, 34784, 19535, -8179, -38752, -77387, -70522, -70802, 4896, 14019, -41528, -30786, 52721, 1493, -72138, -10341, 77379, 36772, 4421, -5756, -39439, 4368, -40866, -37418, 19375, 82472, 52928, 29738, 48701, 8246, -34410, -56219, -34332, -16095, -11797, -22455, -3670, 9335, -9603, -25049, -32706, -40060, -71060, -17545, 15423, 86545, 96898, 8911, 6811, -5864, -30969, -1681, 54730, 71207, 18834, -1903, 29406, 33716, 8405, -23732, -44166, -25767, -15461, -15310, 42621, 61546, 130378, 130348, 104072, 40546, -52020, -61240, 35467, 73356, 116778, 133790, 85543]
23698H5543n2123K7986m4998k1545O896M5448L0046k6888l0101M3668K7831m8174
23686D3589j0161J104l6516n8162l4796J6049K7352P6254L0934k3391J390j0945
23674B2701l8189l7660N7485J9477q0418l4948O2945R0527m6151l848j3408o1091
23662f2578J7756J0417l8982L5963K9694K8383L4798M9847j1674p6401m7689J3047
23650a7419j9106r052K4909P8715N549j14838m3028N0783R223q825M7352Lk7725
23637b3459K3275K1949K7428Q762o784l8851J850j7030J0080K4049P957j0027
23625B9199m0617m3563L8060Q1336r77J0298N929L5198L724q222l7989k7602l3837
23612A0937k5160q315M7336M6657l5964o3067K4707L007P7179l3930j7628l376
$$ y = [85543, 33420, 61406, 16408, -5137, 1759, 47207, 77253, 50365, 20264, 63932, 91763, 43589, 33428, 34532, -1984, -60146, -94942, -78893, -51541, 24713, 55647, 32256, 33646, 22701, -15488, -53148, 4337, 23814, -56604, -91552, -28607, 61920, 15769, 11921, -1487, -62578, -44822, -34405, -73387, -37424, -7730, 20653, 55451, 105298, 93624, 17223, -30466, -17419, -36525, -45577, -20668, 58047, 63596, -51242, -94270, -43487, -34264, -43089, 4263, 4266, -23459, -184, 21765, 49193, 57955, 51171, 12320, 14170, -2860, 7220, 31269, 39226, 29199, -11418, -54981, -16921, 64415, 63438, 73736, 79665, 114863, 118587, 110365, 72376, 44774, 10937, -14223, -22538, 24798, 71455, 35491, -27576, -2869, 138, 77317, 43387, 25759, 22383]
23600B2383J9963j5621n5991m7054L5350Q9595N893p4656n1252J2071L1582j5176
23588d2913J2013M2215M2849l2989j2553L7619l3259Q842K7429R418R714L5933
23576A04318L6961N658n6556j6089O706n2626p3625n1084K7439Q0369L8893j5230
23564C5134p057K1624n7675L0435P4068l2110l0004J2986j7764J0949R195J0172
23552E9953m1388j5770M8888j3299p800K1768L2008M4220o7330R218q683q7374
23540b5589l7026M7338K8603K9254k8772M362L2928J3084k035l4777l55l6242
23528i227l8171J3470j4613N8317O3342j6745n3165J4334N7099l526n6397m7385
23516c2667k059J3415K1301J649P4262J6211l5538l098O338n9073m897L6682J9008
$$ y = [22383, 42346, 26725, -29266, -76320, -40970, 48625, 54518, -20138, -71390, -59319, -27737, -42913, -30900, 11315, 54164, 21175, 8622, 46241, 12982, 21824, 49253, 58671, 68385, 104318, 141279, 146937, 90381, 74292, 80998, 28372, -45253, -96337, -68898, 11471, 50364, 35134, 28077, 49701, -7974, 22461, 96529, 64419, 34415, 47401, 29637, 40586, 49781, 59953, 18565, 2795, 51683, 38384, 30584, 52352, 84360, 128580, 61250, 70468, 61785, -25589, -62615, -15277, 13326, 42580, 13808, 18170, 51098, 64182, 62147, 27370, 27015, -9227, -47398, -33928, -48541, 9776, 73118, 56373, 3208, 17542, 74641, 71115, 14718, -32667, -34726, -21311, -10, 1639, 75901, 92112, 56574, 53476, 59814, 741, -4156, 32526, 51534]
23503E1534J8030j4529j2814P0036J6047K0549l874k3904q681K0804k9944j7729
23491H5525n710m3157k7083K3926p96L72m05L2133M74n2437j7364k1327L8271
23478A2422M1237K5307k450K2454m829j4583L3313r148k5574p155J5667o0502
23466B6159k0359o995j6079K3931n4683m3681N4911J05689J6825l0485l3577p723
23454A3933j4674J9790k0234k4718K9772K2681K3613j686P1369l7437l2209O840
23442E7040O0133J9816j6128o6179o4028L8258P708L0103k5874n5993M2988J9250
23430D7094m5054j8723R1613K4774k3196M0656j9147j00931Q578m189k258L118
23418B335L7477N1832l1594m8344q812l1250K303n1719M1218L8859K6057n2526
$$ y = [51534, 69564, 55035, 42221, 112257, 128304, 148853, 144979, 121075, 112394, 133198, 103254, 85525, 79815, 36658, 9575, 33501, 32705, 33077, 32672, 64805, 65279, 12842, -4522, -25849, 12422, 53659, 78966, 76516, 98970, 94141, 79558, 112871, 103723, 78149, 70994, 86661, 26159, 5800, -1195, -17274, 6657, -48026, -91707, -36796, 68893, 85718, 55233, 21656, 13933, -741, 19049, -1185, -25903, 3869, 26550, 50163, 48477, 119846, 82409, 50200, 57040, 117173, 136989, 120861, 54682, -9346, 28912, 36620, 66723, 40849, -15144, 27844, 47094, 2040, -16683, 74930, 99704, 76508, 117164, 98017, -2914, 5664, 1475, -783, 2335, 39812, 91644, 60050, 11706, 2894, -28356, -26053, -77772, -36554, 2305, 28362, -24164]
23406b4164m6670r624M239M308K8523J9755K3621K4360p953J0355L1167j6970
23394D0947j3673R961p003L3770O4005k8499j9971o7724j1115J9576j511m2633
23382b3870l439M4979Q032J6525l0818j8896O3272K2574k9794j2558m522r83l3346
23369b844M953n6518L6896K2492p902O412N5515j8614m2202p5810r0111N3049
23357a14684N0828J8563J4960K9139Q956J8078n2885L0342L8576L3367j2628N4833
23345A17445L7002q144m7284l0942l4821j2127L584l1615o2185M4466L1670k1712
23333a4663k193k418N253M102n4506K0809K8449k4600l1688P6219L1339J6535
23321E2638k5584J5104K1225l4310l0771K2320N348l2093k1871P254M5215M7669
$$ y = [-24164, -70834, -80458, -76219, -71911, -43388, -23633, -12, 24348, 16395, 26750, 57917, 40947, 27274, 37235, 30232, 64002, 128007, 99508, 79537, 11813, 698, 20274, 18763, -23870, -27309, 17670, 25702, 42227, 11409, -7487, 55785, 78359, 48565, 36007, 31485, 30502, -2844, 2109, -54409, -17513, 4979, -2923, 3489, 59004, 40390, -1812, -77622, -167733, -114684, -63856, -45293, -30333, -1194, 7762, 25840, -27045, 3297, 41873, 75240, 62612, 117445, 154447, 146303, 99019, 68077, 33256, 21129, 24713, -6902, -69087, -24621, 7049, -14663, -16856, -19274, -14021, -9919, -64425, -43616, -15167, -39767, -71455, 4764, 36103, 52638, 27054, 42158, 63383, 29073, -1698, 20622, 25970, -6123, -27994, -20740, 24475, 72144]
23309G2144k926J1548l8029m5963J2660k8152n1507L4329K4250J661k2091r102
23297d1178L9143L0481l5784P916P9240n0985m9704L5792j2313J483j7776j3169
23285b6854j3029M5357L5594J4877K9813J8429o5979q1047n1176l6960K9393O6679
23273c4903L7492l8095n430J1871J0772n4098j4617n9943J4836O4637J717O013
23261e9748j4349K0454K4185N2688J0591L280k9156O797M0849m284N669q532l4509
23248A3935M8812j3502l5392L6769J3219q340J2344L9025M5140k7162j9939l5298
23236F9611N021O764o96j9671J7310m2236M23O010Q0662J3964l4196K6330L504
23223A32800m2261l4378L190l1373m7201L3855k0175O2332N0888q8792l1083L6870
$$ y = [72144, 69218, 80766, 42737, -3226, 9434, -18718, -70225, -35896, -11646, -9985, -32076, -41178, -2035, 28446, -7338, 578, 79818, 28833, -20871, 14921, 2608, 4091, -13685, -26854, -39883, 5474, 41068, 55945, 85758, 104187, 38208, -42839, -94015, -130975, -101582, -34903, 2589, -35506, -40936, -29065, -18293, -72391, -87008, -146951, -132115, -67478, -65761, -59748, -74097, -53643, -29458, 23230, 33821, 37101, 7945, 14742, 55591, 51307, 56976, 48444, 13935, 62747, 49245, 13853, 50622, 63841, 55501, 67845, 106870, 152010, 124848, 104909, 69611, 74632, 81396, 80700, 61029, 78339, 36103, 36526, 42536, 123198, 137162, 102966, 129296, 132800, 90539, 56161, 59351, 27978, -19223, 14632, -5543, 56789, 107677, 18885, -12198, 24672]
23211B4672O1260L9176K2647n6592p4336n0876k6438M7279L0994n2689j1418M6839
23199E18J7762P0310R7763k2186j02226l4202J2208K6516L2150o90j0091N462
23187I3294j7143K610l4143m9542M2697J678O1763Q4595K314j8717J1808K3734
23175B04948Q6458J18706K00580K89726K83312K13096J52226p7942q5409k06128
23165A179573k77637k44048k03015j40793n529j6957o7379j10149m3279K3260
23155I4047P342l1468k3620M083J4016M453j4314r836n778K4572J0002L6021K3084
23142A32604N1069k5730p6693m832o662j5179M0055o798L9182N4601N160j519
23130A85258k7189M1150R709k559k8703m2586l2634j4597l3812k4133k5325R423
$$ y = [24672, 85932, 125108, 147755, 91163, 16827, -34049, -60487, -13208, 17786, -34903, -46321, 518, 18280, 88590, 186353, 164167, 61941, 27739, 39947, 66463, 98613, 97923, 87832, 93294, 76151, 78761, 44618, -4924, 37773, 39451, 101214, 185809, 188123, 169406, 181214, 204948, 291406, 410112, 610692, 900418, 1183730, 1396826, 1549052, 1471110, 1385701, 1179573, 901936, 657888, 454873, 314080, 308551, 291594, 224215, 114066, 70787, 94047, 101389, 69921, 46301, 50384, 64400, 68853, 54539, 44703, 38925, 63497, 73499, 109520, 132604, 183673, 157943, 81250, 76418, 69756, 54577, 94632, 87834, 127016, 181617, 186777, 185258, 158069, 199219, 208928, 206369, 177666, 135080, 102446, 87849, 54037, 29904, 4579, 14002]
23118A4002J4293K6519K8677k2631n3679O5358j2640j5278K8071M7933l3986j3909
23106G2730M7863M3335m9066K2186P2221j6944l4823j0553q7507l0003O2142R508
23094A01089m4561M5777j959m8309m7646r962L9008Q139k4410j6366m956k9962
23082c4118N0379Q8020o827m3483K061j00N7962L2270R745o0148n3317R533j4876
23069C7101N496j3416m7060q300J1532J5844M541j4168R6418L3216j9794j0477
23057I0933p3517m0453N4682L5341J2233J0994m6342j7223K8128M590l9524m0782
23045b0940J4623N0998L1168J4325n0719o5874L9675N6094K0114m9811m0736m6179
23033d7262k5405O9023L0576K4137K7043L591K1521j5745m0887p16O4524j4678
$$ y = [14002, 28295, 54814, 83491, 60860, 7181, 72539, 59899, 44621, 72692, 120625, 86639, 72730, 120593, 163928, 114862, 137048, 209269, 192325, 157502, 146949, 59442, 29439, 91581, 101089, 56528, 102305, 100346, 52037, 4391, -5571, 33437, 41576, 17166, 800, -4156, -34118, 16261, 104281, 97454, 53971, 56032, 55932, 113894, 146164, 155909, 95761, 42444, 51977, 37101, 42597, 29181, -17879, -26179, -14647, 1197, 5738, -8430, 87988, 121204, 101410, 90933, 17416, -23037, 31645, 66986, 79219, 90213, 43871, 26648, 54776, 59366, 19842, -20940, -6317, 44681, 75849, 90174, 39455, -26419, 13256, 69350, 89464, 39653, -1083, -47262, -72667, -3644, 26932, 51069, 78112, 81703, 103224, 87479, 46592, 45876, 110400, 95722]
23021I5722p445J1344j7908j9663j1899M8126m101l6659m3975L931P5726J6622
23009A09821K1501j3309n4606j0898k6O7171K4644p9229J5250L5713o4910M585
22997E5707R3689L9064r985l6066l7856M607k6070n495K5006K067n2194K5145
22985G7619L2933o9326L0320J1067N4314o1705k9070l6461k5065J4005N1366N0968
22973A00965j9708k3573L2201p989o3852l9104K7109K9358P8035N2708K0284M3355
22961B29789J636l449q46p4017l8219L1978J9076m552k6255l1444k2279Q361l891
22948H5888o3120j01738K0808R195M0640K8207j0603J5239K4626o672m595K2082
22936E9957K3862K4346k0601m8462K6557N6645q2614o4141N4023J745J0988N7138
$$ y = [95722, 88277, 99621, 81713, 62050, 50151, 98277, 94176, 57517, 13542, 17473, 93199, 109821, 131322, 118013, 63407, 52509, 52483, 119654, 144298, 65069, 80319, 116032, 51122, 55707, 149396, 188460, 178475, 142409, 104553, 109160, 83090, 77595, 102601, 104668, 52474, 77619, 110552, 41226, 71546, 82613, 136927, 75222, 46152, 9691, -15374, -1369, 49997, 100965, 81257, 57684, 89885, 81896, 18044, -21060, 6049, 35407, 113442, 166150, 186434, 229789, 231425, 227976, 227130, 153113, 114894, 146872, 165948, 161396, 135141, 103697, 81418, 89779, 85888, 22768, -78970, -58162, -48967, -8327, 19880, 9277, 24516, 49142, 42470, 37875, 59957, 83819, 108165, 87564, 39102, 65659, 122304, 39690, -24451, 29572, 31317, 42305, 99443]
22924I9443P549j3430p0922o9756j1735N4639J29643M9624m1149j0444K759l4635
22912I1586J5333l726l6693j2656R28j104l7959nK8412j7368M0282J8666k1532
22899F4164K3193J8638j3239R0410L9840p8326k9875N0816N7360j1266k4814m5547
22887A41354n574k0883J6261p820J2349K0170l5748P5388K2856j4432j3459k1194
22875A69268J0953j8143l4636L6079J4497K037l0108j1824K2902m5586l5000j9503
22863F0936K4031R643R461J2090K7280j4617l9927L3190j4454p407j4312k4948
22851F0966M1666J2488L575O731J28l9519J6957j947j4305m2703K7340J7995Q8347
22838A77719m950j391l5422R408p473j9476M6017K3427j4434J7794l1923o4115
$$ y = [99443, 106992, 93562, 22640, -47116, -58851, -4212, 125431, 175055, 133906, 123462, 126221, 91586, 106919, 103193, 66500, 53844, 54772, 53668, 15709, 15704, 44116, 26748, 67030, 85696, 64164, 87357, 105995, 92756, 183166, 223006, 144680, 114805, 165621, 222981, 211715, 186901, 141354, 135780, 114897, 131158, 123338, 135687, 155857, 120109, 195497, 218353, 203921, 190462, 169268, 180221, 162078, 127442, 163521, 178018, 180055, 149947, 138123, 161025, 115439, 80439, 60936, 84967, 94610, 104071, 116161, 143441, 128824, 88897, 122087, 107633, 100226, 85914, 60966, 102632, 115120, 118695, 125426, 125554, 86035, 102992, 101045, 86740, 44037, 71377, 89372, 177719, 172769, 171378, 135956, 145364, 137891, 118415, 164432, 187859, 173425, 191219, 159296, 95181]
22826I5181l4186P27M3786J9047N4755N0788j9283J713p735j7146l4116m546O375
22813A55360j0984j1654J3372j6282R144J8n6619P0483J7684L6397P7498N7679
22801C42096m398m9505n2659k7273j3269M2541N0503j4236l57O0214l3684k5505
22789B74468K2850l8328k5862o7905j6366o448k5920J7219J7893L4778k842j0907
22777A72630j3429j0591J4044l534j1811J3498O1642N6952J5653l6324N4298O1517
22765C74545m6702m7341p6049j0988L6902k424L123M2346j4190m2509N1575J42404
22753D10692P1839O9329J30619J01201Q3091L6113m8013j18440m3906M4355j8168
22742G18712r6770r2939q3253p2133r007l4827q533k0703m3458J249M7716O956
$$ y = [95181, 60995, 61722, 105508, 124555, 179310, 230098, 210815, 212528, 204793, 187647, 153531, 148985, 155360, 144376, 132722, 146094, 129812, 138956, 138974, 82355, 152838, 170522, 206919, 284417, 342096, 337698, 288193, 235534, 208261, 194992, 237533, 288036, 273800, 273443, 333657, 299973, 274468, 297318, 258990, 233128, 165223, 148857, 142409, 116489, 133708, 151601, 186379, 183537, 172630, 159201, 148610, 162654, 159120, 147309, 160807, 222449, 279401, 295054, 258730, 313028, 374545, 327843, 280502, 204453, 193465, 230367, 227943, 231066, 273412, 259222, 216713, 268288, 410692, 482531, 551860, 682479, 783680, 866771, 902884, 854871, 736431, 692525, 736880, 718712, 621942, 529003, 445750, 373617, 364610, 329783, 321250, 300547, 257089, 258338, 306054, 313010]
22730C13010p4273K8303m049K6118L3866R949k6532l415J9123P2459n34O670N9203
22717D59898N7533k9078J1177M3745N787m8797J4759M5186k6860k6578P085J0033
22705E23890L8767K6760p1959L6062J55136L01485K52293K85269K87350J81127
22695B016180N7553j16818j90888k79284k77802j34850q6400j28182l2760k5429
22685H01320m8703l123J7194J6031j52J7922Q3793K0544o2486N3037N1338N1325
22673I98040J07393J6420K9586M6984j9400l0473J7625M3238O5961Q6114L9103
22662A400591P3922J46266N4642K5548O1175P3782P7900M3396R3890O8558J40175
22651B259845P0587R3230J03566P1312Q1070J04995J24063J56539K49661K93958
$$ y = [313010, 238737, 267040, 262991, 289109, 322975, 332924, 306392, 302977, 322100, 394559, 394025, 400695, 459898, 517431, 488353, 499530, 543275, 549062, 500265, 515024, 560210, 533350, 506772, 513857, 523890, 562657, 589417, 517458, 553520, 708656, 1010141, 1262434, 1547703, 1835053, 2016180, 2073733, 1956915, 1766027, 1486743, 1208941, 1074091, 987691, 859509, 826749, 801320, 752617, 749494, 766688, 782719, 782567, 800489, 884282, 904826, 842340, 895377, 946715, 998040, 1105433, 1121853, 1151439, 1198423, 1179023, 1148550, 1166175, 1209413, 1275374, 1361488, 1400591, 1474513, 1620779, 1675421, 1700969, 1762144, 1835926, 1913826, 1957222, 2051112, 2119670, 2259845, 2330432, 2423662, 2527228, 2598540, 2679610, 2784605, 2908668, 3065207, 3314868, 3608826]
22641C608826L96206M44935N01904N71167P29525P22546Q95619J055519J350391
22632A0276638J972279K762616L760226N316446P891544J2543212K1937488L6726823
22624A03187272M8195718M9554925M6564089L2283852J794273k5099483m0522458
22617B15958188m9631292m8229763l7340071k4492230j4802980r169933o268366
22610B6023553m702320l667881k815262k221949j860512j556354j167032q78939
22602G153304p22077n87475n17618m99648m17168l13757k73805k61001k35504
22593C325251j40096l4120J1437K15037L86271P37644J403883K208259K611483
22584A0725049K630102K032717M80859j089193k103414k692080k646301k096208
$$ y = [3608826, 4005032, 4449967, 4951871, 5523038, 6252563, 6975109, 7870728, 8926247, 10276638, 12248917, 15011533, 18771759, 24088205, 31979749, 44522961, 66460449, 103187272, 151382990, 200937915, 247502004, 279785856, 281580129, 256480646, 215958188, 166326896, 118097133, 80757062, 56264832, 41461852, 32291919, 26023553, 21321233, 17653352, 14838090, 12616141, 10755629, 9199275, 8032243, 7153304, 6431227, 5843752, 5326134, 4826486, 4409318, 4095561, 3821756, 3560755, 3325251, 3185155, 3151035, 3162472, 3377509, 3763780, 4501424, 5905307, 8113566, 10725049, 13355151, 15387868, 15868727, 14779534, 12676120, 9984040, 7337739, 5241531]
22576E241531j426112q47306o13043m25607l43122k11072j74730j52911j19334
22567I28294m4691l1210m6701J5453J5265p2906j14633p0637n5090o3137q3654
22556C76353l7257K417o5995q41R5351J17491J22446J50832J83819K61360K27379
22545A433355J49433J18221m8075k13896k51337k43735k57148k16681p6050n0498
22535C43589m5548K0702J3382r9810j08569j0317P303K1389m2705K089J4958m047
22523A12416L681n0389n3811k66L2240J0387J5367j7938K6254M8349l8281r6355
22511h346K281N3398k2826j879O830M9232L8758J1883m5941P801K116o6293m3105
22498a6091L774q2801q2536o9026k8957k6567O025M9170Q6348N1127K7389J1553
$$ y = [5241531, 3815419, 2968113, 2355070, 1929463, 1586341, 1375269, 1200539, 1047628, 928294, 883603, 852393, 805692, 821145, 836410, 763504, 648871, 578234, 523144, 460007, 376353, 339096, 341513, 275518, 274677, 370028, 487519, 609965, 760797, 944616, 1205976, 1433355, 1582788, 1701009, 1652934, 1439038, 1187701, 943966, 686818, 470137, 394087, 343589, 298041, 318743, 332125, 232315, 123746, 113429, 120732, 142121, 99416, 101505, 116463, 112416, 116097, 65708, 11897, 11631, 43871, 54258, 69625, 51687, 77941, 126290, 88009, -8346, -6065, 47333, 24507, 22628, 29458, 78690, 117448, 129331, 83390, 91191, 93307, 27014, -16091, -12317, -95118, -177654, -246680, -275637, -302204, -296179, -247009, -160661, -109534, -82145, -70592]
22486g0592L7110P0884p98O830p9401j7071O243j5630J5872k0738k6895k4860
22474a19046O7314J1865M7283j6412L5102J7412R37k4208k1002J1535M932j4907
22462H05n9799k1271o8527k6078L3341P637M3678L4183j4756l4280P949k4417
22450a21535k0731N2435Q2924L3722p9979m4619J5642J1295N066l9637l9794n063
22438a50274K7902K3621K1349J8004M3827J20499k241k8001N812r875p9446r5462
22426a04285m2954N5227L1444l0763M1246M759j2310l7214l6194n0584Q880N0081
22414a22667P1892j8352k9649K6580Q9323M8487l370n036l2086j7957j5617k6658
22402c5110k5208j442K9740M2381R563K9790J350K7157J5866K6065J7567p0501
$$ y = [-70592, -33482, 37402, 36604, 43434, -35967, -53038, -46795, -62425, -46553, -67291, -94186, -119046, -51732, -39867, 7416, -8996, 26106, 43518, 44455, 20247, -755, 10780, 15712, 805, -58994, -80265, -148792, -174870, -141529, -133892, -90214, -56031, -70787, -105067, -97118, -121535, -142266, -89831, -6907, 26815, -53164, -97783, -82141, -70846, -65780, -105417, -145211, -150274, -122372, -98751, -77402, -59398, -15571, 104928, 102687, 74686, 80498, 70623, -8823, -104285, -147239, -92012, -60568, -91331, -50085, -45326, -57636, -94850, -131044, -181628, -172748, -122667, -50775, -69127, -98776, -72196, 17127, 65614, 62244, 57208, 25122, 7165, -8452, -35110, -60318, -61760, -32020, 10361, 19924, 49714, 51064, 78221, 94087, 120152, 137719, 67218]
22390F7218r0888k9290K3581J0281j3749N4607k3734k1350M8893j9548m5896K5656
22378a4219p528m3834k8672m136O2575K5385j395j3110L3013j0391n351N3556
22366D5893n597l2492j3397J0645n4827Q588m002M5291N9258o461n9087k9901
22354c6089J74L2711J155M3108J2583l6018K3194p629r338M215K2251J4312j0260
22341E4369M802m0588J9724M5952j729k8396l0677j5469m2394k9923n9805p331
22329a31465n104j9373J9487N1142p996K5366O7211M955k6810k921J0207m7524
22317f2825L9719O4497m3956K1604l4328j547K8757J4110K2957k0209l5060M7135
22305D0854K1994j4931p613k4236o7592J6145R7908N1434o1241p860K6774o606
$$ y = [67218, -23670, -52960, -29379, -19098, -32847, 21760, -1974, -23324, 25569, 6021, -39875, -14219, -21747, -65581, -94253, -98389, -35814, -10429, -11824, -24934, 8079, -2312, -7663, 45893, 40296, 7804, -5593, 5052, -49775, -41187, -45189, 102, 59360, 52899, -6188, -36089, -35915, -3204, -2049, 41059, 53642, 17624, 40818, 33189, 23851, 28066, 50317, 64629, 54369, 59171, 18583, 38307, 84259, 82530, 54134, 23457, 7988, -34406, -64329, -124134, -131465, -136569, -155942, -136455, -85313, -93309, -67943, -732, 4223, -22587, -25508, -15301, -62825, -23106, 41391, -2565, 19039, -15289, -16836, 11921, 26031, 48988, 28779, -6281, 40854, 62848, 47917, 40304, 16068, -51524, -35379, 62529, 113963, 52722, 44862, 71636, 65030]
22293F5030o1601M7276J4735n5223k543M147k2164K920P4916l7524m6198p679
22281b3908J1363o128p360L9642k9169r04j8352o3105P096J4252L364Q9831L820
22268B0442q6623l0420O8631J5540l0759j7166m5127J4041k145Q1279N4934J6038
22256E8665n4266p1276M4712K2739Q802k8903j7797j5502M23j352J9972k8677
22244f2460K572K3586M7670J0025J3053q302L2432j3461l2227o214M4687N6995
22232A08356j6626n1259J0477o2041q5809K6611M9201K2552n7847n2256L8245
22221g0396K8972J7392M7350j1665k7940J6155j7589m8855L1385K0060l671l5471
22209e4273J2531N5753p8862k3633N4231K5825K4591J2274K0569l2941p5056O145
$$ y = [65030, 3429, 50705, 65440, 10217, 7674, 11821, -10343, -7423, 67493, 29969, -16229, -23908, -12545, -18673, -26033, 13609, -15560, -16464, -34816, -97921, -90825, -76573, -73209, 16622, 20442, -66181, -96601, -27970, -12430, -43189, -60355, -105482, -91441, -93586, -12307, 42627, 58665, 4399, -66877, -22165, 574, 9376, -19527, -37324, -52826, -52403, -53755, -33783, -62460, -59888, -36302, 11368, 21393, 34446, 26144, 58576, 45115, 12888, 6674, 51361, 108356, 91730, 40471, 50948, -11093, -96902, -70291, -21090, 1462, -56385, -108641, -70396, -41424, -24032, 23318, 11653, -16287, -132, -17721, -66576, -35191, -15131, -18802, -54273, -41742, 14011, -64851, -88484, -34253, -8428, 16163, 28437, 49006, 16065, -58991, -52846]
22197e2846K824Q500J2392k3233j5950M7574K9537k2738j7521n6259m1425K3270
22185a05875M9464K277j8298K2751K2807l9393K546L5355K9377j2230j0786p7504
22173i9509J3874N8427l384m2995R737l3037l2435K6550M8104K578R357N027j5954
22160e3660O1674M7120K1046o0521j1829k589j2857K2468l3691k7453K3560l2671
22148e9403k8355J5694j8071O8774K2637J2714m7430m2837j6781J2916Q050L9186
22136c2906O0324k1271J7288K8748l0854j0714l8458Q210j6501M9079K4166L3230
22124G0341j4689j2591p418J2315l2845k8517J7439M8701k9325n3142K920j1087
22112c7898J6131M7226j4252l8018M1905M3524k8900p4318N69Q3467K6709n631
$$ y = [-52846, -50022, -41522, -29130, -52363, -68313, -20739, 8798, -13940, -31461, -87720, -129145, -105875, -56411, -54134, -72432, -49681, -26874, -66267, -63721, -28366, 1011, -11219, -22005, -99509, -85635, -27208, -30592, -73587, -63850, -96887, -129322, -102772, -54668, -52090, -42733, -37706, -53660, 8014, 55134, 76180, 15659, 3830, 1241, -11616, 10852, -22839, -50292, -26732, -59403, -87758, -72064, -90135, -21361, 1276, 13990, -33440, -76277, -93058, -80142, -72092, -32906, 27418, 6147, 23435, 52183, 21329, 10615, -27843, -19633, -36134, 12945, 37111, 70341, 55652, 43061, 35643, 47958, 15113, -13404, 4035, 52736, 23411, -29731, -26811, -37898, -21767, 25459, 11207, -26811, 15094, 58618, 29718, -44600, -44031, 39436, 66145, 60514]
22100F0514Q0472j5688l0049N271l4883K542k1759j8637M0998L9185k9681p31
22088G7554n8359K1514n413l1748r939M0586K3063J8113J5447K470J1300K4821
22076A29409Q285P0763J09432K8186R5404J32817L70468O00916M81653K38800
22066B266133l9274j22251q6569j14472j43475k19497k65964k81339j98995j61093
22056F33204j82921q8374j00412q0881J0165j453k3257l0517m6946j3777m424
22045G0407m6025P633K1716r697M1193m341j5681M3256l069k455o92K8601L5031
22032A65877p143j3416K0193o062j705l0124N3583P4421J72551J11241K10521
22021G49937L78383M06266J73696j88797m26158l21563k49472j84891p9320q0579
$$ y = [60514, 140986, 125298, 95249, 100520, 65637, 68179, 46420, 27783, 68781, 107966, 78285, 77554, 19195, 40709, 35296, 3548, -6391, 34195, 57258, 75371, 90818, 93288, 104588, 129409, 137694, 208457, 317889, 346075, 441479, 574296, 944764, 1545680, 2027333, 2266133, 2226859, 2104608, 2018039, 1903567, 1760092, 1540595, 1274631, 993292, 794297, 633204, 450283, 361909, 261497, 180616, 190781, 189328, 166071, 135554, 88608, 74831, 70407, 24382, 32015, 53731, 44034, 85227, 80886, 65205, 108461, 105392, 102937, 102245, 130846, 165877, 158734, 145318, 165511, 159449, 157744, 127620, 181203, 255624, 428175, 539416, 749937, 1128320, 1534586, 1708282, 1519485, 1093327, 771764, 522292, 337401, 258081, 177502]
22011A77502m6650J1471k5440k5057j0686K3560k7938m7075k1158J8798K2874
22000E0201l0507o0344l3991o387l5603p616N5330J00516J0654m2698n0489Q085
21988d2849j0845L7676M0083j118m377L6281N3261J9176j1040p2602p935K2757
21976E8468l4235m5451m1859l9187J8204M9292K2238m5487O121M2478L6474J3343
21964D0399l5486p9925j0973K9535L6932K4574N840J30q147J4151l4703m7744
21952f5417P337L9095r662L9619N1849o444j4898K3818j4541j4847J072n75j3831
21939B2575l45j635K2896o933o8593J3553K8634L0371L2848M0997k1121j0402
21927H2845l4384k0337j2275N388l6804J3573L7472j254K1804j3283l25j5822
$$ y = [177502, 130852, 142323, 116883, 91826, 81140, 104700, 76762, 29687, 8529, 27327, 50201, 19694, -40650, -74641, -81028, -116631, -124247, -68917, 31599, 42253, -445, -50934, -42849, -53694, -16018, 24065, 22947, 18570, 54851, 108112, 127288, 116248, 43646, 35711, 58468, 24233, -21218, -63077, -102264, -84060, -34768, -12530, -58017, -51896, -9418, 27056, 40399, 4913, -75012, -85985, -56450, -19518, 5056, 10896, 11026, 2879, 17030, -17673, -65417, -58080, -18985, -28647, 10972, 62821, 56377, 41479, 65297, 50756, 35909, 36981, 36406, 22575, 22230, 20595, 43491, 36558, -32035, -18482, 10152, 40523, 73371, 114368, 93247, 82845, 48461, 28124, 15849, 21237, -15567, -1994, 35478, 34224, 56028, 42745, 42420, 26598]
21915B6598R883K7152L6385n3748k7132r922j702J7679m3811J1982k1742J5670
21903a2708K4641K3104K0096K3925p8112L320L4977K1773m8484o6956O3368N2199
21891F1143m1505N0189L078p941l1679p4392K8237M389k6571K8508J4359J2026
21879A9841J7884J4694n738P669k7192K2815l680n9772P656P3381k8096n2832
21867a3370n2872M7943N6558K0851r9317j0346K9866L5387J8024N8368l0437l3918
21855B6737n0112n608N513J0171K0039J6006o156J34l1875K7501o247n1989J0667
21842c5219O332K9058L9853J3130O499m623K1463J4649n1661m0933l8028N1449
21830A1969J6163j2823K5131J3250m1428k7888J4810N994j9333k4449n987L0087
$$ y = [26598, 36481, 63633, 100018, 46270, 19138, 9216, 7514, 25193, -18618, -6636, -28378, -12708, 11933, 35037, 55133, 79058, 946, 4266, 39243, 61016, 12532, -54424, 8944, 61143, 19638, 69827, 72905, 64964, 33285, -41107, -12870, -8481, -35052, -6544, 7815, 19841, 37725, 52419, 46681, 54350, 27158, 49973, 46293, -13479, -5823, 67558, 39462, -13370, -66242, -18299, 38259, 59110, -40207, -50553, -20687, 14700, 32724, 91092, 60655, 26737, -23375, -28983, -23470, -13299, 6740, 22746, 16590, 16724, -15151, 12350, 6103, -45886, -35219, -28887, 171, 40024, 53154, 59653, 55030, 76493, 91142, 39481, -1452, -39480, 11969, 28132, 15309, 40440, 53690, 12262, -15626, -816, 5178, -14155, -38604, -44591, -14504]
21818a4504L5973K3735n1552j2020M5031J5101k1918L0623m0025K376l272k2177
21806a2629L748k5204N664K9555o44k1457J5848N8604L3499L3202N390n4686J2215
21793H3105n984k6459K6711L1152J9413l1369j1751J2344J6262R192k4880M2274
21781A40010N238j9640j7139l187j2705j2086O701j4933p9014n8804N1515j238
21769a5282K2671K2337N4735M5202o2620l9526k8193m5367k2873J4236N8208m801
21757a273k5270J773k148Q206J1760j3261L0175k058k5853n4276O3769J6069p2276
21744f4663N681O1832J9287j5598M9625J4794m9764m968K0270r042j5313M8076
21732F0217Q8623o0416q8344m1481K7978R993p903M3139K7316Q211R066j8475
$$ y = [-14504, 21469, 45204, -6348, -18368, 26663, 41764, 19846, 50469, 10444, 12820, 9548, -12629, -8881, -34085, -28421, 1134, 490, -20967, -5119, 53485, 86984, 120186, 125576, 70890, 83105, 77121, 50662, 77373, 108525, 127938, 96569, 84818, 97162, 113424, 122616, 97736, 140010, 145248, 125608, 108469, 105282, 92577, 80491, 87192, 72259, -6755, -65559, -14044, -15282, 7389, 29726, 84461, 129663, 67043, 27517, -676, -46043, -68916, -54680, 3528, -1273, -26543, -24770, -26918, -18712, -6952, -20213, 9962, 7904, -17949, -72225, -8456, 7613, -64663, -58982, 2850, 22137, 6539, 56164, 70958, 21194, 16226, 36496, 27454, 12141, 60217, 148840, 88424, 80, -41401, -13423, -3430, -11333, 31806, 59122, 67333, 76399, 57924]
21720E7924n0206l6259K2991M8560l3339L1045K3708J0008J1635j7964o2679m9766
21708d4342j8627L1568J2693k7396N0170O4485J9503j9525M1371m6267n8982J3972
21696A8623L4125n0516L069J4368l3982k3978M2858K6403j1996O019k938l4295
21684a2240K2509M1271j4030J743O0434m3010j1209o8405n6728K7340K6736j4999
21672d0588N8414L7393M028k2121k7233j2272j2836J1455J6422j9454j9977O0818
21660C4049M512k560L835m2744K9906M5227j484r7158r054L6795L9168J2920j0072
21647D3340k7483L549M8079K70K8357O961n3701m376j3080K0425n4062Q009L1617
21634C7905m4599J5505J6498M7895O63J58J9509M9598l418j08497p3176R192L2553
$$ y = [57924, 7718, -28541, -5550, 43010, 9671, 40716, 64424, 74432, 86067, 68103, 5424, -44342, -62969, -31401, -18708, -46104, 4066, 68551, 88054, 68529, 109900, 63633, 4651, 18623, 52748, 2232, 5301, 19669, -14313, -38291, 4567, 30970, 18974, 24993, 22055, -12240, 10269, 51540, 37510, 39253, 99687, 56677, 45468, -22937, -79665, -52325, -25589, -40588, 17826, 55219, 59247, 37126, 9893, -2379, -15215, -3760, 12662, -6792, -26769, 34049, 38561, 36001, 39836, -2908, 26998, 72225, 70741, -26417, -35471, 1324, 40492, 53412, 43340, 15857, 19406, 67485, 67755, 96112, 103073, 49372, 44996, 31916, 52341, -1721, 6288, 37905, -6694, 8811, 25309, 73204, 73867, 74025, 93534, 143132, 139714, 31217, -41959, -32767, -214]
21621b14L4459j3615m1774k4309j1245j9808l15L8080K2758j0295L391K0768Q586
21608F467M382N2757Q5574l4116j4323K1893n5209p078M8186K4238j319n1826
21596G9626M041L517j9550J8838K4601n1817l0968M221k0307o3169L1045P3167
21584E3245Q492j3967O415j808k5315l3592J8691L0815M6153o1064k9038M0050
21572C9077L5836p5791k8859j5152K883M1827J5217j1266N8122J8097L9544m042
21560A15493l6088o1262j199J4292N998k8759J0381M5194J2710j6160r262K5003
21548G6341o2296O635l7759l3531K1258M5190L6696m3152m4721J76l1693J7636
21536d9220J23932J2934m6453l5703J3897L6417J4289M502l4299k9002r963r344
$$ y = [-214, 34245, 20630, -21144, -45453, -56698, -76506, -76821, -38741, -15983, -26278, -22887, -2119, 6467, 10849, 63606, 149180, 115064, 100741, 122634, 67425, 60347, 108533, 132771, 131452, 79626, 83667, 87184, 67634, 86472, 111073, 59256, 28288, 32509, 12202, -50967, -19922, 53245, 61737, 47770, 54185, 52377, 27062, -6530, 12161, 42976, 89129, 28065, -973, 39077, 74913, -878, -29737, -44889, -42006, -179, 15038, 3772, 61894, 79991, 119535, 115493, 79405, 18143, 16944, 31236, 37234, 8475, 18856, 64050, 76760, 60600, 51338, 76341, 14045, 20680, -17079, -50610, -29352, 15838, 52534, 9382, -35339, -35163, -66856, -49220, 74712, 87646, 41193, 5490, 19387, 55804, 70093, 74595, 40296, 11294, 1331, -8013]
21524h013l4251k4008K2831R5695R1473O870m0631k722m9527j848L0640k3017
21512F3492p1807l2811J4499M0664K6185j0733m5050J6340j6257N2880M0496K475
21500H0373q928J2556j9480j4089j4606l4693m9485k384R3948R175J9852L2763
21488A05002K8544k2704n7926J1488M5991l4753n91p185p458k9527K935L912N601
21475D3329n4713m743J7137n6225j4551K3192O238L260Q1329K7876l7805j7290
21463A7034K0780m1947L2308Q3071n9221n3335j1209j3787n422l4402J7991N1525
21451C386q223l3751L0071L6273l0490N771L6855O6138k2393l9897m439j5501
21439B3800L8245J8398J3274L0017J0118m80Q930m982j6808m4227m1576m9074
$$ y = [-8013, -42264, -66272, -43441, 52254, 143727, 150597, 109966, 107244, 57717, 55869, 86509, 63492, -8315, -41126, -26627, 14037, 40222, 29489, -15561, 779, -15478, 37402, 77898, 80373, 71445, 84001, 64521, 50432, 35826, 1133, -48352, -50736, 43212, 52387, 72239, 105002, 133546, 110842, 52916, 64404, 110395, 75642, 75051, 67866, 60408, 30881, 33816, 37728, 43329, -11384, -16127, 1010, -55215, -69766, -46574, -40336, -37076, 44253, 72129, 34324, 17034, 37814, -4133, 28175, 111246, 52025, -1310, -12519, -26306, -31728, -66130, -48139, 3386, -4837, -38588, -8517, 27756, -2734, 3037, 39892, 106030, 83637, 43740, 39301, 23800, 62045, 80443, 93717, 123734, 133852, 133372, 142302, 137320, 120512, 76285, 34709, -14365]
21427a4365K3486M8166M027R248J1778l1089j6811J9630J868m5022m7322L4444
21415a962L8444j544m0594J6957K7628J4327k1297J6557q049M0310J1076l5414
21403E6439K6445K9041N1457m3417n3867k4445O9884K640k0569j4801k4720k9688
21391B4399p905L7802M0641N2854k8717l1648o2327l3734J2014J2428J1289M2156
21379F9252M6378k3950l9916j884Q431M790J1398L536n0537j4574J8392O792k1217
21366A6891j4174N1286l5370m7541O3203R610p336L3374K8106m5519k89N4518
21354A06759p3714l9092M3813L7014j0693l0915p0681k7921L0540O5929P559J0255
21342D8853n8656q951J0093r927o091j7865K0445R528K6782K4484L6919n936r279
$$ y = [-14365, 9121, 57287, 61314, 70562, 82340, 51251, 34440, 54070, 55938, 10916, -36406, -1962, 36482, 34938, -5656, 11301, 38929, 53256, 31959, 48516, 40467, 80777, 91853, 56439, 82884, 111925, 163382, 119965, 66098, 41653, 111537, 114177, 93608, 78807, 54087, 24399, 16494, 54296, 94937, 147791, 119074, 87426, 25099, -8635, 3379, 15807, 27096, 69252, 115630, 91680, 51764, 49880, 58311, 63101, 74499, 78035, 27498, 12924, 31316, 38108, 16891, 2717, 54003, 18633, -28908, 34295, 43905, 36569, 69943, 98049, 52530, 52241, 106759, 33045, -6047, 37766, 74780, 64087, 33172, -37509, -65430, -34890, 31039, 38598, 48853, -9803, -18754, -8661, -18588, -24679, -42544, -22099, -12571, 14211, 38695, 75614, 69678, 60399]
21329F0399j7343Q131J3710L959J6701o0646l2202K2581K6603K2394J702j283
21317F4706m8334L5239K0409L9774m7264K479N2099N2053m3169Q156n957l7075
21305I3116K2478M0491o2785n7797N9479q13Q0R913J8636J8934q720o535L395
21292A29872M6190P5431j333n6987o3416j2845j5408M6691K4421L428N2076j142
21280B26978l6876N475L0946k5171p9538M325j9125j0644k037p803J2189L3845
21268A32564k9200m7962L3488J2828k920R268k921K3498L2039l7631o0053L0035
21256I3033M5459o2549o360l554J327Q0304N2119K2419m7333J565N0011J5261
21244B41702j9983n288R8554R1566R4411K26304K15575L2519j46885k02823j66937
$$ y = [60399, 43056, 51187, 64897, 68856, 85557, 24911, -7291, 15290, 41893, 64287, 65989, 64706, 16372, 51611, 72020, 111794, 64530, 67009, 119108, 171161, 127992, 136148, 130191, 93116, 115594, 156085, 93300, 35503, 94982, 94169, 94249, 104162, 122798, 141732, 133012, 126477, 129872, 176062, 251493, 250160, 193173, 129757, 116912, 101504, 148195, 172616, 176044, 228120, 226978, 190102, 195577, 226523, 201352, 121814, 126139, 107014, 96370, 94333, 86530, 98719, 132564, 103364, 55402, 88890, 101718, 98798, 108066, 105145, 128643, 160682, 123051, 62998, 93033, 138492, 75943, 69583, 66029, 67356, 147660, 199779, 222198, 174865, 176430, 226441, 241702, 221719, 216431, 314985, 406551, 500962, 727266, 942841, 975360, 828475, 625652, 458715]
21233D58715r2914l1224l2805K131j1022O2065J09891L1883J6550N7732J87281
21222G58283K36094J53166q3565k78731k17326j19769j58324o1948j3175L6071
21212B50776P6563L3434P3124J30748K04885K09924L1518j38769j70077j06778
21202E95348j71849l5796k3366o6745m0025k4431O216J34984J64066J55184J24796
21191H18382J28219M7121j16081k08336j92460j32338j9520q060l0684J6800o8643
21180B34400l3027K0375K6841J0582l696r499q0675L4043l0112Q191j9874N897
21168A63446O739m538o792K9876K6585m5179k2215N459p206N072k3582J1124o837
21155A31952n6720J831J9237J5207k2592l0679M1129K0486J1829K1070K246O813
$$ y = [458715, 365801, 334577, 301772, 303903, 292881, 354946, 464837, 496720, 513270, 571002, 758283, 994377, 1147543, 1063978, 785247, 567921, 448152, 289828, 227880, 214705, 250776, 327339, 360773, 433897, 564645, 769530, 979454, 1010972, 872203, 702126, 595348, 423499, 387703, 364337, 297592, 257567, 233136, 239352, 374336, 538402, 693586, 818382, 946601, 993722, 877641, 669305, 476845, 344507, 324987, 316927, 286243, 303043, 234400, 201373, 221748, 248589, 259171, 255475, 245976, 165301, 199344, 169232, 177423, 157549, 163446, 170185, 165647, 158855, 188731, 215316, 170137, 147922, 153381, 146175, 151247, 127665, 138789, 131952, 75232, 77063, 96300, 111507, 88915, 58236, 99365, 119851, 131680, 152750, 154996, 161809]
21143A61809K7387j7218o9190Q104J7529j4851J4939p542m8279k7375K2025K2256
21131H9594L3468m8055k4308l60L341K5906m7132p9378r137K6740O8103N3982
21119I2764J402o3218L47L9993Q1793K5800m4080L2295n76l29j4545k8277p5285
21106D8084p511L6618K4738K1243J154P582j8989l6697p4629l178J01375j8252
21094H1538j5937N158k607l2449N2158L4817J345O0133o1501m0001j3420K2435
21082I1669L6758J4415k3784j7833j9876J5896M580j5045O7946M0430k1559p899
21070A65698n713L5122j4817n0236k6678J3771R0380K8910n4284l1656n7895N6083
21058A48685O5064m5533l3481J279L6570J0419j2335j6858J4108N9716k6693o3684
$$ y = [161809, 189196, 171978, 102788, 110892, 128421, 113570, 128509, 120967, 72688, 45313, 67338, 89594, 123062, 75007, 50699, 50339, 53680, 79586, 32454, -46924, -56061, -29321, 38782, 92764, 94166, 30948, 31295, 71288, 153081, 178881, 134801, 167096, 166520, 166191, 151646, 123369, 48084, 40573, 77191, 101929, 123172, 124326, 131908, 112919, 76222, 1593, -1585, 99790, 81538, 65601, 70759, 68152, 35703, 87861, 122678, 124023, 184156, 122655, 82654, 69234, 91669, 128427, 142842, 119058, 101225, 81349, 97245, 101825, 86780, 154726, 195156, 173597, 165698, 159985, 195107, 180290, 130054, 103376, 117147, 207527, 236437, 182153, 150497, 92602, 148685, 213749, 168216, 134735, 136014, 172584, 183003, 170668, 153810, 167918, 227634, 200941, 137257]
21046A37257J2390O4212K3598j9208K4290J1323p7450j03271m7441L8294J2539
21035G6533J5051k3744K3376J7748O8283M3777l996j792k9172m7184J8956P078
21023A64914Q051K5549M666l9883l3767l6538k6026M3178O38n279j9222R718M9977
21010A45976J5868n2101n3923l2675J9186O0000N9544K9045l1529j8162N0583
20999A91812n0639L539O1630K4179P7629J400j7151J4085j5848L803q104o0481
20987B25854j9213K5169l0234k512k1529J1470r847m4747J3701R534R0575j9556
20975B28665l8793q657K6272O6708J8056l0889k6823o8809k2096k3937k950l5042
20963H1705N9064J03326L7682j39n254k6075k7592k6047n3627m5829L5263J5922
$$ y = [137257, 149647, 213859, 237457, 218249, 242539, 253862, 176412, 73141, 25700, 63994, 76533, 91584, 67840, 91216, 108964, 177247, 221024, 217028, 215236, 186064, 138880, 157836, 164914, 172965, 198514, 203180, 163297, 129530, 92992, 66966, 110144, 110782, 105503, 86281, 95999, 145976, 161844, 109743, 55820, 23145, 42331, 102331, 161875, 190920, 159391, 141229, 191812, 141173, 144712, 206342, 230521, 308150, 309550, 292399, 306484, 290636, 294439, 286335, 225854, 206641, 231810, 201576, 199064, 177535, 189005, 179158, 134411, 148112, 157646, 248221, 228665, 189872, 181215, 207487, 274195, 292251, 261362, 234539, 165730, 143634, 119697, 116747, 81705, 140769, 244095, 281777, 281638, 276384, 250309, 222717, 196670, 143043, 97214, 132477, 148399]
20951A48399M9670O349j5911M1058N596K0232J1399M4545k1142o8515l3810K3755
20939B11625m2840L2388O6829k2449n751j4109J1200n3794j6501j1650Q3135J6529
20927B54612m6533K4569l1611l1695o421L2347J1463N892P4186L4051k3565j5159
20915B82136m4073M0853J753M213M8673P206j1705m637n615l0847m5054J6104
20903B59007K435L6732K2552k0449k2708m6423o7484J2807N4071J0698N2077M1043
20891C34358n1938j602P7319Q865N9884p185N1729l5147r2495j1877L4511L574
20879C69996k3876J3277l4187j6413j3857m7724k1227J7800L5119J5600R209J0719
20867C14436m4511l4569L7459N1716l254k3631k4202M2118N2943k557j704Q1694
$$ y = [148399, 198069, 204418, 188507, 229565, 235161, 255393, 266792, 311337, 290195, 221680, 187870, 211625, 168785, 201173, 268002, 245553, 239802, 225693, 236893, 183099, 166598, 154948, 238083, 254612, 208079, 232648, 201037, 169342, 162921, 195268, 206731, 212623, 286809, 320860, 297295, 282136, 238063, 278916, 280669, 284882, 333555, 340761, 329056, 324419, 318804, 287957, 242903, 259007, 261442, 298174, 320726, 300277, 277569, 231146, 163662, 176469, 230540, 241238, 293315, 334358, 282420, 280818, 358137, 367002, 426886, 419701, 471430, 436283, 343788, 331911, 366422, 369996, 346120, 359397, 325210, 308797, 294940, 247216, 225989, 243789, 278908, 294508, 303717, 314436, 269925, 235356, 272815, 324531, 321277, 297646, 273444, 315562, 368505, 365948, 364244, 445938]
20855D45938q9495p9569p0071m3316O7342L0236k6286K4123O871O0885M0453O1197
20843D28308M620N1533J9408Q236n7668j6842q0165n5361J8420Q812O1324L7267
20831D27892J5793R166L5791J8804L1385K776L4106n057J671N3567J49312P9838
20819H55044M2435L0905q4928r7779j1322j2884L9942J3907R5309J17741K9195
20808A017565M8187n985l5741l7065J0653j0722J8938p4661q1554j23215l7588
20797F88812j0416k6334J4417j265j3649o491j0904M550P7216J34214J50723Q2946
20785A083819j1962k6413p1822n9942J7527j5353n7790q2902p220M2617J2329
20774H22888l7050l6079J571Q371M6298J05369J29517J03561R3934J23139Q7348
$$ y = [445938, 356443, 276874, 206803, 163487, 230829, 261065, 234779, 258902, 265773, 326658, 367111, 428308, 432928, 484461, 503869, 512105, 454437, 437595, 357430, 302069, 320489, 329301, 390625, 427892, 443685, 452851, 488642, 507446, 538831, 541607, 575713, 570656, 572327, 625894, 775206, 855044, 897479, 928384, 843456, 745677, 734355, 721471, 761413, 775320, 870629, 988370, 1017565, 1065752, 1059767, 1024026, 986961, 997614, 986892, 1005830, 931169, 849615, 726400, 688812, 678396, 652062, 666479, 665214, 651565, 645074, 634170, 638720, 715936, 850150, 1000873, 1083819, 1071857, 1045444, 973622, 913680, 931207, 915854, 858064, 775162, 767942, 810559, 822888, 785838, 749759, 751330, 759701, 805999, 911368, 1040885, 1144446, 1238380, 1361519, 1448867]
20763A448867O8428L1204p3433l6346K0838K9227J58680J10561J52154J0881j66216
20752A754845j26608l2234o0180j55736j03295o2889m7858j12858p9710n8526
20742I14951q0976q910L6008L3226K3386O125O358o982k7954K0594k4005q002
20730H83819n757P3998N4299j0927M6499N2214L0748J26546K6867J3530N4043
20719A345879R213k6090K6632L1973J6488K8450O7611M4421P5757O7144N5924
20708A743402N8520K3633J18945Q9657P4421R5110J28085R9050J13618K0485N6499
20697B621425J49337J93553J69620K46579L56021O40722O18445J85963j60654
20688E021011j98724O3748L57347M40894M73570M46109L78085K79708O5040p5814
$$ y = [1448867, 1517295, 1548499, 1475066, 1438720, 1459558, 1488785, 1647465, 1758026, 1910180, 1921061, 1754845, 1628237, 1596003, 1535823, 1380087, 1276792, 1213903, 1166045, 1053187, 973477, 914951, 833975, 825065, 861073, 894299, 917685, 923810, 930168, 923186, 895232, 915826, 891821, 883819, 878062, 952060, 1006359, 995432, 1041931, 1094145, 1124893, 1251439, 1278306, 1291836, 1345879, 1355092, 1329002, 1355634, 1387607, 1404095, 1432545, 1500156, 1544577, 1620334, 1687478, 1743402, 1801922, 1825555, 1944500, 2034157, 2108578, 2203688, 2331773, 2430823, 2544441, 2564926, 2621425, 2770762, 2964315, 3133935, 3380514, 3736535, 4377257, 4995702, 5181665, 5021011, 4822287, 4886035, 5243382, 5684276, 6157846, 6603955, 6982040, 7261748, 7326788, 7250974]
20678G250974K0613K03923N01610O64888P74579Q45215R84049J270108J530872
20669A4046831K041536K839269L735186M917503O756757R848002J5156470K4736824
20661H4078378M2060199P0235845R1177610N1496912k9313370p3942004p2793117
20654A63000453n0751396l0809053j8830877j2088399q132052o084451m754312
20647C1549913l669809k761136k102759j505888r26363n41173j19718M18836J005526
20638B1347429J686037K679987L847783N430206P802494J1296474J6975960K7884030
20630I8950400M8544726P9388852Q9660785L0437094m8135911p9850664p0338452
20623A48656830m6765896k8465231j7723610j1398183p521646n137014l660758
$$ y = [7250974, 7271587, 7475510, 7977120, 8642008, 9416587, 10261802, 11245851, 12515959, 14046831, 16088367, 18927636, 22662822, 27580325, 34337082, 44185084, 59341554, 84078378, 126138577, 196374422, 287552032, 339048944, 309735574, 235793570, 163000453, 112249057, 81440004, 62609127, 50520728, 42388676, 36304225, 31549913, 27880104, 25118968, 23016209, 21510321, 20583958, 20042785, 19923067, 20341903, 21347429, 23033466, 25713453, 29561236, 34991442, 42793936, 54090410, 71066370, 98950400, 147495126, 226883978, 316544763, 346981857, 298845946, 218995282, 148656830, 101890934, 73425703, 55702093, 44303910, 36782264, 31645250, 27984492]
20616B7984492l153853l254982l142859k762201k156691j751525j313225r65294
20608I483862o61518n17255l04087j89012m0439L177j27226o18410p43995n37749
20598E747348l34016j80755l1891R2879j71148n52891o04440m52136k37717j0233
20588C265000K42422O12220P92211L41886m30823o62096o12064n45740m68999
20579B534017l72171k79887j59155r070Q429n9578n5492j35147j55341j25854
20569A190751l3703K3109K474r9033j03079p0965o3027l3953n0758j8637M876
20558G48055J9935N1401O070q836P1063R9090J15861M5795o3107j12425j28757
20547H44145o5500l9428L0055r959p8064l1055M8054N2799M0426o5458j16204
$$ y = [27984492, 24830639, 21575657, 18432798, 15670597, 13513906, 11762381, 10449156, 9483862, 8822344, 8305089, 8001002, 7811990, 7771551, 7774728, 7647502, 7029092, 6285097, 5747348, 5413332, 5232577, 5200686, 5293565, 5122417, 4569526, 3965086, 3512950, 3275233, 3265000, 3507422, 4119642, 4911853, 5253739, 4822916, 4160820, 3548756, 3003016, 2534017, 2161846, 1881959, 1722804, 1713734, 1722163, 1662585, 1607093, 1471946, 1316605, 1190751, 1157048, 1180157, 1182631, 1083598, 980519, 909554, 846527, 812574, 761816, 743179, 748055, 767990, 819391, 825461, 816625, 887688, 986778, 1102639, 1148434, 1085327, 972902, 844145, 778645, 739217, 769272, 759313, 681249, 650194, 698248, 751047, 791473, 726015, 609811]
20536F09811j59261j22630n0672o3790k279l8216p3935l0993J07238J38977K2814
20525C37064K9643M0238o3550l7397L3831J183J119Q102K1898p2791J5143L5578
20513C50061M2547k5337P508L7810k3240o1362m8810J6737m900o5802n2707p747
20501A64758p8561j45448r7090j5842J65775K16707J51924K4994J4073o7525q5224
20490B48541k5769m033K8918L5972j1937l800L1014k1095p2344k1543L0685m0632
20478A73977k2815L2192O6345P3394Q3301L5145j6122p1391r35l3580J6949N4713
20466C91173l3622M6231L8389m4222n3229o2114j11247m1788J269L1347k1506
20455A40681l2320o984K7790K5918Q9427J9280j3868P0918P1009m5501l6127M7988
$$ y = [609811, 450550, 327920, 277248, 213458, 211179, 172963, 99028, 68035, 175273, 314250, 337064, 366707, 406945, 343395, 305998, 339829, 341012, 342131, 350233, 372131, 299340, 314483, 350061, 392608, 367271, 374779, 412589, 389349, 327987, 279177, 295914, 291014, 225212, 172505, 164758, 86197, -59251, -156341, -172183, -6408, 210299, 362223, 387217, 401290, 333765, 248541, 222772, 218739, 247657, 283629, 271692, 267892, 298906, 277811, 205467, 183924, 214609, 173977, 151162, 183354, 249699, 323093, 406394, 441539, 425417, 354026, 353091, 319511, 336460, 391173, 357551, 403782, 442171, 397949, 344720, 282606, 171359, 129571, 130840, 162187, 140681, 108361, 101377, 129167, 155085, 244512, 263792, 249924, 320842, 391851, 346350, 310223, 358211]
20443C58211O692j2481m1311K156P3372K2392O5343m2564K4222L3390J06956P3208
20431F69586M5388P9977P7775P5589l210o7633p4842M0083J0233n3828j9777L4228
20419H13569L5215J2911j4615p1802k1314k4650l5554q5337n3204o497M5741L6063
20407F30526L880n9556m0276m7690j03596K7131P3339K9537j5964L6590P294n4201
20395D87014j3068j1459j1843J1525N0275N0191Q9539J8763l0636J8851K2553
20384F81705O3496O7113M4797K3653k0881p7708m5000J2987M1722Q0477P1715
20373I44076O1105k4827M5470N7064L3925K8352o4594m3195n3739n0958m8916
20362H83763m4446N872n090N9027P1628o708k7992j499l0778J5465L2235N6731
$$ y = [358211, 364903, 352422, 311111, 313267, 386639, 409031, 474374, 431810, 456032, 489422, 596378, 669586, 714974, 794951, 872726, 948315, 945105, 877472, 802630, 842713, 852946, 799118, 779341, 813569, 848784, 861695, 847080, 775278, 753964, 729314, 693760, 608423, 555219, 548722, 594463, 630526, 634406, 574850, 534574, 486884, 383288, 410419, 483758, 513295, 497331, 533921, 541215, 487014, 473946, 462487, 450644, 462169, 512444, 562635, 652174, 670937, 640301, 659152, 681705, 745201, 812314, 857111, 880764, 859883, 782175, 737175, 750162, 791884, 872361, 944076, 1005181, 980354, 1025824, 1082888, 1116813, 1145165, 1080571, 1037376, 983637, 932679, 883763, 839317, 845189, 840099, 899126, 970754, 964046, 936054, 934555, 903777, 919242, 951477, 1008208]
20350A008208P0121K8497K0462j1313J168P5011P6990Q6262M8825k5034n4872
20339A324325N9528J25138M9048M8248O7357N6864R6749K7160J00053J54446J36433
20328B245349J08385J05888Q4514J59388J74799K34841L40638M15567L82633L65550
20318D617552K82828K68742K56359M00674N60227P29875R80834J459810K146368
20309A1703269L285363M868883N265175L751961K690110J574043m5940M26293
20301C3519157L661060R944953K0664456L4425150L5676296K3475794J9605386
20294A80972252R235860j2395038k4563053k2664135k1239350k1779029j7537998
20287G0029509r256987l0424M440421K297639o13096m366542r537732j1669838
$$ y = [1008208, 1078329, 1106826, 1127288, 1115975, 1117143, 1192154, 1269144, 1355406, 1404231, 1379197, 1324325, 1383853, 1508991, 1558039, 1606287, 1673644, 1730508, 1827257, 1854417, 1954470, 2108916, 2245349, 2353734, 2459622, 2544136, 2703524, 2878323, 3113164, 3453802, 3869369, 4252002, 4617552, 4900380, 5169122, 5425481, 5826155, 6386382, 7116257, 8097091, 9556901, 11703269, 14988632, 19857515, 25122690, 28874651, 31564761, 33138804, 33092864, 33519157, 37180217, 47125170, 67789626, 102214776, 137891072, 161366866, 180972252, 190208112, 177813074, 153250021, 130585886, 109346536, 87567507, 70029509, 60772522, 60742098, 65182519, 67480158, 66867062, 62500520, 52962788, 41292950]
20279D1292950j0208170p301018m723749k942449j823667j081004p25725n19339
20271A1967829l97949l21984l44494j97289o7776L9079N760Q1761K01184K80931
20261A1247052O64356J369323K305468L762558O175916R885308J2618210J0273530
20253E8301721O175266K745557k651490n635458l112433M407157J5420753K3649603
20245I9300676K3328694K7708212L5734522K3806472m55029j0073840k2151356
20238A77198351l7396964l8766825k9517716j7256141p760105k016695r18082
20231D3565823j783250k539885m765165o423709o183560m880344l373368k291870
20223A1324672j541597j073812p65083n44067m50168m93914n60594n45637o29502
$$ y = [41292950, 31084780, 23783762, 19060013, 16117564, 14293897, 13212893, 12487168, 11967829, 11569880, 11247896, 10903402, 10706113, 10638337, 10677416, 10683176, 10764937, 10966121, 11247052, 11911408, 13280731, 15586199, 19348757, 25524673, 35409981, 48028191, 58301721, 64476987, 67222544, 64571054, 58935596, 55823163, 60230320, 75651073, 99300676, 122629370, 150337582, 186072104, 209878576, 209423547, 199349707, 177198351, 139801387, 101034562, 71516846, 54260705, 46500600, 44483905, 43565823, 41782573, 39242688, 34477523, 28053814, 21870254, 16989910, 13616542, 11324672, 9783075, 8709263, 7944180, 7400113, 6949945, 6456031, 5895437, 5349800, 4720298]
20214D720298o94804n09668l99904l43947k66945k02807j40571j04722k2675j00250
20204A934005j45310j39332j66610j08409j51506j18698p7521k8158L7448k7316
20194A008593o7461l5916j4125p5273r5363m2104l5297p8677J043o158m1166K347
20182E20443m9426n7738n9691K7968K7836n9688p1540m3035l4423j9096J5989
20171A97599l4319m8778j45671j10218J6708N1745J22773R7727Q2178j8268l1725
20160A79751N3069M2929J6345l1206m5747K0962J40293R1138P2122P5431m1984
20149E73103m4416p3674j56178l3176N9633L7831P009K2562J01640J3048m1023
20138D66359n5482J2934P1772j0115N9817J39676K18760K90230K80460J70200
$$ y = [4720298, 4025494, 3515826, 3115922, 2771975, 2505030, 2302223, 2161652, 2056930, 2034255, 1934005, 1788695, 1649363, 1482753, 1374344, 1222838, 1104140, 1026619, 998461, 1035909, 1008593, 941132, 905216, 891091, 815818, 720455, 678351, 643054, 564377, 565420, 559262, 518096, 520443, 471017, 413279, 353588, 381556, 409392, 349704, 278164, 235129, 200706, 181610, 197599, 163280, 114502, -31169, -141387, -124679, -72934, 49839, 147566, 229744, 211476, 179751, 232820, 275749, 292094, 260888, 215141, 236103, 376396, 467534, 539656, 615087, 573103, 528687, 455013, 298835, 265659, 325292, 363123, 370132, 392694, 494334, 507382, 466359, 410877, 423811, 495583, 485468, 545285, 684961, 903721, 1193951, 1474411, 1644611]
20128A644611R8378o4273k25324k48536k31337j45772j28000j27217l8415n0711
20118D83404l0418n9044p4933j01164q7985j05041k7891j6020k6826J5644M0259
20107I985p541Q8209K3203l1562J3407l819K5297L0668K1256L4954m0198K2491
20095A86350J9758p065K6162J42714J63420K50301L49513L44871K04309j4112
20085A666221k44139l00599j81698j33875n0958P4786J88995K40475K22057L34011
20075A815276K44662J72267J13413m4833k04391m23214m54288l16944k12998j14503
20065E74447K8549O1784o6975J1382N4471l0804N2192J46536K11801O7589p4076
20054A036896j16039r8371l2050p6190n0647l9698n5993m9550o2993J5136M6043
$$ y = [1644611, 1742989, 1678716, 1453392, 1204856, 973519, 827747, 699747, 572530, 534115, 483404, 452986, 393942, 319009, 217845, 129860, 24819, -3072, -19092, -45918, -30274, 9985, 2444, 90653, 113856, 82294, 95701, 91882, 117179, 147847, 169103, 204057, 163859, 186350, 206108, 199043, 225205, 367919, 531339, 781640, 1131153, 1476024, 1680333, 1666221, 1422082, 1121483, 939785, 805910, 754952, 829738, 1018733, 1259208, 1481265, 1815276, 2059938, 2232205, 2345618, 2300785, 2096394, 1673180, 1218892, 901948, 688950, 574447, 602996, 664780, 597805, 609187, 663658, 632854, 685046, 831582, 1043383, 1110972, 1036896, 920857, 822486, 790436, 714246, 663599, 623901, 567908, 518358, 455365, 470501, 516544]
20043E16544M6493J29578K50228J13934o9314j07278j79819j77097o6566K7450
20033D84153n480k8355p8078o0120k8111l4149k8586m668L083k549l1015Q039
20021A94164J9166k4436l1212m4061k8653O1400O521n5625l01P3723J5787k5761
20009A60712l2304j7600l4443L7947K3497o820j6793N5081L2924Q2212P9925O1339
19997D25677M3934M375l0141m5222m5546o9118o4818k7796k6445J4329k6346j4940
19985A37943N0035K2899l1651q6405m6257l4025K7698L5638N9442p0554n2460
19974A2303j1500K0538J0005n2853o616K7727j7141m629J7467L7385J1352J4617
19962E8655l6571Q586j1426l8220k2595k832L8913k5896O370J07571M9482k4194
$$ y = [516544, 563037, 692615, 942843, 1056777, 987463, 880185, 700366, 523269, 456703, 484153, 478673, 450318, 372240, 312120, 284009, 249860, 221274, 216606, 219689, 217140, 186125, 194164, 213330, 188894, 157682, 113621, 84968, 146368, 152889, 97264, 96963, 170686, 186473, 160712, 128408, 110808, 76365, 114312, 137809, 130989, 114196, 169277, 202201, 284413, 364338, 425677, 469611, 473986, 443845, 398623, 353077, 283959, 219141, 191345, 164900, 179229, 152883, 137943, 187978, 210877, 179226, 92821, 46564, 12539, 40237, 75875, 135317, 64763, 12303, 803, 21341, 31346, -21507, -28123, -396, -17537, -22166, -4699, 32686, 44038, 58655, 22084, 30670, 19244, -18976, -41571, -44403, -5490, -31386, -25016, 82555, 132037, 107843]
19950A07843l0122o0916M796L9058N6878q309j3584j6603m887L972N6349N2509
19938A86984l6607l8975r406l1478J7049J0577p871o827K6668n2844l3640P824
19926C1454Q828k6291l5093k371q765J6343O9598M0484k3492n0414m4121J02L6816
19913A3078j154j0311M0919L7666j6600m8725k9120J217K9862J2451L937j2099
19901B1121P222m353k7978p1819Q590O8804N236Q505L2194k6086p5833n4406P0118
19888c8685J00326J4187M0467L7945n7754p7244q443L4L4161M8372j5966n2706
19876B4694j2498J8831j080l6593n412o232J6619M4155j7294j8329j4323o389
19864a3851L1530K6655N0615n692j6578o2633l7201L9027q275j7638N6350N2190
$$ y = [107843, 77721, 16805, 21601, 60659, 117537, 109228, 95644, 79041, 74154, 78126, 134475, 186984, 150377, 111402, 101996, 70518, 87567, 98144, 90273, 83446, 110114, 57270, 23630, 31454, 40282, 13991, -21102, -23473, -32238, -15895, 53703, 94187, 70695, 20281, -23840, -23738, 13078, 11924, 1613, 42532, 80198, 63598, 14873, -14247, -13030, 16832, 29283, 33220, 21121, 28343, 23990, -3988, -75807, -67217, 1587, 6823, 15328, 47522, 21436, -54397, -108803, -38685, 61641, 75828, 116295, 154240, 96486, 19242, 10799, 10833, 44994, 93366, 77400, 24694, 12196, 31027, 29947, -6646, -12058, -18290, -1671, 42484, 25190, 6861, -7462, -13851, 17679, 44334, 94949, 89257, 72679, 10046, -27155, 11872, 3597, -14041, 42309, 94499]
19852I4499J3635n8900j0715K2457L8500k7240O4564l0589m2332k9097k9203m08
19840E171n4153l0358M6676R1907J22503J54779K11119K05656J51410m4935j33400
19829G26375j59464j12594o6225K2518M4380m546O5952J79093R3873k1801m9707
19818G17854j7893n344J8154o0036l8554j10223j00142j20272l6379M265k2527
19807B28903m8159j7879l0529j1568m427j8851J306J19960J1828q8625p8708o913
19795E6338N6435J9911L8824n609K9976O3495K8001m3499n6413j1553O7609M0221
19783B83736o0771O5140R2202K33449K77979K81057J90282n7565j44790n5014
19773A105705M7009k4542n4532k6575J2285J17453J01801K654p6458j98520k92072
$$ y = [94499, 108134, 49234, 38519, 60976, 99476, 72236, 136800, 106211, 63879, 34782, 5579, 5171, -48982, -79340, -32664, 59243, 181746, 336525, 547644, 753300, 904710, 859775, 726375, 566911, 454317, 388092, 410610, 454990, 450444, 516396, 695489, 789362, 767561, 717854, 699961, 694617, 712771, 652735, 614181, 503958, 403816, 283544, 247165, 251430, 228903, 180744, 162865, 132336, 120768, 116341, 97490, 98796, 218756, 230584, 141959, 63251, 56338, 112773, 132684, 171508, 165899, 195875, 259370, 287371, 243872, 187459, 175906, 243515, 283736, 222965, 288105, 380307, 613756, 891735, 1172792, 1363074, 1305509, 1160719, 1105705, 1152714, 1128172, 1073640, 1047065, 1059350, 1176803, 1278604, 1281258, 1204800, 1006280, 714208]
19762G14208j42116p3567n8443j0854m0992q3335q3384m4116M6195M9577J0493
19751B83666K3583k6341n9534k199K4553n5104p5126l1647n641O9272O9713p333
19739B07862K8648K1165j5154j6275k6611j8433m4511J26796Q8089P1052J18012
19728E40640O4793M6145P4892M1639j5498k9806l7600n4813q8110o3289p7522
19717D01471K2489Q6177Q9505J71028J35492k7755j08534j44490q7968j41012
19707C96403j10119r9886N742J0531o945j6364j2497k4110K4144o0953K3891M4987
19695A74824o2844o7167l4135n4274L0871O3891L4815J3141l2627r723L9520K07
19683I6499n2994k2117l9177l4390M326J6917j8010N498K3650M1397P5369J7966
$$ y = [714208, 572092, 498525, 440082, 429228, 388236, 304901, 221517, 177401, 223596, 273173, 283666, 307249, 280908, 221374, 219175, 243728, 188624, 113498, 81851, 76210, 145482, 215195, 207862, 236510, 257675, 242521, 226246, 199635, 181202, 136691, 263487, 351576, 422628, 540640, 605433, 651578, 726470, 768109, 752611, 722805, 685205, 630392, 542282, 478993, 401471, 423960, 510137, 599642, 770670, 906162, 878407, 769873, 625383, 537415, 396403, 286284, 186398, 192140, 202671, 195726, 179362, 166865, 142755, 166899, 105946, 129837, 174824, 111980, 44813, 10678, -43596, -12725, 51166, 85981, 99122, 66495, 56772, 96292, 96499, 43505, 21388, -17789, -52179, -47853, -30936, -48946, -43448, -19798, 21599, 96968, 114934]
19671A14934l4935m1502L8203K905q1809O766j9728o8788M8191R5163O101J2085
19659G7586N1003J1486j7848r6488j3417j4233M564L6985O6402j26L9165J9331
19647A64410k1861l544p259l9767k928m2117L717l6300J8771O1496K9370J9723
19635A43711k7108q0130J5229L4666m9654p2054P8302J6064n685M3891N8444J5864
19623A71540m269o0889m4729J9564M5763K7693j5884o897k6403o7783l4142M5257
19611D8821k7760q266J0086J0596j9754k3386J1205P8090L3445L7919N8772N0374
19599B60142M2606n0430j7227k8173q8718m8847M9873N1269Q527r2545k4370N6871
19587A18978J1970K4362J1215n47j8291j1688j5257k2060N9395L5929M6910l9829
$$ y = [114934, 79999, 38497, 76700, 79605, -2204, 4562, -15166, -83954, -35763, 59400, 65501, 77586, 128589, 140075, 122227, 25739, 12322, -1911, 2653, 39638, 106040, 105914, 145079, 164410, 142549, 139005, 131746, 91979, 89051, 46934, 50651, 14351, 33122, 94618, 123988, 143711, 116603, 36473, 51702, 86368, 36714, -35340, 42962, 59026, 53341, 97232, 155676, 171540, 167271, 106382, 61653, 81217, 126980, 154673, 138789, 131892, 105489, 37706, 3564, 48821, 21061, 12795, 22881, 33477, 13723, -9663, 1542, 79632, 113077, 150996, 209768, 260142, 302748, 252318, 235091, 206918, 118200, 69353, 119226, 170495, 179022, 86477, 62107, 118978, 130948, 155310, 166525, 165978, 147687, 135999, 120742, 98682, 158077, 194006, 240916, 201087]
19575B01087p1397l1542l0175O7199N7107j1000N4241m0026j9560L8882k6758
19564A88058l9020K6039R091O0847M5897o1118n5294m9174j5409O18K9404p4078
19552F5861p7836L9392P8730L7628m4251o7670L7268K7682o288M2031O9867l9816
19540A62598o778p93L9286J8318J0753P110L8866m0187n5352N1506j4843k1857
19528A88627j2107m508j2534l7454L6688Q6867k0577o6568L9209J9815R786M0408
19516B67652l670j7637l9543m9929m4521J6181O2293O3850K3182K9442K5571k4334
19504C08537o2209q3979N9432L5498j100j5822m3524j0261L245l8085M1968Q2273
19492B75973M0465o3168K254J0311j2942j9688N2252l5517m5619k4019M8837j1142
$$ y = [201087, 129690, 98148, 67973, 135172, 192279, 181279, 235520, 195494, 175934, 214816, 188058, 149038, 175077, 184168, 245015, 290912, 229794, 174500, 125326, 109917, 110535, 139939, 65861, -11975, 27417, 106147, 143775, 99524, 31854, 69122, 96804, 90516, 132547, 202414, 162598, 155820, 155027, 194313, 212631, 223384, 230494, 269360, 229173, 173821, 225327, 210484, 188627, 176520, 172012, 159478, 122024, 158712, 245579, 225002, 158434, 197643, 217458, 227244, 267652, 263982, 246345, 206802, 156873, 112352, 128533, 190826, 254676, 277858, 307300, 332871, 308537, 246328, 162349, 221781, 257279, 256179, 240357, 196833, 186572, 189817, 151732, 193700, 275973, 316438, 253270, 255524, 265835, 252893, 233205, 285457, 249940, 204321, 180302, 229139, 217997]
19480B17997J0293M1543K0890r0706n775M7939M8288n9615j7366l3131J4946K041
19468A97344N9325L1578o732o072P9614N7001l2268j9318n421n1472N5721M1112
19456D00412k5865K5953r762L2136m56j0803N3138P4381J07289R6221R7381O3883
19444I03908n0534K9148l647m0158j916j12036j23896O437k981N1657l3609j35369
19432D87004p149N5802O921J0508k1780o4153o4506j0727J8772j7565Q571L2989
19420D34687L6002l4243q6868k3812N0462L8738K1346j5590k621P3424P7469L401
19408E72395K606J4921p227K5700P7445K0508k9563P573K2341o909J6619N8883
19396G75292Q1572J5848M3879P9244P8217N4870N868j8855r2222k5278j9767k4784
$$ y = [217997, 228290, 269833, 290723, 200017, 194242, 242181, 290469, 230854, 213488, 180357, 195303, 197344, 256669, 288247, 281515, 275443, 355057, 412058, 379790, 360472, 355051, 303579, 359300, 400412, 374547, 400500, 390738, 422874, 422418, 411615, 464753, 539134, 646423, 742644, 840025, 903908, 853374, 882522, 878875, 838717, 836801, 724765, 600869, 607306, 604325, 655982, 622373, 487004, 479855, 535657, 542578, 553086, 531306, 467153, 402647, 391920, 410692, 393127, 401698, 434687, 470689, 436446, 349578, 325766, 376228, 414966, 436312, 420722, 418101, 491525, 568994, 572395, 575001, 589922, 582695, 608395, 685840, 706348, 676785, 684358, 706699, 699790, 716409, 775292, 856864, 872712, 916591, 995835, 1074052, 1128922, 1134790, 1115935, 1023713, 998435, 978668, 953884]
19384I53884n3799J0509l4146K2484K1838Q498O490R888l704O501M7884M8304
19372A044631O7373Q1509L5680N3976J9920J3539N2082j0924L9143L9806j9932
19361A416803P8419R6187N5677J14916P2043J39007J50739J02434N6001J15242
19351B397468J11109J16223J48590J57861K72802L90567M54330N03809N20112
19342E072871K88233R2280J08670K48738M20226M92794P25286J136197J481363
19333A0066658J672593K066949L238971N634295Q492611P848946K166242k572747
19325C8614518k783836N06495N525978J2450952K4627512M6002238O4381968M3890060
19317B33215885j842704k1874249j8997449k3640139l3562935l3895827k5056428
$$ y = [953884, 900085, 910594, 876448, 898932, 920770, 929268, 935758, 945646, 941942, 948443, 996327, 1044631, 1112004, 1193513, 1229193, 1283169, 1303089, 1316628, 1368710, 1357786, 1396929, 1436735, 1416803, 1495222, 1591409, 1647086, 1762002, 1834045, 1973052, 2123791, 2226225, 2282226, 2397468, 2508577, 2624800, 2773390, 2931251, 3204053, 3594620, 4048950, 4552759, 5072871, 5361104, 5453384, 5562054, 5810792, 6231018, 6723812, 7449098, 8585295, 10066658, 11739251, 13806200, 17045171, 22679466, 31172077, 39021023, 41187265, 38614518, 35830682, 36337177, 41863155, 54314107, 78941619, 124943857, 189325825, 233215885, 231373181, 209498932, 190501483, 166861344, 133298409, 99402582, 74346154]
19310G4346154j3812868m277290M189163J1330237J0559617o43057j1526694j4239741
19302E5925521j1043443p436213n822349m619662l276539k394128k145015j821720
19294A7366452j411799r99490m94150m3380J54723N0770l06800p00213p66537
19285A2849576m56710J90926P23060J264911K021052L268882N416248R066205
19277C4344150J4374019J6356918Q158399m318607j0127561p903414j437251O996874
19269E6443527J8378885L0490580K9793473J7283873J8380381L1163583J6311337
19262B18245639k5126201m8666008m5033611l0262150j7395154r525814m064418
19255C8172283O99289L465568J222926l445716n340201m543162k974339j323314
$$ y = [74346154, 60533286, 56255996, 60445159, 71775396, 82335013, 81691956, 70165262, 55925521, 44882078, 37445865, 31623516, 27003854, 23727315, 21333187, 19188172, 17366452, 15954653, 14955163, 14461013, 14417633, 14572356, 14623126, 14316326, 13616113, 12849576, 12392866, 12583792, 13306852, 14571763, 16592815, 19861697, 25277945, 34344150, 48718169, 65075087, 73233486, 68914879, 58787318, 50883904, 49446653, 56443527, 74822412, 105312992, 135106465, 152390338, 170770719, 201934302, 218245639, 193119438, 144453430, 99419819, 69157669, 51762515, 42236701, 38172283, 38871572, 42337140, 43560066, 40114350, 34774149, 30230987, 27256648, 25933334]
19247B5933334q02841k178563l642564l782423k964249k071753j355006p97363
19239H338572m44139l60617m32690o77626q37537p84284o06553m34799l59651
19230C400676k96749k23906k32398l51447k48281j91657j33672j79892n5876n6687
19220A430111p2201j11442j58222p1485n0773J9o2626q1595o7251L3448J2854
19209H00837n4968j23886n3683l0306m0170M2480O9796J0752p383n3600l4766
19198E25103n9054q0572k8894R559o5247l5124k5084j30177p9470q0817k4177
19187g3954J161M8550J9699M4913M4730K7896Q144o9117J0815k0203R545L8509
19175I0688q647l320K1808N0040k545M3773L7099J2509l3214p5070k4736r989
$$ y = [25933334, 25130493, 22951930, 19309366, 15526943, 12562694, 10490941, 9135935, 8338572, 7894433, 7533816, 7101126, 6423500, 5585963, 4801679, 4195126, 3760327, 3400676, 3103927, 2880021, 2647623, 2296176, 2047895, 1856238, 1722566, 1542674, 1486798, 1430111, 1357910, 1246468, 1088246, 1016761, 965988, 966007, 903381, 821786, 754535, 787983, 800837, 745869, 621983, 568300, 537994, 497824, 540304, 610100, 620852, 613469, 559869, 525103, 466049, 385477, 356583, 366142, 300895, 265771, 240687, 110510, 31040, -49777, -73954, -72793, -24243, -4544, 40369, 85099, 112995, 121139, 52022, 62837, 42634, 52179, 90688, 82041, 78721, 100529, 150569, 148024, 191797, 228896, 241405, 208191, 133121, 108385, 98396]
19163I8396L4549j8070m1923o735O1523J4834j6102j7132m8515m4357j367K9380
19151D4481J9745m1101j8946m1113j7081K0615k8209J3465n4739l8895m2607j20769
19139c05154l2866L0764O9989n9799m8901K9398M0144L6689O5901J12689j3913
19128g5059k6788l103M2305L8185n306O270k7463l0070l9903n5078Q18J6011N2448
19115a06733P5754J09288L7588k1430k4626m1700r3791j1956N7079l6636m086
19104f1249P8486N3963L2772R584k5953K2471L6400o614l6188n6567p3061m1143
19092f7099m49l472Q3716L2172O82k1128k8490l611Q975j1935j0417J8920k2130
19079b4266O8584K5497r60Q18L7L045k2338Q1981M6992k5456k1235m8543k4810
$$ y = [98396, 132945, 114875, 72952, 66217, 127740, 142574, 126472, 109340, 60825, 16468, 15101, 44481, 64226, 23125, 4179, -36934, -54015, -33400, -61609, -48144, -102883, -141778, -184385, -305154, -338020, -307256, -237267, -297066, -345967, -316569, -276425, -239736, -173835, -61146, -75059, -101847, -104950, -62645, -24460, -29766, -23496, -50959, -81029, -120932, -176010, -175192, -159181, -106733, -30979, 78309, 115897, 94467, 69841, 28141, -65650, -77606, -20527, -57163, -61249, 17237, 71200, 103972, 113556, 87603, 110074, 146474, 139860, 103672, 47105, -25956, -67099, -67548, -71020, 12696, 44868, 45550, 24422, -4068, -7679, 1296, -10639, -21056, -2136, -24266, 44318, 69815, 68855, 69673, 69710, 72755, 50417, 132398, 179390, 153934, 132699, 84156, 59346]
19066E9346j9487J2087K1556L6775n740R5405qn490J9272k3583l1377k087q0548
19053G6121m5557L3471J2433n9608J5026M2490L97O8725k5334J041l1687q824
19041G8694R577J355k1791n362o6252l4196R972K4025N7829L1060m297p1024j6100
19028f510L9327P3420k265l4111p3268J3488R5218M6149N9810j6161l1402q621
19016A55074R900L6770P4929L9979n4703k197J7932N1082N2287K6237M6342q018
19004D45614l1649M4921N5632O3047J19840K02379K19046L13488L38357K57380
18994B028055K08728l6562k0485J60456L77951P26116J458466K121740K189035
18985I213500J642766J181960J29677j131775j628774j667555j589171j351720
$$ y = [59346, 39859, 51946, 73502, 110277, 104537, 199942, 199934, 194444, 213716, 190133, 158756, 156669, 76121, 30564, 64035, 76468, 16860, 31886, 74376, 74773, 143498, 118164, 119205, 87518, 78694, 88271, 89626, 67835, 62473, -3779, -37975, -28003, -3978, 53851, 84911, 80614, 9590, -6510, 32817, 106237, 103972, 69861, -3407, 10081, 105299, 151448, 211258, 195097, 163695, 155074, 164974, 201744, 276673, 316652, 261949, 259752, 277684, 328766, 381053, 407290, 453632, 445614, 413965, 458886, 514518, 577565, 697405, 899784, 1118830, 1432318, 1770675, 2028055, 2236783, 2200221, 2179736, 2340192, 2718143, 3444259, 4902725, 7024465, 9213500, 10856266, 12038226, 12167903, 11036128, 9407354, 7739799, 6150628, 4798908]
18977D798908r49618m58260k2552J96090J95009M9381j76202m17773o14024n72008
18967B028951m40359l09383k13975j76765p5270p1756l4430m6935n8514j0627
18957E90937L760j5438O5410j5429l0730l0408j5717J7934P8348K00947K41150
18946A090764L10624N28687N32640L54666J73951K5515j55067j67366M5446M28476
18936C168336Q45186R22439R74915J195232J062902L17437k79441p42235j370916
18927F093855j529634j301289q66602m68819k12800j37812n4497k1877o1837j75342
18917A263346j69304j93743j73845q0002o3327r2893p4685k1197P665k005m7594
18906C52416l4402l9209k4643k8503k3886k6494l6784J4350r603k9644j7828k9382
$$ y = [4798908, 3849290, 3391030, 3368478, 3564568, 3759577, 3808958, 3632756, 3214983, 2600959, 2028951, 1588592, 1279209, 1065234, 888469, 813199, 741443, 707013, 660078, 601564, 590937, 594697, 579259, 644669, 629240, 598510, 568102, 552385, 570319, 648667, 849614, 1090764, 1401388, 1930075, 2462715, 2817381, 2991332, 3016847, 2861780, 2694414, 2739860, 3168336, 4013522, 4935961, 5910876, 7106108, 8169010, 8486447, 8207006, 7464771, 6093855, 4564221, 3262932, 2396330, 1927511, 1714711, 1576899, 1522402, 1500525, 1438688, 1263346, 1094042, 900299, 726454, 646452, 583125, 490232, 415547, 394350, 402015, 400010, 352416, 318014, 278805, 254162, 225659, 201773, 175279, 138495, 152845, 143242, 113598, 95770, 66388]
18894F6388n1890R911P4255m0025k7984K9862Q455K57K9888N54P798o9161n3141
18881a4833P104k3538Q10P0459Q8966l1547l6525M862J7818l3621l9103K5966
18869C6818j0200M8035K8098P646p213n8453l014J1539l4154j1200N4609N5546
18857A18057P0624K6808p0759m7429J7125j490l90Q264L1711L2863K920n1639
18845A36665r0021n5870L9605N7180P2451L112k1462Q797q764L9613P1053m0960
18833B11399m4401k614K8985P8586J34685J96166K62542L46011L54363K67958
18823A833680J31043L8133j69451k51343l06388k70089j61838m6067N444Q5524
18813H88648N0505N3079O8610J07240N3450n1517q6355j13949r5728L6329L3219
$$ y = [66388, 14498, 24409, 98664, 58639, 30655, 60517, 68972, 69229, 99117, 99671, 107469, 38308, -14833, -7729, -31267, -30457, 40002, 128968, 97421, 60896, 65758, 83576, 49955, 10852, 36818, 26618, 74653, 102751, 110397, 103184, 44731, 41717, 53256, 19102, 7902, 62511, 118057, 188681, 215489, 144730, 97301, 114426, 112936, 112546, 120810, 152521, 185384, 188304, 136665, 46644, -9226, 30379, 87559, 160010, 163122, 141660, 150457, 141693, 181306, 252359, 211399, 166998, 164384, 193369, 271955, 406640, 602806, 865348, 1211359, 1565722, 1833680, 1964723, 2002856, 1833405, 1582062, 1275674, 1005585, 843747, 797680, 803124, 888648, 939153, 992232, 1060842, 1168082, 1221532, 1170015, 1083660, 969711, 873983, 910312, 943531]
18802I43531n162m6303j9991J13931J57160M7921j02665k11064j22192p8166j14804
18791E62196r6918k6259P1308l1639p8578K4835Q1679J71491J43386N2909o2191
18780H12219j9796l4994l3227K6174Q2375J83560J98068J30230J92092K64038
18770A800739J56383R0443J57162N947l28738m16227l96604j97379m1846L8262
18760H68142M8837P0810J3894n7015j15519m0434P4069L6297j54684j41192o6026
18749E37179o8670n6789J0863O3077Q1213J59624K17306P4608j16376j61394j58170
18738E82471j68496p0385l4481n696l827m1451J4408L1473L5116j0555q2138N636
18726B52075l203r3726l3787l1629j9127P3510J7553k8050m5894k6991O9216M612
$$ y = [943531, 938369, 892066, 872075, 986006, 1143166, 1191087, 1088422, 877358, 755166, 677000, 562196, 465278, 439019, 510327, 478688, 400110, 424945, 506624, 678115, 821501, 874410, 812219, 792423, 757429, 724202, 750376, 832751, 1016311, 1214379, 1344609, 1536701, 1800739, 1957122, 2047565, 2204727, 2210674, 1881936, 1465709, 1069105, 871726, 829880, 868142, 916979, 987789, 1001683, 944668, 829149, 788715, 862784, 899081, 744397, 603205, 537179, 468509, 411720, 422583, 485660, 566873, 726497, 943803, 1018411, 902035, 740641, 582471, 413975, 343590, 309109, 303413, 299586, 258135, 272543, 304016, 339132, 328577, 246439, 252075, 248872, 155146, 121359, 89730, 70603, 144113, 161666, 133616, 87722, 60731, 129947, 134559]
18714A34559m8285n2568K0222J38595K2402l2547M7606q801o8019k4779j4822
18703A13563L9594J052J0375k5940M0174L55N7668K9194m4454J0653l3751K605
18691B01088O1104O4072J35646J87825P5684j21400q1213r5230j22125j19554
18681A85897n1935L6873j8176m889k3281j3965l2171l0706J3480R371k079j9700
18669D8719K187N00O3480R2269M6451j72K9601r268o527L5130J20590K33925K63332
18656I20217J17422j51303k21631j60142j64379j49946n7094l3784O2504o395
18646A55469l0436j9783L8418q602J2240j2915J6862m951P6716j877p190Q3052
18634B97003k735j3517k0830K0095p080K3768P1071O8704R6307J7216m6289j70548
$$ y = [134559, 86274, 33706, 53928, 192523, 214925, 182378, 229984, 221183, 153164, 128385, 113563, 153157, 154209, 164584, 138644, 178818, 179173, 236841, 266035, 221581, 232234, 198483, 201088, 262192, 326264, 461910, 649735, 725419, 604019, 522806, 427576, 305451, 185897, 133962, 170835, 152659, 147770, 124489, 110524, 78353, 47647, 61127, 70498, 68419, 48719, 50906, 51406, 114886, 207155, 253606, 253434, 283035, 273767, 267240, 302370, 422960, 656885, 920217, 1037639, 886336, 664705, 504563, 340184, 190238, 133144, 99360, 161864, 155469, 125033, 105250, 143668, 135066, 147306, 134391, 151253, 146302, 223018, 221141, 213951, 297003, 294268, 280751, 259921, 280016, 272936, 296704, 367775, 436479, 532786, 550002, 503713, 333165]
18622C33165n4529m2756m1833l7434K5752M2561k5018q241L6091J3404J1359O2261
18610C14782Q9867O9981J05302J29645N9410O7031N5601M275r5560j13116j21272
18599E65946j36907q7041n9p4750l2932o973n3187k3078j682K1225J7359K302
18587A90223N121k3833o6209L6894Q0607O7283L6252K5381o9393m3137k6566l03
18575B12320K0927k6583p0042p2007L8689Q6508L3792O4974O5761J06970k7395
18564D33914k8099j5879k0319o3176l3971L9236j1544j6701R606k2136M0115k3961
18552B87085p231m2971o4237k0722l5365o9600j4077O4918L4864K2182M627J034
18540A60507J1454o57l8986J1818m4327m5167L3313M4370L4580R026n4047m1347
$$ y = [333165, 278636, 235880, 194047, 156613, 182365, 224926, 199908, 191667, 227758, 241162, 252521, 314782, 404649, 474630, 579932, 709577, 768987, 836018, 891619, 895894, 800334, 687218, 565946, 429039, 341998, 341939, 267189, 234257, 227284, 174097, 151019, 149337, 170562, 187921, 190223, 195344, 171511, 105302, 142196, 222803, 290086, 326338, 351719, 282326, 239189, 212623, 212320, 233247, 206664, 136622, 64615, 103304, 189812, 223604, 288578, 354339, 461309, 433914, 405815, 389936, 369617, 306441, 272470, 311706, 300162, 283461, 293067, 270931, 311046, 287085, 279854, 236883, 172646, 151924, 116559, 46959, 32882, 97800, 132664, 154846, 159473, 160507, 171961, 171304, 132318, 144136, 99809, 54642, 87955, 132325, 166905, 175931, 121884, 80537]
18528H0537m5262J124P5743L6764K7751K9955N1429K5858L2171O245l3851P604
18516B96068P486J9519L9697M5337J03285Q1430J03551O3159J11680J11742Q1546
18505A064500M9628M8323m438m51k2366o0811j37209j77107j27397j18395q8347
18494D25930j17356m1131l0876m8417M3457J2948n484K0527j3507K4893O0625
18483C31609M096J9095j56j9795k4493k859K8098j2783K0908Q197m1986p1043
18471B38888n7025k3287L6350J1692K0701M4542p030j1726j0301k2214O087n1697
18459A74980m589J8904N6375M3376j3305j920j2780o0924J1829P0082J2742k4643
18447B70127k7684k2334p891l7882k4766M9212N0484j677k7593n1916m3126N638
$$ y = [80537, 35275, 36399, 112142, 148906, 176657, 206612, 258041, 283899, 316070, 322315, 288464, 296068, 303554, 323073, 362770, 408107, 511392, 592822, 696373, 759532, 871212, 982954, 1064500, 1114128, 1162451, 1158013, 1157562, 1135196, 1074385, 937176, 760069, 632672, 514277, 425930, 308574, 267443, 236567, 188150, 231607, 244555, 239071, 259598, 246091, 270984, 331609, 335705, 354800, 354644, 334849, 310356, 307497, 335595, 322812, 343720, 351917, 309931, 238888, 181863, 158576, 194926, 206618, 227319, 271861, 264831, 253105, 242804, 220590, 226677, 174980, 170391, 189295, 245670, 289046, 275741, 273821, 261041, 200117, 211946, 282028, 294770, 270127, 242443, 220109, 212218, 174336, 149570, 198782, 249266, 247589, 219996, 168080, 124954, 130592]
18435A30592J0862M662M6380m698J8704O1053J4039m7501m3882k6215K8260K9857
18423B22113p218o0450p085N2443Q957j3857o1110J9188K0508M0318R820m9933
18411A73694l0142L1690J03434O6515l2333o0782q7511l5034o4544N358o894L7815
18399A01266M5917q743k6433j6062Q719k9465P081l313j2120J5116j0291m4050
18387B7622k2644Q0592M8268o2659k0966O4013O0053K7531J5957l3959K1608l8390
18375A67026J6506P1056m1893m1762l326N1436Q2264p1105q9419J1787M6073K963
18363B01606l9747r7316k2558L708q009M3573O1707J9044l3680K699j3045l3088
18351H4894j4964k8046k773p66M1482m437o4165O5819O5212M8925j361l2886p2153
$$ y = [130592, 141454, 146116, 192496, 187798, 206502, 267555, 281594, 234093, 190211, 163996, 192256, 222113, 214895, 154445, 147360, 199803, 208760, 194903, 133793, 152981, 173489, 213807, 223627, 173694, 143552, 175242, 278676, 345191, 312858, 252076, 164565, 129531, 64987, 70345, 63451, 101266, 147183, 138440, 112007, 95945, 104664, 75199, 82280, 78967, 66847, 81963, 71672, 27622, 4978, 85570, 133838, 71179, 50213, 114226, 174279, 201810, 217767, 183808, 205416, 167026, 183532, 254588, 212695, 170933, 167607, 219043, 301307, 230202, 140783, 152570, 198643, 201606, 161859, 64543, 41985, 45693, 37684, 81257, 142964, 162008, 128328, 131027, 117982, 84894, 69930, 41884, 39111, 38345, 79827, 75390, 11225, 77044, 142256, 191181, 189820, 156934, 84781]
18338H4781m7234M1392k777O5724N8654Q473K6084p515q8394l2848L0728j4429
18326A22639k5836J6656K3556M3916p5285q0157m0916Q323K4712J6049j2127L205
18314B4735M3696j548j1729J7486K0097J1316P538j448j0824J9435m5103Q700
18302H2351R9795O8079K8489J1822n5994o2577l4053q894J9621k7038o3092j5672
18290D2837M5350N1858M0023N3497j8687N3355M6747r798o521p2879j1796O8785
18278B82771k0438N2667K7406j6214j8341m0438k7273j3717l4159o8428m3188
18267H0648N864J7187p799J8954L2435j045J4225P9718J2937n4226J05929J30510
18255D35337J24473K2153L1725M238m1853o3460k9297l9318p5675n4885O1041
$$ y = [84781, 37547, 78939, 76162, 141886, 200540, 209013, 235097, 227582, 139188, 106340, 137068, 122639, 96803, 113459, 137015, 180931, 105646, 25489, -15427, -7104, 17608, 33657, 21530, 24735, 68431, 66883, 55154, 72640, 92737, 104053, 111591, 110143, 99319, 118754, 73651, 82351, 182146, 250225, 278714, 290536, 234542, 171965, 137912, 129018, 148639, 121601, 58509, 42837, 88187, 140045, 180068, 233565, 214878, 268233, 314980, 305182, 298661, 225782, 213986, 282771, 262333, 315000, 342406, 326192, 307851, 267413, 240140, 226423, 192264, 123836, 80648, 86512, 103699, 95900, 114854, 147289, 146244, 160469, 240187, 253124, 198898, 304827, 435337, 559810, 581963, 613688, 617926, 576073, 512613, 483316, 443998, 368323, 313438, 374479]
18244C74479K2879l8217k9623n2047J0419J21757N7155q049M2935r837j1048m1599
18232D39204N137j2207k3982l7292k4457K6170O3780P3200M6469N503m9196k8617
18220D83712K4205j2568N6559J6660m5494r5172m0820K5888J5166R4790K1870
18209E44796m4499l4727L7739P1169P6562P619p2480q264J1733O5685R804j0031
18197F55106K6020l6324Q686J1020j7607J6718P1922J04883Q6887K3744l1132
18186I19923M6809K9045o7000Q3136M7636L2445L5762Q4429J27637J13727R1577
18175A545126J07657K09632K18737K86242K40840J34606K31856L48264N20983
18166C843943Q18287J101592J379360J541024K139519L592002O123047J0931370
$$ y = [374479, 397358, 359141, 329518, 277471, 287890, 409647, 466802, 458753, 501688, 491851, 480803, 439204, 444341, 432134, 408152, 370860, 346403, 372573, 436353, 509553, 556022, 561525, 512329, 483712, 507917, 495349, 551908, 568568, 523074, 427902, 387082, 412970, 428136, 522926, 544796, 500297, 465570, 503309, 574478, 651040, 658659, 586179, 577915, 589648, 655333, 665137, 655106, 681126, 644802, 653488, 664508, 646901, 663619, 735541, 840424, 927311, 951055, 919923, 966732, 995777, 928777, 1011913, 1059549, 1091994, 1127756, 1212185, 1339822, 1453549, 1545126, 1652783, 1862415, 2081152, 2367394, 2608234, 2742840, 2974696, 3322960, 3843943, 4662230, 5763822, 7143182, 8684206, 10823725, 14415727, 20538774, 31470144]
18158C1470144K0844468L1831678K0040795j0197301k5580127k3759056j5268963
18151B9381638q548026m944247l003131j893334j148807o52076m95873n89899
18143H106245n50017k94687p7944k671J97796K84585N20866R13721J508881K183184
18133A2789959K723381L323599M808195P999141J3855604K5448460M7145768O0414690
18125A78508797K2322555l1546429n0571974m1726654k5421750j4245713q290852
18118B9027980m732813k374527o57164P34909J828748L712204Q420523J9402342
18110E5362202L8389203L2860548r563106l2172448l0584324j8522063r028229
18103B6741783m343830j867122l15152J018055L039910O597091J3608520K5411253
$$ y = [31470144, 52314612, 84146290, 104187085, 93989784, 68409657, 44650601, 29381638, 20833612, 15889365, 12886234, 10992900, 9844093, 9192017, 8696144, 8106245, 7556228, 7261541, 7183597, 7180926, 7378722, 7663307, 8184173, 9097894, 10606775, 12789959, 15513340, 18836939, 23645134, 31644275, 45499879, 70948339, 118094107, 178508797, 200831352, 169284923, 118712949, 76986295, 51564545, 37318832, 29027980, 24295167, 21920640, 21263476, 21998385, 23827133, 27539337, 35959860, 55362202, 93751405, 126611953, 117048847, 84876399, 54292075, 35770012, 26741783, 22397953, 20530831, 20215679, 21233734, 24273644, 30870735, 44479255, 69890508]
18095F9890508K7224668K335107k0987349k5528779j8819585j0888404o221733
18088A7004433l836283k504682j560697j036835p87197q94689r20219q19353o05252
18079D039226m81257m27524k31530j67042j09263p8965k467K05452L84939J38563
18069C270132k54485m21718m57590l55379j51429q5319j46829j60162j52764j51337
18059I33120j28277o7467p5384l3233K3103o151K2152j7493k9520j19077o6153
18048D35620m0703O1216N8326j3114P724P5985P8666J81782K37084J45368j57179
18037A070775k40663j14423k6598l3310l6534j23458j00750q0152p3652m5191
18027A96044l5259K5446J0601K2029K5616l358L2942m1261n6850M693K305J0771
$$ y = [69890508, 97115176, 99450283, 78462934, 52934155, 34114570, 23226166, 17004433, 13168150, 10663468, 9102771, 8065936, 7278739, 6384050, 5463831, 4644478, 4039226, 3557969, 3130445, 2898915, 2731873, 2622610, 2543645, 2541178, 2746630, 3131569, 3270132, 3015647, 2593929, 2136339, 1780960, 1629531, 1544212, 1397383, 1237221, 1084457, 933120, 804843, 737376, 661992, 628759, 651862, 645711, 667863, 650370, 620850, 501773, 435620, 394917, 456133, 514459, 501345, 509069, 585054, 663720, 845502, 1082586, 1227954, 1070775, 830112, 715689, 689091, 655781, 619247, 495789, 395039, 314887, 241235, 196044, 160785, 186231, 196832, 218861, 244477, 241119, 274061, 232800, 175950, 180643, 182948, 193719]
18015A93719j8028q944K701n9845n8759M4173N454N8648M477j7680j7121j418
18003A27377m9193o3935j8810n146k7386n9899k0986O9180L8106M5384K2296J8639
17991G5627l7833N572r1518k2174J1085K727j0908Q5437j6794r7091n5078j8114
17979a69062O0431K1350M7349L3427Q9963k0772l9549k4076j9391m7387l974n886
17967g7577l6579k7015J605J0042K9458O9179n7601l3090N60k543J0180O0267
17955e3114K9011J4110L3194R043j8371p6702k6945L825o120M5462J2003k5822
17943f0426k1183K003L2588J8227o624j1212K9393J3618j4058k7753o2436o5162
17931a73025Q6913Q8950J8259r4970j06649m112P8172O8908O9175n027k2474j4936
$$ y = [193719, 175691, 166747, 169448, 109603, 50844, 95017, 100471, 159119, 163596, 145916, 128795, 127377, 78184, 14249, -4561, -9707, -37093, -96992, -117978, -48798, -10692, 34692, 56988, 75627, 37794, 43366, -48152, -70326, -59241, -56514, -67422, 18015, 1221, -95870, -150948, -169062, -108631, -87281, -39932, -6505, 83458, 62686, 23137, -939, -20330, -67717, -71691, -77577, -114156, -141171, -139566, -129524, -100066, -30887, -88488, -121578, -121018, -123561, -113381, -53114, -24103, -9993, 23201, 32244, 13873, -62829, -89774, -85949, -92069, -46607, -34604, -60426, -81609, -79606, -47018, -28791, -35415, -46627, -17234, -3616, -17674, -45427, -107863, -173025, -86112, 2838, 21097, -73873, -180522, -184634, -106462, -37554, 31621, 26594, 4120, -10816]
17919a0816r736l323J4810l2193j4315O5907j9959j1118K8710M4748m036q4761
17907c6082j7841Q9748j3028n3997q940O3371K0661J4153J4669m3481k8118m1355
17895d0240p5624L8428N0280Q3929J6265l4940j6064k5463k8222J5958j3333l2655
17883f1681N4911Q0431m7098l0985k0199j277k9517k4842J4210O7598P518k3112
17871a4043k2867K5476j2711j7708k591M3650j5609N0978N3063J1097p7073j6369
17859E293l1759K8689N4437q331l7197Q123L6737n9841o6001O1046K8277p7109
17847e7636R893J6339j6972j222L4589J1096n4375n6391K9239L7032J5625M585
17835b8198R505L9230k3836n5777j541r483o7p968N365m0701J5150K1545J3917
$$ y = [-10816, -20552, -23875, -9065, -41258, -55573, 10334, -9625, -20743, 7967, 52715, 48679, -36082, -53923, 35825, 22797, -31200, -40140, 23231, 43892, 58045, 72714, 29233, 1115, -40240, -115864, -77436, -27156, 56773, 73038, 38098, 22034, -3429, -31651, -15693, -29026, -61681, -6770, 73661, 26563, -4422, -24621, -25898, -55415, -80257, -66047, 1551, 9069, -14043, -36910, -11434, -24145, -41853, -44444, -794, -16403, 34575, 87638, 98735, 21662, 5293, -26466, 2223, 56660, 48329, 11132, 19255, 55992, -3849, -69850, -8804, 19473, -57636, -47743, -31404, -48376, -49598, -15009, -3913, -58288, -114679, -85440, -48408, -32783, -28198, -18693, 20537, -3299, -59076, -60617, -70100, -70167, -78135, -72770, -113471, -98321, -76776, -62859]
17822f2859o1832l572l381O0314M0381J4167n8900L3554K3865N2059j4372q4895
17810f5471j18548j0962M6015J2730p803M8445O708o0186l5122K1557L8170R344
17798a15123N9086l5786j0645k8839k7560O0899L0950P8462M7445j3248m8293
17787b652L6440m4897j02152m2373j6553L8469M7316l1554J1212J1814O6701L4688
17775F459k8643k7774m0495J9235K888J6558K0320k3317l3070J6007L6362p327
17763d2797p244J2615N355K209q4017K3490p748P171j3329j9241j6595J3983p925
17750a34073J8592Q989O6836k7117p289n369m4826j1073M7754M4107l3612l287
17738h0368J7205O3002K1790l8221q541p912k5963j7985l5671N9242O1479l1256
$$ y = [-62859, -124691, -128263, -131644, -71330, -30949, -16782, -75682, -42128, -18263, 33796, 19424, -65471, -184019, -194981, -148966, -136236, -144039, -95594, -88886, -149072, -184194, -162637, -124467, -115123, -56037, -91823, -102468, -131307, -158867, -97968, -67018, 11444, 58889, 45641, -2652, 33788, -11109, -113261, -155634, -172187, -133718, -86402, -117956, -106744, -94930, -28229, 6459, -22184, -49958, -90453, -71218, -68330, -51772, -31452, -54769, -87839, -71832, -35470, -42797, -50041, -37426, -32071, -29862, -113879, -90389, -98137, -90966, -104295, -123536, -140131, -126148, -134073, -115481, -106492, -39656, -66773, -74062, -79431, -124257, -135330, -87576, -43469, -77081, -80368, -63163, -161, 21629, -16592, -25133, -33045, -59008, -76993, -112664, -53422, 8057, -23199]
17726b3199n5232K0247l862j829M5335m2807N9854L7382k7755M09k4889q48l6109
17713e3303K8585k8296k4370J079K5434l612Q0327K3301J4979k0215m8092o7584
17701g1767Q492q769l9536n062L1435M134J7227K2232l4520l1846J7384P8398
17689a2198k149p3270j264M2039j758L4994j0566l5755k8424r128r186j6559M7265
17676g5959K3547m9953Q13J3469M5374m4607j9723r80K7849N746p565l5965q293
17663a26247N871j6209R8139P8373R266k9552L6833J1774M646j8970j8165K1600
17651E7359J4281K000n6282j05188j8314M6857J5158j3319M3212j1950k5248j6856
17639f8290K0022L2406j5329J4128k722J7083J0505l7277q4559n1688K7492J24819
$$ y = [-23199, -78431, -58184, -62046, -63875, -18540, -61347, -1493, 35889, 8134, 8543, -16346, -17194, -53303, -24718, -53014, -77384, -76305, -50871, -54483, 25844, 49145, 64124, 43909, -4183, -71767, -63275, -72044, -111580, -116642, -85207, -81073, -63846, -41614, -76134, -107980, -90596, -12198, -14347, -87617, -88881, -46842, -48600, -13606, -24172, -59927, -88351, -97479, -106665, -123224, -75959, -52412, -102365, -101552, -88083, -42709, -87316, -107039, -108019, -80170, -74424, -81989, -117954, -126247, -120376, -136585, -38446, 39927, 49193, 19641, 56474, 68248, 72894, 53924, 35759, 57359, 71640, 73640, 17358, -87830, -106144, -59287, -44129, -57448, -14236, -26186, -51434, -68290, -48268, -15862, -31191, -17063, -19785, -2702, 7803, -29474, -114033, -165721, -138229, -13410]
17627a3410J11137J5277J9856j7628n5205l4322O7962Q6335J31445J03956L3934
17616D49337q1574j41150o3224p7913l2868j2100k146k1502o0805Q317L3235J0805
17604H412l2235n5604J9037M0900L8239r062j6867o084k7213P0761R3824J6563
17592A40671L5475N9053P6278J72704K61428J32469r1355j85535j54588j04976
17582C41624j14503r7580j7439p166m3406j11897l2293Q6133K5270m1079j03397
17571a15733l8394L2565k1620J7083L9231P6881N4433n7257O775R7038O6139k3080
17559A34061Q0521J07709Q0046R290n7669o4543j10112j16330l6787J1812P145
17548D5143J1513J6435n5805J8275l0968k7995L2568P069l6513o647L1920K7359
$$ y = [-13410, 97727, 113004, 132860, 115232, 60027, 25705, 93667, 180002, 311447, 415403, 449337, 367763, 226613, 163389, 85476, 52608, 40508, 38362, 16860, -43945, -35628, -2393, 8412, -23823, -79427, -60390, -19490, 18749, 9687, -7180, -13264, -40477, 30284, 124108, 140671, 176146, 235199, 311477, 484181, 745609, 878078, 786723, 601188, 446600, 341624, 227121, 129541, 112102, 104936, 61530, -50367, -82660, 3473, 28743, -12336, -115733, -154127, -121562, -143182, -126099, -86868, -9987, 44446, -12811, -6036, 91002, 157141, 134061, 214582, 322291, 402337, 411627, 353958, 289415, 179303, 62973, 26186, 37998, 45143, 56656, 73091, 17286, 35561, 4593, -23402, 9166, 16235, -20278, -26925, 4995, 32354]
17536C2354N640l663n9892k1601M7772M3042q2986l3521N0524K6009p838J2639
17524H479l8708l5610j1033n211k193J3388K4982o576m9262j4787K6622K8204
17512f1705l084K4199Q5110N4219J3414q4936p2887l2248o0729M3025N8911K8485
17500h226O6178r660k8566L943l3654o085K9431K8127j3818l9978k2487l8255
17488g3050K3196K2997j5943q836J4919l6206O5468q966n2533m391K6218R764
17476c7363k4693J4933N4378L4480k2241j5701O66L0387R241l4626r786l0366
17464c0691J2597R680J2571R4263K2808j6255K5489J20539K31718K83530J26279
17453H92528m7603k47257k56147j17526n1180m6835R355J05288O5400J04001J36512
$$ y = [32354, 37994, 34331, -25561, -47162, 610, 43652, -39334, -72855, -22331, 3678, -4160, 8479, -30229, -65839, -76872, -82083, -84276, -70888, -45906, -52482, -101744, -116531, -89909, -61705, -64789, -40590, 44520, 98739, 112153, 27217, -45670, -77918, -138647, -95622, -36711, -8226, 57952, 48292, 19726, 23669, -9985, -16070, 13361, 41488, 27670, -12308, -34795, -73050, -49854, -26857, -42800, -51636, -36717, -72923, -7455, -16421, -68954, -73345, -47127, -37363, -62056, -47123, 7255, 41735, 19494, 3793, 4459, 34846, 44087, 9461, -325, -30691, -18094, -8414, 4157, 98420, 121228, 104973, 130462, 251001, 482719, 766249, 892528, 844925, 597668, 341521, 223995, 172815, 125980, 135335, 240623, 306023, 410024, 546536]
17442E46536M397j15281j53072j03289r1386q0059k0192K3188K9127K6362n3262
17431A3069o9104r0173J6343P2746O7408M6097j4307K2202k7100k71p0531n9619
17419i3240M3708j3334j3842o849O3846P3734K3128k0829L1504L213O4341J53381
17407C08761K74447K00065n92j83789j85986j43319n9845r2230n2742k4856k7167
17396A2747L6090P0600L5384r3341o2422k4035j1697M6090j0798k9768k0150l5418
17384h6718m639k846J1614J8582O4812J8960m625n3354K5652L0077K5549N9045
17372A02109n4607p8361l4870K4537Q848J3451J0162Q1590P812l0930j3169n6541
17360a9969r783O3122P2451M2465P0868K13105K21981R2402j02801k47786j92298
$$ y = [546536, 550933, 435652, 282580, 179291, 87905, 7846, -12346, 10842, 39969, 66331, 13069, -56035, -146208, -129865, -57119, 10289, 56386, 42079, 64281, 37181, 36910, -33621, -93240, -49532, -62866, -76708, -83557, -19711, 54023, 77151, 56322, 87826, 91039, 155380, 308761, 583208, 783273, 782681, 598892, 412906, 269587, 209742, 117512, 64770, 39914, 12747, 48837, 119437, 154821, 61480, -942, -24977, -36674, 9416, -1382, -31150, -51300, -86718, -91357, -94203, -82589, -64007, 805, 19765, 15140, -38214, -12562, 17515, 43064, 102109, 47502, -30859, -65729, -41192, -32344, -18893, -8731, 72859, 80671, 49741, 36572, -19969, -29752, 33370, 105821, 148286, 219154, 432259, 654240, 746642, 643841, 396055, 203757]
17349B03757o9062K777K3412m9862r3463k4018j7315J8619M5249m6054O010R006
17337I056p3376l0153J5197k9776L2516m258J2902J6129p416o024l4664J8385
17325h1482M5744j2067K3485l013K0456p23J4367J6380l700n694j358N9516p391
17312F4520l2979Q3539O7476M5931m7922N7208K21315J85585J2715r5741j70932
17301C90715j18504q3188p6880n1490m5728k7294m4597p425l5242K0907K2722
17290e6004n4207l4427N9466K4317K4464l6038l3911M4453K7333K4045O3436P876
17278F0803k5790k7639m1066l8509M0437j790o1374J4807J4337K8647k2914l6331
17266i6382J5027M2005k7448J4346N0246N3691m1074k2457n8478l1987N7123l048
$$ y = [203757, 134695, 137472, 160884, 111022, 17559, -6459, -23774, -5155, 40094, -5960, 50, 9056, -64320, -94473, -79276, -109052, -76536, -80794, -67892, -51763, -59179, -65203, -99867, -81482, -35738, -47805, -24320, -27333, -6877, -7600, 6767, 23147, 19447, 13753, 12395, 71911, 64520, 31541, 115080, 182556, 228487, 180565, 237773, 459088, 644673, 657388, 561647, 390715, 272211, 189023, 112143, 60653, 14925, -12369, -56966, -64391, -99633, -78726, -56004, -110211, -144638, -85172, -60855, -36391, -72429, -106340, -61887, -34554, -10509, 52927, 60803, 35013, 7374, -33692, -72201, -31764, -33554, -94928, -80121, -65784, -37137, -60051, -96382, -81355, -39350, -66798, -52452, -2206, 51485, 10411, -12046, -70524, -102511, -45388, -48436]
17254d8436j2219O09J3522j672K302n516k3487k906k506J1802o272N2960p1893
17241i3712l9051J7699O5297O2107p038m2074l9787l2733J0187k9021n883M601
17229a29408O4951P3817J7027L696J559K6385l1195k7483j9234n7261j9994P488
17217h9652K5174J6972l0793j7619k4114r277n4528l3629K1791N6308K8816l3323
17205a43874L4282M2731K4289K0721K632L854k0240m2909j0767K4911j81k8661
17193i3212L957l811M6298N448j7499q69j9921L0478L4534j2796k8623p323L5842
17180b7497J6711K1079l8589j0196j5898j3015J5727L9575j0798l5635K320N2475
17168c741q6440o2056P5686L6538P103j010J0148k6622L7109K3276l0854M409
$$ y = [-48436, -60655, -60046, -46524, -48196, -45894, -51410, -74897, -77803, -80309, -68507, -74779, -21819, -93712, -132763, -115064, -49767, 12340, 5302, -36772, -76559, -109292, -99105, -128126, -134009, -129408, -64457, 9360, 26387, 30083, 31642, 58027, 26832, -651, -19885, -77146, -97140, -89652, -64478, -47506, -78299, -95918, -120032, -129309, -183837, -217466, -195675, -139367, -110551, -143874, -109592, -66861, -42572, -21851, -19219, -15365, -35605, -78514, -89281, -64370, -64551, -93212, -89255, -93066, -46768, -41320, -58819, -59688, -79609, -49131, -14597, -27393, -56016, -63339, -27497, -10786, 10293, -28296, -38492, -54390, -67405, -51678, -12103, -22901, -58536, -56216, -3741, -90181, -152237, -76551, -40013, -32910, -33920, -23772, -50394, -13285, 9991, -20863, -16454]
17156a6454L8163j6118K5824m0749k520J6902m2985l4690P0813j2582p467k5704
17144d7567p6274R958Q6648K3865j6030o5137j1500Q9115P2369J4236l2251m3909
17132C523n8013k3039J4230Q710m0378K3062O6694J457k7888l9965l0703J5732
17120h6578M0820m223j8731l6602j911k466J9053N9361j1135q646j7070k751N1480
17107a9399m1141k5638N000J7984N3122K8162m3634j7279J3889l1155M7526L4060
17095B1497m3698k8347p532k2550O410k3763K289R608J9871K7395K7394L2126
17083B0700l9173l5145l6456N308K8891L7318N872j9659q038O2475O3302q357
17071G7038j23181l4813L9226m0028o532L5143O7148K8305m9449j00227k5858
$$ y = [-16454, 21709, 5591, 31415, -9334, -11854, 5048, -37937, -72627, -1814, -14396, -21863, -47567, -123841, -113883, -27235, -3370, -19400, -84537, -96037, -6922, 65447, 79683, 47432, 3523, -54490, -77529, -63299, -54589, -94967, -71905, -5211, -3754, -31642, -71607, -102310, -86578, -45758, -49981, -68712, -105314, -107225, -109691, -90638, -31277, -42412, -51058, -68128, -70879, -19399, -60540, -86178, -81178, -63194, -10072, 18090, -25544, -42823, -28934, -60089, -12563, 21497, -22201, -50548, -58080, -80630, -74220, -97983, -95694, -86086, -66215, -38820, -11426, 20700, -18473, -53618, -90074, -84766, -55875, -18557, -12685, -32344, -40382, 22093, 85395, 77038, -46143, -80956, -41730, -81758, -88290, -53147, 14001, 42306, -7143, -107370, -133228]
17060a33228L1746K394O4988L6823j3184R354M0978j3601j1548K6708K6964N536
17048G3930j9273o3661k606j054j4569m1710r428N818j5145O8181L3529k6775
17036a2763k4230j7746J5613K2183r0070k3007M9501j742K3947K5495m7503M933
17024g5389p845K9555j0961q268K9248N839L5306J4695l4878k1706q585j1030
17012f4019k1493q96K2635M5497L4035L5924j1294o0884m8954l1507M9479J8776
17000c2701r928l3966q878m058K5028j0515J4353L1378j2806l2047J9777M8399
16988e964J8026j9154J3136K1866k061n2893k4922k2772N4540j2182J1638l913
16976b4655j131j4128k6514J9037l0817l2604q505K301N3836M0574n014j2690
$$ y = [-133228, -101482, -99088, -34100, 2723, -10461, -1107, 39871, 26270, 14722, 41430, 68394, 73930, 54657, -9004, -11610, -12664, -27233, -68943, -78371, -72553, -87698, -19517, 14012, -12763, -36993, -54739, -39126, -16943, -107013, -130020, -80519, -82261, -58314, -32819, -80322, -75389, -83234, -53679, -64640, -72908, -43660, -37821, -2515, 12180, -22698, -44404, -52989, -64019, -85512, -86408, -63773, -18276, 15759, 51683, 40389, -20495, -69449, -100956, -51477, -32701, -42629, -76595, -85473, -89531, -64503, -75018, -60665, -29287, -42093, -74140, -54363, -5964, 12062, -7092, 6044, 27910, 25849, -27044, -51966, -74738, -20198, -32380, -20742, -24655, -25786, -39914, -66428, -47391, -78208, -110812, -119317, -117016, -63180, -22606, -27620, -40310]
16964d0310K8008O5642J3914o1060Q585M1766m3499l7856l084K569J7457M065
16952c803j7174l5213o7233k3974O9830M5260K9861l873P815j7518L378O9300
16940E6656L9579O243l3052l6286j5755j0002M923J3168k1026M4664j3571o1656
16928b6115J2808N042M0939N0250m2318l7990J9305O015O791k2463n3016l9656
16916h0408J3615l4396r033K76J57N4518R1608M3852n1634J8971O029P943j2461
16903D9037j0006o163k8254n7863l7850p509n701K2614L5709L723j1957P413M527
16890d2280m1161j5585L1299j0965P7581N8786n1629n8414j4094K9201L3051M754
16878E44n0461J5200j7538J6300q4160l9629M6574K1506j5145k0594P880M6440
$$ y = [-40310, -12302, 53340, 67254, 6194, 14779, 56545, 13046, -24810, -27894, -25325, -7868, -3803, -20977, -56190, -123423, -147397, -77567, -32307, -2446, -6319, 1496, -16022, -12644, 56656, 96235, 102478, 69426, 33140, 17385, 7383, 12306, 25474, 4448, 49112, 35541, -26115, -13307, -8265, 32674, 82924, 40606, 2616, 21921, 27936, 34727, 12264, -40752, -80408, -66793, -101189, -110222, -109946, -109789, -55271, 36337, 80189, 28555, 47526, 53555, 61498, 49037, 39031, 32868, 4614, -53249, -91099, -98608, -104309, -81695, -45986, -42263, -54220, -46807, -42280, -83441, -99026, -67727, -78692, -1111, 57675, 6046, -52368, -66462, -37261, -4210, 544, -49917, -34717, -52255, -35955, -120115, -159744, -113170, -91664, -106809, -127403, -119523, -73083]
16866g3083K0769m3438Q636L5982k5727j9870j3434O6989J9888j1193M5881O926
16854A8326j4349j2122J0735k1624n2264l989N2396K254j7022k0562j155L1028
16842b8348l6519N511L3819k2983M8688K2282j2407j8245P079P170K4922j030
16830B9939p25j1128m3870N731l7925l5288Q690J9996K4475l6434K4415J5460
16818c6664K5125P813L6472k7471M493n031k81K3080q178Q59k8533m2439l6584
16805h7339j4253m1245k9658L7198Q0200L0471L2446J2473p656j8782k0855R4054
16793F7054M34m5743o3134k894K6230O9704P890J2250j8529m7988K7730n39l6220
16780c755n5047K7479N4904K270m4906p7236L008L7092k9502J0993L7307J486
$$ y = [-73083, -52314, -95752, -87116, -51134, -76861, -96731, -110165, -43176, -23288, -34481, 11400, 18326, 3977, -8145, 2590, -19034, -71298, -75287, -22891, -20637, -37659, -58221, -59376, -28348, -64867, -59356, -25537, -48520, 168, 22450, 10043, -8202, -1123, 6047, 30969, 29939, 29214, 18086, -25784, -20053, -57978, -93266, -84576, -64580, -40105, -76539, -52124, -36664, -11539, -3726, 32746, 5275, 9768, 4737, 4456, 27536, 19358, 20217, -8316, -50755, -87339, -101592, -142837, -172495, -135297, -55097, -24626, 7820, 20293, 12637, -6145, -27000, 67054, 67488, 21745, -41389, -44283, -18053, 51651, 59541, 71791, 53262, 5274, 33004, 32465, -3755, -58802, -31323, 23581, 25851, -19055, -96291, -93283, -56191, -85693, -74700, -37393, -35907]
16768c5907l1723M937k2980L700K4831L9801J8273o6137R040J0745L6295J3427
16756D302j6441J4263L1014m2568j7866k316Q369m502J0221m1517K0527l2321
16744f8835L8361J6756M3063k5581m8415j3364j8863J2373k1373K4351O0613Q905
16732G991j6745j258k568L4083q407m3113j5229j9330k571K9734M5928J123l2572
16719b2934n6550k2759p924N7491K5069J0064J3540n131J4m6748l3282K3001L7273
16706b8876K257j6217J5165n0775o2924m200J17149K7406J6918L0531l0315l9282
16694b3163J3624q799k3905l4464O0069L4852j5400l4638l9447m2130m6209K8662
16682a30948N8307l739l695K0356j051m4049K366K684K7698l2724k3406j0990
$$ y = [-35907, -67630, -62693, -85673, -81973, -57142, -17341, 932, -65205, -56165, -45420, -9125, 4302, -12139, 2124, 33138, -9430, -27296, -29612, -21243, -25745, -15524, -57041, -36514, -68835, -30474, -13718, 29345, 3764, -44651, -58015, -76878, -64505, -85878, -61527, -914, 7991, -8754, -10012, -12580, 21503, 13096, -30017, -45246, -64576, -67147, -37413, 8515, 9638, -22934, -79484, -102243, -110167, -52676, -27607, -17543, -4003, -9134, -9120, -55868, -89150, -66149, -28876, -26619, -42836, -27671, -78446, -141370, -145570, -28421, -1015, 15903, 46434, 16119, -23163, -9539, -18338, -42243, -76707, -16638, 18214, 2814, -31824, -71271, -113401, -159610, -130948, -72641, -76380, -80075, -59719, -60770, -104819, -102453, -99769, -72071, -104795, -128201, -139191]
16670a39191M3277L3809n5583q7369K5192M4865k1912J8257M3355N0660j0969
16659e5609j09000L3769L841O5690P0621K0909k4794j7839K5423L814l4715m3051
16647f0941j7594M5718K6073L481k0960L5852j849r970M2565R7415k4449o7409
16635D7932p3929k8579K3289J8118m8632p485K0293j7487Q8601J29o372K6995
16623D2873l7298l5117k8601m3092k8312N7781J7778J5774M8320J837o3278J0402
16611d0933J3855j1126N83M5665k300o4901l4634j15M131M0549m4729O888L7051
16598e0016M4211K5495n8959O6p040P4959M4824k4546m8610K7054L3686l1696
16586B9428j9662l5776K4986j6036L406j8257j4068J3306j2300j10053j2594Q155
$$ y = [-139191, -95914, -62105, -117688, -205057, -179865, -135000, -156912, -138655, -95300, -44640, -55609, -164609, -130840, -126999, -61309, 9312, 30221, 5427, -12412, 13011, 16825, -17890, -60941, -78535, -32817, -6744, -3263, -24223, 11629, 9780, -190, 42375, 139790, 115341, 47932, -25997, -54576, -31287, -13169, -61801, -69286, -48993, -66480, 22121, 22250, 15878, 42873, 5575, -29542, -58143, -101235, -129547, -71766, -53988, -38214, 10106, 11943, -51335, -40933, -27078, -38204, -37621, 8044, 5744, -59157, -93791, -93906, -89775, -49226, -93955, -87067, -50016, -5805, 19690, -39269, -39203, -46243, 28716, 73540, 48994, 384, 27438, 61124, 29428, 9766, -26010, -1024, -17060, -13654, -31911, -45979, -32673, -44973, -155026, -167620, -159465]
16574a59465J5521j1078J4406P2658L8760k7035q132L9843k5419l5915P618J6820
16562f1418r840l6526J9344K3462L7909M589K184Q870K7839q719K1902l393n475
16549B0728Q265M2013O424n0923m1591M4310J2470q7485m1959O2284j2836J014
16537c7286P792m3442n1256O212M8804J3247l6544n5146K3882K5357k3725J2461
16525a09644K1024Q6897K018m2157l723n720N086L9206j8595K1344Q131j9963
16513a6096l7057m3301M5279O5721j479M173K5144j1570J1918j0184k3859o685
16501B004k2993k2156p829p465Q62J5525J7371K1097j198j6721J1447j268l4693
16488d6017L4118P817p7585K98K576k4978J1833J5408K7824k1367l9758L3682
$$ y = [-159465, -143944, -155022, -140616, -67958, -29198, -56233, -64365, -24522, -49941, -85856, -78238, -61418, -71258, -107784, -88440, -64978, -27069, -22480, -20296, -11426, 16413, 7694, 29596, 26203, 20728, 28993, 71006, 77430, 26507, -15084, 29226, 41696, -45789, -87748, -25464, -38300, -37286, -29494, -72936, -124192, -117980, -69176, -55929, -92473, -147619, -123737, -98380, -122105, -109644, -88620, -1723, 295, -41862, -45585, -51305, -46219, -7013, -25608, -4264, 3867, -16096, -53153, -96454, -51175, 14546, 13067, 17240, 42384, 30814, 42732, 32548, 8689, 2004, -20989, -43145, -50974, -58439, -57577, -42052, -24681, -3584, -4782, -21503, -10056, -11324, -46017, -11899, -4082, -81667, -81369, -78793, -103771, -91938, -76530, -48706, -70073, -109831, -76149]
16476g6149N6575L0151K7346J9833J9566n1364l883m820m210j8439k254j8195
16464b5843l479K7113n0986Q123l018J6454L1952o267L2194K2859k0670k8160
16452B72m7999k0476O329J6222K2960J2411L5439K279j265n62K1522k4034p634
16439A5464j8285o275O3355N8104J7629m3441o7360q6779j687J4485j1246K320
16427f3716J4409M0801J7712l275o3035n580J4443m2084K0002L6509k6427J8915
16415d1326J5804N3327k6718k2768Q973J3185r68l2384k7056n829L2424K6351
16403f985L848J8980l4720l3963K6788M0782j6012n4183j3142j0544n8700L1758
16391a06093O4584k1758l3975m156k9206R688J2019M7313M9194L5626K8511l9984
$$ y = [-76149, -19574, 10577, 37923, 57756, 77322, 25958, 22075, 17255, 13045, -5394, -7648, -25843, -29322, -2209, -53195, -45072, -48090, -31636, 316, -5951, 26243, 49102, 28432, 272, -47727, -68203, -61874, -45652, -22692, -10281, 25158, 27437, 26172, 25610, 47132, 23098, 15464, -2821, -9096, 54259, 112363, 129992, 86551, 19191, -67588, -69275, -54790, -66036, -63716, -49307, -8506, 9206, 5931, -57104, -62684, -48241, -90325, -70323, -33814, -60241, -41326, -25522, 27805, 1087, -21681, -12708, 477, -491, -32875, -59931, -65760, -33336, -6985, -3137, 15843, -18877, -52840, -26052, 14730, -1282, -55465, -68607, -79151, -137851, -106093, -41509, -63267, -97242, -101398, -130604, -120916, -108897, -61584, -12390, 23236, 51747, 11763]
16379A1763q0984p3093M2607J09031K6910M8099n5998m6391l7641L2120n882J6855
16367a2604j3396m755J0517k2328J1556J9547P628K2229l7460l1005K32K6361
16355b3478J7470q994m8068l2796M8412P2879j3169j3780K2801L8562q452o8592
16343a7205J098j997l5160J2692M5142j3313l7091r279N4611j4598r7256k024
16331a14380n808O8570O8470n1058J325N4840j7075J8037k4269N000j3510l5115
16319d4973M2615m543m0708J5623J9794K1321J7156o1114n3618M1179J00376K3575
16307G6683k4778q926k1486k2701q321m426q472K7598k8496R322m9978K538j7778
16294g9221k7549l4591j9744L5464M1635L9865M8049M6182K9862l8500o6819n1940
$$ y = [11763, -69221, -142314, -99707, 9324, 36234, 84333, 28335, -18056, -55697, -23577, -29459, -12604, -26000, -30755, -20238, -42566, -31010, -11463, -3835, 18394, -19066, -50071, -49839, -23478, -6008, -15002, -63070, -95866, -47454, 25425, 12256, -1524, 21277, 59839, 51387, -17205, -16107, -18104, -53264, -40572, 4570, -8743, -45834, -55113, -502, -15100, -112356, -114380, -120188, -51618, 16852, -34206, -32881, 21959, 4884, 22921, -1348, 3652, -9858, -44973, -2358, -6901, -47609, -31986, -12192, 9129, 26285, -34829, -88447, -47268, 53108, 76683, 51905, 42979, 21493, -1208, -9529, -13955, -22427, 5171, -23325, -14003, -63981, -61443, -79221, -106770, -141361, -161105, -125641, -84006, -44141, 3908, 50090, 79952, 41452, -25367, -77307]
16282g7307j124j5663R611j4824K512K0792j5016M6662J8276l1512K3428Q562
16270b5603Q1779j5082l3078O8728k1514j06705m4740L0715K6477Q109K2517j1064
16258a9461K6387O871K2268m0562m310n164o6569k1493K7933R9064O7715M72j09635
16245a6484o0838L7686M1304K9263k396m2248k2467J4629P1504p382m3077K9929
16233B9423j5750o0726j4508K4421L1327K5432M1654n127l0836m5790k0376p416
16221d8272n8051o6836M5858L3601J3425P2594o356L0495j8172l5745N941L3047
16209A529j9100n6107K5443j5774J2183L0442L930n7664K5012j040N1574J3048
16197A3476k926Q23j6274n538k3898k370N099j9084j1398j269J5459k6046j6665
$$ y = [-77307, -78431, -94094, -84483, -99307, -96795, -76003, -91019, -44357, -26081, -57593, -34165, -25603, 56176, 41094, 8016, 76744, 55230, -51475, -96215, -65500, -39023, -30914, -8397, -19461, 6926, 13797, 36065, -4497, -8807, -13971, -80540, -102033, -74100, 24964, 92679, 93151, -16484, -77322, -39636, 1668, 30931, 28535, -13713, -36180, -21551, 49953, 42571, -506, 29423, 13673, -47053, -61561, -37140, -5813, 19619, 61273, 56146, 25310, -20480, -40856, -48272, -106323, -173159, -127301, -93700, -80275, -7681, -14037, 16458, -1714, -37459, -31518, 1529, -17571, -73678, -48235, -64009, -51826, -21384, -17454, -75118, -50106, -51146, 428, 13476, 10550, 11373, -4901, -10439, -34337, -36707, -31608, -50692, -62090, -63359, -47900, -73946, -90611]
16184i0611k9094K9582J7127j0326M2272L8306j4170j9621l2626P0805J8307m6771
16172b6820k6372l1115K4793K7747l1439p1713J2588P3564l1758j9426j8315l038
16160a21304r485M0137R914M2069O7224k7284L3385l0755l0313k7055J827J3646
16148c7994K4733K526k5733q660n2078K5533L6860K9094j0951l0636k5806l0776
16136a03888Q3260N2283j6628j3150L8298J4782M232J24301K8534k8860R081q4723
16124A07522m1601m9509j8133l0138L542N3027R605O975M7764j1466j58846p2046
16112a53304M3590o943M7806K4495M0239j6735m9515J4184L0263K2318q036p578
16100a9216j6144j5279K1844O6926M210o1922m7261L4904j5042M1500J2958K0343
$$ y = [-90611, -119705, -90123, -72996, -83322, -41050, -2744, -16914, -36535, -69161, 1644, 19951, -26820, -53192, -84307, -59514, -31767, -63206, -134919, -122331, -48767, -80525, -99951, -118266, -121304, -130789, -90652, -80738, -38669, 28555, 1271, 34656, 3901, -26412, -53467, -51640, -37994, -13261, -10735, -36468, -45128, -97206, -71673, -34813, -5719, -16670, -47306, -73112, -103888, -20628, 31655, 15027, 1877, 40175, 54957, 59189, 183490, 212024, 183164, 192245, 107522, 65921, 16412, -1721, -31859, -28317, 24710, 34315, 41290, 89054, 77588, -81258, -153304, -109714, -116657, -68851, -44356, -4117, -20852, -70367, -56183, -25920, -3602, -11638, -19216, -35360, -50639, -28795, 38131, 42341, -19581, -66842, -31938, -46980, -5480, 7478, 27821]
16088B7821O0178q706m0788J1758p000o132l8906n4711l9068l8685j6918L509
16076a47648L8894r197L5815J03211K1005m7826m918o603n2094p173M3168M115
16064b9251L8077L6149l0551K5774O0838n7711n0953j2717l7862n3065q784J6661
16052a03395J5679K1496j4386K888Q2102M0461r4965l19K1639j1896l64M2581
16040A521k4940l5771K5371P2859L0604l3719m2895M2246Q467l0183k8987M6351
16028C0924l9026l4217J2029K5136M4230P4417M4703o0583j18133N511N2256O1989
16016I9236K0022j02804m0345J8913j0264K9660m1784m9843j1856K8475k1517
16005h2107j829M9211N8394o945r020K1120J2812q0058m5924P165J7710L2229
$$ y = [27821, 87999, 79293, 38505, 50263, 43263, 37131, -1775, -56486, -95554, -134239, -151157, -147648, -108754, -117951, -82136, 21075, 42080, -5746, -10664, -17267, -69361, -76534, -33366, -29251, 8826, 44975, 14424, 40198, 101036, 43325, -7628, -20345, -58207, -111272, -120056, -103395, -87716, -66220, -80606, -77718, 4384, 44845, -50120, -50439, -28800, -40696, -41060, 1521, -23419, -59190, -33819, 39040, 69644, 35925, -6970, 35276, 43743, 13560, -15427, 30924, -8102, -42319, -30290, -5154, 39076, 113493, 158196, 97613, -20520, -15009, 37247, 99236, 119258, 16454, -23891, -4978, -15242, 14418, -27366, -77209, -89065, -60590, -82107, -83936, -34725, 23669, 16724, 7704, 28824, 41636, -38422, -84346, -77181, -59471, -27242]
15993b7242q591j1811K776j21j3999J7525K2495Q6975R291m7407J3802J1554L4009
15980H9256o217r6993m8403k440K866k4562K8957L7179Q051J565q7590J8084N0417
15967b9830M6533K7669p657L3844M1053r135l7511k9290l5192K9712L120l9283
15955e967l2671N2342J00725K5222m5617K1345J8695j3996k6278l6738m5644K4098
15943C5516L180j4455o6149m7521M3999N3129J9482j4699J7384o6506J0565p696
15931c3771q793N4004J1821o257N4649J025l9900k5761l8144k5206K2620m7061
15919h0774k293J1266Q3192O4027j4226p7766n4000l0025q062O4618L8903l4357
15907c9497m468J8729R989k2467O181K3511L4722q4429l6766j2838L0788J4528
$$ y = [-27242, -35833, -47644, -44868, -44989, -58988, -41463, -18968, 68007, 77298, 29891, 43693, 55247, 89256, 83039, -13954, -62357, -64797, -61931, -86493, -57536, -20357, -12306, -10741, -98331, -80247, -29830, 16703, 44372, 36715, 70559, 111612, 102477, 64966, 35676, 484, 30196, 33316, -5967, -38638, 13704, 114429, 139651, 94034, 115379, 134074, 120078, 93800, 57062, 11418, 35516, 38696, 24241, -41908, -89429, -45430, 7699, 27181, 12482, 29866, -36640, -26075, -33771, -42564, 11440, 23261, 17004, 71653, 72678, 32778, 7017, -31127, -56333, -33713, -80774, -83067, -71801, 11391, 75418, 61192, -16574, -70574, -100599, -108661, -44043, -5140, -39497, -43965, -25236, -15247, -37714, -31533, -8022, 26700, -57729, -94495, -107333, -76545, -62017]
15895f2017Q1826N8399j1350k0398P70l131M1082l2768M659k447l4691J3147J5133
15882D8214j5173l9189q1613K1085R3797J3577j1990l2587k2146N491N8639N5666
15870I3771k027l4614k9623l6338k2554K7472K9826k7880n0619R149J7666K2292
15858c479n8848K8927n880L9247k53J532m679k4542k5106R873M1177k2090r5969
15845a20090l6988K9200R8791N8346n5566l2744j4306M8463K3204j9271L7223
15834A6262j2853k4809M41k469K0396J5574l9295k22k121J3025O2896M3916m1887
15821D8854l4865O928l6766k4355j3717l2800L0949M921k2162L0456j9763K0234
15809d2086P5274J2583p0523k4213M3944J1010k1615k9088L2389N1271L4746M4583
$$ y = [-62017, 19809, 78208, 66858, 46460, 47230, 44099, 85181, 52413, 57072, 54625, 19934, 33081, 48214, 33041, -6148, -87761, -66676, 27121, 40698, 28708, -3879, -26025, -20534, 38105, 93771, 91744, 57130, 27507, -8831, -31385, -3913, 25913, -1967, -52586, -43437, -25771, -3479, -62327, -33400, -39280, -33, -286, 1246, -3433, -27975, -53081, -43208, -2031, -24121, -120090, -157078, -127878, -29087, 29259, -26307, -59051, -73357, -24894, -1690, -20961, 16262, 3409, -21400, -20959, -23428, -3032, 12542, -26753, -26975, -29096, -16071, 46825, 90741, 48854, 13989, 20917, -15849, -40204, -53921, -86721, -55772, -50851, -73013, -42557, -62320, -42086, 33188, 45771, -24752, -48965, -5021, 5989, -15626, -44714, -12325, 38946, 73692, 118275]
15797A18275J5360k1289q4136p7041m8307K3909K7131J181j8195p1961K192J1152
15785a21729P319J2753J11695K8323j06396r925l874N613J2705k7163k2840J7016
15773i6503N7613J110p0610k5907k614O7927N9218k8445j8439j3256j3394J6973
15761f6327P8109K2341l0732j2754m4618k7661L0434O3180j0160J9592L9385k7365
15749C3424l4418n572k2245n6427J2621N7888M8441J7181j6431J4376l597l9399
15737E842j6299m3774j9598L4140M7542P3578m769j5674j3764M535j7983k4374
15725I402m516P304q307j6498K1348j8097K6077K6458q0261j699N9966L8671j8625
15712D1223o1214N140J8466N9724P5128L4679p6279n6402j299l085m5269o8633
$$ y = [118275, 133635, 112346, 28210, -48831, -97138, -73229, -46098, -44917, -63112, -135073, -132881, -121729, -114410, -101657, 10038, 38361, -68035, -77960, -81834, -76221, -63516, -90679, -113519, -96503, -38890, -37780, -108390, -134297, -136911, -68984, -9766, -38211, -56650, -69906, -83300, -66327, 11782, 34123, 3391, -9363, -53981, -81642, -51208, 11972, 1812, 21404, 60789, 33424, -994, -6566, -28811, -85238, -72617, -14729, 33712, 50893, 34462, 48838, 45241, 5842, -10457, -54231, -73829, -39689, 7853, 81431, 76662, 60988, 47224, 51759, 33776, 9402, 4886, 12190, 3883, -12615, 8733, -9364, 16713, 43171, -37090, -38789, 21177, 59848, 41223, -19991, -14851, 3615, 63339, 138467, 173146, 96867, 40465, 39166, 36081, -9188, -77821]
15700g7821l546P3857j2018k5252J9197P875l7792m8083l9558Q2098J0940k5772
15688g5875O4301J140k7504j8247K0372J6921p4653l2990l5911M8707K4446l9797
15676a29090K2857L0565J3965l2127J2069M4473P8424n0007M457P3064o726l8532
15664B3392m0327j8266M9826M3512L7601o6070J9127k9682q0424o375Q4397K9356
15652D6067m7147K5936L5178j9427K4j1562M9882j0089j6174k0634k5556L6105
15640D2603K550p855l010J3613J9568j1930n1872j5301j0839R601o864J7853j565
15627c448q5471m105M5767R9502P4759n1726o4959K1354M825m453K7537O130o8489
15614b777J3046R369j8373L1864l3031k5162J2971J1352M2984L8599J5607o841
$$ y = [-77821, -81367, -7510, -19528, -44780, -25583, -17708, -55500, -103583, -143141, -61043, -50103, -75875, -11574, -10434, -37938, -56185, -35813, -18892, -93545, -126535, -162446, -113739, -89293, -129090, -106233, -75668, -61703, -93830, -81761, -37288, 41136, -8871, -4414, 68650, 61924, 23392, -16935, -35201, 14625, 58137, 95738, 29668, 48795, 19113, -61311, -67686, 16711, 46067, -1080, 24856, 60034, 40607, 40631, 29069, 78951, 68862, 52688, 32054, 6498, 42603, 45153, 37298, 34288, 47901, 67469, 55539, 3667, -11634, -22473, -12872, -19736, -1883, -3448, -88919, -93024, -47257, 52245, 127004, 75278, 10319, 31673, 36498, 32045, 59582, 65712, -2777, 10269, 19638, 1265, 33129, 98, -25064, -12093, -741, 42243, 80842, 96449, 89608]
15602H9608n1307k64n1524m2820J736Q385k1811L3883N2926k6350k9553J0212
15590b6879N9999l0106l8708K3529j8074k3706m22K3675K1208O5333M1505m8925
15578D8429R38k1561L6486K9943K4971m7586l1783R953N4758j2046k6365l3886
15566C2251l2455k6948j1842R829J6254J1377j9557M0374l669k1989K2834k1867
15554e408k5538M0818N0903J7289n762l8788Q309l7201N5713j1066m1989M300
15542A1580j8323k699K802m0642M361m38J1311n598Q167j531K1081j267j5215
15529b6411K8773j7517p3065l171M6355L0730M4588j8737l282R752j8341n6098
15517e6424J447J4344K1900P017m915O968N5560J3041m9388O7L3108J6297k4524
$$ y = [89608, 38301, 38037, -13487, -56307, -54571, -46186, -67997, -34114, 18812, -7538, -37091, -26879, 33120, 3014, -35694, -12165, -30239, -53945, -54367, -30692, -9484, 55849, 97354, 48429, 49367, 27806, 64292, 94235, 119206, 71620, 39837, 49790, 104548, 92502, 66137, 32251, -204, -27152, -38994, -29165, -12911, -1534, -21091, 19283, 15614, -6375, 16459, -5408, -30946, 9872, 60775, 78064, 72302, 33514, 41823, 4622, 60335, 49269, 7280, 11580, -6743, -9442, -6640, -47282, -42921, -43359, -32048, -37646, -29479, -31010, -9929, -11196, -26411, 2362, -15155, -88220, -91391, -45036, -14306, 30282, 11545, 8263, 18015, -326, -56424, -54977, -40633, -18733, -11716, -16631, -9663, 45897, 58938, 9550, 9617, 42725, 59022, 34498]
15504C4498j8514L6753l057K106n0218j9543K5602N878K8120L7959l9421n6336
15492a6173J3840L1122Q42k5351j6944j67P6991P8680m0594l9514j6486n9336
15480a3090J8943k8119m7271m7122K1350R253l4129L6179L9743N485L2481K9673
15468B3376K1395J2846n745o0736O930O630o651L003K111K5778J3018Q998m0490
15455A0463m7587J9572J4412L5518K2595O8741K7849j3692J3936l6164j4977n5348
15443D5318l3233J2760k3430L6464J59k081j2333m8706j5843j8335K2165K759
15431c4336J7636J1857K3392l4680l0338K6978k793P5191J0376n706m7828k1439
15419a1690m4155k2136J9799O2597l0403k3152P4971L5048J5892L1808q4657l7982
$$ y = [34498, 15984, 52737, 49680, 51786, 1568, -17975, 7627, 13505, 41625, 79584, 40163, -16173, -2333, 28789, 29631, 4280, -12664, -12831, 64160, 142840, 102246, 62732, 46246, -13090, 5853, -22266, -69537, -116659, -95309, -86056, -120185, -84006, -44263, -38778, -6297, 23376, 44771, 57617, 51872, -8864, -1934, 4696, -1955, 1048, 3159, 28937, 41955, 50953, 10463, -37124, -17552, -3140, 32378, 54973, 123714, 151563, 137871, 151807, 115643, 100666, 45318, 12085, 24845, 1415, 37879, 38038, 35957, 23624, -25082, -40925, -59260, -37095, -34336, -16700, -4843, 18549, -16131, -46469, -19491, -22284, 52907, 63283, 57577, 9749, -11690, -55845, -77981, -58182, 4415, -25988, -49140, 25831, 60879, 76771, 108579, 23922, -14060]
15407a4060J8773K7116n2876J9390r176j5930K9006l0954K1860L4687L6736J3113
15395G7685l2415j1940K3153M968R062o6683K8988R09L1517k8523M146K480J6616
15382E9963J4738k724L6053m0553m517P7699J3352l0006M6273L2708o1767J3945
15370A55164J4266j8654k1243k1997l0638m8000p697K0699K3244q168L0803N443
15358I3222m2569K6278k2069l6429l9238p6237R9196N9845K735n2817k8611J8488
15346A794J4699j1172k5432K8925O5521k6074j5914R4976L5192j177J4176k2603
15334A52911l1733M491J0174n6311jL445j2708p0002j2856l9992O5131M6721M7112
15321A06382n211q2421J0622N4024l121m4391n3628K7041K2124Q9839M4548J6769
$$ y = [-14060, 4713, 31829, -21047, -1657, -10833, -26763, 2243, -28711, -6851, 27836, 64572, 77685, 45270, 33330, 56483, 61451, 70513, 3830, 32818, 33727, 65244, 36721, 40867, 43347, 59963, 74701, 71977, 108030, 67477, 62960, 140659, 154011, 124005, 170278, 202986, 141219, 155164, 169430, 150776, 129533, 107536, 76898, 28898, 21201, 41900, 65144, 56976, 87779, 93222, 50653, 76931, 54862, 18433, -20805, -97042, 2154, 61999, 64734, 11917, -16694, 1794, 16493, 5321, -20111, 8814, 74335, 48261, 32347, 127323, 162515, 161338, 175514, 152911, 121178, 125669, 135843, 79532, 79531, 82976, 70268, 266, -12590, -52582, 12549, 59270, 106382, 101171, 18750, 29372, 83396, 80275, 35884, -17744, 9297, 31421, 121260, 165808, 182577]
15309A82577j05370q5390K1017K027j2259j1996K5010L9643O8677k6777n3309
15298D3850Q176M7533M3584k944l4471J9941K9698m88K242k3153o2677m9756M3146
15285F4681j4036m0532L4721k5807k1616P638j1881N2762n6634J487K1427M59
15273A2669N5562M6410j1657m1339M5548L719j6995j7711m7882k9989j6752K0623
15261B206M9389O658l927k7373p7379O430K9651j9958j0163K7529K7675M8767
15249E9505K076l4423n9279k0489n0147N61N5118J0837K4772k5710k6387M1683
15237b1883K020n725K5314K4565N174N1860j4771K0591L2695J9091o4324n2476
15225B2131l2322O359p299P0553p853O035L8382l0136K9119j5006n1989p5085
$$ y = [182577, 77207, -8183, 12834, 14861, 2602, -9394, 15616, 55259, 123936, 97159, 43850, 52026, 99559, 143143, 140199, 105728, 125669, 155367, 154879, 157121, 133968, 71291, 21535, 64681, 50645, 10113, 44834, 19027, -2589, 5049, -6832, 45930, -10704, -9217, 12210, 12669, 68231, 114641, 102984, 61645, 107193, 110912, 93917, 76206, 28324, -1665, -18417, 2206, 51595, 58253, 54326, 26953, -50426, -43996, -14345, -34303, -44466, -16937, 10738, 59505, 61581, 27158, -32121, -52610, -102757, -102196, -47078, -36241, -11469, -37179, -63566, -21883, -19863, -25588, -274, 24291, 29465, 81325, 66554, 87145, 119840, 138931, 74607, 22131, -10191, -3832, -11131, 59422, 51569, 57604, 95986, 65850, 94969, 79963, 27974, -47111]
15213d7111m9306K1274L1170R201m7895m5974R975O7143J4735n7289n327P5925
15201b3479M5288L2231m740k9921K8754M1561n075j6916J6609l7841q7346l6475
15189g7350K1820J2566M062r992J4053N0176J5865m3651K0842K292J1787K1661
15177D4131J3213j4932k9067k4194K8738r0187j9183n0601j6842L3589j7743l7420
15165a80498M1744N0005L9438J0018J7567N2873K2485L471l8148l129L4723K2767
15153G3316k3524j07498m3003j5672K8181N3087J3049M8889K4921j0649l6526
15142D571k4448P025m8466n1016N9296M4732l4143j4191K9605L1779N1369j8783
15130C7330l2468r989m8896n1039K7045N6394m6780l4083N1478Q373q091n7973
$$ y = [-47111, -96417, -75143, -43973, -34772, -82667, -128641, -118666, -51523, -36788, -94077, -99404, -23479, 21809, 54040, 49300, 19379, 48133, 89694, 84619, 67703, 84312, 46471, -40875, -77350, -55530, -42964, -38902, -48894, -34841, 15335, 31200, -12451, 8391, 10683, 22470, 44131, 57344, 42412, 13345, -10849, 17889, -72298, -91481, -142082, -158924, -125335, -143078, -180498, -138754, -88749, -49311, -39293, -21726, 31147, 53632, 57103, 18955, 15826, 50549, 73316, 49792, -57706, -100709, -116381, -88200, -35113, -22064, 26825, 51746, 41097, 4571, -19877, -12852, -61318, -112334, -53038, -8306, -42449, -56640, -27035, 4744, 56113, 37330, 4862, -5127, -54023, -105062, -78017, -21623, -68403, -102486, -51008, -42635, -50726, -108699]
15118a08699j5356M1431J228j1135J5329j4441L985P526L0128J1187l3323m9828
15106a21968M0403O4793K8903J892N872q5728J6218K6782O3699L3385n0596p5476
15094e1821k5497M6213N9171K8791k9254m5023n6696l8626l906j2570j5410Q2331
15082f2297K5758L0339K1902j7749m8805j6480N740P0576o1245k2316q237m2727
15070a25541R340P9476P0803K7687o12n0805j33367n4170J9654M3484J2990k9374
15058a30435O4054J7272J3136K1627k1462l414K5372l8457K0486M8364q905P765
15046A5403L0264O36n321m0159m2290N1917l2306j1446K6437K0129P7884L4818
15034A25966l0843m1470k3701n8755n001J2614P221l2915J6360P747L4750P968
$$ y = [-108699, -124055, -82624, -81396, -92531, -77202, -91643, -87658, -80132, -50004, -38817, -72140, -121968, -81565, -16772, 12131, 14023, 19895, -65833, -49615, -22833, 40866, 74251, 23655, -51821, -77318, -31105, 28066, 56857, 27603, -17420, -74116, -112742, -116648, -129218, -144628, -62297, -36539, -6200, 15702, -2047, -50852, -67332, -61592, 8984, -52261, -74577, -82814, -125541, -116201, -36725, 34078, 61765, 61153, 10348, -123019, -177189, -157535, -114051, -101061, -130435, -66381, -49109, -35973, -14346, -35808, -39222, -13850, -52307, -31821, 16543, 7638, 15403, 45667, 46303, 40982, 823, -41467, 10450, -21856, -33302, -6865, 13264, 91148, 125966, 95123, 53653, 29952, -28803, -33804, -21190, -13969, -46884, -30524, -22777, 11973, 19941]
15022A9941l9040r3j1363N1215J4156j3637l1892M6528L686l463k2541P3761m0315
15009D6943k9942P4385K0833o9109k4526l845k0692l9095m5227K4356N1969M7024
14997C3074j1860p6814M7313N5786l2025m217N8665N7541P661o3689p5724k9503
14985c3792l5877K849N8576K7381K7196J7359o2446n5508l3723N8554L5136J001
14973F706l632k1618K6857J4640j8926l0497P480Q745J4862k9815N0704Q1344
14961A06850j486k8464J269l1717k9373k2401M3475L037n8172l15N7245k593N1159
14948H8514J8388q648o3874m9606Q7788J9328L9736J939q7496n5121j829j6410
14936b7291j9896K1964o0650j34706L897O1238R78R397P1183J11275J0148P705
$$ y = [19941, -19099, -19192, -30555, 20660, 34816, 21179, -10713, 35815, 39501, 36038, 13497, 87258, 46943, 17001, 91386, 112219, 43110, 18584, 14739, -5953, -45048, -90275, -65919, -13950, 33074, 21214, -55600, -8287, 47499, 15474, 11257, 69922, 127463, 135124, 71435, -4289, -33792, -69669, -66820, -8244, 19137, 46333, 63692, 1246, -54262, -87985, -29431, 5705, 6706, 3074, -18544, 8313, 22953, 4027, -26470, -18990, -10245, 4617, -25198, 25506, 106850, 105364, 76900, 78169, 46452, 17079, -5322, 38153, 41190, -16982, -17297, 39948, 37355, 88514, 106902, 98254, 34380, -15226, 72562, 91890, 131626, 133565, 46069, -9052, -10881, -27291, -47187, -25223, -85873, -220579, -216682, -155444, -154466, -145069, -73886, 37389, 47537, 55242]
14924E5242n8077o8352K4130J1524o460M5864M39l1158K9031m880m8910L3862
14912a7745P108k1565j5836L1049L5487p897p276M7455k907m5639O931j8961o5194
14899g4990L6259L4376L5167J8941j0199l9367j7005M338l260J8801L6887P264
14887D7212l7485l0175m2919L1476N2804O3940j1019l2774o4816k7324O255J6229
14875b8596N7148n012j4747M222J1482K0190K4696l2157k8584n4230k5380l0842
14863a01810J5627K1586R909J6340j0521k1038J3196J2113K1175k7269n856o746
14851f3294q271J911O4037o276o3972q424N4469J7854K2995M6217j4705l5073
14839G468r518j3220m9810J7045L0475l9628m0873l900K4169J03086k2451N767
$$ y = [55242, -2835, -71187, -47057, -35533, -41993, 3871, 4310, -26848, 2183, -2697, -51607, -17745, -10637, -32202, -48038, -16989, 18498, 10601, 3325, 50780, 47873, 2234, 9165, -9796, -74990, -38731, -4355, 30812, 49753, 39554, 187, -16818, -12480, -15740, 3061, 39948, 47212, 9727, -20448, -63367, -31891, 20913, 84853, 73834, 41060, -23756, -51080, -44825, -28596, 28552, 23540, 8793, 13015, 24497, 44687, 69383, 37226, 8642, -45588, -70968, -101810, -86183, -64597, -54688, -38348, -48869, -69907, -56711, -44598, -23423, -50692, -56548, -63294, -71565, -69654, -5617, -11893, -75865, -84289, -29820, -11966, 11029, 57246, 42541, 7468, -2050, -15270, -65080, -48035, -17560, -57188, -98061, -101961, -77792, 25294, 2843, 8610]
14827H610O556q592R08n98k0119l410K858k4569J7494K7402K6578O080j0688j3163
14813A5347J0130m730j8532j0732M8029M0465j4420K2443P76n5692J7906J7099
14801F8089k6762l2233l6467J1857K8923k2443o1312O0707P231l3238j8522j4249
14789f8419L6878L3453j1534M2453J1268k2509O0987N9578k3505n6688o1218l6151
14777c5407N4231k9423m1590O5761K7799J9708l3125l7288J3237L5174k2496P0706
14765H7287M5940q024o1826l6928K3349J4283R291K0451K3328R030n6734k9894
14753C9553J4518P78o0583k4059J4865J49o306N1321j4562J6761k0993R142K4706
14740D5290J6606j0677J7634N888k7813L565M082k6723L9892L0850L0935j1988
$$ y = [8610, 15166, 6574, 7482, 6884, -13235, -16645, -13787, -38356, -20862, 6540, 33118, 39198, 28510, 15347, 25477, 20747, 2215, -8517, 39512, 79977, 65557, 88000, 88776, 33084, 50990, 68089, 41327, 9094, -27373, -15516, 13407, -9036, -70348, -9641, -2410, -35648, -54170, -68419, -31541, 1912, -9622, 32831, 44099, 21590, 82577, 142155, 118650, 61962, 744, -35407, 18824, -10599, -52189, 13572, 41371, 61079, 27954, -9334, 3903, 39077, 16581, 87287, 133227, 125203, 63377, 26449, 49798, 64081, 73372, 93823, 117151, 126181, 69447, 39553, 54071, 54849, -5734, -29793, -14928, -14779, -21085, 30236, 15674, 32435, 11442, 20584, 45290, 61896, 51219, 68853, 74741, 46928, 50493, 54575, 27852, 67744, 98594, 129529, 117541]
14728A17541L0682m9220J6003j0762k5393L443m336k134K3808q9882l2064O5582
14716D3268L1297l1116l5473J0554M4068O248l9537p248N6692N3372k7449n9767
14704D4909n9037k5299K584J101l341Q798K3935N1927N4065m4026J2039L4175
14692A01830M714l2326N6153k8745K3324M2829m1324l5923j9704k4262q145k4929
14680A3492J0109k0024k6625n6033O243K7129J3849o7908K878O9002O0256j7572
14668A4796L2047n221k9772r690j7539j4737J7042j0096O337P682o172m1025O2527
14655F179L1269m0348l6636r58Q0156j9694q767J6336j7903j0241N6661j4646
14643D1408J165K7736O72q483o0255j9383K8003J5709o3012j2422j308j4377J8649
$$ y = [117541, 148223, 99003, 115006, 104244, 78851, 82294, 77958, 75824, 99632, 9750, -22314, 43268, 74565, 43449, 7976, 18530, 62598, 68846, 29309, 22061, 78753, 132125, 104676, 44909, -14128, -39427, -36843, -35742, -39083, -30285, -6350, 45577, 99642, 55616, 67655, 101830, 106544, 74218, 130371, 101626, 124950, 167779, 126455, 90532, 70828, 46566, 38421, 13492, 23601, 3577, -23048, -79081, -72838, -45709, -31860, -99768, -96890, -27888, 32368, 14796, 46843, 41622, 11850, 2160, -15379, -30116, -13074, -23170, -16833, -9151, -15323, -56348, 6179, 37448, -2900, -39536, -40494, 39662, 19968, 11201, 27537, 9634, -607, 56054, 41408, 42573, 70309, 70981, 62498, 2243, -17140, 10863, 26572, -36440, -48862, -50170, -64547, -45898]
14630d5898J1515K4351R650l060j1912k6575R649N5507K8235l3142j9039l239
14618c958j7352R568J431N3782m2809J4628L8850l8183j8161k56k6755J4623L9408
14605B4816j4495k9125k5577M5052K5458J9947l0028n3347l3684l0986n124L8692
14593f8401K7157m80N44j1683j2363N223m712M3704L2813k9403n8819j4083P8067
14580a2436L9983j023j5417J3903l2404K3066J2338l6391l8006l966O4437J8472
14568C2556J794J6410L6947m2510o880k1581l2120m0893l098L1310j1701j4188
14556e3954J812J4830N1246l8320J664O6920k4039n1300k5640R171J5563j9689
14544e1736j8261O4163P9333j831l7101j05350l6791K0232N4711J7162L0696j1662
$$ y = [-45898, -34383, -10032, -382, -3442, -15354, -41929, -32280, 23227, 51462, 18320, -719, -3958, -21310, -11742, -10311, 43471, 662, 15290, 54140, 15957, -2204, -2460, -29215, -14592, 24816, 10321, -18804, -44381, 671, 26129, 46076, 16048, -37299, -70983, -101969, -107093, -68401, -41244, -41724, -41180, -52863, -65226, -60003, -64715, -21011, 11802, -17601, -76420, -90503, -12436, 27547, 26524, 11107, 25010, -7394, 15672, 28010, -8381, -46387, -50353, 14084, 32556, 34350, 50760, 87707, 45197, 38317, 16736, -15384, -56277, -59375, -28065, -39766, -53954, -52142, -37312, 13934, -24386, -22722, 44198, 20159, -31141, -56781, -47610, -32047, -51736, -69997, -5834, 73499, 71668, 34567, -70783, -107574, -87342, -32631, -15469, 15227, 3565]
14532C565J1962k2322k6611o2280J2037K2629K796J2947k572J4592K5712N614
14520a931n372L230L7192L6754l3562p7159K4436K1641M446K7840K4494o073q924
14507D7012N0276L2305j3347k3420J3189j9013j583l1573l098K5312o608K9399
14495I8851R067k2442o443L4232K4947n4038n2955j6751j5114J16K2736K3920
14483D6126K3794l4410m3374K9969K9997q321J6337l1718m0652J0290j3008m8302
14471f3272J7406M0260m2844k4229m0707k5022L3480L6381L7808q778l9810k0136
14459i9463K5495L6574M1755J3288l9001k788J20073K4620q2688j05186O5102
14448b219P4482M2706J8483l7352m2017o9872j0018M0747j1554l9426j2389j8173
$$ y = [3565, 15527, -6795, -33406, -95686, -83649, -61020, -58224, -45277, -47849, -33257, -7545, -1931, -7303, -4073, 33119, 69873, 36311, -40848, -16412, 5229, 9675, 37515, 62009, 55936, 47012, 97288, 129593, 116246, 92826, 106015, 87002, 85419, 53846, 50748, 76060, 69452, 98851, 107918, 85476, 79033, 113265, 138212, 84174, 31219, 14468, -646, -530, 22206, 46126, 69920, 35510, -7864, 22105, 52102, 43781, 60118, 28400, -12252, -1962, -14970, -63272, -45866, -5606, -48450, -72679, -113386, -138408, -104928, -68547, -30739, -39517, -79327, -99463, -73968, -37394, 4361, 17649, -21352, -24140, 95933, 120553, 37865, -67321, -2219, 72263, 114969, 133452, 96100, 54083, -15789, -25807, 14940, 3386, -36040, -48429, -66602]
14436f6602m4678N434M9274K6581j2896j0608m612M337L4112j3308k5006l2512
14424i0484P819J7405R3199L860m3349o3639j3067O7404Q9157m6577l0886L2762
14412B3604o4736O4743J41033j2694j26689o6283L723J8286l1634J6259J769L3136
14400E17P957J4273J6932J4542K9035n7146j2830j9689q6966j0603M6962Q2795
14388B5779M8937m02n7202L0304k9569o185J2091q767r9581o4443O3071O5437
14376b0530Q7942K9871o2268j5036J8689L5656J8570Q119j3028k7276j1230l322
14364D6157l0643l9325P486L8846n197M064K8433L2264p5609M353Q164k8150j9346
14351b8503M5377J4506q4791m8871O1080M3822K1527K568N666J637l6047L6086
$$ y = [-66602, -111280, -105846, -56572, -29991, -42887, -53495, -58107, -53770, -19658, -32966, -57972, -90484, -82665, -65260, 27939, 31799, -11550, -75189, -88256, -20852, 68305, 21728, -9158, 23604, -41132, 23611, 164644, 151950, 25261, -41022, -37299, -19013, -50647, -34388, -32619, 517, 8474, 22747, 39679, 54221, 83256, 26110, 13280, -6409, -93375, -103978, -57016, 25779, 74716, 74314, 17112, 47416, 17847, 11662, 23753, 14986, -84595, -149038, -85967, -20530, 67412, 97283, 35015, 19979, 38668, 74324, 92894, 101013, 87985, 60709, 49479, 46157, 15514, -23811, -16325, 22521, 17324, 21388, 49821, 82085, 6476, 10829, 18993, -9157, -28503, 16874, 31380, -53411, -102282, -41202, 2620, 24147, 26715, 32381, 34018, -2029, 34057]
14339C4057J779Q938k8122j8792q55k0818M1983L7094m2447o48J0380k9639L413
14326c677k175k2124k7681j1849O1036N2563J9651m3385n0436m6599L6041L2216
14314f419Q880m3444L190L1649L4928l5097L6888M380J358J3555J9801n6665k3843
14301a0839L9582M591L6220m5437o0196L7183m3974k168L5210R7531k1801r7955
14289c2053R700N7021k239l6509L2798K333j4100N506K1705J2004j5261m2660
14277a755M9974K8341k4390m4085K9560L1649p578l258K815p0021M4862N2030
14265H8144M678r402J2851j4772n1325n7370l5142J5323M9279O3832n7674M694
14253A3116L6551M662q2452j3473J9551K1114K0577J4902O362m5061m2961M1214
$$ y = [34057, 35836, 44774, 16652, -2140, -2995, -23813, 18170, 55264, 12817, 12169, 22549, -7090, -3677, -5852, -27976, -55657, -67506, -6470, 46093, 65744, 22359, -28077, -74676, -38635, -6419, 2461, -40983, -37793, -6144, 28784, -6313, 30575, 34955, 36313, 49868, 69669, 13004, -10839, 28743, 33334, 69554, 24117, -36079, 1104, -42870, -45038, -9828, 87703, 65902, -32053, -22353, 34668, 32429, -4080, 28718, 31051, 16951, 22457, 44162, 56166, 40905, -1755, 48219, 76560, 52170, 8085, 37645, 69294, 61716, 58458, 61273, -8748, 36114, 88144, 92822, 83420, 96271, 81499, 30174, -27196, -62338, -47015, 2264, 66096, 8422, 13116, 49667, 54329, -28123, -41596, -22045, -931, 19646, 34548, 40910, -4151, -47112, -5898]
14241e898J1977j1870K5605O32J649j5808p2035R241M2540K6696l2376j5065Q439
14228b6273O659j40N46j0679L1588M8226N2353j8803o3629m2514m549m795K8910
14215c100M0381O5102J2348l0782N1325k9455n8950K0367k2733m0413l0165N3983
14203B7908J7172N78p613p134k963M3974R871N543J8146J7148J396k5655j9568
14190G8803K8887J9468l0032k2425k57l8171n6546l9480P7239J5121J1051j4376
14178B9282n0237j2243M2135N9295M6823K2782K9889l6886j1907n7778l4013R114
14166C6256o0l8562R639k8583l4762K5070j2799p3900J4586M4692N6294R213J7197
14153B4281K9417O088q348J4740M9040Q757j2164k8522p6692n5273L7582L0440
$$ y = [-5898, 6079, -5791, 19814, 20446, 22095, 6287, -65748, -56507, -13967, 12729, -19647, -34712, -26273, -19614, -19754, -19208, -29887, 1701, 49927, 102280, 83477, 19848, -22666, -27215, -32010, -3100, 37281, 102383, 114731, 83949, 135274, 105819, 46869, 67236, 44503, 4090, -26075, 27908, 45080, 45658, 38045, 30911, 27948, 71922, 81793, 87336, 105482, 122630, 124026, 98371, 78803, 107690, 127158, 97126, 74701, 74444, 36273, -20273, -59753, 17486, 32607, 43658, 29282, -20955, -33198, 8937, 68232, 115055, 137837, 167726, 130840, 118933, 61155, 27142, 36256, 36196, -2366, 7273, -21310, -56072, -31002, -43801, -117701, -103115, -58423, -2129, 7084, 24281, 53698, 59786, 51438, 66178, 115218, 123975, 111811, 83289, 6597, -48676, -11094, 19346]
14141A9346L1844O543k6793R355k4934m456n3238r152k886j841m9018M3434N1786
14128a0010M6862m4883j2557J8818r615K9643J9802K2341o098J184L0340m0139
14116D5688l7874K5203j4414j1008N732K3903p81l2222j5115Q827M9965o396j0019
14103C1489l2244o9790j2112N9295J7934l4631k7078K2966n039j0395l6974L2060
14091f4519N4815O1294j4265j1558j1458Q938M2972M3326l0066n8500L3201M5467
14079I9647k7282j8374K9928k6439j9679n6344j5073j5266l6472L7350Q3102K5243
14067F0341n387o922M603j5483j9746q658k4303R302m6670o0522L1685M4269p930
14054d5421k7605m8581O758M1065K2366J3515K2011p394j2036J1182m8278N1561
$$ y = [19346, 51190, 57733, 30940, 40295, 15361, 10905, -42333, -51485, -54371, -56212, -105230, -61796, -10010, 36852, -8031, -20588, -1770, -11385, 18258, 38060, 60401, 54303, 55487, 85827, 45688, 7814, 33017, 18603, 7595, 13327, 37230, 36449, 4227, -10888, -2061, 47904, 41508, 31489, -755, -70545, -82657, -23362, -5428, -40059, -67137, -44171, -49210, -59605, -96579, -64519, -9704, 51590, 37325, 25767, 14309, 23247, 66219, 109545, 79479, 20979, 54180, 99647, 72365, 53991, 83919, 57480, 37801, -18543, -33616, -48882, -85354, -48004, 35098, 60341, 54954, 48032, 52635, 37152, 17406, 8748, -15555, -6253, -52923, -113445, -81760, -37491, -45421, -73026, -121607, -114849, -73784, -51418, -37903, -15892, -23286, -35322, -24140, -72418, -20857]
14042b0857Q7191L6424k6326j9850k9888k2838J2659m8600l5567N0494J2729K3294
14030A8865j7402O188M4415M7843J7158m8816J1943j4037J7988L569o3794n5220
14018c1300L414j6931o4188m0200J4673N1133K4820j6376J9091N4202O423k1493
14006a6732K9747J6125K7513K2130K5942l0833p1867l576N577M7953m4677k8293
13994b0991k8488r17M4291J9495j3474L9921l4032n4077k4580M0233O7656L0400
13982F5437J1766J3194n8357l655j6202l5397R138K8759L5609k7573k9500M0639
13970C3858K75J2077m720l8351j5565j3319L8972L1488M5245K6965K963j8485
13958A01403L33j0825k0408j7126l3635J4134j4463k0547J9676K3968K6046N8242
$$ y = [-20857, 66334, 102758, 76432, 56582, 26694, 3856, 16515, -32085, -67652, -17158, -4429, 18865, 1463, 7651, 52066, 99909, 117067, 68251, 80194, 66157, 84145, 87714, 23920, -31300, -27886, -44817, -109005, -149205, -134532, -83399, -58579, -74955, -55864, -1662, 4761, -16732, 13015, 29140, 56653, 78783, 104725, 73892, 2025, -1551, 4026, 51979, 7302, -20991, -49479, -50396, -6105, 13390, -84, 39837, 5805, -48272, -72852, -32619, 35037, 65437, 77203, 90397, 32040, 28385, 12183, -23214, -14076, 14683, 50292, 22719, -6781, 33858, 34133, 46210, 41490, 3139, -12426, -25745, 13227, 44715, 89960, 116925, 119888, 101403, 101736, 90911, 70503, 53377, 19742, 33876, 19413, -1134, 18542, 42510, 68556, 126798]
13946A26798j5549l0143n8311j8888O958l3465J2267K0368L2360p274k6265K112
13934A0968N203J1209K3481j8880n848k0819N7320K7107l9296n3551L3786L2451
13922F3131r319k414m1365l1598L3035M9728J1186J230j8639j4243j2420k1314
13910F998k0658l3998L0020K062M2319L5038k8171K182m9558k4482K4853k663
13898a6058M2691N1646K87l8403l1325j7794K0373k652N0609o9J6386o59m809
13885G0223J1420n7778R602M529j3085l7174k523L2186K0069j6324j5513m108
13873A524p99L3972k2154m8171l9507N4213n3480p157N271N8910J5135l0023l4363
13860f6629j8827o427P6998J7518J6901K3136o4823j4844J2999J1837J3363j9571
$$ y = [126798, 111249, 81106, 22795, 3907, 10865, -22600, -10333, 10035, 42395, 35121, 8856, 10968, 16171, 27380, 50861, 31981, 26133, 5314, 62634, 89741, 50445, -3106, 30680, 63131, 53812, 51398, 10033, -21565, 11470, 61198, 72384, 73614, 54975, 40732, 28312, 6998, -13660, -47658, -17638, -15576, 26743, 61781, 33610, 35792, -13766, -38248, -13395, -16058, 26633, 78279, 78566, 40163, 8838, -8956, 11417, 8765, 59374, 59305, 75691, 75032, 70223, 81643, 23865, 33467, 37996, 24911, -12263, -14786, 17400, 37469, 21145, 5632, 1524, 725, 34697, 12543, -35628, -75135, -20922, -74402, -81559, -76288, -17378, -2243, -32266, -66629, -85456, -91883, -14885, 2633, 19534, 42670, -22153, -36997, -23998, -12161, 1202, -18369]
13848a8369j5292K869j6805p277K2240M7075j2145j6477j7241j8560N5686J1686
13836A7390K9872j9784n8185j1738K2748K1098J5905N2916Q8345k007l8037o0950
13824E7573n8362M0039J1358o3913k8817J6750k187M6985N6806j2002k5579l0999
13812G652M0163O536Q790p1351O851O5263K5847o3937j6549Q3569N2721k1849
13800A23706m3019o7182m1286L8407K8696N633l7584J0985L7132o5384j6971K6543
13788c24j0321M2219J1303J5027J1230l1573p00K3088J8566J0809q02k7325k4743
13775C6454n353r839k4668n5657P47M8563M2478J3295l3104n0802J8632K3708
13763D454K9362j1682K1093K3506Q560n985k5238K4063L8750j1219N8658J5273
$$ y = [-18369, -33661, -30792, -47597, -54874, -32634, 14441, 2296, -14181, -31422, -49982, 5704, 17390, 47262, 27478, -30707, -42445, -19697, 1401, 17306, 70222, 158567, 156560, 118523, 57573, -789, 39250, 50608, -13305, -42122, -25372, -27559, 19426, 76232, 64230, 38651, 7652, 47815, 54351, 63141, -8210, -1359, 63904, 89751, 25814, 9265, 92834, 145555, 123706, 80687, 13505, -27781, 10626, 39322, 44955, 7371, 18356, 55488, -9896, -26867, -324, -10645, 31574, 42877, 57904, 69134, 37561, 36861, 59949, 78515, 89324, 88522, 61197, 36454, 31101, 21262, -3406, -59063, -58316, -9753, 32725, 46020, 12916, -37886, -19254, 4454, 33816, 22134, 43227, 66733, 75293, 69308, 44070, 68133, 106883, 95664, 154322, 169595]
13751A69595j8912k0598n9984p1134l7460R4045M8023k5952o6807Q198J8223J4061
13739E1298q456l1114L4345K4027O825n9002k3401j3240O742q580L134L408m052
13726a8066j8592J4548r331K1455Q8591N456q1943k7167k9924j7465N3724M4490
13714B5776K4614k0572K8973K5336n474N7972r592o3171k8786j5507J3615p820
13702B5364K4145K9639l1158J052J9445l0323l5711m0523J2164J1123k1063k4975
13690f0821j4623M4733P0041K1763p8040m6804L4949Q5278l8484l8973j59j8360
13678c9500k3999j4551J7509J06610L7859m8775l0217J2703P732M8368j253q3353
13666a0867k8497R438j0617l211k9385P611K3216l9547O249P0949L7730J558j710
$$ y = [169595, 150683, 130085, 70101, -1033, -38493, 55552, 103575, 77623, 10816, 19014, 37237, 51298, 42842, 11728, 46073, 70100, 76925, 17923, -5478, -18718, -11976, -20556, -17422, -14014, -18066, -36658, -22110, -31441, -9986, 78605, 84061, 2118, -25049, -54973, -72438, -18714, 25776, 50390, 29818, 58791, 84127, 78653, 136625, 127033, 63862, 35076, 19569, 33184, 25364, 49509, 79148, 47990, 49042, 68487, 38164, 2453, -38070, -25906, -14783, -35846, -60821, -75444, -30711, 39330, 61093, -16947, -63751, -28802, 56476, 17992, -20981, -21140, -39500, -63499, -78050, -60541, 46069, 83928, 35153, 4936, 17639, 25371, 73739, 72486, -10867, -39364, -29926, -40543, -43754, -73139, -65528, -42312, -81859, -75610, -4661, 33069, 34627, 32917]
$$ [...]
##END NTUPLES=NMR SPECTRUM
##END=
