##TITLE=XTC-1153_3
##JCAMPDX= 6.0         $$ Bruker NMR JCAMP-DX V2.0
##DATA TYPE= nD NMR SPECTRUM
##DATA CLASS= NTUPLES
##NUM DIM= 2
##ORIGIN= BRUKER
##OWNER= patiny
$$ 1.79 TOPSPIN		Version 3.0
$$ 2012-05-20 03:20:49.421 +0200  patiny@icmbsg005
$$ Compression mode = diff/dup
##.OBSERVE FREQUENCY= 400.131578658115
##.OBSERVE NUCLEUS= ^1H
##.ACQUISITION MODE= SIMULTANEOUS (DQD)
##.ACQUISITION SCHEME= Echo-Antiecho
##.AVERAGES= 4
##.DIGITISER RES= 23
##SPECTROMETER/DATA SYSTEM= spect
##.PULSE SEQUENCE= hmbcetgpl3nd
##.SOLVENT NAME= D2O
##.SHIFT REFERENCE= INTERNAL, D2O, 1, 7.286523
##AUDIT TRAIL= $$ (NUMBER, WHEN, WHO, WHERE, PROCESS, VERSION, WHAT)
$$ ##TITLE= Audit trail, TOPSPIN		Version 3.0
$$ ##JCAMPDX= 5.01
$$ ##ORIGIN= Bruker BioSpin GmbH
$$ ##OWNER= patiny
$$ $$ /opt/data/patiny/nmr/XTC-1153_3/14/pdata/1/auditp.txt
$$ ##AUDIT TRAIL=  $$ (NUMBER, WHEN, WHO, WHERE, PROCESS, VERSION, WHAT)
(   1,<2012-05-20 03:20:47.459 +0200>,<patiny>,<icmbsg005>,<go>,<TOPSPIN 3.0>,
      <created by zg
	started at 2012-05-20 02:58:40.374 +0200,
	POWCHK enabled, PULCHK disabled,
       configuration hash MD5:
       77 C7 B7 C4 10 F4 BA 30 64 2E BB 52 82 F2 DA 41
       data hash MD5: 4K * 128
       22 92 05 BC C2 0A 60 B1 4E 0B 65 DE 81 64 C6 1E>)
(   2,<2012-05-20 03:20:47.522 +0200>,<patiny>,<icmbsg005>,<audit>,<TOPSPIN 3.0>,
      <user comment:
       ICON-NMR User ID: patiny
       data hash MD5: 4K * 128
       22 92 05 BC C2 0A 60 B1 4E 0B 65 DE 81 64 C6 1E>)
(   3,<2012-05-20 03:20:48.491 +0200>,<patiny>,<icmbsg005>,<proc2d>,<TOPSPIN 3.0>,
      <Start of raw data processing
       xfb same F2: SI = 2K WDW = 3 SSB = 4 FT_mod = 6 PKNL = 1 F1: SI = 1K ME_mod = 2 NCOEF = 32 WDW = 4 SSB = 2 FT_mod = 6 PHC0 = 0 PHC1 = 0
       data hash MD5: 2K * 1K
       20 93 4E 2A 39 6A 86 1A 88 8A BC 48 25 14 9F A3>)
(   4,<2012-05-20 03:20:48.605 +0200>,<patiny>,<icmbsg005>,<proc2d>,<TOPSPIN 3.0>,
      <abs2 F2: ABSG = 5 ABSF1 = 7.286523 ABSF2 = 0.6042026
       data hash MD5: 2K * 1K
       05 D8 64 EB 64 96 35 86 B1 B0 81 50 7E 5A E3 17>)
(   5,<2012-05-20 03:20:48.776 +0200>,<patiny>,<icmbsg005>,<proc2d>,<TOPSPIN 3.0>,
      <abs1 F1: ABSG = 5 ABSF1 = 210.754 ABSF2 = -11.10083
       data hash MD5: 2K * 1K
       28 64 07 97 73 77 2D 35 83 66 76 EC AF 40 BA AA>)
$$ ##END=
$$ 
$$ $$ hash MD5
$$ $$ B0 B6 7E B8 68 ED 76 DB BA 0C 8A B5 50 2A AD A8
##$RELAX= 
##$RELAX= 
##$RELAX= 
##$RELAX= 
##$RELAX= 
##$RELAX= 
##$RELAX= 
##$RELAX= 
##$RELAX= 
##$RELAX= 
##$RELAX= 
$$ Bruker specific parameters
$$ --------------------------
##$DATPATH= </opt/data/patiny/nmr>
##$EXPNO= 14
##$NAME= <XTC-1153_3>
##$PROCNO= 1
##$ACQT0= 1000000
##$AMP= (0..31)
100 100 100 100 100 100 100 100 100 100 100 100 100 100 100 100 100 100
100 100 100 100 100 100 100 100 100 100 100 100 100 100
##$ANAVPT= -1
##$AQSEQ= 0
##$AQ_mod= 3
##$AUNM= <au_getlinv>
##$AUTOPOS= <33 >
##$BF1= 400.13
##$BF2= 100.612769
##$BF3= 400.13
##$BF4= 400.13
##$BF5= 400.13
##$BF6= 400.13
##$BF7= 400.13
$$ [...]
##$SIGF1= 7.286523
##$SIGF2= 0.6042026
##$SINO= 0
##$SIOLD= 2048
##$SPECTYP= <>
##$SREGLST= <1H.DMSO>
##$SSB= 4
##$STSI= 2048
##$STSR= 0
##$SW_p= 2673.79679144385
##$SYMM= 0
##$S_DEV= 2392338
##$TDeff= 4096
##$TDoff= 0
##$TI= <>
##$TILT= no
##$TM1= 0
##$TM2= 0
##$TOPLEV= 100
##$USERP1= <>
##$USERP2= <>
##$USERP3= <>
##$USERP4= <>
##$USERP5= <>
##$WDW= 3
##$XDIM= 2048
##$YMAX_p= 248549139
##$YMIN_p= -405252597
##$CURPLOT= <Cups-PDF>
##$CURPRIN= <$Cups-PDF>
##$DFORMAT= <normdp>
##$LAYOUT= <+/2D_inv.xwp>
##$LFORMAT= <normlp>
##$PFORMAT= <normpl>
$$ Bruker specific parameters for F1
$$ ---------------------------------
##$ACQT0= 0
##$BF1= 100.612769
##$FnMODE= 6
##$NUC1= <13C>
##$O1= 10043.8343986724
##$SFO1= 100.622812834399
##$SW= 221.832681201688
##$SW_h= 22321.4283611104
##$TD= 128
##$ABSF1= 210.754
##$ABSF2= -11.10083
##$ABSG= 5
##$ABSL= 0
##$ALPHA= 0
##$AQORDER= 0
##$ASSFAC= 0
##$ASSFACI= 0
##$ASSFACX= 0
##$ASSWID= 0
##$AUNMP= <>
##$AXLEFT= 0
##$AXNAME= <F1>
##$AXNUC= <13C>
##$AXRIGHT= 0
##$AXTYPE= 0
##$AXUNIT= <>
##$AZFE= 0.1
##$AZFW= 0.5
##$BCFW= 0
##$BC_mod= 0
##$BYTORDP= 0
##$COROFFS= 0
##$CY= -3
##$DATMOD= 1
##$DC= 0
##$DFILT= <>
##$DTYPP= 0
##$ERETIC= no
##$F1P= 210.76350402832
##$F2P= -11.0913240743493
##$FCOR= 0.5
##$FTSIZE= 1024
##$FT_mod= 6
##$GAMMA= 0
##$GB= 0
##$INTBC= 1
##$INTSCL= 1
##$ISEN= 128
##$LB= 0
##$LEV0= 0
##$LPBIN= 256
##$MAXI= 10000
##$MC2= 5
##$MEAN= 0
##$ME_mod= 2
##$MI= 1
##$NCOEF= 32
##$NC_proc= -11
##$NLEV= 6
##$NOISF1= 0
##$NOISF2= 0
##$NSP= 0
##$NTH_PI= 0
##$NZP= 0
##$OFFSET= 210.754
##$PC= 4
##$PHC0= 0
##$PHC1= 0
##$PH_mod= 1
##$PKNL= no
##$PPARMOD= 1
##$PPDIAG= 0
##$PPIPTYP= 0
##$PPMPNUM= 2147483647
##$PPRESOL= 1
##$PSCAL= 1
##$PSIGN= 0
##$PYNMP= <>
##$REVERSE= no
##$SF= 100.612769
##$SI= 1024
##$SIGF1= 210.754
##$SIGF2= -11.10083
##$SINO= 0
##$SIOLD= 1024
##$SPECTYP= <>
##$SREGLST= <>
##$SSB= 2
##$STSI= 1024
##$STSR= 0
##$SW_p= 22321.42836111
##$SYMM= 0
##$S_DEV= 2392338
##$TDeff= 256
##$TDoff= 0
##$TI= <>
##$TILT= no
##$TM1= 0
##$TM2= 0
##$TOPLEV= 0
##$USERP1= <>
##$USERP2= <>
##$USERP3= <>
##$USERP4= <>
##$USERP5= <>
##$WDW= 4
##$XDIM= 128
##$YMAX_p= 248549139
##$YMIN_p= -405252597
$$ End of Bruker specific parameters
$$ ---------------------------------
##NTUPLES= nD NMR SPECTRUM
##VAR_NAME=  FREQUENCY1,    FREQUENCY2,      SPECTRUM
##SYMBOL=    F1,            F2,              Y
##.NUCLEUS=  13C,           1H
##VAR_TYPE=  INDEPENDENT,   INDEPENDENT,     DEPENDENT
##VAR_FORM=  AFFN,          AFFN,            ASDF
##VAR_DIM=   1024,          2048,            2048
##UNITS=     HZ,            HZ,              ARBITRARY UNITS
##FACTOR=    21.7982698838965, 1.30556483957219, 1
##FIRST=     21204.543296753, 2672.49122660428, -2735697
##LAST=      -1095.08679447308, 0,           763978
##MIN=       -1095.08679447308, 0,           -405252597
##MAX=       21204.543296753, 2672.49122660428, 248549139
##PAGE= F1=21204.54329675
##FIRST=     21204.543296753, 2672.49122660428, -2735697
##DATA TABLE= (F2++(Y..Y)), PROFILE
$$ [...]
##PAGE= F1=14839.44849066
##FIRST=     21204.543296753, 2672.49122660428, 232671
##DATA TABLE= (F2++(Y..Y)), PROFILE
207B794433C80129b753069I70368d159230a363252A638559P63230J2901d670230
$$ 2794433 380129 -2753069 970368 -4159230 -1363252 1638559 2401789 2414690 -4670230
197i63639C308768k36109K007642A584950b700282O98224F228038b026771P04356
$$ -963639 3308768 3072659 5080301 1584950 -2700282 -2002058 6228038 -2026771 -1322415
188a322415C158103a425935C018303A252553D29430e938873C539099A47220b108963
$$ -1322415 3158103 -1425935 3018303 1252553 429430 -5938873 3539099 147220 -2108963
178a016004l381295c17475A065570e828607A524000a898136g79788B963395b213394
$$ -1016004 -4397299 -317475 1065570 -5828607 1524000 -1898136 -779788 2963395 -2213394
168A422622c126566A91160J996535b117649A044474m43154g16623D022857A375851
$$ 1422622 -3126566 191160 2187695 -2117649 1044474 601320 -716623 4022857 1375851
158b007184j663590a571416B058237a00712j992483C425727j629002O81210J089755
$$ -2007184 -3670774 -1571416 2058237 -100712 -2093195 3425727 1796725 2477935 3567690
149C567690Q8017b473798E899484a47080l79416F126972d188115J563603D399125
$$ 3567690 3655707 -2473798 5899484 -147080 -526496 6126972 -4188115 -2624512 4399125
139b764313A172348B04748h58770j306134G43322B88427b773078B888701A329923
$$ -2764313 1172348 204748 -858770 -2164904 743322 288427 -2773078 2888701 1329923
129a165317G09894a981434K07342E005900d67430B728558B62876a668970B121327
$$ -1165317 709894 -1981434 -1774092 5005900 -467430 2728558 262876 -1668970 2121327
119b977415F64784O21564a319097n680564A437996c44119H38840L421960h16133
$$ -2977415 664784 1286348 -1319097 -6999661 1437996 -344119 838840 4260800 -816133
109b160950B739867Q44913a321886E33199B57813a281090E932702a120881G27203
$$ -2160950 2739867 3584780 -1321886 533199 257813 -1281090 5932702 -1120881 727203
99B08074N77561b855778e16060B412210c711054B118987J4982c324837g92285
$$ 208074 785635 -2855778 -516060 2412210 -3711054 2118987 2133969 -3324837 -792285
89c57982H61114j15853a819893l435665a036630j183188C00820g81811K13914
$$ -357982 861114 745261 -1819893 -5255558 -1036630 -2219818 300820 -781811 -567897
80e67897E011488c343570a02706m927852B949942h34206c28077E740597b620972
$$ -567897 5011488 -3343570 -102706 -5030558 2949942 -834206 -328077 5740597 -2620972
70C639327d634915A447669j59150A92319a410150o34396O78910e7299j109650
$$ 3639327 -4634915 1447669 1288519 192319 -1410150 -2044546 -1365636 -57299 -1166949
61a166949L46578j97243L24357D358143b104073j050676Q18758B543040j7725
$$ -1166949 -820371 -1017614 -693257 4358143 -2104073 -3154749 -2335991 2543040 2525315
52B525315a522669A770021d916892A964731p99622K4087A98896J542649J0593
$$ 2525315 -1522669 1770021 -4916892 1964731 1165109 1189196 198896 1741545 1752138
43A752138J250027b083081C425669M37819A862885G89394l00539g52626i5899
$$ 1752138 3002165 -2083081 3425669 3863488 1862885 789394 488855 -752626 -95899
33C055375e871820A488192K286215j753145d431091J696022F895576b386499B423850
$$ 3055375 -5871820 1488192 3774407 2021262 -4431091 -2735069 6895576 -2386499 2423850
23e49150J0595k153637A421757c281065p53114E944730d2145D6181c166246I292
$$ -549150 -538555 -2692192 1421757 -3281065 -4034179 5944730 -42145 46181 -3166246 9292
12E402206a96084k983730H60672l24403c74930B100985I21288c301349A765000
$$ 5402206 -196084 -3179814 860672 536269 -374930 2100985 921288 -3301349 1765000
2B597455c685992A429778
$$ 2597455 -3685992 1429778
##PAGE= F1=14817.65022077
##FIRST=     21204.543296753, 2672.49122660428, 171653
##DATA TABLE= (F2++(Y..Y)), PROFILE
2047A71653J85625J512848M32813b680647k08230F7758O32145M05076K517348
$$ 171653 357278 1870126 2302939 -2680647 -2888877 67758 699903 1104979 3622327
2038C622327a322177A755540g86981F752267a753718C168651b658094C145365
$$ 3622327 -1322177 1755540 -786981 6752267 -1753718 3168651 -2658094 3145365
2029c19809m722915d72447B478762e97515r34373C033615c732074A867591a944872
$$ -319809 -5042724 -472447 2478762 -597515 -1531888 3033615 -3732074 1867591 -1944872
2019b694775B255374c054256A351369b209034i52246G93155M219134g94944k112729
$$ -2694775 2255374 -3054256 1351369 -2209034 -952246 793155 5012289 -794944 -2907673
2010b907673E961222E96425J637613d438533B351435j049977R07303a90359m835164
$$ -2907673 5961222 596425 2234038 -4438533 2351435 1301458 2208761 -190359 -5025523
2001e025523h72724j164489C158254p76182N595809f544534H06969g19925A288956
$$ -5025523 -872724 -2037213 3158254 2382072 7977881 -6544534 806969 -719925 1288956
1991B85723c604194J330738E919959a88055B012844b104446C763569b063182B758677
$$ 285723 -3604194 -2273456 5919959 -188055 2012844 -2104446 3763569 -2063182 2758677
1981b868285J372968D084420c213821M38575N62324l494558A624646b451460A467855
$$ -2868285 -1495317 4084420 -3213821 -2775246 -2212922 -5707480 1624646 -2451460 1467855
1971e47518B775011J81237a859010P17784l94366j179080g767k260840a133712
$$ -547518 2775011 2956248 -1859010 -1141226 -1535592 -2714672 -7767 -2268607 -1133712
1961C773422H9606a153729A488802B40371L719647E91462g083378B455899d726319
$$ 3773422 89606 -1153729 1488802 240371 3960018 591462 -7083378 2455899 -4726319
1951c540386E49866a823284B831662F68378J964833f5709j129867A57561N11224
$$ -3540386 549866 -1823284 2831662 668378 2633211 -65709 -1195576 157561 668785
1942F68785I4848K358839K31617b232960q6629C496192c77021E11056F0351J909110
$$ 668785 94848 2453687 2685304 -2232960 -2319589 3496192 -377021 511056 60351 1969461
1932A969461h25166j388865C075754f656495f11443I93863K385731j246097a299526
$$ 1969461 -825166 -2214031 3075754 -6656495 -611443 993863 3379594 2133497 -1299526
1922f31498l742522B547198e297050D708795a11537A684043b65656n972277C967027
$$ -631498 -4374020 2547198 -5297050 4708795 -111537 1684043 -265656 -6237933 3967027
1912A475162J4319242R125098c7382062J5550429r368485Q973149l000577i687014
$$ 1475162 15794404 24919502 -37382062 -21831633 -31200118 -22226969 -25227546 -9687014
1903B6863937m488226q60203k265717R853088J0523119a6445904B86541Q745132
$$ 26863937 22375711 21515508 19249791 29102879 39625998 -16445904 286541 9031673
1895I031673J0216673F790559j158767b9001129k7964597K0650296J1538269A1823285
$$ 9031673 19248346 6790559 5631792 -29001129 -56965726 -36315430 -24777161 11823285
1886A6061546l028974G17440P634662A060464N087468Q19453b726406D515892
$$ 16061546 13032572 717440 8352102 1060464 6147932 6967385 -2726406 4515892
1877a127637k314188N14350j1439445b335604j6787354g109191l933402F054090
$$ -1127637 -3441825 -2927475 -14366920 -2335604 -19122958 -7109191 -11042593 6054090
1868E684770k111816Q331173C813737R214633b188832E684046d67552J82931A048430
$$ 5684770 3572954 11904127 3813737 13028370 -2188832 5684046 -467552 -284621 1048430
1858a977089j971095c02063A761646o770a293146a9559C21211b1691C565962A093500
$$ -1977089 -3948184 -302063 1761646 1754876 -1293146 -19559 321211 -21691 3565962 1093500
1847A310654J421562a014627d0031l95318A527487Q13912a968287D89941K418241
$$ 1310654 2732216 -1014627 -40031 -435349 1527487 2341399 -1968287 489941 2908182
1838B908182d467673I25517m50211I045L506214b827040J238608K37226k242732
$$ 2908182 -4467673 925517 475306 9045 3515259 -2827040 -1588432 -1351206 -3593938
1829c593938C71730b903102B095984j66598J367573B9718g25661J85094C234809
$$ -3593938 371730 -2903102 2095984 1929386 3296959 29718 -725661 -540567 3234809
1819b586869b5102D610207b17318l852922b019470B995408F58483J04517a410966
$$ -2586869 -25102 4610207 -217318 -4070240 -2019470 2995408 658483 763000 -1410966
1809A49132a253274A6705a091747k226264H51426c058116A224224J457792r42829
$$ 149132 -1253274 16705 -1091747 -3318011 851426 -3058116 1224224 2682016 1739187
1800A739187b899940A390747N692436B66789b173255l81256A713861e447072B514408
$$ 1739187 -2899940 1390747 7083183 266789 -2173255 -2554511 1713861 -5447072 2514408
1790d912315D724216d254518H05546L098247A401428k68927m43248q3617b50463
$$ -4912315 4724216 -4254518 805546 3903793 1401428 1132501 689253 605636 -250463
1780A13340a134845C076975o23899A62876K954573a512607k618576D389883c213918
$$ 113340 -1134845 3076975 2453076 162876 3117449 -1512607 -4131183 4389883 -3213918
1770c710247D51997c573053C067249h90406C326604b551558j11849F5707K311383
$$ -3710247 451997 -3573053 3067249 -890406 3326604 -2551558 -2663407 65707 2377090
1761B377090K765668c812796d03101n995491a821186m084610D778836C22971h020271
$$ 2377090 5142758 -3812796 -403101 -6398592 -1821186 -5905796 4778836 322971 -8020271
1751E840085b511781C099552g016726G778099a534732a79847B664835b295129
$$ 5840085 -2511781 3099552 -7016726 7778099 -1534732 -179847 2664835 -2295129
1742C252492a332777j230498i42090B481892p74849c186503C718693b832437B94264
$$ 3252492 -1332777 -2563275 -942090 2481892 1707043 -3186503 3718693 -2832437 294264
1732a353325C325384c482966a124830J88979B122577c276720J391014D61279L609553
$$ -1353325 3325384 -3482966 -1124830 -935851 2122577 -3276720 -1885706 461279 4070832
1723D070832a736458I03413f41044C807867E0980J072620C34394J103652c449901
$$ 4070832 -1736458 903413 -641044 3807867 50980 1123600 334394 1438046 -3449901
1713f42750k278951j141753D497141B79359b121290E45375c499430m08423k7763
$$ -642750 -2921701 -4063454 4497141 279359 -2121290 545375 -3499430 -3907853 -3935616
1704c935616A608034a95903k120068B974846A65623b931033D319826b726619A16121
$$ -3935616 1608034 -195903 -2315971 2974846 165623 -2931033 4319826 -2726619 116121
1694D108070i79109K70153B247174b749486F9520P3456d93558j450738B110988
$$ 4108070 -979109 -708956 2247174 -2749486 69520 142976 -493558 -1944296 2110988
1684b891793F325802G51867e630600E391916c695958a180724b97821E932597C10025
$$ -2891793 6325802 751867 -5630600 5391916 -3695958 -1180724 -297821 5932597 310025
1674A125493a767580Q00966F02976j63357d37264k023089C377371a288068A77297
$$ 1125493 -1767580 -966614 602976 439619 -437264 -2460353 3377371 -1288068 177297
1664a574010A519143b325403A167912R60292i31102a40715A621893D41701a684689
$$ -1574010 1519143 -2325403 1167912 2128204 -931102 -140715 1621893 441701 -1684689
1654G59527N1292a837104C9283M115097a758814e00868j623425N97766C900870
$$ 759527 810819 -1837104 39283 4154380 -1758814 -500868 -2124293 -1526527 3900870
1644A977693b910997A961276e366061F123987k246786c54765k456560D187028
$$ 1977693 -2910997 1961276 -5366061 6123987 3877201 -354765 -2811325 4187028
1635D97672L64888b426739P02487D9490O289150b052203B977916A307837O092084
$$ 497672 862560 -2426739 -1724252 49490 6338640 -2052203 2977916 1307837 7399921
1626G399921R278540J7229019K9326704i3283114j55339783A53695486C2168539
$$ 7399921 16678461 33907480 63234184 -93283114 -248622897 153695486 32168539
1618A1905618E364424k371452J410631R42796c52308A698873R95313E49267J296240
$$ 11905618 5364424 2992972 4403603 5346399 -352308 1698873 2694186 549267 1845507
1609A845507c199033I2606K91388J942428a723203A219627a041884A777011b830
$$ 1845507 -3199033 92606 383994 2326422 -1723203 1219627 -1041884 1777011 -2830
1599A195658e89503A822820M84648B28799R78846K154092b434095C060117a776152
$$ 1195658 -589503 1822820 2307468 228799 1207645 3361737 -2434095 3060117 -1776152
1589C090033e24558D486838f570590K974414B827791g70298o01805D629693b975558
$$ 3090033 -524558 4486838 -6570590 -3596176 2827791 -770298 -1372103 4629693 -2975558
1579b85422A664676g96499l567348I76671J122872F87097K126277c840593a278151
$$ -285422 1664676 -796499 -4363847 976671 2099543 687097 2813374 -3840593 -1278151
1569c53122A459853D91990a107558A15829i25048A032751l36554Q192927c174706
$$ -353122 1459853 491990 -1107558 115829 -925048 1032751 696197 8889124 -3174706
1559a188541k171160i5391D932621H92291a50418k061333A458454m2484E28060
$$ -1188541 -3359701 -95391 4932621 892291 -150418 -2211751 1458454 1415970 528060
1549E0545L186854A234797g32178B513573a588570A332929J50073d850505E908017
$$ 50545 3237399 1234797 -732178 2513573 -1588570 1332929 1483002 -4850505 5908017
1539d22837A484063c254678A325918p2300J656936b563397i79186A43537L172227
$$ -422837 1484063 -3254678 1325918 1253618 2910554 -2563397 -979186 143537 3315764
1530C315764c963844J101878B37524g289664C488198C742h87002m670270A33881
$$ 3315764 -3963844 -2861966 237524 -7289664 3488198 3742 -887002 -5557272 133881
1520a481498B04302K597010a80936A55601a031255k943321G696692d646300D127155
$$ -1481498 204302 2801312 -180936 155601 -1031255 -3974576 7696692 -4646300 4127155
1510D028294c07576j445149M30293A113932a005258A100025e98235k510365C276897
$$ 4028294 -307576 -1752725 -1322432 1113932 -1005258 1100025 -598235 -3108600 3276897
1500b42180l310401A905948a099722C31180J31513f344328f74986m905578C742581
$$ -242180 -3552581 1905948 -1099722 331180 462693 -6344328 -674986 -5580564 3742581
1490c565857D395875i90433B802488F18494f927318D288123a606422C211509f06720
$$ -3565857 4395875 -990433 2802488 618494 -6927318 4288123 -1606422 3211509 -606720
1480a787469j364512A08768Q69622J667410a461197k144335f83230b6582F60251
$$ -1787469 -3151981 108768 978390 2645800 -1461197 -3605532 -683230 -26582 660251
1470b692310l01242H40064b45862l718497a895751p13551C583414a260829m121853
$$ -2692310 -2993552 840064 -245862 -3964359 -1895751 -2609302 3583414 -1260829 -5382682
1461e382682C476712j060504j132454B56804d20974C12061a505393C741907f87987
$$ -5382682 3476712 2416208 1283754 256804 -420974 312061 -1505393 3741907 -687987
1451b568042C55357c923447H000386f143725A069367b040015D849001c323497
$$ -2568042 355357 -3923447 8000386 -6143725 1069367 -2040015 4849001 -3323497
1442A834602C78962J181952c033318f87358C393076c38137j865626k649721a003928
$$ 1834602 378962 1560914 -3033318 -687358 3393076 -338137 -2203763 -4853484 -1003928
1432C525162j742231b374089C726580g22893a96759B509358b998541a119030A974640
$$ 3525162 1782931 -2374089 3726580 -722893 -196759 2509358 -2998541 -1119030 1974640
1422A633766g010006B782405D61524J928512b975463C543216j265521k14262B70051
$$ 1633766 -7010006 2782405 461524 2390036 -2975463 3543216 2277695 2063433 270051
1412d681412I64293N473995e99971A994215e407896G539134B345880h69247l268511
$$ -4681412 964293 6438288 -599971 1994215 -5407896 7539134 2345880 -869247 -4137758
1403d137758C630390b866558D187684A757996e179310C752902d053490D09305
$$ -4137758 3630390 -2866558 4187684 1757996 -5179310 3752902 -4053490 409305
1394b678216j943894D428647A145821E0851a90452j798996G289920a112432A742746
$$ -2678216 -4622110 4428647 1145821 50851 -190452 -1989448 7289920 -1112432 1742746
1384b22426j518651m64252B198655a98740C187215a730303K07684l997644B244478
$$ -222426 -1741077 -2205329 2198655 -198740 3187215 -1730303 -1522619 -5520263 2244478
1374b546945A665352K824279I96060f4497C28041P98052a006838A123610L347965
$$ -2546945 1665352 4489631 996060 -64497 328041 1126093 -1006838 1123610 4471575
1365D471575e69791p156178A619671k73129e193114C631867q30940r14059E42129
$$ 4471575 -569791 -7725969 1619671 1346542 -5193114 3631867 2800927 1886868 542129
1355A831570J320110i075380C409289F39377d800082G22996M40596a761736p46441
$$ 1831570 3151680 -9075380 3409289 639377 -4800082 722996 1163592 -1761736 -2508177
1346b508177O91633a87988B263735c38480a5684m387882J472653F600906h34575
$$ -2508177 -1816544 -187988 2263735 -338480 -15684 -4403566 -2930913 6600906 -834575
1336c13346O566G212371b165877b98228m339839I27063f80385j673294L77214
$$ -313346 -306780 7212371 -2165877 -298228 -4638067 927063 -680385 -2353679 -1976465
1327a976465L94962B308393g84942m565794C947303d272092D434740f116414C330473
$$ -1976465 -1581503 2308393 -784942 -5350736 3947303 -4272092 4434740 -6116414 3330473
1317d677703h78580D43517c953751a225921H48981a48777j038459I55410a555618
$$ -4677703 -878580 443517 -3953751 -1225921 848981 -148777 -1187236 955410 -1555618
1307e61920k802933C130692l92082b980657F972247A296971B3039J056179i69400
$$ -561920 -3364853 3130692 2738610 -2980657 6972247 1296971 23039 1079218 -969400
1297A600174b22235j908633F2637J735793J86554b84080k557672A336992g30511
$$ 1600174 -222235 -2130868 62637 1798430 1984984 -284080 -2841752 1336992 -730511
1287C066387d789039B404696J1112g62798l668642D120235a276265O13578I86935
$$ 3066387 -4789039 2404696 2415808 -762798 -4431440 4120235 -1276265 -662687 986935
1277e02288A038395b224276F072195A545473b066186j080282h95963A555761K752412
$$ -502288 1038395 -2224276 6072195 1545473 -2066186 -3146468 -895963 1555761 4308173
1268D308173a713258B255776a177173D499969b222183A440712Q43932a193020
$$ 4308173 -1713258 2255776 -1177173 4499969 -2222183 1440712 2284644 -1193020
1259b750309a319C322899b52077k361291F616534e020625a853725K44729a97055
$$ -2750309 -1319 3322899 -252077 -2613368 6616534 -5020625 -1853725 -1608996 -197055
1249A334783J91666c072279P70499D045765e576086K157152A836970B88305O27780
$$ 1334783 1526449 -3072279 -2301780 4045765 -5576086 -3418934 1836970 288305 916085
1240I16085a81893B087721j030786a97704o774687I71727L123796a201762B077041
$$ 916085 -181893 2087721 1056935 -197704 -6972391 971727 4095523 -1201762 2077041
1230a823853m99276C123518a772796g45853K84361F905123b557357f53702a36289
$$ -1823853 -2323129 3123518 -1772796 -745853 -461492 6905123 -2557357 -653702 -136289
1220B572491D47232a916135A008875L1793P88380K49550H20966h01678E132240
$$ 2572491 447232 -1916135 1008875 1040668 1829048 2078598 820966 -801678 5132240
1210c606561g0307A697489M526661A100174b358390E993997b138050j598271D505539
$$ -3606561 -70307 1697489 6224150 1100174 -2358390 5993997 -2138050 -3736321 4505539
1200d54303a95083j08443l51930l341956A024029M28328b54279k878324a022048
$$ -454303 -195083 -303526 -655456 -3997412 1024029 1452357 -254279 -3132603 -1022048
1190F572732D08107c963620C077869A489433n85220J293584d628295B036398a628998
$$ 6572732 408107 -3963620 3077869 1489433 904213 2197797 -4628295 2036398 -1628998
1180c66506B80661K701619e407613D10960g101044A869477E9968Q70723m45476
$$ -366506 280661 2982280 -5407613 410960 -7101044 1869477 59968 930691 485215
1171D85215c018028A024621b606522B25108g95821A114539K003023N60885d190255
$$ 485215 -3018028 1024621 -2606522 225108 -795821 1114539 3117562 3678447 -4190255
1161b94444C621636f494385B177025a613554j612933A203139C41926O56192l63784
$$ -294444 3621636 -6494385 2177025 -1613554 -3226487 1203139 341926 998118 634334
1152F34334q4772J949915d7107j320023r24069H46681a291749D580693A418559
$$ 634334 549562 2499477 -47107 -1367130 -2291199 846681 -1291749 4580693 1418559
1142A765316c426587C10915J721265h45734k473103F33285a520332I9872a61527
$$ 1765316 -3426587 310915 2032180 -845734 -3318837 633285 -1520332 99872 -161527
1132e022402B467601C05331a191024h3323F30862L36357c48823q70336m687080
$$ -5022402 2467601 305331 -1191024 -83323 630862 967219 -348823 -1219159 -5906239
1123e906239i38277A129107J93610E490O50380e53923o30418a5239p34198F65270
$$ -5906239 -938277 1129107 1322717 5490 655870 -553923 -1184341 -15239 -749437 665270
1112B169288e445085E51669R03500d87199l21474o33705D250831e14152A286759
$$ 2169288 -5445085 551669 1455169 -487199 -808673 -1442378 4250831 -514152 1286759
1102B842763F59231j44878L26848e09970j508230B932936o73565k27678b418307
$$ 2842763 659231 514353 841201 -509970 -2018200 2932936 2259371 2031693 -2418307
1092E5081b114836p83338B66262h29789C885806i12100Q6947j110443A30282a108252
$$ 55081 -2114836 -2898174 266262 -829789 3885806 -912100 -825153 -1935596 130282 -1108252
1081D450993C56728f372092A387873l60368f50872m87885C032052g08346A501811
$$ 4450993 356728 -6372092 1387873 1027505 -650872 -1138757 3032052 -708346 1501811
1071G96847l72813a992059Q1240C106882j297831b324538A71702a198589j996546
$$ 796847 424034 -1992059 -1910819 3106882 1809051 -2324538 171702 -1198589 -3195135
1062c195135B231380a016806m563329a455929D796341A58273J337115E73385L78209
$$ -3195135 2231380 -1016806 -5580135 -1455929 4796341 158273 1495388 573385 951594
1053I51594b506840D58570b23247p46785B290145Q7206c453406B639125a945883
$$ 951594 -2506840 458570 -223247 -970032 2290145 2377351 -3453406 2639125 -1945883
1043a943750A475369h49548o87232N03950j721815A377877a363750A346850P9751
$$ -1943750 1475369 -849548 -1536780 -1032830 -2754645 1377877 -1363750 1346850 1426601
1034A426601c264892A875868e36443o33714A95511d216429a423710D015386A543661
$$ 1426601 -3264892 1875868 -536443 -1170157 195511 -4216429 -1423710 4015386 1543661
1024C353187b792848b36297F30849a19083A495903b232349B063321a183131A636136
$$ 3353187 -2792848 -236297 630849 -119083 1495903 -2232349 2063321 -1183131 1636136
1014a521875d12844D71029c149203I34260p4910a459518I98123j76195q459J673597
$$ -1521875 -412844 471029 -3149203 934260 859350 -1459518 998123 821928 813469 2487066
1004B487066e238612Q78553C104092A530548F06748b526227F03651j30045b013970
$$ 2487066 -5238612 -4360059 3104092 1530548 606748 -2526227 603651 473606 -2013970
994A646869b115282A497709K166741g86688m01211B598370L597126b885818H452316
$$ 1646869 -2115282 1497709 3664450 -786688 -1187899 2598370 6195496 -2885818 8452316
984b724887C512938a678733B536884b445546R35279f08686k568693J183643C617101
$$ -2724887 3512938 -1678733 2536884 -2445546 -1510267 -608686 -3177379 -1993736 3617101
974c081113e23324C517583H11274g09559L34895j473993A380306K429547b180422
$$ -3081113 -523324 3517583 811274 -709559 -374664 -1848657 1380306 3809853 -2180422
964a124840B26307j08346a662952j408113a245227K32208r74970h8097C972023
$$ -1124840 226307 117961 -1662952 -3071065 -1245227 -1013019 -1987989 -88097 3972023
954b892133A125464L366160h18888D319274h29297C440698a139464A797579b837626
$$ -2892133 1125464 4491624 -818888 4319274 -829297 3440698 -1139464 1797579 -2837626
944A297224c433755A0045167a508764F35426N86961L26264b483963k25883E361944
$$ 1297224 -3433755 10045167 -1508764 635426 1222387 1548651 -2483963 -2709846 5361944
934e61911r08488l304804F207920h78543j794028B205715p37336M313423f585588
$$ -561911 -1470399 -4775203 6207920 -878543 -2672571 2205715 1468379 5781802 -6585588
924D948451c85064A113623b804875Q70622A924251b28908A599589E77656a180452
$$ 4948451 -385064 1113623 -2804875 -1934253 1924251 -228908 1599589 577656 -1180452
914B589452e79380r33458P31597m218703B743572D33901a570519D56899b501544
$$ 2589452 -579380 -1512838 -781241 -4999944 2743572 433901 -1570519 456899 -2501544
904a689932B272177l96918e220308A705455e118739G064414c445568c25771k9878
$$ -1689932 2272177 1875259 -5220308 1705455 -5118739 7064414 -3445568 -325771 -355649
895c55649B640926a970421A211014a30583F69218R81499a808322B54822O91745
$$ -355649 2640926 -1970421 1211014 -130583 669218 1650717 -1808322 254822 946567
886I46567a365579o24208a95719k67285B35773L031656a35330B027753J33433
$$ 946567 -1365579 -1989787 -195719 -463004 235773 3267429 -135330 2027753 2161186
877B161186a379472B777884a367411D17800c110486C991431K042046a091746C382556
$$ 2161186 -1379472 2777884 -1367411 417800 -3110486 3991431 6033477 -1091746 3382556
867c644590p94195D834934h25452j340176A204670c327470B850900b078005C10855
$$ -3644590 -4438785 4834934 -825452 -2165628 1204670 -3327470 2850900 -2078005 310855
857a637977E800412a402902C467639d73961D505608a49896A758244f65023l140724
$$ -1637977 5800412 -1402902 3467639 -473961 4505608 -149896 1758244 -665023 -3805747
848c805747D759807c91936m147401e53256j101349A522443h54403c37438E02194
$$ -3805747 4759807 -391936 -4539337 -553256 -1654605 1522443 -854403 -337438 502194
838a082229A203539f72828A169307E00236a477392f52243A197219K061529h7012
$$ -1082229 1203539 -672828 1169307 500236 -1477392 -652243 1197219 3258748 -87012
828A149933a065056j604596C86332N174295G38942a977826D978968F8791J566425
$$ 1149933 -1065056 -2669652 386332 5560627 738942 -1977826 4978968 68791 1635216
819A635216N27249C50762b983829D343473I62363R6111M97089a41932l576441
$$ 1635216 2162465 350762 -2983829 4343473 962363 1058474 1555563 -141932 -3718373
810c718373G65507a600895L93794G25685b221097D094710C75452L407601h16427
$$ -3718373 765507 -1600895 -1207101 725685 -2221097 4094710 375452 3783053 -816427
800a671211A788526M55994F74796a357441A36502J204322J94834A11287d12676
$$ -1671211 1788526 2244520 674796 -1357441 136502 1340824 1535658 111287 -412676
790a395153j61858B034538O94314d675713C848043A048092J01788a168040j034407
$$ -1395153 -1557011 2034538 2728852 -4675713 3848043 1048092 1149880 -1168040 -2202447
781b202447g39751C932835b687504o67708k049226A557680D13758J346408J510661
$$ -2202447 -739751 3932835 -2687504 -3355212 -5404438 1557680 413758 1760166 3270827
772C270827A531541L66541g65940l799882C487893e354705A067776J002497g47082
$$ 3270827 1531541 1898082 -765940 -4565822 3487893 -5354705 1067776 2070273 -747082
762b570421B846657a701812D665610b238232l74064P44207o46483C888389A392352
$$ -2570421 2846657 -1701812 4665610 -2238232 -2612296 -1868089 -2514572 3888389 1392352
752b668172i79118d11743A751368a069205A8307i7378j769913d1555A29495b125805
$$ -2668172 -979118 -411743 1751368 -1069205 18307 -97378 -1867291 -41555 129495 -2125805
741C863006j126683A093857C87439K423105a807402C534864j069821d78985D823866
$$ 3863006 2736323 1093857 387439 2810544 -1807402 3534864 2465043 -478985 4823866
731e88180o921965f17629B276309H81976k5523l02294K420152G73725K171184
$$ -588180 -7510145 -617629 2276309 881976 856453 554159 2974311 773725 2944909
722B944909D08737b592911D23464J014875i901818B624050a747336A977150p35187
$$ 2944909 408737 -2592911 423464 1438339 -9901818 2624050 -1747336 1977150 1241963
713A241963R26664g134806b000604N70523P06820G27738c477299F27365f62270
$$ 1241963 2168627 -7134806 -2000604 -1430081 -723261 727738 -3477299 627365 -662270
703D068475F43678O91526c623379C225803B48715a401271J61717j661163D947748
$$ 4068475 643678 1335204 -3623379 3225803 248715 -1401271 -1239554 -2900717 4947748
693g350225E207942b448135A070283a921378A594244b813989R83247B363965f035679
$$ -7350225 5207942 -2448135 1070283 -1921378 1594244 -2813989 -1830742 2363965 -6035679
683c288331C087802c553720B253085J323065C56334Q77521m52322b196721A018274
$$ -3288331 3087802 -3553720 2253085 3576150 356334 1233855 781533 -2196721 1018274
673b300395A762153o05986C37608b775435A252524c476612b11346k57913A733018
$$ -2300395 1762153 1156167 337608 -2775435 1252524 -3476612 -211346 -469259 1733018
663a562402A569177c07556C180306a080300F18092N358406b307096A096391e817300
$$ -1562402 1569177 -307556 3180306 -1080300 618092 5976498 -2307096 1096391 -5817300
653D75052K390810e87037D64685M38002h73328D940002d801420A750572g55256
$$ 475052 2865862 -587037 464685 902687 -873328 4940002 -4801420 1750572 -755256
643a7188n437010b334076Q54072G10068a524704b63834G45562K642311f425827
$$ -17188 -5454198 -2334076 -1480004 710068 -1524704 -263834 745562 3387873 -6425827
633C456634e44319P1793l7800m597C324034b742233A321636J102186H63918d225125
$$ 3456634 -544319 -472526 -510326 -514923 3324034 -2742233 1321636 2423822 863918 -4225125
622c063430Q84721B796865g7041j21299B340553c604921D231798a095744n88994
$$ -3063430 -2178709 2796865 -77041 -198340 2340553 -3604921 4231798 -1095744 -1684738
613a684738j890591E532a036532A564633E76125A67253M17804b573165a112208
$$ -1684738 -3575329 5532 -1036532 1564633 576125 167253 585057 -2573165 -1112208
603h96677A300299c198639f65497j294341m36767R35232A574202a178947j299790
$$ -896677 1300299 -3198639 -665497 -1959838 -2396605 -1461373 1574202 -1178947 -2478737
594b478737B925233A280503J898351f23222K66300C758144b276665l082661A024789
$$ -2478737 2925233 1280503 3178854 -623222 -356922 3758144 -2276665 -5359326 1024789
584b694496a130010p8398B91240N417617B726519a118586l22595j421377J278875
$$ -2694496 -1130010 -1208408 291240 5708857 2726519 -1118586 -1441181 -2862558 -1583683
575a583683r05241g54980A457244k45355a737196A579387K687131b909572J159908
$$ -1583683 -2488924 -754980 1457244 1211889 -1737196 1579387 4266518 -2909572 -1749664
566a749664E83480L007277d293712A252174b61598B266503a779539F76934r7012
$$ -1749664 583480 3590757 -4293712 1252174 -261598 2266503 -1779539 676934 579922
557E79922J346960b583985A26582K055897D70093K325610c25480j007350A61289
$$ 579922 1926882 -2583985 126582 2182479 470093 2795703 -325480 -1332830 161289
547A925012B60446J528303B67931e43223G08584a410520k467755B900029c55778
$$ 1925012 260446 1788749 267931 -543223 708584 -1410520 -3878275 2900029 -355778
537f566734C304504A481325g60054m420341h78687j024987O83269A853205K273491
$$ -6566734 3304504 1481325 -760054 -5180395 -878687 -1903674 -1220405 1853205 4126696
528D126696D51080f241052e49819H99052K914114j431109d18214k085209C32968
$$ 4126696 451080 -6241052 -549819 899052 3813166 2382057 -418214 -2503423 332968
518H56727L60489a590709c38710l42437G67617K321570g169229B834840A312258
$$ 856727 1217216 -1590709 -338710 -681147 767617 3089187 -7169229 2834840 1312258
508a886479F86486K733829a365995J33982k128335A64135K141750Q70068h377978
$$ -1886479 686486 3420315 -1365995 -1232013 -3360348 164135 2305885 3175953 -8377978
498B499953e218702A686071M55525p42205K37436E64830L709636a279901D83398
$$ 2499953 -5218702 1686071 2141596 1399391 1636827 564830 4274466 -1279901 483398
488A366711d994893A838264d852317F332224k307740b185283j721322C073539
$$ 1366711 -4994893 1838264 -4852317 6332224 4024484 -2185283 -3906605 3073539
479B291831d88544l518892A552948a220507c50295j765206I1063J212769L90492
$$ 2291831 -488544 -4007436 1552948 -1220507 -350295 -2115501 91063 1303832 1694324
470A694324a77010E55410J269028b791215B170600a4301B957724a124581E837399
$$ 1694324 -177010 555410 1824438 -2791215 2170600 -14301 2957724 -1124581 5837399
460i98372l128181B280341q90165a66201D41711b243426E889178C91614J361780
$$ -998372 -4126553 2280341 1390176 -166201 441711 -2243426 5889178 391614 1753394
451A753394a478257o587714A025511a23178q87108H19804b094401C892478e239104
$$ 1753394 -1478257 -8065971 1025511 -123178 -1010286 819804 -2094401 3892478 -5239104
441b228404B177125m39195K70137R09782a550397A969997a718881l634931a563276
$$ -2228404 2177125 1737930 2008067 2917849 -1550397 1969997 -1718881 -5353812 -1563276
431E304108e031362D307427Q66277a609201k063315J254256D605037j017432d378921
$$ 5304108 -5031362 4307427 5173704 -1609201 -3672516 -2418260 4605037 3587605 -4378921
421b602127A873947q80504c691404f55082L2439A328772b341576K25459D418642
$$ -2602127 1873947 993443 -3691404 -655082 -622643 1328772 -2341576 -2116117 4418642
411B201984J26549b727221A498353b744461j662839i76665k8910D041402c583811
$$ 2201984 2328533 -2727221 1498353 -2744461 -4407300 -976665 -1005575 4041402 -3583811
401d359420f74221k362028D328927C480h89713J0946k671545g00846B348424d738072
$$ -4359420 -674221 -3036249 4328927 3480 -889713 -878767 -3550312 -700846 2348424 -4738072
390C38625J772557c709423a086485j39439E257205G71861a37508I19560J428076
$$ 338625 2111182 -3709423 -1086485 -1225924 5257205 771861 -137508 919560 2347636
381B347636a546421j22818B409838a76660B338290a73433q4621j140829j378369
$$ 2347636 -1546421 -1669239 2409838 -176660 2338290 -173433 -258054 -1398883 -2777252
372b777252a059157I32496c817141E946976B042614h19545B519036c872631B024524
$$ -2777252 -1059157 932496 -3817141 5946976 2042614 -819545 2519036 -3872631 2024524
362c038784a339588G154622B015670e408263A445118l59988L391765f519869A765745
$$ -3038784 -1339588 7154622 2015670 -5408263 1445118 1085130 4476895 -6519869 1765745
352I17260M417029d570192a440496D552730b425620A663792b24886H55549a116148
$$ 917260 5334289 -4570192 -1440496 4552730 -2425620 1663792 -224886 855549 -1116148
342a822507j280297f13435C60244J520071k99458d135164k14174H43443c242864
$$ -1822507 -3102804 -613435 360244 1880315 1580857 -4135164 -4349338 843443 -3242864
332a696762q44408D117673A77275b46321A549250c161768f23518j509478m37183
$$ -1696762 -2541170 4117673 177275 -246321 1549250 -3161768 -623518 -2132996 -2570179
323b570179f43355H9328L51616i64217k994063B739335j021504M32965f76921
$$ -2570179 -643355 89328 440944 -964217 -3958280 2739335 1717831 2150796 -676921
313a965565A465120O59427j31553a808844c65626B370454a879740R17551k896987
$$ -1965565 1465120 2124547 1992994 -1808844 -365626 2370454 -1879740 -962189 -3859176
304c859176C00322J066653E91455c822824A005081M69567b055355B75917a466495
$$ -3859176 300322 1366975 591455 -3822824 1005081 1474648 -2055355 275917 -1466495
294c611451f93576j028105c63872G08799P249353f41979A231406A37691J534501
$$ -3611451 -693576 -1721681 -363872 708799 7958152 -641979 1231406 137691 1672192
285A672192p85613k12694C36335J423645B34947e7505m926529C095353b589097
$$ 1672192 886579 673885 336335 1759980 234947 -57505 -4984034 3095353 -2589097
275b675072R26700A90495a539283B771378q02673K065829a424213A730293c661042
$$ -2675072 -1748372 190495 -1539283 2771378 1968705 4034534 -1424213 1730293 -3661042
265F732159g92504A457829m21027a14882j526204n289107B339053f826972B620501
$$ 6732159 -792504 1457829 1036802 -114882 -1641086 -6930193 2339053 -6826972 2620501
255a196694K86478B18218K366776C13848c441510B037691L170526A052841c624948
$$ -1196694 -910216 218218 2584994 313848 -3441510 2037691 5208217 1052841 -3624948
245b271044b69197A905183i08611l72491H36522C07633M4192P15139J758588c984153
$$ -2271044 -269197 1905183 -908611 -1281102 836522 307633 351825 1066964 2825552 -3984153
234I60100m52534d385038J815231A415717i44711k284763a127108C091729p46205
$$ 960100 507566 -4385038 -2569807 1415717 -944711 -3229474 -1127108 3091729 2345524
225B345524I56995a312023j864432o37213A503352Q57303g16091A268956f412488
$$ 2345524 956995 -1312023 -3176455 -3813668 1503352 2360655 -716091 1268956 -6412488
215c446145A868341p63807d423668C600163I67813a295462C87361K697394F79453
$$ -3446145 1868341 1104534 -4423668 3600163 967813 -1295462 387361 3084755 679453
205b778411A078234d840945a931953A574150J051647k16581e364907e89585C402242
$$ -2778411 1078234 -4840945 -1931953 1574150 2625797 2409216 -5364907 -589585 3402242
195B998772J194273A907219b677902J289839E991085a892907O18541B873532a284422
$$ 2998772 4193045 1907219 -2677902 -1388063 5991085 -1892907 -1274366 2873532 -1284422
185C527675A011799D43050d757802A885276F15277a519534L50494l826216A48246
$$ 3527675 1011799 443050 -4757802 1885276 615277 -1519534 -1169040 -4995256 148246
175A363816f028054G01291a954432b49536B548030a063312A393446b861603E32838
$$ 1363816 -6028054 701291 -1954432 -249536 2548030 -1063312 1393446 -2861603 532838
165B079026b061248A70763O46375h55364D201121A362559a691227j290098a370559
$$ 2079026 -2061248 170763 817138 -855364 4201121 1362559 -1691227 -2981325 -1370559
155B535897a302629k64139D045855A940411O53137J15779J187547b478707D689773
$$ 2535897 -1302629 -1566768 4045855 1940411 2593548 2709327 3896874 -2478707 4689773
145B323840b74113E771737c571445J298913D684676c247770H92496E4866a492456
$$ 2323840 -274113 5771737 -3571445 -2272532 4684676 -3247770 892496 54866 -1492456
135b304781G92659l19615b584723B818820j163877a265009D53364a676553l22058
$$ -2304781 792659 473044 -2584723 2818820 1654943 -1265009 453364 -1676553 -1998611
126a998611E144655g02637A767894G88462a285458A386457a949114b01142I30564
$$ -1998611 5144655 -702637 1767894 788462 -1285458 1386457 -1949114 -201142 930564
116a481159n633705A757244e17491A200777K374546a44979k005984C868135q34893
$$ -1481159 -7114864 1757244 -517491 1200777 3575323 -144979 -2150963 3868135 3033242
107C033242a260556E01613B2082h63675E309180h08329D08682a32443H93676b643621
$$ 3033242 -1260556 501613 22082 -863675 5309180 -808329 408682 -132443 893676 -2643621
96h01043B424776c762497B089246N2298c708649e24681B22912M58633k767g75681
$$ -801043 2424776 -3762497 2089246 2141544 -3708649 -524681 222912 681545 678778 -775681
85d711054a315482n17529A30090E1735d80286D899369c450542g77255l976656
$$ -4711054 -1315482 -1833011 130090 51735 -480286 4899369 -3450542 -777255 -4753911
76d753911B493751a333312I81244N203323b391604D132453d492023A201103j04777
$$ -4753911 2493751 -1333312 981244 6184567 -2391604 4132453 -4492023 1201103 1096326
67A096326D05358a602350l60403Q81668f3110j132391K76741q2967M85712D788784
$$ 1096326 405358 -1602350 -1962753 -1081085 -63110 -1195501 -918760 -1001727 -516015 4788784
56b603618m44560a487241B845738k77275a421369A585295d639937B028976m00581
$$ -2603618 -3048178 -1487241 2845738 2568463 -1421369 1585295 -4639937 2028976 1628395
47A628395G95491C79193J287852L88351J055484a148029B845937J176457A980793
$$ 1628395 795491 379193 1667045 2055396 3110880 -1148029 2845937 4022394 1980793
37b16685D97976h61324B54166L332745f778231A788152J757255A598066d995364
$$ -216685 497976 -861324 254166 3586911 -6778231 1788152 3545407 1598066 -4995364
27b591220F208762a896180B699390d47972m46220j791465A396301b908930j512168
$$ -2591220 6208762 -1896180 2699390 -447972 -894192 -2685657 1396301 -2908930 -4421098
18d421098F516628b15962B8532b858048a8758F044621g4477l502073A322628D89677
$$ -4421098 6516628 -215962 28532 -2858048 -18758 6044621 -74477 -3576550 1322628 489677
7c03177A466507m16327c423813A469828J417723a708059A511588
$$ -303177 1466507 1050180 -3423813 1469828 2887551 -1708059 1511588
##PAGE= F1=14795.85195089
##FIRST=     21204.543296753, 2672.49122660428, 75699
##DATA TABLE= (F2++(Y..Y)), PROFILE
2047G5699R16389Q38239K48152b056848p89590f87113I65111Q39472K161205a018634
$$ 75699 992088 1830327 2078479 -2056848 -2846438 -687113 965111 1804583 3965788 -1018634
2036B025043h83363F333392h05075A957468b186967C155378a58826m059850A1941
$$ 2025043 -883363 6333392 -805075 1957468 -2186967 3155378 -158826 -4218676 11941
2026B403101a037701n69328B745419c639170B828436b075086q14214B457880b838187
$$ 2403101 -1037701 -1607029 2745419 -3639170 2828436 -2075086 -2889300 2457880 -2838187
2016A773684a924526f58060A431480K922284h34901k221285F033545I86835J242915
$$ 1773684 -1924526 -658060 1431480 4353764 -834901 -3056186 6033545 986835 2229750
2007B229750c995472A775446o27772N92189a00819m598605e73306j601592C030604
$$ 2229750 -3995472 1775446 1147674 1739863 -100819 -4699424 -573306 -2174898 3030604
1997A694552O569035f361984A253088a210844A619737F05526d417094b143281
$$ 1694552 8263587 -6361984 1253088 -1210844 1619737 605526 -4417094 -2143281
1988F556510E8339K030602a379283D025703a441848B687116c114550a175068D879733
$$ 6556510 58339 2088941 -1379283 4025703 -1441848 2687116 -3114550 -1175068 4879733
1978b976422l39536J181410k396321A027622b444486B029960c12124C919099A774996
$$ -2976422 -3315958 -2134548 -4530869 1027622 -2444486 2029960 -312124 3919099 1774996
1968h30729k140081f76491k444541B13023b743800a334616C347259G74096h90466
$$ -830729 -2970810 -676491 -3121032 213023 -2743800 -1334616 3347259 774096 -890466
1958A506345C61983L771169D17810g039104B068377d757969J241090d5169p96032
$$ 1506345 361983 4133152 417810 -7039104 2068377 -4757969 -3516879 -45169 -841201
1949h41201C222894H82959J989062d51119m85865b46779A312169a276896B415046
$$ -841201 3222894 882959 2872021 -451119 -936984 -246779 1312169 -1276896 2415046
1939C405853b095621P45526C021662d15737A228767F5588K874922a925742K62036
$$ 3405853 -2095621 -1350095 3021662 -415737 1228767 65588 2940510 -1925742 -1663706
1930a663706B397445e703491g53948A229890J997369j102749a760466f90420l009942
$$ -1663706 2397445 -5703491 -753948 1229890 3227259 2124510 -1760466 -690420 -3700362
1921c700362B114538d445928D937522f29986A087863a162537m203218C766521
$$ -3700362 2114538 -4445928 4937522 -629986 1087863 -1162537 -5365755 3766521
1912A130502J4988533O928109c1383645J3233210k1382707J4265635P327981e765500
$$ 1130502 16119035 23047144 -31383645 -18150435 -39533142 -25267507 -17939526 -5765500
1903B5112554q049053M038424r98135R920424K515530a5173438E40182R528352
$$ 25112554 17063501 21101925 20103790 30024214 32539744 -15173438 540182 10068534
1895A0068534J5487551F313707n63622c3336488k4743857J3240861J9482518G942193
$$ 10068534 25556085 6313707 5750085 -33336488 -58080345 -44839484 -25356966 7942193
1886A9994809o946245A938005P784009B675663O130794M55271b999112D569400
$$ 19994809 13048564 1938005 9722014 2675663 8806457 9261728 -2999112 4569400
1877c190735J36179l12869j6549694f885127k0135011e644258o710305H390122
$$ -3190735 -3054556 -3367425 -19917119 -6885127 -27020138 -5644258 -12354563 8390122
1868F399703k979132J1781062E766413J2894011a606079E901084c85208C86426
$$ 6399703 3420571 15201633 5766413 18660424 -1606079 5901084 -385208 386426
1859B99698i65256l019933G83238P63783L33940h39559e5876A71012O51954K873603
$$ 299698 -965256 -3985189 783238 1547021 1880961 -839559 -55876 171012 822966 3696569
1849C696569G81651J29946J036642i76642C18439a082112B277713q11549a865761
$$ 3696569 781651 911597 1948239 -976642 318439 -1082112 2277713 1466164 -1865761
1839F50518K727594d736409A056683j97883b02032C825172c202099a511997O09128
$$ 650518 3378112 -4736409 1056683 858800 -202032 3825172 -3202099 -1511997 -902869
1830i02869l317830H4532b128673B221296m41160J107511G58249a548851C14328
$$ -902869 -4220699 84532 -2128673 2221296 1780136 2887647 758249 -1548851 314328
1820B397892a953496H15139L811281B67544d289321a216390B028128C69152A75114
$$ 2397892 -1953496 815139 4626420 267544 -4289321 -1216390 2028128 369152 175114
1810a496160F23276a797458f25834l87785k562298C04370c176791A593596J17316
$$ -1496160 623276 -1797458 -625834 -1013619 -3575917 304370 -3176791 1593596 1710912
1801A710912K63725b369336A439907N028762b5390j794146K78475G38006e953850
$$ 1710912 1974637 -2369336 1439907 6468669 -25390 -1819536 -1541061 738006 -5953850
1791B661640c432084D436282e303367I25398K457139j168342H75008J127261B72163
$$ 2661640 -3432084 4436282 -5303367 925398 3382537 2214195 875008 2002269 272163
1781b23490C57789b054554C544400A665055n97459J443276a162117k976224D603860
$$ -223490 357789 -2054554 3544400 1665055 1067596 2510872 -1162117 -4138341 4603860
1771c369678k86705D927d194625B464696f04842C795458c056165J158120I69094
$$ -3369678 -3656383 4927 -4194625 2464696 -604842 3795458 -3056165 -1898045 969094
1761B295534L095375c311668f94433m737968a841632m149916E263525a18929p837953
$$ 2295534 5390909 -3311668 -694433 -5432401 -1841632 -5991548 5263525 -118929 -7956882
1752g956882F422592b392337C015946g513401I249789a775166C21520J872153
$$ -7956882 6422592 -2392337 3015946 -7513401 9249789 -1775166 321520 2193673
1744B193673b211538C324530i83807o77553k91778C145809j049033c088257D668843
$$ 2193673 -2211538 3324530 -983807 -1661360 -1953138 3145809 2096776 -3088257 4668843
1734b453706c9458j248194C652542b911562J399832c17650B188099c340644J364102
$$ -2453706 -39458 -1287652 3652542 -2911562 -1511730 -317650 2188099 -3340644 -1976542
1725a976542A70439M287175a574146E16283d01794C908842A033802J41090a755797
$$ -1976542 170439 4457614 -1574146 516283 -401794 3908842 1033802 1174892 -1755797
1715A519238c579327e44067j809139j169954D916336C95358b388279D75645c747225
$$ 1519238 -3579327 -544067 -2353206 -3523160 4916336 395358 -2388279 475645 -3747225
1705c009533l18686H94567B15511b813196B344976a05372j660853C422460b674375
$$ -3009533 -3328219 894567 215511 -2813196 2344976 -105372 -1766225 3422460 -2674375
1695D17981K867802i62970d67021B562066b430352E4813L09218c57385j698270
$$ 417981 3285783 -962970 -467021 2562066 -2430352 54813 364031 -357385 -2055655
1686b055655B549503b117060C993282F59224f535022E876888c402902a74917p81651
$$ -2055655 2549503 -2117060 3993282 659224 -6535022 5876888 -3402902 -174917 -956568
1677i56568D672065F25570L8977a012613l80025C74545E799h41626j954195C237249
$$ -956568 4672065 625570 664547 -1012613 -1392638 374545 5799 -841626 -2795821 3237249
1666a526614g11125j063027A199902b508536B120979k43886a805935D08144J129489
$$ -1526614 -711125 -1774152 1199902 -2508536 2120979 1877093 -1805935 408144 1537633
1657A537633m27750a870838I8014J968395b987987H02287M094180b499487h2672
$$ 1537633 1109883 -1870838 98014 2066409 -2987987 802287 4896467 -2499487 -82672
1647b554281a090625C629612j776182c160409C031211e183599F022503j931919
$$ -2554281 -1090625 3629612 1853430 -3160409 3031211 -5183599 6022503 4090584
1639D090584a599465k52761C792758E43092J523716b299849R67968K88467G403471
$$ 4090584 -1599465 -1852226 3792758 543092 2066808 -2299849 -1331881 -1043414 7403471
1629i33784B095453b71379G767200R181014K0714273L1354694a02728832j65724090
$$ -933784 2095453 -271379 7767200 16948214 37662487 69017181 -102728832 -268452922
1621b68452922A63557711C4784583A2371113D410588l17404j42434Q20313d54781
$$ -268452922 163557711 34784583 12371113 4410588 4093184 3950750 4771063 -454781
1612B003327M66073f5474A361149b953170A00044Q42980K948361a748251I43761
$$ 2003327 2469400 -65474 1361149 -2953170 100044 943024 3891385 -1748251 943761
1602i52640A962414D7113J091975a065136B299110k17A34576O63565K430649b607865
$$ -952640 1962414 47113 1139088 -1065136 2299110 2298893 134576 798141 3228790 -2607865
1591B651096b171347C360200C21283M079035f825096K805435D457629a509329
$$ 2651096 -2171347 3360200 321283 4400318 -6825096 -4019661 4457629 -1509329
1582b853227E017076b765060C10300J134123b04061l978510A030681O52075K62046
$$ -2853227 5017076 -2765060 310300 1444423 -204061 -4182571 1030681 1682756 1944802
1573A944802Q4515c321656a578319a92457A018656k07933a242926c30134l56628
$$ 1944802 2029317 -3321656 -1578319 -192457 1018656 810723 -1242926 -330134 -686762
1564f86762A056823D01520Q756202b290092h36191k660096F33817L866415F93743
$$ -686762 1056823 401520 9157722 -2290092 -836191 -3496287 633817 4500232 693743
1554C5345b623918D77943J072543D17070j31392L091345A340530a216091B776875
$$ 35345 -2623918 477943 1550486 417070 285678 3377023 1340530 -1216091 2776875
1544a690176A655002j95165d753594F494080f57531A730233b932418A614360G22362
$$ -1690176 1655002 1459837 -4753594 6494080 -657531 1730233 -2932418 1614360 722362
1534C522334a953320i40084h0686B339214d468363J469117d01174o624800C254094
$$ 3522334 -1953320 -940084 -80686 2339214 -4468363 -2999246 -401174 -7025974 3254094
1524B73556a251158m171387B27963b187348B2876K560434F11998j41891b16072
$$ 273556 -1251158 -5422545 227963 -2187348 22876 2583310 611998 470107 -216072
1514c580516F827687d195238C623240L86875d53076r89136L02996A087865f88938
$$ -3580516 6827687 -4195238 3623240 4010115 -453076 -1442212 -1139216 1087865 -688938
1504D58147p1021c923856C514302a355255k985175B721743b115896B141904A005672
$$ 458147 387126 -3923856 3514302 -1355255 -4340430 2721743 -2115896 2141904 1005672
1494g551333a704394m041698C762996c890013D557452i57253A737988q6923f189112
$$ -7551333 -1704394 -5746092 3762996 -3890013 4557452 -957253 1737988 1651065 -6189112
1484B755428g36762B776992d98801j483273r57956a29376G6091K592504a144479
$$ 2755428 -736762 2776992 -498801 -1982074 -2940030 -129376 76091 2668595 -1144479
1474d303255d64630d4684E04876a672366j951449A150916A27196c776455a552534
$$ -4303255 -464630 -44684 504876 -1672366 -3623815 1150916 127196 -3776455 -1552534
1464c782117D370934a699905l667185C369899j616061m88297c16741L4533A56486
$$ -3782117 4370934 -1699905 -5367090 3369899 1753838 1265541 -316741 -282208 156486
1454i56901C233749a44753j951297A61979c772947H127934f741207B77354a629183
$$ -956901 3233749 -144753 -2096050 161979 -3772947 8127934 -6741207 277354 -1629183
1444D816200c821139B657869c44655A152963b065154N08788C254075a079123n49218
$$ 4816200 -3821139 2657869 -344655 1152963 -2065154 -1556366 3254075 -1079123 -1628341
1435a628341l677643a056984C581115j623650a216135C235052a349026f00552
$$ -1628341 -5305984 -1056984 3581115 1957465 -1216135 3235052 -1349026 -600552
1426B300009c272237a003340A956932l05808g021396C155102C73200L394735c104157
$$ 2300009 -3272237 -1003340 1956932 1651124 -7021396 3155102 373200 3767935 -3104157
1416C684187j683195L46703c91676m332047E92635O101595a213891I12173d111219
$$ 3684187 2000992 2347695 -391676 -4723723 592635 6694230 -1213891 912173 -4111219
1406G543740A255473a183856k130920C735579b681738C926775A626998e371006
$$ 7543740 1255473 -1183856 -3314776 3735579 -2681738 3926775 1626998 -5371006
1397C693963d039536B09261b009902k924617D905760A283086h62675a26695j906554
$$ 3693963 -4039536 209261 -2009902 -4934519 4905760 1283086 -862675 -126695 -2033249
1388b033249G077018a219075B284940c73049j4024k028518B102218f01686C365812
$$ -2033249 7077018 -1219075 2284940 -373049 -387073 -2415591 2102218 -601686 3365812
1378a540537n05748l072223B414057b569167A012915M064295A465419e39515C85344
$$ -1540537 -2046285 -5118508 2414057 -2569167 1012915 5077210 1465419 -539515 385344
1368A429459i41926F00728L890480h22376p041361A538428k16315e167611C456315
$$ 1429459 -941926 600728 4491208 -822376 -7863737 1538428 1322113 -5167611 3456315
1358B656017q41431E48697J207970J468462i211906C003793F61631d759906F72081
$$ 2656017 1814586 548697 1756667 3225129 -9211906 3003793 661631 -4759906 672081
1348A033133b621908J73919L75641A42829J821548b51068g3724l987716Q53625
$$ 1033133 -2621908 -2447989 -2072348 142829 1964377 -251068 -73724 -4061440 -3207815
1339c207815F258649a58473j13007k49877G268216b803007b14921m606849I27260
$$ -3207815 6258649 -158473 -271480 -521357 7268216 -2803007 -214921 -4821770 927260
1329a07934k336080L9293J097590B559549a149875m888226D273294c464623D757178
$$ -107934 -2444014 -2404721 -1307131 2559549 -1149875 -6038101 4273294 -3464623 4757178
1319e326401B771120e110775a187274E76488d170026a545582H18994d88936p67561
$$ -5326401 2771120 -5110775 -1187274 576488 -4170026 -1545582 818994 -488936 -1256497
1310a256497F09341a146082N10937l095218C249913j092277b702820F673362A267929
$$ -1256497 609341 -1146082 -635145 -3730363 3249913 2157636 -2702820 6673362 1267929
1300a59218G92238h27215H78806C72501c906419D11121J673732n36435a206294
$$ -159218 792238 -827215 878806 372501 -3906419 411121 2084853 1548418 -1206294
1290b632154E91642f77234C290339d453555B058387m63227g55435m074191C813592
$$ -2632154 591642 -677234 3290339 -4453555 2058387 1595160 -755435 -4829626 3813592
1280a767093F61263L8368f94269F27861a721222E368707A552637a671926j759031
$$ -1767093 661263 699631 -694269 627861 -1721222 5368707 1552637 -1671926 -3430957
1271c430957g33924A448147K962122a793649A323496a033629D748620b147860
$$ -3430957 -733924 1448147 4410269 -1793649 1323496 -1033629 4748620 -2147860
1262H43000J614273i33324j886736c12078B777138h69508k218689G666015e338078
$$ 843000 2457273 -933324 -2820060 -312078 2777138 -869508 -3088197 7666015 -5338078
1252b658747J204036c56275G32630P55156c681308J138723C693857e520073K348744
$$ -2658747 -1454711 -356275 732630 1487786 -3681308 -2542585 3693857 -5520073 -3171329
1243c171329A280016f1208b170j87748B237690A115416C76379g316021A214134
$$ -3171329 1280016 -61208 -2170 -189918 2237690 1115416 376379 -7316021 1214134
1233D297367a927123A825750f19747k506990C271445a839111e23879K45606G211826
$$ 4297367 -1927123 1825750 -619747 -3126737 3271445 -1839111 -523879 -278273 7211826
1223b916572e17794H01889J320971B46846c408585A060303P02807k43305m44000
$$ -2916572 -517794 801889 2122860 246846 -3408585 1060303 1763110 1519805 1075805
1214A075805m13415a255071D738173b538152g43640B718726K573630G69788a856409
$$ 1075805 662390 -1255071 4738173 -2538152 -743640 2718726 5292356 769788 -1856409
1204E799994a533044j638957C877147f97317b28930D24736h19993l374806F99465
$$ 5799994 -1533044 -3172001 3877147 -697317 -228930 424736 -819993 -4194799 699465
1194A404120h41458k477239J497322E968547A249377c628229C208710A540336
$$ 1404120 -841458 -3318697 -1821375 5968547 1249377 -3628229 3208710 1540336
1185A64815J385484d609202A729078a782219B28969M0113K865824d564027F67359
$$ 164815 1550299 -4609202 1729078 -1782219 228969 269082 3134906 -4564027 667359
1175h089375A697029f86247I06613k07978c242722B17814b724320C9282a273149
$$ -8089375 1697029 -686247 906613 698635 -3242722 217814 -2724320 39282 -1273149
1165H43083K904894j55447e027700e01763C907348g145116B148544a465683r46076
$$ 843083 3747977 3592530 -5027700 -501763 3907348 -7145116 2148544 -1465683 -2411759
1156b411759A336482i9448A643686k50271c426C121268f11179m94209j812448
$$ -2411759 1336482 -99448 1643686 1393415 -3426 3121268 -611179 -1105388 -2917836
1147b917836E18784h23258D282397A455372l16960c585406C35288K186958a385638
$$ -2917836 518784 -823258 4282397 1455372 1138412 -3585406 335288 2522246 -1385638
1137c585689B80299e77217k65424c91473l581622A994909A63946i94878C12654
$$ -3585689 280299 -577217 -842641 -391473 -3973095 1994909 163946 -994878 312654
1127F34123K0492e50690O9581m565738a097923A013101M46639f97223G3818a796203
$$ 634123 654615 -550690 -481109 -5046847 -1097923 1013101 1459740 -697223 73818 -1796203
1116a298179C2299a474049A311106Q44946e359743C42248J432943b82813q52018
$$ -1298179 32299 -1474049 1311106 2156052 -5359743 342248 1775191 -282813 -1134831
1107a134831j84831D075069f96838A486807J647544A048716n06079O4800h26459
$$ -1134831 -1319662 4075069 -696838 1486807 3134351 1048716 542637 607437 -826459
1097b037571C204668o64530j013280b437405E47661b552893o16945C06469i76587
$$ -2037571 3204668 2540138 1526858 -2437405 547661 -2552893 -3169838 306469 -976587
1087D360182d42970q2984k254772A78758g41054D264084b34847o381065A410045
$$ 4360182 -442970 -525954 -2780726 178758 -741054 4264084 -234847 -6615912 1410045
1077G32076h37438p79681D006265a015625A149673C75810e85668j279652J85645
$$ 732076 -837438 -1617119 4006265 -1015625 1149673 375810 -585668 -1865320 -1679675
1068a679675B872115H95411b074296d15023n69870j849748B212576a205653m630255
$$ -1679675 2872115 895411 -2074296 -415023 -984893 -2834641 2212576 -1205653 -5835908
1059e835908a871892E929846B95667J378126A30521N11181b702267F66267c71647
$$ -5835908 -1871892 5929846 295667 1673793 130521 641702 -2702267 666267 -371647
1049g03125B199356M00857c737678B665745a671768o15146B085259h89219l55289
$$ -703125 2199356 2600213 -3737678 2665745 -1671768 -2286914 2085259 -889219 -1244508
1040a244508N21819j139427A477301a579142A039820O54910c768616C047692a481262
$$ -1244508 -722689 -1862116 1477301 -1579142 1039820 1694730 -3768616 3047692 -1481262
1030a163782F95082c755193a493160C570970A142359J320390b276671f96048I51932
$$ -1163782 695082 -3755193 -1493160 3570970 1142359 2462749 -2276671 -696048 951932
1020E26647Q49805b426642B386093a189320H68393a578965f83328H38490c031102
$$ 526647 1376452 -2426642 2386093 -1189320 868393 -1578965 -683328 838490 -3031102
1010A935715A31996a573978A314141E46560L97283K398603e556032J002813C167132
$$ 1935715 131996 -1573978 1314141 546560 943843 3342446 -5556032 -4553219 3167132
1000A857567l50283b451817A620915F60039b843522B744238b650474A724126R73878
$$ 1857567 1507284 -2451817 1620915 660039 -2843522 2744238 -2650474 1724126 2698004
991B698004i16031L04166B078508L811594b972358I056410b827738C755358b354984
$$ 2698004 -916031 -611865 2078508 5890102 -2972358 9056410 -2827738 3755358 -2354984
981C546999b701270J076716O78485k300997Q68405D021673b784622e28825C746476
$$ 3546999 -2701270 -1624554 -946069 -3247066 -2378661 4021673 -2784622 -528825 3746476
971E96886a8466p76786n90222A399236K256214b832183a171344d62963D20803
$$ 596886 -18466 -795252 -1385474 1399236 3655450 -2832183 -1171344 -462963 420803
961b880114M44248O65129O51282n91515e98962D490469b746863A904591L009649
$$ -2880114 -2435866 -1770737 -1119455 -1710970 -598962 4490469 -2746863 1904591 4914240
952D914240i78884C831832E89302K598062c64622A144579b692149I86860b845467
$$ 4914240 -978884 3831832 589302 3187364 -364622 1144579 -2692149 986860 -2845467
942I569352a724488I13587O8172K46632a609098m68399D590471f50521j267819
$$ 9569352 -1724488 913587 981759 1228391 -1609098 -2077497 4590471 -650521 -1918340
933a918340k627574F744847a257754j547593B132574m65466M178626f287470E161862
$$ -1918340 -4545914 6744847 -1257754 -2805347 2132574 1667108 5845734 -6287470 5161862
923G5411Q89485b182094K25318E44946d55041B439003B85171e97496B749594f83431
$$ 75411 964896 -2182094 -1956776 544946 -455041 2439003 285171 -597496 2749594 -683431
912a470292a6477m657546C831297G56302a798009G49076b666315J243222C493844
$$ -1470292 -16477 -4674023 3831297 756302 -1798009 749076 -2666315 -1423093 3493844
902B128553e695253A786303d138084F274198c035399c97237A0667J884809b168663
$$ 2128553 -5695253 1786303 -4138084 6274198 -3035399 -397237 10667 1895476 -2168663
892A864270D0454Q49121J142677a999394e1669A230178i45672j663150b94397
$$ 1864270 40454 889575 2032252 -1999394 -51669 1230178 -945672 -2608822 -294397
882g31205B57589L109564C04077J140350L97716a813581B870761b341501A273651
$$ -731205 257589 3367153 304077 1444427 1842143 -1813581 2870761 -2341501 1273651
872b957119D201806J187024a256569C236768c090223k392579E371371d33271j913947
$$ -2957119 4201806 5388830 -1256569 3236768 -3090223 -5482802 5371371 -433271 -2347218
863b347218I22307b680206B599092a872210I1354a361483D881138a248971C791378
$$ -2347218 922307 -2680206 2599092 -1872210 91354 -1361483 4881138 -1248971 3791378
853a0410D485252A42056K381545g48707k955491D456786g46225m775081c40323
$$ -10410 4485252 142056 2523601 -748707 -3704198 4456786 -746225 -5521306 -340323
843a849717A888521f70969j90606F73703a027556E52739a215305H44123C07648
$$ -1849717 1888521 -670969 -861575 673703 -1027556 552739 -1215305 844123 307648
833a025510j001245A000977K193983B75182J036329a015535j904253C11292N126284
$$ -1025510 -2026755 1000977 3194960 275182 1311511 -1015535 -2919788 311292 5437576
824E437576A269199a704028E568677b91984A014003n9253K57907b377682D125348
$$ 5437576 1269199 -1704028 5568677 -291984 1014003 954750 1212657 -2377682 4125348
814I64911l01147P77470c57406l366356H96379a773311P17302H01324a918085
$$ 964911 663764 1441234 -357406 -3723762 896379 -1773311 -1056009 801324 -1918085
804C582245I87921K822645h86595j145332A434273J072000H11514g41467J38201
$$ 3582245 987921 3810566 -886595 -2031927 1434273 2506273 811514 -741467 -603266
795f03266B145600n16434f88667C87620i29786j089417A768526J405556c884288
$$ -603266 2145600 1629166 -688667 387620 -929786 -2019203 1768526 3174082 -3884288
785C369816A149006a11238l95103k631061a051031D343581c268447J48370k643208
$$ 3369816 1149006 -111238 -506341 -3137402 -1051031 4343581 -3268447 -3120077 -5763285
776e763285A812148B83538J966356N53222q49401j34153i83517l657921C130612
$$ -5763285 1812148 283538 2249894 2803116 1953715 1819562 -983517 -4641438 3130612
766e309010A490220J366993c14482k987024B992375i54462D241639b117009J96719
$$ -5309010 1490220 2857213 -314482 -3301506 2992375 -954462 4241639 -2117009 -1920290
757a920290k17736k99144C958354A502351b733520a364169O27708B277332c78587
$$ -1920290 -2138026 -2437170 3958354 1502351 -2733520 -1364169 -736461 2277332 -378587
747E96176h15793j733099a1598D0712a183893C838261m28451A117808D66906K721659
$$ 596176 -815793 -2548892 -11598 40712 -1183893 3838261 3409810 1117808 466906 3188565
737C188565a020658D193544j735723a288780D265574a397139o829172b92315A547527
$$ 3188565 -1020658 4193544 2457821 -1288780 4265574 -1397139 -8226311 -292315 1547527
727A103200m21074A19165K384244c2306B547253E76415b324925B34740J233982
$$ 1103200 682126 119165 2503409 -32306 2547253 576415 -2324925 234740 1468722
718A468722a0821797B522623i19310B094491H17636J110982f475605a314555K18716
$$ 1468722 -10821797 2522623 -919310 2094491 817636 1928618 -6475605 -1314555 -1095839
709a095839L19856G37575b186387A22441c98175C689875D36693J457788d338111
$$ -1095839 -775983 737575 -2186387 122441 -398175 3689875 436693 1894481 -4338111
699C296061C82608a936850O14108j163181C810819g097319E380616b618357F21240
$$ 3296061 382608 -1936850 -1322742 -2485923 3810819 -7097319 5380616 -2618357 621240
689a058442A439175b849127J022060B584814d917843J686228A979093c352766
$$ -1058442 1439175 -2849127 -1827067 2584814 -4917843 -3231615 1979093 -3352766
680A961668J244743H52344n0072K20371b023404A624161c201449B129656j022753
$$ 1961668 3206411 852344 802272 1022643 -2023404 1624161 -3201449 2129656 1106903
671A106903D18919b356567A444733b711803i1829l55073B305776a645105A438038
$$ 1106903 418919 -2356567 1444733 -2711803 -91829 -446902 2305776 -1645105 1438038
661c34193B452200a010143C26692N427568c104894A408186f025114A30312K445525
$$ -334193 2452200 -1010143 326692 5754260 -3104894 1408186 -6025114 130312 2575837
652B575837B08014N9703L33888e94089D615092c960907A897517a271862E64126
$$ 2575837 208014 267717 601605 -594089 4615092 -3960907 1897517 -1271862 564126
642e383393a710275h09656l71393n33750B76670P39263L069349f683931C010060
$$ -5383393 -1710275 -809656 -1181049 -1714799 276670 1015933 4085282 -6683931 3010060
632c17728A49526d64004p78846C296967b452071H98484J903483A138332d175073
$$ -317728 149526 -464004 -1242850 3296967 -2452071 898484 2801967 1138332 -4175073
622c307254J453909C997391D11930a252558B856896d763392C821361a343677q1136
$$ -3307254 -1853345 3997391 411930 -1252558 2856896 -4763392 3821361 -1343677 -1424813
613a424813j873690c84352n79783A547723a50207D88933M52623b891341a185427
$$ -1424813 -3298503 -384352 -964135 1547723 -150207 488933 941556 -2891341 -1185427
603a08139A695089c238900b34059j998412M54495K24532A594674i63548j382682
$$ -108139 1695089 -3238900 -234059 -2232471 -1777976 -1553444 1594674 -963548 -2346230
594b346230B522296p58500R81299i3532k23876D038349b559578l289332E09741
$$ -2346230 2522296 1763796 2745095 -93532 -317408 4038349 -2559578 -5848910 509741
584b836744a214095p64131D56801M780416B133463g96657q24644j494198a535662
$$ -2836744 -1214095 -1978226 456801 5237217 2133463 -796657 -1621301 -3115499 -1535662
574b912210d73238A478490o33450a977888A261017K366286b913396J346790H32404
$$ -2912210 -473238 1478490 845040 -1977888 1261017 3627303 -2913396 -1566606 832404
564B852572c165204H05555c03498A983058a936794B51079L89724P77706a829170
$$ 2852572 -3165204 805555 -303498 1983058 -1936794 251079 640803 1418509 -1829170
554G518K241544G37586J809106e53682j751419F60775J793982I93645M91675B38540
$$ 7518 2249062 737586 2546692 -553682 -2305101 660775 2454757 993645 1485320 238540
543e50500D93829a842387k112633C633906a14959n746331B917355o90746b14604
$$ -550500 493829 -1842387 -3955020 3633906 -114959 -5861290 2917355 2226609 -214604
533e029064a650095K43548p55861B162744K331834E91849e917575d76289H13348
$$ -5029064 -1650095 -1406547 -2162408 2162744 4494578 591849 -5917575 -476289 813348
523D127001A255202B58046b562099H07226A83981J702781b294970d66325j167373
$$ 4127001 1255202 258046 -2562099 807226 183981 1886762 -2294970 -466325 -1633698
514a633698A700346J006423f850302B932496D75715b700540H90420K776626a037659
$$ -1633698 1700346 2706769 -6850302 2932496 475715 -2700540 890420 3667046 -1037659
504e68436l598727B9406J886137O16376h688942B426637f037062A211061J495020
$$ -568436 -4167163 29406 1915543 2531919 -8688942 2426637 -6037062 1211061 2706081
495B706081q30488q77587J13571L086747a466146C07040Q06537d151395A662537
$$ 2706081 1875593 998006 1111577 4198324 -1466146 307040 1113577 -4151395 1662537
485d384131E078708j582881b094484j300235C308965j326123a242908j850101
$$ -4384131 5078708 3495827 -2094484 -3394719 3308965 1982842 -1242908 -3093009
477c093009A195669a405137O34393r17251g36213A561500l59686F1425R91367
$$ -3093009 1195669 -1405137 -770744 -1687995 -736213 1561500 1201814 61425 1052792
468A052792P0145b551874B427196i0918B869390h65583E781212a060566k878469
$$ 1052792 1122937 -2551874 2427196 -90918 2869390 -865583 5781212 -1060566 -3939035
459c939035A801258o67877B6852J18149c727375E669860a029149B878376a873177
$$ -3939035 1801258 1133381 26852 145001 -3727375 5669860 -1029149 2878376 -1873177
449g067905A128997B184a146383H47352b512479B984734e180630b107612B250792
$$ -7067905 1128997 2184 -1146383 847352 -2512479 2984734 -5180630 -2107612 2250792
439B032290O50342K80052a561768B079305b067293k733078a755661D038073e076439
$$ 2032290 2682632 2962684 -1561768 2079305 -2067293 -4800371 -1755661 4038073 -5076439
429E492602o20080i05535l501122J919698C956415n42970d501388a520915A881477
$$ 5492602 4872522 -905535 -4406657 -2486959 3956415 3413445 -4501388 -1520915 1881477
419A741938d183533g80926a5997A257403b269046K72928D355606j410935A180568
$$ 1741938 -4183533 -780926 -15997 1257403 -2269046 -1996118 4355606 2944671 1180568
409b871509A559508a600414l170527a381697o2067D021293d740682J112845e36083
$$ -2871509 1559508 -1600414 -4770941 -1381697 -1443764 4021293 -4740682 -3627837 -536083
399c325581D270172C10289a320720K62047j884968e24295B121537d830160e77574
$$ -3325581 4270172 310289 -1320720 -1058673 -2943641 -524295 2121537 -4830160 -577574
389C902473c765163a441734J59485D294931D34335L70951K14774J565532i34167
$$ 3902473 -3765163 -1441734 -1282249 4294931 434335 805286 1020060 2585592 -934167
379b843023B830783a131749B859373g92024L61967o47187p19501g44514G41548
$$ -2843023 2830783 -1131749 2859373 -792024 -430057 -1077244 -1796745 -744514 741548
369c066517E219368B041829a132027B741990c602836A949535c603550a403532
$$ -3066517 5219368 2041829 -1132027 2741990 -3602836 1949535 -3603550 -1403532
360H115042A973289c356858A087511L14419K879084f353037A445741m83622M098548
$$ 8115042 1973289 -3356858 1087511 1401930 4281014 -6353037 1445741 962119 5060667
351E060667e401318a286612D098634b424847A691405b78787B24462a524459p90079
$$ 5060667 -5401318 -1286612 4098634 -2424847 1691405 -278787 224462 -1524459 -2314538
342b314538q17374a468151G15560N79039P16049c283840j060216C79626c214042
$$ -2314538 -3131912 -1468151 715560 1294599 2010648 -3283840 -4344056 379626 -3214042
332a674697j350612C046692G85977g01098A654229c091285i73339q65309j504731
$$ -1674697 -3025309 3046692 785977 -701098 1654229 -3091285 -973339 -1838648 -3343379
323c343379d09763a07733k22585r74242l115604C442974A397346J061259d25457
$$ -3343379 -409763 -107733 -330318 -1304560 -4420164 3442974 1397346 2458605 -425457
313b062586B241754j21939l53340a927421d45743B271998a585665P89766l009495
$$ -2062586 2241754 2119815 1766475 -1927421 -445743 2271998 -1585665 -795899 -3805394
304c805394b37193A209813j570c011345E06933R1570c540564A58544a642692k172966
$$ -3805394 -237193 1209813 1208243 -3011345 506933 598503 -3540564 158544 -1642692 -3815658
294c815658a327396m9533E31722J12438P482295i17323A200872D02883O56074
$$ -3815658 -1327396 -1376929 531722 644160 8126455 -917323 1200872 402883 1058957
285A058957a5012A104108C91437J002682G0189N1767e334558B602435b283951
$$ 1058957 -15012 1104108 391437 1394119 70189 121956 -5334558 2602435 -2283951
275c111940J519499D73726a928654C161783o55060J675825a869642A662733c597658
$$ -3111940 -1592441 473726 -1928654 3161783 2506723 4182548 -1869642 1662733 -3597658
265F078701a163186A564697q2239d54307j670990m487780B070483g777683C241832
$$ 6078701 -1163186 1564697 1482458 -454307 -2125297 -6613077 2070483 -7777683 3241832
255b837101g89577H19761J295545D8612c008187B548722K197130A309813c459508
$$ -2837101 -789577 819761 2115306 48612 -3008187 2548722 4745852 1309813 -3459508
245b170948A9449J699952g78752m27137b6331A53515e33952I54771J742682d034370
$$ -2170948 19449 1719401 -778752 -1205889 -26331 153515 -533952 954771 2697453 -4034370
234G17529K00644e276693b365018A702924a446573j561782J152113C794954j827675
$$ 717529 918173 -5276693 -2365018 1702924 -1446573 -3008355 -1856242 3794954 1967279
225A967279C21899g11823j816187j166114A739130j0250b12593A081911f717586
$$ 1967279 321899 -711823 -2528010 -3694124 1739130 1728880 -212593 1081911 -6717586
215c345162A794121m27566c584747C394475F91899a755597D6642L270210H07928
$$ -3345162 1794121 1366555 -3584747 3394475 691899 -1755597 46642 3316852 807928
205b742760A170886e547218b581598A484741J057447k53134f027002b37788C296499
$$ -2742760 1170886 -5547218 -2581598 1484741 2542188 2289054 -6027002 -237788 3296499
195B740642K89623r23369b540960g97951E587647a663512M75093B430324a174052
$$ 2740642 3030265 2106896 -2540960 -797951 5587647 -1663512 -1188419 2430324 -1174052
185C912846G70634B30646c241289C02664N71534i96766k20634m285161C89175
$$ 3912846 770634 230646 -3241289 302664 874198 -996766 -1217400 -5502561 389175
175A629759f024975a19256j943494C87867J570471A27977J143649b681975G14025
$$ 1629759 -6024975 -119256 -2062750 387867 1958338 127977 1271626 -2681975 714025
165A889712b069128h94480I60528h82996D273753A337079a347349o41783M18446
$$ 1889712 -2069128 -894480 960528 -882996 4273753 1337079 -1347349 -1989132 -1570686
156a570686B942017b541371i49345D329765B004089N86134r77166K239742b693823
$$ -1570686 2942017 -2541371 -949345 4329765 2004089 2590223 1613057 3852799 -2693823
146C369492R49209a37905E235372b863292P82785D868970c518714D46931a12563
$$ 3369492 4318701 -137905 5235372 -2863292 -2080507 4868970 -3518714 446931 -112563
136b310473k07734H17898j52610b532111B498121o48362a369266C5556a137663
$$ -2310473 -2518207 817898 665288 -2532111 2498121 1849759 -1369266 35556 -1137663
126b325209E051434i41282F56634N17963i93035C81377i08730j87394D10420a675756
$$ -2325209 5051434 -941282 656634 1174597 -993035 381377 -908730 -1096124 410420 -1675756
115g269671A718750f90979A443564J303105D34756b148228D787122B370102a225709
$$ -7269671 1718750 -690979 1443564 2746669 434756 -2148228 4787122 2370102 -1225709
105D49059b94204j95015D480908f22721G4451e01080G34158b472082J223685B320323
$$ 449059 -294204 -489219 4480908 -622721 74451 -501080 734158 -2472082 -1248397 2320323
94c852734A779761P9177d000737c60468F89625l05092J28828G2003d214670a692709
$$ -3852734 1779761 1858938 -4000737 -360468 689625 384533 513361 72003 -4214670 -1692709
83a589967a81367H70984f52915D484788c242449a467363l182198A957499a902079
$$ -1589967 -181367 870984 -652915 4484788 -3242449 -1467363 -4649561 1957499 -1902079
73B035190M227756b213742D295814d256861H03368R2452D42330a693328k42672
$$ 2035190 6262946 -2213742 4295814 -4256861 803368 895820 442330 -1693328 -1936000
64a936000i21064b22724j008078R6225j7325d09394D967788c103375J32199g87916
$$ -1936000 -921064 -222724 -1230802 -1134577 -1151902 -409394 4967788 -3103375 -2971176 -787916
53B728461k13885a397204A105599d181294A772299J55827B16902J29079J034144
$$ 2728461 2514576 -1397204 1105599 -4181294 1772299 1928126 216902 345981 1380125
44A380125P34158Q67470b34076A867677J991817A912567a242852D13056a154488
$$ 1380125 2114283 2981753 -234076 1867677 3859494 1912567 -1242852 413056 -1154488
34D59613L557525g402369A744945J134102I76242e587433b457627E205989a358599
$$ 459613 4017138 -7402369 1744945 2879047 976242 -5587433 -2457627 5205989 -1358599
24B755494e89558q53501j011391A169441b581279k280182F739816e13256b24255
$$ 2755494 -589558 -1443059 -2454450 1169441 -2581279 -4861461 6739816 -513256 -224255
14b403357a00200F393591b6307m224976A622882C62048c72260F70454L02663c671035
$$ -2403357 -100200 6393591 -26307 -4251283 1622882 362048 -372260 670454 973117 -3671035
3I91389K053851B18379J222696
$$ 991389 3045240 218379 1441075
0A441075
$$ 1441075
##PAGE= F1=14774.053681
##FIRST=     21204.543296753, 2672.49122660428, -178680
##DATA TABLE= (F2++(Y..Y)), PROFILE
2047a78680A428288J06995J03742a560358j253483J203006I54167J336064J758553
$$ -178680 1428288 1535283 1639025 -1560358 -2813841 -1610835 954167 2290231 4048784
2038D048784h24385A980801a066137E504577h2791F33247a693350C037904E2057
$$ 4048784 -824385 1980801 -1066137 5504577 -82791 633247 -1693350 3037904 52057
2028c446079C25293J781529a665183r3803B298136c674847C510458b212877r46974
$$ -3446079 325293 2106822 -1665183 -1758986 2298136 -3674847 3510458 -2212877 -3159851
2019c159851B395858b668216A966146a789135d72289A894069J690058a094286
$$ -3159851 2395858 -2668216 1966146 -1789135 -472289 1894069 3584127 -1094286
2010c478466E797922A211993P82329c469538A142654l94874L16161f0483m350744
$$ -3478466 5797922 1211993 1994322 -3469538 1142654 747780 1063941 -60483 -4411227
2001d411227b46219k292419B913024G26575P272344f249637A574202a667111A779024
$$ -4411227 -246219 -2538638 2913024 726575 7998919 -6249637 1574202 -1667111 1779024
1991H07250e319325a526561F867640A86569J767716g46412D095498i95737B463997
$$ 807250 -5319325 -1526561 6867640 186569 1954285 -746412 4095498 -995737 2463997
1981c333824i71509E481523b684603r49894J437610j023566C42640b769815B463302
$$ -3333824 -971509 5481523 -2684603 -3634497 -2196887 -3220453 342640 -2769815 2463302
1971e3059D770473F75405c5359m909886A27118c383001B28971c148682a532191
$$ -53059 4770473 675405 -35359 -4945245 127118 -3383001 228971 -3148682 -1532191
1961B697205A260126f61854A190484C79979L802506E0920f674338A550732d664172
$$ 2697205 1260126 -661854 1190484 379979 4182485 50920 -6674338 1550732 -4664172
1951c571650g97312A47802L167439A033337J795107a310235d95653k20687A789188
$$ -3571650 -797312 147802 3315241 1033337 2828444 -1310235 -495653 -716340 1789188
1941b738932B353661J611726a962930f78765B523788e78695A834976a9289C883050
$$ -2738932 2353661 3965387 -1962930 -678765 2523788 -578695 1834976 -19289 3883050
1931b970889a152239A576590d659196h21144A387719J498669r03779b202186g18080
$$ -2970889 -1152239 1576590 -4659196 -821144 1387719 2886388 1982609 -2202186 -718080
1921b776231A543486c557585D967800a278569D76789b116030k260161C428800
$$ -2776231 1543486 -3557585 4967800 -1278569 476789 -2116030 -4376191 3428800
1912F60193J4672129N084227b3860262J0746824l3862728J9901240i355938a927324
$$ 660193 15332322 20416549 -23860262 -13113438 -46976166 -27074926 -9355938 -1927324
1903B1691919j0348799Q156539K46660R452287o172446a3164134F20926J0176135
$$ 21691919 11343120 19499659 19746319 29198606 23026160 -13164134 620926 10797061
1895A0797061K0106546E562490J15894c6693320j8909531M649410b4645186C717875
$$ 10797061 30903607 5562490 5678384 -36693320 -55602851 -50953441 -24645186 3717875
1886B3166425j0619695C039422P515947D411900O438026N31377c308727D616026
$$ 23166425 12546730 3039422 10555369 4411900 10849926 11381303 -3308727 4616026
1877e331822b399844j397898k0984032a1983690k2130348c953638r640240A0633212
$$ -5331822 -2399844 -3797742 -24781774 -11983690 -34114038 -3953638 -13593878 10633212
1868G032936C119992J4892262G832425J5974255a136674F083517c27334A097201
$$ 7032936 3119992 18012254 7832425 23806680 -1136674 6083517 -327334 1097201
1859d79761A58292c930500A770792k47371M40675e87163a07116A02886J556226
$$ -479761 158292 -3930500 1770792 1523421 1964096 -587163 -107116 102886 1659112
1850A659112J897372C99565J69133M67565i58113F94803a557237B850045C94484
$$ 1659112 3556484 399565 568698 1036263 -958113 694803 -1557237 2850045 394484
1840a670600H91229K787439d963599A188515N4063d33692C989017c521241a379872
$$ -1670600 891229 3678668 -4963599 1188515 1242578 -433692 3989017 -3521241 -1379872
1830e30503m040960c47285q36172B074075n07897Q34173j089912b370240A176356
$$ -530503 -4571463 -347285 -1183457 2074075 1566178 2400351 1310439 -2370240 1176356
1820A476932a186709A403978L016716G21248d376102c53772I89858A00769c31422
$$ 1476932 -1186709 1403978 4420694 721248 -4376102 -353772 989858 100769 -331422
1810a345132A118365b510488a144286L11228k945791b11498k950095A838005G01905
$$ -1345132 1118365 -2510488 -1144286 -833058 -3778849 -211498 -3161593 1838005 701905
1800B289485a799281A346610M531868c79775r29826d69491J06999n879532B707888
$$ 2289485 -1799281 1346610 5878478 -379775 -1309601 -469491 -362492 -6242024 2707888
1790a946305D165423e779418A071289J635431L46498E98156K920085a72276d0391
$$ -1946305 4165423 -5779418 1071289 2706720 3053218 598156 3518241 -172276 -40391
1780E43958b699000C805030H58732J030522J22281g56371l284856D508515c303224
$$ 543958 -2699000 3805030 858732 1889254 2011535 -756371 -4041227 4508515 -3303224
1770c506471c98732m151498A796859b50251C907114c284036a424972A620857N71141
$$ -3506471 -398732 -4550230 1796859 -250251 3907114 -3284036 -1424972 1620857 2191998
1761B191998L126719b303672i47814k866808a888853m049673E522866f12405o912403
$$ 2191998 5318717 -2303672 -947814 -3814622 -1888853 -5938526 5522866 -612405 -7524808
1752g524808F862302b361637B949231g543199A0059277a979166I01146O37765
$$ -7524808 6862302 -2361637 2949231 -7543199 10059277 -1979166 901146 1538911
1744A538911a984552C363995e75141k08310j768604C648755j387092b668767E130216
$$ 1538911 -1984552 3363995 -575141 -783451 -2552055 3648755 2261663 -2668767 5130216
1734a931195d74874n94174C750990b229802L14197D48452J818069c200035J146369
$$ -1931195 -474874 -1069048 3750990 -2229802 -1915605 448452 2266521 -3200035 -2053666
1725b053666c0031D789358a306911A05490a16594C992474A953312o72500c945009
$$ -2053666 -30031 4789358 -1306911 105490 -116594 3992474 1953312 1280812 -3945009
1715A605683c581964d16903j226066j087191E166911D51376b520306D51503c871082
$$ 1605683 -3581964 -416903 -1642969 -2730160 5166911 451376 -2520306 451503 -3871082
1705a963594o72350A36066N08912c288309A604783a28806j90277B479516b478052
$$ -1963594 -2635944 136066 644978 -3288309 1604783 -128806 -319083 2479516 -2478052
1695G38993J671653i32405a40072B909497b099323C6287N18641b02030j830136
$$ 738993 2410646 -932405 -140072 2909497 -2099323 36287 554928 -202030 -2032166
1686b032166B981340a279282A669746E87229g077200F131054b886682I06101a592667
$$ -2032166 2981340 -1279282 1669746 587229 -7077200 6131054 -2886682 906101 -1592667
1676C371980I46257C91139c50715j474292A25517c07783r11505j570935C087220
$$ 3371980 946257 391139 -350715 -1825007 125517 -307783 -1219288 -2790223 3087220
1666a590760K3412j69009G90697b504853C174814A559055b541933I37373L88331
$$ -1590760 -1567348 -1736357 790697 -2504853 3174814 1559055 -2541933 937373 1325704
1657A325704N27917a913370d88281C108927c994403A906711L688275c168068C29983
$$ 1325704 1853621 -1913370 -488281 3108927 -3994403 1906711 5594986 -3168068 329983
1647b956394g20498C396126j606686c202525D058625d906127E795521j578783
$$ -2956394 -720498 3396126 1789440 -3202525 4058625 -4906127 5795521 4216738
1639D216738b621485g60284C315730F01076K669245b047157i23731j332566H272324
$$ 4216738 -2621485 -760284 3315730 601076 3270321 -2047157 -923731 -2256297 8272324
1629C97182Q95866a712193H060955Q291053K2598620L1522378a05986330j67141656
$$ 397182 1293048 -1712193 8060955 16352008 38950628 70473006 -105986330 -273127986
1621b73127986A63469650C5459427A2407460C489299J626667j626484P30995f12330
$$ -273127986 163469650 35459427 12407460 3489299 5115966 3489482 4220477 -612330
1612B194197N3093e86739I31075b467898B23181J202937M031067a752313G70922
$$ 2194197 2247290 -586739 931075 -2467898 223181 1426118 5457185 -1752313 770922
1602g68767B128006B81046Q36671a467771B706708l28840F3635M21375K385436
$$ -768767 2128006 281046 1117717 -1467771 2706708 2377868 63635 485010 2870446
1593B870446b547935B206623b470003C678392A031071L256112f944453K646679
$$ 2870446 -2547935 2206623 -2470003 3678392 1031071 4287183 -6944453 -4297774
1585d297774F094702a962251k251291E550346b502544I72271K47442D68888c807421
$$ -4297774 6094702 -1962251 -4213542 5550346 -2502544 972271 1219713 468888 -3807421
1575A010020L03281J771739A100751b681768R83313A45913N88823L56549a328961
$$ 1010020 1313301 3085040 1100751 -2681768 -1698455 145913 734736 1091285 -1328961
1565h32116c06264A032750C70311Q441965a229725c28104l040730A500374K162742
$$ -832116 -306264 1032750 370311 8812276 -1229725 -328104 -3368834 1500374 3663116
1556C663116F16338k59049b879879e84769A817963B70946L33208K861523A483092
$$ 3663116 616338 357289 -2879879 -584769 1817963 270946 604154 3465677 1483092
1546a651444C002350a371773B024586n54336d402329F992207i39033B080771b312691
$$ -1651444 3002350 -1371773 2024586 1470250 -4402329 6992207 -939033 2080771 -2312691
1536A575207D39912L621751a219377M65212b97945A277065d640163J594520h20258
$$ 1575207 439912 4061663 -1219377 -754165 -297945 1277065 -4640163 -3045643 -820258
1526f194040B864258E93636a679064l353135C48403b681827a03866B370575q08673
$$ -6194040 2864258 593636 -1679064 -5032199 348403 -2681827 -103866 2370575 1561902
1517A561902o14467D25791c071805E766129c304471C062540Q97925g55261k27133
$$ 1561902 947435 425791 -3071805 5766129 -3304471 3062540 3960465 -755261 -982394
1508i82394K94466A099499c01763F6556J396616d621543C710126b367076k695134
$$ -982394 -687928 1099499 -301763 66556 1463172 -4621543 3710126 -2367076 -5062210
1499e062210C388618c057208C977853A526303h035102b394591l267050C675097
$$ -5062210 3388618 -3057208 3977853 1526303 -8035102 -2394591 -5661641 3675097
1490d147950D645772h40243G62431J841384e011040A407089E7341K291886c22485
$$ -4147950 4645772 -840243 762431 2603815 -5011040 1407089 57341 2349227 -322485
1480b133209n22621b85654m22836B712816d13462m411607f6362L2090C92131f25936
$$ -2133209 -2655830 -285654 -708490 2712816 -413462 -4825069 -66362 -34272 392131 -625936
1469c913816A516731D65958c394122a170769l321537E131529b209856k744744
$$ -3913816 1516731 465958 -3394122 -1170769 -4492306 5131529 -2209856 -4954600
1461d954600C177412A095054J68045i12701A870a1093j95704B651258C20554a619254
$$ -4954600 3177412 1095054 1263099 -912701 1870 -11093 -206797 2651258 320554 -1619254
1450a0662l354526G930626g023730d19685n70982D744388d164375C417896i04538
$$ -10662 -3365188 7930626 -7023730 -419685 -990667 4744388 -4164375 3417896 -904538
1440H41232a096624j203381C125952a705536O88959m528261a017394C647246j612986
$$ 841232 -1096624 -2300005 3125952 -1705536 -1016577 -5544838 -1017394 3647246 2034260
1431B034260g3178B712426a784833Q18292A991299c042101h60567A883725j90899
$$ 2034260 -73178 2712426 -1784833 -966541 1991299 -3042101 -860567 1883725 1692826
1422A692826f802660C410147A75462M758980c032022C834616A815141Q03260a022767
$$ 1692826 -6802660 3410147 175462 4934442 -3032022 3834616 1815141 2618401 -1022767
1412d447410A28731O735583a700492c02375k459614G401987C68301a392814r87942
$$ -4447410 128731 6864314 -1700492 -302375 -2761989 7401987 368301 -1392814 -2380756
1403b380756C831114b505798C675425A518078e099944C517047c810188g7422j107333
$$ -2380756 3831114 -2505798 3675425 1518078 -5099944 3517047 -3810188 -77422 -1184755
1394a184755l792993E171905A408442a453230a33884j751893F722310a233053
$$ -1184755 -4977748 5171905 1408442 -1453230 -133884 -1885777 6722310 -1233053
1385B692138b02029H31647b582183B065631i84387C288825a069566j336864k059693
$$ 2692138 -202029 831647 -2582183 2065631 -984387 3288825 -1069566 -2406430 -4466123
1376d466123B603979b456794D56292M969092A907921a078598D82681J236073g31471
$$ -4466123 2603979 -2456794 456292 5425384 1907921 -1078598 482681 1718754 -731471
1366B58042M287466i06165o991057A468550j67237d700753C152093p73157o07464
$$ 258042 4545508 -906165 -7897222 1468550 1301313 -4700753 3152093 2378936 1771472
1357A771472E88930J184520J261988i018153B510695G05930d474768G82059n6584
$$ 1771472 588930 1773450 3035438 -9018153 2510695 705930 -4474768 782059 725475
1348G25475c249988J062457M4095D38306J173714e1232a7784l691304M09946E785213
$$ 725475 -3249988 -2187531 -2143436 438306 1612020 -51232 -17784 -3709088 -3299142 5785213
1337E98860a35464o60312G055851c335387H9222d867760A003464m33822b548662
$$ 598860 -135464 -795776 7055851 -3335387 89222 -4867760 1003464 569642 -2548662
1327b812470h84349B676095a476182m791210D428700b502065D815250d329657
$$ -2812470 -884349 2676095 -1476182 -6267392 4428700 -2502065 4815250 -4329657
1318B151357e330566a279605E20287d162080a674235G41862e47246r22698D70175
$$ 2151357 -5330566 -1279605 520287 -4162080 -1674235 741862 -547246 -1469944 470175
1308h52034J40681l228916B979471j440116b415917F316613A314404b94199F23931
$$ -852034 -711353 -3940269 2979471 1539355 -2415917 6316613 1314404 -294199 623931
1298f01241C2019J103362e358321H45438J459317I48671a971954m59263h9131
$$ -601241 32019 1135381 -5358321 845438 2304755 948671 -1971954 -2431217 -89131
1288g05432C364613c852002A679387H07212g44122m252609C477434b195770A896628
$$ -705432 3364613 -3852002 1679387 807212 -744122 -4996731 3477434 -2195770 1896628
1278E31450g20018A94253a320055D684835A571602a167919k262309d26522A265401
$$ 531450 -720018 194253 -1320055 4684835 1571602 -1167919 -3430228 -426522 1265401
1268D333425a789249F44764h19971D762595a953313B84660K244935f30019k177781
$$ 4333425 -1789249 644764 -819971 4762595 -1953313 284660 2529595 -630019 -2807800
1259b807800f16038B235581a500656j811732H402139e472728K128700a239190
$$ -2807800 -616038 2235581 -1500656 -3312388 8402139 -5472728 -3344028 -1239190
1250c73413A7477J387471d093222J304163C310248e470709b554937A005292b45291
$$ -373413 17477 1404948 -4093222 -2789059 3310248 -5470709 -2554937 1005292 -245291
1240i84768h4676B363250A094273P628g470826A454009K994067b445377A585143
$$ -984768 -84676 2363250 1094273 1101901 -7470826 1454009 4448076 -2445377 1585143
1230E06165c781614C207509a804101c20846J46232G264460c243135a74863A774516
$$ 506165 -3781614 3207509 -1804101 -320846 -174614 7264460 -3243135 -174863 1774516
1220A538368B968d285488A011554J369415A092696A66231L70184a664459D215782
$$ 1538368 2968 -4285488 1011554 2380969 1092696 166231 536415 -1664459 4215782
1210a345552r1246C464264P24567F12305a316989E450327i37830j641291C373117
$$ -1345552 -1436798 3464264 4188831 612305 -1316989 5450327 -937830 -2579121 3373117
1200h32808b16874A034395i04285l323909C08236J004838a469866j937926R75026
$$ -832808 -216874 1034395 -904285 -4228194 308236 1313074 -1469866 -3407792 -2432766
1191b432766E033931B006771c147621C271021j583229d65764H59889d298886A518017
$$ -2432766 5033931 2006771 -3147621 3271021 1687792 -465764 859889 -4298886 1518017
1181a932751H45123A64895L116945c554170H96717h529504A400344a363498I73303
$$ -1932751 845123 164895 3281840 -3554170 896717 -8529504 1400344 -1363498 973303
1171H11644c374376f88646j997261A3036a754416E53617L653058r12651e355161
$$ 811644 -3374376 -688646 -2685907 13036 -1754416 553617 4206675 3294024 -5355161
1161f46327D088136g435394B013540a270338j16249A457997e84879B545868l94575
$$ -646327 4088136 -7435394 2013540 -1270338 -1386587 1457997 -584879 2545868 2151293
1152B151293e65848C711804i83277L3922k502276a08030j61490C892252A437987
$$ 2151293 -565848 3711804 -983277 -949355 -3451631 -108030 -269520 3892252 1437987
1142E79040c634119D65327K363294b007874j704324F4908K95401a561116f25089
$$ 579040 -3634119 465327 2828621 -2007874 -3712198 64908 360309 -1561116 -625089
1132b584693A435123A5292g26547F61693q5455B78657g25416C80842c978688a215128
$$ -2584693 1435123 15292 -726547 661693 576238 278657 -725416 380842 -3978688 -1215128
1121I53890M52701a316460e29038k335209a365127B81340b053178A689189M39628
$$ 953890 1406591 -1316460 -529038 -2864247 -1365127 281340 -2053178 1689189 2128817
1112B128817e022117D6519J871728a92098j102864J55508C542635h07753A691488
$$ 2128817 -5022117 46519 1918247 -192098 -1294962 -1139454 3542635 -807753 1691488
1102C284484A263490o16637k60925a123390r22037C251341m66803A009415b485660
$$ 3284484 1263490 646853 385928 -1123390 -2045427 3251341 2784538 1009415 -2485660
1092A136867b759542m99778D17326a124237D617713E1479b01960l118433A39929
$$ 1136867 -2759542 -3259320 417326 -1124237 4617713 51479 -201960 -3320393 139929
1082b87161D020974h73641n695231A332057D76751i92092j003117D665405a273138
$$ -287161 4020974 -873641 -6568872 1332057 476751 -992092 -1995209 4665405 -1273138
1072G89587f753j460873j13442J08559B514936i5955j613692P85434K4910j344574
$$ 789587 -6753 -1467626 -1581068 -1472509 2514936 -95955 -1709647 -924213 -899303 -2243877
1062b243877A843849a519650m071369b103621F276086E32052J239617c38648D07743
$$ -2243877 1843849 -1519650 -5591019 -2103621 6276086 532052 1771669 -338648 407743
1052b690079H00542d60558J23823B060081N64199c809784B459767a261044j178875
$$ -2690079 800542 -460558 -336735 2060081 2624280 -3809784 2459767 -1261044 -2439919
1043b439919B695779h80200l0224c26425o50198A638610a667785G25581J217631
$$ -2439919 2695779 -880200 -910424 -326425 -976623 1638610 -1667785 725581 1943212
1034A943212d274602D171675b249313J114743A156968c112428a397518B859801
$$ 1943212 -4274602 4171675 -2249313 -1134570 1156968 -3112428 -1397518 2859801
1025G48820O73444a705527N84409A313056j80588J52637b558224B707741a112916
$$ 748820 1422264 -1705527 -1121118 1313056 1132468 1285105 -2558224 2707741 -1112916
1015I7286a746485g82889A052709b793915B807238e70782j150183A634651C19351
$$ 97286 -1746485 -782889 1052709 -2793915 2807238 -570782 -1720965 1634651 319351
1005I92114L152936e776066J380867C113515j220264K34889b204393B483933G94224
$$ 992114 4145050 -5776066 -4395199 3113515 1893251 2128140 -2204393 2483933 794224
995c550464C869256c106648A923178k59106i23556a26940A477092L744328b877630
$$ -3550464 3869256 -3106648 1923178 1664072 -923556 -126940 1477092 5221420 -2877630
985I265549b846293C851328b911208D526211b853361J266243M38808k104728O45137
$$ 9265549 -2846293 3851328 -2911208 4526211 -2853361 -1587118 -1148310 -3253038 -2607901
976b607901D413176b390546c87752C688929D06340L08497a237733L91298A439040
$$ -2607901 4413176 -2390546 -387752 3688929 406340 714837 -1237733 -846435 1439040
966C150695c289480a091754k3000G72103d013162a754747k97003Q69609j96174
$$ 3150695 -3289480 -1091754 -1114754 772103 -4013162 -1754747 -2051750 -1182141 -1378315
957a378315K17587D882242b495875B575416K698142a155562C320969j406423R26698
$$ -1378315 -1160728 4882242 -2495875 2575416 5273558 -1155562 3320969 1914546 2841244
948B841244D04025Q9013b547235G76127b385632H757948a830956A133360m03890
$$ 2841244 404025 493038 -2547235 776127 -2385632 8757948 -1830956 1133360 729470
939G29470J63476g05411o35889C740223e28001j786833j974565F904611a648953
$$ 729470 892946 -705411 -1341300 3740223 -528001 -2314834 -4289399 6904611 -1648953
929b852910A942203j57035L899844e590741E124956F54993J05089a491000m59426
$$ -2852910 1942203 1785168 5685012 -5590741 5124956 654993 760082 -1491000 -1950426
920a950426R43301M53750C332307h1425I6834K820814f75559p88104H17929d330842
$$ -1950426 -1007125 -553375 3332307 -81425 96834 2917648 -675559 -1463663 817929 -4330842
909D743745A077797a972080A004896b791700a035356D641080B190072f039872
$$ 4743745 1077797 -1972080 1004896 -2791700 -1035356 4641080 2190072 -6039872
900A796215c180473E264014b663724d92021B99891Q54567b356535B250295C09371
$$ 1796215 -3180473 5264014 -2663724 -492021 299891 1154458 -2356535 2250295 309371
890A066601J284802b098466c90293A611900d58592k862441c18904o83528C18836
$$ 1066601 2351403 -2098466 -390293 1611900 -458592 -3321033 -318904 -1002432 318836
880C435148E91137K75301N59273b113684B666295c119845A956829b590498D336602
$$ 3435148 591137 866438 1425711 -2113684 2666295 -3119845 1956829 -2590498 4336602
870D401074a433691B901931b154994m187994E718869a21779k316051D13065b083821
$$ 4401074 -1433691 2901931 -2154994 -6342988 5718869 -121779 -2437830 413065 -2083821
860B037468a518094d1584j003410C755343i90466C857443C70387L812133D51461
$$ 2037468 -1518094 -41584 -1044994 3755343 -990466 3857443 370387 4182520 451461
850C121936h19760k706730D047830i36264n248905d9009j985708B230130d28249
$$ 3121936 -819760 -3526490 4047830 -936264 -6185169 -49009 -2034717 2230130 -428249
840a457265A117821h97987e6248j626348C73993A7045f02921k470697E79360K467032
$$ -1457265 1117821 -897987 -56248 -1682596 373993 17045 -602921 -3073618 579360 3046392
830C046392E95498J043972i37143k244586B33814M883284A741056a391637E704503
$$ 3046392 595498 1639470 -937143 -3181729 233814 5117098 1741056 -1391637 5704503
820g58123C45694c32463B042340a668604C728356A004536C05660J010992f03536
$$ -758123 345694 -332463 2042340 -1668604 3728356 1004536 305660 1316652 -603536
810c724896I80469a950007i38178H77256a537478B939912j233701J916961a019568
$$ -3724896 980469 -1950007 -938178 877256 -1537478 2939912 1706211 3623172 -1019568
800b390296A079391J560093G80837a29574j258378B834384j016307a378443A282272
$$ -2390296 1079391 2639484 780837 -129574 -1387952 2834384 1818077 -1378443 1282272
790d05438k109185A603494J849338b972532B832143A319107a298758B91861c899314
$$ -405438 -2514623 1603494 3452832 -2972532 2832143 1319107 -1298758 291861 -3899314
780a241527D507192c703643Q35518l053547B050764C4743K626463l30872r762
$$ -1241527 4507192 -3703643 -2868125 -5921672 2050764 34743 2661206 2330334 2320572
771B320572p50772a163720l351195B695905d878794A823928J528406H9566c807448
$$ 2320572 1569800 -1163720 -4514915 2695905 -4878794 1823928 3352334 89566 -3807448
761C173116a40503C750945b067908J016494j532999L00610C970104A575549b755168
$$ 3173116 -140503 3750945 -2067908 -1051414 -2584413 -2283803 3970104 1575549 -2755168
751a579537K78871B670635C53403Q11285a779800j504797f0778b7940j90410C771132
$$ -1579537 -1300666 2670635 353403 1164688 -1779800 -3284597 -60778 -27940 -218350 3771132
740C922165A007381m49967K950348a87651D633327B214685a936281C532830b241687
$$ 3922165 1007381 557414 3507762 -187651 4633327 2214685 -1936281 3532830 -2241687
730h281281a35799G78054M63979E05103b80212B112495h98110A929930G16921
$$ -8281281 -135799 778054 1242033 505103 -280212 2112495 -898110 1929930 716921
720b025138B0883J429047a1158247B383576h1412B009898D56022R65975e572563
$$ -2025138 20883 1449930 -11158247 2383576 -81412 2009898 456022 1421997 -5572563
710e37628j58862k07959F63994e59603J71727a40269C220298A87656K042124d849531
$$ -537628 -696490 -904449 663994 -559603 -387876 -140269 3220298 187656 2229780 -4849531
699C256569D67713b460941J113450o77917B531295f536048E332243b680625A99996
$$ 3256569 467713 -2460941 -1347491 -2025408 2531295 -6536048 5332243 -2680625 199996
689b85297A245818b744321Q13341B781857c671878N10078H26751b955640A589194
$$ -285297 1245818 -2744321 -1930980 2781857 -3671878 -3161800 826751 -2955640 1589194
679B755743A345238C14944O80284a724704B018077c956322B301003j096080D82562
$$ 2755743 1345238 314944 995228 -1724704 2018077 -3956322 2301003 1204923 482562
669a667638A638385a872429H197b90824B882465a715600A282940e00359A580218
$$ -1667638 1638385 -1872429 8197 -290824 2882465 -1715600 1282940 -500359 1580218
659a031107A4336N168504c751242A805693f132568b46133B173175I56486G7848
$$ -1031107 14336 5182840 -3751242 1805693 -6132568 -246133 2173175 956486 77848
649B60867c06310D140676c060896A859240a617281A130968e002918g78600i6923
$$ 260867 -306310 4140676 -3060896 1859240 -1617281 1130968 -5002918 -778600 -96923
639b791592Q74763F31027P33901L232256f477641B454151a39970I55123d80872
$$ -2791592 -1916829 631027 1364928 4597184 -6477641 2454151 -139970 955123 -480872
629a990715C102774a850472C53478K566714A347741d029389O65237a441043D937630
$$ -1990715 3102774 -1850472 353478 2920192 1347741 -4029389 -3364152 -1441043 4937630
619H12647b291738C364598e869959C348219a556999L22312j546827a019567L58896
$$ 812647 -2291738 3364598 -5869959 3348219 -1556999 -1234687 -2781514 -1019567 -660671
610f60671A447078h39466G61251L85168c030803a321368F60958J499905c154667
$$ -660671 1447078 -839466 761251 1146419 -3030803 -1321368 660958 2160863 -3154667
600B46495b488833a188898m48005A747766g71993j454685A957239K84251j34C04233
$$ 246495 -2488833 -1188898 -1636903 1747766 -771993 -2226678 1957239 2241490 2241356 304233
589b99709D338018b792660l419563E9085b859133a167169j544262E83871M087679
$$ -299709 4338018 -2792660 -6212223 59085 -2859133 -1167169 -2711431 583871 4671550
580D671550A496302d20977j376302j602269a470347j466782d12388A566748F27661
$$ 4671550 1496302 -420977 -1797279 -3399548 -1470347 -2937129 -412388 1566748 627661
570b387146I01575J969036b739236a310183A017057R23612a783831B00406c35024
$$ -2387146 901575 2870611 -2739236 -1310183 1017057 1940669 -1783831 200406 -335024
560A496320b103733a21071E62974L57704a222169b15493B309833H89773J315226
$$ 1496320 -2103733 -121071 562974 920678 -1222169 -215493 2309833 889773 2204999
551B204999h09458k113732A089356J874512j325753n62817A62098e82002B48059
$$ 2204999 -809458 -2923190 1089356 2963868 1638115 1075298 162098 -582002 248059
541b232713j812997D406119B30212d979287B360402M60079C13255d499496K202546
$$ -2232713 -4045710 4406119 230212 -4979287 2360402 2820481 313255 -4499496 -2296950
532b296950h69974k017664B244764K523206G69472e378646c35098F55311L598072
$$ -2296950 -869974 -2887638 2244764 4767970 769472 -5378646 -335098 655311 4253383
523D253383A52395Q33266b648056A379436d48772B417604c041813e73373j852011
$$ 4253383 152395 985661 -2648056 1379436 -448772 2417604 -3041813 -573373 -2425384
514b425384B635491m39343f237474B800599c61914l000965A123453K855889h00843
$$ -2425384 2635491 2196148 -6237474 2800599 -361914 -3362879 1123453 3979342 -800843
504C6297e042624D3809J229286O17368h834330B217211f468267G29029K535368
$$ 36297 -5042624 43809 1273095 1890463 -8834330 2217211 -6468267 729029 3264397
495C264397j083344C11516J380711K333847a703047A26037O88347c088240A587249
$$ 3264397 2181053 311516 1692227 4026074 -1703047 126037 814384 -3088240 1587249
485c924037C769888r80732b027235o16675C504029A636810a814376l81533H71789
$$ -3924037 3769888 2789156 -2027235 -2643910 3504029 1636810 -1814376 -2195909 871789
475a515070L96537j6614l27992A750640F61802A72790J395581D23206b302239
$$ -1515070 -1118533 -1135147 -1463139 1750640 661802 172790 1568371 423206 -2302239
465B542037b33665B777177g13179E726177a176933k364053A359018n01748A71210
$$ 2542037 -233665 2777177 -713179 5726177 -1176933 -3540986 1359018 857270 171210
455a13049m912753E390012b424090C949707b156040l721700A103393I0880a196884
$$ -113049 -5025802 5390012 -2424090 3949707 -2156040 -5877740 1103393 90880 -1196884
445I31919c062367B067841e003555a983034B110402J97580Q16624m7497a503649
$$ 931919 -3062367 2067841 -5003555 -1983034 2110402 2307982 3124606 3077109 -1503649
435B062316b295005j636907a797232B678081d878099F666675k205264a56694m826627
$$ 2062316 -2295005 -3931912 -1797232 2678081 -4878099 6666675 4461411 -156694 -4983321
426d983321K488707B993759J51899d517621c69313A905042N12515d498689h69119
$$ -4983321 -2494614 2993759 3145658 -4517621 -369313 1905042 2417557 -4498689 -869119
416F57810L42031b015697K07160D192062o91698a41644k716364A545003c93700
$$ 657810 999841 -2015697 -1808537 4192062 3500364 -141644 -2858008 1545003 -393700
406e051885a694075p2937C883833e597752b717744c94169l148227D055617E75774
$$ -5051885 -1694075 -1767012 3883833 -5597752 -2717744 -394169 -3542396 4055617 575774
396a687469L55234r58043b43335A821380d826190a625325E761389c615607J805129
$$ -1687469 -1332235 -2290278 -243335 1821380 -4826190 -1625325 5761389 -3615607 -1810478
387a810478N43642C172663a7531A835675p94445J734755e48492l305027C058597
$$ -1810478 -1266836 3172663 -17531 1835675 1041230 2775985 -548492 -3853519 3058597
377a888794C431765a548037f40616j38903J86793K35115E54064b015259D402872
$$ -1888794 3431765 -1548037 -640616 -779519 -592726 -357611 554064 -2015259 4402872
367A932204a415148B838969c079487A771274c960760a342167H611439A829216
$$ 1932204 -1415148 2838969 -3079487 1771274 -3960760 -1342167 8611439 1829216
358a449675E94149J134955K098563e943504A021108p4580L605837e887343a195516
$$ -1449675 594149 1729104 3827667 -5943504 1021108 946528 4552365 -5887343 -1195516
348C477819b376403A497791c09235j00909j425784q45107k14994O63989I35182
$$ 3477819 -2376403 1497791 -309235 -410144 -1835928 -2681035 -2896029 -2232040 935182
338G30162J666406b133749k315162a49897k905674a509264j935008B044417o74039
$$ 730162 2396568 -2133749 -4448911 -149897 -3055571 -1509264 -3444272 2044417 1370378
329A370378a011649A634526c002527a205486l51591k375558b18277j53084r30816
$$ 1370378 -1011649 1634526 -3002527 -1205486 -1557077 -3932635 -218277 -371361 -1302177
320a302177k87067k962819C972722A194736J487063a41100k061006B918654r12095
$$ -1302177 -1589244 -4552063 3972722 1194736 2681799 -141100 -2202106 2918654 2006559
311B006559m27731a827479d53302B135574a400955O52399l010632g39384A080228
$$ 2006559 1578828 -1827479 -453302 2135574 -1400955 -748556 -3759188 -739384 1080228
301A801015a874904a6639k62752m518799B13745a650089k407729a758412P05314
$$ 1801015 -1874904 -16639 -279391 -4798190 213745 -1650089 -4057818 -1758412 -1053098
292a053098A381716E14328P620301a208843A077750l05343l38875h44948A527718
$$ -1053098 1381716 514328 8134629 -1208843 1077750 772407 433532 -844948 1527718
282D16265Q04173a47715B04461e423511A664211a741634j587008a362358H10817
$$ 416265 1220438 -147715 204461 -5423511 1664211 -1741634 -3328642 -1362358 810817
272b366291C549220n04350Q98530b219661A510168c426388E074404a374048A549535
$$ -2366291 3549220 3044870 3943400 -2219661 1510168 -3426388 5074404 -1374048 1549535
262A945479h87557j779437l422041A860472h647377C859695d424178f46652A410503
$$ 1945479 -887557 -2666994 -6089035 1860472 -8647377 3859695 -4424178 -646652 1410503
252A657117b05313k358352B948652J121128A554461c159450J282963B62337J262373
$$ 1657117 -205313 -2563665 2948652 4069780 1554461 -3159450 -1876487 262337 1524710
243A524710f56039n09596e69845f2844j214668H72146J653704d113712D09102
$$ 1524710 -656039 -1165635 -569845 -62844 -1277512 872146 2525850 -4113712 409102
233A267423f136953b043694A989112a844285o58485j89690D328461A645178b62546
$$ 1267423 -6136953 -2043694 1989112 -1844285 -2502770 -2692460 4328461 1645178 -262546
223a43847j600401j837122B031032I48202m32943K74102f687264c072078A644644
$$ -143847 -1744248 -3581370 2031032 948202 515259 789361 -6687264 -3072078 1644644
213A585100b709077C453929B29520b135465a27227C506727H23498b591881A350140
$$ 1585100 -2709077 3453929 229520 -2135465 -127227 3506727 823498 -2591881 1350140
203f227198L011454A451380P57634r0633f507436A13044K899534o47202n93263
$$ -6227198 -3215744 1451380 2209014 2118381 -6507436 113044 3012578 2365376 1772113
194A772113M57337b251994b07051E110915a336297L37008A912518a030468D201352
$$ 1772113 2229450 -2251994 -207051 5110915 -1336297 -999289 1912518 -1030468 4201352
184F24703a50303j287345M44686A020933e32702n67332m726843D52002J467449
$$ 624703 -150303 -1437648 -992962 1020933 -532702 -1100034 -5826877 452002 1919451
175A919451e749723h26605j310176A112378K02386N4960k38086b543726H00221
$$ 1919451 -5749723 -826605 -2136781 1112378 1314764 1369724 1131638 -2543726 800221
165A728207b080135R7356A105532f97449D283025A393092i30303K13460j326694
$$ 1728207 -2080135 -1982779 1105532 -697449 4283025 1393092 -930303 -716843 -2043537
156b043537C318333c655987b22118D338110B049642N24703D47017L162920b986214
$$ -2043537 3318333 -3655987 -222118 4338110 2049642 2574345 447017 3609937 -2986214
146B081635L677779b2690D600338b025826M4774D993119c479463c6493j70093
$$ 2081635 5759414 -22690 4600338 -2025826 -1981052 4993119 -3479463 -36493 -206586
137b06586k972093M87658H93801M2177b536973B050023p3329a377085d33541J01344
$$ -206586 -3178679 -2691021 893801 935978 -2536973 2050023 1976694 -1377085 -433541 -332197
127c32197k313051D764660a087262d24375A476478g17090m6121A64277a845277
$$ -332197 -2645248 4764660 -1087262 -424375 1476478 -717090 -763211 164277 -1845277
117a55293j660046n541110A421125g65168A647775K89387r45164b066355E500132
$$ -155293 -1815339 -7356449 1421125 -765168 1647775 1937162 991998 -2066355 5500132
107A714609a125104D82609e77689h5716C618420d76896a85052n61522D13578b270122
$$ 1714609 -1125104 482609 -577689 -85716 3618420 -476896 -185052 -746574 413578 -2270122
96a719655B199842c877873A310642R4077d089612a98311A115086H7201K70452
$$ -1719655 2199842 -3877873 1310642 1404719 -4089612 -198311 1115086 87201 357653
87C57653L83511c676176J640963O33123d99380A681614i86971C937392b633463
$$ 357653 741164 -3676176 -2035213 -1402090 -499380 1681614 -986971 3937392 -2633463
77b003624k649490A485769b384370B858074L233756a999402D204584c845953D00399
$$ -2003624 -4653114 1485769 -2384370 2858074 6091830 -1999402 4204584 -3845953 400399
67H33324m01581a615576k01100g82698c69437p84669k06061L0927b63715E002009
$$ 833324 431743 -1615576 -1816676 -782698 -369437 -1154106 -1360167 -1329240 -263715 5002009
56c451025O46206a79594B304201K04538a340875D93646c429925A343171Q16148
$$ -3451025 -2804819 -179594 2304201 2508739 -1340875 493646 -3429925 1343171 2159319
47B159319d19472B27657Q07325R95102P30433G35248k8574K815495j727467b050121
$$ 2159319 -419472 227657 1034982 2030084 2760517 735248 706674 3522169 1794702 -2050121
36C89386a482994F45603L841370g565973A499213M51015C64933e970969b210079
$$ 389386 -1482994 645603 4486973 -7565973 1499213 1950228 364933 -5970969 -2210079
26D127424f36540B724279h03228j205653J23718I09257b192522k976717F705400
$$ 4127424 -636540 2724279 -803228 -2008881 -1885163 909257 -2192522 -5169239 6705400
16g62218K03002j173280i1883F547213H5643e000223A882911C18187d18488g5009
$$ -762218 -559216 -1732496 -91883 6547213 85643 -5000223 1882911 318187 -418488 -75009
5H59803c879840E13340K708683j277972n46619
$$ 859803 -3879840 513340 3222023 1944051 1397432
0A397432
$$ 1397432
##PAGE= F1=14752.25541112
##FIRST=     21204.543296753, 2672.49122660428, -439148
##DATA TABLE= (F2++(Y..Y)), PROFILE
2047d39148A721851o11282L3003a103153j594805J78172G76760J852105J344424
$$ -439148 1721851 1110569 1143572 -1103153 -2697958 -2519786 776760 2628865 3973289
2038C973289f38636A698568a195708D493611D58605e81929n21072B877421D13603
$$ 3973289 -638636 1698568 -1195708 4493611 458605 -581929 -1103001 2877421 413603
2028b746685E56988J129737b295221M10603A803794c747995C959333b263425j123006
$$ -2746685 556988 1686725 -2295221 -1884618 1803794 -3747995 3959333 -2263425 -3386431
2019c386431B169482b539971B025773a744013c34139B250969O02886a456045k534752
$$ -3386431 2169482 -2539971 2025773 -1744013 -334139 2250969 2853855 -1456045 -3990797
2010c990797E349669A348818K60168b784290F11672B16542O7214E5161d064434
$$ -3990797 5349669 1348818 1608986 -2784290 611672 216542 283756 55161 -4064434
2000A47025c030326B931859c55495G261867f133680A814993a968424A830474q83365
$$ 147025 -3030326 2931859 -355495 7261867 -6133680 1814993 -1968424 1830474 947109
1991I47109f184903c66940F871859B71962J410523a68889D033055f78673B202695
$$ 947109 -6184903 -366940 6871859 271962 1682485 -168889 4033055 -678673 2202695
1981c483277h28495E907750b305699j420170J433723M21651c36114l049637B790309
$$ -3483277 -828495 5907750 -2305699 -3725869 -2292146 -1870495 -336114 -3385751 2790309
1971B59947N069187b94068E92307f842349H53876c471423I3987c392811a678536
$$ 259947 5329134 -294068 592307 -6842349 853876 -3471423 93987 -3392811 -1678536
1961A921242l44176d57570F18398B95112L882548d23044n583948I63663d433504
$$ 1921242 1577066 -457570 618398 295112 4177660 -423044 -6006992 963663 -4433504
1951c674042a633995A128868K035356A142880J396402b511982A34980a184190
$$ -3674042 -1633995 1128868 3164224 1142880 2539282 -2511982 134980 -1184190
1942B078620d120065B299760K069979a817979c25747B118375h41647B308023a48201
$$ 2078620 -4120065 2299760 4369739 -1817979 -325747 2118375 -841647 2308023 -148201
1932D717514c839918f82402F80312c591443g98519A488659Q99705o60591b562600
$$ 4717514 -3839918 -682402 680312 -3591443 -798519 1488659 2388364 1727773 -2562600
1922f92228r21565I49712b678760D817797a987033i0398k937800l00625B996522
$$ -692228 -1613793 949712 -2678760 4817797 -1987033 -90398 -3028198 -3328823 2996522
1912A17878J3450999L906525a6082373g528948m4804425K5042597h20905A313877
$$ 117878 13568877 17475402 -16082373 -7528948 -52333373 -27290776 -820905 1313877
1903A7263868E967378J1129637J208297Q445794A2691711a0712651E15010J0786771
$$ 17263868 5967378 17097015 18305312 26751106 12691711 -10712651 515010 11301781
1895A1301781K3116048D592688Q63957c8513546j1575869l620705b2730410c55272
$$ 11301781 34417829 4592688 5456645 -38513546 -50089415 -53710120 -22730410 -355272
1886B5148071A1602841C918139O830510m609871N847884J042764c633106D676020
$$ 25148071 11602841 3918139 10748649 6138778 11986662 13029426 -3633106 4676020
1877g265813a575228k591647k3980383J1213749k2370755b207597j2438540A2476748
$$ -7265813 -1575228 -4166875 -28147258 -16933509 -39304264 -2207597 -14646137 12476748
1868G508197B688104J7242587I789202J7865171h30743F197133b93949A797497
$$ 7508197 2688104 19930691 9789202 27654373 -830743 6197133 -293949 1797497
1859a244642A292274c786318B564705q53005K69994e67614a80719A03226K306516
$$ -1244642 1292274 -3786318 2564705 1711700 1981694 -567614 -180719 103226 2409742
1850B409742P10144g4252B91478G8238i94999A042584a797805C165019g92238
$$ 2409742 3119886 -74252 291478 78238 -994999 1042584 -1797805 3165019 -792238
1840a439400A179333K576345e158562A286541L12795f78227C942618c800856a210717
$$ -1439400 1179333 3755678 -5158562 1286541 1599336 -678227 3942618 -3800856 -1210717
1830b85618m383733i34190a21189A634699l21564N31965j59696c157351A993038
$$ -285618 -4669351 -934190 -121189 1634699 1313135 1845100 1685404 -3157351 1993038
1820E10804c79922A672201K307929A096811d355388D78292f1195p2498o16563
$$ 510804 -379922 1672201 3980130 1096811 -4355388 478292 -61195 -133693 -750256
1811g50256k80242A573835c380866a542923f03474l370615g03265k275349A949514
$$ -750256 -1030498 1573835 -3380866 -1542923 -603474 -3974089 -703265 -2978614 1949514
1801c05531B606544a240586A115011M251678g85567P9231E63057a559433m744824
$$ -305531 2606544 -1240586 1115011 5366689 -785567 -706336 563057 -1559433 -6304257
1792f304257B607038f26964C948703e740604A202901O89645J928181B74266M753457
$$ -6304257 2607038 -626964 3948703 -5740604 1202901 1892546 3820727 274266 5027723
1783E027723g49746B61776L49315c064921C791645E5398K462493r48464c51708
$$ 5027723 -749746 261776 611091 -3064921 3791645 55398 2517891 1569427 -351708
1773c846489D056859c011945l06015g81681l896039A077900A28692L508394c294413
$$ -3846489 4056859 -3011945 -3317960 -781681 -4677720 1077900 128692 3637086 -3294413
1763a165411A829915K07897K866557i59912k43914n55989k14067l818434E488927
$$ -1165411 1829915 2037812 4904369 -959912 -1203826 -1759815 -1973882 -5792316 5488927
1753a131584n707524G105155b466882B863491g174729A0172166b180204A491350
$$ -1131584 -6839108 7105155 -2466882 2863491 -7174729 10172166 -2180204 1491350
1744G03727a604649C286875a65815c5251k711051C935290j817244b006474E054275
$$ 703727 -1604649 3286875 -165815 -35251 -2746302 3935290 2118046 -2006474 5054275
1734a323756K31221L52575C548960a498179r14392A241771J080578b896577P28289
$$ -1323756 -1092535 -739960 3548960 -1498179 -2412571 1241771 2322349 -2896577 -2168288
1725b168288a55369D903784i67872c51011A82228L790951j279367j310617e987614
$$ -2168288 -155369 4903784 -967872 -351011 182228 3973179 2693812 1383195 -5987614
1715A622225c507036c04720n77847r24951E109747C96923b562190D24076c939377
$$ 1622225 -3507036 -304720 -882567 -1807518 5109747 396923 -2562190 424076 -3939377
1705h30410j145911f62358A024411c787915G55466h91A212995L26647b184287
$$ -830410 -1976321 -662358 1024411 -3787915 755466 -891 1212995 1539642 -2184287
1695A018542M48764i46761A97245L034951a840439c8588F67928f8680j850310
$$ 1018542 1467306 -946761 197245 3232196 -1840439 -38588 667928 -68680 -1918990
1686a918990C308921e20538J30845D52738g196829F044772b214624A930618b216353
$$ -1918990 3308921 -520538 -389693 452738 -7196829 6044772 -2214624 1930618 -2216353
1676B116566r19887B72664A25049b296816a86411l53169r65917j022449B884675
$$ 2116566 1196679 272664 125049 -2296816 -186411 -539580 -1505497 -2527946 2884675
1666a526819q17205Q22974B50873b379715D187656A152757c150572A348428m00915
$$ -1526819 -2344024 -1521050 250873 -2379715 4187656 1152757 -3150572 1348428 947513
1657I47513J602468a864764Q48646C789819d759677C219259K896590c744217F50253
$$ 947513 2549981 -1864764 -1016118 3789819 -4759677 3219259 6115849 -3744217 650253
1647c372884d63044C155258j454987c072190D901933d604053E368622j178940
$$ -3372884 -463044 3155258 1700271 -3072190 4901933 -4604053 5368622 4189682
1639D189682c386720C11113K410570E93191L698905a748653e72322k937287H805077
$$ 4189682 -3386720 311113 2721683 593191 4292096 -1748653 -572322 -3509609 8805077
1629A734317E89744b858890H257542O635863K2827502K9435219a02564332j59713831
$$ 1734317 589744 -2858890 8257542 14893405 37720907 67156126 -102564332 -262278163
1621b62278163A53828733C4003051A1949992B583983L359731k942754P14641h73113
$$ -262278163 153828733 34003051 11949992 2583983 5943714 3000960 3715601 -873113
1612B201994j99039a034157D84684a802013D01632J344954N064958a788560F43207
$$ 2201994 2002955 -1034157 484684 -1802013 401632 1746586 6811544 -1788560 643207
1602e52902B196479F34326M11347a824363B992789n09816c6717B05276K021111
$$ -552902 2196479 634326 1045673 -1824363 2992789 2482973 -36717 205276 2226387
1593B226387b296887A668154b705238C964954A505755K598223f973538K494623
$$ 2226387 -2296887 1668154 -2705238 3964954 1505755 4103978 -6973538 -4478915
1585d478915G565923b177875l216185F121500b275419A636495o87165J76824c298805
$$ -4478915 7565923 -2177875 -5394060 6121500 -2275419 1636495 949330 1126154 -3298805
1575H50026J10518K968248A04773b023650L49637E76320l9372P15267a414132
$$ 850026 960544 3928792 104773 -2023650 -1674013 576320 536948 1252215 -1414132
1565a419913A58959P50639l85452P300414a29752B17455c066914B376448R2092
$$ -1419913 158959 909598 524146 7824560 -129752 217455 -3066914 2376448 2468540
1556B468540F42222J26881c033474J328490B140820E4493Q72154K538578A598459
$$ 2468540 642222 769103 -3033474 -1704984 2140820 54493 926647 3465225 1598459
1546b055403C111256g47269B355591r03437c898105G320153a321955B441573a508680
$$ -2055403 3111256 -747269 2355591 1452154 -3898105 7320153 -1321955 2441573 -1508680
1536A195962C50112M095873e00143n409n1305A36642d486555J418569a007807
$$ 1195962 350112 4445985 -500143 -505552 -556857 136642 -4486555 -3067986 -1007807
1526d999248B310167H81653b155028k312926D15448b987629b13687B126405M23068
$$ -4999248 2310167 881653 -2155028 -4467954 415448 -2987629 -213687 2126405 2549473
1517B549473j064276o74948b511401D590814b106996B436586J381455a211474
$$ 2549473 1485197 810249 -2511401 4590814 -2106996 2436586 3818041 -1211474
1508d45145b5414A101327F1842a46519B492911e214689C833977c263091k436174
$$ -445145 -25414 1101327 61842 -146519 2492911 -5214689 3833977 -3263091 -5699265
1499e699265C821936c894917E610818A922944g781336b706325k676709C443777
$$ -5699265 3821936 -3894917 5610818 1922944 -7781336 -2706325 -5383034 3443777
1490d404394D608211g07952a28778C363919c467861B80847L54847J249342a41858
$$ -4404394 4608211 -707952 -128778 3363919 -3467861 280847 635694 1885036 -141858
1480b259880j22773d02011r84036B766774F42049e183923D44919d1337B48548
$$ -2259880 -2382653 -402011 -1386047 2766774 642049 -5183923 444919 -41337 248548
1470C16930c911818A866403G16007b915510g97451l975466E761125b761628j446031
$$ 316930 -3911818 1866403 716007 -2915510 -797451 -4772917 5761125 -2761628 -4207659
1461d207659B848604D62826P63532a534110C63985b63058F66326J312558F35621
$$ -4207659 2848604 462826 1226358 -1534110 363985 -263058 666326 1978884 635621
1451a208349b43865k534343G352377g007590a033091b54417D600001d360056C977371
$$ -1208349 -243865 -2778208 7352377 -7007590 -1033091 -254417 4600001 -4360056 3977371
1441a191202E87995b62497k660914B984505b205555e02059n075113i13576C673492
$$ -1191202 587995 -262497 -2923411 2984505 -2205555 -502059 -5577172 -913576 3673492
1431A947464I05812J216557b073724P63257A554033b334542g94389A709455k8265
$$ 1947464 905812 2122369 -2073724 -1310467 1554033 -2334542 -794389 1709455 1681190
1422A681190f448932C450942a55147E755619b787125C949330A679856J118859
$$ 1681190 -6448932 3450942 -155147 5755619 -2787125 3949330 1679856 2798715
1414B798715a648443k243551c98069F845999b073733N26389O2895G062060c22213
$$ 2798715 -1648443 -3891994 -398069 6845999 -2073733 -1547344 -1484449 7062060 -322213
1404a528314N0434C817887b384382C405378A386192d439150C165146c429768d55176
$$ -1528314 -1477880 3817887 -2384382 3405378 1386192 -4439150 3165146 -3429768 -455176
1394b78812m511341E201310A462282a756437b74322j333049F190870a195131B883862
$$ -278812 -4790153 5201310 1462282 -1756437 -274322 -1607371 6190870 -1195131 2883862
1384B14644J553440b738147B065692a384684B862105c72891k272744r87218B758070
$$ 214644 1768084 -2738147 2065692 -1384684 2862105 -372891 -2645635 -3632853 2758070
1374b263747b0165E416114B257367a689248E79032J347471d29976G5345M500276
$$ -2263747 -20165 5416114 2257367 -1689248 579032 1926503 -429976 75345 4575621
1365D575621h52137p026989A378141j29949c987705B705365p65165k10088F19095
$$ 4575621 -852137 -7879126 1378141 1248192 -3987705 2705365 1940200 1730112 619095
1355A848665P77997h580763A934114G44742d015206I90935B42693c675363a779058
$$ 1848665 2626662 -8580763 1934114 744742 -4015206 990935 242693 -3675363 -1779058
1345b034441F50535N27148A74544p7199c424955J86464E191242A350402E9698
$$ -2034441 650535 1177683 174544 97345 -3424955 -3238491 5191242 1350402 59698
1335a155171F526600c756662E43355d811676A115382J50209b682980n18437c68761
$$ -1155171 6526600 -3756662 543355 -4811676 1115382 1265591 -2682980 -3201417 -368761
1325B580225a792682m284971D388690a476442D595967c254154A492338e341997
$$ 2580225 -1792682 -6077653 4388690 -1476442 4595967 -3254154 1492338 -5341997
1316a196033B28850c978165a603038E90791c59739j497133E05093g28434j06967
$$ -1196033 228850 -3978165 -1603038 590791 -359739 -1856872 505093 -728434 -835401
1307h35401l147377B401646H93065b181488E885084A404044d05861E57674c73497
$$ -835401 -3982778 2401646 893065 -2181488 5885084 1404044 -405861 557674 -373497
1297h82608A949825f389742A318610J079068B00790b541298K46967g08272j38134
$$ -882608 1949825 -6389742 1318610 2397678 200790 -2541298 -2294331 -708272 -846406
1288h46406C258004c090422A249509H6377g65512m171786C129903b571651B931233
$$ -846406 3258004 -3090422 1249509 86377 -765512 -4937298 3129903 -2571651 2931233
1278D35619e99543b58697q07727D058666A553525f07876k614523a0021I83714
$$ 435619 -599543 -258697 -1066424 4058666 1553525 -607876 -3222399 -10021 983714
1268D047783a734012B17931e74562D537414a681315b22935B477933c44313k394937
$$ 4047783 -1734012 217931 -574562 4537414 -1681315 -222935 2477933 -344313 -2739250
1259b739250i24468A715341b109167j203154H765213e391812J488483a001735
$$ -2739250 -924468 1715341 -2109167 -3312321 8765213 -5391812 -3903329 -1001735
1250b05636o08178A264160d238212J148557B898436e444046a698792A039207c19672
$$ -205636 -813814 1264160 -4238212 -3089655 2898436 -5444046 -1698792 1039207 -319672
1240b007950A00254K343917I90770Q97249g455206A674605K777983b721113A353529
$$ -2007950 100254 2444171 990770 1888019 -7455206 1674605 4452588 -2721113 1353529
1230A383001d244255B902407a707597a42651n1325G069285c558368C75546K328044
$$ 1383001 -4244255 2902407 -1707597 -142651 -193976 7069285 -3558368 375546 2703590
1221B703590H55347b89019m144082H22312K043337E35631f17637D12747a997449
$$ 2703590 855347 -289019 -4433101 822312 2865649 535631 -617637 412747 -1997449
1211C598281a74268j946655C880795r43469F78335g81393D960966d10921j613776
$$ 3598281 -174268 -2120923 3880795 2937326 678335 -781393 4960966 -410921 -2024697
1202b024697C010648h92288a64497A459653i15477l211370a68319A179399b094479
$$ -2024697 3010648 -892288 -164497 1459653 -915477 -4126847 -168319 1179399 -2094479
1192c393765N90222C793869j204261b557858C210183j278765i59566A35824c777005
$$ -3393765 -2803543 3793869 2589608 -2557858 3210183 1931418 -959566 135824 -3777005
1182A403451b082375A413403e3714C390396b468423A064395h403035I66518a955156
$$ 1403451 -2082375 1413403 -53714 3390396 -2468423 1064395 -8403035 966518 -1955156
1172A153131l77848c419213a626330q89345A45047b213154B46290M197234j646779
$$ 1153131 775283 -3419213 -1626330 -2515675 145047 -2213154 246290 4443524 2796745
1163B796745e158728g48681D113640g351500A789423a035995b27025A519590a090441
$$ 2796745 -5158728 -748681 4113640 -7351500 1789423 -1035995 -227025 1519590 -1090441
1153C600798p65572a108563D197264a135386K12405k943314a005203C04997L129596
$$ 3600798 2835226 -1108563 4197264 -1135386 -922981 -3866295 -1005203 304997 3434593
1144C434593A349208A08449c638739F79543K230977b634230j095875B2379J160198
$$ 3434593 1349208 108449 -3638739 679543 2910520 -2634230 -3730105 22379 1182577
1135A182577b013377h62254r5686G60869a41431k74393I16217D55250a49809p31251
$$ 1182577 -2013377 -862254 -957940 760869 -141431 -415824 916217 455250 -149809 -881060
1125h81060A297048b791313a315527I43767K29858a804799O61370k553841a386603
$$ -881060 1297048 -2791313 -1315527 943767 1173625 -1804799 -1143429 -3697270 -1386603
1115G16358b474963A741726L28138d434756c51113A889321b64705j025352L54474
$$ 716358 -2474963 1741726 2069864 -4434756 -351113 1889321 -264705 -1290057 -935583
1106i35583B730014h70824A879878J404650A307148n01058A87255a379241o65917
$$ -935583 2730014 -870824 1879878 3284528 1307148 806090 187255 -1379241 -2045158
1097b045158C059421n1571D99703b584265A773904b735713m33101E95535a275483
$$ -2045158 3059421 3007850 499703 -2584265 1773904 -2735713 -3168814 595535 -1275483
1087D649959E02391A34952c535800H217K05182L547014a533560m725612A137765
$$ 4649959 502391 134952 -3535800 8217 213399 3760413 -1533560 -6259172 1137765
1077B61174a114734j148560D955017a472748D04958c25652j826352R56881j17770
$$ 261174 -1114734 -2263294 4955017 -1472748 404958 -325652 -2152004 -1195123 -1312893
1068a312893B066042a112654j98824j4697L75100n29569A137854a967780k881406
$$ -1312893 2066042 -1112654 -1311478 -1326175 -951075 -1480644 1137854 -1967780 -4849186
1059d849186b137371E813974H65378R06612h08902B61274b431719H42456d79510
$$ -4849186 -2137371 5813974 865378 1771990 -808902 261274 -2431719 842456 -479510
1049A02007J787472N62515c654158A995019g32363j680911C277091h27448K62003
$$ 102007 1889479 2451994 -3654158 1995019 -732363 -2413274 3277091 -827448 -565445
1040e65445A45630a98480A823029a627320D41369J713734d772371E170079b787989
$$ -565445 145630 -198480 1823029 -1627320 441369 2155103 -4772371 5170079 -2787989
1030a086782A581866b330620a157959A932422C89895p4238a126453l66530A707460
$$ -1086782 1581866 -2330620 -1157959 1932422 389895 315657 -1126453 -1492983 1707460
1020A641181m70124b576642C008069i64680L87404j503114f50828A120091b470639
$$ 1641181 1171057 -2576642 3008069 -964680 -577276 -2080390 -650828 1120091 -2470639
1010C414085a209490o73503A926313A62284Q12025L861838e901081J988329B959165
$$ 3414085 -1209490 -1882993 1926313 162284 974309 4836147 -5901081 -3912752 2959165
1000A698958O94846a812388C112487H66444d116095D926184c437678B092571F38728
$$ 1698958 2393804 -1812388 3112487 866444 -4116095 4926184 -3437678 2092571 638728
990h13581B24451N99276L458373b617954I083983b780720C811044c295298E278570
$$ -813581 224451 823727 4282100 -2617954 9083983 -2780720 3811044 -3295298 5278570
980b883960a380705J69727j987671N54247D770078a928009a08569C392716B59556
$$ -2883960 -1380705 -1210978 -3198649 -2644402 4770078 -1928009 -108569 3392716 259556
970A461267a672205b50991A497583Q28761c539977h87375p93003A138369d947064
$$ 1461267 -1672205 -250991 1497583 2326344 -3539977 -887375 -1680378 1138369 -4947064
960a089077j008901R02522K37556p38384E066909b129207C092065K460019a323371
$$ -1089077 -2097978 -1195456 -957900 -1696284 5066909 -2129207 3092065 5552084 -1323371
950B823125K02013o20521A105097h2522k332006F87855b065384G691614a826501
$$ 2823125 3025138 2404617 1105097 -82522 -2414528 687855 -2065384 7691614 -1826501
940A293127D79205R7069A17887e15061B890132a99493k422573j376443F723408
$$ 1293127 479205 576274 117887 -515061 2890132 -199493 -2622066 -3998509 6723408
930b001842p84770A664503J62694L450955d513055D826914A331914E15159g76223
$$ -2001842 -2786612 1664503 1827197 5278152 -4513055 4826914 1331914 515159 -776223
920a921551o00684d46274D119514d74136H56983K230392e22333r55024A671900
$$ -1921551 -2522235 -446274 4119514 -474136 856983 3087375 -522333 -1477357 1671900
910d005782E320611A390680b073698A244096b866800e64265E600207B078564f222083
$$ -4005782 5320611 1390680 -2073698 1244096 -2866800 -564265 5600207 2078564 -6222083
900A757756b295985D233068b347140e78577E38771q3141b535434B391648F69326
$$ 1757756 -2295985 4233068 -2347140 -578577 538771 455630 -2535434 2391648 669326
890A176020J417938b079166g36064B057132E1681d038315b61601r88079D36346
$$ 1176020 2593958 -2079166 -736064 2057132 51681 -4038315 -261601 -1249680 436346
880C461581G45228C68224N50036b260114B217873c667781B436226b024737D372276
$$ 3461581 745228 368224 918260 -2260114 2217873 -3667781 2436226 -2024737 4372276
870C182885a608654B491276i69711n952773E815965A15916b385211b94008j307018
$$ 3182885 -1608654 2491276 -969711 -6922484 5815965 115916 -2385211 -294008 -1601026
861a601026A235064a022586f0572o47989B502349f28252C674794G05106K942398
$$ -1601026 1235064 -1022586 -60572 -708561 2502349 -628252 3674794 705106 3647504
852C647504G68336K779002h45467k415416C559699i08595n537147C19321b220334
$$ 3647504 768336 3547338 -845467 -3260883 3559699 -908595 -6445742 319321 -2220334
842B561299a15713j949291A826354f85653J03227j477130a72858j49685R1280
$$ 2561299 -115713 -2065004 1826354 -685653 -582426 -2059556 -172858 -322543 -231263
833b31263l425393e2065B801619H81260J269919h08543k661107A80252M489039
$$ -231263 -3656656 -52065 2801619 881260 2151179 -808543 -3469650 180252 4669291
824D669291B094358a036003E450773a363074c09710j246064B792298i03954C130954
$$ 4669291 2094358 -1036003 5450773 -1363074 -309710 -1555774 2792298 -903954 3130954
814A119194C2891J165243h28047k866833A004554b093300h97870I73875a067272
$$ 1119194 32891 1198134 -828047 -3694880 1004554 -2093300 -897870 973875 -1067272
804B216296K40594P85592a247822j455987G76074J876328E94188j40119b146858
$$ 2216296 2456890 3242482 -1247822 -2703809 776074 2652402 594188 454069 -2146858
794C391810j279678a924108B234823A28350b980641A561492J945525b042340B288946
$$ 3391810 2112132 -1924108 2234823 128350 -2980641 1561492 3507017 -2042340 2288946
784A591391b296912A159500d389948a278845D476023c970764J392448l305183
$$ 1591391 -2296912 1159500 -4389948 -1278845 4476023 -3970764 -2578316 -5883499
776e883499B297041b98646B986660j095632P43522A191429a272541k905580B194757
$$ -5883499 2297041 -298646 2986660 1891028 2634550 1191429 -1272541 -4178121 2194757
766d108131B053671J508521D63182d031859C374720G36493K547122b059217h9891
$$ -4108131 2053671 3562192 463182 -4031859 3374720 736493 3283615 -2059217 -89891
756c129816J078455C957553A624056b693057J064108m25101B924592A093019O31951
$$ -3129816 -2051361 3957553 1624056 -2693057 -1628949 -2054050 2924592 1093019 1724970
747A724970b916047j089994a46419f4662F56088L045369N79334G63944q6357L089179
$$ 1724970 -2916047 -4006041 -146419 -64662 656088 3701457 4280791 763944 677587 3766766
737C766766F78484M183048A770197b376234B743322c055237m483588a24390B5716
$$ 3766766 678484 4861532 1770197 -2376234 2743322 -3055237 -7538825 -124390 25716
727A321739C64767f06765A848426a641821A145782l03780a716857a75535A376501
$$ 1321739 364767 -606765 1848426 -1641821 1145782 842002 -1716857 -175535 1376501
717a0766278B243668G46983R60682B30127M81012d507662B15564b45076p95185
$$ -10766278 2243668 746983 1707665 230127 711139 -4507662 215564 -245076 -1040261
708a040261E26797P20956h44282A24891K574201h5911B258704e111937C124577
$$ -1040261 526797 1247753 -844282 124891 2699092 -85911 2258704 -5111937 3124577
698E28783b928722a313906k17346A229057e725278E104725b650670a27994C95999
$$ 528783 -2928722 -1313906 -1531252 1229057 -5725278 5104725 -2650670 -127994 395999
688A050494b519798L93619B971116b414749o41088b11618k164082A181912J123447
$$ 1050494 -2519798 -2126179 2971116 -2414749 -3055837 -211618 -2375700 1181912 2305359
679B305359m72114a49092G65168a298762B184643d453265B294264q56890E63011
$$ 2305359 1833245 -149092 765168 -1298762 2184643 -4453265 2294264 1437374 563011
669g87271A846833a012431I2464a9023C449813a723076A132848g41598F56226
$$ -787271 1846833 -1012431 92464 -19023 3449813 -1723076 1132848 -741598 656226
659a125838b92265D315325d210941B282698f140024e95945A724884r3288e4963
$$ -1125838 -292265 4315325 -4210941 2282698 -6140024 -595945 1724884 1631596 -54963
649f2182A0329L589404b151344A636494a759526A674352d360540C97738K34726
$$ -62182 10329 3599733 -2151344 1636494 -1759526 1674352 -4360540 397738 632464
640F32464c894087J807979G80435J022994L118670e728850A780411H809J877286
$$ 632464 -3894087 -2086108 780435 1803429 4922099 -5728850 1780411 8809 1886095
631A886095e34314k130192B786907i84061b49750B786525j288484c770611N64624
$$ 1886095 -534314 -2664506 2786907 -984061 -249750 2786525 1498041 -3770611 -3205987
622c205987i33059E574335A124339c233524C867870f819783B936942a744245O62061
$$ -3205987 -933059 5574335 1124339 -3233524 3867870 -6819783 2936942 -1744245 -1082184
613a082184r29312J66930a09074A312328a411482A023763J99062b969937a481519
$$ -1082184 -2011496 -1844566 -109074 1312328 -1411482 1023763 1222825 -2969937 -1481519
603A362324J322430b935321G88125b689653f60892j003500B065696e77184j537649
$$ 1362324 2684754 -2935321 788125 -2689653 -660892 -1664392 2065696 -577184 -2114833
594b114833A304898J399517r53835E85371b74770D669035b919194l479029a80805
$$ -2114833 1304898 2704415 1750580 585371 -274770 4669035 -2919194 -6398223 -180805
584b764323i55039k395873F88758L381235I03571A2032a913727j751991a338084
$$ -2764323 -955039 -3350912 688758 4069993 903571 12032 -1913727 -3665718 -1338084
574b574208e44057A717366E82115b874461E32897J561375b368541i73673A144779
$$ -2574208 -544057 1717366 582115 -2874461 532897 2094272 -2368541 -973673 1144779
564I69676b55388k29053J44169H49885b235157d11915D09347O6425g43327K74836
$$ 969676 -255388 -484441 -340272 849885 -2235157 -411915 409347 475772 -743327 -468491
554d68491B387239I48399Q92598a058285k047167A436182K016135j276362F24674
$$ -468491 2387239 948399 1840997 -1058285 -3105452 1436182 3452317 2175955 624674
544A03515f08307I298b524759j641624E214318F72421d009553A711777J530568
$$ 103515 -608307 9298 -2524759 -4166383 5214318 672421 -4009553 1711777 3242345
535C242345G78741c674965R64620c27584k980439B125853K855854A020015d656350
$$ 3242345 778741 -3674965 -2710345 -327584 -3308023 2125853 4981707 1020015 -4656350
525a11434D29291L768611g70537A740623b713998B006182i69642B805372c744314
$$ -111434 429291 4197902 -770537 1740623 -2713998 2006182 -969642 2805372 -3744314
515f11571k358632C534057A610441e388012B444445a078286k764439A386459L003836
$$ -611571 -2970203 3534057 1610441 -5388012 2444445 -1078286 -3842725 1386459 4390295
506D390295f32702D85940e857855B56362J77715Q92022h733283A942708f476522
$$ 4390295 -632702 485940 -5857855 256362 434077 1326099 -8733283 1942708 -6476522
496C01884L505532j451802c53929B304056J486957a935250a3778E29424a879790
$$ 301884 3807416 2355614 -353929 2304056 3791013 -1935250 -13778 529424 -1879790
486A668643c463814B514239n14810a960298K68996C689549A292453b122246P87694
$$ 1668643 -3463814 2514239 1999429 -1960298 -1691302 3689549 1292453 -2122246 -1334552
477a334552F30760a537367K09227d88412j535431A904326A41299K1427J962377
$$ -1334552 630760 -1537367 -1328140 -488412 -2023843 1904326 141299 162726 2125103
468B125103b47584j765311B525717d02306B738673f34612E721547a311046j656162
$$ 2125103 -247584 -2012895 2525717 -402306 2738673 -634612 5721547 -1311046 -2967208
459b967208I96794l59547C02565b93382n737731E167076c629491D906937b262827
$$ -2967208 996794 637247 302565 -293382 -6031113 5167076 -3629491 4906937 -2262827
449d600630I85049A58477a106585A104181c619636A258083d699127a800270A808193
$$ -4600630 985049 158477 -1106585 1104181 -3619636 1258083 -4699127 -1800270 1808193
439B575185P88121o1589a346503A944140b380339l79587J109477A370799d401599
$$ 2575185 3363306 3301717 -1346503 1944140 -2380339 -2759926 -1650449 1370799 -4401599
429G723154l784554F60306e326974b389311A845044R93892d392711G64722J216903
$$ 7723154 3938600 660306 -5326974 -2389311 1845044 2838936 -4392711 764722 1981625
420A981625J003052d584076h66763A401519F23189a572294M9241C979151j03551
$$ 1981625 2984677 -4584076 -866763 1401519 623189 -1572294 -1523053 3979151 3875600
411C875600a481004j198352A482400o74654e192973a851141o9196C670506f027170
$$ 3875600 -1481004 -2679356 1482400 807746 -5192973 -1851141 -1920337 3670506 -6027170
401a686587b07324l424611C771916H31187a930003L11636q523A69202J338483
$$ -1686587 -207324 -3631935 3771916 831187 -1930003 -1618367 -1626890 169202 1507685
392A507685d713403J997528G540950c272887J165549R57080B033017e33676B940802
$$ 1507685 -4713403 -2715875 7540950 -3272887 -2107338 -1150258 2033017 -533676 2940802
382A026243J929391c93915m187326C119828b346855D043091b338467h22959L11799
$$ 1026243 2955634 -393915 -4581241 3119828 -2346855 4043091 -2338467 -822959 -511160
373e11160G16071A36426K99435g32998C660739A769575a608857B832289b319969
$$ -511160 716071 136426 435861 -732998 3660739 1769575 -1608857 2832289 -2319969
363A552088d045549a127896H691435A637995A67224A7746K048600J123833e287281
$$ 1552088 -4045549 -1127896 8691435 1637995 167224 17746 2066346 3190179 -5287281
353E90814K91686K971097e931549a149721B761698b225601A162354b72849o81776
$$ 590814 882500 3853597 -5931549 -1149721 2761698 -2225601 1162354 -272849 -954625
344i54625j036001q69663M96575m34893A054804B64123K503065g27421l832419
$$ -954625 -1990626 -2860289 -2363714 -2798607 1054804 264123 2767188 -727421 -4559840
335d559840f73756k046766a169290k580529A209014P36630a134354A523175b817146
$$ -4559840 -673756 -2720522 -1169290 -3749819 1209014 1945644 -1134354 1523175 -2817146
325a245890k7706k999308e4108n76795j745490O11478k532421D284321A161142
$$ -1245890 -1273596 -4272904 -54108 -630903 -2376393 -1764915 -4297336 4284321 1161142
315B812800B22151b354505C487149j666114l42699a472304c56566B016339a293463
$$ 2812800 222151 -2354505 3487149 1821035 1478336 -1472304 -356566 2016339 -1293463
305g70928k942720a121137A020451J374525d19842o8555n65059m620269E04646
$$ -770928 -3713648 -1121137 1020451 2394976 -419842 -488397 -1053456 -5673725 504646
295a479143k774021a919403g23423B112387C66823P691160a465770H98015L69261
$$ -1479143 -4253164 -1919403 -723423 2112387 366823 8057983 -1465770 898015 1267276
286A267276a73855j265469A949151D65790Q13643c66308B45172e151913D13546
$$ 1267276 -173855 -1439324 1949151 465790 1279433 -366308 245172 -5151913 413546
276i51758k336062a013102A228237b767219C949669l74533j75672b419281A328788
$$ -951758 -3287820 -1013102 1228237 -2767219 3949669 3575136 3399464 -2419281 1328788
266c090596C826944a334175A462043R56959a269816j907991k228221A761644i297807
$$ -3090596 3826944 -1334175 1462043 2419002 -1269816 -3177807 -5406028 1761644 -9297807
256D482937e749019d42920A947975o68923c81603j696531C266993k6327j424311
$$ 4482937 -5749019 -442920 1947975 1279052 -381603 -2078134 3266993 3240666 1816355
247A816355b691713a317512D80828Q84258e06176o16263L93084b59555j482954
$$ 1816355 -2691713 -1317512 480828 1365086 -506176 -1122439 -729355 -259555 -1742509
238a742509H62150J512564d184961I4613J458054f818265a596029B302903b055639
$$ -1742509 862150 2374714 -4184961 94613 1552667 -6818265 -1596029 2302903 -2055639
228a685363j898707D710296A460178f97938C93671h16969k613239B402668H5637
$$ -1685363 -3584070 4710296 1460178 -697938 393671 -816969 -3430208 2402668 85637
218A441062D92857f277046b628297A507298K81020a789642C820814c33798k041183
$$ 1441062 492857 -6277046 -2628297 1507298 1788318 -1789642 3820814 -333798 -2374981
209b374981A6726L646445G88474b285668A702393f843637L099614A545723J55594
$$ -2374981 16726 3663171 788474 -2285668 1702393 -6843637 -3744023 1545723 1701317
200A701317K53549f680123D77951K099456o36154F07886J705095a790203D00708
$$ 1701317 1954866 -6680123 477951 2577407 1941253 607886 2312981 -1790203 400708
190D647888i21088K59160A399763h04771D417410F51463f37093E54887a842171
$$ 4647888 -921088 -661928 1399763 -804771 4417410 651463 -637093 554887 -1842171
180A151055a26837o56845n116829C92167J864280e165989a333915p72701A894708
$$ 1151055 -126837 -783682 -5900511 392167 2256447 -5165989 -1333915 -2106616 1894708
170G29263J913230A036345b411379H52692Q31462b052124q87328A306868b33388
$$ 729263 2642493 1036345 -2411379 852692 1684154 -2052124 -2939452 1306868 -233388
160D257058A595970d29699G51270b628990C684915d516868F06227L528663k012591
$$ 4257058 1595970 -429699 751270 -2628990 3684915 -4516868 606227 4134890 2122299
151B122299N06748f39498C249354c223441I34607N723156A47929L777386a052747
$$ 2122299 2629047 -639498 3249354 -3223441 934607 6657763 147929 3925315 -1052747
141a916283E064382c090406d61509a70029l808403J241799A059841K59548b541452
$$ -1916283 5064382 -3090406 -461509 -170029 -3978432 -2736633 1059841 1319389 -2541452
131A580729M96044a226297L57052G11259b875734D311567a085778k42741A725109
$$ 1580729 2076773 -1226297 -869245 711259 -2875734 4311567 -1085778 -1328519 1725109
121d11824j525542A259159b315334f77818j171344n447858I47878f78591A858933
$$ -411824 -1937366 1259159 -2315334 -677818 -1849162 -7297020 947878 -678591 1858933
111A266003K94951a862253E975927A143322i06640F55279g54909C73818K480019
$$ 1266003 1560954 -1862253 5975927 1143322 -906640 655279 -754909 373818 2853837
102B853837c22553k174m46934A2830b014540q9048B120340c782718G72510J01059
$$ 2853837 -322553 -324727 -771661 12830 -2014540 -2103588 2120340 -3782718 772510 873569
92H73569c927783B1270J505722a35167B73829R57319c049033P89512J039396M83978
$$ 873569 -3927783 21270 1526992 -135167 273829 1231148 -3049033 -2259521 -1220125 -736147
82g36147B448508a410365C386436a640589o39328k460683A162417b685590C460571
$$ -736147 2448508 -1410365 3386436 -1640589 -2279917 -4740600 1162417 -2685590 3460571
72E758857a720165C907636c240875H4359R03126D50657a366678j51742f19309
$$ 5758857 -1720165 3907636 -3240875 84359 987485 450657 -1366678 -1518420 -619309
62c97294n12624o33742R7287c5675D947487c564828J063888C43574J316326R69539
$$ -397294 -909918 -1543660 -1446373 -35675 4947487 -3564828 -2500940 343574 1659900 2629439
52B629439a206370a34786k230539H42000J522292a039233I1323O35595J122761
$$ 2629439 -1206370 -134786 -2365325 842000 2364292 -1039233 91323 726918 1849679
43A849679O81872p65229d81669C106250j404555b489305E03361a762034H68347
$$ 1849679 2531551 1766322 -481669 3106250 1701695 -2489305 503361 -1762034 868347
33E045981g215398A135201k45396a01752n895402a806737C126726B96627K375873
$$ 5045981 -7215398 1135201 889805 -101752 -5997154 -1806737 3126726 296627 2672500
24B672500i92346j496304i80549G12437a717047l537275F455787h75141j7131
$$ 2672500 -992346 -2488650 -980549 712437 -1717047 -5254322 6455787 -875141 -892272
15h92272K1467E9397O466683C07378e680817B140933D32732c64359k84048G98498
$$ -892272 -870805 59397 6526080 307378 -5680817 2140933 432732 -364359 -648407 798498
4c975104A32208L336218k11361A462653
$$ -3975104 132208 3468426 3257065 1462653
##PAGE= F1=14730.45714124
##FIRST=     21204.543296753, 2672.49122660428, -515744
##DATA TABLE= (F2++(Y..Y)), PROFILE
2047e15744A971459G29481N4331e46303j837293q14201E91587K340895R53113
$$ -515744 1971459 729481 783812 -546303 -2383596 -3197797 591587 2932482 3885595
2038C885595c22007A312951a100356C568749I18256a455969c16248B801735A045515
$$ 3885595 -322007 1312951 -1100356 3568749 918256 -1455969 -316248 2801735 1045515
2028b123380H38184M48844b700649Q54521A417357c725699D281609b102473j311317
$$ -2123380 838184 1287028 -2700649 -1846128 1417357 -3725699 4281609 -2102473 -3413790
2019c413790A932255b400638B107977a677373a39974B620009k76690a757441k598421
$$ -3413790 1932255 -2400638 2107977 -1677373 -139974 2620009 2343319 -1757441 -4355862
2010d355862D838818A518911l12783a844127C68553b78336j63747C89435c525218
$$ -4355862 4838818 1518911 1206128 -1844127 368553 -278336 -442083 389435 -3525218
2000F82268c494402C246256a332669F224012e897006B068483a963433A886181
$$ 682268 -3494402 3246256 -1332669 6224012 -5897006 2068483 -1963433 1886181
1991A126703f847288A340288N320593D38763R60812D39544L509045c89075B053769
$$ 1126703 -6847288 1340288 6660881 438763 1399575 439544 3948589 -389075 2053769
1981c494934f41535F232609a768580j776841J277864e36151l37638l282095C086583
$$ -3494934 -641535 6232609 -1768580 -3545421 -2267557 -536151 -873789 -4155884 3086583
1971F97955M968484a056500A191548h389528A531631c325269g0920l289540J677420
$$ 697955 5666439 -1056500 1191548 -8389528 1531631 -3325269 -70920 -3360460 -1683040
1962a683040A167895O51809b23116e8375A67541M061472h66745m168280D17979
$$ -1683040 1167895 1819704 -223116 -58375 167541 4229013 -866745 -5035025 417979
1952d014689K74060J314976B115635P83775A283715Q28918c811709I71295a532341
$$ -4014689 -3740629 -2425653 2115635 2899410 1283715 2112633 -3811709 971295 -1532341
1942B217364e203559B320932K366095a594523b15553A956592a122975B680969
$$ 2217364 -5203559 2320932 4687027 -1594523 -215553 1956592 -1122975 2680969
1933b19308E410785d387351b04705M3200k350090f29338A605883K19176l90885
$$ -219308 5410785 -4387351 -204705 -161505 -2511595 -629338 1605883 1825059 1434174
1924A434174b731867e46746b11406D92426a801471D567596b626488e13744l232382
$$ 1434174 -2731867 -546746 -211406 492426 -1801471 4567596 -2626488 -513744 -3746126
1915c746126J509400B569117c83885A1172122L516352i167626b181976n2410438
$$ -3746126 -2236726 2569117 -383885 11172122 14688474 -9167626 -2181976 -54592414
1907e4592414b5777744F412011k768639R019293A569177J2827454J706739O999287
$$ -54592414 -25777744 6412011 3643372 12662665 1569177 14396631 16103370 23102657
1899B3102657C222532h107787B71389J1434572K3872792C529212J648444c8373667
$$ 23102657 3222532 -8107787 271389 11705961 35578753 3529212 5177656 -38373667
1890d2495351j0218391a9811223c803257B5716708A0386203D543228N785201k578479
$$ -42495351 -52713742 -19811223 -3803257 25716708 10386203 4543228 10328429 7749950
1882G749950M352085J887495c896344D821357h677671f44689l732094k4985240
$$ 7749950 12102035 13989530 -3896344 4821357 -8677671 -644689 -4376783 -29362023
1874b9362023Q429447k0732167e25480j4812460A3705579n912301B208792J8496589
$$ -29362023 -20932576 -41664743 -525480 -15337940 13705579 7793278 2208792 20705381
1866B0705381r280636J8206825f69350F258200b30376B489807a901717B375833
$$ 20705381 11424745 29631570 -669350 6258200 -230376 2489807 -1901717 2375833
1857c510172C143226r80412j96382g06703b32748B01932K848403o10045f05314
$$ -3510172 3143226 2162814 1966432 -706703 -232748 201932 3050335 2440290 -605314
1847A28034g95557k70878A365732a709515C222245a947316P67161A520050K105934
$$ 128034 -795557 -1066435 1365732 -1709515 3222245 -1947316 -1180155 1520050 3625984
1838C625984e278335A371367N79863h78261C700973d009873i69613a55379m358348
$$ 3625984 -5278335 1371367 1951230 -878261 3700973 -4009873 -969613 -155379 -4513727
1829d513727a609078A040499p1607J32876J83203O59556c817422B758068d06820
$$ -4513727 -1609078 1040499 968892 1101768 1284971 1944527 -3817422 2758068 -406820
1819D23766J218372J715380A406001d204218A249862a018700b75471p56123M34952
$$ 423766 1642138 3357518 1406001 -4204218 1249862 -1018700 -275471 -1031594 -596642
1810e96642A985799d307724a789509c28618l824714a128752j447936A977494a230951
$$ -596642 1985799 -4307724 -1789509 -328618 -4153332 -1128752 -2576688 1977494 -1230951
1800B894816f90963H09255M210226a191476c0008A514419b767015l331071B369812
$$ 2894816 -690963 809255 5019481 -1191476 -30008 1514419 -2767015 -6098086 2369812
1790D45015L411497e264267A335508l23689L460991g0248F364362a411134F70517
$$ 445015 3856512 -5264267 1335508 1011819 4472810 -70248 6364362 -1411134 670517
1780E57901c133774C503310f72258B910088A169815D8580c512081C286775b453516
$$ 557901 -3133774 3503310 -672258 2910088 1169815 48580 -3512081 3286775 -2453516
1770c103532a117948l459439C82918J48758K523650c109783i76692A517320L37789
$$ -3103532 -1117948 -4577387 382918 531676 3055326 -3109783 -976692 1517320 1855109
1761A855109K354349E66447a448854E02081b054843l500541E169539a590428m391683
$$ 1855109 4209458 566447 -1448854 502081 -2054843 -5555384 5169539 -1590428 -5982111
1752e982111G161176b680043B772921f476519I697717b363335B066812b39981
$$ -5982111 7161176 -2680043 2772921 -6476519 9697717 -2363335 2066812 -239981
1743a040058C066869B29655L13913b540158D018275A673287a155398D495076f46973
$$ -1040058 3066869 229655 543568 -2540158 4018275 1673287 -1155398 4495076 -646973
1733a912716c07125C056109g37407k270407A990266L73850b439830J24335a81001
$$ -1912716 -307125 3056109 -737407 -3007814 1990266 2364116 -2439830 -2315495 -181001
1723D683115e49775k74361E08180L310215o19005A477848g612382A547058c356807
$$ 4683115 -549775 -824136 508180 3818395 3199390 1477848 -7612382 1547058 -3356807
1713b03015Q1305p21429D676363B38263b518510C91665c979137C67573a408556
$$ -203015 -121710 -843139 4676363 238263 -2518510 391665 -3979137 367573 -1408556
1703a442829A335079d303313a41942B21748K448161F76123a797122A241529D90943
$$ -1442829 1335079 -4303313 -141942 221748 2669909 676123 -1797122 1241529 490943
1693a013452E17080K999506a684083a70455G08537E0122a718481C485102G2998
$$ -1013452 517080 3516586 -1684083 -170455 708537 50122 -1718481 3485102 72998
1683a919402B24406f818215E584326a428750B821201b791708I94674L63244C15321
$$ -1919402 224406 -6818215 5584326 -1428750 2821201 -2791708 994674 1357918 315321
1673C84251b786938e50564j43132r25585m53099B637689a345118j619491a160578
$$ 384251 -2786938 -550564 -693696 -1619281 -2072380 2637689 -1345118 -2964609 -1160578
1663d03081j756187E075898F87958c606024A601209D24170K702974a738607K77530
$$ -403081 -2159268 5075898 687958 -3606024 1601209 424170 3127144 -1738607 -1461077
1654a461077D044329e161555D623897J762569d170105H46409c794534c11202B896367
$$ -1461077 4044329 -5161555 4623897 6386466 -4170105 846409 -3794534 -311202 2896367
1644A545655b775610E488512d302316D731350p31224c842530A251584P79784D90080
$$ 1545655 -2775610 5488512 -4302316 4731350 4000126 -3842530 1251584 2031368 490080
1634E011239a442328b98229m366021H943850B913073B8678c562042H384819M344383
$$ 5011239 -1442328 -298229 -4664250 8943850 2913073 28678 -3562042 8384819 12729202
1625A2729202K1655899K5128956i3096443j44897921A36628952C0644030A1014088
$$ 12729202 34385101 59514057 -93096443 -237994364 136628952 30644030 11014088
1617A724244M796390B511131P87119a227352B018674k75172a387142e933r76736
$$ 1724244 6520634 2511131 3298250 -1227352 2018674 1743502 -1387142 -5933 -982669
1608i82669F12061J260171N905663a862979E43046c23080B144165A070426j81199
$$ -982669 612061 1872232 7777895 -1862979 543046 -323080 2144165 1070426 889227
1599H89227b125973C155591n66855a72948e9752A308626a877232A024205b868213
$$ 889227 -2125973 3155591 2588736 -172948 -59752 1308626 -1877232 1024205 -2868213
1589D186025A716417K135948f918062K348071H744546b185076m119535F648315
$$ 4186025 1716417 3852365 -6918062 -4569991 8744546 -2185076 -6304611 6648315
1580b117215B276119F33790J065885b675620E38784R7375L741262h31861n75017
$$ -2117215 2276119 633790 1699675 -2675620 538784 636159 4377421 -831861 -1406878
1571a406878j05518A051068C87716Q77921a503636n60588F86082k006J21051N497295
$$ -1406878 -1512396 1051068 387716 1265637 -1503636 -2064224 686082 684076 805127 6302422
1561F302422I12314j91760b656669C176056A051477k64418M77993c102257K99238
$$ 6302422 912314 720554 -2656669 3176056 1051477 787059 1265052 -3102257 -2803019
1552b803019B474152b15628A215756K165551A665526b406576C077063G3128K539241
$$ -2803019 2474152 -215628 1215756 3381307 1665526 -2406576 3077063 73128 2612369
1543B612369j228593c306748G444677a805019B758112f03725E33212j26763M245155
$$ 2612369 1383776 -3306748 7444677 -1805019 2758112 -603725 533212 406449 4651604
1534D651604A13791b40948o24866j47774k998604R20801i29838k720754A637170
$$ 4651604 113791 -240948 -865814 -1013588 -4012192 -3091391 -929838 -3650592 1637170
1524A099120b607237j178391C93084c102496c06476A856765J615683j451606I27574
$$ 1099120 -2607237 -3785628 393084 -3102496 -306476 1856765 3472448 2020842 927574
1514a924689C432468g33405A778990J787715a756563A28798O98604K54530C56846
$$ -1924689 3432468 -733405 1778990 3566705 -1756563 128798 827402 1081932 356846
1504b35250C384982e686105C891732c995430k202940D005353d560946F870693
$$ -235250 3384982 -5686105 3891732 -3995430 -6198370 4005353 -4560946 6870693
1495B150930f830142b613705k318191C083146d676173D442416e90906l25588C879809
$$ 2150930 -6830142 -2613705 -4931896 3083146 -4676173 4442416 -590906 -916494 3879809
1485a639095e84354I23782M67447A7637b338298J76258d82615j454849B840974
$$ -1639095 -584354 923782 1391229 17637 -2338298 -2162040 -482615 -1937464 2840974
1475A924039e360716A028567f9673D8045J018886c658441B169811H75211b398987
$$ 1924039 -5360716 1028567 -69673 48045 1066931 -3658441 2169811 875211 -2398987
1465d41906m221373F203127c263341Q5566B383304h4978A150898b137632G74049
$$ -441906 -4663279 6203127 -3263341 -3177775 2383304 -84978 1150898 -2137632 774049
1455f11445A607798l57339m65106h87494L34399j522288F422007f698296a540901
$$ -611445 1607798 1250459 785353 -887494 -553095 -2075383 6422007 -6698296 -1540901
1445D76026L913009d385961D259844a082544C95211l8973c400405B845805b539702
$$ 476026 4389035 -4385961 4259844 -1082544 395211 356238 -3400405 2845805 -2539702
1435a47466n238052g34262C649422A688268n3178j61018b227804O18296A013625
$$ -147466 -5385518 -734262 3649422 1688268 1635090 1474072 -2227804 -1609508 1013625
1425a200633L46497A438150J49460f019910C236968e93858F183303b371370D016251
$$ -1200633 -854136 1438150 1587610 -6019910 3236968 -593858 6183303 -2371370 4016251
1415A592027J263225b245359q40256i07791F602159b314488l66805c49770F529359
$$ 1592027 2855252 -2245359 -3085615 -907791 6602159 -2314488 -2681293 -349770 6529359
1405h02924p76303g16134C642049b306360C124955A230056c464145B632268b929217
$$ -802924 -1579227 -716134 3642049 -2306360 3124955 1230056 -3464145 2632268 -2929217
1395h77910F63199d386195E022017A429921a795988e59880o64669E494403a109569
$$ -877910 663199 -4386195 5022017 1429921 -1795988 -559880 -1224549 5494403 -1109569
1385B843814H10347J538443b871471B112657a798985B063319E04686b778337J08237
$$ 2843814 810347 2348790 -2871471 2112657 -1798985 2063319 504686 -2778337 -2670100
1376b670100B857997b005664d00827E004439B497509b325372F75514J357717f1189
$$ -2670100 2857997 -2005664 -400827 5004439 2497509 -2325372 675514 2033231 -61189
1366F1664M495115f61699p152741A274286j04508c174774B152939p87879L37191
$$ 61664 4556779 -661699 -7814440 1274286 1169778 -3174774 2152939 1365060 1702251
1357A702251F36210J344921J18384g962059A321037n30113c423292A264737c49582
$$ 1702251 636210 1981131 2099515 -7962059 1321037 790924 -3423292 1264737 -349582
1347c900372a251696m72720G78704r9250l03395j23588c241034K12836D533564
$$ -3900372 -1251696 -1724416 778704 679454 376059 252471 -3241034 -3028198 4533564
1337B054306C16388a575958E717537d027839A099038d654308A260131O72396b810568
$$ 2054306 316388 -1575958 5717537 -4027839 1099038 -4654308 1260131 1932527 -2810568
1327c532741B18052K029441b081538l423588D187828d38564D154880b181883H56593
$$ -3532741 218052 2247493 -2081538 -5505126 4187828 -438564 4154880 -2181883 856593
1317e124249i53473b73317l362723a311740C84613C6605b385912G13875g73131
$$ -5124249 -953473 -273317 -3636040 -1311740 384613 36605 -2385912 713875 -773131
1307a003580k820723A662159B69839b010759E406847A541985d80378F10170a77687
$$ -1003580 -3824303 1662159 269839 -2010759 5406847 1541985 -480378 610170 -177687
1297a763611B734845f919825A821365N35832f26959k225625O29189R91306J62342
$$ -1763611 2734845 -6919825 1821365 2357197 -626959 -2852584 -2223395 -1232089 -1069747
1288a069747B992382b238163G97089d92620l20803l816011B824378b868043C728658
$$ -1069747 2992382 -2238163 797089 -492620 -813423 -4629434 2824378 -2868043 3728658
1278C93846c22995l58626k69611C551672A492477i636k844166E16439J13980K955813
$$ 393846 -322995 -681621 -951232 3551672 1492477 -9636 -2853802 516439 630419 3586232
1268C586232a623619E3178b95419D152523a341031f31315B327779a00567k501645
$$ 3586232 -1623619 53178 -295419 4152523 -1341031 -631315 2327779 -100567 -2602212
1259b602212a203521A269268b628345m63272H783024e027557P23696g39533B16862
$$ -2602212 -1203521 1269268 -2628345 -3091617 8783024 -5027557 -4303861 -739533 216862
1249a706490A097326d023048N86431B501652e398557g13377A392486c00450k695871
$$ -1706490 1097326 -4023048 -3436617 2501652 -5398557 -713377 1392486 -300450 -2996321
1240b996321C64157K140479H49494J826143g257578A907351K347566b688408A165400
$$ -2996321 364157 2504636 849494 2675637 -7257578 1907351 4254917 -2688408 1165400
1230A918420d443859B383475a548077E1590c31712F697072c832272A146166K412046
$$ 1918420 -4443859 2383475 -1548077 51590 -331712 6697072 -3832272 1146166 3558212
1221C558212A65454e80735l226451E08217K728756a17428j096516C03688b185163
$$ 3558212 165454 -580735 -3807186 508217 3236973 -117428 -1213944 303688 -2185163
1211B981338H76912b723489C992181A613033n81296b48641D402191D3182a522927
$$ 2981338 876912 -2723489 3992181 1613033 1031737 -248641 4402191 43182 -1522927
1201B831394h68135c8211A703888h23800l061553f90635A051128b616956o23092
$$ 2831394 -868135 -38211 1703888 -823800 -3885353 -690635 1051128 -2616956 -3240048
1192c240048L86539B347214O30590a861381C021008p20952a267518e68482k522118
$$ -3240048 -2853509 2347214 2977804 -1861381 3021008 2300056 -1267518 -568482 -3090600
1183c090600A426538b191517A911206c50606C471223a363375A188277g708689
$$ -3090600 1426538 -2191517 1911206 -350606 3471223 -1363375 1188277 -7708689
1174D34964b408076A509029F01829c344658Q77151K61035D62473b581581c4016
$$ 434964 -2408076 1509029 601829 -3344658 -2467507 -2206472 462473 -2581581 -34016
1164D471256B170925d448723g81468C989292f873756A543876g31870A015283N09778
$$ 4471256 2170925 -4448723 -781468 3989292 -6873756 1543876 -731870 1015283 1525061
1155A525061a544261D719199j300850a557881D554299a017074K1113l100864K024224
$$ 1525061 -1544261 4719199 3418349 -1557881 4554299 -1017074 -995961 -4096825 -2072601
1146b072601H81032K093759A218673b18025l394372I87637J804122c137119m97460
$$ -2072601 881032 2974791 1218673 -218025 -3612397 987637 2791759 -3137119 -3634579
1137c634579B14428J621493b136074a059997H14399g492k58767e6906A086340
$$ -3634579 214428 1835921 -2136074 -1059997 814399 -7492 -266259 -56906 1086340
1127C17644e76053m09325B233512a530089J46121A014933j82257b082530L64625
$$ 317644 -576053 -985378 2233512 -1530089 -1383968 1014933 832676 -2082530 -1717905
1118a717905k494811a323008A343738b699481A496506N09235c583177h12025A744266
$$ -1717905 -4212716 -1323008 1343738 -2699481 1496506 2005741 -3583177 -812025 1744266
1108d87149o02419L93464A779929h70180B075790J105843A243173k09498F4841
$$ -487149 -1089568 -696104 1779929 -870180 2075790 3181633 1243173 1033675 64841
1098a527888m67263B682615N86799F1892b705968B444450b462444m05985H75766
$$ -1527888 -1995151 2682615 3269414 61892 -2705968 2444450 -2462444 -2868429 875766
1088a395844D511421H88791l70828c395705a72833G60760K795754b144164l548867
$$ -1395844 4511421 888791 517963 -3395705 -172833 760760 3556514 -2144164 -5693031
1079e693031H65789A23003a165376j211908D900969a563724B2146e18127k027894
$$ -5693031 865789 123003 -1165376 -2377284 4900969 -1563724 22146 -518127 -2546021
1070b546021g20095m57168A605475b058624i12129o44689M68254N13350A91225
$$ -2546021 -720095 -1177263 1605475 -2058624 -912129 -1556818 -1088564 -575214 191225
1060b485059j151845J702948D687679A327473L81756a209611B45780a859082H23862
$$ -2485059 -3636904 -1933956 4687679 1327473 1709229 -1209611 245780 -1859082 823862
1050c79595F28153J117097M02177c246106A316487g3506k115248C844885f96728
$$ -379595 628153 1745250 2147427 -3246106 1316487 -73506 -2188754 3844885 -696728
1040a96129G18355k96238J606555a422633B62509K093819e204787F012276c022265
$$ -196129 718355 422117 2028672 -1422633 262509 2356328 -5204787 6012276 -3022265
1030i83323B015885a424915O57850H98915A30071g21943J81843j215755B169567
$$ -983323 2015885 -1424915 -767065 898915 130071 -721943 -540100 -1755855 2169567
1020B048254A013130b400656C306934g20908l00300j554618b05402A098088b061228
$$ 2048254 1013130 -2400656 3306934 -720908 -1021208 -2575826 -205402 1098088 -2061228
1010C691021a708630k92975B193733A37500Q16397M435971e885031K775028B761870
$$ 3691021 -1708630 -2001605 2193733 137500 953897 5389868 -5885031 -3110003 2761870
1000A414889Q93164a271727C491258I09792d487280E865289c564836B271002b63537
$$ 1414889 2308053 -1271727 3491258 909792 -4487280 5865289 -3564836 2271002 -263537
990e61838D52354A97742L040698b177534H592407b591035C696196c428365E665775
$$ -561838 452354 197742 3238440 -2177534 8592407 -2591035 3696196 -3428365 5665775
980b745009i61233j38768j953704O18589E103938a387695C27993K638181B07487
$$ -2745009 -961233 -1100001 -3053705 -2435116 5103938 -1387695 327993 2966174 207487
$$ [...]
##END NTUPLES=nD NMR SPECTRUM
##END=
