##TITLE=XTC-1153_1
##JCAMPDX= 6.0         $$ Bruker NMR JCAMP-DX V2.0
##DATA TYPE= nD NMR SPECTRUM
##DATA CLASS= NTUPLES
##NUM DIM= 2
##ORIGIN= BRUKER
##OWNER= patiny
$$ 1.79 TOPSPIN		Version 3.0
$$ 2012-05-20 02:08:41.129 +0200  patiny@icmbsg005
$$ Compression mode = diff/dup
##.OBSERVE FREQUENCY= 400.131593689269
##.OBSERVE NUCLEUS= ^1H
##.ACQUISITION MODE= SIMULTANEOUS (DQD)
##.ACQUISITION SCHEME= Echo-Antiecho
##.AVERAGES= 4
##.DIGITISER RES= 23
##SPECTROMETER/DATA SYSTEM= spect
##.PULSE SEQUENCE= hmbcetgpl3nd
##.SOLVENT NAME= D2O
##.SHIFT REFERENCE= INTERNAL, D2O, 1, 7.306317
##AUDIT TRAIL= $$ (NUMBER, WHEN, WHO, WHERE, PROCESS, VERSION, WHAT)
$$ ##TITLE= Audit trail, TOPSPIN		Version 3.0
$$ ##JCAMPDX= 5.01
$$ ##ORIGIN= Bruker BioSpin GmbH
$$ ##OWNER= patiny
$$ $$ /opt/data/patiny/nmr/XTC-1153_1/14/pdata/1/auditp.txt
$$ ##AUDIT TRAIL=  $$ (NUMBER, WHEN, WHO, WHERE, PROCESS, VERSION, WHAT)
(   1,<2012-05-20 02:08:39.179 +0200>,<patiny>,<icmbsg005>,<go>,<TOPSPIN 3.0>,
      <created by zg
	started at 2012-05-20 01:46:32.097 +0200,
	POWCHK enabled, PULCHK disabled,
       configuration hash MD5:
       77 C7 B7 C4 10 F4 BA 30 64 2E BB 52 82 F2 DA 41
       data hash MD5: 4K * 128
       EF C5 BA BE 51 B7 69 D3 7E 8A F0 75 4D 67 5B 00>)
(   2,<2012-05-20 02:08:39.241 +0200>,<patiny>,<icmbsg005>,<audit>,<TOPSPIN 3.0>,
      <user comment:
       ICON-NMR User ID: patiny
       data hash MD5: 4K * 128
       EF C5 BA BE 51 B7 69 D3 7E 8A F0 75 4D 67 5B 00>)
(   3,<2012-05-20 02:08:40.224 +0200>,<patiny>,<icmbsg005>,<proc2d>,<TOPSPIN 3.0>,
      <Start of raw data processing
       xfb same F2: SI = 2K WDW = 3 SSB = 4 FT_mod = 6 PKNL = 1 F1: SI = 1K ME_mod = 2 NCOEF = 32 WDW = 4 SSB = 2 FT_mod = 6 PHC0 = 0 PHC1 = 0
       data hash MD5: 2K * 1K
       B7 EE B2 B8 43 47 B6 AD F6 45 30 E1 28 8E 41 FA>)
(   4,<2012-05-20 02:08:40.337 +0200>,<patiny>,<icmbsg005>,<proc2d>,<TOPSPIN 3.0>,
      <abs2 F2: ABSG = 5 ABSF1 = 7.306317 ABSF2 = 0.6595409
       data hash MD5: 2K * 1K
       18 79 2F DE 60 20 81 82 6A 34 85 FC 87 C1 5E 02>)
(   5,<2012-05-20 02:08:40.514 +0200>,<patiny>,<icmbsg005>,<proc2d>,<TOPSPIN 3.0>,
      <abs1 F1: ABSG = 5 ABSF1 = 210.754 ABSF2 = -11.10083
       data hash MD5: 2K * 1K
       32 A2 B0 80 34 B5 23 8F 16 AD 2C 64 CB 8E 03 1D>)
$$ ##END=
$$ 
$$ $$ hash MD5
$$ $$ 20 9F D1 43 46 3B EA 8E F9 49 5E 21 88 9A AB 7A
##$RELAX= 
##$RELAX= 
##$RELAX= 
##$RELAX= 
##$RELAX= 
##$RELAX= 
##$RELAX= 
##$RELAX= 
##$RELAX= 
##$RELAX= 
##$RELAX= 
$$ Bruker specific parameters
$$ --------------------------
##$DATPATH= </opt/data/patiny/nmr>
##$EXPNO= 14
##$NAME= <XTC-1153_1>
##$PROCNO= 1
##$ACQT0= 1000000
##$AMP= (0..31)
100 100 100 100 100 100 100 100 100 100 100 100 100 100 100 100 100 100
100 100 100 100 100 100 100 100 100 100 100 100 100 100
##$ANAVPT= -1
##$AQSEQ= 0
##$AQ_mod= 3
##$AUNM= <au_getlinv>
##$AUTOPOS= <31 >
##$BF1= 400.13
##$BF2= 100.612769
##$BF3= 400.13
##$BF4= 400.13
##$BF5= 400.13
##$BF6= 400.13
##$BF7= 400.13
$$ [...]
##$SIGF1= 7.306317
##$SIGF2= 0.6595409
##$SINO= 0
##$SIOLD= 2048
##$SPECTYP= <>
##$SREGLST= <1H.DMSO>
##$SSB= 4
##$STSI= 2048
##$STSR= 0
##$SW_p= 2659.57446808511
##$SYMM= 0
##$S_DEV= 2235852
##$TDeff= 4096
##$TDoff= 0
##$TI= <>
##$TILT= no
##$TM1= 0
##$TM2= 0
##$TOPLEV= 100
##$USERP1= <>
##$USERP2= <>
##$USERP3= <>
##$USERP4= <>
##$USERP5= <>
##$WDW= 3
##$XDIM= 2048
##$YMAX_p= 193602993
##$YMIN_p= -364066438
##$CURPLOT= <Cups-PDF>
##$CURPRIN= <$Cups-PDF>
##$DFORMAT= <normdp>
##$LAYOUT= <+/2D_inv.xwp>
##$LFORMAT= <normlp>
##$PFORMAT= <normpl>
$$ Bruker specific parameters for F1
$$ ---------------------------------
##$ACQT0= 0
##$BF1= 100.612769
##$FnMODE= 6
##$NUC1= <13C>
##$O1= 10043.8343986724
##$SFO1= 100.622812834399
##$SW= 221.832681201688
##$SW_h= 22321.4283611104
##$TD= 128
##$ABSF1= 210.754
##$ABSF2= -11.10083
##$ABSG= 5
##$ABSL= 0
##$ALPHA= 0
##$AQORDER= 0
##$ASSFAC= 0
##$ASSFACI= 0
##$ASSFACX= 0
##$ASSWID= 0
##$AUNMP= <>
##$AXLEFT= 0
##$AXNAME= <F1>
##$AXNUC= <13C>
##$AXRIGHT= 0
##$AXTYPE= 0
##$AXUNIT= <>
##$AZFE= 0.1
##$AZFW= 0.5
##$BCFW= 0
##$BC_mod= 0
##$BYTORDP= 0
##$COROFFS= 0
##$CY= -3
##$DATMOD= 1
##$DC= 0
##$DFILT= <>
##$DTYPP= 0
##$ERETIC= no
##$F1P= 210.76350402832
##$F2P= -11.0913240743493
##$FCOR= 0.5
##$FTSIZE= 1024
##$FT_mod= 6
##$GAMMA= 0
##$GB= 0
##$INTBC= 1
##$INTSCL= 1
##$ISEN= 128
##$LB= 0
##$LEV0= 0
##$LPBIN= 256
##$MAXI= 10000
##$MC2= 5
##$MEAN= 0
##$ME_mod= 2
##$MI= 1
##$NCOEF= 32
##$NC_proc= -11
##$NLEV= 6
##$NOISF1= 0
##$NOISF2= 0
##$NSP= 0
##$NTH_PI= 0
##$NZP= 0
##$OFFSET= 210.754
##$PC= 4
##$PHC0= 0
##$PHC1= 0
##$PH_mod= 1
##$PKNL= no
##$PPARMOD= 1
##$PPDIAG= 0
##$PPIPTYP= 0
##$PPMPNUM= 2147483647
##$PPRESOL= 1
##$PSCAL= 1
##$PSIGN= 0
##$PYNMP= <>
##$REVERSE= no
##$SF= 100.612769
##$SI= 1024
##$SIGF1= 210.754
##$SIGF2= -11.10083
##$SINO= 0
##$SIOLD= 1024
##$SPECTYP= <>
##$SREGLST= <>
##$SSB= 2
##$STSI= 1024
##$STSR= 0
##$SW_p= 22321.42836111
##$SYMM= 0
##$S_DEV= 2235852
##$TDeff= 256
##$TDoff= 0
##$TI= <>
##$TILT= no
##$TM1= 0
##$TM2= 0
##$TOPLEV= 0
##$USERP1= <>
##$USERP2= <>
##$USERP3= <>
##$USERP4= <>
##$USERP5= <>
##$WDW= 4
##$XDIM= 128
##$YMAX_p= 193602993
##$YMIN_p= -364066438
$$ End of Bruker specific parameters
$$ ---------------------------------
##NTUPLES= nD NMR SPECTRUM
##VAR_NAME=  FREQUENCY1,    FREQUENCY2,      SPECTRUM
##SYMBOL=    F1,            F2,              Y
##.NUCLEUS=  13C,           1H
##VAR_TYPE=  INDEPENDENT,   INDEPENDENT,     DEPENDENT
##VAR_FORM=  AFFN,          AFFN,            ASDF
##VAR_DIM=   1024,          2048,            2048
##UNITS=     HZ,            HZ,              ARBITRARY UNITS
##FACTOR=    21.7982698838965, 1.29862034574468, 1
##FIRST=     21204.543296753, 2658.27584773936, 1256815
##LAST=      -1095.08679447308, 0,           -1081651
##MIN=       -1095.08679447308, 0,           -364066438
##MAX=       21204.543296753, 2658.27584773936, 193602993
##PAGE= F1=21204.54329675
##FIRST=     21204.543296753, 2658.27584773936, 1256815
##DATA TABLE= (F2++(Y..Y)), PROFILE
$$ [...]
##PAGE= F1=5662.376869535
##FIRST=     21204.543296753, 2658.27584773936, -753307
##DATA TABLE= (F2++(Y..Y)), PROFILE
1260c44181B589236c03497B344298I01714J30225A05605K131945c105993C521568
$$ -344181 2589236 -303497 2344298 901714 1031939 105605 2237550 -3105993 3521568
1250e67051k53361A326645k59307i51321A818762b141681R20660A90502f18754
$$ -567051 -820412 1326645 1067338 -951321 1818762 -2141681 -1221021 190502 -618754
1240a072860K92593o43881L92616I96628e089873F787910d626836G313554c369643
$$ -1072860 -780267 -1424148 -1031532 996628 -5089873 6787910 -4626836 7313554 -3369643
1230A764184a01861l06003p48488A25306a464714C39805K407363b870756C178508
$$ 1764184 -101861 -407864 -1156352 125306 -1464714 339805 2747168 -2870756 3178508
1220E45892a645331F897766c501983C40642a014993j318812j477560a65128A85441
$$ 545892 -1645331 6897766 -3501983 340642 -1014993 -2333805 -3811365 -165128 185441
1210f00215C447361b38323C126229g55424n20987j699825f6140l832404I36608
$$ -600215 3447361 -238323 3126229 -755424 -1276411 -2976236 -66140 -3898544 936608
1200b473763l243306G52740J382486a220778C768916b818707A937958k33804K145968
$$ -2473763 -5717069 752740 2135226 -1220778 3768916 -2818707 1937958 1704154 3850122
1191C850122E93780a758434B533387H86027d16327k611931B303665f64812C203765
$$ 3850122 593780 -1758434 2533387 886027 -416327 -3028258 2303665 -664812 3203765
1181b412583A931937f24207j1089j60992a41597n07641B169737Q34140a496391
$$ -2412583 1931937 -624207 -635296 -796288 -141597 -649238 2169737 3003877 -1496391
1171A912948p95935b09632l336783H0360O096038d96685j905522H77121J699823
$$ 1912948 1117013 -209632 -3546415 80360 6176398 -496685 -2402207 877121 2576944
1162B576944g283437e62345J14510q25566B607704A150454M2820f002468C431912
$$ 2576944 -7283437 -562345 -447835 -1273401 2607704 1150454 1193274 -6002468 3431912
1152a915533D0668O20347d323888D102836B45377M539069a023373C401734a560926
$$ -1915533 40668 661015 -4323888 4102836 245377 4784446 -1023373 3401734 -1560926
1142b45546j12799A412439M028614a707843B797929i18906c79448I13443b341895
$$ -245546 -358345 1412439 5441053 -1707843 2797929 -918906 -379448 913443 -2341895
1132a209099A096046c80928k828748C574645c735758B457576i05662C071058d805579
$$ -1209099 1096046 -380928 -3209676 3574645 -3735758 2457576 -905662 3071058 -4805579
1122C336007B48832a662307C78813b333902q74067A569586h34421F55931d34793
$$ 3336007 248832 -1662307 378813 -2333902 -3207969 1569586 -834421 655931 -434793
1112I82151f06840A486819Q36337e719136A061229A73061a0854D044961h53226
$$ 982151 -606840 1486819 2323156 -5719136 1061229 173061 -10854 4044961 -853226
1102D568819h90759A636078b195663R14736B363950b858727b28901B914549B76521
$$ 4568819 -890759 1636078 -2195663 -1280927 2363950 -2858727 -228901 2914549 276521
1092A048552P37037E66663K145240f497688C9882d411697A172035J12362R64204
$$ 1048552 1785589 566663 2711903 -6497688 39882 -4411697 1172035 1284397 2248601
1083B248601b642625F10308J54146a233955l337963K004600E206630B17410b633447
$$ 2248601 -2642625 610308 764454 -1233955 -4571918 -2567318 5206630 217410 -2633447
1073C446001A535055f26925G46180a95128l572746B376078M01034b977393B031149
$$ 3446001 1535055 -626925 746180 -195128 -3767874 2376078 2777112 -2977393 2031149
1063d596532i59479A068078b711607A422415F89215a521179c17218k7398E96966
$$ -4596532 -959479 1068078 -2711607 1422415 689215 -1521179 -317218 -344616 596966
1053a117381E733601c364430h62269b2141B909855h96189F05798a884282F08354
$$ -1117381 5733601 -3364430 -862269 -22141 2909855 -896189 605798 -1884282 608354
1043f25385c06042A398002a458585F863055c783647B292547e60403a58395B504106
$$ -625385 -306042 1398002 -1458585 6863055 -3783647 2292547 -560403 -158395 2504106
1033c383116D616336B51997e254251B97186a392812m66560A865732n71552E65867
$$ -3383116 4616336 251997 -5254251 297186 -1392812 -1859372 1865732 1294180 565867
1023b722166A606330e394012A169451g55216b99681j010188j255500N69370A843646
$$ -2722166 1606330 -5394012 1169451 -755216 -299681 -1309869 -2565369 -1995999 1843646
1013a556599j066113B368490a695003j772463d85970m61658D701823c33636k132042
$$ -1556599 -2622712 2368490 -1695003 -3467466 -485970 -947628 4701823 -333636 -2465678
1004b465678k50896G84021J332606J782860b416827C3477a9513j652438B2279
$$ -2465678 -2716574 784021 2116627 3899487 -2416827 33477 -19513 -1671951 22279
994D660098d857702D636576d55529a40678A603831b237781A157201L10413a965896
$$ 4660098 -4857702 4636576 -455529 -140678 1603831 -2237781 1157201 1467614 -1965896
984D335618e491577b554941I66981J337610J598142e681183E764783d337083B476413
$$ 4335618 -5491577 -2554941 966981 2304591 3902733 -5681183 5764783 -4337083 2476413
974c167455C154866j394677a003988h630C571675A013787f163601F72814J864708
$$ -3167455 3154866 1760189 -1003988 -8630 3571675 1013787 -6163601 672814 2537522
965B537522E9307a5718C230260d932430H12961b545950A36362L53521L269494
$$ 2537522 59307 -15718 3230260 -4932430 812961 -2545950 136362 489883 3759377
956C759377E43565J280546D76461b197858B217416M87722K75681i84248j846269
$$ 3759377 543565 1824111 476461 -2197858 2217416 2705138 2980819 -984248 -2830517
947b830517l75996C533930j496381l32948b823513N64624A188972e55265j486884
$$ -2830517 -3206513 3533930 2037549 1704601 -2823513 -2258889 1188972 -555265 -2042149
938b042149B595995c64935C573619a649650m880745B068695a531509C05310c61519
$$ -2042149 2595995 -364935 3573619 -1649650 -6530395 2068695 -1531509 305310 -361519
928H16647J201491k69243d622928C890615g44763B233521A089713b804412B913202
$$ 816647 2018138 1748895 -4622928 3890615 -744763 2233521 1089713 -2804412 2913202
918c296361j51669e67903p12401c04082F38567B31427b302953B302575j60174
$$ -3296361 -3448030 -567903 -1280304 -304082 638567 231427 -2302953 2302575 2142401
909B142401k43634d265977C693958m21490c654410i89683C603157a563159A319543
$$ 2142401 1898767 -4265977 3693958 3272468 -3654410 -989683 3603157 -1563159 1319543
899i47245C028032C37979b797379B407543p45395d450840g39721D97633B37155
$$ -947245 3028032 337979 -2797379 2407543 1662148 -4450840 -739721 497633 237155
889a704702G017175c963930A401079h201557B360197b842701D98430a601068B969455
$$ -1704702 7017175 -3963930 1401079 -8201557 2360197 -2842701 498430 -1601068 2969455
879B533508e436009I57688f213605D057506F97692c20562j622232h08940j507008
$$ 2533508 -5436009 957688 -6213605 4057506 697692 -320562 -1942794 -808940 -2315948
870b315948N86388J48100j9729j905907e45236r44341A143238g54944m25297n67636
$$ -2315948 -1729560 -1581460 -1601189 -3507096 -545236 -1489577 1143238 -754944 -1180241 -1747877
860a747877A659269K769692k059888o25392d738168E220002i609397B777796J027944
$$ -1747877 1659269 4428961 2369073 1743681 -4738168 5220002 -9609397 2777796 3805740
851C805740a416961J18263B961371a338101L47754B513512e159848B148068c651126
$$ 3805740 -1416961 -1298698 2961371 -1338101 -990347 2513512 -5159848 2148068 -3651126
841a278024A84329J329718d722097H62444a676568B42027i8255n207096a261616
$$ -1278024 184329 1514047 -4722097 862444 -1676568 242027 -98255 -5305351 -1261616
831b463552C255250b298349d8564l393695C226811g81253c6132k082380A925398
$$ -2463552 3255250 -2298349 -48564 -3442259 3226811 -781253 -36132 -2118512 1925398
821B088156a565304K29936A617237a992652B739887e597377J65513f00414o32085
$$ 2088156 -1565304 -1335368 1617237 -1992652 2739887 -5597377 -5431864 -600414 -1232499
812a232499d48076A781441N40235f13027l02702A214905f029206B302158e4087
$$ -1232499 -448076 1781441 2321676 -613027 -915729 1214905 -6029206 2302158 -54087
802d004360n86605d63113B067615K035854P38741c617419A428702J095682d627406
$$ -4004360 -4590965 -463113 2067615 4103469 4842210 -3617419 1428702 2524384 -4627406
792F064234C12426e019317E492253d707271f32278C282854A31285c84820E185972
$$ 6064234 312426 -5019317 5492253 -4707271 -632278 3282854 131285 -384820 5185972
782g210929B133519O72814a332078k16336r74432A0346K036964a044092C14903
$$ -7210929 2133519 2806333 -1332078 -1548414 -2522846 10346 2047310 -1044092 314903
772G87223a843108M0365C394741A265456c915426C66400O887930a655833B632875
$$ 787223 -1843108 -1802743 3394741 1265456 -3915426 366400 7254330 -1655833 2632875
762b61089j855841E64882K586034A319094e892529A444635F00554b683561B205234
$$ -261089 -2116930 564882 3150916 1319094 -5892529 1444635 600554 -2683561 2205234
752f23561j212456B427642d017748A826945n21258l60421B2998a828538o67296
$$ -623561 -1836017 2427642 -4017748 1826945 1305687 945266 22998 -1828538 -2495834
743b495834J024760r53265a067654C163923a743628j452360B948728l78910A93934
$$ -2495834 -1471074 -2424339 -1067654 3163923 -1743628 -3195988 2948728 2569818 193934
733C99615e3017A335880l236g593926b779243A451422J864815A208871L01608
$$ 399615 -53017 1335880 1332644 -7593926 -2779243 1451422 3316237 1208871 1510479
724A510479n61923K89722b774731A392998b969214B12884M3612M037389b430505
$$ 1510479 948556 1238278 -2774731 1392998 -2969214 212884 256496 4293885 -2430505
714a115995M44474a59603k098417a61363r81794c94252B624355E82337b163460
$$ -1115995 -671521 -159603 -2258020 -161363 -1143157 -394252 2624355 582337 -2163460
704H95092d39763B252616Q7959d858922j9843424f241277k063771m680559B6613619
$$ 895092 -439763 2252616 2340575 -4858922 -24702346 -6241277 -8305048 -12985607 26613619
694B8518811A1152605j740072M214158d68189r184887k6321337J3678287l724604
$$ 28518811 11152605 9412533 13626691 -468189 -9653076 -35974413 -22296126 -26020730
686b6020730j6251344E373472L2593521A6549513P998864L348346h961382j360840
$$ -26020730 -42272074 5373472 37966993 16549513 24548377 27896723 -8961382 -10322222
678a0322222a48193k114222l521088a084808h1798A174427h06225C610572a353830
$$ -10322222 -148193 -2262415 -5783503 -1084808 -81798 1174427 -806225 3610572 -1353830
668c38845G5022L649843b993616j494475E299215d5430B349688J824070J8948806
$$ -338845 75022 3724865 -2993616 -4488091 5299215 -45430 2349688 4173758 23122564
659B3122564j1207413a2251423K449433k3799546c881888p897632k1380383H361806
$$ 23122564 11915151 -12251423 -9801990 -33601536 -3881888 -11779520 -33159903 8361806
650B891954K9650506j701814A2261707a732298k58589j3423743c970468O81449
$$ 2891954 32542460 30840646 12261707 -1732298 -1990887 -15414630 -3970468 -3289019
642c289019j3390486f891166J001018H504214R224773A995104b372558F35611
$$ -3289019 -16679505 -6891166 -5890148 8504214 17728987 1995104 -2372558 635611
633a29056I96811d957326K143372a151664A958928o59143q5338J658398I39085
$$ -129056 996811 -4957326 -2813954 -1151664 1958928 1299785 1214447 2872845 939085
623A477995d343836C176622e285718B01821K987958j260365G72816a186827A855423
$$ 1477995 -4343836 3176622 -5285718 201821 3189779 1929414 772816 -1186827 1855423
613a524585I03311L142616j867478E34044J0005342O034941J8172059L3813040
$$ -1524585 903311 4045927 2178449 534044 10539386 16574327 34746386 68559426
605F8559426A1607074c59582752a34903595C5073651J48619087A8049104k234485
$$ 68559426 11607074 -359582752 -134903595 35073651 183692738 18049104 15814619
598A5814619j495306F087713j503200R4294p73156K18316j960190K426752A749032
$$ 15814619 14319313 6087713 4584513 4678807 3905651 4123967 2163777 4590529 1749032
588I66328O65317a486170A860458p35508J258478a039195B491924D84384L473663
$$ 966328 1631645 -1486170 1860458 1124950 2383428 -1039195 2491924 484384 3958047
579C958047i26377F1054L513635M05959H84462g775793B01247d564929F9621c676085
$$ 3958047 -926377 61054 3574689 3980648 884462 -7775793 201247 -4564929 69621 -3676085
568a10575j773500k75655E6995e595242g85352E032074a158282k17456o79390
$$ -110575 -1884075 -2159730 56995 -5595242 -785352 5032074 -1158282 -1375738 -2055128
559b055128C80660L968966g73308j35246C188551e278706A024465h56938A828216
$$ -2055128 380660 4349626 -773308 -908554 3188551 -5278706 1024465 -856938 1828216
549D239337A317261g64585C79275h33127A923706a003050E80685a034292E23344
$$ 4239337 1317261 -764585 379275 -833127 1923706 -1003050 580685 -1034292 523344
539a461479C254572c086511g81152C919127e996264b643322G20993a734175C879554
$$ -1461479 3254572 -3086511 -781152 3919127 -5996264 -2643322 720993 -1734175 3879554
529d05940k80198p98171n10950e72120j594623I466059F353J118041h10797A666193
$$ -405940 -686138 -1484309 -1995259 -572120 -2166743 9466059 6353 1124394 -810797 1666193
518b913819A919035d044126F473481c220953G06385J718710B69604b923118R72907
$$ -2913819 1919035 -4044126 6473481 -3220953 706385 2425095 269604 -2923118 -1950211
509a950211n47141e61041C927168a98281D575224B1522J950189L65108b213282
$$ -1950211 -2497352 -561041 3927168 -198281 4575224 21522 1971711 2336819 -2213282
499G75140J293118a326424q59491i7796A062523e64254B92010J406046L458671
$$ 775140 2068258 -1326424 -2185915 -97796 1062523 -564254 292010 1698056 5156727
490E156727A482600b147616Q97372M14561d12430n655852A420845a58939q54681
$$ 5156727 1482600 -2147616 -1250244 -835683 -412430 -6068282 1420845 -158939 -1013620
481a013620m348587i10751B777910e460077C642049M98395G81947M697384A447493
$$ -1013620 -5362207 -910751 2777910 -5460077 3642049 4140444 781947 5479331 1447493
471e00451j582694B911878b411851C858598a465298e8359j136252m44335A21955
$$ -500451 -2083145 2911878 -2411851 3858598 -1465298 -58359 -1194611 -1638946 121955
461f95357B485157i768340E618626a15242j168575B057989K22509a243577j950598
$$ -695357 2485157 -9768340 5618626 -115242 -1283817 2057989 2280498 -1243577 -3194175
452c194175C378332m07090N21910f177190B300381B70722c971482C4995L596866
$$ -3194175 3378332 2971242 3493152 -6177190 2300381 270722 -3971482 34995 3631861
443C631861A384100M334209I02551b898516a112434D08696c013221B281746E92359
$$ 3631861 1384100 5718309 902551 -2898516 -1112434 408696 -3013221 2281746 592359
433C555708b775464a298825b61502D018098e002526b259209q07399D148577a032416
$$ 3555708 -2775464 -1298825 -261502 4018098 -5002526 -2259209 -3066608 4148577 -1032416
423C92233L838773b152966j565821B076333e544604d89558k269531C713206K05863
$$ 392233 4231006 -2152966 -3718787 2076333 -5544604 -489558 -2759089 3713206 3919069
414C919069I23473A2604d54447j292801G08931b733907A177857d69585k074044
$$ 3919069 923473 12604 -454447 -1747248 708931 -2733907 1177857 -469585 -2543629
405b543629A241072b348547b69994m727062A561499Q89697a710269B87754a929978
$$ -2543629 1241072 -2348547 -269994 -4997056 1561499 2451196 -1710269 287754 -1929978
395b910402a187001C60185J777217c370757a395230C69132L14098a767183I24794
$$ -2910402 -1187001 360185 2137402 -3370757 -1395230 369132 683230 -1767183 924794
385C504341B82900K32460M28880b052109A750162m61856g9967C92770d490447
$$ 3504341 282900 515360 944240 -2052109 1750162 1288306 -79967 392770 -4490447
375c261363a236657d78667l698908f46359j007253D460568f918504E846308b312818
$$ -3261363 -1236657 -478667 -4177575 -646359 -1653612 4460568 -6918504 5846308 -2312818
365f45880j287B247648g47480b39302D61197d333320C199276b689969D856821
$$ -645880 -647167 2247648 -747480 -239302 461197 -4333320 3199276 -2689969 4856821
355c997147d24526h5013k757485O6192e05543C458176r19820D8195c60558l072175
$$ -3997147 -424526 -85013 -2842498 -2776306 -505543 3458176 2538356 48195 -360558 -3432733
345c432733c94238f6256A505235c379318B020922J897553f72374l87422G112199
$$ -3432733 -394238 -66256 1505235 -3379318 2020922 3918475 -672374 -1059796 7112199
335c388967j354097a769978O37267B467163c32483k2953A479090R74994h97802
$$ -3388967 -4743064 -1769978 -1132711 2467163 -332483 -355436 1479090 2454084 -897802
325G49097a23541j834527l62082f65051E45891c653172B00959J879938a096881
$$ 749097 -123541 -1958068 -2320150 -665051 545891 -3653172 200959 2080897 -1096881
315C232380a085388m41839I96006b351138G34739J926770a279132d80089r07726
$$ 3232380 -1085388 -1527227 996006 -2351138 734739 2661509 -1279132 -480089 -1387815
306a387815f7127l235723D078578h79084k023587C872732A565986c345148J477251
$$ -1387815 -67127 -3302850 4078578 -879084 -2902671 3872732 1565986 -3345148 -1867897
297a867897K57239O96014C225838K663926h97314B812259E17667J276174i48926
$$ -1867897 -1610658 -914644 3225838 5889764 -897314 2812259 517667 1793841 -948926
287D015237a461427D553880g621925I67710O71215e377985B92026J997269J840766
$$ 4015237 -1461427 4553880 -7621925 967710 1638925 -5377985 292026 2289295 4130061
278D130061a284113l30283l129396A400476h76209B674248a194797d95553A245742
$$ 4130061 -1284113 -1614396 -4743792 1400476 -876209 2674248 -1194797 -495553 1245742
268c38331A210792J89802J547643c546203A227863a598745A58780d41050A043324
$$ -338331 1210792 1400594 2948237 -3546203 1227863 -1598745 158780 -441050 1043324
258G4432b121937E88925e48872A075826A44408O95063a519295j88968q87316D268251
$$ 74432 -2121937 588925 -548872 1075826 144408 839471 -1519295 -1708263 -2595579 4268251
247c575023A765369c046359j445235a443058j449505E86315a60751o4213C071722
$$ -3575023 1765369 -3046359 -4491594 -1443058 -2892563 586315 -160751 -224964 3071722
237D280997b724044C029523c143285B358085b475423A849600G10445f23971l472272
$$ 4280997 -2724044 3029523 -3143285 2358085 -2475423 1849600 710445 -623971 -4096243
228d096243a289645c35628m145857C114788b725020J296699K68243B22316P21772
$$ -4096243 -1289645 -335628 -4481485 3114788 -2725020 -1428321 -1160078 222316 944088
219I44088c67605l173081B002899d451616b88853M4088j312403l6325A518685
$$ 944088 -367605 -3540686 2002899 -4451616 -288853 -244765 -1557168 -1593493 1518685
209C35934M920277h89159J02491q6263q0914B575775A032834J086762c240337
$$ 335934 5256211 -889159 -786668 -872931 -953845 2575775 1032834 2119596 -3240337
199A623311E95670c027310B007712c006449a59574j343995J28915B022180a699819
$$ 1623311 595670 -3027310 2007712 -3006449 -159574 -1503569 -1374654 2022180 -1699819
189b794716R9155A334249a471605j789116c50753B754406O39993c586222a391279
$$ -2794716 -2695561 1334249 -1471605 -3260721 -350753 2754406 3394399 -3586222 -1391279
179B618273K466676d142806g97570J6982j045298H94233J86910h884228m9030718
$$ 2618273 5084949 -4142806 -797570 -780588 -1825886 894233 1081143 -8884228 -57914946
170e7914946j23676021D4534828R51921J40401513F6986632J10290799c2456441
$$ -57914946 -181590967 44534828 45486749 185888262 66986632 177277431 -32456441
162c5166726j39392836d0346443G030917l348492c159976J407525D726986c840680
$$ -35166726 -174559562 -40346443 7030917 3682425 -3159976 -1752451 4726986 -3840680
153c32027B51652J94804K32286d36430r60571C321081F9934c22200D79639b803856
$$ -332027 251652 446456 678742 -436430 -1397001 3321081 69934 -322200 479639 -2803856
142A222409E46641d045444A696507K185322a52029n46558j9432f4622m97787b23830
$$ 1222409 546641 -4045444 1696507 3881829 -152029 -698587 -718019 -64622 -562409 -223830
131D348702a239250C49022Q88998b719261A349721l20163a182908D67152c616326
$$ 4348702 -1239250 349022 1238020 -2719261 1349721 1029558 -1182908 467152 -3616326
121a220843D561499a618481l359068B485873A029765B18892a074529A878912a721541
$$ -1220843 4561499 -1618481 -4977549 2485873 1029765 218892 -1074529 1878912 -1721541
111D673934a141443j432861Q39243Q40553B952234j230295d669216A903142a913047
$$ 4673934 -1141443 -2574304 -1735061 -894508 2952234 1721939 -4669216 1903142 -1913047
101A611809c620475B007612L192712I14701R5937f53986F596115c342143J653063
$$ 1611809 -3620475 2007612 5200324 914701 1010638 -653986 6596115 -3342143 -1689080
92a689080j57089B794549b552648A986449O9732c256434A915264C64450c99712
$$ -1689080 -1846169 2794549 -2552648 1986449 2056181 -3256434 1915264 364450 -399712
82A275894Q3173J248987g704984A017524J731878A054919J604704a95156k815801
$$ 1275894 1359067 2608054 -7704984 1017524 2749402 1054919 2659623 -195156 -3010957
73c010957B971959A164726d01583A595126b33557j454236C586641f59994l61102
$$ -3010957 2971959 1164726 -401583 1595126 -233557 -1687793 3586641 -659994 -1021096
64a021096D998175j992852b458277g85729j739908D850049c514541D153162a711730
$$ -1021096 4998175 3005323 -2458277 -785729 -2525637 4850049 -3514541 4153162 -1711730
54D303398a351119B81632a457248B429164J391584a89674j692941C206451b76291
$$ 4303398 -1351119 281632 -1457248 2429164 3820748 -189674 -1882615 3206451 -276291
44a091412C382680d15091F93217b632871D108220e715882D592151a510107b6786
$$ -1091412 3382680 -415091 693217 -2632871 4108220 -5715882 4592151 -1510107 -26786
34H23600j23715J71100C86523d45221I11583Q67328c528986B877920a081254A06821
$$ 823600 699885 870985 386523 -445221 911583 1778911 -3528986 2877920 -1081254 106821
23B917035a937893d24085j793763D60740L77859a432595n6797j696396A365444
$$ 2917035 -1937893 -424085 -2217848 460740 838599 -1432595 -1489392 -3185788 1365444
13a905798L75752B124943A01518i9586A42222a39063C421469c449137q84685C40628
$$ -1905798 -1530046 2124943 101518 -99586 142222 -139063 3421469 -3449137 -4333822 340628
2B663512F14428d278125
$$ 2663512 614428 -4278125
##PAGE= F1=5640.578599651
##FIRST=     21204.543296753, 2658.27584773936, -712634
##DATA TABLE= (F2++(Y..Y)), PROFILE
2047g12634J44019G6367J196209B38191a064003l093370d7237F68383m0396O99130
$$ -712634 -568615 76367 1272576 238191 -1064003 -4157373 -47237 668383 627987 1327117
2037A327117b367419q21877C948204a573103A287626R68884B7173b769965b05632
$$ 1327117 -2367419 -3189296 3948204 -1573103 1287626 2256510 27173 -2769965 -205632
2027B942006c672528C035692p37482b109518a51496B441597m11358A01333B6929
$$ 2942006 -3672528 3035692 2298210 -2109518 -151496 2441597 2030239 101333 26929
2017a003786B950245b051114l33966B457165D30897d326611c74135E013945a395904
$$ -1003786 2950245 -2051114 -2385080 2457165 430897 -4326611 -374135 5013945 -1395904
2007G0345b402823B485519D05971P11219L55964f99739l916462a384862G444938
$$ 70345 -2402823 2485519 405971 1117190 1473154 -699739 -4616201 -1384862 7444938
1997B080008a021725l938102D445965a485725e1040B240972G13559j25583b338191
$$ 2080008 -1021725 -4959827 4445965 -1485725 -51040 2240972 713559 587976 -2338191
1987b778164j691507a021492I86229K7246F2450d030780A337030N94585q87517
$$ -2778164 -4469671 -1021492 986229 1013475 62450 -4030780 1337030 1931615 1044098
1978A044098a558484A559895L401505b950323A607964L353943g4177j555755c80749
$$ 1044098 -1558484 1559895 4961400 -2950323 1607964 4961907 -74177 -1629932 -380749
1968a181705A454029d890562G76434M11856b026536b89532H31498i52490j869206
$$ -1181705 1454029 -4890562 776434 1188290 -2026536 -289532 831498 -952490 -2821696
1959b821696G03228J690544c546240e73693I77836M027307F81136a687370D85551
$$ -2821696 703228 2393772 -3546240 -573693 977836 5005143 681136 -1687370 485551
1949b54492n62803F779549B561330j263282C95354d148144i93712C165854c922623
$$ -254492 -817295 6779549 2561330 1298048 395354 -4148144 -993712 3165854 -3922623
1939I86621J859234b331912B631918E61638J381910C51092P526158a167611B449365
$$ 986621 2845855 -2331912 2631918 561638 1943548 351092 7877250 -1167611 2449365
1929c246187a564666H656875b372340j623278e64462B557251C19624b298535A839228
$$ -3246187 -1564666 8656875 -2372340 -3995618 -564462 2557251 319624 -2298535 1839228
1919e989018F002520B008608P77753c21316j368031j834201J511564F53420C04505
$$ -5989018 6002520 2008608 2786361 -321316 -1689347 -3523548 -2011984 653420 304505
1909B617184Q31195C76939a821362F019091d913148E24003J1358L662256b702258
$$ 2617184 3448379 376939 -1821362 6019091 -4913148 524003 535361 4197617 -2702258
1899c611477C715889f736k46235q8893A008816J527927r96564O8328a887563D702270
$$ -3611477 3715889 -6736 -252971 -341864 1008816 2536743 1540179 1608507 -1887563 4702270
1888a393340b15262A781998o82210J197848p40122d551055A137265A9372e47353
$$ -1393340 -215262 1781998 1099788 2297636 1557514 -4551055 1137265 19372 -547353
1878a163595q84541A512470e626594C744438e04341G96040J652717b497j775137
$$ -1163595 -2048136 1512470 -5626594 3744438 -504341 796040 2448757 -2497 -1777634
1869a777634G456903a408414D296653A222429h72778D56598b287614j362771A897789
$$ -1777634 7456903 -1408414 4296653 1222429 -872778 456598 -2287614 -3650385 1897789
1859A745342o80392e06479j016438j565039B896492K530405B78148J001592a142730
$$ 1745342 1064950 -506479 -1522917 -3087956 2896492 5426897 278148 1279740 -1142730
1849a736326C30669M294597c414824D809443i90854o87775I13241J27269a628053
$$ -1736326 330669 4625266 -3414824 4809443 -990854 -1678629 913241 1040510 -1628053
1839B977124a979779p10925C527982b977837A859810a19827p77202C512829b409582
$$ 2977124 -1979779 -2690704 3527982 -2977837 1859810 -119827 -897029 3512829 -2409582
1829a6536p76885A051219b268561A841161f1049D59857e319956F59348K40835
$$ -16536 -793421 1051219 -2268561 1841161 -61049 459857 -5319956 659348 900183
1820I00183c827202C485610j353696L21018D19696J537472d222806B935775a297334
$$ 900183 -3827202 3485610 2131914 2452932 419696 1957168 -4222806 2935775 -1297334
1810E364159b594571A530401d95411A521309n43238b779023D417305a116742N36063
$$ 5364159 -2594571 1530401 -495411 1521309 978071 -2779023 4417305 -1116742 -580679
1801e80679C35666a635705L30108A113535K818667c96983r99858j564259R51881
$$ -580679 335666 -1635705 -1305597 1113535 3932202 -396983 -1396841 -2961100 -2009219
1792b009219B487193r58222m53509K894830q47104j160306F18901b445025h17908
$$ -2009219 2487193 1528971 1075462 3970292 3123188 1962882 618901 -2445025 -817908
1782h22084j52623B118403i33968A348041K475234h12180C204849A506918j83566
$$ -822084 -974707 2118403 -933968 1348041 3823275 -812180 3204849 1506918 1323352
1773A323352a097517d56747B279588G38722K62313b745572A474024a623759m624246
$$ 1323352 -1097517 -456747 2279588 738722 1001035 -2745572 1474024 -1623759 -6248005
1764f248005E902645c275478A365212n47439d103592C414883c967359B196390
$$ -6248005 5902645 -3275478 1365212 817773 -4103592 3414883 -3967359 2196390
1755c070610A773473m63626a695558B072184a90434A769065d20432D61919b712971
$$ -3070610 1773473 1309847 -1695558 2072184 -190434 1769065 -420432 461919 -2712971
1745b597208E77668K77985a290987K16363B683624d165065B662765b353551A590540
$$ -2597208 577668 855653 -1290987 -1074624 2683624 -4165065 2662765 -2353551 1590540
1735c833172i09207j554180e722j060293k269058F290695c47124H18024b060087
$$ -3833172 -909207 -2463387 -5722 -1066015 -3335073 6290695 -347124 818024 -2060087
1725a012835E9998b378596G684472g47482m37266A842871d13374B41453a325258
$$ -1012835 59998 -2378596 7684472 -747482 -1184748 1842871 -413374 241453 -1325258
1715a524121e70772l723553b48797B75282a884431P39775D68670a469566C55084
$$ -1524121 -570772 -4294325 -248797 275282 -1884431 -1144656 468670 -1469566 355084
1705b413152C592980A687724e901661A307306L860731g99297J85650l69973k024283
$$ -2413152 3592980 1687724 -5901661 1307306 5168037 -799297 -613647 -983620 -3007903
1696c007903M33008B849139c913866B263085a17608l262424j367547C824167b46112
$$ -3007903 -2574895 2849139 -3913866 2263085 -117608 -3380032 -4747579 3824167 -246112
1686E223955c405529r22850C851340A299227A14043g06736B486110f49556o365
$$ 5223955 -3405529 -4328379 3851340 1299227 114043 -706736 2486110 -649556 -655921
1677f55921A868675P58655c031143B174465d0513C132676F23430a393059P5042
$$ -655921 1868675 2627330 -3031143 2174465 -40513 3132676 623430 -1393059 -1318017
1668a318017G37883J236293K235912a108751B736878N11418e08700A391950P71898
$$ -1318017 737883 1974176 4210088 -1108751 2736878 3248296 -508700 1391950 2163848
1659B163848e204700K166561B629887f15317B942901j88386g56707k212917g46601
$$ 2163848 -5204700 -3038139 2629887 -615317 2942901 2754515 -756707 -2969624 -746601
1649d214035J504978A922875l49989J591834b523562j260793A286504C45501a161072
$$ -4214035 -2709057 1922875 1572886 3164720 -2523562 -3784355 1286504 345501 -1161072
1639b578964J176073B115617b156484A547289J344924i04971m11113K21336L14111
$$ -2578964 -1402891 2115617 -2156484 1547289 2892213 -904971 -1316084 -1094748 -780637
1630g80637j850855B093724F87010N39082b375836b90827n132053a890913C836952
$$ -780637 -2631492 2093724 687010 1226092 -2375836 -290827 -5422880 -1890913 3836952
1620a273038j368696D854981a661418J39907A903028j865d249404A65175a369278
$$ -1273038 -2641734 4854981 -1661418 -1521511 1903028 1901163 -4249404 165175 -1369278
1610B743471C82684h90111A742256J51661b904634k676644H45632b437121G5601
$$ 2743471 382684 -890111 1742256 1893917 -2904634 -5581278 845632 -2437121 75601
1600C184895B65628R3043a16614q50581E076214b819356B960108b00255p543758
$$ 3184895 265628 358671 -116614 -967195 5076214 -2819356 2960108 -200255 -7744013
1591g744013C053907a731220F92704a898244D958812a891806d21545j831757A015814
$$ -7744013 3053907 -1731220 692704 -1898244 4958812 -1891806 -421545 -2253302 1015814
1581A714378N09866c253273b23048n99586p94749B658172f06321n63323B3655
$$ 1714378 2224244 -3253273 -223048 -822634 -1617383 2658172 -606321 -1169644 23655
1571G3685c161819g23824A914672Q7073l43890c609654A71519J130766J201180
$$ 73685 -3161819 -723824 1914672 2001745 1657855 -3609654 171519 1302285 2503465
1562B503465q26855J166816m84901B3888O75502d79900P318k850711B09224L05465
$$ 2503465 1676610 2843426 2358525 23888 699390 -479900 -472582 -3323293 209224 514689
1552E14689b91618B263015a912834k809950a105651A392098a237357j037881G827705
$$ 514689 -291618 2263015 -1912834 -4722784 -1105651 1392098 -1237357 -2275238 7827705
1542c340730e74021j845643Q32575B114175a73875B781046c62135k457941J274323
$$ -3340730 -574021 -2419664 -1587089 2114175 -173875 2781046 -362135 -2820076 -1545753
1533a545753A171324K213073c649632a390745C054331j69593a328082D393893
$$ -1545753 1171324 3384397 -3649632 -1390745 3054331 2884738 -1328082 4393893
1524e024434h98974j360098C304395a72820l005390A869801d725835I916835g789535
$$ -5024434 -898974 -2259072 3304395 -172820 -3178210 1869801 -4725835 9916835 -7789535
1514E890724A258505j86263K736763a62098l728679I79464L5816M30323J239706
$$ 5890724 1258505 1072242 3809005 -162098 -3890777 979464 1015280 1445603 2685309
1505B685309K274071I02600a936528G912f3218A069043a851719C457265a627661
$$ 2685309 4959380 902600 -1936528 7912 -63218 1069043 -1851719 3457265 -1627661
1495c209136B995604E94916A5598b089726c75100A347475d784061c39690k52090
$$ -3209136 2995604 594916 15598 -2089726 -375100 1347475 -4784061 -339690 -591780
1486e91780B396830K544569k438571c028967b61852j126255l68270h70196A653058
$$ -591780 2396830 4941399 2502828 -3028967 -261852 -1388107 -1756377 -870196 1653058
1476C728292c978891H65272O78939f05168A079090J109686b919736B177661a188992
$$ 3728292 -3978891 865272 1544211 -605168 1079090 2188776 -2919736 2177661 -1188992
1466C924246N99217G18339c394838d45896j164604H80000K485583B15723h00197
$$ 3924246 4523463 718339 -3394838 -445896 -1610500 880000 3365583 215723 -800197
1456b10793A700180p32390b280395C143225A389748g4939A698158B29707g034692
$$ -210793 1700180 967790 -2280395 3143225 1389748 -74939 1698158 229707 -7034692
1446H806813A503091f134435a878038B465612C03527N43958c006006a220871B26992
$$ 8806813 1503091 -6134435 -1878038 2465612 303527 847485 -3006006 -1220871 226992
1436A796532c675299J246039j48786B59365K100173a220113k011076E92685K671795
$$ 1796532 -3675299 -2429260 -2578046 259365 2359538 -1220113 -3231189 592685 3264480
1427C264480o39864c34282F04246b028024H7168c65704k328020B325617J676254
$$ 3264480 2624616 -334282 604246 -2028024 87168 -365704 -2693724 2325617 4001871
1418D001871b284880A38667J230130K61177P5425a118616A433940a567291C10187
$$ 4001871 -2284880 138667 1368797 1629974 1705399 -1118616 1433940 -1567291 310187
1408B765543o18096a820407A289750b494709C166266K543768f54397q15424A945863
$$ 2765543 2147447 -1820407 1289750 -2494709 3166266 5710034 -654397 -1469821 1945863
1398f461543a142085d87756B470659C9227R091098a545697j395698B389833a284566
$$ -6461543 -1142085 -487756 2470659 39227 9130325 -1545697 -2941395 2389833 -1284566
1388C902556b727634q26670i98018D847675d037752a867899i8445B069255b127515
$$ 3902556 -2727634 -3554304 -998018 4847675 -4037752 -1867899 -98445 2069255 -2127515
1378i04286I93372K538435a438910A093172J515117L31603a291516E739019a157989
$$ -904286 993372 3531807 -1438910 1093172 2608289 2939892 -1291516 5739019 -1157989
1368a768589L11009F00003K781728d446865E394335a037385A077927a137375C340749
$$ -1768589 -1457580 600003 3381731 -4446865 5394335 -1037385 1077927 -1137375 3340749
1358b118323B680414g324543L498817A256404A71424e41250E876710g49348j935034
$$ -2118323 2680414 -7324543 -3825726 1256404 171424 -541250 5876710 -749348 -2684382
1349b684382E244898i1340l11979C932436d562473d43912E62177b815358B882649
$$ -2684382 5244898 -91340 -403319 3932436 -4562473 -443912 562177 -2815358 2882649
1339B18644h83175l45711N54519I885203B88577a472101A253422b077005A87035
$$ 218644 -883175 -1228886 -674367 9885203 288577 -1472101 1253422 -2077005 187035
1329A036855J147608a952103I64689L738345d716243F275546Q72164a62069k580815
$$ 1036855 2184463 -1952103 964689 4703034 -4716243 6275546 7147710 -162069 -2742884
1320b742884C11608K59383c397884B457107a201290D11770J51282J371876a900284
$$ -2742884 311608 570991 -3397884 2457107 -1201290 411770 563052 1934928 -1900284
1310d56271A557631g14869j420896h84816k077923f65780A837998K495474A392468
$$ -456271 1557631 -714869 -2135765 -884816 -2962739 -665780 1837998 4333472 1392468
1300F66199N55551k51855d392872J228325B844352p33486e354866J571728i70509
$$ 666199 1221750 969895 -4392872 -3164547 2844352 2110866 -5354866 -3783138 -970509
1290b683368C695261j199735e456346a337239B180748a78809D67206h75236D202284
$$ -2683368 3695261 2495526 -5456346 -1337239 2180748 -178809 467206 -875236 4202284
1280c697806A545686M67861L778267B168961b784594A566195a986030A434185
$$ -3697806 1545686 2013547 5791814 2168961 -2784594 1566195 -1986030 1434185
1271B02609a035132K49045j477791e65448C817620c171071d21899A808815B88711
$$ 202609 -1035132 -786087 -2263878 -565448 3817620 -3171071 -421899 1808815 288711
1261b661116C81922K530014A1378K279105A060640J38182B89320K079108b570916
$$ -2661116 381922 2911936 11378 2290483 1060640 1198822 289320 2368428 -2570916
1251B982581h13708J33640G82280J54732a210020B716704b794400a310886c47494
$$ 2982581 -813708 -680068 782280 937012 -1210020 2716704 -2794400 -1310886 -347494
1241h47071l50266M84730o50237Q1245A424057e522800F857426d763748G026745
$$ -847071 -1197337 -712607 -1362844 -1281599 1424057 -5522800 6857426 -4763748 7026745
1231d799146A820592A31410c26494j323347A32195a328497A287228J117396c182490
$$ -4799146 1820592 131410 -326494 -1649841 132195 -1328497 1287228 2404624 -3182490
1221C743733A205229a627298G672882c519828C63359a059734j466407j104434
$$ 3743733 1205229 -1627298 7672882 -3519828 363359 -1059734 -2526141 -3630575
1213c630575f2095B32097g80903C340009a63507C221854f87616p36992j609648
$$ -3630575 -62095 232097 -780903 3340009 -163507 3221854 -687616 -1424608 -3034256
1204c034256D6009e071755A517730b923993l006046A036726D65829A93639L187557
$$ -3034256 46009 -5071755 1517730 -2923993 -5930039 1036726 465829 193639 3381196
1195C381196c201317B056857o15989K757317G46639a592453C054253G62950a93498
$$ 3381196 -3201317 2056857 1440868 4198185 746639 -1592453 3054253 762950 -193498
1185c189572B770741a49625C392869b309969A629208c50055j015215f54768D2939
$$ -3189572 2770741 -149625 3392869 -2309969 1629208 -350055 -1365270 -654768 42939
1175a07088B787476n94109a112706A499129j75811G3109d215207C99757M481517
$$ -107088 2787476 2193367 -1112706 1499129 1323318 73109 -4215207 399757 4881274
1166D881274F6311c418090G33851K202894f763384a329413c46446q24643B377795
$$ 4881274 66311 -3418090 733851 2936745 -6763384 -1329413 -346446 -1171089 2377795
1156E86578J36191e146260B998495a465646E34889N9454d153335D346424d02565
$$ 586578 722769 -5146260 2998495 -1465646 534889 594343 -4153335 4346424 -402565
1146D462266a216477B896431a663335c63636E0334J319600L922339a511413C010524
$$ 4462266 -1216477 2896431 -1663335 -363636 50334 1369934 5292273 -1511413 3010524
1136f53521k54076E64122b224292R88155A829553a413289j359477C779676d291084
$$ -653521 -907597 564122 -2224292 -1236137 1829553 -1413289 -2772766 3779676 -4291084
1126A963972G44675K679243e186870C027178b08141j19226A40367b769037p57655
$$ 1963972 744675 3423918 -5186870 3027178 -208141 -327367 140367 -2769037 -3526692
1117c526692A562635i61312F64479a23115G44950b23444A397356P47567e072389
$$ -3526692 1562635 -961312 664479 -123115 744950 -223444 1397356 2144923 -5072389
1107A199550A33797b37432D918687a441143E155487a449220A875473b113250i80814
$$ 1199550 133797 -237432 4918687 -1441143 5155487 -1449220 1875473 -2113250 -980814
1097C051913b702225g595B751733H08518j37556L68971m00201J663827f553498
$$ 3051913 -2702225 -7595 2751733 808518 670962 1039933 639732 2303559 -6553498
1087D99456e009774A504944l74713Q61064b778600A777880D65758f55743l772940
$$ 499456 -5009774 1504944 1130231 1991295 -2778600 1777880 465758 -655743 -4428683
1078d428683P76417C050430H75986b109066D430355A107839a138200A664731g01710
$$ -4428683 -3652266 3050430 875986 -2109066 4430355 1107839 -1138200 1664731 -701710
1068c760546B630465K54075b126856A907953e554395i43771A259864b547062G65171
$$ -3760546 2630465 2884540 -2126856 1907953 -5554395 -943771 1259864 -2547062 765171
1058A935469a900788K46439f66316A275209a355461F535336c418147d95658a94301
$$ 1935469 -1900788 -1654349 -666316 1275209 -1355461 6535336 -3418147 -495658 -194301
1048B351632e89597J88340j592619A307284a271994A095233m53949i81838G071986
$$ 2351632 -589597 -401257 -1993876 1307284 -1271994 1095233 641284 -981838 7071986
1038c868343A901376A07928b75445B623974c214358D934063f01133m570424A23164
$$ -3868343 1901376 107928 -275445 2623974 -3214358 4934063 -601133 -5171557 123164
1028A04703b248827A112959O09130p47456b496751A455407e789610G08602a776993
$$ 104703 -2248827 1112959 1722089 974633 -2496751 1455407 -5789610 708602 -1776993
1018B98857a395507r55228J113098A395553f69870j701674B650642a059104k508868
$$ 298857 -1395507 -2350735 -1237637 1395553 -669870 -2371544 2650642 -1059104 -3567972
1009c567972c89321j264010D838721e50804j260343o30118b22605B061190K013580
$$ -3567972 -389321 -1653331 4838721 -550804 -1811147 -2441265 -222605 2061190 4074770
1000D074770b514830f03955B1378b401679A305066K224781d426562D271851g03715
$$ 4074770 -2514830 -603955 21378 -2401679 1305066 3529847 -4426562 4271851 -703715
990F86521R67034b312045A443961J64592a392444C705919d144597J614682I96352
$$ 686521 1653555 -2312045 1443961 1608553 -1392444 3705919 -4144597 -2529915 996352
980B592152O03372e603377F303623d208735B102966b965558C797040A373581g38183
$$ 2592152 3195524 -5603377 6303623 -4208735 2102966 -2965558 3797040 1373581 -738183
970H20839K365975a91380o671348A003565J316496c32282j456C298131c827962
$$ 820839 3186814 -191380 -6862728 1003565 2320061 -332282 -333738 3298131 -3827962
960G97110f34516j19692D09381L741649I2115K401604C82500b277935A769921
$$ 797110 -634516 -754208 409381 4151030 92115 2493719 382500 -2277935 1769921
950B997512l0236b95069k733786P77046D611273A608170L37114b894999l3372
$$ 2997512 2967276 -295069 -3028855 -2251809 4611273 1608170 1945284 -2894999 -2928371
941b928371A518115d81018k095755C274573a47950C200884a925429l008281A564783
$$ -2928371 1518115 -481018 -2576773 3274573 -147950 3200884 -1925429 -4933710 1564783
931g66326c65488r366I16773O87204O96128d532179B953560e83088A669015n87722
$$ -766326 -365488 -374854 916773 1603977 2300105 -4532179 2953560 -583088 1669015 1081293
921A081293c158269B250913c112883n42572e9552j950459O98754A257669a39969
$$ 1081293 -3158269 2250913 -3112883 -3655455 -59552 -2010011 -1311257 1257669 -139969
911a843091B345580n59780q0775d505964D143372j571641b862075a429807C810289
$$ -1843091 2345580 1785800 1705025 -4505964 4143372 2571731 -2862075 -1429807 3810289
901a106664I80838i97667C376482B73146c002070B462401p49936c764622a192323
$$ -1106664 980838 -997667 3376482 273146 -3002070 2462401 1712465 -3764622 -1192323
891A415246C11487b754964G481477d083209A668876g498682B921474b401075F09100
$$ 1415246 311487 -2754964 7481477 -4083209 1668876 -7498682 2921474 -2401075 609100
881a161918B159783J824428e244990B01243f600621D118387C59664r6280b287638
$$ -1161918 2159783 3984211 -5244990 201243 -6600621 4118387 359664 263384 -2287638
871a970785n83578a257773j79328j14036j607048a416899c60355A639276e43593
$$ -1970785 -2554363 -1257773 -1437101 -1551137 -3158185 -1416899 -360355 1639276 -543593
861i86538n21811A056525L850922B284688J1775d931538E534566i014130B830052
$$ -986538 -1508349 1056525 4907447 2284688 2296463 -4931538 5534566 -9014130 2830052
851B744291a599308L91546B774074a725264O40336C625302e204211B228288d456837
$$ 2744291 -1599308 -1207762 2774074 -1725264 -1084928 3625302 -5204211 2228288 -4456837
841i47845d36856A877769d171277B79462a097081a84927p06875m190280b024160
$$ -947845 -436856 1877769 -4171277 279462 -1097081 -184927 -891802 -5082082 -2024160
831b241711C389918a559706D40732c302578C254629e52358k17028j339115B034495
$$ -2241711 3389918 -1559706 440732 -3302578 3254629 -552358 -769386 -2108501 2034495
821B074354b167949P99807A415392a374117C224303e993152O87070d88061k19940
$$ 2074354 -2167949 -1368142 1415392 -1374117 3224303 -5993152 -5306082 -488061 -708001
812g08001J98534A469258M45231d06955j97794A057508d804677A905829a41802
$$ -708001 -509467 1469258 1914489 -406955 -604749 1057508 -4804677 1905829 -141802
802b992074k808115C5389J507436K885840K53706b840145F80921K572251e132703
$$ -2992074 -5800189 35389 1542825 4428665 4682371 -2840145 680921 3253172 -5132703
792F568217G22276f327817E723642e310416A431822J348135f19481o26050E381756
$$ 6568217 722276 -6327817 5723642 -5310416 1431822 2779957 -619481 -1245531 5381756
782f797048A438806K021682a621791J76738j553410C43782J520908a318079b1753
$$ -6797048 1438806 3460488 -1621791 -1445053 -2998463 343782 1864690 -1318079 -21753
772A204043a362209n01881C079459I51824c609738f8630F977536a414118A974504
$$ 1204043 -1362209 -1864090 3079459 951824 -3609738 -68630 6977536 -1414118 1974504
762E51009c011531c08895C792992I69548e727248A312923O4196c170761A152629
$$ 551009 -3011531 -308895 3792992 969548 -5727248 1312923 1377119 -3170761 1152629
752e94424j254797B593846c981369A866657p08670k51752i44958o49609q23595
$$ -594424 -1849221 2593846 -3981369 1866657 1157987 906235 -944958 -1594567 -2418162
743b418162a117712j620589e52500C069780a646408j215822B883544n22283A62689
$$ -2418162 -1117712 -2738301 -552500 3069780 -1646408 -2862230 2883544 2361261 162689
733B33633c4225F14022P73331h304509b374914A196762K433264A325996j7863
$$ 233633 -34225 614022 1387353 -8304509 -2374914 1196762 3630026 1325996 1308133
724A308133k10514L0358b299172A411901c265441f70957A182183L081943b502381
$$ 1308133 1097619 1127977 -2299172 1411901 -3265441 -670957 1182183 4264126 -2502381
714g10277q5105C51537b423237i72347m59330e94006B545435A147216b024327
$$ -710277 -795382 351537 -2423237 -972347 -1431677 -594006 2545435 1147216 -2024327
704A366221h76150B320858J07812d416584j8122597e494015k711237m893908B4205316
$$ 1366221 -876150 2320858 2428670 -4416584 -22539181 -5494015 -8205252 -13099160 24205316
694B7163003A0097614j489035M135660E75934i401662k5539341J4704507m393822
$$ 27163003 10097614 8608579 12744239 575934 -9401662 -34941003 -20236496 -24630318
686b4630318j3987510D838790K9963737A4728390Q932066P62077i754555J463266
$$ -24630318 -38617828 4838790 34802527 14728390 23660456 24422533 -9754555 -8291289
678h291289C6762a685740l058021a335997a39532I52040f60529C611772a612443
$$ -8291289 36762 -1685740 -4743761 -1335997 -139532 952040 -660529 3611772 -1612443
668g78637A67956L545339c131095j608463D988626i44205B342141M81291J8942719
$$ -778637 167956 3713295 -3131095 -4739558 4988626 -944205 2342141 2823432 21766151
659B1766151j0084436a2529577L701823k3508155c837886p245359j9908431H920006
$$ 21766151 11681715 -12529577 -8827754 -32335909 -3837886 -11083245 -30991676 8920006
650B521892K7218227k087848A1740202a845273l76034j1619393c744609n3781
$$ 2521892 29740119 27652271 11740202 -1845273 -2221307 -13840700 -3744609 -3798390
642c798390j0841571f646633M47569G037902J0631983A586646b073860A180767
$$ -3798390 -14639961 -6646633 -6199064 7037902 17669885 1586646 -2073860 1180767
633A34626M29024e464257b515730a121752B843619A068005C54400L312628H53391
$$ 134626 563650 -5464257 -2515730 -1121752 2843619 1068005 354400 3667028 853391
623B493082d754185C118929e246144d11111C452318A380243o25563a277782A942092
$$ 2493082 -4754185 3118929 -5246144 -411111 3452318 1380243 754680 -1277782 1942092
613b657753A552531K065761A796605B27086P975498O665029J7902592L1274796
$$ -2657753 1552531 3618292 1796605 227086 8202584 14867613 32770205 64045001
605F4045001A0187732c27641234a23161599C1023139J36996592A8056775m350015
$$ 64045001 10187732 -327641234 -123161599 31023139 168019731 18056775 13706760
598A3706760J4152E424012r17374k04131L13013K87955A885600K129179A275088
$$ 13706760 13720912 5424012 4506638 4302507 4615520 4903475 1885600 4014779 1275088
588I0615K055858a071562A201332J536777o27283a153095C240961E51003L829952
$$ 90615 2146473 -1071562 1201332 2738109 2110826 -1153095 3240961 551003 4380955
579D380955h80646d10496C919814J14145A725108g564716C4084e337647I42681
$$ 4380955 -880646 -410496 3919814 4033959 1725108 -7564716 34084 -5337647 942681
569c892530d59635j364943q21619E75175f389012a082544E207131a471956M76036
$$ -3892530 -459635 -1824578 -2646197 575175 -6389012 -1082544 5207131 -1471956 -995920
560i95920o80681C19956M441600g86571k1441C152462e371399F35504a030713
$$ -995920 -1676601 319956 4761556 -786571 -808012 3152462 -5371399 635504 -1030713
550B222282K301658A528841g66712A29061a250802A791635a048546H09423a106763
$$ 2222282 4523940 1528841 -766712 129061 -1250802 1791635 -1048546 809423 -1106763
540C98578b196109C464104c843106a172107C450829f282096a951112D3921b131960
$$ 398578 -2196109 3464104 -3843106 -1172107 3450829 -6282096 -1951112 43921 -2131960
530C066489g9108m66439j186568l61776B98939b542276H955476B00508J126493
$$ 3066489 -79108 -545547 -1732115 -2093891 298939 -2542276 8955476 200508 1327001
521A327001a064804A120628b749658B178382c385574E990612b364276D53431J852038
$$ 1327001 -1064804 1120628 -2749658 2178382 -3385574 5990612 -2364276 453431 2305469
512B305469B24588b640121J51321L35090g30660C876699g81203E003800g42215
$$ 2305469 224588 -2640121 -2488800 -2153710 -730660 3876699 -781203 5003800 -742215
502B322431n87464b506766H64644J551368a503061j071244a66301A594263a317005
$$ 2322431 1734967 -2506766 864644 2416012 -1503061 -2574305 -166301 1594263 -1317005
492f40973B042562K994182A724379b139797P22118N71929E5164f290744B498117
$$ -640973 2042562 5036744 1724379 -2139797 -1417679 -845750 55164 -6290744 2498117
482h42213o23027l149325D6756K659435e194892B905942J90794H20407N047752
$$ -842213 -1465240 -4614565 46756 2706191 -5194892 2905942 3096736 820407 5868159
473E868159A252559a374144n38492B780749a420534C507151a162047F53430h34078
$$ 5868159 1252559 -1374144 -1912636 2780749 -1420534 3507151 -1162047 653430 -834078
463a219958c90777J32050B943747h916166F096614C55193a409083A931199L48522
$$ -1219958 -390777 -258727 2943747 -8916166 6096614 355193 -1409083 1931199 2279721
454B279721a611791r05002C631427n24344L05889f635566B742515F08252b583700
$$ 2279721 -1611791 -2516793 3631427 3107083 3412972 -6635566 2742515 608252 -2583700
444f91448C333840A339781M138723H12084c036466a184203A21291b515266B153011
$$ -691448 3333840 1339781 5478504 812084 -3036466 -1184203 121291 -2515266 2153011
434H91998K055781b193953P96380d4906D642351e498027b560912K02474C526804
$$ 891998 2947779 -2193953 -1397573 -44906 4642351 -5498027 -2560912 -2358438 3526804
424g19028F73642L547804b131193j099843B260302e395578a23914k590499C296709
$$ -719028 673642 4221446 -2131193 -3231036 2260302 -5395578 -123914 -2714413 3296709
414C439819G09785a72802p34123n96350A009859c858299A054400c15683k340539
$$ 3439819 709785 -172802 -906925 -1503275 1009859 -3858299 1054400 -315683 -2656222
405b656222I85203b017680B23624f003405B092150K03652a806930H28039b178398
$$ -2656222 985203 -2017680 223624 -6003405 2092150 2295802 -1806930 828039 -2178398
395b590039e86028F56053J360298c157024J417167H32160M23787a914058F65331
$$ -2590039 -586028 656053 2016351 -3157024 -1739857 832160 1255947 -1914058 665331
385B652168B7929J11711J150589b033871A247315K68161H9664J274374d749101
$$ 2652168 27929 139640 1290229 -2033871 1247315 1515476 89664 1364038 -4749101
375c205927a070569M22958k632735h31408L3800D770282g741450E850713b976232
$$ -3205927 -1070569 -647611 -3280346 -831408 -797608 4770282 -7741450 5850713 -2976232
365h20334j87491A704719h51469D4118L87477d552886C027856b257082D679655
$$ -820334 -1007825 1704719 -851469 44118 431595 -4552886 3027856 -2257082 4679655
355c213863f15163C54960b724699O1801b16294C291427A258153C90046a038670
$$ -3213863 -615163 354960 -2724699 -2662898 -216294 3291427 1258153 390046 -1038670
345c183523A382b67089A126701c030945A909715J616219a019977M5929G981504
$$ -3183523 1382 -267089 1126701 -3030945 1909715 3525934 -1019977 -974048 7981504
335d046832l39032a521918M6641C127499c06817n10333A202720J304469a434019
$$ -4046832 -4385864 -1521918 -1475277 3127499 -306817 -817150 1202720 2507189 -1434019
325A184191C12977b392752N58141f98140B6632c697524E52673J246193g59908
$$ 1184191 312977 -2392752 -1834611 -698140 26632 -3697524 552673 1798866 -759908
315A493196e38312j326590H23755b313346a3190B639510a444079A35249a575956
$$ 1493196 -538312 -1864902 823755 -2313346 -13190 2639510 -1444079 135249 -1575956
305I66094c891430C701688A2937b911657D101031A791045d564590f97598m61311
$$ 966094 -3891430 3701688 12937 -2911657 4101031 1791045 -4564590 -697598 -1158909
296a158909n68158C420923L109048i43535A612103A53620J099963g28149C731871
$$ -1158909 -1727067 3420923 6529971 -943535 1612103 153620 1253583 -728149 3731871
286a631377E647233g780255G38760N80393e381430F16325J128820K663752a463984
$$ -1631377 5647233 -7780255 738760 1319153 -5381430 616325 1745145 4408897 -1463984
276a557830l216931A666944a439708B234888h95051J68228A427020B30117R97568
$$ -1557830 -4774761 1666944 -1439708 2234888 -895051 -726823 1427020 230117 1227685
267A227685p4843K599216d236074C09655a747691D15556A84868N49096k23669
$$ 1227685 1152842 3752058 -4236074 309655 -1747691 415556 184868 733964 510295
258E10295a642287C53399e87907C13907K75320j18771d68349j730269o46153D031964
$$ 510295 -1642287 353399 -587907 313907 589227 470456 -468349 -2198618 -2844771 4031964
247b597293A005682b553604j612104a569892K94599D59010a48145m06453B984615
$$ -2597293 1005682 -2553604 -4165708 -1569892 -1275293 459010 -148145 -554598 2984615
237D067145b612284C065505c035653B004365b212081B236520G23664g30927k866008
$$ 4067145 -2612284 3065505 -3035653 2004365 -2212081 2236520 723664 -730927 -3596935
228c596935J219883a30207l623042C904145c472470f68377m55769D78831K72904
$$ -3596935 -2377052 -130207 -3753249 3904145 -3472470 -668377 -1124146 478831 751735
219G51735e23400k922623B550451d515232e23216G6893a529350n5523A227752
$$ 751735 -523400 -3446023 2550451 -4515232 -523216 76893 -1529350 -1584873 1227752
209C80929M193162a288463d46175j080919R1058C500125A149874O75593b964486
$$ 380929 4574091 -1288463 -446175 -1527094 -1436036 3500125 1149874 1825467 -2964486
199A460683B58563b396860A829041b749690a272090o5501N156A705166g98950
$$ 1460683 258563 -2396860 1829041 -2749690 -1272090 -1337591 -1332435 1705166 -798950
189b878755n2510A318248g43917k779176b62928B667451Q39794c437536b33195
$$ -2878755 -2931265 1318248 -743917 -3523093 -262928 2667451 3507245 -3437536 -233195
179B383923L140343d018372a084034c22135j378835A148119j40055i147936m5105365
$$ 2383923 5524266 -4018372 -1084034 -322135 -1700970 1148119 1008064 -9147936 -54253301
170e4253301j15374136D0390936N39477J31278000F0165891J01784008b9512679
$$ -54253301 -169627437 40390936 40930413 172208413 60165891 161949899 -29512679
162c2163666j28135539c6483459F637077l094775c488292a346010D433522c913085
$$ -32163666 -160299205 -36483459 6637077 3542302 -3488292 -1346010 4433522 -3913085
153I24170A08594O70056B39765e77827p04392B989216A44961N08688D9156b469221
$$ 924170 108594 778650 239765 -577827 -1282219 2989216 144961 653649 49156 -2469221
142H28405N02304c972728A377480K736545A68183f76075m3120j2201k76625i9952
$$ 828405 1330709 -3972728 1377480 4114025 168183 -676075 -719195 -731396 -1008021 -99952
131C830245a071699E62894L45007b287006A150841K15495a856541F81070c365454
$$ 3830245 -1071699 562894 907901 -2287006 1150841 1366336 -1856541 681070 -3365454
121e81459D229536e22456m622012C100074C99261A93277a071439B688416b535943
$$ -581459 4229536 -522456 -5144468 3100074 399261 193277 -1071439 2688416 -2535943
111D769457a286105j120198Q91686j29290B978360n62495d632548A451373a548571
$$ 4769457 -1286105 -2406303 -1514617 -1643907 2978360 2415865 -4632548 1451373 -1548571
101I30020b956548A968366K683517G89263J99777B49471O547652c283188h58335
$$ 930020 -2956548 1968366 4651883 789263 989040 249471 6797123 -3283188 -858335
91b370090B657827b947480B259952N80350c409342H83256J52387a69633E99236
$$ -2370090 2657827 -2947480 2259952 2840302 -3409342 883256 1035643 -169633 599236
81E55688K335903g541051A419932R23377G41077K004579C13978d376011D072040
$$ 555688 2891591 -7541051 1419932 2343309 741077 2745656 313978 -4376011 4072040
71A081775b55080A809702c24267k149219C448769d46584m77690D062516j555309
$$ 1081775 -255080 1809702 -324267 -2473486 3448769 -446584 -924274 4062516 2507207
62B507207b792767A58477b489037E766368d151418C818118a446259D519671a541788
$$ 2507207 -2792767 158477 -2489037 5766368 -4151418 3818118 -1446259 4519671 -1541788
52I5090a091098B238841R73762E97745a233327C350336B62055a747153C306322
$$ 95090 -1091098 2238841 3212603 597745 -1233327 3350336 262055 -1747153 3306322
42b2109A62735b362830C360415e387192D910563b647360c65754G64784j86171
$$ -22109 162735 -2362830 3360415 -5387192 4910563 -2647360 -365754 764784 578613
33E78613L77889C57648c19342A98407J689891c314463B380865a355938G70212
$$ 578613 956502 357648 -319342 198407 1888298 -3314463 2380865 -1355938 770212
23B622410b152114J052578j195814C88461J37017i20677m47866j517592B053072
$$ 2622410 -2152114 -1099536 -2295350 388461 525478 -920677 -1368543 -2886135 2053072
13b046091M17151A884057D35076c86390F00309j45658K444511c674589k42369
$$ -2046091 -1628940 1884057 435076 -386390 600309 454651 2899162 -3674589 -3916958
4c916958D49972K614453G68500d707804
$$ -3916958 449972 3064425 768500 -4707804
##PAGE= F1=5618.780329767
##FIRST=     21204.543296753, 2658.27584773936, -658033
##DATA TABLE= (F2++(Y..Y)), PROFILE
2047f58033M33D33771O62161D56711a052417l397056A65156J031118J12777k70395
$$ -658033 -657600 433771 1095932 456711 -1052417 -4449473 165156 1196274 1309051 1038656
2037A038656b172678j048188D030863a461981A528203J624979a62342k444531
$$ 1038656 -2172678 -3220866 4030863 -1461981 1528203 3153182 -162342 -2606873
2029b606873d62143B802799d042172B810625q11916a711782d33154B726077j094445
$$ -2606873 -462143 2802799 -4042172 2810625 1998709 -1711782 -433154 2726077 1631632
2020A631632F28552b66334o1184B235353a595399r18819B426486H73069d037728
$$ 1631632 628552 -266334 -327518 2235353 -1595399 -2514218 2426486 873069 -4037728
2010d21530D923139a505221b27904k554856C853258e58723I07914N64968f97166
$$ -421530 4923139 -1505221 -227904 -2782760 3853258 -558723 907914 1472882 -697166
2000d196027a414520G180470B010067a422213l646540D417970a150846N51335
$$ -4196027 -1414520 7180470 2010067 -1422213 -5068753 4417970 -1150846 -599511
1992e99511B830752I01325C62446a901330q57526k452772i91675A037505M57637
$$ -599511 2830752 901325 362446 -1901330 -2758856 -5211628 -991675 1037505 1495142
1983A495142D02136c978337A051132Q41848n45135b299932A899681M014017c292408
$$ 1495142 402136 -3978337 1051132 1892980 1347845 -2299932 1899681 5913698 -3292408
1973A735437L056287B3547a238269e26116k24765A087642d988442F12906J295199
$$ 1735437 4791724 23547 -1238269 -526116 -750881 1087642 -4988442 612906 1908105
1964A908105b140808c4573G48256a44683l125899D66608O53422c486058h66738
$$ 1908105 -2140808 -34573 748256 -144683 -3270582 466608 1120030 -3486058 -866738
1954I99771N213833D37461a509793c95618C98584f32416E656019k245686F31969
$$ 999771 6213604 437461 -1509793 -395618 398584 -632416 5656019 3410333 631969
1944E4355d909955b18023C208049c917971I80881J278763b059698A947680e34964
$$ 54355 -4909955 -218023 3208049 -3917971 980881 2259644 -2059698 1947680 -534964
1934C495882B02748Q190342f74950C146681c512027R20961I478258b340063j628747
$$ 3495882 202748 8393090 -674950 3146681 -3512027 -2591066 9478258 -2340063 -3968810
1925c968810a743418A962068q75648b829784A723385e603966F220981A664106
$$ -3968810 -1743418 1962068 1086420 -2829784 1723385 -5603966 6220981 1664106
1916C171434E2067d28147l094743a711641H66105E5483K465149N20725C20164
$$ 3171434 52067 -428147 -3522890 -1711641 866105 55483 2520632 3041357 320164
1906a390967F835211d383002G87662c61032D009162b712425o30281C269364a27270
$$ -1390967 6835211 -4383002 787662 -361032 4009162 -2712425 -3342706 3269364 -127270
1896c5743q1129H53144K241705j405419n64979b109624D297357e75219b21424
$$ -35743 -116872 853144 3094849 1689430 1124451 -2109624 4297357 -575219 -221424
1886A392372d4895C556543A496288d324059F88648m3329a130259l64913N78086
$$ 1392372 -44895 3556543 1496288 -4324059 688648 645319 -1130259 -1495172 -917086
1877i17086F65828e062942C753305c41153H05853J838240a84307k014814F971294
$$ -917086 665828 -5062942 3753305 -341153 805853 2644093 -184307 -2199121 6971294
1867i72987C799315A269299h07214b65050j436468j542230A706830N34483I17869
$$ -972987 3799315 1269299 -807214 -265050 -1701518 -3243748 1706830 2241313 917869
1857f51170j187577j002420B555834K635234I66940j18190f03019j284289A025173
$$ -651170 -1838747 -2841167 2555834 5191068 966940 848750 -603019 -1887308 1025173
1847D019419c496485D547906a057253a10528n9289G68707a339181B780722a291683
$$ 4019419 -3496485 4547906 -1057253 -110528 -169817 768707 -1339181 2780722 -1291683
1837b321270C046054b256791A249519h4999p19074D120947b505797C50137i33515
$$ -2321270 3046054 -2256791 1249519 -84999 -804073 4120947 -2505797 350137 -933515
1827A467521a849922B419820g6578C08467d861416H43481C56370c729981C505024
$$ 1467521 -1849922 2419820 -76578 308467 -4861416 843481 356370 -3729981 3505024
1817B997110n52356d37425A553115d030897C157927b224944E156984b700065B084144
$$ 2997110 2444754 -437425 1553115 -4030897 3157927 -2224944 5156984 -2700065 2084144
1807c3060A683419F85733b250008D232470i94544J85415h2073j672732f37198
$$ -33060 1683419 685733 -2250008 4232470 -994544 -809129 -82073 -1754805 -637198
1797A031612L242285g08808j098789o24637P90000A786977p76264O33490J614716
$$ 1031612 4273897 -708808 -1807597 -2432234 -1642234 1786977 1010713 1644203 3258919
1788C258919N95443A381958F0483a794995N44825N47377l88822A046971i3018
$$ 3258919 3854362 1381958 60483 -1794995 -1250170 -702793 -1091615 1046971 -93018
1778A132120L183085c29052C051994B39293J535514a606584c02082C031008G23956
$$ 1132120 4315205 -329052 3051994 239293 1774807 -1606584 -302082 3031008 723956
1768H86057b397965A171995b072159n110254F787909d023015I05142j01174c746969
$$ 886057 -2397965 1171995 -2072159 -7182413 6787909 -4023015 905142 803968 -3746969
1758C142536b819353A913725c573998A746820l04175a833533B164145B5185K008918
$$ 3142536 -2819353 1913725 -3573998 1746820 1442645 -1833533 2164145 25185 2034103
1749B034103b64401E57634d297937J270207D49326J521493a410930c97174B704426
$$ 2034103 -264401 557634 -4297937 -3027730 449326 1970819 -1410930 -397174 2704426
1739c651322B334599a635863B183627d166206g60262r40263C71568a780294j711149
$$ -3651322 2334599 -1635863 2183627 -4166206 -760262 -1700525 371568 -1780294 -3491443
1730c491443F551763F98467d027k098769f34978A53432b487618G340209h76905
$$ -3491443 6551763 698467 -4027 -2102796 -634978 153432 -2487618 7340209 -876905
1720g86811A890131c57723F1366a249744o8832M95543m195547c98318C05612b183403
$$ -786811 1890131 -357723 61366 -1249744 -1318576 -823033 -5018580 -398318 305612 -2183403
1709a722756F53846h62572c97403k381340D224514A569345e966640A315208M210329
$$ -1722756 653846 -862572 -397403 -2778743 4224514 1569345 -5966640 1315208 5525537
1700E525537a024835N11145m16117j822301N60964B044273d289611B736381A6358
$$ 5525537 -1024835 -513690 -929807 -2752108 -2191144 2044273 -4289611 2736381 16358
1690c262338j254828C854635e05747D690447b427305j621434C176749A560093
$$ -3262338 -4517166 3854635 -505747 4690447 -2427305 -4048739 3176749 1560093
1681c03250p03742C196865a424135f34050A798002p63001b354885B075058E43754
$$ -303250 -1006992 3196865 -1424135 -634050 1798002 1035001 -2354885 2075058 543754
1671B137317F17118a630086M57754E1067K191981J902301a245237B593700J372449
$$ 2137317 617118 -1630086 -1172332 51067 2243048 4145349 -1245237 2593700 3966149
1662C966149i94333A452742Q92469e268439J809475B886402a063592B444936J453536
$$ 3966149 -994333 1452742 2345211 -5268439 -3458964 2886402 -1063592 2444936 3898472
1653C898472a686747j834172h70830k674256O05443d87749B247871M04793b787804
$$ 3898472 -1686747 -3520919 -870830 -3545086 -2939643 -487749 2247871 2652664 -2787804
1643b223597A284896b20167n86018j667785J129903A575419a785249A990365O67486
$$ -2223597 1284896 -220167 -806185 -2473970 -1344067 1575419 -1785249 1990365 2657851
1634B657851g67111j062221b82034j084016j553443B453328H25138o3868a998319
$$ 2657851 -767111 -1829332 -282034 -1366050 -2919493 2453328 825138 761270 -1998319
1624f83793m316808a415627C440298a141156k779750E379794a773540L88585B468884
$$ -683793 -5000601 -1415627 3440298 -1141156 -3920906 5379794 -1773540 -1384955 2468884
1614A817897c910054A349126a429882A957205C54192g20224A345945O68538b205271
$$ 1817897 -3910054 1349126 -1429882 1957205 354192 -720224 1345945 2014483 -2205271
1604e928179A682355b551156d63734B797138D17051k9379b68257o10018E566212
$$ -5928179 1682355 -2551156 -463734 2797138 417051 387672 -268257 -878275 5566212
1594b352780B736226a95915p447716B934204a383332G25936a611650D851877a992538
$$ -2352780 2736226 -195915 -7643631 2934204 -1383332 725936 -1611650 4851877 -1992538
1584B23431b323870F84424M27407J413188b559510c85341m65175j493661A750573
$$ 223431 -2323870 684424 1111831 2525019 -2559510 -385341 -850516 -2344177 1750573
1574E52186g97994A76359e81511k082920h75555B350140r23237K23144c597308
$$ 552186 -797994 176359 -581511 -2664431 -875555 2350140 1426903 1650047 -3597308
1564H31748L67924R64436J051822j068241j76951H72839M86336i27780O1846k008150
$$ 831748 1199672 2164108 3215930 2147689 1970738 872839 1359175 -927780 -865934 -2874084
1554b874084c7357A25944P3419J916347a102249k742967a127472B333647a482653
$$ -2874084 -37357 125944 199363 2115710 -1102249 -3845216 -1127472 2333647 -1482653
1544a986541G358521b796284f99251k064748g55644A705599c80193B898917D87396
$$ -1986541 7358521 -2796284 -699251 -2763999 -755644 1705599 -380193 2898917 487396
1534c066681J193498A180087L103691b964162a421523C166090O2152a699904D326593
$$ -3066681 -1873183 1180087 4283778 -2964162 -1421523 3166090 3228242 -1699904 4326593
1524e185193a395079l31420C291220f18574k587871B476806d259993H411615g652429
$$ -5185193 -1395079 -1726499 3291220 -618574 -3206445 2476806 -4259993 8411615 -7652429
1514E076047k357433A054534K581907E12461c471905C793J046807p3420J749513
$$ 5076047 2718614 1054534 3636441 512461 -3471905 3793 1050600 977180 2726693
1505B726693J400454A167548a524941d97604C61502d51790j334410C757844a217205
$$ 2726693 4127147 1167548 -1524941 -497604 361502 -451790 -1786200 3757844 -1217205
1495c224181C289574A99766b55560k065851e42141B070634d186867A19318f59129
$$ -3224181 3289574 199766 -255560 -2321411 -542141 2070634 -4186867 119318 -659129
1485A723554L920552B589729c029878f7525j081981l84849e33507F24765L382198
$$ 1723554 5644106 2589729 -3029878 -67525 -1149506 -1534355 -533507 624765 4006963
1476D006963c678894A106288j21778f17514A177894K250210c712931B892475h74740
$$ 4006963 -3678894 1106288 984510 -617514 1177894 3428104 -3712931 2892475 -874740
1466C558596L02889A224008c599228f99028j726492I96644K816801C20029a662792
$$ 3558596 3861485 1224008 -3599228 -699028 -2425520 996644 3813445 320029 -1662792
1456B12547J087018K60854a470724A609546M79957I9635J070539C13866g488909
$$ 212547 1299565 1560419 -1470724 1609546 2089503 99635 1170174 313866 -7488909
1446H807341A287765e617476b460746B664418D21672M19568c138088a355705B91886
$$ 8807341 1287765 -5617476 -2460746 2664418 421672 841240 -3138088 -1355705 291886
1436A584404b740713j635619b154158b44503C410108a373702l843568E89709K117283
$$ 1584404 -2740713 -4376332 -2154158 -244503 3410108 -1373702 -5217270 589709 2706992
1427B706992n22783e96441B031652a775095B66462A05728b824526B558150J194025
$$ 2706992 2184209 -596441 2031652 -1775095 266462 105728 -2824526 2558150 3752175
1418C752175a721899D3220J287218L33204k50123d68541A711105b703973D48762
$$ 3752175 -1721899 43220 1330438 1663642 1413519 -468541 1711105 -2703973 448762
1408B932996q46966a925773D52794c015217C217572L446596g26810j571526B446316
$$ 2932996 2086030 -1925773 452794 -3015217 3217572 6664168 -726810 -2298336 2446316
1398e369160f59611l50728A970890H95549O874058a765982j832980B552848a191360
$$ -5369160 -659611 -1010339 1970890 895549 7769607 -1765982 -3598962 2552848 -1191360
1388C728111b327899r17673J351615D168273c856675d63633H55757O36823b217827
$$ 3728111 -2327899 -3245572 -1893957 4168273 -3856675 -463633 855757 1492580 -2217827
1378h77902A352007J616546a317892A365512J648500K82516b245784F144818a476680
$$ -877902 1352007 2968553 -1317892 1365512 3014012 3296528 -2245784 6144818 -1476680
1368a628199P33568H31533K908253d650003E538783a461525H67909a068283B376480
$$ -1628199 -894631 831533 3739786 -4650003 5538783 -1461525 867909 -1068283 2376480
1358b570983B647885h391147c994545A168422l45487a017034E433872b50855k359175
$$ -2570983 2647885 -8391147 -3994545 1168422 822935 -1017034 5433872 -250855 -2610030
1349b610030F270394d62086o08003C925924d621249a25334D07749c036686C282881
$$ -2610030 6270394 -462086 -1070089 3925924 -4621249 -125334 407749 -3036686 3282881
1339D54962h38405r37329P56459I718786A74161f79580B63722a444091a98892
$$ 454962 -838405 -1775734 -1019275 9718786 174161 -679580 263722 -1444091 -198892
1329F00826J370747b164191F1792N088610e142600F489701M34344I7210b972511
$$ 600826 1971573 -2164191 61792 5150402 -5142600 6489701 6924045 97210 -2972511
1319D57372L06843c835207A573816g52275i1293H01122J199884a915852E23348
$$ 457372 764215 -3835207 1573816 -752275 -91293 801122 2001006 -1915852 523348
1309B58460c80367k143847a096340j356091J063152B440164J564020F22473L80995
$$ 258460 -380367 -2524214 -1096340 -2452431 -1389279 2440164 4004184 622473 1003468
1300A003468Q993J126076d177073N43733B666388m97003e365129J787750a247444
$$ 1003468 1012461 2138537 -4177073 -3633340 2666388 2169385 -5365129 -3577379 -1247444
1290b500871C094590r36195e014644a249476B415130c62531B02968i00552C948223
$$ -2500871 3094590 2158395 -5014644 -1249476 2415130 -362531 202968 -900552 3948223
1280c491358H97552J714882K795950A836042b272713A634652c352682H34153c14977
$$ -3491358 897552 2612434 5408384 1836042 -2272713 1634652 -3352682 834153 -314977
1270f92590J70280j820353g96059B693015c183813g03955B082426F8626b856335
$$ -692590 -522310 -2342663 -796059 2693015 -3183813 -703955 2082426 68626 -2856335
1260A057645K021536B66944J879784r00785n1055D01590J964546a812784B327073
$$ 1057645 3079181 266944 2146728 1245943 1194888 401590 2366136 -1812784 2327073
1250a194450N49038G5288O97298a432907C608760c353215a324678M12454l17524
$$ -1194450 -645412 75288 772586 -1432907 3608760 -3353215 -1324678 -912224 -1229748
1241a229748p4291N22832m28718l58027A853487e759472F370484d788736F435206
$$ -1229748 -1304039 -781207 -1209925 -1567952 1853487 -5759472 6370484 -4788736 6435206
1231f143295A763017A88558b80941j584899A0387a137743A904748l2279c549801
$$ -6143295 1763017 188558 -280941 -1865840 10387 -1137743 1904748 1872469 -3549801
1221D239380A756870a638468H109385c604032C50280a066016j619373p26394B3726
$$ 4239380 1756870 -1638468 8109385 -3604032 350280 -1066016 -2685389 -3411783 23726
1211C25083a093310C079251a42969C161139e15522j124337j496745H9751f059620
$$ 325083 -1093310 3079251 -142969 3161139 -515522 -1639859 -3136604 89751 -6059620
1201A891883c274728k494173A248081a398298A451493J427596c651145B060311
$$ 1891883 -3274728 -5768901 1248081 -1398298 1451493 2879089 -3651145 2060311
1192A042109L479523H48783a409760C438560D25119F5993c282364B979051C27663
$$ 1042109 4521632 848783 -1409760 3438560 425119 65993 -3282364 2979051 327663
1182C496692b308572A330785a96640j879889c90644A11994K82524K581431A470684
$$ 3496692 -2308572 1330785 -196640 -2076529 -390644 111994 394518 2975949 1470684
1172h44225A092107L72449A36377d609303F59345K550847E11395d301912F52229
$$ -844225 1092107 1464556 136377 -4609303 659345 3210192 511395 -4301912 652229
1162C230676e510108b117994b66888q48571A962275d4031B48420c986677B289378
$$ 3230676 -5510108 -2117994 -266888 -1115459 1962275 -44031 248420 -3986677 2289378
1152a022981A071605D38826d023521D297374a180508C978957a430173B121482
$$ -1022981 1071605 438826 -4023521 4297374 -1180508 3978957 -1430173 2121482
1143a797414c97394D86730P80828L711492a159948C166583e92272q98705B19164
$$ -1797414 -397394 486730 1267558 4979050 -1159948 3166583 -592272 -1490977 219164
1133b143552Q94226B547699b605457L61349C903252d739209A364682Q06589J460865
$$ -2143552 -1249326 2547699 -2605457 -2244108 3903252 -4739209 1364682 2171271 3632136
1124C632136e457210B704940g00058A086924e1772l212541o68663A575410a205585
$$ 3632136 -5457210 2704940 -700058 1086924 -51772 -3264313 -3932976 1575410 -1205585
1114F24089F9881L54773A79793J006671M86851d163969A230019B2843e01255E538765
$$ 624089 69881 424654 179793 1186464 1673315 -4163969 1230019 22843 -501255 5538765
1103a972574E503380a977397B158112b047453g19192C609255b281348B31510K244580
$$ -1972574 5503380 -1977397 2158112 -2047453 -719192 3609255 -2281348 231510 2476090
1094B476090j190239B38035l4684N10006J085337f433701I52078e610922A742725
$$ 2476090 1285851 238035 203351 713357 1798694 -6433701 952078 -5610922 1742725
1084H34648J034251b793210C006153A71632a41607l818178o24957H83656O01321
$$ 834648 1868899 -2793210 3006153 171632 -141607 -3959785 -4584742 883656 1484977
1075A484977a512978E060657E36295a513603B417088a428150k058166B870583
$$ 1484977 -1512978 5060657 536295 -1513603 2417088 -1428150 -3486316 2870583
1066B839615a226692A659788f516033i65741A355297b233156H8253L014461b324170
$$ 2839615 -1226692 1659788 -6516033 -965741 1355297 -2233156 88253 3102714 -2324170
1056c133517a049916A906286a465486F938325c466347b67657p0027A588533a50428
$$ -3133517 -1049916 1906286 -1465486 6938325 -3466347 -267657 -337684 1588533 -150428
1046a318570p59164A884455a795558B515192a60936m30577G187534c887844A422159
$$ -1318570 -2077734 1884455 -1795558 2515192 -160936 -591513 7187534 -3887844 1422159
1036H31730d05826B750307b876286E010245a422357l493130a07217A606932b440158
$$ 831730 -405826 2750307 -2876286 5010245 -1422357 -4915487 -107217 1606932 -2440158
1026C31654J683580n10513b426055A474372f011221B19586b991208I19917a495700
$$ 331654 2015234 1504721 -2426055 1474372 -6011221 219586 -2991208 919917 -1495700
1016a968379e65090H70872A18926b091464B848166c86954l201655c65841j890867
$$ -1968379 -565090 870872 118926 -2091464 2848166 -386954 -3588609 -365841 -2256708
1007b256708D671389g50076k03828j314417J063616B093765J891847b495501a237599
$$ -2256708 4671389 -750076 -953904 -2268321 -1204705 2093765 3985612 -2495501 -1237599
997H0775c261756B502301j24765c870419C720773i85056A303466M67866b366652
$$ 80775 -3261756 2502301 2377536 -3870419 3720773 -985056 1303466 1771332 -2366652
987A538135J87101g76306B817299b745000L22584H86031J802847m02198e306050
$$ 1538135 1725236 -776306 2817299 -2745000 -2422416 886031 2688878 2286680 -5306050
977F493683c919636A622607b747317D515204H05901b46271A468064J305916a331561
$$ 6493683 -3919636 1622607 -2747317 4515204 805901 -246271 1468064 2773980 -1331561
967g511469A295177Q37108g41938J70589C273914b725820G68721M62526a781097
$$ -7511469 1295177 2132285 -741938 -571349 3273914 -2725820 768721 1231247 -1781097
957D28033L912794d24965C065863B71998b155651A240317J957334m28043D34200
$$ 428033 4340827 -424965 3065863 271998 -2155651 1240317 3197651 2769608 434200
947c245582a153384E362682A309804Q52654b961625n09346A824630d20742k478235
$$ -3245582 -1153384 5362682 1309804 2162458 -2961625 -3470971 1824630 -420742 -2898977
938b898977C728980E0399K601055b181143p34455A064362B9995a123841d02877
$$ -2898977 3728980 50399 2651454 -2181143 -2915598 1064362 29995 -1123841 -402877
928A060574l4620J733251d367089A977860c48425A125178j20962c227420A346973
$$ 1060574 1025954 2759205 -4367089 1977860 -348425 1125178 1004216 -3227420 1346973
918b897046o26748D56882b492145K45078A835550e11370r44906B337366r39785
$$ -2897046 -3523794 456882 -2492145 -2247067 1835550 -511370 -1456276 2337366 1397581
909A397581M1780d606272D363248B109074b083338L15048C999551d91119E83079
$$ 1397581 1439361 -4606272 4363248 2109074 -2083338 -1768290 3999551 -491119 583079
899a093121C751143A98016c040210B420991p62068b993460J286141B283264C33826
$$ -1093121 3751143 198016 -3040210 2420991 1658923 -2993460 -1707319 2283264 333826
889c792768G529159d118344A930091f663582C412877a644497F87827f97870A297376
$$ -3792768 7529159 -4118344 1930091 -6663582 3412877 -1644497 687827 -697870 1297376
879E014252d770596h40416n588702C959844A03803O91123b718996q6515L0499
$$ 5014252 -4770596 -840416 -6429118 3959844 103803 794926 -2718996 -2805511 -2775012
870b775012f56958p54228j3221j144185L36786G09261J500284c25971m10413l77483
$$ -2775012 -656958 -1411186 -1424407 -2568592 -2231806 709261 2209545 -325971 -736384 -1113867
860a113867D99583M480019B135135P02437d780352E679751h076232B749460j057338
$$ -1113867 499583 4979602 2135135 2837572 -4780352 5679751 -8076232 2749460 1692122
851A692122a753513O55555B569710b070429R51736D726549e034672B428575e001032
$$ 1692122 -1753513 -1097958 2569710 -2070429 -1118693 4726549 -5034672 2428575 -5001032
841e68174m30734B273688c379104e49375N1854L9087j165849l147863K067846
$$ -568174 -998908 2273688 -3379104 -549375 -497521 -458434 -1624283 -4772146 -2704300
832b704300P12565C378350g46203I45326b907877C300049c40752j193371n24075
$$ -2704300 -1991735 3378350 -746203 945326 -2907877 3300049 -340752 -1534123 -2058198
823b058198B122895j27253b761966a368631A209862g19505C721572f325034J208094
$$ -2058198 2122895 1995642 -2761966 -1368631 1209862 -719505 3721572 -6325034 -5116940
814e116940c77459J70517k18871H54838M24845a84558l4647I26862c451029A385256
$$ -5116940 -377459 -206942 -425813 854838 1279683 -184558 -219205 926862 -3451029 1385256
803a71663j724854m616177D14325N21459L661672m59663a856917h9388C734016
$$ -171663 -1896517 -6512694 414325 935784 4597456 4137793 -1856917 -89388 3734016
793e505004F705285A085422g376595E308108e611376C298269r73176a307786o89516
$$ -5505004 6705285 1085422 -7376595 5308108 -5611376 3298269 2325093 -1307786 -1997302
784a997302E388002f183155G82403L285325a808585N50101k103034F80020R62239
$$ -1997302 5388002 -6183155 782403 4067728 -1808585 -1258484 -3361518 680020 1642259
775A642259a613226a85494A677868h94322j014004A939922H23880c258234e84762
$$ 1642259 -1613226 -185494 1677868 -894322 -1908326 1939922 823880 -3258234 -584762
765F682984a000431A285236Q2234c740932a209042D326152E24063e350761A136171
$$ 6682984 -1000431 1285236 1367470 -3740932 -1209042 4326152 524063 -5350761 1136171
755B086150c418535c8853n35646j248174B717565c906878A929566I35386q3537
$$ 2086150 -3418535 -38853 -574499 -1822673 2717565 -3906878 1929566 935386 851849
746H51849a769068N44322r34241g16940k285242a63905B874811a255520j150761
$$ 851849 -1769068 -1224746 -2158987 -716940 -3002182 -163905 2874811 -1255520 -2406281
737b406281B778597o90709B39349A07133a24998j15021A483867h611323b005648
$$ -2406281 2778597 2087888 239349 107133 -124998 -240019 1483867 -8611323 -2005648
727A022081K684875A542950m33977K45797l31830a680321A461998c371871J680697
$$ 1022081 3706956 1542950 1108973 1354770 1022940 -1680321 1461998 -3371871 -1691174
718a691174A694443K759941b729744b40352o83486G34199b614909R78107k3085
$$ -1691174 1694443 4454384 -2729744 -240352 -923838 734199 -2614909 -1636802 -1659887
709a659887g36768B378938o65797a891617A827796a237906B266813K2181c560872
$$ -1659887 -736768 2378938 1713141 -1891617 1827796 -1237906 2266813 2288994 -3560872
699a9091884d600760l073834m859988B0300567M482331H679375j296620M073593
$$ -19091884 -4600760 -7674594 -12534582 20300567 24782898 8679375 7382755 11456348
691A1456348A532205h647820k2772556J4195950m361426j0474939D146980K5656867
$$ 11456348 1532205 -8647820 -31420376 -17224426 -21585852 -32060791 4146980 29803847
683B9803847A2465145Q907742j964489a0266433M231229B60183a202920k453129
$$ 29803847 12465145 21372887 19408398 -10266433 -6035204 260183 -1202920 -3656049
675c656049a447167a85162G43586f46634C408651a768613Q23758B45659L298101
$$ -3656049 -1447167 -185162 743586 -646634 3408651 -1768613 -944855 245659 3543760
666C543760c144925j553528D459265a691516B314568p28280J7379633q001902
$$ 3543760 -3144925 -4698453 4459265 -1691516 2314568 1586288 18965921 10964019
658A0964019a2274044M826386k1591148c614807o305942j7073439H933789A992516
$$ 10964019 -12274044 -7447658 -29038806 -3614807 -9920749 -26994188 8933789 1992516
649B5577480k563387A0719044a841930n66457r052591c342161p23681q279162
$$ 25577480 23014093 10719044 -1841930 -2408387 -11460978 -3342161 -4065842 -12345004
641a2345004e857389m46971E319760J1292596A063167a630666A612761C43963
$$ -12345004 -5857389 -6304360 5319760 16612356 1063167 -1630666 1612761 343963
632A06594e729073a988122h08732C669031H32362c84099D192456G43825K814641
$$ 106594 -5729073 -1988122 -808732 3669031 832362 -384099 4192456 743825 3558466
623C558466e007764B946559d865345a222751C586457G51532J03516a349948B064804
$$ 3558466 -5007764 2946559 -4865345 -1222751 3586457 751532 855048 -1349948 2064804
613c616710B107758Q74551A382072A9413N983790N907761J7057506K6226707H452637
$$ -3616710 2107758 2982309 1382072 19413 6003203 11910964 28968470 55195177 8452637
603b74467208a03074748B5780879J15469153A7087808o335203J879214D547248
$$ -274467208 -103074748 25780879 141250032 17087808 10752605 12631819 4547248
595D308617m88730J226002O84749A634553J555510H37723g35853B470928f84303
$$ 4308617 3819887 5045889 5730638 1634553 3190063 837723 -735853 2470928 -684303
585F05733L401020A866446a318806D011080E84686M130290h95874q6010D215287
$$ 605733 4006753 1866446 -1318806 4011080 584686 4714976 -895874 -981884 4215287
575C938037j499913f998397a95505n578319A819081c983246g42630r02693j393471
$$ 3938037 2438124 -6998397 -195505 -5773824 1819081 -3983246 -742630 -1645323 -3038794
566c038794A094062f737545a336135E115305a613824e54192p47476C09965M620098
$$ -3038794 1094062 -6737545 -1336135 5115305 -1613824 -554192 -1301668 309965 4930063
557D930063g06557M4010C005954e233589A21708a096252B584190K078348A777835
$$ 4930063 -706557 -662547 3005954 -5233589 121708 -1096252 2584190 4662538 1777835
547g77631g6119j405137A768286a096355I55266a110918D29045b664644C564495
$$ -777631 -76119 -1481256 1768286 -1096355 955266 -1110918 429045 -2664644 3564495
537d584839a445136B909510f406760i24842L02373j849362B143877B26835a11208
$$ -4584839 -1445136 2909510 -6406760 -924842 -622469 -2471831 2143877 226835 -111208
527b111887R1731A075231b786079G785677D62664J011614a261022F82580b372098
$$ -2111887 -2020156 1075231 -2786079 7785677 462664 1474278 -1261022 682580 -2372098
517B372903b445855E410349a509889B55721J862176A38897b246132n87603J029081
$$ 2372903 -2445855 5410349 -1509889 255721 2117897 138897 -2246132 -2833735 -1804654
508a804654Q95307C906219a226931E109682a459086B577546A017732b722177I87261
$$ -1804654 -909347 3906219 -1226931 5109682 -1459086 2577546 1017732 -2722177 987261
498B661908a809629r26405a91108B178832b045810P34139B360530K294174A989454
$$ 2661908 -1809629 -2736034 -191108 2178832 -2045810 -1311671 2360530 4654704 1989454
488b029032M89910O77004D78854f231452C397874a539677l15616j768230I20069
$$ -2029032 -1539122 -862118 478854 -6231452 3397874 -1539677 -1855293 -3623523 920069
478B610207d649367B149341n91975o14405N131382A054556b062254M25618B463193
$$ 2610207 -4649367 2149341 1557366 942961 6074343 1054556 -2062254 -1636636 2463193
468c68299C106058f82877A349515e79013j86243k0596A76263L101577g667548
$$ -368299 3106058 -682877 1349515 -579013 -765256 -785852 176263 3277840 -7667548
458F311742A082527a527661A715710O36848b054844M30480C789916o40046K01254
$$ 6311742 1082527 -1527661 1715710 2352558 -2054844 -1624364 3789916 3149870 3351124
449C351124f822211C086590I53800a067352l37176B904273A103127L987646G43580
$$ 3351124 -6822211 3086590 953800 -1067352 -1404528 2904273 1103127 5090773 743580
439c001982a212774a35198j842660B004884p93460J072460a769592M96663B06508
$$ -3001982 -1212774 -135198 -1977858 2004884 1211424 2283884 -1769592 -1272929 206508
429D841665e883949b775890J306027B604224c57356G12619L411184b081689n19462
$$ 4841665 -5883949 -2775890 -1469863 2604224 -357356 712619 4123803 -2081689 -2601151
420b601151B406061d850206A64041b625694B709332N3513E63195b61402j021363
$$ -2601151 2406061 -4850206 164041 -2625694 2709332 2762845 563195 -261402 -1282765
411a282765J58229A374789d925563I12380a50592k480259G33970a665181F82146
$$ -1282765 -1124536 1374789 -4925563 912380 -150592 -2630851 733970 -1665181 682146
401f879381B654104o74053a827512A281996b220723J01939b17241H85530J015365
$$ -6879381 2654104 1980051 -1827512 1281996 -2220723 -2118784 -217241 885530 1900895
392A900895b844606P59817A189480P27376a840615H5892J861871b16234O7372
$$ 1900895 -2844606 -2084789 1189480 1916856 -1840615 85892 1947763 -216234 -148862
383a48862A637580a923763H54576R48791A70459K038264d845388J790970h34233
$$ -148862 1637580 -1923763 854576 1803367 170459 2208723 -4845388 -3054418 -834233
373g84282j420480a028488A39227M829641h205750E670404c433249i71604k89699
$$ -784282 -2204762 -1028488 139227 4968868 -8205750 5670404 -3433249 -971604 -1261303
364a261303A077763h37445B08365K03961d651577B637733a661689D151597b568273
$$ -1261303 1077763 -837445 208365 412326 -4651577 2637733 -1661689 4151597 -2568273
354g45389H65005b281792j08130B32064K806314A51342O14901a715877r00777
$$ -745389 865005 -2281792 -2389922 232064 3038378 151342 766243 -1715877 -2616654
345b616654D73124d78459I60189b636124A827366J146740i83073r5676H727820
$$ -2616654 473124 -478459 960189 -2636124 1827366 2974106 -983073 -1078749 8727820
335d353572M49377a006064p42587C896498b70746q79728I00768J661300b048549
$$ -4353572 -3904195 -1006064 -1748651 3896498 -270746 -1150474 900768 2562068 -2048549
325A576510F72271b892894a161869L58219L71874l204647I32226K38822a30743
$$ 1576510 672271 -2892894 -1161869 -803650 -431776 -3636423 932226 1171048 -130743
315b42622d2693j860152E27817b057407g96092B496585a560137G95339a794431
$$ -242622 -42693 -1902845 527817 -2057407 -796092 2496585 -1560137 795339 -1794431
305A752179d392938C317153H86552b707589D165385B014442e781905F74728f62483
$$ 1752179 -4392938 3317153 886552 -2707589 4165385 2014442 -5781905 674728 -662483
295b322453C542184L351376a049828C30631i7658F57770c93131C372535a776031
$$ -2322453 3542184 6893560 -1049828 330631 -97658 657770 -393131 3372535 -1776031
285F404593g517048D57660N35258e034253I07289M41694L044081a573195J22641
$$ 6404593 -7517048 457660 992918 -5034253 907289 1348983 4393064 -1573195 -1450554
276a450554l103351A948267a946209A699024d57774m37043A531197G62635N09104
$$ -1450554 -4553905 1948267 -1946209 1699024 -457774 -894817 1531197 762635 1271739
267A271739m59319L584897d698776f01345j245205G18298J4243l18215O37433
$$ 1271739 812420 4397317 -4698776 -601345 -1846550 718298 732541 414326 1051759
258A051759a069910E3687e86698K05164A088037D7845O13044b670348l94550C783937
$$ 1051759 -1069910 53687 -586698 -381534 1088037 47845 660889 -2670348 -3064898 3783937
247a522185D44058b094709j698430a477051A91724M2263a20000q19222B791292
$$ -1522185 444058 -2094709 -3793139 -1477051 191724 233987 -120000 -939222 2791292
237C681298b402440C087986b891040A577989a862175B511149I06540h48855j901090
$$ 3681298 -2402440 3087986 -2891040 1577989 -1862175 2511149 906540 -848855 -2749945
228b749945p53850A96405b864226D525325d057032D5286a027634F24650m1040
$$ -2749945 -3503795 196405 -2864226 4525325 -4057032 45286 -1027634 624650 583610
219E83610f39902k577506C194424d283884g32872B44300a339346q6807H80551
$$ 583610 -639902 -3217408 3194424 -4283884 -732872 244300 -1339346 -1426153 880551
209D79584L447093a679903a53266j883573J02985D356821A180255M91639b698301
$$ 479584 3926677 -1679903 -153266 -2036839 -1933854 4356821 1180255 1671894 -2698301
199A389341a41242j389321A649246b482174L14560R80681J0198A345508A14477
$$ 1389341 -141242 -1530563 1649246 -2482174 -2167614 -1186933 -1176735 1345508 114477
189b816785j78165A333662B8976c481398a92162B572598R61364c183848I65525
$$ -2816785 -2994950 1333662 28976 -3481398 -192162 2572598 3533962 -3183848 965525
179A937931M171902c755238a306346C06140a545438A392479m71277h699835l7939357
$$ 1937931 6109833 -3755238 -1306346 306140 -1545438 1392479 921202 -8699835 -46639192
170d6639192r9150916C3698031l7873J12942160E0274590Q4518514b4801568k460889
$$ -46639192 -145790108 33698031 33660158 146602318 50274590 134793104 -24801568 -27262457
162b7262457j07437516b9878758F149717k848496c907799g86541D164676d028667
$$ -27262457 -134699973 -29878758 6149717 3301221 -3907799 -786541 4164676 -4028667
153B076882h7027A097789a64772m12054n09339B561365H4858J677898d15597j638861
$$ 2076882 -87027 1097789 -164772 -576826 -1086165 2561365 84858 1762756 -415597 -2054458
143b054458D34512J594480c738844I65292L335230E14729f20852j23482m86691
$$ -2054458 434512 2028992 -3738844 965292 4300522 514729 -620852 -744334 -1231025
134a231025k60415A15390K942511g94340H73454l97036a781620I38910Q46548
$$ -1231025 -1491440 115390 3057901 -794340 873454 476418 -1781620 938910 1785458
125A785458b845801A007620c072690F1472L712507E94117e070080C752045c86625
$$ 1785458 -2845801 1007620 -3072690 61472 3773979 594117 -5070080 3752045 -386625
115A17620g84098C542469c131720D649834a270774q00400R15298j168821B865347
$$ 117620 -784098 3542469 -3131720 4649834 -1270774 -2071174 -1155876 -2324697 2865347
105B991111d472611I65471a553578C35315b306555A816763K335564H12063J56537
$$ 2991111 -4472611 965471 -1553578 335315 -2306555 1816763 4152327 812063 968600
96I68600K28838N452146c028542f7610k683911B350923c203356B508477P37675
$$ 968600 1197438 6649584 -3028542 -67610 -2751521 2350923 -3203356 2508477 3246152
87C246152c403145D3907J637872C14761a76103j49009C130549g065928A837364
$$ 3246152 -3403145 43907 1681779 314761 -176103 -325112 3130549 -7065928 1837364
77A790629E18346K095480I54255e490001E025241I55832a09968B073729c81213
$$ 1790629 518346 2613826 954255 -5490001 5025241 955832 -109968 2073729 -381213
67c102634C194729b41860m76153B966306r59997b979989A108039b341464F488799
$$ -3102634 3194729 -241860 -718013 2966306 2006309 -2979989 1108039 -2341464 6488799
57d646093C269552a012917D580604a715999a62673m29259A872571P73282j271701
$$ -4646093 3269552 -1012917 4580604 -1715999 -162673 -591932 1872571 2645853 1374152
48A374152d81838C463101H34769b436828C284781D01401d23150j498992B602235
$$ 1374152 -481838 3463101 834769 -2436828 3284781 401401 -423150 -1922142 2602235
38d747125D879095c731099g41934G62940l09845M59402C77459b73307j92124B014016
$$ -4747125 4879095 -3731099 -741934 762940 453095 912497 377459 -273307 -465431 2014016
27b883925A894379a652416A503720Q18331b336209M14515l86103D06186j50508
$$ -2883925 1894379 -1652416 1503720 2322051 -2336209 -1921694 -2307797 406186 255678
18B55678b56304j014595j204047B904933b103106N68420A563473G68443e26822
$$ 255678 -256304 -1270899 -2474946 2904933 -2103106 -1534686 1563473 768443 -526822
8I47189J98854J262964c759006L54281F14609K817772I04761d964770
$$ 947189 1146043 2409007 -3759006 -3404725 614609 3432381 904761 -4964770
##PAGE= F1=5596.982059883
##FIRST=     21204.543296753, 2658.27584773936, -644704
##DATA TABLE= (F2++(Y..Y)), PROFILE
2047f44704j87526G07414L2399j97840a151337l481778C07850J202392K65371
$$ -644704 -832230 707414 739813 541973 -1151337 -4633115 307850 1510242 1775613
2038A775613F15756a974758j272462C879943a333183A546486K342799c20652j994793
$$ 1775613 615756 -1974758 -3247220 3879943 -1333183 1546486 3889285 -320652 -2315445
2029b315445h77491B452111d471666B486753j087418a289842M69209B856133A147197
$$ -2315445 -877491 2452111 -4471666 2486753 1399335 -1289842 -820633 2856133 1147197
2019I23468g42167D13342R23220a029204j682014B216712j065774c668297d74719
$$ 923468 -742167 413342 1336562 -1029204 -2711218 2216712 1150938 -3668297 -474719
2009D610929a680420g29359k295089D953825a544711D77053R32826h49307k830926
$$ 4610929 -1680420 -729359 -3024448 4953825 -1544711 477053 1409879 -849307 -3680233
2000c680233a302443F591087A761393a886179l267291D049687i03205k56613C175051
$$ -3680233 -1302443 6591087 1761393 -1886179 -5153470 4049687 -903205 -1159818 3175051
1990I84254a70609j353910j195001l109343a007618I26708J002143F15702c782542
$$ 984254 -170609 -1524519 -2719520 -5828863 -1007618 926708 1928851 615702 -3782542
1980F15452J120706k24962c136052B119167M461043c469049A693945K768837a8470
$$ 615452 1736158 1511196 -3136052 2119167 6580210 -3469049 1693945 4462782 -18470
1970h54833K64418R3746E97529e020977C81586K118085b203013H2383N22223J27961
$$ -854833 -590415 -496669 597529 -5020977 381586 2499671 -2203013 82383 604606 732567
1960G32567c630595g9331k91714l058640a296031H63994O116883A53396a498447
$$ 732567 -3630595 -79331 -371045 -3429685 -1296031 863994 6980877 153396 -1498447
1950a286955H50295d61831C692478K87113a88361j46551n118272C23837K746391
$$ -1286955 850295 -461831 3692478 3979591 -188361 -334912 -5453184 323837 3070228
1941C070228c933315H32848Q37106a913109A159990a420477E033868a6017H398404
$$ 3070228 -3933315 832848 1669954 -1913109 1159990 -1420477 5033868 -16017 8398404
1931b64660C634709c872428K99751I739039b233139j720457R78003A414992K69692
$$ -264660 3634709 -3872428 -3572677 9739039 -2233139 -3953596 -2975593 1414992 1684684
1922A684684c423802A525888e043890F075556A099256K371182C84293J55865c307020
$$ 1684684 -3423802 1525888 -5043890 6075556 1099256 3470438 384293 540158 -3307020
1912a066657H78874a52978B138948L13396B88113a013040G252285c226055H76596
$$ -1066657 878874 -152978 2138948 2452344 288113 -1013040 7252285 -3226055 876596
1902a390750C539043b724118k77904B444717c05021A58047a1840D76580K898810
$$ -1390750 3539043 -2724118 -3002022 2444717 -305021 158047 -11840 476580 3375390
1893C375390j661501F05079b331769C752540C19588c46415H59151a282845D773615
$$ 3375390 1713889 605079 -2331769 3752540 319588 -346415 859151 -1282845 4773615
1883A382368d023605B09986J052982b029478K16938e900l68079m131714C614397
$$ 1382368 -4023605 209986 1262968 -2029478 -1812540 -5900 -373979 -4505693 3614397
1873c12255F04010K103032c96866k467366F195296d82273C102137A151697h16505
$$ -312255 604010 2707042 -396866 -2864232 6195296 -482273 3102137 1151697 -816505
1863a042301o4207j731269A397702J231744F48568h36651j237525n89080B181090
$$ -1042301 -1106508 -2837777 1397702 2629446 648568 -836651 -2074176 -2663256 2181090
1853D635481A371123B89540a46252j612293A519126J739601c539627D044910a126802
$$ 4635481 1371123 289540 -146252 -1758545 1519126 3258727 -3539627 4044910 -1126802
1843A178591a340644E57401a184382B671213f73535j334360B495169a512048C89064
$$ 1178591 -1340644 557401 -1184382 2671213 -673535 -2007895 2495169 -1512048 389064
1833c2630p53225D357473b593766F94101h72999A826719a420799B948317a31808
$$ -32630 -785855 4357473 -2593766 694101 -872999 1826719 -1420799 2948317 -131808
1823G966d383601H72354f1653l521437C235907M55852j444109a253506A137644
$$ 7966 -4383601 872354 -61653 -3583090 3235907 3691759 2247650 -1253506 1137644
1813c767054C265010c209983D701925b773525B379219C68812J416315B42766a728620
$$ -3767054 3265010 -3209983 4701925 -2773525 2379219 368812 1785127 242766 -1728620
1803C870115i57886j8711M02042j292557e6347I23737L414637a131120j059014
$$ 3870115 -957886 -976597 -574555 -1867112 -56347 923737 4338374 -1131120 -2190134
1794b190134N66990L92222H16499l56885J514413J75467K305284F09350d35437
$$ -2190134 -1623144 -1230922 816499 459614 1974027 2149494 4454778 609350 -435437
1784a087894o04120e88308q66002a76083G83123J08165L706497E2996K701895
$$ -1087894 -1692014 -588308 -1454310 -176083 783123 891288 4597785 52996 2754891
1775B754891i58162B041048b220210c99847C543205E71594R4659b031765F57617
$$ 2754891 -958162 2041048 -2220210 -399847 3543205 571594 666253 -2031765 657617
1765b487481n366471G258930d772134C25690M19507c238698B701539a705419A361659
$$ -2487481 -7853952 7258930 -4772134 325690 745197 -3238698 2701539 -1705419 1361659
1755c940726A597031j02673a890707B213766I7831K165767b38529E59095e421348
$$ -3940726 1597031 1494358 -1890707 2213766 97831 2263598 -238529 559095 -5421348
1745c381688A57503K847744a726291C07139K331039b945919A809052i69167B669649
$$ -3381688 157503 3005247 -1726291 307139 2638178 -2945919 1809052 -969167 2669649
1735d396884f55095k01973F56542b473242j281178F450751A686794g97188j290808
$$ -4396884 -655095 -857068 656542 -2473242 -3754420 6450751 1686794 -797188 -2087996
1726b087996b84959g784k489938F528602i69139c64178B110688b84013J06292
$$ -2087996 -284959 -7784 -2497722 6528602 -969139 -364178 2110688 -284013 -177721
1717a77721j069181J79954r1124m467311e33123B98965b380922J38940H26162
$$ -177721 -1246902 -1066948 -1158072 -5625383 -533123 298965 -2380922 -2241982 826162
1707b74772r10087j923403D540628A281321e838000A184807M411585a179867d93406
$$ -274772 -1184859 -3108262 4540628 1281321 -5838000 1184807 5596392 -1179867 -493406
1697i30225j354037N51609A303291d562023B945559I7082c072509j051280C635450
$$ -930225 -2284262 -1732653 1303291 -4562023 2945559 97082 -3072509 -4123789 3635450
1687g72621C805078a650926j823329B416554o99888h39206o11601C794105b312468
$$ -772621 3805078 -1650926 -3474255 2416554 1716666 -839206 -1450807 3794105 -2312468
1677e83425A611220c84373j278806A950710r74728k2440l99758a743142P40869
$$ -583425 1611220 -384373 -1663179 1950710 975982 953542 553784 -1743142 -1002273
1668a002273K68715B435092J312345a464210B270283K316649a466900A550354
$$ -1002273 -733558 2435092 3747437 -1464210 2270283 4586932 -1466900 1550354
1659B392144e202421J449924B965042a522998A772067L069535b466973j604400
$$ 2392144 -5202421 -3752497 2965042 -1522998 1772067 4841602 -2466973 -4071373
1651d071373g85523k184828j20506K53673B878361p05732c103657g42088A213515
$$ -4071373 -785523 -2970351 -3090857 -2837184 2878361 2172629 -3103657 -742088 1213515
1641g86906L40514j950240a097696I07928a377815B222785j90422f47023j658418
$$ -786906 -446392 -2396632 -1097696 907928 -1377815 2222785 2032363 -647023 -2305441
1632b305441D66122a785843j338037B752746I77408A59464a547932M47013l250429
$$ -2305441 466122 -1785843 -3123880 2752746 977408 159464 -1547932 -1100919 -4351348
1623d351348h97978B687923i55993l962493E400962a688049M07291B923540j337310
$$ -4351348 -897978 2687923 -955993 -4918486 5400962 -1688049 -1280758 2923540 1586230
1614A586230c335174B500438a550934A421080C32204e94437G80961J309581a292900
$$ 1586230 -3335174 2500438 -1550934 1421080 332204 -594437 780961 2090542 -1292900
1604e910730B368350b542012i10408B206395E62698j58140d10852l10426E817589
$$ -5910730 2368350 -2542012 -910408 2206395 562698 404558 -410852 -721278 5817589
1594a978386B500879a90924p186691B815310i87018F54705a426181D608199b116988
$$ -1978386 2500879 -190924 -7377615 2815310 -987018 654705 -1426181 4608199 -2116988
1584H94273b368480D26725K19126J947474a717140d24106n24512k025095I52996
$$ 894273 -2368480 426725 645851 2593325 -1717140 -424106 -948618 -2973713 952996
1574A574933e38415B27017a167791r94492h50338B637808H48936O41797c360384
$$ 1574933 -538415 227017 -1167791 -2162283 -850338 2637808 848936 1490733 -3360384
1564A509980p43325R27514K740595A444139J56907K38024k081a492513L29432
$$ 1509980 766655 1694169 4434764 1444139 1601046 1839070 1836989 -1492513 -1163081
1555a163081j253341b47944R5865F42226J090597b97078k495948a081482C306138
$$ -1163081 -2416422 -247944 -152079 642226 1732823 -297078 -2793026 -1081482 3306138
1545a681356j3385F683970b063964g26276k454018b649A311014f23632B905182
$$ -1681356 -1694741 6683970 -2063964 -726276 -3180294 -2649 1311014 -623632 2905182
1535A351002c120159Q42352A049892M017693b147872P87418C119979L62293b004599
$$ 1351002 -3120159 -2277807 1049892 5067585 -2147872 -1360454 3119979 3482272 -2004599
1525D220146e263158a782568h89708C245211i28273k382641C147011c877496F722804
$$ 4220146 -5263158 -1782568 -889708 3245211 -928273 -3310914 3147011 -3877496 6722804
1515g261574D155881k74742I58719K462272A162559c103780i52875A104002C90320
$$ -7261574 4155881 3881139 958719 3420991 1162559 -3103780 -952875 1104002 390320
1505B747688K15699A455755a270403M91698G62973a921438K89311C912702g28514
$$ 2747688 2963387 1455755 -1270403 -778705 762973 -1921438 -1632127 3912702 -728514
1495c311785C476146b30396j67788k091770g75219B759734c324503E55453f11430
$$ -3311785 3476146 -230396 -398184 -2489954 -775219 2759734 -3324503 555453 -611430
1485I37679N243926B601732b852710a4680q02636m41516c28046k259D217437c253413
$$ 937679 6181605 2601732 -2852710 -14680 -817316 -1258832 -328046 -330305 4217437 -3253413
1474A403795o61058g43364A204080L110114d290136C345747d97555C014264L7546
$$ 1403795 742737 -743364 1204080 4314194 -4290136 3345747 -497555 3014264 3051810
1465C051810j370137c418916h99870k187288A149091K911717D35407b386075E71054
$$ 3051810 1681673 -3418916 -899870 -3087158 1149091 4060808 435407 -2386075 571054
1455H58022J107580e36977b48124B859788A04406N86005k34532g566301H629245
$$ 858022 1965602 -536977 -248124 2859788 104406 690411 455879 -7566301 8629245
1445A008455d986728K021360B820171F24818J01009c142882a437286C44329R76448
$$ 1008455 -4986728 -2965368 2820171 624818 725827 -3142882 -1437286 344329 1320777
1436A320777a858953m160261a534183g43953C964238a454920n307395F35262J478279
$$ 1320777 -1858953 -6019214 -1534183 -743953 3964238 -1454920 -6762315 635262 2113541
1427B113541l18158h64881C381332a424880E13905M3592b889415B748935O06304
$$ 2113541 1795383 -864881 3381332 -1424880 513905 557497 -2889415 2748935 3355239
1418C355239a188249A36172J290266J48307m99949A83932J574295c599574F00749
$$ 3355239 -1188249 136172 1426438 1574745 1074796 183932 1758227 -3599574 600749
1408B981784r48504a935760c97933l085226C268738L888682f26794k439393B958854
$$ 2981784 2033280 -1935760 -397933 -3483159 3268738 7157420 -626794 -3066187 2958854
1398d261048a28121j326981A377674L94155M278919a882345k090236B653928i35702
$$ -4261048 -128121 -1455102 1377674 1771829 6050748 -1882345 -3972581 2653928 -935702
1388C460998a826454q34785l7710C346895c576140A024737M63887o22272b169123
$$ 3460998 -1826454 -2661239 -2698949 3346895 -3576140 1024737 1488624 866352 -2169123
1378h34575A730253P20175a054172A554218J769788K32499c003642F221679a687254
$$ -834575 1730253 2450428 -1054172 1554218 3324006 3556505 -3003642 6221679 -1687254
1368a447160b05036A079705K839537d386898E398868a865277F87053i54394A354482
$$ -1447160 -205036 1079705 3919242 -4386898 5398868 -1865277 687053 -954394 1354482
1358b931165B582867h670994c936531I50722K80267a271937D720529C28737b467479
$$ -2931165 2582867 -8670994 -3936531 950722 1230989 -1271937 4720529 328737 -2467479
1348G170626g68716q84094C836725d477469A33099K22200c154100C611504G27705
$$ 7170626 -768716 -1652810 3836725 -4477469 133099 355299 -3154100 3611504 727705
1338h41924j242266P31971H793108A63478L3318g28493R3373Q9433B09709J644792
$$ -841924 -2084190 -1352219 8793108 163478 196796 -728493 -635120 -545687 209709 1854501
1328A854501b209448g06123E312202e414936F354003P8109C97259c116104F49157
$$ 1854501 -2209448 -706123 5312202 -5414936 6354003 6432112 397259 -3116104 649157
1318A130470d066384E98261a99695k59830I99645J099035a596037A429211g05008
$$ 1130470 -4066384 598261 -199695 -459525 999645 2098680 -1596037 1429211 -705008
1308c2480k489029a239761p27105J6795B953430N12711d7746A249623k40417K175362
$$ -32480 -2521509 -1239761 -1966866 -1950071 2953430 3466141 -47746 1249623 1009206 3184568
1298C184568c892643o9963B453840j87485e154742J918538a413960p07311B158153
$$ 3184568 -3892643 -3962606 2453840 2266355 -5154742 -3236204 -1413960 -2121271 2158153
1288A924851d567674h03246B502073e30750a3694p97344C543646c275759B95657
$$ 1924851 -4567674 -803246 2502073 -530750 -13694 -811038 3543646 -3275759 295657
1278B950858K069485A501176a429914A713790d497532C09379h25437M06308K08253
$$ 2950858 5020343 1501176 -1429914 1713790 -4497532 309379 -825437 -419129 -210876
1269b10876k074810i72711A467170c090740i24255B303807a79391k749403A701029
$$ -210876 -2285686 -972711 1467170 -3090740 -924255 2303807 -179391 -2928794 1701029
1259C138518E36437J415774m35060l97767E37004J759362h02706A686791a605207
$$ 3138518 536437 1952211 1517151 1119384 537004 2296366 -802706 1686791 -1605207
1249f45396q490F81503a527263D493579c711310a176785k18104k46058L23564
$$ -645396 -653886 681503 -1527263 4493579 -3711310 -1176785 -1394889 -1640947 -1317383
1240a317383L89042N847q59038B334776e707641E414643d615836E640489g183243
$$ -1317383 -928341 -922494 -1781532 2334776 -5707641 5414643 -4615836 5640489 -7183243
1230A668434A51703a90536j580875a83312o31646B277324j018963c875815D709035
$$ 1668434 151703 -190536 -1771411 -183312 -814958 2277324 1258361 -3875815 4709035
1220B219152a575371H229966c651456C57160i54863j775964l68084A60703L67535
$$ 2219152 -1575371 8229966 -3651456 357160 -954863 -2730827 -3098911 160703 528238
1211E28238a451088B765217a28457C016641a90775j649535j338764A38107f704169
$$ 528238 -1451088 2765217 -128457 3016641 -190775 -1840310 -3179074 138107 -6704169
1201B147916c430831j730058A426669c245345B536273j70889d059217B008460
$$ 2147916 -3430831 -5160889 1426669 -3245345 2536273 2365384 -4059217 2008460
1192F03712M280630I75725a150701C744495d0117D19860c251531C000132H04026
$$ 603712 4884342 975725 -1150701 3744495 -40117 419860 -3251531 3000132 804026
1182C546077b354644A147622i6174k521386D0418M2756Q09471J914034I60954
$$ 3546077 -2354644 1147622 -96174 -2617560 40418 83174 892645 2806679 960954
1172f51250H23537P71163C5359d631945H98870N04094n24138d932545G09539K782561
$$ -651250 823537 1594700 35359 -4631945 898870 1402964 878826 -4932545 709539 3492100
1162C492100c580007Q31834a67533q76252A438506f35668a24271k420807A384023
$$ 3492100 -3580007 -2748173 -167533 -1043785 1438506 -635668 -124271 -2545078 1384023
1152e47393A691241B72037c855617D040156a970320C350676a568980A234522a871912
$$ -547393 1691241 272037 -3855617 4040156 -1970320 3350676 -1568980 1234522 -1871912
1142b85495A015607J60919L414854f33641C322149f61214j358906c1086k007850
$$ -285495 1015607 1176526 4591380 -633641 3322149 -661214 -2020120 -31086 -2038936
1133b038936Q35169C261104c819201a599830C988484d931078G54310K569915M25979
$$ -2038936 -1203767 3261104 -3819201 -1599830 3988484 -4931078 754310 3324225 3750204
1124C750204e514939B471910a127506B525452a27698l597708n86084A671711a511773
$$ 3750204 -5514939 2471910 -1127506 2525452 -127698 -3725406 -4311490 1671711 -1511773
1114F03379B28567H0584N71839K72948O8236b986671A191226i4535o20522E887717
$$ 603379 228567 80584 652423 925371 993607 -2986671 1191226 -94535 -715057 5887717
1103b349275E623710b365069B531040a964383d47444D067581a595322D92494J664140
$$ -2349275 5623710 -2365069 2531040 -1964383 -447444 4067581 -1595322 492494 2156634
1094B156634m31593a51104m63288H33862M57675f076915A393986f106645A961089
$$ 2156634 1725041 -151104 -614392 833862 1291537 -6076915 1393986 -6106645 1961089
1084D77355J468418b631715D233018c6620C10969c136529k089560a008767B058712
$$ 477355 1945773 -2631715 4233018 -36620 310969 -3136529 -5226089 -1008767 2058712
1074h25131E327885i2929j625321C036855b282558o40423C120651m08473b88690
$$ -825131 5327885 -92929 -1718250 3036855 -2282558 -2922981 3120651 2712178 -288690
1064A356148g317446i72013A394565a732130e18218D137557b691602j846167a419727
$$ 1356148 -7317446 -972013 1394565 -1732130 -518218 4137557 -2691602 -4537769 -1419727
1054B504828a429864F956398c456070a56436k43805F73629k25549b045310k9327
$$ 2504828 -1429864 6956398 -3456070 -156436 -400241 673629 448080 -2045310 -2074637
1045b074637B365965b104366C875078i00890b42481G184380c762230I36275O82620
$$ -2074637 2365965 -2104366 3875078 -900890 -242481 7184380 -3762230 936275 1618895
1036A618895d96485B921269b345526D876463b129658k377531c33809C039032b379510
$$ 1618895 -496485 2921269 -2345526 4876463 -2129658 -4507189 -333809 3039032 -2379510
1026d07437B191665l5431b471005A748358e965032b43796l995410A547473a571704
$$ -407437 2191665 2156234 -2471005 1748358 -5965032 -243796 -4239206 1547473 -1571704
1016a473355E2625K98502M63158a769151B998999B96300c489300c77141k281213
$$ -1473355 52625 351127 814285 -1769151 2998999 296300 -3489300 -377141 -2658354
1007b658354D264763h56955A20486b161990P5163B262103J409812b336353N25105
$$ -2658354 4264763 -856955 120486 -2161990 -2086827 2262103 3671915 -2336353 -1811248
998a811248A88282d110763C527218A358792c190364C065442a267754A719993K34813
$$ -1811248 188282 -4110763 3527218 1358792 -3190364 3065442 -1267754 1719993 1954806
989A954806b397392A539723K91865a34003A749547a366151q45557F97491J910961
$$ 1954806 -2397392 1539723 1831588 -134003 1749547 -1366151 -2211708 697491 2608452
980B608452A290180d784139F355634c472282A084069b505253E299919A29435L54970
$$ 2608452 1290180 -4784139 6355634 -3472282 1084069 -2505253 5299919 129435 484405
971D84405J408069N11839b284624n702449A553620M65022a106094L97347C200508
$$ 484405 1892474 2404313 -2284624 -7987073 1553620 2018642 -1106094 -708747 3200508
961a690931G61531K156782b834008E56716L765452i73017C502929A69444a821278
$$ -1690931 761531 2918313 -2834008 556716 4322168 -973017 3502929 169444 -1821278
951F85259K650983r08698A195496c452206A3131N741464A196339J172047c031263
$$ 685259 3336242 2427544 1195496 -3452206 13131 5754595 1196339 2368386 -3031263
941c805850B118957c52624k632023C964292B18574J779735b392310f55042F24129
$$ -3805850 2118957 -352624 -2984647 3964292 218574 1998309 -2392310 -655042 624129
931H30739a914564d28432A221287C19114K792480d118055A034434a6379F42581
$$ 830739 -1914564 -428432 1221287 319114 3111594 -4118055 1034434 -16379 642581
921H73352b993756B53671b657625l97366I68960b668972l47640B356302h31991
$$ 873352 -2993756 253671 -2657625 -3054991 968960 -2668972 -3016612 2356302 -831991
911a128114B288175A009508J30143d574564D363118A938784a342678o04268D116661
$$ -1128114 2288175 1009508 1139651 -4574564 4363118 1938784 -1342678 -1946946 4116661
901B65237j13761a213398D130373A31459b900468B300763q13552b172979o4050
$$ 265237 151476 -1213398 4130373 131459 -2900468 2300763 1487211 -2172979 -2237029
892b237029C041886C29044d735753G157169d046335B175245e782209C812122f74045
$$ -2237029 3041886 329044 -4735753 7157169 -4046335 2175245 -5782209 3812122 -674045
882G57352b37951D50498N033910d095296J996546l589753C545000c322A260067
$$ 757352 -237951 450498 5484408 -4095296 -2098750 -5688503 3545000 -3322 1260067
872c174205M809J95035C4960a484932K56944n93025j147182A657911J174505a14766
$$ -3174205 -3169396 -2974361 34960 -1484932 -1227988 -1821013 -2968195 1657911 2832416 -114766
861d42143j47469a9269D610054A911970J409254d339832E607916f860849B536083
$$ -442143 -589612 -19269 4610054 1911970 3321224 -4339832 5607916 -6860849 2536083
851G11314a883164R00129B314496b342508a099251E673230d606538B735266e228796
$$ 711314 -1883164 -983035 2314496 -2342508 -1099251 5673230 -4606538 2735266 -5228796
841a81056j286662B672615b438559Q69367H3945e55767j725618k112876J145940
$$ -181056 -1467718 2672615 -2438559 -1569192 83945 -555767 -2281385 -4394261 -3248321
832c248321J491325C214446E7188J370330b292630C320317a71693k113173L32189
$$ -3248321 -1756996 3214446 57188 1427518 -2292630 3320317 -171693 -2284866 -1952677
823a952677B134928k71689c294222a372901A001984a06784D206531f567711J690167
$$ -1952677 2134928 1863239 -3294222 -1372901 1001984 -106784 4206531 -6567711 -4877544
814d877544b93889B18795a95255h2305D54082G52K05877O10531b103687G76085
$$ -4877544 -293889 218795 -195255 -82305 454082 752 206629 817160 -2103687 776085
803a65208o82581n855460F45324B67244M336141j415451g97252k2970C868280
$$ -165208 -847789 -6703249 645324 267244 4603385 3187934 -797252 -820222 3868280
793e736186F405492A345834h125297D334927e579447D715725A877120a894821
$$ -5736186 6405492 1345834 -8125297 4334927 -5579447 4715725 1877120 -1894821
784b600758E172372e449378A90126M334860a918806R09994k585200I88992L71363
$$ -2600758 5172372 -5449378 190126 4524986 -1918806 -1008812 -3594012 988992 1360355
775A360355a920222a95560B146335e05541j440600A02785P65591b887154a164956
$$ 1360355 -1920222 -195560 2146335 -505541 -1946141 102785 868376 -2887154 -1164956
765F358975e05139F22203J466452d283370b078518D657072b4724m796328I23697
$$ 6358975 -505139 622203 2088655 -4283370 -2078518 4657072 -24724 -4821052 923697
755B656803c443748a293242f01146j188998B756609c824091A969706F30300J25459
$$ 2656803 -3443748 -1293242 -601146 -1790144 2756609 -3824091 1969706 630300 755759
746G55759b411679g62016r98309c33294k925718F0004K497364f54771j259922
$$ 755759 -2411679 -762016 -1760325 -333294 -3259012 60004 2557368 -654771 -1914693
737a914693B599729q77816C97734H973d23344p51737A567140h523647a711876
$$ -1914693 2599729 1721913 397734 8973 -423344 -1175081 1567140 -8523647 -1711876
727H87114K611836j686675H87560P96858q01684a007974A521468c328548N11521
$$ 887114 3498950 1812275 887560 1684418 882734 -1007974 1521468 -3328548 -2817027
718b817027A782299L013394c193784B28982a080539I30957b812798O66954K82427
$$ -2817027 1782299 4795693 -3193784 228982 -1080539 930957 -2812798 -2145844 -1863417
709a863417h59696B138870L8385a807704B203294a534287B065128j36489b406349
$$ -1863417 -859696 2138870 2177255 -1807704 2203294 -1534287 2065128 1928639 -2406349
699a4963690c707204l073489m618077A5496985O098692G017545j142905L972150
$$ -14963690 -3707204 -6780693 -11398770 15496985 21595677 7017545 5874640 9846790
691I846790B323136g469981j8452889J2148504l689657o352002C355013K0448367
$$ 9846790 2323136 -7469981 -25922870 -13774366 -17464023 -23816025 3355013 23803380
683B3803380I977689P990765m263979a0457729c869855D63963h61922j789267
$$ 23803380 9977689 17968454 13704475 -10457729 -3869855 463963 -861922 -2651189
675b651189J208058b68856D89832h14763B980783a887426h48415B59582K902777
$$ -2651189 -1443131 -268856 489832 -814763 2980783 -1887426 -848415 259582 3162359
666C162359c084092j344451C713060b275473B240494E24398J4546062n311801
$$ 3162359 -3084092 -4428543 3713060 -2275473 2240494 524398 15070460 9758659
658I758659a1520964N646893j8507745c266385n287285j3427842H293951A324515
$$ 9758659 -11520964 -5874071 -24381816 -3266385 -8553670 -21981512 8293951 1324515
649B0693495k961499q549412a774915q27904o144886b787246j357063n987836
$$ 20693495 17731996 9182584 -1774915 -2602819 -8747705 -2787246 -4144309 -10132145
641a0132145d606939j624232C492862J1145604D43576a123712A867641D26874
$$ -10132145 -4606939 -6231171 3492862 14638466 443576 -1123712 1867641 426874
632d02065n380651a358320b43426D340140E43855a025678D329582E50557L935977
$$ -402065 -5782716 -1358320 -243426 4340140 543855 -1025678 4329582 550557 4486534
623D486534e206591B636147d253778K035750C535227B0792R82791a450483B152151
$$ 4486534 -5206591 2636147 -4253778 -2218028 3535227 20792 1003583 -1450483 2152151
613d398831B441602l33260I27268a66189D082347M034286J5884930J9439207F563408
$$ -4398831 2441602 2108342 927268 -166189 4082347 8116633 24001563 43440770 6563408
603b09777367g8383244B0098638Q8079929A5220865G348747L735360C482175M15886
$$ -209777367 -78383244 20098638 108178567 15220865 7348747 11084107 3482175 3898061
595C898061o50880J847769J373774A336556P93622C77244a497658B510019d06301
$$ 3898061 3247181 5094950 6468724 1336556 2130178 377244 -1497658 2510019 -406301
585C7209M675242A582451a584824D673622D77983M393544a004473o82842D378945
$$ 37209 4712451 1582451 -1584824 4673622 477983 4871527 -1004473 -1687315 4378945
575C634481o63931f216777e17270n375598B572087d001506a024034l95465j934755
$$ 3634481 2970550 -6216777 -517270 -5892868 2572087 -4001506 -1024034 -1419499 -3354254
566c354254A483536f644545a595126D677069a605313a62840q64267B90770M494257
$$ -3354254 1483536 -6644545 -1595126 4677069 -1605313 -162840 -1027107 290770 4785027
557D785027f14547N9566B680162d935789e06946o22268B822050J761129A967144
$$ 4785027 -614547 -554981 2680162 -4935789 -506946 -1129214 2822050 4583179 1967144
547i48112b79709j308094A773529a197597I57746a140808E30089b890172C478468
$$ -948112 -279709 -1587803 1773529 -1197597 957746 -1140808 530089 -2890172 3478468
537e307074a650715B272285f416822B95021a347442j464164A094487D28227J23344
$$ -5307074 -1650715 2272285 -6416822 295021 -1347442 -2811606 1094487 428227 551571
528E51571b637150P82842A649137b922124F004115G08872P88844a460346C07684
$$ 551571 -2637150 -1854308 1649137 -2922124 6004115 708872 1497716 -1460346 307684
518a886970B445803a421393D706671g84577C6775J777897e1379j769162j209981
$$ -1886970 2445803 -1421393 4706671 -784577 36775 1814672 -51379 -1820541 -3030522
509c030522J444975M34103C965812a557225D798357b160116B652554A36020b922300
$$ -3030522 -1585547 -1151444 3965812 -1557225 4798357 -2160116 2652554 136020 -2922300
499A051053J686327b281262m52365b77727B701290b750568J000247B549969J460695
$$ 1051053 2737380 -2281262 -2733627 -277727 2701290 -2750568 -1750321 2549969 4010664
490D010664j811776a948245K77690O96310G44188e978282C941802b299793P2341
$$ 4010664 2198888 -1948245 -1670555 -974245 744188 -5978282 3941802 -2299793 -2227452
481b227452l18839A582262Q49030c940779A368246d28758A073028M953156G64357
$$ -2227452 -2546291 1582262 2431292 -3940779 1368246 -428758 1073028 6026184 764357
471b637485J296106A885855F20729J948840a21320A878427e23069R3517p08533
$$ -2637485 -1341379 1885855 620729 2569569 -121320 1878427 -523069 -429552 -1138085
462a138085E20040K877516f325948F186164A935601a691776A341909J082161b601515
$$ -1138085 520040 3397556 -6325948 6186164 1935601 -1691776 1341909 2424070 -2601515
452f67466C755739p44358J98440f826646C237724A195104C69178b103232B266928
$$ -667466 3755739 3011381 3209821 -6826646 3237724 1195104 369178 -2103232 2266928
442F33403L918630F16394b914192a321734d25148j045161A754370k88664O0448
$$ 633403 4552033 616394 -2914192 -1321734 -425148 -1470309 1754370 1465706 1526154
433A526154a624992O09274D00242M167812f220087b997039e53393A398571i6458
$$ 1526154 -1624992 -1015718 400242 4568054 -6220087 -2997039 -553393 1398571 -96458
423D27575L419734b074982J12364B439079d047369B89583b565897A905017l9655
$$ 427575 3847309 -2074982 -1962618 2439079 -4047369 289583 -2565897 1905017 1865362
414A865362D20276c32621j332074g08247A688599e937195F78508h6109k462539
$$ 1865362 420276 -332621 -1664695 -708247 1688599 -5937195 678508 -86109 -2548648
405b548648D07734a450790A020801g669447C173341A431155a844191A534097b161246
$$ -2548648 407734 -1450790 1020801 -7669447 3173341 1431155 -1844191 1534097 -2161246
395a619199a40588I45216P66200b542870M0495A337857J176072a616422P52489
$$ -1619199 -140588 945216 1711416 -2542870 -2502375 1337857 2513929 -1616422 -863933
386h63933A401646e19292J03056A884859a800228E06239J528119H8708K713290
$$ -863933 1401646 -519292 -416236 1884859 -1800228 506239 2034358 88708 2801998
377B801998d850555J944677f38942l32404j78435j59176A055843L881097h300820
$$ 2801998 -4850555 -2905878 -638942 -971346 -1149781 -1308957 1055843 4936940 -8300820
367E247708c691993a179868l03855C43577g95842A43544J86861d690969A974147
$$ 5247708 -3691993 -1179868 -1483723 343577 -795842 143544 330405 -4690969 1974147
357a035247C277153b231802h89005A343954a635573l91987G34028J884456g52754
$$ -1035247 3277153 -2231802 -889005 1343954 -1635573 -2027560 734028 2618484 -752754
347A088608b432085N84877I46368g62313H92818b304959A721363N14982g57357
$$ 1088608 -2432085 -1847208 946368 -762313 892818 -2304959 1721363 2236345 -757357
337a382783I158884d314729Q92768c70892j640596D648681c25305j070340E05371
$$ -1382783 9158884 -4314729 -3421961 -370892 -2011488 4648681 -325305 -1395645 505371
327B528363b760551A825624H36261c470974d43062o32751J97931k686047A217008
$$ 2528363 -2760551 1825624 836261 -3470974 -443062 -1075813 -877882 -3563929 1217008
317B22969M02754a828486C21175a748095G2505a679291N5496B137324a718512
$$ 222969 625723 -1828486 321175 -1748095 72505 -1679291 -1623795 2137324 -1718512
307A360455b091337B173271d822084B858107j310251b421571D008663j848018
$$ 1360455 -2091337 2173271 -4822084 2858107 1547856 -2421571 4008663 2160645
299B160645f978632A997783b23110k512805C493692L389346a293517K74543b86852
$$ 2160645 -6978632 1997783 -223110 -2735915 3493692 6883038 -1293517 -1018974 -286852
289a1523l8539B953891a966471F664245f886683E8977N52104d459484A073138
$$ -11523 -50062 2953891 -1966471 6664245 -6886683 58977 611081 -4459484 1073138
279A057322K974677a687069L35230k786804B110485b437061A048816F047a041519
$$ 1057322 4031999 -1687069 -1351839 -4138643 2110485 -2437061 1048816 6047 -1041519
269A448184l12161J39249C27399M475242e023756a497450m63771I63627J78673
$$ 1448184 1136023 1275272 327399 4802641 -5023756 -1497450 -1961221 963627 1142300
260A142300C1964J562167e20893J21485k37217m10873A535765d62716A692764
$$ 1142300 31964 1594131 -520893 -399408 -636625 -1047498 1535765 -462716 1692764
250c159473j74656C475068e00155A07380a822580j604279a295648A335100a27049
$$ -3159473 -3334129 3475068 -500155 107380 -1822580 -3426859 -1295648 1335100 -127049
240a58531j229065B447362N80097b190859C020077b773022A007214a538229B575097
$$ -158531 -1387596 2447362 3027459 -2190859 3020077 -2773022 1007214 -1538229 2575097
230A158143a017403p03178k911800E54531a980945D870176d478448F18174i37713
$$ 1158143 -1017403 -1720581 -4632381 554531 -1980945 4870176 -4478448 618174 -937713
220E88091k08128g85061k128802C786392c848764i64285A17232a084920r9750
$$ 588091 379963 -785061 -2913863 3786392 -3848764 -964285 117232 -1084920 -1184670
211a184670D13900J40233K757772b151211B9175b420773p1736E030479A050635
$$ -1184670 413900 554133 3311905 -2151211 29175 -2420773 -2492509 5030479 1050635
201A592122b519441A341119f36951O6140A407533b266213m94076a184845K15804
$$ 1592122 -2519441 1341119 -636951 -570811 1407533 -2266213 -2760289 -1184845 -969041
192i69041I29444k6661b726175k17022A305659o11757c238957a91879B398601
$$ -969041 929444 902783 -2726175 -2943197 1305659 693902 -3238957 -191879 2398601
182C431084b903177B060345q13216N490645c460598a514348A015039a442004A540639
$$ 3431084 -2903177 2060345 1247129 6737774 -3460598 -1514348 1015039 -1442004 1540639
172G92075g717073k8770816p7765820B5622847p40813Q8795140C8978183O1499715
$$ 792075 -7717073 -36487889 -114253709 25622847 24882034 113677174 38978183 100477898
164A00477898a9116796k219328q0939522b1793151E530931k611150d466099a59589
$$ 100477898 -19116796 -21336124 -102275646 -21793151 5530931 2919781 -4466099 -159589
155C869030d199859B972118c91749A329517e93696J01266l93326B003629a51271
$$ 3869030 -4199859 2972118 -391749 1329517 -593696 -492430 -885756 2003629 -151271
145B885437i52445o93419F341K563556c422841C69493M010765H12234e97934k41884
$$ 2885437 -952445 -1645864 6341 2569897 -3422841 369493 4380258 812234 -597934 -839818
135h39818p71713m28807C38168J731416d90779A207836i1746j189611F86756J501671
$$ -839818 -1611531 -2040338 338168 2069584 -490779 1207836 -91746 -1281357 686756 2188427
125B188427d182495A367870b839349F35202K545300A552481d831265D385423a323737
$$ 2188427 -4182495 1367870 -2839349 635202 3180502 1552481 -4831265 4385423 -1323737
115g3642k23326D295522c540507D258922a156525n09499g34785k204504B547833
$$ -73642 -296968 4295522 -3540507 4258922 -1156525 -1666024 -734785 -2939289 2547833
105C354330d256298D28709b025739a66770j589056A500695K186932I37468l5398
$$ 3354330 -4256298 428709 -2025739 -166770 -1755826 1500695 3687627 937468 902070
96I02070J163163M126429b621396E52462c006366A836999c356130B670092M52200
$$ 902070 2065233 6191662 -2621396 552462 -3006366 1836999 -3356130 2670092 3122292
87C122292c289300e74860B226009I96599a023428k14253C258605f351741B205349
$$ 3122292 -3289300 -574860 2226009 996599 -1023428 -1237681 3258605 -6351741 2205349
77A095212C60227J865876n77405f254981E684818G37525a3994B315570d03389
$$ 1095212 360227 2226103 1648698 -6254981 5684818 737525 -13994 2315570 -403389
67c564536B794922a23650l31651A747791k60523c058809A900340b144483F921791
$$ -3564536 2794922 -123650 -455301 1747791 1487268 -3058809 1900340 -2144483 6921791
57d988945B485112e16115D475549a931382e33350e8790A318478Q09058r0189B07429
$$ -4988945 2485112 -516115 4475549 -1931382 -533350 -58790 1318478 2127536 2037347 207429
46C498512A368984c175080C267378G88957a066574l35716A892513c933930D469512
$$ 3498512 1368984 -3175080 3267378 788957 -1066574 -1402290 1892513 -3933930 4469512
36d728538a204191G88125B91327L89840k79425c55489o54427B067098b318091
$$ -4728538 -1204191 788125 291327 681167 401742 -355489 -1009916 2067098 -2318091
26A407435a969605B159019j74868b495923l63970N55631D99477c2653D88399a227860
$$ 1407435 -1969605 2159019 1984151 -2495923 -2859893 -2304262 499477 -32653 488399 -1227860
15b029858C857032b129032Q25186A126958q1533e62664A141334O70888J84501
$$ -2029858 3857032 -2129032 -1303846 1126958 1045425 -562664 1141334 1812222 1996723
6A996723c718305Q41443G85675K928530I49986e009735
$$ 1996723 -3718305 -2876862 785675 3714205 949986 -5009735
##PAGE= F1=5575.183789999
##FIRST=     21204.543296753, 2658.27584773936, -433912
##DATA TABLE= (F2++(Y..Y)), PROFILE
2047d33912m18405A101917D79698K56666a126401l300498F15312J211063L98274
$$ -433912 -852317 1101917 479698 736364 -1126401 -4426899 615312 1826375 2224649
2038B224649C31034a532137j491994C767166i30953A579337L089815a89372j471653
$$ 2224649 331034 -1532137 -3024131 3767166 -930953 1579337 4669152 -189372 -1661025
2029a661025M80170B166906d712989B309576H15570f59477l81264C125843H37495
$$ -1661025 -1180855 2166906 -4712989 2309576 815570 -659477 -1040741 3125843 837495
2019A203740a096457A442240E46422a32752k580176B079911n75462c004982b49631
$$ 1203740 -1096457 1442240 546422 -132752 -2712928 2079911 1504449 -3004982 -249631
2009D301130a660032M94382j712073E956137b262181H2984J479927i23722j944409
$$ 4301130 -1660032 -1165650 -2877723 5956137 -2262181 82984 1562911 -923722 -2868131
2000b868131g71443F075089A594478b129197k825570C618521e12143r55453C504054
$$ -2868131 -771443 6075089 1594478 -2129197 -4954767 3618521 -512143 -1467596 3504054
1990A198004g27405k46943j441312l596406h02933I02008J637040I04249c197936
$$ 1198004 -727405 -974348 -2415660 -6012066 -802933 902008 2539048 904249 -3197936
1980C41247J364554O7453c734699B421444M719285c223352A731632K517031G0287
$$ 341247 1705801 1773254 -3734699 2421444 7140729 -3223352 1731632 4248663 70287
1970b68771n1971J15089B58124d735822C52498K864675a954447C04839L46137
$$ -268771 -320742 -205653 258124 -4735822 352498 3217173 -1954447 304839 650976
1961F50976J226248c631801g09147r69403j468732J559640H36048O652441A05127
$$ 650976 1877224 -3631801 -709147 -1678550 -3147282 -1587642 836048 7488489 105127
1951a416356m78587A348876g1482A391335L110089h70268L58398m957427H31550
$$ -1416356 -1894943 1348876 -71482 1391335 4501424 -870268 -511870 -5469297 831550
1941C037789c743727G91877O14795a675779E60795a839760F651305d3041H153320
$$ 3037789 -3743727 791877 1406672 -1675779 560795 -1839760 6651305 -43041 8153320
1931B76008L850904d038354j35447I613250a813885j874061k05410A194251J094474
$$ 276008 4126912 -4038354 -4173801 9613250 -1813885 -3687946 -3893356 1194251 2288725
1922B288725c807848A496477d106476E836900E72772L320852I06278M92304b677946
$$ 2288725 -3807848 1496477 -4106476 5836900 572772 3893624 906278 1398582 -2677946
1912D6156Q89450d0038A743240K11895E35964d70108G467430a391017A033575
$$ 46156 935606 -40038 1743240 1955135 535964 -470108 7467430 -1391017 1033575
1902b249287C064559b514141J59365A525864c06957E43711A94690n7312L484482
$$ -2249287 3064559 -2514141 -2354776 1525864 -306957 543711 194690 137378 3621860
1893C621860j792905C27862b296449C326391A436808c40928D46956b271123F069298
$$ 3621860 1828955 327862 -2296449 3326391 1436808 -340928 446956 -2271123 6069298
1883A444962c482327c2954B050997b931477J066935H33300a305763k481720C570146
$$ 1444962 -3482327 -32954 2050997 -2931477 -1864542 833300 -1305763 -3787483 3570146
1873b01460D37582K450058d23984l058396E373508B57883K218775A088611f81964
$$ -201460 437582 2887640 -423984 -3482380 5373508 257883 2476658 1088611 -681964
1863a598139c21288j941931A225247J858906D68894h43203j170804l30735A991278
$$ -1598139 -321288 -2263219 1225247 3084153 468894 -843203 -2014007 -2344742 1991278
1853D018606A693543a76765D07198a159457A955696O85800c316118C556537a001382
$$ 4018606 1693543 -176765 407198 -1159457 1955696 2641496 -3316118 3556537 -1001382
1843B290511b287129F35830i95334B903902B5147a602357B098417e87462J22879
$$ 2290511 -2287129 635830 -995334 2903902 25147 -1602357 2098417 -587462 -464583
1834d64583B55938f42346D411851b476388A192124d49832B314641h24577C590959
$$ -464583 255938 -642346 4411851 -2476388 1192124 -449832 2314641 -824577 3590959
1824c845k06311l473153H85005a41152l066421B899104J452451B084668a751899
$$ -3845 -210156 -3683309 885005 -141152 -3207573 2899104 4351555 2084668 -1751899
1814I25182c266896C449394c985685D231288b687746B574697H79323J133366a40083
$$ 925182 -3266896 3449394 -3985685 4231288 -2687746 2574697 879323 2012689 -140083
1804a077977C535015h27550q4893k9090q04182E61648M04654L326580a431770
$$ -1077977 3535015 -827550 -912443 -941533 -1745715 561648 966302 4292882 -1431770
1794b335927d16423k08986a80015F7417K158123H91008M148339a24013n43856
$$ -2335927 -416423 -625409 -180015 67417 2225540 891008 5039347 -124013 -667869
1785f67869b05071j716776b78270j628330O39588A780643G64684M051996D91989
$$ -667869 -205071 -1921847 -278270 -1906600 -1267012 1780643 764684 4816680 491989
1775B498422a837398B288045b706629f12025C941247D73232L4721a517729A39091
$$ 2498422 -1837398 2288045 -2706629 -612025 3941247 473232 507953 -1517729 139091
1765b684790n290798G453949e308508a71539G93522b502128B262599e69610F99783
$$ -2684790 -7975588 7453949 -5308508 -171539 793522 -2502128 2262599 -569610 699783
1755c964111A475378J37097a752058B390071A56668K456049a89663F00905e791585
$$ -3964111 1475378 1612475 -1752058 2390071 156668 2612717 -189663 600905 -5791585
1745c504156a51656C993425b088823A155893J502462a957599A248084b73665C136507
$$ -3504156 -151656 3993425 -2088823 1155893 2658355 -1957599 1248084 -273665 3136507
1735d324893d60829A60827P96968b983235r65422F108529B662808a369878n25416
$$ -4324893 -460829 160827 957795 -2983235 -3948657 6108529 2662808 -1369878 -1895294
1726a895294A50515c30153k002266E453227i01233B01751K396686f4936k73670
$$ -1895294 150515 -330153 -2332419 5453227 -901233 201751 2598437 -64936 -338606
1717c38606q59284N43610p93064m475822e22228C82140b342335j79294A105868
$$ -338606 -1197890 -654280 -1447344 -5923166 -522228 382140 -2342335 -2521629 1105868
1707C69046a836436j435263D648922I44126e408196A009037M516751a156082d42722
$$ 369046 -1836436 -3271699 4648922 944126 -5408196 1009037 5525788 -1156082 -442722
1697h80826o63094M23632G58513d581541B981820B11127b716579p73238C357341
$$ -880826 -1543920 -1120288 758513 -4581541 2981820 211127 -2716579 -3489817 3357341
1687i30117B785598a014935j622674A735764J36026a372988n18280D317438c185945
$$ -930117 2785598 -1014935 -2637609 1735764 1871790 -1372988 -1891268 4317438 -3185945
1677d20974A390236a373922M77367A908641n73209b65180E38460a627944g56763
$$ -420974 1390236 -1373922 -896555 1908641 1335432 -265180 538460 -1627944 -756763
1667a454361B633923N23698a656835A882796L243091a775490A763692O22017d937263
$$ -1454361 2633923 3157621 -1656835 1882796 5125887 -1775490 1763692 2385709 -4937263
1657c813559B950884a892616A039841M577569b976044j547047d40109j994891
$$ -3813559 2950884 -1892616 1039841 5617410 -2976044 -4523091 -440109 -2435000
1649b435000o21423j758068C472512j665850c357378F27577N11306a236860b9391
$$ -2435000 -3056423 -4814491 3472512 1806662 -3357378 627577 1138883 -1236860 -29391
1639b309671e77880B13035h82082B265556j100915d78831k158678A182329a954323
$$ -2309671 -577880 213035 -882082 2265556 1164641 -478831 -2637509 1182329 -1954323
1629c160991C015975A200607d60988n44353m50557k015126c14331A788393f71785
$$ -3160991 3015975 1200607 -460988 -1005341 -1455898 -3471024 -314331 1788393 -671785
1619e515189D925688a310043J49208C278977A294347b557732C573468a682185
$$ -5515189 4925688 -1310043 -1160835 3278977 1294347 -2557732 3573468 -1682185
1610A184629C68708d60382A22543K046395b09273n238154B867336b332141J129241
$$ 1184629 368708 -460382 122543 2168938 -209273 -5447427 2867336 -2332141 -1202900
1601a202900A486393G34092k66970d77314K3899E846506a624584B284391a47849
$$ -1202900 1486393 734092 467122 -477314 -453415 5846506 -1624584 2284391 -147849
1591f881645B723770e45434E30344a317839D293375b217441A512408b346744C08678
$$ -6881645 2723770 -545434 530344 -1317839 4293375 -2217441 1512408 -2346744 308678
1581C53345K091847g82870c17147p35498k390612C41495K087453c53825B07090
$$ 353345 2445192 -782870 -317147 -1052645 -3443257 341495 2428948 -353825 207090
1571a635414k6298f19411B796176C31699Q87755b883510B145035A48874J002733
$$ -1635414 -1661712 -619411 2796176 331699 1219454 -2883510 2145035 148874 1151607
1562A151607M086884H18606M82479J509658o80042b106070P61821o18947c78781
$$ 1151607 5238491 818606 1301085 2810743 2130701 -2106070 -1344249 -1963196 -378781
1552c35661A037926J37810D72909a690920P40305D209795a808135M02689E900178
$$ -335661 1037926 1175736 472909 -1690920 -950615 4209795 -1808135 -1405446 5900178
1542a209794N58143k982017F32513L11514h85268B833708o52093b969851K28403
$$ -1209794 -651651 -3633668 632513 944027 -885268 2833708 2181615 -2969851 -2741448
1533b741448G86364M865175a245913M2159B901697P17594b220685D082639e267210
$$ -2741448 786364 5651539 -1245913 -1203754 2901697 3619291 -2220685 4082639 -5267210
1523b057908A80584K989031a097790k324830C820134c580597D947313f656157
$$ -2057908 180584 3169615 -1097790 -3422620 3820134 -3580597 4947313 -6656157
1514C199298J408530G75552K380143j416430b808742R38093A168562b84663B702665
$$ 3199298 4607828 775552 3155695 1739265 -2808742 -1870649 1168562 -284663 2702665
1504A594856J13481a201851L44411A089894c215518a391121C901566b09299l292974
$$ 1594856 1708337 -1201851 -857440 1089894 -3215518 -1391121 3901566 -209299 -3502273
1495c502273C525206g05367K96860k192809a096514C381903b335430I22096d86209
$$ -3502273 3525206 -705367 -408507 -2601316 -1096514 3381903 -2335430 922096 -486209
1485F4651O398312B517031b516281a15650l39904n07021c05403q50531D303713
$$ 64651 6462963 2517031 -2516281 -115650 -455554 -962575 -305403 -1155934 4303713
1475b756901A689221H04037i75106A120941L604827d659840C483688h7949B269962
$$ -2756901 1689221 804037 -975106 1120941 4725768 -4659840 3483688 -87949 2269962
1465B109052o4365b968402a065618k512126A270592K798942E16844b959092H38123
$$ 2109052 2044687 -2968402 -1065618 -3577744 1270592 4069534 516844 -2959092 838123
1455C67099J737410D27124b386034C601602g0697B48177L60996g262553H245769
$$ 367099 2104509 427124 -2386034 3601602 -70697 248177 609173 -7262553 8245769
1445F43617d336461R23865B884817H48338C95242c052511a522864C13050P05432
$$ 643617 -4336461 -3412596 2884817 848338 395242 -3052511 -1522864 313050 1018482
1436A018482a095884o121040h00940m52147C901954a525455o190773F79902P82102
$$ 1018482 -1095884 -7216924 -800940 -1253087 3901954 -1525455 -7716228 679902 1462004
1427A462004n9419a177027D473349a023702G84158J08561b930319B821504m1138
$$ 1462004 1402585 -1177027 4473349 -1023702 784158 892719 -2930319 2821504 2780366
1418B780366g82400C62453J228037k74731F46689J00338P27977d210132G06857
$$ 2780366 -782400 362453 1590490 1315759 646689 747027 1475004 -4210132 706857
1408B867056r28810a924011O58057k680148C273143L809746d30536l348970C395193
$$ 2867056 1938246 -1924011 -1265954 -3946102 3273143 7082889 -430536 -3779506 3395193
1398c257240C48720a825100F71295J857925J597665a943624k176864B630101e95480
$$ -3257240 348720 -1825100 671295 2529220 4126885 -1943624 -4120488 2630101 -595480
1388C054026a328923n85656j515803B397996c257240B389903p19277A64539b065390
$$ 3054026 -1328923 -1914579 -3430382 2397996 -3257240 2389903 1670626 164539 -2065390
1378h37103B032577r4604g83497A575135J879848J65080c589325E948987a841060
$$ -837103 2032577 1937973 -783497 1575135 3454983 3620063 -3589325 5948987 -1841060
1368a295976D30076Q24154K590598c736096D971549b309122D57223i13963B90020
$$ -1295976 430076 1254230 3844828 -3736096 4971549 -2309122 457223 -913963 290020
1358c241833B403462h179471c722581E53217P17419a328556C723743H70697b322838
$$ -3241833 2403462 -8179471 -3722581 553217 1270636 -1328556 3723743 870697 -2322838
1348G760435a057790j134494C576761d250770B82999L3500c233972C768473I19845
$$ 7760435 -1057790 -2192284 3576761 -4250770 282999 316499 -3233972 3768473 919845
1338i49540j242455M71830G080436A70351P97788a689879A76382i27687b14529
$$ -949540 -2191995 -1720165 7080436 170351 968139 -1689879 176382 -927687 -214529
1328A764833b172430Q10011E079410e586738E857508k41550F20903c226523G91351
$$ 1764833 -2172430 -1362419 5079410 -5586738 5857508 5615958 620903 -3226523 791351
1318A533305d133343d66180C40015g89762A079727J062183a042373B110982a425745
$$ 1533305 -4133343 -466180 340015 -789762 1079727 2141910 -1042373 2110982 -1425745
1308B27271b253635Q70715k39857q16082C270786n46911f58457A287645j95294
$$ 227271 -2253635 -1382920 -1622777 -2438859 3270786 2723875 -658457 1287645 1092351
1299A092351K867272c645129n34840B148483J45144d838744J942309J355363j09307
$$ 1092351 3959623 -3645129 -4179969 2148483 2293627 -4838744 -2896435 -1541072 -1650379
1290a650379I07836Q17184d271332h4643B341749g76801b75204m16427B924378
$$ -1650379 907836 1725020 -4271332 -84643 2341749 -776801 -275204 -691631 2924378
1280c185291b52708B861747J741074A096150d09798A692452e399277a81639j207276
$$ -3185291 -252708 2861747 4602821 1096150 -409798 1692452 -5399277 -181639 -1388915
1271a388915c40840F1066b191587J022443A42831b944963a173945B361823e29142
$$ -1388915 -340840 61066 -2191587 -1169144 142831 -2944963 -1173945 2361823 -529142
1261b959763B162823Q18528G29212Q45047J86272q51188k89994J438625B95778
$$ -2959763 2162823 2981351 729212 1574259 1760531 909343 619349 2057974 295778
1251A020807b105833g73003o50582E85162a576912E200730c945035i63883q95195
$$ 1020807 -2105833 -773003 -1423585 585162 -1576912 5200730 -3945035 -963883 -1859078
1242a859078k62371P84970Q4037O10751j346594B743514e463734C980775d351514
$$ -1859078 -2121449 -1336479 -1252442 -641691 -1988285 2743514 -5463734 3980775 -4351514
1232D596205g890243A449926e6812q7602j393512e47678Q5162B335549E06931
$$ 4596205 -7890243 1449926 -56812 -144414 -1537926 -547678 -462516 2335549 506931
1222d227270E015027B454109a511653G924737c707113B70724h23636j935210m8766
$$ -4227270 5015027 2454109 -1511653 7924737 -3707113 270724 -823636 -2758846 -2807612
1213b807612B44770M83675a926625B327574b34657B698609A57316b109103j110947
$$ -2807612 244770 728445 -1926625 2327574 -234657 2698609 157316 -2109103 -3220050
1204c220050I6111g058412B221528c472547p82769A448796e017554C292513j516403
$$ -3220050 96111 -7058412 2221528 -3472547 -4255316 1448796 -5017554 3292513 1776110
1195A776110d477408A799721F3407N117119A034199i24145C882365f95431G50472
$$ 1776110 -4477408 1799721 63407 5180526 1034199 -924145 3882365 -695431 750472
1185c209032B768645A155979K252661b544279A012049a34380k875502E07532a54638
$$ -3209032 2768645 1155979 3408640 -2544279 1012049 -134380 -3009882 507532 -154638
1175A261748R62785E85989f41925F49274R59463c15202m068980A002488d52899
$$ 1261748 2224533 585989 -641925 649274 1608737 -315202 -4384182 1002488 -452899
1165A054596e366880H14574K783607a293398j929858a61101q88684G43382a242862
$$ 1054596 -5366880 814574 3598181 -1293398 -3223256 -161101 -1049785 743382 -1242862
1155d57720n73274B29572a55715B268971A3332c724333C521766b807986B474081
$$ -457720 -1030994 229572 -155715 2268971 13332 -3724333 3521766 -2807986 2474081
1145a706275B68154a953967a20884A528490n11546L054834h1621C377884i23881
$$ -1706275 268154 -1953967 -120884 1528490 1016944 4071778 -81621 3377884 -923881
1135b536303b56605j749183P99350C831186e050849i75711C938969d902267G9528
$$ -2536303 -256605 -2005788 -1206438 3831186 -5050849 -975711 3938969 -4902267 79528
1125D059649l66993e423854B280559a548392C789778a74617m027812m79864A761234
$$ 4059649 3692656 -5423854 2280559 -1548392 3789778 -174617 -4202429 -4682293 1761234
1115a961495E26057k26718c68142A094884n46239G0355a711203I92447b94307
$$ -1961495 526057 299339 -368142 1094884 548645 70355 -1711203 992447 -294307
1105i35195E834032b631917E404156b639884B893881a969002b52216D328831h00250
$$ -935195 5834032 -2631917 5404156 -2639884 2893881 -1969002 -252216 4328831 -800250
1095F42023J089053K78279e33138r06620I13311j74773e577777A691606f519112
$$ 642023 1731076 2009355 -533138 -1439758 913311 738538 -5577777 1691606 -6519112
1085B098128B3360K088175b386198E272089b15434E85322b105218l491744b567868
$$ 2098128 23360 2111535 -2386198 5272089 -215434 585322 -2105218 -5596962 -2567868
1075B486174a57902E146799h11400j041068C446053c274032J068051C281336q24682
$$ 2486174 -157902 5146799 -811400 -1852468 3446053 -3274032 -2205981 3281336 2456654
1066B456654E45226M00406g909130a030485A301779a140762N1364D879307c023010
$$ 2456654 545226 945632 -7909130 -1030485 1301779 -1140762 -1089398 4879307 -3023010
1056e761319a820061B972588a345678F532321c449040b39960k12943Q491A105608
$$ -5761319 -1820061 2972588 -1345678 6532321 -3449040 -239960 -452903 -444412 1105608
1046b616675N80595B672092b236676D988296a584032F734O901014c533641D23299
$$ -2616675 -2036080 2672092 -2236676 4988296 -1584032 6734 6907748 -3533641 423299
1036B359924f02886C064638a719719D474653b755915j322992e99406D226555b137516
$$ 2359924 -602886 3064638 -1719719 4474653 -2755915 -4078907 -599406 4226555 -2137516
1026a135416B176920O37307b673616B221585e686498g23672m720283B066107a690628
$$ -1135416 2176920 2814227 -2673616 2221585 -5686498 -723672 -5443955 2066107 -1690628
1016a005367E54133a76632A334532a478667C050170H78931c329222d72686k395099
$$ -1005367 554133 -176632 1334532 -1478667 3050170 878931 -3329222 -472686 -2867785
1007b867785C618224h99181A310697b161551p23263B508398N92842b109928k48529
$$ -2867785 3618224 -899181 1310697 -2161551 -2884814 2508398 3101240 -2109928 -2358457
998b358457B84477d880269D234600E19801b475093B312920a599088A886832K26921
$$ -2358457 284477 -4880269 4234600 519801 -2475093 2312920 -1599088 1886832 2113753
989B113753b478059A485684L78197D46306Q6936a49826j810849D24323J887646
$$ 2113753 -2478059 1485684 1863881 446306 533242 -149826 -1960675 424323 2311969
980B311969B52824d121925E871400b952990D72434b298498F057065f48219A371951
$$ 2311969 252824 -4121925 5871400 -2952990 472434 -2298498 6057065 -648219 1371951
970B011937O9882c040006n189335A725673K23317a431667O34161C057699h43055
$$ 2011937 2081819 -3040006 -8229341 1725673 1948990 -1431667 -797506 3057699 -843055
960G51779L512947c845768G31057L323346a568188C706695D5165a349392A09893
$$ 751779 4264726 -3845768 731057 4054403 -1568188 3706695 45165 -1349392 109893
950C386147j448756r536c663509A110266M635823A258114J263723c159573p60575
$$ 3386147 1937391 1927855 -3663509 1110266 5746089 1258114 2521837 -3159573 -3920148
941c920148B361777c01962k572448C966386C06831R69026b575187A592281B57271
$$ -3920148 2361777 -301962 -2874410 3966386 306831 1275857 -2575187 1592281 257271
931A566281b713296d72479A329239d95178C314676c815605A50564K36407j65077
$$ 1566281 -2713296 -472479 1329239 -495178 3314676 -3815605 150564 386971 221894
922B21894M52627b499472i94238j432820J07140A436750b546895j047726B778658
$$ 221894 674521 -2499472 -994238 -2427058 -2319918 1436750 -2546895 -3594621 2778658
912a079192K13753B184661F35754J84988d453915D151787B043295f82710j258580
$$ -1079192 -865439 2184661 635754 820742 -4453915 4151787 2043295 -682710 -1941290
903a941290D085567A112437c02820j050088D472751G2029b598665B110560r23214
$$ -1941290 4085567 1112437 -302820 -1352908 4472751 72029 -2598665 2110560 1187346
894A187346a350665j392118C626815C10939e514861F396839c855354B387567d943190
$$ 1187346 -1350665 -2742783 3626815 310939 -5514861 6396839 -3855354 2387567 -4943190
884D103990C57773M77014A87087c15298E345080c309589j47539r85170B855381
$$ 4103990 357773 834787 187087 -315298 5345080 -3309589 -3457128 -4442298 2855381
874H4330J567694c584011O13459j76303G77733a621542O57162l4651k607555B447302
$$ 84330 1652024 -3584011 -2970552 -3146855 777733 -1621542 -964380 -999031 -3606586 2447302
863C492645H8367a09222D2520e14090C839125A634503K084170c669557E314336
$$ 3492645 88367 -109222 42520 -514090 3839125 1634503 3718673 -3669557 5314336
853e443151B218342a42605j834316h60372A998814b490421a017054F373624c882201
$$ -5443151 2218342 -142605 -1976921 -860372 1998814 -2490421 -1017054 6373624 -3882201
843C144518e093088A85292a788745C062658a419179j247392F41644d40372k384023
$$ 3144518 -5093088 185292 -1788745 3062658 -1419179 -2666571 641644 -440372 -2824395
834b824395j113778L58732a542927B937970H04391J082808a493853C316507b8942
$$ -2824395 -3938173 -3579441 -1542927 2937970 804391 1887199 -1493853 3316507 -28942
824b930753J183429B063465l29407c681152a371032H31257l90244M252029f645613
$$ -2930753 -1747324 2063465 1734058 -3681152 -1371032 831257 441013 4693042 -6645613
814d552332b12655E66610B14434a268686d52057A48581N35656Q8032h28477A74533
$$ -4552332 -212655 566610 214434 -1268686 -452057 148581 684237 772269 -828477 174533
803i2880H4773f354867G75804c81053D509755A921158B70397a392804C656707
$$ -92880 84773 -6354867 775804 -381053 4509755 1921158 270397 -1392804 3656707
793e764556E726008A523894h500137C021509e151834E562041A459849b286158
$$ -5764556 5726008 1523894 -8500137 3021509 -5151834 5562041 1459849 -2286158
784b946683D795152d605813b49517D810516a913710f44804k972979A322966k44928
$$ -2946683 4795152 -4605813 -249517 4810516 -1913710 -644804 -3617783 1322966 1078038
775A078038b148939i871B624272a76648j732024j93035A125571b439511P40229
$$ 1078038 -2148939 -9871 2624272 -176648 -1908672 -2101707 1125571 -2439511 -1699282
766a699282F063856E7703N6284K589249d548986J761017D798670e89538l529118
$$ -1699282 6063856 57703 113987 2703236 -4548986 -2787969 4798670 -589538 -4118656
757d118656G82459K338778c190561P53126f15548j075089B765722c661116B039935
$$ -4118656 782459 3121237 -3190561 -2437435 -615548 -1690637 2765722 -3661116 2039935
747C36502L52877b753045a59251j028488F9564c444162A98830K007403A51906
$$ 336502 689379 -2753045 -159251 -1187739 69564 -3444162 198830 2206233 151906
737a372681B419590j074269o41733C0070h92982j135585A696915g987769a418540
$$ -1372681 2419590 1345321 703588 30070 -892982 -2028567 1696915 -7987769 -1418540
727H60855K237837r09279G28391J427390G82443b63850A679792c067285q17809
$$ 860855 3098692 2189413 728391 2155781 782443 -263850 1679792 -3067285 -3885094
718c885094A614325L690819c822523G53806a166260A026975b872530M92516M19869
$$ -3885094 1614325 5305144 -3822523 753806 -1166260 1026975 -2872530 -2380014 -1960145
709a960145h77190A974605O00944a683546B544425a648715A827994l24141i75744
$$ -1960145 -877190 1974605 2575549 -1683546 2544425 -1648715 1827994 1503853 -975744
699a0692943b812326k689342m224986A0593134P420668E381413j021134L797262
$$ -10692943 -2812326 -5501668 -9726654 10593134 18013802 5381413 4360279 8157541
691H157541C017261e862198j3289131Q906116k582888k354973B655455J5153304
$$ 8157541 3017261 -5862198 -19151329 -10245213 -12828101 -15183074 2655455 17808759
683A7808759G599307O410801n672183a0168170a912609G35321e47317j134362
$$ 17808759 7599307 14010108 8337925 -10168170 -1912609 735321 -547317 -1681679
675a681679M69888b91484B81594a051874B475313a887968c87393C17501K360420
$$ -1681679 -1211791 -291484 281594 -1051874 2475313 -1887968 -387393 317501 2677921
666B677921b848038j013621B921640b567176B241614a68741A0722258k452707
$$ 2677921 -2848038 -3861659 2921640 -2567176 2241614 -168741 10722258 8269551
658H269551a0225463d165734j4863386b699645m366682r610188G143925G14545
$$ 8269551 -10225463 -4165734 -19029120 -2699645 -7066327 -16676515 7143925 714545
649A5888128l133158n409773a538523j153539l311308a941687k018623m122618
$$ 15888128 12754970 7345197 -1538523 -2692062 -6003370 -1941687 -3960310 -8082928
641h082928b864674k988311A860727J0253010g8055l92347B068041D89798h17228
$$ -8082928 -2864674 -5852985 1860727 12113737 -78055 -470402 2068041 489798 -817228
631e508354e92157F76217M267570C31386a439925D174485C93861M863691e269743
$$ -5508354 -592157 676217 4943787 331386 -1439925 4174485 393861 5257552 -5269743
621B350979c375020J99662C432413f48924A304964a448082B315742d840154B632704
$$ 2350979 -3375020 -3175358 3432413 -648924 1304964 -1448082 2315742 -4840154 2632704
611A174483n68999b25551B678932J515073J4628575J1968139D846234a44051120
$$ 1174483 605484 -225551 2678932 4194005 18822580 30790719 4846234 -144051120
602e3097738A4819278N9534967A2844769D094865N233291B459396R29258n96836
$$ -53097738 14819278 74354245 12844769 4094865 9328156 2459396 3388654 2791818
594B791818K092084K286904A108579n7031B7274a985989B386113a14480k29751
$$ 2791818 4883902 7170806 1108579 1051548 27274 -1985989 2386113 -114480 -344231
585c44231D910405A382322a793286E292236C39198M638222a041898j302726D536083
$$ -344231 4910405 1382322 -1793286 5292236 339198 4977420 -1041898 -2344624 4536083
575C281114K02275e197058g52520m807701C289533c803100a169030J47412k386281
$$ 3281114 3483389 -5197058 -752520 -5560221 3289533 -3803100 -1169030 -1021618 -3407899
566c407899A819883e961308a707479D050087a284058B81965g34414D04772M078102
$$ -3407899 1819883 -5961308 -1707479 4050087 -1284058 281965 -734414 404772 4482874
557D482874c81980K3484B326090d353417i94606l384C055042J384096B208606
$$ 4482874 -381980 -358496 2326090 -4353417 -994606 -997990 3055042 4439138 2208606
547a184547c19179j113070A929999a187751I74616a071166H16376b709391C354089
$$ -1184547 -319179 -1432249 1929999 -1187751 974616 -1071166 816376 -2709391 3354089
537e791864a626624A730509f172597A746622a981042j008019A34806N28659Q89228
$$ -5791864 -1626624 1730509 -6172597 1746622 -1981042 -2989061 134806 663465 1552693
528A552693c093022a467569B151650b769492C958572A077181M77008a504930A64485
$$ 1552693 -3093022 -1467569 2151650 -2769492 3958572 1077181 1554189 -1504930 164485
518a194937B558660b89557D072621g9372K1965A572499a83672j044600j693556
$$ -1194937 2558660 -289557 4072621 -79372 -57407 1572499 -183672 -1228272 -2921828
509b921828a390419J02113D216007a582399D231299b660338B699646g18613k230864
$$ -2921828 -1390419 -1288306 4216007 -1582399 4231299 -2660338 2699646 -718613 -2949477
500b949477A185667J616881b717789K96942c01916C267410c208190J408956B740328
$$ -2949477 1185667 2802548 -2717789 -2420847 -301916 3267410 -3208190 -1799234 2740328
490C338469q41635a802474J61085O04766I76229e415647D219405b933044N32825
$$ 3338469 2496834 -1802474 -1641389 -1036623 976229 -5415647 4219405 -2933044 -2400219
481b400219J077509B156859J81437b978522G83304b505179A353859M543988E28755
$$ -2400219 -1322710 2156859 2338296 -2978522 783304 -2505179 1353859 5897847 528755
471b954887h88536A226974M37842L82157F36847J685498e11796a10332j189601
$$ -2954887 -888536 1226974 1664816 2046973 636847 2322345 -511796 -110332 -1299933
462a299933I21227K532384d933425E912624k929988a713972I73186J672410c042513
$$ -1299933 921227 3453611 -4933425 5912624 2982636 -1713972 973186 2645596 -3042513
452D22826L255847q33820K84231f522960C346494A450876L27311b556083A589621
$$ 422826 3678673 2844853 3129084 -6522960 3346494 1450876 1778187 -2556083 1589621
442A34948L973016E80773b668746J270930e81760k41730A549281K53936H72541
$$ 134948 4107964 580773 -2668746 -1397816 -581760 -823490 1549281 1803217 872541
432a615419e01563F74865L378324f337963c087624D67409A75975j4078a357C543152
$$ -1615419 -501563 674865 4053189 -6337963 -3087624 467409 175975 161897 -1357 3543152
421a950855P29921B519618b933280D12764b384448A089022j12557D39328b41692
$$ -1950855 -1220934 2519618 -2933280 412764 -2384448 1089022 976465 439328 -241692
411a907479a31754B068157f659628E12848a934k266215A57193a282468A392369
$$ -1907479 -131754 2068157 -6659628 512848 -1934 -2268149 157193 -1282468 1392369
401h205428C802895H17880a701914A709348a887601R03011a52610I69159O27931
$$ -8205428 3802895 817880 -1701914 1709348 -1887601 -984590 -152610 969159 1597090
392A597090b138760o96027A418561J690080a102637q61768A214275g24410K16007
$$ 1597090 -2138760 -2834787 1418561 3108641 -1102637 -1964405 1214275 -724410 -508403
383e08403B157681a518839C50547J963403F159L262642d620392J981317c72892
$$ -508403 2157681 -1518839 350547 2313950 6159 3268801 -4620392 -2639075 -372892
373a066667h9881j424673B082594K706059g837318D762488c562876a304311k31425
$$ -1066667 -89881 -1514554 2082594 4788653 -7837318 4762488 -3562876 -1304311 -1535736
364a535736c05555k97754a8897C33045d520519A225289b98133B300773b107059
$$ -1535736 -305555 -603309 -18897 333045 -4520519 1225289 -298133 2300773 -2107059
354i09867A904915g37160p11422A391085P87053a236602A480393c005786h01295
$$ -909867 1904915 -737160 -1448582 1391085 2178138 -1236602 1480393 -3005786 -801295
344A557903i69869I98710a931822A746004k47862c38118j332418I296833c764178
$$ 1557903 -969869 998710 -1931822 1746004 1498142 -338118 -1670536 9296833 -3764178
334b850073D21381b123603E458324c59215j039264A61197K362475c381123B043513
$$ -2850073 421381 -2123603 5458324 -359215 -1398479 161197 2523672 -3381123 2043513
324I19510c921761C76606a396910K37318k212209A493682g93522A529934b945775
$$ 919510 -3921761 376606 -1396910 -1159592 -3371801 1493682 -793522 1529934 -2945775
314F84274a343110c73820p15392j218068A675646a814798A894500b311725B354433
$$ 684274 -1343110 -373820 -1089212 -2307280 1675646 -1814798 1894500 -2311725 2354433
304e015529B456306m45231a990318C778908j432789g939826C211972B51632b842515
$$ -5015529 2456306 2011075 -1990318 3778908 2346119 -7939826 3211972 251632 -2842515
294C373723L245629a554622o82529b86506l01993C77247K291590b093881F497637
$$ 3373723 6619352 -1554622 -2237151 -286506 -588499 377247 2668837 -2093881 6497637
284e794835c36768C09045c630322A205856k20564K493516a704652N58454k286042
$$ -5794835 -336768 309045 -3630322 1205856 985292 3478808 -1704652 -1146198 -3432240
275c432240B203626b783890D55652R7670a041808A253434J59705p3422a74895
$$ -3432240 2203626 -2783890 455652 553322 -1041808 1253434 1413139 1339717 -174895
265E075526e143532b209023K14362A217739L18075b99762B188815E0739i15287
$$ 5075526 -5143532 -2209023 -1994661 1217739 1535814 -299762 2188815 50739 -915287
255f71945r02853A988823i18342B605155c547647k6579C211881D72088A42262
$$ -671945 -1574798 1988823 -918342 2605155 -3547647 -3574226 3211881 472088 142262
245a710566j257156i97994B168718e01641a92488j563160B060719J20559a929893
$$ -1710566 -2967722 -997994 2168718 -501641 -192488 -1755648 2060719 2181278 -1929893
235B931144b598224C76588a202739B484190r73973a135869e60180n017415I80669
$$ 2931144 -2598224 376588 -1202739 2484190 1510217 -1135869 -560180 -5577595 980669
225a136914D993484d619297A107993g90349D45233B09574h98832j578941D308954
$$ -1136914 4993484 -4619297 1107993 -790349 445233 209574 -898832 -2477773 4308954
215c206365a143197b84556m72632o0732a03197F47703K183083b666008A64884
$$ -3206365 -1143197 -284556 -757188 -817920 -103197 647703 2830786 -2666008 164884
205b595588m43351E524399H09278Q10064b392405A349198a139756D39639P13926
$$ -2595588 -3038939 5524399 809278 1619342 -2392405 1349198 -1139756 439639 1153565
196A153565b052484q42949a344882O69076E39307R98736b615995j30712A256671
$$ 1153565 -2052484 -2895433 -1344882 -675806 539307 1538043 -2615995 -2746707 1256671
186A194847b832177b16323B170924J083718b583909C001349C95025O984960c159462
$$ 1194847 -2832177 -216323 2170924 3254642 -2583909 3001349 395025 7379985 -3159462
176a676267A788035a386028A592432F75904f370423j9137494n4682007A7488693
$$ -1676267 1788035 -1386028 1592432 675904 -6370423 -25507917 -80189924 17488693
167A5988695O3034713B7990411L6729290a3277920j975143n3148154a3578657
$$ 15988695 79023408 27990411 64719701 -13277920 -15253063 -68401217 -13578657
159D804797k375569e123396E00714L044608d369465C547168h00016A462254a055319
$$ 4804797 2429228 -5123396 500714 3545322 -4369465 3547168 -800016 1462254 -1055319
149c38342l64187A336906e37012C948215a550905K68044d46382B934676c067577
$$ -338342 -702529 1336906 -537012 3948215 -1550905 -1282861 -446382 2934676 -3067577
139d27645D332155A025683f35207l76774q89810p40010E03525M42846b17267A510820
$$ -427645 4332155 1025683 -635207 -1011981 -1901791 -2641801 503525 946371 -217267 1510820
128g91305n1294C78716K123867e816191A698270b747845A084545J374306k49249
$$ -791305 -842599 378716 2502583 -5816191 1698270 -2747845 1084545 2458851 2209602
119B209602d506789D954333b379303d29318B85433M526691c804677C560912a005854
$$ 2209602 -4506789 4954333 -2379303 -429318 285433 4812124 -3804677 3560912 -1005854
109a304683c38719l160159A974266J447932d058804a83182k818007e90698p95626
$$ -1304683 -338719 -3498878 1974266 3422198 -4058804 -183182 -3001189 -590698 -1386324
100a386324I63709K248787A088891l65135J990281K742141b145595H58797c190118
$$ -1386324 963709 3212496 1088891 723756 2714037 5456178 -2145595 858797 -3190118
90A065325c474905B653793k96246c160045a019041B560047q08651a949803k39217
$$ 1065325 -3474905 2653793 2357547 -3160045 -1019041 2560047 1751396 -1949803 -2189020
81b189020C170913e538032B416460B20523l9694J335586P41407f677002E879979
$$ -2189020 3170913 -5538032 2416460 220523 180829 1516415 2257822 -6677002 5879979
71C27082g0800B398682d65371l463850B163953b25385l9629C78350M79979c149288
$$ 327082 -70800 2398682 -465371 -3929221 2163953 -225385 -265014 378350 858329 -3149288
60B307365b040090F908945e262627A378793a36796D121012b326532a136249C13645
$$ 2307365 -2040090 6908945 -5262627 1378793 -136796 4121012 -2326532 -1136249 313645
50D89517J061191Q48528F03892K709463j619780d068621C090196I66602a871792
$$ 489517 1550708 2399236 603892 3313355 1693575 -4068621 3090196 966602 -1871792
40a012971A179010c206852C566948e724247a899709F86230e5219I6045J63239
$$ -1012971 1179010 -3206852 3566948 -5724247 -1899709 686230 -55219 96045 259284
31B59284g32370p66325A828103a830731G69701b441342B456333j019006b778580
$$ 259284 -732370 -1498695 1828103 -1830731 769701 -2441342 2456333 1437327 -2778580
21d001615J520712D97490e50900A080986a414113l68414D660033b339090a160199
$$ -4001615 -2480903 497490 -550900 1080986 -1414113 -1782527 4660033 -2339090 -1160199
11C83301O65200g09661I97016J170422o43350c750940J167093G37224K947100
$$ 383301 1048501 -709661 997016 2167438 1524088 -3750940 -2583847 737224 3684324
2C684324F62379e005574
$$ 3684324 662379 -5005574
##PAGE= F1=5553.385520115
##FIRST=     21204.543296753, 2658.27584773936, -234237
##DATA TABLE= (F2++(Y..Y)), PROFILE
2047b34237o90101A379377A46023O86011a191091k832407H69614J047782M94706
$$ -234237 -924338 1379377 146023 832034 -1191091 -4023498 869614 1917396 2412102
2038B412102b23j070452j700725C508423d70385A412845L820590A1991h99418
$$ 2412102 -223 -1070675 -2771400 3508423 -470385 1412845 5233435 11991 -899418
2028a564146A769776d988492B053134H6903i9713j196142C347521D86113P34717
$$ -1564146 1769776 -4988492 2053134 86903 -99713 -1295855 3347521 486113 1220830
$$ [...]
##END NTUPLES=nD NMR SPECTRUM
##END=
