##TITLE=Analysis number 325250
Compound Code cc 59516
Book Reference 508/32
Project Code adrs
Chemist Name antons
##JCAMPDX= 6.0         $$ Bruker NMR JCAMP-DX V2.0
##DATA TYPE= NMR SPECTRUM
##DATA CLASS= NTUPLES
##ORIGIN= Bruker BioSpin GmbH
##OWNER= nmr
$$ XWIN-NMR		Version 3.5
$$ Fri Dec 15 09:46:51 2006 GMT Standard Time (UT+0h)  MAYBRIDGE\nmr@NMR_250MHZ
##.OBSERVE FREQUENCY= 250.131544655141
##.OBSERVE NUCLEUS= ^1H
##.ACQUISITION MODE= SIMULTANEOUS (DQD)
##.ACQUISITION SCHEME= undefined
##.AVERAGES= 16
##.DIGITISER RES= 18
##SPECTROMETER/DATA SYSTEM= dpx250
##.PULSE SEQUENCE= zg30
##.SOLVENT NAME= CDCl3
##.SHIFT REFERENCE= (INTERNAL, CDCl3, 0, 16.5325)
##AUDIT TRAIL= $$ (NUMBER, WHEN, WHO, WHERE, WHAT)
$$ ##TITLE= Audit trail, XWIN-NMR		Version 3.5
$$ ##JCAMPDX= 5.01
$$ ##ORIGIN= Bruker BioSpin GmbH
$$ ##OWNER= nmr
$$ C:\u/data/dgb/nmr/ADRS/1740/pdata/1/auditp.txt
$$ ##AUDIT TRAIL=  $$ (NUMBER, WHEN, WHO, WHERE, WHAT)
(   1,<2006-12-15 09:46:08.80 +000>,<MAYBRIDGE\nmr>,<NMR_250MHZ>,
      <created by zg, POWCHK disabled, PULCHK disabled
       configuration hash MD5:
       49 4B E0 1D 92 C2 6B 37 9F E6 65 BC 52 41 86 1D
       data hash MD5: 64K
       3D 2C 8A 07 A0 01 2C 82 CE D0 F0 D5 69 A3 82 36>)
(   2,<2006-12-15 09:46:30.21 +000>,<MAYBRIDGE\nmr>,<NMR_250MHZ>,
      <Start of raw data processing
       ef LB = 0.3 FT_mod = 6 PKNL = 1 SI = 32K 
       data hash MD5: 32K
       9F 49 F6 7B 9B 63 A6 F2 28 2E 4D 3E F4 A4 94 E4>)
(   3,<2006-12-15 09:46:34.58 +000>,<MAYBRIDGE\nmr>,<NMR_250MHZ>,
      <apk 
       data hash MD5: 32K
       7C 3C 62 F9 67 C6 AD F0 95 24 A5 97 04 67 7E 81>)
(   4,<2006-12-15 09:46:36.00 +000>,<MAYBRIDGE\nmr>,<NMR_250MHZ>,
      <abs ABSG = 5 
       data hash MD5: 32K
       19 AF 9F 2A B4 99 48 62 6A 6D FD D4 EA 7B 3C A6>)
$$ ##END=
$$ 
$$ hash MD5
$$ 6B 0D 9B C5 5D 31 F7 F3 8A 08 8A 0A 1E A0 16 C1
##$RELAX= 
##$RELAX= 
##$RELAX= 
##$RELAX= 
##$RELAX= 
##$RELAX= 
##$RELAX= 
$$ Bruker specific parameters
$$ --------------------------
##$DU= <C:\u>
##$EXPNO= 1740
##$NAME= <ADRS>
##$PROCNO= 1
##$TYPE= <nmr>
##$USER= <dgb>
##$AMP= (0..31)
100 100 100 100 100 100 100 100 100 100 100 100 100 100 100 100 100 100 
100 100 100 100 100 100 100 100 100 100 100 100 100 100 
##$AQSEQ= 0
##$AQ_mod= 3
##$AUNM= <au_zg>
##$AUTOPOS= <55 >
##$BF1= 250.13
##$BF2= 250.13
##$BF3= 250.13
##$BF4= 250.13
##$BF5= 500.13
##$BF6= 500.13
##$BF7= 500.13
##$BF8= 500.13
##$BYTORDA= 1
##$CFDGTYP= 0
##$CFRGTYP= 5
##$CHEMSTR= <none>
##$CNST= (0..31)
1 1 145 1 1 1 1 1 1 1 1 1 1 1 1 1 1 1 1 1 1 1 1 1 1 1 1 1 1 1 1 1 
##$CPDPRG= <>
##$CPDPRG1= <>
##$CPDPRG2= <>
##$CPDPRG3= <>
##$CPDPRG4= <mlev>
##$CPDPRG5= <mlev>
##$CPDPRG6= <mlev>
##$CPDPRG7= <mlev>
##$CPDPRG8= <mlev>
##$CPDPRGB= <>
##$CPDPRGT= <>
##$D= (0..31)
0 1 0 0 0 0 0 0 0 0.06 0 0 0 0 0 0 0.0002 0 0 0 0 0 0 0 0 0 0 0 0 0 0 
0 
##$DATE= 1166175966
##$DBL= (0..7)
120 120 120 120 120 120 120 120 
##$DBP= (0..7)
150 150 150 150 150 150 150 150 
##$DBP07= 0
##$DBPNAM0= <>
##$DBPNAM1= <>
$$ [...]
##$SUBNAM7= <"">
##$SUBNAM8= <"">
##$SUBNAM9= <"">
##$SW= 20.6930455092707
##$SWIBOX= (0..15)
0 0 3 0 0 0 0 0 0 0 0 0 0 0 0 0 
##$SW_h= 5175.983436853
##$TD= 65536
##$TD0= 1
##$TE= 295.16
##$TE2= 300
##$TE3= 300
##$TEG= 300
##$TL= (0..7)
0 120 120 120 120 120 120 120 
##$TP= (0..7)
150 150 150 150 150 150 150 150 
##$TP07= 0
##$TPNAME0= <>
##$TPNAME1= <>
##$TPNAME2= <>
##$TPNAME3= <>
##$TPNAME4= <>
##$TPNAME5= <>
##$TPNAME6= <>
##$TPNAME7= <>
##$TPOAL= (0..7)
0.5 0.5 0.5 0.5 0.5 0.5 0.5 0.5 
##$TPOFFS= (0..7)
0 0 0 0 0 0 0 0 
##$TUNHIN= 0
##$TUNHOUT= 0
##$TUNXOUT= 0
##$USERA1= <user>
##$USERA2= <user>
##$USERA3= <user>
##$USERA4= <user>
##$USERA5= <user>
##$V9= 5
##$VALIST= <valist>
##$VCLIST= <CCCCCCCCCCCCCCC>
##$VD= 0
##$VDLIST= <DDDDDDDDDDDDDDD>
##$VPLIST= <PPPPPPPPPPPPPPP>
##$VTLIST= <TTTTTTTTTTTTTTT>
##$WBST= 1024
##$WBSW= 4
##$XGAIN= (0..3)
0 0 0 0 
##$XL= 0
##$YL= 0
##$YMAX_a= 463887
##$YMIN_a= -421438
##$ZGOPTNS= <>
##$ZL1= 120
##$ZL2= 120
##$ZL3= 120
##$ZL4= 120
##$ABSF1= 16.5325
##$ABSF2= -4.160675
##$ABSG= 5
##$ABSL= 3
##$ALPHA= 0
##$AQORDER= 0
##$ASSFAC= 0
##$ASSFACI= 0
##$ASSFACX= 0
##$ASSWID= 0
##$AUNMP= <proc_1d>
##$AZFE= 0.1
##$AZFW= 0.1
##$BCFW= 0
##$BC_mod= 0
##$BYTORDP= 0
##$COROFFS= 0
##$CY= 12.5
##$DATMOD= 1
##$DC= 0
##$DFILT= <>
##$DTYPP= 0
##$F1P= 14.0000005364418
##$F2P= -0.99999901652339
##$FCOR= 0.5
##$FTSIZE= 32768
##$FT_mod= 6
##$GAMMA= 0
##$GB= 0
##$INTBC= 1
##$INTSCL= 1
##$ISEN= 128
##$LB= 0.3
##$LEV0= 0
##$LPBIN= 0
##$MAXI= 10000
##$MC2= 0
##$MEAN= 0
##$ME_mod= 0
##$MI= 0
##$NCOEF= 0
##$NC_proc= -2
##$NLEV= 6
##$NOISF1= 0
##$NOISF2= 0
##$NSP= 0
##$NTH_PI= 0
##$NZP= 0
##$OFFSET= 16.5325
##$PC= 1
##$PHC0= 223.6435
##$PHC1= 6.310165
##$PH_mod= 1
##$PKNL= yes
##$PPARMOD= 0
##$PSCAL= 4
##$PSIGN= 0
##$REVERSE= no
##$SF= 250.129997373364
##$SI= 32768
##$SIGF1= 0
##$SIGF2= 0
##$SINO= 400
##$SIOLD= 32768
##$SREGLST= <1H.CDCl3>
##$SSB= 0
##$STSI= 32768
##$STSR= 0
##$SW_p= 5175.98343685301
##$SYMM= 0
##$S_DEV= 0
##$TDeff= 65536
##$TDoff= 0
##$TI= <Analysis number 999999
Compound Code 99
Book Reference 9
Project Code 9>
##$TILT= no
##$TM1= 0
##$TM2= 0
##$TOPLEV= 0
##$USERP1= <user>
##$USERP2= <user>
##$USERP3= <user>
##$USERP4= <user>
##$USERP5= <user>
##$WDW= 1
##$XDIM= 32768
##$YMAX_p= 355340977
##$YMIN_p= -26950
$$ End of Bruker specific parameters
$$ ---------------------------------
##NTUPLES= NMR SPECTRUM
##VAR_NAME=  FREQUENCY,     SPECTRUM/REAL,   SPECTRUM/IMAG
##SYMBOL=    X,             R,               I
##VAR_TYPE=  INDEPENDENT,   DEPENDENT,       DEPENDENT
##VAR_FORM=  AFFN,          ASDF,            ASDF
##VAR_DIM=   32768,         32768,           32768
##UNITS=     HZ,            ARBITRARY UNITS, ARBITRARY UNITS
##FACTOR=    0.157963299565203, 1,           1
##FIRST=     4135.2740098245, 0,             0
##LAST=      -1040.70942702851, 0,           0
##MIN=       -1040.70942702851, -26950,      0
##MAX=       4135.2740098245, 355340977,     0
$$ Real data points
##PAGE= N=1
##DATA TABLE= (X++(R..R)), XYDATA
$$ [...]
16894C317l249L465P180m757L64j352K523K087K354n084o484L546n684n711J612
16879e873O490L871k648l586l490K818j828k337k36J935l582l53m158n170J257
16864a6890O783K354j414m923qJ62n258k430N449N460L718l009m895R74k08M516
16848i619Q452k261p11J103k919J390r77p21M58l77j870N226N606k695n745L632
16832b028j9K366J0037M75j1532k148L382M998O23q270k311k338k397K021M89
16817f652O078K367m489j53m312K589K672j734O115N796L131J104n146j087k613
16802C666j974N96M873L136j709l097o758p370j536M774j527L339N250m018o082
16787h437R724j746m557J671J470J149k179j254p65M297R850K551p555n798L547
$$ y = [3317, 68, 3533, 10713, 5956, 6320, 4968, 7491, 9578, 11932, 6848, 364, 3910, -1774, -7485, -5873, 617, 4488, 1840, -1746, -5236, -2418, -4246, -6583, -6819, -4884, -8466, -8819, -12977, -18147, -16890, -10107, -7753, -9167, -14090, -14098, -13936, -19194, -21624, -16175, -10715, -6997, -10006, -14901, -13927, -14135, -9619, -1167, -3428, -4139, -3036, -5955, -4565, -5542, -6263, -5805, -6182, -8052, -2826, 2780, 85, -5660, -2028, -2047, 319, 10356, 10831, -701, -2849, 533, 5531, 6154, -2116, -4427, -6765, -9162, -7141, -6652, -574, 1793, -2696, -2849, -7161, -4572, -1900, -3634, 2481, 8277, 11408, 12512, 7366, 6279, 3666, 1692, 2288, 7161, 10297, 8588, 5491, -1267, -8637, -10173, -5399, -6926, -3587, 1663, -2355, -8437, 1287, -459, -5016, -3345, -1875, -726, -2905, -4159, -4924, -627, 9223, 11774, 4219, -1579, 1968]
16772A968q78r94q971o140n45j079M666R677J541J225n58n050m364j583J258N712
16756d115L124m354J248J761P46K935k014j806K709m207O233P177o71q067n080
16741d381M341q85p117k260O65k232m235k826j371K103P265R93n26j874K394K235
16725g711K156r749K724Q786L274n555M6p712K839N731M649L443J203k487p666
16710f029j668L430m234N433N104J385j824K801P29q770l952k668M895p447m258
16695a7073J370M06O914L595m762O624j838p72k349m051J605K262M998J798M31
16680h42k35J462L182n794j725K972j433m925p744M385N706J528M92k632o96j04
16664f403l183R367l416J41K121k172Q12l330k185l786m67Q47L555P26l81M100
$$ y = [1968, 1090, 96, -8875, -15015, -15560, -16639, -11973, -2296, -755, 470, -88, -5138, -9502, -11085, -9827, -4115, -991, -5345, -4097, -2336, -1590, 1345, -669, -2475, 234, -3973, 2260, 9437, 8766, 699, -4381, -40, -925, -8042, -10302, -9637, -11869, -16104, -18930, -20301, -18198, -10933, -9940, -10466, -12340, -9946, -7711, -5555, -15304, -12580, -3794, -520, -6075, -6029, -13741, -10902, -5171, -522, 2921, 4124, 1637, -6029, -7697, -4267, -8501, -3068, 2036, 3421, 1597, 4398, 5127, -3643, -7595, -10263, -5368, -12815, -17073, -15703, -15297, -8383, -4788, -9550, -2926, -4764, -5536, -7885, -11936, -10331, -8069, -3071, -1273, -842, -1077, 385, 3567, -2227, -3952, -980, -2413, -7338, -15082, -10697, -4991, -3463, -2971, -5603, -6299, -6403, -9586, -219, -3635, -3494, -1373, -3545, -2733, -6063, -8248, -12034, -12501, -11654, -8099, -7373, -7754, -3654]
16648c654m389l533j511K594L224k938p14K908J37J149k39J361K82R34J865q472
16632a0996Q19k016o826N607R16n600J543M705J933J207k9j933m219J848N669
16617g372N446m485m5L346j730L267j849j452m246J411j362O14P138J047M322
16602D050k60j1846L071O19n953j277J730K31l499k046Q832Q237k94l342k242
16587c989L886L467j148J773m534n775n15J070j209l830m209O880J2604J61P6
16572D708l95J969n406n338J176M585L85n656M179M446j84j267n664J720R967
16557I225k670r809q605K495P055k376k935o381Q04L80Q319M1m033M530L82q169
16541a1747K008M433N968n523m801J558K90J442K896j637l13k239j168J379j170
$$ y = [-3654, -8043, -11576, -13087, -10493, -7269, -10207, -10921, -8013, -7876, -6727, -6966, -5605, -5323, -4389, -2524, -10996, -10177, -12193, -19019, -13412, -12496, -18096, -16553, -11848, -9915, -8708, -8737, -10670, -14889, -13041, -7372, -1926, -6411, -6456, -3110, -4840, -1573, -3422, -4874, -9120, -7709, -9071, -8457, -1319, -272, 4050, 3790, -8056, -4985, -4366, -10319, -11596, -9866, -9635, -13134, -15180, -6348, 1889, 1595, -1747, -3989, -103, 3364, 2216, 3989, -545, -6320, -6835, -5765, -6974, -10804, -15013, -8133, 4471, 4632, 4708, 4313, 6282, 876, -4462, -3286, 1299, 1684, -3972, 207, 4653, 4469, 3202, -2462, -742, 9225, 6555, -3254, -11859, -9364, -2309, -4685, -7620, -14001, -13197, -12817, -4498, -4457, -8490, -3960, -3578, -11747, -9739, -5306, 662, -4861, -9662, -8104, -7814, -6372, -3476, -5113, -5426, -7665, -8833, -7454, -8624]
16526h624p809p203J601L348N095K288o75K596M110J0969K677l407L984m011m79
16511D460Q031j355o799m237j923k500l360L075m033K348j157k836K189p60q785
16496a7642l678P164L865l642P164Q387J566M718L80m551p470M316M512k845o029
16481c785m497M2J043K743l070j856N239J0494N642L82j1495k420M862J447R71
16466E742J28o186n251k958O506J6751k232o633k004K061j926j824m275j757j610
16451e468O37k65l239J819J297n493K501k331J452J468j945j399L421J0683n329
16436b191k354L629k390j2503l176K000K195K974K048N728l319j817j770J690
16422i256K409M836O95m31k837k696m041k124j036R313O743N334K729j373j883
$$ y = [-8624, -16433, -23636, -22035, -18687, -13592, -11304, -11979, -9383, -5273, 5696, 8373, 4966, 8950, 4939, 4460, 12491, 11136, 4337, 100, -1823, -4323, -7683, -4608, -8641, -6293, -7450, -10286, -8097, -8857, -17642, -21320, -14156, -10291, -13933, -6769, 1618, 3184, 7902, 8282, 3731, -3739, 577, 5089, 2244, -3785, -8282, -8240, -7197, -4454, -7524, -9380, -4141, 6353, 11995, 12377, 882, -1538, 3324, 4771, 5742, 5870, -316, -5567, -8525, -2019, 14732, 12500, 5867, 3863, 5924, 3998, 2174, -2101, -3858, -5468, -4831, -5096, -8335, -6516, -5219, -10712, -8211, -10542, -9090, -7622, -9567, -10966, -7545, 3138, -2191, -4545, -916, -3306, -15809, -18985, -16985, -14790, -11816, -9768, -4040, -7359, -9176, -10946, -9256, -6847, -2011, -1316, -1747, -4584, -7280, -11321, -13445, -14481, -5168, 1575, 6909, 9638, 8265, 6382]
16407F382P51n314J139o54m709o952J049J142O84L989J659K757K316j89J827l294
16391B583k688K839L87n000l615M168K1J521j793o164k256K821J148M989J250
16376B11j193m751k2k062K565L377m321M294P323k526Q5j165j093Q45J85l239
16360a487q963o602n97O720M415N28J380M115M949p183k317N03K273p71l240N29
16344e748K146J437N605j108l634K201L597L250n781o358K662O78p27O092J588
16329E900L27m441p132j749Q53K569N350j875J487k178J16J735q977n798M822
16314h991r8r8J2972M965l534m449O944k218l638j0075m145j110N680L04n959
16299a3450j268L429K040K066M397q299P23J980J792L430L992J333q29l342n439
$$ y = [6382, 7133, 1819, 2958, 2304, -2405, -9357, -8308, -7166, -6482, -2493, -834, 1923, 4239, 4050, 5877, 2583, -105, 2734, 3121, -1879, -5494, -1326, -1305, 216, -1577, -7741, -9997, -7176, -6028, -1039, 211, -982, -5733, -5755, -7817, -5252, -1875, -6196, -1902, 5421, 2895, 2980, 1815, 722, 1567, 1752, -1487, -10450, -17052, -17649, -10929, -6514, -5986, -4606, -491, 4458, -2725, -5042, -4539, -2266, -3037, -6277, -5748, -3602, -2165, 3440, 2332, -1302, 899, 4496, 7746, 1965, -4393, -1731, -1053, -1780, 4312, 5900, 6227, 1786, -5346, -7095, -6242, -3673, 1677, -198, 1289, -889, -773, 962, -8015, -13813, -8991, -9089, -9187, 3785, 8750, 5216, 767, 7711, 5493, 1855, -8220, -12365, -13475, -7795, -7491, -13450, -14718, -11289, -9249, -7183, -2786, -11085, -10362, -8382, -6590, -3160, 832, 2165, 1336, -2006, -7445]
16284g445l951j958m3M371O523P09J344o852n336M230R363L455M76K45m840p820
16268g529K45N751l940o329K07M523K791K222N790L944Q61m095j6684R45J0291
16253a007P387k587l607o031J617K791N506j973K121L010l200l912K016N741m629
16238C243m833j969O423k855j746m671j744M367o92L77K793M053m161k62P04J402
16222D29K90j581n319K448j673j414j413M62M633j696J087j269n597n374K821
16207a3166P163j181L426O433Rn321R56K238K136L602k843r613q08J952k196n434
16191a2647K301J1508J861l707n589L308k52R014K467q018o79K596l511j57L992
16176B487r995m909K638J3741l7j0856l030O219P125K037P48n879n454k339R395
$$ y = [-7445, -11396, -13354, -13397, -9026, -2503, -1794, -450, -7302, -12638, -8408, 955, 4410, 4886, 5131, 291, -7529, -7284, -1533, -5473, -11802, -11595, -7072, -4281, -2059, 3731, 7675, 8536, 4441, -12243, -11298, -1007, 6380, 3793, 186, -5845, -4228, -1437, 4069, 2096, 4217, 7227, 4027, 115, 2131, 7872, 3243, -1590, -3559, 2864, 9, -1737, -6408, -8152, -3785, -4477, -4100, -1307, 2746, -1415, -1677, -973, 429, 719, -862, -6181, -3733, -5406, -6820, -8233, -7771, -3138, -4834, -3747, -5016, -10613, -15987, -13166, -6003, -7184, -3758, 2675, 2684, -2637, -1681, 557, 2693, 6295, 3452, -6161, -6969, -5017, -7213, -12647, -10346, 1162, 3023, -684, -6273, -2965, -3217, 5797, 8264, 246, -433, 2163, -1348, -1505, 2487, -7508, -12417, -9779, 3962, 3925, -6931, -9961, -3742, 3383, 5420, 6168, 289, -5165, -7504, 1891]
16161A891K966m536j278j721K782N807m800k278N435j517l478j951p07l693m69
16146g547l313n352j200k951o587K882J0464M641L336j170O408L630O709k156
16132G794m408N255M259m922q164L611Q880J997j353k98l051N047j492j617k76
16117A1262K80o284n179n485R65P863L344p06m521j814J913K205j490k68l511
16102a426K186m401k53K799K451K702N05O75J534j478J266P159o784j904K256
16087G287n178J99L11j243k211k52O337j30n1l935o76K753j959k379O87L402J40
16070C102o60j124m436L421J1894R63m198k960L070L121p38K678j364R54n349
16055H374m965m554o415K72L343N37n199q11n46O347M998M864J744K219n718n929
$$ y = [1891, 4857, 321, -957, -2678, 104, 5911, 1111, -1167, 4268, 2751, -727, -2678, -3385, -7078, -7547, -10860, -16212, -17412, -20363, -26950, -24068, -13604, -8963, -5627, -6797, -389, 3241, 9950, 7794, 3386, 8641, 12900, 7978, -186, 3425, 12305, 14302, 12949, 12651, 9600, 14647, 13155, 11538, 11262, 11542, 5258, 79, -5406, -4441, 3422, 6766, 6060, 1539, -275, 1638, 3843, 2353, 2085, -1426, 760, -3641, -3894, -1095, 1356, 4058, 4563, 5238, 6772, 5294, 6560, 13719, 6935, 5031, 7287, 2109, 2308, 2619, 1376, -835, -1087, 5250, 5120, 5069, 1134, 458, 3211, 1252, -1127, -440, 2962, 3102, 2442, 1318, -3118, 303, 12197, 13160, 8962, 6002, 9072, 12193, 11455, 14133, 12769, 13723, 8374, 3409, -1145, -7560, -7288, -3945, -3408, -8607, -9418, -9964, -3617, 1381, 6245, 7989, 10208, 4490, -1439]
16039a439o571J057N611J089J466J235J837k031o806k143M250M070J840J276j821
16024B920k097K42N269M172k731j441j526j264R33o372n437r672M454Q54M525
16009g171J928K505k38n80J263m306j901k790K185K797Q76j588K770J583L348
15994F81l987k155K06q00N221k183m420o31M937L916k611M236J511m867K620j221
15978D53k65k295l104j440m296j987K952J915P240J107l008j376l76K868M71L168
15962B027K451j402L826k73J923n58k416J444j743j440n107n731k703N163k41
15947d780j901L112L426K946j107j476l143j0828K482N009N732L537n440K243
15933a88M517R80K402k409J187P825n386o767L56m22m23n507o462Q882k689L06
$$ y = [-1439, -8010, -6953, -1342, -253, 1213, 2448, 4285, 2254, -4552, -6695, -2445, 1625, 3465, 4741, 2920, 823, 1065, 6334, 10506, 7775, 6334, 4808, 3544, 4477, -1895, -7332, -17004, -12550, -11696, -7171, -5243, -2738, -2976, -3556, -2293, -6599, -8500, -11290, -9105, -6308, -5432, -7020, -4250, -2667, 681, -3306, -5461, -5255, -6055, -834, -3017, -7437, -8068, -3131, 785, -1826, 2410, 3921, -946, 1674, 453, 188, -2107, -5211, -6651, -10947, -12934, -9982, -8067, -827, 280, -2728, -4104, -4480, -1612, -1141, 2027, 4478, 3076, 6902, 6629, 8552, 7994, 5578, 7022, 5279, 3839, -1268, -6999, -9702, -4539, -4780, -6681, -3569, -143, 2803, 1696, 220, -2923, -13751, -11269, -6260, -528, 3009, -2431, -188, 4329, 5309, 7711, 5302, 6489, 14314, 8928, 2161, 2517, 2095, 1672, -3835, -10297, -1415, -4104, -3798]
15917c798j535n833k738R709M426o243l17J053m24M058R08K550k353N6L607l65
15901B761m914m945o847m614M924l791N22R116K09N08l42l008l014R348M715j195
15885e67p425L299J124K984n278m850K707M610p49K898j489l230o714k383K322
15870a2741K403M242k821J550pQ360M753o58R92j593j766O921L287M159q442r066
15854d27n276n410m5O80r39M197N976m021j466j393K383J187k759L5j010N454
15838b834L964L784r482n484J955j576k883K574O320m913j81k348q60K308j389
15823a1045r02J189L233j884J426k069l479K094J0020L12o933j373K011J918j670
15808g152j424N300l03O16l432K738Q34J0740O620n126r758j2057J20k794L279
$$ y = [-3798, -5333, -11166, -13904, -4195, 231, -6012, -6329, -5276, -5700, -1642, -734, 1816, -537, -481, 3126, 2761, -2153, -7098, -13945, -18559, -13635, -17426, -16904, -7788, -7579, -7071, -7413, -10421, -13435, -4087, 628, -567, -7992, -4693, -3569, -585, -5863, -10713, -8006, -3396, -4145, -1247, -2736, -5966, -12680, -15063, -12741, -10338, -6096, -8917, -7367, -7374, 986, 5739, 5081, 6073, 4480, 2714, 9635, 12922, 17081, 8639, -427, -5703, -11113, -11158, -10478, -11417, -7220, -1244, -5265, -6731, -8124, -5741, -4554, -7313, -7278, -8288, -2834, 1130, 4914, -4568, -10052, -8097, -9673, -12556, -9982, -3662, -8575, -8756, -11104, -11964, -9656, -11045, -11947, -10758, -7525, -9409, -7983, -10052, -13531, -11437, -1417, -1105, -8038, -9411, -7400, -5482, -7152, -8576, -3276, -3579, -2963, -6395, -3657, -2823, 7917, 14537, 9411, -347, -12404, -12284, -15078, -11799]
15793a1799R362N236m79m960j840J392j239k538J500P87L711N399m942l582n955
15778i947k973N619j501L013M490J395k545p131Q642K39m576o384j827P384N690
15763d12j743K193J801q24J040k398l961j835K742N469k511o153m178o73r33P159
15747e217k966n359L647m198l429M066R33k274P019K885k966j0175k39Q392Q159
15732a722K579J270Q804m012l996n041j618P159m799p517j241l97P958L856l938
15717b655J729j743m401k956j357k776p31L813M786M248k020j083M716K404J21
15702B095N161m605p782j0557r55Q50J004J98l932J003O717O595L963K291k733
15687f87o272L241m746J490l161K580j228O052l358o97M210K879k863J139J505
$$ y = [-11799, -2437, 2799, 2320, -2640, -4480, -3088, -4327, -6865, -5365, -4578, -867, 4532, -410, -3992, -9947, -12920, -7301, -8802, -5789, -1299, 96, -2449, -9580, -938, -699, -5275, -11659, -13486, -6102, -412, -2155, 38, 1839, 1015, 2055, -343, -4304, -6139, -3397, 2072, -439, -6592, -10770, -11443, -12376, -5217, -8183, -13542, -9895, -14093, -17522, -13456, -12523, -14797, -7778, -4893, -7859, -18034, -18273, -9881, -1722, 857, 2127, 10931, 6919, 2923, -2118, -3736, 3423, -1376, -8893, -10134, -10531, -2573, 1283, -2655, -926, -2669, -7070, -10026, -11383, -14159, -14890, -11077, -6291, -2043, -4063, -5146, -430, 1974, 2095, 7256, 2651, -5131, -15688, -16643, -15793, -14789, -14591, -18523, -17520, -10803, -4208, -245, 2046, -687, -6959, -3718, -8464, -6974, -10135, -7555, -8783, -2731, -6089, -6786, -2576, 303, -2560, -1421, 84]
15672H4k872l05N241K260K005n324m975L208k05m527k119j913L539N892m525j769
15656f305L054j741K922M673K279M21m85l052j0516o335p80K58O751P211l66n091
15640g102j1310J553O575J0718P462o104m436N45K842m131N329k586m571m53L057
15625b612j002n283O414N982P84l830J304M070K267J86j009k155j918k819q292
15610g913k962J736M253l501J341Q580k22k84j976N682m673j329L87L598j717
15595A000o09j751J181M752K480l292j424m112J368K687k523p036j862M643L235
15580a263M331o780k966Q198K137m122j596L115K399J177R86l017n422l661j543
15565h027K576L451L870O161k044L70p471q297m047R11J735L272J800q91J575
$$ y = [84, -2788, -3093, 2148, 4408, 6413, 1089, -3886, -678, -883, -5410, -7529, -9442, -5903, -11, -4536, -6305, -3251, -4992, -2070, 2603, 4882, 5303, 4818, 1766, -8750, -15085, -15865, -15607, -8856, -1645, -2011, -7102, -18412, -16859, -10284, 434, 7896, 1792, -2644, -2099, 743, -3388, 1941, -645, -5216, -5669, -2612, -3614, -8897, -2483, 3499, 4283, 453, 1757, 5827, 8094, 8280, 7271, 5116, 3198, 379, -7913, -10875, -9139, -4886, -8387, -7046, 1534, 1312, 1028, -948, 4734, 61, -1268, -881, 2717, 1000, 391, -1360, -179, 4573, 7053, 3761, 2337, -1775, -407, 2280, -243, -7279, -9141, -4498, -1263, 3068, -3712, -6678, 1520, 3657, -465, -2061, 1054, 3453, 4630, 5616, 2599, -2823, -6484, -8027, -5451, -2000, 1870, 8031, 5987, 6357, -1114, -9411, -13458, -12547, -10812, -7540, -5740, -6631, -5056]
15550e056N216l409J020m012r123M10J743N017M443L384j0172p150o17O011Q781
15535c514M183K597K732K289J916M346L497r46j1541q172O2n539J327J757O112
15520A106j245K076k111j214l696J796J438M925L845l399j155N25l391r80M66
15505a014l400j020q92K87J976M04j044k692m0K780o75k705J477J775k791k774
15489a0348o96N26K523L697M646o247m166O698N402O49m45J362rl610P42k98m08
15472A8R96m353l155L393k375j116M982k525J438J253N327K138m696K459j380
15457B404J148r562j410M66K391J395K355o78n375n238o220N767L958J024k281
15442i856K491l099o38j701J47J738M144O489J443Q4l05m729j554K589J72k367
$$ y = [-5056, 160, -3249, -2229, -6241, -15364, -14954, -13211, -8194, -3751, -367, -10539, -17689, -18306, -12295, -3514, 669, 3266, 5998, 8287, 10203, 14549, 18046, 17100, 5559, -2613, -2551, -8090, -6763, -5006, 1106, -139, 1937, -174, -1388, -5084, -3288, -1850, 3075, 6920, 3521, 2366, 2891, -500, -1480, -1014, -4414, -5434, -6326, -6039, -4063, -3659, -4703, -7395, -7435, -4655, -5330, -8035, -6558, -4783, -7574, -10348, -11044, -10518, -7995, -4298, 348, -5899, -10065, -3367, 2035, 2684, 2239, 3601, 3592, -18, 724, 426, 18, 1014, -3339, -6494, -3101, -5476, -6592, -1610, -4135, -2697, -1444, 3883, 6021, 1325, 3784, 2404, 3552, -6010, -7420, -6954, -4563, -3168, -813, -1491, -6866, -12104, -18324, -12557, -8599, -7575, -9856, -7365, -10464, -11102, -12803, -12656, -10918, -6774, -285, 1158, 1242, 937, -3792, -5346, -2757, -2585, -4952]
15426d952j811Q631O045K59o785q458J578n110j834J572O61j910K162L574j298
15411g676k507O296M844j109j476k80j106l20l366k035J61m331N681k2K069Q446
15395C269j935o253m685r73J561o42k115Q771j251j711n098P24J508k047N563
15380e314k474j654j958N09L153O471K932j239k738M282J06q867M34J112j3L797
15364a461J20o997m773J517P19L241J912N200j999p381K397O459N618k161p3l462
15348a124l091J099O32K120Q941k816n087j665J869O173j322m404n679n745N32
15333i567J1446P317M147K19k440o553p053o601Q39J293K100K53K132K714Q654
15318H900j797q188L494m61k996j401K616l783K153N113L121j732J565o762L202
$$ y = [-4952, -6763, 1868, 7913, 8172, 1387, -7071, -5493, -10603, -12437, -10865, -10204, -12114, -9952, -6378, -7676, -10183, -3887, 957, -152, -1628, -1908, -3014, -3334, -6700, -8735, -8574, -12905, -7224, -7246, -5177, 3269, 1334, -4919, -9604, -10577, -9016, -9658, -11773, -3002, -4253, -5964, -11062, -10338, -8830, -10877, -5314, -7788, -9442, -11400, -10891, -7738, -1267, 1665, 426, -2312, 1970, 2076, -6791, -6357, -5245, -5258, -1461, -1341, -8338, -13111, -11594, -10875, -7634, -5722, -522, -2521, -9902, -7505, -1046, 4572, 2411, 2338, -1124, -4215, -3116, -2484, -364, 8577, 5761, 674, -991, 878, 7051, 5729, 1325, -4354, -10099, -9567, 1879, 9196, 13343, 13562, 11122, 4569, -2484, -9085, -8246, -6953, -4853, -4600, -2468, 246, 8900, 7103, -1085, 2409, 1948, -1048, -2449, 167, -3616, -1463, 3650, 6771, 5039, 6604, -158, 3044]
15303C044j302l176J568L408J202O74q668P64q97l064L724M196L40L182j182k670
15287A143m338k90l457Q21L581L523J277K187J402m946k955o060L656J435L408
15272C87N33l394k40J211r84N73R658J734l622m869J164J272q388q597O429M967
15256b166q29n930K70O017m663J134P721K085l634j813L377n51M32K950K613k409
15240D604j873l118J271N223K842N095j204l041o340l614L091M607N344m83J260
15225A3664o455q092n230k824K608j351K525Q9N127K718L552o793j551j094l205
15210f312o723j629r46M860R093M552K036J368Q57r68n187j110J879k618l540
15195d388r50q60J83L12L3j328k824J180J859R478O683k693N82M161m969j293
$$ y = [3044, 1742, -1434, 134, 3542, 4744, 5418, -3250, -2486, -3383, -6447, -2723, 1473, 1813, 4995, 3813, 1143, -3195, -3485, -6942, -6121, -2540, 983, 2260, 4447, 5849, 903, -2052, -8112, -4456, -3021, 387, 920, -2474, -2714, -1503, -2487, -1914, 7744, 9478, 5856, 987, 2151, 3423, -4965, -13562, -7133, -2166, -2995, -8925, -8655, -2638, -7301, -6167, 1554, 3639, 5, -1808, 1569, 1018, 1450, 4400, 7013, 4604, 2731, -387, 884, 6107, 8949, 14044, 12840, 9799, 3459, -155, 2936, 7543, 12887, 12404, 13664, 7209, -883, -6113, -8937, -6329, -7680, -5155, -5066, 61, 2779, 6331, -462, -2013, -3107, -6312, -13035, -14664, -15610, -10750, -1657, 2895, 4931, 6299, 7156, 6188, 1001, -109, 1770, -848, -4388, -5338, -6198, -6015, -5703, -5670, -6998, -9822, -8642, -6783, 2695, 9378, 6685, 7267, 11428, 6459, 5166]
15179E166M719j398l549o97n13m193o929j455J10j136K896K745l774K037R16O989
15163A934K711j292j631J885j734l546j860N956q929J396o00n61j930Q61K983
15148d357K267p144L10P476L705l817L30L905j147M842j125j354M986L622J028
15133A3527k605m533o688j5M396N860J716j599n22N557L523J126k077p888o767
15118C011k900P712J240m349p347L136L894r70n20P871J581o809j122L231n972
15103A687m888M217N200j444l864n11J788l627l536J033J132o45K098P732O62
15088G034j1224l954R134P201L370l306n07m545J387n015o06P92K487K804n253
15073b01l375P738Q70P007J009O773Q98r19K649n825j0406n823l210k169P86J088
$$ y = [5166, 9885, 8487, 4938, 4241, 3728, -465, -7394, -8849, -8739, -9875, -6979, -4234, -8008, -5971, -5055, 1934, 4645, 3353, 1722, 3607, 1873, -1673, -3533, 2423, -6506, -5110, -5710, -6271, -8201, -7340, -4357, -2090, -9234, -8924, -1448, 2257, -1560, -1230, 2675, 1528, 6370, 5245, 3891, 8877, 12499, 13527, 10922, 6389, -299, -314, 4082, 9942, 11658, 10059, 9537, 15094, 18617, 19743, 17666, 9778, 3011, 111, 7823, 9063, 4714, -2633, 503, 4397, 3427, 2907, 10778, 12359, 5550, 4428, 7659, 1687, -3201, 1016, 6216, 4772, 908, 397, 2185, -1442, -4978, -3945, -2813, -3458, -1360, 6372, 7034, -4190, -8144, 990, 8191, 11561, 8255, 7748, 3203, 4590, -425, -1031, -239, 2248, 5052, -201, -3576, 4162, 5032, 12039, 13048, 19821, 20719, 19800, 22449, 16624, 6218, 395, -2815, -4984, -4198, -3110]
15057c110n087K854K795N968J176k218L726Q722J346l410o451p820L054L180l540
15042A185O967P25j826J808k412r46p071m591l204j970J839R620P483M63m142
15027C928l846J050K840l917L96m233o06N393J460l130r207M323L279k303O600
15012B027K926q60J0217p825l209n04J075K217K071k925l158O41N998J338J916
14997A1945n815kn848k545p63P20j36J1224O229R667N245J5662J391j9835p856
14982A9283j1027p011k426k207j417K396M472o177p058L348O245L706M98p77j251
14967E97m909m259K103M008K481k839k713M466K645j231o326k520R33J396m11
14952f579K216R507K78k701j410O56J735K137K565j168l384n385N002m619m657
$$ y = [-3110, -8197, -5343, -2548, 3420, 4596, 2378, 6104, 14826, 16172, 12762, 6311, -1509, 1545, 4725, 1185, 8152, 8877, 7051, 8859, 6447, 5501, -1570, -6161, -9365, -11335, -9496, 124, 7607, 8070, 3928, 82, 1132, 3972, 55, 451, -3782, -4388, 1005, 2465, -665, -9872, -5549, -2270, -4573, 2027, 4953, 4093, 14310, 6485, 3276, 2772, 3847, 6064, 8135, 5210, 2052, 2693, 8691, 10029, 11945, 6130, 6128, 280, -2265, -3028, -2308, -2444, 8780, 15009, 24676, 29921, 45583, 46974, 27139, 19283, 8256, 1245, -1181, -3388, -4805, -2409, 2063, -4114, -11172, -7824, -1579, 2127, 2625, 1848, 597, -4312, -8571, -6468, -2460, 21, -2818, -5531, -1065, 1580, 349, -5977, -8497, -7564, -6168, -6579, -4363, 5144, 5422, 2721, 1311, 1967, 3702, 5839, 8404, 7236, 3852, -1533, 3469, -1150, -5807]
14937e807M163K780m189M756P623j630l36n831p559R32k488R99j131K571L167
14922a980j520n25k199k235p67n261o8L548N055M02J675o55j852L033L877M525
14906E053R87n755r026M871L134k297p96O70Q611M094N698k305j1205L23Q872
14891A0929m327n695J726m130l894p019J44kj904K919N355l126J891m22k147J799
14875g903J575p07J431K119R156q17N773J939m501o795l732j165M405m96n833
14860e551o26M309k256j696L511L625l654o23p197k602P526R16k08q37k48l356
14844h967J282O096K945P44k218m836K015L279o76o590K578L883J888k846o886
14829h309m948m715Q620O292j636k655P58l8l587N135j92k940K316J197N502M752
$$ y = [-5807, -1644, 1136, -3053, 1703, 9326, 7696, 7360, 1529, -6030, -5098, -7586, -6587, -7718, -5147, -1980, -3500, -4025, -6224, -8459, -9226, -14487, -14555, -11007, -5952, -5550, -3875, -4530, -6382, -3349, 528, 5053, 6040, 285, -8741, -3870, -736, -3033, -3829, -3159, 5452, 9546, 15244, 12939, 1734, 2057, 10929, 6602, 907, 2633, -1497, -5391, -12410, -12266, -12268, -14172, -11253, -5898, -9024, -7133, -7555, -9702, -7903, -6328, -7035, -5604, -3485, 5671, 4854, 10627, 12566, 8065, 1270, -2462, -3627, 778, 282, -5551, -6177, -1868, -4124, -5820, -2309, 1316, -2338, -2961, -10158, -12760, -5234, -4318, -4526, -5363, -5611, -8967, -7685, -1589, 1356, 2100, -118, -4954, -2939, 340, -336, -6926, -4348, -465, 1423, -1423, -8309, -13257, -17972, -9352, -3060, -4696, -7351, -6593, -6631, -10218, -5083, -5275, -8215, -5899, -4702, 800, 5552]
14813E552J156j50r487O58j674l71O951j391K55l190L88P814p85n535k738l38
14797b885J780k649j276k123L792m176k965M193k869m632j229O867P25m029K819
14782h657L627M553M864n585O11N155Q619M535n980l395o642o936K242L71J639
14767i79j905L04L399n579j210N550K090R86J327j153n709m242j981J815l89l586
14751a1262l537k226J943L935O807Q880m8n136j921r379m284P110j113m19J491
14736i159K126N972J195J250k181o971l488O55O248L047n45L673N54k612j374
14721a610J459l554n929k429M584K751j899l880N68L15l710K263P76j668k098
14706a4061J544J992Q159l475j110J1792K425o237O359M548p370l561n758k487
$$ y = [5552, 6708, 6558, -2929, -2271, -3945, -4316, 2635, 1244, 1499, -1691, -1303, 6511, 5726, 191, -2547, -2885, -1105, -3754, -5030, -7153, -3361, -7537, -10502, -6309, -9178, -13810, -15039, -8172, -7447, -11476, -8657, -5030, -477, 4387, -1198, -587, 4568, 13187, 17722, 11742, 8347, 1705, -5231, -2989, -2618, -979, -2884, -2580, 819, -4760, -5970, -420, 1670, 2656, 3983, 2830, -2879, -7121, -9102, -7287, -7676, -11262, -14799, -17025, -15082, -11147, -4340, 4540, 4492, -644, -2565, -11944, -16228, -9118, -10231, -10650, -9159, -7033, -1061, 134, 1384, -797, -7768, -11256, -10601, -4353, -1306, -1851, 1822, 2376, -236, -1610, -151, -3705, -9634, -12063, -7479, -4728, -6627, -10507, -9939, -9624, -13334, -11071, -10295, -11963, -14061, -12517, -10525, -2366, -5841, -6951, 4841, 7266, 1029, 7388, 11936, 4566, 1005, -4753, -7240]
14692g240m66j115o89l727l509M774Q520r96n768M505q203o611J106O901O64k91
14676a2145L055j331M262O375l378k531l322o45J37O103r12m002j654o710k769
14661a9467L54N496M805m508L39J649K627l126n79k109N031M38q83J384K209K524
14645c816J532O98n005J433r285o23k685N380J0808Q71k704p29L658j728j935
14630d130J588j353o415j739R492M561K894l036o176K230l81L781k617n615J040
14615e876N278m496o217p40m982R696R605r41j0075J324L983N865r68K140j158
14600B438m481k04M70J532l66K94q07M33o5p267j434Q277N29m964k31k981Q603
14583b24L763L653O586n269l935L967m92m479n755l464j97l641N952J0490N37
$$ y = [-7240, -7706, -8821, -9510, -13237, -16746, -11972, -3452, -4448, -10216, -5711, -13914, -20525, -19419, -12518, -11854, -12145, -9090, -10421, -6159, 216, -3162, -5693, -9015, -9660, -9523, -3420, -4332, -8334, -9988, -16698, -19467, -19113, -13617, -8812, -13320, -12981, -11332, -8705, -11831, -12410, -14519, -9488, -9050, -9933, -8549, -6340, -3816, -2284, -1586, -6591, -5158, -14443, -15066, -17751, -12371, -1563, -692, -3396, -4125, -467, -2195, -4130, -2542, -3895, -10310, -12049, -2557, 2004, 4898, 1862, -4314, -2084, -2465, 1316, -1301, -6916, -5876, -598, -5094, -11311, -12051, -17033, -7337, 2268, 1327, -8748, -7424, -3441, 2424, 1456, 3596, 2438, -2043, -2247, -1777, -245, -611, -317, -1124, -691, -756, -8023, -9457, -1180, -651, -5615, -5846, -8827, -224, 3539, 7192, 13778, 8509, 4574, 8541, 8049, 3570, -2185, -5649, -5846, -9487, -3535, 6955, 7492]
14568G492J666Q42k970m219j106K391N332k757k778k150K128J769M566n407m48
14553D351K329o14J635o047p210O220n40K544j383K642k87m849m281K382R65J468
14537f75j301j726K732n789J519O226j230o81m117k140N276K356o33k348J170
14522a361K079n425L830L246O138N713k113o137m956O57M650m159n074j920j053
14507e885J153n4K162N52m816N46K88k770J454K610O227N894K048j009K649m618
14491F431l312l54L855k645m068j282j23J464M491j839L12j918o061O42L273J843
14475G09j040J672q0l97L079o50j68q203o545M933j804o068P931P861L323O582
14459A1135l411o651j760J100r80J647P387L343j1918p086j781N980L762k240
$$ y = [7492, 9158, 10000, 7030, 2811, 1705, 4096, 9428, 6671, 3893, 1743, 3871, 5640, 10206, 4799, 4351, 6680, 6066, 7701, 1654, -5556, 664, 124, 2668, 1285, 3927, 3640, -1209, -5490, -3108, -2143, -675, -1976, -3702, -970, -6759, -5240, 986, -244, -925, -5042, -7182, -1906, 450, -183, -2531, -1361, 718, -4707, -877, 2369, 8507, 14220, 12107, 5970, 1014, 1671, 6321, 2162, -2912, -4832, -5885, -4732, -4786, -2624, -2072, -6888, -6342, -6054, -8824, -7370, -4760, 1467, 7361, 9409, 8400, 11049, 6431, 3119, 2765, 6620, 3975, -93, -1375, -1498, -34, 4457, 2618, 2930, 1012, -5049, -4407, -1134, 709, -331, 1341, 1261, 864, 3943, 3293, 3125, -5078, -11623, -6690, -8494, -14562, -6631, 1230, 4553, 11135, 7724, 1073, -687, 413, -567, 1080, 8467, 11810, -108, -7194, -8975, -2995, 767, -1473]
14445a473L33k149Q52N667l359r149J665R034l237k752m41M055N151Q48m323L174
14429C896P21m786r85Q28l229K212L438J101L352O69R33N65m889l775K575R63
14413C589l494L848M209q71o952o05P743j476k988q14l425J277j34L590K987j205
14397E279l110K342L901l781o871j556m118m198L507P71L209O933R02r99r65J421
14381B667J688K673j095L748p886n905m7m95k999M456J944n49M549L045j924K93
14365D163K377k392K020j767p761p865o25R015P689K200n00p442k353L652j55
14350B56k528l398o360J2871Q701m257j1291j865j618J417J650O692J522l187
14336a395j409L060L708L44q23L977J677j0681J118J095L735L573K232j143m505
$$ y = [-1473, -1140, -3289, -2437, 3230, -129, -9278, -7613, 1421, -1816, -4568, -5009, -954, 4197, 5045, 722, 3896, 4617, -169, -1154, -326, -3555, -1343, 2095, 3196, 6548, 7217, 8150, 8715, 3826, 51, 2626, 3589, 95, 3943, 8152, 7281, 329, -276, 7467, 5991, 3003, 2189, -1236, 41, -93, 3497, 6484, 5279, 2169, 4511, 8412, 4631, -2240, -3796, -7914, -12112, -8605, -7834, -4625, 2308, 3210, 2211, 1246, 2667, 4355, 7028, 5933, 9681, 1795, -4110, -4157, -4652, -7651, -3195, -1251, -1800, 2749, 5794, 3870, 4163, 6540, 4148, 6168, 4401, -3360, -11225, -11850, -2835, 4854, 7054, 6554, -888, -3241, 411, 256, -2272, -5670, -12030, 841, 9542, 5285, -6006, -7871, -9489, -8072, -6422, 270, 1792, -1395, -2804, 256, 3964, 4308, 3485, 7462, 9139, -1542, -424, 671, 4406, 7979, 10211, 9068, 4563]
14321D563m445K315N554L552p45r424m895j910j044N40M780Q354K716q881l75
14306F55M87M67M592q494j524J762L399Q105J862m455j0389k171q26L872m569
14291g227m226M344N689J644l233K314K011n572n256M002P347J918M974r21l618
14276D190J030J587j1330q331l751J9n57L350O767O683J192M628l824p378k141
14261g866N018l365k763K163L232P714J434j361L235r51k637L227j1220p610L849
14246g901R973M403j395k189R55N653Q78l1L226J885k853l736J020m516j335j436
14230B601o770k991O559K802l287l854j491M414N693N91l015q159J768N971j026
14215a94K076n318j370L309L110j714k394P142M276L991j362p338n974k119j073
$$ y = [4563, 118, 2433, 7987, 11539, 10794, 1370, -3525, -5435, -6479, -5939, -1159, 7195, 9911, 1030, 655, 1142, 1609, 6201, -2293, -3817, -2055, 1344, 9449, 11311, 6856, -3533, -5704, -6530, -2658, -7227, -11453, -7109, -1420, 224, -3009, -695, 1316, -4256, -9512, -5510, 1837, 3755, 8729, 7808, 4190, 5220, 6807, -4523, -12854, -16605, -16586, -17143, -13793, -7026, -343, 849, 5477, 1653, -5725, -7866, -2848, -6213, -8976, -6813, -3581, 4133, 5567, 4206, 7441, 6490, 3853, 7080, -4140, -11750, -7901, 2072, 6475, 5080, 2891, 3846, 9499, 10377, 10346, 13572, 15457, 12604, 8868, 9888, 5372, 4037, 2601, -4169, -7160, -601, 2201, -1086, -4940, -6431, -2017, 3676, 4267, 1252, -6907, -5139, 832, -194, 1882, -3436, -4806, -1497, 1613, -101, -2495, 4647, 8923, 12914, 11552, 4214, -1760, -3879, -4952]
14200d952P78K036k456J154l329L864L634k873o31l911N340J108J534k046j878
14185b628K098j47q07N739N76j904J908m1N438k795l198J815k125J612L133m879
14169C795n717j071J826k661P50k437qM175l86k461M668j380J507K779p917n624
14153a0162O515m151K932M96l301q293L637N654j847o684o955L981N830N554P284
14138D90l62L657o27p652n447m276K801L225J381m72J268O925L154j792J32J988
14122D393m095k693O478M612o907k670N235L150J758R25J619k040m31R01o851
14107C384j483R60n215J492L881k89l113J384k172M48R93m43l316J500M671Q63
14091C545K442P396o169n417M836n373l162K575j627m632k66O522R84l204l24
$$ y = [-4952, -4174, -2138, -4594, -3440, -6769, -2905, 729, -2144, -2775, -6686, -1346, -238, 1296, -750, -2628, -530, -677, -1484, 4255, 4831, 2927, 4835, 4794, 10232, 7437, 4239, 6054, 3929, 5541, 8674, 3795, -1922, -2993, -1167, -3828, -3078, -5515, -5523, -1348, -1734, -4195, 473, -907, 600, 3379, -4538, -10162, -3647, -7798, -4866, -4370, -7671, -15964, -12327, -6673, -8520, -15204, -22159, -18178, -12348, -6794, 490, 128, 3785, 3158, -4494, -9941, -14217, -11416, -8191, -6810, -7282, -6014, 911, 4065, 2273, 2405, 4393, 298, -2395, 4083, 8695, 1788, -882, 4353, 7503, 9261, 10186, 11805, 9765, 9334, 10235, 3384, 1901, 2861, -2354, -862, 3019, 2730, -383, 1001, -1171, -723, 270, -173, -3489, -1989, 2682, 3545, 5987, 13383, 7214, 1797, 6633, 1260, -1902, 673, -954, -5586, -5852, 670, 1654, -1550, -1874]
14076a874l390K729J113m426J443J460q13Q91k595M081l51m399M541J27J319K684
14060B540k512k750j303J418O53m799k638K846k172m804Q501N958k571m098k505
14045h236L35J139j429k233L540K168O501M705l687l184q70N474J142R900K77
14030A5542l381k222k105m454l689l193j979J954P165q11m47J401q88n176K983
14015G00Q671n914q005K748N634q576k753j416Q83O480M580M227l979M9N94K986
13999F909k950N401n69q337q221q72L578J3078M421j434m643o50M196k266j645
13984E996l194R06K379J082k415n300j549n867J423k340N187K585j72M73k659
13969c465l365j1L022L523P744r47q88K155j048k210k879o740k370j39p39M015
$$ y = [-1874, -5264, -2535, -1422, -5848, -4405, -2945, -3758, -2867, -5462, -1381, -1732, -6131, -1590, -1463, -144, 2540, 28, -2722, -4025, -2607, -1954, -6753, -9391, -6545, -8717, -13521, -5020, 938, -1633, -5731, -8236, -7901, -6762, -8191, -10424, -6884, -4716, 1785, 6490, 2803, -381, -1251, 4223, 5365, 15265, 15542, 12161, 9939, 7834, 3380, -309, -3502, -5481, -3527, 3638, 2827, 2380, 3781, 2893, -2283, 700, 9371, 3457, -4548, -1800, 3834, -4742, -7495, -8911, -8028, -1548, 3032, 7259, 3280, 3329, 3923, 6909, 3959, 9360, 8791, 454, -7767, -8639, -5061, 8017, 12438, 11004, 6361, 5711, 9907, 7641, 5996, 2802, 3708, 6087, 7169, 4754, -546, -2095, -7962, -6539, -8879, -3692, -1107, -1279, -806, -3465, -6830, -6841, -3819, -296, 7448, 6501, 5613, 7768, 6720, 4510, 1631, -5109, -7479, -7618, -8357, -4342]
13953d342M128m55j325J920l355K121O617M148n699l782n578M183K470j986m450
13938e385J886M643j320l233k626j819N33N543J460M710K19K316L611q222r233
13923f917k215O197Q116j986K88J344J66Q78l947p1L927N4L004m259m273oo203
13906e903l904P632l363k893l96R889R64p075N057l26j633J824j026l84j136L251
13890E78j666Q12N556O694K709o637l116j22K324j62N316N202M129K810m726K163
13874B1864M41o093J54n24K1Q13J182o313k478L863J116j243o089l466L323J109
13858G680J521K322O61K296J917N637n655n707O121o78j16K313K716M421N056
13843C0505Q491j820j6321n322Q35o778m845J36M076m088k415j48M067K503m32
$$ y = [-4342, -214, -669, -1994, -74, -3429, -1308, 5309, 9457, 3758, -24, -5602, -1419, 1051, -935, -5385, -3499, 1144, -176, -3409, -6035, -7854, -7321, -1778, -318, 4392, 4611, 6927, 10538, 2316, -6917, -9132, -2935, 5181, 3195, 3483, 4827, 4993, 5871, 1924, 1853, 5780, 5834, 8838, 4579, 306, 300, -5903, -9807, -2175, -5538, -8431, -8827, 1062, 2026, -5049, 8, -318, -1951, -127, -1153, -1537, -2673, 578, -1088, -276, 5280, 11974, 14683, 8046, 4930, 4808, 7132, 6970, 12286, 17488, 21617, 24427, 19701, 21864, 22305, 16212, 16366, 15842, 15863, 16676, 17858, 11545, 9067, 12930, 14046, 12803, 6714, 3248, 6571, 7680, 9201, 11523, 12184, 14480, 16397, 22034, 16379, 10672, 16793, 16115, 15999, 18312, 21028, 25449, 30505, 38996, 37176, 20855, 15533, 16368, 9590, 4745, 4881, 8957, 4869, 2454, 2306, 6373, 8876, 8444]
13828H444p283j329p191n968K531j334L973L009J982N777r75K601p07K532o147
13813h5q07k704K925N328j240j429M849r2K440k665K571l709n181O42j676m405
13797e238K907J71o248Q797j421l520L052L424J331l522k349m111k886J086J054
13782g473k381r84O289J526N798m081r651P997O609J246l373K097N042J891K759
13767A3311k172l328n177R84J269k281j954N703j882o230o731m762j427K961M836
13752f880O118M040J288n210p33O465N801J05j67n36o139K586l94J993m653m536
13736h52O825j667J680l334J609M55m543N4P439M509o628o237p26Q919K344k268
13720G579m609j10o055R175N757k923k119n097L57N770j509q18q782Q54Q803P181
$$ y = [8444, 1161, -168, -7359, -13327, -10796, -12130, -8157, -5148, -3166, 2611, 1636, 4237, 3530, 6062, -85, -892, -3596, -671, 4657, 3417, 1988, 6837, 6745, 9185, 6520, 9091, 5382, 201, 843, -833, -5238, -2331, -2160, -8408, 389, -1032, -4552, -1500, 1924, 3255, -267, -2616, -6727, -9613, -8527, -7473, -9854, -10838, -4549, -3023, 2775, -1306, -10957, -2960, 3649, 4895, 1522, 3619, 8661, 10552, 13311, 11139, 7811, 2634, 3618, 4887, 2606, 652, 6355, 4473, -1757, -8488, -13250, -14677, -11716, -6880, -762, 3278, 4566, -644, -1377, 5088, 10889, 10994, 10827, 10291, 4152, 6738, 6344, 8337, 3684, -852, 5973, 4306, 5986, 2652, 4261, 4716, 173, 227, 7666, 12175, 5547, -690, -1416, 7503, 9847, 7579, 2970, 2860, -3195, 5980, 11737, 8814, 6695, 1598, 1955, 7725, 6216, 5398, -3384, -2530, 6273, 13454]
13704A3454j455j048l969k989k66p418k497J45n7J487L882P909P748p692m355
13689B879q68n74L622m02k724M207J295J782j238n856k149p38N841O666j162k342
13673H239L328j64p96j099K34o63o894m150k781n772l535K599K506M530J108M500
13657A190Q34J327j727l128l542K478o679m347m77M027O836n27J861P941M812
13642A0879J172M978j0343l095M299r68l939K868j276k32m978k458o23O352P469
13627A0105K247n27L237J324o750M873l38p667o71j98n129K808m46Q2J62K632
13611E744L32J669j301k577q43l784m265k190q716M035P143K584l201j876K701
13596d545O959K037m459J734K349M450j062j774n612m783N505Q551M024J568n
$$ y = [13454, 11999, 10951, 6982, 3993, 3727, -3691, -6188, -6043, -6100, -4613, -731, 7178, 14926, 7234, 2879, 2011, 1437, 5059, 4657, 1933, 6140, 7435, 9217, 7979, 2123, -26, -764, 5077, 11743, 10581, 8239, 11567, 11403, 10607, 9508, 9742, 9079, 2185, -1965, -4746, -10518, -14053, -11454, -8948, -4418, -3310, 1190, 2024, 3351, 1624, -1504, -5046, -2568, -9247, -13594, -14071, -10044, -3208, -3735, -1874, 6067, 10879, 12051, 17029, 6686, 3591, 7890, 6922, 2983, 5851, 4575, 4343, -635, -3093, -3716, 2636, 10105, 12352, 11825, 15062, 16386, 9636, 14509, 14171, 6504, 5833, 5635, 506, 3314, 2868, 2950, 3112, 5744, 6076, 7745, 6444, 3867, 3024, -760, -5025, -7215, -15931, -11896, -4753, -2169, -5370, -7246, -4545, 2414, 4451, -8, 1726, 4075, 8525, 7463, 5689, 77, -4706, 799, 9350, 13374, 14942, 14937]
13581A4937j36m650q725m142K910J218k569J180M307k919l948O562L009j366o6
13566E602o827K767O832J875o423K572N085N398L274o221n193N05l5q82K48J771
13550A0348l527m525o321j976J1212j315K88m767j53J0694R548K659J080j89j906
13535B1150m004J769j407P539j612L073Q262O500P176O008O721J4790J7263J3023
13521A06251N995M68m054j0021j5123j5601j5601j0474p247j1497q285N30n01
13508A4840L080J0470j866j320j89l518L383O099o82K008j77q818K502M538m31
13493B9919O654O802J2055l792N844J0391Q740K2107J6790K7510M0831K9851L2528
13480B46230K0358p601k9959l8253l3634k7083l0667k4153j3948r081j0561r646
$$ y = [14937, 14801, 10151, 1426, -2716, 194, 1412, -1157, 23, 4330, 1411, -2537, 4025, 7034, 5668, 5602, -1225, 1542, 8374, 10249, 3826, 6398, 11483, 16881, 20155, 13934, 8741, 9246, 9211, 8329, 8577, 10348, 6821, 2296, -4025, -6001, 5211, 3896, 4184, -583, -736, 9958, 19506, 22165, 23245, 23056, 21150, 17146, 18915, 17508, 25047, 23435, 26508, 34770, 41270, 48446, 54454, 61175, 75965, 93228, 106251, 112246, 112714, 108660, 98639, 83516, 67915, 52314, 41840, 34593, 23096, 14811, 15341, 14840, 17920, 28390, 26524, 25204, 25015, 21497, 24880, 30979, 30297, 32305, 32128, 23310, 25812, 30350, 29919, 36573, 43375, 55430, 51638, 57482, 67873, 76613, 98720, 115510, 143020, 183851, 213702, 246230, 266588, 258987, 229028, 190775, 157141, 130058, 99391, 75238, 61290, 52209, 41648, 32002]
13468C2002k537L582j889j435m908m275m779k794R25q07m607L482M733M367j304
13453A9756K730j143j550q71J318P685Q628Q349J0786P809R477J2676K0484J5033
13439A21167O054o90j4553k5211k0005j4897j5630N422j576q765o730j322L40
13426B3604n458n25N950J12m232q522j845j486K068r98r88J200P955M413n015
13411A6233j1471j968L877N118p14J023j347L489N420l289q626J251J819l297
13397G518J830k737j0428N937P873L703j201l657R67J538l53J983l808j342J351
13382I174r78l053J003P350J2978J570r048Q74Q63r62k971m566J127P242P7l157
13366A7523n866m911n93l018L478J0525K638l520j188k847l005K090m64p028O743
$$ y = [32002, 29465, 33047, 31158, 29723, 24815, 20540, 15761, 12967, 13892, 13085, 8478, 11960, 16693, 21060, 19756, 22486, 21343, 19793, 18922, 20240, 27925, 36553, 44902, 55688, 63497, 72974, 85650, 106134, 121167, 127221, 126531, 111978, 86767, 66762, 51865, 36235, 41657, 40081, 31316, 24586, 23264, 23604, 18146, 17621, 23571, 23683, 19451, 10929, 9084, 7598, 9666, 8668, 7680, 8880, 16835, 21248, 16233, 4762, 2794, 6671, 11789, 11075, 12098, 10751, 14240, 19660, 16371, 7745, 8996, 10815, 7518, 9348, 6611, -3817, 2120, 9993, 13696, 12495, 8838, 9805, 11343, 10990, 12973, 9165, 7823, 9174, 8196, 5143, 6146, 13496, 26474, 28044, 18996, 19870, 20733, 19771, 16800, 12234, 13361, 20603, 20680, 17523, 11657, 6746, 6153, 3135, 6613, 17138, 19776, 16256, 15068, 12221, 9216, 11306, 10842, 3814, 10557]
13351A0557J358j242M799k147l818p11n31L452K193M485N135O06M459K324j826
13336B9093J2L176N032L849m632l597k216M259L574K536l361o696o387o371P810
13321B6081O181m252p6K897l896m762M017l998o765o02K15j194K500P77k774M144
13305A8493R66m294k100j781J454R162J0184j71k210l257j329K613L797K558k199
13290C1886P59j250N159L766k767r01K634Q755q56N803m24l148k950l461l807
13275C9198m621O981K700o519N683J272j802M532N356P39M168L012Q900M883l191
13260G1291m729o172k247k868l105r700p325m754L436r51m056JK441p233p555
13245A6474Q971L986k001j738Q99M943K395J805m44k396P286l814L33M6L753J1139
$$ y = [10557, 11915, 10673, 15472, 13325, 9507, 8796, 8265, 11717, 13910, 18395, 23530, 24136, 28595, 30919, 29093, 29105, 32281, 37313, 41162, 36530, 32933, 30717, 34976, 38550, 41086, 37725, 31029, 24642, 18271, 26081, 32262, 28010, 27934, 30831, 26935, 22173, 26190, 22192, 15427, 14825, 15040, 13846, 16346, 17123, 14349, 18493, 19459, 15165, 13065, 11284, 12738, 21900, 32084, 31913, 29703, 26446, 25117, 27730, 31527, 34085, 31886, 32645, 31395, 36554, 40320, 37553, 36652, 39286, 48041, 47185, 52988, 52564, 49416, 46466, 43005, 39198, 34577, 41558, 44258, 37739, 43422, 44694, 42892, 47424, 52780, 53519, 57687, 60699, 69599, 74482, 71291, 66562, 60390, 58143, 55275, 52170, 42470, 35145, 30391, 33827, 32876, 28820, 28821, 31262, 24029, 16474, 25445, 29431, 27430, 25692, 26591, 31534, 33929, 35734, 35290, 32894, 40180, 36366, 36699, 36745, 40498, 51637]
13229E1637L881L444O169R02J7235J6479M863R842J2953J705j529j4078j8192
13216I5311k1651j0558o341j1000k993K976l551j2279o023K324M881O845J549
13203C9490L680L351Q006O5m9j862j551q782p325m937m319J1470P760j40R976
13188E4833N306N104J2045O699K365j938l077j211J3826O073J3829j518o053p063
13174I9220j1855j4825m449p94o627K140N693l4M404O037J946p04m114k74J7072
13159I2836J2368L314O761l76m971l721j2957n014k71k609k51J1054O040O075
13145A08278R796N961K39M741j571k041j855J744k901p490M812P828L36M628O153
13130A38658R042K740l283l221J87O63Q099P048R297J5143J5469J6884L746K166
$$ y = [51637, 55518, 58962, 65131, 66033, 83268, 99747, 104610, 114452, 127405, 129110, 127581, 113503, 95311, 73660, 63102, 56761, 45761, 42768, 45744, 42193, 29914, 23891, 26215, 31096, 37941, 39490, 43170, 46521, 54527, 54592, 54543, 52681, 51130, 42348, 35023, 30086, 25767, 37237, 44997, 44857, 54833, 60139, 65243, 77288, 83987, 86352, 84414, 81337, 80126, 93952, 100025, 113854, 112336, 106283, 99220, 87365, 72540, 68091, 67297, 60670, 62810, 68503, 68469, 72873, 78910, 80856, 80152, 76038, 75764, 92836, 105204, 108518, 115279, 114903, 109932, 106211, 93254, 88240, 87969, 85360, 85109, 96163, 102203, 108278, 118074, 124035, 124274, 129015, 127444, 125403, 123548, 125292, 122391, 114901, 119713, 127541, 127877, 132505, 138658, 147700, 150440, 147157, 143936, 144123, 144786, 152885, 159933, 169230, 184373, 199842, 216726, 220472, 222638]
13116B22638O130O863N359K393K806l698M58J4483J6237J8227J6812K8796K7411
13103C64915K3780K1554J2549Q031P197P677J5909K4122L4225L8062M2784N3010
13091F53815N8184M8965P1799P9125R7059J17044J41248J69483K05005K54243
13081A895970K96903L69536M69492O07248P86475R94915J298056J709582K293252
13072A0721429K994690L595534L692031K858931R93832j368427l254091m008891
13064A6225038l719766k919269k099966j460533j019597p29087n23181l86262
13056C367377k94607k17574j66369j31291r6327o0969k7897N843N3537R3149J33605
13045B658477J92071K40774L06861L84901M80362O00592P54108R76997J274049
$$ y = [222638, 228768, 235631, 240990, 243383, 246189, 242491, 242949, 257432, 273669, 291896, 308708, 337504, 364915, 388695, 410249, 422798, 430829, 438026, 445703, 461612, 485734, 519959, 558021, 600805, 653815, 711999, 760964, 832763, 911888, 1008947, 1125991, 1267239, 1436722, 1641727, 1895970, 2192873, 2562409, 3031901, 3639149, 4425624, 5420539, 6718595, 8428177, 10721429, 13716119, 17311653, 21003684, 23862615, 24856447, 23488020, 20233929, 16225038, 12505272, 9586003, 7486037, 6025504, 5005907, 4276820, 3753639, 3367377, 3072770, 2855196, 2688827, 2557536, 2461209, 2400240, 2372343, 2378186, 2431723, 2524872, 2658477, 2850548, 3091322, 3398183, 3783084, 4263446, 4864038, 5618146, 6595143, 7869192]
13036G869192J654844K140044K805195L764480N104094O652500P877770P807846
13028D5675965N523382J000064m297382q079313r091123p901147n874607m037801
13020A2918038k728958j880764j342555r95006p50987n83280m78375m02835l46083
13011C409195k94368k35251j85128j42298r8633m3779n13L2408P7484J17370J65522
13000B802009K27715L02610L93349N17592O82281Q88951J166011J541150K068995
12991A0590663K743271L435487L821985L436636J964136l82021k760196m182116
12983A8667845m333022l614355k655346j847526j275746q98084o55555n02560
12975B885651l86130l14287k65573k30013k03679j73508j50314j20668r7431q8126
$$ y = [7869192, 9524036, 11664080, 14469275, 18233755, 23337849, 29990349, 37868119, 45675965, 51199347, 52199411, 47902029, 39822716, 30731593, 22830446, 16955839, 12918038, 10189080, 8308316, 6965761, 5970755, 5219768, 4636488, 4158113, 3755278, 3409195, 3114827, 2879576, 2694448, 2552150, 2453517, 2409738, 2409225, 2441633, 2519117, 2636487, 2802009, 3029724, 3332334, 3725683, 4243275, 4925556, 5814507, 6980518, 8521668, 10590663, 13333934, 16769421, 20591406, 24028042, 25992178, 25610157, 22849961, 18667845, 14334823, 10720468, 8065122, 6217596, 4941850, 4043766, 3388211, 2885651, 2499521, 2185234, 1919661, 1689648, 1485969, 1312461, 1162147, 1041479, 944048, 855922]
12965H55922p4790n6274n1107n1506m5215l8253l0756k9892k9415l2060k1625
12954C95029j7470k3964j2679j5452j8430r875k477n772q048j4199j0540q359
12942B47764j4858k7184j4989l477q015j0250o207j002j730m207p151k729N45
12929A46510r78m580n042n016m760m755J763m50j168j383l010k382K841j59k179
12914A15252J134N106q450m543k125Q69N273M804k240l621j2131j457n20j1005
12900H6346j4274m970j254K807p38l399M916l494p718K581P840l414n772n468
12886E3989k691L60P195k70j59J201k606N40Q7m419k694J664k131j967p705l542
12870C6852r012m40K649J3035O245K590N86M506n79j794j1286n244m810q544L627
$$ y = [855922, 781132, 724858, 673751, 622245, 577030, 538777, 508021, 478129, 448714, 416654, 395029, 377559, 353595, 340916, 325464, 307034, 297159, 294682, 288910, 280862, 266663, 256123, 247764, 232906, 205722, 190733, 187256, 179241, 168991, 162784, 161782, 160052, 155845, 148694, 145965, 146510, 145532, 140952, 135910, 130894, 126134, 121379, 123142, 122692, 121524, 120141, 117131, 114749, 117590, 117431, 115252, 116386, 121492, 113042, 108499, 106374, 107243, 112516, 117320, 115080, 111459, 99328, 97871, 97351, 86346, 72072, 67102, 65848, 68655, 67917, 64518, 69434, 65940, 58222, 60803, 68643, 65229, 59457, 53989, 51298, 51658, 58853, 58583, 58424, 59625, 57019, 57559, 57646, 53227, 50533, 52197, 50066, 48099, 40394, 36852, 27840, 27400, 30049, 43084, 49329, 51919, 52505, 57011, 56432, 54638, 43352, 38108, 33298, 24754, 28381]
12855B8381O224q06M490L368K630J315L019l389j563O902R84J306o66q057k712
12840D1426R94k887M282Q39k194l462k055j721m091o240j451p407l871n26K74
12825A1910M053j612N349Q844O246P432J983K043o248l184j994K783m446l642
12811B9517O724Q591L735m568o757k27J116n347k712M484m189m184k965j70n484
12796A7564N644K189r250o387M252O75n076K085l166N362Q470l771n434L611j464
12781A5304K620M108O149J342J281k068m112n183k751M454n9m164l894j728L602
12766A4901k078R69n528l705J658L79o575l212N184K567L687j56L402m125o832
12751E36k676R483K789k02j349j510r0J851O773K429K363l144o322j872m078K970
$$ y = [28381, 34605, 33799, 38289, 41657, 44287, 45602, 48621, 45232, 43669, 50571, 51555, 52861, 52195, 44138, 41426, 42420, 39533, 43815, 44654, 42460, 38998, 36943, 35222, 31131, 24891, 23440, 16033, 12162, 11636, 11910, 15963, 14351, 19700, 28544, 34790, 42222, 44205, 46248, 40000, 36816, 34822, 37605, 33159, 29517, 36241, 44832, 48567, 43999, 37242, 37015, 38131, 32784, 30072, 34556, 30367, 26183, 23218, 23048, 17564, 23208, 25397, 16147, 9760, 14012, 14687, 9611, 11696, 8530, 13892, 22362, 18591, 13157, 16768, 15304, 17924, 22032, 28181, 29523, 30804, 28736, 24624, 19441, 16690, 21144, 21085, 16921, 13027, 11299, 14901, 12823, 13792, 8264, 4559, 6217, 6596, 21, -3191, 1993, 4560, 8247, 8091, 11493, 7368, 536, -2140, 7343, 10132, 9930, 8581, 7071, 6981, 8832, 15605, 18034, 20397, 17253, 10931, 9059, 4981, 7951]
12735G951M737l780j36M496L548j212R84m181k701j941J039m853m986j202l050
12720e287l972N85J457J744O767J484L282J551K989K082j394j089M159k652j127
12705A0579Q51k195QP81j164n819j783M666K941P654O046j3688n471K602k311
12690C697R38M220L213p862q087L0J661L864k683r82K987J592j0979J208P333
12675A50P833q192o480Q870M037n322p06K395R50Q967Q75o010k701m345l890l307
12659f876Q782P051K243l24K410j404O22r117p036K56M521K189N500L986M782
12644A7585J80p474q617j856L337K685j2r33j172K651p49m495M080N014J996K046
12628A4266l245L072M565o215k857K911N202J922M885m02p341L647J3895N93J630
$$ y = [7951, 12688, 8908, 8772, 13268, 16816, 15604, 16588, 12407, 9706, 7765, 8804, 3951, -1035, -2237, -5287, -9259, -8674, -7217, -5473, 1294, 2778, 6060, 7611, 10600, 12682, 11288, 10199, 14358, 11706, 10579, 11430, 9235, 9243, 10024, 8860, 3041, 1258, 5924, 8865, 16519, 22565, 8877, 3406, 6008, 3697, 4635, 8855, 12068, 4206, -3881, -3851, -2190, 1674, -1009, -1991, 996, 2588, -8391, -7183, 150, 7983, -209, -6689, 2181, 6218, 896, 190, 2585, 3535, 12502, 13377, 7367, 4666, 321, -3569, -6876, 1906, 8957, 11200, 10876, 13286, 11882, 12504, 3387, -3649, -3393, 1128, 3317, 8817, 12803, 17585, 17765, 10291, 1674, -182, 3155, 5840, 5828, 4895, 3723, 6374, 5625, 1130, 5210, 10224, 12220, 14266, 11021, 14093, 18658, 12443, 9586, 12497, 17699, 19621, 24506, 24104, 16763, 20410, 34305, 34898, 36528]
12613C6528J1512J3658J4612J5301J4274J1233Q87j0288k0558j2221j0091r932
12601E4915q901j1197p924M68k33J522P51J98j781l60l147M295j855m002K659
12586B5408M07L296N635m40k189L225j854R16J838N568J1672L560O622J1409K0332
12571I5405L4804M0811L8156K9420J6478m428l5116l7573l6016l5425l0648j6930
12559E8938j0560o028j1193m728K108j193J220k995J882j705O096Q02n523p893
12545A9228n778N850Q27m82K75L349M696k354k188k373L144N292J0143J5568J2660
12530F7857J6643K1431J3337Q933J487j1349j6475j3234j5659j9340q911p542
12518C7178l074j0457r112n128J562K116q112n383R24J1068K386m145k542k766
$$ y = [36528, 48040, 61698, 76310, 91611, 105885, 117118, 118005, 107717, 87159, 74938, 64847, 54915, 46014, 34817, 26893, 27361, 27128, 28650, 29401, 29599, 27818, 27458, 24311, 28606, 26751, 22749, 25408, 25815, 29111, 34746, 34306, 32117, 35342, 33488, 34404, 36242, 41810, 53482, 57042, 63664, 75073, 95405, 130209, 171020, 209176, 238596, 255074, 250646, 215530, 177957, 141941, 106516, 75868, 58938, 48378, 42350, 31157, 26429, 28537, 27344, 28564, 25569, 27451, 25746, 31842, 32644, 27121, 19228, 13450, 19300, 20127, 19645, 19920, 23269, 27965, 25611, 23423, 21050, 24194, 29486, 39629, 55197, 67857, 84500, 105931, 119268, 128201, 129688, 118339, 101864, 88630, 72971, 53631, 44720, 37178, 34104, 23647, 14535, 9407, 10969, 13085, 4973, -410, 514, 11582, 13968, 9823, 7281, 4515]
12504D515N498n67k037L164l233l858K324N811K232J362n816q219N512P510N757
12489A9955n879n149k294n19J161L723o423q270n334M656O918N02N026j524k501
12474D048o557m44J237j548l242N372P269n972O58J712n825j511j995L245k659
12459f212j279K208J624O399K21m391j655j123K844J867M402R311J168k742r71
12444A1671o344K605k159k17l456K76k63k301Q7K411k143o820j97L201m671J942
12428f378K100L088j151K552m49L461P46J052J345R32k84q84o77m81k176n988
12412c192q768l168K345P530m1J042j93N68j096Q280L969M632p803n241l706M286
12396e56J721M825r10l578O80L257j960j1908k812K83M406K812N10L052K040k03
$$ y = [4515, 10013, 9446, 7409, 10573, 7340, 3482, 5806, 11617, 13849, 15211, 9395, 1176, 6688, 14198, 19955, 14076, 8927, 6633, 6114, 7275, 10998, 4575, -3695, -9029, -4373, 2545, 3047, 8073, 6549, 4048, -2509, -2953, -1716, -3264, -6506, -1134, 6135, 163, 821, 2533, -3292, -4803, -6798, -3553, -6212, -7491, -5283, -3659, 2740, 2961, -1430, -3085, -4208, -1364, 503, 4905, 14216, 15384, 12642, 11671, 5327, 7932, 5773, 5556, 2100, 2376, 2113, -188, -101, 2310, 167, -6653, -6850, -3649, -8320, -6378, -4278, -1190, -2341, 211, -238, 3223, 3969, 5021, 6366, 7298, 7014, 6130, 5453, 4972, 2796, -3192, -11960, -15128, -12783, -5253, -5294, -4252, -4445, -3877, -4973, 3307, 7276, 11908, 4105, -1136, -4842, -556, 1165, 5990, 5080, 1502, 2182, 5439, 3479, -8429, -11241, -10958, -6552, -3740, -3230, -178, 1862, 1659]
12380A659J602k434p224m679K328N98k64Q742O958M943l826k527m563P44N82m4
12364B595L591j079P7J498j735K783k561o337p724K241P040m500q674j85M454
12349h516L00J927q17O669j398j804J41P622J840k539l706l32R534M4m576j553
12333B836n927n984j818J871J1457M414J837k88j1980q857J283O100P056l335
12319a335k993J394M847K91m869Q40j384n832Q243P917K1K140J044l111l703m466
12303i56R87J673K928p554J923M422M93j297j021n457l270l917N110N782M919
12288D765P776j863k209L824P505P58k639o869m435L744O97p512j702L597L72
12273E809K8K528p23o181p027o54R85L882K884m240L996N92k89o23J105N586J737
$$ y = [1659, 3261, 827, -6397, -11076, -8748, -8150, -8414, 328, 7286, 12229, 8403, 5876, 1313, 2057, 2639, 2595, 6186, 5107, 5184, 6682, 4947, 7730, 5169, -1168, -8892, -6651, 389, -4111, -12785, -12970, -8516, -8216, -6289, -7106, -437, -1835, -3639, -3498, 4124, 5964, 3425, -281, -613, 8921, 8965, 4389, 2836, -3091, -9075, -10893, -9022, 2435, 6849, 8686, 8398, -3582, -12439, -11156, -5056, 2000, -1335, -4328, -2934, 1913, 2204, -2665, -1825, -3209, -9041, -798, 7119, 7140, 9280, 10324, 7213, 3510, -956, 31, 1704, 4632, -2922, -999, 3423, 3916, 2619, 1598, -3859, -7129, -11046, -5936, -154, 4765, 12541, 10678, 8469, 12293, 19798, 20556, 17917, 11048, 6613, 10357, 11054, 3542, 1840, 5437, 5809, 5837, 8365, 7642, 1461, -5566, -6220, -5235, -1353, 1531, -2709, 1287, 1879, 1590, 967, 2072, 7658, 9395]
12256I395P000K46o558r872R96Q594K770J875J728o411r740N306M857J767l09
12241A1644j2318l082k042J620k719m561j121R68N397O254j209Q10o14J662j593
12226i04M038L50p026J513J261L588l745m763j124R22j133K506K35j755L748j136
12210c425m955n704Q64L618J137j468j413m786l70N101J0072L078P6Qo806P46
12194d227N603L016p448M099k003K901n66j452m269n52o83L024P684n95q964k628
12178g060L080K626M710J304o04n864J521j402m051J602N741K880P167L263l433
12163A1480n885m240k320o474p203K401L357K025P569J743n483r506J024P047
12149d465J52l552l655n932p566N471J230N528O511M151k365n973j931N640P014
$$ y = [9395, 16395, 16641, 10083, 211, 1207, 9801, 12571, 14446, 16174, 9763, 23, 5329, 10186, 11953, 11644, -674, -3756, -5798, -4178, -6897, -11458, -12579, -11611, -6214, 40, -1169, -359, -973, 689, -904, 3134, 3484, -3542, -2029, -768, 2820, -925, -5688, -6812, -5890, -7023, -4517, -4282, -6037, -2289, -3425, -8380, -14084, -13220, -9602, -8465, -9933, -11346, -16132, -16502, -11401, -1329, 1749, 1825, 1833, -4973, -4227, 1376, 4392, -3056, 1043, -960, 1941, 1375, -77, -4346, -4898, -5581, -2557, 5127, 4532, -4432, -7060, -3980, -1354, 3356, 4660, 4056, -1808, -287, -1689, -5740, -4138, 1603, 4483, 11650, 14913, 11480, 5595, 1355, -965, -7439, -14642, -12241, -8884, -6859, 710, 2453, -3030, -12536, -11512, -4465, -4313, -7865, -11520, -17452, -25018, -19547, -18317, -12789, -6278, -2127, -4492, -10465, -12396, -6756, 258]
12134B58M431j298l705p916k545M533J805k629J696K8Q166n60k076K253m096K318
12118F63K148p881q955p267K600O872L863L012q318k827j323M462L636K823J418
12103e074J890m43q767L895K650k770J65k64J171M792M774l309l086J234j662
12088d804J66P550J803J943o763k886J289K161N550K562j782j657k899n438n907
12073i112J320P384N665K450M96m78q618m82q064r375J034N61L122r64O868R26
12057g267n6K332j945K48J706L197q88n635J21N850M47q87j350J044L200O31m999
12040d251m427K381m795K094M018O046P281o289l416K074L158o7L463m92o661
12025A17Q17j861k396J428K436J660O356L327k548o263k600K245j430j311j760
$$ y = [258, 4689, 3391, -314, -8230, -10775, -6242, -4437, -7066, -5370, -5342, 2824, 2264, 188, 2441, -1655, 663, 2811, -5070, -14025, -21292, -18692, -11820, -7957, -4945, -13263, -16090, -17413, -12951, -9315, -6492, -5074, -3184, -3627, -12394, -8499, -5849, -8619, -8454, -8718, -7547, -2755, 2019, -1290, -4376, -3142, -4804, -4638, 2912, 4715, 6658, -105, -2991, -1702, 459, 6009, 8571, 6789, 5132, 2233, -3205, -9112, -7792, -408, 5257, 7707, 8203, 7725, -893, -1375, -9439, -18814, -17780, -17219, -14097, -15061, -8193, -7267, -7323, -4991, -6936, -6688, -4982, -1785, -2673, -8308, -8187, -2337, -1890, -2777, -4127, -3083, 117, 748, -4251, -8678, -6297, -11092, -8998, -4980, 1066, 8347, 2058, -1358, 716, 3874, 3807, 7270, 6778, 117, 934, -927, -3323, -1895, 541, 2201, 8557, 11884, 9336, 3073, 473, 2718, 1288, -23, -1783]
12010a783L291m244J787M087j486n389k107q17n299O75j334l92O000J15k80m72
11994g648L543K120P310m097l466O6p38m525k079o015L608K602K055N075l352
11979e541K586K631L691l896J586o16o325k944P573M841K322L043q378j202j425
11964b054k591K421L635K535l150k864l227j705O079L131l237j707J860l64l232
11949d470R45l849o680L588J30M639k887m643O436M309K985k073k861Q84K287
11934a260k920j677L143O557m500m427k511J034L42l490K298K874L793Q841J393
11919I490m093j2889k688R287L281j883n506m126J095N679L865R18j163k908O224
11904D583K619K18j740o705J375Q62J906J561k30R579n563j564J741m606p171
$$ y = [-1783, 1508, -2736, -949, 3138, 1652, -3737, -5844, -6661, -11960, -11285, -12619, -13011, -7011, -6896, -7176, -7648, -4105, -1985, 5325, 1228, -2238, -2172, -2910, -7435, -9514, -15529, -11921, -9319, -7264, -2189, -5541, -2955, -324, 3367, -529, 1057, 441, -5884, -8828, -1255, 3586, 5908, 8951, 573, -629, -2054, -4645, -2224, 1411, 3946, 796, -2068, -5295, -7000, -921, 2210, -1027, -2734, -874, -1238, -4470, -3525, -7374, -14054, -10466, -10336, -5697, -8584, -13227, -6791, -2482, 503, -1570, -4431, -3547, -1260, -4180, -5857, -2714, 3843, -657, -5084, -7595, -6561, -6219, -9709, -7411, -4537, -744, 8097, 9490, 5397, -7492, -10180, -893, 2388, 505, -5001, -9127, -8032, -2353, 1512, 2430, 1267, -1641, 4583, 7202, 7420, 5680, -1025, 350, 1212, 3118, 4679, 4449, 14028, 8465, 6901, 8642, 4036, -3135]
11889c135L274L342r02K742K352k877p031j594L047L749Q41J201R98R2R9p859
11873a661k490j490N046J0539j635q339o27L599l153L706j244k954J622L13l48
11858H84K266N19K414J81p335j1908k762K142Q972k616m808R58M49J953J675M237
11842b779K698j815Q29o571M853L570J229K924J353O74P95k887q909R67Q23k13
11826b459M423j837J313M206J0643P515j0780p913N024K15l902n583m08O396k35
11811F618M79l45j596n62m592l999m279L276O105N163m820k43K833K599k559o20
11795C458l240j993m30K647l79K383L698J465j694j477L27q24p274j770M658L964
11779C519k712j495K595r67O18l30k424p071M0M076L374P84j349J272m342J192
$$ y = [-3135, 139, 3481, 2579, 5321, 7673, 4796, -2235, -3829, -782, 2967, 3808, 5009, 6007, 6099, 6198, -1661, -4151, -5641, -595, 9944, 8309, -30, -657, 2942, -211, 3495, 2251, -703, 919, 1232, 884, 3150, 3669, 6083, 6264, -1071, -12979, -15741, -13599, -4627, -7243, -12051, -11093, -10644, -8691, -7016, -2779, -81, -1896, -1067, -7638, -2785, 785, 2014, 4938, 6291, 6965, 7760, 4873, -4036, -3069, -2246, -2459, 1964, 127, 1440, 5646, 16289, 23804, 13024, 5111, 10135, 10350, 6448, 865, 457, 6853, 6618, 7097, 6752, 5156, 4594, 2, -3997, -8276, -5000, 1105, 6268, 1448, 1205, 4038, 6637, 4078, 3458, 218, -1775, -2205, 442, 63, 2446, 6144, 7609, 5915, 4438, 4765, 3941, -3333, -5103, -445, 3519, 807, -688, 1907, 940, 1558, 1228, -1196, -8267, -8227, -4151, -777, 7, -1342, -70, -4412, -3220]
11763c220M907M145J867n652J46N59k310O57Q262p08r588k91N500q32L611N995
11747A3048r626m398Q47p82l522K88k715O984O346K07k965M822M697j372m510
11732G349m368k854q32l54J81l6k258k576l238R044J4296N12o033m630k711l228
11716a736M28N990J958k613j638N471j794k281L219L105m040q346O150R322P082
11701B0277O287q05p421p597K250j377l139j145j182m6j914O211K425o706j1218
11686e100k979l546o36M507N512K864m99q86q13J123L791P81J560o192j291P877
11670F073N122r915j408K47k070R91Q37J712M56q93k304r304L034M733J210R11
11654e68L046j52l355l51k560j690J0070J0373K332n191j687r180m160K42n81
$$ y = [-3220, 1687, 5832, 7699, 2047, 2193, 2752, 442, 1099, 9361, 8653, -935, -1226, 4274, 3442, 7053, 13048, 3422, -976, -129, -911, -4433, -4145, -6860, 124, 6470, 6677, 3712, 8534, 13231, 11859, 7349, 2981, 127, -705, -1059, -878, -914, -3172, -5748, -8986, 58, 14354, 14866, 8833, 4203, 1492, -1736, -1308, 4682, 6640, 4027, 2389, 7860, 6066, 3785, 7004, 10109, 6069, -2277, 3873, 13195, 20277, 26564, 25759, 18338, 10741, 12991, 11614, 8475, 7330, 6148, 6102, 4188, 10399, 12824, 6118, -5100, -8079, -11625, -12261, -7754, -2242, 622, 123, -763, -1576, -453, 3338, 4119, 5679, -513, -1804, 6073, 11195, 1280, -128, 119, -1951, -960, -123, 1589, 2045, 1152, -1152, -10456, -7422, -2689, -1479, -568, 2478, 2326, -1029, -1380, -3940, -5630, 4440, 14813, 17145, 11954, 10267, 1087, -3073, -2831, -3412]
11639c412r98r0J30J156P524j593O00J683k84j583o669K851j770j540P741k303
11623A443q181L007R977M692J430j387o573l739J076L88O373J784q3N848j375
11608A4680q588n548j634l577n71J269J599K960J189m402k470q03k53r08j352
11593h409L949M118J224j988k99n588K872j577j564J814k59J397L647K36k630
11578c057n502k747M681Q986L132K336m483K985n686n908L144K61L676N5l624
11563a751j155M68l260K203K499L535o97l638M601O271J614n211j651o030j06
11548b308j496k79Q242L325l954j637Q74o690j53k096j904Q348N607O517k158
11533A0238k022L884M873j214j858q633m398N90O76k780K336Q31l413n451m183
$$ y = [-3412, -4410, -4500, -4370, -3214, 4310, 2717, 3317, 5000, 4716, 3133, -3536, -685, -2455, -3995, 3746, 1443, -6738, -3731, 6246, 10938, 12368, 10981, 4408, 669, 1745, 2133, 8506, 10290, 10207, 16055, 14680, 6092, 544, -1090, -4667, -5238, -3969, -2370, 590, 1779, -2623, -5093, -5896, -6149, -7057, -8409, -4460, -342, 882, -1106, -1405, -6993, -4121, -5698, -7262, -5448, -5707, -4310, -663, -427, -3057, -8559, -11306, -6625, 2361, 5493, 7829, 3346, 6331, 645, -5263, -2119, -1858, 1818, 1873, -1751, -2906, -2438, -5698, -3495, -996, 2539, 1842, -1796, 2805, 9076, 10690, 5479, 3828, -2202, -2308, -3804, -4083, 4159, 7484, 3530, 1893, 2767, -3923, -4076, -6172, -8076, 272, 5879, 12396, 10238, 8216, 12100, 16973, 15759, 13901, 5268, 870, 1460, 2136, -644, 1692, 2523, -890, -6341, -10524]
11518a0524r78R031O645k685K629L009P68n081j313n96j340k52k318k007P276
11503B264M237m168k2O2J160Q018l616n297j802n330L637N665M983R194j636j897
11487A5452l775m384k769K343M669k656q002q890M815K341L575L341P75j119m196
11472A520l905q237k48Q716q7p5O44k586K491O025R279k998k371J184J362n240
11456E474p350R602O837j0051m646J817n223J017m74L332L262p85O45l295p832
11441g670k393k016P11J777L260L994J89l401k95L159O7O208j170K791M294k05
11425I300n484k951p824Q803J802q456j578l370K35N14L540o29n57R5K96L047
11409c217M562K159n535l800N865l996K664K643J321k227l884n477N314O145J236
$$ y = [-10524, -11502, -2471, 4174, 1489, 4118, 7127, 7895, 2814, 1501, 905, -435, -687, -3005, -5012, 2264, 6501, 2333, 2311, 2373, 3533, 11551, 7935, 2638, 836, -4494, -857, 4808, 9791, 18985, 17349, 15452, 11677, 7293, 4524, 6867, 11536, 8880, 878, -8012, -3197, -856, 2719, 6060, 6835, 5716, 1520, -2385, -10622, -10870, -2154, -2241, -2316, -1672, -4258, -1767, 4258, 13537, 10539, 8168, 9352, 10714, 5474, -1876, 7726, 14563, 4512, -134, 1683, -3540, -2523, -2997, 335, 3597, 2812, 3457, 162, -7670, -10063, -12079, -11368, -9591, -6331, -2337, -2148, -5549, -5844, -2685, -2618, 3590, 2420, 5211, 9505, 9300, 3816, 865, -6959, 1844, 3646, -4810, -6388, -9758, -9523, -9009, -5469, -6098, -6655, -6560, -6264, -3217, 1345, 3504, -2031, -5831, 34, -3962, -1298, 1345, 2666, 439, -3445, -8922, -3608, 2537, 3773]
11394C773k862k523J727J947L436N47M08l502o861J601K741N352K260n974j0642
11379h572R05N010K832q16P345L40n184R95M141O586K065P89p088o826K20j368
11363A374M87k899M40q43M551N492J951k986n178o079N623K769j277p54l305l146
11347c780L830P986k467m990l778k974K591L778j984L181Q881o947n154K376L781
11332D330k74r41K64K372L794J539k687n323M318O246k443j0396n044P101j38
11317B718m243K999J3015O282p674p766L291q25m514m786m140j19J5160L102n077
11302G423n313j886O056O000M466K27n133L314j696j789k313j682k147K387R079
11287A6993L705l071j627l764O945L077J1865J6149K0119L0423L6848K4868J0338
$$ y = [3773, 911, -1612, 115, 2062, 5498, 6045, 6453, 2951, -3910, -2309, 432, 5784, 8044, 2070, -8572, -7667, -2657, 175, -641, 6704, 7044, 1860, 2855, 6996, 13582, 15647, 16436, 9348, 2522, 2742, 1374, 1861, -1038, -598, -1441, 3110, 8602, 10553, 7567, 2389, -3690, 1933, 4702, 3425, 2671, -634, -3780, 50, 8036, 5569, 579, -3199, -6173, -3582, 196, -1788, 1393, 10274, 3327, -1827, 549, 4330, 4056, 3115, 3379, 5751, 9545, 11084, 8397, 3074, 7392, 13638, 11195, 799, -4245, 2856, 2718, -1525, 1474, 14489, 20771, 13097, 5331, 8622, 7797, 3283, -1503, -5643, -5762, 9398, 12500, 7423, 2110, 224, 6280, 12280, 16746, 16973, 11840, 15154, 13458, 11669, 9356, 7674, 5527, 7914, 16993, 20698, 17627, 16000, 12236, 19181, 22258, 34123, 50272, 70391, 100814, 137662, 162530, 172868]
11274A72868n771j7693k7365l1965l4255k4132j2795J575p49q104j5O62l065L196
11260A2392J543l864J478l988O666j339j844l787lj614N771O67P772j349r319
11245I182k12l122j0438N035P336L38L639m973K586M533J606R65j463k543j525
11230A0944K454k0K658n481n065O95L383N004l087j132k906J402Q605o75j0553
11215F226K942Q887M441O52l613K361J608j936Q051J962L169Q765J781L401O171
11200E4868J4317J0063J1448J1459J1114J4514J6918J5496J6447R791P397j47
11188A93685j2011n182j0192p423j2384j8475j6751j0160n538j6296j4224L338
11176F8387l246p478n281j0006m451L119K855l027k654J577O829J5286J1570J3035
$$ y = [172868, 167097, 149404, 122039, 90074, 55819, 31687, 18892, 20467, 19718, 11614, 11599, 12261, 9196, 12392, 13935, 10071, 11549, 7561, 14227, 12888, 11044, 7257, 7254, 5640, 11411, 12078, 19850, 18501, 9182, 8970, 5848, -4590, 445, 7781, 8119, 11758, 6785, 9371, 13904, 15510, 16475, 15012, 12469, 10944, 13398, 13378, 16036, 10555, 5490, 6185, 9568, 14572, 11485, 10353, 7447, 8849, 17454, 16779, 6226, 9168, 18055, 22496, 23148, 19535, 21896, 23504, 21568, 29619, 31581, 34750, 43515, 45296, 48697, 54868, 69185, 79248, 90696, 102155, 113269, 127783, 144701, 160197, 176644, 186435, 193832, 193685, 181674, 176492, 166300, 158877, 146493, 128018, 111267, 101107, 95569, 79273, 65049, 68387, 65141, 57663, 52382, 42376, 37925, 41044, 43899, 40872, 38218, 39795, 46624, 61910, 73480, 86515]
11162H6515J9085K0723J7149Q026L44l758o418j9203l3450k1618j2201q618k389
11149D4187j0837j7800l659M529Q66K97o19j818j334o913N283R421L958r996j550
11134A4015q46l855m680L014O280o99j079o90J682k423L397l179o22J938J696
11119A3949K803j479j749J473P892K564o043p773K109k504k638N305k012k212
11105I685r31J25L407J392j023K065M819n127q009J521l180j417k083N3l89N296
11089F204k036k902K600o284k139K705P570r68l872n598m228K337p69P48L859
11074b773n319m206M760P759J611l159O052N104m90k965k452K198L605l033j475
11059E217k414J840L954l18N075P82k941l094j648K654M763K247P21j4m427n421
$$ y = [86515, 105600, 126323, 143472, 151498, 151842, 148084, 141666, 122463, 89013, 67395, 55194, 46576, 44187, 33350, 15550, 11891, 16420, 17286, 17583, 16964, 15146, 13812, 6899, 12182, 21603, 25561, 15565, 14015, 13169, 9314, 4634, 7648, 13928, 13229, 12150, 11460, 13142, 10719, 14116, 10937, 10315, 12253, 13949, 16752, 15273, 13524, 14997, 22889, 25453, 19410, 11637, 13746, 11242, 8604, 13909, 11897, 9685, 8754, 8879, 12286, 13678, 12655, 14720, 19539, 14412, 6403, 7924, 4744, 3327, 1244, 1297, 908, 6204, 4168, 1266, 3866, -2418, -4557, -1852, 5718, 4750, 878, -4720, -8948, -6611, -7380, -6632, -2773, -8092, -12298, -7538, 221, 1832, -1327, 4725, 9829, 9339, 6374, 3922, 6120, 9725, 6692, 5217, 2803, 4643, 8597, 8279, 13354, 14136, 11195, 8101, 6453, 9107, 13870, 16117, 16838, 16824, 12397, 6976]
11043F976l388O628J0772k95n377N976M83p3j0068n313m607k826L519j246O725
11028G886J557p640m42k761l843J662K710J434M620N581M869k63N100k036N16
11013A8950o95j957J066N27Q054j85n557J083j519r130N014L774l500l588P973
10998B0310k594o354k631k529r81P81p80J900J261L705K464q10j711K823j730
10983A3124j855L493K292p10q650j958N51l351L419O014j23K616M431m920j055
10968A3318j357k51k446q679j071L108M103m271n525M779P774J842o442M187M976
10953A4045K249o305K798O129l126R91K015Q252k120j2680p205J678R08L332R732
10938B0693M886J619o219l019L443M627N766N910m995k847J619L090m857n608
$$ y = [6976, 3588, 10216, 20988, 20693, 15316, 21292, 21775, 21702, 11634, 6321, 1714, -1112, 2407, 1161, 7886, 9443, 1803, 1361, -1400, -5243, -3581, -871, 563, 5183, 10764, 15633, 15370, 20470, 18434, 18950, 18255, 16298, 17364, 17891, 25945, 25760, 20203, 21286, 19767, 10637, 15651, 19425, 15925, 12337, 20310, 17716, 11362, 8731, 6202, 5221, 6002, 5222, 7122, 8383, 12088, 14552, 13742, 12031, 14854, 13124, 11269, 14762, 17054, 16344, 7694, 5736, 6287, 2936, 6355, 12369, 12246, 14862, 19293, 14373, 13318, 11961, 11710, 9264, 585, -486, 2622, 6725, 2454, -3071, 1708, 9482, 11324, 4882, 9069, 14045, 16294, 9989, 12787, 18916, 15790, 16781, 18796, 27048, 24928, 12248, 5043, 6721, 7629, 10961, 20693, 25579, 27198, 20979, 17960, 21403, 26030, 31796, 37706, 32711, 29864, 31483, 34573, 29716, 24108]
10924B4108k661k247M498R350P097J441j374P281R980J0550J1780P260J2090J0209
10910A09362L944J853n562j4431j1340j1607o055j1237o633o939p862r27j432
10897C1134j626k091j700L814K92m58k014J642O858Q815l458j521q260o138j794
10882B3495M086L404Q384J494K24J511M999J250R110J4585J1619J4421K2658L1733
10868A52973L5564K3111J5722Q909q772j5118j7826k1055k2554k7087k1673j8916
10856H3278m515o469n874m132j658j17j780m152n305m547j2154j277P218K460
10842D0976n688k421l276o152L908K444M721O06Q10l662j439N972Q782P043L371
10827E5995J992J0695J9159J2627Q487K3901K3996Q941r049j6009j5061j4177
$$ y = [24108, 21447, 19200, 23698, 33048, 40145, 41586, 40212, 47493, 57473, 68023, 79803, 87063, 99153, 109362, 113306, 115159, 109597, 95166, 83826, 72219, 66164, 54927, 48294, 41355, 33493, 32566, 31134, 29508, 27417, 25717, 29531, 29823, 29365, 27351, 28993, 35851, 44666, 41208, 39687, 31427, 25289, 23495, 27581, 30985, 39369, 40863, 41087, 42598, 47597, 48847, 57957, 72542, 84161, 98582, 121240, 152973, 188537, 211648, 227370, 236279, 227507, 212389, 194563, 173508, 150954, 123867, 102194, 83278, 78763, 72294, 66420, 62288, 60630, 60513, 58733, 54581, 49276, 44729, 32575, 31298, 38516, 40976, 35288, 32867, 29591, 23439, 27347, 29791, 34512, 35118, 35928, 32266, 30827, 36799, 45581, 52624, 55995, 57987, 68682, 87841, 100468, 108955, 132856, 156852, 165793, 156744, 140735, 125674, 111497]
10815A11497j6470j7537k0240l536N404m351k761P60o784n053K819m694n652j307
10801C2095L990K118J59m221l980K899l06k944j462J049j981o100J442L273Q4
10786B6115n045m08O079N36J752O309l018K613k365m238J581M850o50K714l152
10771C3673k793m027K866N624M200k68n107N1Q039Q70M894J204k082P38M796p61
10755E1917J33Q82J30J809k070k015J321n616N457K834j405o476j498J221j706
10740D4918q298m972np75k307o5N06Q316K558o636n327o512j056K739M781J74
10724B8039j360m550K560k024J18O720N242R328L502O432L134j383m002J402q11
10709E2347L461Q953K872L191q27m003J926K549j392O07K21P75n362o238r205
$$ y = [111497, 95027, 77490, 57250, 53714, 59118, 54767, 52006, 52766, 45982, 40929, 43748, 39054, 33402, 32095, 36085, 38203, 38362, 34141, 30161, 33060, 32754, 29810, 28348, 29397, 27416, 21316, 22758, 26031, 26115, 21070, 20662, 26741, 27277, 29029, 35338, 32320, 34933, 32568, 28330, 29911, 34761, 34111, 36825, 33673, 30880, 26853, 29719, 35343, 39543, 39275, 34168, 34219, 42258, 43128, 48022, 49226, 47144, 47882, 52678, 51917, 52050, 52932, 53062, 54871, 52801, 50786, 52107, 46491, 51948, 54782, 53377, 46901, 45403, 46624, 44918, 36620, 31648, 31643, 30868, 28561, 28496, 29002, 37318, 39876, 33240, 27913, 21401, 20345, 23084, 27865, 28039, 26679, 22129, 24689, 22665, 22783, 29503, 34745, 44073, 47575, 54007, 57141, 55758, 51756, 53158, 52347, 55808, 64761, 67633, 70824, 69997, 65994, 67920, 70469, 69077, 69684, 69905, 70680, 65318, 59080, 49875]
10694D9875k892n062l798k598L682O35k997M356R29K012M022L328l815j550n370
10679D0757k046J741j168n627l685O370O413n272k524P25L995N956L624k611M950
10664E1598Q608m228K085L797m895k636j312J48l916Q134J1562m88o260m318K734
10649F0613k918n285r724k732m893L563N317L193N133m606n448k47M305l098p79
10634D2394N3K984R358L924J162N451L825K115Q536P470J103m937m839n360r563
10619F3676l184j638p371K801J1685N173q97l98J877O449O958J047N028k212Q410
10604I7404Q229N761r256r477R803J2661N286J37m319L515M981N409Q723k419
10590A36438o327Q950N043Q543Q974J2311J8736J1431L460J5333J5592R871O160
$$ y = [49875, 46983, 41921, 38123, 35525, 39207, 39842, 36845, 41201, 42130, 44142, 48164, 51492, 47677, 46127, 40757, 38711, 40452, 39284, 33657, 29972, 36342, 42755, 37483, 34959, 35684, 39679, 45635, 49259, 46648, 51598, 60206, 55978, 58063, 61860, 56965, 54329, 53017, 53165, 49249, 57383, 68945, 68457, 62197, 57879, 60613, 57695, 52410, 42686, 39954, 35061, 38624, 43941, 47134, 52267, 47661, 42213, 41966, 46271, 43173, 42394, 42447, 45431, 54789, 58713, 59875, 65326, 69151, 71266, 79802, 87272, 88375, 83438, 78599, 73239, 63676, 60492, 58854, 51483, 54284, 65969, 71142, 70245, 69847, 71724, 78173, 85131, 86178, 91206, 88994, 97404, 105633, 111394, 102138, 92661, 102464, 115125, 120411, 120548, 116229, 119744, 124725, 130134, 138857, 136438, 130111, 139061, 144104, 152647, 161621, 173932, 192668, 204099, 207559, 222892, 238484, 248355, 254515]
10577B54515Q312J8373L1039N2764P4841J03805J30354J61202J80028J88682J85690
10566A389605J32159N0981n2454j30101j83415k01257j91791j56641j17331q2235
10556D57520o1029m2593k9220k2753k4735j6765m640p525Q07J4052N64m876J638
10543B60445Q156N675K214P52M016m120P156J0193J2562Q760J4041N727M750J2133
10529C52460J8886J3615J8180K4400L0247L0848L0438L5373L6595M1676N4838
10518F87556N9378O5986Q8331J12843J32548J48551J68557K03507K30165K72491
10508B169913L24605L97400N21472O78450R00299J190365J574934K033212K457664
10499A2248314K681414K507530J831113P27835n56448j694302k466105k741257
$$ y = [254515, 262827, 281200, 312239, 365003, 439844, 543649, 674003, 835205, 1015233, 1203915, 1389605, 1521764, 1572745, 1520291, 1390190, 1206775, 1005518, 813727, 657086, 539755, 457520, 396491, 353898, 324678, 301925, 277190, 260425, 255785, 248260, 249067, 263119, 263683, 258807, 260445, 268601, 274276, 276490, 277242, 281258, 277138, 284294, 294487, 307049, 315809, 329850, 335577, 340327, 352460, 371346, 384961, 403141, 427541, 457788, 488636, 519074, 554447, 591042, 632718, 687556, 746934, 812920, 901251, 1014094, 1146642, 1295193, 1463750, 1667257, 1897422, 2169913, 2494518, 2891918, 3413390, 4091840, 4992139, 6182504, 7757438, 9790650, 12248314, 14929728, 17437258, 19268371, 19996206, 19439758, 17745456, 15279351, 12538094]
10491A2538094k581312k149631j635130j166739q18584n77191l96538k75098k03540
10482B734331j59996j35820j22109r5920o8581m3594j2593L4359O5855J13613
10472B309545J59515K21707K99891L89589M93843N87481O62674P06309P14820
10463F545374P15567P66656R48373J273508J792030K515671L429365M412689N167262
10454B7566495N249546M269682K204244l61491k539911l729480l995797l896851
10446B4766437l791793l652197l315113k745381k057273j412384q91895n23780
10438F376621k82587j85323k02860l28998m84971n76390n62297m74492l62300
10429B916403k46638j55344r1234l7729J7654O1284J11328J47265J85995K35554
$$ y = [12538094, 9956782, 7807151, 6172021, 5005282, 4186698, 3609507, 3212969, 2937871, 2734331, 2574335, 2438515, 2316406, 2220486, 2151905, 2108311, 2095718, 2130077, 2195932, 2309545, 2469060, 2690767, 2990658, 3380247, 3874090, 4461571, 5124245, 5830554, 6545374, 7260941, 8027597, 8975970, 10249478, 12041508, 14557179, 17986544, 22399233, 27566495, 32816041, 37085723, 39289967, 38928476, 36388565, 32659085, 28663288, 24766437, 20974644, 17322447, 14007334, 11261953, 9204680, 7792296, 6900401, 6376621, 6094034, 5908711, 5705851, 5376853, 4891882, 4315492, 3753195, 3278703, 2916403, 2669765, 2514421, 2423187, 2385458, 2403112, 2464396, 2575724, 2722989, 2908984, 3144538]
10419C144538K90413L59252M61037O12560Q21276J083658J456347J942539K514193
10410A2685813L074140L416363L279378K458926R91635p75108k358302l381010
10402A9391835l699262l429085k823181k130373j534097j091386p75679n57529
10394C351243m09224l17668k63822k39152k16570k05405j98302j78588j56870
10385A165642j19170q8456p7482o2647n6263m7026m6517l8425l7762l0157l0472
10374E31265l3136j8296k1312j3898j1008k0078j8921j4660j2579r095n851j1791
10362C40640j7443j4195j1706j0278o071q073p261O145O652j354l46J1511J0077
10349B98298p183j0920o821j793r818j5504n585n720m776o940j6783j9713q800
$$ y = [3144538, 3434951, 3794203, 4255240, 4867800, 5689076, 6772734, 8229081, 10171620, 12685813, 15759953, 19176316, 22455694, 24914620, 25906255, 25131147, 22772845, 19391835, 15692573, 12263488, 9440307, 7309934, 5775837, 4684451, 3908772, 3351243, 2942019, 2624351, 2360529, 2121377, 1904807, 1699402, 1501100, 1322512, 1165642, 1046472, 958016, 880534, 817887, 761624, 714598, 668081, 629656, 591894, 561737, 531265, 498129, 479833, 458521, 444623, 433615, 413537, 394616, 379956, 367377, 358282, 352431, 340640, 323197, 309002, 297296, 287018, 280947, 272874, 265613, 271758, 278410, 277056, 276710, 288221, 298298, 291115, 280195, 273374, 271581, 261763, 246259, 240674, 234954, 230178, 223238, 206455, 186742, 177942]
10336A77942m654K547M071k14j1931m199J688L171R177J2823P603Q208K817O791
10322B15840P71L177o155j4919j6525j9128j0419q10L843K0766L1294L0422J7731
10309B55888J5398J8548P235J1924O488j2508q380j0015j8645r286k520N578J247
10296B60952K047L539L275L285P652N327J0665J7303J4242J3168L2981K5482J7294
10283D17212K0281K1161K2158K6585K3085K4825K2443J246l8496p2195q1376o0463
10271C26466l4628j0520q476j602N691L676n35N858J6875J0150K881m217j556
10258C10063l68o604m568K680J3775O444j896N679N218l517L017N334L594M120
10244C42971J5211J3087J3523J5173J0770P882O404J1955J4266J4918N335n811
$$ y = [177942, 173288, 175835, 179906, 179692, 167761, 163562, 165250, 168421, 177598, 190421, 198024, 206232, 209049, 215840, 216611, 219788, 213633, 198714, 182189, 163061, 152642, 151832, 155675, 176441, 207735, 238157, 255888, 271286, 289834, 297069, 308993, 315481, 302973, 294593, 284578, 265933, 256647, 254127, 259705, 260952, 262999, 266538, 269813, 273098, 280750, 286077, 296742, 314045, 328287, 341455, 374436, 399918, 417212, 437493, 458654, 480812, 507397, 530482, 555307, 577750, 578996, 540500, 468305, 386929, 326466, 291838, 281318, 272842, 271240, 276931, 280607, 280072, 285930, 302805, 312955, 315836, 311619, 310063, 309695, 303091, 298523, 301203, 314978, 321422, 319526, 325205, 330423, 326906, 329923, 335257, 338851, 342971, 358182, 371269, 384792, 399965, 410735, 418617, 425021, 436976, 451242, 466160, 471495, 465684]
10232D65684m885l924R692K3604K2684J8776J6818J4509J8695J5897J4553P612
10220F19715J988P872J5704K3426J6965K3291K9451L0243M2536M0870L4330L1539
10208I17930K6721K3188K5694K9940L7088L4263L8394N0001N7683O4752O2964
10197A368618M7072L9797M2577M8067N4516O2754O9613Q3001J00654J00358J20218
10186B137245J44995J63640J75607J77745J81521J80636J81692J93708K19647
10177C756436K74862L33916L84895M45981N10910N80751O82807Q09808R79972
10168H760338J167339J352010J497771J599080J639554J630344J772885K288677
10160B1707998L219699M540223O244369Q312449J0823834J4072285J8724816K5986442
$$ y = [465684, 460799, 456875, 466567, 490171, 512855, 531631, 548449, 562958, 581653, 597550, 612103, 619715, 621703, 629575, 645279, 668705, 685670, 708961, 738412, 768655, 811191, 852061, 886391, 917930, 944651, 967839, 993533, 1023473, 1060561, 1094824, 1133218, 1183219, 1240902, 1305654, 1368618, 1415690, 1455487, 1498064, 1546131, 1600647, 1663401, 1733014, 1816015, 1916669, 2017027, 2137245, 2282240, 2445880, 2621487, 2799232, 2980753, 3161389, 3343081, 3536789, 3756436, 4031298, 4365214, 4750109, 5196090, 5707000, 6287751, 6970558, 7780366, 8760338, 9927677, 11279687, 12777458, 14376538, 16016092, 17646436, 19419321, 21707998, 24927697, 29467920, 35712289, 44024738, 54848572, 68920857, 87645673, 113632115]
10152A13632115L7173853N1253717O1627175N8772191L2881926j7495722o3244709
10145B74600546p4987900o0015189m0287691k6011356j7199152j1769573q273871
10138C6055814n933480m347433l263545k475057j833188j354789j093541j095583
10130A4659198j285309j407649j340215j182340j007604q58104p10348n68002
10122F299627m52081m00053m01533m05914l74480l18910k76913k28412j81152
10113C260179j27948n4334n722K0313m480r7168k10727k50754k13576j77280j48293
10102A990210j41763j24183j09015r7237q4563p5977n1841m2183m0825l5261m2276
10091A145086m1102m0048m8437n3152m1340k7431m935r08o476n098o985n663m105
$$ y = [113632115, 150805968, 202059685, 263686860, 322459051, 355340977, 337845255, 274600546, 199612646, 139597457, 99309766, 73298410, 56099258, 44329685, 36055814, 30122334, 25774901, 22511356, 20036299, 18203111, 16848322, 15754781, 14659198, 13373889, 11966240, 10626025, 9443685, 8436081, 7577977, 6867629, 6299627, 5847546, 5447493, 5045960, 4640046, 4265566, 3946656, 3669743, 3441331, 3260179, 3132231, 3077897, 3072175, 3092488, 3088008, 2990840, 2780113, 2529359, 2315783, 2138503, 1990210, 1848447, 1724264, 1615249, 1518012, 1433449, 1357472, 1305631, 1263448, 1222623, 1187362, 1145086, 1103984, 1063936, 1015499, 962347, 921007, 893576, 888641, 887733, 881257, 876159, 869174, 863511, 859406]
10078H59406m573j7832k1789k1862l0450k5615j4314k1398j3826l232n647j0903
10066F67965j0461p158j6144j8023k5047j5751j4337j5004r536p080p903p719
10054E13802m545j2226o068m667p564n158k021l123k701R535O357J8887K5332
10041E25840M8916O2788O7019Q4766J06010J42971K27581L94229N19901N63945
10031B743966L68703m79512p77624n29945k73498j42622r7418r3205j00202j12075
10021E06568j17855q5658m8460q256l588O211P787P869q74j999j0715n347j0430
10008B35253m711L755j691n514o132J1j2727r729q588J2604M03j598m074l532
9994A93730K959M504J568L460J1408K0489K0113K4043J7548J5059J4362J2829
$$ y = [859406, 854833, 837001, 815212, 793350, 762900, 737285, 722971, 701573, 687747, 684515, 678868, 667965, 657504, 650346, 634202, 616179, 591132, 575381, 561044, 546040, 536504, 529424, 521521, 513802, 509257, 497031, 490963, 486296, 478732, 473574, 471553, 468430, 465729, 475264, 481621, 500508, 525840, 574756, 637544, 704563, 789329, 895339, 1038310, 1265891, 1660120, 2180021, 2743966, 3112669, 2633157, 1855533, 1325588, 1052090, 909468, 812050, 718845, 618643, 506568, 388713, 303055, 254595, 246339, 242751, 248962, 256749, 264618, 263744, 261745, 251030, 245683, 235253, 230542, 234297, 232606, 227092, 220960, 220971, 208244, 198515, 189927, 202531, 202934, 201336, 197262, 193730, 196689, 201193, 202761, 206221, 217629, 238118, 258231, 282274, 299822, 314881, 329243, 342072]
9982C42072n481j6026j9422j4599k3403j6008j3740n230j628p92k587l279N936
9969B25813L914R176R683q291n971J333p386j5847q335J50Q12p943j4713k1379
9955A61016k2221j3171r911n209o70r2p11m452l675O287Q353J0200M450L570M158
9940A37922Q775M827k263J909j018q014q906l59K805l600m86K336J449o283n677
9925A23417k581M671M974j014p76p126m021j17L521r06M794N517J69J2267J1242
9910A54031k405q638p097n575l819n64k090K951J2049M645K390m773n467p12L657
9895A38583L79j480J21K226J914p399n697K155O264K180O121L418N73J19Q337
9880A57814k454K35k49m483o28J463m738M417J704K598Q670L128p36L570M163
$$ y = [342072, 336591, 320565, 301143, 286544, 263141, 247133, 233393, 228163, 226535, 225743, 223156, 219877, 225813, 229727, 238903, 248586, 240295, 234324, 235657, 228271, 212424, 204089, 204239, 205051, 197108, 182395, 161016, 138795, 125624, 115713, 110504, 109834, 109742, 109031, 104579, 100904, 107191, 115544, 125744, 130194, 133764, 137922, 146697, 151524, 149261, 151170, 150152, 142138, 133232, 132873, 135678, 132078, 131592, 133928, 135377, 129094, 123417, 120836, 125507, 130481, 129467, 128691, 121565, 117544, 117427, 120948, 120042, 124836, 130353, 130522, 142789, 154031, 151626, 142988, 135891, 130316, 126497, 125933, 123843, 126794, 138843, 143488, 145878, 141105, 135638, 134926, 138583, 138962, 137482, 137603, 139829, 141743, 134344, 128647, 130802, 137066, 139246, 145367, 148785, 149358, 149477, 157814, 155360, 155595, 155346, 150863, 150235, 151698, 146960, 151377, 153081, 155679, 164349, 167477, 166741, 170311, 174474]
9865A74474K223J325j270o867l936L345N773J465k845J27N178M963L916Q140J3566
9850B09577J5338K126O553P661M227Q551J2661J1143J1547K1025K8680M9532O4419
9837D53040O9504Q0765P9761P9686R1085J11316J25486J48062J64462J84862K11299
9826A799328K24776K24000J83703J05596R742j02414j86478k29106k25094k04102
9816A599951j76327j48313j20753q7385o6435m2408l1411j8613L900L4079M6598
9805I92883N3260P8271J04908J30039J78473K48587L28431M31460N77197P29368
9795C852877Q59355Q94119P45617M02866j5171l87001p45659r79306r50433p51814
9785B925450n36233l80714k70010j86621j27522q7366n9555l9145k2855j6184
$$ y = [174474, 176697, 178022, 176752, 169885, 165949, 169294, 175067, 176532, 173687, 173814, 178992, 183955, 187871, 196011, 209577, 224915, 227041, 233594, 241255, 245482, 254033, 266694, 277837, 289384, 310409, 339089, 388621, 453040, 522544, 603309, 683070, 762756, 853841, 965157, 1090643, 1238705, 1403167, 1588029, 1799328, 2024104, 2248104, 2431807, 2537403, 2547145, 2444731, 2258253, 2029147, 1804053, 1599951, 1423624, 1275311, 1154558, 1067173, 1000738, 958330, 926919, 908306, 912206, 946285, 992883, 1046143, 1124414, 1229322, 1359361, 1537834, 1786421, 2114852, 2546312, 3123509, 3852877, 4712232, 5606351, 6351968, 6754834, 6739663, 6352662, 5607003, 4627697, 3677264, 2925450, 2389217, 2008503, 1738493, 1551872, 1424350, 1336984, 1277429, 1238284, 1215429, 1199245]
9775A199245j0459j257K1840M0127N6856P7670J02982J29677J71354K23080K59338
9764B270453L06698L50612L80408M04669M61264N90819Q04240J104959J506065
9755H180187K005931K516343K822578K602002J730552N09456o75636j318515j299887
9746A7073011j119231j334438j897797k209174k030431j599169j143952p80162
9738D958657n27521l44388k16567j33279j17521j37676j19623n7764K9674J18784
9728C452776K00552K70876L04084L12352L06440K89455K38294J61806P7220J07447
9718E721302K78204N51047Q68367J259581J755413K306730K736242K832833K395584
9709B0705303J508947Q78216J016016J405544J078846n12943k466138l493523
$$ y = [1199245, 1188786, 1187529, 1209369, 1249496, 1306352, 1384022, 1487004, 1616681, 1788035, 2011115, 2270453, 2577151, 2927763, 3308171, 3712840, 4174104, 4764923, 5569163, 6674122, 8180187, 10186118, 12702461, 15525039, 18127041, 19857593, 20367049, 19691413, 18372898, 17073011, 15953780, 14619342, 12721545, 10512371, 8481940, 6882771, 5738819, 4958657, 4431136, 4086748, 3870181, 3736902, 3619381, 3481705, 3362082, 3304318, 3333992, 3452776, 3653328, 3924204, 4228288, 4540640, 4847080, 5136535, 5374829, 5536635, 5613855, 5721302, 5999506, 6550553, 7418920, 8678501, 10433914, 12740644, 15476886, 18309719, 20705303, 22214250, 23092466, 24108482, 25514026, 26592872, 26079929, 23613791, 20120268]
9701B0120268l478195k996538k476252j987896j497687j059660p20222n04716
9693E399102m39352m94475n01819m20606l21699k43521j76757j21251o8561j4321
9683B596740L9008Q1413Q7479P2416N4451O6957J33581K21553L26706M58468O47019
9672D785791Q71416J073644J219353J272014J254739J376411J686155J923773
9664A5463296J745355R68678k04761j241936j816483k117111k292473k171953
9656H332612j759746j285042q91040o19845m79750m14277l66260l03961k37636
9647A975055j90821j68169j41555j19367j05859q5021o7866n0679l3439l1386
9637I80893j4594J030J2502L0198M9531O4786P9344J10028J55322K14187K73530
$$ y = [20120268, 16642073, 13645535, 11169283, 9181387, 7683700, 6624040, 5903818, 5399102, 4959750, 4465275, 3963456, 3542850, 3221151, 2977630, 2800873, 2679622, 2611061, 2596740, 2635748, 2717161, 2804640, 2877056, 2931507, 2998464, 3132045, 3353598, 3680304, 4138772, 4785791, 5657207, 6730851, 7950204, 9222218, 10476957, 11853368, 13539523, 15463296, 17208651, 18177329, 17972568, 16730632, 14914149, 12797038, 10504565, 8332612, 6572866, 5287824, 4396784, 3776939, 3297189, 2882912, 2516652, 2212691, 1975055, 1784234, 1616065, 1474510, 1355143, 1249284, 1164263, 1096397, 1045718, 1012279, 980893, 966299, 967329, 979831, 1010029, 1059560, 1124346, 1203690, 1313718, 1469040, 1683227, 1956757]
9626A956757L67215M78580N80890O36356N82168L66087O3055k10429m74287p09906
9616C636486p72654o65877m91651l43675k47846j84802j30942r4531o0247m4627
9606E99634m8186l9387m7064m1088m0838l3548k6266k2632k2336j5209j1984j3932
9594B37164j0281m028p730j0347q059m618J448m008o466p198l412j1335r254k634
9580A49242n202Q58j774j3784j2433k824l969k547l421j899j352L231k419P96
9566A02503n033l427J05P342K922k113j638m734L642l80l878q311N566o68M801
9551I6699P113O86K648M673l677n201n001M425N669l060q828m080O213L683O95
9536A02657r06l504n207o462n030q168k784k177n502K614r18O362K547n189n480
$$ y = [1956757, 2323972, 2802552, 3383442, 4019798, 4601966, 4968053, 5031108, 4820679, 4346392, 3636486, 2863832, 2197955, 1706304, 1362629, 1114783, 929981, 799039, 704508, 644261, 599634, 551448, 512061, 464997, 423909, 383071, 349523, 323257, 300625, 278289, 263080, 251096, 237164, 226883, 222855, 215125, 204778, 196719, 192101, 193549, 189541, 183075, 175877, 172465, 161130, 151876, 149242, 144040, 144898, 143124, 129340, 116907, 114083, 110114, 107567, 104146, 102247, 100895, 104126, 101707, 102503, 97470, 94043, 94148, 101490, 104412, 102299, 100661, 95927, 99569, 99189, 95311, 87000, 92566, 91898, 96699, 103812, 104498, 107146, 111819, 108142, 102941, 97940, 102365, 108034, 104974, 96146, 92066, 98279, 101962, 102657, 101751, 98247, 93040, 86578, 81548, 73380, 70596, 68419, 62917, 65531, 64613, 70975, 73522, 68333, 62853]
9521F2853J332N052j878o815J064K86j863k443k703O049Q59M359M956N289k139
9506G4258n158O075J0862O891M680P77m95Q511K022j757o206j0409l477m337k440
9491G9797o811r004p930L706j608K256K904j257l994k867K56o29k312j689n676
9476D5142l947K546P922m681m050k340m591N836M607m20Q43L707L264O079N193
9461F5110N564R560M619n421k065j122p520J712k030j0153n756l388J73N859P803
9446F2945J61m852K964L093n593o940q228k807j52m488l120l801k88M421L379
9431C6694j429k592Q157R54M184l877k065n41l451L550N59k619RJ718j152j929
9415C6170K114j962j189J213j136m808j184r32N126J732L442J843k551j409m535
$$ y = [62853, 64185, 69237, 67359, 60544, 61608, 61894, 60031, 57588, 54885, 60934, 61793, 66152, 71108, 76397, 74258, 69100, 75175, 86037, 92928, 97608, 98385, 97890, 106401, 108423, 106666, 100460, 90051, 86574, 82237, 79797, 72986, 63982, 56052, 59758, 58150, 60406, 63310, 62053, 58059, 55192, 55448, 54819, 52507, 50818, 45142, 41195, 43741, 51663, 46982, 42932, 40592, 36001, 41837, 46444, 46024, 46867, 50574, 53838, 59917, 65110, 70674, 80234, 84853, 79432, 77367, 76245, 68725, 70437, 68407, 58254, 52498, 49110, 49283, 55142, 62945, 63106, 58254, 61218, 64311, 58718, 51778, 43550, 40743, 40591, 36103, 32983, 29182, 28894, 33315, 36694, 35265, 32673, 40830, 41784, 45968, 42091, 40026, 39485, 36034, 39584, 40143, 37524, 37533, 39251, 38099, 36170, 38284, 36322, 35133, 36346, 35210, 30402, 29218, 28286, 33412, 35144, 38586, 40429, 37878, 36469, 31934]
9400C1934m961M350P265J47k628L26K479q6Q7Q232O195l688K411R228k687j5264
9384D3340q223P20K896j386o035m874m764L140o85O34L948l413j1187j762O640
9369A8989K197k127l44N186k850p114J759l68N587P175K231M086J746P51O3K375
9353C9342P919Q649N452J6377J7359J3362O671K82Q60q753l605o563q365j2431
9339G6556j2344n733q667o399j395J647n047r491l062k444l72J071O177K55j605
9324B9147m12L44J572J780J1875J55j083k534j955m763K133K007N290N796P707
9309E7059J0585Q670J2999J3741J2167R559M066N898O527K367o563j2195j6318
9296A08562j4843j6674j4794r970k08o91r929j038L466j376q693o223K65L082
$$ y = [31934, 26973, 31323, 38588, 38735, 36107, 36433, 38912, 38826, 38913, 47145, 53340, 49652, 52063, 61291, 58604, 43340, 35117, 35837, 38733, 37347, 31312, 26438, 21674, 24814, 24129, 24763, 28711, 25298, 14111, 12349, 18989, 21186, 19059, 18715, 23901, 21051, 13937, 15696, 15328, 20915, 28090, 30321, 34407, 36153, 36904, 36967, 39342, 47261, 55910, 61362, 77739, 95098, 108460, 115131, 115413, 116273, 107520, 103915, 97352, 88987, 76556, 64212, 58479, 49812, 43413, 42018, 43665, 38618, 29127, 26065, 23621, 23249, 24320, 30497, 30752, 29147, 28735, 29079, 30651, 32431, 44306, 44461, 43378, 40844, 38889, 34126, 36259, 38266, 43556, 49352, 57059, 67644, 76314, 89313, 103054, 115221, 124780, 128846, 134744, 141271, 143638, 137075, 124880, 108562, 93719, 77045, 62251, 52281, 52073, 51382, 41453, 40415, 43881, 42505, 33812, 27589, 27854, 30936]
9282C0936J926J54L224N52j002m028K634M204l280M242m178J369m558O464N296
9267D3955M342Q100P838N373J869M552O583R311J1060O775M018j5307j3700j0990
9253G3779j0997q606j1424k665j989n649m316O63j427L522k863q366P3K903n947
9238A6691k798L117n051L162P18M39J338o491K009N096L399r42l509m950J19N224
9222A7571M40l699P486J2168Q066l047P27K16o841j1379k372j437K62N034M794
9207B7989m601n907k399K965r62n565k703K968j61l45L914l507q403M9N191L765
9191A2288K610l092n725m419L267o013l411P840P274N632p067k846J555J534L23
9176I750L041j818M532k603J412q97R11r75n929m014n87l91N934j501M18k352
$$ y = [30936, 32862, 33016, 36240, 36792, 35790, 31762, 34396, 38600, 35320, 39562, 35384, 36753, 32195, 38659, 43955, 48297, 56397, 64235, 69608, 71477, 76029, 82612, 91923, 102983, 109758, 113776, 98469, 84769, 73779, 62782, 54176, 42752, 40087, 38098, 32449, 28133, 28796, 27369, 30891, 28028, 19662, 19735, 22638, 16691, 13893, 17010, 11959, 15121, 15839, 16278, 17616, 11125, 13134, 18230, 21629, 20687, 17178, 12228, 12347, 17571, 18011, 14312, 21798, 33966, 42032, 38985, 39712, 39928, 33087, 21708, 19336, 17899, 18161, 23195, 27989, 23388, 17481, 15082, 18047, 17085, 11520, 8817, 11785, 11624, 11279, 15193, 11686, 3283, 3332, 8523, 12288, 14898, 11806, 6081, 1662, 4929, -1084, -4495, 3345, 10619, 16251, 9184, 6338, 7893, 9427, 9750, 12791, 10973, 15505, 12902, 14314, 13417, 14328, 13353, 7424, 3410, 2823, 2432, 8366, 6865, 7283, 4931]
9160D931q521r2N712N637L26l616j661J347k957l055p41N176J605M371M469k119
9144A0812j4j36m988J776K379k754o625p7N187N799j619l639k452p42K251Q347
9128A3505l93l173n658l40P09L969n436l010K850L199k446n95P764k617n322j355
9112A651N1O573k174M01r36M458R134M348q454j991j836k763o671L325j33j847
9096C136j472L999M523P209j378m916k601q140l828O218J0269M872j278o237J0
9081A0386o68l781o619l169M026J1507J349K283j927j082j1030l790K455R19m66
9066C93j529J270j329Q22Q157J0347J493k265k328r51O01j351J320o374k825K455
9050G906M455R56r363M8Q18n320q503K209J6823K531j378N832P237o99n016j574
$$ y = [4931, -3590, -3682, 2030, 7667, 7993, 4377, 2716, 4063, 1106, -1949, -2690, 2486, 4091, 8462, 12931, 10812, 10798, 10662, 5674, 7450, 9829, 7075, 450, 373, 5560, 11359, 9740, 6101, 3649, 2907, 5158, 13505, 13112, 9939, 4281, 3941, 4650, 8619, 3183, 173, 3023, 6222, 3776, 3181, 10945, 8328, 3006, 1651, 1702, 8275, 6101, 6502, 5566, 10024, 19158, 23506, 15052, 13061, 11225, 8462, 1791, 5116, 4983, 3136, 1664, 5663, 10186, 17395, 16017, 11101, 8500, 360, -3468, 2750, 13019, 17891, 16613, 10376, 10386, 9718, 5937, -682, -3851, 175, 11682, 13031, 15314, 13387, 12305, 1275, -2515, -60, 859, 393, -1136, 134, -1195, -373, 7784, 18131, 19624, 17359, 15031, 14080, 14681, 13330, 14650, 8276, 5451, 7906, 12361, 13317, 3954, 4002, 4820, -500, -9003, -6794, 10029, 12560, 11182, 17014, 24251, 23552, 18536, 16962]
9034A6962m231o121n282J120k19K168q377K953P237k849l03L749k969J396n095
9019A39L442k509m277n96K894M170j074r43K021k484m512N95L140N404m726o340
9003e656mO487j554J10L015M017L800P686l186n237j223O841j091k245L068l429
8987A1399q500O786N399o081m085m797j931K741k069r94K378L147o847N377P583
8972I506J623k948m586K087O868Q956n345m677J093O9l993n97k840l771K587k036
8956A996q626n51O610O598J909j563l601j841J922j881M167j702k02k348o096
8941e209j553N266J0366R66m334J084k042n040j496o154l10L750M621L894r81
8926B828M166L101m849n875K039j63n279n131P607O933m893j475J933q66p114
$$ y = [16962, 12731, 6610, 1328, 2448, 2229, 4397, -3980, -1027, 6210, 3361, 3058, 6807, 3838, 5234, 139, 3581, 1072, -3205, -3801, -907, 3263, 2189, 1246, 3267, 783, -3729, -3134, 6, 5410, 684, -5656, -5660, 827, -727, -617, 2398, 6415, 10215, 17901, 14715, 9478, 8255, 15096, 14005, 11760, 14828, 11399, 2899, 9685, 15084, 9003, 4918, 121, -1810, 931, -1138, -2132, 246, 3393, -3454, 1923, 9506, 11129, 8181, 3595, 5682, 12550, 21506, 16161, 11484, 12577, 12646, 8653, 8056, 5216, 1445, 4032, 1996, -6630, -7181, -571, 6027, 7936, 6373, 2772, 931, 2853, 972, 5139, 3437, 3235, 887, -5209, -6762, -1496, 8870, 9836, 5502, 6586, 4544, -496, -1992, -8146, -8456, -4706, -85, 3809, 2828, 6994, 10095, 5246, -629, 1410, 1247, -4032, -9163, -1556, 5377, 484, -991, 942, 76, -7038]
8911g038m973J738N356M938k7J0683K976o283L291M343l374o277P03K240l259
8896E037l652o435M841O121k988l171j404p964k235P121j4N17P533P285m360m825
8880A407L279R72M675M152P71L754m057n464l344M435L899p582q065N2J0745K3
8864I652j2784K722M855N251J876k272l959j867j342k791k59J532O72N014J827
8849H127N96l831L245Q133k952p150r8L146m732m167L533K05k268l02L967O982
8833A2434j295r519j311O88j898j473L127N237O284m589J248K107l111m047M138
8818H020n258j774p918n842m894J129O122P532j98L520N094j566m06j906P757
8803I412j19n080o85j217j284O233O583j252l094L119k555j510N270P216J761
$$ y = [-7038, -12011, -10273, -4917, 21, -6, 10677, 13653, 7370, 10661, 15004, 11630, 5353, 6056, 8296, 5037, 1385, -5050, -209, 5912, 2924, -247, -1651, -9615, -11850, -4729, -4743, -4226, 3307, 10592, 6232, 1407, 4686, 5658, 10333, 14485, 15256, 19010, 14953, 9489, 6145, 10580, 14479, 6897, -1168, -1116, 9629, 9652, -3132, -410, 4445, 9696, 11572, 9300, 5341, 3474, 2132, -659, -918, 614, 1286, 6300, 8127, 8723, 4892, 8137, 16270, 13318, 6168, 6070, 9216, 4484, 317, 3850, 4055, 1787, 1485, 5452, 12434, 11139, 1620, 309, 997, -901, -2374, 753, 5990, 12274, 7685, 8933, 11040, 7929, 3882, 8020, 2762, 988, -6930, -12772, -17666, -16537, -10415, -2883, -3081, 439, 5533, 3967, 3561, 1655, 9412, 9293, 4213, 3528, 2311, 1027, 7260, 13843, 12591, 9497, 12616, 10061, 8551, 13821, 21037, 22798]
8788B2798k600j0167j2873J947K225r23k465k55n235K528M48L056J893j16J956
8773B217j176M383N270n402o290k384l834N001J054k554j03l990o257M200K853
8758g012l620K131J914N402k09M26k843J063M828k156K646P051j586J971m87P03
8742A0222j935l548J757N883l677m547N364q87P28j036J621N2p595n312O915M915
8726H920k546l829N258M268j557m212l168r01l806J734q0l862j084L468O719J319
8710F641j530j630J506o53J549n952o845k340j178O944J2092L462m076m854m200
8695a064m498J570O687Q64n897k188J779J595k045n347p352J998K180K732O449
8680b537L013k536L429J714j612j455K260N072o740J166m530O61L196J413J570
$$ y = [22798, 20198, 10031, -2842, -895, 1330, 407, -2058, -2313, -7548, -5020, -4572, -1516, 377, 261, 2217, 1041, 5424, 10694, 5292, -998, -3382, -7216, -2215, -1161, -3715, -3818, -7808, -14065, -9865, -7012, -10632, -8501, -6587, -1185, -1394, -968, -3811, -2748, 2080, -76, 2570, 9621, 8035, 10006, 9519, 10222, 8287, 4739, 6496, 12379, 8702, 4155, 9519, 8632, 9360, 8324, 9945, 9997, 2402, -2910, 4005, 8920, 6374, 2545, 7803, 12071, 10514, 6302, 3134, 2233, -1573, 161, 81, -3781, -4865, -1397, 5322, 6641, 5111, 3481, 4987, 4334, 5883, -69, -6914, -9254, -10432, -3488, 8604, 12066, 7990, 3136, -1064, -5562, -3992, 2695, 3559, -2338, -4526, -2747, -1152, -3197, -8544, -15896, -13898, -11718, -8986, -2537, 476, -2060, 1369, 3083, 1471, 16, 2276, 7348, 608, 1774, -2756, -2095, 1101, 2514, 4084]
8665D084l239j412k409o64O328P400K896l449k183m790p557M634M271k51j708
8650A951j670k077n859m758K254l412M295J4915K641j43J900r577p317r52N804
8635b005P383O779j190O44J546R55m168m676J671n62q698p105K970P710O744L618
8619A1616n874j161K202j362o950l024m162M530N560j345p652K833M897J31J919
8604B158J85m925o58R018j693q273K645R731k784o314L575N826j44k946m875L456
8588C982K067m77n580q59N700L486k211K548N812N571m446q063k934k615J268
8573C249M653L325k925J674Q71J293j703l554j328j083l19q87k290L921Q671n972
8557G596l197K77N259l301n245j522l842L845K399o427K35j097Q52K894L493M772
$$ y = [4084, 845, -567, -2976, -3640, 2688, 10088, 12984, 9535, 7352, 2562, -4995, -361, 3910, 3659, 1951, 281, -1796, -7655, -12413, -10159, -13571, -9276, 5639, 8280, 8137, 10037, 460, -6857, -7809, -2005, 5378, 12157, 10967, 11611, 13157, 14112, 9944, 5268, 6939, 6377, -2321, -9426, -6456, 1254, 7998, 11616, 5742, 4581, 6783, 5421, -1529, -4553, -8715, -4185, 1375, 30, -7622, -4789, 108, 239, 2158, 2343, -2582, -3240, 5778, 4085, -4188, -1543, 8188, 5404, -910, 2665, 8491, 8347, 5401, 526, 3982, 6049, 5572, -8, -867, 4833, 8319, 6108, 8656, 14468, 20039, 15593, 7530, 4596, 1981, 3249, 7902, 11227, 8302, 9976, 10847, 12140, 10437, 6883, 5555, 4472, 4153, 3266, 976, 4897, 13568, 7596, 4399, 4676, 9935, 6634, 1389, -133, -3975, -130, 2269, -4158, -3923, -5020, -4168, -1274, 2219, 6991]
8541F991N04L659J337o211K10j147j325k066L769J795l264j568K522L6j0043p661
8525a2462J885J0109M997q688l045O142K839k026j02L221J378P71k379l535m397
8510e292K308O513M136n470j282K651J627q90p538m698o50J199j139j559L608
8495f476o64J202O110n620J480N98M965J912l302j214M135Q45o984j804K82O44
8479c891M666N203r59k936j518K858M486j438J063K270m550j612j013j033K203
8464C799n587K387K568L008M382l788l949L665J310r25r673R74J119M229p00J025
8448C844K402N085k738m908K082l601l734N845m277N766l997j660j314n977J555
8433e627j41j420Q452N721l955m25r53m231M506m827K943K146j136k03j748k370
$$ y = [6991, 7495, 11154, 12491, 6280, 6490, 5343, 4018, 1952, 5721, 7516, 4252, 2684, 5206, 5242, -4801, -12462, -10577, -468, 4529, -4159, -7204, -1062, 1777, -249, -351, 2870, 4248, 5019, 2640, -895, -5292, -2984, 3529, 7665, 2195, 913, 3564, 5191, 4301, -3237, -7935, -8585, -7386, -8525, -10084, -6476, -7140, -5938, 172, -5448, -3968, -3370, 1595, 3507, 205, -1009, 3126, 3971, -3013, -4817, -4535, -3891, 775, 5978, 5019, 2083, 565, 3423, 7909, 6471, 7534, 9804, 5254, 3642, 2629, 1596, 3799, -1788, 599, 3167, 6175, 10557, 6769, 2820, 6485, 7795, 6870, -2803, -1829, -710, 3519, 2819, 3844, 6246, 11331, 8593, 3685, 5767, 2166, -1568, 4277, 0, 5766, 1769, 109, -1205, -7182, -5627, -5768, -7188, 1264, 6985, 3030, 2605, 1652, -2579, 1927, -2900, 43, 2189, 1053, 850, -898, -3268]
8417c268l99P77j010N733n20k662p315M571k547j546j993M512M105N312n84l429
8401b63q57K851J126j331N24p872j439M661K776O202j614o121j679Q567K61m732
8385A060l624m419M093K691j374L319J808M702k816m858L204N805n258o104k439
8370d210M333j57k99J57R70J984j488p000L592K446N989O090k453p35q475n789
8354e045J199O10K744j945r23M863J497n747l506n049O944L614K224K964p227
8339b783n096j998P202M071J57m230k155J809q86l01J539J695Q478O017o267m676
8323B576K936O75M145O21l651j871p12K519m497m291l70K764m657L124k328j194
8307d211R798M237k777J869q3j347m195k157L391k399n147K082M178k021j1128
$$ y = [-3268, -3667, -2890, -3900, 1833, 1313, -1349, -8664, -4093, -6640, -8186, -10179, -5667, -1562, 3750, 3166, -263, -1120, 1731, 2857, 1526, 2050, -5822, -7261, -2600, 176, 6378, 4764, -1357, -3036, 5531, 5792, 1060, -2564, -6983, -2890, -199, -1573, 1746, 3554, 8256, 5440, 582, 3786, 9591, 4333, -1771, -4210, 123, -34, -333, -176, 794, 2778, 1290, -5710, -2118, 328, 6317, 12407, 9954, 9219, 744, -5045, -3846, -3236, -492, -2437, -3360, 1503, 3000, -2747, -6253, -11302, -4358, -744, 1480, 4444, -2783, -7879, -9877, -2675, 1396, 1553, -2677, -4832, -3023, -3909, -4210, -2671, -976, 7502, 13519, 7252, 2576, 5512, 6187, 10332, 10953, 7302, 5431, 4719, 7238, 2741, -1550, -1920, 844, -3813, -689, -3017, -4211, 5587, 9824, 7047, 8916, 8833, 7486, 3291, 1134, 4525, 2126, -3021, -939, 3239, 1218, -9910]
8292i910m79J460O29K158k861P894P703L008l450k587P97K0n545K830K748K410
8276F825k38k326L385k337p158J975O019j178M629J088K881o876q176j562n09
8261c558M669p68m739m422K599q54K571o011L65L852j422k382J827K492N82j676
8245f875J766L534J372j910l222N170L683n62o065l112O996N265n350q18l993
8230d121k28P594J539m476J411L352O378O07Q84o867n894N060K421k582q67j363
8214B848l95p297p125J887O809m500L910Q149l548l260r96q74Q34O055N287O704
8198A4488l299l408j532k195M06k182n360K085M652L84J373l325k379j27O31O635
8182F847Q50o77k992K016L227p775k796K710P06P986K896k023K414m129o215m127
$$ y = [-9910, -10389, -8929, -8300, -6142, -9003, -1109, 6594, 9602, 6152, 3565, 4362, 4382, -1163, 1667, 4415, 6825, 6587, 4261, 7646, 5309, -1849, 126, 6145, 4967, 9596, 10684, 13565, 6689, -1487, -3049, -3558, 1111, 343, -4396, -8818, -6219, -7073, -4502, -10513, -10148, -6296, -7718, -10100, -8273, -5781, -5199, -6875, -5109, -1575, -203, -2113, -5335, -165, 3518, 2956, -3109, -6221, 775, 6040, 690, -128, -4121, -4349, 3245, 4784, 308, 1719, 5071, 11449, 12056, 12940, 6073, 179, 5239, 7660, 5078, 4211, 2848, 2453, -4844, -11969, -10082, -3273, -7773, -3863, 4286, 738, -2522, -3518, -4392, -3558, 2497, 7784, 14488, 11189, 7781, 6249, 4054, 4460, 2278, -3082, -997, 3655, 4039, 5412, 2087, -292, -419, 212, 6847, 7697, 7020, 4028, 6044, 9271, 1496, -1300, 1410, 2116, 10102, 12998, 10975, 13389, 9260, 3045, -1082]
8166a082J649O07l24p530K061N528K410q96q815J833k079o390O769K507J861k70
8150b161o285K298J837K845P007n71m746l639N99J064K953n836n349M878M787
8135c19O202r5m354j318J708l144J624J937q009m389J663K94J797M787K469J799
8119B652K518m988o006ml538O282K303Q53J105o395n425J922K850J818j041k524
8103g618K339L995J812L888N030n21n971k994L135l32m891k719J795K736O231
8088E915j568J405N420R9O17M83l239m279l468p565L926O580Q470M030m504p587
8072D735k662m487l930r67J458N308N51k570k184J25M634q56j734M089K233K28
8056C971L452k611o42j337k812j651J531R20m555q0J447K291J001M695M745l855
$$ y = [-1082, 567, 1174, 850, -6680, -4619, 909, 3319, 2423, -6392, -4559, -6638, -13028, -6259, -3752, -1891, -2161, -8446, -6148, -4311, -1466, 5541, 4970, 224, -3415, -2816, -1752, 1201, -4635, -9984, -5106, -319, 5883, 5788, 1434, 116, 1824, -1320, 304, 2241, -5768, -10157, -8494, -8200, -6403, -1616, 853, 2652, 5170, 182, -5824, -5828, -9366, -3084, -781, 72, 1177, -5218, -10643, -8721, -5871, -4053, -5094, -7618, -5279, -1284, 528, 4416, 9446, 8925, 2954, -40, 3095, 2763, -2128, -4847, -3052, -316, 5915, 4347, 5752, 11172, 11271, 11888, 12371, 9132, 4853, 1385, -6180, -2254, 4326, 12796, 16826, 12322, 4735, 2073, -2414, -6344, -7311, -5853, -545, 6, -2564, -4748, -4623, 11, -845, -2579, 1510, 3743, 3971, 7423, 4812, 4170, 2833, 21, -1630, -99, 821, -3734, -3814, -2367, -76, 925, 5620, 10365, 6510]
8040F510j1669r841R77P875Q029N586p178n885J767J964o27M052K233l433n964
8025e604J37N10O777N642j52k738k020L478p27o47L083j303q613n514P16J461
8009e514K497N171m054N91k771J248J195J183M642J099l293n465k060N954Q911
7994I334N877N068p921j5322j1660L31R024J0585l518m928P305K339j716j1334
7980f536L059P256L616l725k080k635j392J880q33K63N73m039J044k897K222N689
7964A465P729P893q557p62N173o735m202K894k189p042M463J117j21L898K133
7949G157K297l845N684P795n047l226j03k396L66j045j232j531n819J033M290
7934D378M515P45n929o99n413J979J300L724n602j2481p0R132J020O130L987k374
$$ y = [6510, -5159, -15000, -14023, -6148, 1881, 7467, 289, -5596, -3829, -1865, -2492, 1560, 3793, 360, -5604, -5467, -4957, 1820, 7462, 7310, 4572, 2552, 6030, 5303, 4656, 7739, 6436, -2177, -7691, -6975, -5514, -3017, 2154, -1900, -1309, -4080, -2832, -1637, -454, 4188, 5287, 1994, -3471, -5531, 423, 9334, 15211, 20279, 12358, -2964, -14624, -14293, -5269, 5316, 1798, -3130, 4175, 6514, 4798, -6536, -3477, 3779, 7395, 3670, 1590, -1045, -2437, -557, -1390, -1127, -554, -4593, -3549, -6446, -4224, 1465, 9194, 17087, 8530, 7768, 12941, 6206, 2004, 4898, 2709, -4333, 130, 1247, 1126, 5024, 7157, 9454, 5609, 11293, 19088, 14041, 10815, 10712, 8316, 8682, 7637, 6405, 4874, -945, 88, 4378, 8893, 9638, 3709, 3010, -2403, -424, 876, 4600, -1002, -13483, -13553, -4421, -3401, 2729, 6716, 4342]
7918D342K336K87l54m839O3K901l397L34J56j551K276M987l526m34n49K643m521
7901A154o490p75n328K040O298r68N004J372K302J296M024l570J123L575p410
7886C647o778O82M520o376P50N819K614O06o054m198k320M263M004m817K242J638
7870B42m495l090j895Q815N175k605l911j868R54n613l340O246n265m619Q833
7855f436K966l90J66P153L065j506J254j456o710j476Q438Nn759k864M1O8M702
7838A261P184o99o151p221N904K931K381j780r095O40L254K544n489k774K238
7823d872J823q66N987J619K004K895M429j639n881k081p512n884K14N208M08k839
7807f987N539p13K52P366L810k828l863k322O481N073l162p222n490o92J0152
$$ y = [4342, 6678, 6965, 6611, 1772, 1835, 4736, 1339, 1673, 1829, 278, 2554, 7541, 4015, 3581, 3032, 5675, 1154, -5336, -6111, -11439, -9399, -3101, -4069, 935, 2307, 4609, 5905, 9929, 6359, 7482, 11057, 3647, -3131, -2449, 2071, -4305, -3555, 2264, 4878, 5484, -570, -4768, -7088, -2825, 1179, -3638, -1396, 242, -4253, -7343, -9238, -423, 4752, 2147, -1764, -3632, -2678, -8291, -11631, -5385, -10650, -15269, -6436, -3470, -3860, -3694, 3459, 6524, 5018, 6272, 4816, -1894, -3370, 5068, 5073, -686, -3550, -3509, -3441, 1261, 8445, 7746, 1595, -5626, 278, 3209, 5590, 3810, -5285, -4645, -1391, 1153, -4336, -7110, -4872, -3049, -3915, 2072, 3691, 5695, 8590, 13019, 11380, 5499, 3418, -4094, -9978, -9764, -4556, -4148, -6987, -1448, -2161, -1909, 5457, 9267, 6439, 2576, 254, 6735, 11808, 8646, 1424, -4066, -4758, 5394]
7792E394Q020p622j2287j0631L646O090K811Q320K761p578K23M714j16p299m636
7777h190J844K578k094K55J977P147k871n035j958J2055L16o198m875k510k972
7762a0531J440J2054J072K440p132k157j508J398P687P365J981q887p298j5k470
7747d561R349j517n381j0359m92o32K305o6N573R754j293M222l170l527k257P591
7731E539k222k11N95r182M453P781j597k864j17K246p009n134R25M584M162Q78
7715B827j458K567M835j958l466m357l491J004Q555l827p054o66N724K112l212
7700a865J351K015m11L349j868m249k015P07M454K807j64J772j689n299K28N057
7684D180m152K98N112k558j49J444o970k334O856K907n495K092K732P7J377j0246
$$ y = [5394, 13414, 5792, -6495, -17126, -13480, -7390, -4579, 3741, 6502, -1076, -853, 3861, 3745, -3554, -8190, -6346, -3768, -5862, -5607, -3630, 3517, 646, -4389, -6347, 5708, 6024, -174, -5049, -7559, -10531, -9091, 2963, 4035, 6475, -657, -2814, -4322, -2924, 4763, 12128, 14109, 5222, -2076, -2091, -4561, 4788, 3271, -2110, -12469, -12961, -13593, -11288, -11354, -5781, 3973, 2680, 6902, 3732, 205, -2052, 5539, 3317, 3106, 3701, -5481, -1028, 6753, 5156, 2292, 2175, 4421, -2588, -7722, -6797, -2213, 1949, 2827, 1369, 3936, 8771, 6813, 3347, -1010, -4501, -3497, 5058, 1231, -5823, -6489, -765, 1347, -1865, -514, 1501, 1090, 4439, 2571, -1678, -3693, -2986, 1468, 4275, 4111, 5883, 4194, -1105, -877, 4180, 28, 326, 5438, 2880, 2731, 4175, -2795, -5129, 1727, 4634, -861, 1231, 3963, 4040, 5417, -4829]
7668d829j395N847N23L527K059m295k433l112k443k577m72K020N477O468O255
7653A0620l455m321j589Q4J348L623p372Q79K736n434l699M58Q282l598o475j198
7637i111O349K657P79m153O02J653q61p185l978J4714O149K770n176q269K67O78
7621b115K45l536j55J358m566K570K129j537J88l343j184R760L757m281M382M324
7605G996j631n482j924n499k999K02L276J863L617K752q507K759j006n906L032
7590g457M055K1J137K967o05N685j72k087k628M557r53m726J759P262l678r144
7574d007L622Q559M732j689q049m658J046M651o4K643m634n470j167j301J149
7559d637k347l125k012L814O914j540O019L110l793L641m69k538J120O281k635
$$ y = [-4829, -6224, -377, 146, 3673, 5732, 1437, -996, -4108, -6551, -9128, -9600, -7580, -2103, 4365, 10620, 7165, 2844, 1255, 1339, 2687, 6310, -1062, -183, 2553, -2881, -6580, -6122, 2160, -1438, -7913, -9111, -2762, -105, 674, -3479, -2877, -1224, -2085, -9270, -13248, 1466, 7615, 10385, 5209, -3060, -2793, -2115, -1870, -5406, -5561, -4203, -8769, -6199, -4070, -5607, -5419, -8762, -9946, -186, 3571, -710, 3672, 7996, 6365, 883, -1041, -6540, -9539, -9337, -6061, -4198, -581, 2171, -6336, -3577, -4583, -10489, -7457, -3402, -3381, -2244, 723, 118, 5803, 5631, 3544, 916, 5473, 4520, -206, 1553, 8815, 5137, -4007, -385, 8174, 12906, 11217, 3168, -1490, -444, 4207, 4143, 6786, 2152, -3318, -4485, -5786, -4637, -6984, -10109, -12121, -8307, -1393, -2933, 3086, 6196, 2403, 6044, 5575, 3037, 4157, 10438, 7803]
7544G803L349j405q057k587M320J322q097K128p80P10L491m00o50K167Q00q147
7528d033K832k305J583J3556R042p316p464j256n455o519n012M403P098K599Q85
7513B638j392n119l552M028Q53j566L004M200q14L440n10l194j824k715m313n654
7497a2490Q479J216L169M034j540m184J974L965Q18o882m011j511m808L604L671
7482d496k59J848m822K411J0489L829j46N591l430m605q686n021M663N438k037
7467G67n600K832l8J132P674k202r20q254l194L241J0235J22l417J0219R561n500
7451A6658j0515o530k224j329M872K535J265K923K768l757j018r108j4168M61
7437a7167j880K151Q724N288l048j771n482j917K668L358O407L785L097q806o463
$$ y = [7803, 11152, 9747, 1690, -897, 3423, 4745, -3352, -1224, -2004, -1294, 2197, 1797, 1147, 3314, 4114, -4033, -1201, -3506, -1923, 11633, 20675, 13359, 5895, 4639, -816, -7335, -12347, -7944, -846, 1753, 2638, 1246, -3873, -7425, -3397, -2544, -4110, -1106, 3094, 2280, 5720, 5210, 2016, 192, -2523, -6836, -12490, -4011, -2795, 374, 4408, 2868, -1316, 658, 4623, 5441, -1441, -5452, -6963, -11771, -8167, -4496, -4755, -2907, -7729, -5318, 5171, 9000, 8854, 14445, 11015, 6410, -2276, -7297, -2634, 2804, 767, -4833, -2001, -2039, -907, 6767, 4565, 3645, -4609, -7803, -4562, 5673, 5795, 2378, 12597, 22158, 16658, 6143, -387, -2611, -3940, 932, 3467, 4732, 7655, 10423, 6666, 5648, -3460, -17628, -17167, -19047, -16896, -8172, -2884, -5932, -7703, -13185, -15102, -12434, -9076, -2669, 1116, 4213, -4593, -11056]
7422a1056L746R15n134j241O304L29k1n627Q098j476N132R147j1962n320k733
7407a0899m184M134L715j187o781K275O839k93p65J227K855j843L514N87j911
7392b717L235M116O62j976n016n988O752k898k134J956J452M919N529O065J36
7377A4093l884k887k051l993l193r13O248p87L155L155j646j266J738q968o10
7362a809M443L516k927j847L306J920O41L877Q38m565k886l082L001M431M512
7347A3369j531l006L350k188o754p921k286r6o061K131J145M595k659k657J0355
7332b14L368j063N05R54k025m329j20m926R623L280p655l151j849j599Q283J993
7316A075l229o312r55o17J771K551j891K745K471K31q026j497J123Q265L197k819
$$ y = [-11056, -7310, -6395, -11529, -12770, -6466, -6137, -6158, -11785, -3687, -5163, -31, 9116, -2846, -8166, -10899, -15083, -10949, -7234, -8421, -15202, -12927, -6088, -6381, -7146, -5919, -3064, -4907, -1393, -806, -2717, 518, 4634, 5296, 3320, -1696, -7684, -932, -3830, -5964, -4008, -2556, 2363, 7892, 13957, 14093, 10209, 7322, 5271, 1278, -1915, -2828, 3420, 2633, 5788, 8943, 7297, 6031, 7769, -1199, -1809, 2634, 6150, 3223, 1376, 4682, 6602, 7243, 11120, 11958, 7393, 4507, 1425, 4426, 8857, 13369, 11838, 8832, 12182, 9994, 3240, -4681, -6967, -7063, -13124, -10993, -9848, -5253, -7912, -10569, -214, 3154, 2091, 2596, 3550, 1525, -2804, -2924, -7850, 1773, 5053, -2602, -5753, -7602, -9201, -918, 1075, -2154, -8466, -9421, -10038, -8267, -5716, -7607, -4862, -2391, -2160, -10186, -11683, -10560, -2295, 902, -1917]
7300a917O516J919m851q132m394M604Q712p97k375p41j013j591k946J671M951
7285c84J926J776M960J361k730M2o049q314N916r01j532N294j037n992J1777N567
7269A1680o06P250M73q215J390o767M3L257L202l188j137n476j997K711q553j089
7253g022R360L996l554J408j507j292J180L754K372n806m290J138r35N635J236
7238E673J21m744P47k33J471L809P64l1k004q524M471L312L634m77n975o452K902
7221a536L820l070j219l737M570N553l403n703p99o35O157k083l8Q51j370p03
7205c345k626l644K950j779l16O06P569N66M126L030p386n410M577P526L571p489
7189B526o491m014m77L633L799l870p87j488K739O002j159n644K515p94k698l795
$$ y = [-1917, 4599, 6518, 1667, -6465, -10859, -6255, 2457, 1660, -715, -1456, -2469, -4060, -7006, -5335, -384, 1542, 3318, 8278, 9639, 6909, 6951, 902, -7412, -1496, -2397, -3929, 1365, 328, -5664, 6113, 11680, 11074, 18324, 18797, 10582, 11972, 5205, 5248, 8505, 11707, 8519, 7382, 1906, -91, 2620, -5933, -7022, 2338, 6334, 2780, 4188, 2681, 1389, 2569, 6323, 8695, 2889, -1401, -263, -1198, 4437, 5673, 5794, 1050, 1797, 1564, 3035, 6844, 7608, 7577, 5573, -2951, 1520, 4832, 8466, 7989, 2014, -4438, -1536, 2284, -786, -2005, -5742, -1172, 4381, 978, -4725, -5524, -6159, -2, -2085, -2123, -1272, -2642, -3345, -5971, -9615, -6665, -8444, -8760, -8154, -585, -19, 4107, 7137, -249, -5659, -1082, 6444, 10015, 2526, -3965, -7979, -8456, -4823, -1024, -4894, -5681, -7169, -4430, 1572, 413, -5231, -2716, -3510, -6208, -10003]
7173a0003P418K307n645J061L749L633j724Q76K594k028q566M84R593K376l455
7158B670j61n816r94J682L391rn038J620j987j15M731K429M254j735k869n238
7142c185J470P45l042j03O41J820l47j930J358M286L677k546k806J049m960m060
7126g933o30l12P238o52m73N298l245j827k88M600J827j0530K759L692L390k293
7110F21k448J910o299j330O110R315M025k28r700n227m5m3L4M26R90O781m988
7093i6m703k335L307j806o784K538P151O636K87k101j337N818O97m218m265l933
7077e144p882l618N721M992L250N466L481L379k412j354n872p901q4O277L017
7062A316M350n249r513J738M641k228M624J221j903n247L624j025J75m212K157
$$ y = [-10003, -2585, -278, -5923, -4862, -1113, 2520, 796, 1672, 4266, 2238, -6328, -5844, 3749, 6125, 2670, 2509, -3307, -4301, -2619, 772, 763, -4275, -2655, -4642, -4757, -26, 2403, 6657, 4922, 2053, -3185, -1715, -970, -4012, -4115, -3474, -1654, -2001, -3931, -2573, 1713, 5390, 2844, 38, 1087, -3873, -7933, -8563, -8875, -1637, -2289, -2762, 2536, -709, -2536, -2824, 1776, 3603, -6927, -4168, -476, 2914, 621, -1827, 83, -6216, -7546, -1436, 7879, 11904, 11676, 1976, -3251, -3296, -3339, -3305, -2879, -1889, 4892, -96, -4799, -7134, -3827, -5633, -12417, -9879, -2728, 3908, 4195, 2094, 757, 6575, 7272, 3054, -1211, -5144, -13026, -16644, -10923, -5931, -2681, 2785, 6266, 9645, 7233, 5879, 7, -7894, -7978, -1701, 1316, 5666, 417, -9096, -7358, -2717, -4945, -321, 900, -1003, -6250, -2626, -3651, -3476, -7688, -5531]
7047e531K984L3o28k999P847N168m231P21R717k45j284m177M41l168k990L456
7031E114K580n517l970n752O514K491l345K315k456J585N89n112M082l46J86n029
7015f071m661m47k798M275L875O538o019n585K125j024l243n9M8O521M499L307
6999A281K436P45k290l885m536j625k806L341P240j837q86K458l171J582m18P998
6983E627O51m61O025L523o359m858n962l209k7L14k821j361R188N663K649J652
6967A0234M885j243q51R364L941L266K411rm254l22j918l274r423k937L785M647
6951A8302p839o161k545k831L40N137K87l019m994j958q15j746L863L764k274
6936b489r4P332n935o153O183K637m335m798J196L155n743l630j206J842K449
$$ y = [-5531, -2547, -2514, -3142, -6141, 1706, 6874, 2643, 3364, 13081, 12836, 11552, 7375, 7816, 4648, 1658, 5114, 7694, 2177, -1793, -7545, -1031, 1460, -1885, 430, -2026, -441, 148, -4964, -882, -1228, -1042, -6071, -10732, -11179, -13977, -9702, -5827, 711, -5308, -10893, -8768, -9792, -13035, -13094, -13046, -6525, -2026, 1281, 3717, 4462, 2172, -1713, -6249, -7874, -10680, -7339, -99, -1936, -2822, -364, -3535, -1953, -2371, 5627, 6278, 5817, 11842, 15365, 9006, 4148, -1814, -5023, -5050, -4736, -7557, -8918, 270, 5933, 8582, 10234, 15119, 13876, 13025, 22389, 26330, 29596, 32007, 31998, 27744, 27422, 25504, 22230, 12807, 9870, 13655, 18302, 10463, 4302, 1757, -1074, -734, 4403, 4690, 1671, -3323, -5281, -6096, -7842, -3979, -215, -2489, -2583, 4749, -1186, -7339, -1156, 1481, -2854, -7652, -6456, -3301, -9044, -12674, -13880, -12038, -9589]
6921i589K312O629J084l724J045k582L54P274K966l081j972m99r02j741l854K549
6905c731n18L182j878L53P41m345j630o17M290J2103J654p695o676m307L99R26
6889g749J590j080N414m157K85L519R97j808n315J45k695m42M650R528N09l430
6873c9n177J288K188l83J632O3K840l1k43n421j762L258q734L641J1188J93j795
6856B706K738N789o978o965j705J550N660M443j47L060k129m504N896K500o411
6841E503K229l175j322L158p962q265k841M265J838k320L947J0390N460m331m048
6826B526M200J902n39J194p27o617j585P87l131J048J645j518q47m181o935K804
6810i974K610n50M900J330J759J107p77k745J469K978M352j933p707l43O178M397
$$ y = [-9589, -7277, -648, 436, -3288, -2243, -4825, -4471, 2803, 5769, 2688, 716, 217, -685, -2426, -6280, -3731, -4249, -1067, -2945, -2592, -1851, -6196, -7826, -8443, -4153, 7950, 9604, 1909, -4767, -9074, -8675, -7749, -6159, -7239, -1825, -5982, -5697, -2178, -1181, -2989, -8304, -8159, -10854, -11296, -6646, 2882, 3391, -39, -5216, -3928, -1740, -2123, -491, -428, 2412, 2381, 2138, -3283, -5045, -1787, -10521, -6880, 4308, 4501, 2706, 5444, 11233, 4255, -2710, -4415, -2865, 2795, 7238, 7091, 10151, 8022, 3518, 9414, 11914, 5503, 7732, 4557, 3235, 6393, -1569, -9834, -12675, -8410, -6572, -8892, -4945, 5445, 10905, 6574, 2526, 6726, 8628, 8089, 9283, 8556, 1939, 354, 1141, -1990, -942, 703, -815, -1662, -5843, -12778, -9974, -7364, -7914, -3014, -1684, 75, 1182, 405, -2340, -871, 2107, 6459, 4526, -3181, -3524, 2654, 7051]
6794G051j519N143L471M124Q45p751j0392j385K541K548M053m805L31O496L822
6779A4573m728m560n614j080p33P388L488m575j289L946K545o611l082j882M499
6764B285l73K708K218J29j319j541l478k314N12K792M239r21k197l035m008O30
6748c673N581n52k662j301L590m806M25K933m937r48N780l223o83k017K278L33
6732c882j757j453l87M435j706j711j077K678k26J946Q951k216K691k64p695n450
6716g123k447J0M894M11p36N745L514N853m171m510n3M18O644O213o527l576L072
6699G631j503m850k057Q55l162N874N896O73l630K365o889N91M774N82j499k604
6683C047j005R90J419m634n149k757L477Q76J199O807M146m241n963j245j923
$$ y = [7051, 5532, 10675, 14146, 18270, 19115, 11364, 972, -413, 2128, 4676, 8729, 3924, 4255, 10751, 14573, 9845, 5285, -329, -1409, -2142, 5246, 8734, 4159, 2870, 6816, 9361, 2750, -332, -2214, 2285, 1912, 4620, 6838, 6967, 5648, 4107, 629, -1685, -1173, 1619, 5858, 4937, 2740, -295, -4303, -3673, 1908, 1356, -1306, -2607, 983, -3823, -3398, -465, -5402, -6350, -570, -3793, -4476, -6493, -4215, -3882, -5639, -7092, -7479, -3044, -4750, -6461, -7538, -4860, -5086, -3140, 5811, 3595, 6286, 6022, -1673, -7123, -9570, -9560, -4666, -4255, -4991, 754, 4268, 10121, 5950, 1440, 1387, 1805, 8449, 14662, 8135, 4559, 7631, 6128, 1278, -779, 76, -3086, 2788, 8684, 9357, 5727, 8092, 1203, 1794, 6568, 7150, 5651, 3047, 2042, 3032, 4451, -183, -5332, -8089, -4612, -3736, -2537, 4270, 8416, 4175, -1788, -3033, -4956]
6668d956J53N116M873O11p366o645m610L949P241K340L495M574l278k062K685
6653F120J872r09K530k551j964N068P413q63j0202k444m366M106O278j943K199
6638A0344O762K014p74l950m825J195n85k879j369L434L747N548N66j397K702
6623B0533J388L524M572K120p35P393O840J1575M244R952J7535L0801L1719L2060
6609A83521R347k5531k5149j0182N954N767J3793K4089L8722N0289O9046R6482
6597D36148J16306J48764J84425K32271L61425O34017R89836J151965J177308
6588E432465m797j568864j538356q85066m47481k50279j55368j20018r2776o9851
6578B99609m6285l1752k6519j7606j5903j8033j0485N564J2473K3218K1584l746
$$ y = [-4956, -4803, 313, 5186, 5797, -1569, -8214, -12824, -8875, -1634, 706, 4201, 8775, 5497, 3435, 6120, 7992, 7083, 9613, 7062, 5098, 10166, 17579, 16716, 6514, 4070, -296, 3810, 10088, 8145, 10344, 17106, 19120, 18346, 14396, 9571, 10766, 10181, 7302, 5933, 9367, 13114, 18662, 19228, 17831, 20533, 21921, 25445, 30017, 32137, 31402, 38795, 45635, 57210, 61454, 71406, 88941, 119742, 151461, 183521, 192868, 167337, 142188, 132006, 137960, 143727, 157520, 181609, 220331, 270620, 339666, 436148, 552454, 701218, 885643, 1117914, 1479339, 2113356, 3103192, 4255157, 5432465, 5427668, 3858804, 2320448, 1435382, 987901, 737622, 582254, 462236, 369460, 299609, 253324, 221572, 195053, 177447, 161544, 143511, 133026, 138590, 151063, 174281, 195865, 192119]
6566A92119m2459m4804k1252j0930j3252r136j3387n83K056j0172q348L628k749
6553B0731m690J259o62O463J995q85j0064n015J007l361P015j831L63m90m235
6538G600J038L735n122l689j574J972J468L561j829L880J947o878k203k966L197
6523D137l687p038k864J659j557Q820N710m880j528r79J138j098Q58J0421q05
6508H307m097k085k953K73P687J186j995k991n832n995M29K286J199L012L077
6493A508J484J807M457J760p200r057q402n887Q796M69P629K179l513l058P200
6478A72N459K933k06l734j1522l196K069K241N194L948M931j548K68m207o296
6463c494l490j443j178O365P155j0265l066j128m28J243K125M282K93j947J906
$$ y = [192119, 149660, 104856, 83604, 72674, 59422, 50286, 36899, 36316, 38372, 28200, 19852, 23480, 20731, 16041, 17300, 16638, 23101, 25096, 24211, 14147, 9132, 10139, 6778, 13793, 11962, 12325, 11835, 7600, 8638, 12373, 7251, 3562, 1988, 3960, 5428, 8989, 7160, 11040, 12987, 6109, 3906, 940, 4137, 450, -6588, -9452, -7793, -9350, -530, 5180, 300, -1228, -2207, -1069, -2167, -1309, 9112, 8307, 4210, 2125, -828, -555, 7132, 8318, 6323, 3332, -2500, -8495, -8066, -5780, -4581, -1569, 1508, 2992, 4799, 9256, 11016, 3816, -5241, -13643, -19530, -10734, -10265, -2636, -457, -3970, -7028, 172, 5631, 8564, 8358, 4624, -6898, -10094, -8025, -5784, -590, 3358, 8289, 6741, 7009, 2802, -3494, -6984, -8427, -9605, -3240, 3915, -6350, -9416, -10544, -10972, -9729, -7604, -3322, -3029, -4976, -3070]
6448c070k547K774N035p971j087P427L239l038m480o527k902O295l656O436J365
6433b707K650k381k082J063k23o281n464M029N123O568K176m963k872q187k684
6418a6235L844R176R091Ml21m419nj190M7K624M888k512l451j119L053R497L593
6401A6565j667l808p287j3970o480P639R860K058M162K78n060l612J447k3l414
6386c312m293N973L893N75j446k366K350L858K958j219M90M914n240q489m863
6371f217J865Q467J82k38l411K084o71j980P46O87k892m163L742r07P59J506j52
6354e93N216o184o293j78j024O356l530K401N477M535k167j328J032K103m013
6339A810m791m672N59J855O23l845m161l831O268k90M058K582k919j54M568L297
$$ y = [-3070, -5617, -2843, 2192, -5779, -6866, 561, 3800, 762, -3718, -10245, -13147, -6852, -10508, -4072, -2707, -57, -2438, -4520, -3457, -3680, -9961, -15425, -11396, -6273, 295, 2471, -2492, -5364, -13551, -16235, -12391, -3215, 5876, 5880, 5559, 1140, 1135, -55, -8, 2616, 7504, 4992, 1541, 422, 3475, 12972, 16565, 14898, 11090, 3803, -10167, -16647, -9008, 852, 2910, 7072, 7350, 2290, -1322, 125, 102, -3312, -7605, -1632, 2261, 2836, 1390, -976, 1374, 5232, 8190, 6971, 7461, 12375, 7135, -1354, -6217, -4352, 4115, 4297, 4059, 648, 2732, 2061, 81, 827, 1514, -1378, -5541, -1799, -2706, -1947, -441, -593, 4623, -1561, -7854, -8032, -9056, -2700, -6230, -3829, 1648, 6183, 4016, 2688, 3720, 5823, 1810, -2981, -7653, -7094, -5239, -4616, -8461, -12622, -16453, -10185, -10475, -6417, -3835, -6754, -6908, -2340, 957]
6323I57k457K778K944J25n562L000O828o853j942O294J013j021K370k929q11l911
6307H23j81k802k403r056k772M691L453L497M634N60q018j569N070L935j142j941
6291c221n535J236N573o453n88Q732P046q883l448N264J041K836O414J362O702
6276A8078K94m043n955K917L4n768l339k944J249N90P390k141q95J560m465r78
6260A584M711K968m699n001l975j185j508j521K468L951q50L001L555n756M787
6245B530K916p96l081K182M828m359o460L5j426J504M437K053k515N771P104n518
6229I205p098n382j700J916N658L61m095j16m96j613j580J0776K895l755K501
6214G477J0500R244o862m362M709n479j154j292l327o029q070m757O024K699l547
$$ y = [957, -1500, 1278, 4222, 4347, -1215, 1785, 8613, 1760, -182, 6112, 7125, 6104, 8474, 5545, 4734, 823, 642, -2160, -4563, -13619, -16391, -11700, -8247, -4750, -116, 444, -7574, -9143, -4073, -138, -1280, -3221, -8756, -7520, -1947, -8400, -8988, -256, 6790, -2093, -5541, -277, 764, 3600, 10014, 11376, 18078, 18372, 14329, 8374, 11291, 11325, 5557, 2218, -726, 523, 1113, 8503, 6362, 5467, 7027, 2562, 1584, 6295, 9263, 4564, -437, -4412, -5597, -7105, -8626, -6158, -2207, -3057, -56, 3499, -2257, 2530, 5446, 4650, 1569, 3751, 8579, 4220, -2240, -2205, -3631, -2127, 2310, 4363, 1848, 7619, 14723, 9205, 2107, -3275, -4975, -3059, 2599, 2960, -1135, -1251, -1747, -3360, -4940, 5836, 8731, 4976, 7477, 17977, 27221, 20359, 15997, 20706, 15227, 14073, 12781, 9454, 3425, -4645, -9402, -3378, -679, -4226]
6199d226K241L477j111j889M05j375Q75l969l499K408K173j887j054J797j560
6184g194J943j360k083J250R48M047J368K900m138m284n42J307k926M230J0624
6169F090j373l821j350l646p025m164K2O787K923Q676k993k645j479o4J601K179
6153b82P998j306m656J167j836j859p958m071l05M62L516L437M651M49o26l738
6137d957n502q17K277j765R258M690p455k377L251L329l994q26J794N584j651
6122H39l321J289o284m941L283P182M385k744k786N693l611o867j774k169J222
6107a0604L573K931j343M98k200O419R41Q38K941l932j1980n610L046J1259N524
6092B301K729L273l925l730L932L330m47m425j1001k171K854L164M74O332l151
$$ y = [-4226, -1985, 1492, 381, -1508, -1103, -2478, -1603, -5572, -9071, -6663, -4490, -6377, -7431, -5634, -7194, -5251, -6611, -8694, -7444, -6496, -2449, -1081, 1819, -2319, -6603, -7145, -5838, -8764, -4534, 6090, 4717, 896, -454, -4100, -11125, -15289, -15267, -8480, -5557, 3119, 126, -2519, -3998, -4062, -2461, -282, 7716, 6410, 1754, 2921, 1085, -774, -8732, -12803, -13108, -12646, -9130, -5693, -1042, -593, -1219, -4957, -10459, -11276, -8999, -10764, -1506, 3184, -4271, -6648, -3397, -68, -4062, -4888, -3094, 2490, 839, -2482, -1193, -7477, -12418, -9135, -1953, 2432, -312, -3098, 2595, -1016, -7883, -9657, -11826, -10604, -7031, -4100, -5443, -4945, -7145, -726, 215, 1053, 3994, 62, -11918, -17528, -14482, -3223, 2301, 5030, 8303, 4378, 648, 4580, 7910, 7463, 3038, -7963, -10134, -7280, -4116, -3642, 2690, -461]
6077d61r573M42R854L446p482p758J438q76k783j885l456N496L690j581l281L63
6061a4407J962Q800L989p038k824L749M557J046J604o172J272J27n062K48L357
6046d792M222J667J483J304m249o164M364n87k432L63n51O608M517O240m935n496
6030A562m16n792p750M349N834l181L25n260l376J110K339O231J305l472l323
6015i515K453L010L448k065J939M606Q13K333L031l535j716o32q728K801N77l092
5999d272j855M095Q73M923j007L468N187o946n189J216M221K653n643r521k968
5984a0765M711R593K813n279p087J9K079j881j51N747L635l537o066K466j857
5969e560k533k666L45Q187K694k469q94l906k724j662m381J468N659N781k985
$$ y = [-461, -10034, -9592, 262, 3708, -3774, -11532, -10094, -10970, -13753, -15638, -19094, -13598, -9908, -11489, -14770, -14407, -12445, -3645, 344, -6694, -9518, -5769, -1212, -166, 1438, -4734, -3462, -3335, -8397, -8149, -4792, -570, 1097, 2580, 3884, -365, -6529, -2165, -2752, -5184, -4821, -5372, 1236, 5753, 11993, 7058, 1562, 1146, -4646, -12396, -8047, -2213, -5394, -5069, -10329, -13705, -12595, -10256, -4025, -2720, -6192, -9515, -7062, -4052, -604, -2669, -730, 3876, 4689, 7022, 10053, 6518, 4802, 4170, -4558, -1757, -1180, -4272, -6127, -2032, -1159, 3764, 2757, 6225, 11412, 4466, -723, 493, 4714, 7367, 1724, -7797, -10765, -6054, 3539, 6352, 1073, -6014, -5995, -3916, -5797, -5948, -201, 3434, -103, -6169, -3703, -5560, -8093, -10759, -10414, -2227, 467, -2002, -2896, -6802, -9526, -11188, -15569, -14101, -8442, -2661, -5646]
5954e646l394o21m967l177K456L602L788j541N802J0156k62q713M031O456R797
5939A7767k724n175K427M6p018k026r15l783O66O08L439j53k465p891L494j806
5923e509n34K470O349N916L571J859p28k768m725J501j911o571J658m508J646
5908b284M251o788j097J2892M184n358q558J531M662L820q31n858l749k654N605
5893b32m88M618K090m6j078k747K16k158q793p696L541L338K854n039l338k593
5877a7551J595Q624r12k042q15L369J70k840O79N270K870J321j139K841j39l249
5861a948n813o17P849k089k577k918r6R154L536M70q66K535K585l558l87m226
5845A034p716N56L805K131k744N207N40m230K2P93o272m089M15L687O988Q232
$$ y = [-5646, -9040, -9661, -14628, -17805, -15349, -11747, -7959, -9500, -3698, 6458, 6196, -2517, 1514, 7970, 17767, 15043, 9868, 12295, 12341, 5323, 3297, 2382, -1401, -735, -127, 3312, 3159, 694, -7197, -3703, -5509, -6043, -3573, 2776, 8692, 12263, 14122, 13394, 10626, 5901, 7402, 5491, -1080, 578, -3930, -2284, 1967, -4821, -5918, 6974, 11158, 5800, -2758, -1227, 3435, 7255, 6424, 566, -3183, -5837, -232, -720, 3898, 5988, 5942, 4864, 2117, 2333, 175, -8618, -16314, -12773, -9435, -6581, -11620, -14958, -17551, -15956, -7332, -8244, -10286, -11101, -7732, -7562, -10402, -9723, -4453, -1583, -262, -1401, 1440, 1301, -1948, -7761, -8378, -529, -2618, -5195, -8113, -8209, 945, 4481, 4951, 4085, 6620, 9205, 5647, 5260, 1034, -6682, -6126, -2321, -190, -2934, 2273, 2813, -1417, -1395, -602, -6874, -10963, -10548, -6861, 127, 8359]
5829H359k890l81j223P766j087j444K545J144j601k889p511o723k117k067m7J0104
5813f2m186M559P289o90j614j0799l210k453j685L063J752J898M397O883k958
5798B184p225N266k513P92l40N671M318J290k020l087o634n740k995O7M742J346
5782d878j942N279K565M771L072l338p300m148o274L831Q503K901l19o523J153
5767b647J0223Q820r148r47K369p674j04k413n501l805j773P928R06K948N286
5752D468L70J018k272p582l364j117R73K014J214J433R66J179n05l738K169j337
5736d111q55K975L089J728o744p275J619J988k683N766N867j089m423l609l537
5721a1294j242N077O477k571j588R00K79j1015l592K468L098Q434q86K710M957
$$ y = [8359, 5469, 5088, 3865, 11631, 10544, 9100, 11645, 12789, 11188, 8299, 788, -5935, -8052, -10119, -10166, -62, -4248, 311, 7600, 6910, 5296, -5503, -8713, -11166, -12851, -9788, -8036, -6138, -1741, 5142, 2184, -5041, 225, -2288, -1496, -1836, 3835, 8153, 9443, 7423, 4336, -2298, -8038, -11033, -10966, -6224, -4878, -6820, -1541, 1024, 5795, 8867, 5529, -1771, -5919, -12193, -8362, 141, 3042, 2723, -3800, -2647, 7576, 16396, 7248, 6301, 8670, 996, 892, -1521, -7022, -10827, -12600, -4672, -3766, -818, 4468, 4838, 5856, 3584, -3998, -7362, -8479, -7506, -5492, -4278, -2845, -1879, -700, -1205, -4943, -2774, -4111, -4966, -1991, 1098, 2826, -3918, -11193, -9574, -7586, -10269, -4503, 1364, 275, -4148, -7757, -11294, -12536, -7459, -982, -3553, -5141, -4241, -3962, -14977, -18569, -16101, -13003, -4569, -5455, -2745, 2212]
5706B212K323R70J399k73R6R16L035q580p003q61n556P35J153q02m416r81P04
5689a4929P87P894J0332o586M28j320j242J632n71K707j800n98K130p13L861K250
5673D262k321K950m61j450m831m177K542k007R7l997O453J922k189L386j514q445
5657i780K78K808K544J241r42J65k324J766N386K138m248k166k310O67M252L060
5641B535l108K45Q19K063J282N186j993j4648l04O782M706M190Q88n550l022O454
5625F525m63n558P467j616r694m576m829R69k834l099Q490N825K437o707M181
5610c482N105J030N385k945n073n31N301R920l251j0825j927k213k186J513K376
5595a803L005j730p74j67M572q37k40N436q82p487K226K299l206j164N483n491
$$ y = [2212, 4535, 5505, 6904, 6631, 6727, 7643, 10678, 2098, -4905, -5766, -11322, -10587, -9434, -10236, -14652, -15633, -14929, -14142, -6248, 4084, -2502, -2074, -3394, -4636, -3004, -3575, -868, -2668, -3266, -1136, -1849, 2012, 4262, 1941, 4891, 4430, 2980, -1851, -6028, -3486, -5493, -5396, -9393, -2940, -1018, -3207, 179, -1335, -9780, -9502, -6694, -4150, -2909, -3851, -3686, -6010, -4244, 1142, 3280, -968, -3134, -5444, -4777, -525, 2535, -573, -328, 491, 2554, 3836, 9022, 7029, -7619, -7923, -1141, 3565, 7755, 8643, 3093, 71, 6525, 6062, 504, 7971, 6355, -3339, -7915, -12744, -11775, -14609, -17708, -9218, -3393, -956, -7663, -3482, 1623, 2653, 8038, 5093, 20, -511, 4790, 14710, 11459, 634, -1293, -3506, -5692, -4179, -1803, 1202, -528, -1302, -1469, 3103, 2266, 2026, 7462, 6580, -907, 1319, 3618, 412, -752, 4731, -760]
5579g60m294j676P315Q383N180k091j3575m418N215o139L621K395m579K337Q42
5564b244K640l841k091j78q36j775J041M427K617o882O361N816k430J082J674
5549E381O236k271n487m793k828K165J211P088L056l185k419k428m653k595P96
5534d726j529q94j157K472L09K390M759K213m211m792m727j787L270q31J0082
5519H41K184K86O74k40j331M036K645l963l099o477k714N723L861n894l357m986
5503a1811n500O471m62l867P270N592K067m344j443J286O580O82m992m420J984
5488d907k506J608J0394n653j966K042K599p53J874Q46o448k693N98l333Q54j119
5472h563K287M453Q312P11o806M82J200M906n026m3N286K793l807K264o256q80
$$ y = [-760, -5054, -6730, 585, 8968, 14148, 12057, -1518, -5936, -721, -6860, -3239, -844, -5423, -3086, -2244, 396, -3445, -5536, -5714, -6550, -8325, -7284, -2857, -240, -7122, -761, 5055, 2625, 3707, 5381, 11617, 9346, 3859, -934, -3762, -1597, -386, 6702, 9758, 6573, 4154, 1726, -2927, -5522, -4726, -6255, -7149, -8306, -5834, -5525, -3135, 1624, 3837, -374, -5166, -9893, -11680, -8410, -9241, 841, 3025, 3311, 3985, 3745, 2414, 6450, 9095, 5132, 2033, -4444, -7158, -1435, 2426, -3468, -6825, -11811, -17311, -10840, -11302, -15169, -7899, -2307, -240, -4584, -6027, -4741, 1839, 2521, -2471, -6891, -4907, -7413, -5805, 4589, -1064, -3030, -988, 1611, 858, 2732, 3578, -2870, -5563, -4965, -8298, -7444, -8563, -6276, -1823, 6489, 7200, 394, 876, 2076, 6982, 1956, 1913, 7199, 9992, 6185, 8449, 2193, 1313]
5456A313L858n67m221l823K708O140k00q141k120L017L797N403M470q15l052L48
5440H115O059j761n986Q8j39m545N11L518q435p569L734J1052J489R12o78o404
5424c9l452P73J90r870K40K956O109P60J058K867M786k160j550M564k401m679
5408A52M797J12n068p509l73J782K147L083j624l650K221L443j504j884L2L952
5392A09P198L110k368k487n935p81j005r70j664k542N235L875m55L270J867J20
5376F577n74k129r171k542K000p826K271N711J434L91m757m0R611K497m138l206
5360c891n504l94P6N130J881N352K606k490m98L845J745R8l121m107P154N792
5344A3674j883q250l059l002j44Q39J486N646J135j213p210k538j881K817n768
$$ y = [1313, 5171, 4604, 383, -3440, -732, 5408, 5208, -2933, -5053, -2036, 1761, 7164, 11634, 10819, 7767, 8115, 14174, 12413, 6427, 6515, 6376, 1831, 2342, 5860, -2575, -10144, -6410, 4642, 6131, 7043, 6365, -39, -3491, -2718, -2528, -12398, -12158, -9202, -3093, -2333, -1275, 1592, 6378, 4218, 2668, 7232, 4831, 152, 4949, 5061, -7, -7516, -7889, -6107, -3960, -877, -2501, -6151, -3930, -487, -1991, -3875, -3843, 109, 7307, 10417, 8049, 5562, -373, -1154, -2159, -3129, -4793, -7335, -2100, 1775, 1320, 4590, 6457, 6577, 6003, 3874, -5297, -7839, -5839, -13665, -11394, -5683, -4249, -3858, -8615, -8655, 956, 3453, -685, -3891, -9395, -9789, -9713, -4583, -2702, 2650, 5256, 2766, 2268, 6113, 7858, 7956, 4835, 728, 7882, 13674, 11791, 3541, 482, -2520, -2664, -1825, -339, 5307, 6442, 5229, -1981, -4519, -6400, -3583, -9351]
5329i351p000K789K042J868O803r15m292n752N259P030P80n16K945L661l401j813
5313A37M037K832O509q235m783R68o242n228K603M810M479J238l015n388n233
5298a0511J261K90M059Q492r94k410m119O073k232L272O673l301o911m512O178
5283A308pn000N778M016L374o493p117j066l216m723L039j303k103k05P399K8
5267f291j535L720j489k133j487j846j007Q54R336O767K099k594l515k460l404
5252d985l35J003N712K780K118K485p306J10o286p361m75P144J749o199l838N069
5236h615M086k447M474J461L137O268q375l546L897J112j648n11Q99l306m671
5221g785j180J199J3K503N945Q74k660J524p066k389O72J896k581M077j851l076
$$ y = [-9351, -16351, -13562, -11520, -9652, -2849, -3764, -8056, -13808, -8549, -1519, -739, -1255, 1690, 5351, 1950, 137, 4174, 7006, 13515, 5280, 497, 1465, -4777, -10005, -7402, -2592, 1887, 3125, 110, -5278, -10511, -9250, -8960, -4901, 3591, 2597, 187, -3932, 2141, -91, 3181, 9854, 6553, -358, -4870, 1308, 1301, -3699, 2079, 6095, 9469, 2976, -4141, -5207, -8423, -13146, -10107, -11410, -13513, -13718, -6319, -6291, -7826, -4106, -5595, -7728, -9215, -11061, -12068, -11214, -1878, 4889, 6988, 4394, 879, -1581, -4985, -5320, -4317, 1395, 4175, 6293, 8778, 1472, 1582, -4704, -12065, -12540, -5396, -3647, -9846, -13684, -8615, -4529, -6976, -2502, -1041, 2096, 8364, -11, -3557, 340, 1452, -196, -707, 192, -3114, -7785, -8965, -7766, -7753, -5250, 695, 1569, -1091, 433, -6633, -9022, -8350, -6454, -9035, -4958, -6809, -9885]
5205i885l267K106N604k259j96l24j72k586k379N19K335j896m845j231Q54M189
5189a3433N631l021n38N471J898Q322K716j0302j216K210L636k075J974k358M133
5174C048L910q087l623K509Q38o746n04L280R976J67q33l460R98p65n060j937
5158f289N627j366L738J887N19r194m223j649K574k832k431N656L352K318L269
5143I56O69n402o004J05k930k514L432Q072N42M935L284P67n470j629P87o76J912
5126H36M675J662n299l048K3p201J241K82J11l858m343M57N622O900P836m937
5110I59j668j668L853q7J774m119Q75o206N31K995n729O26L050m23k851J948j101
5093g241J738m856N253p45l25k682J770M011L581k028q382M242N386J453K607
$$ y = [-9885, -13152, -11046, -5442, -7701, -7897, -8221, -8393, -10979, -13358, -12839, -10504, -12400, -17245, -18476, -17622, -13433, -7802, -10823, -11361, -5890, -3992, 4330, 7046, -3256, -4472, -2262, 1374, -701, 1273, -1085, 3048, 6958, -1129, -4752, -2243, -1405, -8151, -8655, -5375, 4601, 4768, 3935, 475, 1473, 708, -4352, -6289, -662, -2028, 1710, 3597, 4116, -5078, -9301, -10950, -8376, -11208, -13639, -7983, -4631, -2313, 956, 1625, -3777, -9781, -9676, -12606, -15120, -11688, -3616, -3074, 1861, 5145, 5912, 442, -1187, -400, -1076, 836, 5511, 7173, 1874, -1174, -1151, -8352, -7111, -6829, -6718, -10576, -14919, -14462, -8840, -1940, 5896, 959, -709, -2377, 1476, 1389, 3163, -956, -81, -6287, -5756, -2761, -8490, -7864, -4814, -5237, -8088, -6140, -7241, -5503, -10359, -5106, -5851, -6176, -8858, -7088, -3077, 504, -1524, -9906, -5664, -278, 1175, 3782]
5078C782K883P21q519k173l526L18n741j084R148J249j636O404R18J018p082q096
5062a1416L960O095N251R55p424n685K5n67j808K58N287o40o885J532O683J482
5046b897l462N002N305k0m527M931j585j604o087J017L2q896L280N053M26l939
5030g971m01L144K058K380O778K928k707l04k197l980o60n20q64L51k183R299
5014E151M662k710O455o8n072N45p50l369o374k971J216k52J638k32j421K121
4998a431M325M463r121j1809m187K404O832M040J666j545l794j706k800M752N137
4983b774o738l062O239O10K157K380L95OM079k92M28m04K649M882N419l312p798
4966D864j812j803P707K246l333j885l256J678l400J018N886j1667o170K583N588
$$ y = [3782, 6665, 7386, -1133, -3306, -6832, -6514, -12255, -13339, -4191, -2942, -4578, 1826, 2744, 3762, -3320, -11416, -7456, -1361, 3890, 4845, -2579, -8264, -8239, -8806, -10614, -10356, -5069, -5709, -12594, -11062, -4379, -2897, -6359, -1357, 3948, 3928, -599, 4332, 2747, 1143, -4944, -3927, -3895, -12791, -9511, -4458, -4032, -7971, -8372, -5228, -3170, -790, 5988, 8916, 6209, 5905, 3708, -272, -932, -1452, -2316, -1965, -4148, 5151, 9813, 7103, 13558, 13490, 8418, 8963, 8213, 4844, -1530, -4501, -3285, -3537, -1899, -2131, -3552, -1431, 2894, 7357, -1764, -13573, -17760, -15356, -8524, -4484, -2818, -4363, -8157, -9863, -12663, -7911, -2774, -9512, -12574, -6335, -5725, -3568, -1188, -793, -787, 3292, 3000, 3428, 3024, 5673, 10555, 15974, 12662, 4864, 3052, 1249, 8956, 11202, 7869, 5984, 2728, 4406, 1006, 2024, 7910, -3757, -9927, -7344, -1756]
4951a756J990L088J015M08j639m484n959N590J2050P55n581k432P11K888l521
4936C123p429k303k588r27k583k766L156K980K650P804j623N151N517l948n196
4921A018l975K565K538l887k299l715J426o47m408j890O86J767K245K552l36M082
4905b278O177o720J199K11R491j33m860l451j855L315K513o39Q321P33r462j508
4889A054Q373J408l434p789l807m017j462j277P718L96m952j00P9K582P677j811
4873F38q56m285k555l137j483N80K807L364K884Q31m60J598p175N667P96o175
4857f961K803J006L05l07j257J056N461N451M735K805m640j0469l064M664L146
4842D734p733j199J079K147J077J30o15n785K248m744l241r18O73N570q08l919
$$ y = [-1756, 234, 3322, 4337, 4745, 3106, -1378, -7337, -1747, 10303, 11058, 5477, 3045, 3756, 6644, 3123, -4306, -6609, -9197, -10124, -12707, -15473, -12317, -9337, -6687, 1117, -506, 4645, 10162, 6214, 1018, -2957, -392, 2146, -1741, -4040, -7755, -6329, -6976, -11384, -13274, -12588, -10821, -8576, -6024, -6360, -2278, 3899, -2821, -1622, -1411, 8080, 7947, 3087, -364, -2219, 1096, 3609, 2970, 11291, 12024, 2562, 1054, 9427, 10835, 7401, -388, -4195, -8212, -9674, -10951, -3233, -2837, -7789, -7889, -7810, -5228, 2449, 638, -218, -4503, -7058, -10195, -11678, -11098, -8291, -4927, -2043, -1212, -1672, -74, -7249, -1582, -786, -6961, -4158, -3152, -2847, -3154, -4411, -3355, 2106, 7557, 12292, 15097, 10457, -12, -3076, 1588, 4734, -2999, -4198, -3119, -972, 105, 235, -380, -6165, -3917, -8661, -11902, -12820, -12147, -6577, -7385, -11304]
4826a1304N750O546N666K045m347k68l038J336o64o276j858o765M83N862N495
4811a337m631j236l090N471o51m727L806N661l513j465Q260m00j030j333o07K706
4795A884Q592j359k443l117J163K958p375j1214J788J0162l41k766j90k116N6
4780d318l623M850J038q097l728P644O891J259N856J551n456n128L562Q932M882
4765A6115M94p362m303q53r5n227k245l74J802J562K599L420n218r200p17L077
4749f525L918O110n440l216L083J070m713R80O742j904K772m904l362O149L113
4734C873K487j06j02J114K280n028l485O7p62K425N090n73m160j220o11k357l072
4717d140n141M594J0922N58l931n304p72M651N12n525o376o439Q32J0886Q040
$$ y = [-11304, -5554, 992, 6658, 8703, 4356, 4088, 1050, 2386, 1722, -4554, -6412, -13177, -12694, -6832, -1337, -5968, -7204, -10294, -4823, -5474, -10201, -6395, -734, -4247, -5712, 2548, 2148, 1118, -215, -822, 1884, 10476, 9117, 6674, 3557, 4720, 7678, 303, -10911, -9123, 1039, 698, -2068, -2258, -4374, -4318, -7941, -3091, -2053, -10150, -13878, -6234, 657, 1916, 7772, 9323, 3867, -1261, 2301, 11233, 16115, 16609, 9247, 4944, 4091, 3996, -1231, -3476, -3850, -2048, -486, 2113, 5533, 315, -8885, -9602, -6525, -2607, 3503, -1937, -5153, -2070, -1000, -5713, -4733, 2009, 105, 2877, -2027, -5389, 760, 3873, 6360, 6254, 6152, 7266, 9546, 4518, 1033, 1100, 338, 2763, 7853, 7280, 3120, 1900, 1289, -1068, -4140, -9281, -4687, 6235, 6793, 2862, -2442, -3214, 1437, 1949, -3576, -9952, -16391, -15559, -4673, 3367]
4702C367K688k913o355k715K776l813m259m576J836K88P633O559Q28k63M12k251
4686g58q304N92N070k731L791Q35P225k514k700l598o411K457k304J205L897Q38
4670c410l289J489L971j696P37K941k207M18K939K507j887M41p41Q68J443k641
4654A883O033Q43j0180m000k230l572j744J688J418J286j979Q11R390J1043Q96
4639A1586J946L663k102l732k576k165L829p16j360o119l390M735N181M565p937
4624E408j0933N7m54K135K611M877j584l868J237o95l03O732r60l856p418n256
4608a2270k92O636K688p52K478k562O90K682K32N213Q212q362j1715k875k390
4593a2387K785K496L507L033k247j710m642Q00O884l75K043L039p185J055k54
$$ y = [3367, 6055, 3142, -3213, -5928, -3152, -6965, -11224, -15800, -13964, -13676, -6043, 516, 1344, 1081, 1493, -758, -9062, -8470, -3400, -6131, -2340, -1505, 5720, 3206, 506, -3092, -9503, -7046, -9350, -8145, -4248, -3410, -6699, -5210, -1239, -2935, -2198, 743, -1464, -1046, 1893, 4400, 2513, 2954, 2213, 3081, 4524, 1883, 7916, 8759, -1421, -5421, -7651, -11223, -12967, -11279, -9861, -8575, -10554, -9743, -353, 10690, 11586, 13532, 17195, 15093, 11361, 8785, 6620, 10449, 9733, 8373, 2254, -1136, 3599, 8780, 13345, 5408, -5525, -5468, -5922, -3787, -1176, 3701, 2117, -1751, -514, -1209, -1512, 5220, 4260, 404, -7014, -12270, -12562, -5926, -3238, -3990, -1512, -4074, -3384, -702, -470, 4743, 12955, 4593, -7122, -9997, -12387, -9602, -7106, -3599, -566, -2813, -4523, -9165, -8365, -1481, -1856, 187, 3226, -3959, -2904, -3158]
4578c158j071m169R879K990l984K239p32J838K303j338K412j1085r305J58P391
4563e632J970o47R64k96L685n4n842K232M250j5p26l193j1668n103M311J0280
4547e484R405K608j174n787o47R931p04m779N56r082o437N507N774N374O157j498
4531I720j709j901J363J922r548k263P727j54o111q47K42J650l440p814o73K263
4515i573p87K842J282M567N97P691L452K289N244n956l257J705p01q51k220j165
4499E159P25q252o886R97k403m100l975O820J0979P144j71L322k317m904K225
4484D363j564q246k726L853O749n58k752o203n5O893o31l879K078K950k94j628
4468a650L74l935K344M187j071l448k380L791M593j464o21J675j602Q68L004k92
$$ y = [-3158, -4229, -8398, 1481, 4471, 487, 2726, 1994, 3832, 6135, 4797, 7209, -3876, -13181, -13023, -5632, -3662, -4309, -3345, -3641, 44, -10, -5852, -3620, 630, 615, -111, -3304, -14972, -20075, -15764, -5484, 3921, 6529, 5355, -432, -1079, 8852, 8148, 3369, 3925, -5157, -11594, -6087, -313, 5061, 11218, 9720, 8011, 6110, 7473, 9395, -153, -2416, 5311, 5157, -954, -1801, -1559, 91, -3349, -11163, -11836, -9573, -10360, -7518, -6236, -1669, -1072, 6619, 10071, 12360, 17604, 11648, 8391, 10096, 9395, 8544, 6324, 5159, 5884, -2368, -9254, -8257, -10660, -14760, -18735, -11915, -936, 6208, 6037, 9359, 7042, 2138, 4363, 2799, -5447, -8173, -4320, 2429, 1871, -881, -7084, -7139, -246, -877, -4756, -2678, 272, -22, -1650, -1276, -5211, -2867, 1320, 249, -3199, -5579, -1788, 2805, 1341, 720, 2395, 793, 1661, 4665, 4373]
4452D373m246K144J068O575n481n813L824Q643P33n008j982n823L08o64K338J608
4436B597r941l318N114N262K102M29N493R0n938K797K41p86J63k67o795M631N748
4419G622J544q188p238L072j49J653L16k618N701M006j074m214m025o5R7N459
4403A899M987o5l799l860l968p15L840K208j969n50j2L274k97k902J308P373q04
4386E948k242J331k741J1j554m612k598K407j111k862M54K685m97K117r52r54
4370e170N000N625m789p851L344N168N315l94L80k921N17K46j664m03m77k523
4354e97j631J148L393p742n238m341N74N819L710N800O160J822m010K784k843
4339D808m133K812l654M87L895L04j807K301l972o110J265J1854M921K733l687
$$ y = [4373, 127, 2271, 3339, 9914, 4433, -1380, 2444, 11087, 11820, 6812, 4830, -993, -685, -1349, 989, 2597, -7344, -10662, -5548, -286, 1816, 2245, 7738, 7828, 1890, 4687, 4928, 4142, 4305, 4038, -2757, 1874, 7622, 9166, 978, -6260, -3188, -3337, -1684, -1368, -3986, 1715, 5721, 4647, 433, -3592, -3657, -3560, 1899, 6886, 6821, 3022, -838, -4806, -5521, -1681, 527, -1442, -1992, -2004, 1270, 973, -1929, -621, 6752, 5948, 3706, 5037, 2296, 2307, 753, -3859, -6457, -4050, -5161, -8023, -7569, -4884, -5381, -3264, -4216, -5170, -170, 5455, 666, -7185, -3841, 1327, 6642, 6248, 6628, 3707, 4224, 4470, 2806, 2403, 1926, -597, -2228, -1080, 2313, -5429, -10667, -15008, -14434, -8615, -4905, 895, 7055, 8877, 4867, 7651, 4808, 675, 3487, -167, 320, 4215, 4519, 2712, 5013, 1041, -5069, -3804, 8050, 12971, 15704, 12017]
4324A2017n056q568j842n84P51K191l626o731j179M246L068J130J032k289L497
4309a943l65l671N096M921l379P08l305q849J502l866p927P519J483k918L033
4294a1961M817j431n016L976P351L389n493m949L067O012K109j796o522M442k404
4279d409m355j387K790L017k081L934K513O36l042l836L536K737R35J215M487
4264F690j60L039p176j85J049Q26K788l799n493m316K594N306N09r84K102m583
4248a793l046m975o10O311K323J781R236l438l934m176n710J057m610M61K165
4233h958J952J971O829L160l571l300N790j649K232Q185K318m531o507m661L853
4218C113M130j223k813m668p100m207n56p06K468L724L575k033N781K694J347
$$ y = [12017, 6961, -1607, -3449, -4033, -3282, -1091, -4717, -11448, -12627, -8381, -5313, -4183, -3151, -5440, -1943, -2308, -5979, -883, 4038, 659, 1367, -1938, -10787, -9285, -13151, -21078, -13559, -12076, -14994, -11961, -7144, -8575, -13591, -9615, -2264, 1125, -4368, -9317, -6250, -238, 1871, 75, -6447, -2005, -4409, -8764, -10151, -7361, -4344, -6425, -2491, 22, 658, -2384, -6220, -2684, 53, 988, 2203, 6690, 6530, 9569, 2393, 2208, 3257, 4083, 6871, 3072, -2421, -6737, -4143, 1163, 1672, 688, 2790, -1793, -4839, -9814, -10424, -4113, -1790, -9, 9227, 5789, 1855, -2321, -8031, -6974, -11584, -11123, -8958, -7006, -5035, 1794, 4954, 1383, -1917, 3873, 2224, 4456, 12641, 14959, 10428, 3921, -740, 3113, 7243, 6020, 3207, -1461, -8561, -12768, -13324, -14030, -11562, -7838, -4263, -6296, -515, 2179, 3526]
4203C526J154N147p573j3913l037J1619m556r201k759L959R622L365O807l666
4189D94j58L153K458N710j43o293l614l114N27J269n35M18j0n458M26M095M153
4172C378J530m536M97O04j546J620K307j33k897k626J786K577M699q090n575o836
4156a3241k975J902P382L223j44l555j769N743R55o986n684n97L22k069J964M469
4140a1060M644j297K044N67J92L820j755n72M527J565l455J051L102m6J248o36
4124C939L954l515j0516j645M508L270k407k615p96K740q73l65L024K214J09k550
4108a524K891J472J188Q51k610n547l808J326O548j87k966M337M834K990k308
4093G487L122n41K955j939j0322r306J042O413M082n603j055L801l597K126J497
$$ y = [3526, 4680, 9827, 2254, -11659, -14696, -3077, -7633, -16834, -19593, -15634, -6012, -2647, 4160, 494, 336, 3489, 5947, 11657, 11514, 5221, 1607, -1507, -980, 289, -246, 172, 162, -5296, -4870, -775, 3378, 4908, 372, 869, 1473, -73, 1547, 3854, 3721, 824, -1802, -16, 2561, 7260, -830, -6405, -13241, -16216, -14314, -6932, -3709, -3853, -7408, -9177, -3434, -2479, -9465, -15149, -15746, -15424, -17493, -15529, -11060, -6416, -7713, -5669, -5102, -4910, -1090, -2845, -3417, 1110, 2675, -780, 271, 3373, 3327, 4575, 3939, 7893, 4378, -6138, -7783, -3275, -5, -2412, -5027, -5823, -3083, -3956, -4321, -1297, 917, 1026, -1524, 1367, 2839, 4027, 4878, 2268, -3279, -7087, -5761, 787, 600, -2366, 1971, 6805, 9795, 7487, 10609, 10068, 13023, 11084, 762, -8544, -7502, -1089, 2993, -2610, -3665, 136, -3461, -1335, 162]
4078A62m352l831K537R14j462j068M164M363k887r200J650N780N989M471m110
4063C120n22P20k074R52J720K730l738l854J598k240o314l24Q984L454J314L944
4047I470p239j296j085k738P728M90l390n030k964j182M027r62l624p681j067
4032a6543J2671M960k292l439J650k908l457M505J82J480R830l174o494N56J224
4017a249l444m557j119N682M276q83m008K027Q75M117l986n996j335J475m59k510
4001a1094k029L805P087k649k975j158n057L43m68J598M08j449M206R733m457
3986d156k397R32L311j329r010K411j96P810J0582l600m821J906k677M472O179
3971I417j927k501p237n118K069j693p587J23P640L352O86J873L816Q28o7J00
$$ y = [162, -4190, -8021, -5484, -4570, -6032, -7100, -2936, 1427, -1460, -10660, -9010, -3230, 2759, 7230, 3120, 2598, 3318, 1244, 2196, 3916, 6646, 2908, -946, 652, -1588, -7902, -8226, 758, 4212, 5526, 9470, 2231, 935, -150, -2888, 4840, 5330, 1940, -3090, -6054, -7236, -3209, -4171, -7795, -15476, -16543, -3872, 1088, -1204, -4643, -2993, -5901, -9358, -4853, -4671, -3191, 6639, 3465, -3029, -2473, -1249, -4693, -9250, -10369, -4687, -411, -1294, -5302, -3275, -2400, 1717, -2269, -8265, -9600, -8125, -8584, -11094, -13123, -9318, -2231, -4880, -7855, -9013, -14070, -13727, -14195, -12597, -12189, -13638, -9432, 301, -4156, -6553, -5621, -2310, -3639, -12649, -10238, -10434, -2624, 7958, 4358, -463, 1443, -1234, 3238, 9417, 7490, 4989, -2248, -7366, -5297, -6990, -14577, -14454, -6814, -3462, -2776, -903, 2913, 3741, 3674, 3774]
3955C774m89m460l797L628K876J15j370q58k915j620O165J0495j586q957K13O032
3939G246O375m155p800J161m689l565J143L234m14N286J194q229p67n198k289
3924a1467N10J552N267j868J470M720K473L823k313n125N235M762m2J035m526
3909E506l765M989k548j617l201P39K596p089K857L320K835J820q199n33N839
3894C549L046L621k861m828k245J54l564k337M748O678n397k87K434J296j918
3879B089j838j982j938k732r94K781j233Q583J0025n135q832K269J653o550N841
3864B007j495R29l508m415N280J1889J399m186j665o044k837J847N415l950j840
3849a174m862J509R71Q94l889L188K334l584l935K389O528O708O17l679m917k099
$$ y = [3774, 3285, -1175, -4972, -1344, 1532, 1647, 277, -581, -3496, -5116, 1049, 11544, 9958, 1001, 1214, 7246, 13621, 9466, 1666, 2827, -1862, -5427, -4284, -1050, -1464, 3822, 5016, -3213, -3980, -9178, -11467, -10957, -9405, -4138, -6006, -4536, 184, 2657, 6480, 4167, -958, 4277, 9039, 8997, 10032, 5506, 1741, 6730, 4182, 2565, -636, 103, 2699, -4390, -1533, 1787, 4622, 6442, -1757, -2290, 3549, 6595, 10216, 7355, 2527, 282, 436, -3128, -5465, -717, 5961, 564, 277, 2711, 4007, 2089, 251, -1731, -3669, -6401, -7395, -4614, -5847, 2736, 12761, 7626, -1206, 1063, 2716, -3834, 2007, 512, 1441, -2067, -6482, -1202, 10687, 12086, 7900, 6235, 191, -2646, -799, 4616, 666, -1174, -6036, -4527, -3556, -2662, -6551, -3363, -1029, -4613, -8548, -6159, 369, 7077, 7694, 4015, -902, -3001]
3833c001M71m349l541N588k773k638L019K310L484N169K196q275r955Q067J1121
3818F893o11l044j47l320m907m66O543J807j084R30r051J7J654M90O308N39l512
3801i61n43j413k906M97M614M269m47J540k239M7l731q191K819m3r6J0539J651
3784E406l459J239n31p716m393l34M795N106j524K735l28k706m180N015R404k060
3768F469p044n791m291n121N6O678O05n188m790J0443N639j65l898k182J589J1855
3752D864L783q561m04N754m725p113M193K196j822j027l221K833O311M47q592
3737e084N504Q155m57k224K701k731j0916m5P612N916k610l347k094n028j550
3722f198K145p213M034R334K882k82k104o795k419P337K548J149O84m708n947
$$ y = [-3001, -2530, -6879, -10420, -4832, -7605, -10243, -7224, -4914, -1430, 3739, 5935, -2340, -12295, -4228, 6893, 6282, 3238, 3091, -229, -5136, -5602, 941, 2748, 1664, 2594, -6457, -6440, -4786, -4296, 2012, 2551, -961, -1504, -2917, -5823, -5326, -712, 3557, 3110, 4650, 2411, 2458, -1273, -9464, -6645, -6688, -6784, 3755, 5406, 1947, 3186, 2655, -5061, -9454, -9788, -4993, 113, -1411, 1324, 996, -1710, -5890, -875, 8529, 6469, -575, -6366, -10657, -15778, -15722, -9044, -8439, -13627, -18417, -7974, -2335, -2500, -6398, -8580, -6991, 4864, 8647, 86, -318, 5436, 711, -6402, -2209, -13, -1835, -2862, -6083, -3250, 3061, 3508, -5084, 420, 8575, 8118, 5894, 8595, 5864, -5052, -5097, 2515, 8431, 5821, 2474, 380, -4648, -6198, -4053, -11266, -7232, 2102, 4984, 4702, 2598, -4197, -6616, 721, 3269, 4418, 5102, 394, -5553]
3707e553L65p0K237k169m994j838J362L738J771O610P267J671L92o89n072j0342
3691e314k758J710j009j05j987M841J190L033O49l1L139j016l279M629J940j739
3675C893R387o253q146k056N899k262n183J697p656K385L531N721n021j358l880
3660i302M963K494M981L15j793j879l850O350N340n414l88K488r827M12K514J951
3644f45M813o52L808j018o169j039K629j925l386k274p85M382N170K953R03n610
3628A155o609p837q547L332R521P495Q38K907j582j262J102j633J88o90L369K193
3612C940L580r21n40Q100n6K10J982n912r803n922p37J018N54j944K052M862q62
3595c99M024j458n459m654m849J57J822R230R503K119k972r62j607K114l157P86
$$ y = [-5553, -5188, -5258, -3021, -5190, -10184, -12022, -10660, -6922, -5151, 1459, 8726, 10397, 10789, 10100, 5028, -5314, -8072, -6362, -7371, -7476, -9463, -4622, -3432, -399, 250, 219, 3358, 2342, -937, 3692, 5632, 3893, 13280, 7027, -1119, -3175, 2724, 462, -4721, -3024, -10680, -8295, -4764, 957, -4064, -5422, -9302, -4339, -1845, 3136, 3451, 1658, -221, -4071, 2279, 7619, 2205, 1817, 4305, -5522, -5110, -2596, -645, 4168, 3516, 7324, 6306, 137, -902, 1727, -198, -3584, -5858, -6643, -2261, 2909, 5862, 6765, 1155, -5454, -13291, -21838, -18506, -8985, -1490, -652, 2255, 673, -589, 513, -1120, -932, -1622, 1747, 3940, 7520, 6599, 6059, 14159, 14103, 14313, 16295, 10383, 580, -5342, -6079, -5061, -4507, -6451, -4399, 463, -399, 3625, 2167, -3292, -7946, -12795, -12638, -10816, -1586, 7917, 10036, 7064, 6102, 4495, 6609, 3452, 4238]
3579D238K496k115o460j0931r540R350J2626K644j080R45j394r446k541K376R376
3564E44J449l729j544Q76r45j574j729K564L942m891K858P92K446k6j0599L80
3548i186N894K678k69J030J951j734j808K5J758L588n951q929N260N479n721m012
3532i947l007P138O559Q85j770J078L800L830k742p382q815k981R468J208K970
3517B92L792m763n916n77j400K77J723N346p61K779O091q197k295L233m5o93q357
3500i471o112J307l733j109L131J0533O733L210K127M021R75n018p418l989J285
3485c528J040k855K132J563K251k605l73P450J545J321l876j985J931q25l997
3470h11k647M430j145J76M067l48o820q113m423L843R364l8M862M253n52o899
$$ y = [4238, 6734, 4619, -1841, -12772, -22312, -12962, -336, 2308, 1228, 2173, 779, -8667, -11208, -8832, 544, 1993, -1736, -3280, -2404, -3349, -4923, -6652, -4088, -146, -5037, -2179, -1387, 1059, 1033, -9566, -9186, -3292, -614, -883, 147, 2098, 364, -1444, -1419, 339, 3927, -2024, -10953, -5693, -214, -5935, -9947, -12954, -5816, 743, 1628, -142, 936, 4736, 8566, 5824, -1558, -10373, -13354, -3886, -2678, 292, 4084, -679, -6595, -7172, -8572, -8295, -6572, -1226, -1987, 792, 6883, -1314, -3609, -376, -421, -1114, -9471, -15583, -14276, -18009, -19118, -15987, -5454, 1279, 4489, 6616, 10637, 11612, 6594, -824, -4813, -3528, -2488, -5343, -3211, -1648, 603, -2002, -2375, 5075, 6620, 7941, 4065, 2080, 4011, 3186, -811, -3458, 972, -173, 3, 4070, 3722, -3098, -11211, -15634, -11791, -2427, -2465, 2397, 6650, 6098, -801]
3454h01j542m487J860k939J752N626K282J450k556J451P317j071n562o076J669
3439a627P11N708r91j829P731k821j1812j522L861k063M531l455J757L709M349
3424F237m554n271k754k992k24m553K839R336M81J064K520r96J159m93Q58O381
3408I038J474o650o389n372r52M655P402O72o349j919O262K748k679k534l312
3393c905J978p48j911j938m019M613p26J82M519K060K422j196k1p53n474R06q71
3376d882o041n062n73M307M954Q372L300K739J998O457L296j988j2311J744j186
3361E124n066M689l2p379L743K739o928Q12L148J749K421J743q068n27M514L538
3345F220J341O352j557k938O87k387n760j007m628O238M297q288j849J44k912
$$ y = [-801, -2343, -6830, -4970, -7909, -6157, -531, 1751, 3201, 645, 2096, 9413, 8342, 2780, -3296, -1627, -916, 4792, 3801, 1972, 9703, 6882, -4930, -6452, -2591, -4654, -123, -3578, -1821, 1888, 6237, 1683, -3588, -6342, -9334, -9558, -14111, -11272, -1936, -1455, -391, 2129, 1133, 2292, 1799, 2657, 9038, 10512, 3862, -2527, -7899, -8851, -4196, 3206, 3878, -2471, -4390, 1872, 4620, 1941, -593, -3905, -1927, -2675, -4586, -6524, -10543, -5930, -6656, -6474, -1955, 105, 2527, 1331, 1310, 557, -4917, -4011, -4882, -10923, -15985, -16558, -12251, -7297, 1075, 4375, 7114, 9112, 15569, 18865, 16877, 4566, 6310, 5124, 58, 4747, 4715, -2664, 1079, 3818, -3110, -2298, 850, 2599, 5020, 6763, -1305, -1832, 2682, 6220, 7561, 13913, 12356, 9418, 10105, 7718, 1958, 951, -3677, 2561, 6858, -1430, -3279, -3135, -6047]
3330f047J1400Q378m213q036k019K8k408K24K177J027l115l133J723O552K936
3315E474J540K364K579J496r181j103j323p985L226M50O21K457J566O660j537
3300G304j2308O28l381l113k381K645K788O415K477J742M267j695p490l571j502
3285g175J902P985K365l566p082m290K560M808M001L686P93k444Q7j922J091O7
3269B866L862m450l791R05m348j0144l987L216J3157O249J684k469o06k416Q253
3254G981j19n078o619n877K124L199K959j013l500m19k476P11K917J415K814l414
3238d395q767O981K137R44m847k725K100k85K175j519j833N425K323N325J050
3223D089j987j648R89K525k816r234j228M504N713J471J423M462J443k744q828
$$ y = [-6047, 5353, 13731, 9518, 1482, -537, -509, -2917, -2693, -516, 511, -2604, -5737, -4014, 2538, 5474, 7014, 9378, 11957, 13453, 4272, 3169, 1846, -6139, -2913, -2463, -1842, 615, 2181, 8841, 7304, -5004, -4376, -7757, -10870, -13251, -10606, -7818, -1403, 1074, 2816, 7083, 5388, -2102, -5673, -7175, -5273, 2712, 5077, 1511, -5571, -9861, -7301, -2493, 1508, 5194, 5987, 3543, 3630, 1708, 2799, 2866, 6728, 2278, -1513, -608, -4956, -15100, -19087, -15871, -2714, 3535, 5219, 2750, 2144, -272, 7981, 7862, 2784, -3835, -9712, -7588, -4389, -1430, -2443, -5943, -6362, -8838, -8127, -5210, -3795, -981, -4395, -13162, -6181, -4044, -3100, -7947, -10672, -8572, -8857, -6682, -8201, -10034, -4609, -2286, 3039, 4089, 2102, 454, 1443, 3968, 1152, -8082, -9310, -4806, 907, 2378, 3801, 8263, 9706, 6962, -1866]
3208a866p66M033m387m346Q21l962o92O325J3993k090l768J977j176l114m959
3193c977K527J619n483O495m490n405K431n98K507M694j469J786N656j964p872
3178c543J332N392N219k680n622o276K395M40L391N86L638l758p016N733J974
$$ y = [-1866, -2632, 1401, -2986, -7332, -6511, -10473, -11165, -4840, 9153, 7063, 3295, 5272, 4096, 982, -3977, -1450, 169, -5314, 1181, -3309, -8714, -6283, -6881, -4374, 320, -1149, 637, 6293, 4329, -3543, -2211, 3181, 8400, 5720, 98, -6178, -3783, -3343, 48, 634, 4272, 514, -6502, -769, 1205]
$$ [...]
##END NTUPLES=NMR SPECTRUM
##END=
